##TITLE=Analysis number 319628
Compound Code cc 48611
Book Reference 483/18
Project Code adrs
Chemist Name mattw
##JCAMPDX= 6.0         $$ Bruker NMR JCAMP-DX V2.0
##DATA TYPE= NMR SPECTRUM
##DATA CLASS= NTUPLES
##ORIGIN= Bruker BioSpin GmbH
##OWNER= nmr
$$ XWIN-NMR		Version 3.5
$$ Mon May 22 14:52:23 2006 GMT Daylight Time (UT+1h)  MAYBRIDGE\nmr@NMR_250MHZ
##.OBSERVE FREQUENCY= 250.131544655141
##.OBSERVE NUCLEUS= ^1H
##.ACQUISITION MODE= SIMULTANEOUS (DQD)
##.ACQUISITION SCHEME= undefined
##.AVERAGES= 16
##.DIGITISER RES= 18
##SPECTROMETER/DATA SYSTEM= dpx250
##.PULSE SEQUENCE= zg30
##.SOLVENT NAME= CDCl3
##.SHIFT REFERENCE= (INTERNAL, CDCl3, 0, 16.522)
##AUDIT TRAIL= $$ (NUMBER, WHEN, WHO, WHERE, WHAT)
$$ ##TITLE= Audit trail, XWIN-NMR		Version 3.5
$$ ##JCAMPDX= 5.01
$$ ##ORIGIN= Bruker BioSpin GmbH
$$ ##OWNER= nmr
$$ C:\u/data/dgb/nmr/ADRS/4880/pdata/1/auditp.txt
$$ ##AUDIT TRAIL=  $$ (NUMBER, WHEN, WHO, WHERE, WHAT)
(   1,<2006-05-22 14:51:44.03 +100>,<MAYBRIDGE\nmr>,<NMR_250MHZ>,
      <created by zg, POWCHK disabled, PULCHK disabled
       configuration hash MD5:
       84 BC 41 DB A1 6E 1D 46 DA 25 12 A5 C1 ED C5 3A
       data hash MD5: 64K
       AB 4D EC 4B 76 D9 BC 47 43 59 7B B4 2A C8 97 7C>)
(   2,<2006-05-22 14:52:01.95 +100>,<MAYBRIDGE\nmr>,<NMR_250MHZ>,
      <Start of raw data processing
       ef LB = 0.3 FT_mod = 6 PKNL = 1 SI = 32K 
       data hash MD5: 32K
       67 EB A5 CB CC E7 CF 93 49 9F 41 20 CE 94 D7 6A>)
(   3,<2006-05-22 14:52:05.45 +100>,<MAYBRIDGE\nmr>,<NMR_250MHZ>,
      <apk 
       data hash MD5: 32K
       B9 01 F0 1F 7C A8 03 7D 59 C0 DD 54 BE D7 96 64>)
(   4,<2006-05-22 14:52:07.30 +100>,<MAYBRIDGE\nmr>,<NMR_250MHZ>,
      <abs ABSG = 5 
       data hash MD5: 32K
       AE F1 04 DF A0 F8 0A E8 A1 01 22 55 00 43 9B 14>)
$$ ##END=
$$ 
$$ hash MD5
$$ 8A 31 B5 14 92 10 8F 4B 42 C6 61 CD 0F 97 01 02
##$RELAX= 
##$RELAX= 
##$RELAX= 
##$RELAX= 
##$RELAX= 
##$RELAX= 
##$RELAX= 
$$ Bruker specific parameters
$$ --------------------------
##$DU= <C:\u>
##$EXPNO= 4880
##$NAME= <ADRS>
##$PROCNO= 1
##$TYPE= <nmr>
##$USER= <dgb>
##$AMP= (0..31)
100 100 100 100 100 100 100 100 100 100 100 100 100 100 100 100 100 100 
100 100 100 100 100 100 100 100 100 100 100 100 100 100 
##$AQSEQ= 0
##$AQ_mod= 3
##$AUNM= <au_zg>
##$AUTOPOS= <41 >
##$BF1= 250.13
##$BF2= 250.13
##$BF3= 250.13
##$BF4= 250.13
##$BF5= 500.13
##$BF6= 500.13
##$BF7= 500.13
##$BF8= 500.13
##$BYTORDA= 1
##$CFDGTYP= 0
##$CFRGTYP= 5
##$CHEMSTR= <none>
##$CNST= (0..31)
1 1 145 1 1 1 1 1 1 1 1 1 1 1 1 1 1 1 1 1 1 1 1 1 1 1 1 1 1 1 1 1 
##$CPDPRG= <>
##$CPDPRG1= <>
##$CPDPRG2= <>
##$CPDPRG3= <>
##$CPDPRG4= <mlev>
##$CPDPRG5= <mlev>
##$CPDPRG6= <mlev>
##$CPDPRG7= <mlev>
##$CPDPRG8= <mlev>
##$CPDPRGB= <>
##$CPDPRGT= <>
##$D= (0..31)
0 1 0 0 0 0 0 0 0 0.06 0 0 0 0 0 0 0.0002 0 0 0 0 0 0 0 0 0 0 0 0 0 0 
0 
##$DATE= 1148305901
##$DBL= (0..7)
120 120 120 120 120 120 120 120 
##$DBP= (0..7)
150 150 150 150 150 150 150 150 
##$DBP07= 0
##$DBPNAM0= <>
##$DBPNAM1= <>
$$ [...]
##$SUBNAM7= <"">
##$SUBNAM8= <"">
##$SUBNAM9= <"">
##$SW= 20.6930455092707
##$SWIBOX= (0..15)
0 0 3 0 0 0 0 0 0 0 0 0 0 0 0 0 
##$SW_h= 5175.983436853
##$TD= 65536
##$TD0= 1
##$TE= 294.16
##$TE2= 300
##$TE3= 300
##$TEG= 300
##$TL= (0..7)
0 120 120 120 120 120 120 120 
##$TP= (0..7)
150 150 150 150 150 150 150 150 
##$TP07= 0
##$TPNAME0= <>
##$TPNAME1= <>
##$TPNAME2= <>
##$TPNAME3= <>
##$TPNAME4= <>
##$TPNAME5= <>
##$TPNAME6= <>
##$TPNAME7= <>
##$TPOAL= (0..7)
0.5 0.5 0.5 0.5 0.5 0.5 0.5 0.5 
##$TPOFFS= (0..7)
0 0 0 0 0 0 0 0 
##$TUNHIN= 0
##$TUNHOUT= 0
##$TUNXOUT= 0
##$USERA1= <user>
##$USERA2= <user>
##$USERA3= <user>
##$USERA4= <user>
##$USERA5= <user>
##$V9= 5
##$VALIST= <valist>
##$VCLIST= <CCCCCCCCCCCCCCC>
##$VD= 0
##$VDLIST= <DDDDDDDDDDDDDDD>
##$VPLIST= <PPPPPPPPPPPPPPP>
##$VTLIST= <TTTTTTTTTTTTTTT>
##$WBST= 1024
##$WBSW= 4
##$XGAIN= (0..3)
0 0 0 0 
##$XL= 0
##$YL= 0
##$YMAX_a= 370280
##$YMIN_a= -573771
##$ZGOPTNS= <>
##$ZL1= 120
##$ZL2= 120
##$ZL3= 120
##$ZL4= 120
##$ABSF1= 16.522
##$ABSF2= -4.171173
##$ABSG= 5
##$ABSL= 3
##$ALPHA= 0
##$AQORDER= 0
##$ASSFAC= 0
##$ASSFACI= 0
##$ASSFACX= 0
##$ASSWID= 0
##$AUNMP= <proc_1d>
##$AZFE= 0.1
##$AZFW= 0.1
##$BCFW= 0
##$BC_mod= 0
##$BYTORDP= 0
##$COROFFS= 0
##$CY= 12.5
##$DATMOD= 1
##$DC= 0
##$DFILT= <>
##$DTYPP= 0
##$F1P= 14.0000005364418
##$F2P= -0.99999901652339
##$FCOR= 0.5
##$FTSIZE= 32768
##$FT_mod= 6
##$GAMMA= 0
##$GB= 0
##$INTBC= 1
##$INTSCL= 1
##$ISEN= 128
##$LB= 0.3
##$LEV0= 0
##$LPBIN= 0
##$MAXI= 10000
##$MC2= 0
##$MEAN= 0
##$ME_mod= 0
##$MI= 0
##$NCOEF= 0
##$NC_proc= -4
##$NLEV= 6
##$NOISF1= 0
##$NOISF2= 0
##$NSP= 0
##$NTH_PI= 0
##$NZP= 0
##$OFFSET= 16.522
##$PC= 1
##$PHC0= 170.0095
##$PHC1= 4.558518
##$PH_mod= 1
##$PKNL= yes
##$PPARMOD= 0
##$PSCAL= 4
##$PSIGN= 0
##$REVERSE= no
##$SF= 250.13
##$SI= 32768
##$SIGF1= 0
##$SIGF2= 0
##$SINO= 400
##$SIOLD= 32768
##$SREGLST= <1H.CDCl3>
##$SSB= 0
##$STSI= 32768
##$STSR= 0
##$SW_p= 5175.98343685301
##$SYMM= 0
##$S_DEV= 0
##$TDeff= 65536
##$TDoff= 0
##$TI= <Analysis number 999999
Compound Code 99
Book Reference 9
Project Code 9>
##$TILT= no
##$TM1= 0
##$TM2= 0
##$TOPLEV= 0
##$USERP1= <user>
##$USERP2= <user>
##$USERP3= <user>
##$USERP4= <user>
##$USERP5= <user>
##$WDW= 1
##$XDIM= 32768
##$YMAX_p= 285468405
##$YMIN_p= -389209
$$ End of Bruker specific parameters
$$ ---------------------------------
##NTUPLES= NMR SPECTRUM
##VAR_NAME=  FREQUENCY,     SPECTRUM/REAL,   SPECTRUM/IMAG
##SYMBOL=    X,             R,               I
##VAR_TYPE=  INDEPENDENT,   DEPENDENT,       DEPENDENT
##VAR_FORM=  AFFN,          ASDF,            ASDF
##VAR_DIM=   32768,         32768,           32768
##UNITS=     HZ,            ARBITRARY UNITS, ARBITRARY UNITS
##FACTOR=    0.157963299565203, 1,           1
##FIRST=     4132.6476996994, 0,             0
##LAST=      -1043.33573715361, 0,           0
##MIN=       -1043.33573715361, -389209,     0
##MAX=       4132.6476996994, 285468405,     0
$$ Real data points
##PAGE= N=1
##DATA TABLE= (X++(R..R)), XYDATA
$$ [...]
17785C32155r3644n5829K1313O3849J6276n6545n0986k1343k0957R234l1837k81
$$ 332155 238511 182682 203995 267844 284120 227575 176589 155246 134289 143523 111686 111405
17773A11405K1717N4867M934j3518l4373j8095k4514k2259m601k1119K7922L0151
$$ 111405 133122 187989 192923 179405 145032 126937 102423 80164 75563 54444 82366 112517
17761A12517N8767j2155m0778j8492p677O5259L7415m9312M6567j3985K0986M981
$$ 112517 171284 159129 118351 99859 92182 157441 194856 145544 192111 178126 199112 204093
17749B04093P765M5994L0000J3489m0273k3437L8821o302k2424l931l9223K7890
$$ 204093 211858 257852 287852 301341 261068 237631 276452 270150 247726 243795 204572 232462
17737B32462N2882K3671k6313j8991j03634o427O4564O5921N4539k4577j1497
$$ 232462 285344 309015 282702 263711 160077 153650 218214 284135 338674 314097 302600
17726C02600l8306J7569K0001J0547L5100L0507o9721n6071N1224M1648M4551
$$ 302600 264294 281863 301864 312411 347511 378018 308297 252226 303450 345098 389649
17715C89649J331m8100M6610P9184J1338p766j7586M977L5121K3537M033N9350
$$ 389649 390980 342880 389490 468674 480012 472246 454660 459637 494758 518295 522328 581678
17703E81678Q4255O7742N0802M6806p0072k2821L3024M4997L7004K6322P8739
$$ 581678 665933 733675 784477 831283 761211 738390 771414 816411 853415 879737 958476
17692I58476N1835L6980J33493J47251J54668J72368J66696K21121K51556L63067
$$ 958476 1010311 1047291 1180784 1328035 1482703 1655071 1821767 2042888 2294444 2657511
17682B657511N52843Q73010J376582K033694K739278L312038L976559L965952
$$ 2657511 3210354 4083364 5459946 7493640 10232918 13544956 17521515 21487467
17674B1487467K835926J509569O97670o97460k718807k639545j591012q89695
$$ 21487467 24323393 25832962 26530632 25833172 23114365 20474820 18883808 17994113
17666A7994113K18175J503647K730072K901590J889612Q28341Q1311j406135l549008
$$ 17994113 18212288 19715935 22446007 25347597 27237209 28065550 28146861 26740726 23191718
17657B3191718l640772l037723l091487k563936j679222r57461o09717n60725
$$ 23191718 19550946 16513223 13421736 10857800 9178578 8221117 7611400 7050675
17649G050675m07119k46847j69000j89523j10750l6531m6910l4827j6779J3136
$$ 7050675 6643556 6396709 6227709 6038186 5927436 5890905 5843995 5809168 5792389 5805525
17639E805525L0877J87914M17227O04472R33699J529494K275415K923818L761208
$$ 5805525 5836402 6024316 6441543 7046015 7979714 9509208 11784623 14708441 18469649
17630A8469649M813623N059775M442118M017310L893675K256952j89962q09346
$$ 18469649 23283272 28343047 32785165 36802475 40696150 42953102 42763140 41953794
17622D1953794o92181j390057k127983p31939J080183J502739J451572J866786
$$ 41953794 41261613 39871556 37743573 37011634 38091817 39594556 41046128 42912914
17614D2912914K186355N84159j852405k468446k785563m128752n338089m556648
$$ 42912914 45099269 45683428 43831023 41362577 38577014 34448262 29110173 24553525
17606B4553525l600653l283290k604953j824550j307634r66060o86589n45754
$$ 24553525 20952872 17669582 15064629 13240079 11932445 10966385 10279796 9734042
17598I734042n12454m90923l48642l46143k97431j57561j40767j51033j02430
$$ 9734042 9221588 8730665 8382023 8035880 7738449 7580888 7440121 7289088 7186658
17589G186658p9400N4484J10365L41621O75780J165234J668112K150457K579755
$$ 7186658 7107258 7161742 7272107 7613728 8289508 9454742 11122854 13273311 15853066
17580A5853066L132708K747855J693327Q77126J31924j365859k495038j977820
$$ 15853066 18985774 21733629 23426956 24304082 24436006 23070147 20575109 18597289
17572A8597289j209386m48896M90741J484419K231092J923945R39051J52284n97690
$$ 18597289 17387903 16939007 17429748 18914167 21145259 23069204 24008255 24160539 23562849
17563B3562849k121624l229415k827419k500503k332929j677915j168027q11632
$$ 23562849 21441225 18211810 15384391 12883888 10550959 8873044 7705017 6893385
17555F893385n41701m27192m37490l04653k99417k62143j91580j91325j84716
$$ 6893385 6351684 5924492 5487002 5182349 4882932 4620789 4429209 4237884 4053168
17546D053168j48758q1315j25439j38866j19216j33969j42811j09314j04485j13570
$$ 4053168 3904410 3823095 3697656 3558790 3439574 3305605 3162794 3053480 2948995 2835425
17536B835425j22987q3290l5351q3124j04288o0759l5491k3080q9744j44775r7439
$$ 2835425 2712438 2629148 2593797 2510673 2406385 2345626 2310135 2287055 2197311 2052536 1955097
17525A955097p8089o6251q3850o4877r737M099m4191j39082j31202J454L1670
$$ 1955097 1877008 1810757 1726907 1662030 1652293 1656392 1612201 1473119 1341917 1343371 1375041
17514A375041q2263l9759k506l5426p0239m3452n6608J4358K1574k5344j8923
$$ 1375041 1292778 1253019 1250513 1215087 1144848 1101396 1044788 1059146 1080720 1055376 1036453
17503A036453q2465j15671j11223L6438O5394m1179m8229k4184k6009n732l1686
$$ 1036453 953988 838317 727094 763532 828926 787747 739518 715334 689325 683593 651907
17492F51907r9164o8131J8567N2140M643k7080M213k4643n143m7093j2703K6742
$$ 651907 552743 484612 503179 555319 559962 532882 537095 512452 507309 460216 447513 474255
17480D74255J3142k2235L7311j783L7872k4792M1888k9394l5758o931m62n1720
$$ 474255 487397 465162 502473 500690 538562 513770 555658 526264 490506 483575 483113 431393
17468D31393p6936l0857r2336J2554K1797K1576k8705p123M2934j5925J8063j8763
$$ 431393 354457 323600 231264 243818 265615 287191 258486 251363 294297 278372 296435 277672
17456B77672l9757k5881P889j4813l5572L749o203K4328L4066J3239O0395P8560
$$ 277672 237915 212034 219923 205110 169538 173287 167084 191412 225478 238717 299112 377672
17444C77672R3486J05779k567j1303k2731q8167j15476j3161M0198k9116k3970
$$ 377672 471158 576937 574370 563067 540336 452169 336693 323532 363730 334614 310644
17433C10644p2327m1962k1850R396L5655M3158n419m3418l6969P987m1246J4556
$$ 310644 238317 196355 174505 183901 219556 262714 257295 213877 176908 184895 143649 158205
17421A58205m6881j2593l4014J6944l2028j6515N0370J2898K4448K9516J6589
$$ 158205 111324 98731 64717 81661 49633 33118 83488 96386 120834 150350 166939
17410A66939k2243L8304K6135k4142m6285p6933j3692N5334L6603N0699J1743
$$ 166939 144696 183000 209135 184993 138708 61775 48083 103417 140020 190719 202462
17399B02462m8882m0523j7948k3810J3786J7072J9965M4706j9781m0355J3690
$$ 202462 153580 113057 95109 71299 85085 102157 122122 166828 147047 106692 120382
17388A20382K5796J5044O967M9151k7602k862k4820o1668l3295j3579L1006M8148
$$ 120382 146178 161222 168189 217340 189738 186876 162056 100388 67093 53514 84520 132668
17376A32668M056j2794K6035k982k758l2526L7545l068o776p7782k4466K0193
$$ 132668 136724 123930 149965 146983 144225 111699 149244 146176 139400 61618 37152 57345
17364E7345k1366k5333O191N2649K0845J5204K7067L4706K0413o7794K4090m0864
$$ 57345 35979 10646 16837 69486 90331 105535 132602 167308 187721 119927 144017 103153
17352A03153j02438p9143K8425J2294J7397l4500m0779M7106K2273l997N9332
$$ 103153 715 -78428 -50003 -37709 -20312 -54812 -95591 -48485 -26212 -30209 29123
17341B9123j2663k0145P8053N3370j3202p953L0944p2829n3832K378K2031l1551
$$ 29123 16460 -3685 74368 127738 114536 106583 137527 64698 10866 13244 35275 3724
17329C724R313l881J0651j8648k9215K6381o6317n9129M5539R7805J757k4816
$$ 3724 13037 9156 19807 1159 -28056 -1675 -67992 -127121 -81582 16223 17980 -6836
17317f836Q0154N3881K44r254K5866j1895l5266m1717o8626l8656J3586K3293
$$ -6836 73318 127199 127443 118189 144055 132160 96894 55177 -13449 -52105 -38519 -15226
17305a5226L3827k1578M546O660k4000l007l0913L1153O6595Q4103N856M204j757
$$ -15226 18601 -2977 1569 8229 -15771 -18778 -49691 -18538 48057 132160 138016 142220 140463
17292A40463o221m5332q1255k3550p054K785L9954k4392M04j5121J8686M294j0387
$$ 140463 134242 88910 7655 -15895 -22949 -20164 19790 -4602 -4198 -19319 -633 3661 -6726
17279f726J7107M7704o80k6215m1731Q799M6759K3621M2285m753l0610l8571k8903
$$ -6726 10381 58085 57405 31190 -10541 -1742 45017 68638 110923 106170 75560 36989 8086
17266H086M581L9221P1279l7258q195J1532j5742j2692j8329n7868N6536L8266
$$ 8086 12667 51888 123167 85909 77714 89246 73504 60812 42483 -15385 41151 79417
17254G9417n5358p061k9713n0959k7240N3230k3266r45O9948L837m4594k9179
$$ 79417 24059 16998 -12715 -63674 -90914 -37684 -60950 -61895 8053 11890 -32704 -61883
17242f1883L2575Q946Q693N2621L3146J031q1284J0266N2099m7425K8214P296
$$ -61883 -29308 -20362 -11669 40952 74098 75129 -6155 4111 56210 8785 36999 44295
17230D4295p5680K0951J166N9885O3848k891p2903l2856J8299J769j3559L866
$$ 44295 -31385 -10434 -9268 50617 114465 111574 38671 5815 24114 25883 12324 16190
17218A6190K081L3011N5137q886m0652p4548k9257k8747J4299M1027R406N3463
$$ 16190 18271 51282 106419 97533 56881 -17667 -46924 -75671 -61372 -20345 -10939 42524
17206D2524P1136q928n459m0604J206P1523O46j1372j8979p0836n9138K511P9977
$$ 42524 113660 104732 99273 58669 59875 131398 132044 120672 101693 30857 -28281 -25770 54207
17193E4207Q1635k4797k4952J3202N9456M6657j8461q7765n097m2310O184l6193
$$ 54207 135842 111045 86093 99295 158751 205408 186947 99182 94085 51775 57959 21766
17181B1766p5871K4222O241Q8492J2768r7690j12770J2137P8832M4966r270m9460
$$ 21766 -54105 -29883 -23642 64850 77618 -20072 -132842 -120705 -41873 3093 -6177 -55637
17169e5637K2716M4708R0400L3407K4093P128J9756J2361l2814L7515k7623n2203
$$ -55637 -32921 11787 102187 135594 159687 166815 186571 198932 166118 203633 176010 123807
17157A23807j621K4497o7634m0412j0692n599M6719j2255M0330j1002n8497J2860
$$ 123807 122186 146683 79049 38637 27945 22346 69065 56810 97140 86138 27641 40501
17145D0501L6254L6707j0801l0682M0000k6995p7803r608M2753L2088J2331J7682
$$ 40501 76755 113462 102661 71979 111979 84984 7181 -2427 40326 72414 84745 102427
17133A02427p7768J6888N826L93m0190m1532J2828Q7539N484l1747M1840K7368
$$ 102427 24659 41547 47373 47766 7576 -33956 -21128 66411 71895 40148 81988 109356
17121A09356l5094m1128j7213L9470J8478M0916M7261N3618K4624L2487j4871
$$ 109356 74262 33134 15921 55391 73869 114785 162046 215664 240288 272775 257904
17110B57904l014J2909m5021K0036l6118o2033M1672K5549m5322o768M5960m337
$$ 257904 254890 267799 222778 242814 206696 144663 186335 211884 166562 159794 205754 201417
17098B01417n7572o8552j0786L7417O757o260M3483P552j4398J2715M0964q0705
$$ 201417 143845 75293 64507 101924 108681 102421 145904 153456 139058 151773 192737 112032
17086A12032q388o6671k4391j1239K5526J4777J7268K1758j3080l7867m3731l4274
$$ 112032 103644 36973 12582 1343 26869 41646 58914 80672 67592 29725 -14006 -48280
17074d8280l3047M4814Q1641M0706K8056J653j9413L2467R099p0580J545K0706
$$ -48280 -81327 -36513 45128 85834 113890 115543 96130 128597 137696 67116 68661 89367
17062H9367M0195j0133m6400M874Q3702O986k3195p2028L864O5196o698K412L3605
$$ 89367 129562 119429 73029 77903 161605 168591 145396 73368 77232 142428 135730 138142 171747
17049A71747L8124n7502n0963r989m7531l4794N3764k4126m0336M1075K6994j8445
$$ 171747 209871 152369 101406 91417 43886 9092 62856 38730 -1606 39469 66463 48018
17037D8018r411M571Q815j0159J0310o8617k1367M4556L2716J0363L1872K3983
$$ 48018 38607 43178 51993 41834 52144 -16473 -37840 6716 39432 49795 81667 105650
17025A05650l2640p2320k8999M7400m2011n886l7721O5312p362N8895l8241J4672
$$ 105650 73010 690 -28309 19091 -22920 -28806 -66527 -1215 -8577 50318 12077 26749
17013B6749j3150k9494L596k7451Q0300N928k7116l3752N533N1749K8446J1084
$$ 26749 13599 -15895 -12299 -39750 40550 46478 19362 -14390 -8857 42892 71338 82422
17001H2422p4853p4960l3591O1288Q1978M0246J2962k1142p3200j0218J8513K1546
$$ 82422 7569 -67391 -100982 -39694 42284 82530 95492 74350 1150 -9068 9445 30991
16989C0991j8242l2432L4212J5414l3397m3803N8270O0424m0516q3645M8599j0284
$$ 30991 12749 -19683 14529 29943 -3454 -47257 11013 71437 30921 -52724 -4125 -14409
16977a4409p1774k7553P7598n6086J5104J1989l4j488j6718K6309Q3398M7366
$$ -14409 -86183 -113736 -36138 -92224 -77120 -65131 -65165 -66653 -83371 -57062 26336 73702
16965G3702m0756j0364R567k4679l2958j875L0646R8513M3319O0378o0639k7733
$$ 73702 32946 22582 32149 7470 -25488 -27363 3283 101796 145115 205493 144854 117121
16953A17121q8k9966q127j6430o0704k7349J9725L238Q250j3238n4875K569N3514
$$ 117121 117033 87067 78940 62510 1806 -25543 -5818 -2580 5670 -7568 -62443 -59874 -6360
16940f360j5194J1076j3154m9438J9529l5746l3752n7459L4125M9234j2836l0383
$$ -6360 -21554 -10478 -23632 -73070 -53541 -89287 -123039 -180498 -146373 -97139 -109975 -140358
16928a40358P5573M0640J8288K4925m5895P800J6127m2216r0328R49O0924J5026
$$ -140358 -64785 -24145 -5857 19068 -26827 -19027 -2900 -45116 -135444 -134495 -73571 -58545
16916e8545l4l8990k3939j3032L0378l6071O6356N6709k4917m33j5635j1808J023
$$ -58545 -58579 -97569 -121508 -134540 -104162 -140233 -73877 -17168 -42085 -42518 -58153 -69961 -68938
16903f8938J4990N3533O3909M1033m8697N1663N9733n9473n1092K7724L2745n747
$$ -68938 -53948 -415 63494 104527 55830 107493 167226 107753 56661 84385 117130 111383
16891A11383m6766n9068k6909N111J4624l828K956L7152l769p904j5242o7749
$$ 111383 64617 5549 -21360 -16249 -1625 -5453 -2497 34655 30886 22982 7740 -60009
16879f0009k1179L5780N3781Q0396J4389o6616n3509p138J6084P993L3213m983
$$ -60009 -81188 -45408 8373 88769 103158 36542 -16967 -24105 -8021 -28 33185 28202
16867B8202P285l1982M90O2106J4998J2478l0431k68k188J7598p0543n0880j3774
$$ 28202 35487 3505 3995 66101 81099 93577 63146 62878 60690 78288 7745 -43135 -56909
16854e6909P3428P1453k45j8733p217n3913q087L6011l4637o636k9204p598M8839
$$ -56909 16519 87972 87727 68994 61777 7864 -223 35788 1151 -5485 -34689 -42287 6552
16841F552J6718K0087m1568m403L9536j3911n7801P8909J17815j6258r0722o1156
$$ 6552 23270 43357 1789 -2614 36922 23011 -34790 44119 161934 145676 54954 -6202
16829f202j2956O1370j7786k8912l0566J3342o178L0545Q4523l1582j6086J8163
$$ -6202 -19158 42212 24426 -4486 -35052 -21710 -27888 2657 87180 55598 39512 57675
16817E7675n2673l7581Q9m2860l382K0168j3302k5808M606L2533J0826k466l2809
$$ 57675 5002 -32579 -32490 -75350 -78732 -58564 -71866 -97674 -93068 -60535 -49709 -52175 -84984
16804h4984l9750m568M7655P3263L4004l3276n8079m0733K4420j9559P3855O811
$$ -84984 -124734 -129302 -81647 -8384 25620 -7656 -65735 -106468 -82048 -101607 -27752 -20941
16792b0941j7027M1667J1580n0160L3731M3693O858j6117n490k2202P5442Q009
$$ -20941 -37968 3699 15279 -34881 -1150 42543 49401 33284 27794 5592 81034 89043
16780H9043p7924j2793j7140n6848m1286K8686L2659K2993M7490j5779n337J0716
$$ 89043 11119 -1674 -18814 -75662 -116948 -88262 -55603 -32610 14880 -899 -6236 4480
16768D480L2569n684j6895m4396K0413j5330M588K1797Q423l7857o2350j4003
$$ 4480 37049 31365 14470 -29926 -9513 -24843 -20255 1542 9965 -27892 -90242 -104245
16756a04245l477N9728K9872k5254m5537k9265L1504k1552O7374P0468Q7839k0070
$$ -104245 -107722 -47994 -18122 -43376 -88913 -118178 -86674 -108226 -40852 29616 117455 97385
16744I7385r548p0070r076R833j3229m6988K4557L53l2586N9997l2547n5068k6685
$$ 97385 87837 17767 8691 18524 5295 -41693 -17136 -16783 -49369 10628 -21919 -76987 -103672
16731a03672N8463N8062k5479m5878l6738P449N7786L4123J1437j5646o2640J4866
$$ -103672 -45209 12853 -12626 -58504 -95242 -87793 -30007 4116 15553 -93 -62733 -47867
16719d7867O4823L4361o1580l3022l0759J8348J8048J9032k284r906j8440J5774
$$ -47867 16956 51317 -10263 -43285 -74044 -55696 -37648 -18616 -20900 -30806 -49246 -33472
16707c3472K5565M6016k0583q1808K5236K5574o677M5453O552j5322l6101J8745
$$ -33472 -7907 38109 17526 -64282 -39046 -13472 -20149 25304 31856 16534 -19567 -822
16695h22p159j6480n8766k8670l5592K1372M9484L3428p71l0348j3915N4806k3857
$$ -822 -7981 -24461 -83227 -111897 -147489 -126117 -76633 -43205 -43976 -74324 -88239 -33433 -57290
16682e7290L3503J0943N340p712m8716k9882j6120Q6365K2703j8125J9535k6354
$$ -57290 -23787 -12844 -7504 -15216 -63932 -93814 -109934 -23569 -866 -18991 544 -25810
16670b5810k952P0865n621J4144r250L0961l6304m5209K0653n345o4503L600q7043
$$ -25810 -28762 42103 36482 50626 41376 72337 36033 -9176 11477 6132 -58371 -54771 -141814
16657a41814M1847J9504J1645m3418N5539j1290l619L7590K5066l629K4135L5602
$$ -141814 -99967 -80463 -68818 -112236 -56697 -67987 -71606 -34016 -8950 -12579 11556 47158
16645D7158J3062j1082j5660J598Q355J8588N5903L1066m0653k9539l5393r2676
$$ 47158 60220 49138 33478 35076 43431 62019 117922 148988 108335 78796 43403 -49273
16633d9273k4382K1989M7900L1213m0827m9521k3280j0282M4046N1146m2154k895
$$ -49273 -73655 -51666 -3766 27447 -13380 -62901 -86181 -96463 -52417 -1271 -43425 -46320
16621d6320N9239K0720l5577L7673L955N248K4504l2655K9374o4085l1644N1596
$$ -46320 12919 33639 -1938 35735 39690 44938 69442 36787 66161 2076 -29568 22028
16609B2028m6673n664K6856K2949m1787j8963P1170l1971r6627p586K5226P00
$$ 22028 -24645 -30309 -3453 19496 -22291 -41254 29916 -2055 -98682 -106268 -81042 -80342
16597h0342M8746J9703o0439l4058K0686J8303Q8498N0944M99l6629m4114j4805
$$ -80342 -31596 -11893 -72332 -106390 -85704 -67401 21097 72041 72540 35911 -8203 -23008
16585b3008L5409k4264l0804m5096j8978J06188N7825k6653j219m8459l8889K5161
$$ -23008 12401 -11863 -42667 -87763 -106741 -553 57272 30619 29400 -19059 -57948 -32787
16573c2787M2166k0042q2955P0980R846l0473j9776k1251M0807N3618j184L475
$$ -32787 9379 -10663 -93618 -22638 -12792 -43265 -63041 -84292 -43485 10133 8949 12424
16561A2424j2236Q587K8460N545o4875M9580p528o2307m9815n5486j606L2914
$$ 12424 188 8775 37235 42780 -22095 27485 19957 -42350 -92165 -147651 -149257 -116343
16549a16343N4075k8587L8403O9385j0667j298J6354k2548j8480m0871k9654q708
$$ -116343 -62268 -90855 -52452 16933 6266 4968 21322 -1226 -19706 -60577 -90231 -98939
16537i8939L3512K3884k2322K5849L3879J4072J27j5264p8703J0627R6165R1153
$$ -98939 -65427 -41543 -63865 -38016 -4137 9935 10062 -5202 -83905 -73278 22887 114040
16525A14040l5552j885L611L477m9237K274k644R098l1576p305P050j6998J4077
$$ 114040 78488 76603 80214 83691 34454 36728 34084 43182 11606 4301 11351 -5647 8430
16512H430j3867N5360j1824K540K621K4420k518R444j3370k4767k1818j2026K499
$$ 8430 -5437 49923 38099 40639 43260 67680 65162 74606 61236 36469 14651 2625 5124
16499E124R792n1251j4848N9534r193k4435j4140N790K1517N7811n1146j8453
$$ 5124 14916 -36335 -51183 8351 -842 -25277 -39417 -33627 -12110 45701 -5445 -23898
16487b3898l60N3872k7308n5680K3426N12o3690n5016K6832J08798P7084N1675
$$ -23898 -24258 29614 2306 -53374 -29948 -29436 -93126 -148142 -121310 -12512 64572 116247
16475A16247m5026p5839j7330L6417k4830k7065J9170J03526J5319o0126J8991
$$ 116247 71221 -4618 -21948 14469 -10361 -37426 -18256 85270 100589 40463 59454
16464E9454m6327k2928Q79j3986m463o3319o1785J7348K0170M9489P5751N9939
$$ 59454 13127 -9801 -8922 -22908 -27371 -90690 -152475 -135127 -114957 -65468 10283 70222
16452G0222p6676P980J2385J3225j3534j1868k6744M4416p299n1261k0394J3216
$$ 70222 -6454 1526 13911 27136 13602 1734 -25010 19406 12107 -39154 -59548 -46332
16440d6332l850K9317l4658j7619O5240K9109K3939j112M0262l252p4035k8966
$$ -46332 -50182 -20865 -55523 -73142 -7902 21207 45146 44034 84296 81044 7009 -21957
16428b1957L0533M1005n7175k8463j5897N4792J6223j1052l5514J2480N2023j8444
$$ -21957 8576 49581 -7594 -36057 -51954 2838 19061 8009 -27505 -15025 36998 18554
16416A8554l6350K6320M6048O601l5965J811j3403J8485R8971J1669m0815n671
$$ 18554 -17796 8524 54572 61173 25208 27019 13616 32101 131072 142741 101926 96255
16404I6255k7544k3701J5000j5075p4774o690K5942j1124q215L7611Q141R546
$$ 96255 68711 45010 60010 44935 -29839 -36529 -10587 -21711 -29926 7685 15826 25372
16392B5372l4432J3405J1815L8143N4736j894k1156n539p2933k8370o8023p675
$$ 25372 -9060 4345 16160 54303 109039 107145 85989 80450 7517 -20853 -88876 -96551
16380i6551P5366M9281k8690P198L2681k7578K9592k8000n7705L6809m078R963
$$ -96551 -21185 28096 -594 6604 39285 11707 41299 13299 -44406 -7597 -11675 -1712
16368a712r090j1108K5246j3873l2156J5915k1395k019k4726N2527O6846K155
$$ -1712 -10802 -21910 3336 -10537 -42693 -26778 -48173 -50192 -74918 -22391 44455 46610
16356D6610l1685k9582n1137K4094N7588r902j5421l1503j1586M079M6102L8341
$$ 46610 14925 -14657 -65794 -41700 15888 5986 -9435 -40938 -52524 -48445 -2343 35998
16344C5998o2227k4404m311j5550o870N3960M7726m3090l5671k4527J9127Q045
$$ 35998 -26229 -50633 -54944 -70494 -77364 -23404 24322 -18768 -54439 -78966 -59839 -51794
16332e1794j4444M8848n8282n0172P8928J08355J9879k2119m9105m2521J7396
$$ -51794 -66238 -17390 -75672 -125844 -46916 61439 81318 59199 10094 -32427 -15031
16321a5031K2999J7156k7477k6174n7719L4677N1180m0426K6377M522r655K3062
$$ -15031 7968 25124 -2353 -28527 -86246 -51569 -389 -40815 -14438 -9916 -19571 3491
16309C491m8752k5107J3897k1108j008M8780N3042J5266O0011J5720n6624p289
$$ 3491 -45261 -70368 -56471 -77579 -78587 -29807 23235 38501 98512 114232 57608 50319
16297E0319l9044n1291j8209J0543J6367J3758n6150r023O7694m6235n9543m518
$$ 50319 11275 -40016 -58225 -47682 -31315 -17557 -73707 -82730 -15036 -61271 -120814 -125332
16285a25332M4106R3467k0619J2942P8317j8033p2525m2380L895M8546L2968J5244
$$ -125332 -81226 12241 -8378 4564 82881 64848 -7677 -50057 -46162 2384 35352 50596
16273E0596N2623j5201O316n7348n6781j01056q077J9068N9229N7347j7933j2650
$$ 50596 103219 88018 94334 36986 -19795 -120851 -128928 -109860 -50631 6716 -11217 -23867
16261b3867m9996J4145Q9195l86J4748O0916o221m5936K2859k1968l1846M5299
$$ -23867 -73863 -59718 29477 29091 43839 104755 98534 52598 75457 53489 21643 66942
16249F6942K0838K0210o0322q583P3217m496n5186o684j701m4198j8224K8154
$$ 66942 87780 107990 47668 39085 112302 107806 52620 45936 44235 37 -18187 9967
16237I967k0441l7022L3200P3133k2557r0169P468J9515q989o4867K3927j9741
$$ 9967 -10474 -47496 -14296 58837 36280 -53889 -46421 -26906 -35895 -100762 -76835 -96576
16225i6576J2214n21N1236K6741N850K1086q713k6018l5597L0260N8225J6325
$$ -96576 -84362 -84883 -33647 -6906 -1056 20030 11317 -14701 -50298 -20038 38187 54512
16213E4512l6222m7363q580N0888M209O672M9933j0094j7497n5146k4809L951
$$ 54512 18290 -29073 -37653 13235 17444 24116 74049 63955 46458 -8688 -33497 -29546
16201b9546k3099K155q110j4138N4640j5274n4041j1304K750J0474K1280K6074
$$ -29546 -52645 -50490 -58600 -72738 -18098 -33372 -87413 -98717 -95967 -85493 -64213 -38139
16189c8139R929j4418L4682p785N0786j8367o17M279M4436r45K3038L2725J6232
$$ -38139 -28210 -42628 -7946 -15731 35055 16688 16071 20350 64786 63841 86879 119604 135836
16176A35836K2314p2593p2082k4537l9957m0770K603L8777J8082L037k4324L0302
$$ 135836 158150 85557 13475 -11062 -51019 -91789 -89186 -50409 -32327 -29290 -53614 -23312
16164b3312J6065K2211j6653n6355M8829M822m4414M9046J9050o4352L746J12145
$$ -23312 -7247 14964 -1689 -58044 -9215 -4393 -48807 239 19289 -45063 -41317 70828
16152G0828k2059p2148J2685J2536r435l3654K496J4313M0885K1714k1702J2290
$$ 70828 48769 -23379 -10694 1842 -7593 -41247 -38751 -24438 16447 38161 16459 28749
16140B8749L1690r472m1192K9618J0964l5376o6261J0530L1451K1788j3855j3973
$$ 28749 60439 50967 9775 39393 50357 14981 -51280 -40750 -9299 12489 -1366 -15339
16128a5339J2489J170R659m4320k0770l2411O4898J274K6029K804j0074L4093
$$ -15339 -2850 -1680 7979 -36341 -57111 -89522 -24624 -23350 2679 5483 -4591 29502
16116B9502R5526L3811m7403p3669m6199p2389m859K3030N1907J307j5575J9487
$$ 29502 125028 158839 111436 37767 -8432 -80821 -85680 -62650 -10743 -9436 -25011 -5524
16104e524k5784j8161L7164O1034M6447n9816o8347l9942m2200k4170K2060j9856
$$ -5524 -31308 -49469 -12305 48729 95176 35360 -32987 -72929 -115129 -139299 -117239 -137095
16092a37095K5046K6177M2422L8516l1586j8145k4992J9043p48R4J5698K5250
$$ -137095 -112049 -85872 -43450 -4934 -36520 -54665 -79657 -60614 -61362 -61268 -45570 -20320
16080b0320J4549J9911p0456Q463L7286L783K1349K7066p0187l5134j518k8905
$$ -20320 -5771 14140 -56316 -47853 -10567 -6784 14565 41631 -28556 -63690 -65208 -94113
16068i4113K5692J6l0172j6692L3841O0824l6339j9017L6469m9583P714N8007
$$ -94113 -68421 -68405 -98577 -115269 -81428 -20604 -56943 -75960 -39491 -89074 -81360 -23353
16056b3353K1536P831n5217m1091J4815l1687L5036P4443l0166L5929K9396J0545
$$ -23353 -1817 6014 -49203 -90294 -75479 -107166 -72130 2313 -27853 8076 37472 48017
16044D8017p4152k253K3490n9296l3703J8422j7530P739M7751M5729L1593J4689
$$ 48017 -26135 -28388 -4898 -64194 -97897 -79475 -97005 -89266 -41515 4214 35807 50496
16032E0496L0464m0012p1429m5761K5436M3173P716j817j5456J3354J6879k6878
$$ 50496 80960 40948 -30481 -76242 -50806 -7633 83 -1734 -17190 -3836 13043 -13835
16020a3835o06N118J5298M1827J4609l5413P621J8801O0424k9591m3916l9365
$$ -13835 -14441 -9323 5975 47802 62411 26998 34619 53420 113844 84253 40337 972
16008I72L4405K9916o012o5662p705J1300k1909m07N3795K3141k9623k9528m3417
$$ 972 35377 65293 59281 -6381 -14086 -2786 -24695 -25102 28693 51834 22211 -7317 -50734
15995e0734q0193k702J5721L271J0817O9896l5843R430Q1241m9734o7078P5581
$$ -50734 -130927 -133629 -117908 -114637 -103820 -33924 -69767 -60337 20904 -28830 -95908 -20327
15983b0327K6865k9156j6850k6603n1392j713M8074O1170J5591n342m7754L3747
$$ -20327 6538 -22618 -39468 -66071 -117463 -119176 -71102 -9932 5659 317 -47437 -13690
15971a3690L6910r485j0466m420k6985n1920Q540K9813j6071J7090k4527J2444
$$ -13690 23220 13735 3269 -1151 -28136 -80056 -71516 -41703 -57774 -40684 -65211 -52767
15959e2767j2229J4315l6903l966N1310q184k2946J6652j8393n1914q75J01589
$$ -52767 -64996 -50681 -87584 -91550 -40240 -48424 -71370 -54718 -73111 -125025 -125900 -24311
15947b4311P915p9097J2047O2547L6630Q166L2615l5410L269J5662J077k052J9845
$$ -24311 -16396 -95493 -83446 -20899 15731 23897 56512 21102 24371 40033 41110 39058 58903
15934E8903o9363K940Q5833j6243n5406J5804J06268j4590k5354J1957o1149j00070
$$ 58903 -10460 -7520 78313 62070 6664 22468 128736 114146 88792 100749 39600 -60470
15922f0470l4333P5173P6622J5297k639p4276o9172l273R3402P5708O946m9514
$$ -60470 -94803 -19630 56992 72289 69650 -4626 -73798 -77071 16331 92039 98985 49471
15910D9471j00247j6286L6588J20469Q9740l8865k7996L023q4966q874j9463j1939
$$ 49471 -50776 -67062 -30474 89995 179735 140870 112874 115897 30931 22057 2594 -9345
15898i345m5316K358J463K5992r187M0721K9334J2407K0987j3476p895P405P58
$$ -9345 -54661 -52303 -50840 -24848 -34035 6686 36020 48427 69414 55938 48043 55448 56206
15885E6206m540N955k4877j5149q7126M2479M6661J3151j1r055m3877q081k6621
$$ 56206 51666 57621 32744 17595 -69531 -27052 19609 32760 32749 23694 -20183 -28264 -54885
15872e4885M7058K9066n0053k2148q836J3590K6212m5107n8643o834L3248K907
$$ -54885 -7827 21239 -28814 -50962 -59798 -46208 -19996 -65103 -123746 -130580 -97332 -94425
15860i4425l4736M1400N7053P9638k5134m6594l376O5130o321K8978J0539m3750
$$ -94425 -129161 -87761 -30708 48930 23796 -22798 -26174 38956 32635 61613 72152 28402
15848B8402m0381j1180N9806M2737n1059o9706n226J4511J8993m14m5651l0896
$$ 28402 -11979 -23159 36647 79384 28325 -41381 -46607 -32096 -13103 -13517 -59168 -90064
15836i0064k7971l3722K2767M8548m0277O2677L2000j3437j4275J1946J988l302
$$ -90064 -118035 -151757 -128990 -80442 -120719 -58042 -26042 -39479 -53754 -41808 -39820 -43122
15824d3122k7859P0885O6622J6116M4560k1296k7580m7884k0816q146l1411m2730
$$ -43122 -70981 -96 66526 82642 127202 105906 78326 30442 9626 1480 -29931 -72661
15812g2661m628M9455L1441L6393q310M195l427L250j077n457l4301n595N8915
$$ -72661 -77289 -27834 3607 40000 31690 35885 32458 35708 34631 29174 -5127 -10722 48193
15799D8193K5381K9567j5429m8182k2738J5389M2423J6251k2249o0822n9402M2227
$$ 48193 73574 103141 87712 39530 16792 32181 74604 90855 68606 7784 -51618 -9391
15787i391j6020n4395M8131o2523J923J7905L8799L9571l9031p8858j5677Q4071
$$ -9391 -25411 -79806 -31675 -94198 -92275 -74370 -35571 4000 -35031 -113889 -129566 -45495
15775d5495n260m3148L9107K1138l9527M9996j9097l2662K8923J6755J3863P602
$$ -45495 -50755 -93903 -54796 -33658 -73185 -23189 -42286 -74948 -46025 -29270 -15407 -7805
15763g805o681j0723Q5474J5945k3042l9026p2148q6213J6323O0378M4058K1534
$$ -7805 -14486 -25209 60265 76210 53168 14142 -58006 -144219 -127896 -67518 -23460 -1926
15751a926n0905M2271L6634K1734n9791K3991M9733o9094o9310N1253P5865l218
$$ -1926 -52831 -10560 26074 47808 -11983 12008 61741 -7353 -76663 -25410 50455 47237
15739D7237k1093k5313J9392q907n1930n604K3095p910n7090j7431N3627M6138
$$ 47237 26144 831 20223 11316 -40614 -46218 -23123 -31033 -88123 -105554 -51927 -5789
15727e789K511l9608k181k3197Q1503M5759l2245j7637L2918l7627l4792l4055
$$ -5789 -3278 -42886 -45067 -68264 13239 58998 26753 9116 42034 4407 -30385 -64440
15715f4440N0747k7538k4869M9499O3292l282J9385l5674n7047n3846l329L8172
$$ -64440 -13693 -41231 -66100 -16601 46691 43409 62794 27120 -29927 -83773 -87102 -48930
15703d8930l600Q216m6561l0145Q3663O3457j1519n5588k2635j9045k2643L793
$$ -48930 -52530 -44314 -90875 -121020 -37357 26100 14581 -41007 -63642 -82687 -105330 -101537
15691a01537O8870N4702j249n1655j0147N9712K7757j6004K6671l5744m12J4084
$$ -101537 -32667 22035 20786 -30869 -41016 18696 46453 30449 57120 21376 20964 35048
15679C5048o1821l6530q534L5557p188R810k1399l5057R6130Q6050n9774j2734
$$ 35048 -26773 -63303 -71837 -36280 -43468 -33658 -55057 -90114 6016 92066 32292 19558
15667A9558L0959L397m4366r691K5987k6744k9408k1617m4487j4706P0429N0216
$$ 19558 50517 53914 9548 -143 25844 -900 -30308 -51925 -96412 -111118 -40689 9527
15655I527J7220n5549q2202L1806L6540M6687K3519R537N6427M6190L300m3692
$$ 9527 26747 -28802 -111004 -79198 -42658 4029 27548 37085 93512 139702 143002 99310
15643I9310j08386m879L7575n0580O124K3216N647m8871K995M7702m5325m4023
$$ 99310 -9076 -13955 23620 -26960 -20836 2380 8027 -40844 -37849 9853 -35472 -79495
15631g9495j3882N6257K6617j6197n3100q792M7958J1231J5103K4579j6293k6057
$$ -79495 -93377 -37120 -10503 -26700 -79800 -88592 -40634 -29403 -14300 10279 -6014 -32071
15619c2071M3247R9708N846j02675r126o600l4552k2270O359L7799M3425M6826
$$ -32071 11176 110884 116730 14055 4929 -1671 -36223 -58493 -52134 -14335 29090 75916
15607G5916n6105n5994O0360J0843m0790m8600L1090L3915J3187J1105J2750q3499
$$ 75916 19811 -36183 24177 35020 -5770 -54370 -23280 10635 23822 34927 47677 -35822
15595c5822k5395Q2721M1945m1625n0701K9872M0506k7521j2316k1297n7358M4609
$$ -35822 -61217 21504 63449 21824 -28877 995 41501 13980 1664 -19633 -76991 -32382
15583c2382K7576l0813j054k911l1345l1366J5348O1274Q8418K4196j5579o424
$$ -32382 -4806 -35619 -36673 -39584 -70929 -102295 -86947 -25673 62745 86941 71362 64938
15571F4938n4901l079m8268l9660J6347M2940Q463j5522k6768J5121K4143k7992
$$ 64938 10037 6958 -41310 -80970 -64623 -21683 -13220 -28742 -55510 -40389 -16246 -44238
15559d4238m8969J0905L7543j6789j629Q2184N858n9836Q6P3382n6745p9429O4096
$$ -44238 -93207 -82302 -44759 -61548 -63177 19007 24865 -34971 -34885 38497 -18248 -97677 -33581
15546c3581O3098J9126l3181L488K798m1363K0124L2022j0002j2207K7526N3379
$$ -33581 29517 48643 15462 18950 21748 -19615 509 32531 22529 10322 37848 91227
15534I1227m5756l4730j3818k5741R787N3353L7743p1632n6704k0118M137K0008
$$ 91227 45471 10741 -3077 -28818 -19031 34322 72065 433 -56271 -76389 -72252 -52244
15522e2244N5538K0885p4618k1794j444P8685J9576n3348q356o132Q155L7664
$$ -52244 3294 24179 -50439 -72233 -73677 5008 24584 -28764 -37120 -43252 -35097 2567
15510B567j8158j2629Q955k0598k95O0625J1902O253k332o714k7214k601j8624
$$ 2567 -15591 -28220 -19265 -39863 -40158 20467 32369 38622 36290 29576 2362 -239 -18863
15497a8863j6135J3664O7425Q4597l3753n1442j957o1702m7559K6356L3095O019
$$ -18863 -34998 -21334 46091 130688 96935 45493 43536 -18166 -65725 -39369 -6274 -255
15485b55q991n155p841P5552J5466q9692k8427r166L3768L0184O01o516j0251
$$ -255 -9246 -14401 -22242 53310 68776 -20916 -49343 -58509 -24741 5443 6044 -472 -10723
15472a0723M343k3146m1479M1693j4397M7428J2680J3338M0016k9574l2134K124
$$ -10723 -6380 -29526 -71005 -29312 -43709 3719 16399 29737 69753 40179 8045 10169
15460A0169M4940L2459j8048j8226N1213k2058o4913m9996m6539p177N3037n674
$$ 10169 55109 87568 69520 51294 102507 80449 15536 -34460 -80999 -88176 -35139 -40813
15448d0813m6999q7445J5371M1423j2932O3564L6849M3789K8833p516o5323p8676
$$ -40813 -87812 -175257 -159886 -118463 -131395 -67831 -30982 12807 41640 34124 -31199 -109875
15436a09875O4990J22043K3885m4808p4319o435M5774L6342n1556J2743k8320
$$ -109875 -44885 77158 101043 56235 -18084 -24519 21255 57597 6041 18784 -9536
15425i536j1518k6966l2499l0591L3078j4541k3661r898M7703L3505M3020M6476
$$ -9536 -21054 -48020 -80519 -111110 -78032 -92573 -116234 -126132 -78429 -44924 -1904 44572
15413D4572k9205p1772k5573O793O9404N7916O0420r3463j13319k3845N4821O0983
$$ 44572 15367 -56405 -81978 -75185 -5781 52135 112555 19092 -94227 -118072 -63251 -2268
15401b268o327J6885l5483O777j9345k741L5212J0246k7750J6684L3538j9753
$$ -2268 -8595 8290 -27193 -20416 -39761 -42502 -7290 2956 -24794 -8110 25428 5675
15389E675o1276k0067M2336k336M2995O033k8177k9193j8735l3122L588L9662
$$ 5675 -55601 -75668 -33332 -35668 7327 13360 -14817 -44010 -62745 -95867 -92279 -52617
15377e2617N4153p838m0782k1994Q69j5918K8460L4247k3140j0828M9417k4615
$$ -52617 1536 -6302 -47084 -69078 -68209 -84127 -55667 -21420 -44560 -55388 -5971 -30586
15365c0586O911J3957O3774P1716l5378o7151j7256j5289o5647n157K3936m3559
$$ -30586 -23675 -9718 54056 125772 90394 23243 5987 -9302 -74949 -80106 -56170 -99729
15353i9729M2730J2490j0773j8747j6409Q6242J07443l0912R242j8448j06435
$$ -99729 -56999 -44509 -55282 -74029 -90438 -4196 103247 72335 81577 63129 -43306
15342d3306m8014P1707J04973n753l9813O172l5097m6645j1869j7951J2096J0801
$$ -43306 -91320 -19613 85360 79607 39794 45966 10869 -35776 -47645 -65596 -53500 -42699
15330d2699P0058O721M8677j0404q252O19m5835r365J0646O531M0034l2559o2580
$$ -42699 27359 34080 82757 72353 64101 64720 18885 9520 20166 26697 66731 34172 -28408
15317b8408K317P6773K6836j4183j09875k5005L1905J2919L781m5539J6026N2624
$$ -28408 -26091 50682 77518 63335 -46540 -71545 -39640 -26721 -22940 -68479 -52453 171
15305A71l720p380p45m3310m1852M6539P1838J3282m6433N4635J7159k988K2147
$$ 171 -3549 -10929 -11674 -54984 -96836 -50297 21541 34823 -11610 43025 60184 57196 79343
15292G9343j7803m9367m0962p2188l8170J1717q627L3434J3879J6965k6855P33
$$ 79343 61540 12173 -28789 -100977 -139147 -127430 -136057 -102623 -88744 -71779 -98634 -97901
15280i7901J4433M6340k9295L708M8389l591N690J6738n1041m477J9937J2469
$$ -97901 -83468 -37128 -66423 -62715 -14326 -17917 -12227 4511 -46530 -51007 -31070 -18601
15268a8601q026L917L8436L2874m131n8267l0270k5754n1495L7814L6163O2364
$$ -18601 -26627 -22710 15726 48600 44469 -13798 -44068 -69822 -121317 -83503 -47340 15024
15256A5024m512j5299L7964n815n601j4052l0771K9998N0657o1859m6492P0994
$$ 15024 10512 -4787 33177 27362 21761 7709 -23062 6936 57593 -4266 -50758 20236
15244B0236M2647k9981m5609m8218m599O9875K2878J2677l586k9702L5147K4285
$$ 20236 62883 32902 -12707 -60925 -65524 4351 27229 39906 36320 6618 41765 66050
15232F6050l2800o2458o532R4854L7594m1332p3285q0858J8392P9914M9450o8359
$$ 66050 33250 -29208 -35740 59114 96708 55376 -17909 -98767 -80375 -461 48989 -19370
15220a9370k5751j6163k57L5103j0519l320j1319k208J5141R478o373J9875J2909
$$ -19370 -45121 -61284 -61541 -26438 -36957 -40277 -51596 -53804 -38663 -29185 -35558 -15683 -2774
15207b774J774K5008j4117l3400n625J8058L8947J6941J2771m4388m0499k5113
$$ -2774 -1000 24008 9891 -23509 -29134 -11076 27871 44812 57583 13195 -27304 -52417
15195e2417m3302m538J1320k2927K4681K7543M0903L6242m4776L4286J148n2292
$$ -52417 -95719 -100257 -88937 -111864 -87183 -59640 -18737 17505 -27271 7015 8163 -44129
15183d4129J2910P1212l3952M924n3823K8694J2747J4833n5842N9820L8604m9787
$$ -44129 -31219 39993 6041 10965 -42858 -14164 -1417 13416 -42426 17394 55998 6211
15171F211j7188n3127m0040N625M2091J9862L412Q7n040K7444m5767j7644L37
$$ 6211 -10977 -64104 -104144 -98519 -56428 -36566 -33154 -33067 -38107 -10663 -56430 -74074 -73737
15158g3737J097O0456L7047p6904j488J7883k8541m7101K9420K2092q924O379
$$ -73737 -72640 -12184 24863 -52041 -53529 -35646 -64187 -111288 -81868 -59776 -68700 -62321
15146f2321L7023K0792M6171J6426m1136n3402J0016M8101k9696j8501M298j357
$$ -62321 -25298 -4506 41665 58091 16955 -36447 -26431 21670 -8026 -26527 -22229 -23586
15134b3586r032k9574N982L7488M6901p4P623j3689l8511j7313J5932L06k5931
$$ -23586 -32618 -62192 -56210 -18722 28179 28105 35728 22039 -16472 -33785 -17853 -17547 -43478
15121d3478K5889J2005l5471l2969J5540M1290m9791q21Q710K468K0374Q5158
$$ -43478 -17589 -5584 -41055 -74024 -58484 -17194 -66985 -67806 -59096 -56628 -36254 48904
15109D8904N6925M64N093l1775o7995l6980j5054n8901k5710L8074K6755J00165
$$ 48904 105829 106293 111386 79611 11616 -25364 -40418 -99319 -125029 -86955 -60200 39965
15097C9965K7987k3063k8438P853J1748o515m0363j2700N0251p4512j3810L0072
$$ 39965 67952 44889 16451 24304 36052 29537 -10826 -23526 26725 -47787 -61597 -31525
15085c1525J4325L9678J2206L2485K634p4658p3317J5640L8956J5978m2922m9912
$$ -31525 -17200 22478 34684 67169 69803 -4855 -78172 -62532 -23576 -7598 -50520 -100432
15073a00432L323K1236N0908K5289q6001l484L7312J8206p899r783k733k4205
$$ -100432 -97109 -75873 -24965 324 -85677 -89161 -51849 -33643 -41542 -51325 -54058 -78263
15061g8263O6514j4768O7376R177l0725k476R470j3772l2542m5985k5130N971
$$ -78263 -11749 -26517 40859 50036 19311 16835 26305 12533 -20009 -65994 -91124 -85153
15049h5153Q745K1084Q3715N9476J044m312j03884j7355O3928L4938p1347p6191
$$ -85153 -76408 -55324 28391 87867 88911 84599 -19285 -36640 27288 62226 -9121 -85312
15037h5312j4542K8587O8401K0236l1766m6933q113P1618M4181l8091l4130M4124
$$ -85312 -99854 -71267 -2866 17370 -14396 -61329 -69442 2176 46357 8266 -25864 18260
15025A8260j951N088O860L382k3049m6419M0179M2456l4123K730m6855l4250N4060
$$ 18260 16309 21397 28257 31639 8590 -37829 2350 44806 10683 13413 -33442 -67692 -13632
15012a3632L3445n4379p8377J2385J8369q731K4024l6765J018L4480O5384j261
$$ -13632 19813 -34566 -112943 -100558 -82189 -90920 -66896 -103661 -102643 -68163 -2779 -4040
15000d040k13R499L4554L1282L0640p0439r7465M9313M8187r9870l2481P4778
$$ -4040 -4253 5246 39800 71082 101722 31283 -66182 -16869 31318 -68552 -101033 -26255
14988b6255J468j110K911n919L8459M1318K4960k8644k9707L147J7098j9695n517
$$ -26255 -24787 -25897 -22986 -28905 9554 50872 75832 47188 17481 20628 37726 18031 12514
14975A2514j6929l2319l989o457J3980n7251j1950Q7029K7922M741k8915j3626
$$ 12514 -4415 -36734 -40723 -47180 -33200 -90451 -102401 -15372 12550 17291 -11624 -25250
14963b5250k6410N2200M93j8662m2966J3241j1613L8750M4909l5112k7738k3616
$$ -25250 -51660 540 1033 -17629 -60595 -47354 -58967 -20217 24692 -10420 -38158 -61774
14951f1774l0977L5346L1771l8184L883Q891L877J496L7747R903k1563k6249K0261
$$ -61774 -92751 -57405 -25634 -63818 -59935 -51044 -47167 -45671 -7924 1979 -19584 -45833 -25572
14938b5572O9705j1704m1453q4645Q3888J02100L1269k5579p2679l6718j6577
$$ -25572 44133 32429 -9024 -93669 -9781 92319 123588 98009 25330 -11388 -27965
14927b7965K3309j5361K6445O7949k7529n4206k2595M3673M1470R178k5185n1967
$$ -27965 -4656 -20017 6428 74377 46848 -7358 -29953 13720 55190 64368 39183 -12784
14915a2784k3963M2183N0178J5075m080j0158p6413K8K0920j8811k2815m447L2966
$$ -12784 -36747 5436 55614 70689 66609 56451 -19962 -19934 986 -17825 -40640 -45087 -12121
14902a2121L957J8296j2925m8511K8295j2384P843k8678J3296P8181L8919m438
$$ -12121 -8164 10132 -2793 -51304 -23009 -35393 -27550 -56228 -42932 35249 74168 69730
14890F9730m2769o0727k1557K0713K8057N7441k3915J6555k0195l2866n1618l7257
$$ 69730 26961 -33766 -55323 -34610 -6553 50888 26973 43528 23333 -9533 -61151 -98408
14878i8408L2669Q2330J7601j9436n254J8166o3151j6176j4273P2629N6388k6988
$$ -98408 -65739 16591 34192 14756 9502 27668 -35483 -51659 -65932 6697 63085 36097
14866C6097k4025N627K5763J9310l0761m3604O34j5409k1985l2603l1393R6214
$$ 36097 12072 17699 43462 62772 32011 -11593 -10959 -26368 -48353 -80956 -112349 -16135
14854a6135M1190j2521j1968q055K4569k8118L6565j8291n7847k4047L1060J4845
$$ -16135 25055 12534 566 -7489 17080 -11038 25527 7236 -50611 -74658 -43598 -28753
14842b8753L906m7409K7793l06r717M2399N7628l6950j608n8515n0986j3067j4120
$$ -28753 -24847 -72256 -44463 -44769 -54486 -12087 45541 8591 6983 -51532 -102518 -115585 -129705
14829a29705N7637R7235m6687n6712K6520K3731N9251O4685k6495n1036K1402
$$ -129705 -72068 25167 -21520 -78232 -51712 -27981 31270 95955 69460 18424 39826
14818C9826l6885m4380r01k1537J5398J0713J1213n1021j7708M0228j4079K0911
$$ 39826 2941 -41439 -42340 -63877 -48479 -37766 -26553 -77574 -95282 -55054 -69133 -48222
14806d8222O097L8702O3726l029n4831q2079J6825Q4666N8894j255j5999k3632
$$ -48222 -42125 -3423 60303 57274 2443 -79636 -62811 21855 80749 79494 63495 39863
14794C9863J2391N6503k2317j9491K0275o2421k962k8719m6854p8073m3885N2919
$$ 39863 52254 108757 86440 66949 87224 24803 21841 -6878 -53732 -131805 -175690 -122771
14782a22771N0366Q263J7765O3956J2255q853m487K0171l7051n2707l8034l5385
$$ -122771 -72405 -64142 -46377 17579 29834 20981 16494 36665 -386 -53093 -91127 -126512
14770a26512M1190N0945k302O7295N1690n011J7937j484m1042p70m0245j2203
$$ -126512 -85322 -34377 -36679 30616 82306 77295 95232 93748 52706 51936 11691 -512
14758e12J1948M8060J6177j824J3050q753l4041k3983l599n57l5691K753P8378
$$ -512 11436 59496 75673 73849 86899 78146 44105 20122 16523 15966 -19725 -16972 61406
14745F1406j3852m5041m7147j8046J6427J8315K1371L6233l1517j6083K2351L8463
$$ 61406 47554 2513 -44634 -62680 -46253 -27938 -6567 29666 -1851 -17934 4417 42880
14733D2880l831r9n155K9450j4477m5292j9389j5084j4805L0393M305j8964j151
$$ 42880 39049 38950 33795 63245 48768 3476 -15913 -30997 -45802 -15409 -11104 -30068 -31219
14720c1219r628k2216k1225P4072K7247M593N7436K8905n4595j266j3967j00113
$$ -31219 -40847 -63063 -84288 -10216 17031 21624 79060 107965 53370 52104 38137 -61976
14708f1976p3161O3269L4961j5026k4162Q609j2063J0018J09845N1341q6843Q273
$$ -61976 -135137 -71868 -36907 -51933 -76095 -67486 -79549 -69531 40314 91655 4812 13085
14696A3085K0176K5992j8260o0216J609j4819n752L383J1278k5103J2017k0880
$$ 13085 33261 59253 40993 -19223 -17614 -32433 -38185 -34802 -23524 -48627 -36610 -57490
14684e7490N418N3398k5346n674K052n1491K4949R384j7826j2228K5615K3754
$$ -57490 -52072 1326 -24020 -29694 -27642 -79133 -54184 -44800 -62626 -74854 -49239 -25485
14672b5485l549m4151N123Q9283O7346j9813k7920o1961L250L0625R73J5080M5200
$$ -25485 -29034 -73185 -68062 21221 88567 68754 40834 -21127 -17877 12748 13721 28801 74001
14659G4001L8924q12l5094m1935k8154l0432O0355M4160o8017r0086o47K3964
$$ 74001 112925 112113 77019 35084 6930 -23502 36853 81013 12996 -77090 -77737 -53773
14647e3773m4256k4513J434M4837J8432j444p80J1122k1523M7813M4117j0264
$$ -53773 -98029 -122542 -121108 -76271 -57839 -59283 -60063 -48941 -70464 -22651 21466 11202
14635A1202j6756K9304M7672n1812p9391p687K9269o284k1720r985Q608Q2858
$$ 11202 -5554 23750 71422 19610 -59781 -67468 -38199 -44483 -66203 -76188 -67580 15278
14623A5278J994n974J991q3248m4554M121M1011K1490o3425o065J45366L6139
$$ 15278 17272 11298 13289 -69959 -114513 -110392 -69381 -47891 -111316 -117381 27985 64124
14611F4124l3408k0500m9909j6468J0935J406J0987Q8997k6345r3543R418N7568
$$ 64124 30716 10216 -39693 -56161 -45226 -43820 -32833 56164 29819 -63724 -54306 3262
14599C262p796l0440N4134N256J411n2197N8809k5255n7846p6367m7992L3243
$$ 3262 -4534 -34974 19160 24416 25827 -26370 32439 7184 -50662 -127029 -175021 -141778
14587a41778O5694L1154m6589j0890M3074L5916J3397m4642n93M0090N8594j2657
$$ -141778 -76084 -44930 -91519 -102409 -59335 -23419 -10022 -54664 -55257 -15167 43427 30770
14575C0770k1812p226j0451O7016r484k9034l3065J56m279L851N5544M9769Q033
$$ 30770 8958 1732 -8719 58297 48813 19779 -13286 -13130 -17409 -13558 41986 91755 99788
14562I9788k9330l7294k2551K2207l1914j3426O952K7704Q487M029L8842N2133
$$ 99788 70458 33164 10613 32820 906 -12520 -5568 22136 30623 34652 73494 125627
14550A25627n3661p0116k0955J6207m9631j8267Q052K0485N8185r840R033J03437
$$ 125627 71966 1850 -19105 -2898 -52529 -70796 -62744 -42259 15926 6086 15119 118556
14538A18556M0124p0553o6933o3270K2987L5047M9719l9894j4662K7554J7719
$$ 118556 158680 88127 21194 -42076 -19089 15958 65677 25783 11121 38675 56394
14527E6394j9598l3487q009K6343K2263n6196o7695j4642K9051R2494J1271j6244
$$ 56394 36796 3309 -4700 21643 43906 -12290 -79985 -94627 -65576 26918 38189 21945
14515B1945K6761k2068p8554K9101O6905m3812n3512L965n9420O1449J9091K1112
$$ 21945 48706 26638 -51916 -22815 44090 278 -53234 -49269 -108689 -47240 -28149 -7037
14503g037P5787J2849j4526o6143k8411j629K1423K7865Q37J9198M9563o3644
$$ -7037 68750 81599 67073 930 -27481 -29110 -7687 20178 21015 40213 89776 26132
14491B6132o5074o4773K8451M7259j3544M6121L1596j4364j2370L4363n856l4915
$$ 26132 -38942 -103715 -75264 -28005 -41549 4572 36168 21804 9434 43797 37941 3026
14479C026m7722M1777M3888J4812j2318n2396q33o6380J7878L9534N6391J8611
$$ 3026 -44696 -2919 40969 55781 43463 -8933 -9766 -76146 -58268 -18734 37657 56268
14467E6268P721n828J8961M367J9697n458J2283p8746r5008k6181k461J6687M2102
$$ 56268 63989 58161 77122 81489 101186 95728 108011 29265 -65743 -91924 -94385 -77698 -35596
14454c5596J7072M4822m1313k9238J0524r289K0681M053l0086J1106l4459Q969
$$ -35596 -18524 26298 -15015 -44253 -33729 -43018 -22337 -18284 -48370 -37264 -71723 -62754
14442f2754j4991L3658K1275k0156r826P828M7990K4662p009J7960k0208j1854
$$ -62754 -77745 -44087 -22812 -42968 -52794 -44966 3024 27686 20677 38637 18429 6575
14430F575k7142r519k1374n4845N6174M1301L2045j2442p201L2863r868j7639
$$ 6575 -20567 -30086 -51460 -106305 -50131 -8830 23215 10773 3572 36435 26567 8928
14418H928N374J0796n8331k7893O727J3856K0595k945R072J1956k8411K3260j4162
$$ 8928 14302 25098 -33233 -61126 -54399 -40543 -19948 -22893 -13821 -1865 -30276 -7016 -21178
14405b1178L3171N7150j08176k3191Q6335M3264R114k6363P914j7513k8652m9841
$$ -21178 11993 69143 -39033 -62224 24111 67375 76489 50126 58040 40527 11875 -37966
14393c7966j8664M6189L2371N141k4561m7187P0103l0389Q26K8963J7901l9725
$$ -37966 -56630 -10441 21930 27071 2510 -44677 25426 -4963 -4137 24826 42727 3002
14381C002m44L8916j0677j0410k4678j0606j6195p1016K4549O5808K6736j5405
$$ 3002 2558 41474 30797 20387 -4291 -14897 -31092 -102108 -77559 -11751 14985 -420
14369d20n7315k1660j996K4859R908O0029l550o3551n4938k1702N041J7466J8674
$$ -420 -57735 -79395 -81391 -56532 -46624 13405 9855 -53696 -108634 -130336 -125295 -107829 -89155
14356h9155k1721K1788M4556K5262P108J7166K5763l1496p992l3427j6943K3677
$$ -89155 -110876 -89088 -44532 -19270 -12162 5004 30767 -729 -8721 -42148 -59091 -35414
14344c5414K9818M654M7732j7099k6266m9418J5855Q9809k1915q5870m8043L0431
$$ -35414 -5596 -942 46790 29691 3425 -45993 -30138 59671 37756 -48114 -96157 -65726
14332f5726P2703N8741O14o179k9916m0486L9141l5427K0963K6191o904r3003
$$ -65726 6977 65718 66332 60153 30237 -10249 28892 -6535 14428 40619 33715 -59288
14320e9288m531N6572L1359j8464J3999K0478J4561j9304J8283l8755j02474n8597
$$ -59288 -63819 -7247 24112 5648 19647 40125 54686 35382 53665 14910 -87564 -146161
14308a46161l3042O903R1027Q259J176J8011m3092L947k3217L1369L7910k0594
$$ -146161 -179203 -172300 -81273 -73014 -71838 -53827 -96919 -92972 -116189 -84820 -46910 -67504
14296f7504r989L8521M2522L6221L938j7315j6677M0884J8508k6488l3245j7696
$$ -67504 -77493 -38972 3550 39771 43709 26394 9717 50601 69109 42621 9376 -8320
14284h320J165q879k7384j1774n2733l6898L6264j2097L8839K2748K4414M1040
$$ -8320 -7155 -16034 -43418 -55192 -107925 -144823 -108559 -120656 -81817 -59069 -34655 6385
14272F385m5550k6247M4362R4787N1679n7322l6234J1757J6739q8476o4986R534
$$ 6385 -39165 -65412 -21050 73737 125416 68094 31860 43617 60356 -28120 -93106 -83572
14260h3572l224l864J4200M0244L8221K6166N4732P464n9447l4265J955j926L9644
$$ -83572 -86796 -90660 -76460 -36216 2005 28171 82903 90367 30920 -3345 -1390 -3316 36328
14247C6328q3683l4073K9254N2987j5476p171Q844o2487Q622N9480K59j274p8920
$$ 36328 -47355 -81428 -52174 813 -14663 -21834 -12990 -75477 -66855 -7375 -7116 -8390 -87310
14234h7310K4382O6068j347j1656j7187k5655n222k545K3363l4624m1542J796
$$ -87310 -62928 3140 1793 -9863 -27050 -52705 -57927 -60472 -37109 -71733 -113275 -111479
14222a11479n4260m2166L9410Q8003L2817M9012j6466m5820k3640J10627O5587
$$ -111479 -165739 -207905 -168495 -80492 -47675 1337 -15129 -60949 -84589 26038 91625
14211I1625p153k2314m3747l0067L081J2092K1560l9509M698r266l1645k0993
$$ 91625 84472 62158 18411 -11656 -8575 3517 25077 -14432 -9734 -19000 -50645 -71638
14199g1638j0300R827M863O2714j0289L026j6092L8122m2717o1753l8066M8345
$$ -71638 -81938 -72111 -67248 -4534 -14823 -11797 -27889 10233 -32484 -94237 -132303 -83958
14187h3958K4995M7167M7841q362q9062l2740J21347P9896j122L1807l9057o9545
$$ -83958 -58963 -11796 36045 27683 -61379 -94119 27228 107124 106002 137809 98752 29207
14175B9207l0172j0962M6929J3600j1013J0453m8861k5011o7606L5616O4962N8050
$$ 29207 -965 -11927 35002 48602 37589 48042 -819 -25830 -93436 -57820 7142 65192
14163F5192M8954j6616q3562k6223j1283j0238p4777N6478R168L192J7605k5226
$$ 65192 114146 97530 13968 -12255 -23538 -33776 -108553 -52075 -42907 -39715 -22110 -47336
14151d7336J1611J516R755k4362O7728M1167k8150R950l132l4293J2963M0999
$$ -47336 -35725 -34209 -24454 -48816 18912 60079 31929 41879 38747 4454 17417 58416
14139E8416J5423l0485k5416k1933n0300N8649j1838l0813M829j7125k7546l8112
$$ 58416 73839 43354 17938 -3995 -54295 4354 -7484 -38297 -33468 -50593 -78139 -116251
14127a16251j9869J5665P3542N7478j7710k1762M1014K5498O2327K0961m03n6887
$$ -116251 -136120 -120455 -46913 10565 -7145 -28907 12107 37605 99932 120893 120490 63603
14115F3603q429N6000J157n0407k1194j4139K5871k7997r551l772N6794R18j0743
$$ 63603 55174 111174 112331 61924 40730 26591 52462 24465 14914 11142 67936 68854 58111
14102E8111k3330L131m620k5335K1963O6648j7273j2033o9517o6599M9234M8975
$$ 58111 34781 37912 33292 7957 29920 96568 79295 67262 -2255 -68854 -19620 29355
14090B9355K2192l8022l5548L5685L1813j6425l6760J0693k8219o5991M134Q3244
$$ 29355 51547 13525 -22023 13662 45475 29050 -7710 2983 -25236 -91227 -87093 -3849
14078c849M8934j4833l3005L2627j0160m7241k7738K908j8464O592P357k0645
$$ -3849 45085 30252 -2753 29874 19714 -27527 -55265 -52357 -70821 -64229 -56872 -77517
14066g7517o728l4949J3916M4717O5711j561l7790L4508P9087R4714o7004n2222
$$ -77517 -84245 -119194 -105278 -60561 5150 3589 -34201 307 79394 174108 107104 54882
14054E4882j606m784o5487l4486q060J5142O2480r232o2641J6677M9798L6100
$$ 54882 53276 48492 -16995 -51481 -59541 -44399 18081 8849 -53792 -37115 12683 48783
14042D8783j2746l5603o1156o396m227k0289N0627J5085k2004J259r956j6229
$$ 48783 36037 434 -60722 -67118 -71345 -91634 -41007 -25922 -47926 -46667 -56623 -72852
14030g2852l6668O51L9767N0387m6899N130M9740j2221l1924P625M0807K1284
$$ -72852 -109520 -108869 -69102 -18715 -65614 -60484 -10744 -22965 -54889 -47264 -6457 14827
14018A4827M962L4520N364q266N112K6115n6045m6566J1136M358N4199K7036n95
$$ 14827 19789 54309 59673 51407 56519 82634 26589 -19977 -8841 -4483 49716 76752 76157
14005G6157j5467m2561P54k5093k4354k1423J5931K4297q781j929j3898k7082
$$ 76157 60690 18129 18883 -6210 -30564 -51987 -36056 -11759 -20540 -22469 -36367 -63449
13993f3449l5866P3635K5730J2809R4569O2479m9068l7446k4449M4948k9787m5381
$$ -63449 -99315 -25680 50 12859 107428 169907 120839 83393 58944 103892 74105 28724
13981B8724m9201j6116L2278K4659J40O4167l566L2749o7674p6196M145j8836
$$ 28724 -20477 -36593 -4315 20344 20484 84651 81085 113834 46160 -30036 -25891 -44727
13969d4727J2561J8769R252o1364k1942N9175J2628k0060j3882j7294k0613l768
$$ -44727 -32166 -13397 -4145 -65509 -87451 -28276 -15648 -35708 -49590 -66884 -87497 -91265
13957i1265K1632p768L1408M9640O668M0922j7610m5920k0600M0793M689J0668
$$ -91265 -69633 -77401 -45993 3647 10315 51237 33627 -12293 -32893 7900 12589 23257
13945B3257N5898J0223j9176l0202K4080L7399j7195q3617l7089R5214N896k5250
$$ 23257 79155 89378 70202 40000 64080 101479 84284 667 -36422 58792 64688 39438
13933C9438k1569j1851L229j06758k2583K9191J8583Q4725O9832k4311j4278m7474
$$ 39438 17869 6018 9247 -97511 -120094 -90903 -72320 12405 82237 57926 43648 -3826
13921c826j097P5079l6355l6607q104K590O348L0351M1129l6824k6910m7604l0710
$$ -3826 -4923 70156 33801 -2806 -10910 -8320 -1972 28379 69508 32684 5774 -41830 -72540
13908g2540r533q179k4423o513O8463L5405O015L129j1393J2821M5309K1797j8900
$$ -72540 -82073 -90252 -114675 -121188 -52725 -17320 -11305 -8176 -19569 -6748 38561 60358 41458
13895D1458M9488K3401j2039l1100n3957J9070k3251k106k3514J6729K8075K1668
$$ 41458 90946 114347 102308 71208 17251 36321 13070 10964 -12550 4179 32254 53922
13883E3922k7640K542l3492k1985J6829J1496j6438p0999l1205K6881N3143N0831
$$ 53922 26282 28824 -4668 -26653 -9824 1672 -14766 -85765 -116970 -90089 -36946 13885
13871A3885K0439K3888J9044j9124J9740o3626k9128k1453m760J0559K880j442
$$ 13885 34324 58212 77256 58132 77872 14246 -14882 -36335 -41095 -30536 -27656 -29098
13859b9098n0570L1690M9714m8664o0045L8244J9845J6230N0935N630o1783L998
$$ -29098 -79668 -47978 1736 -46928 -106973 -68729 -48884 -32654 18281 23911 -37872 -33874
13847c3874L0405j4847q077R374M7412l4970P845R351N231m7277j5180P5754L0612
$$ -33874 -3469 -18316 -26393 -17019 30393 -4577 3268 12619 17850 -29427 -44607 31147 61759
13834F1759l4781k2652m6680n1095p8122j9395N2138K2819O9788J3524J2359M60
$$ 61759 26978 4326 -42354 -93449 -171571 -190966 -138828 -116009 -46221 -32697 -20338 -19878
13822a9878Q657k9261j1573n987N5112o673n6945k3766J1582J03248P2490m5276
$$ -19878 -11221 -40482 -52055 -58042 -2930 -9603 -66548 -90314 -78732 24516 97006 51730
13810E1730l992K9664O032J5978J8896m1389j7415K1343l6558l6934J7051l3933
$$ 51730 47738 77402 83434 99412 118308 76919 59504 80847 44289 7355 24406 -9527
13798i527j1578K476K690M185M7737J019M20N7693j57k1403K1343m1871r0511
$$ -9527 -21105 -18629 -15939 -11754 35983 37002 37422 95115 94958 73555 94898 53027 -37484
13785c7484L2817N1030P0824j1141q4427j6772M2867J1961m0174MJ9096L0720
$$ -37484 -4667 46363 117187 106046 21619 4847 47714 59675 19501 19505 38601 69321
13773F9321j8475J3421J7529n4827m0199q372o033P128o7923o612L5314J4083
$$ 69321 50846 64267 81796 26969 -13230 -21602 -27635 -20507 -88430 -95042 -59728 -45645
13761d5645K746Q5440N7382o12r0525j6882j0931m1872N0517K8157K607n292O712
$$ -45645 -42899 42541 99923 99311 8786 -8096 -19027 -60899 -10382 17775 20382 15090 21802
13748B1802q604K0042J0961o1657K8684M5483l1077m186M9790L5480L3175k0319
$$ 21802 13198 33240 44201 -17456 11228 56711 25634 21448 71238 106718 139893 119574
13736A19574K5846M8204n0394n5573k4905J2503j8860L2003N8300q3904o9410
$$ 119574 145420 193624 143230 87657 62752 75255 56395 88398 146698 62794 -6616
13725f616j4378J8093M3569Q12K5388j5596o3810j9842P315K4667K129K300j027
$$ -6616 -20994 -2901 40668 41480 66868 51272 -12538 -32380 -25065 -398 1731 4031 3004
13712C004K208n9631l6672j4184M5554M1827K4850l8164m5874Q761j678l0329
$$ 3004 5212 -54419 -91091 -105275 -59721 -17894 6956 -31208 -77082 -68321 -69999 -100328
13700a00328K368L7913J0159J3790K35O1298N4367j1509l5412j6881n8677l7385
$$ -100328 -97960 -60047 -49888 -36098 -35863 25435 79802 68293 32881 16000 -42677 -80062
13688h0062J8040R46M3480K6447l7771J1556q239j2502N1966l3955m4984P5395
$$ -80062 -62022 -61076 -17596 8851 -28920 -17364 -25603 -38105 13861 -20094 -65078 10317
13676A0317j2866M2408m4137j03806l687J06376j997l7736L4499k0544q67o326
$$ 10317 -2549 39859 -4278 -108084 -111771 -5395 -7392 -45128 -10629 -31173 -32040 -38366
13664c8366j1899J727k5622j0038K8071K2078K4202J5284j3507M64o4977J11624
$$ -38366 -50265 -48538 -74160 -84198 -56127 -34049 -9847 5437 -8070 -7606 -72583 39041
13652C9041P5232l114q6613p9283P946K8576n651O1692K8184J9763O068j0787
$$ 39041 114273 111159 24546 -54737 -46791 -18215 -23866 37826 66010 85773 91841 81054
13640H1054l0597n7048L7249L4373l9432r525J6640l3663o1434r427J0298J9985
$$ 81054 50457 -6591 30658 65031 25599 16074 32714 -949 -62383 -71810 -61512 -41527
13628d1527j7303n4380N9387k3994n1133m107P4921P3993J0453q941L1771J1807
$$ -41527 -58830 -113210 -53823 -77817 -128950 -133057 -58136 15857 26310 17369 49140 60947
13616F0947k5673o2281n7407m8660L2239R5684J2166j9713j1251K9175o333k115
$$ 60947 35274 -27007 -84414 -133074 -100835 -5151 7015 -12698 -23949 5226 -1107 -3222
13604c222K5875k1615l2617M2835K587k2310N823J6040j19524l4011L231M0987
$$ -3222 22653 1038 -31579 11256 13843 -8467 -2644 13396 -106128 -140139 -136908 -95921
13592i5921P8905O9756L111m0579K347k0394M7293M7194k0484m1588j5525K4294
$$ -95921 -17016 52740 55851 15272 17619 -2775 44518 91712 71228 29640 14115 38409
13580C8409L5316m5012r1879K5652L3291j3603j4126o502m1939k8892O0804O281
$$ 38409 73725 28713 -63166 -37514 -4223 -17826 -31952 -38454 -80393 -109285 -48481 -42200
13568d2200R942J6557M3678J8331J7003j8540j7499m2854k5715K1524K9757K2145
$$ -42200 -32258 -15701 27977 46308 63311 44771 27272 -15582 -41297 -19773 9984 32129
13556C2129J1030M7069j876q6561q477j8798q9712j2510J35999L6877m0407r654
$$ 32129 43159 90228 88352 1791 -6686 -25484 -115196 -127706 8293 45170 4763 -4891
13544d891M472j5145k1741J7234O404Q0304M5808J4904k2738n636m0558m6465
$$ -4891 -419 -15564 -37305 -20071 -13667 66637 112445 127349 104611 98975 58417 11952
13532A1952k4397L886k9569k7628K7920Q5316L4212n8748p3922L909K3060L4569
$$ 11952 -12445 -8559 -38128 -65756 -37836 47480 81692 22944 -50978 -47069 -24009 10560
13520A0560J1871L132K6681p431j4670J2996O08L9441M7668p8022k1891J0038
$$ 10560 22431 25563 52244 44813 30143 43139 43747 83188 130856 52834 30943 40981
13508D0981j3486J2K3502Q051j6481p0763L7014k42k006L7354N241m5159P515
$$ 40981 27495 27507 51009 59060 42579 -28184 8830 8588 6582 43936 49177 4018 11533
13495A1533Q0206j0997n4633k2325L7956l7126o1263J9483N2908k0637L0147j5803
$$ 11533 91739 80742 26109 3784 41740 4614 -56649 -37166 15742 -4895 25252 9449
13483I449n8313M9566r619m3380k8973J0685l8352P175O6406K1604j805J4825
$$ 9449 -48864 702 -8917 -52297 -81270 -70585 -108937 -101762 -35356 -13752 -15557 -732
13471g32M7840L1371N6807P232r8614m906j1443L1692K7665k9622k6005L0196
$$ -732 47108 78479 135286 142518 43904 38998 27555 59247 86912 57290 31285 61481
13459F1481J4475j6970m7521j1538j784N8854R874l4848o0697j7161J4487L3801
$$ 61481 75956 58986 11465 -73 -1857 56997 66871 32023 -28674 -45835 -31348 2453
13447B453J2056r101n1640K3723L2171l9076o7864K8748L1375L2998L1538L4938
$$ 2453 14509 5408 -46232 -22509 9662 -29414 -97278 -68530 -37155 -4157 27381 62319
13435F2319p485j0626M1005l237n1061j8352p028L3960L056J0012m8386l3912
$$ 62319 54834 44208 85213 81976 30915 12563 5535 39495 42551 52563 4177 -29735
13423b9735R1314P9194K309J7694N926k9620l7998p3814l9278k4468J7080J8940
$$ -29735 61579 140773 143082 160776 166702 137082 99084 25270 -14008 -38476 -21396 -2456
13411b456k0743J2179O802o4N9625J8965j1431n4798m7039j881L4762L1100M5648
$$ -2456 -23199 -11020 -4218 -4282 55343 74308 62877 8079 -38960 -40841 -6079 25021 70669
13398G0669O6212k2307j0933p333n1628n1548m8860R410J7019Q3759L8120M471
$$ 70669 136881 114574 103641 96308 44680 -6868 -55728 -46318 -29299 54460 92580 97051
13386I7051o1565l1118M397L2214j4039J9311M6520J9838r6011m1465L3002P278
$$ 97051 35486 4368 8765 40979 26940 46251 92771 112609 16598 -24867 8135 15413
13374A5413L7590M1966O4567M6177K9701n3784o9138k6285L097m369l0274j4482
$$ 15413 53003 94969 159536 205713 235414 181630 112492 86207 89304 84935 54661 40179
13362D0179N1638k6328k5629M39n890J6071K6438o3850l0252k7450R076N390m6058
$$ 40179 91817 65489 39860 40299 34409 50480 76918 13068 -17184 -44634 -35558 -30168 -76226
13349g6226k2633O0724J01692J5147p9L4735K019k0108j7640n6443p6616J3066
$$ -76226 -98859 -38135 63557 78704 78625 113360 115379 95271 77631 21188 -55428 -42362
13337d2362K128M1755L9801k0653j3036k8820M1134o9709J6049j8981R537k5828
$$ -42362 -40234 1521 41322 20669 7633 -21187 19947 -49762 -33713 -52694 -43157 -68985
13325f8985j2258R619L6945K5530L5937L480K8115O2811k4126l669L3599n8929
$$ -68985 -81243 -71624 -34679 -9149 26788 30268 58383 121194 97068 93399 126998 68069
13313F8069l9989j1235L3686J9142j7073N973p6018m2599J9447O3511J09674L3276
$$ 68069 28080 16845 50531 69673 52600 58573 -17445 -60044 -40597 22914 132588 165864
13301A65864M527l1949n5943q5556l4383O4535J1138K7038O1795L291M439l1516
$$ 165864 170391 138442 82499 -3057 -37440 27095 38233 65271 127066 130357 134796 103280
13289A03280m461l3260m1250m914j0314M1608L6567K7601l3672m6886m2757J4353
$$ 103280 98819 65559 24309 19395 9081 50689 87256 114857 81185 34299 -8458 5895
13277E895L4215n2925m7692O7425K1837k5195o1194m653M7237j324J6321m2139
$$ 5895 40110 -12815 -60507 6918 28755 3560 -57634 -62287 -15050 -16374 -53 -42192
13265d2192L1604J8423M7608L0797M925j9857l7996n0849J8402P7708J6602l56
$$ -42192 -10588 7835 55443 86240 91165 71308 33312 -17537 865 78573 95175 94819
13253I4819k061j3567m239m9341k7135N0441J6223l019n1238n8715p833N959L7917
$$ 94819 92758 79191 74952 25611 -1524 48917 65140 62121 10883 -47832 -55665 -49706 -11789
13240a1789J01829K9566l1568n6313j9454j1532j5095p6873R3565K4167l4331
$$ -11789 90040 119606 88038 31725 12271 739 -14356 -91229 2336 26503 -7828
13229g828k0364J5151J6142J6544N5099j463m9951n9202r282J3866P1294M6897
$$ -7828 -28192 -13041 3101 19645 74744 73281 23330 -35872 -45154 -31288 40006 86903
13217H6903o675k42l4951p951K7404M2144m1998n9102J5038N781j6008J2508m3448
$$ 86903 80228 79986 45035 37084 64488 106632 64634 5532 20570 26351 10343 22851 -20597
13204b0597J5229J3346J7185N0730J6802k6470l8188k3045r667j6283N1716N4845
$$ -20597 -5368 7978 25163 75893 92695 66225 28037 4992 -4675 -20958 30758 85603
13192H5603j3999j7723l473K9138P417k9082n3006M9653Q1950K791m7318l0106
$$ 85603 71604 53881 50408 79546 86963 57881 4875 54528 136478 139269 91951 61845
13180F1845l1108L6327J4932J3915M9986j4037M765q964o7762l2449L3321J4789
$$ 61845 30737 67064 81996 95911 145897 131860 136625 127661 59899 27450 60771 75560
13168G5560R892J5623l6229l0146M2808J2041J2039O250j8044j4165J0717j8268
$$ 75560 85452 101075 64846 34700 77508 89549 101588 107838 89794 75629 86346 68078
13156F8078J2744M3849L665k4323r2718q6916K383K6922N4490M1282l4133j0753
$$ 68078 80822 124671 128336 104013 11295 -75621 -73238 -46316 8174 49456 15323 4570
13144D570L0553L7074N2031J5342j3099J5038L5568j3386n9111j3999j3856M291
$$ 4570 35123 72197 124228 139570 126471 141509 177077 163691 104580 90581 76725 81016
13132H1016K3772p631r156j1952M5368L0737M042l7802m7855m3509o7229K8139
$$ 81016 104788 97157 88001 76049 121417 152154 156196 118394 70539 27030 -40199 -12060
13120a2060N3434p588j9510O5371L8970p142l0310j0086m3637J3506P0431Q952
$$ -12060 41374 33786 14276 79647 118617 111475 81165 71079 27442 40948 111379 120331
13108A20331m5840n5914K0729p865J915N6432k0884n3438l5367k3677J8982P5950
$$ 120331 74491 18577 39306 31441 33356 89788 68904 15466 -19901 -43578 -24596 51354
13096E1354L6629L7931k7558l5206o1781J6012K3280L0258j8395p0582j1260M7256
$$ 51354 87983 125914 98356 63150 1369 17381 40661 70919 52524 -18058 -29318 17938
13084A7938O0182O102K4605q681m2691k1137K209j174j1345N2487L5530L4972
$$ 17938 78120 84222 108827 100146 57455 36318 38527 37353 26008 78495 114025 148997
13072A48997J384O11Q639n7157o8610M5921M75n47R015l8633K5415l4368r151
$$ 148997 150381 150992 159631 102474 33864 79785 80260 79713 88728 50095 75510 41142 31991
13059C1991J9536K0275k0437R207Q2965K8547j8384k3260m1229L8675J7743J344
$$ 31991 51527 71802 51365 60572 143537 172084 153700 130440 89211 127886 145629 146973
13047A46973j7421n277l4293M028J7335M6843R120J1109k834l8783l6373j0965
$$ 146973 129552 124275 89982 94010 111345 158188 167308 178417 175583 136800 100427 89462
13035H9462L946l3163n9872J3643j988j7098M7429Q2674M2994j30296o1692l1840
$$ 89462 93408 60245 373 14016 12028 -5070 42359 125033 168027 37731 -23961 -55801
13023e5801N738P3379p326L4548L6519m9373q479P88k6802J3270J2686N2166l7777
$$ -55801 -50063 23316 15990 50538 87057 37684 29205 29993 3191 16461 29147 81313 43536
13010D3536k5653J9975o638L052M4208M4553K7500j6293L1477M184n1903j1002
$$ 43536 17883 37858 31220 34272 78480 123033 150533 134240 165717 169901 117998 106996
12998A06996j0659l1878L0047K6686n868M8714Q7919M1919o0180m3085M4613K0145
$$ 106996 96337 64459 94506 121192 115324 164038 251957 293876 233696 190611 235224 255369
12986B55369L5649p4810k7499N3734O2994J3740P1901J24444P3595R8220O8186
$$ 255369 291018 216208 188709 242443 305437 319177 391078 515522 589117 687337 755523
12975G55523L7744K1807M4740n2431q4940p5966m3643j4516n3406j9719k9342
$$ 755523 793267 815074 859814 807383 722443 646477 602834 588318 534912 515193 485851
12964D85851k2251L9809K6737L3607K1740k737L8471R6988K168j3108L8374M5497
$$ 485851 463600 503409 530146 563753 585493 582756 621227 718215 720383 707275 745649 791146
12952G91146j6842J03314O2444K5973R684K8373J1631l6209J891k5833n5357k1156
$$ 791146 774304 877618 940062 966035 975719 1004092 1015723 979514 981405 955572 900215 879059
12940H79059K3503L1154o2387p1591j24869j1657R973n1695k3680K2818n836m7267
$$ 879059 902562 933716 871329 799738 674869 663212 673185 621490 597810 620628 614792 567525
12928E67525o0433R1060J6658q661J4277L7655K2822K4660j6017L673J31742Q8387
$$ 567525 507092 598152 614810 606149 620426 658081 680903 705563 689546 693219 824961 913348
12916I13348K3009J9012L935J0913l1676p4907j39414j18684j12548n5443l784
$$ 913348 936357 955369 959304 970217 938541 863634 724220 605536 492988 437545 433761
12905D33761n8486l2941K581R810m4534k5754M018j5556n5970k9060k227M2282
$$ 433761 375275 342334 344915 354725 310191 284437 288455 272899 216929 187869 185642 227924
12893B27924L8385k3196L0378l67j6862l3863k4371o546O372j0808P549L732m0064
$$ 227924 266309 243113 273491 273124 256262 222399 198028 191482 197854 187046 194595 198327 158263
12880A58263m9257K3991P2541K2272q216k7297m0311L592K9070M5718l3385j3676
$$ 158263 109006 132997 205538 227810 219594 192297 151986 155578 184648 230366 196981 183305
12868A83305l4022j2167L4974L0282M3740J8768k4966l0083k1168O051J6190L4033
$$ 183305 149283 137116 172090 202372 246112 264880 239914 209831 188663 194714 210904 244937
12856B44937K2320p7789l6066p926K5221L6025L1517R581m2924r0204l5603j1932
$$ 244937 267257 189468 153402 145476 170697 206722 238239 247820 204896 114692 79089 67157
12844F7157J5749N1110N3336J8092P165k2741K2726K6105J6696k1673j2715M3136
$$ 67157 82906 134016 187352 205444 212609 189868 212594 238699 255395 233722 221007 264143
12832B64143K5255j8623k8212l6520l2781m5286l0281J4457M8968j3415o6136
$$ 264143 289398 270775 242563 206043 173262 127976 97695 112152 161120 147705 81569
12821H1569k4906O8095L6656j351K6477m463K2405m2347O525M535O699J3112K6605
$$ 81569 56663 124758 161414 160063 186540 182077 204482 162135 168660 173195 179894 193006 219611
12808B19611m0209n230K3848N5598J4799n5426q7261n5152k1977k0082M8935O3087
$$ 219611 179402 174172 198020 253618 268417 212991 125730 70578 48601 28519 77454 140541
12796A40541j0457K494L9850L5253m6800n723Q632O0931j6871p5141L0323J9691
$$ 140541 130084 132578 172428 207681 160881 155158 163790 224721 207850 132709 163032 182723
12784A82723M3126J0415Q258n4265J482K3294J692l5040M1294L2660m7855L9566
$$ 182723 225849 236264 244522 190257 191739 215033 216725 181685 222979 255639 207784 247350
12772B47350r784k1074J9209J1000m1642l5679O4409k6816q7196m8336M6954Q7684
$$ 247350 237566 216492 235701 246701 205059 169380 233789 206973 119777 71441 118395 206079
12760B06079P158m435P484M4926J3006L2006L7054m3442J0535M5408L0933m7055
$$ 206079 213237 208802 216286 261212 274218 306224 343278 299836 310371 355779 386712 339657
12748C39657l6953l2238N7497K7389j2027K016m1823r4903L1161N6857J6150J7766
$$ 339657 302704 270466 327963 355352 343325 345341 303518 208615 239776 296633 312783 330549
12736C30549O868M9551J6325m09j3346m7535p850M9646p753l8925j8697J9204
$$ 330549 337417 386968 403293 402884 389538 342003 334153 383799 376046 337121 318424 337628
12724C37628K5586J7118k8751j7724J5084l4898L7882Q4991P970j6046J7342L3691
$$ 337628 363214 380332 351581 333857 348941 314043 351925 436916 444886 428840 446182 479873
12712D79873k3775l8959m5168K7162l3176j9781j6498R155O1739J8425o8818k6987
$$ 479873 456098 417139 371971 399133 365957 346176 329678 338833 400572 418997 350179 323192
12700C23192P5048Q874p4385q9252k3815L1222N6793J6652q27k0906L812J248
$$ 323192 398240 407114 332729 243477 219662 250884 307677 324329 323502 302596 306408 307656
12688C07656l5789j02733L2659L3659l1225k6980O2789M1704K1780P3286k1862
$$ 307656 271867 169134 201793 235452 204227 177247 240036 281740 303520 376806 354944
12677C54944r191k121K2683j8452j7103o9705m4116K2727n635k4043K978j5884
$$ 354944 345753 343632 366315 347863 330760 261055 216939 239666 234031 209988 212966 197082
12665A97082L8287P5401J3856n1229l3100N9628L3510n577J4532r331j793M0112
$$ 197082 235369 310770 324626 273397 240297 299925 333435 327858 342390 333059 331266 371378
12653C71378P7514Q5470O0905Q784M3085O2356J554p5651K3564O3835M703o063
$$ 371378 448892 534362 595267 604051 647136 709492 711046 635395 658959 722794 727497 721434
12641G21434O2778N136m8358o8846K935K3706J5389Q6154K5160o4530J4978M2960
$$ 721434 784212 789348 740990 672144 675079 698785 714174 800328 825488 760958 775936 818896
12629H18896j5013o1868j2775o436O6029J25594P3354P406M5957M8203m9838l1290
$$ 818896 803883 742015 729240 722804 788833 914427 987781 995187 1041144 1089347 1039509 1008219
12617A008219q702K3163M4126N0174N2399N0556J3775M8502J61640J09404J48764
$$ 1008219 999517 1022680 1066806 1116980 1169379 1219935 1233710 1282212 1443852 1553256 1702020
12606A702020J88561J58561J48500J61943J34898J36302O8911n5229j40764j29205
$$ 1702020 1890581 2049142 2197642 2359585 2494483 2630785 2699696 2644467 2503703 2374498
12596B374498j64099j55914r0117l4981n6675q8565q0427K7105l664K2333R664
$$ 2374498 2210399 2054485 1964368 1929387 1872712 1784147 1703720 1730825 1727161 1749494 1759158
12585A759158j0310n1952M4429O5930L3489K4001N6140M4689J0090O4796j2926
$$ 1759158 1748848 1696896 1741325 1807255 1840744 1864745 1920885 1965574 1975664 2040460 2027534
12574B027534J2037M1228Q1816N6705K1936K1570M1964R9801Q2567J3994N6982
$$ 2027534 2039571 2080799 2162615 2219320 2241256 2262826 2304790 2404591 2487158 2501152 2558134
12563B558134J35413J21343M7389R8444J63806J48432J58500J45318J41469J35503
$$ 2558134 2693547 2814890 2862279 2960723 3124529 3272961 3431461 3576779 3718248 3853751
12553C853751J94858K55521K89664L72340L61238M23898N06305O28943P29348
$$ 3853751 4048609 4304130 4593794 4966134 5327372 5751270 6257575 6886518 7615866
12544G615866Q80344J075758J296438J542724J753240J914367K009754K292598
$$ 7615866 8496210 9571968 10868406 12411130 14164370 16078737 18088491 20381089
12536B0381089K687035L203532M282318N854116Q265218J1511034J5411064J9006963
$$ 20381089 23068124 26271656 30553974 36408090 44673308 56184342 71595406 90602369
12528I0602369K0840173J9618509J5451137R053234O03384q748903j5672201j7834499
$$ 90602369 111442542 131061051 146512188 155565422 156168806 147419903 131747702 113913203
12520A13913203j6086852j2454133q734826n589533k970391r69919P64533K401063
$$ 113913203 97826351 85372218 76637392 71047859 68077468 67107549 67872082 70273145
12512G0273145L879239M957541N950860O470111O612456O508066O125656N911432
$$ 70273145 74152384 79109925 85060785 91530896 98143352 104651418 110777074 116688506
12504A16688506O028972O514502P193211P840068Q283105Q063384P230396N454598
$$ 116688506 122717478 129231980 136425191 144265259 152548364 160611748 167842144 173296742
12496A73296742K987478K35810k540412m865597o419963p040276p023070o561009
$$ 173296742 176284220 176520030 173979618 169114021 162694058 155653782 148630712 142069703
12488A42069703n766592n040538m510462m304704m319402m610754m891851n058546
$$ 142069703 136303111 131262573 126752111 122447407 118128005 113517251 108625400 103566854
12480A03566854n106780m813365m153049l222665j970204l54372J858344M608376
$$ 103566854 98460074 93646709 89493660 86270995 84300791 83946419 85804763 90413139
12472I0413139Q078474J1934419J5504733J7576335J6964740J2995676O616496
$$ 90413139 98491613 110426032 125930765 143507100 160471840 173467516 180084012
12465A80084012j353426j0125693j7529365k1042488k0041922j6758733j3125008
$$ 180084012 178730586 168604893 151075528 130033040 109991118 93232385 80107377
12458H0107377j0085594p835770o166046m922306m026390l278962k782775k438940
$$ 80107377 70021783 62186013 56019967 51097661 47071271 43792309 41009534 38570594
12450C8570594k095584j935775j780168j673351j570654j443097j350261j191548
$$ 38570594 36475010 34539235 32759067 31085716 29515062 28071965 26721704 25530156
12442B5530156j060960j035813r44345q72299p92767p36525p30475o80983n92351
$$ 25530156 24469196 23433383 22489038 21616739 20823972 20087447 19356972 18675989 18083638
12433A8083638o42980n79675m82724n16004n75174m88127m50868m30293m65991
$$ 18083638 17440658 16860983 16378259 15862255 15287081 14798954 14348086 13917793 13451802
12424A3451802m86040m74604l88293l80610m05581m50526l71032l69796l32023
$$ 13451802 12965762 12491158 12102865 11722255 11316674 10866148 10495116 10125320 9793297
12415I793297l00446k86023k19786k52848l29068k65291k74185j80801j63874
$$ 9793297 9492851 9206828 8987042 8734194 8405126 8139835 7865650 7684849 7520975
12406G520975k22132k08006k99145j92554j38990k28701j67842j30437j83948
$$ 7520975 7298843 7090837 6791692 6599138 6460148 6231447 6063605 5933168 5749220
12397E749220k22499j79715j77890j24588j23210j41680k01201k09718j58154
$$ 5749220 5526721 5347006 5169116 5044528 4921318 4779638 4578437 4368719 4210565
12388D210565j32984j59145j52428p1267r3069j76806j40300j25609o6272n3008
$$ 4210565 4077581 3918436 3766008 3694741 3601672 3424866 3284566 3158957 3092685 3039677
12378C039677r4358k5989m8038n0423p4978r8221q1518o1858o3807m1200j7612
$$ 3039677 2945319 2919330 2871292 2820869 2745891 2647670 2566152 2504294 2440487 2399287 2381675
12367B381675o041m1325n2038r5571q3158o5751n7974j3191L5925m4475l4046
$$ 2381675 2375634 2334309 2282271 2186700 2103542 2037791 1979817 1966626 2002551 1958076 1924030
12356A924030l4232k4635o8855o4231q376l0097k8028n6517l3500J1481o8288
$$ 1924030 1889798 1865163 1796308 1732077 1723701 1693604 1665576 1609059 1575559 1587040 1518752
12345A518752r3619o8980o5105L7626L1610O1940J0621j5039q755m8874k5536
$$ 1518752 1425133 1356153 1291048 1328674 1360284 1422224 1432845 1417806 1409051 1360177 1334641
12334A334641q393l2700K923N5336J3884l3137j0182N5303R9297L6634J7070j0637
$$ 1334641 1326248 1293548 1296471 1351807 1365691 1332554 1322372 1377675 1476972 1513606 1530676 1520039
12322A520039p66p662J9087P7625J14332J40854K06660K61506L98573N22779O72592
$$ 1520039 1519273 1511611 1530698 1608323 1722655 1863509 2070169 2331675 2730248 3253027 3925619
12311C925619P55312Q74520Q30783Q29084P14425N09810J80908j72223l82388
$$ 3925619 4680931 5555451 6386234 7215318 7929743 8439553 8620461 8448238 8065850
12302H065850n27773p34259r34771q37963o80548n02498m25707k55758k32252
$$ 8065850 7538077 6803818 5869047 5031084 4350536 3848038 3422331 3166573 2934321
12293B934321k51812j76082p3525o1169n5972o4833n9492q0469j71952j27653
$$ 2934321 2682509 2506427 2432902 2371733 2315761 2250928 2191436 2110967 1939015 1811362
12283A811362o4621n5271k8127j4306K3603J0112j9853m5015m3324k6763J8439
$$ 1811362 1746741 1691470 1663343 1649037 1672640 1682752 1662899 1617884 1574560 1547797 1566236
12272A566236J7490J9877M797L2k6742o9233l8388Q799j7536j8850k742L9189
$$ 1566236 1583726 1603603 1608400 1608432 1581690 1512457 1474069 1482868 1465332 1446482 1443740 1482929
12260A482929O703r7040n4442j6433L4505L5641k9596j2324O987N291j164N3819
$$ 1482929 1489632 1392592 1338150 1321717 1356222 1391863 1362267 1349943 1356930 1362221 1361057 1414876
12248A414876N0711L4737m1112k4633O750m0317q9021j6889P0333M7298O5641
$$ 1414876 1465587 1500324 1459212 1434579 1441329 1401012 1311991 1295102 1365435 1412733 1478374
12237A478374J18707k906J3949M5358L4207O2040K1138N7884L2803m30L4246M3334
$$ 1478374 1597081 1594175 1608124 1653482 1687689 1749729 1770867 1828751 1861554 1861124 1895370 1938704
12225A938704Q9965N8678Q6829J07164J14522J23011J20657J54347J18227J70350
$$ 1938704 2028669 2087347 2174176 2281340 2395862 2518873 2639530 2793877 2912104 3082454
12215C082454K06544J78594J71778K13613K98130L40160L94119M56836M50777
$$ 3082454 3288998 3467592 3639370 3852983 4151113 4491273 4885392 5342228 5793005
12206E793005O66641Q21183J094122J306194J455686J650300J889691K069180
$$ 5793005 6459646 7280829 8374951 9681145 11136831 12787131 14676822 16746002
12198A6746002K117479K224952K499508K908439L581778N065630P520796J1104088
$$ 16746002 18863481 21088433 23587941 26496380 30078158 35143788 42664584 53768672
12190E3768672J5888673K1391700K7062462L2191892L5298799L4859682L0499203
$$ 53768672 69657345 91049045 118111507 150303399 185602198 220461880 250961083
12183B50961083K2576456J1930866m86723j2758680k2915145k9747413l2668540
$$ 250961083 273537539 285468405 284981682 272223002 249307857 219560444 186891904
12176A86891904l1715105k8053779k2975303j7429562j2253934q552562o084370
$$ 186891904 155176799 127123020 104147717 86718155 74464221 65911659 59827289
12169E9827289m540329l656859l231783k893759k785470k704037k641854k569959
$$ 59827289 55286960 51630101 48398318 45504559 42719089 40015052 37373198 34803239
12161C4803239k425125k152572j952693j713303j464120j343816j259767j030122
$$ 34803239 32378114 30225542 28272849 26559546 25095426 23751610 22491843 21461721
12153B1461721r53068q95811p66847p44883o67508o45244n85190n16110n08118
$$ 21461721 20508653 19612842 18845995 18101112 17433604 16788360 16203170 15687060 15178942
12144A5178942n52329n58757m96850m55248n00176m30942m24114m33375m34799
$$ 15178942 14626613 14067856 13571006 13115758 12615582 12184640 11760526 11327151 10892352
12135A0892352l84214l75078l68999l67303l41402k31368k84247l46634k54893
$$ 10892352 10508138 10133060 9764061 9396758 9055356 8823988 8539741 8193107 7938214
12126G938214k24178k26017j38408k30966k60120k72483k39678j23307j56046
$$ 7938214 7714036 7488019 7349611 7118645 6858525 6586042 6346364 6223057 6067011
12117F067011j30018k07730k42139k03591r6345r6459r1834j64795j78076j18003
$$ 6067011 5936993 5729263 5487124 5283533 5187188 5090729 4998895 4834100 4656024 4538021
12107D538021o5650j26505j41290j69426j11476o6896j19825j46281p8594r1180
$$ 4538021 4472371 4345866 4204576 4035150 3923674 3856778 3736953 3590672 3512078 3420898
12097C420898j08588p7826n9016o5921m5894q5460j26468o2485r1932p7387l6153
$$ 3420898 3312310 3234484 3175468 3109547 3063653 2978193 2851725 2789240 2697308 2619921 2583768
12086B583768m6580k2814n5387k2750p9538q4830l7159r3735p5752K7585j21249
$$ 2583768 2537188 2514374 2458987 2436237 2356699 2271869 2234710 2140975 2065223 2092808 1971559
12075A971559j10426m7132o5916M2475M8131q425j7811m0156p5534r0387j00747
$$ 1971559 1861133 1814001 1748085 1790560 1838691 1830266 1812455 1772299 1696765 1606378 1505631
12064A505631j26775j09593q7303j08091o9736j2907O2419Q3680q017M631j3984
$$ 1505631 1378856 1269263 1181960 1073869 1004133 991226 1053645 1137325 1129308 1133939 1119955
12053A119955N5001K9943j1789L5668K0370j01321M0032o031N5884M4600M8420
$$ 1119955 1174956 1204899 1193110 1228778 1249148 1147827 1187859 1181828 1237712 1282312 1330732
12042A330732M0335r731j7751j6112K0309m0091n3919K3899L468l3788j7348p9401
$$ 1330732 1371067 1361336 1343585 1327473 1347782 1307691 1253772 1277671 1281139 1247351 1230003 1150602
12030A150602k2747k9268r6247n8761k6203k1258L882L6438J5277p488o945j489
$$ 1150602 1127855 1098587 1002340 943579 917376 896118 900000 936438 951715 944227 937282 935793
12018I35793j478r371L3085J43458N4056N7736J26636N6513k3290P225K3344l2401
$$ 935793 934315 924944 958029 1101487 1155543 1213279 1339915 1396428 1373138 1380363 1403707 1371306
12006A371306p5994r2815j35557j44689p9479n5770p2041l5365m7502n1545K787
$$ 1371306 1295312 1202497 1066940 922251 842772 787002 714961 679596 632094 580549 583336
11995E83336l2527n4294p9897O6112K6812r421Q073Q127n1010j9044m0250N3937
$$ 583336 550809 496515 416618 482730 509542 500121 508194 516321 465311 446267 406017 459954
11983D59954r353k6458l610r204k0147j56K3945P4057o6258m1261j0642J6703
$$ 459954 450601 424143 420533 411329 391182 391026 414971 489028 422770 381509 370867 387570
11971C87570O6020J9593j4528M6245n8101q7041n1515j0278R946J5570N146q026
$$ 387570 453590 473183 458655 504900 446799 359758 308243 297965 307911 323481 328627 320601
11959C20601J497n7973j3740q0J090M024K0453m913m6437L7666Q824q874O3493
$$ 320601 322098 264125 250385 250305 251395 255419 275872 270959 224522 262188 271012 262138 325631
11946C25631m75p2266m2670p4M0090m5639J0397L5144r571k8013j3726m1122p555
$$ 325631 325156 252890 210220 210146 250236 204597 214994 250138 240567 212554 198828 157706 150151
11933A50151J4201O383l6760J189K25K4565J7322N8617k9401k7413q9437l3657
$$ 150151 164352 170735 133975 135164 135389 159954 177276 235893 206492 179079 89642 55985
11921E5985J6205k5772l2480n452J7626N3980K4992j946K3510k0132j3655o4064
$$ 55985 72190 46418 13938 8486 26112 80092 105084 103138 126648 106516 92861 28797
11909B8797K5418J5132k8951K5133k7649n5352K9268n443R546K8792k1844J9075
$$ 28797 54215 69347 40396 65529 37880 -17472 11796 6353 15899 44691 22847 41922
11897D1922M5545k7559K419j9260N428Q44j4965M4505l545J782K0169M7332j6643
$$ 41922 87467 59908 62327 43067 48495 49339 34374 78879 75334 77116 97285 144617 127974
11884A27974k5318L2152L5498k314J0080l5655r299q193p5937r905L0795m4620
$$ 127974 102656 134808 170306 167992 178072 142417 133118 124925 48988 39083 69878 25258
11872B5258L838J8283L7569K8726m2029p1638m4812N0138P2852L914j0694O46
$$ 25258 29096 47379 84948 113674 71645 7 -44805 5333 78185 82099 71405 72051
11860G2051l4628l1737o5779k7917O3918P5547K0349k7682L3573j7028m0883J2270
$$ 72051 37423 5686 -60093 -88010 -24092 51455 71804 44122 77695 60667 19784 32054
11848C2054O883N012K2501j2033l5173K2391r41J1178L8126M764o2081L5934K1703
$$ 32054 38937 43949 66450 54417 19244 41635 40694 51872 89998 94762 32681 68615 90318
11835I0318l1757o040m460l352l9426k7711K4696J9072N2353j9700j4705j3624
$$ 90318 58561 52521 48061 44709 5283 -22428 2268 21340 73693 53993 39288 25664
11823B5664M2233L0556J048k7335K244o3813Q353K2956k9437l3202K8448J734
$$ 25664 67897 98453 99501 72166 74410 10597 18950 41906 12469 -20733 7715 9449
11811I449O0617L2782j9145J9647l1668n1311K4793L1297k1262m7517O0968O818
$$ 9449 70066 102848 83703 103350 71682 20371 45164 76461 55199 7682 68650 75468
11799G5468j9102k5915k2997L0330M4292O671k8298j4865m265N466j4085m1644
$$ 75468 56366 30451 7454 37784 82076 88747 60449 45584 41319 46785 32700 -8944
11787h944m6956J3276L1711m1995M1422K4456M648L3997K3860k0780P0418O1161
$$ -8944 -55900 -42624 -10913 -52908 -11486 12970 17618 51615 75475 54695 125113 186274
11775A86274m0436n96m6876j3569P6878N3479J6543O004K7478J9373N3299Q7927
$$ 186274 145838 145242 98366 84797 161675 215154 231697 237701 265179 284552 337851 425778
11763D25778J07407J25527J75876K25871J92249R6463J09514k0574m0229l5643
$$ 425778 533185 658712 834588 1060459 1252708 1349171 1458685 1438111 1397882 1362239
11753A362239j33992j14215j23766k00992j48693j00757q4676m4159n37r2146
$$ 1362239 1228247 1114032 990266 789274 640581 539824 455148 410989 410452 318306
11743C18306l1482M1479n7281J0334q856q9694k2827j7371l8656o3334k8424k4072
$$ 318306 286824 328303 271022 281356 272500 182806 159979 142608 103952 40618 12194 -11878
11731a1878M0193N9684K9897p281K9323k9021l7405L2956o527K7325k0416k6586
$$ -11878 28315 87999 117896 110615 139938 110917 73512 106468 99941 127266 106850 80264
11719H0264m5149q2034m0026L2092R8582j0603J6996M4981J3128p114m3755m6452
$$ 80264 35115 -46919 -86945 -54853 43729 33126 50122 95103 108231 101117 57362 10910
11707A0910L7244M0293m647p231J7768l6226j4395k1009M7819k2883l6415M9410
$$ 10910 48154 88447 83800 76569 94337 58111 43716 22707 70526 47643 11228 60638
11695F0638O9668k0868m4102o5612k9652M2059O7571L0368Q873p3301n6311l148
$$ 60638 130306 109438 65336 -276 -29928 12131 79702 110070 118943 45642 -10669 -13817
11683a3817K936K5425K6507L831j9211j15J7539K0223L7624K0536J6553k0400
$$ -13817 -10881 14544 41051 44882 25671 25556 43095 63318 100942 121478 138031 117631
11671A17631J1283k6318l1405O4593J0535p9789n1575K267n910N8477l2237J0695
$$ 117631 128914 102596 71191 135784 146319 66530 14955 17222 11312 69789 37552 48247
11659D8247O8968j5200k6531P429l6618k8545M7696K5161J6211n2878n401j040
$$ 48247 117215 102015 75484 82913 46295 17750 65446 90607 106818 53940 48539 47499
11647D7499K0442P598k1800n5787m2949l9595P4274K7115K7826L6604J0562j570
$$ 47499 67941 75539 53739 -2048 -44997 -84592 -10318 16797 44623 81227 91789 90219
11635I0219J602m7098p2417K6459j6038n2356K9124R4587M3450M0138N545p9219
$$ 90219 91821 44723 -27694 -1235 -17273 -69629 -40505 54082 97532 137670 143215 63996
11623F3996k1851L4511l2385J1996j539L365P7k5236O224K4966o240m4808K6478
$$ 63996 42145 76656 44271 56267 54728 58093 58170 32934 39158 64124 57884 13076 39554
11610C9554j1469K4496j3853J293N2988j1545m53j5913j7089L520M0585n759l5561
$$ 39554 28085 52581 38728 40021 93009 81464 81011 65098 48009 51529 92114 86355 50794
11597E0794n1825o8563m9750j0698N9107N0888L9512J2458M117k7138J932K8365
$$ 50794 -1031 -69594 -119344 -130042 -70935 -20047 19465 31923 36040 8902 10834 39199
11585C9199J3715n9845m2013J7883J8396K0584j2640j0435M774R1213K9295k5762
$$ 39199 52914 -6931 -48944 -31061 -12665 7919 -4721 -15156 -10382 80831 110126 84364
11573H4364l2216k6886N8403L901n9746j5999J623N0346j4060o3812k3883M9366
$$ 84364 52148 25262 83665 87566 27820 11821 13444 63790 49730 -14082 -37965 11401
11561A1401m4102m0577M3139N6648m0804R722l3076O6056j2533k7604k4342L972
$$ 11401 -32701 -73278 -30139 26509 -14295 -4573 -37649 28407 15874 -11730 -36072 -32100
11549c2100K5105N6009M3203k1095k0184n0807M5270K3414j9350L352K8915k6048
$$ -32100 -6995 49014 92217 71122 50938 131 45401 68815 49465 52817 81732 55684
11537E5684p7233K015L8430m1238j5884J1473L113Q089L6608K1702Q377M92L9414
$$ 55684 -21549 -19534 18896 -22342 -38226 -26753 -23640 -15551 21057 42759 51136 51628 91042
11524I1042N1966l3827p3287n2203l4463N1399O1456l4564O7356R653o8594N710
$$ 91042 143008 109181 35894 -16309 -50772 627 62083 27519 94875 104528 35934 41644
11512D1644l4052n4567M9352l0495m5564K2468J2617L4041Q1776k6525k2755M9239
$$ 41644 7592 -46975 2377 -28118 -73682 -51214 -38597 -4556 77220 50695 27940 77179
11500G7179k0458r3067j06708P1629N9361k4673P2015J5944J1887K3042m9299
$$ 77179 56721 -36346 -143054 -71425 -12064 -36737 35278 51222 63109 86151 36852
11489C6852L0872J6121J8737j8121m1375J8988N7312K3908J100m7270o9145l5007
$$ 36852 67724 83845 102582 84461 43086 62074 119386 143294 144394 97124 27979 -7028
11477g028r411k6419K8722R3899j980J2603J0443l690n2529n0880m7618K6653
$$ -7028 -16439 -42858 -14136 79763 77783 90386 100829 97139 44610 -6270 -53888 -27235
11465b7235L2300m1472k778N5316n8437M0404O986J4832R696j6065j4175Q877
$$ -27235 5065 -36407 -39185 16131 -42306 -1902 5084 19916 29612 13547 -628 8249
11453H249N3727k8650p3151M4682k5101J25R175k7392O3947O1451K7202k8060
$$ 8249 61976 33326 -39825 4857 -20244 -20119 -10944 -38336 25611 87062 114264 86204
11441H6204l8035O560j9308j5531j4752k9269O110J4722R680l3116K6795N7160
$$ 86204 48169 54729 35421 19890 5138 -24131 -18021 -3299 6381 -26735 60 57220
11429E7220K841j3282m3294k471P544N984M0460j9767j7612Q953N2202P6985J5444
$$ 57220 60061 46779 3485 1014 8558 14542 55002 35235 17623 26576 78778 155763 171207
11416A71207n4780p4290p437O4318J7699P2118m6132J6232N694m5385n3934o338
$$ 171207 116427 42137 34700 99018 116717 188835 142703 158935 164629 119244 65310 58972
11404E8972l9222n4517N897M8938l99M4231O3085l2963r1960n6878O6534J0692
$$ 58972 19750 -34767 -28870 20068 19669 63900 126985 94022 2062 -54816 11718 22410
11392B2410j2042p4549Q733M3368L9313L1016O0687k1169n1057m5575n197O26
$$ 22410 10368 -64181 -55448 -12080 27233 58249 118936 97767 46710 1135 -4062 -3436
11380c436K248m9419p9756o2446J25462N9310P249l3741L0637L7510r318m7865
$$ -3436 -1188 -50607 -130363 -192809 -67347 -8037 -788 -34529 -3892 33618 24300 -23565
11368b3565n5086K4715k2270k8895J6662Q2121K8857j2574l4946o404Q4249O3574
$$ -23565 -78651 -53936 -76206 -105101 -88439 -6318 22539 9965 -24981 -31385 52864 116438
11356A16438n4488q8833k2514N192L9818n834k8138R017K3026M338J3001M2496
$$ 116438 61950 -26883 -49397 -44205 -4387 -10221 -38359 -29342 -6316 -1978 11023 53519
11344E3519K4797J4772k1931n700l643l9809k5559j512n4196r458Q7930R7670
$$ 53519 78316 93088 71157 65457 61814 22005 -3554 -5066 -59262 -68720 19210 116880
11332A16880j5921j30910l6716R683O7952P3297K1226M9274k5733j16780m5677
$$ 116880 100959 -29951 -66667 -56984 10968 84265 105491 154765 129032 12252 -33425
11321c3425J422J3451O2987K0640J0365m883n8735J7293O8274k4232p5494L671
$$ -33425 -32003 -18552 44435 65075 75440 70557 11822 29115 97389 73157 -2337 1334
11309A334J6515n5118j7490Q6301J8677j4394K625J5574l3865k840O6886l8904
$$ 1334 17849 -37269 -54759 31542 50219 35825 38450 54024 20159 17319 84205 45301
11297D5301L0904m4802j8991Q7942K0090K6648m084n7866m7639k2808k9052L3428
$$ 45301 76205 31403 12412 100354 120444 147092 143008 85142 37503 14695 -14357 19071
11285A9071j898L4638O6965m0343J7079K7825l036j8962m2279M0320K4095l1600
$$ 19071 17173 51811 118776 78433 95512 123337 120301 101339 59060 99380 123475 91875
11273I1875k1821j9259J6310l9236q0373J6377J02444M9977l2234k8066J3787
$$ 91875 70054 50795 67105 27869 -52504 -36127 66317 116294 84060 55994 69781
11262F9781k4434l1611j8275J5024M9107j5513j7255K0892M229l3148n855j4983
$$ 69781 45347 13736 -4539 10485 59592 44079 26824 47716 51945 18797 12942 -2041
11250b041l9943J7062K4647K4601K6983j9830p1941M6025P2087n139j1207j6609
$$ -2041 -41984 -24922 -275 24326 51309 31479 -40462 5563 77650 72511 61304 44695
11238D4695j556k1036j1453O6298k9064l9957l8970j9694K7976N5500M0775J4638
$$ 44695 43139 22103 10650 76948 47884 7927 -31043 -50737 -22761 32739 73514 88152
11226H8152k5557j6015k1132K4694N761P8194M1502m003J9022k66O7578J4683
$$ 88152 62595 46580 25448 50142 55903 134097 175599 171596 190618 190352 257930 272613
11214B72613r2422o6737j7954n6838l5470k684M7930L8760K8204j2730j0606k3691
$$ 272613 180191 113454 95500 38662 3192 508 48438 87198 115402 102672 92066 68375
11202F8375N2048k2329o5144n7880k804j5599j1315Q785q795k0789p0M2791L2473
$$ 68375 120423 98094 32950 -24930 -27734 -43333 -54648 -45863 -54658 -75447 -75517 -32726 -253
11189b53o105k641J350K4504M6049J6662n299l0645j7641o5272K6137R7239O135
$$ -253 -6358 -8999 -7649 16855 62904 79566 74267 43622 25981 -39291 -13154 84085 90220
11176I0220l9192N36J3696L5966K9560M978j3186m6589o1977N0628M8257j3642
$$ 90220 51028 51564 65260 101226 130786 135764 122578 75989 14012 64640 112897 99255
11164I9255j6880n531Q544L0232M4372M208l5858n6077m7273J4705K2979O2950
$$ 99255 82375 76844 85388 115620 159992 164200 128342 72265 24992 39697 62676 125626
11152A25626J8498n0110J7782J1963l0895k9945N992L529M6259j939r535l4968
$$ 125626 144124 94014 111796 123759 92864 62919 68911 72440 118699 116760 107225 72257
11140G2257l9554Q3438J9217n1778N9112Q169o0089m9948J578K9157L8186K0913
$$ 72257 32703 116141 135358 83580 142692 150861 90772 40824 42402 71559 109745 130658
11128A30658k2144j83m5231k911n0519j199O49k0585K2144q999K7272P1769J2720
$$ 130658 108514 108331 63100 60189 9670 8471 9120 -11465 10679 1680 28952 100721 113441
11115A13441l1834m3152o9915M1462L0771L9973J9829r109j8849J0154K3493K0694
$$ 113441 81607 38455 -31460 10002 40773 80746 100575 91466 72617 82771 106264 126958
11103A26958M5314L7195j1809r231l6022l7687l5669j596L233K6370K9703l1243
$$ 126958 172272 209467 197658 188427 152405 114718 79049 77453 80686 107056 136759 105516
11091A05516j9267l2091L115N1932K8229J3206j049n3342m964k917l2595j1443
$$ 105516 86249 54158 57273 109205 137434 150640 149591 96249 91285 88368 55773 44330
11079D4330p586K3457K7125K9578J8475k4505j6442K5818M7761J6565o2211L8092
$$ 44330 36744 60201 87326 116904 135379 110874 94432 120250 168011 184576 122365 160457
11067A60457M7524K0993l8089q096P6316k0789j6868J0282J3723m0949L9971J4197
$$ 160457 207981 228974 190885 182789 259105 238316 221448 231730 245453 204504 244475 258672
11055B58672M975n415K4497r223M5102Q1905O8967J30271J06986L6799o981L3022
$$ 258672 263647 258232 282729 273506 318608 400513 469480 599751 706737 743536 736555 769577
11043G69577j1034k8580L5108k800q81o2509l6839l5769m8258j9353J8065l514
$$ 769577 758543 729963 765071 762271 761390 698881 662042 626273 578015 558662 576727 573213
11031E73213P714L3005J9814M2205R1909P8494M09p0644o5587k1089l7662O7845
$$ 573213 580927 613932 633746 675951 767860 846354 846763 776119 710532 689443 651781 719626
11019G19626J15238M7469N7366R163P683O2391K8892n8737p1814q7165j9984P17
$$ 719626 834864 882333 939699 948862 956545 1018936 1047828 989091 917277 830112 810128 810845
11007H10845Q727L3269n5394P1932k2178k5233n2150j25073p7069R584q383p8161
$$ 810845 819572 852841 797447 869379 847201 821968 769818 644745 567676 577260 568877 490716
10995D90716R923k2463j3047N3751Q3084J23171M8790l463k348M7928O0787N9689
$$ 490716 500639 478176 465129 518880 601964 725135 773925 770462 768114 816042 876829 936518
10983I36518n8144o3401j15656p9684O520o4408j4427k0381l3853q2474N710O7373
$$ 936518 878374 814973 699317 619633 626153 561745 547318 526937 493084 410610 416320 483693
10971D83693l8124n1772J2615L5162k9819p4572n9185J7972n1716p9282K1787
$$ 483693 445569 393797 406412 441574 411755 337183 277998 295970 244254 164972 186759
10960A86759K8352K6859K7516K5338k7955k4121j6280K189j2834m2529P5155Q4360
$$ 186759 215111 241970 269486 294824 266869 242748 226468 228657 215823 173294 248449 332809
10948C32809l1382o6859k0072O0088L9185j48j1360n6441l3640J1677J9805j7885
$$ 332809 301427 234568 214496 274584 313769 313621 302261 245820 212180 223857 243662 225777
10936B25777J5619j7135l1293l3441n5416K1906P1914l255j7304k4894k0847k7200
$$ 225777 241396 224261 192968 159527 104111 126017 197931 194676 177372 152478 131631 104431
10924A04431j9665L2017l5810m5447O081O0758O420k7310O0622J1011J5493k0808
$$ 104431 84766 116783 80973 35526 41607 102365 108785 81475 142097 153108 168601 147793
10912A47793l6607Q0829Q0591O6940j1084j5165p4225r6563P356K6541R697n8841
$$ 147793 111186 192015 272606 339546 328462 313297 239072 142509 149865 176406 186103 127262
10900A27262p388N3571J614K7111l4874L542O7523L8616o2542K2051j1496K3293
$$ 127262 119874 173445 175059 202170 167296 170838 238361 276977 214435 236486 224990 248283
10888B48283M2923j4035j4602J8062J555Q299j9625O5643L420r717p173n5963
$$ 248283 291206 277171 262569 280631 282186 290485 270860 336503 339923 330206 323033 267070
10876B67070j2054m0057J4607K3943K7816o967m5124j468N4873M5546j4541j7605
$$ 267070 255016 214959 229566 253509 281325 274358 229234 227766 282639 328185 313644 296039
10864B96039m1572J8418J6878o6218q104K5948L1238j34O5175M7190L4079K4402
$$ 296039 254467 272885 289763 223545 215441 241389 272627 272493 337668 384858 418937 443339
10852D43339L3006l5445n0548m2295k1201n0120j8142K8178M2708N640K9043n2061
$$ 443339 476345 440900 390352 348057 326856 276736 258594 286772 329480 335120 364163 312102
10840C12102o2366K1643J9416k3407L969K4469J8445n793l000K4964k4748j5999
$$ 312102 249736 271379 290795 267388 271357 295826 314271 308478 305478 330442 305694 289695
10828B89695L5860N0303J6070l4886j9486J3650m231k9559L8553N6875m2593k1718
$$ 289695 325555 375858 391928 357042 337556 351206 346975 317416 355969 412844 370251 348533
10816C48533M851j4781k2201L6199M7827N2431L7955k2576o5826q6984n2793K3189
$$ 348533 353384 338603 316402 352601 400428 452859 490814 468238 402412 315428 262635 285824
10804B85824k6897J2605J5138P348o4931J899K8838k5448L4932P0493J9619J1705
$$ 285824 258927 271532 286670 294018 229087 230986 259824 234376 269308 339801 359420 371125
10792C71125K8708l012q3580Q947K7575j9278J1463M414k1434n601j9520K3958
$$ 371125 399833 396821 313241 322188 349763 330485 341948 346362 324928 319327 299807 323765
10780C23765N918p335n845m5178J1605k839K0128j5280J9736P3582k3425k0653
$$ 323765 329683 322348 316503 271325 282930 280091 300219 284939 304675 378257 354832 334179
10768C34179L1179P2609O0408k1690n3070M262K6279M1579j0715l0689m8566k6559
$$ 334179 365358 437967 498375 476685 423615 427877 454156 495735 485020 454331 405765 379206
10756C79206p495J9431P1640O4103J15691J17245P7268k9932n2080K2739Q8101
$$ 379206 371711 391142 462782 526885 642576 759821 837089 807157 755077 777816 865917
10745H65917N8417p981j6468N1921P9911M2411K727N412J5338j7127k7246L755
$$ 865917 924334 916353 899885 951806 1031717 1074128 1076855 1082267 1097605 1080478 1053232 1056987
10733A056987K2202J5824K4644K1273o4054p0119j2060J5111L3412l1086M782
$$ 1056987 1079189 1095013 1119657 1140930 1076876 1006757 994697 1009808 1043220 1012134 1016916
10722A016916L7089k3938J9748M2307J1416O3361R1713L6757n4141J2157O8205
$$ 1016916 1054005 1030067 1049815 1092122 1103538 1166899 1258612 1295369 1241228 1253385 1321590
10711A321590O3745k6838r28N870j3576P4192K4509K279K4010J4778N1919p966
$$ 1321590 1385335 1358497 1357569 1363439 1349863 1424055 1448564 1450843 1474853 1489631 1541550 1533584
10699A533584k469M748L9903O1054K4811L8736N9644J6318j2823j361K0344M6287
$$ 1533584 1531115 1535863 1575766 1636820 1661631 1700367 1760011 1776329 1763506 1762145 1782489 1828776
10687A828776L3114R8777L2088L7809O8210M8948M1674m193P2713Q5770P2123
$$ 1828776 1861890 1960667 1992755 2030564 2098774 2147722 2189396 2185203 2257916 2343686 2415809
10676B415809N4503J20814P1182L5809R3816J28498J05224N8544N4863Q0508J14582
$$ 2415809 2470312 2591126 2662308 2698117 2791933 2920431 3025655 3084199 3139062 3219570 3334152
10665C334152J04080J87427J87281J40289J90710K09108J39380J94927K00252
$$ 3334152 3438232 3625659 3812940 3953229 4143939 4353047 4492427 4687354 4887606
10656D887606K75862L21000L52624L72904L73577M02204N05007N38368O43211
$$ 4887606 5163468 5484468 5837092 6209996 6583573 6985777 7490784 8029152 8672363
10647H672363P90630R03051J067995J227494J448723J719594K002724K212496
$$ 8672363 9462993 10366044 11434039 12661533 14110256 15829850 17832574 20045070
10639B0045070K676665L247452L764497M510729N553540O913004Q750464J1004237
$$ 20045070 22721735 25969187 29733684 34244413 39797953 46710957 55461421 66465658
10631F6465658J3350926J5147993J5575277J4160291J0987580O030219R0425n646952
$$ 66465658 79816584 94964577 110539854 124700145 135687725 141717944 141808369 136161417
10623A36161417r835822j1723500j1420878r660778p396743n167236k948986q66386
$$ 136161417 126325595 114602095 103181217 93520439 86123696 80956460 78007474 77141088
10615G7141088J031588K832656M407593N565912O197010O042666N195069L932440
$$ 77141088 78172676 81005332 85412925 90978837 97175847 103218513 108413582 112346022
10607A12346022K515493J325714R35861J516714L077344N312833P622896R263067
$$ 112346022 114861515 116187229 117123090 118639804 121717148 127029981 134652877 143915944
10599A43915944R688243Q597982N971894K352435j742309n475538p997920q873618
$$ 143915944 153604187 162202169 168174063 170526498 168784189 163308651 155310731 146437113
10591A46437113q042452o244784m248001k514862j512550j415833j956054l043521
$$ 146437113 138394661 132149877 127901876 125387014 123874464 122458631 120502577 117459056
10583A17459056m317015n306752n659514n304902m384738k995749j560691P6830
$$ 117459056 113142041 107835289 102175775 96870873 92486135 89490386 87929695 88006525
10575H8006525J871344L757016N796320P737043R413792J0098557R283806O950029
$$ 88006525 89877869 93634885 99431205 107168248 116582040 126680597 135964403 142914432
10567A42914432L223325j383623o153340j0123786j2561898j3093170j2073437
$$ 142914432 146137757 144754134 138600794 128477008 115915110 102821940 90748503
10560I0748503j0414556q708714p121992n915112m930133m070890l533564l062562
$$ 90748503 80333947 71625233 64503241 58588129 53657996 49587106 46053542 42990980
10552D2990980k600809k357144k114735j910993j749443j598462j494123j336021
$$ 42990980 40390171 38033027 35918292 34007299 32257856 30659394 29165271 27829250
10544B7829250j218993j197634j103742r92649q76842q91272q29322p45902p11750
$$ 27829250 26610257 25412623 24308881 23316232 22439390 21548118 20718796 19972894 19261144
10535A9261144o83635o40323o06350o47876n68148n35251n38124m82447m55588
$$ 19261144 18577509 17937186 17330836 16682960 16114812 15579561 15041437 14558990 14103402
10526A4103402l86269m28901m85166m17206m07795m07401l85624l98073l96543
$$ 14103402 13717133 13288232 12803066 12385860 11978065 11570664 11185040 10786967 10390424
10517A0390424l10378l05884k83894l10812l55828k73938k51997k45568k16590
$$ 10390424 10080046 9774162 9490268 9179456 8823628 8549690 8297693 8052125 7835535
10508G835535j64164k39506l07482k11777j32135j98463j71124j58727k35763
$$ 7835535 7671371 7431865 7124383 6912606 6780471 6582008 6410884 6252157 6016394
10499F016394j48607j83109j84516j76096j14787j09624j74214j76952j96933
$$ 6016394 5867787 5684678 5500162 5324066 5209279 5099655 4925441 4748489 4551556
10490D551556j60422j28075j56523k25413j34581m8915j19411j33494j40106q1246
$$ 4551556 4391134 4263059 4106536 3881123 3746542 3697627 3578216 3444722 3304616 3223370
10480C223370o5528r908q1969j34094j36250q0784n6070j665o8413r0528m2175
$$ 3223370 3157842 3147934 3065965 2931871 2795621 2714837 2658767 2657102 2588689 2498161 2455986
10469B455986n1835l3139p8492p6037j0869r2836L0704l9787n6375o0011r1403
$$ 2455986 2404151 2371012 2292520 2216483 2205614 2112778 2143482 2103695 2047320 1987309 1895906
10458A895906j08386o9998N4410K0565M521J6384p3523n0733l983m1965p5637
$$ 1895906 1787520 1717522 1771932 1792497 1797018 1813402 1739879 1689146 1685163 1643198 1567561
10447A567561k7818j3533m8274n1966k2163n7624j8259l7327m7165o9304j2825
$$ 1567561 1539743 1526210 1477936 1425970 1403807 1346183 1327924 1290597 1243432 1174128 1161303
10436A161303l0485k4995O8m6227M875j2126J9290K9n4131l2389l503J2394M750
$$ 1161303 1130818 1105823 1105891 1059664 1064539 1052413 1071703 1071732 1017601 985212 981709 994103 998853
10423I98853R196K9613R49l3384m1089j5719k0134l2512K2089L091n9892j466
$$ 998853 1008049 1037662 1038611 1005227 964138 948419 928285 895773 917862 920953 861061 859595
10411H59595K1666M566q401M6422j8401o9727l4987k9172M9540N0113n976o5570
$$ 859595 881261 885827 877426 923848 905447 835720 800733 771561 821101 871214 865238 799668
10399G99668j7149M1156Q294j9735n2449m9240M4038K5442p4692m7618j5692m8576
$$ 799668 782519 823675 831969 812234 759785 710545 754583 780025 705333 657715 642023 593447
10387E93447K4944L5787Q1380Q879m6462m2695l9085K810k252m86j0049j8349
$$ 593447 618391 654178 735558 744437 697975 655280 616195 619005 616753 616267 606218 587869
10375E87869k3228K2903j0764N095r872K3051M9779l2905n5919n5984m9543r925
$$ 587869 564641 587544 576780 581875 572003 595054 644833 611928 556009 500025 450482 440557
10363D40557J5216k0663p172o4375l9636l3780q10J2693L1868O7995k632m1711
$$ 440557 455773 435110 427938 363563 323927 290147 289337 302030 333898 401893 399261 357550
10351C57550N9160K1173k4459j4775J0378j8095k9179l594L4735j4613o0136n0044
$$ 357550 416710 437883 413424 398649 409027 390932 361753 358159 392894 378281 318145 268101
10339B68101j2558N1731J6016J5524J5718j08005j00289l3200L82M4694J9050
$$ 268101 255543 307274 323290 338814 354532 246527 146238 113038 113420 158114 177164
10328A77164J3792L1999L0144Q1198K1072m3090q1677l7233j8087J1784J0345
$$ 177164 190956 222955 253099 334297 355369 312279 230602 193369 175282 187066 197411
10317A97411k2782L4158O2909n828l7275p9642q7200Q5216R9678j0166P16l2822
$$ 197411 174629 208787 271696 265868 228593 148951 61751 146967 246645 236479 237195 204373
10305B04373j9095M9796l9156k657L354n575l7326j5011n8658N6199M5933m895
$$ 204373 185278 235074 195918 193261 196615 191040 153714 138703 80045 136244 182177 177282
10293A77282k4581r653p769L3993J8174j7030k3184j3650m970R631L9066m9661
$$ 177282 152701 143048 135279 169272 187446 170416 147232 133582 128612 138243 177309 127648
10281A27648K1598P1635J9435k1359m827n3494k3329k8865j1995j3773L624N9195
$$ 127648 149246 220881 240316 218957 214130 160636 137307 108442 96447 82674 86298 145493
10269A45493K5488K7800K2296K1196k5002j6008O985o424j6081j9265K4924m6752
$$ 145493 170981 198781 221077 242273 217271 201263 208248 201824 185743 166478 191402 144650
10257A44650q615j4251n1919j967L8314j0O7321N489p3447l0027K1274O15j2037
$$ 144650 136035 121784 69865 67898 106212 106202 173523 179012 105565 75538 96812 97427 85390
10244H5390K1852M8420l8235m2956l6651O827m933m0769n5199K7149L6360P0323
$$ 85390 107242 155662 117427 74471 37820 44647 39714 -1055 -56254 -29105 7255 77578
10232G7578j5512m072j853K788n3855K7602K2702J231L3979K6070j8473K5100
$$ 77578 62066 57994 56141 58929 5074 32676 55378 56609 90588 116658 98185 123285
10220A23285M3448J5297N3235M016Q590l4720l0107q64L1316M5414j1564N7908
$$ 123285 166733 182030 235265 239281 247871 213151 183044 182180 213496 258910 247346 305254
10208C05254P5486P7149Q6121M8947M4252N7656N1252J8300q4346k8640k5447
$$ 305254 380740 457889 544010 592957 637209 694865 746117 764417 680071 651431 625984
10197F25984j6302o3110n5026L2149J9518n5942k9416O6575J1183J8236L1207
$$ 625984 609682 546572 491546 523695 543213 487271 457855 524430 535613 553849 585056
10186E85056J5181j6172N6307N0447M437J2205m6096m8138P9164J29464O5684
$$ 585056 600237 584065 640372 690819 695256 707461 661365 613227 692391 821855 887539
10175H87539M0019j4905J6920L6646j7934l0231l0743m7517n7997l5103k5146
$$ 887539 927558 912653 929573 966219 948285 918054 887311 839794 781797 746694 721548
10164G21548J1051k9134l8663k2239l970k1266p548m8174o7083o5359k9970j6355
$$ 721548 732599 703465 664802 642563 638593 617327 609779 561605 494522 429163 399193 382838
10152C82838O4484P2567K9961J0813R1628L7751L7405J7645P240j0102J4423q437
$$ 382838 447322 519889 549850 560663 652291 690042 727447 745092 752332 742230 756653 748216
10140G48216m5433m0914j07609o6159K2856o3100m6019r3461k6719K6310R101
$$ 748216 702783 661869 554260 488101 510957 447857 401838 308377 281658 307968 317069
10129C17069o8960L917N4458J2999j8507k8860r102J9135O4768o0466r9329n9339
$$ 317069 248109 252026 306484 319483 300976 272116 263014 282149 346917 286451 187122 127783
10117A27783k4201M7560m1452j9183n330J1782O2711N7871j7714m8406J542l0081
$$ 127783 103582 151142 109690 90507 85177 96959 159670 217541 199827 151421 152963 122882
10105A22882L6417j3862n8944q64k6691K8810L0015j6788k9987K0004m81l1491
$$ 122882 159299 145437 86493 85629 58938 87748 117763 100975 70988 90992 90511 59020
10093E9020k2681q893j8343L9200L3089L1783O946k5601k6355l4928k357L9746
$$ 59020 36339 27446 9103 48303 81392 113175 120121 94520 68165 33237 30880 70626
10081G0626J6725jr0193J597M0113j8581k5630N772k1394L2029L669j5774j0414
$$ 70626 87351 87350 -2843 -1246 38867 20286 -5344 428 -20966 11063 14732 -1042 -11456
10068a1456J2523m9088J2125N0033K8873j2908m6918M5701j4802r293K0432K2169
$$ -11456 1067 -48021 -35896 14137 43010 30102 -16816 28885 14083 4790 25222 47391
10056D7391K4784O7270R0915R2523K9931k399n4269j01922j5964m3475l1478M1764
$$ 47391 72175 139445 230360 322883 352814 350415 296146 194224 178260 134785 103307 145071
10044A45071R6729j0042n6987j04658r882J3903J0238l4029l2849M1232O7293
$$ 145071 241800 231758 174771 70113 60231 74134 84372 50343 17494 58726 126019
10033A26019P53n6837n7193P9433p0095m4504J7431K7543K1050k7087l5907J2457
$$ 126019 126772 69935 12742 92175 22080 -22424 -4993 22550 43600 16513 -19394 -6937
10021f937J3264L3752K8159q6677p89J5714p8715j2260O0272L9695l4456L4072
$$ -6937 6327 40079 68238 -18439 -19228 -3514 -82229 -94489 -34217 5478 -28978 5094
10009E094L7504J7319N6444K7221k4235n9343n5614l7056j7684K5496J5103J2517
$$ 5094 42598 59917 116361 143582 119347 60004 4390 -32666 -50350 -24854 -9751 2766
9997B766n263n1428o7570J3153J25312M9513P617L9459q8l4551r8237m1964J8780
$$ 2766 -2497 -53925 -121495 -108342 16970 66483 74100 113559 113471 78920 -19317 -61281 -42501
9984d2501L6869N7767K3026j4906k2867j0175K042J4534r057n546j0425K1978
$$ -42501 -5632 52135 75161 60255 37388 27213 29255 43789 34732 29186 18761 40739
9972D0739m3720J9239j3478k3027J1207K929k0227J4260M6567n0645N870P0315
$$ 40739 -2981 16258 2780 -20247 -9040 -6111 -26338 -12078 34489 -16156 -10286 60029
9960F0029O2883k4875n8450j8665P773J6334P227J530l9398m5240J468N0311J032
$$ 60029 122912 98037 39587 20922 28695 45029 52256 53786 14388 -30852 -29384 20927 21959
9947B1959l565O112m1712m3740K1433J7948p962q437j4835Q01j7591k6595k3734
$$ 21959 18394 24506 -17206 -60946 -39513 -21565 -29527 -37964 -52799 -51998 -69589 -96184 -119918
9934a19918r731N3021K8596L5435J6327N938l8031K942K925l8475O986L1003J14771
$$ -119918 -129649 -76628 -48032 -12597 3730 9668 -28363 -25421 -22496 -60971 -53985 -22982 91789
9921I1789M2861m2128M9323l8492q7916n1174N120M5782Q455j6169M8080L2327
$$ 91789 134650 92522 141845 103353 15437 -35737 -30617 15165 23620 7451 55531 87858
9909H7858R422o5550R411K4731L5697l2067r6594L5331K6450J73M1923m1026L4145
$$ 87858 97280 31730 41141 65872 101569 69502 -27092 8239 34689 34862 76785 35759 69904
9896F9904J0931J525n0809j5850j5810K749Q950q867n5011N3516k197k5661k276
$$ 69904 80835 82360 31551 15701 -109 2640 11590 2723 -52288 1228 -969 -26630 -28906
9883b8906j9640L7016J4250J7584m0912l9224j5832L3117N4407l1188J2074N3238
$$ -28906 -48546 -11530 2720 20304 -20608 -59832 -75664 -42547 11860 -19328 -7254 45984
9871D5984J9783j4107j8034K0527J6515j8293p3591k3860M6890P550j0853O633
$$ 45984 65767 51660 33626 54153 70668 52375 -21216 -45076 1814 9364 -1489 5144
9859E144L996l3762j1622Q1048N3879P005n2683j6848M5533j1787j18109o0824
$$ 5144 9140 -24622 -36244 44804 98683 105688 53005 36157 81690 69903 -48206 -109030
9847a09030Q961J6689n3102O7945L0995J6698j4100l4911o171M5509L6811k172
$$ -109030 -100069 -83380 -136482 -68537 -37542 -20844 -34944 -69855 -76026 -30517 6294 4122
9835D122N953Q708l2909j5041N3809K6666J3106o330J097l260n0295k6359K6321
$$ 4122 10075 18783 -14126 -29167 24642 51308 64414 58084 59181 55921 5626 -20733 5588
9822E588K7840j3283j3256J5173K1288j8578L5476K3050j9067k4586j4798n7538
$$ 5588 33428 20145 6889 22062 43350 24772 60248 83298 64231 39645 24847 -32691
9810c2691k617l1946k8995L8956J0498L0775K7148K8034L7086J8890N762m2318
$$ -32691 -35308 -67254 -96249 -57293 -46795 -16020 11128 39162 76248 95138 100900 58582
9798E8582m3335j37k1675J9516J0736n3298k9702Q858L9649k7083k4927j5028
$$ 58582 15247 15110 -6565 12951 23687 -29611 -59313 -50455 -10806 -37889 -62816 -77844
9786g7844Q684Q7574J5498O981k0165P357L2889o222k5747k8568l7323N372M0536
$$ -77844 -69160 18414 33912 40893 20728 28085 60974 54752 29005 437 -36886 -31514 9022
9773I022k1442k002J0736K894o775j9252J5109J0257k1653J4844K5278p5826p0070
$$ 9022 -12420 -14422 -3686 -792 -7567 -26819 -11710 -1453 -23106 -8262 17016 -58810 -128880
9760a28880O672L7253J8221L3945k6400M3455R566J3331K6446m0900k9285O2025
$$ -128880 -122208 -84955 -66734 -32789 -59189 -15734 -6168 7163 33609 -7291 -36576 25449
9748B5449Q651n9293K2533M2034R857J0967O179k995m4463l8849m990M5861J4841
$$ 25449 34100 -25193 -2660 39374 49231 60198 66377 63382 18919 -19930 -24920 20941 35782
9735C5782L6149P794l8084N468L599l1631n8134M110K5499j4062K6020J3895J1264
$$ 35782 71931 79725 41641 47109 50708 19077 -39057 -34947 -9448 -23510 2510 16405 27669
9722B7669n6550L658P5334k2443k1810l1303L6178L4663Q206m7226l4333K085
$$ 27669 -28881 -25223 50111 27668 5858 -25445 10733 45396 53602 6376 -27957 -25872
9710b5872j5708K339P4697J7164n807N4700k1356m5691n1618k8736j2027j451
$$ -25872 -41580 -39241 35456 52620 46813 101513 80157 34466 -17152 -45888 -57915 -59366
9698e9366N5834M2297K7505O5173j9610o6203p0938P210L2087J6887q599q979
$$ -59366 -3532 38765 66270 131443 111833 45630 -25308 -18098 13989 30876 22277 13298
9686A3298K684p4788m5250R264M796L1590J13283M6770l2198l6487L898K0297
$$ 13298 15982 -58806 -104056 -94792 -89996 -58406 54877 101647 69449 32962 36860 57157
9674E7157j9825l7965j8301m7274l170M78K2382r040k9664K1656K9344o691k1764
$$ 57157 37332 -633 -18934 -66208 -69378 -68900 -46518 -55558 -85222 -63566 -34222 -40913 -62677
9661f2677j1558Q836J294j310M0378k3944j00028J4955L4898L4843J6420J5681
$$ -62677 -74235 -65399 -64105 -65415 -25037 -48981 -149009 -134054 -99156 -64313 -47893 -32212
9649c2212l0371l4403L2572J8364o0063M469L0426j8156n4406P8545J24652R427
$$ -32212 -62583 -96986 -64414 -46050 -106113 -101644 -71218 -89374 -143780 -65235 59417 68844
9637F8844K1113l7727k7763L816K2991K4229K9741K7184l4728m1036p3456k0001
$$ 68844 89957 52230 24467 28283 51274 75503 105244 132428 97700 56664 -16792 -36793
9625c6793K4822L2982j798M0668J8414K6552k1036n1990R49p0552P225K0624M9902
$$ -36793 -11971 21011 19213 59881 78295 104847 83811 31821 32770 -37782 -30557 -9933 39969
9612C9969P00m6250l3829m4250J3106L3817J4764M3013N752k8711n0561o437O1603
$$ 39969 40669 -5581 -39410 -83660 -70554 -36737 -21973 21040 26792 -1919 -52480 -58917 2686
9599B686K7639k1656o4352N4348J2603o3001M0888J8495q617m1001j7165J176
$$ 2686 30325 8669 -55683 -1335 11268 -51733 -10845 7650 -967 -41968 -59133 -57957
9587e7957L1879K9096k3390j3691K9979N814j9283m44m0790k5139L7427M1443
$$ -57957 -26078 3018 -20372 -34063 -4084 1730 -17553 -17997 -58787 -83926 -46499 -5056
9575e056K3112L3214J4828j8794K2828K654j8278j2826k9010m1685l8758N422
$$ -5056 18056 51270 66098 47304 70132 72786 54508 41682 12672 -29013 -67771 -62349
9563f2349l901N978K0051o346R078O3405l3891J4802Q639k1690l294L163p892
$$ -62349 -66250 -60272 -40221 -46567 -37489 25916 -7975 6827 15466 -6224 -9518 -6355 -14247
9550a4247k5942j7391j1315l2754J3038K2292M649L8371J3371J2779N249Q237
$$ -14247 -40189 -57580 -68895 -101649 -88611 -66319 -61670 -23299 -9928 2851 8100 16337
9538A6337K1112O222k6174m5139o6653R459K2576M0835R845j700J735M1545M801
$$ 16337 37449 43671 17497 -27642 -94295 -84836 -62260 -21425 -11580 -13280 -11545 30000 34801
9525C4801J6369m4792q5164J09767j5036M223N6077m3127o2928n272r858N495
$$ 34801 51170 6378 -78786 30981 15945 20168 76245 33118 -29810 -35082 -44940 -39445
9513c9445j1417L071L1422J2324K0253L0342O452P981M2108m9912o0122J2590
$$ -39445 -50862 -47791 -16369 -4045 16208 46550 53002 60983 103091 53179 -6943 5647
9501E647N2141L976j5944l1878m8840j7579j7252J8683K9743M015o9987k5303
$$ 5647 57788 61764 45820 13942 -34898 -52477 -69729 -51046 -21303 -17288 -87275 -112578
9489a12578N9392M0187J6633O224l4849N2980Q1558k7360Q002k4425o0789k2935
$$ -112578 -53186 -12999 3634 9858 -24991 27989 109547 82187 90189 65764 4975 -17960
9477a7960J8512M9640J8097k2820m790j1063l143r019J2481K4692K946L478k1111
$$ -17960 552 50192 68289 45469 40679 29616 26473 17454 29935 54627 57573 61051 39940
9464C9940n1778p765J1310m1609J9630Q8162M4199l0948p6243n4826N4114j0888
$$ 39940 -11838 -19603 -8293 -49902 -30272 57890 102089 71141 -5102 -59928 -5814 -16702
9452a6702Q340l8490N285K2293J7337Q2121k6509l0535K4288L1890n722l7486
$$ -16702 -8362 -46852 -41567 -19274 -1937 80184 53675 23140 47428 79318 73596 36110
9440C6110K301k0997m6263J5885J6697P35J7613m4791k5646L519n5447l1421J9826
$$ 36110 38411 17414 -28849 -12964 3733 4468 22081 -22710 -48356 -44837 -100284 -131705 -111879
9427a11879O1153Q4892q220o1017o3679J2739J4273M448j4808L4311J5835r278
$$ -111879 -50726 34166 25946 -35071 -98750 -86011 -71738 -67290 -82098 -47787 -31952 -41230
9415d1230J3483L706l0600K4661O2260O948n6927m3819J2624J1403M493j9630
$$ -41230 -27747 -24041 -54641 -29980 32280 39228 -17699 -61518 -48894 -37491 -32998 -52628
9403e2628L62L5633k4764k5134O7007j553L393K9324K3855k4601o5959j0749L3673
$$ -52628 -52266 -16633 -41397 -66531 476 -1077 2316 31640 55495 30894 -35065 -45814 -12141
9390a2141J652K1134M1232k9451l7934k8063P4383m4715o9324j81Q4867R024j812
$$ -12141 -10489 10645 51877 22426 -15508 -43571 30812 -13903 -83227 -83408 1459 10483 8671
9377H671J606m2619j558N3711M2318L223k4577q0853r176M3718j1775J5129O140
$$ 8671 10277 -32342 -33900 19811 62129 65352 40775 -40078 -49254 -5536 -17311 -2182 3958
9364C958N1509n7762o309P166K528N261K5432M2670j964l510k3410q5624k4026
$$ 3958 55467 -2295 -8604 -1438 1090 6351 31783 74453 72489 68979 45569 -40055 -64081
9351f4081M0440O520j8411P755R775L9742R2818K7751n1925j0271m0222j9426
$$ -64081 -23641 -17121 -35532 -27777 -18002 21740 114558 142309 90384 80113 39891 20465
9339B0465N9411J0843m0372l3494l7960L3799K5511K2688j9723k4765R1787j2589
$$ 20465 79876 90719 50347 16853 -21107 12692 38203 60891 41168 16403 108190 95601
9327I5601m3175N664J9787o2169J3852K9710j0656j704K0586q3241j6149l532
$$ 95601 52426 58090 77877 15708 29560 59270 48614 46910 67496 -15745 -31894 -35426
9315c5426R6047P792o672J6039R701O2851j4053o9550k093k1878p5482j1619j5978
$$ -35426 60621 68413 61741 77780 87481 150332 136279 66729 64636 42758 -32724 -44343 -60321
9302f0321N2427P0464J7516L6973n1189j5858J4692M1868L0738J6180j5767M5878
$$ -60321 -7894 62570 80086 117059 65870 50012 64704 106572 137310 153490 137723 183601
9290A83601k8034k1329J7716q338k3245M945Q72J0651L5990J5049J401n491n6154
$$ 183601 155567 134238 151954 143616 120371 125316 126188 136839 172829 187878 189279 183788 127634
9277A27634k7168L1066J1604j727n5231M0540M4449p1164k8971P1942q259N334
$$ 127634 100466 131532 143136 141409 86178 126718 171167 100003 71032 142974 134715 140049
9265A40049K6783m902o1936J5717N4815J618n671k9044k3661k3449P070K9540
$$ 140049 166832 161930 99994 115711 170526 172144 166473 137429 113768 90319 97389 126929
9253A26929k3667l8590N1350J7582J3390K2976M9307J0073K2544l8940J8292n874
$$ 126929 103262 64672 116022 133604 146994 169970 219277 229350 251894 212954 231246 225372
9241B25372k9109Q9269K9151p587P291J6902L2791P8468l6659l8387M9471L8975
$$ 225372 196263 285532 314683 307096 314387 331289 364080 442548 405889 367502 416973 455948
9229D55948q343L58M9207K7282L363n886K1793J7114O793K9254k5618j5631J03892
$$ 455948 447605 447963 497170 524452 527815 521929 543722 560836 567629 596883 571265 555634 659526
9216F59526N3459N8366N3334M5188K8434J7839P7325N9637P2798R6829Q7147P5692
$$ 659526 712985 771351 824685 869873 898307 916146 993471 1053108 1125906 1222735 1309882 1385574
9204A385574J13043J14917J16250J76913J48229J43420J62901K56831K99840L07309
$$ 1385574 1498617 1613534 1729784 1906697 2054926 2198346 2361247 2618078 2917918 3225227
9194C225227L81370L86425M91136N90866O15060O24487O49821P67533Q16238P53102
$$ 3225227 3606597 3993022 4484158 5075024 5690084 6314571 6964392 7731925 8548163 9301265
9184I301265O52240L93088K38723J22309r5210l02034n02324n27052o27960o37543
$$ 9301265 9953505 10346593 10585316 10707625 10612415 10310381 9808057 9281005 8653045 8015502
9174H015502o16082n59318n43570n17006m01657m19753l88782k66899k80032l29751
$$ 8015502 7399420 6840102 6296532 5779526 5377869 4958116 4569334 4302435 4022403 3692652
9164C692652k87703j62729j20778j17571k42088k32595j20756q0908n1276j44871
$$ 3692652 3404949 3242220 3121442 3003871 2761783 2529188 2408432 2327524 2276248 2131377
9154B131377j59597p6803k1870q8503m7535o2219j05751n2656M1855m5838j38949
$$ 2131377 1971780 1894977 1873107 1784604 1737069 1674850 1569099 1516443 1558298 1512460 1373511
9143A373511r6991J1600J162n1806q8941q4778l2176n0125n0689m4066P101L3153
$$ 1373511 1276520 1288120 1289282 1237476 1148535 1063757 1031581 981456 930767 886701 893802 926955
9131I26955K0437r225o2409j01665j5121n2013p727K2105L351n0495n0904l4790
$$ 926955 947392 938167 875758 774093 758972 706959 699232 721337 724688 674193 623289 588499
9119E88499M5827m3004n5591k0143L0784l7457M1285K013j7466l2828k9400K3751
$$ 588499 634326 591322 535731 515588 546372 508915 550200 552213 534747 501919 472519 496270
9107D96270j4293o8077l3249o6546n9363l8141J4147L2320J170p2626J1636P9879
$$ 496270 481977 413900 380651 314105 254742 216601 230748 263068 264238 191612 203248 283127
9095B83127J5159l4572L6289l459M3207L1244j9905k1294m0163L4283L905J823
$$ 283127 298286 263714 300003 296544 339751 370995 351090 329796 289633 323916 327821 329644
9083C29644j7924n5573q3507R697M4036N7395M7927J1436o6499j2304q900l3090
$$ 329644 311720 256147 172640 182337 226373 283768 331695 343131 276632 264328 255428 222338
9071B22338K4056m4456K4864l7818k2891J2962m0924m0970k0016m5578K5442K6478
$$ 222338 246394 201938 226802 188984 166093 179055 138131 97161 77145 31567 57009 83487
9059H3487j2657k5725j3194K1248j4705k1651j1972j7741J4157L9067M1404j4370
$$ 83487 70830 45105 31911 53159 38454 16803 4831 -12910 1247 40314 81718 67348
9047F7348m519j2549Q44p405L2931N5151M7500K7932r1384l631O120k4562o36
$$ 67348 62829 50280 51124 43719 76650 131801 179301 207233 115849 112218 118338 93776 93140
9034I3140R997l3252K4173J7696k9147P244J5855J0511K3463Q629o7252k1849
$$ 93140 103137 69885 94058 111754 82607 89851 105706 116217 139680 148309 81057 59208
9022E9208j3739k7841K696J0589l6103K9019K2556K3085N3119k7050k0788K3788
$$ 59208 45469 17628 20324 30913 -5190 23829 46385 69470 122589 95539 74751 98539
9010I8539j6610l2776k2980L26O420j3219J6543K6750M7754O4552O1871j893j27037
$$ 98539 81929 49153 26173 26499 32919 19700 36243 62993 110747 175299 237170 235277 108240
8997A08240l9477q312l3293j8826p6602J5815K6190K0270L0514l2902l6244k025
$$ 108240 68763 60451 27158 8332 -68270 -52455 -26265 -5995 24519 -8383 -44627 -46652
8985d6652j015J3715L7188N8708j7541o1827q2043M5206Q4232j8449K8460R719
$$ -46652 -47667 -33952 3236 61944 44403 -17424 -99467 -54261 29971 11522 39982 49701
8973D9701m262l9972l1168K0468P402l9379j6061L0361K1770k9210J6078M2480
$$ 49701 45439 5467 -25701 -5233 2169 -37210 -53271 -22910 -1140 -30350 -14272 28208
8961B8208R574J6244o4166j0244M8571K7557j3081j2622l985M0376m1099p4467
$$ 28208 37782 54026 -10140 -20384 28187 55744 42663 30041 26056 66432 25333 -49134
8949d9134m4303N6514Q7583N9743k0378n3071J4189J8418K872k3856j0879j7563
$$ -49134 -93437 -36923 50660 110403 90025 36954 51143 69561 72433 48577 37698 20135
8937B0135J4324m6540n3921J1315j3344K3414R739N6789j664j01476q9612k3274
$$ 20135 34459 -12081 -66002 -54687 -68031 -44617 -34878 21911 20247 -81229 -170841 -194115
8925a94115L1186P7774M5491L4237M2941k9465K584K3939m6325k6190K5476K4957
$$ -194115 -162929 -85155 -39664 -5427 37514 8049 10633 34572 -11753 -37943 -12467 12490
8913A2490K0940N7769J0119n7764q859L5535L310m8342l420p997n522J2924p4952
$$ 12490 33430 91199 101318 43554 34695 70230 73540 25198 21778 13781 8259 21183 -53769
8900e3769m5388j693L8992J31757O4413l2432j8929k4447K1237Q702n9993N1299
$$ -53769 -99157 -100850 -61858 69899 134312 101880 82951 58504 79741 88443 28450 79749
8888G9749K4887n732j6531n9075J3199o4342j3792P3637j1176n1136o366O1928
$$ 79749 104636 98904 82373 23298 36497 -27845 -41637 32000 20824 -30312 -36678 25250
8876B5250L1565L691k7209k6884p28K6671L4578M041J9369o798K1941j2166m6750
$$ 25250 56815 60506 33297 6413 5685 32356 66934 70975 90344 83546 105487 93321 46571
8863D6571k9033m8957l5332M1052L64J2259j1249J8800k1796J2845O4672r257
$$ 46571 17538 -31419 -66751 -25699 -25335 -13076 -24325 -5525 -27321 -14476 50196 40939
8851D0939n1143m4058k1795K0703N691j2093j9138K7612O2078M3342R121o1361
$$ 40939 -10204 -54262 -76057 -55354 -49663 -61756 -80894 -53282 8796 52138 61259 -102
8839a02m7767m98M210J7734M4482M5594k559n6354J9894L5345j766m8342L6288
$$ -102 -47869 -48367 -44157 -26423 18059 63653 61094 4740 24634 59979 58213 9871 46159
8826D6159M5289k7417K9004K8689m4894p4463L7086M2012l8452j0282O3717l4166
$$ 46159 91448 64031 93035 121724 76830 2367 39453 81465 43013 32731 96448 62282
8814F2282p9587K4992N6588m2269k2574j4278l9539O8623J0318j2390M1766j4448
$$ 62282 -17305 7687 64275 22006 -568 -14846 -54385 14238 24556 12166 53932 39484
8802C9484l2140j3031k1414m9951P94O3123K9958o1853O6424P5137m5803m2593
$$ 39484 7344 -5687 -27101 -77052 -76258 -13135 16823 -45030 21394 96531 50728 8135
8790H135r548n7391j9574P4282N4727m3659l1023R694o5040m1725O0549J05119
$$ 8135 -1413 -58804 -78378 -4096 50631 6972 -24051 -14357 -79397 -121122 -60573 44546
8778D4546Q1320R890n5694j2962J5010k7591p975J8511k9005l2662N860j899J1476
$$ 44546 125866 135756 80062 67100 82110 54519 46544 65055 36050 3388 9248 7349 18825
8765A8825N7253K0695l9737o5753m147J6899L1667L5681N2614L0996l8731n6516
$$ 18825 76078 96773 57036 -8717 -12864 4035 35702 71383 123997 154993 116262 59746
8753E9746l0629l4152J4241K6566K9794j9412o6849N0537P5527N0243n6708o5481
$$ 59746 29117 -5035 9206 35772 65566 46154 -20695 29842 105369 155612 98904 33423
8741C3423n0694j1082P4988m0615j4009m3726K5172j9837N0535J7827j8607p9050
$$ 33423 -17271 -28353 46635 6020 -7989 -51715 -26543 -46380 4155 21982 3375 -75675
8729g5675l3419J2681j3342L9923N7319L986k748p881L952k4100J9212R0769Q443
$$ -75675 -109094 -96413 -109755 -69832 -12513 -8527 -11275 -19156 -15204 -39304 -20092 70677 79120
8716G9120r1337k0522N2971L6422J6889K4969K3094m713R836r770n3921p6392
$$ 79120 -12217 -32739 20232 56654 73543 98512 121606 116893 126729 116959 63038 -13354
8704a3354J4916j6374m543N2049q244l9869q246j676M7572m2401J1399k5968l4472
$$ -13354 1562 -14812 -19355 32694 24450 -15419 -23665 -25341 22231 -20170 -8771 -34739 -69211
8691f9211M4698K559n1899m263K0923L5406J0248K2022K8045R220r988K6657L8127
$$ -69211 -24513 -21954 -73853 -78116 -57193 -21787 -11539 10483 38528 47748 37760 64417 102544
8678A02544j0470q525O924n2356m6223n5225J3548R2595j8528M425R896m6092
$$ 102544 92074 83549 90473 38117 -8106 -63331 -49783 42812 24284 28709 38605 -7487
8666g487J4541k6166J2587K9622l774M06L7943m0557q25k6992k420K7141j4247
$$ -7487 7054 -19112 -6525 23097 19323 19729 57672 17115 16290 -10702 -13122 14019 -228
8653b28N284O0238N3395O525m660Q644q0619m4096k9015J7485M0525J7064j3617
$$ -228 5056 65294 118689 125214 120554 129198 48579 4483 -24532 -7047 33478 50542 36925
8640C6925J2133O951p49O987p058K2244j3965J6315l957K5947r257l5295K7765
$$ 36925 49058 56009 55260 62247 55189 77433 63468 79783 75826 101773 92516 57221 84986
8627H4986L6167K8393M5380M2289k49k610o0941q1540k5721J6238j9329L1020
$$ 84986 121153 149546 194926 237215 236966 234356 173415 91875 66154 82392 63063 94083
8615I4083q097L7219Q7543M0688k6348n346l7855k52N0483L0399L9843k9759p9105
$$ 94083 85986 123205 210748 251436 225088 219742 181887 181635 232118 262517 302360 272601 193496
8602A93496p2159J0876n502l4982l8410J8900P697L4377J8279J0597J0010l757
$$ 193496 121337 132213 126711 91729 53319 72219 79916 114293 132572 143169 153179 149422
8590A49422K0040m504l9539J1555K5153K0287o3621m5175m3915k1626K2707M8914
$$ 149422 169462 164958 125419 136974 162127 182414 118793 73618 29703 8077 30784 79698
8578G9698r991K341K5315K9560j7360m2483k9306o794J8818J8912K5168p6131
$$ 79698 69707 72048 97363 126923 109563 67080 37774 30980 49798 68710 93878 17747
8566A7747j04761j2802L5179R990K2925O212K7588k4220K4579P1895L0668J5244
$$ 17747 -87014 -99816 -64637 -54647 -31722 -25510 2078 -22142 2437 74332 105000 120244
8554A20244l712n3168K0355n5539n3501l4589K9507r126l2846L9283J6780J0291
$$ 120244 116532 63364 83719 28180 -25321 -59910 -30403 -39529 -72375 -33092 -16312 -6021
8542f021L192k9157m408m709j5679o745K0366R5271O6534r048m8807j2712q4822
$$ -6021 -2829 -31986 -36394 -41103 -56782 -63527 -43161 52110 118644 109596 60789 48077 -36745
8529c6745m9633L713L3938P4546n728j1376P3774Q2546q1313j12064q4087L035
$$ -36745 -86378 -82665 -48727 25819 20091 8715 82489 165035 83722 -28342 -112429 -109394
8517a09394k7107K5758j7875j4766j6043J4589M4361P8696J2055Q72N1143r6508
$$ -109394 -136501 -110743 -128618 -143384 -159427 -144838 -100477 -21781 -9726 -8854 42289 -54219
8505e4219L30Q9470j8354l9529j5546m231K0425Q726L7983J3336p8630j2922N1510
$$ -54219 -53889 35581 17227 -22302 -37848 -42079 -21654 -12928 25055 38391 -40239 -53161 -1651
8492a651L322o6294r573K6085j3111N3621L2793J1174L1168j4251j3619K0667
$$ -1651 1671 -64623 -74196 -48111 -61222 -7601 25192 36366 67534 53283 39664 60331
8480F0331O1119L2386m5974j6826j5338m216l006J5403o5739o2011l587Q680Q0693
$$ 60331 121450 153836 107862 91036 75698 71482 68476 83879 18140 -43871 -47458 -38778 41915
8467D1915Q4734L8633l6819k4469r188j0970j6914k9207L605l6555K4453K6689
$$ 41915 126649 165282 128463 103994 94806 83836 66922 37715 41320 4765 29218 55907
8455E5907l4550Q033Q032K809L4697j221j7618j3763R668K7381j6611r51j2501
$$ 55907 21357 29390 37422 40231 74928 73707 56089 42326 51994 79375 62764 61813 49312
8442D9312m0730J2190J1513k5947l5862l208M8848K051n9395J4105P4003K6521
$$ 49312 8582 20772 32285 6338 -29524 -32732 16116 18167 -41228 -27123 46880 73401
8430G3401o4623m4718k8075K996k1840O4829O2416L1743n017p0596o110j5306
$$ 73401 8778 -35940 -64015 -61019 -82859 -18030 44386 76129 71112 516 -5594 -20900
8418b0900L4172N5666m2380m9526j0159N879K4369J5289j4107k8130K0604N0441
$$ -20900 13272 68938 26558 -22968 -33127 -27248 -2879 12410 -1697 -29827 -9223 41218
8406D1218J6970l7281n2989o281l5734J0063O2486M1213j2302Q771o577k2889
$$ 41218 58188 20907 -32082 -38363 -74097 -64034 -1548 39665 27363 36134 29557 6668
8394F668o8207Q761L7727j1354M0739M8440n1539k1291K630o581k785m0874j9370
$$ 6668 -61539 -52778 -15051 -26405 14334 62774 11235 -10056 -7426 -14007 -16792 -57666 -77036
8381g7036M250m083O3040L2143L2577j2715L9068j6335M3081p6581q4812Q244
$$ -77036 -72786 -76869 -13829 18314 50891 38176 77244 60909 103990 27409 -57403 -49159
8369d9159L157K5125P1395M7076j624J6340l4541p3577m3974K7871n8388K8427
$$ -49159 -46002 -20877 50518 97594 95970 112310 77769 4192 -39782 -11911 -70299 -41872
8357d1872O6926K5344l215K5538m7137j3796p1313l0574M9136K0915m821l310
$$ -41872 25054 50398 47183 72721 25584 11788 -59525 -90099 -40963 -20048 -24869 -28179
8345b8179n361K791j5150N8216M388m7733j0475l9447o1783K5593N9379O5645
$$ -28179 -33540 -30749 -45899 12317 16705 -31028 -41503 -80950 -142733 -117140 -57761 7884
8333G884N7867m3586p8262M232O974k9088J1050M3635j7325p0542J3851M4893
$$ 7884 65751 22165 -56097 -51865 -44891 -73979 -62929 -19294 -36619 -107161 -93310 -48417
8321d8417K1699k4143M3819N1691N935L5533J5944k802j4505l0634j4960R440
$$ -48417 -26718 -50861 -7042 44649 50584 86117 102061 99259 84754 54120 39160 48600
8309D8600L6270L557k9601o682m139k6652l9134M8892O0428k1844m8259n2433
$$ 48600 84870 88427 58826 52144 48005 21353 -17781 31111 91539 69695 21436 -30997
8297c0997k0771l5294j2948J0371l4503L1034K9209k084m5596k4351K3532P7342
$$ -30997 -51768 -87062 -100010 -89639 -124142 -93108 -63899 -65983 -111579 -135930 -112398 -35056
8285c5056J377k9706j3924n210N9291M5931m6879k1852P9743L6888k459j3287
$$ -35056 -33679 -63385 -77309 -82519 -23228 22703 -24176 -46028 33715 70603 68144 54857
8273E4857o8475l3701M9882k4047N55p164L554L6232O971n0892J3929P716k4373
$$ 54857 -13618 -47319 2563 -21484 -20929 -28093 -24539 11693 18664 -32228 -18299 -10583 -34956
8260c4956j3539K5080K3507J1400J0652l8452j9492K7613j8770k0823N376Q0139
$$ -34956 -48495 -23415 92 11492 22144 -16308 -35800 -8187 -26957 -47780 -42404 37735
8248C7735k631k5798k9545L055K8164m116r305O2968P5283n7928p5470n0517l4510
$$ 37735 35104 9306 -20239 -17184 10980 6864 -2441 60527 135810 77882 2412 -48105 -82615
8235h2615M3506O9483K2040m4356m4594J0099N2296J6348m3655l0911j9202k1192
$$ -82615 -39109 30374 52414 8058 -36536 -26437 25859 42207 -1448 -32359 -51561 -72753
8223g2753J1508q978K8239L1292K3740o5809M3051L29p0807L3600M3774n622M329
$$ -72753 -61245 -70223 -41984 -10692 13048 -52761 -9710 -9381 -80188 -46588 -2814 -8436 -4107
8210d107j8546K833l8240m2784N4092K6970j1507l5137N8636R370j1770k1683
$$ -4107 -22653 -19820 -58060 -100844 -46752 -19782 -31289 -66426 -7790 1580 -10190 -31873
8198c1873K2670k4572K3135q8013J3076Q9241O4354o066m1743l3736n8024J3553
$$ -31873 -9203 -33775 -10640 -98653 -85577 3664 68018 61952 20209 -13527 -71551 -57998
8186e7998J7866L5149J3266J1674P971M9767K5593l5994L1552O161k8113m6155
$$ -57998 -40132 -4983 8283 19957 27928 77695 103288 67294 98846 105007 76894 30739
8174C0739l40k1479j5213L0885R852R577M8742K9826j1088j1147p4819l9842Q5962
$$ 30739 30399 8920 -6293 24592 34444 44021 92763 122589 111501 100354 25535 -14307 71655
8161G1655L9186K679j980K418p667n226k4867m4707j0174M1759L153l1164L4477
$$ 71655 110841 113520 111540 113958 106291 101065 76198 31491 21317 63076 66229 35065 69542
8148F9542r655j8249n9867l327L6083O7225l2542p2147j1527J3919n48N794M1610
$$ 69542 59887 41638 -18229 -21556 14527 81752 49210 -22937 -34464 -20545 -21093 -15299 26311
8135B6311K9186k685K8877K4860K5730j18532n0328J2789J2482K2941R076k4565
$$ 26311 55497 52812 81689 106549 132279 13747 -36581 -23792 -11310 11631 20707 -3858
8123c858l1869K9903N3884m1844K5100N7874k9817p3427k0205J2317M1935Q0867
$$ -3858 -35727 -5824 48060 6216 31316 89190 59373 -14054 -34259 -21942 19993 100860
8111A00860J8254j101K5291p3590l9641o2251k0417L2560M8362L7128k9873k0933
$$ 100860 119114 118013 143304 69714 30073 -32178 -52595 -20035 28327 65455 35582 14649
8099A4649J795q718k6308n0139M1866N7110k31N9550j204p5493j8183j05996K696
$$ 14649 16444 7726 -18582 -68721 -26855 30255 30024 89574 88370 12877 -5306 -111302 -108606
8086a08606O9581m1407P848Q8033n5626m7940J7312Q350K5255L8705L3780N7991
$$ -108606 -39025 -80432 -72584 15449 -40177 -88117 -70805 -62455 -37200 1505 35285 93276
8074I3276L2054p3884J0486O7933M4356n9786n3406k6488m2274K4945O8061K7842
$$ 93276 125330 51446 61932 129865 174221 114435 61029 34541 -7733 17212 85273 113115
8062A13115L618n0382J2484n660m1010j3026l1303L5772P0838l1682m5560l7222
$$ 113115 116733 66351 78835 73175 32165 19139 -12164 23608 94446 62764 17204 -20018
8050b0018O8621L9449n4995N270M9369l1204n0756K5787K4720M780k3579L0598
$$ -20018 48603 88052 33057 38327 87696 56492 5736 31523 56243 61023 37444 68042
8038F8042l7737j659Q668j3949k2033J8391N4224k2453l1948J89K7326N801P779
$$ 68042 30305 28646 37314 23365 1332 19723 73947 51494 19546 19735 47061 52862 60641
8025F0641K8866L4513j3668J3644k2694l3983O333k5193o4245k4218P8833O1726
$$ 60641 89507 124020 110352 123996 101302 67319 73652 48459 -15786 -40004 38829 100555
8013A00555M1308l1590k0386J5283M7076K5072K0706k0614p577j0065j8310L7311
$$ 100555 141863 110273 89887 105170 152246 177318 198024 177410 169833 159768 141458 178769
8001A78769L5018l5307q193J8107m4297m6198J749N9000O5701n380n6506n9811
$$ 178769 213787 178480 170287 188394 144097 97899 99648 158648 224349 218969 162463 102652
7989A02652m6174r274m604k6929j2197L4555N859m1069r449j2221P520L7573J0103
$$ 102652 56478 47204 42600 15671 3474 38029 43888 2819 -6630 -18851 -11331 26242 36345
7976C6345M5289J505K815p2501K3550K1949N4525M3835L5789j7410n7870L8927
$$ 36345 81634 83139 85954 13453 37003 58952 113477 157312 193101 175691 117821 156748
7964A56748N587q4224k6219j3389K777J5616L3994J6364j617l7464L125K6273
$$ 156748 162335 78111 51892 38503 41280 56896 90890 107254 105637 68173 71298 97571
7952I7571j4863o1743j0652K2286J4471K4829M6238k6712L0319k5061l8056l9301
$$ 97571 82708 20965 10313 32599 47070 71899 118137 91425 121744 96683 58627 19326
7940A9326J2281N5500J3698k8388q3648j1767J7660J7194L0077K4575j9833j4780
$$ 19326 31607 87107 100805 72417 -11231 -22998 -5338 11856 41933 66508 46675 31895
7928C1895O995m9492K2102k4223m1796R573n0367M4370O8318p844N7770K7671
$$ 31895 38890 -10602 11500 -12723 -54519 -44946 -95313 -50943 17375 9531 67301 94972
7916I4972n9795j19651o231O8823L4305l6879k6865J1144k7861N6825J4007p2915
$$ 94972 35177 -84474 -90705 -21882 12423 -24456 -51321 -40177 -68038 -11213 2794 -70121
7904g0121p304J8983J1952k5568N321L2003J5033L1357k3536L3002p994n6379
$$ -70121 -77425 -58442 -46490 -72058 -66737 -34734 -19701 11656 -11880 21122 13128 -43251
7892d3251j2245N964J2409J0254N2861l9563K1696k1425k970m393Q115j104k5253
$$ -43251 -55496 -49532 -37123 -26869 25992 -13571 8125 -13300 -16270 -20663 -12548 -13652 -38905
7879c8905n2472o189L1905L6077M5054M9979l292m5722k3473m7917k1853p099
$$ -38905 -91377 -97566 -65661 -29584 15470 65449 62157 16435 -7038 -54955 -76808 -83907
7867h3907K0986K4795J7482K0210k812J5748L6516q040l4924J1234K7316k5484
$$ -83907 -62921 -38126 -20644 -434 -3246 12502 49018 40978 6054 17288 44604 19120
7855A9120m6287l0724n1011j3180L1887Q689L5663Q043j7603M2333L1126m0456
$$ 19120 -27167 -57891 -108902 -122082 -90195 -81506 -45843 -37800 -55403 -13070 18056 -22400
7843b2400l2290j2611K6420J9687M6301J9695m3939m294l2107J1026P1938O6804
$$ -22400 -54690 -67301 -40881 -21194 25107 44802 863 -3431 -35538 -24512 47426 114230
7831A14230k1131j1417n2196K3518k144K1197j5563l9789l7424k2950l740L057
$$ 114230 93099 81682 29486 53004 50860 72057 56494 16705 -20719 -43669 -47409 -44352
7819d4352j048k55k2960K7437L4410j00777j9649N3624k316j0265M2459L1924
$$ -44352 -45400 -45655 -68615 -41178 -6768 -107545 -127194 -73570 -75886 -86151 -43692 -11768
7807a1768m0558k0805O970J5825K6552j8217l5161K7831J917M8619J5103p910
$$ -11768 -52326 -73131 -66161 -50336 -23784 -42001 -77162 -49331 -47414 1205 16308 8398
7795H398j1489n3565n1537L526p989J4530L0776P4972N938m5995l6275m387O126
$$ 8398 -3091 -56656 -108193 -104667 -112656 -98126 -67350 7622 13560 -32435 -68710 -73097 -66971
7782f6971J4398K9838M6456k3471n0080P1418P1466j2741J1512K4047k7197p4674
$$ -66971 -52573 -22735 23721 250 -49830 21588 93054 80313 91825 115872 88675 14001
7770A4001l2485N8573J9707j3142l8459J1271L9074l5531L416K169l4835k126
$$ 14001 -18484 40089 59796 46654 8195 19466 58540 23009 26425 28594 -6241 -8367
7758h367J6096m9762L8306l1957p2852k1633K2683J2309P908M0371j5059n4022
$$ -8367 7729 -42033 -3727 -35684 -108536 -130169 -107486 -95177 -87269 -46898 -61957 -115979
7746a15979L8960L9340O4552O4032o4455n2896l0926j8254L3867J10592M7786
$$ -115979 -77019 -37679 26873 90905 26450 -26446 -57372 -75626 -41759 68833 116619
7735A16619p8461m008k2194q4827M11N4669K9263l1034K1309N9378J6634o668
$$ 116619 38158 34150 11956 -72871 -72460 -17791 11472 -19562 1747 61125 77759 71091
7723G1091j9492K697l2321o4656l3267J4325N4705J5059k864K0015P226J1689
$$ 71091 51599 54296 21975 -42681 -75948 -61623 -6918 8141 5277 25292 32518 44207
7711D4207p1066l7358L9044M9680N1278K1860q619k2186k8553l6959l6093K5009
$$ 44207 -26859 -64217 -25173 24507 75785 97645 89026 66840 38287 1328 -34765 -9756
7699i756O423l637P4220l7507l5856Q343k4858m888K0590j3930J8086L3076m1182
$$ -9756 -3333 -6970 67250 29743 -6113 2230 -22628 -27516 -6926 -20856 -2770 30306 -10876
7686a0876n760L199k0826L1385M6167j635j5948P376j5324j9399K2829Q867K08
$$ -10876 -16636 -13437 -34263 -2878 43289 41654 25706 33082 17758 -1641 21188 30055 30263
7673C0263L6097j9559o1552j5391k0246o542N3491K1272r18k5829L765j269J0513
$$ 30263 66360 46801 -14751 -30142 -50388 -56930 -3439 17833 16915 -8914 -5149 -6418 4095
7660D095j3802o760o2517m6775K8528M7096N0558L7415J8789m8734k2255L3890
$$ 4095 -9707 -16467 -78984 -125759 -97231 -50135 423 37838 56627 7893 -14362 19528
7648A9528J084m8397L2562N696k3917L5409k5687q5658J844Q109o4945J0065P8113
$$ 19528 20612 -27785 4777 10473 -13444 21965 -3722 -89380 -87536 -79427 -144372 -134307 -56194
7635e6194L1460J7799j4280J118j7333p4732N4378Q7553K1242R506L0291k5390
$$ -56194 -24734 -6935 -21215 -20097 -37430 -112162 -57784 29769 51011 60517 90808 65418
7623F5418m4658J4280j7486m2850j7185j8856j395O588l812J2510L6651M9813
$$ 65418 20760 35040 17554 -25296 -42481 -61337 -62732 -56144 -59956 -47446 -10795 39018
7611C9018m3489m9025j8732N3707M3438m0738m5768k1883P3974o787j579o708
$$ 39018 -4471 -53496 -72228 -18521 24917 -15821 -61589 -83472 -9498 -16285 -17864 -24572
7599b4572q5042j9346N9529M0852J5680R010K7885N4607j0806k618K0113J998
$$ -24572 -109614 -128960 -69431 -28579 -12899 -3889 23996 78603 67797 65179 85292 87290
7587H7290o6841n3668l3447l3682L5276L0413M5871k2123k4167P208P567r214
$$ 87290 20449 -33219 -66666 -100348 -65072 -34659 11212 -10911 -35078 -27870 -20303 -29517
7575b9517M455m077j8377L9142K3338k6413j6322l743J3562j3874j8307j8575
$$ -29517 -25062 -29139 -47516 -8374 14964 -11449 -27771 -31514 -17952 -31826 -50133 -68708
7563f8708J1609N3300k8519j7080J1726m3643k1559k2214K6578N1714k045l7344
$$ -68708 -57099 -3799 -32318 -49398 -37672 -81315 -102874 -125088 -98510 -46796 -48841 -86185
7551h6185N196k3236J9738j8090k7769R4566M4967j6757n7086j3639K4341J118
$$ -86185 -80989 -104225 -84487 -102577 -130346 -35780 9187 -7570 -64656 -78295 -53954 -52836
7539e2836l9338M0017K1029j0410p539l5868K7892N245l1504k2118j9485m3147
$$ -52836 -92174 -52157 -31128 -41538 -49077 -84945 -57053 -51808 -83312 -105430 -124915 -168062
7527a68062K3756Q3521K0624Q974r1094p135M5002N6199k0880J9281K1993M446
$$ -168062 -144306 -60785 -40161 -31187 -122281 -129416 -84414 -28215 -49095 -29814 -7821 -3375
7515c375m9331l1305P8374Q9916J7682n1022k5233m1579q94j627k7400J3826J1313
$$ -3375 -52706 -84011 -5637 84279 101961 50939 25706 -15873 -16767 -18394 -45794 -31968 -20655
7502b0655K7296n254J1975J8593l1012K3708N233k8352n9407K6067K8956l6697
$$ -20655 6641 1387 13362 31955 943 24651 29884 1532 -57875 -31808 -2852 -39549
7490c9549R827k7824m949M8621k6665l1540r62R733J8645j8121J2170K6420j7413
$$ -39549 -29722 -57546 -62495 -13874 -40539 -72079 -73041 -63308 -44663 -62784 -50614 -24194 -41607
7477d1607O313N7719k5567p9358j7581K6410j3277K9827M5526L5390K0207q29
$$ -41607 -35294 22425 -3142 -82500 -100081 -73671 -86948 -57121 -11595 23795 44002 43173
7465D3173L6610j6212q9372K2034J3052L4008K8083l5631p4014R225j648j6721
$$ 43173 79783 63571 -25801 -3767 9285 43293 71376 35745 -38269 -29044 -30692 -47413
7453d7413M3387j4000Q572p198K2488l7191p4426Q133k080R6345K3643n5769n9867
$$ -47413 -4026 -18026 -9454 -16652 5836 -31355 -105781 -97648 -99728 -3383 20260 -35509 -95376
7440i5376m0116r119K9726O2377L3677Q7296R455p0017n9487J9375O0861l8779
$$ -95376 -135492 -144611 -114885 -52508 -18831 68465 77920 7903 -51584 -32209 28652 -10127
7428a0127l3536n4310L0946N8469J7528m379q066L5234q38l0065L7599m1668p2615
$$ -10127 -43663 -97973 -67027 -8558 8970 4591 -3475 31759 30921 856 38455 -3213 -75828
7415g5828l5036P2358M6685j0277p1363L0370P7437j8918l8058j442l1853L177
$$ -75828 -110864 -38506 8179 -2098 -73461 -43091 34346 15428 -22630 -24072 -55925 -52748
7403e2748L3162N5880P7716r673j3762m9499K841l3200P603O1341K6096k5677
$$ -52748 -19586 36294 114010 104337 90575 41076 43917 10717 18320 79661 105757 80080
7391H0080k5159p9250J1668J64j072M6950r633M9172N0826l0922m4247j6296k3802
$$ 80080 54921 -24329 -12661 -12497 -13569 33381 23748 72920 123746 92824 48577 32281 8479
7378H479O7055m5347o2148K1708N1819j9134p3429n24K1775k7282o410p635k773
$$ 8479 75534 30187 -31961 -10253 41566 22432 -50997 -51521 -29746 -57028 -63438 -71073 -73846
7365g3846J4022k3692L6553k855K0867j591n4676K9931M9294j4174K1148k6459
$$ -73846 -59824 -83516 -46963 -49818 -28951 -30542 -85218 -55287 -5993 -20167 981 -25478
7353b5478l9563O991L9577K1437l1465j9960N5270j354J9377R332l2359q3786
$$ -25478 -65041 -58050 -18473 2964 -28501 -48461 6809 5455 24832 34164 1805 -81981
7341h1981K7367j4777J1480Q6861N1039J2288j4945k9188k3842k9889o090l0938
$$ -81981 -54614 -69391 -57911 28950 79989 92277 77332 48144 24302 -5587 -11677 -42615
7329d2615K6768N593m5549N1529L4145m8583k3861r122j6965j4751K9216J0762
$$ -42615 -15847 -10254 -55803 -4274 29871 -18712 -42573 -51695 -68660 -83411 -54195 -43433
7317d3433K7004N0076m1735k8409k4322l9760j3672M6445K0671J2810k5285p683
$$ -43433 -16429 33647 -8088 -36497 -60819 -100579 -114251 -67806 -47135 -34325 -59610 -67293
7305f7293M852o075k4122l0412K9100N5708n652K1878M0670l7744J91L338J263
$$ -67293 -62441 -68516 -92638 -123050 -93950 -38242 -43894 -22016 18654 -19090 -18899 -15561 -14298
7292a4298L2594k8221M080j02412o8330R513R0144O8426m46L8406R383K0961l7951
$$ -14298 18296 -9925 -5845 -108257 -176587 -167074 -76930 -8504 -8950 29456 38839 59800 21849
7279B1849n3115l3550K752l1279J3L3244m6203L0696M3393J2480j867P4249M8338
$$ 21849 -31266 -64816 -62064 -93343 -93330 -60086 -106289 -75593 -32200 -19720 -21587 52662 101000
7266A01000j6186n6588n728L2122P375J0690m5308n4346M0934J1641J4949j605
$$ 101000 84814 28226 22498 54620 61995 72685 27377 -26969 13965 25606 40555 38950
7254C8950p1216M174N7908P6093K4521r5192j3330J877m8945M6091P6173p951
$$ 38950 -32266 -28092 29816 105909 130430 35238 21908 23785 -25160 20931 97104 89153
7242H9153m5622n4431P465J1536k0675j7123K5436J0125n563l8773m0660l0315
$$ 89153 43531 -10900 -3435 8101 -12574 -29697 -4261 5864 301 -38472 -79132 -109447
7230a09447j1544K5838M7836L1242L5922L306j05299K4796Q5538R210m776m6374
$$ -109447 -120991 -95153 -47317 -16075 19847 23153 -82146 -57350 28188 37398 32622 -13752
7218a3752J4525j9286r84l869L1906L5593L2652o5419m2360K433j1443k3578q707
$$ -13752 773 -18513 -19497 -23366 8540 44133 76785 11366 -30994 -28561 -40004 -63582 -72289
7205g2289M9980j0122N128j0215K982J01900n140l9076m6293o6788L69O5742L1089
$$ -72289 -22309 -32431 -27303 -37518 -34536 67364 62224 23148 -23145 -89933 -89564 -23822 7267
7192G267K3584k3764o6455J9700N8379j3142k203j3132j6149n0247K909L1618
$$ 7267 30851 7087 -59368 -39668 18711 5569 3366 -9766 -25915 -76162 -73253 -41635
7180d1635k7226L6614m297p5995o306N1718K1323R4166j2377m1473J2236j7722
$$ -41635 -68861 -32247 -36544 -112539 -118845 -67127 -45804 48362 35985 -5488 6748 -10974
7168a0974N239k1617m7765J8431Q2711K1970R007j1264m408L0298n1004l1906
$$ -10974 -5735 -27352 -75117 -56686 26025 47995 57002 45738 41330 71628 20624 -11282
7156a1282q2677R952K8291M2956M6816r132k7575J1758N8410L0436r069n49r826
$$ -11282 -93959 -84007 -55716 -12760 34056 24924 -2651 9107 67517 97953 88884 88335 78509
7143G8509P827K959J5202k8096n3684k5519J0182j081k8347l1800L4696m3188
$$ 78509 86336 89295 104497 76401 22717 -2802 7380 6299 -22048 -53848 -19152 -62340
7131f2340P214M5206k5683l2951k1297j1224J9386L5157p3316n9771j0026Q1561
$$ -62340 -55126 -9920 -35603 -68554 -89851 -101075 -81689 -46532 -119848 -179619 -189645 -108084
7119a08084L2511p5424j6306P3522q784L658N9396k4701K2764L0342l469K6473
$$ -108084 -75573 -150997 -167303 -93781 -102565 -98907 -39511 -64212 -41448 -11106 -14575 11898
7107A1898J0672o182l9857k2782J5543O503L1754J811l2328p8811j88M4721J01573
$$ 11898 22570 16388 -23469 -46251 -30708 -24205 7549 9360 -22968 -101779 -101967 -57246 44327
7094D4327j1773m4269K2856L1366L3841m2748l7864p183K7455m3585L1058l7242
$$ 44327 32554 -11715 11141 42507 76348 33600 -4264 -11447 16008 -27577 3481 -33761
7082c3761j9324j862N0974M2078N3640l4034o7844o1116L6907r020L6556p492
$$ -33761 -53085 -54947 -3973 38105 91745 57711 -10133 -71249 -34342 -43362 -6806 -14298
7070a4298J3649M462l1461j404q107o0842k846N130O1869N1363N8039k8432o4706
$$ -14298 -649 3813 -27648 -29052 -37159 -98001 -100847 -95717 -33848 17515 75554 47122 -17584
7057a7584j8792J0035j5544k2993j1230K4522N055m6537o6651K7945J05957N3538
$$ -17584 -36376 -26341 -41885 -64878 -76108 -51586 -46531 -93068 -159719 -131774 -25817 27721
7045B7721J6262m1117l2922L721J235n7638J4727j8634j3295N9955j7306m6254
$$ 27721 43983 2866 -30056 -26335 -25100 -82738 -68011 -86645 -99940 -39985 -57291 -103545
7033a03545j0983J25805j1656p7101o6627L2929M7916L3137M3609M4447k527o5870
$$ -103545 -114528 11277 -379 -77480 -144107 -111178 -63262 -30125 13484 57931 55404 -10466
7021a0466K9341o563K1530l8842m3821N5225l2878l4405L4746M8529J6308n8531
$$ -10466 18875 12312 33842 -5000 -48821 6404 -26474 -60879 -26133 22396 38704 -19827
7009a9827o1420l0198k6587M1266M7354r655j9707N7928K1991n2393l804L1887
$$ -19827 -81247 -111445 -138032 -96766 -49412 -59067 -78774 -20846 1145 -51248 -55052 -23165
6997b3165M2659J0703m0298r932M9147k0344m5464N8331M4910M3400K8142o2133
$$ -23165 19494 30197 -10101 -20033 29114 8770 -36694 21637 66547 109947 138089 75956
6985G5956j7081K200O995K3690l6592m9246m7951O7629l5454m9573K7697j9454
$$ 75956 58875 61075 68070 91760 55168 5922 -42029 25600 -9854 -59427 -31730 -51184
6973e1184P142K9590l6949j6900J2673P3519K3464k459k7263n4896m0014j7584
$$ -51184 -44042 -14452 -51401 -68301 -55628 17891 41355 38896 11633 -43263 -83277 -100861
6961a00861L047J9108L5588r536K5757M5266k3262m5647L4999N3135L1314J9968
$$ -100861 -97814 -78706 -43118 -52654 -26897 18369 -4893 -50540 -15541 37594 68908 88876
6949H8876r420n9974n3972J2714q447K5673n3173L4557O0204L4885l1417o3898
$$ 88876 79456 19482 -34490 -21776 -30223 -4550 -57723 -23166 37038 71923 40506 -23392
6937b3392k3330L139N2234M7975L5518L648o7753m5387K6172n1984R995K7383
$$ -23392 -46722 -43583 8651 56626 92144 95792 28039 -17348 8824 -43160 -33165 -5782
6925e782P9369k5438n2926m1763P672j4860k9362m866J0614Q471m1351j045J8742
$$ -5782 73587 48149 -4777 -46540 -38868 -53728 -83090 -87956 -77342 -68871 -110222 -111267 -92525
6912i2525M9528L7553N9404n3298q0518l7008L6585J21923N3617m1307k9682N219
$$ -92525 -42997 -5444 53960 662 -79856 -116864 -80279 41644 95261 53954 24272 29491
6900B9491L4945L1435m3765o7930l1068L3720k1092o3175l8676J7185R8867R8638
$$ 29491 64436 95871 52106 -15824 -46892 -13172 -34264 -97439 -136115 -118930 -20063 78575
6888G8575r692k494l701M6750O4433l4509j29899l2146L4174m6050j0422N2203
$$ 78575 68883 66389 62688 109438 173871 139362 9463 -22683 11491 -34559 -44981 7222
6876G222P6467o3096o5546k6044j3047j1265L2200k7721j6970j7731k1345N4152
$$ 7222 83689 20593 -44953 -70997 -84044 -95309 -63109 -90830 -107800 -125531 -146876 -92724
6864i2724P3666J9571j9636J3385M641l4050P08P0024Q113k4086n0978K4692K8647
$$ -92724 -19058 513 -19123 -5738 -1097 -35147 -34439 35585 43698 19612 -31366 -6674 21973
6851B1973l971m2331M34k030O967L8097J7154O433k3894m5516q8163n6021Q3599
$$ 21973 18002 -24329 -23895 -25925 -18958 19139 36293 42726 18832 -26684 -114847 -170868 -87269
6838h7269Q2658j2156M2196J891m0904o7152J9296J7769M7686K5234K2737j5299
$$ -87269 -4611 -16767 25429 27320 -13584 -80736 -61440 -43671 4015 29249 51986 36687
6826C6687o830j0879R142m9993l9873M3924R6948P4486k4129o7443j0197q008
$$ 36687 29857 18978 28120 -21873 -61746 -17822 79126 153612 129483 62040 51843 43835
6814D3835l2324m1983J844O467k7147J1825l764j4927j8222j7059j5059K6228
$$ 43835 11511 -30472 -28628 -22161 -49308 -37483 -41247 -56174 -74396 -91455 -106514 -80286
6802h0286L107o2623L3663J05543K4234M6919L7542m2527m5998j7988l3994n3328
$$ -80286 -77179 -139802 -106139 -596 23638 70557 108099 65572 19574 1586 -32408 -85736
6790h5736K9468M9463J2922L9229m1034p818M7536q2454j7727J940k1153K4632
$$ -85736 -56268 -6805 6117 45346 4312 -3506 44030 -38424 -56151 -54211 -75364 -50732
6778e0732n048M1305M5114k725l5994k795J655l3180L3876j4327J6052M912J4768
$$ -50732 -55780 -14475 30639 27914 -8080 -10875 -9220 -42400 -8524 -22851 -6799 -1887 12881
6765A2881p7738n4365K0652P3255K1868L2452j0650k0863J2877N3976o5070k6557
$$ 12881 -64857 -119222 -98570 -25315 -3447 29005 18355 -2508 10369 64345 -725 -27282
6753b7282j1266K6012N0984k4901R114l746J9554R3652R122m4598n0164l4033
$$ -27282 -38548 -12536 38448 13547 22661 18915 38469 132121 141243 96645 46481 12448
6741A2448l9855J8120N4596O2474k3780n1129N276J8924P614l1997O988l3969
$$ 12448 -27407 -9287 45309 107783 84003 32874 38150 57074 64688 32691 39679 5710
6729E710K104O85K2976K0649l7274o775j7918J3792M4531J2311o0594n4936k8496
$$ 5710 7814 8499 31475 52124 14850 8075 -9843 3949 48480 60791 197 -54739 -83235
6716h3235N1303O1345P0667J193k8689m7285k1787k759N6042j4395j5966q824
$$ -83235 -31932 29413 100080 101273 72584 25299 3512 753 56795 42400 26434 17610
6704A7610M8918k1895p5527l2092p0057k9955J4440M6316N6566K9446J6014j9632
$$ 17610 66528 44633 -30894 -62986 -133043 -162998 -148558 -102242 -45676 -16230 -216 -19848
6692a9848o4603M4289N9211o2994r2382j599O8437L6081O5113o0726K9305k1188
$$ -19848 -84451 -40162 19049 -43945 -136327 -137926 -69489 -33408 31705 -29021 284 -20904
6680b0904Q130K0435N1984j3765q7179o7556R546M1811L7932L0527M8620Q535
$$ -20904 -12774 7661 59645 45880 -41299 -108855 -99309 -57498 -19566 10961 59581 68116
6668F8116l8268j1842P511k9583o1720R562K6555N6196J7182j6252m371N640j8839
$$ 68116 29848 18006 25517 -4066 -65786 -56224 -29669 26527 43709 27457 23086 28726 9887
6655I887q69k7642j7066k4914l6432M3272l1139l2650K5057Q5881j7331o07L3424
$$ 9887 9018 -18624 -35690 -60604 -97036 -53764 -84903 -117553 -92496 -6615 -23946 -24553 8871
6642H871k0806r635k051m529r043l1362j7326J8774J8526l156J6987L2477J7162
$$ 8871 -11935 -21570 -23621 -28150 -37193 -68555 -85881 -67107 -48581 -51737 -34750 -2273 14889
6629A4889M797O0420P214m6539K0359K0P991L2109L886n7365n6460p2314Q7773
$$ 14889 19686 80106 87320 40781 61140 61160 69151 101260 105146 47781 -8679 -80993 6780
6616F780O8625J4364j0932q60o5304k8850L1584J2112o1056L953L8509J4419K1541
$$ 6780 75405 89769 78837 77977 12673 -16177 15407 27519 -33537 -29584 8925 23344 44885
6603D4885m6098l4483L3976q15k1875K2536l938J8092L02m1326j5939l635J8170
$$ 44885 -1213 -35696 -1720 -2535 -24410 -1874 -5812 12280 12582 -28744 -44683 -48318 -30148
6590c0148J2591M0957q514l8724l2673L7850O5841N6842m214n0976K3687J774
$$ -30148 -17557 23400 14886 -23838 -56511 -18661 47180 104022 99808 48832 72519 74293
6578G4293J8287R54l9788n3963j7115q7804j4586J3617P1626L4370n8218k0461
$$ 74293 92580 93534 53746 -217 -17332 -105136 -119722 -106105 -34479 -109 -58327 -78788
6566g8788L1708j5467Q3793k879n6139M3308M9904L8599j8606p8147R6412O953
$$ -78788 -47080 -62547 21246 18367 -37772 5536 55440 94039 75433 -2714 93698 100651
6554A00651k4519p3420m5663R701l3669j04523K8266K9930O3562j6608M3473K2803
$$ 100651 76132 2712 -42951 -33250 -66919 -171442 -143176 -113246 -49684 -66292 -22819 -16
6542a6K2267n17n2636L4358K083m4052J0000N3932k4316p1462N4383O0415Q818
$$ -16 22251 21734 -30902 3456 5539 -38513 -28513 25419 1103 -70359 -15976 44439 53257
6529E3257n814J24n4609o392L0088J7971O670m023m8512L3246P004m8704L2981
$$ 53257 47443 47567 -7042 -13434 16654 34625 41295 37272 -11240 22006 29010 -19694 13287
6516A3287M1624N3014n7651m4189j5557n3356N0182J1423n3085K2645O4757m1676
$$ 13287 54911 107925 50274 6085 -9472 -62828 -12646 -1223 -54308 -31663 33094 -8582
6504h582o1440j0072O1464L878L131P816J0441n125J2186J5841q063m0476P0352
$$ -8582 -70022 -80094 -18630 -14752 -11621 -3805 6636 1511 13697 29538 21475 -19001 51351
6491E1351L4627j3355K2299j1572k7114M229n4347j3800M3262J8580m6939k6874
$$ 51351 85978 72623 94922 83350 56236 60465 6118 -7682 35580 54160 7221 -19653
$$ [...]
##END NTUPLES=NMR SPECTRUM
##END=
