##TITLE=Analysis number 318403
Compound Code cc 48613
Book Reference 483/2
Project Code adrs
Chemist Name mattw
##JCAMPDX= 6.0         $$ Bruker NMR JCAMP-DX V2.0
##DATA TYPE= NMR SPECTRUM
##DATA CLASS= NTUPLES
##ORIGIN= Bruker BioSpin GmbH
##OWNER= nmr
$$ XWIN-NMR		Version 3.5
$$ Tue Mar 28 11:08:12 2006 GMT Daylight Time (UT+1h)  MAYBRIDGE\nmr@NMR_250MHZ
##.OBSERVE FREQUENCY= 250.131544655141
##.OBSERVE NUCLEUS= ^1H
##.ACQUISITION MODE= SIMULTANEOUS (DQD)
##.ACQUISITION SCHEME= undefined
##.AVERAGES= 16
##.DIGITISER RES= 18
##SPECTROMETER/DATA SYSTEM= dpx250
##.PULSE SEQUENCE= zg30
##.SOLVENT NAME= CDCl3
##.SHIFT REFERENCE= (INTERNAL, CDCl3, 0, 16.522)
##AUDIT TRAIL= $$ (NUMBER, WHEN, WHO, WHERE, WHAT)
$$ ##TITLE= Audit trail, XWIN-NMR		Version 3.5
$$ ##JCAMPDX= 5.01
$$ ##ORIGIN= Bruker BioSpin GmbH
$$ ##OWNER= nmr
$$ C:\u/data/dgb/nmr/ADRS/1560/pdata/1/auditp.txt
$$ ##AUDIT TRAIL=  $$ (NUMBER, WHEN, WHO, WHERE, WHAT)
(   1,<2006-03-28 11:07:38.06 +100>,<MAYBRIDGE\nmr>,<NMR_250MHZ>,
      <created by zg, POWCHK disabled, PULCHK disabled
       configuration hash MD5:
       84 BC 41 DB A1 6E 1D 46 DA 25 12 A5 C1 ED C5 3A
       data hash MD5: 64K
       1B F6 87 85 7E BF 94 31 09 F9 F2 A6 11 33 92 A2>)
(   2,<2006-03-28 11:07:53.89 +100>,<MAYBRIDGE\nmr>,<NMR_250MHZ>,
      <Start of raw data processing
       ef LB = 0.3 FT_mod = 6 PKNL = 1 SI = 32K 
       data hash MD5: 32K
       71 E0 8A D4 52 76 AD 59 88 96 30 17 B0 39 C9 A7>)
(   3,<2006-03-28 11:07:55.89 +100>,<MAYBRIDGE\nmr>,<NMR_250MHZ>,
      <apk 
       data hash MD5: 32K
       A1 65 4C 32 D4 C9 D7 5B AE FC 3D 88 4D 4A D3 A1>)
(   4,<2006-03-28 11:07:57.14 +100>,<MAYBRIDGE\nmr>,<NMR_250MHZ>,
      <abs ABSG = 5 
       data hash MD5: 32K
       D1 1F 71 BB DE E7 D5 B3 9F 02 79 BE 0F 9B 83 92>)
$$ ##END=
$$ 
$$ hash MD5
$$ 97 29 DC DE 8B 5A 37 18 E6 FA 34 D3 6B D5 EC 96
##$RELAX= 
##$RELAX= 
##$RELAX= 
##$RELAX= 
##$RELAX= 
##$RELAX= 
##$RELAX= 
$$ Bruker specific parameters
$$ --------------------------
##$DU= <C:\u>
##$EXPNO= 1560
##$NAME= <ADRS>
##$PROCNO= 1
##$TYPE= <nmr>
##$USER= <dgb>
##$AMP= (0..31)
100 100 100 100 100 100 100 100 100 100 100 100 100 100 100 100 100 100 
100 100 100 100 100 100 100 100 100 100 100 100 100 100 
##$AQSEQ= 0
##$AQ_mod= 3
##$AUNM= <au_zg>
##$AUTOPOS= <12 >
##$BF1= 250.13
##$BF2= 250.13
##$BF3= 250.13
##$BF4= 250.13
##$BF5= 500.13
##$BF6= 500.13
##$BF7= 500.13
##$BF8= 500.13
##$BYTORDA= 1
##$CFDGTYP= 0
##$CFRGTYP= 5
##$CHEMSTR= <none>
##$CNST= (0..31)
1 1 145 1 1 1 1 1 1 1 1 1 1 1 1 1 1 1 1 1 1 1 1 1 1 1 1 1 1 1 1 1 
##$CPDPRG= <>
##$CPDPRG1= <>
##$CPDPRG2= <>
##$CPDPRG3= <>
##$CPDPRG4= <mlev>
##$CPDPRG5= <mlev>
##$CPDPRG6= <mlev>
##$CPDPRG7= <mlev>
##$CPDPRG8= <mlev>
##$CPDPRGB= <>
##$CPDPRGT= <>
##$D= (0..31)
0 1 0 0 0 0 0 0 0 0.06 0 0 0 0 0 0 0.0002 0 0 0 0 0 0 0 0 0 0 0 0 0 0 
0 
##$DATE= 1143540456
##$DBL= (0..7)
120 120 120 120 120 120 120 120 
##$DBP= (0..7)
150 150 150 150 150 150 150 150 
##$DBP07= 0
##$DBPNAM0= <>
##$DBPNAM1= <>
$$ [...]
##$SUBNAM7= <"">
##$SUBNAM8= <"">
##$SUBNAM9= <"">
##$SW= 20.6930455092707
##$SWIBOX= (0..15)
0 0 3 0 0 0 0 0 0 0 0 0 0 0 0 0 
##$SW_h= 5175.983436853
##$TD= 65536
##$TD0= 1
##$TE= 294.16
##$TE2= 300
##$TE3= 300
##$TEG= 300
##$TL= (0..7)
0 120 120 120 120 120 120 120 
##$TP= (0..7)
150 150 150 150 150 150 150 150 
##$TP07= 0
##$TPNAME0= <>
##$TPNAME1= <>
##$TPNAME2= <>
##$TPNAME3= <>
##$TPNAME4= <>
##$TPNAME5= <>
##$TPNAME6= <>
##$TPNAME7= <>
##$TPOAL= (0..7)
0.5 0.5 0.5 0.5 0.5 0.5 0.5 0.5 
##$TPOFFS= (0..7)
0 0 0 0 0 0 0 0 
##$TUNHIN= 0
##$TUNHOUT= 0
##$TUNXOUT= 0
##$USERA1= <user>
##$USERA2= <user>
##$USERA3= <user>
##$USERA4= <user>
##$USERA5= <user>
##$V9= 5
##$VALIST= <valist>
##$VCLIST= <CCCCCCCCCCCCCCC>
##$VD= 0
##$VDLIST= <DDDDDDDDDDDDDDD>
##$VPLIST= <PPPPPPPPPPPPPPP>
##$VTLIST= <TTTTTTTTTTTTTTT>
##$WBST= 1024
##$WBSW= 4
##$XGAIN= (0..3)
0 0 0 0 
##$XL= 0
##$YL= 0
##$YMAX_a= 620440
##$YMIN_a= -919062
##$ZGOPTNS= <>
##$ZL1= 120
##$ZL2= 120
##$ZL3= 120
##$ZL4= 120
##$ABSF1= 16.522
##$ABSF2= -4.171173
##$ABSG= 5
##$ABSL= 3
##$ALPHA= 0
##$AQORDER= 0
##$ASSFAC= 0
##$ASSFACI= 0
##$ASSFACX= 0
##$ASSWID= 0
##$AUNMP= <proc_1d>
##$AZFE= 0.1
##$AZFW= 0.1
##$BCFW= 0
##$BC_mod= 0
##$BYTORDP= 0
##$COROFFS= 0
##$CY= 12.5
##$DATMOD= 1
##$DC= 0
##$DFILT= <>
##$DTYPP= 0
##$F1P= 14.0000005364418
##$F2P= -0.99999901652339
##$FCOR= 0.5
##$FTSIZE= 32768
##$FT_mod= 6
##$GAMMA= 0
##$GB= 0
##$INTBC= 1
##$INTSCL= 1
##$ISEN= 128
##$LB= 0.3
##$LEV0= 0
##$LPBIN= 0
##$MAXI= 10000
##$MC2= 0
##$MEAN= 0
##$ME_mod= 0
##$MI= 0
##$NCOEF= 0
##$NC_proc= -3
##$NLEV= 6
##$NOISF1= 0
##$NOISF2= 0
##$NSP= 0
##$NTH_PI= 0
##$NZP= 0
##$OFFSET= 16.522
##$PC= 1
##$PHC0= 170.6535
##$PHC1= 4.733571
##$PH_mod= 1
##$PKNL= yes
##$PPARMOD= 0
##$PSCAL= 4
##$PSIGN= 0
##$REVERSE= no
##$SF= 250.13
##$SI= 32768
##$SIGF1= 0
##$SIGF2= 0
##$SINO= 400
##$SIOLD= 32768
##$SREGLST= <1H.CDCl3>
##$SSB= 0
##$STSI= 32768
##$STSR= 0
##$SW_p= 5175.98343685301
##$SYMM= 0
##$S_DEV= 0
##$TDeff= 65536
##$TDoff= 0
##$TI= <Analysis number 999999
Compound Code 99
Book Reference 9
Project Code 9>
##$TILT= no
##$TM1= 0
##$TM2= 0
##$TOPLEV= 0
##$USERP1= <user>
##$USERP2= <user>
##$USERP3= <user>
##$USERP4= <user>
##$USERP5= <user>
##$WDW= 1
##$XDIM= 32768
##$YMAX_p= 314440036
##$YMIN_p= -55202
$$ End of Bruker specific parameters
$$ ---------------------------------
##NTUPLES= NMR SPECTRUM
##VAR_NAME=  FREQUENCY,     SPECTRUM/REAL,   SPECTRUM/IMAG
##SYMBOL=    X,             R,               I
##VAR_TYPE=  INDEPENDENT,   DEPENDENT,       DEPENDENT
##VAR_FORM=  AFFN,          ASDF,            ASDF
##VAR_DIM=   32768,         32768,           32768
##UNITS=     HZ,            ARBITRARY UNITS, ARBITRARY UNITS
##FACTOR=    0.157963299565203, 1,           1
##FIRST=     4132.6476996994, 0,             0
##LAST=      -1043.33573715361, 0,           0
##MIN=       -1043.33573715361, -55202,      0
##MAX=       4132.6476996994, 314440036,     0
$$ Real data points
##PAGE= N=1
##DATA TABLE= (X++(R..R)), XYDATA
$$ [...]
22649 -8374 -12457 -9057 -6042 -3562 -13363 -22121 -4482 2929 3223 -3882 -9014 -16558 -18130 -14308 -15218
22634 -15218 -8870 -3444 -18737 -20445 -14857 -12828 -4278 -2039 -15573 -20168 -17612 -15621 -23054 -14473
22620 -14473 -1284 -1327 3390 14261 18034 1800 -1419 1247 7821 8179 -1812 -4629 38 -5026
22606 -5026 -12628 -7632 536 2942 3520 663 -5066 1026 3670 1054 3153 5937 -1775 -7431 -3909
22591 -3909 -2705 -13504 -11276 -5290 3239 13885 11781 8620 7229 2358 3963 18900 20977 13164
22577 13164 1592 -6022 -10228 -15036 -18692 -12534 -14894 -20429 -8466 8635 10845 -934 -1931 7652
22563 7652 4321 2528 5330 3923 12141 10826 -12483 -17649 -6579 5687 -2493 -8529 -9487 -433
22549 -433 -1537 -6933 -18827 -18804 -1756 4887 262 18222 13172 16528 8774 8180 18369 22134 2243
22534 2243 -4988 2713 7668 -977 -5605 -11236 -12419 -10324 -22390 -16087 -2802 885 -7772 -8474
22520 -8474 -8660 -3220 -4002 2045 10087 6011 715 6307 3130 -7016 -19334 -14201 -10943 -3142 10621
22505 10621 11867 -2475 -14991 -11418 5457 3746 -2256 4684 5280 6104 -1703 -754 7391 7497 494
22490 494 5287 7252 3068 -10469 -13505 -10900 8868 24728 22390 8047 -857 -3965 4253 1407
22476 1407 -13649 -7288 -688 -9159 -17189 -14225 -17526 -10730 -11152 191 17153 10371 7044 11880
22462 11880 12928 -1568 -24281 -24626 -15734 -2951 2167 1988 1318 1426 3255 20260 14863 -433
22448 -433 7533 1032 -5598 -7196 -16154 -28847 -14558 -10555 -12133 -10562 -22592 -29560 -13562 13230
22434 13230 19869 5570 2490 4248 10210 7026 10764 15511 5929 -372 6497 12694 364 -5804
22420 -5804 9810 14465 7031 6417 5739 -2539 -225 2698 5938 2221 7551 4947 -1626 -8929 -19415
22405 -19415 -19424 -17331 1779 10431 4052 5514 6519 6523 6005 5452 8538 4895 -4061 -12133 -16694 -15359
22389 -15359 -7454 -12588 -9081 -11345 4965 13107 17510 16407 13221 13540 12399 16 -4648 2445
22375 2445 17262 13662 6596 22801 20275 7891 2125 -9641 -12097 -6006 -7374 7049 9081
22362 9081 -1017 -4652 -4183 2822 6605 16250 19058 5207 -1362 -1764 -17679 -540 3042 -9775
22348 -9775 -5800 -628 -8253 -7363 -3264 -1992 7670 -3806 -1571 11094 543 -13823 -14796 -11258
22334 -11258 4308 10603 15345 13960 21680 17859 6214 -4837 -9610 -10969 -9934 -7104 -8059 -10770
22320 -10770 -16810 -16900 -14063 -16976 -23700 -9934 -16777 -30214 -30055 -20302 -4328 -1905 -4851 -5796 -12555
22305 -12555 -14146 -19151 -13912 -8888 -13825 -17691 -27899 -23217 -14565 -17754 -19233 -12350 -10817 -9076
22291 -9076 -18319 -10336 -16109 -12272 -10794 -5644 -3779 -3363 -14749 -13538 -3412 1897 -703 2805
22277 2805 13992 1865 -8825 -18073 -14807 -13059 -19076 -13365 -8165 -10786 -9594 -13633 -3072 -6518
22263 -6518 -5069 -12903 -17729 -7204 -14114 -14703 -5713 -12762 -11595 10919 13728 8014 12057 24618
22249 24618 29224 26683 26957 19231 -3077 -9109 -11271 -528 18353 24505 30626 10985 -8602
22236 -8602 -14988 -22649 -13747 -6556 -5582 -15130 -25163 -18667 -5677 2279 -8946 -7633 -12205 -24300
22222 -24300 -20079 7401 8749 -6955 886 3177 -10499 -4787 8443 5622 12913 11185 11630 8514
22208 8514 26362 25856 22654 17727 9478 19286 10245 6394 795 -10747 -1953 9319 3916 9220
22194 9220 9823 12329 10953 3984 -6834 -8483 -14814 -9306 -14382 -6948 -5005 -12507 -20681 -27864 -30681
22179 -30681 -21135 -13200 -3834 -1278 -2775 -10722 3178 -959 -13013 -18764 -20378 -33772 -16736
22166 -16736 -8463 -6537 -9006 -9991 -13506 -19055 -5425 -409 950 7993 14915 15830 3645 -5497
22152 -5497 -13684 3910 4314 1394 -4291 -6896 1673 12693 31609 36015 20095 12994 15299 19808
22138 19808 8530 9953 7046 1000 4413 3555 -5410 -13366 -10210 -5927 -16081 -15272 -7326 1812
22124 1812 11143 2676 15085 15595 11281 20847 19918 9998 -1070 -4508 13922 13099 4931 -5704
22110 -5704 -5229 -2919 2578 -293 -14174 -10193 -17317 5600 9441 2904 -8032 -4421 -829 4523
22096 4523 1196 -10985 -23467 -11311 296 2189 6430 9485 16436 14852 10870 2727 -7234 -8078
22082 -8078 -8298 1863 11288 13795 -58 -8644 -138 -4525 -10685 -3847 2476 10352 22936 15343
22068 15343 3870 -6331 -10116 -2092 1004 105 6452 9982 -1015 3563 -1951 -9381 8408 8629
22054 8629 3066 339 1954 -1587 -8317 -14218 -4632 -10986 -12234 -11232 -8908 -14018 4502 15620
22040 15620 7123 5176 -2917 -5572 7928 16676 3563 -785 -2292 -2142 7039 6910 16202 15579 10696
22025 10696 9842 -7171 -19264 -19049 -20343 -19743 -35866 -25055 -27330 -30341 -20689 -1306 9509 -315
22011 -315 -3204 -4615 -4668 -4898 -8378 -440 8607 6277 -1716 -1656 -774 4078 4115 -8151 -12898 -15056 -30394
21994 -30394 -32129 -30419 -23657 -16255 -26965 -21393 -22419 -24237 -12054 -5893 -1281 -11950 -18080 -20970
21980 -20970 -27433 -36305 -24004 -9859 -14117 -25210 -12930 -13968 -21105 -5921 1056 -4877 -2994
21967 -2994 -8287 -15230 -2493 4719 -185 -13918 -11315 -17055 -23644 -14826 -15031 -3067 -9474 -7773
21953 -7773 -6754 -23814 -19233 -8165 -5280 -8377 -12262 -7652 2102 -11084 -6542 -10834 -11557 -8249
21939 -8249 -5720 457 5137 6324 1455 5059 -4045 -2983 -439 3881 -10883 -21927 -23977 -16376
21925 -16376 -18874 -19538 -16074 -1592 12999 8050 2821 -1283 -7531 -8139 1488 7865 5457 6675
21911 6675 6018 -3320 3957 8289 5495 8305 5763 7285 2355 -8623 -6052 11386 9090 2320
21897 2320 5833 8366 4208 2580 8250 -970 -1347 -6971 -8660 -10901 1149 4423 14219 12995 2213
21882 2213 -3909 103 -6551 -5380 4260 -1409 -4054 2940 2331 -281 -786 -3265 -5487 -681 -8691
21867 -8691 -10072 -13995 -1891 5667 -4185 -2157 7946 15520 16051 8020 -11474 -14509 -16153 -21866
21853 -21866 -20550 -12667 -4283 1153 7835 643 -9674 -13550 -23044 -14580 -5185 -634 -8112 -19152
21839 -19152 -19201 -12457 -6557 -1437 -1241 13882 4665 -9306 -12836 -15965 -10941 6081 14600 19033
21825 19033 18369 7528 -13799 -20457 -17126 -12341 11357 30225 37904 24678 18510 -3195 -19226
21812 -19226 -24745 -19108 -4031 -17724 -17822 -16129 -3613 -4935 957 3567 -3252 18418 27321 8744
21798 8744 1043 -7053 -6870 -10982 -15570 -14622 -1730 -3466 -5284 4866 4863 10000 12986 9437 4740
21783 4740 2243 4589 15178 11706 2249 -13677 -8372 -18503 -41318 -41821 -20974 -13187 -20427 -10687
21769 -10687 11664 24428 25277 16957 -2234 -15366 -24900 -19242 -15065 -4953 -2760 -8304 -11857
21756 -11857 -19834 -18529 -16186 -11564 -1894 -2306 -6471 1189 -3078 -9532 -12094 -1069 5420 4026
21742 4026 12057 5770 -159 6319 2251 -8048 -9105 -10616 4354 -7874 -8280 -311 4389 2862
21728 2862 -7646 -6455 -9898 -12646 -3469 13770 16620 18649 9918 5802 -1226 -15257 -25480 -28371
21714 -28371 -23998 -26231 -20727 -7730 -4792 -16564 -16038 -20075 -26582 -27056 -11232 3109 3286 -4365
21700 -4365 1081 12480 19767 21577 9828 -246 -2782 -3416 -11987 -11613 -308 8056 7017 3658
21686 3658 9615 9233 7656 2003 -14232 -19478 -17523 -4964 10373 18642 15078 6787 -2565 -8994
21672 -8994 -13817 -11133 -7971 -6781 -4183 -1955 1753 2675 825 -7890 -16670 -35402 -35850 -32739 -28420
21657 -28420 -9477 -9135 -15150 -8641 -11316 -15871 -16293 -25808 -32001 -23644 -15518 -9632 -597 9542
21643 9542 10615 3401 -4855 -18204 -17628 -17950 -12102 6469 604 -5654 -3617 -6127 -17224 -7499
21629 -7499 -13491 -16324 -9863 -8430 -10035 3546 12681 -6078 -16842 -13615 -5261 -5728 -6762 -10010
21615 -10010 1607 8688 4454 -5500 -12701 -5497 -4549 -4737 -161 -24391 -18395 -5268 -6112 -4546
21601 -4546 6612 19904 12423 8988 14601 4934 -6799 2884 -3642 2331 13477 15772 -6589
21588 -6589 -11971 -9780 -17457 -14818 -4486 4747 -7317 -25744 -29370 -26731 -9062 1649 8453
21575 8453 18166 17307 29490 35324 32117 36372 22836 5967 -13087 -24200 -18190 -20781 -26107 -9645
21561 -9645 15095 16081 12061 -1974 7623 4212 8687 12821 -369 -7904 7928 3297 5016 2919
21547 2919 -3650 -7735 -8650 -13042 -5177 6895 12560 11523 584 -785 13816 28897 27990 14409
21533 14409 25661 26974 6956 -14841 -19782 -6294 -305 9736 21422 16869 14304 10421 22441
21520 22441 19292 12264 1735 -3678 -5107 9692 9738 -4351 -17229 -23314 -11532 -14115 -18476 -7838
21506 -7838 10879 11689 -108 -7186 -3946 3526 -12382 -17770 -18051 -16045 -1349 4590 -304 5946
21492 5946 7916 -3481 -1481 23162 33182 19928 7529 13307 11178 4271 6507 12458 2918
21479 2918 -4554 2319 10550 -15925 -23618 -15735 -6323 -1964 -15055 -8731 -10139 -10549 -11156 -19513 -5316
21464 -5316 16812 5875 -11282 -932 6661 -5951 -9294 -2898 8208 11582 5277 8002 18708
21451 18708 7124 2815 5623 11369 -686 283 -12147 -9610 -1992 -13926 -22338 -21042 -19214 -16999
21437 -16999 -21659 -21415 -13827 8186 19861 14598 -4091 -13632 -6399 4285 24462 39193 16338
21424 16338 -1759 -489 -5841 -17611 -16939 -5886 -10317 -17009 -32454 -31389 -15685 -8791 -10291
21411 -10291 485 2393 2068 3034 -1817 -11369 -20306 -15971 -4873 -16090 -20668 2671 5108 -14410
21397 -14410 -23015 -22842 -14308 -12415 -11015 -15938 -27072 -19400 -8548 -9870 -10078 -1644 6370 2777
21383 2777 -9060 -2240 3229 6961 5234 7339 -5042 -3359 -7977 -9005 -10179 -19929 -12287 -1205
21369 -1205 -4518 -19744 -14499 -7457 -780 -2041 -8324 -7607 -12723 -22534 -6874 -5088 -8785 -9453 -1760
21354 -1760 2700 -3837 -9439 1075 7114 8121 14993 8414 -609 3347 2888 -317 624 6527 6623
21339 6623 3814 1773 -10925 -10045 202 6455 -3870 -17971 2614 9152 9617 4828 1978 8469
21325 8469 11522 -7717 -2046 -276 -21011 -11706 -3560 -9247 -4667 -62 6473 16060 18248 -2623
21311 -2623 -8920 -2037 -1331 12574 15085 4527 -4318 4962 12325 21469 16264 6200 2020 3874
21297 3874 7093 2166 -3548 -7705 -8341 -14839 -28607 -46118 -46283 -35268 -14921 -5145 -3463 -13291
21283 -13291 -12597 -16810 -14886 -9210 4577 5256 -8584 -27660 -20993 -11912 -9492 -8667 -12746 -9126
21269 -9126 -4809 -3849 -10178 -26375 -26913 -16085 -11735 -16987 -14822 -19073 -22173 -25282 -21482 -5519
21255 -5519 10054 13652 10498 14521 14306 13087 5338 -6525 -15510 -23415 -35839 -41956 -29477 -24818
21241 -24818 -33452 -37107 -21966 581 958 -16649 -23537 -7976 3097 -10404 -14490 -6048 -7610
21228 -7610 -4824 -10555 -3817 3698 6213 2332 6054 4349 -1766 1003 -2945 879 18043 20918
21214 20918 16221 13312 6569 -8564 -6387 -2939 -11411 -5229 -1314 6962 416 -13009 -10387 12500
21200 12500 14300 2757 -810 6756 12907 14808 6562 1662 -2816 1084 7597 6423 2272 7333
21186 7333 5544 -1271 -6684 -13200 -11461 -6859 -5633 726 -6655 -2029 672 -1538 5471 2762 -13276
21171 -13276 -7133 -5827 -2147 -422 1326 4455 4535 7141 2020 -1358 9581 11837 7015 -2134 7393
21156 7393 2678 -11653 -17353 -12225 -23072 -23994 -23358 -11181 5488 -3890 -18872 -9113 -20262 -24062
21142 -24062 -19370 -9126 -1607 -7714 -7410 3392 10645 20790 10617 1305 -5540 -149 1577 6321
21128 6321 -4688 -13931 -1317 11320 -2994 -7621 211 20235 32388 21182 13191 8707 5342
21115 5342 13407 10908 15234 4043 -6665 -421 13169 14989 8610 -4021 -2985 19334 19537 5468
21101 5468 -6270 -4772 2113 13457 19062 22144 13924 -1537 -15225 -17121 -27075 -21825 -10765
21088 -10765 -13143 -14351 -6610 -2459 -3595 -7743 -7984 -17741 -14023 -19102 -9824 -7320 -12951 -14101 -4498
21073 -4498 -10558 -11125 -7459 -9498 -7573 -18382 -11895 -23474 -27347 -23238 4004 7435 8407 12622
21059 12622 13255 5712 -5376 -6157 -13349 -13444 -8041 -6598 -8047 -4776 3121 -1244 -9622 -8566 -12529
21044 -12529 -14146 -5213 -6459 -7507 -17430 -19755 -8452 -6022 -15690 -35832 -35544 -26352 -22107 517
21030 517 6046 -12348 -17556 -23222 -16294 -6250 -4951 -10415 6095 14298 11612 -10305 -25589 -28028
21016 -28028 -19700 -4692 5529 514 337 3968 -7973 -12957 -6708 3212 -2778 -9056 2211 9366
21002 9366 11229 4078 -15013 -5324 540 904 -13329 -22856 -25731 -16601 -7129 -14228 -6670 -5588
20988 -5588 -599 5801 4039 8428 4162 -9637 -3983 -10461 -19324 -11034 -23882 -35210 -33050 -26173
20974 -26173 -24536 -17521 -61 1510 7532 3920 -2846 -5586 -6058 -1134 1538 -2251 -11412 -9330
20960 -9330 2619 -3242 -6626 -9426 -14904 -16532 -17145 -23722 -10909 -3732 -8199 -2034 -5094 -339
20946 -339 -5708 -5926 4634 6969 16335 16284 9918 4997 -8201 -22279 -21261 -11888 -13835 -11491 -27546
20931 -27546 -30729 -14501 -1186 -2595 576 -1097 -12679 -9116 5072 -5554 -12362 -11505 -9075
20918 -9075 -7394 -6197 -16540 -18881 -2828 4893 -3833 -12233 -11550 -9462 -2132 -440 6552 12314
20904 12314 -4510 -15664 -21300 -17493 -4817 1609 -9144 -8677 -3403 3095 2917 1357 -11566 -8402
20890 -8402 4526 9340 8923 444 -10084 -7284 -15318 -18469 -23934 -16774 4025 8826 -3524 3630
20876 3630 -2151 -13207 -23983 -9773 -16809 -9419 4296 -5057 456 8576 4612 -4935 -23655
20863 -23655 -21713 -10181 -3207 -1124 -1742 -315 -14895 -25066 -22138 -20636 -24453 -21689 -24241 -30254
20849 -30254 -12816 -7573 -10052 -18342 -24100 -20123 -12807 -13708 -15755 -17602 -16109 -13767 -22488 -30050
20835 -30050 -38589 -32303 -11207 12698 8639 3759 -4650 -1649 4150 -7301 -13922 -12120 -28364
20822 -28364 -18944 -2417 3252 -10391 -10472 -8722 -10013 -8177 -11769 -13293 -5847 3365 3849 13870
20808 13870 18453 30184 36222 3996 -11171 -15543 -11954 -3230 13117 12663 2530 -18599 -26329
20795 -26329 -22152 -22283 -29544 -16586 -10856 -16232 -16432 -18005 -15539 -24988 -19122 -2777 4871 -568
20781 -568 -4595 -13027 -12415 -9882 -9913 -12381 -4656 -1129 2780 -1952 9265 15601 10069 4073 10626
20766 10626 21137 23408 17449 2205 6629 6576 -4472 -25571 -29700 -30723 -34654 -23036 -11084
20753 -11084 7740 4048 74 4535 5543 -2874 -5150 -14108 -22627 -17774 -11019 -5089 576 3699
20739 3699 3030 10276 10060 4497 14992 16175 9476 829 -11102 -10739 -5605 9889 881 -4729 -6705
20724 -6705 2302 16565 11381 9035 3932 115 937 1203 -4801 -10625 -5159 1191 -1500 288 -15883
20709 -15883 -23038 -13455 -2608 -1896 812 9876 24937 18126 -5877 -3319 4150 11626 -3387 -15705
20695 -15705 -18050 -13717 711 21243 25000 -5018 -15426 -19722 -15695 -6349 -2508 -16801 -19903
20682 -19903 -5199 -1429 -5805 -25040 -20336 -6092 -4055 -3298 -12792 -13333 -20267 -24410 -17207 -17069
20668 -17069 -28648 -17508 -16416 -25083 -15105 -14249 -21281 -13880 -8895 -11247 -18487 -26595 -15482 -5925
20654 -5925 -5936 -15180 -32167 -35897 -24240 -19624 -29861 -25443 -19679 -11103 -6207 -876 -1970 -4361
20640 -4361 2249 -1049 -1894 -12217 -13822 -4044 -338 6518 15961 19656 10012 699 -10940 -30720
20626 -30720 -33073 -26246 -18202 -17398 -17770 -17933 -13046 4764 20570 13812 1814 -1451 -220 -21512
20612 -21512 -17359 -10097 -12380 -27218 -37920 -32909 -25586 -6669 9535 8569 -3419 -9803 -5162
20599 -5162 -10227 -15424 -12128 -6827 -5377 -1754 2925 -8020 -18627 -21076 -16526 -28591 -28086 -30022
20585 -30022 -31751 -27454 -26805 -26202 -22661 -23376 -27528 -9482 6535 17720 5840 -6163 -14829 -10754
20571 -10754 8338 -3077 -9904 -10067 -21361 -24391 -34810 -38972 -30352 -16181 -9725 -5574 4724
20558 4724 2507 -6710 -2362 -2780 -569 -2386 2032 10304 6753 272 1202 2730 -4607 -13466 -20024
20543 -20024 -16611 -4417 -5716 2728 14872 -2260 -21311 -23856 -13360 -2914 -6407 -3166 11078
20530 11078 17628 11087 1266 -9519 -7363 -16782 -19730 -16687 -20339 -12919 -8679 4401 13046 2930
20516 2930 17994 15518 3331 -13042 -23211 -23504 -28864 -28319 -21025 -7548 -5767 1435 -9282 -14657
20502 -14657 -6296 -2673 -11211 -26489 -34515 -30251 -18480 -27409 -29282 -14527 -455 3211 -6799
20489 -6799 -17952 -22667 -12443 -945 -2871 -15867 -19599 -17667 -26262 -18724 -16348 -4023 -16458
20476 -16458 -28003 -39338 -39373 -38075 -28035 -19668 -6317 -8066 -25074 -32010 -33472 -22513 -17215
20463 -17215 -14298 -27204 -25577 -13125 976 -1217 -7903 -10007 4044 2665 -4068 -11572 -3573
20450 -3573 15669 22243 21663 15694 -7009 -1992 4356 13654 5244 16059 24281 36716 25575 20082
20436 20082 18164 19035 8334 -3061 -4186 5923 -6263 -9305 4629 13287 6831 6044 10522 13334
20422 13334 23220 28345 26701 42347 54947 71871 78562 91566 103420 120120 133881 140928 142507
20409 142507 139891 140603 163794 181865 201613 218111 237903 250350 250462 237793 191177 165187
20397 165187 156773 152889 151502 151995 152021 144172 124313 100180 82985 68868 53293 33009 22270
20384 22270 16854 11902 3902 -5140 -6364 1410 592 -377 -3617 2015 8812 3772 5305 12911 1851
20369 1851 -1819 10399 5192 7569 10215 3221 5587 15564 23148 21440 28082 23908 17717 12312
20355 12312 5536 -1070 13368 15674 18977 9876 -9257 -11390 -24975 -26827 -31161 -45326 -42330
20342 -42330 -21758 -11276 -4714 13139 14681 9158 10378 -8896 -16352 -853 7056 8400 15897
20329 15897 15019 6409 10058 3471 5099 11511 10265 17937 10583 1609 -1624 -9719 -2951 3965 5991
20314 5991 8959 11283 8234 -6486 -8974 -17905 -3085 8537 16133 31607 28299 20023 4244
20301 4244 -6340 -6328 -8273 -210 -12689 -17271 -21543 -37141 -33851 -25388 -24626 -16957 -19514 -30349
20287 -30349 -18732 -11382 -19248 -14094 -16936 -29113 -17558 -14409 -25914 -30859 -15425 -17189 -16621
20274 -16621 -5550 -6358 -12714 62 -11869 -11340 -7522 -8360 -1428 2874 6273 9060 -5075 -1725
20260 -1725 -10272 -16421 -7850 -2253 -9483 -18729 -14955 -13088 -12146 -9415 8298 11741 -1300 -18436
20246 -18436 -31016 -31756 -20589 -17309 -19921 -15165 -1720 49 -3439 -5628 -4865 -7542 -140 -325
20232 -325 7885 1744 -3124 -12275 -26446 -26738 -25764 -28664 -13778 -8207 -5357 5710 -12392 -17553
20218 -17553 -27336 -39418 -33290 -25729 -12303 -3149 -7255 -10374 -9563 -1760 2596 -11166 -6988 -12263
20204 -12263 -17869 -13856 -16377 -27826 -29302 -23025 472 7528 3151 -4259 -9765 -6979 -14532 -20835
20190 -20835 -23084 -17379 -14830 -14584 -15260 -5995 5053 -6801 -23271 -14156 -6541 1175 14679 2300
20176 2300 -11555 -12812 -17022 -9573 -2022 -3492 2946 2950 4900 22011 30191 24632 9989 5972 14844
20161 14844 13293 -2401 -4006 -5357 4005 11155 7319 1120 -15539 -46028 -39506 -23060 -20417
20148 -20417 -17655 -13520 -12555 -13194 -13717 -8877 786 1310 -8234 -10292 -7498 -14628 439 397 4474 -3149
20132 -3149 -20258 -15960 2341 70 -9985 -5583 -1766 -12319 -5943 2228 -18394 -17649 -11260 -2385
20118 -2385 3010 2583 1434 3952 -913 1712 5521 4729 -4726 4556 -4746 -8803 -4873 -9585 -23786
20103 -23786 -28397 -15015 -1149 -12650 -11453 9176 12287 856 -6291 -20264 -28061 -21434 -8585
20090 -8585 -1809 4947 5414 12473 -1544 -6296 -7602 -18891 -19467 -24995 -19417 -16039 -15424 -6556 -5025
20075 -5025 11271 11856 -5868 -21725 -26011 -31328 -35112 -20830 -9375 -11556 -16782 -21618 -22215 -13422
20061 -13422 -9540 -4235 -492 -9924 235 -4351 -15623 -7087 2709 7369 2301 -6824 7304 18019
20047 18019 4679 -11978 -9582 4161 -1286 -2657 5780 -771 -17818 -27123 -9078 -4171 -15307
20034 -15307 -24897 -23513 -20995 -28293 -22523 298 12491 -8455 -11310 5895 17705 24360 15215
20021 15215 7750 13981 14072 18898 12545 229 -6685 -12961 -11697 -1470 -1565 2777 1741 -1994 8216
20006 8216 10936 5133 711 3550 -6453 -1195 1926 -7151 -9856 -2412 9787 4516 -8218 -19017
19992 -19017 -22986 -14167 -14408 -7995 -8636 -12207 -5941 5657 7456 18071 33654 30150 26461 24618
19978 24618 11487 -6869 -7957 -4555 -5384 -14197 -10532 -5191 485 126 -11376 768 8792 8677
19964 8677 5031 -102 -8065 -7308 269 -18467 -22282 -16603 -9702 -6525 -1495 10857 20188 10956
19950 10956 5045 10519 3985 -6799 -10954 -15534 -17814 -25292 -17942 -8258 -6937 -20783 -26951 -16932
19936 -16932 -15905 -8618 -5461 2521 3029 -2775 10290 33684 31633 18760 -3200 -23642 -21888
19923 -21888 -10461 -7170 11952 7473 -4228 -7583 -9201 -6601 -8692 -18542 -14882 -5366 -10336 -10298
19909 -10298 -9932 -10092 -14401 -9969 4964 7458 -2877 -19297 -30696 -31995 -44591 -39348 -36741 -39369
19895 -39369 -24055 7956 3363 -5023 -11274 -17007 1112 -5881 -9111 -5908 -9740 -22670 -19310
19882 -19310 -20585 -28716 -32771 -31253 -12840 -9432 -13497 -23957 -33115 -32441 -26502 -34928 -36126 -31003
19868 -31003 -33497 -29116 -11887 -15878 -19537 -8089 -8644 -9868 -12369 3004 13455 10214 -8489
19855 -8489 -10455 -3958 -4157 -12173 -12343 -4564 -12753 -19096 -7173 3135 2856 4869 -3206 -2532 609
19840 609 -6911 -936 4207 734 -2139 2122 -2837 6686 4540 -7166 -8402 -3252 4573 21055
19826 21055 3153 -784 2653 9746 16703 12722 4992 -1169 -2762 2337 1704 1142 -2430 -4531 -11663
19811 -11663 -9630 -569 -2454 8543 -7914 -22918 -16638 -10453 -3247 -10123 -24157 -20490 -21089 -4010
19797 -4010 -321 -6074 -12865 -2565 -12688 -15408 -11103 -10523 3196 1729 11367 20150 9497 -11051
19783 -11051 -18137 -10507 3550 12046 7163 -2809 -2512 1417 2876 -3772 -12085 -3204 -12423 -13481
19769 -13481 -2255 13632 18117 7857 -2948 -4545 7033 15150 17976 16991 13894 18708 12460
19756 12460 -1259 3172 23469 22646 13637 -1817 -1515 -6134 -5293 -2534 608 -1754 -8435 -6756
19742 -6756 5992 2068 7027 11640 16787 34937 26354 11307 2050 -16853 -22133 -11188 -12275
19729 -12275 -7396 -3507 3248 9767 24310 27521 22880 17971 10589 17094 15341 17789 16403 -4049
19715 -4049 -14185 -5768 -3181 -2856 -6446 5020 22528 27727 29378 34663 35988 33897 23877 6070
19701 6070 20962 39398 26286 15627 19427 24754 14096 10106 5605 5651 14931 20971 19571 20489
19687 20489 28255 18099 18072 19598 10416 24530 35695 42145 41769 48274 53820 49835 42192 26922
19673 26922 23123 26971 37125 35197 22297 31632 35795 37360 35152 50934 47213 43972 42453 40626
19659 40626 44166 41934 48196 50549 40516 43992 47755 52330 44960 59587 73443 72530 70184 78434
19645 78434 62583 54292 58284 55044 59183 62713 71092 66575 64136 68956 73339 81581 76069 65864
19631 65864 71951 68614 64199 68180 82379 76393 82478 90328 91221 87887 91748 95258 95186 94950 115107
19616 115107 116069 112833 117174 113180 122144 125050 119801 123575 130543 128906 133621 138910 135578 133754
19602 133754 129658 104810 102099 101665 90218 89575 93442 86730 89071 107078 101830 96699 79956 70806
19588 70806 68734 78400 95295 98970 102804 102120 100856 99403 103398 95973 87325 84122 88747 81497
19574 81497 72796 50142 56377 59864 62823 71134 62517 63473 70704 73675 76194 57273 62037 59320
19560 59320 47627 36984 33415 34975 42469 46525 45386 42779 29377 17858 17147 22657 33512
19547 33512 50942 46169 34797 29648 12352 19855 39617 32368 32305 41796 34102 27838 30654 31166
19533 31166 24606 9247 1163 860 4118 130 10463 15783 824 -3496 5567 9935 15057 21560
19519 21560 8749 4910 5947 7610 803 -3683 504 -492 -5640 -6550 1298 7917 3635 -3923 3625
19504 3625 722 7448 3861 -10734 682 5310 10956 21098 21067 16827 15435 15084 8897 14546 12321
19489 12321 1692 -1242 -1108 -8896 -5862 1745 -1464 -6437 2374 12355 4505 -8210 -16474 6284
19475 6284 19978 11436 926 -13091 -36808 -28908 -2596 5139 -1653 -473 9420 8847 -2819
19462 -2819 -10892 -11892 -15603 -11319 484 7353 18818 16017 507 4902 11524 6116 -6538 -11819
19448 -11819 -13594 -10442 -10921 -10030 -2371 -9543 -25166 -23162 -11614 6202 11808 6238 -6146 -1643
19434 -1643 -133 -10388 -10827 -1070 2804 20304 24497 22587 22379 14678 1670 -1297 3360 12868
19420 12868 22779 17593 8048 -4306 -11169 -17478 -12616 1186 14869 8534 6607 11047 507
19407 507 2204 -1850 -1335 10770 3639 -9648 -18258 -27662 -34285 -11931 -5812 -12441 -19048 -25003
19393 -25003 -28453 -30528 -33720 -18877 396 -1334 -10533 -8487 -15994 3835 18040 22399 30699
19380 30699 28137 16866 13595 240 7487 13868 20588 -422 -8313 -15841 -14993 -8119 -6178 -4220
19366 -4220 -1262 -7153 -8152 -3251 -7496 -4808 6789 5166 15345 8978 7249 5053 -3089 -1035
19352 -1035 -5671 -2772 12854 18113 19555 8377 -4690 2512 3983 4195 19190 38662 34879 49544
19338 49544 60012 68781 91131 95818 91346 93173 84342 79777 70219 62991 60143 54525 46035 32880
19324 32880 26636 36310 30825 26932 28589 35248 36899 46844 47910 54605 58503 46507 43436 47784
19310 47784 44269 66673 104098 113401 104112 86361 65621 55446 52945 53703 58375 80601 100025
19297 100025 101220 96088 86164 77209 60778 53308 47269 40050 44427 43785 29187 22194 24207 23371
19283 23371 12834 12328 38050 61314 74802 95473 120399 134601 130746 137095 127679 112165 99645
19270 99645 82658 68747 64270 56324 54553 49043 38465 23669 28435 34866 33427 29741 32691
19257 32691 27299 26758 25862 22340 23460 32659 30547 26715 21314 15649 7037 6098 7129 12503 13484
19242 13484 17694 18656 13195 17781 14661 28672 40845 40081 39699 33913 20827 19615 19055 32451
19228 32451 27273 13309 -325 -19014 -27554 -10325 -2927 -2143 -4691 -7369 -6643 8691 15971 21699
19214 21699 24257 20109 15419 16212 18345 14630 17382 22362 21136 14071 1714 -8840 967 6083
19200 6083 5604 4295 16280 20294 17029 2891 -9211 -2947 -2355 5594 1747 -7316 -12003 -9735
19186 -9735 -348 -1821 -4296 -7014 2057 936 -9494 -16453 -16133 -21956 -13395 -6589 -10866 -2115 5457
19171 5457 5806 -1570 -5175 2073 9711 18873 19837 20884 16007 9601 -218 -6438 -12204 -4565 -7422
19156 -7422 -25411 -25422 -28107 -30223 -32722 -41212 -36643 -38068 -33101 -23588 -5215 14052 372 4371
19142 4371 -5601 -16676 -27635 -19294 -10408 -8973 -2948 4446 -1878 -8690 -14548 -15379 -17750 -5290
19128 -5290 836 -7604 -9548 -3483 -11333 -20153 -5723 -1083 2858 3452 7435 10378 -5861 -18458
19114 -18458 -17990 -8857 1230 4438 9550 -4208 -11626 -4006 -6048 -20021 -4810 1288 -5918 -11657
19100 -11657 -3481 -18479 -25558 -18554 -4247 9536 9728 -1045 -13783 -8399 9341 26214 28024
19087 28024 18137 24805 26624 19700 31065 37952 32129 22742 19163 13729 12010 5010 7302 26339
19073 26339 35077 34408 22411 25508 7393 7905 3389 4088 18909 17199 16636 8771 12355 9327 1174
19058 1174 -4120 -3462 -6929 -6461 -7296 -8858 -9425 -9770 -2469 9707 18080 17680 16771 11502 11536 23258
19042 23258 23853 24523 20763 9999 2535 13708 19391 22648 25825 13684 7703 2787 11318 6002
19028 6002 12911 19254 18957 23888 17151 -4600 -22888 -30495 -23974 -13954 173 18625 34223
19015 34223 31508 23612 24532 16260 8438 10458 13377 15085 15369 11692 18103 20343 13210 -5321 -7767
19000 -7767 -15122 -19295 -15177 -14466 -10473 3290 2898 -10355 -389 5349 2822 -4798 -19723 -22755
18986 -22755 -14197 5811 8057 -13240 -15959 -6299 3311 1776 -7576 -13822 -7221 7006 8739 6531
18972 6531 18772 13286 5646 -2606 732 19012 18314 9582 10430 16499 10696 -5726 -15302 -24423
18958 -24423 -13947 6989 8109 9053 -5404 -23800 -18425 -5659 2628 -13850 -27575 -27230 -17518
18945 -17518 -18273 -9795 -1739 -793 -330 517 5417 10491 18008 17406 3976 5407 -610 -10617 -1221
18930 -1221 6096 15845 22233 19081 15385 4452 -2577 -1189 -3316 -7031 -943 10406 20411 18587
18916 18587 23642 27797 21172 9932 7460 9799 951 -4787 -21130 -23825 -21486 -13033 -16933 -4886
18902 -4886 -3813 -7200 1612 17319 12964 13269 2860 -758 209 -5758 -2873 -3065 -10555 -9919 -2969
18887 -2969 6120 11082 22554 23105 14685 16390 6722 5922 11210 7599 -2797 1626 2914 7231 839
18872 839 -613 -3713 -18209 -17871 -10956 -11286 -7931 -4058 -8149 -14368 -6495 -189 8203 12820 18569
18857 18569 17176 26350 22639 31040 33300 25377 38337 48096 41556 43574 43287 39946 39400 35682 53077
18842 53077 53432 50928 40047 27379 16845 9619 4116 10412 22866 5963 -7168 -19450 -10115
18829 -10115 1896 15501 12950 5006 -5822 -13835 -15490 -7734 -8668 -9151 15943 30037 33874 28675
18815 28675 23861 19067 20833 13300 9559 1807 6118 9349 17606 28101 13503 530 5955 12918
18801 12918 14822 19303 30130 52128 51094 23634 16537 17535 31107 41895 39492 35333 38993
18788 38993 51671 49682 41609 36266 22668 23243 14658 -5702 -10818 -4007 9171 25347 16052
18775 16052 18441 9993 18276 25372 36664 33423 30519 30794 47345 66365 92712 124447 140678
18762 140678 128286 95395 71194 54188 45904 45724 27707 21241 15003 3795 -10585 -12798 -12882
18749 -12882 -15258 -6862 -3838 511 -3269 -2441 22007 43606 42618 34486 24278 12272 15994 12302
18735 12302 1661 -2164 12424 18173 9481 17073 16790 28294 24437 21519 37515 51171 47307
18722 47307 15147 3084 10242 13420 12412 18118 21900 25332 29811 23803 8945 10722 4320 5825
18708 5825 8436 -1907 2174 21184 25547 14647 16387 10632 7017 17758 34092 36883 33706
18695 33706 17920 -2173 -8051 -286 2692 9762 24427 32921 42921 47054 66326 70825 82925
18682 82925 108019 132163 168003 198964 223860 247788 269713 275280 271589 254245 232680 234704
18670 234704 248553 238069 212130 195498 187965 186520 189288 190150 173069 159747 139530 130184 127683
18657 127683 128591 137979 141698 110939 83515 77110 64604 65131 89716 105703 106012 114142 133242
18644 133242 153876 174834 206086 218564 240464 262809 280501 322170 374013 415912 457719
18633 457719 483905 485891 490960 498702 510957 525285 526707 515973 503490 494929 488588 490059 506249
18620 506249 503614 495933 485631 451876 417392 373607 325901 286180 246059 214791 195338 171018
18608 171018 156991 148438 130221 113506 112194 108712 118058 129381 129947 140025 143855 147337 163631
18595 163631 181102 200030 214711 241932 278153 307323 332590 347417 370559 389627 384508 354151
18583 354151 323626 295817 284178 273337 275761 286288 305660 337086 359484 376110 384933 371690
18571 371690 349023 326318 303352 290858 262829 220575 196736 184772 177569 151864 122740 106612
18559 106612 95366 96391 106576 110495 111077 115631 113562 97820 93536 92313 89299 92170 86683 80819
18545 80819 89437 96311 96242 93196 96226 115364 118307 126219 127889 149541 164957 180162 193502 214243
18531 214243 228445 244931 252773 252949 255578 269409 290025 301998 309664 326518 331192 332041 327386
18518 327386 317310 301701 296823 285905 253267 226887 190349 176433 165257 154263 144742 144523
18506 144523 143552 148698 160338 175827 172329 153591 138959 146197 137504 134106 145849 146626 156234
18493 156234 185917 200227 224353 249746 254139 259062 266444 289530 303097 309516 326179 347462
18481 347462 361957 378517 388871 418156 439306 475738 482556 464441 443324 412935 373824 345332
18469 345332 328444 301023 281158 253852 224306 200853 177090 163608 141863 130319 126503 124911
18457 124911 121708 112343 99002 89628 83455 80413 66701 63087 67056 79426 90338 112749 139980
18444 139980 178074 195695 192402 186873 170780 146054 124578 114371 118468 116279 122243 142767
18432 142767 152030 161653 182036 196239 188479 157418 139011 126423 104165 92986 97865 105233
18420 105233 98698 88557 103946 107788 110450 115859 117953 108726 109225 120185 131920 141458 140745 130549
18406 130549 121661 135065 146238 169139 196905 240744 270089 302176 331496 355776 380028 416028
18394 416028 441962 450112 447450 450474 449998 435637 415552 394273 373780 347872 317401 292365
18382 292365 264497 229417 197107 164989 151877 149178 146704 147319 148659 144496 137701 134710 147692
18369 147692 148103 147664 151486 161154 168378 176392 188804 203125 214963 206117 206381 207832 223305 248051
18355 248051 268600 289029 317635 347533 389565 429166 466435 499095 520025 534597 554323
18344 554323 551961 543725 539015 534668 536138 529671 517307 493826 461056 440530 426907 401139 385231
18331 385231 358987 351197 352258 356599 378565 395623 411567 405465 394306 386964 370830 354857
18319 354857 341579 320398 323807 332342 361926 408149 433174 458610 472328 472146 469335 437361
18307 437361 405230 381990 352999 335858 317739 286065 260784 248937 237995 229893 227211 230583
18295 230583 243280 264969 288369 318457 332330 339322 352870 378240 412876 470071 514366 522344
18283 522344 514821 518155 532469 525189 526670 538638 538438 543706 549117 536670 547510 582039 623942
18270 623942 652835 665224 668408 669979 666713 636108 588425 555456 510931 469500 435147 417944
18258 417944 425017 447552 450297 438465 419184 404270 400613 377042 370835 374304 379559 355487 350612
18245 350612 367272 388202 389041 395440 400307 402998 409658 408147 402075 400742 403280 412605 439584 465575
18231 465575 506236 546376 604323 687543 779837 849124 860330 831266 797959 791051 792777 790339
18219 790339 781908 772409 799883 836883 881156 936663 1011288 1098810 1216339 1348670 1521432
18208 1521432 1767425 2063096 2332176 2462862 2402655 2240613 2112217 2100739 2247591 2588776
18198 2588776 3163364 3961733 4813198 5332000 5297726 4862536 4410823 4263611 4542892 5341291
18188 5341291 6832885 9050789 11384775 12840211 12980053 12103237 10786447 9351850
18180 9351850 7976391 6830010 5995444 5467233 5188045 5070007 5113299 5303846 5640701
18171 5640701 6104015 6635053 7185930 7786648 8583006 9758768 11524314 14248560 18586224
18162 18586224 25663262 37314838 55313828 76496273 89697959 88420370 75553184
18155 75553184 59808498 46945569 37839772 32473827 30773377 32700565 38485555 47482548
18147 47482548 56793072 63568816 66304444 66172437 65148204 64389823 64059016 64032250 64918347
18138 64918347 67532573 71049466 72629287 70093240 64010000 57332936 53372800 53875385
18130 53875385 56726242 56160196 49594861 39283697 29847081 23372143 19256598 16596628
18122 16596628 14882814 13858352 13401788 13471281 14128048 15593811 18272955 22847172 29922572
18113 29922572 39156463 48068364 52680013 50860099 44235244 37086456 33626572 35801515
18105 35801515 38746706 36283417 28559884 19877060 14279174 11215722 9418616 8275774
18097 8275774 7478302 6810714 6183463 5669140 5330672 5192158 5170826 5133997 5030414 4904497
18087 4904497 4835131 4891808 5056469 5309554 5698169 6371040 7394454 8479358 9121640
18078 9121640 9150027 8834899 8515954 8251538 7931145 7489276 6994855 6635257 6534022 6863456
18068 6863456 7789837 9577255 12209205 15024004 16769417 16491891 14427913 11678618
18060 11678618 9217447 7355964 6017923 5082258 4429691 3980311 3652876 3392059 3208700
18051 3208700 3094139 3064077 3158415 3406584 3858711 4522128 5296213 5902998 6040536 5757431
18041 5757431 5326963 5023886 4967578 5177186 5703148 6686900 8377092 11097829 14958091
18032 14958091 19157289 21998451 22404319 20708226 18154556 15656062 13456264 11603076
18024 11603076 10155198 9167682 8656985 8585698 8868014 9347120 9932815 10607270 11408413
18015 11408413 12464388 13969957 16268692 19934536 25795835 35110864 49153554 68059722
18007 68059722 89563762 110230243 126516227 131377082 120342781 97762780 73963700
18000 73963700 57276807 48748268 46322742 48037847 51779244 55192822 56663634 55996576
17992 55996576 54271730 52883601 52798886 54079361 56214394 59003607 62283328 64533666
17984 64533666 63686425 59311166 52803744 46169648 40536136 36605373 35230561 37224362
17976 37224362 41743744 44429221 41721756 34401967 26287160 20210738 16269532 13733825
17968 13733825 12091546 11096781 10591769 10578944 11172944 12598805 15222307 19403782 24740501
17959 24740501 29248637 30450468 27563673 22130692 16582547 12297923 9413807 7557420
17951 7557420 6344183 5578784 5145307 5003277 5157814 5507775 5770121 5679315 5202491
17942 5202491 4519762 3911882 3470153 3191225 3037144 2937704 2887608 2888406 2924899 3028646
17932 3028646 3183600 3375529 3548670 3651434 3636896 3477026 3266833 3194380 3346280 3684928
17922 3684928 3997851 4092376 3902556 3543289 3195376 2996916 3046523 3391462 4087490 5028335
17912 5028335 5812437 5939516 5292223 4211212 3171265 2417223 1942852 1663196 1481076
17903 1481076 1371939 1296711 1236245 1170461 1101381 1030993 960802 906991 884296 876238 894034
17892 894034 888590 887994 879173 856806 846588 844066 846818 842859 838880 826608 806297 767807 711796
17879 711796 656474 646872 634774 630028 624769 620795 600169 580947 568642 559743 577199 612723
17867 612723 667305 739445 785832 818758 824504 782859 738253 719568 708520 695572 664064 619959
17855 619959 587048 582524 571491 566739 561599 564089 565920 571640 588525 590826 566848 540464 502666
17842 502666 457907 439017 448666 443219 414825 379362 355075 343311 315561 295923 283882 284311
17830 284311 272341 252760 247401 242022 241038 236616 221137 213666 202103 208680 229938 245993 276355
17817 276355 302355 311783 316641 311748 320286 318803 314154 316431 314593 323968 328791 329835 313561 302861
17803 302861 320404 336198 372790 414150 441794 463906 458827 428134 395611 382182 361374 355325
17791 355325 367412 366851 361375 369847 348277 335413 320050 280642 258722 241676 222108 205877
17779 205877 199703 193918 188745 185487 196518 196518 195613 197908 208311 210937 217835 233769 254445 276722
17765 276722 312307 384609 468705 553868 663576 789376 879309 945929 1000564 1043962 1059078
17754 1059078 1072688 1081270 1078383 1043179 950838 845358 782981 780012 822685 895448 998689
17743 998689 1053509 1031161 933262 816970 731161 628535 541172 469437 406364 347348 301351
17732 301351 276530 250511 221083 210443 200859 187879 170384 180320 193178 197643 189021 190066
17720 190066 180485 181724 192534 220375 250001 288944 343725 390576 413480 400759 371243 337821
17708 337821 319225 309505 318792 350000 376846 392918 376824 329987 277424 237314 220853 219044
17696 219044 226155 225056 226830 227828 227471 243383 241525 239991 261038 283999 300324 329934 361931
17683 361931 363022 351857 339809 349289 356535 350990 353265 335062 307857 288976 258493 235403
17671 235403 221827 213346 209682 213045 212462 223693 264657 296972 316534 307928 281628 260121 229045
17658 229045 206051 203208 192745 174587 158290 160345 134009 123444 128711 127956 128366 135016 137542
17645 137542 159238 197927 214927 233485 264190 287329 305385 315568 328697 349477 360878
17634 360878 385342 402387 401582 376537 348979 311713 262755 227362 211339 193352 169046 145504
17622 145504 123153 131498 140247 156717 166296 189474 210829 202258 175539 150813 136257 131903
17610 131903 137828 135367 143734 156797 166354 157348 133357 106678 92659 87156 85815 99407 100237
17597 100237 115406 123710 120361 126224 128065 129003 125600 116395 105628 104012 107703 122629 156378
17584 156378 181747 175619 157092 137933 125646 108371 89095 85542 83011 73360 75581 86171
17572 86171 90242 78394 70408 71973 67415 73873 63885 51305 55197 72895 104568 117425 118082
17559 118082 123392 115926 104710 93221 82097 70857 64446 67205 72735 96797 104339 95852 94940
17546 94940 104338 91066 81360 72501 82923 114781 141395 160797 185657 201717 219886 230249
17534 230249 234163 236254 249147 252721 247124 258968 251869 246681 244453 260776 260031 268716 271973 258789
17520 258789 265805 275629 264473 250193 221996 187694 162856 136890 123570 125355 131785 125892
17508 125892 126853 100502 80894 69451 46929 28193 38724 58452 81918 97277 100147 113456
17496 113456 140011 146880 165328 178620 194419 207070 229407 246643 269235 293786 317481 338188
17484 338188 326659 297571 261128 257793 257859 236760 238001 245262 239996 231715 218126 201986 191351
17471 191351 205284 211004 205921 197831 185137 170002 160744 149257 160841 153078 156199 165219 158064
17458 158064 129009 105563 77029 69117 75074 74523 65983 77759 94360 102085 105370 101437 88234
17445 88234 86317 98662 96698 95207 105197 137892 190708 232614 237091 225897 181950 148402 127050
17432 127050 103853 88431 56905 41703 37902 45687 49880 47089 42809 36180 41258 43551 47441
17419 47441 57433 52074 53717 63436 73793 77805 90939 94672 80915 72321 57294 58549 53506
17406 53506 47370 36296 16503 18396 6324 -811 -7538 -467 4487 7046 7170 14275 15747 17380
17392 17380 22321 15414 11404 -4137 -14830 -5967 7243 10503 6482 15267 24110 9067 -5785
17379 -5785 10363 29898 18966 -1590 -15499 566 1885 9696 3306 -759 1792 5999 4591
17366 4591 6389 14908 20152 13395 12569 13525 6937 963 -3756 6974 -6167 -8730 4598 4772 12296
17351 12296 15995 3335 6183 23282 18272 18171 18364 7315 193 7853 15768 24204 26468 25466
17337 25466 30599 27855 19119 16691 8870 22103 12621 -1217 7827 29388 28564 9205 11491 16075
17323 16075 14275 17042 -392 -4401 -3456 10104 15286 21406 29540 13119 -3401 -1660 411 214
17309 214 2134 -1698 -3665 7192 22358 9539 3641 1021 -1911 8853 10882 6829 820 -794
17295 -794 5030 7449 17709 14017 4231 7013 14014 12906 2895 5438 4728 6718 14804 15814 12833
17280 12833 8128 4806 11705 16454 25610 29290 19166 15910 12763 11183 15228 7582 9845 12172
17266 12172 25812 25079 23978 26272 22289 31074 24486 -2774 -11468 -3632 1738 -1313 -6188 12804
17252 12804 901 -311 5261 -3743 -47 7052 12605 18144 12819 12205 5137 3539 16311 14169
17238 14169 -9 -8852 -19106 -23665 -15215 -14387 -18996 -19967 -7027 4426 7995 16454 27392 22585
17224 22585 16789 4395 3714 392 830 6013 17 -18846 -26622 -13618 -18838 -12121 4781 7252
17210 7252 -300 -5676 -1959 7869 37104 32344 13724 -5201 -14265 -16247 -8308 -27491 -35134 -18680
17196 -18680 -5503 -4525 2478 12291 13346 10314 12643 9607 6513 -10094 -12355 -20424 -27716 -32439
17182 -32439 -17041 -4604 -6321 -10791 -9275 8637 19751 23327 6654 8179 7161 -1445 -12455
17169 -12455 -5894 -8435 -15822 -15212 -14980 -10932 -11663 487 -4555 -1121 15001 16426 21995 11437
17155 11437 9601 15088 10194 3455 -5094 -3542 7702 14493 6676 1394 -2317 -5908 -8634 -9705
17141 -9705 -3350 2750 547 -6389 -11075 -8566 -14538 -12802 -3116 165 3765 2421 -6601 -2355 6292
17126 6292 13696 4597 -13900 -23092 -10792 -7247 -14585 -19346 -6993 -5189 -7791 -2769 -2922 -3001 -6209
17111 -6209 -19178 -13668 -9339 -3923 -4418 -9084 -5283 12148 1520 -17810 -18711 -18662 -7278 10606
17097 10606 6953 6254 11973 5418 9444 6939 12969 13836 -1522 -925 -4324 -12992 -17749 -17705 -17752 -19060
17081 -19060 -13150 -21129 -31486 -11711 -1969 18514 23806 23357 15122 19728 18329 11908 13341 -3159
17067 -3159 -11744 -9060 5920 8309 -10462 -9000 -4927 -11618 -9498 3663 3657 -6393 1489 1825 -426
17052 -426 4097 3797 6361 5842 11232 11791 11494 3747 -12132 -11398 4841 1694 -3158 -4732 -9029 -9191
17036 -9191 -1642 -4302 -5800 -5722 -7114 -15066 -18993 -8730 4175 -5118 -6640 5716 8303 3751
17022 3751 2049 -3241 -3252 -19092 -17855 -4574 11958 20593 16289 7849 -20557 -31840 -21665 -7510
17008 -7510 -21022 -16724 -10373 -3684 -2780 -7212 -15226 -15177 -23405 -27025 -21087 -30047 -23356 -21952 -14884
16993 -14884 -8436 -19115 -22349 -15422 -11230 -25075 -25292 -25300 -24407 -16857 -16190 -4309 -10352 -6139 -17550
16978 -17550 -16545 -11179 -13499 -7397 1416 921 -5730 -4986 -11473 -6393 965 2639 -10818 -15238 -33618
16963 -33618 -26127 -24062 -28581 -30443 -30144 -24967 -14366 2317 8943 5060 4978 985 -11362 -20812
16949 -20812 -29015 -26511 -10367 -9908 -16589 -4621 14749 5873 -12637 -19810 -20724 -23100 -9335 -9158
16935 -9158 -10811 -19170 -8742 -6039 -7434 -2207 6978 1768 651 -5729 -10901 -10451 -6869 -5520 -3633
16920 -3633 -7538 6403 15872 19293 23431 23701 15110 -3145 -10133 -18302 -37453 -29036 -13780 -1287
16906 -1287 -544 -876 6422 7208 9226 2561 -9464 -10430 -2543 -2515 -11131 -19757 -18580 -5461 1388 -6827
16890 -6827 -12872 -8073 232 -7327 -14668 -10113 -115 4660 3539 5091 -6855 -23548 -22522 -14241
16876 -14241 324 5915 9600 3176 1837 9514 11331 4906 3292 -2459 -14430 -20141 -9578 -9915
16862 -9915 -3462 4477 14321 9356 1108 15317 10714 10041 -120 -10037 -19928 -34004 -29420 -25842
16848 -25842 -25585 -9334 851 -9450 -11462 -2615 15164 1704 -10020 -9974 -5690 -13518 -14690 -5132
16834 -5132 -7155 2205 15460 12729 -516 2731 2154 -1552 -2102 5561 1008 -9793 -14207 3642
16820 3642 4996 -3783 -3759 -11585 -11394 -14476 -23014 -12073 -7902 2754 3611 -4523 -6094 735 -6713
16805 -6713 -15025 -14008 -13345 -11151 -413 10733 12668 10950 4438 -4402 -6813 7302 15799 7502
16791 7502 -3204 -1722 6897 1863 -8940 -11082 -5845 -14318 -8525 7478 12505 17185 23243 8598
16777 8598 -22 7848 16128 10920 17614 15140 9026 -5887 -5921 -7322 -14655 -14074 -12118 -14085 -21152
16762 -21152 -11187 -8232 -8933 -16857 -22355 -14001 -20979 -24165 -20283 -18965 -35376 -44777 -36560 -28794
16748 -28794 -17057 -2471 16179 10397 -13258 -17056 -31366 -33793 -29549 -17307 -11255 -9256 -9028
16735 -9028 -19339 -30302 -13678 -9569 -8537 -2837 -3389 -1887 7617 1281 -8374 -5175 -12367 -8236
16721 -8236 216 457 -2392 -6379 -20004 -21211 -19939 -23578 -18241 -7018 -5007 -19802 -24877 -16950
16707 -16950 -26654 -28656 -30312 -19930 -12752 -23190 -17160 -14294 -11566 -23736 -42393 -52038 -41550
16694 -41550 -16434 -645 6874 10657 8271 -14340 -27599 -19199 -7367 -8620 -9062 -3593 9074
16681 9074 17128 30879 25557 22879 16446 8661 1455 -16996 -26684 -31103 -23646 -13950 8502 21998
16667 21998 19990 15963 2660 3778 -2658 -5613 -26248 -30518 -27619 -27424 -25911 -22914 -15950 -4364
16653 -4364 -3650 -10630 -8085 1963 -4010 -2984 -755 -3895 -17773 -12946 -1279 -14971 -18978 -14154
16639 -14154 -22524 -25349 -25081 -11314 2428 1761 -11642 -3526 7555 -9114 -13498 -2463 3695
16626 3695 -2433 -18586 -23719 -27186 -26084 -33717 -36866 -24310 -8434 6339 -1898 -10120 -9667 -11400
16612 -11400 -15425 -19614 -25114 -32929 -40588 -23910 -21512 -17133 480 1850 12212 5065 -5497
16599 -5497 -9270 -1774 -7951 -26296 -29369 -12184 -6695 -17384 -23599 -18172 -11361 -18164 -36009 -39426
16585 -39426 -38300 -38066 -24270 -21466 -19687 -36361 -50203 -40878 -21911 -29700 -19290 -13384 -16985
16572 -16985 -20101 -42499 -29561 -9976 -10113 -16779 -22071 -32954 -27262 -16255 -16730 -12019 -20359 -30675
16558 -30675 -29347 -14322 -19540 -24848 -22889 -18783 -16366 -15975 -12430 -9755 -5373 4499 7531 595
16544 595 -11444 -10088 -23146 -17509 3469 -10220 -28968 -24789 -19758 -11944 -16997 -20558 -13982 3445
16530 3445 14596 13970 16156 11943 5866 7262 14069 10435 -9756 -19475 -33223 -37015 -29617 -24582
16516 -24582 -17521 -24629 -20575 -5109 12788 19385 11996 7831 9766 7782 -1656 -12239 -5101 -459
16502 -459 360 -8245 -9567 -12869 -25400 -25289 -19528 -7426 12727 7033 -8656 -23712 -16334 242
16488 242 -3067 4052 11753 6784 5184 4568 7690 10336 4568 -16159 -9577 -3713 6840 16127 15456
16473 15456 13705 11287 11666 12335 -2573 -17282 -17619 -9321 -5612 -8203 3252 -9981 -18751 -24200
16459 -24200 -25525 -30553 -29746 -25908 -18961 -5852 3756 481 -17963 -35295 -28060 -20183 -18693 -23295
16445 -23295 -26986 -34483 -33683 -27163 -33247 -22271 -18619 -9593 -6919 -18884 -8398 2627 1062 -6190
16431 -6190 791 3545 -8975 -21962 -27396 -19555 -3692 6049 3410 -263 -10307 -17608 -10143 -2777
16417 -2777 412 -5095 -12963 -12611 -5095 -10445 -11764 -16452 -7864 -243 -7320 -20465 -22532 -28751 -31896
16402 -31896 -20100 -16271 -5365 -864 6407 8971 7022 12427 5549 11412 -1953 -10722 -7534 -2600
16388 -2600 -4606 -13005 -17982 -5524 -2061 3298 -3743 -8516 -12675 -14842 -19776 -27448 -20329 -15026
16374 -15026 -9980 -10743 -9887 -7398 -9177 -5994 -11507 -5260 858 7510 1304 -9308 -22583 -24887
16360 -24887 -25084 -21192 -29066 -25766 -11774 -6013 -12091 -22225 -18117 -15511 -16597 -2827 1941 -16168
16346 -16168 -26087 -11006 3940 8176 432 -4414 1552 7272 8880 9386 822 2987 -1482 -12487
16332 -12487 -10664 -11656 -14137 -13684 -1052 15222 23877 30829 12483 -7666 -9304 -7062 -17417 -9119
16318 -9119 2609 7145 9426 8470 12359 5644 -11521 -12882 1132 4296 -4735 -1760 1873 1953 -945
16303 -945 -2834 1800 951 -3000 2688 -12645 -27136 -13995 3469 -11204 -34830 -37124 -36755 -34771
16289 -34771 -14296 8088 5925 2344 -10861 -10577 3534 -4858 -21265 -10129 19855 13589 -6883
16276 -6883 -2303 11121 5008 1699 851 2223 -1128 -6243 -4646 3103 3534 7457 313 -9131 -6416
16261 -6416 -5522 -21337 -33208 -39406 -35035 -34808 -35851 -28012 -25460 -12063 6876 20404 22642 8804
16247 8804 -15795 -10030 -7381 -7767 -18232 -22754 -17781 -13108 -9136 -4923 -5213 2300 9736 4300 -787
16232 -787 -12215 -8863 -3840 -11802 -17132 2958 15446 12196 4980 -10549 -11507 -10817 -8140 -19050
16218 -19050 -25184 -11814 -6376 -607 -4300 4272 7327 -8727 -14733 -7067 -10616 -12350 -3428 3155
16204 3155 -11514 -22964 -10927 13809 10537 -5342 -4395 -496 12535 7926 19071 14876 -3437
16191 -3437 -13474 -5237 -1320 -6520 -7714 -10755 -14455 -7727 -14416 -20604 -16006 -16569 -14581 -8088 3837
16176 3837 -1698 -11284 -28433 -44912 -35352 -18682 -24198 -25386 -22534 -13555 -3191 -10296 -25314
16163 -25314 -19339 -15085 -29959 -32417 -32197 -25911 -18476 -17342 -5369 -5999 -15371 -20560 -31341 -32116
16149 -32116 -25375 -17384 -7583 -17341 -24771 -15486 -11629 -9650 131 -7795 -11191 -11511 -4143 -12898 -16953
16134 -16953 -15372 -13013 -5699 -3792 -16998 -16202 -1655 4840 3752 -2644 11847 901 -15817
16121 -15817 -13625 -12333 -20926 -23366 -22660 -28319 -27067 -15806 -12972 -7118 -5301 -6334 -11322 -16509
16107 -16509 -20511 -30485 -33174 -35372 -36469 -20910 -14218 -20765 -5978 -6217 -25737 -23334 -14940 -6867
16093 -6867 -16546 -12231 -15039 -18148 -10049 -2888 -8511 -8566 -6323 -2666 -10836 -13623 -5878 -8767 -20804
16078 -20804 -34083 -26957 -14939 -18576 -32685 -33701 -32190 -10678 6363 4369 -16005 -33514 -35716
16065 -35716 -17842 -5684 -6647 -15955 -14891 -15382 -5869 -2696 -3113 -5655 -5120 -5276 -2487 -108 -2724
16050 -2724 -3060 -17470 -27270 -22598 -13603 -18655 -39952 -55202 -49586 -47970 -41913 -21512 -10792 -14428
16036 -14428 -4910 -5411 -14252 -12252 -14389 -25658 -22214 -25810 -24630 -17094 -14732 -14062 -8448 -7567 -11556
16021 -11556 -6946 -1036 -3627 702 -4104 -17814 -18574 -20163 -23327 -19968 -26960 -30847 -19301 -10547
16007 -10547 -9744 -14024 -5799 -44 -6060 -5346 -4745 -10555 -4024 -9745 -4867 659 -880 -27486 -19127
15992 -19127 -6317 -4072 4181 11884 19418 11432 -4362 -8711 -5693 98 7367 9765 14916 19772
15978 19772 1916 -13461 -20143 -24403 -23450 -27137 -7857 -1 -18483 -26748 -26252 -27676 -27072 -35984
15964 -35984 -45889 -42925 -26372 -18757 -33968 -30954 -13029 -4495 -19993 -28190 -24694 -18718 -5988
15951 -5988 -15360 -28453 -20981 -30913 -26368 -17433 -7165 11332 14518 4474 -10207 -14353 -432
15938 -432 -4635 -11869 -10184 2598 -138 -6615 -10923 -27929 -23677 -8611 -2084 -9709 -6965 -5401
15924 -5401 -16407 -19747 -16833 -11345 -679 3478 -6413 -13094 -20333 -21131 -14629 -13654 -13096 -4433 -3402
15909 -3402 -9289 -20796 -10420 -5387 -663 -5763 -32967 -35834 -32408 -16396 -17973 -16358 -5384
15896 -5384 4092 11696 10103 3738 -7886 -4337 1372 -3077 -16235 -23258 -21825 -25965 -30513 -26877
15882 -26877 -12595 1786 -13384 -17877 -12535 -2709 -12932 -19204 -11227 -6480 -5470 -1715 -10953
15869 -10953 -11786 -12571 -14315 -13122 -27652 -28144 -22312 -12192 -14517 -31278 -36498 -30023 -14210 -2426
15855 -2426 -1865 603 7177 675 608 -1915 -1683 7188 14279 23727 23639 16410 10609 2084 -4449 -14521
15839 -14521 -15522 -8560 -12044 -12980 -1334 18316 15879 -2507 -11402 -22074 -15314 -6939 -5409 -12279
15825 -12279 -2180 -323 9941 12885 3310 7193 2031 -5813 -9215 -14149 -9683 1878 1032 -4481
15811 -4481 -19607 -34160 -30723 -8849 -4402 -3373 -3075 -10976 -27426 -23048 -12805 -3774 -5571 -7119
15797 -7119 -23535 -38266 -24580 -4928 484 -2375 8139 11091 4362 -9528 -29750 -34534 -32153
15784 -32153 -34247 -33677 -14677 4232 6195 3846 2421 -17247 -15073 -14410 -17866 -4510 -13425 -15972
15770 -15972 -8792 -2567 -7547 -6673 2149 -6651 -8853 -9965 -9311 -13056 -13818 -22506 -11366 9644 7683
15755 7683 -15163 -16230 -4681 634 -4468 -11032 -11761 -9731 -18070 -24872 -15979 -13254 -10261 -14057
15741 -14057 -12242 -16950 -19768 -15966 -15089 -2620 -9916 -5792 -574 -9333 -1527 -7971 -22451 -19851
15727 -19851 -28883 -23273 -26770 -16255 -7263 3635 18618 22855 11910 5575 8473 7319 -10006
15714 -10006 -14392 -21319 -13216 -849 15569 14963 14680 12390 8289 9581 12399 1668 -1282 6655
15700 6655 14935 16626 10287 4932 19168 14616 19072 34710 22379 8382 5220 6597 -6967
15687 -6967 -16609 -24666 -30359 -21763 -18991 -20039 -29477 -24453 -14364 -11321 -2667 3095 8638 16526
15673 16526 4664 9712 10772 8140 15645 5998 -10442 -16827 -20300 -28159 -25761 -8927 -1248 -8839
15659 -8839 -13222 -18610 -21857 -12396 -7791 -14705 -11298 -10293 -22957 -29269 -36344 -34850 -29929 -34496
15645 -34496 -42433 -25191 -8639 -20591 -18596 -8105 -2839 -8139 -1156 9199 3183 -15947 -19184
15632 -19184 -12057 -17420 -14754 -20200 -34376 -45538 -54546 -41384 -19752 -11027 -1670 -14338 -12376
15619 -12376 -21844 -32886 -16628 -5800 -21309 -21935 -18578 -14373 -10672 -24667 -24649 -16750 -29067 -19521
15605 -19521 -14667 -19188 -12657 -5214 -147 -3106 -12986 -14147 -13117 -9690 -6216 -1349 -3775 -7550
15591 -7550 3298 17053 14084 -14674 -35121 -30832 -24898 -17601 -24574 -5813 5007 -169 -5017
15578 -5017 -7475 -18074 -26538 -19726 -8279 4160 -7039 -16405 -13238 -30367 -32140 -30439 -16760
15565 -16760 2752 6273 -4179 -5543 -16077 -24597 -14820 -16067 -10232 -13560 -18201 -12372 -11524 -12630
15551 -12630 -14575 -21426 -24996 -25451 -11832 -474 -3926 -14031 -9607 -6900 -6527 -16460 -23306 -18476
15537 -18476 -4428 1944 2727 5028 3111 -9468 -31172 -28628 -9888 -2103 19846 26271 32582
15524 32582 34587 26011 15318 8443 -7990 -16631 -17914 -3255 426 -5216 -8236 -4743 5968
15511 5968 -3721 -15239 -10572 -7669 -15185 -13775 -7642 -12128 -5577 -5335 -12337 995 -1413 -10676
15497 -10676 -15455 -20983 -19070 -22626 -26010 -38307 -27663 -19119 -16201 -10939 -21570 -33676 -34750
15484 -34750 -27783 -14393 -9750 7171 15860 8304 11545 20404 20932 11008 18742 28793 17184 16379
15470 16379 11587 4388 -2636 -4312 -2415 8718 6291 11888 8519 -12024 -15096 -23411 -28763 -40950
15456 -40950 -34681 -14244 -6584 -3642 -18278 -11853 -734 -7807 -28575 -20974 -6468 -11427 -24380
15443 -24380 -23928 -14423 -1203 2883 9478 19631 34690 36881 35016 17327 -8524 -10307 -12359
15430 -12359 -11015 -8513 -14760 -14768 -21072 -15518 -25577 -35489 -36732 -21738 -14174 -29296 -38556 -26694
15416 -26694 -23271 -25049 -30417 -16970 -3570 -4059 -8706 -16252 -25311 -19516 -16821 -10775 -24201 -18573
15402 -18573 -13992 -18026 -15858 -2671 -6992 -20498 -32958 -39968 -31695 -13073 -10106 -28233 -27811
15389 -27811 -14511 -3103 -5883 -7767 -7083 -7696 -8376 -12166 -14376 -13809 -10273 -7485 -9187 -3858 -8530
15374 -8530 -5206 1368 -11338 -16970 -25880 -35053 -29722 -12424 -7002 -9964 -1666 4537 -2213 -5908
15360 -5908 -14580 -10981 -18609 -33774 -29937 -24974 -7461 -3755 -18286 -5912 -10781 -20383 -31564
15347 -31564 -33437 -28365 -29592 -34855 -27758 -31991 -32622 -23955 -19757 -17987 -14805 -9178 -5011 13834
15333 13834 15915 9915 2257 -13608 -18439 317 14222 5906 -6225 -16320 -29276 -26814 -22440
15320 -22440 -23353 -26786 -24512 -19272 -31848 -22874 -13470 -13271 -24781 -18397 -6455 -8177 -11941 -18038
15306 -18038 -34039 -30888 -26233 -25408 -25981 -9417 -8099 -7907 -20838 -18362 -8259 -3806 -6555 2774
15292 2774 8889 1281 587 -4626 -1120 -524 51 872 -5421 -4616 2188 12686 16064 9182 2246 13125
15276 13125 3189 -6188 -5674 -8031 -15396 -15424 -13634 -23869 -21107 -16424 -24146 -25339 -18743 -12103 10484
15261 10484 8049 4778 3365 -883 -189 -89 -11685 -22036 -19735 -2800 -2474 -8846 -9282 -16229 -22052
15246 -22052 -20110 -8031 2658 -4641 2184 9599 4866 -5243 -2643 -8926 -26168 -14407 -11274
15233 -11274 -5876 6952 804 -11423 -20003 -17683 -6082 6691 9509 916 11442 14643 13879
15220 13879 25561 14983 16638 28530 31112 16946 -8124 -18659 -16067 -3594 -11804 -14276 -19396
15207 -19396 -1005 81 -4275 -3307 -6438 -11412 -23192 -30033 -49695 -45177 -26692 -9107 -12405
15194 -12405 -21398 -24558 -22255 -13470 -16098 -20656 -16244 3715 30426 25825 10071 -6736 -8817
15181 -8817 1610 4113 14088 -473 -13200 -16109 -11645 -7447 -13258 -10212 -14170 -2232 4592 -2537
15167 -2537 -2344 10033 12101 -4850 -26813 -23266 -28223 -44129 -31021 -24640 -33805 -37736 -29134 -33918
15153 -33918 -31926 -25815 -13360 -3822 -5519 -11555 -16819 -30228 -27416 -21860 -17609 -22629 -17778 -22871
15139 -22871 -25128 -23362 -18967 -5412 -15186 -22826 -9777 -9651 -5123 -11723 -14257 -10708 -16604 -12485
15125 -12485 -9381 -2727 4131 13385 800 -6849 -14799 -17352 -18486 -13636 -16710 -15924 -9861 -7472
15111 -7472 -11574 -9694 -5432 -6250 -5695 2909 -5145 -2717 8745 15945 7962 353 4898 -8558 -10381
15096 -10381 -5777 -8604 -10163 -10873 -957 13477 8305 -9066 -7183 -4927 -14389 -12225 -14164 -5343
15082 -5343 18399 9735 5965 15130 10276 17141 14764 9909 14695 740 -12133 -14071 -13704 -14312
15068 -14312 -6498 -462 -622 -10836 -15536 -17996 -30179 -20476 -7912 -3609 -19522 -19617 -19755 -11689
15054 -11689 -12906 -19531 -19393 -14317 -14359 -13750 -2539 3677 -6822 -538 457 2342 356 -2285 4158
15039 4158 20120 21479 8349 4039 -5572 -7669 3703 5848 -3007 8012 6437 10142 18352 7092
15025 7092 -237 -15312 -21929 -14340 -3186 -6634 -14757 -16434 -14007 -6786 729 4636 2521 -2340
15011 -2340 67 -8505 -22742 -12818 -13116 -15640 -6126 1198 -5567 -10516 -23909 -17656 4266 3909
14997 3909 -1369 502 -2197 2426 2807 -380 -1972 4119 -3625 -14878 -10468 5917 12909 19094
14983 19094 17134 15068 3551 38 6301 4108 -18968 -21068 -19559 -11541 -3224 -11849 -16259 -23077
14969 -23077 -16815 -21069 -28284 -29957 -19939 938 3383 -9113 -15153 -21131 -21347 -19461 -21238 -22096
14955 -22096 -23622 -18859 -12582 -17176 -6062 -543 -7841 -12366 -21035 -11869 -16813 -25017 -12219 1645
14941 1645 -1953 -3661 -22094 -20404 -14049 -15105 -17701 -25596 -30898 -24610 -15701 -11129 -7275 -1812
14927 -1812 897 -12795 -9008 -9360 -5712 -11472 -6957 8808 -2497 -14247 -9593 -4373 -8010 -5188
14913 -5188 -6371 -7288 -8325 -6321 -2470 2905 -4196 -8297 -6956 -1273 -2170 -6426 -12751 -15249 -17188
14898 -17188 -23952 -10461 10174 17717 9369 17504 21977 21110 14512 7486 3921 -5325 -6136 -10752
14884 -10752 -11453 -12391 -9746 -9632 -608 5078 -2690 -4423 -7088 -5447 -6060 -2297 -8011 -8838 -2560 -9905
14868 -9905 -5711 1871 -5804 -21566 -30370 -22371 -15942 -13147 -12459 -11583 6 -7163 -20322 -23618
14854 -23618 -5387 2790 -783 -1413 -7201 -6521 -14895 -1770 9578 2292 8594 12274 5811 -6981
14840 -6981 -13491 2652 10636 12443 8121 6179 517 1366 -4407 -10387 -10920 -10886 -9186 -18290 -22022
14825 -22022 -18208 -16172 -20557 -13994 1496 -9310 -31496 -32541 -33974 -36958 -29102 -12645 -7832
14812 -7832 -3315 2683 -6400 -9202 -6597 -9 -7125 -16836 -12338 -10891 -17354 -23380 -27806 -23281 -24055
14797 -24055 -20351 -26207 -25769 -11531 -5433 -9659 -10311 -16771 -29218 -20404 -7807 2557 18407 27767
14783 27767 24640 7653 4685 -3055 -12874 -19882 -21456 -24117 -22060 -16065 -12356 -5089 -1461 -11613
14769 -11613 -24580 -15646 -9201 -9467 -6782 -9912 -18334 -11638 4370 9384 16372 11684 -11374 -15497
14755 -15497 -10036 -3022 -3271 -10041 -6854 -12452 -15434 -9991 -18944 -31898 -42036 -30392 -9218 1515
14741 1515 -1160 -17292 -7533 795 -3918 -8995 -18785 -26485 -32504 -22519 -17534 -24707 -19504 -4636
14727 -4636 -8398 -4767 -9798 -20051 -3799 11003 14761 6767 -261 -14938 -14942 -16322 -26856 -23986
14713 -23986 -22429 -11509 -6295 -2685 -7524 -3100 -5601 -18417 -33733 -22717 -4278 -1891 -2628
14700 -2628 -67 1618 -11382 -17440 -12136 7833 5957 1701 7434 -3512 -6630 -7589 -14169 -16095
14686 -16095 -17579 -14103 -1384 11532 343 -8003 5174 1625 3001 -9902 -12225 -19630 -2652
14673 -2652 7229 4566 -7318 -8928 -3771 -12306 -12347 -6787 -11814 -14028 -12866 -23187 -12487 -4458
14659 -4458 179 2345 -4965 -12161 4180 8845 6726 -1709 -2630 -2623 2372 1859 22140 36463 19711
14644 19711 22147 15762 34394 37359 32070 18923 34058 45465 40919 24860 26790 33994 35048
14631 35048 12618 8017 10348 4430 -5501 904 12908 9002 -6945 -4778 6407 11938 8864
14618 8864 11437 16491 20318 23998 21384 14197 1955 8578 17249 22295 18198 10376 10283 1414 -6147
14603 -6147 799 3412 -7410 -5976 -8301 -10519 -11415 5216 13898 10458 6411 10149 1167 -5211
14589 -5211 -6149 2536 -1791 -1080 3986 9882 523 1644 5700 20841 42260 51367 45154 42415 37763
14574 37763 40821 45638 51709 65831 75806 75555 83036 97247 113293 133203 175854 211901 252212
14561 252212 308915 371643 408366 439668 452002 469558 487784 505078 528921 542853 554572
14550 554572 553239 542573 522611 492128 475932 453771 455200 465233 486888 504199 509245 502594
14538 502594 463779 411882 353531 290396 228352 177121 139902 116213 110574 107178 96437 82170
14526 82170 66596 59383 46087 37023 32758 29064 37839 50538 35564 30334 28533 44411 42332
14513 42332 25217 11286 4287 1858 5444 7291 9647 5199 11492 12638 11681 3301 2887 -5753
14499 -5753 -8260 -4729 5870 5012 14813 16012 18567 29380 18902 1563 -3852 3748 10610 2619
14485 2619 22626 19082 9006 2688 1158 5208 13435 9116 16996 29339 15170 13030 23901
14472 23901 31033 39797 28423 29680 30700 21741 21268 15314 10729 16069 9833 8534 -7132 -8318
14458 -8318 -7710 -4969 -13676 -13548 -13748 -8928 -13947 -11231 -6187 -8030 -6738 3481 19088 18102 26585
14443 26585 32617 27898 19737 8602 -764 3477 3187 9375 1740 -8744 -5559 -6917 -5657 -1530
14429 -1530 174 6090 -10450 -11113 -8309 -18680 -20915 -19782 -22459 -19548 -17057 -22621 -25266 -16688
14415 -16688 -9909 -12036 -14402 -11684 -8520 1095 516 -2698 -1780 -6875 3765 4688 18065 4000
14401 4000 -5947 -12885 -13844 -4853 16576 17219 22123 6508 4687 3892 2325 -5745 -3131 -16669 -20227
14386 -20227 -10151 5499 17924 21517 8122 -13657 -16462 2114 11703 8275 3247 -1476 -4065
14373 -4065 -6601 -12845 -15358 -13863 -7962 -1992 -14770 -14345 4768 10274 -2412 7811 -823 -12902
14359 -12902 -16227 -19232 -8150 -4876 -14892 -7323 7958 7950 -2887 -15582 -19091 -14571 -10951 -6205
14345 -6205 -9203 -12494 -15588 -23795 -16140 -18280 -15711 -4140 2963 9395 2050 -9958 -5733 -3281
14331 -3281 -9659 -13948 -19612 -9902 8950 9774 20035 21338 10696 -5973 -12596 -19162 -28133 -18520
14317 -18520 -18389 -11534 -5736 -746 1850 6683 6903 9141 2065 -149 11778 12062 -1345 -7822 -16093
14302 -16093 -18883 -14987 -8285 10729 8364 -11550 -1578 -2387 -1466 -5163 -2253 2496 4110 6335
14288 6335 8334 13675 16162 18245 24750 20466 3092 -3324 -9020 -8856 4264 5936 -35 -6908
14274 -6908 -8857 -4068 13328 23085 21582 20041 13218 9322 6461 5019 5374 -4260 -3222 8491
14260 8491 5188 -4047 -4842 12838 13313 13666 11154 20290 22861 17045 10617 14268 9216 7439 -7149
14245 -7149 -4975 13096 26692 25285 18673 21041 5359 -10857 6971 10892 7963 10698 124
14232 124 -6039 -9895 3417 6328 976 -10042 -19735 -11117 -3870 -8864 3657 5589 1824 3411
14218 3411 3424 -3450 -2652 6464 13395 24015 21390 13679 6663 -3250 -3393 -11246 -16123 -9652 -2962
14203 -2962 -5811 -14392 -13052 115 10408 5433 6648 13251 12679 -7768 -9300 -8350 -6654 -10284
14189 -10284 -12715 -20803 -18445 -3927 4530 12173 5229 -500 -958 3533 8198 2216 3664 13569
14175 13569 10509 10145 8470 17980 18071 23186 15377 10357 13728 12267 7706 14268 4189 -10110 -295
14160 -295 6092 4863 -8971 -2772 -4755 -23071 -24625 -15449 610 9247 5368 -6189 2578 -1156
14146 -1156 -14259 -20168 -21469 -10648 -12848 2720 5557 -2566 -19557 -24594 -12765 4217 7065
14133 7065 7384 9869 20678 11875 -3379 -17212 -15581 -10985 -17988 2234 6202 -659 9703 11966
14119 11966 3302 14598 18990 8585 5470 -1217 -4790 5878 14316 17971 15949 20422 16594 17331
14105 17331 8973 6237 5873 9091 11467 1336 -3184 -9553 -14539 158 2629 1194 2555 19097
14091 19097 15795 19788 27940 17326 2590 769 -9553 -11466 -6894 -7403 -2877 -1768 -14048 -7042
14077 -7042 -8614 -2620 10517 15704 13978 5219 6195 5809 -6529 -20105 -15700 -947 -10301 -23888
14063 -23888 -18852 -23134 -33328 -31678 -32060 -35209 -34634 -37619 -22888 6760 18491 8072 -1819 -13849
14049 -13849 -24988 -20521 -19139 -14077 -8661 -583 1693 -1123 8655 19052 7703 1886 8422 10983
14035 10983 14782 19035 15865 23595 20939 26516 36258 43763 54566 45309 18552 22551 23520 4803
14021 4803 748 3417 931 3052 2698 -1947 -4299 -9447 -2380 10551 11010 20512 34853 34958 39405
14006 39405 36726 23131 16872 13143 13900 16965 23847 12653 8003 4886 -12790 -18596 -1010 13069
13992 13069 18550 30147 43123 55949 56575 64158 69845 84301 101248 108516 106862 134250 164272
13979 164272 192409 214919 231560 249589 255171 255281 240168 227256 195516 163784 137309 113535
13967 113535 108547 106388 88301 67616 61795 61335 50640 35931 30230 35752 43493 58934 50846
13954 50846 35066 22813 18634 7078 10192 10018 18880 26735 30889 38847 43406 33052 26627 42708
13940 42708 47885 33565 25902 25666 31985 17485 10881 25188 15479 16048 22899 32127 25515 16422
13926 16422 21632 31625 37680 54960 60242 61529 63896 79835 89728 97272 103864 108291 122793 134732
13912 134732 156366 164643 178768 195551 217570 261647 320901 376634 432863 522909 631984
13901 631984 789241 976368 1144260 1256622 1301711 1268667 1185044 1049743 899602 751720
13891 751720 619941 506927 418069 347798 295717 251423 215700 201903 157761 138884 125266
13880 125266 113430 111055 91065 63853 58204 70420 66753 65900 65558 62277 59768 57106 47262 37501
13866 37501 31459 35133 34539 27306 39270 52026 37735 41096 48529 36837 40746 47484 26782
13853 26782 31127 21310 3349 6115 15353 25702 33647 31903 21797 22076 22394 15253 29252 21994
13839 21994 -6067 -2972 7657 17249 18221 27941 32006 37840 35878 29027 26383 33985 41069 38311
13825 38311 29223 23152 22917 31212 19750 3408 -5610 -9292 -11001 -12840 11393 28474 23141 26626
13811 26626 37633 26237 27819 20541 21274 24593 4613 -7745 5341 10364 15172 19546 34876
13798 34876 36068 32503 41460 46249 60002 76321 85191 83821 98794 129274 159099 194775 241315
13785 241315 307858 354003 376510 387325 371716 335068 295842 246108 207719 177815 147418
13774 147418 127735 107899 92163 76534 74930 64452 57706 55458 37529 31065 31348 33408 23930
13761 23930 22928 22402 38812 56024 53145 52980 48747 32934 18415 6354 12909 29476 38501
13748 38501 45846 33063 20514 14263 4665 11717 19687 11972 18814 28705 29801 51964 52542 46067
13734 46067 43428 29737 10398 9871 12026 8737 13431 24843 28622 25889 33604 26530 10459 20560
13720 20560 26000 28419 32421 21569 30377 28768 20092 24678 24866 43842 50905 43907 43013 39679
13706 39679 45114 45258 37913 42485 39717 36167 41023 58397 73052 94453 97074 111909 126504
13693 126504 130706 146059 157276 172932 207746 271169 348796 452675 609959 763889 910972
13682 910972 1039370 1131696 1153045 1100055 994781 868244 716606 582766 490106 403199
13672 403199 327173 270545 224364 201631 187049 183368 167263 158935 161339 165472 166789 164000 167071
13659 167071 164712 169911 184556 208434 245681 302945 390161 493083 611477 755013 895773
13648 895773 1023339 1103066 1127217 1078544 972410 841627 698964 568285 460238 358110
13638 358110 285414 232202 202119 173091 151335 123251 101129 91136 83978 68169 59180 65527
13626 65527 67648 55772 67907 71682 64382 48341 49162 58563 55311 40589 22536 43745 59078
13613 59078 58313 57887 60638 83886 88400 68729 55019 58594 60200 57989 56134 50039 49414 37614
13599 37614 21160 24290 29330 44140 44545 37193 30993 35496 28502 16452 23598 29036 20519 18004
13585 18004 23035 26272 41164 44198 33008 21150 14654 19178 19020 10545 19209 25403 23650 24828
13571 24828 31675 35968 24517 7521 1227 10272 9025 -2115 5939 21520 23270 26949 23946
13558 23946 29333 34712 33188 28101 24346 19265 18590 13787 4993 10322 9249 1281 -88 9632 9865
13543 9865 12071 20065 29516 30355 17202 -3756 -15495 7845 20811 13042 11012 16986 29625
13530 29625 35271 33521 23840 22463 26754 19270 7975 5468 23190 27736 25740 17165 23536 25722
13516 25722 21469 2687 -16296 -25657 -9164 2852 2766 13592 16823 10915 1982 -5509 -12607 -14001
13502 -14001 -15784 1780 20524 10751 12341 19119 28209 21631 13299 8778 20609 12487 16341 22361
13488 22361 9554 13098 18396 27501 36355 22229 16194 17179 36700 48128 34943 14256 21592
13475 21592 22978 20108 23653 26512 34132 41179 47597 49043 27137 14393 14513 17004 13016 19749
13461 19749 33419 33629 30056 12439 4539 4640 11684 20505 9435 -3152 485 3290 4594 -3476
13447 -3476 -7106 -7233 -19019 -15651 -3123 -8351 -5801 -910 5275 10393 2352 3241 9124 6231 1806
13432 1806 5721 6453 16119 21071 23059 21966 16692 7216 1603 10144 23739 20822 19766 10932 11684
13417 11684 9444 2941 18777 30227 25795 15508 10270 7130 -418 7099 13512 14459 12517 2953
13403 2953 23451 26112 19887 16431 11231 21836 28227 14555 21213 31908 18530 19178 25605 26480
13389 26480 14959 3763 10787 16572 21522 12900 16636 21000 24184 25030 44954 53546 40145 28944
13375 28944 14080 16047 44931 53732 48431 39044 32978 24580 27340 35610 52967 51478 44774 53635
13361 53635 60922 54105 29943 12352 15751 25099 25235 26312 34758 45624 46181 32227 22984 17486
13347 17486 19100 27555 41832 43748 36282 35638 40787 44056 40984 47303 43531 29175 26882 27601
13333 27601 18534 7764 15832 8575 9034 12680 5112 16769 17063 16458 21786 34437 32789 16465
13319 16465 15468 36846 60771 58886 55738 48794 39841 31015 45989 53761 55379 40405 34163 42508
13305 42508 28736 29768 41693 48152 37310 32576 23005 11890 18477 19207 15174 18067 30258
13292 30258 46044 26481 -280 -8486 7687 13414 9300 8191 1340 4626 12775 13236 22913 33245
13278 33245 21419 5277 4652 21170 41773 36910 49308 41652 27189 27201 41210 35377 43418
13265 43418 50810 57696 48800 36303 41769 51983 55379 62754 61437 56721 51612 34865 25735 23392
13251 23392 21015 29794 46424 40675 44310 50260 53303 52213 56236 67959 58994 49019 41969 42086
13237 42086 35642 40110 48446 36954 32455 25975 29419 51477 53603 40374 48741 61639 57620
13224 57620 53375 55829 53576 45795 29974 27717 27920 38623 52491 63849 57288 60354 54840 31335
13210 31335 27299 41329 39956 47177 52405 46036 40381 39691 48903 71919 82024 69523 48255
13197 48255 43187 43141 38850 35229 46513 40306 27317 37748 42730 37290 54928 64605 74519 107128
13183 107128 128661 144080 174428 203841 214970 185551 137262 117064 118225 110478 118743 113830
13171 113830 101483 91223 82334 59171 42143 48891 39117 39017 43875 55222 52356 42709 44481
13158 44481 49706 54195 43165 46638 44541 50663 64232 66434 61092 44751 38955 37921 29818 17539
13144 17539 4651 -5074 -2985 -12099 -934 43901 111917 201758 326932 439234 487225 441571
13132 441571 360414 274623 203709 162807 128036 115071 103398 89127 82680 98558 107027 115249
13120 115249 113564 110436 120300 143175 154091 152992 152116 143280 149318 171223 193240 219738 248807
13107 248807 281680 312185 361891 455652 595084 784482 1010398 1245744 1444351 1512886
13097 1512886 1440501 1265930 1056640 872552 758397 716478 732878 765448 778361 717748
13087 717748 598628 474117 370485 308491 258158 224857 201476 183870 180443 176008 176973 172809
13075 172809 159282 134307 119381 106647 93178 97087 100813 107702 108132 100770 105806 93386 85859
13062 85859 82526 71245 64916 57722 72350 84983 97129 103786 92289 91779 96638 98595 94301
13049 94301 95299 108276 127994 170595 212884 221861 212921 198592 167798 127047 114780 106682 103920
13036 103920 116562 121112 131990 125053 114702 101245 80065 67835 73465 87063 80649 89370
13024 89370 89202 82628 74509 72768 66841 55427 65535 78424 92991 98322 91489 77454 76254
13011 76254 78532 75750 79140 93312 92205 83089 81438 81273 80364 79143 66810 63459 78801 89783
12997 89783 102013 117453 114146 92667 73400 60433 66496 73540 67671 68406 86364 100737 102670
12984 102670 107590 106811 110789 122882 127424 124965 122701 112634 96386 97809 105912 108638 92602
12971 92602 76753 76487 74146 68367 67744 64068 56717 75197 91587 94565 90153 101827 110239 121984
12957 121984 133874 136341 143079 147269 144534 161054 168100 157929 137276 124427 120528 127852 137879
12944 137879 135456 143633 158244 168830 190952 202193 221582 235886 230948 228881 219158 188200
12932 188200 184187 195781 208391 211191 201305 180454 173479 177951 177038 161177 135707 125403 133427
12919 133427 143985 136397 129531 137902 138965 148498 152968 142475 146393 155113 160281 163914 160357 144018
12905 144018 125900 101862 113709 136662 150085 155847 166367 160192 161194 154170 142403 142116 157859
12892 157859 179801 181837 181636 183240 179886 189087 204921 205479 201856 178172 170916 175651 172656 183905
12878 183905 185383 184661 182517 178060 173153 169024 171147 179913 215236 247459 288055 342860 405802
12865 405802 460253 520350 586573 634979 664140 681290 679388 651727 612212 583184 550097 512640
12853 512640 481527 469956 468962 474647 468635 457105 467169 496187 518928 531772 537417 548923
12841 548923 559159 585862 621621 656820 704529 732965 766956 804130 820350 802599 779590
12830 779590 748748 713336 674097 642011 632795 607895 595194 586216 584040 576446 567024 575455 574608
12817 574608 540697 522159 498995 487825 507684 533919 547628 573737 617263 652791 684796
12806 684796 722843 760885 805860 850674 858926 825920 771608 731423 694960 647653 589987 545553
12794 545553 526211 507010 484431 474575 449437 431067 453567 447196 427700 416993 419858 420828
12782 420828 420331 424266 411951 400093 387201 379697 402928 438078 460862 477174 501082 518650
12770 518650 510180 493748 468550 443906 436106 461056 493094 492827 495032 493238 500473 516067 550103
12757 550103 565925 590370 603459 604588 624757 650828 671645 691326 703769 720135 734503 773601
12745 773601 803245 841284 874598 884794 896801 906696 910797 901898 910634 911711 939351 977483
12733 977483 1010574 1040300 1058922 1083896 1106690 1134709 1182980 1236763 1288090 1331572 1352551
12722 1352551 1370276 1384243 1395194 1438138 1482996 1533802 1587929 1661848 1755577 1848428 1950540
12711 1950540 2071821 2202426 2358754 2542804 2747211 2963814 3204153 3495615 3842870
12702 3842870 4222831 4626120 5053891 5494170 5973361 6530105 7203467 8019060 9040000
12693 9040000 10238052 11580058 13108200 14881253 16893269 19106365 21530632 24248676
12685 24248676 27525171 31842455 37918733 46721923 59659210 78841571 107100801 146916871
12677 146916871 197365694 249446711 285339982 288811159 258599141 209093719 158910519
12670 158910519 118728162 89908556 69880994 55915933 46036982 38912234 33669268
12663 33669268 29683859 26455245 23614625 21020773 18667348 16581164 14788463 13265924
12655 13265924 11955847 10812336 9791107 8886300 8085507 7382861 6775375 6276850 5848982
12646 5848982 5442881 5066540 4719243 4422505 4173327 3977599 3808390 3647112 3486203
12637 3486203 3336941 3186938 3045264 2898211 2754315 2613505 2472494 2355854 2271815 2166145
12627 2166145 2052886 1942836 1839959 1740550 1666247 1595334 1525522 1469329 1432046 1383000 1341112
12616 1341112 1334840 1334190 1325534 1299592 1257952 1204799 1154988 1110343 1080249 1057015 1031354 1022636
12604 1022636 1004606 1011042 1017792 1032050 1055746 1119121 1235678 1402884 1617913 1868788 2093701
12593 2093701 2231533 2226090 2087386 1846591 1570831 1359068 1203297 1096105 1031491 965583
12583 965583 930166 903320 883410 854766 837870 829430 823565 811612 788187 773180 769746 760199
12571 760199 736669 698455 672964 664277 657759 646557 634515 641382 648847 640699 639725 657183 675880
12558 675880 686806 711746 719665 716431 721322 723469 729060 718640 715313 695517 680731 687525 695689
12545 695689 705452 719365 731303 744190 756431 766244 772714 783624 809035 824227 814311 835747
12533 835747 849938 868054 894700 930156 960469 974269 990156 1000299 1015861 1043746 1066918
12522 1066918 1081175 1079059 1063116 1046979 1035751 1034573 1022322 1003847 989596 984267 986005 997628
12510 997628 1005969 1015736 1016197 1006405 1003728 1008723 1016821 1035955 1051314 1087020 1113230 1129926 1149275
12497 1149275 1161318 1167624 1185361 1210302 1230316 1251528 1287931 1334973 1380087 1433276 1508555
12486 1508555 1587851 1660064 1728907 1801780 1892492 1969513 2043269 2119198 2182867 2237576 2294647
12475 2294647 2370101 2440966 2528137 2631235 2738261 2863503 2954384 3027232 3090602 3122355 3139746
12464 3139746 3132212 3158958 3185437 3223750 3281877 3375427 3496497 3610172 3744580 3910365 4065245
12453 4065245 4229157 4405903 4611496 4844641 5068823 5267892 5460410 5632566 5803806
12444 5803806 6001782 6245145 6494674 6777638 7076111 7380863 7717987 8086935 8459932
12435 8459932 8852586 9277855 9754432 10305953 10951884 11682864 12534121 13535587 14717893
12426 14717893 16110425 17753895 19737138 22178775 25180077 28922727 33577396 39335161
12418 39335161 46409116 54925600 64790972 75457814 85794492 94107973 98744590 98816961
12410 98816961 94698250 87735441 79562780 71539711 64486650 58752751 54412537 51341873
12402 51341873 49414717 48529966 48583747 49482589 51177672 53606550 56705185 60402202 64666276
12393 64666276 69422866 74640715 80254429 86195102 92372827 98573905 104508818 109900460
12385 109900460 114418944 117742484 119643498 119982792 118787129 116180330 112359808 107597373
12377 107597373 102204585 96482420 90678191 84958234 79466432 74297942 69549076 65249053
12369 65249053 61437222 58141171 55393922 53241753 51746796 50964060 50987135 51918223 53890070
12360 53890070 57013051 61397516 67070085 73837003 81249617 88455708 94255743 97356807
12352 97356807 96874622 92746157 85717893 77012694 67834527 59082118 51207474 44377878
12344 44377878 38601830 33793006 29814293 26545758 23840848 21563823 19606861 17872787
12336 17872787 16321047 14914568 13636545 12489382 11483737 10606746 9845436 9193145
12328 9193145 8631761 8140771 7695837 7298467 6942193 6620187 6333253 6076853 5810454
12319 5810454 5581004 5366563 5153364 4970421 4765215 4567357 4376918 4214073 4073509
12310 4073509 3948595 3834706 3737368 3662332 3587859 3524701 3471659 3422657 3391472 3348923 3277529
12299 3277529 3201823 3132676 3060071 3011086 2940369 2874695 2821130 2754543 2693904 2640919 2564333
12288 2564333 2479575 2431702 2402994 2350965 2300391 2251963 2227008 2215837 2211042 2265756 2361642
12277 2361642 2488905 2638698 2812038 2997741 3144512 3220759 3219021 3124569 2961616 2747882
12267 2747882 2525063 2331845 2177664 2076761 2018532 1969329 1945392 1935082 1940410 1934948 1929001
12256 1929001 1913273 1876172 1859395 1861841 1862452 1883974 1938085 2062325 2268105 2512098 2752596
12245 2752596 2933452 2974595 2822577 2572306 2307052 2085252 1922737 1820667 1769667 1731061
12235 1731061 1703094 1687798 1669121 1676617 1693953 1726832 1762067 1811172 1852000 1888803 1907845
12224 1907845 1908723 1913871 1933039 1974284 2042193 2120279 2202477 2300946 2398181 2495880 2576496 2648013
12212 2648013 2729648 2827371 2952394 3085963 3229136 3402174 3582622 3794601 4056892 4378015
12202 4378015 4721834 5139206 5664893 6349145 7266058 8443755 9928115 11753826 13913059
12193 13913059 16315391 18703105 20840052 22661961 24340786 26369212 29409034 34119589
12185 34119589 41306150 52198180 69001072 95145607 134471454 187914334 248186436
12178 248186436 297483779 314440036 290366353 237018783 176997324 127576879 93007792
12171 93007792 70162289 55015010 44771553 37706850 32831224 29504011 27209408 25475357
12163 25475357 23771583 21757194 19403163 16988689 14816453 13010640 11528815 10306582
12155 10306582 9272447 8381352 7632078 6979628 6415452 5938231 5543829 5198855 4884237
12146 4884237 4576736 4288322 4041281 3858156 3693501 3534946 3354301 3191787 3043469
12137 3043469 2899611 2750751 2610789 2489618 2393558 2319501 2238167 2139303 2014900 1879102
12127 1879102 1764545 1690236 1635762 1582474 1518648 1456955 1391199 1336218 1300861 1289411 1279215
12116 1279215 1275569 1245449 1203435 1154025 1113615 1069844 1024342 984296 960014 947823 939841 926402
12104 926402 893210 855914 835316 817396 785638 771417 763636 770259 783928 786423 779057 757590
12092 757590 746439 747976 743105 733247 711183 705451 705759 679508 645051 610007 586103 560065 549255
12079 549255 547493 560623 558776 566590 555210 542806 516155 505289 510457 511814 495335 467461
12067 467461 458791 446929 451789 449250 442587 450555 465809 493477 511321 515379 511599 517710 532569
12054 532569 535077 520520 478015 450819 438738 422123 402941 404936 413508 433420 452859 482961
12042 482961 518672 553921 595130 629104 650693 657172 649967 622519 576624 536968 515942 513839
12030 513839 519047 526999 523915 517243 529105 551860 563637 527177 493434 466147 432715 401738
12018 401738 382433 355396 340369 338236 352599 364804 368420 364096 358660 345304 332364 328123
12006 328123 323568 335816 350871 361635 354787 329545 319212 310699 299640 303641 296981 294193 302912
11993 302912 322247 322324 328428 342720 363054 388558 399415 406042 437857 451623 438792 427751
11981 427751 419210 381648 370793 374640 360284 352043 341467 334618 332746 339133 345738 350758 353633
11968 353633 365342 373394 381181 395672 412818 432438 463154 504629 556251 621890 690176 732031
11956 732031 748965 733921 696182 676175 651204 628152 607669 606420 612260 605122 607124 605099
11944 605099 605186 585998 567324 558887 550417 557638 575863 601198 646075 675692 708266 746167 781057
11931 781057 811347 842558 870508 880506 900361 909359 913382 905427 879569 843440 817553 786564
11919 786564 762754 743169 711970 682479 646793 615953 578914 560352 558966 547881 542500 529531
11907 529531 530891 534332 534726 534663 538762 556997 585601 621668 656655 692310 727533 745557 739754
11894 739754 707039 655782 601731 565077 533195 505294 472970 451063 444803 428026 407357 389907
11882 389907 353102 342633 327223 310791 310341 308751 296694 288151 285524 280512 297415 330005 365954
11869 365954 406606 443383 474682 477448 452997 425657 393977 347496 307737 279570 263682 253073
11857 253073 239159 219276 209526 211083 211725 200981 196995 187766 182028 183411 187699 171411 157190
11844 157190 149173 140432 129161 128606 140673 143677 144629 131076 113152 107370 104234 106551 123140
11831 123140 137780 151833 151014 162071 170983 173708 168760 161995 176623 199065 230886 273699 306771
11818 306771 320922 346573 369211 381631 374587 344019 302192 270901 237312 208990 188406 174626
11806 174626 170611 157330 158934 168911 188978 187129 172922 155176 132800 103498 104252 104856 98308
11793 98308 101636 128750 136522 121291 112600 124186 119509 97562 91495 104303 118289 124747 135020
11780 135020 134014 132864 130934 132342 119107 115074 120924 132923 147021 149250 153552 174992 195939
11767 195939 205513 222396 252804 298216 329863 382759 494052 643528 858781 1136025 1404644
11756 1404644 1597978 1621594 1463637 1203471 934256 716426 557095 456280 383071 349428
11746 349428 327637 306773 299575 288582 289358 293037 271324 238990 223457 228716 225406 228250 234412
11733 234412 219158 215805 217906 213692 216051 213262 194898 183306 181180 188738 195233 194928 209275
11720 209275 218400 244208 290043 375817 456289 533866 614395 708530 787820 809427 793568 716253
11708 716253 627221 535996 444701 373047 331758 283767 252671 226345 197786 160938 158891 163720
11696 163720 161566 135724 115137 107825 105766 80166 81700 102424 103821 106059 87795 67211 65398
11683 65398 77882 86945 99381 106974 95739 78858 78281 69752 50884 40193 32448 39250 64373
11670 64373 77791 82295 88565 87373 84911 80363 87393 101177 111093 110638 98159 89420 85768 83245
11656 83245 72621 57576 59479 81953 92170 94094 90532 93609 103223 108372 102755 110550 107750
11643 107750 117020 127138 127583 143486 172600 197780 234360 288668 336314 398672 463023 499939
11631 499939 536913 538018 501758 438260 360280 306638 265070 216028 186648 172529 155874 145263
11619 145263 136739 127910 112308 96804 93437 82797 75629 65826 63185 57766 69129 74702 71502
11606 71502 81673 79268 68563 67656 82670 77388 74401 63774 68132 81416 89524 71680 58481
11593 58481 71110 70566 58166 73576 82172 82302 84585 75858 62842 52405 46212 49452 58989 68811
11579 68811 64252 62674 62761 63845 55755 52005 49156 59834 72641 63275 55373 55674 46775 42180 46703
11564 46703 34632 44578 53056 44168 45930 40857 39074 42751 47785 37493 38246 39955 44429 48077
11550 48077 42081 40047 36035 30687 38126 31357 36257 36637 49625 61081 49612 32661 44911
11537 44911 57647 68865 71895 73039 80547 87960 82825 77948 76469 70656 54785 59312 65352 65178
11523 65178 65711 86497 95674 74933 66201 58095 55149 53835 63358 77528 68568 63692 65154 69508
11509 69508 67425 59020 43084 52696 51812 61831 77592 72516 62176 60838 51654 45605 43931 40381
11495 40381 45124 49866 56245 65557 72842 75374 61389 57862 47397 51223 65801 54325 49814
11482 49814 61023 47724 48698 44152 42612 34512 26467 47375 58447 48890 48134 45201 38067 28172
11468 28172 30191 26368 16241 20530 32944 31450 19387 1490 -3357 -1631 15979 35521 43939
11455 43939 53380 44375 27583 20091 28498 43472 56953 57387 46885 54347 60341 55521 42925
11442 42925 34676 27827 26066 29206 24609 20493 39452 48467 50800 57978 61446 57739 47390 44576
11428 44576 47359 44002 34124 29865 44305 55385 65123 55524 51472 42120 55556 58123 54977 57344
11414 57344 43106 33014 46542 59922 56020 66748 50078 40921 50238 66140 64753 55672 60083
11401 60083 71200 85227 73976 58735 52751 65118 63507 41900 36245 39459 37282 22667 15489
11388 15489 34394 32624 21531 30409 36943 45975 50869 52775 53717 59906 54462 52744 53016 44616
11374 44616 48499 47807 55213 53171 53774 53366 47669 33825 43928 35228 29507 37818 44942 42691 40241
11359 40241 38327 44346 53344 64495 69631 71579 61099 46191 44597 59978 65373 59451 47009
11346 47009 44537 53004 77244 81345 75761 66655 51093 47734 59230 71068 73824 60932 56480
11333 56480 59001 62683 70321 58129 48315 44097 39727 43782 36673 35788 30864 33981 37514 37320 50701
11318 50701 55780 44840 35756 48681 70843 67330 63005 68614 68509 64450 52689 50053 36022
11305 36022 28565 17112 18845 30961 33606 32053 26284 36877 33539 22690 18466 38052 61804
11292 61804 77461 66186 58313 67209 69966 76729 67864 46745 29327 36227 41458 52359 60950
11279 60950 85452 85900 75337 67163 58243 73804 75136 66335 64832 61190 62729 62302 76551 86761
11265 86761 79360 85651 87563 78406 57294 50120 64685 60296 56344 55669 58707 51080 38742 46820
11251 46820 52724 40813 32019 43529 49843 47921 42659 43403 38320 36848 42475 52283 43420 24843
11237 24843 26623 31566 27415 25762 26434 35559 56928 72540 91616 88563 63320 48610 43581
11224 43581 57050 67404 86610 84891 77521 66562 58921 75105 81670 64856 61218 66504 54825
11211 54825 63278 71613 60860 56154 58302 63398 63935 48255 36096 47891 57291 64814 69424 82904
11197 82904 81324 87486 86862 76942 71021 72405 68482 67146 73025 76776 65942 57775 52723 49934
11183 49934 56346 61201 68381 72939 65676 65285 61885 74177 107000 133035 170217 209636 252037
11170 252037 280883 303746 297502 248206 196033 162995 140848 124399 115209 100989 102941 108091
11158 108091 120316 133226 133030 149250 161500 164723 165849 180595 182145 175457 171761 181548 194724
11145 194724 192409 186425 200164 223005 246683 265132 272919 269434 258553 228459 200960 176858
11133 176858 173000 184107 189315 183886 168393 156791 155374 149711 145130 140104 129717 118134 108978
11120 108978 106627 103562 89570 86013 114772 120677 138040 157319 196407 247695 278497 281209
11108 281209 257796 221678 173732 138708 126374 119916 103293 98314 101431 113918 104372 93821
11096 93821 67982 69503 72704 78623 74225 58635 52469 51480 69654 92919 87472 72799 61147
11083 61147 75662 77005 88589 85314 85602 113270 100585 81673 72399 86406 92857 100270 87500
11070 87500 85225 76934 75970 74478 81141 87927 89969 91539 76260 68136 82301 87343 73301 70599
11056 70599 56920 72012 99633 107340 103668 97714 96753 88912 86496 84205 86185 82048 74374 67846
11042 67846 64331 70045 63430 75352 84596 90459 82728 87826 106090 99426 107997 112383 100929 90108
11028 90108 96411 105287 105560 101753 99764 89483 88865 94539 105349 99845 99327 94210 92739 86641 87751
11013 87751 93873 102697 108883 119371 108098 112353 119489 105507 107062 113401 105395 88081 78658
11000 78658 76713 79504 81357 94716 115706 119986 111652 106463 109849 108083 109290 120673 110992 90181
10986 90181 88518 94359 98756 87092 86811 98097 99302 105486 109618 102119 95623 104238 111191 117780
10972 117780 110828 101680 106657 110963 94063 83615 91960 98766 100766 100172 113523 123454 125396 131753
10958 131753 131383 136280 141737 153317 148621 146404 139480 141580 149007 160562 163826 166756 172018 184481
10944 184481 181965 198323 211263 226449 232321 255560 305718 346456 368222 392635 415228 443019
10932 443019 480853 496401 495895 481620 476560 453543 441498 437035 421918 422797 406520 401506 398327
10919 398327 391883 418959 434408 456378 464102 478008 501288 498333 499443 517076 524489 534279 545895
10906 545895 555445 564101 569720 589030 608794 622210 619558 603559 603683 586738 567252 553136 539934
10893 539934 529810 514512 502264 498013 490013 481131 479120 473833 460421 453414 458677 463693 464739
10880 464739 479183 472511 467010 456004 470507 484519 477509 479465 482043 473243 459076 466018 475808
10867 475808 464751 433313 421317 411198 373179 343542 325764 314735 292405 278166 274064 268806
10855 268806 255432 243589 229595 219625 238031 247753 239250 241816 234913 235023 232693 241726 246562
10842 246562 244477 225439 217559 211271 202729 208261 223247 219018 227640 240543 241619 235812 220744
10829 220744 226168 258915 264065 247277 247461 238350 233293 227489 245039 256499 248987 247980 255793
10816 255793 256254 246934 231248 241213 235011 227362 228640 228834 243373 247180 238046 227245 241070 246035
10802 246035 248026 241078 232795 231445 232199 252206 256336 248533 257177 263775 257703 272858 274028 262065
10788 262065 263212 270142 265946 260192 247444 262635 275707 287200 300359 293075 298953 293748 294613
10775 294613 305237 317566 322812 312967 308926 310908 310364 293697 299259 308672 312863 307746 316974 313451
10761 313451 311025 324502 324461 321461 333226 327107 331479 339665 339466 334864 309388 321140 355136 374044
10747 374044 360096 344087 362242 367100 368657 387689 382916 377297 375763 360069 352508 366845 371552
10734 371552 359887 356131 365266 382378 377179 384551 404105 401347 401540 395693 398458 392006 391817 397427
10720 397427 401231 407127 409198 407464 406098 400647 396252 397910 390210 389888 398765 403471 413404 424286
10706 424286 436993 447335 458906 456547 458355 466044 458241 458169 463362 473837 468999 468741 466246 455584
10692 455584 455137 469030 484952 500979 502560 495705 499626 520378 522162 512500 514136 525861 542753
10679 542753 546693 533708 538695 557522 571548 566070 563475 567838 565920 570269 589150 613549 629400
10666 629400 647621 654655 666692 681167 693436 696990 698086 716931 728946 748578 770394 782247
10654 782247 791271 804168 823896 825418 837208 850451 868767 884148 913527 936896 969974 1001469
10642 1001469 1018007 1039312 1081474 1106647 1132652 1145243 1151604 1173434 1203396 1226336 1250752
10631 1250752 1274995 1297705 1323456 1349747 1383221 1405810 1418272 1439906 1446713 1459314 1501839
10620 1501839 1539244 1575073 1598529 1628145 1664583 1700994 1749987 1805873 1854526 1925955 2008043
10609 2008043 2081339 2147958 2199260 2252091 2301250 2348929 2375229 2376725 2373461 2358079 2348530 2345885
10597 2345885 2352344 2358601 2371817 2389305 2421014 2461701 2491226 2522361 2572367 2624162 2673743 2732802
10585 2732802 2790952 2854384 2901664 2970559 3036485 3106895 3177431 3249838 3307163 3364152 3436464
10574 3436464 3490451 3540529 3582740 3628456 3655251 3680984 3726397 3770393 3808787 3860629 3930150
10563 3930150 4007566 4098903 4187946 4264525 4355784 4464621 4569702 4685541 4806744 4963959
10553 4963959 5139188 5332573 5538821 5741521 5964795 6209362 6461298 6728666 7022682
10544 7022682 7338598 7669884 8031226 8429160 8844721 9315381 9843632 10419555 11056074
10535 11056074 11762627 12543950 13430446 14429895 15566041 16852799 18312707 19966243 21836808
10526 21836808 23994166 26439368 29262017 32480417 36121667 40218067 44760365 49690158
10518 49690158 54858152 60062613 64982356 69248226 72507375 74478746 75060070 74374553
10510 74374553 72663226 70248658 67494969 64779347 62369981 60445296 59122845 58473727
10502 58473727 58533860 59283318 60620732 62435962 64586291 66837181 68940198 70754356
10494 70754356 72329895 73789067 75368299 77270735 79594365 82297949 85227034 88122043
10486 88122043 90696444 92689421 93858276 94077200 93351960 91773401 89482088 86730666
10478 86730666 83815249 80986939 78395556 76148696 74192559 72401167 70616338 68713732
10470 68713732 66645616 64500077 62398344 60499441 58944487 57845253 57265775 57208230
10462 57208230 57676818 58642296 60004735 61635935 63375867 65002099 66270606 66970628
10454 66970628 66888498 65931464 64086654 61420931 58144157 54472934 50594498 46701414
10446 46701414 42904209 39343202 36057472 33039663 30315669 27882155 25696818 23738688
10438 23738688 21981204 20409840 18984128 17711131 16575005 15545977 14593733 13735526
10430 13735526 12965150 12244064 11579572 10967455 10429695 9950868 9497831 9072916 8683417
10421 8683417 8330505 7996789 7689017 7403540 7144652 6902038 6671215 6461750 6281323
10412 6281323 6105272 5918971 5737501 5576112 5422445 5266521 5117395 4985151 4847518
10403 4847518 4712065 4570752 4429447 4275022 4136289 4031913 3924654 3820074 3710313
10394 3710313 3607111 3517261 3444639 3386964 3331345 3250853 3173967 3116912 3051115 2987977 2928836
10383 2928836 2883396 2841165 2794100 2753663 2724602 2681803 2621993 2563738 2501882 2444154 2373078
10372 2373078 2317442 2284153 2244230 2195796 2148067 2097315 2051668 2016889 1993136 1959464 1953846
10361 1953846 1932177 1918141 1919554 1916683 1912438 1937730 1941244 1913939 1887896 1870733 1851847 1836813
10349 1836813 1815674 1790761 1770446 1738064 1715443 1702223 1687753 1681487 1677094 1673702 1670192 1673782
10337 1673782 1681983 1681304 1671778 1673182 1666920 1660745 1666843 1661603 1656191 1661067 1664640 1651358 1647300 1645013
10323 1645013 1646048 1647187 1649392 1654597 1630781 1594638 1579831 1557107 1530335 1516266 1502208 1496776
10311 1496776 1474173 1428729 1404613 1381106 1353285 1332294 1315337 1312836 1328843 1360608 1392481
10300 1392481 1449614 1543046 1659639 1797799 1928738 2035548 2103681 2134837 2091419 1979304
10290 1979304 1829873 1661091 1500183 1363175 1258754 1176776 1103202 1048881 1007290 988833
10280 988833 968366 941202 933476 906701 888906 874483 850334 811823 797323 781730 766618 745296
10268 745296 721228 715908 709307 697006 688333 672723 671124 675369 674711 673295 672027 668479 646660
10255 646660 623657 623404 605462 583841 591481 597669 580380 563671 547580 531765 519007 507812
10243 507812 501592 509439 509611 502913 500141 493963 484225 473211 470962 483118 480234 470118 470969 465865
10229 465865 459590 461454 468116 471606 466081 457795 458237 460796 470141 456279 447420 438549 445338 437279
10215 437279 422108 405354 405672 405092 411250 413992 414045 410582 407093 409189 403182 388329 389410 391364
10201 391364 389816 393940 387730 395994 403149 403832 410257 407420 380936 377668 379975 376877 375466 372619
10187 372619 374214 374376 376705 371347 373729 362957 365201 364202 357470 363255 364409 373281 362037 359123
10173 359123 362761 362894 354379 355793 340553 327600 340312 360342 360680 360326 365067 371844 367931 354036
10159 354036 333479 331973 334729 339137 339100 337758 344042 339077 345646 345022 338355 340041 334151 332892 319988
10144 319988 323584 325178 338778 344540 347455 347677 345374 329225 325794 319070 315253 315814 318634 333600
10130 333600 331068 319338 315882 318164 324463 324499 331703 332903 334126 348506 344059 353040 370516 373677
10116 373677 377875 386536 398280 396772 386781 383567 386288 386855 385193 387803 396708 413761 435436 449413
10102 449413 460001 471413 485665 493180 508463 530734 545982 570359 591397 623280 665852 682830
10090 682830 701849 708006 720498 724113 724067 714170 699103 688896 664797 660727 641630 638434 622652
10077 622652 619399 627693 625198 628106 636011 650883 674095 707255 719285 725953 743633 754871 764823
10064 764823 765062 768332 782245 811430 829681 838358 831987 811456 803985 814223 825262 805337 781900
10051 781900 753692 734808 728536 718620 699356 696015 695107 689991 685090 661751 652019 636416 621970
10038 621970 632655 644995 670767 692520 713412 722643 719837 742113 772021 783234 802284 865476
10026 865476 969402 1058318 1066954 967000 795458 688586 653751 619494 577890 554684 547668
10015 547668 518498 487404 481082 470378 454819 442077 441777 441310 434234 427197 423590 415431 417334
10002 417334 408075 395159 382104 394875 408615 413001 410901 401220 397251 404826 410306 405116 395310
9989 395310 391029 395575 390973 396371 405911 400778 406133 408121 406833 392906 398252 404195 402010 399471
9975 399471 409507 418908 427279 440250 455996 456464 459220 444543 438349 447836 457921 444486 437394
9962 437394 424077 401958 400179 402057 410235 415903 415096 420831 427118 418067 414342 418358 438545 441941
9948 441941 437572 434376 414211 410788 417882 429548 440566 439737 443947 442603 454695 478581 512966
9935 512966 537903 545917 576198 602323 619455 616280 594768 571773 584964 630810 675983 724923
9923 724923 739018 714285 672083 648055 629987 620043 615562 639957 655294 642427 629289 597658
9911 597658 569284 559032 563640 559975 554839 543824 535716 551415 561392 575610 578597 562808 543705
9898 543705 557226 567894 561934 559007 564204 565929 572878 567669 587430 600154 592477 580292 569747
9885 569747 568549 571893 577874 585053 580632 584939 617446 630990 624945 616002 624340 650781 658790 662652
9871 662652 656007 657148 643008 648087 675590 690962 706096 710032 698603 693781 713662 727394 736899
9858 736899 743509 749329 765636 776792 790646 789481 782874 790725 808390 822306 831241 848025 859598
9845 859598 867464 864913 866601 900584 932887 951459 962646 967633 997815 1039579 1074125 1147589
9833 1147589 1220098 1274964 1320762 1400991 1582865 1934615 2480464 3046227 3303012 3096255
9823 3096255 2578853 2045869 1686804 1502644 1402633 1331895 1284638 1263386 1258601 1256591 1264202
9812 1264202 1280178 1292110 1300171 1296627 1310895 1325122 1327659 1330727 1354491 1372368 1371827 1371626 1398898
9799 1398898 1420290 1438581 1464989 1484222 1505681 1533199 1559407 1579530 1609371 1627723 1647324
9788 1647324 1660729 1677210 1706027 1734416 1765101 1787475 1808462 1834618 1854828 1895183 1924280
9777 1924280 1940778 1960852 1999642 2035720 2065370 2104795 2149277 2183755 2228140 2270393 2309858
9766 2309858 2352375 2393905 2435629 2493077 2557061 2603233 2645974 2685188 2742508 2807758 2871257
9755 2871257 2923918 2982766 3040796 3111954 3184781 3249123 3319562 3401674 3486642 3559483 3639862
9744 3639862 3725092 3810760 3913907 4022040 4125280 4219050 4326877 4445813 4569580 4685727
9734 4685727 4810678 4957886 5103143 5246748 5388398 5559450 5739919 5933625 6143851 6366076
9724 6366076 6596897 6855237 7155557 7522344 8001392 8653704 9536502 10621984 11792702
9715 11792702 12762084 13289054 13261485 12845398 12308097 11890519 11680049 11682535 11831099 12095427
9705 12095427 12440109 12830641 13264723 13758072 14295353 14867089 15467711 16140311 16848115
9696 16848115 17600080 18379453 19220196 20104060 21021425 21998685 23027242 24109518 25240263
9687 25240263 26438880 27699117 29024456 30407687 31833809 33309885 34821780 36377914
9679 36377914 37966880 39553980 41149603 42746043 44285610 45762848 47168057 48466983
9671 48466983 49635586 50648488 51473938 52098224 52538564 52750585 52756317 52565119 52155526
9662 52155526 51527896 50708079 49717141 48579448 47349731 46022358 44588902 43064481 41476223
9653 41476223 39882128 38307882 36738752 35177069 33662473 32197043 30774298 29410539
9645 29410539 28117121 26880483 25692938 24561351 23483652 22457366 21474497 20537846
9637 20537846 19671676 18855398 18054669 17290433 16570847 15886512 15249448 14639131 14058755
9628 14058755 13511252 12985865 12469744 12002358 11566853 11143623 10742855 10363115 9998338
9619 9998338 9628147 9285833 8968172 8647188 8355810 8087115 7825976 7568597 7306083 7074533
9609 7074533 6868768 6653609 6439788 6249675 6075290 5896457 5724942 5552929 5399649 5243762
9599 5243762 5105482 4971166 4833339 4703901 4592579 4481364 4372033 4256195 4134904 4018028
9589 4018028 3916478 3820023 3755207 3680543 3592268 3504101 3420483 3337114 3253212 3188461 3122751
9578 3122751 3062795 2994068 2938006 2879407 2805656 2739465 2681091 2624661 2582450 2548577 2487272
9567 2487272 2431432 2371890 2332800 2289558 2251646 2221902 2191023 2137040 2105263 2069466 2013237
9556 2013237 1974462 1942403 1918736 1891691 1842894 1812404 1790100 1769747 1731550 1701578 1675287
9545 1675287 1648700 1620732 1596776 1571370 1554397 1531694 1509227 1490619 1460396 1428056 1394967
9534 1394967 1369858 1354002 1341931 1321652 1314918 1306718 1288585 1274832 1266071 1226389 1203679 1194073
9522 1194073 1180016 1147906 1124072 1106276 1091682 1085800 1081105 1073914 1066085 1050842 1035265 1023876
9510 1023876 1024845 1014006 1000906 978935 957893 951361 944026 927861 900908 893403 881572 872447 871073
9497 871073 877365 859354 824022 795905 786535 786013 786866 776119 770879 765106 756653 749258 747561 752516
9483 752516 757653 732552 728370 713665 704855 704571 703875 689332 692514 672284 656609 657253 657747 660958
9469 660958 666308 658295 642738 633465 618245 608961 613069 613418 612846 613116 603296 588714 592483 579093
9455 579093 557020 547550 553029 550701 544684 538766 540369 538242 534568 536268 544047 539326 531551 529718
9441 529718 531891 531932 535970 512070 484999 476708 471129 467380 461923 461402 451962 461894 460925 461367 470342
9426 470342 465429 453871 448526 450455 451679 457035 441421 427086 437135 436629 425193 426005 429866 436728
9412 436728 427078 414502 412051 413156 410444 416973 409951 411953 407518 405300 398051 387845 384396 371524
9398 371524 362650 346634 363516 373938 371812 356742 344464 337325 332232 330254 331165 334715 348539
9385 348539 343400 331877 326421 324115 332692 325634 315084 313238 321811 332334 328393 323407 342478
9372 342478 343931 335467 321186 321205 318832 320472 324800 316330 308997 288313 289413 279181 281532 292055
9358 292055 295408 295212 311075 312529 301555 310963 312321 304044 301630 303147 306792 302106 288603 280466
9344 280466 275350 282718 285907 295359 287534 281989 277636 274791 261601 251859 258402 266126 250050 250902
9330 250902 253632 255531 251009 255072 257677 263650 254829 252882 250156 226049 227897 226836 219544 219276
9316 219276 228603 241047 244508 235004 223424 228446 236717 248626 256281 258341 257176 255706 255119 239715
9302 239715 233539 243190 249015 243081 233213 226161 225787 228983 217716 205559 200956 211365 205415 191379
9288 191379 209218 210666 196254 193135 191510 202867 203874 201469 187931 204703 210490 209695 211069
9275 211069 211598 216892 220251 225015 234761 250341 254080 252928 267027 305209 343443 376791 422553
9262 422553 476774 518289 522665 475383 420777 370477 322363 309632 303791 292463 284071 289880
9250 289880 313328 363404 414101 455573 489547 491320 488516 480740 463246 446154 428905 415348
9238 415348 391322 375469 374375 388367 395027 396975 404075 429240 474461 544622 645544 784266
9226 784266 925881 1018038 1033082 957317 821476 675957 560257 487592 438086 414864 407303
9215 407303 405916 412512 399001 388575 394773 416714 442812 448362 458072 478318 507583 518882 492207
9202 492207 437887 373931 320920 292834 274634 260035 277404 277197 269715 277747 305910 350663
9190 350663 411299 460768 474012 440961 387382 345757 302244 270318 258127 245019 221229 197954
9178 197954 166325 151325 152518 157131 154427 153310 145620 148542 144591 143170 130713 113299 116219
9165 116219 128257 136761 130211 129934 131579 127880 132105 130174 125330 130245 132997 129963 129976 130578 130970
9150 130970 126083 127989 128209 129016 124074 130751 133078 126683 135983 139233 127782 113334 101736 95974
9136 95974 111454 112137 117113 109621 110398 106041 104294 103848 105309 103723 106961 97484 103736 92069 87420
9121 87420 88976 101032 100454 95123 98644 98087 93702 94275 92038 85495 85567 75187 68478 68912 79724
9106 79724 78897 90458 115492 126117 133389 124282 115972 114195 98254 95535 99169 87932 89154 90817
9092 90817 103515 111307 97980 92240 93128 85790 86992 90064 87065 88329 98896 99695 94148 92370
9078 92370 106082 101546 95303 108485 104467 89137 92582 94917 110258 101886 87498 80390 85998
9065 85998 82609 91314 95033 112942 115094 111490 106302 117482 123555 123217 114357 106332 108744 112468
9051 112468 106729 105444 110932 111860 113831 121265 143159 151648 151701 167494 180355 202104 235664 245239
9037 245239 271056 318190 354773 400055 469537 558087 692118 848642 1019265 1160475 1219205
9026 1219205 1178710 1061427 894651 743382 624685 528881 455258 381413 329757 282546 256217
9015 256217 232571 212141 186182 166646 154775 140169 131033 123582 114763 109847 99890 95155 94620
9002 94620 100831 90548 89583 96132 103386 109522 81705 71433 77845 78350 77246 75214 71468 64620
8988 64620 62451 69010 64585 59074 55194 52394 56831 69364 70681 75329 74331 76963 70800 61831 61266
8973 61266 68751 71398 76454 67559 55134 58843 41764 49496 53660 59818 62518 45148 32072 20817
8959 20817 27336 50929 44945 35693 42812 51487 47909 30663 29479 38746 45275 41112 35733 52936
8945 52936 68268 61961 59718 58434 54527 39680 22103 12280 20516 26321 24079 26960 38508 45047
8931 45047 48624 48757 39368 40740 45261 48730 46044 50228 59577 67928 60576 51586 37385 52851
8917 52851 57896 50594 64254 76626 69626 53502 61887 69742 63821 51565 43004 44060 55069
8904 55069 55149 52804 50198 58889 51217 37891 35269 30756 36827 35302 38866 52951 54643 36290
8890 36290 51650 53450 35734 30029 30225 33543 43852 50475 50194 47910 40014 26652 33414 39243
8876 39243 45312 41965 25903 12816 15611 22568 29499 33437 18169 19972 42411 48727 49730 35657
8862 35657 20387 25234 25973 27806 22125 21646 30804 34992 30656 30112 39647 41906 37292 32451 40168
8847 40168 50065 53481 49629 45327 32010 24819 29608 39884 46264 36565 27471 10164 8921 18945
8833 18945 27166 32646 34248 47077 45481 46858 37888 27782 19116 29949 40895 39198 34438 22699
8819 22699 9513 10587 42676 58790 46614 43156 37565 37601 46748 56627 53730 59522 67648 74098
8805 74098 50145 36345 38579 35655 55771 55818 50434 44703 29835 27568 31063 36002 37948 29107
8791 29107 22789 25340 19614 16670 22729 33721 47182 53148 58466 50577 25430 23622 33812 27233
8777 27233 34510 33073 39022 23926 18953 20760 15560 23941 19331 14281 12638 15334 19131 18765 25623
8762 25623 19427 17653 22337 24774 31761 30863 21322 7948 220 678 17321 20123 27513 23967 30933
8747 30933 17260 16100 19570 28392 36275 31908 41059 44518 43811 26629 22350 20561 19235 19430 20690
8732 20690 30367 18821 1968 -6562 4793 26213 37639 36053 36852 25560 13979 22436 7382
8719 7382 3035 -7633 3946 24873 40365 34732 34313 37390 44670 48153 35049 25633 24257 34167
8705 34167 32379 20731 19096 20520 29887 22612 16877 13475 16123 15034 20984 27364 24421 21211
8691 21211 20316 32095 30873 29317 23213 17439 37414 48200 42271 37056 36284 29450 30838 35777
8677 35777 36126 37977 48832 47148 46406 30366 18465 12174 14851 17701 30543 49666 42043 40054
8663 40054 42338 34775 19740 23460 21932 20246 20753 21749 29376 26544 27318 27796 41081 39290 31932
8648 31932 43098 40729 38369 39156 32140 48767 61518 62396 61858 58671 51168 67802 71763 65352
8634 65352 59956 69134 92502 126973 178462 265754 424937 584034 614977 528883 370304 260005
8622 260005 185999 150090 133656 95594 83099 78406 76494 84423 74051 65398 62443 49265 39622
8609 39622 37514 39732 55602 61459 69939 51684 51360 57760 59854 68607 74542 77905 76196 80313
8595 80313 80410 79224 78027 92461 116615 125464 124887 152606 184885 238097 323472 484180 776142
8582 776142 1123587 1268513 1139506 840835 572559 406502 314503 264240 230178 210205
8572 210205 181936 191939 214489 238083 243265 221912 189157 156419 119137 97477 89374 90699
8560 90699 84189 86248 104363 98054 81543 71968 71011 65764 66600 58812 58714 50155 40541 62603 77083
8545 77083 80061 82673 96072 110875 114186 143793 200681 327265 488941 586459 564842 432451
8533 432451 290953 209414 157893 132813 134303 137146 150069 185008 225383 237719 218804 177776
8521 177776 130512 77525 54073 36595 31754 28523 30345 29553 15637 18712 29713 28485 21008
8508 21008 35620 49913 59512 51536 41983 39324 23207 27451 35938 39333 38447 40313 47012 39205
8494 39205 49238 53113 52741 49059 50423 52690 50049 34922 33376 32024 40143 64963 91576 102983
8480 102983 119808 118825 99666 81606 71791 64903 49348 27709 22412 33235 49026 56639 55476
8467 55476 44648 34402 24634 20476 28517 31707 28682 21444 21256 27292 30589 22401 17001 13156
8453 13156 15253 13657 15110 8220 4946 6288 6606 17824 18528 9867 11390 17060 14569 7013 2133
8438 2133 10422 8681 5752 10278 12180 23034 36520 52343 51342 24555 9668 24578 20158
8425 20158 23416 18981 3387 -4207 7612 1977 7766 2907 -6919 -17317 -2605 2163 -786 -1716
8411 -1716 4702 10753 18703 30321 35369 39408 51938 47815 35956 11166 -3969 -5955 4645
8398 4645 -5270 -14416 -13699 -10707 2176 8581 11156 5269 -2571 -1720 16624 18097 20503 22196 10098
8383 10098 -1230 23282 34241 33787 20603 18622 38235 36787 41043 37591 36697 24272 6211
8370 6211 -6959 -7418 11146 36727 44891 41364 35385 17160 2679 8550 19641 17773 10193 -6217
8356 -6217 -19171 -7438 -320 8250 15411 25055 33819 26688 10769 -4623 -1804 12745 18085 7164
8342 7164 6620 17535 14711 19797 24406 19775 8174 10709 30045 22730 16113 15156 10022 14724 18363
8327 18363 14854 -5616 -13676 -17114 -9069 -3698 -7975 -15672 -14040 -4975 5749 6313 3013 1219
8313 1219 -4895 14925 29665 30868 24409 14549 -4166 -14349 -5689 -5147 -3209 -7295 -7956 1219
8299 1219 3955 -2091 -5208 -7594 -1255 2286 6125 4859 2843 8467 9420 5822 5806 -4115 859 -566
8283 -566 2105 6125 9371 12247 6331 3722 -110 -8374 -1189 22538 32336 20131 24840 38296
8269 38296 27332 18477 26248 26432 14289 8807 10703 13206 3017 -10713 -5275 2331 6179 1878
8255 1878 3241 5108 -1 10009 19748 19795 4400 -20112 -27629 -13672 -1215 1317 3660 1103
8241 1103 7595 5766 7346 21374 16145 5132 11299 22096 6846 -2788 1295 4403 6814 -684
8227 -684 -5112 -747 -4094 1874 -3736 8923 1934 10294 11877 22759 19144 18201 18309 4600 6931
8212 6931 -4882 -486 11091 20724 23293 21563 8453 -1933 -6277 -4228 -8555 -12491 -5127 -1771
8198 -1771 -5630 4387 15791 26537 24816 23978 22713 -1694 -15746 -18883 -16266 -12808 -3468 4400
8184 4400 7729 7138 11956 13339 2811 -6375 -12318 -8602 -968 17150 15326 12439 8774 17689 16190
8169 16190 19841 14830 9194 2759 -3557 -5524 -1549 12906 25327 33437 16924 6158 10835 13715
8155 13715 1519 -4702 3648 11164 6041 5483 -3002 -6640 506 1233 -7976 -19981 -29948 -22296 481
8140 481 13238 15401 15693 11364 3440 5116 1075 -1808 1529 3308 9120 2487 6908 14114 15201
8125 15201 14987 13010 -6545 -4652 -9643 7968 18579 8057 10567 7139 7823 729 -4242 13409
8111 13409 26771 24758 13920 6417 4780 10947 23207 26181 10015 10516 20333 19692 31267 25220
8097 25220 17209 17771 14706 23998 24805 10786 -1016 3301 12747 27030 39899 32150 22290 3864
8083 3864 -2549 -2858 2352 17063 27854 30680 39896 34442 29878 34328 37518 31213 16101 14067
8069 14067 16628 6713 1918 4502 2565 17296 32205 30195 24202 20252 17685 18373 26284 29692
8055 29692 24003 15753 21326 30313 32744 17455 7939 12819 15873 16353 22148 12910 5045 1476 -899
8040 -899 9211 -1307 -566 6264 10095 5929 6687 1721 -9317 6742 14982 10173 5422 5352 5396 16541
8024 16541 17555 8327 5878 9191 3746 5032 9617 15391 34221 51792 53531 41326 45416 43353
8010 43353 30537 15871 10081 18303 27972 20055 2129 3467 10280 8754 4335 7362 9392 2718
7996 2718 16515 23977 28477 29568 35053 30095 23332 30060 32322 31957 29744 21524 23212 33056 35236
7981 35236 33508 34250 37608 30631 15902 18744 29816 34977 25588 12747 24644 28399 28638 37628
7967 37628 33526 21103 10704 20311 17182 8297 17528 21134 10977 2145 2993 -1820 -9040 -10020
7953 -10020 -6675 6675 13615 20379 1699 -7956 944 24867 31298 37025 36025 27049 29252 29008
7939 29008 44000 50973 39195 26412 16722 13259 9945 12601 18101 20369 26781 18064 15810 16974
7925 16974 5838 10061 11531 14397 9670 25033 30839 17652 14908 16146 17740 13701 11614 4472
7911 4472 8636 7001 -10852 2125 14429 19560 8740 2982 13459 19547 27443 24792 16105 25452
7897 25452 32859 30946 16164 1599 1296 4858 9148 7309 2602 11733 11624 327 7553 17563
7883 17563 16342 15206 25960 24444 34499 37978 19014 18450 31254 27631 24640 17690 9105 8569
7869 8569 12880 8522 9457 -1019 1972 8808 1908 6939 11016 13677 14626 126 12442 11057 7652
7854 7652 8095 -5753 5800 27167 32666 23108 22295 23528 28190 34150 31475 22935 22270 11993 -397
7839 -397 2413 13443 26908 37090 24389 11434 -7909 -20341 -8635 -8846 -7902 -4326 5492 10366
7825 10366 20474 19102 12397 3058 4120 3260 2293 -14189 -25920 -28544 -3376 1101 -14695 -19864
7811 -19864 -7602 -4605 -1296 5395 13562 19512 9079 12598 10646 979 -7445 -13977 -3703 -698
7797 -698 -12098 -6580 4285 -1150 -7856 -9204 -7814 -5627 2239 -5542 -14681 -15998 -4891 4471
7783 4471 -122 8710 10093 878 366 1561 1839 -4632 -17893 -29522 -27975 -15797 -5089 -971
7769 -971 -10716 -15095 -6624 9786 6865 5103 8653 15975 10261 15533 17773 7194 15679 16471 8430
7754 8430 5130 4394 294 -16298 -27734 -19576 -8311 2652 -1799 243 -9410 -25304 -33328 -21790
7740 -21790 -11152 -5289 -7651 -13050 -14410 -2062 683 3521 -4415 -3064 14837 18639 7719 9086
7726 9086 8937 10289 17887 19429 9796 -1381 -2465 -9012 -8602 -9162 -7701 -9248 -389 2994 4143
7711 4143 -140 -13017 -20136 -21599 -13151 -8163 6073 21581 9499 4363 20217 3844 -14354
7698 -14354 -17593 -19154 -17197 -5727 -7720 -9618 -9819 -20006 -15836 -11841 -14379 -14141 -3780 -6447
7684 -6447 2658 4574 -2326 662 -11922 -26490 -33563 -24635 -16691 -22575 -28077 -34135 -28046 -25776
7670 -25776 -28637 -30682 -25240 -17563 -29090 -34422 -20171 -15401 -13999 -8174 -3630 -1396 -8513 -10131
7656 -10131 -6531 -10231 -23053 -14681 -8741 1040 -1345 -5510 -1477 -1512 10696 6151 -7391 -5776
7642 -5776 -9518 -40621 -44773 -30822 -21198 -14514 -6893 -9252 -10073 -4932 2848 4583 11064 -7829
7628 -7829 -18347 -17261 -7579 -9332 -3371 8441 19946 24107 15907 473 1662 -913 -323 2081
7614 2081 5303 -6065 4051 10585 9301 15596 8523 3224 -4269 -24335 -26094 -21177 -26420 -22267
7600 -22267 -5830 12172 -827 -5911 -8453 -7681 -8468 -17260 -24511 -22926 -14280 -24359 -18913 -10666
7586 -10666 -5502 5490 9000 -7342 -8175 -3370 175 10550 4517 -10586 -11593 -4085 -3297 -7463
7572 -7463 5364 13923 244 -9581 3343 10818 15136 738 786 -1162 5038 -94 -10370 -25961
7558 -25961 -30711 -22834 -13666 -1168 -13091 -9009 -15856 -18633 -25070 -15704 -15083 -15884 -4346 12120
7544 12120 11563 25762 29027 17375 4306 3308 3684 -298 140 -19258 -15664 -3167 -165 -6971
7530 -6971 -7674 -1332 -10575 -14277 -22472 -25310 -30271 -21937 -27776 -25460 -16914 -9490 -13737 -9788 -6039
7515 -6039 -13185 -12568 -363 -4949 -1679 -3629 -6212 -12427 -7969 364 11596 20675 13529 -1496
7501 -1496 -4054 -3354 -7355 2438 17224 11841 -1000 -4207 -9609 9827 8643 -6646 -14967 -11160
7487 -11160 -2318 7852 10185 10856 6704 -1748 -1993 1414 3497 -8887 -10451 -8834 -13866 -13544 -4836
7472 -4836 -7479 -18694 -16235 -12432 -8015 -8883 -14669 -16015 -13816 -9248 -1803 2221 7218 9528 10222
7457 10222 11573 20880 19742 2978 -6895 6039 15444 -3028 -14514 -19259 -26656 -34619 -28610 -20819
7443 -20819 -11517 -7486 -4753 -23195 -32083 -29483 -23738 -29437 -17054 -11901 -20408 -17338 -8127 -9055
7429 -9055 -2121 7961 7994 512 -10422 -15440 -13909 -13762 -4823 -23211 -25009 -16589 -18462 -30920 -30951
7414 -30951 -26277 -24009 -22122 -23386 -34083 -36925 -36875 -17784 -3293 -3404 -2976 -5013 -499 -770 -19190
7399 -19190 -18376 -12030 -10330 -10852 -13470 -11278 -20908 -17428 -1519 7830 2863 1043 -9246 -12599 -4400
7384 -4400 14481 14225 12487 1440 -19068 -13306 5079 8324 2989 7880 4256 7976 1719 -3549
7370 -3549 1552 -6846 -11491 -5969 -9254 -25489 -21730 -21087 -12071 -14046 -15760 -13992 -1264 4645 -2117
7355 -2117 388 10741 4181 -1278 -9299 -4932 -6398 2622 -6378 -12998 -9998 -14608 -6470 -1134 3452
7340 3452 10774 15003 12706 7660 23157 33450 26884 18301 -2312 -18991 -16028 -5280 2639 6710
7326 6710 4055 1832 -451 7147 11980 20717 14073 18343 11804 6858 3496 22182 33310 24683
7312 24683 8176 -298 -11152 -17396 -144 8063 -3460 -22668 -19973 -11482 13170 11001 8449
7299 8449 18015 14243 -1936 6796 15126 14532 6964 5984 14492 13770 6742 -9848 -7568 4314 14540
7284 14540 28795 25402 12367 -4345 -10416 -2045 -8125 -4941 -3000 -13186 -18543 -26887 -10546
7271 -10546 9613 15845 6105 -4948 -1637 2606 -528 -19970 -28769 -23676 -21831 -21156 -26562 -21281
7257 -21281 -12889 -12303 -28711 -42217 -34882 -45089 -36290 -24605 -17465 -8485 5255 17596 14839
7244 14839 -122 3217 6273 2723 122 -2223 -726 -8157 -15577 -16740 -10807 -19134 -34627 -39496
7230 -39496 -29424 -26434 -19443 -23636 -22997 -29039 -26698 -22957 -20760 -12413 -10179 -25704 -16220 -7996
7216 -7996 -3522 737 10814 11733 4035 4074 5728 8747 -5040 -21105 -21342 -19433 -23520 -22731 -27992
7201 -27992 -32376 -48495 -54159 -43371 -33577 -14383 -8153 -21345 -22691 -31660 -15611 4821 -8045
7188 -8045 -16887 -6943 4303 -1555 -13707 -16775 -13219 -19063 -11388 -13548 -20128 -29011 -26914 -18866
7174 -18866 -25171 -26099 -18365 -11122 -12361 -13948 -21815 -20175 -653 6131 10621 6083 -8212 -12138
7160 -12138 -13230 -10303 -5192 -7425 -12940 826 -2202 -8768 3143 2925 -8095 -13989 -24643 -29880
7146 -29880 -16598 -23683 -18862 -2277 -16152 -18938 -18447 -16908 -26369 -25009 -16211 -12649 -13017 -7512
7132 -7512 1715 19107 18748 6437 -3335 19973 21372 14219 5704 13155 14031 5142 -2608 -12592 -19370
7117 -19370 -14659 -23302 -14513 -9953 2485 12260 9506 1723 -2333 1435 3547 -6973 -7760 5326
7103 5326 13284 14661 3677 -7998 -18460 -17631 -10854 -668 7783 7567 2168 2136 -4791 -4134 3544
7088 3544 1492 -9090 -12970 -12359 -10704 -9582 11048 18464 7966 -3848 -8670 -10745 -591 10615
7074 10615 7178 5718 11700 11646 13493 13684 6055 -1240 11196 15499 7030 -8273 -18891 -24459 -22829
7059 -22829 -12132 2856 -1268 -1234 14942 9590 -4163 -5989 876 16996 24443 19257 10393 4857
7045 4857 -6963 -3338 1377 -1968 -1625 -582 -11129 -10667 -13070 -28484 -27344 -18274 -19396 -4903
7031 -4903 -4559 -5148 -1374 8363 10708 9031 6259 4424 -4860 -12147 -7487 -10443 -18250 -28560 -39376
7016 -39376 -34576 -21779 -10560 -16113 -13771 -3141 1567 -3095 6769 9580 20360 16753 -2670
7003 -2670 -10314 -16392 -11418 1 -5352 -17533 -30414 -29498 -12424 -7095 -4071 -1331 -14687 -29365
6989 -29365 -28238 -20596 -4452 -13538 -27652 -22080 -26790 -15466 -11925 -17576 -7033 6689 6240 13766
6975 13766 4997 -1795 -3258 -19785 -24111 -26636 -23199 -14279 -8526 7099 7589 -3685 -14369 -23147
6961 -23147 -17819 -24016 -19396 8669 12393 -8215 -17548 -13177 -30687 -38604 -27718 -11150 -6249
6948 -6249 -12583 -15124 -15098 -19543 -13740 -3960 -6887 -5008 -4943 -4984 -13527 -18829 -16635 -22065 -20014 -33709
6932 -33709 -27279 -9406 1075 8226 19359 20532 26134 22199 16647 -6164 -11227 -2300 -3923 -8219
6918 -8219 -3423 12207 8603 -3663 -9684 -7269 -13852 -7403 -5292 3807 4305 -4063 -9378 -4478 -1927
6903 -1927 600 5807 13117 21092 20642 15014 14944 30618 26346 9198 3961 -80 -7383 -4284 -1279
6888 -1279 -2231 -632 -1283 -1781 -312 -4236 -14379 -25322 -34894 -34716 -34194 -14165 -8909 -20888 -25570
6873 -25570 -29137 -9881 18044 27691 29564 20277 1043 1315 -4935 -596 6090 1126 -613 7378
6859 7378 3436 1157 3545 -10021 -21759 -33818 -28318 -12787 -12036 -843 2043 9032 25589 32753
6845 32753 17428 -21151 -15432 -26902 -27910 -23692 -12360 -6455 -17517 -26460 -14742 7103 4223
6832 4223 -17347 -13424 -10422 1784 4135 -4345 -27383 -30937 -21268 -5291 -14195 -16033 3424 1755
6818 1755 -10268 -23365 -24368 -17853 -8436 11709 -8401 -15382 -18473 -21349 -17032 -21981 -29614 -26959
6804 -26959 -12806 842 21853 12970 15881 27813 16440 12208 16746 11107 -5538 -12913 -17547
6791 -17547 -14825 -2474 2652 -7166 -15511 -6353 6353 -739 -8333 -13107 -17074 -25430 -39614 -24176
6777 -24176 -17067 -18673 -15019 -22413 -13152 -15934 -13455 -15816 -14495 -6867 4793 -5312 -19648 -18503
6763 -18503 -6552 -10098 -23040 -19643 -21453 -17052 -17173 -5350 7466 -3418 -12530 -21559 -27498 -6658
6749 -6658 -2410 -11381 -9698 -4875 -6165 -9068 -11547 -19925 -16226 -4034 -9426 -11973 -9958 -13384 -14760
6734 -14760 -9428 -13273 -11592 -13725 -18210 -14306 -13139 -13058 3059 5424 -1805 964 -6516 -2606 7760
6719 7760 2608 -2142 7159 13174 4136 8698 16732 29392 31975 44528 54678 65783 65046 65056 66213
6704 66213 49307 34100 5729 -12317 -20749 -12652 1906 14656 39706 18509 15716 14266 -13105
6691 -13105 -27543 -11621 -2697 4592 1783 -9288 -22065 -23128 -22133 -25101 -22907 -34911 -25903 -16390
6677 -16390 -24406 -20333 -19163 -9784 11166 13076 8495 -4804 7559 9419 -2542 820 -1088 -10619
6663 -10619 -20859 -23724 -25328 -28882 -10842 -2932 -7111 -14387 -5438 2521 -4533 -15700 -20077 -17082
6649 -17082 -8554 2030 2710 -7193 -6392 2181 -10372 -19352 -31255 -32936 -30130 -32887 -34018 -20188
6635 -20188 -11872 -17027 -15628 -12623 -736 -2914 -5644 6026 118 -3017 -10330 -12392 -9324 -10902
6621 -10902 -14884 -4353 9959 4872 -6254 -4955 -10798 -14011 -8885 -8059 -13708 -18030 -14492 -9462
6607 -9462 -5669 -3521 -1271 -4197 9447 8982 2229 -5924 -25472 -25862 -23187 -26184 -20850 -9508 16328
6592 16328 1631 -16679 -10815 -2549 -15109 -3223 9742 -4712 -868 -205 -6512 -15336 -16268 -17182
6578 -17182 -13047 -725 2501 -2473 -15431 -18810 -10311 4462 -7222 -10433 -20539 -21439 -7247
6565 -7247 -6056 -4225 -9748 -8558 -3488 -16655 -4324 3529 10434 5381 -5145 2270 -12442 -8863
6551 -8863 2637 3506 6826 -4383 -3582 -3952 -1128 -8603 -12226 2343 826 -18457 -22743 -3034
6537 -3034 1563 -563 2514 3010 -844 -4739 -17347 -16980 -9041 -6239 -14117 -19864 -16699 -13553 -16936
6522 -16936 -21316 -22684 -23670 -27220 -26766 -14894 -6622 -31665 -28401 -14279 -17142 -25812 -29287 -31645
6508 -31645 -28747 -9264 -3890 -2468 28249 29902 11669 7887 11689 10921 10591 4930 -14528 -29449
6494 -29449 -27845 -20618 -29069 -16225 -6676 -2487 5946 9945 -9022 -14872 -23758 -21285 -25944 -20121
6480 -20121 -20088 -18984 -13553 -1904 5900 -5031 -11408 -20692 -19042 -12591 -5163 -7951 -8099 2521 6651
6465 6651 -3999 -17756 -6203 -544 -9239 -13349 -16088 -17117 -23110 -22397 -5217 7487 17740 15336
6451 15336 18729 6341 607 10362 9048 4183 5543 -9394 -10696 5264 1505 13644 8917 -6155
6437 -6155 -17412 -16957 -19065 -18463 -27917 -27083 -17592 693 -2896 -1792 5110 -3632 -12112 -7823 -443
6422 -443 -1560 864 -5415 -17204 -32732 -40762 -24775 -12069 -14579 -18534 -22149 -14931 -7731 -3536
6408 -3536 -6995 -14352 -20481 -4472 -271 -11551 -19099 -12570 2909 2784 3165 -889 -1774 -5208 -17846
6393 -17846 -17083 -11544 -14345 -13411 -26219 -40502 -25894 -8972 -1657 2429 4093 8435 13000 17
6379 17 -8729 -22185 -34248 -19458 -5964 695 -3647 -22399 -16921 -267 -3760 -16342 -8259 -11328
6365 -11328 -17450 -23307 -8227 -16572 -18428 -15529 -13272 -13317 -14467 -13640 -11852 633 6824 14066 21619
6350 21619 16302 3373 -10220 -18729 -36545 -41170 -26073 -14019 -16999 -6357 7408 4227 -2851
6337 -2851 -17515 -28739 -28317 -24428 -5171 -3687 5867 12147 9411 651 -3766 703 -2541 -10062
6323 -10062 3770 20338 17452 14552 -2898 -3506 206 -2206 -7593 -6267 1560 -5848 8891 30477
6309 30477 22707 2122 -13102 -11665 -10391 -3791 672 1054 10427 16043 4516 2184 -3192 -1478
6295 -1478 12915 24008 10273 -3772 -20851 -22440 -6614 -2896 -6907 -3027 2019 -3446 -7719
6282 -7719 3419 17004 10732 -3811 -1705 13876 8573 -5995 -16118 -12552 6345 -248 -13227
6269 -13227 -13271 -9809 -10356 -28124 -26490 -13572 -19157 -18514 -27315 -25668 -23242 -31002 -25307 -15667 -15112
6254 -15112 -13262 -21944 -24690 -19687 -21121 -17037 -9648 -1511 -6615 -12769 2457 16852 29929 17476
6240 17476 -15057 -25772 -30928 -26921 -40607 -29526 -16543 -18470 -21329 -9889 -2381 -1998 -809
6227 -809 15944 -4904 -30226 -16685 -9866 -10272 7552 10757 -3389 -4175 5323 2938 -7220 -6921
6213 -6921 4082 -3998 -9309 167 -5907 -15733 -13081 -14700 -21171 -19904 -26519 -35191 -40403 -22036
6199 -22036 4026 15724 14129 9128 -2787 -11094 -6533 -1324 781 11329 3597 -4017 -8426 -1627
6185 -1627 5208 -8302 -9863 4677 5954 -2906 -6675 6441 18661 11084 13212 12785 11786 10225
6171 10225 12333 6145 4413 -790 -15767 -18341 -15256 -15086 -9367 -22672 -16883 -10853 -5796 -8276
6157 -8276 -6510 -15303 -30227 -28115 -23954 -26094 -21740 -16893 -16896 -13833 -12143 -1226 2133 10381 11020
6142 11020 18456 22115 29044 10855 5410 6032 8947 -1667 -3305 -8608 -12578 -11318 -18658 -14254
6128 -14254 -10893 -18041 -5334 -3744 -7931 -119 2741 -5722 -6306 -1718 8046 9895 8261 -15306
6114 -15306 -18746 -24380 -26666 -22001 -12897 -5787 -11686 -18432 -7309 4628 14077 3623 -7970 -22168
6100 -22168 -17797 -25532 -21227 -7724 -16514 -18660 -22175 -22273 -11235 4083 1721 -1707 -9420 -23107
6086 -23107 -18432 -11306 -18748 -17633 -23112 -35681 -37198 -29214 -5173 9097 9138 -11079 -23536 -21970
6072 -21970 -24340 -20704 -20941 -15868 -14696 -5600 -193 -10148 -13532 -10365 -13952 1344 -190 -4057 -6266
6057 -6266 -7149 -3576 -3141 9786 2646 -10860 -6222 -3137 183 10956 4821 -16388 -22450 -15196
6043 -15196 -8284 -13381 -31026 -39218 -37661 -32521 -16640 -18080 -31954 -27920 -23239 -17730 -11379 -1057
6029 -1057 -9983 -24519 -9923 255 1545 -440 -16327 -20463 -19690 -13175 -2276 5028 6265 12326
6015 12326 10245 3709 3801 2518 -1658 -11155 -16822 -28478 -29632 -22449 -14722 -14503 -4602 10560 9515
6000 9515 1689 -3114 -20409 -28781 -25739 -14103 2239 17679 30361 25231 14550 1342 -1938
5987 -1938 -16485 -24735 -11487 -11669 -11469 -15362 -16020 -13940 -8056 -10781 -10946 -10581 -8181 -10355 -7512 -2316
5971 -2316 -2157 5440 1025 12723 26450 30096 19371 19766 12927 9881 1839 -10128 -13896 -6642
5957 -6642 -15119 -22147 -14791 -6260 -1743 2166 2540 -6093 -13080 -12521 -13338 -24511 -24826 -25279 -12733 -686
5941 -686 -988 -5421 -11560 -10530 1077 6916 4348 11378 13839 15184 11149 -345 -5967 -2951 -9717
5926 -9717 -7226 -3348 -8524 -12800 -13881 -10868 -7203 -14132 -25995 -34048 -44035 -38093 -31190 -34576 -22298
5911 -22298 -10982 -12810 -22805 -10687 -5789 -19869 -12285 4198 7300 7560 221 -7838 -20334 -15944
5897 -15944 -5724 -5332 254 3249 -5964 4122 2735 1525 -8465 -23629 -32225 -28803 -18794 3899
5883 3899 -256 2011 12309 13783 8679 4574 390 -7492 -17619 -22208 -16216 -13000 -11479 -3982
5869 -3982 1584 -11160 -20316 -19039 -16139 -15050 -8825 -13772 -2580 3259 2497 5673 6277 5987 -1010
5854 -1010 -16154 -14378 -6087 -6856 -13071 -3944 -4394 604 944 2243 -7862 -15799 -26579 -24393 -12804
5839 -12804 -16474 -27756 -30420 -22972 -11206 -5069 7212 -1884 2734 4229 85 10030 13997 14991
5825 14991 5199 491 -4721 -3482 136 -6329 -6508 7365 14390 9850 -6913 -8889 10044 19462
5811 19462 19399 14993 5537 7594 2365 -8906 -1198 286 -4978 -6337 5435 6615 3798 8445 702
5796 702 -7970 -21416 -11334 -15119 -3552 -7820 -17846 -14543 -16495 -18740 -9109 10695 -4888 -25620
5782 -25620 -28020 -10561 -4252 -2316 -4658 -61 5051 6689 -3755 2792 6949 10746 19965 13700
5768 13700 7600 8519 8485 14801 5200 -11300 -19134 -9897 -9485 -12492 -5605 701 13438 23137 19924
5753 19924 9177 -1704 -951 8438 739 -12368 -11144 -7245 -6182 -6880 -2660 -5856 -8327 -410
5739 -410 12402 17496 17213 7978 8028 -3595 -2277 3455 4677 -380 2822 609 -7274 -15054 -19633
5724 -19633 -9635 -13173 -14233 -12564 -21337 -25261 -17787 -16437 -17075 -20984 -15847 4011 9830 3778 8060
5709 8060 7972 9707 13984 18537 19934 14336 -10982 -31239 -31712 -19936 -5473 -5953 -16742 -17104 -10386
5694 -10386 -6152 -4761 492 -5313 -3676 5672 -791 -2925 5275 -7900 -11349 -26329 -21812 -5107
5680 -5107 -1304 -12858 -14932 -11345 -12478 -2417 -5597 2673 3621 -3019 -13961 -18252 -22308 -18490
5666 -18490 -21138 -28515 -29457 -33323 -29879 -23981 -16138 5362 15298 2333 -10406 -11812 -13894 -23904
5652 -23904 -23216 -11035 -769 1639 3200 -1877 -4783 -10622 -54 26130 33631 28591 19548 9383
5638 9383 8854 10988 2045 -4796 -5088 -813 5257 15445 5266 1077 -5669 -7932 -21 -917 -15539
5623 -15539 -29168 -13120 -3064 -6545 -3198 16796 144 -12171 -12537 -9366 -10020 972 -6829
5610 -6829 -11418 -9169 -6331 -8224 4862 6506 8677 -4548 -3203 2043 7766 9353 -6047 -12532
5596 -12532 -14881 -13482 -14531 -15239 -13598 -5263 -15615 -4388 2662 16788 16804 15367 3385 -14082
5582 -14082 368 5979 3529 -7283 1503 2907 2362 -5826 -25814 -43029 -49022 -35900 -26961 -32504
5568 -32504 -35546 -14132 -3366 7605 16932 10760 -8127 -14899 -11354 -2849 -4436 -12760 -21077 -19497
5554 -19497 -10446 -10185 -4091 3846 3829 -3894 -14493 -19236 -15740 -11074 -15813 -12912 -10644 -18741 -24469
5539 -24469 -16399 -11884 -22153 -20139 -17624 -17106 -993 17808 14738 776 -15896 -14063 -551
5526 -551 6394 18864 18012 19475 6682 -13818 -21854 -25941 -22343 -18884 -28630 -29029 -24132 -19535 -7249
5511 -7249 -5985 -6875 -19815 -19960 -9245 -19204 -18771 1650 13903 16767 2113 -9452 -7537 -6351
5497 -6351 -562 10842 6824 8863 13826 3541 5360 -10004 -11177 -5891 -8993 -15759 -27196 -24404
5483 -24404 -22624 -5720 -3630 -11408 -14388 -20146 -16963 -272 5437 441 -9781 -5580 12249 11126
5469 11126 9597 8789 -658 -582 7502 -11102 -24081 -33218 -21201 -8231 6176 1894 2543 6273
5455 6273 4962 197 -2881 -5977 -11472 -7442 -3574 -2007 -9510 -15883 -10538 -10272 -2828 -4861 -13109
5440 -13109 -33192 -21987 1319 6681 7857 -4020 -13264 -18197 -9526 1893 -6365 -27646 -17218
5427 -17218 -18266 -13194 1813 7789 567 9191 13918 6165 -1681 -5631 -11219 -10072 -6234 -5902 -17036
5412 -17036 -14472 -19133 -26626 -15767 -129 14573 23500 12924 1828 -1556 -15559 -21635 -15641
5399 -15641 -8582 -15476 -10763 -37 -3135 -6418 -21489 -30144 -21462 -27197 -26111 -26329 -27497 -24931
5385 -24931 -18547 -16148 -17734 -10123 80 -4341 -13704 -20004 -18452 -3318 10825 7080 7613 9201
5371 9201 -1216 -12800 -12014 -12298 -1676 -10032 -23801 -23488 -12594 -11696 3575 9730 -7211 -12502
5357 -12502 -7074 810 16128 13464 -9525 1483 3482 -2451 2464 12992 17358 6648 5151
5344 5151 -2201 -6313 -17588 -4867 9019 13012 11542 18324 14523 9653 1173 3854 -4286 -13861
5330 -13861 -27050 -14340 5150 10166 4589 -4226 -1155 1946 -7532 -20410 -27609 -17322 -6808
5317 -6808 10855 18929 11069 3459 7785 11587 4036 -7042 -2089 2786 -10904 -20282 -13807 -11462
5303 -11462 -10928 -14360 -9297 1991 14982 15808 13886 12961 19501 19917 6168 -11299 -9893 -2128 2668
5288 2668 -14784 -11392 -3957 -9926 -2391 4801 1907 -4761 -11131 -10393 -10498 -7801 -6624 -5396 -5983
5273 -5983 -124 8560 11034 1570 -3680 1541 7830 798 -1607 -11575 -4862 -14299 -16251 -15166 -6044
5258 -6044 -11237 -17069 -11474 -16177 -5378 -4955 -117 -8584 -25777 -20230 -14159 -5940 13405 14702
5244 14702 6534 10241 14963 3527 -14939 -10428 -18956 -21131 -21182 -25333 -39992 -36227 -18188 -1697
5230 -1697 380 -6659 -12704 -16635 -27164 -20588 -2084 -3422 2744 19574 22070 21972 16178 21230 21682
5215 21682 19109 25024 35840 15324 2550 7245 7465 7183 -2281 -15505 -2632 -151 -17119 -25842
5201 -25842 -19879 -8275 -3909 -21152 -18870 -10090 -13869 -14292 -12387 -8856 -2814 3466 7650 5614
5187 5614 -700 -2091 10605 33690 28341 -3541 -6791 2940 5059 -5912 -12869 -9893 -10937 -6796
5173 -6796 -9036 -35918 -17474 -1126 -5573 -11985 -7297 -4043 -7071 -10599 -12897 -19951 -20990 -6137
5159 -6137 10711 6685 5585 4663 -1023 27 -1070 7972 19142 12036 12013 11089 8099 20146 15266
5144 15266 12939 17330 14333 12389 -1782 -17670 -13750 764 6411 3715 -8742 -22624 -24832
5131 -24832 -6714 -3504 -10538 -8309 -12218 -16616 -13169 18566 30769 19992 5874 -7044 -23545
5118 -23545 -24815 -19642 -26187 -25173 -27832 -15097 -9109 -16636 -29767 -18669 -14508 -17914 -28824 -35418
5104 -35418 -21284 -5570 6107 16842 17652 19436 12449 16103 20765 19742 9709 2368 -3170 1909
5090 1909 3267 -8216 -10571 -7113 1968 7622 -915 -13059 -22222 -25035 -24212 -17328 -11550 -19544 -29905
5075 -29905 -41179 -27228 -17146 -5853 2677 -1047 -9809 -5589 1198 -5520 -3901 -6022 1784 -387
5061 -387 -7340 -2636 -1523 10303 25819 34118 28632 25216 19941 3087 -21277 -31668 -16266 10419
5047 10419 15772 6463 -10012 -7162 -1104 -9738 8642 23985 30217 23877 -1587 188 13545
5034 13545 3773 2826 -9443 -22195 -16894 -6914 -10676 -14711 -5282 8327 4819 3442 -309 -1716
5020 -1716 -11032 -25300 -25727 -16499 588 1795 -4641 4436 8075 -1052 -13123 -12944 -910 7294
5006 7294 -9218 -15031 -14433 -7876 6754 7536 15044 24253 28620 19418 3280 -461 1196 6838 15330
4991 15330 10448 2063 -10775 -10230 -7048 -6759 160 -6295 -10229 -20241 -27003 -24913 -19053 -12307 -14012
4976 -14012 -2827 7819 15481 1082 -21308 -17885 -20348 -29109 -13400 2282 8575 -5098 -14589
4963 -14589 -17971 -19477 -10118 -2185 -11500 -22023 -14475 -14967 -17680 -19524 -22032 -16380 -7564 -468 862
4948 862 4148 2945 2812 5289 5352 -1445 -8846 -19412 -27920 -32938 -33510 -19389 -10459 -15086 -11032 -9780
4932 -9780 -17795 -26713 -28479 -22086 -26136 -25918 -15082 -11693 -13700 -14036 -19256 -27577 -21854 -20403 -16235
4917 -16235 -23296 -24122 -24465 -10954 1874 -7721 -9395 -8271 -4138 6834 21256 15912 7441 12698
4903 12698 17090 6470 -10527 -6009 2931 10151 12574 -635 -15146 -14281 -6550 -11437 -9340 6834
4889 6834 16883 9352 15720 20625 18671 4033 -12988 -28643 -31973 -16181 -12714 -20687 -32466
4876 -32466 -35884 -19017 8 3423 15055 24872 10120 -1576 -14537 -17150 -18446 -26873 -32064
4863 -32064 -30532 -19370 -11841 -10626 -5983 4775 10667 4032 -887 -11053 -22453 -29924 -31800 -18191
4849 -18191 -5509 -11848 -12869 -10347 -18072 -12230 9888 19370 15774 5447 8985 -141 -9211 -16299
4835 -16299 -6005 6157 10957 -415 -1581 2382 141 -2919 -8907 -4896 -12806 -1509 -2703 -12690
4821 -12690 -1552 4261 -10644 -7729 -8671 -14826 -8560 -4056 3491 5023 10493 6226 -7498 -16768
4807 -16768 -14384 -12002 -11183 -13588 -14352 -6577 8 4295 1606 4580 -6895 -7039 -4863 4879 10850
4792 10850 480 -3929 -1962 -2226 2710 -11164 -27719 -16747 -13052 -13951 -10281 -13303 -16054 -24451
4778 -24451 -23617 -19540 -6901 266 -6432 -11138 -7925 4866 6067 4940 2777 -4660 3666 16929
4764 16929 14933 3091 -5449 -10242 -9821 -4174 -12869 -7512 9306 17772 13623 -3577 -6688 -3342
4750 -3342 -117 -1371 1080 -8340 -5393 -11012 -16258 -4278 -448 7076 11278 3310 -9512 -5506
4736 -5506 10842 20146 10932 736 4024 12315 8643 -4719 -10795 -18824 -19223 -23093 -6176 -2403
4722 -2403 3791 -5941 -6065 3493 6461 2162 5258 6548 -5412 -9584 -2135 -7268 -18007 -10145 -3474
4707 -3474 10237 11043 7910 -4081 -10509 -6525 -10206 -8205 -605 1500 -6842 -5912 -326 5183 13025
4692 13025 12527 24144 18065 6177 430 -15139 -20431 -17991 -12625 -14812 -12196 -11002 -2860 -6065
4678 -6065 4197 11706 4045 922 -10137 -6455 18503 22127 9030 -905 -3159 -6920 -18983 -19109
4664 -19109 -13788 -11765 -9781 -21605 -12229 -5672 -9327 -8705 2038 -6206 -17040 -4395 7247 5542
4650 5542 -294 6748 5519 -5289 -1649 -5318 33 -7416 -13648 -20499 -22799 -17240 39 2267
4636 2267 -3051 -7725 -12133 -20658 -31052 -19853 -16253 -10996 1562 1449 2879 -14580 -32633 -25473
4622 -25473 -9754 -10334 -3336 -11248 -20470 -15345 -4336 -9445 -11508 -10721 -12573 -11174 -2364 -4131 -2371
4607 -2371 -7814 1707 3985 12844 19361 4123 -19782 -15065 -12475 -23060 -11866 11872 7978 -955
4593 -955 -7197 -9141 -6474 -20186 -5077 15501 26500 10736 4106 -6073 -15507 -6139 7874
4580 7874 5029 8155 -6776 -6710 738 -8891 -11361 -8153 5354 14138 3651 9841 12582 9321 8637
4565 8637 -869 -3549 863 -8540 -19101 -22055 -31715 -29603 -24266 -15734 -5372 6603 -1775 2941
4551 2941 15878 13414 7523 12006 21259 23742 25385 22378 23572 19498 2058 -7700 -9774 -17410
4537 -17410 -15353 -2387 17627 15278 3119 5813 5843 7091 524 -14219 -8077 -6447 -16089 -4116
4523 -4116 4511 1665 -1010 -12017 -11749 -6722 9342 21535 32686 25694 25258 18956 15522 3600
4509 3600 -6158 -3329 -6075 -4690 277 -1936 -1805 -8180 -7535 20078 32030 19159 -3520 -14062
4495 -14062 -24961 -35125 -23986 -19090 -25906 -16245 -13206 -24370 -22209 -7013 -2883 -5872 -19219
4482 -19219 -17127 -4206 8724 8591 14916 19999 1614 -20725 -20208 -6794 -795 8847 5125 -6045
4468 -6045 -14657 -2837 -5052 -17133 -16311 -16876 -20244 -17745 -23184 -22496 -9639 -14619 -24727 -20903 -7987
4453 -7987 -11005 -12566 -6871 -10648 -5897 8623 11681 -331 -17270 -26795 -16293 -2657 1622 5244
4439 5244 -446 -4917 2710 1969 8823 5924 -6126 -10226 -14293 -18059 -18373 -19197 -15602 -6873 -7279 -270
4423 -270 -7974 -3850 -9783 -18033 -16142 -4825 -4444 -15579 -10438 593 -12746 -31972 -26976 -6341
4409 -6341 -6304 -4616 4755 -3438 -25875 -17594 -2267 -6112 -15198 -19369 -10914 -9167 -3520 491 7742
4394 7742 832 -6676 -10966 -8094 -5508 -22651 -27865 -26358 -14243 3962 12588 1819 -8298 -4357
4380 -4357 1373 -8105 -3032 -14517 -35037 -31971 -22868 -15572 3699 12799 5560 5339 3103 12379
4366 12379 20832 5980 -5365 -15584 -21629 36 21055 10552 1011 -1242 4501 -2724 -14584
4353 -14584 -27908 -20305 -1626 798 828 -11366 -15171 -76 21783 27581 18052 12487 5359 1250
4339 1250 -1315 3079 4189 2891 -16512 -18972 -5533 13795 2680 -1509 6388 -750 -13503 -10169
4325 -10169 -12348 -18745 -27190 -28718 -21590 -15348 -8953 -8543 -13402 -6496 780 13326 10632 18199 11003
4310 11003 1295 806 2133 7816 19480 22569 12464 110 -5774 4838 18673 12466 5941 -6165
4296 -6165 211 -1672 7836 10112 23537 23695 16024 19437 12364 14077 21324 19521 18290 7679 1078
4281 1078 4688 15906 5694 -848 1592 10269 7900 -7046 5621 21000 14927 7781 6146 21722
4267 21722 27233 29487 19262 6192 1369 11407 14100 11096 5728 3988 2080 -7580 -10550 -332
4253 -332 9097 -1383 953 -640 -2954 -3545 -6004 1486 7255 2675 -6115 -2270 -3686 -1397 -6583
4238 -6583 -23589 -31618 -34853 -26867 -7163 9727 7305 -2635 -8220 -8178 6090 -3708 -10742 -5008
4224 -5008 -6179 -19554 -9348 8063 -5729 -18537 -19798 -10203 -793 4013 2904 1801 -5226 61
4210 61 -7029 -2147 4375 16968 19560 21571 17481 12191 19142 15404 -940 -21059 -13565 -578
4196 -578 128 7280 2720 -14120 -30337 -22305 -18243 -25698 -21928 343 14999 19853 18922 15818 16860
4181 16860 8121 3128 4944 -8714 -11114 -12681 -17412 -969 8213 3265 7285 -2043 -14780 -19071
4167 -19071 -17440 -14598 -847 6291 9509 17565 22301 15966 14939 5 -13114 -13025 -1444 7763
4153 7763 -191 -6246 -8755 -3608 -13810 -11050 -5245 2003 1642 15499 14146 13918 17731 6267 -11245
4138 -11245 -18618 -13698 -5244 -6871 -7863 -8409 -1710 8791 20068 27560 14276 -9304 -6834 -1766
4124 -1766 -8173 -14862 -12880 -12382 -4488 1378 11292 18233 4329 -681 2093 -3180 -5494 -8057 -4972
4109 -4972 -8135 -14447 -15507 -12572 -10476 -20500 -15974 3172 7325 9097 18128 7612 14394 6810
4095 6810 -7315 -24220 -24905 -24649 -20143 -15840 -7862 15369 14841 3622 6420 11458 13226 5645 -1549
4080 -1549 5242 9008 -5799 1479 16464 8121 -1805 4622 10782 19406 22492 23000 21216 16775 796
4065 796 -11777 -10579 -14151 -12320 3276 -1378 -23566 -20876 -1332 9141 3775 9934 6469 111
4051 111 -6852 -20419 -10008 -10194 -3574 2829 -2914 -17112 -23086 -15888 -23774 -31787 -37057 -14880
4037 -14880 698 2651 5982 7123 10931 16169 4305 -7276 -7020 -17761 -21619 -16165 -7044 -5580
4023 -5580 -1991 -7435 -6796 7375 13871 7545 -2078 -3796 -14970 -1918 8830 1142 -15894 -12589
4009 -12589 -4313 -229 -3755 -16990 -17170 -18832 -12104 -9332 -8696 -12119 -17655 -10627 -3761 -3802 7710
3994 7710 13752 12103 7916 14458 7758 4579 6559 7067 20911 24165 11266 -8638 -23623 -16323
3980 -16323 -5672 5552 1124 1319 2290 -11279 -11735 -14702 -1206 8459 8046 -2575 -8301 -6448
3966 -6448 -18188 -12095 -725 -2171 -2566 13306 25712 24857 18724 4487 -13977 -9263 1608 13182
3952 13182 8149 -6039 3068 747 3066 -15737 -21991 -29316 -20188 -5544 -11591 -20197 -3564 12043
3938 12043 6771 4540 -964 -18040 -17454 -9661 -6454 -8388 -5176 -2811 925 8479 2371 -15172
3924 -15172 -17485 -12853 -7909 6082 15502 20398 27603 21498 14759 -4075 1083 7518 9276 2715
3910 2715 12104 19308 4135 627 1032 -1947 -7257 -4378 5985 4156 -2054 6181 21292 7356
3896 7356 -3913 -19660 -16092 6785 7941 4845 10173 23530 30477 12220 -5279 153 -4129
3883 -4129 -4282 4606 10299 6878 1569 -10660 -5902 95 -3690 -5558 6354 5943 -9602 -10424 -2514
3868 -2514 -1314 -95 9423 7699 1527 3915 8 12633 14664 -3850 -2388 9160 7587 -3521
3854 -3521 -6993 -3012 -11053 -26230 -15459 -10184 -12063 2156 1964 -5295 -7916 -15347 -15296 1947 17746
3839 17746 23647 16278 25226 19712 8964 -3143 -115 898 12475 14934 16168 10811 3636 -3539
3825 -3539 -13250 2795 20869 18016 7387 11069 19404 20094 22797 16746 8833 14765 3665 -5633
3811 -5633 1248 7106 9244 4688 -7928 -11605 -1103 2456 16147 4678 -4391 6236 20243
3798 20243 15305 4053 -5142 2279 9472 15818 7523 -884 2567 3634 -16122 -5970 -2627 2594
3784 2594 2070 -2340 -7205 -17855 -22188 -21004 -5148 -5301 -2202 1125 979 -8547 -11912 -19285 -16287
3769 -16287 -8385 -4289 -7757 -14028 -12526 -5947 -7455 -14035 -19171 -25260 -11756 -12838 -15388 -13892
3755 -13892 -14991 -13917 -16960 -13443 -13824 -16624 -16682 -3970 -15686 -17566 -401 142 -1758 2098 1104
3740 1104 8740 13714 6412 -5798 -10649 -8437 -4607 -5671 -12277 -29729 -26479 -6417 13226 3509
3726 3509 7238 8209 9878 22361 23513 13080 6575 10740 11599 10133 10746 3673 -10783 -10631 4478
3711 4478 8181 -4668 -12052 -7136 940 -6512 -4925 -1319 -8324 -5505 792 9317 10693 16457 15148
3696 15148 649 -10632 -3716 -14275 -17600 -15838 -16511 -9854 -11380 -13807 -13905 -4135 1745 -9114
3682 -9114 -6596 -7168 -3980 -8353 -12124 18703 25356 18512 3752 4261 -818 1138 5032 -1267 5423
3667 5423 9733 6063 13956 17160 -4691 -2996 16828 5112 -18887 -22804 -17130 -5189 -1582 222
3653 222 3849 9382 7887 3148 6142 7830 11223 3328 4490 6247 6657 4933 14202 6263 -1270
3638 -1270 -8710 1310 -305 7076 12449 -10085 -31507 -19044 -3546 3906 -2583 -13350 -15064
3625 -15064 -7440 269 -2178 10592 1947 -8624 -8138 9223 7097 1708 -10321 -5841 3772 -1723
3611 -1723 -19995 -24881 -17089 -3572 4990 18603 21756 12816 10321 17141 29227 28340 13627 8015
3597 8015 1977 3326 6173 916 191 -15607 -11752 -19224 -12171 -8482 -2582 -5830 826 14130 8420
3582 8420 -7292 -3467 -1091 -16616 -13191 13856 17985 -10072 -20717 -22650 -16513 -24591 -41108
3569 -41108 -27732 -16098 -15495 -3847 10552 13688 4475 -6920 1222 5175 379 -7555 -24885
3556 -24885 -25953 -11974 -3763 -5342 -21622 -25043 -24765 -13931 -23097 -18739 -9746 3812 -15016 -27657
3542 -27657 -18723 -9871 -13930 -17659 -11804 -6114 -6190 -7163 -11488 -9169 -6279 -6079 -2962 -10781 6461
3527 6461 12650 -2449 3252 16961 20413 13073 4785 22239 21547 7336 12750 17193 12289 18972
3513 18972 15409 9620 -3263 -6476 -2955 -9292 -12416 -8441 -9995 -1234 -1961 8393 2685 -3640
3499 -3640 -7840 -7886 -748 9623 24849 17504 12706 13752 12727 16080 22675 9254 -8685 -11970
3485 -11970 -6046 -3766 11737 27912 24876 -1816 -4546 5805 12843 22637 16765 -7579 -27070
3472 -27070 -26545 -15440 -8515 -5497 -3626 -2777 3977 11729 19018 20189 16808 -1722 5482 17378
3458 17378 12550 6043 3025 -1148 4585 3586 -4559 -3621 -11751 -5542 -2933 2313 -4845 -3644 6060
3443 6060 7015 4329 118 170 -2000 1170 1462 10825 16585 18833 11338 -3715 10218 13040 11402
3428 11402 1375 1789 -1651 12873 20519 20389 20633 13012 7378 847 -6326 -22200 -27269 -18746 -17121
3413 -17121 -21019 -15684 -18866 -152 9960 6480 -8163 -2771 -7936 -9391 -16320 -5387 4318 10232
3399 10232 21910 12610 3647 1039 8098 8798 1757 6126 -2772 -11746 -13756 -13357 -13706 -5252 -4131
3384 -4131 -12457 -18863 -19434 434 15001 793 -5725 -7852 -1611 5167 9309 7299 -1762 -8241
3370 -8241 -4762 -1603 11382 9220 -3229 -20201 -20959 -23080 -12275 -1208 -16495 -10810 -1772 -10542
3356 -10542 -8528 -12758 -17763 -1710 7591 3251 7386 3817 491 13459 36489 35821 19350 12505
3342 12505 -2861 -9970 -19386 -3505 -6961 -13901 -20808 -22049 -24286 -9797 -12805 -15080 -6401 -8802
3328 -8802 -9430 -3517 -3663 -2196 1285 6687 12929 31807 36322 20366 11558 -10150 -18769 -10881 -6764
3313 -6764 -7998 2322 -3005 -3894 4843 -5050 -14700 -20505 -23405 -3877 -10688 -17225 -23364 -635
3299 -635 21668 29922 20627 5584 -3940 6851 13009 13091 18127 9072 -11874 -1082 5667 -3574
3285 -3574 -8924 -17455 -18670 -8329 -7780 -2063 12792 10079 -4129 3040 12716 -8539 -13077 -1223
3271 -1223 -1158 -2333 -7496 -7611 -6304 862 4000 -5031 -5563 1621 -5477 -1349 6796 14580 9337 8013
3255 8013 12807 24989 26223 11412 692 -3143 4413 3932 -2123 6461 5037 -484 -1831 9603
3241 9603 28983 25842 10979 3892 14364 21945 8926 -3384 -9574 -11658 -11639 -17186 -15798 2728
3227 2728 -10350 -25237 -12449 -3188 -13775 -12232 -2316 -8302 -10761 -5555 3204 10865 7079 -3291
3213 -3291 5121 18792 10505 8485 5726 -499 2647 8598 3943 8106 22839 27161 21854 19234
3199 19234 19634 24329 16599 14569 11116 -17380 -8344 878 13030 19773 10149 8350 10659 18725
3185 18725 31210 26361 13103 15366 16062 22772 19649 7262 -3282 -10198 -1892 -3499 -1222 3676
3171 3676 4141 13494 16522 7215 1548 4397 5993 19828 16490 348 -19024 -18754 -10928 -12477 -11858
3156 -11858 -10276 -8465 -6082 -21596 -22065 -22091 -27264 -20902 -11942 -11393 -17522 -17816 -111 12717 -3072
3141 -3072 -4865 -2906 -5578 -1663 1997 -1011 2818 -4747 -11641 -15064 -13792 -15463 -19752 -18366 -8084
3126 -8084 6921 3470 -8800 -7420 -1273 6650 11488 3856 -7227 -13321 -11843 -14082 -3419 2755
3112 2755 -3414 -4952 -8195 -1308 7080 11878 12203 24299 27291 23007 14264 10382 2989 -210 -3370
3097 -3370 -2908 -3632 -18139 -20910 -464 15785 23116 20818 11343 8434 18392 16260 9292 11306 5112
3082 5112 2143 -11780 -4386 -11144 -7680 -5212 -3259 -5650 551 9417 17004 23699 23431 15386 11805
3067 11805 19719 20164 20826 29343 11885 -3039 11835 22995 21709 11532 -4795 -5498 4310 -6307
3053 -6307 -10403 -7822 1098 -4249 -5316 -2597 -4805 -1201 320 -189 -661 5387 21727 21824 16303 14429
3037 14429 18285 13795 -9332 6345 23296 28242 21570 -3568 -7612 -8259 -19099 -24580 -26187 -1078
3023 -1078 8714 6146 -16240 -11049 -3167 -1026 4195 6839 -1744 8316 19909 34346 48128 45982
3009 45982 32505 5765 -10632 -10050 -7260 -2222 3901 12637 17427 11142 15035 13165 9634 5594
2995 5594 12773 30885 30797 29225 21302 18712 10124 -1631 2020 3236 -2829 6428 10716 14240 13750
2980 13750 13557 7282 9254 17887 17900 8557 1870 -353 5233 3867 -1113 -6317 -89 19641 32254
2965 32254 20106 5912 -1361 2705 -174 -3817 -11153 -3815 10735 -202 -5670 3199 1709 7214
2951 7214 12862 12184 5561 -6266 2814 3567 4046 -3769 -5307 -14742 -20220 -11886 -12474 -18486 -24263 -11959
2935 -11959 1913 174 -2115 -12068 -11868 -2737 -2923 3814 1261 -15083 -17453 -10635 4123 -2946
2921 -2946 3705 2728 4451 9532 15067 -2619 -14072 -6559 934 11478 22069 25222 24500 17020
2907 17020 12729 -5700 -10787 -8548 3432 2640 5949 12856 22340 29055 14616 9232 14440 14538 13089
2892 13089 6005 -6202 -10079 -7145 -6623 -9758 -12884 -20987 -20547 -12707 -7539 1810 16585 33487
2878 33487 38698 26988 13948 7371 10824 4406 593 -14367 -8014 -13 5986 1819 3877 -5513
2864 -5513 5237 22695 32696 38778 25062 9332 -8266 -3794 -7057 -3112 -8857 -1170 4468
2851 4468 -62 2752 9964 1097 -13174 -19726 -23763 -14764 -7782 -7123 140 3649 24693 11297
2837 11297 -8561 4869 11047 24843 10780 -7203 1227 -6129 -2998 -3559 -5388 -9056 -1762 -555
2823 -555 14282 23251 9718 -6471 -1095 11829 24703 23273 15499 17128 26542 22846 19011 8173
2809 8173 -3377 11004 5607 -3679 -5470 10971 28368 19847 -11827 -18352 -8974 -9689 -15602 -13976
2795 -13976 -12606 -7496 9622 18513 16778 9421 1404 15976 22585 10567 3343 11910 20579 19174
2781 19174 22008 10997 9473 8103 -3668 -4573 4924 -4974 -18703 -13553 -16242 -14865 -11221 -8916
2767 -8916 -19131 -30940 -24449 -21753 -20813 -23490 -10483 4951 -314 -13941 -13554 -1383 -2213 4077
2753 4077 5461 4398 -2539 -9034 -14240 -9537 -902 8995 3467 -1874 -1248 14845 12201 10806 23723
2738 23723 38042 35179 32077 28098 22008 135 -11762 -4577 -7599 -5951 3276 7455 11758 9664
2724 9664 3173 2844 -10285 -16063 -10491 -4168 8967 13148 12558 8568 5313 -6162 -3557 -6626 -5367
2709 -5367 3307 20225 20837 9573 3902 -9565 -17055 -5836 7850 18695 36544 34936 29936
2696 29936 27451 37282 31859 23678 31428 28676 20199 26485 23581 10868 11454 10948 -391 5732 8735
2681 8735 172 4185 -2249 -2429 -5620 -3304 -20380 -20852 -3276 8680 -1410 -14689 -17531 -21851
2667 -21851 -11315 3065 16617 25548 15084 -3049 -3314 -5909 -4421 -5584 -1264 9697 22975
2654 22975 26674 23905 28280 17102 24029 39176 38782 19002 3070 -3916 1139 -5079 -10547 -6331
2640 -6331 -11077 -7377 -740 -2545 14425 23667 -2078 -9248 -9188 -1032 12940 23758 33405 13896
2626 13896 -4418 7367 7893 12648 15225 15008 19338 15281 13672 606 8802 18363 9901 15932
2612 15932 17444 19671 20230 26400 14405 -6455 311 3565 8916 10853 5537 -10121 -12167 -6590
2598 -6590 -473 -553 -1679 2600 5427 4345 4828 931 11518 28993 33255 22972 18812 6724 9406
2583 9406 7798 14372 8651 3432 2900 9602 5906 -2900 -1914 -3406 -12231 -5729 6840 976 4250
2568 4250 2802 8919 17345 26103 26607 28483 15584 5426 1365 2348 16128 11566 -13687 -23420
2554 -23420 -17186 -7696 -11344 -21559 -25860 -8240 3226 -2582 -5263 -3808 6454 9207 -7136
2541 -7136 8745 8421 -3940 1327 -2996 1016 9543 23291 11602 -13076 -26605 -19735 -8674
2528 -8674 -21167 -9489 -2081 13139 17447 8093 3436 -946 12992 12814 7494 12086 7181 -10562
2514 -10562 -18344 -389 8916 3665 -7356 2875 8132 4658 19425 13926 -3479 -16810 -17532
2501 -17532 -6441 -6093 -1633 -8591 -6231 -97 -12201 -12978 -9026 -4889 -11395 -20448 -28287 -25850 -3840
2486 -3840 19008 16052 -739 -11389 -17370 -17731 -9181 -939 12456 6518 7597 2218 -13436 -18173
2472 -18173 -10853 3493 9 -15060 -13910 15374 30573 15651 1485 13472 18189 11371 10447
2459 10447 1561 -5500 -378 -13885 -15333 -5206 -2767 -16277 -6299 9768 12994 -984 -7159
2446 -7159 -3390 -19545 -30500 -31207 -2742 16231 811 -2460 -3170 -1643 -5658 -8907 -11956 -10166
2432 -10166 -8938 -7427 -13995 -5790 484 -15221 -33296 -26546 -19415 -5970 -6048 -4478 6705 6009
2418 6009 -3201 -10093 -4496 -12596 -20507 -19296 3950 12785 9674 4834 -12688 -16801 -26108 -30972
2404 -30972 -23630 -24269 -15737 -19080 -23227 -26625 -19679 -6331 -5817 -3895 10855 19138 13419 -336
2390 -336 428 805 -4595 5254 21801 24395 20709 29955 35554 38506 36207 22078 7679 2293 2240
2375 2240 -5490 1014 25257 15474 -3140 -4996 -1296 -10711 -18682 -18543 -10521 -14413 -12814 -4916 -15434
2360 -15434 -27704 -25389 -26843 -30726 -26431 -3923 8502 -7135 -12194 -12218 -10172 -17551 -17488 -10113 8554
2345 8554 13685 4682 12354 -1570 -13860 -19595 -14109 -8306 -11133 -11987 -21406 -5371 4660 8349
2331 8349 -9823 -21439 -20952 -12778 -9946 -9174 -1716 1799 6690 -1465 -2841 4891 15813 15117 14687
2316 14687 12591 15373 15385 5320 -9389 4927 13997 16181 19471 34457 41304 48461 33341 13826
2302 13826 -156 -12565 -4 6958 -1314 -2630 1701 11094 26964 30697 27312 10741 3686
2289 3686 590 13439 20600 5313 4962 11010 3314 16295 30469 5345 -4578 -3048 -4421 -7122
2275 -7122 -15605 -24325 -21913 -1248 7339 -3286 -3656 -7071 -1519 2188 614 -11556 -13075 75
2261 75 -9238 -27382 -14207 -1410 10515 3606 -2427 9566 9299 1670 6822 3845 -249 -18209
2247 -18209 -8532 -6158 -18899 -33833 -28412 -21782 -29069 -27642 -19845 -16541 1396 10739 3017 -14377
2233 -14377 -16735 -15036 -18508 -2347 -879 -12956 -14555 -13146 -22237 -19649 -21378 -24070 -16895 -21516
2219 -21516 -30538 -21526 -12038 -19558 -19990 -8906 5774 12231 6134 5071 10980 18605 7197 -7317
2205 -7317 -899 5792 12636 16320 9794 -2633 -6004 6382 11357 8005 2445 -4615 -2990 4871
2191 4871 9954 19739 13091 2076 -5867 -5019 5393 17390 24262 16089 591 -9993 -14762 -11526
2177 -11526 -12768 -7048 -7507 -19199 -18256 -14648 7342 9170 -3371 -11398 -18872 -17868 -10409 -5104
2163 -5104 6289 4097 -8352 -12143 -25048 -29341 -25148 -16995 -13582 -2862 6083 1805 -8650 -13289
2149 -13289 -22030 -19014 -26092 -15032 -398 -1848 -7593 -4033 732 4335 1027 -6171 -7575 6332
2135 6332 12179 2920 8371 14384 18159 9448 12176 12829 18687 18834 -4692 -9536 -12107 -5314 1886
2120 1886 4620 2717 -8264 -13966 -16316 -322 7511 15861 17116 3473 -4664 -2939 7289 23622
2106 23622 12255 -3059 -8570 -5001 -1068 -8114 -4249 -5916 -9167 1001 15139 10631 14256 27780
2092 27780 21498 5983 -7110 -10543 8193 14827 14978 17496 29269 32151 28458 27806 26999 16517
2078 16517 13941 8458 14237 13063 3902 406 1187 1873 -232 -13187 -6928 6949 5318 -4092 5271
2063 5271 24012 24303 11096 8269 11230 2178 -18084 -10878 -3861 -3408 -5997 -10083 -6695 1054 13067
2048 13067 4048 -3385 -10578 -7425 3325 2487 -2334 -7458 -2964 -8598 -6668 1645 1372 3305 18467
2033 18467 22236 15845 4066 3285 7458 13128 -844 13707 22583 4366 20326 21659 15716 11076
2019 11076 -7 8130 11716 14887 14907 11476 5741 2940 -12558 -15872 -25717 -21879 -6942 -6365 4536
2004 4536 8286 11681 5100 7138 8482 -2130 -2975 -10600 -15914 -8847 -7244 -6790 -6864 -7596 -9862 -4653
1988 -4653 8079 7151 17740 26762 22972 15701 24208 31174 33992 21182 24211 24046 10788 10615 8265
1973 8265 16537 14265 -2924 -3848 -411 -8479 -528 651 14982 19999 1752 5328 13769 21662
1959 21662 11010 25003 23365 30003 35418 19765 13924 7265 316 -17405 -32871 -27264 -18802
1946 -18802 -4398 7037 -3277 -5797 1061 10016 3274 1412 9312 14208 18628 27241 28123 29874
1932 29874 21101 18803 13166 12656 13907 15372 7017 9492 2184 -16155 -2322 2902 -10901 -20452
1918 -20452 -17828 -316 10228 1342 -3578 -2690 -7845 -1792 11837 18181 24017 31880 26809 14721
1904 14721 12780 27448 25272 19946 6211 3993 8583 15718 2305 -2173 -5285 -3928 -2571 -4568
1890 -4568 -11456 -7749 120 6622 -1969 -6038 -8705 -6288 10800 18020 13244 14564 4775 -6528
1876 -6528 -18529 -11439 2094 -5352 -8438 -5020 7806 2224 3131 6660 12938 7779 8962 20789
1862 20789 38632 27793 18316 10289 -4209 -8029 -12573 -9571 -8867 -15988 -5669 2108 6009 1886
1848 1886 -3664 -2714 11833 22078 16434 6242 9852 2834 522 5515 17176 6640 6958 4418
1834 4418 -11600 -11507 -16192 -11579 -8092 -14094 -842 23053 29185 30178 14769 18997 26236 21540 7364
1819 7364 4980 -1869 1388 5089 56 1490 6178 14241 5589 -1347 2924 16187 19665 10325 18053
1804 18053 16646 9565 7210 9436 4462 2318 3452 3878 5243 8958 8583 18181 24921 24690 22172
1789 22172 11679 6936 9481 -582 15130 35569 34648 21916 7110 4671 2221 -11121 -12569
1776 -12569 5154 6988 1368 -11869 -23701 -31299 -31489 -33058 -23031 -17333 -25325 -13823 -1555
1763 -1555 -2500 -1212 -13435 -17028 -21539 -14966 -14624 -74 8822 9302 -864 13036 13738 16935 12769
1748 12769 8903 -1373 1431 7769 16737 18283 7442 4303 -921 2113 -3957 -1803 -5302 -25314
1734 -25314 -7637 6019 -450 -9171 -6392 -3086 -4174 -244 -3052 -4876 5402 8831 9588 8966
1720 8966 -2111 -7391 -7802 948 6281 -6794 -3871 18968 2448 151 -8532 -10583 -7909 -1993
1706 -1993 6924 3682 -511 -1673 7714 12953 -4752 -7087 10380 39033 32317 16149 13619 17799
1692 17799 -159 -8727 -4819 16186 21630 14462 18678 15964 13470 10189 11898 17168 21126 21395
1678 21395 14958 15957 15341 4344 -2762 359 11714 11151 16043 11922 2054 -4513 -8287 -7847 2399
1663 2399 -6499 -6885 1000 -6992 -13587 -11297 -5121 16110 25306 22336 6902 1743 8793 19790
1649 19790 12919 12684 3509 10901 6766 -10345 -14036 -5012 6694 6977 -83 545 2552 -3241 -2653
1634 -2653 -3746 3847 7712 14813 5107 -19021 -25398 -12332 5189 3541 -480 -18404 -27226 -12694
1620 -12694 3801 10244 -3227 -4338 -13999 -12394 -8671 -13774 -21681 -25729 -20710 -5768 4879 -7909
1606 -7909 -10369 -6082 2629 11234 1842 7713 14 -5616 -1195 11243 19104 14396 16235 -682
1592 -682 -11350 -3329 9617 7402 4645 4898 -7992 -15354 -12955 -15143 -6800 -12065 -8476 5787
1578 5787 12810 22458 26879 33357 29443 15424 24925 16108 6701 11422 12764 -915 -6771 328
1564 328 -7716 -6397 -5383 6741 14369 21335 27778 21270 26302 39596 41988 34421 28151 26021 21197
1549 21197 10169 3447 9617 11149 5478 6127 11853 -4481 -8894 3149 4542 2431 1820 2623 8321
1534 8321 10344 21830 13260 -6811 -7436 -11110 -12677 5209 24369 27787 24880 12403 10892 15045
1520 15045 10346 6386 5053 15404 24851 22079 14732 2988 4930 -3685 -12845 -3647 6602 25310
1506 25310 37851 33209 27702 17892 11411 -4541 -6098 11308 20267 13204 -1163 4635 9190 -6753
1492 -6753 -21011 -11010 1825 5601 9130 15632 21105 28872 16857 9907 7951 -7498 -13982 -4763
1478 -4763 96 13155 8907 5781 6019 16246 -2303 -16188 -13778 -16592 -6142 -2477 15466 22430
1464 22430 15808 20976 15984 6354 -6384 -7069 -5589 1353 7955 28695 19510 11379 3476 -8292
1450 -8292 -8588 -6704 4518 -873 877 2516 -4454 -6413 -19643 -19171 -8614 -11941 -12338 -12887 1881
1435 1881 13350 8161 4829 -2610 -2908 2202 -1234 -13944 -17880 -14328 -16192 -17259 -6068 12710
$$ [...]
##END NTUPLES=NMR SPECTRUM
##END=
