##TITLE=Analysis number 318508
Compound Code cc 48614
Book Reference 483/6/2
Project Code adrs
Chemist Name mattw
##JCAMPDX= 6.0         $$ Bruker NMR JCAMP-DX V2.0
##DATA TYPE= NMR SPECTRUM
##DATA CLASS= NTUPLES
##ORIGIN= Bruker BioSpin GmbH
##OWNER= nmr
$$ XWIN-NMR		Version 3.5
$$ Thu Mar 30 12:12:20 2006 GMT Daylight Time (UT+1h)  MAYBRIDGE\nmr@NMR_250MHZ
##.OBSERVE FREQUENCY= 250.131544655141
##.OBSERVE NUCLEUS= ^1H
##.ACQUISITION MODE= SIMULTANEOUS (DQD)
##.ACQUISITION SCHEME= undefined
##.AVERAGES= 16
##.DIGITISER RES= 18
##SPECTROMETER/DATA SYSTEM= dpx250
##.PULSE SEQUENCE= zg30
##.SOLVENT NAME= CDCl3
##.SHIFT REFERENCE= (INTERNAL, CDCl3, 0, 16.522)
##AUDIT TRAIL= $$ (NUMBER, WHEN, WHO, WHERE, WHAT)
$$ ##TITLE= Audit trail, XWIN-NMR		Version 3.5
$$ ##JCAMPDX= 5.01
$$ ##ORIGIN= Bruker BioSpin GmbH
$$ ##OWNER= nmr
$$ C:\u/data/dgb/nmr/ADRS/1960/pdata/1/auditp.txt
$$ ##AUDIT TRAIL=  $$ (NUMBER, WHEN, WHO, WHERE, WHAT)
(   1,<2006-03-30 12:11:57.74 +100>,<MAYBRIDGE\nmr>,<NMR_250MHZ>,
      <created by zg, POWCHK disabled, PULCHK disabled
       configuration hash MD5:
       84 BC 41 DB A1 6E 1D 46 DA 25 12 A5 C1 ED C5 3A
       data hash MD5: 64K
       A3 97 35 F2 58 93 89 E7 FE CD 98 7D B8 A4 34 C5>)
(   2,<2006-03-30 12:12:10.91 +100>,<MAYBRIDGE\nmr>,<NMR_250MHZ>,
      <Start of raw data processing
       ef LB = 0.3 FT_mod = 6 PKNL = 1 SI = 32K 
       data hash MD5: 32K
       8E D1 8E 56 89 6A 57 6A 9F F0 BF 5A 3E 00 FD 2E>)
(   3,<2006-03-30 12:12:12.64 +100>,<MAYBRIDGE\nmr>,<NMR_250MHZ>,
      <apk 
       data hash MD5: 32K
       72 43 F1 BB 47 83 29 C6 48 4C 03 C6 CE 05 0B A6>)
(   4,<2006-03-30 12:12:13.41 +100>,<MAYBRIDGE\nmr>,<NMR_250MHZ>,
      <abs ABSG = 5 
       data hash MD5: 32K
       D4 91 7C FE F1 6E D5 8C 30 DB D9 FB 22 58 C1 B6>)
$$ ##END=
$$ 
$$ hash MD5
$$ 47 88 63 56 14 6A C5 C0 B2 3D 2A E9 CA F8 D9 ED
##$RELAX= 
##$RELAX= 
##$RELAX= 
##$RELAX= 
##$RELAX= 
##$RELAX= 
##$RELAX= 
$$ Bruker specific parameters
$$ --------------------------
##$DU= <C:\u>
##$EXPNO= 1960
##$NAME= <ADRS>
##$PROCNO= 1
##$TYPE= <nmr>
##$USER= <dgb>
##$AMP= (0..31)
100 100 100 100 100 100 100 100 100 100 100 100 100 100 100 100 100 100 
100 100 100 100 100 100 100 100 100 100 100 100 100 100 
##$AQSEQ= 0
##$AQ_mod= 3
##$AUNM= <au_zg>
##$AUTOPOS= <27 >
##$BF1= 250.13
##$BF2= 250.13
##$BF3= 250.13
##$BF4= 250.13
##$BF5= 500.13
##$BF6= 500.13
##$BF7= 500.13
##$BF8= 500.13
##$BYTORDA= 1
##$CFDGTYP= 0
##$CFRGTYP= 5
##$CHEMSTR= <none>
##$CNST= (0..31)
1 1 145 1 1 1 1 1 1 1 1 1 1 1 1 1 1 1 1 1 1 1 1 1 1 1 1 1 1 1 1 1 
##$CPDPRG= <>
##$CPDPRG1= <>
##$CPDPRG2= <>
##$CPDPRG3= <>
##$CPDPRG4= <mlev>
##$CPDPRG5= <mlev>
##$CPDPRG6= <mlev>
##$CPDPRG7= <mlev>
##$CPDPRG8= <mlev>
##$CPDPRGB= <>
##$CPDPRGT= <>
##$D= (0..31)
0 1 0 0 0 0 0 0 0 0.06 0 0 0 0 0 0 0.0002 0 0 0 0 0 0 0 0 0 0 0 0 0 0 
0 
##$DATE= 1143717116
##$DBL= (0..7)
120 120 120 120 120 120 120 120 
##$DBP= (0..7)
150 150 150 150 150 150 150 150 
##$DBP07= 0
##$DBPNAM0= <>
##$DBPNAM1= <>
$$ [...]
##$SUBNAM7= <"">
##$SUBNAM8= <"">
##$SUBNAM9= <"">
##$SW= 20.6930455092707
##$SWIBOX= (0..15)
0 0 3 0 0 0 0 0 0 0 0 0 0 0 0 0 
##$SW_h= 5175.983436853
##$TD= 65536
##$TD0= 1
##$TE= 294.16
##$TE2= 300
##$TE3= 300
##$TEG= 300
##$TL= (0..7)
0 120 120 120 120 120 120 120 
##$TP= (0..7)
150 150 150 150 150 150 150 150 
##$TP07= 0
##$TPNAME0= <>
##$TPNAME1= <>
##$TPNAME2= <>
##$TPNAME3= <>
##$TPNAME4= <>
##$TPNAME5= <>
##$TPNAME6= <>
##$TPNAME7= <>
##$TPOAL= (0..7)
0.5 0.5 0.5 0.5 0.5 0.5 0.5 0.5 
##$TPOFFS= (0..7)
0 0 0 0 0 0 0 0 
##$TUNHIN= 0
##$TUNHOUT= 0
##$TUNXOUT= 0
##$USERA1= <user>
##$USERA2= <user>
##$USERA3= <user>
##$USERA4= <user>
##$USERA5= <user>
##$V9= 5
##$VALIST= <valist>
##$VCLIST= <CCCCCCCCCCCCCCC>
##$VD= 0
##$VDLIST= <DDDDDDDDDDDDDDD>
##$VPLIST= <PPPPPPPPPPPPPPP>
##$VTLIST= <TTTTTTTTTTTTTTT>
##$WBST= 1024
##$WBSW= 4
##$XGAIN= (0..3)
0 0 0 0 
##$XL= 0
##$YL= 0
##$YMAX_a= 499621
##$YMIN_a= -692009
##$ZGOPTNS= <>
##$ZL1= 120
##$ZL2= 120
##$ZL3= 120
##$ZL4= 120
##$ABSF1= 16.522
##$ABSF2= -4.171173
##$ABSG= 5
##$ABSL= 3
##$ALPHA= 0
##$AQORDER= 0
##$ASSFAC= 0
##$ASSFACI= 0
##$ASSFACX= 0
##$ASSWID= 0
##$AUNMP= <proc_1d>
##$AZFE= 0.1
##$AZFW= 0.1
##$BCFW= 0
##$BC_mod= 0
##$BYTORDP= 0
##$COROFFS= 0
##$CY= 12.5
##$DATMOD= 1
##$DC= 0
##$DFILT= <>
##$DTYPP= 0
##$F1P= 14.0000005364418
##$F2P= -0.99999901652339
##$FCOR= 0.5
##$FTSIZE= 32768
##$FT_mod= 6
##$GAMMA= 0
##$GB= 0
##$INTBC= 1
##$INTSCL= 1
##$ISEN= 128
##$LB= 0.3
##$LEV0= 0
##$LPBIN= 0
##$MAXI= 10000
##$MC2= 0
##$MEAN= 0
##$ME_mod= 0
##$MI= 0
##$NCOEF= 0
##$NC_proc= -4
##$NLEV= 6
##$NOISF1= 0
##$NOISF2= 0
##$NSP= 0
##$NTH_PI= 0
##$NZP= 0
##$OFFSET= 16.522
##$PC= 1
##$PHC0= 167.9882
##$PHC1= 7.38372
##$PH_mod= 1
##$PKNL= yes
##$PPARMOD= 0
##$PSCAL= 4
##$PSIGN= 0
##$REVERSE= no
##$SF= 250.13
##$SI= 32768
##$SIGF1= 0
##$SIGF2= 0
##$SINO= 400
##$SIOLD= 32768
##$SREGLST= <1H.CDCl3>
##$SSB= 0
##$STSI= 32768
##$STSR= 0
##$SW_p= 5175.98343685301
##$SYMM= 0
##$S_DEV= 0
##$TDeff= 65536
##$TDoff= 0
##$TI= <Analysis number 999999
Compound Code 99
Book Reference 9
Project Code 9>
##$TILT= no
##$TM1= 0
##$TM2= 0
##$TOPLEV= 0
##$USERP1= <user>
##$USERP2= <user>
##$USERP3= <user>
##$USERP4= <user>
##$USERP5= <user>
##$WDW= 1
##$XDIM= 32768
##$YMAX_p= 410486693
##$YMIN_p= -234535
$$ End of Bruker specific parameters
$$ ---------------------------------
##NTUPLES= NMR SPECTRUM
##VAR_NAME=  FREQUENCY,     SPECTRUM/REAL,   SPECTRUM/IMAG
##SYMBOL=    X,             R,               I
##VAR_TYPE=  INDEPENDENT,   DEPENDENT,       DEPENDENT
##VAR_FORM=  AFFN,          ASDF,            ASDF
##VAR_DIM=   32768,         32768,           32768
##UNITS=     HZ,            ARBITRARY UNITS, ARBITRARY UNITS
##FACTOR=    0.157963299565203, 1,           1
##FIRST=     4132.6476996994, 0,             0
##LAST=      -1043.33573715361, 0,           0
##MIN=       -1043.33573715361, -234535,     0
##MAX=       4132.6476996994, 410486693,     0
$$ Real data points
##PAGE= N=1
##DATA TABLE= (X++(R..R)), XYDATA
$$ [...]
17642A6367261l431961k369619j626123j151642q52163p29829o29920n36841m51068
17633D588095l63377m08171l29359l12440k82016k20097j78610j53063j76158
17624B164804k56003k01217j40092j62869p4536j06584j26577j39600q1890l7334
17614H38102o8299k2148k2140q7383m4233J5892m0793j0285J4404Q833N703r935
17602E77718L6804N9746M0480m7406m5616q851k5874K811r268m3734k0041r77
17590E15792l1380o6625n3429j3620n8544p2395o0415K5636P5350Q809J5198J6212
17578C00589l4170j00753p585j9697L3522L0615L136K077K1295o540j598O808
17566B27699l6490J2540j0479K3062K0027j7010k2613K687k9060l7102m070p511
$$ plain form
17642 16367261 12935300 10565681 8939558 7787916 6935753 6205924 5576004 5039163 4588095
17633 4588095 4224718 3816547 3487188 3174748 2892732 2672635 2494025 2340962 2164804
17624 2164804 1908801 1707584 1567492 1404623 1330087 1223503 1096926 957326 875436 838102
17614 838102 769803 747655 725515 638132 593899 609791 568998 558713 573117 581950 587653 577718
17602 577718 614522 674268 714748 667342 621726 612875 587001 589812 580544 536810 516769 515792
17590 515792 484412 417787 364358 350738 292194 219799 159384 185020 260370 269179 284377 300589
17578 300589 266419 165666 158081 138384 171906 202521 205657 207734 229029 222489 220891 227699
17566 227699 191209 203749 193270 216332 236359 219349 196736 199423 170363 133261 129191 121680
17554A21680j1388n137l6859l2202L3706N930P5J0825K5921L551o3582j6775M4216
17541G9961J383P032n0211n6060k9698j6269N5178N7274N795N515K8847m3482
17529D5265J5171K523k6930k164N550k1931k0053L2989m2005j7386L0944q427
17517f454q731K9832M5384L5677J1040j6040l4202N261m8334k7361j9251k957
17505c6136J2476k3330P97M3584J0199K6406l914k754o7006l6197O6216L6042
17493B6383j2973K0786r344n541O0505K5549m3897K8823Q680q3698j8785K5852
17481B2340k9636K3007l14l6788M4917J2824j2380m2087M1568K8096L186j5429
17469C9304M2997K8067l7376K1816n194n7806j8502k8993M840L2696k2143k4653
$$ plain form
17554 121680 110292 105155 68296 36094 69800 75730 75805 86630 112551 116102 52520 35745 79961
17541 79961 81344 88376 38165 -17895 -47593 -63862 -8684 48590 54385 59900 88747 45265
17529 45265 60436 62959 36029 33865 39415 17484 -2569 30420 -11585 -28971 1973 -6454
17517 -6454 -15185 14647 60031 95708 106748 90708 56506 61767 13433 -13928 -33179 -36136
17505 -36136 -23660 -46990 -46193 -2609 7590 33996 30082 27328 -39678 -75875 -9659 26383
17493 26383 13410 34196 24852 19311 79816 105365 61468 90291 98971 15273 -3512 22340
17481 22340 -7296 15711 15397 -21391 23526 36350 23970 -18117 23451 51547 54733 39304
17469 39304 82301 110368 72992 94808 89614 31808 13306 -15687 -10847 21849 -294 -24947
17457b4947j7875K2559N4770j1644J8493K2386M3457n273l7679o71K3399J5552
17445A02527l11J5514O9867q609J2756J30633J61781J07688m3747j79997j28741
17434B39361o6145o87o455k055P805N585J7818m4773q0866N8990P7203O5M375
17421B10221J847l8742j9322K4237J5428k4181k9440K8856L8957N4783K3066M517
17409B90227j4866k5589N0312j6181K3013k4009N4674k5948l5073l9365k6859
17398B10336K418l4311j4613J3645k5784k9489k5440j1150k5978K3865K0937K7009
17386A31445M522l6056j8159N547J5568K1705k1148j1646O9258J7564J048m1505
17374A38143l5066J4346O3110J6745q932j7999r351M4043O2514r764k0117J1720
$$ plain form
17457 -24947 -42822 -20263 34507 22863 41356 63742 107199 101926 64247 63576 86975 102527
17445 102527 102216 117730 187597 178988 191744 322377 484158 591846 548099 368102 239361
17434 239361 173216 172529 166074 164019 171824 177409 195227 150454 69588 128578 205781 205846 210221
17421 210221 212068 173326 154004 178241 193669 169488 140048 168904 207861 262644 285710 290227
17409 290227 275361 249772 300084 283903 306916 282907 337581 311633 276560 237195 210336
17398 210336 212754 178443 163830 177475 151691 122202 96762 85612 59634 83499 104436 131445
17386 131445 135967 99911 81752 87299 102867 124572 103424 91778 161036 178600 179648 138143
17374 138143 103077 117423 180533 197278 188346 170347 160996 205039 267553 257789 237672 249392
17362B49392N6735P8496M4195J10294O6660j3086l5429k6126k5008M198M9260
17351E59581M6455l609L2351J4519m6813m2903o9487k1879j4014n1914p0865m9857
17339B81565j2639k5468l8489J5744L6494j7580k2884k7824J2421N4667k1581
17328B34426m8981M8413N9487K064N816n59Q1l7762M6982M5463J9388n2358k9185
17315B93275N2578P8095M3172J5976P3880N1349O095m5520q4374k8566m435n909
17303D45616R403O222O9129Q7892J239n0994p9985n6241j7894j4168L5803J8835
17291D54857l0094p1920j3065K2266L5293K7829l4450k1537M149l0747k89K6687
17279C68979L8562o501m1418k2983l644l995j7032Q713O851K2971M0975k389J1850
$$ plain form
17362 249392 306127 384623 428818 539112 605772 592686 557257 531131 506123 510321 559581
17351 559581 606036 602427 634778 649297 602484 559581 490094 468215 454201 402287 331422 281565
17339 281565 268926 243458 204969 220713 257207 239627 216743 188919 201340 256007 234426
17328 234426 185445 233858 293345 295409 301225 300666 300747 262985 309967 355430 374818 322460 293275
17315 293275 345853 423948 467120 483096 556976 608325 614420 568900 484526 455960 451525 445616
17303 445616 455019 461241 530370 618262 619501 568507 488522 432281 414387 400219 436022 454857
17291 454857 424763 352843 339778 362044 397337 425166 390716 369179 373328 342581 342292 368979
17279 368979 407541 401040 359622 336639 332995 329000 311968 320681 327532 350503 391478 389089 400939
17266D00939K2888N0995L0304P16M759q157L110m4603p8865L1039O4312r60M5821
17253E22298N5378K8456N4585N1413J05743J40309J18063P9970N1319J7602L2057
17242A257193R0728R5010J74146J91605J82244J30922L6131P5573J94218K74735
17232B702505M05321N46459P27507J030469J535197K428104L650309N630063Q044828
17223B6700762R402299P351187J481940m281180n387996j868637L366773Q035199
17215D4800347R371443M630426m530109j1746716j2593172r230304n722755l463841
17207A1515319k173987j418719r62341p18533n56830l06478j57905j63517j18973
17198D938036l7854n5581m4658Q3600K36684L90057N06823L98067K62447J14631
$$ plain form
17266 400939 423827 474822 505126 505842 510601 502444 505554 460951 382086 413125 477437 476477 522298
17253 522298 577676 606132 660717 712130 817873 958182 1076245 1156215 1207534 1225136 1257193
17242 1257193 1347921 1442931 1617077 1808682 1990926 2121848 2157979 2233552 2427770 2702505
17232 2702505 3107826 3654285 4381792 5412261 6947458 9375562 13025871 18655934 26700762
17223 26700762 36103061 43454248 44936188 40655008 35267012 33398375 36765148 44800347
17215 44800347 54171790 58802216 54272107 42525391 29932219 20701915 14979160 11515319
17207 11515319 9341332 7922613 6960272 6241739 5684909 5378431 5220526 5057009 4938036
17198 4938036 4900182 4844601 4799943 4883543 5120227 5510284 6017107 6415174 6677621 6792252
17188F792252J89406L79548M95704N72245P65419J182397J854245K760581M259376
17179A9251173O512723R555133J2481535J2717262P926412M50029l878252r72229
17171F4043786P339130J6573816K1579143J7401245M701256p733693j0934013
17164A12970670o018589k00106K163193J426230q11449m066017p343636q435422
17156H9684874p903403p406765p341740p414805p559603p845918p977285p218694
17148B9016661n953409m390636k956592j900694j313629j073654q08133o97709
17140I922205n68337m02150k10058j7252K13138N35782J007875J741186K747702
17131A4970091M229974N513403N274289K653545r94238k547174q09880K903245
$$ plain form
17188 6792252 6981658 7361206 7856910 8429155 9194574 10376971 12231216 14991797 19251173
17179 19251173 25763896 35319029 47800564 60517826 68444238 68894267 65016015 64043786
17171 64043786 71382916 87956732 109535875 126937120 131638376 123904683 112970670
17164 112970670 106952081 106751975 108915168 110341398 109529949 105463932 98120296 89684874
17156 89684874 81781471 74374706 67032966 59618161 52058558 44212640 36235355 29016661
17148 29016661 23063252 18672616 15716024 13815330 12501701 11428047 10619914 9922205
17140 9922205 9353868 8951718 8741660 8724408 8937546 9473328 10481203 12222389 14970091
17131 14970091 19200065 24713468 29987757 32641302 31647064 29099890 28290010 31193255
17123C1193255P026413R521430P753205J519360m845242n868448j634098L980822
17115D8646697Q399165J0296840R392035N829315J419949k454235n325948n403062
17107G0800756l558254k264388k361676m004401o021360p823708q837415q206530
17099B7723024o707726m953468l354274k271922j650734j191361r46090p68525
17091E878924n71328m74250m51165l74755l19360k69643k80592k32046k66298
17082B639487j62854j63794j48427j74840j69255j93074j86763j23374j00011
17073A217095p0166n9666r0370q7868q2335j01788o3368j6117q607N026L676r753
17061F35759p8515q6383l4801l0815j5920j102j3568P557J1152m7102l9283n955
$$ plain form
17123 31193255 38219668 47741098 55494303 57013663 52168421 46299973 44665875 48646697
17115 48646697 57045862 67342702 76734737 82564052 83984001 81529766 76203818 70800756
17107 70800756 67242502 64978114 62616438 58612037 52590677 44766969 35929554 27723024
17099 27723024 21015298 16061830 12707556 10435634 8784900 7593539 6647449 5878924
17091 5878924 5307596 4833346 4382181 4007426 3688066 3418423 3137831 2905785 2639487
17082 2639487 2476633 2312839 2164412 1989572 1820317 1627243 1440480 1317106 1217095
17073 1217095 1146929 1087263 996893 909025 826690 724902 661534 645417 636810 641836 645512 635759
17061 635759 557244 470861 436060 405245 389325 388223 374655 382212 393364 346262 306979 301024
17049C01024j08n67k1148M080q101M3708K3951o1240j0801L8850l36r9261L2172
17036B42223R434j4438m0178l9656q060J7361M734O903j7917j2902j5449l3686
17024I8369o298K9970N3514o979l2109J9486P724L2692j7974j7074n5071m3972
17012F2278l2609n1995K3926J7099k2112m1067J7139N6386p184p706J4911j8323
17000A0743K6319k2096k6825K9424N771J0616l2889Q627L5485L7177k5066o6282
16988h996l8795J7735k3547o0391j2570J7900L3299N0877p6374r7935k2063j3675
16976b34535Q8279J05739q578k7722k5524K3665K9973L3543k8481n2124O586p758
16964i6937M0207M1326N9792j4986j5595j2054J4096r357n196k3707M7311K8521
$$ plain form
17049 301024 300916 300349 279201 283281 275180 318888 342839 281599 270798 309648 309312 210051 242223
17036 242223 251657 237219 197041 157385 149325 166686 171420 178323 160406 147504 132055 98369
17024 98369 92071 122041 175555 168576 136467 155953 163677 196369 178395 161321 106250 62278
17012 62278 29669 -22326 1600 18699 -3413 -44480 -27341 29045 21861 14155 29066 10743
17000 10743 37062 14966 -11859 17565 23336 33952 1063 9690 45175 82352 57286 -8996
16988 -8996 -47791 -30056 -53603 -113994 -126564 -108664 -75365 -24488 -100862 -198797 -220860 -234535
16976 -234535 -146256 -40517 -49095 -76817 -102341 -78676 -48703 -15160 -43641 -95765 -89179 -96937
16964 -96937 -56730 -15404 44388 29402 13807 1753 15849 6492 1296 -22411 24900 53421
16952E3421J4592m5506m2772j3794m2532K4886O5395n076K3010o353j0967m1756
16940b7452m7246j8128J8983J4139N0312M7652J1078k0332k7749r779J673J9133
16928A2284M9972l523j8695K5409n9622p3692j4577j3523k1498j1695K1033J9771
16916h8356M2488R362k6661L8147Q5240J3243l2280m5051p273K8424n93k2146
16904e456M5837K3040k7161l2688L5372M8775K3012j6434l7631o0487k4545N3077
16892B4711K784P467L2391M602j8297K2409K1855L4k7533K6182j3768m4478j1494
16879B6865l1673q497L118j1999L369j523k0673M299K2288L096L6192n230N345
16866B4977q524L8948J1056l798l8251l5175r856J2317q208j2821k738K3089K3275
$$ plain form
16952 53421 68013 22507 -20265 -34059 -76591 -51705 13690 8614 31624 25271 14304 -27452
16940 -27452 -74698 -92826 -73843 -59704 -9392 38260 49338 29006 1257 -8522 -6849 12284
16928 12284 62256 58733 40038 65447 5825 -67867 -82444 -95967 -117465 -129160 -108127 -88356
16916 -88356 -45868 -36506 -63167 -25020 60220 73463 41183 -3868 -11141 17283 16690 -5456
16904 -5456 40381 63421 36260 3572 38944 87719 110731 94297 56666 -3821 -28366 24711
16892 24711 27495 34962 67353 71955 53658 76067 97922 97956 70423 96605 82837 38359 26865
16879 26865 -4808 -13305 -10187 -22186 -18817 -20340 -41013 -36714 -14426 -11330 24862 19632 24977
16866 24977 16453 55401 66457 62659 24408 -10767 -20623 -8306 -16514 -29335 -32073 -8984 14291
16853A4291K9702j2045M1857L4307j9066L9315l8699m0662m505K0035J7161n171
16841G6520l4652l6728l5915l313m7755j6137L5986J9335J2008o02K4037j624
16829h840N566K2437p845j6520p471j1321j5800l5071j9864M3803M4979j3511
16817a9458M1924J3487n449P234l2652L5678K2303j7356J5414l8665n1010j9044
16805d7594J8211N6577j0911m3041r581j975N3145J5942n2197j4097L339M952
16793b7230M817m5324j0889R167r910J3432N3088l5386J2821J7482J8650L560
16781D278J7925N71o3170J5440N0749J2997m185m2008l5250M2289K3394o2980
16769c9950m4846J5022N518j0239l42j926N9781J6090L3611J1794o638k3417n619
$$ plain form
16853 14291 43993 31948 73805 108112 89046 128361 89662 49000 44495 64530 81691 76520
16841 76520 41868 5140 -30775 -34088 -81843 -97980 -61994 -42659 -30651 -31253 -7216 -8840
16829 -8840 -3274 19163 11318 -5202 -12673 -23994 -39794 -74865 -94729 -50926 -5947 -19458
16817 -19458 22466 35953 30504 37738 5086 40764 63067 45711 61125 22460 -28550 -47594
16805 -47594 -29383 27194 16283 -26758 -36339 -38314 14831 30773 -21424 -35521 -32182 -27230
16793 -27230 -22413 -67737 -78626 -69459 -79369 -65937 -12849 -48235 -35414 -17932 718 4278
16781 4278 22203 22774 -40396 -24956 25793 38790 34605 -7403 -42653 -364 23030 -39950
16769 -39950 -84796 -69774 -64256 -74495 -74837 -76763 -16982 -892 32719 44513 37875 14458 8839
16756H839l032k1676r792j797K9074m1394m5790K5702K4551K5020P150n923J2093
16743C025k75j0544j019L9062O57o820n569K02k5720k9705p783k8572j0890R203
16729g4748M0603J4193J9258K1167j4812k0783P88L4858N5366l3434l4243Q291
16717A6504J6940Q749k9227K6318O3633M6692K5455K1285o3502l19K908K8165
16705A63601P82K1929L2478k6266r616l3209n5015o790j1157K7566k7884p675
16693F8744R614n213k4294m8466j0708N8516r084n3377k4158j0182L6115J3952
16681A459P089L5003N8539R320L0273j803J4791K1972L5745P9738M0014Q7398
16669D19538O6057L2493N1132O4810R6749P5105p89K5187n1189q0680o2584j15798
$$ plain form
16756 8839 5807 -15869 -25661 -27458 1616 -39778 -85568 -59866 -35315 -10295 -3145 -9068 3025
16743 3025 2750 -7794 -8813 30249 30906 24086 18517 18719 -7001 -36706 -44489 -73061 -83951 -74748
16729 -74748 -34145 -19952 -694 20473 5661 -15122 -14334 20524 75890 42456 8213 16504
16717 16504 33444 42193 12966 39284 102917 149609 175064 196349 132847 132528 135436 163601
16705 163601 164383 186312 218790 192524 182908 149699 94684 87894 76737 104303 76419 68744
16693 68744 78358 73145 48851 385 -10323 48193 39109 -14268 -38426 -48608 -12493 1459
16681 1459 8548 43551 102090 111410 141683 139880 154671 176643 212388 292126 332140 419538
16669 419538 485595 518088 569220 634030 730779 805884 805095 830282 779093 698413 635829 520031
16657E20031P893L5184J780o0410j72592p3256j9575m5462q2387m6547L3858K87
16645I8804k1350m2357k7957K2365J8187j3227j6038L5103K314J2958K9614j8044
16633H0372k1637n415N967M3674K0923m3291j2009J0609M77J8945O7029R3641
16621B59285J05947N2215Q7127O2285l1527j759k6116J198J5571j3567j3131Q455
16609E05983q632l5279q2309j34901n2542l9172p5975k378m0348l9010J6725j6687
16597d525n7555J7891j1943j2374M341j5186j117J2528L1321M9762j8631k0382
16585b5870q264j4150N1402j8026l9384l2679l6378L5417L8543l923J5767N0055
16573A2510k6005l4857l487q663k3932M7685K2578j9785n4009O801M466j039j0086
$$ plain form
16657 520031 527924 563108 564888 504478 331886 258630 239055 193593 111206 64659 98517 98804
16645 98804 77454 35097 7140 29505 47692 34465 18427 53530 55844 68802 98416 80372
16633 80372 58735 53320 59287 102961 123884 80593 68584 79193 79670 98615 165644 259285
16621 259285 365232 417447 504574 566859 535332 533573 507457 508655 524226 510659 497528 505983
16609 505983 497351 462072 379763 244862 192320 153148 77173 74795 34447 -4563 12162 -4525
16597 -4525 -62080 -44189 -56132 -68506 -64165 -79351 -80468 -67940 -36619 13143 -5488 -25870
16585 -25870 -34134 -48284 3118 -14908 -54292 -86971 -123349 -87932 -49389 -53312 -37545 12510
16573 12510 -13495 -48352 -51839 -60502 -84434 -36749 -14171 -33956 -87965 -81164 -76698 -77737 -87823
16560h7823N0466j5547k281R967J4224j7343q43N7439M0842K9546j6565l4091
16548B7991j6790m455m280J4819J4626J4898k4570n5351l5331l1300k5979j6599
16536a42321L5927N2277J8502L8118R64N181q131J0908Q139j829j0899j2431n850
16523a1445j8064L375O374l7175J9299O9902n534j3453J630j3276q035J1032l6428
16510c1798n5066J2984K8481L0191j9834J2652j8355l4018M2121M3004K0699p8902
16498d7841k0872j0450j2005j057J8790K6062r746M928K7786K0280j5525q250
16486b7900m680k5687K7863l0611k9892K4236K1266K8906r856L9699j1998l4287
16474c2941J7013o86l7153J023k7632K3983K0020l1809J2636J3904m362K7641
$$ plain form
16560 -87823 -37357 -52904 -55185 -45218 -30994 -48337 -49180 8259 49101 78647 62082 27991
16548 27991 11201 6746 2466 17285 31911 46809 22239 -33112 -68443 -99743 -125722 -142321
16536 -142321 -106394 -54117 -35615 2503 3467 8648 517 11425 19564 17735 6836 -5595 -11445
16523 -11445 -29509 -26134 -19760 -56935 -37636 32266 26732 13279 14909 1633 -6402 4630 -31798
16510 -31798 -86864 -73880 -45399 -15208 -35042 -22390 -40745 -74763 -32642 10362 31061 -47841
16498 -47841 -68713 -79163 -91168 -92225 -73435 -47373 -57119 -52191 -24405 -4125 -19650 -27900
16486 -27900 -32580 -58267 -30404 -61015 -90907 -66671 -45405 -16499 -26355 13344 1346 -32941
16474 -32941 -15928 -16614 -53767 -52744 -80376 -56393 -36373 -68182 -55546 -41642 -46004 -18363
16462a8363K6117O2067m2628o1304l6579j088N3623N270M34N579N848M628k0071
16449a6467k3764j5446k4440j5199M6553J7561K05N0871l88l574J1890m8622m2213
16436f3033L9426L6001K8234n9550r659J9173l1339L574l0168m7974m57Q989j2443
16423a19226P4792K2714k1214l8540K8097O3548j4131j0601j3984K0945L6712
16412B9112M1855N630J8047M1110o0263l7401j2348l58l5698j4416L2443R303
16400A7016k0475j0417P0608n901m4414J3201O8354K2602l8575j5937j8133o8588
16388c0659L9703M1852j9302L845M5156K483o8272q8004J411K4515M4900L0362
16376B7990n0459n4432l1132K5023j3880l1980Q0684J5175K6474R789L7268L8712
$$ plain form
16462 -18363 7754 69821 27193 -34111 -70690 -71778 -18155 -12885 -12451 -6872 -1024 3604 -16467
16449 -16467 -40231 -55677 -80117 -95316 -48763 -31202 -30997 19874 19486 15912 27802 -20820 -63033
16436 -63033 -23607 12394 40628 -18922 -28581 -9408 -40747 -37173 -67341 -115315 -115772 -106783 -119226
16423 -119226 -44434 -21720 -42934 -81474 -53377 10171 -3960 -14561 -28545 -7600 29112
16412 29112 70967 76597 94644 135754 75491 38090 25742 25384 -10314 -24730 7713 17016
16400 17016 -3459 -13876 56732 50831 6417 19618 87972 110574 71999 56062 37929 -30659
16388 -30659 9044 50896 31594 35439 80595 83078 14806 -73198 -71787 -47272 -2372 27990
16376 27990 -22469 -76901 -108033 -83010 -96890 -128870 -48186 -33011 -6537 3252 40520 79232
16364G9232n1775p887l4429l8781j4672J7133j1516j0576k337K1116L5623q449
16352b7318J1143N3310l374L052l5084l5393n077j9481m5716k5263P5476O2527
16340H802K518L036J9638j6568k0026N890j5889K2616N5674J5772K2206j7682
16328H5987m8283l2889j4673l9248k0614j025J9176L2852J0812o8740k45K3195
16316e3695L0111K2773j7153j9966k3275N898K6738Q066k5334J9317J1051k2343
16304c7812J8902j4457l3016o735L7033M7633k1000n3040j6989O037M6175O0974
16292C3705K1807l7163o7300l5222k3698J3266J4829M4010N9485m1697n628M5903
16280B2297J7141n8308n764j9358l2105M7450j599j5645k0658m8579r853M1348
$$ plain form
16364 79232 27457 19570 -14859 -53640 -68312 -51179 -62695 -73271 -75608 -54492 -18869 -27318
16352 -27318 -16175 37135 33761 36813 1729 -33664 -38741 -58222 -103938 -129201 -53725 8802
16340 8802 11320 14356 33994 17426 -2600 3290 -12599 10017 65691 81463 103669 85987
16328 85987 37704 4815 -9858 -49106 -69720 -70745 -51569 -18717 -7905 -76645 -76890 -53695
16316 -53695 -23584 -811 -17964 -37930 -61205 -55307 -28569 -20503 -45837 -26520 -15469 -37812
16304 -37812 -18910 -33367 -66383 -73118 -36085 11548 -9452 -62492 -79481 -73444 -27269 33705
16292 33705 55512 18349 -48951 -84173 -107871 -94605 -79776 -35766 23719 -17978 -23606 22297
16280 22297 39438 -18870 -24634 -43992 -76097 -28647 -30246 -45891 -66549 -115128 -124981 -83633
16268h3633K7988r638n0371L1905J01685o6556k8336j1548J4188L5374N9138j3914
16256F282m8818m778O914J4203J1942N187k4778K630P969K095k0260J8627L5153
16243A2368L536j1389J8349M2261j0434p2708p4633L5684O8824Q826m4884k9530
16231e3730J2448j5696M1935N5629L192l9915q259M0580k0814k4350M1099j4248
16219A7871o1776M939K0104N9770M167j4637K978M840n8375q0280J123N8686N6611
16206A6021k7256l1700K8976J840k2609r0695P025L890k1023J3951P0557K2076
16194b8947m1522J5988J0852n26K7983K2057m8580j7535p191o7322q427O3929
16182g9241Q906m5787M2272L3815k5865J7369J8467L4944K4283m5988n8032N3029
$$ plain form
16268 -83633 -55645 -65283 -115654 -83749 17936 -48620 -76956 -88504 -74316 -38942 20196 6282
16256 6282 -42536 -47314 -40400 -26197 -14255 -9068 -33846 -31216 -23247 -21152 -41412 -22785 12368
16243 12368 15904 4515 22864 65125 54691 -18017 -92650 -56966 11858 20684 -24200 -53730
16231 -53730 -41282 -56978 -15043 40586 43778 3863 -4396 36184 15370 -8980 32119 17871
16219 17871 -43905 -38966 -18862 40908 45075 30438 33416 38256 -20119 -100399 -99276 -40590 16021
16206 16021 -11235 -42935 -13959 -12119 -34728 -125423 -118398 -114508 -135531 -121580 -51023 -28947
16194 -28947 -70469 -54481 -43629 -44155 -16172 5885 -42695 -60230 -67421 -134743 -143170 -79241
16182 -79241 -70335 -116122 -73850 -40035 -65900 -48531 -30064 4880 29163 -16825 -74857 -21828
16170b1828O2633N0189m2332o7058k4488K4652j7706N094K9713K0211J5882m997
16158B9965k7260l4940l8696j2413L5684L9930k4170k3577j9071L3354K681O105
16146c2408q988M5668L8404m9703k1408L3323m003j3218J5755L1596J7872k8678
16134B4212k2776k8587m2329K6855J4328m6871m6630J953K9361O6687N359l3989
16122e2427J749J2499O6465J0536k4285k6454O10j210K9552M0359L236n3318l5245
16109b7933j2151m076L7223K3126L4187k624j9104j1170m16M0806j1066n6523
16097i721l8055j9238j3276o224L4539J5539k2736m6064M8546N5391k141k3383
16085b6823m745N807K1044r298m8570N8938L1548k6748k2889r7693K142K3214
$$ plain form
16170 -21828 40805 90994 48662 -18396 -42884 -18232 -35938 -30844 -1131 19080 34962 29965
16158 29965 2705 -32235 -70931 -83344 -47660 -7730 -31900 -55477 -74548 -41194 -38513 -32408
16146 -32408 -41396 4272 42676 -7027 -28435 4888 885 -12333 3422 35018 52890 24212
16134 24212 1436 -27151 -69480 -42625 -28297 -75168 -121798 -119845 -90484 -23797 -18438 -52427
16122 -52427 -50678 -38179 28286 38822 14537 -11917 -11307 -12517 17035 57394 60630 7312 -27933
16109 -27933 -40084 -44160 -6937 16189 50376 47752 28648 17478 17062 57868 46802 -9721
16097 -9721 -47776 -67014 -80290 -86514 -51975 -36436 -59172 -105236 -56690 -1299 -3440 -26823
16085 -26823 -31568 -25761 -4717 -14015 -62585 -3647 27901 1153 -21736 -119429 -117287 -94073
16073i4073J1606L4585q280l5360L4261O7393L3292j7230j743l7212k8675R727
16061c1709O396M9703L680j252m0151n8688j3410K5332k360j700K5210K5833J7479
16048D363m565j3860N6355N6405O09o1733m6962N849j8466k4828J2032p132M646
16035c7287l4941o7877j8837K4159J8996M9094O403K1936k6306N2881O7397O739
16023F2357q677k9023p0577m8939O768J5906J3591j4066j8741J7845k3484k7341
16011a24381j7446L3055L6684M0706K8761J1675k7895l3204j0799r019q711J4452
15999f6122N206L5249r296m4423j2798j9435l44L5079M8528l8937q68l4095o49
15986a02905L3760M4626K1527O631m1608K1279J3505j939o150k6219J3398j553
$$ plain form
16073 -94073 -82467 -47882 -56162 -91522 -57261 10132 43424 26194 24451 -12761 -41436 -31709
16061 -31709 -25313 24390 28070 26818 -13333 -72021 -85431 -60099 -62459 -64159 -38949 -13116 4363
16048 4363 -202 -14062 42293 98698 99307 37574 -9388 -3539 -22005 -46833 -34801 -41933 -37287
16035 -37287 -72228 -140105 -158942 -134783 -115787 -66693 -60290 -38354 -64660 -11779 55618 62357
16023 62357 53680 24657 -45920 -94859 -88091 -72185 -58594 -72660 -91401 -73556 -97040 -124381
16011 -124381 -141827 -108772 -72088 -31382 -2621 9054 -18841 -52045 -62844 -71863 -80574 -66122
15999 -66122 -60916 -25667 -34963 -79386 -92184 -111619 -111963 -76884 -28356 -67293 -68161 -102256 -102905
15986 -102905 -69145 -24519 -2992 3639 -37969 -16690 -3185 -5124 -11274 -37493 -24095 -25648
15974b5648K1960K5825J1099j1711k0884j1378L553j6881k3207n647J6618O3562
15962B7261J2388n8295j3619J0311m293R879l113k2352l2905k0139m7326N447
15950a36756J4438k374J8002L3378K0455L0733j2690J0234N5194n188n0235k1831
15938d6640L3154J2800q2921l6472N2831M3461J0434K239L2180J6826n717m5265
15926a3090m3981O163M7406K6775l5196m0427j7592j5839o378J1241L0549J8263
15914c2106k1942L8866Q837m2910N9308P3042j2856o6593j1386K385J4989l4398
15902b4764K7905n1824k4856J329O908o928M0309M8529j7815k4434J8338L5631
15890B8328r325k6006L1897L1917m5373m1029L3938j6211l7225l489j3860K2842
$$ plain form
15974 -25648 -3688 22137 33236 21525 641 -10737 -7184 -24065 -47272 -52919 -36301 27261
15962 27261 39649 -18646 -32265 -21954 -26247 -16368 -19481 -41833 -74738 -94877 -142203 -136756
15950 -136756 -122318 -124692 -106690 -73312 -52857 -22124 -34814 -24580 30614 25426 -24809 -46640
15938 -46640 -13486 -686 -83607 -120079 -67248 -23787 -13353 -11114 21066 37892 32175 -13090
15926 -13090 -57071 -50908 -3502 23273 -11923 -52350 -69942 -85781 -92159 -80918 -50369 -32106
15914 -32106 -54048 -15182 -6345 -49255 10053 83095 70239 3646 -7740 -5355 9634 -24764
15902 -24764 3141 -48683 -73539 -72210 -65302 -72230 -31921 16608 -1207 -25641 -7303 28328
15890 28328 19003 -7003 24894 56811 11438 -29591 4347 -11864 -49089 -52578 -66438 -43596
15878d3596j1824m1207j3065K1257L4565n5195k1981L2189M3288k278p976r304
15866g5127m3904p694M3408K8369K3994R955j3286k5189Q295J9466L2435M43J5358
15853A6523o042p3047J1337l3615K752M4452M20m8458k6220M756J2153R980M6873
15840c8136K389k8591L0853M2193L2740m361k3622L024N6238j7045n7738p1K6651
15827B4524k8541J3274k4771l5113o238j3598P039L7876o265K0688j3980q5848
15815a10953k7726j4097M7579L0499M8490O8888J6978J1648O918R375M739n387
15803H6951m6857j4889m5026M689Q831n4110n0936n711r820N0376N1368j093K6219
15790hO836k8386n5403l744J5826K8453K8005J1693J0294m4913j2596N431Q400
$$ plain form
15878 -43596 -55420 -96627 -109692 -88435 -53870 -109065 -131046 -98857 -55569 -57847 -65823 -75127
15866 -75127 -119031 -126725 -83317 -54948 -30954 -20999 -34285 -59474 -51179 -31713 722 1165 16523
15853 16523 10481 -62566 -51229 -84844 -82092 -37640 -37220 -85678 -111898 -107142 -94989 -85009 -38136
15840 -38136 -35747 -64338 -33485 8708 41448 37087 13465 16489 72727 55682 -2056 -2127 24524
15827 24524 -4017 9257 -15514 -50627 -56865 -70463 -63424 -25548 -31813 -11125 -25105 -110953
15815 -110953 -138679 -152776 -105197 -74698 -26208 42680 59658 71306 78224 87599 92338 86951
15803 86951 40094 25205 -19821 -15132 -6301 -60411 -111347 -117058 -126878 -76502 -25134 -26227 -8
15790 -8 6828 -21558 -76961 -80705 -64879 -36426 -8421 3272 13566 -31347 -43943 -38512 -30112
15777c0112L300j7557j6654M6294J8767k5266M726O0420j8408m6409k7448J2546
15765c5801j7132k133j1463N1397N5493r117j4276j4077l0055n8156Q292N7903
15753a9125m5678P669l9287j8631K3776L7364M735l1777k3688q388j0035L9498
15741h3567L2972J5964K0121J3262J1325N200R226k8701l0884l267k2172j0692
15729g1213m8467K2352R971j9763L5034P6495P0678K8197n3113p4555n763J1265
15717a8882L2298K1181k8647o4303J1969K2077M0809M95m8597M5223j447K055
15705A4231J3150k739l6866n6188L436K8121N2487L5217P896m6540k0141m4251
15693e2187J3249J7057R385j4592q710k0474N257K4871L8472P06k0387j6386l1148
$$ plain form
15777 -30112 -26812 -44369 -61023 -14729 4038 -21228 -16502 43918 25510 -20899 -48347 -35801
15765 -35801 -52933 -55066 -66529 -15132 40361 31244 16968 2891 -27164 -85320 -77028 -19125
15753 -19125 -64803 -57134 -96421 -115052 -91276 -53912 -49177 -80954 -104642 -113030 -123065 -83567
15741 -83567 -50595 -34631 -14510 -1248 10077 15277 24503 -4198 -35082 -38349 -60521 -71213
15729 -71213 -119680 -97328 -87357 -107120 -72086 4409 75087 103284 50171 -24384 -30147 -18882
15717 -18882 13416 34597 5950 -58353 -46384 -24307 16502 16997 -31600 13623 12176 14231
15705 14231 27381 24642 -12224 -68412 -64976 -36855 15632 50849 58745 12205 -7936 -52187
15693 -52187 -38938 -21881 -12496 -27088 -35798 -56272 -51015 -26144 12328 13034 -7353 -23739 -54887
15680e4887k8843L4085K0408L4815j610k3837o2695M4165m94J888N320j1341j4599
15667e7625K3643n04l4528p580K5654R237P4117J6393k0261r75l1230K2973K4400
15654D3714p2670k8571J6819M9705m4331l6998k1328L9027L4472J1215P265O2546
15642F0865P765l2297j1892j9242k7305j346O32K5475j4154J4722k03m877l290
15629e147j9363J2294Q576J0242j2936m9975J3882M1373K4608P214J471L972K3201
15616E9412P4n113m5265n237k3410j1647J8889Q562J3883m2983J4896K8975rj5747
15602d720P3976j7542m4147r4031k9609M9578J4451j1445K2891j1898Q495L1164
15590a2837J9660j3894m8027r721P06m486m241p545J0358r679K5980M2662k0422
$$ plain form
15680 -54887 -83730 -49645 -29237 5578 3968 -19869 -82564 -38399 -38893 -37005 -31685 -43026 -57625
15667 -57625 -33982 -34486 -69014 -76594 -50940 -41703 32414 48807 28546 27571 -3659 19314 43714
15654 43714 -28956 -57527 -40708 8997 -35334 -72332 -93660 -54633 -20161 -8946 -1681 60865
15642 60865 68630 36333 24441 5199 -22106 -23452 -22820 2655 -11499 3223 3020 -1857 -5147
15629 -5147 -24510 -12216 -3640 6602 -6334 -56309 -42427 -1054 23554 30768 32239 36211 59412
15616 59412 59486 54373 9108 3871 -19539 -31186 -12297 -3735 10148 -32835 -17939 11036 11027 -4720
15602 -4720 69256 51714 7567 -86464 -116073 -66495 -52044 -63489 -40598 -52496 -44001 -12837
15590 -12837 6823 -7071 -55098 -64819 -64113 -68599 -72840 -80385 -70027 -79706 -53726 -11064 -31486
15577c1486k7116r678M5036K9461J3868k8160N838j7329n0296o8099K5476J4758
15565i7727M570j6326L296N6685j0566k1673k197r973O1986K1480K3145M3990
15553E6690k1465n4784m124q556l0610l9155J4113m889M1338M0223p164p546M0594
15540A4665l3360p405n018K7803J8130k4208n227j9327l1817m8422k7683J3496
15528a28373J9843L6081L4729L7868J3471M884J5849l096J2669j4155m814L079
15516B8035j3648o9544P29L0794l9764M6688L6836k5213p230Q128l0060L4059
15504a90r964q943j5145j202o311j9480j2561l7025l123P0002K9303J0468K0444
15491A6273k4781M3491j9031k8428L1135K4839j7471k7075j4281q03q272N730
$$ plain form
15577 -31486 -58602 -68280 -23244 6217 20085 -8075 -2237 -19566 -69862 -137961 -112485 -97727
15565 -97727 -93157 -109483 -106187 -49502 -60068 -81741 -83938 -93911 -31925 -10445 12700 56690
15553 56690 35225 -19559 -23683 -32239 -62849 -102004 -87891 -92780 -51442 -11219 -18383 -25929 14665
15540 14665 -18695 -26100 -31118 -3315 14815 -9393 -14620 -33947 -65764 -114186 -141869 -128373
15528 -128373 -108530 -72449 -37720 148 13619 18503 34352 31256 43925 29770 24956 28035
15516 28035 14387 -55157 -54428 -23634 -63398 -16710 20126 -5087 -12317 -4189 -34249 -190
15504 -190 -10154 -19097 -34242 -35444 -41755 -61235 -73796 -110821 -113944 -43942 -14639 -4171 16273
15491 16273 -8508 34983 15952 -12476 18659 43498 26027 -1048 -15329 -16132 -24404 -18674
15479a8674Q034j4386j2557N3309J0609k5887n191o74L180R549J6897J6225k0985
15466A9449J5099r781n380m8593j7856J2377J466J7932Q427J308o388r18m8779
15453f1637O90O2415N9009l6714j8246L3478k6210n5794l9901M3713j4255K7742
15441b5710N234m9109L3096j7931k9020j6143O0260M9797J3226m6607m0160J5274
15429d7793k9407m026L9429l0621M3435M5008n655n5766m1687m3771J8158o605
15417a19301N6209L8651K0579M4033j6449J0832o336p726k6972l5819n6334M8800
15405d9833K261K0708J6065j1390l1467j0408L9285J509m522m4663m0260J9221
15393i3494J3457L1260L9378N499q376l0819k5155M7983K2575Q900j9933j5035
$$ plain form
15479 -18674 -10640 -25026 -37583 15726 26335 448 -4743 -5417 -2237 7312 24209 40434 19449
15466 19449 34548 24767 19387 -29206 -47062 -34685 -33219 -15287 -6860 -5552 -11940 -12858 -61637
15453 -61637 -60947 1468 60477 23763 5517 38995 12785 -43009 -82910 -39197 -53452 -25710
15441 -25710 -20476 -69585 -36489 -54420 -83440 -99583 -39323 10474 23700 -22907 -63067 -47793
15429 -47793 -77200 -81226 -41797 -72418 -28983 16025 10370 -45396 -87083 -130854 -112696 -119301
15417 -119301 -63092 -24441 -3862 40171 23722 34554 28218 20492 -6480 -42299 -98633 -49833
15405 -49833 -47572 -26864 -10799 -22189 -53656 -64064 -24779 -23270 -27792 -72455 -112715 -93494
15393 -93494 -80037 -48777 -9399 -3900 -12276 -43095 -68250 -20267 2308 11208 -8725 -23760
15381b3760l396m028R391l1959J6809j1268k4116K2245K2829j8221Q427J1190
15369b5857j660k2963J684O7367N158N3769J823J222J2610P441k2331l5194R966
15356E3035R644N859J4945Q441l9510m6134k1676J5792n744m7831k9646L5465
15344d7360k264O0823R2214n9577o0051j344N8447J6348m3368L063j5272j2930
15332a1271l3399j9575R010l7752K9972M5810J1075N3524k3668l9213K3840j9084
15320a0731L7065N5196J8941k2966l1405n1149k6884K8355L661K1643l6229k3114
15308c7617O938j4851k0055K2135J05684L1843n5557k6435J8419k5292N128m919
15296E421j844l1372l3505l7298K112n592j3570M3577L3874J2954N167j9009K5498
$$ plain form
15381 -23760 -27156 -31184 -21793 -53752 -36943 -48211 -72327 -50082 -27253 -45474 -37047 -25857
15369 -25857 -27517 -50480 -48796 18571 23729 77498 79321 80543 93153 100594 78263 43069 53035
15356 53035 62679 68538 83483 91924 52414 6280 -15396 396 -5348 -53179 -82825 -47360
15344 -47360 -49624 11199 103413 43836 -16215 -17559 40888 57236 13868 16931 1659 -11271
15332 -11271 -44670 -64245 -55235 -92987 -63015 -17205 -6130 47394 23726 -15487 8353 -10731
15320 -10731 26334 81530 100471 77505 46100 -5049 -31933 -3578 83 21726 -14503 -37617
15308 -37617 -30679 -45530 -65585 -43450 62234 94077 38520 12085 30504 5212 10340 5421
15296 5421 3577 -27795 -61300 -98598 -96486 -102078 -115648 -72071 -38197 -25243 -20076 -39085 -13587
15283a3587J529j6687j1959J9681N6664P909M0410j159l4897o2844o358P735M1573
15270B8010l9272l7543O532K668P871K1438Q9049N6050n944l701q698n2666j3616
15257E0178l0451k1140q799r798J8345k6131K4598P0962L9238n5138j8131K1498
15245E5231p816J7790K0139o6299K8211M3800K4959n3916l1466l6725l1151N471
15233c1772M4191J9395m374j3702J1300q9120J6234K7070l2329L721K5613O257
15221a7516m3503j841l2892j430N1467L8307m2580k5434R989k4022l2724r495
15209a31674L2575K7987j5883K3971O1875L0854k8878j8482J3910N8609O8177
15198A23041m4667m1734j1021J1620R153L936r178o543L6165K3720m3664K5188
$$ plain form
15283 -13587 -12058 -28745 -40704 -21023 35641 43550 83960 82801 47904 -14940 -21298 -13563 28010
15270 28010 -11262 -48805 -42273 -39605 -31734 -10296 78753 134803 128859 125158 116460 63794 50178
15257 50178 19727 -1413 -10212 -20010 -1665 -27796 -3198 67764 107002 51864 33733 55231
15245 55231 47415 65205 85344 19045 47256 91056 116015 62099 30633 -6092 -37243 -31772
15233 -31772 12419 31814 27440 13738 25038 -64082 -47848 -20778 -53107 -49386 -23773 -17516
15221 -17516 -61019 -62860 -95752 -97182 -45715 -7408 -49988 -75422 -65433 -89455 -122179 -131674
15209 -131674 -99099 -71112 -86995 -63024 -1149 29705 827 -17655 -3745 54864 123041
15198 123041 78374 36640 25619 37239 46392 50328 41150 34607 70772 94492 50828 76016
15186G6016J1035N227k3371n5338j8183K2150M1982K5193N930k5080J6584L8056
15174A20201l5026p3351q231L330P607m2320j1960L508K976J5272K415j5779l105
15161c4463J3609o458R919j1835J0549L6248L171m1673j5428n3208o690L6030
15149f0229J6435J5843L7048j7150K0078J9434L7112j6103j9724j9169R526l2612
15137i511K6906M5159n4599N272N9501L9386K3853k7477n3822k4370n0003l6016
15125e5721R395J5773R242N243k7133J6967N1513j5292k8398J0881R695L8234
15113D0399j3111j5652k8724J1829R442J2978n196n1442j4392M6489Q399k9822
15101b8803J4261J967l9457J3723j5985P244o981L5513j4195k0765j2270P132
$$ plain form
15186 76016 87051 92278 68907 13569 -4614 17536 59518 84711 90641 65561 82145 120201
15174 120201 85175 11824 3593 6923 14530 -27790 -39750 -36242 -33266 -17994 -15579 -31358 -34463
15161 -34463 -20854 -27312 -17393 -29228 -18679 17569 20740 -20933 -36361 -89569 -96259 -60229
15149 -60229 -43794 -27951 9097 -8053 12025 31459 68571 52468 32744 13575 23101 -9511
15137 -9511 17395 62554 7955 13227 72728 112114 135967 108490 54668 30298 -19705 -55721
15125 -55721 -46326 -30553 -21311 -16068 -43201 -26234 25279 9987 -18411 -7530 2165 40399
15113 40399 27288 11636 -17088 -5259 4183 17161 11965 -39477 -53869 -7380 1019 -28803
15101 -28803 -14542 -12575 -52032 -38309 -54294 -47050 -54031 -18518 -32713 -53478 -65748 -58616
15089e8616k679k1329J4134M0728j067j7261L411K8563N7567R515J1077j7518
15077D6525m3498k0658N2033n799j7327j4360o611k1583J1022j2032m6464N1213
15065b7539P259n460K0551m2988L9926L1152n5338j7795L0527M2292L3166k9688
15053B6065m9727N563J999q567J3768n6169K2319M1705J0828m0251r804k2567
15041f4838k0673J5639L1701L1374J0476L3043J2568k270j11p018o5992l4376
15029f0477M0571K2557P562k4659k5100M7347N9340o144l2003k7409L335n981
15017a061k1518J482L3949J5319J3646l8118n6581L3528K5280K8931l4344l1855
15005c1342J2871l9115L9160J4719J6991j0080K7358M6402k9194k0170q428l1251
$$ plain form
15089 -58616 -61295 -82624 -68490 -27762 -28829 -46090 -42679 -14116 43451 52966 64043 46525
15077 46525 3027 -17631 34402 28603 11276 -3084 -9695 -31278 -20256 -32288 -78752 -27539
15065 -27539 -20280 -25740 -5189 -48177 -8251 22901 -32437 -50232 -19705 22587 55753 26065
15053 26065 -23662 -18099 -16100 -24667 -10899 -67068 -44749 -3044 7784 -32467 -42271 -64838
15041 -64838 -85511 -69872 -38171 -6797 3679 36722 49290 47020 46909 39891 -26101 -60477
15029 -60477 -19906 2651 10213 -14446 -39546 7801 67141 60997 28994 1585 4920 -1061
15017 -1061 -22579 -21097 12852 28171 41817 3699 -52882 -19354 5926 34857 513 -31342
15005 -31342 -18471 -57586 -18426 -3707 13284 3204 30562 76964 47770 27600 19172 -12079
14993a2079J5142k1497K7691K9510L5684K2266l9730n1871m9645J2687J4942k7469
14981d4369n277J277L8364R444k4767k1577Q699l049N336k9430q272k4041N524
14968i2138K2928J0072M0199j3266m117K3138R664K5796k5570L245j8406R847
14956h608J6891P747o047K4385r206L8996j2231m9251J619j3591l3309L9695L2290
14943B9380n530J572M3507M0270M3419l156J5075o258m9908j2835L1426l7350
14931H9612j0784p932m5012L0334J0745k4822j5632O81L0483J6097m6228j2923
14919A4619L6005K4785k0490n1172l8087m4044L1510O8951K9961J9198J8244k8409
14907F1071k737m072q82L605j3326K744k271M499r554n5073j1235J1292J1182
$$ plain form
14993 -12079 3063 -18434 9257 38767 74451 96717 56987 5116 -44529 -31842 -16900 -44369
14981 -44369 -49646 -48369 -10005 -561 -25328 -46905 -38206 -41255 -35919 -65349 -73621 -97662 -92138
14968 -92138 -69210 -59138 -18939 -32205 -36322 -13184 -3520 22276 -3294 -49 -18455 -8608
14956 -8608 8283 16030 9983 34368 25162 64158 51927 2676 4295 -9296 -42605 -2910 29380
14943 29380 23850 25422 68929 109199 152618 149462 164537 158279 108371 95536 126962 89612
14931 89612 78828 70896 25884 56218 66963 42141 26509 27190 57673 73770 27542 14619
14919 14619 50624 75409 54919 3747 -34340 -78384 -46874 22077 52038 71236 89480 61071
14907 61071 58334 54262 53380 56985 43659 46403 44132 48631 39077 -15996 -27231 -15939 -4757
14894d757O18O150K2658L9351L345K8387K917J6592n1631q8390M837M1977N6562
14881G8616K728l9403M712N882j8252j4719L212P687j219J6834K1169K6249J618
14868I5114k9817L196K6523j5123j4718J3529k6690J340J8429m8976k5881K6410
14856B3336P2025J0607n7704p322J2407Q62O419p785n4521j2300K5914L234J5898
14843C1070J9256J6047O341J6284J2633j6935j7359p4939o0975L5618P890K0427
14831d642M1417K6836N9415l805j4041l5672m5309n1821L7168L5535l7214j9789
14819a1922L5737Q38j3595o004J3329K4250K3279m7633k5752L5461J4448R95k1106
14806B2325j7288P6957J3142k7642J800l6478q493K3392P004P52M7569N0990K4150
$$ plain form
14894 -4757 -4139 2011 24669 64020 67365 95752 98669 115261 63630 -24760 -19923 22054 78616
14881 78616 81344 41941 46653 52535 34283 19564 22776 30463 29244 46078 67247 93496 95114
14868 95114 65297 68493 95016 79893 65175 78704 52014 53354 71783 22807 -3074 23336
14856 23336 95361 105968 48264 40942 53349 54211 60630 52845 -1676 -13976 11938 15172 31070
14843 31070 50326 66373 72714 88998 101631 84696 67337 -7602 -68577 -32959 -25069 -4642
14831 -4642 36775 63611 123026 119221 105180 69508 24199 -27622 9546 45081 7867 -11922
14819 -11922 23815 24653 11058 5054 18383 42633 65912 18279 -7473 27988 42436 43431 22325
14806 22325 5037 81994 95136 67494 69294 32816 24323 47715 54719 55471 103040 154030 178180
14793A78180K5996m9888k3200n0108k9948j1556j6388l406j536K3983o216K9219
14781F5132j8169M6161L8989l2243m460j171l692J4218m297j8622N2139k8109
14769A05876m6841j225O010l0899M9310k610n9804Q107K3226q821K7250K7571
14757I7150k1701o2201j422R164K630k5520N530K7051J4816N1396j9212k3581
14745E4100j215O917j848J7919J4373L4362K5455o1486m8249K2563K9172M7170
14733A39233J3830K505k0414N895k8044l6877L9135r5245k4090M8239O767M6737
14721I7671K4252m8139k4615L9535m579o810L681p298j2186L9712J7790m982m3557
14708G0475l1415m15K426l032k17K7990J2101J6709k7902j1327K0819o666J3206
$$ plain form
14793 178180 204176 154288 131088 80980 51032 39476 23088 19682 18146 42129 35913 65132
14781 65132 46963 93124 132113 99870 95410 94239 90547 104765 100468 81846 133985 105876
14769 105876 59035 57810 63820 32921 82231 79621 19817 27924 51150 42329 69579 97150
14757 97150 75449 13248 11826 20990 23620 -1900 3630 30681 45497 96893 77681 54100
14745 54100 52885 59802 57954 75873 90246 124608 150063 88577 40328 62891 92063 139233
14733 139233 153063 155568 135154 141049 113005 76128 115263 20018 -4072 44167 50934 97671
14721 97671 121923 73784 49169 88704 84125 77315 80996 73698 61512 101224 119014 114032 70475
14708 70475 39060 38645 41071 38039 37822 65812 77913 94622 66720 55393 76212 69546 82752
14695H2752L5339m7530k4912K0176r106j6628L742N3501m334J3767K3566O040
14683A36373Q57j3242k7673n0996k6128K3640L0105n395K3948R84J5532K2313
14671A30318J2943r525k5829M596J0346j3928J2166N016k1607m011j2208j4143
14659G4134M2926P789j5037O5010N2486k8915m485J6857p535q4928n6011J2125
14647G4416M5599L170N725Q353J5222n0608l7909R410L3073L4327n557k3563n75
14634A11083k8160n1411L886j1108K2361K9424N8206P6271J8463l2767l0438j6627
14622A49183j424k4160L8304L9417J8159m4760q876J3088j1004l7082j001K7413
14610A57257J5072k3960m635L9291M6470m5598j7022l238j8974K9066n756m1839
$$ plain form
14695 82752 118091 70561 45649 65825 56719 40091 43833 97334 93000 106767 130333 136373
14683 136373 137230 123988 96315 45319 19191 42831 72936 67541 91489 92473 108005 130318
14671 130318 143261 133736 107907 112503 122849 108921 121087 126103 104496 100485 88277 74134
14659 74134 117060 124849 109812 174822 227308 198393 193908 210765 203230 118302 62291 74416
14647 74416 120015 123185 128910 137263 152485 101877 63968 73378 106451 140778 135221 111658 111083
14634 111083 82923 31512 35398 24290 46651 76075 134281 210552 229015 196248 165810 149183
14622 149183 147759 123599 161903 201320 219479 174719 165843 178931 167927 130845 129844 157257
14610 157257 172329 148369 143734 183025 229495 183897 166875 163637 144663 173729 167973 126134
14598A26134J5041n74J5883j5650k157r613L7384Q116M0235M0743k2045k3517
14586B09980J8748j6918l2663N673j2622L6016j8570o041K0407k1168k0210O49
14574A63281K3993J1744k8406q006L8401Q179o2369l8798L1489L4456Q21J898
14562A76683N014k7925J2205P209K9611M6576K620j9670O312Q426n1788l908R843
14549B01208L023o4385m0951K6950j8345n074L2665N5872K3968l031k0186k4320
14537A67394o018R887K0354L8840P770q901r925J6407K6151k8809j8838r684n140
14524A99488L834P325L1488j4117l4527j2193K4165N5995M0086J8385o05j0713
14512C08611P4l3145L3335K4365k6426j1914J0657o711j0869P4602j20q4581J3742
$$ plain form
14598 126134 141175 140601 156484 140834 138677 129064 166448 174564 214799 255542 233497 209980
14586 209980 228728 211810 179147 184820 172198 208214 189644 183603 204010 182842 162632 163281
14574 163281 187274 199018 170612 162606 201007 209186 146817 108019 139508 173964 174785 176683
14562 176683 181697 153772 165977 173186 202797 249373 251993 232323 238635 247061 195273 191365 201208
14549 201208 204231 139846 98895 125845 107500 102426 135091 190963 214931 211900 191714 167394
14537 167394 161376 171263 191617 230457 238227 229326 219401 235808 261959 233150 214312 204628 199488
14524 199488 203322 210647 242135 228018 193491 181298 205463 261458 301544 319929 319324 308611
14512 308611 308685 275540 308875 333240 306814 294900 305557 298846 287977 362579 362459 277878 291620
14499B91620K8216n294M6808L9102l2453j0627l8070l965J6046m8422m5079N107
14487B42989J7494M8299L5554J436j1401J38l1733M7734K6539k2348n3409j6637
14475B84655L4913k1949j771K3230P243k589J2980m875l551Q244J6727l541n118
14462C44598J2444k4657j1897K3356J8673j5066l4507L2923M9832M8719Q990n171
14450D48237j8658q86j1631m7487l1248j7541K3994M9304k412k7494K740j3048
14438C53870Q189j3723m1117K9512P9505L2848J2833n1197n1574j4947j2006J2606
14426C44799N0922j7619k0266J8476L728R748Q29o049M061N898q32K3988J1894
14413D29577K9233N2578K586n1178j6373o816M4176L8434m9569k3002J6885O438
$$ plain form
14499 291620 319836 314542 361350 400452 367999 357372 319302 315337 331383 282961 237882 242989
14487 242989 260483 308782 344336 345772 334371 334509 302776 350510 377049 354701 301292 284655
14475 284655 319568 297619 295848 319078 326321 323732 336712 331837 328286 336530 353257 349716 344598
14462 344598 357042 332385 320488 343844 362517 347451 312944 345867 395699 444418 453408 448237
14450 448237 429579 428693 417062 369575 338327 320786 344780 394084 391672 364178 366918 353870
14438 353870 362059 348336 307219 336731 416236 449084 461917 410720 359146 344199 332193 344799
14426 344799 395721 378102 357836 376312 380040 389788 390617 384568 388629 394527 393695 417683 429577
14413 429577 458810 511388 513974 462796 446423 439607 483783 522217 472648 449646 466531 472969
14401D72969J1814J4115j1474N770L0208k8301n671L230M9058M9598L472Q520
14389F03308m5935J5860K6487J5142l6498r907j2704P012N7015M7135k9903n126
14377F31886j8889J625J0617N1922p574J7429N965m3564N4430K0201l5783l8770
14365F49495M8290j4896k9332L9770l3914j7556N1219O6145n478k0291l524N875
14353G35803M554Q028J2077N0875J8572J2217N1057L5477j4435k7577j0131O1365
14341I37882L241K6673l4232K0974k0415K6212K1996P196J6388l8510l25J9056
14329I86136L1417q607l034Q0152M8216l7807l6654l1685M8171M0456J8845j1538
14317A124068m0307j9461Q976L5222n4008P366N7498p244N872K968M81J5131L248
$$ plain form
14401 472969 484783 498898 487424 493194 523402 495101 489430 492660 541718 591316 594788 603308
14389 603308 557373 573233 599720 614862 578364 568457 555753 562765 619780 666915 637012 631886
14377 631886 612997 614622 625239 677161 669587 687016 692981 649417 703847 724048 688265 649495
14365 649495 697785 682889 653557 693327 659413 641857 693076 759221 753743 733452 729928 735803
14353 735803 740357 748385 760462 811337 829909 842126 893183 928660 914225 886648 876517 937882
14341 937882 941123 967796 933564 954538 934123 960335 982331 989527 1005915 967405 967080 986136
14329 986136 1017553 1008946 1005912 1086064 1134280 1096473 1059819 1028134 1076305 1116761 1135606 1124068
14317 1124068 1083761 1064300 1073276 1108498 1054490 1061856 1119354 1112110 1117982 1120950 1121431 1136562 1139810
14304A139810K347L5613J7696K3272o883K1799j0572o3622r782N6831K475K9438
14292A238422J2636J333M5715M1568J3209K4815J5415O6683j9503P917L1312l8097
14280A441425J9589K9727j0482m145L5212N5378J611N49L1364K4402L3637K2313
14268A680580p355m5805k3239J6882K6082K9410P0628L6814J4090N6400Q481L678
14256A866646j9202j3613Q130J9384L3086K5958j0873P4485K0539J0586L0031
14245B045157l641K244O8631P1092J0337l1891K0221r02J1791K171L1968M5873
14233B273051J4830J6348J1599J9601K9179J9712J3687P5152R5208L5732N2494
14222B656593k3828j5502M2545R8487O6144K3657j462M1301J2223j8084Q3535
$$ plain form
14304 1139810 1142157 1177770 1195466 1218738 1211855 1233654 1223082 1159460 1149678 1206509 1208984 1238422
14292 1238422 1251058 1252391 1298106 1339674 1352883 1377698 1393113 1459796 1440293 1448210 1479522 1441425
14280 1441425 1461014 1490741 1480259 1476114 1511326 1566704 1568315 1568864 1600228 1624630 1658267 1680580
14268 1680580 1673225 1627420 1604181 1621063 1647145 1676555 1747183 1783997 1798087 1854487 1862968 1866646
14256 1866646 1847444 1833831 1841961 1861345 1894431 1920389 1909516 1984001 2004540 2015126 2045157
14245 2045157 2041516 2043760 2112391 2183483 2193820 2161929 2182150 2181248 2193039 2195210 2227178 2273051
14233 2273051 2287881 2304229 2315828 2335429 2364608 2384320 2398007 2473159 2568367 2604099 2656593
14222 2656593 2632765 2617263 2659808 2758295 2824439 2848096 2846634 2887935 2900158 2882074 2965609
14211B965609N6710k755N8786M5951N5615R8948M6967N5893Q2238P6298K9496
14200C569756r67R1293Q3331O2196O6798M8891O9916Q1936M8732Q7446P4436R0427
14188D374191O6192M2213N5959N9315P7447Q9617N3882J14532N8870O7431J05332
14177E164981J04402J39607J10838R4715J19633J62077J27259J20432P2857J33540
14167F350341K17994J04358J25792J50857J14950J71147J52285J69514J77603
14158G734841K10299J83720J87039J59542J74069K08207J87705K49061K50585
14149I545068K51894K59217K10576K40680K95871L64342K95760L15589L01528
14140A2080525L28100L51824L13945L53103M38285M49061M31565L86794L94899
$$ plain form
14211 2965609 3022319 3019564 3078350 3124301 3179916 3278864 3325831 3381724 3463962 3540260 3569756
14200 3569756 3568789 3660082 3743413 3805609 3872407 3921298 3991214 4073150 4121882 4209328 4283764 4374191
14188 4374191 4440383 4482596 4538555 4597870 4675317 4764934 4818816 4933348 4992218 5059649 5164981
14177 5164981 5269383 5408990 5519828 5614543 5734176 5896253 6023512 6143944 6216801 6350341
14167 6350341 6568335 6672693 6798485 6949342 7064292 7235439 7387724 7557238 7734841
14158 7734841 7945140 8128860 8315899 8475441 8649510 8857717 9045422 9294483 9545068
14149 9545068 9796962 10056179 10266755 10507435 10803306 11167648 11463408 11778997 12080525
14140 12080525 12408625 12760449 13074394 13427497 13865782 14314843 14746408 15133202 15528101
14131A5528101M69686M70945M72594N65942N59446O11820O62646O64977O34024
14122B0640181O28626O79398O64254P10249Q14146Q12877Q59511Q35704Q67959
14113B7512905R63390R90403R34557R75230J056282J122285J165205J171805J193186
14104C7085248J184434J176844J232802J268499J221948J247182J217598J219971
14096D6854526J261898J165655J178640J156340J060491R64467Q89435Q86514
14088E5417966Q11418O72416O03236M87763L37542K21596J23919k8503j78489
14079E8468864l09447l95149m78897o67715p38425p64148q20210q97122j015005
14070E2382746j076169j103578j143429j206664j221906j240772j253833j220035
$$ plain form
14131 15528101 15997787 16468732 16941326 17507268 18066714 18678534 19341180 20006157 20640181
14122 20640181 21268807 21948205 22612459 23322708 24136854 24949731 25809242 26644946 27512905
14113 27512905 28476295 29466698 30401255 31376485 32432767 33555052 34720257 35892062 37085248
14104 37085248 38269682 39446526 40679328 41947827 43169775 44416957 45634555 46854526
14096 46854526 48116424 49282079 50460719 51617059 52677550 53642017 54531452 55417966
14088 55417966 56229384 56901800 57505036 57992799 58330341 58551937 58675856 58647353 58468864
14079 58468864 58159417 57764268 57285371 56617656 55879231 55115083 54294873 53397751 52382746
14070 52382746 51306577 50202999 49059570 47852906 46631000 45390228 44136395 42916360
14062D2916360j231642j233503j200836j147511j156759j127198j096487j079515
14054C3642909j075611j019604r38756r93872r80928q82837q64144q64566q24352
14045B5198239q13542p51967p00067o84870o93635o68173o14281o18976o35313
14036A9017415o00126n47934n04420n32611m76600m48894m08230m74240m52939
14027A4571421m11038m32640m01586l15602l27954l41475l25037k75829l34406
14018A1405854k54068k40066k94666l15982k94570k37482j98224k52260k20768
14009I097768k00223k03326j93381k14617j74015j80217k13040j43554q9467j26815
13999G359113j79049k20195j64427j19632j29883j50033j51680j28456j10617
$$ plain form
14062 42916360 41684718 40451215 39250379 38102868 36946109 35818911 34722424 33642909
14054 33642909 32567298 31547694 30608938 29615066 28634138 27751301 26887157 26022591 25198239
14045 25198239 24384697 23632730 22932663 22247793 21554158 20885985 20271704 19652728 19017415
14036 19017415 18417289 17869355 17364935 16832324 16355724 15906830 15498600 15024360 14571421
14027 14571421 14160383 13727743 13326157 13010555 12682601 12341126 12016089 11740260 11405854
14018 11405854 11151786 10911720 10617054 10301072 10006502 9769020 9570796 9318536 9097768
14009 9097768 8897545 8694219 8500838 8286221 8112206 7931989 7718949 7575395 7485928 7359113
13999 7359113 7180064 6959869 6795442 6675810 6545927 6395894 6244214 6115758 6005141
13990F005141r2668p3561j26189j01932j35228j28643j16975j29885j05223o5824
13980D929013l5821p3662r3242j20561p8581k7620n1965r3542o0284j11489p9599
13969D102647o7675o8331q9475l7331k7395p3427p8234m4884p4453k2228l0411
13958C488803m9492q2196j37597n5013j39o8979j09196l5655o282j6452o2069
13947B865733p1907m2827l1814m3164k8076m8229n4851M219k7060j6995r8960
13936B406069q7883K8521J7551o0962k5267o4002l2400l6715J1350J9118k9693
13925B145687n2179m2202m4687N101m9716k6990l5912o9659j5255L350m1740m6489
13913A729309l6090m6221J9555J886l7964k9750K1201k5509k9642M3772P491k0608
$$ plain form
13990 6005141 5912473 5838912 5712723 5610791 5475563 5346920 5229945 5100060 4994837 4929013
13980 4929013 4893192 4819530 4726288 4605727 4527146 4499526 4447561 4354019 4293735 4182246 4102647
13969 4102647 4034972 3966641 3877166 3839835 3812440 3739013 3660779 3615895 3541442 3519214 3488803
13958 3488803 3439311 3357115 3219518 3164505 3164366 3095387 2986191 2950536 2944254 2927802 2865733
13947 2865733 2793826 2750999 2719185 2676021 2647945 2599716 2544865 2549084 2522024 2505029 2406069
13936 2406069 2318186 2346707 2364258 2303296 2278029 2214027 2181627 2144912 2156262 2175380 2145687
13925 2145687 2093508 2051306 2006619 2011720 1962004 1935014 1899102 1829443 1814188 1817538 1775798 1729309
13913 1729309 1693219 1646998 1666553 1668439 1630475 1600725 1621926 1596417 1566775 1610547 1618038 1597430
13901A597430j038j4812J1318n105l3772m7085k4920j7756j0441k6081n884j5590
13889A406264n3139l0925O317k3908k3518M3165J6892k3161K7824q856l4160l3711
13877A269084o0066m5508j4297O2431N5556o0357m6271j5182l0292k662k4357
13866A088079J547M0864l324O014P581j6840l6823l382M2367M300j6147J109m211
13853A111134q163N942n9923R50N4211j2809K173k5138l0845q487M3385q536L366
13840A067260l8421j825m469n760L6917j0623m7224m697j2051K283l5859k4745
13828I20786j4525J5374K8856j8640k9745l7958J8051K7276K3869k3406j7787
13817H92151l0413j7194n5237L7912O1137j0687k8669k8691m3642M4219M2272
$$ plain form
13901 1597430 1596392 1581580 1592898 1587793 1554021 1506936 1482016 1464260 1453819 1427738 1421854 1406264
13889 1406264 1353125 1322200 1328517 1304609 1281091 1324256 1341148 1317987 1345811 1336955 1302795 1269084
13877 1269084 1209018 1163510 1149213 1211644 1267200 1206843 1160572 1145390 1115098 1112436 1088079
13866 1088079 1089626 1130490 1127166 1133180 1140761 1123921 1087098 1083716 1126083 1130383 1114236 1115345 1111134
13853 1111134 1102971 1108913 1048990 1049940 1104151 1091342 1093515 1068377 1037532 1029045 1072430 1063894 1067260
13840 1067260 1028839 1027014 1022545 1016785 1053702 1043079 995855 991158 979107 981390 945531 920786
13828 920786 906261 921635 950491 931851 902106 864148 882199 909475 933344 909938 892151
13817 892151 861738 844544 789307 827219 888356 877669 849000 820309 776667 820886 863158
13806H63158j2360l0268l4185l2746L360k7342l5689m6337k753J8021L2777n2102
13794F43534O159J8386l4000k9443p133J9814M0032l2776o3411j0245K0309N842
13782E77068m5168q331J9939l3997J5957L9638O3064L1659Q033m1733l2172J675
13770E95632j6445K0451r96m2097n1667o915k3868P910N782j7663m67N834R104
13757D84595J3084K0876K490K3032m3431l4651j9383N1164j9941M098K975M1085
13745E25993l6665j6487O54l89J501l8715k5244J7410P734n9771j1456N5907p84
13732D19688j4703J588J3368L382k5619O996K2072k7963j5378J568q534m2831
13720C33634J4402M0708O1612q796m7636k0269l9425l076P4790O5137k929l8858
$$ plain form
13806 863158 850798 820530 786345 753599 756959 729617 693928 647591 644838 662859 695636 643534
13794 643534 649693 668079 634079 604636 597503 617317 657349 624573 561162 550917 571226 577068
13782 577068 531900 523569 543508 509511 525468 565106 628170 659829 667862 626129 593957 595632
13770 595632 579187 599638 598642 556545 504878 497963 474095 482005 487787 470124 469657 475491 484595
13757 484595 497679 518555 521045 544077 500646 465995 446612 497776 477835 481933 484908 525993
13745 525993 489328 472841 473495 473106 474607 435892 410648 428058 435792 376021 364565 420472 419688
13732 419688 404985 406573 419941 423323 397704 404700 426772 398809 383431 384999 376465 333634
13720 333634 348036 388744 450356 441560 393924 373655 334230 331154 405944 471081 468152 429294
13708D29294m6406m6825l5606j1897l217O7112K6684m484L4634j1840k7569m268
13696C65612J3118k8996n8814k6730N0233K4740k0050o411J6284J4644l384k0591
13684C19655q475l6793L4414l0112L7064J5116q9827P632l392l3736O6802m501
13672B73847K1592N514l6553j0415J7328q848k4098N9958P218o0699j1191J2261
13660B45914Q3834L6004m0289n4311m0055j7788j159k5248j1364j724L3078K756
13648B09648K0472J4433j6494p57j397L0733L27m2458j3519N9662L4086j0705
13636B84031j9962q630k9303L7629K0493j7089k1972L2860J4190L0991m5355j9755
13624B58128M8979l640o0276M017Q839N471J8477j6548R020M0723m946l049J9964
$$ plain form
13708 429294 382888 336063 300457 288560 285343 352455 379139 374655 409289 397449 369880 365612
13696 365612 378730 349734 290920 264190 314423 339163 319113 312702 328986 343630 340246 319655
13684 319655 311180 274387 308801 278689 315753 330869 241042 248674 245282 211546 278348 273847
13672 273847 295439 300953 264400 253985 271313 262465 238367 298325 305543 244844 233653 245914
13660 245914 329748 365752 325463 271152 231097 213309 212150 186902 175538 173814 206892 209648
13648 209648 230120 244553 228059 227302 225905 256638 256965 214507 200988 260650 294736 284031
13636 284031 264069 255439 226136 263765 284258 267169 245197 278057 292247 323238 277883 258128
13624 258128 307107 303467 243191 247208 256047 261518 279995 263447 272467 313190 308244 305195 325159
13611C25159r446m2874k7968j0269M7755M7228K6743k5514m0977K34J3261o3832
13599B39500k0423m6647k6369J532q701R171M5578K5698k7278k7658O5281M4143
13587B73827j6873m5727l7029k7807L8884L2585k3279K3072l2559K4974N5885
13576B65953m9729r067L4842m4370l5186N5298J8377n047j4154n2294j5047N4768
13564B04344L1783m3325o1604k531k7109l9476l4103K3699L1311N5846K644J7023
13552A58502m4221L8270m5430k6062K3140M7419k4693j8338O5022N2431k257o3230
13540A60553l8815J1708J4405J9032J707j8327j805K0928l8356o8869j0863L2757
13528H4055J787M1553j6078k8979j3423K2941J9868K3406L8706l514k3521k5701
$$ plain form
13611 325159 315713 272839 244871 234602 282357 329585 356328 330814 289837 290071 303332 239500
13599 239500 219077 172430 146061 147593 138892 148063 193641 219339 192061 164403 229684 273827
13587 273827 256954 211227 174198 146391 185275 217860 194581 217653 185094 210068 265953
13576 265953 216224 207157 241999 197629 162443 217741 236118 231071 216917 164623 149576 204344
13564 204344 236127 192802 131198 128667 101558 62082 27979 51678 82989 138835 141479 158502
13552 158502 114281 152551 107121 81059 104199 151618 126925 108587 173609 226040 223783 160553
13540 160553 121738 133446 147851 166883 168590 150263 148458 169386 131030 62161 51298 84055
13528 84055 85842 127395 111317 82338 68915 91856 111724 135130 173836 170322 146801 121100
13516A21100r222R6368J3160q9981k9002K5187J9497j1108l8614J918n105M3675
13504A37873J9871m0854q347K6110L8356M6149j5360n905l2172l8712J1860J583
13492A40452l0220J7113k4410k8876M615M2783J7642k4712J2730r052k0122J1373
13480A09316J9189K4046j6938j6993k7991J479L7800r317j1723J2104N8956k1357
13468A58571N524L1666k5385l5446L670m258l6524R276L6071j0117K0866L4439
13456A88353j7933J9371J4053j2651L9580p861q0524r095J2233m5250j5491O2809
13444A47594J5274j780N748m1862J2539N0631j9301m2287m1981o7317m7350M5973
13432A5881R1211N5192p103r5247P676Q9866J7596l2489l3187k5239J4447o388
$$ plain form
13516 121100 111878 208246 221406 131425 102423 127610 147107 135999 97385 99303 94198 137873
13504 137873 157744 116890 108543 134653 173009 219158 203798 197893 165721 127009 138869 140452
13492 140452 110232 127345 102935 74059 78674 121457 139099 114387 127117 118065 97943 109316
13480 109316 128505 152551 135613 118620 90629 92108 129908 120591 108868 120972 179928 158571
13468 158571 164095 195761 170376 134930 138600 134342 97818 107094 143165 133048 153914 188353
13456 188353 170420 189791 203844 191193 230773 222912 142388 133293 145526 100276 84785 147594
13444 147594 162868 161088 166836 124974 137513 188144 168843 126556 84575 17258 -30092 15881
13432 15881 107092 162284 155181 59934 67610 157476 175072 142583 109396 84157 98604 92216
13420I2216N085N2398j8362q145m6346p388j1469J8095M2684L8359J8278r755
13408A65650l4421m0132k4497q063k3963j7071L0863J4039j3011J344k2752K2233
13396E0219J9364n0250K2869j8133J2223J7089J2050M0889K8231Q671o8458n3546
13384B1218Q156K0349k6661k7340k6025M1007L8549K7323k188J7072P569K9512
13372A28541k0852L4016l0652j1549M7441j3361p2043k5299k2325N81j4911K0321
13360A9908M5044J1817P27p53J6303n8340j3081N4571K960K0608M3160r994l6605
13347I6325K0296L1690L1794j4552m6551j8159J8515K7253K2592l0394p2834m8027
13335A7948J8566Q689L6886J201K98J7917k019m1257K1954o617j8600k8132j3726
$$ plain form
13420 92216 97301 149699 131337 123192 76846 69458 57989 76084 118768 157127 175405 165650
13408 165650 131229 91097 66600 58537 34574 17503 48366 62405 49394 50738 27986 50219
13396 50219 69583 19333 42202 24069 36292 53381 65431 106320 134551 143222 74764 21218
13384 21218 29374 49723 23062 -4278 -30303 10704 49253 76576 74388 91460 99029 128541
13372 128541 107689 141705 111053 99504 146945 133584 61541 36242 13917 14498 -413 19908
13360 19908 64952 76769 77496 76743 93046 34706 21625 76196 79156 99764 142924 132930 96325
13347 96325 116621 148311 180105 165553 119002 100843 119358 146611 169203 138809 65975 17948
13335 17948 36514 45203 82089 83290 83588 101505 99486 58229 80183 73566 54966 26834 13108
13322A3108L5223P908L0992J3134m806L697nl0027J7010O346q951K9333P356l1631
13308H8687k0350j1682k213J7722o439Q505k304K737j1902J0107k0348J7115M2455
13295A12090k427l364M185l636R743r615j1502j6147o2592k6689O4354P5747j9880
13282A10267k6834l4713J9968J3748R191l207j7194o170N0518m1884n7423N753
13270B2020j469J8454N3074K8745q280l5484j2765O5461K1088o7315K292j270
13258H4551O259j9090l6486J4531m3634j5263l5510L3147Q955R282J9918K0950
13246D7610K1635J0306L7557n591p058q103l035L5220j6907o0300J0266N8904
13234A20504K3348o293n9017l7843j5747l3980J5863M0562J1371M5392J7947q473
$$ plain form
13322 13108 48331 56239 87231 100365 95559 99256 99251 69224 86234 92580 83629 112962 120318 88687
13308 88687 68337 56655 54442 72164 65725 74230 71926 74663 62761 72868 52520 69635 112090
13295 112090 109663 106299 110484 106848 116591 106976 95474 79327 16735 -9954 54400 130147 110267
13282 110267 83433 48720 68688 82436 91627 88420 71226 65056 115574 73690 16267 22020
13270 22020 20551 39005 92079 120824 112544 77060 64295 129756 150844 83529 85821 84551
13258 84551 90810 71720 35234 49765 6131 -9132 -44642 -11495 -2540 6742 26660 47610
13246 47610 69245 79551 117108 111517 104459 96356 93321 128541 111634 51334 61600 120504
13234 120504 143852 137559 78542 40699 24952 -9028 6835 47397 58768 104160 122107 113634
13222A13634K3541N124l2357j3339l3862o0890R039N7797J4666q197J1771K3699
13210A10626J5915Q622m800J0234L4800J3404m6486q491J3048l0646m3728J1012
13198H3510J3885L8837O755k5056k3317l2099m8064J2534N2700L3865J0162r973
13186A13739M760K377j5622J3845l0344p0243n0074J7272O197P432R187L4431
13174D2957L1794J021N0265k4399l7559k9428N291K3738L0896L1777L0805M3044
13162B00202J8317L5079K1024r491k3085m1086n4251j8933n4727J8275L5605l0782
13150I6147J2814K682j5162k7458k5516J5677q58M216M7716R046o602J1995l1126
13137I3571J2706K1159J7460O929m7524l4493K4579K8905n133r649J5519J3606
$$ plain form
13222 113634 137175 142299 109942 96603 62741 1851 10890 68687 83353 75156 86927 110626
13210 110626 126541 135163 130363 140597 175397 188801 142315 133824 146872 116226 72498 83510
13198 83510 97395 136232 142987 117931 94614 62515 14451 26985 79685 113550 123712 113739
13186 113739 118499 120876 105254 119099 88755 18512 -31562 -14290 -8093 -661 8526 42957
13174 42957 74751 75772 126037 101638 64079 34651 39942 63680 94576 126353 157158 200202
13162 200202 218519 253598 274622 265131 242046 200960 146709 127776 73049 91324 126929 96147
13150 96147 108961 111643 96481 69023 43507 59184 58326 62542 110258 119304 112702 124697 93571
13137 93571 106277 127436 144896 151825 104301 69808 94387 123292 118159 108510 124029 137635
13125A37635l9081l119k8142K8518J4759m7643P812O6673J9949O6863n769J0732
13113B29187j4803p345m9867l3834m5393J900L14p30Q911J5065l1087R585l6824
13100D5079k1787K714J0164K1161L6157L0777q684k8418n2196l1507N179L0231
13088C8870K89k359R945P082j9164l4234M4379M2162M0740L919P166k7601k7692
13075H3502j7766K5895N9383N6502j6898J0255k0984l4758k0251J5920p9059m6757
13063A4984k1931j8503K0091N9899N8624N8373J2150j2212j4265n5429k4434o2729
13051A4618n695M0672R519L2900l2917l078J9722k2122n2199j5859K3665K3835
13039C3061Q399M229m7797n0166J4405O2111K0329j953J5117m4588K9402L6356
$$ plain form
13125 137635 98554 95435 67293 95811 110570 62927 70739 137412 157361 224224 218455 229187
13113 229187 214384 207039 157172 123338 77945 79845 80159 79429 88340 103405 72318 81903 45079
13100 45079 23292 26006 36170 57331 93488 124265 115581 87163 34967 3460 8639 38870
13088 38870 39159 36800 46745 53827 34663 429 44808 86970 127710 131629 138795 111194 83502
13075 83502 65736 91631 151014 207516 190618 200873 179889 145131 124880 140800 61741 14984
13063 14984 -6947 -25450 -5359 54540 113164 171537 183687 171475 157210 101781 77347 14618
13051 14618 8923 49595 59114 92014 59097 56019 75741 53619 1420 -14439 9226 33061
13039 33061 41460 45689 -2108 -52274 -37869 24242 44571 42618 57735 13147 42549 78905
13027G8905K8275k4278Q919j2476l6342M448N212j2028J4283m517R096j852j2647
13014D4998k865j0174j5164L9710R204o917J475J162K0108M4457R931k2493J8154
13001A31586O265q0884q626k6904K8338K905k2166J5018k3517J7459r190M5067
12989G5351J4517J7390k4322l1799L2875P904l5519q1588m764K1157K3211Q1961
12977I6374L3124J4718k5111k9961m3006p780L836o3429K2765M4648L0234k434
12965G3978r531m2157j3821K0277K1950n302J1948O1771O148o8723J6682K8058
12953A01278K1135L7563J3657j4267m0047o2888L7582N5622p60l2220r334k0384
12941H6937j0027M0282p897j9578J5873M3030J3938m6592j0602L8965N3240L2267
$$ plain form
13027 78905 107180 82902 91821 79345 43003 47451 52663 40635 54918 50401 59497 57645 44998
13014 44998 42133 31959 16795 56505 65709 58792 60267 61429 81537 125994 135925 113432 131586
13001 131586 137851 56967 48341 21437 49775 52680 30514 45532 22015 39474 30284 75351
12989 75351 89868 107258 82936 51137 84012 91916 56397 -25191 -29955 -8798 14413 96374
12977 96374 129498 144216 119105 89144 46138 38358 42194 -21235 1530 46178 76412 73978
12965 73978 64447 22290 8469 28746 50696 45394 57342 119113 125261 56538 73220 101278
12953 101278 122413 159976 173633 159366 119319 56431 94013 149635 148875 116655 107321 86937
12941 86937 76910 117192 109295 89717 105590 148620 162558 115966 105364 144329 197569 229836
12929B29836K7029O8959P9345P6742R6209P5343K8498M7911P6720Q9035M3479
12918I39106N7628p4464p0002m0112n1958p2059p2054o0552N615n6287j7299L8587
12906E26149R612K9427N290j3900q787M8684N6409N0555N8692M6614O9738K7189
12894I05672N0155N7959K7875M7455Q0253O2481K5829R45n5807p2437q9639o4240
12882I76501n1013n7433r3871p2017m7390m2249j5104Q807k0673k8106k2148j5773
12870E19531M3640K0160m1139L8177O7900P854R0604R9809O5111N2092N7349l4765
12858I86323r552n2199l7765m3140j52424j20043o2253m2347l5554j8237k6400
12847C86409L762k3426K3951L502k078n6947q1756l7038R392L8548l893j376k3381
$$ plain form
12929 229836 256865 325824 405169 481911 578120 653463 681961 729872 806592 895627 939106
12918 939106 996734 922270 852268 812156 760198 688139 616085 555533 561148 504861 487562 526149
12906 526149 535761 565188 570478 556578 547791 596475 652884 703439 762131 808745 878483 905672
12894 905672 955827 1013786 1041661 1089116 1169369 1231850 1257679 1258624 1202817 1130380 1040741 976501
12882 976501 925488 868055 774184 702167 654777 612528 597424 606231 585558 557452 535304 519531
12870 519531 563171 583331 542192 580369 648269 656123 746727 846536 911647 963739 1021088 986323
12858 986323 976771 924572 886807 843667 691243 571200 508947 466600 431046 412809 386409
12847 386409 390171 366745 390696 394198 392120 335173 253417 216379 225771 264319 260426 259050 235669
12834B35669m2248m4914L0890k5712j3272M2097l822j2974J2450M4204K3908j3542
12822B32734k3187K2869k4449m2585K3585K635l9045R619n0876l0248L1450P2610
12810A85112J4286m3145J0816O15k1101k3160L482n119o302P3308J1641k5372
12798A75061r440k1603o5896j8266L9770J5727r214m979K7124O428q819N083k1110
12785A09866J4560j5576J6383K1345L3615l7539j3738l3138L8756P8072L9279
12774B51885k2392k2138L6568k6748k0687K1871o0230m1633l5761L3188O7006
12763A80929m694n3143L1962O170n2910L6433L7169J4565o3271j9768J3210N6561
12751A83213j9857q714J650j3060k4808j5935N2703M9832R469n3162O9945K4600
$$ plain form
12834 235669 193421 148507 179397 153685 140413 182510 178688 165714 178164 222368 246276 232734
12822 232734 209547 232416 207967 165382 188967 191602 152557 162176 111300 81052 112502 185112
12810 185112 199398 156253 167069 167684 146583 123423 126905 121786 115484 188792 200433 175061
12798 175061 165621 144018 78122 59856 99626 115353 106139 101160 128284 134712 125893 130976 109866
12785 109866 124426 108850 125233 146578 180193 142654 128916 95778 134534 212606 251885
12774 251885 229493 207355 243923 217175 196488 218359 158129 116496 80735 113923 180929
12763 180929 176235 123092 155054 161224 108314 144747 181916 196481 133210 113442 126652 183213
12751 183213 163356 154642 156292 143232 118424 102489 155192 205024 214493 161331 231276 255876
12739B55876K92j8749n2263l2804k1728N6813J1283p123j4003J9463N3504J868
12727B52429J3741N9449J0232J5305K6384J7799n0404j1114J072l7779l3388M4408
12715C08134L5751j9362l1532m425j9279M795J1491l8671P409J1278M171J6512
12703B86272K121l0695K9562N9728M9992K408k0058j6363k3009k8024k2557k9008
12691B60369l10M6844O7999l9191o840m8959j1287L3254K1245J0800N3799j2948
12679C74775l1656m7504l4771l4680j1478q260N0784R765L6079L8331N2062L2387
12667D25834k8762k330Q1923Q4220q063m2294l4615N7403P9903o610p5469R079
12655E40219K5954n5374j5632K7151R48n7294Q463L5241k9559k5089k8745j5465
$$ plain form
12739 255876 256168 237419 185156 152352 130624 187437 198720 191597 177594 197057 250561 252429
12727 252429 266170 325619 335851 351156 377540 395339 344935 333821 334893 297114 263726 308134
12715 308134 343885 324523 292991 288566 269287 274082 285573 246902 254311 265589 269760 286272
12703 286272 288393 257698 287260 346988 396980 399388 379330 362967 339958 311934 289377 260369
12691 260369 260059 306903 374902 335711 328871 279912 268625 301879 323124 333924 387723 374775
12679 374775 343119 295615 260844 226164 214686 206426 257210 266975 303054 341385 393447 425834
12667 425834 397072 394742 476665 560885 552822 510528 475913 533316 613219 606609 531140 540219
12655 540219 566173 510799 495167 522318 523266 465972 474435 509676 480117 455028 426283 410818
12643D10818J3311N0348J8346J6550N4644K2470J437Q112n3971N1918N1243K5259
12631F70485K6473m471O2333Q8420N4346L3863j6350m5855M6273K0082r882m4120
12619H81597l4482o4228k4316k5552k9610N5655P7491L2561O022j9200k0373J9421
12607H54986M0877q94J1275Q2952Q1655O5678N6043K7231M9976K3758K3867R6748
12595A414152J19628P4719Q8342J50373J83155J93718K65499K49149J86645J23408
12585C048788J1688j23066j87036k08188j95392k78229k85519j51986o5951p8464
12575A486645q1201o0888K0231M2343R650l595l3654k2319k1878J7558j0858l534
12563A338500k7754k9058J5670M7157J1568m5048l4651L5486M5126J268L18l017
$$ plain form
12643 410818 424129 474477 492823 509373 564017 586487 587924 596036 542065 593983 645226 670485
12631 670485 696958 692487 754820 843240 897586 931449 915099 869244 915517 935599 925717 881597
12619 881597 847115 782887 758571 733019 703409 759064 836555 869116 875138 855938 835565 854986
12607 854986 895863 894969 906244 989196 1070851 1136529 1192572 1219803 1269779 1293537 1317404 1414152
12595 1414152 1533780 1608499 1696841 1847214 2030369 2224087 2489586 2738735 2925380 3048788
12585 3048788 3060476 2937410 2750374 2542186 2346794 2068565 1783046 1631060 1565109 1486645
12575 1486645 1405444 1344556 1364787 1407130 1416780 1413185 1379531 1357212 1335334 1352892 1342034 1338500
12563 1338500 1310746 1281688 1297358 1344515 1356083 1311035 1276384 1311870 1356996 1358264 1358582 1355565
12551A355565j5292O753P3261M7302O903J693n660J7185N5152L4653N8509O0967
12539A696991m862J3973P791K2149K2172L7043o64L7768L505O1975R0368Q0140
12527B068349O0572O0158P8102O6545M6992R1222L8634P6729J12302Q3420R2433
12516B875458J04560J18735J39017P2741O0540J39014J27225P4050J14555J48901
12506C974796J92765K16783K36826K49442L34969L34839K95651L12312L12620
12497F461003L81456M16159M65934N61537O84040P64522Q95949J007709J071595
12488A2709904J177691J423146J663977J848356K186479K517446L043196L766687
12480C0336882M665409N838017P356857R337615J1693426J4449077J7341367J9838611
$$ plain form
12551 1355565 1340273 1347026 1420287 1467589 1474492 1476185 1470525 1487710 1542862 1577515 1636024 1696991
12539 1696991 1692129 1706102 1713893 1736042 1758214 1795257 1794593 1832361 1835866 1897841 1988209 2068349
12527 2068349 2128921 2189079 2267181 2333726 2380718 2471940 2510574 2587303 2699605 2783025 2875458
12516 2875458 2980018 3098753 3237770 3310511 3371051 3510065 3637290 3711340 3825895 3974796
12506 3974796 4167561 4384344 4621170 4870612 5205581 5540420 5836071 6148383 6461003
12497 6461003 6842459 7258618 7724552 8286089 8970129 9734651 10630600 11638309 12709904
12488 12709904 13887595 15310741 16974718 18823074 21009553 23526999 26570195 30336882
12480 30336882 35002291 40840308 48197165 57534780 69228206 83677283 101018650 120857261
12472A20857261K0721915J8550173J2653087L598068o101781j3411232j6819444
12465A40048047j6746218j4734130j1854164q913896o222497l950024k006205
12458G5620913l14849J121830K550078L853827M983836O065529P089743Q165049
12450A09135956R182261J0140343J1103287J1873930J2397144J2383637J1708481
12443A87925039J0262776Q066250N227318J909974j482066m712678p491484r595876
12435A90109253j1006166j1690889j1767615j1402720j0660249r751230q773335
12428A15057049p847863o900437n936773m945441l876136k776086j532138p4948
12420H1167227J383634L150528N249317P626959J0187625J2632087J4466952J4989638
$$ plain form
12472 120857261 141579176 160129349 172782436 176380504 170278723 156867491 140048047
12465 140048047 123301829 108567699 96713535 87799639 81577142 77627118 75620913
12458 75620913 75306064 76427894 78977972 82831799 87815635 93881164 100970907 109135956
12450 109135956 118318217 128458560 139561847 151435777 163832921 176216558 187925039
12443 187925039 198187815 206254065 211481383 213391357 211909291 207196613 199705129 190109253
12435 190109253 179103087 167412198 155644583 144241863 133581614 123830384 115057049
12428 115057049 107209186 100308749 94371976 89426535 85550399 82774313 81242175 81167227
12420 81167227 82550861 85701389 90950706 98577665 108765290 121397377 135864329 150853967
12412A50853967J3204929Q585271J624027o296086j3043090j7172275j8295680
12405A19461063j7358218j5305513j2914985j0668709q688552p090231n799907
12398D1634948m758089l932455l352704k865599k500734k136589j889177j703265
12390A8496336j448271j313148j196557j071917r14038q25316p57905o48539o32787
12381I687858n80138n39712m92113m75900m08682l81980l52056l12967k66607
12372E877703k54064k40720j99218k21967k02973j36158j42363j17899j09329
12363D253012r8372q1615L4129p093k2272J7137o3811j15471j48196j69315j03705
12352C494428j49185j68710j41080j34371n0563p3567m7384m9015q3962p2368
$$ plain form
12412 150853967 164058896 172644167 174268194 167972108 154929018 137756743 119461063
12405 119461063 102102845 86797332 73882347 63213638 54525086 47434855 41634948
12398 41634948 36876859 32944404 29591700 26726101 24225367 22088778 20199601 18496336
12390 18496336 17048065 15734917 14538360 13466443 12552405 11727089 10969184 10320645 9687858
12381 9687858 9107720 8568008 8075895 7599995 7191313 6809333 6457277 6144310 5877703
12372 5877703 5623639 5382919 5183701 4961734 4758761 4622603 4480240 4362341 4253012
12363 4253012 4154640 4073025 4107154 4100061 4077789 4094926 4031115 3915644 3767448 3598133 3494428
12352 3494428 3345243 3176533 3035453 2901082 2850519 2776952 2729568 2680553 2596591 2524223
12342B524223o6151k5859j05709j22850n2129J4744j6912m813n9279r5893n7120
12331A932252K1293j3406l8117o4889J2877k6791o1104k4697j9366l8613n6363
12320A623076J5035m2034n9414R851j4584K1164k9074m2557o4739l5567j3256
12309A367901m3737j1933k1825o00m6343n3557l5700m5741K0437r008R286j5623
12297A113557K0876M5610K6839l4485j7031o0235m2506m2621p6788p4704j8239
12286H40273j5143l3950m8668l6499J256K5320j0301L6557k4976Q535n137j0191
12274G27076N062l584K5516k1961K2362M40j7721n5653p2496k8281j156K0095
12262E99699J014k8136J3725M856n7088r4585q2530m827k464k1803J8178j2093
$$ plain form
12342 2524223 2458072 2432213 2326504 2203654 2151525 2166269 2149357 2144544 2085265 1989372 1932252
12331 1932252 1953545 1940139 1902022 1837133 1850010 1823219 1762115 1737418 1718052 1679439 1623076
12320 1623076 1638111 1596077 1536663 1546514 1531930 1553094 1524020 1481463 1416724 1381157 1367901
12309 1367901 1324164 1312231 1290406 1289806 1243463 1189906 1154206 1108465 1128902 1119894 1129180 1113557
12297 1113557 1134433 1180043 1206882 1172397 1155366 1095131 1052625 1010004 933216 858512 840273
12286 840273 825130 791180 742512 706013 707269 732589 722288 758845 733869 742404 737267 727076
12274 727076 732138 728554 754070 732109 754471 754911 737190 681537 609041 580760 579604 599699
12262 599699 600713 572577 586302 591158 534070 439485 356955 352128 349664 327861 346039 333946
12250C33946M4521L0015P6840P1675R2053N7597K2423P5217L2434K0365O6572
12239I23658K4638O1716P7168m8630q6494l1140N5476N3502J8440r596L5361m2236
12227A031863M768J0788L4150k8388J1271K2759J39191N4173O0457P5751R3751
12216A510534Q9932Q2177N3139L0581J6131M4111Q2676J02596P2123J10243J46414
12205B340657K22250J56713J85852K41172K42430K06690K43347K73579L04287
12196D416977M40724N36709N72163P04186Q23308J023089J382759J771474K197380
12187A3868769K582913K899808L074183L046967L017892L297487L786296M764925
12179D0339240O652303J0015010J5630512K4237724L5639039M7589963N6376530
$$ plain form
12250 333946 378467 408482 485322 556997 649050 706647 729070 804287 836721 857086 923658
12239 923658 948296 1010012 1087180 1038550 952056 920916 976392 1029894 1048334 1038738 1074099 1031863
12227 1031863 1036631 1047419 1081569 1053181 1064452 1087211 1226402 1280575 1341032 1416783 1510534
12216 1510534 1600466 1682643 1735782 1766363 1782494 1826605 1909281 2011877 2084000 2194243 2340657
12205 2340657 2562907 2719620 2905472 3146644 3389074 3595764 3839111 4112690 4416977
12196 4416977 4857701 5394410 5966573 6670759 7494067 8517156 9899915 11671389 13868769
12187 13868769 16451682 19351490 22425673 25472640 28490532 31788019 35574315 40339240
12179 40339240 46991543 57006553 72637065 96874789 132513828 180103791 236480321
12172B36480321N8597981N3166908L9993399K1447317Q00767j9126309l7289228
12165C54071156n1191624n7724743n6077720m8019865l6197515k4367333j5601261
12158F4891095j0022944o669740m758136l723709l303205l184489l306300l449289
12150B6473283l402677l174396k766228k168757j698918j338655j111067r45638
12142I866947q58409p51871p08016o31258n09717n43077m83247m07453l35566
12133D638333k63631l09296k03153j52322k36612j98881j98687j96274j52445
12124B727032j21450j49147j15339j2906n3778j83401j27696j27129j21638k3742
12114A690806m750o689l7240n4821m4788o5951m8234q803j1105l0575o5853o3938
$$ plain form
12172 236480321 295078302 348245210 388238609 409685926 410486693 391360384 354071156
12165 354071156 302879532 245154789 189077069 141057204 104859689 80492356 64891095
12158 64891095 54868151 48198411 43440275 39716566 36413361 33228872 29922572 26473283
12150 26473283 23070606 19896210 17129982 14961225 13262307 11923652 10812585 9866947
12142 9866947 9008538 8256667 7548651 6917393 6407676 5864599 5381352 4973899 4638333
12133 4638333 4374702 4065406 3862253 3709931 3473319 3274438 3075751 2879477 2727032
12124 2727032 2605582 2456435 2341096 2328190 2274412 2091011 1963315 1836186 1714548 1690806
12114 1690806 1686056 1679367 1642127 1587306 1542518 1476567 1428333 1419530 1408425 1377850 1311997 1248059
12102A248059l2779l6160o8132q2773l4210k2832Q439l0089m048j4233j7071j5857
12090H98314j3468J2752j0087k1264R860K177J0670k9197n3044p6151m9151l2300
12078F49111r205l2568k68L116M2082k7025j0771K0721P176k8267j0391k1203
12066E82508k1376j5076P966j0884l2754m6317n3727L4953N6519J0637p5706k6993
12054D09750K3325j3469j9040R652O5386N999r4386j8236n663j5091L6557J888
12042C86672J3745L7345K8142j6140L2137L8545k7589O656p039n760l2641k7200
12030D26873p842K5044n0976k6116M72j4906Q680P8427K2688L2953J03994J20165
12018G19456N1768J03743M9683L0879J9030K1605o890p6323o6455o1101p5556
$$ plain form
12102 1248059 1215280 1179120 1110988 1028215 994005 971173 979612 949523 945475 931242 914171 898314
12090 898314 884846 897598 887511 866247 876107 878284 888954 859757 806713 730562 681411 649111
12078 649111 639906 607338 607070 610186 652268 625243 614472 635193 642369 614102 603711 582508
12066 582508 561132 546056 554022 543138 510384 464067 410340 445293 501812 512449 436743 409750
12054 409750 433075 419606 400566 410218 475604 481603 387217 368981 363318 348227 384784 386672
12042 386672 400417 437762 465904 449764 481901 520446 492857 499513 492474 486714 454073 426873
12030 426873 419031 444075 393099 366983 367455 352549 361229 439656 462344 495297 599291 719456
12018 719456 771224 874967 924650 955529 974559 996164 989274 912951 846496 785395 709839
12007G09839l1414m2061J910J3746J7981n6063n7592q998L1706K4178J179M7708
11995F52119N4752J3542K8213N1104L3989N3868L0410N6804L3287j8599q9484
11984I00005r4292q2127p9257o6772j8083K2644L7554N556K4363L3427L846K0460
11972G07324M7568l39j944n014j6903m4826K167K4601l0348q431O8008M9941O2473
11959H54277M9709K7267l355P6445J43236M1880n7892o4737j22036j17210j43625
11948F83959m0348n8547p7739R137J3340j1410O080K3806n881n8076l4530l6386
11936D13405m9510o4285l3323l957M293J100k1063j1137m792r627k3534L5026
11924B32596L1500J0126k6886l2873n0299j3227J8008J7352L2092j561l3019j3928
$$ plain form
12007 709839 678425 636364 638274 652020 670001 613938 556346 547348 579054 603232 604411 652119
11995 652119 706871 720413 748626 799730 833719 887587 917997 974801 1008088 989489 900005
11984 900005 805713 723586 644329 577557 559474 582118 619672 625228 649591 683018 686864 707324
11972 707324 754892 754553 752609 747595 730692 685866 688033 712634 682286 673855 741863 791804 854277
11959 854277 903986 931253 927898 1004343 1147579 1189459 1131567 1066830 944794 827584 683959
11948 683959 643611 585064 507325 516462 529802 518392 524472 548278 542397 484321 449791 413405
11936 413405 363895 299610 266287 262330 266623 267723 246660 235523 230731 221104 197570 232596
11924 232596 264096 274222 247336 214463 164164 150937 168945 186297 218389 216828 183809 169881
11912A69881k1371j5503k384L1868M4635n4724m4769L0966N0074k687j2239M3499
11900B17246J4495J4093j8210J8557j3922n5129J7322o382j301l5877k4511n950
11888A20431l7681J7815M494J7599j9783M2444J9246m3140l6990n3783o5458J0395
11876b4411M2566N4783O7002J9282q989K9513q221m442L4297K4417k3512J6794
11864B19079j19N14L644j7025n3828l4261r2205j8116K1952N6187K0202K7560
11852A33584m0531n266M281Q737k789K981j3297k5142J3623m0275l6141P358J9478
11839B6601J6892K3757q629L2806o41L6544L1635m0860k2656j9889L2874J4722
11827A23156J3654N6923P683j5732p3245j4053J4362j8919q759k3139L389k248
$$ plain form
11912 169881 148510 133007 130623 162491 207126 152402 107633 138599 188673 185986 173747 217246
11900 217246 231741 245834 227624 246181 232259 177130 194452 188070 186769 150892 126381 120431
11888 120431 82750 100565 105059 122658 102875 145319 164565 121425 84435 30652 -34806 -24411
11876 -24411 18155 72938 139940 159222 150233 179746 171525 167083 201380 225797 202285 219079
11864 219079 218960 219474 223118 206093 152265 118004 25799 7683 29635 85822 106024 133584
11852 133584 93053 87787 92068 100805 98016 100997 87700 62558 76181 35906 -235 7123 26601
11839 26601 43493 67250 58621 91427 90786 127330 158965 118105 95449 75560 108434 123156
11827 123156 136810 193733 201416 185684 112439 98386 112748 93829 85070 61931 65320 63072
11815F3072M5680M149l2821j1434j2944J2544m644k8875k5846O6759P8913L760
11803A58313l6946n2830m636j7355j0621N130K4341K4493L0168l5595k1190N629
11791F8901l9529p1833O6129O5389l438j353o368M6432l787R322j0563j6181k4090
11778G9031N175L9421K5768M3053k4710j0415L5108j4064j1768l0156o2970J5140
11766H8613L6099J8435K7146k3527l6558j8611K1980P8718K0169j1382L7206N1433
11754B89721P5733M9843J52940K46519L05128L07757L04669K03576J02618O5216
11744B103720r1240k06682k66447k12672k24163k26958k38704j67787q1540l1319
11734C56208j3985n975n6296l1185m0439m3691q384m6133n1906j4248N856j9851
$$ plain form
11815 63072 108752 112901 80080 68646 55702 68246 63602 34727 8881 75640 154553 158313
11803 158313 121367 68537 63901 46546 35925 41055 65396 89889 120057 84462 63272 68901
11791 68901 29372 -42461 23668 89057 85619 84266 77898 124330 120543 129865 119302 103121 79031
11778 79031 84206 123627 149395 192448 167738 157323 192431 178367 166599 136443 73473 88613
11766 88613 124712 143147 170293 146766 110208 91597 113577 192295 212464 201082 238288 289721
11754 289721 365454 415297 568237 814756 1119884 1427641 1732310 1935886 2038504 2103720
11744 2103720 2012480 1805798 1539351 1326679 1102516 875558 636854 469067 387527 356208
11734 356208 342223 336248 279952 248767 208328 164637 156253 110120 58214 43966 49822 29971
11722B9971K1089j1132K1424N466J59m187j8470k9376K5316K1114L257j3167O0951
11709A12415J8083k3210j8941K3755K4568J4946k2400J5592o0861m4017J05K3199
11697F3234k2483q809M6097J3192j3965p370K1876o267j5260K788M153m3711m0436
11684f961M0835O5337J0109l1661n768N263j1649J1787L6258j2941J2736L0366
11672A43711q241n1863k0150j9201j780N6322K0895j6740j1638k5079k8772J7753
11660E5217q38j5563L2047L0233J3304k68K5354j3249p8206J6498J7716p1542
11648A0703o699M4386Q688k2338Q947q731l4922j2554L3655O4504J6465K2945
11636A25049j1509n0341n0572L6011j8268o6763j6564J7669N9593K8178K994o883
$$ plain form
11722 29971 51060 39928 61352 66818 66977 62790 44320 14944 40260 61374 64631 51464 112415
11709 112415 130498 107288 88347 112102 136670 151616 129216 144808 83947 39930 40035 63234
11697 63234 40751 31942 78039 91231 77266 69896 91772 85505 70245 73033 77186 33475 -6961
11684 -6961 33874 99211 109320 77659 71891 77154 65505 77292 113550 100609 113345 143711
11672 143711 135470 83607 63457 44256 42476 98798 119693 102953 91315 66236 37464 55217
11660 55217 54379 38816 70863 101096 114400 114132 139486 126237 48031 64529 82245 10703
11648 10703 4004 48390 57078 34740 43687 34956 34 -12520 21135 85639 102104 125049
11636 125049 113540 63199 12627 48638 30370 -36393 -52957 -35288 24305 52483 55477 48594
11624D8594K7410j0524k191k120j331n908j6352n1791n724N9228J7728n4761m9023
11611d6765l0555O1018J2205j5885J8541M1659n2465P347M1845J3243j2864R630
11599D6954r299k1071j2317k1968O308N972J3595L0065k1027Q14K2651l82L6553
11586G6848O6456j1385m7202l856m363n453k0678m277k3189J1371L5873K7558
11574I7703k2984m2989j1176l636K7901k4285j429L2901L1593l5694m1142j4423
11562g660j0736M2545J3516J426K2554q8115m6244J5429L51O852M8254j9743K7205
11549E634M1676K575l6701J0033N310m6628j1201J6366K5285L2917l326N252k177
11536D5015P462j0485K236O388j3991K9845M907L561k1508J9544M260k5099l0000
$$ plain form
11624 48594 76004 65480 63289 61169 59838 53930 37578 -14213 -19937 39291 57019 2258 -46765
11611 -46765 -77320 -16302 -4097 -19982 -1441 40218 -12247 -4900 36945 50188 37324 46954
11599 46954 37655 16584 4267 -17701 -11393 -5421 8174 38239 17212 18026 40677 40295 76848
11586 76848 143304 131919 84717 80861 76498 71045 50367 46090 22901 34272 70145 97703
11574 97703 74719 31730 20554 16918 44819 20534 19105 52006 83599 47905 6763 -7660
11562 -7660 -18396 24149 37665 39091 61645 -26470 -72714 -57285 -56934 -50082 -1828 -21571 5634
11549 5634 47310 49885 13184 23217 28527 -18101 -29302 -12936 12349 45266 41940 47192 45015
11536 45015 52477 41992 44228 50616 36625 66470 71377 74938 53430 72974 77234 52135 22135
11523B2135k848j5919N296L2153K3541m1903k9583J1113J6113Q393l513L4456
11511E9434M8807n100j7873n3857m9757j3395K3059L7790N1343l4458n537r531
11499C0925m6871j685K4994L3172J7825j0820Q025M571j9636j6897K687N0576
11487G6866Q670j4238j1997P07l3749n8080o138M0812O9164o084n2967j0867p188
11474e089O2749m56l7913n109L4712L696l3552o4632o946P856J8740L7137L7218
11461D8411j846l0190l2779j3884M7958j8591m4170J2546K9736P199K0864J0274
11449C5528P552L6834n325J9215k1951m6515l0607k1031N1350R612j2759k4132
11437b229J7310K2072l9631J9064L9937K3756k4698m2896l1302K4488J5216K195
$$ plain form
11523 22135 19287 3368 8664 40817 64358 22455 -7128 3985 20098 28491 24978 59434
11511 59434 108241 103141 85268 31411 -18346 -31741 -8682 29108 80451 45993 40456 30925
11499 30925 -15946 -17631 7363 40535 58360 47540 55565 60136 40500 23603 26290 76866
11487 76866 85536 71298 59301 60008 26259 -31821 -37959 2853 72017 65933 12966 2099 -5089
11474 -5089 57660 57204 19291 14182 48894 52590 19038 -45594 -52540 -44684 -25944 11193 48411
11461 48411 46565 16375 -16404 -30288 17670 -921 -45091 -32545 -2809 4390 25254 35528
11449 35528 43080 79914 74589 93804 71853 25338 -5269 -26300 25050 34662 21903 -2229
11437 -2229 15081 37153 -2478 16586 56523 80279 55581 12685 -18617 5871 21087 23282
11425B3282K6895Q299r827l7335j4642r880o100p582M9684J9222N871J600n4380
11412d893j1807n398l0240K1638J4413r084j2304L1336K1884O442l8237K9706
11400A3456M389J7380L5928k7816m6872j6933L3465M5720n431n0365k6370L2873
11388I424J6270J3256k0523Q571O541l3762l5361J5460N6692N0269j8443R07l9115
11375C0186l9877K4173L4368m0606k3218J1712N8924l4005p29M5124l7371m673
11363B4008m273L2250j856k8849N914L8217K3580P786l4793L5809m3068J786J0683
11350F7194j3719j7037k4045J9317L0061R664j6115l9965k1829L0130j1613k1302
11338i259K8781M618l565K8240L0289J9716j9851k910m744k9383j4031p178J2119
$$ plain form
11425 23282 50177 58476 48649 11314 -3328 -13208 -19308 -26890 22794 42016 47887 49487 -4893
11412 -4893 -16700 -22098 -52338 -30700 -16287 -25371 -37675 -6339 15545 21987 -16250 13456
11400 13456 17845 35225 71153 43337 -3535 -20468 12997 58717 53286 2921 -23449 9424
11388 9424 25694 38950 18427 26998 33539 -223 -35584 -20124 36568 86837 68394 69301 30186
11375 30186 -9691 14482 48850 8244 -14974 -3262 55662 21657 20928 66052 28681 24008
11363 24008 19735 51985 50129 21280 27194 65411 88991 96777 61984 97793 54725 56511 67194
11350 67194 53475 36438 12393 31710 61771 71435 55320 15355 -6474 23656 12043 -9259
11338 -9259 19522 24140 20575 48815 79104 98820 78969 76059 71315 41932 27901 20723 32842
11325C2842K1145K1654L18K4704L381n8942R413M5139K6990j0241l5761k5768
11313E4874k0330o518M7734J7562l0464o1344N779K2663m882l2478K0809j2709
11301F96K109P426J95j0320Q465M7648O1527K5755n1785q5391k3788J4384K4813
11288B1734K4342P818J3000o7297q660J8916M8164k095p272l4735m3151k1596
11276e0832J5241K3718j7706P3244M5262j7613K562J2058J0104l7226k8559K0372
11264E0625p958k5932J6192P300l2137K7256L2038O283j1850J5758J0613j3446
11252G4742j3835J501m453j0735l6219J1401M4889p503l3255J8210J6298K917
11240F3958n7380k207j2431L2434J1943J5537K6858k0031o81k040J7257l3227
$$ plain form
11325 32842 53987 75641 75959 100663 104044 45102 54515 99654 126644 116403 80642 54874
11313 54874 34544 28026 75760 93322 62858 1514 7293 29956 25074 -7404 13405 696
11301 696 2805 10231 10426 106 8571 56219 117746 143501 91716 6325 -17463 -3079 21734
11288 21734 46076 53894 66894 -403 -9063 9853 58017 55922 48650 13915 -29236 -50832
11276 -50832 -35591 -11873 -29579 43665 88927 71314 73876 85934 96038 58812 30253 50625
11264 50625 42667 16735 32927 40227 8090 35346 67384 73667 61817 77575 88188 74742
11252 74742 60907 62408 57955 47220 11001 22402 67291 59788 26533 44743 61041 63958
11240 63958 6578 4371 -8060 24374 36317 51854 78712 58681 58000 55960 73217 39990
11228C9990j4370P0704o023j2882L7172k3141p0327Q195O9966K5409M685J1114
11216A40492j1846m8403l8634l4197J2156M314M36l1521K335Q407l649J2586M9985
11203F2461J8075k7268n545N5056J4966j1396l9844j2410n784R252L00M549n921
11190E6491k2120j9212J2598k528j9780j2263J8237K4960r340L0203J0129K3586
11178I0961J9407j1826J094O284p0792l1654Q274M9566J7788K0424j7040j5106
11166F7380o4065p273L1402L5288J8745K3225j3576m6686O305J3148l0534P47
11154C4106J5247J4468J2113m609q462j5640O7780j3694q627r25j0451K3641j0795
11141I4152K392n540j0606k971j1930j5343J7757l6068j9927L5405N5076J5219
$$ plain form
11228 39990 25620 96324 90301 77419 114591 91450 21123 29318 99284 124693 129378 140492
11216 140492 128646 80243 41609 7412 19568 23882 24318 -7203 -4868 3539 -110 12476 62461
11203 62461 80536 53268 47723 102779 117745 106349 66505 54095 48311 57563 57863 62412 56491
11190 56491 34371 15159 27757 25229 5449 -6814 11423 36383 27043 57246 67375 90961
11178 90961 110368 98542 99636 105920 35128 3474 11748 61314 79102 99526 82486 67380
11166 67380 3315 -3958 27444 62732 81477 104702 91126 44440 50745 63893 33359 34106
11154 34106 49353 63821 75934 71325 62863 47223 115003 101309 92682 91757 81306 104947 94152
11141 94152 96544 91004 80398 77427 65497 50154 67911 31843 11916 47321 102397 117616
11129A17616n3968L9230J5134m071k9743j2402j7038k0992J7532J8935m7574j8648
11117D011j6074J7069L2644l759K0628K6386k7270K7796J9498K9869P252l2427
11105A05623k1119o8724K4258L1704j5786q99K0339L6941k8151p5838N017N8149
11093G1514K0636l9802p0131J270q560K5041K9785L073k0278M1370k4005k3733
11081F180L735K732J4553j483L0173j8968k298j7224J097N3961j5654J2256N870
11068G4930k5839M772J7347j7140j8616J3213J9578j086j4653p62R695N0282m895
11055A06826k545j4888q0747m6572k1713K8248Q2800J5152l1377J8838M4856Q345
11043A07223m8503l4578N9330k0221p9752K4005O1265K4032R46L5013K4141k0381
$$ plain form
11129 117616 63648 102878 118012 113941 84198 71796 54758 33766 51298 70233 22659 4011
11117 4011 -12063 5006 37650 33891 54519 80905 53635 81431 100929 130798 138050 105623
11105 105623 84504 15780 40038 71742 55956 55057 75396 112337 84186 8348 13365 71514
11093 71514 92150 52348 -17783 -16513 -25073 -32 29753 32826 12548 53918 29913 6180
11081 6180 9915 12647 27200 25717 55890 36922 34624 17400 18497 72458 56804 69060 74930
11068 74930 49091 53863 71210 54070 35454 48667 68245 67159 52506 51744 61439 111721 106826
11055 106826 104281 89393 8646 -37926 -59639 -31391 51409 66561 35184 54022 98878 107223
11043 107223 58720 24142 83472 63251 -16501 7504 68769 92801 93747 128760 152901 132520
11031A32520p498j1585j1088m2057k9193J8925J23p786P562L047j8312q212L0500
11018E6946M2020M327j7917k8411n514O837M8808l316l1591k9303L0953l496j8537
11005E1806J867L3563l6610m9548L5331l2173m2195K2105O237Q2484K0766k2976
10993G0657k2663L0288K6396p4611k5262r320K5201K8656J101N0142j2571J2807
10981A00821k9642o706j4146J9420L404j386n226L8194J1160k0463j0373O034
10969I1091K1879L9835L5165l3765j8079j1960j7512o5570O4401M0463L736J9578
10957A69262K5673J4257R673l0650l9098L261J4022m940j0537k8999K9774Q795
10945A60493l155Q490k5303J6374n2941j3601L436j4029p26L9030K3384K8169
$$ plain form
11031 132520 125022 113437 102349 60292 31099 50024 50147 42361 49923 52970 34658 26446 56946
11018 56946 98966 103293 85376 56965 51451 58288 107096 103780 72189 42886 73839 70343 51806
11005 51806 53673 87236 50626 1078 36409 4236 -37959 -15854 -9617 72867 93633 70657
10993 70657 47994 78282 104678 30067 4805 -4515 20686 49342 50443 100585 88014 100821
10981 100821 71179 64473 50327 69747 73151 71765 66539 104733 115893 95430 85057 91091
10969 91091 112970 152805 187970 154205 136126 124166 106654 41084 105485 145948 149684 169262
10957 169262 194935 209192 218865 188215 149117 152378 166400 161460 150923 121924 151698 160493
10945 160493 157338 165828 140525 156899 103958 90357 93793 79764 79038 118068 141452 169621
10933A69621L334k9768J8301R1498k2299p1336J0018k9411M5735N1605k0482o5971
10921A50845J9392J4667j2309j0043K5185J5107K0526M6339n2630m1841N7985
10910B33223O1303q682j9034K1472M3088L1945L0293L1400N0099j3712L6417P2234
10898E70046R7841M0828R572J6120K7396J616m3064m7171j825M4092L3973J0638
10886G60062l0202l4775Q621M7945J1815n0538j0352K5769l927K5230K0794Q106
10874G78548Q834Q764K5988J5783M7326J3297K2672j9710p227O3702O2747K3467
10862A044191l8836r1167K5099l5997l6791J7434j1327n6359j1057N107M9921
10851H60218l3062o0170l540l3774M1K3533j211J0009l6045r782J180N5344J75
$$ plain form
10933 169621 172955 143187 161488 252986 230687 159351 169369 139958 185693 237298 216816 150845
10921 150845 170237 184904 172595 162552 187737 202844 223370 269709 217079 175238 233223
10910 233223 294526 285844 266810 288282 331370 363315 393608 425008 475107 461395 497812 570046
10898 570046 667887 708715 718287 734407 761803 763419 720355 673184 671359 715451 749424 760062
10886 760062 729860 695085 703706 751651 763466 712928 702576 728345 724418 749648 770442 778548
10874 778548 787382 796146 822134 837917 885243 898540 921212 901502 894275 957977 1020724 1044191
10862 1044191 1005355 914188 939287 903290 866499 883933 872606 816247 805190 810297 860218
10851 860218 827156 766986 763446 729672 729713 753246 752035 762044 725999 716217 717397 772741 772916
10838G72916q853m9417K7652M1408k2999j172j1026r8477l2766m990n522n5244
10826E51510p5431l9329k0908k3983M982J8759k8747j3308k6545j6354j9967P170
10814C17849L9032J6501o733n0874l466K7347K1985k7676r669q687j1382l8044
10802B66183o6992J388J4291k8037l302O9157l0422m6474J2198J2122j062k6800
10790A72250N14Q7638L2746K439j0456j4503r167k9225k2964k9241J8619N301
10778B03951L3422J2152M9181M316k9908m2360J4641M5363k3500n3662J3705L4982
10766B62283L010n580N5093J730J1361k4651L7165J9490p538k3335K8100m4281
10754C12847k6310M312l5161k8798J3812k1848K9283M7524k4929o4504M4892J8424
$$ plain form
10838 772916 764063 714646 742298 783706 760707 759535 748509 650032 617266 612276 606754 551510
10826 551510 476079 436750 415842 391859 396841 415600 386853 373545 347000 330646 310679 317849
10814 317849 356881 373382 366649 315775 312309 339656 361641 333965 324296 315609 304227 266183
10802 266183 199191 200579 214870 186833 183531 252688 222266 175792 187990 200112 199050 172250
10790 172250 172764 260402 293148 295587 285131 270628 261461 232236 209272 180031 198650 203951
10778 203951 237373 249525 298706 303022 273114 230754 245395 290758 267258 213596 227301 262283
10766 262283 265293 259713 314806 316536 327897 303246 340411 359901 352363 329028 357128 312847
10754 312847 286537 290849 255688 226890 240702 218854 248137 295661 270732 206228 251120 269544
10742B69544j6527j0787P0648M4271J4300M3347n678L753L812J1225K2710j6213
10730D34405j2455J4633j4960J3904K9535m5084j3069L9722K4873L50j9929O414
10718D58339K2694J7826m767l7892J6730L41m4321P420L3873O0843M6651M10q099
10705E70048J9662o2892n0400J876K1674J6757o574N8395K8549m8968l2691K1036
10693E36472k1578L2461N7551P173l0568O8322q485n4713J9836j3863n197N078
10681E92489k3229J3757M8440j6201J7902J1903n074J0699j4092K2288O8449P5408
10669H02739L6076l081k7155m1559j5445o30O571K6869M8147m729m0619j8651
10657G68533j0116j0810J8961J4014J9123O157L5282K7468K1199k0565q890N488
$$ plain form
10742 269544 253017 242230 312878 357149 371449 414796 409118 412871 416683 427908 450618 434405
10730 434405 421950 436583 421623 435527 465062 419978 406909 446631 471504 471854 451925 458339
10718 458339 481033 498859 494092 456200 472930 473271 428950 436370 470243 531086 577737 578147 570048
10705 570048 589710 526818 476418 478294 499968 516725 510151 568546 597095 548127 515436 536472
10693 536472 514894 547355 604906 612079 581511 649833 641348 586635 606471 592608 587411 592489
10681 592489 569260 583017 631457 615256 633158 645061 639987 650686 636594 658882 727331 802739
10669 802739 838815 835734 808579 767020 751575 750945 757516 784385 832532 827803 787184 768533
10657 768533 758417 747607 766568 780582 799705 805862 841144 868612 889811 869246 860356 865844
10645H65844M0235N5243p088J0766M5078J8996K8750L2555L3433o8260l9480Q3963
10633A100035O1087K9343K5204l5130j315J9808j1435q4029o918K1636K5142J11801
10621A255229L9839j3734k2489k7047L0574K6082M365K7220O7215R9504K8734
10610A515492j4043l0907N4001L9909l3679K2343M0309N0746J2018p969K2229
10599A670449k2232O3786P0643N073n0477O922K7899L1354K5180K1414J2080l4821
10587A827270K5205L5115m565j7301L0990L2967J1637j1116m651L1604K5829N4005
10575B036989O0711j1120N337L4222K6500M2052N038K1747J1247N921L669O5300
10563B307613L9106M2710P2621M6101O3727P0291L3578m8383L8208R2959M2133
$$ plain form
10645 865844 906079 961322 954234 965000 1010078 1029074 1057824 1090379 1123812 1055552 1016072 1100035
10633 1100035 1161122 1190465 1215669 1180539 1179224 1199032 1187597 1103568 1096650 1118286 1143428 1255229
10621 1255229 1295068 1281334 1258845 1231798 1262372 1288454 1292819 1320039 1387254 1486758 1515492
10610 1515492 1501449 1470542 1524543 1564452 1530773 1553116 1593425 1644171 1656189 1648220 1670449
10599 1670449 1648217 1712003 1782646 1787719 1737242 1744164 1772063 1803417 1828597 1850011 1862091 1827270
10587 1827270 1852475 1887590 1883025 1865724 1896714 1929681 1941318 1930202 1925551 1957155 1982984 2036989
10575 2036989 2097700 2086580 2091917 2126139 2152639 2194691 2199729 2221476 2232723 2238644 2242313 2307613
10563 2307613 2346719 2389429 2462050 2508151 2571878 2642169 2675747 2627364 2665572 2758531 2800664
10552B800664M917L9481O0167P5154N4773L3918M9375O7614J09142R0544L4660
10541C420409Q7915J38950J39251J62329Q2567N7252R9049R2318J54330J00425
10531D534795R0354J71581J71555J36048R4467J58687K23511K02534J64820J55806
10521F104158K07386K25483K60007K79966K48469K77470L23779K96313L26917
10512H549948M35581M45828M47236M72946N13247N32281N52235O01873P14061
10503A3265236P90903Q67339R61975J028684J167252J276485J414971J549314
10495B2322159J742624J951848K242727K545531K762548L123719L590530M032765
10487D4314451M648945N286130N922824O561296P237544P763142Q102211Q157170
$$ plain form
10552 2800664 2805581 2845062 2905229 2980383 3035156 3069074 3118449 3186063 3295205 3385749 3420409
10541 3420409 3508324 3647274 3786525 3948854 4031421 4088673 4187722 4280040 4434370 4534795
10531 4534795 4625149 4796730 4968285 5104333 5198800 5357487 5580998 5783532 5948352 6104158
10521 6104158 6311544 6537027 6797034 7077000 7325469 7602939 7926718 8223031 8549948
10512 8549948 8985529 9431357 9878593 10351539 10864786 11397067 11949302 12551175 13265236
10503 13265236 14056139 14923478 15885453 16914137 18081389 19357874 20772845 22322159
10495 22322159 24064783 26016631 28259358 30804889 33567437 36691156 40281686 44314451
10487 44314451 48963396 54249526 60172350 66733646 73971190 81734332 89836543 97993713
10479I7993713P782026O849702N494415L586459J462121n82129k156954l370320
10471A17059033l955561m015677l650936l004269k137433j140184K3430J116593
10463A00294996K093975L008227L603022L851490L701904L311788K760867K309215
10455A24935484K213429K549049L045554L728996M134994M231036L923529L103726
10447A51865797J869741M19558j040978k385367l404752m088909m332415m191159
10439A34711516l829355l263676k866374k627816k671609l023750l378147l567141
10431A09483648l561487l222383k596131j891885j083629k55616N51406J308386
10423I8732309J911759K312576K389633K222649J695475Q74685k98803j632485
$$ plain form
10479 97993713 105775739 112625441 118119856 121706315 123168436 122586307 120429353 117059033
10471 117059033 113103472 109087795 105436859 102432590 100295157 99154973 99178403 100294996
10463 100294996 102388971 105397198 109000220 112851710 116553614 119865402 122626269 124935484
10455 124935484 127148913 129697962 132743516 136472512 140607506 144838542 148762071 151865797
10447 151865797 153735538 154155096 153114118 150728751 147323999 143235090 138902675 134711516
10439 134711516 130882161 127618485 124752111 122124295 119452686 116428936 113050789 109483648
10431 109483648 105922161 102699778 100103647 98211762 97128133 96872517 97423923 98732309
10423 98732309 100644068 102956644 105346277 107568926 109264401 110139086 109840283 108207798
10415A08207798k970432m224343n155317n834245o163174o247690o064111n802836
10407F5745650n432038n025013m503260m121771l736497l329564k979127k663326
10399C3955054k514901k231950k000036j771879j640502j492508j305838j249624
10391A9747816j143708r91995r54089r35153p89054p21682o81818o39030o48649
10382A2242638n59254m66324m86745m35147m20561m29933l37904l37884l66974
10373H401912l10503k74184k90976k71417k83779k39038j90124j71231j41539
10364F229121j85455j88611j86680j72444j54465j39983j12028j43804j12624
10355D833027k15710j57696q2041j04390j09222p5943p8901j46931q4763p8969
$$ plain form
10415 108207798 105237366 101013023 95857706 90023461 83860287 77612597 71548486 65745650
10407 65745650 60313612 55288599 50785339 46663568 42927071 39597507 36618380 33955054
10399 33955054 31440153 29208203 27208167 25436288 23795786 22303278 20997440 19747816
10391 19747816 18604108 17612113 16658024 15722871 14933817 14212135 13530317 12891287 12242638
10382 12242638 11683384 11217060 10730315 10295168 9874607 9444674 9106770 8768886 8401912
10373 8401912 8091409 7817225 7526249 7254832 6971053 6732015 6541891 6370660 6229121
10364 6229121 6043666 5855055 5668375 5495931 5341466 5201483 5089455 4945651 4833027
10355 4833027 4617317 4459621 4377580 4273190 4163968 4088025 4009124 3862193 3777430 3698461
10345C698461j13542j06255n2240j4176l1802r9319p4242p7891n4874j7661p7910
10334B978549r0611o8444n8785q0151l7633k8027j7335n2537k5961j05205m1629
10323B372231p337l7184r4342l8903l1224K868o9967n7470n9387m7154k7070M1442
10311A946503L1846m4200n9037r538j0070j6516o5616p2906K9446K3005n9716
10300A693201j7290l9457p7983l7478l9463l0555l919m9261n5364p2289o1787
10289A208355o0732k5579l0577L1660L264k3490p165N4230q513l5328m9105J1125
10277A068145j0940p564j0907n1419k8739j7253k2138l4078o7182n2559J4407
10266G79773J1806M5097j8228l3459m4564M486K3310J9484J370k9041p2550l1302
$$ plain form
10345 3698461 3584919 3478664 3426424 3412248 3380446 3281127 3206885 3128994 3074120 3056459 2978549
10334 2978549 2887938 2819494 2760709 2680558 2642925 2614898 2597563 2545026 2519065 2413860 2372231
10323 2372231 2364894 2327710 2233368 2194465 2163241 2166109 2096142 2038672 1979285 1932131 1905061 1946503
10311 1946503 1978349 1934149 1875112 1865574 1855504 1838988 1773372 1700466 1729912 1752917 1693201
10300 1693201 1675911 1636454 1558471 1520993 1481530 1450975 1447056 1397795 1342431 1270142 1208355
10289 1208355 1147623 1122044 1091467 1123127 1126391 1102901 1095736 1149966 1141453 1106125 1057020 1068145
10277 1068145 1057205 1049641 1038734 987315 958576 941323 919185 885107 817925 765366 779773
10266 779773 791579 836676 818448 784989 740425 744911 768221 787705 789075 760034 687484 656182
10254F56182J5855N5304J7839m3375m7263k4212p701m153J258L4768k4082J4062
10242F44482q759O1354N8538m2508R733k1117j6327j0694k7020J3679K419l5057
10230F28723n0767r109R324p453l8318M4659p123K2490M2325M630L4533L3330
10218G07244j1241q986k6605L5888K6155r536j4474j5274n3653l0237K8389o882
10206F20788n8257L1601L9609r335l8708J9802j4978n0165l6878O90p834K2612
10194E18947K9390N7651M0040K1365m0378n0621j2398K2928l2210L998J3028k1214
10182E50526M9255L1038n9318j553M7484m9316k0676Q533q865J2390j5731o7678
10170D76089l2576l5682P32K7288K2937N4289k8423q5582l6716K2385K3339K5446
$$ plain form
10254 656182 672037 727341 745180 701805 654542 630330 622629 618476 619734 654502 630420 644482
10242 644482 635723 697077 755615 713107 722840 701723 685396 674702 647682 661361 663780 628723
10230 628723 577956 568847 578171 570718 532400 577059 569936 592426 634751 639381 673914 707244
10218 707244 696003 687017 660412 696300 722455 712919 698445 683171 629518 599281 627670 620788
10206 620788 562531 594132 633741 624406 585698 605500 590522 540357 503479 504169 496335 518947
10194 518947 548337 605988 646028 667393 627015 576394 563996 586924 554714 558712 571740 550526
10182 550526 599781 630819 571501 569948 617432 568116 547440 555973 547108 559498 543767 476089
10170 476089 443513 407831 408563 435851 458788 513077 484654 399072 362356 384741 408080 433526
10158D33526J8980O9503M5071m2989n7691L98O450L038k1164J0072M2627k1855
10146D85966n0590J8536K2403J6219l8637k1097k0420q0050l4556j1524J3062
10135B99312N8205L5505J9172J3969m0741j0248N0569l6035m5757L2398K289L8137
10123D16775l8838l2036J3299J452k7930N433L4017j2164o6050m156P3599J1182
10111C74583j6866k7744m5256k3703N384M3907K836K0342K3J6538K3140M5995
10099D19179k4311k559l7607k2350k8412j0640K107l4334K2060M3624M6947K664
10087C76368l3170j2184J9475K4390J2531k8165j6728L385N315N6006l0943m7711
10075C28569K2342j7730O494O0143M2878K401K632l4835m3995M1616N4266N3808
$$ plain form
10158 433526 452506 522009 567080 524091 466400 466798 473248 476286 455122 465194 507821 485966
10146 485966 435376 453912 476315 492534 453897 432800 412380 332330 297774 286250 299312
10135 299312 357517 393022 412194 426163 385422 375174 425743 389708 343951 376349 378638 416775
10123 416775 377937 345901 359200 360652 332722 338155 372172 360008 293958 289802 363401 374583
10111 374583 357717 329973 284717 261014 266398 310305 313141 333483 333506 350044 373184 419179
10099 419179 394868 392309 354702 332352 303940 293300 295407 261073 283133 326757 373704 376368
10087 376368 343198 331014 350489 374879 387410 359245 342517 345902 351217 407223 376280 328569
10075 328569 350911 333181 339675 399818 442696 445097 447729 412894 368899 410515 464781 518589
10063E18589K4778K4363M0260K8038J4340J2149N2602J23762J21948J83797L12737
10052A457363L27207K09621o8686l82720k84417j56824q0673j7559m2208n2342
10042I08762o1006j1665o379K4248n460j6337L7065M3439N1852K3502p8291p196
10030I02534L6427l788K8817J9555k0696k7491M956M3610J4481N0037J7333m3345
10018A022430n8978j6672l4112l5949j6278j9422k3453l2193k0651l0244M6125
10007G80603O7243l2902j1391n1125j4504q871n761j1684k4184o5171K0989R7317
9995G40559L9020j5940K312J8385M6541q465j17466k3296k9861p5852r798O324
9983E72463k4369k782l7264q1261p3042O275n0053j00131j2945Q3816K0819k3901
$$ plain form
10063 518589 543367 567730 607990 636028 650368 662517 715119 838881 960829 1144626 1457363
10052 1457363 1784570 1994191 1925505 1542785 1258368 1101544 1020871 1003312 961104 908762
10042 908762 847756 836091 829712 853960 848500 832163 869228 912667 964519 988021 909730 902534
10030 902534 938961 935173 963990 983545 962849 935358 940314 983924 998405 1048442 1065775 1022430
10018 1022430 963452 946780 912668 876719 860441 841019 817566 785373 764722 734478 780603
10007 780603 847846 814944 803553 752428 737924 729053 723292 711608 687424 622253 643242 740559
9995 740559 779579 763639 765951 784336 830877 822412 704946 681650 651789 575937 566139 572463
9983 572463 548094 545312 508048 426787 353745 360020 309967 209836 196891 280707 301526 277625
9971B77625l3405P11J7271J0490k853L3436m9078k3406O219n887L6996K1114M308
9958B93541m4449j8038n89L1677M2904J6467m4854p8693k7251l5975m91N2229
9946A86478j412l7276o369K8393k9356k7280r794l541k322J4122K7235k2495J4730
9933A31113M2463J5814J2448m402l9287m0363n690j8526N629K3675J613J2770
9921A37257R245J1467k8651k25K6655r27K4312M5959m3902l9332J9345K4852L2836
9908B18891M6045k2304j5013k4214m4006K3055r182k7017M1008l1746J2888O2947
9896B31352K6269j2585J185k525K769N01l5143L79n8919l4166J1868k2304k5246
9883H3435k0798M2866k2868m4142M8962m993m335O327K3496M3389M092k5990O069
$$ plain form
9971 277625 244220 244931 262202 272692 269839 303275 254197 230791 237010 231123 268119 289233 293541
9958 293541 249092 231054 230465 262142 305046 321513 276659 197966 170715 134740 134249 186478
9946 186478 185066 147790 141421 169814 140458 113178 103384 99843 97521 111643 138878 116383 131113
9933 131113 173576 189390 201838 197436 158149 117786 112096 93570 99199 122874 124487 137257
9921 137257 146502 157969 129318 129093 155748 154821 179133 225092 181190 141858 161203 186055 218891
9908 218891 264936 242632 227619 203405 159399 182454 173272 146255 187263 155517 168405 231352
9896 231352 257621 245036 246221 243696 246465 246966 211823 212202 153283 119117 130985 108681 83435
9883 83435 62637 105503 82635 38493 87455 82462 78127 84454 107950 151339 155431 129441 135510
9870A35510l1921n695J0117j5416K5224J6510P02m435Q5115L6017J370M4675O5564
9857C63337R5064R0173J30455K72975K82148J07626j79947l00916l09986j93470
9847C57459n6876j1690o4919j2473P927l9048j6303P202J3892L025l3377m6200
9835A08619m7011k7323J5073K3557n479L7074J6825O150K0148N637m1576l4405
9823G7289m3392j477M6473M1359k2692k9460O609j7737M7270M2998l5986j0494
9811A00760J9059k1637n5686O393N2490j3698M570K2703J6956K6899J2485J0652
9799A81946k0491K1821k9385q297p002k9552k0844j001K3068J9450Q2984j1122
9787B01575k2998m1187Q695j3248K443r792m203m9827l3574R325P676P080L2039
$$ plain form
9870 135510 103589 97894 108011 92595 117819 134329 135031 130596 215711 251728 253098 297773 363337
9857 363337 458401 548574 679029 952004 1234152 1341778 1161831 860915 550929 357459
9847 357459 300583 288893 223974 211501 219428 180380 164077 171279 185171 188196 154819 108619
9835 108619 61608 34285 49358 72915 67436 104510 121335 127485 147633 153270 111694 77289
9823 77289 33897 32420 78893 120252 97560 68100 74709 56972 104242 147240 111254 100760
9811 100760 119819 98182 42496 48889 101379 87681 92251 114954 131910 158809 171294 181946
9799 181946 161455 183276 153891 145594 138592 109040 88196 87195 110263 129713 212697 201575
9787 201575 178577 137390 146085 132837 135280 125488 121285 71458 37884 47209 54885 61965 94004
9774I4004L5617j2820m8369k064K9859Q812j1944J7916K5968l5452j0141l5124
9762E6262m767K7070K7232j0549k6J7615m0582K3581N4305K9620j9078m0885p38
9749A19060j1058J2556k856m7412k2163j833L4559N7624j7520k5469M3183j4077
9737A24594o418J38k2228o1414j0036L3789J8272Q466P38k4052J6320N7066L2335
9724A67570K9114n675q2774j1N5115l1601j8300J1468J6938k560O4K990P744O8648
9710B18730l5347l2093l4718r302J2606P249k3435j2746k1989n7978l2649J4911
9698f761M7619L2712M1709L0932L020n1101o5523J7626o524j3679M3666K384l3123
9685D2957L5800P1j7845R20j4636k2446J5506Q020K5261J7813j2032O219J4039
$$ plain form
9774 94004 129621 116801 68432 66368 96227 105039 93095 111011 136979 101527 91386 56262
9762 56262 51495 78565 105797 95248 95222 112837 72255 95836 150141 179761 160683 119798 119060
9749 119060 108002 120558 117702 70290 48127 46294 80853 138477 120957 95488 138671 124594
9737 124594 118176 118314 96086 34672 24636 58425 76697 85163 85901 61849 78169 135235 167570
9724 167570 196684 191009 108235 108224 163339 131738 113438 124906 141844 139284 139348 142338 150082 218730
9710 218730 183383 151290 116572 107270 119876 127125 103690 90944 68955 10977 -21672 -6761
9698 -6761 40858 73570 115279 146211 149231 98130 32607 50233 43709 30030 73696 76080 42957
9685 42957 78757 78828 60983 61903 47267 24821 40327 48347 73608 91421 79389 85608 99647
9672I9647j7613q216J7012j0455N28p618p031n2549l0223r467O3125j636K083
9659C7587J6224K3689j0755m0021J2075K4681J0512L3992k240k0782j4567K0517
9647I0912l3117n5658j8134K5802J1942N0701K5250j7579j9261k0921r308N1964
9635H2593J5316L3597J5787q925k0062L532k1363k4249K0492m773m7677l6907
9623G361P7393Q6249P627R428k1550k5924J8259L0471l9123m1392k6189K8345
9611A10955J5525M502o197J1433M9183l6153q8368P583P2180J3749l7656M259
9599A20995p969k6283K7198K3302j3154p1191n14j7354k9910O082L1746J9087
9587F2035j7103K8092L8588L4483j7402n3456m1205L0903K1562k7822j2900J7966
$$ plain form
9672 99647 82034 73818 90830 80375 80903 73285 66254 13705 -16518 -25985 37140 35504 37587
9659 37587 53811 77500 66745 26724 38799 63480 73992 107984 105744 84962 70395 90912
9647 90912 57795 2137 -15997 9805 21747 72448 97698 80119 60858 39937 30629 82593
9635 82593 97909 131506 147293 138368 118306 121838 100475 76226 96718 91945 44268 7361
9623 7361 84754 171003 178630 188058 166508 140584 158843 189314 150191 108799 82610 110955
9611 110955 126480 130982 124785 136218 185401 149248 60880 68463 140643 154392 116736 120995
9599 120995 113026 86743 113941 137243 124089 52898 52384 35030 5120 11202 42948 62035
9587 62035 44932 73024 111612 146095 128693 75237 34032 64935 86497 58675 45775 63741
9575F3741L5886M3010J3495j3989J1032L0614J851o2924r9698n6643k167L6338
9563E46N3383K0456p2271k1991N2825N4158K429l9703m2074r423L8396L6153J062
9550G3946k734J7365J195L7811k2824n0015K8310j5176J9702L9584m704J938R103
9537A33501J7957k3168n683j1106j0046j9845o13L0404M1217K4104J5070k1585
9525A70207r008K1798m4902m9386o0669k6994M7144K0076j7815K9618p835j397
9513G0837L2152N3563m387J0691J0594n6601J2346j1461l6416j163J6393k135
9501I4413L5618k186j6734K5318q538k440j6147l4316p19Q1J4292R709O430J3451
9487A18232j7802P435K6128k3691k2892K3103J3641O323L3566O5297k1327K3939
$$ plain form
9575 63741 99627 142637 156132 142143 153175 183789 185640 122716 23018 -33625 -35792 546
9563 546 53929 74385 2114 -19877 32948 87106 89535 49832 7758 -1665 36731 72884 73946
9550 73946 71212 88577 89772 127583 104759 54744 83054 67878 87580 127164 122460 124398 133501
9537 133501 151458 128290 122607 111501 101455 81610 80997 111401 152618 176722 191792 170207
9525 170207 161199 182997 138095 88709 28040 1046 48190 68266 50451 80069 72234 70837
9513 70837 102989 156552 152165 162856 173450 116849 129195 117734 81318 80155 96548 94413
9501 94413 130031 127845 111111 136429 127891 125451 109304 74988 74269 74350 88642 98351 104781 118232
9487 118232 100430 107865 133993 110302 87410 110513 124154 130477 164043 229340 208013 231952
9475B31952q564j32k2914J8303p740j7982k1548l0598n416l0142l5656n788K6239
9462I0014J1032N4967K2270m3951M0058M9255k7934J2238K3085m6273k5769L257
9450A62249K0779K3239J4679l1308L5241j9577k0708j5226L0560M0169n3214k9172
9438A57711Q528M2644m0473n8344M8987O9943j7360l9375j8884N8212M098k5845
9426A89842o2450k8245J2861o552J1534K754k1055m2921M0838L4512J0749N1939
9414A93806P689j6156M9278N9765P50o0532o8324L2697O5441M1428J4247l5272
9402B84817J0535o756j2558l1150o5465j2526N4434O0760N556m917L6881K7060
9390C46671p209o568K030j1588N905r594j8912k4543O522k8166p698r632k6797
$$ plain form
9475 231952 223388 223256 200342 218645 210905 192923 171375 140777 135361 105219 69563 63775 90014
9462 90014 101046 156013 178283 134332 174390 223645 195711 207949 231034 184761 158992 162249
9450 162249 183028 206267 220946 189638 224879 205302 184594 169368 199928 240097 186883 157711
9438 157711 166239 208883 168410 110066 159053 228996 211636 172261 153377 211589 215687 189842
9426 189842 127392 99147 112008 105456 116990 119744 98689 55768 96606 131118 141867 193806
9414 193806 201495 185339 234617 294382 295132 234600 166276 198973 264414 305842 320089 284817
9402 284817 295352 288596 276038 244888 179423 166897 221331 282091 287647 282730 319611 346671
9390 346671 339462 332894 334924 323336 329241 319647 300735 276192 282714 254548 246850 237218 210421
9377B10421O0746Q021k427K5432Q954p301N7755p77m6159l1719M6o871k4994M4173
9363B95300N8075N8982L241m6172j1890L282L7344L3744K8396j7500n1347o8508
9351C22947J1538K1145P896P928m0726N300J5734O174p360j508L3387K1390J7867
9338D21712k0749K348K3654J9848l5401N0181q039j1888K6590J6096K8691J3089
9326E26132j9866J8519O812Q781M7281L3074o39O51j5290N50J6817R069J726M2848
9312F76465K0255P836l552k2320l6020o3983M6804M5272J5065k1750k1566P891
9300F50397O5986j313k4218N08o2640M6189N6634N9353K1974k5548K0521J7944
9288H25787J9807K9249J4243K4356N5565Q151p134J0096N5907N9862L608j168
$$ plain form
9377 210421 271167 279188 276761 302193 311147 303846 361601 360824 314665 282946 282992 276121 251127 295300
9363 295300 353375 412357 415598 369426 357536 360818 398162 431906 460302 442802 391455 322947
9351 322947 334485 355630 363526 371454 330728 336028 351762 357936 350576 349068 382455 403845 421712
9338 421712 400963 403311 426965 446813 411412 461593 453554 441666 468256 484352 513043 526132
9326 526132 506266 524785 531597 540378 587659 620733 620094 620745 605455 606005 622822 631891 633617 676465
9312 676465 696720 704556 701004 678684 642664 578681 625485 670757 685822 664072 642506 650397
9300 650397 716383 715070 690852 691360 628720 674909 731543 790896 812870 787322 807843 825787
9288 825787 845594 874843 889086 913442 969007 977158 970024 980120 1036027 1095889 1099497 1098329
9276A098329q452l717J5807N2458M1418O501k2008m0248k0848m633O8068N4403
9264A237078J8851K3938L3592k4387L9196Q0589L4972l9229J7624L9724L3177
9253A495125O2489L2980J2259L4650K8549m3422K2191M3707K4384M2711o360k1060
9241A728203R185M2722R7726K7336M541J4971K3572R05L7145L6202L8421K3880
9229B084809j0934N2134K5944L6314M5502m770L735L4104K7512O165J982M8685
9217B351182J4627j0450J103m8638m3445L2540l1151k0474J6773j2467M7465l961
9205B293104m2013j1430j976P025M2808Q385p1589j0087m691l2643k1123o8051
9193B087719r0069K6055J8515N77J5425J087k1637m9073n6823k0097n726n1485
$$ plain form
9276 1098329 1089877 1086160 1101967 1154425 1195843 1202344 1180336 1140088 1119240 1114607 1182675 1237078
9264 1237078 1255929 1279867 1313459 1289072 1328268 1408857 1443829 1404600 1422224 1461948 1495125
9253 1495125 1557614 1590594 1602853 1637503 1666052 1622630 1644821 1688528 1712912 1755623 1749263 1728203
9241 1728203 1737388 1780110 1877836 1905172 1909713 1924684 1948256 1949161 1986306 2022508 2060929 2084809
9229 2084809 2073875 2126009 2151953 2188267 2233769 2228999 2232734 2266838 2294350 2300515 2302497 2351182
9217 2351182 2365809 2355359 2356462 2307824 2264379 2296919 2265768 2245294 2262067 2249600 2297065 2293104
9205 2293104 2251091 2239661 2237685 2244710 2287518 2295903 2224314 2214227 2209536 2176893 2155770 2087719
9193 2087719 1997650 2023705 2042220 2042797 2058222 2059309 2037672 1988599 1931776 1911679 1905953 1854468
9181A854468l7318j3900J4477J2145O711l6084l326n3030o6409l8906k6023l0460
9169A582345k7362k5399L1830k8765r6309m4615K0691p474l3948n0693l6880m1760
9157A241661l6382L9525J4534m5970j00594l8812j2342k956M3252r719j0991n3806
9145A027400J8796O446k7983n8860m4045o309j461m0265K7085N2364K8273o1960
9133I19481p3111l0837l2559J2968J0441Q988k5040l0526K193k6584q015p2096
9121F55303k7417k2206J6453n2234o245L1268O6431j6733k7935k2590n3559n5745
9109D84791j518J112j1286N234l345L2960Q1936L9462j0639k9977m3474J1612
9097E56868J8437k6956k5648l095j5697r488l6919k6844k3623l3478K9077N7162
$$ plain form
9181 1854468 1817150 1803250 1817727 1829872 1836583 1800499 1797173 1744143 1677734 1638828 1612805 1582345
9169 1582345 1554983 1529584 1561414 1532649 1436340 1391725 1412416 1404942 1370994 1320301 1283421 1241661
9157 1241661 1205279 1244804 1259338 1213368 1112774 1073962 1061620 1058664 1101916 1092197 1081206 1027400
9145 1027400 1046196 1052642 1024659 965799 921754 915445 913984 873719 900804 953168 981441 919481
9133 919481 846370 815533 782974 795942 806383 815371 790331 759805 761998 735414 727399 655303
9121 655303 627886 605680 622133 569899 563654 594922 661353 644620 616685 594095 540536 484791
9109 484791 483273 484385 473099 478333 474988 507948 589884 629346 618707 588730 545256 556868
9097 556868 575305 548349 522701 519606 503909 494421 457502 430658 407035 373557 402634 459796
9085D59796j2409m9009k1843j2401n137k2168k6959K5264J1089J9678K4630J0056
9073D00587l1628L816J1929j0344l8150j3752J625j4370k7325k6452J2423K9115
9061B97474K1662L3527M757k9240N046J5047K580j9421L062J7923J0300k9870
9049C32847n3095j06101K246N1441N1888N3762J1541L997j0256o6519j930M5242
9037C15063P027o4760N566K6160j0388k1460L5282k4087l1272j4194O0046R131
9025B92114l2953j0268j1400K8707K3786k1013m2906l6491J7114q91J1853L0967
9013B48619o0629J730k2297m9154l1380J3090M6436K3917L6328k0830k8900k8996
9001A27934j0619K4396M9832K2381o8421M0428K2943l9786m7396k6207m7689k253
$$ plain form
9085 459796 447387 398378 376535 364134 358997 336829 309870 335134 346223 365901 390531 400587
9073 400587 368959 372775 384704 374360 336210 322458 324083 309713 282388 255936 268359 297474
9061 297474 319136 352663 357420 328180 333226 348273 350853 331432 334494 352417 362717 332847
9049 332847 279752 173651 175897 227338 279226 332988 344529 348526 338270 271751 269821 315063
9037 315063 322090 257330 262896 289056 278668 257208 292490 268403 237131 222937 282983 292114
9025 292114 259161 248893 237493 266200 289986 268973 226067 189576 206690 205799 217652 248619
9013 248619 187990 189720 167423 118269 86889 99979 146415 170332 206660 185830 156930 127934
9001 127934 117315 141711 191543 213924 145503 185931 208874 169088 121692 95485 47796 45543
8989D5543N0958O595p2734q15K1970L3188K7077r385o6356j5861L4456M103J5759
8976G4498J3360J7021L742l7689j5119M5770M2988j5930J1872K751L9578q699
8964A74143k9670O650k183m3069J0457j7102r6832J3845J7304J9919j172N541
8952E7831N314Q7030O8177l9431l9739n578L412l788n339l5956j5324j2961P887
8939G1535M907J3138k9051j4922j227k8094j4129q240K4424j9662K3167k685M3135
8926F2296K5473j3709J2063j0301k762K5680J3151J2668l3294n750k6586k4852
8914C4077K3773L8145k0973l2007k0251m7168m861p07l278L7956J7916K0453Q8028
8901A31103J999k3864J9802o840k4079m8822K2575K3034k5465R634o452k3796
$$ plain form
8989 45543 96501 103096 30362 29547 51517 84705 111782 102397 36041 20180 54636 58739 74498
8976 74498 87858 104879 108621 70932 55813 101583 144571 128641 140513 143264 182842 174143
8964 174143 144473 151123 148940 105871 116328 99226 2394 16239 33543 53462 52290 57831
8952 57831 63145 150175 218352 178921 139182 133604 137016 133228 127889 91933 76609 63648 71535
8939 71535 76442 89580 60529 45607 44380 16286 2157 -6083 18341 -1321 21846 19161 62296
8926 62296 87769 74060 86123 75822 73060 98740 111891 124559 91265 85515 58929 34077
8914 34077 57850 95995 75022 43015 22764 -24404 -29265 -29972 -33250 4706 22622 43075 131103
8901 131103 133102 109238 129040 122200 98121 49299 71874 94908 69443 79077 72625 48829
8889D8829k6908j9803L1132L9578M153o089j2884K485N086j7089j4433L2981J0421
8876G7459j387n5612j2340N2945J3532j9983k0747j0495L2264N58j7950K2440
8864F0684k9827J0693J1227k5703l407M210p330N2557J3559m531J8170k9739m7308
8851B3255L8135j2289r129j0192l397j1754n533j3391J3860L2064K217m0173J5230
8838A8903L8485J1084r734k1494l5221J2587n729k5816M7319K6837j071k1789
8826C4361j3015j277k6065m3669j2678O3289M7305L7282j4954J956k262j6169
8814E4104K1913K6384n2282k3121L7223L6428n4419m0207N2171K3080J5370n5565
8802D1079m1944j8378K5769N9625O3450J7528n8556j7555J7481J9420m2149m5301
$$ plain form
8889 48829 21921 2118 33250 72828 76981 70892 58008 60493 65579 48490 34057 67038 77459
8876 77459 76072 20460 8120 61065 74597 54614 33867 23372 55636 56194 38244 60684
8864 60684 30857 41550 52777 27074 23667 27877 20547 73104 86663 82132 100302 70563 23255
8851 23255 61390 49101 39972 29780 26383 14629 9096 -4295 9565 41629 43846 3673 18903
8838 18903 57388 68472 58738 37244 2023 14610 8881 -16935 30384 57221 56150 34361
8826 34361 21346 20069 -5996 -49665 -62343 946 48251 85533 70579 72535 70273 54104
8814 54104 76017 102401 50119 26998 64221 100649 46230 6023 58194 81274 96644 41079
8802 41079 -865 -19243 6526 66151 129601 147129 88573 71018 88499 107919 65770 20469
8790B0469p021O1896k1699o0969J1900L2409l438L4620J508l3024M1558N173l6395
8777D6987j1596Q776l8307J8314M3882p621j7926k5261l2642K6456K0325k0613
8765A0774k6593L93M1064M2247m5468K7138K8734l4761M7927K1386N3291N774
8753A71906o4987l3529O824j7065j6338K834O4729K300q789k4514l3848L4424
8741H3947K8863K308j9933J664j9713J4398j6637j2334k3708k3082n0180l4181
8729f8588J2312Q4207L5058j7310k8026N6030J4599l5975p9440l0112P6147M7324
8717F6226n4479j6255L1643r081N2438P778j2178l5546K5817l9929k1024L086
8705a504L6531L2764J480l4753K4188N2812L2991j4517k9790k0746O787P727o742
$$ plain form
8790 20469 13448 75344 53645 -7324 4576 36985 33547 68167 69675 36651 78209 83382 46987
8777 46987 35391 44167 5860 24174 68056 60435 42509 17248 -15394 11062 31387 10774
8765 10774 -15819 -15426 25638 67885 22417 49555 78289 43528 91455 112841 166132 171906
8753 171906 106919 73390 80214 63149 46811 49645 114374 116674 107885 83371 49523 83947
8741 83947 112810 115118 95185 96849 77136 91534 74897 62563 38855 15773 -34407 -68588
8729 -68588 -56276 27931 62989 45679 17653 73683 88282 52307 -27133 -57245 18902 66226
8717 66226 11747 -4508 27135 18054 70492 78270 66092 30546 56363 16434 -4590 -1504
8705 -1504 35027 67791 69271 34518 58706 111518 144509 129992 100202 79456 86243 93970 87228
8692H7228r267K368J2601m0884l8521j3163k8775L4794l645J8306j682n2681o111
8679c9432Q7966K1133q45M072K3388l4564m5203J8684l3997q859k527q781J0351
8666h614L8496J6930j6820K4494M1736j1395j8824q220j3171K1249J5541J4077
8654I5479P721P4693J38870N7385l1986q6048p2107M190j4455K4195J3888m52
8642B11373o2065m1407p954J379K0532P65J0381Q636j3138J77J1191L8178K1680
8629A99728l4220j2904k313J5879L1660l6725j0807N1576O369n5819n8186K0289
8617A14527O4165O9383L379o940m5160n686L9565M3724J09038J15201R0091Q8785
8605F80072J146j17875k11305j38497j0046l4607l5043j760M5734m2086k1791
$$ plain form
8692 87228 77961 80329 92930 52046 13525 362 -28413 6381 2736 21042 19360 -33321 -39432
8679 -39432 48534 69667 68822 72894 96282 61718 16515 35199 1202 -7657 -10184 -18965 -8614
8666 -8614 29882 46812 29992 54486 96222 84827 66003 57783 44612 65861 81402 95479
8654 95479 103200 177893 316763 374148 342162 256114 184007 188197 173742 197937 211825 211373
8642 211373 149308 107901 99947 101326 121858 122623 133004 141640 128502 128679 139870 178048 199728
8629 199728 165508 152604 150291 166170 197830 161105 150298 201874 208243 152424 94238 114527
8617 114527 178692 248075 251454 244514 199354 193668 233233 276957 385995 501196 591287 680072
8605 680072 681218 563343 352038 213541 203495 168888 133845 132085 177819 135733 113942
8594A13942j4385N68q230K4086K1688l7504o986j8214k7819J0923L5594K0006
8582A13669l4552q682o904O951O424k37j6462j3500N1001O9809j8623k6722k3595
8569I8577L563j5994o7854R01M6711O2850n399M0338P7056K7673o1027j7712O242
8556A95925n7641o5610o1495k9105N1773L645l9397k8196P412J7379P461q811
8544f660O6870K6117m5868m3434k512l3589k087j9026j7470M0590P9843j4831
8532B7943j9227n0106O979L0193j7332J6561Q166K2567J7960J4985M8928m875
8520A02742o5181m6083m6364L0557K2839j5776k5877N907N4491N5101k010m9530
8508B0816j3435K3098O575l1249J33L7945k6925j10832K2165M8337k6426n4125
$$ plain form
8594 113942 99557 100125 91895 115981 137669 100165 93179 74965 47146 58069 93663 113669
8582 113669 79117 70435 63531 70482 76906 76669 60207 46707 97708 167517 148894 122172 98577
8569 98577 102140 86146 18292 19193 65904 128754 123355 163693 240749 268422 207395 189683 195925
8556 195925 138284 72674 11179 -17926 33847 37492 -1905 -30101 -22689 -5310 2151 -6660
8544 -6660 60210 86327 40459 -2975 -5487 -39076 -41163 -60189 -77659 -37069 42774 27943
8532 27943 8716 -41390 -34411 -4218 -21550 -4989 3177 25744 43704 58689 107617 102742
8520 102742 37561 -8522 -54886 -24329 -1490 -17266 -43143 -37236 17255 72356 70346 20816
8508 20816 7381 30479 37054 5805 5938 43883 16958 -93874 -71709 -23372 -49798 -103923
8496a03923K3193P2989p860o677L5603l3083k0184M580J6410K7764p663j4829
8484a3680J0374L7765k3333n7946Q991k77O710J2125L6369k730O933M0318k1875
8471C9744k4313L6211j2663l0901j1226J238J4006J899K949l574M0418j8066k3629
8458A2093K3158J8944j47n3307k2114J6761j4264k0603N9541j9029k9422J1082
8446a7307P04K1003R781L664m1800r757m139l0744K7341N3993N3219l6428m7254
8433a7724J9687J2477J7605j1301m4469k7861K6954J1141L0620l8408J1628R12
8421h739p508J8457k5844n029P675M0784N5167j0558j2433j0679l0961P132J9406
8408C6870J3625L0160k7456k7246L3849K2968K0900k1087l8638j9493j7368m086
$$ plain form
8496 -103923 -80730 -7741 -15601 -22278 13325 -19758 -39942 -35362 -18952 8812 1149 -13680
8484 -13680 -3306 34459 11126 -46820 -37829 -38106 -31396 -19271 17098 14368 21301 61619 39744
8471 39744 15431 51642 38979 8078 -3148 -1910 12096 13995 16944 13370 53788 35722 12093
8458 12093 35251 54195 54048 741 -21373 -4612 -18876 -39479 20062 1033 -28389 -17307
8446 -17307 -16603 4400 14181 17845 -23955 -33712 -37851 -68595 -41254 12739 65958 29530 -17724
8433 -17724 1963 14440 32045 20744 -23725 -51586 -24632 -13491 17129 -21279 -9651 -8739
8421 -8739 -16247 2210 -23634 -28663 -20988 19796 74963 64405 51972 41293 10332 17464 36870
8408 36870 50495 80655 53199 25953 59802 82770 103670 82583 43945 24452 7084 2998
8396B998J4713n949j0750M1919j6995j8049M0890j1224J692j8146J4475j3986
8384B1588l639J1016j1837j2155n7846r692r673J749N268L9098J7195k0234k776
8371c1938J1679J0676M7361M1954o651M819m4627j7477K7644K0497l2364r123
8359B2450K1650j3642K2976P97l5066o1871N793J6671J3019l9429L520J9411J8093
8346e628K4228M4761K2290l2275j4001J1765M71p200Q354P883n8882J455J5872
8333A9093P029j1592J2113J2030J9949J000l5854k2462J1502O4282K5488n0046
8321E2532n8824K7412k6196K2629J7302j1165j1005m5405q420K6300l401r029
8309b7270M9182L0601j5164j3777K2606M1536l8106K3289m1937K620m23k3946
$$ plain form
8396 2998 17711 11762 1012 42931 25936 7887 48777 37553 39245 21099 35574 21588
8384 21588 17949 28965 17128 4973 -52873 -62565 -72238 -70489 -65221 -26123 -8928 -29162 -31938
8371 -31938 -20259 -9583 37778 79732 73081 77900 33273 15796 43440 63937 31573 22450
8359 22450 44100 30458 53434 54231 19165 -42706 -36913 -20242 -7223 -46652 -43132 -23721 -5628
8346 -5628 18600 63361 85651 53376 39375 51140 51611 44411 52765 60648 1766 3221 19093
8333 19093 26122 14530 26643 38673 58622 59622 23768 1306 12808 77090 102578 52532
8321 52532 -6292 21120 -5076 17553 34855 23690 12685 -32720 -41140 -14840 -18241 -27270
8309 -27270 21912 52513 37349 23572 46178 87714 49608 72897 30960 33580 33157 9211
8297I211l5888L301J111M5087J4203K1387K2069q549k9582m3925l815L1292l40
8284B5562j8630k2338L1813k8064o8300J7854M172j1594L5402L9877M015l6245
8272b6476k3968J4018K0931P474N84q193J4920q54j2845l6445R17m261M408M2575
8258g215K8239k7515l397l8666j4585m069O7274K0353k4191m1398j6481n64J8573
8245d3642M5491k1643m9583m944L217K0504N1615M8678j8905n1240K8472j6815
8233h795K6141J8662j2556k1684q731k7191k2589O1269k9772j1581m869P5632
8221C3936J9074l6488J3330k1522k673K0762l5427l5567k8898K4918l707k3536
8209g5798l479p703k2522n609L1386M1364j3712m831J0318K2220j802l794l3898
$$ plain form
8297 9211 -26677 -23376 -22265 22822 37025 58412 80481 71932 42350 -1575 -5390 25902 25562
8284 25562 6932 -15406 16407 -11657 -79957 -62103 -57931 -69525 -34123 5754 9769 -26476
8272 -26476 -50444 -36426 -15495 -8021 -7437 -15630 -710 -1564 -14409 -50854 -49937 -54198 -49790 -7215
8258 -7215 21024 -6491 -9888 -48554 -63139 -67208 66 20419 -3772 -45170 -61651 -62215 -43642
8245 -43642 1849 -19794 -69377 -74321 -71104 -50600 1015 49693 30788 -20452 8020 -8795
8233 -8795 17346 36008 23452 1768 -6963 -34154 -56743 4526 -25246 -36827 -41696 33936
8221 33936 53010 16522 29852 8330 5657 26419 -9008 -44575 -73473 -48555 -52262 -75798
8209 -75798 -79277 -86980 -109502 -115111 -83725 -42361 -56073 -60904 -50586 -28366 -30168 -33962 -67860
8196f7860j6178L9303L9459o471m634l459L1778J8870k610k127k1993P023J882
8183A2983j7008Q871L254j7578M910n7194l3872J45J5435J8466l2325j4143J7188
8170i0868M7404K70k3982K6381J0084L2092P43J431m1463o3752L8052K3271L2619
8157g718R8123J453n5091l3743m8736p340M7803J695m3206p0J4461k4110K0667
8144c5812j4419K6058K0719j8861J8726O4775k7707k0922l2497L7340N7004j7303
8132E7101k1581l3045l3715j0228K7034J5277k3380q157L8655m8720l4133K829
8120g2063P469k305L9097J1737k0755j3730K2288q904L0838M4669M8199l5880
8108E0660o6914K4583M1746l2965o2368k3071L9483k167k755m64n7213J7794L4479
$$ plain form
8196 -67860 -84038 -44735 -5276 -11747 -16381 -19840 11938 30808 28198 26071 4078 11101 12983
8183 12983 -4025 4846 8100 -9478 -4568 -61762 -95634 -95489 -80054 -61588 -93913 -108056 -90868
8170 -90868 -43464 -43194 -67176 -40795 -30711 1381 2124 3555 -37908 -101660 -63608 -40337 -7718
8157 -7718 90405 91858 36767 3024 -45712 -53052 -5249 -3554 -46760 -46830 -32369 -56479 -35812
8144 -35812 -50231 -24173 -3454 -22315 -3589 61186 33479 12557 -19940 17400 74404 57101
8132 57101 35520 2475 -31240 -41468 -14434 843 -22537 -30694 7961 -40759 -74892 -72063
8120 -72063 -64594 -66899 -27802 -16065 -36820 -50550 -28262 -37166 -6328 38341 86540 50660
8108 50660 -16254 8329 50075 17110 -45258 -68329 -28846 -31013 -33768 -34232 -91445 -73651 -39172
8095c9172J714K7056J7681L0280P401Q007k4727N672K1181K6153j3894n1297k4809
8082h754K934K0835n9699o234J9452K8995k0738J6148N8275J4744k6236l5661
8070D061M603O120m405j3743p283L382l9822m1033O4526M4827k6370n7154l3567
8057i5858M1619L5674L4709Q4958L1963K60m4400o9681l8329l7495N2731K0014
8045A6165J2676L0608k7902p342L3155l0658l5380J5063n692J3987K324J6001
8033C3005L4469K3923L0563k3306l2532l4735j5822J1038L7787K232j7712N004
8021E3914l8001k8885j1908o568K1440N2483K5802K3384K9152R2449p056k8340
8009A77866J556m7196n1939L2665L5565j2110m8389j9003L1526k025j5532k5346
$$ plain form
8095 -39172 -37458 -10402 7279 37559 44960 52967 28240 33912 55093 81246 67352 16055 -8754
8082 -8754 -5820 15015 -44684 -50918 -31466 -2471 -23209 -7061 51214 65958 39722 4061
8070 4061 8664 14784 10379 -3364 -10647 -7265 -47087 -88120 -23594 21233 -5137 -62291 -95858
8057 -95858 -54239 -18565 16144 101102 133065 133325 88925 19244 -19085 -56580 -3849 16165
8045 16165 28841 59449 31547 24205 57360 26702 -8678 6385 693 14680 17004 33005
8033 33005 67474 91397 121960 98654 66122 31387 15565 26603 64390 66622 48910 53914
8021 53914 15913 -12972 -24880 -31448 -10008 42475 68277 91661 120813 213262 206206 177866
8009 177866 179422 132226 80287 112952 148517 136407 88018 69015 100541 98516 82984 57638
7997E7638j0171l5701M515L8136j3624m9480L8409l1707J7114K2200o92r380k0435
7984F822L2669N5717K3772j8576K3706m3194l6041l4728n6139J4673M1998L8218
7972D8897J9321k3476L3360J5252M7742J5760j0760n3401L499L2283k5283m2313
7960F0881l312K9982L8741p542l9253p0001j8463L5438K378L0761m3470j7811
7948a671r446J1914K5333j4414l5207p8168P338O4908J7812k3000l036l6136k6627
7935a00400Q8144M7295q203K3199J4783l1836O584N5502J9612l1096k1299m599
7923E7686k0467l424L4208j3494j4864l0171k430K5609J3380K96L0622L9065k8524
7910H7492p4660R503l1436j7528L8683N0108Q152M974m1956p4744L8056M0967
$$ plain form
7997 57638 47467 11766 16281 54417 40793 -8687 29722 -1985 15129 37329 36637 27257 6822
7984 6822 39491 95208 118980 100404 124110 80916 44875 10147 -45992 -31319 10679 48897
7972 48897 68218 44742 78102 93354 141096 156856 146096 92695 96194 128477 103194 60881
7960 60881 57569 87551 126292 118750 79497 9496 -8967 26471 28849 59610 16140 -1671
7948 -1671 -11117 797 26130 11716 -23491 -101659 -94321 -29413 -11601 -34601 -37637 -73773 -100400
7935 -100400 -12256 35039 26836 50035 64818 32982 39566 95068 114680 83584 62285 57686
7923 57686 37219 33795 68003 54509 39645 9474 7044 32653 46033 46329 76951 116016 87492
7910 87492 12832 22335 -9101 -26629 12054 62162 70314 75288 33332 -41412 -3356 37611
7898C7611j4489j2246K529Q1572p452m9592J7214l9160k1578K8255m855p126k2869
7885a2186j2297n2199m122M1702k5818o0800J3648P1355J8496K2767p3189N58
7873g2085N9331R329M7225k0120j5977m4289m2533J2481M3107M1422N383l5829
7861a2555p608n8864m2451N5471j0266l04o431K2501K2363J472m5380j8785N522
7848i5315K5321L0004J3709j9678K045L62J5891K8965L3184j1500r1368l4712
7836a03092K3142J00149L2499k9198j8045n1594r996k5172J0030O5517L3604k187
7824B5657J0434j3918j6126k5076j2315M725l4j1198j5866r088j9308R96J292
7811g9825j2442j2631P009j9758J2168J6675J7598j6820j231J6697L4838K0058
$$ plain form
7898 37611 23122 10876 13405 94977 87525 37933 55147 15987 -5591 22664 17809 10683 -12186
7885 -12186 -24483 -76682 -80804 -39102 -64920 -125720 -112072 -40717 -22221 546 -72643 -72085
7873 -72085 -12754 -3425 43800 23680 7703 -36586 -79119 -66638 -23531 17891 23274 -12555
7861 -12555 -20163 -79027 -121478 -66007 -76273 -76577 -83008 -60507 -38144 -36672 -82052 -100837 -95315
7848 -95315 -69994 -39990 -26281 -45959 -43914 -43552 -27661 1304 34488 22988 -68380 -103092
7836 -103092 -79950 20199 52698 23500 5455 -46139 -56135 -81307 -71277 -5760 27844 25657
7824 25657 36091 22173 6047 -19029 -31344 -26619 -26653 -37851 -53717 -62805 -82113 -81117 -79825
7811 -79825 -92267 -104898 -97889 -117647 -105479 -88804 -71206 -88026 -89257 -72560 -37722 -17664
7799a7664k7557j1360K7302J3465k0939k7421L5542L7902L4151j5278l9092k2923
7787c3872n5508l331p388J05063L1780j1801p642O076j2854l1668J6953N07K2659
7774A8974j1371j2394k3533K0823N819k1412J4104J8278o1096l4285M5737K2030
7762a8326l4960J3050J0346k2811m6182K4109N8866n599P892l6132j61N8764J2518
7749B1374j6739j0360m265L0406K0911m4853K366l3625K5819n231n3204J6175
7737e1226j6812R422p281J4627L3949j5841k599K3061R270j642n461k4175k6807
7724f1515K4758p992r41K9762j0483k5773L2133K2243k1315k0766j8793M846L4451
7711a9385L4385J6280m0607L8282j8525o3739j40k1831K6572K1085k3116J0552
$$ plain form
7799 -17664 -45221 -56581 -29279 -15814 -36753 -64174 -28632 9270 43421 28143 -10949 -33872
7787 -33872 -89380 -92711 -100099 4964 36744 24943 17301 23377 10523 -21145 -4192 -3685 18974
7774 18974 7603 -4791 -28324 -7501 -1682 -23094 -8990 9288 -51808 -86093 -40356 -18326
7762 -18326 -53286 -40236 -29890 -52701 -98883 -74774 -15908 -21507 -13615 -49747 -49908 8856 21374
7749 21374 4635 -5725 -9990 20416 41327 -3526 -1160 -34785 -8966 -14197 -67401 -51226
7737 -51226 -68038 -58616 -65897 -51270 -17321 -33162 -35761 -12700 -3430 -5072 -10533 -34708 -61515
7724 -61515 -36757 -44749 -45690 -15928 -26411 -52184 -20051 2192 -19123 -39889 -58682 -53836 -19385
7711 -19385 15000 31280 -9327 28955 10430 -53309 -53449 -75280 -48708 -27623 -50739 -40187
7699d0187q847N6583N3543o2845l8548J2472M7166M149j9626l0656M2714j9683
7687c765l4182j8072L675m34m10j6993k0554J6195j8555o3098l89L3850K6106
7674i6626N6441P22P8579M2517r2488j474J2769N2531r381o4589n4634j3704j8391
7661a07728K0952J1538P200K1991r306N203J1422L4949K3223l000j2111J6669
7649B1002n0986l5690L0032L545m2046K0560N1154k2974j7649K756J5752J900
7637b2644m5421l5253L1027P3772j8820L0240o985J0994M478n278o3829j9127
7625f6846L7437L3215q365M339l6755m4693J3270L5926N0060K7171K40m2907N636
7612G728L464l555k1163j5529L7277m325j7181k317N8335J8725o9492l8747K0786
$$ plain form
7699 -40187 -49034 7549 61092 -1753 -40301 -27829 19337 23486 3860 -26796 15918 -3765
7687 -3765 -37947 -56019 -52344 -52778 -53188 -70181 -90735 -74540 -93095 -156193 -156582 -122732 -96626
7674 -96626 -40185 -39463 39116 81633 -10855 -12329 440 52971 43590 -20999 -75633 -89337 -107728
7661 -107728 -86776 -75238 -68038 -46047 -55353 -50150 -38728 -3779 19444 16444 4333 21002
7649 21002 -29984 -65674 -35642 -32097 -74143 -53583 -2429 -25403 -43052 -40296 -24544 -22644
7637 -22644 -68065 -103318 -72291 1481 -17339 12901 5916 16910 21388 16110 -47719 -66846
7625 -66846 -29409 3806 -4559 -220 -36975 -81668 -68398 -32472 17588 44759 44999 2092 7728
7612 7728 11192 7637 -13526 -29055 8222 3897 -13284 -15601 42734 61459 -8033 -46780 -25994
7599b5994L820P590q573N2160k5282J3408J9528j0729j4848p440o535J2778r959
7586g6J502n269J401K319o4236K2883L4349J1645o2025L040J8000K5388p784K0503
7572A640m1684q823J485O121p745j6289R210K5813j5338L7145j1271Q760q744
7559a9720o2334l8718L7364L7342k1519M4933N714o045J042J2220k4521n857P956
7546c2143L4734J3851M622j2317P484P264o461K4650Q846J3072k5213n8106l127
7533b2844m00m5259N041P7991J0331k7439p418Q644j5863k5977k5655p203J7919
7520e8132K5957r190k4010K4708q913n279j6770n0762M7045K7111k382n330L5040
7507b0907N3605j3134j0719O182L3923L9857R918o4272l0014j1267K7893m6503
$$ plain form
7599 -25994 -22174 -14584 -23157 29003 3721 17129 36657 25928 11080 3640 -2895 9883 -76
7586 -76 1426 -3843 -2442 -123 -64359 -41476 -7127 4518 -57507 -54467 -36467 -11079 -18863 1640
7572 1640 -40044 -48867 -47382 -41261 -49006 -65295 -56085 -30272 -45610 -8465 -19736 -10976 -19720
7559 -19720 -82054 -120772 -83408 -46066 -67585 -22652 -16938 -22983 -21941 -9721 -34242 -40099 -32143
7546 -32143 2591 16442 21064 8747 16231 23495 17034 41684 50530 63602 38389 -19717 -22844
7533 -22844 -23244 -68503 -63462 14529 24860 -2579 -9997 -1353 -17216 -43193 -68848 -76051 -58132
7520 -58132 -32175 -41365 -65375 -40667 -49580 -54859 -71629 -122391 -75346 -48235 -50617 -55947 -20907
7507 -20907 32698 19564 8845 15027 48950 88807 98725 34453 4439 -6828 21065 -25438
7495b5438k8675N0861K1081n181k788n265L6745r782l4257K2626l4112o1528j9076
7482i4789L2380L7357j735L0888n749L61m1749P705j8752J4523L4594J9952k0073
7469e087K0024k0050K1017K3376n5761m844K459m0933k0174J1494K0192L8578
7457i709J007l2909J7229o599j3519J7963m2879M1766L7893N6702K691m9100p849
7444A2687m56J9057m3813K2819K6306j8498k3430j7878M1810K2078k7535l0863
7432a7716l3598K1364K1739l2537J7698K041o805m8032j4343l8962K6520M9739
7420e2892K4877l172k7987k3184K7427L9550p2267l139M0266M6991o216k9084
7408c8830O568L9666j8216N598j5979L2896K1612j6279k6556l0349L3555L050
$$ plain form
7495 -25438 -54113 -3252 17829 12648 9860 4595 41340 31558 -2699 19927 -14185 -75713 -94789
7482 -94789 -62409 -25052 -26787 4101 -1648 -1287 -43036 -35331 -54083 -39560 -4966 14986 -5087
7469 -5087 14937 -5113 15904 39280 -16481 -21325 -18866 -59799 -79973 -68479 -48287 -9709
7457 -9709 -8702 -41611 -24382 -30981 -44500 -26537 -69416 -27650 10243 66945 69636 20536 12687
7444 12687 12231 31288 -12525 10294 36600 18102 -5328 -23206 18604 40682 13147 -17716
7432 -17716 -51314 -29950 -8211 -40748 -23050 -21009 -27814 -75846 -90189 -129151 -102631 -52892
7420 -52892 -28015 -31187 -59174 -82358 -54931 -15381 -87648 -90787 -50521 -3530 -9746 -38830
7408 -38830 -32262 7404 -10812 -5214 -21193 11703 33315 17036 -9520 -39869 -6314 -3264
7396c264J5847J59o480o037n82k1431L8144J4791j2119N1204k0331l1222j9720
7383a041K0604k4314P830m0774Q13P387K51M0456k8887j7952K5125O735j4200
7370a7967K802j4502l6958l9209N8742P5562K6631k5671K6231K7765j4563J651
7358G0514q949q6724j2505L2930K9083N184p947J9954j2260n1139M984R487P272
7345a16m2000l4413K6073p519m5277N3982L6657m9292L088K4479m1026j0814K3521
7332f2657M406m2735M4979O686K279n3481k9240j7516L7911O45J2670K8335J6191
7319e1527O829K4140N1905R828k3226j3781L7929M0144l3233o6810n474M3835
7307B0559n191j8708L543M6675L3178p1378k8641j2252m2849P552L5598N0216
$$ plain form
7396 -3264 12583 12742 6262 225 -357 -21788 16356 31147 19028 70232 49901 18679 -1041
7383 -1041 19563 -4751 3079 -37695 -36882 -29495 -29244 11212 -17675 -35627 -10502 -3767 -17967
7370 -17967 -15165 -29667 -66625 -105834 -47092 28470 55101 29430 55661 83426 68863 70514
7358 70514 61565 -25159 -37664 -4734 24349 29533 21586 41540 29280 -21859 -16875 -7388 -116
7345 -116 -42116 -76529 -50456 -57975 -103252 -49270 -12613 -61905 -58817 -34338 -75364 -86178 -62657
7332 -62657 -58251 -100986 -56007 -49321 -47042 -100523 -129763 -147279 -109368 -108723 -96053 -67718 -51527
7319 -51527 -44698 -20558 31347 41175 17949 4168 42097 82241 49008 -17802 -23276 20559
7307 20559 15368 -3340 203 46878 80056 8678 -19963 -32215 -75064 -67512 -31914 18302
7295A8302J3816K9901J4890k9266j6512J8913L1357k9764k4633j6122L4883k0542
7283B5223q730P061o3493r737j0628k0406L972L938j2090J5991K993J3867m884
7270e6923J9948o549j352M038L0143K2504k3631l4283L8824P745k6049l2644r1892
7257a50121J3977N4605Q5842K6466p1442K7532P704p1341o2831K8208M4392L2185
7245c4824Q407q309k5610P657n919k6686j3203J0415M4730j3952l3000j6103J1456
7232i4941O192k0281p248L5146J7398j086m2578M559N9941L4123k3776J3127M1201
7219B1777m64m658J8205k868p0077R943j0743o4440k5734j161L9732O2238M7531
7206A9281Q054k9325k8305K664K9800l0931q255K1172L2765j6056n1701l7075
$$ plain form
7295 18302 32118 62019 76909 47643 31131 50044 81401 51637 27004 10882 45765 25223
7283 25223 16493 23554 -39939 -49676 -60304 -80710 -76738 -72800 -84890 -68899 -65906 -52039 -56923
7270 -56923 -36975 -43524 -44876 -40838 -10695 11809 -11822 -46105 -7281 464 -25585 -58229 -150121
7257 -150121 -136144 -81539 4303 30769 -40673 -13141 -5437 -76778 -139609 -111401 -67009 -34824
7245 -34824 -26417 -34726 -60336 -52679 -58598 -85284 -98487 -88072 -43342 -57294 -90294 -106397 -94941
7232 -94941 -88749 -109030 -116278 -81132 -63734 -64820 -107398 -102839 -42898 -8775 -32551 -19424 21777
7219 21777 21313 16655 34860 31992 -38085 -28142 -38885 -103325 -129059 -130220 -90488 -28250 19281
7206 19281 27335 -1990 -30295 -27631 2169 -28762 -37017 -15845 16920 864 -50837 -87912
7194h7912O2621K3875k7200p301L2407l0789k2020o337J1654k4167o0242j4690
7182a50101M6852M1031M561J3276M3473K8330l1523k1886k881R554J2562n379
7170a2131M7695J0866j2745m8187K004M779J4416j852k9959m878l2541k1601J0266
7157g3868L9129K1469K0249K6948K3072m5159j0223j0969q729l513k5912J9325
7145b8181M1027K2825J0702J5608j6593k8083l0252k789j5750N2392n615l0976
7133a5685j0927L2351r637n6436k6479n123j5384M3805P801K8147L8458m1809
7121c0918q69L4789r756k2096k2323n78j3863L1976J7980k99M797J0098K24k1545
7107b2383j1596P4575o7846n5280j2211K2278J0601M1898J10986K1074k8862l5902
$$ plain form
7194 -87912 -25291 -1416 -28616 -35917 -3510 -34299 -56319 -62656 -51002 -75169 -135411 -150101
7182 -150101 -103249 -62218 -57657 -44381 -908 27422 -4101 -25987 -28868 -19314 -6752 -12131
7170 -12131 35564 46430 33685 -14502 -12498 -7719 6697 4845 -25114 -29992 -62533 -84134 -73868
7157 -73868 -34739 -13270 6979 33927 56999 11840 1617 -9352 -18081 -21594 -47506 -28181
7145 -28181 12846 35671 46373 61981 45388 17305 -12947 -15736 -31486 20906 15291 -15685
7133 -15685 -26612 5739 -3898 -60334 -86813 -91936 -107320 -63515 -55714 -27567 10891 -30918
7121 -30918 -31787 3002 -6754 -28850 -51173 -51751 -65614 -33638 -15658 -15957 -11160 -1062 -838 -22383
7107 -22383 -33979 40596 -27250 -82530 -94741 -72463 -61862 -19964 91022 112096 83234 47332
7095D7332q999J077q240j4948j9744J7354r714n4040o317L308K3451L0616j7065
7082a5929K5284K3095J9273K3205l1440j0573l2359o1203P486L1642K2327p730
7070f922n3377m9353Q801L7520L8535j614j2552l376l66N821K5446N0593m8322
7057i166m7317L3386j8142l9306O1381L4252n0275l8076m3452Q1538M7394n858
7045F359K2843K2922O060n4251O337n982k6117n2569N8740k23O634J6943Q789
7032A6485J3190l5853k3738K5491k4068j8380k3041J3340N4191Q957o449K8019
7020B8144J1551o754K0782j2654k8764k3040j9261M6475L7000o0991m7923q795
7008f4230K3118k0671M1702K6044j4608K0734J8187j0530L2662n743J9881K180
$$ plain form
7095 47332 38333 39410 31170 16222 -3522 13832 4118 -49922 -56239 -52931 -29480 1136 -15929
7082 -15929 9355 32450 51723 74928 43488 32915 556 -60647 -53161 -21519 808 -6922
7070 -6922 -60299 -109652 -100851 -63331 -24796 -26410 -38962 -42338 -42704 -36883 -11437 39156 -9166
7057 -9166 -56483 -23097 -41239 -80545 -19164 15088 -35187 -73263 -116715 -35177 12217 6359
7045 6359 29202 52124 58184 3933 10270 4288 -21829 -74398 -15658 -15881 -9247 7696 16485
7032 16485 29675 -6178 -29916 -4425 -28493 -46873 -69914 -56574 -2383 6574 125 28144
7020 28144 39695 32941 53723 41069 12305 -10735 -29996 16479 53479 -7512 -55435 -64230
7008 -64230 -41112 -61783 -20081 5963 -8645 12089 30276 19746 52408 46665 66546 68726
6996F8726J8528O473m8374j3021J743l1537L304J511R141M2233m1121m2492q037
6983c2923o005K736m9864m251P2515M7645k063K2676k4668l4214q3273j0426N3981
6970d8134O5374j7628k3162q149p538k549j9852k3977q388J6647J7906L0722P329
6957b1399L493K7024n254l2630l5772J9449K8933J8589N9000k2365l1790p088
6945A90m5369N70O1474j4567K0017J334l8668L7169L3926J8326r629j2391k2151
6932C0231o0338l990J8960J5577O871J2165j2750P255j9399J0961n0380J0089
6920c4748N1534j5956j7422L7237J2402k2618p925J0967m202k7377n5538L2055
6908d1591K2905J4361k5996o320L083K4152N9950J8044K3124k2104j1830K8118
$$ plain form
6996 68726 87254 93727 45353 32332 34075 2538 5842 7353 16494 58727 17606 -24886 -32923
6983 -32923 -38928 -36192 -86056 -90307 -17792 29853 27790 50466 25798 -8416 -91689 -102115 -48134
6970 -48134 17240 -388 -23550 -31699 -39237 -41786 -61638 -85615 -94003 -77356 -59450 -28728 -21399
6957 -21399 -17906 9118 3864 -28766 -64538 -45089 -16156 2433 61433 39068 7278 190
6945 190 -45179 -44609 16865 2298 22315 23649 -15019 22150 56076 74402 64773 52382 30231
6932 30231 -30107 -34097 -15137 440 7311 19476 6726 13981 -5418 5543 -44837 -34748
6920 -34748 16786 830 -16592 20645 33047 10429 2504 13471 9269 -18108 -73646 -41591
6908 -41591 -18686 -4325 -30321 -36641 -33558 -9406 50544 68588 91712 69608 57778 85896
6896H5896J2525L185k9380n7645j8538j6715L3062k7953K6396K1539o3567j7649
6884d8844P174m6578l6831J9933P8701K9647L46j7786m860r982L9456j6361J8489
6871A2504J4416q2587k8726k6508l0433O2893M8573j3690N51O51l8161j3389L134
6858i0772L1146J9456O633O50K0418K2987n721l1799o593L3512P045m1793l1833
6845f6664r607J6823l967J8410O8384j9445M969l9809L3323J0714k3674N332P826
6832B615N5364k7127k1409l3847J5943O209r359J2614l0223O105k1389k4663J3469
6819e5698L8624n262j68l1615n738J8523L2007k9436j7559Q903L9084K1690L4271
6806D7626l7605n5241J5302K4803N336l4466n5727Q222M4451N2515n844J5201
$$ plain form
6896 85896 98421 101606 72226 14581 -3957 -20672 12390 -15563 10833 32372 -31195 -48844
6884 -48844 -41670 -88248 -125079 -105146 -26445 3202 3548 -14238 -19098 -29080 10376 -5985 12504
6871 12504 26920 -55667 -84393 -110901 -141334 -78441 -29868 -43558 -43007 -42356 -80517 -93906 -90772
6858 -90772 -59626 -40170 -33537 -32887 -12469 10518 4797 -27002 -33595 -83 6962 -34831 -66664
6845 -66664 -76271 -59448 -63415 -45005 23379 3934 8903 -30906 2417 13131 -10543 -5211 2615
6832 2615 57979 30852 9443 -24404 -8461 -2252 -11611 1003 -29220 -23115 -44504 -69167 -55698
6819 -55698 -17074 -22336 -22504 -54119 -59857 -41334 -9327 -38763 -56322 -47419 -8335 13355 47626
6806 47626 10021 -45220 -29918 -5115 221 -34245 -89972 -81750 -37299 15216 9372 24573
6794B4573l4013k0140P684R692K9572K1999l727m9702j8530L1826R830j7219o5171
6781g3326j3015L0906P2039K1694k8042j6502n0390J1895N9833l1565k6658j6106
6769e9237M2104N0347k5110k0001R315o7286j7965L7293K8870J8534P587L7031
6757D1482m7646o2758M920M9518k373k9299j9836l382L1122O2898J760J0755l3285
6744C876m344m9151L9488J8904l5893j5072K1917L3518O610j4980n370J1317O785
6731A7605k1058j3366m278L2477K8870j5622J7153L1068K1251r091l2541m7001
6719E467J5369l4038Q486p769J6705p784P874k7715L2492L6182j9038m8657J4611
6706g815p128q195O8132P204l6326n4873l2234K3223L1756K9795k989P875K5538
$$ plain form
6794 24573 -9440 -29580 -21896 -12204 17368 39367 35640 -14062 -32592 -766 9064 -8155 -73326
6781 -73326 -86341 -55435 16604 38298 10256 -6246 -56636 -44741 15092 -16473 -43131 -59237
6769 -59237 -17133 33214 8104 -11897 -2582 -69868 -87833 -50540 -21670 -3136 4451 41482
6757 41482 -6164 -68922 -64002 -14484 -16857 -46156 -65992 -69374 -38252 24646 26406 37161 3876
6744 3876 -468 -49619 -10131 8773 -27120 -42192 -20275 13243 19853 4873 -497 10820 17605
6731 17605 -3453 -16819 -21097 11380 40250 24628 41781 72849 94100 85009 52468 5467
6719 5467 20836 -13202 -4716 -12485 4220 -3564 4310 -23405 9087 45269 26231 -22426 -7815
6706 -7815 -14943 -23138 44994 52198 15872 -39001 -71235 -48012 -16256 13539 10550 18425 43963
6693D3963J5240n0625l6522m118K25k4530l3619K5377L3767L6954j4920j9046
6681b7854k283J1573Q903K0931n9723j6755L3541K0124l1953R976j8777K8087
6669b4210K8345J0469m7832N276L3789N7679K394K3220m8595j7336j5770j4262
6657f833J4543J2752j240J971J1652J8205j8587l5857m7377l4939k234L7076J8814
6644c2054M0643J1594O808J3541k3759j0350K3737Q217k5765n5448k6371K1255
6632d7952J5446Q484j9919j5336K6710K5754L3834k2604k4044J684j5346k1527
6620e4816q899L3726M1614J0153j9481J8807J8024l4843k6946r496K3452p796
6608a6501Q610k9156j3232O9425L6381j5347O654O700J5641m0175k8956j29k6630
$$ plain form
6693 43963 59203 8578 -27944 -32062 -31837 -56367 -89986 -64609 -30842 6112 -8808 -27854
6681 -27854 -30137 -18564 -9661 11270 -48453 -65208 -31667 -11543 -43496 -33520 -52297 -24210
6669 -24210 4135 14604 -33228 -27952 5837 63516 65910 89130 40535 23199 7429 -6833
6657 -6833 7710 20462 19222 21193 32845 51050 32463 -3394 -50771 -85710 -87944 -50868 -32054
6644 -32054 8589 20183 26991 40532 16773 6423 30160 38377 12612 -42836 -69207 -47952
6632 -47952 -32506 -24022 -43941 -59277 -32567 -6813 27021 4417 -19627 -17943 -33289 -54816
6620 -54816 -63715 -29989 11625 21778 2297 21104 39128 4285 -22661 -32157 -8705 -16501
6608 -16501 -7891 -37047 -50279 19146 55527 40180 46834 53534 69175 29000 44 -85 -26715
6595b6715l7388q539R4194N5382p3551k2335j4058K2060o380k2722J6676M8645
6583B5269m5898m2211o189p319l118L8798M3220J1175k7304j640K4373Q418l5220
6570a7646m3639j7725J4712M7298J3677j7876K1355L8129j6617j5467q749J4933
6558A2385l3185M364J037K701P880K9866l6246n5769k6141J283K255O3133N4901
6545B8464j0998m7430o661r516J9149J5772k3235K8324L7739K888j9606R304j9184
6532E010k8323J2944Q293j7733M976L725J4620j851K9611j8422k5543n393j203
6519a9289l9652k6803l932K5597L1769M3734r69j131k601l9148j450K4763o4675
6506g3787O517K6479P735k119J4316L1754j0159j9362J0367j0348K5027o695K1481
$$ plain form
6595 -26715 -64103 -72642 21552 76934 3383 -18952 -33010 -10950 -17330 -40052 -23376 25269
6583 25269 -20629 -62840 -69029 -76348 -79466 -40668 2552 13727 -13577 -15217 9156 17574 -17646
6570 -17646 -61285 -79010 -64298 -17000 -3323 -21199 156 38285 21668 6201 -2548 12385
6558 12385 -20800 -16436 -15399 -12698 -4818 25048 -11198 -66967 -93108 -91825 -89570 -26437 28464
6545 28464 17466 -29964 -36625 -46141 -26992 -11220 -34455 -6131 31608 34496 14890 24194 5010
6532 5010 -23313 -10369 -2076 -19809 -14833 -11108 3512 1661 31272 12850 -12693 -18086 -19289
6519 -19289 -58941 -85744 -89676 -64079 -32310 11424 10455 9324 6723 -32425 -33875 -9112 -73787
6506 -73787 -67270 -40791 -33056 -35175 -20859 10895 736 -18626 -8259 -18607 6420 -275 21206
6493B1206j8584M393L8090l3540k9722L276l5930J5894K1615k6429m436J4318
6481b9849L7761l51k6196J4874P907K6021o287K5477j9192j3707l4412m8661j3049
6468g9664N731J6491J0163N5969K1171k1505k3478K6906o6734n862M2591J6811
6456a410k2694n847O210Q28M709k5096m999N7328r213j2112J1985j9309l4265
$$ plain form
6493 21206 2622 7015 45105 11565 -18157 -14881 -50811 -34917 -13302 -39731 -44167 -29849
6481 -29849 7912 7561 -18635 -3761 4146 30167 23880 49357 30165 16458 -17954 -66615 -79664
6468 -79664 -73933 -57442 -47279 8690 29861 8356 -15122 11784 -54950 -60812 -18221 -1410
6456 -1410 -24104 -29951 -23741 -22913 -18204 -43300 -48299 9029 -184 -12296 -311 -19620 -53885
$$ [...]
##END NTUPLES=NMR SPECTRUM
##END=
