##TITLE=Analysis number 319598
Compound Code cc 48705
Book Reference 404/186/3
Project Code adrs
Chemist Name janep
##JCAMPDX= 6.0         $$ Bruker NMR JCAMP-DX V2.0
##DATA TYPE= NMR SPECTRUM
##DATA CLASS= NTUPLES
##ORIGIN= Bruker BioSpin GmbH
##OWNER= nmr
$$ XWIN-NMR		Version 3.5
$$ Mon May 22 09:06:53 2006 GMT Daylight Time (UT+1h)  MAYBRIDGE\nmr@NMR_250MHZ
##.OBSERVE FREQUENCY= 250.131544655141
##.OBSERVE NUCLEUS= ^1H
##.ACQUISITION MODE= SIMULTANEOUS (DQD)
##.ACQUISITION SCHEME= undefined
##.AVERAGES= 16
##.DIGITISER RES= 18
##SPECTROMETER/DATA SYSTEM= dpx250
##.PULSE SEQUENCE= zg30
##.SOLVENT NAME= CDCl3
##.SHIFT REFERENCE= (INTERNAL, CDCl3, 0, 16.522)
##AUDIT TRAIL= $$ (NUMBER, WHEN, WHO, WHERE, WHAT)
$$ ##TITLE= Audit trail, XWIN-NMR		Version 3.5
$$ ##JCAMPDX= 5.01
$$ ##ORIGIN= Bruker BioSpin GmbH
$$ ##OWNER= nmr
$$ C:\u/data/dgb/nmr/ADRS/4830/pdata/1/auditp.txt
$$ ##AUDIT TRAIL=  $$ (NUMBER, WHEN, WHO, WHERE, WHAT)
(   1,<2006-05-22 09:06:16.73 +100>,<MAYBRIDGE\nmr>,<NMR_250MHZ>,
      <created by zg, POWCHK disabled, PULCHK disabled
       configuration hash MD5:
       84 BC 41 DB A1 6E 1D 46 DA 25 12 A5 C1 ED C5 3A
       data hash MD5: 64K
       AC 33 D6 7E BC 6C 4F 7E 02 23 A2 62 72 26 5E 4F>)
(   2,<2006-05-22 09:06:35.41 +100>,<MAYBRIDGE\nmr>,<NMR_250MHZ>,
      <Start of raw data processing
       ef LB = 0.3 FT_mod = 6 PKNL = 1 SI = 32K 
       data hash MD5: 32K
       18 8A 4C F7 6A 6F 23 2C B5 48 30 14 F5 4D CC 82>)
(   3,<2006-05-22 09:06:37.80 +100>,<MAYBRIDGE\nmr>,<NMR_250MHZ>,
      <apk 
       data hash MD5: 32K
       B8 81 EF 7B 24 B1 06 C2 5B ED 8B B7 E7 F0 CE F2>)
(   4,<2006-05-22 09:06:41.80 +100>,<MAYBRIDGE\nmr>,<NMR_250MHZ>,
      <abs ABSG = 5 
       data hash MD5: 32K
       5F 6A 3B F9 86 11 9F 3F 9F 6D 6F A5 08 5C D0 A3>)
$$ ##END=
$$ 
$$ hash MD5
$$ DE A9 87 4F 0B 4B 39 04 4E ED 3B FE FF 2E 5F E2
##$RELAX= 
##$RELAX= 
##$RELAX= 
##$RELAX= 
##$RELAX= 
##$RELAX= 
##$RELAX= 
$$ Bruker specific parameters
$$ --------------------------
##$DU= <C:\u>
##$EXPNO= 4830
##$NAME= <ADRS>
##$PROCNO= 1
##$TYPE= <nmr>
##$USER= <dgb>
##$AMP= (0..31)
100 100 100 100 100 100 100 100 100 100 100 100 100 100 100 100 100 100 
100 100 100 100 100 100 100 100 100 100 100 100 100 100 
##$AQSEQ= 0
##$AQ_mod= 3
##$AUNM= <au_zg>
##$AUTOPOS= <2 >
##$BF1= 250.13
##$BF2= 250.13
##$BF3= 250.13
##$BF4= 250.13
##$BF5= 500.13
##$BF6= 500.13
##$BF7= 500.13
##$BF8= 500.13
##$BYTORDA= 1
##$CFDGTYP= 0
##$CFRGTYP= 5
##$CHEMSTR= <none>
##$CNST= (0..31)
1 1 145 1 1 1 1 1 1 1 1 1 1 1 1 1 1 1 1 1 1 1 1 1 1 1 1 1 1 1 1 1 
##$CPDPRG= <>
##$CPDPRG1= <>
##$CPDPRG2= <>
##$CPDPRG3= <>
##$CPDPRG4= <mlev>
##$CPDPRG5= <mlev>
##$CPDPRG6= <mlev>
##$CPDPRG7= <mlev>
##$CPDPRG8= <mlev>
##$CPDPRGB= <>
##$CPDPRGT= <>
##$D= (0..31)
0 1 0 0 0 0 0 0 0 0.06 0 0 0 0 0 0 0.0002 0 0 0 0 0 0 0 0 0 0 0 0 0 0 
0 
##$DATE= 1148285174
##$DBL= (0..7)
120 120 120 120 120 120 120 120 
##$DBP= (0..7)
150 150 150 150 150 150 150 150 
##$DBP07= 0
##$DBPNAM0= <>
##$DBPNAM1= <>
$$ [...]
##$SUBNAM7= <"">
##$SUBNAM8= <"">
##$SUBNAM9= <"">
##$SW= 20.6930455092707
##$SWIBOX= (0..15)
0 0 3 0 0 0 0 0 0 0 0 0 0 0 0 0 
##$SW_h= 5175.983436853
##$TD= 65536
##$TD0= 1
##$TE= 294.16
##$TE2= 300
##$TE3= 300
##$TEG= 300
##$TL= (0..7)
0 120 120 120 120 120 120 120 
##$TP= (0..7)
150 150 150 150 150 150 150 150 
##$TP07= 0
##$TPNAME0= <>
##$TPNAME1= <>
##$TPNAME2= <>
##$TPNAME3= <>
##$TPNAME4= <>
##$TPNAME5= <>
##$TPNAME6= <>
##$TPNAME7= <>
##$TPOAL= (0..7)
0.5 0.5 0.5 0.5 0.5 0.5 0.5 0.5 
##$TPOFFS= (0..7)
0 0 0 0 0 0 0 0 
##$TUNHIN= 0
##$TUNHOUT= 0
##$TUNXOUT= 0
##$USERA1= <user>
##$USERA2= <user>
##$USERA3= <user>
##$USERA4= <user>
##$USERA5= <user>
##$V9= 5
##$VALIST= <valist>
##$VCLIST= <CCCCCCCCCCCCCCC>
##$VD= 0
##$VDLIST= <DDDDDDDDDDDDDDD>
##$VPLIST= <PPPPPPPPPPPPPPP>
##$VTLIST= <TTTTTTTTTTTTTTT>
##$WBST= 1024
##$WBSW= 4
##$XGAIN= (0..3)
0 0 0 0 
##$XL= 0
##$YL= 0
##$YMAX_a= 438814
##$YMIN_a= -428028
##$ZGOPTNS= <>
##$ZL1= 120
##$ZL2= 120
##$ZL3= 120
##$ZL4= 120
##$ABSF1= 16.522
##$ABSF2= -4.171173
##$ABSG= 5
##$ABSL= 3
##$ALPHA= 0
##$AQORDER= 0
##$ASSFAC= 0
##$ASSFACI= 0
##$ASSFACX= 0
##$ASSWID= 0
##$AUNMP= <proc_1d>
##$AZFE= 0.1
##$AZFW= 0.1
##$BCFW= 0
##$BC_mod= 0
##$BYTORDP= 0
##$COROFFS= 0
##$CY= 12.5
##$DATMOD= 1
##$DC= 0
##$DFILT= <>
##$DTYPP= 0
##$F1P= 14.0000005364418
##$F2P= -0.99999901652339
##$FCOR= 0.5
##$FTSIZE= 32768
##$FT_mod= 6
##$GAMMA= 0
##$GB= 0
##$INTBC= 1
##$INTSCL= 1
##$ISEN= 128
##$LB= 0.3
##$LEV0= 0
##$LPBIN= 0
##$MAXI= 10000
##$MC2= 0
##$MEAN= 0
##$ME_mod= 0
##$MI= 0
##$NCOEF= 0
##$NC_proc= -3
##$NLEV= 6
##$NOISF1= 0
##$NOISF2= 0
##$NSP= 0
##$NTH_PI= 0
##$NZP= 0
##$OFFSET= 16.522
##$PC= 1
##$PHC0= 172.6826
##$PHC1= 7.235639
##$PH_mod= 1
##$PKNL= yes
##$PPARMOD= 0
##$PSCAL= 4
##$PSIGN= 0
##$REVERSE= no
##$SF= 250.13
##$SI= 32768
##$SIGF1= 0
##$SIGF2= 0
##$SINO= 400
##$SIOLD= 32768
##$SREGLST= <1H.CDCl3>
##$SSB= 0
##$STSI= 32768
##$STSR= 0
##$SW_p= 5175.98343685301
##$SYMM= 0
##$S_DEV= 0
##$TDeff= 65536
##$TDoff= 0
##$TI= <Analysis number 999999
Compound Code 99
Book Reference 9
Project Code 9>
##$TILT= no
##$TM1= 0
##$TM2= 0
##$TOPLEV= 0
##$USERP1= <user>
##$USERP2= <user>
##$USERP3= <user>
##$USERP4= <user>
##$USERP5= <user>
##$WDW= 1
##$XDIM= 32768
##$YMAX_p= 279549546
##$YMIN_p= -227152
$$ End of Bruker specific parameters
$$ ---------------------------------
##NTUPLES= NMR SPECTRUM
##VAR_NAME=  FREQUENCY,     SPECTRUM/REAL,   SPECTRUM/IMAG
##SYMBOL=    X,             R,               I
##VAR_TYPE=  INDEPENDENT,   DEPENDENT,       DEPENDENT
##VAR_FORM=  AFFN,          ASDF,            ASDF
##VAR_DIM=   32768,         32768,           32768
##UNITS=     HZ,            ARBITRARY UNITS, ARBITRARY UNITS
##FACTOR=    0.157963299565203, 1,           1
##FIRST=     4132.6476996994, 0,             0
##LAST=      -1043.33573715361, 0,           0
##MIN=       -1043.33573715361, -227152,     0
##MAX=       4132.6476996994, 279549546,     0
$$ Real data points
##PAGE= N=1
##DATA TABLE= (X++(R..R)), XYDATA
$$ [...]
19309B6596419M153051K406206J001216j113067l019963j971112J023460M816081
$$ 26596419 30749470 33155676 34156892 33043825 30023862 28052750 29076210 33892291
19301C3892291Q930397J2002505J3289911J5047464J5934869P896151l531881
$$ 33892291 42822688 54825193 68115104 83162568 99097437 106993588 103461707
19294A03461707p014312j1246708j9817651j8240068j0946222n892527l055688
$$ 103461707 96447395 85200687 65383036 47142968 36196746 30304219 27248531
19287B7248531j286667q4932M85647Q171p21086j218971k256009l231589k757633
$$ 27248531 25961864 25876932 26362579 26370750 25649664 24430693 22174684 18943095 16185462
19278A6185462j881633j288559q59811o73291n17782m59210m41556m43437l99423
$$ 16185462 14303829 13015270 12155459 11482168 10964386 10505176 10063620 9620183 9220760
19269I220760m27477n51942m37619l61678k87785k62806k71238k33298j99475
$$ 9220760 8793283 8241341 7803722 7442044 7154259 6891453 6620215 6386917 6187442
19260F187442k02440j43029j03966j13264j49708j85663j13677o2685o3479q9881
$$ 6187442 5985002 5841973 5738007 5624743 5475035 5289372 5175695 5113010 5049531 4959650
19250D959650j09137k14854k10558j78891k50930k54976j60848o0423p5041o8463
$$ 4959650 4850513 4635659 4425101 4246210 3995280 3740304 3579456 3519033 3443992 3375529
19240C375529r1853j41502o6679o2543j14346j06849j32158j87644j55261p0316
$$ 3375529 3283676 3142174 3075495 3012952 2898606 2791757 2659599 2471955 2316694 2246378
19230B246378o6546n0392o2325L3989l0356j04430j12077j02502r0247m3370J022
$$ 2246378 2179832 2129440 2067115 2101104 2070748 1966318 1854241 1751739 1661492 1618122 1619144
19219A619144L078p710j8000m3508n3949o0633k7170n8569n5848l7881o1030l5813
$$ 1619144 1622222 1614512 1596512 1553004 1499055 1438422 1411252 1352683 1296835 1258954 1197924 1162111
19207A162111J0534o4817m3249O434j7330m7415p998k4346l0071J5950m3544m8218
$$ 1162111 1172645 1107828 1064579 1071013 1053683 1006268 998270 973924 943853 959803 916259 868041
19195H68041n0495o8841q4333o211j7947o809l1377M415k8117J7958K1747l3065
$$ 868041 817546 748705 664372 658161 640214 633405 602028 606443 578326 596284 618031 584966
19183E84966l6407n2015l7824l0563j2430j3336j0858L0660R267j1693m763k1832
$$ 584966 548559 496544 458720 428157 415727 402391 391533 422193 431460 419767 415004 393172
19171C93172J4895J7426k5304M4203L7868o9605p1214l7124m493j3629j5320o838
$$ 393172 408067 425493 400189 444392 482260 412655 341441 304317 299824 286195 270875 264037
19159B64037m268j2642P483M7571M7293k8469n2366Q885m8609J3331K9350J4718
$$ 264037 259769 247127 254610 302181 349474 321005 268639 277524 228915 242246 271596 286314
19147B86314L7277O692k989k5558L8175N9902k0507j04241p2363l5287l565M4721
$$ 286314 323591 330283 327294 301736 339911 399813 379306 275065 202702 167415 163850 208571
19135B08571J8326l1909o328M023J3729K2293N124n2795Q464M0945L6907k35J9303
$$ 208571 226897 194988 188660 192683 206412 228705 233829 181034 189498 230443 267350 267115 286418
19122B86418K2086J4253k5182o5558j0804K1701L5559m462l818R01J8326M2507
$$ 286418 308504 322757 297575 232017 221213 242914 278473 274011 270193 271094 289420 331927
19110C31927R698o149p2175p2702n388J0532K5708J8108j6323j1854j0140L5798
$$ 331927 341625 335476 263301 190599 185211 195743 221451 239559 223236 211382 201242 237040
19098B37040j5379M6612O705r093j7751j8971l1316k8154o3K2762J7434l6747
$$ 237040 221661 268273 274978 265885 248134 229163 197847 169693 169630 192392 209826 173079
19086A73079l7085P845J2462M6342l1418n7921J7515L0650K1064J9735N9907J7621
$$ 173079 135994 143839 156301 202643 171225 113304 130819 161469 182533 202268 262175 279796
19074B79796J6945k3667m8760o7747N123L772L093J2162J8937j1764j2443J2692
$$ 279796 296741 273074 224314 156567 161690 165462 168555 180717 199654 187890 175447 188139
19062A88139O6528K5183m2253q1691q878J04130J0985n604J5608j3009p6790k6144
$$ 188139 254667 279850 237597 155906 147028 251158 262143 256539 272147 259138 182348 156204
19050A56204K0728k5105j4461L5430r651K6099K1708m6565j7078K7309m336m7232
$$ 156204 176932 151827 137366 172796 163145 189244 210952 164387 147309 174618 170282 123050
19038A23050l5500L9842j2403n4665m3462J5015M0968O2397L3356J206M0287j3402
$$ 123050 87550 127392 114989 60324 16862 31877 72845 135242 168598 169804 210091 196689
19026A96689L1205k1423m870k9244J0282J9024k7066k1766n4498M3204J7677M0154
$$ 196689 227894 206471 201601 172357 182639 201663 174597 152831 98333 141537 159214 199368
19014A99368l6469K2818J4307J3281k9071n476L3036L7009P118j2718j4016J2343
$$ 199368 162899 185717 200024 213305 184234 178758 211794 248803 255921 243203 229187 241530
19002B41530p168L4555M5022k7196j10622j231O2424L6376j2741J4345O9343n855
$$ 241530 234362 268917 313939 286743 176121 174890 237314 273690 260949 275294 344637 338782
18990C38782k3551N5237J6693m1190j0289m6504o0915k4422J2832O2481M193M9991
$$ 338782 315231 370468 387161 345971 335682 289178 228263 203841 216673 279154 283347 333338
18978C33338J06869J8663k9669J5955k5948l3694k7938J3836p510q0968O445L0626
$$ 333338 440207 458870 429201 445156 419208 385514 357576 371412 363902 282934 289379 320005
18966C20005l3533l645J899L3428O7290N3576L6199Q4100J5118p5486r095L1508
$$ 320005 286472 282827 284726 318154 385444 439020 475219 559319 574437 498951 489856 521364
18954E21364J538n5714o5296k8517O6686N8858Q5290J9424l4477p9832k1170j7155
$$ 521364 522902 467188 401892 373375 440061 498919 584209 603633 569156 489324 468154 450999
18942D50999L3514O7375j0638J9084J0301l9309l7034o7171n4663n554j977K2775
$$ 450999 484513 551888 541250 560334 570635 531326 494292 427121 372458 366904 364927 387702
18930C87702J4207M1401K5143k1957l2319j0755K5397l2000n804M6194J22277
$$ 387702 401909 443310 468453 446496 414177 403422 428819 396819 391015 437209 559486
18919E59486R8471j4593j8040N9555N9576m451j4179J2456j3755l7146M4703M5692
$$ 559486 657957 643364 625324 684879 744455 740004 725825 738281 724526 687380 732083 777775
18907G77775J5810p615j7709n4174k9826L1087L1705N9906M2492j2579R4859O0198
$$ 777775 793585 785970 768261 714087 684261 715348 747053 806959 849451 836872 931731 991929
18895I91929j5866P1858P1494O8865J07345K30032J98185J56531J65088J34276
$$ 991929 976063 1047921 1119415 1188280 1295625 1525657 1723842 1880373 2045461 2179737
18885B179737J90718K14980K30134K84117L43310M96136P17247R32248R93469
$$ 2179737 2370455 2585435 2815569 3099686 3442996 3939132 4656379 5588627 6582096
18876F582096R55304J011270J202605J366660J855589K127907J452301Q07487
$$ 6582096 7537400 8548670 9751275 11117935 12973524 15101431 16553732 17361219
18868A7361219M40519n74608r92539J57293J880280L981757P209751J2388377
$$ 17361219 17801738 17227130 16234591 16391884 18272164 22253921 29463672 41852049
18860D1852049J8040696J8314596J3042136R927421N601988q791100j6422139
$$ 41852049 59892745 78207341 91249477 101176898 106778886 97987786 81565647
18853H1565647j2701610j1665075j1950052q048589l552847k25265K111750K559543
$$ 81565647 68864037 57198962 45248910 37200321 33647474 33422209 35533959 38093502
18845C8093502J121220m77569j973917m539274n981136m813388l118561j919799
$$ 38093502 39214722 38737153 36763236 32223962 26242826 21429438 18310877 16391078
18837A6391078j164244p66206n26725l18030k92512l05731l24781l06528k75105
$$ 16391078 15226834 14460628 13933903 13615873 13323361 13017630 12692849 12386321 12111216
18828A2111216p9931P3862L40119M75833M95288O80099R41198J080206J390304
$$ 12111216 12031285 12105147 12445266 12921099 13416387 14096486 15037684 16117890 17508194
18819A7508194K299869L436897M066267L476798K094167J021464l94374k419125
$$ 17508194 19808063 23244960 27311227 30788025 32882192 33903656 33509282 31090157
18811C1090157j937491Q71243M504103P716067Q839229R207648J1515897J1518013
$$ 31090157 29152666 30023909 34528012 42244079 51083308 60290956 71806853 83324866
18803H3324866L019595m014262m718395r242761j6850263j4080141q147213m496059
$$ 83324866 86344461 82330199 77611804 68369043 51518780 37438639 29291426 24795367
18795B4795367k479190j209473k63877K92400R8612m38503q38780j353596k237768
$$ 24795367 22316177 21106704 20842827 21135227 21233839 20795336 19956556 18602960 16365192
18786A6365192k263809j591302j090599p62924n63689m12818m13517m68048l95979
$$ 16365192 14101383 12510081 11419482 10656558 10092869 9680051 9266534 8798486 8402507
18777H402507l05580l59167l89973l39720k76317k05264k42526k10711j15872
$$ 8402507 8096927 7737760 7347787 7008067 6731750 6526486 6283960 6073249 5957377
18768E957377p5402j13915j86639j70771j58627j40537j78358j93168j87298k10985
$$ 5957377 5881975 5768060 5581421 5410650 5252023 5111486 4933128 4739960 4552662 4341677
18758D341677k18299k07557j74555j71991j05777j55742r6315j28155j28893p4877
$$ 4341677 4123378 3915821 3741266 3569275 3463498 3307756 3211441 3083286 2954393 2879516
18748B879516q0622r1214q2921l3905r1354r7992q2595n7746n7793p9325o5600
$$ 2879516 2798894 2707680 2624759 2590854 2499500 2401508 2318913 2261167 2203374 2124049 2058449
18737B058449k7266o2320o3928l3930K308m6259n7856k1163j0826j0222j6063
$$ 2058449 2031183 1968863 1904935 1871005 1873313 1827054 1769198 1748035 1737209 1726987 1710924
18726A710924p3788k4023l1787l5001j1772r627j9315m4142J0443J1942J7849
$$ 1710924 1637136 1613113 1581326 1546325 1534553 1524926 1505611 1461469 1471912 1483854 1501703
18715A501703k1481m3238R1605J46064J95112K58724K74702J22176R4893K201
$$ 1501703 1480222 1436984 1528589 1674653 1869765 2128489 2403191 2525367 2620260 2622461
18705B622461j34146k56117j83800p8281j2588R0009K34964M03102P24421P71916
$$ 2622461 2488315 2232198 2048398 1970117 1957529 2047538 2282502 2685604 3410025 4181941
18695D181941N39178K76490L9071l22281o83338n38247j49584Q0085K54728L89179
$$ 4181941 4721119 4997609 5036680 4714399 4031061 3492814 3343230 3423315 3678043 4067222
18685D067222M73031O68311J030501J479273K169985L631171O057489P308164
$$ 4067222 4540253 5208564 6239065 7718338 9888323 13519494 19576983 26885147
18677B6885147N009674K000477P34440k705837p385287n950005k821724p43238
$$ 26885147 31894821 33895298 34629738 31923901 24538614 18588609 15766885 15023647
18669A5023647Q67536K625199N244323R419749J3298855J2511177Q046879L671425
$$ 15023647 15891183 18516382 23760705 33180454 46479309 58990486 67037365 70708790
18661G0708790k559747j0836441j3912329j1514453o651304l246032j196492M11277
$$ 70708790 68149043 57312602 43400273 31885820 25234516 21988484 20791992 21203269
18653B1203269K282086N018804P766239O831838K675634J92047k193879q678639
$$ 21203269 23485355 28504159 36270398 43102236 45777870 45969917 43776038 35097399
18645C5097399j0109600o300891l356363j861602j180931q95606p39346o64817
$$ 35097399 24987799 18686908 15330545 13468943 12288012 11392406 10653060 9988243
18637I988243o46784n52178m41535l75301l08803j68695p4310j24293j70452k26640
$$ 9988243 9341459 8789281 8347746 7972445 7663642 7494947 7420637 7296344 7125892 6899252
18627F899252m23496n17732l93705k26175k15501j96270k10997j94980j65071
$$ 6899252 6475756 5958024 5564319 5338144 5122643 4926373 4715376 4520396 4355325
18618D355325j91951j71449j85168j56836j32343j40329j27379q2215r8205j16181
$$ 4355325 4163374 3991925 3806757 3649921 3517578 3377249 3249870 3167655 3069450 2953269
18608B953269j01155r2114l3670q0096j34197j30322r5874o3651j9878o0333o9355
$$ 2953269 2852114 2760000 2726330 2646234 2512037 2381715 2285841 2222190 2202312 2141979 2072624
18597B072624n3530k3424j0167l7443q7789Q08n1707o8936m3813q9812n0604O239
$$ 2072624 2019094 1995670 1985503 1948060 1860271 1861079 1809372 1740436 1696623 1606811 1556207 1562446
18585A562446n2331o286j3515k8873j06253m9729n4087K6002k7154o0332m7173
$$ 1562446 1510115 1503829 1490314 1461441 1355188 1305459 1251372 1277374 1250220 1189888 1142715
18574A142715j5520L4675j6363p9852l9984m0686n1105J4464n6357l4339n2471
$$ 1142715 1127195 1161870 1145507 1065655 1025671 984985 933880 948344 891987 857648 805177
18563H05177k1524m2584l4934k6145n3700l835k7104k3618k9467l7129J1238j6059
$$ 805177 783653 741069 706135 679990 626290 622455 595351 571733 542266 505137 516375 500316
18551E00316k8443k4671Q337N44k6244l383m4236j1624l867j7257j2631K7151
$$ 500316 471873 447202 455539 456083 429839 426456 382220 370596 366729 349472 336841 363992
18539C63992j5044j4674J2393j7258K3207p627L3008m5585p8665L4150Q088K9136
$$ 363992 348948 334274 346667 329409 352616 344989 377997 332412 253747 287897 295985 325121
18527C25121l894L580N0254O7574L7366q089l7199j3726J5605j287r191m8877
$$ 325121 321227 324807 375061 442635 480001 471912 434713 420987 436592 435305 426114 377237
18515C77237j3620k1277J6029M5257j1848k2658j0807K9623K788K803j4273j484
$$ 377237 363617 342340 358369 403626 391778 369120 358313 387936 390724 393527 379254 377770
18503C77770M6745O1061n7415L155M8925j7520l167L538k5000r1694m3667L1123
$$ 377770 424515 485576 428161 431316 480241 462721 459554 463092 438092 346398 302731 333854
18491C33854M3953j8691K1869M7635J9597j3687M8906L5824k8760l4388M2255
$$ 333854 377807 359116 380985 428620 448217 434530 483436 519260 490500 456112 498367
18480D98367l8669l9514j0264K3114M728m6182K8392O6374N595J5398M3358M3189
$$ 498367 459698 420184 409920 433034 437762 391580 419972 486346 491941 507339 550697 593886
18468E93886R349J0156m1857l7069K495k0162j5533Q6371O7538j3260j021L3780
$$ 593886 603235 613391 571534 534465 536960 516798 501265 587636 655174 641914 640893 674673
18456F74673O5774J5420l4046l757M3793N2425M0177M2798J3779J0115P0752R5189
$$ 674673 740447 755867 721821 718064 761857 814282 854459 897257 911036 921151 991903 1087092
18444A087092J07568L5315N1251O1413L5239K4981Q5995J96804K49867K46961
$$ 1087092 1194660 1229975 1281226 1342639 1377878 1402859 1488854 1685658 1935525 2182486
18434B182486K36117K99864L21682K71983L29283N07701O83833P99333N43875
$$ 2182486 2418603 2718467 3040149 3312132 3641415 4149116 4832949 5632282 6176157
18425F176157K60933K48961j7752l11793J18833Q04339J491182K142695K304545
$$ 6176157 6437090 6686051 6668299 6356506 6475339 7279678 8770860 10913555 13218100
18416A3218100J852457J680058K068924K035454L631351P663339J4656429K6113732
$$ 13218100 15070557 16750615 18819539 20854993 24486344 32149683 46806112 72919844
18408G2919844L6420532K9208794J1797402N069670n676328l4798584l5154760
$$ 72919844 109340376 138549170 150346572 155416242 149739914 114941330 79786570
18401G9786570j8868939q891028l732928Q06057O473705J4218419K1749692K2824564
$$ 79786570 60917631 52026603 48293675 49099732 55573437 69791856 91541548 114366112
18393A14366112J7517377Q460839m062052j7574680k4683202k6548887j7583467
$$ 114366112 131883489 140344328 136282276 118707596 94024394 67475507 49892040
18386D9892040r543881n538881l654058k817117k394948k171910j801677j498257
$$ 49892040 40348159 34809278 31155220 28338103 25943155 23771245 21969568 20471311
18378B0471311j263746j097946q84213p69345o93159n49908m58902n02707o37859
$$ 20471311 19207565 18109619 17225406 16456061 15762902 15212994 14754092 14251385 13613526
18369A3613526o99117o61013n13049m73851m33201l32317j25216N3704J48658
$$ 13613526 12914409 12253396 11740347 11266496 10833295 10500978 10375762 10429466 10578124
18360A0578124m9535j60500k35065n27936p54090o33739n24078l24690k22605
$$ 10578124 10528589 10368089 10133024 9605088 8850998 8217259 7693181 7368491 7145886
18351G145886l12682k50035k10857j80141k13849k44178j75768j87244j51968
$$ 7145886 6833204 6583169 6372312 6192171 5978322 5734144 5558376 5371132 5219164
18342E219164j53017j71852j95316k03769j85732j44490j21847j24883j78197
$$ 5219164 5066147 4894295 4698979 4495210 4309478 4164988 4043141 3918258 3740061
18333C740061j36303j36014r1703p4290j11234j05642p5995p9494r1453p9197
$$ 3740061 3603758 3467744 3376041 3301751 3190517 3084875 3008880 2929386 2837933 2758736
18323B758736m1585j7846n9249l6862n6213j06262n2875n6458m1776n5419r8839
$$ 2758736 2717151 2699305 2640056 2603194 2546981 2440719 2387844 2331386 2289610 2234191 2135352
18312B135352l4007n4192p3961k6054l8274L444l9514o0705m0477p6863q3315
$$ 2135352 2101345 2047153 1973192 1947138 1908864 1912308 1872794 1812089 1771612 1694749 1611434
18301A611434j8097j3590o6586o2202j00617n5951r1811p7419o5489m2581M11
$$ 1611434 1593337 1579747 1513161 1450959 1350342 1294391 1202580 1125161 1059672 1017091 1017502
18290A017502n6215j4791p85k0441l0632j4200J1348q7549m9999q1966m4261j7754
$$ 1017502 961287 946496 945711 925270 894638 880438 891786 804237 754238 672272 628011 610257
18278F10257J7100j10488q9153J0746o6789o1938k5608K1110L5197K8261l0542
$$ 610257 627357 516869 427716 438462 371673 309735 284127 305237 340434 368695 338153
18267C38153J804J6450J7524j5097j433m4196l9797j4730N0626M464k1301K6557
$$ 338153 339957 356407 373931 358834 357401 313205 273408 258678 309304 313768 292467 319024
18255C19024K321m8730k3576L313j8681n3400K9197J0013R671J9118J7337q469
$$ 319024 321345 272615 249039 252352 233671 180271 209468 219481 229152 248270 265607 257138
18243B57138J1781n503K8438K6429n181j4478l0371M0129l800p3902l3009J771
$$ 257138 268919 263416 291854 318283 313102 298624 268253 308382 304582 230680 197671 199442
18231A99442J4936k8940l4893j4902M0088M0194K7712m127K0224K370p883J5019
$$ 199442 214378 185438 150545 135643 175731 215925 243637 239510 259734 262104 254221 269240
18219B69240R231l3851R338j7685m8648N169k7080j7028K273L1014k9196J7219
$$ 269240 278471 244620 253958 236273 187625 192794 165714 148686 150959 181973 152777 169996
18207A69996K717r266j8892N9120L1130P012M0961M835o4264l8347P984J735P610
$$ 169996 172713 163447 144555 203675 234805 241817 282778 287613 223349 185002 192986 194721 202331
18194B02331J2024j321L5699O1843K0469o8957J1993P9716K0152o4174n1340m39
$$ 202331 214355 213034 248733 310576 331045 262088 274081 353797 373949 309775 258435 257996
18182B57996L3911j7614m607k1997k2227J4160p900J3913J3579N2868L7795m639
$$ 257996 291907 274293 269686 247689 225462 239622 231722 245635 259214 312082 349877 345238
18170C45238o726j0815l4565m1276k727M486J0075R119J5142J3810J1607m3397
$$ 345238 338512 327697 293132 251856 249129 253615 263690 272809 287951 301761 313368 269971
18158B69971k9860j5926O638P5105N780m9774n866K2319j7635l6129N2356Q6760
$$ 269971 240111 224185 230823 305928 311708 261934 256068 278387 260752 224623 276979 363739
18146C63739O4k8719n9755l8807N691K6305K1567P3358N8349K6810P765K0077
$$ 363739 363803 335084 275329 236522 242213 268518 290085 363443 421792 448602 456367 476444
18134D76444L3842L6936R959j3202L0854L8138P7357J00371R6206Q7701Q9664
$$ 476444 510286 547222 557181 543979 574833 612971 690328 790699 886905 974606 1064270
18123A064270P8432J65306J76489K37066K89150M09172N73229Q20487J235747
$$ 1064270 1142702 1308008 1484497 1721563 2010713 2419885 2993114 3813601 5049348
18114E049348K035285L521616O492746J1752993J5018433R013737K227557J322866
$$ 5049348 7084633 10606249 17098995 28851988 43870421 52884158 55111715 56434581
18106E6434581n893308j7620880j2599780o103102l036414j671934j089573q49792
$$ 56434581 50541273 32920393 20320613 14217511 11181097 9509163 8419590 7569798
18098G569798p93358p18035n40215l89532k50402k74229l30682k89034k37400
$$ 7569798 6776440 6058405 5518190 5128658 4878256 4604027 4273345 3984311 3746911
18089C746911k13289k06882j79693j47256j02185j13463j04023j04365l0278p9457
$$ 3746911 3533622 3326740 3147047 2999791 2897606 2784143 2680120 2575755 2545477 2466020
18079B466020q3517m0091n0659p3249p9723j18309r6756l2199p8501p3847K845
$$ 2466020 2382503 2342412 2291753 2218504 2138781 2020472 1923716 1891517 1813016 1739169 1742014
18068A742014M8949M159J9032P942n1593n0950o8168n1637n3175l6762j14102
$$ 1742014 1790963 1795122 1814154 1822096 1770503 1719553 1651385 1599748 1546573 1509811 1395709
18057A395709n8337n3095j0807j01286r5038m2575k605j4115k7492j0455m0527
$$ 1395709 1337372 1284277 1273470 1172184 1077146 1034571 1031966 1017851 990359 979904 939377
18046I39377j14327p7622l560j7841o777p8072P323L0438p8151k3575j441k5587
$$ 939377 825050 747428 743868 726027 719250 641178 648501 678939 600788 577213 575772 550185
18034E50185p2926m7875M23M1695M8735L6811q028j4024j2445l1098n9847O723
$$ 550185 477259 429384 429807 471502 520237 557048 549020 534996 522551 491453 431606 438329
18022D38329J4l0883K122J1500J8875m6228k573N080l1533k2119K2146R789J1022
$$ 438329 438343 407460 409582 421082 439957 393729 391156 396236 364703 342584 364730 374519 385541
18009C85541n0259M7194K2473k0627N8642J7848k6158M0794K3362L1765K2168
$$ 385541 335282 382476 404949 384322 442964 460812 434654 475448 498810 530575 552743
17998E52743K3665J6154L3086N6870L9421J0531o0006n5207j0376k6424m6665
$$ 552743 576408 592562 625648 682518 721939 732470 672464 617257 606881 580457 533792
17987E33792n2752J1094o8173o6951p3786k0131l9637J700l9100K5105J9686l0331
$$ 533792 481040 492134 423961 357010 283224 263093 223456 225156 186056 211161 230847 200516
17975B00516r943L970K1803k4656p676m2689P550K3984j4178j3666O344j0444
$$ 200516 190573 194543 216346 191690 184014 141325 148875 172859 158681 145015 151359 140915
17963A40915L6335J0650K1534J0198K4639J5755K7295M9432L129l8192N4722K4071
$$ 140915 177250 187900 209434 219632 244271 260026 287321 336753 339882 301690 356412 380483
17951C80483l4151m2971Q846K2247L7966j8227m9615K2286N6294N5545m2370o5322
$$ 380483 346332 303361 312207 334454 372420 354193 304578 326864 383158 438703 396333 331011
17939C31011l1073K5764K805m0481o6579k7407J134l1151m0426j7339N3381o5
$$ 331011 299938 325702 328507 288026 221447 194040 195174 164023 123597 106258 159639 159574
17927A59574j0897j1081Q3798l0445j01571n3712p459R29K3638L2945R070k5258
$$ 159574 148677 137596 221394 190949 89378 35666 28207 29136 52774 85719 94789 69531
17915F9531J3237n97K7908N8076o365o50J3222M705k1562k8035l0057j9303N4703
$$ 69531 82768 82171 110079 168155 161790 161140 174362 179067 157505 129470 99413 80110 134813
17902A34813L9854q52j1928L8001j4345j7442M8627m0770k3651M6660N3413J5941
$$ 134813 174667 173815 161887 199888 185543 168101 216728 175958 152307 198967 252380 268321
17890B68321j5617l834o6336n3615q555P6329R4068K2790m941m0673n4430p2479
$$ 268321 252704 248870 182534 128919 120364 196693 290761 313551 308610 267937 213507 141028
17878A41028l9002Q593L3240q172l5861n75j3270j0493j8234K2057n9448J8838
$$ 141028 102026 110619 143859 135687 99826 99251 85981 75488 57254 79311 19863 38701
17866C8701O2838N543j558K5198L7244K0078O9598K1877L62m6749l5768m9689
$$ 38701 101539 107082 105524 130722 167966 188044 257642 279519 279881 233132 197364 147675
17854A47675O6796J084j8514o852M5455J0556o9681m7056p11l8708l4560J9945
$$ 147675 214471 215555 197041 190189 235644 246200 176519 129463 128752 90044 55484 75429
17842G5429J5233J0325n426J2063l0077m5997j1475m033M2468M2848M2690r257
$$ 75429 90662 100987 95561 107624 77547 31550 20075 16042 58510 101358 144048 134791
17830A34791J1018J2345K5484M0324O479l9168o628p3231k2209L7409J2871N1763
$$ 134791 145809 158154 183638 223962 230441 191273 184645 111414 89205 126614 139485 191248
17818A91248o6170m8193M2664M0540j0516l9495K0889K9219N698J7483K0238L6439
$$ 191248 125078 76885 119549 160089 149573 110078 130967 160186 165884 183367 203605 240044
17806B40044l798o2014n7361n5691J1163J9844n2832j8813N2134M4902P2417J397
$$ 240044 236246 174232 116871 61180 72343 92187 39355 20542 72676 117578 189995 191392
17794A91392j9918j5552p8292n759P854o3455k9394j6238l02L5985P1662K1108
$$ 191392 171474 155922 77630 71871 79725 16270 -13124 -29362 -29664 6321 77983 99091
17782I9091K6889j2578k7650l0119K6650R8673K0156J2373L915m1990o7392j2586
$$ 99091 125980 113402 85752 55633 82283 180956 201112 213485 217400 175410 108018 95432
17770I5432q7924r003R000N1386L4438j8290M830n306l7762m642K1786q375l3035
$$ 95432 7508 -1495 7505 58891 93329 75039 79869 74563 36801 32159 53945 45570 12535
17757A2535j2911q985K6403J0070N0444L4761n0772o1371k460K0009k8019j7350
$$ 12535 -376 -9361 17042 27112 77556 112317 61545 174 -2286 17723 -10296 -27646
17745b7646j1953J3019k2179j619L263p377M1078M588n273j2333l384j1464K3593
$$ -27646 -39599 -26580 -48759 -50378 -47115 -54492 -13414 -8826 -14099 -26432 -29816 -41280 -17687
17732a7687Q3225J7771m3019l3795m8929k3505L9804m88k0329M0430p015K8407
$$ -17687 65538 83309 40290 6495 -42434 -65939 -26135 -26623 -46952 -6522 -13537 14870
17720A4870L7488L4197j3565q024o503m5923P536l4533O000K477K0266o460j7449
$$ 14870 52358 86555 72990 64966 58463 12540 20076 -14457 -8457 -5980 14286 7826 -9623
17707i623m1505k5680Q447K2723K0301P4879N2770k5236l1207o3913q4294m0693
$$ -9623 -51128 -76808 -68361 -45638 -25337 49542 102312 77076 45869 -18044 -102338 -143031
17695a43031L5444O7025L451j4739J529l5386o2011l6622K3004M1146K8217M2386
$$ -143031 -107587 -40562 -37111 -51850 -50321 -85707 -147718 -184340 -161336 -120190 -91973 -49587
17683d9587j3975j7284J2726P816O4471L7576o66J1991k8731k1112K7302k7548
$$ -49587 -63562 -80846 -68120 -60304 4167 41743 41077 53068 24337 3225 30527 2979
17671B979n9502J3556L5436K4635J3246m995J6048J9927k326l230J1675L8261
$$ 2979 -56523 -42967 -7531 17104 30350 25355 41403 61330 59004 55774 67449 105710
17659A05710O152m0812q5071k7638j0867K0453L3761M369o1927r4382K0814M3207
$$ 105710 111862 71050 -14021 -41659 -52526 -32073 1688 6057 -55870 -150252 -129438 -86231
17647h6231J8686m3264j5236N6356R2519K5858l7826k5372k8532O0742K2103q7314
$$ -86231 -67545 -110809 -126045 -69689 22830 48688 10862 -14510 -43042 17700 39803 -47511
17635d7511k69K532J0069L4177k3101j0062N0292K8010J1971j9475m2561j258
$$ -47511 -47780 -45248 -35179 -1002 -24103 -34165 16127 44137 56108 36633 -5928 -7186
17623g186j722j8041j832N111n204k4882M9121J7776n7958O018L2971J3062j5502
$$ -7186 -8908 -26949 -28781 -23670 -28874 -53756 -4635 13141 -44817 -38799 -5828 7234 -8268
17610h268R414m557M0465j6859m6917l0454j0360M1468O4949P748Q045k828L9888
$$ -8268 1146 -3411 37054 20195 -26722 -57176 -67536 -26068 38881 46629 54674 51846 91734
17597I1734l8509o2168O737K7169K8727l0595o5480L0542l5608k6218L3723J8304
$$ 91734 53225 -8943 -2206 24963 53690 23095 -42385 -11843 -47451 -73669 -39946 -21642
17585b1642l3112j6212k0053K8788O833J6325M7245K7553j1008k3764k9269L738
$$ -21642 -54754 -70966 -91019 -62231 -55398 -39073 8172 35725 24717 953 -28316 -24578
17573b4578J2580o2565L437N4307k4833k9827k7496l9349K2915R5613K3922L3480
$$ -24578 -11998 -74563 -71126 -16819 -41652 -71479 -98975 -138324 -115409 -19796 4126 37606
17561C7606M6948m4990j071p6034m8363N4753L7995P3303M2313k9422m4509n9363
$$ 37606 84554 39564 38493 -37541 -85904 -31151 6844 80147 122460 93038 48529 -10834
17549a0834o7649N4945L4101K9191j5757o4082k1720M2775L2149l4669n2771j6217
$$ -10834 -78483 -23538 10563 39754 23997 -40085 -61805 -19030 13119 -21550 -74321 -90538
17537i0538N4152J9525l8939j7787J2639M7547N002J2477k6067k128M3431P6L691
$$ -90538 -36386 -16861 -55800 -73587 -60948 -13401 -8399 4078 -21989 -24117 19314 19390 23081
17524B3081m1368l3340n4211J0337J2524L6745O3108L7436j7232K3245O7247J1911
$$ 23081 -18287 -51627 -105838 -95501 -82977 -46232 16876 54312 37080 60325 127572 139483
17512A39483j6770m7869o0385q0567J0213O8417R863j1424j7391L5285P038k692
$$ 139483 122713 74844 14459 -66108 -55895 12522 22385 10961 -6430 28855 35893 33201
17500C3201k3657J5446j8827n7854K529M2634J9131j135q853j7900j0396L6629
$$ 33201 9544 24990 6163 -51691 -49162 -6528 12603 11468 2615 -15285 -25681 10948
17488A0948p106J1701j199l8197m384k9667K940O4910M339k4062l4460J393J4433
$$ 10948 3842 15543 14344 -23853 -28237 -57904 -54964 9946 14285 -9777 -44237 -42844 -28411
17475b8411q778k069J8983P376O5979q827k0425k2627m1602M0587j0813j6373
$$ -28411 -37189 -39258 -20275 -12899 53080 44253 23828 1201 -40401 186 -10627 -27000
17463b7000K5601o6K5407J3616k7544J0645M3730J4087o4039l2793j0075l412
$$ -27000 -1399 -1465 23942 37558 10014 20659 64389 78476 14437 -18356 -28431 -31843
17451c1843J2328m916o450J7701L9040N4689P1214P7377J01365L6232J4736m0568
$$ -31843 -19515 -24431 -30881 -13180 25860 80549 151763 229140 330505 366737 381473 340905
17439C40905j01332m0851k3673l9415L61L7070k945l7769P188N510j4728p2554
$$ 340905 239573 198722 175049 135634 135995 173065 170120 132351 139539 145049 130321 57767
17427E7767j781L0590Q799O037l4320l7195J4958K7063L555L7531n3525l7462
$$ 57767 55986 86576 95375 101412 67092 29897 44855 71918 75473 113004 59479 22017
17415B2017j6009K9389N1598j7591l0982k9143n145Q561L0844J020p842k3993
$$ 22017 6008 35397 86995 69404 38422 9279 4134 12695 43539 44559 36717 12724
17403A2724m012j7076k8460l5986L1880L7682n493K3933L6957k4537k2844j2608
$$ 12724 8712 -8364 -36824 -72810 -40930 -3248 -8741 15192 52149 27612 4768 -7840
17391g840O477p009J0102O62J3970j1995L7334j4607j1137j2842j0326J5944K3966
$$ -7840 -1363 -8372 1730 2392 16362 4367 41701 27094 15957 3115 -7211 8733 32699
17378C2699K7349Q29m1346m4917K242M8183R251m450m0134l8357R827O5840L93
$$ 32699 60048 60877 19531 -25386 -23144 25039 34290 29840 -10294 -48651 -38824 27016 27409
17365B7409m178n5962l541L177J9460J5777R759J6981j8421M799o646m4916j2363
$$ 27409 23231 -32731 -36272 -33095 -13635 2142 11901 28882 10461 15260 8614 -36302 -48665
17352d8665M1914L6257l9175l4084K4054L0573j1155j2065J6342L9742j1275q947
$$ -48665 -6751 29506 -9669 -43753 -19699 10874 -281 -12346 3996 43738 32463 23516
17340B3516L9174N0648k6830p9851k9910K9411L5590m2797m9654J8177q167J1706
$$ 23516 62690 113338 86508 6657 -23253 6158 41748 -1049 -50703 -32526 -40693 -28987
17328b8987K0710K3892r081j6278J4917N6126L4613p8671n2505Q192o369J7209
$$ -28987 -8277 15615 6534 -9744 5173 61299 95912 17241 -35264 -27072 -33441 -16232
17316a6232k209M059k383J2552L06J2515k5341N396q65O564J3144k1112j8676
$$ -16232 -18441 -14382 -16765 -4213 -3907 8608 -16733 -11337 -12202 -5638 7506 -13606 -32282
17303c2282M980k031m6132k6720L4334K6441K6968M5726L5397p023l145j07633
$$ -32282 -27302 -29333 -75465 -102185 -67851 -41410 -14442 31284 66681 59658 56513 -51120
17291e1120k5183l4619J7483L3473L9242P3075K2902k1367k3926J2510o563O226
$$ -51120 -76303 -110922 -93439 -59966 -20724 52351 75253 53886 29960 42470 35907 42133
17279D2133M2851o667q9541p5963J1587K839n516M7193P1118L3720k3237r264
$$ 42133 84984 78317 -11224 -87187 -75600 -72761 -78277 -31084 40034 73754 50517 41253
17267D1253m25K102J1915P437J2072k9212l3779j7654J1577j2695J364K5033n39
$$ 41253 40828 42930 54845 62282 74354 45142 11363 -6291 5286 -7409 -6045 18988 18449
17254A8449J309M521k0670J7236O3999J7298R5618Q8891Q1111M7881R3051J91201
$$ 18449 19758 24279 3609 20845 84844 102142 197760 286651 367762 415643 508694 699895
17242F99895L79515O58536J005464J313063J067497M45775J31314m57930j274079
$$ 699895 1079410 1737946 2743410 4056473 5123970 5569745 5701059 5243129 3969050
17233C969050j393583q77224m04694k47658j64417r5332r0396o3642o7518L31
$$ 3969050 2575467 1698243 1293549 1045891 881474 786142 695746 632104 564586 564917
17223E64917n4305q8556m5760l329k5158l8645J9308k433N805j6853o3044l7328
$$ 564917 510612 422056 376296 372967 347809 309164 328472 326039 331844 314991 251947 214619
17211B14619L788O7010k1934n2126m2124N7062M2789o5051p8916R190L4931K8176
$$ 214619 218407 285417 263483 211357 169233 226295 269084 204033 125117 134307 169238 197414
17199A97414J58O704M8017J6021o2010n7794q196n7139k2598L0387R4273M710
$$ 197414 197572 204276 252293 268314 206304 148510 140314 83175 60577 90964 185237 189947
17187A89947n2852q145L9777l4964p6057m9594M3033Q8300k5233n2492j4197J1550
$$ 189947 137095 128950 168727 133763 57706 8112 51145 139445 114212 61720 47523 59073
17175E9073n1731k5238J5836L967J8523k2402L7706j4862O083K719m7104P165
$$ 59073 7342 -17896 -2060 1907 20430 -1972 35734 20872 26955 29674 -17430 -10265
17163a0265J8798K6680Q0220J7021p441r456R448o1430j4802P581N907J0839k9592
$$ -10265 8533 35213 115433 132454 125013 115557 125005 63575 48773 56354 62261 73100 43508
17150D3508j6974k2090K1333Q729j7323R118l9737O709l6759m329J3661k392O1651
$$ 43508 26534 4444 25777 34506 17183 26301 -13436 -6727 -43486 -47815 -34154 -36546 25105
17137B5105J4538r281N873j8063L015N0181L6856k3978o0920j5415k0401J5500
$$ 25105 39643 30362 36235 18172 21187 71368 108224 84246 23326 7911 -12490 3010
17125C010L3648k9492k4109J3798L9037k2088k3843J8572p547j7718k3571m0204
$$ 3010 36658 7166 -16943 -3145 35892 13804 -10039 8533 986 -16732 -40303 -80507
17113h0507K6762Q5182K0385l6279K972j2851j3643L7026j4109J7957n430r684
$$ -80507 -53745 31437 51822 15543 18515 5664 -7979 29047 14938 32895 27465 17781
17101A7781k4871M2694N8212q227n8826k2475r372Q809k0906k6596m4758O7095
$$ 17781 -7090 35604 93816 85589 26763 4288 -5084 3725 -17181 -43777 -88535 -21440
17089b1440K0453M287K2313k8147L794J89L6646L7273O3284m235r9458n6380J7608
$$ -21440 -987 3300 25613 -2534 1260 1449 38095 75368 138652 134417 34959 -21421 -3813
17076c813K7705k1603l647j9749J2412K0033o338j3444n520l9834m2591J0331
$$ -3813 23892 2289 -1358 -21107 -8695 11338 5000 -8444 -13964 -53798 -96389 -86058
17064h6058L9065O1067M5381m626K24j6831r392J3031o678R145l221l48L784K3536
$$ -86058 -46993 14074 59455 54829 55053 38222 28830 41861 35183 44328 41107 40759 44543 68079
17050F8079N0772n9219m6106j4494L0895J2956k0129k6253l634n2968L8622L1389
$$ 68079 118851 59632 13526 -968 29927 42883 22754 -3499 -7133 -60101 -21479 9910
17038I910R007j9745k599p558J4722R715l392L795l5129j3334L3077K3930J6400
$$ 9910 18917 -828 -3427 -10985 3737 13452 10060 13855 -21274 -34608 -1531 22399 38799
17025C8799n0133j41K2773p635l0924k3619M70Q093M3940N9256J9000n3658Q81
$$ 38799 -11334 -11475 11298 3663 -27261 -50880 -50410 -42317 1623 60879 79879 26221 27102
17012B7102k393k0160n8397O367k0657o608m0434O7418Q1896N2637j2433k6836
$$ 27102 24709 4549 -53848 -47481 -68138 -74746 -115180 -47762 34134 86771 74338 47502
17000D7502j7054L4766l2133j5587K649K6695N37k8351J6637N1802o412l5187
$$ 47502 30448 65214 33081 17494 20143 46838 47375 19024 35661 87463 81051 45864
16988D5864K553m7677k7727k747K4306M7693N7892J9164M590j7073n0131j9925
$$ 45864 48417 740 -26987 -29734 -5428 42265 100157 119321 123911 106838 56707 36782
16976C6782N913M102M869k4754j314k0718o3446P868O9799R589k7248N216j0019
$$ 36782 42695 46797 51666 26912 25598 4880 -58566 -50698 19101 28690 1442 6658 -3361
16963c361j4767K961j6470M9251J4491n4087J2484K4980J2227j6944j0867J2541
$$ -3361 -18128 -15167 -31637 17614 32105 -21982 -9498 15482 27709 10765 -102 12439
16951A2439R638n2207p525r369J2609J0860k7388J8723m0847J1959K5752N7317
$$ 12439 22077 -30130 -37655 -47024 -34415 -23555 -50943 -32220 -73067 -61108 -35356 21961
16939B1961N8986k4784m8400J68q835K5522L365l7314K6273M8528k2980l1315
$$ 21961 80947 56163 7763 7931 -904 24618 27983 -9331 16942 65470 42490 11175
16927A1175k0600k2510m2319J1405M0007K9638k4477m7732K3971M5872M4127J0713
$$ 11175 -9425 -31935 -74254 -62849 -22842 6796 -17681 -65413 -41442 4430 48557 59270
16915E9270P541J6261n0583o251K7872l550j5378j4276K2585o309j2490J2867
$$ 59270 66811 83072 32489 26238 54110 50560 35182 20906 43491 37182 24692 37559
16903C7559j0085K3917n4097n9258J2582J322l2696O3107M1196k2243p147l8760
$$ 37559 27474 51391 -2706 -61964 -49382 -48060 -80756 -17649 23547 1304 -5843 -44603
16891d4603m4306N750J2807K3869M2766j7830r822O206r457j2408O0341Q4434
$$ -44603 -88909 -83159 -70352 -46483 -3717 -21547 -31369 -25163 -34620 -47028 13313 97747
16879I7747k6257j8418J4386l5620k1382j9190L919P358J4367o5447j2285k2878
$$ 97747 71490 53072 67458 31838 10456 -8734 -4815 2543 16910 -48537 -60822 -83700
16867h3700O061L6489K0295K1254J3028j9447p480J4609l8664l1114Q886K366
$$ -83700 -77639 -41150 -20855 399 13427 -6020 -13500 1109 -37555 -68669 -59783 -57417
16855e7417J7691l0587m5139k5555O6176O7504N267j9404K43k4155J312L02K3089
$$ -57417 -39726 -70313 -115452 -141007 -74831 -7327 -2060 -21464 -21221 -45376 -44064 -43762 -20673
16842b0673N6637L2758n172K1956L8250j0064m1863n1921k4048J4590O4175J3026
$$ -20673 35964 68722 63550 85506 123756 113692 71829 19908 -4140 10450 74625 87651
16830H7651J0712n9007n0816m668J2659j611P20j3932J3633k456J0967j4733Q115
$$ 87651 98363 39356 -11460 -16128 -3469 -5080 -4360 -18292 -4659 -7115 3852 -10881 -2766
16817b766M5912K3605O525J693n9132n7252j3818K3109O8011O1474K7366p4513
$$ -2766 43146 66751 73276 74969 15837 -41415 -55233 -32124 35887 97361 124727 50214
16805E0214n1805k2768Q464K5921K67m7079k5867K8184r238J1271K3649j8802
$$ 50214 -1591 -24359 -15895 10026 10293 -36786 -62653 -34469 -43707 -32436 -8787 -27589
16793b7589l8107K3091L037M6384r31l7773n1640K7084K0955Q34L4462J2062l1449
$$ -27589 -65696 -42605 -39568 6816 5885 -31888 -83528 -56444 -35489 -34655 -193 11869 -19580
16780a9580J6982j1755O385J3405J0695m6969k2177J5067J923Q302q72l7398J8872
$$ -19580 -2598 -14353 -7968 5437 16132 -30837 -53014 -37947 -36024 -27722 -28594 -65992 -47120
16767d7120J1535m0191m9357L3004L3120L7338R213m0151K84j0742N5385M3737
$$ -47120 -35585 -75776 -125133 -92129 -59009 -21671 -12458 -52609 -52325 -63067 -7682 36055
16755C6055M6128j684j2833m7487j5548j4144k6859J0295K0225q187J7905K5603
$$ 36055 82183 80499 67666 20179 4631 -9513 -36372 -26077 -5852 -14039 3866 29469
16743B9469J7818J1759j2210k4415K4426p619j9882q373J726p684n18M0621J2697
$$ 29469 47287 59046 46836 22421 46847 39228 19346 10973 12699 5015 4497 45118 57815
16730E7815L75j3559o8633p309K6206o956j0766N228j3638l1524O0354N0516q635
$$ 57815 58190 44631 -24002 -31311 -5105 -12061 -22827 -17599 -31237 -62761 -2407 48109 39474
16717C9474O28O8242J6338m3773r884l410k8874k7906k5911L1292J7314Q958L6811
$$ 39474 40102 108344 124682 80909 71025 67615 38741 10835 -15076 16216 33530 42488 79299
16704G9299j4954m2764j5445p5187L5024M7982k2230l1185K2831k6867n7084K6521
$$ 79299 64345 21581 6136 -69051 -34027 13955 -8275 -39460 -16629 -43496 -100580 -74059
16692g4059O2617q489k9128n0619L5757N2554o783K7199L9031J7418L2526r456
$$ -74059 -11442 -19931 -49059 -99678 -63921 -11367 -18150 9049 48080 65498 98024 88568
16680H8568j2626l6481J5439L2276l5186L363L8184k3279P154j109j7210p865
$$ 88568 75942 39461 54900 87176 51990 55353 93537 70258 77412 76303 59093 51228
16668E1228n2936k9967K6315J1613l7140J530j7590j6051J8335J7156L8051O068
$$ 51228 -1708 -31675 -5360 6253 -30887 -29357 -46947 -62998 -44663 -27507 10544 16612
16656A6612L244l1107o991k0563m431J797L4016K2172p145k8911J7N5305j1077
$$ 16612 19856 -11251 -18242 -38805 -43236 -41439 -7423 14749 7604 -21307 -21290 34015 22938
16643B2938l7496M2631K1413L4047k4737l1961l250J9714j3738j3442m8920j4696
$$ 22938 -14558 28073 49486 83533 58796 26835 23585 43299 29561 16119 -32801 -47497
16631d7497J3910L2026K6812k2279m8188M1015M3288k2256o0145l6615K8352K0089
$$ -47497 -33587 -1561 25251 2972 -45216 -4201 39087 16831 -43314 -79929 -51577 -31488
16619c1488M3240j2270n6628L1651L4096l790M6160o12j1911K305k290J1384l0143
$$ -31488 11752 -518 -57146 -25495 8601 4811 50971 50359 38448 40753 38463 49847 19704
16606A9704l7632m3410J1536M3204k1021M1521K7396K195k9038j2203l1010P6069
$$ 19704 -17928 -61338 -49802 -6598 -27619 13902 41298 43493 14455 2252 -28758 47311
16594D7311M0979o666o2495j4507J5043J5081l2726N0030j5754k8026l8788l7035
$$ 47311 88290 81624 19129 4622 19665 34746 2020 52050 36296 8270 -30518 -67553
16582f7553J7023N1337J1501K1203o4350m1967q202m1941j3854P478O2661K4282
$$ -67553 -50530 807 12308 33511 -30839 -72806 -81008 -122949 -136803 -129325 -66664 -42382
16570d2382r186M1233J5942l9129p972M7013L0875j8704n2243P360Q803n796K3545
$$ -42382 -51568 -10335 5607 -33522 -41494 5519 36394 17690 -34553 -27193 -18390 -24186 -641
16557f41M2104L7417k5477j4727m90q881k5493M681L1426r118k2076K338n495
$$ -641 41463 78880 53403 38676 38186 29305 3812 8493 39919 30801 8725 11063 5568
16544E568K7270K8800m1503k0003M3999m380n4009J2549M5521l2818o0931j7962
$$ 5568 32838 61638 20135 132 44131 39751 -14258 -1709 43812 10994 -49937 -67899
16532f7899l600J1798M3002O2738j1243p3092k6487O6414J2343r193N7029K3849
$$ -67899 -71499 -59701 -16699 46039 34796 -38296 -64783 1631 13974 4781 61810 85659
16520H5659q5976K224M7538N153n4248K4331M1234M032k0479l3976M52K3022j2929
$$ 85659 -317 1907 49445 54598 350 24681 65915 69947 49468 15492 15944 38966 26037
16507B6037J7776k8304m0471P112q157J6583j049m605J8193J1805p3808m3769
$$ 26037 43813 15509 -24962 -17850 -26007 -9424 -10473 -15078 3115 14920 -58888 -102657
16495a02657j2142O8235K6555N9882l4850m3833N225k3585K9435L445k6118k707
$$ -102657 -114799 -46564 -20009 39873 5023 -38810 -33585 -57170 -27735 -24290 -50408 -53115
16483e3115o643j4425J9765J054L768M142j40k6209R221j7934p567J9471K1513
$$ -53115 -59758 -74183 -54418 -53364 -49596 -45454 -45594 -71803 -62582 -80516 -88083 -68612 -47099
16470d7099M9303J2914O3726j9998q0353K518N5524J4079K9998Q967K7711n3607
$$ -47099 2204 15118 78844 58846 -21507 -18989 36535 50614 80612 89579 117290 63683
16458F3683l3176k4985l4671K171R206l7297J9000O0948J3449n0198j2894M740
$$ 63683 30507 5522 -29149 -26978 -17772 -55069 -36069 24879 38328 -11870 -24764 -20024
16446b0024J5950l0288k4746K3264N7792M3534o091P841K3607o265K0509k5275
$$ -20024 -4074 -34362 -59108 -35844 21948 65482 59391 67232 90839 84574 105083 79808
16434G9808l1572J8369J3736l5534l6549R019n3932q614k8951k7915K3800L9171
$$ 79808 48236 66605 80341 44807 8258 17277 -36655 -45269 -74220 -102135 -78335 -39164
16422c9164N3997j7818m2365o003j9684J034R387j7805j9620K6738O1327J606
$$ -39164 14833 -2985 -45350 -51353 -71037 -70003 -60616 -78421 -98041 -71303 -9976 -8370
16410h370l4480L5663q149m7744k0443L2883L0332n2634o2764N1462O8933k9507
$$ -8370 -42850 -7187 -15336 -63080 -83523 -50640 -20308 -72942 -135706 -84244 -15311 -44818
16398d4818M980M5145j76J2950N349K2561J787l0096k8747J029j1855n158M0204
$$ -44818 -39838 5307 5131 18081 23430 45991 47778 17682 -11065 -10036 -21891 -27049 13155
16385A3155m1564K392L1602j4050o970K9238N540o227j8477L3775J3344j4371
$$ 13155 -28409 -26017 5585 -8465 -15435 13803 19343 13116 -5361 28414 41758 27387
16373B7387j596j5082j9518K054K7785J4610n2858J1755k4246k7636M2712N3278
$$ 27387 25791 10709 -8809 -6755 21030 35640 -17218 -5463 -29709 -57345 -14633 38645
16361C8645J1819j9811J3864M490l1399k7594Q096l220n042M3664N0868j9342
$$ 38645 50464 30653 44517 49007 17608 -9986 -1890 -5110 -10152 33512 84380 65038
16349F5038o5740l4302J0678J3883j5442N0232j2149l4107L6453N6657N2650l533
$$ 65038 -702 -35004 -24326 -10443 -25885 24347 12198 -21909 14544 71201 123851 120318
16337A20318o0316m5649k052K1447p790l5750k7445J1159J5902J3900L6939L9344
$$ 120318 60002 14353 12301 33748 25958 -9792 -37237 -26078 -10176 3724 40663 80007
16325H0007j492k1514n4000l3291J3768K9457m5441q255L6496M6475l3158k3115
$$ 80007 78515 57001 3001 -30290 -16522 12935 -32506 -40761 -4265 42210 9052 -14063
16313a4063n314J2671R8212O1517n180n4883p9421k9706K16L6703l9087j9611
$$ -14063 -19377 -6706 91506 153023 147843 92960 13539 -16167 -15951 20752 -18335 -37946
16301c7946l3874l396j5400l5314J2693P6124K0243j9742q679J8659j8937k1487
$$ -37946 -71820 -75216 -90616 -125930 -113237 -37113 -16870 -36612 -45291 -26632 -45569 -67056
16289f7056k2511l0952m047O9589L0467Q55J1678J8747J0835j877J2626O731L5918
$$ -67056 -89567 -120519 -124566 -54977 -24510 -23655 -11977 6770 17605 15728 28354 35085 71003
16276G1003j5433p4992j8525k2596j3805j0418J2138n477l2776L0868K9395N3799
$$ 71003 55570 -19422 -37947 -60543 -74348 -84766 -72628 -78105 -110881 -80013 -50618 3181
16264C181Q122k201P30M4994l1792j8622K1710N8461k3286o8108j7861N2257K3230
$$ 3181 11303 9102 9832 54826 23034 4412 26122 84583 61297 -6811 -24672 27585 50815
16251E0815r382L2045L7947n160o2627p1587k4720L9942j6615j5427L5034K047
$$ 50815 41433 73478 111425 106265 43638 -27949 -52669 -12727 -29342 -44769 -9735 -7688
16239g688K4576k250P827j1024k6220M913N3107l3036n9922K2689K4260K0686
$$ -7688 16888 14638 22465 11441 -14779 -9866 43241 10205 -49717 -27028 -2768 17918
16227A7918L5187M0066k1278n159k9045l6107o2749p8869K3877K4119K0235P8850
$$ 17918 53105 93171 71893 66734 37689 1582 -61167 -140036 -116159 -92040 -71805 7045
16215G045M3271k5201m8807n4395J7105P7382k4621j9781k8489M7380k7840k3897
$$ 7045 50316 25115 -23692 -78087 -60982 16400 -8221 -28002 -56491 -9111 -36951 -60848
16203f0848J9083O0702l0271J9502l3271p592L2990L1729m2153n5652k5093j8415
$$ -60848 -41765 18937 -11334 8168 -25103 -32695 295 32024 -10129 -65781 -90874 -109289
16191a09289L42L361M0760L5783K4976K2041k8330k3673Q019K0494k93J435J1020
$$ -109289 -108947 -105586 -64826 -29043 -4067 17974 -10356 -34029 -26010 -5516 -5809 -4374 6646
16178F646L0090r361j712l0195p891j4350N033K6287k0722N239K5341J0280j2596
$$ 6646 36736 27375 25663 -4532 -12423 -26773 -21740 4547 -16175 -10936 14405 24685 12089
16165A2089p8631j5953q507J1200J2693K3502k2505n4360K7623N3410L6494k6959
$$ 12089 -66542 -82495 -91002 -79802 -67109 -43607 -66112 -120472 -92849 -39439 -2945 -29904
16153b9904p5627n497M0653L9354K6824k5923k1731j531m338Q6355j283o0429
$$ -29904 -105531 -111028 -70375 -31021 -4197 -30120 -51851 -53382 -57720 28635 27352 -33077
16141c3077L5472J2926q574M9175n603k2954k120J2934l1577J1108J3810n2917
$$ -33077 2395 15321 6747 55922 50319 27365 25245 38179 6602 17710 31520 -21397
16129b1397k4275L7625M9271J6820r377j1561n0872j6063j5464K3419J1412m1424
$$ -21397 -45672 -8047 41224 58044 48667 37106 -13766 -29829 -45293 -21874 -10462 -51886
16117e1886k7338O1858O5285k1336j0220Q694l6290l3183K1035l226N222p858
$$ -51886 -79224 -17366 47919 26583 16363 25057 -11233 -44416 -23381 -26607 -21385 -29243
16105b9243m8515j8934J8911M0326K0172M1807K9804l4393n2361L5490O2478n0089
$$ -29243 -77758 -96692 -77781 -37455 -17283 24524 54328 19935 -32426 3064 65542 15453
16093A5453k4635k9902L8560N4276q968n4976j6150L0718J2561q992M702m0746
$$ 15453 -9182 -39084 -524 53752 44784 -10192 -26342 4376 16937 7945 12647 -28099
16081b8099M5116M3872m589K026m1032p032M3885r208k0770k5868k9246j2491
$$ -28099 17017 60889 56300 58326 17294 10262 54147 44939 24169 -1699 -30945 -43436
16069d3436P599J4313j7877r785m697K0925M8500l8922l2182R5466j5592J0265
$$ -43436 -35837 -21524 -39401 -49186 -53883 -32958 15542 -23380 -55562 39904 24312 34577
16057C4577k2108j9898K0324k0813K2845J5873j8609j7248J1505j7579l995j8843
$$ 34577 12469 -7429 12895 -7918 14927 30800 12191 -5057 6448 -11131 -15126 -33969
16045c3969k4451K3731J064J3501L5481l2439J755r381j972L9491L1677J6945
$$ -33969 -58420 -34689 -33625 -20124 15357 -17082 -15327 -24708 -26680 12811 44488 61433
16033F1433n9355n7309L880L5236k6370q510j3321k150K5871N6728N7475n3651
$$ 61433 2078 -55231 -51351 -16115 -42485 -50995 -64316 -66466 -40595 16133 73608 19957
16021A9957m3891K0080L3493j6704m3546m1590k4794K0557K4649j9595k9676K2290
$$ 19957 -23934 -3854 29639 12935 -30611 -72201 -96995 -76438 -51789 -71384 -101060 -78770
16009g8770O8200J0530l2486J1236M2120K0365K6663J734n8245k0j5769J342O4956
$$ -78770 -10570 -40 -32526 -21290 20830 41195 67858 69592 11347 11327 -4442 -3100 61856
15996F1856M3570m8343j8566N095k2016l9485J1959K5262m708n655K1396j25N729
$$ 61856 105426 57083 38517 43612 21596 -17889 -5930 19332 14624 8969 30365 30240 35969
15983C5969K1062k7863k8739j2133R718L7917J2229l8585q518N1589M0413o0473
$$ 35969 57031 29168 429 -11704 -1986 35931 48160 9575 1057 52646 93059 32586
15971C2586l1225m9821J5018l469l6033j5030k5318J5626P6731J2642m2284m2396
$$ 32586 1361 -48460 -33442 -36911 -72944 -87974 -113292 -97666 -20935 -8293 -50577 -92973
15959i2973j8541K7298N6536L0513K4628p54K602l7401j5573j3692j0546K6498
$$ -92973 -111514 -84216 -27680 2833 27461 26707 29309 -8092 -23665 -37357 -47903 -21405
15947b1405M7235J0315J0351p705l463j5660k0794m238K0313N1765J3887n4990
$$ -21405 25830 36145 46496 38791 35328 19668 -1126 -5364 14949 66714 80601 25611
15935B5611k9688k7217j59M1779k6920m3899N0091O0953J9741n2322n3249p2865
$$ 25611 -4077 -31294 -31453 10326 -16594 -60493 -10402 50551 70292 17970 -35279 -108144
15923a08144j5590N6788K9499k0291J6395M427J4710M7270j5093m6496L5788L8548
$$ -108144 -123734 -66946 -37447 -57738 -41343 -36916 -22206 25064 9971 -36525 -737 37811
15911C7811k2336n245L283J2038k4447j9623L2600J1246J7624k0070k2528K9242
$$ 37811 15475 10230 13513 25551 1104 -18519 14081 25327 42951 22881 353 29595
15899B9595K604k4211n1333K3255K0118r468O629L8703m2062L1583Q710j5443
$$ 29595 32199 7988 -43345 -20090 28 -9440 -2811 35892 -6170 25413 34123 18680
15887A8680J3311m826k7463k5888O804Q8022P4228m8132r1130m2428l6426J822
$$ 18680 31991 27165 -298 -26186 -19382 68640 142868 94736 3606 -38822 -75248 -73426
15875g3426K8529J3794O4107j8511k0134j5669K0584M4667K2020m0552J7578J9268
$$ -73426 -44897 -31103 33004 14493 -5641 -21310 -726 43941 65961 25409 42987 62255
15863F2255M8428J1576n8689P277l741j5681j4270L9941j5388m1475L8882K5205
$$ 62255 110683 122259 63570 70847 67106 51425 37155 77096 61708 20233 59115 84320
15851H4320j7842l6627K1911M2660j9888n9502M986P224n4802K167K3819n693
$$ 84320 66478 29851 51762 94422 74534 15032 20018 27242 -27560 -25393 -1574 -7267
15839g267o3167P74P947L7055M4128J1138l3888j3323M0726K8965q340j5274Q21
$$ -7267 -70434 -69660 -61713 -24658 19470 30608 -3280 -16603 24123 53088 44748 29474 30295
15826C0295K9833n7057k7675K5721L935j144P10j6371J538J7859k9876L4335K8736
$$ 30295 60128 3071 -24604 1117 5052 3908 4618 -11753 -10215 7644 -22232 12103 40839
15813D0839k6177k0524J3052j1332K4338m7598J2788O1321L465j2877n1218n660
$$ 40839 14662 -5862 7190 -4142 20196 -27402 -14614 46707 50172 37295 -13923 -19583
15801a9583M0096M1055Q621n6975o5883K7302N1024R622l8614Q411L8006M5995
$$ -19583 20513 61568 70189 13214 -52669 -25367 25657 35279 -3335 5076 43082 89077
15789H9077K9557m0600j5100J6638k8626j8457Q488k3286l9175l6499K2699M2370
$$ 89077 118634 78034 62934 79572 50946 32489 40977 17691 -21484 -57983 -35284 7086
15777G086K1864j0405j635J9285J9542l6743J2688k4092n5010P494K4487k8979
$$ 7086 28950 18545 16910 36195 55737 18994 31682 7590 -47420 -39926 -15439 -44418
15765d4418J3337m615L4361L3282M531M979J1473K2025L2876l774n3250j7862
$$ -44418 -31081 -35696 -1335 31947 36478 41457 52930 74955 107831 104057 50807 32945
15753C2945l5410j9580J3852L7405j4616k774r012k6351k6086O517M1138M0437
$$ 32945 -2465 -22045 -8193 29212 14596 11822 2810 -23541 -49627 -43110 -1972 38465
15741C8465l2922Q835K7997j1974l2235m0114k3409j1502K1171L5932J7482L7741
$$ 38465 5543 14378 42375 30401 -1834 -41948 -65357 -76859 -55688 -19756 -2274 35467
15729C5467R380j3194L3371L013o1625o5144N2789J6355N1803n431N545j4833
$$ 35467 44847 31653 65024 68037 6412 -58732 -5943 10412 62215 56784 62329 47496
15717D7496q888J2051j3107M594J4680j0828l8164L6180J1950j3248o363p955
$$ 47496 38608 50659 37552 42146 56826 45998 7834 44014 55964 42716 36353 28398
15705B8398K574j0690k9901n893N6128K2486m723l5116J2377K081N7968m004k6695
$$ 28398 30972 20282 -9619 -15512 40616 63102 58379 23263 35640 37721 95689 91685 64990
15692F4990m1738k1993O832m7587K1467M1908k5839J2610K855R841o250K0610
$$ 64990 23252 1259 8091 -39496 -18029 23879 -1960 10650 13505 23346 17096 37706
15680C7706j9956J4407l6746j4981J0848K8042k328K5968O880j5605m4443o03
$$ 37706 17750 32157 -4589 -19570 -8722 19320 16992 42960 49840 34235 -10208 -10811
15668a0811N862m1069K8742J4407j3608Q298m237j2781l458J8685K1482K9906
$$ -10811 -4949 -46018 -17276 -2869 -16477 -8179 -12416 -25197 -28655 -9970 11512 41418
15656D1418L3778n1361k1000J3138K0039j9979m66M3155k3723k8908l4996j944
$$ 41418 75196 23835 2835 15973 36012 16033 15567 58722 34999 6091 -28905 -30849
15644c0849K2233J7996r583j5969k2257j8775R932J9770L1458J3665l3903l715
$$ -30849 -8616 9380 -203 -16172 -38429 -57204 -47272 -27502 3956 17621 -16282 -19997
15632a9997j5182J7876J5393k2279n392k0432M2179k1443J7020k4751J813j616
$$ -19997 -35179 -17303 -1910 -24189 -29581 -50013 -7834 -29277 -12257 -37008 -35195 -36811
15620c6811l5093k1841K1665j0410j2247P440N2385L5425P639m3278r462k8062
$$ -36811 -71904 -93745 -72080 -82490 -94737 -87297 -34912 513 8152 -35126 -44588 -72650
15608g2650L3928J9950m6517Q503J9044M079M2641J0878K0330N771k563P577m293
$$ -72650 -38722 -18772 -65289 -56786 -37742 -33663 8978 19856 40186 45957 43394 50971 46678
15595D6678K5023J3149m7509l0585K2519O649O527m1583n0962L6008M2516n774
$$ 46678 71701 84850 37341 6756 29275 35924 42451 868 -50094 -14086 28430 22656
15583B2656r109P3628J1858j9857j782j5684j6985k5839K6324l6998q421K1420
$$ 22656 13547 87175 99033 79176 77394 61710 44725 18886 45210 8212 -209 21211
15571B1211j8656j9775l0791M0837K7733l7483L985j1020l0683m2175R670K9986
$$ 21211 2555 -17220 -48011 -7174 20559 -16924 -12939 -23959 -54642 -96817 -87147 -57161
15559e7161N2677j9531m8486J8605L916L6430K6345L0237L4377l9437l9562J5290
$$ -57161 -4484 -24015 -72501 -53896 -49980 -13550 12795 43032 77409 37972 -1590 13700
15547A3700J9368j1279k3570j1678K2700O3651m6557l2702L75j8826K7335K2138
$$ 13700 33068 21789 -1781 -13459 9241 72892 26335 -6367 -5992 -24818 2517 24655
15535B4655k3714K2766K5142n5596j4437P295O464j802l4687P917K6729O972j8563
$$ 24655 941 23707 48849 -6747 -21184 -13889 -7425 -9227 -43914 -35997 -9268 -2296 -20859
15522b0859k813m676K6142M3024J1808q7621l1056Q771P807j0002j7116l715j1766
$$ -20859 -23672 -28348 -2206 40818 52626 -34995 -66051 -57280 -49473 -59475 -76591 -80306 -92072
15509i2072O229j5306K0489R1149L8786n3376O334M1797L7773l9551J6716J9800
$$ -92072 -85843 -101149 -80660 10489 49275 -4101 2233 44030 81803 42252 58968 78768
15497G8768k1451k5328M7111Q225p2889l4998O019l6888O6873k8966j5192L4176
$$ 78768 57317 31989 79100 87325 14436 -20562 -14543 -51431 15442 -13524 -28716 5460
15485E460O13j5513j2697m1387N921k3939K7791p040n681L4885P35k4453L0010
$$ 5460 6073 -9440 -22137 -63524 -57603 -81542 -53751 -60791 -66472 -31587 -30852 -55305 -25295
15472b5295K3071j1886l1073l7503K0238K5120M13j1579l1844J3067K9761K4104
$$ -25295 -2224 -14110 -45183 -82686 -62448 -37328 -36915 -48494 -80338 -67271 -37510 -13406
15460a3406P388P253J4654M2730j3767j9988j2872q294O951K9267m0438m7850
$$ -13406 -6018 1235 15889 58619 44852 24864 11992 3698 10649 39916 -522 -48372
15448d8372m839K6907J952O3769L6523m3791n1176K1367L8376n6409Q869M6102
$$ -48372 -53211 -26304 -24352 39417 75940 32149 -19027 2340 40716 -15693 -6824 39278
15436C9278j8685j0014k4539m6026J6231N3603L9076k85Q680n438p1714m5650
$$ 39278 20593 10579 -13960 -59986 -43755 9848 48924 48639 57319 51881 -19833 -65483
15424f5483L733J1683j6552K0567O860k3358j8152K8776J3634j6870K603M0962
$$ -65483 -61750 -50067 -66619 -46052 -39192 -62550 -80702 -51926 -38292 -55162 -52559 -11597
15412a1597m567R545n6397j312J0673M1928P2846N0187l6775Q734j0580j8367
$$ -11597 -16164 -6619 -63016 -64328 -53655 -11727 61119 111306 74531 83265 72685 54318
15400E4318j2005k7360N4245J3141l8457J3736J0871n406l0533l5042p38n095
$$ 54318 42313 14953 69198 82339 43882 57618 68489 63083 32550 -2492 -3230 -8325
15388h325J6043K3569K084q234n7677P059M896J2944r174j3749Q325K0483J8471
$$ -8325 7718 31287 33371 25137 -32540 -25481 -20585 -7641 -16815 -30564 -22239 -1756 16715
15375A6715O746j3075O490J4594L1412O063k2867o849o9407J5962L2859R17m4721
$$ 16715 23461 10386 16876 31470 62882 68945 46078 39229 -30178 -14216 18643 19560 -25161
15362b5161l5924k259K3097O5074K3786n2354k1696j4251M1419O1143J073j0587
$$ -25161 -61085 -63344 -40247 24827 48613 -3741 -25437 -39688 1731 62874 63947 53360
15350E3360j9614n816J2384o14j0362J9908m7868k0850K0011m3173l8109N5602
$$ 53360 33746 27930 40314 39700 29338 49246 1378 -19472 539 -42634 -80743 -25141
15338b5141M5133l2705k9638J4029N144q573K6274J8726l3364j069J534k0670
$$ -25141 19992 -12713 -42351 -28322 -23178 -31751 -5477 13249 -20115 -21184 -19650 -40320
15326d0320J4802r988K6252J8420K0879M471j4449k2734m1229M4183l073l485
$$ -40320 -25518 -35506 -9254 9166 30045 34516 20067 -2667 -43896 287 -2786 -6271
15314f271L2297K7096l6764k1517L9149N989k6800n404P553l0053n8482K202K4516
$$ -6271 26026 53122 16358 -5159 33990 39979 13179 7775 15328 -14725 -73207 -71005 -46489
15301d6489k9904J791j5923M9296O7767r772j2507P980M583k1463l0071n3811
$$ -46489 -76393 -74602 -90525 -41229 26538 16766 4259 12239 16822 -4641 -34712 -88523
15289h8523j3390O5649P9925l709j1970j384m1046Q764r814J0886J2363k4054
$$ -88523 -101913 -36264 43661 39952 27982 26598 -14448 -5684 -15498 -4612 7751 -16303
15277a6303k2817L3437n597L57J9917M8520K8129R719o9651n900J2152L638j7869
$$ -16303 -39120 -5683 -11280 -10923 8994 57514 85643 95362 25711 19811 31963 35601 17732
15264A7732m101K9166R86k7261n3021J1584N2654J3810K891k9198m9983K0370
$$ 17732 13631 42797 43783 16522 -36499 -24915 27739 41549 44440 15242 -34741 -14371
15252a4371j2666j340M6861M3128n447k8283j7749k335R147l2249j5161l2265
$$ -14371 -27037 -28377 18484 61612 56165 27882 10133 7798 16945 -15304 -30465 -62730
15240f2730n0129M0255N3737J9292K8070K7946k0177m0813O899J1699n457N461
$$ -62730 -112859 -72604 -18867 425 28495 56441 36264 -4549 2350 14049 8592 14053
15228A4053l521N0183N8280n9830n6423N9824M453l6516K8940j6859r1236j8389
$$ 14053 10532 60715 118995 59165 2742 62566 67019 30503 59443 42584 -48652 -67041
15216f7041j6495p017P9374L0711L878L1895J1076j7530M2516k0795r393m5875
$$ -67041 -83536 -90553 -11179 19532 23410 55305 66381 48851 91367 70572 61179 15304
15204A5304o009K1851p5640J3146N6786l8020j7881J1883M5329K9421R468J8935
$$ 15304 9295 31146 -44494 -31348 25438 -12582 -30463 -18580 26749 56170 65638 84573
15192H4573J4578k2643p7637m5212o009L1971q223m4437N152J6992q643M8584
$$ 84573 99151 76508 -1129 -46341 -52350 -20379 -28602 -73039 -67887 -50895 -59538 -10954
15180a0954M5990K437j6732n4773Q245j9078r124Q6890j4288l8494k8632M0977
$$ -10954 35036 37473 20741 -34032 -25787 -44865 -53989 32901 18613 -19881 -48513 -7536
15168g536J2706r40o2314L6592O0420l0169p2202o7434J6308J4381O7002J011
$$ -7536 5170 4230 -58084 -21492 38928 8759 -63443 -130877 -114569 -100188 -33186 -32175
15156c2175q531J3496Q814J9465K4354K8479j2718J355L055m1363n1470l0174
$$ -32175 -40706 -27210 -18396 1069 25423 53902 41184 42539 45594 4231 -47239 -77413
15144g7413K0899Q4608M2819J3165k4421k989J5183k6433J6292L0931p8551n1657
$$ -77413 -56514 28094 70913 84078 59657 56668 71851 45418 61710 92641 14090 -37567
15132c7567L8715k5366n768o6403m6547K7242J4666J09167L9401l3055n5831N6441
$$ -37567 1148 -24218 -29986 -96389 -142936 -115694 -101028 8139 47540 14485 -41346 15095
15120A5095j8013l0508N1344l558J1623K9207j7755o3245m3143p288N9009K054
$$ 15095 -2918 -33426 17918 14360 25983 55190 37435 -25810 -68953 -76241 -17232 -15178
15108a5178m110Q793K6282J8378k6215j0187K5932k8863k2508l8065K0999L205
$$ -15178 -19288 -10495 15787 34165 7950 -2237 23695 -5168 -27676 -65741 -44742 -41537
15096d1537n712O6925K0088r133K5293O481j4960l5174L0698J3671j4301l838
$$ -41537 -47249 19676 39764 30631 55924 62405 47445 12271 42969 56640 42339 38501
15084C8501J9866n7093l0787j3416J0387m24J2013J5271j8345p552P595l9125
$$ 38501 58367 1274 -29513 -42929 -32542 -32966 -20953 -5682 -24027 -31579 -23984 -63109
15072f3109M237k0488j7974k100L1134k3518k3267O6213O3380n8435n0321j0308
$$ -63109 -58872 -79360 -97334 -99434 -68300 -91818 -115085 -48872 14508 -43927 -94248 -104556
15060a04556j0184L9129J2026j9336L2022J8314N964R798l9984o592J0075J0419
$$ -104556 -114740 -75611 -63585 -82921 -50899 -32585 -26621 -16823 -56807 -63399 -53324 -42905
15048d2905J0700q525L4566O885K3140m099k8927n570K8414m64p248L904Q794
$$ -42905 -32205 -40730 -6164 721 23861 19762 -9165 -14735 13679 13215 5967 9871 18665
15035A8665k564m9310l2858K2823K1681o755Q658J0318l6941O024N9799J3499
$$ 18665 16101 -33209 -66067 -43244 -21563 -28318 -19660 -9342 -46283 -40259 19540 33039
15023C3039o5811k6435K1766k885m0668L9428J2312K3309J236L6044Oj08062O751
$$ 33039 -32772 -59207 -37441 -40326 -80994 -41566 -29254 -5945 -4709 31335 31341 -76721 -69970
15010f9970P1386L8753m662l2149j8502Q818r837l503J3876J9041L8563l575p3756
$$ -69970 1416 40169 35507 3358 -15144 -6326 -16163 -19666 -5790 13251 51814 48239 -25517
14997b5517l5371K0202J8356K8577l3557j6619J1081j110M076q116J7565n0808
$$ -25517 -60888 -40686 -22330 6247 -27310 -43929 -32848 -33958 -29882 -37998 -20433 -71241
14985g1241j3792L7052R433K1606K3778N960k3584J2003l4452m4488K2119k1794
$$ -71241 -85033 -47981 -38548 -16942 6836 12796 -10788 1215 -33237 -77725 -55606 -77400
14973g7400J8427J3934K6258L8181n884M0833l1579l5045K0816M2437K3660l5738
$$ -77400 -58973 -45039 -18781 19400 13516 54349 22770 -12275 8541 50978 74638 38900
14961C8900n8694K2727j7492n6153k9703M9602L1324l8329L06N2244L60n3910
$$ 38900 -19794 2933 -14559 -70712 -100415 -50813 -19489 -57818 -57512 -5268 -4908 -58818
14949e8818M6599J0159K5278p264j1097l2867q263N9447N3965k4213m6302l3295
$$ -58818 -12219 -2060 23218 15954 4857 -28010 -36273 23174 77139 52926 6624 -26671
14937b6671p591R758J1101l2802J1306O4931K5868K6002K3094m041o8446l8827
$$ -26671 -34262 -24504 -13403 -46205 -34899 30032 55900 81902 104996 100955 32509 -6318
14925f318K4517N758j2666j9382K2989j0794k652J0443K3311k0576j2515J8275
$$ -6318 18199 23957 11291 -8091 14898 4104 1452 11895 35206 14630 2115 20390
14913B0390k9161j8433J3162L4041L0678K0478M195j9734n7110j7020k2426J693
$$ 20390 -8771 -27204 -14042 19999 50677 71155 75350 55616 -1494 -18514 -40940 -39247
14901c9247M60o828J0384k6664N763R2217N1076l3800m5881j4278L7227K7591
$$ -39247 -38787 -45615 -35231 -61895 -56132 36085 87161 53361 7480 -6798 30429 58020
14889E8020k9695K750k301k7075n317O381m9791j1371k4791R857K299M930Q2639
$$ 58020 28325 31075 28774 1699 -3618 2763 -47028 -58399 -83190 -73333 -71034 -66104 16535
14876A6535L8188M9698L123J6668J2174j4071o5761m7790J6377m9429l5057J6098
$$ 16535 54723 104421 107544 124212 136386 122315 56554 8764 25141 -24288 -59345 -43247
14864d3247J1410p96K1977O4869P832n2330k3725N0743L283m5445l4535k0421
$$ -43247 -31837 -32633 -10656 54213 62045 9715 -14010 36733 40016 -5429 -39964 -60385
14852f0385J0333K7456L3012J0200N3378J0555j9250m1490k538n361j3082l2359
$$ -60385 -50052 -22596 10416 20616 73994 84549 65299 23809 21271 15910 2828 -29531
14840b9531j8660j7615R541L2194m5597K6646J8106l602J4276l1968L1154J2566
$$ -29531 -48191 -65806 -56265 -24071 -69668 -43022 -24916 -28518 -14242 -46210 -15056 -2490
14828b490K861K6442J5013m0737k7396K9557L8521L4418Q980N957J8565l4262
$$ -2490 371 26813 41826 1089 -26307 3250 41771 76189 85169 91126 109691 75429
14816G5429n8168K3334K0027K2648K637l4275k6245O196k1969R733J7177J2831
$$ 75429 17261 40595 60622 83270 85907 51632 25387 31583 9614 19347 36524 49355
14804D9355N047J4539K9454K325l8126l0952p2412N4505l5495n697l3557l3256
$$ 49355 54402 68941 98395 100720 62594 31642 -40770 13735 -21760 -27457 -61014 -94270
14792i4270J6881N4368l2730J5035P202J5565M2196j6125l0088k1556j529P587
$$ -94270 -77389 -23021 -55751 -40716 -33514 -17949 24247 8122 -21966 -43522 -45051 -37464
14780c7464K128J7717J6799r131l8200o1985J978N5674O9336j2320o5263j9675
$$ -37464 -35336 -17619 -820 -9951 -48151 -110136 -108158 -52484 16852 4532 -60731 -80406
14768h0406K1426J2023K5105M2241k6778J8659K7330j0809k3919N648j0033K602
$$ -80406 -58980 -46957 -21852 20389 -6389 12270 39600 28791 4872 10520 487 3089
14756C089P973J3419J555n6390l1597j9848k3112j0327Q6925J9748k7898j5811
$$ 3089 11062 24481 26036 -30354 -61951 -81799 -104911 -115238 -28313 -8565 -36463 -52274
14744e2274r137J0997J7050k5827K8310M3250N5534K5957m0142k8705M671q658
$$ -52274 -61411 -50414 -33364 -59191 -30881 12369 67903 93860 53718 25013 29684 21026
14732B1026l064K3601N769L671P64k2826l2141p30N998l4998K9581K0829j7481
$$ 21026 17962 41563 47332 51003 51767 28941 -3200 -3930 2068 -32930 -3349 17480 -1
14719aJ3364j2304j377n3017j2803M0256L2382N3768j4273m0965o089j0l6817
$$ -1 13363 1059 -318 -53335 -66138 -25882 6500 60268 45995 5030 -1059 -1069 -37886
14706c7886j2687Q28O1360O4781l0935r0115j1100J3055L668M0876L2813j7599
$$ -37886 -50573 -49745 11615 76396 45461 -44654 -55754 -42699 -39031 1845 34658 17059
14694A7059k5491m9368M3820K5665q706L7044J4675o6516m7449l118n2525L243
$$ 17059 -8432 -57800 -13980 11685 2979 40023 54698 -11818 -59267 -62385 -114910 -111667
14682a11667P3076M9732j2508K8284J8447l1361m066J2692L682j4415j4498r860
$$ -111667 -38591 11141 -1367 26917 45364 14003 9937 22629 26311 11896 -2602 -12462
14670a2462J3890k602o8901J9427M2271L3299L4013o5179o8631O148K7428J4988
$$ -12462 1428 -1174 -70075 -50648 -8377 24922 58935 -6244 -74875 -68727 -41299 -26311
14658b6311J7927N520O722J9700M9728M2782m4255m1490k120L668j1681q485N2769
$$ -26311 -8384 -2864 3858 23558 73286 116068 71813 30323 28203 31871 20190 11705 64474
14645F4474K4281p664m0377J1255j8074R106K1752k4356L4020n363n2439l2238
$$ 64474 88755 81091 40714 51969 33895 43001 64753 40397 74417 69054 16615 -15623
14633a5623K084m4420j1345K4393M7230q069L2895K6854J0364n5226o0922l0057
$$ -15623 -13539 -57959 -69304 -44911 2319 -5750 27145 53999 64363 9137 -51785 -81842
14621h1842K1853K1678k3807n491K214l8437j6062N9102J6621r843j9343L0145
$$ -81842 -59989 -38311 -62118 -67609 -65395 -103832 -119894 -60792 -44171 -54014 -73357 -43212
14609d3212O8791K3602o9298k2423o307n121l1152L7775J04693J330o9836j1770
$$ -43212 25579 49181 -20117 -42540 -48847 -53968 -85120 -47345 57348 58678 -11158 -22928
14597b2928j9971o4941O981P3721J7381l3611k8613Q1012M0561j2124P698O611
$$ -22928 -42899 -107840 -100859 -27138 -9757 -43368 -71981 9031 49592 37468 45166 51777
14585E1777r167l5281k0809k7391M807j6616j2929K3028p873J2907L2499M0721
$$ 51777 42610 7329 -13480 -40871 -36064 -52680 -65609 -42581 -50454 -37547 -5048 35673
14573C5673K8769J5256k5209p6714n653K5317M708O043j1520o3121K1964J5444
$$ 35673 64442 79698 54489 -22225 -27878 -2561 2147 8190 -3330 -66451 -44487 -29043
14561b9043J0207M0475J7334L2986J6775J5089j4471m7406o3614k4115N055L1518
$$ -29043 -18836 21639 38973 71959 88734 103823 89352 41946 -21668 -45783 -40728 -9210
14549i210J079L5218J9582K3093l1646n723k1966Q060l3296L3538j1588m1717
$$ -9210 -8131 27087 46669 69762 38116 32393 10427 18487 -14809 18729 7141 -34576
14537c4576J8827P6585L7201K208n2588p2748n1343l3263K177M6879L3228J2448
$$ -34576 -15749 60836 98037 100245 47657 -25091 -76434 -109697 -107520 -60641 -27413 -14965
14525a4965J5251J6884j4259l9737J2944J7584k4787L7724M3845M0658p12k8038
$$ -14965 286 17170 2911 -36826 -23882 -6298 -31085 6639 50484 91142 90430 62392
14513F2392o371n909n671m3550J0049N5417Q413j2576o7771n6860k821K037k0964
$$ 62392 56021 50112 44441 891 10940 66357 74770 62194 -5577 -62437 -65258 -63221 -84185
14500h4185O0096J7492K4626n9560r5987J3162L4789m197J6889J1041J4018N0968
$$ -84185 -24089 -6597 18029 -41531 -137518 -124356 -89567 -93764 -76875 -65834 -51816 -848
14488h48M5807K4851K0964N126r9278K895K048l5435k8895N2493K148m5863j825
$$ -848 44959 69810 90774 95900 -3378 -483 1565 -33870 -62765 -10272 -8124 -53987 -55812
14475e5812k0061o925K6210m892L7358K5375l3620J3039L3252K5740p828l9055
$$ -55812 -75873 -82798 -56588 -61480 -24122 1253 -32367 -19328 13924 39664 31836 -7219
14463g219K2549K6426K4566j9176k870l0181J1049n666R937j8534J340m263k2207
$$ -7219 15330 41756 66322 47146 44276 14095 25144 19478 29415 10881 12221 7958 -14249
14450a4249P634L634L2903P097J6428k4698l7472j3972L4003Q2058J6680k4054
$$ -14249 -6615 -2981 29922 37019 53447 28749 -8723 -22695 11308 93366 110046 85992
14438H5992M862k2452q0323n0537j9062K7376L0492k1862l7652j6975K1385L6034
$$ 85992 90854 68402 -11921 -62458 -81520 -54144 -23652 -45514 -83166 -100141 -78756 -42722
14426d2722j3014J5720N0717L6169j2943R236k4415j448L0128K3999o0326j709
$$ -42722 -55736 -40016 10701 46870 33927 43163 18748 17300 47428 71427 11101 9392
14414I392O2950O5384j2594k4400n9155j7966m0589J2397o9151n0397M1537J1083
$$ 9392 72342 137726 125132 100732 41577 23611 -16978 -4581 -73732 -124129 -82592 -71509
14402g1509K1524O7682J8707j0480R427R063J6470M009p806j1020k6357l7523
$$ -71509 -49985 17697 36404 25924 35351 44414 60884 64893 57087 46067 19710 -17813
14390a7813j707L8568k7136j399K8184M3273P677q0751n405J6445Q461m421q563
$$ -17813 -19520 19048 -8088 -9487 18697 61970 69647 -11104 -16509 -64 8397 3976 -4587
14377d587J5901J8569O7444K2275j6839m2275p5837l3863J5554P9454K4660m2746
$$ -4587 11314 29883 97327 119602 102763 60488 -15349 -49212 -33658 45796 70456 27710
14365B7710l3927J2063K3798L0465l1026o9462k8785K5897M6277K5965J3533q660
$$ 27710 -6217 5846 29644 60109 29083 -40379 -69164 -43267 3010 28975 42508 33848
14353C3848l5241m577N3109J2962l708J651k7657n1306m4485P694k4099L0172
$$ 33848 -1393 -5970 47139 60101 56393 58044 30387 -20919 -65404 -57710 -81809 -51637
14341e1637M6692J7297K1630J8492K3275O173J7927j4081k9028p3444q0196R051
$$ -51637 -4945 12352 33982 52474 75749 81922 99849 85768 56740 -16704 -96900 -87849
14329h7849N7914k4765o393k914K8641m046P803M2744J6583L2792K9440m2059
$$ -87849 -29935 -54700 -61093 -64007 -35366 -39412 -31609 11135 27718 60510 89950 47891
14317D7891m7595J311N7571K4925k4406l4975k378J1553l0719O073L7504q482
$$ 47891 296 1607 59178 84103 59697 24722 22344 33897 3178 9251 46755 38273
14305C8273k8155l1126q0394J3163O5300M8822P0393K1382R24l8537l7646p3655
$$ 38273 10118 -21008 -101402 -88239 -22939 25883 96276 117658 118582 80045 42399 -31256
14293c1256J6229M5644J6284j7983k2092k3546k4457J730k6122l0047L5921P6433
$$ -31256 -15027 30617 46901 28918 6826 -16720 -41177 -39447 -65569 -95616 -59695 16738
14281A6738R6340J9919n3072n460K2263j8856O871J7360p9979k2313P573l5341
$$ 16738 113078 132997 79925 74465 96728 77872 84743 102103 22124 -189 7384 -27957
14269b7957o00L5866J0481j7165m2072M069K0322J9282R530K2126K1680L2669
$$ -27957 -28557 7309 17790 625 -41447 -37378 -17056 2226 11756 33882 55562 88231
14257H8231j8220n5980l0320j639J7440m2017K51L6875J8974l2343m2548K2563
$$ 88231 70011 14031 -16289 -17928 -488 -42505 -42254 -5379 13595 -18748 -61296 -38733
14245c8733K5657L5039O270J3590J6438j0512l1304M561L3383J6647Q412J3422
$$ -38733 -13076 21963 28233 41823 58261 47749 16445 21006 54389 71036 79448 92870
14233I2870j1633m9798P05p890L9608K8153l1596m6839P024R833Q383L6317k5432
$$ 92870 81237 31439 32144 24254 63862 92015 60419 13580 20604 30437 38820 75137 49705
14220D9705k6331n1686k4953L3823q449j4294K7356K8385j0771k6550j7094j6138
$$ 49705 23374 -28312 -53265 -19442 -27891 -42185 -14829 13556 2785 -23765 -40859 -56997
14208e6997k0360l7800M204P5271J0436J6888M5818K6026K1264l458l7250o368
$$ -56997 -77357 -115157 -110953 -35682 -25246 -8358 37460 63486 84750 81292 44042 37674
14196C7674n5473J0416O7443n2683m4595j746R871O3219j6283k2917j0061M0585
$$ 37674 -17799 -7383 60060 7377 -37218 -38964 -29093 34126 17843 -5074 -15135 25450
14184B5450K6760r991L1722J448l5192l569J2750J2502k3091j8010M1182j4852
$$ 25450 52210 42219 73941 75389 40197 36628 49378 61880 38789 20779 61961 47109
14172D7109K0365o631j5787K0571M9131N7356j024R312P0162J09804J94034K42641
$$ 47109 67474 60843 45056 65627 114758 172114 171090 180402 250564 360368 554402 797043
14160G97043K70782K08820J06652M7966j37231l35193l31819k19149n1367l4936
$$ 797043 1067825 1276645 1383297 1431263 1294032 958839 627020 407871 356504 321568
14150C21568m7775o0919o2592J0574K7088J7165m7400K1361j1289K1273j876K6525
$$ 321568 273793 212874 150282 160856 187944 205109 157709 179070 167781 189054 187178 213703
14138B13703J3208m1386m5629m0539P808L9554n9777O981J2822K0959J5311j380
$$ 213703 226911 185525 139896 99357 107165 146719 86942 93923 106745 127704 143015 141635
14126A41635m8206j6302O8304n9780n0375o523K6793J3435k5700m154k7939J3020
$$ 141635 93429 77127 145431 85651 35276 28753 55546 68981 43281 39127 11188 24208
14114B4208O562M6861N8584j0349j3623K4669j3564m8523k3112j8650r403K4698
$$ 24208 30770 77631 136215 125866 112243 136912 123348 74825 51713 33063 23660 48358
14102D8358L521j7866k4192P7886M7253P4570Q5552O8699J7299M8649J7076j00211
$$ 48358 51879 34013 9821 87707 134960 209530 295082 363781 381080 429729 446805 346594
14090C46594j20959n8856l8968J9735J9559n6244l3218K9008L2301j10j3761o2191
$$ 346594 225635 166779 127811 147546 167105 110861 77643 106651 138952 138842 125081 62890
14078F2890j7031J5891m308M297J9060p017o07K1564K8988P493l2330k6314n395
$$ 62890 45859 61750 57442 61739 80799 73782 73175 94739 123727 131220 98890 72576 67181
14065F7181K6011J6201k417R409o678o8717j3675O0128l0285r254J5200k5546
$$ 67181 93192 109393 106976 116385 109707 40990 27315 87443 57158 47904 63104 37558
14053C7558j8711r33l780L8011K6403q852l9329l0589k796P5430M4957R54J7164
$$ 37558 18847 17914 14134 52145 78548 69696 30367 -222 -3018 72412 117369 118323 135487
14040A35487l6919k3705J1708P7835J132m8963j036j2141o3877o318J8911O659
$$ 135487 98568 74863 86571 164406 165538 116575 115539 103398 39521 33203 52114 58773
14028E8773O186m7869p71L3011K0616J5807j655p3766m1090l92N6619K9686O950
$$ 58773 64959 17090 16319 49330 69946 85753 84098 10332 -30758 -31150 25469 55155 62105
14015F2105m2648m4984k1181L1449K3394k356j3684M313k163J9804m5795o808
$$ 62105 19457 -25527 -46708 -15259 8135 5779 -7905 -3592 -5755 14049 -31746 -38554
14003c8554L9406L2913K5126J6064k0519K0541l390l7299l8969J361n901K6554
$$ -38554 852 33765 58891 74955 54436 74977 71587 34288 -4681 -3320 -9221 17333
13991A7333M6247J9943R386k4859k7592m2393m8339L4699K6327k4651N9166j3053
$$ 17333 63580 83523 92909 68050 40458 -1935 -50274 -15575 10752 -13899 45267 32214
13979C2214l8589J3447Q791l0772j8058j4691L8685N3568J0201K6398l8420l1308
$$ 32214 -6375 7072 15863 -14909 -32967 -47658 -8973 44595 54796 81194 42774 11466
13967A1466j8871j5872j2198N140k3809J592J1393Q2121M1375r393m5391l1401
$$ 11466 -7405 -23277 -35475 -30335 -54144 -52552 -41159 40962 82337 72944 27553 -3848
13955c848J4181M8344M6373n2581l7171K0527K2900J7496j630k559J6040Q0k6094
$$ -3848 10333 58677 105050 52469 15298 35825 58725 76221 74591 72032 88072 88152 62058
13942F2058m573K1589M8669K8884J705k9949j5275K0302k738J3940Q919k1874
$$ 62058 57485 79074 127743 156627 158332 128383 113108 133410 130672 144612 153531 131657
13930A31657n2128j7406k5511R722N2190J0699k0837M4231k4576o9409k0495j9652
$$ 131657 79529 62123 36612 46334 98524 109223 88386 132617 108041 38632 18137 -1515
13918a515k7604k012J1244J7978l60M99N6249J7758K244k773j6539K280L497N6126
$$ -1515 -29119 -31131 -19887 -1909 -2269 -1770 54479 72237 74481 71708 55169 57449 60946 117072
13904A17072j3811j9820M508J1814L235j150m3131k5993j7151L6193M5693K8167
$$ 117072 103261 83441 87949 99763 102998 101848 58717 32724 15573 51766 97459 125626
13892A25626J486m5341n8650m1543j2084r188q111L1475P0361Q840l5043k6480
$$ 125626 127112 81771 23121 -18422 -30506 -39694 -47805 -16330 54031 62871 27828 1348
13880A348N966k3316k4586j2227o947J8604P5628O7827J3711k246M3385M314k9820
$$ 1348 7314 -16002 -40588 -52815 -59762 -41158 34470 102297 116008 113762 157147 161461 131641
13867A31641m6674l9710k2567K2404K2785L139M3508K073p795l8451p3533j9332
$$ 131641 84967 45257 22690 45094 67879 71018 114526 116599 108804 70353 -3180 -22512
13855b2512M5212K1712M0568M913p5916k5605o664k504M4282L6963L3361Q62o6760
$$ -22512 22700 44412 84980 89893 13977 -11628 -18292 -20796 23486 60449 93810 94672 27912
13842B7912k7505M1242O3248N8491o5260l2717J4080J2356l7979n5429K5008j9037
$$ 27912 407 41649 104897 163388 98128 65411 79491 91847 53868 -1561 23447 4410
13830D410L9561M0775K6264K9337k8419j0245l103K2514J612n0059m7324P420
$$ 4410 43971 84746 111010 140347 111928 101683 98580 121094 122706 72647 25323 32743
13818C2743L8534J6234N6870k0204Q885R0312K2149L954J4075l7430k2634L5120
$$ 32743 71277 87511 144381 124177 133062 223374 245523 249477 263552 226122 203488 238608
13806B38608J0780k6138J8252O024J5458j0905m28J4430J9751j0255o4874k1248
$$ 238608 249388 223250 241502 247526 262984 252079 251651 266081 285832 275577 210703 189455
13794A89455M8929J828L8841N8230l9278m5445M7685n528K5038m8553l5678K31
$$ 189455 238384 240212 279053 337283 298005 252560 300245 294717 319755 271202 235524 235755
13782B35755K1327k3348N582k337K6188L9536n105j6036k5700l1959L6843J2697
$$ 235755 257082 233734 239316 236979 263167 302703 297598 281562 255862 223903 260746 273443
13770B73443p5462p2118L2056Q0206j221J4856N736K6454j2267K8387L8679L843
$$ 273443 197981 125863 157919 238125 236904 251760 257496 283950 271683 300070 338749 342592
13758C42592L092p3512L8804M8215Q163K180L2629j0379J2423L548j5845r901
$$ 342592 345684 272172 310976 359191 367354 369534 402163 391784 404207 407755 391910 382009
13746C82009J8884N7592K1463O069n278n9023m5123J4776J1875K5173M3972k663
$$ 382009 400893 458485 479948 486017 480739 421716 376593 391369 403244 428417 472389 469726
13734D69726m2607n805K6883M1620M1012J2957J8990J03183P5042M9994K6907
$$ 469726 427119 421314 448197 489817 530829 543786 562776 665959 741001 790995 817902
13723H17902K6271J8943K5730L0216O1622J07741J67520J38308Q6817R7980J07374
$$ 817902 844173 863116 888846 919062 980684 1088425 1255945 1394253 1481070 1579050 1686424
13712A686424K00165J51700R7709J00571J21453J43539K13627K29401L07455L87124
$$ 1686424 1886589 2038289 2135998 2236569 2358022 2501561 2715188 2944589 3252044 3639168
13702C639168N02618N01492N21348O29268Q47544J169862J566981J887357K149073
$$ 3639168 4141786 4643278 5164626 5793894 6641438 7811300 9378281 11265638 13414711
13693A3414711K625245L508489M862869P440873J2238098K0653238L5648076N6594272
$$ 13414711 16039956 19548445 24411314 31852187 44090285 64743523 100391599 156985871
13685A56985871O4766333M1787967J4726732J282643l3516272p1690306n8486931
$$ 156985871 221752204 263540171 278266903 279549546 246033274 174342968 115856037
13678A15856037l2885032j7982154j0558605o889418n010054l962735l369897
$$ 115856037 82971005 64988851 54430246 47540828 42530774 38568039 35198142
13671C5198142k899448k545518k428246k279168k025881j729447j463043j192192
$$ 35198142 32298694 29753176 27324930 25045762 23019881 21290434 19827391 18635199
13663A8635199j020008q23793p61456o88608p16711p52715o95345o14844n75948
$$ 18635199 17615191 16791398 16029942 15341334 14624623 13871908 13176563 12561719 11985771
13654A1985771n40099m23463l34093l38661l33295l29290l44269k78208k95747
$$ 11985771 11445672 11022209 10688116 10349455 10016160 9686870 9342601 9064393 8768646
13645H768646k92063l55907l11853k85537j92649k56060k78223k63691k52411
$$ 8768646 8476583 8120676 7808823 7523286 7330637 7074577 6796354 6532663 6280252
13636F280252j93683j25547j93391k24381j83380j29393j58480j48583j64333
$$ 6280252 6086569 5961022 5767631 5543250 5359870 5230477 5071997 4923414 4759081
13627D759081j39808j20140k00214k28658j72892q6445j02500j26453j08804r5654
$$ 4759081 4619273 4499133 4298919 4070261 3897369 3810924 3708424 3581971 3473167 3377513
13617C377513r1698j54237o1929j7441o9728q8739j14112q8910p1722o3711r7746
$$ 3377513 3285815 3131578 3069649 3052208 2982480 2893741 2779629 2690719 2618997 2555286 2457540
13606B457540m2596n8226r3893j26277p7799k5357P979k2236l1901m0818l7480
$$ 2457540 2414944 2356718 2262825 2136548 2058749 2033392 2041371 2019135 1987234 1946416 1908936
13595A908936l4975o8871r696K2110l891q7955r6296j06422k6289k1971k6077
$$ 1908936 1873961 1805090 1795394 1817504 1813613 1725658 1629362 1522940 1496651 1474680 1448603
13584A448603r1208p6271l6844q7375j31337j06582o2841q3965p4505l1677k7149
$$ 1448603 1357395 1281124 1244280 1156905 1025568 918986 856145 772180 697675 665998 638849
13573F38849M2186L4147l0462l5304n3172r5817m6030o4169l51n066N6344M0388
$$ 638849 681035 715182 684720 649416 596244 500427 454397 390228 389877 384811 441155 481543
13561D81543l8420j8630m2919J3594L8546J4162n2205m2669j8781J3462o461n7475
$$ 481543 443123 424493 381574 395168 433714 447876 395671 353002 334221 347683 341222 283747
13549B83747k9162R220M1561K3877l9624j6991J7702o585l7841j6654K7063j1221
$$ 283747 254585 263805 305366 329243 289619 272628 290330 283745 245904 229250 256313 245092
13537B45092O808m3689P979P2167k8280J3502j0083o845n3333m3735k0304q497
$$ 245092 251900 208211 216190 288357 260077 273579 263496 256651 203318 159583 139279 130782
13525A30782n854M5415P6921j6310J6078P1618J7410j5617k1144j627O898M9067
$$ 130782 124928 170343 247264 230954 247032 318650 336060 320443 299299 297672 304570 353637
13513C53637m7835p1940k5070o249o548N0993l9275m2097l4910j0658k3177q669
$$ 353637 305802 233862 208792 202543 195995 246988 207713 165616 130706 120048 96871 88202
13501H8202j3228k2229l4193M334N684m0997j4718O6227O6962J5686L693J3514
$$ 88202 74974 52745 18552 22886 28570 -12427 -27145 39082 106044 121730 125423 138937
13489A38937L2915P0918J5843j4766j9913l0445K779m19J9517m2040m1052J761
$$ 138937 171852 242770 258613 243847 223934 193489 196268 195849 215366 173326 132274 134035
13477A34035M0471N4973j8875k7355k076L8898Q067M850j9873m2180J4440J9602
$$ 134035 174506 229479 210604 183249 181173 220071 228138 232988 213115 170935 185375 204977
13465B04977k9095k8410J290j9255L980O0254J2578j3143q878J7143J3422k1680
$$ 204977 175882 147472 148762 129507 133487 193741 206319 193176 184298 201441 214863 193183
13453A93183N1373K3616l8827k6865j4848n4788l7289M3953J2813n0699o697O7025
$$ 193183 244556 268172 229345 202480 187632 132844 95555 139508 152321 101622 94925 161950
13441A61950l1985m58O326n429n4025l4656K3879J7883K8539n2400j6050L8626
$$ 161950 129965 129507 135833 130404 76379 41723 65602 83485 112024 59624 43574 82200
13429H2200k0283l3507o0327N0117J0875K5212J2952k7054j896K6593K9956Q239
$$ 82200 61917 28410 -31917 18200 29075 54287 67239 40185 38289 64882 94838 103077
13417A03077J7904l3165j2258J1079k6166J65K249L3639K1008K1673o6527l9144
$$ 103077 120981 87816 75558 86637 60471 60636 62885 96524 117532 139205 72678 33534
13405C3534P0886L8431o6924L1363j9747k8015k4730k2984P038k9726K4914K1169
$$ 33534 104420 142851 75927 107290 87543 59528 34798 11814 18852 -10874 14040 35209
13393C5209M5303j1l2640J9484M2865o076O96j0692j8874k3826N1230k2343n2901
$$ 35209 80512 80501 47861 67345 110210 104134 104830 94138 75264 51438 102668 80325 27424
13380B7424k5667k6049K7401M5106J8558j1279k9896r7895k2020L5628J6607K3642
$$ 27424 1757 -24292 3109 48215 66773 55494 25598 -72297 -94317 -58689 -42082 -18440
13368a8440L2455K7315J8695k57K4754J8842m1338q916l1376l4818k0892k7008
$$ -18440 14015 41330 60025 59768 84522 103364 62026 53110 21734 -13084 -33976 -60984
13356f0984M8578M8544j2951K2462K7242o0562m3883N6003L7130n9773m7298J9773
$$ -60984 -12406 36138 23187 45649 72891 12329 -31554 24449 61579 1806 -45492 -25719
13344b5719K0758j5388m6367O5025R7982J7540j6766o1274l7414j9035K7874K3846
$$ -25719 -4961 -20349 -66716 -1691 96291 113831 97065 35791 -1623 -20658 7216 31062
13332C1062j0514m1287Q47L1549M5540K0821K3474n2526j2983K9192K8314m4798
$$ 31062 20548 -20739 -19892 11657 57197 78018 101492 48966 35983 65175 93489 48691
13320D8691j1816L2629O499n0879k6249K2699K3753j283r654j3755j5920k2108
$$ 48691 36875 69504 76003 25124 -1125 21574 45327 44044 34390 20635 4715 -17393
13308a7393J0961M1713J7589l4247l3076n319R159o09n885J2423k6375J6J7681
$$ -17393 -6432 35281 52870 18623 -14453 -19772 -10613 -11222 -17107 -4684 -31059 -31043 -13362
13295a3362l8263O651p999N1831M8001r616K7688Q7296r373q842L429o2729n8844
$$ -13362 -51625 -44974 -52973 -1142 46859 37243 64931 152227 142854 134012 137441 74712 15868
13282A5868r830k092j8294M8755M1505j5708k5591k9798M421J7608k8128m5061
$$ 15868 6038 3946 -14348 34407 75912 60204 34613 4815 9236 26844 -1284 -46345
13270d6345L9894n1541l3216N4305K0159L7354j0694O453M3000L8145k9201M519
$$ -46345 -6451 -57992 -91208 -36903 -16744 20610 9916 16369 59369 97514 68313 72832
13258G2832l6609l149k1510k1156k303K5728j7838l2615K0162j671l1113K4703
$$ 72832 36223 33074 11564 -9592 -11895 13833 -4005 -36620 -16458 -18129 -49242 -24539
13246b4539M4184K1313k0733l5844J3370L4545N9033M1409o0874J215o589o6376
$$ -24539 19645 40958 20225 -15619 -2249 32296 91329 132738 71864 73079 66490 114
13234A14m3675M4636O596M9569J4679m0966j2524J785k7462k129j6212n1476K7271
$$ 114 -43561 1075 7671 57240 71919 30953 18429 20214 -7248 -9377 -25589 -77065 -49794
13221d9794J9168K6652L2297M0163L098j7031M9112K8816k7420o966L5033M6846
$$ -49794 -30626 -3974 28323 68486 71584 54553 103665 132481 105061 98095 133128 179974
13209A79974N700P3775P1574J19511K24690L38218L14603J52678L7811p9628k69890
$$ 179974 185674 259449 331023 450534 675224 1013442 1328045 1480723 1518534 1438906 1169016
13198A169016l33683k20186j31008j07786o2999K8765J2052l6198j7026l2574
$$ 1169016 835333 615147 484139 376353 313354 342119 354171 317973 300947 268373
13188B68373j03322k2954p572J0765K3823K0554o4450j3292m9786l8118P7792
$$ 268373 165051 142097 134525 145290 169113 189667 125217 111925 62139 24021 101813
13177A01813j0150l0745N35N5789L1655q873k3184j0867k1640m6240N3772K0849
$$ 101813 91663 60918 61453 117242 148897 140024 116840 105973 84333 38093 91865 112714
13165A12714m3690l7936l215M424j6486k3809k0757m4343j7579O2068M3871R357
$$ 112714 69024 31088 27873 32297 15811 -7998 -28755 -73098 -90677 -28609 15262 24619
13153B4619l5689L4545L2091L9752J0077L871l9760L2748J3306k0143M5198m8871
$$ 24619 -11070 23475 55566 95318 105395 109266 69506 102254 115560 95417 140615 91744
13141I1744n3739l960o4315K643K1640n354L0701J9805l2339K5826N3192J4360
$$ 91744 38005 34045 -30270 -27627 -5987 -11341 19360 39165 6826 32652 85844 100204
13129A00204p198l817J7489l3523o3528m2983l0575l438N0046Q0168J3493j9574
$$ 100204 93006 89189 106678 73155 9627 -33356 -63931 -67369 -17323 62845 76338 56764
13117E6764l7720M2542k684J0426l5942r202k2701J758J6830j7150p264l348l1707
$$ 56764 19044 61586 58902 69328 33386 24184 1483 3241 20071 2921 -4343 -7691 -39398
13104c9398j8655J5380M103j6627L8374J6880J6030J2039Q585l2377J2839M1659
$$ -39398 -58053 -42673 -38570 -55197 -16823 57 16087 28126 36711 4334 17173 58832
13092E8832m0434k6030j0751k352M6615J6090l0861l0131N2791O126j6564j8458
$$ 58832 18398 -7632 -18383 -20735 25880 41970 11109 -19022 33769 39895 23331 4873
13080D873k0389J3465l2190n7216L5930J10030O22j4555l4746k7400M2866N9570
$$ 4873 -15516 -2051 -34241 -91457 -55527 54503 55125 40570 5824 -21576 21290 80860
13068H0860O714l9938k2567K9044n894o443o583L2642j1816J0764n0104l6798
$$ 80860 87574 47636 25069 54113 48219 41776 35193 67835 56019 66783 16679 -20119
13056b0119k9859j3110M0629N0369k5169K0172L1566l5579k6076N473N5201o0770
$$ -20119 -49978 -63088 -22459 27910 2741 22913 54479 18900 -7176 -1703 53498 -7272
13044g272l952M7565n01J8102r147l1937M460K518k7285o7477m4993N6246L7389
$$ -7272 -11224 36341 35840 53942 44795 12858 17318 19836 -7449 -74926 -119919 -63673 -26284
13031b6284k7785M306J8413J6255K7193o3271m714L4384Q026K7747P5984j5405
$$ -26284 -54069 -49763 -31350 -15095 12098 -51173 -55887 -21503 -13477 14270 90254 74849
13019G4849m0070l3710Q577r902l338o273M822j323R588j3065J9588k5377K403
$$ 74849 34779 1069 9646 -256 -3594 -9867 -5045 -6368 3220 -9845 9743 -15634 -13231
13006a3231N8150k4202k4698O7089K0036R561k9906o6623k588J3062K138k020
$$ -13231 44919 20717 -3981 63108 83144 92705 62799 -3824 -6412 6650 8788 6768
12994F768j5182k2j6097l2600K2015L6818J9309j7183K714m6378l0865L7941N2976
$$ 6768 -8414 -8436 -24533 -57133 -35118 1700 21009 3826 6540 -39838 -70703 -32762 20214
12981B0214k8224l5121k1985N2642L1806j9299N6098K9937l6480r546J9275J5247
$$ 20214 -8010 -43131 -65116 -12474 19332 33 56131 86068 49588 40042 59317 74564
12969G4564m5911Q927l1437n8118j2296j2136j3783N3564N5002L4834k7010l2738
$$ 74564 28653 37580 6143 -51975 -64271 -76407 -90190 -36626 18376 53210 26200 -6538
12957f538K8666r336K0599K480k4114k271J3213q35j4968O159o297J6287J2450
$$ -6538 22128 12792 33391 35871 11757 9486 22699 21864 6896 13055 6758 23045 35495
12944C5495K6574o1347L4574O697k6302l882n2761l0787O9027Q1259K0353j1648
$$ 35495 62069 722 35296 41993 15691 11809 -40952 -71739 -2712 78547 98900 87252
12932H7252k9644j6929k8698n1946L0613J7873k0881l4532J4361J0425k3035j5440
$$ 87252 57608 40679 11981 -39965 -9352 8521 -12360 -46892 -32531 -22106 -45141 -60581
12920f0581Q963K6539j6069m1596k1999R3175O4367N174j5108k5349N2914j5512
$$ -60581 -51618 -25079 -41148 -82744 -104743 -11568 52799 57973 42865 17516 70430 54918
12908E4918M924n2153l8853l4106j0262j621J0087K1172J9284M1278K5828j7027
$$ 54918 59842 7689 -31164 -65270 -75532 -77153 -67066 -45894 -26610 14668 40496 23469
12896B3469k6430R265L4968l1700K512o630k1537l0874J6019L9285j3776k5311
$$ 23469 -2961 6304 41272 9572 12084 5454 -16083 -46957 -30938 8347 -5429 -30740
12884c0740j3741l098l231K2315K2473j7437K9340N7999p703j15186m986N4816
$$ -30740 -44481 -47579 -50810 -28495 -6022 -23459 5881 63880 56177 -59009 -63995 -9179
12872i179M2057p864m5790l7458N142M3973n693n721J9435o974J0765M3616k4482
$$ -9179 32878 25014 -20776 -58234 -53092 -9119 -14812 -20533 -1098 -8072 2693 46309 21827
12859B1827n9011l5722N404M0624J9574K7804k4176l604o2689M085L6596j480
$$ 21827 -37184 -72906 -67502 -26878 -7304 20500 -3676 -7280 -69969 -65884 -29288 -30768
12847c0768j7128J1413O535k8625M4134K8945K7085K1802k9784m1251M4528M0485
$$ -30768 -47896 -36483 -29948 -58573 -14439 14506 41591 63393 33609 -7642 36886 77371
12835G7371p568k8549j9865Q5305N7383k0467N732q9112l1736m440m9013k6422
$$ 77371 69803 41254 21389 106694 164077 143610 149342 60230 28494 24054 -24959 -51381
12823e1381L3619P0251J2161n6582K1749j2327k2604l0160J5617k848j9716K9196
$$ -51381 -17762 52489 64650 8068 29817 17490 -5114 -35274 -19657 -22505 -42221 -13025
12811a3025J3407k366N0515J067K362k3546l4020J0127M482L0112N5329N6488
$$ -13025 382 -1984 48531 49598 51960 28414 -5606 4521 9003 39115 94444 150932
12799A50932k7157k4434p5044n0863q232N8939N3793o255n0929m8101J5294j2444
$$ 150932 123775 99341 24297 -26566 -34798 24141 77934 71679 20750 -27351 -12057 -24501
12787b4501K3313L0498r128m2703l9029o085L1196l0166q952N3023l6690k4788
$$ -24501 -1188 29310 20182 -22521 -61550 -67635 -36439 -66605 -75557 -22534 -59224 -84012
12775h4012m4212J4505N6597L683k1609l2789L9577J7569J3376k3809L5019J1086
$$ -84012 -128224 -113719 -57122 -53439 -75048 -107837 -68260 -50691 -37315 -61124 -26105 -15019
12763a5019o6933j1443L5609K0543J9118k9495j637m7165n7388J2446j6058m778
$$ -15019 -81952 -93395 -57786 -37243 -18125 -47620 -49257 -96422 -153810 -141364 -157422 -162200
12751a62200L0930J09948L8078K2357L6233n1084l8248k2094M323J9816K0164
$$ -162200 -131270 -21322 16756 39113 75346 24262 -13986 -36080 -31757 -11941 8223
12740H223l6805k5104J1965J6400L9265O0462O61j399L0716k0409K2316k8083
$$ 8223 -28582 -53686 -41721 -25321 13944 74406 75067 73668 104384 83975 106291 78208
12728G8208p478m0035K8834K8228p321q6259l6068L5138J4825P158K6873M715
$$ 78208 70730 30695 59529 87757 80436 -5823 -41891 -6753 8072 15230 42103 46818
12716D6818O072K3376j8569n2163n2120j7852J3714N2858P163O250N1034m2554
$$ 46818 52890 76266 57697 5534 -46586 -64438 -50724 2134 9297 15547 66581 24027
12704B4027n2781M652J4962j7938j6513M3053J9614J2462k0241J7420Q651J0638
$$ 24027 -28754 -24102 -9140 -27078 -43591 -538 19076 31538 11297 28717 37368 48006
12692D8006q957J6644m5399j5182j2164o7841K1318O7531J6262j1506p317j3640
$$ 48006 39049 55693 10294 -4888 -17052 -84893 -63575 3956 20218 8712 1395 -12245
12680a2245L3116l6583o7016j1500M2791j3195K2402L2950J1394O6624k9167M111
$$ -12245 20871 -15712 -82728 -94228 -51437 -64632 -42230 -9280 2114 68738 39571 43682
12668D3682J7195r1779r8812l6960M7029N5016l76k2871M2904M917M571K3051
$$ 43682 60877 -30902 -129714 -166674 -119645 -64629 -65005 -87876 -44972 -40055 -35484 -12433
12656a2433M821p937k3265K7064K5728M1031j8940j4943J733K016l9659O846J2021
$$ -12433 -7612 -15549 -38814 -11750 13978 55009 36069 21126 22859 24875 -14784 -7938 4083
12643D083K094K3488L0638l166k5744l4759k7490J1442L0713J9164j7654l6362
$$ 4083 6177 29665 60303 57137 31393 -3366 -30856 -19414 11299 30463 12809 -23553
12631b3553r231L9014M3709O1557m6095n3384l8906O123k415L9047J642m233m7043
$$ -23553 -32784 6230 49939 111496 65401 12017 -26889 -20766 -23181 15866 17508 13275 -33768
12618c3768L7810O2760R160M909p0177k5232j6635L3010M3579j6179m9609l9079
$$ -33768 4042 66802 75962 80871 10694 -14538 -31173 1837 45416 29237 -20372 -59451
12606e9451M8373L3125J6174J5296j7882l1204m6016j6112R468J0363J1313J5290
$$ -59451 -11078 22047 38221 53517 35635 4431 -41585 -57697 -48229 -37866 -26553 -11263
12594a1263j3351n35p27K711j3725p078N417j6457O3510J4617J0043L4279j6500
$$ -11263 -24614 -25149 -25876 -23165 -36890 -43968 -38551 -55008 8502 23119 33162 67441 50941
12581E0941j9416k4728o597l8505L057K7493j1058n887n0264l2044O1475J7169
$$ 50941 31525 6797 200 -38305 -35248 -7755 -18813 -24700 -74964 -107008 -45533 -28364
12569b8364j0500l63O3997K0472k2725r030k3855J2518o783o2552l1589J5140
$$ -28364 -38864 -39227 24770 45242 22517 13487 -10368 2150 -4633 -67185 -98774 -83634
12557h3634Q540M5475L806j5678J1229L5134l3097q759J0417N0909J0234j5531
$$ -83634 -75094 -29619 -25813 -41491 -30262 4872 -28225 -36984 -26567 24342 34576 19045
12545A9045k4732r560n63J7087K3252K9066k3001k6269J3301J5438k3072o03L432
$$ 19045 -5687 -15247 -15810 1277 24529 53595 30594 4325 17626 33064 9992 9389 12821
12532A2821J6441k1554l8895r456L843j5017L5859J1508k4269J3819q696L639
$$ 12821 29262 7708 -31187 -40643 -36800 -51817 -15958 -4450 -28719 -14900 -23596 -19957
12520a9957k0332j7774K3075N1027J5001J0466M66R032M3425L631Q217m0345p2302
$$ -19957 -40289 -58063 -34988 16039 31040 41506 41972 51004 94429 98060 106277 65932 -6370
12507f370l870J5257J636J2043n5481j0912p075L7641L2520M9305L933J6329k6497
$$ -6370 -10240 5017 6653 18696 -36785 -47697 -54772 -17131 15389 64694 68627 84956 58459
12494E8459l3327m1956l910J7231l3085L5840m070J3348n4556k0602o873K6048
$$ 58459 25132 -16824 -20734 -3503 -36588 -748 -4818 8530 -46026 -66628 -73501 -47453
12482d7453J1338M0910L8427k0660l1625O794j0921j889J0841q182m4238O475
$$ -47453 -36115 4795 43222 22562 -9063 -2269 -13190 -15079 -4238 -12420 -56658 -50183
12470e0183K6133m101K463L9169J0154j1717l5804k1941k9328r244K2269L2781
$$ -50183 -24050 -28151 -25688 13481 23635 11918 -23886 -45827 -75155 -84399 -62130 -29349
12458b9349j3199k4366M9127M3240m4897n6111m0754J1870J5522M6924l2194J3330
$$ -29349 -42548 -66914 -17787 25453 -19444 -75555 -116309 -104439 -88917 -41993 -74187 -60857
12446f0857M0805n0764n7217O6724Q5946n677M9835K1461p3065n6437K554J5582
$$ -60857 -20052 -70816 -128033 -61309 24637 18960 68795 90256 17191 -39246 -36692 -21110
12434b1110J7347L2159j0154j5433J9803l023l1259J6135J0899J0600N54l2719
$$ -21110 -3763 28396 18242 2809 22612 19589 -11670 4465 15364 25964 26518 -6201
12422f201R146m6490o210K0605M0867Q1077Q9264j3162p1884n2680j6801n3931
$$ -6201 2945 -43545 -49755 -29150 11717 92794 182058 168896 97012 44332 27531 -26400
12410b6400l7173O1194J8089j6849l0569l6861J8841Q9429K2130m7469m3541J1911
$$ -26400 -63573 -2379 15710 -1139 -31708 -68569 -49728 39701 61831 14362 -29179 -17268
12398a7268M5191J9481K7189K3607m3537o6270j4810K0226R027q578k0411J1327
$$ -17268 27923 47404 74593 98200 54663 -11607 -26417 -6191 2836 -5742 -26153 -14826
12386a4826J345J3963p989p149J9996l0926n663K2679J9428k7069l18j256j99
$$ -14826 -13481 482 -7507 -14656 5340 -25586 -31249 -8570 10858 -16211 -16529 -17785 -17984
12373a7984K1377L5763K2032N201k8163L4552Q38N716k4664o4021n5259k4704
$$ -17984 3393 39156 61188 66389 38226 72778 73616 79332 54668 -9353 -64612 -89316
12361h9316J6163R422M7815N3882j1234K081J6607L0477J5517j2142o2452J282
$$ -89316 -73153 -63731 -15916 37966 26732 28813 45420 75897 91414 79272 16820 18102
12349A8102l7367m4560o411K5156P191L2845P735J168l3802K2865m2025l1006
$$ 18102 -19265 -63825 -70236 -45080 -37889 -5044 2691 3859 -29943 -7078 -49103 -80109
12337h0109P3767J00079O108o2402m9212J1487K9235R501R556J3277k825L735
$$ -80109 -6342 93737 99845 37443 -11769 -282 28953 38454 48010 61287 58462 62197
12325F2197Q211l0115p5718k7644L9040J0672k6272k5341J3344N967m063M3458
$$ 62197 70408 40293 -35425 -63069 -24029 -13357 -39629 -64970 -51626 -45659 -49722 -6264
12313f264L6910p794j3002n3443P653N3496M2311j8912q129j2444k2485l7631
$$ -6264 30646 22852 9850 -43593 -35940 17556 59867 40955 32826 20382 -2103 -39734
12301c9734l5429o482o033L6883O0766l7087o333J8099K2114M5542J7083J8285
$$ -39734 -75163 -81645 -87678 -50795 9971 -27116 -33449 -15350 6764 52306 69389 87674
12289H7674L2779j8513n9651m9423r723l1168J7025r335l7771k25M6600R8022
$$ 87674 120453 101940 42289 -7134 -16857 -48025 -31000 -40335 -78106 -78331 -31731 66291
12277F6291K7712l5783l5385O294L9428j0087l7003k7859l2828n575L5866q061
$$ 66291 94003 58220 22835 29129 68557 58470 21467 -6392 -39220 -44795 -8929 -16990
12265a6990K4007m0960J9536M7029O5895J2407p088p469q4640p6232J9819Q840
$$ -16990 7017 -33943 -14407 32622 98517 110924 103836 96367 11727 -64505 -44686 -35846
12253c5846L8587l338n5614n6167J5035o159M39J1247J5330J8765J8923L6818
$$ -35846 2741 -597 -56211 -112378 -97343 -103502 -103063 -91816 -76486 -57721 -38798 -1980
12241a980l7373l9264L0995J4213l2760O039M7776K6331K2030m2199l8046l3016
$$ -1980 -39353 -78617 -47622 -33409 -66169 -60130 -12354 13977 36007 -6192 -44238 -77254
12229g7254J5488M9806M2956O1661l3615m7009J0517J8799l4045q131k4319l5740
$$ -77254 -61766 -11960 30996 92657 59042 12033 22550 41349 7304 -827 -25146 -60886
12217f0886l2752J190K9272N0869k5761O131L1535J9497M9584N8844j2827o678
$$ -60886 -93638 -92448 -63176 -12307 -38068 -31937 -402 19095 68679 127523 114696 108018
12205A08018L379m7298j0682P146p602J0304M104o4611n3761K3201K0461J4709
$$ 108018 111397 64099 53417 60563 52961 63265 67369 2758 -51003 -27802 -7341 7368
12193G368O2823j1577n9648k1004L5142L0034K1246K3912k9323j2147O386J0577
$$ 7368 70191 58614 -1034 -22038 13104 43138 64384 88296 58973 46826 53212 63789
12181F3789M600k8375n2456o858M1458J985n1033k6834M9714Q747j3246L4030
$$ 63789 68389 40014 -12442 -19300 22158 24143 -26890 -53724 -4010 4737 -8509 25521
12169B5521k6681j0577l4120Q363K6550k4983j9694L9785J0719j2766m1873L2848
$$ 25521 -1160 -11737 -45857 -37494 -10944 -35927 -55621 -15836 -5117 -17883 -59756 -26908
12157b6908L6346n8028p238K0569J8771L1298k8490k4409J7907L171m140m5292
$$ -26908 9438 -48590 -55828 -35259 -16488 14810 -13680 -38089 -20182 -17011 -21151 -66443
12145f6443O134O741J1998O496J4876M0462K5904q0250l1825K3365j3338L9121
$$ -66443 -60309 -53568 -41570 -35074 -20198 20264 46168 -34082 -65907 -42542 -55880 -16759
12133a6759J3820j1082o0228j9601J4550N0640K7952k5436J5481L0151l933P408
$$ -16759 -2939 -14021 -74249 -93850 -79300 -28660 -708 -26144 -10663 19488 15555 22963
12121B2963J1247J1106j9610K1578N1554o7695n9442J9566J2440o1924l5208M3503
$$ 22963 34210 45316 25706 47284 98838 31143 -28299 -8733 3707 -58217 -93425 -49922
12109d9922L5133O5424l6211q516M1223J833n2681k092O494j2206J1106N5893
$$ -49922 -14789 50635 14424 5908 47131 48964 -3717 -5809 685 -11521 -415 55478
12097E5478j8561j5076L0959K2077k4723m5253k3152l0153J5528L4096P4587j816
$$ 55478 36917 21841 52800 74877 50154 4901 -18251 -48404 -32876 1220 75807 73991
12085G3991o0001k3555n927l0855J0615K2783J0985j5462j9546m7968j9663L1330
$$ 73991 13990 -9565 -15492 -46347 -35732 -12949 -1964 -17426 -36972 -84940 -104603 -73273
12073g3273M8108K5738o636R64K860k4514J2622M4505K43l6268o773M3827J7338
$$ -73273 -25165 573 -6063 -5099 -2239 -26753 -14131 30374 30617 -5651 -12424 31403 48741
12060D8741J725j9067o6348k2236L3614O7594K8805l0284k0022K9655m396l5233
$$ 48741 50466 31399 -34949 -57185 -23571 44023 72828 42544 22522 52177 47781 12548
12048A2548n4990j9745J4283P3684K6070m8199n178j4042m674J5309N683Q451
$$ 12548 -42442 -62187 -47904 25780 51850 3651 -1527 -15569 -20243 -4934 749 9200
12036I200j3078n925k5985N1299K2336k4103P87M1628k469m3051k2081K4535k027
$$ 9200 -3878 -9803 -35788 15511 37847 13744 14531 56159 53690 10639 -11442 13093 11066
12023A1066K9663N2832l482n6028M2440J8324r9034l2263M6234o1393N957J5797
$$ 11066 40729 93561 90079 34051 76491 94815 -4219 -36482 9752 -51641 -45684 -29887
12011b9887N1566K308j4368m10Q669m136M1492N141q996k616q127n0337k6580
$$ -29887 21679 23987 9619 9209 17878 13742 55234 60375 51379 48763 40636 -9701 -36281
11998c6281N934j885K9906K6701k683P071L6870r788n2628j4627J8682j0792M4898
$$ -36281 -30347 -32232 -2326 24375 21692 28763 65633 55845 3217 -11410 7272 -3520 41378
11985D1378M9326R453N1622k0780q7621n0137K2191L4795j2947M890k8269j4521
$$ 41378 90704 100157 151779 130999 43378 -6759 15432 50227 37280 42170 13901 -620
11973f20l4414K0981m03L0423N3338o174m3566M060j8271j2468O4095M7832q925
$$ -620 -35034 -14053 -14456 15967 69305 63131 19565 23625 5354 -7114 56981 104813 95888
11960I5888j6606n9399k5637M0818m3542o1370M6563N6543K0595k7111m621j3634
$$ 95888 79282 19883 -5754 35064 -8478 -69848 -23285 33258 53853 26742 22121 8487
11948H487k8206N828k1991j8861K249k1842K2132m0091k4127K8424K5334J8852
$$ 8487 -19719 -13891 -35882 -54743 -52494 -74336 -52204 -92295 -116422 -87998 -62664 -43812
11936d3812j1071P773L1385N3947M861l9922m3094K8032J2890K6076J2325M0533
$$ -43812 -54883 -47110 -15725 38222 43083 3161 -39933 -11901 989 27065 39390 79923
11924G9923N761k2409n9860l4611j6718l0734K5859k4881K3851k2978J9744L390
$$ 79923 85684 63275 3415 -31196 -47914 -78648 -52789 -77670 -53819 -76797 -57053 -53663
11912e3663L819O4284M190j2476j0304L0575l0465k8506n0224p726K7488K1607
$$ -53663 -49844 14440 18630 6154 -4150 26425 -4040 -32546 -82770 -90496 -63008 -41401
11900d1401R51m3082k7666M8308J06443j3764k5095Q60j8544J6996K2191N1349
$$ -41401 -40450 -83532 -111198 -62890 43553 29789 4694 5554 -12990 4006 26197 77546
11888G7546l5029m5411j4940q63K8964j1777k6867j9088M3395l5255J2001J088
$$ 77546 42517 -2894 -17834 -18697 10267 -1510 -28377 -47465 -4070 -39325 -27324 -26236
11876b6236M6256q095j6718N237j1440j4328j0521K7292r835o922M8816L5814
$$ -26236 20020 11925 -4793 444 -10996 -25324 -35845 -8553 -18388 -25310 23506 59320
11864E9320p011k5121m1886M4610L2479o9166j5558l7697m0509J6353P7209K7312
$$ 59320 52309 27188 -14698 29912 62391 -6775 -22333 -60030 -100539 -84186 -6977 20335
11852B0335k5589K0799K9485k170j9252l2365j4285L3110J0309l0976l633K6708
$$ 20335 -5254 15545 45030 42860 23608 -8757 -23042 10068 20377 -10599 -14232 12476
11840A2476K8013n6209m8363J9331M7572L5494k1135o1348q816K4368J9201L1326
$$ 12476 40489 -15720 -64083 -44752 2820 38314 17179 -44169 -52985 -28617 -9416 21910
11828B1910J6690K0109K7699k3609m4040o4332k9913Q245N0667L3763M9807K1736
$$ 21910 38600 58709 86408 62799 18759 -45573 -75486 -67241 -16574 17189 66996 88732
11816H8732k3523n8609k0008L7206j4709L943m8647m7533k820M7811J7766j6305
$$ 88732 65209 6600 -13408 23798 9089 13032 -35615 -83148 -85968 -38157 -20391 -36696
11804c6696N819J5958M4003l1346l6139L4265R899l3567M398M5935n0928k1710
$$ -36696 -30877 -14919 29084 -2262 -38401 -4136 5763 -27804 -23406 22529 -28399 -50109
11792e0109R063J4501j3217J0468j8925k642r352j92L6463j0038K1498n425k2524
$$ -50109 -41046 -26545 -39762 -29294 -48219 -50861 -60213 -60405 -23942 -33980 -12482 -17907 -40431
11779d0431K7508L1638J5942k7625l6720L6803M7492L2643L806l8510j4272K656
$$ -40431 -12923 18715 34657 7032 -29688 7115 54607 87250 91056 52546 38274 40930
11767D0930l5997k1477J9619L263m9993k512J8818k7196K4143M7784L4723k2174
$$ 40930 4933 -16544 3075 6338 -43655 -46167 -27349 -54545 -30402 17382 52105 29931
11755B9931j5999l4828p89q777n70Q024J3353N7687M004k466m8249m259j5246
$$ 29931 13932 -20896 -21685 -30462 -31032 -23008 -9655 48032 52036 49570 1321 -2938 -18184
11742a8184J7077J8207l3289Q165M5114J3362o9782k3917m716O123Q418j9045
$$ -18184 -1107 17100 -16189 -8024 37090 50452 -19330 -43247 -47963 -41840 -33422 -52467
11730e2467J6106J3698r869k8041L2877K8804k2556K1532j1832j8565N0049N3892
$$ -52467 -36361 -22663 -32532 -60573 -27696 1108 -21448 84 -11748 -30313 19736 73628
11718G3628j8281N730k0849J0368r267r131k865J5090J3758k572L68K2807O648
$$ 73628 55347 61077 40228 50596 41329 32198 29333 44423 58181 55609 55977 78784 85432
11705H5432o0340k8902K1366j3799n529K5649J8581j2687m7299K860L3152K7978
$$ 85432 25092 -3810 17556 3757 -1772 23877 42458 29771 -17528 -14668 18484 46462
11693D6462o752k1096R791j4057L9721J4431k0378j01300P610K0869K6530K9508
$$ 46462 39710 18614 28405 14348 54069 68500 48122 -53178 -45568 -24699 1831 31339
11681C1339m3120m2891K4161Q0619k6848k6426K4391k0390k2822L301q238J9720
$$ 31339 -11781 -54672 -30511 50108 23260 -3166 21225 835 -21987 -18686 -26924 -7204
11669g204k1739k3457J4198L9206J3128J8264M8561k2516o257l4707K9815j183
$$ -7204 -28943 -52400 -38202 1004 14132 32396 80957 58441 52184 17477 47292 46109
11657D6109N328r352j1903j1523k979j4914J6139N7880p785l6169p0412L2078
$$ 46109 51437 42085 30182 18659 15680 766 16905 74785 67000 30831 -39581 -7503
11645g503J6174Q35M4479j3454p591j7600J2065O402J7855j6931k4379k6814N585
$$ -7503 8671 9506 53985 40531 32940 15340 27405 33807 51662 34731 10352 -16462 -10877
11632a0877K8732J3617n072K7999J2908p6684m0023k3433N1023M5684l5959L0481
$$ -10877 17855 31472 26400 54399 67307 -9377 -49400 -72833 -21810 23874 -12085 18396
11620A8396l6573J5208j333J9059L7794m46m6548l9417L9812J0204k0460l4826
$$ 18396 -18177 -2969 -4302 14757 52551 52105 5557 -33860 5952 16156 -4304 -39130
11608c9130M8431j1432J5937Q187m9282j6429m537L4662N8812M9354m5334k0993
$$ -39130 9301 -2131 13806 21993 -27289 -43718 -48255 -13593 45219 94573 49239 28246
11596B8246l4953n8731n383j8106M2651J1443K0706L8319o293M9591J9998j5266
$$ 28246 -6707 -65438 -70821 -88927 -46276 -34833 -14127 24192 17899 67490 87488 72222
11584G2222l4086J1923j6679m7735J9807J9207Q318p223o93Q860n0357j4862L1294
$$ 72222 38136 50059 33380 -14355 5452 24659 32977 25754 25061 33921 -16436 -31298 -4
11571dL7203J8530k3049n869N796l5669o5203l4257J759k3973L4K7446N2036M2128
$$ -4 37199 55729 32680 26811 32607 -3062 -68265 -102522 -100763 -124736 -124702 -97256 -45220 -3092
11557c092J5504M4703K2014l0158k9491k0876J102j6960n6571L5127l3125R360
$$ -3092 12412 57115 79129 48971 19480 -1396 -294 -17254 -73825 -38698 -71823 -62463
11545f2463k75J5745n402L0935k5872k6818K8780R0066J3351m5863j0487J0588
$$ -62463 -62738 -46993 -52395 -21460 -47332 -74150 -45370 44696 58047 12184 1697 12285
11533A2285o103k2451l6750l6879j0307K7167M2896p65K983k2551j2936k1384
$$ 12285 6182 -16269 -53019 -89898 -100205 -73038 -30142 -30907 -27924 -50475 -63411 -84795
11521h4795j0278K0183L2283L6100J6186M0261Q794l0551j5808m334k983M0613
$$ -84795 -95073 -74890 -42607 -6507 9679 49940 58734 28183 12375 8041 5058 45671
11509D5671J8106m5686k8164K969J9699J3085L382k4857L7593L2006J2740n7774
$$ 45671 63777 18091 -10073 -7104 12595 25680 29062 4205 41798 73804 86544 28770
11497B8770l7035n6006j6944m0491L4779J7518J0761K7371L4162L3019l2743l0601
$$ 28770 -8265 -64271 -81215 -121706 -86927 -69409 -58648 -31277 2885 35904 3161 -27440
11485b7440j7953M3380J7765k2771n217K9727L215j0601l8517k5132n758j244
$$ -27440 -45393 -2013 15752 -7019 -12236 17491 20706 10105 -28412 -53544 -59302 -60546
11473f0546O3710L5304j1601k8533l9698l8548J8985Q322M1096K4564Q782K970
$$ -60546 3164 38468 26867 -1666 -41364 -79912 -60927 -52605 -11509 13055 21837 24807
11461B4807k4304K0155r562M0672M38l4449J773j0864M7508p980R595J7527l2207
$$ 24807 503 20658 11096 51768 52206 17757 19530 8666 56174 48194 57789 75316 43109
11448D3109O819k7700l1602J6375j7405j6248L0367k7437p981L0024K0295j4204
$$ 43109 49928 22228 -9374 7001 -10404 -26652 3715 -23722 -31703 -1679 18616 4412
11436D412M3791j4081o3525k4868k127r044p452L2003L4088L3295l0263j4450
$$ 4412 48203 34122 -29403 -54271 -56398 -65442 -72894 -40891 -6803 26492 -3771 -18221
11424a8221L4063O711P329L017J1218k3177k754N498l7885j5231J8064L8320q431
$$ -18221 15842 22553 29882 32899 44117 20940 18186 23684 -14201 -29432 -11368 26952 18521
11411A8521J1705L9236o598P813m8462k2330j4068k0606J8111Q828J5583l8820
$$ 18521 30226 69462 62864 70677 22215 -115 -14183 -34789 -16678 -7850 7733 -31087
11399c1087k5863L4516L0685j6494j8130N3269P159k4713K0217l0270j4291Q120
$$ -31087 -56950 -22434 8251 -8243 -26373 26896 34055 9342 29559 -711 -15002 -6882
11387f882O7396M745n0655J9328K7847j16j3733j5983q636L0825l2736o2971p159
$$ -6882 60514 65259 14604 33932 61779 61663 47930 31947 23311 54136 21400 -41571 -48730
11374d8730K7658r24j7243M310J4503P9694L3158k3713q425k9078r800M1267J7816
$$ -48730 -21072 -21996 -39239 -34929 -20426 59268 92426 68713 60288 31210 21410 62677 80493
11361H0493m817m7589k7451J31k1203M176l018o507j0134r573l1607r385k531
$$ 80493 75676 28087 636 767 -20436 -16260 -19278 -25785 -35919 -45492 -77099 -86484 -89015
11348h9015M2572N1248L2229m2968m8886K5560N5415K7943m494N503o531k3180
$$ -89015 -46443 4805 37034 -5934 -54820 -29260 26155 54098 49604 55107 48576 25396
11336B5396o7882J3424Q564l432O0966k4386l0056J8833J6890m7114l7659M822
$$ 25396 -42486 -29062 -20498 -23930 37036 12650 -17406 1427 18317 -28797 -66456 -61634
11324f1634n830K1826J6606m4344J3246L0813k014K5212k4718n759K1692K2808
$$ -61634 -67464 -45638 -29032 -73376 -60130 -29317 -31331 -6119 -30837 -36596 -14904 7904
11312G904O9795J3641n884j9845p2183j3551L2248K5822o684j7307n43J2059P749
$$ 7904 77699 91340 85456 65611 -6572 -20123 12125 37947 31263 13956 13413 25472 33221
11299C3221Q981n0688q6112k5844K1004M2140J9518L4733O116m7837j9911j7633
$$ 33221 42202 -8486 -94598 -120442 -99438 -57298 -37780 -3047 3069 -44768 -64679 -82312
11287h2312K8586K6995l1084K1808O760L1438j9987k9709n22o73J3709j0063K4990
$$ -82312 -53726 -26731 -57815 -36007 -29247 2191 -17796 -47505 -48027 -48700 -34991 -45054 -20064
11274b0064N255j0932l2012k8464J6923Q891P2308J9860l8777l1525l3939J8733
$$ -20064 -14809 -25741 -57753 -86217 -69294 -60403 11905 31765 -7012 -38537 -72476 -53743
11262e3743q095L6099J5862L51M4870O0900l7717m390k961O17j8684k0049K691
$$ -53743 -61838 -25739 -9877 -9526 35344 96244 58527 54137 51176 51793 33109 13060 15751
11249A5751p920l9223j5793P8012M8272j2439J9285p4758n869k525M3732K5180
$$ 15751 7831 -31392 -47185 30827 79099 66660 85945 11187 5318 2793 46525 71705
11237G1705K2890R363m4532p3917M245N625P783N1728J6741l5211j0689L2427
$$ 71705 94595 103958 59426 -14491 -10246 -4621 3162 54890 71631 36420 25731 58158
11225E8158J1811n0583o3299l6856M9177O704k94P9719j9845j3515j2825L7330
$$ 58158 69969 19386 -43913 -80769 -31592 -24888 -25182 54537 34692 21177 8352 45682
11213D5682j343j546J1783n0727j0620%L0665j3267m0013L2030o219L1289L1267
$$ 45682 44339 42793 54576 3849 -6771 -6771 23894 10627 -29386 2644 -3575 27714 58981
11200E8981r501q9193l4669J8391L9251k3403j4960o436K1341K8149O108j3002
$$ 58981 49480 -39713 -74382 -55991 -16740 -40143 -55103 -61539 -40198 -12049 -5941 -18943
11188a8943J9709n942K9730Q97K7478n172r3885O34O7121M4834j446o0838m3932
$$ -18943 766 -5176 24554 25451 52929 47757 -46128 -45494 21627 66461 65015 4177 -39755
11175c9755J1681J8389L3595J8508L2351k6059J1483J1974J3883m7031k0196M0090
$$ -39755 -28074 -9685 23910 42418 74769 48710 60193 72167 86050 39019 18823 58913
11163E8913j9194J9247o163l8903o792Q566j8963j1348l3372L8755N5323L089
$$ 58913 39719 58966 52803 13900 7108 15674 -3289 -14637 -48009 -9254 46069 49158
11151D9158l5670j8473M8720K4386j3031q301j7095M2487l472j16503m4852N3690
$$ 49158 13488 -4985 43735 68121 55090 46789 29694 72181 68709 -47794 -92646 -38956
11139c8956L5614K0198j2276M600j3346m3254q603J7159J2078j2156m7938K488
$$ -38956 -3342 16856 4580 9180 -4166 -47420 -56023 -38864 -26786 -38942 -86880 -84392
11127h4392J05028o056J6233P245n8085p224L7721P459P920K6869J9457m2253
$$ -84392 20636 14580 30813 38058 -20027 -27251 10470 17929 25849 52718 72175 29922
11115B9922k4096m1450q425l1001q308K1482N4545M4875J0757o1852n8151n6129
$$ 29922 5826 -35624 -44049 -75050 -83358 -61876 -7331 37544 48301 -13551 -71702 -127831
11103a27831K4563R3125M7494L9645K5936l2752l8411r078k1372K9356o198R685
$$ -127831 -103268 -10143 37351 76996 102932 70180 31769 22691 1319 30675 24477 34162
11091C4162N941J5428k9598o981J4884o811J9625n7424P3707K4605j5983N2266
$$ 34162 40103 55531 25933 18952 33836 27025 46650 -10774 62933 87538 71555 123821
11079A23821J0243j5471P2k1314m4928J1304L0388K1338P870J3559r524j6750
$$ 123821 134064 118593 118665 97351 52423 63727 94115 115453 123323 136882 127358 110608
11067A10608k6209n3026k203M0194K1655m1807J5978K6503m8501l4433R62l681
$$ 110608 84399 31373 29170 69364 91019 49212 65190 91693 43192 8759 9721 6040
11055F040n8193r97J5801L271P222J5210l0522k590L5411K4316j6961l2456k77
$$ 6040 -52153 -53150 -37349 -34078 -26856 -11646 -42168 -44758 -9347 14969 -1992 -34448 -34725
11042c4725L6476K1983j9470J1909l2591j1265N7046O370J7607j8277j8309j168
$$ -34725 1751 23734 4264 16173 -16418 -27683 29363 35733 53340 35063 16754 15586
11030A5586l5211l2885j1950n777j2817l0188N7204L3352K3202K7422j1664j7835
$$ 15586 -19625 -52510 -64460 -70237 -83054 -113242 -56038 -22686 516 27938 16274 -1561
11018a561k880M3005k207o2319j0295M1525k7479k3042J8940j218L4467K5443
$$ -1561 -4441 38564 36357 -25962 -36257 5268 -22211 -45253 -26313 -27531 6936 32379
11006C2379m880M7554J6682l6186n6852Q916n3803J2607k374q336J3600k1208
$$ 32379 27499 75053 91735 55549 -1303 7613 -46190 -33583 -35957 -44293 -30693 -51901
10994e1901j105L898l4888K8278P3125N0535O0031l0374k1249l87m0243m9264
$$ -51901 -53006 -49108 -83996 -55718 17407 67942 127973 97599 76350 75963 35720 -13544
10982a3544m8226L5901N0223K522p916M1502l8414p4436l964N4422R230J009L5534
$$ -13544 -61770 -25869 24354 26876 18960 60462 22048 -52388 -56352 -1930 7300 8309 43843
10969D3843Q214o3128p6447j0167l2485L9065P5603r348K2844j882L5097n3511
$$ 43843 52057 -11071 -87518 -97685 -130170 -91105 -15502 -24850 -2006 -3888 31209 -22302
10957b2302J0756K8043K5411J9612R125l462n7317j5337J0581l5379m8O1947L7289
$$ -22302 -11546 16497 41908 61520 70645 67183 9866 -5471 5110 -30269 -30317 31630 68919
10944F8919j2142m1657k5124N7850Q448o4364O16k3485J9152K9417j0090P735
$$ 68919 56777 15120 -10004 47846 56294 -8070 -7454 -30939 -11787 17630 7540 15275
10932A5275N5946j3108p6480k9137K4198O9596j5690J5496m3288K5346Q519l1289
$$ 15275 71221 58113 -18367 -47504 -23306 46290 30600 46096 2808 28154 36673 5384
10920E384j6q983j3441J2639J51P302N706j5783m521m0407J5481m96J3865R422
$$ 5384 5368 -3615 -17056 -4417 -4266 3036 8742 -7041 -11562 -51969 -36488 -36984 -23119 -13697
10906a3697k6978O920L5225K8863L0794k2088J8873n881k7568j4370K6306m7905
$$ -13697 -40675 -33755 1470 30333 61127 39039 57912 52031 24463 10093 36399 -11506
10894a1506J1513J4204o3337j9264N0630M0472n192m9200m1863o72l0201l444
$$ -11506 7 14211 -49126 -68390 -17760 22712 17520 -31680 -73543 -74215 -104416 -107860
10882a07860L1181K8185O169j8805j02K1027L5666N3291J8105J489m9162l2020
$$ -107860 -76679 -48494 -42325 -61130 -61232 -40205 -4539 48752 66857 68346 19184 -12836
10870a2836K7341j0987m0997Q941j1072k7092Q74j7036P484M6578J4787L591k9322
$$ -12836 14505 3518 -37479 -28538 -39610 -66702 -65828 -82864 -75380 -28802 -14015 -10424 -39746
10857c9746k1117N1310M9664Q593K4973l3196k1074P517k9510j4146l2897J3024
$$ -39746 -60863 -9553 40111 48704 73677 40481 19407 26924 -2586 -16732 -49629 -36605
10845c6605M9083K2105L8592j9286l1904j2346k3575n8326N055L9047L6375K2576
$$ -36605 12478 34583 73175 53889 21985 9639 -13936 -72262 -67207 -28160 8215 30791
10833C0791l2762k6769J1749P77J6272N4935k1308L264K089J833L8510k4585l9540
$$ 30791 -1971 -28740 -16991 -16214 58 54993 33685 36949 39038 40871 79381 54796 15256
10820A5256k96k3548l5423N347L5001j437j9530J7642k6234p4940m0384O4512
$$ 15256 14960 -8588 -44011 -38664 -3663 -5100 -24630 -6988 -33222 -108162 -148546 -84034
10808h4034N3876Q724r805L472L5463l831k646q738k1663k5980j9021K8909L9487
$$ -84034 -30158 -21434 -31239 -27767 7696 3865 1219 -7519 -29182 -55162 -74183 -45274 -5787
10795e787k0095k4041M772N74J4811N1938J2345l0781j3908R294K2643m6897k1062
$$ -5787 -25882 -49923 -45151 -44577 -29766 22172 34517 3736 -10172 -878 21765 -25132 -46194
10782d6194J4899M0138L1989P4741L3737l608N1284J11659J15310K10194L39080
$$ -46194 -31295 8843 40832 115573 149310 145702 196986 308645 423955 634149 973229
10771I73229L11449J88741Q3845m8999l37650l69245k78072j41720l9034k1130
$$ 973229 1284678 1473419 1557264 1508265 1170615 801370 523298 381578 342544 321414
10761C21414k5912l0994R066k5600j5597q4133m2900m8387j1442Q0395J5164k7259
$$ 321414 295502 264508 273574 247974 232377 148244 105344 56957 45515 125910 141074 113815
10749A13815q029J0218k906r326j6377l7744M0561K7949k1183m9487K1263K5211
$$ 113815 105786 116004 113098 103772 87395 49651 90212 118161 96978 47491 68754 93965
10737I3965m127j3666L1487Q985l9205m9070k5575Q6556L3882k0243J2585j2738
$$ 93965 89838 76172 107659 116644 77439 28369 2794 89350 123232 102989 115574 102836
10725A02836m5008j4699M1010j4616l1168n9909r003m781K0613j0102J8327j0755
$$ 102836 57828 43129 84139 69523 38355 -21554 -30557 -35338 -14725 -24827 -6500 -17255
10713a7255J207N6723k7268Q455j0629M7675M535o0443m0495M9053K3233m637
$$ -17255 -16048 40675 13407 21862 11233 58908 63443 3000 -37495 11558 34791 30154
10701C0154k1448k8089K0020J7413l472L0861o0808q138l0398J1865J1781k6185
$$ 30154 8706 -19383 637 18050 14578 45439 -15369 -23507 -53905 -42040 -30259 -56444
10689e6444P700L042J5645K2578O6396j9964k9710n6819M6590L2447q185n724
$$ -56444 -48744 -45702 -30057 -7479 58917 38953 9243 -47576 -986 31461 23276 17552
10677A7552k708m1179J1949R485r763K3794O1242J6746J817k1687J1636r069j3114
$$ 17552 14844 -26335 -14386 -4901 -14664 9130 70372 87118 88935 67248 78884 69815 56701
10664E6701J9206K1043p1413m1015L573Q226j7607L5384n9575K0936j0027N0698
$$ 56701 75907 96950 25537 -15478 -11905 -3679 -21286 14098 -45477 -24541 -34568 16130
10652A6130K6272l568N8727j6914m9586l5106n6516R608L8826m277K0010l0893
$$ 16130 42402 38834 97561 80647 31061 -4045 -60561 -50953 -12127 -16404 3606 -27287
10640b7287J6549k3976N180k6586K3521L7083L1457J545q1133M401M2125l0046
$$ -27287 -10738 -34714 -29534 -56120 -32599 4484 35941 37486 -43647 -39246 2879 -27167
10628b7167k4843k437K9664O756K4798J9169j0344J7686j7734l2494l7349j1099
$$ -27167 -52010 -54447 -24783 -18027 6771 25940 15596 33282 15548 -16946 -54295 -65394
10616f5394J4359K8679L6692J3034P942j996K3475n890l129J8553J6118k4498
$$ -65394 -51035 -22356 14336 27370 35312 33316 56791 50901 47772 66325 82443 57945
10604E7945p363l800q113r827j2457j6736K9552P77o241j2539p1126m3649L7561
$$ 57945 50582 46782 38669 28842 16385 -351 29201 29978 23737 11198 -59928 -103577 -66016
10591f6016R445j5762L8259N4210j5695K1194k1374l367J4456K299L1414l9283
$$ -66016 -56571 -72333 -34074 20136 4441 25635 4261 894 15350 17649 49063 9780
10579I780N202k215K9631J057k4712l565J2085r753m3933k2944K1672J5865r750
$$ 9780 14982 12767 42398 43455 18743 15178 27263 17510 -26423 -49367 -27695 -11830 -21580
10566b1580M4254j1924R300n0856P956M3664M0655M9626r521j3127j3167l6035
$$ -21580 22674 10750 20050 -30806 -22850 20814 61469 111095 101574 88447 75280 39245
10554C9245p926n564o927L2667L0906K4223K8570k3242m6198j6509p1188r0523
$$ 39245 31319 25755 18828 51495 82401 106624 135194 111952 65754 49245 -21943 -112466
10542a12466J1892N0126q144j9398K4687j9800q268N639M4795K6930r85j8360
$$ -112466 -100574 -50448 -58592 -77990 -53303 -73103 -81371 -75732 -30937 -4007 -4992 -23352
10530b3352p251n0396K1389K2249l3881m255K0141K5394K5592J5123K3100j3293
$$ -23352 -30603 -80999 -59610 -37361 -71242 -75497 -55356 -29962 -4370 10753 33853 20560
10518B0560k1925J8247j8154l6830O0728J9569k8545J2036j7473m660N5512N8422
$$ 20560 -1365 16882 -1272 -38102 22626 42195 13650 25686 8213 3553 59065 117487
10506A17487l6800o4733r7725m2385k0350L177O8095O1574J7092M2828O849k8688
$$ 117487 80687 15954 -81771 -124156 -144506 -141329 -73234 -11660 5432 48260 55109 26421
10494B6421k0402j5966l0187j7532J8458M578l0726k1529O1844L1041J786O564
$$ 26421 6019 -9947 -40134 -57666 -39208 -34630 -65356 -86885 -25041 6000 7786 14350
10482A4350K3157k2359k7650P936m6745n0167K4578N0384O266K4639J1564k8994
$$ 14350 37507 15148 -12502 -4566 -51311 -101478 -76900 -26516 -20250 4389 15953 -13041
10470a3041K5951m1041l5770R290M1317l9784N0914k6099k396M212j6502J1975
$$ -13041 12910 -28131 -63901 -54611 -13294 -53078 -2164 -28263 -30659 -26447 -42949 -30974
10458c0974J6017K7012J7638L0232l1673N597J6328l994m1547l3212j6982j1743
$$ -30974 -14957 12055 29693 59925 28252 33849 50177 46183 4636 -28576 -45558 -57301
10446e7301j369o3358k8881N7961K9388j4002K1918n315R534k3107l7204K2514
$$ -57301 -58670 -122028 -150909 -92948 -63560 -77562 -55644 -60959 -51425 -74532 -111736 -89222
10434h9222N9606M6456m1742o947J9642r847n8677J477M905q938M2077J7455l2658
$$ -89222 -29616 16840 -24902 -31849 -12207 -22054 -80731 -79254 -74349 -83287 -41210 -23755 -56413
10421e6413M228Q922P57k8642l492J3640j8430j9935p75l9808N5288P7039q01
$$ -56413 -52185 -43263 -42506 -71148 -74640 -61000 -79430 -99365 -100140 -139948 -84660 -7621 -8422
10408h422l8230M447L3293r009p3510M479J8697j6311R650Q839P661N1870N2136
$$ -8422 -46652 -42205 -8912 -17921 -91431 -86952 -68255 -84566 -74916 -66077 -58416 -6546 45590
10395D5590n01k2298l5584J783j2538n2568K4541K0021l9455k4707O955K0957
$$ 45590 45089 22791 -12793 -11010 -23548 -76116 -51575 -31554 -71009 -95716 -88761 -67804
10383f7804o252O7895J4255p0362j623M5233M8390k9313p8416l0320m50N2519
$$ -67804 -74056 -6161 8094 -62268 -63891 -18658 29732 419 -77997 -108317 -108767 -56248
10371e6248Q735K808j4514L0130Q672j5908L1545l6710K4172N7229p061J3422
$$ -56248 -47513 -44705 -59219 -29089 -20417 -36325 -4780 -41490 -17318 39911 32850 46272
10359D6272k1343J2315N4049N5807L5955K5776k9565O7769J35578R9916N3833
$$ 46272 24929 37244 91293 147100 183055 208831 179266 247035 382613 482529 536362
10348E36362J44427J49024J41429R6022J37560J17156J06452M9913k8248n0823
$$ 536362 680789 829813 971242 1067264 1204824 1321980 1428432 1478345 1450097 1399274
10338A399274j19298k08036j45746j33736j30069r1956j18416j01251k9389n4360
$$ 1399274 1279976 1071940 926194 792458 662389 570433 452017 350766 321377 267017
10328B67017m1452p6786q4770J105N2197J0167J4702J7795j5100M0225M8457m6756
$$ 267017 225565 148779 64009 65114 117311 127478 142180 159975 144875 185100 233557 186801
10316A86801o0690j2700k748k8401j9738k7767k7408k9838K9873K5582j6467j1409
$$ 186801 126111 113411 110663 82262 62524 34757 7349 -22489 7384 32966 16499 5090
10304E090K1627m3461N2127Q3867Q382q0778j23889m0900j6485K0209P6061P8933
$$ 5090 26717 -16744 35383 119250 127632 46854 -77035 -117935 -134420 -114211 -38150 40783
10292D0783N3147l2738j5791m6757j70m1513L1705L7435J3768k79j9146k5887
$$ 40783 93930 61192 45401 -1356 -1526 -43039 -11334 26101 39869 39590 20444 -5443
10280e443j1600J4367J7179L1875J8023k009K914K4773m1892k1920k0186Q152
$$ -5443 -17043 -2676 14503 46378 64401 62392 65306 90079 48187 26267 6081 14233
10268A4233O0203M3953o370L352k2233l9011p087n4527j3351K8336j1156n6195
$$ 14233 74436 118389 112019 115371 93138 54127 47040 -7487 -20838 7498 -3658 -59853
10256e9853N2411K0128l1908K1670P3966m2241K0264L7277l2773k2732L3785j7568
$$ -59853 -7442 12686 -19222 2448 76414 34173 54437 91714 58941 36209 69994 52426
10244E2426K235M5407L1786k6674j8163l0102p0543l307k0021k2033j8568j1483
$$ 52426 54661 100068 131854 105180 87017 56915 -13628 -16935 -36956 -58989 -77557 -89040
10232h9040K909L5578K2760p518p060L9821Q5119K9886k0236l0957k7446M5973
$$ -89040 -86131 -50553 -27793 -35311 -42371 -2550 82569 112455 92219 61262 33816 79789
10220G9789o8305n7997j4264L3012R478r83P747n9962O189p656O5336Q3727j3007
$$ 79789 11484 -46513 -60777 -27765 -18287 -19270 -11523 -71485 -65296 -72952 -7616 76111 63104
10207F3104l5461m958N464r9094p1014M6650P2175P0303k173n1663j0093M0919
$$ 63104 27643 22685 28149 -70945 -141959 -95309 -23134 47169 44996 -6667 -16760 24159
10195B4159O1172J805p9935m5234K155K4234J0743k3926M269j4689o492l8674
$$ 24159 85331 87136 7201 -38033 -35878 -11644 -901 -24827 -20558 -35247 -41739 -80413
10183h0413l7757l768J4697K0647K8877O673p620m51K8981k7560j607J2744p116
$$ -80413 -118170 -121938 -107241 -86594 -57717 -51044 -58664 -59115 -30134 -57694 -59301 -46557 -53673
10170e3673K1258L4379j4097k1330l7582L746R148K3781J7876m223K5609N1116
$$ -53673 -32415 1964 -12133 -33463 -71045 -67299 -58151 -34370 -16494 -20717 4892 56008
10158E6008K0718k2631J291k7401J2655K4171L8914j9303k7406m2637m3758K8326
$$ 56008 76726 54095 55386 27985 40640 64811 103725 84422 57016 14379 -29379 -1053
10146a053M3769L0460r375j6038Q848j8521l8300K6753K4416l8900J3310M04j9586
$$ -1053 42716 73176 63801 47763 56611 38090 -210 26543 50959 12059 25369 25773 6187
10133F187J5967j1030K8531m247L5302j8099l5282P669l1885j5363M001J4808
$$ 6187 22154 11124 39655 35408 70710 52611 17329 24998 -6887 -22250 -18249 -3441
10121c441K1053q402Q082l4513L006J9732J4517k7118k9337O807K5278r336P875
$$ -3441 17612 9210 17292 -17221 -14215 5517 20034 -7084 -36421 -29614 -4336 -13672 -5797
10108e797l589j1202J2792J1637j6215k281n811Q544O1184k4585m0338O37J5243
$$ -5797 -9386 -20588 -7796 3841 -12374 -14655 -20466 -11922 49262 24677 -15661 -15024 219
10095B19k0100J1836l6860n1247O1107J4590o990J7200L4226M636J5884j7276
$$ 219 -19881 -8045 -44905 -96152 -35045 -20455 -27445 -10245 23981 28617 44501 27225
10083B7225m8541m2437p444j128K582K2328L9574k7292l0901J620j727J1337L7322
$$ 27225 -21316 -63753 -71197 -72325 -69743 -47415 -7841 -35133 -66034 -64414 -66141 -54804 -17482
10070a7482L7306Q133J4506K5024j3473q0519k1019L0841P900N958L2244L2719
$$ -17482 19824 27957 42463 67487 54014 -26505 -47524 -16683 -8783 -2825 29419 62138
10058F2138J7887k2448l5123k0870l3015N8337P4031l3318k3540R526J6093m3646
$$ 62138 80025 57577 22454 1584 -31431 26906 100937 67619 44079 53605 69698 26052
10046B6052J7994L0922n0969j6059j5972k6105j3047K0582j3303l307L9647O2760
$$ 26052 44046 74968 23999 7940 -8032 -34137 -47184 -26602 -39905 -43212 -3565 59195
10034E9195l6229p8419o619k3238K9520L1377O4340k6791q5103n136k732n505
$$ 59195 22966 -55453 -62072 -85310 -55790 -24413 39927 13136 -71967 -77103 -79835 -85340
10022h5340n5243r145R2895K945K3589k142l1034q69K5046q708k31M1378n255
$$ -85340 -140583 -149728 -56833 -53888 -30299 -32441 -63475 -64344 -39298 -48006 -48237 -6859 -12114
10009a2114K0618R02n321J4249l0064n9239m7171J4447Q3524M2258L908j9288
$$ -12114 8504 9406 4085 18334 -11730 -70969 -118140 -103693 -20169 22089 25997 6709
9997F709k5662k67M2002j2200J9618o62j2475L920K3126m243j1137j364J6812
$$ 6709 -18953 -19220 22782 10582 30200 29538 17063 20983 44109 39866 28729 27365 44177
9984D4177J2201k5273l4384L0509J9322l4406K0496o333o8663k8171M7782M2555
$$ 44177 56378 31105 -3279 27230 46552 12146 32642 26309 -42354 -70525 -22743 19812
9972A9812m1197m7945K7895O2131M747q697r441j6555L0061K1528l1508k4784
$$ 19812 -21385 -69330 -41435 20696 25443 16746 7305 -9250 20811 42339 10831 -13953
9960a3953K4606k8042L1509L1076l7135p352j3487k6282K330L8765O0369q245
$$ -13953 10653 -17389 14120 45196 8061 709 -12778 -39060 -36730 2035 62404 54159
9948E4159L5861j6399m0417j1780p724k3223n3257L6919M994k5141m69K3046J7563
$$ 54159 90020 73621 33204 21424 13700 -9523 -62780 -25861 -20867 -46008 -46477 -23431 -5868
9935e868N916L5073J5436L1964j9129n1813k3446R854k43L8392M1962o334K6986
$$ -5868 48 35121 50557 82521 63392 11579 -11867 -2013 -2256 36136 78098 71764 98750
9922I8750n0252l2231l1579J8461L0160L032l5351J358L9328j2213l5507K7123
$$ 98750 48498 16267 -15312 3149 33309 36341 990 2348 41676 29463 -6044 21079
9910B1079l2064n973m0286o6356J6408M4316q284J1299P6515Q69j5090j2499l2603
$$ 21079 -10985 -16958 -57244 -123600 -107192 -62876 -71160 -59861 16654 17523 2433 -10066 -42669
9897d2669q487J7638O655k8112J4657p55Q024L3585q376o399O577J5626j8991
$$ -42669 -51156 -33518 -26863 -54975 -40318 -41073 -33049 536 -7840 -14239 -7662 7964 -11027
9884a1027n57m605L3067J9992J0530K6883j7794M318Q178m194q457l4265k5659
$$ -11027 -11584 -16189 16878 36870 47400 74283 56489 60807 68985 64791 56334 22069 -3590
9871c590N09j2953m820j424P941M2014P4927j824k1881j05496m2672N0216O4325
$$ -3590 -3081 -16034 -20854 -22278 -14337 27677 102604 100780 78899 -26597 -69269 -19053 45272
9858D5272L7940j9869j1655l0233M5440L486p0439N315N3409P967r6659j9203
$$ 45272 83212 63343 51688 21455 66895 70381 -58 5257 58666 66633 -30026 -49229
9846d9229m369k7113K5924M3537N0033J855l4555k3002n3300J374N8621M4291
$$ -49229 -53598 -80711 -54787 -11250 38783 40638 6083 -16919 -70219 -68845 -10224 34067
9834C4067J0445L2121k0018k1290j6303k7127J7745Q617m7990o114P7110M4213
$$ 34067 44512 76633 56615 35325 19022 -8105 9640 18257 -29733 -35847 41263 85476
9822H5476Q382J7617J4415m3582j03888j07516j7584k9936R07K0720O4395N8123
$$ 85476 93858 111475 125890 82308 -21580 -129096 -146680 -176616 -175709 -154989 -90594 -32471
9810c2471L2875O0609J4444n5423o9134J3531m831M8140Q298J3756k9679j5401
$$ -32471 404 61013 75457 20034 -49100 -35569 -40400 7740 16038 29794 115 -15286
9798a5286J4441J8335J4522r766j1415k3549n843M170K4757J8310l9469l2251
$$ -15286 -845 17490 32012 22246 10831 -12718 -18561 -14391 10366 28676 -10793 -43044
9786d3044j4357M709O818L7146m064l286K7746m6403J1274K3206P772n8044K4754
$$ -43044 -57401 -52692 -45874 -8728 -12792 -16078 11668 -34735 -23461 -255 7517 -50527 -25773
9773b5773K0400k1520j0789J2575K3007L8544l1715r489L3727q54J287k304j9360
$$ -25773 -5373 -26893 -37682 -25107 -2100 36444 4729 -4760 28967 28113 29400 27096 7736
9760G736l9542m5903j8480M214J5044j5487L6015j6371j070O7231L2561L6061
$$ 7736 -31806 -77709 -96189 -91975 -76931 -92418 -56403 -72774 -73844 -6613 25948 62009
9748F2009l625m0592J0061K4430J3384l5080m6115J9500J0878K3214l8071k5559
$$ 62009 58384 17792 27853 52283 65667 30587 -15528 3972 14850 38064 -7 -25566
9736b5566L5401L9902M5975J5828k6199j4965j9172k8874l930K5482J8035L6741
$$ -25566 9835 49737 95712 111540 85341 70376 51204 22330 18400 43882 61917 98658
9724I8658j6085k2574l6218k7605l4765M3931J8145k2587N472m264L024k197j0511
$$ 98658 82573 59999 23781 -3824 -38589 5342 23487 900 6372 2108 5132 2935 -7576
9711g576l4549j1656P5119J5793l8599m1719K6004K8452n1401l7404O7776L6256
$$ -7576 -42125 -53781 21338 37131 -1468 -43187 -17183 11269 -40132 -77536 -9760 26496
9699B6496J3056N731r865j7021j827k5437L395l1007p9030j2953P0989M7274L773
$$ 26496 39552 45283 35418 18397 16570 -8867 -5472 -36479 -115509 -128462 -57473 -10199 -6426
9686f426r548k5136p660N6054M0937L490l1716K3721L347m832l5865n3266K2232
$$ -6426 -15974 -41110 -48770 7284 48221 51711 19995 43716 47063 42231 6366 -46900 -24668
9673b4668O1582K9684l5015m8651J8177l1319j0694L6459J1859m696k574m5904
$$ -24668 36914 66598 31583 -17068 1109 -30210 -40904 -4445 7414 2718 144 -45760
9661d5760o4165j0212P873M9664P8812j710m5678p096j1684j6880J6383L0590
$$ -45760 -109925 -120137 -112264 -62600 16212 14502 -31176 -38272 -49956 -66836 -50453 -19863
9649a9863j2800j354N086j2954k6289M2794K6621j0958O848N2805K980J5922m5566
$$ -19863 -32663 -34017 -28931 -41885 -68174 -25380 1241 -9717 -2869 49936 52916 68838 23272
9636B3272k3507K4305j1670O570l3191p9961M182N0430L4414q729n9356o4520
$$ 23272 -235 24070 12400 18970 -14221 -94182 -90000 -39570 -5156 -13885 -73241 -137761
9624a37761L3444O1129J4083L7917K576k0286p742m4568k7151M0013k695k819
$$ -137761 -104317 -43188 -29105 8812 11388 -8898 -16640 -61208 -88359 -48346 -51041 -53860
9612e3860N594k114l2745M4171j4184R520M3561m4718o8137P196P0535N0825K4653
$$ -53860 -48266 -50380 -83125 -38954 -53138 -43618 -57 -44775 -112912 -105716 -35181 15644 40297
9599D0297l0979K050J6803k5815p9040k5824J2410L4499O778K872k7931L6890
$$ 40297 9318 11368 28171 2356 -76684 -102508 -90098 -55599 -48821 -45949 -73880 -36990
9587c6990l409j8533l4074k9477N1825M9799L0933L947k1422k793k562M9666l759
$$ -36990 -40399 -58932 -93006 -122483 -70658 -20859 10074 14021 -7401 -10194 -12756 36910 33151
9574C3151l1760j8767N7784L4142n2839k8616L6273j7528m4986L4533J9802L1632
$$ 33151 1391 -17376 40408 74550 21711 -6905 29368 11840 -33146 1387 21189 52821
9562E2821l8410j4672j3910p98N757M995O374l2675R896K684L4468L4648N1899
$$ 52821 14411 -261 -14171 -14969 -9212 -4217 2157 -30518 -20622 -17938 16530 51178 103077
9549A03077j8456l8539K5248n8926o136M0858L5045K242o6444M1997J3803q8248
$$ 103077 84621 46082 71330 12404 6268 47126 82171 84413 17969 59966 73769 -14479
9537a4479k5336l0019j9285m078N9208R127l501p728k3991O262L9959m437l4531
$$ -14479 -39815 -69834 -89119 -93197 -33989 -24862 -28363 -36091 -60082 -53820 -13861 -18298 -52829
9524e2829q142M6511Q813n514n739p234j636j4618K9214j983k177l2790m6117
$$ -52829 -60971 -14460 -5647 -11161 -16900 -24134 -25770 -40388 -11174 -13157 -15334 -48124 -94241
9511i4241K1294L8392N3147j8732n7586k6808o444l4341L5595M6957O3617M5506
$$ -94241 -72947 -34555 18592 -140 -57726 -84534 -90978 -125319 -89724 -42767 20850 66356
9499F6356p914l3627m3189L1564K6438l3391O132K3590M5333o1120n691l1066
$$ 66356 58442 24815 -18374 13190 39628 6237 12369 35959 81292 20172 14481 -16585
9487a6585K813J2401K954L0260j7003O638l9941M1897j2071l0572p287n505K0319
$$ -16585 -13772 -1371 1583 31843 14840 21478 -18463 23434 11363 -19209 -26496 -32001 -11682
9474a1682P266k6320O090M481p387n622m0817J8415M9387K6812o495j6779N554
$$ -11682 -4416 -30736 -24646 -20165 -27552 -33174 -73991 -55576 -6189 20623 14128 -2651 2903
9461B903l3708J6951J1822q387m5276Q526J3523M8371J4197l8992n39l6365J180
$$ 2903 -30805 -13854 -2032 -10419 -55695 -47169 -33646 14725 28922 -10070 -10609 -46974 -45794
9448d5794O4174K0202m0417k0198P7589j0979q0731o697J17K9243k5079m7742
$$ -45794 18380 38582 -1835 -22033 55556 44577 -36154 -42851 -42734 -13491 -38570 -86312
9436h6312m4710j2043L9060L8813j8843n848P214L9242M016j219K2660j6092J2742
$$ -86312 -131022 -143065 -104005 -65192 -84035 -89883 -82669 -43427 -39411 -40630 -17970 -34062 -21320
9423b1320L6041m384j8380J8630N4269K2889k6301k7925j2262n0667J251L6731
$$ -21320 14721 10337 -8043 10587 64856 87745 61444 33519 21257 -29410 -28159 8572
9411H572j3156p600o639K6825K8871m5692n3622N222Q2262Q0895l1910q9465o9660
$$ 8572 -4584 -12184 -18823 8002 36873 -8819 -62441 -57219 25043 105938 74028 -15437 -85097
9398h5097K878M4342m8466J2759J2516K8485J9828m268K9955j0325j1997L0573
$$ -85097 -82219 -37877 -86343 -73584 -61068 -32583 -12755 -17023 12932 2607 -9390 21183
9386B1183L1557j5738K2492o5439p9390o562m381k2050K8314P316K6367j3363
$$ 21183 52740 37002 59494 -5945 -85335 -91897 -96278 -118328 -90014 -82698 -56331 -69694
9374f9694R6246J50K2524J9647n453K1841k7327k9035p9483l4126K6046j7051
$$ -69694 26552 26702 49226 68873 63420 85261 57934 28899 -50584 -84710 -58664 -75715
9362g5715k9374J852M6961L8508L2347K1887n9644k1613N5770j0510m6832J9732
$$ -75715 -105089 -103237 -56276 -17768 14579 36466 -23178 -44791 10979 469 -46363 -26631
9350b6631Q481n250j410o648K5266K0234o778K7765J3094k887k6082n7719j7373
$$ -26631 -18150 -23400 -24810 -31458 -6192 14042 7264 35029 48123 45236 19154 -38565 -55938
9337e5938O1770J6445J1483J7298l940j4252l2888N881J3075o2456j2815O77Q063
$$ -55938 5832 22277 33760 51058 47118 32866 -22 5859 18934 -43522 -56337 -55660 -47597
9324d7597j1757K4502L351L3564j5992m4502L7300L4553k6538j6184Q798L0203
$$ -47597 -59354 -34852 -31501 2063 -13929 -58431 -21131 13422 -13116 -29300 -20502 9701
9312I701j5212J8196j6289J425N4922K4989j5607O182l0823k9588o41m0512J0128
$$ 9701 -5511 12685 -3604 -2179 52743 77732 62125 68307 37484 7896 7255 -33257 -23129
9299b3129L5339k9902k3267M2620M5448o397l3948K0435K3658k1476m267m3136
$$ -23129 12210 -17692 -40959 1661 47109 40712 6764 27199 50857 29381 25114 -18022
9287a8022n4235K3097L1002k2689k9428M3909K2990k4463j278M7291p930O485
$$ -18022 -72257 -49160 -18158 -40847 -70275 -26366 -3376 -27839 -29117 18174 10244 16729
9275A6729m0619l1872M0876q19j9105k1656j1287M0054O1829n7680l1232K1691
$$ 16729 -23890 -55762 -14886 -15705 -34810 -56466 -67753 -27699 34130 -23550 -54782 -33091
9263c3091J8602K609K7858k708J3360j1595n8711J0981k893j3727J4552J6066
$$ -33091 -14489 -11880 15978 13270 26630 15035 -43676 -32695 -35588 -49315 -34763 -18697
9251a8697j9051k1065J2141l9060k1765K5364j8677K812K9322R819J6410j3470
$$ -18697 -37748 -58813 -46672 -85732 -107497 -82133 -100810 -97998 -68676 -58857 -42447 -55917
9239e5917J7853K8414q697J1592J9793k9026l8955J650k1131L4001L3514j9946
$$ -55917 -38064 -9650 -18347 -6755 13038 -15988 -54943 -53293 -74424 -40423 -6909 -26855
9227b6855j4437k1423k0369M718O5494R5435R859k0375j5863m2180n6255L5821
$$ -26855 -41292 -62715 -83084 -78366 -12872 82563 92422 72047 56184 14004 -42251 -6430
9215f430R802o244m8659O299M9073J8422K459p701O226P729j5712k090m5146k3792
$$ -6430 3372 -2872 -51531 -45232 3841 22263 24722 17021 23247 30976 15264 13174 -31972 -55764
9201e5764L2713j505j4747o224M4176k9015l0666K7570L0448K6589n9156n273
$$ -55764 -23051 -24556 -39303 -45527 -1351 -30366 -61032 -33462 -3014 23575 -35581 -40854
9189d0854M6397J5249k4237p351J4902O79L9483j7107M969N9723k0740n1947k652
$$ -40854 5543 20792 -3445 -10796 4106 4785 44268 27161 32130 91853 71113 19166 16514
9176A6514J8446l5600k99L3992Q060l8452J653M7366j947j220k0331m1994J5278
$$ 16514 34960 -640 -939 33053 41113 2661 4314 51680 49733 48513 28182 -13812 1466
9163A466N3788j2526k7261K6350K1057j6055l704k0090M0167j5081l8781q881
$$ 1466 55254 42728 15467 41817 62874 46819 43115 23025 63192 48111 9330 449
9151D49k2787N855J3966n253M0865Q3886r729j0590r861m8317J7949l6128K6147
$$ 449 -22338 -16483 -2517 -7770 33095 116981 107252 96662 86801 38484 56433 20305 46452
9138D6452K4723J323q774m0033k1485K2687j8922N7911k7698l7604K179k2612
$$ 46452 71175 72498 63724 23691 2206 24893 5971 63882 36184 -1420 759 -21853
9126b1853j7524L3778L7471R4275M9292J8386l946k1752N75j5572j2621O7912
$$ -21853 -39377 -5599 31872 126147 175439 193825 189879 168127 168702 153130 140509 208421
9114B08421J01564L5923k0375n040j8442M7318J25311Q6591L3912J14007J05861
$$ 208421 309985 345908 325533 320493 302051 349369 474680 561271 595183 709190 815051
9103H15051J26477J81784K01454K83311N37730P32756J161234J889842L029390
$$ 815051 941528 1123312 1324766 1608077 2145807 2878563 4039797 5929639 8959029
9094H959029L967445L060805J436844L99869j096060l400011l822822k679121
$$ 8959029 12926474 15987279 17424123 17823992 16727932 13327921 9505099 6825978
9086F825978j572533j011596p01913m30880l50336k57193k05365k02140j99324
$$ 6825978 5253445 4241849 3539936 3109056 2758720 2501527 2296162 2094022 1894698
9077A894698j13923j28478j57223p9915p6838j31479r1982k9044j7638j0687m1367
$$ 1894698 1780775 1652297 1495074 1415159 1338321 1206842 1114860 1085816 1068178 1057491 1016124
9066A016124n7946o1549m5894Q234L407o822J92n5613q1424m5202o0282m1660
$$ 1016124 958178 896629 850735 858969 862376 855554 855746 800133 718709 673507 613225 571565
9054E71565k3758j371j5351j5521l4214l3307L9263o2062n9273j227K9807N8744
$$ 571565 547807 546436 531085 515564 481350 448043 487306 425244 365971 364744 394551 453295
9042D53295J2100l9617j7035j4029n1134l404Q304m355m9831r934K3406J8038
$$ 453295 465395 425778 408743 394714 343580 340176 348480 344125 294294 284360 307766 325804
9030C25804l5591p2295k6846k630J4506n9371J4817K9435L2010L9945L0752p6802
$$ 325804 290213 217918 191072 188442 202948 143577 158394 187829 219839 259784 290536 213734
9018B13734n0491N431j6J2242j5892J6259K9553L4983l206L9614P796n7275k5508
$$ 213734 163243 168674 168658 180900 165008 181267 210820 245803 242597 282211 290007 232732 207224
9005B07224k0693l2023O902j4280J3393L1801m534k4105l3536K712j9658m2141
$$ 207224 186531 154508 161410 147130 160523 192324 187790 163685 130149 132861 113203 71062
8993G1062q4154j7396K430l8834k2850K3003K4071M7625Q83n6375m236J4456k2669
$$ 71062 -13092 -30488 -28058 -66892 -89742 -66739 -42668 4957 5840 -50535 -54771 -40315 -62984
8980f2984K1153K6223M204L2997O3048p1734J703N5729L9443K8718j2321o5324
$$ -62984 -41831 -15608 -11404 21593 84641 12907 14610 70339 109782 138500 126179 60855
8968F0855l5524m0230r915P438K0302m81R275P5644K472K3740J6205n0012p2551
$$ 60855 25331 -14899 -24814 -17376 2926 2445 11720 87364 89836 113576 129781 79769 7218
8955G218k1046J6526j9190k969N2112j479l1287o2571K5418J9871P232k7767J6795
$$ 7218 -13828 2698 -16492 -19461 32651 31172 -115 -62686 -37268 -17397 -10165 -37932 -21137
8942b1137J7328J664K9731N4502N2637j0469l2608l5915n0773K8143K0000r960
$$ -21137 -3809 -2145 27586 82088 134725 124256 91648 55733 4960 33103 53103 43143
8930D3143j1666l3826j5647L1876K6060k9247m2841l7262N2917K1012j3231K0111
$$ 43143 31477 -2349 -17996 13880 39940 10693 -32148 -69410 -16493 4519 -8712 11399
8918A1399m4724J5811R1686P154j5626k4962L5142l443o5328j7496j530m8175
$$ 11399 -33325 -17514 74172 81326 65700 40738 75880 72437 7109 -10387 -11917 -60092
8906f0092K9257q845p136J2620p218l53P883L5789K9597j5986L0992L1557L6006
$$ -60092 -30835 -39680 -46816 -34196 -41414 -41767 -33884 1905 31502 15516 46508 78065 114071
8893A14071k4231n4227m5509j8376j2503M306j1854j2660M3652K7362m7924k7233
$$ 114071 89840 35613 -9896 -28272 -40775 -36469 -48323 -60983 -17331 10031 -37893 -65126
8881f5126K4625Q524K4741L2952j7079N948o396o646q176k7956K693N2580j205
$$ -65126 -40501 -31977 -7236 25716 8637 14585 8189 1543 -6633 -34589 -31896 20684 19479
8868A9479j5007J1474K8247K1948n2187l9618j259N3140J6682r839l7366O077
$$ 19479 4472 15946 44193 66141 13954 -25664 -26923 26217 42899 33060 -4306 1771
8856A771N664L903j3630K4883j6846K8654O3245L118l0756M5855k1100j3563l399
$$ 1771 7435 11338 -2292 22591 5745 34399 97644 100762 70006 115861 94761 81198 77799
8843G7799p8510m6524K6427M6035J0739j8446j3901J1363m994n629l9048J8392
$$ 77799 -711 -47235 -20808 25227 35966 17520 3619 14982 9988 4359 -34689 -16297
8831a6297J0862m006q208j8715L9798M5266L9461o263p1881m6029R415l9771p325
$$ -16297 -5435 -9441 -17649 -36364 3434 48700 88161 81898 10017 -36012 -26597 -66368 -73693
8818g3693R911L3873R619m9729l731P0310M8721l3353j8753M6713N9876k2571
$$ -73693 -63782 -29909 -20290 -70019 -73750 -3440 45281 11928 -6825 39888 99764 77193
8806G7193o2887j7836M4731M2385n7134L2184K7275m2810p0497k0652L7178K7503
$$ 77193 14306 -3530 41201 83586 26452 58636 85911 43101 -27396 -48048 -10870 16633
8794A6633L9281j2506j5326J7372k0739K4408r629m6458n8275j1923K1758j2915
$$ 16633 55914 43408 28082 45454 24715 49123 39494 -6964 -65239 -77162 -55404 -68319
8782f8319j5821P277K9855L226J167j4210P287M8428j1446K3649N9864K1261o4193
$$ -68319 -84140 -76863 -47008 -43782 -42615 -56825 -49538 -1110 -12556 11093 70957 92218 28025
8769B8025m9226m802o745J2851J6336l0704n7263j3166J5270M1042L8884J3468
$$ 28025 -21201 -26003 -32748 -19897 -3561 -34265 -91528 -104694 -89424 -48382 -9498 3970
8757C970m868K0243k2838j8813N6486K561J7125O213o761k6744O516L3563j8742
$$ 3970 -898 19345 -3493 -22306 34180 36741 53866 60079 53318 26574 33090 66653 47911
8744D7911r2492p824L6817q958J9325N3805K2705k6466k284n20K0479k4764m5228
$$ 47911 -44581 -52405 -15588 -24546 -5221 48584 71289 44823 42539 42019 62498 37734 -7494
8731g494K0909K132l2125j9035j4796J8584K1181J0673o964K2526P695k545K5652
$$ -7494 13415 15547 -16578 -35613 -50409 -31825 -10644 29 -6935 15591 23286 20741 46393
8718D6393M4133l1572n0974l4275J1422r785l1010L3078J4788j3201P021O1310
$$ 46393 90526 58954 7980 -26295 -14873 -24658 -55668 -22590 -7802 -21003 -13982 47328
8706D7328K1141l2610r282m4288k4785P7500q820m8442k5628K5207J0948K0749
$$ 47328 68469 35859 26577 -17711 -42496 35004 26184 -22258 -47886 -22679 -11731 9018
8694I018J6947O272J1276P700m1215n5189l4722q067j0373M9264j6479Q34j4991
$$ 9018 25965 32237 43513 51213 9998 -45191 -79913 -87980 -98353 -49089 -65568 -64734 -79725
8681g9725J5162M5637J2850j5829k133M1416l2061m4332k463K754K7534J6802
$$ -79725 -64563 -18926 -6076 -21905 -24038 17378 -14683 -59015 -61478 -58724 -31190 -14388
8669a4388J0904K6403k5246n094K4115o2026j8121M0551M8989J8221n098l5672
$$ -14388 -3484 22919 -2327 -7421 16694 -45332 -63453 -22902 26087 44308 39210 3538
8657C538J1555L756m0552j6364K0315J2471j7315P092j5517n485p2140K4482L9426
$$ 3538 15093 18849 -21703 -38067 -17752 -5281 -22596 -15504 -31021 -36506 -108646 -84164 -44738
8644d4738M4749R142N8602Q008O470k213J9219j4891k5003J075Q525J1860k0523
$$ -44738 11 9153 67755 75763 82233 80020 99239 84348 59345 60420 68945 80805 60282
8631F0282l1972l593J257Q778j2075K5708O212l5886l3013k1060O9542K8031m4021
$$ 60282 28310 24717 25974 34752 22677 48385 54597 18711 -14302 -35362 34180 62211 18190
8618A8190R908j0577l133m9599k25K5343R053k4522j4713K7000k4543l5054N4698
$$ 18190 28098 17521 14388 -35211 -35436 -10093 -1040 -25562 -40275 -13275 -37818 -72872 -18174
8605a8174M079O570j9191o711L4388O440l88m4163r704N8415l0914k122j0114
$$ -18174 -14095 -7525 -26716 -33427 961 7401 7013 -37150 -46854 11561 -19353 -21475 -31589
8592c1589m1063O1731L5332J3125L8917l3991j2810M1013O2878j9698n7099o4834
$$ -31589 -72652 -10921 24411 37536 76453 42462 29652 70665 133543 113845 56746 -8088
8580h088J8444K996O930j3349L258M8037J9679L3942M746j00512p2762l1657k754
$$ -8088 10356 13352 20282 6933 10191 58228 77907 111849 116595 16083 -56679 -88336 -91090
8567i1090K7942P0933N1406J1428k8877l4876J0731j4449O557L6423L0287J1098
$$ -91090 -63148 7785 59191 70619 41742 6866 17597 3148 9705 46128 76415 87513
8555H7513N5l6372J050p035j1235J4242k6860j6626K2630j5995l0592K6485N2835
$$ 87513 87568 51196 52246 45211 33976 48218 21358 4732 27362 11367 -19225 7260 60095
8542F0095j9407l488K2086k556l1153j4590K6419r897j8214Q406J0903j523M0793
$$ 60095 40688 37200 59286 56730 25577 10987 37406 27509 9295 17701 28604 27081 67874
8529F7874J5391k529k9149m2828n8585l1735M44j279L9856N1134l2393K7277J0820
$$ 67874 83265 80736 51587 8759 -49826 -81561 -81117 -82396 -42540 8594 -23799 3478 14298
8516A4298J4045Q27L386k5605j2041K5499L2391k1186k2528L2794J1789j9766
$$ 14298 28343 29170 32556 6951 -5090 20409 52800 31614 9086 41880 53669 33903
8504C3903K1540l1180j3232M1609K7367k7811l543l3005j3184p2171K8704N8857
$$ 33903 55443 24263 11031 52640 80007 52196 48653 15648 2464 -69707 -41003 17854
8492A7854l0665P302P455l3658K8656J6314J5073m4318q374L1434L1155l4271
$$ 17854 -12811 -5509 1946 -31712 -3056 13258 28331 -15987 -24361 7073 38228 3957
8480C957O31j3512N692l677j876j0572j259j8241Q911L2773m7688M9195O8471
$$ 3957 4588 -8924 -3232 -6909 -8785 -19357 -20616 -38857 -29946 2827 -44861 4334 72805
8467G2805k4595k4402K7478k4850k0592l8456Q766j5917l074k7935n1896M6084
$$ 72805 48210 23808 51286 26436 5844 -32612 -23846 -39763 -42837 -70772 -122668 -76584
8455g6584J3642m7726J1644M9474M8242K1194j3243l7768M3415J3598j1575M763
$$ -76584 -62942 -110668 -99024 -49550 -1308 19886 6643 -31125 12290 25888 14313 19076
8443A9076m5695k7083N5271K3420q000m5785n3579K4389K1317J2166L3003j3148
$$ 19076 -26619 -53702 1569 24989 16989 -28796 -82375 -57986 -36669 -24503 8500 -4648
8431d648q706L4130M8663m9733n8504K9245J3155J3030k9549j608l2062N3691
$$ -4648 -13354 20776 69439 19706 -38798 -9553 3602 16632 -12917 -14525 -46587 7104
8419G104m6665o1566j679N5694N1606N0963L4489K5279j4547n5604j7427j3934
$$ 7104 -39561 -101127 -102806 -47112 4494 55457 89946 115225 100678 45074 27647 13713
8407A3713n789l3179L0230K3961j6846J4922R690j3639k2879j2904k570j4924
$$ 13713 7924 -25255 4975 28936 12090 27012 36702 23063 184 -12720 -15290 -30214
8395c0214j003l0900r65n296o154M497L3840L559p523J5542J529j8831P0325M2129
$$ -30214 -31217 -62117 -63082 -68378 -74532 -70035 -36195 -32636 -40159 -24617 -23088 -41919 28406 70535
8381G0535l5754j6146K1832n4163j0334k0976J8540J4769P859J6457L385l9527
$$ 70535 34781 18635 40467 -13696 -24030 -45006 -26466 -11697 -3838 12619 16004 -23523
8369b3523L3477K9359J1234r322K2422j4332K0955J6694j9189J4530k2865k5898
$$ -23523 9954 39313 50547 41225 63647 49315 70270 86964 67775 82305 59440 33542
8357C3542Q098l9247k0676K5248p348m1381l3062N1409K6630n999k9346p5K2057
$$ 33542 41640 2393 -18283 6965 -383 -41764 -74826 -23417 3213 -2786 -32132 -32207 -10150
8344a0150j1625m1059k8703M6215Q7783R848o164j2755L317m3798k7527K0036
$$ -10150 -21775 -62834 -91537 -45322 42461 52309 46145 33390 36707 -7091 -34618 -14582
8332a4582J6700J8966L6560J3801m8933r7154K5067M2531o687K6812l9474k2223
$$ -14582 2118 21084 57644 71445 22512 -74642 -49575 -7044 -13731 13081 -26393 -48616
8320d8616K6376J3580J0305M5781J0886o6329j8242L1047J031L5327j8431K9916
$$ -48616 -22240 -8660 1645 47426 58312 -8017 -26259 4788 5819 41146 22715 52631
8308E2631k029j7387J9146L0618K2786m3293l2021j4249p45k3278n3538r876L2621
$$ 52631 50602 33215 52361 82979 105765 62472 30451 16202 15457 -7821 -61359 -71235 -38614
8295c8614r685n719O4838p0950K2220Q022p546q397q970O2038O6500L2568n4546
$$ -38614 -48299 -54018 10820 -60130 -37910 -29888 -37434 -45831 -54801 7237 73737 106305 51759
8282E1759k9166j0685n4860k209J3983m6723p1732K6399N4264M7671r720m1103
$$ 51759 22593 11908 -42952 -45161 -31178 -77901 -149633 -123234 -68970 -21299 -31019 -72122
8270g2122L5832O5460j6745L066J7389m597j0021N8350m0131q2445j2629K2951
$$ -72122 -36290 29170 12425 15491 32880 28283 18262 76612 36481 -45964 -58593 -35642
8258c5642K7817n379j9234j1739n425k9756M805K2595K446P872l002K1786M7451
$$ -35642 -7825 -13204 -32438 -44177 -49602 -79358 -74553 -51958 -49512 -41640 -44642 -22856 24595
8245B4595m3418l4215M4520O0902j7921J5857K413K8464o7028l9139m5164J9826
$$ 24595 -18823 -53038 -8518 52384 34463 50320 52733 81197 14169 -24970 -70134 -50308
8233e0308M0988O4849j0980L369K4387k6874m663O52J0384j0954k2130l5164J9905
$$ -50308 -9320 55529 44549 47918 72305 45431 40768 41420 51804 40850 18720 -16444 3461
8220C461J135K1748J1069l3325o246k167k6207J8843J4318m4495J4751M09N570
$$ 3461 4596 26344 37413 4088 -2158 -4325 -30532 -11689 2629 -41866 -27115 -26706 -21136
8207b1136J7669q315k1638j6080P424J3399R0120N7640m3994m0898k5773o29P189
$$ -21136 -3467 -11782 -33420 -49500 -42076 -28677 61443 119083 75089 34191 8418 7789 14978
8194A4978N0724P1415r873o1436r805k9457J9858m9808q265M183k432k0811M7431
$$ 14978 65702 137117 127244 65808 56003 26546 46404 -3404 -11669 -7486 -9918 -30729 16702
8181A6702J3251J7904L5452n3849m3081k8853l478N8227K7317m4054j2871J3070
$$ 16702 29953 47857 83309 29460 -13621 -42474 -45952 12275 39592 -4462 -17333 -4263
8169d263N714J2792m269k9126n1690N221L8012K7665K583n0596K4195Q9200N7123
$$ -4263 1451 14243 9974 -19152 -70842 -65621 -27609 56 2639 -47957 -23762 65438 122561
8156A22561L0831m2880o3967m0175l492m8612L4761m971N403M3317J9462l895
$$ 122561 153392 110512 46545 6370 2878 -45734 -10973 -15944 -10541 32776 52238 48343
8144D8343P988k9839p4250l8189K3299l3342L2382M1480J2641j753R235J614k1915
$$ 48343 56331 26492 -47758 -85947 -62648 -95990 -63608 -22128 -9487 -11240 -2005 -391 -22306
8131b2306J0398M4573l3281o5386L4367j347o918j2136l851K7018J1200O266l6515
$$ -22306 -11908 32665 -616 -66002 -31635 -32982 -39900 -52036 -55887 -28869 -17669 -11403 -47918
8118d7918m148J872N073M0047J7374J1168L1325j9683l9125j8815r542j9316k5775
$$ -47918 -52066 -50194 -45121 -5074 12300 23468 54793 35110 -4015 -22830 -32372 -51688 -77463
8105g7463K952J4918L8862R742q04J3935N1721N965j3128j4060j9471P980J5405
$$ -77463 -74511 -59593 -20731 -10989 -11793 2142 53863 59828 46700 32640 13169 21149 36554
8092C6554j2422K7458L3922l241n6578j1551K7105o641l1715J375k8205J0745
$$ 36554 24132 51590 85512 82271 25693 14142 41247 34606 2891 4266 -23939 -13194
8080a3194L6630K4092j9444O2690L2431p4452k7283L2265K864J1372m0703k6258
$$ -13194 23436 47528 28084 90774 123205 48753 21470 53735 56599 67971 27268 1010
8068A010K1107K3619J6051l7278l5408m1136M2632J7276k8455O6027k1458o8081
$$ 1010 22117 45736 61787 24509 -10899 -52035 -9403 7873 -20582 45445 23987 -44094
8056d4094k3742N505N6828k107k6303J521k1194l0426m9897L902M0155K7641O8165
$$ -44094 -67836 -62331 -5503 -7610 -33913 -32392 -53586 -84012 -133909 -130007 -89852 -62211 5954
8043E954L4915K6377j953p088O150k5024k6122K4096L1043l7768k8777J4093Q830
$$ 5954 40869 67246 65293 58205 64355 39331 13209 37305 68348 30580 1803 15896 24726
8030B4726J4589r935m7932m9073L1842M5293N6503j4810q3187l7043M4159K2416
$$ 24726 39315 29380 -18552 -67625 -35783 9510 66013 51203 -31984 -69027 -24868 -2452
8018b452M067m898P636P640j135p5030Q430M1693j0794K5481Q346l1526n22l0415
$$ -2452 1615 -3283 4353 11993 10858 -64172 -55742 -14049 -24843 638 8984 -22542 -23064 -53479
8004e3479r481j6580J1223K6550N5656l1141J8310J8689J6682L979r430r351J0268
$$ -53479 -62960 -79540 -68317 -41767 13889 -17252 1058 19747 36429 40408 30978 21627 31895
7991C1895l7453m2033J5726k0575L0369P3961o835o3159j467Q9422J79J9094J0156
$$ 31895 -5558 -47591 -31865 -52440 -22071 51890 45055 -18104 -19571 69851 70030 89124 99280
7978I9280m4480l4512l6718K3440K6715l6294o9104K4140k875P6868N0755r796
$$ 99280 54800 20288 -16430 7010 33725 -2569 -71673 -47533 -50408 26460 77215 67419
7966F7419l0113m704J141m4544J3193l7555k3924N3999K605J1423l226m2606j0240
$$ 67419 37306 32602 33743 -10801 2392 -35163 -59087 -5088 -2483 8940 5714 -36892 -47132
7953d7132J9625L6491J1171N4889L079j3847m0071K3513M041J1055K3126l1280
$$ -47132 -27507 8984 20155 75044 78123 64276 24205 47718 51759 62814 85940 54660
7941E4660p88J7328o335J308m6123l7968m7031k7041Q7550K0150J8817m5497n807
$$ 54660 53872 71200 64865 66173 20050 -17918 -64949 -91990 -4440 15710 34527 -10970 -16777
7928a6777m2345j0732J2931M8969J1461o015K8462J5270k3530m3243J3888O2016
$$ -16777 -59122 -69854 -56923 -7954 3507 -2508 25954 41224 17694 -25549 -11661 50355
7916E0355O668k0322p7665p38L1460R932K1364J8955k1737r615j9536n4710k5898
$$ 50355 57023 36701 -40964 -41702 -10242 -310 21054 40009 18272 8657 -10879 -65589 -91487
7903i1487K0537L3367K4552j4675j3717J3684q952o2696Q862J7867O7533L2948
$$ -91487 -70950 -37583 -13031 -27706 -41423 -27739 -36691 -99387 -90525 -72658 -5125 27823
7891B7823m409m903m1743J066M1681J5774k6604k4745k66J3661O1886k0711n1182
$$ 27823 23414 18511 -23232 -22166 19515 35289 8685 -16060 -16326 -2665 59221 38510 -12672
7878a2672k3630m6445j2913j8862K8785K6579L5740K0810j2618q3329j0228O7169
$$ -12672 -36302 -82747 -95660 -114522 -85737 -59158 -23418 -2608 -15226 -98555 -108783 -41614
7866d1614R0833j7045k0972J3483K195J0014r990L292m551k7570j5753j6632j7661
$$ -41614 49219 32174 11202 24685 26880 36894 26904 30196 25645 -1925 -17678 -34310 -51971
7853e1971L69L8023q768l5547r302P103Q178K8630J7658M6844L4237Q693j7775
$$ -51971 -51602 -13579 -22347 -57894 -67196 -60093 -51915 -23285 -5627 41217 75454 84147 66372
7840F6372l1888l4243N623r126o1599K987J8147R341l4883K8567M0555o7521o543
$$ 66372 34484 241 5864 -3262 -64861 -61874 -43727 -34386 -69269 -40702 -147 -67668 -74211
7827g4211K0797Q992K4193J3093N080J9967k6155j1752j2898n7478R380L0067
$$ -74211 -53414 -44422 -20229 -7136 -2056 17911 -8244 -19996 -32894 -90372 -80992 -50925
7815e0925O3307L1312j8644l0210J4474M8357L2101l9368n7218L0474j350k6170
$$ -50925 12382 43694 25050 -5160 9314 57671 89772 50404 -6814 23660 22310 -3860
$$ [...]
##END NTUPLES=NMR SPECTRUM
##END=
