##TITLE=Analysis number 318869
Compound Code cc 48708
Book Reference 456/150/2
Project Code adrs
Chemist Name anns
##JCAMPDX= 6.0         $$ Bruker NMR JCAMP-DX V2.0
##DATA TYPE= NMR SPECTRUM
##DATA CLASS= NTUPLES
##ORIGIN= Bruker BioSpin GmbH
##OWNER= nmr
$$ XWIN-NMR		Version 3.5
$$ Fri Apr 21 08:49:49 2006 GMT Daylight Time (UT+1h)  MAYBRIDGE\nmr@NMR_250MHZ
##.OBSERVE FREQUENCY= 250.131544655141
##.OBSERVE NUCLEUS= ^1H
##.ACQUISITION MODE= SIMULTANEOUS (DQD)
##.ACQUISITION SCHEME= undefined
##.AVERAGES= 16
##.DIGITISER RES= 18
##SPECTROMETER/DATA SYSTEM= dpx250
##.PULSE SEQUENCE= zg30
##.SOLVENT NAME= CDCl3
##.SHIFT REFERENCE= (INTERNAL, CDCl3, 0, 16.522)
##AUDIT TRAIL= $$ (NUMBER, WHEN, WHO, WHERE, WHAT)
$$ ##TITLE= Audit trail, XWIN-NMR		Version 3.5
$$ ##JCAMPDX= 5.01
$$ ##ORIGIN= Bruker BioSpin GmbH
$$ ##OWNER= nmr
$$ C:\u/data/dgb/nmr/ADRS/2820/pdata/1/auditp.txt
$$ ##AUDIT TRAIL=  $$ (NUMBER, WHEN, WHO, WHERE, WHAT)
(   1,<2006-04-21 08:49:22.53 +100>,<MAYBRIDGE\nmr>,<NMR_250MHZ>,
      <created by zg, POWCHK disabled, PULCHK disabled
       configuration hash MD5:
       84 BC 41 DB A1 6E 1D 46 DA 25 12 A5 C1 ED C5 3A
       data hash MD5: 64K
       F0 9C E2 90 D1 A8 2A 66 45 FD CE 0B F7 33 C0 B5>)
(   2,<2006-04-21 08:49:39.01 +100>,<MAYBRIDGE\nmr>,<NMR_250MHZ>,
      <Start of raw data processing
       ef LB = 0.3 FT_mod = 6 PKNL = 1 SI = 32K 
       data hash MD5: 32K
       08 7F 4D 1E 07 AD 7C A5 60 1C DF D5 3C 04 22 3D>)
(   3,<2006-04-21 08:49:40.89 +100>,<MAYBRIDGE\nmr>,<NMR_250MHZ>,
      <apk 
       data hash MD5: 32K
       1D 0F 69 AA 0B BF 27 7B 4B 15 51 08 E5 AC E4 43>)
(   4,<2006-04-21 08:49:41.80 +100>,<MAYBRIDGE\nmr>,<NMR_250MHZ>,
      <abs ABSG = 5 
       data hash MD5: 32K
       7A B3 C7 8A 94 1C 66 AB 06 47 0A 21 06 B2 A0 0C>)
$$ ##END=
$$ 
$$ hash MD5
$$ AC 69 90 C7 EC 29 BA 6F F0 33 87 6D 4D 3B 1C AE
##$RELAX= 
##$RELAX= 
##$RELAX= 
##$RELAX= 
##$RELAX= 
##$RELAX= 
##$RELAX= 
$$ Bruker specific parameters
$$ --------------------------
##$DU= <C:\u>
##$EXPNO= 2820
##$NAME= <ADRS>
##$PROCNO= 1
##$TYPE= <nmr>
##$USER= <dgb>
##$AMP= (0..31)
100 100 100 100 100 100 100 100 100 100 100 100 100 100 100 100 100 100 
100 100 100 100 100 100 100 100 100 100 100 100 100 100 
##$AQSEQ= 0
##$AQ_mod= 3
##$AUNM= <au_zg>
##$AUTOPOS= <1 >
##$BF1= 250.13
##$BF2= 250.13
##$BF3= 250.13
##$BF4= 250.13
##$BF5= 500.13
##$BF6= 500.13
##$BF7= 500.13
##$BF8= 500.13
##$BYTORDA= 1
##$CFDGTYP= 0
##$CFRGTYP= 5
##$CHEMSTR= <none>
##$CNST= (0..31)
1 1 145 1 1 1 1 1 1 1 1 1 1 1 1 1 1 1 1 1 1 1 1 1 1 1 1 1 1 1 1 1 
##$CPDPRG= <>
##$CPDPRG1= <>
##$CPDPRG2= <>
##$CPDPRG3= <>
##$CPDPRG4= <mlev>
##$CPDPRG5= <mlev>
##$CPDPRG6= <mlev>
##$CPDPRG7= <mlev>
##$CPDPRG8= <mlev>
##$CPDPRGB= <>
##$CPDPRGT= <>
##$D= (0..31)
0 1 0 0 0 0 0 0 0 0.06 0 0 0 0 0 0 0.0002 0 0 0 0 0 0 0 0 0 0 0 0 0 0 
0 
##$DATE= 1145605751
##$DBL= (0..7)
120 120 120 120 120 120 120 120 
##$DBP= (0..7)
150 150 150 150 150 150 150 150 
##$DBP07= 0
##$DBPNAM0= <>
##$DBPNAM1= <>
$$ [...]
##$SUBNAM7= <"">
##$SUBNAM8= <"">
##$SUBNAM9= <"">
##$SW= 20.6930455092707
##$SWIBOX= (0..15)
0 0 3 0 0 0 0 0 0 0 0 0 0 0 0 0 
##$SW_h= 5175.983436853
##$TD= 65536
##$TD0= 1
##$TE= 295.16
##$TE2= 300
##$TE3= 300
##$TEG= 300
##$TL= (0..7)
0 120 120 120 120 120 120 120 
##$TP= (0..7)
150 150 150 150 150 150 150 150 
##$TP07= 0
##$TPNAME0= <>
##$TPNAME1= <>
##$TPNAME2= <>
##$TPNAME3= <>
##$TPNAME4= <>
##$TPNAME5= <>
##$TPNAME6= <>
##$TPNAME7= <>
##$TPOAL= (0..7)
0.5 0.5 0.5 0.5 0.5 0.5 0.5 0.5 
##$TPOFFS= (0..7)
0 0 0 0 0 0 0 0 
##$TUNHIN= 0
##$TUNHOUT= 0
##$TUNXOUT= 0
##$USERA1= <user>
##$USERA2= <user>
##$USERA3= <user>
##$USERA4= <user>
##$USERA5= <user>
##$V9= 5
##$VALIST= <valist>
##$VCLIST= <CCCCCCCCCCCCCCC>
##$VD= 0
##$VDLIST= <DDDDDDDDDDDDDDD>
##$VPLIST= <PPPPPPPPPPPPPPP>
##$VTLIST= <TTTTTTTTTTTTTTT>
##$WBST= 1024
##$WBSW= 4
##$XGAIN= (0..3)
0 0 0 0 
##$XL= 0
##$YL= 0
##$YMAX_a= 436716
##$YMIN_a= -419416
##$ZGOPTNS= <>
##$ZL1= 120
##$ZL2= 120
##$ZL3= 120
##$ZL4= 120
##$ABSF1= 16.522
##$ABSF2= -4.171173
##$ABSG= 5
##$ABSL= 3
##$ALPHA= 0
##$AQORDER= 0
##$ASSFAC= 0
##$ASSFACI= 0
##$ASSFACX= 0
##$ASSWID= 0
##$AUNMP= <proc_1d>
##$AZFE= 0.1
##$AZFW= 0.1
##$BCFW= 0
##$BC_mod= 0
##$BYTORDP= 0
##$COROFFS= 0
##$CY= 12.5
##$DATMOD= 1
##$DC= 0
##$DFILT= <>
##$DTYPP= 0
##$F1P= 14.0000005364418
##$F2P= -0.99999901652339
##$FCOR= 0.5
##$FTSIZE= 32768
##$FT_mod= 6
##$GAMMA= 0
##$GB= 0
##$INTBC= 1
##$INTSCL= 1
##$ISEN= 128
##$LB= 0.3
##$LEV0= 0
##$LPBIN= 0
##$MAXI= 10000
##$MC2= 0
##$MEAN= 0
##$ME_mod= 0
##$MI= 0
##$NCOEF= 0
##$NC_proc= -4
##$NLEV= 6
##$NOISF1= 0
##$NOISF2= 0
##$NSP= 0
##$NTH_PI= 0
##$NZP= 0
##$OFFSET= 16.522
##$PC= 1
##$PHC0= 169.0207
##$PHC1= 9.416802
##$PH_mod= 1
##$PKNL= yes
##$PPARMOD= 0
##$PSCAL= 4
##$PSIGN= 0
##$REVERSE= no
##$SF= 250.13
##$SI= 32768
##$SIGF1= 0
##$SIGF2= 0
##$SINO= 400
##$SIOLD= 32768
##$SREGLST= <1H.CDCl3>
##$SSB= 0
##$STSI= 32768
##$STSR= 0
##$SW_p= 5175.98343685301
##$SYMM= 0
##$S_DEV= 0
##$TDeff= 65536
##$TDoff= 0
##$TI= <Analysis number 999999
Compound Code 99
Book Reference 9
Project Code 9>
##$TILT= no
##$TM1= 0
##$TM2= 0
##$TOPLEV= 0
##$USERP1= <user>
##$USERP2= <user>
##$USERP3= <user>
##$USERP4= <user>
##$USERP5= <user>
##$WDW= 1
##$XDIM= 32768
##$YMAX_p= 377716110
##$YMIN_p= -333885
$$ End of Bruker specific parameters
$$ ---------------------------------
##NTUPLES= NMR SPECTRUM
##VAR_NAME=  FREQUENCY,     SPECTRUM/REAL,   SPECTRUM/IMAG
##SYMBOL=    X,             R,               I
##VAR_TYPE=  INDEPENDENT,   DEPENDENT,       DEPENDENT
##VAR_FORM=  AFFN,          ASDF,            ASDF
##VAR_DIM=   32768,         32768,           32768
##UNITS=     HZ,            ARBITRARY UNITS, ARBITRARY UNITS
##FACTOR=    0.157963299565203, 1,           1
##FIRST=     4132.6476996994, 0,             0
##LAST=      -1043.33573715361, 0,           0
##MIN=       -1043.33573715361, -333885,     0
##MAX=       4132.6476996994, 377716110,     0
$$ Real data points
##PAGE= N=1
##DATA TABLE= (X++(R..R)), XYDATA
$$ [...]
$$ plain form
19165 38838 16281 121305 136511 106863 165908 187098 172191 184483 111880 118176 127737 102609
19153 102609 118498 56656 95891 186865 184814 129254 141523 206767 232052 215274 256388 371211
19141 371211 426911 458323 457729 508356 515293 382037 266729 270174 325459 331174 384983 365142
19129 365142 363676 443005 471893 505350 516331 468148 401452 264876 211928 377899 501349
19118 501349 471889 344105 278499 222506 151251 222779 254920 196572 192682 227523 203976
19107 203976 176098 139161 118855 146715 159615 286345 343759 324332 311007 312594 215248
19096 215248 183128 269777 310595 341169 287853 317748 308674 369692 458743 429288 490545 661360
19084 661360 722308 738499 708641 650089 635955 637498 562419 505957 603748 736429 756714
$$ packed form
19165C8838k2557J05024J5206k9648N9045K1190j4907J2292p2603O296R561k5128
19153A02609J5889o1842L9235R0974k051n5560J2269O5244K5285j6778M1114J14823
19141C71211N5700L1412n94N0627O937j33256j15308L445N5285N715N3809j9841
19129C65142j466P9329K8888L3457J0981m8183o6696j36576n2948J65971J23450
19118E01349k9460j27784o5606n5993p1255P1528L2141n8348l890L4841k3547
19107B03976k7878l6937k0306K7860J2900J26730N7414j9427j3325J587r7346
19096B15248l2120Q6649M0818L0574n3316K9895r074O1018Q9051k9455O1257J70815
19084F61360O0948J6191k9858n8552j4134J543p5079n6462R7791J32681K0285
$$ plain form
19073 756714 694970 644875 552071 447145 522415 523017 435228 372351 373143 426136 486939 365823
19061 365823 356521 313982 301034 304247 289197 193595 63041 124370 266832 270025 283276 296713
19049 296713 220875 259072 308834 248464 237272 216043 154264 122736 191184 197581 114276 67432
19037 67432 85190 190405 246171 191339 153749 166367 237184 444181 595679 543506 487905
19026 487905 452936 278016 190629 129039 164685 232849 303282 264818 318588 466077 610447
19015 610447 720596 747221 748720 639180 591875 565602 467257 356615 322050 277078 271379
19004 271379 370676 579963 643237 612606 531264 493465 449784 401475 273335 178801 149799
18993 149799 188574 216846 198094 113883 142487 167552 108379 129605 127062 168845 238517 277494
$$ packed form
19073G56714o1744n0095r2804j04926P5270O02q7789o2877P92N2993O0803j21116
19061C65823r302m2539j2948L213j5050r5602j30554O1329J42462L193J3251J3437
19049B96713p5838L8197M9762o0370j1192k1229o1779l1528O8448O397q3305m6844
19037F7432J7758J05215N5766n4832l7590J2618P0817K06997J51498n2173n5601
19026D87905l4969j74920q7387o1590L5646O8164P0433l8464N3770J47489J44370
19015F10447J10149K6625J499j09540m7305k6273r8345j10642l4565m4972n699
19004B71379R9297K09287O3274l0631q1342l7799m3681m8309j28140r4534k9002
18993A49799L8775K8272j8752q4211K8604K5065n9173K1226k543M1783O9672L8977
$$ plain form
18981 277494 215815 233367 206303 191354 234149 203430 190931 76462 16118 102072 211153
18970 211153 274170 220515 166687 187498 192658 173050 145337 170693 134436 56609 146956 198261
18958 198261 166098 126623 218918 259290 339312 335381 343343 366225 291080 195051 130663 170484
18946 170484 196565 150451 205019 247996 362094 324798 155834 95350 197524 268254 226463
18935 226463 302725 388102 495176 467384 397142 377281 309742 312424 316445 298302 236762 119325
18923 119325 218949 315097 283119 261327 351778 467954 598525 592195 530635 507444 557031
18912 557031 639032 569880 455575 391691 436418 534199 623345 776745 879264 882961 885266
18901 885266 835941 903056 868866 735471 730062 798087 820804 863344 825985 790998 702044
$$ packed form
18981B77494o1679J7552k7064j4949M2795l0719j2499j14469o0344Q5954J09081
18970B11153O3017n3655n3828K0811N160j9608k7713K5356l6257p7827R0347N1305
18958A98261l2163l9475R2295M0372Q0022l931P962K2882p5145r6029o4388L9821
18946A70484K6081m6114N4568M2977J14098l7296j68964o0484J02174P0730m1791
18935B26463P6262Q5377J07074k7792p0242j9861o7539K682M021j8143o1540j17437
18923A19325R9624R6148l1978k1792R0451J16176J30571o330o1560k3191M9587
18912E57031Q2001o9152j14305o3884M4727R7781Q9146J53400J02519L697K305
18901H85266m9325O7115l4190j33395n409O8025K2717M2540l7359l4987q8954
$$ plain form
18890 702044 577586 542717 599439 689939 771901 869498 963276 1031791 944124 856251 734150
18879 734150 634005 466693 412002 395261 307861 274597 300455 409011 482835 463574 463116
18868 463116 443520 473448 517356 522326 427425 421360 429058 463971 514158 527279 477676 482480
18856 482480 600528 700993 741665 796237 983790 1122632 1288005 1279064 1243826 1232104 1217963
18845 1217963 1125825 935393 909543 1017434 1145876 1156126 1168889 1164235 1167207 1084691 954825
18834 954825 864624 814051 795756 773371 675285 571000 530537 569411 553940 448209 301700
18823 301700 279636 315240 382643 467710 590422 746230 759166 651214 649267 703749 707099
18812 707099 724803 781609 766686 834370 873837 900258 850563 730846 526693 463270 512409
$$ packed form
18890G02044j24458l4869N6722R0500Q1962R7597R3778O8515q7667q7873j22101
18879G34150j00145j67312n4691j6741q7400l3264K5858J08556P3824j9261m58
18868D63116j9596K9928M3908M970r4901o065P698L4913N0187J3121m9603M804
18856D82480J18048J00465M0672N4572J87553J38842J65373q941l5238j1722j4141
18845A217963r2138j90432k5850J07891J28442J0250J2763m654K972q2516j29866
18834I54825r0201n0573j8295k2385r8086j04285m0463L8874j5471j05731j46509
18823C01700k2064L5604O7403Q5067J22712J55808J2936j07952j947N4482L350
18812G07099J7704N6806j4923O7684L9467K6421m9695j19717k04153o3423M9139
$$ plain form
18801 512409 487575 473152 463505 399379 435747 457314 395334 318877 249550 242364 324771 335104
18789 335104 364339 395227 381659 304248 283195 314769 322994 313961 304115 316314 296572 217004
18777 217004 275880 368225 346923 354288 384359 408251 405549 356834 411438 576768 619165 664199
18765 664199 808769 1063120 1306356 1370823 1311319 1237961 1121941 1056714 1089785 1067427 1025733
18754 1025733 1051664 973202 862669 834509 808342 905627 932723 902057 952207 906481 873215
18743 873215 886571 841200 844327 798755 726253 699177 676853 750588 732571 763639 854716 896136
18731 896136 880197 878987 839478 859342 819074 735435 780444 891316 950848 986392 973004
18720 973004 992569 1019762 1054624 1071292 1090371 1045143 1060958 1144559 1281294 1425815 1553225
$$ packed form
18801E12409k4834j4423r647o4126L6368K1567o1980p6457o9327p186Q2407J0333
18789C35104K9235L0888j3568p7411k1053L1574Q225r033r846J2199j9742p9568
18777B17004N8876R2345k1302P365L0071K3892k702m8715N4604J65330M2397M5034
18765F64199J44570K54351K43236O4467n9504p3358j16020o5227L3071k2358m1694
18754A025733K5931p8462j10533k8160k6167R7285K7096l0666N0150m5726l3266
18743H73215J3356m5371L127m5572p2502k7076k2324P3735j8017L1068R1077M1420
18731H96136j5939j210l9509J9864m0268q3639M5009J10872N9532L5544j3388
18720I73004J9565K7193L4862J6668J9079m5228J5815Q3601J36735J44521J27410
$$ plain form
18709 1553225 1628532 1716389 1783348 1843026 1826639 1791907 1671111 1623407 1616995 1605664 1592502
18698 1592502 1488542 1509783 1509734 1446052 1432518 1440590 1396183 1251440 1220928 1335244 1379866
18687 1379866 1419742 1497195 1593158 1621669 1632099 1691357 1762778 1744636 1715094 1799222 1990437
18676 1990437 2088322 2150852 2319100 2464796 2570765 2603163 2654603 2648507 2644959 2562601 2530356
18665 2530356 2575137 2737442 2966524 3296960 3543826 3788049 3978910 4266730 4602277 4862270
18655 4862270 5243783 5787035 6503040 7720576 9457901 11589388 13800546 15605253 16629156
18646 16629156 16810146 16491782 16264923 16920968 19078170 23453606 31340050 43524624
18638 43524624 59880771 78362427 95496388 108173051 114195610 112405556 104372019
$$ packed form
18709A553225P5307Q7857O6959N9678j6387l4732j20796m7704o412j1331j3162
18698A592502j03960K1241m9o3682j3534Q072m4407j44743l0512J14316M4622
18687A379866L9876P7453R5963K8511J0430N9258P1421j8142k9542Q4128J91215
18676A990437R7885O2530J68248J45696J05969L2398N1440o096l548q2358l2245
18665B530356M4781J62305K29082L30436K46866K44223J90861K87820L35547K59993
18655D862270L81513N43252P16005J217536J737325K131487K211158J804707J023903
18646A6629156J80990l18364k26859O56045K157202M375436P886444J2184574
18638D3524624J6356147J8481656J7133961J2676663O022559j790054q033537
$$ plain form
18631 104372019 93534637 81759404 70009829 59662142 52565714 49495123 49939499
18624 49939499 52150828 54142743 54410446 52021321 47043076 40795545 34879789 30098631
18616 30098631 26675181 24078086 22188200 20915440 20159257 19680159 19323292 19119540 18983534
18607 18983534 18904882 18802907 18669181 18735738 19062558 19893534 21527355 24238019 28576289
18598 28576289 34772330 42328929 49823605 55618401 58534211 58124436 55143164 51802362
18590 51802362 50611492 53634371 62344039 77264020 98101223 123278597 149810525
18583 149810525 172996188 187116080 188639498 177849790 156386646 129074800 102773734
18576 102773734 81808281 67513010 58920660 54517783 52939658 52722186 52615827 51788937
$$ packed form
18631A04372019j0837382j1775233j1749575j0347687p096428l070591M44376
18624D9939499K211329J991915K67703k389125m978245o247531n915756m781158
18616C0098631l423450k597095j889886j272760p56183m79098l56867k03752j36006
18607A8983534p8652j01975j33726O6557L26820Q30976J633821K710664M338270
18598B8576289O196041P556599P494676N794796K915810m09775k981272l340802
18590E1802362j190870L022879Q709668J4919981K0837203K5177374K6531928
18583A49810525K3185663J4119892J523418j0789708k1463144k7311846k6301066
18576A02773734k0965453j4295271q592350m402877j578125k17472j06359q26890
$$ plain form
18568 51788937 49491719 45691978 41094098 36593244 32792397 29957435 27853085 26312615
18560 26312615 25072658 23967449 23076268 22239198 21576827 20970720 20300703 19502858 18741991
18551 18741991 18069164 17451291 16832011 16260159 15734929 15292924 14879628 14439292 13980209
18542 13980209 13600335 13265007 12956490 12642056 12287573 11920710 11656830 11453725 11125196
18533 11125196 10816051 10515870 10319736 10172294 9941774 9683024 9544673 9452551 9372003 9315386
18523 9315386 9197993 9014401 8928168 8841875 8682206 8624106 8532423 8387038 8114661 7925615
18513 7925615 7806100 7720862 7710248 7787314 7732359 7700761 7632967 7504427 7334137 7077887
18503 7077887 6937280 6875597 6762609 6693116 6636321 6529370 6531068 6508518 6377062 6245874
$$ packed form
18568E1788937k297218l799741m597880m500854l800847k834962k104350j540470
18560B6312615j239957j105209q91181q37070o62371o06107o70017p97845p60867
18551A8741991o72827o17873o19280n71852n25230m42005m13296m40336m59083
18542A3980209l79874l35328l08517l14434l54483l66863k63880k03105l28529
18533A1125196l09145l00181j96134j47442k30520k58750j38351r2122q0548n6617
18523I315386j17393j83592q6233q6293j59669n8100r1683j45385k72377j89046
18513G925615j19515q5238j0614P7066n4955l1598o7794j28540j70290k56250
18503G077887j40607o1683j12988o9493n6795j06951J698k2550j31456j31188
$$ plain form
18493 6245874 6197156 6170213 6107393 6035085 5943191 5859870 5818487 5762067 5711309 5728875 5785591
18482 5785591 5788477 5929038 6090903 6027991 5948638 5913988 5904959 5938817 6028170 6138801 6287930
18471 6287930 6390122 6560557 6646610 6705401 6804810 7032100 7394847 7812153 8351157 9009620
18461 9009620 9822595 10845318 12283109 14545641 18657372 25949702 36420769 46774374
18453 46774374 53641983 56833537 54316682 45576826 37093652 32830699 32612141 36363954
18445 36363954 44553213 55733995 65604572 72234643 75919902 75706678 74766607 78862261
18437 78862261 84471598 87601245 87202747 78964695 64109057 52524563 47295529 47424060
18429 47424060 53034114 64744599 79162282 89413879 93638293 91190179 78432433
$$ packed form
18493F245874m8718k6943o2820p2308r1894q3321m1383n6420n0758J7566N6716
18482E785591K886J40561J61865o2912p9353l4650r029L3858Q9353J10631J49129
18471F287930J02192J70435Q6053N8791R9409K27290L62747M17306N39004O58463
18461I009620Q12975J022723J437791K262532M111731P292330J0471067J0353605
18453D6774374O867609L191554k516855q739856q483174m262953k18558L751813
18445C6363954Q189259J1180782R870577O630071L685259k13224r40071M095654
18437G8862261N609337L129647l98498q238052j4855638j1584494n229034J28531
18429D7424060N610054J1710485J4417683J0251597M224414k448114j2757746
$$ plain form
18422 78432433 60707953 47679930 40060706 35514715 32685702 30857908 29598941 28890855
18414 28890855 28721026 29209554 30408495 32333321 34902661 37969292 40642996 42456745
18406 42456745 43512211 43904069 44115874 45528567 49377687 57323807 70401003 88660317
18398 88660317 111965200 137562899 159547581 174981139 182475484 177801820 163482370
18391 163482370 145757158 125315274 105378728 90153629 79627046 73582325 71534653
18384 71534653 72250569 73607012 73833534 72378625 68659304 62665413 56111563 49888449
18376 49888449 44298983 39939282 36732130 34524348 32856742 31652695 30724364 29956924
18368 29956924 29384107 28990712 28614556 28425109 28453211 28800842 29483280 30965055 33662435
$$ packed form
18422G8432433j7724480j3028023p619224m545991k829013j827794j258967p08086
18414B8890855j69829M88528J198941J924826K569340L066631K673704J813749
18406D2456745J055466L91858K11805J412693L849120P946120J3077196J8259314
18398H8660317K3304883K5597699K1984682J5433558P494345m673664j4319450
18391A63482370j7725212k0441884j9936546j5225099j0526583o044721k047672
18384G1534653P15916J356443K26522j454909l719321n993891o553850o223114
18376D9888449n589466m359701l207152k207782j667606j204047r28331p67440
18368B9956924n72817l93395l76156j89447K8102L47631O82438J481775K697380
$$ plain form
18359 33662435 38212721 45002135 52915635 60213842 65843679 68477724 67279021 64192469
18351 64192469 61541912 60837826 62684572 67473358 76152950 87481751 99612104 111931621
18343 111931621 122631104 128094630 127993669 123151004 112636618 97980485 83827172
18336 83827172 71329501 61712320 55974628 53264424 52850581 54174396 57326378 62900859
18328 62900859 72778917 89892833 115261008 140829747 156887807 164725546 160555138
18321 160555138 140507701 123502638 123927067 139197118 156716526 166701820 169500550
18314 169500550 159902323 136548330 118042871 114829206 127699995 155567293 190236393
18307 190236393 221532086 240035567 236655597 210397617 171672986 131244130 102842187
$$ packed form
18359C3662435M550286O789414P913500P298207N629837K634045j198703l086552
18351F4192469k650557p04086J846746M788786Q679592J1328801J2130353J2319517
18343A11931621J0699483N463526j00961m842665j0514386j4656133j4153313
18336H3827172j2497671r617181n737692k710204m13843J323815L151982N574481
18328F2900859R878058J7113916K5368175K5568739J6058060P837739m170408
18321A60555138k0047437j7005063M24429J5270051J7519408R985294K798730
18314A69500550r598227k3353993j8505459l213665J2870789K7867298L4669100
18307A90236393L1295693J8503481l379970k6257980l8724631m0428856k8401943
$$ plain form
18300 102842187 85788660 75086132 67642012 62098932 57718443 54116734 51002712 48424097
18292 48424097 46427670 44807661 43464038 42479950 41979433 42251353 43657218 44918900
18284 44918900 45222282 44615300 42533971 38804040 35402203 33039024 31493719 30593741
18276 30593741 30366888 30626343 30571938 30204662 29600951 28297141 26622050 25294143 24287107
18267 24287107 23467338 22778582 22026587 21319914 20829352 20306732 19754699 19230369 18709148
18258 18709148 18236055 17931955 17707125 17654279 17442663 17131417 16806617 16278332 15683031
18249 15683031 15091682 14677832 14436741 14307638 14233055 14155187 13969208 13656713 13293712 12944245
18239 12944245 12752305 12651902 12625702 12615750 12701949 12686233 12416056 11929879 11612261 11366112
$$ packed form
18300A02842187j7053527j0702528p444120n543080m380489l601709l114022k578615
18292D8424097j996427j620009j343623r84088n00517K71920J405865J261682
18284D4918900L03382o06982k081329l729931l401837k363179j545305q99978
18276C0593741k26853K59455n4405l67276o03711j303810j675091j327907j007036
18267B4287107q19769o88756p51995p06673m90562n22620n52033n24330n21221
18258A8709148m73093l04100k24830n2846k11616l11246l24800n28285n95301
18249A5683031n91349m13850k41091j29103p4583p7868j85979l12495l63001l49467
18239A2944245j91940j00403k6200r952Q6199j5716k70177m86177l17618k46149
$$ plain form
18229 11366112 11058264 10744066 10425870 10208099 9984124 9713106 9577378 9433072 9277971
18220 9277971 9180576 9046484 8905018 8805670 8770321 8802697 8714205 8625917 8478789 8181989
18210 8181989 7914816 7686482 7512119 7369700 7222999 7098992 6970150 6965499 6973593 6886810
18200 6886810 6851038 6881453 6913948 6832368 6707961 6473700 6275925 6165394 6096100 6066704
18190 6066704 6198738 6212424 6182916 6075291 5880808 5720301 5678056 5699065 5790035 5985418
18180 5985418 6049978 5936854 5739399 5552988 5414601 5205807 4960619 4796790 4680167 4712336
18170 4712336 4748883 4648901 4542853 4525358 4424008 4283116 4195112 4180280 4077046 3992832
18160 3992832 4018981 3979507 3929948 3930095 4009897 3949643 3841829 3753556 3807278 3831040 3753317
$$ packed form
18229A1366112l07848l14198l18196k17771k23975k71018j35728j44306j55101
18220I277971r7395j34092j41466r9348l5349L2376q8492q8288j47128k96800
18210H181989k67173k28334j74363j42419j46701j24007j28842m651Q094q6783
18200F886810l5772L0415L2495q1580j24407k34261j97775j10531o9294k9396
18190F066704J32034J3686k9508j07625j94483j60507m2245K1009R0970J95383
18180E985418O4560j13124j97455j86411j38387k08794k45188j63829j16623L2169
18170D712336L6547r9982j06048j7495j01350j40892q8004j4832j03234q4214
18160C992832K6149l9474m9559J47P9802o0254j07814q8273N3722K3762p7723
$$ plain form
18149 3753317 3715755 3652465 3504674 3457562 3443265 3293651 3148394 3083678 3037479 3039870 3081719
18138 3081719 3155719 3212534 3280097 3307597 3301755 3305733 3307481 3306165 3246576 3262774 3298736 3331993
18126 3331993 3325682 3478731 3656326 3740783 3827976 3932623 4123626 4359036 4601611 4967795
18116 4967795 5404652 6003826 6725142 7702495 9331553 12003274 16726734 25514015 41693645
18107 41693645 64998449 84344418 94251469 97662359 87080668 61614344 41483343
18100 41483343 30204546 23768710 19751665 16985354 15003909 13410906 12221477 11286640
18092 11286640 10569240 9991534 9482537 9089630 8635375 8170564 7750561 7439024 7221065
18083 7221065 6972348 6794419 6560062 6347012 6194926 6019518 5932230 5857844 5730666 5625263
$$ packed form
18149C753317l7562o3290j47791m7112j4297j49614j45257o4716m6199K391M1849
18138C081719P4000N6815O7563K7500n842L978J748j316n9589J6198L5962L3257
18126C331993o311J53049J77595Q4457Q7193J04647J91003K35410K42575L66184
18116D967795M36857N99174P21316R77353J629058K671721M723460Q787281J6179630
18107D1693645K3304804J9345969R907051L410890j0581691k5466324k0131001
18100D1483343j1278797o435836m017045k766311j981445j593003j189429r34837
18092A1286640p17400n77706n08997l92907m54255m64811m20003l11537k17959
18083G221065k48717j77929k34357k13050j52086j75408q7288p4386j27178j05403
$$ plain form
18073 5625263 5513775 5302793 5141123 4974103 4838616 4702411 4544416 4535063 4624191 4571297
18063 4571297 4381051 4302629 4181822 4118158 3938566 3779232 3608362 3521620 3433349 3291445
18053 3291445 3152459 3105624 3008601 2958552 2905177 2952269 2846787 2758795 2566028 2437467
18043 2437467 2385288 2422605 2396889 2346340 2194275 2080758 2114983 2219825 2169320 2007390
18033 2007390 1958873 1944553 1971207 1893100 1820176 1778634 1780149 1743002 1729070 1733409 1737091 1614810
18021 1614810 1525637 1540343 1501941 1533118 1613249 1500259 1447533 1395176 1458503 1514500 1542280
18010 1542280 1401458 1362560 1351120 1295317 1299628 1275814 1206178 1211245 1217765 1144967 1052277 992013
17998 992013 1037346 1112691 1139003 1145273 1134552 1053556 992436 969735 903815 948081 902939 800057
$$ packed form
18073E625263j11488k10982j61670j67020j35487j36205j57995r353Q9128n2894
18063D571297j90246p8422j20807o3664j79592j59334j70870q6742q8271j41904
18053C291445j38986m6835r7023n0049n3375M7092j05482q7992j92767j28561
18043B437467n2179L7317k5716n0549j52065j13517L4225J04842n0505j61930
18033B007390m8517j4320K6654p8107p2924m1542J515l7147j3932M339L682j22281
18021A614810q9173J4706l8402L1177Q0131j12990n2726n2357O3327N5997K7780
18010A542280j40822l8898j1440n5803M311k3814o9636N067O520p2798r2690o0264
17998I92013M5333P5345K6312O270j0721q0996o1120k2701o5920M4266m5142j02882
$$ plain form
17986 800057 907419 975556 1062546 1071976 1040375 1037989 1207183 1350117 1303624 1223018 1203057
17975 1203057 1107225 926022 968203 960805 871283 806946 787144 858820 887938 912842 898448
17964 898448 850545 763009 723786 707784 705286 668098 642021 641657 653207 688674 696023 746191
17952 746191 693210 627788 521959 551708 521913 546020 609534 625734 561214 528130 540162
17941 540162 558757 524488 451298 439593 447442 477209 533815 573416 558313 459573 420006 378028
17929 378028 344795 386172 415830 442898 478423 499396 494083 432533 412451 468407 480819 429100
17917 429100 371204 295217 249044 308158 394229 480927 440750 497447 512879 460607 418064
17906 418064 472463 504186 577129 547234 472987 477642 461369 553175 686296 736242 678480
$$ packed form
17986H00057J07362O8137Q6990R430l1601k386J69194J42934m6493q0606j9961
17975A203057r5832j81203M2181p398q9522o4337j9802P1676K9118K4904j4394
17964H98448m7903q7536l9223j6002k498l7188k6077l64J1550L5467P349N0168
17952G46191n2981o5422j05829K9749k9795K4107O3514J6200o4520l3084J2032
17941E40162J8595l4269p3190j1705P849K9767N6606L9601j5103r8740l9567m1978
17929C78028l3233M1377K9658K7068L5525K0973n313o1550k0082N5956J2412n1719
17917D29100n7896p5987m6173N9114Q6071Q6698m0177N6697J5432n2272m2543
17906D18064N4399L1723P2943k9895p4247M655j6273R1806J33121M9946n7762
$$ plain form
17895 678480 582758 534439 588630 661531 738050 732977 748664 830657 857779 817250 771618 759684
17883 759684 629324 601028 611807 596193 529958 488181 398305 366803 410558 451695 454681
17872 454681 475577 451643 375587 431297 543445 608481 517301 378828 347055 439636 582540
17861 582540 749846 804133 764778 777034 831225 898643 864354 843003 818396 966619 1063942
17850 1063942 1050713 1080283 1011247 857271 931369 960280 979230 1018886 1091172 1096300 1055657
17839 1055657 1038884 906421 807133 796985 712346 647171 719494 849064 901284 884770 790426
17828 790426 762736 660650 498317 497494 538876 601443 624841 526399 417390 357012 312675
17817 312675 248362 305292 299898 377330 560064 603424 526447 437236 368008 397731 420748
$$ packed form
17895F78480r5722m8319N4191P2901P6519n073J5687Q1993K7122m0529m5632j1934
17883G59684j30360k8296J0779j5614o6235m1777q9876l1502M3755M1137K986
17872D54681K0896k3934p6056N5710J12148O5036r1180j38473l1773R2581J42904
17861E82540J67306N4287l9355J2256N4191O7418l4289k1351k4607J48223R7323
17850A063942j3229K9570o9036j53976P4098K8911J8950L9656P2286N128m0643
17839A055657j6773j32463r9288j0148q4639o5175P2323J29570N2220j6514r4344
17828G90426k7690j02086j62333q23M1382O2567K3398r8442j09009o0378m4337
17817C12675o4313N6930n394P7432J82734M3360p6977q9211o9228K9723K3017
$$ plain form
17806 420748 504099 511141 435629 332805 265697 306601 279577 256316 372810 511603 515035
17795 515035 518300 501709 525260 529594 434735 499562 440359 376456 508844 528291 568089 544831
17783 544831 508378 427320 325543 205680 213799 267963 256505 338128 238669 206433 180377
17772 180377 203512 208651 212830 242698 225411 162128 185844 300570 428279 487883 479067 429970
17760 429970 376160 422581 475782 558959 647435 746592 851157 811858 682140 539871 357041
17749 357041 237920 214850 208252 206284 148604 -48142 -41130 84390 170089 174426 267611 379000
17737 379000 446651 475594 527612 526890 414856 342002 263546 305359 319153 238300 227487 259174
17725 259174 309998 349531 333410 296387 258646 85128 102012 114732 88088 150437 208632
$$ packed form
17806D20748Q3351P042p5512j02824o7108M0904k7024k3261J16494J38793L432
17795E15035L265j6591K3551M334r4859O4827n9203o3903J32388J9447L9798k3258
17783E44831l6453q1058j01777j19863Q119N4164j1458Q1623r9459l2236k6056
17772A80377K3135N139M179K9868j7287o3283K3716J14726J27709N9604q816m9097
17760D29970n3810M6421N3201Q3177Q8476R9157J04565l9299j29718j42269j82830
17749C57041j19121k3070o598j968n7680j96746P012J25520Q5699M337R3185J11389
17737C79000O7651K8943N2018p22j12034p2854p8456M1813J3794q0853j0813L1687
17725B59174N0824L9533j6121l7023l7741j73518J6884J2720k6644O2349N8195
$$ plain form
17714 208632 263786 193062 241912 205867 183925 184180 183644 77284 176499 327648 384745 397483
17702 397483 361984 333903 238156 149174 78701 54948 26269 72370 74884 36863 117264 151053
17690 151053 87926 58372 88496 48950 -17503 -34660 23498 79622 167195 169444 141883 177817
17678 177817 226503 152816 107123 7065 28060 75105 23009 9992 78229 111487 79573
17667 79573 22957 29907 88493 104793 148623 153264 110040 84255 149869 247390 208505 196589
17655 196589 179697 42562 12875 48099 8043 -13953 40389 82558 33981 36681 35546 9837
17643 9837 -58 -38262 37784 135961 188909 191083 124263 87646 87735 147619 65046 128838 162629
17630 162629 101670 63285 63623 93132 102247 145684 90433 36275 25647 -2245 -28698 -108969
$$ packed form
17714B08632N5154p0724M8850l6045k1942K55n36j06360R9215J51149N7097J2738
17702C97483l5499k8081r5747q8982p0473k3753k8679M6101K514l8021Q0401L3789
17690A51053o3127k9554L0124l9546o6453j7157N8158N6124Q7573K249k7561L5934
17678A77817M8686p3687m5693j00058K0995M7045n2096j3017O8237L3258l1914
17667G9573n6616O950N8586J6300M3830M641m3224k5785O5614R7521l8885j1916
17655A96589j6892j37135k9687L5224m0056k1996N4342M2169m8577K700j135k5709
17643I837r895l8204P6046R8177N2948K174o6820l6617Q9N9884q2573O3792L3791
17630A62629o0959l8385L38K9509R115M3437n5251n4158j0628k7892k6453q0271
$$ plain form
17618 -108969 -50789 -33470 10379 54499 -31020 -163553 -155536 -109378 -47803 -35024 -89170
17607 -89170 -146254 -63085 18133 -40022 -104712 -68659 34999 30738 -30772 16239 21376 -29647
17595 -29647 -34400 -87637 -71467 -27868 -28535 -78746 -12898 47558 19527 -81447 -93401 6717
17583 6717 81216 79677 46130 57830 70028 162923 205979 89548 89189 79803 60259 102395
17571 102395 73740 -17852 -70607 -99110 -71714 -45645 -118645 -34041 65201 42398 61370
17560 61370 23338 39800 -17436 -34125 -14737 -20728 8009 13758 28159 52661 24041 -10879
17548 -10879 -48024 -25605 -26439 4653 37244 53053 116615 161355 165955 -1374 -61460 40259
17536 40259 58859 106688 56382 25854 -4365 -11654 -43733 -52251 8627 83767 79141 24360
$$ packed form
17618a08969N8180J7319M3849M4120q5519j32533Q017M6158O1575J2779n4146
17607h9170n7084Q3169Q1218n8155o4690L6053J03658m261o1510M7011N137n1023
17595b9647m753n3237J6170M3599o67n0211O5848O0456k8031j00974j1954J00118
17583F717P4499j539l3547J1700J2198R2895M3056j16431l59r386j9544M2136
17571A02395k8655r1592n2755k8503K7396K6069p3000Q4604R9242k2803J8972
17560F1370l8032J6462n7236j6689J9388n991K8737N749J4401K4502k8620l4920
17548a0879l7145K2419q34L1092L2591J5809O3562M4740M600j67329o0086J01719
17536D0259J8600M7829n0306l0528l0219p289l2079q518O0878P5140m626n4781
$$ plain form
17524 24360 26083 25234 10310 -20894 -22497 -53391 6381 79370 53390 28544 34339 62261 -52815
17511 -52815 -70814 -50059 -60605 -37927 -21454 35300 89816 137074 107247 9412 -79738 -116172
17499 -116172 -115394 -63244 -36332 -72132 -94965 -25076 9243 -5934 -79310 -100762 -18785 46299
17487 46299 8943 34134 53903 108937 112976 50678 19763 55663 70367 36342 -18982 -444
17475 -444 95551 56039 -38462 -85927 -113817 -95869 -22257 -48226 -90667 -20226 27762 72251
17463 72251 5860 17906 -25462 -23541 16761 26893 46710 31878 24476 105299 100887 108167
17451 108167 90332 2763 55342 110886 80019 59349 111574 258347 282193 300083 354616
17440 354616 375179 461549 541760 525598 411211 277172 145964 59632 21102 429 87227
$$ packed form
17524B4360J723q49j4924l1204j603l0894N9772P2989k5980k4846N795K7922j15076
17511e2815j7999K0755j0546K2678J6473N6754N4516M7258k9827r7835q9150l6434
17499a16172P78N2150K6912l5800k2833O9889L4319j5177p3376k1452Q1977O5084
17487D6299l7356K5191J9769N5034M039o2298l0915L5900J4704l4025n5324J8538
17475d44R5995l9512r4501m7465k7890J7948P3612k5969m2441P0441M7988M4489
17463G2251o6391J2046m3368J921M0302J0132J9817j4832p402Q0823m412P280
17451A08167j7835q7569N2579N5544l0867k0670N2225J46773K3846J7890N4533
17440C54616K0563Q6370Q0211j6162j14387j34039j31208q6332l8530k0673Q6798
$$ plain form
17429 87227 158052 169087 130146 121500 98845 76264 54854 17037 46229 113645 61627 -20410
17417 -20410 7229 110155 165324 137142 43507 77623 135720 124446 92043 41940 12402
17406 12402 -20309 -34975 -12357 -22925 -67428 -57073 5729 -25260 -13243 5469 22 77852
17394 77852 54257 -7874 -62532 -113906 -106493 -81708 -27011 42621 73239 -17111 -13069 56016
17382 56016 96676 40141 60696 40945 -11196 6719 111727 47500 138885 184077 155049
17371 155049 180759 99440 -26575 -65531 -105955 -89456 -43792 -34520 21131 2357 -21942
17360 -21942 -19174 20458 66055 77591 49650 90801 130423 119423 51790 76503 8845 -13202
17348 -13202 46785 63360 58458 59947 46035 32516 57128 83331 39442 76986 62053 58435
$$ packed form
17429H7227P0825J1035l8941q646k2655k2581k1410l7817K9192O7416n2018q2037
17417b0410K7639J02926N5169k8182r3635L4116N8097j1274l2403n0103k9538
17406A2402l2711j4666K2618j0568m4503J0355O2802l0989J2017J8712n447P7830
17394G7852k3595o2131n4658n1374P413K4785N4697O9632L0618r0350M042O9085
17382E6016M0660n6535K0555j9751n2141J7915J05008o4227R1385M5192k9028
17371A55049K5710q1319j26015l8956m0424J6499M5664R272N5651j8774k4299
17360b1942K768L9632M5597J1536k7941M1151L9622j1000o7633K4713o7658k2047
17348a3202N9987J6575m902J489j3912j3519K4612K6203m3889L7544j4933l618
$$ plain form
17336 58435 119220 100426 33885 50661 60936 44924 -65862 -56500 25009 100974 75488 43739
17324 43739 6909 32995 98070 103036 93205 107056 58222 14910 -11882 29593 43426 55728
17312 55728 -15948 -34779 -32197 -41226 8355 -58312 -104679 -77033 -108599 -135948 -99002 -13903
17300 -13903 -30915 -19967 29978 91688 79531 -4246 -67749 -56697 -773 -28939 -12688 -23323
17288 -23323 -72819 -105414 -44015 104476 92904 112787 113648 51761 27134 3430 -34105 -2780
17276 -2780 47623 -23473 -5995 63757 113629 39365 -48885 -76512 -157166 -140400 -93607 -34295
17264 -34295 -1436 79831 -5561 -89931 -98349 -38063 -24302 -62717 -34692 -3666 -18262 -59346
17252 -59346 -108165 -102196 -117326 -138677 -81119 -15638 27111 34063 110393 146931 181107 106276
$$ packed form
17336E8435O0785j8794o6541J6776J0275j6012j10786R362Q1509P5965k5486l1749
17324D3739l6830K6086O5075M966r831J3851m8834m3312k6792M1475J3833J2302
17312E5728p1676j8831K582r029M9581o6667m6367K7646l1566k7349L6946Q5099
17300a3903j7012J0948M9945O1710j2157q3777o3503J1052N5924k8166J6251j0635
17288b3323m9496l2595O1399J48491j1572J9883Q61o1887k4627k3704l7535L1325
17276b780N0403p1096J7478O9752M9872p4264q8250k7627q0654J6766M6793N9312
17264c4295L2859Q1267q5392q4370q418O0286J3761l8415K8025L1026j4596m1084
17252e9346m8819N969j5130k1351N7558O5481M2749O952P6330L6538L4176p4831
$$ plain form
17240 106276 69062 156538 200453 210447 136378 126595 134491 101882 -35355 30852 91494 41849
17228 41849 -953 -11563 -122709 -106055 -3392 39499 5458 -17885 -66586 -38723 -109754
17217 -109754 -186086 -163028 -138771 -82479 -39383 -6746 804 -22504 17454 109951 112761 28849
17205 28849 3526 -45136 -30095 -11494 -48853 -59175 -59453 -16973 -104647 -162237 -75204 67475
17193 67475 110452 151434 132070 42809 22864 39535 -9835 2604 3827 -38357 -77151 -119606
17181 -119606 -151513 -200189 -152745 -103551 -38938 -79993 -116908 -51516 -12967 90 2222 -90898
17169 -90898 -143803 -96682 -52817 -75194 -100115 -30756 -41981 -18938 -30025 -63592 -40918 -42449
17157 -42449 5518 22010 -47288 -31434 42510 63433 -6522 -61542 -18685 46815 48896 51431
$$ packed form
17240A06276l7214Q7476M3915R994p4069r783P896l2609j37237O6207O0642m9645
17228D1849m2802j0610j11146J6654J02663M2891l4041k3343m8701K7863p1031
17217a09754p6332K3058K4257N6292M3096L2637P550k3308L9958R2497K810q3912
17205B8849k5323m8662J5041J8601l7359j0322k78M2480q7674n7590Q7033J42679
17193F7475M2977M0982j9364q9261j9945J6671m9370J2439J223m2184l8794m2455
17181a19606l1907m8676M7444M9194O4613m1055l6915O5392L8549J3057K132r3120
17169i0898n2905M7121M3865k2377k4921O9359j1225K3043j1087l3567K2674j531
17157d2449M7967J6492o9298J5854P3944K0923o9955n5020M2857O5500K081K535
$$ plain form
17145 51431 107131 28137 -52961 -65327 -39942 -2587 -25073 -87408 -140517 -60994 -99512 -146712
17133 -146712 -108581 -49964 -6713 -35409 -146278 -163954 -159343 -174444 -105393 -105345 -65358 -86180
17121 -86180 -110552 -84970 -57902 -19735 -12597 -11496 -19638 -990 -13779 -50008 -9625 -52549
17109 -52549 -59162 -51754 -86134 -83528 -50649 -51220 -1486 -29389 -46595 -83605 -141721 -142569 -96435
17096 -96435 25621 63708 -41788 -68715 -101480 -36575 44890 81992 90569 157455 97373
17085 97373 -15592 -4315 -38905 -86673 -56218 -38548 -43679 -34326 9367 54252 35933 101061
17073 101061 139836 198495 64515 -41357 -122504 -71417 -3047 -15903 -60236 -31388 15279
17062 15279 38393 2913 4069 -1700 14200 -11363 54150 94252 63531 67733 87251 47248
$$ packed form
17145E1431N5700p8994q1098j2366K5385L7355k2486o2335n3109P9523l8518m7200
17133a46712L8131N8617M3251k8696j10869j7676M611j5101O9051M8L9987k0822
17121h6180k4372K5582K7068L8167P138J101q142J8648j2789l6229M0383m2924
17109e2549o613P408l4380K606L2879n71M9734k7903j7206l7010n8116q48M6134
17096i6435J22056L8087j05496k6927l2765O4905Q1465L7102Q577O6886o0082
17085I7373j12965J1277l4590m7768L0455J7670n131R353M3693M4885j8319O5128
17073A01061L8775N8659j33980j05872q1147N1087O8370j2856m4333K8848M6667
17062A5279K3114l5480J156n769J5900k5563O5513M0102l0721M202J9518m0003
$$ plain form
17050 47248 -51351 -111832 -51565 13806 26317 30764 27062 -5881 8718 -18861 27326 53300
17038 53300 92535 103864 50758 8781 -5836 25594 29620 -15432 6939 2299 38481 -52388
17026 -52388 -179188 -134166 -142478 -164847 -220738 -201912 -69432 14393 108697 55878 -39576
17015 -39576 31956 21766 53735 73713 85915 30742 -37244 -55366 -84238 -106392 -47200 -71451
17003 -71451 9868 42696 26626 30473 5923 74843 148745 99908 111817 77167 45732 38991
16991 38991 -6351 -11869 -20691 -35557 6709 -42178 -90954 -80254 -68615 19224 95364 133448
16979 133448 163229 189294 206501 97801 -10261 -85991 -54201 66695 73809 7107 -46681
16968 -46681 10683 133144 51810 54056 33911 -25641 -42567 -55269 -92787 -89137 -109844 -102310
$$ packed form
17050D7248r8599o0481O0267O5371J2511M447l702l2943J4599k7579M6187K5974
17038E3300L9235J1329n3106m1977j4617L1430M026m5052K2371m640L6182r0869
17026e2388j26800M5022q312k2369n5891J8826J32480Q3825R4304n2819r5454
17015c9576P1532j0190L1969J9978J2202n5173o7986j8122k8872k2154N9192k4251
17003g1451Q1319L2828j6070L847k4550O8920P3902m8837J1909l4650l1435o741
16991C8991m5342n518q822j4866M2266m8887m8776J0700J1639Q7839P6140L8084
16979A33448K9781K6065J7207j08700j08062p5730L1790J20896P114o6702n3788
16968d6681N7364J22461q1334K246k0145n9552j6926j2702l7518L650k0707P534
$$ plain form
16956 -102310 -122969 -91353 -14232 43389 47152 12822 -81041 -84301 -30462 -27112 -65542 -121204
16944 -121204 -73595 -3643 -9167 -2367 46616 47336 35060 -11035 107392 131198 -918 -121710
16932 -121710 -83022 13105 47581 44503 112293 166336 151664 150069 25195 -80829 -34592
16921 -34592 15852 71470 27254 11733 8475 -9934 623 25606 62346 125604 42655 5072
16909 5072 44682 -32293 -142093 -203562 -219672 -165885 -87529 -78889 -77346 -18446 79236 110360
16897 110360 -25411 -83968 -108466 -101010 -136484 -228206 -160047 -1766 26044 90959 125804
16886 125804 -24190 -109451 -116500 -74923 -76304 -31522 -30282 -41162 -37938 -31924 -40810 -7156
16874 -7156 97096 132569 117593 -15531 -138014 -70466 24375 28533 14641 44403 62535
$$ packed form
16956a02310k0659L1616P7121N7621L763l4330r3863l260N3839L350l8430n5662
16944a21204M7609O9952n524O800M8983P20j2276m6095J18427K3806j32116j20792
16932a21710L8688R6127L4476l078O7790N4043j4672j595j24874j06024M6237
16921c4592N0444N5618m4216j5521l258j8409J0557K4983L6740O3258q2949l7583
16909E072L9610p6975j09800o1469j6110N3787P8356Q640J543N8900R7682L1124
16897A10360j35771n8557k4498P456l5474r1722O8159J58281K7810O4915L4845
16886A25804j49994q5261p049M1577j381M4782J240j0880L224O014q886L3654
16874g156J04252L5473j4976j33124j22483O7548R4841M158j3892K9762J8132
$$ plain form
16863 62535 113445 92743 75043 110239 48643 -11375 -42654 -73109 -90611 -115528 -15160
16852 -15160 59073 27828 16429 19698 45742 37409 11057 -36662 -93212 -32653 25754 -6459
16840 -6459 -59281 -85179 -101765 -87554 -38629 -73965 -107152 -129618 -97199 -37538 -43448 28475
16828 28475 -35040 -88570 -79945 -51916 -4508 50512 -10307 -127784 -43364 48258 20159 330
16816 330 -60205 -66846 -9636 -74815 -163335 -159247 -128808 -153315 -102968 -48796 -89002 -133628
16804 -133628 -51749 25103 47146 -12454 -31619 23406 2020 -49054 -33390 9722 69128
16793 69128 26644 1807 26263 102187 81451 -36708 -82009 -28690 -57655 -86067 -69270
16782 -69270 -61846 41118 82151 49814 -2029 -82636 -60086 -34145 7891 -8541 56919 -27946
$$ packed form
16863F2535N0910k0702j7700L5196o1596o0018l1279l0455j7502k4917J00368
16852a5160P4233l1245j1399L269K6044q333k6352m7719n6550O0559N8407l2213
16840f459n2822k5898j6586J4211M8925l5336l3187k2466L2419N9661n910P1923
16828B8475o3515n3530Q625K8029M7408N5020o0819j17477Q4420R1622k8099j9829
16816C30o0535o641N7210o5179q8520M088L0439k4507N0347N4172m0206m4626
16804a33628Q1879P6852K2043n9600j9165N5025k1386n1074J5664M3112N9406
16793F9128m2484k4837K4456P5924k0736j18159m5301N3319k8965k8412J6797
16782f9270P424J02964M1033l2337n1843q0607K2550K5941M2036j6432O5460q4865
$$ plain form
16770 -27946 -97692 -130917 -107045 -41029 -29724 -56666 -77620 -136145 -85164 -68393 -84803 -93034
16758 -93034 -78774 21249 79837 14643 -79719 -109677 -117932 -68982 13003 60295 81720 24377
16746 24377 6159 35989 36111 -2986 -32908 -66432 -109728 -73315 -31240 -31459 -125946 -120007 -27130
16733 -27130 64468 -7376 -77664 -113393 -79469 -37261 -30199 -42483 -59772 -22506 38464 17507
16721 17507 -14237 6220 42305 -7891 -36288 -30330 -93685 -34263 22565 36716 8995 83827
16709 83827 90980 86614 107434 154898 94987 21199 12902 15248 -52241 -99203 -128594 -100063
16697 -100063 -60943 -171345 -190980 -134266 -89129 -129513 -125683 -114550 3207 102864 81034
16686 81034 39687 72861 30015 -23652 -1381 30795 -14756 -31893 -12726 -61454 -124 71171
$$ packed form
16770b7946o9746l3225K3872O6016J1305k6942k0954n8525N0981J6771j6410q231
16758i3034J4260J00023N8588o5194r4362k9958q255M8950Q1985M7292K1425n7343
16746B4377j8218K9830J22l9097k9922l3524m3296L6413M2075k19r4487N939R2877
16733b7130R1598p1844p0288l5729L3924M2208P062j2284j7289L7266O0970k0957
16721A7507l1744K0457L6085n0196k8397N958o3355N9422N6828J4151k7721P4832
16709H3827P153m366K0820M7464n9911p3788q297K346o7489m6962k9391K8531
16697a00063L9120j10402j9635N6714M5137m0384L830J1133J17757R9657k1830
16686H1034m1347L3174m2846n3667K2271L2176m5551j7137J9167m8728O1330P1295
$$ plain form
16674 71171 83242 75652 54302 46176 -52719 -48596 -34045 18573 4082 30064 42751 60099
16662 60099 103937 149520 95152 55304 18969 56556 91940 63439 13041 -164287 -220548
16651 -220548 -85710 7458 51972 19595 16878 -21271 -76060 -68777 -54902 -63074 -72548 -133994
16639 -133994 -199133 -163397 -49263 39501 54997 4615 -32013 -99473 -118398 -25504 1865
16628 1865 -56697 -75018 -87828 -171509 -163495 -96956 -38556 -27331 16997 38504 -2783 -27074
16616 -27074 -71944 -85984 -61753 -71936 -48103 -44240 -17073 20741 32362 12095 -95523 -201216
16604 -201216 -217649 -199174 -90493 -46152 -121404 -173927 -139762 -90641 -20061 -33860 -24488
16593 -24488 -39439 -118249 -109981 -77636 -47478 -67935 -84768 -95299 -21750 -34049 31038 77162
$$ packed form
16674G1171J2071p590k1350q126r8895M123J4551N2618j4491K5982J2687J7348
16662F0099M3838M5583n4368l9848l6335L7587L5384k8501n0398j77328n6261
16651b20548J34838R3168M4514l2377k717l8149n4789P283J3875q172r474o1446
16639a33994o5139L5736J14134Q8764J5496n0382l6628o7460j8925R2894K7369
16628A865n8562j8321j2810q3681Q014O6539N8400J1225M4328K1507m1287k4291
16616b7074m4870j4040K4231j0183K3833L863K7167L7814J1621k0267j07618j05693
16604b01216j6433J8475J08681M4341p5252n2523L4165M9121P0580j3799R372
16593b4488j4951p8810Q268L2345L0158k0457j6833j0531P3549j2299O5087M6124
$$ plain form
16581 77162 29868 -8344 -56320 -90879 -89581 -86032 -25480 -6696 -48554 -90328 -131038 -85075
16569 -85075 14097 19675 21263 54969 65962 -24353 -31850 -82490 -44240 23960 -6201 -42023
16557 -42023 -6319 -66958 -49356 -9125 43220 33822 -40869 -75052 -23714 24425 131293 139493
16545 139493 53163 3305 -19951 15023 71958 72254 79043 70880 35175 -14967 -53958 -53052 -119428
16532 -119428 -192815 -86953 52941 93166 109902 40550 -2197 -73270 -115348 -124367 -56943
16521 -56943 51074 80637 13902 2393 -22756 -7759 59195 -10434 -232 -10488 -88594
16510 -88594 -117442 -129811 -75314 44863 145582 117997 41763 -59689 -139873 -175764 -154019
16499 -154019 -115216 -136964 -140829 -115555 18801 35785 32785 -124892 -137381 -84853 -122611
$$ packed form
16581G7162m7294l8212m7976l4559J298L549O0552J8784m1858m1774m0710M5963
16569h5075R9172N578J588L3706J0993r0315p497n0640L8250O8200l0161l5822
16557d2023L5704o0639J7602M0231N2345r398p4691l4183N1338M8139J06868Q200
16545A39493q6330m9858k3256L4974N6935K96O789q163l5705n0142l8991R06o6376
16532a19428p3387J05862J39894M0225J6736o9352m2747p1073m2078r019O7424
16521e6943J08017K9563o6735j1509k5149J4997O6954o9629J0202j0256p8106
16510h8594k8848j2369N4497J20177J00719k7585p6234j01452q0184l5891K1745
16499a54019L8803k1748l865K5274J34356J6984l000j57677j2489N2528l7758
$$ plain form
16488 -122611 -55639 -69050 -36050 7588 56136 149415 110511 83672 45051 70251 36410
16477 36410 91967 97759 38012 -27397 -47833 -25913 36761 97291 124230 188462 130824 105393
16465 105393 167733 35899 -79416 -33839 49868 32115 -5958 -46484 -71897 -139657 -137978
16454 -137978 -52334 -34612 -139991 -219136 -138368 -63115 -78497 -11747 27698 -29687 -90895
16443 -90895 -72849 20537 82811 18671 -67345 -54594 -41873 -30944 -19407 23179 -55668 -194446
16431 -194446 -271978 -301312 -140801 -33413 -21563 4141 29763 113655 110154 15368 -38880
16420 -38880 -94698 -168720 -167985 -131634 -68384 -28157 -16566 -10667 1369 63154 26995 44330
16408 44330 154434 163782 145869 112173 31015 -59756 -17262 63967 37324 7140 12109 -30519
$$ packed form
16488a22611O6972j3411L3000M3638M8548R3279l8904k6839l8621K5200l3841
16477C6410N5557N792n9747o5409k0436K1920O2674O0530K6939O4232n7638k5431
16465A05393O2340j31834j15315M5577Q3707j7753l8073m0526k5413o7760J679
16454a37978Q5644J7722j05379p9145Q0768P5253j5382O6750L9445n7385o1208
16443i0895J8046R3386O2274o4140q6016J2751J2721J0929J1537M2586p8847j38778
16431a94446p7532k9334J60511J07388J1850K5704K5622Q3892l501r4786n4248
16420c8880n5818p4022P35L6351O3250M0227J1591N899J2036O1785l6159J7335
16408D4330J10104R348j7913l3696q1158r0771M2494Q1229k6643l0184M969m2628
$$ plain form
16396 -30519 -15671 32101 -57000 -112466 -42198 -60391 -78548 -62154 -159186 -166511 -110265 -96534
16384 -96534 -101526 -113442 -81847 -42519 -67905 -61398 -44862 -94957 -14848 -11723 -74184 -100013
16372 -100013 -95481 -83815 -66741 -741 11068 -41853 -166025 -178187 -116258 -106713 -92681 -67954
16360 -67954 -45958 -46330 11541 57664 29103 86894 36467 23697 71988 114784 119103 61651
16348 61651 12613 24275 -8282 -53154 -18576 4262 96115 76787 27963 -83469 -103441
16337 -103441 -102341 -115856 -161114 -171362 -134157 -181039 -200704 -151817 -90792 -62951 -36557 33258
16325 33258 -13222 -77328 -75058 16650 65878 123333 57475 -47434 -55125 -38895 -17294 13537
16313 13537 -67351 -116647 -136625 -144305 -112932 -214419 -129635 -105116 -132650 -85964 -113709 -38867
$$ packed form
16396c0519J4848M7772q9101n5466P0268j8193j8157J6394r7032p325N6246J3731
16384i6534m992j1916L1595L9328k5386O507J6536n0095Q0109L125o2461k5829
16372a00013M532J1666J7074O6000J1809n2921j24172j2162O1929R545J4032K4727
16360f7954K1996l72N7871M6123k8561N7791n0427j2770M8291M2796M319n7452
16348F1651m9038J1662l2557m4872L4578K2838R1853j9328m8824j11432j9972
16337a03441J100j3515m5258j0248L7205m6882j9665M8887O1025K7841K6394O9815
16325C3258m6480o4106K270R1708M9228N7455o5858j04909p691J6230K1601L0831
16313A3537q0888m9296j9978p680L1373j01487Q4784K4519k7534M6686k7745P4842
$$ plain form
16301 -38867 -23608 -50759 -84593 -35121 -48131 -84597 -18049 69749 1693 -33432 -21016 -38102
16289 -38102 -110722 10064 174336 187836 129289 -20155 -89368 -21941 -11717 -66988 -7871
16278 -7871 47269 43351 -64857 -107230 -141137 -56056 38685 71160 60397 53210 25183 28236
16266 28236 -33865 -100171 -105090 22648 157794 132992 93450 12298 -34500 -26363 16913 47926
16254 47926 20355 11623 -5926 -64447 -209217 -123666 -42288 -28274 -76930 -122647 -87191 -36440
16242 -36440 -7832 -19239 -31035 -19570 -26044 -17226 -79271 -90421 -96255 -145343 -133067 -85501
16230 -85501 -60810 -29303 -84368 -60822 79519 75994 42410 33730 -46866 16534 -23992 -68560
16218 -68560 -46515 -101432 -69068 2489 19944 125602 154594 76564 -43782 -85326 5290
$$ packed form
16301c8867J5259k7151l3834M9472j3010l6466O6548Q7798o8056l5125J2416j7086
16289c8102p2620J20786J64272J3500n8547j49444o9213O7427J0224n5271N9117
16278g871N5140l918j08208m2373l3907Q5081R4741L2475j0763p187k8027L053
16266B8236o2101o6306m919J27738J35146k4802l9542q1152m6798Q137M3276L1013
16254D7926k7571q732j7549n8521j44770Q5551Q1378J4014m8656m5717L5456N0751
16242c6440K8608j1407j1796J1465o474Q818o2045j1150n834m9088J2276M7566
16230h5501K4691L1507n5065K3546J40341l525l3584q680q0596O3400m0526m4568
16218f8560K2045n4917L2364P1557J7455J05658K8992p8030j20346m1544R0616
$$ plain form
16207 5290 -17363 -90343 -24442 -5191 -59309 -150664 -146810 -119179 -112915 -127263 16582 163303
16195 163303 193062 209996 177562 111606 126317 63221 -12795 95107 127202 185735 148072
16184 148072 -32856 -90365 37512 106582 75129 37568 28091 -20164 85054 111719 -25778
16173 -25778 -30965 -69780 -69120 -53583 -25269 9216 37973 16697 59395 105363 66961 -59545
16161 -59545 -72111 -16982 -6461 28783 -1407 -28991 36003 115195 79219 50473 52768 57944
16149 57944 69016 69798 16017 -91365 -150602 -97604 -1278 19241 72349 107481 40087 3852
16137 3852 -15456 -26313 -5675 -4465 22179 41264 43882 42650 -63209 -127398 -139754 -108869
16125 -108869 -3736 32781 51232 91245 13840 -33573 -47830 -66811 -81963 -66784 -1756
$$ packed form
16207E290k2653p2980O5901J9251n4118r1355L854K7631O264j4348J43845J46721
16195A63303K9759J6934l2434o5956J4711o3096p6016J07902L2095N8533l7663
16184A48072j80928n7509J27877O9070l1453l7561r477m8255J05218K6665j37497
16173b5778n187l8815O60J5537K8314L4485K8757k1276M2698M5968l8402j26506
16161e9545j2566N5129J0521L5244l0190k7584O4994P9192l5976k8746K295N176
16149E7944J1072P82n3781j07382n9237N2998R6326K0519N3108L5132o7394l6235
16137C852j9308j0857K0638J210K6644J9085K618j232j05859o4189j2356L0885
16125a08869J05133L6517J8451M0013p7405m7413j4257j8981j5152J5179O5028
$$ plain form
16114 -1756 15570 35322 90567 116357 78351 95927 132293 69439 35807 -2991 45193 32632
16102 32632 -27254 47449 108923 98361 45881 -22951 -68074 -18599 8954 18070 35197 6471
16090 6471 36617 26022 89862 42979 -11682 -80627 -76358 -132280 -67157 31902 118637 109379
16078 109379 50559 -65403 -88762 -57422 -24946 35941 78200 91955 43837 -30789 -9425
16067 -9425 -44654 19336 29958 33488 81933 133526 103709 -3882 -63303 -22762 -46192 -75624
16055 -75624 49212 118661 115915 148715 108258 60064 33814 10715 -2536 -41258 -84280 -144258
16043 -144258 -117620 -44285 55863 28148 -35562 -48253 21843 22267 -8649 104154 108708 91440
16031 91440 74020 -44658 -47223 -90156 -71223 -61171 -38617 44466 5528 20551 28288 -58161
$$ packed form
16114a756J7326J9752N5245K5790l8006J7576L6366o2854l3632l8798M8184j2561
16102C2632n9886P4703O1474j0562n2480o8832m5123M9475K7553R116J7127k8726
16090F471L0146j0595O3840m6883n4661o8945M269n5922O5123R9059Q6735r258
16078A09379n8820j15962k3359L1340L2476O0887M2259J3755m8118p4626K1364
16067i425l5229O3990J0622L530M8445N1593k9817j07591n9421M0541k3430k9432
16055g5624J24836O9449k746L2800m0457m8194k6250k3099j3251l8722m3022n9978
16043a44258K6638P3335J00148k7715o3710j2691P0096M24l0916J12803M554j7268
16031I1440j7420j18678k565m2933J8933J0052K2554Q3083l8938J5023P737q6449
$$ plain form
16019 -58161 -62873 -98296 -53082 2135 12513 -77437 -113618 -56299 66795 75231 72725 63443
16007 63443 8044 32253 90002 149028 96261 156675 109936 -47788 -70765 -70245 -32512 -119883
15995 -119883 -98392 -34473 -13793 71906 53268 -30769 9764 53287 44617 67190 15635 -40317
15983 -40317 -64413 -56788 -2906 7848 54762 59717 50242 54235 -35067 -129455 -95886 63483
15971 63483 113553 104528 59688 -8274 -57479 -53697 20065 16359 1169 -28586 -65656 -23461
15959 -23461 -23299 -150649 -158657 -86289 -34701 -3619 105546 75244 75864 195816 172597 65786
15947 65786 -19872 -87834 -111186 -109009 -54771 -70773 -77332 -68215 -17431 14843 29778 7519
15935 7519 -753 -10186 52841 89492 92826 129533 105060 -11842 -59507 -42320 -52419 -87692
$$ packed form
16019e8161m712l5423M5214N5217J0378q9950l6181N7319J23094Q436k506r282
16007F3443n5399K4209N7749N9026n2767O0414m6739j57724k2977N20L7733q7371
15995a19883K1491O3919K0680Q5699j8638q4037M0533M3523q670K2573n1555n5952
15983d0317k4096P625N3882J0754M6914M955r475L993q9302r4388L3569J59369
15971F3483N0070r025m4840o7962m9205L782P3762l706j5190k9755l7070M2195
15959b3461J62j27350q008P2368N1588L1082J09165l0302O20J19952k3219j06811
15947F5786q5658o7962k3352K177N4238j6002o559R117N0784L2274J4935k2259
15935G519q272r433O3027L6651L334L6707k4473j16902m7665J7187j0099l5273
$$ plain form
15923 -87692 -108042 -53868 43518 60431 31797 81766 97853 34338 -3600 -28794 -39611 -47472
15911 -47472 8850 -38127 -133917 -132872 -35282 21382 19456 20074 9222 -33882 -125158 -86732
15899 -86732 -43927 12296 80554 61993 25968 32605 53325 109540 91236 38993 2430 -125622
15887 -125622 -47234 79892 147785 99845 -16769 -100229 -140818 -48102 37798 11011 18870
15876 18870 41444 -19166 -124190 -145812 -180754 -203509 -101119 -39281 -68967 -82030 -52594
15865 -52594 -204 76908 16100 -11207 -22119 13289 8427 18227 115764 115714 56157 -44235
15853 -44235 -118993 -115543 -88841 -26464 -62315 -79475 -50103 -100085 -96913 -7691 25572 11379
15841 11379 71052 169183 196815 197764 148261 68466 -86539 -121820 -32704 53720 36565 -51373
$$ packed form
15923h7692k0350N4174R7386J6913k8634M9969J6087o3515l7938k5194j0817p861
15911d7472N6322m6977r5790J045R7590N6664j926O18j0852m3104r1276L8426
15899h6732M2805N6223O8258j8561l6025O637K0720N6215j8304n2243l6563j28052
15887a25622P8388J27126O7893m7940j16614q3460m0589R2716Q5900k6787P859
15876A8870K2574o0610j05024k1622l4942k2755J02390O1838k9686j3063K9436
15865e2594N2390P7112o0808k7307j0912L5408m862R800R7537n0n9557j00392
15853d4235p4758L450K6702O2377l5851j7160K9372m9982L172Q9222L3263j4193
15841A1379N9673R8131K7632R49m9503p9795j55005l5281Q9116Q6424j7155q7938
$$ plain form
15829 -51373 -119943 -109587 -163131 -134653 -138294 -73790 -62784 -46421 -20719 -18771 -18341 26381
15817 26381 76144 62632 103826 103413 100209 -45691 -27471 64219 65152 76519 70242 76193 81829
15804 81829 43638 -43083 -4938 -9126 21402 129491 132485 98611 68561 110612 66312 21397
15792 21397 -7007 -58350 -40986 -73695 -60134 -30111 -4955 -101782 -175225 -138734 7275
15781 7275 90980 40991 -48495 -58916 -72067 -125777 -167233 -38783 24196 98260 105219 45512
15769 45512 10573 19113 25298 21733 -5132 19291 13685 34176 -5036 -46428 -3347 -3817 23006
15756 23006 49349 119986 46418 45393 69730 32386 -31441 -53383 -95110 -104842 -78060 -68160
15744 -68160 -6079 4710 -65600 -95049 -85572 -56363 32653 -2284 13171 3886 28781 20812
$$ packed form
15829e1373o8570J0356n3544K8478l641O4504J1006J6363K5702J948M30M4722
15817B6381M9763j3512M1194m13l204j45900J8220R1690R33J1367o277N951N636
15804H1829l8191q6721L8145m188L0528J08089K994l3874l0050M2051m4300m4915
15792B1397k8404n1343J7364l2709J3561L0023K5156r6827p3443L6491J46009
15781G275Q3705m9989q9486j0421j3151n3710m1456J28450O2979P4064O959n9707
15769D5512l4939Q540O185l565k6865K4423n606K0491l9212m1392M3081m70K6823
15756B3006K6343P0637p3568j025K4337l7344o3827k1942m1727r732K6782R900
15744f8160O2081J0789p0310k9449R477K9209Q9016l4937J5455r285K4895p969
$$ plain form
15732 20812 39602 75234 112321 162735 164038 142870 103329 119943 81084 18161 -2470 -44949
15720 -44949 1002 31439 19494 73985 155620 120489 95708 62928 26630 -99941 -159390
15709 -159390 -129092 -84494 -41942 -34864 -60533 -14748 -71347 -24782 -34069 -39816 -15822 68106
15697 68106 94348 5764 -74720 -79882 16245 40981 6056 -33842 -82045 -100269 -71412 -62862
15685 -62862 -63065 -29389 -35303 -6771 -3167 32533 44698 54374 26988 28548 39477 -22366 -46844
15672 -46844 -82300 -14297 -15433 -74900 -101217 -119495 -43816 57150 27076 -27842 -66470 -78716
15660 -78716 -8467 -15277 -31203 -17144 37110 296 -135506 -147947 -120157 -153887 -142355 -69131
15648 -69131 -63487 -61728 -92917 -77064 -57816 -72768 -114460 -89803 -19965 11519 29955 13701
$$ packed form
15732B0812J8790L5632L7087N0414J303k1168l9541J6614l8859o2923k0631m2479
15720d4949M5951L0437j1945N4491Q1635l5131k4781l2780l6298j26571n9449
15709a59390L0298M4598M2552P078k5669M5785n6599M6565r287n747K3994Q3928
15697F8106K6242q8584q0484n162R6127K4736l4925l9898m8203j8224K8857Q550
15685f2862k03L3676n914K8532L604L5700J2165R676k7386J560J0929o1843k4478
15672d6844l5456O8003j136n9467k6317j8278P5679J00966l0074n4918l8628j2246
15660g8716P0249o810j5926J4059N4254l6814j35802j2441K7790l3730J1532P3224
15648f9131N644J759l1189J5853J9248j4952m1692K4657O9838L1484J8436j6254
$$ plain form
15636 13701 -24995 -50695 -63893 35144 39223 6263 -23676 -49104 55539 106800 47857 -41559
15624 -41559 -157744 -72029 26980 26957 -17275 -28720 -25487 -3018 -27410 -7665 -2972 -30636
15612 -30636 -85297 -36952 -12965 -82406 -54155 -2133 12263 6530 -27343 13764 35455 -16906
15600 -16906 -31920 -47033 11589 -89150 -69075 -36890 -51462 -88313 -48723 -39508 25928 14243
15588 14243 11086 32755 10730 -122210 -159234 -160508 -80451 -40777 -10279 53468 -17460 -76355
15576 -76355 -38851 -50995 -22562 37538 84010 22605 -16471 27625 -28508 -39985 94865
15565 94865 126301 122643 79595 44740 6513 -46727 -44568 4207 18705 57471 57365 44451
15553 44451 -26964 -80475 -86875 -102172 16554 76056 15774 -15611 47002 56742 84777 79961
$$ packed form
15636A3701l8696k5700j3198R9037M079l2960k9939k5428J04643N1261n8943q9416
15624d1559j16185Q5715R9009k3m4232j1445L233K2469k4392J9745M693k7664
15612c0636n4661M8345K3987o9441K8251N2022J4396n733l3873M1107K1691n2361
15600a6906j5014j5113N8622j00739K0075L2185j4572l6851L9590R215O5436j1685
15588A4243l157K1669k2025j32940l7024j274Q0057L9674L0498O3747p0928n8895
15576g6355L7504j2144K8433O0100M6472o1405l9076M4096n6133j1477J34850
15565I4865L1436l658m3048l4855l8227n3240K159M8775J4498L8766j06j2914
15553D4451p1415n3511o400j5297J18726N9502o0282l1385O2613R740K8035m816
$$ plain form
15541 79961 41990 -56536 -1977 -9844 -96869 -74523 -42532 40712 -17628 -26391 -13724 -33856
15529 -33856 -167932 -228524 -183930 -207890 -161672 -21103 2092 45867 55142 -36179 -34029 -25228
15517 -25228 710 4770 -19286 25396 -18158 -17048 54181 -16007 -26060 -78718 -64922 -86151
15505 -86151 -33821 71671 117280 179130 221389 191909 139882 106222 120382 178780 226349
15494 226349 192164 148846 120766 186505 219480 219750 138717 52648 52188 52049 -1243 14873 27177
15481 27177 55763 91409 60624 43011 82402 117551 56180 3489 -32417 -92023 -83967 -1815
15469 -1815 112553 112481 48980 25352 33478 6056 -44060 -89882 -42512 -18346 -42520 -42235 -13183
15456 -13183 -30424 47910 7303 -36043 -113108 -124220 -84001 -90298 -145404 -168964 -116506 -73753
$$ packed form
15541G9961l7971r8526N4559p867q7025K2346L1991Q3244n8340q763J2667k0132
15529c3856j34076o0592M4594k3960M6218J40569K3195M3775R275r1321K150Q801
15517b5228K5938M060k4056M4682m3554J110P1229p0188j0053n2658J3796k1229
15505h6151N2330J05492M5609O1850M2259k9480n2027l3660J4160N8398M7569
15494B26349l4185m3318k8080O5739L2975K70q1033q6069m60j39n3292J6116J2304
15481B7177K8586L5646l0785j7613L9391L5149o1371n2691l5906n9606Q056Q2152
15469a815J14368p2o3501k3628Q126k7422n0116m5822M7370K4166k4174K85K9052
15456a3183j7241P8334m0607m3346p7065j1112M0219o297n5106k3560N2458M2753
$$ plain form
15444 -73753 -62247 -33337 -42117 -22515 -79480 -81728 -22560 -16940 -91210 -85119 -52170 -98981
15432 -98981 -81970 9764 50374 -34763 -26078 -59138 -663 76114 -1905 -29453 26093 -30855
15420 -30855 -79280 -41056 -32789 87922 126657 89055 111246 154789 136898 139159 123873 47085
15408 47085 30571 53652 26843 20092 73093 99951 47931 21717 -3151 -35468 -4825 78520
15396 78520 91638 57476 13752 78334 156926 160415 133511 53065 -7577 31529 53668 29014
15384 29014 -1056 -45694 -67774 -53970 -92124 -68806 -139107 -155827 -92899 -27621 44337 56211
15372 56211 -1014 -147698 -174376 -103672 -48536 -402 51030 14281 -15423 39838 29072
15361 29072 38761 93424 22073 7448 63686 -21112 -9337 94600 135576 88260 -14960
$$ packed form
15444g3753J1506K8910q780J9602n6965k248N9168N620p4270O091L2949m6811
15432i8981J7011R1734M0610q5137Q685l3060N8475P6777p8019k7548N5546n6948
15420c0855m8425L8224Q267J20711L8735l7602K2191M3543j7891K261j5286p6788
15408D7085j6514K3081k6809o751N3001K6858n2020k6214k4868l2317L0643Q3345
15396G8520J3118l4162m3724O4582P8592L489k6904q0446o0642L9106K2139k4654
15384B9014l0070m4638k2080J3804l8154K3318p0301j6720O2928O5278P1958J1874
15372E6211n7225j46684k6678P0704N5136M8134N1432l6749k9704N5261j0766
15361B9072R689N4663p1351j4625N6238q4798J1775J03937M0976m7316j03220
$$ plain form
15350 -14960 -73687 -105239 -125829 -160457 -105353 -57212 -78960 -72782 -79898 -65643 -96143 -98331
15338 -98331 -128602 -129290 -110300 -121663 -36275 25080 14849 -96805 -85401 -44962 -61889 -77568
15326 -77568 -93037 -77454 -97413 -100952 -81868 -44331 -20586 38710 53324 53748 14799 3105
15314 3105 -20150 17582 10492 22514 -17189 -46474 10623 -10485 -24189 -15580 -36078 -65306
15302 -65306 -78532 -121453 -179069 -112789 -130232 -88219 6928 12853 -24047 -84426 -44934 -3886
15290 -3886 -54915 -92238 -56863 7337 10731 3573 72257 82225 83074 25860 -75079 -101943 -150425
15277 -150425 -150338 -84531 -33526 -16019 43484 116583 138521 69312 77222 36111 -58474 -110144
15265 -110144 -78267 -58320 -31426 -1750 90840 105924 116558 77259 70090 66869 13642 -39047
$$ packed form
15350a4960n8727l1552k0590l4628N5104M8141k1748O178p116J4255l0500k188
15338i8331l0271o88J8990j1363Q5388O1355j0231j11654J1404M0439j6927j5679
15326g7568j5469J5583j9959l539J9084L7537K3745N9296J4614M24l8949j1694
15314C105k3255L7732p090J2022l9703k9285N7097k1108j3704Q609k0498k9228
15302f5306j3226m2921n7616O6280j7443M2013R5147N925l6900o0379L9492M1048
15290c886n1029l7323L5375O4200L394p158O8684R968Q49n7214j00939k6864m8482
15277a50425Q7O5807N1005J7507N9503P3099K1938o9209P910m1111r4585n1670
15265a10144L1877J9947K6894K9676R2590J5084J0634l9299p169l221n3227n2689
$$ plain form
15253 -39047 2845 130355 129540 78426 21862 -55741 -32859 -650 -17665 -78007 -60282 41569
15241 41569 95372 65261 44344 -3636 -75362 -68297 20618 23456 41407 61849 31643 -69017
15229 -69017 -6472 47162 31955 15601 -102708 -172707 -124166 -81357 -50587 -26796 24225
15218 24225 59511 24983 -23578 13156 109648 147699 98267 112754 164567 164081 76515 58198
15206 58198 131385 121893 97299 66266 1064 -83635 -137451 -155789 -113143 19206 98938 76640
15194 76640 63880 62160 59864 58333 77107 22214 64098 69797 -35735 -25333 58966 96022
15182 96022 -34773 -160572 -137536 -129030 -109169 -105064 -117218 -54681 -54363 -31421 -84773 -131351
15170 -131351 -97788 -76662 -89267 -46449 -63044 -197010 -148499 -124187 -61408 20821 67906
$$ packed form
15253c9047M1892J27510q15n1114n6564p7603K2882L2209j7015o0342J7725J01851
15241D1569N3803l0111k0917m7980p1726P065Q8915K838J7951K0442l0206j00660
15229f9017O2545N3634j5207j6354j18309o9999M8541M2809L0770K3791N1021
15218B4225L5286l4528m8561L6734R6492L8051m9432J4487N1813m86q7566j8317
15206E8198P3187r492k4594l1033o5202q4699n3816j8338M2646J32349P9732k2298
15194G6640j2760j720k296j531J8774n4893M1884N699j05532J0402Q4299L7056
15182I6022j30795j25799K3036Q506J9861M105j2154O2537L18K2942n3352m6578
15170a31351L3563K1126j2605M2818j6595j33966M8511K4312O2779Q2229M7085
$$ plain form
15159 67906 27994 -45700 -65906 -41538 -49304 -41255 59255 61126 40335 65196 14122 -80210
15147 -80210 -142244 -74356 31613 -62466 -47259 44055 50087 35690 -37281 -97909 -72337 -45791
15135 -45791 14681 5836 54819 71991 72330 43021 39290 27773 -2451 30547 143914 97460
15123 97460 5107 26070 66843 151922 98042 3598 -53506 -67307 -37001 65498 102437
15112 102437 201657 184610 172901 144044 83567 61701 -83746 -72745 -32795 15112 40460
15101 40460 -19827 36039 117415 131797 -3299 -56268 -22858 35848 -38777 -103398 -67689
15090 -67689 -19741 18893 34884 81338 86847 104784 168878 113232 31661 -4587 -12010 -33697
15078 -33697 -35816 -4634 11880 -25450 -85929 33492 104120 73324 23109 -41325 -70587 -29531
$$ packed form
15159F7906l9912p3694k0206K4368p766Q049J00510J871k0791K4861n1074r4332
15147h0210o2034O7888J05969r4079J5207R1314O032j4397p2971o0628K5572K6546
15135d5791O0472q845M8983J7172L39k9309l731j1517l0224L2998J13367m6454
15123I7460r2353K0963M0773Q5079n3880r4444n7104j3801L0306J02499L6939
15112A02437R9220j7047j1709k8857o0477k1866j45447J1001L9950M7907K5348
15101D0460o0287N5866Q1376J4382j35096n2969L3410N8706p4625o4621L5709
15090f7689M7948L8634J5991M6454N509J7937O4094n5646q1571l6248p423k1687
15078c3697k119L1182J6514l7330o0479J19421P0628l0796n0215o4434k9262M1056
$$ plain form
15066 -29531 -33287 -5415 -16437 -32741 -49842 -95662 -2373 -27015 -69837 -105694 -137036 -64414
15054 -64414 -17557 2729 -710 26154 60368 -37753 -77312 -1351 -2041 -56711 -69894 -49852
15042 -49852 -80593 -16924 -7512 13558 80546 49596 6446 24824 -71727 -115691 -189139 -180611
15030 -180611 -69108 -11350 -30027 39979 -19635 -20973 61899 45815 59276 97447 84789
15019 84789 60550 41087 8048 36625 71002 109279 5691 -119305 -127870 -9908 66248
15008 66248 115703 132788 88390 44197 5820 52503 140117 183013 72976 49779 21527
14997 21527 -17243 20409 -6835 -14684 -49306 -42738 9427 41103 -24613 -122905 -126829 -95886
14985 -95886 34871 69599 22054 -65487 -89460 12304 77027 111193 50361 -3567 -2173
$$ packed form
15066b9531l756K7872j1022j6304j7101m5820R3289k4642m2822l5857l1342P2622
15054f4414M6857K0286l439K6864L4214r8121l9559P5961o90n4670j3183K0042
15042d9852l0741O3669R412K1070O6988l0950m3150J8378r6551m3964p3448Q528
15030a80611J11503N7758j8677P0006n9614j338Q2872j6084J3461L8171j2658
15019H4789k4239j9463l3039K8577L4377L8277j03588j24996q565J17962P6156
15008F6248M9455J7085m4398m4193l8377M6683Q7614M2896j10037k3197k8252
14997B1527l8770L7652k7244p849l4622O568N2165L1676o5716r8292l924L0943
14985i5886J30757L4728m7545q7541k3973J01764O4723L4166o0832n3928J394
$$ plain form
14974 -2173 -29440 26333 90759 157829 141673 157354 162025 46039 93940 84089 30310 -32876
14962 -32876 -25873 -62178 -152493 -68826 -10541 11333 -10448 -55114 -79974 -104105 -77947 -11014
14950 -11014 67600 57714 52914 -18255 -46742 8841 -7221 -6077 -5262 82267 22533 -75765 -98120
14937 -98120 87253 165695 125866 153901 116720 35622 45622 61465 33444 -24969 -54738
14926 -54738 34575 36789 -26528 24598 41745 2813 -53535 -79992 -58694 -94623 -85943 19444
14914 19444 81326 176108 132826 75411 30540 -28477 -65506 -64498 -15085 -6335 26318 -12458
14902 -12458 1091 68656 60024 38253 61643 43339 -4393 -51686 -4622 -33271 21852 -44882
14890 -44882 -62137 -40520 -60080 -102316 -116780 -128777 -35574 1938 8539 22125 -9987 -50861
$$ packed form
14974b173k7267N5773O4426O7070j6156J5681M671j15986M7901r851n3779o3186
14962c2876P003l6305r0315Q3667N8285K1874k1781m4666k4860k4131K6158O6933
14950a1014P8614r886m800p1169k8487N5583j6062J144Q15Q7529n9734r8298k2355
14937i8120J85373P8442l9829K8035l7181q1098J0000J5843k8021n8413k9769
14926e4738Q9313K214o3317N1126J7147l8932n6348k6457K1298l5929Q680J05387
14914A9444O1882R4782m3282n7415m4871n9017l7029J008M9413Q750L2653l8776
14902a2458J3549O7565q632k1771K3390j8304m7732m7293M7064k8649N5123o6734
14890d4882j7255K1617j9560m2236j4464j1997R3203L7512O601J3586l2112m0874
$$ plain form
14878 -50861 -74697 -26798 -2453 -34568 -91188 -35819 -34565 14880 45100 58818 120912 88073
14866 88073 65528 -40342 -45543 -3518 -24273 -74660 -158903 -158663 -105926 -64194 -107955 -134487
14854 -134487 -117984 -2768 -18068 4884 -89973 -125315 -112054 -122870 -180852 -134194 -59591
14843 -59591 -11545 11372 -15910 -87048 -56009 -32278 22813 14364 49296 52029 68066 85067
14831 85067 32712 30230 68332 99650 84274 57638 55971 79929 69746 39307 51611 19661
14819 19661 25988 18754 66517 100966 112126 119295 118767 11245 -8503 8381 -36644 -135996
14807 -135996 -162430 -62485 -36882 -91369 -89297 -26832 18092 58175 90449 80408 1866 -62089
14795 -62089 -50871 -27127 -27570 -62279 -88458 -42453 -74459 -66910 -41954 6662 -37893 -51727
$$ packed form
14878e0861k3836M7899K4345l2115n6620N5369J254M9445L0220J3718O2094l2839
14866H8073k2545j05870n201M2025k0755n0387q4243K40N2737M1732m3761k6532
14854a34487J6503J15216j5300K2952r4857l5342J3261j0816n7982M6658P4603
14843e9591M8046K2917k7282p1138L1039K3731N5091q449L4932K733J6037J7001
14831H5067n2355k482L8102L1318j5376k6636j667K3958j0183l0439J2304l1950
14819A9661O327p234M7763L4449J1160P169n28j07522j9748J6884m5025r9352
14807a35996k6434R9945K5603n4487K072O2465M4924M0083L2274j0041p8542o3955
14795f2089J1218K3744m43l4709k6179M6005l2006P549K4956M8616m4555j3834
$$ plain form
14783 -51727 4681 -9622 -29100 -28467 -31800 -34487 -20806 16690 77877 98927 111613 98921
14771 98921 49298 64147 22989 -2483 42931 12786 -75867 -61246 -14610 19228 -66161 -70459
14759 -70459 -10753 -24861 -13910 8121 72490 118001 -43564 -70589 -20443 77713 85720 16734
14747 16734 60867 114248 138900 85212 45057 57486 110894 182406 228868 309265 404891 535630
14735 535630 735381 952397 1204360 1415972 1721891 2011746 2182242 2226135 2108763 1948368
14725 1948368 1772990 1554398 1361567 1278987 1041010 750559 646128 654979 613418 483176
14715 483176 438410 477681 530290 439703 340235 275403 265162 320040 256673 188267 165940
14704 165940 81980 67738 207835 289546 278872 253847 181931 193998 212619 236166 197988
$$ packed form
14783e1727N6408j4303j9478O33l333k687J3681L7496O1187K1050J2686j2692
14771I8921m9623J4849m1158k5472M5414l0145q8653J4621M6636L3838q5389m298
14759g0459N9706j4108J0951K2031O4369M5511j61565k7025N0146R8156Q007o8986
14747A6734M4133N3381K4652n3688m0155J2429N3408P1512M6462Q0397R5626J30739
14735E35630J99751K17016K51963K11612L05919K89855J70496M3893j17372j60395
14725A948368j75378k18592j92831q2580k37977k90451j04431Q851m1561j30242
14715D83176m4766L9271N2609r0587r9468o4832j0241N4878o3367o8406k2327
14704A65940q3960j4242J40097Q1711j0674k5025p1916J2067J8621K3547l8178
$$ plain form
14693 197988 181956 130095 61672 -17798 21371 77722 161202 135528 115881 19949 -35178
14682 -35178 -66742 -16912 70007 165216 173496 38871 40 5793 -22511 34761 62816 68842
14670 68842 56700 54430 56148 81339 156298 193209 107727 100350 13681 30935 124868 149154
14658 149154 57332 18350 -10821 20797 58383 6237 -17990 -50005 -31821 50865 74037
14647 74037 -10468 65152 121084 122488 105314 91722 122927 112507 42187 -44091 -86712 -19097
14635 -19097 80790 6512 -5136 44719 50773 1003 -1407 88859 98610 44556 39953 28214
14623 28214 115452 193713 227113 174060 91218 54133 49533 17422 73128 146915 93377 -39419
14611 -39419 -45092 -26712 -101715 -59386 43355 67413 84730 96575 107069 73349 61806 149324
$$ packed form
14693A97988j6032n1861o8423p9470L9169N6351Q3480k5674j9647r5932n5127
14682c5178l1564M9830Q6919R5209Q280j34625l8831N753k8304N7272K8055O026
14670F8842j2142k270J718K5191P4959L6911q5482p377q6669J7254R3933K4286
14658A49154r1822l8982k9171L1618L7586n2146k4227l2015J8184Q2686K3172
14647G4037q4505P5620N5932J404j7174j3592L1205j0420p0320q6278m2621O7615
14635a9097R9887p4278j1648M9855O054m9770k410R0266R751n4054m603j1739
14623B8214Q7238P8261L3400n3053q2842l7085m600l2111N5706P3787n3538j32796
14611c9419n673J8380p5003M2329J02741K4058J7317J1845J0494l3720j1543Q7518
$$ plain form
14599 149324 161120 113742 18741 25298 58251 96774 102423 72650 7878 10252 260 33598
14587 33598 77454 18320 46436 96569 16175 54001 26489 -66020 -66180 -77213 -35470 -34188
14575 -34188 -9028 56009 77621 78263 -3674 -5388 -18606 20563 3937 16131 -44475 -26727
14563 -26727 29753 14798 -41053 -21253 1003 17889 32267 15609 -10093 -35771 -49802 -54574
14551 -54574 -39561 52589 41996 -25552 -148910 -101423 -65788 -100281 -105347 -93173 -91193 -99465
14539 -99465 -77897 -74810 -23588 -36561 -42028 -50168 25970 42788 42644 42841 1264 -19492 -6441
14526 -6441 8786 -6782 3815 -5127 63979 114536 170631 127218 49749 -12238 -56518 -26413
14514 -26413 -12859 -12910 88646 140132 44803 12209 33644 62472 -45508 -23151 -75406 -66272
$$ packed form
14599A49324J1796m7378r5001O557L2953L8523N649k9773o4772K374r992L3338
14587C3598M3856n9134K8116N0133q0394L7826k7512r2509j60j1033M1743J282
14575c4188K5160O5037K1612O42q1937j714j3218L9169j6626J2194o0606J7748
14563b6727N6480j4955n5851J9800K2256J6886J4378j6658k5702k5678j4031m772
14551e4574J5013R2150j0593o7548j23358M7487L5635l4493n066J2174J980q272
14539i9465K1568L087N1222j2973n467q140P6138J6818j44J97m1577k0756J3051
14526f441J5227j5568J0597q942O9106N0557N6095m3413p7469o1987m4280L0105
14514b6413J3554n1J01556N1486r5329l2594K1435K8828j07980K2357n2255R134
$$ plain form
14502 -66272 11465 -80005 -101673 -68487 -79228 -45201 14118 31787 92500 93446 -12472 -41595
14490 -41595 -16527 -2459 50583 14643 49402 92071 79418 141776 151309 116444 101427 55595
14478 55595 -62539 -141562 -21328 116463 132489 75782 -1452 71660 113779 85298 68108
14467 68108 98211 88039 63741 26779 10716 36264 65052 82267 31312 12758 31412 -12653
14455 -12653 16064 42579 6927 -14927 -67970 -136866 -161214 -109740 -18599 79 -22254 126323
14443 126323 156635 74335 49576 81850 170694 194884 185039 195153 96436 -34234 14448
14432 14448 152241 181316 167755 109883 115445 129620 58053 49549 55275 80525 54373 -1965
14420 -1965 43942 78308 9279 -43718 -13713 -18769 -19676 45661 2551 4618 15984 42518 33885
$$ packed form
14502f6272P7737r1470k1668L3186j0741L4027N9319J7669O0713R46j05918k9123
14490d1595K5068J4068N3042l5940L4759M2669j2653O2358R533l4865j5017m5832
14478E5595j18134p9023J20234J37791J6026n6707p7234P3112M2119k8481j7190
14467F8108L0103j0172k4298l6962j6063K5548K8788J7215n0955j8554J8654m4065
14455a2653K8717K6515l5652k1854n3043o8896k4348N1474R1141J8678k2333J48577
14443A26323L0312q2300k4759L2274Q8844K4190r845J0114r8717j30670M8682
14432A4448J37793K9075j3561n7872N562J4175p1567q504N726K5250k6152n6338
14420a965M5907L4366o9029n2997L0005n056r07O5337m3110K067J1366K6534q633
$$ plain form
14407 33885 19280 -21084 -4185 76170 65185 38980 44920 30701 59000 68782 68947 68145 118573
14394 118573 82956 148376 55421 -48278 -47939 53330 96953 83021 44436 -20764 22343
14383 22343 100173 39734 20161 61822 28137 -98958 -103371 -49131 167707 284619 214742
14372 214742 127019 -23147 -89043 -46672 1612 -13785 36088 160228 133110 1835 -14732
14361 -14732 89794 71330 35257 23790 20758 27376 -33286 -37791 -2378 -25048 -1022 -51285
14349 -51285 -41087 25520 89353 69460 47590 60690 50201 51244 34111 63309 78807 15262
14337 15262 -55767 -24615 56109 83881 35033 68854 100907 83062 52550 58448 -6001 -46822
14325 -46822 -43464 -1817 106934 64167 29109 -2237 50501 57127 8260 45217 28759 -5574
$$ packed form
14407C3885j4605m0364J6899Q0355j0985k6205N940j4219K8299R782J65q02N0428
14394A18573l5617O5420r2955j03699L39J01269M3623j3932l8585o5200M3107
14383B2343P7830o0439j9573M1661l3685j27095m413N4240K16838J16912o9877
14372B14742q7723j50166o5896M2371M8284j5397M9873J24140k7118j31275j6567
14361a4732J04526j8464l6073j1467l032O618o0662m505L5413k2670K4026n0263
14349e1285J0198O6607O3833j9893k1870J3100j0489J043j7133K9198J5498o3545
14337A5262p1029L1152Q0724K7772m8848L3821L2053j7845l0512N898o4449m0821
14325d6822L358M1647J08751m2767l5058l1346N2738O626m8867L6957j6458l4333
$$ plain form
14313 -5574 -47318 2872 24269 32079 46154 -4286 -11500 -6200 -25777 -5525 19411 -6287
14301 -6287 -40472 -99539 -23504 -29518 -55427 31287 103625 89789 -35148 -146540 -27693
14290 -27693 48791 97564 176518 174734 118483 566 -1858 155973 248072 206444 271715 349081
14278 349081 357361 469937 610511 683632 819344 947363 1236684 1582109 1865256 1940983
14268 1940983 2037935 1955500 1679843 1364715 1114436 989499 850045 786763 698578 595760
14258 595760 547704 407415 383373 381848 312420 285305 263071 266140 290896 302050 217975 174578
14246 174578 161888 162178 185350 194672 184098 170934 184717 167726 178398 154502 168572 281747
14234 281747 295217 251601 223111 186143 161741 119271 81926 170014 228086 173410 116317
$$ packed form
14313e574m1744N0190K1397P810J4075n0440p214N300j9577K0252K4936k5698
14301f287l4185n9067P6035o014k5909Q6714P2338j3836j24937j11392J18847
14290b7693P6484M8773P8954j784n6251j17917k424J57831R2099m1628O5271P7366
14278C49081Q280J12576J40574P3121J35712J28019K89321L45425K83147P5727
14268A940983R6952q2435k75657l15128k50279j24937j39454o3282q8185j02818
14258E95760m8056j40289k4042j525o9428k7115k2234L069K4756J1154q4075m3397
14246A74578j2690K90K3172R322j0574j3164J3783j6991J0672k3896J4070J13175
14234B81747J3470m3616k8490l6968k4402m2470l7345Q8088N8072n4676n7093
$$ plain form
14223 116317 203315 280268 216316 138122 199126 179735 185469 167988 234635 215457 79112
14212 79112 19760 35993 48113 20744 -10542 -8648 31704 141833 125702 112849 87026 53798
14200 53798 -13521 49274 -48069 -136587 -82734 -34181 11600 89097 117712 136463 127706 108876
14188 108876 11322 -22738 93111 128419 97653 71396 61293 93005 55694 102698 117196
14177 117196 184905 223580 159709 100276 31436 -35517 -49567 -120249 -109456 -85385 -119423
14166 -119423 -74388 -61814 -101259 -77237 9893 77678 48771 28998 84753 58190 -5308
14155 -5308 7743 -74479 -97010 -18436 3892 -22546 -49308 -13324 -25949 -24406 -67333 -136314
14143 -136314 -173230 -123949 -45811 -65247 -113595 -115302 -35938 -24707 -114528 -119387 -7036 125283
$$ packed form
14223A16317Q6998P6953o3952p8194O1004j9391N734j7481O6647j9178j36345
14212G9112n9352J6233J2120k7369l1286J894M0352J10129j6131j2853k5823l3228
14200E3798o7319O2795r7343q8518N3853M8553M5781P7497K8615J8751q757j8830
14188A08876r7554l4060J15849L5308l0766k6257j0103L1712l7311M7004J4498
14177A17196O7709L8675o3871n9433o8840o6953j4050p0682J0793K4071l4038
14166a19423M5035J2574l9445K4022Q7130O7785k8907j9773N5755k6563o3498
14155e308J3051q2222k2531P8574K2328k6438k6762L5984j2625J543m2927o8981
14143a36314l6916M9281P8138j9436m8348j707P9364J1231q9821m859J12351J32319
$$ plain form
14131 125283 129584 45805 -26577 -62105 -11879 19793 70483 82503 8770 -25752 -33333 -61915
14119 -61915 -63144 41298 100444 46907 74615 33506 44989 50842 34999 31113 17943 9165
14107 9165 13318 44535 13682 -8497 16963 -30534 16260 82355 84592 101178 122086 146362
14095 146362 90102 12555 47758 96151 92836 72097 25789 4723 -18060 736 45159 94251
14083 94251 122738 78226 26351 60027 51515 36044 33754 -60047 -117575 -103659 -54232 -43630
14071 -43630 -5153 -15324 36911 74276 61415 102344 102226 143157 126108 47954 75435 62053
14059 62053 74627 61198 47462 59837 80502 143735 149377 79929 9485 -48026 -4633 117010
14047 117010 138070 172995 82037 17971 56329 135378 146803 262154 215945 159215 201625
$$ packed form
14131A25283M301q3779p2382l5528N0226L1672N0690J2020p3733l4522p581k8582
14119f1915j229J04442N9146n3537K7708m1109J1483N853j5843l886j3170q778
14107I165M153L1217l0853k2179K5460m7497M6794O6095K237J6586K0908K4276
14095A46362n6260p7547L5203M8393l315k0739m6308k1066k2783J8796M4423M9092
14083I4251K8487m4512n1875L3676q512j5471k290r3801n7528J3916M9427J0602
14071d3630L8477j0171N2235L7365j2861M0929j18M0931j7049p8154K7481j3382
14059F2053J2574j3429j3736J2375K0665O3233N642o9448p0444n7511M3393J21643
14047A17010K1060L4925r0958o4066L8358P9049J1425J15351m6209n6730M2410
$$ plain form
14036 201625 280865 271992 201611 135527 156782 158782 81081 -14452 -82727 -41088 140580 191167
14024 191167 163013 89611 20427 8102 12190 98763 173425 122256 81383 50059 -27766 -38989
14012 -38989 -8860 38592 34307 30728 -28355 -44753 -16035 -8318 -38479 -40787 -4941 109507
14000 109507 95320 2716 11218 4253 59602 45144 2369 -10999 25317 143517 63824 -5083
13988 -5083 -36382 -58995 -113069 -173825 -255169 -184335 -156100 -200349 -201131 -182527 -213014 -188948
13976 -188948 -172334 -147124 -137688 -90048 4695 54086 34236 35858 65575 99422 90367 100963
13964 100963 -9161 -33152 -33392 -52719 -5908 -14190 -61384 -68585 -51875 9898 52784 -10003
13952 -10003 23335 76265 41853 -38482 -92279 -60638 -6496 -55392 -76681 -118178 -123850 -13538
$$ packed form
14036B01625P9240q873p0381o6084K1255K000p7701r5533o8275M1639J81668N0587
14024A91167k8154p3402o9184j2325M088Q6573P4662n1169m0873l1324p7825j1223
14012c8989L0129M7452m285l579n9083j6398K8718P717l0161k308L5846J14448
14000A09507j4187r2604Q502o965N5349j4458m2775j3368L6316J18200p9693o8907
13988e083l1299k2613n4074o0756q1344P0834K8235m4249p82J8604l0487K4066
13976a88948J6614K5210R436M7640R4743M9391j9850J622K9717L3847r055J0596
13964A00963j10124k3991k40j9327M6811q282m7194p201J6710O1773M2886o2787
13952a0003L3338N2930l4412q0335n3797L1641N4142m8896k1289m1497n672J10312
$$ plain form
13940 -13538 74569 -18817 -65373 -43089 20891 81071 104136 26769 -45043 -54845 71053 100704
13928 100704 136414 66349 56583 142782 258196 320198 370072 460149 682747 987209 1256458
13917 1256458 1406463 1581841 1763421 1882525 1928384 1877168 1890938 1758506 1656497 1497792
13907 1497792 1323104 1154503 1133373 1115185 1193862 1156692 1057260 1004337 1017236 1053802 1101211
13896 1101211 1136625 1171634 1062458 956126 986826 966202 992392 1019620 1173613 1191490 1093621
13885 1093621 1024629 1033660 969735 822595 777932 850403 920377 924574 896318 888619 902895 919183
13873 919183 851247 764280 763851 791736 736461 841680 819341 915043 899614 836054 931567 874877
13861 874877 756521 708587 699499 742453 750588 780228 756398 753752 790038 921296 990506 899533
$$ packed form
13940a3538Q8107r3386m6556K2284O3980O0180K3065p7367p1812r802J25898K9651
13928A00704L5710p0065r766Q6199J15414O2002M9874R0077K22598L04462K69249
13917A256458J50005J75378J81580J19104M5859n1216J3770j32432j02009j58705
13907A497792j74688j68601k1130j8188P8677l7170r9432n2923J2899L6566M7409
13896A101211L5414L5009j09176j06332L0700k0624K6190K7228J53993J7877r7869
13885A093621o8992R031o3925j47140m4663P2471O9974M197k8256p699J4276J6288
13873I19183o7936q6967m29K7885n5275J05219k2339R5702j5429o3560R5513n6690
13861H74877j18356m7934r088M2954Q135K9640k3830k646L6286J31258O9210r0973
$$ plain form
13849 899533 841081 875772 899785 929387 952402 981996 1020699 1123882 1249672 1293776 1315094
13838 1315094 1266711 1319892 1260135 1205425 1166702 1116525 1208963 1275447 1320107 1489350 1643387
13827 1643387 1752917 1846246 1903865 1967605 2041623 2093832 2131920 2255932 2351931 2602483 2977843
13816 2977843 3365812 3648187 3925764 4315962 4811315 5473638 6378848 7494873 8756021
13807 8756021 10045786 11356228 12720130 14150931 15752234 17529408 19883471 22845593
13799 22845593 26881451 32822085 41998060 56743200 79976225 114197198 160379266
13792 160379266 216084695 275103436 328084000 364715774 377716110 365017312 329717352
13785 329717352 280987371 228325376 180029544 141360650 112811994 93374310 80388303
$$ packed form
13849H99533n8452L4691K4013K9602K3015K9594L8703J03183J25790M4104K1318
13838A315094m8383N3181n9757n4710l8723n0177R2438O6484M4660J69243J54037
13827A643387J09530R3329N7619O3740P4018N2209L8088J24012R5999K50552L75360
13816B977843L87969K82375K77577L90198M95353O62323R05210J116025J261148
13807H756021J289765J310442J363902J430801J601303J777174K354063K962122
13799B2845593M035858N940634R175975J4745140K3233025L4220973M6182068
13792A60379266N5705429N9018741N2980564L6631774J3000336j2698798l5299960
13785C29717352m8729981n2661995m8295832l8668894k8548656j9437684j2986007
$$ plain form
13778 80388303 71463544 64979549 60102425 56298886 53133882 50369865 47741312 45189404
13770 45189404 42763532 40313997 38085359 35979527 34074184 32380822 30940269 29595902
13762 29595902 28393597 27251308 26257420 25311082 24442927 23731287 22973734 22116596 21287337
13753 21287337 20630687 20041310 19494054 19029211 18597006 18094251 17514816 17013482 16513162
13744 16513162 16032023 15497435 15005194 14552780 14162567 13803996 13392650 13004115 12660006
13735 12660006 12286203 11941057 11749628 11496315 11170377 10897072 10640679 10290648 9970367
13726 9970367 9776390 9617555 9345847 9116646 8851425 8611907 8506167 8416925 8327154 8143736
13716 8143736 7986392 7877208 7774802 7642851 7362001 7090833 6943786 6861839 6865911 6774586
$$ packed form
13778H0388303q924759o483995m877124l803539l165004k764017k628553k551908
13770D5189404k425872k449535k228638k105832j905343j693362j440553j344367
13762B9595902j202305j142289r93888r46338q68155p11640p57553q57138q29259
13753B1287337o56650n89377n47256m64843m32205n02755n79435n01334n00320
13744A6513162m81139n34588m92241m52414l90213l58571m11346l88535l44109
13735A2660006l73803l45146j91429k53313l25938k73305k56393l50031l20281
13726I970367j93977j58835k71708k29201k65221k39518j05740q9242q9771j83418
13716H143736j57344j09184j02406j31951k80850k71168j47047q1947M072r1325
$$ plain form
13706 6774586 6604303 6479699 6359895 6250553 6229786 6180798 6110106 5967794 5884358 5710865
13696 5710865 5606948 5436504 5325081 5206948 5098134 4971769 4821870 4732570 4629876 4524956
13686 4524956 4466222 4314600 4285549 4257431 4202904 4148555 4037531 3968991 3988951 3969179 3802130
13675 3802130 3639081 3595423 3591395 3536603 3604597 3691197 3758778 3828450 3997831 4114675 4277634
13664 4277634 4544132 4699034 4830470 4826110 4633002 4475341 4362091 4123091 3967603 3874224
13654 3874224 3746647 3670321 3555388 3429207 3367736 3257033 3151266 3109911 3082133 2949399
13644 2949399 2894813 2929626 2866491 2679196 2687427 2698452 2659102 2552284 2553313 2566990 2553786
13633 2553786 2472311 2329342 2297756 2327060 2286027 2194312 2107152 2039222 1997836 2024132 2051016
$$ packed form
13706F774586j70283j24604j19804j09342k0767m8988p0692j42312q3436j73493
13696E710865j03917j70444j11423j18133j08814j26365j49899q9300j02694j04920
13686D524956n8734j51622k9051k8118n4527n4349j11024o8540J9960j9772j67049
13675C802130j63049m3658m028n4792O7994Q6600O7581O9672J69381J16844J62959
13664D277634K66498J54902J31436m360j93108j57661j13250k39000j55488r3379
13654C874224j27577p6326j14933j26181o1471j10703j05767m1355k7778j32734
13644B949399n4586L4813o3135j87295Q231J1025l9350j06818J029J3677j3204
13633B553786q1475j42969l1586K9304m1033r1715q7160o7930m1386K6296K6884
$$ plain form
13622 2051016 2006608 1854036 1777626 1804209 1790199 1717644 1658432 1620453 1523706 1519154 1566020
13611 1566020 1609454 1637007 1626686 1563131 1527066 1499375 1527610 1587948 1585399 1565584 1572634 1630698
13599 1630698 1587158 1437748 1349717 1392250 1341140 1316447 1338207 1322523 1232281 1199922 1104809
13588 1104809 1130686 1129276 1095699 1068275 1100553 1106314 1051459 1038972 921347 954420 932958
13577 932958 863780 887127 911332 994581 1046863 980623 913780 813372 848674 920719 961681
13566 961681 776990 784494 759661 717515 787203 771127 692397 628388 603684 674438 765651
13555 765651 782480 827214 845624 862605 807345 817487 802473 735933 687111 726209 719985 719704
13543 719704 752698 632447 613751 629167 617180 511406 445504 442701 456569 569875 632608
$$ packed form
13622B051016m4408j52572p6410K6583j4010p2555n9212l7979r6747m552M6866
13611A566020M3434K7553j0321o3555l6065k7691K8235O0338k549j9815P050N8064
13599A630698m3540j49410q8031M2533n1110k4693K1760j5684r0242l2359r5113
13588A104809K5877j410l3577k7424L2278N761n4855j2487j17625L3073k1462
13577I32958o9178K3347K4205Q3249N2282o6240o6843j00408L5302P2045M0962
13566I61681j84691P504k4833m2146O9688j6076p8730o4009k4704P0754R1213
13555G65651J6829M4734J8410J6981n5260J0142j5014o6540m8822L9098o224k81
13543G19704L2994j20251j8696J5416j1987j05774o5902k803J3868J13306O2733
$$ plain form
13532 632608 573428 557181 575274 587252 492219 470335 467208 431611 380049 419212 426476 518809
13520 518809 544304 453471 394517 416792 365947 353871 441954 457810 443236 343359 354342
13509 354342 434704 398064 354375 283322 305804 358280 373239 408706 401367 361843 402856 406982
13497 406982 306809 345453 333218 355964 355264 328667 297305 305829 319422 338486 285598 241227
13485 241227 277782 282323 291664 207608 196134 206450 162842 206761 244037 190683 172640 251148
13473 251148 278524 315420 339188 290359 288946 241806 196525 179587 233168 250145 239557 176153
13461 176153 173575 271028 255768 258925 218105 175658 230248 252395 214603 198702 131398 201735
13449 201735 241682 192454 130459 115094 143777 55778 59565 119491 242707 175601 70797
$$ packed form
13532F32608n9180j6247J8093J1978r5033k1884l127l5597n1562L9163P264R2333
13520E18809K5495r0833n8954K2275n0845j2076Q8083J5856j4574r9877J0983
13509C54342Q0362l6640m3689p1053K2482N2476J4959L5467p339l9524M1013M126
13497D06982j00173L8644j2235K2746p00k6597l1362Q524J3593J9064n2888m4371
13485B41227L6555M541R341q4056j1474J0316m3608M3919L7276n3354j8043P8508
13473B51148K7376L6896K3768m8829j413m7140m5281j6938N3581J6977j0588o3404
13461A76153k578R7453j5260L157m0820m2447N4590K2147l7792j5901o7304P0337
13449B01735L9947m9228o1995j5365K8683q7999L787N9926J23216o7106j04804
$$ plain form
13438 70797 74557 53033 111828 172862 182562 126557 67887 -52358 945 124130 115868 16120
13426 16120 39372 117777 142580 170918 144496 25103 -70627 -69797 -4697 4856 5298 4494 2711
13413 2711 -35728 53354 72481 69841 20046 -8063 -23744 -103260 -134707 9826 125617 63117
13401 63117 70134 97016 81430 140756 149514 132934 85346 6604 5064 -15319 8603 20342
13389 20342 -1225 -30178 -15922 -38442 5655 28755 58547 47223 2420 -56103 42821 176525
13377 176525 103855 -317 81072 192642 132566 102559 66542 43030 31943 3187 55159
13366 55159 88448 121564 97423 165077 205213 166456 138764 146204 195082 150370 113680 77944
13354 77944 18813 -22417 28778 50212 35016 50885 46079 54148 23871 29735 -41827 61928
$$ packed form
13438G0797L760k1524N8795O1034R700n6005n8670j20245N3303J23185q262r9748
13426A6120K3252P8405K4803K8338k6422j19393r5730Q30O5100R553M42q04j783
13413B711l8439Q9082J9127k640m9795k8109j5681p9516l1447J44533J15791o2500
13401F3117P017K6882j5586N9326Q758j6580m7588p8742j540k0383K3922J1739
13389B0342k1567k8953J4256k2520M4097K3100K9792j1324m4803n8523R8924J33704
13377A76525p2670j04172Q1389J11570o0076l0007l6017k3512j1087k8756N1972
13366E5159L3289L3116k4141O7654M0136l8757k7692P440M8878m4712l6690l5736
13354G7944n9131m1230N1195K1434j5196J5869m806Q069l0277N864p1562J03755
$$ plain form
13342 61928 184587 256370 207742 169946 102602 129244 108998 -6571 43844 146449 120507
13331 120507 134672 89273 -13128 -61293 -42194 -89893 -9120 -27543 45792 148591 118646
13320 118646 119868 199677 236722 258178 257511 176726 159069 206173 137552 144881 325263 447848
13308 447848 533884 590258 802490 1037573 1338076 1705582 1958912 2005902 1962416 1820524
13298 1820524 1675503 1482511 1256187 1041647 844426 709978 650825 599915 561011 456846
13288 456846 403375 352495 421698 359846 294597 306066 235266 222195 322778 342997 351020
13277 351020 320860 370008 349394 244817 223329 149493 83695 91411 120382 170976 130928
13266 130928 164041 226347 163207 178819 180427 114517 100620 144592 261365 305059 255481
$$ packed form
13342F1928J22659P1783m8628l7796o7344K6642k0246j15569N0415J02605k5942
13331A20507J4165m5399j02401m8165J9099m7699Q0773j8423P3335J02799k9945
13320A18646J222P9809L7045K1456o67q0785j7657M7104o8621P329J80382J22585
13308D47848Q6036N6374K12232K35083L00503L67506K53330M6990m3486j41892
13298A820524j45021j92992k26324k14540j97221j34448n9153n0910l8904j04165
13288D56846n3471n0880O9203o1852o5249J1469p0800j3071J00583K0219Q023
13277C51020l0160M9148k0614j04577k1488p3836o5798P716K8971N0594m0048
13266A30928L3113O2306o3140J5612J608o5910j3897M3972J16773M3694m9578
$$ plain form
13255 255481 225578 276813 271365 260910 278172 249461 280830 286733 403059 412302 339313 285140
13243 285140 270286 305445 248152 178652 220474 258800 241751 189319 107628 195670 232731
13232 232731 248923 211042 105672 120714 156678 103567 63326 83128 82436 17620 -33275 -61022
13220 -61022 36662 164807 232261 254938 265484 259984 223577 182481 173000 232471 239374 197541
13208 197541 175404 220117 238206 212521 233184 233262 160644 2252 42140 106575 138567 101891
13196 101891 67959 205560 312547 260115 204954 193660 174070 122187 131554 88868 52597
13185 52597 -32807 -31807 27960 26990 24783 -7455 61690 118090 55597 21074 1201 79028
13173 79028 145900 134500 85184 121941 174654 198944 171596 217885 258938 171080 191492 194485
$$ packed form
13255B55481k9903N1235n448j0455J7262k8711L1369N903J16326R243p2989n4173
13243B85140j4854L5159n7293o9500M1822L8326j7049n2432q1691Q8042L7061
13232B32731J6192l7881j05370J5042L5964n3111m0241J9802o92o4816n0895k7747
13220f1022R7684J28145O7454K2677J0546n500l6407m1096r481N9471O903m1833
13208A97541k2137M4713J8089k5685K0663P8p2618j58392L9888O4435L1992l6676
13196A01891l3932J37601J06987n2432n5161j1294j9590n1883R367m2686l6271
13185E2597q5404J000N9767r70k207l2238O9145N6400o2493l4523j9873P7827
13173G9028O6872j1400m9316L6757N2713K4290k7348M6289M1053q7858K0412K993
$$ plain form
13161 194485 109386 113522 188256 146136 60326 65126 20859 67925 89516 34961 75822 -1364
13149 -1364 22009 80502 66736 67786 49873 1113 10507 65159 36949 -92032 -119190 -51173
13137 -51173 92874 146420 119797 57047 41281 -9360 -42206 -66657 -57556 -50163 -133528 -21603
13125 -21603 122745 146790 128743 180467 219836 166767 158911 171950 103463 76240 56406 19725
13113 19725 121682 116695 138822 83641 51044 109839 109358 36111 -68599 -75432 -8379 81312
13101 81312 12456 -88657 -157572 -140215 -76153 4552 36055 48171 117417 153820 91884
13090 91884 2575 8381 32849 85096 49035 29666 21352 15205 76222 193611 207153 92599
13078 92599 32214 35231 88325 102730 39401 41493 112628 128055 62814 2119 -67125 12214
$$ packed form
13161A94485q5099M136P4734m2120q5810M800m4267M7066K1591n4555M0861p7186
13149a364K3373N8493j3766J050j7913m8760R394N4652k8210j28981k7158O8017
13137e1173J44047N3546k6623o2750j5766n0641l2846k4451R101P393q3365J11925
13125b1603J44348K4045j8047N1724L9369n3069p856J3039o8487k7223j9834l6681
13113A9725J01957m987K2127n5181l2597N8795m81p3247j04710o833O7053Q9691
13101H1312o8856j01113o8915J7357O4062Q0705L1503J2116O9246L6403o1936
13090I1884q9309N806K4468N2247l6061j9369q314o147O1017J17389J3542j14554
13078I2599o0385L017N3094J4405o3329K092P1135J5427o5241o0695o9244P9339
$$ plain form
13066 12214 15923 -32766 -118090 -52030 -38363 -48154 -42768 -59028 -87299 -100534 -65991 16867
13054 16867 90081 27227 6999 112396 189079 224768 206987 229305 224814 137759 1652
13043 1652 -95774 -167917 -142329 -163410 -87326 -66514 -104233 -130995 -30113 -50670 49012 38245
13031 38245 -34501 -1625 102279 157527 145441 113679 54618 19267 78676 54870 6334
13020 6334 62937 138539 138831 192160 139278 64290 20483 28869 -11334 -1912 79335 147528 88260
13007 88260 -2608 -15859 2884 -69269 -165935 -98106 -40260 19164 87802 72191 36248 47297
12995 47297 80487 85380 54108 -24930 -37767 -28993 -14652 -19087 28609 40536 -34476 -32022
12983 -32022 -4600 -13831 -48421 21504 30663 -16902 -136573 -43457 74763 48996 53289 44330
$$ packed form
13066A2214L709m8689q5324O6060J3667r791N386j6260k8271j3235L4543Q2858
13054A6867P3214o2854k0228J05397P6683L5689j7781K2318m491q7055j36107
13043A652r7426p2143K5588k1081P6084K0812l7719k6762J00882k0557R9682j0767
13031C8245p2746L2876J03904N5248j2086l1762n9061l5351N9409k3806m8536
13020F334N6603P5602K92N3329n2882p4988m3807Q386m0203R422Q1247O8193n9268
13007H8260r0868j3251J8743p2153r6666O7829N7846N9424O8638j5611l5943J1049
12995D7297L3190M893l1272p9038j2837Q774J4341m435M7696J1927p5012K454
12983c2022K7422r231l4590O9925R159m7565j19671R3116J18220k5767M293q959
$$ plain form
12971 44330 17085 23699 30132 112740 117590 90569 108606 135645 130658 75676 -18608 -29373
12959 -29373 -77650 -145557 -35639 15852 42392 50904 -30519 -89605 -75628 -17399 -2069 -23751
12947 -23751 -8326 55283 84418 57485 -11455 -110632 -187446 -168393 -108878 -115290 -77443 -89384
12935 -89384 -88704 -56279 -71689 -133313 -149374 -41590 3154 -67244 -47659 -43787 -68032 -109629
12923 -109629 -52387 22121 18844 56008 54145 10533 -37139 -75590 -58574 -61740 -26826 -64283
12911 -64283 -82304 -55668 -77774 -99735 -11556 -30787 49780 42793 -39711 -27520 52161 87823
12899 87823 97719 88665 34464 29789 51157 80904 19413 -8109 -52798 -167757 -164170 -70793
12887 -70793 -95338 -144760 -88330 -152382 -211530 -228448 -175448 -136901 -84809 -114818 -102196 -66848
$$ packed form
12971D4330k7245O614O433Q2608M850k7021J8037K7039m987n4982r4284j0765
12959b9373m8277o7907J09918N1491K6540Q512q1423n9086J3977N8229J5330k1682
12947b3751J5425O3609K9135k6933o8940r9177p6814J9053N9515o412L7847j1941
12935h9384O80L2425j5410o1624j6061J07784M4744p0398J9585L872k4245m1597
12923a09629N7242P4508l277L7164j863m3612m7672l8451J7016l166L4914l7457
12911f4283j8021K6636k2106k1961Q8179j9231Q0567o987q2504J2191P9681L5662
12899H7823R896r054n4201m675K1368K9747o1491k7522m4689j14959L587R3377
12887g0793k4545m9422N6430o4052n9148j6918N3000L8547N2092l0009J2622L5348
$$ plain form
12875 -66848 -37371 60269 162853 148632 100099 84654 80810 66267 71090 46598 37224 54588
12863 54588 -17486 34975 -2905 119 -13686 8612 -11448 -4755 9389 -20689 -57088 13341
12851 13341 -23453 -8181 24375 30002 106918 120765 65444 29910 40822 126264 181052 243101
12839 243101 201319 68317 -60563 -10973 42425 -5377 -41527 -89329 -36497 -8656 19678
12828 19678 -70347 -90452 -113294 -127057 -89595 -90567 -67183 6840 -42936 -37551 77669 81945
12816 81945 112156 82616 16891 6543 30422 6723 5954 28346 -30865 -51405 94411 150009
12804 150009 96361 79828 90487 168771 131313 46791 -1660 -15674 24892 70621 56864
12793 56864 47709 11733 5037 -30500 -72040 -127580 -137740 -81128 33079 114099 92238 19724
$$ packed form
12875f6848K9477R7640J02584j4221m8533j5445l844j4543M823k4492r374J7364
12863E4588p2074N2461l7880L024j3805K2298k0060O693J4144l0078l6399P0429
12851A3341l6794J5272L2556N627P6916J3847n5321l5534J0912Q5442N4788O2049
12839B43101m1782j33002j28880M9590N3398m7802l6150m7802N2832K7841K8334
12828A9678r0025k0105k2842j3763L7462r72K3384P4023m9776N385J15220M276
12816H1945L0211k9540o5725j0348K3879k3699p69K2392n9211k0540J45816N5598
12804A50009n3648j6533J0659P8284l7458q4522m8451j4014M0566M5729j3757
12793E6864r155l5976o696l5537m1540n5540j0160N6612J14207Q1020k1861p2514
$$ plain form
12781 19724 -5125 32597 17627 -64761 -134956 -158603 -11778 29168 27319 67356 12456 3312
12769 3312 32229 -5587 -49970 -66416 98 10958 4561 9671 60484 87890 92478 130749
12757 130749 126622 142643 191326 138840 129324 155423 233174 291082 210127 164800 86664 101617
12745 101617 41445 -38114 -75629 -46014 8116 -30778 -106090 -70070 -30132 -46625 -162584
12734 -162584 -169028 -128207 -88915 -93254 -33675 3886 -3469 -30397 -13441 14016 22797 30352
12722 30352 -22661 -17371 -2361 25061 42814 -9466 -11410 35427 65611 7303 -69111 -27492
12710 -27492 56249 172117 177610 66450 92727 139141 131154 162379 67477 72996 43594 23145
12698 23145 -47917 -77300 -111712 -140797 -31130 -5697 -16653 -37860 -42390 -99703 -139551 -94087
$$ packed form
12781A9724k4849L7722j4970q2388p0195k3647J46825M0946j849M0037n4900r144
12769C312K8917l7816m4383j6446O6514J0860o397N110N0813K7406M588L8271
12757A30749m127J6021M8683n2486r516K6099P7751N7908q0955m5327p8136J4953
12745A01617o0172p9559l7515K9615N4130l8894p5312L6020L9938j6493j15959
12734a62584o444M0821L9292m339N9579L7561p355k6928J6956K7457Q781P555
12722C0352n3013N290J5010K7422J7753n2280j944M6837L0184n8308p6414M1619
12710b7492Q3741J15868N493j11160K6277M6414p987L1225r4902N519k9402k0449
12698B3145p1062k9383l4412k9085J09667K5433j0956k1207m530n7313l9848M5464
$$ plain form
12686 -94087 29030 65735 -1545 86017 75363 52968 44937 -18258 -50871 -2654 -43929 -121876
12674 -121876 -131648 -119259 -121033 -56314 -36045 20168 12286 58317 72241 80631 88097 -9107
12662 -9107 -52324 -90306 -78419 -54571 -138778 -191672 -98634 -27427 -41529 29019 -50993 -143432
12650 -143432 -73958 354 13820 -41537 10866 57999 106009 57602 1377 -20766 -33370
12639 -33370 -6408 75280 -2149 -14927 2015 38460 -20124 -121601 -122598 -45781 -77870 -108913
12627 -108913 -88918 -18334 5256 14822 23084 7528 40404 71937 106309 113741 92955 100995
12615 100995 121411 160367 191802 151018 45848 -13610 -77701 -71029 -84816 -69978 21012
12604 21012 21874 43493 39544 8620 34668 -68981 -59964 20393 -24340 -40510 -8122 26842
$$ packed form
12686i4087J23117L6705o7280Q7562j0654k2395q031o3195l2613M8217m1275p7947
12674a21876r772J2389j774O4719K0269N6213p882M6031J3924Q390P466r7204
12662i107m3217l7982J1887K3848q4207n2894R3038P1207j4102P0548q0012r2439
12650a43432O9474P4312J3466n5357N2403M7133M8010m8407n6225k2143j2604
12639c3370K6962Q1688p7429j2778J6942L6445n8584j01477r97P6817l2089l1043
12627a08913J9995P0584K3590R566Q262j5556L2876L1533L4372P432k0786Q040
12615A00995K0416L8956L1435m0784j05170n9458o4091O672j3787J4838R0990
12604B1012Q62K1619l949l0924K6048j03649R017Q0357m4733j6170L2388L4964
$$ plain form
12592 26842 8908 40584 -4855 -92085 -68164 50184 49609 55525 17689 -82469 -84355 -28444
12580 -28444 -24532 -17286 57890 112139 170420 112609 -7172 12226 57 132005 171935 117041
12568 117041 65059 -30371 -49459 54455 158252 223791 154474 26564 -63130 -60758 -14738
12557 -14738 30534 65327 28825 7682 -4957 -91414 -75398 -9688 95252 26509 -59613
12546 -59613 -39516 -26357 -15878 37656 98192 93974 46622 -28859 4350 -60723 -18409 22307
12534 22307 46788 26347 -36548 -23772 -20382 14788 -24492 -12606 44 77804 153143 94173
12522 94173 -28178 -57450 -25695 91039 66881 51070 51649 54605 69607 87240 95756 64656
12510 64656 14903 9476 -487 32459 31230 32400 59975 87619 81909 71026 -5702 -15426 -22742
$$ packed form
12592B6842j7934L1676m5439q7230K3921J18348n75N916l7836j00158j886N5911
12580b8444L912P246P5176N4249N8281n7811j19781J9398j2169J31948L9930n4894
12568A17041n1982r5430j9088J03914J03797O5539o9317j27910q9694K372M6020
12557a4738M5272L4793l6502k1143j2639q6457J6016O5710J04940o8743q6122
12546e9613K0097J3159J0479N3534O0536m218m7352p5481L3209o5073M2314M0716
12534B2307K4481k0441o2895J2776L390L5170l9280J1886J2650P7760P5339n8970
12522I4173j22351k9272L1755J16734k4158j5811N79K956J5002J7633Q516l1100
12510F4656m9753n427r963L2946j229J170K7575K7644n710j0883p6728r724p316
$$ plain form
12497 -22742 1117 27786 27660 -6701 -34655 -28572 87194 34943 1054 3509 -78616 -105902
12485 -105902 -73719 -1742 67318 78250 152465 125369 127805 142265 140261 96926 59825 103507
12473 103507 106349 61366 52985 46677 -41652 704 22952 9558 -84265 -50033 -50270 -140043
12461 -140043 -226301 -202419 -184323 -171171 -154010 -168287 -195014 -109067 -33409 -16594 -52579
12450 -52579 -10100 83351 29141 -42343 -26061 23781 96413 -2937 -63573 -53967 -45839 -52913
12438 -52913 -90348 -108707 -62963 -45923 -45493 7487 54064 21801 23643 97989 111597 128822
12426 128822 244525 313549 272877 221223 101771 -31372 -90714 -73237 -90067 -44515 -94877
12415 -94877 -104500 -42269 1343 -16892 9284 -11252 -53281 17287 19473 -28406 -38890 34505
$$ packed form
12497b2742K3859K6669j26l4361k7954O083J15766n2251l3889K455q2125k7286
12485a05902L2183P1977O9060J0932P4215k7096K436J4460k004m3335l7101M3682
12473A03507K842m4983q381o308q8329M2356K2248j3394r3823L4232k37q9773
12461a40043q6258K3882J8096J3152J7161j4277k6727Q5947P5658J6815l5985
12450e2579M2479R3451n4210p1484J6282M9842P2632r9350o0636R606Q128p074
12438e2913l7435j8359M5744J7040M30N2980M6577l2263J842P4346J3608J7225
12426A28822J15703O9024m0672n1654j19452j33143n9342J7477j6830M5552n0362
12415i4877r623O2231M3612j8235K6176k0536m2029P0568K186m7879j0484P3395
$$ plain form
12403 34505 126632 133936 67080 38464 -43280 -64650 -33173 27867 -2722 7173 27143 5203
12391 5203 -47839 -38431 -99063 -156221 -110604 -32873 24730 70712 21420 -57415 -80509 -73847
12379 -73847 -19363 46107 59894 -7942 21762 77755 50311 89677 103796 131270 70543 -47468
12367 -47468 -10348 85246 58567 35053 12832 -45285 10293 -75000 -134075 -15023 124230
12356 124230 122866 29881 9251 93431 76463 44581 28955 21777 12940 -3731 -113981 -130295
12344 -130295 -100503 -46011 -22908 17161 12495 77048 90052 63067 -3294 -67704 2888 64362
12332 64362 33174 -26729 -111792 -24556 96505 88657 73889 57117 21863 63726 -27456 -97258
12320 -97258 -177529 -111742 -36506 24220 23123 21006 14256 95910 126507 132349 126518 78344 47567
$$ packed form
12403C4505R2127P304o6856k8616q1744k1370L1477O1040l0589R895J9970k1940
12391E203n3042R408o0632n7158M5617P7731N7603M5982m9292p8835k3094O662
12379g3847N4484O5470J3787o7836K9704N5993k7444L9366J4119K7474o0727j18011
12367d7468L7120R5594k6679k3514k2221n8117N5578q5293n9075J19052J39253
12356A24230j364r2985k0630Q4180j6968l1882j5626p178q837j6671j10250j6314
12344a30295K9792N4492K3103M0069m666O4553J3004k6985o6361o4410P0592O1474
12332F4362l1188n9903q5063Q7236J21061p848j4768j6772l5254M1863r1182o9802
12320i7258q0271O5787P5236O0726j097k117o750Q1654L0597N842n831m8174l0777
$$ plain form
12307 47567 71691 74533 128384 117480 81558 57355 39265 63518 49572 65975 21285 -3588
12295 -3588 -37265 -11356 -35329 -69424 -142790 -110850 -83502 -27602 -19657 37398 69525 48753
12283 48753 63277 62022 -13684 13230 58342 57411 95878 41896 -11996 45662 111365 180436
12271 180436 203378 130065 89507 16680 -9338 3411 -4815 -20826 -55337 -79844 -124003 -154666
12259 -154666 -136578 -106327 -84162 -28593 40584 43418 -9462 23168 45465 35076 44856 19521
12247 19521 25779 33856 -51303 -22424 29360 1763 57556 39023 65224 20808 -57067 -50906
12235 -50906 -48724 -110338 -121934 -96927 -90676 -103933 1686 -6277 -15842 10157 31674 58084
12223 58084 95794 62248 102383 146057 200384 206343 141620 97525 -60901 -82032 -73936 -18587
$$ packed form
12307D7567K4124K842N3851j0904l5922k4203j8090K4253j3946J6403m4690k4873
12295c588l3677K5909k3973l4095p3366L1940K7348N5900P945N7055L2127k0772
12283D8753J4524j255p5706K6914M5112r31L8467n3982n3892N7658O5703O9071
12271A80436K2942p3313m0558p2827k6018J2749q226j6011l4511k4507m4159l0663
12259a54666J8088L0251K2165N5569O9177K834n2880L2630K2297j0389R780k5335
12247A9521O258Q077q5159K8879N1784k7597N5793j8533K6201m4416p7875O161
12235e0906K182o1614j1596K5007O251j3257J05619p963r565K5999K1517K6410
12223E8084L7710l3546M0135M3674N4327N959o4723m4095j58426k1131Q096N5349
$$ plain form
12211 -18587 22467 -426 -21050 -5104 36647 -19710 -77704 -61928 -14242 -20311 -39587 -46565
12199 -46565 -31396 -6416 57176 103880 167345 127299 63830 23320 -25734 78042 167531
12188 167531 144106 87654 66367 56241 63160 30542 -39936 -47324 50256 89491 74800 119949
12176 119949 68207 29264 93239 112734 106742 17429 -28161 -67255 -127939 -145026 -109066 -5808
12164 -5808 -8751 4125 -19005 -55265 -99033 -120449 -87868 -12885 -10 31809 -56199 -148015
12152 -148015 -175123 -107372 -30641 -46063 -58176 -42408 30438 42688 60087 118662 101368
12141 101368 107090 27679 35795 44831 41180 1075 -56976 -33475 25817 130199 168078 143942
12129 143942 89334 66442 73417 54085 59084 86643 162358 131761 131912 100384 70375 96269
$$ packed form
12211a8587M1054k2893k0624J5946M1751n6357n7994J5776M7686o069j9276o978
12199d6565J5169K4980O3592M6704O3465m0046o3469m0510m9054J03776Q9489
12188A67531k3425n6452k1287j0126O919l2618p0478p388R7580L9235j4691M5149
12176A19949n1742l8943O3975J9495n992q9313m5590l9094o0684j7087L5960J03258
12164e808k943J2876k3130l6260m3768k1416L2581P4983J2875L1819q8008r1816
12152a48015k7108O7751P6731j5422j2113J5768P2846J2250J7399N8575j7294
12141A01368N722p9411Q116R036l651m0105n8051K3501N9292J04382L7879k4136
12129A43942n4608k2892O975j9332M999K7559P5715l0597J51l1528l0009K5894
$$ plain form
12117 96269 104624 44336 20721 14392 -26110 -49757 -50739 -88866 -124242 -122799 -83971 -19901 63603
12104 63603 123444 139445 142681 165192 -14467 -83077 -32668 -38756 -15190 20318 102693 36685
12092 36685 -15616 15414 23057 9183 -8861 12216 42522 81260 66693 57054 72736 85426
12080 85426 99660 35399 113747 130911 146060 132607 75739 47055 12539 18687 16472 35158
12068 35158 23203 18811 2644 8944 13884 27831 31877 30409 20462 30628 -6529 -36132 8556
12055 8556 39949 -7415 38791 -7791 -42614 -5558 49467 59337 50519 127432 160971 154807
12043 154807 155741 108297 105581 134335 155197 112324 113771 127235 100274 139134 144842 108226
12031 108226 75000 28470 103619 55958 -29548 -7987 -8279 59154 97178 116911 81246 123564
$$ packed form
12117I6269Q355o0288k3615o329m0502k3647r82l8127l5376J443L8828O4070Q3504
12104F3603N9841J6001L236K2511j79659o8610N0409o088K3566L5508Q2375o6008
12092C6685n2301L1030P643j3874j8044K1077L0306L8738j4567r639J5682J2690
12080H5426J4234o4261P8348J7164J5149j3453n6868k8684l4516O148k215J8686
12068C5158j1955m392j6167O300M940J3947M046j468r947J0166l7157k9603M4688
12055H556L1393m7364M6206m6582l4823L7056N5025R870q818P6913L3539o164
12043A54807R34m7444k716K8754K0862m2873J447J3464k6961L8860N708l6616
12031A08226l3226m6530P5149m7661q5506K1561k92O7433L8024J9733l5665M2318
$$ plain form
12019 123564 108078 44453 56638 35794 3889 -22975 12666 -27815 -53654 -90431 -75962
12008 -75962 42686 87984 27804 58507 86015 97310 112956 142097 36621 -32178 -82085
11997 -82085 -107039 -90297 -75917 -60041 -35248 -25887 -45872 -32688 -31881 -6487 9201 37241
11985 37241 -2584 66143 120589 58478 33061 9662 7036 68586 114195 68946 46322 -87959
11973 -87959 -69651 -53906 -27463 -28772 18110 28632 15709 71306 158132 113007 79539 91022
11961 91022 96997 44417 33410 -8203 -118389 -141043 -153418 -118317 -67125 -30485 -35794 -80208
11949 -80208 -33328 -9387 17063 48994 -31161 -76828 -16497 32003 -43487 8021 73837 160085
11937 160085 128124 52234 84089 113563 81970 62358 36144 23417 -46327 -71561 18787
$$ packed form
12019A23564j5486o3625J2185k0844l1905k6864L5641m0481k5839l6777J4469
12008g5962J18648M5298o0180L0703K7508J1295J5646K9141j05476o8799m9907
11997h2085k4954J6742J4380J5876K4793R361j9985J3184Q07K5394J5688K8040
11985C7241l9825O8727N4446o2111k5417k3399k626O1550M5609m5249k2624j34281
11973h7959J8308J5745K6443j309M6882J0522j2923N5597Q6826m5125l3468J1483
11961I1022N975n2580j1007m1613j10186k2654j2375L5101N1192L6640n309m4414
11949h0208M6880K3941K6450L1931q0155m5667O0331M8500p5490N1508O5816Q6248
11937A60085l1961p5890L1855K9474l1593j9612k6214j2727o9744k5234R0348
$$ plain form
11926 18787 45686 76682 -3720 5850 -23314 12760 45326 73608 112432 96852 -407 -65734
11914 -65734 -5298 32782 56367 104202 47222 10494 36148 1421 17350 85611 136860 92097
11902 92097 55745 79853 72252 62978 101293 104436 47381 8587 -3525 43005 -6851 -30811
11890 -30811 -38869 -68068 -28791 -18762 85057 107410 88894 81758 -42686 -65029 -4328 36321
11878 36321 25886 72041 35889 37827 59796 57756 -11786 -30301 -107388 -167842 -138989 -51189
11866 -51189 100819 136428 118415 143413 100377 63029 24719 -29840 -100067 -96701 -12784 -102125
11854 -102125 -119264 -128364 -85437 -45592 -36527 -75932 -132466 -173383 -141248 -89749 -25514 46807
11842 46807 24892 138573 156326 108029 113174 156916 66988 22186 10234 -37178 -80096 -43376
$$ packed form
11926A8787K6899L0996q0402R570k9164L6074L2566K8282L8824j5580r7259o5327
11914f5734O0436L8080K3585M7835n6980l6728K5654l4727J5929O8261N1249m4763
11902I2097l6352K4108p601r274L8315L143n7055l8794j2112M6530m9856k3960
11890c0811q058k9199L9277J0029J03819K2353j8516p136j24444k2343O0701M0649
11878C6321j0435M6155l6152J938K1969k040o9542j8515p7087o0454K8853Q7800
11866e1189J52008L5609j8013K4998m3036l7348l8310n4559p0227L366Q3917q9341
11854a02125j7139r100M2927L9845R065l9405n6534m0917L2135N1499O4235P2321
11842D6807k1915J13681J7753m8297N145M3742q9928m4802j1952m7412m2918L6720
$$ plain form
11830 -43376 24883 26297 -39166 -114928 -100472 -45250 -101246 -58443 -26221 15049 49103 39267
11818 39267 15123 -59102 16664 8063 -50393 -8108 39790 32755 -1038 6215 32925 22384
11806 22384 5063 7290 -40365 51050 20930 -62638 -22789 394 -8437 -52982 -43829 5370
11794 5370 36457 36297 102295 110511 46763 23564 -15152 -20965 -34835 23194 -574 -52657 -29537
11781 -29537 -6373 74701 134216 154705 101831 81959 33169 -11617 32148 29843 32354 8286
11769 8286 -22734 12563 22008 28458 -20508 -114548 -182638 -136975 -107932 -33587 8405 -36392
11757 -36392 -50608 26831 40347 -8942 -35345 -52020 -17176 48387 -1869 -42019 -68611 -140694
11745 -140694 -125096 -98013 -82583 -29057 -7820 -81842 -91117 -100899 -79282 -62226 -88726 -103702
$$ packed form
11830d3376O8259J414o5463p5762J4456N5222n5996M2803L2222M1270L4054r836
11818C9267k4144p4225P5766q601n8456M2285M7898p035l3793P253K6710j0541
11806B2384j7321K227m7655R1415l0120q3568L9849K3183q831m4545R153M9199
11794E370L1087j60O5998Q216o3748k3199l8716n813j3870N8029k3768n2083K3120
11781b9537K3164Q1074N9515K0489n2874j9872m8790m4786M3765k305K511k4068
11769H286l1020L5297R445O450m8966r4040o8090M5663K9043P4345M1992m4797
11757c6392j4216P7439J3516m9289k6403j6675L4844O5563n0256m0150k6592p2083
11745a40694J5598K7083J5430N3526K1237p4022r275r782K1617J7056k6500j4976
$$ plain form
11733 -103702 -119224 -88979 -80526 -33072 1737 -1900 -71411 -41292 58441 19556 -70609 -81927
11721 -81927 -47728 -31235 84563 134727 81097 72892 116558 162350 112970 84805 4641 84826
11709 84826 155254 171112 69050 -116067 -120300 -28534 1853 -58417 -13339 90760 132790
11698 132790 125971 81632 13873 24371 15032 -15906 -16347 -2140 4337 -40677 -23607 22966
11686 22966 160019 67159 -30917 -11263 -52225 -129235 -76746 -78079 30026 75185 41638
11675 41638 21760 74716 114302 127090 75221 155994 129519 65406 67244 35982 32264 32425
11663 32425 -807 58493 62459 -56437 -54755 31585 -81363 -82040 -45315 -88260 -49935 -32514
11651 -32514 -60736 -86182 -62493 -57554 -13275 16213 44593 61884 138849 108228 19106 -2106
$$ packed form
11733a03702j5522L0245Q453M7454L4809l637o9511L0119R9733l8885r0165j1318
11721h1927L4199J6493J15798N0164n3630q205M3666M5792m9380k8165q0164Q0185
11709H4826P0428J5858j02062j85117m233R1766L0387o0270M5078J04099M2030
11698A32790o819m4339o7759J0498r339l0938m41J4207O477m5014J7070M6573
11686B2966J37053r2860r8076J9654m0962p7010N2489j333J08105M5159l3547
11675D1638j9878N2956L9586J2788n1869Q0773k6475o4113J838l1262l718J61
11663C2425l3232N9300L966j18896J682Q6340j12948o77L6725m2945L8325J7421
11651c2514k8222k5446K3689M939M4279K9488K8380J7291P6965l0621q9122k1212
$$ plain form
11639 -2106 -64292 -86042 -119953 -119478 -43074 96874 159531 110644 83121 136045 91175 34495
11627 34495 59271 72169 97718 52390 23717 6831 -13979 -61641 -170657 -95706 105761
11616 105761 132885 154409 145946 196032 112721 -33065 -49037 39366 43343 37007 24656 47607
11604 47607 94141 94586 42169 49244 9299 13504 -74701 -150817 -135868 -89808 -98554 -113241 -46352
11591 -46352 26989 108580 38899 -3106 -50989 -77938 11633 38432 98680 157821 136754 72826
11579 72826 119419 197658 126003 43444 31972 38995 75228 57165 -27809 -403 45469 -6149
11567 -6149 -60204 10104 74994 32837 -30645 -46142 -8099 27097 70307 -12248 18043 -15280
11555 -15280 -74704 -59842 -32753 -116758 -149733 -94058 -81137 -56697 -84018 -20318 63221 10706
$$ packed form
11639b106o2186k1750l3911M75P6404J39948O2657m8887k7523N2924m4870n6680
11627C4495K4776J2898K5549m5328k8673j6886k0810m7662j09016P4951K01467
11616A05761K7124K1524q463N0086q3311j45786j5972Q8403L977o336j2351K2951
11604D7607M6534M45n2417P075l9945M205q8205p6116J4949M6060q746j4687O6889
11591d6352P3341Q1591o9681m2005m7883k6949Q9571K6799O0248N9141k1067o3928
11579G2826M6593P8239p1655q2559j1472P023L6233j8063q4974K7406M5872n1618
11567f149n4055P0308O4890m2157o3482j5497L8043L5196M3210q2555L0291l3323
11555a5280n9424J4862K7089q4005l2975N5675J2921K4440k7321O3700Q3539n2515
$$ plain form
11543 10706 -43672 -11798 -6189 -17488 28820 62821 -35762 -80550 -82907 32064 52025 36432
11531 36432 -5759 12223 -20929 669 18642 -7682 -66852 -26289 -3594 43529 85860 109175
11519 109175 146845 57256 34248 44808 -77844 -65081 48822 193761 104185 -51863 -125596
11508 -125596 -74948 83298 68324 52672 98240 119808 89540 4712 -4548 -22516 -85505
11497 -85505 -162386 -151900 -52848 -11706 -12620 56071 35101 34573 -36242 -55819 -56408 -93602 -144414
11484 -144414 -165455 -71005 24022 5038 -5979 32825 22563 141218 191084 178137 149931
11473 149931 106704 74718 28036 -49219 -9037 67878 52713 19863 -5688 -5691 49514 29875
11461 29875 -29302 -11857 -11022 -15432 -52050 -83045 13798 44939 -9296 -51174 -155664 -96710
$$ packed form
11543A0706n4378L1874N609j1299M6308L4001r8583m4788k357J14971J9961j5593
11531C6432m2191J7982l3152K1598J7973k6324n9170M0563K2695M7123M2331K3315
11519A09175L7670q9589k3008J0560j22652J2763J13903J44939q9576j56048p3733
11508a25596N0648J58246j4974j5652M5568K1568l0268q4828r260j7968o2989
11497h5505p6881J0486R9052M1142r14O8691k0970n28p0815j9577n89l7194n0812
11484a44414k1041R4450R5027j8984j1017L8804j0262J18655M9866j2947k8206
11473A49931m3227l1986m6682p7255M0182P6915j5165l2850k5551lN5205j9639
11461B9875n9177J7445Q35m410l6618l0995R6843L1141n4235m1878j04490N8954
$$ plain form
11449 -96710 -2744 27181 373 12545 25424 34802 90954 106579 99341 160721 194522 148516
11437 148516 125828 156791 196790 201657 167207 123695 -36640 -33508 5862 62207 93202 38485
11425 38485 10089 -25207 12429 20570 -53198 -9122 36602 44864 83885 43973 17086 26083
11413 26083 -42577 -49628 28394 109785 46148 -108971 -138552 -56886 21580 99376 51033 -36466
11401 -36466 -88457 -22754 10443 -31684 -50865 -19754 -42802 -13691 -59810 -58547 -140750 -87198
11389 -87198 27203 26672 59763 46207 -16450 -69570 -35491 -67518 -51288 -107599 -53247 -39561
11377 -39561 -76290 -46111 -57687 -9272 -4713 29162 34823 51619 46763 7786 6093 -61303
11365 -61303 -209292 -189932 -115283 -79717 -36084 -63656 -96593 -103961 -142888 -101319 -31808 -56326
$$ packed form
11449i6710R3966K9925k6808J2172J2879R378N6152J5625p238O1380L3801m6006
11437A48516k2688L0963L9999M867l4450m3512j60335L132L9370N6345L0995n4717
11425C8485k8396l5296L7636Q141p3768M4076M5724Q262L9021l9912k6887Q997
11413B6083o8660p051P8022Q1391o3637j55119k9581Q1666P8466P7796m8343q7499
11401c6466n1991O5703L3197m2127j9181L1111k3048K9111m6119J263q2203N3552
11389h7198J14401n31L3091j3556o2657n3120L4079l2027J6230n6311N4352J3686
11377c9561l6729L0179j1576M8415M559L3875N661J6796m856l8977j693o7396
11365f1303j47989J9360P4649L5566M3633k7572l2937p368l8927M1569O9511k4518
$$ plain form
11353 -56326 -74178 -109830 -64092 -58972 -49311 3329 -79178 -102002 -145345 -214863 -187120 -100839
11341 -100839 -93811 -50385 -61167 -56775 681 36496 43755 -4652 -152359 -163546 -44875 28180
11329 28180 -16718 -40516 -28231 -14661 25248 39417 38151 40347 53429 95659 27476 25654
11317 25654 -40623 -108145 -172451 -180927 -206372 -166753 -130653 10252 4854 -33359 -83331 -71052
11305 -71052 -13455 6004 -36174 -66164 30436 56512 -55402 -79596 12706 71034 53531
11294 53531 56865 5466 -26960 26807 4783 -21738 -16162 -40304 -123039 -133771 -71359 -41319
11282 -41319 20739 -1194 -100789 -61219 34992 86221 13527 -35451 -7039 -25045 -13836 66113
11270 66113 103331 48281 60772 25891 -58295 -111021 -128657 -52278 16006 25539 15615 -66935
$$ packed form
11353e6326j7852l5652M5738N120R661N2640q2507k2824m3343o9518K7743Q6281
11341a00839P028M3426j0782M392N7456L5815P259m8407j47707j1187J18671P3055
11329B8180m4898k3798J2285J3570L9909J4169j266K196J3082M2230o8183j822
11317B5654o6277o7522o4306q476k5445L9619L6100J40905n398l8213m9972J2279
11305g1052N7597J9459m2178k9990R6600K6076j11914k4194R2302N8328j7503
11294E3531L334n1399l2426N3767k2024k6521N576k4142q2735j0732O2412L0040
11282d1319O2058k1933r9595L9570R6211N1229p2694m8978K8412j8006J1209P9949
11270F6113L7218n5050J2491l4881q4186n2726j7636P6379O8284R533r924q2550
$$ plain form
11258 -66935 -202379 -197247 -136897 -76008 -62080 -49211 -21740 43149 -12090 -64737 -48075 -17786
11246 -17786 -64139 -157003 -238968 -142622 -27947 19225 -37948 -51253 11059 79144 95205
11235 95205 63765 -28899 -46600 -38509 -89378 -139136 -124095 -96967 -48022 -109818 -89518 -52972
11223 -52972 -23684 -44556 -50300 -96283 -121678 -98737 -90961 -97966 -125343 -86321 -32711 19480
11211 19480 98475 77891 32832 -76086 -29100 44930 46165 56626 29683 -383 -31530 22913
11199 22913 84536 53076 33067 34438 -8434 -52848 -21567 55820 116018 134519 50579 -57711
11187 -57711 -125241 -88971 -14872 69863 198632 188461 57853 -12485 -32892 3191 -52147
11176 -52147 -85252 -76890 -64019 -134329 -206276 -207275 -196554 -132109 -6887 -48563 -100668 -65951
$$ packed form
11258f6935j35444N132O0350O0889J3928J2869K7471O4889n5239n2647J6662L0289
11246a7786m6353r2864q1965R6346J14675M7172n7173j3305O2312O8085J6061
11235I5205l1440r2664j7701Q091n0869m9758J5041K7128M8945o1796K0300L6546
11223e2972K9288k0872n744m5983k5395K2941P776p005k7377L9022N3610N2191
11211A9480P8995k0584m5059j08918M6986P4030J235J0461k6943l0066l1147N4443
11199B2913O1623l1460k0009J371m2872m4414L1281P7387O0198J8501q3940j08290
11187e7711o7530L6270P4099Q4735J28769j0171j30608p0338k0407L6083n5338
11176e2147l3105Q362J2871p0310p1947r99J0721O4445J25222m1676n2105L4717
$$ plain form
11164 -65951 -14673 -50290 -101675 -100196 -74316 -1424 43280 13249 627 19338 -71480 -35409
11152 -35409 -15114 -45165 15514 34231 -11854 -22574 6313 -34432 -7055 -13303 -95113 -126820
11140 -126820 -41954 -41425 -18977 40221 -21438 24905 95286 -30101 -143367 -79669 5216
11129 5216 4748 13257 55455 115 -69900 -105757 -113620 -52942 -60571 -85012 -44796 19138 56230
11116 56230 43835 31933 -23987 -67488 -75621 -58841 -53649 -55397 -150791 -93226 -19196 42063
11104 42063 -22431 -74077 -143881 -149440 -171010 -59594 -46415 20689 -15635 -104243 -125923 -153346
11092 -153346 -206961 -177872 -101322 -31100 -39308 -142666 -209851 -164904 -135675 -160023 -180939
11081 -180939 -178681 -85393 -79204 -157168 -160284 -105602 -129997 -149354 -137265 -98342 -40478 40701
$$ packed form
11164f5951N1278l5617n1385J479K5880P2892M4704l0031j2622J8711r0818L6071
11152c5409K0295l0051O0679J8717m6085j0720K8887m0745K7377o248q1810l1707
11140a26820Q4866N29K2448N9198o1659M6343P0381j25387j13266O3698Q4885
11129E216m68Q509M2198n5340p0015l5857p863O0678p629k4441M0216O3934L7092
11116E6230j2395j1902n5920m3501q133J6780N192j748r5394N7565P4030O1259
11104D2063o4494n1646o9804n559k1570J11416J3179O7104l6324q8608k1680k7423
11092a53346n3615K9089P6550P0222q208j03358o7185M4947K9229k4348k0916
11081a80939K258R3288O189p7964l116N4682k4395j9357J2089L8923N7864Q1179
$$ plain form
11069 40701 21716 58659 23453 -70616 -112780 -161501 -159533 -112196 -112410 -115134 -86304 -32035
11057 -32035 13261 22587 -51797 -25024 14366 53223 4950 22327 94537 118844 27166 4767
11045 4767 71044 89677 80426 39898 -9814 25428 -21831 -13672 -30057 5778 -2509 2226 9917
11032 9917 14611 -21555 -24103 62435 2535 -27593 49098 102294 108447 139000 100506 77897
11020 77897 49581 91093 83419 62036 47038 -76185 -204778 -179637 -87366 -12488 -33420
11009 -33420 -37887 59048 -63140 -108050 -73673 -43029 -9056 16100 16903 -6219 -11644 28363
10997 28363 69997 54933 71957 16655 58324 79563 42835 24899 64780 -26925 -129487
10986 -129487 -82515 13622 104442 73522 30407 35867 121555 156619 107281 14214 -74920 14444
$$ packed form
11069D0701j8985L6943l5206r4069m2164m8721J968M7337k14k724K8830N4269
11057c2035M5296R326p4384K6773L9390L8857m8273J7377P2210K4307r1678k2399
11045D767O6277J8633r251m0528m9712L5242m7259Q159j6385L5835q287M735P691
11032I917M694l6166k548Q6538n9900l0128P6691N3196O153L0553l8494k2609
11020G7897k8316M1512p674k1383j4998j23223j28593K5141R2271P4878k0932
11009c3420m467R6935j22188m4910L4377L0644L3973K5156Q03k3122n425M0007
10997B8363M1634j5064J7024n5302M1669K1239l6728j7936L9881r1705j02562
10986a29487M6972R6137R0820l0920m3115N460Q5688L5064m9338r3067q9134Q9364
$$ plain form
10974 14444 90877 115866 172424 79069 26439 127668 88405 84496 103755 146865 127468 98528
10962 98528 71109 19846 -83368 -85864 28033 19283 -41595 -71951 6857 24479 50527 23454
10950 23454 -60238 -135893 -144713 3309 104474 71716 42016 53163 40117 47328 22696 -68713
10938 -68713 -131174 -179865 -214521 -158071 -84249 43870 124843 33374 -60525 -86148 -72417
10927 -72417 -88989 -73622 -42083 -43462 -31027 -32789 -25746 -53732 -23166 -971 3912 -10789
10915 -10789 22982 -25102 -54206 15354 -10893 -36685 6112 66603 44711 1710 -82634 -81034
10903 -81034 -128476 -145543 -102831 -115083 -40710 -28491 -72694 -130224 -89319 28084 137616
10892 137616 124194 55559 35954 -57746 -114961 -93569 12407 -25821 -50939 -20451 42915
$$ packed form
10974A4444P6433K4989N6558r3355n2630J01229l9263l909J9259M3110j9397k8940
10962I8528k7419n1263j03214k496J13897q750o0878l0356P8808J7622K6048k7073
10950B3454q3692p5655q820J48022J01165l2758k9700J1147j3046P211k4632r1409
10938f8713o2461m8691l4656N6450P3822J28119Q0973r1469r3899k5623J3731
10927g2417j6572J5367L1539j379J2435j762P043k7986L0566K2195M883j4701
10915a0789L3771m8084k9104O9560k6247k5792M2797O0491k1892m3001q4344J600
10903h1034m7442j7067M2712j2252P4373J2219m4203n7530M0905J17403J09532
10892A37616j3422o8635j9605r3700n7215K1392J05976l8228k5118L0488O3366
$$ plain form
10881 42915 -14280 -88719 -76604 -46197 -58799 -99078 -58035 -61444 17043 41748 -1116 -60085
10869 -60085 -58485 -63494 -80573 -40217 -102585 -85432 1745 -43551 -81938 -43204 -71481 -100006
10857 -100006 -123903 -87754 -94706 -194843 -286218 -257838 -211307 -180383 -144599 -92991 50632
10846 50632 122157 65254 18714 15773 -6569 -69728 -99356 -14315 38116 -35084 -66496 -45763
10834 -45763 -128502 -85536 -60606 -774 65437 47885 75843 12153 -21479 8031 -52398 -43483
10822 -43483 -89137 -14485 62276 16744 21265 -3590 57758 17050 -29083 -16272 48455 -19123
10810 -19123 -89807 -51376 24450 -29938 -75540 -67255 -113299 -93233 -39569 -100828 -62511 92762
10798 92762 162464 188810 238562 212233 121917 101476 112439 125445 30141 -40923 -142018
$$ packed form
10881D2915n7195p4439J2115L0407j2602m0279M1043l409P8487K4705m2864n8969
10869f0085J600n009j7079M0356o2368J7153Q7177m5296l8387L8734k8277k8525
10857a00006k3897L6149o952j00137r1375K8380M6531L0924L5784N1608J43623
10846E0632P1525n6903m6540k941k2342o3159k9628Q5041N2431p3200l1412K0733
10834d5763q2739M2966K4930N9832O6211j7552K7958o3690l3632K9510o0429Q915
10822d3483m5654P4652P6761m5532M521k4855O1348m0708m6133J2811O4727o7578
10810a9123p0684L8431P5826n4388m5602Q285m6044K0066N3664o1259L8317J55273
10798I2762O9702K6346M9752k6329r0316k0441J0963J3006r5304p1064j01095
$$ plain form
10787 -142018 -77117 -65661 54912 139805 167950 133204 152716 135281 147661 95836 12484
10776 12484 -71649 -102653 -170039 -100389 2329 -30499 30090 37277 -78476 -94202 -6230
10765 -6230 -56826 -159556 -160554 -49366 33197 76909 93255 702 -112088 -98420 -36935 -4196
10753 -4196 46590 57883 -27203 -85225 -111154 -86544 6587 26453 63514 -5083 -13374 -37256
10741 -37256 -24642 -50292 -73013 -17659 -14330 -14835 13760 31665 27997 -18292 -89323 -83301 -19583
10728 -19583 5120 -84890 -114680 -46003 21084 29745 59605 82565 13065 19694 77916 44187
10716 44187 37875 42868 52211 79812 74717 -24270 -23813 -51123 -47100 -22104 -93616 -102086 -50352
10703 -50352 -129756 -164694 -77959 -102997 -80333 -14366 -21208 -89371 -74445 -71412 -101829 -103723
$$ packed form
10787a42018O4901J1456J20573Q4893K8145l4746J9512j7435J2380n1825q3352
10776A2484q4133l1004o7386O9650J02718l2828O0589P187j15753j5726Q7972
10765f230n0596j02730r98J11188Q2563M3712J6346r2553j12790J3668O1485L2739
10753d196N0786J1293q5086n8022k5929K4610R3131J9866L7061o8597q291k3882
10741c7256J2614k5650k2721N5354L329n05K8595J7905l668m6289p1031O022O3718
10728a9583K4703r0010k9790O8677O7087Q661K9860K2960o9500O629N8222l3729
10716D4187o312M993R343K7601n095r8987M57k7310M023K4996p1512q470N1734
10703e0352p9404l4938Q6735k5038K2664O5967o842o8163J4926L033l0417j894
$$ plain form
10691 -103723 -154174 -134967 -129080 -129408 -138064 -169163 -104988 -67103 -48075 25633 47544 81137
10679 81137 79253 96851 64695 83663 101436 111775 98648 75690 113025 101472 41993 55753
10667 55753 42214 4002 -45174 -76712 -56201 -79811 -134027 -88132 -93606 -132399 -196929 -137571
10655 -137571 -35832 -21189 -12656 42065 92729 62482 -26833 -71793 -89271 2082 36664
10644 36664 80311 120719 145723 53882 6995 -22745 -26553 -66908 -66480 -30119 -37763 -48818
10632 -48818 11058 48705 24013 31669 51945 6310 -4056 58838 46120 16299 -14842 -59652
10620 -59652 -91536 -117138 -162822 -183667 -74696 -24422 -57179 -119526 -95091 -7047 75148
10609 75148 32917 77311 142738 101561 95629 91947 24506 -35994 -10951 -30512 -98670 -106432
$$ packed form
10691a03723n0451J9207N887l28q656l1099O4175L7885J9028P3708K1911L3593
10679H1137j884J7598l2156J8968J7773J0339j3127k2958L7335j1553n9479J3760
10667E5753j3539l8212m9176l1538K0511k3610n4216M5895n474l8793o4530N9358
10655a37571J01739J4643Q533N4721N0664l0247q9315m4960j7478R1353L4582
10644C6664M3647M0408K5004r1841m6887k9740l808m0355M28L6361p644j1055
10632d8818N9876L7647k4692P656K0276m5635j0366O2894j2718k9821l1141m4810
10620e9652l1884k5602m5684k0845J08971N0274l2757o2347K4435Q8044Q2195
10609G5148m2231M4394O5427m1177n932l682o7441o0500K5043j9561o8158p762
$$ plain form
10597 -106432 -79380 -3952 25794 46410 82917 25749 -20896 -4924 -24063 -65045 -59581 -73968
10585 -73968 -63905 -65748 -98223 -56334 -78111 -94501 -27223 56008 95305 68051 59764 75482
10573 75482 2737 -50721 45772 62815 -3693 -25517 53889 47135 20185 62175 99720 108604
10561 108604 132301 163182 117402 72135 55901 20679 89583 124086 98464 60688 34891
10550 34891 50640 22210 -3269 10504 -39682 -97521 -63089 -13322 -33911 -38820 41758 80976
10538 80976 -49742 -51995 -7744 31469 79166 66901 -28820 -56628 -127175 -86513 -46588 2456
10526 2456 62442 86614 205115 219587 117556 19119 -18173 -91624 -99670 -59876 21424 50859
10514 50859 74808 92275 18997 31952 10586 21426 -107622 -132135 35740 114979 72414
$$ packed form
10597a06432K7052P5428K9746K0616L6507n7168m6645J5972j9139m0982N464j4387
10585g3968J0063j843l2475M1889k1777j6390O7278Q3231L9297k7254q287J5718
10573G5482p2745n3458R6493J7043o6508k1824P9406o754k6950M1990L7545Q884
10561A08604K3697L0881m5780m5267j6234l5222O8904L4503k5622l7776k5797
10550C4891J5749k8430k5479J3773n0186n7839L4432M9767k0589m909Q0578L9218
10538H0976j30718k253M4251L9213M7697j2265r5721k7808p0547M0662L9925M9044
10526B456N9986K4172J18501J4472j02031r8437l7292p3451q046L9794Q1300K9435
10514E0859K3949J7467p3278J2955k1366J0840j29048k4513J67875P9239m2565
$$ plain form
10503 72414 59414 59271 69431 18568 -72641 -23696 33348 107452 101932 43601 9268 22549
10491 22549 18581 11522 -22649 -31479 -20656 10362 3454 -6688 28081 75514 146847 183120
10479 183120 196379 208117 83538 42679 85619 95929 83639 -15254 18416 36355 28340
10468 28340 -38519 -82726 -171441 -186527 -44425 -37244 23043 81304 95778 81320 71312 -11202
10456 -11202 -121943 -146991 -117794 -107150 20248 111890 78915 -75652 -143842 -134761 -138845
10445 -138845 -84328 13262 97108 40105 15341 -5542 29211 33966 17464 42117 12482 -40842
10433 -40842 -25506 -34689 -10338 -6227 63953 84407 17266 66249 106309 53740 35057 29017
10421 29017 -6884 -75859 -94369 -151553 -154049 -105716 -62146 -53724 -26684 -16039 21225 43024
$$ packed form
10503G2414j3000j43J0160n0863r1209M8945N7044P4104n520n8331l4333J3281
10491B2549l968p059l4171q830J0823L1018o908j0142L4769M7433P1333L6273
10479A83120J3259J1738j24579m0859M2940J0310j2290r8893L3670J7939q015
10468B8340o6859m4207q8715j5086J42102P181O0287N8261J4474j4458j0008q2514
10456a1202j10741k5048K9197J0644J27398R1642l2975j54567o8190R081m084
10445a38845N4517R7590Q3846n7003k4764k0883L4753M755j6502K4653k9635n3324
10433d0842J5336r183K4351M111P0180K0454o7141M8983M0060n2569j8683o040
10421B9017l5901o8975j8510n7184k496M8333M3570Q422K7040J0645L7264K1799
$$ plain form
10409 43024 -1227 -51906 -122684 -121718 -133460 -121001 -15109 88434 128094 56033 49753 46060
10397 46060 57992 -8845 -55939 29354 19437 -10201 65747 88454 52422 67110 111918 103398
10385 103398 25883 37492 31576 33752 -8416 -73795 -94654 -127616 -61104 -27702 -62764 -131857
10373 -131857 -188671 -135952 -72508 -11033 81622 27897 -87236 -27746 58316 35744 -59832
10362 -59832 -42542 69851 165096 69369 -30816 -117828 -81643 -101603 -27290 -64658 -101780
10351 -101780 -137620 -120955 -50058 5388 32854 48377 25833 9846 -43887 -72721 -69958 -64604
10339 -64604 -6826 -42977 -11397 -54495 -39872 -70613 -115646 -65360 -30170 -62547 -148175 -109167
10327 -109167 -110592 -6247 2146 -23796 19230 17392 -18400 37864 91529 67198 -88056 -196692
$$ packed form
10409D3024m4251n0679p0778R66j1742J2459J05892J03543L9660p2061o280l693
10397D6060J1932o6837m7094Q5293r917k9638P5948K2707l6032J4688M4808q520
10385A03398p7515J1609n916K176m2168o5379k0859l2962O6512L3402l5062o9093
10373a31857n6814N2719O3444O1475R2655n3725j15133N9490Q6062k2572r5576
10362e9832J7290J12393R5245r5727j00185q7012L6185j9960P4313l7368l7122
10351a01780l5840J6665P0897N5446K7466J5523k2544j5987n3733k8834K763N354
10339f4604N7778l6151L1580m3098J4623l0741m5033N0286L5190l2377q5628L9008
10327a09167j425J04345Q393k5942M3026j838l5792N6264N3665k4331j55254j08636
$$ plain form
10315 -196692 -179669 -93762 -25490 15445 11412 68231 44335 16961 45418 -48831 -109184 -28024
10303 -28024 -51214 -60285 -67599 -26191 15406 44018 7145 -54442 -52072 -30307 -51112 -55078
10291 -55078 -78322 -60538 -47084 -16495 75519 58335 121051 88983 104480 53280 18511 76431
10279 76431 3620 14320 66164 40595 -76410 -116599 -29378 -3483 17443 -2166 122599
10268 122599 119306 12152 -42221 13059 -35342 -95075 -33956 26618 -34570 -69919 -69612 -106566
10256 -106566 -98952 -48313 -127869 -145470 -136619 -89253 -46901 21642 46128 -3230 17409 5399
10244 5399 -60911 -74823 -84072 -45390 -1723 -92823 -190977 -167102 -12816 -6404 -55063 -78650
10232 -78650 -144048 -114353 -129539 -117313 -71670 -37585 47490 97631 60614 77277 111061 69340
$$ packed form
10315a96692J7023Q5907O8272M0935m033N6819k3896k7374K8457r4249o0353Q1160
10303b8024k3190r071p314M1408M1597K8612l6873o1587K370K1765k0805l966
10291e5078k3244J7784J3454L0589R2014j7184O2716l2068J5497n1200l4769N7920
10279G6431p2811J0700N1844k5569j17005m0189Q7221K5895K0926j9609J24765
10268A22599l293j07154n4373N5280m8401n9733O1119O0574o1188l5349L07l6954
10256a06566P614N0639p9556j7601Q851M7366M2352O8543K4486m9358K0639j2010
10244E399o6310j3912r249L8682M3667r1100r8154K3875J54286O412m8659k3587
10232g8650o5398K9695j5186J2226M5643L4085Q5075N0141l7017J6663L3784m1721
$$ plain form
10220 69340 18000 10984 7417 6934 7223 61270 83732 58054 27609 41345 -61170 -61419 -71915
10207 -71915 -102426 -84949 -32590 47284 -13380 -80183 -73034 -62826 23700 83221 21116 5106
10195 5106 -13663 57363 96478 135084 113792 8577 -17293 -29711 -105665 -99026 -73453 -28493
10183 -28493 -137693 -181830 -128690 -93406 -21523 -27721 -45260 -40904 -11959 -12912 -17529 14405
10171 14405 2783 80203 94114 130848 135571 82882 23985 -27086 18073 26939 -79327 -8572
10159 -8572 64975 124096 142443 37935 4112 -3060 -68652 -36966 37230 56678 83440 41684
10147 41684 -16848 17320 2530 -81636 5947 56784 24125 11013 77349 135141 73132 18513
10135 18513 57277 107831 108965 49944 88092 55480 -16892 -72321 -28100 64497 120604 77722
$$ packed form
10220F9340n1340p016l567m83K89N4047K2462k5678l0445J3736j02515k49j0496
10207g1915l0511J7477N2359P9874o0664o6803P149J0208Q6526N9521o2105j6010
10195E106j8769P1026L9115L8606k1292j05215k5870j2418p5954O639K5573M4960
10183b8493j09200m4137N3140L5284P1883o198j7539M356K8945r53m617L1934
10171A4405j1622P7420J3911L6734M723n2689n8897n1071M5159Q866j06266P0755
10159h572P3547N9121J8347j04508l3823p172o5592L1686P4196J9448K6762m1756
10147D1684n8532L4168j4790q4166Q7583N0837l2659j3112O6336N7792o2009n4619
10135A8513L8764N0554J134n9021L8148l2612p2372n5429M4221R2597N6107m2882
$$ plain form
10123 77722 -44570 -124663 -114209 -26937 -7503 -76219 -27586 -82465 -177233 -89577 -57284
10112 -57284 -57404 -97139 -111326 -163352 -229716 -301417 -277335 -209191 -211547 -149810 -110807 -169819
10100 -169819 -94044 -139135 -93493 -65869 -45841 -72334 -47902 -49526 -35908 47363 -46809 -96580
10088 -96580 -49195 96425 72842 68511 31724 -86787 -124284 -165274 -60500 -30360 -38843
10077 -38843 -5957 23867 20419 -22903 -42980 -11651 33699 18952 -61550 -25946 13742 -23318
10065 -23318 -8942 68100 59969 105728 23309 -161279 -132513 -48247 -3571 -61507 -102718 -82697
10053 -82697 -95381 -77742 -73292 -43625 -66844 -90663 -122168 -76427 -66973 -62019 -66114 -179270
10041 -179270 -233978 -187318 -81983 -28605 -73058 -49576 -7067 -52289 -53904 -57779 -2560 61267
$$ packed form
10123G7722j22292q0093J0454Q7272J9434o8716M8633n4879r4768Q7656L2293
10112e7284j20l9735j4187n2026o6364p1701K4082O8144k356O1737L9003n9012
10100a69819P5775m5091M5642K7624K0028k6493K4432j624J3618Q3271r4172m9771
10088i6580M7385J45620k3583m331l6787j18511l7497m0990J04774L0140q483
10077c8843L2886K9824l448m3322k0077L1329M5350j4747q0502L5604L9688l7060
10065b3318J4376P7042q131M5759q2419j84588K8766Q4266M4676n7936m1211K0021
10053h2697j2684J7639M450K9667k3219k3819l1505M5741R454M954m095j13156
10041a79270n4708M6660J05335N3378m4453K3482M2509m5222j615l875N5219O3827
$$ plain form
10029 61267 27183 -85052 -106167 -99302 -120196 -73253 -24183 -46182 -68789 -59196 63724 90770
10017 90770 45979 48234 -72456 -183390 -216643 -181869 -158668 -26840 71225 111639 213346
10006 213346 227115 149181 75104 26817 -44125 -5575 96511 122661 6450 -53410 -120875
9995 -120875 -211188 -234236 -120679 -62442 -17658 -50888 -118961 -42088 26684 9893 6520 28806
9983 28806 17534 24888 -25492 42485 141625 132652 135562 273996 387401 516868 770997 1234643
9971 1234643 1919417 2925344 4016461 4831199 5096473 4810392 3942036 2865861 2025434
9962 2025434 1493695 1182245 986297 805611 738378 778474 745960 616411 573990 536137
9952 536137 523931 459348 429014 374278 307297 322978 283746 270058 337258 352848 279146 281933
$$ packed form
10029F1267l4084j12235k1115O865k0894M6943M9070k1999k2607R593J22920K7046
10017I0770m4791K255j20690j10934l3253L4774K3201J31828R8065M0414J01707
10006B13346J3769p7934p4077m8287p0942L8550J02086K6150j16211n9860o7465
9995a20875r0313k3048J13557N8237M4784l3230o8073P6873O8772j6791l373K2286
9983B8806j1272P354n0380O7977R9140q973K910J38434J13405J29467K54129M63646
9971A234643O84774J005927J091117Q14738K65274k86081q68356j076175q40427
9962B025434n31739l11450j95948j80686o7233M0096l2514j29549m2421l7853
9952E36137j2206o4583l0334n4736o6981J5681l9232j3688O7200J5590p3702K787
$$ plain form
9940 281933 293853 296303 278123 207397 142428 174057 167663 121040 139009 208124 259511 313655
9928 313655 346522 234167 122313 170374 238960 239819 261687 222087 175652 108854 51311 26500
9916 26500 111984 253728 194881 63162 39334 62449 90879 39646 -63395 -100490 -10768
9905 -10768 23624 55219 65737 90858 154681 159504 63759 52811 82874 38662 57959 125426
9893 125426 142000 187448 229350 168328 80244 50906 85455 131951 97539 45263 10584 -55083
9881 -55083 -1157 3409 -30464 -5724 -2299 -6890 -2466 115876 180199 134747 90363 3039
9869 3039 18929 101716 138128 104339 99058 103068 186861 215367 269689 360918 487571 591845
9857 591845 704339 754393 768873 628677 394293 197171 100827 20009 42275 97649 66969
$$ packed form
9940B81933J1920K450j8180p0726o4969L1629o394m6623J7969O9115N1387N4144
9928C13655L2867j12355j11854M8061O8586Q59K1868l9600m6435o6798n7543k4811
9916B6500Q5484J41744n8847j31719k3828K3115K8430n1233j03041l7095Q9722
9905a0768L4392L1595J0518K5121O3823M823r5745j0948L0063m4212J9297O7467
9893A25426J6574M5448M1902o1022q8084k9338L4549M6496l4412n2276l4679o5667
9881e5083N3926M566l3873K4740L425m591M424J18342O4323m5452m4384q7324
9869C039J5890Q2787L6412l3789n281M010Q3793K8506N4322R1229J26653J04274
9857E91845J12494N0054J4480j40196k34384j97122r6344q0818K2266N5374l0680
$$ plain form
9846 66969 94734 100849 37158 62032 167648 161340 140512 95327 23840 43963 174857 152345
9834 152345 130953 173532 121147 6327 -79415 -97515 -46966 16404 24388 415 80024 97806
9822 97806 68167 33224 16894 -1235 -62085 -7941 24567 -85309 -137860 -21705 36509
9811 36509 -4747 54852 113582 -3370 -59294 -26065 -55376 -31194 -17568 74460 35285 -52352
9799 -52352 -45771 -23807 -33283 -28958 -279 13716 56468 8308 34216 38192 16358 17822 24888
9786 24888 26467 48456 110600 80781 36510 47165 56995 97035 113950 75386 37550 -47295
9774 -47295 -48008 -28293 -50908 -57980 -61812 -71807 -22433 30233 -4721 71484 166941 39414 -38614
9761 -38614 -61922 -17772 32407 105452 81390 25126 23440 -41705 -44888 -33164 -99722 -59372
$$ packed form
9846F6969K7765O115o3691K4874J05616o308k0828m5185p1487K0123J30894k2512
9834A52345k1392M2579n2385j14820q5742j8100N0549O3370P984k3973P9609J7782
9822I7806k9639l4943j6330j8129o0850N4144L2508j09876n2551J16155N8214
9811C6509m1256N9599N8730j16952n5924L3229k9311K4182J3626R2028l9175q7637
9799e2352O581K1964r476M325K8679J3995M2752m8160K5908L976k1834J464P066
9786B4888J579K1989O2144k9819m4271J0655R830M0040J6915l8564l7836q4845
9774d7295p13J9715k2615p072l832r995M9374N2666l4954P6205R5457j27527p8028
9761c8614k3308M4150N0179P3045k4062n6264j686o5145l183J1724o6558M0350
$$ plain form
9749 -59372 17314 -29664 -13602 32704 11485 812 22947 -10576 -96152 -37509 -65394 -150608
9737 -150608 -94357 -36779 -36463 -78516 -12227 -64899 -62128 4647 87367 58989 9959 -22116
9725 -22116 50109 34060 -1889 -8192 -19042 -32695 -5782 -72771 -74185 33949 -12381 7071
9713 7071 87022 79357 28853 -33083 -40329 -154075 -195275 -82706 569 57333 97580 75881
9701 75881 22839 59891 101859 106739 118353 51349 66458 116429 109928 39262 28664 16331
9689 16331 770 50270 85828 92957 115692 95127 23207 32090 -10456 23942 76035 78588
9677 78588 86333 66294 23725 46558 -18524 -51805 37015 118238 141803 113895 103232 103970
9665 103970 130466 95479 -4682 -21815 57098 107491 147956 241453 312860 202897 54364
$$ packed form
9749e9372P6686m6978J6062M6306k1219j0673K2135l3523q5576N8643k7885q5214
9737a50608N6251N7578L16m2053O6289n2672K771O6775Q2720k8378m9030l2075
9725b2116P2225j6049l5949o303j0850j3653K6913o6989j414J08134m6330J9452
9713G071P9951p665n0504o1936p246j13746m1200J12569Q3275N6764M0247k1699
9701G5881n3042L7052M1968M880J1614o7004J5109M9971o501p0666j0598j2333
9689A6331j5561M9500L5558P129K2735k0565p1920Q883m2546L4398N2093K553
9677G8588P745k0039m2569K2833o5082l3281Q8820Q1223K3565k7908j0663P38
9665A03970K6496l4987j00161j7133P8913N0393M0465R3497P1407j09963j48533
$$ plain form
9654 54364 4506 9351 12407 29297 36826 -3334 -35902 -75638 -53385 59500 115034 90985
9642 90985 76458 64396 12800 -54544 -14362 42324 37119 30016 52109 7755 46810 85481
9630 85481 64814 -11542 -59023 -65406 -29692 -50993 -67625 -67748 -21911 9848 -29697 -50086
9618 -50086 43538 58690 65066 83522 90954 117860 108145 19229 29356 8790 2942 30583 3966
9605 3966 -30143 -119332 -95639 -76276 -63575 -6549 25860 -25775 19580 63085 25421 -14845
9593 -14845 -54449 38363 16779 -85662 -111363 -113770 -78841 -92041 -29197 -120605 -106982 -71475
9581 -71475 -43970 -12928 50293 118108 19015 -15945 -16718 -95075 -114755 -109409 -54746 -12876
9569 -12876 92984 98344 -1850 -118848 -111279 -60182 -17595 -30581 26181 -34990 -36131 13095
$$ packed form
9654E4364m9858M845L056J6890P529m0160l2568l9736K2253J12885N5534k4049
9642I0985j4527j2062n1596o7344M0182N6686n205p103K2093m4354L9055L8671
9630H5481k0667p6356m7481o383L5714k1301j6632j23M5837L1759l9545k0389
9618e0086R3624J5152O376J8456P432K6906r715q8916J0127k0566n848K7641k6617
9605C966l4109q9189K3693J9363J2701N7026L2409n1635M5355M3505l7664m0266
9593a4845l9604R2812k1584j02441k5701k407L4929j3200O2844r1408J3623L5507
9581g1475K7505L1042O3221O7815r9093l4960p73p8357j9680N346N4663M1870
9569a2876J05860N360j00194j16998P569N1097M2587j2986N6762o1171j141M9226
$$ plain form
9557 13095 25133 159866 187960 214043 154187 133836 167377 138271 103760 82378 103014 122647
9545 122647 180371 159839 128478 116398 59606 -1867 38956 65621 12379 -46176 -35440 7325
9533 7325 125521 96805 42085 52285 4138 -98680 -1532 -27923 -69135 -53379 -52575 -75083
9521 -75083 -56787 -56498 -17507 -54569 20394 79846 18985 -58198 -39491 -49181 -65615 14078
9509 14078 85355 120091 91216 -36051 -56401 36850 97191 165638 166633 125827 78759 57045
9497 57045 86864 70033 77535 11531 -8730 -8661 61696 70626 60031 69471 51756 2975 15691
9484 15691 -12557 -128701 -169233 -170643 -118446 -40816 -44683 51700 81706 54000 60018 93632
9472 93632 1427 -41863 -37100 -44131 -69205 -91131 -117150 -106802 -55959 -11404 40828 -15787
$$ packed form
9557A3095J2038J34733K8094K6083n9856k0351L3541k9106l4511k1382K0636J9633
9545A22647N7724k0532l1361j2080n6792o1473M0823K6665n3242n8555J0736M2765
9533G325J18196k8716n4720J0200m8147j02818R7148k6391m1212J5756Q04k2508
9521g5083J8296K89L8991l7062P4963N9452o0861p7183J8707r690j6434P9693
9509A4078P1277L4736k8875j27267k0350R3251O0341O8447R95m0806m7068k1714
9497E7045K9819j6831P502o6004k0261O9P0357Q930j0595R440j7715m8781J2716
9484A5691k8248j16144m0532j410N2197P7630l867R6383L0006k7706O018L3614
9472I3632r2205m3290M763p031k5074k1926k6019J0348N0843M4555N2232n6615
$$ plain form
9460 -15787 -111520 -65807 -19770 -56486 -70314 10103 106587 110065 59156 20387 -1559 -32098
9448 -32098 -4496 93645 126748 85718 14076 21487 44708 65114 101393 89977 -29207 -97835
9436 -97835 -89570 -25552 -65520 -121359 -138371 -135182 -59504 -47890 -21003 -15575 28112 68557
9424 68557 66798 21869 -5272 -25658 -45907 -63406 -109701 -165000 -37451 25652 94227 125863
9412 125863 101539 5519 -50653 -20615 -53348 -34145 -12817 -10182 10199 37189 60241 52025
9400 52025 42045 -44184 -109633 -173604 -118839 -7620 -67028 -72870 -76803 -141193 -84672 -51442
9388 -51442 20162 18791 -8415 11864 18552 64477 63042 46191 21615 -50176 -82689 -172427
9376 -172427 -227451 -261893 -304795 -283936 -162577 -94485 -36958 7456 55808 94142 80977
$$ packed form
9460a5787r5733M5713M6037l6716j3828Q0417R6484L478n0909l8769k1946l0539
9448c2098K7602R8141L3103m1030p1642P411K3221K0406L6279j1416j19184o8628
9436i7835Q265O4018l9968n5839j7012L189P5678J1614K6887N428M3687M0445
9424F8557j759m4929k7141k0386k0249j7499m6295n5299J27549O3103O8575L1636
9412A25863k4324r6020n6172L0038l2733J9203K1328K635K0381K6990K3052q216
9400E2025r980q6229o5449o3971N4765J11219n9408n842l933o4390N6521L3230
9388e1442P1604j371k7206K0279O688M5925j435j6851k4576p1791l2513q9738
9376a72427n5024l4442m2902K0859J21359O8092N7527M4414M8352L8334j3165
$$ plain form
9365 80977 -6614 -39315 -48891 -17817 -12574 -25780 -56983 -84324 -102138 -24235 91211 89842
9353 89842 -3529 12106 7996 -870 20544 7903 -52852 4155 127074 41687 24714 -57581
9341 -57581 -156685 -119869 -44617 -33174 -22870 -7765 -83957 -126256 -38745 39481 92905 137066
9329 137066 103216 23109 -65524 30602 7946 13066 15925 5879 54271 26935 43695 47537
9317 47537 -50715 1395 -15196 -56635 -51412 -101285 -78061 -25349 -158493 -272263 -107956
9306 -107956 88499 56245 -52287 -58862 22349 -33934 20366 23121 20115 48454 105376 43536
9294 43536 123613 145478 125547 54387 27478 8918 -41396 -93768 17733 72274 11958 -21228
9282 -21228 -27509 -33887 36292 -54380 -52981 50348 62379 97603 140929 82286 60935 63471
$$ packed form
9365H0977q7591l2701r576L1074N243j3206l1203k7341j7814P7903J15446j369
9353H9842r3371J5635m110q866K1414j2641o0755N7007J22919q5387j6973q2295
9341e7581r9104L6816P5252J1443J0304J5105p6192m2299Q7511P8226N3424M4161
9329A37066l3850q0107q8633R6126k2656N120K859j0046M8392k7336J6760L842
9317D7537r8252N2110j6591m1439N223m9873K3224N2712j33144j13770J64307
9306a07956J96455l2254j08532o575Q1211n6283N4300K755l006K8339N6922o1840
9294D3536Q0077K1865j9931p1160k6909j8560n0314n2372J11501N4541o0316l3186
9282b1228o281o378P0179r0672J399J03329J2031L5224M3326n8643k1351K536
$$ plain form
9270 63471 26565 107631 66398 17914 63243 38943 26247 62127 46403 7635 -29776 3649
9258 3649 99598 113691 127448 50904 114337 107698 23423 -20117 41444 53992 46020 55755 110816
9245 110816 164545 167044 170902 145805 117858 107366 101434 131448 139906 69827 36041 130662
9233 130662 151907 180977 152286 80348 32589 33038 -88191 -151947 -147048 -70549 -6416 -2972
9221 -2972 20147 20517 26844 6864 104996 95568 93626 76431 79997 42567 13624 53215 53090 62090
9207 62090 51563 2107 -37524 30832 19192 -37494 -58440 -63544 -81888 -78733 -42508 -25260
9195 -25260 -34482 -15549 58692 96863 146589 126533 151890 201288 120749 73445 87375 146109
9183 146109 191394 205203 157729 192752 176890 179051 183196 138297 75873 55660 107429 178031
$$ packed form
9270F3471l6906Q1066m1233m8484M5329k4300j2696L5880j5724l8768l7411L3425
9258C649R5949J4093J3757p6544O3433o639q4275m3540O1561J2548p972R735N5061
9245A10816N3729K499L858k5097k7947j0492n932L0014Q458p0079l3786R4621
9233A30662K1245K9070k8691p1938m7759M49j21229o3756M899P6499O4133L444
9221b972K3119L70O327j9980R8132r428j942j7195L566l7430k8943L9591j25R000
9207F2090j0527m9456l9631O8356j1640n6686k0946n104j8344L155L6225J7248
9195b5260r222J8933P4241L8171M9726k0056K5357M9398q0539m7304J3930N8734
9183A46109M5285J3809m7474L5023j5862K161M145m4899o2424k0213N1769P0602
$$ plain form
9171 178031 116972 92371 120193 103271 67959 128977 268661 342915 389094 304715 190325
9160 190325 126805 145351 158348 219764 295741 308083 278698 224918 301575 303744 289326 261045
9148 261045 140874 114195 232474 292232 313178 357425 301858 350642 357839 334762 503814
9137 503814 530597 467902 516522 539032 425068 429287 442786 509724 522946 502598 538758 571113
9125 571113 572650 642053 702203 723385 718186 710235 753793 802316 821113 821771 771764 780642 917802
9112 917802 982226 1086475 1094631 1082214 1070764 1141397 1229489 1289878 1406544 1536355 1613079
9101 1613079 1694100 1861577 1964249 2067613 2218475 2333008 2537144 2668979 2747631 2943449
9091 2943449 3166700 3424340 3627554 3852546 4026951 4175724 4392477 4571800 4652161 4791652
$$ packed form
9171A78031o1059k4601K7822j6922l5312O1018J39684P4254M6179q4379j14390
9160A90325o3520J8546J2997O1416P5977J2342k9385n3780P6657K169j4418k8281
9148B61045j20171k6679J18279N9758K0946M4247n5567M8784P197k3077J69052
9137E03814K6783o2695M8620K2510j13964M219J3499O6938J3222k0348L6160L2355
9125E71113J537O9403O0150K1182n199p951M3558M8523J8797O58n0007Q878J37160
9112I17802O4424J04249Q156j2417j1450P0633Q8092O0389J16666J29811P6724
9101A613079Q1021J67477J02672J03364J50862J14533K04136J31835P8652J95818
9091B943449K23251K57640K03214K24992J74405J48773K16753J79323Q0361J39491
$$ plain form
9081 4791652 4787680 4883552 4918587 5038180 5037898 4938996 4897571 4834379 4729302 4578392 4392626
9070 4392626 4259153 4127482 3933218 3730384 3548004 3472725 3309018 3126045 3014180 2893530
9060 2893530 2788418 2768016 2698594 2560609 2418093 2274802 2204667 2154052 2205597 2148083 2010908
9049 2010908 1886796 1885500 1908857 1872466 1838071 1808146 1750411 1697818 1535887 1468307 1403079
9038 1403079 1440826 1433161 1367016 1268638 1174801 1083663 1025915 993956 940782 937222 887173 865052
9026 865052 830739 846639 782921 831377 820582 856386 813336 769076 731514 720897 743542 706517
9014 706517 696726 753288 810347 754580 663328 648007 727321 682444 629235 640171 609681 619660
9002 619660 697064 690996 602860 457694 371201 405628 409152 469916 516612 526412 434692 386204
$$ packed form
9081D791652l972R5872L5035J19593k82r8902m1425o3192j05077j50910j85766
9070D392626j33473j31671j94264k02834j82380p5279j63707j82973j11865j20650
9060B893530j05112k0402o9422j37985j42516j43291p0135n0615N1545n7514j37175
9049B010908j24112j296K3357l6391l4395k9925n7735n2593j61931o7580o5228
9038A403079L7747p665o6145r8378r3837r1138n7748l1959n3174l560n0049k2121
9026H65052l4313J5900o3718M8456j0795L5804m3050m4260l7562j0617K2645l7025
9014G06517r791N6562N7059n5767r1252j5321P9314m4877n3209J0936l0490R979
9002F19660P7404o068q8136j45166q6493L4427L524O0764M6696R800r1720m8488
$$ plain form
8990 386204 417420 497045 504332 495225 325851 182019 197583 266566 223934 219574 217280 221953
8978 221953 226244 350576 433832 371367 387509 413383 387437 335981 260478 207874 305864 367697
8966 367697 317927 280950 227053 161483 196453 257168 294448 338955 329830 290411 311174 413786
8954 413786 357244 356777 356418 359587 301962 227115 169864 126848 152510 201885 304881 329551
8942 329551 253564 192733 187493 163747 150735 159758 192016 175187 192322 146667 76979 57045
8930 57045 106758 170474 203934 207833 198438 156398 56458 48914 96597 89982 93989 71006 51045
8917 51045 135394 112071 100238 121479 157556 169606 153735 98204 38562 18492 63414 66128
8905 66128 37577 67578 80858 49948 3409 19483 21062 66324 92495 54247 98199 155870
$$ packed form
8990C86204L1216P9625P287r107j69374j43832J5564O8983m2632m360k294M673
8978B21953M291J24332Q3256o2465J6142K5874k5946n1456p5503n2604R7990O1833
8966C67697m9770l6977n3897o5570L4970O0715L7280M4507r125l9419K0763J02612
8954D13786n6542m67l59L169n7625p4847n7251m3016K5662M9375J02996K4670
8942C29551p5987o0831n240k3746j3012R023L2258j6829J7135m5655o9688j9934
8930E7045M9713O3716L3460L899r395m2040r9940p544M7683o615M007k2983j9961
8917E1045Q4349k3323j1833K1241L6077J2050j5871n5531n9642k0070M4922K714
8905F6128k8551L0001J3280l0910m6539J6074J579M5262K6171l8248M3952N7671
$$ plain form
8893 155870 165379 169420 184303 157532 130662 11048 -18290 -37726 -1467 54104 96660 156100
8881 156100 111963 45679 51282 183494 218309 195614 166081 137372 165208 62763 41025
8870 41025 100903 76364 100635 29262 -64931 -21623 49893 33087 -4293 -63696 -96775 -90949
8858 -90949 2485 112496 129061 51975 25750 99301 200668 149587 67511 45392 73711
8847 73711 18531 27315 78666 133018 66418 101567 137777 80935 24010 14785 -35942 -10404
8835 -10404 2867 70831 102838 153529 245287 325756 288290 218705 136893 69426 136056 249395
8823 249395 205388 93869 44403 -15307 -105455 -182684 -158555 -79149 -70294 -42945 -41839 -102514
8811 -102514 -161985 -157835 -195829 -194696 -197135 -159703 -107319 -29322 -87408 -153365 -73340 -6604
$$ packed form
8893A55870R509M041J4883k6771k6870j19614k9338j9436L6259N5571M2556N9440
8881A56100m4137o6284N603J32212L4815k2695k9533k8709K7836j02445k1738
8870D1025N9878k4539K4271p1373r4193M3308P1516j6806l7380n9403l3079N826
8858i0949R3434J10011J6565p7086k6225P3551J01367n1081q2076k2119K8319
8847G3711n5180Q784N1351N4352o6600L5149L6210n6842n6925r225n0727K5538
8835a0404J3271O7964L2007N0691R1758Q0469l7466o9585q1812o7467O6630J13339
8823B49395m4007j11519m9466n9710r0148p7229K4129P9406Q855K7349J106o0675
8811a02514n9471M150l7994J133k439L7432N2384P7997n8086o5957Q0025O6736
$$ plain form
8799 -6604 45895 75605 11616 1237 42814 -34753 62997 92662 79751 -3082 -41259 -51278
8787 -51278 2772 33781 78095 83430 81326 124671 77787 51966 57805 68787 86279 -25626
8775 -25626 -16182 10813 79853 101520 148450 136982 94121 12172 17514 77254 94224 79894
8763 79894 48302 61129 116706 -24183 -73829 -76889 -21933 37360 3087 8211 21059 13846
8751 13846 3631 16962 13288 51397 40577 146259 129587 66211 100885 98969 24299 56963
8739 56963 134336 92104 71675 95101 47373 -2957 7929 29987 69039 -17959 -77760 2681
8727 2681 16551 3073 -11621 16573 -21675 24885 153307 218685 220614 145436 39645 -12874
8715 -12874 -70531 65036 121445 67643 -8 -43983 4120 40281 85456 69515 20115 -30748
$$ packed form
8799f604N2499K9710o3989j0379M1577p7567R7750K9665j2911q2833l8177j0019
8787e1278N4050L1009M4314N335k104M3345m6884k5821N839J0982J7492j11905
8775b5626R444K6995O9040K1667M6930j1468m2861q1949N342N9740J6970j4330
8763G9894l1592J2827N5577j40889m9646l060N4956N9293l4273N124J2848p213
8751A3846j0215J3331l674L8109j0820J05682j6672o3376L4674j916p4670L2664
8739E6963P7373m2232k0429K3426m7728n0330J0886K2058L9052q6998n9801Q0441
8727B681J3870j3478j4694K8194l8248M6560J28422O5378J929p5178j05791n2519
8715a2874n7657J35567N6409n3802o7651m3975M8103L6161M5175j5941m9400n0863
$$ plain form
8703 -30748 -36957 -79163 -3560 17758 -54290 -142855 -78084 -57623 -10065 107735 149545 149206
8691 149206 220090 203365 182597 229292 221750 194630 114512 66227 -4030 -36624 23153 51892
8679 51892 30133 11575 -4912 12461 30396 79089 23172 -44486 -60902 -5864 -25862 -107203
8667 -107203 -108419 -56329 13180 20970 25048 53613 -19081 -44919 61323 136622 182306 200993
8655 200993 198263 133823 73660 130908 105813 55652 9317 -14948 576 -24394 -17055 -14760
8643 -14760 2693 32089 58090 34834 36030 53192 9127 88106 105082 31720 -39420 -81871
8631 -81871 -75066 -49583 -45715 -22159 -24609 13042 138011 191060 212739 189432 182975 140251
8619 140251 87924 18251 -28637 21830 73603 94697 171574 320015 397406 396774 334832 271667
$$ packed form
8703c0748o209m2206P5603K1318p2048q8565O4771K0461M7558J17800M1810l39
8691A49206P0884j6725k0768M6695p542k7120q0118m8285p0257l2594N9777K8739
8679E1892k1759j8558j6487J7373J7935M8693n5917o7658j6416N5038j9998q1341
8667a07203j216N2090O9509P790M078K8565p2694k5838J06242P5299M5684J8687
8655B00993k730o4440o0163N7248k5095n0161m6335k4265J5524k4970P339K295
8643a4760J7453K9396K6001k3256J196J7162m4065P8979J6976p3362p1140m2451
8631h1871O805K5483L868K3556k450L7651J24969N3049K1679k3307o457m2724
8619A40251n2327o9673m6888N0467N1773K1094P6877J48441P7391o32o1942o3165
$$ plain form
8607 271667 291654 329498 312376 242878 159472 91754 103677 116743 118975 152049 135935 72307
8595 72307 100538 62144 -10831 16341 61497 91569 81776 7936 61488 110498 82460 117846
8583 117846 120021 39533 15998 92934 67166 77685 98015 74780 72948 55158 65513 29177
8571 29177 14928 46570 138123 240398 230478 140706 49578 167343 154760 112176 115353 113135
8559 113135 170956 149338 97250 58711 -27626 8677 21547 35128 38975 -2295 -13680 514
8547 514 30850 86913 69429 -3986 36485 47363 11518 -43978 -111418 -106563 447 -18185
8535 -18185 -61043 2128 6057 96155 142960 104773 69576 131798 180322 128707 73464 30427
8523 30427 21426 16485 35610 101884 69539 53193 37409 -121470 -165454 -138853 -105061 -38227
$$ packed form
8607B71667J9987L7844j7122o9498q3406o7718J1923J3066K232L3074j6114o3628
8595G2307K8231l8394p2975K7172M5156L0072r793p3840N3552M9010k8038L5386
8583A17846K175q0488k3535P6936k5768J0519K0330k3235j832j7790J0355l6336
8571B9177j4249L1642R1553J02275r920q9772r1128J17765j2583m2584L177k218
8559A13135N7821k1618n2088l8539q6337L6303J2870J3581L847m1270j1385J4194
8547E14L0336N6063j7484p3415M0471J0878l5845n5496o7440M855J07010j8632
8535a8185m2858O3171L929R0098M6805l8187l5197O2222M8524n1615n5243m3037
8523C0427r001m941J9125O6274l2345j6346j5784j58879m3984K6601L3792O6834
$$ plain form
8511 -38227 -19405 23505 35007 106595 85506 -36794 -86716 -40748 -17966 21165 104072 223592
8499 223592 228687 126772 74737 26255 -4652 -535 -27812 -83106 -22651 -270 31970 16736
8487 16736 4278 22040 71454 60251 14680 13752 32746 46036 19906 -23921 -97852 -28065
8475 -28065 77544 130109 76061 -28865 -141461 -160788 -109250 32818 126986 159248 118994
8464 118994 1785 -87030 -38689 -11213 1231 -32882 -121170 -114934 -34126 -33791 66238 132327
8452 132327 63532 27493 -23369 -21347 -84885 -85581 -589 25386 -77346 -169758 -75989 -2068
8440 -2068 -45674 -106025 -124237 -52167 63972 148732 184129 164439 108157 86086 33839 49094
8428 49094 27069 1708 64505 103974 38297 60772 53101 25022 60666 43348 29059 25328
$$ packed form
8511c8227J8822M2910J1502P1588k1089j22300m9922M5968K2782L9131Q2907J19520
8499B23592N095j01915n2035m8482l0907M117k7277n5294O0455K2381L2240j5234
8487A6736j2458J7762M9414j1203m5571r28J8994J3290k6130m3827p3931O9787
8475b8065J05609N2565n4048j04926j12596j9327N1538J42068R4168L2262m0254
8464A18994j17209q8815M8341K7476J2444l4113q8288O236Q0808L35J00029O6089
8452A32327o8795l6039n0862K022o3538o96Q4992K5975j02732r2412R3769P3921
8440b068m3606o0351j8212P2070J16139Q4760L5397j9690n6282k2071n2247J5255
8428D9094k2025k5361O2797L9469o5677K2475p671k8079L5644j7318j4289l731
$$ plain form
8416 25328 111109 200713 142040 91464 40458 -93341 -106945 -127554 32823 119300 76714
8405 76714 28095 -33547 -44822 26888 5770 -8610 -6681 7438 88253 125207 56404 26416
8393 26416 223 40835 27836 65623 95385 48884 29262 7657 24252 -21523 -35056 57620
8381 57620 43259 -60526 -65110 -51306 25083 138334 134258 52295 24961 58795 80329 81502
8369 81502 21093 -39629 -3289 -82334 -189364 -187655 -87531 -51056 -55388 -18673 -45358 -8172
8357 -8172 60533 116615 18251 -120626 -96166 -63689 -82046 -59151 -31527 31248 42171 3209
8345 3209 -75183 -113623 -63493 -23365 -6580 -17585 36332 118655 78662 22208 -1261 73807
8333 73807 104352 4509 -68747 -120579 -15978 55794 -1025 -25821 -29138 -117013 -120241 -87441
$$ packed form
8416B5328Q5781Q9604n8673n0576n1006j33799j3604k0609J60377Q6477m2586
8405G6714m8619o1642j1275P1710k1118j4380J929J4119Q0815L6954o8803k9988
8393B6416k6193M0612j2999L7787K9762m6501j9622k1605J6595m5775j3533R2676
8381E7620j4361j03785m584J3804P6389J13251m076q1963k7334L3834K1534J173
8369H1502o0409o0722L6340p9045j07030J709J00124L6475m332L6715k6685L7186
8357h172O8705N6082r8364j38877K4460L2477j8357K2895K7624O2775J0923l8962
8345C209p8392l8440N0130M0128J6785j1005N3917Q2323l9993n6454k3469P5068
8333G3807L0545r9843p3256n1832J04601P1772n6819k4796l317q7875l228L2800
$$ plain form
8321 -87441 -105510 57701 105488 83121 58336 -14242 -18951 -13472 -5189 -32243 -99391 -70068
8309 -70068 -116757 -115569 -44731 -106413 -112794 -35699 -15474 -61839 -49506 -69974 -105931 -58461
8297 -58461 -96662 -130552 -30234 30170 61515 1777 -29470 -11751 -38121 -30505 -55569 -39750
8285 -39750 -40179 13791 -17216 -20801 42458 9013 -69885 -63762 -100826 -74607 19680 34292 -46159
8272 -46159 11046 137999 156830 142023 129333 71374 -22367 -5705 -38444 -53092 -64381 -129109
8260 -129109 -161584 -82659 -11721 21013 53840 -3409 -74403 -20231 7391 -30729 -39143 -69810
8248 -69810 -113783 -119050 -201073 -166774 -28321 -59126 -91432 34322 38406 -30594 71046 93190
8236 93190 8880 -54509 -42139 11319 73100 114429 51902 24073 87054 165967 108974 5741
$$ packed form
8321h7441j8069J63211M7787k2367k4785p2578m709N479Q283k7054o7148K9323
8309g0068m6689J188P0838o1682o381P7095K0225m6365J2333k0468l5957M7470
8297e8461l8201l3890J00318O0404L1345n9738l1247J7719k6370P616k5064J5819
8285c9750m29N3970l1007l585O3259l3445p8898O123l7064K6219R4287J4612q0451
8272d6159N7205J26953J8831j4807j2690n7959r3741J6662l2739j4648j1289o4728
8260a29109l2475P8925P0938L2734L2827n7249p0994N4172K7622l8120q414l0667
8248f9810m3973n267q2023L4299J38453l0805l2306J25754M084o9000J01640K2144
8236I3190q4310o3389J2370N3458O1781M1329o2527k7829O2981P8913n6993j03233
$$ plain form
8224 5741 31035 51398 67473 86255 75037 68051 79553 38811 76396 168939 126760 152760
8212 152760 90999 -36886 -25697 -47361 -64081 -95755 -7600 195911 120102 -38747 -8048
8201 -8048 330 43457 54955 57761 37154 -2031 -64221 -78585 -88307 -43991 -2476 79526 116799
8188 116799 151148 78811 52692 32933 -21029 12315 61418 -17070 -70201 -24193 46991 105041
8176 105041 64572 123440 68515 7853 -73879 -34167 -92084 -124417 -119364 -59854 -8596 -17333
8164 -17333 -56732 -63678 -22249 -9297 31694 -4733 -70544 -3972 26443 5315 -8666 -4627
8152 -4627 51055 -17783 19109 -6078 -31961 -162762 -206078 -93703 -48023 -32591 -11870 12311
8140 12311 -99262 -137422 -19966 -17590 -26231 -38181 -91238 -127400 -94163 -87659 -50551 -16007
$$ packed form
8224E741K5294K0363J6075J8782j1218o986J1502m0742L7585R2543m2179K6000
8212A52760o1761j27885J1189k1664j6720l1674Q8155K03511p5809j58849L0699
8201h048Q378M3127J1498K806k0607l9185o2190j4364r722M4316M1515Q2002L7273
8188A16799L4349p2337k6119j9759n3962L3344M9103p8488n3131M6008P1184N8050
8176A05041m0469N8868n4925o0662q1732L9712n7917l2333N053N9510N1258q737
8164a7333l9399o946M1429J2952M0991l6427o5811O6572L0415k1128j3981M039
8152d627N5682o8838L6892k5187k5883j30801m3316J12375M5680J5432K0721K4181
8140A2311j11573l8160J17456K376q641j1950n3057l6162L3237O504L7108L4544
$$ [...]
##END NTUPLES=NMR SPECTRUM
##END=
