##TITLE=Analysis number 316894
Compound Code cc 48713
Book Reference 472/13/7
Project Code adrs
Chemist Name victoriam
##JCAMPDX= 6.0         $$ Bruker NMR JCAMP-DX V2.0
##DATA TYPE= NMR SPECTRUM
##DATA CLASS= NTUPLES
##ORIGIN= Bruker BioSpin GmbH
##OWNER= nmr
$$ XWIN-NMR		Version 3.5
$$ Tue Jan 31 10:35:32 2006 GMT Standard Time (UT+0h)  MAYBRIDGE\nmr@NMR_250MHZ
##.OBSERVE FREQUENCY= 250.131544655141
##.OBSERVE NUCLEUS= ^1H
##.ACQUISITION MODE= SIMULTANEOUS (DQD)
##.ACQUISITION SCHEME= undefined
##.AVERAGES= 16
##.DIGITISER RES= 18
##SPECTROMETER/DATA SYSTEM= dpx250
##.PULSE SEQUENCE= zg30
##.SOLVENT NAME= CDCl3
##.SHIFT REFERENCE= (INTERNAL, CDCl3, 0, 16.522)
##AUDIT TRAIL= $$ (NUMBER, WHEN, WHO, WHERE, WHAT)
$$ ##TITLE= Audit trail, XWIN-NMR		Version 3.5
$$ ##JCAMPDX= 5.01
$$ ##ORIGIN= Bruker BioSpin GmbH
$$ ##OWNER= nmr
$$ C:\u/data/dgb/nmr/ADRS/15400/pdata/1/auditp.txt
$$ ##AUDIT TRAIL=  $$ (NUMBER, WHEN, WHO, WHERE, WHAT)
(   1,<2006-01-31 10:35:09.31 +000>,<MAYBRIDGE\nmr>,<NMR_250MHZ>,
      <created by zg, POWCHK disabled, PULCHK disabled
       configuration hash MD5:
       62 19 C7 07 E1 42 D1 B7 37 6C 3D D0 77 39 F9 E6
       data hash MD5: 64K
       2D 8F 25 88 62 A0 75 27 6A 24 2F E4 1D D9 7E 1C>)
(   2,<2006-01-31 10:35:22.47 +000>,<MAYBRIDGE\nmr>,<NMR_250MHZ>,
      <Start of raw data processing
       ef LB = 0.3 FT_mod = 6 PKNL = 1 SI = 32K 
       data hash MD5: 32K
       E0 ED 70 B0 58 93 4C 42 F5 68 FB C2 24 4B 1C 6D>)
(   3,<2006-01-31 10:35:24.16 +000>,<MAYBRIDGE\nmr>,<NMR_250MHZ>,
      <apk 
       data hash MD5: 32K
       64 10 0B 74 6C DD 2C FC D5 37 09 B8 7D 4E 5E A4>)
(   4,<2006-01-31 10:35:24.98 +000>,<MAYBRIDGE\nmr>,<NMR_250MHZ>,
      <abs ABSG = 5 
       data hash MD5: 32K
       BC 6A BC 0B 0D C0 E0 74 2C 12 12 B0 E4 09 EE 66>)
$$ ##END=
$$ 
$$ hash MD5
$$ E6 F3 89 C1 B4 C1 9D E1 CF 8B B2 43 BB 32 DB 8D
##$RELAX= 
##$RELAX= 
##$RELAX= 
##$RELAX= 
##$RELAX= 
##$RELAX= 
##$RELAX= 
$$ Bruker specific parameters
$$ --------------------------
##$DU= <C:\u>
##$EXPNO= 15400
##$NAME= <ADRS>
##$PROCNO= 1
##$TYPE= <nmr>
##$USER= <dgb>
##$AMP= (0..31)
100 100 100 100 100 100 100 100 100 100 100 100 100 100 100 100 100 100 
100 100 100 100 100 100 100 100 100 100 100 100 100 100 
##$AQSEQ= 0
##$AQ_mod= 3
##$AUNM= <au_zg>
##$AUTOPOS= <12 >
##$BF1= 250.13
##$BF2= 250.13
##$BF3= 250.13
##$BF4= 250.13
##$BF5= 500.13
##$BF6= 500.13
##$BF7= 500.13
##$BF8= 500.13
##$BYTORDA= 1
##$CFDGTYP= 0
##$CFRGTYP= 5
##$CHEMSTR= <none>
##$CNST= (0..31)
1 1 145 1 1 1 1 1 1 1 1 1 1 1 1 1 1 1 1 1 1 1 1 1 1 1 1 1 1 1 1 1 
##$CPDPRG= <>
##$CPDPRG1= <>
##$CPDPRG2= <>
##$CPDPRG3= <>
##$CPDPRG4= <mlev>
##$CPDPRG5= <mlev>
##$CPDPRG6= <mlev>
##$CPDPRG7= <mlev>
##$CPDPRG8= <mlev>
##$CPDPRGB= <>
##$CPDPRGT= <>
##$D= (0..31)
0 1 0 0 0 0 0 0 0 0.06 0 0 0 0 0 0 0.0002 0 0 0 0 0 0 0 0 0 0 0 0 0 0 
0 
##$DATE= 1138703707
##$DBL= (0..7)
120 120 120 120 120 120 120 120 
##$DBP= (0..7)
150 150 150 150 150 150 150 150 
##$DBP07= 0
##$DBPNAM0= <>
$$ [...]
##$SUBNAM7= <"">
##$SUBNAM8= <"">
##$SUBNAM9= <"">
##$SW= 20.6930455092707
##$SWIBOX= (0..15)
0 0 3 0 0 0 0 0 0 0 0 0 0 0 0 0 
##$SW_h= 5175.983436853
##$TD= 65536
##$TD0= 1
##$TE= 293.16
##$TE2= 300
##$TE3= 300
##$TEG= 300
##$TL= (0..7)
0 120 120 120 120 120 120 120 
##$TP= (0..7)
150 150 150 150 150 150 150 150 
##$TP07= 0
##$TPNAME0= <>
##$TPNAME1= <>
##$TPNAME2= <>
##$TPNAME3= <>
##$TPNAME4= <>
##$TPNAME5= <>
##$TPNAME6= <>
##$TPNAME7= <>
##$TPOAL= (0..7)
0.5 0.5 0.5 0.5 0.5 0.5 0.5 0.5 
##$TPOFFS= (0..7)
0 0 0 0 0 0 0 0 
##$TUNHIN= 0
##$TUNHOUT= 0
##$TUNXOUT= 0
##$USERA1= <user>
##$USERA2= <user>
##$USERA3= <user>
##$USERA4= <user>
##$USERA5= <user>
##$V9= 5
##$VALIST= <valist>
##$VCLIST= <CCCCCCCCCCCCCCC>
##$VD= 0
##$VDLIST= <DDDDDDDDDDDDDDD>
##$VPLIST= <PPPPPPPPPPPPPPP>
##$VTLIST= <TTTTTTTTTTTTTTT>
##$WBST= 1024
##$WBSW= 4
##$XGAIN= (0..3)
0 0 0 0 
##$XL= 0
##$YL= 0
##$YMAX_a= 430668
##$YMIN_a= -475184
##$ZGOPTNS= <>
##$ZL1= 120
##$ZL2= 120
##$ZL3= 120
##$ZL4= 120
##$ABSF1= 16.522
##$ABSF2= -4.171173
##$ABSG= 5
##$ABSL= 3
##$ALPHA= 0
##$AQORDER= 0
##$ASSFAC= 0
##$ASSFACI= 0
##$ASSFACX= 0
##$ASSWID= 0
##$AUNMP= <proc_1d>
##$AZFE= 0.1
##$AZFW= 0.1
##$BCFW= 0
##$BC_mod= 0
##$BYTORDP= 0
##$COROFFS= 0
##$CY= 12.5
##$DATMOD= 1
##$DC= 0
##$DFILT= <>
##$DTYPP= 0
##$F1P= 14.0000005364418
##$F2P= -0.99999901652339
##$FCOR= 0.5
##$FTSIZE= 32768
##$FT_mod= 6
##$GAMMA= 0
##$GB= 0
##$INTBC= 1
##$INTSCL= 1
##$ISEN= 128
##$LB= 0.3
##$LEV0= 0
##$LPBIN= 0
##$MAXI= 10000
##$MC2= 0
##$MEAN= 0
##$ME_mod= 0
##$MI= 0
##$NCOEF= 0
##$NC_proc= -4
##$NLEV= 6
##$NOISF1= 0
##$NOISF2= 0
##$NSP= 0
##$NTH_PI= 0
##$NZP= 0
##$OFFSET= 16.522
##$PC= 1
##$PHC0= 100.5763
##$PHC1= 7.406597
##$PH_mod= 1
##$PKNL= yes
##$PPARMOD= 0
##$PSCAL= 4
##$PSIGN= 0
##$REVERSE= no
##$SF= 250.13
##$SI= 32768
##$SIGF1= 0
##$SIGF2= 0
##$SINO= 400
##$SIOLD= 32768
##$SREGLST= <1H.CDCl3>
##$SSB= 0
##$STSI= 32768
##$STSR= 0
##$SW_p= 5175.98343685301
##$SYMM= 0
##$S_DEV= 0
##$TDeff= 65536
##$TDoff= 0
##$TI= <Analysis number 999999
Compound Code 99
Book Reference 9
Project Code 9>
##$TILT= no
##$TM1= 0
##$TM2= 0
##$TOPLEV= 0
##$USERP1= <user>
##$USERP2= <user>
##$USERP3= <user>
##$USERP4= <user>
##$USERP5= <user>
##$WDW= 1
##$XDIM= 32768
##$YMAX_p= 421579048
##$YMIN_p= -142968
$$ End of Bruker specific parameters
$$ ---------------------------------
##NTUPLES= NMR SPECTRUM
##VAR_NAME=  FREQUENCY,     SPECTRUM/REAL,   SPECTRUM/IMAG
##SYMBOL=    X,             R,               I
##VAR_TYPE=  INDEPENDENT,   DEPENDENT,       DEPENDENT
##VAR_FORM=  AFFN,          ASDF,            ASDF
##VAR_DIM=   32768,         32768,           32768
##UNITS=     HZ,            ARBITRARY UNITS, ARBITRARY UNITS
##FACTOR=    0.157963299565203, 1,           1
##FIRST=     4132.6476996994, 0,             0
##LAST=      -1043.33573715361, 0,           0
##MIN=       -1043.33573715361, -142968,     0
##MAX=       4132.6476996994, 421579048,     0
$$ Real data points
##PAGE= N=1
##DATA TABLE= (X++(R..R)), XYDATA
$$ [...]
$$ plain form
18455 1459951 1465269 1481479 1518696 1605884 1710042 1755156 1750929 1742020 1734793 1760454 1826064 1866175
18443 1866175 1869419 1921375 2138262 2424484 2650246 2760071 2851269 2890770 2953112 3003715 2996733
18432 2996733 2984912 2950075 2942563 2975432 3220047 3637381 4180895 4702431 5078967 5185479
18422 5185479 5029253 4800741 4719226 4814926 5008267 5329794 5853912 6603138 7450759 8327414
18412 8327414 9327643 10833600 13514374 18336743 27146638 42395411 60967926 70542887
18404 70542887 67795812 55821553 41171675 31721781 27424406 26376524 27629471 31424923
18396 31424923 39502652 55272082 84043125 126074804 162418991 172751243 154544322
18389 154544322 118655690 83666995 60462102 47678286 41112753 38519163 39317705
$$ packed form
18455A459951N318J6210L7217Q7188J04158M5114m227q909p227K5661O5610M0111
18443A866175L244N1956K16887K86222K25762J09825R1198L9501O2342N0603o982
18432B996733j1821l4837p512L2869K44615M17334N43514N21536L76536J06512
18422E185479j56226k28512q1515R5700J93341L21527N24118P49226Q47621Q76655
18412H327414J000229J505957K680774M822369Q809895J5248773J8572515R574961
18404G0542887k747075j1974259j4649878r449894m297375j047882J252947L795452
18396C1424923Q077729J5769430K8771043M2031679L6344187J0332252j8206921
18389A54544322l5888632l4988695k3204893j2783816o565533k593590P98542
$$ plain form
18382 39317705 44366031 55995200 78309735 110662463 133848186 132538766 111786216
18375 111786216 80160126 54451473 39237254 30440459 24942401 21348481 18926687
18368 18926687 17276304 16179612 15336704 14560222 13712736 12784605 12054337 11874161 12534607
18359 12534607 13650260 14227065 13660794 12267498 10641413 9340749 8554542 8124816 7954487
18350 7954487 7977367 8117311 8222994 8337247 8628949 9197650 10110384 11237171 12365357
18341 12365357 13485296 14658132 15751927 17240810 19764854 23178304 24882985 24202523
18333 24202523 22035736 19410620 18236707 18198709 18653518 19500335 20809689 22992115 26464659
18324 26464659 31188643 37274545 45809944 59709376 84398975 129527643 209796274
$$ packed form
18382C9317705N048326J1629169K2314535L2352728K3185723j309420k0752550
18375A11786216l1626090k5708653j5214219q796795n498058l593920k421794
18368A8926687j650383j096692q42908p76482q47486r28131p30268j80176O60446
18359A2534607J115653N76805n66271j393296j626085j300664p86207m29726j70329
18350G954487K2880J39944J05683J14253K91702N68701R12734J126787J128186
18341A2365357J119939J172836J093795J488883K524044L413450J704681o80462
18333B4202523k166787k625116j173913l7998M54809Q46817J309354K182426L472544
18324B6464659M723984O085902Q535399J3899432K4689599M5128668Q0268631
$$ plain form
18317 209796274 321271630 407623272 421579048 364377345 270434745 184824178 132970465
18310 132970465 104960067 90653225 86093969 91051211 109125408 147134518 201448351
18303 201448351 245218150 275518384 273532469 234347815 185844596 133320328 95726397
18296 95726397 73930901 60570134 51716273 45618250 41458098 38578095 36325861 34526305
18288 34526305 33746906 34281064 35710719 37415304 39431522 41961571 45140725 47269695
18280 47269695 47941291 48039957 49018289 52727759 60546096 73657850 90347533 107110608
18272 107110608 125586590 148545963 172370291 185962274 188450227 184028107 174675189
18265 174675189 161623807 144743046 125867066 109361146 96985028 87313218 79534148
$$ packed form
18317B09796274J11475356Q6351642J3955776n7201703r3942600q5610567n1853713
18310A32970465k8010398j4306842m559256M957242J8074197L8009110N4313833
18303B01448351M3769799L0300234j985915l9184654m8503219n2524268l7593931
18296I5726397k1795496j3360767q853861o098023m160152k880003k252234j799556
18288C4526305p79399N34158J429655J704585K016218K530049L179154K128970
18280D7269695O71596R8666R78332L709470P818337J3111754J6689683J6763075
18272A07110608J8475982K2959373K3824328J3591983K487953m422120r352918
18265A74675189j3051382j6880761j8875980j6505920j2376118r671810p779070
$$ plain form
18258 79534148 74779491 72779076 70614619 66411013 60673772 54414722 48614976 42993170
18250 42993170 37529648 32857148 29579388 27035057 24863942 22661466 20710295 19446422
18242 19446422 18729238 18655770 19234056 20258280 20899165 21344801 21987252 23763565 27328495
18233 27328495 32106075 37116640 42581955 48819757 55182429 59125841 60455891 61164967
18225 61164967 63578399 68465306 74363807 82283063 94543007 109669759 120948508 128261644
18217 128261644 135012742 140966275 139428680 129793727 114587081 99000927 85114548
18210 85114548 71781037 58783142 47814091 40326783 35543276 32658425 30965520 29335761
18202 29335761 27271197 24845052 22299121 19996333 17801371 15598361 13480480 11787202
$$ packed form
18258G9534148m754657k000415k164457m203606n737241o259050n799746n621806
18250D2993170n463522m672500l277760k544331k171115k202476j951171j263873
18242A9446422p17184p3468N78286J024224O40885M45636O42451J776313L564930
18233B7328495M777580N010565N465315O237802O362672L943412J330050P09076
18225F1164967K413432M886907N898501P919256J2259944J5126752J1278749P313136
18217A28261644O751098N953533j537595r634953j5206646j5586154j3886379
18210H5114548j3333511j2997895j0969051p487308m783507k884851j692905j629759
18202B9335761k064564k426145k545931k302788k194962k203010k117881j693278
$$ plain form
18194 11787202 10477673 9474727 8740979 8163484 7734455 7413536 7140600 6848769 6452000
18185 6452000 6037640 5729999 5515330 5303775 5073558 4791493 4484097 4240869 4007769
18176 4007769 3822494 3677243 3544039 3395123 3311035 3286356 3274450 3276300 3415004 3620233
18166 3620233 3818246 3898226 3851036 3709904 3524570 3306071 3115106 2974484 2865130 2712255
18156 2712255 2441531 2153727 1983180 1887101 1731768 1655287 1545085 1504388 1474969 1422914
18146 1422914 1417440 1448426 1477631 1472069 1506787 1580032 1689977 1824286 1852444 1844027 1797138
18135 1797138 1812843 1871199 2000475 2116709 2176014 2139030 2028514 1964875 1948192 1971888 2014530
18124 2014530 2094366 2162468 2258935 2393316 2536341 2568205 2559518 2583713 2648441 2846822 3307656
$$ packed form
18194A1787202j309529j002946p33748n77495m29029l20919k72936k91831l96769
18185F452000m14360l07641k14669k11555k30217k82065l07396k43228k33100
18176D007769j85275j45251j33204j48916q4088k4679j1906J850J38704K05229
18166C620233J98013P9980m7190j41132j85334k18499j90965j40622j09354j52875
18156B712255k70724k87804j70547r6079j55333p6481j10202m0697k9419n2055
18146A422914n474L0986K9205n562L4718P3245J09945J34309K8158q417m6889
18135A797138J5705N8356J29276J16234N9305l6984j10516o3639j6683K3696M2642
18124B014530P9836O8102R6467J34381J43025L1864q687K4195O4728J98381M60834
$$ plain form
18113 3307656 4009738 4898950 6228248 8516335 12881978 21387658 38310341 64506994
18105 64506994 76671774 71735385 55118687 33263378 20897881 14791032 11295549
18098 11295549 9046674 7465843 6351281 5537355 4886755 4289769 3774253 3338809 2973134
18089 2973134 2630418 2381017 2216630 2079863 1984221 1836871 1712133 1609805 1536217 1517268
18079 1517268 1457035 1440128 1431982 1387753 1319230 1214994 1119839 1038444 926996 893050 878454
18068 878454 895450 959427 1013276 1078510 1110193 1098675 1074556 1037875 939938 822820 765344
18057 765344 771792 764309 711520 732118 752949 749311 733725 730572 696263 639893 604957 608264
18045 608264 636431 589807 557173 556879 539462 522208 551010 496803 461118 479800 445546 412518
$$ packed form
18113C307656P02082Q89212J329298K288087M365643Q505680J6922683K6196653
18105F4506994J2164780m936389j6616698k1855309j2365497o106849l495483
18098A1295549k248875j580831j114562q13926o50600n96986n15516m35444l65675
18089B973134l42716k49401j64387j36767r5642j47350j24738j02328p3588j8949
18079A517268o0233j6907q146m4229o8523j04236r5155q1395j11448l3946j4596
18068H78454J6996O3977N3849O5234L1683j1518k4119l6681r7937j17118n7476
18057G65344O448p483n2789K0598K0831l638j5586l153l4309n6370l4936L307
18045F08264K8167m6624l2634k94j7417j7254K8802n4207l5685J8682l4254l3028
$$ plain form
18033 412518 420657 427337 423489 427874 449894 455874 457556 464013 431193 434390 454394 435321 447630
18020 447630 450963 442138 395254 397793 427513 453153 439208 420312 446939 482636 472919 480024
18008 480024 489544 505437 518462 503716 524617 517203 535250 528908 564208 598740 586315 525368
17996 525368 478648 424435 408616 417109 432411 454478 376593 327267 328049 300227 282509 272644
17984 272644 272384 259425 262731 252605 252406 264612 282115 313768 359240 399612 397328 421638 397859
17971 397859 323378 270586 317556 330476 307776 281429 285130 277751 281462 275078 261856 228419
17959 228419 187777 202281 206293 224713 274865 290618 246525 208219 200622 226438 230758 237095
17947 237095 244896 262737 272732 274572 280698 273021 250441 281197 283057 269932 278562 252567 264647
$$ packed form
18033D12518Q139O680l848M385K2020N980J682O457l2820L197K0004j9073J2309
18020D47630L333q825m6884K539K9720K5640j3945j8896K6627L5697r717P105
18008D80024R520J5893J3025j4746K0901p414J8047o342L5300L4532j2425o0947
17996E25368m6720n4213j5819Q493J5302K2067p7885m9326P82k7822j7718r865
17984B72644k60j2959L306j0126j99J2206J7503L1653M5472M0372k284K4310k3779
17971C97859p4481n2792M6970J2920k2700k6347L701p379L711o384j3222l3437
17959B28419m0642J4504M012J8420N0152J5753m4093l8306p597K5816M320O337
17947B37095P801J7841R995J840O126p677k2580L0756J860j3125Q630k5995J2080
$$ plain form
17934 264647 222689 206703 225622 265832 300947 268155 197614 162029 145745 156085 159984 188559
17922 188559 219410 233481 194979 166461 188011 204937 208986 233018 242213 229862 230438 243828
17910 243828 297168 389759 537313 775720 921288 957833 924154 755294 645182 685126
17900 685126 849607 1104243 1251986 1184674 990590 734881 539442 453839 428355 380200
17890 380200 355966 347644 369210 378401 369560 356248 319485 269355 283371 322032 355913 408979
17878 408979 484069 644176 797460 898545 882232 787314 709702 696272 778169 952917 1079490
17867 1079490 1044996 911865 708503 516246 447445 406282 372874 322395 339427 353664 361424
17856 361424 321136 336744 312777 290534 291893 297898 300170 410430 585510 709408 743176
$$ packed form
17934B64647m1958j5986J8919M0210L5115l2792p0541l5585j6284J0340L899K8575
17922A88559L0851J4071l8502k8518K1550J6926M049K4032R195j2351N76J3390
17910B43828N3340R2591J47554K38407J45568L6545l3679j68860j10112L9944
17900F85126J64481K54636J47743o7312j94084k55709j95439q5603k5484m8155
17890C80200k4234q322K1566R191q841j3312l6763n0130J4016L8661L3881N3066
17878D08979P5090J60107J53284J01085j6313r4918p7612j3430Q1897J74748J26573
17867A079490l4494j33131k03362j92257o8801m1163l3408n0479J7032J4237P760
17856C61424m0288J5608k3967k2243J359O005K272J10260J75080J23898L3768
$$ plain form
17845 743176 703186 611242 495906 411549 340596 292357 258098 201397 211068 239044 249442
17834 249442 263926 286514 316025 372877 461719 628081 939419 1204965 1373154 1485276
17824 1485276 1537229 1479650 1468692 1502903 1584518 1635123 1597619 1459677 1348094 1266429 1264952
17813 1264952 1258924 1246276 1326831 1578029 1843959 2074369 2214291 2163873 2062252 1891214
17803 1891214 1751241 1714877 1588123 1460168 1311858 1175080 1132072 1231177 1338423 1391961
17793 1391961 1424176 1410787 1318875 1119290 845218 643892 575156 489414 421860 406680 453390
17782 453390 469756 482940 532559 612995 659913 742284 872692 990216 1112082 1198431 1169252
17771 1169252 1094708 1003995 973284 1010177 1053490 1152932 1235714 1213875 1114901 954826 769768
$$ packed form
17845G43176l9990r1944j15336q4357p0953m8239l4259n6701R671K7976J0398
17834B49442J4484K2588K9511N6852Q8842J66362L11338K65546J68189J12122
17824A485276N1953n7579j0958L4211Q1615N0605l7504j37942j11583q1665j477
17813A264952o028j2648Q0555K51198K65930K30410J39922n0418j01621j71038
17803A891214j39973l6364j26754j27955j48310j36778m3008R9105J07246N3538
17793A391961L2215j3389r1912j99585k74072k01326o8736q5742o7554j5180M6710
17782D53390J6366J3184M9619Q0436M6918Q2371J30408J17524J21866Q6349k9179
17771A169252p4544r0713l0711L6893M3313R9442Q2782k1839r8974j60075j85058
$$ plain form
17760 769768 598274 458513 391779 353378 328836 302717 309655 301014 298470 297844 306314 263990
17748 263990 225059 209731 233917 235916 223089 235234 287499 351195 426295 565038 690350
17737 690350 703873 628753 542790 481326 421539 424935 468869 544297 568303 586405 635088 672494
17725 672494 675000 691501 674650 655328 704775 823756 902369 918903 857426 723677 658212
17714 658212 628640 591508 598234 644534 649894 655748 717932 813365 857947 809200 660586 503335
17702 503335 403408 340218 269855 233698 222459 225817 230100 242447 237159 223542 205822 211553
17690 211553 248385 325115 420193 480847 502706 427492 286831 221509 188274 178597 178643 194162
17678 194162 199110 161752 132629 126387 96608 103759 113419 74026 40877 19814 28271 10326
$$ packed form
17760G69768j71494j39761o6734l8401k4542k6119O938q641k544o26Q470m2324
17748B63990l8931j5328K4186J999j2827J2145N2265O3696P5100J38743J25312
17737F90350J3523p5120q5963o1464n9787L396M3934P5428K4006J8102M8683L7406
17725F72494K506J6501j6851j9322M9447J18981P8613J6534o1477j33749o5465
17714F58212k9572l7132O726M6300N360N854O2184R5433M4582m8747j48614j57251
17702E03335r9927o3190p0363l6157j1239L358M283J2347n288j3617j7720N731
17690B11553L6832P6730R5078O0654K1859p5214j40661o5322l3235r677M6J5519
17678A94162M948l7358k9123o242k9779P151R660l9393l3149k1063Q457j7945
$$ plain form
17666 10326 25621 -4371 -29840 -6485 20384 -3215 24213 16762 -20638 3613 15823 -13364
17654 -13364 531 32087 35897 21590 -1556 -54023 -4029 43710 74105 51740 53473 53076
17642 53076 42727 48576 46080 82298 70606 58780 46038 46267 37121 64172 25009 11169 26272
17629 26272 5212 -28164 -25850 -3378 55020 70962 66515 48290 54574 43448 20524 35174
17617 35174 49282 26333 32363 48664 36679 -10414 -29678 -23311 -23832 -37780 -48294 -59446
17605 -59446 -81921 -39888 -33209 -62690 -49585 -67579 -87770 -120943 -88841 -8398 34709 39937
17593 39937 1608 -12109 -20962 -3412 1150 -37412 -55790 -32173 -4798 23307 21513 -14754
17581 -14754 -36395 -23093 -47936 -62945 -41254 16793 20434 26335 5293 2117 21018 11630
$$ packed form
17666A0326J5295k9992k5469K3355K6869k3599K7428p451l7400K4251J2210k9187
17654a3364J3895L1556L810j4307k3146n2467M9994M7739L0395k2365J733l97
17642E3076j0349N849k496L6218j1692j1826j2742K29r146K7051l9163j3840J5103
17629B6272k1060l3376K314K2472N8398J5942m447j8225O284j1126k2924J4650
17617C5174J4108k2949O030J6301j1985m7093j9264O367n21j3948j0514j1152
17605e9446k2475M2033O679k9481J3105j7994k0191l3173L2102Q0443M3107N228
17593C9937l8329j3717q853J7550M562l8562j8378K3617K7375K8105j794l6267
17581a4754k1641J3302k4843j5009K1691N8047L641N901k1042l176J8901r388
$$ plain form
17569 11630 20574 46091 66253 32901 -37914 -52290 -28050 -14461 -31814 -34638 -28020 -20455
17557 -20455 -18047 -38070 -40822 -3600 17629 6698 -16952 -40232 -39070 -22603 -44404 -36987
17545 -36987 -9495 -14596 14163 32762 8216 2843 22588 23680 14846 -5763 7201 46416
17533 46416 24485 12104 22554 15919 -1831 18319 -26907 -27540 5981 42383 48952 43360 61091
17520 61091 69410 23049 4432 1893 -6451 25850 -8688 15429 26445 46245 40069 13161
17508 13161 -7422 12178 65602 85369 78687 51984 23944 11289 -8205 -829 -6202 -23004
17496 -23004 -38666 -39723 -47829 -18133 -13858 -30622 -52910 -25855 -4482 -8192 -55515 -96152
17484 -96152 -79872 -46959 7236 -3355 -21204 1071 32694 -14593 -43026 -28933 -433 3020
$$ packed form
17569A1630Q944K5517K0162l3352p0815j4376K4240J3589j7353k824O618P565
17557b0455K408k0023k752L7222K1229j0931k3650k3280J162J6467k1801P417
17545c6987K7492n101K8759J8599k4546n373J9745J092q834k0609J2964L9215
17533D6416k1931j2381J0450o635j7750K0150m5226o33L3521L6402O569n592J7731
17520F1091Q319m6361j8617k539q344L2301l4538K4117J1016J9800o176k6908
17508A3161k0583J9600N3424J9767o682k6703k8040j2655j9494P376n373j6802
17496b3004j5662j057q106K9696M275j6764k2288K7055K1373l710m7323m0637
17484i6152J6280L2913N4195j0591j7849K2275L1623m7287k8433J4093K8500L453
$$ plain form
17472 3020 -15676 -44881 -39395 -27872 -16921 -4248 7459 11727 43866 17531 -38233 -28955
17460 -28955 -15848 -9636 -16203 -24554 -5215 -30363 -23175 -11342 19153 30770 -18945 -71494
17448 -71494 -63547 -11199 39353 72235 99562 118986 146332 162829 250687 387420 394658 321483
17436 321483 214545 75746 16190 30183 78258 76678 19475 12511 -8567 5453 16069
17425 16069 44717 79762 84510 80603 59217 36866 36074 41771 16073 30119 27889 47497 39964
17412 39964 -27067 -45350 -17469 3328 6914 -6812 -13547 41917 52928 52518 25211 7642
17400 7642 12251 23715 24166 5593 -5330 -35925 -53762 -85076 -51948 7399 2927 -46934 -51624
17387 -51624 -27473 -16011 -17117 10530 24749 24872 34101 41713 78350 101322 82319 45518 -13288
$$ packed form
17472C020j8696k9205N486J1523J0951J2673J1707M268L2139k6335n5764R278
17460b8955J3107O212o567q351J9339k5148P188J1833L0495J1617m9715n2549
17448g1494P947N2348N0552L2882K7327J9424K7346J6497Q7858J36733P238p3175
17436C21483j06938j38799n9556J3993M8075j580n7203o964k1078J4020J0616
17425A6069K8648L5045M748l907k1386k2351p92N697k5698J4046k230J9608p533
17412C9964o7031j8283K7881K0797L586j3726o735N5464J1011m10k7307j7569
17400G642M609J1464M51j8573j0923l0595j7837l1314L3128N9347m472m9861m690
17387e1624K4151J1462j106K7647J4219J23R229P612L6637K2972j9003l6801n8806
$$ plain form
17374 -13288 -39217 -75481 -82332 -76106 -51506 -12862 -8044 -9067 -11790 -15671 -22672 -8876 7394
17361 7394 -25491 -47795 -43229 -51516 -36953 -6833 -10051 12186 -14053 -24420 -5492 -3118 -5033
17348 -5033 -39327 -40706 -52475 -20679 39034 70222 50289 12704 -25 20062 14279 1924
17336 1924 1213 -11390 -51039 -44406 -28923 -39340 -11287 10055 13088 7959 -14690 -10876 -7848
17323 -7848 -20669 -36358 -43836 -49358 -33321 -38290 -38918 -51628 -52441 -77175 -36271 12632 2305
17310 2305 -485 -11560 -1966 -20347 -43731 -73235 -65076 -21131 24822 41256 33835 10915 -26347
17297 -26347 -16506 -4424 2191 14373 32177 27964 26309 3126 27374 45442 27858 4894
17285 4894 4975 28814 69587 115405 99091 64036 46273 36543 44158 12194 -15519 3105 -46335
$$ packed form
17374a3288k5929l6264o851O226K4600L8644M818j023k723l881p001J3796J6270
17361G394l2885k2304M566q287J4563L0120l218K2237k6239j0367J8928K374j915
17348e033l4294j379j1769L1796N9713L1188j9933l7585j2729K0087n783j2355
17336A924p11j2603l9649O633J5483j0417K8053K1342L033n129k2649L814L028
17323g848j2821j5689p478n522J6037m969o28j2710q13k4734M0904M8903j0327
17310B305k790j1075R594j8381k3384k9504Q159M3945M5953J6434p421k2920l7262
17297b6347R841J2082O615J2182J7804m213j655k3183K4248J8068j7584k2964
17285D894Q1K3839M0773M5818j6314l5055j7763r730P615l1964k7713J8624m9440
$$ plain form
17272 -46335 -73873 -74456 -70005 -61273 -60881 -86633 -66426 -59817 -22290 -10929 8602 -31822 -64148
17259 -64148 -34688 7629 -39610 -54404 -22624 -39439 14627 73403 63223 29273 49342 71564
17247 71564 30980 4911 -25814 -16076 14889 -5147 35297 10479 22968 43071 43778 37172
17235 37172 53034 74129 68905 47681 29638 37278 24409 68679 74269 38701 30173 51124
17223 51124 40847 48261 79229 135777 163779 196665 212903 197678 179912 174855 173622 152019
17211 152019 100642 57752 80521 96952 80471 26386 2676 9539 29102 46757 74859 69811
17199 69811 79914 56947 26560 886 -2593 4832 2389 6343 9119 -20663 5509 32110 49689
17186 49689 16249 34520 78983 99926 83675 97334 76126 42595 60941 91478 113638 132038
$$ packed form
17272d6335k7538n83M451Q732L92k5752K0207O609L7527J1361J9531m0424l2326
17259f4148K9460M2317m7239j4794L1780j6815N4066N8776j0180l3950K0069K2222
17247G1564m0584k6069l0725R738L0965k0036M0444k4818J2489K0103P07o606
17235C7172J5862K1095n224k1224j8043P640j2869M4270N590l5568q528K0951
17223E1124j0277P414L0968N6548K8002L2886J6238j5225j7766n057j233k1603
17211A52019n1377m2890K2769J6431j6481n4085k3710O863J9563J7655K8102n048
17199F9811J0103k2967l0387k5674l479P425k443L954K776k9782K6172K6601J7579
17186D9689l3440J8271M4463K0943j6251J3659k1208l3531J8346L0537K2160J8400
$$ plain form
17174 132038 116165 84654 62528 64119 64380 38048 63888 77753 55063 97114 122118 153421
17162 153421 163882 128469 88736 88099 103807 104598 75619 38162 69339 99391 91884 120929
17150 120929 141614 187088 204270 176651 191850 220782 243101 225195 169509 103328 30073
17139 30073 48840 80452 75876 80022 89899 81517 77334 75632 46097 56651 85243 79957 105107
17126 105107 70337 3300 -11425 -19665 -28415 -40337 36084 55019 13539 -4657 -19535 -40796
17114 -40796 -47735 -1493 31996 57698 102362 85768 53100 86139 66564 15851 11081 32639
17102 32639 39453 29874 27201 36943 91074 102855 97316 59278 49809 75026 83913 85523 107207
17089 107207 109325 133925 108569 65438 26534 68202 50221 76392 70667 62895 72594 92082
$$ packed form
17174A32038j5873l1511k2126J591K61k6332K5840J3865k2690M2051K5004L1303
17162A53421J0461l5413l9733o37J5708P91k8979l7457L1177L0052p507K9045
17150A20929K0685M5474J7182k7619J5199K8932K2319j7906n5686o6181p3255
17139C0073J8767L1612m576M146R877q382m183j702k9535J0554K8592n286K5150
17126A05107l4770o7037j4725q240q750j1922P6421J8935m1480j8196j4878k1261
17114d0796o939M6242L3489K5702M4664j6594l2668L3039j9575n0713m770K1558
17102C2639O814r579k673R742N4131J1781n539l8038r469K5217Q887J610K1684
17089A07207K118K4600k5356m3131l8904M1668j7981K6171n725p772R699J9488
$$ plain form
17077 92082 119158 108852 77057 71218 50184 -28953 -70279 -65987 -57160 -20510 14721 19068
17065 19068 -7192 4171 48529 84343 60767 23603 7627 14454 18852 31849 24441 30325
17053 30325 19134 31314 15010 -1962 38086 69649 70026 80384 69485 71687 62523 51300
17041 51300 50104 47665 54624 81128 82259 66450 45809 -24477 -53212 -59140 -59272 -43292 -43039
17028 -43039 -37802 -11665 -6676 -35943 -36124 -9215 32111 -3054 -41877 -23238 2796 -14492
17016 -14492 9627 19898 -16591 -41314 -74087 -23477 -6942 17237 26246 -6315 2104 7296
17004 7296 5487 7717 12603 19054 29968 23871 -4649 -31231 -29875 -15470 22592 24867 37767
16991 37767 71920 21370 -16414 -32822 2689 -14069 -52681 -26582 -18836 -14315 149 5286
$$ packed form
17077I2082K7076j0306l1795n839k1034p9137m1326M292Q827L6650L5231M347
17065A9068k6260J1363M4358L5814k3576l7164j5976O827M398J2997p408N884
17053C0325j1191J2180j6304j6972M0048L1563L77J0358j0899K202r164j1223
17041E1300j196k439O959K6504J131j5809k0641p0286k8735n928j32J5980K53
17028d3039N237K6137M989k9267j81K6909M1326l5165l8823J8639K6034j7288
17016a4492K4119J0271l6489k4723l2773N0610J6535K4179R009l2561Q419N192
17004G296j809K230M886O451J0914o097k8520k6582J356J4405L8062K275J2900
16991C7767L4153n0550l7784j6408L5511j6758l8612K6099P746M521J4464N137
$$ plain form
16979 5286 10123 52919 56644 65272 44397 49073 42720 51365 45919 15494 -6472 -4406 19008
16966 19008 42574 66980 55244 57337 32854 -10644 -26990 -32777 -49873 -54957 -40090 5743
16954 5743 -43892 -67355 -82355 -97598 -82861 -55110 -47484 -40222 -1429 12564 9560 -6294
16942 -6294 -67346 -68346 -28505 -7 32017 20789 16482 15498 41499 66957 30793 -44019 -59259
16929 -59259 -8397 24084 -6355 -40854 -83561 -120972 -62816 -8580 4757 -13051 -1972 18982
16917 18982 7458 -1964 -37927 -77070 -57171 -42644 -58991 -50175 -37391 -60853 -60398 -38340
16905 -38340 -16954 -16985 -56438 -19386 -21226 -33332 -22015 1429 3505 5272 12918 -6127 -19569
16892 -19569 -12710 -16416 -29632 -42839 -38227 -69798 -62590 -55199 -48369 -22011 -35232 -62214 -70875
$$ packed form
16979E286M837M2796L725Q628k0875M676o353Q645n446l0425k1966K066K3414
16966A9008K3566K4406j1736K093k4483m3498j6346n787j7096n084J4867M5833
16954E743m9635k3463j5000j5243J4737K7751P626P262L8793J3993l004j5854
16942f294o1052j000L9841K8498L2024j1228m307r84K6001K5458l6164p4812j5240
16929e9259N0862L2481l0439l4499m2707l7411N8156N4236J3337j7808J1079K0954
16917A8982j1524r422l5963l9143J9899J4527j6347Q816J2784k3462M55K2058
16905c8340K1386l1l9453L7052j840j2106J1317K3444K076J767P646j9045j3442
16892a9569O859l706j3216j3207M612l1571P208P391O830K6358j3221k6982q661
$$ plain form
16879 -70875 -49757 -14164 -1845 7458 34612 26797 -22836 -68172 -81218 -69503 -39110 -21123
16867 -21123 -45160 -2414 3334 7697 31386 32283 36100 22205 23440 36451 9962 13722 23563
16854 23563 16155 1847 -26624 -39006 -23619 15549 35749 -1201 -47325 -29392 3784 2608
16842 2608 17570 20023 2249 -27897 -20156 -5630 -14332 -1543 -5352 -6625 16950 -8770 -12512
16829 -12512 -41172 -15835 8513 19953 -8383 -50777 -70626 -72736 -40840 -51788 -93055 -90316
16817 -90316 -55429 -9739 3386 30034 24833 15073 -4969 15162 32564 31770 36198 4614 -18723
16804 -18723 -6919 20007 67591 80633 50916 13641 12116 17282 33093 33180 -8073 -9025 20483
16791 20483 -1493 -11592 -6299 -12555 -18809 -39561 -24849 -44336 -37778 -5037 -17319 -18306 -9809
$$ packed form
16879g0875K1118L5593J2319R303K7154p815m9633m5336j3046J1715L0393J7987
16867b1123k4037M2746N748M363K3689Q97L817j3895J235J3011k6489L760R841
16854B3563p408j4308k8471j2382J5387L9168K0200l6950m6124J7933L3176j176
16842B608J4962K453j7774l0146P741J4526q702J2789l809j273K3575k5720l742
16829a2512k8660K5337K4348J1440k8336m2394j9849k110L1896j0948m1267K739
16817i0316L4887M5690J3125K6648n201r760k0042K0131J7402p94M428l1584k3337
16804a8723J1804K6926M7584J3042k9717l7275j525N166J5811Q7m1253r52K9508
16791B0483k1976j0099N293o256o254k0752J4712j9487O558L2741j2282r87Q497
$$ plain form
16778 -9809 -13067 -30592 -3240 16139 17015 -22800 -86953 -100165 -66557 17225 36601 24348
16766 24348 -568 6918 24741 2363 24512 29833 36423 33041 5319 -105 -2364 30017 43937
16753 43937 34348 25268 10520 4721 23633 4065 1208 37934 47641 -6976 -34283 -5531 18313
16740 18313 5303 11489 7372 37076 21310 5681 -13667 -64195 -76081 -48929 -17900 -6024
16728 -6024 -3269 -15835 -49931 -38257 -2749 26936 16625 3016 -16075 4657 640 14828
16716 14828 593 8147 -6138 -33086 -78859 -54436 -12382 10876 710 -37732 -47549 -33161
16704 -33161 -16279 33375 34905 -10698 -28308 -42183 -18131 7431 -40487 -39301 -35722 16223
16692 16223 27463 9670 -10010 -16521 -10701 -14824 -18590 -46418 -50800 -32133 -19882 -13781 -10538
$$ packed form
16778i809l258j7525K7352J9379Q76l9815o4153j3212L3608Q3782J9376j2253
16766B4348k4916P486J7823k2378K2149N321O590l382k7722n424k259L2381J3920
16753D3937r589r080j4748n799J8912j9568k857L6726R707n4617k7307K8752K3844
16740A8313j3010O186m117K9704j5766j5629j9348n0528j1886K7152L1029J1876
16728f024K755j2566l4096J1674L5508K9685j0311j3609j9091K0732m017J4188
16716A4828j4235P554j4285k6948m5773K4423M2054K3258j0166l8442r817J4388
16704c3161J6882M9654J530m5603j7610j3875K4052K5562m7918J186L579N1945
16692A6223J1240j7793j9680o511N820m123l766k7828m382J8667J2251O101L243
$$ plain form
16679 -10538 -47138 -92206 -76760 -47792 -43105 -46718 -79260 -50518 -31507 -31696 -38318 -23512 -21388
16666 -21388 4290 27451 16267 -12665 2909 -9763 -7526 -22278 -28160 -28189 -17844 -48991 -51264
16653 -51264 -51033 -49048 -40028 -35508 -11854 17099 49088 56235 26841 12359 11235 2775 2123 -1085
16639 -1085 -19237 -25224 -55220 -74496 -61346 -49131 -65731 -22189 13375 27186 58578 79771
16627 79771 77873 80313 27560 17244 -713 -21189 5858 71566 52549 10523 -471 -40204
16615 -40204 -46965 -34779 -25745 -11203 -16502 -1235 -11635 -8387 -16723 -48664 -39708 -4290 2385
16602 2385 -33113 -23227 -21155 3499 24927 22570 36997 62580 -1433 -49457 -24508 -29903 -35878
16589 -35878 -27775 -42165 -75258 -92901 -49761 13704 53849 57635 2465 -10403 -17535 -20093
$$ packed form
16679a0538l6600m5068J5446K8968M687l613l2542K8742J9011j89o622J4806K124
16666b1388K5678K3161j1184k8932J5574j2672K237j4752n882k9J0345l1147k273
16653e1264K31J985R020M520K3654K8953L1989P147k9394j4482j124q460o52l208
16639a085j8152n987k9996j9276J3150J2215j6600M3542L5564J3811L1392K1193
16627G9771j898K440n2753j0316j7957k0476K7047O5708j9017m2026j0994l9733
16615d0204o761J2186R034J4542n299J5267j0400L248q336l1941Q956L5418O675
16602B385l5498R886K072K4654K1428k357J4427K5583o4013m8024K4949n395n975
16589c5878Q103j4390l3093j7643M3140O3465M0145L786n5170j2868p132k558
$$ plain form
16577 -20093 17080 51057 63538 59041 27737 -7678 -25900 -9313 40641 49867 12057 -37720
16565 -37720 -29844 -22468 -45638 -30605 -46470 -59156 -40066 -15598 25999 20089 -37040 -52851
16553 -52851 -49136 -18702 -14225 10254 -9993 -6937 3668 -10027 -49192 -54723 -69368 -79601
16541 -79601 -66902 -58567 -38677 -72282 -67958 -76268 -68434 -47621 -57915 -35269 -15190 -12432 -35605
16528 -35605 -54461 -7384 22445 6690 -28474 -3819 26091 393 -23362 -40129 -43892 -34870
16516 -34870 -50309 -28001 -11462 -2541 -27756 -34147 -12828 10476 8839 -2938 12747 -12969
16504 -12969 -17970 18367 14650 -7838 -17714 7884 20941 24976 38618 54893 57154 59973 8483
16491 8483 1627 66 13298 15579 10793 -29229 -39286 -8930 -5734 -37557 -34709 -36074 -25822
$$ packed form
16577b0093L7173L3977J2481m497l1304l5415j8222J6587M9954R226l7810m9777
16565c7720P876P376k3170J5033j5865j2686J9090K4468M1597n910n7129j5811
16553e2851L715L0434M477K4479k0247L056J0605j3695l9165n531j4645j0233
16541g9601J2699Q335J9890l3605M324q310P834K0813j0294K2646K0079K758k3173
16528c5605j8856M7077K9829j5755l5164K4655K9910k5698k3755j6767l763R022
16516c4870j5439K2308J6539Q921k5215o391K1319K3304j637j1777J5685k5716
16504a2969n001L6337l717k2488r876K5598J3057M035J3642J6275K261K819n1490
16491H483o856j561J3232K281m786m0022j0057L0356L196l1823K848j365J0252
$$ plain form
16478 -25822 5477 9893 9361 3653 -27473 -52774 -46678 -23388 -23815 -25458 17665 33105 40530
16465 40530 -10830 -37659 -74664 -67930 -56953 -56782 -58038 -62567 -99120 -82438 -49868 -46820 -49433
16452 -49433 -3387 3396 20083 13604 38407 -11709 -49140 -41624 -46899 -48995 -24104 9992 -3201
16439 -3201 -34350 -26368 -355 44383 34079 -4139 -929 18900 5099 -26585 -24871 -12860
16427 -12860 -13076 12595 -8193 -8358 -6959 -27727 -11112 5011 -10800 1955 38698 12006 -51043
16414 -51043 -96175 -109877 -86272 -80967 -60781 -37213 -49555 -47604 -67202 -73825 -52919 -60971
16402 -60971 -67225 -60570 -43465 -15073 -1517 13599 480 18397 37272 41220 20862 -1002
16390 -1002 11427 17023 24419 -25419 -55620 -14099 35269 384 30071 32984 2409 445 -44506
$$ packed form
16478b5822L1299M416n32n708l1126k5301O096K3290m27j643M3123J5440P425
16465D0530n1360k6829l7005O734J0977J71j256m529l6553J6682L2570L048k613
16452d9433M6046O783J6687o479K4803n0116l7431P516n275k096K4891L4096j3193
16439c201l1149P982K6013M4738j0304l8218L210J9829j3801l1684J714J2011
16427a2860k16K5671k0788j65J399k0768J6615J6123j5811J2755L6743k6692o3049
16414e1043m5132j3702K3605N305K0186K3568j2342J951j9598o623K0906q052
16402f0971o254O655J7105K8392J3556J5116j3119J7917J8875L948k0358k1864
16390a002J2429N596P396m9838l0201M1521M9368l4885K9687K913l0575j964m4951
$$ plain form
16377 -44506 -51126 -20586 -36493 -58825 -42643 -32723 -561 -33826 -84242 -52548 -31778 -23846
16365 -23846 -63446 -74871 -31624 -8629 12895 38209 70477 77619 118671 98108 55611 52938
16353 52938 32367 15846 24149 73257 47243 22366 10424 24378 51353 58932 74358 100618
16341 100618 88573 30396 -6312 -33252 -47251 -40140 -58022 -99462 -98837 -7324 35201 48828
16329 48828 54453 45074 -111 -32137 -45608 -7075 6612 -7703 -35077 -59791 -28964 -8318
16317 -8318 1800 -5079 -54774 -74944 -47284 -31566 -5626 5023 -33215 -38992 -12491 -13270 12312
16304 12312 32733 34123 2725 -19168 -12683 -35422 -17091 5646 -17509 -49833 9869 34073
16292 34073 8890 -10294 -8598 3768 23255 21901 23893 44436 71727 46455 27060 -4308
$$ packed form
16377d4506o620L0540j5907k2332J6182R920L2162l3265n0416L1694K0770P932
16365b3846l9600j1425M3247K2995K1524K5314L2268P142M1052k0563m2497k673
16353E2938k0571j6521Q303M9108k6014k4877j1942J3954K6975P579J5426K6260
16341A00618j2045n8177l6708k6940j3999P111j7882m1440O25R1513M2525J3627
16329D8828N625r379m5185l2026j3471L8533J3687j4315k7374k4714L0827K0646
16317h318J0118o879m9695k0170K7660J5718K5940J0649l8238n777K6501p79K5582
16304A2312K0421J390l1398k1893O485k2739J8331K2737k3155l2324N9702K4204
16292C4073k5183j9184J696J2366J9487j354J992K0543K7291k5272j9395l1368
$$ plain form
16280 -4308 -13622 -45594 -50664 -53556 -31855 -13024 24720 47841 25352 -6485 -18241 -22260 -39998
16267 -39998 2615 26187 54283 84321 56872 -13927 -34312 -17211 -35512 -49781 -38162 -31108
16255 -31108 4970 27829 36952 31322 -19400 -12210 15406 31416 13065 23957 45157 39052
16243 39052 50604 24672 14069 23858 21458 6243 19491 3026 24227 43949 44312 22302
16231 22302 -1166 -16951 -55876 -30198 9612 24063 11551 -1414 -25315 -40381 -28529 -27632
16219 -27632 -40928 -52159 -29929 -33364 -54995 -79814 -87699 -19947 67718 52594 25231 -31954
16207 -31954 -49032 -31657 13719 16379 -15217 -35127 -11873 14817 -31649 -41758 -84615 -82061
16195 -82061 -56531 -55622 -12210 -33712 -69616 -7344 8894 28045 58149 46309 301 -47824
$$ packed form
16280d308r314l1972n070k892K1701J8831L7744K3121k2489l1837j1756m019j7738
16267c9998M2613K3572K8096L0038k7449p0799k0385J7101j8301j4269J1619P054
16255c1108L6078K2859R123n630n0722P190K7616J6010j8351J0892K1200o105
16243C9052J1552k5932j0603R789k400j5215J3248j6465K1201J9722L63k2010
16231B2302k3468j5785l8925K5678L9810J4451j2512j2965k3901j5066J1852Q97
16219b7632j3296j1231K2230l435k1631k4819p885O7752Q7665j5124k7363n7185
16207c1954j7078J7375M5376K660l1596j9910K3254K6690m6466j0109m2857K554
16195h2061K5530R09M3412k1502l5904O2272J6238J9151L0104j1840m6008m8125
$$ plain form
16183 -47824 -23238 78233 99361 78597 48571 -12588 -42294 -32025 -12693 -4249 -1234 -2848
16171 -2848 1370 -22727 -2079 -28755 -6814 878 4492 8597 -153 -2430 -6974 -26694 -18230
16158 -18230 -670 -27722 7508 15187 -12595 -14538 -12301 11268 -2451 15030 46160 16594
16146 16594 -19108 -29866 -33097 -24497 -40499 -18559 21806 38386 8973 -5867 -28252 -38074
16134 -38074 -26006 -7520 -8427 -3611 43341 60913 40501 1761 -13261 17612 -44680 -62283
16122 -62283 -39365 -62947 -30814 1046 4370 40771 41541 30169 49095 48831 16811 -5625 -5587
16109 -5587 14154 -6412 -6391 -10285 -50260 -31879 9802 -28958 -70186 -35241 5607 -8019 1137
16096 1137 -27840 -43838 8495 66416 63992 47885 2884 -30040 -20566 -47377 -99088 -86014
$$ packed form
16183d7824K4586J01471K1128k0764l0026o1159k9706J0269J9332Q444L015j614
16171b848M218k4097K0648k6676K1941P692L614M105q750k277m544j9720Q464
16158a8230J7560k7052L5230P679k7782j943K237K3569j3719J7481L1130k9566
16146A6594l5702j0758l231Q600j6002K1940M0365J6580k9413j4840k2385r822
16134c8074J2068J8486r07M816M6952J7572k0412l8740j5022L0873o2292j7603
16122f2283K2918k3582L2133L1860L324L6401P70j1372J8926k64l2020k2436L8
16109e587J9741k0566K1l894l9975J8381M1681l8760m1228L4945M0848j3626R156
16096A137k8977j5998N2333N7921k424j6107m5001l2924R474k6811n1711J3074
$$ plain form
16084 -86014 -35822 -35647 -25665 619 26544 59189 36902 52760 47065 -3111 -22533 -45962
16072 -45962 -10925 -24670 -50136 -52939 -100864 -68034 -13622 26908 31231 39603 1432 -67644
16060 -67644 -68234 -28505 -4530 -1287 -2471 4432 7163 2589 16176 -6053 -50587 -48755 -20711
16047 -20711 -36349 -45886 -46082 -57389 -32871 -3466 -6853 42553 40322 5105 21938 40987 77549
16034 77549 89275 31135 -17851 -27651 -33141 -36093 -53197 -27989 -31169 -42698 -4537 -12945 -31015
16021 -31015 16136 20649 -25353 -39546 -19045 -35574 -38726 -42212 -70382 -56198 -279 23396
16009 23396 29356 56207 44690 40367 34634 18497 -8009 -29398 -22864 -20238 -41935 -23078 -12378
15996 -12378 -2128 -34060 -25481 -33889 -14830 16904 43702 58670 70490 69933 43023 10939
$$ packed form
16084h6014N0192J75R982K6284K5925L2645k2287J5858n695n0176j9422k3429
16072d5962L5037j3745k5466k803m7925L2830N4412M0530M323Q372l8171o9076
16060f7644n90L9729K3975L243j184O903K731m574J3587k2229m4534J832K8044
16047b0711j5638r537j96j1307K4518K9405l387M9406k231l5217J6833J9049L6562
16034G7549J1726n8140m8986r800n490k952j7104K5208l180j1529L8161q408j8070
16021c1015M7151M513m6002j4193K0501j6529l152l486k8170J4184N5919K3675
16009B3396N960K6851j1517m323n733j6137k6506k1389O534K626k1697J8857J0700
15996a2378J0250l1932Q579q408J9059L1734K6798J4968J1820n57k6910l2084
$$ plain form
15984 10939 32827 23896 12227 -9229 7562 31157 -7354 -19833 -2996 4185 14474 34025
15972 34025 20011 28963 877 -25158 -18900 -42425 -62232 -51649 -18204 -2620 3587 -6774
15960 -6774 -15315 7601 23424 -4146 16347 31200 2446 7696 -38623 -3247 15861 12241
15948 12241 20900 17335 -706 -16829 -7603 28374 31482 11810 15230 15791 41486 56735 34403
15935 34403 19111 -3237 -4171 20354 33855 52086 -26501 -74339 -35326 18433 31929 42628
15923 42628 -2857 7724 25922 32160 7169 -12082 -18175 -44567 -45578 -25976 -1782 28530
15911 28530 23493 20828 30585 14290 17504 7527 16951 69640 93810 64552 31810 5798 -17957
15898 -17957 -29237 -3261 16818 17283 -12637 -259 41549 42940 -6280 -26113 -33490 6564
$$ packed form
15984A0939K1888q931j1669k1456J6791K3595l8511j2479J6837P181J0289J9551
15972C4025j4014Q952k8086k6035O258k3525j9807J0583L3445J5584O207j0361
15960f774q541K2916J5823k7570K0493J4853k8754N250m6319L5376J9108l620
15948A2241Q659l565j8041j6123R226L5977L108j9672L420N61K5695J5249k2332
15935C4403j5292k2348r34K4525J3501J8231p8587m7838L9013N3759J3496J0699
15923D2628m5485J0581J8198O238k4991j9251o093k6392j011J9602K4194L0312
15911B8530n037k665R757j6295L214r977R424N2689K4170k9258l2742k6012k3755
15898a7957j1280K5976K0079M65k9920J2378M1808J391m9220j9833p377M0054
$$ plain form
15886 6564 38014 39189 17680 30044 37461 1465 -10900 -10530 12839 16037 7873 31998 37823
15873 37823 4196 18142 20115 27347 6239 -12168 -25146 -9392 -10347 -35118 -28876 5288 25249
15860 25249 6357 -285 29433 69142 73351 49272 60083 43411 40828 81662 71286 69610
15848 69610 76345 43409 -331 6258 3198 -1266 2764 -25363 -48744 -35811 21107 26773 17842
15835 17842 37260 58537 44516 29129 12289 17139 1485 21985 65027 66386 60258 56073
15823 56073 30895 32763 41081 28015 -7534 -37207 -32076 -1670 -3757 -10823 -40684 -45717 -71172
15810 -71172 -83502 -44727 18620 9651 23138 2283 -35278 -32556 -58606 -53612 -63379 -42852
15798 -42852 -47136 -43905 -33713 -9461 -18282 -23341 -56801 -76856 -32255 28432 27568 12227 7662
$$ packed form
15886F564L1450J175k1509J2364P417l5996j2365L70K3369L198q164K4125N825
15873C7823l3627J3946J973P232k1108j8407j2978J5754r55k4771O242L4164J9961
15860B5249j8892o642K9718L9709M209k4079J0811j6672k583M0834j0376j676
15848F9610O735l2936m3740O589l060m464M030k8127k3381J2933N6918N666q931
15835A7842J9418K1277j4021j5387j6840M850j5654K0500M3042J359o128m185
15823E6073k5178J868Q318j3066l5549k9673N131L0406k087p066k9861n033k5455
15810g1172j2330L8775O3347q969J3487k0855l7561K722k6050M994r767K0527
15798d2852m284L231J0192K4252q821n059l3460k0055M4601O0687q64j5341m565
$$ plain form
15785 7662 -18256 10025 -13524 -46908 -38932 -8535 26953 17768 -33156 -39285 -11220 34926
15773 34926 17261 -8857 14514 32764 12065 -7546 -38828 -23257 -9587 -18947 -34009 -28176
15761 -28176 -6844 18417 19645 29433 30995 39227 67713 69558 28781 -13253 -7606 14638 10784
15748 10784 10554 14514 10420 -18101 -48853 -60726 -83763 -34711 -18247 8271 20315 -7224
15736 -7224 -53471 -64725 -58106 -30286 -8066 15433 24023 53433 26467 24775 25318 34508 27003
15723 27003 23894 13109 6463 -17827 -29146 -27342 -21308 5010 15949 23559 47942 88417 71997
15710 71997 34603 19421 -14100 4965 1801 -14420 -9602 -18298 12223 -20944 -40312 -37578
15698 -37578 -7417 22496 20583 -20462 -14551 -8219 -43230 -56384 -56554 -51605 -29911 -4869 21122
$$ packed form
15785G662k5918K8281k3549l3384P976L0397L5488r185n0924o129K8065M6146
15773C4926j7665k6118K3371J8250k0699j9611l1282J5571J3670r360j5062N833
15761b8176K1332K5261J228R788J562Q232K8486J845m0777m2034N647K2244l854
15748A0784k30L960m094k8521l0752j1873k3037M9052J6464K6518J2044k7539
15736g224m6247j1254O619K7820K2220K3499Q590K9410k6966j692N43R190p505
15723B7003l109j0785o646k4290j1319J804O034K6318J0939P610K4383M0475j6420
15710G1997l7394j5182l3521J9065l164j6221M818q696L0521l3167j9368K734
15698c7578L0161K9913j913m1045N911O332l5011j3154j70M949K1694K5042K5991
$$ plain form
15685 21122 6981 -19602 -54968 -58470 -60374 -39695 -31714 -59514 -8908 14531 34241 42566
15673 42566 1126 -13440 30803 42593 60233 45695 30741 10364 -37437 -80964 -63536 -60079
15661 -60079 -27772 1158 -17514 -26499 8074 30961 22362 44250 29926 37172 58976 59596 53882
15648 53882 22734 30564 43095 26961 2394 11787 39923 6463 -32247 -20329 -8998 -7330
15636 -7330 14520 52710 77179 56832 47664 25354 16540 8040 23626 9663 14739 32443 320
15623 320 -14616 32256 27312 4293 -9788 -4665 -14882 -9680 -11461 -7823 -1248 23127 45095
15610 45095 18433 -13518 4316 31279 -7122 -42690 -67963 -65234 -19617 -3355 -29723 -27112
15598 -27112 -47226 -4718 26831 55785 67457 47110 15747 -9562 -29167 -18728 16526 -18076
$$ packed form
15685B1122j4141k6583l5366l502j904K0679P981k7800N0606K3439J9710Q325
15673D2566m1440j4566M4243J1790J7640j4538j4954k0377m7801m3527J7428L457
15661f0079L2307K8930j8672q985L4573K2887q599K1888j4324P246K1804O20n714
15648E3882l1148P830J2531j6134k4567R393K8136l3460l8710J1918J1331J668
15636g330K1850L8190K4469k0347r168k2310q814q500J5586j3963N076J7704l2123
15623C20j4936M6872m944k3019j4081N123j0217N202j781L638O575K4375K1968
15610D5095k6662l1951J7834K6963l8401l5568k5273K729M5617J6262k6368K611
15598b7112k0114M2508L1549K8954J1672k0347l1363k5309j9605J0439L5254l4602
$$ plain form
15586 -18076 -23716 -18109 14121 35736 18038 9721 30440 32280 51204 23181 32071 40065 9899
15573 9899 -3109 9861 4029 13946 27067 1471 -49507 -65457 -56761 -52379 -32986 14960 27523
15560 27523 40839 5948 -38193 -49288 -20692 -37642 -48453 -43379 -7812 3905 774 32514
15548 32514 58755 62107 33049 6002 26027 -2037 -48160 -93625 -72934 -28768 17011 16283
15536 16283 4437 -18563 -19125 -12388 -9328 10536 -6229 -27138 -32880 -39271 -46823 -53106 -46757
15523 -46757 -45688 -2283 20681 33363 12517 -42346 -51970 -37127 5018 24261 35381 12380
15511 12380 9231 6465 -16784 -1022 5932 4615 9349 44964 41724 44563 42989 8593 -13099
15498 -13099 -25004 -33361 -28862 -3743 -14303 -18480 12672 22648 -4820 -20530 -3988 -12542 8573
$$ packed form
15586a8076n640N607L2230K1615j7698q317K0719J840J8924k8023Q890P994l0166
15573I899j3008J2970n832R917J3121k5596n0978j5950Q696M382J9393M7946J2563
15560B7523J3316l4891m4141j1095K8596j6950j0811N074L5567J1717l131L1740
15548C2514K6241L352k9058k7047K0025k8064m6123m5465K0691M4166M5779p28
15536A6283j1846k3000n62O737L060J9864j6765k0909n742o391p552o283O349
15523d6757J069M3405K2964J2682k0846n4863r624J4843M2145J9243J1120k3001
15511A2380l149k766k3249J5762O954j317M734L5615l240K839j574l4396k1692
15498a3099j1905q357M499K5119j0560m177L1152R976k7468j5710J6542q554K1115
$$ plain form
15485 8573 53422 65384 31897 4385 13815 29666 15793 18095 4207 -16055 -56977 -40680
15473 -40680 -41693 -83915 -78110 -96324 -111462 -89676 -13749 -8492 -24273 -35652 -24102 -14111
15461 -14111 27274 11703 2981 12506 1683 29397 50105 45212 24326 4014 50136 87033
15449 87033 56116 47011 36328 33901 12900 -11442 -3880 16947 -12107 -24468 -9769 24118
15437 24118 34969 19680 -1317 14154 -37360 -69751 -101899 -79303 -16324 16868 12804 12005
15425 12005 43400 33895 29541 -26126 -50819 -35188 -47363 -30215 -34296 -12402 -44015 -39136
15413 -39136 -29642 -26177 -42788 -77363 -87649 -92889 -87019 -88715 -67616 -58368 -71771 -79047 -67818
15400 -67818 -75205 -48626 -5370 5082 -20341 -47686 -76647 -81386 -88173 -76025 -62371 -45609
$$ packed form
15485H573M4849J1962l3487k7512R430J5851j3873K302j3888k0262m0922J6297
15473d0680j013m2222N805j8214j5138K1786P5927N257j5781j1379J1550R991
15461a4111M1385j5571q722R525j0823K7714K0708m893k0886k0312M6122L6897
15449H7033l0917r105j0683k427k1001k4342P562K0827k9054j2361J4699L3887
15437B4118J0851j5289k0997J5471n1514l2391l2148K2596O2979L3192m064p99
15425A2005L1395r505m354n5667k4693J5631j2175J7148m081K1894l1613M879
15413c9136R494L465j6611l4575j0286n240N870j696K1099R248j3403p276J1229
15400f7818p387K6579M3256J0452k5423k7345k8961m739o787J2148J3654J6762
$$ plain form
15388 -45609 -27727 -15195 -20305 -34688 -29253 -42633 -64643 -60776 -36059 -14829 -23878 -8896
15376 -8896 -23386 -40657 -47276 -67540 -49911 -1136 23632 16264 -1354 9821 50812 62902
15364 62902 36605 19814 42265 20428 14435 52537 33582 8230 -316 11179 34358 74631
15352 74631 62838 6076 22411 55437 85050 79546 71507 49285 16282 -5280 -27580 25990
15340 25990 73549 73010 49363 46695 58048 24304 5181 5484 3486 -35686 -58847 15686 40783
15327 40783 33584 -18172 -67918 -101310 -83962 -21517 8223 -32652 -50628 -34047 3002 16134
15315 16134 -9016 10923 42363 38396 -2013 -20513 -18051 -36088 -66180 -66619 -16376 -21181 -7755
15302 -7755 -15593 -7064 -39951 -63916 -75885 -65830 -35091 -3214 -26617 -23724 -36370 -79954
$$ packed form
15388d5609J7882J2532n110j4383N435j3380k2010L867K4717K1230r049J4982
15376h896j4490j7271o619k0264J7629M8775K4768p368j7618J1175M0991J2090
15364F2902k6297j6791K2451k1837n993L8102j8955k5352q546J1495K3179M0273
15352G4631j1793n6762J6335L3026K9613n504q039k2222l3003k1562k2300N3570
15340B5990M7559n39k3647k668J1353l3744j9123L03j998l9172k3161P4533K5097
15327D0783p199n1756m9746l3392J7348O2445K9740m0875j7976J6581L7049J3132
15315A6134k5150J9939L1440l967m0409j8500K462j8037l0092m39N0243m805J3426
15302g755p838Q529l2887k3965j1969J0055L0739L1877k3403K893j2646m3584
$$ plain form
15290 -79954 -64903 -44570 -71019 -68209 -71038 -59470 -63166 -68848 -59085 5143 39532 39204 10186
15277 10186 -16816 8276 28290 29251 40903 43711 -10052 -58868 -62290 -60255 -56547 -59059 -23482
15264 -23482 -2121 28386 -1188 -17055 1801 8429 5502 39398 27926 -19745 -56047 -22728
15252 -22728 10670 582 -22355 -7767 19776 16082 39377 66414 59197 40094 13030 15074
15240 15074 54991 58842 23419 6415 9995 19995 30587 14377 -11083 -38213 -28957 -51583
15228 -51583 -65755 -36506 -37613 -40141 -34529 -50593 -89240 -80570 -24525 -10747 -18987 -22822 -20656
15215 -20656 -32767 -40751 -62889 -26917 13085 -2244 22760 64149 36545 -25658 -56673 -45365
15203 -45365 -19394 -4389 -24443 -22712 -8983 1360 -24548 -39500 -16098 -281 -8000 -15074
$$ packed form
15290g9954J5051K0333k6449K810k829J1568l696n682R763O4228L4389l28k9018
15277A0186k7002K5092K0014R61J1652K808n3763m8816l422K035L708k512L5577
15264b3482K1361L0507k9574j5867J8856O628k927L3896j1472m7671l6302L3319
15252b2728L3398j0088k2937J4588K7543l694K3295K7037p217j9103k7064K044
15240A5074L9917L851l5423j7004L580J0000J0592j6210k5460k7130R256k2626
15228e1583j4172K9249j107k528N612j6064l8647Q670N6045J3778q240l835K166
15215b0656j2111p984k2138L5972M0002j5329K5004M1389k7604o2203l1015J1308
15203d5365K5971J5005k0054J731J3729J0343k5908j4952K3402J5817p719p074
$$ plain form
15191 -15074 -33561 -3643 13700 -17253 25315 17843 -24876 -21312 11145 17920 39144 52021
15179 52021 10688 -15064 -61373 -91305 -87175 -73229 -59133 -51878 -37699 -19592 -60461 -67245
15167 -67245 -68315 -59825 -22265 18424 16153 -13488 -10213 -18354 15453 37085 14109 21119 40628
15154 40628 14718 -61174 -48036 -25640 -48596 -37648 -31807 -27072 -34275 -31610 -17294 -1012
15142 -1012 9740 60116 56092 25528 13687 7651 -9459 16200 34513 28368 42841 76923
15130 76923 27818 -26276 -15539 11641 18245 51232 37383 24012 39559 25493 24890 27094
15118 27094 22488 -6604 -13958 -9216 -2875 11704 28933 25631 1462 -19415 -9658 -13780 -2599
15105 -2599 -13263 -72195 -66016 -53798 -53556 -52634 -60653 -76813 -47370 -4876 21045 -511 -32156
$$ packed form
15191a5074j8487K9918J7343l0953M2568p472m2719L564L2457O775K1224J2877
15179E2021m1333k5752m6309k9932M130J3946J4096P255J4179J8107m0869o784
15167f7245j070Q490L7560M0689k271k9641L275q141L3807K1632k2976P010J9509
15154D0628k5910p5892J3138K2396k2956J0948N841M735p203K665J4316J6282
15142a012J0752N0376m024l0564j1841o036j7110K5659J8313o145J4473L4082
15130G6923m9105n4094J0737K7180O604L2987j3849j3371J5547j4066o03K204
15118B7094m606k9092p354M742O341J4579J7229l302k4169k0877R757m122J1181
15105b599j0664n8932O179J2218K42R22q019j6160K9443M2494K5921k1556l1645
$$ plain form
15092 -32156 -51373 1688 27185 -12832 -23860 -8351 7613 22668 31488 18203 21503 29774
15080 29774 8060 -30762 -33224 25777 66525 57597 19466 -22627 -56823 -32229 -58496 -56797
15068 -56797 -45779 -40810 -44349 -59560 -31828 17378 -4198 -28078 -32415 -8328 4051 -23941
15056 -23941 -1330 30434 19269 48572 70575 9530 2997 9683 -10896 -13201 -34055 -74184
15044 -74184 -62227 -35188 -31864 -19448 -5760 -31630 1688 32794 -5374 -33299 3301 45030
15032 45030 58201 66407 81140 91354 100024 106010 102206 108333 110869 99876 116514 76722 16817
15019 16817 20797 49580 39653 37506 -2406 -13801 14165 -5923 35509 7643 -12527 -7805
15007 -7805 -50359 -81602 -53719 -59026 -53218 -50429 -50750 -33573 -23394 -14938 -14145 23306 5971
$$ packed form
15092c2156j9217N3061K5497m0017j1028J5509J5964J5055Q820j3285L300Q271
15080B9774k1714l8822k462N9001M0748q928l8131m2093l4196K4594k6267J699
15068e6797J1018M969l539j5211K7732M9206k1576k3880m337K4087J2379k7992
15056b3941K2611L1764j1165K9303K2003o1045o533O686k0579k305k0854m0129
15044g4184J1957K7039L324J2416J3688k5870L3318L1106l8168k7925L6600M1729
15032D5030J3171Q206J4733J0214Q670N986l804O127K536j0993J6638l9792n9905
15019A6817L980K8783r927k147l9912j1395K7966k0088M1432k7866k0170M722
15007g805m2554l1243K7883n307N808K789l21J7177J0179Q456P93L7451j7335
$$ plain form
14994 5971 -29480 -51400 -63723 -78944 -68285 -45802 -1216 -32457 -80373 -103834 -86093 -59364
14982 -59364 -42191 -10966 46050 43065 39432 -5868 -37233 -1136 -26133 -8041 4239 6672
14970 6672 -9235 -8447 -16380 -4467 -14206 -24225 -22995 -46548 -52181 -65033 -31768 -32301 -38852 -49318
14956 -49318 -53746 -79751 -38798 9808 43656 45589 -12994 1967 -5948 -6901 8706 -5573 11574
14943 11574 -55569 -92572 -58777 -73301 -52217 -69017 -104464 -106747 -89322 -64488 -40276 -51906
14931 -51906 -47952 -35279 5428 45440 83844 62086 -4747 -25268 7120 4820 8875 15740
14919 15740 -10010 -20431 -13393 11796 2319 -43031 -48315 -25448 -21042 28401 10976 3622 36576
14906 36576 9703 -7696 -12715 8416 34558 38510 7978 -32925 -73041 -55543 -33462 -10721
$$ packed form
14994E971l5451k1920j2323j5221J0659K2483M4586l1241m7916k3461J7741K6729
14982e9364J7173L1225N7016k985l633m5300l1365L6097k4997J8092J2280K433
14970F672j5907P88p933J1913r739j0019J230k3553n633j2852L3265n33o551j0466
14956d9318m428k6005M0953M8606L3848J933n8583J4961p915r53J5607j4279J7147
14943A1574o7143l7003L3795j4524K1084j6800l5447k283J7425K4834K4212j1630
14931e1906L954J2673M0707M0012L8404k1758o6833k0521L2388k300M055O865
14919A5740k5750j0421P038K5189r477m5350n284K2867M406M9443j7425p354L2954
14906C6576k6873j7399n019K1131K6142L952l0532m0903m0116J7498K2081K2741
$$ plain form
14894 -10721 -23924 -17089 20770 31623 36795 36729 30494 11859 8759 -3453 -46328 -61367 -66951
14881 -66951 -79714 -34994 -7197 3950 19263 -12220 -45821 -45335 -23714 -43620 -45940 -16687
14869 -16687 3434 9438 10184 7860 -46503 -53834 -8179 7906 378 -1081 -29140 -66927 -51561
14856 -51561 -31619 -48814 -44318 -61420 -7608 32926 34130 37066 37554 7520 24140 18050 -12558
14843 -12558 -30088 -15083 26568 31186 -848 -22284 -64307 -75725 -46965 -45317 -41764 -39138
14831 -39138 -21345 714 -5825 -16048 -34872 -47906 -34334 -8674 -15404 -43574 -36903 15333
14819 15333 7920 -27690 -30288 -31818 -46631 -44193 -10638 5838 22046 14252 -25442 -83825 -94864
14806 -94864 -62961 -31751 1842 31605 36365 -4741 -10607 -6948 27571 1423 -22363 -42570
$$ packed form
14894a0721j3203O835L7859J0853N172o6o235j8635l100j2212m2875j5039n584
14881f6951j2763M4720K7797J1147J5313l1483l3601M86K1621j9906k320K9253
14869a6687K0121O004P46k324n4363p331M5655J6085p528j459k8059l7787J5366
14856e1561J9942j7195M496j7102N3812M0534J204K936M88l0034J6620o090l0608
14843a2558j7530J5005M1651M618l2034k1436m2023j1418K8760J648L553K626
14831c9138J7793K2059o539j0223j8824j3034J3572K5660o730k8170O671N2236
14819A5333p413l5610k598j530j4813K438L3555J6476J6208p794l9694n8383j1039
14806i4864L1903L1210L3593K9763M760m1106n866L659L4519k6148k3786k0207
$$ plain form
14794 -42570 -57741 -25496 -17518 -32470 -12693 -1571 12658 25002 51924 -10717 -22830 40673
14782 40673 33815 9778 -11157 -25165 -50358 -49054 -36791 -51068 -23938 4681 -29445 -17501
14770 -17501 3591 -21747 -53915 -32047 7744 30954 -6587 1135 29947 36216 42745 49402
14758 49402 28813 44674 60292 57919 81603 71040 40646 35378 47826 17627 -152 33801
14746 33801 56080 56539 60495 42494 22753 13994 23678 36277 25040 29783 55455 31695 8423
14733 8423 29757 5394 -9822 2915 1466 -15970 -3064 30974 20953 -4466 116 32110
14721 32110 45203 56621 69322 68099 2332 -38849 -18479 26661 56163 29038 -20459 -13061
14709 -13061 4022 -3863 -10817 6404 18113 -9746 -59616 -73838 -70404 -35267 -1825 -52931
$$ packed form
14794d2570j5171L2245P978j4952J9777J1122J4229J2344K6922o2641j2113O3503
14782D0673o858k4037k0935j4008k5193J304J2263j4277K7130K8619l4126J1944
14770a7501K1092k5338l2168K1868L9791K3210l7541P722K8812O269O529O657
14758D9402k0589J5861J5618k373K3684j0563l0394n268J2448l0199j7779L3953
14746C3801K2279M59L956j8001j9741q759R684J2599j1237M743K5672k3760k3272
14733H423K1334k4363j5216J2737j449j7436J2906L4038j0021k5419M582L1994
14721C2110J3093J1418J2701j223o5767m1181K0370M5140K9502k7125m9497P398
14709a3061J7083p885o954J7221J1709k7859m9870j4222L434L5137L3442n1106
$$ plain form
14697 -52931 -85994 -62604 -23211 -30321 -35157 -18400 -33976 -28691 -14839 -12906 -24505 -29652 -3849
14684 -3849 -11621 -6886 -12578 15752 18553 31014 6631 -9196 -51412 -70440 -26271 9138 -8184
14671 -8184 -37073 -49015 -44003 -22669 5932 31098 5369 -58508 -61476 -36088 -38257 -74483
14659 -74483 -69809 -36499 2416 -965 -11339 -2062 45719 59053 52166 30343 55057 91759
14647 91759 68833 71772 23265 -7747 873 -8378 -22614 -10956 -17444 -33728 -40707 -16273 5091
14634 5091 -16637 -41330 -60573 -58799 -70807 -80867 -77041 11189 35277 8473 -24378 -53815
14622 -53815 -50210 -16214 -8581 -103039 -109264 -69796 -31654 -40014 -41430 -12883 5645 25581 10049
14609 10049 -15953 18664 3665 -22386 -6078 -33700 -25464 -10299 -24484 -26762 -26870 -18762 -19564
$$ packed form
14697e2931l3063K3390L9393p110m836J6757j5576N285J3852J933j1599n147K5803
14684c849p772M735n692K8330K801J2461k4383j5827m2216j9028M4169L5409j7322
14671h184k8889j1942N012K1334K8601K5166k5729o3877k968K5388k169l6226
14659g4483M674L3310L8915l381j0374R277M7781J3334o887k1823K4714L6702
14647I1759k2926K939m8507l1012Q620r251j4236J1658o488j6284o979K4434K1364
14634E091k1728k4693j9243J774j2008j0060L826Q8230K4088k6804l2851k9437
14622e3815L605L3996P633r4458o225L9468L8142q360j416K8547J8528J9936j5532
14609A0049k6002L4617j4999k6051J6308k7622Q236J5165j4185k278j08Q108q02
$$ plain form
14596 -19564 -32672 -53394 -81304 -78427 -63621 -57579 -36516 -26891 -442 12239 28387 28607 27883
14583 27883 -10859 -25141 -38226 -25207 1885 -1208 -14833 -39077 -56300 -67660 -35276 2842
14571 2842 42549 44917 44515 47149 9163 -16169 -11979 -10799 -24559 -34627 858 -770 -40844
14558 -40844 -26612 -4224 29859 38447 9129 -39887 -76327 -76526 -50210 -34152 -58 7590
14546 7590 -18915 -39698 -33696 -29477 -44944 -44319 -16822 -2380 4203 -20902 -59268 -56574 -4193
14533 -4193 7369 -6065 -29576 -15662 -28626 17489 13149 10893 14649 -29198 -39511 -30286 -17616
14520 -17616 -6316 12921 30820 48655 23666 42066 62666 77421 52476 4724 -4462 17824
14508 17824 10030 7204 -3050 -57576 -77916 -85398 -105816 -68267 -41520 -9784 -20916 -40657
$$ packed form
14596a9564j3108k0722k7910K877J4806O042K1063R625K6449J2681J6148K20p24
14583B7883l8742j4282j3085J3019K7092l093j3625k4244j7223j1360L2384L8118
14571B842L9707K368m02K634l7986k5332M190J180j3760j0068L5485j628m0074
14558d0844J4232K2388L4083Q588k9318m9016l6440j99K6316J6058L4094P648
14546G590k6505k0783O002M219j5467O25K7497J4442O583k5105l8366K694N2381
14533d193J1562j3434k3511J3914j2964M6115m340k256L756m3847j0313R225J2670
14520a7616J1300J9237J7899J7835k4989J8400K0600J4755k4945m7752r186K2286
14508A7824p794k826j0254n4526k0340p482k0418L7549K6747L1736j1132j9741
$$ plain form
14496 -40657 -14327 -2245 34427 53145 46648 9469 -10267 3994 64321 80182 66881 38096
14484 38096 23175 17437 37178 87093 110594 64794 38306 25603 -18781 -52714 -55547 -11294
14472 -11294 -20224 -32325 -29050 -37305 -56273 -50330 -4815 30152 -10633 -43633 -60601 -46386
14460 -46386 -38802 -33842 -43044 -67273 -83288 -71905 -50965 -31682 28796 60694 38761 41055
14448 41055 15652 -7574 13601 21840 27489 19926 10478 24899 16213 -19217 4255 25375 46485
14435 46485 45165 20629 29709 -19408 -34365 -18020 -21739 -16841 -44462 -22127 -1595 22376
14423 22376 43304 48552 58039 63832 32358 -11245 -3974 14115 29385 24332 3375 20931 44112
14410 44112 58658 33719 49033 53828 4165 -47409 -32006 2859 27017 24103 22659 25276
$$ packed form
14496d0657K6330J2082L6672J8718o497l7179j9736J4261O0327J5861j3301k8785
14484C8096j4921n738J9741M9915K3501m5800k6488j2703m4384l3933k833M4253
14472a1294q930j2101L275q255j8968N943M5515L4967m0785l3000j6968J4215
14460d6386P584M960r202k4229j6015J1383K0940J9283O0478L1898k1933K294
14448D1055k5403k3226K1175Q239N649p563r448J4421q686l5430K3472K1120K1110
14435D6485j320k4536R080m9117j4957J6345l719M898k7621K2335K0532K3971
14423B2376K0928N248R487N793l1474m3603P271J8089J5270n053k0957J7556K3181
14410D4112J4546k4939J5314M795m9663n1574J5403L4865K4158k914j444K617
$$ plain form
14398 25276 -2563 -4403 -3134 -15934 29326 51841 34339 19654 17060 15422 22992 27004 8458
14385 8458 -4754 27568 43525 25889 13214 25077 44575 68974 52667 21197 70834 94211
14373 94211 62230 26482 4944 -2983 -5983 -14859 -26651 -30793 -2026 27886 20075 -1936 4169
14360 4169 -11054 -7402 24766 45012 37868 35091 74919 100940 99105 111334 85291 54457 -16397
14347 -16397 -36408 11820 -4245 27139 44716 28376 38895 57047 57748 50383 26000 -19971
14335 -19971 5879 -1303 23465 47234 33825 81037 116138 114989 89502 119624 169493 198383
14323 198383 206073 209647 224611 247334 307611 338096 421230 541382 699540 876968 1082499
14312 1082499 1266350 1496619 1669489 1790579 1855482 1906547 1986477 2077562 2081416 2057828 2047118
$$ packed form
14398B5276k7839j840J269j2800M5260K2515j7502j4685k594j638P570M012j8546
14385H458j3212L2322J5957j7636j2675J1863J9498K4399j6307l1470M9637K3377
14373I4211l1981l5748k1538p927l000q876j1792m142K8767K9912p811k2011O105
14360D169j5223L652L2168K0246p144k777L9828K6021j835J2229k6043l0834p0854
14347a6397k0011M8228j6065L1384J7577j6340J0519J8152P01p365k4383m5971
14335a9971K5850p182K4768K3769j3409M7212L5101j149k5487L0122M9869K8890
14323A98383P690L574J4964K2723O0277L0485Q3134J20152J58158J77428K05531
14312A082499J83851K30269J72870J21090O4903N1065P9930R1085L854k3588j0710
$$ plain form
14301 2047118 2018820 2001230 1955543 1855134 1677589 1442225 1249339 1098980 926506 765030
14291 765030 657897 565586 503768 467455 392619 331930 309414 295912 268957 222183 210587
14280 210587 192853 159992 139762 100678 72758 53699 45606 46854 56386 51730 67398 115017
14268 115017 154272 124160 52524 30591 3651 13556 37779 49841 43155 23177 22770 14289
14256 14289 22568 35965 31978 38178 66714 82602 75177 53216 33187 57094 70172 72092 107543
14243 107543 83306 73632 74614 46697 8584 31905 62587 86758 85371 70162 20870 36959
14231 36959 74033 54960 23844 7358 32501 22638 9284 70810 96798 37911 1375 2022
14219 2022 17132 18745 740 12666 29079 69847 92309 74927 61886 71487 53584 23904
$$ packed form
14301B047118k8298j7590m5687j00409j77545k35364j92886j50359j72474j61476
14291G65030j07133r2311o1818l6313p4836o0689k2516j3502k6955m6774j1596
14280B10587j7734l2861k0230l9084k7920j9059q093J248R532m656J5668M7619
14268A15017L9255l0112p1636k1933k6940R905K4223J2062o686j9978m07q481
14256A4289Q279J3397l987O200K8536J5888p425k1961k0029K3907J3078J920L5451
14243A07543k4237r674R82k7917l8113K3321L0682K4171j387j5209m9292J6089
14231C6959L7074j9073l1116j6486K5143r863j3354O1526K5988n8887l6536O47
14219B022J5110J613j8005J1926J6413M0768K2462j7382j3041R601j7903k9680
$$ plain form
14207 23904 -20230 -35646 -41088 -7988 8036 -18838 -32938 -10564 14861 32376 41806 12154
14195 12154 6457 14861 35082 56431 26812 51125 54959 72826 72227 39931 41390 31893 5579
14182 5579 -9567 42816 43539 43997 58859 62245 95479 89493 69727 806 -34856 -32343 -12329
14169 -12329 6306 -6220 -5468 30318 70316 72761 68199 64754 55245 48801 38959 61522 66265
14156 66265 70980 98448 106822 102552 63289 38668 85872 74325 57848 54698 69390 86222
14144 86222 61113 64522 75027 94897 90317 77597 52964 33395 44361 46806 53533 100932
14132 100932 76190 42904 42292 84631 80113 72907 52172 -260 -7889 28401 71678 127193
14120 127193 119779 122208 131215 138072 151689 122547 84872 63818 96683 65591 19502 -2069
$$ packed form
14207B3904m4134j5416n442L3100J6024k6874j4100K2374K5425J7515R430k9652
14195A2154n697Q404K0221K1349k9619K4313L834J7867n99l2296J459r497k6314
14182E579j5146N2383P23M58J4862L386L3234n986j9766o8921l5662K513K0014
14169a2329J8635j2526P52L5786L9998K445m562l445r509o444r842K2563M743
14156F6265M715K7468Q374m270l9263k4621M7204j1547j6477l150J4692J6832
14144H6222k5109L409J0505J9870m580j2720k4633j9569J0966K445O727M7399
14132A00932k4742l3286o12M2339m518p206k0735n2432p629L6290M3277N5515
14120A27193p414K429R007O857J3617k9142l7675k1054L2865l1092m6089k1571
$$ plain form
14108 -2069 43745 46611 19295 10567 20089 25334 50210 68203 60096 99119 88598 98097 85035
14095 85035 44697 28522 15644 8044 25090 30315 29149 66685 77506 58668 82802 118201
14083 118201 105981 85489 86198 79504 68553 88041 80644 102100 126295 100310 37573 21949
14071 21949 43506 97770 114079 113172 111411 108629 78932 113927 125622 104494 174293 235836
14059 235836 238880 222022 199455 131852 120717 138461 129611 141043 144491 142279 111697 81400
14047 81400 59327 56761 78822 70787 70790 51214 37772 33407 57252 74595 82461 86457 91208 84609
14033 84609 94739 80054 67367 56236 42010 83558 56062 21979 8949 1486 -2755 -3433
14021 -3433 5541 21145 50627 63420 64261 55942 54181 33919 -4846 -14206 40185 8921 -24033
$$ packed form
14108b069M5814K866k7316q728R522N245K4876J7993q107L9023j0521R499j3062
14095H5035m0338j6175j2878p600J7046N225j166L7536J0821j8838K4134L5399
14083A18201j2220k0492P09o694j0951J9488p397K1456K4195k5985o2737j5624
14071B1949K1557N4264J6309r07j761k782k9697L4995J1695k1128O9799O1543
14059B35836L044j6858k2567o7603j1135J7744q850J1432L448k212l0582l0297
14047H1400k2073k566K2061q035Lj9576j3442m365K3845J7343P866L996M751o599
14033H4609J0130j4685j2687j1131j4226M1548k7496l4083j3030p463m241o78
14021c433Q974J5604K9482J2793Q41q319j761k0262l8765r360N4391l1264l2954
$$ plain form
14008 -24033 20148 21654 -6209 -66 38504 40927 11668 13267 -4256 -25174 -9344 25551
13996 25551 36070 44597 80084 85338 66963 71743 61424 25276 -4 6858 33377 1628
13984 1628 -40160 -38992 19113 11097 -49739 -38590 -18797 6460 18070 41690 23489 -7534
13972 -7534 -31019 -41982 -10628 -37891 -62061 -69160 -65825 -55420 -31851 16841 28027 -12012
13960 -12012 -7752 26848 66843 87052 90439 56947 33142 40078 36316 23529 41532 61638
13948 61638 43762 39611 49016 32578 2739 3298 3634 -10652 -8733 15875 71964 85796 74279
13935 74279 91579 107844 93884 69573 84001 105338 87719 45131 24153 17928 17559 40548
13923 40548 65919 43389 50803 79041 67226 74992 82073 94259 90945 79766 68031 102940
$$ packed form
14008b4033M4181J506k7863O143L8570K423k9259J599j7523k0918J5830L4895
13996B5551J0519Q527L5487N254j8375M780j0319l6148k5280O862K6519l1749
13984A628m1788J168N8105q016o0836J1149J9793K5257J1610K3620j8201l1023
13972g534k3485j0963L1354k7263k4170p099L335J0405K3569M8692J1186m0039
13960a2012M260L4600L9995K0209L387l3492k3805O936l762j2787J8003K0106
13948F1638j7876m151R405j6438k9839N59L36j4286J919K4608N6089J3832j1517
13935G4279J7300J6265j3960k4311J4428K1337j7619m2588k0978o225l69K2989
13923D0548K5371k2530P414K8238j1815P766P081J2186l314j1179j1735L4909
$$ plain form
13911 102940 112601 112877 136365 166449 168194 146896 134573 171203 170233 137889 128954 101355 115974
13898 115974 123141 143000 133956 102854 110664 154563 89973 69034 63979 71728 89990 60377
13886 60377 73262 55470 41384 68522 68662 91247 121227 127051 138299 109667 91743 53791
13874 53791 13424 22997 47053 30295 -4608 17382 34296 14643 14999 20889 30772 62589 42050
13861 42050 -22218 -16347 13380 -25408 -57535 -18543 12640 -7856 -20015 -34220 -8240 -27000
13849 -27000 -17602 46035 73122 81753 64477 -22012 -47864 -34587 -29760 -11401 -35803 -37934
13837 -37934 19362 33940 32071 15266 27240 32964 2731 -2180 10195 5755 -21360 -12913 26086
13824 26086 23146 12075 -7996 -48286 -29986 11629 20048 -21563 -45249 4991 59694 67232
$$ packed form
13911A02940R661K76K3488L0084J745k1298j2323L6630r70l2344q935k7599J4619
13898A15974P167J9859r044l1102P810M3899o4590k0939n055P749J8262k9613
13886F0377J2885j7792j4086K7138J40K2585K9980N824J1248k8632j7924l7952
13874E3791m0367R573K4056j6758l4903K1990J6914j9653L56N890R883L1817k0539
13861D2050o4268N871K9727l8788l2127L8992L1183k0496j2159j4205K5980j8760
13849b7000R398O3637K7087Q631j7276q6489k5852J3277M827J8359k4402k131
13837c7934N7296J4578j869j6805J1974N724l0233m911J2375m440k7115Q447L8999
13824B6086k940j1071k0071m0290J8300M1615Q419m1611k3686N0240N4703P538
$$ plain form
13812 67232 68354 87556 94363 80397 26340 -31322 -28014 -8943 -4528 -18900 -3097 10565
13800 10565 -7350 -38053 -531 32667 29989 -22791 -43308 -19785 -3122 -9505 -11262 -2931
13788 -2931 -13212 3742 16919 2130 -24266 -37181 -3255 -14655 -7663 -19166 -32802 -12817
13776 -12817 5888 10860 -27393 -24049 -12670 5223 14012 -10680 -1871 18530 8599 2647 32877
13763 32877 19582 24718 58935 89748 91086 66935 56253 48902 16312 1248 10574 9273 -8956
13750 -8956 -14281 -11074 -3727 -47024 -15110 6213 21444 17387 -9607 -41521 -49906 -32216 -5273
13737 -5273 -38611 -49215 -15463 -11487 -33447 -20103 -15574 -35478 -69442 -42716 11309 21931
13725 21931 21057 1940 39277 71003 112914 76109 36557 36331 13640 -3210 -964 -13134 -25766
$$ packed form
13812F7232J122J9202O807j3966n4057n7662L308J9071M415j4372J5803J3662
13800A0565j7915l0703L7522L3198k678n2780k0517K3523J6663o383j757Q331
13788b931j0281J6954J3177j4789k6396j2915L3926j1400O992j1503j3636J9985
13776a2817J8705M972l8253L344J1379J7893Q789k4692Q809K0401r931n952L0230
13763C2877j3295N136L4217L0813J338k4151j0682p351l2590j5064R326j301j8229
13750h956n325L207P347m3297L1914K1323J5231m057k6994l1914q385J7690K6943
13737e273l3338j0604L3752L976k1960J3344M529j9904l3964K6726N4025J0622
13725B1931q74j9117L7337L1726M1911l6805l9552k26k2691j6850K246j2170j2632
$$ plain form
13712 -25766 -33603 -2650 5803 19748 15284 14339 29950 43159 43545 38295 47781 44330 41599 48261
13698 48261 57945 84562 60771 66274 85467 58432 54585 41073 14264 20600 22921 25564 94968
13685 94968 136671 128272 155447 207278 266089 312431 312879 277349 274461 293924 332046 344560
13673 344560 350859 336845 259512 216057 183689 187774 185374 146586 108311 102195 113654 136982
13661 136982 134669 60519 9408 8555 43147 94437 86187 68844 82073 138913 148298 111087
13649 111087 102056 128767 154529 135716 139796 193233 240723 315300 316931 303926 327446 357538
13637 357538 346246 313119 276450 202374 161873 156122 140288 121863 82903 54875 53467 77316
13625 77316 105122 81581 30142 -20866 -49895 -14090 -8073 18307 37229 36174 32809 38157
$$ packed form
13712b5766p837L0953Q453J3945m464r45J5611J3209L86n250R486l451k731O662
13698D8261R684K6617k3791N503J9193k7035l847j3512k6809O336K321K643O9404
13685I4968M1703q399K7175N1831N8811M6342M48l5530k888J9463L8122J2514
13673C44560O299j4014p7333m3455l2368M085k400l8788l8275o116J1459K3328
13661A36982k313p4150n1111q53L4592N1290q250j7343J3229N6840R385l7211
13649A11087r031K6711K5762j8813M080N3437M7490P4577J631j3005K3520L0092
13637C57538j1292l3127l6669p4076m0501n751j5834j8425l8960k8028j408K3849
13625G7316K7806k3541n1439n1008k9029L5805O017K6380J8922j055l365N348
$$ plain form
13613 38157 35852 -9148 1830 7739 40343 105274 76298 48435 79282 26898 -24119 -16318
13601 -16318 21194 41797 -7304 18083 30600 15208 -460 19152 28715 53840 35291 55265
13589 55265 14677 -43382 -25504 -3992 -9267 -523 29078 26375 30658 -8877 -64052 -58369 -16873
13576 -16873 -30461 -52960 -28949 -36610 -4853 38053 58191 35347 22714 8016 -1630 -33843
13564 -33843 -43962 -33398 18070 29617 30394 29989 38066 59416 75214 58516 39008 6082 14423
13551 14423 42049 40055 5859 564 16971 61493 62145 25152 -9774 12654 9369 26553 33031
13538 33031 27821 17024 27184 8027 12517 51371 64401 65016 39958 66131 75391 75987 74262
13525 74262 41783 28230 14236 25126 39717 43587 45157 6246 20251 42508 48549 64946
$$ packed form
13613C8157k305m5000J0978N909L2604O4931k8976k7863L0847n2384n1017P801
13601a6318L7512K0603m9101K5387J2517j5392j5668J9612R563K5125j8549J9974
13589E5265m0588n8059J7878K1512n275Q744K9601k703M283l9535n5175N683M1496
13576a6873j3588k2499K4011p661L1757M2906K0138k2844j2633j4698r646l2213
13564c3843j0119J0564N1468J1547P77m05Q077K1350J5798j6698j9508l2926Q341
13551A4423K7626j994l4196n295J6407M4522O52l6993l4926K2428l285J7184O478
13538C3031n210j0797J0160j9157M490L8854J3030O15k5058K6173R260N96j725
13525G4262l2479j3553j3994J0890J4591L870J570l8911J4005K2257O041J6397
$$ plain form
13513 64946 65868 28385 -22929 -21544 -19573 -17449 -20720 -37130 -53703 -24831 12821 21275 -1386
13500 -1386 -36919 -41414 10918 -7132 -7449 -53210 -58196 3605 2800 -13968 -12467 -2786 48116
13487 48116 79874 84606 78963 71129 77514 73263 38394 33362 23590 25819 24491 3652 -6771
13474 -6771 -47309 -25532 -2063 -1834 -28167 -52207 -58919 -58405 -42484 -50270 -22501 34302 62305
13461 62305 38557 45298 56907 48311 37926 14705 25547 12030 -10522 -29030 -21011 34524
13449 34524 27670 -13214 -26851 -14846 4029 22505 52735 35776 23077 8363 -11658 -12306
13437 -12306 3233 -33471 -46850 -49524 -38407 -38163 -36519 -13072 16081 27127 42136 62931
13425 62931 68567 56948 39745 18163 3345 -21943 -2646 7895 74537 70781 74143 47621
$$ packed form
13513F4946R22l7483n1314J385J971K124l271j6410j6573K8872L7652Q454k2661
13500a386l5533m495N2332j8050l17m5761m986O1801q05j6768J501R681N0902
13487D8116L1758M732n643p834O385m251l4869n032r772K229j328k0839j0423
13474f771m0538K1777K3469K29k6333k4040o712N14J5921p786K7769N6803K8003
13461F2305k3748O741J1609q596j0385k3221J0842j3517k2552j8508Q019N5535
13449C4524o854m0884j3637J2005J8875J8476L0230j6959j2699j4714k0021o48
13437a2306J5539l6704j3379k674J1117K44J644K3447K9153J1046J5009K0795
13425F2931N636j1619j7203k1582j4818k5288J9297J0541O6642l756L362k6522
$$ plain form
13413 47621 -21855 -24464 22188 57173 27240 5396 -8466 7304 -25313 -3148 -8919 2893
13401 2893 -19558 -24505 22095 27945 -39081 -6537 63918 43900 3213 -19179 -31740 -49117
13389 -49117 -23680 -33280 -17424 17766 15205 40291 83267 74475 64284 71048 42537 -9358
13377 -9358 -10422 15191 -12065 -46074 -43468 -26570 4235 35634 38825 4152 21461 35105
13365 35105 37276 36865 6883 -139 14188 32556 -973 20152 25850 4984 -20427 12993 18333
13352 18333 -21947 -40795 -70945 -91297 -37864 -19651 -32744 -52903 -38282 -24044 -44538 -43438
13340 -43438 -13344 -3054 -23448 -17051 23656 51997 62058 72517 86670 72475 20438 26365
13328 26365 22490 -36954 -27526 -5230 30000 1894 -19466 5547 -12727 -46277 -1227 6440
$$ packed form
13413D7621o9476k609M6652L4985k9933k1844j3862J5770l2617K2165n771J1812
13401B893k2451m947M6600N850o7026L2544P0455k0018m0687k2392j2561j7377
13389d9117K5437r600J5856L5190k561K5086M2976q792j0191O764k8511n1895
13377i358j064K5613k7256l4009K606J6898L0805L1399L191l4673J7309J3644
13365C5105K171m11k9982p022J4327J8368l3529K1125N698k0866k5411L3420N340
13352A8333m0280j8848l0150k0352N3433J8213j3093k0159J4621J4238k0494J100
13340d3438L0094J0290k0394O397M0707K8341J0061J0459J4153j4195n2037N927
13328B6365l875n9444R428K2296L5230k8106k1360K5013j8274l3550M5050P667
$$ plain form
13316 6440 -9070 -18071 -60127 -57787 -34812 -36186 -52738 -13226 -1458 -15980 34562 80927
13304 80927 77761 41898 44760 56157 71203 82626 81087 70562 51978 4443 -6895 -19663
13292 -19663 -48851 -19521 27974 41232 26918 66449 108187 87765 75542 45072 -15824 -41225
13280 -41225 -22789 -20708 -39707 4290 54827 57378 78063 74843 53620 96507 106821 84877
13268 84877 93056 61397 46887 46307 64680 77595 90384 69512 75964 63044 57854 54589 70403
13255 70403 80534 53323 99289 124239 102101 64929 80972 65639 67764 77535 49569 41628
13243 41628 40538 44198 68937 46404 9208 -11534 -20797 -28482 -33386 -28215 -14549 -9044 -10852
13230 -10852 7 -1361 48747 101037 82122 86650 105022 110913 54633 42674 51819 60255 52523
$$ packed form
13316F440j5510r001m2056K340K2975j374j6552L9512J1768j4522N0542M6365
13304H0927l166l5863K862J1397J5046J1423j539j0525j8584m7535j1338j2768
13292a9663k9188K9330M7495J3258j4314L9531M1738k0422j2223l0470o0896k5401
13280d1225J8436K081j8999M3997N0537K551K0685l220k1223M2887J0314k1944
13268H4877Q179l1659j4510n80J8373J2915J2789k0872O452j2920n190l265J5814
13255G0403J0131k7211M5966K4950k2138l7172J6043j5333K125R771k7966p941
13243D1628j090L660K4739k2533l7196k0742r263p685m904N171J3666N505j808
13230a0852J0859j368N0108N2290j8915M528J8372N891n6280j1959R145Q436p732
$$ plain form
13217 52523 54600 61959 67827 91337 148968 198614 264256 316522 365712 433895 520681 653709
13205 653709 826430 1038480 1302058 1546100 1765972 1990314 2145694 2233699 2231084 2095205
13195 2095205 1836795 1578259 1334584 1126038 930528 748781 579748 481184 451005 431200
13185 431200 425296 468839 466918 537289 630526 790857 1084116 1375971 1636088 1844715 1991303
13174 1991303 2090744 2049191 1900138 1645902 1348519 1082034 900380 749406 697957 715263
13164 715263 757404 762653 748191 699078 598716 507130 405380 390786 404976 407767 400258 331526
13152 331526 261896 248744 269775 250351 189915 188057 206710 218486 236575 212046 175164 164939
13140 164939 157645 147438 129129 82553 70731 52255 76880 84269 62872 35837 22676 53029
$$ packed form
13217E2523K077P359N868K3510N7631M9646O5642N2266M9190O8183Q6786J33028
13205F53709J72721K12050K63578K44042K19872K24342J55380Q8005k615j35879
13195B095205k58410k58536k43675k08546j95510j81747j69033r8564l0179j9805
13185D31200n904M3543j921P0371R3237J60331K93259K91855K60117K08627J46588
13174A991303R9441m1553j49053k54236k97383k66485j81654j50974n1449J7306
13164G15263M2141N249j4462m9113j00362r1586j01750j4594J4190K791p509o8732
13152C31526o9630j3152K1031j9424o0436j858J8653J1776J8089k4529l6882j0225
13140A64939p294j0207j8309m6576j1822j8476K4625P389k1397k7035j3161L0353
$$ plain form
13128 53029 108662 100619 98622 91493 98756 141057 195504 260341 313272 425478 509811 548654
13116 548654 478064 363420 263206 194294 137592 126216 131030 162229 176753 165454 134579
13105 134579 128250 146207 152789 214577 272389 289769 255107 229390 183049 140450 124619 136214
13093 136214 158440 189022 181728 168534 146536 136676 112581 122601 161603 185714 222956 241749
13081 241749 238849 231242 239143 250606 305840 363656 414218 463863 590134 719016 835523
13070 835523 984046 1137611 1330163 1509230 1650184 1740382 1706717 1555897 1355333 1103168
13060 1103168 903196 712193 573113 476248 399854 347707 353360 361008 301028 229216 207936
13049 207936 175341 198849 201555 140049 156388 182716 206208 207925 158742 181955 213021 255097
$$ packed form
13128E3029N5633q043j997p129P263M2301N4447O4837N2931J12206Q4333L8843
13116E48654p0590j14644j00214o8912n6702j1376M814L1199J4524j1299l0875
13105A34579o329J7957O582O1788N7812J7380l4662k5717m6341m2599j5831J1595
13093A36214K2226L0582p294j3194k1998r860k4095J0020L9002K4111L7242J8793
13081B41749k900p607P901J1463N5234N7816N0562M9645J26271J28882J16507
13070H35523J48523J53565J92552J79067J40954R0198l3665j50820k00564k52165
13060A103168j99972j91003j39080r6865p6394n2147N653P648n9980p1812k1280
13049B07936l2595K3508K706o1506J6339K6328K3492J717m9183K3213L1066M2076
$$ plain form
13037 255097 305730 374081 427759 431746 456343 440720 444310 421022 401554 394852 360608 333039
13025 333039 304736 252334 245480 226589 208332 165765 121999 81335 48516 55473 47690 30277
13013 30277 71828 41888 7718 38818 36503 59818 48086 58030 82962 107165 132349 131427
13001 131427 124245 104612 80590 93081 65638 41437 34612 56413 77567 72758 67728 78349
12989 78349 70804 61706 82600 85323 95471 69513 61054 59000 28154 16684 35451 -6213 -68965
12976 -68965 -81054 -94802 -67959 -46842 -37685 -42541 -25708 -33805 -35923 -76399 -89115 -104250
12964 -104250 -88438 -111967 -111184 -64487 -32368 -51838 -12701 48196 106022 113654 66834 58880
12952 58880 58828 43296 88064 84473 71690 63679 68083 59777 41157 48887 43024 45042 46384 46802
$$ packed form
13037B55097N0633O8351N3678L987K4597j5623L590k3288j9468o702l4244k7569
13025C33039k8303n2402o854j8891j8257m2567m3766m0664l2819O957p783j7413
13013C0277M1551k9940l4170L1100k315K3315j1732R944K4932K4203K5184r22
13001A31427p182j9633k4022J2491k7443k4201o825K1801K1154m809n030J0621
12989G8349p545r098K0894K723J0148k5958q459k054l0846j1470J8767m1664o2752
12976f8965j2089j3748K6843K1117R157m856J6833q097k118m0476j2716j5135
12964a04250J5812k3529P83M6697L2119j9470L9137O0897N7826P632m6820p954
12952E8880n2j5532M4768l591j2783q011M404q306j8620P730n863K018J342M18
$$ plain form
12938 46802 70119 68680 68483 72763 98127 120166 141288 151363 170624 178036 207158 223636 233862
12925 233862 221105 186594 208195 249365 287000 299744 279466 274833 281254 247621 195867 155382
12913 155382 175359 188066 170113 182572 233750 275414 291691 339764 364505 390677 413493
12902 413493 445361 490073 521531 518075 540269 530528 534087 514739 512665 526906 478514 413633
12890 413633 397573 395798 386674 386409 346466 327920 310100 303138 278617 288524 330411 361322 358464
12877 358464 293263 238185 257422 289931 244891 253839 260271 307615 344075 373069 379137 392872
12865 392872 419254 437062 443860 441371 462553 468331 472243 493177 474552 469186 471909 462052 470805
12852 470805 480219 530416 537670 546737 533266 527926 516915 481175 484569 497623 505918 509563 465467
$$ packed form
12938D6802K3317j439j97M280K5364K2039K1122J0075J9261P412K9122J6478J0226
12925B33862j2757l4511K1601M1170L7635J2744k0278m633O421l3633n1754m0485
12913A55382J9977J2707j7953J2459N1178M1664J6277M8073K4741K6172K2816
12902D13493L1868M4712L1458l456K2194r741L559j9348k074J4241m8392o4881
12890D13633j6060j775r124k65l9943j8546j7820o962k4521R907M1887L0911k858
12877C58464o5201n5078J9237L2509m5040Q948O432M7344L6460K8994O068J3735
12865C92872K6382J7808O798k489K1182N778L912K0934j8625n366K723r857Q753
12852D70805R414N0197P254R067j3471n340j1011l5740L394J3054Q295L645m4096
$$ plain form
12839 465467 444114 458044 490279 527274 557362 587025 634395 662607 688155 735140 791543
12828 791543 821105 870584 874163 890490 913684 930915 973733 1037404 1121873 1266350 1356520
12817 1356520 1476824 1599194 1724427 1859430 1945682 2086280 2275880 2431677 2586180 2747921
12807 2747921 2930774 3149543 3353701 3521171 3788359 4136903 4531010 4988255 5493643
12798 5493643 6132341 6996083 8140395 9531689 11188999 13075377 15181805 17576725
12790 17576725 20182409 23146506 26594514 30886422 36780781 45628635 59611737 81795111
12782 81795111 114167171 155701780 203886740 254031363 303617749 348569073 384982606
12775 384982606 405945178 407298208 389898799 357271403 316402364 270259933 223177953
$$ packed form
12839D65467k1353J3930L2235L6995L0088K9663M7370K8212K5548M6985N6403
12828G91543K9562M9479L579J6327K3194J7231M2818O3671Q4469J44477R0170
12817A356520J20304J22370J25233J35003Q6252J40598J89600J55797J54503J61741
12807B747921J82853K18769K04158J67470K67188L48544L94107M57245N05388
12798E493643O38698Q63742J144312J391294J657310J886378K106428K394920
12790A7576725K605684K964097L448008M291908N894359Q847854J3983102K2183374
12782H1795111L2372060M1534609M8184960N0144623M9586386M4951324L6413533
12775C84982606K0962572J353030j7399409l2627396m0869039m6142431m7081980
$$ plain form
12768 223177953 177436773 138052948 107193472 85383697 70811696 60774578 53380394
12761 53380394 47461535 42429524 37837333 33573054 29651481 26092025 22891410 20029734
12753 20029734 17542753 15443173 13754478 12379344 11232473 10274715 9401716 8654760
12745 8654760 8003937 7402515 6868413 6371927 5925028 5575428 5269176 4968779 4711680
12736 4711680 4483695 4242595 3991606 3854884 3737532 3564261 3369142 3179229 2945152
12727 2945152 2757939 2655613 2513854 2362975 2221973 2102217 2030124 1928368 1831057 1739643
12717 1739643 1642161 1549040 1501143 1475021 1459976 1452775 1439507 1405527 1420278 1426033 1449053 1456180
12705 1456180 1461023 1452669 1402725 1329227 1247818 1165126 1130121 1073017 987278 887049 822752
$$ packed form
12768B23177953m5741180l9383825l0859476k1809775j4572001j0037118p394184
12761E3380394n918859n032011m592191m264279l921573l559456l200615k861676
12753B0029734k486981k099580j688695j375134j146871r57758q72999p46956
12745H654760o50823o01422n34102m96486m46899l49600l06252l00397k57099
12736D711680k27985k41100k50989j36722j17352j73271j95119j89913k34077
12727B945152j87213j02326j41759j50879j41002j19756p2093j01756r7311r1414
12717A739643r7482r3121m7897k6122j5045p201j3268l3980J4751N755K3020P127
12705A456180M843q354m9944p3498q1409q2692l5005n7104q5739j00229o4297
$$ plain form
12694 822752 768846 726269 697448 709604 699230 679899 642014 607548 599444 590388 577602 562051
12682 562051 579679 593055 596892 587668 568431 527650 482181 496129 468576 432231 370529 359732
12670 359732 388269 401060 384486 394799 396496 336551 313156 297531 330154 334132 275484 257114
12658 257114 235847 198564 204810 202852 229581 205633 184205 191839 186436 186571 221781 201701 222476
12645 222476 261331 288796 322236 316749 276152 274905 282105 266872 283695 277683 239501 217860
12633 217860 226682 232562 213241 170970 180070 167378 153589 158164 129955 82818 115566 133644
12621 133644 146066 172540 200788 228540 259764 277277 292322 312347 284309 260087 234641
12610 234641 211564 194141 186720 194186 200462 200528 187861 167177 177726 185862 205221 231210 257765
$$ packed form
12694H22752n3906m2577k8821J2156j0374j9331l7885l4466q104r056j2786j5551
12682E62051J7628J3376L837r224j9237m0781m5469J3948k7553l6345o1702j0797
12670C59732K8537J2791j6574J0313J697n9945k3395j5625L2623L978n8648j8370
12658B57114k1267l7283O246j958K6729k3948k1428P634n403J35L5210k0080K0775
12645B22476L8855K7465L3440n487m0597j247P200j5233J6823o012l8182k1641
12633B17860Q822N880j9321m2271R100j2692j3789M575k8209m7137L2748J8078
12621A33644J2422K6474K8248K7752L1224J7513J5045K0025k8038k4222k5446
12610B34641k3077j7423p421P466O276O6j2667k0684J0549Q136J9359K5989K6555
$$ plain form
12597 257765 247011 272842 297062 286267 341062 372055 400019 398304 388446 387698 408475 456158
12585 456158 443341 421495 380781 347532 319084 312811 319406 304466 279827 286269 351080 383558
12573 383558 370764 370875 341166 336786 327965 288263 295236 311474 298285 288635 314647 316282 309684
12560 309684 337092 300827 287025 298758 314664 327734 331978 334749 313059 309285 335716 415080
12548 415080 494794 501085 440417 316991 240114 211764 237219 267054 294262 307209 338369
12537 338369 307729 269022 233339 224765 257886 295585 280452 235507 216373 217295 170051 144500
12525 144500 168764 185933 195946 229490 212114 196839 182347 186435 179884 178594 180405 246496
12513 246496 289237 266457 225441 207176 205510 216425 232622 200239 210927 214387 194033 183643
$$ packed form
12597B57765j0754K5831K4220j0795N4795L0993K7964j715r858p48K0777M7683
12585D56158j2817k1846m0714l3249k8448o273O595j4940k4639O442O4811L2478
12573C83558j2794J11k9709m380q821l9702O973J6238j3189r650K6012J635o598
12560C09684K7408l6265j3802J1733J5906J3070M244K771k1690l774K6431P9364
12548D15080P9714O291o0668j23426p6877k8350K5455K9835K7208J2947L1160
12537C38369l0640l8707l5683q574L3121L7699j5133m4945j9134R22m7244k5551
12525A44500K4264J7169J0013L3544j7376j5275j4492M088o551j290J811O6091
12513B46496M2741k2780m1016j8265j666J0915J6197l2383J0688L460k0354j0390
$$ plain form
12501 183643 133255 116271 141433 187089 223431 233318 176933 162901 135076 102218 75213 62965
12489 62965 37256 41205 51353 85754 118895 141628 144018 83415 59776 70822 95650 83868
12477 83868 43321 62720 36472 43496 52661 53857 70322 11325 18991 47766 31820 20614
12465 20614 32043 14978 57601 84327 70071 102514 126142 122335 93613 113796 103277 85366
12453 85366 84908 53797 45143 50636 72651 96507 90457 104051 132007 105574 74625 73868 93736
12440 93736 112184 122823 154462 131598 69959 -11463 -12031 6348 24027 47928 60820 33238
12428 33238 820 84647 121556 109065 100862 139559 144379 133531 144518 138045 127779 117258
12416 117258 131930 110988 91178 114552 146447 145515 127013 51160 62728 82804 86229 81102
$$ packed form
12501A83643n0388j6984K5162M5656L6342R887n6385j4032k7825l2858k7005j2248
12489F2965k5709L949J0148L4401L3141K2733K390o0603k3639J1046K4828j1782
12477H3868m0547J9399k6248P024R165J196J6465n8997P666K8775j5946j1206
12465B0614J1429j7065M2623K6726j4256L2443K3628l807k8722K0183j0519j7911
12453H5366m58l1111q654N493K2015K3856o050J3594K7956k6433l0949p57J9868
12440I3736J8448J0639L1639k2864o1639q1422n68J8379J7679K3901J2892k7582
12428C3238l2418Q3827L6909j2491q203L8697M820j0848J0987o473j0266j0521
12416A17258J4672k0942j9810K3374L1895r32j8502p5853J1568K0076L425n127
$$ plain form
12404 81102 70153 62058 32542 14106 43581 64628 66751 84414 80583 77027 63014 32435
12392 32435 24103 45727 60024 53537 68298 79399 52812 25336 61769 102385 128411 123140
12380 123140 127042 86116 94822 99347 127168 134175 73497 58728 72172 68496 86125 126830
12368 126830 172061 182212 163279 128430 121991 141669 162961 190460 229512 251347 271141 305982
12356 305982 324947 355110 404302 540567 707001 916951 1111901 1347158 1634697 1924617
12346 1924617 2120919 2202119 2216784 2134007 1962397 1762261 1511838 1216704 982482 799764
12336 799764 640587 515330 441888 350616 273922 220934 221674 219208 222438 193817 180037 142844
12324 142844 137685 170871 173638 137361 105744 88121 83218 123011 138086 127532 149889 163740
$$ packed form
12404H1102j0949q095k9516j8436K9475K1047K123J7663l831l556j4013l0579
12392C2435q332K1624J4297o487J4761J1101k6587k7476L6433M0616K6026n271
12380A23140L902m0926Q706M525K7821P007o0678j4769J3444l676J7629M0705
12368A26830M5231J0151j8933l4849o439J9678K1292K7499L9052K1835J9794L4841
12356C05982J8965L0163M9192J36265J66434K09950J94950K35257K87539K89920
12346A924617J96302Q1200J4665q2777j71610k00136k50423k95134k34222j82718
12336G99764j59177j25257p3442r1272p6694n2988P40k466L230k8621j3780l7193
12324A42844n159L3186K767l6277l1617j7623m903L9793J5075j0554K2357J3851
$$ plain form
12312 163740 127293 104214 87964 94694 123210 82557 50206 7398 4608 23663 46636 74742
12300 74742 67887 42466 22539 42389 65866 38516 42984 12852 30120 25483 13672 32418
12288 32418 38613 -5524 -34945 -59636 -78933 -63767 -15685 35258 19612 -11686 -16223 -58021
12276 -58021 -59712 -22377 -25382 -27755 -35373 -24013 -20585 -15365 13371 11321 1996 23641 33598
12263 33598 15401 24161 47343 40810 21670 -35525 -32202 -25305 -47492 -49478 -1311 10800 -12202
12250 -12202 -1015 1496 -23596 4319 27197 47853 41507 -353 -43104 -51354 -33428 -24328
12238 -24328 -8448 19248 -8222 -1525 10727 -5612 -6746 40637 34067 3842 -10544 -8686
12226 -8686 -10250 3226 -3619 18250 56094 8050 -11117 12501 53180 75149 49240 51603
$$ packed form
12312A63740l6447k3079j6250O730K8516m0653l2351m2808k790J9055K2973K8106
12300G4742o855k5421j9927J9850K3477k7350M468l0132J7268m637j1811J8746
12288C2418O195m4137k9421k4691j9297J5166M8082N0943j5646l1298m537m1798
12276e8021j691L7335l005k373p618J1360L428N220K8736k050r325K1645R957
12263C3598j8197Q760K3182o533j9140n7195L323O897k2187j986M8167J2111k3002
12250a2202J1187K511k5092K7915K2878K0656o346m1860m2751q250J7926R100
12238b4328J5880K7696k7470O697J2252j6339j134M7383o570l0225j4386J858
12226h686j564J3476o845K1869L7844m8044j9167K3618M0679K1969k5909K363
$$ plain form
12214 51603 51398 44358 53733 30619 6357 16794 15391 -13017 -37269 -49111 -35511 -37948 -39744
12201 -39744 -21872 -6841 -9775 19675 2553 -18541 -72087 -58934 -7538 20038 8082 16710
12189 16710 41534 50567 7728 -5636 -32615 -22824 20276 20180 32891 14173 -4573 -12624 -9665
12176 -9665 -39075 -53346 -51164 -53304 -36565 -20954 8208 -20369 -14260 3628 23941 13176
12164 13176 -25139 -9210 -9045 -6393 -46382 -66538 -59258 -44042 4459 7122 -12951 2291 37892
12151 37892 7780 -34860 -5902 12498 23309 57923 38387 1629 -12423 4638 62592 93734
12139 93734 85281 63975 20942 18152 12889 4276 -42469 -49399 -12597 8454 -7298 -4611 2019
12126 2019 -39002 -75289 -31176 18592 10846 36427 6235 -25135 -19522 7141 -13333 -26701
$$ packed form
12214E1603k05p040R375k3114k4262J0437j403k8408k4252j1842J3600k437j796
12201c9744J7872J5031k934K9450j7122k1094n3546J3153N1396K7576j1956Q628
12189A6710K4824R033m2839j3364k6979R791M3100r6J2711j8718j8746q051K959
12176i665k9410j4271K182k140J6739J5611K9162k8577O109J7888K0313j0765
12164A3176l8315J5929J65K652l9989k0156P280J5216M8501K663k0073J5242L5601
12151C7892l0112m2640K8958J8400J0811L4614j9536l6758j4052J7061N7954L1142
12139I3734q453k1306m3033k790n263q613m6745o930L6802K1051j5752K687O630
12126B019m1021l6287M4113M9768p746K5581l0192l1370N613K6663k0474j3368
$$ plain form
12114 -26701 -585 55454 63710 60857 51818 33702 48715 56727 70514 26752 1522 10373 357
12101 357 -18143 -37263 -24352 -8934 22321 5959 -42659 -50790 -80038 -69756 -44038 -10479
12089 -10479 -10354 -13838 -34855 2854 28848 -11509 -18837 -1603 -35373 -62313 -19110 -15897 3007
12076 3007 9870 -10194 5407 20971 5592 6647 49601 59335 11564 -41379 -41963 -28938 -18694
12063 -18694 -37219 -27497 6847 5502 -26502 -19003 -22237 -38460 -43912 -71135 -85917 -96922 -74509
12050 -74509 -68683 -84465 -103762 -99762 -72039 -66532 -64508 -45720 -16892 45547 84696 70779
12038 70779 29007 13677 13409 -16867 -54651 -74082 -69614 -71511 -81059 -76004 -57204 -11612 -19157
12025 -19157 -19986 -6580 -10941 9136 8459 20810 14494 4298 -11590 -2803 -14195 -34248 -22146
$$ packed form
12114b6701K6116N6039Q256k853r039j8116J5013Q012J3787m3762k5230Q851j0016
12101C57j8500j9120J2911J5418L1255j6362m8618q131k9248J0282K5718L3559
12089a0479J25l484k1017L7709K5994m0357p328J7234l3770k6940M3203L213J8904
12076C007O863k0064J5601J5564j5379J055M2954R734m7771n2943n84J3025J0244
12063a8694j8525R722L4344j345l2004P499l234j6223n452k7223j4782j1005K2413
12050g4509N826j5782j9297M000K7723N507K024J8788K8828O2439L9149j3917
12038G0779m1772j5330k68l0276l7784j9431M468j897r548N055J8800M5592p545
12025a9157q29J3406m361K0077o77J2351o316j0196j5888Q787j1392k0053J2102
$$ plain form
12012 -22146 5047 28288 28112 -7294 -47782 -51727 -2086 14050 6927 7606 -5398 -33613 9444
11999 9444 -667 -13142 -12585 -33607 -43516 -32349 -47231 -85985 -51823 -19053 -27948 -18228 -26628
11986 -26628 9245 12078 -7426 -47046 -58934 -52704 -16941 -40357 -43514 -24325 9372 -5003
11974 -5003 -62597 -70819 -51678 -65549 -61069 -19304 -8695 770 7968 8280 8629 -3353 3106 1315
11960 1315 -23974 -64121 -46085 -58747 -58851 -54704 -82635 -67663 -32936 -2700 -6328 -19721 -8625
11947 -8625 -2069 -422 10118 22613 26674 7435 29879 33070 7977 -38904 -11517 -9597 -1172
11934 -1172 -8527 -15258 -19471 -27957 -1690 10250 6822 1161 -11694 4436 30451 10411 15411
11921 15411 -5383 13760 55076 -874 -6958 -14603 8099 11765 -3843 7315 -9131 -34023
$$ packed form
12012b2146K7193K3241j76l5406m0488l945M9641J6136p123O79j3004k8215M3057
11999I444j0111j2475N57k1022r909J1167j4882l8754L4162L2770q895R720q400
11986b6628L5873K833j9504l9620j1888O230L5763k3416l157J9189L3697j4375
11974e003n7594q222J9141j3871M480M1765J0609R465P198L12L49j1982O459j791
11960A315k5289m0147J8036j2662j04M147k7931J4972L4727L0236l628j3393J1096
11947h625O556J647J0540J2495M061j9239K2444L191k5093m6881K7387J920Q425
11934a172p355o731m213q486K6267J1940l428n661j2855J6130K6015k0040N000
11921A5411k0794J9143M1316n5950o084p645K2702L666j5608J1158j6446k4892
$$ plain form
11909 -34023 -42314 -53476 -34484 10752 22975 14298 -8898 -18491 2468 3363 -12237 -21782 133
11896 133 13864 12959 5164 -4572 -12467 -32693 -1852 23101 5080 -6356 -10971 16881 -20299
11883 -20299 -33263 743 6595 20258 40772 26698 22470 22686 53738 19239 13093 13359 8848
11870 8848 -22354 -41392 -59088 -71473 -63466 -47689 -25673 -14703 8973 -19291 -37474 -70582
11858 -70582 -102139 -128027 -100502 -40918 -19885 22522 27064 2354 -1799 -8060 -730 -1466 -8456
11845 -8456 -37553 -18877 -22814 -12876 -36713 -8123 14652 -28558 -23320 -30278 -46889 -68629 -47258
11832 -47258 -15293 -21224 11860 49792 17416 -21623 -76755 -89374 -92891 -57864 -2883 -7970
11820 -7970 -5421 -10591 4663 -27394 -12166 -4339 11710 10291 -8038 -16502 -16390 4531 27140
$$ packed form
11909c4023q291j1162J8992M5236J2223q677k3196r593K0959Q95j5600r545K1915
11896A33J3731r05p795r736p895k0226L0841K4953j8021j1436m615K7852l7180
11883b0299j2964L4006N852J3663K0514j4074m228K16L1052l4499o146K66m511
11870H848l1202j9038j7696j2385Q007J5777K2016J0970K3676k8264j8183l3108
11858g0582l1557k5888K7525N9584K1033M2407M542k4710m153o261P330p36o990
11845h456k9097J8676l937R938k3837K8590K2775m3210N238o958j6611k1740K1371
11832d7258L1965n931L3084L7932l2376l9039n5132j2619l517L5027N4981n087
11820g970K549n170J5254l2057J5228P827J6049j419j8329q464J12K0921K2609
$$ plain form
11807 27140 -12051 -31108 -59621 -45796 15867 33793 29723 5490 14078 -26245 -36622 -37720
11795 -37720 -26260 213 8868 29183 37379 41397 24379 16578 -4691 -13802 24906 12958 -44122
11782 -44122 -49042 842 -26050 -29100 744 25062 30768 28628 41551 43311 8634 17413 14684
11769 14684 14754 40826 51291 7797 17378 14642 -31834 -76777 -75203 -48493 -23361 -21684 -62882
11756 -62882 -115146 -142968 -99744 -27081 3171 -14014 -5337 19589 2778 23807 5909 -67457
11744 -67457 -27876 26623 62050 67094 45184 13929 -329 8464 -25920 -40577 9698 8888
11732 8888 -33037 -79017 -73498 -75650 -42913 -23518 9204 20643 16962 -16148 -16966 -29941 -31039
11719 -31039 -34384 4182 -954 -1986 -14576 -48782 -39585 -34991 -45018 -71274 -51193 -35571 -17248
$$ packed form
11807B7140l9191j9057k8513J3825O1663J7926m070k4233Q588m0323j0377j098
11795c7720J1460K6473Q655K0315Q196M018j7018p801k1269r111L8708j1948n7080
11782d4122m920M9884k6892l050K9844K4318N706k140J2923J760l4677Q779k729
11769A4684P0K6072J0465m3494R581k736m6476m4943J574K6710K5132J677m1198
11756f2882n2264k7822M3224P2663L0252j7185Q677K4926j6811K1029j7898p3366
11744f7457L9581N4499L5427N044k1910l1255j4258Q793l4384j4657N0275q10
11732H888m1925m5980N519k152L2737J9395L2722J1439l681l3110q18j2975j098
11719c1039l345L8566n136j032j2590l4206R197M594j0027k6256K0081J5622J8323
$$ plain form
11706 -17248 -35855 -42283 -15155 -10240 -709 -30455 -53301 -28110 -1688 1182 -25905 -20587 7298
11693 7298 41204 45147 -663 -15932 -29524 -55223 -38887 7598 39671 76274 42392 -28568
11681 -28568 -45272 -57267 -56634 -64082 -55364 -33136 12864 3732 -4127 -12491 -17817 6678 31735
11668 31735 5766 11421 47894 34312 46062 30727 -2985 6061 30137 27330 15171 12437
11656 12437 10797 -20642 -15448 7922 -26174 -61763 -66891 -31078 -17878 -8167 -4848 -4372 -15416
11643 -15416 -963 -2278 27776 29320 20652 5498 -26936 -34713 -23847 1853 13359 -3033
11631 -3033 -16039 -31380 -60341 -44918 7808 -8218 -29199 -30268 -37656 -19602 16813 9251
11619 9251 -22590 -20944 -20904 -33886 -29449 -30863 -48911 -28954 -28862 -50518 -85300 -111341 -78970 -54832
$$ packed form
11706a7248j8607o428K7128M915R531k9746k2846K5191K6422K870k7087N318K7885
11693G298L3906L943m5810j5269j3592k5699J6336M6485L2073L6603l3882p0960
11681b8568j6704j1995O33p448Q718K2228M6000r132p859q364n326K4495K5057
11668C1735k5969N655L6473j3582J1750j5335l3712R046K4076k807j2159k734
11656A2437j640l1439N194K3370l4096l5589n128L5813J3200R711L319M76j1044
11643a5416J4453j315L0054J544q668j5154l2434p777J0866K5700J1506j6392
11631c033j3006j5341k8961J5423N2726j6026k0981j069p388J8054L6415p562
11619I251l1841J646M0j2982M437j414j8048J9957R2k1656l4782k6041L2371K4138
$$ plain form
11605 -54832 -41493 -4427 56169 61880 -20097 -54295 -52097 -53016 -69281 -57408 -45028 -5352
11593 -5352 -11579 -39441 -55940 -61740 -43775 15928 17518 7206 25328 43380 66385 63423 39671
11580 39671 17950 -32212 -22812 -6195 7452 -13907 -36231 -90469 -102450 -114393 -117026 -87431
11568 -87431 -7443 23003 10621 -24605 -12014 -16733 -21811 770 9132 -29642 -32745 9417
11556 9417 7636 32359 67691 59663 30739 22470 34328 -13548 -19183 -37565 -39636 -19836 -8626
11543 -8626 -3257 -11923 -2338 -65486 -77602 -27783 19672 17782 7215 7819 -8284 -12347 -15679
11530 -15679 12809 -1986 -42912 -43287 -27140 -9728 -8876 14747 28950 21652 18011 17947 16077 -3772
11516 -3772 -15964 -63106 -114720 -109968 -56008 -15037 -33001 -43673 -11171 -12068 -59907 -73827
$$ packed form
11605e4832J3339L7066O0596N711q1977l4198K198r19j6265J1873J2380L9676
11593e352o227k7862j6499n800J7965N9703J590j0312J8122J8052K3005k962k3752
11580C9671k1721n0162R400J6617J3647k1359k2324n4238j1981j1943k633K9595
11568h7431P9988L0446j2382l5226J2591m719n078K2581Q362l8774l103M2162
11556I417j781K4723L5332q028k8924q269J1858m7876n635j8382k071J9800J1210
11543h626N369q666R585o3148j2116M9819M7455j890j0567O04j6103m063l332
11530a5679K8488j4795m0926l75J6147J7412Q52K3623J4203p298l641o4j870j9849
11516c772j2192m7142n1614M752N3960M0971j7964j0672L2502q97m7839j3920
$$ plain form
11504 -73827 -33656 14745 20679 -2566 -1504 24079 33650 9641 7630 9839 17327 35560 5611
11491 5611 1701 -16847 -19995 -51219 -46161 -13237 -12746 -5050 -67563 -78855 -40006 19429 35129
11478 35129 12610 2571 -11806 5470 5442 14769 8521 6522 38496 44394 1117 15419 24915
11465 24915 12222 32025 31391 60111 56033 49287 67058 73219 44217 72339 135482 163732 177830
11452 177830 188230 181117 150334 119304 103432 109599 74121 40611 27460 23368 23569 55262
11440 55262 43196 29856 3010 12218 30063 64525 66663 46186 50204 74688 100257 106695
11428 106695 102647 109674 104965 141733 192171 177684 173446 209372 231547 229475 238952 207745 118107
11415 118107 61419 73267 58304 40644 56977 47360 47571 26178 39326 71410 74740 37669
$$ packed form
11504g3827M0171M8401N934k3245J062K5583R571k4009k011K209P488J8233k9949
11491E611l910j8548l148l1224N058L2924M91P696o2513j1292L8849N9435J5700
11478C5129k2519j0039j4377J7276k8R327o248j999L1974N898m3277J4302R496
11465B4915j2693J9803o34K8720m078o746J7771O161k9002K8122O3143K8250J4098
11452A77830J0400p113l0783l1030j5872O167l5478l3510j3151m092K01L1693
11440E5262j2066j3340k6846R208J7845L4462K138k0477M018K4484K5569O438
11428A06695m048P027m709L6768N0438j4487m238L5926K2175k072R477l1207q9638
11415A18107n6688J1848j4963j7660J6333r617K11k1393J3148L2084L330l7071
$$ plain form
11403 37669 4083 -10837 13629 22695 22850 16469 46736 38793 52510 59619 98078 135591 109252
11390 109252 90764 94262 110104 104419 95896 100808 125044 84471 71810 81388 69635 52323
11378 52323 55831 76445 85051 69194 58963 46616 34195 29293 27021 31456 21258 -24644 -61364
11365 -61364 -32909 30585 40055 20677 3744 -44781 -57970 -46067 -24645 8766 -5102 11766
11353 11766 44693 38416 -4266 3181 617 22357 23167 13337 723 -35157 -46666 -28470 -11370
11340 -11370 33750 61201 64437 56275 66348 76972 35286 26716 15971 -11689 -52 -3362
11328 -3362 -26670 -8272 -14504 -26258 -10961 -22187 600 -14800 -39676 -24087 24818 -10280
11316 -10280 -26400 -23830 -34339 -5215 -5183 -11315 8295 -5877 26701 81175 102870 78467 54793
$$ packed form
11403C7669l3586j4920K4466R066J55o381L0267p943J3717P109L8459L7513k6339
11390A09252j8488L498J5842n685q523M912K4236m0573j2661R578j1753j7312
11378E2323L508K0614Q606j5857j0231j2347j2421m902k272M435j0198m5902l6720
11365f1364K8455O3494R470j9378j6933m8525j3189J1903K1422L3411j3868J6868
11353A1766L2927o277m2682P447k564K1740Q10r830j2614l5880j1509J8196J7100
11340a1370M5120K7451L236q162J0073J0624m1686q570j0745k7660J1637l310
11328c362k3308J8398o232j1754J5297j1226K2787j5400k4876J5589M8905l5098
11316a0280j6120K570j0509K9124L2o132J9610j4172L2578N4474K1695k4403k3674
$$ plain form
11303 54793 19173 33027 57970 43535 3198 -40847 -47391 -11377 -1425 -32237 -54488 -22928
11291 -22928 8096 21579 -32373 -36632 -45521 -13861 -5041 -18937 -41240 -42209 7706 45066 81814
11278 81814 40859 22195 9040 40366 34988 21230 -17629 -19050 -33840 -44613 -27954 -8600
11266 -8600 -15405 -34494 -52385 -78311 -71707 -39424 -31333 -47311 -54887 -64273 -77715 -70647 -42220
11253 -42220 -34334 -13875 -3865 15174 48193 15854 16740 33163 23084 19222 21458 21646 4641
11240 4641 -12410 -15067 -10963 -22860 -16890 -16283 -1299 -15359 -28308 -58427 -32054 -48 11961
11227 11961 -10200 307 40053 13089 -27336 -79848 -69265 -26399 35932 38390 53030 42226
11215 42226 65148 56540 42647 -77 -27275 -10165 -32470 -31572 1851 -21421 2764 50791
$$ packed form
11303E4793l5620J3854K4943j4435m0337m4045o544L6014R952l0812k2251L1560
11291b2928L1024J3483n3952m259q889L1660Q820j3896k2303r69M9915L7360L6748
11278H1814m0955j8664j3155L1326n378j3758l8859j421j4790j0773J6659J9354
11266h600o805j9089j7891k5926O604L2283Q091j5978p576r386j3442P068K8427
11253d2220P886K0459J0010J9039L3019l2339Q86J6423j0079l862K236J88j7005
11240D641j7051k657M104j1897N970O07J4984j4060j2949l0119K6373L2006J2009
11227A1961k2161J0507L9746k6964m0425n2512J0583M2866O2331K458J4640j0804
11215D2226K2922q608j3893m2724k7198J7110k2305Q98L3423k3272K4185M8027
$$ plain form
11203 50791 83936 64276 42037 30497 12694 29923 27550 18818 40272 33889 38327 5571
11191 5571 6286 -3994 -23425 -5421 -27564 -46203 -67752 -35912 -13424 -40350 -68832 -62423
11179 -62423 -38626 26570 54185 49287 46014 18751 1836 -3240 36597 51776 50377 41561 19270
11166 19270 -27397 -41314 -36257 -67333 -67637 -26019 20932 29787 14460 1924 -10778 32778
11154 32778 35368 15592 -26717 -5790 20906 20466 50512 68328 73948 66057 15769 -21501 -44708
11141 -44708 -68738 -58574 -34094 -20403 2557 4245 41274 32211 29640 25994 37170 46199 39751
11128 39751 45643 36454 46238 28818 1506 29195 30975 8207 -4000 -33151 -55415 -23640
11116 -23640 12353 32995 62008 43772 -202 -5532 2219 -32621 -59933 -58204 -36276 -15684
$$ packed form
11203E0791L3145j9660k2239j1540j7803J7229k373q732K1454o383M438l2756
11191E571P15j0280j9431J8004k2143j8639k1549L1840K2488k6926k8482O409
11179f2423K3797O5196K7615m898l273k7263j6915n076L9837J5179j399q816k2291
11166A9270m6667j3917N057l1076l04M1618M6951Q855j5327j2536j2702M3556
11154C2778K590j9776m2309K0927K6696m40L0046J7816N620p891n0288l7270k3207
11141d4708k4030J0164K4480J3691K2960J688L7029r063k571l646J1176R029o448
11128C9751N892r189R784j7420k7312K7689J780k2768j2207k9151k2264L1775
11116b3640L5993K0642K9013j8236m3974n330P751l4840k7312J729K1928K0592
$$ plain form
11104 -15684 5374 17355 22159 -12573 3595 22425 26357 26943 27084 24861 -5693 16470 21450
11091 21450 38847 7 -30944 -30003 -32603 12277 6253 -9908 -17375 -8908 25752 42367 4330
11078 4330 -2452 -12943 -38498 -38283 -23002 -8620 -4342 -10589 26793 24047 26896 50652 43455
11065 43455 31239 33898 58958 47228 17968 7560 -15926 -69439 -70222 -525 15419 -23944
11053 -23944 -33302 -15298 -24196 -18949 -25478 -23214 11480 16720 19422 40923 54708 31548 14487
11040 14487 434 -22935 -4074 -4153 -23881 -11654 10151 50077 84331 14600 -42654 -35970
11028 -35970 -39004 -87886 -54562 -32413 -24493 9091 15513 -21285 -23374 -37399 -56993 -61403 -52939
11015 -52939 -12830 -10219 -7213 -1428 15365 24479 -21615 -26514 -64474 -47815 -8218 -14008 -46688
$$ packed form
11104a5684K1058J1981M804l4732J6168J8830L932N86J41k223l0554K2163M980
11091B1450J7397l8840l0951R41k600M4880o024j6161p467Q467L4660J6615l8037
11078D330o782j0491k5555K15J5281J4382M278o247L7382k746K849K3756p197
11065D3455j2216K659K5060j1730k9260j0408k3486n3513p83O9697J5944l9363
11053b3944r358J8004q898N247o529K264L4694N240K702K1501J3785k3160j7061
11040A4487j4053k3369J8861p9j9728J2227K1805L9926L4254o9731n7254O684
11028c5970l034m8882L3324K2149P920L3584O422l6798k089j4025j9594m410Q464
11015e2939M0109K611L006N785J6793R114m6094m899l7960J6659L9597n790l2680
$$ plain form
11002 -46688 -21646 -2888 6561 1984 8059 1779 6050 29946 23199 19488 38604 3028 -13069
10989 -13069 1243 -3365 -28085 -6310 4047 -10715 6276 -5233 -39606 -29457 -64335 -76449
10977 -76449 -55615 -6047 24627 14639 10940 -13666 -41296 -47192 -24397 -25538 -70955 -99244
10965 -99244 -59897 -59164 -69306 -35707 -37962 -16861 -5154 -603 595 44251 40760 40924 -6492
10952 -6492 -9681 16039 58411 68325 37012 35595 22096 9368 -5950 10117 19264 4065 38539
10939 38539 -16980 -46012 -28484 -6482 4000 5220 756 -8343 -38538 -48146 -63718 -51518
10927 -51518 5485 24650 19500 16583 36046 56626 62750 47797 18197 7731 -16932 -18823
10915 -18823 12294 11533 -15579 -2926 -19167 -27493 -14268 -1500 13560 27980 38384 44779
$$ packed form
11002d6688K5042J8758R449m577O075o280M271K3896o747l711J9116l5576j6097
10989a3069J4312m608k4720K1775J0357j4762J6991j1509l4373J0149l4878j2114
10977g6449K0834M9568L0674r988l699k4606k7630n896K2795j141m5417k8289
10965i9244L9347P33j0142L3599k255K1101J1707M551J198M3656l491J64m7416
10952f492l189K5720M2372R914l1313j417j3499j2728j5318J6067R147j5199L4474
10939C8539n5519k9032J7528K2002J0482J220m464r099l0195r608j5572J2200
10927e1518N7003J9165n150k917J9463K0580O124j4953k9600j0466k4663j891
10915a8823L1117p61k7112J2653j6241q326J3225J2768J5060J4420J0404O395
$$ plain form
10903 44779 31471 6613 -13909 -12371 -37663 -27463 -70054 -67012 -8884 -14499 -19188 3231
10891 3231 22180 44626 20428 6688 -11600 19804 48193 43857 66430 35007 43886 30651
10879 30651 -13914 21255 52402 61914 54628 14580 -36807 -59695 -85546 -10932 52780 46031
10867 46031 -2261 -4254 -4143 -1439 8372 1256 -11626 -3109 33204 46273 42154 24598 790
10854 790 -16878 -6171 23928 53254 23766 9564 -12346 -14982 -23533 3215 23207 2925
10842 2925 10087 32343 69263 89219 69391 61653 33568 4497 7216 32035 12726 -7056
10830 -7056 -1677 1955 -20941 -36188 -13092 17387 17230 -2497 6520 9436 25781 19133 10299
10817 10299 31021 11993 2223 11819 8735 11981 27102 36404 -11238 -22905 -13832 -35359 -43121
$$ packed form
10903D4779j3308k4858k0522J538k5292J0200m2591L042N8128n615m689K2419
10891C231J8949K2446k4198j3740j8288L1404K8389m336K2573l1423Q879j3235
10879C0651m4565L5169L1147R512p286m0048n1387k2888k5851P4614O3712o749
10867D6031m8292j993J11K704R811p116j2882Q517L6313J3069m119j7556k3808
10854G90j7668J0707L0099K9326k9488j4202k1910k636q551K6748J9992k0282
10842B925P162K2256L6920J9956j9828p738k8085k9071K719K4819j9309j9782
10830g056N379L632k2896j5247K3096L0479j57j9727R017K916J6345o648q834
10817A0299K0722j9028r770R596l084L246J5121R302m7642j1667R073k1527p762
$$ plain form
10804 -43121 -35118 -69395 -44164 -18153 6893 32995 9913 -37036 -27854 7276 31201 -7046
10792 -7046 -11860 3463 21034 62076 75949 37091 -12510 -5649 41797 65537 59472 50443 48096
10779 48096 7074 -9464 10347 56802 60269 50694 34483 23137 39939 63710 65092 31222
10767 31222 4807 30467 7177 -23036 -21027 -38748 -25665 -10984 5929 25479 32743 29511
10755 29511 55182 68694 40480 20181 19097 39086 49740 32759 11376 27617 -12935 -6917
10743 -6917 -11044 -5746 17043 11210 40446 73159 63668 23504 19348 2514 11138 33196 55567
10730 55567 45779 1144 -19626 -37279 -10313 23000 -17610 -28154 -9806 25424 52470 28958
10718 28958 11820 259 -23621 -2655 41760 34602 -3917 3964 -10121 650 24942 44828
$$ packed form
10804d3121Q003l4277K5231K6011K5046K6102k3082m6949R182L5130K3925l8247
10792g046m814J5323J7571M1042J3873l8858m9601O861M7446K3740o065r029k347
10779D8096m1022j6538J9811M6455L467r575j6211j1346J6802K3771J382l3870
10767C1222k6415K5660k3290l0213K009j7721J3083J4681J6913J9550P264l232
10755B9511K5671J3512k8214k0299j084J9989J0654j6981k1383J6241m0552O018
10743f917m127N298K2789n833K9236L2713r491m0164m156j6834Q624K2058K2371
10730E5567r788m4635k0770j7653K6966L3313m0610j0544J8348L5230K7046k3512
10718B8958j7138j1561k3880K0966M4415p158l8519P881j4085J0771K4292J9886
$$ plain form
10706 44828 65387 40110 18682 34934 64430 73050 52896 51783 1340 -17567 -18653 -8819
10694 -8819 25741 23871 18130 -21222 -30143 -26253 3091 21033 -11792 -9644 -13576 -11530 -30675
10681 -30675 -57579 -46372 -26341 -32270 -31908 -17952 -3732 1251 38649 36114 -13779 -66005 -73865
10668 -73865 -39115 14368 36991 18311 -7357 -15583 -30119 -35741 -42016 -18003 7368 -16490
10656 -16490 -34301 -46752 -42812 -36027 -37550 5236 36864 27333 59383 58378 26348 -7799 -16442
10643 -16442 5562 35027 -12427 -71373 -55478 -32715 -18354 -16637 32852 33006 3143 33536
10631 33536 37127 6167 -27489 -51577 -63530 -66083 -72252 -85489 -78040 -33321 -6439 10709
10619 10709 34783 -18502 -31201 -18005 15864 5055 -62667 -103093 -31951 31504 21123 -21367
$$ packed form
10706D4828K0559k5277k1428J6252K9496Q620k0154j113n0443j8907j086R834
10694h819L4560j870n741l9352q921L890K9344J7942l2825K148l932K046j9145
10681c0675k6904J1207K0031n929L62J3956J4220M983L7398k535m9893n2226p860
10668g3865L4750N3483K2623j8680k5668q226j4536n622o275K4013K5371k3858
10656a6490j7811j2451L940O785j523M2786L1628r531L2050j005l2030l4147q643
10643a6442K2004K9465m7454n8946J5895K2763J4361J717M9489J54k9863L0393
10631C3536L591l0960l3656k4088j1953k553o169j3237P449M4719K6882J7148
10619A0709K4074n3285j2699J3196L3869j0809o7722m0426P1142O3455j0381m2490
$$ plain form
10607 -21367 -12687 -17736 -50891 -64348 -16013 32342 60539 35593 37309 31877 34095 33635 69630
10594 69630 89436 74889 49125 32027 17880 -16496 -15509 -9546 -54942 -69927 -60229 -20136
10582 -20136 -18091 5083 -539 -18933 -16107 -13445 -34945 223 19357 -28375 -40432 -12045
10570 -12045 -4035 28697 30650 27278 11841 -12090 -10517 -24381 -36777 -46602 -64614 -72269 -79540
10557 -79540 -61570 -74836 -88457 -77291 -42733 -7009 -7209 25619 23567 31307 2995 -10968
10545 -10968 -49085 -64491 -76893 -69458 -36539 -41955 -33591 -19564 4937 -821 -4460 38765 60052
10532 60052 33480 -26074 -68306 -44025 -57633 -83436 -80397 -65285 -69986 -48493 -19162 -22226
10520 -22226 -22969 103 22830 -12504 660 -8602 -20505 4814 17518 7891 -13297 -37627
$$ packed form
10607b1367Q680n049l3155j3457M8335M8355K8197k4946J716n432K218m60L5995
10594F9630J9806j4547k5764j7098j4147l4376R87N963m5396j4985R698M0093
10582b0136K045K3174n622j8394K826K662k1500L5168J9134m7732j2057K8387
10570a2045Q010L2732J953l372j5437k3931J573j3864j2396r825j8012p655p271
10557g9540J7970j3266j3621J1166L4558L5724k00L2828k052P740k8312j3963
10545a0968l8117j5406j2402P435L2919n416Q364J4027K4501n758l639M3225K1287
10532F0052k6572n9554m2232K4281j3608k5803L039J5112m701K1493K9331l064
10520b2226p43K3072K2727l5334J3164r262j1903K5319J2704r627k1188k4330
$$ plain form
10508 -37627 -29514 -19015 -30211 -35454 -1930 5232 8958 -91 -32201 -53989 -39698 1312 -28398
10495 -28398 -57986 -56185 -26692 -5266 6388 -12789 -47222 -47277 -23721 11653 11812 21223 -23307
10482 -23307 -49925 -11706 23711 18775 4071 -12355 -20553 -28569 -29856 -61257 -83959 -5321
10470 -5321 77673 54383 5657 -47905 -61098 -75257 -58477 -44294 -47262 -53075 -59817 -38305
10458 -38305 -30899 -2077 -7631 -11331 4358 -13088 -28838 -17311 2162 36668 33569 6602
10446 6602 7951 2355 53576 46196 -886 -8505 11810 37331 -11869 -16524 -6444 -5648 -20827
10433 -20827 10780 -12618 -70292 -85003 -76980 -50842 -39297 -27825 -47759 -27827 516 -16909
10421 -16909 -46226 -63114 -76067 -50525 4295 -20380 -42135 -56896 -18069 641 -35383 -60562
$$ packed form
10508c7627Q113J0499j1196n243L3524P162L726r049l2110k1788J4291M1010k9710
10495b8398k9588J801K9493K1426J1654j9177l4433n5K3556L5374J59R411m4530
10482b3307k6618L8219L5417m936j4704j6426q198q016j287l1401k2702P8638
10470e321Q2994k3290m8726n3562j3193j4159J6780J4183k968n813o742K1512
10458c8305P406K8822n554l700J5689j7446j5750J1527J9473L4506l099k6967
10446F602J349n596N1221p380m7082p619K0315K5521m9200m655J0080P96j5179
10433b0827L1607k3398n7674j4711Q023K6138J1545J1472j9934J9932K8343j7425
10421a6909k9317j6888j2953K5542N4820k4675k1755j4761L8827J8710l6024k5179
$$ plain form
10409 -60562 -72475 -11550 -3471 -29907 -12141 3735 460 16156 51 -2823 17575 9668
10397 9668 6179 7386 45151 45461 32475 20175 7477 -16961 -5359 44805 53640 12231 -4952
10384 -4952 19290 23521 -1068 9691 30062 74764 138894 209687 288242 360062 437395 532839
10372 532839 621683 668557 684330 666739 620170 579857 505453 410937 358225 311787 244593
10361 244593 163095 122041 133571 136728 116880 111249 100729 101774 113683 98498 120256 130420
10349 130420 86658 24770 -1867 827 -18111 -5710 3302 6123 17054 29264 21951 19211
10337 19211 18719 17137 72192 104098 103042 46950 4703 -40495 -46570 -7265 29596 37005 24327
10324 24327 23148 11982 -4515 -31004 -95407 -85203 -55367 -23078 -25616 -8268 -1846 -7571
$$ packed form
10409f0562j1913O0925Q079k6436J7766J5876l275J5696j6105k874K0398p907
10397I668l489J207L7765L10j2986j2300j2698k4438J1602N0164Q835m1409j7183
10384d952K4242M231k4589J0759K0371M4702O4130P0793P8555P1820P7333R5444
10372E32839Q8844M6874J5773j7591m6569m0313p4404r4516n2712m6438o7194
10361B44593q1498m1054J1530L157j9848n631j0520J045J1909j5185K1758J0164
10349A30420m3762o1888k6637K694j8938J2401R012K821J0931J2210p313k740
10337A9211m92j582N5055L1906j056n6092m2247m5198o075L9305L6861P409j2678
10324B4327j179j1166j6497k6489o4403J0204K9836L2289k538J7348O422n725
$$ plain form
10312 -7571 -7189 1845 25655 29109 39583 31454 -1649 4751 -2935 -22242 -43331 -35838 -34383 3429
10298 3429 11561 -30812 -35892 -30018 -34952 -54647 -24681 -22909 -37112 -5121 15825 2141 5311
10285 5311 19452 44743 37981 52894 43136 48574 33009 33664 17839 7419 36267 31604 40282
10272 40282 40379 3631 -1748 -14271 -61253 -36630 16173 34838 3072 -44359 -41104 15731 -21161
10259 -21161 -47777 -28854 -6954 -9267 -13294 -22566 1472 14469 -6365 -6753 22556 34673 20881
10246 20881 3586 -6848 36456 61952 63949 63150 28762 4192 -5994 30081 60757 43592
10234 43592 17542 14030 115 7338 13003 41549 51273 35588 38897 34661 -20629 7398 39000
10221 39000 13267 20617 58369 67365 67610 62580 41177 24844 53273 51506 33282 24992 29768
$$ packed form
10312g571L82R034K3810L454J0474q129l3103O400p686j9307k1089P493J455L7812
10298C429Q132m2373n080N874m934j9695K9966J772j4203L1991K0946j3684L170
10285E311J4141K5291o762J4913r758N438j5565O55j5825j0420K8848m663Q678
10272D0282R7l6748n379j2523m6982K4623N2803J8665l1766m7431L255N6835l6892
10259b1161k6616J8923K1900k313m027r272K4038J2997k0834l88K9309J2117j3792
10246B0881j7295j0434M3304K5496J997p99l4388k4570j0186L6075L0676j7165
10234D3592k6050l512j3915P223N665K8546R724j5685L309m236n5290K8027L1602
10221C9000k5733P350L7752Q996K45n030k1403j6333K8429j767j8224q290M776
$$ plain form
10208 29768 36268 39344 25692 -898 7254 -4786 17967 16960 15450 39742 31814 32156 62585
10195 62585 62252 18839 34954 103994 74090 69088 90901 77402 47289 2607 29550 81256
10183 81256 32240 -20707 10378 52728 43011 -1614 8088 45070 43594 386 -2565 -17850
10171 -17850 3123 3491 -10008 -5488 -44739 -59353 -99151 -84337 -28078 5728 12390 -14770
10159 -14770 -75374 -44711 13770 18088 13651 14920 38051 31789 -21005 -11158 -25733 -25254 -34763
10146 -34763 -43348 -45918 -33934 -22858 4138 6561 18780 48286 65819 44778 19647 5295
10134 5295 38568 45483 -9975 160 31583 -6985 -31990 -3789 -1265 17912 18859 -604 -17649
10121 -17649 25746 49041 51637 36595 10039 8918 19154 12603 611 10932 38400 22508
$$ packed form
10208B9768O500L076j3652k6590Q152j2040K2753j007j510K4292p928L42L0429
10195F2585l33m3413J6115O9040k9904n002K1813j3499l0113m4682K6943N1706
10183H1256m9016n2947L1085M2350r717m4625R702L6982j476m3208k951j5285
10171a7850K0973L68j3499M520l9251j4614l9798J4814N6259L3806O662k7160
10159a4770o0604L0663N8481M318m437J269K3131o262n2794R847j4575M79r509
10146c4763q585k570J1984J1076K6996K423J2219K9506J7533k1041k5131j4352
10134E295L3273O915n5458J0135L1423l8568k5005K8201K524J9177R47j9463j7045
10121a7649M3395K3295K596j5042k6556j121J0236o551j1992J0321K7468j5892
$$ plain form
10109 22508 688 -3857 8053 22952 15942 19936 4401 9717 7812 -4380 -11819 -2170 13729
10096 13729 12653 48041 56879 44575 61940 70456 73866 18562 -21552 -39323 -61474 -54276 -38751
10083 -38751 -43357 -40188 -26669 -5467 8669 -27290 -29820 14907 -11739 -5116 5387 -592 -15984
10070 -15984 -42049 -43339 -34988 -27479 -16193 -2870 -5860 9404 28108 42155 63344 8506
10058 8506 -25620 -33879 -35947 -29725 -39705 -11608 39140 29388 11765 4044 -11912 -48171 -52920
10045 -52920 10193 25590 27176 -2554 -21481 16272 8118 -11493 -8295 -62709 -57518 -15674
10033 -15674 -10182 -23545 -22007 -16861 -20387 -32486 -27862 -821 9536 -14362 -25446 -36273 -48925
10020 -48925 -33173 -44060 -50033 -33737 20237 31725 12538 23000 -9748 1690 -1961 -8770
$$ packed form
10109B2508k1820m545J1910J4899p010L994j5535N316j905j2192p439R649J5899
10096A3729j076L5388Q838j2304J7365Q516L410n5304m0114j7771k2151P198J5525
10083c8751m606L169J3519K1202J4136l5959k530M4727k6646O623J0503n979j5392
10070a5984k6065j290Q351P509J1286J3323k990J5264J8704J4047K1189n4838
10058H506l4126q259k068O222r980K8097N0748r752j7623p721j5956l6259m749
10045e2920O3113J5397J586k9730j8927L7753q154j9611L198n4414N191M1844
10033a5674N492j3363J538N146l526j2099M624K7041J0357k3898j1084j0827j2652
10020d8925J5752j0887n973J6296N3974J1488j9187J0462l2748J1438l651o809
$$ plain form
10008 -8770 15494 43941 63933 65792 58472 2273 12513 37572 44516 56166 2371 -49100
9996 -49100 -46100 5659 23983 7502 -4041 -9650 -18711 -9460 54 2933 23723 -3403 -29036
9983 -29036 -16784 -19565 -22815 -38842 -75078 -92017 -92958 -101037 -85634 -88075 -62049 -51985 -28696
9970 -28696 -2985 11745 24617 -1932 -21499 -16782 13691 19958 18155 13281 -5508 -21808 6701
9957 6701 2620 -19266 -8539 8588 3171 -30008 -15162 -15199 -32164 -71371 -60954 -34192 -12697
9944 -12697 21025 7353 -32103 -15391 1558 4439 -15362 -35624 -31670 -21306 -19258 -14834 11620
9931 11620 39758 79014 58175 12289 10395 16280 16626 -35122 -69144 -38847 -909 -26266 -37442
9918 -37442 -25089 9960 13353 10374 -7918 -42074 -58371 -28460 -37841 -37537 -41177 -32766 -53572
$$ packed form
10008h770K4264K8447J9992J859p320n6199J0240K5059O944J1650n3795n1471
9996d9100L000N1759J8324j6481j1543n609r061R251R514K879K0790k7126k5633
9983b9036J2252k781l250j6027l6236j6939r41q079J5403k441K6026J0064K3289
9970b8696K5711J4730J2872k6549j9567M717L0473O267j803m874j8789j6300K8509
9957F701m081k1886J0727J7127n417l3179J4846l7j6965l9207J0417K6762K1495
9944a2697L3722j3672l9456J6712J6949K881j9801k0262L954J0364K048M424K6454
9931A1620K8138L9256k0839m5886j894N885L46n1748l4022L0297L7938k5357j1176
9918c7442J2353L5049L393k979j8292l4156j6297K9911r381L04l640Q411k0806
$$ plain form
9905 -53572 -72409 -39492 -16058 18420 13134 7249 32400 38593 30281 70535 125105 145723 168250
9892 168250 146816 84594 65866 73678 62888 62275 62757 34192 5448 -7047 2178 -11108 7193
9879 7193 28346 19798 13905 362 29181 58583 74766 58926 45133 57784 55939 64177 53057
9866 53057 81964 139858 156071 138338 139745 139708 186706 311042 469770 819981 1317595 1814931
9854 1814931 2032144 1830106 1360023 884030 593791 457173 342607 266721 257914 256638
9844 256638 257899 289495 351500 478613 700881 997262 1360750 1691763 1852741 1825941 1646075
9833 1646075 1385477 1080965 787082 579448 437794 365826 333510 303245 270435 227397
9823 227397 187959 161457 138988 143951 118760 118426 111351 106804 99132 92965 80416 75708 63264
$$ packed form
9905e3572j8837L2917K3434L4478n286n885K5151O193q312M0254N4570K0618K2527
9892A68250k1434o2222j8728P812j0790o13M82k8565k8744j2495R225j3286J8301
9879G193K1153q548n893j3543K8819K9402J6183j5840j3793J2651j845Q238j1120
9866E3057K8907N7894J6213j7733J407l7M6998J24336J58728L50211M97614M97336
9854A814931K17213k02038m70083m75993k90239j36618j14566p5886q807j276
9844B56638J261L1596O2005J27113K22268K96381L63488L31013J60978k6800j79866
9833A646075k60598l04512k93883k07634j41654p1968l2316l0265l2810m3038
9823B27397l9438k6502k2469M963k5191l34p075m547p672o167j2549m708j2444
$$ plain form
9810 63264 62974 67939 64639 23599 32918 26967 34126 60874 71757 38455 37574 24174 -18274 -3692
9796 -3692 19988 11091 6522 9836 -1605 7916 14492 1424 -27772 -23951 -15040 -10707 16308 2731
9782 2731 6299 28502 -19981 -40109 -29129 1842 25864 -6423 8384 42482 46786 37727 -202
9769 -202 -26858 -10490 12200 24239 4449 1875 51271 47192 9023 -1467 -18023 -42219 -16347
9756 -16347 5172 14049 12402 -24540 -7690 58181 45071 16377 633 -38124 -41516 5576
9744 5576 1838 -36879 -27569 11030 12383 -4019 -3893 45393 54019 13230 -4645 12449 4499
9731 4499 949 -15651 5034 -19564 -48138 -43802 -42505 18834 72406 62780 51698 55261 38073
9718 38073 14533 -346 -4624 -37110 -45239 -21275 6798 -3180 -34191 9055 -23694 -71668
$$ packed form
9810F3264k90M965l300m1040R319n951P159K6748J0883l3302q81j3400m2448J4582
9796c692K3680q897m569L314j1441R521O576j3068k9196L821Q911M333K7015j3577
9782B731L568K2203m8483k0128J0980L0971K4022l2287J4807L4098M304r059l7929
9769b02k6656J6368K2690J2039j9790k574M9396m079l8169j0490j6556k4196K5872
9756a6347K1519Q877j647l6942J6850O5871j3110k8694j5744l8757l392M7092
9744E576l738l8717R310L8599J353j6402J26M9286Q626m0789j7875J7094p950
9731D499l550j6600K0685k4598k8574M336J297O1339N3572r626j1082L563j7188
9718C8073k3540j4879m278l2486q129K3964K8073r978l1011M3246l2749m7974
$$ plain form
9706 -71668 -92532 -12734 47148 65510 42705 43583 63009 61221 64342 66360 60691 71202 90802
9693 90802 50451 45655 40199 32281 29066 17301 22409 43239 71910 91529 80443 60157 79478
9680 79478 89367 59764 43975 43137 35828 38743 46406 70109 76064 81048 45401 38441 -29401 -89453
9666 -89453 -23441 602 -2177 13347 22397 9015 44235 31752 5214 13907 -22257 -26268 -22005
9653 -22005 14709 32742 55052 54565 33760 57205 55060 27994 18650 5147 -17193 -13675 -834
9640 -834 23523 46193 24194 -6274 -5377 4192 40688 57678 76140 73105 42202 31895 51650
9627 51650 84317 76282 86527 70632 35986 63747 89182 85358 45110 15780 19742 40068
9615 40068 63319 37276 22369 9101 45150 59255 48720 13616 28079 51030 104994 77797
$$ packed form
9706g1668k0864P9798N9882J8362k2805Q78J9426j788L121K018n669J0511J9600
9693I0802m0351m796n456p918l215j1765N108K0830K8671J9619j1086k0286J9321
9680G9478R889k9603j5789q38p309K915P663K3703N955M984l5647o960o7842o0052
9666h9453O6012K4043k779J5524R050j3382L5220j2483k6538Q693l6164m011M263
9653b2005L6714J8033K2310m87k0805K3445k145k7066r344j3503k2340L518J2841
9640h34K4357K2670k1999l0468Q97R569L6496J6990J8462l035l0903j0307J9755
9627E1650L2667q035J0245j5895l4646K7761K5435l824m0248k9330L962K0326
9615D0068K3251k6043j4907j3268L6049J4105j0535l5104J4463K2951N3964k7197
$$ plain form
9603 77797 65674 34679 -202 -9976 -9462 -7291 40126 41506 42445 49026 76060 101991 76080
9590 76080 81511 136905 202354 244066 248263 226617 219674 208583 185784 156431 129399 121742 78079
9577 78079 8507 23256 65960 112334 119480 114535 94851 138522 150151 173000 212240 254080
9565 254080 215181 187826 177684 144805 134321 159685 192327 192334 189048 187442 191106 174643 181190
9552 181190 185477 207936 229909 241755 276252 386881 550705 652850 637019 542852 413386
9541 413386 344120 292662 241014 247910 257707 243871 226811 195969 190498 177429 207344 206528 191204
9528 191204 212494 218954 220749 237124 254843 252792 250815 212869 222745 231171 220342 211832 131110
9515 131110 119342 122104 102326 103664 109995 120868 131869 108986 88784 95446 140821 217644
$$ packed form
9603G7797j2123l0995l4881r774N14K171M7417J380R39O581K7034K5931k5911
9590G6080N431N5394O5449M1712M197k1646o943j1091k2799k9353k7032p657m3663
9577G8079o9572J4749M2704M6374P146m945j9684M3671J1629K2849L9240M1840
9565B54080l8899k7355j0142l2879j0484K5364L2642Pl286j606L664j6463O547
9552A81190M287K2459K1973J1846L4497J10629J63824J02145j5831r4167j29466
9541D13386o9266n1458n1648O896R797j3836j7060l0842n471j3069K9915q16j5324
9528A91204K1290O460J795J6375J7719k051j977l7946R876Q426j0829q510q0722
9515A31110j1768K762j9778J338O331J0873J1001k2883k0202O662M5375P6823
$$ plain form
9503 217644 217098 194689 134360 87197 64515 63171 62434 64424 75248 80731 126401 150794 155523
9490 155523 167289 140934 116785 116819 82834 70982 75813 62168 90291 68018 45122 12762
9478 12762 -20118 566 38678 101859 123926 75304 40625 74436 74038 56268 37907 -3787
9466 -3787 -15150 14517 22905 30760 56252 105694 91345 111220 97676 75508 92102 98868 60762
9453 60762 74423 86578 52944 51322 66923 72369 47390 49426 59808 98077 88155 105136 108878
9440 108878 110976 71023 77817 71179 59352 97014 142297 152928 118429 77110 73393 98646
9428 98646 127376 91295 56954 60961 44933 46378 80829 122116 105914 109872 122194 118665 92930
9415 92930 99051 86014 80364 107709 108064 117216 134358 138370 141264 136600 137331 107671 52883 31128
$$ packed form
9503B17644n46k2409o0329m7163k2682j344p37J990J0824N483M5670K4393M729
9490A55523J1766k6355k4149L4l3985j1852M831j3645K8123k2273k2896l2360
9478A2762l2880K0684L8112O3181K2067m8622l4679L3811l98j7770j8361m1694
9466c787j1363K9667Q388P855K5492M9442j4349J9875j3544k2168J6594O766l8106
9453F0762J3661J2155l3634j622J5601N446k4979K036J0382L8269r922J6981L742
9440A08878K098l9953O794o638j1827L7662M5283J0631l4499m1319l717K5253
9428I8646K8730l6081l4341M007j6028J445L4451M1287j6202L958J2322l529k5735
9415I2930O121j3037n650K7345L55R152J7142M012K894m664P31k9660n4788k1755
$$ plain form
9401 31128 48265 66374 74991 89714 146931 154020 130863 91517 56667 65595 89653 112410
9389 112410 139784 121393 94077 103248 133050 152366 158583 134340 131002 145213 109558 118127
9377 118127 114728 102070 86638 61515 83237 97457 80908 73440 79815 101083 113440 151425
9365 151425 153416 180050 176864 155624 100053 46497 51218 80032 90427 61378 90227 109969
9353 109969 100665 116436 144304 151194 165112 122430 75572 114920 111316 126249 102149 122194
9341 122194 113603 89155 80740 90948 118217 111277 112413 164764 149083 149965 143299 144888 145434 154045
9327 154045 159213 150046 153309 155809 153903 156309 217567 209031 218464 199115 166379 138689 142685
9314 142685 133172 116099 134626 171801 162121 172624 160247 163306 179093 177253 147136 165838
$$ packed form
9401C1128J7137J8109Q617J4723N7217P089k3157l9346l4850Q928K4058K2757
9389A12410K7374j8391k7316R171K9802J9316O217k4243l338J4211l5655Q569
9377A18127l399j2658j5432k5123K1722J4220j6549p468O375K1268J2357L7985
9365A51425J991K6634l186k1240n5571n3556M721K8814J0395k9049K8849J9742
9353A09969r304J5771K7868O890J3918m2682m6858L9348l604J4933k4100K0045
9341A22194q591k4448q415J0208K7269o940J136N2351j5681Q82o666J589N46Q611
9327A54045N168r167L263K500j906K406O1258q536R433j9349l2736k7690L996
9314A42685r513j7073J8527L7175r680J0503j2377L059J5787j840l0117J8702
$$ plain form
9302 165838 182894 168657 119483 140466 166812 184479 203646 163720 135513 116909 157229 155769
9290 155769 166558 172722 145309 144065 151000 141023 133022 123170 143734 180929 175456 174735 215414
9277 215414 237646 215095 231401 236725 238174 276172 291502 298765 327074 279128 308460 304015
9265 304015 270200 279049 265105 228700 202107 210913 209035 208906 218048 240143 210374 199770 210828
9252 210828 212029 214715 262058 275716 252060 222428 230476 234180 203789 207024 222193 253417 272659
9239 272659 254236 260257 303022 304432 256186 242389 244954 222586 244325 246116 255511 262772 262946
9226 262946 292577 315125 295923 277657 242211 220680 244252 258278 266770 278922 290466 245839
9214 245839 225079 212053 216672 248564 273279 281767 287967 268588 241660 235150 248401 263992
$$ packed form
9302A65838J7056j4237m9174K0983K6346J7667J9167l9926k8207j8604M0320j460
9290A55769J0789O164k7413j244O935r977q001r852K0564L7195n473p21M0679
9277B15414K2232k2551J6306N324J449L7998J5330P263K8309m7946K9332m445
9265C04015l3815Q849j3944l6405k6593Q806j878j29R142K2095k9769j0604J1058
9252B10828J201K686M7343J3658k3656k9632Q048L704l0391L235J5169L1224J9242
9239B72659j8423O021M2765J410m8246j3797K565k2368K1739J791R395P261J74
9226B62946K9631K2548j9202j8266l5446k1531K3572J4026Q492J2152J1544m4627
9214B45839k0760j3026M619L1892K4715Q488O200j9379k6928o510J3251J5591
$$ plain form
9202 263992 284669 295013 306020 299582 285021 270096 283903 327310 339620 316812 287425 330650
9190 330650 362985 338615 337555 370046 342435 314523 307454 300343 299364 308729 301002 339541 391297
9177 391297 351873 369264 371005 374199 409487 437411 440073 429598 429303 467511 492194 475901 438512
9164 438512 450439 459320 459633 465739 448513 422037 467580 498921 485364 503919 474176 436734
9152 436734 437915 440717 490977 476961 429366 439315 416017 439861 455996 461528 457081 446181 461774
9139 461774 457111 473043 473309 458014 473186 474542 447249 455279 477018 505800 492588 459927 410117
9126 410117 424471 458193 481675 470461 497384 479534 461596 470321 511003 530013 540045 534390
9114 534390 498199 478788 466102 423299 445670 498079 505556 491234 493678 496174 520330 513028
$$ packed form
9202B63992K0677J0344J1007o438j4561j4925J3807M3407J2310k2808k9387M3225
9190C30650L2335k4370j060L2491k7611k7912p069p111r79R365p727L8539N1756
9177C91297l9424J7391J741L194L5288K7924K662j0475k95L8208K4683j6293l7389
9164D38512J1927Q881L13O106j7226k6476M5543L1341j3557J8555k9743l7442
9152D36734J181K802N0260j4016m7595R949k3298K3844J6135N532m447j0900J5593
9139D61774m663J5932K66j5295J5172J356k7293Q030K1739K8782j3212l2661m9810
9126D10117J4354L3722K3482j1214K6923j7850j7938Q725M0682J9010J0032n655
9114E34390l6191j9411j2686m2803K2371N2409P477j4322K444K496K4156p302
$$ plain form
9102 513028 489167 514582 480423 498792 525064 529488 529589 560373 587683 625540 626557 646565
9090 646565 650067 651148 643832 647618 687772 735813 753655 730221 725728 768679 776409 744705 720629
9077 720629 750650 772358 854020 853873 838224 872375 855820 832477 842001 835074 895303 923158
9065 923158 957557 991086 1040143 1099501 1137230 1134602 1120186 1134475 1148516 1175138 1174540 1156272
9053 1156272 1167772 1201627 1235234 1240761 1266994 1312691 1323778 1317505 1382279 1384685 1378856 1418840
9041 1418840 1455844 1499813 1537257 1568297 1593004 1587473 1560659 1564499 1558313 1587065 1661751 1737665
9029 1737665 1774250 1767689 1716241 1726238 1787265 1834036 1881382 1907417 1903003 1929902 1973401 2033469
9017 2033469 2083545 2098570 2126405 2187107 2197055 2215700 2270335 2309074 2315808 2375222 2417589 2445828
$$ packed form
9102E13028k3861K5415l4159J8369K6272M424J01L0784K7310L7857J017K0008
9090F46565L502J081p316L786M0154M8041J7842k3434m493M2951P730l1704k4076
9077G20629L0021K1708Q1662j47j5649L4151j6555k3343R524o927O0229K7855
9065I23158L4399L3529M9057N9358L7729k628j4416J4289J4041K6622n98j8268
9053A156272J1500L3855L3607N527K6233M5697J1087o273O4774K406n829L9984
9041A418840L7004M3969L7444L1040K4707n531k6814L840o186K8752P4686P5914
9029A737665L6585o561n1448R997O1027M6771M7346K6035m414K6899M3499O0068
9017B033469N0076J5025K7835O0702R948J8645N4635L8739O734N9414M2367K8239
$$ plain form
9005 2445828 2531637 2591284 2650548 2664577 2715900 2766055 2809569 2868750 2948041 3007944 3039862
8994 3039862 3107029 3177380 3232006 3317660 3428457 3488603 3558197 3688756 3765838 3850631 3969732
8983 3969732 4036372 4095970 4211114 4339185 4448196 4565311 4703805 4838534 4956895 5108343
8973 5108343 5207499 5360497 5574016 5735161 5865142 6086418 6339501 6546519 6755268 6923256
8963 6923256 7144723 7384117 7604833 7860799 8184742 8536914 8910713 9269699 9659797 10096274
8953 10096274 10499029 10935708 11454209 11996851 12539013 13148508 13765099 14378466 15100046
8944 15100046 15869521 16724459 17619501 18562958 19594842 20693068 21869316 23163501 24555973
8935 24555973 26071633 27747547 29543747 31509334 33692456 36102423 38739256 41605433
$$ packed form
9005B445828Q5809N9647N9264J4029N1323N0155M3514N9181P9291N9903L1918
8994C039862O7167P0351N4626Q5654J10797O0146O9594J30559P7082Q4793J19101
8983C969732O6640N9598J15144J28071J09011J17115J38494J34729J18361J51448
8973E108343R9156J52998K13519J61145J29981K21276K53083K07018K08749J67988
8963F923256K21467K39394K20716K55966L23943L52172L73799L58986L90098M36477
8953A0096274M02755M36679N18501N42642N42162O09495O16591O13367P21580
8944A5100046P69475Q54938Q95042R43457J031884J098226J176248J294185J392472
8935B4555973J515660J675914J796200J965587K183122K409967K636833K866177
$$ plain form
8927 41605433 44747354 48164417 51939118 56101970 60685866 65693221 71163644 77077370
8919 77077370 83511258 90424975 97723760 105327498 113122423 120973380 128560248 135550535
8911 135550535 141713178 146685818 150228836 152116269 152192497 150534221 147322764 142707996
8903 142707996 136967879 130443670 123496621 116331622 109135168 102022837 95186217 88685956
8895 88685956 82556263 76823832 71502940 66577991 62063440 57915273 54055991 50545683
8887 50545683 47350344 44345313 41552210 38982043 36551375 34337689 32285750 30423251
8879 30423251 28743395 27160489 25665712 24306070 23093824 21928546 20835035 19812435
8871 19812435 18856671 17973561 17172863 16410393 15697211 15022697 14403574 13797598 13217151
$$ packed form
8927D1605433L141921L417063L774701M162852M583896N007355N470423N913726
8919G7077370O433888O913717P298785P603738P794925P850957P586868O990287
8911A35550535O162643M972640L543018J887433P6228j658276l211457m614768
8903A42707996n740117o524209o947049p164999p196454p112331o836620o500261
8895H8685956o129693n732431n320892m924949m514551m148167l859282l510308
8887E0545683l195339l005031k793103k570167k430668k213686k051939j862499
8879C0423251j679856j582906j494777j359642j212246j165278j093511j022600
8871A9812435r55764q83110q00698p62470p13182o74514o19123o05976n80447
$$ plain form
8862 13217151 12678088 12201876 11728271 11250471 10799627 10341490 9947054 9624362 9291196
8853 9291196 8910751 8590796 8283155 7979809 7697151 7444819 7215153 6979369 6814488 6629467
8843 6629467 6389984 6196521 6018599 5830194 5644750 5453391 5266115 5122125 5035580 4880976
8833 4880976 4724224 4632724 4523875 4408285 4290999 4167049 4044407 3915193 3819025 3743556
8823 3743556 3670752 3607472 3543333 3461050 3380919 3276883 3176371 3120927 3071535 3026353 2938918
8812 2938918 2844379 2820052 2787875 2705106 2665722 2616231 2529890 2446755 2380879 2335081 2290645
8801 2290645 2267757 2257383 2206324 2170474 2122154 2061144 2027075 2051556 2013388 1981783 1929114
8790 1929114 1844551 1815012 1782963 1755765 1753554 1723933 1706200 1728453 1730543 1655335 1631735 1651978
$$ packed form
8862A3217151n39063m76212m73605m77800m50844m58137l94436l22692l33166
8853I291196l80445l19955l07641l03346k82658k52332k29666k35784j64881j85021
8843F629467k39483j93463j77922j88405j85444j91359j87276j43990q6545j54604
8833D880976j56752r1500j08849j15590j17286j23950j22642j29214r6168p5469
8823C743556p2804o3280o4139q2283q0131j04036j00512n5444m9392m5182q7435
8812B938918r4539k4327l2177q2769l9384m9491q6341q3135o5876m5798m4436
8801B290645k2888j0374n1059l5850m8320o1010l4069K4481l8168l1605n2669
8790A929114q4563k9539l2049k7198k211k9621j7733K2253K090p5208k3600K0243
$$ plain form
8778 1651978 1644594 1610890 1529602 1496097 1441886 1436546 1444590 1413774 1385064 1377314 1362196 1347847
8766 1347847 1344325 1367604 1348464 1242459 1232065 1239713 1197248 1169599 1179427 1163612 1150981 1152927
8754 1152927 1147325 1140998 1159737 1150206 1089590 1066868 1073895 1100973 1093850 1035830 996786 1016724
8742 1016724 1005523 998474 982246 967225 926210 890364 876376 921224 932965 904264 876413 851765
8730 851765 870240 885764 908201 925310 938993 939695 907999 897900 908563 869116 830396 835081
8718 835081 831200 826971 840207 840860 817759 780376 771500 796116 795970 746469 731303 740996 730471
8705 730471 733794 743224 761894 727782 684572 653144 674861 638180 604360 591602 582217 615090
8693 615090 651375 673383 686505 657560 635342 650856 662595 665713 656346 633844 570627 556713
$$ packed form
8778A651978p384l3704q1288l3505n4211n340Q044l0816k8710p750j5118j4349
8766A347847l522K3279j9140j06005j0394P648m2465k7649R828j5815j2631J946
8754A152927n602o327J8739r531o0616k2722P027K7078p123n8020l9044J9938
8742A016724j1201p049j6228j5021m1015l5846j3988M4848J1741k8701k7851k4648
8730H51765J8475J5524K2437J7109J3683P02l1696j0099J0663l9447l8720M685
8718H35081l881m229J3236O53k3101l7383q876K4616j46m9501j5166R693j0525
8705G30471L323R430J8670l4112m3210l1428K1717l6681l3820j2758r385L2873
8693F15090L6285K2008J3122k8945k2218J5514J1739L118r367k2502o3217j3914
$$ plain form
8681 556713 581056 518337 516044 556483 589798 578457 567040 539016 519513 549897 551419 516499
8669 516499 530084 538191 492905 504858 536711 563675 573804 595410 592220 587192 583990 569299
8657 569299 613175 699162 853290 961793 986306 918056 760129 667691 621073 562523 491855
8646 491855 464534 501075 479030 456613 505924 511927 533540 526785 448084 406385 403718 429686
8634 429686 440136 447989 461093 447495 419186 447845 464020 436608 439168 415096 381530 394266
8622 394266 416963 458993 475693 469040 482223 482019 485145 478151 482386 568284 667734 788464 1038326
8609 1038326 1304438 1358895 1235498 995439 768507 646807 597196 549496 506676 505215 505075
8598 505075 477050 452206 426588 384924 381293 384258 395006 411471 402047 372286 324228 341708
$$ packed form
8681E56713K4343o2719k293M0439L3315j1341j1417k8024j9503L0384J522l4920
8669E16499J3585Q107m5286J1953L1853K6964J0129K1606l190n028l202j4691
8657E69299M3876Q5987J54128J08503K4513o8250j57927r2438m6618n8550p0668
8646D91855k7321L6541k2045k2417M9311O003K1613o755p8701m1699k667K5968
8634D29686J0450P853J3104j3598k8309K8659J6175k7412K560k4072l3566J2736
8622C94266K2697M2030J6700o653J3183k04L126o994M235Q5898R9450J20730K49862
8609A038326K66112N4457j23397k40059k26932j21700m9611m7700m2820j461j40
8598E05075k8025k4844k5618m1664l631K965J0748J6465r424k9761m8058J7480
$$ plain form
8586 341708 359392 373081 385654 403720 390426 346603 324247 312670 353406 412987 421887 363450
8574 363450 334399 332630 341019 368910 364752 324511 338644 384128 444774 541478 685531 760584
8562 760584 734933 650054 501157 392800 391588 373007 323998 300795 302240 303886 330074 352024
8550 352024 394789 384581 330855 292075 279320 262387 294202 258395 226499 222814 256021 272951
8538 272951 309918 291312 257758 234305 215641 198720 221642 241422 221227 206187 195468 204297
8526 204297 200664 183494 178958 199935 196852 221868 235593 233330 260867 283335 244497 221480
8514 221480 179691 198475 215327 226804 211195 184674 186927 170155 149172 168454 191946 212551
8502 212551 224209 248024 242369 237927 233136 222660 263596 243061 220240 217076 224013 227606 204928
$$ packed form
8586C41708J7684J3689J2573J8066j3294m3823k2356j1577M0736N9581Q900n8437
8574C63450k9051j769Q389K7891m158m0241J4133M5484O0646R6704J44053P5053
8562G60584k5651q4879j48897j08357j212j8581m9009k3203J445J646K6188K1950
8550C52024M2765j0208n3726l8780j2755j6933L1815l5807l1896l685L3207J6930
8538B72951L6967j8606l3554k3453j8664j6921K2922J9780k0195j5040j0719Q829
8526B04297l633j7170m536K0977l083K5016J3725k263K7537K2468l8838k3017
8514B21480m1789J8784J6852J1477j5609k6521K253j6772k0983J9282K3492K0605
8502B12551J1658K3815n655m442m791j0476M0936k0535k2821l164O937L593k2678
$$ plain form
8489 204928 178330 191791 216679 209400 211513 228936 193856 152829 146313 159863 184863 208400
8477 208400 190586 152522 135093 172700 178354 157112 172282 166569 166422 172497 212390 171292 168485
8464 168485 196747 209086 213784 201799 176265 141645 136655 134194 139450 134937 151476 192474 207139
8451 207139 227670 199905 151883 135143 134119 141024 145889 140827 155745 170688 149011 132642
8439 132642 113784 128201 150242 181635 214395 208119 174796 131406 135304 151194 143441 107091
8427 107091 94239 88664 85598 68852 36394 66750 102676 109097 137581 117774 86821 74949
8415 74949 87318 72572 98699 124728 95691 95241 105175 79108 50715 38977 31270 51799 76315
8402 76315 88984 96177 68360 69042 138396 132306 162717 149372 114106 113081 120662 117931 98241
$$ packed form
8489B04928k6598J3461K4888p279K113J7423l5080m1027o516J3550K5000K3537
8477B08400j7814l8064j7429L7607N654k1242J5170n713j47O075L9893m1098k807
8464A68485K8262J2339M698j1985k5534l4620m990k461N256m513J6539M0998J4665
8451B07139K0531k7765m8022j6740j024O905M865n062J4918J4943k1677j6369
8439A32642j8858J4417K2041L1393L2760o276l3323m3390L898J5890p753l6350
8427A07091j2852n575l066j6746l2458L0356L5926O421K8484j9807l0953j1872
8415G4949J2369j4746K6127K6029k9037m50R934k6067k8393j1738p707K0529K4516
8402G6315J2669P193k7817O82O9354o090L0411j3345l5266j025P581k731j9690
$$ plain form
8389 98241 101399 125782 136543 108085 117663 84034 53742 48436 52898 100701 97029 93294 96573
8376 96573 81455 78807 95696 104160 136767 130632 152635 168434 152308 134968 104578 100682 115483
8363 115483 138381 161732 148685 166789 176055 178424 190181 228362 203732 162859 142508 127687
8351 127687 115276 115590 100906 65612 70695 57789 75472 78294 71542 88569 90024 87718 93009
8338 93009 105414 77221 50154 59316 51669 54559 54627 53163 63924 97049 125432 115771 72335
8325 72335 81342 108795 134472 124463 118376 104829 83766 85718 102357 65185 58663 98824 102004
8312 102004 102371 112338 122005 128339 135832 105914 44932 16692 22857 2024 1043 26915 28368 34371
8298 34371 46221 54234 61755 57139 88834 86776 39193 41294 103802 117709 111781 94111 94969
$$ packed form
8389I8241L158K4383J0761k8458R578l3629l0292n306M462M7803l672l735L279
8376I6573j5118k648J6889Q464L2607o135K2003J5799j6126j7340l0390l896J4801
8363A15483K2898K3351j3047J8104R266K369J1757L8181k4630m0873k0351j4821
8351A27687j2411L14j4684l5294N083j2906J7683K822o752J7027J455k306N291
8338I3009J2405k8193k7067R162p647K890O8j464J0761L3125K8383r661m3436
8325G2335R007K7453K5677j0009o087j3547k1063J952J6639l7172o522M0161L180
8312A02004L67R967R667O334P493k9918o0982k8240O165k0833r81K5872J453O003
8298C4371J1850Q013P521m616L1695k058m7583K101O2508J3907n928j7670Q58
$$ plain form
8285 94969 97091 85020 110597 108189 111973 107520 86243 104061 66261 53768 35260 65458 99113
8272 99113 108185 120570 73220 94593 152792 133074 113681 86825 66509 108703 128509 107216
8260 107216 80682 57451 30706 17471 21892 -4212 -1242 1517 32403 61855 103839 100189
8248 100189 82083 72456 52933 35844 21925 58103 111124 99120 100828 118593 78520 85848
8236 85848 87325 81738 73073 91100 89600 99190 121264 102499 92503 79089 77745 70360 39288
8223 39288 19903 29634 75306 62300 37852 72527 42798 45908 48417 24851 25499 27298 31959
8210 31959 29435 5040 9975 -30533 -23890 2538 23367 21449 16700 21915 69 11791 37176
8197 37176 69052 60251 49425 3661 -26635 -15692 -11259 -605 6409 41166 79807 112510
$$ packed form
8285I4969K122j2071K5577k408L784m453k1277J7818l7800j2493j8508L0198L3655
8272I9113R072J2385m7350K1373N8199j9718j9393k6856k0316M2194J9806k1293
8260A07216k6534k3231k6745j3235M421k6104K970K759L0886K9452M1984l650
8248A00189j8106r627j9523j7089j3919L6178N3021j2004J708J7765m0073P328
8236H5848J477n587q665J8027j500R590K2074j8765r996j3414j344p385l1072
8223C9288j9385R731M5672j3006k4448L4675k9729L110K509k3566O48J799M661
8210C1959k524k4395M935m0508O643K6428K0829j918m749N215k1846J1722K5385
8197C7176L1876q801j0826m5764l0296J0943M433J0654P014L4757L8641L2703
$$ plain form
8185 112510 98729 62025 10247 -73485 -71379 -53762 -9690 48159 80592 67253 53300 51669
8173 51669 74259 102080 102165 82009 69342 39829 42599 35875 24417 8669 46571 51260 56653
8160 56653 84880 89578 73188 70866 68771 104655 120023 63480 34945 68142 57608 8827
8148 8827 21590 13976 21661 35375 70682 104697 96646 98938 89324 24567 -3893 27672 40964
8135 40964 -2083 -36586 -22690 30733 60308 42101 51281 88850 84393 46501 35564 55864
8123 55864 64366 86600 84074 74639 95124 110029 131834 117350 92322 64193 57132 52525 32983
8110 32983 47820 59475 73589 69205 66345 64679 81638 61909 75803 79399 71683 95386 96352
8097 96352 102390 75381 51477 55414 40214 50130 67211 60804 48320 67485 109282 83329 67219
$$ packed form
8185A12510j3781l6704n1778q3732K106J7617M4072N7849L2433j3339j3953j631
8173E1669K2590K7821Q5k0156j2667k9513K770o724j1458j5748L7902M689N393
8160E6653K8227M698j6390k322k095L5884J5368n6543k8535L3197j0534m8781
8148H827J2763p614P685J3714L5307L4015q051K292r614o4757k8460L1565J3292
8135D0964m3047l4503J3896N3423K9575j8207R180L7569m457l7892j0937K0300
8123E5864Q502K2234k526r435K0485J4905K1805j4484k5028k8129p061m607j9542
8110C2983J4837J1655J4114m384k860j666J6959j9729J3894L596p716K3703R66
8097I6352O038k7009k3904L937j5200R916J7081o407j2484J9165M1797k5953j6110
$$ plain form
8084 67219 52997 79900 112515 73224 45487 35272 51020 25221 -2234 9457 45986 58472
8072 58472 20667 20798 25807 24557 56756 77295 81260 98026 78922 62913 27164 39250 69243
8059 69243 49849 14102 -15066 8260 33569 49243 79345 83027 63553 91706 120628 156268
8047 156268 120257 100079 81285 77048 78652 39122 62022 58178 24891 -24142 4330 34317
8035 34317 58249 63965 106255 117775 137036 157392 116771 98806 66295 70763 85223 61776
8023 61776 48312 74318 108871 136249 143364 133840 96228 78422 124540 117394 104267 132203
8011 132203 117253 85336 106476 150376 175814 164682 168224 168312 132328 108723 122318 135503
7999 135503 142388 134627 109094 71330 12817 15452 42983 39847 65555 74743 91106 93015 74881
$$ packed form
8084F7219j4222K6903L2615l9291k7737j0215J5748k5799k7455J1691L6529J2486
8072E8472l7805J31N009j250L2199K0539L965J6766j9104j6009l5749J2086K9993
8059F9243j9394l5747k9168K3326K5309J5674L0102L682j9474K8153K8922L5640
8047A56268l6011k0178j8794m237J604l9530K2900l844l3287m9033K8472K9987
8035C4317K3932N716M2290J1520J9261K0356m0621j7965l2511M468J4460k3447
8023F1776j3464K6006L4553K7378P115r524l7612j7806M6118p146j3127K7936
8011A32203j4950l1917K1140M3900K5438j1132L542Q8l5984k3605J3595J3185
7999A35503O885p761k5533l7764n8513K635K7531l136K5708R188J6363J909j8134
$$ plain form
7986 74881 66350 56469 14077 31326 91276 123029 114086 80076 81838 96567 92690 89774 83417
7973 83417 44408 29454 32387 23801 23088 48577 63830 48413 72531 103070 68914 55207 39277
7960 39277 17478 49265 55843 31382 32372 42278 22818 22384 25640 50697 59270 79364 50518
7947 50518 66421 67032 46973 65853 87712 85078 80985 82529 70707 81847 82394 58954 45086
7934 45086 48973 24176 29819 -5210 26789 50402 36228 5714 14480 22875 51290 65386 77043
7921 77043 80388 74491 57621 44827 50630 22854 21806 7866 35411 40899 35507 62698 42571
7908 42571 45486 38609 49036 89954 68017 28791 47186 48558 16477 25334 37361 25731 36134
7895 36134 47646 74333 88215 47531 6773 15851 82081 100310 102208 86450 83388 96460
$$ packed form
7986G4881q531r881m2392J7249N9950L1753q943l4010J762J4729l877k916o357
7973H3417l9009j4954K933q586p13K5489J5253j5417K4118L0539l4156j3707j5930
7960C9277k1799L1787O578k4461R90R906j9460m34L256K5057Q573K0094k8846
7947E0518J5903O11k0059J8880K1859k634m093J544j1822J1140N47k3440j3868
7934D5086L887k4797N643l5029L1999K3613j4174l0514Q766Q395K8415J4096J1657
7921G7043L345n897j6870j2794N803k7776j048j3940K7545N488n392K7191k0127
7908D2571K915o877J0427M0918k1937l9226J8395J372l2081Q857J2027j1630J0403
7895C6134J1512K6687J3882m0684m0758R078O6230J8229J898j5758l062J3072
$$ plain form
7883 96460 81379 93459 90871 93929 77456 44384 65544 81500 57228 6840 9675 15730 5391
7870 5391 54332 70643 73486 81020 56912 13160 35865 68495 5221 -24345 -26057 -12467 -96
7857 -96 2003 -25706 -18921 1251 52762 42513 -489 -28283 -15919 23349 44787 64672 86729
7844 86729 57814 55756 26047 26957 54336 48597 37874 25303 33198 18492 -238 19501 33162
7831 33162 -7757 -35994 -40096 -78505 -76683 -32565 -41437 -51534 33152 68139 63522 83129 75936
7818 75936 72207 27614 13830 12867 34679 72284 74993 65803 38720 25391 -6108 -24784 9042
7805 9042 15016 -7506 -33611 -60399 -46668 -35817 -21128 3834 37716 20338 41680 52888
7793 52888 28925 35765 47515 32618 25946 63654 78360 77612 60492 32525 42811 61712 88536
$$ packed form
7883I6460j5081J2080k588L058j6473l3072K1160J5956k4272n0388K835O055j0339
7870E391M8941J6311K843P534k4108m3752K2705L2630o3274k9566j712J3590J2371
7857i6K099k7709O785K0172N1511j0249m3002k7794J2364L9268K1438J9885K2057
7844H6729k8915k058k9709R10K7379n739j0723j2571P895j4706j8730J9739J3661
7831C3162m0919k8237m102l8409J822M4118q872j0097Q4686L4987m617J9607p193
7818G5936l729m4593j3784r63K1812L7605K709r190k7083j3329l1499j8676L3826
7805I042N974k2522k6105k6788J3731J0851J4689K4962L3882j7378K1342J1208
7793E2888k3963O840J1750j4897o672L7708J4706p48j7120k7967J0286J8901K6824
$$ plain form
7780 88536 91860 68106 43609 16170 62206 76547 53282 6461 15240 22250 22178 41948 36708
7767 36708 20202 16866 -5299 -21715 -29156 -7908 16010 -14726 -45245 -59077 -29422 -32055
7755 -32055 -3651 21513 20462 14990 14617 7772 -11974 -44835 3482 33040 18249 32915 26339
7742 26339 29940 20811 -9927 8066 11992 -362 -21531 -49654 -52102 -22091 15036 24817 24577
7729 24577 2288 -27218 -25366 -65623 -109103 -104579 -60518 -46349 -55065 -63663 -60900 -33830 -35163
7716 -35163 -38470 -61726 -64256 -29819 18796 20504 -10369 -55171 -84953 -51263 -13440 19821
7704 19821 -9862 -12092 -11350 31600 47345 29347 28135 34807 70706 78932 67701 25868 -44524
7691 -44524 -8332 47056 78151 66057 4756 -36117 -37039 -14213 6665 -48608 -62354 -46910
$$ packed form
7780H8536L324k3754k4497k7439M6036J4341k3265m6821Q779P010p2J9770n240
7767C6708j6506l336k2165j6416p441K1248K3918l0736l0519j3832K9655k633
7755c2055K8404K5164j051n472l73o845j9746l2861M8317K9558j4791J4666o576
7742B6339L601r129l0738J7993L926j2354k1169k8123k448L0011L7127R781k40
7729B4577k2289k9506J852m0257m3480M524M4061J4169q716q598K763K7070j333
7716c5163l307k3256k530L4437M8615J708l0873m4802k9782L3690L7823L3261
7704A9821k9683k230P42M2950J5745j7998j212O672L5899Q226j1231m1833p0392
7691d4524L6192N5388L1095j2094o1301m0873r22K2826K0878n5273j3746J5444
$$ plain form
7679 -46910 -16895 -28289 -36006 -69758 -51527 -11659 -3447 2379 -5801 -44430 -38796 -4649 -9349
7666 -9349 -12827 -41142 -49577 -46818 -20551 18457 43954 53135 103685 92984 59723 12711 -5325
7653 -5325 -13644 -29004 -26598 14759 -10956 -35119 -45476 -47767 -20085 26572 31042 31015 34980 37947
7639 37947 15181 8192 -6672 35212 98142 98536 69216 56325 27634 -346 15074 14896 7012
7626 7012 8357 6163 -41847 -51167 -15805 4670 -15953 -46271 -64622 -55931 -15558 2434 -16086
7613 -16086 -25148 2744 6121 -28754 -9837 -34282 -22647 -9604 27434 39105 4159 -27619
7601 -27619 -35468 -23176 -12643 17450 35737 2104 15508 54065 34319 11893 3955 17183
7589 17183 -4875 4233 46541 40193 45667 58213 31967 7375 14517 194 -31110 -13974 -33093
$$ packed form
7679d6910L0015j1394p717l3752J8231L9868Q212N826q180l8629N634L4147m700
7666i349l478k8315q435K759K6267L9008K5497R181N0550j0701l3261m7012j8036
7653e325q319j5360K406M1357k5715k4163j0357k291K7682M6657M470k7L965K967
7639C7947k2766o989j4864M1884O2930L94k9320j2891k8691k7980J5420j78p884
7626G012J345k194m8010r320L5362K0475k0623l0318j8351Q691M0373J7992j8520
7613a6086r062K7892L377l4875J8917k4445J1635J3043L7038J1671l4946l1778
7601b7619p849J2292J0533L0093J8287l3633J3404L8557j9746k2426p938J3228
7589A7183k2058R108M2308o348N474J2546k6246k4592P142j4323l1304J7136j9119
$$ plain form
7576 -33093 -1184 4374 6674 17224 21905 -2006 -19887 -58858 19213 90102 90511 41973 13753
7563 13753 6685 -9598 15452 78867 71960 38459 3288 18205 47107 54777 68843 66656 62890
7550 62890 58391 58728 34220 -27402 -52682 -46835 -1254 15425 -11222 -25600 -33812 -31183 -1030
7537 -1030 42825 46337 -19325 -71437 -94191 -53821 -19085 -17870 2770 -5471 -979 -35684 -57459
7524 -57459 -51542 -82659 -78640 -7435 4091 12197 10051 26217 -31085 -70297 -75195 -68010 -57487
7511 -57487 -29771 -25730 -24258 -26446 -27988 -17683 13540 28221 36633 40854 13981 652 33425
7498 33425 5595 16029 35717 18294 921 17484 26573 35553 19754 -31917 -68438 -60692
7486 -60692 -72363 -49421 -26506 -27995 -24183 -36128 -10291 54302 35986 -2586 -27608 -5754
$$ packed form
7576c3093L1909N558K300J0550M681k3911j7881l8971P8071P0889M09m8538k8220
7563A3753p068j6283K5050O3415o907l3501l5171J4917K8902P670J4066k187l766
7550F2890m499L37k4508o1622k5280N847M5581J6679k6647j4378q212K629L0153
7537a030M3855L512o5662n2112k2754M0370L4736J215K0640q241M492l4705k1775
7524e7459N917l1117M019P1205J1526Q106k146J6166n7302l9212m898P185J0523
7511e7487K7716M041J472k188j542J0305L1223J4681Q412M221k6873j3329L2773
7498C3425k7830J0434J9688j7423j7373J6563R089Q980j5799n1671l6521P746
7486f0692j1671K2942K2915j489L812j1945K5837O4593j8316l8572k5022K1854
$$ plain form
7474 -5754 21724 10530 22032 15974 -50712 -85137 -69211 -57458 -17249 3268 -1549 35624
7462 35624 62666 57695 18849 -4421 9102 3599 -18654 -39011 -26528 -32654 35131 56773
7450 56773 40558 22838 23102 34324 40500 10666 21036 41848 35587 12319 -5798 -37722 -56495
7437 -56495 -29199 -8618 1313 17583 9886 -26435 -12171 -12169 2093 -30811 -61842 -59871 -76832
7424 -76832 -72527 -69177 -50074 -16629 -131 -4011 12023 5614 13825 -42570 -23496 -5477 -32466
7411 -32466 -53000 -69726 -33439 -4717 22904 18075 28932 17687 29635 40788 68792 72851
7399 72851 64529 64234 78866 76044 61187 40906 55056 77992 57927 14456 60334 41657 -13099
7386 -13099 -15710 -19867 5482 26030 6552 36030 43484 88157 121928 100992 63043 -22856
$$ packed form
7474e754K7478j1194J1502o058o6686l4425J5926J1753M0209K0517m817L7173
7462C5624K7042m971l8846k3270J3523n503k2253k0357J2483o126O7785K1642
7450E6773j6215j7720K64J1222O176k9834J0370K0812o261k3268j8117l1924j8773
7437e6495K7296K0581R931J6270p697l6321J4264KJ4262l2904l1031J971j6961
7424g6832M305L350J9103L3445J6498l880J6034o409Q211n6395J9074J8019k6989
7411c2466k0534j6726L6287K8722K7621m829J0857j1245J1948J1153K8004M059
7399G2851q322k95J4632k822j4857k0281J4150K2936k0065m3471M5878j8677n4756
7386a3099k611m157K5349K0548j9478K9478P454M4673L3771k0936l7949q5899
$$ plain form
7374 -22856 -52444 -28275 -6932 -17438 24329 46938 13491 -5647 -27308 -76439 -71528 -38879
7362 -38879 -37535 -47677 -4360 -15698 -65952 -60908 -20148 -25629 -5576 2124 11785 -20367 -80597
7349 -80597 -86195 -84188 -63653 -24799 -50527 -82825 -62126 -46798 -36466 -5471 -19551 -35432
7337 -35432 -49315 -26293 -14874 -2613 -19920 -28052 -45960 -19982 -23625 -23933 21767 22604 -4009
7324 -4009 -37594 -46871 -29948 -6157 10365 3609 -15050 58 20444 -12537 -36990 -10128
7312 -10128 38062 88281 87120 28903 20880 53185 95880 84536 41978 6740 19761 1569
7300 1569 -14001 4393 13518 -18456 -55190 -77817 -72340 -22015 15652 -1901 -24492 -61238
7288 -61238 -84095 -71757 -30096 3730 30114 23455 9525 8371 49934 39487 39376 38539 29140
$$ packed form
7374b2856k9588K4169K1343j0506M1767K2609l3447j9138k1661m9131M911L2649
7362c8879J344j0142M3317j1338n0254N044M0760n481K0053P700R661l2152o0230
7349h0597n598K007K0535L8854k5728l2298K0699J5328J0332L0995j4080j5881
7337c5432j3883K3022J1419J2261j7307q132j7908K5978l643l08M5700Q37k6613
7324d009l3585r277J6923K3791J6522o756j8659J5108K0386l2981k4453K6862
7312a0128M8190N0219j161n8217q023L2305M2695j1344m2558l5238J3021j8192
7300A569j5570J8394R125l1974l6734k2627N477N0325L7667j7553k2591l6746
7288f1238k2857J2338M1661L3826K6384o659j3930j154M1563j0447j11q37r399
$$ plain form
7275 29140 -1240 868 27902 46577 21710 -30209 -36538 -41000 -37532 -61930 -54747 -34766 -24614
7262 -24614 -61570 -72412 -49286 -23598 -60426 -50187 -4974 -5524 -10035 -9969 10194 34378 31524
7249 31524 41824 36731 27504 37635 28726 24926 4786 6008 4369 66762 71165 30909 38689
7236 38689 44488 30547 58570 103619 123161 112213 57416 71371 47779 -9938 -25250 -22550
7224 -22550 -25142 -14498 5111 27448 -4190 -3117 16096 6275 12220 13457 4795 15777 29577
7211 29577 35702 64774 66200 76294 42251 35122 69259 80895 15933 -26704 -13793 -4128 26771
7198 26771 19585 23440 18759 -5328 -10823 -31422 -16118 15896 50574 82126 31221 4660 28416
7185 28416 48197 18886 27988 -966 -34259 -56367 -97298 -126825 -107728 -67486 -9005 5313
$$ packed form
7275B9140l0380K108K7034J8675k4867n1919o329m462L468k4398P183J9981J0152
7262b4614l6956j0842K3126K5688l6828J0239M5213n50m511O6K0163K4184k854
7249C1524J0300n093r227J0131q909l800k0140J222j639O2393M403m0256P780
7236C8689N799j3941K8023M5049J9542j0948n4797J3955k3592n7717j5312K700
7224b2550k592J0644J9609K2337l1638J073J9213r821N945J237q662J0982J3800
7211B9577O125K9072J426J0094l4043p129L4137J1636o4962m2637J2911R665L0899
7198B6771p186L855m681k4087n495k0599J5304L2014L4678L1552n0905k6561K3756
7185B8416J9781k9311R102k8954l3293k2108m0931k9527J9097M0242N8481J4318
$$ plain form
7173 5313 11453 -1846 -18430 -30484 -27392 -5841 -7191 1600 25261 22844 32059 33398 30402 8041
7159 8041 -21552 120 -18209 -53219 -96744 -95790 -69093 -39524 -40588 -24342 -7869 16786 51710
7146 51710 58482 35410 9315 23934 -22214 -38014 541 25735 23510 3378 11597 -576
7134 -576 -22718 -4240 -37787 -40963 -9527 11841 41504 7555 19708 -16781 -62274 -48933
7122 -48933 -26184 -44429 -98021 -101260 -64251 -58764 -76514 -60750 -48432 -14949 -25244 -28642
7110 -28642 -59583 -33590 2252 11780 -6938 -66438 -57904 -42724 -60939 -40985 -15314 14509
7098 14509 35098 40876 31211 38690 34503 17003 6483 14693 11086 -22264 -49848 -58668 -45638
7085 -45638 -61197 -50619 -16600 -10436 -14121 -17365 -7770 15670 13955 -9672 -51696 -87534 -71466
$$ packed form
7173E313O140j3299j6584j2054L092K1551j350Q791K3661k417R215J339k996k2361
7159H041k9593K1672j8329l5010m3525R54K6697K9569j064J6246J6473K4655L4924
7146E1710O772k3072k6095J4619m6148j5800L8555K5194k225k0132Q219j2173
7134e76k2142J8478l3547l176L1436K1368K9663l3949J2153l6489m5493J3341
7122d8933K2749j8245n3592l239L7009N487j7750J5764J2318L3483j0295l398
7110b8642l0941K5993L5842R528j8718n9500Q534J5180j8215J9954K5671K9823
7098A4509K0589N778r665P479m187j7500j0520Q210l607l3350k7584q820J3030
7085d5638j5559J0578L4019O164l685l244R595K3440j715k3627m2024l5838J6068
$$ plain form
7072 -71466 -73161 -33433 6595 1609 11573 16176 -18722 -7242 12737 9995 621 34696 47935
7059 47935 34869 10891 22687 5192 -3366 6941 16449 37975 41797 10550 6757 27896 20415
7046 20415 39309 31550 1579 -3629 -11426 -8589 23060 25642 48768 54160 19438 -7543 -17939
7033 -17939 29628 62951 45905 9285 31735 42016 -20476 -60023 -53829 -50916 -36479 -17239
7021 -17239 -17481 -28925 -40486 -39912 -8818 2582 7951 16144 3883 3728 -3979 -34833 -38272 -32621
7007 -32621 -30643 -13034 -7206 5217 -16519 -37427 -17154 -5530 -9752 9197 1353 11095 -11258
6994 -11258 4132 28090 23866 33768 24044 -27937 -74723 -90997 -86926 -66837 -68250 -39968 -37284
6981 -37284 -79251 -96180 -86188 -59142 -32059 -33788 -26443 -226 11323 20636 21941 -11923 -28630
$$ packed form
7072g1466j695L9728M0028m986R964M603l4898J1480J9979k742r374L4075J3239
7059D7935j3066k3978J1796j7495q558J0307R508K1526L822l1247l793K1139p481
7046B0415J8894p759k9971n208p797K837L1649K582K3126N392l4722k6981j0396
7033a7939M7567L3323j7046l6620K2450J0281o2492l9547O194K913J4437J9240
7021a7239k42j1444j1561N74L1094J1400N369Q193j2261j55p707l0854l439N651
7007c2621J978J7609N828J2423k1736k0908K0273J1624m222J8949p844R742k2353
6994a1258J5390K3958m224R902r724n1981m6786j6274M071K0089j413K8282K684
6981c7284m1967j6929R992K7046K7083j729P345K6217J1549R313J305l3864j6707
$$ plain form
6968 -28630 -32304 -13396 -39260 -37417 -10134 -12628 -31158 -27032 -24021 -51177 -76949 -82014 -62131
6955 -62131 -38610 -29501 -41322 4271 30810 3118 -22503 -53324 -27058 14543 29181 32395
6943 32395 -20431 -42525 -25070 -16855 -27131 -12781 -32563 -56570 -5789 46902 53590 44233
6931 44233 7100 -15466 -14218 -32499 -17925 -4697 -17266 -20796 10160 -9456 20761 59012
6919 59012 27367 10521 11968 12739 -14641 -29116 1117 21529 49792 13166 -23956 -36137
6907 -36137 -15422 -8913 -1573 -6156 17298 -2590 -28913 -28263 -18104 -58580 -59084 -46144 -52077
6894 -52077 -46709 -47145 -3688 -4653 -14910 -6974 -9555 6247 12969 10092 17432 -8288 -67274 -50846
6880 -50846 -26902 -28055 -20463 -49710 -69982 -49709 -60494 -71475 -39936 -13236 -4115 -16647
$$ packed form
6968b8630l674J8908k5864J843K7283k494j8530M126L011k7156k5772n065J9883
6955f2131K3521R109j1821M5593K6539k7692k5621l0821K6266M1601J4638L214
6943C2395n2826k2094J7455Q215j0276J4350j9782k4007N0781N2691O688r357
6931D4233l7133k2566J248j8281J4574J3228j2569l530L0956j9616L0217L8251
6919E9012l1645j6846J447P71k7380j4475L0233K0412K8263l6626l7122j2181
6907c6137K0715O509P340m583K3454j9888k6323O50J0159m0476n04J2940n933
6894e2077N368m36M3457r65j0257P936k581J5802O722k877P340k5720n8986J6428
6880e0846K3944j153P592k9247k0272K0273j0785j0981L1539K6700R121j2532
$$ [...]
##END NTUPLES=NMR SPECTRUM
##END=
