##TITLE=Analysis number 319328
Compound Code cc 48904
Book Reference 468/65
Project Code adrs
Chemist Name colinb
##JCAMPDX= 6.0         $$ Bruker NMR JCAMP-DX V2.0
##DATA TYPE= NMR SPECTRUM
##DATA CLASS= NTUPLES
##ORIGIN= Bruker BioSpin GmbH
##OWNER= nmr
$$ XWIN-NMR		Version 3.5
$$ Wed May 10 14:02:46 2006 GMT Daylight Time (UT+1h)  MAYBRIDGE\nmr@NMR_250MHZ
##.OBSERVE FREQUENCY= 250.131544655141
##.OBSERVE NUCLEUS= ^1H
##.ACQUISITION MODE= SIMULTANEOUS (DQD)
##.ACQUISITION SCHEME= undefined
##.AVERAGES= 16
##.DIGITISER RES= 18
##SPECTROMETER/DATA SYSTEM= dpx250
##.PULSE SEQUENCE= zg30
##.SOLVENT NAME= CDCl3
##.SHIFT REFERENCE= (INTERNAL, CDCl3, 0, 16.522)
##AUDIT TRAIL= $$ (NUMBER, WHEN, WHO, WHERE, WHAT)
$$ ##TITLE= Audit trail, XWIN-NMR		Version 3.5
$$ ##JCAMPDX= 5.01
$$ ##ORIGIN= Bruker BioSpin GmbH
$$ ##OWNER= nmr
$$ C:\u/data/dgb/nmr/ADRS/4060/pdata/1/auditp.txt
$$ ##AUDIT TRAIL=  $$ (NUMBER, WHEN, WHO, WHERE, WHAT)
(   1,<2006-05-10 14:02:22.95 +100>,<MAYBRIDGE\nmr>,<NMR_250MHZ>,
      <created by zg, POWCHK disabled, PULCHK disabled
       configuration hash MD5:
       84 BC 41 DB A1 6E 1D 46 DA 25 12 A5 C1 ED C5 3A
       data hash MD5: 64K
       60 90 DA 69 04 54 BB 6F 65 A2 48 60 5A 8F 2B 2F>)
(   2,<2006-05-10 14:02:35.15 +100>,<MAYBRIDGE\nmr>,<NMR_250MHZ>,
      <Start of raw data processing
       ef LB = 0.3 FT_mod = 6 PKNL = 1 SI = 32K 
       data hash MD5: 32K
       44 DC 5C 40 D7 99 89 A9 3B 05 2D E8 C0 DC 93 7A>)
(   3,<2006-05-10 14:02:37.93 +100>,<MAYBRIDGE\nmr>,<NMR_250MHZ>,
      <apk 
       data hash MD5: 32K
       39 1F 55 4B 4B 54 E2 EC CF 07 1C 85 C5 4C 03 11>)
(   4,<2006-05-10 14:02:39.73 +100>,<MAYBRIDGE\nmr>,<NMR_250MHZ>,
      <abs ABSG = 5 
       data hash MD5: 32K
       F0 41 84 84 B4 7B 15 0D C3 2B 56 CA 1B 06 FB 3B>)
$$ ##END=
$$ 
$$ hash MD5
$$ 16 95 37 F0 FC 42 2D 3C A4 44 BB 9F 95 41 45 E9
##$RELAX= 
##$RELAX= 
##$RELAX= 
##$RELAX= 
##$RELAX= 
##$RELAX= 
##$RELAX= 
$$ Bruker specific parameters
$$ --------------------------
##$DU= <C:\u>
##$EXPNO= 4060
##$NAME= <ADRS>
##$PROCNO= 1
##$TYPE= <nmr>
##$USER= <dgb>
##$AMP= (0..31)
100 100 100 100 100 100 100 100 100 100 100 100 100 100 100 100 100 100 
100 100 100 100 100 100 100 100 100 100 100 100 100 100 
##$AQSEQ= 0
##$AQ_mod= 3
##$AUNM= <au_zg>
##$AUTOPOS= <38 >
##$BF1= 250.13
##$BF2= 250.13
##$BF3= 250.13
##$BF4= 250.13
##$BF5= 500.13
##$BF6= 500.13
##$BF7= 500.13
##$BF8= 500.13
##$BYTORDA= 1
##$CFDGTYP= 0
##$CFRGTYP= 5
##$CHEMSTR= <none>
##$CNST= (0..31)
1 1 145 1 1 1 1 1 1 1 1 1 1 1 1 1 1 1 1 1 1 1 1 1 1 1 1 1 1 1 1 1 
##$CPDPRG= <>
##$CPDPRG1= <>
##$CPDPRG2= <>
##$CPDPRG3= <>
##$CPDPRG4= <mlev>
##$CPDPRG5= <mlev>
##$CPDPRG6= <mlev>
##$CPDPRG7= <mlev>
##$CPDPRG8= <mlev>
##$CPDPRGB= <>
##$CPDPRGT= <>
##$D= (0..31)
0 1 0 0 0 0 0 0 0 0.06 0 0 0 0 0 0 0.0002 0 0 0 0 0 0 0 0 0 0 0 0 0 0 
0 
##$DATE= 1147266142
##$DBL= (0..7)
120 120 120 120 120 120 120 120 
##$DBP= (0..7)
150 150 150 150 150 150 150 150 
##$DBP07= 0
##$DBPNAM0= <>
##$DBPNAM1= <>
$$ [...]
##$SUBNAM7= <"">
##$SUBNAM8= <"">
##$SUBNAM9= <"">
##$SW= 20.6930455092707
##$SWIBOX= (0..15)
0 0 3 0 0 0 0 0 0 0 0 0 0 0 0 0 
##$SW_h= 5175.983436853
##$TD= 65536
##$TD0= 1
##$TE= 295.16
##$TE2= 300
##$TE3= 300
##$TEG= 300
##$TL= (0..7)
0 120 120 120 120 120 120 120 
##$TP= (0..7)
150 150 150 150 150 150 150 150 
##$TP07= 0
##$TPNAME0= <>
##$TPNAME1= <>
##$TPNAME2= <>
##$TPNAME3= <>
##$TPNAME4= <>
##$TPNAME5= <>
##$TPNAME6= <>
##$TPNAME7= <>
##$TPOAL= (0..7)
0.5 0.5 0.5 0.5 0.5 0.5 0.5 0.5 
##$TPOFFS= (0..7)
0 0 0 0 0 0 0 0 
##$TUNHIN= 0
##$TUNHOUT= 0
##$TUNXOUT= 0
##$USERA1= <user>
##$USERA2= <user>
##$USERA3= <user>
##$USERA4= <user>
##$USERA5= <user>
##$V9= 5
##$VALIST= <valist>
##$VCLIST= <CCCCCCCCCCCCCCC>
##$VD= 0
##$VDLIST= <DDDDDDDDDDDDDDD>
##$VPLIST= <PPPPPPPPPPPPPPP>
##$VTLIST= <TTTTTTTTTTTTTTT>
##$WBST= 1024
##$WBSW= 4
##$XGAIN= (0..3)
0 0 0 0 
##$XL= 0
##$YL= 0
##$YMAX_a= 306799
##$YMIN_a= -422680
##$ZGOPTNS= <>
##$ZL1= 120
##$ZL2= 120
##$ZL3= 120
##$ZL4= 120
##$ABSF1= 16.522
##$ABSF2= -4.171173
##$ABSG= 5
##$ABSL= 3
##$ALPHA= 0
##$AQORDER= 0
##$ASSFAC= 0
##$ASSFACI= 0
##$ASSFACX= 0
##$ASSWID= 0
##$AUNMP= <proc_1d>
##$AZFE= 0.1
##$AZFW= 0.1
##$BCFW= 0
##$BC_mod= 0
##$BYTORDP= 0
##$COROFFS= 0
##$CY= 12.5
##$DATMOD= 1
##$DC= 0
##$DFILT= <>
##$DTYPP= 0
##$F1P= 14.0000005364418
##$F2P= -0.99999901652339
##$FCOR= 0.5
##$FTSIZE= 32768
##$FT_mod= 6
##$GAMMA= 0
##$GB= 0
##$INTBC= 1
##$INTSCL= 1
##$ISEN= 128
##$LB= 0.3
##$LEV0= 0
##$LPBIN= 0
##$MAXI= 10000
##$MC2= 0
##$MEAN= 0
##$ME_mod= 0
##$MI= 0
##$NCOEF= 0
##$NC_proc= -5
##$NLEV= 6
##$NOISF1= 0
##$NOISF2= 0
##$NSP= 0
##$NTH_PI= 0
##$NZP= 0
##$OFFSET= 16.522
##$PC= 1
##$PHC0= 168.9747
##$PHC1= -0.6198468
##$PH_mod= 1
##$PKNL= yes
##$PPARMOD= 0
##$PSCAL= 4
##$PSIGN= 0
##$REVERSE= no
##$SF= 250.13
##$SI= 32768
##$SIGF1= 0
##$SIGF2= 0
##$SINO= 400
##$SIOLD= 32768
##$SREGLST= <1H.CDCl3>
##$SSB= 0
##$STSI= 32768
##$STSR= 0
##$SW_p= 5175.98343685301
##$SYMM= 0
##$S_DEV= 0
##$TDeff= 65536
##$TDoff= 0
##$TI= <Analysis number 999999
Compound Code 99
Book Reference 9
Project Code 9>
##$TILT= no
##$TM1= 0
##$TM2= 0
##$TOPLEV= 0
##$USERP1= <user>
##$USERP2= <user>
##$USERP3= <user>
##$USERP4= <user>
##$USERP5= <user>
##$WDW= 1
##$XDIM= 32768
##$YMAX_p= 433673788
##$YMIN_p= -488753
$$ End of Bruker specific parameters
$$ ---------------------------------
##NTUPLES= NMR SPECTRUM
##VAR_NAME=  FREQUENCY,     SPECTRUM/REAL,   SPECTRUM/IMAG
##SYMBOL=    X,             R,               I
##VAR_TYPE=  INDEPENDENT,   DEPENDENT,       DEPENDENT
##VAR_FORM=  AFFN,          ASDF,            ASDF
##VAR_DIM=   32768,         32768,           32768
##UNITS=     HZ,            ARBITRARY UNITS, ARBITRARY UNITS
##FACTOR=    0.157963299565203, 1,           1
##FIRST=     4132.6476996994, 0,             0
##LAST=      -1043.33573715361, 0,           0
##MIN=       -1043.33573715361, -488753,     0
##MAX=       4132.6476996994, 433673788,     0
$$ Real data points
##PAGE= N=1
##DATA TABLE= (X++(R..R)), XYDATA
$$ [...]
27853b267M941j2802J7721J31097m4853L4862J6711N311j5396j76872j16081j9395
$$ -2267 2674 -10128 7593 138690 93837 128699 145410 150721 135325 -41547 -157628 -177023
27841a77023P0668K11311N8158L8008K4284j16679R1142M2962p2352j11638O6608
$$ -177023 -106355 104956 163114 201122 225406 108727 199869 242831 170479 58841 125449
27830A25449K8573q6605o8165m0883K7529K1204K1699Q4066J14911n5484K6936
$$ 125449 154022 67417 -748 -41631 -14102 7102 28801 112867 227778 172294 199230
27819A99230q1586j24721M099K0057Q1846M0466r9825k7779J9735N104k5066j4183
$$ 199230 117644 -7077 -2978 17079 98925 139391 39566 11787 31522 36626 11560 -2623
27807b623Q2561K1662J1898n6745n0550m9211K0223O7788R1117j25636j46141
$$ -2623 79938 101600 113498 56753 6203 -43008 -22785 45003 136120 10484 -135657
27796a35657l2531l2938R2621J18166M2069N4839o172k8732N3042M178n0789l8865
$$ -135657 -168188 -201126 -108505 9661 51730 106569 100397 71665 124707 128885 78096 39231
27784C9231J4862j30846J4553O7960n1409J3794K235J03315M9608L4743j14670
$$ 39231 54093 -76753 -62200 5760 -45649 -31855 -29620 73695 123303 158046 43376
27773D3376j44527q652l3297P3286K9418p0438p6972J04616J61298K5661n5179
$$ 43376 -101151 -109803 -143100 -69814 -40396 -110834 -187806 -83190 78108 103769 48590
27762D8590m6552Q610K6560J0803o1003k0092O5137J14619M4249j35635j8418
$$ 48590 2038 10648 37208 48011 -12992 -33084 32053 146672 190921 55286 36868
27751C6868n3453m1373N3380k8554p3160l1161M7814p1325p6877J4846j778K0818
$$ 36868 -16585 -57958 -4578 -33132 -106292 -137453 -89639 -160964 -237841 -222995 -224773 -203955
27739b03955J41301K7479Q3640R3479k6236j40025n869M0169o1897J50552q100
$$ -203955 -62654 -35175 48465 141944 115708 -24317 -30186 9983 -51914 98638 90538
27728I0538n9757p0126O463l1365j20419o5260K5516j002k4905J34609L8190m973
$$ 90538 30781 -39345 -32882 -64247 -184666 -249926 -224410 -225412 -250317 -115708 -77518 -82491
27716h2491J56142q0895j8562k3494k0434j02283o4476m78J25589K03481J7368
$$ -82491 73651 -7244 -25806 -49300 -69734 -172017 -236493 -236971 -111382 92099 109467
27705A09467m727j0024J3610l0966J7274P0702j10540j45033O0553O996q918k10375
$$ 109467 104740 94716 108326 77360 94634 165336 54796 -90237 -29684 -22688 -31606 -241981
27693b41981N7820R2187n3114l7984j32260K9405J88736J15551O9469l0320k6514
$$ -241981 -184161 -91974 -145088 -183072 -315332 -285927 -97191 18360 87829 57509 30995
27682C0995q9621L3493L3239L9451Q4316L7300j4798l0044O4989j13849p6925
$$ 30995 -58626 -25133 8106 47557 131873 169173 154375 124331 189320 75471 -1454
27671a454K219Q6083j0869j20783o5585J42851J4168N18k3427j42N9390R835p693
$$ -1454 765 86848 75979 -44804 -110389 32462 46630 47148 23721 23579 82969 92804 85111
27658H5111p264L2162p0827k5685N7578Q7576l6474j85032j7300O6262O0465q091
$$ 85111 77847 110009 39182 13497 71075 158651 122177 -62855 -80155 -13893 46572 38481
27646C8481l9056J03647N0789q4791m6948p6133O0931Q1334l3404N238Q981k6580
$$ 38481 -575 103072 153861 69070 22122 -54011 6920 88254 54850 60088 69069 42489
27634D2489J60401p7141o3077P5717r9906j2516J8994J00514R2021j57323M6229
$$ 42489 202890 125749 62672 138389 38483 25967 44961 145475 237496 80173 126402
27623A26402L438M717n095n141p3181m9510L3765l9088o8968L4452N2306J6223
$$ 126402 129840 134557 129462 124321 51140 1630 35395 -3693 -72661 -38209 14097 30320
27611C0320j45038j30522M9029j72N1351J21587j4856j861L4259j01511n4257
$$ 30320 -114718 -245240 -196211 -196383 -145032 -23445 -38301 -40162 -5903 -107414 -161671
27600a61671P6966Q3877j8965O274j5686N15P6657J43058l4503o4927j0884L3
$$ -161671 -84705 -828 -19793 -13519 -29205 -28690 47967 191025 156522 91595 80711 80744
27588H0744J5793Q720J3678j66703K5196O1264r5795m0508J0964Q8653O3966j03227
$$ 80744 96537 105257 118935 -47768 -22572 38692 -57103 -97611 -86647 2006 65972 -37255
27576c7255o3751r8556j51640j832K41220K18056K8332l0084j02167r804L7707
$$ -37255 -101006 -199562 -351202 -353034 -111814 106242 134574 104490 2323 -7481 30226
27565C0226j3884q9071O5397L1719p456m3985o128k7376j23020N7605j7989o8363
$$ 30226 16342 -72729 -7332 24387 16931 -27054 -33182 -60558 -183578 -125973 -143962 -212325
27553b12325N9770k4433m144P7790K6641P5453o8393n1327k2945l0306O0239J86753
$$ -212325 -152555 -176988 -181132 -103342 -76701 -1248 -69641 -120968 -143913 -174219 -113980 72773
27541G2773k621r0259K4817N8675L1916p1863j17803N3646R2139m2029r688j56299
$$ 72773 70152 -20107 4710 63385 95301 23438 -94365 -40719 51420 9391 -297 -156596
27529a56596l1602j7359n4483J30035P0261p9954k398J27102K3841K992P3738
$$ -156596 -188198 -205557 -260040 -130005 -59744 -139698 -142096 -14994 8847 11839 85577
27518H5577j13515j1289l18q1518L3539K3662Q9803M7259p5574j05743k6165J1321
$$ 85577 -27938 -39227 -39545 -121063 -87524 -63862 25941 73200 -2374 -108117 -134282 -122961
27506a22961Q6566Q2693r6521p5331J37383M062j19230L0184R8503P5292J07203
$$ -122961 -36395 46298 -50223 -125554 11829 15891 -103339 -73155 25348 100640 207843
27495B07843Q2430j79083o1274M9356o2767n9109o8228m0675j2460P5136P5678
$$ 207843 290273 111190 49916 99272 36505 -22604 -90832 -131507 -143967 -68831 6847
27484F847M597k1486k480O4222J01773j3543n3557Q860m6779n0810L0368k3194
$$ 6847 11444 -10042 -12522 51700 153473 139930 86373 95233 48454 -2356 28012 4818
27472D818J10639L1744j0991l2889j23072p1412J62129J20278K2593n3330m2365
$$ 4818 115457 147201 136210 103321 -19751 -91163 70966 191244 213837 160507 118142
27461A18142N9760L278o6636j19125j7017P9227l1560n0427M5517J3107J26593
$$ 118142 177902 181180 114544 -4581 -21598 57629 26069 -24358 21159 34266 160859
27450A60859M5883o4878m1891j1463r8079j02567o6135n6330J19619J06413o2112
$$ 160859 206742 141864 99973 88510 -9569 -112136 -178271 -234601 -114982 -8569 -70681
27439g0681J0851J8567j24320P889J39343R8513J9312q1271l1088k4572J4023
$$ -70681 -59830 -41263 -165583 -157694 -18351 80162 99474 18203 -12885 -37457 -23434
27428b3434P2867p2890l3937O054M8882N1968m9199p1881L3973J04464l4143j5356
$$ -23434 49433 -23457 -57394 -51340 -2458 49510 311 -71570 -37597 66867 32724 17368
27416A7368L9259J30778J15611j10331j09332O7014j1696j8846o9902q2100j06130
$$ 17368 56627 187405 303016 192685 83353 150367 138671 119825 49923 -32177 -138307
27405a38307m9523N8938J54422N4590l2255j15300L1263J14930K0470O889j16404
$$ -138307 -187830 -128892 25530 80120 47865 -67435 -36172 78758 99228 106117 -10287
27394a0287l0012j0242P2267l702K3583m8139j04460M448Q3849R3721k4644j12390
$$ -10287 -40299 -50541 21726 18024 41607 -6532 -110992 -106544 -22695 71026 46382 -66008
27382f6008J69413J3853q0633k9215j06573P3258M7700r6871j00376J33484N9543
$$ -66008 103405 117258 36625 7410 -99163 -25905 21795 -75076 -175452 -41968 17575
27371A7575k9349l0122K9886K5814J24433j1452j14999k7596j2899m9272n598
$$ 17575 -11774 -41896 -12010 13804 138237 126785 11786 -15810 -28709 -77981 -83579
27360h3579O1599n1982n1414R985L0934k2776M360J35352O1107P4260n9235j98565
$$ -83579 -21980 -73962 -125376 -115391 -84457 -107233 -102873 32479 93586 167846 108611 -89954
27348h9954J26072L2416j35208p2570k230l5269l4300J70352N0359L7729J13936
$$ -89954 36118 68534 -66674 -139244 -141474 -176743 -211043 -40691 9668 47397 161333
27337A61333m1759p7680o5334J1159R576J2276m7676q7334M7149M7305m0354j843
$$ 161333 119574 41894 -23440 -12281 -2705 9571 -38105 -125439 -78290 -30985 -71339 -73182
27325g3182n5746r840k4497o8905P847J18873R8857P3691N0690l8339P5618l2601
$$ -73182 -128928 -138768 -163265 -232170 -224323 -105450 -6593 67098 117788 79449 155067 122466
27313A22466j11922j03203K7533J04047j5466n5323n4389n1338q492N4248K5056
$$ 122466 10544 -92659 -65126 38921 23455 -31868 -86257 -137595 -146087 -91839 -66783
27302f6783o2284J4752P2119j89j04700J23025J61451n1613k5386q3976j4461
$$ -66783 -129067 -114315 -42196 -42385 -147085 -24060 137391 85778 60392 -23584 -38045
27291c8045J52581Q6020l0618r8797l4988Q5392J0734q5160q6084j60908l9169
$$ -38045 114536 200556 169938 71141 36153 121545 132279 47119 -38965 -199873 -239042
27280b39042J48506J57326J0292N5467K9107l3854j17276r9790p1402j4022J34098
$$ -239042 -90536 66790 77082 132549 161656 127802 10526 -89264 -160666 -174688 -40590
27269d0590p9000j87608O9722J37580L8416M3187n2909Q6682J2423n8997N2662
$$ -40590 -119590 -307198 -237476 -99896 -61480 -18293 -71202 15480 27903 -31094 21568
27258B1568L2128o3925J8442p0560o832R4638l1425m1900k3152J0779J25203Q1665
$$ 21568 53696 -10229 8213 -62347 -69179 25459 -5966 -47866 -71018 -60239 64964 146629
27246A46629M6952m8343k2241J2154J6065n1193o9195J8562N5001j28120m8340
$$ 146629 193581 145238 122997 135151 151216 100023 30828 49390 104391 -23729 -72069
27235g2069J12572J69961L7242j26470N392J8628l0986q2281r7823J49468N9659
$$ -72069 40503 210464 247706 121236 126628 145256 114270 31989 -65834 83634 143293
27224A43293L4100K7730j28771m0054l9375N9350Q1436J2574q1112L9462J78602
$$ 143293 177393 205123 76352 36298 -3077 56273 137709 150283 69171 108633 287235
27213B87235l9451r1245m0237k051k9424j10920r5170M4420j7064j5755J76813
$$ 287235 247784 156539 116302 114251 84827 -26093 -121263 -76843 -93907 -109662 67151
27202F7151J40442o7719j22554n8019P4953N0029j37231j5812l0042P5484l2427
$$ 67151 207593 139874 17320 -40699 34254 84283 -52948 -68760 -98802 -23318 -55745
27191e5745J1923m657L0566R9790P602P074J57120O1571l9502r2921q5915p1775
$$ -55745 -43822 -48479 -17913 81877 89479 96553 253673 315244 275742 182821 96906 25131
27179B5131j19231J519N5714R1436J3276j9306J6821j660o9684N9377j12242l8323
$$ 25131 -94100 -92581 -36867 54569 67845 48539 65360 63700 -5984 53393 -58849 -97172
27167i7172l3025L0164L0081J2323o8191j9880n3217j2808J4080J30288Q5014
$$ -97172 -130197 -100033 -69952 -57629 -125820 -145700 -198917 -211725 -197645 -67357 17657
27156A7657n6528n496k0363N5259Q2382O0140j47867j05417O8053J66245J13352
$$ 17657 -38871 -44367 -64730 -9471 72911 133051 -14816 -120233 -52180 114065 227417
27145B27417m4809j26314q8556J7411O3482j3218J6537Q5331m4722j14688r8696
$$ 227417 182608 56294 -32262 -14851 48631 35413 51950 137281 92559 -22129 -120825
27134a20825J40418J41722O7271q4152j43749J1446l9048p5984l7514Q157J2054
$$ -120825 19593 161315 228586 144434 685 12131 -26917 -102901 -140415 -132258 -120204
27123a20204p304Q7721N5162R4121K4742j84788r4239O8092R6631J08617J6951
$$ -120204 -127508 -39787 15375 109496 134238 -50550 -144789 -76697 19934 128551 145502
27112A45502r4962r9154n1871J22337l05l7565Q3318J59259j9374j47669j49359
$$ 145502 50540 -48614 -100485 21852 21547 -16018 67300 226559 207185 59516 -89843
27101h9843N3647K0387j1671j03809p8026l8822K05319O6263j02987o7446q0400
$$ -89843 -36196 -15809 -27480 -131289 -209315 -248137 -42818 23445 -79542 -146988 -227388
27090b27388J33256K8801o5169m9805R8191J39302M9247m4494j11234p0826k0282
$$ -227388 -94132 -65331 -130500 -180305 -82114 57188 106435 61941 -49293 -120119 -140401
27079a40401R1656O7901m3788J08627n5271j69546k7570o5619O2347J23531K990
$$ -140401 -48745 19156 -24632 83995 28724 -140822 -168392 -234011 -171664 -48133 -45143
27068d5143j22654N74P1908J231J93962K2654j24982o4979P2635o003q5924k7120
$$ -45143 -167797 -167223 -95315 -94084 99878 122532 -2450 -67429 5206 -797 -86721 -113841
27056a13841L4852m034k9596J5622J33248R2176m4346k9661r781j6495p5351j24591
$$ -113841 -78989 -83023 -112619 -96997 36251 128427 84081 54420 44639 28144 -47207 -171798
27044a71798o784Q2933J2497p5238M9538O4708r604N1595R257n1451N9818Q0106
$$ -171798 -178582 -95649 -83152 -158390 -108852 -44144 -53748 -2153 7104 -44347 15471 95577
27032I5577j09068j23217l2310K2800n555M0425j5341m1644R8235M926P600j6021
$$ 95577 -13491 -136708 -169018 -146218 -151773 -111348 -126689 -168333 -70098 -65172 -57572 -73593
27020g3593P4281q8941K2325N2258j8390j8990k6760r337R6121O9799m9441l3083
$$ -73593 688 -88253 -65928 -13670 -32060 -51050 -77810 -87147 8974 78773 29332 -3751
27008c751j2661Q623m1642O3568M2384k9414j8030n0223J9254K6368l0213p3738
$$ -3751 -16412 -7789 -49431 14137 56521 27107 9077 -41146 -21892 4476 -25737 -99475
26996i9475j8278R5815R577K264j9469R0568O2918q5274j52063Q979K4919k2335
$$ -99475 -117753 -21938 -12361 -10097 -29566 61002 123920 38646 -113417 -104438 -79519 -101854
26984a01854L8881P7894M8978L3654O1318j2676j02952j6099L3305Q2434p1071
$$ -101854 -62973 14921 63899 97553 158871 146195 43243 27144 60449 142883 71812
26973G1812j28626P5683N9562l1087J06724Q2314J1244p2008J2795l9483Q4989
$$ 71812 -56814 18869 78431 47344 154068 236382 247626 175618 188413 148930 233919
26962B33919j92725j07528J33604J75965k5741p8747R243n6664p5207N8152J01778
$$ 233919 41194 -66334 67270 243235 217494 138747 147990 91326 16119 74271 176049
26951A76049k642n6796q5602M623j14044n8207k8057J8128R0175J2396P492J05482
$$ 176049 173407 116611 31009 35632 -78412 -136619 -164676 -146548 -56373 -43977 -36485 68997
26939F8997l3653m5240P2394m6615J5753M6851o2061R3136m8077o3680n6516k0248
$$ 68997 35344 -9896 62498 15883 31636 78487 16426 109562 61485 -2195 -58711 -78959
26927g8959J27019J6001o1530K7517J2324O1235J7219r3785r7959M452O9689p6697
$$ -78959 48060 64061 2531 30048 42372 103607 120826 27041 -70918 -66466 3223 -73474
26915g3474J06173L8622j72669M136J23594N7909R890P9575o7767n9303r5996
$$ -73474 32699 71321 -101348 -97212 26382 84291 94181 173756 105989 46686 -49310
26904d9310O6816J706N8015l7326J2399l3159p7876m9741Q4906o555m2207j3324
$$ -49310 17506 19212 77227 39901 52300 19141 -58735 -108476 -23570 -30125 -72332 -85656
26892h5656P5980K06417j28248N0310R9451p8657p4494q1189J19633j1233j41194
$$ -85656 -9676 196741 68493 118803 218254 139597 65103 -16086 103547 92314 -48880
26881d8880k5260K737P0655R9681M475k10647j23173N5657J72464L5750M85O8426
$$ -48880 -74140 -71403 -748 98933 103408 -107239 -230412 -174755 -2291 33459 33944 102370
26869A02370N7428j06807J4977P6457r4796r3344p1392J0846p2185r9740o2695
$$ 102370 159798 52991 67968 144425 49629 -43715 -115107 -104261 -176446 -276186 -338881
26858c38881J22741K26873M9485j08915l9971J74898N2415j17784Q275j4500O19
$$ -338881 -216140 10733 60218 -48697 -88668 86230 138645 20861 29136 14636 15255
26847A5255J8706J8832L5015N7018j7439l6260p0925J5353J03578p1504j21578
$$ 15255 33961 52793 87808 144826 127387 91127 20202 35555 139133 67629 -53949
26836e3949Q3013l30j3607J00565l6054q8853j505P9549M4854J46714M1735m4130
$$ -53949 29064 28734 15127 115692 79638 -9215 -10720 68829 113683 260397 302132 258002
26824B58002j85869L3977K7209m5384r2106q8259o0740K5118L4573J7862J2698
$$ 258002 72133 106110 133319 87935 -4171 -92430 -153170 -128052 -93479 -75617 -62919
26813f2919m4146K2026R9057P0437p5357q4936J6393p7891O639J43721L7312k3425
$$ -62919 -107065 -85039 14018 84455 9098 -75838 -59445 -137336 -130697 13024 50336 26911
26801B6911n0980j38406m2783O5501R6888K2798m7595n006J53953P0190o7896
$$ 26911 -24069 -162475 -205258 -139757 -42869 -20071 -67666 -72672 81281 151471 83575
26790H3575m7720o7140k914Q7434J06879Q2882p1605p2936j38734r1080l1601
$$ 83575 35855 -31285 -34199 53235 160114 242996 171391 98455 -40279 -131359 -162960
26779a62960k1239K5569N0787O766n2797r8683M1142P0079R5601J21264K572o2221
$$ -162960 -184199 -158630 -107843 -101077 -153874 -252557 -211415 -141336 -45735 75529 78101 15880
26767A5880l0089m7961k13484N0060N4030J11336J42081k6609j10636l1254J49718
$$ 15880 -14209 -62170 -275654 -225594 -171564 -60228 81853 55244 -55392 -86646 63072
26756F3072O4607K1953P5083n0012N581j13724j14651j6271k9012o62n5462P6323
$$ 63072 127679 149632 224715 174703 180284 66560 -48091 -64362 -93374 -94036 -149498 -73175
26744g3175J18645Q1276m0201n9812k4895K9673J880o4543k679m8209k7338R8473
$$ -73175 45470 126746 86545 26733 1838 31511 33391 -31152 -33831 -82040 -109378 -10905
26732a0905m3362l5495N720l1605J21157Q2375J4238J0526R0005o410m7412p0681
$$ -10905 -54267 -89762 -84042 -115647 5510 87885 102123 112649 202654 196244 148832 78151
26720G8151q7766K2551K2882K0117K2003k1560R3704Q4306o4086n7074J9900N7468
$$ 78151 -9615 12936 35818 55935 77938 56378 150082 234388 170302 113228 133128 190596
26708A90596n2518M6145M0418n9545M790m4572M7029o1020K3518l6341N7568o6833
$$ 190596 138078 184223 224641 165096 169886 125314 172343 111323 134841 98500 156068 89235
26696H9235m4930k6982j08197p8267J33633m1933o8032M4634J0108m8039n4175
$$ 89235 44305 17323 -90874 -169141 -35508 -77441 -145473 -100839 -90731 -138770 -192945
26685a92945J06013J32090j6479k6683K2513l7312M9158j1748M7716J15689J4384
$$ -192945 -86932 45158 28679 1996 24509 -12803 36355 24607 72323 188012 202396
26674B02396j58639j48019l7816o1759J358j16876L3170K06997J94941n1779N5174
$$ 202396 43757 -104262 -142078 -203837 -202479 -319355 -286185 -79188 115753 63974 119148
26663A19148q35p9941j30572J1286P867p0758m1335P3481Q6154l1136M794k8187
$$ 119148 118313 38372 -92200 -80914 -73047 -143805 -185140 -111659 -25505 -56641 -51847 -80034
26651h0034j8270J15113Q9191p0539j01463l477J22673l0368j26460J55668J25097
$$ -80034 -98304 16809 106000 35461 -66002 -69479 53194 22826 -103634 52034 177131
26640A77131M7706r1844m4639J9065n7767M065p699r0185k2864M1673Q5463m4554
$$ 177131 224837 132993 88354 107419 49652 53717 46018 -44167 -67031 -25358 60105 15551
26628A5551m4857J44848m2109j07714m465j28273o5534Q213O8831N2067n4671
$$ 15551 -29306 115542 73433 -34281 -38746 -167019 -232553 -224340 -155509 -103442 -158113
26617a58113j5501P3766L5667k3487o7619L6457p7920P8277J11070K9259N0128
$$ -158113 -173614 -99848 -64181 -87668 -155287 -118830 -196750 -118473 -7403 21856 71984
26606G1984j28513q91J21557K5492m6051Q3337l2748r3796O001P3669M0087O2074
$$ 71984 -56529 -57420 64137 89629 43578 126915 94167 371 6372 80041 120128 182202
26594A82202q3948q341M7552j9532p9114j9054K4446j22203p4043J46756R2988
$$ 182202 98254 89913 137465 117933 38819 19765 44211 -77992 -152035 -5279 87709
26583H7709l5214p9098j2104L6885J05600P157o1836k0845L3896K4060j07337
$$ 87709 52495 -26603 -38707 -1822 103778 110935 49099 28254 62150 86210 -21127
26572b1127M553K0237K3004j2619J56844P7136l3253n9602l9588q902J0230q468
$$ -21127 -16574 3663 26667 14048 170892 248028 214775 155173 115585 106683 116913 108445
26560A08445j21272o8624O3710J57226K0074p2576l6639M9838M1559n221L1953
$$ 108445 -12827 -81451 -17741 139485 159559 86983 50344 100182 141741 136520 168473
26549A68473J9823m668j01615l3056K525j4097l3157N0395j00625m6142L7966
$$ 168473 188296 183628 82013 48957 51482 37385 4228 54623 -46002 -92144 -54178
26538e4178k3896L643M8451k5429J06728N8457k960J2712q4529m3497L1466M5111
$$ -54178 -78074 -74431 -25980 -51409 55319 113776 110816 123528 38999 -4498 26968 72079
26526G2079m0513r417N4556M7078n8646m2531J04232j28596n0601M6373m3361
$$ 72079 31566 22149 76705 123783 65137 22606 126838 -1758 -52359 -5986 -49347
26515d9347q7174j00097R1907N074k5382k7394L4157L7776O1492N2566m0507q9971
$$ -49347 -136521 -236618 -144711 -139637 -165019 -192413 -158256 -120480 -58988 -6422 -46929 -136900
26503a36900j5149N9397N641p938M7922K1163r0745K4162Q462M4410L0230R4653
$$ -136900 -152049 -92652 -87011 -94949 -47027 -25864 -116609 -92447 -83985 -39575 -9345 85308
26491H5308L045O7337k6854o4167j47946j1135M9288J2548N3221M7870l505p094
$$ 85308 88353 155690 128836 64669 -83277 -94412 -45124 -32576 20645 68515 65010 57916
26479E7916K0078Q0812N7409j38093K1359l4982K8897j29881n6101P9226K4689
$$ 57916 77994 158806 216215 78122 99481 64499 93396 -36485 -92586 -13360 11329
26468A1329M9870J18519k4770l5581J4293q840n348M8837k8595O2122k9213O1510
$$ 11329 61199 179718 154948 119367 133660 124820 119472 168309 139714 201836 172623 234133
26456B34133M5957q6788p2012k4961k5900k3525l2973l5375N0850R6934m283j32014
$$ 234133 280090 193302 121290 96329 70429 46904 13931 -21444 29406 126340 122057 -9957
26444i957n7639P1564n7889Q0847R8577k8510j41820p7020j48211j8464R7637
$$ -9957 -67596 3968 -53921 26926 125503 96993 -44827 -121847 -270058 -288522 -190885
26433a90885J09827l6483n4969Q5013O0146N3863P8927O4455j9695Q040J07593
$$ -190885 -81058 -117541 -172510 -87497 -27351 26512 105439 169894 150199 158239 265832
26422B65832p6479l7907K503K7022p325n6477K8746K2847j02675r4918j9009m2618
$$ 265832 189353 151446 153949 180971 173646 117169 145915 168762 66087 -28831 -47840 -90458
26410i0458l229R4733r7981P5316N7329Q0914j44175o3437j0189J6734R7368J36694
$$ -90458 -93687 1046 -96935 -21619 35710 116624 -27551 -90988 -101177 -84443 12925 149619
26398A49619J26340p7991j09130j05063J7210J5301K3449O533j27577Q324R8764
$$ 149619 275959 197968 88838 -16225 985 16286 39735 46268 -81309 -72985 25779
26387B5779K5518q1878o991L1089j0581k4223K2328N6527J03369J3250R2801k4235
$$ 25779 51297 -30581 -37572 -6483 -17064 -41287 -18959 37568 140937 154187 246988 222753
26375B22753j55584j3188J38790J57922n8907j41715j03589O600J3397O568l2133
$$ 222753 67169 53981 192771 350693 291786 150071 46482 53082 66479 73047 40914
26364D0914p2236P545L4966M2547j07228j09266m2388K6948K9402Q932R1031r7307
$$ 40914 -31322 -23777 11189 53736 -53492 -162758 -205146 -178198 -148796 -139864 -48833 -146140
26352a46140O6595Q3934M1515l1062k3477j72428l0560N2087O3033N0801K3479
$$ -146140 -79545 4389 45904 14842 -8635 -181063 -211623 -159536 -96503 -45702 -22223
26341b2223j29158o422N0725N981P2387J4940n5617J7519J40619L9675K2399n4460
$$ -22223 -151381 -157803 -107078 -101097 -28710 -13770 -69387 -51868 88751 128426 150825 96365
26329I6365j14463n5884K6925R2898K6360R662m3362Q067K9106M0142K7592K5550
$$ 96365 -18098 -73982 -47057 45841 72201 81863 38501 46568 75674 115816 143408 168958
26317A68958k5777j6236p9561r8831l9784K7495P5640j0966o1487j45789J3122
$$ 168958 143181 126945 47384 -51447 -91231 -63736 11904 938 -60549 -206338 -193216
26306a93216N828k4114N9378K9118j1915M0339j4461p9130Q7114M8634J02114
$$ -193216 -187388 -211502 -152124 -123006 -134921 -94582 -109043 -188173 -101059 -52425 49689
26295D9689L8257p8379n3365p3595P5628N9245n12j37461l9952J47365L6708r527
$$ 49689 87946 9567 -43798 -117393 -41765 17480 16968 -120493 -160445 -13080 23628 14101
26283A4101J04452K9543J9859O4264K7952l1128r5011q5397M1577p0933n8408
$$ 14101 118553 148096 167955 232219 260171 229043 134032 48635 90212 19279 -39129
26272c9129k9497l3572M3644O5096M7360j47944L1045J22573M9491l1720k2158
$$ -39129 -68626 -102198 -58554 6542 53902 -94042 -62997 59576 109067 77347 55189
26261E5189K451J6639K5184n2468L9678L2847j20454J8266k0258L5619L6707n722
$$ 55189 57640 74279 99463 46995 86673 119520 -934 17332 -2926 32693 69400 63678
26249F3678j05788q0655R1310J33682O3663p3412M4269O6621p3882j91560j2902
$$ 63678 -42110 -122765 -31455 102227 165890 92478 136747 203368 129486 -62074 -74976
26238g4976J5846p9659k8348J32726J411m5741q506M1783o1885K7537N3171j1758
$$ -74976 -59130 -138789 -167137 -34411 -33000 -78741 -87247 -45464 -107349 -79812 -26641 -38399
26226c8399K9224j3481r1279R7926M2529J163O4095j3627j27222J3612O6020O0211
$$ -38399 -9175 -22656 -113935 -16009 26520 27683 91778 78151 -49071 -35459 30561 90772
26214I0772L0315O9398R070j09797j91789P1057R4851k2623j1160k045m2118n3279
$$ 90772 121087 190485 199555 89758 -102031 -30974 63877 41254 30094 28049 -14069 -67348
26202f7348n6424o3915O8710J38O4077k0585J00594N9699m605m3397K8904l8750
$$ -67348 -123772 -187687 -118977 -118839 -54762 -75347 25247 84946 80341 36944 65848 27098
26190B7098q8563k6160j5626N9770J36665J32833j7496j69471r2899N57N3853
$$ 27098 -61465 -87625 -103251 -43481 93184 226017 208521 39050 -53849 -53292 561
26179E61L3390Q3574k70j867q3007K902O1108r7923j90192o4106J56037P7854
$$ 561 33951 117525 117255 115388 32381 35283 96391 -1532 -191724 -255830 -99793 -21939
26167b1939L6013j2241J19388Q2642j10771j14485N4748j5974q985p018K3508
$$ -21939 14074 1833 121221 203863 93092 -21393 33355 17381 8396 1378 24886
26156B4886j5344L362o300p3783l0845J060j4273J60358L7739l8222L4472j885
$$ 24886 9542 12904 6604 -67179 -98024 -96964 -111237 49121 86860 48638 83110 81225
26144H1225J8991j32795K0454l616J1967M8813k4747r7465J0836M5138L4376L107
$$ 81225 100216 -32579 -12125 -15741 -3774 45039 20292 -77173 -66337 -21199 13177 16284
26132A6284q4048j11150M4223J88499N7626m9621o2379Q1775L6177l8929q995
$$ 16284 -67764 -178914 -134691 53808 111434 61813 -566 81209 117386 78457 69462
26121F9462r8446M861K473r2598O2732o0311l1226k8449M5318P644N3513j5023
$$ 69462 -28984 -24123 -21650 -114248 -51516 -111827 -143053 -171502 -126184 -118540 -65027 -80050
26109h0050P790Q4253k7754N460j2636n2289J05M3649p879N1318Q6095M5780o1389
$$ -80050 -72260 11993 -15761 -10301 -22937 -75226 -75121 -31472 -39351 11967 98062 143842 82453
26096H2453r2598M0231j8312n6847j01320K069m999J1228l162K6009k5358J1416
$$ 82453 -10145 30086 11774 -45073 -146393 -144324 -149323 -138095 -141257 -115248 -140606 -129190
26084a29190n4888o1681N9701O3788R7950Q0417m3004j3154j4945o7763K7544
$$ -129190 -184078 -245759 -186058 -122270 -24320 56097 13093 -61 -15006 -82769 -55225
26073e5225J3598o2028K1695Q8140j31984p1544K744K1641m9167q779K0013L7458
$$ -55225 -41627 -103655 -81960 6180 -125804 -197348 -194604 -172963 -222130 -230909 -210896 -173438
26061a73438O5104J27225l7022k3412L7001o5059M5307J5330L2152J30956k1097
$$ -173438 -108334 18891 -18131 -41543 -4542 -69601 -24294 -8964 23188 154144 133047
26050A33047m7040r0480K1700K0556k2856j1132P9564q3272K2339k2168N4746
$$ 133047 86007 -4473 17227 37783 14927 3795 83359 87 22426 258 55004
26039E5004m7134q0968j7238Q487J83570Q7546o1308l3722O213q2143j2501L3904
$$ 55004 7870 -73098 -90336 -81849 101721 189267 127959 94237 100450 18307 5806 39710
26027C9710m8152J18687R7450J5518J1298o1723k726n7296p9533M2593J04083
$$ 39710 -8442 110245 207695 223213 234511 172788 170062 112766 33233 75826 179909
26016A79909l6709m6088M4584j86836j05159N734J19653P0182r1993L8144J23496
$$ 179909 143200 97112 141696 -45140 -150299 -144565 -24912 45270 -46723 -8579 114917
26005A14917M742k8841K9624p7895q8455l544N5655J13523J6315q8084M8069q764
$$ 114917 119659 90818 120442 42547 -45908 -49452 6203 119726 136041 47957 96026 87262
25993H7262O9042n4116j39524j38394J10156R9229K9519l99j26703M480J26630
$$ 87262 156304 102188 -37336 -175730 -65574 33655 63174 62775 -63928 -59448 67182
25982F7182P8348p2388j9071p4028k2105o3686j8451N0451j9039k4632Q3096J6101
$$ 67182 145530 73142 54071 -19957 -42062 -105748 -124199 -73748 -92787 -117419 -34323 -18222
25970a8222J4355q4763N1402N9871N2404P21j17844o6300n4183l2376N6325J26013
$$ -18222 -3867 -88630 -37228 22643 75047 75768 -42076 -108376 -162559 -194935 -138610 -12597
25958a2597k5644j49729K0481K1192k9257J73034N6771o2260m9067n5075J710
$$ -12597 -38241 -187970 -167489 -146297 -175554 -2520 54251 -8009 -57076 -112151 -110441
25947a10441Q7408Q6660L8556j9549P327L5363n104o6285N8073n0368J4995K0720
$$ -110441 -23033 63627 102183 82634 89961 125324 120220 53935 112008 61640 76635 97355
25935I7355J13369m764n72R446K6701j6918j31544n3831O5369M8377r0543m2999
$$ 97355 210724 205960 205388 214834 241535 224617 93073 39242 104611 152988 62445 19446
25923A9446J6164n9213j8819O5064L7340m2923J3843j14691o8005O0336R6263
$$ 19446 35610 -23603 -42422 22642 59982 17059 30902 -83789 -151794 -91458 4805
25912D805M6862L3590k9750k8829L2196P3190k3502p1720j61343J8395O1723q9238
$$ 4805 51667 85257 55507 26678 58874 132064 108562 36842 -124501 -106106 -44383 -133621
25900a33621N8558J31144k0662j49750O5508P4345Q067L8679l2500l9775m6976
$$ -133621 -75063 56081 35419 -114331 -48823 25522 33589 72268 39768 -7 -46983
25889d6983N5967l8163m3428O1540J23298q86o5763j72264k8923P5437Q5057n8556
$$ -46983 8984 -29179 -72607 -11067 112231 111345 45582 -126682 -155605 -80168 4889 -53667
25877e3667j6096p0678l2803J2357Q6840J32068R3977l9083j21984k220J5896
$$ -53667 -69763 -140441 -173244 -160887 -74047 58021 151998 112915 -9069 -11289 4607
25866D607K3923N9522M7995M7125J8227r469j10951j61471r4636l3689M2881l9417
$$ 4607 28530 88052 136047 183172 201399 191930 80979 -80492 -175128 -208817 -165936 -205353
25854b05353O8943J05847O0687q200k1208j04105J9657J34240O8152l4219n0l6819
$$ -205353 -136410 -30563 30124 21924 716 -103389 -83732 50508 118660 84441 84391 47572
25842D7572n3741k4316q87Q5349n6289j69889n8937M9095R2074l3274j3191P3493
$$ 47572 -6169 -30485 -31372 53977 -2312 -172201 -231138 -182043 -89969 -123243 -136434 -62941
25830f2941j15729k4571K5559J75N1049Q1231K4202j05023q8255J19028k8505
$$ -62941 -178670 -203241 -177682 -177507 -126458 -45227 -21025 -126048 -214303 -95275 -123780
25819a23780K2601J70874n5582q8208O1892K385L9184q0810J4028K8101M3010
$$ -123780 -101179 69695 14113 -74095 -12203 -9818 29366 -51444 -37416 -9315 33695
25808C3695n8111J05146J9630l5993j1049p5557J492L4106R3126j13270o5576
$$ 33695 -24416 80730 100360 64367 53318 -22239 -20747 13359 106485 -6785 -72361
25797g2361O9506O7060K4504j23032r2567J5646K5357N2595M1848k8324k3212
$$ -72361 -2855 64205 88709 -34323 -126890 -111244 -85887 -33292 8556 -19768 -42980
25786d2980O7604J1125K5956L0284q6845j1171o9424o8870J23813R9939n9584
$$ -42980 24624 35749 61705 91989 5144 -6027 -75451 -144321 -20508 79431 19847
25775A9847l0502k569o542L0100j01539N1861k250m1158R5566j6539j21536M3001
$$ 19847 -10655 -13224 -19766 10334 -91205 -39344 -41594 -82752 12814 -3725 -125261 -82260
25763h2260N6412P6602P0046k2707j5021o4980j33113K4525J09431J25004M6191
$$ -82260 -25848 50754 120800 98093 83072 18092 -115021 -90496 18935 143939 190130
25752A90130n7182j24261j42414J12279k3940j70658J154J45883J76316N6839
$$ 190130 132948 8687 -133727 -21448 -45388 -216046 -214892 -69009 107307 164146
25742A64146q4288p5456l2145k3862J90248R3575r6017j654l8275m3301K774l5904
$$ 164146 79858 4402 -27743 -51605 138643 232218 136201 134547 96272 52971 55745 19841
25730A9841j20947J1537J04065j57180o8117J00525R546L5426M4002k7671o6748
$$ 19841 -101106 -89569 14496 -142684 -210801 -110276 -100730 -65304 -21302 -48973 -115721
25719a15721r3832K4207O3042J41878J89579p114o5030r2495p6626O2940J60034
$$ -115721 -209553 -185346 -122304 19574 209153 202039 137009 44514 -32112 30828 190862
25708A90862l6863j88762o5808j14100N5968Q2532O7111N0328N9332n375l6467
$$ 190862 153999 -34763 -100571 -214671 -158703 -76171 -9060 41268 100600 95225 58758
25697E8758p8974o7385M0170p9798O5707K4223m4419L8464J71985l838l4787M6854
$$ 58758 -20216 -87601 -47431 -127229 -61522 -37299 -81718 -43254 128731 124893 90106 136960
25685A36960j17695N6449j1516O7363m047j32547k0038o8651N289P162j4931M3440
$$ 136960 19265 75714 64198 131561 127514 -5033 -25071 -93722 -88433 -81271 -96202 -52762
25673e2762L3r5671J4655r807p4994n775J8985N0681O4295m0485O5743j13539
$$ -52762 -52729 -148400 -133745 -143552 -218546 -224321 -205336 -154655 -90360 -130845 -65102 -178641
25661a78641k9441R0136j3130L869P7177J50812L344j03419n8165P824N106o8224
$$ -178641 -208082 -117946 -131076 -127207 -50030 100782 104126 707 -57458 -49634 -44528 -112752
25649a12752j07587m8273Q7540J4417n504k938Q6911M7000K3022J28801N6792
$$ -112752 -220339 -268612 -181072 -166655 -172159 -175097 -88186 -41186 -18164 110637 167429
25638A67429m816j10980m8524k6731o253j5121L0315q10L1181Q128j21947K0836
$$ 167429 162613 51633 3109 -23622 -29875 -44996 -14681 -15491 15690 23818 -98129 -77293
25626g7293Q0869m0519j5446k3328K11417J60934j1349M1416r2169q5156j32197
$$ -77293 3576 -36943 -52389 -75717 135700 296634 285285 326701 234532 149376 17179
25615A7179o4143M2449P9385N2871o1235q1965m0120R2367k5058m1264R6210K4700
$$ 17179 -46964 -4515 74870 127741 66506 -15459 -55579 36788 11730 -29534 66676 91376
25603I1376n6876m4448K6775M6884j03216l6153J10542k0993o3596K3126m420
$$ 91376 34500 -9948 16827 63711 -39505 -75658 34884 13891 -49705 -26579 -30999
25592c0999k1972p2324L3066R813k4257K7557q7508K497M5685O1283M4749m8290
$$ -30999 -52971 -125295 -92229 -82416 -106673 -79116 -166624 -164127 -118442 -57159 -12410 -60700
25580f0700L1691O1813R606n2829j14843o8551J43927O8405r10p176j595m8808
$$ -60700 -29009 32804 42410 -10419 -125262 -193813 -49886 18519 17609 10433 8838 -39970
25568c9970L2291J32279j54019j80151J03699J50390N2943L9348q5864J1477R766
$$ -39970 -7679 124600 -29419 -209570 -105871 44519 97462 136810 50946 62423 72189
25557G2189l8885Q8539N4921j5964o8473r1q697l8224j36670p5578M2198J04073
$$ 72189 33304 121843 176764 160800 92327 92236 83539 45315 -91355 -166933 -124735 -20662
25545b0662o1093l328J4633Q4722P2674n188k1586J07971r1646j08642J845o5717
$$ -20662 -81755 -85083 -70450 14272 86946 81758 60172 168143 76497 -32145 -30300 -96017
25533i6017o664Q9793N6866N6612N6106o5763o5053M6838M6128M7679m460J420
$$ -96017 -102681 -12888 43978 100590 156696 90933 25880 72718 118846 166525 162065 163485
25521A63485j3303k5651M0638p3856L8732o7242m6613m5783M4479q05o4950L649
$$ 163485 150182 124531 165169 91313 130045 62803 16190 -29593 14886 14081 -50869 -47220
25509d7220M1429l8238n0357k0870M6091J18717N6440l8647l2395m5329R62J1247
$$ -47220 -5791 -44029 -94386 -115256 -69165 49552 105992 67345 34950 -10379 -9417 1830
25497A830Q7066J3592j15976M6651J3997O1970L6451o0759L3270k819q3543J072
$$ 1830 88896 102488 -13488 33163 47160 109130 145581 84822 118092 115273 31730 32802
25485C2802k3237K8973L8934J8334J58311N4042j21857j19123j5168O506o840
$$ 32802 9565 38538 77472 95806 254117 308159 186302 67179 52011 58517 51677
25474E1677L9251L0400q4437J958J00535M8125j45511o4929J7463O3495m8693
$$ 51677 90928 121328 36891 38849 139384 187509 41998 -22931 -5468 58027 9334
25463I334j9726j5566k6194j21955K6743J74825N6532l4935m4449j7047j03581
$$ 9334 -10392 -25958 -52152 -174107 -147364 27461 83993 49058 4609 -12438 -116019
25452a16019R9655N8172M7415j2734k14683n4510k2800p7866Q7649J56381j148
$$ -116019 -16364 41808 89223 76489 -138194 -192704 -215504 -293370 -205721 -49340 -50488
25441e0488k1458p3082q3881J5145M507J62325J50127l0337m0086r8946n9506
$$ -50488 -71946 -145028 -228909 -213764 -209257 -46932 103195 72858 32772 -66174 -125680
25430a25680j6242n9130q6946P5999K23134J38717r0034j04662r882J03385n3263
$$ -125680 -141922 -201052 -287998 -211999 11135 149852 59818 -44844 -54726 48659 -4604
25419d604j37870r1143l2925R849J15767L6798L3935J4790q7021k2771J53834
$$ -4604 -142474 -233617 -266542 -256693 -140926 -104128 -70193 -55403 -142424 -165195 -11361
25408a1361J25435J14601o4624q8631o8988o9042O8827R460o5395m2969N7613
$$ -11361 114074 228675 164051 75420 6432 -62610 6217 15677 -49718 -92687 -35074
25397c5074J05283p2723m6698K0725N9338k1689J15604R1940j18925j32494j74128
$$ -35074 70209 -2514 -49212 -28487 30851 9162 124766 216706 97781 -34713 -208841
25386b08841l7932R8568O7084J01263j18609n1051r244J28705J23490r9018j67516
$$ -208841 -246773 -148205 -81121 20142 -98467 -149518 -158762 -30057 93433 -5585 -173101
25375a73101J57366P6877K2984N5807R2929O0868J5929j70919j07435O0953j5614
$$ -173101 -15735 61142 84126 139933 232862 293730 309659 138740 31305 92258 76644
25364G6644P7889j9121j44922j06367nN2272l5547M1364M1128l4589p1385m8581
$$ 76644 154533 135412 -9510 -115877 -115882 -63610 -99157 -57793 -16665 -51254 -122639 -171220
25352a71220Q0358J33448j07446J4433j0852J7932Q021j24905k8336L6385J53394
$$ -171220 -90862 42586 -64860 -50427 -61279 -43347 -35326 -160231 -188567 -152182 1212
25341A212Q2345j22338M0280N4234n563N7377n9735R1298M1504j1196j50534m6443
$$ 1212 83557 -38781 1499 55733 50170 107547 47812 139110 180614 169418 18884 -27559
25329b7559J08137k892J4836o020o7971J9098J0881j96725j7884P1573m1479P184
$$ -27559 80578 77686 92522 86502 18531 37629 48510 -148215 -166099 -94526 -136005 -128821
25317a28821O356r3816J24548N7488j1443M7910M455k2922k5923j1048k7055N9950
$$ -128821 -122465 -216281 -91733 -34245 -45688 2222 6677 -16245 -42168 -53216 -80271 -20321
25305b0321n6803j29881M7209O2819q361K2855L715o1346K6629R1206m4549k5561
$$ -20321 -77124 -207005 -159796 -96977 -105338 -82483 -78768 -140114 -113485 -22279 -66828 -92389
25293i2389M082L7047m377R3594K3371J1328n330j40370P2741M6725R9599p266
$$ -92389 -88307 -51260 -55637 37957 61328 72656 67326 -73044 -303 46422 146021 138755
25281A38755p4581j14094n2417O7231m6062j66134J30763M5242Q6185P9529m4381
$$ 138755 64174 -49920 -102337 -35106 -81168 -247302 -116539 -71297 14888 94417 50036
25270E0036k6208j44328l3384J6756p5054L1113J23177l2249p0536J8479J03334
$$ 50036 23828 -120500 -153884 -137128 -212182 -181069 -57892 -90141 -160677 -142198 -38864
25259c8864J05633J08560L2536m9860j3952R4653j40j8755j71794J20614M7444
$$ -38864 66769 175329 207865 158005 144053 238706 238566 219811 48017 168631 216075
25248B16075k3438K6400j01072r8370J77786J6196j19096L7478p0758j44200q8095
$$ 216075 192637 219037 117965 19595 197381 213577 94481 131959 61201 -82999 -171094
25237a71094R1705J73001J02653L7542j89356R516J3753J6483J784R5853K5788
$$ -171094 -79389 93612 196265 233807 44451 53967 67720 84203 85987 181840 207628
25226B07628j65613r4389N6414M9711q114J1868n9579o5092p1383K2340n3231
$$ 207628 42015 -52374 4040 53751 45637 57505 -2074 -67166 -138549 -116209 -169440
25215a69440O044K809J3500J81004j022j43310j09509O7441J99503K5061m4547
$$ -169440 -163396 -160587 -147087 33917 32895 -110415 -219924 -152483 47020 72081 27534
25204B7534p2476J1917k545n0700L1087J78959j44Q353j35671N7930N6177j02228
$$ 27534 -44942 -33025 -35570 -86270 -55183 123776 123632 131985 -3686 54244 110421 8193
25192H193q2369J31791n096M6298J3220q5433j4283J41034q887K2348m6094j28234
$$ 8193 -74176 57615 52519 98817 112037 26604 12321 153355 144468 166816 120722 -7512
25180g512Q1187N8433r6969q8811K5287J28455j6400j11729k826L5228O8304L7068
$$ -7512 73675 132108 35139 -53672 -28385 100070 83670 -28059 -30885 4343 72647 109715
25168A09715K0027p3907P2779K4695j22151K5027P0311k1835j15415p9375m8207
$$ 109715 129742 55835 128614 153309 31158 56185 126496 104661 -10754 -90129 -138336
25157a38336l44k2740P5140q7674k4586L4084L4378J15381J73468k595l6947M4039
$$ -138336 -138680 -161420 -86280 -173954 -198540 -164456 -130078 -14697 158771 156176 119229 163268
25145A63268n5647o6864j12566R05j4732j35312O2547P9855P2861k0835K3114
$$ 163268 107621 40757 -71809 -70904 -85636 -220948 -158401 -78546 -5685 -26520 -3406
25134c406l5383m1396k9385Q2280l3398n3962j34984j18689K6805J48120N7413
$$ -3406 -38789 -80185 -109570 -27290 -60688 -114650 -249634 -368323 -341518 -193398 -135985
25123a35985J9938R6566Q3683k7198P0120N9009n3297R042p5503J8130L7456J537
$$ -135985 -116047 -19481 64202 37004 107124 166133 112836 121878 46375 64505 101961 103498
25111A03498n2639j06252o7369n4257j688J01780K1057j8430J20800m9045j43667
$$ 103498 50859 -55393 -122762 -177019 -178707 -76927 -55870 -74300 46500 -2545 -146212
25100a46212j02081K9572J23715N3998J21374J6597j71019r1704K1481L2301J86539
$$ -146212 -248293 -218721 -95006 -41008 80366 96963 -74056 -165760 -144279 -111978 74561
25089G4561n0660j24929Q4132K4260J37457j1606o9252P5359n7026j65209m8985
$$ 74561 23901 -101028 -16896 7364 144821 133215 63963 139322 82296 -82913 -131898
25078a31898O032J4623r556K7303L3528J54355n0908n8909J3135N1424K7458O007
$$ -131898 -125866 -111243 -120799 -93496 -59968 94387 43479 -15430 -2295 49129 76587 82594
25066H2594n9202k9134m1448j066O8790k582R3819r695j45011r4843N9755K5287
$$ 82594 23392 -5742 -47190 -48256 20534 17952 111771 102076 -42935 -137778 -78023 -52736
25054e2736l8848O386j10237p8165O7277J11126n46m8385J03988P979n6513L6058
$$ -52736 -91584 -85198 -195435 -273600 -206323 -95197 -95743 -144128 -40140 -32161 -88674 -52616
25042e2616O6188Q8703o425N2082Q516M8443j6663J6927Q6933j19421l0438M6209
$$ -52616 13572 102275 95850 147932 156448 204891 188228 205155 292088 172667 142229 188438
25030A88438N2195k7847P544j19420m2185J02724j55548o0424L4092m0648m4645
$$ 188438 240633 212786 220330 100910 58725 161449 5901 -54523 -20431 -61079 -105724
25019a05724n5442Q8322k6835m6398Q7597R0520O0559m3668l9191l2916L3455
$$ -105724 -161166 -72844 -99679 -146077 -58480 32040 92599 48931 9740 -23176 10279
25008A0279J9634q431O016J17453n2409q8594J8965m9201j12757m2173O205Q4873
$$ 10279 29913 21482 27498 144951 92542 3948 22913 -26288 -139045 -181218 -175013 -90140
24996i0140J20431O209n1880N1577j5637p733J13830K9427O878p4119p963P0087
$$ -90140 30291 36500 -15380 36197 20560 12827 126657 156084 162962 88843 80880 150967
24984A50967q7679j12020L6798k6297n3077Q8455P7792Q9688Q5546p8711p0989
$$ 150967 63288 -48732 -11934 -38231 -91308 -2853 74939 164627 250173 171462 100473
24973A00473K6366j18814k0476j6102O9073j4816k8009p6603M8230r704J0918
$$ 100473 126839 8025 -12451 -28553 40520 25704 -2305 -78908 -30678 -40382 -29464
24962b9464O219j06691j84971Q3847J37202O8944J03683K8122q6368O4246l7499
$$ -29464 -23245 -129936 -314907 -231060 -93858 -24914 78769 106891 20523 84769 47270
24951D7270r1411J4162o624m582M0988J26032k1466r6525j7551J15998K0017k0372
$$ 47270 -44141 -29979 -36603 -41185 -197 125835 104369 7844 -9707 106291 126308 105936
24939A05936R7107j256p967m0337j15124l6405L5063r8761p7886m1074k8290J949
$$ 105936 203043 201787 193820 153483 38359 1954 37017 -61744 -139630 -180704 -208994 -207045
24927b07045K30q1192k6810O7654J33416R7703J10058k11699j56917R4661J6634
$$ -207045 -206815 -288007 -314817 -247163 -113747 -16044 94014 -117685 -274602 -179941 -163307
24916a63307L7314k3478J2045O5168M8537q3617O3222L6748n8489o8937J28509
$$ -163307 -125993 -149471 -137426 -72258 -23721 -107338 -44116 -7368 -65857 -134794 -6285
24905f285j6509j30558K9848j0419O7879r7714j5373P3588n6837j7317J12500
$$ -6285 -22794 -153352 -123504 -133923 -66044 -163758 -179131 -105543 -162380 -179697 -67197
24894f7197M8272p6126P593J72449P1599j84614L7085Q3881p5858n9302n6095
$$ -67197 -18925 -95051 -87458 84991 156590 -28024 9061 92942 17084 -42218 -98313
24883i8313J1655L1162r821M7340N3220m8142n2618J15854O1221R9748J12008
$$ -98313 -86658 -55496 -65317 -17977 35243 -12899 -65517 50337 111558 211306 323314
24872C23314r5447j57274p9417O0953j7178J821o2986q9629N3092L2232M5815
$$ 323314 227867 70593 -8824 52129 34951 36772 -26214 -115843 -62751 -30519 15296
24861A5296M6905j55043k1159Q7895M5737o702O931j5286j1156L3474P3358o5811
$$ 15296 62201 -92842 -114001 -26106 19631 12929 19860 4574 -6582 26892 100250 34439
24849C4439L7801m8750n0420k0576R4247J63595O3632j41027j08173O3384j6587
$$ 34439 72240 23490 -26930 -47506 46741 210336 273968 132941 24768 88152 71565
24838G1565o6471p8816L5522M0560J0483M7194j02n5490n2250M1232N6775r2643
$$ 71565 5094 -73722 -38200 2360 12843 60037 59935 4445 -47805 -6573 50202 -42441
24826d2441j01378K2647L9591K3736j3439J15042K7116n8768j2783n7713K4519
$$ -42441 -143819 -121172 -81581 -57845 -71284 43758 70874 12106 -677 -58390 -33871
24815c3871J8825r9513m7955J54J827o0326o9245K1725J08474l6948j748N7900
$$ -33871 -15046 -114559 -162514 -162360 -160533 -220859 -290104 -268379 -159905 -196853 -198601 -140701
24803a40701R0421R0186J2637J3280J47508k6550j84325j17791n9845J29588J9345
$$ -140701 -50280 39906 52543 65823 213331 186781 2456 -115335 -175180 -45592 -26247
24792b6247j26898l0845J02468J51474P8745J2110q4304J1304j04633j02272J9305
$$ -26247 -153145 -183990 -81522 69952 148697 160807 76503 87807 -16826 -119098 -99793
24781i9793K381M1508N8855L7394q411J166j3800M9002J9481L4013o2661j11672
$$ -99793 -97412 -55904 2951 40345 31934 33100 19300 68302 87783 121796 59135 -52537
24769e2537M6009l4012j44738K732J96894N5627j5143j01832J27543N7173q8802
$$ -52537 -6528 -40540 -185278 -182546 14348 69975 54832 -47000 80543 137716 48914
24758D8914Q1085J7911j57266j9514m2590J2081O633L7563k4047m3582M9463l5110
$$ 48914 129999 147910 -9356 -28870 -71460 -59379 -52746 -15183 -39230 -82812 -33349 -68459
24746f8459R491J34553l3358q7576L0529J0595j1995N2748J00007L6025L4794
$$ -68459 -58968 75585 42227 -45349 -14820 -4225 -16220 36528 136535 172560 207354
24735B07354M6629j42144j30809L4279Q8003l6201q3259m2292N3276P4206N4128
$$ 207354 253983 111839 -18970 15309 103312 67111 -16148 -58440 -5164 69042 123170
24724A23170J8483k4221m6189j99323j0676n0645K626O2590R0884J7364m2144
$$ 123170 141653 117432 71243 -128080 -138756 -189401 -186775 -124185 -33301 -15937 -58081
24713e8081n4393O660J16424N1275N3114j47544r0480p6273N8294J44526M4869
$$ -58081 -112474 -105814 10610 61885 114999 -32545 -123025 -199298 -141004 3522 48391
24702D8391K00k5038J4084l9369j6938n5191q530n1495K4873P8860n3388j08917
$$ 48391 48591 23553 37637 -1732 -18670 -73861 -82391 -133886 -109013 -30153 -83541 -192458
24690a92458M0770J01509J68990O399j07011j47456j0945N8636R2937l6973r3598
$$ -192458 -151688 -50179 118811 125210 18199 -129257 -140202 -81566 11371 -25602 -119200
24679a19200M4228J00435k2664q7621N459p201L7991J10358K8050Q244j17453
$$ -119200 -74972 25463 2799 -84822 -79363 -86564 -48573 61785 89835 98079 -19374
24668a9374o9686K1771O797L7989R2297j84255j14540j7809R8832N7420l0954
$$ -19374 -89060 -67289 -60492 -22503 69794 -114461 -229001 -246810 -147978 -90558 -121512
24657a21512P2426J17309M0987j1157L5575k11126j62682r1612N150J71757J21364
$$ -121512 -49086 68223 109210 98053 133628 -77498 -240180 -331792 -326642 -154885 -33521
24646c3521k4063n4322M6860R0511N3293M709j9227m5969q1327m5320m624r069
$$ -33521 -57584 -111906 -65046 25465 78758 83467 64240 18271 -63056 -108376 -113000 -122069
24634a22069L0318J4096N2167M2133l9338n8942O9945j1513m0721N3866j0708
$$ -122069 -91751 -77655 -25488 16645 -22693 -81635 -11690 -23203 -63924 -10058 -20766
24623b0766j2759J8547L7864L759n0606m484L1748p826R1130R1824l4600m2838
$$ -20766 -33525 -14978 22886 26645 -23961 -28445 3303 -4523 86607 178431 143831 100993
24611A00993j47842K2744J08137K4850j00095p3628k6809k1639K1711l8980n9772
$$ 100993 -46849 -24105 84032 108882 8787 -64841 -91650 -113289 -91578 -130558 -190330
24600a90330j64335N9632M0493M1803O442Q8404J2834j1499p1579o0574O067O4850
$$ -190330 -354665 -295033 -254540 -212737 -206295 -117891 -105057 -116556 -188135 -248709 -242642 -177792
24588a77792J10040Q2138Q9469L2533j00262j01300P3639P7591R228Q8897k2683
$$ -177792 -67752 14386 103855 136388 36126 -65174 8465 86056 95284 184181 161498
24577A61498r0904m750k4418P3490l7244j05202p1430K624M7635P787Q816J7030
$$ 161498 70594 65844 41426 114916 77672 -27530 -98960 -96336 -48701 -40914 -32098 -15068
24565a5068J03673k5049m3274k176j3313n6920K6814O0758Q5293k12511j34743
$$ -15068 88605 63556 20282 18106 4793 -52127 -25313 35445 120738 -91773 -226516
24554b26516R0048J16360J9537J35163J0680p5712n0763n0087P1433R2160P7393
$$ -226516 -136468 -20108 -571 134592 145272 69560 18797 -31290 40143 132303 209696
24543B09696K2713m5729j23756o8786m886O6043L2458K2643o5137L9133n670j33186
$$ 209696 232409 186680 62924 -5862 -10748 55295 87753 110396 45259 84392 78722 -54464
24531e4464j07789l4488J8113j5639P0947J49011P195Q838J1603L7900K3384n222
$$ -54464 -162253 -196741 -178628 -194267 -123320 25691 32886 41724 53327 91227 114611 109389
24519A09389j94515j33964Q9044R1213Q1948M5262J3597N1q0471k8633N5851K8348
$$ 109389 -85126 -219090 -130046 -38833 43115 88377 101974 102025 21554 -7079 48772 77120
24507G7120m6077j20430M4574J42092N8826r3824o1610P6881R2400M780j7578
$$ 77120 31043 -89387 -44813 97279 156105 62281 671 77552 169952 174732 157154
24496A57154p6690l3829R9223j30401p2297p9864q4452L7072O5036J25874l4892
$$ 157154 80464 46635 145858 15457 -56840 -136704 -221156 -184084 -119048 6826 -28066
24485b8066m4232N583O3287J2196N4105M0927j7691j2556J04945n2807j12767
$$ -28066 -72298 -66715 -3428 8768 62873 103800 86109 73553 178498 125691 12924
24474A2924O2300J44883O8157j3427o0823p7080j24119m8259P3408O9831J17099
$$ 12924 75224 220107 288264 274837 214014 136934 12815 -35444 37964 107795 224894
24463B24894J4431n2143j12773m1308j2965O2152o8945j02263P0472R9564j14048
$$ 224894 239325 187182 74409 33101 20136 82288 13343 -88920 -18448 81116 -32932
24452c2932l020M2727o4941j464q2299O163l6915L1761Q1096M6880J67280J00578
$$ -32932 -35952 6775 -58166 -59630 -141929 -135766 -172681 -140920 -59824 -12944 154336 254914
24440B54914n2765r3157q3416j14411L1661J2428m0104m7030K4559J12604L5767
$$ 254914 202149 108992 25576 -88835 -57174 -44746 -84850 -131880 -107321 5283 41050
24429D1050p4060n7785O9535O6624m7087K8458J99816m9116m7414r4864o3711
$$ 41050 -33010 -90795 -21260 45364 -1723 26735 226551 177435 130021 35157 -28554
24418b8554N5330J10616o3403j03546O0325K1528o8032k5813O1260J0271n1276
$$ -28554 26776 137392 73989 -29557 30768 52296 -15736 -41549 19711 29982 -21294
24407b1294O6384J861p5012P1219j17564m7717O8836L4152N0351m9501m6108j16944
$$ -21294 45090 46951 -28061 43158 -74406 -122123 -53287 -19135 31216 -18285 -64393 -181337
24395a81337m7226r4019K6230J03514K3340l2347k9872j1553m1872J4532J49395
$$ -181337 -228563 -322582 -296352 -192838 -169498 -201845 -231717 -243270 -285142 -270610 -121215
24384a21215Q565P273P9598J42126l1467l4365j1675O783o7955j4607Q4888J91118
$$ -121215 -112650 -105377 -25779 116347 84880 50515 38840 45623 -22332 -36939 47949 239067
24372B39067J5375j73477j19929K111J09769Q9960l475j17340j12107k4897L4114
$$ 239067 254442 80965 -38964 -36853 72916 162876 159401 42061 -70046 -94943 -60829
24361f0829k7266L2605J0291k3078n3149O364O169N9772R9303j7457K0272o3264
$$ -60829 -88095 -55490 -45199 -68277 -121426 -115062 -108893 -49121 50182 32725 52997 -10267
24349a0267k5276o375J07918P5045m6718l6262O9531P1967N8033L1146p5359j23977
$$ -10267 -35543 -41918 66000 141045 94327 58065 127596 199563 257596 288742 213383 89406
24337H9406o5649J7641P8714N760q7610Q9719j7630q7913m9915p1621M9678P6703
$$ 89406 23757 41398 120112 125872 38262 127981 110351 22438 -27477 -99098 -49420 27283
24325B7283J626j32732m9494r5871M5224L5757P3262k1558l6760O2379j1771N7265
$$ 27283 28909 -103823 -153317 -249188 -203964 -168207 -94945 -116503 -153263 -90884 -102655 -45390
24313d5390Q609j34770J09610J06561M5033L0757q2955l7316L5455m0302K5446
$$ -45390 -36781 -171551 -61941 44620 89653 120410 37455 139 35594 -4708 20738
24302B0738l1813m6733M5377K4414l7393N0445l7468m8645j010K8726J1222J60768
$$ 20738 -11075 -57808 -12431 11983 -25410 25035 -12433 -61078 -62088 -33362 -22140 138628
24290A38628n7412p3727l7006M667R0638M6869l3610n5906m7417j6450j08072
$$ 138628 81216 7489 -29517 -24850 65788 112657 79047 23141 -24276 -40726 -148798
24279a48798L1503Q9012n8016n6019J07015N0860p351p7431o3650J08J17456n5136
$$ -148798 -117295 -28283 -86299 -142318 -35303 15557 8206 -69225 -132875 -132767 -15311 -70447
24267g0447m2060l393J47537R0056l1361j04078j10339J1890P4422J131R766J6753
$$ -70447 -112507 -115900 31637 121693 90332 -13746 -124085 -112195 -37773 -36642 -26876 -10123
24255a0123j18382p3247J8944P123N9603k5574p8741K9345N1328J02410P0244
$$ -10123 -128505 -201752 -182808 -175685 -116082 -141656 -220397 -191052 -139724 -37314 32930
24244C2930q6742o3447P685j9923J00303P8694P413J21724j7860j02586R1306
$$ 32930 -53812 -117259 -109574 -129497 -29194 49500 56913 178637 160777 58191 149497
24233A49497N7243j03181j14573o0020k0971Q6456o060R9344q0745j26418J11570
$$ 149497 206740 103559 -11014 -71034 -92005 -5549 -11609 87735 6990 -119428 -7858
24222g858J28033j09640j29565N565K3307J44211j01828k00472R5591J11360P6761
$$ -7858 120175 10535 -119030 -113465 -90158 54053 -47775 -248247 -152656 -41296 35465
24211C5465j4046p9145J0708j65975m3974J27693q5890k0658k7980M9469J46089
$$ 35465 21419 -57726 -47018 -212993 -256967 -129274 -215164 -235822 -263802 -214333 -68244
24200f8244J55201R9820j10055k16844M5803J51996O0957K1316j39274j48466
$$ -68244 86957 186777 76722 -140122 -94319 57677 118634 139950 676 -147790
24190a47790O6562K75680l9469j02384L6112p2517l2443l7400l3356j05049L8461
$$ -147790 -81228 194452 154983 52599 88711 16194 -16249 -53649 -87005 -192054 -153593
24179a53593K7042K2164q5758J06605J25868K6105l3546J6684K5422k897K3262
$$ -153593 -126551 -104387 -190145 -83540 42328 68433 34887 51571 76993 74096 97358
24168I7358L4996j02989l4639m9785p2435P0671J619L630q015k2761K9240o5987
$$ 97358 132354 29365 -5274 -55059 -127494 -56823 -55204 -51574 -59589 -82350 -53110 -119097
24156a19097l1439n9520J01345J00173K6676M3243M4423k8440j19986l7204Q130
$$ -119097 -150536 -210056 -108711 -8538 18138 61381 105804 77364 -42622 -79826 -71696
24145g1696J2227j6148n3729L3812o3874O6121J61782K6177l2174j39194j32795
$$ -71696 -59469 -75617 -129346 -95534 -159408 -93287 68495 94672 62498 -76696 -209491
24134b09491L8078Q3832Q9877O1735j93930o5109J41605N6810N0999k7386J261
$$ -209491 -171413 -87581 2296 64031 -129899 -195008 -53403 3407 54406 27020 28281
24123B8281r300l4395q9587k1894J22737J712n0145j11793k8096n8193j247N6028
$$ 28281 18981 -15414 -105001 -126895 -4158 -2446 -52591 -164384 -192480 -250673 -251920 -195892
24111a95892R5914Q1573j4900j30069l5441M4421O9383L97p50R0668Q6463K4307
$$ -195892 -99978 -18405 -33305 -163374 -198815 -154394 -85011 -84614 -85364 5304 91767 116074
24099A16074m8693m2912j17983o611N7245j1726j15595K3457J84261Q927k16565
$$ 116074 67381 24469 -93514 -100125 -42880 -54606 -170201 -146744 37517 46444 -170121
24088a70121r4584J28136J51349j4308J4537J3462P0699k6523n965R5138q8991
$$ -170121 -264705 -136569 14780 472 15009 28471 99170 72647 66682 161820 72829
24077G2829j13366p8652O8814m1561j22051P7683P9849K15225k5789j70515J7343
$$ 72829 -40537 -119189 -50375 -91936 -213987 -136304 -56455 158770 132981 -37534 -20191
24066b0191p5208k4355Q1695L9325j3800J31130n6060K3705l7593j86055n0408
$$ -20191 -95399 -119754 -38059 1266 -12534 118596 62536 86241 48648 -137407 -187815
24055a87815k431J22777P0926j1881P081R7403K9993p8825o9971J210K1088J931
$$ -187815 -190246 -67469 3457 -8424 -1343 96060 126053 47228 -22743 -21533 -445 1486
24043A486p8662J6169n9652O5764j4928q6340r1224m1704K9697J73150J3544k0413
$$ 1486 -77176 -61007 -120659 -54895 -69823 -156163 -247387 -289091 -259394 -86244 -72700 -93113
24031i3113M9113K525J2469l6554M9091O8779m5860L3618n3162n5574n7971j38540
$$ -93113 -44000 -41475 -29006 -65560 -16469 52310 6450 40068 -13094 -68668 -126639 -265179
24019b65179o4478m5359P1964R8880Q6628M2576o2525n65P2852P2673J7019k3279
$$ -265179 -329657 -375016 -303052 -204172 -117544 -74968 -137493 -138058 -65206 7467 24486 1207
24007A207K7792J8256K6086o1460m5412m4185J16784Q2026p1101p4409j120J15935
$$ 1207 28999 47255 73341 11881 -33531 -77716 39068 121094 49993 -24416 -25536 90399
23995I0399j3240p2686K3491q7283j18235m3602K8190N5596J19963Q9136r618
$$ 90399 77159 4473 27964 -59319 -177554 -221156 -192966 -137370 -17407 71729 62111
23984F2111j43015k13570Q240Q5923L3997L2379Q5005l0340k767Q6527O6071k1849
$$ 62111 -80904 -294474 -286234 -200311 -166314 -133935 -48930 -79270 -82037 4490 70561 48712
23972D8712o5188L9557K6862n2743o8822P1432j507n7470M2415Q5179l9489j02963
$$ 48712 -16476 23081 49943 -2800 -71622 -190 -1697 -59167 -16752 68427 28938 -74025
23960g4025j9114M9318m6684o6724k3126O0888R8956Q896Q7250M9073j20040p0116
$$ -74025 -93139 -43821 -90505 -157229 -180355 -119467 -20511 -11615 75635 124708 4668 -65448
23948f5448j4101J9503J9036M9473k8095p3636m7314Q811j829K1055l2869j8581
$$ -65448 -79549 -60046 -41010 8463 -19632 -93268 -140582 -131771 -133600 -112545 -145414 -163995
23936a63995n648O4915r335m1865o0133O4119J83184P1033n4775j37326K8371
$$ -163995 -169643 -104728 -114063 -155928 -216061 -151942 31242 102275 47500 -89826 -61455
23925f1455N6367p7227k63483p8621J56751Q1303r3040J03430Q5222L8638l8730
$$ -61455 -5088 -82315 -345798 -424419 -267668 -186365 -279405 -175975 -90753 -52115 -90845
23914i0845O5878M3073J605l451M5969k4768m9124p3225o5609P8868Q2505P779
$$ -90845 -24967 18106 19711 16260 62229 37461 -11663 -84888 -150497 -71629 10876 18655
23902A8655q9964k6514R5808P2967m9424p3145J17797k1331p9807J9464m4548
$$ 18655 -71309 -97823 -2015 70952 21528 -51617 66180 44849 -34958 -15494 -60042
23891f0042j5238o882J06632O0255j6331M7393l4613J2958n679j5676M5688m7755
$$ -60042 -75280 -82162 24470 84725 68394 115787 81174 94132 88453 72777 118465 70710
23879G0710j13306m9269L0064L0988j04695M1524O5133l0591L8150m1715m8957
$$ 70710 -42596 -91865 -61801 -30813 -135508 -93984 -28851 -59442 -21292 -63007 -111964
23868a11964R8514N5842j22382Q2825P5307k0691K9450m4709q2600n9248l679
$$ -111964 -13450 42392 -79990 2835 78142 57451 86901 42192 -40408 -99656 -103335
23857a03335m9496M4645O0269j1095k0693k4069P5796O1520J4260J0443n704n6090
$$ -103335 -152831 -108186 -47917 -59012 -79705 -103774 -27978 33542 47802 58245 52541 -3549
23845c549l4040O7511n6870j9181j2016M3263l3527j53902N1366J20718N9287
$$ -3549 -37589 29922 -26948 -46129 -58145 -14882 -48409 -202311 -150945 -30227 29060
23834B9060J1794p8041m6670J20662l0455j31957L175K3209Q1645K7787r312j1659
$$ 29060 40854 -37187 -83857 36805 6350 -125607 -122432 -99223 -17578 10209 897 -10762
23822a0762n8635l5361l9578m8517J17687R7179M8913r2020p5963m8611J08353
$$ -10762 -69397 -104758 -144336 -192853 -75166 22013 70926 -21094 -97057 -145668 -37315
23811c7315L7964J5082L1899j2245j07987k3656j9354M0461j2886Q830L5821p0360
$$ -37315 649 15731 47630 35385 -72602 -96258 -115612 -75151 -88037 -79207 -43386 -113746
23799a13746M7024Q1854k7478m1925M614j1885L5822j8887l745n6202J5803j0047
$$ -113746 -66722 15132 -12346 -54271 -49657 -61542 -25720 -44607 -48352 -104554 -88751 -98798
23787i8798p9123m3310j6744K8631M7599L7513J03015J33638j1575j6206O704
$$ -98798 -177921 -221231 -237975 -209344 -161745 -124232 -21217 112421 100846 84640 91344
23776I1344k4253l7562m0921o3959o1793j0467R746L0761K341m855J4764L8988
$$ 91344 67091 29529 -11392 -75351 -137144 -147611 -137865 -107104 -104763 -109618 -94854 -55866
23764e5866P5934J9850o174R662N599l2353L8500K0105J1879J50359q7948j43605
$$ -55866 20068 39918 33744 43406 49005 16652 55152 75257 87136 237495 149547 5942
23752E942q0494O5670K7398k1039q4049J01075n903l1082j10763M0177O5072O8748
$$ 5942 -74552 -8882 18516 -2523 -86572 14503 8600 -22482 -133245 -93068 -27996 40752
23740D0752O2822m1423j36052j88796M9535M6596j36702q9835P3588k771M0367
$$ 40752 103574 62151 -73901 -262697 -213162 -166566 -303268 -393103 -319515 -322286 -281919
23729b81919N7667L7583P7389J5269q1141l0276m4301P0445J34060q9671p0147
$$ -281919 -224252 -186669 -109280 -94011 -175152 -205428 -249729 -179284 -45224 -134895 -205042
23718b05042N7522L5764P2628o3263k9244q0136R6036Q2462N5067p7025j76184
$$ -205042 -147520 -111756 -39128 -102391 -131635 -211771 -115735 -33273 21794 -55231 -231415
23707b31415M9599K61719K2829l8231k4767P3193r4794j17753m4187m9940q9388
$$ -231415 -181816 79903 102732 64501 39734 112927 18133 -99620 -143807 -193747 -283135
23696b83135K0861M0901J2640M6919J32910O6648j0253l1289n110J12598j000
$$ -283135 -262274 -221373 -208733 -161814 -28904 37744 27491 -3798 -8908 103690 102690
23685A02690p1600P8313p7680m6811L4034k3999M9752j40370o7824k1058M1463
$$ 102690 31090 109403 31723 -15088 18946 -5053 44699 -95671 -163495 -184553 -143090
23674a43090J19235J00958m2401j46781P6132J22245l7989p4695l2538j2936o1474
$$ -143090 -23855 77103 34702 -112079 -35947 86298 48309 -26386 -58924 -71860 -133334
23663a33334M9845P1519J375n8165P339M1760N6010l0446J25198J41534P274j73099
$$ -133334 -83489 -11970 -10595 -68760 -61421 -19661 36349 5903 131101 272635 279909 106810
23651A06810j16533p3181o1497N2287p1454K4424J38036L4022p1760M0386L9736
$$ 106810 -9723 -82904 -144401 -92114 -163568 -139144 -1108 32914 -38846 1540 41276
23640D1276q7236J7934P7434O7477M3707o5952N5111m5160q1142o3534n201M1983
$$ 41276 -45960 -28026 49408 116885 160592 94640 149751 104591 23449 -40085 -45286 -3303
23628c303J02504n5765q6104p3115K2302m4555J03464K7366q0839M3482m1709
$$ -3303 99201 43436 -42668 -115783 -93481 -138036 -34572 -7206 -88045 -44563 -86272
23617h6272L2712J50208L580q3169l3696R0636P3353l0001j05418j7423R21J1730
$$ -86272 -53560 96648 100228 17059 -16637 73999 147352 117351 11933 -5490 -4569 7161
23605G161M6104L185J65921m3708j74608k9003q2709n393L8456j60174O1896K7785
$$ 7161 53265 56450 222371 178663 4055 -24948 -107657 -113050 -74594 -234768 -172872 -145087
23593a45087R8627L2417q496j7251k3361K4035r4391J0777k2597p089N4175m474
$$ -145087 -46460 -14043 -22539 -39790 -63151 -39116 -133507 -122730 -145327 -152416 -98241 -102715
23581a02715j9983l9272j38410o5472J00838J12793J01376N3041N987J19554J06797
$$ -102715 -122698 -161970 -300380 -365852 -265014 -152221 -50845 2196 8183 127737 234534
23570B34534k3849r5396m4856J3045k7035k42990J761Q5796J1847L3454P6352
$$ 234534 210685 115289 70433 83478 56443 -186547 -184786 -98990 -87143 -53689 22663
23559B2663M7623l3661k4272j63940O8795J9933k2199O559P5334j9996L5315q3520
$$ 22663 70286 36625 12353 -151587 -82792 -62859 -85058 -78499 -3165 -23161 12154 -71366
23547g1366N2099J08013J4115j02422J589N7579j77278n1491o529O4844J81599
$$ -71366 -19267 88746 102861 439 2028 59607 -117671 -169162 -175691 -110847 70752
23536G0752J6495m3050J06472k139k452R3638r9352j26370m2921J2006N6755r1081
$$ 70752 87247 44197 150669 148530 146078 239716 140364 13994 -28927 -16921 39834 -51247
23524e1247o4418P408p0101N0063J14909r023M4088M2989O6262j0330o2001n7126
$$ -51247 -115665 -108257 -178358 -128295 -13386 -22409 21679 64668 130930 120600 58599 1473
23512A473j40195j5470J87727L0725r2390l2977P2320J48775n2131l52l211j11068
$$ 1473 -138722 -154192 33535 64260 -28130 -61107 11213 159988 107857 107505 104294 -6774
23500f774N3889p2275K6440J61405j01489o9719N588m8761N5624J4134N9315l3365
$$ -6774 47115 -25160 1280 162685 61196 -8523 -2935 -51696 3928 18062 77377 44012
23488D4012n6916r8194K9394M2522k7606q5667n8676P1026O6309k7332N1488Q285
$$ 44012 -12904 -111098 -81704 -39182 -66788 -152455 -211131 -140105 -73796 -101128 -49640 -41355
23476d1355L719J4706k3302m8610Q663Q862M285P8288N4841j06368j81777M7549
$$ -41355 -37636 -22930 -46232 -94842 -86179 -77317 -73032 5256 60097 -46271 -228048 -180499
23464a80499J16929J42487N0325j08843k2198J05254J9681p9947q4437L1511J702
$$ -180499 -63570 78917 129242 20399 -1799 103455 123136 43189 -41248 -9737 -8035
23453h035K4373p9636m6658r888J16763j5080M3815n2036j68536n6921P0611R2836
$$ -8035 16338 -63298 -109956 -119844 -3081 -18161 25654 -26382 -194918 -251839 -181228 -88392
23441h8392r1647j4841P171K3530K3456O8144J12435K021J03510n1887N9820o3385
$$ -88392 -180039 -194880 -187709 -164179 -140723 -72579 39856 41877 145387 93500 153320 89935
23429H9935l4828k5436L4574L1398n926m2913m1587J04260n4435r3598q4301N2648
$$ 89935 55107 29671 64245 95643 89717 46804 5217 109477 55042 -38556 -122857 -70209
23417g0209J60772j5072r6139N4862P2098J310j24403j7664M6896k0865N2845
$$ -70209 90563 75491 -20648 34214 106312 107622 -16781 -34445 12451 -8414 44431
23406D4431m1577o6940j8561L9741q017M0304l0242n5132j3361L1348j5057Q0932
$$ 44431 2854 -64086 -82647 -42906 -50923 -10619 -40861 -95993 -109354 -78006 -93063 -12131
23394a2131j37059n1581J06532M6667l6494o5816N0044q6411l9730j01018m8432
$$ -12131 -149190 -200771 -94239 -47572 -84066 -149882 -99838 -186249 -225979 -326997 -375429
23383c75429N4031P6940J62214K7855n5563N4824M5970M9243J2937j69722l0689
$$ -375429 -321398 -244458 -82244 -54389 -109952 -55128 -9158 40085 53022 -116700 -147389
23372a47389j7758Q1676K3384M4924J84964l4054m3302j38266r4632r9126l6671
$$ -147389 -165147 -83471 -60087 -15163 169801 135747 92445 -45821 -140453 -239579 -276250
23361b76250k28L8362Q8810P9523O3235L0531J9668k8637j42606o5766Q337J65693
$$ -276250 -276478 -238116 -149306 -69783 -6548 23983 43651 15014 -127592 -193358 -185021 -19328
23349a9328P220P0351n5166l0390o0192r0975J6675N979O9484o2772k1119J45555
$$ -19328 -12108 58243 3077 -27313 -87505 -178480 -161805 -155826 -86342 -149114 -170233 -24678
23337b4678L6578k3523j08654q9891o3036R1746N126N466J51592R9338M8400P1255
$$ -24678 11900 -11623 -120277 -210168 -273204 -181458 -176332 -170866 -19274 80064 128464 199719
23325A99719L264n6058q1126J6452J6684M9229o1621j32309j01588P1714J4909
$$ 199719 202983 146925 65799 82251 98935 148164 86543 -45766 -147354 -75640 -60731
23314f0731q879j0477j9116m2176j5285J17041L3262J21001P0888p8891j55302
$$ -60731 -69610 -80087 -99203 -141379 -156664 -39623 -6361 114640 185528 106637 -48665
23303d8665L2182K3086l7720R151O2315M8278n0274o7456r1090p2347M3090P4012
$$ -48665 -16483 6603 -31117 -21966 40349 88627 38353 -29103 -120193 -192540 -149450 -75438
23291g5438O5264K068L5856J51524p8240j25301k1482l5532J66863m5570o2364
$$ -75438 -10174 -8106 27750 179274 101034 -24267 -45749 -81281 85582 40012 -22352
23280b2352K9651k9860m1036q980P6326Q7069K1255L2942q3523o0549p1560m4265
$$ -22352 7299 -22561 -63597 -72577 3749 90818 112073 145015 61492 943 -70617 -114882
23268a14882l3009j30628N3185M5013J50819Q2373J887n7259r5682O5967N4818
$$ -114882 -147891 -278519 -225334 -180321 -29502 52871 54758 -2501 -98183 -32216 22602
23257B2602n4252j55978P909M5K9691L4180j1340q0986M1714k8160R9923L1057
$$ 22602 -31650 -187628 -179719 -179674 -149983 -115803 -127143 -208129 -166415 -194575 -94652 -63595
23245f3595l7491m3272K5393K01710J8595p4268n1840Q8971J11250k645M522O1932
$$ -63595 -101086 -144358 -118965 82745 101340 27072 -24768 64203 175453 172808 177330 239262
23233B39262p8467m2954l8965m9627K1651O1929O8725j2145p3707k3354j54344
$$ 239262 160795 117841 78876 29249 50900 112829 181554 169409 95702 72348 -81996
23222h1996j24569n8356k1659M2608J08811J62442P5131j95310q5297j6090j05546
$$ -81996 -206565 -264921 -286580 -243972 -135161 27281 102412 -92898 -178195 -194285 -299831
23211b99831J76798L5745M5144J38678P9839l497N3456l340j04087p5912M2439
$$ -299831 -123033 -87288 -42144 96534 176373 172876 226332 222992 118905 42993 85432
23200H5432j75313j99154N2805R8073K87R9373J35477J0179j19986r0657n2898
$$ 85432 -89881 -289035 -236230 -138157 -137870 -38497 96980 107159 -12827 -103484 -156382
23189a56382N9602J14851N8777L7403j8187j45211L2307N6508p3119M0345K3294
$$ -156382 -96780 18071 76848 114251 96064 -49147 -16840 39668 -33451 6894 30188
23178C0188M2125r4886j04243k4610m1940k8388J5398J13159m7155k1296K0966
$$ 30188 72313 -22573 -126816 -151426 -193366 -221754 -206356 -93197 -140352 -161648 -140682
23167a40682m1105j10115Q6662L8335N477N1290N0950l8177R9145M0308k7033
$$ -140682 -181787 -291902 -205240 -166905 -161428 -110138 -59188 -97365 1780 42088 15055
23156A5055l6944L8461M9113r7237K3943k3481K2116J02052j6746j83175q0154
$$ 15055 -21889 16572 65685 -31552 -7609 -31090 -8974 93078 76332 -106843 -186997
23145a86997Q3941J18500J50990J9581K3474J58530R620k2784j66639j49588j9317
$$ -186997 -103056 15444 166434 186015 209489 368019 377639 354855 188216 38628 19311
23134A9311M4620q1567o343j193p1558n8802Q5695J61760o65j2056J27012o5312
$$ 19311 63931 -17636 -23979 -25172 -96730 -155532 -69837 91923 91258 79202 206214 140902
23122A40902j64501j65952r880K6778J12227K7836J407j37852j641N9851N3259
$$ 140902 -23599 -189551 -199431 -172653 -60426 -32590 -31183 -169035 -170676 -110825 -57566
23111e7566P9576l8110j6447M4084J09103r6148p1438K0752o6591M2888l0322
$$ -57566 22010 -16100 -32547 11537 120640 24492 -46946 -26194 -92785 -49897 -80219
23100h0219l6113L6644J06130M1389l4795j70550p2444O1131J79758O6109L4752
$$ -80219 -116332 -79688 26442 67831 33036 -137514 -209958 -148827 30931 97040 131792
23089A31792o7342J6949j0424J1370o5758M810j7991j19347j05276k0826P7667
$$ 131792 64450 81399 70975 82345 16587 21397 3406 -115941 -221217 -242043 -164376
23078a64376k5400r5341N9450L0071k8712K4211l3205M4370K09818K5940j48190
$$ -164376 -189776 -285117 -225667 -195596 -224308 -200097 -233302 -188932 20886 46826 -101364
23067a01364k1710Q9307O2167J3477l3631j7237l3789K522J20401j504l4952K6381
$$ -101364 -123074 -33767 28400 41877 8246 -8991 -42780 -40258 80143 78639 43687 70068
23055G0068M9495L619q4270q1303M5165k4589K5112K6380N3505j00290o967N1151
$$ 70068 119563 123182 38912 -42391 2774 -21815 3297 29677 83182 -17108 -24075 27076
23043B7076j7005q3999j58757R697K9382j1367M6673R472J44984L4524P5465J47007
$$ 27076 10071 -73928 -232685 -222988 -193606 -204973 -158300 -148828 -3844 30680 106145 253152
23031B53152m6702j7614n1642j80425q7584L3702P4499l6777n2640n842O0260
$$ 253152 206450 188836 137194 -43231 -130815 -97113 -22614 -59391 -112031 -117873 -57613
23020e7613J35792l8469q3458j6318M8651n6456p1520M3193P0610N253n4666m160
$$ -57613 78179 39710 -43748 -60066 -11415 -67871 -139391 -96198 -25588 -20335 -75001 -79161
23008g9161J36662L3377N2490l7263r0630j60598q5819Q1630P9504K8839J18706
$$ -79161 57501 90878 143368 106105 15475 -145123 -230942 -149312 -69808 -40969 77737
22997G7737J01790n1589n8091n8292j36410q4769o7747J47792J9247Q5901O5970
$$ 77737 179527 127938 69847 11555 -124855 -209624 -277371 -129579 -110332 -24431 41539
22986D1539K8705n6863n7012K06375Q3104L202L6296m1928n4665q5840l7552j8918
$$ 41539 70244 13381 -43631 162744 245848 249050 285346 243418 188753 102913 65361 46443
22974D6443j7829j14558L499M7661J2539R287p8547J4190Q4480J859K1651N9526
$$ 46443 28614 -85944 -82445 -34784 -22245 -12958 -91505 -77315 7165 9024 30675 90201
22962I0201n3089m2378P3460R9634j6377j6777l2166J45951J54407K14152J72769
$$ 90201 37112 -5266 68194 167828 151451 134674 102508 248459 402866 617018 789787
22951G89787K12421K82567M09899K14132K59724J24906q4920k28529l28561k38608
$$ 789787 1002208 1284775 1694674 1908806 2168530 2293436 2208516 1979987 1651426 1412818
22941A412818k45797l89648j74553j25589o4503K7495l771k2802l1163n8343k7761
$$ 1412818 1167021 777373 602820 477231 412728 440223 436452 413650 382487 324144 296383
22930B96383p4214n6865J17830N6379o9466k8635l5686m3421J0503J13618j517
$$ 296383 222169 165304 283134 339513 270047 241412 205726 162305 172808 286426 284909
22919B84909l8240m6719l8082l6170L5103o9683o6304P9910M1258M1156q7210
$$ 284909 246669 199950 161868 125698 160801 91118 24814 104724 145982 187138 99928
22908I9928o1570r4280k5876N5470J03839N8897K221K4744j3953m5976J52600
$$ 99928 38358 -55922 -81798 -26328 77511 136408 138629 163373 149420 103444 256044
22897B56044j6522o5858p329l3137K8701J369M9255l0182l3297j05370q3408m4926
$$ 256044 239522 173664 166335 133198 161899 163268 212523 182341 149044 43674 -39734 -84660
22885h4660l1879n4314J9646K9769J23152Q1689L4024J6690q6365j9573j4172
$$ -84660 -116539 -170853 -151207 -121438 1714 83403 117427 134117 47752 28179 14007
22874A4007Q97N5540N3846L6415l2420m4364O9267N9880O1261j19715r2091m2926
$$ 14007 14904 70444 124290 160705 128285 83921 153188 213068 274329 154614 62523 19597
22862A9597Q5890n4314L410M1195J9616p3767k2838J722r329K3759M4725Q663
$$ 19597 105487 51173 54583 95778 115394 41627 18789 20511 11182 34941 79666 88329
22850H8329r1988p9247j8485l4753J18416P5887N8208j02666j31561J7159o5751
$$ 88329 -3659 -82906 -101391 -136144 -17728 58159 116367 13701 -117860 -100701 -166452
22839a66452l4683Q1801M7162L3684o1020n9441Q8672M7555l1894j14130L6355
$$ -166452 -201135 -119334 -72172 -38488 -99508 -158949 -70277 -22722 -54616 -168746 -132391
22828a32391P2898j897p8092Q3432r888K4968R6110m0514j94002n6971J34488
$$ -132391 -59493 -61390 -139482 -56050 -65938 -40970 55140 14626 -179376 -236347 -101859
22817a01859N4684O2491M7531O2477m9538l6011o6146J6104O627j1099K0173L3447
$$ -101859 -47175 15316 62847 125324 75786 39775 -26371 -10267 -3640 -14739 5434 38881
22805C8881k9212J5182n1957N3267R6215N0974j40700o6614L0094p8677J1702
$$ 38881 9669 24851 -27106 26161 122376 173350 32650 -33964 -3870 -82547 -70845
22794g0845m7264r5703Q2495J3064l0938M5392Q6981O7450m4178o0583n4939O0644
$$ -70845 -118109 -213812 -131317 -118253 -149191 -103799 -16818 50632 6454 -54129 -109068 -48424
22782d8424J08750M6180n1402r5439p6262J13905O4940J0873j42511o4695L7318
$$ -48424 60326 106506 55104 -40335 -116597 -2692 62248 73121 -69390 -134085 -96767
22771i6767J16740J71109j33657J3057L5697m6527m9906p400L7914M387j17048
$$ -96767 19973 191082 57425 70482 106179 59652 9746 2346 40260 44647 -72401
22760g2401o778o1452N1484R6539j10278l4210J40118R3039J5490j46672n7792
$$ -72401 -79179 -140631 -89147 7392 -102886 -137096 3022 96061 111551 -35121 -92913
22749i2913p760j1875m6407J09350L4389R4760p476K9941M486j66222J2439j3066
$$ -92913 -100673 -112548 -158955 -49605 -15216 79544 72068 102009 106495 -59727 -47288 -60354
22737f0354p9032j6984O3209O1309P2682j1462n5909j04080L7860r2568N4679
$$ -60354 -139386 -156370 -93161 -31852 40830 29368 -26541 -130621 -92761 -185329 -130650
22726a30650P4582l0427n2602k7106J22479J01627Q4023p3900l2135r4877L2876
$$ -130650 -56068 -86495 -139097 -166203 -43724 57903 141926 68026 35891 -58986 -26110
22715b6110K638Q1764j5900m1317J40367J66423L9002j04431j46062j08542k3014
$$ -26110 -23472 58292 42392 1075 141442 307865 346867 242436 96374 -12168 -35182
22704c5182J32378J687L0773j97501o3596K1433J81395J60638r4608j15363j09673
$$ -35182 97196 98883 129656 -67845 -131441 -110008 71387 232025 137417 22054 -87619
22693h7619m5369O6902q197J0881J4035j42470K5263K1592P657l0004p298L3746
$$ -87619 -132988 -66086 -74283 -63402 -49367 -191837 -166574 -144982 -137325 -167329 -174627 -140881
22681a40881M2340R181O0348Q6573R5903n546j07963j16080r232N8899k556o7084
$$ -140881 -98541 -89360 -29012 57561 153464 147918 39955 -76125 -85357 -26458 -29014 -96098
22669i6098l5512M9027O8097J2864q7856j2063l905N2289J035k4331Q7370Q3969
$$ -96098 -131610 -82583 -14486 -1622 -89478 -101541 -105446 -53157 -52122 -76453 10917 94886
22657I4886j20645L6872N0206N9823m3545m822N3788l786J157K5070L5270q4694
$$ 94886 -25759 11113 61319 121142 77597 72775 126563 122777 123934 149004 184274 99580
22645I9580j13375K5453l5753o7241L525J28578O1381m2712M2400m9166L3218
$$ 99580 -13795 11658 -24095 -91336 -87811 40767 102148 59436 101836 52670 85888
22634H5888M3283p8001k4047j53419j59474L6789J52980m070R8446L8032l4232
$$ 85888 129171 51170 27123 -126296 -285770 -248981 -96001 -100071 -1625 36407 2175
22623B175j01860j26676N3020K0986J13717q6084o8717J5749k7498P5452L8791
$$ 2175 -99685 -226361 -173341 -152355 -38638 -124722 -193439 -177690 -205188 -129736 -90945
22612i0945j25248l7096Q1167n8094j0009M0261M5490q858o5134M5397L8271N4768
$$ -90945 -216193 -253289 -172122 -230216 -240225 -199964 -154474 -163332 -228466 -183069 -144798 -90030
22600i0030m0735k4018J6670O6083J2129o738j04100r4726k2079K8779J33050
$$ -90030 -130765 -154783 -138113 -72030 -59901 -66639 -170739 -265465 -287544 -258765 -125715
22589a25715j5311p2177R469O0851J41713K6470P0673l3606p0973O0150K6532
$$ -125715 -141026 -213203 -203734 -142883 -1170 25300 95973 62367 -8606 51544 78076
22578G8076P0082L470N0093q7129r6010r695N1060j838l9360p8124l1188M021
$$ 78076 148158 151628 201721 114592 18582 8887 59947 58109 18749 -59375 -90563 -86542
22566h6542R6985L4153l3762J53910M08j84116k7125L7167M9m9087L9209J0237
$$ -86542 10443 44596 10834 164744 165152 -18964 -46089 -8922 -8873 -57960 -18751 -8514
22554h514j10876j08781k9938Q8482P5204K1493j27605K2792M7205O1821j6499
$$ -8514 -119390 -228171 -258109 -169627 -94423 -72930 -200535 -177743 -130538 -68717 -85216
22543h5216q8440L4589K1263J36127P6938m0727j19441p1373r33J67682J1988
$$ -85216 -173656 -139067 -117804 18323 95261 54534 -64907 -136280 -137213 30469 42457
22532D2457j04419k2667L0509l6090L3508M3448J17476P764o994q2155J6559K18185
$$ 42457 -61962 -84629 -54120 -90210 -56702 -13254 104222 111986 104992 22837 39396 257581
22520B57581N1960q4217r0209j47369O0820P7737J2711J16034J4635O7671J32421
$$ 257581 309541 225324 135115 -12254 48566 126303 139014 255048 269683 337354 469775
22509D69775p0177l6073J2927O721r9425p0876O8019j16420O5640P9470o5049
$$ 469775 399598 363525 376452 383173 283748 212872 280891 164471 230111 309581 244532
22498B44532k0645l3766N829j13922N1274O7275K1107J34956L8937J9600j6077
$$ 244532 223887 190121 195950 82028 133302 200577 221684 356640 395577 415177 399100
22487C99100q9379K5868L8511P0050K58465K52955L03225L49299L93424N09909
$$ 399100 309721 335589 374100 444150 702615 955570 1258795 1608094 2001518 2511427
22477B511427L39631M9706k34950m02706n76340l46488k11747k11085k26348n2517
$$ 2511427 2851058 2900764 2665814 2263108 1686768 1340280 1128533 917448 691100 638583
22467F38583k9602O9625P0355p9671j00526l6627M1452J22391K9906m3811O4427
$$ 638583 608981 678606 748961 669290 568764 532137 573589 695980 725886 682075 746502
22456G46502R1062R2193J75921J07329J49029J722j03843l5908n4231P3332J343
$$ 746502 837564 929757 1105678 1213007 1362036 1363758 1259915 1224007 1169776 1243108 1244451
22445A244451q591J33850Q3789J64198J71273P8408m77P9328K340P5226J15103
$$ 1244451 1235860 1369710 1453499 1617697 1788970 1867378 1866901 1946229 1948569 2023795 2138898
22434B138898L8334J06981J48550J18727J67353J99951K53378K77439L33054M20163
$$ 2138898 2177232 2284213 2432763 2551490 2718843 2918794 3172172 3449611 3782665 4202828
22424D202828N13934M94798P28567O85039Q12459J002128J006224J407888J719977
$$ 4202828 4716762 5211560 5940127 6625166 7437625 8439753 9445977 10853865 12573842
22415A2573842K136090K948445L988645N031966O328636Q841352J3312612K2064568
$$ 12573842 14709932 17658377 21647022 26678988 33007624 41848976 55161588 77226156
22407G7226156L7327414N6402276O9200601P3264554O7694097M4530988Q027702
$$ 77226156 114553570 170955846 240156447 313421001 381115098 425646086 433673788
22400D33673788k4930444m7628730o1070926o2034614n1450113l8114932k7202590
$$ 433673788 408743344 361114614 300043688 238009074 186558961 148444029 121241439
22393A21241439j9238924j3669227r749691p384320n773642m472543l725144l325929
$$ 121241439 102002515 88333288 78583597 71199277 65425635 60953092 57227948 53902019
22385E3902019l003460k628715k581028k185535j861611j748956j640773j594720
$$ 53902019 50898559 48269844 45688816 43503281 41641670 39892714 38251941 36657221
22377C6657221j398846j314129j182955r84670j032033r47025q10509p16334n79614
$$ 36657221 35258375 33944246 32761291 31776621 30744588 29797563 28987054 28270720 27691106
22368B7691106o04493o90897n90448p36355o98659p29546p05080o43573p14764
$$ 27691106 27086613 26395716 25805268 25068913 24370254 23640708 22935628 22292055 21577291
22359B1577291n60727n70230n29734m99497n24648m57569l11889l88475n68008
$$ 21577291 21016564 20446334 19916600 19417103 18892455 18434886 18122997 17734522 17166514
22350A7166514l70260k09336k91856m12506m75912m93618l67585j61221k62163
$$ 17166514 16796254 16586918 16295062 15882556 15406644 14913026 14545441 14384220 14122057
22341A4122057l03498k72541l37602k04165j87017j56429j33804j64840j95845
$$ 14122057 13818559 13546018 13208416 13004251 12817234 12660805 12527001 12362161 12166316
22332A2166316j15486j04501p4753J417K91568K08992J64812n8792r7113k18882
$$ 12166316 12050830 11946329 11871576 11872993 12164561 12373553 12538365 12479573 12382460 12163578
22322A2163578l35205m39335n68545n85945k24023k12700l76918l30850j66358
$$ 12163578 11828373 11389038 10820493 10234548 10010525 9797825 9420907 9090057 8923699
22313H923699l8013k14377k65202n5044l6488j03078j12800k57464l26405k14856
$$ 8923699 8885686 8671309 8406107 8351063 8314575 8211497 8098697 7841233 7514828 7299972
22303G299972j89949k50768j36507p5295j59705j12032r6982j12347q4344j03666
$$ 7299972 7110023 6859255 6722748 6647453 6487748 6375716 6278734 6166387 6082043 5978377
22293E978377j08807j77814l1618k8573j06168r4910k0860J07413r3020j14222
$$ 5978377 5869570 5691756 5660138 5631565 5525397 5430487 5409627 5517040 5424020 5309798
22283E309798j40990p0658j66616n3317j37250j01174m6264j7798J24933J4383
$$ 5309798 5168808 5098150 4931534 4878217 4740967 4639793 4593529 4575731 4700664 4715047
22273D715047j8287j88469k03938j34587k26249k46469p1429R4608N7044j29527
$$ 4715047 4696760 4508291 4304353 4169766 3943517 3697048 3625619 3720227 3777271 3647744
22263C647744k77159m4142J3286N4978L2887p9968m4436p8467m206p2620j23296
$$ 3647744 3370585 3326443 3339729 3394707 3427594 3347626 3303190 3224723 3220517 3147897 3024601
22252C024601q6556j00742n57L8388L085j37158n2890K2811j15523n1966J031
$$ 3024601 2938045 2837303 2836746 2875134 2878219 2741061 2688171 2710982 2595459 2543493 2544524
22241B544524M7337J29815J31418J89368K91949L12540K36356O3597K9305j75390
$$ 2544524 2591861 2721676 2853094 3042462 3334411 3646951 3883307 3946904 3976209 3800819
22231C800819k86326k45780l37739k86255k79733p3640j1858l6714O187J401j74811
$$ 3800819 3514493 3268713 2930974 2644719 2364986 2291346 2279488 2242774 2248961 2250362 2075551
22220B075551l3726q2429K7378j02318m9249Q008k0545l7217n1762j3854J8303
$$ 2075551 2041825 1959396 1986774 1884456 1835207 1843215 1822670 1785453 1733691 1719837 1738140
22209A738140l3848j30344L754J31756M3840k00774l0444o4797j18002j00037
$$ 1738140 1704292 1573948 1577702 1709458 1753298 1552524 1522080 1457283 1339281 1239244
22199A239244L0030J04140J24735M8566P5739p705j24528k4389O2604k6787j13648
$$ 1239244 1269274 1373414 1498149 1546715 1622454 1614749 1490221 1465832 1528436 1501649 1388001
22188A388001Q185N9422P1775j995n2879l2076j66470j85705p9067j51173l8924
$$ 1388001 1396186 1455608 1527383 1525388 1472509 1440433 1273963 1088258 1009191 858018 819094
22177H19094J35797N0453N4440R1665j2602l6883p0142o3668P3934N1885k8694
$$ 819094 954891 1005344 1059784 1151449 1138847 1101964 1031822 968154 1042088 1093973 1065279
22166A065279M29l6564K7680l0487o4638j8630j7088K2867k129J1563j73248M9637
$$ 1065279 1065708 1029144 1056824 1026337 961699 943069 925981 948848 946719 958282 785034 834671
22154H34671Q0140o0569n2101n5669j21999J10175O696n0938r881j5710J9547
$$ 834671 914811 854242 802141 746472 624473 734648 741344 690406 680525 664815 684362
22143F84362J0828L5383k9934q4020l4999l7311K0376K0918Q4518P7266m3725
$$ 684362 695190 730573 700639 616619 581620 544309 564685 585603 670121 747387 703662
22132G03662j1210l0199l7882l5811p6502L4808N9202J5033j16563R560K4474
$$ 703662 692452 662253 624371 588560 512058 546866 606068 621101 504538 514098 538572
22121E38572O5130Q251q5776p1890r9747K4963O0252j4348l4116L0702M6379m1334
$$ 538572 603702 611953 526177 454287 354540 379503 439755 425407 391291 421993 468372 427038
22109D27038R2709O00p7637j22832n1992P7293o1876Q28O1698k6924M7920K0484
$$ 427038 519747 520347 442710 319878 267886 345179 283303 284131 345829 318905 366825 387309
22097C87309n661K0192p2628j2260r609k7517O1882N8587j3828O2388J409j14901
$$ 387309 381648 401840 329212 316952 307343 279826 341708 400295 386467 448855 450264 335363
22085C35363m6750R7451l4423m5661l9522Q6942O6830l6078o6373j11437j5248
$$ 335363 288613 386064 351641 305980 266458 353400 420230 384152 317779 206342 191094
22074A91094k0764k5435J8415J16764N1970j390O9575L1878o9045j22026K6697
$$ 191094 170330 144895 163310 280074 332044 330654 400229 432107 363062 241036 267733
22063B67733m4314P7408j8266o2535O0432k3595l8039m5074n4391p2793m8706
$$ 267733 223419 300827 282561 220026 280458 256863 218824 173750 119359 46566 -2140
22052b140O0268Q9236R9194o7378j7403l1774Q0499K5664p4524l359Q1359K7038
$$ -2140 58128 147364 246558 179180 161777 130003 210502 236166 161642 158283 239642 266680
22040B66680n439j5501J7627J8341L587K9224L6741n9215J803K1492J0012j15240
$$ 266680 261241 245740 263367 281708 285295 314519 351260 292045 293848 315340 325352 210112
22028B10112k3737m0191K6224J0448o5122j42606Q6816k6430k5224J25574k9549
$$ 210112 186375 146184 172408 182856 117734 -24872 61944 35514 10290 135864 106315
22017A06315l2087k2940K0397j18975j1306N130J21605Q3733k8851k3373K5759
$$ 106315 74228 51288 71685 -47290 -58596 -53466 68139 151872 123021 99648 125407
22006A25407j30324m1120N0621j4516M6385P6366l403o960P661J185J4098P5653
$$ 125407 -4917 -46037 4584 -9932 36453 112819 109416 102456 110117 111302 125400 201053
21994B01053M2784r8155P968O9511p1475k0457j20244k7981J6322l799K2118Q7321
$$ 201053 243837 145682 153650 223161 151686 131229 10985 -16996 -674 -4473 17645 104966
21982A04966k357m2688j25751K540p47L1252R5260M9675j84673n8722K6438J8662
$$ 104966 102609 59921 -65830 -63290 -64037 -32785 62475 112150 -72523 -131245 -104807 -86145
21970h6145J7461N2761J03481m4632K6350k2434J0031m2022j9130N2008L4907
$$ -86145 -68684 -15923 87558 42926 69276 46842 56873 14851 -4279 47729 82636
21959H2636N3190L786l5137P9173R6804l0291k7916R6607K8008j04624k5671j09399
$$ 82636 135826 139612 104475 183648 280452 250161 222245 318852 346860 242236 216565 107166
21947A07166j26162O3983m3111j09566j8666O9138J7903K0258J41331P6788n521
$$ 107166 -18996 44987 1876 -107690 -126356 -57218 -39315 -19057 122274 199062 193541
21936A93541l0241j2148K2705j6732q6578j28365J524J56020J01381r938K5675
$$ 193541 163300 151152 173857 157125 70547 -57818 -56294 99726 201107 191169 216844
21925B16844J6501j1032q7582q3097K2089j6955q5200j3916o778N5096N3957m4840
$$ 216844 233345 222313 134731 51634 73723 56768 -28432 -42348 -49126 5970 59927 15087
21913A5087o4100m6093K3901N0031R1368j8425J07432l1346j39655M7988J54022
$$ 15087 -49013 -95106 -71205 -21174 70194 51769 159201 127855 -11800 36188 190210
21902A90210Q5972n4591P845j29245j66374q7385L3025J73135R3065j07374R3185
$$ 190210 276182 221591 229436 100191 -66183 -153568 -120543 52592 145657 38283 131468
21891A31468k5771j07991q2654o357L9399l1554O5817Q9186k4505q1804j67085
$$ 131468 105697 -2294 -84948 -91305 -51906 -83460 -17643 71543 47038 -34766 -201851
21880b01851l822N8183J34790J0441p4528K7267J1373j32582o8125J33231J47154
$$ -201851 -205673 -147490 -12700 -2259 -76787 -49520 -38147 -170729 -238854 -105623 41531
21869D1531L182m7665O3531J2523j26165K1997J36319J04568m5228n2040n8160
$$ 41531 44713 -2952 60579 73102 -53063 -31066 105253 209821 164593 112553 54393
21858E4393L9634P0959n6146Q7735J67656L04059J95350L25765K53463K91940
$$ 54393 94027 164986 108840 196575 364231 668290 863640 1189405 1442868 1734808
21848A734808M17753R7896n4327j90547l74281k83167j84999j29604k35435j77411
$$ 1734808 2152561 2250457 2196130 2005583 1631302 1348135 1163136 1033532 798097 620686
21838F20686j35933q3308r5276j56517L1622J41021Q4145j7808j1627q6519K8521
$$ 620686 484753 401445 306169 149652 181274 322295 406440 388632 377005 290486 319007
21827C19007P3058M614j29316K5665p3028o9089o0046N1282O9829q2361l7371
$$ 319007 392065 396679 267363 293028 220000 150911 90865 142147 211976 129615 92244
21816I2244j5531P322L0456j09709l1543n53L2237Q7702k8962r0528J32061J294
$$ 92244 76713 84035 114491 4782 -26761 -27314 4923 92625 63663 -26865 105196 106490
21804A06490j6227J33818n081j5647K8575l1692j6015L9999N0833o1316O1377
$$ 106490 90263 224081 219000 203353 231928 200236 184221 224220 275053 213737 275114
21793B75114k0794j54434j49779Q6682m5879J2847R4966L1438J9017J3906O3239
$$ 275114 254320 99886 -49893 36789 -9090 3757 98723 130161 149178 163084 226323
21782B26323j3387r6372n2712k502N7512L3940M2560Q5930j3760O098m3344j63646
$$ 226323 212936 116564 63852 61350 118862 152802 195362 281292 267532 273630 230286 66640
21770F6640o139J76776N4302j2254l8863o368k9276L9140m307j12462O2636m7068
$$ 66640 60501 237277 291579 279325 240462 234094 204818 243958 239651 127189 189825 142757
21758A42757j79171l9609N6157j05107l3839N9357J30357J8270K1815k4915j30876
$$ 142757 -36414 -76023 -19866 -124973 -158812 -99455 30902 49172 70987 46072 -84804
21747h4804p2929Q9670J72573L0674j23082O3307J6965n0084r1556N3107o7455
$$ -84804 -157733 -68063 104510 135184 12102 75409 92374 42290 -49266 3841 -63614
21736f3614q8921K6329J3344L6553l5526N1079j3568p6731J8013Q5747J3802m7479
$$ -63614 -152535 -126206 -112862 -76309 -111835 -60756 -74324 -151055 -133042 -47295 -33493 -80972
21724h0972N4631J18340p6694J044O5988J58639L854j44084j7940K0295j69392
$$ -80972 -26341 91999 15305 16349 82337 240976 244830 100746 82806 103101 -66291
21713f6291m9896O3712K6744L3825j1347R817J09428N8525J7468P8742J435r6978
$$ -66291 -116187 -52475 -25731 8094 -3253 6564 115992 174517 191985 270727 272162 175184
21701A75184o2076O4143j00230L718J42350p3178j85542q9255Q6140K8551q6084
$$ 175184 113108 177251 77021 80739 223089 149911 -35631 -124886 -38746 -10195 -96279
21690i6279j2559R7737J11982l721j0535O7647k1201m7493n7840n7835N8719J30159
$$ -96279 -108838 -11101 100881 97160 86625 154272 133071 85578 27738 -30097 28622 158781
21678A58781n8010j39020J0507K6923q6165M9121M3394L1329o5704M5991k3129
$$ 158781 100771 -38249 -27742 -819 -86984 -37863 5531 36860 -28844 17147 -5982
21667e982M9705J54619N6770R967K0930k0848J5234p7070q7358l5724j4836k8261
$$ -5982 43723 198342 255112 265079 286009 265161 280395 203325 115967 80243 65407 37146
21655C7146L1462K0349o1460o0340o7284l7046q3739P993Q4500j3052K4179J25210
$$ 37146 68608 88957 27497 -32843 -100127 -137173 -220912 -212919 -128419 -141471 -117292 7918
21643G918j882J336q1994P3241l8959n6800J4125j879J0394J41906K1574P8019
$$ 7918 6036 7372 -74622 -1381 -40340 -97140 -83015 -84894 -74500 67406 88980 166999
21631A66999l6771j8132K3998R6829J06832r8686o1688O2620J6378m5730j56538
$$ 166999 130228 112096 136094 232923 339755 241069 179381 242001 258379 212649 56111
21620E6111j08172P0959J38571q4011k1843m5351k9821M7135Q5731N1627j21599
$$ 56111 -52061 18898 157469 73458 51615 6264 -23557 23578 109309 160936 39337
21609C9337p8859n7221L3356M1817N8803L3823n7406q5580p959J02919M4091J20069
$$ 39337 -39522 -96743 -63387 -21570 37233 71056 13650 -71930 -79889 23030 67121 187190
21597A87190j06363q5357J3414J6105k2688M2503J19463J20268n6826j06107k1730
$$ 187190 80827 -4530 8884 24989 2301 44804 164267 284535 227709 121602 99872
21586I9872p3154p7618N8825P124L7845M4176l829J4159O9984j9278j8512L9720
$$ 99872 26718 -50900 7925 15049 52894 97070 93241 107400 177384 158106 139594 179314
21574A79314J6770l3406j88688p2382L8378J51022J79614l2879m7354j58136K3681
$$ 179314 196084 162678 -26010 -98392 -60014 91008 270622 237743 190389 32253 55934
21563E5934R6675N0624m9373O163l2910J2173l4194j5506M5228n8336m5638o5027
$$ 55934 152609 203233 153860 160023 127113 139286 105092 89586 134814 76478 30840 -34187
21551c4187R8937P6643M2400m5694R2356Q524j19515o1119O442P1631N0398n8313
$$ -34187 64750 141393 183793 138099 230455 238979 119464 58345 64787 136418 186816 128503
21539A28503k03314O5752J34098J53011J0848j320l0244j38085j9507j0718M0407
$$ 128503 -74811 -9059 125039 278050 288898 287578 257334 119249 99742 89024 129431
21528A29431o0275L9429J4383l2191r7960O7849m0987n0985Q4061k4571J6172
$$ 129431 69156 108585 122968 90777 -7183 60666 19679 -31306 52755 28184 44356
21517D4356k5678N1523J3374J2268q8464q2597k2531K3538K0539Q4387J43724
$$ 44356 18678 70201 83575 95843 7379 -75218 -97749 -74211 -53672 30715 174439
21506A74439Q6813l6044j80918j35447R3428l2889l8442j2342p1638M0274O7041
$$ 174439 261252 225208 44290 -91157 2271 -30618 -69060 -81402 -153040 -112766 -45725
21495d5725J09069O3081r6718n5747R9614j03140l1989K2597M169J4007M7801
$$ -45725 63344 126425 29707 -26040 73574 -29566 -61555 -38958 -34789 -20782 27019
21484B7019o6757O7039N5997j02094o2829M7343J06897m3885n4196J0271N2218
$$ 27019 -39738 27301 83298 -18796 -81625 -34282 72615 28730 -25466 -15195 37023
21473C7023q2844m5996q0339K21156K9076N0648Q2538o0114r1397o8652l9821
$$ 37023 -45821 -91817 -172156 49000 78076 128724 211262 151148 59751 -8901 -48722
21462d8722L3547K3421M8556j7228n1805M3310J24037M1626q1154m2374r79j3768
$$ -48722 -15175 8246 56802 39574 -12231 31079 155116 196742 115588 73214 72235 58467
21450E8467p681R8166p8582m0666m7930j1464q8284k804j46223L9246J88606J0504
$$ 58467 50786 148952 70370 29704 -18226 -29690 -117974 -120778 -267001 -227755 -39149 -28645
21438b8645k2342j2713P7680n6661n1514J19059R0551L6198l2263j38585m4670
$$ -28645 -50987 -63700 13980 -42681 -94195 24864 115415 151613 119350 -19235 -63905
21427f3905J02998J29333k5880l0429J0636P4288n255n3026j92080r0603Q6870
$$ -63905 39093 168426 142546 112117 122753 197041 191786 138760 -53320 -143923 -57053
21416e7053Q6379l7019p7155J38389J60766n7658j15507q1911j01248Q4734R6371
$$ -57053 29326 -7693 -84848 53541 214307 156649 41142 -40769 -142017 -57283 39088
21405C9088N6289l9938M3980p1543o3121j274O7754Q1560J2517Q2289R663q6372
$$ 39088 95377 55439 99419 27876 -35245 -36519 31235 112795 125312 207601 217264 130892
21393A30892r3692k8610L3405K2727k568L5871o992O9183q9078j79250n0855L2102
$$ 130892 37200 8590 41995 64722 62154 98025 91033 160216 71138 -108112 -158967 -126865
21381a26865N3777P9052j1366M3269k2934J16609R823r6545j26706M2586P0286
$$ -126865 -73088 5964 -5402 37867 14933 131542 141365 44820 -81886 -39300 30986
21370C0986j1791n0k8206L0848P1246k4453j00066m9225Q7590o7334j6462j316
$$ 30986 19195 19145 -9061 21787 93033 68580 -31486 -80711 6879 -60455 -76917 -78233
21358g8233L3247n3116l2759O2182L7561J20096J31539P6490j75784j49529k5297
$$ -78233 -44986 -98102 -130861 -68679 -31118 88978 220517 297007 121223 -28306 -53603
21347e3603L8196R1487J15171k7045j78062p7350L0870R5170N8515o0560j05990
$$ -53603 -15407 76080 191251 164206 -13856 -91206 -60336 34834 93349 32789 -73201
21336g3201N0316j0450N3116P6730N624N2734n2106j631q2238p057N5186N8693
$$ -73201 -22885 -33335 19781 96511 102135 154869 102763 101132 18894 11837 67023 125716
21324A25716J0226n6984q6863M9443K6865r3799P6129L943M2073M1680k1209q1521
$$ 125716 135942 78958 -7905 41538 68403 -25396 50733 54676 96749 138429 117220 35699
21312C5699K7754Q6291q7085j37966j8201P5146P8057J01737O746r3371l0584
$$ 35699 63453 149744 62659 -75307 -93508 -18362 59695 161432 168178 74807 44223
21301D4223M2314p6034J2907J09242M3141j83241j01733n5983K6006Q4252M0104
$$ 44223 86537 10503 23410 132652 175793 -7448 -109181 -165164 -139158 -54906 -14802
21290a4802P22M3177j0114N0386J15775P4539P802j47347K0069o9475o2101p2247
$$ -14802 -14080 29097 18983 69369 185144 259683 267485 120138 140207 70732 8631 -63616
21278f3616J1081m601J7665n027j3598P2968M1343Q5906K7956j14547n3106l0619
$$ -63616 -52535 -57136 -39471 -44498 -58096 14872 56215 142121 170077 55530 2424 -28195
21266b8195n1085m1772J00272P9905k0967k2322l9031j1048p4485J25222P2876
$$ -28195 -79280 -121052 -20780 59125 38158 15836 -23195 -34243 -108728 16494 89370
21255H9370J05176j7242n7242l2579M1235j8685l0948k0509r8584P3185Q2194
$$ 89370 194546 177304 120062 87483 128718 110033 79085 58576 -40008 33177 115371
21244A15371R5207J01428l8231j42724l8221O542m6403j08113j01381q712N7124
$$ 115371 210578 312006 273775 131051 92830 99372 52969 -55144 -156525 -165237 -108113
21233a08113P4443J7887o4816j51738J016M9587K8694r3275l2049J14312J18005
$$ -108113 -33670 -15783 -80599 -232337 -231321 -181734 -153040 -246315 -278364 -164052 -46047
21222d6047j9682j315R9678K9315K6472r8735j4438j4440q2572l9577J13275K8790
$$ -46047 -65729 -67044 32634 61949 88421 -10314 -24752 -39192 -121764 -161341 -48066 -19276
21210a9276l4546J0883O4463r7973r158L4573M0754l460J08932M3737k2428m3561
$$ -19276 -53822 -42939 21524 -76449 -85607 -51034 -10280 -13740 95192 138929 116501 72940
21198G2940o1697J36898J01418q5484r2607K5863k5257L7834r2043j19127J4158
$$ 72940 11243 148141 249559 164075 71468 97331 72074 109908 17865 -101262 -87104
21187h7104q414N2353Q991o2988O972k6631M9246J3888J6396o2695j5366l1050
$$ -87104 -95518 -43165 -34174 -97162 -90190 -116821 -67575 -53687 -37291 -99986 -115352 -146402
21175a46402n6567O3622j9695J7109J54690L0005j3720L7816o0013K4945R4347
$$ -146402 -202969 -139347 -159042 -141933 12757 42762 29042 66858 6845 31790 126137
21164A26137k215r0524m7367n4173J12184J01996r7101Q026l3368q2349n1310
$$ 126137 123922 33398 -13969 -68142 44042 146038 48937 56963 23595 -58754 -110064
21153a10064J03569M6455r3639p7818Q8350J31676n7004j35922p4684N9874N1174
$$ -110064 -6495 39960 -53679 -131497 -43147 88529 31525 -104397 -179081 -119207 -68033
21142f8033R2539Q0038p338J9582m8172O7474l4406k7863o1842K912m4061k8779
$$ -68033 24506 104544 97206 116788 68616 136090 101684 73821 11979 14891 -29170 -57949
21130e7949J6205l9699R7321M6251q9543l2693J1812K6360K5232j6467r2883j31789
$$ -57949 -41744 -81443 15878 62129 -27414 -60107 -48295 -21935 3297 -13170 -106053 -237842
21118b37842J26082J85566n1644p8275L906n9959l1230J55754J71844J9368p0665
$$ -237842 -111760 73806 22162 -56113 -52207 -112166 -143396 12358 184202 203570 132905
21107A32905n1544p0423m4803p5239O7074R7484J15821J06861J20285l6934j93202
$$ 132905 81361 10938 -33865 -109104 -42030 55454 171275 278136 398421 361487 168285
21096A68285j07041l3053q4025R982l2098p1970K9457R0410o301J08187J20775
$$ 168285 61244 28191 -55834 -45852 -77950 -149920 -120463 -30053 -36354 71833 192608
21085A92608m4360j01632q0023p3696m5159J13621l6875J11085k1385M0882l2182
$$ 192608 148248 46616 -33407 -107103 -152262 -38641 -75516 35569 14184 55066 22884
21074B2884J1434N2767j5121n1886j32378N7774j4021j3426J1371o1965k7060
$$ 22884 34318 87085 71964 20078 -112300 -54526 -68547 -81973 -70602 -132567 -159627
21063a59627L848N6431N9469j8212N8537Q2165n9363o817R8997j0891j69981o1522
$$ -159627 -155779 -99348 -39879 -58091 446 82611 23248 16431 115428 104537 -65444 -126966
21051a26966M3831p7428J50954L1449K4964P0488l7723m0275Q239o4896k3943
$$ -126966 -83135 -160563 -9609 21840 46804 117292 79569 39294 47533 -17363 -41306
21040d1306J6312J0638R5624P4947l4515j13724p7443N603o1724R4105j04462
$$ -41306 -24994 -14356 81268 156215 121700 7976 -69467 -63864 -125588 -31483 -135945
21029a35945j05905r9677O8650K23037M2564r7100J7008L2083l8779K2224K6701
$$ -135945 -241850 -341527 -272877 -49840 -7276 -104376 -87368 -55285 -94064 -71840 -45139
21018d5139Q3901J603l3145o848M3387J4831p6327n0533L9998O8708o237l5973
$$ -45139 38762 40365 7220 372 43759 58590 -17737 -68270 -28272 40436 34199 -1774
21006a774O4935M1038m7683m089q9326Q8196M8648q2326n7515M0556p147P3609
$$ -1774 63161 104199 56516 52427 -36899 51297 99945 17619 -39896 660 -6487 67122
20994F7122r985n3613j2507l9790k5530J5723J20074P9271J01908M4840j06931
$$ 67122 57137 3524 -8983 -48773 -74303 -58580 61494 140765 242673 287513 180582
20983A80582j33184o1943J05941J7484o1310j67445M7429R3312M5935j5817L1807
$$ 180582 47398 -14545 91396 108880 47570 -119875 -72446 20866 66801 50984 82791
20972H2791q2287K2423r081m1790O7478m5295n5890j02881o004L1077J19815J49570
$$ 82791 504 22927 13846 -27944 39534 -5761 -61651 -164532 -170536 -139459 -19644 129926
20960A29926R1526l1832j30301j33344j5824N014J9413P5277L3941P9675j60916
$$ 129926 221452 189620 59319 -74025 -89849 -84835 -65422 9855 43796 123471 -37445
20949c7445j33764R4070O7348m3329j4700N6815O2734N2279Q551j06604k6560
$$ -37445 -171209 -77139 -9791 -53120 -67820 -11005 51729 104008 112559 5955 -20605
20938b0605k7596n7241P6320M8250J04190K3421m2302P4673N7080m2238p4163
$$ -20605 -48201 -105442 -29122 19128 123318 146739 104437 179110 236190 193952 119789
20927A19789n571q3918j54465l9806J16091k0683q1378J7250O6108J0641o2m3229
$$ 119789 114218 30300 -124165 -163971 -47880 -68563 -149941 -132691 -66583 -55942 -56004 -99233
20915i9233j0000J49956j29823n0159L6948J17405K3680r0757n9587J38020O3593
$$ -99233 -109233 40723 -89100 -139259 -102311 15094 38774 -51983 -111570 26450 90043
20904I0043M4499j13762q893m2817j66114L8763O5899N4032J23678N7689j3800
$$ 90043 134542 20780 11887 -30930 -197044 -158281 -92382 -38350 85328 143017 129217
20893A29217r8257R183n6506m7238r4910l9252o201R5524N7160O3987J09043r1214
$$ 129217 30960 40143 -16363 -63601 -158511 -197763 -203964 -108440 -51280 12707 121750 30536
20881C0536Q8895J56320q029j47385O707K5434o1207j9872L3294l0054m6457j28064
$$ 30536 119431 275751 267722 120337 127044 152478 91271 71399 104693 74639 28182 -99882
20869i9882Q3965M5729K5246L0229Q292J12511p955m3197j4520n122L3600j36473
$$ -99882 -15917 29812 55058 85287 93579 206090 198135 154938 140418 135296 168896 32423
20857C2423o2935M1737k488K5172k9914k0923m54n3795n8378J09995j13110K9306
$$ 32423 -30512 11225 8737 33909 3995 -16928 -17382 -71177 -129555 -19560 -132670 -103364
20845a03364O4933l2671J15335J57838j9406p0339j68559k9880K24369K06673
$$ -103364 -38431 -71102 44233 202071 182665 112326 -56233 -86113 138256 344929
20835C44929j44157j17675j6651j43233K314J31731O0679M9716m7652l3904o401
$$ 344929 200772 83097 66446 -76787 -74473 57258 117937 167653 120001 86097 79696
20824G9696l8002q2884l7218K1463L733J991k280j40125j9199Q1176J01908m8842
$$ 79696 41694 -41190 -78408 -56945 -53212 -51221 -53501 -193626 -212825 -131649 -29741 -78583
20812g8583q9866P3012J41831O3283m6418j02952K8169k820o002J2933j9142Q5709
$$ -78583 -168449 -95437 46394 109677 63259 -39693 -11524 -14344 -20346 -7413 -26555 59154
20800E9154M7872l5155l9789q399M7759n9207r9264o6886l6216r08R8568n1898
$$ 59154 107026 71871 32082 23683 71442 12235 -87029 -153915 -190131 -191039 -92471 -144369
20788a44369m2223J53308L9996O8447k2756o8472j39276J4580J24401O5688L5264
$$ -144369 -186592 -33284 6712 75159 52403 -16069 -155345 -140765 -16364 49324 84588
20777H4588J00504j51374m5819n7j16853J19058J91272O6558j16363j11888M0888
$$ 84588 185092 33718 -12101 -12158 -129011 -9953 181319 247877 131514 19626 60514
20766F0514j64627O6436J83933l1842j06994K1035Q2677M3594j35553p479N5413
$$ 60514 -104113 -37677 146256 114414 7420 28455 111132 154726 19173 11694 67107
20755F7107N9159M3997k4702j03251j35139L7592Q7458p7893j90958p223P3029
$$ 67107 126266 170263 145561 42310 -92829 -55237 32221 -45672 -236630 -243853 -170824
20744a70824J28594O4929j937n4703O6119M7666p5279n0682j8253M8557N6140
$$ -170824 -42230 22699 20762 -33941 32178 79844 4565 -46117 -64370 -15813 40327
20733D0327K42M3826N5658N8198q4329j41347o6651P5629N4477L9427n472j70162
$$ 40327 40569 84395 140053 198251 113922 -27425 -94076 -18447 36030 75457 69985 -100177
20721a00177p956M7907J0256M5068L5844m700q4905L889j14155J816J345L7524
$$ -100177 -108133 -60226 -49970 -4902 30942 26242 -58663 -54774 -168929 -167113 -165768 -128244
20709a28244K5831O7870q785p2840Q1580O3621p943p7488l509l7859j309M5923
$$ -128244 -102413 -34543 -43328 -116168 -34588 29033 21090 -56398 -59907 -97766 -99075 -53152
20697e3152P5506L9289L662J3553N999q0149l283O1927j08969O416O5019J5390
$$ -53152 22354 61643 65305 78858 84857 4708 1425 63352 -45617 -39201 25818 41208
20685D1208j8937o6819j02924k3241j6138M8737M6999J03565L8926J35745J40573
$$ 41208 22271 -44548 -147472 -170713 -186851 -138114 -91115 12450 51376 187121 327694
20674C27694p7891p5558J235o326J5405n5020o0193q3394m5509k1996O7584J84744
$$ 327694 249803 174245 175480 169154 184559 129539 69346 -14048 -59557 -81553 -13969 170775
20662A70775Q1242j63495K3944R7815m5975j74799l1144P5795L8487l0160q4085
$$ 170775 252017 88522 112466 210281 164306 -10493 -41637 34158 72645 42485 -41600
20651d1600J30337l0763m6234k8709k0502M6655L4449j2660j26788J1778J68689
$$ -41600 88737 57974 11740 -16969 -37471 9184 43633 30973 -95815 -84037 84652
20640H4652N2511J1773K4909k524J4004j277n1242o2487J2311m0480J8689J00025
$$ 84652 137163 148936 173845 171321 185325 184048 132806 70319 82630 42150 60839 160864
20628A60864j5999j39999j35406K6223J6928J7277N7615Q4196J15763P237J4711
$$ 160864 144865 4866 -130540 -104317 -87389 -70112 -12497 71699 187462 194699 209410
20617B09410o8429q8410l8396j94033j05861Q8775O5746J42440M7440l2300L1652
$$ 209410 140981 52571 14175 -179858 -285719 -196944 -131198 11242 58682 26382 58034
20606E8034O8706l4895J5280p479K6915M4134J5315m9956r5169J21864O5793J34262
$$ 58034 126740 91845 107125 99646 126561 170695 186010 136054 40885 162749 228542 362804
20594C62804K9267j18209r3529j66335o2436J57297m9992K9580j8047q47J03996
$$ 362804 392071 273862 180333 13998 -48438 108859 58867 88447 70400 69553 173549
20583A73549l7357j6215L2832L402j05367j75636P3910M1509J0Q0748L904N7o5943
$$ 173549 136192 119977 152809 156211 50844 -124792 -50882 -9373 -9363 71385 75289 75346 9403
20570I403l5257r7581R315J72636P0096j41803j14281j4733K2796M7249m7199
$$ 9403 -25854 -123435 -114120 58516 128612 -13191 -127472 -142205 -119409 -72160 -119359
20559a19359j9875Q1890o051m4324N2434J07872M306q1107p1242J21288J4446
$$ -119359 -139234 -57344 -63395 -107719 -55285 52587 56893 -24214 -95456 25832 40278
20548D0278M335r926j102K295N1040K1467J872p0797p5534n667J7907O0282n5580
$$ 40278 44613 34687 33585 35880 86920 108387 110259 39462 -36072 -41739 -23832 36450 -19130
20535a9130K0032K3777P720R8598K6575j4150n3350m2238Q1205k4073n7776j7053
$$ -19130 902 24679 32399 130997 157572 143422 90072 47834 129039 104966 47190 30137
20523C0137q2206j22685J30519J10087k4379J2740O0836P8645j06505m8421J44824
$$ 30137 -52069 -174754 -44235 65852 41473 54213 115049 193694 87189 38768 183592
20512A83592k330n2292k2748j61691M9134O8209p2097o4787q6175j5112p2266
$$ 183592 181262 128970 106222 -55469 -6335 61874 -10223 -75010 -161185 -176297 -248563
20501b48563L0006J63082J38611l3213j4838k5438p2599l9718L4474O762J51045
$$ -248563 -218557 -55475 83136 49923 35085 9647 -62952 -102670 -68196 -61434 89611
20490H9611J13195o1596j8385j01710L0070P3881k690k0019L2465o0117r6967
$$ 89611 202806 141210 122825 21115 51185 125066 122376 102357 134822 74705 -22262
20479b2262K6130L747j0666M7751l5556L2395J2200Q775L6425O6188l6343m3652
$$ -22262 3868 7615 -3051 44700 9144 41539 53739 62514 98939 165127 128784 85132
20467H5132j19953j7246Q7535P9087L3180P2172q6991k5921M0531M3431N940J832
$$ 85132 -34821 -52067 35468 114555 147735 219907 132916 106995 147526 190957 196897 198729
20455A98729m0828L2906P6816n5120o2893j14404o1511N7878m6115O0764M9288
$$ 198729 157901 190807 267623 212503 149610 35206 -26305 31573 -14542 46222 95510
20444I5510K6777k4055M5267J3488L5936J9233m503j31770q9099M856J9563Q081
$$ 95510 122287 98232 143499 156987 192923 212156 207653 75883 -13216 -8360 11203 19284
20432A9284M110K7036L7311L9863p0189p3699j17338p4908M2158Q2195k0973K6478
$$ 19284 23394 50430 87741 127604 57415 -16284 -133622 -208530 -166372 -84177 -105150 -78672
20420g8672K02807N1550n3170K4826J5812k2657q3139l7155j6598K2150p160j32880
$$ -78672 124135 175685 122515 147341 163153 140496 57357 20202 3604 25754 18594 -114286
20408a14286l013l445N0315J22751R9188J4838j23237r598N5848q97O4932m2807
$$ -114286 -117299 -120744 -70429 52322 151510 166348 43111 33513 89361 88464 153396 110589
20396A10589m0597l3064M0840N9557q9819k8332J01434o5525j19615J2382J1812
$$ 110589 69992 36928 77768 137325 47506 19174 120608 55083 -64532 -52150 -40338
20385d0338j8810N8656j296m2681o4736o091R8954P9358P7715m1921m4754p4263
$$ -40338 -59148 -492 -1788 -44469 -109205 -115296 -16342 63016 140731 98810 54056 -20207
20373b0207J44956J18816m3353j07313o4408q8533J94885P3926m9468J4971m1894
$$ -20207 124749 243565 200212 92899 28491 -60042 134843 208769 159301 174272 132378
20362A32378q9440L8243O6171k303p4362O5457K4342r0465k9105M2374K6651K8378
$$ 132378 42938 81181 147352 145049 70687 136144 160486 70021 40916 83290 109941 138319
20350A38319n6716J29624j26090j6241J30694M9j35807j29404j37916P52J15076
$$ 138319 81603 211227 85137 68896 199590 199639 63832 -65572 -203488 -202736 -87660
20339h7660K2315L8366O3084P2253l942l7221R2358k3718r9766K3026J08943k7847
$$ -87660 -65345 -26979 36105 108358 104416 67195 159553 135835 36069 59095 168038 140191
20327A40191q9355o5485M0069K8405P6231J26450M1833O334m410o0636m6620o1238
$$ 140191 50836 -14649 25420 53825 130056 256506 298339 304673 300263 239627 193007 131769
20315A31769J9313m7046q5779q603N8063Q3018J31849r944m0741n574n6228j10861
$$ 131769 151082 104036 18257 9654 67717 150735 282584 272640 231899 226325 170097 59236
20303E9236n7662N797Q310P4916O4455p5253n069K960J7738O9313Q093M9244L1187
$$ 59236 1574 7371 15681 90597 155052 79799 74730 77690 95428 164741 172834 222078 253265
20290B53265m0324o6203N2383R950m1201L6258J3592Q6035l9028q0361O6550n5019
$$ 253265 212941 146738 199121 209071 167870 204128 217720 303755 264727 184366 250916 195897
20278A95897j42087O9926P0208n6453n0526l3264K0786r1329o6483K5851O1872
$$ 195897 53810 123736 193944 137491 86965 53701 74487 -16842 -83325 -57474 4398
20267D398N2989P7925M2711Q365L4528n8652l6776N7867R4585k7653k712l6022
$$ 4398 57387 135312 178023 186388 220916 162264 125488 183355 277940 250287 247575 211553
20255B11553j2955k0606k4361M0383P4072j31843m2675J8050k9649o2674M9812
$$ 211553 198598 177992 153631 194014 268086 136243 93568 111618 81969 19295 69107
20244F9107J87202J6414j25058N5234M3081L4881k7562K5209N9454k3856J18331
$$ 69107 256309 272723 147665 202899 245980 280861 253299 278508 337962 314106 432437
20233D32437J10252Q2262J28717n3470k5184K7020k3479L820L28j8836l6603O1756
$$ 432437 542689 624951 753668 700198 675014 702034 678555 682375 682703 663867 627264 689020
20221F89020j0933q8705n8736O1885M5414l7072L2887P7204q8275p4342q194j7887
$$ 689020 678087 589382 530646 592531 637945 600873 633760 710964 622689 548347 540153 522266
20209E22266m1752j02103j7631J57614J54687J05717j05175M937M5600P3806N9453
$$ 522266 480514 378411 360780 518394 673081 778798 673623 678560 724160 797966 857419
20198H57419Q5161r1552q3071m7383k5264n3777m0957J57833K37006L8093m7969
$$ 857419 942580 851028 767957 720574 695310 641533 600576 758409 995415 1033508 985539
20187I85539n1217n5619j10709N2021J1983J07025k00786k07716p0647M373L3843
$$ 985539 934322 878703 767994 820015 831998 939023 738237 530521 459874 464247 498090
20176D98090K6677j6050m1663M7285Q8317o4094j11443l3862J03147L7519j20636
$$ 498090 524767 508717 467054 514339 602656 538562 427119 393257 496404 533923 413287
20165D13287j26772N162L4103R7857J51204N8551n9550R2581l0277r0414l0802
$$ 413287 286515 291677 325780 423637 574841 633392 573842 666423 636146 545732 514930
20154E14930m2882n8756p6646M1557J3883M3516j6974n0530J8662q7984p6350
$$ 514930 472048 413292 336646 378203 392086 435602 418628 368098 386760 298776 222426
20143B22426l7815j54054j01434J53520J45743o1117l5633N7834p8359N156j16253
$$ 222426 184611 30557 -70877 82643 228386 167269 131636 189470 111111 116267 14
20132A4M088L7637K3197R3511P0537L3491j2389J4826n4738K4465N4555o1670
$$ 14 4102 41739 64936 158447 228984 262475 250086 264912 210174 234639 289194 227524
20120B27524q7721k7789N8736N2294Q470j28129n8197M6245P8165N5992j0133
$$ 227524 139803 112014 170750 223044 231514 103385 45188 91433 169598 225590 215457
20109B15457J07529O5159n2433j02550p0037j1675n5027j33053m8733p9534R7020
$$ 215457 322986 388145 335712 233162 163125 151450 96423 -36630 -85363 -164897 -67877
20098f7877J08430M0516k1351k5930P1462j41955p7109N1736J2942M3993J73934
$$ -67877 40553 81069 59718 33788 105250 -36705 -113814 -62078 -49136 -5143 168791
20087A68791J7434j30423j34458K30277J8911j05181n2382k1433M8641Q548n6201
$$ 168791 186225 55802 -78656 151621 170532 65351 12969 -8464 40177 48725 -7476
20076g476O501P9932l6592k2230M2540P2150O439l1778M7422j4216j12650j3696
$$ -7476 -975 78957 42365 20135 62675 134825 141264 109486 156908 142692 30042 16346
20064A6346Q1570O6396m2810o1026n0045p6144K9446L6514L2669J42850O9458
$$ 16346 97916 164312 121502 60476 10431 -65713 -36267 247 32916 175766 245224
20053B45224j4918n2032l388K4280j550l7713o2590K9504L3974L3307m9149J00658
$$ 245224 230306 178274 174886 199166 197616 159903 97313 126817 160791 194098 144949 245607
20041B45607r022j2130J36488Q7834j40302o5599j25468q2685l8670J33586R2246
$$ 245607 236585 224455 360943 448777 308475 242876 117408 34723 -3947 129639 221885
20030B21885M219r602P806l7685q6366q0315R4986O0481M5635k4674Q7781J55658
$$ 221885 226104 216502 224308 186623 100257 19942 114928 175409 221044 196370 284151 439809
20018D39809r3953l9338p4092j35678l8615n1256k6383O9638o3055j1142L1195
$$ 439809 345856 306518 232426 96748 58133 6877 -19506 50132 -12923 -24065 7130
20007G130J84762O223l8554N7014J52620m4487M3760k7541j05913J1635L6329
$$ 7130 191892 198115 159561 216575 369195 324708 368468 340927 235014 246649 282978
19996B82978P6235j6723m4789N142j5736j07953l377J15100j48179j50261M9112
$$ 282978 359213 342490 297701 302843 287107 179154 175777 290877 142698 -7563 41549
19985D1549R0355J42572P2560q8559o9338n3444K8798M6393K714k2258j21188
$$ 41549 131904 274476 347036 258477 189139 135695 164493 210886 213600 191342 70154
19974G0154J4731o058J11052O442j6734k3208M5772m0420M1672L8916p5462o2504
$$ 70154 84885 78827 189879 196321 179587 156379 202151 161731 203403 242319 166857 104353
19962A04353n9435L5662R8850M2483q0098r1579M662r2379J09168J07601K215
$$ 104353 44918 80580 179430 221913 141815 50236 54898 -37481 71687 179288 181503
19951A81503j46280K2050P7342r318J4160R4514q981N2942M7982o0390n0595n6443
$$ 181503 35223 57273 134615 125297 139457 233971 224990 277932 325914 265524 214929 158486
19939A58486j16183M7780m6371M2322L1558J32877O4959l6087j4082j00542k0203
$$ 158486 42303 90083 43712 86034 117592 250469 315428 279341 265259 164717 144514
19928A44514K2218J2132p2609O2698P2611N3971j18096j1275K128j04381r4514
$$ 144514 166732 178864 106255 168953 241564 295535 177439 166164 168292 63911 -30603
19917c0603R717J35187R8339N6523o412n16q6734k6712N0310o123m7044N6445
$$ -30603 -20886 114301 212640 269163 262751 262235 175501 148789 199099 192976 145932 202377
19905B02377l7997N3822J0481l6588L6608m3752l7961j1706N0341L6573o6612
$$ 202377 164380 218202 228683 192095 228703 184951 146990 135284 185625 222198 155586
19894A55586m3483P1771K2908Q434m3713M0733M6205J2578K4602K128N7244N802
$$ 155586 112103 183874 206782 215216 171503 212236 258441 271019 295621 297749 354993 360795
19882C60795j10751K936R2430L8122m0913R3358Q5777o6711q8556l6720O7966
$$ 360795 250044 252980 345410 383532 342619 435977 521754 455043 366487 329767 397733
19871C97733J2669k03679j1086J2838R157N9611k9881j04342m2879k5522O1998
$$ 397733 410402 206723 195637 208475 217632 277243 247362 143020 100141 74619 136617
19860A36617N9022M273J03716j7278N6165R389m0848J890j22223R9610O91j4773
$$ 136617 195639 199912 303628 286350 342515 351904 311056 312946 190723 290333 291024 276251
19848B76251P8397n6660p7289k0238q3964r801n0365Q8199J72734O136L7909l8868
$$ 276251 354648 297988 220699 200461 116497 106696 56331 144530 317264 323400 361309 322441
19836C22441j21310m9683O7299J4712j3251K3811N2950L0710l3760N246l9841
$$ 322441 201131 151448 218747 233459 220208 244019 296969 327679 293919 299165 259324
19825B59324q9050Q1237M4891J63031J01456o7106l3946j21538k4885L957r4542
$$ 259324 170274 251511 296402 459433 560889 493783 459837 338299 313414 317371 222829
19814B22829l2688l0328Q3696J43533J6026p3656L139J08741J20166m9223k1258
$$ 222829 190141 159813 243509 387042 403068 329412 332551 441292 561458 512235 490977
19803D90977L6128l4398n9764p1689J7211k265q5568l1810o038O3148J07285Q6265
$$ 490977 527105 492707 432943 361254 378465 376200 290632 258822 252784 315932 423217 509482
19791E09482N0750q0682j25250k2303J2314L0007j52920J41522k3544k1503l0279
$$ 509482 560232 479550 354300 331997 344311 374318 221398 362920 339376 317873 287594
19780B87594R4858J44720q2359l9698L2453J4929M168J17034j9338L5918q1428
$$ 287594 382452 527172 444813 405115 437568 452497 456665 573699 554361 590279 508851
19769E08851O9452R1492q769N5446k8094l1430R7803O4464k262j0989k4038l8528
$$ 508851 578303 669795 661026 716472 688378 656948 754751 819215 816953 805964 781926 743398
19757G43398p736N3271J36412R1615j5056p1618j58346J7757J26767L6394m6160
$$ 743398 735662 788933 925345 1016960 1001904 930286 771940 789697 916464 952858 906698
19746I06698o3926o4751n1602o8346K114O7345Q2179O3472M2645M5117J40947
$$ 906698 842772 778021 726419 658073 660187 727532 809711 873183 915828 960945 1101892
19735A101892q687j7868O9661J0303l6732q9304r504J42122Q2218k167J38343
$$ 1101892 1093205 1075337 1144998 1155301 1118569 1029265 1019761 1161883 1244101 1241934 1380277
19724A380277M033n4617J01961j25786M1304J16450j44317k040N695L3494N9110
$$ 1380277 1384310 1329693 1431654 1305868 1347172 1463622 1319305 1317265 1322960 1356454 1415564
19713A415564J4813n3940O8466J68098J76271J41560J41955K56648J48193k4529
$$ 1415564 1430377 1376437 1444903 1613001 1789272 1930832 2072787 2329435 2477628 2453099
19703B453099K70937J99379J87764R1474j5440p0902p6145M3566K21296L36600
$$ 2453099 2724036 2923415 3111179 3202653 3187213 3116311 3040166 3083732 3305028 3641628
19693C641628L46101L02528M52372L38375J07553K35783K00163J42981p6601K39276
$$ 3641628 3987729 4290257 4742629 5081004 5188557 5424340 5624503 5767484 5690883 5930159
19683E930159K50927J34718K76966N38501Q22774Q83131R39260R77980J337522
$$ 5930159 6181086 6315804 6592770 7131271 7954045 8837176 9776436 10754416 12091938
19674A2091938J768577K462426L605319N416532Q586898J2949527J5199633J1538605
$$ 12091938 13860515 16322941 19928260 25344792 33931690 46881217 62080850 73619455
19666G3619455M435357P61295L111713O372339M035062k787764p801580p497256
$$ 73619455 78054812 78816107 81927820 88300159 92335221 89547457 81745877 74248621
19658G4248621l613525J852291Q322555J1668766P640099L89023k390437R16475
$$ 74248621 70635096 72487387 80809942 92478708 100118807 100507830 98117393 99033868
19650I9033868M010864O59684o686437j1663283j1569780r263609o841708m341107
$$ 99033868 103044732 103704416 97017979 85354696 73784916 64521307 57679599 53338492
19642E3338492k112978k13706J921981N059964R367936J3431262J3034911O671221
$$ 53338492 51225514 51011808 52933789 57993753 67361689 80792951 93827862 100499083
19634A00499083N21496K73304M520027N663832k8403p136205r517131o967357
$$ 100499083 101020579 101293883 105813910 111477742 111449339 104313134 94796003 87828646
19626H7828646j932194M499811R995251R702193L058584k592081j754671K437071
$$ 87828646 85896452 90396263 100391514 110093707 113152291 110560210 108805539 111242610
19618A11242610K484244l962996j1214117j3723140j2274844r900069p538798
$$ 111242610 113726854 109763858 98549741 84826601 72551757 62651688 55112890
19611E5112890n791562m210663l285994k719287k223757j955976j949831j453087
$$ 55112890 49321328 45110665 41824671 39105384 36881627 34925651 32975820 31522733
19603C1522733j233881j165194q64243p51896p43996n37306o87484o40085p86085
$$ 31522733 30288852 29123658 28259415 27507519 26763523 26226217 25538733 24898648 24112563
19594B4112563q31161o46574n46758m72919n49790p39885n70005n32667l56811
$$ 24112563 23281402 22634828 22088070 21615151 21065361 20325476 19755471 19222804 18865993
19585A8865993k57197n20724n11385m79008m75417l86554l65676k76967l52301
$$ 18865993 18608796 18088072 17576687 17097679 16622262 16235708 15870032 15593065 15240764
19576A5240764k68613k42205n11583m59633k81419l29966k23357k10612k39947
$$ 15240764 14972151 14729946 14218363 13758730 13477311 13147345 12923988 12713376 12473429
19567A2473429k90727j98217l22750k93687j89718j80493j11068j22847j90281
$$ 12473429 12182702 11984485 11661735 11368048 11178330 10997837 10886769 10763922 10573641
19558A0573641k24336k84945l6465L047j14605k04112j63932l09619k88713j77817
$$ 10573641 10349305 10064360 10027895 10030942 9916337 9712225 9548293 9238674 8949961 8772144
19548H772144n7676K324k21773j80797j88465r1965L0682j47476p9937j01329
$$ 8772144 8714468 8716792 8495019 8314222 8125757 8033792 8064474 7916998 7837061 7735732
19538G735732j59850m8665j28420p6758j00030j61909j95775j25453p5188j31124
$$ 7735732 7575882 7527217 7398797 7322039 7222009 7060100 6864325 6738872 6663684 6532560
19528F532560p5424j30448j56998q5821n7546N35k07430j01992p8237j89441j12566
$$ 6532560 6457136 6326688 6169690 6083869 6026323 6026858 5819428 5717436 5639199 5449758 5337192
19517E337192o1215j98078j53075j94088j51753j75795K0064J03221n6851j71599
$$ 5337192 5275977 5077899 4924824 4730736 4578983 4403188 4423252 4526473 4469622 4298023
19507D298023k5855j41908j23793o8366n684J20627j9762p7160q1149n8006M573
$$ 4298023 4272168 4130260 4006467 3938101 3932417 4053044 4033282 3956122 3874973 3816967 3821540
19496C821540r7982j06947m5666m3537o9652m5665l7070P6293l5324k6301j69079
$$ 3821540 3723558 3616611 3570945 3527408 3457756 3412091 3375021 3451314 3415990 3389689 3220610
19485C220610r7335l3509n3946r0329p244J3552j53361m685P4765J5071j70578
$$ 3220610 3123275 3089766 3035820 2945491 2938247 2951799 2798438 2793753 2868518 2883589 2713011
19474B713011j86099L526p195L4749J11943M6557j90476j36500r0614n4697l688
$$ 2713011 2526912 2530438 2523243 2557992 2669935 2716492 2526016 2389516 2298902 2244205 2240517
19463B240517m5926M0322J19769o7450P3156J37148Q0272j03526j41658j00131
$$ 2240517 2194591 2234913 2354682 2287232 2360388 2497536 2577808 2474282 2332624 2232493
19453B232493P379N094r4888j15247m5768n9492p8048j52752N3084J03120R9306
$$ 2232493 2239872 2244966 2150078 2034831 1989063 1929571 1851523 1698771 1751855 1854975 1954281
19442A954281j0153j1106k9694o921j4981Q9444R4747j9140R6181P3145J25630
$$ 1954281 1944128 1933022 1903328 1896407 1881426 1970870 2065617 2046477 2142658 2215803 2341433
19431B341433j06740q6189l6751q4798M7913J76168J39614J11631P3512P2425
$$ 2341433 2234693 2148504 2111753 2026955 2074868 2251036 2390650 2502281 2575793 2648218
19421B648218k5776K3077M49210O32344Q41865P68205K39922j89145k90451l30051
$$ 2648218 2622442 2645519 3094729 3727073 4568938 5337143 5577065 5387920 5097469 4767418
19411D767418l97770m19111m12183j86711l4470r883J220n5710l6929m9823j69116
$$ 4767418 4369648 3950537 3538354 3351643 3317173 3307290 3308510 3252800 3215871 3166048 2996932
19400B996932l02138j49688j01255k50479J2875m96j02166j63415j18864K8429
$$ 2996932 2694794 2545106 2443851 2193372 2206247 2205751 2103585 1940170 1821306 1849735
19390A849735K2132m9920j1853l5039q1568j55679J16953J84037K5495R3188K7411
$$ 1849735 1871867 1821947 1810094 1775055 1693487 1537808 1654761 1838798 1864293 1957481 1984892
19379A984892L5477l4411L9063L068P6917L01472K72236K31496l8662p4417j57673
$$ 1984892 2020369 1985958 2025021 2028089 2105006 2406478 2678714 2910210 2871548 2797131 2639458
19368B639458o3472M7369J27468J01884L92487N23380M92010N88238O45757K90169
$$ 2639458 2575986 2623355 2750823 2852707 3245194 3768574 4260584 4848822 5494579 5784748
19358E784748l20857p32362q08259n30926l63842k63301r7885j78084l38668k03773
$$ 5784748 5463891 4731529 3923270 3392344 3028502 2765201 2667316 2489232 2150564 1946791
19348A946791p3497P8331P6139o1493J4776L6120m0417J9829j38887n0451n1327
$$ 1946791 1873294 1951625 2027764 1966271 1981047 2017167 1976750 1996579 1857692 1807241 1755914
19337A755914p3892j40060l5287o5824O0908Q331n9380j64754m2530M8980M2387
$$ 1755914 1682022 1541962 1506675 1440851 1501759 1510090 1450710 1285956 1243426 1292406 1334793
19326A334793Q3978N3726k61231k3611J9767L8080m840o3502l9151Q5733L7174
$$ 1334793 1418771 1472497 1211266 1187655 1207422 1245502 1240662 1177160 1138009 1223742 1260916
19315A260916p476K3474l1246L2085l5226j31750j6690L1014J01790p1722p2825
$$ 1260916 1253440 1276914 1245668 1277753 1242527 1110777 1094087 1125101 1226891 1155169 1082344
19304A082344J3954m8025K0690Q1939J0267j8023P9193M6756J7724q022o1511
$$ 1082344 1096298 1048273 1068963 1150902 1161169 1143146 1222339 1269095 1286819 1278797 1217286
19293A217286r3727n0883N165o6569j22346m5764R9890J23914Q2448J9766J60439
$$ 1217286 1123559 1072676 1077841 1011272 888926 843162 943052 1066966 1149414 1169180 1329619
19282A329619O7698q6428j18849J4075p3132P6504J9974K5960J7500j8546j12184
$$ 1329619 1397317 1310889 1192040 1206115 1132983 1209487 1229461 1255421 1272921 1254375 1142191
19271A142191k4921Q0764O7409M7027n8923l9733j9427N6875q489l4173p6035
$$ 1142191 1117270 1198034 1265443 1312470 1253547 1213814 1194387 1251262 1242773 1208600 1132565
19260A132565J00103L5776j03596J35167J57537L1564j13644j14314j2394K6709
$$ 1132565 1232668 1268444 1164848 1300015 1457552 1489116 1375472 1261158 1248764 1275473
19250A275473K5358J08223R5964L9116r4057l6880J8517O0825P0216Q2336J50244
$$ 1275473 1300831 1409054 1505018 1544134 1450077 1413197 1431714 1492539 1562755 1645091 1795335
19239A795335K23597K4668j1999J24191L4963P3337Q5118J8286R7609R3254M1334
$$ 1795335 2018932 2043600 2031601 2155792 2190755 2264092 2349210 2367496 2465105 2558359 2599693
19228B599693K56235O6503M8940K7421O4659M9886K47810K25420J96580L96701
$$ 2599693 2855928 2922431 2971371 2998792 3063451 3113337 3361147 3586567 3783147 4179848
19218D179848M77521P03266O62940M36372K33127K05200j77018j31591K41743
$$ 4179848 4657369 5360635 6023575 6459947 6693074 6898274 6721256 6589665 6831408
19209F831408M28982O10822P34967J020360J370594K093527L237170N334082P976128
$$ 6831408 7260390 7871212 8606179 9626539 10997133 13090660 16327830 21661912 29638040
19200B9638040Q357362M605383r49074m006779l822285k298417p15038Q34144
$$ 29638040 37995402 42600785 41651711 37644932 33822647 31524230 30809192 31643336
19192C1643336K359050M088031O449654J0505899J8567041L3701339N8663710
$$ 31643336 34002386 38090417 44540071 55045970 73613011 107314350 165978060
19185A65978060Q0077729O8925715K7876165j0290539l0881345m2290627m6679258
$$ 165978060 246055789 314981504 342857669 332567130 301685785 259395158 212715900
19178B12715900m1480622l0985528k0374554j1064423j563005Q517435J5831225
$$ 212715900 171235278 140249750 119875196 108810773 107247768 115765203 131596428
19171A31596428J2678965n42148j3445732j8096288j6654161j3435006j0271079
$$ 131596428 144275393 143733245 130287513 112191225 95537064 82102058 71830979
19164G1830979p449977n449509l916836k878934k207587j738492j388211r72975
$$ 71830979 64381002 58931493 55014657 52135723 49928136 48189644 46801433 45828458
19156D5828458p36026o63425m56945k53245k5395J36324K42133P75434J636549
$$ 45828458 45092432 44429007 43972062 43718817 43693422 43829746 44071879 44847313 46483862
19147D6483862K893675M632942P779366J3268175K0484095K3699822J5790610
$$ 46483862 49377537 54010479 61789845 75058020 95542115 119241937 135032547
19140A35032547N74339j0563948j2579928r072226l625242L510239J3718236K8363730
$$ 135032547 135606886 125042938 112463010 103390784 99765542 103275781 116994017 145357747
19132A45357747M5109332N7726437O4985369O5018679L7717736j6587467o0267513
$$ 145357747 190467079 248193516 313178885 378197564 415915300 399327833 339060320
19125C39060320o9759667n7691473m2946695l0545248k0830812j4007019r563076
$$ 339060320 269300653 211609180 168662485 138117237 117286425 103279406 93716330
19118I3716330o474777l656939o36135K587031N673008N425195M3247o360598
$$ 93716330 87241553 83584614 82948479 85535510 91208518 96633713 96676960 90316362
19110I0316362r189901q461072o758674n285471l954173l147641k722318k391720
$$ 90316362 81126461 72665389 65906715 60621244 56667071 53519430 50797112 48405392
19102D8405392j880986j331719j026942p39450o71345q89160j040715j079668
$$ 48405392 46524406 45192687 44165745 43426295 42754950 41865790 40825075 39745407
19094C9745407j300895j414822j313823j180241r05890q27291q42055r06688r47257
$$ 39745407 38444512 37029690 35715867 34535626 33629736 32802445 31960390 31053702 30106445
19085C0106445p84410p67739o64485m66198m52436o96880n70980n61824o11655
$$ 30106445 29322035 28554296 27889811 27423613 26971177 26274297 25703317 25141493 24529838
19076B4529838n13913n63254n08284m72434o06864n74140o48029n19044j58843
$$ 24529838 24015925 23452671 22944387 22471953 21865089 21290949 20642920 20123876 19965033
19067A9965033k83306m03434j78891l25643k99519k27856k72632k48605j19004
$$ 19965033 19681727 19278293 19099402 18773759 18474240 18246384 17973752 17725147 17606143
19058A7606143k34539k95754r2421j79927l34873m18752l21796l74564k71900
$$ 17606143 17371604 17075850 16983429 16803502 16468629 16049877 15728081 15353517 15081617
19049A5081617j79741k87231k70217j87698j72811k51744k02407j69435k63763
$$ 15081617 14901876 14614645 14344428 14156730 13983919 13732175 13529768 13360333 13096570
19040A3096570l33421k62148l19674k68818k37996k62193k01453j86328k62064
$$ 13096570 12763149 12501001 12181327 11912509 11674513 11412320 11210867 11024539 10762475
19031A0762475k04917j72589k99221k04867j18412n7831k02884k51954j13830
$$ 10762475 10557558 10384969 10085748 9880881 9762469 9704638 9501754 9249800 9135970
19022I135970Q292j72755k60119j86756j53496j53932j37017m4048k5249j80310
$$ 9135970 9144262 8971507 8711388 8524632 8371136 8217204 8080187 8036139 8010890 7830580
19012G830580j79172j87652j40439k05190r832J36679r0681j86481j41711L6228
$$ 7830580 7651408 7463756 7323317 7118127 7108295 7244974 7154293 6967812 6826101 6862329
19002F862329J51360N7000q012K9567l4344j62421q6323o9894K2695r0369j36017
$$ 6862329 7013689 7070689 7062677 7092244 7057900 6895479 6809156 6739262 6761957 6671588 6535571
18991F535571k8295O6221m1299j35581r2562J04257K29727J09544R6307P592j43587
$$ 6535571 6507276 6573497 6532198 6396617 6304055 6408312 6638039 6747583 6843890 6851482 6707895
18980F707895k16866K1180R4315O2242n4238r9300p3398K6496M09234L67103O9624
$$ 6707895 6491029 6512209 6606524 6668766 6614528 6515228 6441830 6468326 6877560 7244663 7314287
18969G314287K35519N53029N77399Q90269J213473J782502K878873M898700Q848730
$$ 7314287 7549806 8102835 8680234 9570503 10783976 12566478 15445351 20344051 29192781
18960B9192781J4779929J7114009Q677521m092521j0888634j0335630p958555
$$ 29192781 43972710 61086719 69764240 65671719 54783085 44447455 36488900
18953C6488900n589521l289764j393483P99557L604446Q303026J4235567J5310797
$$ 36488900 30899379 27609615 26216132 27015689 30620135 38923161 53158728 68469525
18945F8469525N805374o431182j1810305j0634853q270924o267711m337010k992253
$$ 68469525 74274899 67843717 56033412 45398559 37127635 30859924 26522914 23530661
18937B3530661k079143j568255j101488p02557l76985l08240l13219l43745j94799
$$ 23530661 21451518 19883263 18781775 18079218 17702233 17393993 17080774 16737029 16542230
18928A6542230k51158j58368J33515J82821K30233L06739N83305P39444J009511
$$ 16542230 16291072 16132704 16266219 16449040 16679273 16986012 17569317 18308761 19318272
18919A9318272J345778K099762L452397N899732J0645942J7371186J9541964J0092931
$$ 19318272 20664050 22763812 26216209 32115941 42761883 60133069 79675033 89767964
18911H9767964k548316p091124k514251O115312J2631938P881590l664573j0243239
$$ 89767964 87219648 80128524 77614273 83729585 96361523 104243113 100578540 90335301
18903I0335301p601299p7197Q772917J1511176L161709p265156r566491l596070
$$ 90335301 82734002 82656805 91429722 102940898 106102607 98837451 89270960 85674890
18895H5674890N363534J0402484L507158q545543j4965946j3939722j0831762
$$ 85674890 91038424 101440908 104948066 96402523 81436577 67496855 56665093
18888E6665093q097061n828028m297636l130249k437286j758748j292135j040250
$$ 56665093 48568032 42740004 38442368 35312119 32874833 31116085 29823950 28783700
18880B8783700q54300o80727p41273n28967m60424l14414l31034l16880k20445
$$ 28783700 27929400 27248673 26507400 25978433 25518009 25203595 24872561 24555681 24335236
18871B4335236L2831L10070M56097M49264O70115J515674K938377N449072R790315
$$ 24335236 24368067 24678137 25134234 25583498 26253613 27769287 30707664 36156736 45947051
18862D5947051J6478977K0156004J1278760m034190j3167334j2977725j0046162
$$ 45947051 62426028 82582032 93860792 89826602 76659268 63681543 53635381
18855E3635381p208769m767604k325086K34636L535204Q557523J5560252J8038087
$$ 53635381 46426612 41659008 39333922 39568558 43103762 51661285 67221537 85259624
18847H5259624P869580o749426j4202875j3147914j0355977p810605n736623l946021
$$ 85259624 93129204 86379778 72176903 59028989 48673012 40862407 35125784 31179763
18839C1179763l016315k338256j639188j156137r23289q88195p45545n39118m77644
$$ 31179763 28163448 25825192 24186004 23029867 22106578 21218383 20472838 19933720 19456076
18830A9456076n53376n65208m96009n52247l79645j43548j94872l70022m66240
$$ 19456076 18902700 18337492 17841483 17289236 16909591 16766043 16571171 16201149 15734909
18821A5734909m76622l81502l89798l00599k19884k90349l15552m93347l25446
$$ 15734909 15258287 14876785 14486987 14186388 13966504 13676155 13360603 12867256 12541810
18812A2541810j21049j08802k21052l82472m18543m48374l24858k81461k76372
$$ 12541810 12420761 12311959 12090907 11708435 11289892 10841518 10516660 10235199 9958827
18803I958827j72548j96650k70026k28656j89241k04845j76966r9142o8053j63718
$$ 9958827 9786279 9589629 9319603 9090947 8901706 8696861 8519895 8420753 8352700 8188982
18793H188982k47524j71776p6494j57209j26934j31022j9936n256K6813n8015
$$ 8188982 7941458 7769682 7693188 7535979 7409045 7278023 7258087 7252831 7279644 7221629
18783G221629j56075p4978m1512o8571j20264j70258j04194q2120Q4002l8773
$$ 7221629 7065554 6990576 6949064 6880493 6760229 6589971 6485777 6403657 6487659 6448886
18773F448886L2727J04928p9811q7707J545j6034R349J18495J08034N3858p0887
$$ 6448886 6481613 6586541 6506730 6419023 6420568 6404534 6413883 6532378 6640412 6694270 6623383
18762F623383l40105k49086k99988k44812r6099p8301r2860p5140j38888j80345
$$ 6623383 6283278 6034192 5734204 5489392 5393293 5314992 5222132 5146992 5008104 4827759
18752D827759j23774Q6529l9465j89004k15500k01344q8879r7851m4379j09094
$$ 4827759 4703985 4790514 4751049 4562045 4346545 4145201 4056322 3958471 3914092 3804998
18742C804998j03722M260k7452o6362j19203o2339l4046o59p178Q965J6657o344
$$ 3804998 3701276 3705536 3678084 3611722 3492519 3430180 3396134 3395475 3388297 3397262 3413919 3407575
18730C407575L4722j24188k19159n8094m6352p6574j36823j51807m4998M5505
$$ 3407575 3442297 3318109 3098950 3040856 2994504 2917930 2781107 2629300 2584302 2629807
18720B629807K46721P3362j43791j08207r5150j62787j66996p1815P5307R5705
$$ 2629807 2876528 2949890 2806099 2697892 2602742 2439955 2272959 2201144 2276451 2372156
18710B372156m0844Q2191L2934j64358j66957k5485m1174p6026J39990K9737j15375
$$ 2372156 2331312 2413503 2446437 2282079 2115122 2089637 2048463 1972437 2112427 2142164 2026789
18699B026789n4131o2304m5466J6704n3581j2128J0836J6318l0786n2631K6307
$$ 2026789 1972658 1910354 1864888 1881592 1828011 1815883 1826719 1843037 1812251 1759620 1785927
18688A785927l7140J47970J6949M5770J27046J56064P4605O1003K30983J73605
$$ 1785927 1748787 1896757 1913706 1959476 2086522 2242586 2317191 2378194 2609177 2782782
18678B782782P7914m6119L7062O5390j29777l09981r7144Q249J59299K43636J03272
$$ 2782782 2860696 2814577 2851639 2917029 2787252 2477271 2380127 2388376 2547675 2791311 2894583
18667B894583J02116J62972K26359J34769l9675q1446k3624p8690k66506k02181
$$ 2894583 2996699 3159671 3386030 3520799 3481124 3399678 3376054 3297364 3030858 2828677
18657B828677j74334j37044j88968j66258r1708L5068M71j42813p0744j9459L4969
$$ 2828677 2654343 2517299 2328331 2162073 2070365 2105433 2105904 1963091 1892347 1872888 1907857
18646A907857n8759J3617K1909j26093r9339J9832P8174k3268j02647J04800j8985
$$ 1907857 1849098 1862715 1884624 1758531 1659192 1679024 1757198 1733930 1631283 1736083 1717098
18635A717098M4097l7540k057R9875j2792o6943j0929J19634J78220K15375J47096
$$ 1717098 1761195 1723655 1721598 1821473 1808681 1741738 1730809 1850443 2028663 2244038 2391134
18624B391134J18880Q3610J10236J61778K83544J49967j87741j68625j43150j76799
$$ 2391134 2510014 2593624 2703860 2865638 3149182 3299149 3111408 2942783 2799633 2622834
18614B622834j36466j06290j25818J01238J04296K6660P1267J03633L6469q889
$$ 2622834 2486368 2380078 2254260 2355498 2459794 2486454 2557721 2661354 2697823 2688934
18604B688934j91418o996k2811k36714k17784q7086p1410p7044r5138k9764j42004
$$ 2688934 2497516 2490520 2467709 2230995 2013211 1926125 1854715 1777671 1682533 1652769 1510765
18593A510765p8455k43281j29092p5149P3773P6125O9126M0533r2525n7479K7703
$$ 1510765 1432310 1189029 1059937 984788 1058561 1134686 1203812 1244345 1151820 1094341 1122044
18582A122044q4671o6402k7063P325K8379M486J4933J8228r6196R5138L3173o9998
$$ 1122044 1037373 970971 943908 951233 979612 984098 999031 1017259 921063 1016201 1049374 979376
18570I79376M3249J17564j00134o5411O5587p397l6308k7538j13035q8340n7132
$$ 979376 1022625 1140189 1040055 974644 1040231 1032834 996526 968988 855953 767613 710481
18559G10481k0865J17145K9346j30850j75N2645L860M9153n2523p4896o7120l6949
$$ 710481 689616 806761 836107 705257 705082 757727 761587 810740 758217 683321 616201 579252
18547E79252p6228K3169K5519L9782j123l1748l9248m6226O9396j2910p9189O9539
$$ 579252 503024 526193 551712 591494 590371 558623 519375 473149 542545 529635 450446 519985
18535E19985n089q8742L3530J34082L1618j5482k5505r3871j29555o6415M3211
$$ 519985 514896 426154 459684 593766 625384 609902 584397 490526 360971 294556 337767
18524C37767J5560J4755P3806R5388j235j0181r8629j939j8796M1784l991J3804
$$ 337767 353327 368082 441888 537276 536041 525860 427231 425292 406496 448280 444289 458093
18512D58093N2610l2230P1886K3084k8569k7107n0297n1605p0746o9345p7004
$$ 458093 510703 478473 550359 573443 544874 517767 467470 415865 345119 275774 198770
18501A98770P0947n383M4176Q4691R3442P7638O737o9668j5881M5683L4190J3574
$$ 198770 269717 264334 308510 393201 486643 564281 571018 501350 485469 531152 565342 578916
18489E78916O5514J11441j64424k05328k1898K1544K7720K7965N1732J2289l1644
$$ 578916 644430 755871 591447 386119 364221 385765 413485 441450 493182 505471 473827
18478D73827n8269M0777N2672Q908j11596o2968N6126Q2282P4034q9522o8116
$$ 473827 415558 456335 509007 517915 406319 343351 399477 481759 555793 466271 398155
18467C98155N0851j35630j703K3036P0618l6169J44962P4386l9975p9310m7274
$$ 398155 449006 313376 311673 334709 405327 369158 514120 588506 548531 469221 421947
18456D21947k2999k8873N1307Q1339r3950o4225N1757m3344j8103J93496O2489
$$ 421947 398948 370075 421382 502721 408771 344546 396303 352959 334856 528352 590841
18445E90841K6908q3219K6039J63705j082l2593j08652J7196k7933j15150K7462
$$ 590841 617749 534530 560569 724274 723192 690599 581947 599143 571210 456060 483522
18434D83522j4452J9903K9019J30672J65863m7593L4203o7871q0071j15053O6393
$$ 483522 469070 488973 517992 648664 814527 766934 801137 733266 653195 538142 604535
18423F04535o9075Q7845k5626j05838p698P0503n6333j3845P0084K0362r3282
$$ 604535 535460 623305 597679 491841 484143 554646 498313 484468 554552 574914 481632
18412D81632j1868J35618O3308j8565l7004L7381K2694p0688R8352P1612N7198
$$ 481632 469764 605382 668690 650125 613121 650502 673196 602508 700860 772472 829670
18401H29670K1185j799j04271J90436J73069K03456J09623m9536j43177M4218
$$ 829670 850855 849056 744785 935221 1108290 1311746 1421369 1371833 1228656 1272874
18391A272874K9584P4146P5014P4867p2777j65179l0262N5391n1928o3818p8555
$$ 1272874 1302458 1376604 1451618 1526485 1453708 1288529 1258267 1313658 1261730 1197912 1119357
18380A119357K9242o3430o1253M5322J2452n394j39307m7818q5607j24857m2464
$$ 1119357 1148599 1085169 1023916 1069238 1081690 1076296 936989 889171 803564 678707 636243
18369F36243N2932Q7439J62682J51184J00598j12497l7133L0266J22012J13455
$$ 636243 689175 776614 939296 1090480 1191078 1078581 1041448 1071714 1193726 1307181
18359A307181P0087N2082m1996q7374L6130J17306k8605L1873R7292L1174j18210
$$ 1307181 1377268 1429350 1387354 1299980 1336110 1453416 1424811 1456684 1553976 1585150 1466940
18348A466940j08082K4750k7485L6127K4220L9571M9195k2837p7292j13821p1017
$$ 1466940 1358858 1383608 1356123 1392250 1416470 1456041 1505236 1482399 1405107 1291286 1220269
18337A220269k18911j34749N1648Q5080o0077p6972J58141K64825R1369q6790
$$ 1220269 1001358 866609 918257 1003337 943260 866288 1024429 1289254 1380623 1293833
18327A293833r7011m1779m7128J87241J2491M2626O2488N8329r9511k7079j10056
$$ 1293833 1196822 1155043 1107915 1295156 1307647 1350273 1412761 1471090 1371579 1344500 1234444
18316A234444m184o4071P3468J9582O8506K0686L13k5327j36867j76550k12015
$$ 1234444 1230260 1166189 1239657 1259239 1327745 1348431 1348744 1323417 1186550 1010000 797985
18305G97985m3551J37386Q7044m4542l7516j8016l4621j464J5681O7234n1824
$$ 797985 754434 891820 978864 934322 896806 878790 844169 842705 858386 925620 873796
18294H73796j37048n736M1184m665m1896j2455R9062Q2825J0990P2097J5482p0348
$$ 873796 736748 731012 772196 767531 725635 713180 812242 895067 906057 978154 993636 923288
18282I23288P238J87334R8465J10453N5188R3682r2222J29554J64202L3698M1301
$$ 923288 930526 1117860 1216325 1326778 1381966 1475648 1383426 1512980 1677182 1710880 1752181
18271A752181K7332K03589K3055n0116q6547j65159J10104J17184m5377l8841
$$ 1752181 1779513 1983102 2006157 1956041 1869494 1704335 1814439 1931623 1886246 1847405
18261A847405j12296j13541j00573m7806q9765N7357J24387M1963j59381j49833
$$ 1847405 1735109 1621568 1520995 1473189 1383424 1440781 1565168 1607131 1447750 1297917
18251A297917L6467r3939J6238k4323r6464N0752N5008M8549o4333P665P7825
$$ 1297917 1334384 1240445 1256683 1232360 1135896 1186648 1241656 1290205 1225872 1233537 1311362
18240A311362N2041k0089l351l209L0318P418p7745P3818P7148j4804R5952J29838
$$ 1311362 1363403 1343314 1339963 1336754 1367072 1374490 1296745 1370563 1447711 1432907 1528859 1658697
18228A658697p820r9562o2626O6753K48732J49063P8436k4358M4325K19500O2564
$$ 1658697 1650877 1551315 1488689 1555442 1804174 1953237 2031673 2007315 2051640 2271140 2333704
18217B333704J02209J01816L1903n3949O336J77570R8169L310L5735j47149m8420
$$ 2333704 2435913 2537729 2569632 2515683 2522019 2699589 2797758 2801068 2836803 2689654 2641234
18206B641234K5774L6596J05335O6445q9749m7407J23871L03860K55051J73754
$$ 2641234 2667008 2703604 2808939 2875384 2785635 2738228 2862099 3165959 3421010 3594764
18196C594764J76828K65390J06393J47642J03907n834P7271L2433J1120K19757
$$ 3594764 3771592 4036982 4143375 4291017 4394924 4389090 4466361 4498794 4509914 4729671
18186D729671J70638J91023K15351L40411M90809M75898O89181R77919J221442
$$ 4729671 4900309 5091332 5306683 5647094 6137903 6613801 7302982 8280901 9502343
18177I502343J313821J377504J713440K441884L782513N693254O666631N785138
$$ 9502343 10816164 12193668 13907108 16348992 20131505 25824759 32491390 38276528
18169C8276528M214394K011340o84556k397039j977850o94249J011673K845489
$$ 38276528 42490922 44502262 43817706 41420667 39442817 38748568 39760241 42605730
18161D2605730N007645Q370350J4531946K5680751M3825484N9905035N9940547
$$ 42605730 47613375 55983725 70515671 96196422 140021906 199926941 259867488
18154B59867488N0492942L4610702N830677k5033908m1291968m4224016m1569567
$$ 259867488 310360430 344971132 350801809 325767901 284475933 240251917 198682350
18147A98682350l4075826k3675868j2927465k662629N354188P777318M781438
$$ 198682350 164606524 140930656 128003191 125340562 130694750 138472068 143253506
18140A43253506k30457o544045j3016047j6277629j4742203j1625242q672972
$$ 143253506 143023049 136479004 123462957 107185328 92443125 80817883 72144911
18133G2144911o129073m440509l160827k616443k251054j836198j516605j315470
$$ 72144911 66015838 61575329 58414502 55798059 53547005 51710807 50194202 48878732
18125D8878732j052474o44850j60047K08023N07582P82327J182742J751040K719478
$$ 48878732 47826258 47181408 47021361 47229384 47736966 48519293 49702035 51453075 54172553
18116E4172553M874552Q364605J3218042J6937352J6316102J3412253J0261433
$$ 54172553 59047105 67411710 80629752 97567104 113883206 127295459 137556892
18109A37556892P531642R647565K2611678L4797980K3518035L789851l01119J2410995
$$ 137556892 145088534 154736099 177347777 212145757 235663792 239453643 239152524 251563519
18101B51563519K8439981L8754735K9587058Q644273j0862688l0449031m6825044
$$ 251563519 280003500 318758235 348345293 356989566 346126878 315677847 268852803
18094B68852803n0161993m0758869k9999958k1425930j4952858j0342807o930793
$$ 268852803 218690810 177931941 147931983 126506053 111553195 101210388 94279595
18087I4279595m392148j985028L67340J440788M10746j180951l012172m951063
$$ 94279595 89887447 87902419 88269759 89710547 90121293 88940342 85928170 80977107
18079H0977107o281884n788864m687618l851919l094838k628322k533933k265161
$$ 80977107 74695223 68906359 64218741 60366822 57271984 54643662 52109729 49844568
18071D9844568j958666j672438j532421j538674j280540j238267r60595q85828
$$ 49844568 47885902 46213464 44681043 43142369 41861829 40623562 39662967 38777139
18063C8777139j007345q57555q59995p52564q21769r24335r19812q69297r19892
$$ 38777139 37769794 36912239 36052244 35299680 34477911 33553576 32633764 31764467 30844575
18054C0844575q69552p55753p55616o83004n37061p37144o24905m55196m05883
$$ 30844575 29975023 29219270 28463654 27780650 27243589 26506445 25881540 25426344 25020461
18045B5020461m02683m93089n37319n00202m84200n27186m75101m59399m33565
$$ 25020461 24617778 24124689 23587370 23087168 22602968 22075782 21600681 21141282 20707717
18036B0707717m16898m65901l39285k87448l06274k27642k15188k80364j76473
$$ 20707717 20290819 19824918 19485633 19198185 18891911 18664269 18449081 18168717 17992244
18027A7992244j46111k52270j75314k34052l97788k85838j53244j92025k39116
$$ 17992244 17846133 17593863 17418549 17184497 16786709 16500871 16347627 16155602 15916486
18018A5916486k83869k87288j53132k70330j65220j83728k74186j19979k32677
$$ 15916486 15632617 15345329 15192197 14921867 14756647 14572919 14298733 14178754 13946077
18009A3946077j56764J32887L12244N65409Q02319O77174J56675m30704o78658
$$ 13946077 13789313 13922200 14234444 14799853 15602172 16279346 16436021 16005317 15326659
18000A5326659q81018q04365q36563o58693l64858k58174k35438k66506n4296
$$ 15326659 14445641 13641276 12804713 12146020 11781162 11522988 11287550 11021044 10966748
17991A0966748k752j4843k32320l38178l53127k77863k52142l03859k04894k05992
$$ 10966748 10963996 10949153 10716833 10378655 10025528 9747665 9495523 9191664 8986770 8780778
17981H780778j36135j85058M9426k3416j67155j68243j13776j44785j56448J9226
$$ 8780778 8644643 8459585 8509011 8485595 8318440 8150197 8036421 7891636 7735188 7754414
17971G754414n358R8485q2532k12208j97920q1020n6928r5093r024K1030K4194
$$ 7754414 7749056 7847541 7765009 7552801 7354881 7273861 7216933 7121840 7112816 7133846 7158040
17960G158040q8964r3325p9819j8403n9171j86027n5773J16379K35390M54023
$$ 7158040 7069076 6975751 6895932 6877529 6818358 6632331 6576558 6692937 6928327 7382350
17950G382350N38275N18739M71635J51719k11401o41639p58708o87709l75488
$$ 7382350 7920625 8439364 8910999 9062718 8851317 8209678 7450970 6763261 6387773
17941F387773j83670k01897j85064k18570j61215l10756j41045N6481N4915N6564
$$ 6387773 6204103 6002206 5817142 5598572 5437357 5126601 4985556 5042037 5096952 5153516
17931E153516j7744l380j36330k36886j3292l5601m1900j50191j43966O6079m02
$$ 5153516 5135772 5132392 4996062 4759176 4745884 4710283 4668383 4518192 4374226 4440305 4439903
17920D439903o9542q4480r6464n5583k1784Q8502k236o0980k7450q0567j7163
$$ 4439903 4370361 4285881 4189417 4133834 4112050 4200552 4198316 4137336 4109886 4029319 4012156
17909D012156m0989k694O1374L4801P823Q5154K32178K11180J19668J75904J82904
$$ 4012156 3971167 3968473 4029847 4064648 4072471 4157625 4389803 4600983 4720651 4896555 5079459
17898E079459J56849J20262J65417Q6612J54402K58654K44195J99409K69816K71334
$$ 5079459 5236308 5356570 5521987 5608599 5763001 6021655 6265850 6465259 6735075 7006409
17888G006409M34798N89896P15678Q63562J116182J586691K308816L264070N165715
$$ 7006409 7441207 8031103 8746781 9610343 10726525 12313216 14622032 17886102 23051817
17879B3051817R170580J5386863J9867868J3458061R00346o003553k442354O359569
$$ 23051817 32222397 47609260 67477128 80935189 81835535 75831982 73389628 79749197
17871G9749197J3126398P533472o411391j5447646j5503341j2129031q885600
$$ 79749197 92875595 100409067 93997676 78550030 63046689 50917658 42032058
17864D2032058o188118m332445l004877k134545j605734j171058o00050k69019
$$ 42032058 35843940 31511495 28506618 26372073 24766339 23595281 22995231 22726212
17856B2726212Q1418K30974N07250N09295O17640J224982K249549L732463O493102
$$ 22726212 22807630 23038604 23545854 24055149 24672789 25897771 28147320 31879783 38372885
17847C8372885J1366189J7297458J6810663O649239l451388m582550K187711J1022720
$$ 38372885 49739074 67036532 83847195 90496434 87045046 82462496 84650207 95672927
17839I5672927J2111602J135238j0930891j4075723j0373834n203068J204835
$$ 95672927 107784529 108919767 97988876 83913153 73539319 68336251 69541086
17832F9541086R481707J4858206R055784k330117p799134l916199M590033J0288893
$$ 69541086 79022793 93880999 102936783 100606666 92807532 88891333 93481366 103770259
17824A03770259M613950p541953j4917655j4565954j1435542q508280o110625
$$ 103770259 108384209 100842256 85924601 71358647 59923105 51414825 45304200
17817D5304200m169584l070112k324273j760795j394257j124728q98502m41387
$$ 45304200 41134616 38064504 35740231 33979436 32585179 31460451 30561949 30120562
17809C0120562l02305j17844J15967N80061J205402K044852L592447O034637J0762036
$$ 30120562 29818257 29700413 29816380 30396441 31601843 33646695 37239142 43273779 54035815
17800E4035815J6696910J5488097N064441m791149n425438Q63925Q860013R385893
$$ 54035815 70732725 86220822 91285263 86494114 81068676 81932601 90792614 100178507
17792A00178507q81940j1975406j4918140j2397152r414389o813444m764678l550372
$$ 100178507 99296567 87321161 72403021 60005869 50591480 43778036 39013358 35462986
17784C5462986k757459j980669j683550j369630j140971r01536q67087q07975
$$ 35462986 32705527 30724858 29041308 27671678 26530707 25629171 24762084 23954109
17776B3954109q45042o22655n55730l65404l66728k91437k83019l36690l41513
$$ 23954109 23109067 22486412 21930682 21565278 21198550 20907113 20624094 20287404 19945891
17767A9945891j61531k2556q8552J55779L52617J70519K40231N30835P80802R99854
$$ 19945891 19784360 19761804 19673252 19829031 20181648 20352167 20592398 21123233 21904035 22903889
17757B2903889J376971J661570K382978L631661N949956J0445097J7894055K3856316
$$ 22903889 24280860 25942430 28325408 31957069 37907025 48352122 66246177 90102493
17749I0102493J8670654O688311J684552J0039986K4315912K6711173R082568
$$ 90102493 108773147 115461458 117146010 127185996 151501908 178213081 187295649
17742A87295649j3160053k1217559j3832427l253635k428143j0989413j8345147
$$ 187295649 174135596 152918037 139085610 135831975 133403832 122414419 104069272
17735A04069272j8162302j4360845j0629082p575782n339910l819382l017552
$$ 104069272 85906970 71546125 60917043 53341261 48001351 44181969 41164417
17728D1164417k527991k019322j585995j253338j149443j188936j153281r24018
$$ 41164417 38636426 36617104 35031109 33777771 32628328 31439392 30286111 29362093
17720B9362093q72239p33928n31947n11875n67776m94162m28197j37115n7800
$$ 29362093 28489854 27755926 27223979 26712104 26144328 25650166 25221969 25084854 25027054
17711B5027054P2873O9679o0131J17316M52029O82069Q56313J260242K037364
$$ 25027054 25099927 25169606 25109475 25226791 25678820 26360889 27217202 28477444 30514808
17702C0514808L130629N001531Q458445J4706677K1188728J8781063Q106916J513771
$$ 30514808 33645437 38646968 47105413 61812090 83000818 101781881 109888797 111402568
17694A11402568P055487K0090029K5439375J1826198r527162j9513624j4386773
$$ 111402568 118458055 138548084 163987459 175813657 166286495 146772871 132386098
17687A32386098m178740j346065q511623j6474477j7476549j4154910j0560293
$$ 132386098 128207358 126861293 118349670 101875193 84398644 70243734 59683441
17680E9683441p602039n286629l848892l099449k492373k142593j751122j302190
$$ 59683441 52081402 46794773 42945881 39846432 37354059 35211466 33460344 32158154
17672C2158154j133084j142899j091777j167792j066213q91585o67828p12189
$$ 32158154 31025070 29882171 28790394 27622602 26556389 25664804 24996976 24284787
17664B4284787o36952q14937p15231o17830o29769m65422m05820n37213m49570
$$ 24284787 23647835 22832898 22117667 21499837 20870068 20404646 19998826 19461613 19012043
17655A9012043l65609l32158l59356k70786k60767k71661l17192j42629j84976
$$ 19012043 18646434 18314276 17954920 17684134 17423367 17151706 16834514 16691885 16506909
17646A6506909m01877j68123K6260J0598k74347m79872k86083j50515k32683k60074
$$ 16506909 16105032 15936909 15963169 15973767 15699420 15219548 14933465 14782950 14550267 14290193
17636A4290193l54124m93947m37272k93810k06714j86036l92291m20100j57928
$$ 14290193 13936069 13442122 13004850 12711040 12504326 12318290 11925999 11505899 11347971
17627A1347971K5091r0387j43860j00956k32378k68529l23298l61413l20067l07240
$$ 11347971 11373062 11282675 11138815 11037859 10805481 10536952 10213654 9852241 9532174 9224934
17617I224934j80647j64738r0772j00715P1582l2523j30582r0169k25934k05518
$$ 9224934 9044287 8879549 8788777 8688062 8759644 8727121 8596539 8506370 8280436 8074918
17607H074918k38744l02309k27167j70952j40829p1190l9346j30689j29459j28531
$$ 8074918 7836174 7533865 7306698 7135746 6994917 6923727 6884381 6753692 6624233 6495702
17597F495702O477N0094j65809j58985j16088n3574p813J19872J1788k42753j30512
$$ 6495702 6502179 6552273 6386464 6227479 6111391 6057817 6050004 6169876 6181664 5938911 5808399
17586E808399m7338M4945J59355M8307m819l9335k71752k77713j64792j84123
$$ 5808399 5761061 5806006 5965361 6013668 6008849 5969514 5697762 5420049 5255257 5071134
17576E071134j08739j46118n0444M7544O685K1381P3321O5529Q5966J02843M1386
$$ 5071134 4962395 4816277 4765833 4813377 4820062 4841443 4914764 4980293 5066259 5169102 5210488
17565E210488j83702k08570j25474j48563k87525l84913p846j22329l7905r5923
$$ 5210488 5026786 4818216 4692742 4544179 4256654 3871741 3863895 3741566 3703661 3607738
17555C607738r0745j85661j20131j6215k2406k04684q7499L0265N5953K5171p5192
$$ 3607738 3516993 3331332 3211201 3194986 3172580 2967896 2880397 2910662 2966615 2991786 2916594
17544B916594j05935q4313o6496q5256L794j40973j44265o9171o6342J11431R3093
$$ 2916594 2810659 2726346 2659850 2574594 2578388 2437415 2293150 2223979 2157637 2269068 2362161
17533B362161L036n4422j36020p7334l5275P5399N0752l1403n5763N6771n7739
$$ 2362161 2365197 2310775 2174755 2097421 2062146 2137545 2188297 2156894 2101131 2157902 2100163
17522B100163j19631Q6228M0723M2117l6808K4795j4627k30q0228m4135J7960
$$ 2100163 1980532 2066760 2107483 2149600 2112792 2137587 2122960 2122730 2042502 1998367 2016327
17511B016327j89411k47188k9420Q1446N4688n9761j06662k4739j27593n8920
$$ 2016327 1826916 1579728 1550308 1631754 1686442 1626681 1520019 1495280 1367687 1308767
17501A308767M3922J12441M3943r0192M8261m7114p1624K7956J4359j7461j36254
$$ 1308767 1352689 1465130 1509073 1418881 1467142 1420028 1348404 1376360 1390719 1373258 1237004
17490A237004l7712j66772k7516N0819j8643q920J3856j8911r8621l8540J6556
$$ 1237004 1199292 1032520 1005004 1055823 1037180 1028260 1042116 1023205 924584 886044 902600
17479I02600n430j747K6895K9759L0860P1992O3837q5880j24310K1069K3632p6113
$$ 902600 897170 895423 922318 952077 982937 1054929 1118766 1032886 908576 929645 953277 877164
17467H77164j10817l2793Q5444Q7555R1990K0153p0427j05886l5468K7854p4887
$$ 877164 766347 733554 818998 906553 998543 1018696 948269 842383 806915 834769 759882
17456G59882m8869o891J30652l6575j30710P805r443L3192k0587L7477K5216J7622
$$ 759882 711013 704122 834774 798199 667489 675294 665851 699043 678456 715933 741149 758771
17444G58771l6169L0054J20925R5475J87444J35810n1201j95466k04094p2387
$$ 758771 722602 752656 873581 969056 1156500 1292310 1241109 1045643 841549 769162
17434G69162L127q6170m4311q2947j1677R5995j18405j26200J13791J58405M0713
$$ 769162 772289 686119 641808 558861 547184 643179 524774 398574 512365 670770 711483
$$ [...]
##END NTUPLES=NMR SPECTRUM
##END=
