##TITLE=Analysis number 318898
Compound Code cc 48910
Book Reference 468/61
Project Code adrs
Chemist Name colinb
##JCAMPDX= 6.0         $$ Bruker NMR JCAMP-DX V2.0
##DATA TYPE= NMR SPECTRUM
##DATA CLASS= NTUPLES
##ORIGIN= Bruker BioSpin GmbH
##OWNER= nmr
$$ XWIN-NMR		Version 3.5
$$ Mon Apr 24 12:04:03 2006 GMT Daylight Time (UT+1h)  MAYBRIDGE\nmr@NMR_250MHZ
##.OBSERVE FREQUENCY= 250.131544655141
##.OBSERVE NUCLEUS= ^1H
##.ACQUISITION MODE= SIMULTANEOUS (DQD)
##.ACQUISITION SCHEME= undefined
##.AVERAGES= 16
##.DIGITISER RES= 18
##SPECTROMETER/DATA SYSTEM= dpx250
##.PULSE SEQUENCE= zg30
##.SOLVENT NAME= CDCl3
##.SHIFT REFERENCE= (INTERNAL, CDCl3, 0, 16.522)
##AUDIT TRAIL= $$ (NUMBER, WHEN, WHO, WHERE, WHAT)
$$ ##TITLE= Audit trail, XWIN-NMR		Version 3.5
$$ ##JCAMPDX= 5.01
$$ ##ORIGIN= Bruker BioSpin GmbH
$$ ##OWNER= nmr
$$ C:\u/data/dgb/nmr/ADRS/2840/pdata/1/auditp.txt
$$ ##AUDIT TRAIL=  $$ (NUMBER, WHEN, WHO, WHERE, WHAT)
(   1,<2006-04-24 12:03:41.64 +100>,<MAYBRIDGE\nmr>,<NMR_250MHZ>,
      <created by zg, POWCHK disabled, PULCHK disabled
       configuration hash MD5:
       84 BC 41 DB A1 6E 1D 46 DA 25 12 A5 C1 ED C5 3A
       data hash MD5: 64K
       E6 58 64 36 C8 AF D1 D0 2E A3 B7 61 AB D1 57 DC>)
(   2,<2006-04-24 12:03:54.36 +100>,<MAYBRIDGE\nmr>,<NMR_250MHZ>,
      <Start of raw data processing
       ef LB = 0.3 FT_mod = 6 PKNL = 1 SI = 32K 
       data hash MD5: 32K
       CD 49 06 4A 22 54 04 78 EB FE AE AA 42 72 7F 80>)
(   3,<2006-04-24 12:03:56.00 +100>,<MAYBRIDGE\nmr>,<NMR_250MHZ>,
      <apk 
       data hash MD5: 32K
       5D 42 8D 90 26 E6 4B EB B0 7D 86 74 50 25 1E AD>)
(   4,<2006-04-24 12:03:56.80 +100>,<MAYBRIDGE\nmr>,<NMR_250MHZ>,
      <abs ABSG = 5 
       data hash MD5: 32K
       6D 33 72 55 9D DF DC F5 CC 84 DB 2B 73 FA 9D D4>)
$$ ##END=
$$ 
$$ hash MD5
$$ 68 BB 64 2B 12 89 13 E2 95 C8 1E F7 25 1A 76 B4
##$RELAX= 
##$RELAX= 
##$RELAX= 
##$RELAX= 
##$RELAX= 
##$RELAX= 
##$RELAX= 
$$ Bruker specific parameters
$$ --------------------------
##$DU= <C:\u>
##$EXPNO= 2840
##$NAME= <ADRS>
##$PROCNO= 1
##$TYPE= <nmr>
##$USER= <dgb>
##$AMP= (0..31)
100 100 100 100 100 100 100 100 100 100 100 100 100 100 100 100 100 100 
100 100 100 100 100 100 100 100 100 100 100 100 100 100 
##$AQSEQ= 0
##$AQ_mod= 3
##$AUNM= <au_zg>
##$AUTOPOS= <20 >
##$BF1= 250.13
##$BF2= 250.13
##$BF3= 250.13
##$BF4= 250.13
##$BF5= 500.13
##$BF6= 500.13
##$BF7= 500.13
##$BF8= 500.13
##$BYTORDA= 1
##$CFDGTYP= 0
##$CFRGTYP= 5
##$CHEMSTR= <none>
##$CNST= (0..31)
1 1 145 1 1 1 1 1 1 1 1 1 1 1 1 1 1 1 1 1 1 1 1 1 1 1 1 1 1 1 1 1 
##$CPDPRG= <>
##$CPDPRG1= <>
##$CPDPRG2= <>
##$CPDPRG3= <>
##$CPDPRG4= <mlev>
##$CPDPRG5= <mlev>
##$CPDPRG6= <mlev>
##$CPDPRG7= <mlev>
##$CPDPRG8= <mlev>
##$CPDPRGB= <>
##$CPDPRGT= <>
##$D= (0..31)
0 1 0 0 0 0 0 0 0 0.06 0 0 0 0 0 0 0.0002 0 0 0 0 0 0 0 0 0 0 0 0 0 0 
0 
##$DATE= 1145876620
##$DBL= (0..7)
120 120 120 120 120 120 120 120 
##$DBP= (0..7)
150 150 150 150 150 150 150 150 
##$DBP07= 0
##$DBPNAM0= <>
##$DBPNAM1= <>
$$ [...]
##$SUBNAM7= <"">
##$SUBNAM8= <"">
##$SUBNAM9= <"">
##$SW= 20.6930455092707
##$SWIBOX= (0..15)
0 0 3 0 0 0 0 0 0 0 0 0 0 0 0 0 
##$SW_h= 5175.983436853
##$TD= 65536
##$TD0= 1
##$TE= 295.16
##$TE2= 300
##$TE3= 300
##$TEG= 300
##$TL= (0..7)
0 120 120 120 120 120 120 120 
##$TP= (0..7)
150 150 150 150 150 150 150 150 
##$TP07= 0
##$TPNAME0= <>
##$TPNAME1= <>
##$TPNAME2= <>
##$TPNAME3= <>
##$TPNAME4= <>
##$TPNAME5= <>
##$TPNAME6= <>
##$TPNAME7= <>
##$TPOAL= (0..7)
0.5 0.5 0.5 0.5 0.5 0.5 0.5 0.5 
##$TPOFFS= (0..7)
0 0 0 0 0 0 0 0 
##$TUNHIN= 0
##$TUNHOUT= 0
##$TUNXOUT= 0
##$USERA1= <user>
##$USERA2= <user>
##$USERA3= <user>
##$USERA4= <user>
##$USERA5= <user>
##$V9= 5
##$VALIST= <valist>
##$VCLIST= <CCCCCCCCCCCCCCC>
##$VD= 0
##$VDLIST= <DDDDDDDDDDDDDDD>
##$VPLIST= <PPPPPPPPPPPPPPP>
##$VTLIST= <TTTTTTTTTTTTTTT>
##$WBST= 1024
##$WBSW= 4
##$XGAIN= (0..3)
0 0 0 0 
##$XL= 0
##$YL= 0
##$YMAX_a= 304926
##$YMIN_a= -451192
##$ZGOPTNS= <>
##$ZL1= 120
##$ZL2= 120
##$ZL3= 120
##$ZL4= 120
##$ABSF1= 16.522
##$ABSF2= -4.171173
##$ABSG= 5
##$ABSL= 3
##$ALPHA= 0
##$AQORDER= 0
##$ASSFAC= 0
##$ASSFACI= 0
##$ASSFACX= 0
##$ASSWID= 0
##$AUNMP= <proc_1d>
##$AZFE= 0.1
##$AZFW= 0.1
##$BCFW= 0
##$BC_mod= 0
##$BYTORDP= 0
##$COROFFS= 0
##$CY= 12.5
##$DATMOD= 1
##$DC= 0
##$DFILT= <>
##$DTYPP= 0
##$F1P= 14.0000005364418
##$F2P= -0.99999901652339
##$FCOR= 0.5
##$FTSIZE= 32768
##$FT_mod= 6
##$GAMMA= 0
##$GB= 0
##$INTBC= 1
##$INTSCL= 1
##$ISEN= 128
##$LB= 0.3
##$LEV0= 0
##$LPBIN= 0
##$MAXI= 10000
##$MC2= 0
##$MEAN= 0
##$ME_mod= 0
##$MI= 0
##$NCOEF= 0
##$NC_proc= -4
##$NLEV= 6
##$NOISF1= 0
##$NOISF2= 0
##$NSP= 0
##$NTH_PI= 0
##$NZP= 0
##$OFFSET= 16.522
##$PC= 1
##$PHC0= 172.5291
##$PHC1= -7.412899
##$PH_mod= 1
##$PKNL= yes
##$PPARMOD= 0
##$PSCAL= 4
##$PSIGN= 0
##$REVERSE= no
##$SF= 250.13
##$SI= 32768
##$SIGF1= 0
##$SIGF2= 0
##$SINO= 400
##$SIOLD= 32768
##$SREGLST= <1H.CDCl3>
##$SSB= 0
##$STSI= 32768
##$STSR= 0
##$SW_p= 5175.98343685301
##$SYMM= 0
##$S_DEV= 0
##$TDeff= 65536
##$TDoff= 0
##$TI= <Analysis number 999999
Compound Code 99
Book Reference 9
Project Code 9>
##$TILT= no
##$TM1= 0
##$TM2= 0
##$TOPLEV= 0
##$USERP1= <user>
##$USERP2= <user>
##$USERP3= <user>
##$USERP4= <user>
##$USERP5= <user>
##$WDW= 1
##$XDIM= 32768
##$YMAX_p= 283666553
##$YMIN_p= -246565
$$ End of Bruker specific parameters
$$ ---------------------------------
##NTUPLES= NMR SPECTRUM
##VAR_NAME=  FREQUENCY,     SPECTRUM/REAL,   SPECTRUM/IMAG
##SYMBOL=    X,             R,               I
##VAR_TYPE=  INDEPENDENT,   DEPENDENT,       DEPENDENT
##VAR_FORM=  AFFN,          ASDF,            ASDF
##VAR_DIM=   32768,         32768,           32768
##UNITS=     HZ,            ARBITRARY UNITS, ARBITRARY UNITS
##FACTOR=    0.157963299565203, 1,           1
##FIRST=     4132.6476996994, 0,             0
##LAST=      -1043.33573715361, 0,           0
##MIN=       -1043.33573715361, -246565,     0
##MAX=       4132.6476996994, 283666553,     0
$$ Real data points
##PAGE= N=1
##DATA TABLE= (X++(R..R)), XYDATA
$$ [...]
##PAGE= N=2
##DATA TABLE= (X++(I..I)), XYDATA
25354 1465604 1461235 1510549 1553983 1473987 1403436 1426413 1432053 1467522 1445932 1494417 1533927 1494720
25342 1494720 1435671 1432063 1543293 1554620 1526184 1514200 1536525 1526008 1528656 1546797 1520630
25331 1520630 1536096 1531427 1483614 1505041 1540166 1597818 1569429 1517242 1447728 1471388 1484219
25320 1484219 1534997 1538233 1526477 1514678 1495736 1507691 1433750 1452634 1469210 1476202 1568240 1626045
25308 1626045 1606190 1597437 1568785 1593884 1639432 1598567 1558602 1551825 1526764 1517466 1512411 1457495
25296 1457495 1506833 1591842 1619133 1608366 1587667 1648801 1648467 1581750 1546570 1545599 1517736 1496696
25284 1496696 1526013 1518881 1478424 1479849 1497551 1514898 1518394 1550978 1518127 1533864 1558292 1580746
25272 1580746 1535675 1452260 1401111 1485303 1544126 1536046 1440658 1456538 1445516 1436100 1434323 1489553
25260 1489553 1502948 1468808 1473025 1411581 1393060 1373179 1429847 1426583 1442557 1526710 1531801 1472420
25248 1472420 1480454 1470773 1529157 1558735 1585072 1602502 1565389 1568848 1521879 1514446 1533595 1575563
25236 1575563 1644710 1554304 1510246 1536310 1488054 1494273 1543814 1541374 1553442 1514103 1486617 1518708
25224 1518708 1597239 1627879 1595446 1602306 1593563 1599833 1660761 1666742 1671513 1637287 1523328 1490311
25212 1490311 1496297 1478570 1466348 1455770 1433972 1461422 1482087 1512182 1533260 1522226 1477475
25201 1477475 1446216 1470909 1498654 1544532 1615120 1587407 1519515 1498723 1525286 1562545 1577384
25190 1577384 1574852 1555847 1507485 1488039 1533968 1529168 1522607 1530868 1558602 1551508 1587741 1648934
25178 1648934 1623022 1542504 1517571 1531347 1529042 1488348 1497851 1543038 1561425 1567471 1521463 1529520
25166 1529520 1600746 1615857 1575857 1521443 1534454 1651448 1688168 1713481 1627483 1515104 1460864
25155 1460864 1515350 1513558 1513921 1541124 1566153 1557247 1598359 1654183 1635230 1647566 1647442 1656885 1646084
25142 1646084 1603545 1577436 1575420 1611104 1598221 1614935 1576875 1525750 1534930 1533840 1515780 1534072
25130 1534072 1529888 1554541 1599056 1564662 1605517 1599491 1574157 1542744 1457184 1457360 1510990 1494877
25118 1494877 1469144 1529979 1652833 1691571 1669574 1658458 1662312 1658446 1629916 1678438 1692130
25107 1692130 1645467 1638533 1660128 1631304 1615866 1509797 1521982 1494088 1445825 1438644 1453016
25096 1453016 1481221 1525802 1527873 1485351 1521220 1549023 1601737 1560255 1570884 1611693 1605642 1692882
25084 1692882 1654254 1707311 1689192 1557244 1560793 1583717 1613123 1620518 1630918 1624319 1631182 1641840
25072 1641840 1611783 1583777 1584468 1639481 1547199 1528831 1513071 1535400 1567462 1572414 1551607 1464158
25060 1464158 1490888 1558383 1639550 1577003 1571346 1618356 1550412 1511341 1511410 1523930 1552849 1550626
25048 1550626 1466743 1472967 1543275 1564248 1587041 1623182 1661292 1634682 1627365 1607621 1616744 1595537
25036 1595537 1595725 1503144 1514558 1550984 1594404 1609541 1515241 1499023 1526302 1520361 1527447 1565945
25024 1565945 1640942 1623983 1597935 1553785 1550130 1561778 1602478 1661502 1647226 1574602 1514733
25013 1514733 1501917 1497146 1506338 1550854 1521781 1529508 1527611 1513577 1518651 1547716 1526170 1481091
25001 1481091 1443097 1525047 1575218 1606874 1608873 1609649 1611857 1629122 1627916 1636836 1633645 1610635 1605163
24988 1605163 1637880 1563029 1511156 1532128 1523435 1573608 1609438 1618762 1645413 1694391 1657283 1683749
24976 1683749 1714945 1625356 1538890 1468569 1471437 1549083 1620646 1647810 1615157 1592633 1622135
24965 1622135 1639597 1666451 1629573 1638254 1637100 1636532 1569450 1582998 1623635 1637308 1566685 1591700
24953 1591700 1597049 1645456 1668241 1710249 1679195 1646291 1658054 1689725 1625945 1610147 1621646
24942 1621646 1594842 1597699 1643393 1581667 1564500 1555236 1609137 1647304 1611545 1557383 1564331 1601092
24930 1601092 1602409 1619091 1624481 1643585 1614867 1576816 1542892 1584434 1566416 1540584 1587628 1625255
24918 1625255 1638848 1608677 1586082 1563468 1601507 1652421 1635348 1649148 1686675 1629840 1583981
24907 1583981 1567732 1588831 1597303 1552787 1511848 1472286 1512165 1579798 1616717 1611403 1563883 1509835
24895 1509835 1578589 1683235 1653199 1615055 1607148 1651150 1647145 1566488 1533245 1554309 1507572
24884 1507572 1467402 1538477 1626286 1645345 1662057 1676076 1658978 1625845 1573383 1635246 1638797
24873 1638797 1639592 1685346 1626911 1581976 1625277 1657616 1678204 1667545 1563794 1532434 1611075
24862 1611075 1711850 1728108 1681729 1660435 1653404 1639994 1641950 1556598 1576185 1553090 1526639
24851 1526639 1594828 1645464 1679071 1614709 1650568 1674649 1614233 1616574 1614581 1646807 1653956 1595166
24839 1595166 1560852 1594991 1610647 1606872 1581347 1601294 1627259 1651114 1673487 1704489 1713546 1710723
24827 1710723 1665317 1653564 1670229 1705608 1632090 1619129 1706601 1702508 1684001 1726222 1731787 1756227
24815 1756227 1752384 1746956 1677684 1598550 1591997 1671005 1745556 1690897 1681567 1699489 1649387 1639677
24803 1639677 1625392 1619091 1615408 1602618 1697846 1755726 1705521 1740490 1721647 1681798 1658584 1675169
24791 1675169 1694164 1687103 1590682 1585265 1571427 1578375 1643202 1632712 1630472 1614057 1595255 1615203
24779 1615203 1540996 1513801 1543380 1558190 1633978 1674681 1688925 1692601 1663237 1665275 1600021 1560272
24767 1560272 1659781 1698183 1704169 1748903 1819311 1797911 1761184 1679992 1672930 1680434 1670543 1671055
24755 1671055 1663952 1651079 1623630 1613238 1660446 1661300 1626713 1631487 1590877 1599594 1678788 1715901
24743 1715901 1732024 1747552 1703223 1707626 1729744 1695685 1670930 1728956 1704723 1650557 1679819
24732 1679819 1688574 1691213 1675929 1663300 1578605 1567966 1619548 1626058 1639447 1599662 1530712 1567831
24720 1567831 1598993 1605007 1644470 1628349 1605740 1701340 1792256 1768474 1647788 1552372 1569206
24709 1569206 1622446 1644501 1696784 1774921 1699982 1594877 1644223 1706530 1747199 1807346 1820983
24698 1820983 1754071 1689911 1638752 1657134 1693772 1677424 1665514 1592923 1625710 1633120 1711715
24687 1711715 1738753 1715482 1716606 1708014 1641343 1575241 1593060 1691592 1741183 1716623 1625214 1580553
24675 1580553 1596365 1669640 1707941 1766489 1732458 1733895 1756392 1857696 1862635 1830585 1845090
24664 1845090 1794177 1750084 1674474 1669881 1804462 1810495 1774130 1846592 1857605 1837441 1796251
24653 1796251 1734820 1738223 1760803 1754011 1776880 1752947 1742527 1740542 1714661 1764316 1743547 1693762
24641 1693762 1689553 1648071 1690032 1724513 1796663 1803390 1733912 1727339 1721928 1724048 1676202 1634500
24629 1634500 1673169 1701891 1670098 1614250 1605818 1649030 1644729 1633007 1619798 1629213 1660067 1669282
24617 1669282 1665876 1746901 1743812 1699916 1763490 1767149 1671325 1624388 1604503 1660063 1743524 1755762
24605 1755762 1682110 1727816 1785030 1856222 1788994 1723284 1687517 1695928 1747136 1743615 1747944 1774868
24593 1774868 1731749 1702176 1699922 1702445 1743444 1710746 1626961 1596889 1559409 1611754 1662565 1677859
24581 1677859 1652000 1607407 1592543 1606659 1645664 1678465 1629672 1635891 1650687 1696581 1697656 1693311
24569 1693311 1712370 1740853 1770735 1720198 1703717 1755222 1717488 1662744 1622290 1632333 1726169
24558 1726169 1757196 1739923 1672560 1640708 1627616 1572261 1626928 1650697 1593291 1554984 1573731
24547 1573731 1665072 1654406 1669619 1738486 1734905 1674307 1768134 1797991 1774270 1733127 1730374 1789035
24535 1789035 1803687 1782263 1720826 1680131 1720213 1756833 1765703 1733954 1699263 1678967 1727519
24524 1727519 1781907 1786144 1742769 1781895 1846134 1898764 1846838 1782566 1707289 1673570 1675924 1627590
24512 1627590 1590808 1644332 1650078 1635072 1654583 1699681 1666436 1659825 1649080 1655939 1666672 1602888
24500 1602888 1564418 1626155 1683341 1716939 1688699 1668032 1670455 1696186 1716976 1685280 1695836
24489 1695836 1802483 1808920 1782261 1748923 1714380 1651484 1672229 1758781 1736222 1692762 1647432
24478 1647432 1623156 1644836 1688374 1721625 1748439 1776516 1847267 1814885 1758033 1701446 1715333
24467 1715333 1770291 1792417 1742017 1742814 1665694 1716439 1754883 1778047 1826433 1859743 1887582 1836338
24455 1836338 1843787 1817140 1801591 1766885 1801757 1846100 1847050 1786540 1747984 1706923 1632778 1638046
24443 1638046 1809539 1877898 1791702 1681445 1702980 1755044 1797955 1757202 1749061 1779085 1773813
24432 1773813 1740717 1751631 1772765 1797689 1744551 1729997 1697681 1697978 1740808 1702620 1708497 1738533
24420 1738533 1756933 1846871 1841823 1817249 1762660 1773390 1824615 1784326 1682302 1592918 1594881
24409 1594881 1652968 1594233 1612319 1650408 1683424 1767693 1782232 1735059 1767574 1836924 1871411
24398 1871411 1847955 1779322 1742349 1708457 1756853 1746447 1658397 1637444 1672979 1715097 1715589 1661075
24386 1661075 1707316 1828654 1835036 1886937 1945525 1872018 1828967 1758443 1749631 1769205 1793114
24375 1793114 1854514 1841473 1778966 1771963 1766591 1764716 1716300 1716065 1741152 1754193 1740399 1683281
24363 1683281 1765170 1799656 1802679 1832753 1845802 1848679 1780334 1795873 1841136 1840587 1840787 1860011
24351 1860011 1869957 1848293 1804515 1872993 1903537 1812676 1750960 1724723 1685420 1635840 1653572
24340 1653572 1730570 1811867 1849613 1858610 1872754 1853121 1800457 1728675 1685139 1652783 1723300
24329 1723300 1805557 1840677 1804906 1811519 1779135 1721575 1733404 1700906 1639561 1668962 1710408
24318 1710408 1737648 1791704 1822591 1838909 1781357 1781931 1746423 1678243 1652026 1717395 1791481 1797466
24306 1797466 1800230 1766970 1716617 1749221 1826497 1845173 1834164 1801365 1793680 1808516 1842340 1874393
24294 1874393 1921844 1887673 1783164 1767831 1824735 1800021 1822764 1836928 1803733 1744442 1781704
24283 1781704 1830519 1848128 1815517 1753616 1732653 1743873 1744495 1772111 1779154 1755312 1717327 1720161
24271 1720161 1769573 1815728 1820431 1821623 1812817 1829370 1812640 1753378 1697671 1693312 1645847 1626048
24259 1626048 1580967 1611705 1633616 1690556 1691075 1746268 1844317 1825879 1843581 1773155 1757273 1791353
24247 1791353 1844344 1893292 1868244 1859455 1840671 1848677 1836300 1839130 1887923 1908245 1886693 1883355
24235 1883355 1836106 1805951 1773975 1793916 1826372 1840454 1882164 1889533 1902333 1885548 1868177
24224 1868177 1850598 1767628 1728071 1733908 1705574 1735439 1811412 1808875 1776243 1800006 1836928 1859857
24212 1859857 1832132 1808512 1737095 1699519 1755197 1792860 1762886 1744378 1740302 1734235 1762868 1779747
24200 1779747 1746178 1721719 1714576 1709347 1760426 1734930 1776453 1846248 1896986 1909862 1880432 1895124
24188 1895124 1798323 1791768 1831394 1775858 1740109 1778632 1747552 1745001 1801606 1757322 1723775 1771001
24176 1771001 1742442 1765366 1869615 1893956 1884120 1842946 1822659 1812901 1813963 1761906 1801054 1852786
24164 1852786 1824591 1800787 1813060 1763648 1742708 1792260 1838798 1841606 1753026 1781912 1822179
24153 1822179 1838426 1822234 1813684 1780306 1759757 1783332 1845499 1781624 1736064 1759651 1742213
24142 1742213 1799212 1829334 1841240 1788320 1726474 1736492 1807295 1817243 1851455 1915282 1944408
24131 1944408 1981762 2049010 2005027 1919333 1832790 1856019 1847727 1813888 1838580 1839671 1882284 1752924
24119 1752924 1756208 1790624 1804052 1786392 1726088 1764943 1841622 1831653 1796304 1742423 1823310 1833847
24107 1833847 1809483 1850602 1796260 1821737 1880804 1918348 1859923 1753655 1818132 1914777 1974255
24096 1974255 1939626 1878524 1867943 1790044 1762803 1822496 1872715 1924792 2000630 2022805 1965172
24085 1965172 1912737 1893104 1881115 1854573 1829417 1810987 1883925 1899773 1919426 1852867 1776302
24074 1776302 1801773 1808347 1773380 1786701 1810868 1871241 1882165 1865553 1894647 1906327 1820836
24063 1820836 1844930 1920191 1836328 1818536 1871242 1955931 1951310 1900772 1910319 1864182 1838026 1866260
24051 1866260 1919572 1933253 1952526 2006989 1915872 1797411 1809536 1814698 1803085 1809067 1891225
24040 1891225 1903428 1889310 1886110 1876672 1899860 1959313 1955855 1947095 1936913 1925993 1996469 1972073
24028 1972073 1915966 1851487 1861416 1902662 1955690 1950964 1889844 1847373 1850327 1842476 1839989 1870537
24016 1870537 1858116 1905098 2007644 1982701 1966599 1907391 1873964 1893833 1931813 1949601 1944927
24005 1944927 1901149 1831642 1860911 1847044 1813599 1809042 1850302 1932151 1918547 1906509 1857595
23994 1857595 1832117 1866919 1942401 1951183 1920091 2025853 2067780 1978864 1922789 1916951 1891296
23983 1891296 1879598 1859844 1845352 1864446 1873249 1859968 1841355 1847315 1852605 1864125 1819235 1773207
23971 1773207 1803667 1892165 1925498 1905814 1854137 1898315 1971648 1933322 1914347 1938341 1911876
23960 1911876 1967485 1938360 1966573 1954227 1893645 1849308 1809955 1800171 1769474 1791934 1766353
23949 1766353 1803237 1808095 1825405 1843387 1867700 1915211 1934873 1877334 1818222 1789273 1817769
23938 1817769 1899213 1946159 1925788 1954336 1977474 1949130 1856351 1942461 2002283 1983535 1920222
23927 1920222 1904285 1948599 2004265 2048475 2020224 1992731 2008024 1941360 1876621 1842567 1902790
23916 1902790 1977986 1957519 1916051 1952276 1995680 1946030 1905824 1853140 1810108 1835345 1881736
23905 1881736 1877545 1904650 1961269 1982647 1932283 1899692 1863222 1874324 1888679 1842764 1831945
23894 1831945 1802076 1883509 1921408 1899653 1928050 1995245 2047591 2042255 2100244 2066717 1960208
23883 1960208 1903448 1892490 1890820 1859158 1822384 1863469 1876762 1865752 1908393 1920460 1989785
23872 1989785 1999919 1991443 1968546 1997200 1998757 1989806 1991780 2046550 1960452 1936126 1964824 1896433
23860 1896433 1853019 1858933 1917312 1986969 1976613 1913711 1859453 1860724 1856104 1799348 1830192 1886539
23848 1886539 1856117 1864359 1847728 1831806 1803562 1838013 1918252 1979336 2032610 1961201 1979214
23837 1979214 1944316 1939732 1920726 1909885 1964530 1971587 1917483 1924671 1990426 2003246 1955849 1943774
23825 1943774 1918600 1874966 1921730 1918888 1901008 1894678 1888297 1946661 1953280 1918812 1945788 1933086
23813 1933086 1902019 1920375 1877119 1834844 1852716 1881728 1961830 1960019 1951397 1942085 1980623 1886155
23801 1886155 1891230 1946330 1975937 1989471 1982373 1977824 1932426 1928574 1968443 1995163 1952384 1923873
23789 1923873 1965205 1958265 2016068 1969611 1960379 1950575 1965409 1994425 1948456 1912313 1868907 1869356
23777 1869356 1896926 1896541 1886848 1808410 1793786 1770193 1816184 1852166 1907768 1955015 2007264 2019548
23765 2019548 1985389 1924719 1988129 2021166 1965520 1982613 1973274 1894528 1945647 1998752 1969413
23754 1969413 1907416 1908781 1856479 1828814 1918069 1961899 1927942 1919597 1905388 1918050 1911279 1901776
23742 1901776 1884575 1930175 1984439 2045525 2006338 1959461 1938252 1917458 1883957 1934106 1920510
23731 1920510 1874096 1876572 1936362 1952770 1980755 2035351 2015961 2003983 1984050 1984370 2001459 2088298
23719 2088298 2070118 2044021 2040349 2011924 2011929 1968905 1940591 1999828 1979061 2006319 1986294 1984772
23707 1984772 2013426 2004646 2040537 2071316 2111746 2077197 2017605 1987978 1937384 1904236 1980010
23696 1980010 2006587 1938378 1905851 1926455 1898901 1877070 1933191 2002838 2046713 2014624 1977928
23685 1977928 1949920 1957036 1928989 1890700 1959960 2009987 1947421 1923428 1894156 1963043 2026661
23674 2026661 2033998 1961408 1902173 1887700 1904367 2006265 2010385 1902528 1854691 1881327 1932338
23663 1932338 1947833 1960718 1987986 1977303 1963461 1899017 1845463 1923700 1948241 1953770 1860816
23652 1860816 1853450 1901974 1883537 1910953 1880567 1909589 1995309 2052778 2078258 2040208 2011715
23641 2011715 1944103 1933538 1909348 1973374 2010172 2009019 1987488 1971309 2022341 2027281 2030465 2013425
23629 2013425 2007188 2001053 1985460 2019612 2072772 2065399 2021211 1995901 2001894 1935703 1915367 1974199
23617 1974199 2000127 2037663 2106595 2110167 2036945 2059135 2124820 2135548 2084197 2014796 2027540
23606 2027540 2001020 2029838 2030391 1970552 1946880 1951414 1965333 1961619 2033030 2034737 2054451 2087393
23594 2087393 2046578 2025123 2035356 2078486 2082210 2064736 2057951 2087056 2099120 2098200 2085035 2052518
23582 2052518 2008512 1928421 1936682 2002264 2016843 1983700 2041448 2084473 2033595 2038196 2063856 2141104
23570 2141104 2073754 2070649 2025137 1972115 1997123 2052356 2067393 2063305 2086655 2050270 2042966 2051364
23558 2051364 2072459 2031944 1990754 1994104 2012638 2028863 2011824 2017256 2056529 2023845 2007132 2058116
23546 2058116 2057804 2097882 2121733 2032139 1983097 1933559 1918696 1934781 1981707 2014318 1963636 1948568
23534 1948568 1934827 1913097 1935240 1970398 2009391 2009164 1995160 2021583 2057644 2053624 1987849 1939803
23522 1939803 1926289 2012006 2037336 1978705 1958500 1971752 2012198 2052717 2110318 2062864 1969522
23511 1969522 1992567 2074124 2110283 2055419 2029827 2047904 2003881 1968679 1925306 1927849 1970110
23500 1970110 2044904 2055065 2033552 2012125 1986797 1996185 2000068 2028734 2073520 2077796 2078169 2060115
23488 2060115 2038313 2004426 2055906 2086465 2080643 2100185 2009126 1959540 1989955 2043312 1966760
23477 1966760 1965185 2015520 2116747 2110483 2057292 2070906 2077892 2054485 2008108 2042865 2079601 2036661
23465 2036661 2042085 2053455 2135188 2169551 2141555 2129219 2124652 2077514 2028515 2061096 2057904 2007636
23453 2007636 1991299 2032264 2094901 2072298 2009750 2057821 2087048 2104113 2070071 2049221 2022694
23442 2022694 2014779 2028881 2027977 2082464 2132455 2098184 2088821 2064340 2070528 2085758 2135500 2114860
23430 2114860 2126624 2071334 2056693 2024443 2085185 2160993 2168015 2174110 2191856 2178824 2187684 2207443
23418 2207443 2167715 2116646 2065049 2105264 2171487 2197806 2186364 2237244 2203642 2165326 2194026
23407 2194026 2190597 2106561 2106068 2117056 2120429 2124522 2099322 2023217 2132451 2193603 2169766 2137183
23395 2137183 2127339 2131269 2188020 2193864 2181541 2131843 2182794 2199274 2177471 2196708 2098585 2043111
23383 2043111 2087560 2095616 2164680 2148874 2136667 2165001 2147592 2157011 2153827 2066028 2069776 2140890
23371 2140890 2138081 2097447 2185715 2186822 2202150 2189594 2163441 2086071 1995656 2012734 2077002 2145632
23359 2145632 2162823 2161980 2101576 2071174 2114774 2161177 2158757 2167493 2102331 2097519 2126988 2175497
23347 2175497 2196431 2127289 2089074 2055474 2029504 2096870 2141638 2137468 2118873 2130913 2071289
23336 2071289 2084244 2140133 2118959 2112481 2116574 2133757 2151053 2137204 2121811 2187089 2218825 2244252
23324 2244252 2179871 2129620 2136998 2152802 2220373 2265038 2275610 2236143 2254421 2272269 2290651
23313 2290651 2248549 2143123 2127120 2130280 2126895 2147579 2188479 2198311 2183485 2165852 2123045 2135469
23301 2135469 2113986 2047335 2030621 2127243 2158415 2160965 2134592 2198206 2279992 2301800 2242398
23290 2242398 2146693 2157600 2178697 2142203 2138010 2087565 2064444 2112471 2050561 2068944 2117423
23279 2117423 2135318 2095701 2049096 2016679 2010771 2003605 2066441 2077488 2097333 2072325 2129600 2192160
23267 2192160 2168151 2216178 2202355 2157794 2190130 2216525 2220532 2318271 2269271 2202509 2103244
23256 2103244 2090455 2147610 2163769 2207590 2197058 2096138 2079858 2042450 2029659 2112235 2140716
23245 2140716 2182231 2263436 2252765 2216711 2215631 2211792 2191790 2137397 2083255 2124228 2160483 2229091
23233 2229091 2270166 2242215 2181428 2164599 2135721 2190766 2199791 2155432 2157629 2168976 2229743 2219380
23221 2219380 2211780 2167032 2148028 2131519 2110265 2194237 2193677 2154138 2145838 2097585 2115657 2168365
23209 2168365 2228651 2230476 2199307 2172736 2171195 2209036 2225697 2200695 2150934 2232813 2280954 2239464
23197 2239464 2193693 2209005 2172617 2155995 2174249 2168310 2096813 2110334 2097545 2074004 2060157
23186 2060157 2096492 2181890 2213926 2180095 2152690 2213598 2215031 2193924 2205320 2233527 2210191
23175 2210191 2175681 2167974 2215584 2228316 2196267 2166417 2181554 2216858 2193168 2133393 2099108
23164 2099108 2141171 2104706 2151152 2224709 2340295 2317356 2297526 2317685 2272437 2229077 2209743
23153 2209743 2212745 2242996 2178575 2118241 2102183 2160105 2214011 2247519 2208462 2190128 2242365
23142 2242365 2206523 2216406 2215961 2227307 2251672 2282090 2342550 2372161 2343233 2326603 2325092 2345464
23130 2345464 2322533 2305380 2323249 2339846 2316173 2268438 2313727 2253596 2179304 2145591 2121840
23119 2121840 2133100 2213065 2243539 2269262 2288720 2248528 2210953 2245480 2318053 2278701 2261552
23108 2261552 2304660 2274502 2230445 2205239 2194444 2199803 2207010 2279351 2304978 2307629 2310859 2304937
23096 2304937 2259658 2194782 2213381 2204724 2224980 2234606 2222416 2234559 2241836 2215603 2280305 2358950
23084 2358950 2302608 2232723 2185845 2211931 2236057 2239818 2251445 2201661 2166128 2186021 2170088
23073 2170088 2169631 2211996 2196878 2162542 2237007 2297041 2331106 2313631 2314615 2309426 2284332 2214709
23061 2214709 2209495 2243590 2320090 2313699 2231071 2198876 2107953 2032191 2065675 2093144 2165685 2176067
23049 2176067 2163424 2212907 2227303 2200078 2242027 2244461 2215830 2207161 2246418 2252612 2224446 2241486
23037 2241486 2255951 2274141 2238340 2127973 2138763 2168402 2200556 2203050 2254857 2322701 2309891
23026 2309891 2248330 2198563 2249873 2294046 2304232 2249644 2184437 2229742 2256371 2231577 2176524
23015 2176524 2201429 2272726 2259302 2250617 2188019 2200406 2246260 2269290 2288716 2260568 2265128 2244394
23003 2244394 2277161 2333794 2234167 2232383 2289315 2308526 2322118 2271225 2251496 2289749 2303367
22992 2303367 2254282 2256798 2292971 2265586 2274171 2279946 2262982 2204689 2233314 2210536 2158967 2184552
22980 2184552 2265889 2282364 2273425 2299039 2380850 2401540 2346808 2284779 2267190 2310936 2281223
22969 2281223 2218180 2216403 2254116 2258674 2260896 2218577 2244519 2304103 2350278 2374552 2366933 2349769
22957 2349769 2291872 2300052 2348473 2398967 2441854 2467065 2443388 2386985 2355901 2283405 2288182 2277101
22945 2277101 2304479 2273928 2286037 2274583 2210645 2155135 2136131 2227005 2283086 2303079 2351326
22934 2351326 2380934 2356039 2329152 2321406 2321493 2309232 2323578 2267938 2204997 2254206 2290689 2264339
22922 2264339 2286291 2348543 2362436 2334049 2303960 2263238 2298500 2364443 2288516 2300233 2246009
22911 2246009 2210613 2276871 2277399 2287012 2301812 2288003 2354746 2349560 2331898 2312814 2283246 2313916
22899 2313916 2323538 2324170 2367760 2358784 2317321 2287375 2279234 2260174 2283207 2324330 2347926 2356900
22887 2356900 2394386 2420858 2395741 2367270 2334732 2299184 2346722 2377824 2387275 2404220 2383807
22876 2383807 2340826 2321867 2316747 2251112 2218320 2251915 2325541 2435474 2479497 2451613 2387339
22865 2387339 2315873 2317756 2355738 2340138 2362824 2403058 2365155 2349720 2344489 2301142 2290359 2231229
22853 2231229 2273006 2330750 2389005 2389859 2341021 2297394 2234484 2218695 2261143 2282300 2246936 2299087
22841 2299087 2386510 2427589 2482733 2470706 2424485 2427377 2407650 2375485 2390775 2409272 2444572
22830 2444572 2419755 2458330 2404770 2320066 2274473 2274408 2297180 2311683 2286992 2246138 2254788 2342625
22818 2342625 2360130 2352403 2416906 2386907 2339035 2293430 2305652 2354879 2436659 2466181 2462374 2443901
22806 2443901 2459288 2416303 2378566 2370629 2352480 2346885 2348983 2382603 2426506 2424284 2377784 2452589
22794 2452589 2437872 2397130 2416206 2447875 2448696 2435130 2440228 2376822 2353877 2388537 2375748 2310747
22782 2310747 2288507 2314711 2352491 2378740 2415474 2360888 2356987 2374015 2347712 2420130 2512029
22771 2512029 2530044 2515596 2496603 2441501 2405617 2355438 2398426 2445211 2408122 2346377 2359909
22760 2359909 2432878 2394446 2333348 2355197 2366083 2468309 2501571 2489114 2506082 2510913 2464686
22749 2464686 2379734 2401547 2409805 2389087 2427614 2497546 2509341 2431778 2381917 2355398 2360305 2383810
22737 2383810 2380525 2373769 2399948 2436673 2508098 2486712 2377512 2371777 2380149 2415219 2427188 2410009
22725 2410009 2394891 2401157 2379313 2372789 2423682 2433676 2411011 2411914 2430158 2389533 2331902 2319554
22713 2319554 2413023 2473728 2511323 2540650 2538600 2470411 2378250 2393006 2373508 2378270 2441460 2457967
22701 2457967 2463728 2448937 2509064 2527269 2510649 2449769 2477977 2460039 2400168 2377752 2412529
22690 2412529 2452193 2471282 2478420 2486524 2519054 2545029 2512763 2502690 2515658 2514306 2523377 2422231
22678 2422231 2360229 2426810 2416512 2422822 2385521 2372890 2425946 2522622 2554132 2536962 2485951
22667 2485951 2486244 2468641 2458874 2463994 2479218 2511547 2524855 2529415 2514586 2430670 2398194 2432480
22655 2432480 2432259 2428915 2457927 2484495 2510862 2500368 2451815 2420295 2519621 2479552 2453885 2418252
22643 2418252 2448552 2474803 2515148 2542561 2512740 2435651 2483260 2443453 2454659 2468078 2479549
22632 2479549 2475819 2438261 2474516 2431549 2390216 2399500 2390994 2452714 2510905 2417486 2360577 2378951
22620 2378951 2400843 2448752 2474083 2479587 2465957 2459266 2552250 2555043 2527553 2441546 2435159 2394747
22608 2394747 2398461 2473502 2510272 2550453 2543030 2520009 2505103 2469554 2492030 2487231 2483054 2476974
22596 2476974 2461584 2480155 2465822 2477823 2525401 2508043 2494218 2506801 2564654 2566158 2578606
22585 2578606 2587602 2572196 2544645 2496162 2487202 2482570 2447613 2462052 2505705 2501959 2481989 2478437
22573 2478437 2495195 2496482 2460312 2396070 2438284 2463033 2511452 2580152 2575660 2486000 2452358 2535023
22561 2535023 2525146 2470613 2478954 2516754 2578663 2592256 2568962 2528154 2527155 2512007 2505542 2485352
22549 2485352 2469692 2470295 2526202 2571781 2580210 2561152 2553925 2559081 2573051 2551094 2513780 2513872 2545537
22536 2545537 2594238 2606377 2622235 2622193 2624631 2612095 2559715 2454422 2467159 2541911 2565304 2497837
22524 2497837 2542891 2611885 2624435 2580948 2546582 2582436 2616645 2639358 2538195 2413158 2440805
22513 2440805 2507690 2502234 2534487 2557178 2537787 2585825 2594859 2568581 2558996 2509921 2516318 2541615
22501 2541615 2548316 2498169 2470446 2470015 2520590 2614294 2597216 2571381 2497629 2493293 2466667 2459661
22489 2459661 2506723 2577989 2596165 2570313 2519931 2477964 2445482 2509567 2553144 2566249 2571728
22478 2571728 2594736 2623697 2606619 2581691 2575950 2611357 2605976 2619933 2621760 2661697 2620840 2637460
22466 2637460 2648500 2600232 2559362 2582379 2621182 2556173 2541988 2506968 2441497 2494990 2534312
22455 2534312 2543049 2530736 2520447 2564264 2600361 2675938 2626533 2498384 2515803 2558926 2506028
22444 2506028 2577275 2640113 2556327 2561135 2606008 2620831 2584277 2500251 2475781 2524663 2555783
22433 2555783 2550063 2521266 2590909 2653083 2673433 2635316 2641000 2683995 2667292 2618375 2594537 2659609
22421 2659609 2689488 2628090 2666937 2661382 2677153 2671702 2641487 2600094 2538729 2511183 2586786 2600914
22409 2600914 2606370 2572126 2540867 2563948 2558110 2533754 2611947 2646134 2616442 2620683 2666561 2604836
22397 2604836 2585990 2520792 2466685 2476283 2572352 2644606 2725763 2773846 2756100 2690073 2586031
22386 2586031 2546838 2553995 2581423 2604581 2641884 2627651 2533129 2536858 2583416 2627030 2602645 2588479
22374 2588479 2650622 2718878 2708582 2662592 2659837 2719000 2621515 2525517 2585603 2588626 2583052 2589905
22362 2589905 2599766 2568409 2572105 2584469 2565358 2569329 2538161 2590134 2645629 2663741 2694534 2704575
22350 2704575 2640910 2616519 2645576 2678480 2654240 2581097 2613970 2664597 2629895 2606397 2680372
22339 2680372 2665160 2676171 2657494 2643302 2649017 2657403 2666761 2682490 2686516 2644076 2545764 2555681
22327 2555681 2646595 2702543 2745726 2769403 2769948 2754159 2721018 2713527 2770242 2708890 2658100 2651741
22315 2651741 2642570 2629755 2638699 2606717 2560051 2578151 2559732 2532851 2567970 2615651 2679747 2717516
22303 2717516 2668363 2670598 2700720 2719804 2791273 2790173 2698459 2652725 2640128 2616622 2661596 2693685
22291 2693685 2701352 2671423 2664884 2732038 2802751 2819849 2776661 2783051 2814169 2796389 2740494 2770844
22279 2770844 2736338 2682327 2652844 2647978 2642535 2648678 2667736 2698962 2732271 2706842 2767037 2801643
22267 2801643 2778362 2707433 2692790 2675314 2650468 2671346 2689740 2700585 2692686 2745251 2798129
22256 2798129 2773334 2762781 2691207 2656978 2687752 2756041 2786173 2739716 2736775 2738022 2773356 2762095
22244 2762095 2719284 2675606 2686036 2770892 2756732 2753230 2717415 2687282 2675947 2652159 2589181
22233 2589181 2571869 2630067 2586498 2545236 2606222 2647459 2650969 2650274 2653605 2639804 2620059 2640194
22221 2640194 2587400 2591578 2630593 2644510 2662855 2727137 2797850 2836342 2765196 2764741 2739246 2815597
22209 2815597 2856882 2803475 2746110 2722208 2726344 2753175 2811885 2843190 2834507 2745327 2678590 2670617
22197 2670617 2675387 2775008 2736139 2748356 2772368 2750840 2700191 2728582 2795085 2805206 2812009 2803233
22185 2803233 2834097 2888465 2886947 2842906 2812518 2778448 2763038 2770091 2808784 2811832 2764808 2804682
22173 2804682 2822626 2806725 2737710 2717196 2707052 2754795 2707534 2677309 2692311 2723727 2752422
22162 2752422 2788779 2799088 2836049 2845633 2865280 2813203 2819512 2794515 2786490 2783717 2756207 2729002
22150 2729002 2837079 2893314 2812562 2737138 2771465 2745883 2736403 2748821 2808484 2822385 2797973
22139 2797973 2808088 2757051 2741570 2737227 2686239 2716901 2740869 2777889 2823729 2844170 2781797
22128 2781797 2714125 2743786 2879519 2886510 2857020 2848417 2854932 2837533 2818098 2768488 2721765 2737924
22116 2737924 2808389 2808449 2755514 2779452 2797052 2841578 2870424 2817621 2780020 2760259 2726706 2770740
22104 2770740 2815369 2832845 2852671 2828658 2781477 2801907 2795389 2789754 2857239 2916723 2910954 2818927
22092 2818927 2720692 2662690 2772050 2822263 2806627 2818443 2810566 2815943 2821997 2815836 2847990 2847789
22080 2847789 2827060 2799507 2862163 2887498 2803542 2762119 2792099 2883532 2848280 2783050 2805392
22069 2805392 2853925 2842300 2804377 2810333 2792040 2833913 2820828 2795234 2783357 2808522 2881176
22058 2881176 2881587 2852386 2825276 2786300 2794724 2871775 2919555 2924277 2846833 2813841 2909077 2899803
22046 2899803 2837733 2799516 2786026 2828611 2867570 2872884 2801345 2808752 2904913 2930483 2953803 2955626
22034 2955626 2917665 2888358 2885503 2884723 2863883 2883416 2924178 2924397 2918800 2902112 2922001 2938542
22022 2938542 2926117 2918128 2894422 2831502 2865355 2867348 2844739 2818041 2848820 2884134 2923103 2957522
22010 2957522 2927472 2918296 2870161 2898404 2917085 2906593 2912275 2950549 2978891 2990802 2929061 2884530
21998 2884530 2897164 2901702 2853027 2770915 2773641 2773379 2849672 2899856 2923650 2883389 2815983 2799692
21986 2799692 2840814 2929456 2935145 2873270 2920977 2902354 2899383 2893602 2896056 2874293 2841040 2881390
21974 2881390 2886501 2805466 2838247 2861539 2878724 2910827 2963404 2939508 2949513 2898606 2850296
21963 2850296 2838355 2886856 2905947 2900251 2948314 2895272 2881910 2887818 2899925 2919162 2954327 2903582
21951 2903582 2888645 2877377 2878106 2868121 2878157 2881337 2844954 2878996 2947422 2916028 2942819 2936492
21939 2936492 2955061 2966798 2937284 2993726 2937397 2846178 2892357 2884786 2868821 2856181 2859148 2934928
21927 2934928 2901271 2846150 2891308 2949425 2943745 2960416 3035672 3049818 3028733 3009275 2958681
21916 2958681 2936479 2952229 2952811 2983031 2990725 2983928 3037343 2997917 2984820 2969314 2994411 3019301
21904 3019301 2966022 2899961 2974394 3037946 2996239 3001384 2936027 2918005 2979128 2988533 2924431 2973090
21892 2973090 2999084 2978276 2917567 2878960 2916868 2920426 2930560 2981540 3010349 3092594 3085928 3055838
21880 3055838 3032461 3071051 3032584 3014217 2954246 2928879 2928462 2954010 2985445 3056676 3046118 3004188
21868 3004188 2996927 2961014 2998072 3008032 3016370 2969034 2912106 2882479 2833060 2865454 2996469 3071082
21856 3071082 3097302 3117719 3099789 3083495 3035587 3023540 3044406 3016781 3013233 3011346 3016059 2988661
21844 2988661 2989813 3045902 3083505 3036497 2953564 2946690 2989069 3023311 3000194 3028073 3002168 2953709
21832 2953709 2984626 3035102 3083725 3107801 3076579 3084397 3103418 3151233 3168724 3110888 3103930 3055387
21820 3055387 3024373 3043935 3086676 3096219 3086666 3081604 3110659 3163166 3111489 3048556 3024217 3095762
21808 3095762 3175163 3172119 3160348 3142192 3123576 3130034 3077400 2965874 2886140 2904409 3000989
21797 3000989 3019417 2962917 2902392 2918980 2975370 2944962 2983046 3045435 3139258 3126966 3155918
21786 3155918 3136108 3166103 3153890 3137806 3082578 2965044 2974849 3041880 3017574 2997255 3030501
21775 3030501 3108074 3187048 3133573 3112198 3172294 3135776 3053685 3049753 3042917 3023927 3051384 3119335
21763 3119335 3153689 3114187 3101397 3128692 3093661 3132392 3187009 3149232 3152110 3126401 3145169
21752 3145169 3219402 3241036 3192462 3137069 3129019 3122979 3100652 3113299 3122194 3087917 3017704 3058165
21740 3058165 3144748 3092541 3068826 3078495 3041884 3077912 3102496 3123511 3139046 3193572 3190753 3194330
21728 3194330 3230323 3264691 3241538 3145095 3152346 3144088 3065270 3079681 3196355 3232618 3199787
21717 3199787 3118940 3102865 3083110 3132510 3070721 3072689 3061129 3095340 3129460 3121370 3066109 3055522
21705 3055522 3088333 3144139 3203971 3148781 3198659 3236406 3201222 3184587 3129790 3182855 3263872
21694 3263872 3232624 3179535 3152646 3157060 3165755 3191373 3167591 3172831 3147003 3113157 3162008 3190214
21682 3190214 3160721 3112390 3144296 3210352 3261051 3261546 3268478 3257130 3254323 3200299 3200966 3193750 3161026
21669 3161026 3128943 3134122 3174144 3137977 3043669 3110851 3135128 3103072 3144028 3189190 3246188
21658 3246188 3197906 3190490 3170389 3202046 3218149 3242081 3272116 3210905 3129268 3144176 3147471 3156488
21646 3156488 3197586 3170752 3161625 3175316 3166930 3153118 3077244 3132815 3149447 3106964 3110002 3187489
21634 3187489 3247029 3221264 3253071 3221959 3210998 3219603 3267445 3260375 3262882 3278269 3245683 3227536
21622 3227536 3226272 3263449 3208573 3203843 3232244 3172390 3177053 3253461 3347469 3348910 3329712 3290828
21610 3290828 3313625 3355596 3373939 3240053 3165969 3181980 3244544 3238741 3216966 3232086 3191458
21599 3191458 3212295 3226600 3198253 3204049 3254887 3292486 3256474 3231773 3161548 3170813 3200494 3233352
21587 3233352 3207645 3151557 3159385 3180809 3230019 3261215 3235475 3221795 3224860 3270783 3306439 3352352
21575 3352352 3332842 3338711 3326844 3335009 3349922 3375901 3357433 3293597 3293933 3245116 3251848 3300525
21563 3300525 3316360 3344772 3290484 3298709 3292019 3328882 3376407 3402630 3406724 3416427 3416394 3390992 3434460
21550 3434460 3404443 3426315 3481491 3478839 3379749 3306765 3286378 3267319 3291978 3265697 3290007
21539 3290007 3299032 3366297 3337410 3328470 3367364 3370644 3328339 3300964 3220815 3191143 3195987 3253716
21527 3253716 3237613 3276488 3306242 3329230 3341577 3359365 3369517 3391247 3393140 3343922 3283662
21516 3283662 3283464 3303535 3297867 3260759 3278553 3358871 3303732 3326284 3338771 3394293 3404372 3423256
21504 3423256 3449483 3382908 3321131 3334105 3320275 3375943 3421548 3367438 3314015 3316546 3361077
21493 3361077 3402604 3444527 3479626 3369249 3345913 3378636 3446512 3449981 3364609 3323366 3334736
21482 3334736 3300095 3307015 3366209 3393293 3399847 3390048 3299630 3342527 3435423 3432505 3421870 3450131
21470 3450131 3448320 3447508 3402512 3375961 3296776 3345051 3449709 3433046 3386276 3369229 3446944 3401069
21458 3401069 3306786 3323444 3331256 3420465 3396063 3410160 3476292 3482634 3401063 3369513 3442711 3410568
21446 3410568 3383141 3345627 3428821 3557512 3606443 3544048 3481579 3473079 3468968 3447998 3402914
21435 3402914 3388032 3409815 3401259 3328947 3434260 3508776 3515617 3529825 3571157 3596966 3677634
21424 3677634 3647581 3622114 3544152 3508666 3471298 3509191 3559130 3493509 3411468 3395165 3379470
21413 3379470 3441725 3478139 3482584 3485465 3454997 3396330 3453466 3459761 3495466 3479763 3518699 3507802
21401 3507802 3569532 3610200 3612506 3617903 3576887 3619228 3572479 3569642 3540742 3477295 3452139 3430896
21389 3430896 3447154 3450165 3530929 3534018 3496161 3481879 3499458 3409923 3480119 3546860 3607846 3606340
21377 3606340 3556487 3493989 3545594 3521633 3483662 3524649 3560577 3580006 3552300 3532460 3511283
21366 3511283 3582943 3621900 3573850 3571563 3532601 3512551 3547945 3529140 3488707 3441506 3467821
21355 3467821 3551691 3544692 3493062 3510268 3501095 3501072 3575063 3542104 3481827 3520417 3580510 3587775
21343 3587775 3568212 3560776 3578677 3514372 3488164 3474764 3507886 3555716 3614162 3601668 3563676
21332 3563676 3594626 3540827 3527860 3523607 3475038 3536732 3585555 3600698 3606809 3655737 3636507 3647110
21320 3647110 3642066 3606714 3559481 3523529 3518725 3518970 3584392 3635085 3651766 3714277 3710279 3675798
21308 3675798 3690836 3633848 3579420 3635831 3652237 3699820 3652638 3589477 3602657 3587762 3624125
21297 3624125 3531280 3504465 3542908 3564238 3583143 3524549 3594151 3615133 3570791 3536197 3585213
21286 3585213 3681830 3722572 3739537 3728415 3778079 3805556 3703027 3606699 3575082 3648822 3707818
21275 3707818 3707600 3645432 3594717 3651225 3696669 3724576 3733165 3716579 3677711 3634563 3627482 3671442
21263 3671442 3643305 3667475 3684009 3734229 3734429 3730144 3719801 3693881 3686991 3668657 3648462 3616127
21251 3616127 3616062 3670979 3725788 3683065 3625609 3660026 3726301 3699345 3687549 3698845 3722084 3713297
21239 3713297 3668780 3710685 3729156 3762813 3813622 3830899 3837032 3760327 3729494 3769529 3826076
21228 3826076 3812685 3759548 3771438 3772219 3758307 3790870 3770918 3730499 3793875 3795395 3741504 3634250
21216 3634250 3630976 3717167 3768866 3752679 3753580 3754079 3710655 3694211 3699880 3724260 3754817 3691058
21204 3691058 3674254 3669946 3611635 3588605 3638081 3752669 3736319 3730810 3780630 3855345 3871314
21193 3871314 3835430 3861591 3841986 3862156 3860429 3827093 3776128 3795763 3829743 3775800 3627219
21182 3627219 3648441 3647346 3702620 3796736 3847099 3841564 3797298 3826003 3839033 3832498 3807594 3849837
21170 3849837 3853056 3895546 3911223 3840121 3795602 3805076 3853185 3846037 3853242 3852322 3859439 3855886 3872685
21157 3872685 3850326 3801768 3804864 3864480 3929372 3911300 3880940 3857783 3816898 3803278 3788938
21146 3788938 3765720 3837494 3876372 3887763 3845935 3888290 3866773 3851383 3835243 3775637 3785316
21135 3785316 3822048 3794252 3833507 3874938 3842217 3835558 3833657 3843512 3873022 3871099 3867697 3811441
21123 3811441 3751977 3743457 3779588 3774137 3784701 3770618 3793737 3827232 3864528 3911321 3954290 3938283
21111 3938283 3840497 3832149 3927020 3928966 3880370 3832979 3807555 3835502 3966443 4050838 4001576
21100 4001576 3953652 3886624 3930941 3951102 3940352 3897262 3863002 3895419 3990144 4066567 4052095
21089 4052095 4062828 4022287 3997943 3956405 3916413 3872257 3875930 3910516 3950903 3944874 3931350 3934273
21077 3934273 3938780 3961486 3949190 3978426 4031951 4059380 3976303 3996050 3942054 3935683 3976930 4018698
21065 4018698 3971789 3929740 3940262 3909169 3917156 3980095 3971395 3996333 4019511 4002936 4066531 4093130
21053 4093130 4042515 4035108 4013772 3984798 3971993 3951858 3969911 3945675 3899640 3940079 3957604
21042 3957604 3974508 3940123 3951143 3971913 4012386 3990090 3978857 3941969 3933453 3996387 4048272
21031 4048272 4050556 4051623 4038285 4031463 4003073 3953778 3964177 3972462 4003102 3977850 4003872 4009116
21019 4009116 4007463 4046096 4065313 3992656 3909915 3870068 3904409 3881349 3884232 3938044 3958529 3989762
21007 3989762 3963976 4007343 4071392 4093617 4115804 4081553 4047363 4105501 4115160 4051729 4042834 4068122
20995 4068122 4108031 4112013 4110890 4123751 4088906 4096562 4130846 4095573 4050413 4099109 4112609 4099826
20983 4099826 4082228 4043968 4042584 4103951 4105762 4106508 4162694 4107115 4065979 4094895 4038654 4092562
20971 4092562 4169045 4196400 4192424 4184354 4199030 4224830 4219611 4169935 4185649 4249098 4252984 4179290
20959 4179290 4118327 4093351 4097375 4153302 4204861 4127319 4187145 4239423 4203380 4181671 4158260
20948 4158260 4196759 4249801 4285331 4303483 4307165 4239481 4195736 4190973 4201762 4214826 4144424 4116638
20936 4116638 4091960 4109391 4135362 4148979 4181757 4117160 4121815 4122411 4146682 4153884 4162084 4186930
20924 4186930 4173837 4196486 4233434 4230935 4228324 4213899 4202443 4135471 4133481 4111465 4103273 4105291
20912 4105291 4168311 4223347 4271174 4264798 4188627 4219341 4240420 4209016 4214699 4197859 4210855 4151733
20900 4151733 4143030 4180685 4212703 4258686 4223369 4259515 4301517 4346753 4339187 4253703 4243705 4295747
20888 4295747 4339508 4303226 4311115 4262849 4248712 4195120 4249525 4358449 4395445 4342399 4340945
20877 4340945 4343231 4315388 4322752 4302975 4352362 4441664 4448641 4340511 4303149 4285809 4291402 4240816
20865 4240816 4283429 4352530 4352597 4350850 4420949 4354825 4288087 4293738 4339570 4291531 4277504 4268405
20853 4268405 4316687 4338956 4347878 4356271 4410094 4468119 4442439 4413640 4478060 4529570 4524781 4454127
20841 4454127 4366578 4358787 4383939 4408461 4395000 4362536 4404880 4439882 4377207 4337377 4379204
20830 4379204 4445051 4445059 4424145 4383295 4398525 4385880 4343417 4336611 4296577 4297723 4366729 4399082
20818 4399082 4388650 4392249 4350756 4435830 4463697 4522693 4555421 4517867 4413740 4367003 4365162
20807 4365162 4427533 4478779 4533782 4540527 4472817 4475015 4451294 4443122 4390826 4395167 4473236 4543061
20795 4543061 4527139 4511809 4476555 4485382 4483933 4450931 4419259 4362028 4392864 4367610 4391005 4399604
20783 4399604 4392871 4418445 4389944 4402344 4439577 4497154 4501324 4490809 4505057 4455977 4416127 4484677
20771 4484677 4504136 4504344 4405141 4415550 4454560 4527198 4528289 4535038 4563233 4559520 4514750 4519733
20759 4519733 4511097 4441589 4492666 4601715 4640431 4589957 4606120 4636126 4698243 4662960 4601941
20748 4601941 4571917 4614381 4683578 4649010 4549636 4531113 4545908 4507129 4527645 4508446 4514063
20737 4514063 4521652 4560456 4654894 4707511 4678346 4686313 4685798 4604365 4520862 4511503 4556051 4599279
20725 4599279 4601895 4631835 4663622 4622937 4645915 4709375 4749761 4721875 4657700 4652116 4628187 4643183
20713 4643183 4652640 4737406 4755507 4767833 4757063 4768622 4668041 4620676 4630703 4630295 4674543 4683481
20701 4683481 4653623 4636308 4679905 4712370 4711434 4740585 4717666 4646624 4616048 4564119 4579952 4592609
20689 4592609 4628080 4715886 4704930 4633076 4662107 4680819 4709071 4688668 4647494 4671586 4675613
20678 4675613 4714709 4733810 4718429 4703944 4761038 4783160 4762075 4770944 4771325 4769467 4806941 4822834
20666 4822834 4763796 4688104 4714293 4760797 4725115 4651331 4663875 4769067 4807827 4860776 4938335
20655 4938335 4863144 4759066 4807040 4841647 4842350 4841204 4851602 4844879 4810159 4834787 4882545 4920150
20643 4920150 4865106 4799356 4773999 4803308 4832833 4834771 4875540 4869431 4837447 4893039 4925246 4913696
20631 4913696 4854982 4861700 4851824 4879640 4900637 4885378 4929192 4933272 4906522 4872346 4910850 5010739
20619 5010739 5017145 5015079 4984578 4905830 4906377 4877506 4925921 4995011 5008375 4992815 4945308 4930165
20607 4930165 4869198 4933277 4991833 4948024 4925391 4931353 4950418 5008158 5042117 5012063 4950977
20596 4950977 4949614 4975754 4957503 4912471 4926806 4888816 4883861 4820164 4823828 4860957 4868931 4938166
20584 4938166 4962651 4876226 4898280 4872733 4853553 4852774 4876455 4923554 4999017 5020988 4980703 4987140
20572 4987140 4967659 5029758 5044030 5057130 5066133 5055623 5030519 5080411 5058117 5057655 5072503 5104697
20560 5104697 5113168 5072300 5076290 5088168 5049988 5091039 5083820 5097185 5117453 5160240 5179456 5159772
20548 5159772 5079329 5059101 5055682 5089780 5125203 5102249 5152250 5181908 5137518 5101757 5098298 5042840
20536 5042840 5022578 5054911 5080107 5061941 5124414 5187013 5201853 5202424 5188776 5196902 5174777 5142472
20524 5142472 5149526 5095168 5063315 5099415 5140716 5153367 5159868 5183496 5111622 5076532 5039707 5099054
20512 5099054 5164583 5229501 5218436 5197882 5178292 5242262 5251476 5175800 5137236 5118834 5168654
20501 5168654 5193472 5227362 5239560 5259837 5242174 5168215 5185123 5226409 5241982 5205983 5247976
20490 5247976 5285878 5305888 5306853 5251573 5234531 5297362 5395688 5391245 5272566 5223718 5229484 5245927
20478 5245927 5315982 5315662 5237468 5229817 5315065 5337224 5326503 5249737 5242290 5318821 5313350 5307261
20466 5307261 5259350 5232908 5279046 5453696 5511280 5439054 5373768 5349683 5356339 5391565 5399455
20455 5399455 5481082 5458940 5377750 5368959 5353021 5363822 5337839 5395829 5364921 5382863 5385116 5399566
20443 5399566 5451616 5391132 5339737 5361671 5401729 5368407 5381046 5367652 5397212 5452013 5480174
20432 5480174 5474488 5447257 5427484 5421566 5375844 5347264 5317464 5340142 5330845 5409221 5412948 5408239
20420 5408239 5421568 5424729 5415167 5434505 5429782 5396662 5433436 5437187 5427929 5424968 5488389 5547821
20408 5547821 5540685 5499567 5480835 5478306 5528636 5537866 5544710 5602232 5643420 5694497 5648243 5512818
20396 5512818 5469135 5527444 5553985 5590949 5590221 5501469 5476604 5537663 5578806 5578702 5604379 5624694
20384 5624694 5647135 5740631 5754861 5704222 5633212 5496497 5550060 5607047 5607947 5637978 5669339
20373 5669339 5677198 5687702 5704368 5758490 5751258 5747592 5719059 5656660 5694133 5673996 5626590 5708634
20361 5708634 5782435 5844001 5847627 5819335 5734271 5740490 5801667 5776874 5726346 5735659 5745207 5817320
20349 5817320 5768974 5743600 5735861 5811352 5817071 5824458 5886735 5932274 6004892 5988194 5923438 5871756
20337 5871756 5837139 5748261 5719419 5692995 5674213 5713058 5767684 5833852 5803365 5801526 5890597
20326 5890597 5859114 5865023 5921826 5853418 5859696 5896799 5913824 5943251 5934727 5899013 5790800 5747873
20314 5747873 5821672 5865355 5893718 5870052 5864592 5863174 5812550 5828909 5843235 5842086 5875343 5904642
20302 5904642 5906147 5949629 6026357 6017044 5989087 6028038 6064294 6042773 5986614 5946830 5839859
20291 5839859 5808769 5806439 5881357 5969490 5980525 5959495 5961891 5995346 6030801 6009290 6077790 6150287
20279 6150287 6141309 6071464 6016422 6010378 5988719 5981253 5975532 6022075 6049557 6005862 5935678 6011673
20267 6011673 6077964 6123934 6153135 6128465 6125117 6200327 6254443 6214226 6123197 6112210 6152160
20256 6152160 6170595 6156172 6134550 6119459 6137813 6182328 6219925 6192211 6121808 6129500 6185695
20245 6185695 6177122 6147431 6173722 6193033 6203474 6248566 6335506 6374249 6389890 6378578 6386399 6344916
20233 6344916 6349757 6295189 6334636 6347197 6310662 6309360 6341875 6363930 6330593 6309244 6401772 6419352
20221 6419352 6440585 6457754 6367946 6323989 6299607 6313824 6315695 6354408 6377967 6377021 6293424 6267620
20209 6267620 6337084 6441282 6534642 6485019 6445056 6431341 6436075 6466330 6505956 6482694 6477213
20198 6477213 6447106 6411727 6428705 6432598 6487725 6465818 6453086 6452116 6403312 6361639 6422916 6496134
20186 6496134 6523982 6541837 6571358 6574187 6638032 6637516 6547298 6568514 6554717 6590870 6626141 6602124
20174 6602124 6663485 6634520 6602139 6603586 6637105 6637455 6687524 6728755 6781940 6790313 6894690 7039609
20162 7039609 7072884 7032442 6984632 6885023 6823782 6854258 6914119 6896696 6837090 6808655 6690205
20151 6690205 6701084 6786716 6812063 6822815 6831455 6873804 6864828 6819523 6770868 6736892 6740523 6744712
20139 6744712 6738275 6733652 6759217 6778964 6811107 6846900 6857940 6872660 6882369 6922846 6949335 6925538
20127 6925538 6859949 6804014 6859958 6886707 6894077 6807214 6766243 6764400 6836381 6892036 6879438 6832275
20115 6832275 6793906 6785314 6820088 6780123 6774558 6714135 6635150 6639261 6587269 6598625 6655643 6655097
20103 6655097 6678814 6763721 6791377 6848480 6862994 6803855 6796690 6870346 6888679 6892606 6895056 6886530
20091 6886530 6833891 6873105 6908818 6956849 7002215 6903364 6854658 6908063 6915487 6926647 6963039
20080 6963039 6981043 7011290 7042766 7041580 6994948 6962555 6950477 6983522 7076286 7105026 7115659
20069 7115659 7094702 7056050 7078265 7201991 7277135 7285261 7168786 7166372 7151926 7152275 7176388 7153103
20057 7153103 7162068 7196871 7238971 7281526 7243206 7205979 7212224 7278032 7280468 7298439 7313366 7293607
20045 7293607 7264960 7243198 7297188 7330439 7306141 7324019 7344498 7287083 7279540 7257101 7341396
20034 7341396 7386925 7345217 7391796 7398739 7439642 7462798 7468757 7478691 7470594 7482834 7517322 7500451
20022 7500451 7455681 7437928 7437014 7435439 7471642 7468668 7485883 7491605 7441967 7496118 7509886 7529835
20010 7529835 7568673 7569733 7591552 7628662 7615389 7633884 7607993 7616826 7620275 7609963 7613328 7626133
19998 7626133 7596749 7615118 7652398 7683495 7743544 7722724 7705511 7725737 7707531 7788393 7833174
19987 7833174 7794939 7815267 7835004 7838936 7847905 7849904 7841489 7823149 7804729 7796198 7841556 7916946
19975 7916946 7925847 7894541 7887853 7911991 7956727 7905209 7892975 8010735 8079009 8089552 8104148
19964 8104148 8052530 8043780 8053210 8037713 8062715 8092222 8118990 8040708 8069504 8161954 8131961 8156007
19952 8156007 8133053 8115483 8149005 8161650 8179101 8236467 8272137 8213554 8189611 8222802 8263740
19941 8263740 8324293 8272088 8305020 8339292 8345745 8457404 8470948 8479379 8491758 8484685 8459204 8431668
19929 8431668 8406269 8503364 8483963 8495465 8519992 8520869 8476568 8481038 8524219 8529294 8508227 8543774
19917 8543774 8607260 8561974 8487377 8595774 8690440 8669710 8703036 8704811 8603006 8598401 8702412
19906 8702412 8757605 8785477 8848744 8872928 8837715 8788879 8724438 8731776 8798694 8803200 8757692 8718865
19894 8718865 8744556 8800254 8830991 8880971 8861861 8919041 8881875 8805217 8769626 8859230 8912618
19883 8912618 8897958 8938141 9039457 9112498 9107301 9063484 9079215 9158860 9201845 9161150 9105477
19872 9105477 9145395 9208790 9206949 9208371 9248458 9285706 9213869 9226540 9316761 9416033 9451994 9491150
19860 9491150 9438613 9430685 9478948 9520790 9553338 9578320 9572352 9575126 9606902 9602262 9595335 9576041
19848 9576041 9652980 9660798 9685172 9702964 9763393 9797000 9849917 9878595 9906642 9955486 9908382
19837 9908382 9837733 9854158 9911776 9935311 9932459 9957550 9966465 10039990 10112784 10084147 10074459 10114943
19825 10114943 10144903 10071095 10094014 10137662 10185034 10221003 10241815 10206158 10235717 10247316 10326233
19814 10326233 10373283 10384219 10402456 10381558 10417635 10469731 10428161 10463286 10477873 10471003 10573422
19803 10573422 10661947 10614805 10648649 10696130 10681043 10664955 10672284 10723572 10752297 10814850 10824387
19792 10824387 10785666 10804087 10905368 10964696 10945281 11008769 11059344 11077333 11071312 11135368 11239985
19781 11239985 11325577 11271536 11237304 11330279 11341763 11345381 11361727 11345895 11419766 11520180 11510661
19770 11510661 11503192 11494670 11510599 11603108 11712717 11800130 11780118 11817467 11912070 11905983 11799815
19759 11799815 11764850 11855853 11914683 12010822 12092369 12130519 12207132 12283564 12270768 12227733 12249640
19748 12249640 12342900 12469248 12486298 12535579 12579391 12622132 12664827 12651822 12694663 12730492 12755887
19737 12755887 12823375 12892178 12927940 12938722 13034332 13089735 13102475 13109488 13194393 13251397 13327026
19726 13327026 13413200 13476984 13518530 13624327 13718527 13781011 13805712 13795780 13862757 13917662 13901959
19715 13901959 13948771 14020302 14040954 14105977 14170003 14233635 14315609 14317562 14347839 14382484 14422338
19704 14422338 14410082 14428247 14474022 14571637 14624318 14736949 14750906 14750975 14888364 15068218 15189682
19693 15189682 15299735 15393909 15482521 15615261 15744987 15795899 15758098 15747840 15828203 15966062
19683 15966062 15978655 16081787 16154863 16171197 16258286 16359415 16489977 16591684 16692727 16763728
19673 16763728 16890468 16987608 16969761 17033105 17171805 17227255 17375481 17415907 17484089 17607479
19663 17607479 17725555 17828869 18036622 18141242 18212477 18391285 18690421 18832994 18940706
19654 18940706 19124721 19324271 19487155 19615340 19789473 19939020 20103983 20291050 20531063
19645 20531063 20770676 20974528 21157337 21354513 21646376 21929173 22155188 22442550 22774686
19636 22774686 23029267 23273661 23650943 24056457 24356983 24688572 25071443 25351590 25598464
19627 25598464 25792045 26010266 26335405 26765357 27142883 27515637 27902798 28352009 28906102
19618 28906102 29416938 30000304 30556775 31055191 31586530 32201907 32861042 33548012 34356279
19609 34356279 35129668 36019451 37112173 38392722 39756330 41338438 43173579 45168991
19601 45168991 47379996 50107861 53283534 56887441 60873841 64484941 65397646 61390406
19593 61390406 53302533 45836006 43607277 43615966 40367003 32945339 25205043 23094842
19585 23094842 26590194 32327000 37508247 39018320 34737774 26289820 19227333 17704637
19577 17704637 17411031 13060801 4450910 -3752592 -5983954 -3397005 851645 5421986
19569 5421986 9837086 14364089 19121507 24073645 29125968 32888244 32677198 27061534
19561 27061534 18555231 13320648 13222244 12696774 7584326 -1047925 -7364498 -6842161 -2011746
19552 -2011746 3850699 7831193 6872204 100239 -9153891 -14470730 -15076351 -17103321
19544 -17103321 -24268495 -34729090 -42169706 -43246581 -41008010 -38038862 -35355263 -33054044
19536 -33054044 -31074312 -29375253 -27941201 -26636354 -25422790 -24289052 -23279426 -22334450
19528 -22334450 -21405348 -20570429 -19865476 -19257692 -18716116 -18257042 -17808403 -17302312 -16871263
19519 -16871263 -16486217 -16056452 -15715714 -15376776 -15049279 -14686352 -14262041 -13909261 -13632940
19510 -13632940 -13370671 -13097007 -12751492 -12408857 -12166913 -11970473 -11775302 -11552137 -11357798
19501 -11357798 -11120865 -10925549 -10693094 -10485529 -10270759 -10070205 -9755442 -9532541 -9355927
19492 -9355927 -9124425 -8914445 -8688772 -8528702 -8322695 -8169438 -7989267 -7819762 -7639027
19483 -7639027 -7413521 -7263169 -7109065 -6933617 -6822322 -6685982 -6576027 -6420430 -6242675
19474 -6242675 -6126287 -6011457 -5874585 -5665825 -5535619 -5380758 -5296706 -5235229 -5110685 -4928928
19464 -4928928 -4785249 -4696445 -4637052 -4599738 -4456973 -4315452 -4259874 -4180066 -4128549 -4017500
19454 -4017500 -3942497 -3832699 -3722476 -3625932 -3453516 -3379226 -3249369 -3203046 -3206998 -3099947
19444 -3099947 -2970986 -2866568 -2743395 -2623153 -2609709 -2628449 -2563702 -2501596 -2386624 -2192898
19434 -2192898 -2037699 -2073165 -2048766 -1917606 -1873439 -1844773 -1834045 -1779830 -1665042 -1561267
19424 -1561267 -1536861 -1510472 -1359337 -1263423 -1231447 -1238819 -1206911 -1130717 -1122313 -1012339 -963170
19413 -963170 -920050 -824944 -823222 -775212 -677053 -584732 -562260 -511363 -409623 -381907 -347411
19402 -347411 -263701 -299909 -225147 -93211 -41060 5627 32687 25661 73957 163556 258667
19391 258667 339345 377162 444918 506205 525695 575028 621947 738629 844527 884451 865927
19380 865927 879632 913976 925710 1040116 1115064 1187807 1207917 1249289 1350452 1480944 1564395
19369 1564395 1590387 1526878 1485459 1544590 1667883 1767376 1782587 1772545 1804259 1914405 1959189
19358 1959189 1936032 1916929 1883792 1849811 1875758 1994403 2001787 2001749 2001592 2067837 2109754 2141349
19346 2141349 2242439 2413336 2493927 2474674 2538202 2545690 2584463 2618600 2674001 2737853 2838526
19335 2838526 2879031 2917863 2960661 2914856 2977042 3069977 3075742 3064855 3071876 3111681 3184911 3236110
19323 3236110 3273079 3275218 3270832 3348535 3414272 3404729 3406831 3303311 3301673 3390588 3407060 3428042
19311 3428042 3396719 3387273 3436336 3468852 3519701 3577679 3569521 3568490 3554642 3558871 3618863 3645149
19299 3645149 3663684 3738976 3891897 3975879 3979183 3983383 3993045 4013191 4093775 4151385 4175838 4186909
19287 4186909 4183828 4195474 4213660 4224721 4278764 4260291 4297966 4321393 4361365 4427042 4496309
19276 4496309 4521118 4577059 4590766 4608613 4635087 4552639 4604996 4670898 4692552 4740822 4777111
19265 4777111 4857084 4836704 4874423 4996721 5102377 5084007 5042599 4999875 4928171 4833595 4803743
19254 4803743 4891700 4987375 4988374 5023703 5107292 5135102 5188981 5196744 5236312 5268214 5266785 5308131
19242 5308131 5319796 5355142 5365570 5466452 5526606 5596523 5666053 5636494 5610788 5640981 5603475
19231 5603475 5589327 5596213 5638180 5679076 5762536 5828565 5899916 5880372 5854036 5954781 5980343
19220 5980343 5976065 6025565 6045443 6016392 6068906 6098957 6106481 6198788 6231915 6275940 6286647 6249953
19208 6249953 6279366 6342246 6457045 6460535 6466769 6535688 6525348 6501697 6462091 6439166 6429848 6456684
19196 6456684 6544108 6656457 6671608 6719609 6759208 6805957 6775220 6719316 6746397 6757012 6775231
19185 6775231 6841257 6879049 6910117 6899038 6894442 6909493 7010038 7099854 7114998 7110435 7096027
19174 7096027 7063774 7051416 7074066 7135027 7278504 7368411 7352498 7407094 7432105 7432001 7472965
19163 7472965 7496016 7565824 7516232 7504048 7547354 7607506 7640178 7646965 7654695 7682805 7740505 7751421
19151 7751421 7778815 7774575 7830343 7867437 7872898 7938113 7947144 7915906 7953111 7946562 7926979 7966871
19139 7966871 8000985 8092474 8185848 8202390 8226699 8248345 8257822 8248775 8278285 8300940 8369697 8394140
19127 8394140 8359576 8413131 8471581 8490698 8535015 8533477 8489889 8569373 8641001 8687028 8715313
19116 8715313 8712875 8754164 8756641 8741608 8790845 8796713 8852109 8900543 8935818 8943749 9002543 9069682
19104 9069682 9060690 9096333 9245579 9284094 9294141 9346548 9368791 9423110 9379515 9387852 9491329
19093 9491329 9532924 9503701 9543410 9633100 9639543 9673104 9680268 9678936 9659231 9751180 9771834 9769034
19081 9769034 9868439 9970533 9935620 9938796 9937227 10028253 10085783 10087976 10104787 10126947 10194138 10248169
19069 10248169 10336867 10407312 10441851 10504074 10571869 10616417 10638258 10631623 10713343 10801978 10909430
19058 10909430 10968300 10898887 10835117 10895446 10966962 11069361 11103918 11067322 10998185 10894304 10880830
19047 10880830 10910858 10943939 11072286 11111827 11131248 11176182 11153304 11213442 11248606 11336142 11416539
19036 11416539 11495818 11484095 11390365 11269024 11233453 11261400 11439663 11597488 11652770 11708965
19026 11708965 11716333 11627672 11608645 11602369 11708011 11790345 11807591 11906296 12013642 12127444 12200229
19015 12200229 12231123 12183525 12168551 12239222 12349518 12389022 12502348 12593566 12670496 12775861
19005 12775861 12767941 12747983 12632774 12520490 12558726 12674189 12797374 12935697 13076042 13191851
18995 13191851 13295819 13328469 13302833 13256738 13310733 13417413 13480621 13529429 13533940 13388020 13176280
18984 13176280 13104584 13117231 13210137 13385864 13632458 13842272 13855719 13745578 13618879 13607992
18974 13607992 13596292 13619582 13634851 13619388 13629754 13655322 13776072 13820463 13808189 13874424 14010462
18963 14010462 14149590 14215428 14296832 14399929 14539792 14619357 14644681 14752004 14811073 14894018
18953 14894018 14984842 15045553 15096806 15210709 15307100 15424794 15505540 15591114 15708273 15798745
18943 15798745 15879571 15970228 16088557 16163146 16309257 16362889 16387696 16508212 16611005 16672478
18933 16672478 16728451 16824874 16902718 17007497 17149902 17198191 17294011 17439915 17476332 17610701
18923 17610701 17703568 17814410 17930505 18068319 18169199 18267151 18290035 18391005 18549707 18736672
18913 18736672 18862657 18872696 18951389 19124237 19327918 19525157 19783853 20025187 20135192 20289914
18903 20289914 20431692 20682292 20918946 21123226 21312335 21503349 21676956 21849030 22151782
18894 22151782 22435729 22717403 22948263 23133010 23351243 23598893 23882266 24165898 24449322
18885 24449322 24700756 24994580 25360346 25752370 26221969 26673573 27147732 27620998 28079173
18876 28079173 28649225 29290959 29915987 30605737 31388354 32189734 33201198 34432560 35966773
18867 35966773 37733345 39874540 42541202 45795743 49393942 52244051 50237631 40446838
18859 40446838 25439690 14383752 13107511 15893593 19406154 22800492 26168852 29781242
18851 29781242 33652339 37632420 40220479 37302545 26782486 11876916 2448080 2062157
18843 2062157 4673530 7541340 9989000 11962994 13612555 15127441 16508470 17782117
18835 17782117 18925339 20043603 21192838 22296763 23464176 24724293 25975115 27229029
18827 27229029 28433197 29638689 31013691 32760604 34869907 37249389 39955375 43280024
18819 43280024 47274790 51952372 57011538 60091056 56223217 44679619 30431792 25362928
18811 25362928 29943650 36944264 41050276 37353746 26544436 14949632 13329870 18687860
18803 18687860 23115547 20496356 10480809 -1368200 -4080283 1016048 7340336 9650808
18795 9650808 3462047 -9787961 -22931522 -25920722 -23034790 -19284693 -15982717 -13237112
18787 -13237112 -10841603 -8720489 -6881694 -5247527 -3866883 -2698187 -1616287 -556508
18779 -556508 632976 1965376 3215791 4413987 5602117 6702183 7941566 9438768
18771 9438768 11232540 13137315 15210329 17728060 20848359 24741941 29170191 32714619
18763 32714619 30840167 19634146 1752190 -12638483 -14868504 -11554576 -7328735 -3225588
18755 -3225588 758391 4864408 9332424 13850832 16894714 13985810 2291480 -15022972
18747 -15022972 -27398697 -28809727 -26062404 -22897268 -20280280 -18176571 -16373183 -14841737
18739 -14841737 -13539319 -12491443 -11609507 -10788494 -10048456 -9332325 -8667912 -8004821 -7419111
18730 -7419111 -6980589 -6688181 -6429311 -6117592 -5705204 -5303524 -4965164 -4635393 -4280399
18721 -4280399 -3889532 -3502345 -3188073 -2854493 -2651759 -2618283 -2595997 -2557643 -2324442 -1999267
18711 -1999267 -1668556 -1384426 -1068910 -756695 -493250 -269472 -124398 47283 225559
18702 225559 388063 585610 772947 950241 1207491 1430803 1628332 1894328 2134545 2367157
18692 2367157 2562463 2796376 2992903 3109084 3240378 3412869 3607027 3826189 4029722
18683 4029722 4133643 4282356 4487425 4654769 4816499 4953773 5109522 5233655 5475101
18674 5475101 5682255 5857605 5944834 6055357 6285362 6438011 6505817 6629000 6763573 6958136
18664 6958136 7148464 7339472 7496720 7670993 7824862 8016105 8165228 8360141 8571968
18655 8571968 8725871 8908060 9186650 9429545 9593803 9782486 9975563 10198365 10378035
18646 10378035 10584565 10813978 10990945 11017475 10969156 10970918 10968670 10993071 11067084 11175353 11372222
18635 11372222 11600548 11782003 11936863 12129788 12298262 12511295 12715306 12747586 12824549 12957711
18625 12957711 13105585 13312168 13562448 13795325 13954072 14075088 14166784 14355812 14553613
18616 14553613 14748491 14885166 15072189 15290185 15476128 15656801 15923510 16152654 16299702
18607 16299702 16505034 16731718 17004435 17217234 17493457 17732369 17956464 18215269 18472346
18598 18472346 18717936 18975716 19244055 19569685 19843944 20082406 20413338 20817863 21156838
18589 21156838 21379323 21558887 21774162 21934422 21992094 22014089 22116068 22328128 22754233 23176405
18579 23176405 23583496 23944236 24255772 24564209 24974384 25358019 25688338 26089122 26551257
18570 26551257 26962727 27404627 27786265 28181184 28661795 29180554 29719063 30297052 30880062
18561 30880062 31416755 32016536 32684719 33313485 34009800 34765382 35571803 36407009 37360247
18552 37360247 38362747 39330515 40254145 41100489 41868898 42718932 43860815 45173733 46717238
18543 46717238 48601190 50918465 53538498 56247694 58388551 57928551 54273925 49254723
18535 49254723 47313841 49154953 52262900 55799543 59446388 63124512 66846374 70857414
18527 70857414 75372109 80716739 87408959 95679810 106076665 119260485 135822464 155031560
18519 155031560 169115233 156408429 105678333 29528975 -25897823 -44895718 -51027493
18512 -51027493 -50956115 -41701015 -29791772 -18470078 -7746239 2131292 10648900 15659441
18504 15659441 12141258 -1850393 -21354780 -33560780 -33395930 -28196455 -22334956 -17132906
18496 -17132906 -12776848 -8926306 -5398115 -2336851 337716 2749709 5045258 7539563
18488 7539563 10263932 13093490 15908059 18807412 21999860 25597255 29638273 34270619
18480 34270619 39802110 46445352 54006741 61426590 64700989 57739631 40620472 21599615
18472 21599615 14849420 19216927 28112969 39182584 51944837 66638027 83397586
18465 83397586 100223455 111594854 113972921 99671716 56858018 -19059825 -106426989
18458 -106426989 -148486351 -143355803 -126572909 -110600845 -98049387 -88510151 -80905672
18451 -80905672 -74589954 -69365123 -65051004 -61355864 -57926681 -54492729 -50730025 -46849475
18443 -46849475 -43159996 -40869600 -42146576 -47447074 -54418162 -57444047 -56091998 -53545650
18435 -53545650 -51025723 -48864540 -47109510 -45737527 -44622684 -43702582 -43042856 -42441386
18427 -42441386 -41697720 -40780365 -39803220 -38815163 -37842363 -36994178 -36283255 -35601473 -34972696
18418 -34972696 -34287620 -33666760 -33155655 -32613430 -31960985 -31355402 -30843961 -30304890 -29779707
18409 -29779707 -29388273 -29100898 -28824586 -28485410 -28089905 -27625828 -27205959 -26766012 -26363838
18400 -26363838 -25857434 -25305991 -24904360 -24558970 -24272327 -23972515 -23515537 -23145776 -22843705
18391 -22843705 -22537314 -22193157 -21811319 -21506582 -21332680 -21176445 -21044972 -20897494 -20735171
18382 -20735171 -20683988 -20648918 -20501037 -20276873 -20153508 -19992149 -19771266 -19532622 -19233404 -18870810
18372 -18870810 -18623173 -18440510 -18324614 -18133639 -17987358 -17800339 -17469204 -17213424 -17041084
18363 -17041084 -16816311 -16456516 -16219616 -16044804 -15734647 -15484330 -15251302 -14997873 -14744261
18354 -14744261 -14508196 -14250225 -14068478 -13912460 -13814180 -13687888 -13492417 -13180199 -12887399
18345 -12887399 -12663596 -12543648 -12407475 -12272942 -11956977 -11492822 -11156150 -11030529 -11101448
18336 -11101448 -11315266 -11529777 -11694210 -11671265 -11748299 -11914956 -11986025 -11962300 -11891070 -11899600
18326 -11899600 -11913756 -11836833 -11786578 -11723036 -11548849 -11322286 -11153759 -10949023 -10738981 -10546327
18316 -10546327 -10463023 -10344730 -10149435 -9973821 -9791230 -9623817 -9437487 -9257088 -9056871
18307 -9056871 -8798635 -8599471 -8389617 -8157961 -7976839 -7787783 -7659939 -7608568 -7631820 -7645488
18297 -7645488 -7609656 -7493897 -7467840 -7415815 -7309354 -7115663 -6949413 -6759193 -6513269 -6255596
18287 -6255596 -6073059 -6025445 -6143154 -6342585 -6744955 -7016561 -7299325 -7611815 -7767571 -7630366
18277 -7630366 -7435024 -7169153 -6964223 -6817066 -6766028 -6606169 -6462764 -6361255 -6223750 -6155715
18267 -6155715 -6048017 -5961608 -5964208 -5871354 -5716738 -5558352 -5416978 -5230125 -5120722 -5048048
18257 -5048048 -4973798 -4832035 -4676508 -4592621 -4533897 -4373505 -4241161 -4142670 -3992727 -3797314
18247 -3797314 -3682838 -3595952 -3496864 -3360515 -3231592 -3149130 -3204546 -3253633 -3176564 -2993553
18237 -2993553 -2821669 -2724617 -2576266 -2454241 -2452760 -2507547 -2550990 -2678760 -2803391 -2909285
18227 -2909285 -3052828 -2961228 -2889249 -2831459 -2753042 -2750447 -2651014 -2532231 -2452374 -2408089 -2255812
18216 -2255812 -2071853 -1919374 -1794187 -1725633 -1654161 -1514989 -1430397 -1365348 -1195614 -1078363
18206 -1078363 -1039160 -960462 -814044 -687100 -549085 -382948 -269672 -224856 -213930 -126399
18196 -126399 -11262 142540 216419 295644 414241 435668 508887 478568 411758 359120 412399
18185 412399 612566 771330 917875 1072888 1156530 1295635 1382574 1525128 1688139 1834555
18175 1834555 1923908 1933060 2071581 2242479 2314427 2437614 2596747 2769339 2881995 3005163
18165 3005163 3169612 3270632 3339654 3459636 3579613 3699469 3836316 4024904 4216812 4361328
18155 4361328 4488185 4661551 4840290 4967118 5171155 5361987 5558377 5755568 5942735
18146 5942735 6057712 6258574 6563612 6777273 7057353 7241255 7395533 7586830 7807175
18137 7807175 8117110 8436520 8668445 8731724 8786493 8927314 9200576 9569447 9950727 10360689
18127 10360689 10811422 11278921 11847583 12417350 13087698 13889319 14678067 15577441 16479111
18118 16479111 17472160 18727077 20239079 22090112 24254304 26816552 29991185 34162513
18110 34162513 39673521 46825439 54975095 58385559 44475505 12395751 -26591581 -41635073
18102 -41635073 -38086059 -31622033 -26080893 -22042462 -19177937 -16937545 -15145128 -13681299
18094 -13681299 -12394453 -11280392 -10250130 -9372776 -8642015 -8005678 -7490594 -7054631 -6569525
18085 -6569525 -5998298 -5596587 -5205126 -4925742 -4735010 -4395906 -4037119 -3791090 -3569860
18076 -3569860 -3347341 -3122823 -2884607 -2642907 -2476053 -2190303 -1868496 -1642834 -1376255
18067 -1376255 -1164682 -929001 -708129 -599364 -570698 -512442 -378780 -121003 126536 245279
18057 245279 363879 385302 340594 308475 395531 550545 711595 868061 914816 919907 879728
18046 879728 965059 1165177 1322725 1463684 1684611 1907540 2036492 2197193 2327576 2440815
18036 2440815 2529647 2638619 2742273 2910926 3085539 3189144 3282784 3393078 3527047 3628316
18026 3628316 3788927 3902314 4057887 4170468 4352702 4468693 4506258 4574333 4695442 4886990
18016 4886990 5116867 5305442 5416532 5538419 5652068 5781530 5702660 5557571 5428958 5294355
18006 5294355 5252968 5253907 5295959 5472600 5730073 5967620 6222828 6357293 6420699 6425916 6390709
17995 6390709 6391524 6411892 6557004 6786548 6941168 7157161 7267764 7271374 7286912 7386684 7555151
17984 7555151 7710461 7858448 8001497 8047928 8098214 8173503 8311189 8461589 8579575 8705735
17974 8705735 8776574 8915665 9114591 9300115 9425891 9614908 9697773 9796962 9947098 10045395
17964 10045395 10182209 10284564 10270195 10190409 10294783 10487571 10662282 10795291 11022315 11154303
17954 11154303 11246840 11425362 11733804 12140717 12480692 12716452 12681963 12333860 11841287 11637164
17944 11637164 11807103 12160714 12645565 12992909 12977279 12510775 11843977 11444035 11278300
17935 11278300 11242359 11298747 11509912 11779397 12114574 12534393 12867615 13091563 13233013 13422112
17925 13422112 13549603 13530511 13517261 13480674 13500543 13704791 13945329 14185517 14370436 14497005
17915 14497005 14727309 14990974 15298769 15568422 15860305 16178876 16476065 16751768 17004655
17906 17004655 17270003 17436244 17590162 17590709 17617289 17556766 17458005 17404063 17348525 17480488 17868038
17895 17868038 18290602 18577086 18677989 18586614 18408747 18441346 18526369 18627831 18723731 18760543
17885 18760543 18746238 18694691 18762233 19008251 19287533 19596745 19899851 20179710 20378680 20620198
17875 20620198 20957226 21291905 21582696 21903379 22127776 22326384 22469174 22546188 22682829
17866 22682829 22868471 23122290 23383086 23738873 24139977 24549933 24893640 25139736 25368013
17857 25368013 25589150 25900996 26193335 26555641 26921616 27272318 27767074 28211327 28516460
17848 28516460 28777204 29040715 29179481 29365438 29571259 29786668 30034469 30408853 30865309
17839 30865309 31335539 31832769 32386477 32935467 33421129 33880622 34324098 34759421 35200235
17830 35200235 35665748 36195082 36806822 37408634 38016106 38663419 39338152 40030033 40719915
17821 40719915 41454479 42263201 43066249 43777848 44616388 45620404 46730426 47941951 49153806
17812 49153806 50204324 51006238 51680650 52676496 53932038 55283905 56851408 58698915
17804 58698915 60798306 63052515 65505895 68359137 71547195 74829087 76519715 74279457
17796 74279457 68460795 62522204 61810411 65041284 69355524 73969978 78611334 83125322
17788 83125322 87691543 92761448 98797856 106079547 114729260 125320244 138753701 155888652
17780 155888652 177117122 199193735 205663585 170983875 94585778 7374977 -37105192
17773 -37105192 -48702868 -50476621 -42176856 -28340829 -14770047 -2347946 9267631
17766 9267631 20428057 30366972 35595085 30191172 14033363 -4742301 -11646572 -6798124
17758 -6798124 2007759 11677142 21281242 30135444 35055166 31989242 22202371 13038457
17750 13038457 14405055 21647596 26312512 21955326 9588801 -2749111 -3990228 1897696
17742 1897696 9310596 16747743 24193612 32045207 40485168 49608965 57794786 60240659
17734 60240659 52587215 36891776 23534317 23129125 31326735 42932179 56068378 70794408
17726 70794408 87734430 106421862 123073866 133053714 129059615 100547219 38940751
17719 38940751 -41017146 -100792986 -109781279 -98780722 -93013404 -95112096 -94655652 -85194204
17711 -85194204 -72509651 -59729441 -48970573 -44228936 -47919326 -56853373 -61440405 -56137974
17703 -56137974 -48091170 -45152395 -52174879 -68130259 -82904089 -88000140 -85355385 -79720831
17695 -79720831 -74119309 -69315963 -65290466 -61825038 -58473925 -55234612 -52216435 -49388820
17687 -49388820 -46839604 -44531487 -42223163 -39669723 -36819399 -33599576 -30082718 -26103814
17679 -26103814 -21399336 -16260098 -13060444 -16288356 -26226477 -38152813 -41669674 -37845048
17671 -37845048 -34342758 -37856865 -49228798 -63495796 -69543928 -67605752 -63663561 -59933213
17663 -59933213 -56800512 -54196179 -51982604 -49980652 -48043672 -46321841 -44722886 -43234522
17655 -43234522 -41894297 -40619251 -39379778 -38218221 -37114479 -36033980 -34901605 -33850839
17647 -33850839 -32842731 -31800270 -30764965 -29726951 -28664015 -27568997 -26570403 -25520724
17639 -25520724 -24352117 -23185915 -22066005 -21127566 -20114008 -18961159 -17574875 -16109383
17631 -16109383 -14578422 -13004826 -11362381 -9432177 -7334345 -5090286 -2550912 352401
17623 352401 3831799 7887409 12731572 18673341 25623358 32268236 34359890 28306629
17615 28306629 16721585 9533030 13532202 17769375 9453474 -14328963 -42971290 -56954477
17607 -56954477 -54580667 -50344431 -53632006 -64299956 -74634650 -75404508 -70918264 -65782581
17599 -65782581 -61226220 -57485636 -54411307 -51796688 -49479919 -47510066 -45721869 -43999105
17591 -43999105 -42547259 -41178441 -39757502 -38267417 -36622168 -35160031 -33857662 -32662734
17583 -32662734 -31438590 -30101391 -28692298 -27195477 -25643698 -24105896 -22585695 -20921756
17575 -20921756 -19052422 -16867521 -14440733 -11878469 -9162375 -6034049 -2004673 3028181
17567 3028181 8928643 15177458 19219636 16595192 7445793 -2606051 -2831457 2625359
17559 2625359 811816 -15475586 -42230999 -62685686 -65676233 -60916359 -60630909 -68171297
17551 -68171297 -79682550 -84784363 -82171808 -77493718 -73187628 -69666665 -66854436 -64445453
17543 -64445453 -62407346 -60645184 -59082307 -57683148 -56317831 -55194783 -54237895 -53343977
17535 -53343977 -52515525 -51735743 -50918003 -50171958 -49496236 -48812015 -48156252 -47544621 -46943587
17526 -46943587 -46339971 -45804591 -45294691 -44669206 -44053494 -43506191 -43053998 -42681282 -42421071
17517 -42421071 -42146155 -41698664 -41266905 -41033669 -40983271 -41028646 -40935104 -40617596 -40196762 -40006670
17507 -40006670 -40008326 -39893759 -39573467 -39185078 -38768885 -38461349 -38240684 -37934610 -37650865 -37333475
17497 -37333475 -36974330 -36681361 -36427236 -36201316 -35937985 -35665910 -35375246 -35138835 -34888562
17488 -34888562 -34639197 -34450864 -34226318 -34063571 -33926606 -33712441 -33518431 -33384835 -33242414
17479 -33242414 -33041208 -32926269 -32798721 -32655350 -32522271 -32392874 -32177338 -31988984 -31797487
17470 -31797487 -31624828 -31477537 -31311467 -31149294 -31005576 -30832226 -30614603 -30418430 -30267395
17461 -30267395 -30141648 -29927596 -29779515 -29637841 -29466654 -29287163 -29155979 -29027306 -28907735
17452 -28907735 -28785021 -28689061 -28556971 -28432837 -28255600 -28130559 -27928724 -27739293 -27562060
17443 -27562060 -27445152 -27230785 -27015763 -26924687 -26956861 -27103673 -27067184 -26888071 -26770570 -26676920
17433 -26676920 -26529498 -26345840 -26217179 -26137795 -26100911 -26045496 -25880298 -25809195 -25723169 -25640918
17423 -25640918 -25592933 -25548439 -25455839 -25347605 -25195131 -25072547 -25043265 -24930192 -24832741 -24718100
17413 -24718100 -24621497 -24537770 -24443850 -24330292 -24295051 -24212606 -24141651 -24058506 -23978671 -23838554 -23834002
17402 -23834002 -23755854 -23581418 -23440364 -23397933 -23310578 -23196097 -23117036 -22979024 -22817070 -22768631
17392 -22768631 -22753450 -22700362 -22582751 -22496992 -22480744 -22465572 -22402979 -22252116 -22149885 -22053891
17382 -22053891 -21973148 -21886448 -21842157 -21728643 -21621448 -21505852 -21434304 -21389747 -21288773 -21189952
17372 -21189952 -21119700 -21071069 -21070215 -21025230 -20911174 -20878903 -20871104 -20723763 -20633404 -20577638 -20437937
17361 -20437937 -20374559 -20301906 -20214320 -20188454 -20183312 -20120123 -20065405 -20034109 -19966482 -19895562 -19842017
17350 -19842017 -19776342 -19718758 -19647550 -19572758 -19524508 -19437519 -19396596 -19449063 -19415924 -19277535 -19145728
17339 -19145728 -19126020 -19072379 -19035927 -19014732 -18968030 -18885653 -18790755 -18721435 -18667539 -18657914 -18626565
17328 -18626565 -18562533 -18475418 -18418928 -18347696 -18299378 -18184390 -18088082 -18078570 -18049918 -17974665 -17957854
17317 -17957854 -17932667 -17873540 -17740855 -17744933 -17792311 -17740167 -17625819 -17591443 -17610230 -17606838 -17555017
17306 -17555017 -17451940 -17396095 -17331999 -17262653 -17187812 -17093003 -17061365 -17023523 -16995192 -16899749 -16801320
17295 -16801320 -16774413 -16743689 -16728332 -16657538 -16619158 -16594146 -16557076 -16521789 -16429235 -16341594 -16353567
17284 -16353567 -16364604 -16316029 -16284485 -16244976 -16190968 -16086623 -15974361 -15952255 -15906075 -15816239 -15731296
17273 -15731296 -15785860 -15765501 -15663495 -15597866 -15546408 -15415695 -15246588 -15201890 -15258271 -15440226
17263 -15440226 -15570237 -15549355 -15405734 -15351685 -15328281 -15326037 -15361602 -15385135 -15322109 -15217693 -15118050
17252 -15118050 -15126389 -15136210 -15144592 -15117374 -15098404 -15140508 -15240440 -15384596 -15358925 -15240333 -15180057
17241 -15180057 -15122367 -15043855 -15017022 -14975287 -14845670 -14763273 -14663714 -14612585 -14559260 -14589876 -14690309
17230 -14690309 -14654915 -14592862 -14550005 -14479073 -14430220 -14389904 -14331141 -14290683 -14251991 -14179345 -14191749
17219 -14191749 -14171782 -14073440 -13994731 -13881004 -13791923 -13869264 -14003613 -14210025 -14227562 -14150021
17209 -14150021 -14087553 -14083721 -14169652 -14258401 -14134816 -14000341 -14049973 -14107301 -14052345 -13924667 -13879707
17198 -13879707 -13802191 -13725273 -13718453 -13744492 -13813804 -13768122 -13719931 -13681325 -13730087 -13762025 -13879922
17187 -13879922 -13987399 -14029424 -14017755 -13953215 -13855425 -13825950 -13788406 -13832923 -13914686 -13863121 -13696264
17176 -13696264 -13664749 -13680687 -13691869 -13715125 -13726596 -13738160 -13741578 -13691926 -13583339 -13497401 -13461398
17165 -13461398 -13370812 -13257105 -13227498 -13214187 -13186212 -13101807 -13078630 -13065825 -13064279 -13159556 -13212919
17154 -13212919 -13170980 -13168632 -13072294 -12966522 -12858451 -12919326 -13060179 -13113041 -13065469 -12996322 -12896403
17143 -12896403 -12935903 -12931380 -12921711 -12942390 -12965504 -12972714 -12925221 -12892743 -12844655 -12835001 -12843468 -12786289
17131 -12786289 -12706987 -12729489 -12769642 -12745646 -12736674 -12780349 -12724501 -12659623 -12591851 -12519296 -12444413
17120 -12444413 -12420679 -12370248 -12283505 -12315173 -12435754 -12401493 -12339133 -12274244 -12200651 -12131949 -12092945
17109 -12092945 -12083470 -12074854 -12058310 -11999739 -11959019 -11959175 -11994317 -11949217 -11897629 -11919002 -11957781 -11961912
17097 -11961912 -11951756 -11872635 -11779175 -11704462 -11677155 -11635746 -11585735 -11576631 -11531495 -11424773 -11380233
17086 -11380233 -11363932 -11429890 -11448337 -11358769 -11325023 -11396251 -11454780 -11557859 -11667862 -11737840 -11680088
17075 -11680088 -11616168 -11579086 -11642816 -11757642 -11734863 -11699793 -11627683 -11590522 -11527086 -11536146 -11565398
17064 -11565398 -11466090 -11382790 -11415972 -11381570 -11352231 -11333707 -11371770 -11358077 -11323618 -11287811 -11298247
17053 -11298247 -11279088 -11268636 -11258573 -11188412 -11190588 -11113441 -11063332 -11062200 -11068822 -11025597 -10982381 -10945485
17041 -10945485 -10949987 -10910065 -10852713 -10776486 -10675338 -10636819 -10624359 -10572993 -10598671 -10715575 -10755843
17030 -10755843 -10688369 -10642230 -10670412 -10754875 -10864028 -10960954 -10908171 -10829010 -10874202 -10971274 -11062570
17019 -11062570 -10993787 -10979475 -10951236 -10912035 -10929354 -10916204 -10913014 -10826918 -10733075 -10710091 -10712212
17008 -10712212 -10708426 -10676213 -10667817 -10689164 -10632801 -10612150 -10627952 -10596652 -10538545 -10541519 -10532368 -10488415
16996 -10488415 -10438587 -10406895 -10401019 -10395568 -10348129 -10356167 -10406775 -10433271 -10357313 -10288604 -10308126 -10247651
16984 -10247651 -10197928 -10244111 -10296174 -10253425 -10218056 -10212546 -10198537 -10297438 -10353724 -10305999 -10215770
16973 -10215770 -10195134 -10116757 -10053345 -10049238 -10048414 -10067163 -10031839 -10007931 -10025403 -10032160 -10032332 -10014189
16961 -10014189 -9980816 -9953433 -10031122 -10069805 -10094562 -10071509 -9998372 -9970262 -9981439 -9935283 -9915920
16950 -9915920 -9847481 -9815682 -9868828 -9815168 -9752197 -9836859 -9893254 -9880884 -9846574 -9769838 -9735808
16939 -9735808 -9718658 -9711372 -9671374 -9639164 -9655167 -9686932 -9657757 -9613795 -9668272 -9677749 -9631076 -9599240
16927 -9599240 -9606265 -9614700 -9582149 -9572488 -9600847 -9503615 -9442678 -9457521 -9446276 -9500713 -9542017 -9550175
16915 -9550175 -9603601 -9518743 -9418545 -9355186 -9418706 -9498106 -9499993 -9437498 -9427246 -9353567 -9326172
16904 -9326172 -9247299 -9170900 -9211092 -9243359 -9233289 -9187312 -9248952 -9288092 -9236707 -9270923 -9308286
16893 -9308286 -9317411 -9327845 -9165917 -9088366 -9095519 -9124496 -9115527 -9057909 -9049364 -9064794 -9090757 -9091911
16881 -9091911 -9084538 -9123959 -9142500 -9116334 -9032519 -8938970 -8910050 -8880571 -8849479 -8847551 -8885936 -8994758
16869 -8994758 -9029553 -9002559 -8950838 -8931900 -8943860 -8974841 -8953772 -8972943 -8962905 -8941735 -9003357
16858 -9003357 -8986339 -8899703 -8832745 -8813522 -8802560 -8838436 -8828435 -8764859 -8817745 -8869176 -8843409
16847 -8843409 -8815692 -8821658 -8778436 -8751219 -8748184 -8762564 -8724293 -8695646 -8697831 -8674591 -8641259 -8633746
16835 -8633746 -8585391 -8520335 -8516991 -8516931 -8527599 -8529287 -8483936 -8444089 -8466553 -8471001 -8503382 -8526909
16823 -8526909 -8595848 -8634586 -8564603 -8553367 -8522293 -8481796 -8382157 -8388155 -8406356 -8396173 -8421947
16812 -8421947 -8439975 -8462000 -8490365 -8373943 -8354065 -8362746 -8368526 -8380366 -8327908 -8289655 -8277990
16801 -8277990 -8247554 -8327270 -8369936 -8338375 -8349314 -8319327 -8251856 -8247187 -8230284 -8234131 -8243813 -8199028
16789 -8199028 -8157895 -8190896 -8233087 -8177165 -8130554 -8126787 -8140223 -8159313 -8187057 -8213693 -8232151
16778 -8232151 -8251884 -8247674 -8223975 -8224093 -8215559 -8143368 -8102882 -8165852 -8196508 -8162684 -8124838 -8077112
16766 -8077112 -8081344 -8021358 -8022231 -7999630 -7994690 -8080226 -8098266 -8049220 -7935497 -7944379 -7964982 -7978317
16754 -7978317 -7915524 -7954827 -7980863 -7990742 -8022510 -8007249 -7904993 -7892021 -7944874 -7962523 -7889282
16743 -7889282 -7889449 -7906466 -7861870 -7839712 -7799980 -7794886 -7852275 -7890071 -7856123 -7906778 -7878069 -7786210
16731 -7786210 -7737346 -7773282 -7823178 -7849765 -7780777 -7835671 -7842890 -7758244 -7777414 -7834151 -7792332
16720 -7792332 -7782387 -7761947 -7741383 -7753483 -7728476 -7708697 -7670232 -7607760 -7600030 -7650725 -7694920 -7691243
16708 -7691243 -7686989 -7635520 -7594997 -7611571 -7667692 -7659555 -7613734 -7590719 -7595071 -7552068 -7566971 -7568067
16696 -7568067 -7554847 -7559476 -7603670 -7572934 -7551026 -7511529 -7488202 -7475065 -7466006 -7495827 -7479562 -7463082
16684 -7463082 -7506889 -7465160 -7382246 -7371478 -7387589 -7377575 -7371530 -7388094 -7423934 -7412939 -7363692
16673 -7363692 -7290429 -7289602 -7319182 -7350631 -7346209 -7359725 -7384453 -7317043 -7367364 -7485310 -7520740 -7447988
16661 -7447988 -7356871 -7304644 -7284071 -7270633 -7328773 -7344159 -7356427 -7334804 -7266481 -7302647 -7303456 -7264263
16649 -7264263 -7283279 -7290613 -7262972 -7300688 -7252595 -7209208 -7216729 -7232384 -7300508 -7283020 -7292584 -7291028
16637 -7291028 -7248357 -7211750 -7181555 -7159756 -7085645 -7128905 -7130647 -7122239 -7087817 -7063139 -7072111 -7123769
16625 -7123769 -7145553 -7078195 -7106719 -7066687 -7010696 -6955749 -7010374 -7073992 -6967233 -6852785 -6871293
16614 -6871293 -6948989 -7013254 -6982698 -6988646 -7001230 -6989099 -7041089 -7095847 -7082633 -7048161 -7037040
16603 -7037040 -7034390 -7013749 -6921889 -6903139 -6906112 -6964611 -7015076 -6941159 -7015195 -7116694 -7144714
16592 -7144714 -7058384 -6968314 -6908857 -6874475 -6830091 -6885803 -6912876 -6971251 -6958697 -6926441 -6932799
16581 -6932799 -6954783 -6977948 -6922066 -6864937 -6866511 -6839595 -6821092 -6821599 -6808451 -6807196 -6794074 -6793525
16569 -6793525 -6821098 -6832515 -6866906 -6888873 -6845290 -6905336 -6862229 -6772762 -6694302 -6658154 -6676567
16558 -6676567 -6627150 -6697689 -6743339 -6724803 -6717931 -6664081 -6641897 -6635233 -6740576 -6772704 -6717648
16547 -6717648 -6708132 -6723330 -6754117 -6700172 -6649861 -6657839 -6635289 -6646437 -6673112 -6634791 -6602577 -6657575
16535 -6657575 -6650928 -6623784 -6604992 -6562809 -6578689 -6545260 -6508853 -6513300 -6529280 -6545713 -6637692 -6587067
16523 -6587067 -6540736 -6549634 -6474558 -6436213 -6481910 -6499055 -6506669 -6583428 -6563850 -6514805 -6495040 -6510563
16511 -6510563 -6496433 -6536561 -6545652 -6499644 -6490652 -6471805 -6461412 -6463991 -6461364 -6429315 -6382647 -6382251
16499 -6382251 -6367900 -6374028 -6373691 -6405575 -6427782 -6344854 -6295155 -6434641 -6463448 -6422920 -6445640 -6473268
16487 -6473268 -6478633 -6470331 -6444724 -6500331 -6482938 -6444432 -6481511 -6443814 -6452743 -6443541 -6304369 -6325309
16475 -6325309 -6409736 -6442753 -6447523 -6471340 -6485308 -6453204 -6404552 -6390247 -6381554 -6322948 -6312535 -6335557
16463 -6335557 -6333383 -6266571 -6297076 -6378913 -6481313 -6472753 -6389160 -6374154 -6356059 -6311375 -6262158
16452 -6262158 -6178659 -6244687 -6255442 -6255810 -6301781 -6341062 -6318299 -6270621 -6210203 -6236196 -6211890 -6194256
16440 -6194256 -6185581 -6204214 -6197102 -6123305 -6159304 -6135847 -6148750 -6201085 -6243537 -6223737 -6162665 -6071419
16428 -6071419 -6031151 -6014609 -6036860 -6097952 -6068070 -6041542 -6043932 -6106597 -6178059 -6236458 -6187416
16417 -6187416 -6133449 -6119317 -6155208 -6189699 -6140964 -6082746 -6129069 -6134693 -6112015 -6077316 -6027718
16406 -6027718 -6049442 -6075226 -6071008 -6093391 -6105644 -6005665 -5921362 -5992871 -6007131 -5985726 -5987177 -6010320
16394 -6010320 -6021489 -6044417 -6027841 -6005338 -5955912 -5946029 -5992978 -6048412 -6084098 -6062489 -6061026 -5971890
16382 -5971890 -5879368 -5882683 -5950202 -6027133 -6044533 -5986395 -5967583 -5942725 -5926896 -5934777 -5916531 -5902637
16370 -5902637 -5869257 -5868658 -5865085 -5837610 -5787965 -5804555 -5842706 -5907595 -5986308 -6008827 -5985622 -5940481
16358 -5940481 -5918311 -5908421 -5877997 -5854316 -5817465 -5858523 -5836910 -5827249 -5875689 -5853714 -5810268 -5763053
16346 -5763053 -5804707 -5806840 -5865780 -5828007 -5836180 -5836418 -5817002 -5771430 -5778153 -5731210 -5668554 -5723332
16334 -5723332 -5822802 -5793023 -5807070 -5806466 -5805854 -5816762 -5794774 -5789157 -5808629 -5841373 -5841953 -5792288 -5833914
16321 -5833914 -5802136 -5716429 -5761736 -5776000 -5742556 -5712180 -5692999 -5708361 -5754048 -5706657 -5667778
16310 -5667778 -5688688 -5690820 -5703608 -5741126 -5818780 -5766879 -5776916 -5697340 -5674678 -5628717 -5620853 -5595520
16298 -5595520 -5601345 -5640955 -5629254 -5587885 -5636142 -5673327 -5661783 -5617651 -5568615 -5536775 -5573912
16287 -5573912 -5524829 -5449180 -5466887 -5593077 -5649676 -5635382 -5611686 -5641459 -5670378 -5597174 -5576786
16276 -5576786 -5594615 -5595831 -5519819 -5522182 -5515336 -5548646 -5554329 -5519163 -5526848 -5588165 -5626126 -5622216
16264 -5622216 -5578411 -5578492 -5563242 -5534190 -5490671 -5475420 -5534553 -5565338 -5598940 -5572085 -5484529 -5467112
16252 -5467112 -5505017 -5498582 -5490020 -5441089 -5418797 -5396868 -5385895 -5369708 -5344105 -5291188 -5356047 -5429344
16240 -5429344 -5470947 -5503456 -5477375 -5492799 -5566631 -5566881 -5491655 -5514217 -5470335 -5411145 -5423500 -5349351
16228 -5349351 -5300961 -5360289 -5336491 -5317159 -5296174 -5307347 -5368713 -5371045 -5368632 -5318823 -5314275 -5371895
16216 -5371895 -5412767 -5395884 -5393083 -5435748 -5406586 -5308097 -5343265 -5390427 -5412970 -5305357 -5263636
16205 -5263636 -5297353 -5313159 -5268370 -5239507 -5274775 -5302025 -5324849 -5346783 -5305437 -5326650 -5331286
16194 -5331286 -5269723 -5273171 -5368587 -5362330 -5331845 -5285164 -5255067 -5297797 -5335395 -5325970 -5297293 -5302818
16182 -5302818 -5285104 -5235168 -5200290 -5225867 -5348355 -5328917 -5291329 -5272514 -5249838 -5190697 -5142669
16171 -5142669 -5135001 -5177307 -5229090 -5188921 -5206408 -5328514 -5299042 -5239102 -5241403 -5258535 -5295650
16160 -5295650 -5386772 -5350229 -5288182 -5319214 -5334831 -5284006 -5185628 -5151520 -5209922 -5200719 -5160461
16149 -5160461 -5115704 -5055962 -5060212 -5091047 -5044484 -5066777 -5150313 -5162103 -5193923 -5193781 -5186670 -5169204
16137 -5169204 -5164066 -5157802 -5172298 -5163848 -5168352 -5178593 -5172837 -5164419 -5144814 -5138331 -5083173 -5072021 -5017738
16124 -5017738 -5002461 -5031545 -5061614 -5085088 -5172807 -5137349 -5091810 -5089077 -5074712 -5041454 -5051987
16113 -5051987 -5090360 -5083353 -4978015 -4988436 -5063110 -5022275 -4988426 -5020936 -5040483 -4977506 -4959599
16102 -4959599 -4884313 -4899108 -4934088 -4991629 -4997861 -5034697 -5053779 -4987430 -4936061 -4939926 -4935803 -4943326
16090 -4943326 -4984916 -5017836 -4970687 -4971975 -4951939 -4918770 -4839371 -4877266 -4955081 -4939252 -4962018
16079 -4962018 -4990876 -5009541 -4952097 -4886826 -4886659 -4928546 -4888141 -4869112 -4910768 -4949232 -4977101 -4971989
16067 -4971989 -5000170 -4986471 -4901248 -4905818 -4934907 -4914435 -4867302 -4844019 -4837025 -4880174 -4878524 -4863018
16055 -4863018 -4908060 -4858340 -4767927 -4723157 -4715846 -4833181 -4844316 -4866803 -4876559 -4840602 -4812248
16044 -4812248 -4843602 -4870662 -4884141 -4905511 -4980149 -5035895 -4990660 -4841357 -4816008 -4891712 -4888984
16033 -4888984 -4912174 -4934606 -4946300 -4886993 -4882312 -4854460 -4827298 -4835279 -4838836 -4811751 -4791243 -4769380
16021 -4769380 -4765040 -4787332 -4763285 -4736673 -4699713 -4744778 -4801184 -4800604 -4805477 -4741992 -4804965 -4820507
16009 -4820507 -4839545 -4798358 -4773858 -4789334 -4798526 -4752662 -4669962 -4663169 -4704061 -4723094 -4825607
15998 -4825607 -4847063 -4839151 -4763690 -4731165 -4737130 -4790565 -4775951 -4760650 -4705528 -4703855 -4680220 -4672162
15986 -4672162 -4716814 -4768537 -4753621 -4726641 -4700318 -4804629 -4835185 -4774164 -4817478 -4839367 -4741965
15975 -4741965 -4724500 -4729793 -4706359 -4628715 -4633176 -4702386 -4759076 -4804274 -4771187 -4725003 -4707998 -4676577
15963 -4676577 -4692780 -4741748 -4724641 -4691750 -4708034 -4626939 -4581758 -4582951 -4620201 -4649739 -4648798 -4576957
15951 -4576957 -4642820 -4678750 -4645954 -4610740 -4631403 -4636009 -4591037 -4583582 -4574539 -4611776 -4683030 -4678053
15939 -4678053 -4651845 -4634499 -4606826 -4529066 -4550726 -4621466 -4679093 -4645052 -4539240 -4568720 -4646902
15928 -4646902 -4640320 -4646369 -4602498 -4612920 -4569542 -4528343 -4516032 -4515184 -4529867 -4568321 -4539504 -4579315
15916 -4579315 -4602932 -4569836 -4561556 -4574634 -4466736 -4505617 -4547865 -4523144 -4521468 -4506753 -4481009
15905 -4481009 -4505906 -4510243 -4454069 -4505350 -4527056 -4538724 -4553470 -4557913 -4585801 -4529514 -4471202 -4516600
15893 -4516600 -4563215 -4563177 -4540034 -4491368 -4437315 -4447248 -4440455 -4437565 -4451851 -4447305 -4520693 -4507794 -4488100
15880 -4488100 -4509465 -4543252 -4598023 -4613771 -4570715 -4562393 -4521769 -4441408 -4426706 -4350429 -4320449
15869 -4320449 -4399000 -4419323 -4418341 -4417447 -4468852 -4509729 -4510935 -4458396 -4449297 -4414729 -4433598 -4399978
15857 -4399978 -4381935 -4402269 -4466867 -4483018 -4453946 -4472129 -4433864 -4442174 -4470621 -4471347 -4516601 -4551099
15845 -4551099 -4495370 -4406988 -4394854 -4438948 -4448149 -4391072 -4374577 -4321642 -4303640 -4366065 -4345821
15834 -4345821 -4289962 -4292592 -4257661 -4328629 -4315438 -4307959 -4325546 -4327473 -4327296 -4382194 -4358339 -4305187
15822 -4305187 -4246612 -4176199 -4161742 -4223576 -4271309 -4301891 -4220890 -4203818 -4266460 -4316938 -4344435
15811 -4344435 -4337137 -4395236 -4502360 -4467402 -4360202 -4277366 -4260540 -4278372 -4277218 -4306901 -4371157
15800 -4371157 -4384837 -4368439 -4293759 -4278040 -4272633 -4239827 -4215797 -4230609 -4311179 -4308879 -4315206 -4319311
15788 -4319311 -4324737 -4380831 -4346441 -4340521 -4381810 -4385243 -4362094 -4328645 -4262363 -4284401 -4333359 -4341294
15776 -4341294 -4308662 -4223019 -4286345 -4330396 -4324024 -4331539 -4315208 -4280438 -4228802 -4205984 -4232194 -4231962
15764 -4231962 -4280868 -4306769 -4266799 -4289302 -4201540 -4162912 -4273611 -4327045 -4322655 -4265816 -4205965
15753 -4205965 -4212485 -4299395 -4270090 -4279277 -4259987 -4209192 -4225823 -4239107 -4226132 -4243136 -4211010 -4177844
15741 -4177844 -4183394 -4176366 -4179705 -4179323 -4165208 -4163417 -4204504 -4244801 -4244444 -4204101 -4189810 -4208928 -4210210
15728 -4210210 -4190944 -4261390 -4277539 -4213597 -4192661 -4147367 -4140794 -4150021 -4149978 -4106790 -4046682 -4095272
15716 -4095272 -4152402 -4158059 -4192128 -4241137 -4216783 -4201661 -4213356 -4203709 -4176196 -4182944 -4198747 -4178933
15704 -4178933 -4204062 -4217020 -4136729 -4097172 -4110944 -4109326 -4123418 -4096352 -4016511 -3993675 -4023750
15693 -4023750 -4105692 -4148199 -4152368 -4063659 -4093293 -4121758 -4085183 -4125560 -4160268 -4183127 -4215453
15682 -4215453 -4195107 -4134864 -4090578 -4086553 -4090235 -4071633 -3983162 -3939285 -3962158 -3954077 -3909751 -3981406
15670 -3981406 -4032657 -4069894 -4100850 -4100495 -4106735 -4142332 -4153701 -4158883 -4180202 -4195604 -4164243 -4071208
15658 -4071208 -4035794 -4010708 -4019110 -4038280 -3967753 -3955433 -3968471 -3973325 -4013183 -4038951 -4033379 -4045326
15646 -4045326 -4073498 -4026309 -4037280 -4035730 -3999945 -4033782 -4049626 -4017781 -3999969 -4011027 -3991363
15635 -3991363 -4005999 -4093693 -4089062 -4028608 -4020426 -3991608 -4001404 -4086420 -4136748 -4121305 -4066118 -4035065
15623 -4035065 -4054600 -3971301 -3935768 -4009528 -4020547 -4024343 -3969528 -3947306 -3941610 -3887371 -3952910 -3984831
15611 -3984831 -3995336 -4016362 -4030972 -3985023 -3944116 -3969794 -4003343 -3944077 -3948373 -3920681 -3925794 -3920101
15599 -3920101 -3936313 -3942130 -3903321 -3826278 -3849614 -3865377 -3920272 -3954640 -3955389 -3984266 -3949306 -3928816
15587 -3928816 -3871718 -3837917 -3864286 -3852345 -3960725 -4006677 -3986435 -3945364 -3929670 -3932600 -3914052
15576 -3914052 -3873095 -3826273 -3873697 -3877192 -3903729 -3867883 -3907432 -3928005 -3908118 -3934054 -3939333 -3932960
15564 -3932960 -3910955 -3942429 -3960696 -4006219 -4001814 -3966812 -3962767 -3861884 -3832640 -3885825 -3912136
15553 -3912136 -3874007 -3856098 -3896122 -3891814 -3837309 -3893920 -3908596 -3926390 -3929316 -3915197 -3873432 -3865576
15541 -3865576 -3812000 -3826575 -3871970 -3908910 -3851629 -3817759 -3858485 -3841004 -3776484 -3773852 -3777842 -3750380
15529 -3750380 -3749917 -3782887 -3800386 -3867983 -3774306 -3723154 -3684969 -3662622 -3748201 -3729825 -3749816 -3788684
15517 -3788684 -3815787 -3719527 -3715539 -3827572 -3948029 -3957349 -3953577 -3889978 -3832782 -3803162 -3856454
15506 -3856454 -3821262 -3842555 -3869331 -3835612 -3847596 -3839710 -3790847 -3757361 -3698496 -3710061 -3719100 -3697432
15494 -3697432 -3727146 -3684992 -3685241 -3788722 -3754001 -3660038 -3689028 -3755573 -3786798 -3796652 -3816906 -3886073
15482 -3886073 -3917126 -3907117 -3842194 -3811965 -3778669 -3778529 -3808776 -3880070 -3830726 -3796354 -3806057 -3832822
15470 -3832822 -3788104 -3751177 -3765266 -3811623 -3845912 -3759631 -3695282 -3759946 -3789410 -3772187 -3753751
15459 -3753751 -3715799 -3717033 -3776470 -3776067 -3793953 -3763246 -3708879 -3694181 -3690425 -3654787 -3683880 -3703814
15447 -3703814 -3697910 -3638681 -3673294 -3745999 -3784732 -3741971 -3556536 -3575740 -3632549 -3602153 -3537372
15436 -3537372 -3481682 -3566519 -3661645 -3707275 -3749999 -3701793 -3628543 -3600711 -3627146 -3633144 -3647464
15425 -3647464 -3627033 -3629096 -3693697 -3728175 -3667090 -3611821 -3615584 -3632682 -3644909 -3676879 -3654368 -3713337
15413 -3713337 -3696422 -3662654 -3665421 -3754011 -3779039 -3729792 -3678729 -3639624 -3600194 -3589499 -3538006
15402 -3538006 -3648115 -3734454 -3637391 -3576995 -3630551 -3633147 -3596764 -3596758 -3605495 -3579549 -3534893 -3539864
15390 -3539864 -3587092 -3602300 -3660957 -3591424 -3544613 -3575091 -3570259 -3544345 -3580339 -3654297 -3676015
15379 -3676015 -3645183 -3661238 -3676616 -3572536 -3420043 -3472480 -3541279 -3523920 -3462144 -3441827 -3488684
15368 -3488684 -3518924 -3546735 -3552094 -3626749 -3609531 -3537658 -3552315 -3583841 -3571287 -3625419 -3668907
15357 -3668907 -3589881 -3485606 -3471385 -3547389 -3506731 -3464156 -3485919 -3519520 -3558300 -3590305 -3572735
15346 -3572735 -3566454 -3599406 -3617579 -3647993 -3633091 -3649690 -3632325 -3532999 -3439109 -3388121 -3357275
15335 -3357275 -3422692 -3522208 -3466045 -3434876 -3375438 -3399700 -3484590 -3489647 -3486428 -3510205 -3531491 -3602332
15323 -3602332 -3646877 -3646454 -3647573 -3577876 -3513067 -3506670 -3559466 -3532688 -3571955 -3601321 -3546930 -3467569
15311 -3467569 -3425963 -3424203 -3482726 -3574388 -3547554 -3499999 -3527444 -3499076 -3488059 -3489761 -3497281 -3460410
15299 -3460410 -3458647 -3447727 -3453458 -3510276 -3466509 -3416577 -3375565 -3338302 -3389056 -3468037 -3449600 -3430159
15287 -3430159 -3471932 -3498169 -3500919 -3465912 -3554127 -3606812 -3554945 -3573766 -3574289 -3590558 -3581461 -3534563
15275 -3534563 -3546338 -3485095 -3396546 -3353019 -3365984 -3462886 -3460954 -3410945 -3426324 -3440310 -3341231
15264 -3341231 -3339560 -3439723 -3482140 -3472620 -3413690 -3434392 -3428575 -3377616 -3380910 -3351421 -3369753 -3398753
15252 -3398753 -3439046 -3460679 -3434525 -3360828 -3351387 -3394866 -3456707 -3494760 -3432763 -3440405 -3448011 -3421222
15240 -3421222 -3452813 -3406135 -3382144 -3429866 -3433866 -3521732 -3507386 -3435764 -3429355 -3463162 -3384609 -3390973
15228 -3390973 -3327144 -3319575 -3342869 -3421775 -3431614 -3366248 -3327151 -3284101 -3315915 -3332573 -3357271 -3312625
15216 -3312625 -3362116 -3426350 -3449365 -3413362 -3425447 -3386618 -3348275 -3352354 -3290096 -3232628 -3252106
15205 -3252106 -3350066 -3304797 -3437614 -3508103 -3454939 -3419908 -3479351 -3502074 -3537758 -3478491 -3446017
15194 -3446017 -3429942 -3395291 -3341697 -3300508 -3355560 -3410573 -3378141 -3353611 -3371900 -3401453 -3425077
15183 -3425077 -3354692 -3316450 -3288059 -3245893 -3327631 -3385738 -3352971 -3366267 -3320524 -3231486 -3292492
15172 -3292492 -3354085 -3390539 -3375972 -3323090 -3325816 -3404234 -3460767 -3479481 -3408176 -3396433 -3385878
15161 -3385878 -3377204 -3320174 -3286996 -3270614 -3270860 -3241829 -3243814 -3266382 -3356543 -3402012 -3306053 -3301836
15149 -3301836 -3287722 -3316473 -3302832 -3280515 -3308043 -3325246 -3308246 -3275341 -3192529 -3150768 -3196482
15138 -3196482 -3246846 -3216293 -3208194 -3254924 -3319548 -3346460 -3363566 -3365544 -3324503 -3289595 -3308105 -3336467
15126 -3336467 -3293940 -3238716 -3246502 -3313101 -3331685 -3314231 -3267736 -3276203 -3221163 -3166229 -3191575 -3217707
15114 -3217707 -3290039 -3314683 -3324177 -3386367 -3329529 -3293508 -3312447 -3310726 -3347548 -3347417 -3326262 -3308326
15102 -3308326 -3225293 -3228529 -3260388 -3249187 -3278105 -3317221 -3248053 -3210967 -3256784 -3236190 -3194033
15091 -3194033 -3190424 -3220781 -3264744 -3248176 -3221272 -3197416 -3256822 -3258290 -3288987 -3254762 -3284876 -3340176
15079 -3340176 -3371442 -3394255 -3348160 -3286577 -3274898 -3269785 -3264437 -3215297 -3156370 -3094681 -3113530 -3177119
15067 -3177119 -3315493 -3359939 -3291294 -3253979 -3266644 -3244168 -3194478 -3190198 -3158002 -3140488 -3164793
15056 -3164793 -3151392 -3165299 -3154188 -3136870 -3165208 -3253508 -3302289 -3281255 -3262849 -3271820 -3265845 -3262377
15044 -3262377 -3313352 -3356013 -3326045 -3257746 -3240254 -3308591 -3325402 -3330035 -3288022 -3291177 -3257203 -3251393
15032 -3251393 -3269549 -3238365 -3271288 -3269176 -3217076 -3221456 -3218923 -3177149 -3184276 -3186205 -3168875 -3151292
15020 -3151292 -3177530 -3196934 -3157599 -3116873 -3138240 -3179437 -3143857 -3071754 -3052756 -3033521 -3039672
15009 -3039672 -3107050 -3135174 -3179954 -3162934 -3149364 -3085605 -3054613 -3140959 -3186509 -3138059 -3126915
14998 -3126915 -3088884 -3068045 -3032422 -2965404 -2957117 -2992701 -3032563 -3076763 -3119502 -3115572 -3135180 -3113822
14986 -3113822 -3128133 -3139236 -3224373 -3276556 -3239894 -3186891 -3140386 -3126915 -3172546 -3242677 -3216931
14975 -3216931 -3140111 -3100744 -3140372 -3176064 -3177294 -3137905 -3162811 -3125998 -3120665 -3185758 -3190345 -3122010
14963 -3122010 -3092735 -3069294 -3062974 -3107289 -3142219 -3144368 -3161295 -3261174 -3276044 -3251371 -3256091 -3194728
14951 -3194728 -3180912 -3174555 -3144184 -3108216 -3107097 -3117094 -3102091 -3084498 -3052251 -3047524 -3082698 -3098626
14939 -3098626 -3154202 -3120459 -3098747 -3142790 -3153533 -3154013 -3144646 -3171516 -3226575 -3164166 -3104972 -3074354
14927 -3074354 -3033908 -3024796 -2985633 -2982328 -3002365 -3030642 -3079054 -3070120 -3101177 -3118748 -3098587 -3024912
14915 -3024912 -2991331 -3067179 -3045466 -3038524 -3096693 -3113004 -3086577 -3036984 -3005801 -3010480 -3058472 -3080533
14903 -3080533 -3123710 -3099466 -3065435 -3005624 -2999158 -3007483 -2997136 -3053715 -3103705 -3072548 -3045564 -3044887
14891 -3044887 -3044373 -3022863 -3044794 -3073279 -3087292 -3067796 -3043542 -3072354 -3081613 -3062878 -3006673 -3082784
14879 -3082784 -3096043 -3036954 -3028208 -3019942 -2964738 -2996743 -2993231 -2927688 -2950156 -3034625 -3044565 -3017054
14867 -3017054 -3036395 -3036821 -3040739 -2996738 -2919340 -2887460 -2892868 -2948277 -2956351 -2961244 -3026164 -3030489 -3002921
14854 -3002921 -2950697 -2944110 -2906022 -2914193 -2919664 -2895144 -2817057 -2822225 -2851488 -2862996 -2902174 -2866749
14842 -2866749 -2826774 -2801155 -2854574 -2932444 -2949454 -2876546 -2876110 -2932874 -2945777 -2971836 -2923499 -2991241
14830 -2991241 -3088564 -3147318 -3089805 -3027261 -3021084 -3006506 -2905769 -2881545 -2931651 -2978443 -2952181
14819 -2952181 -2929446 -2951903 -2986947 -3006568 -2991183 -2973323 -3010712 -3007112 -2990175 -3053557 -3021957
14808 -3021957 -2950820 -2962565 -2937719 -2942044 -2944880 -2959109 -3037500 -3067334 -2997977 -2916729 -2866057 -2878629
14796 -2878629 -2998134 -3025094 -2989237 -2960326 -2930577 -2916795 -2917312 -2943013 -2968741 -2927393 -2847936
14785 -2847936 -2827752 -2913837 -2951981 -2958521 -2922903 -2857545 -2854852 -2883739 -3016124 -3019539 -2963522 -2930558
14773 -2930558 -2957283 -2945975 -2978437 -2921831 -2893327 -2880403 -2886321 -2934821 -2897804 -2826302 -2878605
14762 -2878605 -2912725 -2902153 -2946196 -3036378 -3029796 -2976846 -2894899 -2864606 -2866755 -2917225 -2968427 -2976681
14750 -2976681 -2966862 -2973122 -2989264 -2963640 -2982617 -3013198 -2987356 -2924404 -2897442 -2899919 -2978993 -3063551
14738 -3063551 -2983485 -2919279 -2955511 -2932377 -2875708 -2872615 -2905394 -2922544 -2897674 -2859544 -2836739
14727 -2836739 -2853274 -2965421 -3025620 -3020256 -3038142 -3024926 -2950954 -2912758 -2897431 -2890132 -2926802
14716 -2926802 -2864819 -2845124 -2881686 -2829262 -2877800 -2900551 -2906440 -2892925 -2962338 -2939126 -2914832
14705 -2914832 -2855350 -2835370 -2874433 -2908880 -2939352 -2934616 -2923867 -2866160 -2850652 -2818568 -2852205
14694 -2852205 -2938969 -2994079 -2991768 -2961001 -2922017 -2883588 -2822024 -2848382 -2879229 -2879499 -2932154 -2901646
14682 -2901646 -2777108 -2822950 -2894616 -2888740 -2872806 -2778147 -2795581 -2884438 -2926132 -2907671 -2923315
14671 -2923315 -2869482 -2889201 -2936993 -2917229 -2857036 -2875897 -2867793 -2849098 -2822989 -2830617 -2884573 -2807035
14659 -2807035 -2731645 -2697148 -2718273 -2784470 -2859930 -2890518 -2867844 -2799865 -2791456 -2857687 -2872916
14648 -2872916 -2818527 -2819476 -2823425 -2835412 -2804935 -2817238 -2842400 -2822381 -2775440 -2771512 -2787031 -2776030
14636 -2776030 -2755767 -2735016 -2811422 -2856994 -2821344 -2775708 -2807990 -2776722 -2782102 -2737318 -2710878
14625 -2710878 -2811921 -2820204 -2857487 -2786840 -2796560 -2777999 -2816955 -2845552 -2840377 -2788164 -2738499 -2735852
14613 -2735852 -2740518 -2750715 -2763899 -2849172 -2803619 -2766796 -2763994 -2749588 -2784402 -2816056 -2780610 -2759297
14601 -2759297 -2732612 -2760666 -2839278 -2806025 -2781405 -2783036 -2771214 -2820000 -2789266 -2777664 -2758279
14590 -2758279 -2780358 -2834897 -2854933 -2789306 -2804855 -2784709 -2746747 -2801731 -2854688 -2858419 -2848341
14579 -2848341 -2820757 -2822294 -2812333 -2777383 -2752036 -2751605 -2764433 -2814043 -2812868 -2808710 -2774172 -2810411
14567 -2810411 -2834244 -2839602 -2783279 -2755823 -2758474 -2710124 -2715437 -2740001 -2767569 -2785521 -2847365 -2829814
14555 -2829814 -2812253 -2724536 -2587486 -2627864 -2587438 -2591504 -2658928 -2781915 -2818723 -2785466 -2766890
14544 -2766890 -2781145 -2728140 -2698082 -2735674 -2735510 -2716802 -2646697 -2603180 -2604112 -2663643 -2734105 -2744871
14532 -2744871 -2734616 -2683276 -2674607 -2673533 -2670315 -2777742 -2841072 -2811936 -2767891 -2731460 -2743422 -2753267
14520 -2753267 -2729441 -2713647 -2717996 -2705751 -2779070 -2796032 -2727042 -2718126 -2762764 -2742495 -2701833 -2734218
14508 -2734218 -2743426 -2708529 -2706637 -2702568 -2692363 -2690380 -2677945 -2663533 -2714854 -2686941 -2656037 -2589085
14496 -2589085 -2494429 -2583615 -2660310 -2678201 -2632395 -2587947 -2629130 -2716714 -2745824 -2718231 -2710442
14485 -2710442 -2638398 -2676078 -2748219 -2745433 -2736248 -2764557 -2799443 -2850486 -2821931 -2838915 -2810159 -2791866
14473 -2791866 -2749901 -2741373 -2738691 -2752531 -2713646 -2705772 -2638124 -2652952 -2679361 -2680457 -2633295 -2582475
14461 -2582475 -2609076 -2660583 -2694481 -2686353 -2722025 -2746287 -2754998 -2753005 -2710713 -2671909 -2627266 -2680588
14449 -2680588 -2700844 -2697436 -2674396 -2673600 -2680348 -2672796 -2675121 -2697272 -2701755 -2756341 -2784323 -2775163 -2656412
14436 -2656412 -2641620 -2662917 -2671921 -2625101 -2576848 -2558322 -2585392 -2633012 -2661641 -2670655 -2653406 -2684233
14424 -2684233 -2733671 -2692212 -2693025 -2637756 -2609166 -2597716 -2655857 -2671917 -2669831 -2705859 -2686853 -2673357
14412 -2673357 -2699971 -2644439 -2612101 -2623304 -2593842 -2601174 -2663893 -2703932 -2709676 -2756013 -2784943 -2775733
14400 -2775733 -2724962 -2637116 -2599533 -2573171 -2612086 -2622276 -2636931 -2591835 -2587945 -2668780 -2711181
14389 -2711181 -2687311 -2652614 -2614955 -2601283 -2574516 -2610444 -2642427 -2623154 -2610732 -2546873 -2525626
14378 -2525626 -2514535 -2547206 -2636745 -2686728 -2705786 -2671265 -2607714 -2604156 -2617430 -2590646 -2689708
14367 -2689708 -2702586 -2674021 -2599063 -2547084 -2544406 -2606779 -2630068 -2689394 -2658484 -2626922 -2591479
14356 -2591479 -2577306 -2606625 -2646996 -2591840 -2578518 -2635317 -2557811 -2532561 -2532447 -2553982 -2590222 -2546994
14344 -2546994 -2581420 -2692427 -2710281 -2720104 -2704455 -2718175 -2732099 -2765237 -2652543 -2562382 -2553276
14333 -2553276 -2561791 -2596179 -2622159 -2619624 -2622470 -2643287 -2574751 -2550591 -2603586 -2647691 -2663754 -2685636
14321 -2685636 -2688619 -2644180 -2576689 -2563550 -2530306 -2574275 -2577994 -2636018 -2705268 -2744383 -2718876 -2664716
14309 -2664716 -2649949 -2634336 -2672634 -2641977 -2592224 -2563976 -2623288 -2629022 -2638767 -2581153 -2571601 -2622535
14297 -2622535 -2706033 -2699473 -2692159 -2700872 -2661515 -2596383 -2583723 -2629518 -2619821 -2572953 -2557879 -2543089
14285 -2543089 -2584547 -2607433 -2558490 -2522909 -2530444 -2505688 -2517920 -2496271 -2561697 -2517008 -2434333
14274 -2434333 -2468006 -2531984 -2521635 -2470506 -2499476 -2505605 -2466200 -2438655 -2475289 -2590942 -2592314
14263 -2592314 -2619900 -2579227 -2502915 -2447957 -2517186 -2539505 -2520347 -2446751 -2428750 -2457065 -2542152
14252 -2542152 -2603667 -2574681 -2595106 -2610491 -2612029 -2606248 -2520785 -2521265 -2491219 -2505140 -2505482 -2527341
14240 -2527341 -2508436 -2474031 -2509228 -2468474 -2464367 -2511921 -2603771 -2655212 -2642230 -2610708 -2525955
14229 -2525955 -2459796 -2445169 -2480692 -2557577 -2513827 -2524737 -2517567 -2556596 -2495822 -2472363 -2508895
14218 -2508895 -2572197 -2515443 -2479164 -2446034 -2400937 -2465268 -2490764 -2460638 -2407321 -2425020 -2426017 -2433284
14206 -2433284 -2440329 -2442725 -2452453 -2453612 -2443172 -2427843 -2403734 -2470627 -2466209 -2425056 -2407957 -2438654
14194 -2438654 -2469577 -2467712 -2479121 -2520787 -2514030 -2460845 -2488700 -2496650 -2435591 -2406174 -2351587 -2298401
14182 -2298401 -2331753 -2356748 -2447463 -2510319 -2469968 -2538764 -2582996 -2558912 -2568595 -2515269 -2513687 -2543849
14170 -2543849 -2575796 -2558289 -2508957 -2461109 -2501283 -2550788 -2596743 -2622697 -2642538 -2628570 -2607301
14159 -2607301 -2498666 -2436557 -2385814 -2433814 -2440649 -2445894 -2483088 -2501772 -2476745 -2493817 -2483584
14148 -2483584 -2552549 -2615477 -2571309 -2516569 -2466883 -2406320 -2450595 -2545422 -2576454 -2473881 -2470978
14137 -2470978 -2442163 -2452453 -2493425 -2488831 -2505423 -2490038 -2454785 -2427071 -2466914 -2490842 -2513679
14126 -2513679 -2488753 -2512162 -2465158 -2437155 -2464158 -2422885 -2400421 -2367204 -2369335 -2399242 -2444194
14115 -2444194 -2535093 -2530028 -2517078 -2538790 -2518514 -2477846 -2471583 -2459880 -2433890 -2368321 -2406669 -2503184
14103 -2503184 -2479368 -2517561 -2515188 -2513696 -2500275 -2510525 -2500671 -2477087 -2462194 -2406904 -2377861 -2406496
14091 -2406496 -2461586 -2521657 -2499631 -2448628 -2450533 -2430654 -2454258 -2399575 -2399561 -2432221 -2492624 -2530174
14079 -2530174 -2472512 -2482468 -2518651 -2477629 -2392885 -2373661 -2305514 -2247135 -2209643 -2248290 -2263411
14068 -2263411 -2342934 -2413205 -2455496 -2422151 -2390853 -2459865 -2534923 -2471687 -2382175 -2368405 -2405280
14057 -2405280 -2384754 -2352752 -2354088 -2351551 -2357660 -2430995 -2452953 -2412104 -2305487 -2295943 -2335862 -2363376
14045 -2363376 -2358956 -2356623 -2326947 -2271330 -2219886 -2237293 -2295277 -2380215 -2388312 -2401181 -2350543 -2293054
14033 -2293054 -2294793 -2369753 -2400957 -2420286 -2408471 -2389735 -2437828 -2490938 -2495435 -2471927 -2439103 -2380288
14021 -2380288 -2435240 -2481281 -2484045 -2466390 -2440143 -2479999 -2556421 -2555976 -2516359 -2490996 -2469089 -2461209
14009 -2461209 -2396606 -2411644 -2362031 -2392049 -2360730 -2339778 -2339508 -2287768 -2253351 -2323016 -2380259 -2371535
13997 -2371535 -2358063 -2343649 -2407069 -2419813 -2388733 -2372975 -2328475 -2272325 -2259425 -2271421 -2261054
13986 -2261054 -2275178 -2356644 -2389922 -2425533 -2391903 -2364615 -2387338 -2402064 -2420533 -2375118 -2366639
13975 -2366639 -2453197 -2410279 -2368060 -2332175 -2380425 -2391884 -2372282 -2318415 -2289995 -2303857 -2322727
13964 -2322727 -2367808 -2445225 -2457181 -2438243 -2372149 -2310831 -2294464 -2236834 -2235214 -2313033 -2300971
13953 -2300971 -2297360 -2391610 -2398887 -2404630 -2426976 -2368509 -2358425 -2374777 -2287886 -2222537 -2255377 -2319976
13941 -2319976 -2364553 -2282875 -2171811 -2164868 -2209955 -2182935 -2192665 -2225869 -2269916 -2282349 -2274247 -2259340
13929 -2259340 -2302875 -2321882 -2312120 -2368361 -2404764 -2436327 -2414015 -2339660 -2269367 -2177920 -2163587
13918 -2163587 -2223368 -2255193 -2299724 -2296335 -2310867 -2242958 -2216837 -2254891 -2319825 -2337819 -2327056
13907 -2327056 -2327126 -2350030 -2366251 -2345726 -2295459 -2291995 -2293549 -2204040 -2111235 -2126643 -2171879 -2245488
13895 -2245488 -2275633 -2231422 -2272437 -2356127 -2395443 -2347301 -2315042 -2320146 -2340160 -2314142 -2225281
13884 -2225281 -2176072 -2201642 -2249526 -2284587 -2287950 -2340827 -2394841 -2450661 -2430797 -2466128 -2481954
13873 -2481954 -2410989 -2329795 -2345700 -2401539 -2363660 -2338664 -2319222 -2300278 -2349767 -2339247 -2360127
13862 -2360127 -2356795 -2372284 -2391791 -2398401 -2370487 -2296531 -2306727 -2309374 -2266200 -2268007 -2336225 -2371318
13850 -2371318 -2375521 -2401820 -2382266 -2321671 -2239624 -2330795 -2386991 -2372705 -2374587 -2274494 -2212521
13839 -2212521 -2243775 -2226699 -2249328 -2234121 -2230571 -2228749 -2325090 -2292247 -2303741 -2266324 -2211482 -2231381
13827 -2231381 -2227224 -2221222 -2217994 -2195414 -2235136 -2282844 -2269018 -2206635 -2190408 -2172565 -2219129 -2281597
13815 -2281597 -2372911 -2413905 -2348472 -2319346 -2338342 -2335344 -2308143 -2304496 -2355018 -2307170 -2262597 -2280259
13803 -2280259 -2303282 -2340300 -2368924 -2412730 -2396754 -2341010 -2369050 -2337775 -2312883 -2335819 -2351186
13792 -2351186 -2366934 -2381425 -2362696 -2381872 -2342370 -2382325 -2381313 -2407550 -2390517 -2367602 -2350065
13781 -2350065 -2319071 -2327642 -2337661 -2286504 -2238323 -2229456 -2170085 -2168413 -2233040 -2222999 -2256261 -2301345
13769 -2301345 -2286565 -2282650 -2268299 -2284134 -2310751 -2319788 -2316268 -2284869 -2325012 -2278047 -2277988 -2266241
13757 -2266241 -2238518 -2214888 -2225581 -2227850 -2298863 -2221954 -2198675 -2318328 -2321944 -2308291 -2276397
13746 -2276397 -2191215 -2155654 -2185146 -2203250 -2196447 -2150098 -2228720 -2215690 -2191433 -2152392 -2206813
13735 -2206813 -2298240 -2288598 -2323427 -2303465 -2338724 -2259269 -2225680 -2234862 -2237838 -2234830 -2272600 -2246119
13723 -2246119 -2163346 -2179063 -2208663 -2292352 -2308976 -2227025 -2168269 -2108308 -2190436 -2295360 -2305800
13712 -2305800 -2278474 -2285427 -2268800 -2237465 -2210268 -2229557 -2243299 -2205186 -2262626 -2298571 -2301460 -2224044
13700 -2224044 -2263626 -2321214 -2288654 -2294147 -2301586 -2273298 -2209010 -2208655 -2183435 -2176366 -2238519 -2267947
13688 -2267947 -2264170 -2289889 -2214074 -2196716 -2197010 -2250095 -2279980 -2309850 -2243328 -2141958 -2182501 -2232461
13676 -2232461 -2214402 -2239466 -2240925 -2293716 -2283623 -2299620 -2245349 -2161105 -2099598 -2123246 -2227139
13665 -2227139 -2253346 -2300622 -2261481 -2142958 -2106305 -2107810 -2115180 -2148869 -2112107 -2089161 -2103796
13654 -2103796 -2106790 -2110913 -2079754 -2086419 -2105547 -2120516 -2138647 -2223282 -2244437 -2175031 -2167813 -2142521
13642 -2142521 -2157799 -2153584 -2179054 -2208258 -2209225 -2170725 -2216470 -2202495 -2184997 -2123251 -2109778 -2154607
13630 -2154607 -2143606 -2132975 -2122685 -2070489 -2082961 -2099902 -2139926 -2151150 -2070565 -2107033 -2147250
13619 -2147250 -2197082 -2257161 -2202015 -2167042 -2180812 -2128370 -2087188 -2105331 -2155390 -2169559 -2186060
13608 -2186060 -2144750 -2046963 -2057365 -2050786 -2055156 -2087174 -2111689 -2156769 -2185854 -2162539 -2216159 -2192573
13596 -2192573 -2189359 -2156044 -2142802 -2111865 -2046852 -2096538 -2140683 -2120901 -2124224 -2120205 -2122027 -2171277
13584 -2171277 -2177669 -2169934 -2163271 -2121264 -2072083 -2102220 -2116422 -2096650 -2092451 -2116478 -2087256 -2100472
13572 -2100472 -2084725 -2137439 -2240917 -2299338 -2311444 -2227491 -2172836 -2154838 -2157604 -2194498 -2190648
13561 -2190648 -2176578 -2162536 -2169595 -2146085 -2096971 -2118124 -2116796 -2144417 -2126509 -2100958 -2076326 -2117188
13549 -2117188 -2144146 -2166275 -2184262 -2112580 -2067023 -2076757 -2056971 -2038098 -2058305 -2077493 -2058186
13538 -2058186 -2106624 -2090809 -2081079 -2077755 -2011179 -1958624 -1928322 -1980834 -2005674 -2035975 -2035571 -2084418
13526 -2084418 -2167065 -2126430 -2116553 -2125464 -2090298 -2134340 -2099421 -2110172 -2120444 -2122766 -2178610 -2189012
13514 -2189012 -2124653 -2014521 -1952761 -1962937 -2083188 -2149869 -2150085 -2182274 -2168533 -2147380 -2170229
13503 -2170229 -2201396 -2175198 -2181801 -2126202 -2080240 -2074755 -2081569 -2095179 -2043355 -2082032 -2110403 -2122893
13491 -2122893 -2118805 -2140524 -2091948 -2019862 -2061323 -2015918 -2022469 -2070602 -2131111 -2125882 -2116651 -2121566
13479 -2121566 -2122969 -2135267 -2181903 -2129444 -2076547 -2010316 -2005782 -2027361 -2049892 -2012364 -2103161 -2109193
13467 -2109193 -2133583 -2160762 -2080363 -2072668 -2059146 -2051940 -2086663 -2128780 -2166284 -2152082 -2094281 -2111419
13455 -2111419 -2103371 -2122927 -2124590 -2144643 -2137607 -2116032 -2023267 -2041467 -2158018 -2192180 -2186257 -2135271
13443 -2135271 -2140622 -2152259 -2134041 -2075288 -2052419 -2120683 -2198943 -2134881 -2153665 -2160989 -2167793 -2158883
13431 -2158883 -2145010 -2161297 -2147548 -2146872 -2241730 -2287047 -2237219 -2153683 -2153485 -2124533 -2121455 -2090564
13419 -2090564 -2093987 -2117941 -2080101 -2044899 -2067090 -2038874 -2057627 -2117179 -2127982 -2139779 -2117897
13408 -2117897 -2146144 -2114502 -2141406 -2151318 -2153096 -2082628 -2073923 -2020480 -2038829 -2033672 -2058308 -2049406
13396 -2049406 -1997329 -1989990 -2011043 -2009410 -2052693 -2028125 -2061451 -2053123 -2048166 -2043874 -2046281 -2056015 -2033330
13383 -2033330 -1935727 -1902483 -1956152 -1937784 -1910625 -1927923 -1929107 -1934387 -2031182 -2082974 -2093954 -2076035
13371 -2076035 -2067802 -2048955 -1983625 -1982407 -2029189 -2097141 -2085335 -2085803 -2095623 -2020223 -1970614 -1984098
13359 -1984098 -2045261 -2023986 -1964875 -1939457 -1945928 -1978712 -1950137 -1932237 -1985952 -2011721 -1933686
13348 -1933686 -1927591 -2106111 -2136955 -2120828 -2083216 -2041782 -1984518 -1977050 -2027707 -2040767 -2142650
13337 -2142650 -2108106 -2080759 -2041726 -2029289 -1978524 -1936801 -1938953 -1997522 -1967980 -1928415 -1937885 -1937818
13325 -1937818 -1939085 -1929931 -1968615 -1952651 -1986171 -2099684 -2115257 -2089991 -2109182 -2039747 -2066133
13314 -2066133 -2106197 -2031111 -2007660 -2049760 -2072410 -2031306 -2107992 -2097878 -2045342 -1942855 -1976078
13303 -1976078 -1985681 -2006547 -2029948 -2038310 -1996748 -1981472 -1929630 -1906255 -1913386 -1940916 -2035092 -2047642
13291 -2047642 -2015496 -1996729 -1992865 -1993115 -1999483 -1946852 -1923788 -2007015 -2051161 -1988673 -1931416 -1893311
13279 -1893311 -1887180 -1927782 -2023571 -2062398 -2049425 -2013056 -2018735 -1996049 -2016179 -1997020 -1955998 -1960060
13267 -1960060 -1964624 -2015674 -2015311 -1983396 -1932999 -1950673 -2017687 -2019765 -2010786 -2021244 -1994821 -1959157
13255 -1959157 -1978618 -1965601 -1996104 -2018282 -1979072 -1980438 -1983742 -1996729 -1971464 -2065990 -2145598 -2169458
13243 -2169458 -2087209 -2019968 -2006569 -2001153 -1973439 -1976378 -1939103 -1979504 -2003299 -2027255 -1994843 -1943539
13231 -1943539 -1907641 -1908889 -1959697 -1956593 -1958775 -2043030 -2026508 -1992392 -1956894 -1896561 -1860929 -1898687
13219 -1898687 -1941845 -1964958 -1957631 -1918465 -1907848 -1955175 -1943829 -1868688 -1850442 -1904954 -1978654
13208 -1978654 -1953440 -1929290 -1896101 -1918363 -1989446 -2000283 -2061625 -2085801 -2036869 -1987228 -2001735
13197 -2001735 -2026874 -2061243 -2035693 -1971940 -1985331 -1966783 -1937576 -1959327 -1919468 -1928508 -1976391
13186 -1976391 -1978358 -1956239 -2005542 -2009150 -2010644 -2024103 -2086619 -2047796 -1998353 -1940709 -1896843 -1867018
13174 -1867018 -1890306 -1896795 -1946638 -2014021 -2047634 -1969486 -1889405 -1943990 -1895987 -1848801 -1827614
13163 -1827614 -1799383 -1763636 -1757932 -1816612 -1876516 -1905906 -1940206 -1905302 -1917615 -1983266 -2038690
13152 -2038690 -2005535 -1922581 -1865435 -1868551 -1911991 -1997424 -2001541 -1968663 -2012949 -1999650 -1971247 -2017417
13140 -2017417 -2025469 -2031645 -2034045 -1955745 -1896288 -1895998 -1984384 -1984582 -1940755 -1932841 -1909862 -2006068 -2047106
13127 -2047106 -2039048 -2049207 -1985876 -1960707 -1961554 -1950856 -1915946 -1878272 -1898413 -1936515 -1906788 -1936376
13115 -1936376 -1985651 -2004905 -1940554 -1863177 -1834864 -1811265 -1822239 -1856139 -1919244 -1982210 -1977005
13104 -1977005 -1992186 -1986843 -1908346 -1869533 -1864205 -1940908 -2009391 -1981196 -1962391 -1939525 -1967745 -2019708
13092 -2019708 -1982561 -1923225 -1898589 -1873935 -1888679 -1932669 -1937824 -1945086 -2013830 -2001268 -1965384 -1979816
13080 -1979816 -1959805 -1945841 -2010615 -2020308 -1941957 -1891042 -1955529 -2011881 -2023061 -2050353 -1992329
13069 -1992329 -1932731 -1931954 -1992569 -1992875 -1984702 -1996689 -1974998 -1917294 -1919429 -1881357 -1809751 -1797660
13057 -1797660 -1821894 -1813618 -1809871 -1866956 -1848946 -1889293 -1916545 -1927727 -1966772 -1988734 -1997012 -1987258
13045 -1987258 -1917018 -1882425 -1883613 -1847609 -1882747 -1922629 -1924693 -1839775 -1774703 -1801295 -1807204 -1799804
13033 -1799804 -1758176 -1806013 -1897455 -1977218 -2029548 -1964082 -1954783 -2026562 -2062091 -2016785 -2025116 -2010950
13021 -2010950 -1942805 -1933821 -1966295 -1879561 -1839356 -1860448 -1866427 -1958948 -2017753 -1986473 -2005008 -1992047
13009 -1992047 -1897589 -1906748 -1892220 -1851301 -1898634 -1893946 -1934289 -1967731 -1925773 -1948712 -2041449 -2013350
12997 -2013350 -1887727 -1868537 -1908985 -1886136 -1870714 -1841518 -1856156 -1918663 -1969966 -1984097 -1977448
12986 -1977448 -1941649 -1939226 -1834990 -1844598 -1883389 -1892449 -1965098 -2013891 -2019918 -2071471 -1985717 -1920421
12974 -1920421 -1837677 -1847346 -1870488 -1901612 -1919665 -1900350 -1926168 -1945344 -1847101 -1801698 -1931480
12963 -1931480 -1969149 -1901733 -1878080 -1847302 -1753316 -1692390 -1747104 -1828186 -1898539 -1905252 -1913958 -1843602
12951 -1843602 -1848153 -1845721 -1875366 -1899809 -1899908 -1957784 -1974284 -1967913 -1931468 -1879372 -1859679 -1855683 -1825171
12938 -1825171 -1788876 -1774779 -1796837 -1834409 -1862874 -1882266 -1898626 -1872760 -1852607 -1855765 -1822918
12927 -1822918 -1762901 -1838322 -1873280 -1820530 -1881583 -1877986 -1867486 -1874356 -1840991 -1857788 -1922939 -2005507
12915 -2005507 -2004775 -1944946 -1860825 -1851293 -1946353 -1917794 -1909628 -1968125 -1917466 -1912153 -1886200 -1829531
12903 -1829531 -1888816 -1938283 -1964583 -1924275 -1887099 -1873416 -1861578 -1798415 -1771811 -1853993 -1928288
12892 -1928288 -1896882 -1820524 -1867385 -1936979 -2013051 -1967830 -1946832 -1895880 -1903569 -1925104 -1902694
12881 -1902694 -1844627 -1813725 -1759724 -1757979 -1842177 -1871168 -1813824 -1801433 -1813740 -1800263 -1793200 -1777347
12869 -1777347 -1775876 -1799029 -1779406 -1832070 -1841270 -1841719 -1849751 -1794927 -1905191 -1929336 -1808038 -1830505
12857 -1830505 -1869427 -1889664 -1859075 -1822070 -1813175 -1810772 -1859665 -1909790 -1836880 -1816942 -1837214 -1833315
12845 -1833315 -1842800 -1824466 -1908725 -1928669 -1952916 -1889367 -1862676 -1864013 -1937088 -1944966 -1882603 -1885949
12833 -1885949 -1905533 -1876430 -1876807 -1877836 -1847771 -1803214 -1774685 -1768604 -1777867 -1773328 -1815798 -1791636
12821 -1791636 -1816472 -1876943 -1803737 -1778628 -1803075 -1785959 -1832712 -1877644 -1866518 -1876332 -1910087
12810 -1910087 -1954555 -1926715 -1985563 -2013506 -1959024 -1896244 -1832589 -1763446 -1781693 -1778155 -1789732
12799 -1789732 -1785708 -1725259 -1724011 -1724595 -1776884 -1793556 -1812347 -1819723 -1786405 -1692611 -1710034 -1718873
12787 -1718873 -1692865 -1694505 -1775380 -1809683 -1763984 -1803667 -1849354 -1829372 -1758651 -1749243 -1805771 -1813569
12775 -1813569 -1789659 -1793071 -1807185 -1864729 -1930235 -1900179 -1934553 -1956395 -1943840 -1859549 -1812553
12764 -1812553 -1732483 -1670882 -1667421 -1764065 -1763924 -1774430 -1836015 -1837169 -1786295 -1804184 -1856123 -1887763
12752 -1887763 -1897326 -1854472 -1799357 -1781793 -1815855 -1865651 -1880825 -1886884 -1803574 -1802341 -1789811 -1802300
12740 -1802300 -1796599 -1819767 -1841060 -1833643 -1768147 -1792875 -1767527 -1813481 -1784944 -1742559 -1790711 -1709798
12728 -1709798 -1723372 -1789579 -1805197 -1773651 -1696607 -1691239 -1710437 -1673391 -1705440 -1672386 -1633335
12717 -1633335 -1698285 -1744184 -1721375 -1733234 -1709696 -1698683 -1773475 -1819459 -1780977 -1681667 -1673516
12706 -1673516 -1681656 -1679928 -1668662 -1721508 -1768435 -1765360 -1737809 -1676817 -1691387 -1706125 -1781640 -1828000
12694 -1828000 -1806042 -1777157 -1739120 -1665765 -1698561 -1744432 -1763560 -1819419 -1842478 -1897669 -1922213
12683 -1922213 -1889881 -1861696 -1859012 -1873762 -1888135 -1832079 -1839300 -1879318 -1823608 -1768286 -1711896 -1698696
12671 -1698696 -1746026 -1765842 -1703975 -1707435 -1765205 -1755336 -1801156 -1775758 -1689334 -1689576 -1726936 -1743878
12659 -1743878 -1741472 -1692638 -1694995 -1738136 -1800601 -1824818 -1787390 -1750304 -1780981 -1799132 -1757026 -1722919
12647 -1722919 -1706417 -1767262 -1808223 -1840253 -1848526 -1870442 -1761756 -1759770 -1782445 -1767908 -1753996
12636 -1753996 -1737954 -1745220 -1826683 -1780874 -1738727 -1713572 -1734062 -1749454 -1753495 -1745247 -1813915 -1789279
12624 -1789279 -1749416 -1779406 -1827292 -1873051 -1880492 -1776976 -1775660 -1753940 -1776700 -1776320 -1748740 -1764332
12612 -1764332 -1724819 -1775511 -1844702 -1792100 -1730335 -1750308 -1759805 -1765248 -1732950 -1742668 -1828580 -1871879
12600 -1871879 -1874744 -1853232 -1832392 -1823094 -1777222 -1752045 -1663663 -1645063 -1663050 -1662219 -1689659 -1702218
12588 -1702218 -1722968 -1704260 -1727833 -1784225 -1789025 -1812196 -1845161 -1797671 -1795644 -1743643 -1672497 -1722078
12576 -1722078 -1757864 -1729970 -1671358 -1641390 -1631355 -1687848 -1724705 -1714783 -1699916 -1676411 -1681387 -1679203
12564 -1679203 -1687066 -1666718 -1632463 -1637709 -1659669 -1729519 -1762980 -1755249 -1773930 -1781891 -1779209 -1756901
12552 -1756901 -1788416 -1806123 -1848322 -1850562 -1801535 -1810734 -1744451 -1714858 -1728023 -1733520 -1724962 -1749035
12540 -1749035 -1743059 -1771300 -1833688 -1787936 -1688456 -1748260 -1788648 -1782813 -1748873 -1780288 -1738768 -1739710
12528 -1739710 -1740182 -1693850 -1682728 -1733880 -1667565 -1656729 -1747701 -1786478 -1755107 -1782296 -1817800 -1835019
12516 -1835019 -1736161 -1702984 -1748009 -1726383 -1660042 -1641584 -1600227 -1639614 -1700707 -1674042 -1655602
12505 -1655602 -1689341 -1719606 -1718149 -1643283 -1672361 -1756739 -1745587 -1690036 -1609471 -1576066 -1580873 -1610885
12493 -1610885 -1669785 -1674199 -1680559 -1749736 -1785716 -1692428 -1679171 -1650333 -1627267 -1663798 -1721937 -1724624
12481 -1724624 -1758787 -1721330 -1722092 -1755752 -1682624 -1721288 -1693338 -1609465 -1583535 -1575163 -1575063 -1647315
12469 -1647315 -1655547 -1627102 -1638463 -1607820 -1631120 -1724078 -1732899 -1698559 -1700013 -1666932 -1663024 -1687540
12457 -1687540 -1694486 -1704086 -1712402 -1739312 -1734150 -1709211 -1773488 -1773566 -1726534 -1745641 -1759330 -1748626 -1745520
12444 -1745520 -1703440 -1694084 -1647458 -1691278 -1691543 -1661087 -1653322 -1706110 -1768521 -1739835 -1721269 -1696750
12432 -1696750 -1750861 -1736071 -1716957 -1716649 -1670655 -1658032 -1621399 -1564963 -1613676 -1657086 -1726750 -1760474
12420 -1760474 -1729183 -1663237 -1626436 -1597063 -1658242 -1745129 -1740908 -1693784 -1667358 -1651948 -1617002
12409 -1617002 -1619587 -1608590 -1626771 -1664504 -1640890 -1602499 -1620787 -1571052 -1618753 -1693098 -1693097 -1680960
12397 -1680960 -1746219 -1739325 -1695985 -1700343 -1653089 -1631329 -1730716 -1731652 -1702230 -1756741 -1784404 -1733461
12385 -1733461 -1676825 -1726005 -1728314 -1735665 -1716709 -1714175 -1670253 -1642847 -1581408 -1565505 -1557721 -1575388
12373 -1575388 -1706482 -1739300 -1749662 -1787677 -1801109 -1788206 -1786642 -1752237 -1751578 -1791705 -1754439 -1729878
12361 -1729878 -1725828 -1714628 -1723509 -1744128 -1687376 -1651689 -1668653 -1708700 -1720396 -1686921 -1685945 -1741846
12349 -1741846 -1742482 -1704358 -1623937 -1552866 -1608049 -1637154 -1653676 -1664259 -1661411 -1689314 -1738417 -1775918
12337 -1775918 -1678450 -1699567 -1749686 -1754224 -1735376 -1688098 -1650333 -1657192 -1649196 -1646094 -1623651 -1618326
12325 -1618326 -1685408 -1724511 -1712042 -1644059 -1585027 -1617143 -1675268 -1684230 -1688832 -1710619 -1688086 -1583731
12313 -1583731 -1597036 -1656965 -1646765 -1639851 -1618675 -1689321 -1638864 -1576948 -1574842 -1618517 -1654528 -1652073
12301 -1652073 -1659055 -1650601 -1661354 -1725370 -1759628 -1726832 -1737117 -1762571 -1791960 -1796893 -1788274 -1749598
12289 -1749598 -1672570 -1714431 -1734663 -1748742 -1776758 -1768213 -1765352 -1724530 -1652189 -1636623 -1701219 -1748071
12277 -1748071 -1697642 -1643782 -1593834 -1596236 -1577298 -1594226 -1602877 -1601669 -1594400 -1671670 -1734166 -1825130
12265 -1825130 -1830966 -1732848 -1730770 -1794229 -1802055 -1799031 -1785929 -1692931 -1665935 -1656790 -1539913 -1569709
12253 -1569709 -1595321 -1608507 -1605985 -1639202 -1715015 -1725795 -1688042 -1689239 -1637610 -1639334 -1659144 -1641292
12241 -1641292 -1648240 -1656373 -1615837 -1621937 -1653119 -1607290 -1593889 -1630827 -1656930 -1660950 -1638574 -1620407
12229 -1620407 -1631351 -1663897 -1646744 -1633003 -1654576 -1645917 -1643361 -1624781 -1613080 -1617964 -1594112 -1594438
12217 -1594438 -1663864 -1669705 -1668977 -1661909 -1676299 -1694869 -1676423 -1623986 -1612189 -1644689 -1670521 -1687828
12205 -1687828 -1717830 -1709577 -1730368 -1678326 -1580477 -1576184 -1566193 -1573261 -1593150 -1605125 -1587445 -1632775
12193 -1632775 -1662834 -1622532 -1611656 -1558403 -1488687 -1504352 -1482401 -1438673 -1473274 -1511847 -1603115
12182 -1603115 -1653737 -1674843 -1727592 -1730666 -1732363 -1797868 -1789121 -1776650 -1758945 -1664540 -1608665 -1632754
12170 -1632754 -1610926 -1640055 -1664965 -1675723 -1649157 -1616966 -1641832 -1691442 -1587821 -1546057 -1618095
12159 -1618095 -1694422 -1659043 -1582316 -1568939 -1574738 -1541540 -1515141 -1537952 -1565687 -1621107 -1670246
12148 -1670246 -1603380 -1562758 -1566510 -1593880 -1711052 -1753824 -1731698 -1727946 -1748866 -1669911 -1622858
12137 -1622858 -1650356 -1641145 -1675129 -1685250 -1710952 -1739428 -1696003 -1619383 -1620149 -1671713 -1677903 -1689584
12125 -1689584 -1696918 -1684341 -1566573 -1517220 -1587364 -1614941 -1654541 -1663808 -1711845 -1697433 -1645599
12114 -1645599 -1595621 -1639786 -1607769 -1593588 -1596940 -1542793 -1557566 -1616063 -1620622 -1637700 -1658059 -1648780
12102 -1648780 -1541019 -1452808 -1458198 -1520215 -1618786 -1642015 -1619396 -1572319 -1625163 -1617108 -1573524
12091 -1573524 -1592211 -1677190 -1677695 -1687476 -1721876 -1693658 -1630318 -1597706 -1549893 -1561189 -1592049 -1630730
12079 -1630730 -1617897 -1660943 -1671671 -1587359 -1578236 -1599913 -1594164 -1553828 -1553865 -1610511 -1652600 -1647970
12067 -1647970 -1557515 -1546871 -1583276 -1592038 -1554610 -1517177 -1543314 -1603980 -1564853 -1575908 -1641740
12056 -1641740 -1713717 -1759907 -1749427 -1782238 -1773548 -1751850 -1766885 -1657663 -1587712 -1581014 -1552825
12045 -1552825 -1453219 -1464076 -1498751 -1515159 -1532020 -1594834 -1612952 -1554421 -1539391 -1578873 -1666765
12034 -1666765 -1649607 -1601331 -1615802 -1650051 -1635283 -1644892 -1660980 -1588453 -1587836 -1566406 -1535312 -1506603
12022 -1506603 -1439062 -1513819 -1612527 -1627210 -1581158 -1584317 -1542758 -1508065 -1535699 -1520446 -1521289 -1528820
12010 -1528820 -1530066 -1608584 -1719427 -1681831 -1652914 -1639961 -1582698 -1536788 -1562011 -1604776 -1611873
11999 -1611873 -1581064 -1572854 -1563648 -1664568 -1688484 -1662284 -1627663 -1566838 -1530802 -1537355 -1573839 -1684060
11987 -1684060 -1703015 -1636200 -1661354 -1651547 -1651479 -1628714 -1612530 -1655482 -1668613 -1717008 -1663790 -1639829
11975 -1639829 -1577916 -1517241 -1580858 -1625119 -1627448 -1656824 -1557315 -1567823 -1584613 -1590296 -1635391 -1618101
11963 -1618101 -1588243 -1576110 -1580102 -1534506 -1536968 -1570211 -1652377 -1601388 -1540221 -1525916 -1575857 -1591552
11951 -1591552 -1504316 -1486867 -1522936 -1524932 -1480513 -1541677 -1622218 -1572107 -1547216 -1553351 -1482606 -1462877
11939 -1462877 -1445010 -1447500 -1470174 -1483591 -1506505 -1528945 -1479271 -1499718 -1512830 -1503178 -1556795 -1619990
11927 -1619990 -1658695 -1617171 -1536546 -1535526 -1573553 -1543376 -1537945 -1556940 -1587798 -1566565 -1566298 -1588991
11915 -1588991 -1575975 -1568903 -1521404 -1549415 -1581672 -1574194 -1535203 -1499920 -1506735 -1529004 -1588650 -1560679
11903 -1560679 -1556530 -1550415 -1551783 -1591729 -1616073 -1614133 -1608733 -1579700 -1588327 -1643667 -1650030 -1623882 -1568161
11890 -1568161 -1596420 -1624622 -1625312 -1594165 -1550510 -1533485 -1549309 -1560375 -1542764 -1470403 -1456336 -1522758
11878 -1522758 -1544421 -1536652 -1522051 -1488392 -1472566 -1462784 -1548186 -1528399 -1488030 -1537451 -1564043 -1523220
11866 -1523220 -1512090 -1601198 -1583936 -1568210 -1555137 -1517033 -1505310 -1488692 -1468538 -1523520 -1573227
11855 -1573227 -1505366 -1459788 -1486411 -1516121 -1526305 -1508378 -1517256 -1473865 -1506199 -1463423 -1430868
11844 -1430868 -1453541 -1481195 -1504039 -1477174 -1481130 -1530279 -1549167 -1502440 -1494603 -1526390 -1573399 -1545342
11832 -1545342 -1503857 -1473117 -1481224 -1485263 -1503176 -1492748 -1501084 -1522330 -1546589 -1487169 -1494583 -1548356
11820 -1548356 -1509996 -1491996 -1513223 -1559281 -1594642 -1529598 -1550702 -1569104 -1509993 -1505029 -1559192
11809 -1559192 -1630119 -1627339 -1510594 -1508547 -1564958 -1573915 -1632775 -1617858 -1613353 -1622907 -1498984 -1403640
11797 -1403640 -1432208 -1540077 -1543954 -1494289 -1478369 -1522761 -1551722 -1594239 -1625551 -1605726 -1658492
11786 -1658492 -1693278 -1651237 -1604615 -1537365 -1511696 -1488623 -1489408 -1494064 -1504983 -1607612 -1603185 -1572164
11774 -1572164 -1549540 -1617983 -1623129 -1619721 -1644029 -1614822 -1516149 -1448989 -1449535 -1444672 -1443138 -1437728 -1442145
11761 -1442145 -1438960 -1442048 -1493051 -1529996 -1527327 -1552017 -1637580 -1645470 -1586226 -1561302 -1582727 -1589848
11749 -1589848 -1608508 -1546890 -1528816 -1559381 -1563908 -1490762 -1489944 -1559227 -1555144 -1486547 -1466981 -1513419
11737 -1513419 -1533476 -1561153 -1551333 -1455556 -1474731 -1550635 -1497577 -1552931 -1591440 -1614167 -1608876 -1584672
11725 -1584672 -1573086 -1523191 -1517461 -1494251 -1479758 -1509857 -1508012 -1448258 -1390501 -1479846 -1512447 -1468490
11713 -1468490 -1406107 -1311605 -1320201 -1348222 -1421565 -1457613 -1472060 -1468213 -1451463 -1493111 -1509221 -1485051
11701 -1485051 -1449668 -1493604 -1487692 -1498791 -1452924 -1373988 -1382757 -1426754 -1444668 -1462510 -1391854 -1357597
11689 -1357597 -1466021 -1528093 -1600084 -1531388 -1459556 -1395213 -1438110 -1444776 -1461898 -1455255 -1465689
11678 -1465689 -1506828 -1520914 -1518090 -1512159 -1518319 -1464858 -1470705 -1495759 -1495623 -1493619 -1447481 -1481698 -1516990
11665 -1516990 -1487069 -1491991 -1497804 -1474804 -1475699 -1538025 -1505303 -1395387 -1446225 -1446565 -1454360 -1524291
11653 -1524291 -1475756 -1430653 -1441470 -1454553 -1467507 -1488034 -1488066 -1554722 -1618203 -1600481 -1599276 -1556698
11641 -1556698 -1500422 -1410731 -1393350 -1409140 -1457557 -1552012 -1604767 -1590414 -1601692 -1583352 -1590605
11630 -1590605 -1613118 -1538567 -1427918 -1463327 -1507681 -1498732 -1426642 -1375898 -1420174 -1447303 -1429762
11619 -1429762 -1461164 -1449120 -1403248 -1371928 -1394441 -1399179 -1440330 -1516406 -1524233 -1519754 -1475152 -1424763
11607 -1424763 -1514286 -1581165 -1576666 -1567128 -1593508 -1560733 -1485034 -1512798 -1506989 -1528753 -1485018 -1477897
11595 -1477897 -1475516 -1434720 -1411239 -1421519 -1440908 -1520887 -1522140 -1501414 -1477951 -1502749 -1512188 -1565939
11583 -1565939 -1554907 -1468780 -1515677 -1472612 -1373884 -1362032 -1407371 -1451433 -1481445 -1501218 -1537180
11572 -1537180 -1550225 -1516696 -1456227 -1448213 -1428186 -1484350 -1493322 -1501556 -1469939 -1492135 -1514487 -1451534
11560 -1451534 -1379755 -1344869 -1370783 -1439187 -1442347 -1449171 -1513627 -1509663 -1514448 -1521196 -1474078 -1388947
11548 -1388947 -1377590 -1467309 -1491506 -1494049 -1473023 -1521967 -1571971 -1548748 -1485839 -1436328 -1448089
11537 -1448089 -1418943 -1364007 -1386505 -1365310 -1381290 -1441270 -1407780 -1396613 -1432499 -1398950 -1362856
11526 -1362856 -1349828 -1368930 -1396700 -1324474 -1266107 -1291599 -1286119 -1358730 -1394748 -1372260 -1396001
11515 -1396001 -1359663 -1320843 -1359961 -1382346 -1379378 -1373999 -1377802 -1399859 -1421813 -1441597 -1458023 -1428941
11503 -1428941 -1446955 -1439255 -1390577 -1429484 -1434124 -1380858 -1374883 -1436784 -1481194 -1412317 -1453861 -1477021
11491 -1477021 -1411554 -1442716 -1512903 -1464829 -1443693 -1426034 -1409768 -1395572 -1427722 -1451476 -1446426
11480 -1446426 -1408189 -1431970 -1470666 -1515129 -1494114 -1490944 -1489908 -1420983 -1391790 -1337857 -1340683 -1377692
11468 -1377692 -1413679 -1399937 -1399438 -1446350 -1438173 -1447406 -1479214 -1494470 -1466175 -1534260 -1605098 -1583261
11456 -1583261 -1559891 -1514364 -1423967 -1382749 -1358618 -1387053 -1379781 -1349567 -1312481 -1365845 -1420888
11445 -1420888 -1414241 -1335329 -1323411 -1315459 -1394379 -1434560 -1377362 -1433181 -1556297 -1562584 -1547188 -1516106
11433 -1516106 -1457672 -1425153 -1424151 -1467528 -1503214 -1495547 -1470607 -1470468 -1456988 -1507796 -1535825 -1546027
11421 -1546027 -1465844 -1462998 -1459042 -1392417 -1361421 -1388101 -1369529 -1330862 -1331794 -1317763 -1358077 -1346151
11409 -1346151 -1312952 -1334729 -1408973 -1389253 -1370573 -1449695 -1496085 -1468402 -1463028 -1530658 -1558788
11398 -1558788 -1531631 -1484614 -1501813 -1518031 -1413577 -1393437 -1405503 -1404357 -1356111 -1358389 -1402570
11387 -1402570 -1388968 -1358697 -1322390 -1288608 -1262541 -1298008 -1321160 -1330379 -1361063 -1360845 -1338333 -1321452
11375 -1321452 -1299321 -1346709 -1380868 -1366245 -1410113 -1401530 -1361747 -1361425 -1331020 -1285644 -1297415 -1286527
11363 -1286527 -1273185 -1293873 -1357836 -1441083 -1428152 -1375681 -1314021 -1297419 -1357320 -1439351 -1425863
11352 -1425863 -1380941 -1375851 -1378203 -1367048 -1294023 -1323201 -1346557 -1364573 -1369749 -1440416 -1418018 -1433323
11340 -1433323 -1442544 -1447792 -1376755 -1378614 -1406297 -1366717 -1347868 -1325530 -1364285 -1396767 -1435025 -1441369
11328 -1441369 -1435609 -1519177 -1552835 -1504806 -1429088 -1380160 -1404624 -1459257 -1432386 -1413255 -1404285 -1431687
11316 -1431687 -1451176 -1443050 -1478321 -1432161 -1405071 -1395070 -1384077 -1418636 -1388384 -1340464 -1424555
11305 -1424555 -1468852 -1419520 -1356812 -1356514 -1432368 -1434698 -1447932 -1416514 -1389203 -1377147 -1364739 -1345288
11293 -1345288 -1385448 -1464045 -1415984 -1386073 -1396835 -1412656 -1422947 -1381836 -1385715 -1378389 -1389516 -1348875
11281 -1348875 -1283047 -1257830 -1265939 -1300207 -1314748 -1350642 -1392606 -1390655 -1428747 -1471167 -1459633 -1471187
11269 -1471187 -1383258 -1296352 -1321469 -1391878 -1403974 -1373950 -1318689 -1278975 -1246497 -1264688 -1257396
11258 -1257396 -1279607 -1338401 -1319883 -1298677 -1299520 -1362736 -1398985 -1385544 -1391904 -1413053 -1433787 -1428434
11246 -1428434 -1513315 -1543570 -1530333 -1477663 -1389450 -1358172 -1368649 -1330412 -1303720 -1279780 -1295275
11235 -1295275 -1292864 -1262802 -1287400 -1336679 -1380697 -1383555 -1379394 -1405315 -1402998 -1398673 -1347427 -1375363
11223 -1375363 -1357657 -1315654 -1300613 -1301952 -1374208 -1345283 -1357716 -1363680 -1317932 -1313451 -1271236 -1282631
11211 -1282631 -1224797 -1255965 -1335468 -1353088 -1393009 -1388166 -1366705 -1344428 -1342542 -1304901 -1331621 -1303843
11199 -1303843 -1258762 -1321061 -1382580 -1440804 -1409824 -1457022 -1459822 -1447382 -1370350 -1325017 -1339430
11188 -1339430 -1341435 -1311491 -1320263 -1384319 -1377415 -1307804 -1313322 -1333944 -1341561 -1353696 -1372677 -1422414
11176 -1422414 -1435448 -1384127 -1349062 -1322700 -1350084 -1350215 -1333436 -1294014 -1309480 -1344833 -1316144 -1306059
11164 -1306059 -1286623 -1258596 -1322835 -1372262 -1395162 -1383528 -1414488 -1361871 -1338275 -1337723 -1304313 -1332091
11152 -1332091 -1296307 -1275297 -1290183 -1321591 -1312307 -1290143 -1267479 -1275700 -1307078 -1318764 -1309090 -1301715
11140 -1301715 -1282765 -1244377 -1240710 -1286375 -1368324 -1368868 -1367916 -1389193 -1455145 -1452942 -1399470 -1426070
11128 -1426070 -1421528 -1350496 -1326472 -1288904 -1327691 -1365628 -1331477 -1313059 -1276165 -1223631 -1252790
11117 -1252790 -1273525 -1241169 -1272787 -1422888 -1495857 -1413321 -1367885 -1319684 -1239790 -1288616 -1307489
11106 -1307489 -1295435 -1193711 -1185083 -1249443 -1266797 -1265624 -1310795 -1335620 -1331516 -1308071 -1303458 -1378663
11094 -1378663 -1381795 -1427741 -1367442 -1305526 -1306546 -1345023 -1377962 -1397037 -1384918 -1354768 -1398009 -1377751
11082 -1377751 -1374185 -1402006 -1336547 -1314996 -1348988 -1354672 -1373514 -1334548 -1382861 -1372291 -1366691 -1420714
11070 -1420714 -1478371 -1460165 -1436418 -1432190 -1427470 -1377926 -1330071 -1375542 -1400330 -1404709 -1413915 -1396169
11058 -1396169 -1380841 -1356205 -1349997 -1325801 -1320189 -1274431 -1247963 -1315929 -1319885 -1313646 -1355827 -1355910 -1405463
11045 -1405463 -1434311 -1390540 -1279192 -1186491 -1182577 -1297760 -1351359 -1368101 -1354802 -1396805 -1439754
11034 -1439754 -1491459 -1483004 -1419625 -1419184 -1408741 -1382848 -1376498 -1435314 -1504586 -1509837 -1442980 -1413546
11022 -1413546 -1468041 -1408246 -1320855 -1327365 -1290409 -1260371 -1306782 -1278825 -1197024 -1192441 -1261715 -1314589
11010 -1314589 -1320124 -1275747 -1273961 -1329828 -1318741 -1277508 -1261352 -1183559 -1165804 -1235097 -1295599 -1337131
10998 -1337131 -1329719 -1293839 -1259324 -1234802 -1236988 -1278368 -1344774 -1339343 -1283181 -1331704 -1321367 -1331423
10986 -1331423 -1416094 -1384804 -1355820 -1261056 -1241030 -1309434 -1325639 -1352599 -1355027 -1350116 -1290182 -1194186
10974 -1194186 -1190255 -1270439 -1301213 -1289391 -1339970 -1347619 -1379572 -1393133 -1359418 -1321785 -1310957 -1317297
10962 -1317297 -1356791 -1358020 -1393968 -1432675 -1305252 -1271788 -1278742 -1298332 -1272829 -1239182 -1216789
10951 -1216789 -1225994 -1226411 -1185174 -1214957 -1241288 -1197883 -1191185 -1174900 -1193019 -1307359 -1323591 -1355211
10939 -1355211 -1372392 -1339817 -1356640 -1340730 -1335048 -1286514 -1240046 -1302915 -1310325 -1305697 -1317725 -1336739
10927 -1336739 -1364878 -1362544 -1335506 -1356137 -1340000 -1384721 -1394835 -1305999 -1257552 -1238391 -1262287
10916 -1262287 -1215990 -1105366 -1097750 -1148703 -1184721 -1179806 -1292755 -1316967 -1315004 -1344286 -1337999 -1371023
10904 -1371023 -1358916 -1349036 -1297472 -1197545 -1185814 -1224287 -1223339 -1301372 -1380307 -1298572 -1221341 -1217464
10892 -1217464 -1297573 -1379045 -1352512 -1203135 -1190120 -1268293 -1275208 -1236765 -1272362 -1298470 -1296965
10881 -1296965 -1273493 -1275152 -1230323 -1218847 -1263034 -1248500 -1180623 -1130264 -1135673 -1116989 -1095385 -1252928
10869 -1252928 -1327305 -1285404 -1284979 -1317890 -1318814 -1303512 -1306023 -1307113 -1285260 -1288809 -1280833 -1308898 -1316183
10856 -1316183 -1323247 -1288154 -1215660 -1231651 -1285575 -1256622 -1220389 -1238201 -1277382 -1292755 -1325801
10845 -1325801 -1301567 -1301074 -1308390 -1355117 -1337064 -1326393 -1357306 -1284748 -1238743 -1178919 -1197476 -1246348
10833 -1246348 -1288465 -1288374 -1313757 -1309199 -1272729 -1236905 -1195216 -1187077 -1175936 -1277035 -1284860 -1315149
10821 -1315149 -1307325 -1248790 -1263613 -1250584 -1340722 -1424941 -1421875 -1272456 -1191633 -1192639 -1180167 -1186865
10809 -1186865 -1168324 -1196324 -1198051 -1199512 -1266989 -1283096 -1218583 -1261310 -1307769 -1308823 -1275594 -1269745
10797 -1269745 -1197098 -1161708 -1193668 -1270441 -1307003 -1268445 -1247416 -1275332 -1316880 -1294347 -1292617
10786 -1292617 -1297747 -1305278 -1320776 -1333961 -1278922 -1253168 -1247584 -1258142 -1236451 -1204341 -1204994 -1246238
10774 -1246238 -1241108 -1258574 -1323702 -1375535 -1371104 -1335309 -1329990 -1336695 -1348281 -1319512 -1328205 -1306762
10762 -1306762 -1282945 -1249641 -1273052 -1270805 -1249625 -1246545 -1255321 -1249293 -1231615 -1293319 -1263650 -1257544
10750 -1257544 -1303636 -1296106 -1312740 -1295602 -1293831 -1268646 -1270089 -1290551 -1277544 -1274503 -1278024 -1310038
10738 -1310038 -1371633 -1415523 -1361235 -1286187 -1310222 -1325775 -1283799 -1227988 -1208289 -1159604 -1197209
10727 -1197209 -1187650 -1169771 -1161961 -1135078 -1160017 -1225613 -1266346 -1242631 -1202633 -1178750 -1203496 -1254145
10715 -1254145 -1263210 -1280795 -1259026 -1254472 -1141736 -1136481 -1134244 -1216689 -1207023 -1160089 -1149905 -1255339
10703 -1255339 -1258695 -1247613 -1294648 -1372777 -1360691 -1345542 -1253202 -1189980 -1260209 -1189340 -1254117
10692 -1254117 -1305204 -1273410 -1268573 -1292147 -1293658 -1269781 -1233896 -1188185 -1163173 -1236436 -1251801 -1257701
10680 -1257701 -1291199 -1330152 -1318638 -1249445 -1102129 -1087714 -1078418 -1132786 -1161991 -1242467 -1275939
10669 -1275939 -1234889 -1169224 -1163191 -1212468 -1196173 -1147972 -1168792 -1230553 -1222710 -1191080 -1227931 -1266918
10657 -1266918 -1307558 -1251484 -1244711 -1206551 -1215108 -1231973 -1214968 -1199718 -1250837 -1291521 -1339100 -1316595
10645 -1316595 -1238146 -1232257 -1163139 -1161747 -1209573 -1291274 -1294832 -1257135 -1198528 -1186599 -1227696 -1223283
10633 -1223283 -1232856 -1341245 -1367201 -1316380 -1266125 -1209189 -1292572 -1310753 -1306094 -1252177 -1288424
10622 -1288424 -1228801 -1145342 -1076088 -1113843 -1166412 -1197761 -1217334 -1187966 -1200438 -1246174 -1241036
10611 -1241036 -1221032 -1233305 -1214050 -1221134 -1283485 -1274578 -1330523 -1335219 -1261175 -1216338 -1148537 -1101565
10599 -1101565 -1099456 -1097185 -1155009 -1217061 -1213548 -1180684 -1140399 -1177042 -1175260 -1220314 -1167822 -1092181
10587 -1092181 -1141969 -1154393 -1163498 -1161844 -1131874 -1182436 -1226623 -1228047 -1226585 -1178217 -1166861 -1233875
10575 -1233875 -1278182 -1272843 -1211831 -1255076 -1282263 -1280603 -1255611 -1212114 -1211234 -1217635 -1244642 -1191299
10563 -1191299 -1168564 -1214425 -1169083 -1127302 -1147584 -1163899 -1185593 -1234400 -1214411 -1177796 -1146785
10552 -1146785 -1114748 -1153503 -1170019 -1198737 -1238942 -1217284 -1225242 -1193861 -1097580 -1134685 -1123827
10541 -1123827 -1154365 -1197852 -1186214 -1128679 -1169528 -1184692 -1152611 -1207939 -1270732 -1286232 -1248476
10530 -1248476 -1261883 -1242000 -1247031 -1240431 -1260279 -1307463 -1338513 -1297871 -1275770 -1200414 -1183076 -1165241
10518 -1165241 -1124569 -1121513 -1161484 -1197969 -1217112 -1204920 -1202271 -1223336 -1243842 -1233337 -1244695 -1193051
10506 -1193051 -1135272 -1111406 -1154718 -1181635 -1150417 -1137224 -1164403 -1228114 -1237752 -1265587 -1238301
10495 -1238301 -1190948 -1159468 -1117903 -1096623 -1158696 -1162273 -1094299 -1060465 -1109890 -1145937 -1175470
10484 -1175470 -1172429 -1162873 -1178574 -1158106 -1142735 -1156549 -1144451 -1237965 -1268687 -1225649 -1205760 -1201215
10472 -1201215 -1140685 -1115189 -1147249 -1241075 -1221709 -1230430 -1308329 -1389427 -1332812 -1308442 -1259139
10461 -1259139 -1215688 -1159009 -1191925 -1252957 -1247564 -1241087 -1260638 -1267304 -1233183 -1151224 -1105132 -1073028
10449 -1073028 -1112435 -1124810 -1198008 -1217489 -1165983 -1093671 -1099822 -1118434 -1142117 -1178909 -1125956
10438 -1125956 -1157365 -1244231 -1290588 -1298057 -1225597 -1194310 -1129215 -1042918 -1088630 -1179935 -1192191
10427 -1192191 -1223355 -1241912 -1169463 -1200698 -1245713 -1275287 -1274487 -1226077 -1180480 -1191220 -1210201 -1153517
10415 -1153517 -1246319 -1267378 -1243799 -1241589 -1222502 -1199498 -1162369 -1237712 -1251763 -1144878 -1127458
10404 -1127458 -1143142 -1143329 -1214099 -1248322 -1230002 -1249870 -1211780 -1155697 -1154383 -1190439 -1266742 -1343307
10392 -1343307 -1308094 -1302937 -1244168 -1197859 -1220685 -1240149 -1258930 -1254385 -1277700 -1324292 -1356748 -1314615
10380 -1314615 -1239061 -1258772 -1167298 -1130478 -1140758 -1164822 -1178904 -1230661 -1219378 -1145614 -1148041
10369 -1148041 -1158867 -1146210 -1174229 -1225114 -1189288 -1182086 -1107965 -1082272 -1112551 -1107885 -1132937 -1127838
10357 -1127838 -1106588 -1151421 -1147026 -1068979 -1026165 -1038179 -1074758 -1091585 -1079374 -1105366 -1127816
10346 -1127816 -1155380 -1172450 -1128568 -1092503 -1089677 -1164128 -1159092 -1135052 -1138317 -1178156 -1239403 -1194870
10334 -1194870 -1107426 -1138865 -1178520 -1185462 -1158298 -1188120 -1193684 -1147590 -1159458 -1183608 -1194382 -1195566
10322 -1195566 -1222365 -1167712 -1180255 -1188439 -1221823 -1137663 -1121381 -1156268 -1177108 -1150791 -1211225
10311 -1211225 -1177167 -1119302 -1159721 -1164284 -1200922 -1219132 -1199494 -1194106 -1221794 -1219680 -1156970 -1092984
10299 -1092984 -1113608 -1160510 -1139998 -1099592 -1115816 -1136797 -1126387 -1144273 -1163379 -1208313 -1182649
10288 -1182649 -1096642 -1080957 -1113644 -1050154 -1089779 -1050001 -1025831 -1017962 -1024138 -1011078 -1034405 -1063792
10276 -1063792 -1049513 -1079136 -1114688 -1099954 -1134479 -1153731 -1221156 -1289516 -1232315 -1162374 -1194908
10265 -1194908 -1216941 -1243757 -1200570 -1175363 -1201573 -1220980 -1212880 -1164222 -1176208 -1192378 -1164480
10254 -1164480 -1142067 -1130134 -1153865 -1172941 -1211712 -1242383 -1186559 -1185236 -1135887 -1131633 -1151115 -1163894
10242 -1163894 -1227091 -1256815 -1324015 -1271329 -1203070 -1175530 -1193344 -1163049 -1100216 -1146663 -1182045
10231 -1182045 -1206725 -1183012 -1173550 -1112206 -1044197 -1053643 -1113095 -1114096 -1083131 -1106602 -1107730 -1163533
10219 -1163533 -1192959 -1182378 -1161878 -1184877 -1210412 -1161883 -1118480 -1138626 -1124390 -1143790 -1164310
10208 -1164310 -1167134 -1189978 -1202805 -1164539 -1167561 -1161727 -1092831 -1071721 -1087373 -1035155 -1026791 -1115379
10196 -1115379 -1196421 -1167961 -1095219 -1063553 -1101543 -1126298 -1163395 -1141818 -1172331 -1189521 -1184207
10185 -1184207 -1159165 -1106714 -1088681 -1100530 -1157477 -1142949 -1087297 -1100115 -1126550 -1123132 -1195362
10174 -1195362 -1181434 -1123702 -1083398 -1084257 -1106825 -1059963 -1016196 -1054405 -1062168 -1056103 -1133782 -1134298
10162 -1134298 -1228526 -1298723 -1241207 -1121650 -1036386 -1038242 -1042106 -1060602 -1047101 -936932 -977583
10151 -977583 -1073838 -1122449 -1070016 -1079502 -1056835 -1042675 -1045232 -1134856 -1159374 -1092228 -1027085 -1068239
10139 -1068239 -1062046 -1088027 -1103966 -1069229 -1121293 -1190322 -1199233 -1146122 -1099237 -1089281 -1061974 -1115548
10127 -1115548 -1183430 -1149513 -1098875 -1082009 -1072245 -1076245 -1055750 -1045610 -1066716 -1021873 -945395 -991506
10115 -991506 -1009277 -1033557 -1062630 -1045347 -1040142 -1004778 -991596 -1007896 -1006610 -985488 -1060166 -1043886
10103 -1043886 -1023201 -999741 -1026657 -1060040 -1055034 -1026927 -1050194 -1138595 -1144744 -1067931 -1071059 -1098352
10091 -1098352 -1068973 -1028135 -1029780 -986354 -993539 -1081029 -1068039 -1030893 -1026474 -1025684 -1019144 -1044550
10079 -1044550 -1091012 -1037086 -1052373 -1131313 -1206720 -1245746 -1266706 -1240912 -1227435 -1143753 -1097224
10068 -1097224 -1056594 -1007081 -1003374 -1022225 -1051902 -1040165 -1004836 -983889 -991080 -994349 -1011267 -980316
10056 -980316 -1006497 -988481 -1000848 -1006336 -1074013 -1095799 -1063405 -1093495 -1134198 -1113068 -1147428 -1077530
10044 -1077530 -1022555 -1051989 -1173233 -1182009 -1087301 -1033434 -1055455 -1052489 -1036917 -1045398 -1044799 -1012770
10032 -1012770 -1061280 -1120150 -1132730 -1095978 -1112029 -1120671 -1086509 -1086715 -1031798 -1032045 -1088898 -1152480
10020 -1152480 -1181305 -1148093 -1137387 -1047672 -1026074 -1016241 -1063392 -1084419 -1158238 -1169139 -1145093
10009 -1145093 -1149174 -1122061 -1142428 -1125305 -1085649 -1085235 -1105365 -1114675 -1182317 -1174987 -1105639 -1048926
9997 -1048926 -1061792 -1084936 -1070157 -1069245 -1062822 -1095260 -1103651 -1052753 -1047112 -1039506 -1055618 -1072348 -1070798
9984 -1070798 -1052308 -1022490 -1032921 -1058251 -1071626 -1072523 -1026280 -1022464 -1087993 -1113850 -1107086 -1045205
9972 -1045205 -1066492 -1074929 -1064209 -1017908 -1029372 -1066584 -1028842 -1011202 -1046109 -1071661 -1091998 -1116093
9960 -1116093 -1122099 -1132046 -1119872 -1062316 -990045 -989725 -997332 -1016881 -1073686 -1067303 -1008373 -1002945 -1010682
9947 -1010682 -1034773 -1027215 -1026906 -1089635 -1057605 -973550 -1035589 -1089304 -1128166 -1122989 -1076951 -1011667
9935 -1011667 -990870 -939621 -971155 -984537 -1044666 -1001468 -990505 -1062984 -1078511 -1097371 -1101992 -1075344
9923 -1075344 -1087038 -1079461 -1081803 -1118820 -1098582 -1019066 -1051460 -1039675 -1091659 -1107064 -1145657 -1123162
9911 -1123162 -1083922 -1011510 -975837 -991249 -1041322 -1005122 -920623 -951310 -1018488 -1085350 -1085278 -1126031
$$ [...]
##END NTUPLES=NMR SPECTRUM
##END=
