##TITLE=Analysis number 318737
Compound Code cc 49510
Book Reference 452/184/2
Project Code adrs
Chemist Name peted
##JCAMPDX= 6.0         $$ Bruker NMR JCAMP-DX V2.0
##DATA TYPE= NMR SPECTRUM
##DATA CLASS= NTUPLES
##ORIGIN= Bruker BioSpin GmbH
##OWNER= nmr
$$ XWIN-NMR		Version 3.5
$$ Wed Apr 12 09:52:25 2006 GMT Daylight Time (UT+1h)  MAYBRIDGE\nmr@NMR_250MHZ
##.OBSERVE FREQUENCY= 250.131544655141
##.OBSERVE NUCLEUS= ^1H
##.ACQUISITION MODE= SIMULTANEOUS (DQD)
##.ACQUISITION SCHEME= undefined
##.AVERAGES= 16
##.DIGITISER RES= 18
##SPECTROMETER/DATA SYSTEM= dpx250
##.PULSE SEQUENCE= zg30
##.SOLVENT NAME= CDCl3
##.SHIFT REFERENCE= (INTERNAL, CDCl3, 0, 16.522)
##AUDIT TRAIL= $$ (NUMBER, WHEN, WHO, WHERE, WHAT)
$$ ##TITLE= Audit trail, XWIN-NMR		Version 3.5
$$ ##JCAMPDX= 5.01
$$ ##ORIGIN= Bruker BioSpin GmbH
$$ ##OWNER= nmr
$$ C:\u/data/dgb/nmr/ADRS/2560/pdata/1/auditp.txt
$$ ##AUDIT TRAIL=  $$ (NUMBER, WHEN, WHO, WHERE, WHAT)
(   1,<2006-04-12 09:51:48.05 +100>,<MAYBRIDGE\nmr>,<NMR_250MHZ>,
      <created by zg, POWCHK disabled, PULCHK disabled
       configuration hash MD5:
       84 BC 41 DB A1 6E 1D 46 DA 25 12 A5 C1 ED C5 3A
       data hash MD5: 64K
       BF C9 28 2E 6F 0B 99 B2 50 F9 D6 33 43 34 4E 95>)
(   2,<2006-04-12 09:52:04.22 +100>,<MAYBRIDGE\nmr>,<NMR_250MHZ>,
      <Start of raw data processing
       ef LB = 0.3 FT_mod = 6 PKNL = 1 SI = 32K 
       data hash MD5: 32K
       6A 96 20 78 9F BD F6 62 61 1D 99 8B 8A 4B E6 C4>)
(   3,<2006-04-12 09:52:05.92 +100>,<MAYBRIDGE\nmr>,<NMR_250MHZ>,
      <apk 
       data hash MD5: 32K
       BB DC 61 1C 27 04 CC 4F 79 08 16 84 32 78 77 5F>)
(   4,<2006-04-12 09:52:06.73 +100>,<MAYBRIDGE\nmr>,<NMR_250MHZ>,
      <abs ABSG = 5 
       data hash MD5: 32K
       D1 3F 5B D3 FD 92 89 03 59 23 F2 93 3D 5A 17 0D>)
$$ ##END=
$$ 
$$ hash MD5
$$ 35 39 8C 23 13 3A 13 C2 42 07 28 90 61 6D B7 9F
##$RELAX= 
##$RELAX= 
##$RELAX= 
##$RELAX= 
##$RELAX= 
##$RELAX= 
##$RELAX= 
$$ Bruker specific parameters
$$ --------------------------
##$DU= <C:\u>
##$EXPNO= 2560
##$NAME= <ADRS>
##$PROCNO= 1
##$TYPE= <nmr>
##$USER= <dgb>
##$AMP= (0..31)
100 100 100 100 100 100 100 100 100 100 100 100 100 100 100 100 100 100 
100 100 100 100 100 100 100 100 100 100 100 100 100 100 
##$AQSEQ= 0
##$AQ_mod= 3
##$AUNM= <au_zg>
##$AUTOPOS= <3 >
##$BF1= 250.13
##$BF2= 250.13
##$BF3= 250.13
##$BF4= 250.13
##$BF5= 500.13
##$BF6= 500.13
##$BF7= 500.13
##$BF8= 500.13
##$BYTORDA= 1
##$CFDGTYP= 0
##$CFRGTYP= 5
##$CHEMSTR= <none>
##$CNST= (0..31)
1 1 145 1 1 1 1 1 1 1 1 1 1 1 1 1 1 1 1 1 1 1 1 1 1 1 1 1 1 1 1 1 
##$CPDPRG= <>
##$CPDPRG1= <>
##$CPDPRG2= <>
##$CPDPRG3= <>
##$CPDPRG4= <mlev>
##$CPDPRG5= <mlev>
##$CPDPRG6= <mlev>
##$CPDPRG7= <mlev>
##$CPDPRG8= <mlev>
##$CPDPRGB= <>
##$CPDPRGT= <>
##$D= (0..31)
0 1 0 0 0 0 0 0 0 0.06 0 0 0 0 0 0 0.0002 0 0 0 0 0 0 0 0 0 0 0 0 0 0 
0 
##$DATE= 1144831906
##$DBL= (0..7)
120 120 120 120 120 120 120 120 
##$DBP= (0..7)
150 150 150 150 150 150 150 150 
##$DBP07= 0
##$DBPNAM0= <>
##$DBPNAM1= <>
$$ [...]
##$SUBNAM7= <"">
##$SUBNAM8= <"">
##$SUBNAM9= <"">
##$SW= 20.6930455092707
##$SWIBOX= (0..15)
0 0 3 0 0 0 0 0 0 0 0 0 0 0 0 0 
##$SW_h= 5175.983436853
##$TD= 65536
##$TD0= 1
##$TE= 294.16
##$TE2= 300
##$TE3= 300
##$TEG= 300
##$TL= (0..7)
0 120 120 120 120 120 120 120 
##$TP= (0..7)
150 150 150 150 150 150 150 150 
##$TP07= 0
##$TPNAME0= <>
##$TPNAME1= <>
##$TPNAME2= <>
##$TPNAME3= <>
##$TPNAME4= <>
##$TPNAME5= <>
##$TPNAME6= <>
##$TPNAME7= <>
##$TPOAL= (0..7)
0.5 0.5 0.5 0.5 0.5 0.5 0.5 0.5 
##$TPOFFS= (0..7)
0 0 0 0 0 0 0 0 
##$TUNHIN= 0
##$TUNHOUT= 0
##$TUNXOUT= 0
##$USERA1= <user>
##$USERA2= <user>
##$USERA3= <user>
##$USERA4= <user>
##$USERA5= <user>
##$V9= 5
##$VALIST= <valist>
##$VCLIST= <CCCCCCCCCCCCCCC>
##$VD= 0
##$VDLIST= <DDDDDDDDDDDDDDD>
##$VPLIST= <PPPPPPPPPPPPPPP>
##$VTLIST= <TTTTTTTTTTTTTTT>
##$WBST= 1024
##$WBSW= 4
##$XGAIN= (0..3)
0 0 0 0 
##$XL= 0
##$YL= 0
##$YMAX_a= 326596
##$YMIN_a= -396002
##$ZGOPTNS= <>
##$ZL1= 120
##$ZL2= 120
##$ZL3= 120
##$ZL4= 120
##$ABSF1= 16.522
##$ABSF2= -4.171173
##$ABSG= 5
##$ABSL= 3
##$ALPHA= 0
##$AQORDER= 0
##$ASSFAC= 0
##$ASSFACI= 0
##$ASSFACX= 0
##$ASSWID= 0
##$AUNMP= <proc_1d>
##$AZFE= 0.1
##$AZFW= 0.1
##$BCFW= 0
##$BC_mod= 0
##$BYTORDP= 0
##$COROFFS= 0
##$CY= 12.5
##$DATMOD= 1
##$DC= 0
##$DFILT= <>
##$DTYPP= 0
##$F1P= 14.0000005364418
##$F2P= -0.99999901652339
##$FCOR= 0.5
##$FTSIZE= 32768
##$FT_mod= 6
##$GAMMA= 0
##$GB= 0
##$INTBC= 1
##$INTSCL= 1
##$ISEN= 128
##$LB= 0.3
##$LEV0= 0
##$LPBIN= 0
##$MAXI= 10000
##$MC2= 0
##$MEAN= 0
##$ME_mod= 0
##$MI= 0
##$NCOEF= 0
##$NC_proc= -3
##$NLEV= 6
##$NOISF1= 0
##$NOISF2= 0
##$NSP= 0
##$NTH_PI= 0
##$NZP= 0
##$OFFSET= 16.522
##$PC= 1
##$PHC0= 174.0977
##$PHC1= 6.141653
##$PH_mod= 1
##$PKNL= yes
##$PPARMOD= 0
##$PSCAL= 4
##$PSIGN= 0
##$REVERSE= no
##$SF= 250.13
##$SI= 32768
##$SIGF1= 0
##$SIGF2= 0
##$SINO= 400
##$SIOLD= 32768
##$SREGLST= <1H.CDCl3>
##$SSB= 0
##$STSI= 32768
##$STSR= 0
##$SW_p= 5175.98343685301
##$SYMM= 0
##$S_DEV= 0
##$TDeff= 65536
##$TDoff= 0
##$TI= <Analysis number 999999
Compound Code 99
Book Reference 9
Project Code 9>
##$TILT= no
##$TM1= 0
##$TM2= 0
##$TOPLEV= 0
##$USERP1= <user>
##$USERP2= <user>
##$USERP3= <user>
##$USERP4= <user>
##$USERP5= <user>
##$WDW= 1
##$XDIM= 32768
##$YMAX_p= 525082924
##$YMIN_p= -170954
$$ End of Bruker specific parameters
$$ ---------------------------------
##NTUPLES= NMR SPECTRUM
##VAR_NAME=  FREQUENCY,     SPECTRUM/REAL,   SPECTRUM/IMAG
##SYMBOL=    X,             R,               I
##VAR_TYPE=  INDEPENDENT,   DEPENDENT,       DEPENDENT
##VAR_FORM=  AFFN,          ASDF,            ASDF
##VAR_DIM=   32768,         32768,           32768
##UNITS=     HZ,            ARBITRARY UNITS, ARBITRARY UNITS
##FACTOR=    0.157963299565203, 1,           1
##FIRST=     4132.6476996994, 0,             0
##LAST=      -1043.33573715361, 0,           0
##MIN=       -1043.33573715361, -170954,     0
##MAX=       4132.6476996994, 525082924,     0
$$ Real data points
##PAGE= N=1
##DATA TABLE= (X++(R..R)), XYDATA
$$ [...]
16411E2446k4073p069m781q107p2398j3701O8030R091R922l2872J1428K0656L7953
16398D6525K2202k3589j052o0553P289M1846J1873r863j1353Q8l0047K4349p483
16385A0232n9164j7197M2363J0165M0417m574J1764K0899j7632L588j8498m8154
16373b5791k1839M437K2443j1399L2331M3494Q370r027l8828l9297l17K3150K0752
16360H479q441l729m2267k8083n2818P240N0321N8319J240j3916j6035L164J5603
16347b0923J9625n6525L3238J4332j9998K7057K5211K3119j6728m7209P633O954
16335d214P757J7491r921j2477l5715m1757j2122K5884o61M1300J1416J3758M0691
16322D1430P222m227N662K1293n4007o0487K5680L6529j5876n3446o5424K7390
$$ plain form
16411 52446 28373 21304 16523 8416 -63982 -77683 -9653 -562 9360 -23512 -12084 8572 46525
16398 46525 68727 45138 44086 -16467 -9178 32668 44541 34678 23325 23413 -6634 17715 10232
16385 10232 -48932 -66129 -23766 -13601 26816 22242 34006 54905 37273 40861 22363 -25791
16373 -25791 -47630 -43193 -20750 -32149 182 43676 52046 43019 4191 -35106 -35423 -12273 8479
16360 8479 38 -3691 -45958 -74041 -126859 -119619 -69298 -10979 -9739 -23655 -39690 -36526 -20923
16347 -20923 -1298 -57823 -24585 -10253 -30251 -3194 22017 45136 28408 -18801 -11168 -4214
16335 -4214 3543 21034 11113 -1364 -37079 -78836 -90958 -65074 -65735 -24435 -13019 739 41430
16322 41430 48652 44425 50087 71380 17373 -43114 -17434 19095 3219 -50227 -115651 -88261
16310h8261L5186j1191L5537K9616J548K331n1176Q888K6266m555J5519J1953
16298A1661n3187k3962L9802m10l4984L4512L1596k5000k3664J531j3209O854
16286d8460L367k5540J1871R452J9260K5902l771n1313k9335J7357J4723J0952
16274d5535K5754L6911J0135L956k5034k8760N282j1764J3061L0904R949j6192
16262H667M0454o533l1042n378m7550m6226j5011M3994M2705J7291K5341J3313
16250D0025l1100l3080L0734L7718j3747m960j1116k1758k8314M6866M0396j8818
16238C2846Q87j0729P13m7217p127J7695l4028m0007M1096J2718r175J6857O699
16225a8772J5034m948O28L3776R997j7017J4266K2785o770k5574j341j4200l3688
$$ plain form
16310 -88261 -53075 -64266 -28729 887 2435 4766 -46410 -37522 -11256 -15811 -292 11661
16298 11661 -41526 -65488 -25686 -26096 -61080 -26568 5028 -19972 -43636 -42105 -55314 -48460
16286 -48460 -45093 -70633 -58762 -49310 -30050 -4148 -7919 -59232 -88567 -71210 -56487 -45535
16274 -45535 -19781 17130 27265 31221 6187 -22573 -17291 -29055 -15994 14910 24859 8667
16262 8667 49121 42588 11546 6168 -41382 -87608 -102619 -58625 -15920 1371 26712 40025
16250 40025 8925 -24155 6579 44297 30550 25590 14474 -7284 -35598 11268 51664 32846
16238 32846 33733 23004 23717 -23500 -30627 -12932 -46960 -86967 -45871 -33153 -42328 -25471 -18772
16225 -18772 -3738 -8686 -8058 25718 35715 18698 32964 55749 48979 23405 22064 7864 -25824
16212b5824J0630k4332j347k6953L0721N6790K7706k351j3574J286q804j150J3879
16199C6677l3057j4699J8634K857j3495N742L7022n797j6277P795P749j3501k2564
16186b914J9522l3629j3036N8950J3349l1616l1450p545k912L7345L3747q854
16174C0957l9527m4672K3608K1230j2104n261j1031j3992Q847J3341L0615P796
16162I807J5825l626n273p095m1140l6970j0272J7569N6304o416j0168M698n944
16149b2701o54M0773N318q642k2279P3192K2351m7292m0993k6307R154K9949K0629
16136C2498K7041j6819p6283l5931P892K8488n211M884L596n084o577K9368m417
16123a6555L5l7631L987P041j6524k7335k2733j5049M7412L9199O1663L0641j9177
$$ plain form
16212 -25824 -15194 -39526 -40873 -67826 -37105 19685 47391 45040 31466 32752 23948 22798 36677
16199 36677 3620 -11079 7555 10412 -3083 2659 39681 33884 17607 25402 33151 19650 -2914
16186 -2914 16608 -17021 -30057 28893 42242 10626 -20824 -28369 -31281 6064 39811 30957
16174 30957 -8570 -53242 -29634 -8404 -20508 -25769 -36800 -50792 -41945 -28604 2011 9807
16162 9807 25632 22006 16733 9638 -31502 -68472 -78744 -61175 -4871 -11287 -21455 -16757 -22701
16149 -22701 -23355 17418 22736 14094 -8185 65007 87358 40066 -927 -27234 -18080 11869 32498
16136 32498 59539 42720 -33563 -69494 -61602 -33114 -38325 -33441 -29845 -34929 -41506 -12138 -16555
16123 -16555 -16520 -54151 -50164 -43123 -59647 -86982 -109715 -124764 -77352 -38153 23510 54151 34974
16110C4974l3599k029l3028M6195L2377J2965o1498J749M0693J477n7252k815
16098a9791J7263k0360l5787q942n333j1917O112L3024J925J2450J9519O426l3102
16085c8513K3506K1501p857K464k6148j0267K2434J8178J1037j4557j6736l8122
16073e3080J5094N1109j2698m0743k1753j452L6940P1223m6083m6215K2586K2353
16061b719M4260j0739l5191l8534m8763J0818O1933K2286m4814k6788N2868J7971
16049B588q022N3190N0914o1755r110K3652j3229m759k947m061n656k105L5833
16036E4533k9129n1500l2125L8870O660L3587K8558k2314k5386k3650k0592j4284
16024e6772L905O927J2408j2112J765L4698k7339n0590j6928J6341K5523M6444
$$ plain form
16110 34974 1375 -654 -33682 12513 44890 57855 -3643 -1894 38799 40276 -16976 -19791
16098 -19791 -2528 -22888 -58675 -67617 -72950 -84867 -78755 -45731 -43806 -31356 -11837 -5411 -38513
16085 -38513 -15007 6494 -1363 1101 -25047 -35314 -12880 5298 16335 1778 -14958 -53080
16073 -53080 -37986 13123 425 -40318 -62071 -63523 -26583 44640 -1443 -47658 -25072 -2719
16061 -2719 41541 30802 -4389 -42923 -91686 -80868 -18935 3351 -41463 -68251 -15383 2588
16049 2588 -5434 47756 98670 36915 27805 51457 38228 33469 30522 26461 20805 18700 54533
16036 54533 25404 -26096 -58221 -19351 -12691 20896 49454 27140 1754 -21896 -42488 -56772
16024 -56772 -52867 -45940 -33532 -45644 -43879 -9181 -36520 -87110 -104038 -87697 -62174 -15730
16012a5730M3522j2148q606j8232R417L6489O279j3460k2196M998K5261M786l5249
15999E131j0385j3N1166o145o0272j1114J0562J3923J267j436j3971P333k1504
15986c5458K4064N2322n504m156N314p443j3107m9340j4775J5564J120O427K0879
15973d093j5473Q865l4668L6023L6287O905j7897j68j301k1764Q307j5917k0224
15960c5118J8388l017K766L5818K8798K264l8781k2272M389n8826J2377j2729
15948f5943M6414K6946k4037J7171j3909k0182L3574j0559J1150J8952M6453k2340
15936D3690q6486m230J6868L94L2627K7612k3781m2630N5624K4788l6648k2529
15924a4701J2256K5921M1595k1035o0419l4440O262J5482k032j1416k090K715
$$ plain form
16012 -15730 27792 15644 7038 -11194 -1777 34712 40991 27531 5335 10333 35594 40380 5131
15999 5131 -5254 -5267 45899 39754 -20518 -31632 -21070 -7147 -5880 -7316 -21287 -13954 -35458
15986 -35458 -11394 40928 35424 31268 36582 29139 16032 -33308 -48083 -32519 -31399 -24972 -4093
15973 -4093 -19566 -10701 -45369 -9346 26941 33846 15949 15781 14480 -7284 1023 -14894 -35118
15960 -35118 -16730 -19747 -16981 18837 47635 49899 11118 -11154 -6765 -65591 -53214 -65943
15948 -65943 -19529 7417 -16620 551 -13358 -33540 34 -10525 625 19577 66030 43690
15936 43690 -42796 -47026 -30158 -29764 2863 30475 6694 -35936 19688 44476 7828 -14701
15924 -14701 -2445 23476 65071 44036 -16383 -50823 -44561 -29079 -31111 -42527 -44617 -41902
15912d1902q585k0283L8090M3790K8711j4794l6233R765K4829K1590l7555l3792
15900b6369k9983j0832j4153M90J8734m1677L8417K6632l597M2542j172J8773
15888A7805l781j7945J4328L4835k3686k3047O5J737J0183q616j5385j1575R463
15875a5619k1259O01Q716J2183k4295O428L0121n138k2436K0174K1941l3166q018
15862b9767R178L0431J8259J3335l1762m254N623J2257J205k140n0322j7679J5279
15849c0357N502K8740k4813j3797M8362P0900j7636m0816k1453q01r820l4793
15837d0782K8737j9538j5229J4294R918j3495k9132o88P537K7695N5299n42l1549
15824g475M068j387q563q359R591K6464J0042l033m4295N935N028o180J0623k2389
$$ plain form
15912 -41902 -50487 -70770 -32680 11110 39821 25027 -11206 -1441 23388 44978 7423 -26369
15900 -26369 -56352 -67184 -81337 -80847 -62113 -103790 -65373 -38741 -42338 204 -968 17805
15888 17805 14024 -3921 10407 45242 21556 -1491 -1426 311 10494 1878 -13507 -25082 -15619
15875 -15619 -36878 -36277 -27561 -15378 -39673 -33245 -3124 -8262 -30698 -10524 11417 -21749 -29767
15862 -29767 -20589 9842 28101 41436 9674 5420 11043 23300 24505 22365 -27957 -45636 -30357
15849 -30357 -24855 3885 -20928 -34725 13637 84537 66901 26085 4632 3831 -5989 -40782
15837 -40782 -12045 -31583 -46812 -32518 -22600 -36095 -65227 -65915 -58378 -30683 24616 24074 -7475
15824 -7475 -3407 -4794 -13357 -21716 -12125 14339 24381 21348 -22947 -17012 -11984 -18164 -7541 -29930
15810b9930N6448M6476m4153M74Q611k6663k1506l5740k8354J0756L3786N0064
15798B0269m898k2367p525L083M2843k8866k7268K286k316L1669j6203O68L5595
15785B6970K7970j5704n525K9985m6549j8164r709l3461k9104k2586K6756L8475
15773c0646J933l913m2075J1057L4700O2640J1449J0726m69l9775l1585p314k001
15760b5273R802J2724n429J9896K4396K3698j4494J1661n0018J3708j0346M011
15748A4336L545N977k723r291l3044l2940j5048J2933J3613J0432M0591k351k2883
15735a6853m145j6090J7167j7178n687K3584J3437K0248J6586k6874m1419m2937
15723h0161J4004L2913K324j2395k6851K8809J8052J0887J6699O619K0038n834
$$ plain form
15810 -29930 26518 72994 28841 29315 37926 11263 -10243 -45983 -74337 -63581 -29795 20269
15798 20269 15371 -6996 -14521 -11438 31405 2539 -24729 -22443 -24759 6910 -9293 -8625 26970
15785 26970 54940 39236 33711 63696 17147 -1017 -10726 -44187 -73291 -95877 -69121 -30646
15773 -30646 -28713 -32626 -74701 -63644 -28944 33696 45145 55871 55402 15627 -15958 -23272 -25273
15760 -25273 -15471 -2747 -8176 11720 36116 59814 45320 56981 6963 20671 10325 14336
15748 14336 17881 23858 21135 11844 -21200 -54140 -69188 -56255 -42642 -32210 8381 6030 -16853
15735 -16853 -20998 -37088 -19921 -37099 -42786 -19202 -5765 14483 31069 4195 -37224 -80161
15723 -80161 -66157 -33244 -30920 -43315 -70166 -41357 -23305 -12418 4281 10900 30938 25104
15711B5104j2327M6884o837j6214p980n7146j7796J3811K7304L863J9496K5355
15699D3517j36l9907Q623O961j4905j9065J1855K311p638M2569k5677n0731M8429
15686F206J5354j6749m5958o884l143J4845O9564k9302p3314j7627K6845P231
15674e2932P80J8007J0852J2417J01r829n571j5016J6575L5507M960J2063k9232
15661a318k2646o293J0619n631M016N6279l042q282J4920K8568o556M636j6373
15648D8897j3071m4864r7895K4806Q7132J0207r007j9031j1192k6453p550j9190
15636g7211J77K1788n6452j7937N0024k851k2581L0461K6858J4925K2111j1624
15624b2312l1088j5587K3525J878M590J6620K2625L0742j7263k5389K7879k7975
$$ plain form
15711 25104 12777 59661 52824 36610 28630 -28516 -46312 -32501 -5197 -1334 18162 43517
15699 43517 43381 3474 12097 19058 4153 -14912 -3057 -746 -8384 34185 8508 -42223 6206
15686 6206 21560 4811 -41147 -48031 -51174 -36329 33235 3933 -69381 -87008 -60163 -52932
15674 -52932 -52152 -34145 -23293 -10876 -10775 -20604 -26175 -41191 -24616 10891 15851 27914 -1318
15661 -1318 -23964 -30257 -19638 -25269 -21253 35026 31984 23702 38622 67190 60634 65270 48897
15648 48897 35826 -9038 -106933 -82127 5005 15212 6205 -12826 -24018 -50471 -58021 -77211
15636 -77211 -77034 -55246 -111698 -129635 -79611 -82462 -105043 -74582 -47724 -32799 -10688 -22312
15624 -22312 -53400 -68987 -45462 -43584 -38994 -22374 251 30993 13730 -11659 16220 -11755
15612a1755j6966L474L7992J4120k3982j2782j2857k0241K555M8129J5234l6779
15600a3858j3594l3804l4081J6901J6733R292P299K269R601l0799O665P361l088
15587e3103l5390Q667O273P8000J8002j6620J8095j9062o8489k8641M9169K8777
15575a4322J8091m783K6538j9572m42m132J4436L7954J4613k7708k5839j5613
15563g79J4106l3339m019M4023j5334k9957m6518L4054O4243K5204l132m4633
15551C919j0830K0727j5712j8511j8190o189m066J5278O1424L67n607n235K134
15538A9509k849M4899P219j9352J2348J094k3411l3273j869j3797l7600l9083
15526h6165J7890M1909N924M551j259k1747j2701j2005l2980J9889L5211r149
$$ plain form
15612 -11755 -28721 -25247 12745 26865 2883 -9899 -22756 -42997 -40442 7687 22921 -13858
15600 -13858 -27452 -61256 -95337 -78436 -61703 -52411 -45112 -42843 -33242 -64041 -57376 -50015 -53103
15587 -53103 -88493 -79826 -73553 4447 22449 5829 23924 4862 -63627 -92268 -43099 -14322
15575 -14322 3769 -1014 25524 5952 5510 1378 15814 53768 68381 40673 14834 -779
15563 -779 13327 -20012 -24031 19992 4658 -25299 -71817 -37763 26480 51684 48552 3919
15551 3919 -6911 13816 -1896 -20407 -38597 -44786 -48852 -33574 27850 28217 22610 17375 19509
15538 19509 16660 61559 68778 49426 61774 62868 39457 6184 4315 -9482 -47082 -86165
15526 -86165 -68275 -26366 -20442 -15891 -17150 -38897 -51598 -63603 -96583 -76694 -41483 -50632
15514e0632M5540J6395j7024R992n405k0215j948L6968J6650m8182k969K5597
15502D767L2460L4192m79m9299o1306l0703n713j0139N9956O712m1180l844K5481
15489c9095M506R975k5409r931J6870J2319K3024j3980j2492L621P267k4547M9410
15476A538M2098n9561l0775M5886M0535J7708k5240l547l9773P120L9543r012
15464B6520q669k1143k4253j277L3892M9868k4196K757k8618m4995K0414L0071
15452A0371R37p928k697l044J9783J5805J2478J2908j8040l8427k3839n957P1392
15439D3742n113l2075k724k4807K9234j4510o9192K9188M1647L7545K3550j1032
15427D5453o9932l5216k375K2189J8066k1964j7066M9803K4756K3567M3908L2366
$$ plain form
15514 -50632 -5092 11303 -5721 4271 -1134 -21349 -23297 13671 30321 -17861 -20830 4767
15502 4767 37227 71419 70940 21641 -39665 -70368 -76081 -86220 -26264 -19552 -60732 -64576 -39095
15489 -39095 -34589 -24614 -50023 -59954 -43084 -30765 -7741 -21721 -34213 -30592 -23325 -47872 1538
15476 1538 43636 -15925 -46700 -814 39721 57429 32189 28642 -11131 -4011 35532 26520
15464 26520 17851 -3292 -27545 -28822 5070 54938 30742 33499 4881 -40114 -19700 10371
15452 10371 11308 3380 683 -2361 17422 33227 45705 58613 40573 2146 -21693 -27650 43742
15439 43742 38629 6554 3830 -20977 8257 -6253 -75445 -46257 -4610 32935 56485 45453
15427 45453 -24479 -59695 -62070 -39881 -21815 -43779 -60845 -11042 13714 37281 81189 113555
15415A13555r959l9836n7314m968K0765j5686J6328L326j9081k0024l2300K4194
15403b1000L389L164M7684j4352j1454J4691o408j0025j2279j3601l9874m9705
15391a09770K6886N7374J0065j9573J0673J8934L8788j8545l2507J7836j5296
15380a5135M2195K2502r413L2092R031l9963m6242O660j5854q57p659n188P6305
15367D8474N0731n6823n0615K2792j2462k447N61P6960K1k5269R204k3356K5764
15354F3535L2946l0648j8021k366L817j6423l5910k2892l1819J4320j608k6308
15342g1377M1987N5869p70n832l1036L4188J8925N719j2488j0554J2991j6249
15330B1373l030m874J9195K0328Q366j3939j9999r040k3679L257p080O734p242
$$ plain form
15415 113555 103596 63760 6446 1478 22243 6557 22885 26211 7130 -12894 -45194 -21000
15403 -21000 -17611 -14447 33237 18885 7431 22122 15714 5689 -6590 -20191 -60065 -109770
15391 -109770 -82884 -25510 -15445 -35018 -24345 -5411 33377 14832 -17675 161 -15135
15380 -15135 27060 49562 40149 72241 81272 41309 -4933 1727 -14127 -14984 -22643 -27831 48474
15367 48474 99205 42382 -8233 14559 2097 -350 211 77171 77192 51923 61127 37771 63535
15354 63535 96481 65833 47812 45446 49263 32840 -3070 -25962 -57781 -43461 -45069 -71377
15342 -71377 -29390 26479 25709 19877 -11159 23029 41954 47673 35185 24631 37622 21373
15330 21373 18343 13469 32664 52992 61358 47419 27420 18380 -5299 -2042 -9122 -2388 -9630
15317i630j0470K6846l0864j7444J8118K7031j0687O92L8772j2678k2425p488
15305a0227K8652L9218k3818q283M447M317j3502J5361k1479n788J0606J3251
15293C2755j2321l8089l6429O5794M4258j631J5908P696J5281J2550l4698n158
15281F5916k4242j3801M459J657L856q558l1151L646l6995r883j6343K8253M1100
15268G914l5529m7961K9667O5304R298n691l2503J9139n827n560m4392J8843L1785
15255D487j9053K6394N400L921j9400o1597N054j0741K9354N5054L4246j0815
15243D2304j7021k4291K756l0155p063N173J06K7410k6944R642J0861j7761K1573
15230c410L4024j7337m039k0432o296M0940K5888Q927j7842K0018l9644k0703
$$ plain form
15317 -9630 -20100 6746 -24118 -41562 -23444 3587 -7100 -6408 32364 19686 -2739 -10227
15305 -10227 18425 57643 33825 25542 29989 34306 20804 36165 14686 8898 19504 32755
15293 32755 20434 -17655 -54084 11710 55968 54337 70245 77941 93222 105772 71074 65916
15281 65916 41674 27873 32332 33989 37845 29287 -1864 1782 -35213 -45096 -61439 -33186 7914
15268 7914 -27615 -75576 -45909 19395 28693 23002 -9501 9638 3811 -1749 -46141 -27298 4487
15255 4487 -14566 11828 17228 21149 1749 -59848 -54794 -65535 -36181 18873 53119 42304
15243 42304 25283 992 3748 -26407 -33470 -28297 -28191 -781 -27725 -18083 -7222 -24983 -3410
15230 -3410 30614 13277 9238 -11194 -17490 23450 49338 58265 40423 60441 20797 94
15218I4J726J119O591j7676N651J1817L5504m55j4357k589j7283L5147J2217j3229
15204D4277n4008k9643k7944q704O4499O6925l7094j5621j3948L6703j1716k8408
15192a4682N093j5916n468k1727l2330K078K3769K3017K4706L54n888K470M429
15179a0095L6331J3295m5281l0211K9478M9691r992j1311q343l0082J9680N6179
15167E9339K441k7894k2354j0401j9638l7397j9232O6297R6842M1439j3044p1879
15155D4519l4867q756l5388j1173j4413N0292M1015l617p8641k3867K3437L5492
15143a5967o626Q026k4595o896K4167L0026K6746o166m4150k298K3976J2663l473
15130A5433M510J6030m222n0299l4682j1686M5191j6475L5201J6994j0918K2277
$$ plain form
15218 94 1820 2939 9530 -8146 -2495 9322 44826 44371 30014 27425 10142 45289 57506 44277
15204 44277 -9731 -39374 -67318 -76022 -11523 55402 18308 2687 -11261 25442 13726 -14682
15192 -14682 -9589 -25505 -30973 -52700 -85030 -82952 -59183 -36166 -11460 -11106 -16994 -14524 -10095
15179 -10095 26236 39531 -5750 -35961 -6483 43208 33216 21905 13562 -16520 3160 59339
15167 59339 61780 33886 11532 1131 -18507 -55904 -75136 -8839 88003 129442 116398 44519
15155 44519 9652 896 -34492 -45665 -60078 -9786 31229 27612 -51029 -74896 -51459 -15967
15143 -15967 -22593 -14567 -39162 -46058 -21891 8135 34881 28715 -15435 -17733 6243 18906 15433
15130 15433 19943 35973 31751 -18548 -53230 -64916 -19725 -36200 -999 15995 5077 27354
15118B7354K4106k8005k3478K9224J87l8761n7477J2106J5031M513J2226K1984
15106i90j8951p2914K9513M8443l6407k0880K9648J8988k2100k3496J5017K0593
15094c3536K3452K2263N15k4533k0001N0200q088K842J7271Q873k6688m6203J4395
15081a9238l670j9248k0462K7460J1538N41o011l067K200K8845K0542k2106j8510
15068b1186j1859L6482K3143J5357j0098j1059K6364J1519l4975l2287O597N8122
15056E6120l3850m6117m6738K3999J8496q254l3848J6736N8709m996k2687j1964
15044c4394P48j3397K0179P183N2175K1091n217J4454m8806l0471l6811j0598
15032f3864J4648j9752j0607J6222K3322k1315R306M1433O741K4958J7871j1541
$$ plain form
15118 27354 51460 23455 -23 29201 29388 -9373 -66850 -54744 -39713 -35200 -22974 -990
15106 -990 -19941 -92855 -63342 -14899 -51306 -72186 -42538 -23550 -45650 -69146 -54129 -33536
15094 -33536 -10084 12179 12694 -11839 -31840 18360 10272 13114 30385 39258 12570 -33633 -19238
15081 -19238 -22908 -42156 -62618 -35158 -23620 -23079 -29090 -32157 -29957 -1112 19430 -2676 -21186
15068 -21186 -33045 3437 26580 41937 31839 20780 47144 58663 23688 -8599 -2002 56120
15056 56120 22270 -23847 -70585 -46586 -28090 -36344 -70192 -53456 5253 257 -22430 -34394
15044 -34394 -33646 -47043 -26864 -19681 32494 53585 48368 62822 14016 -16455 -53266 -63864
15032 -63864 -49216 -68968 -79575 -63353 -40031 -61346 -52040 -10607 -3866 21092 38963 27422
15020B7422k9189M195K4434k9303k2500J8505o213m840k2339J5550N4239K5072
15008E5033j550M2048K2707l011P5013R0752J54245J97582J01204P1541j41384
14997F64180k33305j71458o3521l9958k5240k8184M814L5046l8534n0354j0689
14986D2797L827R092J1239m157l001k8127J29K1111J1533O204o444l8619j3770
14973A1814J0159j976k3957J2437J517m622k6666j6533q987L6064j0658N0803
14961B9395L1939p780k4678n2112m9234J8017J4110q311J3337L5599p081n62K6123
14948A8762J2945J778J1049j5036N837o66Q349L3645O591k0322k2963R717J4227
14935F3913k503j8542L042j5409m0864L1348K2155k1108m72J1750m0954L791K2572
$$ plain form
15020 27422 -1767 2428 26862 -2441 -24941 -6436 -12649 -17489 -39828 -24278 29961 55033
15008 55033 53483 95531 118238 115227 190240 280992 435237 632819 734023 805564 664180
14997 664180 430875 259417 195896 155938 130698 102514 107328 142374 103840 53486 42797
14986 42797 46624 55716 66955 62798 59797 31670 31799 52910 64443 70647 64203 25584 11814
14973 11814 21973 19997 -3960 8477 9994 5372 -21294 -37827 -46814 -10750 -21408 29395
14961 29395 61334 53554 28876 -23236 -72470 -54453 -40343 -48654 -35317 282 -6799 -7361 18762
14948 18762 31707 33485 44534 29498 35335 34669 43018 76663 83254 62932 39969 49686 63913
14935 63913 61410 42868 45910 30501 -10363 20985 43140 22032 21560 33310 -7644 -3853 18719
14922A8719o20j8891k0763J0148L0434L5864j7009l6699l6243j7512K0806J6433
14910a5333L2965M446m6878L1965J5805j0010m2237J4783M2365j7447k0431J006
14898i001m616j1436k3733K0858K212M0549L1310k2926k1301k9749j6944L751
14886d1026j5229K079j5923K2140M6788k0672l9697J0537K4826j5347J8977K7479
14874D932O7648J306k0211J6883j9504l8675o973K299M5549J439l2852m1323j4176
14861c3658K9856j9813P74N5612L472k11l7226l0329K3233K4245J0415J2469J1598
14848E0437L4061j9703k4252L446j9024K2563k2813m2106L7141K6994k925j6187
14836B7632K581k4416k4337m8207L8362M6674P520j0676o480L0913M626k2148
$$ plain form
14922 18719 18099 -792 -21555 -11407 19027 54891 37882 1183 -35060 -52572 -31766 -15333
14910 -15333 17632 22078 -24800 7165 22970 12960 -29277 -14494 27871 10424 -10007 -9001
14898 -9001 -13617 -25053 -48786 -27928 -25716 14833 46143 23217 1916 -27833 -44777 -41026
14886 -41026 -56255 -54176 -70099 -47959 -1171 -21843 -61540 -51003 -26177 -41524 -22547 4932
14874 4932 72580 73886 53675 70558 51054 12379 5406 7705 53254 54693 21841 -19482 -33658
14861 -33658 -3802 -23615 -22841 32771 36243 36032 -1194 -31523 -8290 15955 26370 38839 50437
14848 50437 84498 64795 40543 43989 24965 47528 24715 -17391 19750 46744 43819 27632
14836 27632 30213 5797 -18540 -66747 -28385 18289 25809 15133 8653 39566 44192 22044
14824B2044M0617k4633q1821J2152K0043N7242L4377l0704k7689m4774l051K2706
14812c491J6442R499k1863J4850p719j2044L2454M936l3375L57m77m242N898J1593
14798A2818O885L6012m9440L466K3332K302l0786J12N271j6436q386j0811P098
14785a8563M0530n29k2142l046j3914k062L0139L1614Q723k2765Q180n5509l0780
14772e0124j9697J5246P314K8090M6298R395k9186K898o604K1073J0029m3026
14760h294o031M48N020K6400R334Q96P702k279k7564l0455L7966o773K3055r184
14746B0241R121L097l0431J2350K0212l1686J7132L0087j0823j6102j3489n887
14734C822M97P491j3073j9034J5262j4838l0159K5478L5006j4250K447Q65J1821
$$ plain form
14824 22044 62661 38028 -43793 -31641 -11598 45644 80021 49317 21628 -23146 -26197 -3491
14812 -3491 12951 22450 587 15437 7718 -4326 28128 33064 -311 46 -431 -4673 1225 12818
14798 12818 19703 55715 6275 9741 33073 35375 4589 4701 9972 -6464 -14850 -25661 -18563
14785 -18563 21967 21438 -704 -3750 -17664 -19726 10413 42027 50750 27985 36165 -19344 -50124
14772 -50124 -69821 -54575 -47261 -19171 27127 36522 7336 10234 3630 24703 34732 -8294
14760 -8294 -14325 -13877 -8857 17543 26877 27773 35475 33196 5632 -24823 13143 6370 29425 20241
14746 20241 29362 32459 2028 14378 34590 2904 20036 50123 39300 23198 9709 3822
14734 3822 4319 11810 -1263 -20297 -5035 -19873 -50032 -24554 10452 -3798 -1351 -486 11335
14721A1335l1112Q503J5949o739L039k7999k5903K2863K3076l8713J753K4476
14709a9472L3714j0897o802j7851m3993k0122n458K9229N7856j6718q395J1271
14697a7638J5124k5908j735n319J2436J0411L9561J5971J1651m368m5845J7543
14685B1884P8400L3141p9072k5107k6535k4230L6647m1917Q539J4887k6683J6374
14673a3672Q529M367L142K505K2350l4807l3413j5046J2048Q970K2598j8965j6217
14660d7611j8949K130K9395j989k8014K2310M4679l5235K0454p541o0277O7841
14648a2807J9379k5406o924J1703j7292m8603L2408N5764k2636l4164J8263N1533
14636B1218P392n3617j9664L850K3724M2285N670K9727p889n5490l1208r278N4171
$$ plain form
14721 11335 -19777 -11274 4675 -2064 975 -27024 -52927 -30064 -6988 -45701 -43948 -19472
14709 -19472 14242 3345 -3457 -21308 -65301 -85423 -90881 -61652 -3796 -20514 -28909 -17638
14697 -17638 -2514 -28422 -30157 -35476 -23040 -12629 26932 42903 54554 50186 4341 21884
14685 21884 100284 133425 54353 29246 2711 -21519 15128 -26789 -18250 -3363 -30046 -13672
14673 -13672 -5143 -776 2366 4871 27221 -7586 -40999 -56045 -43997 -35027 -12429 -31394 -47611
14660 -47611 -66560 -64430 -35035 -37024 -65038 -42728 1951 -33284 -12830 -20371 -80648 -12807
14648 -12807 6572 -18834 -25758 -14055 -31347 -79950 -47542 8222 -14414 -48578 -30315 21218
14636 21218 28610 -25007 -44671 -40821 -17097 25188 30858 60585 52696 -2794 -34002 -43280 10891
14623A0891p604l1689q114K408R898P064l4636j742L7834K8240j1730K5022K8752
14610E4594R763k406k1341m359K6553j4275m4529J8738N4997j8540q4730m5443
14598g0978L6824P936r139m872k948K7019Q042L6637K5506k4622o120k0866N793
14585H212M0641J7862j2223M46k1641k1703j2076l0998j7055k9857o623K415L5556
14572d7044M2421R760j6360l0419J3724J7265J406J4722P090R806k3361j4908
14560a5898K5014j7668k5178K952j4829Q331j8776J9975M2009j9608o4445J5051
14548f3070K7495j6902r173N2873L8630m1283n6515J9725L6445P691K404P660
14536E980J4829k7304j8412K6921m328j8308j4054K3206k706j7708K2773M072
$$ plain form
14623 10891 3287 -28402 -36516 -34108 -24210 -17146 -51782 -53524 -15690 12550 820 25842 54594
14610 54594 64357 61951 40610 36251 62804 48529 4000 22738 77735 59195 -25535 -70978
14598 -70978 -34154 -26218 -35357 -40229 -43177 -16158 -8116 28521 54027 29405 23285 2419 8212
14585 8212 48853 66715 54492 54938 33297 11594 -482 -31480 -48535 -78392 -85015 -82600 -47044
14572 -47044 -4623 5137 -11223 -41642 -27918 -10653 -9247 5475 12565 22371 -990 -15898
14560 -15898 9116 -8552 -33730 -30778 -45607 -37276 -56052 -36077 5932 -13676 -78121 -63070
14548 -63070 -35575 -52477 -61650 -8777 29853 -11430 -67945 -48220 -11775 -4084 -1680 5980
14536 5980 20809 -6495 -24907 2014 -2314 -20622 -34676 -11470 -14176 -31884 -9111 -5039
14524e039m3477P425L0250J086k9279m3991n245P439L5889L4940K5997J6109n0521
14511a8417k4269k024j6891r956J6446K6578J9100N9912n532j4125k0750j1123
14499a051J4158k1314n398M8537k7599j5380J0384M340k3935l4681J7538M1202
14487F801M9008L3704J0071n7064k2519M0984K1840n9375m5358L8352O3277j5727
14475F3994q318l5387l7365J8445K8639J2134J1404n8831k4456K0777M7658m970
14463C3724q598j7184m7887L3418L4680l5961J4929J1232J093j6313j7842Q883
14451e826Q636j472j0110j9142n944J396J7605L6007L0635k8158k3415k7491N290
14438b1989J214j058K182K9809J9793J8830K4943p884r550j7159m039J060J6848
$$ plain form
14524 -5039 -48516 -41091 -10841 -9755 -39034 -83025 -88270 -80831 -44942 -10002 15995 32104 -18417
14511 -18417 -42686 -44710 -61601 -71557 -55111 -28533 -9433 50479 44947 30822 10072 -1051
14499 -1051 13107 -8207 -13605 34932 7333 -8047 2337 6677 -17258 -51939 -34401 6801
14487 6801 55809 89513 99584 42520 20001 60985 82825 23450 -21908 16444 79721 63994
14475 63994 55676 20289 -17076 1369 30008 42142 53546 -5285 -29741 -8964 38694 33724
14463 33724 25126 7942 -39945 -6527 28153 -7808 7121 18353 19446 3133 -14709 -5826
14451 -5826 2810 1338 -8772 -27914 -33858 -32462 -14857 21150 51785 23627 212 -27279 -21989
14438 -21989 -20775 -21833 -19651 10158 29951 48781 73724 65840 56290 39131 35092 36152 53000
14425E3000l1319m7811j3776r576L0889L3137p916j1007r600m5801R910R42J7135
14412c1793L0970l7142q346K1090K9077k7l5085k2920j3912N0574K7639L0565
14400D0690k0372l4170k1607Q522L3069o178J6534M9936L7134p456j6636j5965
14388F3501k6537m6009Q707L5440j2195j6685m1812J0349J9445J0220k7455p656
14376c0687N3687K4l4336l6788J4457K3432o894J397J3121R867K1921j2627j1443
14363E131M3865K8481p0422k0308M0193M8703J0484m0560o2667k2428K1572L1733
14351A3777m51m4515m0124K8890O4335J2187R040K157j4910k41k449k94j5442
14338A1960M054k2155p6173J4372M3275R856l937l1272M5632J8324k0732k0881
$$ plain form
14425 53000 21681 -26130 -39906 -49482 -18593 14544 6628 -4379 -13979 -59780 -49870 -48928 -31793
14412 -31793 -823 -37965 -46311 -25221 3856 3829 -31256 -54176 -68088 -17514 10125 40690
14400 40690 20318 -13852 -35459 -26937 6132 -46 16488 66424 103558 96102 79466 63501
14388 63501 36964 -9045 -338 35102 22907 6222 -35590 -25241 -5796 4424 -23031 -30687
14376 -30687 23000 23024 -11312 -48100 -33643 -10211 -17105 -15708 -2587 7280 29201 16574 5131
14363 5131 48996 77477 7055 -13253 26940 75643 86127 45567 -17100 -39528 -17956 13777
14351 13777 13326 -31189 -71313 -42423 21912 34099 43139 45296 30386 30145 27696 27402 11960
14338 11960 16014 -6141 -82314 -67942 -24667 -14811 -18748 -50020 -4388 13936 -6796 -27677
14326b7677Q119M8435K2696j1609m6221l13K7725O916k0619k8810o908K7920k2382
14313b2728k484K9312j8899j6750J0118N897k13k9335m7606p348L9291O0591K1182
14300B1028j3865k2893k3285K7325k0178L855K0137Q929K8943L3385m4416o854
14288A2111j7259M733j1973J3216M751p059J7234k6093l6923P025K5296N1446
14276C6505O959j4759L202M04o5425l2086K0028K7458J5187K7721k4219R21O406
14263H302r568k1259J72rJ4862K1859k2982j4662k4426M1108L9952l2855r084
14250h590M3648j0067L3175J0783r85J9168L418l6378Q133j5487L0339L6746j9359
14237I4544k9621o592l1885l8619K1243J7282q78l023K613r34l781j9482j5597
$$ plain form
14326 -27677 -19558 28877 51573 39964 -6257 -6570 21155 28071 7452 -21358 -28266 -346 -22728
14313 -22728 -25212 4100 -14799 -31549 -21431 -15534 -15747 -45082 -92688 -100036 -60745 -154 21028
14300 21028 7163 -15730 -39015 -11690 -31868 -28013 -7876 1053 29996 63381 18965 12111
14288 12111 -5148 -415 -12388 828 5579 -1480 15754 -10339 -47262 -40237 -14941 36505
14276 36505 43464 28705 31907 32311 -33114 -65200 -45172 -17714 -2527 25194 975 1896 8302
14263 8302 -1266 -22525 -22353 -22362 -7500 14359 -8623 -23285 -47711 -6603 33349 494 -8590
14250 -8590 35058 24991 58166 68949 67964 87132 90550 54172 62305 46818 77157 113903 94544
14237 94544 64923 58331 26446 -12173 9070 26352 25474 22451 25064 24130 20349 867 -14730
14224a4730J4821k4619M9988o853k2447m1192j0470K2533J6798l6L0251j7514
14212c470l1365K0993O0520j1834k7736K7627J63l2982J1323L223o597k8451k0814
14199c9400J6129m86M0228J4037k7573M558Q995M641j2557J1274k8527P304L4823
14186C3446J2208m7557m7325l5960N163O4672J9946j8992k2284N408k7099j7100
14174g5474K2529M5152O7820N449l2593k1847J0170j8523l1411R771J3762l4801
14162c9996k7097J5179L1979J1385k7274K6266L0797l4023J96M94n490J8647j7778
14149a6715j5355R44n2462k6246L5610M2167K4937l3646j6077j2280L0521M8602
14137A0000m2258k4520M0806L2577Q524k8558R941K3663k0305m5902N666j2025
$$ plain form
14224 -14730 91 -24528 25460 18607 -3840 -45032 -55502 -32969 -16171 -16207 14044 -3470
14212 -3470 -34835 -13842 46678 34844 7108 34735 34898 1916 13239 16462 9865 -18586 -39400
14199 -39400 -23271 -23757 16471 30508 2935 7493 16488 21129 8572 19846 -8681 -1377 33446
14186 33446 45654 -1903 -49228 -85188 -80025 -15353 4593 -14399 -36683 -31275 -58374 -75474
14174 -75474 -52945 -7793 60027 65476 32883 11036 21206 2683 -28728 -18957 -5195 -39996
14162 -39996 -67093 -51914 -19935 -8550 -35824 -9558 21239 -12784 -12588 -12094 -17584 1063 -16715
14149 -16715 -32070 -31126 -83588 -109834 -74224 -32057 -7120 -40766 -56843 -69123 -38602 10000
14137 10000 -32258 -56778 -15972 16605 25129 -3429 6512 30175 9870 -36032 -30366 -42391
14125d2391P354J3901M6016k1360o268k5917K8900j5886K060J5490M307L3635
14113C9841o1058j3175M3039p613j623L2045n247p475K909K02p733L4795j2237
14100C6670q313K4805j064j819j8036j3468k0310j7722k200j9643j6452O416q240
14087e9376K374K4579J0202n310L582n738L9435K9298K595k8350k210J1527n056
14074A7552P338K779l629O2638l4423r007r719j5032J9206k4766o2480M158O60
14061d4725P756J3827J5507M072K1056L084o6128p608O4270k2259n9185k6236
14049i6569K6843L8726N1438j4906k4206L098J0777L6250J7315j9995l7041k2669
14037c0939k3649j8604J6231P654K3684j3242L1968J9654N062L8582J1073l6532
$$ plain form
14125 -42391 -35037 -21136 24880 3520 -2748 -28665 235 -15651 -13591 1899 6206 39841
14113 39841 -21217 -34392 8647 1034 -589 31456 26209 18734 21643 21845 14112 48907 36670
14100 36670 28357 53162 52098 50279 32243 18775 -1535 -19257 -21457 -41100 -57552 -51136 -59376
14087 -59376 -57002 -32423 -22221 -27531 -23949 -29687 9748 39046 41641 13291 11081 22608 17552
14074 17552 24890 27669 24040 86678 52255 43248 33529 18497 37703 12937 -49543 -45385 -44725
14061 -44725 -36969 -23142 -7635 -3563 17493 20577 -45551 -53159 11111 -11148 -70333 -96569
14049 -96569 -69726 -31000 20438 5532 -18674 -15576 -4799 31451 48766 28771 -8270 -30939
14037 -30939 -54588 -73192 -56961 -49307 -25623 -38865 -6897 12757 17819 56401 67474 30942
14025C0942l7275J2064K3968K1158j3032n0547l4278J2464q650j2936L4008L5337
14013A3223l3952K0364L874l031m5237K0949J5311K7258K6730l7960Q455Q212
14001B4196l4767k4514o862j8649Q498Q2045O6470K850m7963o2735j4768K3922
13989b277L2673Q177k8292l9471K86p454j091J6170K1984J3596K71j0348j9298
13976a5074J2561L9289J3150K622k6177P310j5291m596j9580k8585L5544L4874
13964C6047l149j3861J4967J253l8587m8304J0960J77m723j1404M123j3735M917
13951f1319J8270M1837J5680j100j2294P038j4566j3425j2R204J357l4897p654
13938e1881J6833J0444k6350M0131M6552J4468R673k3020l0871J0170L8155j4564
$$ plain form
14025 30942 -6333 5731 29699 50857 37825 -12722 -47000 -34536 -43186 -56122 -22114 13223
14013 13223 -20729 -365 3509 478 -44759 -23810 -8499 18759 45489 7529 15984 24196
14001 24196 -10571 -35085 -41947 -60596 -52098 29947 96417 99267 51304 -11431 -26199 -2277
13989 -2277 30396 38573 10281 -29190 -28904 -36358 -37449 -21279 705 14301 14572 4224 -15074
13976 -15074 -2513 36776 49926 52548 26371 33681 18390 13794 -5786 -34371 1173 36047
13964 36047 32898 19037 34004 35257 -3330 -51634 -40674 -40497 -45220 -56624 -52501 -66236 -61319
13951 -61319 -43049 -1212 14468 13368 1074 8112 -6454 -19879 -19891 -10687 -9330 -44227 -51881
13938 -51881 -35048 -24604 -50954 -10823 35729 50197 59870 36850 5979 16149 54304 39740
13926C9740p2606o7249j004J0098K8075L354r128J7413j1139Q870K6582K7657
13914F63J6401P559O483j2076K8647K2924M889l2648k2896j1796K565L5341r25
13901D5131k6301j971J6004o61k0477K6279J4708m3826j6836J3813l462J6570
13889A8971K1091L2403o470k7942k9076p76j2653m0195J1934N9594J7226m1577
13877B530m8096k511M6207m507k1970l1908Q311J2680J0149k6145j4623K8026
13865d1857N4354R882N984J9344m1209k1098J4437N4664L5356L8516k817l0344
13853I5212O627j953J5340l9832m6319L4692J5178k0913m0080j3301Q844q353
13841E142j4385N886j1632L3307J6003k4839j4355K2405L0032K0044k5386m3346
$$ plain form
13926 39740 -32866 -100115 -101119 -91021 -62946 -59592 -68720 -51307 -62446 -53576 -26994 663
13914 663 17064 24623 31106 19030 47677 70601 75490 42842 19946 8150 10715 46056 45131
13901 45131 18830 16859 32863 32202 11725 38004 52712 8886 -7950 5863 2401 18971
13889 18971 40062 72465 65995 38053 8977 8201 -4452 -44647 -32713 26881 44107 2530
13877 2530 -45566 -48077 -1870 -6377 -28347 -60255 -51944 -39264 -29115 -55260 -69883 -41857
13865 -41857 12497 22379 28363 47707 6498 -14600 -163 54501 89857 128373 125556 95212
13853 95212 101839 99886 115226 75394 29075 63767 78945 58032 17952 4651 13495 5142
13841 5142 -9243 -3357 -14989 18318 34321 9482 -4873 17532 47564 67608 42222 -1124
13829a124r477l472J7536k0894r357p390K1272M3350N1102j1810n9398l6498J1470
13816a4690K8381l3992r338K1199J2929Q423K5848L642m023j7836k4736K7631
13804B3438j5315o7410j2153R430N4216K0618P727m9304j2269l7576j9893M6717
13792e1774M0912R34m341M8192o175n117P975Q549l7623Q055J954m846l355L7837
13778D1177j3024J3580j879m4935k4804J0293N6730k347k674k1136k101o407k706
13765b33P346k4405k9931P084J0080J3342K5741m3889q162M1935Q0039R583j9374
13752F9156k2007l675N426n149P460j4704l2377o442p803o436m625j7287j9678
13739e8141L7504P3706j4183k6575j0361l2859o337k650m742K1889j3938l01n906
$$ plain form
13829 -1124 -10601 -14073 3463 -17431 -26788 -34178 -12906 30444 81546 69736 10338 -26160 -14690
13816 -14690 13691 -20301 -29639 -8440 4489 12912 38760 42402 38379 20543 -4193 23438
13804 23438 8123 -59287 -71440 -62010 -7794 12824 20551 -28753 -41022 -78598 -98491 -51774
13792 -51774 -10862 -9928 -14269 33923 27748 22631 30606 39155 1532 9587 11541 6695 3340 41177
13778 41177 28153 41733 39854 -5081 -29885 -19592 37138 34791 32117 10981 8880 2473 -233
13765 -233 7113 -17292 -47223 -40139 -30059 -16717 9024 -34865 -43027 -1092 78947 88530 69156
13752 69156 47149 43474 48900 43751 51211 36507 4130 -2312 -10115 -16551 -21176 -38463 -58141
13739 -58141 -20637 53069 38886 12311 1950 -30909 -37246 -39896 -44638 -22749 -36687 -36988 -42894
13726d2894J4030j1863J9473k1121m3260M119L823l328J7047k5321L8629L4785
13714a5881k9046k8909N694R065R604M4041M2473j0433l1225j5166j243k8184
13702d9210j9289K4817M2056k6015J1618J9705L771J8683N3823j4710m5468k2618
13690b837m743m557L437L176o214K0614j0180K2369j2239k6312k7589j4815K0053
13677c9837Q499k2619l2422J2108n062L8004m543O147L5123J2256K5410K2067
13665E5131j7499l8300j8285J3362j0553j1883L4177j236l4918o849K0001K2303
13653E451R069Q075k4169L2178K4720j4221j3751m135K6284M521l554j858k5534
13640B3076J4513J3438q386n270l4866k41n488j1889q788N277K2300r84k2358
$$ plain form
13726 -42894 -28864 -40727 -21254 -42375 -85635 -81516 -77693 -81021 -63974 -89295 -50666 -15881
13714 -15881 -44927 -73836 -68142 -59077 -49473 -5432 37041 26608 -4617 -19783 -21026 -49210
13702 -49210 -68499 -43682 -1626 -27641 -16023 3682 7453 26136 79959 65249 19781 -2837
13690 -2837 -7580 -12137 -8700 -5524 -11738 8876 -1304 21065 8826 -17486 -45075 -59890 -39837
13677 -39837 -31338 -53957 -86379 -74271 -79333 -41329 -45872 -39725 -4602 7654 33064 55131
13665 55131 37632 -668 -18953 -5591 -16144 -28027 6150 4914 -30004 -36853 -16852 5451
13653 5451 14520 22595 -1574 30604 55324 41103 27352 23217 49501 54022 50468 48610 23076
13640 23076 37589 51027 42641 37371 2505 2264 -3224 -15113 -23901 -18624 3676 2692 -19666
13627a9666L611K9434j6081K1491l0746o2574L022q733j0881j5749L1071O0204
13615a5597J0856l0817N897j362N15k4833K6862N6888n595l6772L0998M3502R984
13602G0526R705k0064k5038P787m8129k2543m821L0509j3877K2106M2449J4441
13590F3051o6210j3697O743k2927j2416j2426K2027Q84J8393n597L6463k1319
13578g031l9488O200j02K9616K3979n4266o59N2656R587l6752k4710J1877K0017
13565i076n631l3943k9552K1842N8683J4460k7892P265j9553N7861J7979k4018
13553B8425k0622l1466K7708k9095j237P496P999R849J8691M845j9919K98L7849
13540D0821o1612o0675n7586j5514N9996J7781J0421K2264K3482Q929J2559k251
$$ plain form
13627 -19666 -16055 13379 -2702 18789 -11957 -74531 -71509 -80242 -91123 -106872 -75801 -15597
13615 -15597 -4741 -35558 -29661 -31023 -30508 -55341 -28479 28409 22814 -13958 17040 60542 70526
13602 70526 80231 60167 35129 42916 -5213 -27756 -32577 -2068 -15945 6161 48610 63051
13590 63051 -3159 -16856 -10113 -33040 -45456 -57882 -35855 -34971 -16578 -22175 14288 -7031
13578 -7031 -46519 -40319 -40421 -10805 13174 -41092 -41751 10905 20492 -16260 -40970 -29093 -9076
13565 -9076 -14707 -48650 -78202 -56360 2323 16783 -11109 -3844 -23397 34464 52443 28425
13553 28425 7803 -23663 4045 -25050 -26287 -18791 -10792 -943 17748 22593 2674 2972 40821
13540 40821 -20791 -81466 -139052 -154566 -94570 -76789 -66368 -44104 -20622 -11693 866 -1385
13528a385J8101l1916p137K5820J1745M7047Q570l0143L832j8888j121k9189o506
13515a1170J5410k2765o17L6542j2883P979J3542K8172K5429j8669j0283p377
13503D3310j9255L744o2289J0919M3323k8346K147J8202K6369J7279m9843l3213
13491b7653m945j0259J1969L1106m231K0583M7928J8704l835j01868k6725K2116
13479b7110j4998K6256l6445j4191K2453K1954J3197K3257l5718j8913K509k1464
13467e9213J4485R131K0780M1993N6771L7063J7499K0760Q232n0350j4645k7510
13455G4996O666Q10K9143l2997m9945n340k9169J4588K9212M2433J4537m4630
13443E0304m1797n27K9776J2193R820l9410k5179k439M891L956J7061j8940k5003
$$ plain form
13528 -1385 16716 -15200 -22337 3483 15228 62275 70845 40702 44534 25646 24525 -4664 -11170
13515 -11170 4240 -18525 -19142 17400 4517 12496 26038 54210 79639 60970 50687 43310
13503 43310 24055 27799 -34490 -23571 19752 -8594 -6447 11755 38124 55403 5560 -27653
13491 -27653 -32598 -42857 -30888 218 -4013 16570 64498 83202 79367 -22501 -49226 -27110
13479 -27110 -42108 -15852 -52297 -66488 -44035 -22081 -8884 14373 -21345 -40258 -37749 -59213
13467 -59213 -44728 -35597 -14817 27176 83947 121010 138509 159269 167501 117151 102506 74996
13455 74996 81662 82472 111615 78618 28673 23333 -5836 8752 37964 80397 94934 50304
13443 50304 8507 7980 37756 49949 59769 20359 -4820 -7259 -2368 1588 18649 -291 -25294
13430b5294J2266k287m3720J4813K4477K5445M476J6572j4301L121M690N304J4881
13417D0443J6630k9814k1737l9081n9925p047L5979K0186L270R5J0453m781n498
13404d0827K4456k7952O8568P2960q672l8747l4404j4229J6961N7145q90j0208
13392F4161j6560j964k2804k1737r96j2073J6442J9151K5070l9713J6921Q72k1582
13379E188l051j8241R266m330K131j5241N12J3931J1213n0561m0919j299K1366
13366g0035k8314o045J4014P76K5493J9979n550j7015k128L9507N9526J7682j3163
13353C4727l0714j4417l690K990k042k4231R741L3550l047k5902R288M2606j5630
13340A3229j7030k9677r775P778M17k123N4840J2620m1009L7991L8387L9739m5707
$$ plain form
13430 -25294 -13028 -15315 -59035 -44222 -19745 5700 10176 26748 12447 15568 20258 25562 40443
13417 40443 57073 27259 5522 -33559 -93484 -100531 -64552 -44366 -41096 -41001 -30548 -35329 -40827
13404 -40827 -16371 -44323 24245 97205 88533 49786 15382 1153 18114 75259 74369 64161
13392 64161 47601 45637 22833 1096 100 -11973 4469 23620 48690 8977 25898 26770 5188
13379 5188 2137 -16104 -6838 -11168 -9037 -24278 -23766 -9835 1378 -49183 -90102 -91401 -70035
13366 -70035 -98349 -104394 -90380 -89604 -64111 -44132 -49682 -66697 -68825 -29318 30208 47890 34727
13353 34727 4013 -10404 -14094 -11104 -13146 -37377 -27636 5914 2867 -23035 -13747 28859 13229
13340 13229 -3801 -33478 -43253 -35475 -35058 -37181 17659 30279 -10730 27261 65648 105387 59680
13327E9680o3014J1504m620l7461L326J535O219R286k3863n552J3762J1076o815
13314b4937l2964L6639N1041J7279j8445l120j5713N202j9323k347j7814N538
13302a8964L8842J6466k4698j2070j7098q17j0851L3023j1975o3032k5082N3964
13290d2292P5662R448Q909P697k558k9322k0836l6662L2838J637m249o039L312
13277b455K8205j6978k9933m207L2171j684J9333m0679o4199M1509j6217L1146
13265b3988L5940k2436n4247K1116M6652J6016k7967L4572J6663m8656m4142L680
13253d6797J5807j5200k3072J0446K9597q335J9125k688j8549k1342r307P693
13241f2622Q165O1209M6207j9543l1194l5858J5211M3952L092o20J291k7465J3529
$$ plain form
13327 59680 -3334 8170 3550 -33911 -30585 -29050 -22831 -13545 -37408 -42960 -29198 -18122 -24937
13314 -24937 -57901 -21262 29779 47058 28613 25493 9780 14982 -4341 -6688 -24502 -18964
13302 -18964 19878 36344 11646 -424 -17522 -18339 -29190 3833 -8142 -71174 -96256 -42292
13290 -42292 33370 42818 51727 59424 56866 27544 6708 -29954 2884 4521 272 -5767 -2455
13277 -2455 25750 8772 -21161 -25368 6803 5119 24452 -16227 -80426 -38917 -55134 -23988
13265 -23988 11952 -10484 -64731 -43615 3037 19053 -8914 25658 42321 -6335 -50477 -46797
13253 -46797 -30990 -46190 -69262 -58816 -29219 -37554 -18429 -21117 -39666 -61008 -70315 -62622
13241 -62622 -54457 6752 52959 33416 2222 -33636 -18425 25527 28619 27999 29290 1825 15354
13228A5354l6238p729M8803r810l4778k6920j2670j2107K5146N8525j5431l2247
13216d0102p949K0297K7138m341J423k9432k1657j9932R212M0216J5517O235K4856
13203B1481N368q719l780m2005n435J291k0925K0542L3696K2002O583J4695j1462
13190C3332N146L8710M765l2544k5093o850L6996K3354k8550k6237j7821J7968
13178B3176M673l3371J7281k8939l2661L1557K6397o4642j3430l715L2530O7139
13166B5995j1692j4271J6581j8223j9326m9690k1756J7754L5628J8706k1208j0525
13154e2027K8554j0182P070K7464K5641J0615j679n0747N887J7894k1271J3651
13142H70J652M311J9543R301R451o972j9182M4839M6734m995L94k5006l1947r841
$$ plain form
13228 15354 -20884 -28613 20190 10380 -24398 -51318 -63988 -76095 -50949 7576 -7855 -40102
13216 -40102 -48051 -27754 -616 -4957 -3534 -32966 -54623 -74555 -65343 -25127 -9610 -3375 21481
13203 21481 26849 18130 14350 -27655 -33090 -31799 -52724 -32182 1514 23516 30099 44794 33332
13190 33332 38478 77188 81953 49409 24316 17466 54462 77816 49266 23029 5208 23176
13178 23176 27849 -5522 11759 -17180 -49841 -18284 8113 -56529 -69959 -73674 -41144 25995
13166 25995 14303 32 16613 -1610 -20936 -70626 -92382 -74628 -39000 -20294 -41502 -52027
13154 -52027 -23473 -33655 -26585 879 26520 37135 35456 -15291 -9404 8490 -12781 870
13142 870 2522 6833 26376 35677 45128 38156 18974 63813 110547 105552 105946 80940 48993 39152
13128C9152r910k4554j5929K1633M2387j5371n2913l2026o946J4280k0890k4561
13116h5648n320M8381L4500l2301j0060K4720K2889j1372K3525K1737q145k0030
13104B876L3449m054k2417j480L2830j9791k3798K0886J5905O3346n628m4259
13092D7865Q77J1876l6630J9602L163J0499o810J5467M0179j7456k8194o326o089
13079D8023j2400k2918m3987j4435n402j5730K0554M387J1206M2679j6722k0226
13067b4971K4855o170j0758l4922L5358L8886L9360m1409n4609K1619J924n8718
13055f9555K5201N2280N85o744j4338l3078M732R79K7027J0839k7704J5226J503
13042a3047p100J7390N801l9562p791O925K6195M5171M536n7305p0873K4034K3890
$$ plain form
13128 39152 29242 4688 -11241 10392 52779 37408 -15505 -47531 -54477 -40197 -61087 -85648
13116 -85648 -90968 -42587 -8087 -40388 -50448 -25728 -2839 -14211 9314 31051 22906 2876
13104 2876 36325 32271 9854 8374 41204 21413 -2385 18501 34406 97752 92124 47865
13092 47865 48742 60618 23988 43590 46753 57252 50442 65909 106088 88632 60438 54112 48023
13079 48023 35623 12705 -31282 -45717 -51119 -66849 -46295 -41908 -30702 11977 -4745 -24971
13067 -24971 -116 -6286 -17044 -51966 -16608 22278 61638 20229 -34380 -12761 -10837 -69555
13055 -69555 -44354 7926 8511 1767 -12571 -45649 -40917 -39938 -12911 -2072 -29776 -14550 -13047
13042 -13047 -20147 -2757 3044 -36518 -44309 -37384 -11189 33982 38518 -18787 -89660 -65626 -41736
13029d1736R166N6088j7812j3364l53K5399O945o5244j5695L7464K1230q508J4027
13016G607M6865n170l4430m3178o041J9731m60j1262k4068J3267K3652L4391n325
13003A5579k6134R493L4169n5824n4594K5560K706L8833K0545q89j0362J5903
12991A4985K9875j4646K362J4391Q62K8119M6800o5736o6742j9457k0102O608
12979d2681m2312j6027k5958L0670j497M810K1603N8228M1722J3958j6665k4845
12967A006p443k6669l5005j1755L3998N8674N943q335P885j6072j1386O6137L7852
12954I4830o6991q220J7254o267l1985j3295K0083Q650l6806k5392k7630K5894
12942d9875N1944L8349K1535l2363k2478m3650j8738j8572J4614M5998K9739K1935
$$ plain form
13029 -41736 -32570 23518 5706 -7658 -8011 17388 24333 -40911 -56606 -19142 2088 -6420 7607
13016 7607 54472 49302 14872 -28306 -34347 -14616 -15076 -26338 -50406 -37139 -13487 20904 15579
13003 15579 -10555 -1062 33107 -22717 -77311 -51751 -49045 -10212 10333 9444 -918 14985
12991 14985 44860 30214 32576 46967 47829 75948 122748 57012 -9730 -29187 -49289 -42681
12979 -42681 -84993 -101020 -126978 -96308 -97805 -92995 -71392 -13164 28558 42516 25851 1006
12967 1006 -6437 -33106 -68111 -79866 -45868 12806 18749 10414 18299 2227 -9159 56978 94830
12954 94830 27839 19619 36873 30606 -1379 -14674 5409 14059 -22747 -48139 -75769 -49875
12942 -49875 2069 40418 61953 29590 7112 -36538 -55276 -73848 -59234 -13236 16503 38438
12930C8438J7426J5946m3516n5689k1009J416K6275J8484M9261J3598J2681K7778
12918A01089j3539k5152k7822j8736k3208j466J085m1865l4618L4178J8959p3
12906c1168l572R073K1429L2630j164j149P280k6930k6844j9827l3010j3512j910
12893h8674L2943L598K9969L5584j6130N163J8078n665m8517m1586K6153L121
12881d5963K626J3991L192j9737J1823K5894L8296L5578p399q913n819m472m9784
12868a0687q757K2488Q949M2020k6652l2016N506K6386K1571j973j3243o226J6993
12855D4359l7421l5478J999k3086l59M8250L4696m277m960M1055l7646l6070k3264
12842c2202J2720N3022k639K029L523j958M5798K162r658m711m4011n984K2982
$$ plain form
12930 38438 55864 71810 28294 -27395 -48404 -46988 -20713 -2229 47032 60630 73311 101089
12918 101089 87550 62398 34576 15840 -7368 -8834 -7749 -49614 -84232 -50054 -31095 -31168
12906 -31168 -34740 -25667 -4238 28392 27228 26079 33359 6429 -20415 -40242 -73252 -86764 -88674
12893 -88674 -55731 -52133 -22164 13420 -2710 2453 20531 14866 -33651 -75237 -49084 -45963
12881 -45963 -43337 -29346 -26154 -45891 -34068 -8174 30122 65700 58301 49388 43569 39097 -10687
12868 -10687 -19444 3044 11993 54013 27361 -4655 851 27237 48808 46835 33592 27366 44359
12855 44359 6938 -28540 -26541 -49627 -49986 -1736 32960 28683 23723 64778 27132 -8938 -32202
12842 -32202 -19482 33540 30901 32930 36453 34495 80293 82455 72797 68086 24075 18091 41073
12829D1073j4146p585M0626M9200N3235j8152n566M947k2736n174k2607l7398
12817E5717k7225n8483p144L8420L805q506m4225j091L8283L7239l166n0793m8445
12804g5614O2859J4469l1041j4350L499K6994J2774j9470J885K0553k0911J5290
12792c063J4789L1352J9330j9154k2774k9228J121k8569l46J4127k5539j39M6182
12779a911J7936l5938j6033k513M6665M8888K2222J0484j5849m7563n2230k6623
12767e2465L308o286J5651K4277J9342N0434L5775M473k7370M367k8087m0350
12755C069M057O159m260R456J901k3825k0897l3494l4634M6741l878k2392K2292
12742d9705R8955K7529j2732K7015p080m2498O579k6116n8059m7289J1645J07051
$$ plain form
12829 41073 26927 19342 59968 109168 162403 144251 138685 143632 120896 115722 93115 55717
12817 55717 28492 -29991 -37135 1285 5090 -3416 -47641 -48732 -10449 26790 23624 -27169 -75614
12804 -75614 -12755 1714 -29327 -43677 -40178 -13184 -410 -19880 -17995 2558 -18353 -3063
12792 -3063 11726 43078 62408 43254 20480 -8748 -7627 -36196 -36542 -22415 -47954 -48093 -1911
12779 -1911 16025 -19913 -35946 -38459 8206 57094 79316 89800 73951 26388 -25842 -52465
12767 -52465 -49157 -55443 -39792 -15515 3827 54261 90036 94509 67139 71506 43419 3069
12755 3069 7126 13285 9025 18481 20382 -3443 -24340 -57834 -92468 -45727 -49605 -71997 -49705
12742 -49705 49250 76779 64047 91062 83982 41484 48063 21947 -36112 -83401 -71756 35295
12730C5295J322m6752o893J5656K0109O0086j796k5218l3967l4457j7622N236
12718b9001j8971j0122N616J8580M6239L5246k3022J1855n060m1623k2605J1836
12706b1032J755Q009K1872N688Q237K1698k4685j8758J6053k7260l2251J7807
12694b2867K4474m4423k8055Q958M6888K1291j0503n040J4594P365J3067M827
12682C0576J1995L2254n8635k2510j4008R452J8952q854n6511J8783L1799k5059
12670c1766m22N933k7210O512J0669l2825J2321J7857L007J816k9618m500K0492
12657d7734K7455K6607M2360o481l4013r560Q37j7015r731K4605J8962L7761l3467
12644B0586K939M5156L724k0640J4531m7567l7337K154J5929j395J8890n810j9112
$$ plain form
12730 35295 36617 -10135 -17028 -1372 18737 78823 77027 51809 17842 -16615 -34237 -29001
12718 -29001 -47972 -58094 -52478 -33898 12341 47587 24565 36420 31360 -10263 -32868 -21032
12706 -21032 -19277 -11268 10604 16292 24529 46227 21542 2784 18837 -8423 -40674 -22867
12694 -22867 1607 -42816 -70871 -61913 -15025 6266 -4237 -9277 5317 12682 25749 30576
12682 30576 42571 74825 16190 -6320 -20328 -10876 8076 -778 -57289 -38506 -6707 -31766
12670 -31766 -32188 -26255 -53465 -46953 -36284 -69109 -56788 -38931 -35924 -34108 -63726 -68226 -47734
12657 -47734 -20279 6328 48688 42207 8194 -1366 -529 -17544 -27275 -2670 16292 54053 20586
12644 20586 23525 68681 72405 51765 66296 18729 -18608 -16454 -525 -1920 16970 11160 -7952
12631g952L8334M6523L6260l6311n3240k5852J992K5918j2116j0353k5141l3904
12619e5842l389L8504M2914l1448N288K5808K1617l0782k4565M224l7857j5133
12607f0661N2201K2575j0749j7451j7069L6312j7037j0060K2867k2132o0386k7413
12595a09003L2024O5650L5860J8198j4840m3214k3543j7146J100J0511J7987J4502
12583a1914m411j2056K779N143J1309n1500K5539J9323K3563J0364K3648N746
12571D7533l8093l7707q752n967K0193N471k0301k479n769j1368K2324N5789l6544
12558a5670l7608M3245O404N636M3947K0685m6599N357K5566R247O238o284K9513
12545H9677J2863k487k4979k6302l1371J173N411j6247K975k8616j1909J1392
$$ plain form
12631 -7952 30382 76905 113165 76854 23614 -2238 -246 25672 13556 3203 -21938 -55842
12619 -55842 -59231 -20727 22187 -9261 -3973 21835 43452 12670 -11895 -7671 -45528 -60661
12607 -60661 -8460 14115 3366 -14085 -31154 5158 -11879 -21939 928 -21204 -81590 -109003
12595 -109003 -76979 -11329 24531 42729 27889 -15325 -38868 -56014 -54914 -44403 -26416 -11914
12583 -11914 -16325 -28381 -25602 -20459 -9150 -60650 -35111 -15788 7775 18139 41787 47533
12571 47533 9440 -28267 -37019 -42986 -22793 -17322 -37623 -40102 -45871 -57239 -34915 20874 -15670
12558 -15670 -53278 -10033 -3629 2007 45954 66639 20040 25397 50963 60210 66448 60164 89677
12545 89677 102540 100053 75074 48772 17401 18574 23985 7738 10713 -17903 -29812 -18420
12533a8420k1286m225j119k800K0705k6256j7022n6432l642L1870P403J2786O110
12520g2328j6141M1097J9008J2485k4376m5900K6680M3384L4899Q003m0727k4129
12508c8045L1681O8157J8681n2765k4101j1226l57j3948J0304J8262l125l675
12496a57l7656M682J6049l1993l0947J6445L7462L6622o3349m8333M2193o459
12484f5441R626n03K5481j8857m107M0064j2467k379O429K0429q101J5774K3741
12471B9689P302o0968o803K2535l9446k1300L4340K7672K9750Q71m0334L7k0729
12458c7384J4338L7130k9625l1288o296O444j5671J3058j6574J6472L1212o596
12446b4780n7388K2K4710O271J1077M4708L7265L3982J556k9740k3068k4678J5128
$$ plain form
12533 -18420 -39706 -43931 -45050 -47850 -27145 -53401 -70423 -126855 -130497 -98627 -91224 -78438 -72328
12520 -72328 -88469 -47372 -28364 -15879 -40255 -86155 -59475 -16091 18808 26811 -13916 -38045
12508 -38045 -6364 61793 80474 27709 3608 -7618 -7975 -21923 -11619 6643 3518 -157
12496 -157 -37813 -33131 -17082 -49075 -80022 -63577 -26115 10507 -52842 -101175 -58982 -65441
12484 -65441 -55815 -56318 -30837 -49694 -53801 -13737 -26204 -28583 -22154 -1725 -9826 5948 29689
12471 29689 36991 -23977 -30780 -8245 -47691 -68991 -34651 -6979 22771 23642 -16692 -16655 -37384
12458 -37384 -23046 14084 -15541 -46829 -53125 -46681 -62352 -49294 -65868 -49396 -18184 -24780
12446 -24780 -82168 -82146 -57436 -51165 -40088 4620 41885 75867 77423 47683 24615 -63 15065
12433A5065j2293R101P207J088j6482r238J3239K2361M999K2988L7565J4028l8498
12420G1130k3748M866o428q1354j3955L3722M1597J8138k1575j9810j3001J8743
12408H325O7557L8432q860k0992j9788k6075k6057m9222J8229J6885J0318l1220
12396b2468m7373l98J7685L9329M2391l5182K5022N9426p085k1862j6550m5632
12384a2697j0517J0352K3529P530j7689j8384m3244J1151N339r557l5687m2063
12372a31937K2999K0964K8613J935M2723M2113J7744m9063l6479L7175M2162j4492
12360B4457k5209K2475J2497k7077l2380M8125J5080k0661N2304M6708Q783k6613
12348I8489n9691j0902K8613k1967m671K9311J5857j2447m3602l7773J5419k424
$$ plain form
12433 15065 2772 11873 19080 20168 3686 -5552 7687 30048 35047 58035 95600 109628 71130
12420 71130 47382 52248 45820 -35534 -49489 -15767 25830 43968 22393 2583 -10418 8325
12408 8325 75882 114314 105454 84462 64674 38599 12542 -36680 -18451 -1566 8752 -22468
12396 -22468 -69841 -70239 -52554 -13225 29166 -6016 19006 78432 71347 49485 32935 -12697
12384 -12697 -23214 -12862 10667 18197 508 -17876 -61120 -49969 -44630 -54187 -89874 -131937
12372 -131937 -108938 -87974 -59361 -57426 -14703 27410 45154 -3909 -40388 -3213 38949 24457
12360 24457 -752 21723 34220 7143 -25237 22888 37968 17307 69611 116319 125102 98489
12348 98489 38798 27896 56509 34542 29871 59182 75039 62592 18990 -18783 -3364 -5788
12336e788j951K5891J8916m2918K1304m360k7889J1554K2266K1375r462k4573
12324D365L5116l4701n4872k4332n7626r276M0040m624K5738p383l5682K3760
12312i9477L9127J2507j4154M148R394M690l6369j7908j6516J4841N4204r015
12300e4528Q957L9677k0401j6883L2112J528q500P493j1515l5920j4865Q5330
12288A2485J6622k499J2063j1884l9748l852J2936O829L031m9897N4201K4520
12276C4807k7650R95J8153J1528j1689l9894K1713J0216k4157O639j0229k5881
12264c5449k910O231M2752O5142k9093l8979l2779m6018j3868L6902L8775k6989
12252c6283j8974M0032J0711j9394j1984K4189L936j1473j9014K7318K619N309
$$ plain form
12336 -5788 -7739 18152 37068 -5850 15454 11094 -16795 -5241 17025 38400 28938 4365
12324 4365 39481 4780 -50092 -74424 -132050 -141326 -101286 -105910 -80172 -87555 -123237 -99477
12312 -99477 -60350 -47843 -61997 -57849 -48455 -43765 -80134 -98042 -114558 -99717 -45513 -54528
12300 -54528 -45571 -5894 -26295 -43178 -11066 -9538 -18038 -10545 -22060 -57980 -72845 12485
12288 12485 29107 26608 38671 26787 -12961 -16813 -3877 2952 5983 -43914 10287 34807
12276 34807 7157 8152 26305 37833 26144 -13750 7963 18179 -5978 661 -9568 -35449
12264 -35449 -38359 -32128 10624 75766 46673 7694 -25085 -71103 -84971 -48069 -9294 -36283
12252 -36283 -55257 -15225 -4514 -23908 -35892 -11703 -7767 -19240 -38254 -10936 -8317 -3008
12240c008l58J6829l6240j9732l7305j8910k3710L9290P0781J4429k9682N735
12228b1881j258J0899j102r740L158l8944j2883O1202K0958J4005k3043K3339
12216B4710N422k9957Q6M0315M9852K3411l7364m4440k4167k0882k9553J3154
12204b9413j1886j0791N511J8552R9408K5780j988l480m0412o658O142M191o7283
12191a2327l4065K0682k7746n2168o80K7092M7481M3966K770K1555K457o2240
12179b3223j7813L1116N38j0115l9272O8K2876J5769j2773K2971K0077j9553K4759
12166A5425j2302n0955K0341L8834J2776J8814j4513m5408P888j2216m2204J1688
12154e1832J1829k9083J925n796K0188J5866N2567M6752j6818o434j6108j2867
$$ plain form
12240 -3008 -3366 13463 -22777 -42509 -79814 -98724 -122434 -83144 -12363 2066 -27616 -21881
12228 -21881 -23139 -12240 -13342 -23082 -19924 -58868 -71751 -10549 10409 24414 1371 24710
12216 24710 30132 175 261 40576 90428 113839 76475 32035 7868 -13014 -42567 -29413
12204 -29413 -41299 -52090 -46579 -28027 71381 97161 95173 91693 51281 44623 50765 54956 -12327
12191 -12327 -46392 -25710 -53456 -105624 -106304 -79212 -31731 12235 15005 36560 39017 -23223
12179 -23223 -41036 -9920 -9382 -19497 -58769 -58701 -35825 -20056 -32829 -9858 10219 -9334 15425
12166 15425 3123 -47832 -27491 11343 24119 42933 28420 -16988 -9100 -21316 -63520 -51832
12154 -51832 -40003 -69086 -67161 -72957 -52769 -36903 15664 62416 45598 39164 23056 10189
12142A0189L6897j801l9026k8203J2354J580j4512J4745K1063N3976J473p7461
12130h726m027p557k8083J0432J5839K914J2883j605J167k1254K2688L685j3747
12117a5391J840J9652k9441k3210J9316L8709k1586o0406L34P31R387r777l0188
12104a00030j6879L2124P3556M0247n071K817J3827Q788j5525J6456K525k2189
12092C0646R382m1593m232K2840K3363k7993q2794j941M8298M4988J3315P0019
12080A04298j9708p9478J1371R015O768M4844M0009l4901n0597m180n1131n8133
12068h1823j2217J1956L9816L7484K8800m392n4325k8984k057k4606Q626J1774
12056f9948R200L8134J8057K8114O3398J5924j252r542j8802j3048j5436O185
$$ plain form
12142 10189 47086 45285 6259 -21944 -9590 -8010 -22522 -7777 13286 67262 68735 -8726
12130 -8726 -12753 -20310 -48393 -37961 -22122 -19208 -6325 -7930 -6763 -28017 -5329 -1644 -15391
12117 -15391 -13551 6101 -23340 -46550 -27234 11475 -10111 -70517 -70183 -69452 -60065 -69842 -100030
12104 -100030 -116909 -84785 -11229 29018 23947 26764 40591 49379 33854 50310 52835 30646
12092 30646 40028 -1565 -5797 17043 40406 12413 -70381 -72322 -24024 20964 34279 104298
12080 104298 84590 5112 16483 25498 32266 77110 117119 82218 31621 27441 -23690 -81823
12068 -81823 -94040 -82084 -42268 -4784 24016 19624 -34701 -63685 -65742 -90348 -81722 -69948
12056 -69948 -60748 -22614 -4557 23557 86955 102879 101627 92085 73283 60235 44799 50984
12044E0984k8893j1668k9880J0961R01k5957l8921k4575M9459O3753J3152n436
12032B3880l354L1550p823l6261k6794j7061J3662n698k2764J354N557K8606j5997
12019c1143k9941K7606J0456Q539K4665N2572K3562o6262n486K1161j3865n899
12007A5965K9658K7724j0368l4282j4876l1597k0205j1531L0456J585p044N3369
11995B8854L5400K437n2143J2280l5183N307M0756k1167n808p071l0835n423N444
11982b7152M0493L6312j385j3960p596J5748j4320m680k0299n660L4716K555R176
11969D3948J5854M110m5879J5319L3393R264m4404j049q131J0138j7994J2633
11957B7202K8325k3119l2049r461J138K9848k4940j9287j3531J0534M4368J7868
$$ plain form
12044 50984 22091 10423 -19457 -8496 -7595 -33552 -72473 -97048 -47589 16164 29316 23880
12032 23880 20526 52076 44253 7992 -18802 -35863 -22201 -27899 -50663 -49309 -43752 -15146 -31143
12019 -31143 -61084 -33478 -23022 -14483 10182 62754 86316 20054 14568 35729 21864 15965
12007 15965 45623 73347 62979 28697 13821 -17776 -37981 -49512 -19056 -17471 -24515 28854
11995 28854 64254 66691 14548 26828 -8355 -3048 37708 16541 10733 3662 -27173 -32596 -27152
11982 -27152 13341 49653 48268 34308 26712 42460 28140 23460 3161 -2499 32217 34772 43948
11969 43948 59802 63912 18033 33352 66745 76009 31605 30556 22425 32563 14569 27202
11957 27202 55527 32408 359 -9102 -7964 21884 -3056 -22343 -35874 -25340 19028 36896
11945C6896k64m0354l149q522j1249N5578K8954k9846k6774N5405J2631l6778
11933C2528k339l4748P372j0832o997l8998m6205k3693N6219L9950j514J9209
11921a0048p855j57J6812k3637m488l2831P266P0223O4134j8286n5182J0028j1914
11908D065r125Q22O0799K1765n1379n733N861Q55l0770J93k3644m2832L2710L5299
11894a114L1147J1156J8213k4040l9044J8040l663J3395N346k1028r15l2537Q594
11881a6450k5612R323L0579J0857m9926J4737Q0461N2753n0439m9547o4972j7969
11869g6205M5400M314K9624L301m0105m0667K146M2974n799n949L9317J4387J4762
11856B7500L615k1007l8059l2182N914K9901J8300j0174m863O8249L4883k7485
$$ plain form
11945 36896 36632 -3722 -6871 -15393 -26642 28936 57890 28044 1270 56675 69306 32528
11933 32528 30189 -4559 2813 -8019 -15016 -54014 -100219 -123912 -67693 -27743 -29257 -10048
11921 -10048 -17903 -18060 -1248 -24885 -29373 -62204 -54938 15285 79419 61133 5951 15979 4065
11908 4065 -5060 -4238 56561 78326 26947 21214 27075 27930 -2840 -2647 -26291 -69123 -36413 -1114
11894 -1114 30033 41189 59402 35362 -3682 14358 10695 24090 29436 8408 7493 -25044 -16450
11881 -16450 -42062 -32739 -2160 8697 -41229 -26492 53969 106722 56283 6736 -58236 -76205
11869 -76205 -30805 -26491 3133 6434 -33671 -74338 -72192 -29218 -35017 -40966 -1649 12738 27500
11856 27500 31115 10108 -27951 -60133 -54219 -24318 -6018 -16192 -21055 47194 82077 54592
11844E4592n4078j4057M3975l4067k655J5324J3261k3009m6977L7481J1499J5435
11832A6724K811m2627L2694J4354K3619J6090K0490k683O796k9783l4866k2396
11820A223j1032l7095j0210J2782j5993N545N146q643N0280L6869l895k506K7020
11807D9491K7757j816m5366l2986j053j9052j6064k612J3019K752K5n531r707
11794d1143L2095K9727j2641K9086R025m9402R459q605M8045R651l1483l797k374
11781A7643j1561J2809J1471O639J4346K5178L041n906p097j9042L395l7884k6023
11768a2991j4867K6213L1993k9709J2210K4103J393o62j6249l9560k2582K9360
11756a1348J3642m9687j3138M3758J4182L9067n563L780j0544r203q151J1013
$$ plain form
11844 54592 514 -13543 30432 -3635 -6290 9034 22295 -714 -47691 -10210 1289 16724
11832 16724 19535 -23092 9602 23956 47575 63665 84155 81472 88268 58485 23619 1223
11820 1223 -9809 -46904 -57114 -44332 -60325 -54780 -49634 -58277 -7997 28872 24977 22471 49491
11807 49491 77248 75432 30066 -2920 -3973 -23025 -39089 -41701 -28682 -25930 -25905 -31436 -41143
11794 -41143 -9048 20679 8038 37124 46149 -3253 6206 -2399 45646 55297 23814 20017 17643
11781 17643 6082 18891 30362 37001 51347 76525 79566 73660 66563 47521 50916 13032 -12991
11768 -12991 -27858 -1645 30348 639 12849 36952 38345 37683 21434 -18126 -40708 -11348
11756 -11348 2294 -47393 -60531 -16773 -2591 36476 30913 34693 24149 14946 6795 17808
11744A7808m9364j3469j3142l219J3996M4186K148k7015k1926k08J9680n039J2576
11731b2988M5341L722J6715K1548L292l5860k6571L023l1901m1418J1697P7057
11719B3657p819m0912j3304K8593L207l2043K1453J9651o39J9921k7342k8763
11707c4340L5699M4108L025L614q570k258k0731m4136l9523k9978J9114K4742
11695d9234l746j4948p688J567J335L1876l897L0226J4825k841j8398O5991Q515
11682E3583m7483K768L2038J1403M5707R299k2149k8718K542J6121j2996k2660
11670C9455K7662L2389j51p950L1504K2671j2434n2839m8213J443Q374l6781j3821
11657h691j1129j4767K8471M7525R667l7794M39O935M33j498j2174K778j213P021
$$ plain form
11744 17808 -31556 -45025 -58167 -61386 -47390 -3204 -1056 -28071 -49997 -50205 -30525 -35564 -22988
11731 -22988 22353 26075 42790 64338 67630 31770 5199 8222 -23679 -65097 -53400 23657
11719 23657 15838 -25074 -38378 -9785 -6578 -38621 -17168 2483 1844 21765 -5577 -34340
11707 -34340 1359 45467 48492 52106 43536 41278 20547 -23589 -63112 -93090 -73976 -49234
11695 -49234 -52980 -67928 -75616 -74049 -72714 -40838 -44735 -14509 316 -2525 -20923 45068 53583
11682 53583 6100 8868 40906 52309 98016 107315 85166 56448 58990 75111 62115 39455
11670 39455 67117 99506 99355 91405 122909 145580 133146 80307 32094 33537 41911 5130 -8691
11657 -8691 -19820 -34587 -6116 41409 51076 13282 13721 20656 21089 19591 7417 10195 8982 16003
11643A6003L1417r993K1518k6583j1924j1226L2558J993j1228l2467L1600o485
11631B5183l717l3778L9254L5086O3355K198j0435j9354l2341J57J1655k4603
11619E2660p0691q901K0829r814J2962k2267j9556K875K6156J3410j0333p132
11607a9802L6441P465K5753J1747n2523m8611J5930L217k1117J8105L7954J0113
11595B4672j2334m1769J828J4501K3418J1112J5378M1388l2204m7414J7324J9311
11583C5211j7680m122K4541m616n06j260J328m1063k024K7785J9584J3359n890
11570D4647k2486j1125m351J2846k1985k4508L318J7970M368j5641K3781L4694
11558D1528M880L4737j6615n420J5410k1619j0843J2162q979J1032j209k5948
$$ plain form
11643 16003 47420 37427 58945 32362 20438 9212 41770 43763 32535 68 31668 25183
11631 25183 21466 -12312 26942 62028 125383 127581 117146 97792 65451 65608 77263 52660
11619 52660 -18031 -26932 -6103 -15917 -2955 -25222 -44778 -41903 -15747 -2337 -12670 -19802
11607 -19802 16639 24104 49857 61604 9081 -39530 -23600 -20383 -41500 -23395 14559 24672
11595 24672 12338 -29431 -27603 -13102 10316 21428 36806 78194 45990 -1424 15900 35211
11583 35211 17531 13409 37950 33334 32828 31568 32896 -8167 -10191 17594 37178 50537 44647
11570 44647 22161 11036 6685 19531 -2454 -26962 -23644 -5674 -1306 -16947 6834 41528
11558 41528 46408 81145 64530 59110 74520 52901 42058 54220 45241 56273 55064 29116
11546B9116j3980l9919M387O92L833K8074L5508K1200k8200l6809j2485M348Q400
11533D165J4014k6228q156M9627L4809L2540k5593n2707m869L365J4681L6292
11521G1940l11m7227j1306N8953l631l9448J4605p60J911K5449j1195n754K4910
11508G8136Q38o2676P819M9606R271M261k9415J973o743l371O554j4123R064M1238
11494I2432k969l3823k5295o281j600k0964o247K0013L2696J2655J5577J8991
11482I5185k6955n1281k9866K1373K2005K607J689j0904N5898j9849n3477j9237
11470a2812J2082L7612k8451j5870J8416j7534J773J949j2032k8348j9265j0922
11458g3402K9515J5755J1760J9062N0059j9485m1981l1048L6257N5419O744O96
$$ plain form
11546 29116 15136 -24783 -20396 -19704 -15871 12203 47711 68911 40711 3902 -8583 -4235 4165
11533 4165 18179 -8049 -16205 33422 68231 100771 75178 22471 17602 20967 35648 71940
11521 71940 71629 24402 13096 72049 68418 28970 43575 42815 44726 70175 58980 53226 78136
11508 78136 78974 16298 24117 73723 82994 87255 57840 59813 53070 49699 56253 42130 51194 92432
11494 92432 89463 55640 30345 24064 22464 1500 -4747 15266 47962 60617 76194 95185
11482 95185 68230 16949 -12917 8456 30461 33068 34757 23853 79751 59902 6425 -12812
11470 -12812 -730 36882 8431 -7439 10977 -6557 -4784 -2835 -14867 -43215 -62480 -73402
11458 -73402 -43887 -28132 -16372 2690 52749 33264 -8717 -39765 -3508 51911 58655 59351
11446E9351j959m4422m6688K1001K1663k3426M0999J440k3610K461j6922L0562
11434B0450J3676O312N7119j7725n1573L9795M833m5222j5044m271j9033K9193
11422A8510k4099m5373R978m338j1045P232L5554M6470L9768M2809j5154o8817
11410C1495n0301p076P790K3365J7899l5476k4841N1830L4350p322J8573r680
11398E0606J2817k1545m2517k9421L4402N055n2270k3859k1217l843P5009K7605
11386A0822n5209N457K7051Q63j3078k7004K2189M8529N1233l6386o4063K8148
11374a448L7079R515J0040L3913k2246k847L9606k0300m0737N67K8863L3135J7858
11361A22998K2904l0639m1215l3717m7694o595K2238L2994K2695j4260J2523R687
$$ plain form
11446 59351 57392 12970 -33718 -12717 8946 -14480 26519 27959 4349 6810 -10112 20450
11434 20450 34126 40438 97557 79832 28259 68054 72887 27665 12621 8350 -10683 18510
11422 18510 -5589 -50962 -40984 -45322 -56367 -49135 -13581 32889 72657 115466 100312 31495
11410 31495 -18806 -25882 -18092 5273 23172 -12304 -37145 14685 49035 41713 60286 50606
11398 50606 63423 41878 -639 -30060 4342 9397 -42873 -66732 -87949 -91792 -16783 10822
11386 10822 -44387 -38930 -11879 -11016 -24094 -51098 -28909 19620 70853 34467 -29596 -1448
11374 -1448 35631 45146 55186 89099 66853 64006 103612 83312 42575 43142 72005 105140 122998
11361 122998 145902 115263 74048 40331 -7363 -13958 8280 41274 63969 49709 62232 71919
11349G1919j9940l7632k5870L5319j7454j8368J2189R6J5957k262j7678j7116
11337b0840l2250n855K7367M7538L5531J0042k6193l011J4342J1576r776p216
11325D1255j4744k9691J9081J8199R194J9281m430J6961j3629k0993K7193n272
11313F2405n8721p11K1281L582J5595O614k6206N93j448N568l8522K9237M4939
11300F4206K468K538m0056k8365l7831N0034K9380K6002k0448K7415J0522k4764
11288F1101j0514O791n623j968o838n529L642k580j9373n2352j723J8474K469
11275a4023L3610M6068L3977J3858p363n8889m9492r460R892j7243J7038l6236
11263c8263L113K7058q29M875j5179K4180M9217M2246j0560k6713J5778K552K0404
$$ plain form
11349 71919 51979 14347 -11523 23796 6342 -12026 163 259 16216 13954 -3724 -20840
11337 -20840 -53090 -58945 -31578 15960 51491 61533 35340 32329 46671 58247 48471 41255
11325 41255 26511 -3180 15901 34100 43294 62575 58145 75106 61477 40484 67677 62405
11313 62405 3684 2973 24254 27836 43431 50045 23839 24432 22984 28552 -9970 19267 64206
11300 64206 66674 69212 29156 791 -37040 12994 42374 68376 47928 75343 85865 61101
11288 61101 50587 57378 51755 49787 42949 37420 41062 38482 19109 -33243 -34966 -16492 -14023
11275 -14023 19587 65655 99632 113490 106127 47238 -2254 -11714 -1822 -19065 -2027 -38263
11263 -38263 -35150 -8092 -8921 -4046 -19225 4955 54172 96418 85858 59145 74923 77475 97879
11250I7879J793n5799n1304K9118K2932o40J3607k6615o099M094P043J8625N531
11237F0165j7474P470p696n1251R650N4189K9795l2598j298j7436k0323L4677
11225D7870K6076J846J3392l041j3836j8481r060j7688l202j3730k0763J0212
11213d05J5608L0356K7268L4976k2105k8102j9629j772K0454L4239J3145l2105
11201G1928j9392N306K9649L6873j2085j4334r196k2877j0210K9259R935K4249
11189A19105k5501m0824j5070M2874K0215k7005j0949L0353J2540r531L950q825
11177I1332K2763k5243j7414L2888J277R380n0626o067l087L5242K001l2192J2176
11164G2430n136k0603O937J1564m3804p2790M1889N9679l6281j2579k4661l7508
$$ plain form
11250 97879 99672 43873 -7431 21687 44619 43979 57586 30971 24872 28966 36009 54634 60165
11237 60165 42691 50161 42465 -8786 864 55053 84848 52250 50952 33516 13193 47870
11225 47870 73946 75792 89184 86143 72307 53826 44766 27078 23876 10146 -10617 -405
11213 -405 15203 45559 72827 107803 85698 57596 37967 36195 56649 90888 104033 71928
11201 71928 52536 57842 87491 124364 112279 97945 88749 65872 55662 84921 94856 119105
11189 119105 93604 52780 37710 80584 100799 73794 62845 93198 105738 96207 100157 91332
11177 91332 114095 88852 71438 104326 105603 114983 64357 58290 55203 90445 92446 60254 72430
11164 72430 67294 46691 53628 65192 21388 -51402 -9513 50166 13885 1306 -23355 -60863
11152f0863O0870Q8215J3124N551j9785K5593j1654l8674l7811J3724Q52k0706
11140A8436k0914n591q403M4482M0430q27k3355q815p493J089q235j0647J3572
11127B3729L789N0487J5642j9105j0857L7476J8298j5171j8897l9390m4427J0390
11115A1964J0350K1734K8829K0801L232K1926j6855j6045j1774Q847n4863j2290
11103A5856O631K0133Q905L0797l940p7564p326R809K8212k552k0219J5974N84
11090B5300j6521L926L0472L2970M7528K4543q953j8152j7725P43j490L0468m4626
11077H8483m9898j5851K0787Q690K409k1272j0295O4008N9567J1325J8585j1299
11065A65239m6851m0019j1693K8566l1756j5816O34K710J7519J129j9727k6782
$$ plain form
11152 -60863 7 88222 101346 106897 87112 112705 101051 62377 24566 38290 39142 18436
11140 18436 -2478 -8069 -16472 28010 68440 67613 44258 35443 27950 29039 20804 10157 23729
11127 23729 27518 78005 93647 74542 63685 101161 119459 104288 85391 46001 1574 11964
11115 11964 22314 44048 72877 93678 96910 118836 101981 85936 74162 83009 28146 15856
11103 15856 22487 42620 51525 82322 78382 818 -6508 3301 31513 28961 8742 24716 25300
11090 25300 8779 12705 43177 76147 123675 148218 139265 121113 103388 104131 102641 133109 88483
11077 88483 38585 22734 43521 52211 54620 33348 23053 87061 146628 157953 176538 165239
11065 165239 118388 78369 66676 95242 63486 47670 48304 51014 68533 69662 49935 23153
11053B3153k8108p802j6193j8915N2040J5164J1276N0951M7439K2369j1216n0329
11041H9829m7619m7632L4738K5022l8972J8957N134K3845k2497j6316k8920J4842
11029A0411J4288q205j3558J6861L2895j6841o4476j4897J6160N0507J2242K9642
11017F5029m762l4308l8326M4403Q0710L6806K2243K3142m8470n2563l3862M331
11005F4373m984R926J7561M1522l486j9495k4682l1007J2114J4998L0999j8020
10993H9819p8314n6586j4507J7507K7480K5993N5446k958l5293j5363J2426J8563
10981D4213p919r192n823K3209J2667K8820k0111p266o003L2041K8650K9785O777
10968A49848K54k609J1138q681Q574J2588O031k8960o2395j1472L9968K5159K1023
$$ plain form
11053 23153 -4955 -12757 -28950 -47865 4175 19339 30615 81566 129005 151374 140158 89829
11041 89829 42210 -5422 29316 54338 15366 34323 39457 63302 40805 24489 -4431 10411
11029 10411 24699 16494 2936 19797 52692 35851 -28625 -43522 -27362 23145 35387 65029
11017 65029 60267 25959 -12367 32036 112746 149552 171795 194937 146467 93904 60042 64373
11005 64373 59389 69315 86876 128398 124912 105417 80735 49728 61842 76840 107839 89819
10993 89819 11505 -45081 -59588 -42081 -14601 11392 66838 63880 28587 13224 25650 44213
10981 44213 36294 27102 21279 44488 57155 85975 65864 58598 52595 84636 113286 143071 149848
10968 149848 150102 147493 158631 149950 158524 171112 177143 148183 85788 74316 114284 139443 160466
10955A60466N8882P942l995N4338P6742P3030R2952J61811K87971M87738N95410
10944B053287M93787K88249k12252o98221n71811l37706j88650r2028r9268p2685
10934E62702n8274o9727k1116k0278j9973j7134k7123j9127n8018j4708k757k3734
10922B10733m4548K0539L9654L4380j2395j9397q48k2849L3499k6197n1914j0409
10910A50248K7980O3213N4255q836n8675m7268l6054J901J5496Q718j3902k7914
10898A29162J1241q366K629k5910n872J6480J1850J4856l8185l6318o607M0002
10886A04962K1668k1867K5293J9355l1303m113l2385j9288L0480M114j6409K1735
10874A02242M0093j6683L1270O857o582J5872m1906j3533K7027j8447l92K1694
$$ plain form
10955 160466 219348 227290 223295 277633 354375 427405 520357 682168 970139 1457877 2053287
10944 2053287 2547074 2835323 2623071 1924850 1353039 1015333 826683 734655 635387 562702
10934 562702 504428 434701 413585 393307 373334 356200 329077 309950 251932 237224 234467 210733
10922 210733 166185 186724 226378 260758 248363 228966 228118 205269 238768 212571 160657 150248
10910 150248 178228 241441 295696 286860 228185 180917 144863 146764 162260 170978 157076 129162
10898 129162 140403 132037 134666 108756 102884 119364 131214 146070 107885 71567 64960 104962
10886 104962 126630 104763 130056 149411 118108 113995 81610 62322 92802 96916 80507 102242
10874 102242 142335 125652 156922 163779 157197 173069 131163 117630 144657 126210 125818 147512
10862A47512K6452k9998l7808l5451L7356L3455l1167J3164J7913J5231j2550
10851A44109j4060j9696m9327n6434l4130oJ4810M0672O718J4585P671O964R115
10838G0991L4861r915j6858J5321K6420j1397K5871J4383j8241k9805j5720K4631
10826A10542J7057l2732m6591k0218N2250L4688J282M75l2199k51Q0980N2212
10814B17495R501k7869k2710k2783k7595r534j6541K5602K1735K6160L7884J8202
10802B29547p4986p7978L1453M5767J7613k6650l1251K5021K447j9664J6742M2486
10790A80547O0822J22702L2601p0466j00325K3173J04821J2814p5028m6511l6917
10779B08233J4021n9444m2329m1618J0948L8177M2177L5901K725n6462j7777j3180
$$ plain form
10862 147512 173964 143966 106158 70707 108063 141518 110351 123515 141428 156659 144109
10851 144109 130049 110353 61026 4592 -29538 -29544 -14734 25938 32656 47241 54912 61876 70991
10838 70991 105852 95937 79079 94400 120820 109423 135294 149677 131436 101631 85911 110542
10826 110542 127599 94867 48276 28058 80308 114996 116278 116753 84554 84303 165283 217495
10814 217495 226996 199127 176417 153634 126039 116505 99964 125566 147301 173461 211345 229547
10802 229547 154561 76583 108036 153803 171416 144766 113515 138536 140983 121319 138061 180547
10790 180547 241369 364071 396672 326206 225881 249054 353875 366689 291661 245150 208233
10779 208233 222254 162810 120481 78863 89811 127988 170165 206066 208791 152329 134552 121372
10767A21372K323M4944J6864n967K0585k539J8629l9200m733L190j1930J5613
10755A79151M7571J0676l2056l8867J9873J4285O1152R8159L4560j5871n9425
10744C19208r5831q3225n5178J896M0742P277M215j2587j4114N7342K5968m7454
10732A48259q165J6507q444P429J1435J3493N1072R4119K5920M3862N5654p650
10720D43491k742n8393r9900l9246M4435K4618n1811k591n116m776K6066p835
10708B66200L5359K0361J0867l1793K564L7080n1629K3400M8670k0890o6216K4879
10696B98852M7220L8001P744J6505N8067O4974M4878j326O22l8060p9117J6344
10684D74704l0942k2264j49j9544r943m6659n6321l2382j9287M1553J8626L9329
$$ plain form
10767 121372 123695 168639 185503 179536 200121 197582 216211 177011 172278 175468 163538 179151
10755 179151 226722 237398 205342 166475 186348 200633 261785 359944 394504 378633 319208
10744 319208 223377 140152 84974 86870 127612 134889 139104 126517 112403 169745 195713 148259
10732 148259 140094 156601 148157 155586 167021 180514 231586 325705 351625 395487 451141 443491
10720 443491 440749 382356 282456 243210 287645 312263 260452 257861 252745 247969 274035 266200
10708 266200 301559 321920 332787 300994 303558 340638 289009 312409 361079 340189 273973 298852
10696 298852 346072 384073 391817 408322 466389 531363 576241 574915 575537 537477 458360 474704
10684 474704 443762 421498 421349 401805 391862 345203 288882 256500 237213 278766 297392 336721
10672C36721J9097J4062j9286K1600R4594R0055J64160K32090L50202L41069K73574
10661A917938J89022M9548N3296J86301j48661l57433j72474n9906q1646j18773
10651A457212r3317l9784K0753J5895j2922K8482l781n2667m9264p9719l5179
10640A155709l6781q59r924m5465l6510L7441L154K8579N1691J1294l4247n537
10628A118545L7153m570j1156l6684n495L260O868m2541l2810K0078r217k4596
10616A018835l5300N0999P5709M1692L1274K0465L2625J7418l9694r513K6008
10605A230518j4136Q079J6722l552K6110N9557l8024k6312n2814l0746m927M6895
10593A217370N3641K9717J4421q759P171Q4383O4702O4263N6845O7765M5455P2469
$$ plain form
10672 336721 355818 369880 350594 372194 466788 556843 721003 953093 1303295 1644364 1917938
10661 1917938 2106960 2156508 2209804 2396105 2247444 1890011 1717537 1657631 1575985 1457212
10651 1457212 1363895 1324111 1344864 1360759 1347837 1376319 1372538 1319871 1270607 1190888 1155709
10640 1155709 1118928 1118069 1108145 1062680 1026170 1063611 1066765 1095344 1147035 1158329 1124082 1118545
10628 1118545 1155698 1151128 1139972 1103288 1097793 1101053 1107921 1065380 1032570 1052648 1043431 1018835
10616 1018835 983535 1034534 1110243 1151935 1183209 1203674 1236299 1253717 1214023 1204510 1230518
10605 1230518 1216382 1224461 1241183 1237631 1263741 1323298 1285274 1258962 1206148 1175402 1170475 1217370
10593 1217370 1271011 1300728 1315149 1306390 1313561 1397944 1462646 1526909 1583754 1651519 1696974 1769443
10581A769443N3013M5797P4508Q3708O4786J3090K1226P5525N0519O4453J42142
10570B458210J40374J32229J28302K20630K32373K22373K14855K22385L34844
10561D306575M16978N95782Q23173R88496R38789Q46444L87113j42721J6924M50708
10551I628261O97948J061963J502314J841640K322458K876029L493301M541439
10543B7965353O125355Q394024J1501948J7075662K7288117M5508375P4886711
10536B18745545J02962290J00722741P8068396K4583952j06794241j40963634
10530B77325049q7491489m8636848k8792973j8608700j3123463r800080p624630
10523F3246866o058103m975209m159161l581846l126523k694598k469977k156278
$$ plain form
10581 1769443 1822456 1868253 1942761 2026469 2091255 2104345 2125571 2201096 2251615 2316068 2458210
10570 2458210 2598584 2730813 2859115 3079745 3312118 3534491 3749346 3971731 4306575
10561 4306575 4723553 5319335 6142508 7131004 8069793 8916237 9303350 9160629 9177553 9628261
10551 9628261 10326209 11388172 12890486 14732126 17054584 19930613 23423914 27965353
10543 27965353 34090708 42484732 53986680 71062342 98350459 143858834 218745545
10536 218745545 321707835 422430576 500498972 525082924 418288683 277325049
10530 277325049 189833560 141196712 112403739 93795039 80671576 70871496 63246866
10523 63246866 57188763 52213554 48054393 44472547 41346024 38651426 36181449 34025171
10515C4025171j704207j300129r68579o09238l26022m36592o78485j259211j575377
10506B5167331j273107r98061q17948p52769o67649n92742m49939m24846l94161
10497A8796109m37238m87148n34063n76917o00760o66957n64763n62135n60067
10488A3806061m87258m38924l70674k82698k67354k27190k00142j77807k02475
10479A1151539k53030k93664k50071k93513l08205k67794k46957k27710k67194
10470H743401k34508j96215k54787k64364k22773j77780j46486j51222j41196
10461F954070j62300j67330j30524j31276j42828n3950m6738j08384j20998j48455
10451E741287j19468j24767j16189j37108j59899j55107j50675r8597q9925j04623
$$ plain form
10515 34025171 32320964 31020835 30052256 29443018 29116996 28680404 28001919 26742708 25167331
10506 25167331 23894224 22896163 22078215 21325446 20657797 20065055 19615116 19190270 18796109
10497 18796109 18358871 17871723 17337660 16760743 16159983 15493026 14928263 14366128 13806061
10488 13806061 13318803 12879879 12509205 12226507 11959153 11731963 11531821 11354014 11151539
10479 11151539 10898509 10604845 10354774 10061261 9753056 9485262 9238305 9010595 8743401
10470 8743401 8508893 8312678 8057891 7793527 7570754 7392974 7246488 7095266 6954070
10461 6954070 6791770 6624440 6493916 6362640 6219812 6165862 6119124 6010740 5889742 5741287
10451 5741287 5621819 5497052 5380863 5243755 5083856 4928749 4778074 4679477 4589552 4484929
10441D484929j40711j29044o0392k4746k2513j43736r5468p0892p1247l5750o3180
10430C627250p0741p5409o1750p7123q5482o7177m0527j7843j3178j8372k1430
10419C078218p05O682N1701J5847m954O2740J10934K13006N48880N14847J78444
10408D775640k6220j40772k16979l36791l49279k73546j02833o6016o8518o8396
10398C126290r3510j08759j24431j11833p9876J2888n3869l3509o7601o9980q3044
10387B312766j20799p2501n7498p7222p2084r0069n6847j00589j03105j27596
10377A434456l3068P7248M4733r060K3280m6170o2645J0015K4333l023J4207N929
10365A480235j1986p4371q6919m4825K728k4939k7872l2138j9255l006j5697R873
$$ plain form
10441 4484929 4344218 4215174 4154782 4130036 4107523 3963787 3868319 3797427 3726180 3690430 3627250
10430 3627250 3556509 3481100 3419350 3342227 3256745 3189568 3149041 3131198 3118020 3099648 3078218
10419 3078218 3077513 3084195 3135896 3151743 3146789 3209529 3320463 3533469 4082349 4597196 4775640
10408 4775640 4749420 4608648 4391669 4054878 3705599 3432053 3329220 3263204 3194686 3126290
10398 3126290 3032780 2924021 2799590 2687757 2607881 2620769 2566900 2533391 2465790 2395810 2312766
10387 2312766 2191967 2119466 2061968 1984746 1912662 1822593 1765746 1665157 1562052 1434456
10377 1434456 1401388 1478636 1523369 1514309 1537589 1491419 1428774 1438789 1463122 1460099 1474306 1480235
10365 1480235 1468249 1393878 1306959 1262134 1264862 1239923 1212051 1179913 1160658 1157652 1141955 1151828
10353A151828j8494n1737k8328j4894m6616o3572l3401q835n4966j13552O6231
10342G83664J20254P5426k4097m7320o579j3961n2330J6172L8849l2762j3641
10331H43675J3984J6091j8177l5670K0073O6335k1040l9437o3499o2701n3607
10320F66027k5378j4152L0586J8215l9653l3813l12l2290K6840R12n636j3233
10308E78113j7188n8511j2162L9991R658l0204J2637j859k582L64l9862k7451
10296D50944j7467j2280K762M1924Q152j382K2071l1414J4608o012M629J1693
10284D88228j5632l0877L1337J2081j5579m7879o9600j5862M4226m772l4432m0656
10272C00583M1604j2471p322k3846o5950J8065O646l428L799N682J2907k3305
$$ plain form
10353 1151828 1133334 1081597 1053269 1038375 991759 928187 894786 885951 830985 717433 783664
10342 783664 903918 979344 955247 907927 901348 887387 835057 851229 890078 857316 843675
10331 843675 857659 873750 855573 819903 839976 906311 885271 845834 782335 719634 666027
10320 666027 640649 626497 657083 675298 635645 601832 601520 569230 596070 596982 591346 578113
10308 578113 560925 502414 490252 530243 539901 509697 522334 520475 517893 518257 478395 450944
10296 450944 433477 421197 423959 465883 474035 472653 494724 463310 477918 471906 476535 488228
10284 488228 472596 441719 473056 485137 469558 421679 352079 336217 380443 375671 341239 300583
10272 300583 342187 329716 322394 298548 232598 250663 257309 253881 257680 263362 276269 252964
10260B52964k4004k1834K1918Q191J0824p987j5364J0424K3731M8890L3781l1445
10248C10089j453K8215k5305j8354m1941k3719K2997J0423n6312n4817J8422K8649
10236A96894j0924j5652L3875N427k0086K7403N2743N268k7039k8154k4146M4566
10224B40175J6742M2002K9201l3205m2968l7346l0156j7735l3255L2595j6756
10213A49294q0996M7866M8415K281m0460k6436L3921L639r047k090K0092k0802
10201A25677J4500k8821r932j4374M5386K655J4258r199Q366J0523q430j9785
10189A30824k3210j3570M1665L0796k2065l3313k2033k5446n634L269n482Q39
10177E6640J2675O436j6835K8516M0092L072R310k0624K3675Q661J7474j607m1462
$$ plain form
10260 252964 228960 207126 229044 237235 248059 240072 224708 235132 258863 307753 341534 310089
10248 310089 308636 336851 311546 293192 251251 227532 250529 260952 204640 149823 168245 196894
10236 196894 185970 170318 204193 209620 189534 216937 269680 274948 247909 219755 195609 240175
10224 240175 256917 298919 328120 294915 251947 214601 184445 166710 133455 166050 149294
10213 149294 68298 116164 164579 166860 126400 99964 133885 137524 128477 126387 146479 125677
10201 125677 140177 111356 101424 87050 132436 135091 149349 140150 148516 159039 150609 130824
10189 130824 107614 94044 135709 166505 144440 111127 89094 63648 58014 61283 55801 56640
10177 56640 69315 75751 58916 87432 127524 130596 139906 119282 142957 151618 169092 167485 126023
10164A26023m2713l0354J8768L6579J1019l1098J7420J9361O6341K2296j6629
10153A97013m1308j9184r753k7162l047J061k9221J8365J7572m8566N0267J8451
10141A24488l8156j7986L210L6460J4313m775J7072Q704M996J7468K0458p651
10129A78601L763J5668N6817P6562R8640J50030K06557M04260N30538N10842M06839
10118B639117J51187m83181p35310m96032l06033j36521o3413q7718q1724l3249
10108C67123n9793j5540k798k9807K1650J5563l8701j9931k4609m5448k2112K4198
10096A69795k0170n511P304M0222N3717m5445j6302K5062K0321m0919m7351l4260
10084A06463J0832l138k0021K5408K2584L5858j750j2650m135J2511k037J9150
$$ plain form
10164 126023 83310 52956 71724 108303 119322 88224 105644 125005 191346 213642 197013
10153 197013 155705 136521 126768 99606 96559 97620 68399 86764 104336 55770 106037 124488
10141 124488 86332 68346 71556 108016 122329 117554 134626 143330 148326 165794 186252 178601
10129 178601 182364 198032 254849 331411 430051 580081 786638 1190898 1721436 2232278 2639117
10118 2639117 2790304 2307123 1571813 1075781 769748 633227 569814 482096 400372 367123
10108 367123 307330 291790 288992 259185 280835 296398 257697 237766 213157 167709 145597 169795
10096 169795 149625 144114 151418 191640 245357 199912 183610 208672 228993 188074 140723 106463
10084 106463 117295 114157 94136 119544 142128 177986 176236 163586 159451 171962 169925 189075
10072A89075K8799n6152l3640O466K4307k6244m4995o569L0402m2634o012K291
10060F5094L7633j8168N829m623L6619L7986O164j2549j3006L531O9680Q59L5138
10047B50187p302o7215m5484j1777q871p002J5056q921j9646l5557j938k7655
10035B3875K0495M5328O311J508K0465J0537P924l0135J259k1137q137k5390K4907
10022G7810K8065l0380o27j5568K8169P271M985Q68l039j2542O994N062K9860
10009A26928m5740o8219K2444J2383K706K5502l5367k279M3182k3653l2908j0425
9997A4554j0459J8201J5250O299O8359J0646j1342L933l097m4923j6865P185L938
9984F1679n457N191O4435j8263k3397l6970K1648K7229o210m9732k7334j6619
$$ plain form
10072 189075 217874 161722 128082 134548 158855 132611 87616 81047 111449 68815 62803 65094
10060 65094 102727 84559 90388 85765 122384 160370 166534 153985 140979 144510 214190 215049 250187
10047 250187 242885 175670 130186 118409 109538 102536 117592 108671 89025 53468 51530 23875
10035 23875 44370 89698 96009 97517 117982 128519 136443 106308 107567 86430 78293 52903 77810
10022 77810 105875 75495 74868 59300 87469 94740 99725 100593 97554 85012 92006 97068 126928
10009 126928 81188 12969 35413 47796 50502 76004 40637 38358 81540 57887 24979 14554
9997 14554 4095 22296 37546 43845 112204 122850 111508 115441 112344 67421 50556 57741 61679
9984 61679 56222 61413 125848 107585 84188 47218 68866 96095 89885 40153 12819 -3800
9972c800K5018J2474P807l2184J8098J6316j8081M3413K3476L4691N6518k485
9960A81261p0610l0823k9955M1086J9566k4871N749J817J7923J9640l2537n2006
9948D6240J1679J6788K6089J3014J2685J340J9366L982n7887o4852j4220O628
9936B0852J4318l1263J196M7062L5317P3185j0120k0457j0307K462o751J2858
9924A28352k7626j8887n645j24r592L2776Q859K5528J8958n520L6614l7051j8717
9911A27925L0716k3144m163j3551m6737K962M1401r757m6729j8483l0877K9801
9899C9364M2556k8582r416L6580O2040J7851j8765J0480r082J2466J4732j6961
9887A53263r943K232k3166j5484j7849j0682j0518J7416j0745m863j917l0153
$$ plain form
9972 -3800 21218 33692 41499 9315 27413 43729 25648 69061 92537 127228 183746 181261
9960 181261 110651 79828 49873 90959 110525 85654 91403 93220 111143 130783 98246 46240
9948 46240 57919 74707 100796 113810 126495 127835 147201 151183 93296 28444 14224 20852
9936 20852 35170 3907 5103 52165 87482 160667 150547 130090 119783 122245 115494 128352
9924 128352 100726 81839 76194 76070 66478 99254 108113 133641 152599 147079 183693 146642 127925
9911 127925 158641 135497 131334 117783 71046 74008 115409 105652 58923 40440 9563 39364
9899 39364 81920 53338 43922 80502 142542 160393 141628 152108 143026 155492 170224 153263
9887 153263 143320 145552 122386 106902 89053 78371 67853 85269 74524 69661 67744 37591
9875C7591o756K4866l6234j2655m210M6594O7758k630m8870J0651O9327q230l446
9862A33756K7457l94J3974N443Q872j7869m2790k4717r212M7961N1503J9122l3121
9849A79985k3089n306m7214k8321R962j390O080k6613M6536K3891N2674L8050
9837B25245M00l4130n612l4922K4522k0703l773j7738k4039m5869k9597m858N401
9824C4327K6892M8731j2847p388K49M6202J9262j8998N587Q168m1751k4489m632
9811G9313K2048K2880j2231k1583K1274N777O656n1038L7797N746n2798l8021
9799B5820J8877M5993N1351k4209j648J1j4894k824l5014j5151M1791n48j3438
9786G6117l593m045J0391J6228k285Q370m9302o9943M3769N3965J4965P222K1837
$$ plain form
9875 37591 30835 55701 19467 6812 2602 49196 116954 114324 65454 76105 145432 137202 133756
9862 133756 161213 160819 174793 180236 189108 171239 128449 103732 94520 142481 193984 213106 179985
9849 179985 156896 151590 104376 76055 86017 84627 90707 64094 110630 134521 187195 225245
9837 225245 225645 191515 185903 150981 175503 154800 151027 133289 109250 63381 33784 28926 34327
9824 34327 61219 109950 97103 89715 89964 136166 155428 136430 142017 150185 108434 83945 79313
9811 79313 101361 124241 112010 90427 111701 117478 124134 73096 110893 116639 63841 25820
9799 25820 44697 90690 142041 117832 116184 116195 101301 98477 63463 48312 90103 89555 76117
9786 76117 72524 68479 78870 95098 92813 101183 51881 -18062 25707 79672 94637 101859 123696
9773A23696j7032R923K3264K4592o983J2461p028k9233j0623l6919k6265O767
9761F6620J5357K9745N7343p191o713l8558M804J2054l2970J2342n5696k3118
9749C4019M4410k0094n882l3390J5678M7788O453J1758Q31j8581q480K0000L0605
9736A25115L6129j0147n5323n4361k1162q732K3022L4046L1373J2524k4687N70
9724H8367K813j6100l0642P388J7730N254l4081M7412J9509j3001Q206O430M5663
9711A54948J9731m2546j2552L9192k311k5524K529o307K985J9131J7482K3306
9699A90064j6647k8052K1143J8588J2012l7854m0981J9059K4015L2986M295j48
9687A98480p048M364j3520J610N26l420j324N3m9723l8267K7695K1502j1071K1200
$$ plain form
9773 123696 106664 116587 139851 164443 157460 169921 162893 133660 123037 86118 59853 66620
9761 66620 81977 111722 169065 161874 155161 116603 121407 133461 100491 112833 57137 34019
9749 34019 78429 58335 52453 19063 34741 82529 88982 100740 101571 82990 74510 94510 125115
9736 125115 161244 151097 95774 41413 20251 11519 34541 68587 99960 112484 87797 88367
9724 88367 91180 75080 44438 51826 69556 74810 40729 88141 107650 94649 102855 109285 154948
9711 154948 174679 132133 119581 158773 156462 130938 133467 127160 130145 149276 166758 190064
9699 190064 173417 145365 166508 185096 197108 159254 118273 137332 161347 194333 198628 198480
9687 198480 191432 195796 182276 183886 184412 180992 179668 179721 129998 91731 119426 140928 129857 151057
9673A51057p642K6612L7352L3547J157q0976n1975l0221Q758J8136K0738O015
9661A32558J0897q5j8564N0801j929l4048Q603J8993Q54j2067N423m8252j9216
9648I3968J5164K1920K3069n4492k351L4800K3996k7988n0197N0056O0812n97
9636A88160K6468K1210n9116l9660K9357K2907L1828p672l4520R388j9048j4186
9624A55116j679k0672J9267J0751R72Q346j6313r075K3145K2376K0110P369J981
9611B21694J6690L0956O0765O910p0660l6451l8825k2140k5531J1835j1802O2047
9599B05488M7487l6035j7171K5052J7926M163k4795k8508m281O464r496L7034
9587B23328N5647L1656n5190j0914k2986k0192M2923L2871j121j9070l652j958
$$ plain form
9673 151057 143415 170027 207379 240926 242083 161107 109132 78911 87669 105805 126543 132558
9661 132558 143455 143370 124806 175607 173678 139630 148233 167226 168080 156013 161436 113184 93968
9648 93968 109132 131052 154121 99629 97278 132078 156074 128086 77889 127945 188757 188160
9636 188160 214628 235838 176722 137062 166419 189326 221154 213482 178962 188350 169302 155116
9624 155116 153437 132765 152032 162783 163755 172101 155788 146713 169858 192234 212344 219713 221694
9611 221694 238384 269340 330105 337015 266355 229904 191079 168939 143408 155243 143441 205488
9599 205488 252975 216940 199769 224821 242747 246910 222115 193607 189326 195790 186294 223328
9587 223328 278975 310631 255441 244527 221541 201349 244272 277143 276022 256952 253300 251342
9575B51342k137j9972m49J491m5658j8236r7J677J1006J1198P4954M1921j6006
9562B91034j940k5970N2j3830M3583N136l2909k1125j6103K6382j6206k0942N3797
9549B70959N227m8151J6902K4925n130k2628l563K0443J2021L5893K8307k179
9537C33026J2683k1289l2360k4541N0571J0694K5880J4697k4541l5108j3815P94
9525B96691j1444j4796j3684o163l0461K5602L3230J0278K6146L7429k0160k8439
9513C04229l7125l7986j5J5695K1433K6107L0534k6905J5057K4333M468j8020
9501C21805k3832J3352O4348L6225m3540q4538j3752L1699R800j4393J3844M0501
9489C51519M2986N467J939k7836l8710P298J0420J9233j6973J2344m1846L5963
$$ plain form
9575 251342 249205 229233 228784 230275 184617 166381 166284 167961 178967 190165 265119 307040 291034
9562 291034 289094 263124 263176 249346 292929 298065 265156 244031 227928 254310 238104 217162 270959
9549 270959 276186 228035 244937 269862 264732 242104 238541 258984 271005 306898 335205 333026
9537 333026 345709 324420 292060 267519 318090 328784 354664 369361 344820 309712 295897 296691
9525 296691 285247 270451 256767 250604 220143 245745 278975 289253 315399 352828 332668 304229
9513 304229 267104 229118 229103 244798 266231 292338 322872 295967 311024 335357 339825 321805
9501 321805 297973 311325 375673 411898 368358 283820 270068 301767 311567 297174 311018 351519
9489 351519 394505 399972 401911 374075 335365 342663 353083 372316 355343 367687 325841 361804
9477C61804K8573K6826k1701j7488j1956j410K9980P68Q858K519m7999L303j103
9464C60974P398j5763j4736k8465k026N5726n14J606l041p50J6579J0910j5949
9451C71949J5089l3373k8608J2239P031L0204L8882Q822l3708K0572l158j5934
9439C90007M387m0801r820O7612K1501k5897j0043q829L5935O033K2904k9731
9427D23258l1546J6884K5413L7136J1948j5318j3139p399k6484k0507m8377O0703
9415D12572J6051J1184R680j9335k1183k4335l7603L5584P4633M9254r39l1571
9403D73992M1759L1926k8055J9255j2320j0978l7026r140J7949O3593K3171k1010
9391E53116k6950k3701L3441J7057L4978N7037l2207p116p937K3511K7428M328
$$ plain form
9477 361804 390377 417203 395502 378014 366058 364648 394628 395396 404254 406773 358774 362077 360974
9464 360974 368372 352609 337873 309408 307382 363108 362594 364200 361159 360409 376988 387898 371949
9451 371949 387038 353665 325057 337296 344327 374531 413413 422235 388527 409099 405941 390007
9439 390007 394394 353593 343773 411385 432886 406989 396946 388117 424052 430085 452989 423258
9427 423258 391712 408596 434009 471145 483093 467775 454636 447237 420753 400246 351869 412572
9415 412572 428623 439807 449487 430152 408969 384634 347031 382615 457248 506502 505563 473992
9403 473992 515751 547677 519622 538877 526557 515579 478553 469413 487362 550955 574126 553116
9391 553116 526166 502465 535906 552963 587941 644978 612771 605655 597718 621229 648657 652985
9379F52985j2581J2744k0174o2606k7905M9886M5396q72l8684j6545K2506J3919
9367F18069k4803l2205L1460J9751L0015o334l2950l7538j9806J7789j592L3969
9355E95825M0862j6573k5903L9436K6548K8416M76n560k898Q735k272l1578k0026
9342F35488n822J6440K1606j1765m3261J4057J5491j2513j9029K2610j5778Q367
9330F25891J8040j8057J2975K5710j5968J7779M6385L8377k906o2814p5352k7748
9318E82312O0672K4231k0485K772K9060K3503q686R115M9686O840l7451m1129
9306F80440L8360J5835l8946q107K2770r722k4987J3395K9210M3816K1800k070
9294G81794m1635k6659J8275J3726J5217O8257K5094m9903j3154P292j8053k4965
$$ plain form
9379 652985 640404 653148 632974 570368 542463 592349 637745 636873 598189 581644 604150 618069
9367 618069 593266 561061 592521 612272 642287 635953 603003 565465 545659 563448 561856 595825
9355 595825 636687 620114 594211 633647 660195 688611 689087 683527 680629 689364 687092 655514 635488
9342 635488 629666 646106 667712 655947 612686 626743 642234 629721 610692 633302 617524 625891
9330 625891 643931 625874 638849 664559 648591 666370 712755 751132 748226 685412 610060 582312
9318 582312 642984 667215 646730 649502 678562 702065 693379 702494 752180 759020 721569 680440
9306 680440 718800 734635 695689 687582 710352 700630 675643 689038 718248 762064 783864 781794
9294 781794 740159 713500 731775 745501 760718 828975 854069 804166 791012 798304 780251 755286
9282G55286L2499K4018l99l8434J3079M4669J3636q413k8607o664N189j8817J3448
9269H00490m960J3611l7999J5144L0801k0092n9433j3494R211K5725j147j1555
9257G46302J6865K1864K0666j5290j0361j179j0820L4845J2552j1883k2459l0975
9245G50127l5707r953P0194K6603J4470K21j8074j3837P641L5623N342l3499p576
9232G91575R731k2525Q401M7675k5210k1565j1136N800L1273L1624j2289M647
9220H38001N502l2472r029J0461j2181l1298M0132L2400K554m9354J5766J3968
9208H24450P254r340K7344J1396l5133n2002o0628j3094O6284M7984j8831n0034
9196G45650P436q672J198L234J3427J0062l695n200L4509k1494o1465J8772L1241
$$ plain form
9282 755286 787785 811803 811404 772970 786049 830718 844354 835941 807334 800670 805859 787042 800490
9269 800490 795530 809141 771142 786286 817087 796995 737562 724068 733279 759004 757857 746302
9257 746302 763167 785031 805697 790407 780046 778867 768047 802892 815444 803561 781102 750127
9245 750127 714420 704467 774661 801264 815734 815955 797881 784044 791685 827308 832650 799151 791575
9232 791575 801306 778781 787182 834857 809647 788082 776946 782746 814019 845643 833354 838001
9220 838001 843503 811031 802002 812463 800282 768984 809116 841516 844070 794716 810482 824450
9208 824450 831704 822364 849708 861104 825971 773969 713341 700247 766531 814515 795684 745650
9196 745650 753086 744414 745612 748846 762273 772335 768640 763440 797949 776455 714990 733762 765003
9183G65003n209K0863K1522k7458l4809M5517J3816p2481k5261K0061Q1661L6044
9171H39269l8252j9588n221m79l9747l1835m1509L5864O516j007k6793l5759p709
9158F33750K1891L2671L5758k3772k4567j431N589j4305k0070j0483K1933R12
9146F57876Q546J0956k1714P09J4929K0496P091k5055J484k4711j6723o921l172
9133F23791k3863P445N676o292J8782r760J5823j1159K5448N4077j9244m2658
9121F38066k8976L2015j4418l8601J560L9258k79j2769m639k3459k5433q3k41
9108E62001n265K61L5882N5315j0382j5393m3844k5744q516j6567O0796N1509
9096F40053m1980n361K0633k638m1169k9729J6924N3961M881l1546l3302J121
$$ plain form
9183 765003 759794 780657 802179 774721 739912 785429 799245 726764 701503 721564 803225 839269
9171 839269 801017 781429 776208 775729 735982 704147 662638 698502 705018 704011 677218 641459 633750
9158 633750 655641 688312 724070 700298 675731 674300 679889 665584 645514 635031 656964 657876
9146 657876 666422 677378 655664 656373 671302 691798 698889 673834 675318 650607 633884 626963 623791
9133 623791 599928 607373 613049 606757 625539 615779 631602 620443 645891 699968 680724 638066
9121 638066 609090 641105 626687 588086 589646 628904 628625 615856 611217 587758 562325 562242 562001
9108 562001 556736 556997 592879 648194 637812 622419 578575 552831 544315 527748 588544 640053
9096 640053 598073 592712 613345 610707 569538 539809 556733 610694 615575 584029 550727 551848
9084E51848J2432J0207j0993O389j4200j0255l8602j1884J2545J8945K9928j2380
9072E43980r139q113j7520n14L7191L4093l1246k905q735k379J5142j0372j2654
9059E26829k0804j4765k6705j5175N0049J1850N223j0620m7667j5671L4435L6833
9047E13812k8331k7198o5677L5016J4319L1091q352M67K1554l1125p9399M7881
9035D24058K6020l9691K3271L9388j2019j630o695Q09K8895k1299j2338l3235
9023D15534l4366M003M9387J0762j239j0117N807k4648j821L5957J0547N271K1039
9010D86116n3515k7506R111k5980l2416K8061P513j3074L8498K869l175j979j6779
8997C97744n882M010n284l3285p426Q097r54j2227J563k3029m55l836m9826l5181
$$ plain form
9084 551848 564280 574487 563494 569883 555683 545428 506826 494942 507487 526432 556360 543980
9072 543980 534841 526728 509208 508694 545885 579978 548732 545827 537092 534713 549855 539483 526829
9059 526829 506025 491260 464555 449380 499429 511279 516502 505882 458215 442544 476979 513812
9047 513812 485481 458283 392606 427622 441941 473032 464680 465147 486701 455576 376177 424058
9035 424058 450078 410387 433658 473046 461027 459397 452702 453511 482406 461107 448769 415534
9023 415534 381168 385171 434558 445320 444081 433964 439771 415123 413302 449259 459806 465077 486116
9010 486116 432601 405095 414206 388226 355810 383871 391384 378310 416808 419677 416502 414523 397744
8997 397744 391862 395872 390588 357303 349877 357974 357020 344793 346356 323327 322872 319036 269210 234029
8983B34029M4389Q0436Q474l1665j2270J2479k6930r248K4147m732l231l5318
8971B80560j36L8335l697l2319j1697L2846j4282j2862J6385O8175o65k7376j3774
8958C19493m8525J077q903J760j4135M9087N0905k0882J7067j1681n0182k7136
8946B57945J1953P564m894M404L5967Q227j3310J11j4350O752P548K844j3771
8933B96990K944K01q639K3410m267m2380l4216l702l7240M171l1012n11L5219
8920B00968N4456l001n8568n0505L367N9733R819k2541l4310R738O1427M2650
8908B73233j316l8523l6584R454L8191N0038n470K2377m2469m9923Q558J9528
8896B47094K4075j5881n0598N4517L5169J4266k4436m7834j5918j5409k4145k7450
$$ plain form
8983 234029 278418 358854 367328 335663 323393 335872 308942 299694 323841 319109 315878 280560
8971 280560 280424 318759 315062 282743 271046 303892 289610 276748 293133 361308 360643 333267 319493
8958 319493 270968 272045 263142 264902 250767 299854 350759 329877 346944 335263 285081 257945
8946 257945 269898 277462 272568 276972 312939 321166 307856 307967 293617 300369 307917 310761 296990
8933 296990 299934 300135 291496 314906 310639 268259 234043 230341 193101 197272 166260 165749 200968
8920 200968 255424 252423 193855 143350 146717 206450 216269 193728 159418 169156 230583 273233
8908 273233 271917 233394 196810 206264 244455 294493 289023 311400 268931 219008 227566 247094
8896 247094 271169 255288 204690 259207 294376 308642 284206 236372 220454 205045 180900 153450
8884A53450k7361k6024K7040M5187l8476m7984K9791N5101j1786N6586J444m6221
8872A70747J5304N5414J6476k4671m2201l3698K1217K2022Q055L060K507O884
8860B21116p833k5608j5408m1687M874M8596k4199K1843K7524j5315K7179J3163
8848B34245l0400K4422K6184l1543K76r22J2719m2650j6217J322J7969k4890j5152
8835A55363j4237O26N547K4416n979k1818q559J6867j1464j0026p013L1837j075
8822A54485j5028J9009O964K9402O9563J2002j2094m4232k6195j391j339j8846
8810A72300Q802k0878j0956L5202K2572o0013l1324j5378L6338j8175l1029N0325
8798A37786P7916j0811j2516j622l8206J2968M0743j137n2455p3745J2373L5391
$$ plain form
8884 153450 126089 100065 127105 172292 133816 85832 115623 170724 158938 215524 216968 170747
8872 170747 186051 241465 257941 233270 191069 157371 178588 200610 208665 211725 214232 221116
8860 221116 213283 187675 172267 130580 135454 184050 159851 181694 209218 193903 221082 234245
8848 234245 203845 228267 254451 222908 223184 222262 234981 192331 176114 177436 195405 170515 155363
8835 155363 141126 141752 147299 171715 165736 143918 135359 152226 140762 130736 123723 155560 154485
8822 154485 139457 158466 165430 194832 264395 276397 264303 220071 193876 192485 191146 172300
8810 172300 181102 160224 149268 184470 207042 147029 115705 100327 136665 118490 87461 137786
8798 137786 215702 204891 192375 190753 152547 165515 206258 205121 152666 78921 91294 126685
8786A26685N2960r16K600J7229l1342N765J8486n5160l0098M1694J6288k0317
8774A43874l5362L809K2578k4408j7918m798M3372O3033l3045m4116j1030j9551
8762H6438l196n1265n4197J9518Q4665p716j4423m825J8090M0805o934R053j0172
8749A05841q744m973M894m997l7713k3265P618N573j4242M0177L0465K2272j4161
8736A08745M16j3965p955j4594J4757J6665L1915J3655q066l7556r048j7632L1512
8723A08849J8675J8302m4470j6350K8560j0881M4121L4401m3798k9991K158L4703
8711A44279k7564O685m763j1357O5084J1200L0239J7522o4987k9530J1064o8744
8699G9128j3180K4406j2897l5190j4716J2190J3622J3209j969l546L3802J5021
$$ plain form
8786 126685 179645 178729 181329 198558 167216 172981 191467 136307 106209 147903 164191 143874
8774 143874 108512 112321 134899 110491 92573 87775 131147 194180 161135 117019 105989 86438
8762 86438 83242 31977 -22220 -2702 81963 74247 59824 54999 73089 113894 106960 116013 105841
8749 105841 97097 92124 97018 92021 54308 31043 38661 44234 29992 70169 100634 122906 108745
8736 108745 109161 95196 87241 72647 87404 104069 135984 149639 141573 104017 94969 77337 108849
8723 108849 127524 145826 101356 85006 113566 102685 146806 181207 137409 107418 109576 144279
8711 144279 116715 123400 118637 107280 172364 183564 213803 231325 166338 136808 147872 79128
8699 79128 65948 90354 77457 42267 27551 39741 53363 66572 64603 61057 94859 109880
8687A09880K3187K0303j6248l9339j9950j8235M6464P293j3281J2552K1302Q246
8675A42174j4549m3181l0553R035O5066k564k3405j8064j9004J437J8190J6490
8663A01072K7621p691K9096L6034R46m6083L6092J4060m1862j677k8626j1164
8651A07818l4319L1164J1429l3267k81q290K339j0241J3961J6244m4007k4240
8639B8310M0424J6403k587j3784L4836M0473L2831J272p9517k3364k6128L3195
8627H2364M7638M281k9368j9558L1202L9777m2231j1464J1107K13l0168L8799
8615A22592J4250j2565K592k5306Q048r703k3467O221R156n283M2160m0119J7845
8602A06421L2333j1479O748K6381J2689M765n7730n01N1566O2402l226k0296L6509
$$ plain form
8687 109880 133067 153370 137122 97783 77833 59598 106062 113355 100074 112626 133928 142174
8675 142174 127625 84444 53891 62926 127992 125428 102023 83959 64955 66392 84582 101072
8663 101072 128693 121002 150098 186132 187078 140995 177087 191147 149285 147608 118982 107818
8651 107818 73499 104663 116092 82825 82544 74254 76593 66352 80313 96557 52550 28310
8639 28310 68734 85137 82550 68766 103602 144075 176906 178178 98661 75297 49169 82364
8627 82364 130002 134283 104915 85357 116559 156336 114105 102641 113748 113961 83793 122592
8615 122592 136842 124277 126869 101563 109611 99908 76441 82662 91818 86535 128695 88576 106421
8602 106421 138754 127275 134023 160404 173093 177858 120128 119627 171193 233595 230369 210073 246582
8589B46582J069k2727L6651J0265J7938J5157n9563m5557k1795m6075L6433N8049
8577B26427j79l1704l6762p811o173p924L3730J8032J3184m0199m7937P579l1530
8564H8733k8491j1230J7799Q35K8159j1054l4054n447J8829K3519j001K2023K1
8551A08641j3504r722J4009N13K2008N577R431l4581l3996q360Q264Q107R485
8538H5872p732J2657J1743M6824l7877m0016l0198M9240K8083j7001n9379k6585
8526A5631K3282L0638M112j0687r828k093J4690j2371m548P486J7362K6572K6714
8513A26960k754o7115j1415j297K8005K8470n135o926L2041J4192k434J626l5968
8500I8250L797J2296k0339j690L0160j7813j471k1759M680M7621m4834k4158j4999
$$ plain form
8589 246582 247651 224924 261575 271840 289778 304935 245372 199815 178020 131945 168378 226427
8577 226427 226248 194544 157782 149971 143798 135874 169604 187636 200820 160621 112684 120263 88733
8564 88733 60242 49012 66811 67646 95805 84751 50697 45250 64079 87598 86597 108620 108641
8551 108641 95137 85415 99424 99937 121945 127522 136953 102372 68376 60016 68280 76387 85872
8538 85872 78140 90797 102540 149364 111487 71471 41273 90513 118596 101595 42216 15631
8526 15631 38913 69551 73663 62976 53148 51055 65745 53374 48826 56312 73674 100246 126960
8513 126960 124206 57091 45676 44379 72384 100854 95719 88793 120834 135026 132592 134218 98250
8500 98250 102047 114343 94004 92314 122474 104661 103190 81431 86111 133732 88898 64740 49741
8487D9741K4015j6323m6047J0230M860n8051K1378J7723J237J2543p438J1118
8475B4986J406L7654K9967k2160l2136K3078k9864m2721J5492P7339J0892l8026
8463E5907o768J6043J0348k8454K7870K6186p282k9793N888Q527K1211R786j4648
8450I4821l5540o645o2179k0153j857J7114O1106K3344J4429m087k1243l9908
8438A9202k4882J7846j8353J8958K1475K6367m0014n3194M786K7983j0061o319
8426a6206J7407k0515R950j5001R917M4634m922K4152J2836M784k5305k1784q877
8413A1070q026K9737r649k4722k14o264k1481M2311J7982L6225j4078j648q297
8400D2946k0205K6603m306J6854n727m0707M558J8934J231J545J6362J0465n0814
$$ plain form
8487 49741 73756 57433 11386 21616 26476 -31575 -10197 7526 8763 21306 13868 24986
8475 24986 26392 64046 94013 71853 39717 62795 32931 -9790 5702 83041 93933 55907
8463 55907 49139 65182 75530 47076 74946 101132 93850 64057 69945 78472 99683 109469 94821
8450 94821 59281 52636 -9543 -29696 -31553 -14439 46667 70011 84440 80353 59110 19202
8438 19202 -5680 12166 -6187 12771 34246 60613 20599 -32595 -27809 174 -9887 -16206
8426 -16206 1201 -19314 -9364 -24365 -14448 30186 25264 49416 62252 67036 41731 19947 11070
8413 11070 3044 32781 23132 -1590 -1804 -8068 -29549 12762 30744 66969 52891 51243 42946
8400 42946 22741 49344 45038 61892 56165 15458 20016 38950 40181 41726 58088 68553 17739
8387A7739K1553M6374L199m3888j7833J6691K5611J5908m5957l8469K8958J2860
8375D2746M3927K4141j2218L861j7564k3744m5752k5037k3926L4284K4673M577
8363B9968r234l5775R376k867k4089K2447J8765M3167Q601m5012L660Q638J9928
8350D7573K2058k932J3358R824l0932p3223k6993K5537K0011l0740m277K1779
8338h957J1123J9854k757P854K3129J4931K1237m1155m4522k8571M671m540O09
8325b7094o570k119J066J7882M4905L285J8113L5073j0215k2722J194O831j8229
8312D1400j9413L6O8088J6744m5584m8484l9961m1245k9973J4269M151J0727M3768
8299b5477L2073K5229J4601L830l6589m9642L0728j308j7047J396K5656K1902
$$ plain form
8387 17739 39292 85666 88865 44977 27144 43835 69446 85354 39397 928 29886 42746
8375 42746 86673 110814 98596 102457 84893 61149 15397 -9640 -33566 718 25391 29968
8363 29968 20734 -15041 -5665 -8532 -32621 -10174 8591 51758 60359 15347 19007 27645 47573
8350 47573 69631 66699 80057 89881 58949 -14274 -41267 -15730 4281 -26459 -30736 -8957
8338 -8957 2166 22020 19263 27117 50246 65177 86414 45259 737 -27834 -23163 -27703 -27094
8325 -27094 -33664 -35783 -34717 -16835 28070 31355 49468 84541 74326 51604 52798 59629 41400
8312 41400 21987 22023 90111 106855 61271 12787 -27174 -68419 -98392 -84123 -79972 -69245 -25477
8299 -25477 6596 31825 46426 50256 13667 -35975 -5247 -6555 -23602 -22206 3450 25352
8287B5352l0779L4469J8595k0810J8476L6302N8133j1108k3314l5138l4015K2107
8275E8270k8264k1997K3615O598J9968k2372J6859M2552m533k7825Q558j3628
8263E7801J4415L3112n2665j1075N624K0076j304l4413K67L3974N999K620m46
8250G3985R371M7978P973K6261P722r130m6916J3930o435n2300N819n525k7072
8237D5661J0586k0590k0558j3047Q111l659k5902q328m5618J1461L9583L8453
8225A6153L2697L1718n515P593j3663k4119K5056j1636L188l8656n1116L5184
8213F884L8585p475r426K838J0817Q8025Q3396L682J1851L9326L0262k9871o8801
8200B00093n2310l6532j7019n9582j0402M3359J5062O937p950n6549Q511J3751
$$ plain form
8287 25352 -5427 29042 47637 26827 45303 81605 139738 128630 105316 70178 36163 58270
8275 58270 30006 8009 31624 38222 58190 35818 52677 95229 90696 62871 71429 57801
8263 57801 72216 105328 52663 41588 47212 67288 65984 31571 31838 65812 71811 74431 73985
8250 73985 83356 131334 139307 165568 173290 164160 117244 131174 124739 72439 78258 72733 45661
8237 45661 56247 35657 15099 2052 10163 6504 -19398 -27726 -73344 -61883 -22300 16153
8225 16153 48850 80568 75053 82646 68983 44864 69920 58284 61472 22816 -28300 6884
8213 6884 45469 37994 28568 31406 42223 130248 213644 217326 229177 268503 298765 268894 200093
8200 200093 147783 111251 94232 34650 24248 67607 82669 89606 81656 25107 33618 47369
8188D7369l0735J2412K0157L3343k6013k227r969L1242K704j19663n2892K8230
8176f6042N8095Q8755M7395r870k056m023m2702j8017J9764J3396R779k5539K8419
8163I7354K7546K595J0700K3152J8412l1377m1274J9542M727l6020j9245K5362
8151A01474r127k9013l6486j8979k5576m401r62K7568K9613K7958J2672j4024
8139F0717K5199J1892m9262K0272O4878q249j9170m1443k899j2899P065M44n690
8126E0855j8312k1131r554J7563J7290K900J4835J631J8953L0188Q541j952l8176
8113G3631j6210K245n354K6549m106j3405Q451k6219n9866L5862J7620m6610l339
8100a0751j4646k0440m294K3834M5230J5867k5957l9321k3974M843k3769J8041
$$ plain form
8188 47369 16634 29046 49203 82546 56533 54306 44337 75579 78283 -41380 -94272 -66042
8176 -66042 -7947 80808 128203 118333 116277 112254 69552 51535 71299 84695 94474 68935 97354
8163 97354 124900 127495 138195 161347 179759 148382 107108 126650 131377 95357 76112 101474
8151 101474 92347 63334 26848 7869 -17707 -22108 -23070 4498 34111 62069 74741 60717
8139 60717 85916 97808 48546 68818 133696 125447 106277 64834 61935 49036 56101 56545 50855
8126 50855 32543 11412 1858 19421 36711 39611 54446 56077 75030 105218 113759 111807 73631
8113 73631 57421 59666 54312 80861 76755 63350 71801 45582 -14284 21578 39198 -7412 -10751
8100 -10751 -25397 -45837 -50131 -26297 18933 34800 8843 -30478 -54452 -49609 -73378 -55337
8088e5337L6507J6051R666r103L6884J9692j723j9664P23K0553M235o6071M1438
8075C3851M0874k9734J02j0021k5153k2971p685L1755j0092k0100L381m0371j3687
8062f9851Q788M3098M3851j1163k3832J8948m003j2987J5134L355l064O768L1361
8049D6403k5287J8054n47k786p6227j4449N5701L9539j9443M740K690P288o368
8036B9308j3970J0452J7511J9797L908l3327m965J2291r595n928k8654J4707K4548
8023C6083n443O116R484M0456M6094n648p5864n4473o185k2539K5762N0939j5117
8010B9665k1666K4204k7368l3918l5159K3167O2566j0468k9415L2961q177J716
7998H108O688k3127k0309L5747N8231M1307R755k7082m6028j6645J0254L1285
$$ plain form
8088 -55337 -18830 -2779 6887 -2216 34668 54360 52637 32973 33696 54249 58484 -7587 33851
8075 33851 74725 44991 45093 35072 9919 -13052 -20737 11018 926 -19174 -15793 -56164 -69851
8062 -69851 -61063 -17965 25886 14723 -9109 9839 5836 -7151 7983 11338 8274 15042 46403
8049 46403 21116 39170 38623 35837 -40390 -54839 862 40401 20958 25698 28388 35676 29308
8036 29308 15338 25790 43301 63098 67006 33679 28714 41005 31410 25482 -3172 11535 36083
8023 36083 30640 36756 46240 86696 132790 127142 51278 -3195 -9380 -31919 -6157 44782 29665
8010 29665 7999 32203 4835 -29083 -64242 -41075 21491 11023 -18392 14569 6392 8108
7998 8108 14796 -8331 -28640 7107 65338 106645 116400 89318 43290 26645 36899 68184
7986F8184K1283J4222m7381n0217m3790p0J6102N6344L0625j5189o1470R404J3078
7973A1125P5049J9941l9186j9709l4748m255J2452J9805k2747m4027k6913J4773
7961c8440L5924J2310L6101J0891k0176n557k2623Q658J8484M3410k2877k6724
7949B9381P430k0093J5040J6937k3651n7685k970N0320M6626m7054o138Q407p692
7936H858M306o842k54L59J040N7941L3590j6593k8328k0358P554J0981l7640N386
7922B0000M580l1957K311L6708J563P791M7317m9792m0069K6669q369k4319l1218
7909c8785K7800L0436k7665n694k3151M9023M2466J3900l3357j748M384p874k2819
7896F916l102K5526J8433k4549k0322k0287l0939L3841M1965l8776j7800l393
$$ plain form
7986 68184 89467 103689 56308 6091 -37699 -37769 -21667 34677 65302 50113 -11357 -1953 11125
7973 11125 86174 106115 66929 47220 12472 8217 20669 40474 17727 -26300 -53213 -38440
7961 -38440 -2516 9794 45895 56786 36610 31053 8430 17088 35572 78982 56105 29381
7949 29381 36811 16718 31758 48695 25044 -32641 -35611 14709 61335 14281 8143 16550 8858
7936 8858 13164 6322 6068 6427 7467 65408 98998 82405 54077 33719 41273 52254 14614 20000
7922 20000 24580 -7377 -5066 31642 33205 40996 88313 38521 -1548 25121 16752 -7567 -38785
7909 -38785 -10985 19451 -8214 -13908 -37059 11964 54430 68330 34973 33225 37609 29735 6916
7896 6916 3814 29340 47773 23224 2902 -17385 -48324 -14483 27482 -11294 -29094 -32487
7884c2487K4584J107K2310J807J0308L2877m0336J8607L612m7787j3188K2343
7872C757J8094k7921l5527K1414O719N6542J3483k7849n6200J3210L7726Q764
7860C2212j3880m179o96K5255M4451l7337q104j3013n0347J4308K7477J8813m7426
7847a2466J2875J9142J783k576l2583l5523r852J4248J8740J3794N0261M5425
7835H3268M280j2181l6558j3637R024k2594q031M5712j2487n2213L1304J5237
7823C1124k082l0539L8838j7013l9960O219L7112K6847k9397N578J8699j8565
7811B6861k5068o2915P287J5888L7585J4709Q975K2480l5760j2839M6524Q490
7799E2217J1729o908n0877o39M020r172k6278P794J1805L5302j2846m0081K8336
$$ plain form
7884 -32487 -7903 -6796 15514 17321 27629 60506 20170 38777 42389 -5398 -18586 3757
7872 3757 21851 -6070 -41597 -20183 -13464 43078 56561 28712 -27488 -14278 23448 32212
7860 32212 18332 14153 13457 38712 83163 45826 37722 24709 -25638 -11330 16147 34960 -12466
7847 -12466 409 19551 21334 18758 -13825 -49348 -59200 -44952 -26212 -12418 37843 83268
7835 83268 87548 75367 38809 25172 34196 11602 3571 49283 36796 -15417 15887 31124
7823 31124 29042 -1497 37341 20328 -19632 -13413 23699 50546 21149 26727 45426 26861
7811 26861 1793 -61122 -53835 -37947 -362 14347 23322 45802 10042 -2797 43727 52217
7799 52217 63946 57038 6161 5522 9542 370 -25908 -18114 -6309 28993 16147 -23934 4402
7786D402L3868K3866k5243l499L1388P536m334n4730J46K2063l6843m9463J8982
7773c1861M9773k1810k7139P010L9713O810j3542l1780j5956M1644k4941j6187
7761c8266K8670k0910m353L6682P610O818O668Q802L9818m336J5596o299j3073
7748F3427l3690j2310M1890k0999m2279k0863K6376O1637M1187k2170k566Q476
7736H8116j3717j012l9816p6745j6028Q37J2327n0221J5806K8730J2175j9648
7724e9196J1543L6092J6453J5352M194r014j7112N65p510l7768N807R163P1145
7711C9714L8804J2186k9140m6323l0423p553l8722N220K3172J52j8358K4462Q294
7698a8515K6893k1107o777L4339J0851o576K1072J7057j6443j4895l2048p179
$$ plain form
7786 4402 38270 62136 36893 33394 64782 72318 67984 13254 13400 35463 -1380 -50843 -31861
7773 -31861 17912 -3898 -31037 -24027 15686 22496 8954 -22826 -38782 2862 -22079 -38266
7761 -38266 -9596 -30506 -34859 1823 9433 16251 22919 31721 71539 67203 82799 76500 63427
7748 63427 29737 17427 59317 38318 -3961 -24824 1552 63189 104376 82206 79640 88116
7736 88116 74399 73387 33571 -43174 -59202 -58365 -46038 -96259 -80453 -51723 -39548 -59196
7724 -59196 -47653 -11561 4892 20244 24438 15424 -1688 -1123 -8633 -46401 -40594 -31431 39714
7711 39714 78518 90704 61564 15241 -15182 -22735 -61457 -56237 -33065 -32913 -51271 -26809 -18515
7698 -18515 8378 -12729 -19506 14833 25684 19108 40180 57237 40794 25899 -6149 -13328
7686a3328J655J404j5862k3150k6981j1559L1792K5275J2440L8644L1091m1861
7674I560l980M1597J7186k6269o7221l5905J5188J9298j381n6688P475N8806N574
7661a6760J7008J1674j4788n560l6903k5117N0881L5426K6766n2284o2136l3113
7649a04906K9652J9304J1808K0240p786l5615P5964M6935k1180n4304q805K0402
7637h291J9629j5668L983L2049j9500l0103l352L3792k091l7245l0012J5103J9575
7624b2131K3372k6516K0223R611j3132q970j0757L2591m8913j9681L6606K9189
7612A492j2661L968K7264J4565m9115l0078L8458O8307n775l4374l7931J9075
7600C195j866J3965j1558j4714Q232L8653J0233j3959m8858j8181j273n724j9928
$$ plain form
7686 -13328 -11673 -10269 -26131 -49281 -76262 -87821 -56029 -30754 -18314 20330 51421 9560
7674 9560 5580 47177 64363 38094 -29127 -65032 -49844 -30546 -31927 -88615 -81140 -22334 -16760
7661 -16760 248 11922 -2866 -8426 -45329 -70446 -19565 15861 42627 -9657 -71793 -104906
7649 -104906 -75254 -55950 -44142 -23902 -31688 -67303 8661 55596 34416 -19888 -28693 -8291
7637 -8291 11338 -4330 -347 31702 12202 -17901 -21253 12539 10448 -26797 -56809 -41706 -22131
7624 -22131 1241 -25275 -5052 4559 -8573 -17543 -28300 4291 -44622 -64303 -27697 1492
7612 1492 -11169 -7201 20063 34628 -14487 -44565 -6107 62200 56425 22051 -15880 3195
7600 3195 1329 15294 3736 -10978 -2746 35907 46140 32181 -16677 -34858 -36131 -41855 -61783
7587f1783L3682L5315o320j8405j3458J4784p755j3114L1676L7064j6911p642
7575G133n3860J3300o62M4902J5813l5153J962J0865K2499K5940j2577k5054J2227
7562B7335L5743k4222m7268n5049j6913p168K5871K7182K4904L7121l1736K5492
7550B1292L2625J7808o523K7133j0867k4761j0018M4463p4814m1796k1647j819
7538d8924J7331J6724K6808K6884J2320k8898L220J8330L510L332j1587k4564
7526A4486k7122j6107k2527j004L6930O681n817L847j9375m182M0566N0703M451
7513F1530k356k8802j8663l5658l380j0360j5757L484J9529L3946L512k0189K8301
7500A5137K0062j8918l9825L085l4695j434N310j9463J5464L5613L8814k2812
$$ plain form
7587 -61783 -28101 7214 894 -17511 -30969 -16185 -23940 -37054 -5378 31686 14775 7133
7575 7133 -46727 -33427 -34089 10813 26626 -8527 -6565 4300 26799 52739 40162 15108 27335
7562 27335 63078 38856 -8412 -63461 -80374 -87542 -61671 -34489 -9585 27536 -4200 21292
7550 21292 53917 71725 65202 92335 81468 56707 46689 91152 16338 -25458 -47105 -48924
7538 -48924 -31593 -14869 11939 38823 51143 22245 25465 43795 47305 50637 39050 14486
7526 14486 -12636 -28743 -51270 -52274 -15344 -8663 -14480 -10633 -30008 -34190 6376 57079 61530
7513 61530 59174 30372 11709 -23949 -27329 -37689 -53446 -49962 -30433 3513 7025 -13164 15137
7500 15137 35199 16281 -23544 -20459 -55154 -56588 -51278 -70741 -55277 -19664 19150 -3662
7488c662j8674m520R682J1560L6858j1079L8238r875k7442j9116o671L1379j257
7475B5421j7740J9712M900l5335m3384J714l0581k4696Q366Q045N320K0021N0071
7462h166K1310k1125j0694L1526j4972k1922k6162K3417L2040M455l1565J1062
7450a0796L6868j7369n790j5097j5332J4018K2292J4927n8812L5686L1253k52
7438C1596l6726m8606L2383N3054j7410j3153J39K4401M2366j5687l5547j8583
7426a773j427j943R351L5088l11m0022n4624L4771l902k0910K552J1197p003K6331
7412a2625K1884K5771j5905N370j5863m0409k488q949n539j2626J4551P580j1449
7399e0697K1111m85j1324j0025O233j0699l371k4947j2898j383k11J8837p915
$$ plain form
7488 -3662 -22336 -26856 -17174 -5614 31244 20165 58403 48528 21086 1970 -4701 26678 25421
7475 25421 7681 27393 32293 -3042 -46426 -44712 -75293 -99989 -91623 -83578 -78258 -58237 -8166
7462 -8166 13144 -7981 -18675 12851 -2121 -24043 -50205 -26788 5252 9707 -21858 -10796
7450 -10796 26072 8703 2913 -12184 -27516 -13498 8794 23721 -35091 595 31848 31596
7438 31596 -5130 -53736 -21353 31701 14291 1138 1277 25678 68044 52357 16810 -1773
7426 -1773 -3200 -5143 4208 39296 38985 -1037 -55661 -20890 -24792 -45702 -43150 -31953 -38956 -12625
7412 -12625 9259 35030 19125 24495 8632 -31777 -34265 -43214 -48753 -61379 -46828 -39248 -50697
7399 -50697 -29586 -30071 -41395 -51420 -45187 -55886 -59257 -84204 -97102 -98485 -98696 -79859 -87774
7386h7774J7567j0315p531j3708j8524L5967L8980N5689j6468m2948P401j0521
7374e2185J4235l930J8074L6671R005J5375j3138m9041m294K9605O8881Q076J2100
7361H9434o4991l8174L2695L9852r794o1275J595j0675N621j1570j6444j2613
7349e6339r343L8268O7774m4522l7291L7092L1914O891R289k6870R138K3295r537
7336C9759m4306l2409j4301J3090Q787k9087q104j2381R143N8528N8746k497K5727
7323G0695N159j3507J4307L7840n2815p2178j3887N0183K776Q76k9364n7779J3749
7310d3945K7420k2283m416L2216M4971K9258K770m6427q5224J5913L2141L3997
7298A6391J692j9010J4312J2447k7738P820k8652j2463L0167J9022J6973J2529
$$ plain form
7386 -87774 -70207 -80522 -88053 -101761 -120285 -84318 -45338 10351 -6117 -49065 -41664 -52185
7374 -52185 -37950 -41880 -23806 12865 21870 37245 24107 -24934 -29228 377 69258 77334 89434
7361 89434 24443 -13731 18964 58816 49022 -12253 -10658 -21333 -15712 -27282 -43726 -56339
7349 -56339 -65682 -27414 40360 -4162 -41453 -4361 27553 34444 43733 16863 26001 49296 39759
7336 39759 -4547 -36956 -51257 -38167 -29380 -58467 -66571 -78952 -69809 -11281 47465 44968 70695
7323 70695 75854 62347 76654 114494 61679 -10499 -24386 25797 28573 29449 85 -57694 -43945
7310 -43945 -16525 -38808 -43224 -11008 33963 63221 65991 19564 -65660 -49747 -17606 16391
7298 16391 18083 -927 13385 25832 -1906 5914 -22738 -35201 -5034 13988 30961 43490
7286D3490n9173j3668J5582L231J6678Q067J2981N3449J20m0284l0267j2873N4925
7273E2258N253j7601j60K9562M748j2414o346j1354j7392q253k0562r359J6083
7260D463L0427j2773k5231J4085L7554K3883j6829K4337N0120l897k0316j0846
7248I4977n4286j8642k0583l1479O891J0419j2092K8259K739j2539J9266j6414
7236c484j1063j2437j3003O714K4813L8015j9853L291m4382k792m0898m2394o377
7223a23850J9441K998N2566M6013J0986R659L1219l6816k9380j6960j8503J5538
7211c7089J5617k0846N8024N756l0803K0935K7579j6198J4448J2802l8634j4292
7199b701l6498K3482k2459k3984J7232K6041l8809k58J7895M141j008j3493m0823
$$ plain form
7286 43490 -15683 -29351 -13769 -10538 6140 14207 27188 80637 80757 40473 10206 -2667 52258
7273 52258 57511 39910 39750 69312 74060 61646 55300 43946 26554 18301 -2261 -11620 4463
7260 4463 34890 22117 -3114 10971 48525 72408 55579 79916 130036 126139 105823 94977
7248 94977 40691 22049 1466 -30013 -23122 -12703 -24795 3464 6203 -6336 12930 -3484
7236 -3484 -14547 -26984 -39987 -33273 -8460 29555 9702 12993 -31389 -34181 -75079 -117473 -123850
7223 -123850 -104409 -101411 -48845 -2832 8154 17813 49032 12216 -17164 -34124 -52627 -37089
7211 -37089 -21472 -42318 15706 21462 -9341 11594 39173 22975 37423 50225 11591 -2701
7199 -2701 -39199 -15717 -38176 -62160 -44928 -18887 -57696 -57954 -40059 -35918 -36926 -50419 -91242
7186i1242J0880n517l30L3327K0976N446K4293Q79J339L8783J1737m804o629o4786
7172b5648k2563J9181k737K294N1j2419m3561L8655J2883l3426k0709k273K7623
7159f2649N1447j6835J1621J9842k847l2561N845K1774K7880K7174j2646o9965
7147c1920P303k7137L0130L7115j0973n8390k2241K652r454K4230K5102J7489
7135a6094J6594L8013j07641m2320M7742J9738j8545k5564J3606l3320J3082L7210
7123e7499k372J8016J2147m4K1291J282Q954n070j4288r881J1699K5191m4824
7110c5398k018k5016q758j1719J3020L3567L1043L795L6683m1893J7528k3518
7098a2684J100O179p603K7481K6975k7004J1878l258R970j6356o766l4790l3612
$$ plain form
7186 -91242 -80362 -85879 -86209 -52882 -31906 -26460 -2167 -1288 51 38834 50571 45767 39138 -25648
7172 -25648 -48211 -29030 -31767 -29473 -29422 -41841 -85402 -46747 -33864 -67290 -87999 -90272 -62649
7159 -62649 -11202 -28037 -16416 3426 579 -31982 -26137 -4363 23517 50691 38045 -31920
7147 -31920 -24617 -51754 -21624 15491 4518 -53872 -76113 -73461 -82915 -58685 -33583 -16094
7135 -16094 500 38513 -69128 -111448 -63706 -43968 -62513 -88077 -74471 -107791 -94709 -57499
7123 -57499 -59871 -41855 -29708 -29752 -8461 -7179 1775 -3295 -17583 -27464 -15765 9426 -35398
7110 -35398 -37416 -62432 -71190 -82909 -69889 -36322 -5279 -1484 35199 -6694 10834 -12684
7098 -12684 -11584 -5405 -13008 14473 41448 14444 26322 23064 33034 16678 9912 -24878 -58490
7085e8490M7192l5279j0278k4037K1953M6388O0639l305l2787k8380o071L3772
7073A1317L6168l0843r208k2091p208n59J0898J8139m53n51Q038J3188l0601L643
7059a23Q292j3531M801O6088K4555r117k7885k8906l8175k8731l69j1096J9661
7046c4536M2220j7364j52j4546M1888J1401O325J3340k151j1723k6472L513K6204
7033C7947m5684l6446L28J7651j0888n0214L4480L2168K6089K9301j4035j3781
7021F916M774k109k8233j6658O807K7940k3811K534J8761J4040K2991n0447m0058
7008e6553j4944L6983J5061J9028K0813k1958M789Q185n268r708l772l2870l0379
6995g0593p692K6409M083J0931M3754O781o886j6840M4603K6577j5065n6741R09
$$ plain form
7085 -58490 -11298 -46577 -56855 -80892 -58939 -12551 48088 44783 11996 -16384 -22455 11317
7073 11317 47485 16642 7434 -14657 -21865 -22424 -11526 6613 6160 5609 13647 26835 -3766 -123
7059 -123 8169 -5362 -561 65527 90082 80965 53080 24174 -14001 -42732 -43101 -54197 -34536
7046 -34536 7684 -9680 -9832 -24378 17510 28911 35236 48576 46425 34702 8230 11743 37947
7033 37947 -7737 -44183 -43855 -26204 -37092 -87306 -52826 -20658 5431 34732 20697 6916
7021 6916 11690 9581 -18652 -35310 -28503 -563 -24374 -21840 -3079 10961 33952 -16495 -56553
7008 -56553 -71497 -34514 -19453 -425 20388 -1570 3219 11404 6136 -3572 -7344 -40214 -70593
6995 -70593 -78285 -51876 -47793 -36862 6892 13673 6787 -10053 34550 61127 46062 -10679 -9770
6982i770L4424l2368N798K2217l4497j8134J8600j4453L0427M7538l3303k2538
6970f059J1089J2463L5469J5293n8720K4997L587j7039K085j7281l5701p652M7613
6957A0144l903j9008K1509j6732j8909K6997J247j7375k3023r271L8104j5533
6945b5753K4123n792J7279O639l014k4942R032q368P171K2702J452m0895q469
6932b8835l0723j2400J8542k5874J930J0435J9562J8881K480k792j6142m286J1402
6919c7820j8946m3955K9695L2784P352k0871R406J1097J9805O4189R106m9212
6907A2630r074l9043l121k255M365J3090J3506j5227j6764j8961K6380P851L9874
6894A3251K887j881l6489l5117n412L4613M0089m1812j186j8266j2226K2665L1431
$$ plain form
6982 -9770 24654 -7714 -1916 20301 -14196 -32330 -13730 -28183 2244 49782 16479 -6059
6970 -6059 5030 17493 52962 68255 9535 34532 38119 21080 23165 5884 -29817 -37469 10144
6957 10144 6241 -12767 8742 -7990 -26899 98 1345 -16030 -39053 -48324 -10220 -25753
6945 -25753 -1630 -7422 9857 16496 13482 -11460 -2428 -10796 -3625 19077 20529 -20366 -28835
6932 -28835 -59558 -71958 -53416 -79290 -77360 -66925 -47363 -28482 -26002 -28794 -44936 -49222 -37820
6919 -37820 -56766 -100721 -71026 -38242 -30890 -51761 -42355 -31258 -11453 52736 61842 12630
6907 12630 3556 -35487 -38608 -40863 -36498 -23408 -9902 -25129 -41893 -60854 -34474 -26623 13251
6894 13251 16138 14257 -22232 -57349 -62761 -28148 11941 -29871 -31057 -49323 -61549 -38884 -7453
6881g453J8384K1084l2015k2767O165N4844k2074m2229K0944K1484k8253l0400
6869d2286K2437J980l9349P769J6945j460K2918j3373j8779O267J460k2137l041
6856f0649J2493L3056O9768k25l8269J3863p834k2483j1334r454K9367j3980m2024
6843d7705j1921M6706L5361J3725j4641L494j2431m2109J1111M1612k0399k7748
6831b4945l3608P459K0760L6608m743L7217J6303P743l9331o0458k0189K5353
6819c1831L0809L573K7719M0467P659k414K716l7536j5038k0015O251N789Q661
6806B6810n285n6912k0813K3236J1703O621R284l6076n162N273L8375L2353q136
6793B1271J971j4965j7972K3528m872l6852n71K9972M0789k3166l3684K5459K4669
$$ plain form
6881 -7453 10931 32015 0 -22767 -16602 38242 16168 -26061 -5117 16367 -11886 -42286
6869 -42286 -19849 -17869 -57218 -49449 -32504 -33964 -11046 -24419 -43198 -36931 -35471 -57608 -60649
6856 -60649 -48156 -15100 54668 54443 16174 30037 22203 -280 -11614 -21068 8299 -5681 -47705
6843 -47705 -59626 -12920 22441 36166 21525 25019 12588 -29521 -18410 23202 2803 -24945
6831 -24945 -58553 -51094 -30334 6274 1531 38748 55051 62794 23463 -36995 -57184 -31831
6819 -31831 -1022 2551 30270 70737 78396 75982 78698 41162 26124 6109 12360 18149 26810
6806 26810 21525 -35387 -56200 -32964 -21261 -14640 -5356 -41432 -46594 -41321 -2946 29407 21271
6793 21271 23242 8277 -9695 13833 8961 -27891 -28462 1510 42299 19133 -14551 10908 35577
6780C5577l545l5797k2870k3531k491K259L363k2077M99M0026Q451l6263L5214
6767b1185J8187L0891Q871L0382J4181k1391m5215j1495J5877r105k4611m5158
6755e9771N409N3365J5392M963K6272J1077n586m3830o034p52j20M046J3029J5187
6741C2647p010j1454k8201k2143m119l2132l064P2233O2302j869j2924j1521l0319
6728B426J389j7020j8866L2927Q396j6933j1256R798j39N829J9434l739m4629
6715c2383m601j3205l1016N0577J5322l190J0297m153M567l471o047K5725L9889
6702D8311K9139P8k3302j8893n0896o822p359M3605n077l7197O728L6947k1074
6689e812J0210R227K5354m793l8427K130J3231m0038j6414k9022K956K7540L827
$$ plain form
6780 35577 32032 -3765 -26635 -50166 -52657 -50398 -47035 -69112 -68613 -28587 -20136 -56399 -21185
6767 -21185 -2998 27893 36764 67146 81327 59936 14721 3226 19103 9998 -14613 -59771
6755 -59771 -54362 -997 14395 19358 45630 56707 51121 7291 1257 505 385 4431 17460 32647
6741 32647 25637 14183 -14018 -36161 -40280 -72412 -75476 -3243 59059 57190 44266 32745 2426
6728 2426 3815 -13205 -32071 856 9252 -7681 -18937 -9139 -9278 -3449 15985 12246 -32383
6715 -32383 -36984 -50189 -81205 -30628 -15306 -18496 -8199 -12352 -7785 -11256 -17303 8422 48311
6702 48311 77450 77528 54226 35333 -15563 -22385 -29744 13861 8784 -28413 -21685 15262 -5812
6689 -5812 4398 13625 38979 34186 -4241 -2111 11120 -28918 -45332 -74354 -71398 -43858 -40031
6676d0031J0735K4281l1066j0674K5476M644n732q328J8959M3226J9412j2684
6664C8218k2464j8123K7913R529j1905l7559n203K0472N1079J6025j8975l749
6652D5258q612l8293j1927j6702j5208q225k6828k6971k2513J4825K8739n035
6640i1492O1535K1908J6298n332J5259l2915m4222M8033j1550l1572l509J5814
6628d1745K7474l1623k3926P7723L6521j5745l5104j2637k0091K82j5215L2138
6616b1948M6136R993q578m398J5735J3238m0j9124o9168j9173J06073K2537J5351
6603H6634L919j6704o2160q985L1003j2748l6217K457K0658j2432l0704J5807
6591a9472L1614J1121k7707k7412j7848J0604J1571J5772L2875k5664n1j5955
$$ plain form
6676 -40031 -29296 -5015 -36081 -46755 -21279 -16635 -22367 -30695 -11736 31490 50902 38218
6664 38218 15754 -2369 25544 35073 23168 -14391 -19594 878 51957 67982 49007 45258
6652 45258 36646 -1647 -13574 -30276 -45484 -53709 -80537 -107508 -130021 -115196 -86457 -91492
6640 -91492 -29957 -8049 8249 2917 18176 -14739 -58961 -10928 -22478 -54050 -57559 -41745
6628 -41745 -14271 -45894 -69820 7903 44424 28679 -6425 -19062 -39153 -38871 -54086 -21948
6616 -21948 24188 34181 25603 21205 36940 50178 50138 31014 -38154 -57327 48746 71283 86634
6603 86634 90553 73849 11689 2704 33707 20959 -15258 -12801 7857 -4575 -35279 -19472
6591 -19472 12142 23263 -4444 -31856 -49704 -39100 -27529 -11757 21118 -4546 -4597 -20552
6579b0552L4593J3847j7943L937L4664j7307l9076j6518K5907J1180k3063L0037
6567A9706p832P06N230L5852j408m3484m9424r223L2002J2978j8675j1214k0406
6554e5192j8657J2829Q837N3226J1821k6974J0851L5785j2801J9774m4681m2042
6542d7224K7141L1185r839o065o225L2917R899k4094q275k4686J6547O204J8326
6529A5811K4725k7170q399k6568L804k2417j4092L259L5674J07R233q238m308
6516a8579n507m321j4955q380j4999j3223M2457M2180M4935J2643P673k965J369
6503F8328j603k1460j9431q185J3579L9270m040l2399l3765k880k6019j8310J1617
6490c5298M0312N1058K2646j5283j2549k4441k3175j9723N997m3718N9135N0918
$$ plain form
6579 -20552 14041 27888 9945 13882 48546 31239 -7837 -24355 1552 12732 -10331 19706
6567 19706 11874 12580 17810 53662 52254 8770 -40654 -49877 -17875 -4897 -23572 -34786 -55192
6554 -55192 -73849 -61020 -52183 1043 12864 -14110 -3259 32526 19725 39499 -5182 -47224
6542 -47224 -20083 11102 1263 -4802 -11027 21890 31789 7695 -580 -25266 -8719 -2515 15811
6529 15811 40536 13366 4967 -21601 -17797 -40214 -54306 -51047 -15373 -15266 -6033 -14271 -18579
6516 -18579 -24086 -28407 -43362 -51742 -66741 -79964 -37507 4673 49608 62251 69924 66959 68328
6503 68328 66725 45265 25834 17649 31228 70498 66458 34059 294 -2586 -28605 -46915 -35298
6490 -35298 5014 56072 78718 63435 50886 26445 3270 -16453 -10456 -54174 4961 55879
6478E5879j1106n4197j3933l1338P016J7188j7493K1578K1407J166J2318J0392
6466A8877K0696l5635m7339q344o183l848M8421Q4648J6047l1232o2021l3085
6454c8998J0751o632j6365K6603L48m2846Q522K2445K7286R018l603J4966k923
6441H572m0207l4478l065K2845j1263j7863p968P1951K0454O470J3993M1095J3400
6428H3936j6036k9626m2073k3284K5743K353K4718m041j4988k7023L5225K5373
6416D0277l4051n261k5959n0174k1596J7774N4377N4914k9224q975l2789j4369
6404e5056j0442J6149q712R407L5601J3764R453J372J9608j0668l6530o671J7623
6391e102J054j401L0890K9915k3990l1694J6960J3104j5115l4128j1944j9371
$$ plain form
6478 55879 44773 -9424 -23357 -54695 -47679 -30491 -47984 -26406 -4999 -3833 8485 18877
6466 18877 39573 3938 -43401 -51745 -57928 -61776 -13355 71293 87340 56108 -5913 -38998
6454 -38998 -28247 -34879 -51244 -24641 -24293 -67139 -58617 -36172 -8886 132 -3471 11495 8572
6441 8572 -31635 -66113 -69178 -46333 -57596 -75459 -83427 -11476 8978 15448 29441 70536 83936
6428 83936 67900 38274 -3799 -27083 -1340 1013 25731 21690 6702 -20321 14904 40277
6416 40277 6226 965 -24994 -75168 -96764 -78990 -24613 30301 1077 -7898 -40687 -55056
6404 -55056 -65498 -49349 -58061 -48654 -13053 711 10164 11536 31144 20476 -16054 -22725 -5102
6391 -5102 -4048 -5449 25441 55356 31366 -328 16632 29736 14621 -19507 -31451 -50822
6379e0822k425K8579k0351J8771L7506M4825J0360k1312l3771j0523o902l499
6367i564n268k986K3191K1541K9081K2899m9332m0127M7910j3866n7668j1353
6355d5542J783J8573P980q791n383o862K2772J0896j2582l3364n4182O439L2461
6342f5802L3446K6116J7809j4271K27J1385P492J8913K4678l5567j7280J3664
6330B0810K0964J128k8190n1843J3309J204O660k4332j9277j4773j4419K3810
6318f4949J2413K3066J5246n9372J5526N4510L7486N451n0919k2837K357q685
6306d0707L7715N3068n240k6021K1822p556L7818j8084m6290N549J0041j9997
6294B118O86k4493l3871j1352j6081J7715n629M7474N8527L0626m9852l7793K6319
$$ plain form
6379 -50822 -53247 -24668 -45019 -26248 11258 56083 66443 45131 11360 837 -6065 -9564
6367 -9564 -14832 -17818 5373 26914 55995 78894 29562 -10565 37345 23479 -34189 -45542
6355 -45542 -43759 -25186 -17206 -25997 -31380 -38242 -15470 -4574 -17156 -50520 -104702 -98263 -65802
6342 -65802 -32356 -6240 11569 -2702 -2475 8910 16402 35315 59993 24426 7146 20810
6330 20810 41774 42902 14712 -37131 -23822 -22618 -15958 -40290 -59567 -74340 -88759 -64949
6318 -64949 -52536 -29470 -14224 -73596 -58070 -3560 33926 39377 -11542 -34379 -32022 -40707
6306 -40707 -2992 50076 44836 18815 40637 33081 70899 52815 6525 12074 22115 2118
6294 2118 2804 -21689 -55560 -66912 -82993 -65278 -70907 -23433 35094 65720 15868 -21925 4394
6281D394j0704k2030J262o436m173j1790K0451J0627j3508q372j0977p500k9810
6268h8566K8950L9119L0060L9077K1026k5169j8525l5265j4419N1249J168M007
6256C2712O1521Q269n0491m2376j7556R935K8332L2865Q55k1062j5837K7916K5859
6243H0942k8259j0364R155o493r350m283k0131K8208K8376o1410J4046o758k3032
6230i353M3107K4167l7576l5137r77j8735k5679O526j7171m990K0168k2146M8302
6217b9494R382n765o881p630K3786J7592J2662l396R223J2411P71K703j6686J5824
6203C4502k4752j2478k144j6848P612J5779M78j6860k9162K8368J3017o569M430
6190d627L7737k2120m9775k4208J4389k0080j7804J7423K8742P5320J4711o0135
$$ plain form
6281 4394 -6310 -28340 -27078 -33514 -37687 -49477 -29026 -18399 -31907 -40279 -51256 -58756 -88566
6268 -88566 -59616 -20497 9563 48640 69666 44497 25972 -9293 -23712 27537 28705 32712
6256 32712 94233 102502 52011 9635 -7921 2014 30346 63211 64066 43004 27167 55083 80942
6243 80942 52683 42319 51474 44981 35631 31348 11217 39425 67801 6391 20437 13679 -9353
6230 -9353 33754 57921 20345 -14792 -15769 -34504 -60183 -53657 -70828 -75818 -55650 -77796 -29494
6217 -29494 -20112 -25877 -32758 -40388 -16602 990 13652 10256 19479 31890 32661 35364 18678 34502
6203 34502 9750 -2728 -4872 -21720 -14108 1671 2149 -14711 -43873 -15505 -2488 -9057 -4627
6190 -4627 33110 10990 -38785 -62993 -48604 -68684 -86488 -69065 -40323 34997 49708 -10427
6178a0427j7493p833N352q968P67L5265N1860J1775q234J0513k2147l023J1926
6165D9333k1472k5667l2377k5378K527J2722k8460M781J6238J2262k1416o544
6153f3451L7253M7702k9666j8351J2n02M5707p338J6701j3513k4360k0613m1402
6140g1821j1607m521R624L2171Q179N7776l8220J0073p817K2372J2257J7143j4740
6127B0869j8305J4868j3996j1118M663J6247m2485l7603M8309K9916n4672M553
6115c8754M7753L4175K2215j0014l2878k4164K6342k7075m2771r384M7990L3939
6103B7374K338K6931k2856K7057J3984n2845l6577k6372Q750M0295R964m3324
6091b5281K143j9516J2031l6588j2372L4763L436O509P603l3842l7398L3337M4028
$$ plain form
6178 -10427 -27920 -35753 -30401 -39369 -38602 -3337 48523 60298 52064 62577 40430 37407 49333
6165 49333 27861 2194 -30183 -55561 -53034 -40312 -68772 -63991 -47753 -35491 -56907 -63451
6153 -63451 -26198 21504 -8162 -26513 -26501 -27003 18704 11366 28067 14554 -9806 -30419 -71821
6140 -71821 -83428 -87949 -78325 -46154 -37975 19801 -18419 -8346 -16163 6209 18466 35609 20869
6127 20869 2564 17432 3436 -7682 -3019 13228 -29257 -66860 -18551 11365 -43307 -38754
6115 -38754 8999 43174 65389 55375 22497 -1667 24675 -2400 -45171 -54555 -6565 27374
6103 27374 29712 56643 33787 60844 74828 21983 -14594 -40966 -32216 8079 18043 -25281
6091 -25281 -23138 -42654 -30623 -67211 -79583 -44820 -41384 -34875 -27272 -61114 -98512 -65175 -21147
6078b1147J6292N340R445J2522j1505j4770j8350N405L1178K921L851l9883K5305
6065F604J1300j704N8896J7307j0879m4534l5278L78M614n6166m2325O5686L7220
6052A1119K80j9018o3811N59L2461m817K8713K5605j1066k5409L7452M7207Q055
6039F7330j5751k2593L0733R077J5712P996n603k5594k2467N098M483o6470l4370
6026e2419K6323J8060n190K6684N7660m243p179j9361k1104p430n694j3634L8661
6013C1134N949K0998q289j1487k8909q000k3708j3098k3021j4382J9012K0768
6001c3033R116j9889j769J2271M4157j8836m1399q309K0585K7364j938k2764j6950
5988e1394M3853p624j8030m4765p4814J7920P7148J2687M356J813O958N0214K3480
$$ plain form
6078 -21147 -4855 485 9930 22452 10947 -3823 -22173 -16768 14410 17331 21182 -18701 6604
6065 6604 17904 16200 75096 92403 81524 36990 1712 2090 6704 -49462 -91787 -26101 11119
6052 11119 11399 -7619 -71430 -70871 -38410 -43227 -14514 11091 25 -25384 12068 59275 67330
6039 67330 51579 28986 59719 68796 84508 92504 86901 61307 38840 43938 48421 -18049 -52419
6026 -52419 -26096 -8036 -13226 13458 71118 66875 59696 40335 19231 11801 6107 -7527 31134
6013 31134 37083 58081 49792 38305 9396 1396 -22312 -35410 -58431 -72813 -53801 -33033
6001 -33033 -23917 -43806 -45575 -33304 10853 -7983 -49382 -57691 -37106 -9742 -11680 -34444 -51394
5988 -51394 -7541 -15165 -33195 -77960 -152774 -134854 -57706 -45019 -40663 -38850 -31892 18322 41802
5975D1802k8646J0881P149K524j2352k539m1772j2705K1864O253m7448R163J1736
5962c4090O062J3408m9925R733J5360k470k5158K165M7031L1658j485r053l300
5949f4J0999K9739k730k0867m3297K7325L3040O265j8521r348k2653k8773J2K0190
5935a8683M7612j1788k9744M957j8768L7734J8087j4824l4428k2298L4674J0128
5923B659J1752M7974j0517n0592K1475N882J302k4019K815j5489j2953m3j1537
5910c1291J0797k0647p990k597L1675j3128M691J7553O541L8544M4699k0521l7526
5897B0800k8688n220p076j6984p668O609m9K5601L0626K135K996j072P90K164
5883B4964J0652l814m382J8348l0088n5232j2359N040n052p811K5366j6243j0634
$$ plain form
5975 41802 13156 24037 31186 33710 21358 18819 -22953 -35658 -13794 -7541 -54989 -45826 -34090
5962 -34090 -28028 -14620 -64545 -54812 -39452 -41922 -67080 -64915 -17884 13774 12289 3236 -64
5949 -64 10935 40674 37944 17077 -26220 1105 34145 40410 21889 12541 -10112 -38885 -38873 -18683
5935 -18683 28929 17141 -12603 -7646 -26414 11320 29407 14583 -19845 -42143 -7469 2659
5923 2659 14411 62385 51868 1276 22751 28633 29935 5916 8731 -6758 -19711 -19754 -31291
5910 -31291 -20494 -41141 -49131 -51728 -20053 -33181 -28490 -10937 -4396 34148 78847 58326 20800
5897 20800 -7888 -13108 -20184 -37168 -44836 -38227 -38276 -12675 17951 20086 23082 22010 22800 24964
5883 24964 35616 31802 27420 45768 15680 -39552 -51911 -46871 -51923 -59734 -34368 -50611 -61245
5870f1245n534R735Q362k8041k5284L4028K9562N5283o495M474J0918J8237j0338
5857C3662k2528P880j2982r001N0039j8917q2646j7543M3062K6443l4722r676
5845d6929k685L1867L0454K1340Q455J1008K1066l2234o364l3282j8991J8480
5833B185l289O592L8431M1408O033J1513m7947l5028m538O462l1508J1673J8892
5820B0879J0716j1027O446n342o9817j0121m009J594l204k9747J3588M3954N060
5807c1030k8084k2497r336R488R425l4457k3297J1305J6033K6162N0588q220k9184
5794f3104K897L4154J5010J5552n362m2773n3145L0639M6140J9830k826j2563
5782a5551J995J2257j4094P1054M6337k9467j4846k694l9379m4292k2696J0262
$$ plain form
5870 -61245 -66779 -57044 -48682 -76723 -102007 -67979 -38417 16866 10371 14845 25763 44000 33662
5857 33662 11134 19014 6032 -2969 47070 28153 -54493 -72036 -28974 -2531 -37253 -46929
5845 -46929 -49614 -17747 12707 34047 42502 53510 74576 42342 35978 2696 -16295 2185
5833 2185 -1104 5488 43919 85327 91360 102873 54926 19898 15360 21822 -9686 1987 20879
5820 20879 31595 20568 27014 21672 -48145 -58266 -62275 -60681 -63885 -93632 -80044 -36090 -31030
5807 -31030 -59114 -81611 -90947 -81459 -72034 -106491 -129788 -118483 -102450 -76288 -25700 -33920 -63104
5794 -63104 -60207 -26053 -11043 4509 -853 -43626 -96771 -66132 -19992 -162 -2988 -15551
5782 -15551 -13556 -1299 -15393 55661 101998 72531 57685 54991 15612 -28680 -51376 -41114
5770d1114k040k9354K5551j8453k2863n147K541K5470N0116l908m7752l1359J2098
5757h6214M0777k0507j2335q307m342J4193N0785K199K234k0846r836L51M0000
5744a1848N2959j248m8815n8845l1826J7628L2637K934P023J5997o663J2465k7517
5731d5119l4522K9163O3037j9857l8436L9236N2128k9155L827q430J2014k6278
5719b392n2660J5684j0366k1808p670K0003P006l9060J3816K9002M9877K8572
5707C0004j7856m7907Q658M161m073M849k6879L4640K1494j9293l4176K6968J9088
5694c22j7568k1010l711N0621L8306r106k6905k7920R382p084k0469J2029M0267
5681A6510M70j643l6874N370j3841j1600m4026J1469J4753J3948J007L9837J0558
$$ plain form
5770 -41114 -43154 -72508 -46957 -65410 -88273 -93420 -90879 -65409 -15293 -19201 -66953 -98312 -86214
5757 -86214 -45437 -65944 -78279 -86586 -90928 -76735 -25950 -23751 -21517 -42363 -52199 -51848 -11848
5744 -11848 41111 39863 -8952 -67797 -99623 -81995 -49358 -46424 -39401 -23404 -30067 -17602 -45119
5731 -45119 -79641 -50478 12559 -7298 -45734 -6498 45630 16475 20302 11872 23886 -2392
5719 -2392 -55052 -39368 -49734 -71542 -79212 -59209 -52203 -91263 -77447 -48445 1432 30004
5707 30004 12148 -35759 -27101 -22940 -27013 -22164 -49043 -14403 7091 -12202 -46378 -19410 -322
5694 -322 -17890 -38900 -42611 8010 46316 37210 10305 -17615 -8233 -15317 -35786 -23757 16510
5681 16510 16980 15337 -21537 -16167 -30008 -41608 -85634 -74165 -59412 -45464 -44457 -4620 5938
5668E938m1979j8438M9873J3100j1450l0807J1333L8812k340N628K401j8474o826
5655c229K5394r097l0628K5162L7510j7144l7878r784o063q726j3454J1900J6191
5642a9846N767l8964K3411M4454L7854n569j3549o337j4860J782J4493l8242q872
5629a8478L540l5169j211J0049P353K706k2499k4383J0058P2321Q536K8738j8037
5616B3524J063l7195m0917k3554O158j053K2523J9459K2692J093k3810j8397j3683
5603f2097J4627K8588K7275J4139k1263k7615j3837m373k6032m0758L2640K0365
5591e8341L5297N7756q725k3744k768J5136k5229k4998O286j9812J7468N7171
5579B5497O668m1469J8955N4447k2983o214J5919k3113l7346J3309M4946n44L5622
$$ plain form
5668 5938 -36041 -54479 -4606 8494 -2956 -33763 -22430 16382 14042 19670 22071 3597 -3229
5655 -3229 22165 13068 -17560 7602 45112 27968 -9910 -19694 -25757 -34483 -47937 -36037 -19846
5642 -19846 -14079 -53043 -29632 14822 52676 47107 33558 27221 12361 14143 28636 -9606 -18478
5629 -18478 -14938 -50107 -51318 -41269 -33916 -31210 -53709 -78092 -68034 4287 12823 41561 23524
5616 23524 24587 -12608 -53525 -77079 -70921 -71974 -49451 -29992 -7300 -6207 -30017 -48414 -62097
5603 -62097 -47470 -18882 8393 22532 1269 -26346 -40183 -44556 -70588 -111346 -78706 -58341
5591 -58341 -23044 34712 25987 2243 -525 14611 -10618 -35616 -29330 -49142 -31674 25497
5579 25497 32165 -9304 9651 64098 41115 34901 50820 27707 -9639 3670 48616 48072 83694
5566H3694j0746O933m8917k090k6388O100l9449J0054R836l8977m588O045K0796
5553b7697N659J081k9948m440p018K3761O5957Q17j5776J3738K7346N353m4603
5540A4230q931J3631r300l6383K8722K2544K4221j8664K3263P924m0177J6895
5528C7975j3699k9505r891m5477j8792p629J0768N144J758K0799L3582m7576J6628
5515d5915K9208L188P510R680l4874J4263o8J3179r611J1397Q855O87O654J9481
5501C3634j5284j0726J1056p409K3173l1171J1345K4316m523n1042k1734k2233
5489f0598j588N5640K957K476j5961m3472L1963K7714j4272R32p256k5935l4709
5476h2109K3028j692J5145R322j1484p335L0405L5169k1412l4718K9138J6844
$$ plain form
5566 83694 72948 79881 30964 28874 2486 8586 -30863 -20809 -10973 -49950 -54538 -48493 -27697
5553 -27697 -22038 -20957 -50905 -55345 -62363 -38602 27355 28172 12396 26134 53480 58833 14230
5540 14230 5299 18930 9630 -26753 1969 24513 48734 30070 53333 61257 21080 37975
5528 37975 24276 -5229 -15120 -60597 -79389 -87018 -76250 -71106 -69348 -48549 -14967 -62543 -45915
5515 -45915 -16707 -13519 -6009 3671 -31203 -16940 -17008 -3829 -13440 -2043 6812 7499 14153 33634
5501 33634 18350 7624 18680 11271 34444 3273 14618 38934 34411 -16631 -38365 -60598
5489 -60598 -62186 -6546 -3589 -1113 -17074 -60546 -28583 -869 -15141 -14209 -21465 -47400 -82109
5476 -82109 -59081 -60773 -45628 -36306 -47790 -55125 -24720 10449 -10963 -45681 -16543 301
5464C01J464J0141j5331m300J1859J8595l5918K408P3758L1163j975j9435l5857
5451C6873l8691J3038M0558j0729m4749p847q734j197k1382j2256k6547l063N0921
5438c3805L2826j6172K1220M5063l5235j6456K2690K6509k6431l3025p238K3228
5426C174J5550m4249m3482J2387N7550J2783j3523l391l3313k048J318J2545o482
5413c1181N975J690j6145J182j4843n613J2609J4866K8390o983j9146j5151m7998
5400i2348k1970M0867K7841K1571p523J0754o391P237j9461K008o218j8128O595
5387e5166q086R744O748K5306j7962k7562M8982K820J1778K7640K7983p276k7264
5374A7685l8675o267J6852K9525k8160l4271M86l665P92k9049k3413K0466M2575
$$ plain form
5464 301 1765 11906 -3425 -7725 4134 22729 -13189 -10781 62977 94140 92165 72730 36873
5451 36873 -1818 11220 51778 41049 -3700 -11547 -20281 -21478 -42860 -55116 -81663 -84726 -33805
5438 -33805 -979 -17151 4069 49132 13897 -2559 20131 46640 20209 -12816 -20054 3174
5426 3174 18724 -25525 -69007 -56620 930 13713 190 -3201 -36514 -38562 -37244 -24699 -31181
5413 -31181 -25206 -23516 -39661 -38479 -53322 -58935 -46326 -31460 -3070 -10053 -29199 -44350 -92348
5400 -92348 -114318 -73451 -45610 -24039 -31562 -20808 -27199 -19962 -39423 -37415 -43633 -61761 -55166
5387 -55166 -63252 -53508 -46760 -21454 -39416 -66978 -17996 -15176 -3398 24242 52225 44949 17685
5374 17685 -20990 -27257 -10405 19120 -9040 -43311 -42825 -46490 -45698 -74747 -98160 -77694 -35119
5361c5119J1908L6218J5963M42j0914l4463j6620J7053Q573j5003J3664J5453
5349G155k7585o6327k99L5733M6707N4068k4670j2939n2349l5332K4155J8349
5337c3334J9243o224J5810M1628l313l9574o048j8026J0978L1749k67j7375Q209
5324C456r331J4342J6421k525m3756l4663M4329J2537k2804L168k5191J4579j2250
5311d1688k5944R052J4445J850m613j6195k933j7695p322K6288N5269k3070o2237
5298i4793K8201N4301K5906k2103R370J3361q303J6117K9211r66j6507k3114L891
5285A4572L4565l704J805j2031m0087o94J9940L123M533k5284k4092l029L1149
5272G66J2331K291m7622J9695J4737N922K0300n037N056J6688k9136j8116P21
$$ plain form
5361 -35119 -23211 13007 28970 29412 18498 -15965 -32585 -15532 -6959 -21962 -8298 7155
5349 7155 -20430 -86757 -87056 -51323 -4616 49452 24782 11843 -40506 -75838 -51683 -33334
5337 -33334 -14091 -20315 -4505 37123 33810 -5764 -11812 -29838 -18860 12889 12622 -4753 3456
5324 3456 -5875 8467 24888 22363 -21393 -56056 -11727 810 -21994 -18826 -44017 -29438 -41688
5311 -41688 -67632 -58580 -44135 -42285 -46898 -63093 -66026 -83721 -91043 -64755 -9486 -32556 -94793
5298 -94793 -66592 -12291 13615 -8488 882 14243 5940 22057 51268 50302 33795 10681 14572
5285 14572 49137 45433 47238 35207 -4880 -5574 14366 17489 22022 -3262 -27354 -30383 766
5272 766 13097 15388 -32234 -12539 2198 8120 28420 23383 28439 45127 15991 -2125 -1404
5259a404j2695l3726l1810q522L9796L4208j9661k892L2416L2351o482j7038j5396
5246a0855j0538K386r448j2624k2178J4313R639L367l470K9101O788j6067J8666
5233i20o417j8948K1125J6376K8114j1662Q37J2236k4062j8946J4503n455J5003
5220B1784M099p44k3980l1463O6811K8825J498k6297n7902m0201R812N0118Q5
5207B445k0840M232m733K9169K3694j0084p6378n370P030L4320j1801r292k260
5194c9868j737j418J7822J2996L5823k9896l1222K952L7199M929j9694o589L522
5181a5181j5443M3105N388K3066K7901o2093o1335n693k3270J5012O8920J1373
5169A1750j9346K468k0958j7918k1768k3192J3691R815j2019j50j9992o366P010
$$ plain form
5259 -1404 -14099 -47825 -79635 -88157 -48361 -14153 -33814 -36706 -4290 28061 21579 4541 -10855
5246 -10855 -21393 -19007 -28455 -41079 -63257 -48944 -39305 -35938 -39408 -10307 -3519 -19586 -920
5233 -920 -7337 -26285 -5160 11216 39330 27668 28505 40741 16679 -2267 12236 6781 21784
5220 21784 25883 25139 1159 -30304 36507 65332 66830 40533 -17369 -57570 -47758 2360 2445
5207 2445 -18395 -14163 -18896 10273 33967 23883 -52495 -57865 -50835 -16515 -28316 -37608 -39868
5194 -39868 -41605 -43023 -25201 -12205 23618 -6278 -37500 -34548 2651 7580 -12114 -18703 -15181
5181 -15181 -30624 12481 17869 40935 68836 6743 -54592 -60285 -83555 -68543 377 11750
5169 11750 -7596 -5128 -26086 -44004 -65772 -88964 -75273 -65458 -77477 -77627 -97619 -103985 -96975
5156i6975J264K5688N5083N310k3044K4284J624L289L8239k385j2745l3560k5479
5143c9407J4417K1761k323q821L707J0767j4702L88r974k9677J0165J1736J6063
5130a5900k7439l8536l800L0528L020p968j609K4254Q087j3213k2836m2079L6480
5117g1011K9686J1147q999K6099J6358J6794J9928J7855K4301M565l4965k7357
5105B4401r303k2176j9957p75L964K8714k6107j3031N7055L7290k0709j7494m8967
5092b7095J320j62L6343K830j8023j1860r649k2413R570m0745j8148K771K9785
5079f5476j41O358J9087L5068K9493P792n240q156k2597Q532j9339l2438J4512
5066c2545J3714k4552k2187j729M9631Q124n9219r912L4285M899q656J0385M896
$$ plain form
5156 -96975 -95711 -70023 -14940 -9630 -32674 -8390 -6766 -3477 34762 32377 19632 -13928 -39407
5143 -39407 -24990 -3229 -5552 -14373 -10666 101 -14601 -14213 -24187 -53864 -43699 -31963 -15900
5130 -15900 -43339 -81875 -85675 -55147 -52127 -60095 -61704 -37450 -29363 -42576 -65412 -107491 -71011
5117 -71011 -41325 -30178 -39177 -13078 3280 20074 40002 57857 82158 86723 51758 24401
5105 24401 15098 -7078 -27035 -27810 -23846 4868 -21239 -34270 22785 60075 39366 21872 -27095
5092 -27095 -25775 -25937 10406 13236 -4787 -16647 -26296 -48709 -39139 -79884 -98032 -95261 -65476
5079 -65476 -65617 -59259 -40172 -5104 24389 32181 26941 18785 -3812 4720 -14619 -47057 -32545
5066 -32545 -18831 -43383 -65570 -67299 -17668 -9544 -68763 -78675 -44390 -39491 -48147 -37762 -32866
5053c2866K4946L1240k6934k0175m036J0635k2144L0434k0704M1772L7786K3212
5041G3166M7378j3971m1325j6639j4661j8151L0374P958o5224n532K7595L4840
5029D5808J6089q3123l3055n111K1260L9594J1664K7917j944k747K04k5469m6714
5016c5627l4826K5143J5412n981L288L2812M2404N863j9850j6032M4208K3029
5004G9843l6365r665M7281Q955n021k9564k3750o6208m2469k732P509J4210m5333
4991a03309O887M6428p224R354K8340O7426K0783n0612n455J8634k0380M459J9689
4978C5020j1415j3705L9266P360m4428l0244l5809K9005K8611J8844J0681L2996
4966F6182J6340k2971o6572o3836j8025J9358N7052N4680k7321n9236p640L7078
$$ plain form
5053 -32866 -7920 23320 -3614 -23789 -27825 -17190 -39334 -8900 -29604 12168 49954 73166
5041 73166 120544 106573 65248 48609 33948 15797 46171 54129 -11095 -16627 10968 45808
5029 45808 61897 -21226 -54281 -59392 -38132 1462 13126 41043 39099 36352 36556 11087 -35627
5016 -35627 -70453 -45310 -29898 -35879 -32591 221 42625 48488 28638 12606 56814 79843
5004 79843 43478 33813 81094 90049 85028 55464 31714 -34494 -76963 -79695 -72186 -57976 -103309
4991 -103309 -96422 -49994 -57218 -47864 -19524 47902 68685 18073 12618 31252 10872 15331 35020
4978 35020 23605 9900 49166 56526 12098 -18146 -53955 -24950 3661 22505 33186 66182
4966 66182 82522 59551 -7021 -70857 -88882 -69524 -12472 42208 14887 -44349 -51989 -14911
4954a4911M3912K4330k4203j4310N677j0873r044k8523m0090q050L0268R600M269
4941c1948J848n023J6089l626K3391j577j539M944n9556j2086q823J6932L5431
4928b5543Q205k0588L2393K3240k1241l2106j7030J3385J4748L7148O107j280
4916A7438n0343K3568N9870J3914k5454m647L1828Q84p990n044K625K9551k7677
4903E8523m9625j0130J4605o311j571L9221K3416M039l4790K126j3865q374L4827
4890E2091j7071q102J1998m2292p827q899l4051O956M2123K3885j2163K4782L1691
4877F3121k4489k6219o15j8584R229m806m4821k9920j6945J2114L2436K2639Q918
4864a7942J5743M5343j20R885l8720k2924P795N922j2190k7402L9851R794m0987
$$ plain form
4954 -14911 29001 53331 29128 14818 20495 9622 578 -27945 -68035 -76085 -45817 -36217 -31948
4941 -31948 -30100 -35123 -19034 -22660 731 -846 -2385 2559 -56997 -69083 -77906 -60974 -25543
4928 -25543 -17338 -37926 -5533 17707 -3534 -35640 -52670 -39285 -24537 12611 18718 17438
4916 17438 -32905 -9337 50533 64447 38993 34346 66174 67058 59068 54024 56649 86200 58523
4903 58523 8898 -1232 13373 7062 5491 44712 68128 72167 37377 39503 25638 17264 52091
4890 52091 35020 26918 38916 -3376 -11203 -20102 -54153 -47197 -5074 18811 6648 31430 63121
4877 63121 38632 12413 11798 -6786 2443 -2363 -47184 -77104 -94049 -81935 -49499 -26860 -17942
4864 -17942 -2199 43144 43024 52909 14189 -8735 -940 4982 -7208 -34610 5241 15035 -25952
4851b5952l3128m0364N0938M2865k1245L3223j763Q094l788m054j9731n774M3165
4838B2486k6052j3238m6973k58K0770L3955j109j5866J9420L9923M0881j3108
4826F0831m9043l7630l7128n733R290k7728L4885N3550R223k3127o618J1342L7038
4813B9152K3958m0468q328k3738J0374J05j540O515J8004k6082o085j1615L642
4800b6106K536K7811K0249q259j2971J1632o562K654J2753n1705m2035J4701P374
4787d7928K1271K9685K0160L4K321k2037k4842K7055M623q991r104j5720M904
4774a8569R475m8058l721j8087m8037L147M8699N366j6691J4994M88J8402J6361
4761c6231K5743P4393K5454n4836j9564m1560l7660J3161M0493K9233J6412l2332
$$ plain form
4851 -25952 -59080 -99444 -48506 -5641 -26886 6337 4574 12668 8880 4826 -14905 -20679 22486
4838 22486 -3566 -16804 -63777 -64035 -43265 -9310 -10419 -26285 -6865 33058 73939 60831
4826 60831 11788 -25842 -62970 -68703 -59413 -87141 -52256 1294 10517 -12610 -19228 -7886 29152
4813 29152 53110 12642 4314 -19424 -9050 -8945 -10485 -3970 14034 -12048 -18133 -29748 -26106
4800 -26106 -23570 4241 24490 16231 3260 14892 8330 10984 23737 -27968 -70003 -55302 -47928
4787 -47928 -26657 3028 23188 23222 25543 3506 -21336 5719 10342 1351 -7753 -23473 -18569
4774 -18569 -9094 -57152 -60873 -78960 -126997 -123850 -75151 -69785 -86476 -71482 -70994 -52592 -36231
4761 -36231 -10488 63905 89359 34523 14959 -26601 -64261 -51100 -10607 18626 35038 2706
4749B706l0672k0276j7834K8131M3711l0111j3649K9086J4443K1193R786K1346
4737E7860j1549m012o1645o4811L3890L2292K6519q22k714j0197L4298o704J1746
4724C4151j354l1107m3419L3718K860l4117k7588p388J1373K4216J5132K4267
4712G44J5536l4255j4716J7426K6845n0671j5227K4044M1370n80m1730Q6998K3024
4699G8808j2680j768P29L9860j3860q6678j7881k713j2952K0930m176P385J6471
4686A1475L957M8411r687r831l6449L706k7538l6842o575o461L4544N5240m165
4673A9785m5632o261Q812L795m5582o182J1910J6217L4657o1657j6858K309J6431
4660f8256N0438m6114m8031J6519K4673o538M3237J2372J1249j9714J9431K1506
$$ plain form
4749 2706 -27966 -48242 -66076 -37945 5766 -24345 -37994 -8908 5535 26728 36514 57860
4737 57860 46311 42299 -19346 -84157 -50267 -17975 8544 7722 5008 -5189 29109 22405 34151
4724 34151 32797 1690 -41729 -8011 -5151 -39268 -66856 -74244 -62871 -38655 -23523 744
4712 744 16280 -17975 -32691 -15265 11580 -39091 -54318 -30274 11096 10516 -31214 55784 78808
4699 78808 66128 64360 65089 104949 91089 4411 -13470 -16183 -29135 -8205 -12381 -4996 11475
4686 11475 15432 63843 54156 44325 7876 11582 -15956 -52798 -59373 -65834 -31290 23950 19785
4673 19785 -25847 -32108 -23296 -19501 -65083 -71265 -59355 -43138 -8481 -70138 -86996 -84687 -68256
4660 -68256 -17818 -63932 -111963 -95444 -70771 -77309 -34072 -21700 -10451 -30165 -10734 10772
4648A0772J4585M454L604k1254j0283n236k3713L2797J4197l3270k2373k1390
4636e7110j8499K9788K5465L7663k4039l7578J2600Q762L304M2594K4572n1751
4624d229j87K0789o823K8034j1152j1501j273k5264k6466K711K9996p16P355K3341
4610B4615r479k4904K0575N10L2063L5593m6499k8727j0715k2400k3527J1057
4598d1838J4025L461L9829k5846l9353n899J1904L0339K4416o723l7719k5250
4586e8654J0930P0866J3232l3280l8480Q860O5879J4146k5478k9950l0701k8357
$$ plain form
4648 10772 25357 29811 33415 12161 1878 -3358 -27071 5726 19923 -13347 -35720 -57110
4636 -57110 -75609 -45821 -20356 17307 -6732 -44310 -31710 -22948 -19644 22950 47522 -4229
4624 -4229 -4416 16373 9550 37584 26432 14931 13658 -11606 -38072 -35361 -5365 -6081 1274 24615
4610 24615 15136 -9768 10807 11317 43380 78973 32474 3747 -6968 -29368 -52895 -41838
4598 -41838 -27813 -24352 15477 -10369 -49722 -55621 -43717 -13378 11038 4315 -33404 -58654
4586 -58654 -47724 23142 36374 3094 -35386 -26526 39353 53499 28021 -1929 -32630 -60987
$$ [...]
##END NTUPLES=NMR SPECTRUM
##END=
