##TITLE=Analysis number 319032
Compound Code cc 49709
Book Reference 481/10/1/4
Project Code adrs
Chemist Name bruced
##JCAMPDX= 6.0         $$ Bruker NMR JCAMP-DX V2.0
##DATA TYPE= NMR SPECTRUM
##DATA CLASS= NTUPLES
##ORIGIN= Bruker BioSpin GmbH
##OWNER= nmr
$$ XWIN-NMR		Version 3.5
$$ Thu Apr 27 09:55:26 2006 GMT Daylight Time (UT+1h)  MAYBRIDGE\nmr@NMR_250MHZ
##.OBSERVE FREQUENCY= 250.131544655141
##.OBSERVE NUCLEUS= ^1H
##.ACQUISITION MODE= SIMULTANEOUS (DQD)
##.ACQUISITION SCHEME= undefined
##.AVERAGES= 16
##.DIGITISER RES= 18
##SPECTROMETER/DATA SYSTEM= dpx250
##.PULSE SEQUENCE= zg30
##.SOLVENT NAME= CDCl3
##.SHIFT REFERENCE= (INTERNAL, CDCl3, 0, 16.522)
##AUDIT TRAIL= $$ (NUMBER, WHEN, WHO, WHERE, WHAT)
$$ ##TITLE= Audit trail, XWIN-NMR		Version 3.5
$$ ##JCAMPDX= 5.01
$$ ##ORIGIN= Bruker BioSpin GmbH
$$ ##OWNER= nmr
$$ C:\u/data/dgb/nmr/ADRS/3270/pdata/1/auditp.txt
$$ ##AUDIT TRAIL=  $$ (NUMBER, WHEN, WHO, WHERE, WHAT)
(   1,<2006-04-27 09:54:58.30 +100>,<MAYBRIDGE\nmr>,<NMR_250MHZ>,
      <created by zg, POWCHK disabled, PULCHK disabled
       configuration hash MD5:
       84 BC 41 DB A1 6E 1D 46 DA 25 12 A5 C1 ED C5 3A
       data hash MD5: 64K
       C6 0E 1E A3 0B 4D 52 26 D6 8E F8 D5 46 06 5B 9D>)
(   2,<2006-04-27 09:55:13.13 +100>,<MAYBRIDGE\nmr>,<NMR_250MHZ>,
      <Start of raw data processing
       ef LB = 0.3 FT_mod = 6 PKNL = 1 SI = 32K 
       data hash MD5: 32K
       84 71 BE A1 5B 09 6A F2 81 3A 3B 4F E3 47 F2 D6>)
(   3,<2006-04-27 09:55:14.97 +100>,<MAYBRIDGE\nmr>,<NMR_250MHZ>,
      <apk 
       data hash MD5: 32K
       B5 25 B2 C1 34 C2 A9 D1 02 33 2B 2C 5F 23 94 AF>)
(   4,<2006-04-27 09:55:15.70 +100>,<MAYBRIDGE\nmr>,<NMR_250MHZ>,
      <abs ABSG = 5 
       data hash MD5: 32K
       98 67 79 32 08 60 3F 0F F5 8E 5F 8B 1E 87 57 4C>)
$$ ##END=
$$ 
$$ hash MD5
$$ F4 35 03 2C C0 0A D4 26 7D CD 25 D7 0E 84 95 B6
##$RELAX= 
##$RELAX= 
##$RELAX= 
##$RELAX= 
##$RELAX= 
##$RELAX= 
##$RELAX= 
$$ Bruker specific parameters
$$ --------------------------
##$DU= <C:\u>
##$EXPNO= 3270
##$NAME= <ADRS>
##$PROCNO= 1
##$TYPE= <nmr>
##$USER= <dgb>
##$AMP= (0..31)
100 100 100 100 100 100 100 100 100 100 100 100 100 100 100 100 100 100 
100 100 100 100 100 100 100 100 100 100 100 100 100 100 
##$AQSEQ= 0
##$AQ_mod= 3
##$AUNM= <au_zg>
##$AUTOPOS= <5 >
##$BF1= 250.13
##$BF2= 250.13
##$BF3= 250.13
##$BF4= 250.13
##$BF5= 500.13
##$BF6= 500.13
##$BF7= 500.13
##$BF8= 500.13
##$BYTORDA= 1
##$CFDGTYP= 0
##$CFRGTYP= 5
##$CHEMSTR= <none>
##$CNST= (0..31)
1 1 145 1 1 1 1 1 1 1 1 1 1 1 1 1 1 1 1 1 1 1 1 1 1 1 1 1 1 1 1 1 
##$CPDPRG= <>
##$CPDPRG1= <>
##$CPDPRG2= <>
##$CPDPRG3= <>
##$CPDPRG4= <mlev>
##$CPDPRG5= <mlev>
##$CPDPRG6= <mlev>
##$CPDPRG7= <mlev>
##$CPDPRG8= <mlev>
##$CPDPRGB= <>
##$CPDPRGT= <>
##$D= (0..31)
0 1 0 0 0 0 0 0 0 0.06 0 0 0 0 0 0 0.0002 0 0 0 0 0 0 0 0 0 0 0 0 0 0 
0 
##$DATE= 1146128096
##$DBL= (0..7)
120 120 120 120 120 120 120 120 
##$DBP= (0..7)
150 150 150 150 150 150 150 150 
##$DBP07= 0
##$DBPNAM0= <>
##$DBPNAM1= <>
$$ [...]
##$SUBNAM7= <"">
##$SUBNAM8= <"">
##$SUBNAM9= <"">
##$SW= 20.6930455092707
##$SWIBOX= (0..15)
0 0 3 0 0 0 0 0 0 0 0 0 0 0 0 0 
##$SW_h= 5175.983436853
##$TD= 65536
##$TD0= 1
##$TE= 295.16
##$TE2= 300
##$TE3= 300
##$TEG= 300
##$TL= (0..7)
0 120 120 120 120 120 120 120 
##$TP= (0..7)
150 150 150 150 150 150 150 150 
##$TP07= 0
##$TPNAME0= <>
##$TPNAME1= <>
##$TPNAME2= <>
##$TPNAME3= <>
##$TPNAME4= <>
##$TPNAME5= <>
##$TPNAME6= <>
##$TPNAME7= <>
##$TPOAL= (0..7)
0.5 0.5 0.5 0.5 0.5 0.5 0.5 0.5 
##$TPOFFS= (0..7)
0 0 0 0 0 0 0 0 
##$TUNHIN= 0
##$TUNHOUT= 0
##$TUNXOUT= 0
##$USERA1= <user>
##$USERA2= <user>
##$USERA3= <user>
##$USERA4= <user>
##$USERA5= <user>
##$V9= 5
##$VALIST= <valist>
##$VCLIST= <CCCCCCCCCCCCCCC>
##$VD= 0
##$VDLIST= <DDDDDDDDDDDDDDD>
##$VPLIST= <PPPPPPPPPPPPPPP>
##$VTLIST= <TTTTTTTTTTTTTTT>
##$WBST= 1024
##$WBSW= 4
##$XGAIN= (0..3)
0 0 0 0 
##$XL= 0
##$YL= 0
##$YMAX_a= 439821
##$YMIN_a= -575957
##$ZGOPTNS= <>
##$ZL1= 120
##$ZL2= 120
##$ZL3= 120
##$ZL4= 120
##$ABSF1= 16.522
##$ABSF2= -4.171173
##$ABSG= 5
##$ABSL= 3
##$ALPHA= 0
##$AQORDER= 0
##$ASSFAC= 0
##$ASSFACI= 0
##$ASSFACX= 0
##$ASSWID= 0
##$AUNMP= <proc_1d>
##$AZFE= 0.1
##$AZFW= 0.1
##$BCFW= 0
##$BC_mod= 0
##$BYTORDP= 0
##$COROFFS= 0
##$CY= 12.5
##$DATMOD= 1
##$DC= 0
##$DFILT= <>
##$DTYPP= 0
##$F1P= 14.0000005364418
##$F2P= -0.99999901652339
##$FCOR= 0.5
##$FTSIZE= 32768
##$FT_mod= 6
##$GAMMA= 0
##$GB= 0
##$INTBC= 1
##$INTSCL= 1
##$ISEN= 128
##$LB= 0.3
##$LEV0= 0
##$LPBIN= 0
##$MAXI= 10000
##$MC2= 0
##$MEAN= 0
##$ME_mod= 0
##$MI= 0
##$NCOEF= 0
##$NC_proc= -4
##$NLEV= 6
##$NOISF1= 0
##$NOISF2= 0
##$NSP= 0
##$NTH_PI= 0
##$NZP= 0
##$OFFSET= 16.522
##$PC= 1
##$PHC0= 163.1258
##$PHC1= 12.79471
##$PH_mod= 1
##$PKNL= yes
##$PPARMOD= 0
##$PSCAL= 4
##$PSIGN= 0
##$REVERSE= no
##$SF= 250.13
##$SI= 32768
##$SIGF1= 0
##$SIGF2= 0
##$SINO= 400
##$SIOLD= 32768
##$SREGLST= <1H.CDCl3>
##$SSB= 0
##$STSI= 32768
##$STSR= 0
##$SW_p= 5175.98343685301
##$SYMM= 0
##$S_DEV= 0
##$TDeff= 65536
##$TDoff= 0
##$TI= <Analysis number 999999
Compound Code 99
Book Reference 9
Project Code 9>
##$TILT= no
##$TM1= 0
##$TM2= 0
##$TOPLEV= 0
##$USERP1= <user>
##$USERP2= <user>
##$USERP3= <user>
##$USERP4= <user>
##$USERP5= <user>
##$WDW= 1
##$XDIM= 32768
##$YMAX_p= 434659448
##$YMIN_p= -254001
$$ End of Bruker specific parameters
$$ ---------------------------------
##NTUPLES= NMR SPECTRUM
##VAR_NAME=  FREQUENCY,     SPECTRUM/REAL,   SPECTRUM/IMAG
##SYMBOL=    X,             R,               I
##VAR_TYPE=  INDEPENDENT,   DEPENDENT,       DEPENDENT
##VAR_FORM=  AFFN,          ASDF,            ASDF
##VAR_DIM=   32768,         32768,           32768
##UNITS=     HZ,            ARBITRARY UNITS, ARBITRARY UNITS
##FACTOR=    0.157963299565203, 1,           1
##FIRST=     4132.6476996994, 0,             0
##LAST=      -1043.33573715361, 0,           0
##MIN=       -1043.33573715361, -254001,     0
##MAX=       4132.6476996994, 434659448,     0
$$ Real data points
##PAGE= N=1
##DATA TABLE= (X++(R..R)), XYDATA
$$ [...]
15947c9045O6806J4311m0472j6088k6055j7501m442K2699o3577p736P3996m0367
15935g7471K8852R0987o170l5527j6610l6956k8023O6980M9249k8774k9443j7703
15923d0609J1893o88M4106l7501j3341M6945j6858j6167l5609K4149K7311k7298
15911c3667k024K802j03379k327N0367Q134N8963R541j3234n978J6011l0383K8874
15898a6300M1534L5646o5998k0723J7543P5l656M8563J220o6582J5457k1114m9365
15885h3700p8443M0013J11734j3708o8841j0712J5448k1538J3146K1067p913J215
15873h2232j4802K9487k544j6332j6233j6013m0697M2374L8431K6801J4543m335
15861d1552M500k7737m6983R506K3087J526J9117M4006K680J952j6L8855m5921
$$ y = [-39045, 27761, 42072, 1600, -14488, -40543, -58044, -62486, -39787, -103364, -111100, -37104, -77471, -48619, 42368, 36198, 671, -15939, -52895, -80918, -13938, 35311, 6537, -22906, -40609, -28716, -29404, 14702, -22799, -36140, 10805, -6053, -22220, -57829, -33680, -6369, -33667, -35691, -32889, -136268, -138595, -88228, -80094, -21131, -11590, -24824, -30802, -14791, -45174, -16300, 25234, 60880, -5118, -25841, -8298, -8223, -11879, 36684, 37904, -28678, -13221, -34335, -83700, -162143, -122130, -10396, -24104, -92945, -103657, -88209, -109747, -96601, -75534, -83447, -82232, -97034, -67547, -70091, -86423, -102656, -118669, -159366, -116992, -78561, -51760, -37217, -41552, -37052, -64789, -111772, -102266, -79179, -77653, -58536, -14530, -11850, -9898, -9914, 28941, -16980]
15848a6980l8233j8343K6398N0987n1957K6797J7258J555j2823R141k7855N8390
15836B4335M3558L8595o3867j02337n0284M5420M0428l2573K7222n7241L4689
15825e2055P3814L88p7814l1094N3580M773j5785j313J1238M035J2684M778Q806
15812c965O1776J5842j7218K4752J06381J29698J31610K9514m0751J9060N132
15801D61831K4279P6192r269J5577p08p058l0511m2922k3949P810j5423o5328
15789C90521q7703o1432o653m9994l6811m4355r115k3609J1876m5314R800m1817
15777E394k270k9318m5191J4700J332J4229J7948M235N8579O0657m041l3704q217
15764E4333k421j7492N8273N5840n7141j03859J0517L5151M5945K6537K5151P438
$$ y = [-16980, -55213, -73556, -47158, 3829, -48128, -21331, -4073, -2518, -15341, -6200, -34055, 24335, 67893, 106488, 42621, -59716, -110000, -64580, -24152, -56725, -29503, -86744, -52055, 21759, 22147, -55667, -86761, -33181, -28408, -44193, -45506, -34268, -30233, -17549, -12771, -3965, 57811, 73653, 56435, 81187, 187568, 317266, 448876, 478390, 437639, 456699, 461831, 486110, 562302, 553033, 568610, 567902, 560844, 530333, 487411, 463462, 471272, 455849, 390521, 302818, 241386, 234733, 184739, 147928, 103573, 94458, 70849, 82725, 37411, 47211, 5394, 3124, -26194, -71385, -56685, -55353, -41124, -23176, -18941, 39638, 100295, 96254, 62550, 54333, 51912, 34420, 92693, 148533, 91392, -12467, -1950, 33201, 79146, 105683, 130834, 138272]
15752A38272n7789l8500m4788J4069k2452Q712l3232o9582J6826K9614O930l1579
15740h3499O105k6601j2714Q0227O1766j3299l2832m6823l4244M3174L6835l9424
15728f1329k4367l431L403M4439P3760L2462l2419J414K466j4199k3063n2354
15716e3218l3361K2523M5905J1488N1488K4295k5290n6726l3140m73K9456j2524
15704b9577j3898L1469k6647m3880K5023j648l0568k1507p57J8304J029K0617
15692g2040L6080r341j3781K3157N874p0968k0216j8701M5825N1256j8872o7189
15680a28916N8775n944k7251L2558R1696K970r6841m6813Q7554k824p3492j7967
15668a26495L9129j1269M5441J4240q2568k7022N2968K8776P3891L6090n6898
$$ y = [138272, 80483, 41983, -2805, 11264, -11188, -2476, -35708, -105290, -88464, -58850, -51920, -83499, -77394, -103995, -116709, -36482, 25284, 11985, -20847, -67670, -101914, -58740, -21905, -61329, -85696, -89127, -85724, -41285, 32475, 64937, 32518, 33932, 36398, 22199, -864, -53218, -86579, -64056, -18151, -6663, 44825, 69120, 43830, -12896, -46036, -46509, -17053, -29577, -43475, -12006, -38653, -82533, -57510, -59158, -89726, -111233, -111990, -93686, -92657, -72040, -35960, -45301, -59082, -35925, -30051, -101019, -121235, -139936, -94111, -42855, -61727, -128916, -70141, -76085, -103336, -70778, 20918, 23888, -72953, -119766, -32212, -35036, -108528, -126495, -87366, -98635, -53194, -38954, -121522, -148544, -95576, -66800, 7091, 43181, -13717]
15657a3717o9397J1145K8505J2089j4210j3606Q951J2667l6482O694N4437j5065
15645b7989o929N3245J4449J3736l6841o3306l8330N4238O309k1750j4758J3314
15633e4612M0601k6543J4234k4102l1864J1334K3969J0506K5222k5749n1064N266
15621h2802j7962l3781j543M4458N6492M5304l029j6635n930M3963O6246l780
15609I1001p8682q1225R671k1146m0505N3412j112J7560k5663L602J0536p803
15597g0354n708K4574l4476m1550L0063j7273n8756j5566J9531K4273M8318K4795
15585g2129n0008J7521K2889L1036k2070q1496l7706O3414N2736k3452P690J9783
15573g1792L8976r817l2431l5990K7534K2642j1095J8463N6024R165m0735o5842
$$ y = [-13717, -83114, -71969, -43464, -31375, -45585, -59191, -50240, -37573, -74055, -67361, -12924, -27989, -34918, 18327, 32776, 46512, 9671, -53635, -91965, -37727, -31418, -53168, -67926, -54612, -14011, -40554, -26320, -50422, -82286, -70952, -46983, -36477, -11255, -37004, -88068, -82802, -100764, -134545, -136088, -91630, -35138, 10166, 7137, -9498, -15428, 28535, 94781, 91001, 12319, -68906, -59235, -80381, -120886, -67474, -68586, -51026, -76689, -73087, -62551, -70354, -76062, -51488, -85964, -127514, -97451, -114724, -173480, -189046, -169515, -145242, -96924, -72129, -122137, -104616, -81727, -50691, -72761, -154257, -191963, -128549, -75813, -99265, -91575, -71792, -32816, -42633, -75064, -111054, -83520, -60878, -71973, -53510, 2514, 11679, -29056, -94898]
15561i4898J6165K1538N2879J4258l0439q8728Q256J0311J7345j0536K1895l5003
15549i6957M3155o097n9892q36J5760O079l7228P90m424P0217N3435j8867N976
15536b8889N9309j1551k8110O168j3902l7056J8381L5844J2844l7402r623J700
15524c2287K7129j7040l9J5501j4821o0356J2480N3274Q072k2802L5786M5548
15512E0445m0021q6619K2410N6198k8018j8053q102j809k0761K2689J5211j4063
15500e0493J3298k0582K3491k7009O361m2957m0734K159M2118K2727M8976K3905
15488A260J4257l9645j3931O5560M2322p3268m8211o4174k4632K8131J9480k0929
15476a13780J4141M2722j7269J0842p07j8569L5942K4459l6912j9351j8230R0086
$$ y = [-94898, -78733, -57195, -4316, 9942, -20497, -109225, -100969, -90658, -73313, -83849, -61954, -96957, -53802, -59899, -119791, -120627, -104867, -98788, -136016, -135226, -139650, -69433, -15998, -34865, -28889, 30420, 18869, -9241, -3073, -16975, -54031, -35650, 194, 13038, -24364, -33987, -32287, -5158, -22198, -22237, -6736, -21557, -81913, -69433, -16159, -8087, -30889, 4897, 50445, 10424, -76195, -53785, 2413, -25605, -43658, -51760, -53569, -74330, -51641, -36430, -50493, -37195, -57777, -34286, -61295, -54934, -97891, -138625, -136466, -94348, -71621, -22645, 1260, 15517, -24128, -38059, 27501, 69823, -3445, -51656, -115830, -140462, -112331, -92851, -113780, -99639, -56917, -74186, -63344, -64051, -82620, -46678, -22219, -59131, -78482, -96712, -6626]
15464f626N036m7042j7057K5096K4216j719n3886k8766L6684L1751l1174k1326
15452h4813J0096j5752m4904Q5252P502Q484j127l5952j6073L6411J789O5719
15440A6632k9153p9997M3699J2547m7893m4696N1324R289L1962l1872m2737M650
15428a06245K342N3581N2874j803l1457k620M3475k8832K4070K8313q658j5497
15416I543j593P548N3147J5321n2416l2778j3715j1562j4415P219K4057M966O51
15403d027o6723Q131N415M2488O0664j4336p6714k1282n9557o408M2351q419k9806
15390a28223l9836M7150L1174K0733q686j4543K7851M0404K404K7141q139l1907
15378c4477q994L6677O851k1688j2243n9299Q0978j2814j2071L5283J0067n1954
$$ y = [-6626, -1590, -48632, -65689, -40593, -16377, -18096, -71982, -100748, -64064, -32313, -63487, -84813, -74717, -90469, -135373, -50121, -42619, -34135, -35262, -71214, -87287, -50876, -49087, 16632, -12521, -92518, -48819, -36272, -84165, -128861, -77537, -68248, -36286, -68158, -110895, -106245, -103903, -50322, 2552, 749, -30708, -33328, 10147, -18685, 5385, 33698, 25040, 9543, 7950, 15498, 68645, 83966, 31550, -1228, -14943, -26505, -40920, -33701, -9644, -4678, -4027, -70750, -62619, -57204, -14716, 45948, 31612, -45102, -66384, -125941, -132349, -89998, -98417, -128223, -168059, -120909, -89735, -69002, -77688, -92231, -64380, -23976, -21572, 5569, -2570, -34477, -43471, -6794, 57, -21631, -33874, -93173, -12195, -25009, -37080, -1797, 8270, -43684]
15366d3684K296k3634J2165J1308J2619m948k8137J4748K9862j8344m4002n1628
15354a31379L7163O5643P947n8615n3431O5975j3991M1225L2205n0592m573l4407
15342i6830m4522L6685M6046J0173N746j6229j3895M5572L1826L6226k3233l0113
15330a2548j25143j6830Q5768J8846N1257K6060n2612j6550m1516j0044L5448
15319e7864K7249J9639J7124q540K1857l8079k4902K2310o944k6037L9561N02
15307a4124p7329o0975O2987Q6030Q803n9926n5417o0102J0717r799M4876J4517
15295a09742J3731O6990r36J1228j0293M0301N369j9601L6136K3909l1358m0833
15283a5099m8957M434m859l5546N0016K5039m943j9279M2320k990k7486K0565
$$ y = [-43684, -41388, -65022, -52857, -41549, -28930, -33878, -62015, -47267, -17405, -35749, -79751, -131379, -94216, -28573, -20626, -79241, -132672, -66697, -80688, -39463, -7258, -57850, -62423, -96830, -141352, -104667, -58621, -48448, -42702, -58931, -72826, -27254, 4572, 40798, 17565, -12548, -137691, -154521, -68753, -49907, 1350, 27410, -25202, -41752, -83268, -93312, -57864, -30615, -10976, 6148, -2392, 19465, -18614, -43516, -21206, -28150, -54187, -14626, -14124, -91453, -152428, -89441, -3411, 5392, -54534, -109951, -170053, -159336, -169135, -124259, -109742, -96011, -29021, -29957, -18729, -29022, 11279, 16648, -2953, 33183, 57092, 25734, -15099, -64056, -59622, -64481, -100027, -50011, -24972, -29915, -49194, -6874, -9864, -37350, -16785]
15271a6785k039j1615r2429j0431j9971L1682k210j61N9217J735K9781M7739l6159
15258b1646O467l7951L4462j3323l1310M335J2040k3980N671K5023K1458j3477
15246c2231j07313m1630O1415J7069m3730K9939N1212j6790j002j89L300N0544
15234b9406l8959o866J5802J9925j6841K9828N8210k6655m5093j7573L3422j3944
15222c8150j0143j1238K1537k6813j9103L2190k2800P618N520J3267O079M2478
15210D42Q74m3365k2256l1514j2137P234M355P4395L8781k9604k3513M7724J421
15197A2837j8517l8961j1793n360j1333p649J3191N2460K6763j9414k1549J3909
15185a5416P0486j7895n753j7851q660L4551l3064k4656L3208M0644O7422K396
$$ y = [-16785, -18824, -30439, -122868, -133299, -153270, -121588, -123798, -123959, -64742, -63007, -33226, 14513, -21646, -15179, -53130, -18668, -31991, -63301, -58966, -46926, -70906, -65235, -40212, -18754, -32231, -139544, -181174, -119759, -102690, -146420, -116481, -65269, -82059, -83061, -83250, -79950, -29406, -68365, -75231, -59429, -39504, -56345, -26517, 31693, 5038, -40055, -57628, -24206, -38150, -48293, -59531, -37994, -64807, -83910, -51720, -74520, -66902, -61382, -48115, -42036, 442, 1316, -42049, -64305, -95819, -107956, -100722, -96367, -21972, 16809, -12795, -36308, 11416, 12837, -5680, -44641, -56434, -61794, -73127, -80776, -67585, -15125, 11638, -7776, -29325, -15416, 55070, 37175, 31422, 13571, 4911, 39462, 6398, -18258, 14950, 55594, 123016, 125412]
15173A25412n8939k7430m6363j5358j478K0425J4902j1987j01311j0065K7691
15162h4501L093L6262J0757L4383J0383r284p1364R016j5422K1187J5782j5793
15150e5501K7440k4104m674R418n779l5149Q695k415l053M2728L1643k1233j4508
15137d6492j1544k2118K0834N6993K4191n1649r498p892K2417K0258M1284k856
15125C3928p8086n1859j8501K8903J8123L230O178J9688L3150o0896n3292L9902
15113g9532J2692k109L2284M581J5956J1617p6293m4421Q5416M3274L9879k6580
15101A6764k7613k3218l3864N554M4251N964l4814j2483J5840J2124m0856K2527
15089d9824L1669M2960m0796n8533L9069M574o0953O4297R0420N7741k3702j00556
$$ y = [125412, 66473, 39043, -7320, -22678, -24156, -3731, 11171, -816, -102127, -112192, -84501, -81408, -45146, -34389, -6, 10377, 1093, -70271, -61255, -76677, -55490, -39708, -55501, -28061, -52165, -56839, -47421, -53200, -88349, -79654, -82069, -85122, -42394, -10751, -31984, -46492, -58036, -80154, -59320, -2327, 21864, -29785, -39283, -47175, -24758, -4500, 36784, 33928, -44158, -96017, -114518, -85615, -67492, -64262, -58084, -38396, -5246, -66142, -119434, -79532, -66840, -68949, -36665, -32084, -16128, -4511, -80804, -125225, -39809, 3465, 43344, 16764, -10849, -34067, -67931, -62377, -18126, -12162, -46976, -59459, -43619, -31495, -72351, -49824, -18155, 24805, -15991, -74524, -35455, -30881, -91834, -27537, 62883, 120624, 96922, -3634]
15077c634p7949L0552Q6355j2249m8245l0249j6263K5932m239J0453r799l9153
15065h8488J2267j215o52M6711K3980J7536j720l7373j07L2673M8087m242o0436
15052a2979k3300L0974J4169L8526K4141k8449l3791l7859J4280K6964P6843j7096
15040G2423j9392J1439k7659m7950j5103P886j9002k8979k548J3787m5609k3242
15028a23949M5585L7029J1621J9666P4r303l2099J5308m109L6010K1205L1098
15016D8136K5642j5206o6295j0598o479j738j5053P0859L4424k640J00366P3945
15004B35363j0148j4046n251k4102K8805k7027m8079j5866j5858j202k4545l1166
14992D6878p575Q466r418J5578m7220o1398k3856K5129m4167K2014R4699J4144
$$ y = [-3634, -81583, -51031, 35324, 23075, -25170, -55419, -71682, -45750, -49989, -39536, -49335, -88488, -76221, -77436, -78088, -31377, -7397, 10139, 8419, -28954, -29061, 3612, 51699, 47457, -12979, -36279, -5305, 8864, 47390, 71531, 43082, 9291, -28568, -14288, 12676, 89519, 72423, 53031, 64470, 36811, -11139, -26242, -18356, -37358, -66337, -68885, -55098, -100707, -123949, -78364, -41335, -29714, -10048, -9974, -19277, -51376, -36068, -40177, -4167, 17038, 48136, 73778, 58572, -7723, -18321, -24800, -26538, -41591, 29268, 63692, 61052, 161418, 235363, 225215, 211169, 205918, 181816, 210621, 183594, 135515, 119649, 103791, 102589, 78044, 46878, 39303, 47769, 38351, 53929, 6709, -54689, -78545, -53416, -97583, -75569, 19130, 33274]
14980C3274k2821J180K5664P313n173N0102O169q5506o3719k7102K2588r8L2750
14967b5379L0438N816J7904r04M3411Q7906j2880q108M6732k1538K194P165l6644
14954A36113k1100p7815l4903O9030l447N6043K2395m573n0969q5327j32926L5665
14942i1814O1003J3457n6016q7797k453J8494J6111k2793l7608k905J4931J1387
14930a66003M1662J0191N8502n074K4078P0047L0605m7846j5776r429k872l8439
14918e0354l066L4982l871m1931L0380l4376K1141M6762p2537K3366K3265l3670
14906e9909k052O6734p173l2305K0441J5769j6783j0170N5073J6657o9314j0744
14894c3776Q984n694K5341M6898K3476j3168l7934j0830k0873M3686m4619m456
$$ y = [33274, 10453, 11633, 37297, 44610, 39437, 89539, 95708, 10202, -53517, -80619, -58031, -58129, -25379, 5059, 10875, 28779, 27875, 71286, 159192, 146312, 138204, 184936, 163398, 165592, 172757, 136113, 115013, 37198, 2295, 71325, 67878, 123921, 146316, 141743, 90774, 5447, -127479, -91814, -30811, -17354, -73370, -161167, -163620, -145126, -129015, -151808, -189416, -192321, -177390, -166003, -124341, -114150, -55648, -60722, -36644, 33403, 64008, 16162, 386, -9043, -11915, -50354, -53420, -18438, -22309, -64240, -33860, -68236, -47095, -333, -72870, -49504, -26239, -59909, -61961, 4773, -2400, -34705, -14264, 1505, -15278, -25448, 29625, 46282, -23032, -33776, -24792, -30486, -5145, 41753, 65229, 52061, 14127, 3297, -17576, 26110, -18509, -22965]
14882b2965j2991M4739l0834q0344m1051K4480M4978J8409M9322j4375L539J3500
14870c593l4236j3539n0059J1876K8283l2793M0690O2712K8442m3519J3209q875
14858a402J5832R810j0311J7674j1099k5202k0294n365N3232J9403j00091k4246
14846h2059O9484K2228n6443L231N736k811l1329r350M0292N9997m538m2713r47
14833b9222L3247k5334j6222L0978p389k2146N1348M4004m9845o3471N418L7569
14821a1065j2948J9801m646l3267J2829K3929l5450k7280P3597N2920J3044J5841
14809H7305k4942l7175p1909m8354J0337K977l2661j8334L092q145P3680N9207
14797d922q4909r734J7985k2306m5203Q39K1642J8175L2939K7413R978q857J572
$$ y = [-22965, -35956, 8783, -22051, -102395, -143446, -118966, -73988, -55579, -6257, -20632, -17093, -3593, -37829, -51368, -101427, -89551, -61268, -94061, -53371, 9341, 37783, -5736, 7473, -1402, 14430, 24240, 13929, 31603, 20504, -4698, -24992, -30357, 22875, 42278, -57813, -82059, -12575, 9653, -46790, -43559, -37823, -40634, -71963, -81313, -41021, 18976, 14438, -28275, -29222, 4025, -21309, -37531, -6553, -13942, -36088, 15260, 59264, 9419, -54052, -48634, -11065, -24013, -4212, -8858, -42125, -29296, -5367, -40817, -68097, 5500, 58420, 71464, 87305, 62363, 25188, -46721, -95075, -84738, -81761, -114422, -132756, -129664, -137809, -64129, -4922, -89831, -99565, -81580, -103886, -149089, -148250, -126608, -108433, -75494, -48081, -38103, -46960, -45388]
14784d5388K3569L9262j5033n9826o8556P5070O3802j2723o8470j321j2683k9565
14772a11862K8285M6989k0032Q549N3716j5429l3122Q2672l5235q532n5083j2517
14760g1601j23k8288J7277Q2185N2355n4112n3723k2244N2795L8331K6333k7697
14748A1488m5053j4109o62K0256m5235j7695J0788K9847J6353R275m5047n4138
14736a23932N2327N5090l3350j7907j4970L7303O252n046N467K2634L6202l5346
14724a5276j9885N42J888q852J1985j1025K6264J9369l4732P096j8959N8744L5851
14711E3010j0635K03j0324j4716o3456j9957M3496O5037l6962M716J0251k0863
14699b00J028o9706l6754J6454r335M2565K8387l2732K8543L4857k7415J363K8407
$$ y = [-45388, -21819, 17443, 2410, -57416, -125972, -50902, 12900, 177, -68293, -69614, -82297, -111862, -83577, -36588, -56620, -48071, 5645, -9784, -42906, 39766, 4531, -4001, -59084, -71601, -71724, -100012, -82735, -550, 51805, -2307, -56030, -78274, -25479, 12852, 39185, 11488, -33565, -47674, -48336, -28080, -73315, -91010, -80222, -50375, -34022, -24747, -69794, -123932, -71605, -16515, -49865, -67772, -82742, -45439, -39187, -44233, -38766, -16132, 20070, -15276, -35161, -34619, -32731, -41583, -29598, -40623, -14359, 5010, -29722, -22626, -41585, 17159, 53010, 42375, 42578, 32254, 17538, -45918, -65875, -22379, 42658, 5696, 10412, 20663, -200, 828, -68878, -105632, -89178, -98513, -55948, -27561, -60293, -31750, 3107, -24308, -22945, 5462]
14686E462l9839q931k8089l3112N2995L7528J0055J0317j8242j3024m9786K1350
14674e3316L2941K0315k7775p2396N611O6672O2496p279o929k3168m0709J2483
14662c1054O692p3756k8322N8045O8384J7435N334k6699J6806O9574K3297j1453
14650I4283l2929n4427l8846J5490j7290R645l0804q5946O034P928M3956N8449
14638b4457l297m3911k8392M1722k6016Q013N7093N7900K4937o6669n6892M4547
14626a5422K9825J7736k3412k6824L2690O4405J009o9343p2307l1049M2804k6503
14614g6391l513R4417O3974l9294k1220l8421l0508j0910j9346L3462J31474K4416
14602A08140l5688k0835j7258j1768m8854p295m1131K9488Q239m3742j5055J5181
$$ y = [5462, -34377, -43308, -71397, -104509, -51514, -13986, -3931, 6386, -11856, -24880, -74666, -53316, -20375, -60, -27835, -100231, -94620, -27948, 34548, 27269, 20340, -2828, -43537, -31054, -24362, -98118, -126440, -68395, -11, 17424, 22758, -3941, 12865, 82439, 105736, 94283, 61354, 6927, -31919, -16429, -33719, -24074, -54878, -140824, -134790, -126862, -82906, -24457, -27754, -71665, -100057, -58335, -84351, -76338, -19245, 38655, 63592, -3077, -59969, -15422, 14403, 32139, 8727, -18097, 14593, 78998, 80007, 10664, -61643, -92692, -49888, -76391, -79904, 14513, 78487, 39193, 17973, -20448, -50956, -61866, -81212, -47750, 83724, 108140, 72452, 51617, 34359, 22591, -26263, -33558, -74689, -45201, -36962, -80704, -95759, -80578]
14590h0578K6304j457K4521M5905j9660l7077j446J5528m9702j8046R844K8475
14578e7389O0282L9331l3922O931M7590m2152P0682N6161j7629n5147l0896K525
14566D6367k5589m669k3296k2520q729m333J3101K5418R957K8060O044M3658J2792
14553I6261l354l4622l2219M161M0349o039k6423l9135j2642n9366n989K0526
14541e8492K3309p082k0141Q732P7045J240j3755j3375M4879N6727N197O0143
14529A64427K5443j1008K2237P3819O0589j7456p5559K1418K6289L028J0888J8426
14517C22541n8050o2192k0811m7393P326L7575J0315J0043k1311m3014l90l4993
14505I9646L9046O2529O8343J2702M2187N0490M8475P4434j5190l0681l1008p3483
$$ y = [-80578, -54274, -55731, -31210, 14695, -4965, -42042, -43488, -27960, -77662, -95708, -85864, -57389, 2893, 42224, 8302, 15233, 62823, 20671, 91353, 147514, 129885, 74738, 43842, 46367, 20778, 16109, -7187, -29707, -38436, -42769, -29668, -4250, 5707, 33767, 39811, 83469, 96261, 92907, 58285, 26066, 30227, 70576, 64537, 38114, -1021, -13663, -73029, -79018, -58492, -35183, -42265, -62406, -53674, 23371, 24611, 10856, -2519, 42360, 99087, 104284, 164427, 189870, 178862, 201099, 274918, 335507, 318051, 242492, 263910, 290199, 293227, 304115, 322541, 264491, 202299, 181488, 134095, 141421, 178996, 189311, 199354, 178043, 135029, 134639, 99646, 138692, 201221, 269564, 282266, 324453, 374943, 423418, 497852, 482662, 451981, 420973, 347490]
14493C47490p2510j531j6525K7637l0730j25258p9240J0902N0553L1037k0341
14482A21484l6331k213J2618J18424L5804n5207J6818P6171N3567N9659R2827
14471D93621P3308P3087k9778j052L142O5053Q4804Q1228J51906K79120K92759
14460A567198K44883J83794R0058j20617j97160j52230k39935k44448j93457j67819
14450G70267n0244l4237l4255m86R8129K9501l2477m1946l4129r3464q4912j8475
14438D73272k9244k4760o0217J6237k935n2697q3514j9417L8734m8818k7942J9609
14426A98308J7226O9234l7111p5932p535J3318k3752m7699J5131K7954j7934M1016
14414A72224K3862P926j1240j5705l9120j1009l662J6737k4153l1578j3845P2338
$$ y = [347490, 274980, 273449, 256924, 284561, 253831, 128573, 49333, 60235, 110788, 141825, 121484, 85153, 82940, 95558, 213982, 249786, 194579, 211397, 287568, 341135, 400794, 493621, 566929, 640016, 610238, 609186, 612328, 677381, 762185, 843413, 995319, 1274439, 1567198, 1812081, 1995875, 2085933, 1965316, 1768156, 1615926, 1375991, 1131543, 938086, 770267, 720023, 685786, 651531, 651045, 749174, 778675, 746198, 704252, 670123, 576659, 491747, 473272, 444028, 419268, 359051, 375288, 372353, 319656, 236142, 216725, 255459, 206641, 178699, 198308, 215534, 284768, 247657, 171725, 164190, 177508, 153756, 106057, 121188, 149142, 131208, 172224, 196086, 204012, 192772, 177067, 137947, 126938, 123276, 140013, 115860, 84282, 70437, 142775]
14402A42775K8473M0059R0404J1129k8012j08540p0831P256J5639n971O6482K5052
14390B13915j02548o4419K069Q4011N204l7436m876l6193K7743O3166n2090l0198
14378F8348j1376j2773m8050J8285K5019k2167J1357m1312J2076O1761l3198j882
14366B6088L3684r231J555k2037O3008L8177K020K2087K2679O842J5512k6054
14354A74330j4353K9559j5957K3443L7871n4387o7774K3035O0661J8637n9648
14343A55417r2871J5638M899j8158n4653R393N0028J6426n3527o274P9980j954
14331A04344r463L2803r743K5039j329O938m7045n5465O983M3659j7892j7719
14319F1110M3449L0644l1435O457n324o9560j7940M9103J9642j2512J180K4839
$$ y = [142775, 171248, 211307, 301711, 312840, 284828, 176288, 105457, 112713, 128352, 122381, 188863, 213915, 111367, 46948, 49017, 133028, 138232, 100796, 95920, 59727, 87470, 150636, 98546, 68348, 56972, 44199, -3851, 14434, 39453, 17286, 28643, -12669, -593, 61168, 27970, 26088, 59772, 50541, 52096, 30059, 93067, 131244, 133264, 155351, 178030, 184872, 200384, 174330, 159977, 189536, 173579, 197022, 234893, 180506, 112732, 135767, 196428, 215065, 155417, 62546, 78184, 83083, 64925, 10272, 19665, 69693, 86119, 32592, 26318, 106298, 104344, 94881, 127684, 117941, 142980, 141651, 148589, 101544, 46079, 53062, 96721, 78829, 61110, 104559, 135203, 103768, 110225, 104901, 35341, 17401, 66504, 86146, 73634, 74814, 99653]
14307I9653N615m9330k4111L1078J3915J9060O322J7798J5911K643j6110J6943
14295A39387l0928N0954K3276l480m8605m4181m9611L409O2673K0349M2111j6259
14283A49095J1278M0389o878o0179m3629l4939K528L8712N292O7888K3993m4049
14271A49501k3650J5088N6488N2208k9732K4723q892L7624J06992O7994L943m4149
14259D08138k2299L0255k5772m8290j28659J9203L8860P583r532k2350j0288L7993
14247B74842l1213l7037J9556j5734o8480n9813m1204J9190M9263j9556J9855
14236A09669L3171l1004k1670J9666J948J2834K7687o1746J0492N8486N6448J8638
14224B34619o2632j1056M8990J40812O4548m892K3065j4306p2581l9535M2511
$$ y = [99653, 105268, 55938, 31827, 62905, 76820, 95880, 102202, 120000, 135911, 138554, 122444, 139387, 108459, 159413, 182689, 179209, 130604, 86423, 36812, 40221, 102894, 123243, 165354, 149095, 160373, 200762, 193884, 133705, 90076, 55137, 57665, 96377, 101669, 169557, 193550, 149501, 125851, 140939, 197427, 249635, 219903, 244626, 235734, 273358, 380350, 448344, 452287, 408138, 385839, 416094, 390322, 342032, 213373, 232576, 271436, 279019, 269487, 247137, 236849, 274842, 243629, 206592, 226148, 210414, 141934, 82121, 40917, 60107, 109370, 89814, 109669, 142840, 111836, 90166, 109832, 111780, 124614, 152301, 90555, 101047, 159533, 215981, 234619, 171987, 160931, 209921, 350733, 415281, 410389, 433454, 419148, 346567, 307032, 349543]
14213C49543l9670n8125O7575M9836l0147j09573J6322L6501O4666K4305L1534
14202D02767J05513Q9184Q5323j0583j27680k06871j65920n7645k7526m8226o5827
14191b7491j5222O1486O7171j6324J9514L1506N6958Q5853M1912K5741r402N0310
14179C72012O1638K1950O1545N523m686K4482j3454j26531m2630J5251O529k8371
14167C53258K3415m0885k8226m1241Q672J11398P6617P3768J32472L4553k5070
14156F78731q2511n9722p612p203o5507k0952J4709l0236L9856N6438J9448Q4345
14144F19784J39906J05400J17571J75966K41091L35308M71496N61984N41097L80972
14134C690575J29810j71524m07925n74442n44541n08457m25490l00634j42053
$$ y = [349543, 309873, 251748, 319323, 369159, 339012, 229439, 245761, 282262, 346928, 371233, 402767, 508280, 597464, 682787, 672204, 544524, 337653, 171733, 114088, 86562, 38336, -27491, -42713, 18773, 85944, 69620, 89134, 120640, 177598, 263451, 305363, 331104, 321702, 372012, 433650, 455600, 517145, 522668, 517982, 542464, 529010, 402479, 359849, 375100, 381629, 353258, 376673, 335788, 307562, 266321, 274993, 386391, 463008, 536776, 669248, 703801, 678731, 596220, 536498, 528886, 521683, 456176, 435224, 449933, 419697, 459553, 515991, 535439, 619784, 759690, 865090, 982661, 1158627, 1399718, 1735026, 2206522, 2768506, 3309603, 3690575, 3820385, 3648861, 3240936, 2666494, 2121953, 1613496, 1188006, 887372, 745319]
14125G45319M4814J8628o6222m4072J9770N5625j9053j4070k0745l2249L3540
14114G21285j3892n80Q223o501l238q350J0027K492K7228J4962l2450J784L8810
14101G59800J1838j0026j6312Q303K1992O4304M791m9002m847k1935J6843R302
14089G95051p3198l0143J1407L2142j2160M5390N9578M1571J9096l0768M5213
14078I03179J01632R7062N3876m2936J0887J6379l1873K3039O7349M3768M7351
14067A289713N4805L4290n3253J6307n2352k2418L6058L5790K1027R1331P2474
14056A523772O8729R6210J29162J41271Q0990J33094R9982R285P8693J16295J04688
14045B582171J57817Q4989J83683K31391J65615J62865K51760L08298K51796K71054
$$ y = [745319, 790133, 808761, 742539, 698467, 718237, 773862, 754809, 740739, 719994, 687745, 721285, 707393, 706813, 715036, 708535, 705297, 696947, 706974, 709466, 736694, 751656, 719206, 720990, 759800, 771638, 761612, 745300, 753603, 775595, 839899, 844690, 795688, 790841, 768906, 785749, 795051, 721853, 691710, 703117, 735259, 723099, 768489, 828067, 869638, 888734, 857966, 903179, 1004811, 1101873, 1155749, 1112813, 1123700, 1140079, 1108206, 1131245, 1198594, 1242362, 1289713, 1344518, 1378808, 1325555, 1341862, 1289510, 1267092, 1303150, 1338940, 1359967, 1451298, 1523772, 1592501, 1688711, 1817873, 1959144, 2040134, 2173228, 2273210, 2282495, 2361188, 2477483, 2582171, 2739988, 2824977, 3008660, 3240051, 3405666, 3568531, 3820291, 4128589, 4380385, 4651439]
14035D651439L75613L82651M94068O81613P89784R50323J134006J291820J593966
14026A2345283J834119K019782K178975K365125K499118K618262K929379L570774
14018C2360817M773755O860104J0227599J5543408K3560664L4267993M6303124
14011A73897464N6030420N9205556N2726092L5866305J0017276j8838576m2201832
14004C26702705n5351411n6853906m8487935l5855150k4461250j6318085j1082251
13997G8292717p715353n697664m382110l717376l395476l317581l336731l262889
13989D3467537l103631k786026k387133k035537j776973j562472j331529j247028
13981B7237208j160003j014073r96433r18972r00302p68505p15800o41005n99622
$$ y = [4651439, 5027052, 5409703, 5903771, 6585384, 7375168, 8325491, 9459497, 10751317, 12345283, 14179402, 16199184, 18378159, 20743284, 23242402, 25860664, 28790043, 32360817, 37134572, 43994676, 54222275, 69765683, 93326347, 127594340, 173897464, 229927884, 289133440, 341859532, 377725837, 387743113, 368904537, 326702705, 271351294, 214497388, 166009453, 130154303, 105693053, 89374968, 78292717, 70577364, 64879700, 60497590, 56780214, 53384738, 50067157, 46730426, 43467537, 40363906, 37577880, 35190747, 33155210, 31378237, 29815765, 28484236, 27237208, 26077205, 25063132, 24066699, 23147727, 22247425, 21478920, 20763120, 20122115, 19522493]
13972A9522493n99225n98903n70631m85267m31380m70946n38331m99088m37505
13963A4891217l98241k97729l07442l65526l28418l06426l37441k83468l61500
13954A1905026l41758m00922l21165k67469k32820l21799l57657l30701k55106
13945I075629k66308k70856k26376j88143j72971j77460j46779j85514k26034
13936G215188j79028j69394j89387j17974j66081j34698q7779j12486j20341q4046
13926E853974j38428j53779j51746j45866j28891k4048j21345k13537j52885m1355
13916D582094n0710j01688p8900r4323r4303j00107j13664j20647M407j5424l4371
13905C782364m2120p7446o7398l2448M573m9917m5128m6349J6247r116R766L0195
$$ y = [19522493, 18923268, 18324365, 17753734, 17268467, 16837087, 16366141, 15827810, 15328722, 14891217, 14492976, 14195247, 13887805, 13522279, 13193861, 12887435, 12549994, 12266526, 11905026, 11563268, 11162346, 10841181, 10573712, 10340892, 10019093, 9661436, 9330735, 9075629, 8809321, 8538465, 8312089, 8123946, 7950975, 7773515, 7626736, 7441222, 7215188, 7036160, 6866766, 6677379, 6559405, 6393324, 6258626, 6170847, 6058361, 5938020, 5853974, 5715546, 5561767, 5410021, 5264155, 5135264, 5111216, 4989871, 4776334, 4623449, 4582094, 4531384, 4429696, 4350796, 4256473, 4162170, 4062063, 3948399, 3827752, 3832159, 3816735, 3782364, 3740244, 3662798, 3595400, 3562952, 3567525, 3517608, 3472480, 3426131, 3442378, 3433262, 3443028, 3473223]
13893C473223r348N9439J8160K2877Q8723Q0131J63176K24925K81397L63877M12611
13882E179191L78113K51431L5320j85858l55250n13480n00884m01730l38804k74189
13872C273860k10197j48421q4354r6696q5827j5246Q548k1838l7763J2527J4058
13861B608651M0928p2136r0741l2244j01169j66241j00143j12013r5022j05725
13851A774145n3540J3877j31340q4089J7670M0404m0937l4100M8115l8935j17667
13840A393603o7252J2694J04011l556j6743j175j6043k6017p6097K4526l2563
13829A295388n6286k0115O769R0089J08639k7681k4422O551r88j0486k1105j23784
13817A222569j08441m2001J5246K5094M3930N3611L3705L1784J7100K7338P3995
$$ y = [3473223, 3463875, 3523314, 3541474, 3564351, 3653074, 3733205, 3896381, 4121306, 4402703, 4766580, 5179191, 5557304, 5808735, 5844055, 5658197, 5302947, 4789467, 4288583, 3886853, 3548049, 3273860, 3063663, 2915242, 2830888, 2734192, 2648365, 2633119, 2641667, 2619829, 2582066, 2594593, 2608651, 2649579, 2577443, 2486702, 2454458, 2353289, 2187048, 2086905, 1974892, 1879870, 1774145, 1720605, 1734482, 1603142, 1519053, 1536723, 1577127, 1536190, 1502090, 1550205, 1511270, 1393603, 1326351, 1339045, 1443056, 1439500, 1422757, 1421582, 1405539, 1379522, 1303425, 1327951, 1295388, 1239102, 1218987, 1225756, 1315845, 1424484, 1396803, 1372381, 1378932, 1377944, 1367458, 1346353, 1222569, 1114128, 1072127, 1087373, 1112467, 1156397, 1210008, 1243713, 1275497, 1292597, 1319935, 1393930]
13806A393930N9155o0342r0024j44612p9108p4365n2124l9893k9171p0785o0727
13795G51934M3331M920n0332m5498k2010m3181K4959M4935O65k6433j5556k0576
13783F47158O86l1654j3613P1022K7564n6569m8950R051M9140M6170L0346k6402
13771G03949m7264j7507o7585o2909k1759l4099r604k4821O240n521R90m7642
13759C72468K4075L4670j4635K471J6958O040O8812L3335k5802j8222j8429L0544
13747E12285O0007k6378l6304k0374n377j3880o3084l2752J8937K5905M7552n6844
13735D09693j8005k4388k6004l6971K2484m4359K1232N2010j7066n2939o388O0863
13723C40162L3462M3894K0849m8165n9696p5500q60J9805L1560J1435j6916K258
$$ y = [1393930, 1453085, 1392743, 1302719, 1158107, 1078999, 1004634, 952510, 912617, 883446, 812661, 751934, 795265, 800185, 749853, 704355, 682345, 639164, 664123, 709058, 709723, 683290, 667734, 647158, 647844, 616190, 602577, 673599, 701163, 644594, 595644, 604695, 653835, 700005, 730351, 703949, 656685, 639178, 571593, 508684, 486925, 452826, 443222, 418401, 424641, 419120, 420110, 372468, 396543, 431213, 416578, 419049, 436007, 442047, 510859, 544194, 518392, 500170, 481741, 512285, 572292, 545914, 509610, 489236, 483859, 469979, 406895, 374143, 393080, 418985, 466537, 409693, 391688, 367300, 341296, 304325, 326809, 282450, 303682, 355692, 338626, 285687, 279299, 340162, 373624, 417518, 438367, 390202, 330506, 255006, 254146, 273951, 305511, 316946, 300030, 302288]
13711C02288j606q9546o613R787P6523j2368R817K4176M4822m2299l9011k2883
13699B53087N4912j8548n574K9487O080n1843n2517l2701o096P7775K6047K4228
13687C04337J1182L8089j7166j2567l0323L4356N4454L2028O0848P9723j1903
13676E43058M6244M3888O7538Q9414N6473O8519R1419N2296M5360J0517K7441
13665A142167J00580m3029j16924m9303P1176N4473P177N9019l9488m0781l469
13654A141598r4229J1783k0524j29456r7601p4638p4271j0751p792l1733n5772
13643E56614l7483k2203l1869K976J161o1622k8543p855m804m9571n8908n3378
13631B04515K4013M1355P6327k9515p4006l153J6411j4201J549k4782J7475J920
$$ y = [302288, 300682, 211136, 204523, 214310, 290833, 278465, 288282, 312458, 357280, 314981, 275970, 253087, 307999, 289451, 283877, 313364, 319444, 267601, 215084, 182383, 176287, 254062, 280109, 304337, 315519, 353608, 336442, 323875, 293552, 327908, 382362, 414390, 475238, 554961, 543058, 589302, 633190, 700728, 790142, 846615, 915134, 1006553, 1058849, 1104209, 1114726, 1142167, 1242747, 1199718, 1082794, 1033491, 1104667, 1159140, 1166317, 1225336, 1185848, 1145067, 1141598, 1047369, 1059152, 1038628, 909172, 811571, 736933, 662662, 651911, 644119, 612386, 556614, 519131, 496928, 465059, 468035, 469196, 407574, 379031, 371176, 366372, 316801, 257893, 204515, 228528, 269883, 346210, 316695, 242689, 239536, 255947, 241746, 243295, 218513, 235988, 237908]
13619B37908K2119M3353L4784k0551L0837j26j19397n2798l4509L6058Q5548l5739
13607B27487r340J1964K0303j6702l299m355l619P610L818j3799l0860k0095N6915
13594B26028K544m3529r1084M015M7341j0418m9056n0072J39159M4388L739p2134
13582A50921o6353K8567M9768P2414M6606L3014M029K5075o1936j2496M4440k973
13570C11076n085m6504k3046o305M105J8681J5844K2076J7741M5340K2811J5391
13558C92125J1076J05970J52513J89057K75461L31459L36606K57779J14827k2400
13548B144473q6402k72772k86021k51440k00657j96565j04187o2815q9889j28128
13538D65597n2355m4377J5347j508k5131N395j619k734n1615q9349j6546j004
$$ y = [237908, 260027, 303380, 338164, 317613, 348450, 348324, 228927, 176129, 141620, 177678, 263226, 227487, 218147, 230111, 250414, 233712, 230413, 226058, 222439, 230049, 233867, 220068, 189208, 169113, 226028, 228572, 185043, 93959, 97974, 145315, 134897, 85841, 35769, 174928, 219316, 223055, 150921, 84568, 113135, 162903, 235317, 281923, 314937, 318966, 344041, 282105, 269609, 314049, 311076, 305991, 259487, 236441, 230136, 234241, 252922, 268766, 290842, 308583, 353923, 376734, 392125, 403201, 509171, 661684, 850741, 1126202, 1457661, 1794267, 2052046, 2166873, 2144473, 2058071, 1785299, 1499278, 1247838, 1047181, 850616, 746429, 683614, 593725, 465597, 413242, 368865, 384212, 382704, 357573, 362968, 361349, 358615, 307000, 217651, 201105, 200101]
13526B00101J2101L2240j6678j3733P697J0122l1746q401k8371o5884J2935J13947
13514B24330P1072n5023M812O8521l2298n9134n6673N821J2845K0437J2884p6903
13502A40691o3820k1805M2965M9338L8588L7581j8358m510m418m4413J2010k5131
13490A38718q6026N8136N1167L3478K7315l9189m6554l8104n501L046n432J3397
13478A04451M5994N4407J7659M775j8133o4823m5330L9554M3596K1544J2201j23639
13466I2256n438J2787j4835J1472O743J0047M2073M037J3827K3964l1175J4852
13454A80610k1660j5907O5414r719K3745L8839J8740k5770l5163o9004J5060J9186
13442A84371M3825O1567M1955j5910l9353J2400J3018N2201J539n5582q4909m4953
$$ y = [200101, 212202, 244442, 227764, 214031, 221728, 231850, 200104, 191703, 163332, 97448, 110383, 224330, 295402, 240379, 245191, 313712, 281414, 222280, 165607, 171428, 184273, 204710, 217594, 140691, 76871, 55066, 98031, 147369, 185957, 223538, 205180, 200670, 196252, 151839, 163849, 138718, 52692, 110828, 161995, 195473, 222788, 183599, 137045, 98941, 93440, 96486, 91054, 104451, 150445, 204852, 222511, 227286, 209153, 144330, 99000, 138554, 182150, 203694, 215895, 92256, 86818, 99605, 84770, 96242, 102985, 113032, 155105, 159142, 172969, 196933, 165758, 180610, 158950, 143043, 208457, 198738, 222483, 261322, 280062, 254292, 219129, 150125, 165185, 184371, 228196, 289763, 331718, 315808, 276455, 288855, 301873, 354074, 355613, 300031, 215122, 170169]
13430A70169J5599r519J6965Q3119L9756K9506K0894j8882M617k6301l5877j7056
13418B72990m9507p3338j5482J7427P7974L646M214j11688p6166l501j3184N066
13406C8451K3413N3329k7291j3844K0896L3187L0108K5272o3542m9742N700q18
13394G5119l6839L6113R505m8676M7563L5377L9296K1557o038J6927j7501p1276
13382A01127m2209O2555j4000K9434o7003L3775O4315L7113l8068j5297j2055
13371A39687j6503J7050K1099l7622l8895k6487L2969K785N927J8517K5453K5277
13359A69257J2187j2731K4353j977l918j3135n2621l7110m612K8423O4053m7459
13347A24710q6145M0305J1941j3763k0877p2071J5961J09703Q9584J710j4498
$$ y = [170169, 185768, 176249, 193214, 276333, 316089, 345595, 366489, 347607, 352224, 325923, 290046, 272990, 223483, 150145, 134663, 152090, 230064, 233710, 237924, 126236, 50070, 46569, 33385, 38451, 61864, 115193, 87902, 74058, 94954, 128141, 158249, 183521, 119979, 70237, 75937, 75119, 38280, 74393, 83898, 35222, 82785, 118162, 157458, 179015, 172977, 189904, 172403, 101127, 58918, 121473, 107473, 136907, 69904, 103679, 167994, 205107, 167039, 151742, 139687, 123184, 140234, 161333, 123711, 84816, 58329, 91298, 94083, 100010, 118527, 143980, 169257, 181444, 168713, 193066, 191089, 187171, 174036, 121415, 84305, 79693, 108116, 172169, 124710, 38565, 78870, 90811, 77048, 56171, -15900, 61, 109764, 199348, 201058, 186560]
13336A86560p268n9739l4718Q14J6481K3443j1761j0081j5169N3329N4007k8713
13324A67185q6582k2129K0102j4517K7868L703r431L4226n1751k5269l3750j3941
13312d286P2241M949r460O5931j9735p6152L6770L9142l542n8603J5439J6027
13300G8721j3654O628O312m1507j4240K7157R608J8379o0436m1805j505L2542
13288F200M2555K4545M5101p959n5530K006m6567m5473K0472J638Q7389K8159
13276A02536K2937J6557p5980o9527k4033O1838P6529l5603r9064j3272M0477
13265C395Q9104K362n1235J2934L2745o622P6080j766j8538K3623J4161l2504
13253A43739j3560l271q262l7744l2652j2739J1521K8556m496R870R2500M46k5534
$$ y = [186560, 179292, 119553, 84835, 85649, 102130, 125573, 113812, 103731, 88562, 141891, 195898, 167185, 80603, 58474, 78576, 64059, 91927, 95630, 86199, 120425, 68674, 43405, 9655, -4286, 67955, 72904, 63444, 129375, 109640, 33488, 70258, 109400, 105858, 47255, 62694, 78721, 65067, 71695, 78007, 36500, 22260, 49417, 59025, 77404, 16968, -24837, -26342, 6200, 48755, 73300, 118401, 110442, 54912, 56918, 10351, -35122, -14650, -13012, 74377, 102536, 125473, 142030, 66050, -3477, -27510, 34328, 110857, 75254, -23810, -37082, 3395, 92499, 94861, 43626, 56560, 89305, 82683, 158763, 156997, 138459, 162082, 176243, 143739, 130179, 126908, 118646, 80902, 48250, 35511, 47032, 75588, 71092, 80962, 173462, 173908, 148374]
13240A48374K7702j9892m7425m0901L4613L9968o0206m2480r317j3716M0575N1441
13228A08736k5027j354q726L3518K3516m167L592q815m66p6384l5472K4808K3441
13215E7200j7084j0583o855J6299J1822k7463L3252K0782M807J0114j255j5135
13203G5901r722j3465L1805L5271j3270J315j8807k6188J2667k202k27m2269m9780
13190a8971M8915J14990j8831j1558J0782l0463k4176n3977l9603k457J26152
13179A00803j0949n2893j4180L2870n853j9255K6776l3493j8747N87M9396n3939
13167A123m041N8595J2401K3414j4270j8893O4144K7178m6790j0256m9749j1145
13155C1711K7758k213m3394P4363J7256l9398K3735M8081l2207k3853k600m6255
$$ y = [148374, 176076, 156184, 108759, 67858, 102471, 142439, 82233, 39753, 30436, 16720, 57295, 108736, 83709, 82355, 73629, 107147, 130663, 126496, 130088, 121273, 120807, 44423, 8951, 33759, 57200, 40116, 29533, 22678, 38977, 50799, 23336, 56588, 77370, 82177, 92291, 91036, 75901, 66179, 52714, 84519, 119790, 106520, 107835, 89028, 62840, 75507, 73305, 73078, 30809, -18971, 29944, 144934, 126103, 114545, 125327, 94864, 70688, 16711, -22892, -25349, 100803, 89854, 36961, 22781, 55651, 49798, 30543, 57319, 23826, 5079, 5666, 55062, 1123, -2918, 55677, 68078, 91492, 77222, 58329, 122473, 149651, 102861, 92605, 42856, 31711, 59469, 57256, 13862, 88225, 105481, 66083, 89818, 137899, 105692, 81839, 79239, 32984]
13143C2984l9743P2080P3250M0345m1327m112J5622l6915p3375J0061K2514k708
13131F8676K2737k3636j25789p3229M4548L9447N3515K9989k8320l0060j6315
13120c8437K4019k1401o9828L2399N4462L9736O9971K7055j2265n888K4528q323
13108A16028m71k7619m8577k2717K4177n922K2701M2054J1443J9849K0382k5744
13096A25584j1300M14m7815K1670P8544K7611j2344L6866j249m8365J1155O0666
13084B41437k5615q9559l7586q8422o308O7322L3644K4996n6024L961l8565m2911
13072a3630l0968L9540O737J6671J2711l0697O552J9577j198N4643J032o099l93
13059G4478l4727j8138o352M3710j6895j5913m1671J2460L1484r842k7213M1764
$$ y = [32984, -6759, 65321, 138571, 178916, 137589, 133477, 149099, 112184, 38809, 48870, 71384, 68676, 91413, 67777, -58012, -131241, -86693, -47246, 6269, 36258, 7938, -22122, -38437, -14418, -35819, -105647, -73248, -18786, 20950, 90921, 117976, 105711, 99823, 124351, 116028, 115557, 87938, 39361, 16644, 40821, 34899, 57600, 99654, 111097, 130946, 151328, 125584, 114284, 114698, 66883, 88553, 167097, 194708, 182364, 219230, 217981, 169616, 180771, 241437, 215822, 126263, 88677, 255, -6053, 61269, 94913, 119909, 63885, 67846, 29281, -13630, -44598, -5058, 1679, 18350, 31061, 364, 6916, 26493, 25295, 79938, 80970, 74871, 74478, 39751, 21613, 15261, 58971, 42076, 26163, -15508, -3048, 28436, 18594, -8619, 33145]
13047C3145L3437j3546l5336O0299j0905J2111l1471k5430L3193J8241l4573l3108
13035F057n410n981L479P955K699L5331M9339K3321k0231k6679o3494k3567P1182
13022E4001N5918o2098K476K6107P3832L9167l6516m9515k0991n3504m4529M3068
13010B7416l465o576p708M2170K9523q02l1843l875o357k6307o725N4735q431
12997E1755m11M9732l8013m848n6146n0278n4341k1677N7917J43331Q4573m7942
12985A13652M485L6799m4106J3807m8920r009M1009M1497m5438j5387n0826m2198
12973d635J02335j741o6696j9210l2041L5534Q5120M5805j6728P1J5185l6343
12961A06656n3265j8451k7575j819L1118J0234k3600j7018J9737l8502L7352J806
$$ y = [33145, 66582, 53036, 17700, 77999, 67094, 79205, 47734, 22304, 55497, 73738, 39165, 6057, 647, -5334, -1855, 6100, 8799, 44130, 93469, 116790, 96559, 69880, 6386, -17181, 54001, 109919, 47821, 50297, 76404, 150236, 189403, 152887, 103372, 82381, 28877, -15652, 27416, 23951, 17375, 9667, 51837, 81360, 80558, 48715, 44840, 38483, 12176, 5451, 60186, 51755, 51344, 101076, 63063, 58215, 2069, -48209, -102550, -124227, -66310, 77021, 161594, 113652, 118137, 154936, 110830, 124637, 75717, 66708, 107717, 149214, 103776, 88389, 37563, -4635, 97700, 95959, 29263, 10053, -21988, 13546, 98666, 144471, 127743, 127814, 142999, 106656, 53391, 34940, 7365, 5546, 36664, 46898, 23298, 6280, 26017, -12485, 24867, 26673]
12949B6673p3947P0241J1954J1183O6006K2465k9723k8790l197N846M3850j4709
12937A07852n3691o0110j4266K6123L7470m7913O036J0384M503M4101L4739L5530
12925A30758j8216l1423o4637M3400P1166K6845J1012r695n1322K056j6686j7413
12913G5845k1027m1979j8673M9963K6655o506p440m8545N3078P3531j6796r259
12901A08847n2260N075m6899Q695l308R568J6317L5641L7189n5606l4821J9750
12889D8188p8154J2017J4409l7526j5603j8096L6159R154J3057k5842m4710K4540
12877f2407L2094L018L1011J2270K4869q799l7086J3384n612L4121n5301j9459
12865c7897O3129K9313j4140Q523K5641K4688j0412O7820j07622j1536L7469L4292
$$ y = [26673, -47274, 22967, 34921, 46104, 112110, 134575, 104852, 76062, 72865, 78711, 122561, 107852, 54161, -5949, -20215, 5908, 43378, -4535, 1501, 11885, 16388, 60489, 95228, 130758, 112542, 81119, 16482, 59882, 131048, 157893, 168905, 159210, 107888, 109944, 93258, 75845, 54818, 12839, -5834, 44129, 70784, 64278, 56838, 8293, 61371, 134902, 118106, 108847, 56587, 61662, 14763, 23458, 20150, 29718, 46035, 81676, 118865, 63259, 28438, 48188, -29966, -17949, -3540, -41066, -56669, -74765, -38606, -29452, -16395, -42237, -86947, -62407, -30313, -27295, 3716, 15986, 40855, 32056, -5030, 8354, 2742, 36863, -18438, -37897, 25232, 54545, 40405, 48928, 74569, 99257, 88845, 156665, 49043, 37507, 74976, 109268]
12853A09268j3539L2174O221m3642m3238M8824j606l9516j8165L6691K822M6571
12841A22865J6323k9261k4572l7143j0962K5375P521k971K9825K0462j6787j0830
12829H9845P8963k9275j6463L2211j3664J2014j0440q6019m8784k1664j6331j586
12817c1193J3310K9262L9935M1725r6469o4657N9976M6882J1380L2563l1019M54
12805E2149n390j4532k9202J2888l09L2167L9322L7568q796l0196n1420j0608
12793B3641p3577M238K5895P1867K0717k8991O9043N6935M0283j6947R641P5384
12781B78129L0727R999R0821J51729J28208P7098P8431O7985m757j10534j41485
12770F56351j30659q7849j4496l8935m8356o238k3807n2673k9413M4847p332J0769
$$ y = [109268, 95729, 127903, 134124, 90482, 47244, 96068, 94462, 54946, 36781, 73472, 76294, 122865, 139188, 109927, 85355, 48212, 37250, 62625, 70146, 67175, 97000, 117462, 100675, 89845, 168808, 139533, 123070, 155281, 141617, 153631, 143191, 57172, 8388, -13276, -29607, -31193, -17883, 11379, 51314, 93039, -3430, -68087, -8111, 38771, 50151, 82714, 51695, 52149, 46759, 32227, 3025, 15913, 15604, 47771, 87093, 124661, 115865, 85669, 34249, 23641, -49936, -45698, -19803, 52064, 72781, 43790, 112833, 169768, 210051, 193104, 202745, 278129, 308856, 318855, 409676, 561405, 689613, 766711, 845142, 913127, 908370, 797836, 656351, 525692, 437843, 423347, 384412, 336056, 329818, 306011, 253338, 223925, 268772, 261440, 272209]
12758B72209N9789m2048L1402K7801n4177l0533K3467L7460R883L7598L9940O1314
12746D74105Q5327J57882K15273J24971J18306R9483n764p8487j46233q9456m2578
12735I12829j3549o7315m8096n1050o1896j00410j16333j5791j1340n0553R613
12724C86109k1915o0527r2587O49N2824j6238n398r708L162l3270N5418J06659
12712C65178N1119r571N4036O8340R6398J21399R9029Q0643J2936L048q8266j69442
12700F84847j68546r8478p9011o5842L356L3903k5415o66l3902k1973l2346M981
12688B00908O484K6482j7785r098l7815O639n9231l1962K1336l6052p0127K4121
12676B3900N2308O7375J7009p4850j1425L7085l0614K9801r751l9684L1129j2669
$$ y = [272209, 331998, 289950, 321352, 349153, 294976, 264443, 287910, 325370, 335253, 372851, 412791, 474105, 559432, 717314, 932587, 1057558, 1175864, 1275347, 1269583, 1191096, 1044863, 955407, 912829, 899280, 831965, 783869, 732819, 670923, 570513, 454180, 438389, 427049, 376496, 386109, 364194, 303667, 211080, 211729, 264553, 248315, 242917, 233209, 236371, 203101, 258519, 365178, 416297, 406726, 460762, 529102, 625500, 746899, 845928, 926571, 939507, 942555, 854289, 684847, 516301, 417823, 338812, 272970, 276326, 310229, 284814, 284148, 250246, 228273, 195927, 200908, 207392, 233874, 216089, 206991, 169176, 175815, 116584, 84622, 105958, 69906, -221, 23900, 76208, 143583, 160592, 85742, 74317, 111402, 80788, 110589, 100838, 61154, 92283, 79614]
12664G9614K5268p27k0723r996L8172L3566P1595m3417n8195K8402M7351L2019
12652B22929k1542k5406K3449m330K3219J5521j2939J3387K6602l3344n5114m5436
12640A26996m8537K550k8470j9579N9837L5624l9624o6297M001J146L4488M5329
12628A07464l03j7229J5132K6474q516n4728m1490j3844K9027R087j6647K9078
12616F3505O243n7163l8355m26P2884N3263l6191j5219m6448J1153L3762Q064
12604E5072k9180N2734K6866j7815K7609q513m5550m0884M068l4721R245J6407
12592A5338p996J8403J5089j5862Q180J8838m1269o506J7898o864K845K2841l3269
12579G666N3180O898l1911k6864L7533P6190K130k0393o6100K3343k3813o482
$$ y = [79614, 104882, 104155, 83432, 73436, 111608, 145174, 216769, 173352, 115157, 143559, 190910, 222929, 201387, 175981, 199430, 195100, 218319, 233840, 220901, 234288, 260890, 227546, 172432, 126996, 78459, 81009, 52539, 32960, 92797, 128421, 88797, 22500, 26501, 27647, 62135, 107464, 107161, 89932, 105064, 131538, 123022, 68294, 26804, 12960, 41987, 51074, 34427, 63505, 69748, 12585, -25770, -26196, 46688, 99951, 63760, 48541, 2093, 13246, 47008, 55072, 25892, 78626, 105492, 87677, 115286, 106773, 61223, 20339, 24407, -10314, -1069, 15338, 7342, 25745, 40834, 24972, 33152, 51990, 10721, 4215, 22113, 15249, 18094, 40935, 7666, 60846, 67744, 35833, 8969, 46502, 122692, 124822, 104429, 38329, 61672, 37859, 31377]
12567C1377k1665j1087K5382J3930M3197n0446l4223K0244N7870p960J8157j2060
12555G2716k0696q386O449j248L1063J7404l6245m2843J4484L0767K3583N587
12543I2635J7022J7757p0505n9564n6157r945J0079M8406P8513O0361n2690J3661
12531H9573P583l9306l8379j1495k9183n0769o677O4006M1495K6481Q929R217
12519G1475l0922k7228J1511J3806K878r559L9048k773j8744j6525K8992j625
12507F0334J9977K3414n628j4111M5769l7037l4605K1808m5317p700j9369O239
12495A3774J0022l209j5050j0162M3116O1547l2360l8315m5127k9094O1299O9869
12483H6310k5156l131j3838K0897j5173M6612K2087m3158J1039k149j5629K880
$$ y = [31377, 9712, -1375, 24007, 37937, 81134, 30688, -3535, 16709, 74579, 66619, 84776, 72716, 52020, 43634, 50083, 48835, 79898, 97302, 61057, 18214, 32698, 63465, 87048, 92635, 109657, 127414, 56909, -2655, -58812, -68757, -58678, -10272, 68241, 128602, 75912, 89573, 97156, 57850, 19471, 7976, -21207, -71976, -78653, -14647, 26848, 53329, 62258, 71475, 40553, 13325, 24836, 38642, 41520, 31961, 71009, 68236, 49492, 32967, 61959, 60334, 80311, 103725, 98097, 83986, 129755, 92718, 58113, 79921, 34604, 26904, 7535, 13774, 23796, 20587, 5537, -4625, 38491, 100038, 67678, 29363, -15764, -44858, 16441, 86310, 61154, 58023, 44185, 65082, 49909, 96521, 118608, 75450, 86489, 84340, 68711, 71591]
12471G1591L0979K9324Q09j3924j5456J9442k5733j7401o4002M1946L3326j5950
12459G4951O9545k8644m3267l5936J5644N5459l0098N6570j1176o4265p6879k7556
12447d5652l3531K1436J1942Q1262M276J8632l1099j5387J3484K2927qP786J9838
12434G5906j0274m486J1842J481j541l6509K0485L6839j8347l985j4451J5475
12422G2435K5247J5634r6063J9881O3179n250l9444j2491M0648j9771n193L7589
12410I6401m7427j2450L9388M9302L2174l8412Q176N614O696N480m673l2844J8443
12397A25868K4907n1303k1219j2653L7188K4959o6755L100j2437k1972j1454K0083
12385C8312l6579j7447p181m0933j0119N4449J4175J3241K5440k8908N81O3399
$$ y = [71591, 102570, 131894, 132703, 118779, 103323, 122765, 97032, 79631, 15629, 57575, 90901, 74951, 144496, 115852, 72585, 36649, 52293, 107752, 77654, 134224, 123048, 58783, -18096, -45652, -79183, -57747, -45805, 35457, 39733, 58365, 27266, 11879, 25363, 48290, 48282, 56068, 75906, 65632, 61146, 72988, 74469, 72928, 36419, 56904, 93743, 75396, 71411, 56960, 72435, 97682, 113316, 17253, 37134, 100313, 95063, 55619, 43128, 83776, 64005, 58812, 96401, 48974, 36524, 75912, 125214, 157388, 118976, 127152, 132766, 139462, 144942, 140269, 107425, 125868, 150775, 99472, 78253, 65600, 102788, 127747, 60992, 64092, 51655, 29683, 18229, 38312, 1733, -15714, -22895, -63828, -73947, -19498, -5323, 7918, 33358, 4450, 5031, 68430]
12373F8430k8224n3334K9443L7891j7155n5957k569K8030R803j0145M1131n3946
12361f602O3013L3676m8684N02r620J4408J07744k3057n1112k4199K3596J1146
12349I0811k6613K1695j4382k0375j7960k2367j3185J1937J6233n553j9810m6995
12337d6564K6463L2790M6828j840n0350k2863J9401N5018l182L339K9652M3694
12325A32386k1879O1562L444l1119q9063K2176K7165R087K9035K5105j5382j9037
12313A33480o3509j4440k6840j4255M0491o735k524j6487K5602p0305k758m8087
12301f6367k2679M4987K8998j182K784K8871r071r0973K0647K9044N6035k3732
12289b638n4008J5808K1685R16O3409k7642n8572M4651O6319n054m1738m176K1207
$$ y = [68430, 40206, -13128, 16315, 54206, 37051, -18906, -21475, 6555, 16358, 6213, 47344, -6602, 56411, 90087, 41403, 41905, 32285, 46693, 154437, 131380, 80268, 56069, 79665, 90811, 64198, 85893, 71511, 51136, 33176, 10809, -2376, 9561, 25794, 20241, 431, -46564, -20101, 12689, 59517, 57677, 7327, -15536, 3865, 58883, 55701, 59040, 88692, 132386, 110507, 172069, 175513, 144394, 55331, 77507, 104672, 113759, 142794, 167899, 152517, 133480, 69971, 55531, 28691, 14436, 54927, 48192, 45668, 29181, 54783, -15522, -18280, -66367, -89046, -44059, -15061, -16243, -13459, 15412, 6341, -84632, -63985, -34941, 21094, -2638, -56646, -40838, -19153, -18237, 45172, 17530, -41042, 3609, 69928, 64874, 23136, 18960, 40167]
12276D0167P0743k0572j3150j3789k0424l4550N824K5128m9435J9928n137N128
12264I861k9617m6803p045R0049j2267k8733L3556K5374k0390q878n3739Q1323
12252C2691J7067l5431l3221l6502L2468P8669J1645j7793J0191o6857l8675K1420
12240b4328P6059J4563J1990j07230j21549Q6560N2209k3636j8572k7002N0087
12229c0849M0269K6537j395k1362k954P027k9274L1691J1500P292j0080O2244
12217I0646K54n5273O578j4541p4590k1106K8052N2058Q256Q177l9487L0533N3724
12204G3281L1716n2737j8572k021l1262o1147K556J732L1093P1328J0897o2873
12192f009q626q307J3319m3955L4088J4896J0426m3676k4944j989O5182Q3463
$$ y = [40167, 110910, 90338, 77188, 63399, 42975, 8425, 14249, 39377, -10058, 9870, 4733, 9861, -19756, -66559, -73604, 16445, 4178, -24555, 9001, 34375, 13985, 5107, -48632, 32691, 49758, 14327, -18894, -55396, -22928, 55741, 67386, 49593, 59784, -7073, -45748, -24328, 51731, 66294, 78284, -28946, -150495, -63935, -11726, -35362, -53934, -80936, -30849, 9420, 35957, 34562, 13200, 10246, 17273, -12001, 19690, 31190, 38482, 28402, 90646, 90900, 35627, 42205, 27664, -46926, -68032, -39980, 12078, 20334, 28511, -10976, 19557, 73281, 104997, 52260, 33688, 31667, 405, -60742, -58186, -56454, -25361, 45967, 56864, -6009, -14635, -22942, -9623, -53578, -19490, -4594, 5832, -37844, -62788, -64777, 405, 83868]
12180H3868k8380o4152q3109J3280Q0032N0525k1789p5261k424J5068K1k7236
12168e9557j1530r554L2363l5365Q862L7298P223m2363K8297K4866O562L6290
12156B3392M9811k7978m9929K6977K8477P309P213M4323J6980m6047l3345P7782
12144A24965l818q0619r7526j8493Q2921O256m7330j63n06J3679K8886K0127m0364
12131a1985k0090N861l5506k0881l8906K5609N9059J3830k211K6864L2226K5757
12119E9627n786L8751m5150p1886j4075M3746N5495J2432k4973k0739K3967J6469
12107F7878k2527j1907k9588M6816R910Q37m8614j1063j925J2397K8034k5981
12095A4267q231p2666r053L3547r789n1668n269L5333M5600K0093j4355m8911
$$ y = [83868, 55488, -8664, -91773, -78493, 1539, 52064, 30275, -44986, -47410, -32342, -32321, -59557, -71087, -80641, -48278, -83643, -74781, -37483, -30260, -72623, -44326, -19460, -12898, 23392, 73203, 45225, -4704, 22273, 50750, 58059, 65272, 109595, 126575, 80528, 47183, 124965, 121147, 40528, -56998, -75491, 7430, 13686, -33644, -33807, -34313, -20634, 8252, 28379, -11985, -32075, -26214, -61720, -82601, -121507, -95898, -36839, -23009, -25220, 1644, 33870, 59627, 53841, 92592, 47442, -24444, -38519, 5227, 60722, 73154, 48181, 27442, 51409, 67878, 45351, 33444, 3856, 50672, 60582, 61419, 12805, 1742, -183, 12214, 40248, 14267, 6036, -66630, -75683, -42136, -51925, -103593, -108862, -73529, -27929, -7836, -22191, -71102]
12083g1102n92q503J1523k2477m9061P1400N3897n5660k2890K8325N8335j5795
12071b2600K3361O951k8632j1229j4534j4713N5724M7330k979l8397J7091J6683
12059C4056O7778L8211J4305P5907L0954N128l6991j2789n7724k4918M5955p9900
12047I9972p1938N4903M6632M1111n496M9381L1192n461l8330L6808k171j8814
12035B17789k893J00399k6788o2419J1890p829l5311p0206k4669K7144k1207j6294
12023H9606L3987J2599L175K4752M9485j7246j6346l090M0817o9537k6082J2869
12011A34989K5197l7728Q231L7015n1999n082J5214k1173j1441l2531k8840L6249
11999F8101N0022N7777N6139M5148L6642K9659n222j6149r74j1451m049m3386
$$ y = [-71102, -71694, -80197, -68674, -91151, -140212, -68812, -14915, -70575, -93465, -65140, -6805, -22600, 761, 7712, -20920, -32149, -46683, -61396, -5672, 41658, 38679, 282, 17373, 34056, 101834, 140045, 154350, 230257, 261211, 266339, 229348, 216559, 158835, 133917, 179872, 99972, 28034, 82937, 129569, 170680, 165184, 214565, 245757, 240296, 201966, 238774, 236603, 217789, 214896, 315295, 288507, 226088, 237978, 230149, 194838, 124632, 99963, 127107, 105900, 89606, 123593, 136192, 139367, 164119, 213604, 196358, 180012, 176922, 217739, 148202, 122120, 134989, 160186, 122458, 130689, 167704, 115705, 110623, 125837, 104664, 93223, 60692, 31852, 68101, 118123, 175900, 232039, 277187, 313829, 343488, 338266, 322117, 321143, 309692, 305643, 262257]
11987B62257o8814j3917K2081k9522l5878L1727j212j5673K5986M911J2531l53
11975A94124k7776L8192J0873l0433n0458p984q261n2255M720J5035q795p299
11963F9683K344J3095k4597m5481n3361k5764N3751M0738l8571P906M7362l4877
11951A2228l6033K4790K8233J1927j4292l831Q982P5188j9041l0866J7624j8950
11939E5959k3569k257q270P78J2627K0103m7040O659L5413L2937K6644r867l1576
11926F8541K8676J383k158n2117o4953l5101m9823k4336L0898J00539N7252k5903
11914C2898K0223j3740m9628j4090O274p7115j7870Q5094J3966L5088O4590O0677
11902A46367k4210r486o649n560j5949j3980k8142o9784k5015J4395P7756N2659
$$ y = [262257, 193443, 179526, 201607, 172085, 136207, 167934, 166722, 151049, 177035, 181946, 194477, 194124, 166348, 204540, 215413, 184980, 134522, 126538, 118277, 66022, 70742, 85777, 76982, 69683, 72027, 85122, 60525, 15044, -38317, -64081, -10330, 30408, -8163, -257, 47105, 12228, -23805, 985, 29218, 41145, 26853, 23022, 32004, 107192, 88151, 57285, 74909, 55959, 32390, 30133, 21863, 22641, 35268, 55371, 8331, 14990, 50403, 83340, 109984, 100117, 68541, 97217, 98600, 96442, 44325, -20628, -55729, -105552, -129888, -98990, 1549, 58801, 32898, 53121, 39381, -10247, -24337, -18063, -95178, -113048, -27954, -13988, 21100, 85690, 146367, 122157, 112671, 106022, 100462, 84513, 70533, 42391, -27393, -52408, -38013, 39743, 92402]
11890I2402o6031o4315l5034j6699K0325j4526L0203O7546m8521L9124K016l6177
11878b9687J6572L5435L0635Q833m3465l0294l4735j9053k5782L0823J9735j7816
11866e8799m5531K7649j3141J5336O0406k849j6397J659L006l3396l5445L9958
11854e7544M7532k6887R897Q1907J7445R185J7719l3609p3450O0397O004n7895
11842G01k0553k38j0034k0169j633J2518J6637O7237k2025l8838M342l8226q72
11829e1153J1571l2366j1634j6007N9974K3038M5115m2560k1876p916N2809L1894
11817D0889N552o3108p0797n5007k5394O7925K1949L4986L503r122l458k8457
11805h0539o5266j7835L0862Q5352j5258j1994P3009M5553l8276j2715n902J0360
$$ y = [92402, 26371, -37944, -72978, -89677, -69352, -83878, -53675, 13871, -34650, 4474, 6490, -29687, -13115, 22320, 52955, 61788, 18323, -11971, -46706, -65759, -91541, -60718, -40983, -58799, -104330, -76681, -89822, -74486, -14080, -16929, -33326, -31667, -28661, -62057, -97502, -57544, -10012, -36899, -27002, 54905, 72350, 81535, 99254, 65645, -7805, 52592, 58596, 701, -19852, -20090, -30124, -50293, -51926, -39408, -22771, 44466, 22441, -16397, -12055, -50281, -51153, -39582, -71948, -83582, -99589, -39615, -16577, 28538, -14022, -35898, -43814, 8995, 40889, 46441, -16667, -87464, -142471, -167865, -99940, -77991, -43005, -39502, -48624, -52082, -80539, -145805, -163640, -132778, -47426, -62684, -74678, -1669, 43884, 5608, -7107, -13009, -2649]
11793b649p0361L1109K5467m7581P438J271j9600n0281J8210O031L5239L7806
11781b7901N1795l5336k1402J9719j6763j1682j6889o1303J3729O8437J8234M4973
11769B5611l704l0251k5310j3321m7051J6009N4464M9096l0609N0528K2096k2942
11757D4616n2249m3431L2621L9025K217J3085l1941J8472p082K1623N8515K1522
11745A16993Q326J0553l2461o6232n2662j9528N4430J7092l6236m5744o6704M8356
11733f3817K6133M6985k3572m0591M9614N8745N2754N8506J546m5310j6743k3491
11721H0759n8524j5458N7569k8846p6858j2163K1606l0416k6876j2166O6854L5889
11709A370k5587P401n3691n1187j6131J9106P2514L416M6311L4838K8071r136
$$ y = [-2649, -73010, -41901, -16434, -64015, -56577, -55306, -74906, -125187, -106977, -100946, -65707, -27901, 23894, -11442, -32844, -13125, -29888, -41570, -58459, -119762, -106033, -37596, -19362, 25611, 21907, -8344, -33654, -46975, -94026, -78017, -23553, 25543, -5066, 45462, 67558, 44616, -7633, -51064, -18443, 20582, 22799, 35884, 3943, 22415, 15333, 36956, 95471, 116993, 125319, 135872, 103411, 37179, -15483, -35011, 19419, 36511, 275, -45469, -112173, -63817, -37684, 9301, -14271, -54862, -5248, 53497, 106251, 164757, 166303, 120993, 104250, 80759, 22235, 6777, 64346, 35500, -41358, -53521, -31915, -62331, -89207, -101373, -34519, 1370, -24217, -16816, -70507, -121694, -137825, -118719, -46205, -42789, 3522, 38360, 66431, 57295]
11697E7295k475k8962k2053M8159L0519J2079m3120p5387n873R218L515J2154
11685d931j6121N1588N9272l6072l2190M901J4664k1156J4068L3569m5113k9318
11673f839Q5289L7570k9321j8497j7942l2575N2915R84m2351o449L0798M9138
11661A02720p816j1889K8949o4823q3771J333M6221j5139P392O2991K2302n0485
11649C7985m2521k4719J2531k167R462J5537J709K7684r913j757l2901j3k352
11636a1435q219K3071j144L5592J4531l2884j7977J7744J3457k0191j6508m501
11624h464j6737r894l6195Q057L7545k3181k0062o2430K235O0767R3838j4930
11612A0549k4090l0523N6371M9760l2640m1449k1913J5161N2922J0288j7770K578
$$ y = [57295, 54820, 25858, 3805, 51964, 82483, 94562, 51442, -23945, -29818, -20600, -17085, -4931, -21052, 30536, 89808, 53736, 21546, 26447, 41111, 19955, 34023, 67592, 22479, -6839, 78450, 116020, 86699, 68202, 50260, 17685, 70600, 71584, 29233, 22784, 53582, 102720, 94904, 83015, 111964, 47141, -36630, -35297, 10924, -4215, 3177, 66168, 88470, 37985, -4536, -29255, -16724, -18891, -9429, 6108, 7817, 35501, 25588, 23831, -9070, -9083, -11435, -19654, 3417, 2273, 37865, 52396, 19512, 1535, 19279, 32736, 12545, -3963, -8464, -25201, -35095, -71290, -63233, -25688, -48869, -68931, -131361, -129126, -68359, 25479, 10549, -13541, -44064, 12307, 62067, 29427, -12022, -33935, -18774, 34148, 44436, 26666, 29244]
11600B9244j4635l0515k3239K0944R4142M9226l608n4661n1625M0218M8154q359
11588I5286o3762l5063m0385K6183j2163m9054M2371M3042o593m5326k5540N6910
11576a4094N2854K3314o193P511k8172m2148Q020n629P61o3376J5413L7582j7091
11563c1248j5986n541k7590m3731K5568P1292k6562k8945J3291M4899L6383J6052
11551B7882l1431M0439K1680K683p0558o8773k3557N7923P340J0545J7593l5394
11539d3628L786N2338K4585K7219o7774o9103M8968P1032J1087o5123k359J6551
11527G579J5713o5015J0972K6075L715Q590L623l3482M3854K2589L9098K0303
11515A03614l0283N5240K2053m0992r2931j4083j9099j6757m307J042L14O8979
$$ y = [29244, 14609, -15906, -39145, -18201, 75941, 125167, 121559, 66898, 15273, 55491, 103645, 95286, 31524, -3539, -43924, -17741, -29904, -78958, -36587, 6455, -138, -45464, -71004, -14094, 38760, 62074, 55881, 63392, 35220, -6928, 1092, -4537, -3776, -67152, -51739, -14157, -31248, -47234, -52775, -80365, -124096, -98528, -27236, -53798, -82743, -69452, -24553, 11830, 27882, -3549, 36890, 58570, 61253, -9305, -78078, -101635, -43712, -36372, -25827, -8234, -43628, -39842, 12496, 37081, 64300, -3474, -72577, -23609, 47423, 58510, -6613, -8972, 7579, 23292, -41723, -30751, -4676, -961, 7629, 11252, -22230, 21624, 44213, 83311, 103614, 73331, 128571, 150624, 109632, 16701, 2618, -16481, -33238, -37545, -36503, -36189, 32790]
11503C2790j6634M959J2415l8185M1823O8779r623n8666k235k2446r9060j3116
11491i9199M1488N4078M8645M1168k6324j6094J5508l1162m8j2091m2706o3579
11479i0316N1540L2240l814j2996j7657J7823J2009l4719M638J3985q6917o2171
11467a76355j7058L8717O2952L7528L1192M9204n0089l1406j7808P64M231L4899
11455c3229L6863n817l7060l4638r0689r421M3310L9633K1210O0153k4482j8558
11443e2725L7801j6011m5964M3132Q4002K0324l8750j9512N1582K4668K8935J4336
11431A31818L9577m1084j20982l4092M5977K2958l7170n6833k0477k2063M6880
11420d5491M2349M7844p5684r979r282k8510r963J1305L2453J4911j6794J3441
$$ y = [32790, 16156, 21115, 33530, -4655, 37168, 105947, 96324, 37658, 35423, 12977, -86083, -99199, -57711, -3633, 45012, 86180, 59856, 43762, 59270, 28108, 28060, 15969, -26737, -90316, -38776, -6536, -10350, -23346, -41003, -23180, -11171, -45890, -41252, -27267, -114184, -176355, -193413, -154696, -91744, -54216, -23024, 26180, -23909, -55315, -73123, -72359, -68128, -33229, 3634, -2183, -39243, -73881, -164570, -173991, -130681, -91048, -69838, -9685, -34167, -52725, -14924, -30935, -76899, -33767, 50235, 70559, 31809, 12297, 63879, 88547, 117482, 131818, 171395, 130311, 9329, -24763, 21214, 44172, 7002, -49831, -70308, -92371, -45491, -3142, 44702, -30982, -40961, -50243, -78753, -88716, -77411, -44958, -30047, -46841, -33400]
11408c3400L1258l0528k6381m5195k1628M1713K4311J606J2606L5293K1547M2972
11396E4174P937j6510k3891K7123k2777O9776m1377l3051K7388M6863n865o4432
11384B5358l758l2493m3057J8399J8141J1844J031M5938k2998l6732O867m6465
11372e7925L1129J05495j8574n6246k5555k7518R776L715J1163m68J6232N96o6341
11359g4521r518N755k6291N024P0885N700n6366k4838N0385J1245L6046j0375
11347a6869L4628J3370l6872n8801n47L1279O8224J6422n3736p1055j3968N1040
11335c6885J4372l7550j628O9641j9985k9841K0910j4739m154l3048o656L0815
11323d8748J2235K7906K2240k2758K047M5132K2871K0192P7965J6600r1853l8184
$$ y = [-33400, -2142, -32670, -59051, -104246, -125874, -84161, -59850, -58244, -45638, -10345, 11202, 54174, 62111, 45601, 21710, 48833, 26056, 95832, 54455, 21404, 48792, 95655, 89790, 25358, 21600, -10893, -53950, -35551, -17410, -5566, -4535, 41403, 18405, -18327, -11460, -57925, -26796, 78699, 60125, 3879, -21676, -49194, -39418, -35703, -24540, -25008, -8776, -8180, -74521, -84039, -78284, -104575, -99551, -28666, -22966, -79332, -104170, -53785, -42540, -6494, -16869, 17759, 31129, -5743, -64544, -65091, -33812, 34412, 50834, -2902, -73957, -87925, -36885, -22513, -60063, -61691, 7950, -12035, -41876, -20966, -35705, -39859, -72907, -79563, -48748, -36513, -8607, 13633, -9125, -7078, 38054, 60925, 81117, 159082, 175682, 83829, 45645]
11311D5645m7896q3053J3240O3143K2087j5554l7665J0043N203M4701k1375k5412
11299b6893j8175K3674K0602k9481K5909O4363L7333m7676m1162M9027o1955n6690
11287f1124q446P029p000L8100k1784p4147k691N9966P3342l8536k8359L3580
11275c0070K2864L8097M6137J6878m494L0451J2358k9493j09791q7098J4077p546
11263h7630l5524N0091J7924J5114l0846j2004O2124k348k1031K4954k3550L2742
11251i984M519n3502l637L9692Q098o7135o0287m256L0305j300l9295J0675k46
11238a46353N1085M5068L5284M8445l6752p6401J5628M0138k3194n0400N9192
11227c8260Q4662j8344n2381m0085k3764k7926L9544Q6982L0624O79J7218k9098
$$ y = [45645, -2251, -85304, -72064, -8921, 13166, -2388, -40053, -30010, -24807, 19894, -1481, -26893, -45068, -21394, -792, -30273, -4364, 59999, 97332, 49656, 8494, 57521, -4434, -61124, -69570, -62541, -69541, -31441, -53225, -127372, -130063, -70097, 3245, -35291, -63650, -30070, -7206, 30891, 77028, 93906, 89412, 119863, 132221, 102728, -7063, -94161, -80084, -87630, -123154, -73063, -55139, -40025, -70871, -82875, -20751, -23099, -44130, -19176, -42726, -9984, -5465, -58967, -62604, -22912, -14814, -81949, -142236, -146492, -116187, -117487, -156782, -146107, -146353, -95268, -50200, -14916, 33529, -3223, -79624, -63996, -23858, -47052, -97452, -38260, 46402, 28058, -24323, -64408, -88172, -116098, -76554, 10428, 41052, 41731, 58949, 29851]
11215B9851l4897k1447q130N123n231J2450K2759j8125n4263m3224R095O5088
11203d0951M3558l2524M577n9143k7483N8748R43J7979J9412K0365L373k2419
11191a3565m0187J6108J1282n419L6224J2122J156l297m1758r949J0979M575N854
11178a5875m8125j8703J2606m0779K851P2085O2567J7304Q08J9108o110j9312
11166C8425M296k4936J8535j6531l2178m9052n1752j813M1874J6958K0984j6651
11154e1841O3262o401j9528J0891l5383q939K3324N1264L1987j6976k6258l9684
11142b4282m6069l4234M8744j1492n5476K2461J07018K4845o3206l4342J3621
11131e2412K3689M0478N968l3389l2997m3179l15O6407j4688l4224J3176O5209
$$ y = [29851, -5046, -26493, -34623, -29500, -34731, -22281, 478, -17647, -71910, -115134, -106039, -40951, 2607, -29917, -25340, -84483, -111966, -53218, -52275, -34296, -14884, 5481, 8854, -13565, -53752, -37644, -26362, -31781, 4443, 16565, 17721, 14424, -27334, -37283, -26304, -21729, -15875, -64000, -82703, -70097, -110876, -108025, -35940, 26627, 43931, 44739, 63847, 57737, 38425, 42721, 17785, 36320, 19789, -12389, -61441, -113193, -115006, -73132, -56174, -35190, -51841, 11421, 5020, -14508, -3617, -39000, -47939, -24615, 26649, 58636, 41660, 15402, -24282, -70351, -104585, -55841, -67333, -122809, -100348, 6670, 31515, -31691, -66033, -52412, -28723, 11755, 17723, -15666, -48663, -91842, -92157, -25750, -40438, -74662, -61486, 3723]
11119C723j1309L0904L9592L8592J8787n4350j5048k337p9040l6410m1914M115
11107a04695J03685L23k4196k8491n935P07J8721N2707R112o2474q3350K8578
11095i5308J08128N5903j0688j0392j2936J003o9448k6257P945j9154n706M9170
11083b7740O9968j2223q3426n8692q886L8582j7732o1024K3718P3644J0746q172
11071f1237k1889P345M3137J1815j5449J8022j8774r654o297J7162L4172j4856
11059a6503m3043j7176j4037K9189P4911k2617k1680N7965Q76M4189J658m859
11047F8873l6474j0354O586r691k3847J6091K4588k0230k1787n5291R587O7339
11035A5390r988j6605l9530r264M8956L3478l1915J0391j4853P107Q0501o632
$$ y = [3723, -7586, 23318, 62910, 101502, 120289, 65939, 50891, 48554, -30486, -66896, -108810, -104695, -1010, -687, -24883, -53374, -59309, -58602, -39881, 12826, 21938, -40536, -123886, -95308, 12820, 68723, 58035, 47643, 34707, 35710, -33738, -59995, -52050, -71204, -76910, -27740, 42228, 30005, -53421, -112113, -120999, -82417, -100149, -161173, -137455, -63811, -53065, -61237, -83126, -75781, -32644, -20829, -36278, -18256, -37030, -46684, -52981, -35819, -1647, -16503, -59546, -76722, -90759, -61570, 13341, -9276, -30956, 27009, 27885, 72074, 73732, 68873, 32399, 22045, 28631, 18940, -4907, 11184, 35772, 15542, -6245, -61536, -51949, 15390, 5402, -11203, -50733, -59997, -11041, 22437, -9478, 913, -13940, -6833, 73668, 67036]
11023F7036m6315N591j5793m6866M3131L0688J7855L1717j4807o2821m9631M5140
11011D925o523l7271M329L2554K6818j2139j3781K4639K2951M253j243k5390k4866
10998g44k0704L80M6166J2207n005j7872r5634o928O5379N2233J3515l6663j8541
10985a2211Q924n0083R544N0792M420N3748P7456j7336o2633l1990K4598O6449
10973A21678M0115J6459m0109m9029j9459M43K5283m4726m2700k2783K5532L3870
10961D4574R400J3643q049n5006p6536L6960L6328J09459Q0229n6957o6928J0635
10949G7752k7241l2421k3o7856m0846J9606M5410R8512L3465o1427o4295k0987
10937d0351M6768j1204N4061K3530l0963j8552j8661q0533l3394M5398P9388N031
$$ y = [67036, 20721, 26312, 10519, -36347, 6784, 37472, 55327, 87044, 72237, 9416, -40215, 4925, -1598, -38869, -34540, -1986, 24832, 12693, -1088, 23551, 46502, 50755, 49512, 24122, -744, -21448, -21068, 25098, 37305, 32300, 14428, -81206, -88134, -22755, 29478, 42993, 6330, -12211, -3287, -53370, -43826, 6966, 11386, 65134, 142590, 125254, 62621, 30631, 55229, 121678, 161793, 178252, 138143, 89114, 69655, 70098, 95381, 50655, 7955, -14828, 10704, 44574, 53974, 67617, 59568, 4562, -71974, -35014, 1314, 110773, 191002, 134045, 67117, 77752, 50511, 18090, 18067, -49789, -90635, -71029, -25619, 72893, 106358, 44931, -19364, -40351, 6417, -4787, 49274, 72804, 41841, 23289, 4628, -75905, -109299, -63901, 15487, 20518]
10925B0518J3435L7854J1038L3871m2102r5377o0980K9979K7571O0943O5202Q790
10913A10742m6418j0893K5499P427l6496J5494L846K3731p935l6463j2678m518
10901C1338l6036m8286M1656K0423L2984K9114l572J8944J1252j3930k0436j5970
10889D7481K6560m3358l6067k5345L5936K257M9081O0895k0409k7506m3358L5165
10877F1332k6243k7312M3615l567K2004K1815O018j4822p4337j9576Q8569N1821
10865A29317j9905o0008J8295N6999k592K4514m723J0572l4239p9582l5867q572
10853e791L4532n4274m1484K3907L1765J5025J4193J6675m6299k4348j2555R88
10841d7666M2342L9668K0006l2461l4839J8385j0835O291J9460M471K2717O894
$$ y = [20518, 33953, 71807, 82845, 116716, 74614, -20763, -81743, -51764, -24193, 36750, 101952, 110742, 64324, 53431, 78930, 86357, 49861, 65355, 69201, 92932, 84997, 48534, 35856, 31338, -4698, -52984, -11328, 9095, 42079, 71193, 67621, 86565, 97817, 83887, 63451, 47481, 74041, 30683, -5384, -30729, 5207, 7464, 56545, 117440, 97031, 69525, 26167, 61332, 35089, 7777, 51392, 47825, 69829, 91644, 97662, 82840, 8503, -11073, 77496, 129317, 109412, 49404, 67699, 124698, 122106, 146620, 141897, 152469, 118230, 38648, 2781, -5791, 28741, -25533, -67017, -43110, -11345, 3680, 17873, 34548, -11751, -36099, -48654, -47666, -5324, 34344, 54350, 21889, -12950, 5435, -5400, 891, 20351, 24822, 47539, 54433]
10829E4433r306l7621j561N0549n0117l4188o218n1075L4525M1677Q679J548k3191
10816b1866J0374K5735O5120j5733K073K368j3108J6792m6225p1639l2955M4677
10804c4387P5886L7750K6357J3310l094r973n9775j8000p234P312J1668k2815
10792A7005K6233K6558L2478k0793q880J7172k2468j0047P594j0706m5136J1680
10780B0690M1041m5899n8455l1657n491M7518k2756Q138O865q434M5302R2450
10768H9312K6181l1074n7910K4812j4568n8975J9850K020L4082L0410K7061m5277
10756D5924n229K2779l082l9506R600L1323K7166J20660O378J8039J1309J62976
10744D08337K22606K80282L88796M35074L13689J74228O0965j4092j5228Q1565
$$ y = [54433, 45127, 7506, 5945, 56494, 6377, -27811, -34029, -85104, -50579, -8902, -223, 1325, -21866, -11492, 14243, 79363, 63630, 65703, 68071, 54963, 71755, 25530, -46109, -79064, -34387, 41499, 79249, 105606, 118916, 115822, 105849, 46074, 28074, 20840, 28152, 39820, 17005, 43238, 69796, 102274, 81481, 72601, 89773, 67305, 57258, 64852, 54146, 9010, 20690, 61731, 15832, -42623, -74280, -79771, -32253, -55009, -46871, -40006, -48440, -3138, 89312, 115493, 84419, 26509, 51321, 36753, -22222, -2372, -352, 33730, 64140, 91201, 45924, 40695, 63474, 60392, 20886, 30486, 61809, 88975, 209635, 216013, 234052, 245361, 408337, 630943, 911225, 1300021, 1735095, 2048784, 2223012, 2283977, 2269885, 2254657, 2336222]
10734B336222P1283P506j06819k21931l80048l69277k26485k25577j80069k6073
10724F78732m2133q0156j04362o6615l734J2279K574j7517l7599j7992N5101k2520
10712C56058n7886o3832p1110k3827L5648J1209m5682l0399k1902j5352J2172
10701H5097r322L7831P0968J4813J9205k7136j514j2791r373O8690q273q0554
10689A47641k1349j072J9260J2461k050R8566l1082l7088m5024p785J0319k1776
10677A21021l4322p6188K1582J23871M7110n7108j06303l8717R1959O367k8185
10666G1087k8355K2172L9213K020l3250j503j5774j6186K9598R865j3713l5673
10654B9501r7065k772k4039O2117J9404Q457j3316l0052K8032P7836M1998K5748
$$ y = [2336222, 2407505, 2415011, 2308192, 2086261, 1706213, 1336936, 1110451, 884874, 704805, 678732, 636599, 556443, 452081, 385466, 381732, 394011, 396585, 379068, 341469, 323477, 378578, 356058, 298172, 234340, 163230, 139403, 175051, 186260, 140578, 110179, 88277, 72925, 85097, 75775, 113606, 184574, 199387, 218592, 191456, 189942, 177151, 167778, 236468, 228195, 147641, 126292, 125220, 144480, 156941, 154891, 253457, 222375, 185287, 140263, 132478, 142797, 121021, 86699, 10511, 32093, 155964, 203074, 145966, 39663, 946, 92905, 99272, 71087, 42732, 64904, 104117, 106137, 72887, 71384, 55610, 39424, 69022, 78887, 65174, 29501, -67564, -70336, -94375, -32258, -12854, -4397, -17713, -47765, -19733, 58103, 100101, 125849]
10642A25849L2454n8080o9904k0810J5353J4501m0477n7428O606M4498K908m7519
10630e2049K0579J12558P8714k6246o4418R557j5669J3788J4989p2179p8830P5840
10618A6634O1834r841n1557l1514J1215M4264N4864K4518N494m6099n6581L4368
10606E7599K1311q358m293J6310P8808L1560m3336n9075k6508n035j2903N32M4676
10593I1288J9275P2315J37846N0192j4336J8403L3283m6562o145n3517j004O6808
10581C67846k3872M295k1196m9937j8153n1094k1515p634l8517J0993l9220n734
10569A06262L5550k7792r0292o3100L9141L0967k9861n7118M3044J5277k6357
10558b4279j6186L5574O7187R571P411p0897n8696K2671M4910n2825j6108J06846
$$ y = [125849, 158303, 100223, 30319, 9509, 24862, 39363, -1114, -58542, -51936, -7438, -4530, -52049, -31470, 81088, 159802, 133556, 69138, 78695, 63026, 76814, 91803, 19624, -59206, 16634, 78468, 68627, 17070, -14444, -3229, 41035, 95899, 120417, 125911, 79812, 23231, 57599, 78910, 70552, 66259, 82569, 161377, 192937, 149601, 90526, 64018, 58983, 46080, 46612, 91288, 110563, 182878, 320724, 370916, 356580, 374983, 408266, 361704, 355559, 302042, 301038, 367846, 343974, 348269, 327073, 277136, 258983, 207889, 186374, 178740, 140223, 151216, 111996, 106262, 141812, 114020, 23728, -39372, -231, 30736, 875, -56243, -13199, 2078, -24279, -40465, -4891, 62296, 71867, 79278, 8381, -50315, -27644, 17266, -35559, -51667, 55179]
10546E5179K2686k9609O971J0836J8387L6263J6341K5975n7956L4388o6696K6561
10534I9326M0367k5774k6931N3228P5207J9266q666j2399o492r78k0884n1510
10522A33760r4465m0652k7494j5015p266j6033n0762O032p6607O247K5001O3217
10510i4037J0824m4369l7244L2729K1810j4969L2188J12766j754l1346K0134J07573
10498A14305L5967n1770l5464n580j4365K9642K326k7861j6631M7155K1510R887
10486A09121k6403K395M0237O2026n564n3670j8434o8489M6261M5636M5056J0339
10474A88511l3379N4446Q3467R7501R5359O3166K25876L85061M38857N60824P02327
10463B862016O04383L69880J02407m5707j15767j78074j4584M4479j64677l74952
$$ y = [55179, 77865, 48256, 55227, 66063, 84450, 120713, 137054, 163029, 105073, 139461, 72765, 99326, 139693, 113919, 86988, 140216, 215423, 234689, 226023, 213624, 207132, 206154, 185270, 133760, 39295, -1357, -28851, -43866, -51132, -67165, -117927, -111895, -188502, -182255, -157254, -94037, -83213, -127582, -164826, -132097, -110287, -125256, -93068, 19698, 17944, -13402, 6732, 114305, 150272, 98502, 63038, 57458, 43093, 72735, 75061, 47200, 30569, 77724, 99234, 109121, 82718, 85113, 125350, 187376, 181812, 128142, 109708, 41219, 87480, 133116, 178172, 188511, 155132, 209578, 293045, 390546, 485905, 549071, 774947, 1160008, 1598865, 2159689, 2862016, 3466399, 3836279, 3938686, 3892979, 3777212, 3599138, 3584554, 3629033, 3464356, 3089404]
10453C089404n94904p17895n80808l88982j94064q1070K3353k0117M8505K0892
10443F04314m1641k3990K4927l8736l0150L5350L1250k3319J0500J8175M4360
10432F11040K1764N5990k7694o9798n258N4210K0820j47m1828J3919J5068m9910
10420E98176n0734K4652m3364n6330J0328j0047l852M6658L0888R759K4029M8662
10408F28825Q110l6719K8869K9712J9966J6117L5738L6012K7643j9360k5779M2446
10396G91580L7174P3565O8591M2448N7356J16041M7604K8280M0698P433l2386
10385A278384J0564M3018R1725O80R746N0091J2862P241M5171R5585J22420L6918
10373A804405J44638J40680J39230R2784J59615J93642J35889J78796K48806L01596
$$ y = [3089404, 2494500, 1776605, 1195797, 806815, 612751, 531681, 555034, 534917, 583422, 604314, 562673, 538683, 563610, 524874, 494724, 530074, 561324, 538005, 548505, 566680, 611040, 632804, 688794, 661100, 591302, 586044, 640254, 661074, 660927, 619099, 633018, 648086, 598176, 547442, 572094, 528730, 472400, 482728, 472681, 468829, 515487, 546375, 556134, 580163, 628825, 636935, 600216, 629085, 658797, 678763, 694880, 730618, 766630, 794273, 774913, 749134, 791580, 828754, 902319, 970910, 1013358, 1070714, 1186755, 1234359, 1262639, 1303337, 1310770, 1278384, 1288948, 1331966, 1423691, 1424371, 1434117, 1484208, 1497070, 1504311, 1549482, 1645067, 1767487, 1804405, 1949043, 2089723, 2228953, 2321737, 2481352, 2674994, 2810883, 2989679, 3238485, 3540081]
10363C540081L55039M78030O43144P29557P95452P66347P60090O87107P51763
10354I506610Q71571J100779J306398J561459J764231K025451K334875K877721
10346B3349095L831854N301924P423396J1147195J7540766K8081481M3059813
10339A39735524N9370135O9697537O6633936N1394130L2724558J2587367m860733
10332D27282454n953880N208434Q122440k607616k3670682n2612508p2514375
10325B83254267o8107863m9365984l1848759k0429150j3831572r875960p419514
10318H2375465n984522n073013m401398l915252l455931l074814k683669k407835
10310E1379031k223801k091276j920756j758097j617292j519325j545287j684434
$$ y = [3540081, 3895120, 4373150, 5016294, 5745851, 6541303, 7307650, 8067740, 8754847, 9506610, 10378181, 11478960, 12785358, 14346817, 16111048, 18136499, 20471374, 23349095, 27180949, 32482873, 39906269, 51053464, 68594230, 96675711, 139735524, 199105659, 268803196, 335437132, 386831262, 419555820, 432143187, 427282454, 421328574, 426537008, 434659448, 432051832, 408381150, 355768642, 283254267, 215146404, 165780420, 133931661, 113502511, 99670939, 89794979, 82375465, 76390943, 71317930, 66916532, 63001280, 59545349, 56470535, 53786866, 51379031, 49155230, 47063954, 45143198, 43385101, 41767809, 40248484, 38703197, 37018763]
10302C7018763j579224j444304j309021j140159j002286r29713q61232q42344
10294B7910480p81508p50403o84694o61274o52271o46953o22425o28671n85337
10285B1896944n83048n26954n08164n37590n19432m55011l88911m59470n62031
10276A7356333n13325n16072l95135l75580m60914m69237l54961l75322m11909
10267A3483878l14209k79325l13269l40035k74992l16486l09936k22373k01879
10258A0911374k06844j64018k16553k30706j96835k41766k25289k78160k00924
10249H950279j57580j83232j52891j06577j60401j86280k01682j71854j28983
10240G500799j38753j47386j57518j35923j06318p1152l8645j07085j6261j5408
$$ y = [37018763, 35439539, 33995235, 32686214, 31546055, 30543769, 29614056, 28752824, 27910480, 27128972, 26378569, 25693875, 25032601, 24380330, 23733377, 23110952, 22482281, 21896944, 21313896, 20786942, 20278778, 19741188, 19221756, 18766745, 18377834, 17918364, 17356333, 16843008, 16326936, 15931801, 15556221, 15095307, 14626070, 14271109, 13895787, 13483878, 13169669, 12890344, 12577075, 12237040, 11962048, 11645562, 11335626, 11113253, 10911374, 10704530, 10540512, 10323959, 10093253, 9896418, 9654652, 9429363, 9151203, 8950279, 8792699, 8609467, 8456576, 8349999, 8189598, 8003318, 7801636, 7629782, 7500799, 7362046, 7214660, 7057142, 6921219, 6814901, 6743749, 6705104, 6598019, 6581758, 6566350]
10230F566350p7086p5329j10306k4305q0482k7721K214q23L7045L371n2599j00297
10218F060032m1254J01494O4258Q1662J47737K20093K89152L86214N41605M95777
10208H346770K81982j05823k75323k35364n7547P863n7412l32711n39559o31635
10198F401241n15648m30501l84626k54449k04505j39096j19208r7964j17436p4440
10188D063368j15166j57833j26956q6503l9838j15149j27034r4564q4044K3253
10178C139534L3967m4341l9773q7376r4614k6440m8285n4566m4022j3267L0471
10167B751288l3190j5514l9298p7794n3770L4873K2497o2558m1948K6152m1386
10156B469352o4901l081J0463j7797K345l5968k8109m5404o2765p2867r8232j01008
$$ y = [6566350, 6489264, 6413935, 6303629, 6279324, 6198842, 6171121, 6173335, 6172512, 6209557, 6212928, 6160329, 6060032, 6018778, 6120272, 6184530, 6266192, 6413929, 6634022, 6923174, 7309388, 7850993, 8346770, 8628752, 8522929, 8247606, 8012242, 7954695, 7962558, 7905146, 7572435, 7032876, 6401241, 5885593, 5455092, 5070466, 4816017, 4611512, 4472416, 4353208, 4255244, 4137808, 4063368, 3948202, 3790369, 3663413, 3576910, 3537072, 3421923, 3294889, 3200325, 3116281, 3139534, 3173501, 3129160, 3089387, 3002011, 2907397, 2880957, 2832672, 2778106, 2734084, 2720817, 2751288, 2718098, 2702584, 2663286, 2585492, 2531722, 2566595, 2589092, 2526534, 2484586, 2510738, 2469352, 2404451, 2401370, 2411833, 2394036, 2396381, 2360413, 2332304, 2286900, 2224135, 2151268, 2053036, 1952028]
10144A952028j8068j0967j6087o6738m4223j02539j20948k9487J4509l0177n024
10133A522279o814j12805n216N5809j1907J6167M7081J6196J1907k8498m4550
10122A459649n3526N083m4403o5782l2553N4461K2347J6488M8178K5003M8411
10111A483356k5661p146M5516K2080J1228L6926M7786K4598l3400J9762R2359
10100A717404Q4590J78891L19850M82008P62378P77504O77467N73775J69554l05865
10090E437556o79101q95486q50871n36905l83258j89595m1695o5730r9351l5692
10080A659872j4355n337j5986m6307n7906m5065o9448n7712o4757q8153k7716
10069A167130n1434j9816j2080m674L4455j4717K8451L4414M824p1634o6072p1876
$$ y = [1952028, 1933960, 1922993, 1906906, 1840168, 1795945, 1693406, 1572458, 1542971, 1557480, 1527303, 1522279, 1515465, 1402660, 1397444, 1453253, 1441346, 1457513, 1504594, 1520790, 1532697, 1504199, 1459649, 1406123, 1411206, 1366803, 1301021, 1268468, 1322929, 1345276, 1361764, 1409942, 1434945, 1483356, 1457695, 1450549, 1496065, 1518145, 1529373, 1566299, 1614085, 1638683, 1605283, 1625045, 1717404, 1801994, 1980885, 2300735, 2782743, 3545121, 4322625, 5000092, 5573867, 5743421, 5437556, 4758455, 3862969, 3012098, 2475193, 2091935, 1902340, 1860645, 1794915, 1695564, 1659872, 1645517, 1640180, 1624194, 1577887, 1519981, 1474916, 1405468, 1347756, 1282999, 1194846, 1167130, 1115696, 1095880, 1083800, 1079126, 1113581, 1098864, 1127315, 1161729, 1166553, 1094919, 1028847, 956971]
10057I56971p6944l6321P58j13L6099k0382p4975m711N3465K2013M2917l1316
10045H67461K2664k3296K4864p0084o7409k7543p698L0272M8587P2052L5788O5673
10033I71331O3156l375K1207N333k9473K9836j0714n998k2737o5366j33449l9723
10021G80028N0569K0033q45K2410L9924O3349J21597K17627J34106J0037m2683
10010A416152l2647j08562j74020k04533j05913o4749R531O331k0427K8810O5218
9999H15191J5838n6019j08471l0387k0439l6790o3206j1224K7070k3820K8969
9988E36712M08o6256P612K9544O2923L3008k6154J8850k5556o2226k6296q768
9976D73801N2181K3476N7625l3564K8791k662j6412m5410J2719K2490k2918l8725
$$ y = [956971, 880027, 843706, 844464, 844351, 880450, 860068, 785093, 780382, 833847, 855860, 898777, 867461, 890125, 866829, 891693, 821609, 754200, 726657, 718959, 749231, 797818, 869870, 905658, 971331, 1034487, 1031112, 1052319, 1057652, 1028179, 1058015, 1047301, 1041303, 1018566, 953200, 819751, 780028, 830597, 850630, 849785, 872195, 912119, 975468, 1097065, 1314692, 1448798, 1458835, 1416152, 1383505, 1274943, 1100923, 896390, 790477, 725728, 735259, 741590, 721163, 749973, 815191, 831029, 775010, 666539, 636152, 615713, 578923, 515717, 504493, 531563, 507743, 536712, 537120, 470864, 478476, 508020, 570943, 603951, 577797, 596647, 571091, 508865, 482569, 473801, 525982, 549458, 607083, 573519, 602310, 599648, 583236, 537826, 550545, 573035, 550117, 511392]
9964E11392K6701k6202l0403J3537L8317L4556k2571M6734N192k7586m1808m185
9952E23674M0501K0665k6237m5K3462Q0839K1786m0477p5237l3085K1715p660
9940E49901j4385n4522Q763P1979J5372L6204R2683J09667Q4148J93298L76853
9929A469961L98520L60428L33585K34250J34671l5337q9458l7427n529j5940j04214
9918B643510j64835l73647m25372k98876j82812l5147l2270l3012J5490l6365
9908A076664n9082l0984o3120m2764l2360j0843L7025j5358j01141p8668m9003
9897F30366N8400J7245M1794J6430n1846m8211N1607m701L224j7702p8658l0122
9885E87826R497L3758m4694k3913p8796j5731N0252L8007N7083J1187n3051N665
$$ y = [511392, 538093, 511891, 481488, 495025, 533342, 567898, 545327, 592061, 597253, 569667, 527859, 523674, 564175, 584840, 558603, 558558, 582020, 662859, 684645, 644168, 568931, 535846, 557561, 549901, 535516, 480994, 489757, 561736, 577108, 613312, 705995, 815662, 899810, 1093108, 1469961, 1868481, 2228909, 2562494, 2796744, 2931415, 2896078, 2806620, 2769193, 2763664, 2747724, 2643510, 2478675, 2105028, 1679656, 1380780, 1197968, 1162821, 1130551, 1097539, 1113029, 1076664, 1017582, 986598, 923478, 880714, 848354, 837511, 874536, 859178, 758037, 679369, 630366, 688766, 706011, 747805, 764235, 712389, 664178, 715785, 711084, 714308, 696606, 617948, 587826, 597323, 631081, 586387, 562474, 483678, 467947, 518199, 556206, 613289, 624476, 571425, 577090]
9873E77090l8538M36J8090J0764J2666q6476j1876L8319k0044j4530J5840K2540
9861E24281N3286M6908M0212J02951J5814l8550k9980q6605l5594P1022K7909
9850F91654K8835O0188R380q2188n2307r8973k4312N213Q119L6186l6566n1772
9838D93457o3561n02R641m3110L1710J7022j8347l4611P5466k4481l5323N6455
9826D63816M6398n4428r977P444L7185N1700O3635O7437P153o0974L7600K9251
9814F86240n2840l5260p7317m8882o7125k9349J6064L0774M3659K5321J5791N7113
9802E64189L6379L2951j3584p472J2084l4930p5898o0485k7108p0901l8391J3809
9790C30643L1827N0105k4146k2426j4458j8865j5663M4640M8180M2891K6082R391
$$ y = [577090, 538552, 538988, 557078, 567842, 580508, 494032, 482156, 520475, 500431, 485901, 501741, 524281, 577567, 624475, 664687, 767638, 783452, 744902, 714922, 628317, 592723, 663745, 691654, 720489, 780677, 790057, 707869, 655562, 556589, 532277, 537490, 545609, 581795, 545229, 493457, 429896, 429394, 439035, 395925, 427635, 444657, 426310, 391699, 467165, 442684, 407361, 463816, 510214, 455786, 445809, 453253, 490438, 542138, 605773, 673210, 680363, 619389, 656989, 686240, 633400, 598140, 520823, 471941, 404816, 375467, 391531, 422305, 465964, 491285, 507076, 564189, 600568, 633519, 619935, 612463, 624547, 589617, 513719, 453234, 426126, 355225, 316834, 330643, 362470, 412575, 388429, 366003, 351545, 332680, 317017, 361657, 409837, 452728, 478810, 488201]
9778D88201p0327j7960M7219J2371n768N9670L0038O9589O2953M1564K9368M7902
9766G94820M7021O2200l3341o8503q1899q1503q9871n8369k3056M2252m3961m2774
9754D23016j616J4215k7434m5156M2671L5367m4611l3326L4656O9245K8674K1769
9742E17470l8564l1157O5186O6745J08952M1339n1738L3379R0182m6901m909j7098
9730G32886o2897J0537J5492r293j8871m9714r5966j07129n1384m8219J9486p10
9718C34218K3082K1462K973J3063P0549l4023O317Q0203L2566k6788L1117P3194
9706F27933Q591p0319M1857M8316m5866m1073p9169m7772k0724M0247L6026n7253
9694D40794q8886O4693L1257n8307m7933j1472r6499J3832J6515O2714j887r595
$$ y = [488201, 417874, 399914, 447133, 459504, 453736, 513406, 543444, 613033, 675986, 717550, 746918, 794820, 841841, 904041, 870700, 802197, 720298, 638795, 548924, 490555, 467499, 509751, 465790, 423016, 421400, 435615, 408181, 363025, 405696, 441063, 396452, 363126, 397782, 467027, 495701, 517470, 478906, 447749, 512935, 579680, 688632, 729971, 678233, 711612, 801794, 754893, 749984, 732886, 669989, 680526, 696018, 686725, 667854, 618140, 522174, 415045, 363661, 315442, 334928, 334218, 357300, 378762, 381735, 394798, 465347, 431324, 437641, 517844, 550410, 523622, 554739, 627933, 636524, 566205, 608062, 656378, 610512, 569439, 490270, 442498, 421774, 462021, 498047, 440794, 351908, 416601, 447858, 389551, 341618, 330146, 233647, 247479, 263994, 326708, 324821, 315226]
9682C15226L457k8026m6096L3030M5190L2896M6586L9831L4400K5354j4870m5924
9670D41054J4408l929n9564j05650m4904L1873l8845m1406J5345J1974L0539k1907
9658B28988K4004L7356K5250J7646J2400M726j0k7094P881K4934K0902J7551j08655
9645B85879m2155M4424N1987j3148L4510L9933K2085p1212o6705l1388L7376M3231
9633C34817K1120J0622k8302j5626p2836l801O5327k0292K4744N8357Q782p1820
9621C11092j1887j6610P8116P2778K4871o752M9097J3360l1857r2964n4351L4786
9609C69679J0911m6860K887l8164K3747J2735J0587n8840k8377J8043l7276k4238
9597B14834K7493J4802j7436k5953L8560Q6754k4764l8828K9500j7241O222j8239
$$ y = [315226, 318683, 290657, 244561, 277591, 322781, 355677, 402263, 442094, 476494, 501848, 486978, 441054, 455462, 451533, 391969, 286319, 241415, 273288, 234443, 193037, 208382, 220356, 250895, 228988, 252992, 290348, 315598, 333244, 345644, 350370, 350360, 323266, 331147, 356081, 376983, 394534, 285879, 243724, 288148, 340135, 326987, 361497, 401430, 423515, 352303, 285598, 254210, 291586, 334817, 355937, 366559, 338257, 322631, 249795, 245994, 311321, 291029, 315773, 374130, 382912, 311092, 299205, 282595, 360711, 433489, 458360, 451608, 500705, 514065, 482208, 389244, 334893, 369679, 380590, 333730, 336617, 298453, 322200, 334935, 345522, 286682, 258305, 276348, 239072, 214834, 242327, 257129, 239693, 213740, 252300, 339054, 314290, 275462, 304962, 287721, 293943, 275704]
9585B75704q215M5207n094n3651K7877j6535j07522K799R5078L4331J0613j8009
9573B82583n3313p624P8672k205K8889O1313J5235M734q6927o2860j9615N7460
9561B96342K0932j0299n1020l9891o579j5685M353J8918n3259M2949R2809k3292
9549B76278j5011O0956q329J9186n5494O1093O3159k8911o0965m3220K2129M5641
9537C36512O8577M0784l645m5932j1383l4346l4112k8461K4534K4104K0194J3223
9525C70049L201J9166K5758L6019O852r930k1447r773L1413r553J9443J0660n273
9512D66585O2282P3854O4999l6365l4393J224k605k9980k2716J4241k6228p5207
9500D55691l4183K8658R315k8841j6352O0041J343n647K887o892m2790j0711J6202
$$ y = [275704, 267489, 312696, 307602, 253951, 281828, 265293, 157771, 160570, 255648, 289979, 300592, 282583, 229270, 221646, 300318, 298113, 327002, 388315, 403550, 408284, 321357, 258497, 238882, 296342, 317274, 306975, 255955, 216064, 209485, 193800, 198153, 217071, 163812, 206761, 299570, 276278, 261267, 322223, 313894, 333080, 277586, 338679, 401838, 372927, 311962, 268742, 290871, 336512, 405089, 445873, 442228, 396296, 384913, 350567, 316455, 287994, 312528, 336632, 356826, 370049, 373250, 392416, 418174, 454193, 461045, 451115, 429668, 419895, 451308, 441755, 461198, 471858, 466585, 528867, 602721, 667720, 631355, 596962, 598186, 595581, 565601, 542885, 557126, 530898, 455691, 421508, 450166, 459481, 430640, 414288, 474329, 475672, 470025, 472912, 466020, 423230, 412519, 428721]
9487D28721K8175j1915q5196J386K6750L2647J36851K7304k1583n953l925l3164
9475E20098l1010k475n0088n0968m1113l1602J2279j3608K8070O2421k8041P875
9463C81838j7467J7255L9771J8599k4361N094K6280M4640n0996k572K0571k679
9451D55973K81N2096N0549J9837m3553K7233o97P805k1601j7581r858P4106l4808
9438E59782n0233l5596p4417K551L5244m7942K7585L1406N1850m4857K2360P6134
9426E53867Q441j0551r432J3776k221m4173l0560L9842M1782l0069m2023j7369
9414D71310M2279M4089N0899M2405M1023m8771k9036k5635L1479j2393l5362m5092
9402E27195o484N214J4517k0593Q359J3152J2711M2475Q55L1860j6167J9993P89
$$ y = [428721, 456896, 444981, 359785, 361171, 387921, 420568, 557419, 584723, 563140, 557187, 553262, 520098, 489088, 486613, 436525, 385557, 344444, 312842, 325121, 311513, 339583, 402004, 373963, 381838, 364371, 381626, 421397, 439996, 415635, 420729, 447009, 491649, 440653, 438081, 458652, 455973, 456254, 508350, 558899, 578736, 535183, 562416, 561719, 569524, 547923, 530342, 520484, 594590, 559782, 509549, 473953, 399536, 402087, 437331, 389389, 416974, 448380, 500230, 455373, 477733, 553867, 562308, 551757, 542325, 556101, 553880, 509707, 479147, 518989, 560771, 530702, 488679, 471310, 513589, 557678, 608577, 650982, 692005, 643234, 614198, 588563, 620042, 607649, 572287, 527195, 520711, 525925, 540442, 519849, 528208, 541360, 554071, 596546, 597401, 629261, 613094, 633087, 633876]
9389F33876j02657j9303r558J6994P3871L5098K10j6959l0062r8584K0242N2281
9377E55449j1657j0158k3028R839k0163l8802R7345M4483k1539m8634L569K9956
9365E66660O3566R4607J2303P344K9526R701k3620j0789k8045p4585m7047N3104
9353F52725Q3290M6223l2825j76M6750J0586q374p4406J0240L3685m5723q4404
9341F37591q3434M567M3131J3651K9560k7943j7746M6419o207n4927j1648M8924
9329F21938J9209L7540k5628k2861L3200K6855P3201N1013l5938K1823k4299L3146
9317H09199L9532k0659n030j7147L3654J0483K8966j2793p4633m7588L0650J7648
9305G92282J6768L6335k9238P4845L1773j3063p895R3792M0404o09J0686L4917
$$ y = [633876, 531219, 511916, 502358, 519352, 593223, 628321, 628531, 611572, 581510, 482926, 503168, 555449, 543792, 533634, 510606, 520445, 500282, 461480, 558825, 603308, 581769, 533135, 536704, 566660, 630226, 724833, 737136, 744480, 774006, 783707, 760087, 749298, 721253, 646668, 599621, 652725, 736015, 782238, 749413, 749237, 795987, 806573, 798199, 723793, 734033, 767718, 721995, 637591, 554157, 558724, 601855, 615506, 645066, 617123, 599377, 645796, 639589, 584662, 573014, 621938, 641147, 678687, 653059, 630198, 663398, 690253, 763454, 814467, 778529, 800352, 776053, 809199, 848731, 828072, 823042, 805895, 839549, 850032, 878998, 866205, 791572, 743984, 774634, 792282, 809050, 845385, 816147, 890992, 922765, 909702, 901807, 995599, 1036003, 1035394, 1046080, 1080997]
9293A080997K6592j2522K0861M1221M8003R2735N0973j0411K2665N3848M837j5748
9281A404051Q827N4821N0940M9477Q39q1185k0151N3568k2742n0760K9080K0945
9269A497710j6440m3952k376J1303J5680m9489L2183K5059j7721M912J4731m330
9257A467270P200L6249N7461R319M0881N0175K1828K4650J6848K7249N862j3456
9245A751536O261L261R7092O1575M556L3672P1697j1930l950N9507M7630j1440
9233B109467N4305M6918J47965J07843k6623j4406Q0182P7466M3457L3708R0144
9222B750426M3846Q3871M2019O5300O2805J48616J22612J47771R7724Q4153P0449
9211C719592J19114J83192R9619P2757J35103J03356J55837J91927J89292J84249
$$ y = [1080997, 1107589, 1095067, 1115928, 1157149, 1205152, 1297887, 1348860, 1338449, 1361114, 1414962, 1419799, 1404051, 1412878, 1467699, 1518639, 1568116, 1568955, 1487770, 1467619, 1521187, 1498445, 1447685, 1476765, 1497710, 1481270, 1437318, 1434942, 1446245, 1461925, 1412436, 1444619, 1469678, 1451957, 1456869, 1471600, 1467270, 1474470, 1510719, 1568180, 1577499, 1618380, 1668555, 1690383, 1715033, 1731881, 1759130, 1764992, 1751536, 1757797, 1761058, 1858150, 1919725, 1924281, 1957953, 2029650, 2017720, 2013770, 2073277, 2120907, 2109467, 2163772, 2210690, 2358655, 2466498, 2439875, 2425469, 2505651, 2583117, 2626574, 2660282, 2750426, 2794272, 2878143, 2920162, 2985462, 3048267, 3196883, 3319495, 3467266, 3564990, 3649143, 3719592, 3838706, 4021898, 4121517, 4194274, 4329377, 4432733, 4588570, 4780497, 4969789, 5154038]
9201E154038K02429J88301K11305K51598K59780K94383J89849K94949L00398L73812
9191G720842L58698L78851L79208M27392M03929M10790N91272N94798N62071O93293
9181A2521144P33429P76035Q89418R07427R67602J084636J160196J319635J369003
9172B1728525J482872J653010J762984J799504K017491K219323K239115K388551
9164C7291375K480522K517182K606120K605284K550052K359867K131612J840132
9156E6382146J464582J016407N52346q515m73692q28420j182685j538306j756554
9147E3627309k013511k116612k190428k169268k062193j970628j953384j941734
9139C7209551j850085j727290j608145j497688j414342j306743j226879j125917
$$ y = [5154038, 5356467, 5544768, 5756073, 6007671, 6267451, 6561834, 6751683, 7046632, 7347030, 7720842, 8079540, 8458391, 8837599, 9264991, 9668920, 10079710, 10670982, 11265780, 11827851, 12521144, 13254573, 14030608, 14920026, 15827453, 16795055, 17879691, 19039887, 20359522, 21728525, 23211397, 24864407, 26627391, 28426895, 30444386, 32663709, 34902824, 37291375, 39771897, 42289079, 44895199, 47500483, 50050535, 52410402, 54542014, 56382146, 57846728, 58863135, 59415481, 59406966, 58933274, 58104854, 56922169, 55383863, 53627309, 51613798, 49497186, 47306758, 45137490, 43075297, 41104669, 39151285, 37209551, 35359466, 33632176, 32024031, 30526343, 29112001, 27805258, 26578379, 25452462]
9131B5452462j091579j041328r66558q85729p83656p95972p84255p18569o12313
9122A7772503n65171o26736n78466n14965m74565n10796n19937m04757m29539
9113A3147571l95527l48831l93846l44968l76739k69318k55878l12867l08239
9104A0141358k36241k57441k54750k09029k37568j88169k30536k09386j95743
9095H122495j59895j75444k16010k28837k21793k02553j22480j08034j76831j23457
9085F387161j28967j09112p7039j20618j89275j85775j03741r1709j26774r9862
9075E154289r1301r3482j12394o9043p2691j19010q6332q0078p0513n5284n1246
9064D252915q3585l9347p0848o9105q6675j00610m2531k9973o7635j23196o3813
$$ y = [25452462, 24360883, 23319555, 22352997, 21467268, 20683612, 19887640, 19103385, 18384816, 17772503, 17207332, 16580596, 16002130, 15487165, 15012600, 14501804, 13981867, 13577110, 13147571, 12752044, 12403213, 12009367, 11664399, 11287660, 11018342, 10762464, 10449597, 10141358, 9905117, 9647676, 9392926, 9183897, 8946329, 8758160, 8527624, 8318238, 8122495, 7962600, 7787156, 7571146, 7342309, 7120516, 6917963, 6795483, 6687449, 6510618, 6387161, 6258194, 6149082, 6072043, 5951425, 5762150, 5576375, 5472634, 5380925, 5254151, 5154289, 5062988, 4969506, 4857112, 4788069, 4715378, 4596368, 4510036, 4429958, 4359445, 4304161, 4252915, 4169330, 4129983, 4059135, 3990030, 3903355, 3802745, 3760214, 3730241, 3662606, 3539410, 3475597]
9053C475597o122q9736n5466o8465j7023M5806m8036k3114o3120r164J4312p935
9041C147534j7297m2816r1767p6164K907J4379l095R270k8825J337n4443q160
9029B852860p0934r538M0718l7476m4394o2640o7015l1657p8332m7464J2964j8501
9017B438591n4755n5640r1314m8043l7724l4319L7892k1967p3525m3775k2314
9006A993107m9411m8755l0062k3984J7357m0242j08675m4657k5688l48j0035n606
8994A623001j10404k1938r876m0597N6916N7226j06530j7061k7136q3383n0668
8983A269550O6583J2858j1390K6010k5744K5781L9649k5242n7287k4444m0882
8972A255442j7939n6000q16O9322q702r6309n3573j2448q5608l4655k6287J8836
$$ y = [3475597, 3469475, 3379739, 3324273, 3255808, 3238785, 3284591, 3236555, 3213441, 3150321, 3141157, 3155469, 3147534, 3130237, 3087421, 2995654, 2919490, 2922397, 2936776, 2933681, 2942951, 2914126, 2915463, 2861020, 2852860, 2781926, 2772388, 2813106, 2775630, 2731236, 2668596, 2601581, 2569924, 2491592, 2444128, 2457092, 2438591, 2383836, 2328196, 2236882, 2188839, 2151115, 2116796, 2154688, 2132721, 2059196, 2015421, 1993107, 1943696, 1894941, 1864879, 1840895, 1858252, 1818010, 1709335, 1664678, 1638990, 1638642, 1628607, 1623001, 1512597, 1490659, 1480783, 1440186, 1497102, 1554328, 1447798, 1430737, 1403601, 1320218, 1269550, 1336133, 1348991, 1337601, 1363611, 1337867, 1363648, 1403297, 1378055, 1320768, 1296324, 1255442, 1237503, 1181503, 1180687, 1250009, 1241307, 1144998, 1091425, 1078977, 993369, 958714, 932427, 951263]
8960I51263j6513L1123O7133K350m0399j08396j901N5629J9699m6165m5950j7530
8948H50343p550m0605j8107j7996k5089M2469J0928j4904q122L0561J4990O79
8936H17597M0514l7712n5070l7423j8136j383L38M5774m7066j9011K5584j4478
8924F99528P091k3066m8516J7081K4963m2891j4965R139L6746o861j5555l0250
8912F12444k0224M5853j9697q1055o1856Q0187q071Q728o697P475R550K7521r945
8899E84213k3561l2275k914n430j2738m545j343M7012K784m225k7180J2298m3516
8886D88580o601L5020r175N611J982M205l990R32l0847J0162J25013M6042l5415
8873F31519j0037J06p0121k7832r0797k0837l4246L678j0652m6590n8799J6464
$$ y = [951263, 934750, 965873, 1033006, 1035356, 994957, 886561, 884660, 940289, 959988, 913823, 867873, 850343, 842793, 802188, 784081, 766085, 740996, 783465, 794393, 779489, 771367, 801928, 816918, 817597, 858111, 820399, 765329, 727906, 709770, 708387, 708725, 754499, 707433, 688422, 714006, 699528, 706619, 683553, 635037, 652118, 677081, 634190, 619225, 628364, 665110, 658249, 642694, 612444, 592220, 638073, 618376, 537321, 475465, 555652, 547581, 556309, 549612, 557087, 566637, 594158, 584213, 560652, 528377, 525463, 520033, 507295, 502750, 501407, 548419, 551203, 546978, 519798, 532096, 488580, 481979, 516999, 507824, 513435, 515417, 519622, 515632, 516564, 485717, 495879, 620892, 666934, 631519, 621482, 621588, 551467, 523635, 432838, 412001, 377755, 381433, 370781, 324191, 265392, 281856]
8861B81856K6985m5302M6125P4640j6145J2729K4366J5088o564p902j4051k1012
8849C70813j6834J8178Q2414r065k6039l0092m8774o6841k5774M9427P6755k8412
8837C45756l312N3766J010q7659j3195k8661l4478q336N710J5907L8361J578n6022
8824B30425L7935L6102M3942M1744j1589m2841q04J8929K7562m5213L120n7808
8812B81504o5051l746N9475o372m0213J4356P0416k0224q6134o2985K3635R3688
8800B58349l7796l5218M1290j095n5635k851O9641M798K9309j812K3367N3667
8788C46014M800j5652m4221n4638m0392J4692j0949Q395P427P456l3377m5351
8776A44204m134K7010L6974O0398N8561m7959m5372j7524M0450l3962m8323L3087
$$ y = [281856, 308841, 263539, 309664, 384304, 368159, 380888, 405254, 420342, 413778, 405876, 391825, 370813, 353979, 372157, 454571, 445506, 419467, 389375, 340601, 273760, 247986, 297413, 374168, 345756, 342444, 396210, 397220, 309561, 296366, 267705, 233227, 224891, 230601, 246508, 284869, 286447, 230425, 268360, 304462, 348404, 390148, 378559, 335718, 334914, 353843, 381405, 336192, 339312, 281504, 216453, 212707, 272182, 265810, 225597, 239953, 310369, 290145, 204011, 141026, 164661, 258349, 220553, 185335, 226625, 225530, 169895, 167044, 236685, 241483, 270792, 268980, 292347, 346014, 350814, 335162, 290941, 236303, 195911, 210603, 199654, 208049, 215476, 222932, 189555, 144204, 140070, 167080, 204054, 264452, 323013, 275054, 229682, 212158, 252608, 218646, 170323, 203410]
8764B03410P9107j1474l0677j071m2986R761L3479L5307N1840p323j0628k5601
8752B83144n524p6222o3644K9232j7968r885l0458K7954O9552R661k3336q297
8740A84209j3693J1514J0522O3557J0920l3356n5383M60q546K0685j5940n2227
8728A22722q281j832R041J621L3139Q462j1058J1996L2498O9064P2499l329J2008
8715C48550k1799n7656k0656j6745k5172O8345K1312m2154r0371m4002k562l748
8703A13342J8118J8678N3584k5480k3199N1141O1410j2257L5226p448m9617n1542
8691A81956p143K4299o201K3926J6187L7425k4565l1632L4674q3l2631J7690q970
8678B24932k7659j7003k9864K436L1749l3612r682N1778L7290j6777N29J7551
$$ y = [203410, 282517, 271043, 240366, 239295, 196309, 206070, 239549, 274856, 326696, 319373, 308745, 283144, 277620, 201398, 137754, 166986, 149018, 139133, 108675, 136629, 206181, 215842, 192506, 184209, 170516, 182030, 192552, 256109, 267029, 233673, 178290, 178750, 170204, 190889, 174949, 122722, 114441, 112609, 121650, 123271, 156410, 164872, 153814, 165810, 198308, 267372, 339871, 336542, 348550, 326751, 269095, 248439, 231694, 206522, 274867, 296179, 254025, 163654, 119652, 117090, 113342, 131460, 150138, 203722, 178242, 155043, 206184, 267594, 255337, 290563, 283115, 233498, 181956, 174813, 199112, 192911, 216837, 233024, 270449, 245884, 214252, 248926, 248843, 216212, 233902, 224932, 197273, 180270, 150406, 152842, 184591, 150979, 141297, 193075, 230365, 213588, 214117, 231668]
8666B31668J6823k5278l3467m370J1937l7490J032j642q497N5166M0046l0292
8654B15636J0370n104p906p741P371K8092L9568M738m6985l1551J6344l1646J3859
8641B05045Q7679M8865n0134m1371J0891N1449L9964K6498M6127J4978J113j8633
8629D22471k9801P600R781j7347j271k5949m1368L6399Q1269l4284r69l9291n1428
8616C15812j6302K3857N1648l9982l4072J2685M7962L8981o851N5630N4584K46
8604E04198k0335k3202q202l6033k0229p704k5059m187l9695J6195K3512k2209
8592C37050m4515j3123J3862j18386p2521K7901J0336J0742L1737P2001L480j23
8580B58441l5303J7949l6579l0443R135K6444j3868n184K1799K3572k7106o1786
$$ y = [231668, 248491, 223213, 189746, 185376, 197313, 159823, 160855, 159213, 150716, 205882, 245928, 215636, 226006, 220902, 212996, 205255, 212626, 240718, 280286, 285024, 238039, 206488, 222832, 191186, 205045, 292724, 341589, 291455, 250084, 260975, 312424, 352388, 378886, 425013, 439991, 441104, 422471, 392670, 400270, 410051, 392704, 391433, 365484, 324116, 360515, 441784, 407500, 406531, 367240, 315812, 299510, 323367, 375015, 335033, 300961, 313646, 361608, 400589, 393738, 449368, 503952, 504198, 483863, 460661, 452459, 416426, 396197, 388493, 363434, 359247, 319552, 335747, 359259, 337050, 292535, 279412, 293274, 174888, 102367, 130268, 140604, 151346, 183083, 255084, 258564, 258441, 223138, 241087, 204508, 174065, 183200, 209644, 195776, 190592, 212391, 235963, 208857, 147071]
8568A47071J3700N9998L8826m327p0289p307J140M7301L1700J2819J3393k9442
8556B54583N14n1312j05783L0931j974j8126j4683M5069j2878l8060J7668N3146
8544A59095j1943o2356p3036k142K6872M8439J2380l1933J9548J2741L2374p801
8532A22238m549L4084o335l5026l0739q727K2398M2552k9018k2997r996M006M6179
8519A24070J1598j1577L7176l0049l9419j0636J5283L8170O1857k2708j3936l2091
8507A27738p4382P448l6963J9357L5218P5802K5135m0234r241N189J3381M7544
8495A95992l749q431l1283L328l5325P8207L0577o9666j8698j7435l455K6476
8483A46538L457K666k651m8909k5287O2331K0830l7925p7842l4230K0243L7078
$$ y = [147071, 160771, 220769, 259595, 255268, 184979, 177672, 178812, 226113, 257813, 270632, 284025, 254583, 255097, 203785, 98002, 128933, 126959, 108833, 94150, 139219, 126341, 88281, 105949, 159095, 147152, 84796, 11760, 9618, 36490, 84929, 97309, 65376, 84924, 97665, 130039, 122238, 117689, 151773, 145438, 110412, 79673, 70946, 93344, 135896, 106878, 83881, 73885, 77891, 124070, 135668, 124091, 161267, 131218, 91799, 81163, 96446, 134616, 196473, 173765, 159829, 127738, 53356, 60804, 23841, 43198, 78416, 154218, 179353, 139119, 129878, 135067, 148448, 195992, 192243, 183812, 152529, 155857, 120532, 198739, 229316, 159650, 140952, 123517, 120062, 146538, 149995, 152661, 150010, 101101, 75814, 138145, 158975, 121050, 43208, 8978, 29221, 66299]
8471F6299J9034N2671K7461o2303k626j0505j0139K3275J8790j3086K7946j801
8459A35016j4297m0997m6979N3326L152m236J0254l5868l9352L871j5543N7398
8447F5745M3008K9314j5147k3652J0522m6616j9464L7954m020M4164K247q7664
8435C6391k3035M1813J2559J7141k1865j4667L0052j5166P2j959J9082l7238P9302
8422A22482l629k9749J0043J8060M2399n2242o7682j233J7926l469k6909Q187
8410C4184M7721l4555o0531m8556M757Q0211j8499L7829K0728K3853L0269K5935
8398A43346R722n8562l9421n18J1895p987m608N5529R666l6353l7242j1598L4159
8385F8028n109k380J9323L190m9745J1877M1129N8221J6942j8550O5144P7864
$$ y = [66299, 85333, 138004, 165465, 103162, 100536, 90031, 79892, 103167, 121957, 108871, 136817, 135016, 120719, 79722, 32743, 86069, 89221, 84985, 95239, 59371, 20019, 23890, 8347, 65745, 108753, 138067, 122920, 99268, 109790, 63174, 43710, 81664, 77644, 121808, 124055, 36391, 13356, 55169, 67728, 84869, 63004, 48337, 78389, 63223, 63295, 61336, 80418, 43180, 122482, 118853, 89104, 99147, 117207, 159606, 107364, 39682, 38449, 56375, 52906, 25997, 34184, 81905, 47350, -13181, -61737, -56980, 23231, 4732, 42561, 63289, 87142, 117411, 143346, 153068, 94506, 55085, 54567, 66462, 58475, 53867, 109396, 119062, 82709, 45467, 33869, 68028, 62919, 60539, 79862, 83052, 33307, 45184, 86313, 144534, 161476, 142926, 208070, 285934]
8373B85934J775j24101q0343k9159K2810L5743J6052M6732k0833m9807k4030m4841
8361C5932m0023J8664O9942l968m1446M0416K6642n9234n2318n763L9681K2387
8349E0912K9785Q3981M463J6963p431n8324n2790l6446l8159L6189K5838O5904
8337A20885J6669m244l3239k3605J4784k845n896k9040P315j4112J6331l0267
8325C2736O561M75J9261K5752j7915K86k7661k489k6101j9563l7853j435j9382
8312f7328m1714J1341O5288N1707n2623J3217M2575j8937j2596l4151J7048P8047
8300E1874M2090r733L2175M750j7874j370k4088j3644O0715k4702J0827l4717
8288G6303m2135n2528k0568L4509l5141p793J11613J337l9488M1978j152L1640
$$ y = [285934, 287709, 163608, 83265, 54106, 76916, 112659, 128711, 175443, 154610, 104803, 80773, 35932, -4091, 14573, 84515, 80547, 39101, 79517, 106159, 46925, -5393, -11156, 28525, 50912, 80697, 164678, 169141, 186104, 178673, 120349, 67559, 31113, -7046, 29143, 54981, 120885, 137554, 133310, 100071, 76466, 91250, 88405, 82509, 53469, 60784, 46672, 63003, 32736, 39297, 39772, 59033, 84785, 66870, 67156, 39495, 37006, 10905, -8658, -46511, -47946, -67328, -109042, -97701, -32413, 19294, -33329, -20112, 22463, 3526, -9070, -43221, -26173, 51874, 93964, 84231, 116406, 121156, 103282, 101912, 77824, 64180, 124895, 100193, 111020, 76303, 34168, -18360, -38928, -4419, -39560, -47353, 64260, 65597, 26109, 68087, 66935, 98575]
8276I8575k2378N570O6351l9528l0267O6573k5812j8382j6508j5237j9314m957
8264D4686q492L9695o374L6085R91l6674k1300k3908n0524Q284L7876k467j9810
8251a932K3232m580m6153L6568m545M978j7184J2172K5944l4663j2206L0153K0920
8238C2704q7025J5458P9846O9553j2997N064m4604j4501K1956l4883j5658J881
8226A6794K705N9617m38O731l8703l9032j1894O347J7054J7297m5381P638K7746
8213B6481j1446L5828l9647J0407j0166o0920m6922K2228R756K769Q330j0687
8201f3989R294J9239j8772K9554N0220L0097J1654j1165k8061j06007J164O2849
8189a3923n29J9517K7757p631r3793N174O3389J726n542Q1385K9961J2365j2994
$$ y = [98575, 76197, 81767, 148118, 108590, 78323, 144896, 119084, 100702, 84194, 68957, 49643, 44686, 36194, 75889, 69515, 105600, 106591, 69917, 48617, 24709, -25815, -17531, 20345, 17878, -1932, 21300, 16720, -29433, 7135, 2590, 7568, -9616, 2556, 28500, -6163, -18369, 11784, 32704, -54321, -38863, 40983, 110536, 97539, 102603, 57999, 43498, 65454, 30571, 14913, 16794, 19499, 79116, 78678, 85409, 46706, 7674, -4220, 2127, 19181, 36478, -8903, -1265, 26481, 15035, 50863, 11216, 21623, 11457, -49463, -96385, -74157, -64401, -61632, -53302, -63989, -54695, -35456, -54228, -24674, 25546, 55643, 67297, 56132, 28071, -77936, -76772, -13923, -14452, 5065, 32822, 25191, -68602, -63428, -39, 1687, -3855, 77530, 107491, 119856, 106862]
8176A06862j1569p661J3490K7041K8864J9975j2793l5849r044K7105N176l5444
8164A16153l4159M4470J5356j7755k6776Q585o3571m4024N0487K8992l017m0519
8152C4222r882r03K0716k2503m4517K3144Q192O8799j6753l2864p91j5886m5645
8139c4671m6676N8266Q7138J6030L0465K4436j8034m6601J5784j6728j3394K4659
8127H0674P0918P728l911q179k8691l004O346k8150M4413L182l3489m9776m0288
8114A7773o203P773j6381K9224R798O5385Q0696K2723p5424n4232m7825j8130
8102A5177l843j619j7753m485L0734O1359J2192j6927n0090K1079M5577n1446
8090C9955p7157K901k1781n1163J3740M1678Q5954J9330j71o4068L4568N079j4735
$$ y = [106862, 95293, 87632, 101122, 128163, 157027, 177002, 164209, 128360, 119316, 146421, 151597, 116153, 81994, 126464, 141820, 124065, 97289, 105874, 42303, -1721, 48766, 77758, 74741, 34222, 24340, 23437, 44153, 21650, -22867, 277, 8469, 77268, 60515, 27651, 26860, 10974, -34671, -81347, -23081, 64057, 80087, 110552, 134988, 116954, 70353, 86137, 69409, 56015, 80674, 151592, 159320, 155409, 147230, 118539, 115535, 121881, 93731, 138144, 141326, 107837, 58061, 17773, 11570, 19343, 2962, 32186, 41984, 107369, 188065, 210788, 135364, 81132, 33307, 15177, 11334, 9715, -8038, -12523, 18211, 79570, 91762, 74835, 24745, 45824, 91401, 39955, -37202, -34301, -56082, -107245, -93505, -51827, 34127, 53457, 53286, -10782, 23786, 28865, 14130]
8077A4130j5542m0736o8900L5790M3198l9168K5091L9501q061J6479n024k9504
8065c2746J6487J6139M4717L9566j7299R897N3659K8177J4502p4325L7136m4721
8053I1189l9824K7483J0773K0368P932k0612K6917j3138M5673J3326k0651k8876
8041A20560m0385p0495j2370J4536j9760k1278J4078P0824N6825K4445n04P511
8029A43987q715o3717L9715l3846l0755n2924J913O2476J7480O2424Q9571O8587
8017B96196M7196n0323j9607o3285p1765k1972j4468K2136o948o064L3804k2520
8005A22380M5726l8214l5729m6692N743m362j9169k1177R820m3813k3776O8264
7993A9001L0995M6324L897j9618L3581J3856L3763K079p1275m9968J5970j2905
$$ y = [14130, -1412, -42148, -111048, -75258, -32060, -71228, -46137, -6636, -14697, 1782, -3242, -32746, -16259, -120, 44597, 84163, 66864, 76761, 130420, 158597, 173099, 98774, 135910, 91189, 51365, 78848, 89621, 109989, 117921, 97309, 124226, 111088, 156761, 170087, 149436, 120560, 80175, 9680, -2690, 11846, -7914, -29192, -15114, 55710, 112535, 136980, 136476, 143987, 135272, 71555, 111270, 77424, 46669, -6255, -4342, 58134, 75614, 138038, 227609, 296196, 343392, 293069, 273462, 210177, 138412, 116440, 101972, 124108, 117160, 111096, 144900, 122380, 168106, 129892, 94163, 47471, 53214, 48852, 29683, 8506, 18326, -25487, -49263, 19001, 49996, 96320, 100217, 80599, 114180, 128036, 161799, 163878, 92603, 42635, 58605, 45700]
7981D5700N9990M2281l7453m0967N7112O3601J2546N8543j0751q4481J1592k286
7969A75427J8740m450l1876K3682l2650J2526J5236J2623k1512j1390m425R011
7957A60942k865l8458k3711m4916J2466M0606J4690j7002Q287n1853N3156L4813
7945A46155m599p1381j1527j9054j3781J29r639K1396K5629M2089J6022K2889
7933A44328l9097j9199J1055j9607L0620P643m7367m7436J3680k6706l616N6070
7921F0368L2807K8813q189n9055l1949K5211J756K6315n9464L3837K4007m640
7909F9817K1691L6565r805k3754j0983o747l1854j9204q2K8225m6712L1949L2037
7896G1143k59l8461l37N8110J5049J0198j9554r846j06880l6202P4854K3125n1411
$$ y = [45700, 105690, 147971, 110518, 69551, 126663, 190264, 202810, 261353, 250602, 166121, 177713, 175427, 194167, 189717, 157841, 181523, 148873, 161399, 176635, 189258, 167746, 156356, 151931, 160942, 158077, 119619, 95908, 50992, 63458, 104064, 118754, 101752, 110039, 58186, 111342, 146155, 141556, 70175, 58648, 39594, 25813, 25942, 16303, 37699, 63328, 105417, 121439, 144328, 105231, 86032, 97087, 77480, 108100, 115743, 68376, 20940, 34620, 7914, 4298, 60368, 93175, 121988, 113799, 54744, 22795, 48006, 49762, 76077, 16613, 50450, 74457, 69817, 91508, 128073, 118268, 94514, 83531, 76784, 44930, 25726, 25644, 53869, 7157, 39106, 71143, 70884, 32423, 32086, 90196, 105245, 115443, 95889, 86043, -20837, -57039, 17815, 40940, -10471]
7883a0471l3978j9899l9115J9053N5225K4334Q9294L0862j3992k0802J9782K1483
7871A21776o1548n9547m5941o7916j5477O0235l3413p9262R2125O4553J4829j871
7859a1457O3895k4226j4105N1583j5848r222N5800q0l9549m0537m797J9085O1651
7846I2193P506m3018j9690K4001n2037p526L3148m010n6552o2208M3835L6795
7834g563l8840K7705O5667K1766l4690k224n9728J430Q3234m6491l3065K471N3740
7821C3412M109Q333J7810l2131J5953J1864J058r261N5289K836k6884n3508k4499
7808D381J4978O591J0570L1905j0411J5974P527o3685l8797M5051P681R029L442
7795D4236L1244j1895m1187K3953k1482K2821m322j8281J0480l6303J9898M0522
$$ y = [-10471, -44449, -64348, -103463, -84410, -29185, -4851, 84443, 115305, 101313, 80511, 100293, 121776, 60228, 681, -45260, -113176, -128653, -68418, -101831, -181093, -88968, -24415, -9586, -11457, 52438, 28212, 14107, 65690, 49842, 40620, 96420, 96340, 56791, 16254, 11457, 30542, 92193, 99699, 56681, 36991, 60992, 8955, 1429, 34577, 30567, -25985, -88193, -44358, -7563, -46403, -18698, 46969, 68735, 34045, 31821, -27907, -26477, 56757, 10266, -22799, -20328, 33412, 37521, 45854, 63664, 31533, 47486, 59350, 60408, 51147, 106436, 109272, 82388, 28880, 4381, 19359, 25950, 36520, 68425, 58014, 73988, 81515, 17830, -20967, 24084, 31765, 40794, 44236, 75480, 63585, 22398, 46351, 24869, 47690, 43368, 25087, 35567, -736, 19162, 59684]
7783E9684J7932r836j0677l2828n996l9182l2654j7627R4654R0537o4477l0851
7771A8679K9032M1298o7239L671L816R846J7480l2802n400j0135N3454O832m8242
7758B0290K0104o437J8436q294n5522j3159N0150k8462R095j0631m535J4090K3593
7745B8718L3786M0263m8326n0317k2552n064k0044L1671Q6266N0152Q614j9650
7733A13517o3176l1778O03m6441r1320m7005Q2270P1744O6999J6880m2631k3614
7721F048O371J8790l1161K9882J0822m0179r146m436o0017J4679N7520O0119M8176
7708A07468q512l0232k6456M472P296r399l1759j1893L1551L8726L0297j1705
7696H9854m0463l2034M5517K4509K2263l0925k9401J4397j9653L13j02085r9714
$$ y = [59684, 77616, 67780, 57103, 24275, 18279, -20903, -53557, -71184, 23470, 114007, 49530, 18679, 47711, 89009, 21770, 25441, 29257, 39103, 56583, 23781, 18381, 8246, 61700, 68532, 20290, 40394, 33957, 52393, 44099, -11423, -24582, 25568, -2894, 6201, -4430, -8965, 5125, 28718, 62504, 102767, 54441, 4124, -18428, -23492, -43536, -11865, 74401, 124553, 133167, 113517, 50341, 18563, 19166, -27275, -118595, -165600, -83330, -11586, 55413, 72293, 29662, 6048, 12419, 31209, 48, 29930, 40752, 573, -8573, -13009, -73026, -58347, -827, 59292, 107468, 98956, 68724, 42268, 46740, 54036, 44637, 12878, 985, 32536, 71262, 101559, 89854, 49391, 17357, 62874, 87383, 109646, 78721, 49320, 63717, 44064, 44377, -57708, -157422]
7684a57422J9434O3413O8172L2904l4055o3349L0186j1862N7306J1692k2783k8783
7672c5147m6983L2862O4018O3275M1424j1012m9501p1124m0531m2697N614M8518
7660d1284k3095k5111J0331K6897L2636j8764o0674k6085J4852J0825Q362l5788
7648a26898O4748M1729Q091J0716q208n9990k4555L3614M1793j0569m1094L2958
7636c7665N3690M1642R301k3953L7572n7085O930K1239K1549m6753k9693o310
7624i536k038O90j5422J4394R7580M4209l9333r8091k7630k1709L2853P5597K2161
7611G3725j0010m2603n6168j2506O337l5526n9681K1198N6701M8030L9906k0061
7599I342l915K0847J5399M961k5086J7283l1792M9677K5534l2753k3132n7688
$$ y = [-157422, -137988, -74575, -6403, 26501, -7554, -70903, -40717, -52579, 4727, 16419, -6364, -35147, -82130, -49268, 14750, 78025, 119449, 108437, 58936, -12188, -52719, -95416, -89802, -41284, -64379, -89490, -79159, -52262, -19626, -38390, -99064, -125149, -110297, -99472, -91110, -126898, -62150, -20421, -12330, -1614, -9822, -69812, -94367, -60753, -18960, -29529, -70623, -37665, 16025, 57667, 66968, 43015, 80587, 23502, 30432, 51671, 73220, 26467, -3226, -9536, -11574, -10884, -26306, -11912, 85668, 129877, 90544, -7547, -35177, -56886, -24033, 51564, 73725, 63715, 21112, -35056, -47562, -41225, -76751, -136432, -115234, -58533, -10503, 29403, 9342, 5427, 26274, 41673, 46634, 21548, 38831, 7039, 56716, 82250, 49497, 26365, -31323]
7587c1323m0532M2993L4471L0083L5866Q633n8730j8143l6488k4490j0501K579
7575f5582n794M1560Q2621M4606K3291J5663l4043m1477j06729L7960N3043K2321
7563F7440o2556n5076m8565R937J5696O3473J7711l2384M5441j892o351L4782
7551D7656J2276n8165n6791j6284K5969R1276M0665n7059n0072N0249l1050p074
7539h404M7997J5108l1145p946J5592j604n8605m20N9506j9672q2989l0777J4325
7526h9034k552J5090K9354k8075k6864M5423n42J9727O030l7115J2027L1950K6100
7513A519m0871p903L5233Q7588o3081m9485m1308K9557J4072L45M409k8920Q56
7500e7989M7261J3286n7294l6065K4469l4317m3348J6950M8756M7000L8351K9615
$$ y = [-31323, -71855, -28862, 5609, 35692, 71558, 80191, 21461, 3318, -33170, -57660, -68161, -65582, -71376, -29816, 52805, 97411, 120702, 136365, 102322, 60845, -45884, -7924, 45119, 67440, 4884, -50192, -98757, -88820, -73124, -9651, 8060, -24324, 21117, 19225, 12874, 47656, 59932, 1767, -55024, -71308, -45339, 45937, 86602, 29543, -20529, 29720, -1330, -8404, 39593, 54701, 23556, 15610, 31202, 29598, -29007, -29427, 30079, 10407, -72582, -103359, -89034, -91586, -76496, -47142, -75217, -102081, -56658, -57200, -37473, -31443, -68558, -56531, -24581, 1519, -39352, -47255, -12022, 75566, 12485, -37000, -78308, -48751, -34679, -34334, -29925, -58845, -57989, -10728, 2558, -54736, -90801, -66332, -100649, -143997, -127047, -78291, -31291, 7060, 36675]
7488C6675J4632o6979n1363M3117p66K3363L0503K7944J5553q3345n2085J3517
7476d9234L0494J8961N6414L6177L8457K2200L315n8238o9312n9453N069N2229
7464B7079k3707J7952L1535j0725J2663L4787o8866j2885j1071o6547l3708M2391
7452f1102L5659L4776L2224k4857o1104L6030j5975p1942m0286j1474K4544M9728
7440g3779L6756J3767k0196L6212K7390L5415q527j0221K6783K6277k5312n0605
7428A3960r55k8628j874k6342j4337o0185J8713L4711n0000j592L0972M675N791
7415g5091K8426L7786L7269k1977l8604M1548J3420L4150k2449l3486O3990n1914
7403A3068q0108m6679k7195j020J6690J7314J9323L5804P424R1026M1166p982
$$ y = [36675, 51307, -15672, -67035, -23918, -24684, -1321, 29182, 57126, 72679, -10666, -62751, -49234, -18740, 221, 56635, 92812, 131269, 153469, 156784, 98546, 29234, -30219, -25150, 27079, 3372, 21324, 52859, 42134, 54797, 89584, 20718, 7833, -3238, -69785, -103493, -61102, -25443, 9333, 41557, 16700, -44404, -8374, -24349, -96291, -136577, -148051, -123507, -73779, -37023, -23256, -43452, -7240, 20150, 55565, 47038, 36817, 63600, 89877, 64565, 13960, 13005, -15623, -17497, -43839, -58176, -118361, -99648, -64937, -114937, -116529, -85557, -80882, -75091, -46665, -8879, 28390, 6413, -32191, 9357, 22777, 56927, 34478, 992, 64982, 13068, -67040, -113719, -140914, -141934, -125244, -107930, -88607, -52803, -45379, 45647, 86813, 78831]
7391G8831J9539K88p8050k3807K4053k5791l0742l0591k5134j1883j5595L5214
7379h3668J2982J0756k9657K3357j9864n1386O1138J06181K0258j8521m7535K343
7367a3616K7960K0962j0078l2568J3032q659M2625n2966n2527m1391K9841N1919
7355b5466j7656m1679J3997M9198L2572K2963q740r061o895l5627l696M9526L4672
7342E4108K4343l5287n2215r520N7235k0843r401M321K1879p375j3450k7307j054
7329a4566K1997K4161m5493J6825n851k0387k3227k229j383L5987O2933O498K6782
7316H2047O8226M1634k2554o2883l949l9503K3949k0180o7374p1031j9853L4183
7304e7288K4215O602j670K486l2933P011m8195J8332J7384J6715O2808j7328j0452
$$ y = [78831, 98370, 98658, 20608, -3199, 20854, -4937, -35679, -66270, -91404, -103287, -118882, -83668, -70686, -59930, -89587, -66230, -86094, -137480, -76342, 29839, 50097, 31576, -15959, -13616, 14344, 35306, 25228, -7340, 5692, -2967, 39658, -13308, -65835, -107226, -77385, -25466, -43122, -84801, -70804, -21606, 10966, 33929, 25189, 16128, 9233, -26394, -30090, 19436, 54108, 78451, 43164, -9051, -18571, 38664, 17821, 8420, 12741, 34620, 27245, 13795, -13512, -14566, 7431, 31592, -13901, 2924, -2927, -23314, -46541, -48770, -50153, -14166, 48767, 55265, 82047, 150273, 191907, 169353, 106470, 102521, 63018, 86967, 66787, -587, -71618, -91471, -57288, -33073, -26471, -28141, -25655, -58588, -51577, -99772, -81440, -64056, -47341, 15467, -1861, -12313]
7291a2313K913K212J4874P0701P469m2056o3703J6388k1421j9248o9364O5336
7279d8212L4784n1521l0362N3086L7696M1475K0551J6938m011j1531l7409J4318
7267C5802k2715n3133q75K4106L2278K5930l2404k3909k0307K4574L2693K8788
7255E0828m550N748q124J2991J456N278p5895o245J3269m7398p583L2205M2048
7242A4028n928j2801J9591L3243r095j5717J8075o4745m9847L6945j6372K5436
7230b7187J4864L1523o6836r131j996M6902k2778m7551k8846O381L0548L4600
7218c9507L208L7220J8828K3773K0141j12646p0689N2276K4635m9896n4389K5208
7206a21838J1181J05262m0606n5737L9974M3090q7814l0640K2781M2320N3228
$$ y = [-12313, -9400, -7188, 7686, 78387, 85856, 43800, -19903, -3515, -24936, -44184, -113548, -48212, -13428, -64949, -95311, -42225, -4529, 36946, 57497, 74435, 70424, 58893, 21484, 35802, 13087, -40046, -40921, -16815, 15463, 41393, 8989, -14920, -35227, -10653, 22040, 50828, 46278, 52026, 43902, 56893, 58349, 63627, -12268, -18513, -5244, -52642, -60225, -28020, 14028, 8100, -4701, 14890, 48133, 39038, 23321, 41396, -23349, -73196, -36251, -52623, -27187, -12323, 19200, -47636, -56767, -58763, -11861, -34639, -82190, -111036, -104655, -74107, -39507, -36299, 921, 19749, 43522, 63663, -48983, -119672, -67396, -42761, -92657, -147046, -121838, -110657, -5395, -46001, -101738, -61764, -18674, -106488, -137128, -114347, -72027, -18799]
7195a8799p943k1308k7802K858J4900j3201J7257M1857r119l5669N48P1612K751
7182A7942o0593J4366K2505Q443k7650k7602j0928j5763q375K075O3483O235k0253
7169c6115p107J226L0273L9564K7975M4120P6234m048o5885o1388j3275n590n123
7156B0861j256K1410l270k0588m1632k0292l0348M2650J1749M929K8367K5891
7144C8471M724N8813L6872J255k3915l2763k5047n839l4516M1585J2108n5425
7132A6323m5982N2992O2975Q291M6614o5507m7520l5685r42q5404n6201L5154
7120a14892Q4025K8525k8997N763R2829L5114j9400l7094m4029l0812q324j2710
7108e0002N6777k3732L2124L1532m383J0147M1703n033l7923J5139p238J3556
$$ y = [-18799, -26742, -48050, -75852, -72994, -58094, -71295, -54038, -12181, -21300, -56969, -56421, 15191, 17942, -42651, -28285, -5780, 2663, -24987, -52589, -63517, -79280, -87655, -85580, -22097, -15862, -36115, -43222, -41996, -11723, 27841, 55816, 99936, 176170, 172122, 106237, 44849, 31574, 25984, 20861, 19605, 41015, 37745, 17157, -24475, -44767, -75115, -32465, -20716, -15787, 12580, 38471, 43195, 102008, 138880, 140135, 116220, 83457, 58410, 52571, 18055, 59640, 71748, 16323, -29659, 23333, 86308, 94599, 141213, 75706, 28186, -7499, -8441, -93845, -150046, -114892, -30867, -2342, -31339, -25576, 67253, 102367, 82967, 45873, 1844, -28968, -37292, -50002, 6775, -16957, 15167, 46699, 42316, 52463, 94166, 89133, 51210, 66349, 59111, 72667]
7096G2667j5538R138K9642L0072n9465o1077J2236J806j5549l9900k8127M7522
7084a6573J3393N2888j3264K703M0507p5648o6298K0360L0349J8428P798k4388
7072i745n8045p817R3584O0040J0959l0295K4068J7283J283q261m3756j6081j3493
7059A9724l4901M368O7848l0258m6054L5509M603p4257O2450M8232j4489k945
7047C9830k7059k7567n4119p165K053k9274j7478l903M1189J00857K26j8060L8037
7034C7567l7221m8710q669J2428j7769L2641m7367p1299L4229L2782P632L6799
7022c6957J2972R284k3015r880k856l169L5556l4030l3874J1379K7317N234O683
7009c5356J8640N9409L8650k3399K4734M6473m6591l0028k0295L846j9351j3867
$$ y = [72667, 57129, 66267, 95909, 125981, 66516, 5439, 17675, 19481, 3932, -35968, -64095, -16573, -3180, 49708, 36444, 39147, 79654, 4006, -62292, -41932, -11583, 6845, 14643, -9745, -67790, -75607, 17977, 78017, 88976, 58681, 82749, 100032, 101315, 93054, 49298, 33217, 19724, -15177, -10809, 57039, 26781, -19273, 16236, 20839, -53418, 9032, 57264, 42775, 39830, 12771, -14796, -68915, -76080, -74027, -103301, -120779, -124682, -83493, 17364, 17590, -470, 37567, 346, -48364, -57033, -44605, -62374, -29733, -77100, -148399, -114170, -81388, -73756, -36957, -23985, -14701, -37716, -47596, -50452, -53621, -18065, -52095, -85969, -74590, -47273, -42039, -35356, -16716, 42693, 81343, 57944, 82678, 129151, 82560, 52532, 32237, 36083, 16732, 2865]
6997B865k9317r354M0756n1871n5089k1143M4869j2652J7393K9126K2289j9929
6985d2057O3796L6846n5705l5300P72J4165N8828K8211P431l5039O558K1954N2602
6972A23062n4575p3309l7924j4821N1169j3474m0466O431l2419p889K8079k9995
6960i6131L370J3800M6271O3892j1466k0172M4009L6032m2415o1507R197J0601
6948d519N8357M3532o240l5413r5485L9966J4355j9931k797k2638K8238l6884
6936c9459J7652M0775K1178j6390J7936m6701p475k1438j7309K4285M4572N5599
6924G3225k2546k1182J4414l0552l0999l10J2933M6089m1971M969N9951k4588
6912C9433J8930m4302j7754L980j9593o138j5864L2985O4051p6535n1582O8993
$$ y = [2865, -26452, -35806, 4950, -46921, -102010, -123153, -78284, -90936, -73543, -44417, -22128, -42057, 21739, 58585, 2880, -32420, -31648, -17483, 41345, 69556, 76987, 41948, 48506, 70460, 123062, 68487, -4822, -42746, -57567, -6398, -19872, -60338, -53907, -86326, -94215, -66136, -96131, -92761, -78961, -32690, 31202, 19736, -436, 43573, 79605, 37190, -24317, -15120, -4519, 53838, 97370, 91130, 55717, -39768, 198, 14553, -5378, -8175, -30813, -2575, -39459, -21807, 18968, 40146, 23756, 41692, -5009, -12484, -33922, -51231, -26946, 17626, 73225, 50679, 29497, 43911, 13359, -17640, -17950, -5017, 41072, -899, 4070, 64021, 39433, 58363, 14061, -3693, 287, -19306, -25444, -41308, -8323, 55728, -20807, -72389, -3396]
6900c396k3706k4146M6830M5682k4879m5010l4946M533K9842L9838M4130j0025
6888D4747m0964m8162M1026J2933p534O917l79j0813Q974j5942k0569k8315q010
6875f6091O5832k7303l8882M627M6111N1139k3066J6063p5360r118N1952k8918
6863c3014n3372L5064R9974j4590m597n460O983n5294j5827K1476j6308J8085
6851a6880O458J0253P581k1832j8958n671N7309O9214L1130m0880l8032J1005
6839E0697k3933k3493k8093n1204M7566j9268M2797P2692j8327k7795q6572l1840
6827i6773K5207P377k7145k3840l1980L8121L3697J6931M9937J7088l9997j0514
6815d1891N1725P0310k5310J9325O3502L1034n7275p7700n6527K8434k3016K7803
$$ y = [-3396, -27102, -51248, -4418, 41264, 16385, -28625, -63571, -59038, -29196, 10642, 54772, 44747, 3783, -44379, -3353, 9580, 2046, 8963, 8584, -2229, 6745, -9197, -29766, -58081, -66091, -259, -27562, -66444, -61817, -15706, 35433, 12367, 28430, -46930, -56048, -4096, -33014, -86386, -51322, 48652, 34062, 29465, 24005, 30988, -24306, -40133, -18657, -34965, -16880, -10422, -169, 7412, -14420, -33378, -39049, 18260, 87474, 118604, 77724, 39692, 50697, 26764, 3271, -24822, -76026, -28460, -47728, -4931, 67761, 49434, 21639, -64933, -96773, -71566, -64189, -91334, -115174, -147154, -109033, -75336, -58405, -8468, 8620, -31377, -41891, 9834, 80144, 54834, 74159, 137661, 168695, 111420, 33720, -22807, 5627, -17389, 10414]
6803A0414k9664l3841L652N7100O3592K2584j4461r3663k2316l4895q1398L2083
6791a20813L8620k3640O147K3721Q5235J1482p7244O053Q2657O7101J7572m1136
6779G5755r3025j5775O2310O2783j4730m3443Q510J8040o0720k9135M7684L3289
6767E1543J0179q0196o9543O997R0024M1968j6175j6135K4611O41j1032N1296
6755H4178m6297p6024L6400L7789R289j1558j1074N4831k9791J3314m009J3190
6743G0238o8691k7309R8803O2489l4513o716m4393k9222M1888Q7536M7323J0011
6731B07444J9298M9255M1126K0916j3563j09214l9398o8779o5172n7781N471m682
6719a5079k458k1494K4049Q5236j3047k5607k2770m513k0423k1007j3882k333
$$ y = [10414, -19250, -53091, -49439, 7661, 71253, 93837, 79376, -14287, -36603, -71498, -152896, -120813, -82193, -105833, -99686, -75965, 9270, 20752, -56492, -50439, 32218, 99319, 116891, 75755, -17270, -33045, 29265, 92048, 77318, 33875, 42385, 60425, -295, -29430, 18254, 51543, 61722, -18474, -88017, -81020, 9004, 50972, 34797, 18662, 43273, 43914, 32882, 84178, 37881, -38143, -1743, 36046, 45335, 33777, 22703, 77534, 47743, 61057, 57048, 70238, 1547, -25762, 73041, 135530, 101017, 94301, 49908, 20686, 62574, 150110, 197433, 207444, 226742, 275997, 317123, 338039, 324476, 215262, 175864, 107085, 41913, -15868, -10397, -15079, -17537, -39031, -14982, 70254, 57207, 31600, 8830, 4317, -16106, -37113, -50995, -53328]
6707e3328L4885L9244M6395j0755o5329k9884k506n761J2332L4031J3880J6012
6695B9216k146l5632n234j1637O5017N3492k1921k0620L0221p754p6714j2049
6683a5761J7147k925J9659p734k5350o559k3154k0663l1239L499O8153n7499j1414
6670i3840k378J2921N6486K2219n577J5919L0218n327k9940K5615K8575j652J8490
6657G1729J9709J6307p7722l6496J2344J5264l958p677j7452l4620l9094N0499
6645c1167k239k3278j3219k9497J7415n465J911L906m1780O8792R985l4547L1615
6632d7568N3127J5528o1888l6747n860M9441M1935l4108K8553M404M9488j5322
6620D0983j0459p3195k2712O7000K5392q339l3412l5710L4079m9743p3K8050O7530
$$ y = [-53328, -18443, 20801, 67196, 56441, -8888, -38772, -41278, -47039, -34707, -676, 13204, 29216, 27070, -8562, -13796, -25433, 39584, 93076, 71155, 50535, 80756, 73002, -3712, -15761, 1386, -1539, 18120, 10386, -14964, -21523, -44677, -65340, -96579, -93080, -24927, -82426, -93840, -96218, -83297, -26811, -4592, -10169, 5750, 35968, 30641, 701, 26316, 54891, 53239, 71729, 91438, 107745, 30023, -6473, 5871, 21135, 17177, 9500, -7952, -42572, -81666, -31167, -33406, -56684, -69903, -99400, -81985, -87450, -85539, -81633, -123413, -54621, -44636, -79183, -47568, 5559, 21087, -40801, -77548, -83408, -33967, 7968, -26140, 2413, 6817, 56305, 40983, 30524, -42671, -65383, 1617, 27009, 18670, -14742, -50452, -16373, -66116, -66189, -38139, 29391]
6607B9391J1887o463o5100L318K6088j6659k0538j7500q657L0225R52l5221m3926
6594a12203L6652J0021l3185N7589O2070J9858m64p0623M5Q0994J9313k6968O869
6581D9968l0897q571p6337l020L9515L2106l191K6505N1095L1847m7407m3816
6569A7797M1606j8944k0312n1880j0223J3354j858J9427J3236L9360k1149P617
6557B8031J5947m1833l6153L80k7371r167J7123j634O7522P6836m7345k7114K6539
6544D1761j8560K8785q590j6461P6103J1778k1429j014k0013l4864K3170J8122
6532G8788l6954K0425n5186n7185k7158m0251l7559m620q244R574O3467P6742
6520a8161L3623J40n2132Q120J807j3731L4J6964L3927M437M788J7723O713n7272
$$ y = [29391, 41278, 34815, -30285, -26967, -879, -17538, -38076, -55576, -64233, -34008, -33056, -68277, -112203, -75551, -65530, -98715, -41126, 20944, 40802, 40338, -30285, -30240, 50754, 70067, 43099, 49968, 19071, 10500, -65837, -68857, -29342, 2764, -427, 26078, 77173, 109020, 61613, 17797, 59403, 40459, 20147, -31733, -41956, -28602, -30460, -11033, 2203, 41563, 20414, 28031, 43978, 2145, -34008, -33628, -60999, -70166, -53043, -54677, 12845, 89681, 42336, 15222, 41761, 23201, 51986, 43396, 26935, 103038, 114816, 93387, 92373, 72360, 37496, 60666, 78788, 41834, 62259, 7073, -50112, -77270, -117521, -155080, -159700, -167944, -158370, -94903, -18161, 15462, 15602, -36530, -28410, -26603, -40334, -40300, -23336, 10591, 15028, 19816, 37539, 44252, -13020]
6506a3020k4020O291L6784k6223j9120L2336N4702o6882n9413P1077J6802j6891
6494g577n9789m0675L3084J3029J6198K8353K8772k0310o7131P024K4078k0883
6482f5827n0004l8455K6503N8587j592j3432K2140K3667O1676L6961j0113o0975
6470a0864j1524k6721m3703p774J9524R002k47q074k62R99j8416m706j05450O284
6456b01932N9494M4260J10976N7170p0482k7120M4687M521j1210k5098j9478k1171
6444e5383J1548N8040P9146K5615p5345j774k4041n4247J6745k2880p413j247
6432e1236J7936k512l7343j9615j0764N027k239Q5646N3713Q201l5162o0470L7971
6419a0847L3009M1936k5666j3563K704k9946p492P381n5873k1314P505k2693J3573
$$ y = [-13020, -37040, -30749, 6035, -20188, -39308, -6972, 47730, -19152, -78565, -7488, 9314, -7577, -67366, -108041, -74957, -61928, -45730, -17377, 11395, -8915, -76046, -69022, -44944, -65827, -115831, -154286, -127783, -69196, -70788, -84220, -62080, -38413, 23263, 60224, 50111, -10864, -22388, -49109, -92812, -100586, -81062, -72060, -72307, -80381, -80643, -79644, -98060, -102766, -208216, -201932, -142438, -98178, 12798, 69968, -514, -27634, 17053, 21574, 10364, -14734, -34212, -55383, -43835, 14205, 93351, 118966, 43621, 41847, 17806, -36441, -19696, -42576, -49989, -51236, -33300, -35812, -73155, -92770, -103534, -98507, -100746, -15100, 38613, 46814, 11652, -48818, -10847, 22162, 64098, 38432, 24869, 27573, -2373, -9865, -2484, -58357, -79671, -72166, -94859, -81286]
6406h1286L1139P588J3407M4614j0933o0904l5397J0161N4628K2467J3287j9409
6394a0638O286j7904n2271O8034P2124n9074j08325L1166L0733K7695L1385L9680
6382E8891J265k9409l0403M756P8205J5215k1561q7779k4461k6564O348K4694
6370c0803k0939k8814K085K3460L5784K1876k4281L635J4152Q824N6331k657k0431
6357C8222j4240l6382L0412R6531j5407m5919K8838k127o0822p6133k6284L5857
6345d7454M3489N1331N339k4376J4199l5664n770q879K2792j0971l2409j7577
6333d5950r866R1139j5071k9043K8928J2238n9744k115J8080N6503O4584N294
6321A14977o1945j8752J3592r700n5325j1644k4911J5479L682N7154j215k8975
$$ y = [-81286, -50147, -42559, -29152, 15462, 4529, -56375, -91772, -81611, -26983, -4516, 8771, -10638, -4352, -22256, -74527, -6493, 65631, 6557, -101768, -70602, -39869, -12174, 19211, 58891, 60156, 30747, 344, 5100, 83305, 98520, 76959, -10820, -35281, -61845, -55497, -30803, -51742, -80556, -78471, -55011, -19227, 2649, -21632, -17997, -3845, 4979, 61310, 58653, 38222, 23982, -12400, 18012, 114543, 99136, 53217, 82055, 79928, 19106, -57027, -83311, -47454, -3965, 47366, 52705, 28329, 42528, 6864, 1094, -7785, 15007, 4036, -28373, -45950, -55816, 35323, 20252, -8791, 20137, 32375, -27369, -29484, -11404, 45099, 109683, 114977, 53032, 34280, 47872, 38172, -17153, -28797, -53708, -38229, -34547, 22607, 21392, -7583]
6309g583R479k7542m4862N423L9543j5375Q922R291l5512n1329k8405L2153J1342
6296i4455P9569L851K3992m1906j1598K666j1225L8253Q0255N2192n9411k9245
6284C2938j7619j5463P5784L6334n2745m2503j4506M5252j18n1470l6691k1240
6272f2047R214M9545j9097o6933O807N4047j2025m192j1926j1778L1823M7187
6260A0625l116o3511L5568N0047M4348m188r3832l5007L2674K4833j4483K8492
6248A2450k0364o0551O1379M0694q386N9739K7100k6209n9711m2805l2463p4790
6236a23917n4192J203M3701R2208Q4165l2103n2040J808m0425K1631N2698p137
6224a2400M4277L1101k8531k3066k2799K9565M685m9165l6167M7936Q3984J8241
$$ y = [-7583, 1896, -25646, -70508, -65085, -25542, -40917, -31995, -22704, -58216, -109545, -137950, -105797, -94455, -14886, -11035, 12957, -28949, -40547, -37881, -49106, -10853, 69402, 121594, 62183, 32938, 15319, -144, 75640, 111974, 59229, 16726, 2220, 47472, 47354, -4116, -40807, -62047, -52833, -3288, -22385, -89318, -82511, -28464, -40489, -44681, -56607, -68385, -36562, 10625, 7509, -56002, -20434, 29613, 73961, 69773, -24059, -59066, -26392, -1559, -16042, 12450, -7914, -68465, -7086, 33608, 25222, 84961, 112061, 85852, 26141, -16664, -49127, -123917, -178109, -176906, -133205, -40997, 43168, 11065, -40975, -39167, -79592, -57961, -5263, -12400, 31877, 62978, 34447, 11381, -11418, 18147, 22832, -26333, -62500, -14564, 69420, 87661]
6212H7661l5683k7002l0464q5600J8632L4027O3246O1318j9727R743j5716O078
6200F6513K929l0144m5441j7305n0757k0691L0246j9708N5299j6058n2964j500
6188i9581L1671N0532J1003j1328j9803n0650O0630K7105M9846j0264q2493m6801
6176i0133K6986K5794L120M5007r190O4197P062l2675n5999n2649N947L4046J8371
6163a0116k7273J6536J0085J0347O074J438J8787l3406p0190m7415j0641J5572
6151a20202O650M5149q96J6238O7588n6146j8001R890L0852j0143j7354Q6362
6139C9987N4644L1965j701p4154Q177k2664p1489L2478Q5259n2867p1331L3898
6127g798N0341N2842L3987k5174J4822K335m146j13591o8163L7219K4287P8726
$$ y = [87661, 51978, 24976, -5488, -91088, -72456, -38429, 24817, 86135, 66408, 76151, 60435, 66513, 69442, 39298, -6143, -23448, -74205, -94896, -64650, -84358, -29059, -45117, -98081, -99581, -67910, -17378, -6375, -17703, -37506, -88156, -27526, -421, 49425, 39161, -43332, -90133, -63147, -37353, -34233, 10774, 1584, 65781, 72843, 40168, -15831, -68480, -62533, -28487, -10116, -37389, -20853, -10768, -421, 5653, 7091, 25878, -7528, -77718, -125133, -135774, -120202, -113552, -68403, -69299, -53061, 14527, -41619, -59620, -49730, -18878, -29021, -46375, 39987, 94631, 126596, 124895, 50741, 58918, 36254, -35235, -2757, 82502, 29635, -41696, -7798, 42543, 95385, 129372, 104198, 119020, 121355, 117209, 3618, -64545, -27326, -3039, 75687]
6115G5687k4927M808j0709m0374l3600l0612M7916m3154k2607l1717M6312P9910
6103A6933K9843m858M4377J4404o0206L218k4783K6659j581k6130K681l3722k2867
6090c6032K0642J00800N3426o0421l6249M9464k6408n2231n7508J1157L5212n7891
6078e6039j0618K1348J8300J8803m640j5744j3902l2786m2373L6411P1903K5867
6066A6530j6328J8097o2071q311Q5695O0228J7029m7904m5075l8337J3622J960
6054d865J1951J1205L1106J9546k9969m884j0206Q412K4643R499k5312j9901K6598
6041D7823P7133P74k4434Q773k710o8420r854l7932m8366k3103N5482L3188q059
6028B95L9238J2652n1573L1110N600j3111L9937l9256M015j5975j0694M5718O979
$$ y = [75687, 50760, 55568, 44859, 4485, -29115, -59727, -11811, -54965, -77572, -109289, -62977, 16933, 46776, 41918, 86295, 100699, 40493, 43711, 18928, 45587, 44006, 17876, 20557, -13165, -36032, -15390, 85410, 138836, 78415, 42166, 91630, 65222, 12991, -44517, -33360, 1852, -56039, -66657, -45309, -27009, -8206, -12846, -28590, -42492, -75278, -117651, -81240, -9337, 16530, 202, 18299, -43772, -52083, 33612, 93840, 110869, 62965, 17890, -20447, -6825, -4865, 7086, 18291, 49397, 68943, 38974, 34090, 23884, 32296, 56939, 66438, 41126, 21225, 47823, 124956, 125730, 101296, 110069, 107359, 38939, 29085, -8847, -57213, -80316, -24834, 8354, 295, 39533, 52185, 612, 31722, 37322, 24211, 64148, 24892, 28907, 12932, 2238, 47956, 54935]
6015E4935p3495j385P1480O6781o5089n1920p174q7435N257K5717K444L9843K0715
6002F74k7910n8225J6108L6349K6033M5850L8505j7194m9739p8632l9492O5585
5990d2088K1748o899J4094M5395m6678j4374j753L8534l8015K7672O907n8084
5978e3541n9578K8196N0491L9870J6935k4156k9422K6132K8004J0115l578L3992
5966F3460Q186m9303k7449J1192J4975J3801m0234l312j8733j5636M2168Q5776
5954H4891L7411L7827N329o1601l8838j6433j7347j5847N0871J6295K3072n3210
5942E2420n2504j1533L3304P916M4936J084L5144K0474q4293j5809k7993Q460
5930A1606l0605l42m58O605n31M864j5636m4648M6173N3002k0271L019K1219j0781
$$ y = [54935, -18560, -19945, 51535, 118316, 53227, 1307, -5867, -93302, -88045, -62328, -59884, -20041, 674, -27236, -85461, -69353, -33004, -6971, 38879, 77384, 60190, 10451, -68181, -107673, -42088, -20340, -27239, -13145, 32250, -14428, -28802, -30555, 7979, -30036, -2364, 4543, -53541, -113119, -84923, -34432, 5438, 22373, -1783, -31205, -5073, 22931, 33046, 29468, 63460, 71646, 22343, -5106, 6086, 21061, 34862, -5372, -8684, -27417, -43053, -885, 84891, 122302, 160129, 165458, 103857, 65019, 48586, 31239, 15392, 66263, 82558, 105630, 52420, -84, -11617, 21687, 29603, 74539, 75623, 110767, 131241, 46948, 31139, 3146, 11606, -18999, -19341, -19799, -13194, -13725, -8861, -24497, -69145, -22972, 30030, 9759, 12778, 33997, 23216]
5916B3216K0431N302o3086j20715p2972j390R802M1821M6872k506K4362O5739
5904b3124L5146j1980M0326O4734m4412n5039j7634k3179m176j918k1516k3311
5892h6083J7298L4114l874j6184K0283k0509J0906L2377m1870k531k8397j4229
5880i8699L5355N4290o660K7908q251l1262l0325N751K700M596j2020Q2551J3352
5867C9286p4993M775k5760M4559M4028k348l0693j0986j8641m432J791O139k8123
5854e5398R2598j3700N072m4807J7535m2578m8263M3372P5839Q142j3172n4307
5842b9667K7184K6398J8067Q724m6122J1967K2440J3261L1217l6247l1086l9424
5830b3288N4801R2079p6037r6349m3127m0692K6365J5533l6774n1302K5755J9534
$$ y = [23216, 43647, 48949, -14137, -134852, -207824, -209214, -199412, -157591, -110719, -113225, -88863, -23124, 12022, 42, 40368, 105102, 60690, 5651, -11983, -35162, -39338, -41256, -62772, -86083, -68785, -34671, -38545, -54729, -34446, -54955, -44049, -11672, -53542, -56073, -84470, -98699, -63344, -9054, -15714, 12194, 3943, -27319, -57644, -51893, -49193, -44597, -56617, 25934, 39286, -35707, -30932, -56692, -12133, 31895, 29547, -1146, -12132, -30773, -35205, -33414, -27275, -55398, 37200, 23500, 28572, -16235, 1300, -41278, -89541, -46169, 29670, 37812, 24640, -29667, -2483, 23915, 41982, 50706, 4584, 16551, 38991, 52252, 83469, 47222, 16136, -23288, 31513, 123592, 47555, -48794, -91921, -132613, -106248, -90715, -127489, -178791, -153036, -133502]
5818a33502N8741L4285n255k502k6575j2591K5138L7483j9168j4134L0875Q4832
5806E7627m719l8347j8405N6856K5938k7960J3925R554j8091o9885k8519k6697
5794f8723J7481K9205r02k0522L6328l0168o719N5616J3128k6937K7263O0600
5782H5650k4820J8839l887K2041K6140k6952j02967o4995R597K2243j1973m7144
5770i8228K4377M6797P605M3421N0077p6025q0560L030L4283q539K3486K1151
5758i125n8744k1877j797J2289N131J140J2852j7333k0705K5365Q3916k3494M9376
5745C6994N0117n0682l871L3231l742o3920j7339J150m7922j3230j2822j4839
5733a06875J4167K5297P7329K1600K6099n081m1738l8319k8520o59k5132k9172
$$ y = [-133502, -74761, -40476, -45731, -48233, -74808, -87399, -62261, -24778, -43946, -58080, -27205, 57627, 52908, 14561, -3844, 53012, 78950, 50990, 64915, 74469, 56378, -13507, -42026, -68723, -51242, -22037, -22939, -43461, -7133, -37301, -44020, 11596, 24724, -2213, 25050, 85650, 60830, 79669, 75782, 97823, 123963, 97011, -5956, -70951, -61354, -39111, -51084, -98228, -73851, -27054, -19449, 23972, 74049, -1976, -82536, -79506, -45223, -53762, -30276, -9125, -67869, -89746, -91543, -79254, -74123, -72983, -60131, -77464, -98169, -72804, 11112, -12382, 36994, 87111, 36429, 32558, 65789, 62047, -1873, -19212, -18062, -65984, -79214, -92036, -106875, -92708, -67411, 9918, 31518, 57617, 52536, 10798, -27521, -56041, -56700, -81832, -111004]
5721a11004j2652p3530L2525P3092L2462R5240L9129j3594m7461j1294L5L6217
5709C9165J6073j2031n6639m0637P116L4531j1384J9638J0490k1104J6767M3041
5697D5026K13o9176P361P6479L9182l0990k8655r171K490R793N2006r222L2856
5684A18192o3999p5775m9155K2248K7855k5537K9566J6839m4948K0224P6077J9135
5672G0722k7512J5563j3705l1006j747k3001k0161J2028l4642J6333J08791J666
5660G3329j08745K6680J8328j2601L485j1270Q415m180m6895J1930l461k1361
5648f6346L0845n46j4578N0636n4810n2145M6170P4463K3812j1055O6364o1425
5636C1385k0512j1374L8376k598K6707J5741l0161l7500J8068L788k1395Q474
$$ y = [-111004, -123656, -197186, -164661, -91569, -59107, 36133, 75262, 61668, 14207, 2913, 2948, 39165, 55238, 43207, -13432, -54069, -46953, -12422, -23806, -4168, 6322, -14782, 1985, 45026, 45239, -23937, -16576, 59903, 99085, 68095, 39440, 30269, 32759, 42552, 94558, 85336, 118192, 54193, -21582, -70737, -48489, -20634, -46171, -16605, 234, -44714, -24490, 51587, 70722, 43210, 58773, 45068, 14062, 12315, -10686, -30847, -18819, -53461, -37128, 71663, 73329, -35416, -8736, 9592, -3009, 476, -10794, -2379, -6559, -53454, -41524, -44985, -66346, -35501, -36047, -50625, 11, -54799, -106944, -60774, 13689, 37501, 26446, 92810, 31385, 10873, -501, 37875, 35277, 61984, 77725, 47564, 10064, 28132, 31920, 10525, 18999]
5624A8999J304l5503J6107o354o9106k422N5643J3260L1379L9644j3972K7816
5612G6795r525l8074p7735K1433K0953q8720o184R7058O1187J4062J9457J2101
5600A02808j0768K1313j4491n3070J5084l0590q3867j141M0424K7050K1166J5372
5588D9290K5200j6072n5630r1957P678O0100L8013l693L8165l4766o3349m0313
5576h7334R174K8843P294J541K8656q0451n2535j7918K892N6133k1165k3503L5209
5563a13164N5810K2876m9916J0499N3108M9594L123j4609l1834L7001l1393o2928
5551g1833N038l0242K6759R4756k4667l086J1305k2009j3506K5135J8120l6544
5539b0774o5924P2628P9797K9146o929J4859M985m8145l161m6178q9693m7072
$$ y = [18999, 20303, -15200, 907, -5447, -74553, -76975, -21332, -8072, 23307, 62951, 48979, 76795, 67270, 29196, -48539, -27106, -6153, -94873, -101057, -3999, 57188, 71250, 90707, 102808, 92040, 113353, 98862, 45792, 60876, 30286, -53581, -54722, -14298, 12752, 33918, 49290, 74490, 58418, 2788, -89169, -81491, -21391, 16622, 12929, 51094, 16328, -47021, -87334, -78160, -49317, -42023, -40482, -11826, -92277, -144812, -162730, -159838, -103705, -124870, -148373, -113164, -57354, -34478, -84394, -73895, -20787, 28807, 31930, 17321, -14513, 22488, -8905, -71833, -66795, -97037, -70278, 24478, -189, -3275, 8030, -13979, -27485, -2350, 15770, -20774, -86698, -14070, 65727, 94873, 87944, 102803, 107788, 59643, 56482, 10304, -79389, -126461]
5527a26461j1594L4666L3987K4775k4044p817J1018l0569m0455L2617J7841Q466
5515g7570k3356J1598j6936p425L9428K8424Q4472L6853p5678p6750j0107J3643
5503g3404O5370P0900J5027p3685K4130l611J782K678M0928j5423q6829n5955
5491h8092L3147M9867K2837k7912j2959M685l7881o0550M8278l0324K2733P5366
5479h05Q651L2862n7118M8836k9217M432K0726K8501J0081J5261P033l6927M496
5466E6812k061m4169r3651n874M1356M0358N0999N464n2973l8211J3703K9900
5454A653J6173R766j7515k7546L5414k3501m1103m38j5864K8417n069j8476k533
5441f0622j5185L9089L4318n82m4149N6285l5151p5338R72j5963l111Q7504K847
$$ y = [-126461, -138055, -103389, -69402, -44627, -68671, -76488, -65470, -96039, -136494, -103877, -86036, -77570, -100926, -89328, -106264, -113689, -74261, -45837, 38635, 75488, -190, -76940, -87047, -73404, -8034, 62866, 77893, 4208, 28338, 24727, 26509, 29187, 70115, 54692, -32137, -88092, -54945, -5078, 17759, -10153, -23112, -18427, -56308, -116858, -68580, -98904, -76171, -805, 7846, 40708, -16410, 32426, 3209, 7641, 28367, 56868, 66949, 82210, 89243, 52316, 56812, 54751, 10582, -83069, -88943, -47587, -7229, 43770, 49234, -3739, -41950, -28247, 1653, 17826, 27592, 10077, -17469, 17945, -5556, -46659, -47097, -62961, -34544, -39613, -58089, -60622, -75807, -36718, -2400, -2982, -47131, 9154, -25997, -101335, -100363, -116326, -119437, -31933, -29086]
5428b9086M9910l785K7286j1811r7986q4317P6452Q239N781P8048J200L1154j1506
5415C9579o5700M209P927k5060J9665k9903k8427N8992p9102n7498R2317K6926
5403c6075l5786L1097L5931k5260l9361M5864Q622m902j0874M322N7704q690q2254
5390e9662j232K4490n596j8828P3072M6522m7161o8643l2518m5463L5445K0772
5378g8802L1987Q8787j5640j7750k646j3002j7026j6028K41L1780j3403j5119
5366c6621l010J6430j6797k3310k0786q305J2400K1470J0042m4638n496J9911
5354g8710J3345J3901M0397J4195K8572j5278j1390k8911L561m7568m6742N847
5342a08781n0362k5273N4277M7634j7351K9507Q482N3694q714l8271j8271M3271
$$ y = [-29086, 20824, 17039, 44325, 32514, -65472, -149789, -73337, -65098, -59317, 18731, 19931, 51085, 39579, -26121, -21912, -13985, -39045, -19380, -49283, -77710, -18718, -97820, -155318, -63001, -36075, -71861, -40764, -4833, -30093, -69454, -23590, -14968, -19870, -30744, -26422, 31282, 22592, -59662, -60894, -36404, -42000, -60828, 12244, 58766, 11605, -57038, -89556, -135019, -99574, -78802, -46815, 41972, 26332, 8582, 5936, -7066, -24092, -40120, -39879, -8099, -21502, -36621, -39631, -23201, -39998, -63308, -84094, -92399, -79999, -58529, -48487, -93125, -98621, -78710, -65365, -51464, -11067, 3128, 31700, 16422, 5032, -23879, -20318, -67886, -114628, -108781, -159143, -184416, -130139, -82505, -99856, -70349, -61867, -8173, -16887, -55158, -73429, -30158]
5330c0158L0907L1413K3312L238r051l9803k5505J4772l6713j5566M3298k6707
5318c6563k0144J8560L4426J5101J1861J5230O18k4119o158M3831K8751n1826
5306B9568K3964j373j734o4028o2073K8810L0618n329k1005J4027J8518L8006
5294B7969N5506L2843l0688n6471m4364n3705l7118L9643K1850j4765n8281N157
5282a12424j706J6875M0001J5547K9546J2842k6234p10n9134j8380J7633M7143
5270c9001k2908r766K0986J3671R903L5604J8393m8608m9393K9520n689k0993
5258f8281L9787q416O94J1311K6265L1495p351j2159K9604K6668l0805m8584l2750
5245d2522l6985r619R6157k1822l6276l9852k0516O807M2013L0248j5726k9887
$$ y = [-30158, 749, 32162, 55474, 58712, 49661, 9858, -15647, -875, -37588, -53154, -9856, -36563, -56707, -38147, -3721, 11380, 23241, 38471, 39089, 14970, 8812, 52643, 81394, 29568, 53532, 52159, 50425, -13603, -75676, -46866, -16248, -21577, -42582, -28555, -10037, 27969, 83475, 116318, 85630, 29159, -15205, -68910, -106028, -66385, -44535, -59300, -117581, -112424, -114130, -97255, -57254, -41707, -12161, 681, -25553, -26263, -85397, -103777, -86144, -39001, -61909, -71675, -50689, -37018, -27115, 8489, 26882, -21726, -71119, -41599, -47288, -68281, -28494, -36910, -36216, -24905, 1360, 32855, 25504, 13345, 42949, 69617, 38812, -9772, -42522, -79507, -89126, 7031, -14791, -51067, -90919, -111435, -104628, -62615, -32367, -48093, -77980]
5233g7980K6024L112j9894l5663O9543M845l0675K8469K8679o633M8383k8543
5221I667o7632r012O871J037P735M7187M0228o7784l6109o0696n174K1930m56
5208a12208L0220J5795J0709K571K2176j7529n2454N4893M9087M7688P859n404
5196E3403p286J5864J5860j6470m8698N304Q54J5551j4566L1540N131p3705j4572
5183c1790K5469Q422q646k2662K7301j5186m3389R121P5282k6642m9400K4048
5171b8072M1065l0811k6690L7342Q6930J7368r3804m8971L2335j8175m2832j3839
5159h8154P6936M5385l5391o8994n2045k9786N2295K0668j0211J4425L8292J8111
5147a8469L1615L5712j1750l367j81Q596k2650L2128L0568m4564k1356O414l587
$$ y = [-77980, -51956, -48844, -68738, -104401, -34858, -30013, -60688, -32219, -3540, -10173, 38210, 9667, -57965, -66977, -60106, -59069, -51334, -4147, 36081, -31703, -67812, -128508, -133682, -111752, -112208, -81988, -66193, -55484, -52913, -30737, -48266, -100720, -45827, 3260, 50948, 58807, 53403, 46117, 61981, 77841, 61371, 12673, 17977, 18831, 34382, 19816, 51356, 56487, -17218, -31790, -6321, 2101, -6545, -29207, -1906, -17092, -60481, -51360, 23922, -2720, -52120, -28072, 12993, -17818, -44508, -7166, 79764, 97132, 3328, -45643, -13308, -31483, -74315, -88154, -11218, 34167, -1224, -70218, -122263, -152049, -99754, -79086, -89297, -74872, -36580, -18469, 13146, 48858, 37108, 33741, 33560, 42156, 19506, 51634, 82202, 37638, 16282, 22696, 19109]
5134A9109k2449L2117O3816m2583m8797l5167N6594P0331m341j53439k1063J3990
5122g1882O847k1236K9843q618k8497j7845N1517P086J4254J7942j0327J8466
5110a2450K0085k5470m2368k1532q596K478J4340j8865l6230l717M6736J4828
5098g0761k191N1459L6819n4535j6453J6388N2750R987n3294j98J2743M8199N921
5085C6834J1654o6786p3777k4414K1401K2399L3766j3769J8091K18L6558M599
5073F774Q394M0203k5559n1060K6714L0348K2589k8918j0544l5914L768J6053
5061B848m0077k6379m7582k9871J2811J1130M196K0830R5254J11881L9796r3473
5049F1364o9425l8444J2332L0740N3785P0335j8728n8976l524k9425k9805Q066
$$ y = [19109, -3340, 28777, 92593, 50010, 1213, -33954, 22640, 92971, 88630, -64809, -85872, -71882, -65035, -86271, -56428, -65046, -93543, -111388, -59871, -52785, -38531, -20589, -30916, -12450, 7635, -17835, -60203, -81735, -90331, -87853, -73513, -92378, -128608, -132325, -85589, -70761, -72952, -21493, 15326, -39209, -55662, -39274, 13476, 23463, -29831, -30029, -17286, 30913, 36834, 48488, -18298, -92075, -116489, -95088, -72689, -38923, -52692, -34601, -34383, 2175, 6774, 15168, 55371, 29812, -21248, 5466, 35814, 58403, 29485, 18941, -16973, -13205, 2848, -37229, -63608, -111190, -141061, -128250, -117120, -112924, -92094, 3160, 115041, 154837, 61364, -8061, -46505, -34173, -3433, 50352, 120687, 101959, 42983, 39459, 10034, -19771, -11705]
5037a1705j085k3863J8090j1726r229n548N3634P7158k8412k3177j0411l3454
5025i728l780L7705R407r400o248k7239L1881r899k1939m9575j693Q295J2528
5012c9685M8350o30J2323J0563r161k1708J4781P1042P3162n5897p4689J3349
5000D1800n5121l8544j3139L2247q701p091O6192O3439r3027q7336R41M2077O5051
4987H788J5613l605l8478k0696j5908M6859N3017K871L5147q391L897j6105O967
4974F9976k5848k3004K9680J7722K0813k7867k7740M3076m413J079J8968n1075
4962D1367k9498K181R415L541j156J0585P165o2814k1185j4490M5390j4704M5391
4949B1188O1172m9508r0065m664j1477M9766Q816K8852j805M699j6033J526m495
$$ y = [-11705, -12790, -36653, -18563, -30289, -39518, -45066, 8568, 85726, 57314, 34137, 23726, -9728, -13508, 24197, 33604, 24204, 17956, -9283, 22598, 12699, -9240, -58815, -60508, -52213, -39685, 8665, 8035, 20358, 30921, 21760, 52, 14833, 85875, 159037, 103140, 28451, 41800, -13321, -51865, -65004, -32757, -41458, -48549, 17643, 81082, -11945, -99281, -98340, -56263, 8788, 24401, 20796, -17682, -38378, -54286, -7427, 45590, 48461, 83608, 75217, 79114, 63009, 69976, 44128, 21124, 50804, 68526, 89339, 61472, 33732, 76808, 72395, 73474, 92442, 41367, 11869, 14050, 23465, 27006, 25850, 36435, 43600, -19214, -40399, -54889, -9499, -24203, 21188, 82360, 32852, -57213, -61877, -73354, -23588, -14772, 14080, 12275, 16974, 941, 2467, -2028]
4936b028K2924M5687J3481n3440j3500M6658M5316j6420m7486r8816l7412m4950
4924a39986l6392M8938O9400k933j8354l0918J7275N5781M696k6657M2847K0879
4912D576o8184N689M660j9933M4456N7674L9454m5071K0596J5032L8000j5377
4900H1572J9770o5127l7813j5479J1111J4444N14m6649m5491P541o947j4753L1328
4887f5979N2038M110O885r590q7813K0732Q3160K7643L1417l9751m8870l8990
4875f5008N4993R815m7871K7993P3265n6299p1561l1347k959k3279R416J3646
4863a09196R7646J7319k2753Q255O7261J5177l9349j1401m0425L5146L9235r1197
4851c4282n7644N7027K2286l2763o3079O659j4263K7695J027J2122Q113M3575
$$ y = [-2028, 20896, 66583, 80064, 26624, 13124, 59782, 105098, 88678, 41192, -57624, -95036, -139986, -176378, -127440, -58040, -60973, -79327, -110245, -92970, -37189, -32493, -59150, -16303, 4576, -63608, -57919, -53259, -73192, -28736, 28938, 68392, 23321, 43917, 58949, 96949, 81572, 101342, 36215, -1598, -17077, -5966, 8478, 8992, -37657, -83148, -75607, -82554, -97307, -65979, -13941, -9831, -2946, -12536, -100349, -79617, 3543, 31186, 62603, 22852, -26018, -65008, -10015, -200, -48071, -20078, 53187, -3112, -74673, -106020, -108979, -132258, -122842, -109196, -11550, 5769, -16984, -8729, 58532, 73709, 34360, 22959, -17466, 17680, 56915, -34282, -91926, -34899, -12613, -45376, -108455, -101796, -116059, -88364, -87337, -75215, -67102, -23527]
4839b3527L1812m1772j01604l7396Q7143R4493K119o3730J6607J646n2322L8674
4827d7857L8442O9671L1002j4782l8836l0404K0199K8403m4645o998J3150J1951
4815B9296r065M2490J1102o1408q0558n0234k4930J0565O758J3216L8091J7928
4803e6749K6179J9055j3571m645K3012M1974m2582J6670P2979K4613L8719J2094
4791A57748j5616n1613N268r772j1017l1815J2959j795J5971K8652o0950p4705
4779c6685n8996L0416P9364K3629l8362m7808k4963M9421Q4909K8387p7700k287
4767I325L9728m5640j4863j6687M8808o097L139L9175l6662k7184L8196l523j1574
4754A6141j2721K3074K8918k7409o2952O551k5109p347k2909j3267N3635j040
$$ y = [-23527, 8285, -33487, -135091, -172487, -85344, 9149, 11268, -52462, -35855, -34209, -86531, -47857, -9415, 60256, 91258, 76476, 37640, 7236, 27435, 55838, 11193, 4195, 17345, 29296, 20231, 62721, 73823, 12415, -68143, -118377, -143307, -132742, -125984, -112768, -74677, -56749, -30570, -11515, -25086, -29731, -6719, 35255, -7327, 9343, 82322, 106935, 145654, 157748, 142132, 90519, 95787, 86015, 74998, 43183, 56142, 54347, 70318, 98970, 38020, -36685, -95681, -65265, 14099, 37728, -634, -48442, -73405, -23984, 60925, 89312, 11612, 9325, 49053, 3413, -11450, -28137, 20671, 14574, 17713, 56888, 20226, -6958, 31238, 27715, 16141, 3420, 26494, 55412, 28003, -34949, -28398, -53507, -60854, -83763, -97030, -43395, -44435]
4742d4435l5044k3288K2607N5163L7257m5332l4484J1469M7713O0899k3686J5699
4730D4538J2675j3889k5985n0492p5955l1119R3320J01542j5858l9562M3075p2990
4718c0700k4702P1611L8068k7583n6887L4014J1773N0054n1620m3214j3288l332
4706d5806o432m9443K950L9153l4859n9662J4595L0099K80K7521L5709M8695l6824
4693c4024m3248N271l5048o6202j6553K3350L631K6060L2512O9041K8781L3560
4681B7131l5303m1642L90L643r371j4240J8673L4702J8507l3558l2843L014K7347
4668c3550K9388K9167N0314J6750m2103o3530k8128k2280L2433N5525Q515k3390
4656I111L969j3049l5252n8533J3154k8004J5145k3766J5194M4878L8213R893
$$ y = [-44435, -79479, -102767, -80160, -24997, 12260, -33072, -67556, -56087, -8374, 52525, 28839, 44538, 57213, 43324, 17339, -33153, -109108, -140227, -46907, 54635, 38777, -785, 42290, -30700, -55402, 16209, 54277, 26694, -30193, 3821, 15594, 65648, 14028, -29186, -42474, -45806, -52238, -101681, -98731, -59578, -94437, -154099, -139504, -109405, -109125, -81604, -45895, 2800, -34024, -77272, -72001, -107049, -173251, -189804, -166454, -162823, -136763, -104251, -35210, -6429, 27131, -8172, -49814, -49424, -45781, -55152, -69392, -50719, -16017, 2490, -31068, -63911, -60897, -33550, -4162, 25005, 75319, 92069, 49966, -13564, -41692, -63972, -31539, 23986, 32501, 9111, 13080, 31, -35221, -93754, -80600, -108604, -93459, -117225, -102031, -57153, -18940, -9047]
4644i047M855l0404R97r825j9217P904j1943M6864J9162l9433Q095O62k4922m6107
$$ y = [-9047, -4192, -34596, -33599, -43424, -62641, -54737, -66680, -19816, -654, -40087, -31992, -31330, -56252, -102359]
$$ [...]
##END NTUPLES=NMR SPECTRUM
##END=
