##TITLE=Analysis number 316896
Compound Code cc 49916
Book Reference 458/84
Project Code adrs
Chemist Name stevem
##JCAMPDX= 6.0         $$ Bruker NMR JCAMP-DX V2.0
##DATA TYPE= NMR SPECTRUM
##DATA CLASS= NTUPLES
##ORIGIN= Bruker BioSpin GmbH
##OWNER= nmr
$$ XWIN-NMR		Version 3.5
$$ Tue Jan 31 11:31:17 2006 GMT Standard Time (UT+0h)  MAYBRIDGE\nmr@NMR_250MHZ
##.OBSERVE FREQUENCY= 250.131544655141
##.OBSERVE NUCLEUS= ^1H
##.ACQUISITION MODE= SIMULTANEOUS (DQD)
##.ACQUISITION SCHEME= undefined
##.AVERAGES= 16
##.DIGITISER RES= 18
##SPECTROMETER/DATA SYSTEM= dpx250
##.PULSE SEQUENCE= zg30
##.SOLVENT NAME= CDCl3
##.SHIFT REFERENCE= (INTERNAL, CDCl3, 0, 16.522)
##AUDIT TRAIL= $$ (NUMBER, WHEN, WHO, WHERE, WHAT)
$$ ##TITLE= Audit trail, XWIN-NMR		Version 3.5
$$ ##JCAMPDX= 5.01
$$ ##ORIGIN= Bruker BioSpin GmbH
$$ ##OWNER= nmr
$$ C:\u/data/dgb/nmr/ADRS/15420/pdata/1/auditp.txt
$$ ##AUDIT TRAIL=  $$ (NUMBER, WHEN, WHO, WHERE, WHAT)
(   1,<2006-01-31 11:30:49.59 +000>,<MAYBRIDGE\nmr>,<NMR_250MHZ>,
      <created by zg, POWCHK disabled, PULCHK disabled
       configuration hash MD5:
       62 19 C7 07 E1 42 D1 B7 37 6C 3D D0 77 39 F9 E6
       data hash MD5: 64K
       17 55 A4 D4 C8 F7 B8 15 4D 02 BC C6 B1 25 64 6D>)
(   2,<2006-01-31 11:31:07.00 +000>,<MAYBRIDGE\nmr>,<NMR_250MHZ>,
      <Start of raw data processing
       ef LB = 0.3 FT_mod = 6 PKNL = 1 SI = 32K 
       data hash MD5: 32K
       32 13 30 78 C9 A1 0B 1D 08 02 66 92 D4 8D 22 2F>)
(   3,<2006-01-31 11:31:08.88 +000>,<MAYBRIDGE\nmr>,<NMR_250MHZ>,
      <apk 
       data hash MD5: 32K
       D3 B2 50 94 EA 4C 1C 9B A8 84 67 78 6E 77 E0 D6>)
(   4,<2006-01-31 11:31:09.63 +000>,<MAYBRIDGE\nmr>,<NMR_250MHZ>,
      <abs ABSG = 5 
       data hash MD5: 32K
       E3 E0 45 53 BB BA DC C0 4E 9A 73 58 31 8C 3E 16>)
$$ ##END=
$$ 
$$ hash MD5
$$ 88 39 88 6F 0E AD BE CF A2 FA 78 86 82 2A B6 AE
##$RELAX= 
##$RELAX= 
##$RELAX= 
##$RELAX= 
##$RELAX= 
##$RELAX= 
##$RELAX= 
$$ Bruker specific parameters
$$ --------------------------
##$DU= <C:\u>
##$EXPNO= 15420
##$NAME= <ADRS>
##$PROCNO= 1
##$TYPE= <nmr>
##$USER= <dgb>
##$AMP= (0..31)
100 100 100 100 100 100 100 100 100 100 100 100 100 100 100 100 100 100 
100 100 100 100 100 100 100 100 100 100 100 100 100 100 
##$AQSEQ= 0
##$AQ_mod= 3
##$AUNM= <au_zg>
##$AUTOPOS= <19 >
##$BF1= 250.13
##$BF2= 250.13
##$BF3= 250.13
##$BF4= 250.13
##$BF5= 500.13
##$BF6= 500.13
##$BF7= 500.13
##$BF8= 500.13
##$BYTORDA= 1
##$CFDGTYP= 0
##$CFRGTYP= 5
##$CHEMSTR= <none>
##$CNST= (0..31)
1 1 145 1 1 1 1 1 1 1 1 1 1 1 1 1 1 1 1 1 1 1 1 1 1 1 1 1 1 1 1 1 
##$CPDPRG= <>
##$CPDPRG1= <>
##$CPDPRG2= <>
##$CPDPRG3= <>
##$CPDPRG4= <mlev>
##$CPDPRG5= <mlev>
##$CPDPRG6= <mlev>
##$CPDPRG7= <mlev>
##$CPDPRG8= <mlev>
##$CPDPRGB= <>
##$CPDPRGT= <>
##$D= (0..31)
0 1 0 0 0 0 0 0 0 0.06 0 0 0 0 0 0 0.0002 0 0 0 0 0 0 0 0 0 0 0 0 0 0 
0 
##$DATE= 1138707048
##$DBL= (0..7)
120 120 120 120 120 120 120 120 
##$DBP= (0..7)
150 150 150 150 150 150 150 150 
##$DBP07= 0
##$DBPNAM0= <>
##$DBPNAM1= <>
$$ [...]
##$SUBNAM7= <"">
##$SUBNAM8= <"">
##$SUBNAM9= <"">
##$SW= 20.6930455092707
##$SWIBOX= (0..15)
0 0 3 0 0 0 0 0 0 0 0 0 0 0 0 0 
##$SW_h= 5175.983436853
##$TD= 65536
##$TD0= 1
##$TE= 293.16
##$TE2= 300
##$TE3= 300
##$TEG= 300
##$TL= (0..7)
0 120 120 120 120 120 120 120 
##$TP= (0..7)
150 150 150 150 150 150 150 150 
##$TP07= 0
##$TPNAME0= <>
##$TPNAME1= <>
##$TPNAME2= <>
##$TPNAME3= <>
##$TPNAME4= <>
##$TPNAME5= <>
##$TPNAME6= <>
##$TPNAME7= <>
##$TPOAL= (0..7)
0.5 0.5 0.5 0.5 0.5 0.5 0.5 0.5 
##$TPOFFS= (0..7)
0 0 0 0 0 0 0 0 
##$TUNHIN= 0
##$TUNHOUT= 0
##$TUNXOUT= 0
##$USERA1= <user>
##$USERA2= <user>
##$USERA3= <user>
##$USERA4= <user>
##$USERA5= <user>
##$V9= 5
##$VALIST= <valist>
##$VCLIST= <CCCCCCCCCCCCCCC>
##$VD= 0
##$VDLIST= <DDDDDDDDDDDDDDD>
##$VPLIST= <PPPPPPPPPPPPPPP>
##$VTLIST= <TTTTTTTTTTTTTTT>
##$WBST= 1024
##$WBSW= 4
##$XGAIN= (0..3)
0 0 0 0 
##$XL= 0
##$YL= 0
##$YMAX_a= 722893
##$YMIN_a= -503009
##$ZGOPTNS= <>
##$ZL1= 120
##$ZL2= 120
##$ZL3= 120
##$ZL4= 120
##$ABSF1= 16.522
##$ABSF2= -4.171173
##$ABSG= 5
##$ABSL= 3
##$ALPHA= 0
##$AQORDER= 0
##$ASSFAC= 0
##$ASSFACI= 0
##$ASSFACX= 0
##$ASSWID= 0
##$AUNMP= <proc_1d>
##$AZFE= 0.1
##$AZFW= 0.1
##$BCFW= 0
##$BC_mod= 0
##$BYTORDP= 0
##$COROFFS= 0
##$CY= 12.5
##$DATMOD= 1
##$DC= 0
##$DFILT= <>
##$DTYPP= 0
##$F1P= 14.0000005364418
##$F2P= -0.99999901652339
##$FCOR= 0.5
##$FTSIZE= 32768
##$FT_mod= 6
##$GAMMA= 0
##$GB= 0
##$INTBC= 1
##$INTSCL= 1
##$ISEN= 128
##$LB= 0.3
##$LEV0= 0
##$LPBIN= 0
##$MAXI= 10000
##$MC2= 0
##$MEAN= 0
##$ME_mod= 0
##$MI= 0
##$NCOEF= 0
##$NC_proc= -4
##$NLEV= 6
##$NOISF1= 0
##$NOISF2= 0
##$NSP= 0
##$NTH_PI= 0
##$NZP= 0
##$OFFSET= 16.522
##$PC= 1
##$PHC0= -52.06007
##$PHC1= 6.401137
##$PH_mod= 1
##$PKNL= yes
##$PPARMOD= 0
##$PSCAL= 4
##$PSIGN= 0
##$REVERSE= no
##$SF= 250.13
##$SI= 32768
##$SIGF1= 0
##$SIGF2= 0
##$SINO= 400
##$SIOLD= 32768
##$SREGLST= <1H.CDCl3>
##$SSB= 0
##$STSI= 32768
##$STSR= 0
##$SW_p= 5175.98343685301
##$SYMM= 0
##$S_DEV= 0
##$TDeff= 65536
##$TDoff= 0
##$TI= <Analysis number 999999
Compound Code 99
Book Reference 9
Project Code 9>
##$TILT= no
##$TM1= 0
##$TM2= 0
##$TOPLEV= 0
##$USERP1= <user>
##$USERP2= <user>
##$USERP3= <user>
##$USERP4= <user>
##$USERP5= <user>
##$WDW= 1
##$XDIM= 32768
##$YMAX_p= 413891094
##$YMIN_p= -101351
$$ End of Bruker specific parameters
$$ ---------------------------------
##NTUPLES= NMR SPECTRUM
##VAR_NAME=  FREQUENCY,     SPECTRUM/REAL,   SPECTRUM/IMAG
##SYMBOL=    X,             R,               I
##VAR_TYPE=  INDEPENDENT,   DEPENDENT,       DEPENDENT
##VAR_FORM=  AFFN,          ASDF,            ASDF
##VAR_DIM=   32768,         32768,           32768
##UNITS=     HZ,            ARBITRARY UNITS, ARBITRARY UNITS
##FACTOR=    0.157963299565203, 1,           1
##FIRST=     4132.6476996994, 0,             0
##LAST=      -1043.33573715361, 0,           0
##MIN=       -1043.33573715361, -101351,     0
##MAX=       4132.6476996994, 413891094,     0
$$ Real data points
##PAGE= N=1
##DATA TABLE= (X++(R..R)), XYDATA
$$ [...]
$$ plain form
23666 28070 20542 -505 -11200 -22889 -11427 -10900 -11084 -3524 -15740 -13109 -3968 9319 12932
23653 12932 14241 9616 21109 10898 -8951 -23673 -705 1474 -21986 -38269 -30413 -26524 -18728
23640 -18728 -18977 -23887 943 14858 13379 21542 20139 2380 -23216 -46272 -41729 -25033 -6082
23627 -6082 -12769 -9898 2405 3626 -10853 -10308 -26476 -31504 -13572 14237 19865 -103 -27068
23614 -27068 -21744 -9887 -27455 -33091 -23870 -24062 -30594 -42976 -41279 -41953 -19681 -20850 -10358 -10184
23600 -10184 -11173 -4366 4241 3468 -24674 -38763 -45319 -35668 -5764 7314 10412 13242 15439 -8169
23586 -8169 -19119 -5746 1844 5283 10630 15326 14712 -14239 -24055 -28420 -29864 -21569 -24022 -38254
23572 -38254 -49578 -45887 -34322 -49111 -37420 -9375 -19206 -20422 -18180 -28264 -27487 -29915 -15325
$$ packed form
23666B8070p528k1047j0695j1689J1462N27j84P560j2216K631R141J3287L613
23653A2932J309m625J1493j0211j9849j4722K2968K179k3460j6283P856L889P796
23640a8728k49m910K4830J3915j479Q163j403j7759k5596k3056M543J6696J8951
23627f082o687K871J2303J221j4479N45j6168n028J7932K7809N628j9968k6965
23614b7068N324J1857j7568n636R221j92o532j2382J697o74K2272j169J0492J74
23600a0184r89O807Q607p73k8142j4089o556R651K9904J3078L098K830K197k3608
23586h169j0950J3373P590L439N347M696o14k8951r816m365j444Q295k453j4232
23572c8254j1324L691J1565j4789J1691K8045r831j216K242j0084P77k428J4590
$$ plain form
23559 -15325 -3383 5344 -5456 -12878 -22163 -25838 -7644 -9511 -5001 -6861 -15620 -10347 -4764 2342
23545 2342 1741 -10530 -13404 -19070 -20140 -9907 -10922 -16758 -18940 -15355 -6784 -12612 -18062 -26440
23531 -26440 -38151 -30692 -33608 -43534 -37036 -32306 -17973 -30425 -18430 2194 4373 2226 8469
23518 8469 5556 3696 -2245 -15825 -8245 728 -1463 -12546 -18162 -23194 -19082 168 -8267 -7409
23504 -7409 -12608 -13294 1230 4969 -5280 -8901 -15234 -5354 -15190 -13834 -5355 -6721 -1090 2858
23490 2858 -4815 -24477 -35420 -37276 -59053 -52711 -43973 -45081 -36161 -41937 -24594 -23667 -19038 -15350
23476 -15350 -23863 -32649 -24903 -8049 -9598 -3078 16214 28325 39478 15532 -2899 7581 20437
23463 20437 16382 5942 12660 17732 10411 -12795 -15085 -16919 -30802 -17503 1490 18102 21872
$$ packed form
23559a5325J1942Q727j0800p422r285l675J8194j867M510j860q759N273N583P106
23545B342o01j2271k874n666j070J0233j015n836k182L585Q571n828n450q378
23531b6440j1711P459k916r926O498M730J4333j2452J1995K0624K179k147O243
23518H469k913j860n941j3580P580Q973k191j1083n616n032M112J9250q435Q58
23504g409n199o86J4524L739j0249l621o333R880r836J356Q479j366N631L948
23490B858p673j9662j0943j856k1777O342Q738j108Q920n776J7343R27M629L688
23476a5350q513q786P746J6854j549O520J9292J2111J1153k3946j8431J0480J2856
23463B0437m055j0440O718N072p321k3206k290j834j3883J3299J8993J6612L770
$$ plain form
23450 21872 18068 21285 21135 22341 23528 5330 -5933 -5303 14501 21016 4411 11480 18907 18382
23436 18382 6157 -1641 6529 2478 14758 30019 7137 -11616 -21387 -28322 -26835 -19600 -2731
23423 -2731 20246 29359 15295 23485 19706 17857 21064 19659 14999 12646 14086 -9962 -34520 -22713
23409 -22713 8879 2434 -18581 -34359 -32422 -34201 -16525 -2709 -5317 -5407 -22604 -32774 -19146
23396 -19146 -10454 203 -7733 -20745 -28963 -23765 -19002 -6630 -7351 -19165 -20500 -14450 -10526 -20235
23382 -20235 -12910 -7762 -2487 26234 36342 18811 20234 25235 7408 -4275 2049 11312 14977
23369 14977 -3392 -19828 -12778 1228 15180 3787 -10685 -11213 -5407 4611 1106 -12739 -23555
23356 -23555 -24684 -32351 -37531 -29112 -21674 -20378 -12422 -12128 -23029 -14441 -10548 -12883 -7815 7705
$$ packed form
23450B1872l804L217j50J206J187j8198j1263O30J9804O515j6605P069P427n25
23436A8382j2225p798Q170m051J2280J5261k2882j8753r771o935J487P235J6869
23423b731K2977R113j4064Q190l779j849L207j405m660k353J440k4048k4558J1807
23409b2713L1592o445k1015j5778J937j779J7676J3816k608r0j7197j0170J3628
23396a9146Q692J0657p936j3012q218N198M763J2372p21j1814j335O050L924r709
23382b0235P325N148N275K8721J0108j7531J423N001j7827j1683O324R263L665
23369A4977j8369j6436P050J4006J3952j1393j4472n28N806J0018l505j3845j0816
23356b3555j129p667n180Q419P438J296P956K94j0901Q588L893k335N068J5520
$$ plain form
23342 7705 19508 12830 546 1674 13117 1697 -24058 -37003 -32959 -26243 -30063 2908 13658
23329 13658 -1554 -677 -9319 -8864 -6815 9043 11516 17097 -7353 -33198 -33307 -33935 -21093 1124
23315 1124 4471 2140 2442 21290 20942 30061 15356 2333 -14133 -25804 -34831 -24223 -5141
23302 -5141 -12281 -28783 -34500 -17538 2888 -6887 -22893 -31193 -19311 -13641 7071 14957 -5778
23289 -5778 1011 -4907 -8542 -14069 -12999 10962 14048 -6336 -36724 -29458 -7396 10580 9857 12051
23275 12051 1297 -16334 -34124 -24015 1435 12934 7776 6179 -12426 -19659 -21054 -7245
23263 -7245 8026 13187 3716 4965 1995 12069 20717 20310 14636 -2735 -2301 1087 6573 20387
23249 20387 24347 8168 9716 18638 21632 16669 14605 -3733 -20479 -14408 -15533 -23729 -10965
$$ packed form
23342G705J1803o678j2284J128J1443j1420k5755j2945M044O716l820L2971J0750
23329A3658j5212Q77q642M55K049J5858K473N581k4450k5845j09o28J2842K2217
23315A124L347k331L02J8848l48R119j4705j3023j6466j1671r027J0608J9082
23302e141p140j6502n717J6962K0426r775j6006q300J1882N670K0712P886k0735
23289e778O789n918l635n527J070K3961L086k0384l0388P266K2062J7976p23K194
23275A2051j0754j7631j7790J0109K5450J1499n158j597j8605p233j395J3809
23263g245J5271N161r471J249k970J0074Q648m07n674j7371M34L388N486J3814
23249B0387L960j6179J548Q922K994m963k064j8338j6746O071j125q196J2764
$$ plain form
23236 -10965 14017 13164 -1544 -22722 -32276 -12859 -530 13369 20377 17187 -1522 -20131 -26032
23223 -26032 -31120 -28917 -19830 -21261 -15018 -13215 -3838 -15745 -19612 -9840 -10631 7890 28274 23598
23209 23598 4798 -18835 -4896 5687 -6434 -28270 -21382 -10012 10614 19658 5215 3601
23197 3601 7910 20506 20626 11946 12247 2209 10885 4608 -3364 -4397 -9562 -21983 -31833 -31569 -20915
23182 -20915 6294 4556 -1281 -3052 1675 2356 9110 12319 8149 7576 7933 3137 -6265 -16905 -7933
23167 -7933 -21833 -14521 -15158 -23829 -47013 -44752 -34013 -26179 -4217 14019 7499 -11252 -11570 -16292
23153 -16292 -9626 2008 1912 6305 24049 31521 24343 4719 -10530 -2642 15851 18078 552
23140 552 -12290 -11623 5491 -1997 1700 -12934 -19165 -11864 -8202 395 12328 14613 -1723 -30607
$$ packed form
23236a0965K4982q53j4708k1178r554J9417J2329J3899P008l190j8709j8609n901
23223b6032n088K203R087j431O243J803R377j1907l867R772p91J8521K0384m676
23209B3598j8800k3633J3939J0583j2121k1836O888J1370K0626R044j4443j614
23197C601M309J2596J20q680L01j0038Q676o277p972j033n165j2421r850K64J0654
23182b0915K7209j738n837j771M727O81O754L209m170n73L57m796r402j0640Q972
23167g933j3900P312o37q671k3184K261J0739P834K1962J8236o520j8751l18m722
23153a6292O666J1634r6M393J7744P472p178j9624j5249P888J8493K227j7526
23140E52j2842O67J7114p488L697j4634o231P301L662Q597J1933K285j6336k8884
$$ plain form
23126 -30607 -34847 -35851 -14439 -3959 710 2292 2983 13172 17765 22994 12744 -11075 -27234
23113 -27234 -28085 -6093 -3613 -5710 -10953 -24999 -24380 -29527 -25844 -19440 -11389 -29846 -16353 -19757
23099 -19757 -31966 -27748 -29175 -31970 -33808 -26769 -9558 -737 -13091 -28436 -34166 -24099 -23328
23086 -23328 -21597 -10389 -7596 -11755 -20434 -14386 -24911 -12198 -16441 -18124 -15658 -25107 -20811 -1344
23072 -1344 7366 -6894 -21506 -11925 -7471 -8416 7006 26064 23174 18955 5119 -7556 -24600
23059 -24600 -29115 -28202 -27842 -32088 -16977 -2496 6873 2159 6581 542 9099 2595 -3584 -1189
23045 -1189 3744 13230 6636 1147 -11866 -24712 -18378 -18007 -14075 -14662 -8659 8804 20656 10741
23031 10741 -566 -461 48 -19754 -27815 -32915 -36617 -38709 -21722 -8642 5329 595 2688 1731
$$ packed form
23126c0607m240j004K1412J0480M669J582O91J0189M593N229j0250k3819j6159
23113b7234q51K1992K480k097n243j4046O19n147L683O404Q051j8457J3493l404
23099a9757j2209M218j427k795j838P039J7211Q821j2354j5345n730J0067P71
23086b3328J731J1208K793m159q679O048j0525J2713m243j683K466r449M296J9467
23072a344Q710j4260j4612R581M454r45J5422J9058k890m219j3836j2675j7044
23059b4600m515R13L60m246J5111J4481R369m714M422o039Q557o504o179K395
23045a189M933R486o594n489j3013j2846O334L71L932n87O003J7463J1852r915
23031A0741j1307J05N09j9802q061n100l702k092J6987J3080J3971m734K093r57
$$ plain form
23017 1731 -9650 -12368 -11864 -13959 -1179 5130 -4979 -10605 -15508 -8098 427 -5393 -4084 8669
23003 8669 13947 11915 12082 -1389 -26157 -22481 7371 16533 19670 17020 30050 36006 20497 6388
22989 6388 4082 7603 10934 16161 12712 7902 3753 5128 5163 18938 20589 2945 11968 9536 8192
22974 8192 6778 -6493 1321 29727 38664 15668 10677 13350 14447 -3236 -16364 -6598 9369
22961 9369 12359 2729 -6523 -10658 -15252 -11161 9949 16369 7921 32 -10455 -29900 -34235 -29850
22947 -29850 -11228 9371 11342 18338 25400 11693 -10306 -10334 -6189 -5888 -5535 -6967 -20827 -37291
22933 -37291 -36223 -29545 -32658 -36615 -22657 -13405 -6083 6074 4714 8508 7992 9200 8883 -8723
22919 -8723 -17163 -31007 -25126 -15207 -13883 -13433 -13711 -8019 -1929 2062 -11108 -18760 -16197 -9445 1165
$$ packed form
23017A731j1381k718N04k095J2780O309j0109n626m903P410Q525n820J309J2753
23003H669N278k032J67j3471k4768L676K9852R162L137k650J3030N956j5509j4109
22989F388k306L521L331N227l449m810m149J375L5J3775J651j7644R023k432j344
22974H192j414j3271P814K8406Q937k2996m991K673J097j7683j3128R766J5967
22961I369K990r630r252m135m594M091K1110O420q448p889j0487j9445m335M385
22947b9850J8622K0599J971O996P062j3707k1999k8M145L01L53j432j3860j6464
22933c7291J068O678l113l957J3958R252P322J2157j360L794n16J208l17j7606
22919h723q440j3844N881R919J324M50k78N692O090L991j3170p652K563O752J0610
$$ plain form
22904 1165 -5057 -21039 -24435 -16669 -3044 -6648 -4068 -287 8333 14490 -3458 -2558 -1179 7649
22890 7649 -6374 -12502 -16271 -19360 -3307 -10845 -16442 -9595 4156 7120 2683 -11905 -13299 -9899
22876 -9899 -10549 -20155 -1649 2896 -8363 -10288 -2975 -23378 -20060 -17456 -5524 -6409 -22742 -26885
22862 -26885 -21030 -16131 -23463 -25720 -26640 -26751 -5956 -12695 -20893 -17102 -17166 -21772 -27237 -31312 -27256
22847 -27256 -11230 -4523 -17606 -15988 -13837 -5233 1346 -5810 -18869 -21914 -19528 -17214 -16897 -5082
22833 -5082 -2989 11561 17652 19605 10455 8848 2743 -12242 -22207 -24082 -34812 -41461 -13257 16635
22819 16635 22279 9285 7689 -3295 -10124 2226 -7298 -22939 -31728 -34863 -21919 -15150 -11285
22806 -11285 -1016 -9040 -19891 -19695 -14305 -6019 -9325 1664 11542 5339 -3279 -16421 -18932 -19954
$$ packed form
22904A165o222j5982l396P766J3625l604K580L781Q620O157j7948R00J379Q828
22890G649j4023o128l769l089J6053p538n597O847J3751K964m437j4588j394L400
22876i899o50r606J8506M545j1259j925P313k0403L318K604J1932q85j6333m143
22862b6885N855M899p332k257r20j11K0795o739q198L791o4m606n465m075M056
22847b7256J6026O707j3083J618K151Q604O579p156j3059l045K386K314L17J1815
22833e082K093J4550O091J953r150j607o105j4985r965j875j0730o649K8204K9892
22819A6635N644j2994j596j0984o829J2350r524j5641q789l135J2944O769L865
22806a1285J0269q024j0851J96N390Q286l306J0989R878o203q618j3142k511j022
$$ plain form
22792 -19954 -34684 -38527 -18180 -6915 -3644 -3783 2361 5388 -17505 -34320 -26973 -33663 -17007
22779 -17007 -11537 -28502 -42799 -51967 -54324 -55862 -46470 -40872 -43091 -34682 -13834 -5455 -3588 15120
22765 15120 7302 -2317 -1482 6291 -1828 -8824 -11501 -12603 -22584 -31674 -25429 5448 25541 23289
22751 23289 18627 11449 -1678 -12678 -10629 -11908 -25159 -25101 -24062 -33173 -34500 -25861 -20862 -8936
22737 -8936 -18793 -24515 -24477 -9613 11353 11858 -5426 650 4829 -1533 -409 22648 35053 14185
22723 14185 -5958 -9124 -8419 -15014 -14066 -3442 -9823 -9274 -1563 12950 9057 -9795 -15307 -22969
22709 -22969 -20528 -13876 -20168 -11577 -5425 7857 7071 13171 10140 12829 997 8760 8634 -4407
22695 -4407 -954 1796 -3314 -620 -15166 -18676 -12639 -8829 -10129 -15116 -25770 -24182 -19453 -6687
$$ packed form
22792a9954j4730l843K0347J1265L271j39O144L027k2893j6815P347o690J6656
22779a7007N470j6965j4297r168k357j538R392N598k219Q409K0848Q379J867J8708
22765A5120p818r619Q35P773q119o996k677j102r981r090O245L0877K0093k252
22751B3289m662p178j3127j1000K049j279j3251N8J039r111j327Q639M999J1926
22737h936r857n722L8J4864K0966N05j7284O076M179o362J124K3057J2405k0868
22723A4185k0143l166P05o595R48J0624o381N49P711J4513l893j8852n512p662
22709b2969K441O652o292Q591O152J3282p86O100l031K689j1832P763j26j3041
22695d407L453K750n110K694j4546l510O037L810j300m987j0654J588M729J2766
$$ plain form
22681 -6687 305 -20670 -39303 -28688 -17648 -12369 11626 -6 -3408 13201 18295 27539 32231
22668 32231 24569 2573 -12851 -14300 -7020 -9748 6743 -8582 -14934 -8057 -15425 -11941 -10212
22655 -10212 -5759 -4045 -11552 -17316 -16343 -19095 -20532 -14113 6118 17171 22330 17414 -2470 -16918
22641 -16918 -7477 15426 7870 -2779 -10398 671 -4879 -5 -4055 -16060 -19364 -18999 -13349 -5540
22627 -5540 -5095 2402 5085 -925 19 -11062 -12492 -14301 -9540 2655 -1111 2085 2672 12008 10509
22612 10509 11457 16804 9656 5503 -5618 -38206 -25467 -25030 -38095 -17833 -16015 10160 9663 -580
22598 -580 -1038 -11999 3305 1536 -7808 10045 5506 -17329 -35484 -12618 10059 9549 5487 3093
22584 3093 3843 5801 5923 419 -13842 -33002 -29962 -16515 -12889 -14816 -18765 -35797 -36434 -23065
$$ packed form
22681f687O992k0975j8633J0615J1040N279K3995j1632l402J6609N094R244M692
22668C2231p662k1996j5424j449P280k728J6491j5325o352O877p368L484J729
22655a0212M453J714p507n764R73k752j437O419K0231J1053N159m916j9884j4448
22641a6918R441K2903p556j0649p619J1069n550M874m050j2005l304L65N650P809
22627e540M45P497K683o010R44j1081j430j809M761J2195l766L196N87R336j499
22612A0509R48N347p148m153j1121l2588J2739M37j3065K0262J818K6175m97j0243
22598e80m58j0961J5304j769r344J7853m539k2835j8155K2866K2677n10m062k394
22584C093P50J958J22n504j4261j9160L040J3447L626j927l949j7032o37J3369
$$ plain form
22570 -23065 -16542 -25445 -30185 -28185 -33770 -12004 4526 -1745 -9846 -15886 -10509 -17610 -23131 -14728
22556 -14728 -18396 -23352 -38944 -40919 -25901 -4181 -10622 -30755 -22247 -12475 -22072 -8364 9683
22543 9683 22431 13312 -6077 2697 2633 -889 423 222 6436 -15127 -32874 -35142 -30344 -17510
22529 -17510 -14262 -11875 -11442 -18968 4876 12407 3222 -2442 -7014 -5592 -7559 -3184 7868 16461
22515 16461 7123 7295 16269 26328 27751 18722 5973 -8095 5244 4151 -7397 -19654 -26140
22502 -26140 -30307 -20068 -7945 1309 -6593 -11150 -14531 -5894 16779 28782 25064 16317 3107
22489 3107 -18331 -25457 -13910 -19338 -28157 -32652 -44209 -30133 -11084 -2895 -9283 -17282 -12652
22476 -12652 -18367 -13295 -2944 -12924 -17392 -7989 -9690 -14049 -19235 -12949 -18332 -13712 -9801 1091
$$ packed form
22570b3065O523q903m740K000n585K1766J6530o271q101o040N377p101n521Q403
22556a4728l668m956j5592j975J5018K1720o441k0133Q508R772r597J3708J8047
22543I683J2748r119j9389Q774o4l522J312k01O214k1563j7747k268M798J2834
22529a7510L248K387M33p526K3844P531r185n664m572J422j967M375J1052Q593
22515A6461r338J72Q974J0059J423r029j2749j4068J3339j093j1548j2257o486
22502b6140m167J0239J2123R254p902m557l381Q637K2673J2003l718q747j3210
22489C107k1438p126J1547n428q819m495j1557J4076J9049Q189o388p999M630
22476a2652n715N072J0351r980m468R403j701m359n186O286n383M620L911J0892
$$ plain form
22462 1091 -9307 -8189 -3974 12351 25285 24641 25846 16543 22775 8147 -23288 -38232 -22752
22449 -22752 -24761 -47496 -35519 -31577 -34034 -21224 -10150 -5007 3550 9761 12921 20246 11472
22436 11472 559 -26271 -34587 -11091 -4702 -5529 -11964 -30679 -37507 -37942 -44564 -38552 -29267 -16307
22422 -16307 8811 19583 -4356 -15733 -10184 -19608 -10263 -2930 -14025 -33539 -12769 -17043 -14333
22409 -14333 -1453 11998 33805 25657 5650 3839 323 -3490 -1501 9693 -6512 -13865 -5719
22396 -5719 -917 -11824 -9084 -18793 -13629 -10344 10710 19259 13759 14198 -2007 -11019 -19888 -19197
22382 -19197 -31366 -33901 -31042 -33504 -52809 -48999 -26140 -29004 -7739 -8894 -28611 -33009 -5003
22369 -5003 1015 20924 17010 12006 -8177 -19133 -7451 -996 2284 3738 -12520 -5625 -1569
$$ packed form
22462A091j0398J118M215J6325J2934o44J205r303O232j4628l1435j4944J5480
22449b2752k009k2735J1977L942k457J2810J1074N143Q557O211L160P325q774
22436A1472j0913k6830q316K3496O389q27o435j8715o828m35o622O012R285J2960
22422a6307K5118J0772k3939j1377N549r424R345P333j1095j9514K0770m274K710
22409a4333J2880J3451K1807q148k0007j811l516l813J989J1194j6205p353Q146
22396e719M802j0907K740r709N164L285K1054Q549n500M39j6205r012q869O91
22382a9197j2169k535K859k462j9305L810K2859k864K1265j155j9717m398K8006
22369e003O018J9909l914n004k0183j0956J1682O455L280J454j6258O895M056
$$ plain form
22356 -1569 4380 -605 561 -11792 -14109 -18908 -25504 -4510 15742 27595 15183 -4798 11607
22343 11607 13583 -9505 -26667 -47735 -44055 -26359 -22240 -23157 -12357 -13380 -20038 -17955 -22091
22330 -22091 -14566 -22732 -34799 -36730 -24544 -4848 6634 12939 7521 8128 9806 -10563 -15302
22317 -15302 -980 12990 816 2662 15446 10368 13795 10882 6787 -2476 -1077 5991 11294
22304 11294 19991 11972 13011 5937 11692 10701 -3714 -1830 5907 2447 7007 9616 9125 4192 -86
22289 -86 -8425 -10174 -19101 -22515 -12056 3045 6054 6542 -716 -6556 15826 27047 36304 24671
22275 24671 6437 762 6073 -4870 -11405 -5565 1631 -3703 -10642 -14141 -8683 -14482 -11201 -14436
22261 -14436 -10312 -3865 -5206 -18558 -25004 -24881 -18098 -15725 -19774 -9209 -20320 -36445 -25657
$$ packed form
22356a569N949m985J166j2353k317m799o596K0994K0252J1853j2412j9981J6405
22343A1607J976k3088j7162k1068L680J7696M119r17J0800j023o658K083m136
22330b2091P525q166j2067j931J2186J9696J1482O305n418O07J678k0369m739
22317a5302J4322J3970j2174J846J2784n078L427k913m095r263J399P068N303
22304A1294Q697q019J039p074N755r91j4415J884P737l460M560K609m91m933m278
22289h6q339j749q927l414J0459J5101L009M88p258n840K2382J1221R257j1633
22275B4671j8234n675N311j0943o535N840P196n334o939l499N458n799L281l235
22261a4436M124O447j341j3352o446J23O783K373m049J0565j1111j6125J0788
$$ plain form
22248 -25657 -17294 -23100 -37235 -42582 -26684 -26291 -3888 1750 -12556 -33339 -20188 -7149 -3495
22235 -3495 -4271 -16343 -16560 -10153 -1499 -11405 -1093 13701 4200 -14675 -7804 -16316 -15245 -18054
22221 -18054 -23392 -25311 -33360 -20282 -17582 -16731 -16229 -30493 -14651 -2085 -5439 -5055 7310 8295
22207 8295 3248 20973 11548 8170 11685 -1184 -2724 743 -4432 -2583 -3838 -15187 -20913 -29272
22193 -29272 -28403 -25291 -16775 5682 10868 10271 1946 -17962 -5577 10858 1994 232 7289 21971
22179 21971 21408 4092 -10347 3550 9402 3839 1535 23495 27016 14174 1543 -5051 -25707
22166 -25707 -42022 -54401 -51615 -26026 -4888 -3859 1655 1695 -8772 -709 -2845 -19208 -22308
22153 -22308 -17281 -32761 -38222 -21996 -23502 -32487 -28597 -10784 -37152 -43056 -26503 -13100 -1159
$$ packed form
22248b5657Q363n806j4135n347J5898L93K2403N638j4306k0783J3151J3039L654
22235c495p76j2072k17O407Q654r906J0312J4794r501j8875O871q512J071k809
22221a8054n338j919q049J3078K700Q51N02j4264J5842J2566l354L84J2365R85
22207H295n047J7725r425l378L515j2869j540L467n175J849j255j1349n726q359
22193b9272Q69L112Q516K2457N186n97q325j9908J2385J6435q864j762P057J4682
22179B1971n63j7316j4439J3897N852n563k304K1960L521j2842j2631o594k0656
22166b5707j6315j2379K786K5589K1138J029N514M0j0467Q063k136j6363l100
22153b2308N027j5480n461J6226j506q985L890J7813k6368n904J6553J3403J1941
$$ plain form
22140 -1159 -4656 -8809 -6359 -9262 -5327 4801 1565 2695 -6420 -104 7573 9353 6740 1876
22126 1876 5980 1895 20583 20492 6317 5148 -1912 -3558 -9074 -14358 -7595 5278 5913 4235 7935
22111 7935 4188 15647 1970 -9748 -14959 -10861 -2037 6480 -3447 4637 7193 -4123 -3611 -2015
22097 -2015 -11494 -1941 12862 13733 19966 14921 7082 13454 25163 21007 10341 -3868 5998 7217
22083 7217 -229 -7641 -13512 -5385 5510 10718 24094 9426 15590 692 -22058 -28160 -15821
22070 -15821 -4045 10055 30009 24272 30671 30560 32679 32515 34060 16943 11509 10194 20825 14869
22056 14869 6918 9933 12305 -11418 -17382 -9678 -13628 -20231 -20085 -18626 -30285 -32606 -12686 -19132
22042 -19132 -28864 -20138 4962 12608 28824 37187 14751 11820 11053 678 -4761 -2029 -19243
$$ packed form
22140a159l497m153K450k903L935J0128l236J130r115O316P677J780k613m864
22126A876M104m085J8688r1j4175j169p060j646n516n284O763J2873O35j678L700
22111G935l747J1459j3677j1718n211M098Q824Q517r927Q084K556j1316N12J596
22097b015r479R553J4803Q71O233n045p839O372J1709m156j0666j4209R866J219
22083G217p446p412n871Q127J0895N208J3376j4668O164j4898k2750o102J2339
22070a5821J1776J4100J9954n737O399j11K119j64J545j7117n434j315J0631n956
22056A4869p951L015K372k3723n964P704l950o603J46J459j1659k321J9920o446
22042a9132r732Q726K5100P646J6216Q363k2436k931p67j0375n439K732j7214
$$ plain form
22029 -19243 -12269 -3523 10555 6948 7367 6399 -9728 -36606 -46537 -15214 11058 14233 6961 550
22015 550 11482 20860 11093 15552 7616 -4011 173 3783 5828 8071 10105 2871 2228 7412 2238
22000 2238 4478 19938 38757 43526 23143 9823 9868 2393 -7113 3857 -174 -4189 2392 2374
21986 2374 -4672 -21738 -25642 -14934 -9113 10549 15626 -2960 -1070 6302 11566 -5170 -7078
21973 -7078 -7561 -10682 -3401 7643 8506 15286 11545 2573 651 -5311 -18192 -13667 3678 9467
21959 9467 -5916 -13796 -5716 4561 5934 16058 18547 12979 10119 10843 7638 9161 3921 2195
21945 2195 21941 37677 26963 12792 -3611 -27048 -24637 -10387 -5811 3627 6659 -427 -3704
21932 -3704 -4406 1044 1902 4062 -12814 -38944 -32363 -22531 -11329 -10278 -24542 -38350 -15145 9092
$$ packed form
22029a9243O974Q746J4078l607M19r68j6127k6878r931L1323K6272L175p272o411
22015E50J0932R378r767M459p936j1627M184L610K045K243K034p234o43N184n174
22000B238K240J5460J8819M769k0383j3320M5p475r506J0970m031m015O581j8
21986B374p046j7066l904J0708N821J9662N077j8586J890P372N264j6736j908
21973g078m83l121P281J1044Q63O780l741q972j922n962j2881M525J7345N789
21959I467j5383p880Q080J0277J373J0124K489n568k860P24l205J523n240j726
21945B195J9746J5736j0714j4171j6403k3437K411J4250M576R438L032p086l277
21932c704p02N450Q58K160j6876k6130O581R832J1202J051j4264j3808K3205K4237
$$ plain form
21918 9092 -11027 -20707 -18088 -10585 -9867 1018 10240 8341 -17309 -11948 9766 4597 -7380 -8874
21904 -8874 3939 12372 16186 16527 16151 6749 -9545 -9781 -1645 -2532 -8903 -9642 -15647 -8344 -18494
21889 -18494 -34176 -26283 -19465 -3631 -4167 -8134 -3428 3175 19857 29996 26014 16473 6743 -3402
21875 -3402 -9863 3252 471 -3938 9282 11628 7357 2642 19334 13064 -8233 -11498 -741
21862 -741 -4397 -9449 1053 -23240 -38134 -27213 -38414 -35477 -29258 -3595 16419 -156 -9837
21849 -9837 664 13582 18859 9711 -5093 -17533 -9125 52 17455 14943 13212 9671 3169
21836 3169 -6103 -2105 2304 4458 14284 12324 16448 27177 17118 3629 12628 12039 3647 -4315
21822 -4315 -5459 -1971 -15941 -34337 -37294 5704 18607 5096 3216 7885 17192 17557 24486 21795
$$ packed form
21918I092k0119r680K619P503P18J0885R222j899k5650N361K1714n169j1977j494
21904h874J2813Q433L814L41l76r402j6294k36Q136q87o371p39o005P303j0150
21889a8494j5682P893O818J5834n36l967M706O603J6682J0139l982r541r730j0145
21875c402o461J3115k781m409J3220K346m271m715J6692o270k1297l265J0757
21862g41l656n052J0502k4293j4894J0921j1201K937O219K5663K0014j6575r681
21849i837J0501J2918N277r148j4804j2440Q408R177J7403k512j731l541o502
21836C169r272L998M409K154R826j960M124J0729j0059j3489Q999n89q392p962
21822d315j144L488j3970j8396k957M2998J2903j3511j880M669R307L65O929k691
$$ plain form
21808 21795 22247 348 -16422 -22032 -16878 -2980 -4243 -8512 -13837 -3077 2541 11072 25153
21795 25153 26946 7876 3036 -68 -11343 -20600 -18269 -20898 -3522 2160 -2754 3338 -10185
21782 -10185 -11570 -26390 -23043 -171 18441 1878 -15958 -17097 -3704 12283 38924 50672
21770 50672 28278 11223 21900 26641 7788 -4612 -16300 -18442 -11720 880 -11186 -17952
21758 -17952 -7177 8149 -353 2585 25469 42786 28962 25627 17296 4731 3629 -10712 -27367
21745 -27367 -18989 -13035 -8684 5396 6102 -10375 3766 20707 12848 9816 1448 -4441 -9482 -12850
21731 -12850 -4646 15992 28667 29447 28191 17549 -983 -17574 -16627 2697 -5691 -7005 6644
21718 6644 18548 7304 19710 18064 314 -14953 -12434 -9873 8381 11108 9780 -2573 -12323
$$ packed form
21808B1795M52k1899j6770n610N154J3898j263m269n325J0760N618Q531J4081
21795B5153J793j9070m840l104j1275r257K331k629J7376N682m914O092j3523
21782a0185j385j4820L347K2872J8612j6563j7836j139J3393J5987K6641J1748
21770E0672k2394j7055J0677M741j8853j2400j1688k142O722J2600j2066o766
21758a7952J0775J5326q502K938K2884J7317j3824l335q331j2565j102j4341j6655
21745b7367Q378N954M351J4080P06j6477J4141J6941p859l032q368n889n041l368
21731a2850Q204K0638J2675P80j256j0642j8532j6591R47J9324q388j314J3649
21718F644J1904j1244J2406j646j7750j5267K519K561J8254K727j328j2353r750
$$ plain form
21705 -12323 2541 3033 1689 -5725 -19089 -28741 -26817 -24381 -21854 -23405 -21495 -8265 9323 30556
21691 30556 51804 44724 18274 -6192 -6579 -6831 -8412 -7352 -16107 -7642 -10131 -29850 -28651 -16721
21677 -16721 -17260 -28028 -19257 -8501 -13343 -28980 -19623 -9008 2873 12127 1761 -11908 -27069
21664 -27069 -14066 -1070 -4474 -6071 -10370 -19803 -40129 -47785 -39765 -14752 7618 -1210 6692
21651 6692 17363 4256 -15543 -3725 -2507 8312 12893 12508 -4813 -24974 -21849 -17863 -7431
21638 -7431 -1110 -3561 -8365 -14416 -19669 -27808 -18454 341 -4722 -5825 -8658 -14780 -2359 6541
21624 6541 18409 16124 6704 -5552 -19576 -23268 -17764 -20899 -10443 -5722 -9929 -2709 4617 13993
21610 13993 19700 11927 6190 -1681 -10438 1750 16546 24671 17543 -906 -10549 -10620 -13522 4545
$$ packed form
21705a2323J4864M92j344p414j3364r652J924K436K527j551J910J3230J7588K1233
21691C0556K1248p080k6450k4466l87k52j581J060q755Q465k489j9719J199J1930
21677a6721n39j0768Q771J0756m842j5637R357J0615J1881R254j0366j3669j5161
21664b7069J3003J2996l404j597m299r433k0326p656Q020K5013K2370q828P902
21651F692J0671j3107j9799J1818J218J0819M581l85j7321k0161L125L986J0432
21638g431O321k451m804o051n253q139R354J8795n063j103k833o122J2421Q900
21624F541J1868k285r420j2256j4024l692N504l135J0456M721m207P220P326R376
21610A3993N707p773n737p871q757J2188J4796Q125p128j8449r643p1k902J8067
$$ plain form
21596 4545 8206 1377 6698 7898 -7708 -17249 -10423 -8935 -14441 -9447 -7135 -6412 -9286 -6926 -83
21581 -83 2452 4681 342 18470 25695 15712 12424 14083 17147 27726 20249 12928 13488 20365 1244
21566 1244 -2979 -9557 -1036 16642 32927 17103 5412 3289 -1490 -5187 -3826 -5124 -13373 -24048
21552 -24048 -9606 2633 -13123 -19713 -8643 19486 28918 -9386 12018 7392 -8972 -11935
21540 -11935 -4283 -12110 -20142 -4254 -26215 -53431 -38675 -11516 2170 -15289 -13491 20959
21528 20959 42154 29693 7913 5202 5091 2247 14212 2746 -8159 -10798 6351 5271 10846
21515 10846 12038 1494 -3972 -13839 -30765 -28417 -22526 -20598 -7028 -12580 -12291 -13702 -16261 -36400
21501 -36400 -30932 -29242 -21649 -2200 -7127 -11364 -5808 18643 24190 3238 -16071 -51653 -34449
$$ packed form
21596D545L661o829N321J200j5606r541O826J488n506M994K312P23k874K360O843
21581h3K535K229m339J8128P225r983l288J659L064J0579p477p321N60O877j9121
21566A244m223o578Q521J7678J6285j5824j1691k123m779l697J361j298q249j0675
21552b4048J4442J2239j5756o590J1070K8129R432l8304K1404m626j6364k963
21540a1935P652p827q032J5888k1961k7216J4756K7159J3686j7459J798L4450
21528B0959K1195j2461k1780k711j11k844J1965j1466j0905k639J7149j080N575
21515A0846J192j0544n466r867j6926K348N891J928J3570n552K89j411k559k0139
21501c6400N468J690P593J9449m927m237N556K4451N547k0952j9309l5582J7204
$$ plain form
21488 -34449 -1436 -697 -513 -6184 -6123 -10994 -17363 -22890 -21358 -7981 -20694 -28204 -17580 1226
21474 1226 2573 3785 -13753 -3972 -13571 -32333 -33265 -31772 -15221 -18252 -19539 -10382 5715 3574
21460 3574 1485 4775 2749 6734 12344 14041 -6160 -19324 -16694 -14784 -2913 2371 -2460 1415
21446 1415 15088 19332 21971 29786 22290 -1319 -820 -7377 -5063 6577 11872 12286 6001 23946
21432 23946 1897 -20667 -16686 -12661 -5694 10815 8491 10105 -7246 -22586 -22712 -8974 10818
21419 10818 8233 3035 1652 -2885 8799 6017 -12948 -19555 -9171 -22487 -19670 -18020 -17311 -22595
21405 -22595 -11342 870 10722 6262 9428 10589 -34 -8502 -2031 -23836 -27275 -21244 16732
21392 16732 38124 33122 31024 31628 16350 5710 13374 14065 4535 -5266 -800 -5940 -11361 -15996
$$ packed form
21488c4449L3013P39J84n671O1m871o369n527J532J3377j2713p510J0624J8806
21474A226J347J212j7538R781r599j8762r32J493J6551l031j287R157J6097k141
21460C574k089L290k026L985N610J697k0201j3164K630J910J1871N284m831L875
21446A415J3673M244K639P815p496k3609M99o557K314J1640N295M14o285J7945
21432B3946k2049k2564L981M025O967J6509k324J614j7351j5340j26J3738J9792
21419A0818k585n198j383m537J1684k782j8965o607J0384j3316K817J650P09n284
21405b2595J1253J2212R852m460L166J161j0623q468O471k1805l439O031L7976
21392A6732K1392n002k098O04j5278j0640P664O91r530r801M466n140n421m635
$$ plain form
21378 -15996 -24669 -13950 7554 21402 32414 37959 34234 8948 -1312 -2522 3556 14861 13871
21365 13871 -8758 -8115 5901 7251 2495 2626 -5249 4957 7783 15642 16055 18485 15668 4848
21351 4848 -8634 -6954 -16902 -29698 -22654 1117 -5694 -17116 -21418 -16948 -13576 -4483 8521
21338 8521 -6675 -7263 3671 -4035 -18384 -30270 -39534 -31633 -21594 -37598 -33826 -16578 -23062
21325 -23062 -32715 -24610 -23336 -16537 7477 26257 20501 6536 8508 23782 28348 8515 -5226
21312 -5226 -13489 -26219 -28502 -17738 -4962 -5286 -7381 -12256 -12402 -10363 754 3677 5014 5746
21298 5746 -4829 -23608 -15611 11995 12662 28144 28751 28410 23338 4363 9092 6834 339 11284
21284 11284 12722 9136 11527 -9631 -15885 -16702 5178 15128 -6071 -6380 -3360 2488 10225 -4658
$$ packed form
21378a5996q673J0719K1504J3848J1012N545l725k5286j0260j210O078J1305r90
21365A3871k2629O43J4016J350m756J31p875J0206K826P859M13K430k817j0820
21351D848j3482J680r948j2796P044K3771o811j1422m302M470L372R093J3004
21338H521j5196n88J0934p706j4349j1886r264P901J0039j6004L772J7248o484
21325b3062r653Q105J274O799K4014J8780n756j3965J972J5274M566j9833j3741
21312e226q263j2730k283J0764J2776l24k095m875j46K039J1117K923J337P32
21298E746j0575j8779P997K7606O67J5482O07l41n072j8975M729k258o495J0945
21284A1284J438l586K391k1158o254q17K1880R950k1199l09L020N848P737j4883
$$ plain form
21270 -4658 -23680 -35686 -36572 -33256 -24264 -20377 -13842 -10531 -12098 -14984 3296 14984 6636 -9481
21256 -9481 -11700 2776 8871 7886 5087 -2803 3914 9261 -7398 -20677 -23827 -10181 -1261 -2358
21242 -2358 -9160 -22884 -34204 -13381 -15069 -11099 -16834 -29660 -10599 6129 15232 -95 -2865
21229 -2865 3057 -7190 -6111 -18720 -29105 -17634 -21435 -21194 -3902 -1887 14402 8298 10820
21216 10820 2079 5933 -6090 -31378 -44131 -28671 12256 13125 -1316 -1597 -2440 2132 -7478 -13951
21202 -13951 -15122 -11284 -15100 -20759 -15629 -18638 -31264 -26803 -20624 -18831 -14134 -8497 15004 26719
21188 26719 25944 18305 14229 9699 -6076 -17220 12055 25057 1537 992 -16865 -11783 2839
21175 2839 10370 13638 38035 14861 -9110 -10337 12864 6358 -829 2410 -916 -15749 -20886
$$ packed form
21270d658j9022j2006q86L316Q992L887O535L311j567k886J8280J1688q348j6117
21256i481k219J4476O095r85k799p890O717N347j6659j3279l150J3646Q920j097
21242b358o802j3724j1320K0823j688L970n735j2826J9061J6728R103j5327k770
21229b865N922j0247J079j2609j0385J1471l801K41J7292K015J6289o104K522
21216A0820q741L854j2023k5288j2753J5460M0927Q69j4441k81q43M572r610o473
21202a3951j171L838l816n659N130l009j2626M461O179J793M697N637K3501J1715
21188B6719p75p639m076m530j5775j1144K9275J3002k3520n45j7857N082J4622
21175B839P531L268K4397k3174k3971j227K3201o506p187L239l326j4833n137
$$ plain form
21162 -20886 -23208 -12583 -15040 -10657 -4322 -12486 -4342 -12812 -9365 -2210 -7457 -13880 -7797 -10002
21148 -10002 -16021 2444 1716 8139 6266 -7748 -9380 -14028 -16887 -24868 -32184 -30737 -22906 -10330
21134 -10330 -7631 -16985 -19444 -9285 -11096 -8583 -15580 -12128 -4441 19357 9822 2432 -7361 13398
21120 13398 17193 11734 9572 -4691 4634 10505 6678 11734 16597 14205 -642 -24057 -24122 -14332
21106 -14332 501 -871 12875 22676 27748 37178 38976 32429 8925 15851 1992 -19825 -2641
21093 -2641 -6610 -8755 24048 32907 34390 17407 3793 21581 20756 18411 30045 37616 33895 19141
21079 19141 8868 15038 32301 41966 39065 48075 46180 39246 22868 7131 -2694 10202 9563
21066 9563 16120 26949 17233 7975 -262 5422 9593 5311 -4374 -13819 -15053 -16290 23580 41294
$$ packed form
21162b0886k322J0625k457M383O335q164Q144q470L447P155n247o423O083k205
21148a0002o019J8465p28O423j873j4014j632m648k859p981p316J447P831J2576
21134a0330K699r354k459J0159j811K513o997L452P687K3798r535p390r793K0759
21120A3398L795n459k162j4263R325N871l827N056M863k392j4847k3415o5R790
21106a4332J4833j372J3746R801N072R430J798o547k3504O926j3859k1817J7184
21093b641l969k145L2803Q859J483j6983j3614J7788q25k345J1634P571l721j4754
21079A9141j0273O170J7263R665k901R010j895o934j6378j5737r825J2896o39
21066I563O557J0829r716r258q237N684M171m282r685r445j234j237L9870J7714
$$ plain form
21052 41294 15777 -13984 -21541 -5683 -9033 1754 24723 19688 19255 24970 13724 -1005 -2532
21039 -2532 -264 9751 108 -69 4191 2919 -5245 -21103 -31922 -42008 -10889 5233 9299
21026 9299 12583 12434 10354 5971 2339 3953 7920 14247 26661 13355 1437 16112 -1245 -10387
21012 -10387 -3453 6915 -8475 -1727 9739 5969 8079 4634 -7164 -7930 -8621 -12617 -11687 -5004
20998 -5004 7212 -1871 -17117 -23782 -18202 -10075 -4889 -15906 -21678 -23143 -13141 2868 13282
20985 13282 4779 -5946 -12689 -10562 -10531 -15050 -7230 1118 -1171 5275 5458 21826 30243 17164
20971 17164 3018 -12529 -29502 -21017 -7112 247 12894 7857 -1745 -11137 -20731 -7814 -3598
20958 -3598 1937 869 -298 -6473 10396 29357 20594 9401 4099 -4294 -18426 -9396 -12875 -15248
$$ packed form
21052D1294k5517k9761p557J5858l350J0787K2969n035m33N715j1246j4729j527
21039b532K268J0015r643j77M260j272q164j5858j0819j0086L1119J6122M066
21026I299L284j49k080m383l632J614L967O327J2414j3306j1918J4675j7357r142
21012a0387O934J0368j5390O748J1466l770K110l445j1798p66o91l996R30O683
20998e004J2216r083j5246o665N580Q127N186j1017n772j465J0002J6009J0414
20985A3282q503j0725o743K127L1m519P820Q348k289O446J83J6368Q417j3079
20971A7164j4146j5547j6973Q485J3905P359J2647n037r602r392r594J2917M216
20958c598N535j068j167o175J6869J8961q763j1193n302q393j4132R030l479k373
$$ plain form
20944 -15248 -4760 -8739 13135 10128 14308 3728 12949 10168 -2134 -10855 -11223 859 11895
20931 11895 16374 28835 27945 19867 6447 5400 -6961 -20116 -29753 -37063 -37281 -25710 -11345
20918 -11345 327 -2540 -13478 -1388 548 -681 -10302 -3833 5637 -5281 -12791 3359 14679
20905 14679 18194 15415 16689 8769 432 -16279 -30790 -30698 -15649 3233 -3752 -12606 -72 5883
20891 5883 16995 16880 20954 22683 3128 -4607 -9373 -20755 -4264 6604 5035 16863 26071
20878 26071 23075 23867 24379 22061 20779 14728 4633 22522 12149 3550 6180 23508 30648 12553
20864 12553 -4510 -28854 -29154 -21621 -8931 -6159 1986 9062 3483 363 -3921 -8675 -18162 -10332
20850 -10332 -2607 -10324 -9879 -16105 6292 25700 9523 463 -5934 -4736 -1129 -2128 -10517 -25768
$$ packed form
20944a5248J0488l979K1874l007M180j0580R221k781j2302q721l68J2082J1036
20931A1895M479J2461q90q078j3420j047j2361j3155r637p310k18J1571J4365
20918a1345J1672k867j0938J2090J936j229r621O469R470j0918p510J6150J1320
20905A4679L515k779J274p920q337j6711j4511R2J5049J8882o985q854J2534N955
20891E883J1112j15M074J729j9555p735m766j1382J6491J0868j569J1828R208
20878B6071k996P92N12k318j282o051j0095J7889j0373q599K630J7328P140j8095
20864A2553j7063k4344l00P533J2690K772Q145P076n579l120m284m754r487P830
20850a0332P725p717M45o226K2397J9408j6177r060o397J198L607r99q389j5251
$$ plain form
20836 -25768 -36707 -14311 -12212 -3698 3893 18146 19572 14346 11431 21594 11107 -4714 -4285
20823 -4285 3738 652 1024 11946 6221 -926 -12487 -12126 -2185 12023 130 -531 37 19819
20809 19819 17043 3292 2306 4563 14960 10761 9097 938 -2741 -9243 -4847 -8448 5355 22251
20795 22251 25144 4882 4578 14979 27715 24863 19710 3862 17925 23545 6854 4202 4221 4765
20781 4765 186 -4088 -20420 -10410 12871 21080 11817 -2515 -18682 -11458 -6865 -8407 -1106
20768 -1106 9434 38986 49259 30217 23570 28570 14242 4558 5587 17460 25923 20854 15194
20755 15194 18901 9547 6094 13826 6281 12119 22280 26552 20177 -4591 4344 526 -10940 -17796
20741 -17796 -5611 9732 2056 -9932 -16848 -10959 -6110 -4875 1692 -9798 -5590 4156 5429
$$ packed form
20836b5768j0939K2396K099Q514P591J4253J426n226k915J0163j0487j5821M29
20823d285Q023l086L72J0922n725p147j1561L61R941J4208j1893o61N68J9782
20809A9819k776j3751r86K257J0397m199j664q159l679o502M396l601J3803J6896
20795B2251K893k0262l04J0401J2736k852n153j5848J4063N620j6691k652J9N44
20781D765m579m274j6332J0010K3281Q209r263j4332j6167P224M593j542P301
20768a106J0540K9552J0273j9042o647N000j4328r684J029J1873Q463n069n660
20755A5194L707r354l453P732p545N838J0161M272o375k4768Q935l818j1466o856
20741a7796J2185J5343p676j1988o916N889M849J235O567j1490M208R746J273
$$ plain form
20728 5429 11854 14319 2054 8552 14719 17810 -3449 3285 20546 1177 -2214 8095 14436
20715 14436 -604 -10711 -25338 -24003 -13566 -7027 3527 -1850 -19932 -780 15361 28087
20703 28087 41140 32932 22539 837 -1907 1156 2666 12268 22672 10883 21697 18047 18060
20690 18060 21070 18904 11946 18040 27757 33027 33191 30314 21056 11761 -220 5935 16007 22334
20676 22334 17988 2578 6593 26272 33190 18772 11455 15577 17200 10908 21304 36458 32484
20663 32484 33082 23789 11984 -8018 -3547 745 -13798 -2401 10897 21087 27907 17882 34704
20650 34704 25120 3615 11964 9110 -407 17752 26957 13417 -14144 1412 14251 22058 29643
20637 29643 28938 24245 7577 7506 7622 11443 4219 6046 6068 -7458 -9630 14024 12410 -4526 -4029
$$ packed form
20728E429O425K465j2265O498O167L091k1259O734J7261j9369l391J0309O341
20715A4436j5040j0107j4627J335J0437O539J0554n377j8082J9152J6141J2726
20703B8087J3053q208j0393k1702k744L063J510R602J0404j1789J0814l650J3
20690A8060L010k166o958O094R717N270J64k877r258r295j1981O155J0072O327
20676B2334m346j5410M015J9679O918j4418p317M122J623o292J0396J5154l974
20663C2484N98r293j1805k0002M471M292j4543J1397J3298J0190O820j0025J6822
20650C4704r584k1505Q349k854r517J8159R205j3540k7561J5556J2839P807P585
20637B9643p05m693j6668p1J16L821p224J827K2j3526k172K3654j614j6936M97
$$ plain form
20622 -4029 23646 32505 18159 -278 5560 1273 -7648 -6720 169 10720 18390 12278 9258 11190
20608 11190 1789 -12786 -16802 -15991 -12831 -4876 11355 23461 14822 1709 105 817 -4224 6470
20594 6470 18571 13427 1816 -3551 1026 9049 13673 4431 -538 23967 30751 35091 44734 31555
20580 31555 5721 -1104 9008 10766 9938 2558 2065 12871 12906 7868 17397 18994 20521 8697
20566 8697 6931 22769 12014 -13404 -5178 17764 17330 13777 27861 38745 37342 28649 8536
20553 8536 2843 4329 19863 27042 19746 13978 19067 18344 6132 -7549 -2509 568 -75 -4092
20539 -4092 -1602 12486 15214 14800 6751 -20836 -21264 -9660 703 -9867 -10064 -4314 5590 26103
20525 26103 27397 34397 44631 39351 26333 12715 8712 24570 37915 31167 35945 23554 16593
$$ packed form
20622d029K7675Q859j4346j8437N838m287q921R28O889J0551P670o112l020J932
20608A1190r401j4575m016Q11L160P955J6231J2106q639j3113j604P12n041J0694
20594F470J2101n144j1611n367M577Q023M624r242m969K4505O784M340R643j3179
20580C1555k5834o825J0112J758q28p380m93J0806L5n038R529J597J527j1824
20566H697j766J5838j0755k5418Q226K2942m34l553J4084J0884j403q693k0113
20553H536n693J486J5534P179p296n768N089p23j2212j3681N040L077o43m017
20539d092K490J4088K728m14q049k7587m28J1604J0363j0570j97N750R904K0513
20525B6103J294P000J0234n280j3018j3618m003J5858J3345o748M778j2391o961
$$ plain form
20512 16593 21221 21556 16262 19574 26120 11140 -500 -2375 -2256 6839 4986 15190 15508 26667
20498 26667 27779 29815 24112 18366 14758 -3284 6509 13953 15722 5444 17852 26452 25809 17107
20484 17107 13892 21870 17708 6715 6571 6663 11545 12574 16818 24776 38405 40060 27903 24103
20470 24103 31443 43198 38957 33927 48047 41978 23060 33544 29079 20730 22890 19504 7263
20457 7263 14386 19813 8348 -6531 7592 7359 -1810 -1485 -12614 -18311 -19221 -29118 -12564 8874
20443 8874 -11819 -17431 -18691 -4865 47 -4466 10025 25814 24849 15607 18719 2618 5044 6375
20429 6375 999 1998 -978 -25976 -21574 -7652 -598 -7263 -17676 -22426 -9721 8166 22374
20416 22374 21852 2800 -5613 9106 9590 13675 414 -16154 -7634 -1482 13885 2580 -19053
$$ packed form
20512A6593M628L35n294L312O546j4980j1640j875J19R095j853J0204L18J1159
20498B6667J112K036n703n746l608j8042R793P444J769j0278J2408Q600o43q702
20484A7107l215P978m162j0993j44R2M882J029M244P958J3629J655j2157l800
20470B4103P340J1755m241n030J4120o069j8918J0484m465q349K160l386j2241
20457G263P123N427j1465j4879J4123k33r169L25j1129n697r10r897J6554K1438
20443H874k0693n612j260J3826M912m513J4491J5789r65r242L112j6101K426J331
20429F375n376R99k976k4998M402J3922P054o665j0413m750J2705J7887J4208
20416B2374n22j9052q413J4719M84M085j3261j6568Q520O152J5367j1305k1633
$$ plain form
20403 -19053 -13243 -5918 38 -8534 -6409 7941 2980 -8669 -14483 -21862 -34 8766 5451 11856
20389 11856 -1552 -12417 -9613 -7145 -15473 8910 12919 -2070 -17999 -17407 9121 16321 8247
20376 8247 2696 9082 2254 1743 2095 24648 14916 1146 -6504 -1417 664 15714 21141 17971
20362 17971 4160 12173 19012 8653 -6433 -23159 -20922 4513 17600 14219 7738 3425 -8074
20349 -8074 -15339 -19507 -25830 -13755 11 -7663 -26996 -7328 9411 23418 21252 3375 14786
20336 14786 6997 4664 17248 36941 21747 -3485 -4059 -2283 -4586 -6705 10944 17483 634
20323 634 7815 22903 23821 22959 17905 17438 17297 7079 18841 28549 15826 4334 -501 13716
20309 13716 42592 55861 33264 42006 47847 41331 31739 36349 42181 36800 41542 48161 45627 40616
$$ packed form
20403a9053N810P325N956q572K125J4350m961j1649n814p379K1828Q800l315O405
20389A1856j3408j0865K804K468q328K4383M009j4989j5929N92K6528P200q074
20376H247n551O386o828n11L52K2553r732j3770p650N087K081J5050N427l170
20362A7971j3811Q013O839j0359j5086j6726K237K5435J3087l381o481m313j1499
20349h074p265m168o323J2075J3766p674j9333J9668J6739J4007k166j7877J1411
20336A4786p789k333J2584J9693j5194k5232n74J776k303k119J7649O539j6849
20323F34P181J5088R18q62n054m67j41j0218J1762R708j2723j1492m835J4217
20309A3716K8876J3269k2597Q742N841o516r592M610N832n381M742O619k534n011
$$ plain form
20295 40616 36160 37195 10847 3975 19274 16767 14379 24744 11900 400 2046 3728 14124
20282 14124 24344 12557 19884 24202 27723 32689 22500 8348 29793 31459 29432 18449 17444
20269 17444 23199 33315 46764 54876 59119 65893 55750 57174 58265 49511 42581 37723 27062
20256 27062 7908 13097 21643 21082 2950 -10077 -11280 -8663 -7205 18777 30895 42751 36548
20243 36548 29552 39014 36994 31102 35314 37586 10559 7399 28662 20370 4149 -1849 21115
20230 21115 26442 4793 -22008 -27272 -14462 5092 9905 10356 16846 12301 26342 30078 28317
20217 28317 29463 24390 18850 20032 21534 5 -7330 -968 10103 19877 18315 21982 26125 32887
20203 32887 41066 50516 30375 26653 23757 18984 28314 16433 9581 10266 -13102 -36478 -2548
$$ packed form
20295D0616m456J035k6348o872J5299k507k388J0365j2844j1500J646J682J0396
20282A4124J0220j1787P327M318L521M966j0189j4152K1445J666k027j0983j005
20269A7444N755J0116J3449Q112M243O774j0143J424J091q754o930m858j0661
20256B7062j9154N189Q546n61j8132j3027j203K617J458K5982J2118J1856o203
20243C6548o996R462k020n892M212K272k7027l160K1263q292j6221n998K2964
20230B1115N327k1649k6801n264J2810J9554M813M51O490m545J4041L736j761
20217B8317J146n073n540J182J502k1529p335O362J1071R774j562L667M143O762
20203C2887Q179R450k0141l722k896m773R330j1881o852O85k3368k3376L3930
$$ plain form
20190 -2548 11542 7812 20894 24064 7327 4054 21299 28794 27205 34802 41818 29982 46142
20177 46142 42723 45428 58384 43488 20657 17516 29761 23845 23040 27383 28988 28033 8543 -15417
20163 -15417 -17868 -9456 4827 25107 32017 29882 13217 -2049 -5414 -8231 -15635 -3422 20666
20150 20666 28569 17123 17727 22208 19760 13808 29113 24871 9981 -8749 -6957 -1032 3445 19927
20136 19927 28905 32684 35779 37423 31501 21927 12144 30788 28032 15404 2021 10192 18199 11851
20122 11851 5371 14140 22901 32019 48688 54567 56626 33296 11811 21098 31792 11187 11227 17604
20108 17604 15812 7025 -7154 -914 17445 28237 32853 43847 52151 41227 35526 28860 37376
20095 37376 32751 8501 17994 27374 26665 23887 31501 44362 46950 45927 34807 24493 36773
$$ packed form
20190b548J4090l730J3082L170j6737l273J7245P495j589P597P016j1836J6160
20177D6142l419K705J2956j4896k2831l141J2245n916q05M343J605r55j9490k3960
20163a5417k451Q412J4283K0280O910k135j6665j5266l365k817p404J2213K4088
20150B0666P903j1446O04M481k448n952J5305m242j4890j8730J792N925M477J6482
20136A9927Q978L779L095J644n922r574r783J8644k756j2628j3383Q171Q007o348
20122A1851o480Q769Q761R118J6669N879K059k3330k1485R287J0694k0605M0O377
20108A7604j792q787j4179O240J8359J0792M616J0994Q304j0924n701o666Q516
20095C7376m625k4250R493R380p09k778P614J2861K588j023j1120j0314J2280
$$ plain form
20082 36773 40594 59846 74704 71603 56833 53052 48067 50597 45015 28470 24564 38087 40909
20069 40909 34662 25721 18561 24271 40743 43972 29531 7511 3808 11886 9409 21944 35539
20056 35539 49520 46030 44268 43807 51686 38901 37467 24946 17796 20456 22727 19152 22316 30340
20042 30340 34331 29253 31208 22777 34954 45378 41298 38508 43664 59891 70385 50401 43363
20029 43363 41713 48723 48000 37247 36784 53117 66148 44012 25437 21794 19797 32560 18948
20016 18948 14072 26045 26388 24686 17065 32108 38263 28610 29782 42280 41375 40081 30521 12570
20002 12570 6818 10060 15840 38059 49734 35386 29379 32561 39724 45695 23811 14962 19192
19989 19192 43982 66062 58775 44887 33124 40211 25416 4679 6237 13294 24930 37797
$$ packed form
20082C6773L821J9252J4858l101j4770l781m985K530n582j6545l906J3523K822
20069D0909o247q941p160N710J6472L229j4441k2020l703Q078k477J2535J3595
20056C5539J3981l490j762m61P879j2785j434j2521p150K660K271l575L164Q024
20042C0340L991n078J955q431J2177J0424m080k790N156J6227J0494j9984p038
20029D3363j650P010p23j0753m63J6333J3031k2136j8575l643j997J2763j3612
20016A8948m876J1973L43j702p621J5043O155r653J172J2498r05j294r560j7951
20002A2570n752L242N780K2219J1675j4348o007L182P163N971k1884q849M230
19989A9192K4790K2080p287j3888j1763P087j4795k0737J558P057J1636J2867
$$ plain form
19977 37797 38251 32086 25388 17479 15059 18299 23164 48708 63878 66293 53009 41456 26069
19964 26069 27559 26559 29543 26927 28287 30873 14983 -1008 10552 13774 -1154 -32 -737 1780
19950 1780 9416 28265 33457 34499 29800 17122 16296 22117 29725 25852 26696 36808 29856 23320
19936 23320 30683 20119 2488 6870 12616 14141 20345 35741 20713 1355 -1210 2096 2085 27112
19922 27112 24139 25060 22335 19332 12816 21034 27114 36470 31172 19889 26834 33955 34069 22911
19908 22911 10431 17219 20538 15134 18212 10752 -1824 11897 25207 17398 16680 15635 22019 16787
19894 16787 20611 22163 25929 22185 18431 2207 -10835 7652 30091 25654 33264 36598 51883
19881 51883 49896 37405 36005 24336 16221 30888 48880 39000 31745 34769 34852 26694 17521 15375
$$ packed form
19977C7797M54o165o698p909k420L240M865K5544J5170K415j3284j1553j5387
19964B6069J490j000K984k616J360K586j5890j5991J1560L222j4928J122p05K517
19950A780P636J8849N192J042m699j2678q26N821P608l873Q44J0112o952o536
19936B3320P363j0564j7631M382N746J525O204J5396j5028j9358k565L306j1K5027
19922B7112k973R21k725l003o516Q218O080R356n298j1283O945P121J14j1158
19908B2911j2480O788L319n404L078p460j2576J3721J3310p809p18j045O384n232
19894A6787L824J552L766l744l754j6224j3042J8487K2439m437P610L334J5285
19881E1883j987j2491j400j1669q115J4667J7992r880p255L024Q3q158r173k146
$$ plain form
19867 15375 29869 32725 45396 38850 35147 30522 20342 28272 34119 31131 16172 14179 44118
19854 44118 39362 23665 30120 24527 9093 -5764 -9343 3445 -3761 4925 14482 14453 13950 11914
19840 11914 29904 32394 28169 26896 16199 13645 25172 39026 26638 25539 52241 58820 33700
19827 33700 8930 -1191 171 1759 23219 24588 20560 8283 13593 27287 24666 7881 9536
19814 9536 38106 30048 20930 30543 31779 28188 27762 22613 33450 52779 40358 32133 30647 20822
19800 20822 17597 28568 30366 26999 31672 19037 1670 6538 17413 13101 28739 42392 36225
19787 36225 14951 11877 29804 51187 38397 36217 56562 62450 51489 59542 51450 49674 39337
19774 39337 28874 21470 49020 62415 57685 43371 16409 8978 12580 27704 33955 35179 53767
$$ packed form
19867A5375J4494K856J2671o546l703m625j0180P930N847k988j4959j993K9939
19854D4118m756j5697O455n593j5434j4857l579J2788p206Q686R557k9n03k036
19840A1914J7990K490m225j273j0697k554J1527J3854j2388j099K6702O579k5120
19827C3700k4770j0121J362J588K1460J369m028j2277N310J3694k621j6785J655
19814I536K8570q058r118R613J236l591m26n149J0837J9329j2421q225j486r825
19800B0822l225J0971J798l367M673j2635j7367M868J0875m312J5638J3653o167
19787C6225k1274l074J7927K1383j2790k180K0345N888j0961Q053q092j776j0337
19774C9337j0463p404K7550J3395m730j4314k6962p431L602J5124O251J224J8588
$$ plain form
19761 53767 60512 59236 55618 51900 33594 41950 33877 26133 23367 36772 50514 58424 56324 48418
19747 48418 42744 27145 31442 39810 39760 22333 34592 38428 36845 39076 25599 19985 22887 27067
19733 27067 21280 27107 32502 39540 32308 30905 43893 54355 47194 40310 37108 39820 30301 32673
19719 32673 48184 48101 57681 55598 54960 54078 52607 54900 68316 84894 64005 57741 67712 70858
19705 70858 55299 37137 37017 40256 33524 42814 40286 41285 31381 29371 34249 48965 44190 28710
19691 28710 19788 15636 33029 49950 41291 28571 27953 32453 25040 19993 17044 18548 46790 52239
19677 52239 48621 48240 45627 51802 61006 65723 54722 47723 52765 54408 54998 37860 21960 38510
19663 38510 50976 51642 59555 56341 53255 42390 29570 23888 19017 19544 25608 22737 43048 48063
$$ packed form
19761E3767O745j276l618l718j8306Q356q073p744k766J3405J3742P910k100p906
19747D8418n674j5599M297Q368n0j7427J2259L836j583K231j3477n614K902M180
19733B7067n787N827N395P038p232j403J2988J0462p161o884l202K712r519K372
19719C2673J5511q3R580k083o38q82j471K293J3416J6578k0889o264R971L146
19705G0858j5559j8162j20L239o732R290k528R99r904k010M878J4716m775j5480
19691B8710q922m152J7393J6921q659j2720o18M500p413n047k949J504K8242N449
19677E2239l618l81k613O175R204M717j1001o999N042J643N90j7138j5900J6550
19663C8510J2466O66P913l214l086j0865j2820n682m871N27O064k871K0311N015
$$ plain form
19649 48063 59991 70370 69610 76868 80861 72749 60873 52028 43657 30429 12662 25730 47381
19636 47381 41120 64553 69838 59305 71314 81076 57054 42003 34815 26230 36774 33533 34028
19623 34028 50970 68894 78363 73548 59121 57811 45788 54075 50819 37261 33837 42209 44261
19610 44261 54710 58405 61606 53554 49049 59325 67755 56579 61132 61425 66457 75534 68433 69003
19596 69003 68574 56842 45972 50323 46541 54309 53684 50538 52996 38968 30415 35587 43352 51591
19582 51591 57347 62319 69502 67324 71500 75815 55491 53743 61037 71796 63345 58245 54367 60122
19568 60122 60956 72529 56194 51143 37528 36245 37375 58310 67606 71625 53775 32744 32309
19555 32309 32668 51938 50654 49099 35252 51457 47173 53099 65541 62981 53747 54852 49550 34804
$$ packed form
19649D8063J1928J0379p60P258L993q112j1876q845q371j3228j7767J3068K1651
19636D7381o261K3433N285j0533J2009R762k4022j5051p188q585J0544l241M95
19623C4028J6942J7924R469m815j4427j310j2023Q287l256j3558l424Q372K052
19610D4261J0449L695L201q052m505J0276Q430j1176M553K93N032R077p101N70
19596F9003m29j1732j0870M351l782P768o25l146K458j4028q553N172P765Q239
19582E1591N756M972P183k178M176M315k0324j748P294J0759q451n100l878N755
19568F0122Q34J1573j6335n051j3615j283J130K0935R296M019j7850k1031m35
19555C2309L59J9270j284j555j3847J6205m284N926J2442k560r234J105n302j4746
$$ plain form
19541 34804 42530 50592 40450 30530 26627 37741 46084 48352 34570 41131 46246 34770 40765
19528 40765 55080 61548 63429 68935 61071 49859 76928 96590 91915 97518 107536 127194 159974
19515 159974 175763 180782 168788 153629 132875 115136 106713 91616 103631 128074 168189 176969
19503 176969 178947 195217 178573 145957 117353 86520 69446 107787 92654 59567 48898 55535
19491 55535 61319 75104 90186 92382 96939 89385 80403 93375 94218 85138 66039 57159 77061
19478 77061 80538 79300 79299 66106 57802 54690 67124 93715 121559 138671 182421 229073 271188
19465 271188 313176 314358 279860 259174 222779 184009 162697 163472 161727 172638 212911 268479
19453 268479 289680 302555 303734 269479 212850 168050 128975 99822 89315 84151 93217 92960
$$ packed form
19541C4804P726Q062j0142r920l903J1114Q343K268j3782O561N115j1476N995
19528D0765J4315O468J881N506p864j1212K7069J9662m675N603J0018J9658L2780
19515A59974J5789N019j1994j5159k0754j7739q423j5097J2015K4443M0115Q780
19503A76969J978J6270j6644l2616k8604l0833j7074L8341j5133l3087j0669O637
19491E5535N784J3785J5082K196M557p554q982J2972Q43r080j9099q880J9902
19478G7061L477j238jj3193q304l112J2434K6591K7844J7112M3750M6652M2115
19465B71188M1988J182l4498k0686l6395l8770k1312P75j745J0911M0273N5568
19453B68479K1201J2875J179l4255n6629m4800l9075k9153j0507n164R066k57
$$ plain form
19441 92960 75289 87512 94334 93918 85556 84875 88842 113500 133320 117293 95458 85947 98500
19428 98500 100779 103205 101151 83681 83771 87830 80809 69284 73183 92511 115309 138906 163078
19415 163078 180522 186097 173744 149038 120915 109457 102266 86007 87566 125364 154674 167477
19403 167477 197988 214641 200177 172032 142202 125787 110439 80895 72885 84528 97624 105559
19391 105559 97372 81422 63690 53107 39392 35341 43049 43401 67611 80937 72371 56547 71929
19378 71929 64046 52070 54366 71117 67509 63071 67802 67887 81470 73368 47861 34057 50290
19365 50290 65759 64418 76564 73816 68407 65564 63739 71068 109777 102845 66301 51212 48699
19352 48699 51581 55543 62723 66128 59069 82346 88749 83807 70562 55289 54392 59216 58507 65697
$$ packed form
19441I2960j7671J2223O822m16q362o81L967K4658J9820j6027k1835r511J2553
19428I8500K279K426k054j7470R0M059p021j1525L899J9328K2798K3597K4172
19415A63078J7444N575j2353k4706k8123j1458p191j6259J559L7798K9310J2803
19403A67477L0511J6653j4464k8145k9830j6415j5348k9544q010J1643J3096P935
19391A05559q187j5950j7732j0583j3715m051P708L52K4210J3326q566j5824J5382
19378G1929p883j1976K296J6751l608m438M731Q5J3583q102k5507j3804J6233
19365E0290J5469j341J2146k748n409k843j825P329L8709o932l6544j5089k513
19352D8699K882L962P180L405p059K3277O403m942j3245j5273q97M824p09P190
$$ plain form
19338 65697 67783 54349 46711 48037 57794 70801 78441 80433 83113 95753 107571 103560 87027
19325 87027 67848 49531 63893 76484 71000 55125 52602 49953 57089 56365 68443 79207 87376
19312 87376 86791 87392 75585 75597 87730 79609 66711 63082 69676 60714 57510 49943 62586 75647
19298 75647 97783 107714 98328 104292 115465 112059 107430 94591 91291 99591 115407 102991 100178
19285 100178 106488 112051 103297 115546 114202 95100 91047 100550 119084 134405 151536 157196 163448
19272 163448 176879 209775 244877 281651 345302 463258 568609 638042 687515 686621 637320
19261 637320 564781 486881 434931 416169 456108 545743 633369 692847 748453 730922 633545
19250 633545 519022 405761 326802 270215 236143 208797 199306 191704 197271 212335 203989 195765
$$ packed form
19338F5697K086j3434p638J326R757J3007P640J992K680J2640J1818m011j6533
19325H7027j9179j8317J4362J2591n484j5875k523k649P136p24J2078J0764Q169
19312H7376n85O01j1807J2J2133q121j2898l629O594q962l204p567J2643J3061
19298G5647K2136R931r386N964J1173l406m629j2839l300Q300J5816j2416k813
19285A00178O310N563q754J2249j344j9102m053R503J8534J5321J7131N660O252
19272A63448J3431L2896L5102L6774O3651J17956J05351O9433M9473q94m9301
19261F37320p2539p7900n1950j8762L9939Q9635Q7626N9478N5606j7531r7377
19250F33545j14523j13261p8959n6587l4072k7346r491p602N567J5064q346q224
$$ plain form
19238 195765 183101 168029 160784 158817 169971 175229 184436 182374 177790 189460 191749 188596 198818
19225 198818 209055 207200 223268 236920 285022 331500 418803 537857 635939 715037 773585
19214 773585 772694 703144 614885 522102 463631 457079 512014 620137 721696 782560 805326 743300
19202 743300 634603 539038 443573 351497 292547 261488 224793 185890 164372 146938 145278
19191 145278 146156 156740 158690 163756 158105 157731 161367 160181 152398 146511 143604 169261 179381 161434
19177 161434 162041 170529 158797 138868 123310 120576 116158 131360 148134 134548 121863 121280 126149
19164 126149 130125 129347 135974 134746 138813 137590 131935 122291 121295 118989 107074 109807 120284 138790
19150 138790 138393 136253 136870 148792 147974 137610 126188 124035 139495 150913 143909 139431 137703 131928
$$ packed form
19238A95765j2664j5072p245j967J1154N258R207k062m584J1670K289l153J0222
19225A98818J0237j855J6068J3652M8102M6478Q7303J19054R8082P9098N8548
19214G73585q91o9550q8259r2783n8471o552N4935J08123J01559O0864K2766o2026
19202G43300j08697r5565r5465r2076n8950l1059l6695l8903k1518j7434j660
19191A45278Q78J0584J950N066n651l74L636j186p783n887k907K5657J0120j7947
19177A61434O07Q488j1732j9929j5558k734m418J5202J6774j3586j2685n83M869
19164A26149L976p78O627j228M067j223n655r644r96k306j1915K733J0477J8506
19150A38790l97k140O17J1922q18j0364j1422k153J5460J1418p004m478j728n775
$$ plain form
19136 131928 123560 134716 154307 133009 128862 124761 112153 102639 110060 137086 168676 173260 150918
19123 150918 149905 151811 159007 159852 158604 158402 157866 145489 142392 149843 134766 135226 129724 123123 137871
19108 137871 144524 149246 162814 170583 160027 147531 130050 114591 122019 139875 143117 152188 160562
19095 160562 159259 143565 147250 142459 137476 145750 141117 143176 157353 174299 170345 175197 185364
19082 185364 193452 182172 166092 167392 151789 138061 169405 177940 177008 144592 135190 164014 189637
19069 189637 174299 166318 187275 187058 163168 155767 179892 205195 194263 196330 213934 218350 209868
19056 209868 208026 203625 216844 219321 200590 161325 140576 144532 162255 186587 203190 199691
19044 199691 199343 203200 206626 182607 152815 158125 160385 144306 120263 137702 156439 164972 191710
$$ packed form
19136A31928q368J1156J9591k1298m147m101j2608r514P421K7026L1590M584k2342
19123A50918j013J906P196Q45j248k02n36j2377l097P451j5077M60n502o601J4748
19108A37871O653M722J3568P769j0556j2496j7481j5459P428J7856L242R071Q374
19095A60562j303j5694L685m791m983Q274m633K059J4177J6946l954M852J0167
19082A85364Q088j1280j6080J300j5603j3728L1344Q535r32l2416r402K8824K5623
19069A89637j5338p981K0957k17k3890p401K4125K5303j0932K067J7604M416q482
19056B09868j842m401J3219K477j8731l9265k0749L956J7723K4332J6603l499
19044A99691l48L857L426k4019k9792N310K260j6079k4043J7439J8737Q533K6738
$$ plain form
19031 191710 190778 181745 179775 171595 167223 168336 187579 200739 199847 172736 155690 166686 171517
19018 171517 173750 184729 192683 203187 197370 201536 214112 211559 223714 234842 242447 249335 255216
19005 255216 258129 261659 278595 289590 319116 390055 481144 563749 589496 561614 520768 455580
18993 455580 406678 377084 376782 396113 446918 537452 608647 617063 558160 457460 388457 345150
18981 345150 317094 297870 262768 255540 245567 236779 230667 220009 222721 227542 232670 225946 227398
18968 227398 253756 266045 274308 285732 284338 296203 285240 260984 240669 246177 254376 269117
18956 269117 283995 320431 368668 442477 545599 642392 682771 669139 641437 597108 639621
18945 639621 734842 783407 791303 800425 832625 861466 861688 830351 773772 723877 734103 775080
$$ packed form
19031A91710r32r033j970q180m372J113J9243J3160q92k7111j7046J0996M831
19018A71517K233J0979P954J0504n817M166J2576k553J2155J1128P605O888N881
19005B55216K913L530J6936J0995K9526P0939R1089Q2605K5747k7882m0846o5188
18993D55580m8902k9594l02J9331N0805R0534P1195Q416n8903j00700o9003m3307
18981C45150k8056j9224l5102p228r973q788o112j0658K712M821N128o724J452
18968B27398K6358J2289Q263J1424j394J1865j0963k4256k0315N508Q199J4741
18956B69117J4878L6436M8237P3809J03122R6793M0379j3632k7702m4329M2513
18945F39621R5221M8565P896R122L2200K8841K22l1337n6579m9895J0226M0977
$$ plain form
18933 775080 798062 753312 663332 559969 489345 431090 415371 399321 368069 339783 329836
18922 329836 327463 306212 303037 293052 284501 290776 318483 335663 332871 333289 321033 322903 319688
18909 319688 313720 317015 334561 338017 341813 347142 355453 370414 382627 414924 498195 613472
18897 613472 728813 766392 736880 699114 694717 720896 770716 802126 821846 857044 927807
18886 927807 986589 998036 940700 881176 902130 994686 1061676 1020821 929053 824147 716575
18875 716575 637889 591569 581740 613906 678475 705330 687947 642157 575932 518627 483598 456754
18863 456754 457973 447865 438399 427144 430056 444691 442617 428316 424416 439022 455943 494943
18851 494943 556241 596237 633602 706540 808058 898037 971594 1021855 1011253 954994 908637
$$ packed form
18933G75080K2982m4750q9980j03363p0624n8255j5719j6050l1252k8286r947
18922C29836k373k1251l175r985q551O275K7707J7180k792M18j2256J870l215
18909C19688n968L295J7546L456L796N329Q311J4961J2213L2297Q3271J15277
18897F13472J15341L7579k9512l7766m397K6179M9820L1410J9720L5198P0763
18886I27807N8782J1447n7336n9524K0954R2556O6990m0855r1768j04906j07572
18875G16575p8686m6320r829L2166O4569K6855j7383m5790o6225n7305l5029k6844
18863D56754J219j0108r466j1255K912J4635k074j4301l900J4606J6921L9000
18851D94943O1298L9996L7365P2938J01518Q9979P3557N0261j0602n6259m6357
$$ plain form
18840 908637 896010 942647 1005555 1126519 1303062 1483090 1618997 1654204 1562772 1412451
18830 1412451 1264742 1149099 1086704 1078339 1136541 1253362 1321830 1301356 1210500 1077328 974166
18819 974166 909398 861218 830170 797038 770732 756018 744415 739779 744953 751269 750583 732450
18807 732450 703908 707350 704920 703664 741181 801924 863209 931867 969134 955359 941673 928074
18795 928074 921506 938985 993207 1077326 1179176 1317025 1443434 1529023 1567844 1511612 1451883
18784 1451883 1443379 1438211 1429822 1449959 1503248 1619155 1727109 1791446 1885915 2048843 2254386
18773 2254386 2445419 2616777 2771023 2755580 2631552 2539291 2531732 2664766 3001615 3484161
18763 3484161 3955189 4360269 4652215 4861508 4988025 5092688 5322297 5720157 6393064
$$ packed form
18840I08637j2627M6637O2908J20964J76543J80028J35907L5207r1432j50321
18830A412451j47709j15643o2395q365N8202J16821O8468k0474r0856j33172j03162
18819I74166o4768m8180l1048l3132k6306j4714j1603m636N174O316o86j8133
18807G32450k8542L442k430j256L7517O0743O1285O8658L7267j3775j3686j3599
18795I28074o568J7479N4222Q4119J01850J37849J26409Q5589L8821n6232n9729
18784A451883q504n168q389K0137N3289J15907J07954O4337R4469J62928K05543
18773B254386J91033J71358J54246j5443j24028r2261p559J33034L36849M82546
18763C484161M71028M05080K91946K09293J26517J04663K29609L97860O72907
$$ plain form
18754 6393064 7440225 8871053 10816904 13773060 18348511 26028674 39942642 63250904
18746 63250904 87760665 100755435 112207534 114781106 100422746 83125163 65205468
18739 65205468 52651312 50129937 58634573 80131331 104158016 114263932 123255595
18732 123255595 123258385 104867935 83566877 60927106 41996949 30320199 23376089 18978189
18724 18978189 15976053 13893645 12430491 11298877 10525044 10124527 10011830 10070173 10119428
18715 10119428 10129681 10024797 9830117 9612829 9427788 9296467 9287673 9406064 9717813 10433634
18705 10433634 11535863 12989493 15110977 18409550 23632827 32780620 49614007 76984113
18697 76984113 102637141 115769188 128341162 128045131 110241283 90929545 71293598
$$ packed form
18754F393064J047161J430828J945851K956156M575451P680163J3913968K3308262
18746F3250904K4509761J2994770J1452099K573572j4358360j7297583j7919695
18739F5205468j2554156k521375Q504636K1496758K4026685J0105916Q991663
18732A23255595K790j8390450k1301058k2639771j8930157j1676750o944110m397900
18724A8978189l002136k082408j463154j131614p73833m00517j12697N8343M9255
18715A0119428J0253j04884j94680k17288j85041j31321q794J18391L11749P15821
18705A0433634J102229J453630K121484L298573N223277R147793J6833387K7370106
18697G6984113K5653028J3132047J2571974k96031j7803848j9311738j9635947
$$ plain form
18690 71293598 59268278 58949005 71158703 96748490 121175917 131456193 140588576
18683 140588576 136430365 114119675 89743840 64377370 44583067 32543213 25295913
18676 25295913 20334197 16715220 13999923 11902075 10391899 9421535 8801233 8468827
18668 8468827 8161414 7613590 6956661 6251865 5605575 5137435 4788661 4571598 4522709 4502865
18658 4502865 4438480 4379961 4249039 4062355 3908270 3698539 3509961 3376258 3118469 2794892
18648 2794892 2461102 2161750 1962358 1881109 1888921 1962807 2110685 2350866 2734322 2939889
18638 2939889 2752682 2423012 2014172 1700501 1537912 1444328 1427719 1473691 1604110 1886047
18628 1886047 2132696 2069598 1856326 1563733 1295964 1120423 992558 919885 866674 842943
$$ packed form
18690G1293598j2025320l19273J2209698K5589787K4427427J0280276R132383
18683A40588576m158211k2310690k4375835k5366470j9794303j2039854p247300
18676B5295913m961716l618977k715297k097848j510176r70364o20302l32406
18668H468827l07413n47824o56929p04796o46290m68140l48774k17063m8889j9844
18658D502865o4385n8519j30922j86684j54085k09731j88578j33703k57789l23577
18648B794892l33790k99352j99392q1249P812P3886J47878K40181L83456K05567
18638B939889j87207l29670m08840l13671j62589r3584j6609M5972J30419K81937
18628A886047K46649o3098k13272k92593k67769j75541j27865p2673n3211k3731
$$ plain form
18618 842943 817488 786304 780604 790897 785720 787160 780076 782852 785997 795114 874020 1015883 1208850
18605 1208850 1406695 1441554 1357506 1202873 1054811 975599 962089 989308 1004336 1018968 1069296
18594 1069296 1114740 1111428 1063848 1004921 928439 861306 810552 765608 733225 711606 724972
18583 724972 770942 794599 793066 784221 783734 793058 816541 813337 803012 776116 764805 761990 747687
18570 747687 767683 801017 812952 829016 831814 848724 861913 865883 850347 832044 814586 836898
18558 836898 870628 890120 932696 1003488 1112490 1219231 1308657 1366345 1375252 1374271 1311331 1209796
18546 1209796 1129385 1047195 968713 927709 907676 907256 925194 937343 952852 956112 955545 966785
18534 966785 978996 993251 1029394 1057766 1060605 1088270 1107697 1123459 1149315 1166060 1190656 1235765
$$ packed form
18618H42943k5455l1184n700J0293n177J440p084K776L145R117P8906J41863J92967
18605A208850J97845L4859q4048j54633j48062p9212j3510K7219J5028J4632N0328
18594A069296M5444l312m7580n8927p6482o7133n0754m4944l2383k1619J3366
18583G24972M5970K3657j533q845m87R324K3483l204j0325k6896j1311k815j4303
18570G47687J9996L3334J1935J6064K798J6910J3189L970j5536j8303j7458K2312
18558H36898L3730J9492M2576P0792J09002J06741Q9426N7688Q907r81o2940j01535
18546A209796q0411q2190p8482m1004k0033m20J7938J2149J5509L260n67J1240
18534I66785J2211J4255L6143K8372K839K7665J9427J5762K5856J6745K4596M5109
$$ plain form
18522 1235765 1282091 1355269 1468141 1567323 1625522 1693722 1730966 1734524 1786322 1890091 1983889
18511 1983889 2038996 2094528 2198584 2327831 2474203 2671326 2878571 2991020 3019270 3035429
18501 3035429 3105080 3257932 3509815 3869818 4327571 4934123 5786253 7079711 9054119
18492 9054119 12102888 17270966 26639370 43288388 63466175 69026342 61980695 49350659
18484 49350659 35202724 26417305 22453486 21722711 24146193 31150199 45405027 63440624
18476 63440624 67482318 59444313 46303661 31664568 22070769 16501259 13088019 10839587
18468 10839587 9260318 8144252 7354520 6745898 6334302 6136530 6152518 6238674 6264355
18459 6264355 6245874 6294541 6416795 6636620 6904719 7065249 7165093 7390042 7791849 8403963
$$ packed form
18522A235765M6326P3178J12872R9182N8199O8200L7244L558N1798J03769R3798
18511A983889N5107N5532J04056J29247J46372J97123K07245J12449K8250J6159
18501C035429O9651J52852K51883L60003M57753O06552Q52130J293458J974408
18492I054119L048769N168078R368404J6649018K0177787N560167p045647j2630036
18484D9350659j4147935q785419l963819p30775K423482P004006J4254828J8035597
18476F3440624M041694q038005j3140652j4639093r593799n569510l413240k248432
18468A0839587j579269j116066p89732o08622m11596j97772J5988Q6156K5681
18459F264355j8481M8667J22254K19825K68099J60530R9844K24949M01807O12114
$$ plain form
18449 8403963 9286407 10482613 12061457 14297318 17478668 22525374 31484914 47857430
18441 47857430 73188181 91270818 89548763 80763621 68991661 65794757 77225516
18434 77225516 95543731 100821804 97844149 95680410 100288040 104437225 95728409 83027836
18426 83027836 69150992 63689554 71938876 86657075 86692121 75080467 58474100 41294272
18418 41294272 30127865 23480183 19341517 16601654 14656935 13169958 11933612 10964588
18410 10964588 10271558 9888485 9722324 9741243 9766216 9787660 9876582 10015882 10123999 10330665
18400 10330665 10780062 11660370 13213909 15846494 20198614 25323206 28069893 29011755
18392 29011755 29589533 31017597 35688119 45935437 65725877 96063814 118239315 123546131
$$ packed form
18449H403963Q82444J196206J578844K235861L181350N046706Q959540J6372516
18441D7857430K5330751J8082637j722055q785142j1771960l196904J1430759
18434G7225516J8318215N278073k977655k163739M607630M149185q708816j2700573
18426H3027836j3876844n461438Q249322J4718199L5046j1611654j6606367j7179828
18418D1294272j1166407o647682m138666k739863j944719j486977j236346r69024
18410A0964588o93030l83073j66161J8919K4973K1444Q8922J39300J08117K06666
18400A0330665M49397Q80308J553539K632585M352120N124592K746687R41862
18392B9011755N77778J428064M670522J0247318J9790440L0337937K2175501N306816
$$ plain form
18384 123546131 127352958 126077326 121809249 123110648 127163494 135628791 141079717 148065218
18376 148065218 162957061 162498221 141040792 113613320 83194563 61605577 50792240
18369 50792240 47885008 51626826 58684934 59866044 53782324 44456750 34203824 26675309
18361 26675309 22189404 19599277 18056087 17035299 16332592 15944080 15874395 16274936 17370437
18352 17370437 19536357 23403001 28496101 31361055 31264322 30044532 28788029 29481798
18344 29481798 32922075 39839289 51334515 64036941 70672056 73664150 78235121 91382406
18336 91382406 120396604 157661136 191372155 217810574 223366560 219602385 214009055
18329 214009055 214868595 206843502 191708827 178765175 168958750 169233777 165318914 156683541
$$ packed form
18384A23546131L806827j275632m268077J301399M052846Q465297N450926O985501
18376A48065218J4891843m58840k1457429k7427472l0418757k1588986j0813337
18369E0792240k907232L741818P058108J181110o083720r325574j0252926p528515
18361B6675309m485905k590127j543190j020788p02707l88512o9685M00541J095501
18352A7370437K165920L866644N093100K864954r6733j219790j256503O93769
18344B9481798L440277O917214J1495226J2702426O635115K992094M570971J3147285
18336I1382406K9014198L7264532L3711019K6438419N555986l764175n593330
18329B14009055Q59540q025093j5134675j2943652r806425K75027l914863q635373
$$ plain form
18321 156683541 138482092 112053424 87299311 66390578 52142002 44012270 40496998
18314 40496998 41012206 43682049 42930688 38707508 33147343 27262977 22984747 20250739
18306 20250739 18427870 17209393 16443084 16016879 15930580 16188601 16639846 17395916 18689042
18297 18689042 20837367 24486548 30982461 42232047 59322294 75190172 78571756 73066827
18289 73066827 63456562 55682002 55566245 65358883 84093411 101909483 119782438 147109533
18281 147109533 176022761 193749838 201554653 197598657 172853912 137458358 102738047
18274 102738047 72332070 51843261 39277367 31410977 26376918 23204382 21517552
18267 21517552 21443516 23573849 28287116 32444202 31344085 27238413 21532811 16213157
$$ packed form
18321A56683541j8201449k6428668k4754113k0908733j4248576q129732l515272
18314D0496998N15208K669843p51361m223180n560165n884366m278230k734008
18306B0250739j822869j218477p66309m26205q6299K58021M51245P56070J293126
18297A8689042K148325L649181O495913J1249586J7090247J5867878L381584n504929
18289G3066827r610265p774560j15757R792638J8734528J7816072J7872955K7327095
18281A47109533K8913228J7727077P804815l955996k4744745l5395554l4720311
18274A02738047l0405977k0488809j2565894p866390n034059l172536j686830
18267B1517552p4036K130333M713267M157086j100117m105672n705602n319654
$$ plain form
18259 16213157 12646716 10416535 8992325 8085826 7467735 6922412 6430456 5982092 5680584
18250 5680584 5513228 5415368 5376515 5307979 5045164 4559458 3987637 3432602 2991389 2665849
18240 2665849 2418944 2226380 2053509 1908792 1810295 1728005 1660893 1627787 1592668 1524093
18230 1524093 1453118 1401761 1363794 1350276 1351818 1344623 1323546 1344517 1396259 1458644 1528963 1582969
18218 1582969 1635801 1620506 1516813 1385038 1267504 1210582 1195084 1247169 1331905 1413504 1450671
18207 1450671 1471694 1456077 1386773 1284755 1128992 1011289 961380 945366 939763 921186 894411
18196 894411 859206 827150 800244 771111 743319 740358 757196 761179 752845 748568 736308 715272
18184 715272 720830 723665 749852 801806 829553 854948 873535 891465 911856 961104 1052905 1181620
$$ packed form
18259A6213157l566441k230181j424210r06499o18091n45323m91956m48364l01508
18250E680584j67356r7860l8853o8536k62815m85706n71821n55035m41213l25540
18240B665849k46905j92564j72871j44717r8497q2290o7112l3106l5119o8575
18230A524093p0975n1357l7967j3518J542p195k1077K0971N1742O2385P0319N4006
18218A582969N2832j5295j03693j31775j17534n6922j5498N2085Q4736Q1599L7167
18207A450671K1023j5617o9304j02018j55763j17703m9909j6014n603j8577k6775
18196H94411l5205l2056k6906k9133k7792k961J6838L983q334m277j2260k1036
18184G15272N558K835K6187N1954K7747K5395J8587J7930K0391M9248R1801J28715
$$ plain form
18172 1181620 1368730 1575116 1728181 1876912 2009868 2147871 2306669 2322890 2244794 2161212
18162 2161212 2125853 2269718 2574998 2832551 2859106 2673190 2349014 2004067 1733537 1540609
18152 1540609 1388885 1286221 1191251 1109814 1073045 1054833 1039646 1040692 1047240 1050010 1066182
18141 1066182 1070239 1066555 1075531 1077563 1114854 1162967 1181082 1177158 1148028 1122256 1124655 1172462
18129 1172462 1234286 1314931 1376681 1403244 1436829 1506152 1614024 1750279 1960645 2283258
18119 2283258 2653942 2965900 3283255 3631659 3908268 4145131 4419811 4914624 5684137
18110 5684137 6458109 7338383 8965550 12314669 19527943 31410024 36297683 32104020
18102 32104020 25698826 17217508 11946672 9490442 8446647 8235710 8675526 9710785
$$ packed form
18172A181620J87110K06386J53065J48731J32956J38003J58798J6221p8096q3582
18162B161212l5359J43865L05280K57553K6555j85916l24176l44947k70530j92928
18152A540609j51724j02664r4970q1437l6769j8212j5187J046O548K770J6172
18141A066182M057l684Q976K032L7291M8113J8115l924k9130k5772K399M7807
18129A172462O1824Q0645O1750K6563L3585O9323J07872J36255K10366L22613
18119B283258L70684L11958L17355L48404K76609K36863K74680M94813P69513
18110E684137P73972Q80274J627167L349119P213274J1882081M887659m193663
18102C2104020o405194q481318n270836k456230j043795k10937M39816J035259
$$ plain form
18094 9710785 11430148 14184330 18843950 26846685 39604208 52188160 55527515 53517041
18086 53517041 49264938 47741064 54350056 72179998 97455828 108602713 100458342 84201640
18078 84201640 65090645 53850966 53507220 62254983 69512416 64824290 54291404 40611519
18070 40611519 28894054 21613014 17177114 14289380 12324970 10999655 10114677 9517625
18062 9517625 9073588 8652905 8340117 8188196 8126177 8256445 8425725 8532384 8750625 9200150
18052 9200150 9962342 11158954 13015818 15955638 20935132 29542936 40650552 46033403
18044 46033403 45016005 41828808 38936384 41233736 50692168 66668298 84951420 105495690
18036 105495690 125500720 141838181 149740199 146704646 136846249 116989677 92482430
$$ packed form
18094I710785J719363K754182M659620Q002735J2757523J2583952L339355k010474
18086E3517041m252103j523874O608992J7829942K5275830J1146885q144371j6256702
18078H4201640j9110995j1239679l43746Q747763P257433m688126j0532886j3679885
18070D0611519j1717465p281040m435900k887734j964410j325315q84978n97052
18062I517625m44037m20683l12788j51921o2019J30268J69280J06659K18241M49525
18052I200150P62192J196612J856864K939820M979494Q607804J1107616N382851
18044D6033403j017398l187197k892424K297352R458432J5976130J8283122K0544270
18036A05495690K0005030J6337461P902018l035553r858397j9856572k4507247
$$ plain form
18029 92482430 70703406 53206426 42413039 37805926 38450275 43426344 47139115 44078194
18021 44078194 37408999 28998945 21694116 16824075 13714679 11687481 10339068 9431369
18013 9431369 8741142 8242996 7950714 7785260 7652551 7483287 7307715 7236132 7272531 7356158
18003 7356158 7537387 7857041 8442640 9417158 10951945 13655840 18662851 26808008 33554464
17994 33554464 33906128 31645513 28103169 27124364 31735794 43323742 56884558 58791841
17986 58791841 52305006 41997276 31927294 27358476 28484580 33247831 34696135 31079735
17978 31079735 25345871 18511079 13407283 10256995 8358695 7297490 6781752 6462865
17970 6462865 6094494 5733906 5474472 5331976 5254998 5133619 4973975 4852168 4737136 4637660
$$ packed form
18029I2482430k1779024j7496980j0793387m607113O44349M976069L712771l060921
18021D4078194o669195q410054p304829m870041l109396k027198j348413r07699
18013I431369o90227m98146k92282j65454j32709j69264j75572p1583L6399Q3627
18003G356158J81229L19654N85599R74518J534787K703895N007011Q145157O746456
17994C3554464L51664k260615l542344r78805M611430J1587948J3560816J907283
17986E8791841o486835j0307730j0069982m568818J126104M763251J448304l616400
17978C1079735n733864o834792n103796l150288j898300j061205n15738l18887
17970F462865l68371l60588k59434j42496p6978j21379j59644j21807j15032r9476
$$ plain form
17960 4637660 4528651 4423867 4368124 4376446 4509879 4747680 5057688 5469730 6046933 6837894
17950 6837894 7998905 9684119 12070304 15454838 20676350 29526128 45540527 71231107
17942 71231107 92002353 92050039 83622540 71302915 66605841 77475319 97329936 100738066
17934 100738066 88062306 68700821 47058597 32269241 23560627 18303036 15048860
17927 15048860 13013474 11712554 10801337 10002921 9243943 8598951 8180785 8029277 8080262
17918 8080262 8189467 8139292 7929680 7651701 7514474 7529068 7613662 7644987 7633698 7684428
17908 7684428 7912136 8391403 9056408 9785855 10729465 12082421 14094277 17020354 21131626
17899 21131626 26996929 35990983 51256511 78230851 116043762 145684993 155327752
$$ packed form
17960D637660j09009j04784n5743Q322J33433K37801L10008M12042N77203P90961
17950F837894J161011J685214K386185L384534N221512Q849778J6014399K5690580
17942G1231107K0771246M7686q427499j2319625m697074J0869478J9854617L408130
17934A00738066j2675760j9361485k1642224j4789356q708614n257591l254176
17927A5048860k035386j300920r11217p98416p58978o44992m18166j51508N0985
17918H080262J09205n0175k09612k77979j37227J4594Q4594L1325j1289N0730
17908G684428K27708M79267O65005P29447R43610J352956K011856K926077M111272
17899B1131626N865303Q994054J5265528K6974340L7812911K9641231R642759
$$ plain form
17892 155327752 143401428 126462291 118566896 130695309 152696395 163053444 149586500
17885 149586500 119733211 87179210 59947593 42852947 32689147 26300891 22031379
17878 22031379 19001064 16816530 15233653 14104291 13420195 13217599 13335881 13577255 13872832
17869 13872832 14170747 14423612 14778366 15399973 16524997 18154914 20446173 24101180 30397902
17860 30397902 40024680 50148468 57041726 59335935 56833492 53205136 52377027 57326638
17852 57326638 71054612 95981895 132497474 180718752 229476415 256240297 258197328
17845 258197328 234914870 207248090 197670247 221421701 279173011 334044362 349119446
17838 349119446 327143924 287367232 239328763 192927527 151876216 116958817 90387063
$$ packed form
17892A55327752j1926324j6939137p895395J2128413K2001086J0357049j3466944
17885A49586500k9853289l2554001k7231617j7094646j0163800o388256m269512
17878B2031379l030315k184534j582877j129362o84096k02596J18282K41374K95577
17869A3872832K97915K52865L54754O21607J125024J629917K291259L655007O296722
17860C0397902R626778J0123788O893258K294209k502443l628356q28109M949611
17852E7326638J3727974K4927283L6515579M8221278M8757663K6763882J957031
17845B58197328k3282458k7666780r577843K3751454N7751310N4871351J5075084
17838C49119446k1975522l9776692m8038469m6401236m1051311l4917399k6571754
$$ plain form
17831 90387063 73292277 64105064 61488247 65018443 72754723 78029053 75218359 66027910
17823 66027910 54085952 43027921 35221173 30320070 27261710 25231098 23727827 22427849
17815 22427849 21374934 20771225 20757371 21442423 22688492 24619548 27841880 33660941 43960322
17806 43960322 58539218 71349127 77834387 81650501 88614574 101867703 114742431
17799 114742431 117766946 111334838 102440226 100603976 116238424 152117632 186641124
17792 186641124 199142263 197476328 186274162 174401050 172503223 181323870 191527837
17785 191527837 183124683 157546723 126762352 96980301 73909093 57389786 45062100
17778 45062100 35804062 29334813 24915533 21860591 19756082 18408990 17830175 18370579
$$ packed form
17831I0387063j7094786r187213k616817L530196P736280N274330k810694r190449
17823F6027910j1941958j1058031p806748m901103l058360k030612j503271j299978
17815B2427849j052915o03709j3854O85052J246069J931056L222332N819061J0299381
17806D3960322J4578896J2809909O485260L816114O964073J3253129J2874728
17799A14742431L024515o432108q894612j836250J5634448L5879208L4523492
17792A86641124J2501139j665935j1202166j1873112j897827Q820647J0203967
17785A91527837q403154k5577960l0784371k9782051k3071208j6519307j2327686
17778D5062100r258038o469249m419280l054942k104509j347092n78815N40404
$$ plain form
17770 18370579 20354869 22819509 23386233 21427167 18121263 14566953 11809689 10046013
17762 10046013 8854398 7898146 7013663 6227524 5574613 5089450 4699633 4340051 3976959
17753 3976959 3659416 3361318 3095557 2883193 2693420 2513534 2358132 2214402 2070796
17744 2070796 1919644 1790389 1696180 1651623 1638397 1613384 1584637 1514149 1446090 1404369 1377194
17733 1377194 1355135 1340649 1306980 1268704 1215402 1161715 1114144 1063607 1003506 966857 949337
17722 949337 922134 895676 878909 878691 878396 872302 857079 820867 746448 699573 696550 678279 635695
17709 635695 614013 618153 615570 623046 605308 566323 553386 518294 506109 491030 482886 478514
17697 478514 477483 460871 446319 447873 451771 459328 472755 493542 514961 552159 585220 629401
$$ packed form
17770A8370579J984290K464640N66724j959066l305904l554310k757264j763676
17762A0046013j191615r56252q84483p86139o52911m85163l89817l59582l63092
17753C976959l17543k98098k65761k12364j89773j79886j55402j43730j43606
17744B070796j51152j29255r4209m4557j3226k5013k8747p0488o8059m1721k7175
17733A377194k2059j4486l3669l8276n3302n3687m7571n0537o0101l6649j7520
17722I49337k7203k6458j6767k18k95o094j5223l6212p4419m6875l023j8271m2584
17709F35695k1682M140k583P476j7738l8985j2937l5092j2185j5079q144m372
17697D78514j031j6612j4552J554L898P557J3427K0787K1419L7198L3061M4181
$$ plain form
17685 629401 629144 627754 642797 643854 643839 638787 614609 614442 613248 611031 613614 616310 609544 598708
17671 598708 577970 543268 516162 480658 445249 424434 426014 422360 431192 444759 450207 408017
17659 408017 344790 312872 286456 278441 273179 269803 295597 313056 307965 283396 235218 197716
17647 197716 197488 191120 190950 210709 237316 255013 272428 283585 275135 268281 273800 283223 314443
17634 314443 344966 360985 340806 322090 309848 307406 306059 319523 326657 332664 348613 361800
17622 361800 337909 320108 327918 348702 324468 302374 298557 284339 301591 304264 283795 251881
17610 251881 236660 233336 244052 287407 314056 296934 267508 247873 243620 226354 218938 216162
17598 216162 214580 213178 219180 209842 204711 215193 247744 255036 276845 292299 300383 305682 304625
$$ packed form
17685F29401k57j390J5043J057j5n052k4178j67j194k217K583K696o766j0836
17671E98708k0738l4702k7106l5504l5409k0815J580l654Q832J3567N448m2190
17659D08017o3227l1918k6416q015n262l376K5794J7459n091k4569m8178l7502
17647A97716k28o368j70J9759K6607J7697J7415J1157q450o854N519R423L1220
17634C14443L0523J6019k0179j8716j2242k442j347J3464P134O007J5949J3187
17622C61800k3891j7801P810K0784k4234k2094l817j4218J7252K673k0469l1914
17610B51881j5221l324J0716M3355K6649j7122k9426j9635m253j7266p416k776
17598B16162j582j402O002r338n131J0482L2551P292K1809J5454Q084N299j057
$$ plain form
17585 304625 314560 311262 323345 348035 370007 399429 442199 475359 508447 529838 519453 520518
17573 520518 549709 604880 702033 768744 773358 715459 650489 596359 588191 606081 623065 593793
17561 593793 573341 568468 538132 519424 509979 506139 499609 486689 481063 478661 473838 489237 476883
17548 476883 479574 486055 486222 482440 472906 457950 484432 509242 518793 527054 543951 570942 629114
17535 629114 710383 804093 899825 982745 1037852 1086433 1114144 1122173 1136017 1201163 1310426
17524 1310426 1473195 1590466 1590049 1500606 1420407 1345014 1316784 1331708 1360538 1401850 1440945
17513 1440945 1533089 1687821 1862033 2029172 2207521 2415486 2639806 2861169 3051842 3268825
17503 3268825 3503292 3738553 4045660 4484033 5014576 5652727 6424521 7360619 8570538
$$ packed form
17585C04625R935l298J2083K4690K1972K9422M2770L3160L3088K1391j0385J065
17573E20518K9191N5171R7153O6711M614n7899o4970n4130q168J7890J6984k9272
17561E93793k0452m873l0336j8708r445l840o530j2920n626k402m823J5399j2354
17548D76883K691O481J67l782r534j4956K6482K4810R551Q261J6897K6991N8172
17535F29114Q1269R3710R5732Q2920N5107M8581K7711Q029J3844O5146J09263
17524A310426J62769J17271m17q9443q0199p5393k8230J4924K8830M1312L9095
17513A440945R2144J54732J74212J67139J78349K07965K24320K21363J90673K16983
17503C268825K34467K35261L07107M38373N30543O38151P71794R36098J209919
$$ plain form
17494 8570538 10166315 12318343 15312398 19771453 26947156 39225716 59711367 86801500
17486 86801500 111621123 130098084 143421968 147828105 145804320 146247834 148511901 148224916
17478 148224916 146629475 140180464 122945083 98925413 74285213 52951312 37960876
17471 37960876 28701373 22909719 19032844 16270147 14157025 12462609 11147168 10164265
17463 10164265 9427399 8867546 8402847 7993999 7614472 7242660 6907498 6603159 6381159
17454 6381159 6271257 6256924 6301762 6305557 6276163 6228831 6206659 6253886 6352338 6534177 6850323
17443 6850323 7345843 8012695 8926516 10190870 12007490 14691154 18765851 25281447 36615180
17434 36615180 55630349 80290725 102017957 118140636 129798797 132968174 130711740
$$ packed form
17494H570538J595777K152028K994055M459055P175703J2278560K0485651K7090133
17486H6801500K4819623J8476961J3323884M406137k023785M43514K264067k86985
17478A48224916j595441o449011j7235381k4019670k4640200k1333901j4990436
17471C7960876r259503n791654l876875k762697k113122j694416j315441r82903
17463A0164265p36866n59853m64699m08848l79527l71812l35162l04339k22000
17454F381159j09902j4333M4838L795k9394m7332k2172M7227R8452J81839L16146
17443F850323M95520O66852R13821J264354J816620K683664M074697O515596J1333733
17434C6615180J9015169K4660376K1727232J6122679J1658161L169377k256434
$$ plain form
17427 130711740 130964994 132344394 131668680 130313480 124083037 108085695 86479259 64503317
17419 64503317 45753688 32790565 24821355 19764960 16317357 13840329 11981211 10526300
17411 10526300 9380579 8509235 7790474 7195281 6688588 6225245 5814128 5457631 5135043
17402 5135043 4784514 4418759 4091967 3781459 3451006 3139817 2846809 2585257 2357036
17393 2357036 2155556 1964907 1796044 1635304 1511960 1407890 1300066 1193909 1091485
17384 1091485 1015306 920536 835753 789216 741103 716529 691925 668949 666089 663467 657718 671155
17372 671155 725913 846668 1021748 1192514 1304010 1309287 1210010 1113953 1073881 1112739 1156671
17361 1156671 1155926 1076487 924853 765969 648659 567587 514791 485745 465680 452319 453077
$$ packed form
17427A30711740K53254J379400o75714j355200o230443j5997342k1606436k1975942
17419F4503317j8749629j2963123p969210n056395l447603k477028j859118j454911
17411A0526300j145721q71344p18761n95193n06693m63343m11117l56497l22588
17402E135043l50529l65755l26792l10508l30453l11189k93008k61552k28221
17393B357036k01480j90649j68863j60740j23344j04070j07824j06157j02424
17384A091485p6179r4770q4783m6537m8113k4574k4604k2976k860k622n749J3437
17372F71155N4758J20755J75080J70766J11496N277r9277r6057m0072L8858M3932
17361A156671p45p9439j51634j58884j17310q1072n2796k9046k0065j3361P58
$$ plain form
17350 453077 431676 438063 461337 476996 479322 550819 648163 759773 847312 895932 945095 965582
17338 965582 969915 969249 981666 957733 910630 866416 836822 865983 933779 997214 1026320 1065068
17326 1065068 1132935 1200954 1210652 1197263 1224002 1307173 1385170 1370650 1241687 1075966 928883
17315 928883 849599 837500 808089 738146 640126 543286 451845 397416 388479 359210 367904 370891
17303 370891 359516 372274 386512 363493 336029 311084 308162 317618 352041 429644 531320 605598
17291 605598 662302 722403 802859 895187 923369 877932 825334 767403 733878 744083 808031
17280 808031 841043 800340 718361 626826 591107 609067 689829 803498 901804 919590 845795
17269 845795 728040 621436 566861 572585 633019 691428 699176 655490 559518 453983 391857
$$ packed form
17350D53077k1401O387K3274J5659K326P1497R7344J11610Q7539M8620M9163K0487
17338I65582M333o66J2417k3933m7103m4214k9594K9161O7796O3435K9106L8748
17326A065068O7867O8019R698j3389K6739Q3171P7997j4520j28963j65721j47083
17315I28883p9284j2099k9411o9943r8020r6840r1441n4429q937k9269Q694K987
17303C70891j1375J2758J4238k3019k7464k4945k922R456L4423P7603J01676P4278
17291F05598N6704O0101Q0456R2328K8182m5437n2598n7931l3525J0205O3948
17280H08031L3012m0703q1979r1535l5719J7960Q0762J13669R8306J7786p3795
17269H45795j17755j06604n4575N724O0434N8409P748m3686r5972j05535o2126
$$ plain form
17258 391857 329232 258811 205830 183899 183238 147765 126604 124435 125622 110430 102187 112047 113286
17245 113286 97068 76781 61123 55746 61587 63831 55845 48180 43376 51473 55292 54869 60103 64939
17231 64939 66770 48842 66697 77826 72166 71814 70250 74050 75020 70913 71654 66158 66962 58543 68722
17216 68722 79836 64970 60369 73326 78620 69492 69317 64531 52625 55274 51325 46491 39984 27445
17202 27445 32602 44362 63714 67619 65976 66722 52010 57505 53304 67945 81887 88592 83095
17189 83095 73777 77735 76623 69556 56231 63621 48557 40452 34371 47572 63305 53118 44920
17176 44920 47603 46845 47829 41167 33992 3299 -12816 -16807 -23361 -22938 -14074 -17062 -10080 -13842 -34712
17161 -34712 -21153 -7083 6778 23288 47459 49849 38765 28573 8523 -8867 -6246 15226
$$ packed form
17258C91857o2625p0421n2981k1931o61l5473k1161k169J187j5192q243R860J239
17245A13286j6218k0287j5658n377N841K244p986p665m804Q097L819m23N234M836
17231F4939J831j7928J7855J1129n660l52j564L800R70m107P41n496Q04q419J0179
17216F8722J1114j4866m601J2957N294r128j75m786j1906K649l949m834o507j2539
17202B7445N157J1760J9352L905j643P46j4712N495m201J4641J3942O705n497
17189H3095r318L958j112p067j3325P390j5064q105o081J3201J5733j0187q198
17176D4920K683p58R84o662p175l0693j6115l991o554M23Q864k988O982l762k0870
17161c4712J3559J4070J3861J6510K4171K390j1084j0192k0050j7390K621K1472
$$ plain form
17149 15226 21971 32628 35777 33527 28210 26411 42896 37544 21770 10519 9470 31657 43410
17136 43410 42503 53426 58863 44070 17327 16075 26816 21104 25121 44923 45371 21633 14008
17123 14008 15050 -3398 -7450 -5413 -599 6093 -9127 -14211 -23715 -20814 -16018 -24223 -31824 -34901
17109 -34901 -33644 -30594 -32658 -30630 -19795 -19718 -25466 -22639 -23641 -43407 -58209 -42907 -41276 -32597
17095 -32597 -21386 -44521 -46712 -24036 -13895 -11917 -14927 -19725 -6765 -6547 -14136 -22196 -14125
17082 -14125 -7349 -10452 -10949 -8669 -10030 -7014 625 -1667 -12711 -19071 -20985 -3555 6371 -11471
17068 -11471 -17198 -32143 -33033 -39071 -24206 -13601 -17192 -22001 -21592 -18908 -22154 -13042 -19990 -30736
17054 -30736 -25090 -19730 -16348 -5473 -1908 -7693 -8609 4472 9612 -3097 -12316 -11264 -26663 -20962
$$ packed form
17149A5226O745J0657L149k250n317j799J6485n352j5774j1251j049K2187J1753
17136D3410r07J0923N437j4793k6743j252J0741n712M017J9802M48k3738p625
17123A4008J042j8448m052K037M814O692j5220n084r504K901M796q205p601l077
17109c4901J257L050k064K028J0835P7n748K827j002j9766j4802J5302J631Q679
17095c2597J1211k3135k191K2676J0141J978l010m798J2960K18p589q060Q071
17082a4125O776l103m97K280j361L016P639k292j1044o360j914J7430R926j7842
17068a1471n727j4945q90o038J4865J0605l591m809M09K684l246R112o948j0746
17054c0736N646N360L382J0875L565n785r16J3081N140j2709r219J052j5399N701
$$ plain form
17040 -20962 -17877 -14697 6189 9935 -3265 -18343 -19391 13150 19168 15870 19381 29873 13311
17027 13311 4992 -8494 -445 16298 12815 18264 27403 30529 26248 8911 4980 -2139 -21605
17014 -21605 -43049 -45462 -42890 -26574 -10024 -6807 2589 -2256 -14174 -16683 -21411 -16623 -23518
17001 -23518 -13982 -13361 -25095 -33933 -27297 -19831 -5572 -3800 -4095 4136 13589 12972 10867 3328 -2292
16986 -2292 -2382 -30 7877 3259 -11775 -18232 5052 5988 5463 23471 36045 44823 41470 43062 27157
16971 27157 32282 34328 43459 102386 171783 282221 414250 540289 657523 725269 761981
16960 761981 751042 747899 768330 773967 739027 685014 592178 478183 364214 258021 199761
16949 199761 166299 130947 87505 64187 66104 62333 55251 40695 17832 20984 18240 11807 6912
$$ packed form
17040b0962L085L180K0886L746j3200j5078j048L2541O018l298L511J0492j6562
17027A3311q319j3486Q049J6743l483N449R139L126m281j7337l931p119j9466
17014b1605k1444k413K572J6316J6550L217R396m845j1918k509m728M788o895
17001b3518R536O21j1734q838O636P466J4259J772k95Q231R453o17k105p539n620
16986b292r0K352P907m618j5034o457K3284R36n25J8008J2574Q778l353J592j5905
16971B7157N125K046R131N8927O9397J10438J32029J26039J17234O7746L6712
16960G61981j0939l143K0431N637l4940n4013r2836j13995j13969j06193n8260
16949A99761l3462l5352m3442k3318J917l771p082j4556k2863L152k744o433m895
$$ plain form
16936 6912 16558 28391 45384 46416 56606 42723 27724 19785 17902 10934 -7101 -4072 25202
16923 25202 26935 31252 46134 55704 59941 70575 72950 64613 87322 133666 210490 310638 423540
16910 423540 531841 613946 658521 676589 680468 691763 700787 708261 695908 646598 548693 434703
16898 434703 342121 245552 169154 114744 85782 66349 64609 52136 39411 41786 42073 26334
16886 26334 29660 49337 49291 32040 13885 -1570 1836 22315 29114 17691 17423 21509 19024 7949
16872 7949 -2440 270 15972 4213 -9780 -12434 -9230 -9653 11870 20382 6931 -20976 -29937
16859 -29937 -20016 -21000 -24755 -18134 -24951 -26058 -19270 -16553 -20299 -33163 -38535 -37473 -29686 -36433
16845 -36433 -31558 -26849 -18400 -17376 -26184 -25003 -31942 -37478 -19185 183 -5072 -12950 -3842 -483
$$ packed form
16936F912R646J1833J6993J032J0190j3883j4999p939j883o968j8035L029K9274
16923B5202J733M317J4882R570M237J0634K375q337K2709M6344P6824J00148J12902
16910D23540J08301Q2105M4575J8068L879J1295R024P474j2353m9310r7905j13990
16898D34703r2582r6569p6398n4410k8962j9433j740j2473j2725K375K87j5739
16886B6334L326J9677m6j7251j8155j5455L406K0479O799j1423k68M086k485j1075
16872G949j0389K710J5702j1759j3993k654L204m23K1523Q512j3451k7907q961
16859b9937R921r84l755O621o817j107O788K717l746j2864n372J062P787o747
16845c6433M875M709Q449J024q808J181o939n536J8293J9368n255p878R108L359
$$ plain form
16831 -483 -21901 -25040 -10392 10002 17992 6667 -8004 -8587 -5446 -17356 -9860 -19163 -20817 -13827
16817 -13827 -11606 -4356 -10505 -21244 -14687 -25349 -26021 -16375 -7831 -17485 -6224 15570 -8129
16804 -8129 -14668 -18591 -14773 11422 20831 14545 -4839 -4409 2690 2441 13038 -4934 -19311 -6760
16790 -6760 -4011 -13673 -22325 -13899 1191 10540 10462 4383 1783 -2193 -9721 -20219 -20845 -16457 -17687
16775 -17687 -11258 -26217 -27371 -21090 -13869 -11190 -26677 -26464 -12797 -13080 -17171 -11986 -9335 -12117
16761 -12117 -3015 11036 12129 1727 -10713 -20517 -10963 -8477 -4764 6080 4209 -3283 -16566
16748 -16566 -30267 -33712 -35142 -53264 -50882 -29104 -25751 -5523 5374 -1503 -13322 -15715 -16196
16735 -16196 -10995 -6300 -11475 -13411 -25587 -39860 -47920 -44936 -43158 -14903 5704 -10104 -12794
$$ packed form
16831d83k1418l139J4648K0394P990j1325j4671n83L141j1910P496r303j654O990
16817a3827K221P250o149j0739O557j0662o72R646Q544r654J1261K1794k3699
16804h129o539l923L818K6195R409o286j9384M30P099k49J0597j7972j4377J2551
16790f760K749r662q652Q426J5090R349p8o079k600l976p528j0498o26M388j230
16775a7687O429j4959j154O281P221K679j5487K13J3667k83m091N185K651k782
16761a2117R102J4051J093j0402j2440r804R554K486L713J0844j871p492j3283
16748a6566j3701l445j430j8122K382K1778L353K0228J0897o877j1819k393m81
16735a6196N201M695n175j936j2176j4273q060K984J778K8255K0607j5808k690
$$ plain form
16722 -12794 -8390 -35298 -43535 -40388 -26159 -8861 -29 -2394 -2332 -7500 -8545 -17936 -18469 -35928
16708 -35928 -20461 -4535 -13511 -43611 -58113 -51094 -44558 -33876 -24358 -19187 -29762 -37389 -26658
16695 -26658 -22411 -18786 -36957 -44847 -42802 -37028 -29077 -15679 -13829 -24183 -15564 -122 -16282
16682 -16282 -20114 2860 14627 25049 24177 13302 4424 -9360 -36662 -52018 -49887 -46025 -36400
16669 -36400 -43903 -35341 -29653 -22019 -29994 -48589 -49812 -28007 -21748 -39411 -47360 -48928 -33259
16656 -33259 -24375 -29278 -39312 -42979 -24853 -28223 -50671 -35873 -29925 -31203 -25601 -28187 -46759
16643 -46759 -51266 -32533 -27974 -33285 -34575 -37568 -40755 -51399 -25044 -15973 -19580 -15534 -21489 -33636
16629 -33636 -45553 -35249 -16332 -517 -7325 -32096 -30075 -42326 -42668 -29871 -38799 -37935 -19916
$$ packed form
16722a2794M404k6908q237L147J4229J7298Q832k365O2n168j045r391n33j7459
16708c5928J5467J5926q976l0100j4502P019O536J0682R518N171j0575p627J0731
16695b6658M247L625j8171p890K045N774P951J3398J850j0354Q619J5442j6160
16682a6282l832K2974J1767J0422q72j0875q878j3784k7302j5356K131L862R625
16669c6400p503Q562N688P634p975j8595j223K1805O259j7663p949j568J5669
16656c3259Q884m903j0034l667J8126l370k2448J4798N948j278N602k586j8572
16643d6759m507J8733M559n311j290k993l187j0644K6355R071l607M046n955j2147
16629c3636j1917J0304J8917J5815o808k4771K021j2251l42J2797q928Q64J8019
$$ plain form
16616 -19916 -17457 -30576 -41944 -34003 -25119 -11601 -7460 -11246 -20510 -20742 -16130 -27347 -29728 -33749
16602 -33749 -17789 -13060 -14387 -7583 -10226 -27464 -38792 -35938 -31606 -16771 -12771 -16834 -25824
16589 -25824 -29798 -35594 -38559 -37831 -21451 -13337 -32182 -40761 -37442 -19316 5542 14238 1655
16576 1655 -9582 -2159 -4685 -4282 3962 -12034 -22674 -31919 -43908 -42296 -36258 -29165 -34575 -30700
16562 -30700 -12284 -12770 -20140 -32622 -41743 -34465 -40616 -44899 -42908 -35209 -33577 -36340 -24712 -36029
16548 -36029 -21656 -22812 -30996 -41492 -48060 -41408 -31198 -40423 -52514 -29346 -18115 -21217 -30947
16535 -30947 -38691 -43838 -57730 -62398 -38120 -11893 -13732 -17979 -30942 -31903 -25858 -24342 -15203 -8219
16521 -8219 1362 -11997 -26824 -28127 -19012 -37392 -31136 -24470 -30475 -37486 -36468 -35257 -33426 -17886
$$ packed form
16616a9916K459j3119j1368P941Q884J3518M141l786r264k32M612j1217k381m021
16602c3749J5960M729j327O804k643j7238j1328K854M332J4835M000m063q990
16589b5824l974n796k965P28J6380Q114j8845q579L319J8126K4858Q696j2583
16576A655j1237P423k526M03Q244j5996j0640r245j1989J612O038P093n410L875
16562c0700J8416m86p370j2482r121P278o151m283J991P699J632k763J1628j1317
16548c6029J4373j156q184j0496o568O652J0210r225j2091K3168J1231l102r730
16535c0947p744n147j3892m668K4278K6227j839m247j2963r61O045J516R139O984
16521h219R581j3359j4827j303R115j8380O256O666o005p011J018J211J831J5540
$$ plain form
16507 -17886 -12918 -29607 -38514 -37407 -17689 -9494 -23597 -29772 -19240 -18502 -28274 -18924 -20189 -20490
16493 -20490 -28203 -16874 -8328 -10504 -26179 -28044 -29638 -35658 -45121 -48417 -38146 -32941 -15964
16480 -15964 -12570 -21293 -13701 -5947 4599 -2935 -16778 -29202 -38328 -40894 -33774 -35654 -31616 -26118
16466 -26118 -20429 -17782 -32882 -33610 -32964 -44033 -38678 -41003 -38523 -12529 -15747 -8977 -21258 -32394
16452 -32394 -31058 -42169 -32686 -17970 -30278 -13625 2185 22010 34244 26966 1590 -18730
16440 -18730 -35111 -37880 -43767 -29576 -11262 -6606 -10240 -21510 -28853 -31003 -20979 -19092 -15537
16427 -15537 -14588 -17747 -17191 -23830 -32653 -22962 -14409 -22308 -35346 -49700 -50506 -27499 -25826 -34582
16413 -34582 -34419 -29117 -41226 -55145 -44099 -26662 -7029 -5555 -20230 -14221 510 15671 20642
$$ packed form
16507a7886M968j6689q907J107J9718Q195j4103o175J0532P38r772R350j265l01
16493b0490p713J1329Q546k176j5675j865j594o020r463l296J0271N205J6977
16480a5964L394q723P592P754J0546p534j3843j2424r126k566P120j880M038N498
16466b6118N689K647j5100p28O46j1069N355k325K480K5994l218O770j2281j1136
16452c2394J336j1111R483J4716j2308J6653J5810J9825J2234p278k5376k0320
16440a8730j6381k769n887J4191J8314M656l634j1270p343k150J0024J887L555
16427a5537R49l159N56o639q823R691Q553p899j3038j4354q06K3007J673q756
16413c4582J63N302j2109j3919J1046J7437J9633J474j4675O009J4731J5161M971
$$ plain form
16400 20642 12316 9341 14505 5429 2804 14537 -535 611 -21567 -43148 -31117 -17545 -18052
16387 -18052 -25808 -44182 -33845 -37488 -29777 -18947 -10824 -16650 -15599 -19329 -21270 -25539 -24251 -15844
16373 -15844 -16279 -25461 -5063 2230 8040 2411 -9734 3202 7452 -11203 -33975 -34352 -28016 -36409
16359 -36409 -48793 -40156 -15187 -452 -10330 -19029 -11459 -7257 -10913 -11817 -24151 -39247 -36737
16346 -36737 -38158 -32970 -45723 -58937 -60871 -34357 -22321 -40283 -47857 -34959 -26127 -14225 -27106
16333 -27106 -28475 -26723 -21939 -25660 -25695 -15798 -13914 -26871 -36184 -47680 -52770 -72171 -67210 -44985
16319 -44985 -32518 -25418 -2902 -11468 -27807 -15944 -4321 -9858 -8166 -9030 -14752 -35596 -36848
16306 -36848 -37120 -37605 -43831 -55319 -56249 -47763 -46609 -35679 -33321 -16419 -12722 -2636 -4854 -26725
$$ packed form
16400B0642q326k975N164r076k625J1733j5072J146k2178k1581J2031J3572n07
16387a8052p756j8374J0337l643P711J0830Q123n826J051l730j941m269J288Q407
16373a5844m35r182K0398P293N810n629j2145J2936M250j8655k2772l77O336q393
16359c6409j2384Q637K4969J4735r878q699P570M202l656r04j2334j5096K510
16346c6737j421N188j2753j3214j934K6514J2036j7962p574J2898Q832J1902j2881
16333b7106j369J752M784l721l5R897J884j2957r313j1496n090j9401M961K2225
16319d4985J2467P100K2516q566j6339J1863J1623n537J692q64n722k0844j252
16306c6848k72m85o226j1488r30Q486J154J0930K358J6902L697J0086k218k1871
$$ plain form
16292 -26725 -43169 -30680 -29902 -24473 -25815 -26583 -25441 -29138 -38779 -49372 -53832 -57703 -45681 -43747
16278 -43747 -26278 -23135 -30928 -42571 -24164 -34776 -45422 -28360 -17842 -22715 -12211 -11106
16266 -11106 -9755 -372 3742 -13820 -40412 -30092 -14982 -7044 -8438 -18958 -31752 -19347 -2259
16253 -2259 8931 -381 -22735 -28424 -20381 -18779 -31850 -25840 2894 5659 4203 7327 5601 -13075
16239 -13075 -33267 -29048 -15314 -9834 -2922 -1001 1385 10957 20623 8306 -1107 -3773 -7762 -14317
16225 -14317 -12093 -13541 -18506 -9502 -24661 -29552 -41758 -37098 -14591 -4459 -17755 -23893 -27235
16212 -27235 -14008 9735 25051 20364 4577 -10317 -5871 -3134 -283 -15420 -25029 -27843 -36864
16199 -36864 -39276 -31600 -27115 -26636 -27067 -25726 -28029 -44230 -57011 -43975 -28525 -21401 -13288 -11899
$$ packed form
16292b6725j6444J2489P78N429j342p68J142l697r641j0593m460l871J2022J934
16278d3747J7469L143p793j1643J8407j0612j0646J7062J0518m873J0504J105
16266a1106J351R383M114j7562k6592J0320J5110P938j394j0520j2794J2405J7088
16253b259J1190r312k2354n689Q043J602j3071O010K8734K765j456L124j726j8676
16239a3075k0192M219J3734N480O912J921K386R572R666j2317r413k666l989o555
16225a4317K224j448m965R004j5159m891j2206M660K2507J0132j3296o138l342
16212b7235J3227K3743J5316m687j5787j4894M446K737K851j5137r609k814r021
16199c6864k412P676M485M79m31J341k303j6201j2781J3036J5450P124Q113J389
$$ plain form
16185 -11899 -20601 -17076 -3365 17254 16137 -17568 -18532 -26618 -36377 -37043 -47816 -26392 -28807 -23330
16171 -23330 -9378 -2109 7492 -6480 -13667 -10219 5834 4761 -7484 -19713 -20602 -19221 -34901
16158 -34901 -36245 -33175 -36183 -35783 -19755 7818 11004 6562 -6516 -15136 -9535 -15373 -25947 -20625
16144 -20625 -1658 3225 17845 17104 116 -17318 -20194 -10756 -9410 -19073 -26319 -43885 -49687
16131 -49687 -22296 -10461 -12163 -1137 17081 6030 -849 -534 399 14193 9019 -10443 -23956
16118 -23956 -30838 -31942 -14491 -12391 -19000 -12018 -21248 -24365 -24317 -20711 -27604 -22388 -17165 -23158 -27945
16103 -27945 -36980 -45098 -36389 -18317 -3660 -4000 4664 8505 15282 16001 -373 -25472 -23128 -16733
16089 -16733 -13588 -10424 -12369 -13930 -11969 -9337 -6967 -10448 -5494 8982 651 -10414 -22366 -28190
$$ packed form
16185a1899q702L525J3711K0619j117l3705r64q086r759o66j0773K1424k415N477
16171b3330J3952P269R601j3972p187L448J6053j073j2245j2229q89J381j5680
16158c4901j344L070l008M00J6028K7573L186m442j3078q620N601n838j0574N322
16144b0625J8967M883J4620p41j6988j7434k876R438J346r663p246j7566n802
16131d9687K7391J1835j702J1026J8218j1051o879L15R33J3794n174j9462j3513
16118b3956o882j104J7451K100o609O982r230l117M8L606o893N216N223n993m787
16103b7945r035q118Q709J8072J4657l40Q664L841O777P19j6374k5099K344O395
16089a6733L145L164j945j561J961K632K370l481M954J4476q331j1065j1952n824
$$ plain form
16075 -28190 -32433 -40042 -37769 -43241 -32479 -33388 -27260 -26210 -27321 -22950 -19112 -8443 -331 -14987
16061 -14987 -15582 -5144 -10866 -11148 4878 3896 -9447 862 13428 21950 20414 22234 3423 -3893
16047 -3893 12636 15380 2945 -11917 -6991 -10284 -14384 -23293 -13226 -13895 -11210 5548 24046
16034 24046 14910 14087 4155 -10878 -14319 -16326 -33155 -53293 -36316 -16078 -7799 -20958 -28624
16021 -28624 -8740 -15418 -10630 -1238 -8204 -4061 284 -9191 -7632 -8368 -15286 -18390 -11971 1976
16007 1976 -2332 7868 20103 5493 5220 5742 -1040 -18087 -32272 -31711 -23304 -34247 -27073 -29659
15993 -29659 -27696 -13761 -2364 -17588 -690 5817 -982 12415 11508 937 -12402 -13048 -13852
15980 -13852 -1921 -9652 -23010 -396 13595 -16898 -34144 -39824 -21098 9483 8861 2996 -12300
$$ packed form
16075b8190m243p609K273n472J0762r09O128J050j111M371L838J0669Q112j4656
16061a4987n95J0438n722k82J6026r82j3343J0309J2566Q522j536J820j8811p316
16047c893J6529K744j2435j4862M926l293m100q909J0067o69K685J6758J8498
16034B4046r136q23r932j5033l441k007j6829k0138J6977K0238Q279j3159p666
16021b8624J9884o678M788R392o966M143M345r475J559p36o918l104O419J3947
16007A976m308J0200J2235j4610k73N22o782j7047j4185N61Q407j0943P174k586
15993b9659J963J3935J1397j5224J6898O507o799J3397r07j0571j3339o46q04
15980a3852J1931p731j3358K2614J3991l0493j7246n680J8726L0581o22n865j5296
$$ plain form
15967 -12300 -8486 -1947 9912 10493 1946 -5227 -290 8831 11350 1838 -12489 -9085 -15615 -29286
15953 -29286 -24346 -34588 -52135 -31598 -4028 350 11611 28202 21333 5614 9567 11933 -4467
15940 -4467 18529 34758 38334 14709 9685 11189 -17646 -32461 -9241 -6 1453 -2594 6236
15927 6236 1663 7933 12772 24251 33615 30703 24001 19469 25070 34949 17742 14738 21464 26713
15913 26713 28184 27578 32395 28046 14000 -6981 -5457 8636 20981 30017 19518 9511 574
15900 574 -1777 1813 -13043 -20579 -36678 -28561 -25037 -17821 -4529 -12580 -13113 -11763 38 16278
15886 16278 36565 31347 32937 23290 11678 8185 11685 18015 30688 40543 28498 34542 36860
15873 36860 19758 4419 6657 23213 6522 -20816 -33746 -38724 -23932 -3932 -3626 4520 11461
$$ packed form
15967a2300L814O539J1859N81q547p173M937R121K519r512j4327L404o530j3671
15953b9286M940j0242j7547K0537K7570M378J1261J6591o869j5719L953K366j6400
15940d467K2996J6229L576k3625n024J504k8835j4815K3220R235J459m047Q830
15927F236m573O270M839J1479R364k912o702m532N601R879j7207l004O726N249
15913B6713J471o06M817m349j4046k0981J524J4093J2345R036j0499j0007q937
15900E74k351L590j4856p536j6099Q117L524P216J3292q051n33J350J1801J6240
15886A6278K0287n218J590r647j1612l493L500O330J2673R855j2045O044K318
15873C6860j7102j5339K238J6556j6691k7338j2930m978J4792K0000L06Q146O941
$$ plain form
15860 11461 11107 11455 24430 18577 16751 9155 12293 20340 18741 6031 11264 10728 17650 19442 20416
15845 20416 28187 25370 14179 4025 13783 10137 15514 25082 18519 2776 -11822 -1467 1620
15832 1620 -6224 -16119 -19360 -23593 295 15301 9964 11336 9973 5510 7475 14640 20069 17316
15818 17316 8735 -3507 -2856 7823 -3161 4829 10000 23608 23902 14454 1 5574 20284
15805 20284 35265 46173 48058 40538 27612 18552 10991 -2719 11827 9945 16321 25980 40478
15792 40478 38196 44451 53226 48312 46140 40094 16109 15434 11015 12665 10126 19603 8843 4195
15778 4195 370 -2659 -7615 10901 22369 35816 49698 60888 48919 38624 37768 45437 36759
15765 36759 21028 13304 7405 24578 32443 22651 14627 13304 -7832 -11500 5992 18576 9382
$$ packed form
15860A1461l54L48J2975n853j826p596L138Q047j599j2710N233n36O922J792R74
15845B0416P771k817j1191j0154R758l646N377R568o563j5743j4598J0355L087
15832A620p844r895l241m233K3888J5006n337J372j363m463J965P165N429k753
15818A7316q581j2242O51J0679j0984P990N171J3608K94r448j4453N573J4710
15805B0284J4981J0908J885p520j2926r060p561j3710J4546j882O376R659J4498
15792D0478k282O255Q775m914k172o046k3985o75m419J650k539R477j0760m648
15778D195l825l029m956J8516J1468J3447J3882J1190j1969j0295q56P669q678
15765C6759j5731p724n899J7173P865r792q024j323k1136l668J7492J2584r194
$$ plain form
15752 9382 2107 7377 3638 4658 6472 4995 -9256 -15966 -8461 -7264 -18395 -18855 -3366 14357
15738 14357 11424 5930 11127 20103 11558 16084 26073 25731 17103 5761 10247 85 -4554 167
15724 167 19338 8829 -7237 -14911 -20133 -13341 3097 8840 5606 -13694 -11760 -20778 3685
15711 3685 10123 3946 6622 -1003 13563 23709 15843 4464 12991 17320 10968 10457 3539 3085
15697 3085 -10259 -25884 -8518 13848 593 -10285 12117 30017 41638 36448 15202 9434
15685 9434 1680 -10202 8109 20179 6777 -18594 -7940 23195 29878 19755 11909 -1816
15673 -1816 -8862 -8978 996 2448 904 10158 -2528 -7409 6619 16421 27179 19770 24852 14522
15659 14522 12795 20123 12960 4700 -9578 -5517 -467 -3098 -18499 -16687 -14188 -14431 -29070 -18487
$$ packed form
15752I382p275N270l739J020J814j477j4251o710P505J197j1131m60J5489J7723
15738A4357k933n494N197Q976q545M526R989l42q628j1342M486j0162m639M721
15724A67J9171j0509j6066p674n222O792J6438N743l234j9300J934r018K4463
15711C685O438o177K676p625J4566J0146p866j1379Q527M329o352n11o918m54
15697C085j3344j5625J7366K2366j3255j0878K2402J7900J1621n190k1246n768
15685I434p754j1882J8311J2070j3402k5371J0654L1135O683j0123p846j3725
15673a816p046j16R974J452j544R254j2686m881J4028R802J0758p409N082j0330
15659A4522j727P328p163q260j4278M061N050k631j5401J812K499k43j4639J0583
$$ plain form
15645 -18487 6241 17820 12827 9227 14426 29991 30611 10854 -867 -22116 -32065 -4230 13697
15632 13697 14345 18449 2034 3215 5095 9953 2044 2464 -4590 -8932 -11479 -7412 699 16685
15618 16685 23253 18162 17514 28109 24226 25345 17247 5754 4449 -1870 3462 1880 -6690 -16537
15604 -16537 -10038 -3322 6065 1193 -1675 1208 -9825 -13116 -17819 -11628 7347 28038 25381 7121
15590 7121 -6724 -25686 -37535 -20734 -2890 -4588 -14762 -11382 -11497 -4120 -15131 -20517 -28361
15577 -28361 -31472 -48768 -48718 -27454 -18320 -23146 -24642 -10894 -8924 -17221 -6595 -7063 -8470 -30640
15563 -30640 -41580 -19495 -1519 -1885 -11605 -7259 -18157 -19058 -11864 -6130 -13498 -18344 -16156 -10641
15549 -10641 -20142 -2325 304 -2845 -314 4543 -611 -7598 -20943 -10321 -11236 -132 16326
$$ packed form
15645a8487K4728J1579m993l600N199J5565O20j9757j1721k1249r949K7835J7927
15632A3697O48M104j6415J181J880M858p909M20p054m342k547M067Q111J5986
15618A6685O568n091o48J0595l883J119q098j1493j305o319N332j582q570r847
15604a6537O499O716R387m872k868K883j1033l291m703O191J8975K0691k657j8260
15590G121j3845j8962j1849J6801J7844j698j0174L380j15P377j1011n386p844
15577b8361l111j7296N0K1264R134m826j496J3748J970q297J0626m68j407k2170
15563c0640j0940K2085J7976l66r720M346j0898r01P194N734p368m846K188N515
15549a0641r501J7817K629l149K531M857n154o987j3345J0622r15J1104J6458
$$ plain form
15536 16326 27366 15408 607 -9448 -2471 -6878 -22809 -19238 -14814 -16836 -9314 -6874 -14570
15523 -14570 -18005 -16166 -17845 -13460 -2355 3338 -6025 -16851 -14228 -5476 3711 -13558 -14257 -13722
15509 -13722 -12502 -12257 10731 26371 29069 27464 21827 12174 8020 12347 -256 -4765 -6288 1134
15495 1134 -7573 -27745 -25091 -3089 -608 -14052 -4763 4039 4915 -11238 -14844 821 -4405 -13686
15481 -13686 -8495 -16806 -21569 -25473 -21725 -5710 6095 -960 -752 -4032 6490 3747 -8975 -3796
15467 -3796 2023 -11135 -20358 -14304 -15839 -4374 18296 12940 -5985 8623 13224 -3058 -6305
15454 -6305 2291 5390 13025 6439 -17945 -5167 5300 11460 21517 23715 9912 -11883 -23188
15441 -23188 -20829 -32558 -24294 -3325 5503 -7408 4464 16153 26137 27966 31568 7415 -2417
$$ packed form
15536A6326J1040j1958j4801j0055O977m407j5931L571M424k022P522K440p696
15523a4570l435J839j679M385J1105N693r363j0826K623Q752R187j7269o99N35
15509a3722J220K45K2988J5640K698j605n637r653m154M327j2603m509j523P422
15495A134q707k0172K654K2002K481j3444R289Q802Q76j6153l606J5665n226r281
15481a3686N191q311m763l904L748J6015J1805p055K08l280J0522k743j2722N179
15467c796N819j3158r223O054j535J1465K2670n356j8925J4608M601j6282l247
15454f305Q596L099P635o586k4384J2778J0467O160J0057K198j3803k1795j1305
15441b3188K359j1729Q264K0969Q828j2911J1872J1689R984J829L602k4153r832
$$ plain form
15428 -2417 4093 -12392 -39354 -24995 -19039 -24332 -20637 -30522 -27665 -17124 -12616 -5003 -6045 -12413
15414 -12413 -23449 8286 16617 11510 3540 -7991 -14265 3298 7083 1737 -9144 -11953 -3260
15401 -3260 -6399 4885 4685 -14813 -22461 -19627 -1946 -13992 -10729 689 11330 16216 12473
15388 12473 3432 -2575 5363 -3721 -826 17660 27068 14843 35382 45720 32891 24152 21799
15375 21799 454 -17607 -22253 -8948 -14404 -9870 -13199 -10449 -10985 -2860 1959 12045 11760 4232
15361 4232 -15827 14704 9495 9544 -6197 -22744 -27957 -35432 -17212 -6739 -8817 -11170 -15226 -12464
15347 -12464 -22505 -6129 5852 10401 -1461 -1193 16677 4715 -18935 -13891 -5617 -5876 -16165
15334 -16165 -4459 -10991 -5487 -14389 -17603 -16676 -23861 -8920 -4472 -4800 3862 11328 -15626 -33697
$$ packed form
15428b417O510j6485k6962J4359N956n293L695r885K857J0541M508P613j042o368
15414a2413j1036L1735Q331n107p970j1531o274J7563L785n346j0881k809Q693
15401c260l139J1284k00j9498p648K834J7681j2046L263J1418J0641M886l743
15388A2473r041o007P938r084K895J8486R408j2225K0539J0338j2829q739k353
15375B1799k1345j8061m646J3305n456M534l329K750n36Q125M819J0086k85p528
15361D232k0059L0531n209M9j5741j6547n213p475J8220J0473k078k353m056K762
15347a2464j0041J6376J1981M549j1862K68J7870j1962k3650N044Q274k59j0289
15334a6165J1706o532N504q902l214R27p185J4941M448l28Q662P466k6954j8071
$$ plain form
15320 -33697 -32736 -14697 6871 -5304 -1879 7816 18099 3428 -2121 -11991 -28868 -48383 -42871
15307 -42871 -38364 -28356 -19322 -5774 4458 23446 25205 18937 13286 -7195 -19274 -38856 -44629
15294 -44629 -24489 -21322 -31258 -25227 -10756 6749 -6904 -25133 -28763 -29278 -34908 -38002 -22402
15281 -22402 -19146 -32927 -31945 -9094 3193 10049 6522 16202 18733 15797 10302 975 -6570 -962
15267 -962 -727 -3627 3503 2624 6692 12559 3398 16756 12078 1484 5172 -1780 3624 10727 20066
15252 20066 35655 54691 31965 1368 -1945 -3982 2931 697 6227 -275 5518 340 -7143
15239 -7143 -5068 10359 20734 9557 -3782 -4033 -2734 -597 6061 -1799 10599 8779 -13815
15226 -13815 -15906 -16362 -8932 -11279 -10745 -14322 -25773 -32381 -30711 -20887 -6840 -5079 -19794 -28619
$$ packed form
15320c3697R61J8039K1568j2175L425R695J0283j4671n549r870j6877j9515N512
15307d2871M507J0008R034J3548J0232J8988J759o268n651k0481j2079j9582n773
15294d4629K0140L167r936O031J4471J7505j3653j8229l630n15n630l094J5600
15281b2402L256j3781R82K2851J2287O856l527R680K531k936n495r327p545N608
15267i62K35k900P130q79M068N867r161J3358m678j0594L688o952N404P103R339
15252B0066J5589J9036k2726l0597l313k037O913k234N530o502N793n178p483
15239g143K075J5427J0375j1177j3339k51J299K137O658p860J2398j820k2594
15226a3815k091m56P430k347N34l577j1451o608J670R824J4047J761j4715q825
$$ plain form
15212 -28619 -36000 -24795 -23621 -26845 -24210 -36881 -18855 11265 17358 2868 3333 1531 -6178
15199 -6178 -2160 -6548 -2000 -163 -24159 -40545 -37837 -37584 -33573 -34469 -28463 -10696 -14359 8250
15185 8250 -992 -18968 -26482 -38267 -36713 -6167 -11774 -17972 8912 28252 24857 13462 3017
15172 3017 -10374 -12782 -12387 -5884 -3510 -9527 -5267 17514 19554 17577 13357 15066 11444 -2261
15158 -2261 4114 10196 -4824 -635 -3015 -7935 6384 30420 31274 24401 43788 43221 19494 -4821
15144 -4821 5135 9387 2130 6789 15984 4600 -5554 3643 -5189 -12372 -909 8214 -9690 -23566
15130 -23566 -25261 -14876 -8333 -8374 -20791 -22171 -11719 -11035 5710 -3716 738 -592 -14520 -19442
15116 -19442 -21674 -11718 -8802 3015 16373 2214 5126 14277 9812 30861 24389 24812 22926 4121
$$ packed form
15212b8619p381J1205J174l224K635j2671J8026L0120O093j4490M65j802p709
15199f178M018m388M548J837k3996j6386K708K53M011q96O006J7767l663K2609
15185H250r242j7976p514j1785J554L0546n607o198K6884J9340l395j1395j0445
15172C017j3391k408L95O503K374o017M260K2781K040j977m220J709l622j3705
15158b261O375O082j5020M189k380m920J4319K4036Q54o873J9387n67k3727k4315
15144d821R956M252p257M659R195j1384j0154R197q832p183J1463R123j7904j3876
15130b3566j695J0385O543m1j2417j380J0452O84J6745r426M454j330j3928m922
15116a9442k232R956K916J1817J3358j4159K912R151m465K1049o472M23j886j8805
$$ plain form
15102 4121 -4900 -16879 -12828 -10412 -7876 -17490 -32998 -29475 -13718 2862 15507 19177 8855
15089 8855 -7158 -4872 -23210 -34485 -15565 -4366 -15578 -9359 -19608 -33674 -30141 -18210
15077 -18210 -4970 -6827 -16051 1217 3004 626 -4958 -12838 -21075 -17233 -14788 3108 7779 2793
15063 2793 5063 8490 -1577 917 4292 -6687 -9430 -15450 -6871 -18729 -30644 -16805 8197
15050 8197 7073 -20385 -32671 -39727 -21294 -16528 -16012 -13135 -14928 5 20636 -3556 -24724
15037 -24724 -19850 -2715 1372 -4310 864 16718 4599 -1902 13848 15137 20184 22758 12531
15024 12531 -2406 -18797 -16254 -14163 -3981 13027 9391 3437 23078 18818 13180 16707 12850
15011 12850 3751 -3953 -13766 -20368 -16104 8388 13258 18706 22274 28014 33929 41538 55987 50931
$$ packed form
15102D121r021j1979M051K416K536r614j5508L523J5757J6580J2645L670j0322
15089H855j6013K286j8338j1275J8920J1199j1212O219j0249j4066L533J1931
15077a8210J3240j857r224J7268J787k378n584p880q237L842K445J7896M671m986
15063B793K270L427j0067K494L375j0979k743o020Q579j1858j1915J3839K5002
15050H197j124k7458j2286p056J8433M766N16K877j793J4933K0631k4192k1168
15037b4724M874J7135M087n682N174J5854j2119o501J5750J289N047K574j0227
15024A2531j4937j6391K543K091J0182J7008l636n954J9641m260n638L527l857
15011A2850r099p704r813o602M264K4492M870N448L568N740N915P609J4449n056
$$ plain form
14997 50931 41779 39260 45165 53607 48061 77271 117697 150326 180304 212730 278087 366492 497301
14984 497301 737814 1166358 2023648 3822156 6328790 6745873 5757768 4232746 2513861
14975 2513861 1510023 1014418 744116 575339 460334 366398 294128 238703 191654 166847
14965 166847 147276 122231 99878 93863 89423 83169 80356 60434 44892 47306 59103 64603 58989
14952 58989 30196 20235 23175 21012 22006 18204 4573 -3204 4163 2377 -27049 -38751 -13171
14939 -13171 -1280 -15617 1199 16320 -707 -23562 -20437 -11326 -522 -6471 -17858 -31822
14927 -31822 -14983 11788 9903 11590 6936 8638 7777 -3510 -1419 -7308 8047 13972 -6240
14914 -6240 -6049 -1637 -9485 -8536 -8825 -13021 -19784 -13544 -4552 -10979 -7725 -3110 -5125 -26832 -17359
$$ packed form
14997E0931r152k519N905Q442n546K9210M0426L2629K9978L2426O5357Q8405J30809
14984D97301K40513M28544Q57290J798508K506634M17083r88105j525022j718885
14975B513861j003838m95605k70302j68777j15005r3936p2270n5425m7049k4807
14965A66847j9571k5045k2353o015m440o254k813j9922j5542K414J1797N500n614
14952E8989k8793r961K940k163R94l802j3631p777P367j786k9426j1702K5580
14939a3171J1891j4337J6816J5121j7027k2855L125R111J0804n949j1387j3964
14927c1822J6839K6771j885J687m654J702q61j1287K091n889J5355N925k0212
14914f240J91M412p848R49k89m196o763O240Q992o427L254M615k015k1707R473
$$ plain form
14899 -17359 15395 3498 -23770 -28752 -8600 -4921 6922 19460 41874 30440 11237 4440
14887 4440 -13565 2314 5543 8136 10606 -257 -15757 -16645 -13858 -2798 3087 -7482 -14975
14874 -14975 -11 18783 20522 14253 -559 -6427 -14838 -17658 -18644 -9226 -15486 -15060 6099 -800
14860 -800 -24389 -24675 -4044 8199 12449 -4976 -16862 -18452 -22424 -38898 -61227 -63438 -52447
14847 -52447 -38935 -22240 -12092 8163 16463 12144 -19289 -37181 -23306 -13286 -8915 -9712 -8419
14834 -8419 -14897 -16094 -12917 -3526 4728 9362 25223 13247 -10595 -17437 2131 7576 26771
14821 26771 26062 18541 4662 -488 -9315 -898 2925 7333 563 14353 21897 21641 11084 8661
14807 8661 20375 34479 16599 6724 11068 -3496 -8703 -177 3991 10061 19366 18646 9919 7213
$$ packed form
14899a7359L2754j1897k7268m982K0152L679J1843J2538K2414j1434j9203o797
14887D440j8005J5879L229K593K470j0863j5500q88K787J1060N885j0569p493
14874a4975J4964J8794J739o269j4812n868q411k820r86R418o260M26K1159o899
14860h00k3589k86K0631J2243M250j7425j1886j590l972j6474k2329k211J0991
14847e2447J3512J6695J0148K0255Q300m319l1433j7892J3875J0020M371p97J293
14834h419o478j197L177R391Q254M634J5861j1976k3842o842J9568N445J9195
14821B6771p09p521j3879n150q827Q417L823M408o770J3790P544k56j0557k423
14807H661J1714J4104j7880r875M344j4564n207Q526M168O070R305p20q727k706
$$ plain form
14793 7213 -13721 -23772 -20724 -29815 -39493 -36295 -23701 -17582 -9738 10517 24356 28335 37986
14780 37986 38654 27263 23652 32184 26449 15882 9053 2005 17855 21835 35847 30088 15682
14767 15682 16879 26752 19027 6289 13615 14425 6942 -2947 11972 4897 -11842 -18083 -3451 3788
14753 3788 2844 4570 6921 -277 -3017 -6881 12416 11626 2419 6834 5195 12216 912 -6782 4886
14738 4886 2851 -316 2531 -2795 -13956 -720 1346 1071 -15843 -36197 -24993 -12348 3894
14725 3894 12827 13214 1843 8656 18632 11527 -13112 -29748 -27164 -27128 -8605 -4036 5936 -12360
14711 -12360 -13542 -1395 5456 16352 11260 -306 179 13119 6455 4737 9509 8256 19369
14698 19369 612 -21548 -38187 -30861 -13438 -7678 705 19029 13095 4 6362 9323 -1570
$$ packed form
14793G213k0934j0051L048r091r678L198J2594O119P844K0255J3839L979R651
14780C7986O68j1391l611Q532n735j0567o829p048J5850L980J4012n759j4406
14767A5682J197R873p725j2738P326Q10p483r889J4919p075j6739o241J4632P239
14753C788r44J726K351p198k740l864J9297p90r207M415j639P021j1304p694J1668
14738D886k035l167K847n326j1161J3236K066k75j6914k0354J1204J2645J6242
14725C894Q933L87j1371O813R976p105k4639j6636K584L6J8523M569R972j8296
14711a2360j182J2147O851J0896n092j1566M85J2940o664j718M772j253J1113
14698A9369j8757k2160j6639P326J7423N760Q383J8324n934j3091O358K961j0893
$$ plain form
14685 -1570 -22325 -32489 -38367 -22984 -23065 -20800 -10850 -403 97 14609 23801 19001 3416 -16565
14671 -16565 -18490 -17875 -21555 -29793 -28143 -29627 -40312 -26716 -24641 -18071 2169 9250 -14386 -21477
14657 -21477 -13130 -16401 -25355 -21328 -23533 -32779 -17575 -10541 -14998 -4103 -11499 346 -12356
14644 -12356 -6318 -3712 6569 21669 6447 4512 15582 11184 -2129 1108 7170 12426 23478
14631 23478 24010 20796 15547 -2972 -19132 33 6864 4851 8044 13429 4379 -2343 25455 25666
14617 25666 580 -2643 -3558 -9817 -20837 -24334 -14959 -4234 -6024 -16631 -34346 -32865 -21914
14604 -21914 -5623 3226 1145 8528 5168 -10686 6290 15650 8365 4761 -13021 -21894 -22217 -8904
14590 -8904 -531 -12969 -27398 -20120 -16302 -13718 -19570 -20026 -21728 -31472 -19161 -16319 -15250 -27611
$$ packed form
14685a570k0755j0164n878J5383q1K265R950J0447N00J4512R192m800j5585j9981
14671a6565j925O15l680q238J650j484j0685J3596K075O570K0240P081k3636p091
14657b1477Q347l271q954M027k205r246J5204P034m457J0895p396J1845j2702
14644a2356O038K606J0281J5100j5222j935J1070m398j3313L237O062N256J1052
14631B3478N32l214n249j8519j6160J9165O831k013L193N385r050o722K7798K11
14617B5666k5086l223r15o259j1020l497R375J0725j790j0607j7715J481J0951
14604b1914J6291Q849k081P383l360j5854J6976R360p285l604j7782q873l23J3313
14590h904Q373j2438j4429P278L818K584n852m56j702r744J2311K842J069j2361
$$ plain form
14576 -27611 -23783 -17984 -25194 -16354 -17403 -12590 -19781 -13595 -10228 -21566 -42898 -22146 1093
14563 1093 6417 7075 12762 -3451 -16669 -14605 -4050 -12768 -24556 -29967 -23328 -4806 5822
14550 5822 11140 149 -25252 -35059 -10796 -4312 -21880 -28625 -33783 -34580 -31311 -26513 -24228 -23037
14536 -23037 -3573 -3402 -5718 -4518 2690 -5394 -8017 -10562 -8289 -13213 -20205 -12956 1125 -5448
14522 -5448 -17325 -620 4437 3030 -27040 -37802 -33158 -29196 -25484 -9340 -8058 -8500 -13107 -6004
14508 -6004 -7681 -4354 8148 6320 18210 7342 -196 6059 26951 3603 -14321 8858 29878
14495 29878 23031 7441 -3864 -9375 -9207 3865 20095 4773 -7626 -6334 19132 19534 14414
14482 14414 8468 3162 838 -867 -28465 -50270 -45252 -21513 -26369 -17611 -10599 -17033 -28290
$$ packed form
14576b7611L828N799p210Q840j049M813p191O186L367j1338k1332K0752K3239
14563A093N324O58N687j6213j3218K064J0555q718j1788n411O639J8522J0628
14550E822N318j0991k5401r807K4263O484j7568o745n158p97L269M798K285J191
14536b3037J9464J71k316J200P208q084k623k545K273m924o992P249J4081o573
14522e448j1877J6705N057j407l0070j0762M644L962L712J6144J282m42m607P103
14508f004j677L327J2502j828J1890j0868p538O255K0892k3348j7924K3179K1020
14495B9878o847j5590j1305n511J68J3072J6230j5322j2399J292K5466M02n120
14482A4414n946n306k324j705k7598k1805N018K3739m856Q758P012o434j1257
$$ plain form
14469 -28290 -24976 -20747 -17299 -23829 -30490 -20757 -23375 -27018 -17640 974 21532 12009 -7859 -26401
14455 -26401 -18952 -1716 -364 13436 24698 6927 -8785 -21216 -20459 -10728 6667 7610 19427
14442 19427 21887 3151 -592 -819 1845 14963 3756 6496 25853 22892 15548 1302 1812 5864
14428 5864 3112 12693 13926 5832 3703 -5040 -7338 -3857 2440 -4020 -1910 13133 33459 30964
14414 30964 45414 69716 58305 45666 27378 35171 33833 703 -12183 -6225 -4334 7840
14402 7840 11244 21023 21794 253 1180 396 -22970 -34248 -16607 -454 3454 5875 4990 870
14388 870 -16764 -15367 -287 12934 23717 28660 20063 10371 4040 -4328 -10376 -28703 -19611 -6697
14374 -6697 -3124 -4637 5096 94 17164 19517 14200 8683 -13079 -21162 -12366 -2316 -11075 -7212
$$ packed form
14469b8290L314M229L448o530o661R733k618l643R378J8614K0558r523j9868j8542
14455b6401P449J7236J352J3800J1262j7771j5712j2431P57R731J7395R43J1817
14442A9427K460j8736l743k27K664J3118j1207K740J9357k961p344j4246N10M052
14428E864k752R581J233q094k129q743k298L481O297o460K110J5043K0326k495
14414C0964J4450K4302j1411j2639j8288P793j338l3130j2886N958J891J2174
14402G840L404R779P71k1541R27p84k3366j1278J7641J6153L908K421q85m120
14388H70j7634J397J5080J3221J0783M943q597r692o331q368o048j8327R092J2914
14374f697L573j513R733n002J7070K353n317n517k1762q083Q796J0050q759L863
$$ plain form
14360 -7212 -9391 -2237 1078 4985 -7877 -8568 -17077 -35213 -34487 -32595 -34226 -22679 -14220 -4758
14346 -4758 -6921 8197 10316 2742 -2648 -3190 -11234 -5697 -11321 -13249 -20339 -4129 19818 18871
14332 18871 37469 37468 19746 9185 -2745 -13853 -20133 -13363 -1345 1569 -1001 -4275 15414
14319 15414 13902 11471 4397 15319 10622 -1468 405 -1328 8177 14071 -8055 -13555 -7880 -3811
14305 -3811 -5681 10323 27065 34452 20330 11911 -10470 -29616 -26717 -14539 353 -1022 11206
14292 11206 24301 32162 23457 8358 10017 11973 17369 18336 6280 -20855 -49968 -38581 -21297
14279 -21297 -19861 -21028 -26857 -22183 -13415 14492 36977 39545 21516 11160 639 -973 -4114
14266 -4114 -17045 -14035 -8595 -18475 -15618 -12241 -18777 -26036 -26317 -17227 10756 23610 22700 26312
$$ packed form
14360g212k179P154L315L907j2862o91q509j8136P26J892j631J1547Q459R462
14346d758k163J5118K119p574n390n42q044N537n624j928p090J6210K3947r47
14332A8871J8598jj7722j0561j1930j1108o280O770J2018K914k570l274J9689
14319A5414j512k431p074J0922m697j2090J873j733R505N894k2126n500N675M069
14305c811j870J6004J6742P387j4122q419k2381j9146K899J2178J4892j375J2228
14292A1206J3095P861q705j5099J659J956N396R67j2056k7135k9113J1387J7284
14279b1297J436j167n829M674Q768K7907K2485K568j8029j0356j0521j612l141
14266d114j2931L010N440r880K857L377o536p259k81R090K7983J2854r10L612
$$ plain form
14252 26312 32974 16579 -6410 -17141 -29167 -16496 -3209 7121 13768 9201 -20796 -34031
14240 -34031 -7284 -12803 -15221 -3266 -4285 1753 5379 836 -1282 -5322 -3935 1008 -2840 -3167
14226 -3167 12929 33284 26663 19991 19821 2892 -6930 -19779 -30303 -27053 -4766 2515 4531
14213 4531 10637 7522 -5234 -10641 -17991 -21930 -22965 -21453 -32317 -37564 -29930 -17573 -1455 8287
14199 8287 22288 26444 17199 3656 -11728 -19979 -20157 2579 -6118 -9162 -14445 -17490 -8461 -16228
14185 -16228 -30451 -22760 -4817 17407 10498 -2413 -17156 -16975 -19776 -15398 -18574 -1890 33121
14172 33121 47192 38998 26206 10336 -3147 -8879 9492 26438 25900 18663 13528 6759 6573
14159 6573 11473 9871 17284 28703 21760 2224 16942 10721 7867 16027 566 4631 -994 -11307
$$ packed form
14252B6312O662j6395k2989j0731j2026J2671J3287J0330O647m567k9997j3235
14240c4031K6747n519k418J1955j019O038L626m543k118m040J387M943l848l27
14226c167J6096K0355o621o672j70j6929r822j2849j0524L250K2287P281K016
14213D531O106l115j2756n407p350l939j035J512j0864n247P634J2357J6118R742
14199H287J4001M156r245j3543j5384q251j78K2736q697l044n283l045R029p767
14185a6228j4223P691J7943K2224o909j2911j4743J81k801M378l176J6684L5011
14172C3121J4071q194j2792j5870j3483n732J8371J6946n38p237n135o769j86
14159F573M900j602P413J1419o943j9536J4718o221k854Q160j5461M065n625j0313
$$ plain form
14145 -11307 -2858 -8691 -10856 -8788 9294 13449 22214 20858 -4276 -14485 -16310 -9678 -5592 13306
14131 13306 8463 -1024 -3932 -6838 -2515 -7128 2164 -12347 -33237 -37751 -20725 -9527 -5944
14118 -5944 -11453 -10570 11930 22032 28956 26176 16064 15641 7272 16951 5983 -17998 -12081 -19224
14104 -19224 -35945 -27969 -13579 -10691 -10426 -20799 -27221 -23622 -19596 -23064 -9252 10802 -6389
14091 -6389 -4018 -3801 -19809 -17197 -4402 -3022 1153 7386 8807 5206 9595 15231 11982 2773
14077 2773 3289 -2261 -11816 -5740 -28178 -36683 -18781 -9091 -14293 -14805 -11334 -13722 -16868 -12022 -10647
14062 -10647 -13014 -15121 -25029 -18547 -14379 -12832 -10363 -3167 -2235 -3227 -5499 5193 12237 10668 10000
14047 10000 12424 -2403 -10132 -2425 6443 13981 12572 4440 2057 -1615 8421 4938 -4576 -8072
$$ packed form
14145a1307Q449n833k165K068J8082M155Q765j356k5134j0209j825O632M086J8898
14131A3306m843r487k908k906M323m613R292j4511k0890m514J7026J1198L583
14118e944n509Q83K2500J0102O924k780j0112m23q369R679j0968k3981N917p143
14104a9224j6721P976J4390K888K65j0373o422L599M026l468J3812K0054j7191
14091f389K371K17j6008K612J2795J380M175O233J421l601M389N636l249r209
14077B773N16n550r555O076k2438q505J7902R690n202n12L471k388l146M846J375
14062a0647k367k107r908O482M168J547K469P196R32r92k272J0692P044j569o68
14047A0000K424j4827p729P707Q868P538j409q132k383l672J0036l483r514l496
$$ plain form
14033 -8072 -14321 -17160 -22710 -9121 -11901 -14808 -35919 -45105 -52961 -32548 -29115 -36012 -31811 -39513
14019 -39513 -43424 -39827 -32842 -16729 -3937 2761 1964 4745 -14607 -22573 -17486 -14470 -20345 -9271
14005 -9271 -9184 -23252 -17566 -2803 4188 -3122 -15858 -11925 -894 -14171 -11731 -9312 -1243 -4276
13991 -4276 -4052 4422 -6658 -18793 -23672 -28776 -23588 -18796 -7334 13599 7093 -3699 -4496 -5726
13977 -5726 6254 8957 17027 9079 -3665 -136 3866 5496 19424 10953 -6658 -20877 -10545
13964 -10545 -6611 10593 -5388 -15069 -23683 -19884 -11317 -5170 -9730 -15359 8414 11029 8367 6302
13950 6302 -587 -18377 -28572 -21510 -13250 -14810 -16998 -8470 1201 -76 3608 661 6439 -4517
13936 -4517 -2393 10629 17752 -8248 -30275 -8683 -12227 -34301 -27547 -25959 -30253 -29950 -40762
$$ packed form
14033h072o249k839n550J3589k780k907k1111r186p856K0413L433o897M201p702
14019c9513l911L597O985J6113J2792O698p97K781j9352p966N087L016n875J1074
14005i271Q7j4068N686J4763O991p310j2736L933J1031j3277K440K419Q069l033
13991d276K24Q474j1080j2135m879n104N188M792J1462K0933o506j0792p97j230
13977e726J1980K703Q070p948j2744L529M002J630J3928q471j7611j4219J0332
13964a0545L934J7204j5981r681q614L799Q567O147m560n629K3773K615k662k065
13950F302o889j7790j0195P062Q260j560k188Q528R671j277L684k947N778j0956
13936d517K124J3022P123k6000k2027K1592l544k2074O754J588m294L03j0812
$$ plain form
13923 -40762 -46594 -47723 -40529 -35167 -21984 -1191 6432 1904 -13037 -21021 -13034 -6678 -1659 3054
13909 3054 8409 30700 18503 -13885 -18410 -8043 -6832 -11462 -20804 -29426 -30813 -21784 -9484
13896 -9484 -20457 -5079 10291 -2361 -19550 -23935 -14948 -21505 -24252 -18158 -25806 -38862 -28321
13883 -28321 -19201 9749 9002 -4642 8775 27404 32458 27517 13873 -15685 -27049 -23904 -24055
13870 -24055 -24144 -26844 -17033 -14259 -17764 -20568 -30330 -23891 -15303 -13060 -8865 16437 19212 13304 2649
13855 2649 -452 -581 13427 25335 28347 40245 51612 42557 28534 15307 -10044 -16484 -29091
13842 -29091 -39721 -24325 -4205 1984 -1008 -11382 -15234 -20950 -30472 -14941 -12298 -13458 5953
13829 5953 9461 -3674 -11925 -16077 -14895 -14015 -2775 9877 8649 -1166 -15351 -15680 -11477 -18105
$$ packed form
13923d0762n832j129P194N362J3183K0793P623m528j4941p984P987O356N019M713
13909C054N355K2291j2197l2388m525J0367J211m630r342q622j387R029J2300
13896i484j0973J5378J5370j2652j7189m385Q987o557k747O094p648j3056J0541
13883b8321R120K8950p47j3644J3417J8629N054m941j3644k9558j1364L145j51
13870b4055q9k700R811K774l505k804r762O439Q588K243M195K5302K775n908j0655
13855B649l101j29J4008J1908L012J1898J1367r055j4023j3227k5351o440j2607
13842b9091j0630J5396K0120O189k992j0374l852n716r522J5531K643j160J9411
13829E953L508j3135q251m152J182Q80J1240J2652j228r815j4185l29M203o628
$$ plain form
13815 -18105 -22217 -3943 2617 -1616 4275 4783 5034 -3865 -12007 5011 16503 3685 3316 12693
13801 12693 23273 33563 2859 -17000 -18650 -27266 -18940 -11554 -32595 -37171 -26861 -14494 -2437
13788 -2437 -12796 -27538 -11003 -8132 -2647 10427 19359 21404 9844 -4159 -14651 -3739 7148
13775 7148 10091 8633 -3630 -4640 2235 15785 17813 16303 4213 -17247 -14672 -6269 -3660 -4560
13761 -4560 -7544 -532 2345 -2108 2976 6232 -503 -18422 -20764 -16025 -3826 -3878 -7969 -8370 2411
13746 2411 3337 1418 -14434 -35071 -58570 -59863 -47030 -34962 -16034 -6422 3722 -2920 -24617
13733 -24617 -31356 -33383 -24614 -19759 -15092 4571 -2167 -18070 -23870 -28860 -40144 -52972 -34380
13720 -34380 -15779 4137 6737 21172 23353 22606 21531 98 -25335 -28126 8936 5249 -4177
$$ packed form
13815a8105m112J8274O560m233N891N08K51q899q142J7018J1492j2818l69R377
13801A2693J0580J0290l0704j9859j650q616Q326P386k1041m576J0310J2367J2057
13788b437j0359j4742J6535K871N485J3074Q932K045j1560j4003j0492J0912J0887
13775G148K943j458j2263j010O875J3550K028j510j2090k1460K575Q403K609r00
13761d560k984P012K877m453N084L256o735j7919k342M739J2199n2m091m01J0781
13746B411R26j919j5852k0637k3499j293J2833J2068J8928R612J0144o642k1697
13733b4617o739k027Q769M855M667J9663o738j5903n800m990j1284j2828J8592
13720c4380J8601J9916K600J4435K181p47j075k1433k5433k791L7062l687r426
$$ plain form
13707 -4177 9914 13688 1747 6959 9163 -3205 -6360 -177 1039 -14948 -25523 -14578 5083
13694 5083 9432 12839 6551 6734 12688 15722 18623 13228 7781 14655 19056 17400 315 -4886 10167
13679 10167 3416 -10831 632 -2432 694 224 1315 1914 -12015 -18817 -20201 -12016 695 -7859
13665 -7859 -11028 -11618 -9506 5333 -3571 2274 16688 13363 20148 14806 -11850 -23337 -4629 16038
13651 16038 16478 -3584 -3177 2747 6184 -2393 521 22721 25597 12145 -8258 13709 33570
13638 33570 36506 26769 33356 29750 14337 5466 994 4869 3204 8662 1636 -13339 -20640 16009
13624 16009 28042 7159 4240 -5538 -5921 8245 10695 4268 -66 8921 8486 19937 13652 -7682
13610 -7682 -11271 -1441 -20700 -21846 -22640 -29012 -31935 -19133 -18946 -4025 -10187 -13823 -28499 -40448
$$ packed form
13707d177J4091L774j1941N212K204j2368l155O183J216j5987j0575J0945J9661
13694E083M349L407o288J83N954L034K901n395n447O874M401j656j7085n201J5053
13679A0167o751j4247J1463l064L126m70J091N99j3929o802j384Q185J2711q554
13665g859l169n90K112J4839q904N845J4414l325O785n342k6656j1487J8708K0667
13651A6038M40k0062M07N924L437q577K914K2200K876j3452k0403K1967J9861
13638C3570K936r737O587l606j5413q871m472L875j665N458p026j4975p301L6649
13624A6009J2033k0883k919r778l83J4166K450o427m334Q987m35J1451o285k1334
13610g682l589R830j9259j146p94o372k923J2802J87J4921o162l636j4676j1949
$$ plain form
13596 -40448 -33358 -21084 -14805 -20877 -24356 -19080 2938 8729 5656 6878 -5596 -14353 -9860 -9202
13582 -9202 -3733 -475 17699 -900 -12369 -12785 -8090 -15656 -17187 -8907 14059 13652 7008 516
13568 516 6918 19782 9601 -5144 -4934 3794 13993 33360 47173 51335 26841 10839 1602
13555 1602 768 8713 6265 10327 10375 -6845 -8063 8567 980 314 -12019 -16461 -21845 -30167 -30912
13540 -30912 -21350 -4773 8270 19364 22625 17562 14141 14015 6940 1759 -13300 -18587 -16484 -16699
13526 -16699 -10389 -24762 -24994 -39246 -44934 -39101 -37110 -28855 -20231 -12414 -21951 -24985 -20496 -8901
13512 -8901 -2553 -9633 -21320 -8670 1540 3863 -9777 -12085 -9226 -6717 15205 20955 11294
13499 11294 2056 5321 -361 -35386 -45974 -22043 5162 7295 6613 11015 -5272 -17544 -22678
$$ packed form
13596d0448P090J2274O279o072l479N276K2018N791l073J222j2474q757M493O58
13582i202N469L258J8174j8599j1469m16M695p566j531Q280K2966m07o644o492
13568E16O402J2864j0181j4745K10Q728J0199J9367J3813M162k4494j6002r237
13555A602q34P945k448M062M8j7220j218J6630p587o66j2333m442n384q322p45
13540c0912R562J6577J3043J1094L261n063l421j26p075n181j5059n287K103k15
13526a6699O310j4373k32j4252n688N833J991Q255Q624P817r537l034M489J1595
13512h901O348p080j1687J2650J0210K323j3640k308K859K509K1922N750r661
13499A1294r238L265n682l5025j0588K3931K7205K133o82M402j6287j2272n134
$$ plain form
13486 -22678 -8139 869 76 8444 -2298 -23293 -29176 -29351 -28843 -26690 -12168 295 -31634 -62417
13472 -62417 -50999 -42053 -39570 -28878 -12799 6287 18524 11614 17802 13460 3791 11719 19826
13459 19826 33174 32935 12825 989 4758 287 7905 8548 13116 -4783 -16442 -23091 -31150 -19982
13445 -19982 -17408 -28362 -37797 -23849 -9521 -8744 307 6791 -3056 -27294 -37461 -42762 -26914
13432 -26914 -10823 -28575 -35435 -19036 214 -5167 -18697 -19800 -16873 -19405 -14791 -15431 -11692
13419 -11692 -17850 -22117 -4912 2188 18047 22720 3382 -4637 -5247 -1850 2932 5799 11154 6339
13405 6339 -12808 -15821 4241 7699 -12399 -20781 -25606 -21413 -5331 -19678 -23514 -18098 -20375
13392 -20375 3575 29152 20397 14544 17511 32940 36377 14262 3467 19296 13762 15801 14547
$$ packed form
13486b2678J4539R008p93Q368j0742k0995n883j75N08K153J4522J2463l1929l0783
13472f2417J1418Q946K483J0692J6079J9086J2237o910O188m342r669P928Q107
13459A9826J3348k39k0110j1836L769m471P618O43M568j7899j1659o649q059J1168
13445a9982K574j0954r435J3948J4328P77R051O484r847k4238j0167n301J5848
13432b6914J6091j7752o860J6399J9250n381j3530j103K927k532M614o40L739
13419a1692o158m267J7205P100J5859M673j9338q019o10L397M782K867N355m815
13405F339j9147l013K0062L458k0098q382m825M193J6082j4347l836N416k277
13392b0375K3950K5577q755n853K967J5429L437k2115j0795J5829n534K039j254
$$ plain form
13379 14547 2703 -1884 -5815 -9054 3125 17318 14366 8142 6632 10770 10620 12297 6489 -3483
13365 -3483 1470 8887 15429 32976 47819 38877 30663 27399 27158 29246 17940 18794 13220 -20701
13351 -20701 -15345 -6894 -4310 -2658 8459 15297 15566 15810 21015 2982 2917 10709 1859 3697 -4604
13336 -4604 -1294 13762 9251 -3728 3659 7689 -4513 7579 9801 -2532 13302 36438 39850
13323 39850 33242 24331 30457 26871 31390 33628 24544 28872 10897 4859 -12139 -9163 10036 17212
13309 17212 38272 40711 28349 26118 16225 13415 13394 27204 32001 31628 40765 34537 27817 20135
13295 20135 5163 -27148 -32965 -36909 -23135 -8433 8593 24904 20706 13220 28453 29019 12259
13282 12259 -1784 -13643 -4584 1829 -13754 -14283 -1111 9974 14319 18475 16430 2909 -8607
$$ packed form
13379A4547j1844m587l931l239J2179J4193k952o224j510M138j50J677n808r972
13365c483M953P417O542J7547J4843q942q214l264k41K088j1306Q54n574l3921
13351b0701N356Q451K584J652J1117O838K69K44N205j8033o5P792q850J838q301
13336d604L310J5056m511j2979P387M030j2202J2092K222j2333J5834K3136L412
13323C9850o608q911O126l586M519K238r084M328j7975o038j6998K976J9199P176
13309A7212K1060K439j2362k231r893k810k1J3810M797l73R137o228o720p682
13295B0135j4972l2311n817l944J3774J4702J7026J6311m198p486J5233N66j6760
13282A2259j4043j1859R059O413j5583n29J3172J1085M345M156k045j3521j1516
$$ plain form
13269 -8607 -3157 5706 4893 -4283 -23560 -17719 -9817 1863 20040 24371 26081 47144 45967 25920
13255 25920 22253 9303 111 8368 17454 22608 28594 14791 2296 6707 14019 7945 15114 2910
13241 2910 2016 -4888 -28209 -25437 -17565 -7455 -9945 4603 24060 38357 49112 48641 43279 41675
13227 41675 45535 36186 30862 24547 13851 2860 2941 5992 17864 12284 5544 8063 13641 14180
13213 14180 10651 13280 17629 9986 -10921 9537 20041 21582 28997 11666 22868 42146 46626
13200 46626 21042 15235 27690 25403 13239 177 12905 46518 53001 44165 44001 62918 64000
13187 64000 44620 40917 18097 26874 26170 26121 37313 50884 50233 34670 38839 26301 25698 23523
13173 23523 22648 13779 19334 18277 14202 19405 27143 18908 8096 -5766 -11444 -13637 -9217 -12079
$$ packed form
13269h607N450Q863q13r176j9277N841P902J1680J8177M331J710K1063j177k0047
13255B5920l667j2950r192Q257R086N154N986j3803j2495M411P312o074P169j2204
13241B910q94o904k3321K772P872J0110k490J4548J9457J4297J0755m71n362j604
13227D1675L860r349n324o315j0696j0991Q1L051J1872n580o740K519N578N39
13213A4180l529K629M349p643k0907K0458J0504J541P415j7331J1202J9278M480
13200D6626k5584n807J2455k287j2164j3062J2728L3613O483q836j64J8917J082
13187F4000j9380l703k2820Q777p04m9J1192J3571o51j5563M169j2538o03k175
13173B3523q75q869N555j057m075N203P738q235j0812j3862n678k193M420k862
$$ plain form
13159 -12079 -10014 198 -2758 -5085 2939 -2985 -12965 -7356 4817 24872 28365 26900 -12542
13146 -12542 -20687 -7702 -14343 -7176 12588 18251 19077 12982 8887 13099 4190 4293 9925 8034
13132 8034 -7406 5238 23769 23431 8165 2384 -4931 5206 23695 24742 34403 39141 25008
13119 25008 16377 26520 45706 42203 35282 41514 38625 19057 15233 12820 9717 -11273 -19335
13106 -19335 -15128 480 11098 4624 10001 15726 16444 12261 -1599 -2024 17656 6392 -23192
13093 -23192 -41451 -29145 -15549 -921 -5720 5374 12827 19484 16770 602 -9523 16925
13081 16925 40914 37223 16674 -10277 -13601 -3687 17710 27452 13096 13316 26153 22407 -3586
13068 -3586 2882 -4671 -5382 -8540 10980 21042 20369 5305 -12382 -7106 -604 83 2885 10622
$$ packed form
13159a2079K065J0212k956k327Q024n924r980N609J2173K0055L493j465l9442
13146a2542q145J2985o641P167J9764N663Q26o095m095M212q909J03N632j891
13132H034j5440J2644J8531l38j5266n781p315J0137J8489J047R661M738j4133
13119B5008q631J0143J9186l503o921O232k889j9568l824k413l103k0990q062
13106a9335M207J5608J0618o474N377N725P18m183j3860m25J9680j1264k9584
13093b3192j8259J2306J3596J4628m799J1094P453O657k714j6168j0125K6448
13081A6925K3989l691k0549k6951l324R914K1397R742j4356K20J2837l746k5993
13068c586O468p553p11l158J9520J0062o73j5064j7687N276O502O87K802P737
$$ plain form
13054 10622 -845 -3179 -9979 -12917 -1774 8103 22821 43468 50688 51228 44274 33183 37282
13041 37282 54554 46353 16964 12618 25396 32281 38554 37127 39134 15344 -4113 -6137 5656
13028 5656 22361 36747 38438 33627 26721 51763 45580 29161 12098 8037 4391 13337 11015
13015 11015 8539 12379 2915 -11457 -12103 -3103 -28690 -14991 4517 3356 332 -9950 -10492 -14169
13001 -14169 -17177 -18469 2324 18698 8388 11949 20764 20510 19518 9040 12137 31890 33330 27368
12987 27368 25908 15079 1908 -6539 -4089 9864 20728 46138 54901 36977 23704 13872 1293
12974 1293 -1460 12080 8832 1503 17876 26109 20731 15925 13126 21546 29127 21868 25996 26090 26803
12959 26803 45330 43494 25306 22787 26118 32423 15945 13401 18773 13129 23399 37020 48356
$$ packed form
13054A0622j1467k334o800k938J1143R877J4718K0647P220N40o954j1091M099
13041C7282J7272q201k9389m346J2778O885O273j427K007k3790j9457k024J1793
13028E656J6705J4386J691m811o906K5042o183j6419j7063m061l646Q946k322
13015A1015k476L840r464j4372o46R000k5587J3699J9508j161l024j0282n42l677
13001a4169l008j292K0793J6374j0310L561Q815k54r92j0478L097J9753J440n962
12987B7368j460j0829j3171q447K450J3953J0864K5410Q763j7924j3273r832j2579
12974A293k753J3540l248p329J6373Q233n378m806k799Q420P581p259M128R4P13
12959B6803J8527j836j8188k519L331O305j6478k544N372n644J0270J3621J1336
$$ plain form
12946 48356 64249 71611 81861 73665 74358 62819 50148 61735 80034 70328 66878 81301 94141
12933 94141 95789 89577 87425 86437 98299 109384 139584 189126 251763 312481 357588 389611 387324
12920 387324 338548 282188 243424 209776 173734 134083 137516 123623 106690 98125 101623 89538
12908 89538 108805 153723 183065 233565 279383 317989 328183 316660 275931 231139 231501 284090
12896 284090 357023 430370 497101 513112 478410 443538 376223 298985 235436 207347 207241 230100
12884 230100 273378 312611 348280 344588 293423 224086 174273 160581 142594 132354 140997 144873
12872 144873 143607 159739 198969 250846 316191 393530 472653 543064 586871 561097 476750 383148
12860 383148 320530 250506 197056 159169 143930 138951 118952 94669 81747 77046 88209 79116
$$ packed form
12946D8356J5893P362J0250q196O93j1539j2671J1587J8299r706l450J4423J2840
12933I4141J648o212k152r88J1862J1085L0200M9542O2637O0718M5107L2023k287
12920C87324m8776n6360l8764l3648l6042l9651L433j3893j6933q565L498j2085
12908H9538J9267M4918K9342N0500M5818L8606J0194j1523m0729m4792L62N2589
12896B84090P2933P3347O6731J6011l4702l4872o7315p7238o3549k8089j06K2859
12884B30100M3278L9233L5669l692n1165o9337m9813j3692j7987j0240Q643L876
12872A44873j266J6132L9230N1877O5345P7339P9123P0411M3807k5774q4347r3602
12860C83148o2618p0024n3450l7887j5239m979j9999k4283j2922m701J1163r093
$$ plain form
12848 79116 80329 81216 79225 75294 79022 80644 75060 73889 60804 56527 67589 70882 59488 59857
12834 59857 51185 36166 37449 51570 69926 70980 56787 60707 48073 46496 59821 65626 76213
12821 76213 59810 27274 32167 41113 42825 57601 63989 71208 69636 64553 64462 48788 41828 52451
12807 52451 42572 53795 53208 53687 48416 40370 39582 36202 29036 35234 33771 38707 38785 41918 49806
12792 49806 73074 66496 44870 49897 35552 25608 28352 29864 52756 71498 63762 65519 71197
12779 71197 81336 79883 75045 71328 76952 79512 74991 83379 82309 76344 72152 57673 53691 55484
12765 55484 63261 88317 111625 129840 131789 113350 91432 69919 47837 46075 60198 64997
12753 64997 57031 57964 64075 67717 86349 85427 62829 52726 41817 10248 3299 45517 65845
$$ packed form
12848G9116J213Q87j991l931L728J622n584j171j3085m277J1062L293j1394L69
12834E9857q672j5019J283J4121J8356J054j4193L920j2634j577J3325N805J0587
12821G6213j6403l2536M893Q946J712J4776O388P219j572n083r1j5674o960J0623
12807E2451r879J1223n87M79n271q046p88l380p166O198j463M936P8L133P888
12792D9806K3268o578k1626N027j4345r944K744J512K2892J8742p736J757N678
12779G1197J0139j453m838l717N624K560m521Q388j070n965m192j4479l982J793
12765E5484P777K5056K3308J8215J949j8439k1918k1513k2082j762J4123M799
12753F4997p966R33O111L642J8632r22k2598j0103j0909l1569o949M2218K0328
$$ plain form
12740 65845 78983 99838 92681 68499 60889 45050 31037 32478 55705 74452 58492 53163
12728 53163 55383 78994 87175 65359 69788 72329 85494 74337 56316 50045 45683 29077 22157
12715 22157 41610 74092 100338 102075 112051 123546 138317 157448 162840 170885 244541 292317
12703 292317 306171 308269 290305 272533 259523 225629 211716 192440 187950 194686 198148 181184
12691 181184 142176 112291 80212 80039 105311 131726 132729 140237 130653 110400 110455 107878 111429
12678 111429 129763 121996 103898 97434 110495 118054 129065 132644 113497 107507 83269 52998
12666 52998 40595 42431 59159 99247 114025 118005 131364 124116 76860 47700 28906 33250
12654 33250 34386 47884 49612 55457 82420 119178 137080 162028 184317 202671 208535 199717 181546
$$ packed form
12740F5845J3138K0855p157k4182p610j5839j4013J441K3227J8747j5960n329
12728E3163K220K3611Q181k1816M429K541J3165j1157j8021o271m362j6606o920
12715B2157J9453L2482K6246J737R976J1495J4771J9131N392Q045P3656M7776
12703B92317J3854K098j7964j7772j3010l3894j3913j9276m490O736L462j6964
12691A81184l9008k9885l2079j73K5272K6415J003P508r584k0253N5k577L551
12678A11429J8334p767j8098o464J3061P559J1011L579j9147n990k4238l0271
12666E2998j2403J836J6728M0088J4778L980J3359p248m7256k9160j8794M344
12654C3250J136J3498J728N845K6963L6758J7902K4948K2289J8354N864q818j8171
$$ plain form
12641 181546 169306 149557 125894 96055 67305 65999 76909 91938 94879 106970 111296 91718
12629 91718 66174 65140 78330 106840 117134 147909 183328 208349 189326 159137 146572 114236
12617 114236 62165 31141 19685 5677 19635 39425 43548 54022 59748 47051 33182 15531
12605 15531 30913 33576 48125 73200 104324 142637 162409 166647 163242 165468 164530 183511 201625
12592 201625 222747 226031 223799 206758 194532 184013 186204 167735 167011 176313 195969 219433 251223
12579 251223 298240 334602 341793 315516 273923 277206 267512 247697 241184 230761 215924 195120
12567 195120 181029 198201 193224 196522 182709 199295 215096 236289 212003 220269 249826 278733
12555 278733 269115 276085 290246 285356 275585 258990 266080 273237 294141 328128 324742 314998 290929
$$ packed form
12641A81546j2240j9749k3663k9839k8750j306J0910J5029K941J2091M326j9578
12629I1718k5544j034J3190K8510J0294L0775L5419K5021j9023l0189j2565l2336
12617A14236n2071l1024j1456j4008J3958J9790M123J0474N726j2697j3869j7651
12605A5531J5382K663J4549K5075L1124L8313J9772M238l405K226r38J8981J8114
12592B01625K1122L284k232j7041j2226j0519K191j8469p24R302J9656K3464L1790
12579B51223M7017L6362P191k6277m1593L283r694j9815o513j0423j4837k0804
12567A95120j4091J7172m977L298j3813J6586J5801K1193k4286Q266K9557K8907
12555B78733r618O970J4161m890r771j6595P090P157K0904L3987l386r744k4069
$$ plain form
12542 290929 269484 291316 304668 315067 314454 315288 306842 306789 328367 360555 383025 411097 438749
12529 438749 466229 490740 498646 484874 482304 490831 503512 497314 517034 552926 570745 571069 565822
12516 565822 570521 574154 575594 582245 570814 587035 624073 669020 727063 779505 823613 873638
12504 873638 914724 943603 993012 1070389 1173487 1288908 1368261 1376459 1328784 1280905 1276072
12493 1276072 1305627 1403719 1538924 1634198 1711693 1828484 1939835 2025551 2071332 2113771 2157472
12482 2157472 2198326 2269097 2397565 2555497 2764443 3028930 3327032 3705668 4164295 4671482
12472 4671482 5258222 5933901 6649880 7398893 8214377 9169279 10316967 11770028 13618074
12463 13618074 15886679 18672936 22116019 26608418 32821235 41606280 54186697 72700964
$$ packed form
12542B90929k1445K1832J3352J0399o13Q34q446n3K1578L2188K2470K8072K7652
12529D38749K7480K4511P906j3772k570Q527J2681o198J9720L5892J7819L24n247
12516E65822M699L633J440O651j1431J6221L7038M4947N8043N2442M4108N0025
12504H73638M1086K8879M9409P7377J03098J15421P9353Q198m7675m7879m833
12493A276072K9555R8092J35205R5274P7495J16791J11351Q5716M5781M2439M3701
12482B157472M0854P0771J28468J57932K08946K64487K98102L78636M58627N07187
12472D671482N86740O75679P15979P49013Q15484R54902J147688J453061J848046
12463A3618074K268605K786257L443083M492399O212817Q785045J2580417J8514267
$$ plain form
12455 72700964 101762455 150025274 229797134 338422276 413891094 405107878 346270367
12448 346270367 259396251 179522987 125867136 92378609 70798020 56056978 45327492
12441 45327492 37160008 30888164 26095233 22425898 19602903 17361938 15516879 13981856
12433 13981856 12670653 11534939 10583806 9775119 9062211 8448561 7869470 7300659 6776099
12424 6776099 6297580 5868083 5495535 5174801 4874089 4573750 4305025 4065767 3853029
12415 3853029 3666396 3470484 3254851 2991536 2703897 2450846 2214606 2007685 1831582
12406 1831582 1697144 1571473 1449254 1339507 1240802 1188581 1174336 1181345 1184849 1179336 1125163
12395 1125163 1036707 961285 913070 889102 863931 822232 790825 769370 743573 701482 652117
$$ packed form
12455G2700964K9061491M8262819P9771860J08625142P5468818q783216n8837511
12448C46270367q6874116p9873264n3655851l3488527k1580589j4741042j0729486
12441D5327492q167484o271844m792931l669335k822995k240965j845059j535023
12433A3981856j311203j135714r51133q08687p12908o13650n79091n68811n24560
12424F776099m78519m29497l72548l20734l00712l00339k68725k39258k12738
12415C853029j86633j95912k15633k63315k87639k53051k36240k06921j76103
12406A831582j34438j25671j22219j09747r8705n2221j4245P009L504n513n4173
12395A125163q8456p5422m8215k3968k5171m1699l1407k1455k5797m2091m9365
$$ plain form
12384 652117 610449 597156 589962 579198 579391 558767 548317 534207 502789 470065 455125 447181
12372 447181 423862 400720 388101 391333 397027 404141 419037 420580 412450 398208 383306 364140
12360 364140 323708 317053 332842 346035 356079 340077 299470 265082 257110 260047 261641 253142
12348 253142 234145 222508 198891 201531 217482 216126 200698 206531 222272 230217 210288 190908
12336 190908 193793 198764 200816 201038 205908 202594 205697 215992 241311 269794 248934 184710 185144
12323 185144 212512 205438 181354 167340 162190 159262 136372 120378 122630 128196 123227 124595 126293
12310 126293 123856 120391 125808 120137 122554 124783 118427 111613 121557 128542 149458 190837 229606
12297 229606 257801 249145 225616 211029 184641 171044 164395 166710 193893 199924 199525 196889 180026
$$ packed form
12384F52117m1668j3293p194j0764J93k0624j0450j4110l1418l2724j4940p944
12372D47181k3319k3142j2619L232N694P114J4896J543q130j4242j4902j9166
12360C64140m0432o655J5789J3193J0044j6002m0607l4388p972K937J594q499
12348B53142j8997j1637k3617K640J5951j356j5428N833J5741P945j9929j9380
12336A90908K885M971K052K22M870l314L103J0295K5319K8483k0860o4224M34
12323A85144K7368p074k4084j4014n150k928k2890j5994K252N566m969J368J698
12310A26293k437l465N417n671K417K229o356o814R944O985K0916M1379L8769
12297B29606K8195q656k3529j4587k6388j3597o649K315K7183O031l99k636j6863
$$ plain form
12284 180026 156358 137341 97035 86761 87331 93665 87225 105199 114736 121095 124156 133145 114673
12271 114673 96419 95957 96327 102233 105890 104505 123182 129294 126098 89834 26549 -25436 -39576
12258 -39576 -34852 -26589 436 23613 41746 58963 62825 64497 74526 84022 67234 67451 107323
12245 107323 135514 129780 117421 91757 65229 63174 66408 68218 56264 51220 60780 64681 33547
12232 33547 6741 14218 24036 34476 51699 75976 87939 88064 74151 67063 42134 40319 44212
12219 44212 49138 55564 60314 57979 54652 48297 45372 50798 67617 75536 64060 53715 58262 58026
12205 58026 64724 66050 59514 57438 57351 51010 47544 35502 21275 38446 66812 72369 70554 54093
12191 54093 46630 36746 39994 38740 37118 45555 66788 76864 69480 51311 36180 23043 17434
$$ packed form
12284A80026k3668j9017m0306j0274N70O334o440J7974R537O359L061Q989j8472
12271A14673j8254m62L70N906L657j385J8677O112l196l6264o3285n1985j4140
12258c9576M724Q263K7025K3177J8133J7217L862J672J0029R496j6788K17L9872
12245A07323K8191n734j2359k5664k6528k055L234J810j1954n044R560L901l1134
12232C3547k6806P477R818J0440J7223K4277J1963J25j3913p088k4929j815L893
12219D4212M926O426M750k335l327o355k925N426J6819P919j1476j0345M547k36
12205E8026O698J326o536k076q7o341l466j2042j4227J7171K8366N557j815j6461
12191E4093p463r884L248j254j622Q437K1233J0076p384j8169j5131j3137n609
$$ plain form
12178 17434 23788 42410 55658 62731 76287 66662 46545 41061 43663 31561 23142 29544 28335
12165 28335 38145 57738 69871 63293 49550 45005 50067 43171 37058 30060 31076 27930 24037 22306
12151 22306 8925 -7625 7951 32148 47883 38473 21566 -5820 -8910 -35322 -78932 -83507
12139 -83507 -89448 -101351 -95621 -73067 -44003 -35518 -28725 -14190 11960 20837 17212 -2290 -31650
12126 -31650 -41447 -38198 -33504 -24278 -4965 9827 9901 9725 7216 1956 13734 28172 17802 6866
12112 6866 12524 18862 17424 14027 3325 -18160 -22300 -25892 -33210 -25108 -32491 -34633 -40372 -37403
12098 -37403 -7671 14950 21026 26846 37537 47978 58573 68906 83239 91735 83922 56496
12086 56496 49534 33024 24523 18652 19965 19689 9684 2754 3075 16452 19340 1503 -10095 -5870
$$ packed form
12178A7434O354J8622J3248P073J3556r625k0117n484K602j2102q419O402j209
12165B8335R810J9593J2133o578j3743m545N062o896o113o998J016l146l893j731
12151B2306j3381j6550J5576K4197J5735r410j6907k7386l090k6412m3610m575
12139h3507n941j1903N730K2554K9064Q485O793J4535K6150Q877l625j9502k9360
12126c1650r797L249M694R226J9313J4792P4j76k509n260J1778J4438j0370j0936
12112F866N658O338j438l397j0702k1485m140l592p318Q102p383k142n739K969
12098c7403K9732K2621O076N820J0691J0441J0595J0333J4333Q496p813k7426
12086E6496o962j6510q501n871J313k76j0005o930L21J3377K888j7837j1598M225
$$ plain form
12072 -5870 2728 -4007 -34307 -28039 -16243 8780 12188 13465 22834 2212 7493 4491 1563 16279
12058 16279 21054 3581 -12264 -167 -1776 2110 5239 -8364 2121 21190 21669 19033 40688
12045 40688 51495 39459 28309 31507 37397 38071 60214 91486 107859 137230 175925 219751
12033 219751 288053 358285 427244 469297 462906 421712 358213 269637 190438 140865 126867 111937
12021 111937 112041 110756 117939 133251 151078 156704 199869 248011 312107 343669 345951 319159 259672
12008 259672 225795 208870 209144 229820 256467 309614 365411 410217 443772 454538 422684 372906
11996 372906 347532 308384 297781 309926 350866 351222 303327 241183 186826 146712 135188 131811
11984 131811 127881 99284 95484 97766 90872 89275 111496 153339 210644 252202 302034 354918
$$ packed form
12072e870Q598o735l0300O268J1796K5023L408J277R369k0622N281l002k928J4716
12058A6279M775j7473j5845J2097j609L886L129j3603J0485J9069M79k636K1655
12045D0688J0807j2036j1150L198N890O74K2143L1272J6373K9371L8695M3826
12033B19751O8302P0232O8959M2053o391m1194o3499q8576p9199m9573j3998j4930
12021A11937J04j285P183J5312J7827N626M3165M8142O4096L1562K282k6792n9487
12008B59672l3877j6925K74K0676K6647N3147N5797M4806L3555J0766l1854m9778
11996C72906k5374l9148j0603J2145M0940L56m7895o2144n4357m0114j1524l377
11984A31811l930k8597l800K282o894j597K2221M1843N7305M1558M9832N2884
$$ plain form
11972 354918 391315 383134 334413 264052 196501 151869 139501 124533 96438 65045 56343 63820
11960 63820 68882 87747 112781 141027 135491 121947 96403 68651 34549 30678 23081 26630 29175
11947 29175 36970 32789 67367 78951 68059 70192 81284 65701 53807 30609 15494 13065
11935 13065 -6934 -14557 11675 20079 21857 17789 6697 16292 20501 17865 30106 22274 4639
11922 4639 -15803 -18950 -15694 -16380 -12384 9261 29831 49989 37527 17014 24771 31763 21104
11909 21104 13995 22853 17703 2661 4595 18905 27470 16725 3865 2938 20295 35518 17969
11896 17969 442 -8281 -14263 -30447 -36907 -30529 -18332 -12195 12541 -1705 -2301 12803 10815
11883 10815 7172 -17058 -20694 -13966 -1294 -4544 -10457 -3133 -3319 -5346 -10387 -20980 -20101 -3902
$$ packed form
11972C54918L6397q181m8721p0361o7551m4632j2368j4968k8095l1393q702P477
11960F3820N062J8865K5034K8246n536j3544k5544k7752l4102l871p597L549K545
11947B9175P795m181L4578J1584j0892K133J1092j5583j1894k3198j5115k429
11935A3065j9999p623K6232Q404J778m068j1092R595M209k636J2241p832j7635
11922D639k0442l147L256o86L996K1645K0570K0158j2462k0513P757O992j0659
11909B1104p109Q858n150j5042J934J4310Q565j0745j2860r27J7357J5223j7549
11896A7969j7527q723n982j6184o460O378J2197O137K4736j4246n96J5104j988
11883A0815l643k4230l636O728J2672l250n913P324j86k027n041j0593Q79J6199
$$ plain form
11869 -3902 10489 6280 4285 -2973 -16037 1755 2797 -8281 4200 30002 41754 28142 27211
11856 27211 37880 21404 -8434 4434 15486 13401 22769 30747 31709 21379 3622 -8821 -14521
11843 -14521 -6917 -10485 -23183 -28994 -16923 -6318 14143 28926 21513 20947 36554 20223 -2525
11830 -2525 -9829 -6417 -1015 3342 12298 2890 2043 -5153 4085 6274 -4266 -11971 -14742 10839
11816 10839 29029 27548 17789 5465 7519 7020 -1606 -26929 -30987 -23158 -16492 -4278 13571
11803 13571 5681 3864 5235 15270 17902 -18207 -30315 -28298 -36998 -48143 -57594 -49424 -25384
11790 -25384 -30264 -15666 80 -6012 -14638 -8703 10394 7955 6734 1074 94 7846 10441 16783
$$ packed form
11869c902J4391m209j995p258j3064J7792J042j1078J2481K5802J1752j3612r31
11856B7211J0669j6476k9838J2868J1052k085R368P978R62j0330j7757j2443n700
11843a4521P604l568j2698n811J2071J0605K0461J4783p413n66J5607j6331k2748
11830b525p304L412N402M357Q956r408q47p196R238K189j0540p705k771K5581
11816A0839J8190j481r759j2324K054m99q626k5323m058P829O666J2214J7849
11803A3571p890j817J371J0035K632l6109j2108K017q700j1145r451Q170K4040
11790b5384m880J4598J5746o092q626N935J9097k439j221n660r80P752K595O342
$$ [...]
##END NTUPLES=NMR SPECTRUM
##END=
