##TITLE=Analysis number 317590
Compound Code cc 49963
Book Reference 458/98
Project Code qc-cat
Chemist Name stevem
##JCAMPDX= 6.0         $$ Bruker NMR JCAMP-DX V2.0
##DATA TYPE= NMR SPECTRUM
##DATA CLASS= NTUPLES
##ORIGIN= Bruker BioSpin GmbH
##OWNER= nmr
$$ XWIN-NMR		Version 3.5
$$ Fri Feb 24 12:17:59 2006 GMT Standard Time (UT+0h)  MAYBRIDGE\nmr@NMR_250MHZ
##.OBSERVE FREQUENCY= 250.131544655141
##.OBSERVE NUCLEUS= ^1H
##.ACQUISITION MODE= SIMULTANEOUS (DQD)
##.ACQUISITION SCHEME= undefined
##.AVERAGES= 16
##.DIGITISER RES= 18
##SPECTROMETER/DATA SYSTEM= dpx250
##.PULSE SEQUENCE= zg30
##.SOLVENT NAME= DMSO
##.SHIFT REFERENCE= (INTERNAL, DMSO, 0, 16.522)
##AUDIT TRAIL= $$ (NUMBER, WHEN, WHO, WHERE, WHAT)
$$ ##TITLE= Audit trail, XWIN-NMR		Version 3.5
$$ ##JCAMPDX= 5.01
$$ ##ORIGIN= Bruker BioSpin GmbH
$$ ##OWNER= nmr
$$ C:\u/data/dgb/nmr/ADRS/16860/pdata/1/auditp.txt
$$ ##AUDIT TRAIL=  $$ (NUMBER, WHEN, WHO, WHERE, WHAT)
(   1,<2006-02-24 12:17:37.63 +000>,<MAYBRIDGE\nmr>,<NMR_250MHZ>,
      <created by zg, POWCHK disabled, PULCHK disabled
       configuration hash MD5:
       84 BC 41 DB A1 6E 1D 46 DA 25 12 A5 C1 ED C5 3A
       data hash MD5: 64K
       BB CB 0A 65 13 B2 52 BC 75 2E 62 61 FE 93 1F E2>)
(   2,<2006-02-24 12:17:50.10 +000>,<MAYBRIDGE\nmr>,<NMR_250MHZ>,
      <Start of raw data processing
       ef LB = 0.3 FT_mod = 6 PKNL = 1 SI = 32K 
       data hash MD5: 32K
       BE 0F F8 70 BA AF B7 2B C1 C9 82 73 C8 19 89 69>)
(   3,<2006-02-24 12:17:51.80 +000>,<MAYBRIDGE\nmr>,<NMR_250MHZ>,
      <apk 
       data hash MD5: 32K
       DF 96 F3 08 45 0A F7 52 AF B2 29 58 A7 95 84 CD>)
(   4,<2006-02-24 12:17:52.55 +000>,<MAYBRIDGE\nmr>,<NMR_250MHZ>,
      <abs ABSG = 5 
       data hash MD5: 32K
       53 68 11 61 5F 69 62 10 67 08 BA 90 77 88 23 A1>)
$$ ##END=
$$ 
$$ hash MD5
$$ 62 85 E3 26 F6 E5 62 41 5C 22 E9 41 86 D4 DC A0
##$RELAX= 
##$RELAX= 
##$RELAX= 
##$RELAX= 
##$RELAX= 
##$RELAX= 
##$RELAX= 
$$ Bruker specific parameters
$$ --------------------------
##$DU= <C:\u>
##$EXPNO= 16860
##$NAME= <ADRS>
##$PROCNO= 1
##$TYPE= <nmr>
##$USER= <dgb>
##$AMP= (0..31)
100 100 100 100 100 100 100 100 100 100 100 100 100 100 100 100 100 100 
100 100 100 100 100 100 100 100 100 100 100 100 100 100 
##$AQSEQ= 0
##$AQ_mod= 3
##$AUNM= <au_zg>
##$AUTOPOS= <27 >
##$BF1= 250.13
##$BF2= 250.13
##$BF3= 250.13
##$BF4= 250.13
##$BF5= 500.13
##$BF6= 500.13
##$BF7= 500.13
##$BF8= 500.13
##$BYTORDA= 1
##$CFDGTYP= 0
##$CFRGTYP= 5
##$CHEMSTR= <none>
##$CNST= (0..31)
1 1 145 1 1 1 1 1 1 1 1 1 1 1 1 1 1 1 1 1 1 1 1 1 1 1 1 1 1 1 1 1 
##$CPDPRG= <>
##$CPDPRG1= <>
##$CPDPRG2= <>
##$CPDPRG3= <>
##$CPDPRG4= <mlev>
##$CPDPRG5= <mlev>
##$CPDPRG6= <mlev>
##$CPDPRG7= <mlev>
##$CPDPRG8= <mlev>
##$CPDPRGB= <>
##$CPDPRGT= <>
##$D= (0..31)
0 1 0 0 0 0 0 0 0 0.06 0 0 0 0 0 0 0.0002 0 0 0 0 0 0 0 0 0 0 0 0 0 0 
0 
##$DATE= 1140783456
##$DBL= (0..7)
120 120 120 120 120 120 120 120 
##$DBP= (0..7)
150 150 150 150 150 150 150 150 
##$DBP07= 0
##$DBPNAM0= <>
##$DBPNAM1= <>
$$ [...]
##$SUBNAM7= <"">
##$SUBNAM8= <"">
##$SUBNAM9= <"">
##$SW= 20.6930455092707
##$SWIBOX= (0..15)
0 0 3 0 0 0 0 0 0 0 0 0 0 0 0 0 
##$SW_h= 5175.983436853
##$TD= 65536
##$TD0= 1
##$TE= 293.16
##$TE2= 300
##$TE3= 300
##$TEG= 300
##$TL= (0..7)
0 120 120 120 120 120 120 120 
##$TP= (0..7)
150 150 150 150 150 150 150 150 
##$TP07= 0
##$TPNAME0= <>
##$TPNAME1= <>
##$TPNAME2= <>
##$TPNAME3= <>
##$TPNAME4= <>
##$TPNAME5= <>
##$TPNAME6= <>
##$TPNAME7= <>
##$TPOAL= (0..7)
0.5 0.5 0.5 0.5 0.5 0.5 0.5 0.5 
##$TPOFFS= (0..7)
0 0 0 0 0 0 0 0 
##$TUNHIN= 0
##$TUNHOUT= 0
##$TUNXOUT= 0
##$USERA1= <user>
##$USERA2= <user>
##$USERA3= <user>
##$USERA4= <user>
##$USERA5= <user>
##$V9= 5
##$VALIST= <valist>
##$VCLIST= <CCCCCCCCCCCCCCC>
##$VD= 0
##$VDLIST= <DDDDDDDDDDDDDDD>
##$VPLIST= <PPPPPPPPPPPPPPP>
##$VTLIST= <TTTTTTTTTTTTTTT>
##$WBST= 1024
##$WBSW= 4
##$XGAIN= (0..3)
0 0 0 0 
##$XL= 0
##$YL= 0
##$YMAX_a= 252802
##$YMIN_a= -375508
##$ZGOPTNS= <>
##$ZL1= 120
##$ZL2= 120
##$ZL3= 120
##$ZL4= 120
##$ABSF1= 16.522
##$ABSF2= -4.171173
##$ABSG= 5
##$ABSL= 3
##$ALPHA= 0
##$AQORDER= 0
##$ASSFAC= 0
##$ASSFACI= 0
##$ASSFACX= 0
##$ASSWID= 0
##$AUNMP= <proc_1d>
##$AZFE= 0.1
##$AZFW= 0.1
##$BCFW= 0
##$BC_mod= 0
##$BYTORDP= 0
##$COROFFS= 0
##$CY= 12.5
##$DATMOD= 1
##$DC= 0
##$DFILT= <>
##$DTYPP= 0
##$F1P= 14.0000005364418
##$F2P= -0.99999901652339
##$FCOR= 0.5
##$FTSIZE= 32768
##$FT_mod= 6
##$GAMMA= 0
##$GB= 0
##$INTBC= 1
##$INTSCL= 1
##$ISEN= 128
##$LB= 0.3
##$LEV0= 0
##$LPBIN= 0
##$MAXI= 10000
##$MC2= 0
##$MEAN= 0
##$ME_mod= 0
##$MI= 0
##$NCOEF= 0
##$NC_proc= -4
##$NLEV= 6
##$NOISF1= 0
##$NOISF2= 0
##$NSP= 0
##$NTH_PI= 0
##$NZP= 0
##$OFFSET= 16.522
##$PC= 1
##$PHC0= 240.3061
##$PHC1= 7.914719
##$PH_mod= 1
##$PKNL= yes
##$PPARMOD= 0
##$PSCAL= 4
##$PSIGN= 0
##$REVERSE= no
##$SF= 250.13
##$SI= 32768
##$SIGF1= 0
##$SIGF2= 0
##$SINO= 400
##$SIOLD= 32768
##$SREGLST= <1H.DMSO>
##$SSB= 0
##$STSI= 32768
##$STSR= 0
##$SW_p= 5175.98343685301
##$SYMM= 0
##$S_DEV= 0
##$TDeff= 65536
##$TDoff= 0
##$TI= <Analysis number 999999
Compound Code 99
Book Reference 9
Project Code 9>
##$TILT= no
##$TM1= 0
##$TM2= 0
##$TOPLEV= 0
##$USERP1= <user>
##$USERP2= <user>
##$USERP3= <user>
##$USERP4= <user>
##$USERP5= <user>
##$WDW= 1
##$XDIM= 32768
##$YMAX_p= 336571508
##$YMIN_p= -445518
$$ End of Bruker specific parameters
$$ ---------------------------------
##NTUPLES= NMR SPECTRUM
##VAR_NAME=  FREQUENCY,     SPECTRUM/REAL,   SPECTRUM/IMAG
##SYMBOL=    X,             R,               I
##VAR_TYPE=  INDEPENDENT,   DEPENDENT,       DEPENDENT
##VAR_FORM=  AFFN,          ASDF,            ASDF
##VAR_DIM=   32768,         32768,           32768
##UNITS=     HZ,            ARBITRARY UNITS, ARBITRARY UNITS
##FACTOR=    0.157963299565203, 1,           1
##FIRST=     4132.6476996994, 0,             0
##LAST=      -1043.33573715361, 0,           0
##MIN=       -1043.33573715361, -445518,     0
##MAX=       4132.6476996994, 336571508,     0
$$ Real data points
##PAGE= N=1
##DATA TABLE= (X++(R..R)), XYDATA
$$ [...]
17341C98814R6580K0672m5031m6554J2916J4332p8684j13863p5048N5400n5544
$$ 398814 495394 516066 471035 424481 437397 451729 373045 259182 184134 239534 183990
17330A83990J00636P1619j49743j41459O6200Q7663J3756m5528j41991j4148J9058
$$ 183990 284626 356245 206502 65043 131243 218906 232662 187134 45143 30995 50053
17319E0053m5916K5712j842J0297P8676j274K604k05m5013p6931L8117P9437M6650
$$ 50053 4137 29849 28007 38304 116980 115706 118310 118105 73092 -3839 34278 113715 160365
17306A60365k9955r0690M4669K2848Q966J06875N1615K7439L383j6117O9294k2545
$$ 160365 130410 39720 84389 107237 116203 223078 274693 302132 305515 289398 358692 336147
17294C36147q6316o4698J51816k0247j51084N4460l5353j29353m091j0745Q4701
$$ 336147 249831 185133 336949 316702 165618 220078 184725 55372 51281 40536 125237
17283A25237K05841O2938j12324o2493k9771L6527L5683K7905r7696P0368K6910
$$ 125237 331078 394016 281692 219199 189428 225955 261638 289543 191847 262215 289125
17272B89125j59072p1878K285k0248k4488J11958J63490l3059j28718k5310K5393
$$ 289125 130053 58175 60460 40212 15724 127682 291172 258113 129395 104085 129478
17261A29478R0566r6554j70192Q7155N8976p995P6718Q3165n7124R3337r9306
$$ 129478 220044 123490 -46702 40453 99429 91434 168152 251317 194193 287530 188224
17250A88224j08321l6030m1337l3733n8984j22654O5377K01618j1550K2817R745
$$ 188224 79903 43873 2536 -31197 -90181 -212835 -147458 54160 42610 65427 75172
17239G5172p7660N6737m9630K0725L4376O4847k3466K5668N5405K3653r7771n067
$$ 75172 -2488 54249 4619 25344 59720 124567 101101 126769 182174 205827 108056 102989
17227A02989l8048m8842o5455J11673Q6974m463l3428q9292R720n3625o5029p423
$$ 102989 64941 16099 -49356 62317 149291 144828 111400 22108 31828 -21797 -86826 -94249
17215i4249j8194j7136J05698O1198n5940J04491N5642n3716N5518j86745p7822
$$ -94249 -112443 -129579 -23881 37317 -18623 85868 141510 87794 143312 -43433 -121255
17204a21255j3692K00293J37887j43053p1884o6489P268L8619J7587N8023n5776
$$ -121255 -134947 65346 203233 60180 -11704 -78193 -70925 -32306 -14719 43304 -12472
17193a2472l9417M7926J04180J0522M4416p0220l2803N1915n2355j07312M0754
$$ -12472 -51889 -3963 100217 110739 155155 84935 52132 104047 51692 -55620 -14866
17182a4866J0025j13047L8619K35078M5756j08647N3458K2338p7421k5158N3106
$$ -14866 -4841 -117888 -79269 155809 201565 92918 146376 168714 91293 66135 119241
17171A19241j3559q3780o4900J01433O1618l4632q7800n9784J07541J00055l7850
$$ 119241 105682 21902 -42998 58435 120053 85421 -2379 -62163 45378 145433 107583
17160A07583r8328p1414J02397P2253k3950J0539m8875n1181N0658j03256J0425
$$ 107583 9255 -62159 40238 112491 88541 99080 50205 -976 49682 -53574 -43149
17149d3149Q1184J6327p0046k4310J28739J0005j55270K046J34554n1613m9236
$$ -43149 38035 54362 -15684 -39994 88745 98750 -56520 -54474 80080 28467 -20769
17138b0769K5075J14022n8573p0066J70410n8001j06451P1901K6083o4717L4061
$$ -20769 4306 118328 59755 -10311 160099 102098 -4353 67548 93631 28914 62975
17127F2975l743r3533O9915n7101k1056P4008J6380j3272l0938j19472j47862
$$ 62975 59232 -34301 35614 -21487 -42543 31465 47845 34573 3635 -115837 -263699
17116b63699L7994J00456R6954m9996m813O2663L9226M5864L8655j3372j08213
$$ -263699 -225705 -125249 -28295 -78291 -83104 -20441 18785 64649 103304 89932 -18281
17105a8281n8964l5216n123J46949j383j1590j05161l7628o932Q3057J45861M3309
$$ -18281 -77245 -112461 -117584 29365 27982 16392 -88769 -126397 -133329 -50272 95589 138898
17093A38898m2985P7366L8134j8396l7441K710P5433M4445n7707j3664P433k7837
$$ 138898 95913 173279 211413 193017 155576 158286 233719 278164 220457 206793 214226 186389
17081A86389L8532j2721o5406r0578o9326j6695J13253K1496j41420l6176m2184
$$ 186389 224921 212200 146794 56216 -13110 -29805 83448 104944 -36476 -72652 -114836
17070a14836Q8348J19815J16377M6244n8074k37672L316M7962K3105N5142N473
$$ -114836 -26488 93327 209704 255948 197874 -39798 -36482 11480 34585 89727 95200
17059I5200j12738n9396J6831O9872P7401P1362O9793M7406l7536p5936j28712
$$ 95200 -17538 -76934 -60103 9769 87170 158532 228325 275731 238195 162259 33547
17048C3547p4641o7792m0676l6675P8294K3531k6942l2847j12007l918J35251
$$ 33547 -41094 -108886 -149562 -186237 -107943 -84412 -111354 -144201 -256208 -260126 -124875
17037a24875J4653M0693N4141J16842j03805j82531R472Q0370j9969k706j2649
$$ -124875 -110222 -69529 -15388 101454 -2351 -184882 -175410 -95040 -115009 -117715 -130364
17026a30364N516o06J30538O5349q0898p5848j1987J10480m4338n2448O2244K2790
$$ -130364 -124848 -125454 5084 70433 -10465 -86313 -98300 12180 -32158 -84606 -22362 428
17014D28N1436j48p1573j7682M9594O4184K4712l0569K8096J15823J4933k9701
$$ 428 51864 51716 -19857 -37539 12055 76239 100951 70382 98478 214301 229234 199533
17002A99533N1517m4158o4826m5041k4033o4684J3899P1453o1884l0291N1937
$$ 199533 251050 206892 142066 97025 72992 8308 22207 93660 31776 1485 53422
16991E3422k1314P20O7146J3733j14078j55449Q1278J33207j36623j85845P3757
$$ 53422 32108 32828 99974 113707 -371 -155820 -74542 58665 -77958 -263803 -190046
16980a90046J02011L5923m0159l2159N1332P7555p022Q5407M9871j44585j50852
$$ -190046 -88035 -52112 -92271 -124430 -73098 4457 -2565 82842 132713 -11872 -162724
16969a62724L681J26228L2918J9228N2316O982o8646q4532K1204J55844n9213
$$ -162724 -159043 -32815 103 19331 71647 78629 9983 -74549 -53345 102499 43286
16958D3286P475k7740j40451j5979J24188J37903J9057k5290j2007j17586r7780
$$ 43286 50761 23021 -117430 -133409 -9221 128682 147739 122449 110442 -7144 -104924
16947a04924J13349l7755n1806Q0082J51456N5178l3272o9961n2637J9726O6608
$$ -104924 8425 -29330 -81136 -1054 150402 205580 172308 102347 49710 69436 136044
16936A36044R2619P021r7605j2469N029q6240q221j09118o4928O4100J45946J7689
$$ 136044 228663 235684 138079 125610 130639 44399 36178 -72940 -137868 -73768 72178 89867
16924H9867J44062j6532j5460o0376k7403q3948m7135J26188k5447p0612K7116
$$ 89867 233929 217397 201937 141561 114158 30210 -16925 109263 83816 13204 40320
16913D0320J3781p3253M5711P9249k1341L4590J29953n4879j13041k5194R5473
$$ 40320 54101 -19152 26559 105808 84467 119057 249010 194131 81090 55896 151369
16902A51369K24777L3790j78389M530O878j42919o5964k7409N0487r3030l2865
$$ 151369 376146 409936 231547 236077 242955 100036 34072 6663 57150 -35880 -68745
16891f8745J28671J45618k3404N7765m8982j07134N7918O717L1433J9088o5782
$$ -68745 59926 205544 182140 239905 190923 83789 141707 148424 179857 198945 133163
16880A33163m4467j03300J3082K5951J4612K0158J37092j9138J11431N811r1098
$$ 133163 88696 -14604 -1522 24429 39041 59199 196291 177153 288584 294395 203297
16869B03297r3314j90047p7837p3152j06486J10061L07893J68788q8796j20406
$$ 203297 109983 -80064 -157901 -231053 -337539 -227478 80415 249203 160407 40001
16859D0001O0736n0894P879R6620J6720Q178j95613m4262r572j15803J4585o2593
$$ 40001 100737 49843 57722 154342 171062 179240 -16373 -60635 -70207 -186010 -171425 -234018
16847b34018j46245k2408R9711J36852K8012O5951m838p6297m4124O9982k5315
$$ -234018 -380263 -402671 -302960 -166108 -138096 -72145 -76983 -153280 -197404 -127422 -152737
16836a52737L3033j0325O8657O5545m4063n1994p6516M3152N2326j08451l8256
$$ -152737 -119704 -130029 -61372 4173 -39890 -91884 -168400 -125248 -72922 -181373 -219629
16825b19629j2805j6148l5140P3369R594Q6377Q7500J19124J0549q4185j02978
$$ -219629 -232434 -248582 -283722 -210353 -200759 -114382 -26882 92242 102791 18606 -84372
16814h4372m3566O7446J737j3578O40N9677j5849o4298m5841J0276M9781J8530
$$ -84372 -127938 -60492 -58755 -72333 -71693 -12016 -27865 -92163 -138004 -127728 -77947 -59417
16802e9417P612M5789n2758L7761Q9119j0009m8856N4553m4676j59518o0600P9674
$$ -59417 -51805 -6016 -58774 -21013 68106 58097 9241 63794 19118 -140400 -201000 -121326
16790a21326p9248N0282J87666k9821j14392j32300O1954L7751M8152j5146n2050
$$ -121326 -200574 -150292 37374 7553 -106839 -239139 -177185 -139434 -91282 -106428 -158478
16779a58478M3983K5487Q8193o766L5705j06068q7716O7038L3052N5560J7996
$$ -158478 -114495 -89008 -815 -7581 28124 -77944 -165660 -98622 -65570 -10010 7986
16768G986q6954j6483q4270j37526N3283m177k6115R9917J63109o0076p6430J1984
$$ 7986 -78968 -95451 -179721 -317247 -263964 -268141 -294256 -194339 -31230 -91306 -167736 -155752
16756a55752J30609J40586k7943q3002j17829l3559K4409R3499J1870N6941J33724
$$ -155752 -25143 115443 87500 4498 -113331 -146890 -122481 -28982 -17112 39829 173553
16745A73553r7662P307L7941k83q7101m6689r493j6433P5035r1513p2598o7915
$$ 173553 75891 83198 121139 120856 33755 -12934 -22427 -38860 36175 -55338 -127936 -195851
16733a95851j1508O0499P300O0425L6206J07520O3107p8446n4003m0231L8200
$$ -195851 -207359 -146860 -139560 -79135 -42929 64591 127698 49252 -4751 -44982 -6782
16722f782N935m2685L6232j3106j04520L4590L9032M5697J7758P4680J45481M7100
$$ -6782 -847 -43532 -7300 -20406 -124926 -90336 -51304 -5607 12151 86831 232312 279412
16710B79412q7865j7177j04738j16760j34782M9598k4941j61250K207J5676j8911
$$ 279412 191547 174370 69632 -47128 -181910 -132312 -157253 -318503 -316296 -300620 -319531
16699c19531J33936Q0295o7825q3910K9895m9500O1351J20693M2263m9305M9407
$$ -319531 -185595 -105300 -173125 -257035 -227140 -276640 -215289 -94596 -52333 -101638 -52231
16688e2231K6098J12203N5512J5890l3372k8561k1100M0724N0408q7775j37146
$$ -52231 -26133 86070 141582 157472 124100 95539 74439 115163 165571 77796 -59350
16677e9350K3762J9992m1487K8074Q1212N9764J2373K5597q7580j03458q2439
$$ -59350 -35588 -15596 -57083 -29009 52203 111967 124340 149937 62357 -41101 -123540
16666a23540m1955o5682J11547N9069J8523j7591m4372o6824n3830R6276J3220
$$ -123540 -165495 -231177 -119630 -60561 -42038 -59629 -104001 -170825 -224655 -128379 -115159
16655a15159j4519M3800L6836P8238J36098j61493j57419L8030L4953L5594o5104
$$ -115159 -129678 -85878 -49042 29196 165294 3801 -153618 -115588 -80635 -45041 -110145
16644a10145J08858K0452p6844j5170k9464K7574k013M2279j29859q3650O0714
$$ -110145 -1287 19165 -57679 -72849 -102313 -74739 -76752 -34473 -164332 -247982 -187268
16633a87268K336k5040k7474J15019J94396k2176r8856O226J17809k4286l2389
$$ -187268 -184932 -209972 -237446 -122427 71969 49793 -49063 -42837 74972 50686 18297
16622A8297j45816j02228Q2711O0880r261K6396J11727N2696M4217N2612n4237
$$ 18297 -127519 -229747 -147036 -86156 -95417 -69021 42706 95402 139619 192231 137994
16611A37994j23713k6924L6340l2700l7944j1155j9519o3137n7342J35634J89740
$$ 137994 14281 -12643 23697 -9003 -46947 -58102 -77621 -140758 -198100 -62466 127274
16600A27274m7019p4802K4907P3057N4858J05897q6018k51801J3395j5874L3500
$$ 127274 80255 5453 30360 103417 158275 264172 178154 -73647 -60252 -76126 -42626
16589d2626j8292k3810J36721j13727r5529m7688J16333P1542N7277k30k21113
$$ -42626 -60918 -84728 51993 -61734 -157263 -204951 -88618 -17076 40201 39971 -181142
16578a81142o2480R1182M6265J0952M5785p5473j3798O6942j6637o4947L249l7809
$$ -181142 -243622 -152440 -106175 -95223 -49438 -124911 -138709 -71767 -88404 -153351 -150102 -187911
16566a87911o202J27599N5571J1397k9369m349j4288j04549K31J6091p7422j6649
$$ -187911 -194113 -66514 -10943 454 -28915 -33264 -47552 -152101 -151870 -135779 -213201 -229850
16554b29850l2214k6168J62934J15352J0220l9069L8489P2400N6698M924k41289
$$ -229850 -262064 -288232 -125298 -9946 274 -38795 -306 72094 128792 133716 -107573
16543a07573R110J89264J3566j27763j26135K0820J0373N8834K9270M5063o6142
$$ -107573 -98463 90801 104367 -23396 -149531 -128711 -118338 -59504 -30234 14829 -51313
16532e1313M7640P122j009j4784Q2426m6955p1693N9920J5303j0765j4462j9466
$$ -51313 -3673 3449 2440 -12344 70082 23127 -48566 11354 26657 15892 1430 -18036
16520a8036l1877J58002L8829o6869j7464p76p3644n3324N9110K9843O9175j2495
$$ -18036 -49913 108089 146918 80049 62585 61809 -11835 -65159 -6049 23794 92969 80474
16508H0474Q818j01014j25292n1742K19593M3550k6812j1547M9244j35706j31369
$$ 80474 89292 -11722 -137014 -188756 30837 74387 47575 36028 85272 -50434 -181803
16497a81803P7201m7172l6240N5279j8464J51011J12090O7911N380k5409j2453
$$ -181803 -104602 -151774 -188014 -132735 -151199 -188 111902 179813 185193 159784 147331
16486A47331j60154m9269j00223P2653J09090p871p802K766M0563LO546R4547
$$ 147331 -12823 -62092 -162315 -89662 19428 11557 3755 6521 47084 47087 53633 148180
16474A48180J8401j6861J0926q2573k6929O1252J3055n4271q253j4132J6375k5869
$$ 148180 166581 149720 160646 78073 51144 112396 125451 71180 62927 48795 65170 39301
16462C9301J7343R3482p4533m7864k0282J4868L637p2409O3685P21J37885Q527
$$ 39301 56644 150126 75593 27729 7447 22315 25952 -46457 17228 17949 155834 164361
16450A64361p3695k4843L833m9596R846n7888k0877N8387R0428Q157l3272q132
$$ 164361 90666 65823 69656 20060 29906 -27982 -48859 9528 99956 108113 74841 66709
16438F6709r4865j69366o5863n904M6479k452Q4101N0774j2107k1916j3312p9518
$$ 66709 -28156 -197522 -263385 -269289 -222810 -225262 -141161 -90387 -102494 -124410 -137722 -217240
16426b17240K5389j9741J50615J21003j00872K347R5026o082l8635j1849o0144
$$ -217240 -191851 -211592 -60977 60026 -40846 -38499 56527 50445 11810 -39 -60183
16415f0183N5650o7027l0597l6413M0870J629j8504N7794M1413r2318M3305P7372
$$ -60183 -4533 -71560 -102157 -138570 -97700 -96071 -114575 -56781 -15368 -107686 -64381 12991
16403A2991k0348p6382m8834j29450N0693J16907J50620M3407j31561r700Q6383
$$ 12991 -7357 -83739 -132573 -262023 -211330 -94423 56197 99604 -31957 -41657 44726
16392D4726p2906j23926p4081M0249p28Q7588R559q5758N4175O1878O7119P6m4373
$$ 44726 -28180 -152106 -226187 -185938 -186666 -99078 -89519 -175277 -121102 -59224 7895 7971 -36402
16379c6402M1192n3172m4808k5726P2799O3055n0101P116L4976n526l8270k276
$$ -36402 4790 -48382 -93190 -118916 -46117 16938 -33163 -26047 8929 3403 -34867 -37143
16367c7143M638m2108M9029N2356k5479m4312j05221R6789L1983n4515n7074R8636
$$ -37143 -32505 -74613 -25584 26772 1293 -43019 -148240 -51451 -19468 -73983 -131057 -32421
16355c2421M0855n9476p4311o5993j9415R2168Q1482J31026K2503j45164r1176
$$ -32421 8434 -51042 -125353 -191346 -210761 -118593 -37111 93915 116418 -28746 -119922
16344a19922J38676R7957j1958O4255L188r6727l8714J28636P7274J1015n8417
$$ -119922 18754 116711 104753 169008 172196 75469 36755 165391 242665 253680 195263
16333A95263q1665o6197m1485m5000N1956N6576O744K8995l8381j32931L4332
$$ 195263 113598 47401 5916 -39084 12872 69448 76192 105187 66806 -66125 -31793
16322c1793l7253n1355l3416R2077L3566l946J08139r631l9882k4357L0113J22266
$$ -31793 -69046 -120401 -153817 -61740 -28174 -32120 76019 66388 26506 2149 32262 154528
16310A54528J01128l7839r305o1840k30725m8682O0207n7772J2127O6744l4574
$$ 154528 255656 217817 208512 146672 -84053 -132735 -72528 -130300 -118173 -51429 -86003
16299h6003r784J09496O2698q80o1261j44449p9851R4019P0648O7690n8784k1178
$$ -86003 -95787 13709 76407 75527 14266 -130183 -210034 -116015 -45367 22323 -36461 -57639
16287e7639N8972o5717m2433k4296j1481N8979M4290j0503L0645M6352k6701j06084
$$ -57639 1333 -64384 -106817 -131113 -142594 -83615 -39325 -49828 -19183 27169 468 -105616
16275a05616j05588k6966j6493J8721J29918Q6199n1498J69004r551p3155j05811
$$ -105616 -211204 -238170 -254663 -235942 -106024 -19825 -71323 97681 88130 14975 -90836
16264i0836p8444N4270k8093N9209J28180R403L7029k5351o6685m8352O1316m9936
$$ -90836 -169280 -115010 -143103 -83894 44286 53689 90718 65367 -1318 -49670 11646 -38290
16252c8290p5114P8120l8670j2627J08689N3696q4779j3106K8899j19114r9181
$$ -38290 -113404 -35284 -73954 -86581 22108 75804 -8975 -22081 6818 -112296 -211477
16241b11477J32410J87302J68753m3024L2124n7072q8638r6803j09157l354p0881
$$ -211477 -79067 108235 276988 233964 266088 209016 120378 23575 -85582 -88936 -159817
16230a59817k6677K805J24436O5406Q7741m7494l8748n6446r1408J36609J04440
$$ -159817 -186494 -183689 -59253 6153 93894 46400 7652 -48794 -140202 -3593 100847
16219A00847L8363j9701p5884P1935K7877j51146o7002k6275M7028O825k5108
$$ 100847 139210 119509 43625 115560 143437 -7709 -74711 -100986 -53958 -47133 -72241
16208g2241p6933l948J72335K24327M0660j92762l0775r5949l1529P4492j0017
$$ -72241 -149174 -153122 19213 243540 284200 91438 60663 -35286 -66815 7677 -2340
16197b340k3800j522j71373j10885J3184L0287R3667J34072J00944N0642n5543
$$ -2340 -26140 -27662 -199035 -309920 -296736 -266449 -172782 -38710 62234 112876 57333
16186E7333p7477j19862m1657J3093N1380J25323J31562o6989j74348P6583Q8814
$$ 57333 -20144 -140006 -181663 -168570 -117190 8133 139695 72706 -101642 -25059 63755
16175F3755N9635q1921n5049o1275j9656N0611J3187L3304K0769j5906R822L8888
$$ 63755 123390 41469 -13580 -74855 -94511 -43900 -30713 2591 23360 7454 17276 56164
16163E6164j3154p1506q0184j54556k696J45696N6687O0910J1760M6819r9393
$$ 56164 43010 -28496 -108680 -263236 -265932 -120236 -63549 -2639 9121 55940 -43453
16152d3453N1172J3153j5359l8939q1380O0882j7742k9029K7290K895R8967J3666
$$ -43453 7719 20872 5513 -33426 -114806 -53924 -71666 -100695 -73405 -70510 28457 42123
16140D2123M8475n7157j12878m7946J36253K2720L6849l9488j20294Q1091j2281
$$ 42123 90598 33441 -79437 -127383 8870 31590 68439 28951 -91343 -10252 -22533
16129b2533j4499j01295j00131L6095J39797J92505J09053l8850j38556j69877
$$ -22533 -37032 -138327 -238458 -202363 -62566 129939 238992 200142 61586 -108291
16119a08291j784N7788j3700j28720l7176P1894R7924L6918q761l7467o6400J49977
$$ -108291 -110075 -52287 -65987 -194707 -231883 -159989 -62065 -25147 -33908 -71375 -137775 12202
16107A2202J07931o3334j80297k6184L5315l1578Q1202R4517R5862j70011j08753
$$ 12202 120133 56799 -123498 -149682 -114367 -145945 -64743 29774 125636 -44375 -153128
16096a53128K6683o3379K7171k2417Q7632J06627p1415Q891L617q8862M7692J87331
$$ -153128 -126445 -189824 -162653 -185070 -97438 9189 -62226 -53335 -49718 -138580 -90888 96443
16084I6443q1546j73084j35331l4130Q5667L8505q1145M0027k7042l2139M9702
$$ 96443 14897 -158187 -293518 -327648 -241981 -203476 -284621 -244594 -271636 -303775 -254073
16073b54073J02010L2580J05093L0294j59659l1823J31350M2325P7311M420k8828
$$ -254073 -152063 -119483 -14390 15904 -143755 -175578 -44228 -1903 75408 79828 51000
16062E1000q467l676O6947J19314M0791n5616j10014n6713J00820O329k8223k7392
$$ 51000 42533 38857 105804 225118 265909 210293 100279 43566 144386 150715 122492 95100
16050I5100K40O043O9091k3358j17450J6026m759M2919r8864j22733K1575K24680
$$ 95100 95340 101383 170474 147116 29666 45692 40933 83852 -15012 -137745 -116170 108510
16038A08510O1461j48370n0794k5377J50679R8206M167j57485r9421k91N971J475
$$ 108510 169971 21601 -29193 -54570 96109 194315 198482 40997 -58424 -58715 -52744 -51269
16026e1269M491n1130O1824k21M5712Q840P6105L7478j0604m9908o6578n7219
$$ -51269 -46778 -97908 -36084 -36305 9407 18247 94352 131830 121226 71318 4740 -52479
16014e2479r6173k6775J7959K0688l6480N8307o5105j23685J17510R5681k2273
$$ -52479 -148652 -175427 -157468 -136780 -173260 -114953 -180058 -303743 -186233 -90552 -112825
16003a12825L5004P1859j2846l2393j6468L7839K4607m354M4247M9461j09866
$$ -112825 -77821 -5962 -18808 -51201 -67669 -29830 -5223 -9577 34670 84131 -25735
15992b5735l285r478J9477J9746N8135n6952j36486r5279k7735L2205M0475R4089
$$ -25735 -29020 -38498 -19021 725 58860 1908 -134578 -229857 -257592 -225387 -184912 -90823
15980i0823L3885R7784P081j73127p0861J33426N7666o8092p2135m2475J1509
$$ -90823 -56938 40846 47927 -125200 -196061 -62635 -4969 -73061 -145196 -187671 -176162
15969a76162K9329Q2836j12352J13993J25398j5727r0031l2438R0400J17163q5578
$$ -176162 -146833 -63997 -176349 -62356 63042 47315 -42716 -75154 15246 132409 46831
15958D6831j26590N5786j1861K5354N2253L8801p6773j21100o7674K9926L5375
$$ 46831 -79759 -23973 -35834 -10480 41773 80574 3801 -117299 -184973 -155047 -119672
15947a19672K8603K0727n5470p7600N9643P836N5878J20727L8978o3001n2200
$$ -119672 -91069 -70342 -125812 -203412 -143769 -135933 -80055 40672 79650 16649 -35551
15936c5551L0798J59802L4107r8967j12613M92J53580o4422j96982o929o8495
$$ -35551 -4753 155049 189156 90189 -22424 -21932 131648 67226 -129756 -136685 -205180
15925b05180k186M0687P4057M6757N2714J04120M3039j39145j40497K949L0828
$$ -205180 -207366 -166679 -92622 -45865 6849 110969 154008 14863 -125634 -122685 -91857
15914i1857Q3294n190Q6088o736j48386j27539o0959N4761J37109j6838M0799
$$ -91857 -8563 -13753 72335 65599 -82787 -210326 -271285 -216524 -79415 -96253 -55454
15903e5454M5645P2249M8735k9294n7708n6991l0661P5992k9124N6699Q513R6545
$$ -55454 -9809 62440 111175 81881 24173 -32818 -63479 12513 -16611 40088 48601 145146
15891A45146J0779K0888L9689j39559j45637j04535K9997P6946m0069p6060j7856
$$ 145146 155925 176813 216502 76943 -68694 -173229 -143232 -66286 -106355 -182415 -200271
15880b00271Q3830O7256k3254j00928L639P7341q0091n4167M4849O0686n2220
$$ -200271 -116441 -49185 -72439 -173367 -169728 -92387 -172478 -226645 -181796 -121110 -173330
15869a73330L8453L5987L4397k3948k4607o1743N333O0098J61872l3572J51543
$$ -173330 -134877 -98890 -64493 -88441 -113048 -174791 -169458 -109360 52512 18940 170483
15858A70483K0704j30862r8755P4712P0697j22366j79423L6741P6174j8074J33969
$$ 170483 191187 60325 -38430 36282 106979 -15387 -194810 -158069 -81895 -99969 34000
15847C4000m1278p1767J1676J1223L9061J10428N8315k3748n8443J2311j95175
$$ 34000 -7278 -79045 -67369 -56146 -17085 93343 151658 127910 69467 81778 -113397
15836a13397o4096J22012j458j21141K8893k8553m3587k8973K03060M8060N04
$$ -113397 -177493 -55481 -56939 -178080 -149187 -177740 -221327 -250300 -47240 820 1324
15825A324K5282k6127l3848j126p8475o5196j8042P2444J4357k5548J51521n4201
$$ 1324 26606 479 -33369 -34495 -112970 -178166 -196208 -123764 -109407 -134955 16566 -37635
15813c7635m9109o8850r73j9767K2269K2514J0632m0193N3778J07944n655j8838
$$ -37635 -86744 -155594 -156567 -176334 -154065 -131551 -120919 -161112 -107334 610 -5045 -23883
15801b3883j2298l5567M9588N6474j1567J0612N9132O9758N3133o2075o0494k788
$$ -23883 -36181 -71748 -22160 34314 22747 33359 92491 162249 215382 153307 92813 90025
15789I0025l561m5657o0691J3793l6690K4588l7930r4900J4658P9707N9037j7473
$$ 90025 86464 40807 -19884 -6091 -42781 -18193 -56123 -151023 -136365 -56658 2379 -15094
15777a5094L6282k2306o0045n1074n4868k453J04091M2078k997n0902r0363j3303
$$ -15094 21188 -1118 -61163 -112237 -167105 -169558 -65467 -23389 -26386 -77288 -167651 -180954
15765a80954K3871M6118J48701P0972L0130K2882q4214n6288j02195K600J91045
$$ -180954 -157083 -110965 37736 108708 138838 161720 77506 21218 -80977 -78377 112668
15754A12668n8713m2750K3585L907m0547o6629n7704J3018J15833J3144j75143
$$ 112668 53955 11205 34790 38697 -1850 -68479 -126183 -113165 2668 15812 -159331
15743a59331O0490Q1831P3578j8225M260o409q5427q9485J24665P4027N266q1472
$$ -159331 -98841 -17010 56568 38343 42603 36194 -49233 -138718 -14053 59974 65240 -16232
15731a6232n2171j7694O1150N039n4517j8337L6666j07614j631J74922N5458J3970
$$ -16232 -68403 -86097 -24947 -19908 -74425 -92762 -56096 -163710 -165341 9581 65039 79009
15719G9009L1734O4320n1645j31303l1832P2415o4109j21023l387R8493J06193
$$ 79009 110743 175063 123418 -7885 -39717 32698 -31411 -152434 -155821 -57328 48865
15708D8865j12364L3080J7750k6780J06069l7144j9066J9621j01633m8121m5286
$$ 48865 -63499 -30419 -12669 -39449 66620 29476 10410 30031 -71602 -119723 -165009
15697a65009J29111R367K4397j0793j22454n5803j8631j12436k9565J39236J51655
$$ -165009 -35898 -26531 -2134 -12927 -135381 -191184 -209815 -322251 -351816 -212580 -60925
15686f0925L1276j05644j2575J06726J04741J6713j0691P3861N489k806l750n5211
$$ -60925 -29649 -135293 -147868 -41142 63599 80312 69621 143482 148971 146165 142415 87204
15674H7204J1620o3697k093L0107m4221K4028k0420j7834L7388J11965P136j50082
$$ 87204 98824 35127 33034 63141 18920 42948 22528 4694 42082 154047 161183 11101
15662A1101j27521N6426Q3062n0484p1035j303m303L2181K4941J5849j00209j34760
$$ 11101 -116420 -59994 23068 -27416 -98451 -99754 -104057 -71876 -46935 -31086 -131295 -266055
15650b66055M8057n5964N897J32512Q0463j09813k7469j0619J17852k6805j8615
$$ -266055 -217998 -273962 -268065 -135553 -55090 -164903 -192372 -202991 -85139 -111944 -130559
15639a30559N959j0245O5108O5679j718j66496k8138J10595Q9475N2488O2599
$$ -130559 -124600 -134845 -69737 -4058 -5776 -172272 -200410 -89815 -340 52148 114747
15628A14747l056q887o565N4061m3830p2753k727n2009p6537Q9282k171l3202
$$ 114747 111691 102804 96239 150300 106470 33717 30990 -21019 -97556 -8274 -10445 -43647
15616d3647o0275m4216R6037l5127J8010J40591K1434j10468j10197K036L631
$$ -43647 -103922 -148138 -52101 -87228 -69218 71373 92807 -17661 -127858 -125822 -122191
15605a22191R2068j17068j02040Q546L5670M7793o6906N7254R4530O6299m7789
$$ -122191 -30123 -147191 -249231 -240685 -205015 -157222 -224128 -166874 -72344 -6045 -53834
15594e3834l3089k0114R8534J30718J05759n0418j5849j34280j54584o6596m1459
$$ -53834 -86923 -107037 -8503 122215 227974 177556 161707 27427 -127157 -193753 -235212
15583b35212P7393P9128N1089P0310Q3058N4156P2455k46827r4054O1966k5585
$$ -235212 -157819 -78691 -27602 42708 125766 179922 252377 5550 -88504 -26538 -52123
15572e2123q5170P1719p334J74640k3807p3578p741O4370J0234L3931N3279j7742
$$ -52123 -137293 -65574 -72908 101732 77925 4347 -3394 60976 71210 105141 158420 140678
15560A40678j24112j21808l086j5777J05938J42025k3521r0931j06712L7751O2123
$$ 140678 16566 -105242 -108328 -124105 -18167 123858 100337 9406 -97306 -59555 2568
15549B568r8372k6604J6440M8622K5877j03796L3202R0975L3904L6488l3938j19474
$$ 2568 -95804 -122408 -105968 -57346 -31469 -135265 -102063 -11088 22816 59304 25366 -94108
15537i4108J32394R4223M5655P7067n7688j74636n1288M7281j15825p9392r71
$$ -94108 38286 132509 178164 255231 197543 22907 -28381 18900 -96925 -176317 -177288
15526a77288P6637k0090O6049n4208q1710o4012J37300K0846n0828K902N867O5109
$$ -177288 -100651 -120741 -54692 -108900 -190610 -254622 -117322 -96476 -147304 -144402 -138535 -73426
15514g3426O7605p3008m5528p6177K9858L061N1040r9349j04245r2070R0300l755
$$ -73426 -5821 -78829 -124357 -200534 -170676 -167615 -116575 -215924 -320169 -412239 -321939 -325694
15502c25694L0013N5471Q5130N6000O806O8465Q0117k8572j16672j07391N660
$$ -325694 -295681 -240210 -155080 -99080 -92274 -23809 56308 27736 -88936 -196327 -190667
15491a90667M8655L2924l715J13054O7786m1858q1002p4700N20J64692L2861o1765
$$ -190667 -142012 -109088 -112803 251 68037 26179 -54823 -129523 -129003 35689 68550 6785
15479F785n3903p8167q483J45182M625j6314R4843j57604o9585l5699J70992k2331
$$ 6785 -47118 -125285 -133768 11414 16039 -275 94568 -63036 -132621 -168320 2672 -19659
15467a9659o6402m391l109R4023M5949m7154K0905P72O558j62262j09722M5243
$$ -19659 -86061 -90452 -93561 462 46411 -743 20162 20934 27492 -134770 -244492 -199249
15455a99249Q3406K7905P4144o0389j09994J8218K83885J7768j89481j13993p4677
$$ -199249 -115843 -87938 -13794 -74183 -184177 -165959 117926 135694 -53787 -167780 -242457
15444b42457m9057o888J58338J21748o0146l6704Q2651J00050j9145j34360M3971
$$ -242457 -291514 -298402 -140064 -18316 -78462 -115166 -32515 67535 48390 -85970 -41999
15433d1999l1582N2170P4395k8769N296M2179q757j13743l5363N8984K9197J26477
$$ -41999 -73581 -21411 52984 24215 29511 71690 62933 -50810 -86173 -27189 2008 128485
15421A28485J00327l8771r762j11617m1018p7494P4084K9842l5827l3309n4634
$$ 128485 228812 190041 180279 68662 27644 -49850 24234 54076 18249 -15060 -69694
15410f9694q4125k4959k0347J9862n3380o1756L0033K65533J321r0858r268l7107
$$ -69694 -153819 -178778 -199125 -179263 -232643 -294399 -264366 1167 2488 -88370 -97638 -134745
15398a34745q2578j36073J19903J20419N4927m8549j31619o7835l1689N8496J25686
$$ -134745 -217323 -353396 -233493 -113074 -58147 -106696 -238315 -306150 -337839 -279343 -153657
15387a53657J96788Q1465Q749j1569q0972j6764m0997j07394q2270N1163K7723
$$ -153657 43131 124596 133345 121776 40804 24040 -16957 -124351 -206621 -155458 -127735
15376a27735P0214J37497m4867o961K0339J334l0925p7188P3206J18388L5556
$$ -127735 -57521 79976 35109 28148 48487 49821 18896 -58292 14914 133302 168858
15365A68858j00141j85204j85975J29964J35067J32414J4094k3015k2283k1963
$$ 168858 68717 -116487 -302462 -172498 -37431 94983 109077 86062 63779 41816
15355D1816j56127k9122q171k9159Q735J6821Q9801k6944m1566l3837O4909J02928
$$ 41816 -114311 -143433 -151604 -180763 -172028 -155207 -65406 -92350 -133916 -167753 -102844 84
15343H4n8347r2799q8301J03617J09740k0478n5666L0233n0261N2228N3236l5320
$$ 84 -58263 -151062 -239363 -135746 -26006 -46484 -102150 -71917 -122178 -69950 -16714 -52034
15331e2034J3715K1125M80L0023K4981L5188j7643m9303N9550O9176k466m1441
$$ -52034 -38319 -17194 -16714 13309 38290 73478 55835 6532 66082 135258 132792 91351
15319I1351m8263p9031k2891K0274j744O3718o1303j14868O1978O8938L9910K2775
$$ 91351 43088 -35943 -58834 -38560 -40304 23414 -37889 -152757 -90779 -21841 18069 40844
15307D0844m8344O1109M5287l4769n5630j3656N2173p8831j1845Q2170P0974M7962
$$ 40844 -7500 53609 98896 64127 8497 -5159 47014 -31817 -43662 38508 109482 157444
15295A57444L880j12704j30236N0584n2065m479K4598j1230p092Q0140q2713q7747
$$ 157444 161324 48620 -81616 -31032 -83097 -87576 -62978 -74208 -81300 -1160 -83873 -171620
15283a71620O4643R8135J5272o0390M8209N4894l8823p9181n0805q1362n2156
$$ -171620 -106977 -8842 6430 -53960 -5751 49143 10320 -68861 -119666 -201028 -253184
15272b53184n403K1278Q2677J16170R754K1281o0508n4J07668L3272L8335n563
$$ -253184 -258587 -237309 -154632 -38462 -28708 -7427 -67935 -67989 39679 72951 111286 105723
15260A05723j5365L9542R593l867Q593R1900o9929j38694k6824L2554J15253j18140
$$ 105723 90358 129900 139493 135626 144219 236119 166190 27496 672 33226 148479 30339
15248C0339j00738p3718p2832j18115K236J09793N6405r947J9606m8878p502P0594
$$ 30339 -70399 -144117 -216949 -335064 -332828 -223035 -166630 -176577 -156971 -205849 -213351 -142757
15236a42757J17772J37890j21252j74300L2949J27941n6278J666O0963Q2480M5501
$$ -142757 -24985 112905 -8347 -182647 -149698 -21757 -78035 -76369 -15406 67074 112575
15225A12575j947j8734N2129M499q8957K4260J11165m3092j31121j2700q2208
$$ 112575 110628 91894 144023 148522 59565 83825 194990 151898 20777 8077 -74131
15214g4131P428R2418O8561n467L4316r3982n8074k0695l8327L1352O2654M4974
$$ -74131 -66703 25715 94276 88809 123125 29143 -28931 -49626 -87953 -56601 6053 51027
15202E1027l3531O499O2000k4005n1180n3989j13045Q604O5244O8381o0203J53191
$$ 51027 17496 23995 85995 61990 10810 -43179 -156224 -147620 -82376 -13995 -74198 78993
15190G8993Q3700l1829p4430N1392P2584l1181j87850n8637P4370Q7667M8713
$$ 78993 162693 130864 56434 107826 180410 149229 -38621 -97258 -22888 64779 113492
15179A13492K1008m2988Q2754K1830j11194j14832r8631J20212Q7151k0809p7915
$$ 113492 134500 91512 174266 196096 84902 -29930 -128561 -8349 78802 57993 -19922
15168a9922M2801P1582q3792k8467R549o5898K3559O3342J12385j21434n4852
$$ -19922 22879 94461 10669 -17798 -8249 -74147 -50588 12754 125139 3705 -51147
15157e1147Q5180j19639j86873j1186Q9595M861j2186O3362J09888n195K6962
$$ -51147 34033 -85606 -272479 -283665 -194070 -189209 -201395 -138033 -28145 -33340 -6378
15146f378q8970M6212J325J24572o8458j53552k3196J04837J17608j9181m1275
$$ -6378 -95348 -49136 -47811 76761 8303 -145249 -168445 -63608 54000 34819 -6456
15135f456l7935l5606m0045Q5814Q4299J9663O3487j42857j14318O4349P247j5456
$$ -6456 -44391 -79997 -120042 -34228 50071 69734 133221 -9636 -123954 -59605 -52358 -67814
15123f7814M3700j18988J15214J20232N2988m5713L7179n7551l1720M6565P7557
$$ -67814 -24114 -143102 -27888 92344 145332 99619 136798 79247 47527 94092 171649
15112A71649r7322j08531k9899J30264K0010j1650m9946Q512Q3699L0714l6256
$$ 171649 74327 -34204 -64103 66161 86171 74521 24575 33087 116786 147500 111244
15101A11244L9350p0285p015J5443o7092n1853J19777J19608j5200j15470O609
$$ 111244 150594 80309 73294 88737 21645 -30208 89569 209177 193977 78507 85116
15090H5116J3998j295p200j6205k7732n7575r6693n5929J32988J02077m0570J29356
$$ 85116 99114 97819 90619 74414 46682 -10893 -107586 -163515 -30527 71550 30980 160336
15078A60336J2878J6486r9532L1580p5682J951Q371j14636P011j2476j3681P3772
$$ 160336 173214 189700 90168 121748 46066 48017 56388 -58248 -51237 -63713 -77394 -3622
15066c622K0241p9691J36070R8486p8425j27096j4672n1793J8399M822n5058J07711
$$ -3622 16619 -63072 72998 171484 93059 -34037 -48709 -100502 -82103 -77281 -132339 -24628
15054b4628L167K2314K3755o9428j03610Q94N4885J28690Q6403j01922q9219N6441
$$ -24628 -21461 853 24608 -44820 -148430 -147536 -92651 36039 122442 20520 -68699 -12258
15042a2258M5236J3725k465r6116j20405P4395J07303k0131j55238k5742L7024
$$ -12258 32978 46703 44238 -51878 -172283 -97888 9415 -10716 -165954 -191696 -154672
15031a54672J17188j12864J4233J1663p5483N3708R322P2300M2009j56106j3040
$$ -154672 -37484 -150348 -136115 -124452 -199935 -146227 -136905 -64605 -22596 -178702 -191742
15020a91742L9184m4907o4403q25J41572J35896l2057p140q4806m4199n0915J625
$$ -191742 -152558 -197465 -261868 -262693 -121121 14775 -17282 -24422 -109228 -153427 -204342 -202717
15008b02717P7896R2959J03574p2505j171j5594N4427r442O8057p927j29015k48023
$$ -202717 -124821 -31862 71712 -793 -1964 -17558 36869 27427 95484 87557 -41458 -289481
14996b89481l5235R4857J65464J20184j8416k5003N6381O7406r5848m5001P805
$$ -289481 -324716 -229859 -64395 55789 37373 12370 68751 136157 40309 -4692 3113
14985C113o7357K2413L9283j413K196K5668l4050q9857O1187N110j0613j24964
$$ 3113 -64244 -41831 -2548 -3961 -1765 23903 -10147 -100004 -38817 -33707 -44320 -169284
14973a69284K861J10646J62703L6019o2991q8049m6112j39899o6255L9464Q7577
$$ -169284 -166423 -55777 106926 142945 79954 -8095 -54207 -194106 -260361 -220897 -133320
14962a33320J26221m6794j67192M8877j19424j14266R395J40341R3227O060R1335
$$ -133320 -7099 -53893 -221085 -172208 -291632 -405898 -396503 -256162 -162935 -156875 -65540
14951f5540J3579M96j70091J5021J35455O7650o1028j33060o3052J2625J47555
$$ -65540 -51961 -51465 -221556 -206535 -71080 -3430 -64458 -197518 -260570 -247945 -100390
14940a00390J04303N2408J7905j2668n2946j41719N6800P7588l8214j56412P3192
$$ -100390 3913 56321 74226 61558 8612 -133107 -76307 1281 -36933 -193345 -120153
14929a20153J22042j16491j6920J26687J7164P288k5313K1101j5468J04042J71190
$$ -120153 1889 -114602 -131522 -4835 12329 19617 -5696 15405 -63 103979 275169
14918B75169j16343j99699m4698J29443r6466q4420l313J21256k2536q3215J27051
$$ 275169 158826 -40873 -85571 43872 -52594 -137014 -140327 -19071 -41607 -124822 2229
14907B229l3116m7331L3598q6503p9029J16656Q7573l05j78941q9899P8445J05566
$$ 2229 -30887 -78218 -44620 -131123 -210152 -93496 -5923 -6228 -185169 -275068 -196623 -91057
14895i1057J19323K8482o0933j71894r3646Q1295J32582O7142k4688o6884o8567
$$ -91057 28266 56748 -4185 -176079 -269725 -188430 -55848 11294 -13394 -80278 -148845
14884a48845P8006N1918o435n1914K0594P9580L521l2203M4203p0607j21549j7314
$$ -148845 -70839 -18921 -25356 -77270 -56676 22904 26425 -5778 38425 -32182 -153731 -171045
14872a71045P4121M2462l068j4386J4917P3656k0263q9624m9061J5467k6503p1439
$$ -171045 -96924 -54462 -57530 -71916 -56999 16657 -3606 -93230 -142291 -126824 -153327 -224766
14860b24766j2282O8768L9004o306K4847l4721J7574P4924l3280L7207O0759j6297
$$ -224766 -237048 -168280 -129276 -135582 -110735 -145456 -127882 -52958 -86238 -49031 11728 -4569
14848d569j13020j12668K2090Q7576J09092R7604n4540j56451k0132k9451R5450
$$ -4569 -117589 -230257 -208167 -120591 -11499 86105 31565 -124886 -145018 -174469 -79019
14837g9019J19157J00530j0325O366r4499j18073K011K6991r627L2054j8301J4093
$$ -79019 40138 140668 130343 136709 42210 -75863 -73852 -46861 -56488 -24434 -42735 -28642
14825b8642q1502k7589J11749P7299J2246p71J9628L8083M185j56939j41900O2415
$$ -28642 -110144 -137733 -25984 51315 63561 62790 82418 120501 124686 -32253 -174153 -111738
14813a11738N5830M7404p4019l3716L8050j02374l7723J12291J65295M0879q8498
$$ -111738 -55908 -8504 -82523 -116239 -78189 -180563 -218286 -105995 59300 100179 11681
14802A1681q8787j0355l6243Q6647K6160J2200m5922k7478r1619K4134J24480
$$ 11681 -77106 -87461 -123704 -37057 -10897 1303 -44619 -72097 -163716 -139582 -15102
14791a5102L1555m3270k8806k2083j18255L8620O4531P709J55124l5465j82678
$$ -15102 16453 -26817 -55623 -77706 -195961 -157341 -92810 -85101 70023 34558 -148120
14780a48120j05027p0733L9374K8456J23606M6949R782m5267P5300J237m6908
$$ -148120 -253147 -323880 -284506 -256050 -132444 -85495 -75713 -120980 -45680 -44443 -91351
14769i1351m9671N8766Q4904k23634J7634J52717N8264q973K8556J4603j06766
$$ -91351 -141022 -82256 2648 -220986 -203352 -50635 7629 -1344 27212 41815 -64951
14758f4951l1467m4747o9967Q5378O8710P446j72726j33659K563l4609J39899
$$ -64951 -96418 -141165 -211132 -125754 -57044 -49598 -222324 -355983 -353420 -388029 -248130
14747b48130J59724L5055M8958R8498J43700J4736j23898k00240j20842K2986
$$ -248130 -88406 -53351 -4393 94105 237805 252541 128643 -71597 -192439 -169453
14737a69453N954j08580L7332M3090L5428N5778l1757m3574Q8305Q9097q6758
$$ -169453 -163499 -272079 -234747 -191657 -156229 -100451 -132208 -175782 -87477 1620 -85138
14726h5138o6912L3565J6262J54842J59601M5548r4517o8306j4414o8693n4664
$$ -85138 -152050 -118485 -102223 52619 212220 257768 163251 94945 80531 11838 -42826
14715d2826o7704m3906J12540J46435j09106j40904L8993L4225L8908o173l1759
$$ -42826 -110530 -154436 -41896 104539 -4567 -145471 -106478 -72253 -33345 -39518 -71277
14704g1277O984m3540k9719Q6145n5441J5837o362N550q7069m3325O1498J56624
$$ -71277 -64293 -107833 -137552 -51407 -106848 -91011 -97373 -91823 -178892 -222217 -160719 -4095
14692d095L3021o9351n0784j9421L0474m0256r7591k6672o1425k9207O3881J11051
$$ -4095 28926 -40425 -91209 -110630 -80156 -120412 -218003 -244675 -306100 -335307 -271426 -160375
14680a60375N0307m6615o3018J02914J00528M3766k2784j209M9225r4141M5296
$$ -160375 -110068 -156683 -219701 -116787 -16259 27507 4723 3514 52739 -41402 3894
14669C894R7650k580K9270q4562R0266m1794m9117k3471m5749j38247J28344J50229
$$ 3894 101544 98964 128234 43672 133938 92144 43027 19556 -26193 -164440 -36096 114133
14657A14133j32870o6840n6202k6243P0475O9548j19746j1606Q783N8665n5922
$$ 114133 -18737 -85577 -141779 -168022 -97547 -27999 -147745 -159351 -150568 -91903 -147825
14646a47825k6899J06053L3892k30401n8964J09711r769J03035j1029M4086O6866
$$ -147825 -174724 -68671 -34779 -265180 -324144 -214433 -224202 -121167 -132196 -88110 -21244
14635b1244R354k51J34050N1880N2464L404K6907j14143o8094o3696o2140r2502
$$ -21244 -11890 -12141 121909 173789 226253 229657 256564 142421 74327 10631 -51509 -144011
14623a44011K9944L1369Q4571N915L7797M2376k9068K5542J8207p002O3841M8037
$$ -144011 -114067 -82698 1873 7788 45585 87961 58893 84435 102642 95640 159481 207518
14611B07518J6091j91517j55320k6558J7763L2320r6976p015M5446P505J33758
$$ 207518 223609 32092 -123228 -149786 -132023 -99703 -196679 -203694 -158248 -150743 -16985
14600a6985O1186R1350M7915k6373j00947J05250R0105r0858j64148p4842J28925
$$ -16985 44201 135551 183466 157093 56146 161396 251501 160643 -3505 -78347 50578
14589E0578j5595m4174k0534N8041J44843q4632p8140n3626n1945J28565Q4813
$$ 50578 34983 -9191 -29725 28316 173159 88527 10387 -43239 -95184 33381 118194
14578A18194j45628o7936j6382j39888l7741n8166J27196J25026O9843M7934N803
$$ 118194 -27434 -95370 -111752 -251640 -289381 -347547 -220351 -95325 -25482 22452 28255
14567B8255m3952j98543P172O8894J00764O4084N1740M7729M2465r7814j20649
$$ 28255 -15697 -214240 -207068 -138174 -37410 26674 78414 126143 168608 70794 -49855
14556d9855K3687J7607L0517k3937j59319m5648Q7804K7928J229R1976k2368j2109
$$ -49855 -26168 -8561 21956 -1981 -161300 -206948 -119144 -91216 -89987 1989 -20379 -32488
14544c2488J4148R3751j7220Q0533k5736n0456k3683r4682n0230M1065m9614p9589
$$ -32488 -18340 75411 58191 138724 112988 62532 38849 -55833 -106063 -64998 -114612 -194201
14532a94201m2774O9275Q8062R1805J29709r5280n5776J52968n1087n7983N1145
$$ -194201 -236975 -167700 -79638 12167 141876 46596 -9180 143788 92701 34718 85863
14521H5863J5764q327j59067j49666j23461O6025Q4308J55604J97467O8016j00088
$$ 85863 101627 93300 -65767 -215433 -338894 -272869 -188561 -32957 164510 232526 132438
14510A32438j06635q2859L881m0702O7706K7157N6685P5877j02878q7766k1189
$$ 132438 25803 -57056 -53175 -93877 -26171 986 57671 133548 30670 -57096 -78285
14499g8285j4580O903m6599l8884J08149k6368p4535Q875P4071m1110j90939m9269
$$ -78285 -92865 -85962 -132561 -171445 -63296 -89664 -164199 -155324 -81253 -122363 -313302 -362571
14487c62571Q3484J43624Q5331J01729q2740o5912K1462R6283P148M1613p6521
$$ -362571 -279087 -135463 -50132 51597 -31143 -97055 -75593 20690 27838 69451 -7070
14476g070m8473m4406N8017Q0262J30022K9817q6246O648j3431l7196q7293p0253
$$ -7070 -55543 -99949 -41932 38330 168352 198169 111923 118571 105140 67944 -19349 -89602
14464h9602M5025k5251J5167R6279O8953n9068k4339o3452j81631k2091k9516
$$ -89602 -44577 -69828 -54661 41618 110571 51503 27164 -36288 -217919 -240010 -269526
14453b69526k395N6760J58157J80379R8916j28675m165P3518O4028P2737l8459
$$ -269526 -271921 -215161 -57004 123375 222291 93616 89451 162969 226997 299734 261275
14442B61275r4233p2400j39355j16835k9461R5148J3480K1459M3875l3833l4452
$$ 261275 167042 94642 -44713 -161548 -191009 -95861 -82381 -60922 -17047 -50880 -85332
14431h5332J05670J74824J01732o7942j98791j36430o3424k482R2015N1058q043
$$ -85332 20338 195162 296894 228952 30161 -106269 -169693 -172175 -80160 -29102 -37145
14420c7145M2613M7413q2856J22285p7002l6852O386k2945o9617r5478N2612J63213
$$ -37145 5468 52881 -29975 92310 15308 -21544 -15158 -38103 -107720 -203198 -150586 12627
14408A2627j770l9378Q865O6843L6080m7839j45185O0578O1672O757k5206j3086
$$ 12627 10857 -28521 -19656 47187 83267 35428 -109757 -49179 12493 19250 -5956 -19042
14396a9042J1877R4081P1894o843p4277p4757K9172J02514K5111j40577j20369
$$ -19042 -7165 86916 158810 151967 77690 2933 32105 134619 159730 19153 -101216
14385a01216k5570J90347J51668K804k9980j5742J1686J4503j39830J13323Q5992
$$ -101216 -126786 63561 215229 218033 188053 172311 183997 198500 58670 171993 257985
14374B57985N6043j19426n5280p575k8785K6902J3834r2380j23771O1569q5049
$$ 257985 314028 194602 139322 131747 102962 129864 143698 51318 -72453 -10884 -95933
14363i5933O2356J69901k0523M1955O0139P5475j5084j86673j84485K1932N5737
$$ -95933 -33577 136324 115801 157756 217895 293370 278286 91613 -92872 -70940 -15203
14352a5203P2302l8323j02522J32502J1171L9917J2398P9590j12125j22080m2059
$$ -15203 57099 18776 -83746 48756 59927 99844 112242 191832 79707 -42373 -84432
14341h4432L9888P5748k2879o8913J845J7586N6960P4613m1641r7478j8160J30156
$$ -84432 -44544 31204 8325 -60588 -58743 -41157 15803 90416 48775 -48703 -66863 63293
14329F3293j2319j99157p4377k5856R9198l8318J6911l3672r6509J47306J1897
$$ 63293 50974 -148183 -222560 -248416 -149218 -187536 -170625 -204297 -300806 -153500 -141603
14318a41603m7872M9410M023l8634R3611p5278M2118J6164O1174J00864r395K6585
$$ -141603 -189475 -140065 -136042 -174676 -81065 -156343 -114225 -98061 -36887 63977 54582 81167
14306H1167j01873n323Q0935j40331n4958K4697Q7746J7133r097l1413O5876P6773
$$ 81167 -20706 -26029 54906 -85425 -140383 -115686 -27940 -10807 -19904 -51317 14559 91332
14294I1332j286q059k3523m6482j60815p4096J34439P4083J0775k4240l8319J03881
$$ 91332 90046 81987 58464 11982 -148833 -222929 -88490 -14407 -3632 -27872 -66191 37690
14282C7690l149j05485O741R0706J017m0853j13004m9320m9074L1840L526R6057
$$ 37690 34541 -70944 -64203 26503 27520 -13333 -126337 -175657 -224731 -192891 -189365 -93308
14270i3308L4264L3753N1627l9467m5832l3116q9547J33819R6242p2004n3352
$$ -93308 -59044 -25291 26336 -13131 -58963 -92079 -181626 -47807 48435 -23569 -76921
14259g6921J6135l9444k1880J55427Q9213J35495Q2252p4393N046Q0731j12157
$$ -76921 -60786 -100230 -122110 33317 122530 258025 340277 265884 270930 351661 239504
14248B39504N6104o7928o0907o6364k5678O0213L4651m1136j57623j31799q9359
$$ 239504 295608 227680 166773 100409 74731 134944 169595 128459 -29164 -160963 -250322
14237b50322J12991K2376K6781R962n1198j7932k693j9040O4605P4004M5335K36036
$$ -250322 -137331 -114955 -88174 -78212 -129410 -147342 -150035 -169075 -104470 -30466 14869 250905
14225B50905P7122N5466j7214j32685j48813q9986k7912r2573k8675L4041J38045
$$ 250905 328027 383493 366279 233594 84781 -5205 -33117 -125690 -154365 -120324 17721
14214A7721J88533j14955j64208O1902M5056M059p5371j53482l1936O8065R8519
$$ 17721 206254 91299 -72909 -11007 34049 38108 -37263 -190745 -222681 -154616 -56097
14203e6097j6n995M3246r2409L10J40397P5722J7975p3886o1283j8086r7567M9463
$$ -56097 -56113 -62108 -18862 -111271 -110961 29436 105158 123133 49247 -12036 -30122 -127689 -78226
14190g8226J24255P8000O16o8753o7230k3256p278j2010o0196k6146N2468J64596
$$ -78226 46029 124029 124645 55892 -11338 -34594 -41872 -53882 -114078 -140224 -87756 76840
14178G6840N9398J0629q2356k7739m7953N2832P1227r879O6393j64785j45327
$$ 76840 136238 146867 64511 36772 -11181 41651 112878 102999 169392 4607 -140720
14167a40720k1113J9047p1554Q022m3513J21840M9992J1840P7658q4729p7757
$$ -140720 -161833 -142786 -214340 -206318 -249831 -127991 -77999 -66159 11499 -73230 -150987
14156a50987K4962n4332j4206N0106J8071j35987J3499N412L5117J83512N3856
$$ -150987 -126025 -180357 -194563 -144457 -126386 -262373 -248874 -243462 -208345 -24833 29023
14145B9023K5326j7963M6445j32440j98348n235Q7993N6008Q987M4779J79089
$$ 29023 54349 36386 82831 -49609 -247957 -253192 -165199 -109191 -100204 -55425 123664
14134A23664J25500q7619j90165j01743K1293k112m6706J28611P1933p3720n1692
$$ 123664 249164 161545 -28620 -130363 -109070 -111182 -157888 -29277 42656 -31064 -82756
14123h2756J012J2434J06551J08812j38642k15570M339R3609j11863j5339R8669
$$ -82756 -81744 -69310 37241 146053 7411 -208159 -203820 -110211 -222074 -237413 -138744
14112a38744R2560K09458K3666n0849q9978p612p5147n4772j0388R318k2198m1272
$$ -138744 -46184 163274 186940 136091 46113 38501 -36646 -91418 -101806 -92488 -114686 -155958
14100a55958M0746O6674L6892L3256r074j7849j31351j39615J6386J37991J07981
$$ -155958 -115212 -48538 -11646 21610 12536 -5313 -136664 -276279 -259893 -121902 -13921
14089a3921R225l1863k5917p3925L978k5569O6195k2191n6743J07073J29844K5124
$$ -13921 -4696 -36559 -62476 -136401 -132423 -157992 -91797 -113988 -170731 -63658 66186 91310
14077I1310q2413n198j483K8253j51977m8491M0135K3636O0107n19N9408N511
$$ 91310 8897 3699 2216 30469 -121508 -169999 -129864 -106228 -46121 -46640 12768 18279
14065A8279o9758m3894k2109Q4912o0436k0363j588o4413O0887N4050P5694n4514
$$ 18279 -51479 -95373 -117482 -32570 -93006 -113369 -114957 -179370 -118483 -64433 11261 -43253
14053d3253q4224o5720M0989J00689O1418M4624j31648l3932J01792J6585N0604
$$ -43253 -127477 -193197 -152208 -51519 9899 54523 -77125 -111057 -9265 7320 57924
14042E7924m9042o2091j04961l8874l3225P7823J26138m6261J34451P8076p542
$$ 57924 8882 -53209 -158170 -197044 -230269 -152446 -26308 -72569 61882 139958 132416
14031A32416L9107Q4018L0791m2085j07189J6277J74918k6644j5659N7130j09714
$$ 132416 171523 255541 286332 244247 137058 153335 328253 301609 285950 343080 233366
14020B33366l9642q517M490r7555j31232L9137q4884m5623J0354N327J248j2752
$$ 233366 193724 185207 189697 92142 -39090 47 -84837 -130460 -120106 -114779 -113531 -126283
14008a26283N7953L4838p7978k9246J32715P6064o3756j7899j4501J8449J9241
$$ -126283 -68330 -33492 -111470 -140716 -8001 68063 4307 -13592 -28093 -9644 9597
13997I597Q905O4712m1158p4640N3851N0728m2577j21175M9357J7694J1058L6933
$$ 9597 18502 83214 42056 -32584 21267 71995 29418 -91757 -42400 -24706 -13648 23285
13985B3285j5788L3987k8265k01275o985m3210p8181N2545J75426o8487j02279
$$ 23285 7497 41484 13219 -188056 -195041 -238251 -316432 -263887 -88461 -156948 -259227
13974b59227k517J14110P3182n2087k0110j7895m9766N5953q211l5921k8734O2611
$$ -259227 -261744 -147634 -74452 -126539 -146649 -164544 -214310 -158357 -166568 -202489 -231223 -168612
13962a68612Q0939q33j5607R8624J3022p766J2132J11580l4668r8372r3843P1564
$$ -168612 -87673 -88506 -104113 -5489 7533 -233 11899 123479 88811 -9561 -103404 -31840
13950c1840J02928P91J22682m8768j14312K6905m597J955j4215m8281j776l4130
$$ -31840 71088 71879 194561 145793 31481 58386 53789 55744 41529 -6752 -8528 -42658
13938d2658q3442L7116k8360j04696l2881Q5292L9156M0165J15631M5660K7485
$$ -42658 -126100 -88984 -117344 -222040 -254921 -169629 -130473 -90308 25323 70983 98468
13927I8468O449M2793j25746r2803n1941m2131O2937R0271o1337L6279L188m3872
$$ 98468 104917 147710 21964 -70839 -122780 -164911 -101974 -11703 -73040 -36761 -33573 -77445
13915g7445q9708L8845j9323r4394p9558J48828J12967K6412j06530L1014O3291
$$ -77445 -167153 -128308 -147631 -242025 -321583 -172755 -59788 -33376 -139906 -108892 -45601
13904d5601j27764P3675N6326p0689l9297P0786J8248q4521j32913j5941P111
$$ -45601 -173365 -99690 -43364 -114053 -153350 -82564 -64316 -148837 -281750 -297691 -290580
13893b90580J14889j7423k490O2311N9260K2498M5493J1507k7035m3550K1303
$$ -290580 -175691 -193114 -195604 -133293 -74033 -51535 -6042 5465 -21570 -65120 -43817
13882d3817j7198P1491L0798j09743j55854m5238J45259P0629J4592L6642J15521
$$ -43817 -61015 10476 41274 -68469 -224323 -269561 -124302 -53673 -39081 -2439 113082
13871A13082l1358q6159k0942n1474J7774l578J2559O9541k3320o3441j06435
$$ 113082 81724 -4435 -25377 -76851 -59077 -62655 -50096 19445 -3875 -67316 -173751
13860a73751j4144N5629L7031M4763m7100J47465P0214J0683k9703n4761Q5658
$$ -173751 -187895 -132266 -95235 -50472 -97572 49893 120107 130790 101087 46326 131984
13849A31984k0272o1714m5122J16645q5427j23785J0554P4171m6612q0673p1602
$$ 131984 111712 49998 4876 121521 36094 -87691 -77137 -2966 -49578 -130251 -201853
13838b01853j3431R8602Q4715M9841J10985Q9050j03745j29984l3686m8645J5170
$$ -201853 -215284 -116682 -31967 17874 128859 217909 114164 -15820 -49506 -98151 -82981
13827h2981j9704o1297O77O986Q4284P7335R067p431J4491q6340m5457L3935M4965
$$ -82981 -102685 -163982 -163305 -156319 -72035 5300 14367 6936 21427 -64913 -110370 -76435 -31470
13814c1470R8817m9239m7250J07817O7708M6845N1990L9130l6217m568j43107
$$ -31470 67347 18108 -29142 78675 146383 193228 245218 284348 248131 243563 100456
13803A00456M6756l4616r1311r8771J600P877M9785p2654J4888R1140j8033p5419
$$ 100456 147212 112596 21285 -77486 -75886 -68009 -18224 -90878 -75990 15150 -2883 -78302
13791g8302q8479Q7029L3734k772K087P6388o592l2555q7844m5268Q0467L2526
$$ -78302 -166781 -79752 -46018 -48790 -46703 29685 23093 -9462 -97306 -142574 -62107 -29581
13779b9581N1900j7351m1899q5836J02381N9012r3451J5899J01977j618j16003
$$ -29581 22319 4968 -36931 -122767 -20386 38626 -54825 -38926 63051 61433 -54570
13768e4570j20350l3696l8926K4326J44098m2007j62432M6115Q6297P8898j786
$$ -54570 -174920 -208616 -247542 -223216 -79118 -121125 -283557 -237442 -151145 -72247 -74033
13757g4033M2631L0798o2477p5940K4949N7419M546q3794m7078m9384l3965J03116
$$ -74033 -31402 -604 -63081 -139021 -114072 -56653 -52107 -135901 -182979 -232363 -266328 -163212
13745a63212Q2698M7187J0721R8715m3311o0465o4704K9010o5161n4925P9361
$$ -163212 -80514 -33327 -22606 76109 32798 -27667 -92371 -63361 -128522 -183447 -104086
13734a04086J14204L0927o9072j57621M5655J05006M8505n7751r0571j4041O003
$$ -104086 10118 41045 -28027 -185648 -139993 -34987 13518 -44233 -134804 -148845 -142842
13723a42842J34611l5212m6459l8649q3655Q913p372N0684M8979K13069J8735
$$ -142842 -8231 -43443 -89902 -128551 -212206 -203293 -210665 -159981 -111002 102067 120802
13712A20802o6066j8131j83430l4742q9318N9538O9758P0460j2188M4251N9533
$$ 120802 54736 36605 -146825 -181567 -270885 -211347 -141589 -71129 -83317 -39066 20467
13701B0467n3234j58768k5016M4050K5565J08442O5837P2804p4055j32782l3823
$$ 20467 -32767 -191535 -216551 -172501 -146936 -38494 27343 100147 26092 -106690 -140513
13690a40513m5372K0846J82145L3334q0355J4006m7742j43328J18651J39321m4715
$$ -140513 -185885 -165039 17106 50440 -29915 -15909 -63651 -206979 -88328 50993 6278
13679F278o0882L5451O6081n9875k9748l680p5302k1606K5273O900N9121l6759
$$ 6278 -54604 -19153 46928 -12947 -42695 -46375 -121677 -143283 -118010 -111110 -51989 -88748
13667h8748o8205j1870J08426J11559K3247j39796o6586M3398J70103q5839j5335
$$ -88748 -156953 -168823 -60397 51162 74409 -65387 -131973 -88575 81528 -4311 -19646
13656a9646R6131k1469m5980l0441J5394L0536J31560O9806p239P4132j77820
$$ -19646 76485 55016 9036 -21405 -6011 24525 156085 225891 218652 292784 114964
13645A14964j05837J0959l0673J3200J0083l6753L9443L5408J9881n7204l1536
$$ 114964 9127 20086 -10587 2613 12696 -24057 15386 50794 70675 13471 -18065
13634a8065K1347J38641k1314j12289j2575k570l1694q3474J47523J57068n9566
$$ -18065 3282 141923 120609 8320 -4255 -6825 -38519 -121993 25530 182598 123032
13623A23032j33145M3889j07547J05059j5761L7998j03354m5601o4875P4451K
$$ 123032 -10113 33776 -73771 31288 15527 53525 -49829 -95430 -160305 -85854 -85852
13612h5852N5513O5947O0834P6977p012j17859j7546K3582P803j3025m6200o7802
$$ -85852 -30339 35608 96442 173419 166407 48548 31002 54584 62387 49362 3162 -64640
13600f4640k6587K7417n9283M7824m0610K4320J35949K5057K6790r21k0378J6198
$$ -64640 -91227 -63810 -123093 -75269 -115879 -91559 44390 69447 96237 95316 74938 91136
13588I1136p9386m565p6838N8752J57029J08823q2671j14920P9953Q241o0853
$$ 91136 11750 7185 -69653 -10901 146128 254951 172280 57360 137313 145554 84701
13577H4701n6062N5188N3646M2446n4949m1295o6465M7219q9663o1460Q3075P6339
$$ 84701 28639 83827 137473 179919 124970 83675 17210 64429 -25234 -86694 -3619 72720
13565G2720Q2702Q29q8187N737q6028j56594k0192O3702P884n4795J00187j3899
$$ 72720 155422 156251 68064 73801 -12227 -168821 -189013 -125311 -117427 -172222 -72035 -85934
13553h5934q3429J2907j9144k1770q4254J2936j779k375q6624J51670J35936N8730
$$ -85934 -169363 -156456 -175600 -197370 -281624 -268688 -270467 -272842 -359466 -207796 -71860 -13130
13541a3130n3418K1093j50293K211K18162R7349j38156o5127J03147L2824m8004
$$ -13130 -66548 -45455 -195748 -193537 24625 121974 -16182 -81309 21838 54662 6658
13530F658j01334Q8212J42436l1073j32281k8107k0538O0785J06627J45774m9851
$$ 6658 -94676 -6464 135972 104899 -27382 -55489 -76027 -15242 91385 237159 187308
13519A87308j34467J00886J20467L0279K3961M2767J27187O919J21997J34190
$$ 187308 52841 153727 274194 304473 328434 371201 498388 505307 627304 761494
13509G61494j62959P181O4837k9721p9892j25722k08063j76736Q9532P047L6336
$$ 761494 598535 605716 670553 640832 560940 435218 227155 50419 139951 146998 183334
13498A83334M0197O2571o4707j01330j224j16071k6272M0869j3827J0414L4088
$$ 183334 223531 286102 221395 120065 118841 2770 -23502 17367 3540 13954 48042
13487D8042K4282O9240N1922j07621k639n4776P4086R2298O3013J05874j16891
$$ 48042 72324 141564 193486 85865 83226 28450 102536 194834 257847 363721 246830
13476B46830k3599o9333n828m4709q8023r7989O6328n2760j02752p1363J21650
$$ 246830 223231 153898 148070 103361 15338 -82651 -16323 -69083 -171835 -243198 -121548
13465a21548J14185K2078k6227j9528l5248J4176m3378j23435N0166Q1528o0540
$$ -121548 -7363 14715 -11512 -31040 -66288 -52112 -95490 -218925 -168759 -87231 -147771
13454a47771n5483J04884O5282j6385P747n7361p0206N2546R5649J96613M4780
$$ -147771 -203254 -98370 -33088 -49473 -41726 -99087 -169293 -116747 -21098 175515 220295
13443B20295j39299j29718q4177J23571K6795M6455o3922L5187J47228M576r0970
$$ 220295 80996 -48722 -132899 -9328 17467 63922 0 35187 182415 186991 96021
13432I6021j4723k9076q5783k876j8125Q8157q800J6552L6248o852p1463J2717
$$ 96021 81298 52222 -33561 -36437 -54562 33595 24795 41347 77595 70743 -720 11997
13420A1997N6176o2492q3481p2879M5916Q0838P2650J4499J9772K002n382k1712
$$ 11997 68173 5681 -77800 -150679 -104763 -23925 48725 63224 82996 84998 79616 57904
13408E7904l8201J5906K0263M1144J8379j14197j22317K7462J5041j8690L1060
$$ 57904 19703 35609 55872 97016 115395 1198 -121119 -93657 -78616 -97306 -66246
13397f6246N2186m6999q2835J6796J16240J5726j2183m1013K7438R9790L7346
$$ -66246 -14060 -61059 -143894 -127098 -10858 4868 -7315 -48328 -20890 78900 116246
13386A16246P168k3213q1254j00383m0579K8161o7183O9873J12769o4511k2154
$$ 116246 123414 100201 18947 -81436 -122015 -93854 -161037 -91164 21605 -42906 -65060
13375f5060N4699K9006p3237l0909l7969p9860P771n228M3286J27994J4285m8708
$$ -65060 -10361 18645 -54592 -85501 -123470 -203330 -195559 -200787 -157501 -29507 -15222 -63930
13363f3930n5897J1436N1746J06413k7134n3362l124J94693Q6234k08464k71617
$$ -63930 -119827 -108391 -56645 49768 22634 -30728 -33852 160841 247075 38611 -233006
13352b33006L9514R5475Q9174Q0543R6217o1127K605J7855O500O1949o3557j04385
$$ -233006 -193492 -98017 -8843 71700 167917 106790 109395 127250 133750 195699 132142 27757
13340B7757M9394n0346k5627m3756j38680J290J57671J3188Q626N9036J34852
$$ 27757 77151 26805 1178 -42578 -181258 -179968 -22297 -9109 -483 58553 193405
13329A93405K8892j14241j14422J55396J11964k9623m3867k5181L0326q0477j18264
$$ 193405 222297 108056 -6366 149030 260994 231371 187504 162323 192649 112172 -6092
13318f092o2355l3904N5295J85226O2432p7429O075N593M3929j02518p4639r8319
$$ -6092 -68447 -102351 -47056 138170 200602 123173 129248 134841 178770 76252 1613 -96706
13306i6706J24641J49159O0881j63666m3156L6800l8888n9016L8840p1561m4330
$$ -96706 27935 177094 237975 74309 31153 67953 29065 -29951 8889 -62672 -107002
13295a07002L8330R3182K7440n4490n618L0454o5773M5457j4206q6933M8116K2778
$$ -107002 -68672 24510 51950 -2540 -8158 22296 -43477 1980 -12226 -99159 -51043 -28265
13283b8265k8100n5147J18794R3886l0377o9124J4282J2940J079o4911M196K0939
$$ -28265 -56365 -111512 7282 101168 70791 1667 15949 28889 29968 -34943 -30747 -9808
13271i808l2329M4363n6171o2539P9600r626j824P7219J13902k4312M2768N5658
$$ -9808 -42137 2226 -53945 -116484 -36884 -46510 -48334 28885 142787 118475 161243 216901
13259B16901m8247L1116l607p6507O717p3416k917J5818J90637J11880N2689R6043
$$ 216901 168654 199770 196163 119656 126373 52957 50040 65858 256495 368375 421064 517107
13247E17107L5436R6322J06216J7299n9572n0935j12456j14503O2890K3509n0106
$$ 517107 552543 648865 755081 772380 712808 661873 549417 434914 497804 521313 471207
13236D71207k5978P1923p3519N763j9802K977j11768j71792p5453K2214L9752
$$ 471207 445229 517152 443633 449396 429594 432571 320803 149011 73558 95772 135524
13225A35524p9216N904l2723J47650l9420j26101l2291R3927J11550K2741j42733
$$ 135524 56308 62212 29489 177139 137719 11618 -20673 73254 184804 207545 64812
13214F4812j19632J3834P2866J21451k4765q3778n1964L8687j7080J4488K9871
$$ 64812 -54820 -40986 31880 153331 128566 44788 -7176 31511 14431 28919 58790
13203E8790N2809m2320J6250j3133O8024N4896q9382K0963N2804j11558m7060
$$ 58790 111599 69279 85529 72396 140420 195316 105934 126897 179701 68143 21083
13192B1083p3937J17264J13495k916L5264q6299p6416j31953J21561J76916o7637
$$ 21083 -52854 64410 177905 174989 210253 123954 47538 -84415 37146 214062 146425
13181A46425k3396P1538Q13k15689J6600J56652N7271l8427p0118r8575L9131
$$ 146425 123029 194567 195380 -20309 -3709 152943 210214 171787 101669 3094 42225
13170D2225J27640L4247o5864M3914L9132J66236J77981m8405R606j04795k3390
$$ 42225 169865 204112 138248 182162 221294 387530 565511 517106 526712 421917 398527
13159C98527n3502L8295p4248M5126Q0737R707p6091N3883r7280J8562N7350q5963
$$ 398527 345025 383320 309072 354198 434935 444642 368551 422434 325154 343716 401066 315103
13147C15103l9299q511N7306L4151q7164Q5474J59102j36149r2224N8719O9306
$$ 315103 275804 267293 324599 358750 271586 357060 516162 380013 287789 346508 415814
13136D15814J09501J9588k5618P9148O8542q7654k05870n7827l4733K032L6233
$$ 415814 525315 544903 519285 598433 666975 579321 373451 315624 280891 282923 319156
13125C19156J02150N4662J5464L3398j1075L035J11284R8880J43900O1888P4992
$$ 319156 421306 475968 491432 524830 513755 516790 628074 726954 870854 932742 1007734
13114A007734J08610k490Q9531J01203O2299m6018J0138L0247J22326J22246J04528
$$ 1007734 1116344 1113854 1203385 1304588 1366887 1320869 1331007 1361254 1483580 1605826 1710354
13103A710354L3192o9734j09647J08351J90626J48083J62262O8680J56340J55140
$$ 1710354 1743546 1673812 1564165 1672516 1863142 2011225 2173487 2242167 2398507 2553647
13093B553647K22915J12623K63652L45794K86358L08330K12244K94389L44922
$$ 2553647 2776562 2889185 3152837 3498631 3784989 4093319 4305563 4599952 4944874
13084D944874M03493M87818N88825M89597O89459Q70317Q01642R32185J175343
$$ 4944874 5348367 5836185 6425010 6914607 7604066 8474383 9276025 10208210 11383553
13075A1383553J299245J591622J813279K097986K551874L018564L683049M315871
$$ 11383553 12682798 14274420 16087699 18185685 20737559 23756123 27439172 31755043
13067C1755043N125870O082596O963210P451743P653409P479202O645137N244449
$$ 31755043 36880913 42963509 49926719 57378462 65031871 72511073 79156210 84400659
13059H4400659L329048J017183j245101l440471n152309o230804p052458p350520
$$ 84400659 87729707 88746890 87501789 84061318 78909009 72678205 65625747 58275227
13051E8275227p116851o465046n685199m964720m140072l435439k916370k502322
$$ 58275227 51158376 44693330 39008131 34043411 29903339 26467900 23551530 21049208
13043B1049208k202286j986573j675393j407186j233148j232590r38669o95654
$$ 21049208 18846922 16860349 15184956 13777770 12544622 11312032 10373363 9677709
13035I677709o43924p16475o98100o92117n65036l76708l25634l82749l79803
$$ 9677709 9033785 8317310 7619210 6927093 6362057 5985349 5659715 5276966 4897163
13026D897163j53071k77005k20412k40131j60273r3479r6958k12261j96512n9597
$$ 4897163 4744092 4467087 4246675 4006544 3846271 3752792 3655834 3443573 3247061 3187464
13016C187464j99603r7086k01433j71074o1873p4642K0232j15109p8646j75871
$$ 3187464 2987861 2890775 2689342 2518268 2456395 2381753 2401985 2286876 2208230 2032359
13006B032359j94707r1567K7071J20210m6703j33882r3008n6721m5955o2673j75022
$$ 2032359 1837652 1746085 1773156 1893366 1846663 1712781 1619773 1563052 1517097 1454424 1279402
12995A279402j32012J09707k4056m4493o4655R4540R6082m778j0943j5061O0009
$$ 1279402 1147390 1257097 1233041 1188548 1123893 1218433 1314515 1309737 1298794 1283733 1343742
12984A343742J05676O9637l972l9644k17935n6924J847N3330M2360n8912r5155
$$ 1343742 1449418 1519055 1515083 1475439 1257504 1200580 1202427 1255757 1298117 1239205 1144050
12973A144050o0287q0702L6969m6045l9955m6395j64395n2567m002M6528j47366
$$ 1144050 1083763 1003061 1040030 993985 954030 907635 743240 690673 686671 733199 585833
12962E85833j26786O9607J54401m1385j83040l5488M1916n4518L3225Q7435O7352
$$ 585833 459047 528654 683055 641670 458630 423142 465058 410540 443765 531200 598552
12951E98552p8420K9051J6259J6517j87037k6480K1620p2451o5217M1628N009
$$ 598552 520132 549183 565442 581959 394922 368442 390062 317611 252394 294022 299031
12940B99031K8667l037p5349M444L6783Q461n790j2096J08718m5562p8270J26116
$$ 299031 327698 324661 249312 253756 290539 299000 293210 281114 389832 344270 266000 392116
12928C92116Q1715o821j07006k03888L4213N3401j24950l1038j9889K8728j38909
$$ 392116 473831 467010 360004 156116 190329 243730 118780 87742 67853 96581 -42328
12917d2328L6285J20367M7086L4239L7000M7139k6178o4592J7754L2864M3497
$$ -42328 -6043 114324 161410 195649 232649 279788 253610 189018 206772 239636 283133
12906B83133N0325p4264o0562n240J24746P253j11176o5872p2580m8890Q2412
$$ 283133 333458 259194 198632 193392 318138 325391 214215 148343 75763 26873 109285
12895A09285j7897o918L569J15629k2010J6738M4533o2569n8967L0767K2807L0591
$$ 109285 91388 84470 88039 203668 181658 198396 242929 180360 121393 152160 174967 205558
12883B05558J49822K7395r2163n6122M4452j50142p1186L6684K03442l1051j40727
$$ 205558 355380 382775 290612 234490 278942 128800 57614 94298 297740 266689 125962
12872A25962j39022j8749R4731N4708M2671J9483j27309J3258L7892K5441j06748
$$ 125962 -13060 -31809 62922 117630 160301 179784 52475 65733 103625 129066 22318
12861B2318O8121K24021J7351j12997j16366R891J11533L2565K1958m4911o8520
$$ 22318 90439 314460 331811 218814 102448 112339 223872 256437 278395 233484 164964
12850A64964J76995J16521o1146j25203j46916j77914L1734R3532m4601k4533
$$ 164964 341959 458480 397334 272131 125215 -52699 -20965 72567 27966 3433
12840C433l1659O3798l2737m4117l3735m6212K4394L2257m278P9938L9388n4592
$$ 3433 -28226 35572 2835 -41282 -75017 -121229 -96835 -64578 -68856 11082 50470 -4122
12828d122j20316N0939M6180J0247n44P3805L1249K8737j20633j8902l1146N1680
$$ -4122 -124438 -73499 -27319 -17072 -17616 56189 87438 116175 -4458 -23360 -54506 -2826
12816b826L6243m7238P5417m5814r9241l6239l3450Q2054L0807o019N4109R7694
$$ -2826 33417 -13821 61596 15782 -83459 -119698 -153148 -71094 -40287 -46306 7803 105497
12804A05497R0491j8128l5801j44872o2726n8349L9443L343j895J41513Q3192
$$ 105497 195988 177860 142059 -2813 -65539 -123888 -84445 -81102 -82997 58516 141708
12793A41708p8599P0447o1343n6718q3091K3034p2856n7747K2864Q9789m7697
$$ 141708 63109 133556 72213 15495 -67596 -44562 -117418 -175165 -152301 -62512 -110209
12782a10209N7292J70221j14040n8858m0551n9858P5837P2746o2363L8058J24268
$$ -110209 -52917 117304 3264 -55594 -96145 -156003 -80166 -7420 -69783 -31725 92543
12771I2543M9959o7829j2694J62804J46049j03035j73087l9433p5883o887J62248
$$ 92543 142502 74673 61979 224783 370832 267797 94710 55277 -20606 -27493 134755
12760A34755N0686j23667m3807m2117l7649j1492r7967k7872j245Q0754j33J5257
$$ 134755 185441 61774 17967 -24150 -61799 -73291 -171258 -199130 -200375 -119621 -119754 -104497
12748a04497P6708O560j9941j1076R5162L8088j6284O3806m4452n5403q882m1195
$$ -104497 -27789 -21229 -41170 -52246 42916 81004 64720 128526 84074 28671 19789 -21406
12736b1406M4607M2782J8421J00003M4897M9867M4576L8030o7453n5359q1174
$$ -21406 23201 65983 84404 184407 229304 279171 323747 361777 294324 238965 157791
12725A57791r7783j3467O9896M4939p8467j3132L2409Q4713l232L3528J5519j05723
$$ 157791 60008 46541 116437 161376 82909 69777 102186 186899 183667 217195 232714 126991
12713A26991j5401k3535j6046j02702K1638M143p7541J0910O267m8223J26070
$$ 126991 111590 88055 72009 -30693 -9055 -4912 -82453 -71543 -65276 -113499 12571
12702A2571J14045L0960j20880j58588M7883L248k0304o5379k6155J4769R0746
$$ 12571 126616 157576 36696 -121892 -74009 -70761 -91065 -156444 -182599 -167830 -77084
12691g7084j9239p9840j7628R7936r684J5852L0391j4789K4134J36127k2910k9206
$$ -77084 -96323 -176163 -193791 -95855 -105539 -89687 -59296 -74085 -49951 86176 63266 34060
12679C4060p0552q7018J2486J49606l050r3502O2631o7574k7476k265J69025Q3104
$$ 34060 -36492 -123510 -111024 38582 35532 -57970 4661 -62913 -90389 -92654 76371 159475
12667A59475o1911p6983K7457J15713R9006j80035j60230j2155J10790L9970N3649
$$ 159475 97564 20581 48038 163751 262757 82722 -77508 -89663 21127 61097 114746
12656A14746K1301J04566q335j08689p8669L2188P9844K5682l1463j84683l6517
$$ 114746 136047 240613 232278 123589 44920 77108 156952 182634 151171 -33512 -70029
12645g0029L0580J36880Q937j1845o2373m3540J88113N1467j09629q42m447K0724
$$ -70029 -39449 97431 106368 94523 32150 -11390 176723 228190 118561 117719 113272 133996
12633A33996K0836K0119o691r7176o786J63365l5841q5687m4043K5236R6306J1224
$$ 133996 154832 174951 168260 71084 64298 227663 191822 106135 62092 87328 183634 194858
12621A94858q1044n7004J07271l2405q0038R2232K5307N2366L5988L138q2861
$$ 194858 113814 56810 164081 131676 51638 143870 169177 221543 257531 260669 177808
12610A77808P4036Q7319o1592p9775M2942J06458k9149r3517Q9381J16333J59730
$$ 177808 251844 339163 277571 197796 240738 347196 318047 224530 313911 430244 589974
12599E89974P3942q6929j59843j36515o9252q8893O4507P7175q848n1169L3413
$$ 589974 663916 576987 417144 280629 211377 122484 186991 264166 255318 204149 237562
12588B37562L5665p9901j48632j31390l2766N7822L9189q66O4254k545m0135k2733
$$ 237562 273227 193326 44694 -86696 -119462 -61640 -22451 -23317 40937 38392 -1743 -24476
12576b4476j4866o3369K5057P5467P1677m4121J0499p9902o1374Q7238J19984
$$ -24476 -39342 -102711 -77654 -2187 69490 25369 35868 -44034 -105408 -18170 101814
12565A01814k2874p2486N1400L5782k7436j27596j02646J6022O7906J0694j38113
$$ 101814 78940 6454 57854 93636 66200 -61396 -164042 -148020 -80114 -69420 -207533
12554b07533J12000J37206l5463N8700O1191j18747Q5479J00253l462J11420l881
$$ -207533 -95533 41673 6210 64910 126101 7354 92833 193086 189624 301044 297163
12543B97163m5848M71Q7072k9886N4724J01535j53431r8553r5689o8711n629J8481
$$ 297163 251315 251786 338858 308972 363696 465231 311800 213247 117558 48847 43218 61699
12531F1699K6985j08399l763K0569j1971K6631J32755L4204j01578j4041P2524
$$ 61699 88684 -19715 -23478 -2909 -14880 11751 144506 178710 77132 63091 135615
12520A35615k3916j02187o0912l3309J4800n634O7669l7206m161J34542J26557
$$ 135615 111699 9512 -51400 -84709 -69909 -75543 -7874 -45080 -49241 85301 211858
12509B11858n7471P6899L710J54j21460r4335j9972J80o4377k9029m4333P0916
$$ 211858 154387 231286 234996 235150 113690 19355 -617 -437 -64814 -93843 -138176 -67260
12497f7260j1605m7433J4986P5746K4949l4514Q556K4646n6323j43873R5069J55546
$$ -67260 -78865 -126298 -111312 -35566 -10617 -45131 -36575 -11929 -68252 -212125 -117056 38490
12485C8490k4455L8445N6025r0113J0970L1595k1188n1246P5838o5744n6297p3174
$$ 38490 14035 52480 108505 18392 29362 60957 39769 -11477 64361 -1383 -57680 -130854
12473a30854J18777L6929K8131R5431m5499N7580M5965K9331j31527j09106L0043
$$ -130854 -12077 24852 52983 148414 102915 160495 206460 235791 104264 -4842 25201
12462B5201J96172J1250j26545k3865m7273M4832n8061r8998q4171m1708k7857
$$ 25201 221373 232623 106078 82213 34940 79772 21711 -77287 -161458 -203166 -231023
12451b31023n3269Q6616J38455J37787P7463j38962j49810p6975r297n5957j09385
$$ -231023 -284292 -197676 -59221 78566 156029 17067 -132743 -209718 -219015 -274972 -384357
12440c84357Q6452K65881J09035k2380j6505j40447n9478P1944N3268M4756P2569
$$ -384357 -297905 -32024 77011 54631 38126 -102321 -161799 -89855 -36587 8169 80738
12429H0738k8595J15343L9148m6092N2435K2003j73568k20209M7553J33861j14077
$$ 80738 52143 167486 206634 160542 212977 234980 61412 -158797 -111244 22617 -91460
12418i1460j7593O0686N7497J5715N8776n2696k1477n6649m5588n6847o1333q6611
$$ -91460 -109053 -48367 9130 24845 83621 30925 9448 -47201 -92789 -149636 -210969 -297580
12406b97580M264P0233P237O0550J47849J31619j7650j04915K4797o4006j2308
$$ -297580 -293316 -223083 -215846 -155296 -7447 124172 106522 1607 26404 -37602 -49910
12395d9910j6357N9921Q9288J12971N9547p8713L132K6115r4416q8817l3902m1898
$$ -49910 -66267 -6346 82942 195913 255460 176747 179879 205994 111578 22761 -11141 -53039
12383e3039K6592m7199K4606N8032J1594L0331r322j2620n6126L1595P6471J20168
$$ -53039 -26447 -73646 -49040 8992 20586 50917 41595 28975 -27151 4444 80915 201083
12371B01083M4019p7228n4653n3899q4487j369L5986L0096l4435j098m5426m0358
$$ 201083 245102 167874 113221 59322 -25165 -26534 9452 39548 5113 4015 -41411 -81769
12359h1769L6015N4855m9358k8649l667Q0311j8093K4118p4695l5445J55163O4656
$$ -81769 -45754 9101 -40257 -68906 -72573 7738 -10355 13763 -60932 -96377 58786 123442
12347A23442r8767j04076p3330n4060J98785j2917p6456L3789O1411m1659P3934
$$ 123442 24675 -79401 -152731 -206791 -8006 -20923 -97379 -63590 -2179 -43838 30096
12336C0096O2950j0179J32563o3336j04710N9613l9399j19161j37950J50541J56100
$$ 30096 93046 82867 215430 152094 47384 106997 67598 -51563 -189513 -38972 117128
12325A17128p318L0919p0562l4437j7225J41496q1151j76213p0390M1635l1322
$$ 117128 109810 140729 70167 35730 18505 160001 78850 -97363 -167753 -126118 -157440
12314a57440l5975K5836O7019J38274L9244k5169O0292k7808j29601n4012k1063
$$ -157440 -193415 -167579 -100560 37714 76958 51789 112081 84273 -45328 -99340 -120403
12303a20403O3142J82620Q2865m7046p74q656j8534R9919j25528j35357O0876
$$ -120403 -57261 125359 208224 161178 160404 151748 133214 233133 107605 -27752 33124
12292C3124J6282R617J3086N3435j43455j59204O2674K2659p1544L6795R5575
$$ 33124 49406 59023 72109 125544 -17911 -177115 -114441 -91782 -163326 -126531 -30956
12281c0956m1684k4475N3927j6931Q3828N5684J45368J08477j22749q9865o502
$$ -30956 -72640 -97115 -43188 -60119 23709 79393 224761 333238 210489 120624 114122
12270A14122l136j6745j09201J7895O0061M824q3719n4129L1126p9842K4368J3763
$$ 114122 110986 94241 -14960 2935 62996 67820 -15899 -70028 -38902 -118744 -94376 -80613
12258h0613M8028Q9172p4260j04525l5733l1920P5053P8667r4668j9421O4996
$$ -80613 -32585 56587 -17673 -122198 -157931 -189851 -114798 -36131 -130799 -150220 -85224
12247h5224K9580N6689O2344N3776j10855O569o5883K679n5886M0282R6924O0062
$$ -85224 -55644 1045 63389 117165 6310 12879 -53004 -50325 -106211 -65929 30995 91057
12235I1057n2667r3455Q9903N2570P865j6653j1463K366Q5491J81115O6937r7834
$$ 91057 38390 -55065 34838 87408 95273 78620 67157 69523 155014 336129 403066 305232
12223C05232p1470k1505m963k6510l0145O889O6905j7701n0574Q5988N9194p9008
$$ 305232 233762 212257 207294 180784 150639 157528 224433 206732 156158 242146 301340 222332
12211B22332j34460J08361K2872q2527r7025j43876k6007N4216Q4241m2281o3563
$$ 222332 87872 196233 219105 136578 39553 -104323 -130330 -76114 8127 -34154 -97717
12200i7717J02987Q0696m144L5231J00167P5177J12525m8626P2439L1244R3763
$$ -97717 5270 85966 81822 117053 217220 292397 404922 356296 428735 459979 553742
12189E53742P9599o3000N2807Q1419j2649P5619K45382K81077M44240M54725L64114
$$ 553742 633341 570341 623148 704567 691918 767537 1012919 1293996 1738236 2192961 2557075
12178B557075N48523M61829K69366j33313k58296m63978m81728l34297l17286
$$ 2557075 3105598 3567427 3836793 3703480 3445184 2981206 2499478 2165181 1847895
12169A847895k80976j07030j68855k59267k23902m8219j27218m8633K4520q0040
$$ 1847895 1566919 1459889 1291034 1031767 807865 759646 632428 583795 608315 528275
12159E28275o9879o7310j13508j35184P5940J09386J08650q5051k22891k54986
$$ 528275 458396 391086 277578 142394 218334 327720 436370 351319 128428 -126558
12149a26558j4739J94507J24365P806L7976j03495q9169j5592N8548J48399%N9005
$$ -126558 -141297 53210 177575 185381 223357 119862 30693 15101 73649 222048 222048 281053
12137B81053j29061k6300k1339L202k2776N7818j01248k9419N4560K7346P2544
$$ 281053 151992 125692 104353 107555 84779 142597 41349 11930 66490 93836 166380
12126A66380l2203j11173l4234L9547l7725n5516N8171Q9464K4877J0120K1417
$$ 166380 134177 23004 -11230 28317 -9408 -64924 -6753 82711 107588 117708 139125
12115A39125k05584L063J51742J47182p6115r2284p5189K9358J7256l7643p1836
$$ 139125 -66459 -63396 88346 235528 159413 67129 -8060 21298 38554 911 -70925
12104g0925Q9316J74031M255l9701P713k01418K0877L9771j1074J2898l5870q5388
$$ -70925 18391 192422 196677 156976 164689 -36729 -15852 23919 12845 25743 -10127 -95515
12092i5515n2509J18080J57883L7085r5576n4524L0439q6354j68024N1942J32242
$$ -95515 -148024 -29944 127939 165024 69448 14924 45363 -40991 -209015 -157073 -24831
12081b4831P2619j628N151M9367j25930q2364j7944M5067p9044r3931J02228J23087
$$ -24831 47788 46160 51311 100678 -25252 -107616 -125560 -80493 -159537 -253468 -151240 -28153
12069b8153l3833M3753m6824Q227O8782j16735m5839j1172K34913J41603j7775
$$ -28153 -61986 -18233 -65057 -56830 11952 -104783 -150622 -161794 73119 214722 196947
12058A96947J9475L4321j55030j84494O1208N5892J8770J27851J44354Q6687R9477
$$ 196947 216422 250743 95713 -88781 -27573 28319 47089 174940 319294 405981 505458
12047E05458K780q1740j22403o6636l7586j73301k12545P0370J80851J34105K8840
$$ 505458 508238 426498 304095 237459 199873 26572 -185973 -115603 65248 199353 228193
12036B28193p0083j62027j43413N4892J0083l240P9831O5514J23831L3168n1767
$$ 228193 158110 -3917 -147330 -92438 -82355 -85595 -5764 59750 183581 216749 164982
12025A64982n1285l3600n321J1804Q5680O0964R9935p5786j04146r9059r1553
$$ 164982 113697 80097 74776 86580 172260 233224 333159 257373 153227 54168 -37385
12014c7385M0685K8108M470O0965J347j775l947J08425r3106p6611K37648J36841
$$ -37385 3300 31408 35878 96843 98190 96415 92468 200893 107787 31176 268824 405665
12002D05665l0201k8264j8543J00633K25274J49454J75858m9583l8655m0971k7610
$$ 405665 375464 347200 328657 429290 654564 804018 979876 930293 891638 850667 823057
11991H23057j85566j82429q1337j6032O6216P5505J22120m8669j55276L0136N2733
$$ 823057 637491 455062 373725 357693 423909 499414 621534 572865 417589 447725 500458
11980E00458N3879O2413p1021q7010n5096j1163Q3912Q8412M2905k2416K6761
$$ 500458 554337 616750 545729 458719 403623 392460 476372 564784 607689 585273 612034
11969F12034r9209k8759L5770J4179J13617M6903j5981K09564Q2864K385J67893
$$ 612034 512825 484066 519836 534015 647632 694535 678554 888118 970982 973367 1141260
11958A141260L30009K50399J20570J23369L11673L08443L29309J47004N4384J75482
$$ 1141260 1471269 1721668 1842238 1965607 2277280 2585723 2915032 3062036 3116420 3291902
11948C291902N5181R3011K0198J22713L43260L36225M05422M57473M61390N87905
$$ 3291902 3347083 3440094 3460292 3583005 3926265 4262490 4667912 5125385 5586775 6174680
11938F174680Q61171R04299R16487J234695J442590K043094K706265L314273M495931
$$ 6174680 7035851 7940150 8856637 10091332 11533922 13577016 16283281 19597554 24093485
11929B4093485O105563Q603120J2352432J8834080K9806626M8346544P3112880
$$ 24093485 30199048 38802168 51154600 69988680 99795306 148141850 221254730
11922B21254730P8903963L6412815r327008k2989268l4900578n4464511n8383124
$$ 221254730 300158693 336571508 327244500 304255232 269354654 214890143 156507019
11915A56507019m4757493k9621063j9254521j3113496r186251o789537n113970
$$ 156507019 111749526 82128463 62873942 49760446 40574195 33784658 28670688
11908B8670688l916102l105287k482694k040470j768772j696176j408611j164356
$$ 28670688 24754586 21649299 19166605 17126135 15357363 13661187 12252576 11088220
11900A1088220q55429o89930o46044o68960o59901o33000o19869n06371m09578
$$ 11088220 10232791 9542861 8896817 8227857 7567956 6934956 6315087 5808716 5399138
11891E399138l68398k69054k40452k64101k84576j99393j53447j88398j97502
$$ 5399138 5030740 4761686 4521234 4257133 3972557 3773164 3619717 3431319 3233817
11882C233817j26908n5626j39060j62073R0682n7056p8521j42859q0951l7060
$$ 3233817 3106909 3051283 2912223 2750150 2840832 2783776 2705255 2562396 2481445 2444385
11872B444385j08088o2137k82109l9968q5470j43976j105N7651m9225k69362r1538
$$ 2444385 2336297 2274160 1992051 1952083 1866613 1722637 1721532 1779183 1729958 1460596 1369058
11861A369058j05603j55213j5560k8693j20311k3131N5462J0750K9686j0242j07503
$$ 1369058 1263455 1108242 1092682 1063989 943678 920547 976009 986759 1016445 1006203 898700
11850H98700p8500l8493L2965Q7644o3902j50945j02370J12532l7665l6031n558
$$ 898700 820200 781707 814672 902316 838414 687469 585099 697631 659966 623935 618377
11839F18377p2484K4467L5575j05P8900o0573l5876l6943K633M6482N0632M774
$$ 618377 545893 570360 605935 605830 684730 624157 588281 551338 553971 600453 651085 655859
11827F55859l3319q8462p1169o9178L9952N8521N1336l7925K2126M1692j42749
$$ 655859 622540 534078 462909 393731 433683 492204 543540 505615 527741 569433 426684
11816D26684k9125M1042r3003J01618Q6376o6655r1755O2524R5859j67127K5673
$$ 426684 397559 438601 345598 447216 533592 466937 375182 437706 533565 366438 392111
11805C92111j303n286J20227J35183j01057o6530J0703q0891j70587l1182O455
$$ 392111 390808 385522 505749 640932 539875 473345 484048 403157 232570 201388 207843
11794B07843k4814n8608o6102P923K3320n8590j77556N0656O6292q666N8482J4998
$$ 207843 183029 124421 58319 66242 89562 30972 -146584 -95928 -29636 -38302 20180 35178
11782C5178L257J50922j7216l3622J40742P9073p6355m1366r816j8125K200o842
$$ 35178 38435 189357 172141 138519 279261 358334 281979 240613 230797 212672 214872 208030
11770B08030O2480o8491M154Q6427j3267k0397j7117K5847q6576n4929l4759P0702
$$ 208030 270510 202019 206173 292600 279333 258936 241819 267666 181090 126161 91402 162104
11758A62104J2307n7204O0851j06438o3081j8611P2782M9066k2668L0419L9469
$$ 162104 174411 117207 178058 71620 8539 -10072 62710 111776 89108 119527 158996
11747A58996m922k1464R53p571p3883j00417j0876R484K0422Q9864L5647p9727
$$ 158996 154074 132610 133563 125992 52109 -48308 -59184 -49700 -29278 60586 96233 16506
11735A6506L7026P5548R9960k238o3849l764j06407l4094L0305l2449p8377P427
$$ 16506 53532 129080 229040 226802 162953 159189 52782 18688 48993 16544 -61833 -54406
11723e4406K632J7000j785J62393Q5254k7240r2961l5093J24036n92Q2702j23631
$$ -54406 -51774 -34774 -36559 125834 211088 183848 90887 55794 179830 179238 261940 138309
11711A38309q4960M3674p3235P4822Q0047m4057p2925J1996J56130l268q7959
$$ 138309 53349 97023 23788 98610 178657 134600 61675 73671 229801 226533 138574
11700A38574k00167l8978R4259O3822K1982q410L8941K3363o1118N5804l2444
$$ 138574 -61593 -100571 -6312 57510 79492 71082 110023 133386 72268 128072 95628
11689I5628j03002L9642p132K3555K9114p4397O5004K0468m4631k8899L2210M9278
$$ 95628 -7374 32268 25136 48691 77805 3408 68412 88880 44249 15350 47560 96838
11677I6838n3907M078p0867o6029N8510R9293L1304J78892J9437k3655k1378K5133
$$ 96838 42931 47009 -23858 -89887 -31377 67916 99220 278112 297549 273894 252516 277649
11665B77649j23609j30863r6819N5416P9919k1845m935m9240p9856N5304J24874
$$ 277649 154040 23177 -73642 -18226 61693 39848 34913 -14327 -94183 -38879 85995
11654H5995J74963j954J8972r1549j20553m3337M7730l7081o2685M250Q5976k3804
$$ 85995 260958 259004 277976 186427 65874 22537 70267 33186 -29499 -25249 60727 36923
11642C6923L9528m4107j35064K125RO5684r9552p6667R570O7110J81798o6258
$$ 36923 76451 32344 -102720 -100595 -100586 -34902 -134454 -211121 -201551 -134441 47357 -18901
11630a8901j39821k5986J31797L5714J15249J10940J5014l7557j30367m9112J1818
$$ -18901 -158722 -184708 -52911 -17197 98052 208992 224006 186449 56082 6970 18788
11619A8788J5495O0976O9407j59522l5331M8979r158n714M059j11879n6856R6283
$$ 18788 34283 95259 164666 5144 -30187 18792 9634 3920 7979 -103900 -160756 -64473
11607f4473J21595J92812n0207j68856q0062n2123J05002q6414J87j4131k0782
$$ -64473 57122 249934 199727 30871 -49191 -101314 3688 -82726 -82539 -96670 -117452
11596a17452j00171O2634J68513M3199R856K6872n349p3701P7905J66328M73q0576
$$ -117452 -217623 -154989 13524 56723 66579 93451 88102 14401 92306 258634 259107 178531
11584A78531J11531p4241j28182L7609q460l0655r48j7188k4871p6638r977n2088
$$ 178531 290062 215821 87639 125248 116788 86133 85185 67997 43126 -33512 -43489 -95577
11572i5577n4065O6154K8630j4086k6864R7000J82290P1153r4436r1318j8499
$$ -95577 -149642 -83488 -54858 -68944 -95808 1192 183482 254635 160199 68881 50382
11561E0382m7898N7808k6567j30712l5514J04675K2606k4955M5210K1760K2305
$$ 50382 2484 60292 33725 -96987 -132501 -27826 -5220 -30175 15035 36795 59100
11550E9100j2812n6499O798M4711K601l8277j59553M8291P6825m5435K0030N2398
$$ 59100 46288 -10211 -3413 41298 43899 5622 -153931 -105640 -28815 -74250 -54220 -1822
11538a822N88j33051Q3266J27499J21090k3966o8598p0633l0204O5660R4003K4590
$$ -1822 -1234 -134285 -51019 76480 197570 173604 105006 34373 4169 69829 163832 188422
11526A88422M0433J07704q7439k03119k0876Q1167j47043q6337J63122J02361
$$ 188422 228855 336559 249120 46001 25125 106292 -40751 -127088 36034 138395
11516A38395l7899J6100r5876p6565J5596J42373l2328j05455J09455J6510o8182
$$ 138395 100496 116596 20720 -55845 -40249 102124 69796 -35659 73796 90306 22124
11505B2124o0984O6373M8901p218K2516p9437l4882p1637k6472N2393R4889j9882
$$ 22124 -38860 27513 76414 69196 91712 12275 -22607 -94244 -120716 -68323 26566 6684
11493F684k8130R7229j7648j09038J08323p085L277J935P6455o4569j59770q1977
$$ 6684 -21446 75783 58135 -50903 57420 50335 53612 55547 132002 67433 -92337 -174314
11481a74314M0046P9072K1718l149R0351l9490j40165q0155P0889J69314l3175
$$ -174314 -134268 -55196 -33478 -36627 53724 14234 -125931 -206086 -135197 34117 942
11470I42n3025n915j2209m9385n1692p7026L7849L4581K3934J16678P4138j7906
$$ 942 -52083 -57998 -70207 -119592 -171284 -248310 -210461 -175880 -151946 -35268 38870 20964
11458B0964K0550M4220j00825K2947O2465J2666j37022j24867j52793j9916J59844
$$ 20964 41514 85734 -15091 7856 70321 82987 -54035 -178902 -331695 -351611 -191767
11447a91767J07604O3689O664K24k548J4214j8256N4415m152P2832o7712Q6527
$$ -191767 -84163 -20474 -13810 -13586 -16134 -1920 -20176 34239 30087 102919 35207 121734
11435A21734j2430r4766p700l5800K2032j3013j00554l8812j9945J35954N1138
$$ 121734 109304 14538 6838 -28962 -6930 -19943 -120497 -159309 -179254 -43300 7838
11424G838K5248Q5877R3333n8875j73387j6592J02108k8149J055R9782J65833
$$ 7838 33086 118963 212296 153421 -19966 -36558 65550 37401 38456 138238 304071
11413C04071l7388m8439j0105q6853n2277o116J38317j08306j53412j12743M3050
$$ 304071 266683 218244 208139 121286 69009 62893 201210 92904 -60508 -173251 -130201
11402a30201Q2714j29657j6000P5572J47371n7298n3846q5663J96O9032M9870
$$ -130201 -47487 -177144 -193144 -117572 29799 -27499 -81345 -167008 -166812 -97780 -47910
11391d7910j29935Q013J74714n3566p5510L4312J34067q5142q4111n8653P9564
$$ -47910 -177845 -169832 4882 -48684 -124194 -89882 44185 -40957 -125068 -183721 -104157
11380a04157J79138J00862J3266N5650l7814j55883o5990J18785j46908p3324
$$ -104157 74981 175843 189109 244759 206945 51062 -14928 103857 -43051 -116375
11370a16375J39039L2866R775K40958Q1070j23506l3899K3583r2579p8740o2077
$$ -116375 22664 55530 65305 306263 387333 263827 229928 253511 160932 82192 20115
11359B0115q7451P2098J59783K516o6687M8249J546o4583j08068j75686j1637
$$ 20115 -67336 4762 164545 167061 100374 148623 150169 85586 -22482 -198168 -209805
11348b09805J25800Q8750n1789l6486k1853N6394m4005N9398j10724j01621M6896
$$ -209805 -84005 4745 -47044 -83530 -105383 -48989 -92994 -33596 -144320 -245941 -199045
11337a99045M6998K2713O3892O217K2050n3005o9720j6115J20399N4768O2689
$$ -199045 -152047 -129334 -65442 -59225 -37175 -90180 -159900 -176015 -55616 -848 61841
11326F1841J26851q4134r8666n6952j43100O1228J45882L7993M1908L6719j76310
$$ 61841 188692 104558 5892 -51060 -194160 -132932 12950 50943 92851 129570 -46740
11315d6740j32505Q6664Q5667p4171j01924M3143K06416Q2568p5261j60026p1882
$$ -46740 -179245 -92581 -6914 -81085 -183009 -139866 66550 149118 73857 -86169 -158051
11304a58051m7928K380R1137M050p1567j9818M7395J39436q3236j00019J44044
$$ -158051 -205979 -203599 -112462 -108412 -179979 -199797 -152402 -12966 -96202 -196221 -52177
11293e2177J3388m1521j2477J26672N3000j09230p7870n2489o5845N9909J31576
$$ -52177 -38789 -80310 -92787 33885 86885 -22345 -100215 -152704 -218549 -158640 -27064
11282b7064O1256q203p5991M7554n1937P4420M1835n0367k4800k8o2751j16742
$$ -27064 34192 25989 -50002 -2448 -54385 20035 61870 11503 -13297 -13325 -76076 -192818
11270a92818j5304J28428J197o64k3945p1277P5141k7592k3903P1316K1843k6587
$$ -192818 -208122 -79694 -78497 -79161 -103106 -174383 -99242 -126834 -150737 -79421 -57578 -84165
11258h4165J22769J18133q9706q4137k2892L7521m3801j3142J5524k631o3538
$$ -84165 38604 156737 67031 -17106 -39998 -2477 -46278 -59420 -43896 -46527 -110065
11247a10065q4511O6848K2895k9269j7407J10288Q4813r1918P781N2251o7095
$$ -110065 -194576 -127728 -104833 -134102 -151509 -41221 43592 -48326 -40545 11706 -55389
11236e5389j00397O2253P0667J07754J9771j53676j8092N7178q3249j7861L1481
$$ -55389 -155786 -93533 -22866 84888 104659 -49017 -67109 -9931 -93180 -111041 -79560
11225g9560N8070k1277j10822L2152J15937M1614j0378k0223o6186m7152j8354
$$ -79560 -21490 -42767 -153589 -121437 -5500 36114 25736 5513 -60673 -107825 -126179
11214a26179P2860J09783J8710j09826M1312J05695n14r0729k9321m9051n2725
$$ -126179 -53319 56464 75174 -34652 6660 112355 111841 21112 -8209 -57260 -109985
11203a09985m492N7851M4893l6372l8059N3439m3193r9950q101J08086Q2570O399
$$ -109985 -114477 -56626 -11733 -48105 -86164 -32725 -75918 -175868 -183969 -75883 6687 13086
11191A3086N1461m1694O2430Q3167o9971j06074o3841j05891o0380J04006O6761
$$ 13086 64547 22853 85283 168450 98479 -7595 -71436 -177327 -237707 -133701 -66940
11180f6940l6959R7895M8917J1303N7108j53150k4634l4396J09813M0352P5042
$$ -66940 -103899 -6004 42913 54216 111324 -41826 -66460 -100856 8957 49309 124351
11169A24351m2648j3278j1966M5106L2969Q3341p364m4012j14642j32425l9214
$$ 124351 81703 68425 56459 101565 134534 217875 210511 166499 51857 -80568 -119782
11158a19782P7562Q9145O8985M9459J0636j65958j86678J05691Q9522j08070p614
$$ -119782 -42220 46925 115910 165369 176005 10047 -176631 -70940 18582 -89488 -97102
11147i7102j5917j6927N0712L4231L8395j4164q7764M9896J31120L0302J7655
$$ -97102 -113019 -129946 -79234 -45003 -6608 -20772 -108536 -58640 72480 102782 120437
11136A20437l1173j1719m1755L9339O121P7400p7198l4861M3099L0352m3907p5780
$$ 120437 89264 77545 35790 75129 81250 158650 81452 46591 89690 120042 76135 355
11124C55l6384L1021M14l1416N4880R0812q283n981k7272O4256j43367j24763
$$ 355 -36029 -5008 -4594 -36010 18870 109682 101399 95418 68146 132402 -10965 -135728
11112a35728m7758Q1690K7234O6945J03596J6302m8747j2929q5773j94329k793
$$ -135728 -183486 -101796 -74562 -7617 95979 112281 63534 50605 -35168 -229497 -232290
11101b32290Q9260p8617J01300J51576L3253j02899k627L2884m435J52022J1737
$$ -232290 -143030 -221647 -120347 31229 64482 -38417 -41044 -8160 -12595 139427 151164
11090A51164o1481J13175j2765q5363j01139J4474j0290n0483j12828M2478M7422
$$ 151164 89683 202858 190093 104730 3591 18065 7775 -42708 -155536 -113058 -65636
11079f5636J20779R4620o5845j30773M7434R3655P4498p1182j55038J24153J79315
$$ -65636 55143 149763 83918 -46855 579 94234 168732 97550 -57488 66665 245980
11068B45980L311j92949p3796O2576J08703J5303j33568l5495P0702j4176Q11
$$ 245980 249291 56342 -17454 45122 153825 169128 35560 65 70767 56591 57402
11057E7402l9066j28073n8113q6750j4506J22586J60697k7054R129M0511j0252
$$ 57402 18336 -109737 -167850 -254600 -269106 -146520 14177 -12877 -3748 36763 26511
11046B6511j5338J07881Q1880q0509n5845J55660J31555M7566M5227l4717J5043
$$ 26511 11173 119054 200934 120425 64580 220240 351795 399361 444588 409871 424914
11035D24914R7148j5584j2304k5079l2326j15775K6698J83421J46611J33404N2067
$$ 424914 522062 506478 494174 469095 436769 320994 347692 531113 677724 811128 863195
11024H63195L3705q6827m5425k8829j23626J16752R1478L1024m711m3168m059
$$ 863195 896900 810073 764648 735819 612193 728945 820423 851447 846736 803568 799509
11013G99509Q6089M7272N0921J0238j00610j05468j13245j39539q9824J15611
$$ 799509 885598 932870 983791 994029 893419 787951 674706 535167 445343 560954
11003E60954K1949M5578J35747J6650L9567q6778p4709j0613p3799j20836j6941
$$ 560954 582903 628481 764228 780878 820445 733667 658958 648345 574546 453710 436769
10992D36769r6846J4930J62737j6744o3265r5164n8751m758n2745j35919m8170
$$ 436769 339923 354853 517590 500846 437581 342417 283666 278908 226163 90244 42074
10981D2074r804R8884r1411Q7243l0920j2011O5256K2511r2827L8481N0502K657
$$ 42074 32270 131154 39743 126986 96066 84055 149311 171822 78995 117476 167978 170635
10969A70635j0923j08547Q1960J3561l3981o4676K4149q4470j25684Q4949J8095
$$ 170635 159712 51165 133125 146686 112705 48029 72178 -12292 -137976 -53027 -34932
10958c4932j2258r439M3644L1691n9350M2620M1077o3182K6293J1530p8241l274
$$ -34932 -47190 -56629 -12985 18706 -40644 1976 43053 -20129 6164 17694 -60547 -63821
10946f3821q859M6220R3810J86854O4560j47819n1433J3165k906n3997l5761J7188
$$ -63821 -72680 -26460 67350 254204 318764 170945 119512 132677 129771 75774 40013 57201
10934E7201j4768J8080K7554l9464m2738j32350J32551R1605r7766J6201m3165
$$ 57201 42433 60513 88067 48603 5865 -126485 6066 97671 -95 16106 -27059
10923b7059J5595k8592l7974M5213J00776M4458q3978p9086O8265K6011K7170
$$ -27059 -11464 -40056 -78030 -32817 67959 112417 28439 -50647 17618 43629 70799
10912G0799o1863k0865M2340O3564l2226l6277l8075M7996K3450M1716n526k20561
$$ 70799 8936 -11929 30411 93975 61749 25472 -12603 35393 58843 100559 95033 -125528
10900a25528m0414L9505N9138O5463J50251p7260n1917K6227j8339L1960n958
$$ -125528 -165942 -126437 -67299 -1836 148415 71155 19238 45465 27126 59086 53128
10889E3128q6799k9628N4817Q2420K4792p3703j05839M5260L8467m3057k4988
$$ 53128 -33671 -63299 -8482 73938 98730 25027 -80812 -35552 2915 -40142 -65130
10878f5130j00993r0198q260L6875Q0141Q6001m2895J20599J53753j13157m8182
$$ -65130 -166123 -256321 -264581 -227706 -147565 -61564 -104459 16140 169893 56736 8554
10867H554P922J8922J08847O6030J41412n2868j50653n4250k0858R4036K0729
$$ 8554 16476 35398 144245 210275 351687 298819 148166 93916 73058 167094 187823
10856A87823o4092K9523m0575k9159l5647j3963J02948O9036j45963k4537M768
$$ 187823 123731 153254 112679 83520 47873 33910 136858 205894 59931 35394 40162
10845D0162k1373m0933J50929o76j7666M313q372J476J3208j7070o877k43j67204
$$ 40162 18789 -22144 128785 128109 110443 114756 106384 107860 121068 103998 97121 96878 -70326
10832g0326j33767l8852J32745K9687Q2726P4023K2411N0k3630j1592j0525L1321
$$ -70326 -204093 -242945 -110200 -80513 2213 76236 98647 98697 75067 63475 52950 84271
10820H4271n8842n7461l4561J3847K0977M5547l7159Q8010N2401r907N8161q948
$$ 84271 25429 -32032 -66593 -52746 -31769 13778 -23381 64629 117030 107123 165284 156336
10808A56336j42105j13085L2248m2962m9322P9315O1624L0184K9764l1198j09853
$$ 156336 14231 -98854 -66606 -109568 -158890 -79575 -17951 12233 41997 10799 -99054
10797i9054L9856o6660J4420Q8764j4937P4501R2575n7945J02185L9105J6165
$$ -99054 -59198 -125858 -111438 -22674 -37611 36890 129465 71520 173705 212810 228975
10786B28975J287r2361k6866j09005l3578O8380O9843o3074k2172j3519j10438
$$ 228975 230262 137901 111035 2030 -31548 36832 106675 43601 21429 7910 -102528
10775a02528M9699M6729r8571P3283N8639l6431j61708l0877J59879J0864J05198
$$ -102528 -52829 -6100 -104671 -31388 27251 -9180 -170888 -201765 -41886 -31022 74176
10764G4176j08002p7456J3167K7652J01035Q576J0900M1133Q630k5920P6662N5052
$$ 74176 -33826 -111282 -98115 -70463 30572 39148 50048 91181 99811 73891 150553 205605
10752B05605j83743M4548N0103j44130K48K31451J01176j47835n6841j31741m720
$$ 205605 21862 66410 116513 -27617 -27369 204082 305258 157423 100582 -31159 -35879
10741c5879m0105N960O441k7526J68202J15285J0591j1702P6575J81900K5281
$$ -35879 -75984 -70024 -63583 -91109 77093 192378 202969 191267 267842 449742 475023
10730D75023j41514j89301K6284L744m1803O6895k863j220P0363R3592J50100
$$ 475023 333509 144208 170492 174236 132433 199328 196465 195245 265608 359200 509300
10719E09300J20263J60473J58213J21535J77455J81878J09575j70817k33124o2536
$$ 509300 629563 790036 948249 1069784 1247239 1429117 1538692 1367875 1134751 1072215
10709A072215n6449r0639j98944k08548k06782k15169j20222R8935L9432n9296
$$ 1072215 1015766 925127 726183 517635 310853 95684 -24538 74397 113829 54533
10699E4533M1331m2135P2249o651P2134J4239p3245n0753j07599J146Q0973p644
$$ 54533 95864 53729 125978 119327 191461 205700 132455 81702 -25897 -24751 56222 48578
10687D8578K8175M8668n4957j52945j7326O370R1698K9361m0134o9529j9930o2869
$$ 48578 76753 125421 70464 -82481 -99807 -93437 -1739 27622 -12512 -82041 -101971 -164840
10675a64840k5295J074Q5063m8437r3995l1110o8440J19116O6353K41034N8334
$$ -164840 -190135 -189061 -103998 -152435 -246430 -277540 -345980 -226864 -160511 80523 138857
10664A38857j04085p5474m1152o4210J4341Q7719Q7060p7358o9784k2763Q3044
$$ 138857 34772 -40702 -81854 -146064 -131723 -44004 43056 -34302 -104086 -126849 -43805
10653d3805L3108L4712Q3413l1167J50727K43105L6036L0011K15839K25600K05419
$$ -43805 -10697 24015 107428 76261 226988 470093 506129 536140 751979 977579 1182998
10642A182998J80893K06273M9851j41338k39811J1367l0820o5719k06620j4720
$$ 1182998 1363891 1570164 1620015 1478677 1238866 1250233 1219413 1153694 947074 932354
10632I32354J48743J37771J68032K16824K01124K89573K84640M79313N58860L65435
$$ 932354 1081097 1218868 1386900 1603724 1804848 2094421 2379061 2858374 3417234 3782669
10622C782669K02784M43623M39128N59940P17381R17653R17864J194513J829039
$$ 3782669 3985453 4429076 4868204 5428144 6145525 7063178 7981042 9175555 11004594
10613A1004594K603191L521650M645800O296072P950069Q992041Q473694O192898
$$ 11004594 13607785 17129435 21775235 28071307 36021376 45013417 53487111 59680009
10605E9680009L428620J263722l34050r23844o9865K165987N736310J0105168
$$ 59680009 63108629 64372351 64038301 63114457 63044592 65210579 70946889 81052057
10597H1052057J4839366J7689024J5780390R298260K332798k641425o344689p880405
$$ 81052057 95891423 113580447 129360837 138659097 140991895 138350470 132005781 124125376
10589A24125376o257296j594471M807006J2062876J8831005K1976083J7418681
$$ 124125376 117868080 116273609 121080615 133143491 151974496 173950579 191369260
10582A91369260O821064l310712j0310000j5554641j7992682j6047467j0711272
$$ 191369260 198190324 194879612 184569612 169014971 151022289 134974822 124263550
10575A24263550l815803K878696Q127837J0166975O765379o32408p171429j1430316
$$ 124263550 120447747 123326443 131454280 141621255 148386634 147754226 140582797 129152481
10567A29152481j4288227j5129490j3074200r229034n259675j540550P35721J421874
$$ 129152481 114864254 99734764 86660564 77431530 72171855 70631305 71367026 72788900
10559G2788900k1924k719449n275675p075909q235436q454446p593336o204597
$$ 72788900 72766976 70047527 64771852 57695943 49460507 41006061 33412725 27208128
10551B7208128m660876l404254k683374k220415j669266j250622j077768r06002
$$ 27208128 22547252 19142998 16459624 14239209 12569943 11319321 10241553 9335551
10543I335551r57710o95986n37845m98284m05231k69235l28325l99188m68846
$$ 9335551 8377841 7681855 7144010 6645726 6240495 5971260 5642935 5243747 4774901
10534D774901k72437k64113k74818j97714k09127q9893j97206m1639q0843j31411
$$ 4774901 4502464 4238351 3963533 3765819 3556692 3466799 3269593 3227954 3147111 3015700
10524C015700j71438o1201r2842j55317j60379M0349l4820j46239j67151j44098
$$ 3015700 2844262 2783061 2690219 2534902 2374523 2414872 2380052 2233813 2066662 1922564
10514A922564q308m1817j37686q1162k7688j74590o4946K3982J03394J3205j50857
$$ 1922564 1914256 1872439 1734753 1653591 1625903 1451313 1386367 1410349 1513743 1526948 1376091
10503A376091m9680r0400m6363N5628o5557j84223J13504J00728J94j09167K1346
$$ 1376091 1326411 1236011 1189648 1245276 1179719 995496 1109000 1209728 1209922 1100755 1122101
10492A122101l2340q1422j08662J5091j32948p4969K9715J58800J15320Q0236
$$ 1122101 1089761 1008339 899677 914768 781820 706851 736566 895366 1010686 1090922
10482A090922P612N831r6044j21783m0959q7481M0541O4334n2343o5896j0164
$$ 1090922 1098534 1104365 1008321 886538 845579 758098 798639 862973 810630 744734 734570
10471G34570L0889L1645j42568r6244k5699J5671P4380K631j89339k10770Q7690
$$ 734570 765459 797104 654536 558292 532593 548264 622644 625275 435936 225166 312856
10460C12856P8444J08466k852l1819K572m4241j04845r7367N5113N7525j55354
$$ 312856 391300 499766 496914 465095 467667 423426 318581 221214 276327 333852 178498
10449A78498M9430J09054J51110j1070J1317o0374j03166r865L9131r2076j24226
$$ 178498 227928 336982 488092 477022 488339 427965 324799 314934 354065 261989 137763
10438A37763J47523J12512j24563q3888N7430j0231R1129N2338Q840K049m0749
$$ 137763 285286 397798 273235 189347 246777 236546 327675 380013 388853 390902 350153
10427C50153o2540K2687p1816J5564N7770m5368r2311o7875n3168N5207M7787
$$ 350153 287613 310300 238484 254048 311818 266450 174139 106264 53096 108303 156090
10416A56090l9299N4450P1184l5911Q5521j2384L1642M4958j1021q4037l9503
$$ 156090 116791 171241 242425 206514 292035 279651 311293 356251 345230 261193 221690
10405B21690p3917m3035L4479o6707n3736J27041Q4842O3184M5674N014j17420
$$ 221690 147773 104738 139217 72510 18774 145815 230657 293841 339515 344529 227109
10394B27109j25865n3411J16335N3688M6811j5537j43891k6165Q742j5341L2517
$$ 227109 101244 47833 164168 217856 264667 249130 105239 79074 87816 72475 104992
10383A04992p784N389O2218n978k2276k3607M1897l6135p4506L3062Q5591P4809
$$ 104992 97208 102597 164815 158837 136561 112954 154851 118716 44210 77272 162863 237672
10371B37672J1695m9413J1150J2832O2522J42149j8534k67247j57309k8963O943
$$ 237672 249367 199954 211104 223936 286458 428607 410073 142826 -14483 -43446 -36503
10360c6503l151L2041M0681M8064K0077j6520l0306O9181j4652q3870j2341N9947
$$ -36503 -39654 -7613 33068 81132 101209 84689 54383 123564 108912 25042 12701 72648
10348G2648n629N8259R9071J58323k7746j42215n3922N7712q0975l9730q5732
$$ 72648 67019 125278 224349 382672 354926 212711 158789 216501 135526 95796 10064
10337A0064m1617O2736Q5589k2398p8058j10745J25964J19591J11262P0112o1259
$$ 10064 -31553 31183 116772 94374 16316 -94429 31535 151126 262388 332500 271241
10326B71241r7733O279J00986r1644M3013L6951j05948n7739R4537r9170j28445
$$ 271241 173508 179787 280773 189129 232142 269093 163145 105406 199943 100773 -27672
10315b7672n7469j921L8989P8526j4294j26548k0024P4099o3921L4312O7936P5956
$$ -27672 -85141 -87062 -48073 30453 16159 -110389 -130413 -56314 -120235 -85923 -17987 57969
10303E7969p9332j91203M9969K57187J19314J5387j36742L792J16470j7045k284
$$ 57969 -21363 -212566 -162597 94590 213904 229291 92549 96341 212811 195766 193482
10292A93482j13598K7208M8854J6678o6018l0499n7715N7633J75234o1314p9652
$$ 193482 79884 107092 155946 172624 106606 76107 18392 76025 251259 189945 110293
10281A10293N3518K4089M5025o446l707M4231K0758j50944m6851m7324j9007j63
$$ 110293 163811 187900 232925 226479 222772 267003 287761 136817 89966 42642 23635 23472
10269B3472K3339Q7557J06057j6487r7606n5995J0284j15115L2186L9671k3439
$$ 23472 46811 134368 240425 223938 126332 70337 80621 -34494 -2308 37363 13924
10258A3924K8843J9664R2748M8800p2160l2542K3844n2738k694J86882Q5805o1803
$$ 13924 42767 62431 155179 203979 131819 99277 123121 70383 67689 254571 340376 278573
10246B78573N432q9506p6829o8550K1079j7181O7059j3213n1059k9155J20173
$$ 278573 284005 194499 117670 49120 70199 53018 120077 106864 55805 26650 146823
10235A46823p0976j61537q535l3874M4456P7047J17469o5015j10733n5716M2933
$$ 146823 75847 -85690 -94225 -128099 -83643 -6596 110873 45858 -64875 -120591 -77658
10224g7658J56179O8974J151O8065O6057q4279q2014J744j3731m5679j10688o705
$$ -77658 78521 147495 148646 216711 282768 198489 116475 118219 104488 58809 -51879 -58584
10212e8584l9183J0434L342P3675m720J518K2236R500L0195O6151Q0360K0599
$$ -58584 -97767 -87333 -83991 -10316 -15036 -13518 8718 18218 48413 114564 194924 215523
10200B15523P739j57146p1190n8195l4869O2239P5305j3925R3727M4846j20963
$$ 215523 223262 66116 -5074 -63269 -98138 -35899 39406 25481 119208 164054 43091
10189D3091o572M4675J17585N717n1741j60128P8188L2717q0366K2273Q7049k7574
$$ 43091 36519 81194 198779 204496 152755 -7373 70815 103532 23166 45439 132488 104914
10177A04914k5147J61071Q787j4006O1883k474n5416K3347k6280J22736M5527
$$ 104914 79767 240838 249625 235619 297502 295028 239612 262959 236679 359415 404942
10166D04942J9336R4008q6272L1618N6738J14006N9479Q709r215j6483J26386
$$ 404942 424278 518286 432014 463632 520370 634376 693855 702564 693349 676866 803252
10155H03252K3084j09773j16328k2062j7210R5560O0781J03084K41624Q4510j23545
$$ 803252 826336 716563 600235 578173 560963 656523 717304 820388 1062012 1146522 1022977
10144A022977l0449N207j09039j00135j47121j65376N7432J30779Q322N0313L4526
$$ 1022977 992528 997735 888696 788561 641440 476064 533496 664275 672597 722910 757436
10133G57436J14303k7537j51692j34121j5265J0712j8948n7097O1160N5647P9566
$$ 757436 871739 844202 692510 558389 543124 553836 534888 477791 538951 594598 674164
10122F74164j57012j59004k8712q404j05959p7172M8135J04024l9724m1655j39713
$$ 674164 517152 358148 329436 321032 215073 137901 186036 290060 250336 208681 68968
10111F8968K3184j8327j42177m6165L8139O02J03981J10751R9313P0465m8284
$$ 68968 92152 73825 -68352 -114517 -76378 -75776 28205 138956 238269 308734 260450
10100B60450j9149p5300J5779k9266m6645j53505m8634l2638q3914N6089k9896
$$ 260450 241301 166001 181780 152514 105869 -47636 -96270 -128908 -212822 -156733 -186629
10089a86629N4903P4128M7929O2830k0150K8577p3824K738M8568J05190j13096
$$ -186629 -131726 -57598 -9669 53161 33011 61588 -12236 -9498 39070 144260 31164
10078C1164o3118P2633J02963L1087J4528l1189q4336N0547l3043n6272Q2192
$$ 31164 -31954 40679 143642 174729 189257 158068 73732 124279 91236 34964 117156
10067A17156J0241l0181j2865j02155p2673j7403Q033Q9799J16747m8931n9298
$$ 117156 127397 97216 84351 -17804 -90477 -107880 -99847 -10048 106699 57768 -1530
10056a530l5318L5562j31839n9942L4899J07686J38322M9130k7807L6294Q2213
$$ -1530 -36848 -1286 -133125 -193067 -158168 -50482 87840 136970 109163 145457 227670
10045B27670K2434J9327O8049l4650j84646k2874m539j21530q3305J2702P3399
$$ 227670 250104 269431 337480 302830 118184 95310 90771 -30759 -114064 -101362 -27963
10034b7963J05772P658J2243n214r5226l2944M5477j0556j12224n8212J17383
$$ -27963 77809 85467 97710 92496 -2730 -35674 9803 -753 -112977 -171189 -53806
10023e3806L1993n1220O5147J65578k4108m4349j32601r2310R7584M2178n5014
$$ -53806 -21813 -73033 -7886 157692 133584 89235 -43366 -135676 -38092 4086 -50928
10012e0928N9570R7074P6690n5783j83578j83493K5619K872N8519J8344n1144
$$ -50928 8642 105716 182406 126623 -56955 -240448 -214829 -211957 -153438 -135094 -186238
10001a86238R3875J46420R24k8598l9479m7122k9970J72901P8997L6494O32m6380
$$ -186238 -92363 54057 54981 26383 -13096 -60218 -90188 82713 161710 198204 198836 152456
9989A52456j5270N538m0228Q1440J2128Q0443P0229R1716K3947j03287j03608
$$ 152456 137186 142724 102496 183936 196064 276507 346736 438452 462399 359112 255504
9978B55504o7446J42670n3029k41545l4420J35033J77548J0579j23468j18445
$$ 255504 188058 330728 277699 36154 1734 136767 314315 324894 201426 82981
9968H2981p7932L2974j11712L5291O5096Q7972k0927K0020J09526Q0355j8654
$$ 82981 5049 38023 -73689 -38398 26698 114670 93743 113763 223289 303644 284990
9957B84990k08224m8358l0743l4969N139L7486K9300j07732o5065J00584P6257
$$ 284990 76766 28408 -2335 -37304 -32165 5321 34621 -73111 -138176 -37592 38665
9946C8665Q1556L2418m6029O6014N5148r1450l7077L6261J27576L6433L1416o4886
$$ 38665 120221 152639 106610 172624 227772 136322 99245 135506 263082 299515 330931 266045
9934B66045j45060J11511N7478l3551R7179Q6152K19733K11433L67400P98341
$$ 266045 120985 232496 289974 256423 353602 439754 659487 870920 1238320 2036661
9924B036661J357648P64435l62508k02125l04196p57188q99649n19462k94802
$$ 2036661 3394309 4158744 3796236 3594111 3289915 2532727 1633078 1113616 818814
9915H18814j97266k63000j49037q4574N3233n4017l6817l283l218m4998L4644
$$ 818814 621548 358548 209511 124937 178170 124153 87336 84053 80835 35837 70481
9904G0481P2968K0467o7694L5315j30864r869O5862M2177J21770J6226n2547O729
$$ 70481 143449 163916 96222 131537 673 -9196 56666 98843 220613 236839 184292 191021
9892A91021l7655l8783q3785l0818j10943K6112Q4341Q3969l6041L0597K6997
$$ 191021 153366 114583 30798 -20 -110963 -84851 -510 83459 47418 78015 105012
9881A05012o0418p2850p3074n5260J40911J66970k6507o2394q1978J3944K5422
$$ 105012 44594 -28256 -101330 -156590 -15679 151291 124784 62390 -19588 -5644 19778
9870A9778R7416k8003r7126r1445o9144J29130J20202N4452p144N4568J8150j40873
$$ 19778 117194 89191 -7935 -99380 -168524 -39394 80808 135260 128116 182684 200834 59961
9858E9961j82208l0599O1415Q207J49861M3838j53951R041P0037K4892r863L3322
$$ 59961 -122247 -152846 -91431 -83224 66637 110475 -43476 -34435 35602 60494 50631 83953
9846H3953Q1955j29441j6843k9776q1245r423N3413Q6430J2691j76799j6397n2679
$$ 83953 165908 36467 19624 -10152 -91397 -100820 -47407 39023 51714 -125085 -141482 -194161
9834a94161m1086O0895J54339J13553N1689n659l8890j5020n1998j02252p7479
$$ -194161 -235247 -174352 -20013 93540 145229 139570 100680 85660 33662 -68590 -146069
9823a46069J22524L5444q8415q9402M5287j234K7464J60281J551O4188L9510q6964
$$ -146069 -23545 11899 -76516 -165918 -120631 -121865 -94401 65880 67431 131619 171129 84165
9811H4165m2761k6860o7165N6293p8650m8445k2489q8410n024l5631P777J11451
$$ 84165 41404 14544 -52621 3672 -74978 -123423 -145912 -234322 -239346 -274977 -267200 -155749
9799a55749n126R018M6927J23334l5819M4961L7794M6436O4621o1568p7532q6321
$$ -155749 -160875 -151857 -104930 18404 -17415 27546 65340 111776 176397 114829 37297 -49024
9787d9024J37607Q5491r3801J1328n5073P5158J3243l8808k9548l3526r681O9973
$$ -49024 88583 174074 80273 91601 36528 111686 124929 86121 56573 23047 13366 83339
9775H3339N2924K25135L18624L46279K46374l5321j24700j75272k49901k56673
$$ 83339 136263 361398 680022 1026301 1272675 1237354 1112654 937382 687481 430808
9765D30808j53805M572l5487r6832k47530k8603k8010R0714J18735j9761M964
$$ 430808 277003 281575 246088 149256 -98274 -126877 -154887 -64173 54562 34801 39765
9754C9765r9551o3880M5642J2772N4747j2138n8999M8608J76845k2047j23668
$$ 39765 -59786 -123666 -78024 -65252 -10505 -22643 -81642 -33034 143811 121764 -1904
9743a904R266N3069Q2678J8508J1482r7462j7528J1758K4265n8727o2052P3254
$$ -1904 7362 60431 143109 161617 173099 75637 58109 69867 94132 35405 -26647 46607
9731D6607M9761l5504l5477q0380r332n8454P0148J01539K3858m3623N7044q9970
$$ 46607 96368 60864 25387 -54993 -64325 -122779 -52631 48908 72766 29143 86187 -3783
9719c783J08060j08837j11748K9588J20156O1807j26682J05819J5145j90845n5823
$$ -3783 104277 -4560 -116308 -86720 33436 95243 -31439 74380 89525 -101320 -157143
9708a57143L0206N9491k4901j08943J37425O9775O2905j09368m2488P1866L7655
$$ -157143 -126937 -67446 -92347 -201290 -63865 5910 68815 -40553 -83041 -11175 26480
9697B6480n2119r4259J06221J12927K330q3644k8458J17505p3568J8248q636p666
$$ 26480 -25639 -119898 -13677 99250 101580 17936 -10522 106983 33415 51663 43027 35361
9685C5361P9620M5189J1404l3549k3813n2035J3606k4709M6175k0401q1071O6765
$$ 35361 114981 160170 171574 138025 114212 62177 75783 51074 97249 76848 -4223 62542
9673F2542K2004L5126P466j39366M501R3973M5854j81020q0968m9969M95Q2095
$$ 62542 84546 119672 127138 -12228 -7727 86246 132100 -48920 -129888 -179857 -179362 -97267
9661i7267J160n1738K1108L2344N8260L7527j40928o3005j05567r8127K59890
$$ -97267 -96107 -147845 -126737 -94393 -36133 1394 -139534 -202539 -308106 -406233 -146343
9650a46343J22264M3377p500J17038J0127L1990O4933J18086r9598J7204r33O6802
$$ -146343 -24079 19298 11798 128836 138963 170953 235886 353972 254374 271578 270645 337447
9638C37447k0479j37144M4815K1523k3089L6457p9373j34602Q626K0417r0056
$$ 337447 316968 179824 224639 246162 223073 259530 180157 45555 54181 74598 -15458
9627a5458k6526J29856L1652p8479p5527Q9192J59144m1452j93756j15988J40216
$$ -15458 -41984 87872 119524 41045 -34482 54710 213854 172402 -21354 -137342 2874
9616B874M9418m2221k9239N9729k9403j00607j65531P9574L6651P2102n0365j5291
$$ 2874 52292 10071 -19168 40561 11158 -89449 -254980 -175406 -138755 -66653 -117018 -132309
9604a32309R9365P7679M6120p4703J48564R6585r3028j02152l728L1284J5724
$$ -132309 -32944 44735 90855 16152 164716 261301 168273 66121 62393 93677 109401
9593A09401p1714l7187P9049J11719j40977q1988k0334N4087n4582O4424J30869
$$ 109401 37687 500 79549 191268 50291 -31697 -52031 2056 -52526 11898 142767
9582A42767n0563p9391r209L5707j7180p7583j15423q8129J0919Q2360N1409J3712
$$ 142767 92204 12813 3604 39311 22131 -55452 -170875 -259004 -248085 -165725 -114316 -100604
9570a00604L7976P1721L7424p8133N0603j7632j01014M889P2548j27720o3470
$$ -100604 -62628 9093 46517 -31616 18987 1355 -99659 -94770 -22222 -149942 -213412
9559b13412J26228J14530p4381J00311J3708O4397R8493j40299k24139N0231q2262
$$ -213412 -87184 27346 -47035 53276 66984 131381 229874 89575 -134564 -84333 -166595
9548a66595N5988Q1206m7763O1883L5588k1010J9246L0334o8606j28202m6915
$$ -166595 -110607 -29401 -77164 -15281 20307 -703 18543 48877 -19729 -147931 -194846
9537a94846O8477J53287M4640k5473M7111k0402O632p2512m4911P0959O1661j1024
$$ -194846 -126369 26918 71558 46085 93196 72794 79426 6914 -37997 32962 94623 83599
9525H3599M7736J2739p5922K1060R785p9489J7325l7781p9256J19578O0391r6941
$$ 83599 131335 144074 68152 89212 98997 19508 36833 -948 -80204 39374 99765 2824
9513B824j37075L3083K4036J09249M2195j5795l3428k9919j08889N0649K3545
$$ 2824 -134251 -101168 -77132 32117 74312 58517 25089 -4830 -113719 -63070 -39525
9502c9525O0975K0488q4402R093R3379l459k5403J09642n5637R819j7248j63467
$$ -39525 21450 41938 -42464 -33371 60008 56549 31146 140788 85151 94970 77722 -85745
9490h5745L9754j6018O237J3344M0213j9113O9334J0450l707L085m2979j03907
$$ -85745 -45991 -62009 -55772 -42428 -2215 -21328 48006 58456 54749 57834 14855 -89052
9478h9052q4112Q2456K9801k4175K5337J46971j1054j11351j3952J4569M4440
$$ -89052 -173164 -90708 -60907 -85082 -59745 87226 76172 -35179 -49131 -34562 9878
9467I878L7828L7395O3043L9504j12743r8180q2763j8039P8974n8966m782O6787
$$ 9878 47706 85101 148144 187648 74905 -23275 -106038 -124077 -45103 -104069 -108851 -42064
9455d2064J3728k3991K420J06049M2447j3818r4354J9633k8937j5965Q8487O5876
$$ -42064 -28336 -52327 -49907 56142 98589 84771 -9583 10050 -18887 -34852 53635 119511
9443A19511l9315n3241L6217N1758n9553M2564R7575M7148L634p1362J1738M0319
$$ 119511 80196 26955 63172 114930 55377 97941 195516 242664 246298 174936 186674 226993
9431B26993K210q1329j29006k3631j5377n8990o4462M6697R6505L0296k0470P0170
$$ 226993 229203 147874 18868 -4763 -20140 -79130 -143592 -96895 -390 29906 9436 79606
9419G9606j4205q1068P9826J46998O9764j97825j29746o5915J873k1917j8449
$$ 79606 65401 -15667 64159 211157 280921 83096 -46650 -112565 -110692 -132609 -151058
9408a51058n171m014N9753O2228n8972N0383O2882m5801p8175J04936L3752r5235
$$ -151058 -156229 -160243 -100490 -38262 -97234 -46851 16031 -29770 -107945 -3009 30743 -64492
9396f4492k8095O6580J64268O6971q9432k5864R6545O0350m3731j01059j53447
$$ -64492 -92587 -26007 138261 205232 115800 89936 186481 246831 203100 102041 -51406
9385e1406Q9650K7316l7701K0904M6798P3738J6322o784l0215l1991j0297K7995
$$ -51406 38244 65560 27859 48763 95561 169299 185621 178837 148622 116631 106334 134329
9373A34329M0006Q7905j01848o0409j3742j6171p996K4184o3665M3877J00031
$$ 134329 174335 262240 160392 99983 86241 70070 62074 86258 22593 66470 166501
9362A66501j42721j44647L9168J43546k6163n9994n4434J2238N8174J14456l1111
$$ 166501 23780 -120867 -81699 61847 35684 -24310 -78744 -66506 -8332 106124 75013
9351G5013n6556J9336k1978L122r015L8507N4875j61245L9719M6975J0587p2549
$$ 75013 18457 37793 15815 18937 9922 48429 103304 -57941 -18222 28753 39340 -33209
9339c3209j8183J19419o3370j41667J5374J34029P1548J7186j26775l5710O8576
$$ -33209 -51392 68027 4657 -137010 -121636 12393 83941 101127 -25648 -61358 7218
9328G218j18119r8206J02910N2358q5013J4161J31079Q4052p8196K9988n4113
$$ 7218 -110901 -209107 -106197 -53839 -138852 -124691 6388 90440 12244 42232 -11881
9317a1881j1532p5150P0699N7757o1383O05n2009j8114J73949l9321j4899L3231
$$ -11881 -23413 -98563 -27864 29893 -31490 -30885 -82894 -101008 72941 33620 18721 51952
9305E1952J08869Q034J4105j39252k11203M2214J37818P0076J03207j37042r9390
$$ 51952 160821 168855 182960 43708 -167495 -125281 12537 82613 185820 48778 -50612
9294e0612n0776O2111n2217L4477m1937J9406O8133k6429j81988j201O2607M1655
$$ -50612 -101388 -39277 -91494 -57017 -98954 -79548 -11415 -37844 -219832 -221033 -158426 -116771
9282a16771k2546o960l4165N7588O4866o8822J13985m029p6907n8178L4975J1909
$$ -116771 -139317 -146277 -180442 -122854 -57988 -126810 -12825 -16854 -93761 -151939 -116964 -105055
9270a05055J31034m3748J3406P9304n7397m8858o1728o6200J671J62700j3712
$$ -105055 25979 -17769 -4363 74941 17544 -31314 -93042 -159242 -157571 5129 -8583
9259h583m0129m1232O8109n24J840k0597k7381K1018M401N7101M0025l488l0806
$$ -8583 -48712 -89944 -21835 -22359 -20519 -41116 -68497 -47479 -43078 14023 54048 50560 19754
9246A9754L8131J5807J30742m9965p161R330q0573k1115j7855k0901k8103K1112
$$ 19754 57885 73692 204434 154469 147308 156638 76065 54950 37095 16194 -11909 9203
9234I203M2548j41779j26257J08344J14824j00828j688M2390P0121M7275j21718
$$ 9203 51751 -90028 -216285 -107941 6883 -93945 -95633 -53243 16878 64153 -57565
9223e7565o8521J76256l7402n3706n304l3844J07400k6037q4319l0197n2875j1138
$$ -57565 -126086 50170 12768 -40938 -46242 -80086 27314 1277 -83042 -113239 -166114 -177252
9211a77252L1599n2020k5908j4318J00211q4881K3453J87772M5084p2932o3652
$$ -177252 -145653 -197673 -223581 -237899 -137688 -222569 -199116 -11344 33740 -39192 -102844
9200a02844o5274K8952J24295k6435j1257o5146n1655K4352R1557l3400r2903
$$ -102844 -168118 -139166 -14871 -41306 -52563 -117709 -169364 -145012 -53455 -86855 -179758
9189a79758K21898Q7312q3763p8582n2505K6584J26633n7584r5357R6005K2390
$$ -179758 42140 129452 45689 -32893 -85398 -58814 67819 10235 -85122 10883 33273
9178C3273J9436R6954r1513l4389N7756n5328J2908K5538j29459r7922n4870L8942
$$ 33273 52709 149663 58150 23761 81517 26189 39097 64635 -64824 -162746 -217616 -178674
9166a78674O2392p790M6878R0649K8329m675L4625o9740p8328p5775r3790K2336
$$ -178674 -116282 -124072 -77194 13455 41784 37109 71734 1994 -76334 -152109 -245899 -223563
9154b23563p590O6332L9461o7069j4111K4348R7247P0586Q028K8717M5658J0800
$$ -223563 -231153 -164821 -125360 -192429 -206540 -182192 -84945 -14359 -6331 22386 68044 78844
9142G8844n7572l4399o4998L0957L1831J41658P8328K2731j2478j64120j22966
$$ 78844 21272 -13127 -78125 -47168 -15337 126321 204649 227380 214902 50782 -72184
9131g2184j3124M8967l9326K1385J52793J7468m2783j32845N2385M1739J7674
$$ -72184 -85308 -36341 -75667 -54282 98511 115979 73196 -59649 -7264 34475 52149
9120E2149r7127n4584m4201p4999k3090J65950M4200K0065J18040N0160j05368
$$ 52149 -44978 -99562 -143763 -218762 -241852 -75902 -31702 -11637 106403 156563 51195
9109E1195k3584j8077j1560j01381j3701J7966O6143j08321L6564K43381L7462
$$ 51195 27611 9534 -2026 -103407 -117108 -99142 -32999 -141320 -104756 138625 176087
9098A76087n8621j25555n2685J38020K5259N0849r714q2554l2501j49816R2996
$$ 176087 117466 -8089 -60774 77246 102505 153354 143640 61086 28585 -121231 -28235
9087b8235J99576m8441j35184j72692j32747K25016P007J01189j7951K9375J3000
$$ -28235 171341 122900 -12284 -184976 -317723 -92707 -85700 15489 -2462 26913 39913
9076C9913n899M8241q7765l4948m9326j0195P8077J32486M4229j5431n7050p6650
$$ 39913 34014 82255 -5510 -40458 -89784 -99979 -21902 110584 154813 139382 82332 5682
9064E682O5108l375j14854N6630M6533k7705j4663N8352K0686k6800m5495Q4545
$$ 5682 70790 67415 -47439 9191 55724 28019 13356 71708 92394 65594 20099 104644
9052A04644m1271J1466K5763p1801p1136K0423P3738l9625j20556L5393J56273
$$ 104644 63373 74839 100602 28801 -42335 -21912 51826 12201 -108355 -72962 83311
9041H3311l2524P4998k6827j95000l5196J04607N5875M1963p2218j36965o1063
$$ 83311 50787 125785 98958 -96042 -131238 -26631 29244 71207 -1011 -137976 -199039
9030a99039J75505J71228k8231N783N808j27865q4614j0356J1473K8710J77889
$$ -199039 -23534 147694 119463 125246 131054 3189 -81425 -91781 -80308 -51598 126291
9019A26291L670q3940l857l1455L8262P8141O9782j25085N374K3974j02609l5868
$$ 126291 129961 46021 42164 10709 48971 127112 196894 71809 77183 101157 -1452 -37320
9007c7320m7997l0177K4600J47175P2149N4677o1432p7242L3921P5609r481j18127
$$ -37320 -85317 -115494 -90894 56281 128430 183107 121675 44433 78354 153963 144482 26355
8995B6355L9884M5739p6766M1221J18787J382r4226K0028L9877L6872l5769m0726
$$ 26355 66239 111978 35212 76433 195220 196602 102376 122404 162281 199153 163384 122658
8983A22658j05787o2902k7350o9027K1784M665n1326O5582J50135R5745J3469
$$ 122658 16871 -46031 -73381 -142408 -120624 -115959 -167285 -101703 48432 144177 157646
8972A57646k29670r4238L1622M7087p4129J36586J23302M6723p0102n9757m6148
$$ 157646 -72024 -166262 -134640 -87553 -161682 -25096 98206 144929 74827 15070 -31078
8961c1078j54064n4420j5114J26153J08588k3326J7688O9102P7772r6133j11945
$$ -31078 -185142 -239562 -254676 -128523 -19935 -43261 -25573 43529 121301 25168 -86777
8950h6777L0339O0486M8165n1663O692M7825N3850r782j5110r3771r8882r6821
$$ -86777 -56438 4048 52213 550 7242 55067 108917 99135 84025 -9746 -108628 -205449
8938b05449N7966R2650p3843J24256J26832P2533n1773j4686o914J153J1735M6127
$$ -205449 -147483 -54833 -128676 -4420 122412 194945 143172 128486 121572 122725 134460 180587
8926A80587n1847j10264N1213J08103J1442j20770j36870l5646l1000o7773P4080
$$ 180587 128740 18476 69689 177792 189234 68464 -68406 -104052 -135052 -202825 -128745
8915a28745J66186O8843r3624r1033N4756M7270m8212K8646k0980N1760N4143
$$ -128745 37441 106284 12660 -78373 -23617 23653 -24559 4087 -16893 34867 89010
8904H9010j2787L081M2572l7790M271R3577n6051n8900J9168P0645j51753o0027
$$ 89010 76223 79304 121876 84086 88357 181934 125883 66983 86151 156796 5043 -54984
8892e4984k9187N417K1999J1169L1936k3702n7033K0064k8380p4181p3199J0959
$$ -54984 -84171 -78754 -56755 -45586 -13650 -37352 -94385 -74321 -102701 -176882 -250081 -239122
8880b39122J33940Q1996M1189J23935l6443j57543Q7391j6863j2822r1908p8147
$$ -239122 -105182 -23186 18003 141938 105495 -52048 35343 18480 5658 -86250 -164397
8869a64397J23024N3178Q8003K1551j2774j13788q5242k0557j4951J66511m6053
$$ -164397 -41373 11805 99808 121359 108585 -5203 -90445 -111002 -125953 40558 -5495
8858e495l6444P2246N4055j5630k6663Q7469N8554L4416k167o0005p5961K9985
$$ -5495 -41939 30307 84362 68732 42069 129538 188092 222508 220341 160336 84375 114360
8846A14360p535j45052n9566J35994J04376J32942m1240q4461p1550q8585m7784
$$ 114360 106825 -38227 -97793 38201 142577 275519 234279 149818 78268 -10317 -58101
8835e8101j24761j39341L6724L6795J10359K396N3383J12761N3556k77n9489k9572
$$ -58101 -182862 -322203 -285479 -248684 -138325 -135929 -82546 30215 83771 83494 24005 -5567
8823e567R507L6282n004j733j42824j00779P3267J49530J49208J16555l5610j92532
$$ -5567 3940 40222 35218 33485 -109339 -210118 -136851 12679 161887 278442 242832 50300
8811E0300j00659l9928J16963k0746M4216n4886j33286l361o008Q9429l5066Q512
$$ 50300 -50359 -90287 26676 5930 50146 -4740 -138026 -141387 -147395 -57966 -93032 -84520
8799h4520o8777K5607n0981r6564L2156J11052J0820m2371O7549K5279J3659J07069
$$ -84520 -153297 -127690 -178671 -275235 -243079 -132027 -121207 -163578 -96029 -70750 -57091 49978
8787D9978j36807j5230M2365K17995N9063k2598j07280l7998N3061O4686p3266
$$ 49978 -86829 -102059 -59694 158301 217364 194766 87486 49488 102549 167235 93969
8776I3969p023o1094r1170J38895j16352j19429l2282K5310j8101r087M7357Q9875
$$ 93969 86946 25852 -65318 73577 -42775 -162204 -194486 -169176 -187277 -196364 -149007 -59132
8764e9132m1616N3760J410j27832J9042K26230J14748L7541K6330O4864j0601
$$ -59132 -100748 -46988 -45578 -173410 -154368 71862 186610 224151 250481 315345 304744
8753C04744K7619j13607o7798j21455q9740m7969R517L4754J00331j5927k6610
$$ 304744 332363 218756 150958 29503 -60237 -108206 -98689 -63935 36396 20469 -6141
8742f141R062M7722p8484m4484k037O1434P4712n5609j42732L2022J05331Q1154
$$ -6141 2921 50643 -27841 -72325 -74362 -12928 61784 6175 -136557 -104535 796 81950
8730H1950M7959m9864l9087q7552o3451Q0858J54574q7662p6914p7399r485l5901
$$ 81950 129909 80045 40958 -46594 -110045 -29187 125387 37725 -39189 -116588 -126073 -161974
8718a61974L7565O1096L020j8051L6774O1892q961o2336l3467m0193j25941n156
$$ -161974 -124409 -63313 -60293 -78344 -41570 20322 11361 -50975 -84442 -124635 -250576 -255732
8706b55732P7354P4998K7774k6656M0922p1642q352K4371l6962L8724j2040O8628
$$ -255732 -178378 -103380 -75606 -102262 -61340 -132982 -141334 -116963 -153925 -115201 -127241 -58613
8694e8613J09632Q697j1489P472k739N9392p2403q9288q2150J20892J03625p8377
$$ -58613 51019 59716 48227 55699 52960 112352 39949 -49339 -131489 -10597 93028 14651
8682A4651j21566k24769l7904J80684J3823L7065k841J4987K9658K02342J00372
$$ 14651 -106915 -331684 -369588 -188904 -175081 -138016 -140857 -125870 -96212 106130 206502
8671B06502o6580j4790j14670p6587N4623Q6059J9297k4145j23643o2953N6106
$$ 206502 139922 125132 10462 -66125 -11502 74557 93854 69709 -53934 -116887 -60781
8660f0781J48139J0566R7775p07p6759r0583j63912l6150N2924O8365R2338l415
$$ -60781 87358 97924 195699 194992 118233 27650 -136262 -172412 -119488 -51123 41215 37800
8648C7800j6004j43144q320j6549M6461P2311r278L416L2874j95443j23577J41162
$$ 37800 21796 -121348 -129668 -146217 -99756 -27445 -36723 -33307 -433 -195876 -319453 -178291
8636a78291K41529L5209j63218k25928O6289J07077J7877p4490N2146n7058l3295
$$ -178291 63238 98447 -64771 -290699 -224410 -117333 -99456 -173946 -121800 -178858 -212153
8625b12153L8476M6902M9321P8712J74491j34462k10882p5106J06814J24749J09914
$$ -212153 -173677 -126775 -77454 1258 175749 41287 -169595 -244701 -137887 -13138 96776
8614I6776o1331l8139K4724o2256o5076N5297O1613q815j9174j58468o5305M4608
$$ 96776 35445 -2694 22030 -40226 -105302 -50005 11608 2793 -16381 -174849 -240154 -195546
8602a95546J26190O3313k2050O0172J17568p1169o6705O9131j91573J8252J30130
$$ -195546 -69356 -6043 -28093 32079 149647 78478 11773 80904 -110669 -92417 37713
8591C7713J16401N9719r4496j08112J7815k3229l5188L2682J67046O7168q803
$$ 37713 154114 213833 119337 11225 29040 5811 -29377 3305 170351 237519 228716
8580B28716j58519j17830L9860O4996K9510m1784k9303m1117J33646R1733o3684
$$ 228716 70197 -47633 -7773 57223 86733 44949 15646 -25471 108175 199908 136224
8569A36224O4708n6425M729j47508j79972J3255p2991m0259Q4616J33311L9281
$$ 136224 200932 144507 149236 1728 -178244 -164989 -237980 -278239 -193623 -60312 -21031
8558b1031P9302r1284l1949N1033N3715J02503L0396n8198n8313N3369J314j72967
$$ -21031 58271 -33013 -64962 -13929 39786 142289 172685 114487 56174 109543 110857 -62110
8546f2110o9035r7389p5163n0883O0396J40256m8043L8455O6937J07876O4912
$$ -62110 -131145 -228534 -303697 -354580 -294184 -153928 -201971 -163516 -96579 11297 76209
8535G6209R916J21876Q8423n0983j82731o5903N3429L2453R1119j5235o2402m3850
$$ 76209 86125 208001 296424 245441 62710 -3193 50236 82689 173808 158573 96171 52321
8523E2321p54P6003L2949K7297K9454k4348j49856j01882n9211K0017J1318q303
$$ 52321 51567 127570 160519 187816 217270 192922 43066 -58816 -118027 -98010 -86692 -94995
8511i4995p2220J59489R6316k7236j07322M5210N0384j21418m2615j958M4473
$$ -94995 -167215 -7726 88590 61354 -45968 -758 49626 -71792 -114407 -116365 -71892
8500g1892K9948M8242J38580J2982k0066n0842N8958l7184o4473l001M9646Q2542
$$ -71892 -41944 6298 144878 157860 137794 86952 145910 108726 44253 41252 90898 173440
8488A73440r6771p3125K4628j7113K9617L714R6220P9146P7523J10347N6750O6540
$$ 173440 76669 3544 28172 11059 40676 44390 140610 219756 297279 407626 464376 530916
8476E30916k8214r7041m7286j25136k3711R7521k1478q8209j9532m862k6766R77
$$ 530916 502702 405661 358375 233239 209528 307049 285571 197362 177830 172968 146202 147179
8464A47179K076L220o6743j22715o0424L6502Q8411K2731k124J14186L3333l2071
$$ 147179 149255 152475 85732 -36983 -97407 -60905 27506 50237 48113 162299 195632 163561
8452A63561p0133j81828L254O2322Q1461p450j24591j7949M329k5634J13734N5991
$$ 163561 93428 -88400 -85146 -22824 58637 51187 -73404 -91353 -87024 -112658 1076 57067
8440E7067M6341k8111J27573O1083j4885Q1245P0264R402M8697L5998L1495l7855
$$ 57067 103408 75297 202870 263953 249068 330313 400577 409979 458676 494674 526169 488314
8428D88314j07086k00225q4479O6540k9528l5683j7320J48905m5259j59877m8640
$$ 488314 381228 181003 96524 163064 133536 97853 80533 229438 184179 24302 -24338
8417b4338J2877m0693l2730J2991n5337K1913o579m4110l0978N0706O0646k9082
$$ -24338 -11461 -52154 -84884 -71893 -127230 -105317 -111896 -156006 -186984 -136278 -75632 -104714
8405a04714n8733J1003K9439m6867Q035J30562J99030O8544o8621J935O284l063
$$ -104714 -163447 -152444 -123005 -169872 -161837 -31275 167755 236299 167678 169613 175897 172834
8393A72834J06705J16253K08132L75626K0329r9447j16233j55185j54666k03416
$$ 172834 279539 395792 603924 979550 999879 900432 784199 629014 474348 270932
8383B70932j15193O630L6792R270K8876q5544n9221j21462M4819L0153m6573k919
$$ 270932 155739 162369 199161 208431 237307 151763 92542 -28920 15899 46052 -521 -3440
8371c440N8899R4477P147n3850Q3664N9176K0503m1345Q001j152r5623K2666j0165
$$ -3440 55459 149936 157083 103233 186897 246073 266576 225231 233232 232080 136457 159123 148958
8358A48958j32534P9973o3684r2496K0475P857M8658J23468J31935J13255L38695
$$ 148958 16424 96397 32713 -59783 -39308 -31451 17207 140675 272610 385865 724560
8347G24560N47297N08344J61857j25000j54222k47076m35046k93787r1187j50332
$$ 724560 1271857 1780201 1942058 1817058 1662836 1415760 980714 686927 595740 445408
8337D45408j37693p7670m7946m9595J7535P707k7970L3428J11645M0780n0690
$$ 445408 307715 230045 182099 132504 150039 157746 129776 163204 274849 315629 264939
8326B64939l1822m0830j61842n9724J18166L5450p7547k3496q3787l4111O0994
$$ 264939 233117 192287 30445 -29279 88887 124337 46790 23294 -60493 -94604 -33610
8315c3610O7573M6551Q7525p94o0379n6305m5752K13941N4114m4856N1052J15781
$$ -33610 33963 80514 168039 167245 106866 50561 4809 218750 272864 228008 279060 394841
8303C94841J60517K02053J39705n6652k9164M661k06573j44433r2241L4693n7640
$$ 394841 555358 757411 897116 840464 811300 815961 609388 464955 372714 407407 349767
8292C49767j02343o6742m669j03430J03723Q1483j5438p1665m5585K0128r92k8325
$$ 349767 247424 180682 176013 72583 176306 257789 242351 170686 125101 145229 144237 115912
8280A15912k9244p638l4571Q816J33973M8119j04770q063j2952l7960R4238R2993
$$ 115912 86668 79030 44459 53275 187248 235367 130597 122534 109582 71622 165860 258853
8268B58853l7819j48602j6343k3416q6215k5907m6889k6429Q7278P4279J9642
$$ 258853 221034 72432 56089 32673 -53542 -79449 -126338 -152767 -65489 8790 28432
8257B8432l0239k3253l8948J02680O1592k985l2904M5806L0335M4622J5531J1848
$$ 28432 -1807 -25060 -64008 38672 100264 97279 64375 110181 140516 185138 200669 212517
8245B12517j7718j06418j52047o8319L0141n0061r3118O053K3624O3934R3387
$$ 212517 194799 88381 -63666 -131985 -101844 -151905 -245023 -238970 -215346 -151412 -58025
8234e8025J22756L8353M6861K5867p3691n5296L2372L7961j10296l7477O6383
$$ -58025 64731 103084 149945 175812 102121 46825 79197 117158 6862 -30615 35768
8223C5768R7126K4547r6685q3301M655P37O1262J3519n9842m7526J5430p5318
$$ 35768 132894 157441 60756 -22545 -17890 -17153 44109 57628 -2214 -49740 -34310 -109628
8211a09628j07209j08664P5549J50944R1779l7186M5301J11090o6142j33991Q893
$$ -109628 -216837 -325501 -249952 -99008 -7229 -44415 886 111976 45834 -88157 -79264
8200g9264n0816P509N6993R3775L1237p779L0763J2905l3092M3195K9567q004
$$ -79264 -130080 -122571 -65578 28197 59434 51655 82418 95323 62231 105426 134993 126989
8188A26989k2789N7856p4451m4750M380j8983n1961k6618K4385m9135N1629j16398
$$ 126989 104200 162056 87605 42855 47235 28252 -23709 -50327 -25942 -75077 -23448 -139846
8176a39846o7837Q8075J12634N0440o4339M538n3937k4941M1575R5030N2345Q5344
$$ -139846 -207683 -119608 -6974 43466 -20873 -16335 -70272 -95213 -53638 41392 93737 179081
8164A79081l2926L8363r8021j32845o5407m8002M7849K6402j4635J12751L7815
$$ 179081 146155 184518 86497 -46348 -111755 -159757 -111908 -85506 -100141 12610 50425
8153E0425p9304p3253N0075R4761j1644n416q7054n3047k7463J02427J05531M4743
$$ 50425 -28879 -102132 -52057 42704 31060 25644 -61410 -114457 -141920 -39493 66038 110781
8141A10781k9464m3592J01982J7396j08062r2915K9434J33806M3069m5470l0550
$$ 110781 81317 37725 139707 157103 49041 -43874 -14440 119366 162435 116965 86415
8130H6415m4690j00663n098j489r3933j27923l7642P7733P1567O6525p2792q8445
$$ 86415 41725 -58938 -64036 -65525 -159458 -287381 -325023 -247290 -175723 -109198 -181990 -270435
8118b70435r0232Q6733O6444P9439k2733N9612j906p8441M6297N4357k9261N6718
$$ -270435 -360667 -273934 -207490 -128051 -150784 -91172 -93078 -171519 -125222 -70865 -100126 -43408
8106d3408J41340L1028M9113n0299O4029Q6817p3893j03534Q3000j7916p589p0353
$$ -43408 97932 128960 178073 127774 191803 278620 204727 101193 184193 166277 158688 88335
8094H8335r7898j0483n3200O0466l292J0619p9113M0313J65505M091r9886j46929
$$ 88335 -9563 -20046 -73246 -12780 -16072 -5453 -84566 -44253 121252 125343 25457 -121472
8082a21472N4409O6907l2858L2346J1481p9140q1143R2046L1658j11643k5483
$$ -121472 -67063 -156 -33014 -668 10813 -68327 -149470 -57424 -25766 -137409 -162892
8071a62892M4893Q2576L0069n0193o0031o9320R8712P9988M6678r1641p5387k188
$$ -162892 -117999 -35423 -5354 -55547 -115578 -184898 -86186 -6198 40480 -51161 -126548 -128736
8059a28736P1669R1713n059q4794k0158j5951k0816n247L6201M9073K1056J16161
$$ -128736 -57067 34646 29587 -55207 -75365 -91316 -112132 -117379 -81178 -32105 -11049 105112
8047A05112l5758j29757K0907p3542p9289J21532R8347J47718k0637k7616q9903
$$ 105112 69354 -60403 -39496 -113038 -192327 -70795 27552 175270 154633 127017 37114
8036C7114j51891l6178m8943O3000L1162J15343l1869p5942q4783K318Q7704K0252
$$ 37114 -114777 -150955 -199898 -136898 -105736 9607 -22262 -98204 -182987 -180669 -92965 -72713
8024g2713p3843M4117P3776N3349q8282j06651q0581J57124J54917j1153R794
$$ -72713 -146556 -102439 -28663 24686 -63596 -170247 -250828 -93704 61213 50060 59854
8013E9854j4340J17939L6318j18990m3721Q2108N2806M1254o9566p6935k9991
$$ 59854 45514 163453 199771 80781 37060 119168 171974 213228 143662 66727 36736
8002C6736N8319j72794p8209M3676L1954n259N7774k5726L49k8676P105J21792
$$ 36736 95055 -77739 -155948 -112272 -80318 -85577 -27803 -53529 -53180 -81856 -74751 47041
7990D7041p4131j9197m336K3729n3827p9482Q197J61797J03768j80471o4356J0305
$$ 47041 -27090 -46287 -50623 -26894 -80721 -160203 -152006 9791 113559 -66912 -131268 -120963
7978a20963J04580N7535O2668L4491p4763m243L1682R0919o2680j48831j14529
$$ -120963 -16383 41152 103820 138311 63548 59305 90987 181906 119226 -29605 -144134
7967a44134J8970J10550J08336j8762O0147J44356o7237j13849J0866r3644m3261
$$ -144134 -125164 -14614 93722 74960 135107 279463 212226 98377 109243 15599 -27662
7956b7662L4107O4459l2603l6549J1926k0894l9622m4328n120k0970p0212K9913
$$ -27662 6445 70904 38301 1752 13678 -7216 -46838 -91166 -96286 -117256 -187468 -157555
7944a57555J10020K0208q1534q8498P3454M3135K6912J9885P659o1652N7658J4828
$$ -157555 -47535 -27327 -108861 -197359 -123905 -80770 -53858 -33973 -26314 -87966 -30308 -15480
7932a5480J026j6543J36k5707L6460L5216J4762k900r1987M785L6747k4883O5487
$$ -15480 -14454 -30997 -30861 -56568 -20108 15108 29870 26970 -65017 -60232 -23485 -48368 17119
7919A7119R7795r8787j20779K7986L8669j04396j26682k0312R4364J16154K0908
$$ 17119 114914 16127 -104652 -76666 -37997 -142393 -269075 -289387 -195023 -78869 -57961
7908e7961o8332N3189J32432K7550m4455j10614R5358O1107K3767J07146l0790
$$ -57961 -126293 -73104 59328 86878 42423 -68191 27167 88274 112041 219187 188397
7897A88397r7970j64268P8098N8617j2676O0053R398j25542K0760l0522Q7817
$$ 188397 90427 -73841 4257 62874 50198 110251 119649 -5893 14867 -15655 72162
7886G2162l459j27618J5792O1495J45371J8462k9987p6347j29117N7311N6931
$$ 72162 68703 -58915 -43123 18372 163743 182205 152218 75871 -53246 4065 60996
7875F0996J0474N1867M8007J9531j08223N8158l8751M159m7722n4394K9523q5421
$$ 60996 71470 123337 171344 190875 82652 140810 102059 106218 58496 4102 33625 -51796
7863e1796n0234j3048P937L2453q4866N4631J06969N4911j1002j6430N4449P8026
$$ -51796 -102030 -115078 -107141 -74688 -159554 -104923 2046 56957 45955 29525 83974 162000
7851A62000M7918o8423j23709M1153j11355K5585J46882J54021m8072J4662p814
$$ 162000 209918 141495 17786 58939 -52416 -26831 120051 274072 226000 240662 232848
7840B32848j53998j38904m1743J24542j6358J4093Q9586m5627K5596m8512N2764
$$ 232848 78850 -60054 -101797 22745 6387 20480 110066 64439 90035 41523 94287
7829I4287N0383m2727n2252R5351Q0093l7694p2806p3489p7297P874l7244O3539
$$ 94287 144670 101943 49691 145042 225135 187441 114635 41146 -36151 -28277 -65521 -1982
7817a982J17531J2059l9259M266k5852j60276L2298k7257J46212J51724j12977
$$ -1982 115549 127608 88349 92615 66763 -93513 -61215 -88472 57740 209464 96487
7806I6487j43074O1259R0337m274n4473P4123m8801j22746n1040J9762O5711N4530
$$ 96487 -46587 14672 105009 100735 46262 120385 71584 -51162 -102202 -82440 -16729 37801
7794C7801M4404r924o1986J15570K1434j1239j7716q4560Q9031Q2016l6986j19555
$$ 37801 82205 72281 10295 125865 147299 136060 118344 33784 122815 204831 167845 48290
7782D8290j26599k3958J17787J06826j01856j9282O1199l5218N7329L0232j02266
$$ 48290 -78309 -102267 15520 122346 20490 1208 62407 27189 84518 114750 12484
7771A2484M1578o7729o979p5769J8698o3726K8170p6891R0642J44647m1302J4563
$$ 12484 54062 -13667 -20646 -96415 -77717 -141443 -113273 -190164 -99522 45125 3823 18386
7759A8386k0970p7242L0967N8550J37087l8533p5849J3651Q8987J05017L9581
$$ 18386 -2584 -79826 -48859 9691 146778 108245 32396 46047 135034 240051 279632
7748B79632o7221m9364p4937j22063N2261N3205j50067o4490j0299n0707J04610
$$ 279632 212411 163047 88110 -33953 18308 71513 -78554 -143044 -153343 -204050 -99440
7737i9440J13856o5173M1441J50558k325n4444J7072L1771o6438J35390P0357
$$ -99440 14416 -50757 -9316 141242 138917 84473 101545 133316 66878 202268 272625
7726B72625j82552r9129n1921n3171J9368K4970j03157R598P589J4718J32177
$$ 272625 90073 -9056 -60977 -114148 -94780 -69810 -172967 -163369 -155780 -141062 -8885
7715h885k9377J0207L6645j83742N7397J84121J01238J3264k0836m1570n3652
$$ -8885 -38262 -28055 8590 -175152 -117755 66366 167604 180868 160032 118462 64810
7704F4810p475k4949k537l1023o0892m4481K4680J0297o09L0860P7017J1624p6512
$$ 64810 57335 32386 29849 -1174 -62066 -106547 -81867 -71570 -72179 -41319 35698 47322 -29190
7691b9190m2181P639K5198j4898k3257l5729R9740l871o0528p4741J25751J09213
$$ -29190 -71371 -63732 -38534 -53432 -76689 -112418 -12678 -16549 -77077 -151818 -26067 83146
7679H3146R9315J620o2366j13670j080k6955P9468k5983m9452K8742R8105o2076
$$ 83146 182461 184081 121715 8045 6965 -19990 59478 33495 -15957 12785 110890 48814
7667D8814q139J56106L0887O1453R2493m6231j63124k2878J6124O883J36819Q8986
$$ 48814 40675 196781 227668 289121 381614 335383 172259 149381 165505 172388 309207 398193
7655C98193q9050j50729m1830j0137n743k04063n8810l5305l4576O0301Q0044
$$ 398193 309143 158414 116584 106447 100704 -103359 -162169 -197474 -232050 -171749 -91705
7644i1705J05885R6421p1090m0857j34974p2996J52521J24318j03333J91609R2964
$$ -91705 14180 110601 39511 -1346 -136320 -209316 -56795 67523 -35810 155799 248763
7633B48763j19024j16994j29824q4778k4021M5757J57269O6182m3657p4339k5195
$$ 248763 129739 12745 -117079 -201857 -225878 -180121 -22852 43330 -327 -74666 -99861
7622i9861K5507M02O4497L3099m4341K8851N5179J3339j61956o1084L5450K8971
$$ -99861 -74354 -73952 -9455 23644 -20697 8154 63333 76672 -85284 -146368 -110918 -81947
7610h1947j9964J0566k7047l8760j2680n69Q1376K8429R8272O9846k1192m3007
$$ -81947 -101911 -91345 -118392 -157152 -169832 -170401 -89025 -60596 37676 107522 86330 43323
7598D3323j11571R28l5008J29732J21883J0482j66307K9657j4060k2437J60547
$$ 43323 -68248 -67320 -102328 27404 149287 159769 -6538 23119 9059 -13378 147169
7587A47169M6527m1150o3209L8637j6581l614j08486j69997k8822O9317J44631
$$ 147169 193696 152546 89337 127974 111393 107779 -707 -170704 -199526 -130209 14422
7576A4422M4015j5527j02549j3520N5864R6449J12721M774o3655J0107m1643r6341
$$ 14422 58437 42910 -59639 -73159 -17295 79154 191875 196649 132994 143101 101458 5117
7564E117m8356K7995O2321J17817l2140j21562K9527J61792p8601k4320p563L1531
$$ 5117 -43239 -15244 47077 164894 132754 11192 40719 202511 123910 99590 92027 123558
7552A23558p7754k24110p4726M4345L0498Q9122L1626m2132O0668J1664r2976
$$ 123558 45804 -178306 -253032 -208687 -178189 -89067 -57441 -99573 -38905 -27241 -120217
7541a20217J08794K9884O0693O357n8273p705R2189Q8922O902k6116Q4203O104
$$ -120217 -11423 18461 79154 85511 27238 19533 111722 200644 207546 181430 265633 271737
7529B71737p0089K6129q299j0025n2235p978K2583j30636l1004J4693J06164P6620
$$ 271737 201648 227777 219478 209453 157218 149240 171823 41187 10183 24876 131040 207660
7517B07660J0674r9402n6092Q1246j33871J0201m294l1620j12423k7428K30913
$$ 207660 218334 118932 62840 144086 10215 20416 16122 -15498 -127921 -155349 75564
7506G5564K32977j6816j34993o9813m7660m2320P0540l1391j29972r78L5966k4515
$$ 75564 308541 291725 156732 86919 39259 -3061 67479 36088 -93884 -94862 -58896 -83411
7494h3411K990M9607L2666p175M0651R718M778k2172l5115j2659n6592m9271m1721
$$ -83411 -80421 -30814 1852 -5323 35328 45046 49824 27652 -7463 -20122 -76714 -125985 -167706
7481a67706j3256k6550n7918J28334P6003k0135n9383O7989j6848q9408l6423
$$ -167706 -180962 -207512 -265430 -137096 -61093 -81228 -140611 -72622 -89470 -178878 -215301
7470b15301P2514J00077K3260J16869m6725k6675p8393R9429l2302M792m9243
$$ -215301 -142787 -42710 -19450 97419 50694 24019 -54374 45055 12753 17545 -31698
7459c1698m8695l0363J9796N0824j18998k3647N0789j76630o0999J17787J09577
$$ -31698 -80393 -110756 -90960 -40136 -159134 -182781 -131992 -308622 -369621 -251834 -142257
7448a42257O477m2631m5532J31696P3412n1277L254L6062R8487K221p0170j70508
$$ -142257 -135780 -178411 -223943 -92247 -18835 -70112 -66858 -30796 67691 69912 -258 -170766
7436a70766j20187j8455L4134O7934K3788l2755O7951J18438n6117j28795q0562
$$ -170766 -290953 -309408 -275274 -207340 -183552 -216307 -148356 -29918 -86035 -214830 -295392
7425b95392O9213J62664j31328K42810J45899j4358q7561j51121K2651R0897j5951
$$ -295392 -226179 -63515 -194843 47967 193866 179508 91947 -59174 -36523 54374 38423
7414C8423J1703J359n8431M7839M3223p5408k8722L6349o8379j35463K0109N2763
$$ 38423 50126 51485 -6946 40893 84116 8708 -20014 16335 -52044 -187507 -167398 -114635
7402a14635n9891q9532P5003J59777J3705M7720K9014j7076j9175j5927M3098
$$ -114635 -174526 -264058 -189055 -29278 -15573 32147 61161 44085 24910 8983 52081
7391E2081q9649O8845N1165n0671k7919J05172p7318j20704L6064l5074j04051
$$ 52081 -37568 31277 82442 31771 3852 109024 31706 -88998 -52934 -88008 -192059
7380a92059o3917J03293m0508L9074j8657K8752L0787p9472m1572Q3899J00248
$$ -192059 -255976 -152683 -193191 -154117 -172774 -144022 -113235 -192707 -234279 -150380 -50132
7369e0132J32481O6724p0235o0370l2834O0714l0154k1114l2672p7542J2753J06997
$$ -50132 82349 149073 78838 18468 -14366 46348 16194 -4920 -37592 -115134 -102381 4616
7357D616J01347M9341j16912p2048L1722k0289J13998m9116j08253j03862n6255
$$ 4616 105963 155304 38392 -33656 -1934 -22223 91775 42659 -65594 -169456 -225711
7346b25711R0173R5988o8373N000K1457p5953Q823J1550K4949q1520n6045J39090
$$ -225711 -135538 -39550 -107923 -102923 -81466 -157419 -148596 -137046 -112097 -193617 -249662 -110572
7334a10572J63612K9848p9156q7223o3961l0279m416J18149J15139q205l3970
$$ -110572 53040 82888 3732 -83491 -147452 -177731 -182147 -63998 51141 42936 8966
7323H966J2662j12530o2913Q8375J14175J60384J6154k47500j79656L5903N6245
$$ 8966 21628 -90902 -153815 -65440 48735 209119 225273 -22227 -201883 -165980 -109735
7312a09735l8482p258O6666J31785r7382N3291Q8406p35j934j16445K9760J19183
$$ -109735 -148217 -155475 -88809 42976 -54406 -1115 87291 86556 84622 -31823 -2063 117120
7300A17120O7846k8665r2908J3613M3665J43980n0741j09472K4212K4192L2737
$$ 117120 184966 156301 63393 77006 120671 264651 213910 104438 128650 152842 185579
7289A85579k2555m1403o6632j6413O3502j5328N7221p4473m4983n5781j15705
$$ 185579 163024 121621 54989 38576 102078 86750 143971 69498 24515 -31266 -146971
7278a46971k0257L3404p1023L4764n4477p1873K5181Q5841J06226O4029o8095
$$ -146971 -167228 -133824 -204847 -170083 -224560 -296433 -271252 -185411 -79185 -15156 -83251
7267h3251j27384l776P4751l0000n6674J9029M3500J08511k3938m1230o2656k6307
$$ -83251 -210635 -214411 -139660 -169660 -226334 -207305 -163805 -55294 -79232 -120462 -183118 -209425
7255b09425l6833J12010M2456P5907m9885j67323O067K623o0679M2990P1098m4178
$$ -209425 -246258 -134248 -91792 -15885 -65770 -233093 -227026 -224403 -285082 -242092 -170994 -215172
7243b15172J2363k5162Q3238L216J04008J36031q6041j16961L6622j03656o6208
$$ -215172 -202809 -227971 -144733 -141517 -37509 98522 12481 -104480 -67858 -171514 -237722
7232b37722J47862J13810R7358L6177q3305P9150j2761K9052O531l6603l3951
$$ -237722 -89860 23950 121308 157485 74180 153330 140569 169621 176152 139549 105598
7221A05598O6614j15004j35457j4214p9530r023P8276o1033j14640Q3607Q7610
$$ 105598 172212 57208 -78249 -92463 -171993 -181016 -102740 -163773 -278413 -194806 -107196
7210a07196M1212N4148q0602O479m9734N84O5225J14762R857J5879l0292Q6383
$$ -107196 -65984 -11836 -92438 -85959 -135693 -135109 -69884 44878 54735 70614 40322 126705
7198A26705k8257q333N6005L2486j22374j56115n6399l3452R5809Q4338l4053
$$ 126705 98448 90115 146120 178606 56232 -99883 -156282 -189734 -93925 -9587 -43640
7187d3640n9667O5239N0953j33274o2771P1338J8616N5280j37303m1659J91194
$$ -43640 -103307 -38068 12885 -120389 -183160 -111822 -93206 -37926 -175229 -216888 -25694
7176b5694N0410K495j60065j29J00977M2255l7909r2835P3112Q2003J44840O4699
$$ -25694 24716 27211 -132854 -132983 -32006 10249 -27660 -120495 -47383 34620 179460 244159
7164B44159n5686r5810R0250K9683j14698n7950L4603j1294l3921l6944k4614
$$ 244159 188473 92663 182913 212596 97898 39948 74551 63257 29336 -7608 -32222
7153c2222K522J16285o6694j07631L0162M549J03858R2318p2651j74564l9728
$$ -32222 -29700 86585 19891 -87740 -57578 -53029 50829 143147 70496 -104068 -143796
7142a43796L414k331o8868o287m4377J0933j7991P9099J65708J3915p5328K4883
$$ -143796 -140382 -142713 -211581 -217868 -262245 -251312 -269303 -190204 -24496 -10581 -85909 -61026
7130f1026R160Q1049j0137k4596K01666M9442K1100o7244p9886p7224m5078J26449
$$ -61026 -51866 29183 19046 -5550 196116 245558 266658 199414 119528 42304 -2774 123675
7118A23675o0020k7228R3490Q9251j143j42539j19725K3218r0869L9229r5417
$$ 123675 63655 36427 129917 219168 218025 75486 -44239 -21021 -111890 -72661 -168078
7107a68078n802M047R2988J56837M7461M7534q9456k1144J2904k2837M4336j06727
$$ -168078 -173880 -169833 -76845 79992 127453 174987 85531 64387 77291 54454 98790 -7937
7095g937r1676L0906l8868O880k7353J2450j3639O0790R0162J02801l8972K7019
$$ -7937 -99613 -68707 -107575 -100695 -128048 -115598 -129237 -68447 21715 124516 85544 112563
7083A12563q2963n6000m6320j66716m5525J97427j4959J5840P4689j44978J7677
$$ 112563 29600 -26400 -72720 -239436 -284961 -87534 -102493 -86653 -11964 -156942 -139265
7072a39265P2253J54567O0672L999k26396j81467L4481J91790M4856P078k5527
$$ -139265 -67012 87555 148227 152226 -74170 -255637 -221156 -29366 15490 22568 -2959
7061b959o0355p509O883j01579m7452J66769J49858j60802j36112Q2311J08641
$$ -2959 -63314 -70823 -63940 -165519 -212971 -46202 103656 -57146 -193258 -110947 -2306
7050b306k6566p5135p0829n9980J09209J07016O6728J07363J37180n2721m3236
$$ -2306 -28872 -104007 -174836 -234816 -125607 -18591 48137 155500 292680 239959 196723
7039A96723m2894k343j7454n8421r4633J03582J20576o9578o0267p8035K3350
$$ 196723 153829 151486 134032 75611 -19022 84560 205136 135558 75291 -2744 20606
7028B0606P4246j1243m5816O919k6345N8529J5709j14676p5768R0481J0671j8395
$$ 20606 94852 83609 37793 44712 18367 76896 92605 -22071 -97839 -7358 3313 -15082
7016a5082n1962K9888L9964m349m4939k7644j2338q9113N4295J24555N5920J30726
$$ -15082 -67044 -37156 2808 -1541 -46480 -74124 -86462 -175575 -121280 3275 59195 189921
7004A89921L8557k27051j54391j22503L4287R4141R2276M3417o7416o7654J11939
$$ 189921 228478 1427 -152964 -275467 -241180 -147039 -54763 -11346 -78762 -146416 -34477
6993c4477M8388N3659j14947j28975R6123j03942j09760n2866K9599J52882J47242
$$ -34477 13911 67570 -47377 -176352 -80229 -184171 -293931 -346797 -317198 -164316 -17074
6982a7074n0388j6255o2120N1430R4647M8974k739P8532p3963j44407K3087p9241
$$ -17074 -67462 -83717 -145837 -94407 240 49214 46475 125007 51044 -93363 -70276 -149517
6970a49517J2877J53820M0028l1498j24148O5144J9193r212j694Q418m8735q6912
$$ -149517 -136640 17180 57208 25710 -98438 -33294 -14101 -23313 -25007 -16589 -65324 -152236
6958a52236o8718O0951l3639q3010R5350J41861q3044k5268L2992J23004N161
$$ -152236 -220954 -160003 -193642 -276652 -181302 -39441 -122485 -147753 -114761 8243 13404
6947A3404j21814r5081r247l8968N7476R8643L0577J12848j6105m380J348l5705
$$ 13404 -108410 -203491 -212738 -251706 -194230 -95587 -65010 47838 31733 27353 28701 -7004
6935g004q5546L5251p164J39795L0470j11256r4276M678J22424M0450p6418M1720
$$ -7004 -92550 -57299 -64463 75332 105802 -5454 -99730 -95052 27372 67822 -8596 33124
6923C3124R0851j10796j09622j3079k045q6340l2018P467j809J33107N7279N3271
$$ 33124 123975 13179 -96443 -109522 -111567 -197907 -229925 -222458 -224267 -91160 -33881 19390
6911A9390O8365O5367o5159M7527M7402O390j73762j52192k5400M6444P6339Q0259
$$ 19390 87755 153122 87963 135490 182892 189282 15520 -136672 -162072 -115628 -39289 40970
6899D0970k5587M2519r1541j8692P7618M9731k3952l4897O3229N91j06108q0435
$$ 40970 15383 57902 -33639 -52331 25287 75018 51066 16169 79398 79989 -26119 -106554
6887a06554j9450N7986J34136J41877k435m7493p7228p907n0601j22754l1009
$$ -106554 -126004 -68018 66118 207995 205560 158067 80839 72932 22331 -100423 -131432
6876a31432o0676o6390n4701J63123J13453Q8989P5899j07915q504N8861l1914
$$ -131432 -192108 -258498 -313199 -150076 -36623 52366 128265 20350 11846 70707 38793
6865C8793M8907j0783L1843J6347L4631n2538o5222o7861j29208j36304O441J05616
$$ 38793 87700 76917 108760 125107 159738 107200 41978 -25883 -155091 -291395 -284954 -179338
6853a79338J23353o3113o0568N7204J14620J06002j4118n1056m4519m6790j7927
$$ -179338 -55985 -119098 -179666 -122462 -7842 98160 84042 32986 -11533 -58323 -76250
6842g6250n0366m4928J0530O1734M3391J57164P0800k9918n2914K5327k998L2558
$$ -76250 -126616 -171544 -161014 -99280 -55889 101275 172075 142157 89243 114570 111572 144130
6830A44130L400n450p4524j22348j7530J3853M3320N5707p3003J12944J10552
$$ 144130 147530 142080 67556 -54792 -72322 -58469 -15149 40558 -32445 80499 191051
6819A91051j13898j46255n9579P1030L3264l3853L0207L1261j34649J9244N0398
$$ 191051 77153 -69102 -128681 -57651 -24387 -58240 -28033 3228 -131421 -112177 -61779
6808f1779J8977R5351j59064j34830L2124M8634R7445J0543O4663J11214j8584
$$ -61779 -42802 52549 -106515 -241345 -209221 -160587 -63142 -52599 12064 123278 104694
6797A04694o5501q1098K7956J0313l6722r5412p5925J0344J31845P4582l1663
$$ 104694 39193 -41905 -13949 -3636 -40358 -135770 -211695 -201351 -69506 5076 -26587
6786b6587m0666P4269j58838N3396Q785m1027R5717J57763k7633L5357k036P0399
$$ -26587 -67253 7016 -151822 -98426 -89641 -130668 -34951 122812 95179 130536 128500 198899
6774A98899l6574l1341q032k0146k9320p8606n0822q2197P4037J23103L146o2552
$$ 198899 162325 130984 122952 102806 73486 -5120 -55942 -138139 -64102 59001 62147 -405
6762d05J7376J36452K6572K0862L5310k9498j40992o5754L7740r8815j74122l3518
$$ -405 16971 153423 179995 200857 236167 206669 65677 -77 37663 -61152 -235274 -268792
6750b68792J38142P9575M7349j51468M9377J25472N3677p0413k5563M402J7091
$$ -268792 -130650 -51075 -3726 -155194 -105817 19655 73332 2919 -22644 -18242 -1151
6739a151o536q963J12111j5645j5561R0438j6722j55418m6796k028j8821M3752
$$ -1151 -7687 -16650 95461 79816 64255 154693 137971 -17447 -64243 -66271 -85092 -41340
6727d1340n851m2530p883P2483J198j8877K5853q867O2900m8153J5437P0975L3254
$$ -41340 -47191 -89721 -97604 -25121 -23923 -42800 -16947 -25814 37086 -11067 4370 75345 108599
6714A08599N826K3853l4854j89700q029J267N0000k1956l3384K5263N4281M6363
$$ 108599 114425 138278 103424 -86276 -94305 -93038 -43038 -64994 -98378 -73115 -18834 27529
6702B7529p4759m5055m5824m711m1264Q2556K1763j9210l4191P2224O0339n6688
$$ 27529 -47230 -92285 -138109 -142820 -184084 -101528 -79765 -98975 -133166 -60942 -603 -57291
6690e7291O821L9917l4525k6498M5227k1191n1043M574M3018M2192M9366J58500
$$ -57291 -50470 -10553 -45078 -71576 -26349 -47540 -98583 -94009 -50991 -8799 40567 199067
6678A99067K8162j28011r428L082O1094r370K2077l2404M9560R1696j87405l9628
$$ 199067 227229 99218 89790 92872 153966 144596 166673 134269 183829 275525 88120 48492
6666D8492J01264m6886K8602p2327p9823n6780o437Q2475k8858j007j6233Q6379
$$ 48492 149756 102870 131472 59145 -20678 -77458 -83895 -1420 -30278 -31285 -47518 38861
6654C8861l8462J517J14983n8566r2474m0344J7019L77N8602L8815j00792m3773
$$ 38861 399 1916 116899 58333 -34141 -74485 -57466 -57089 1513 40328 -60464 -104237
6642a04237j1197N1025J61606J14653r1186r1824l6330p1350j10919k0361L2014
$$ -104237 -115434 -64409 97197 211850 120664 28840 -7490 -78840 -189759 -210120 -178106
6631a78106J30926J88963K6206k3974j13506r0303j4657O9981k29r396L7880J6062
$$ -178106 -47180 141783 167989 144015 30509 -59794 -74451 -4470 -4699 -14095 23785 39847
6619C9847P9787L1653j2630L115n1883j28763j34701K283J218N8924K4487O3506
$$ 39847 119634 151287 138657 141772 89889 -38874 -173575 -171292 -170074 -111150 -86663 -23157
6607b3157O3308p4896q4742m4422O8116l2075j4175J63913L9211p3658j01714
$$ -23157 40151 -34745 -119487 -163909 -95793 -127868 -142043 21870 61081 -12577 -114291
6596a14291p332n9650J55645J55741M6718J8918P0503j05314j11551R2464L8734
$$ -114291 -121623 -181273 -25628 130113 176831 195749 266252 160938 49387 141851 180585
6585A80585j12516j15765o2406J0820l8810n562q2762J59794J01529q47j8277
$$ 180585 68069 -47696 -110102 -99282 -138092 -143654 -226416 -66622 34907 34060 15783
6574A5783M4957P7343N8112j56360j69849k1143Q9506n295n4447p8660O2228J13895
$$ 15783 60740 138083 196195 39835 -130014 -151157 -61651 -66946 -121393 -200053 -137825 -23930
6562b3930K834M7435J35746o8948r1052m2805R9655j8593o0514n5231q1500k0681
$$ -23930 -21096 26339 162085 93137 2085 -40720 58935 40342 -20172 -75403 -156903 -177584
6550a77584K3611P8381N1092P1298Q1309K2373j42758j26877o4094K1817k8264
$$ -177584 -153973 -75592 -24500 46798 128107 150480 7722 -119155 -183249 -161432 -189696
6539a89696K2504Q3987N2900m4400q1002J32056L6750j3060N2188p2311k1607
$$ -189696 -167192 -83205 -30305 -74705 -155707 -23651 13099 39 52227 -20084 -41691
6528d1691R8747J11740m0221j42467m2371l5014l011K708O8927Q3746N3809r6386
$$ -41691 57056 168796 128575 -13892 -56263 -91277 -94288 -91580 -22653 61093 114902 18516
6516A8516o014m211J0201j1226k010M7142n5262j07083O8053j6229N6993O3651
$$ 18516 12502 8291 18492 7266 5256 52398 -2864 -109947 -41894 -58123 -1130 62521
6504F2521J2777j7306o0509Q3713J42003m6534k894k8700K3551Q8950q8312m6524
$$ 62521 75298 57992 -2517 81196 223199 176665 173771 145071 168622 257572 169260 122736
6492A22736j24729r1238Q726N660J9444q4373L9834L2965j8005O6948J15430R8701
$$ 122736 -1993 -93231 -84505 -78845 -59401 -143774 -103940 -70975 -88980 -22032 93398 192099
$$ [...]
##END NTUPLES=NMR SPECTRUM
##END=
