##TITLE=Analysis number 318102
Compound Code cc 50802
Book Reference 481/2
Project Code adrs
Chemist Name bruced
##JCAMPDX= 6.0         $$ Bruker NMR JCAMP-DX V2.0
##DATA TYPE= NMR SPECTRUM
##DATA CLASS= NTUPLES
##ORIGIN= Bruker BioSpin GmbH
##OWNER= nmr
$$ XWIN-NMR		Version 3.5
$$ Wed Mar 15 11:52:17 2006 GMT Standard Time (UT+0h)  MAYBRIDGE\nmr@NMR_250MHZ
##.OBSERVE FREQUENCY= 250.131544655141
##.OBSERVE NUCLEUS= ^1H
##.ACQUISITION MODE= SIMULTANEOUS (DQD)
##.ACQUISITION SCHEME= undefined
##.AVERAGES= 16
##.DIGITISER RES= 18
##SPECTROMETER/DATA SYSTEM= dpx250
##.PULSE SEQUENCE= zg30
##.SOLVENT NAME= CDCl3
##.SHIFT REFERENCE= (INTERNAL, CDCl3, 0, 16.522)
##AUDIT TRAIL= $$ (NUMBER, WHEN, WHO, WHERE, WHAT)
$$ ##TITLE= Audit trail, XWIN-NMR		Version 3.5
$$ ##JCAMPDX= 5.01
$$ ##ORIGIN= Bruker BioSpin GmbH
$$ ##OWNER= nmr
$$ C:\u/data/dgb/nmr/ADRS/770/pdata/1/auditp.txt
$$ ##AUDIT TRAIL=  $$ (NUMBER, WHEN, WHO, WHERE, WHAT)
(   1,<2006-03-15 11:51:47.27 +000>,<MAYBRIDGE\nmr>,<NMR_250MHZ>,
      <created by zg, POWCHK disabled, PULCHK disabled
       configuration hash MD5:
       84 BC 41 DB A1 6E 1D 46 DA 25 12 A5 C1 ED C5 3A
       data hash MD5: 64K
       73 CF 33 E2 A5 D5 61 8E 9C 29 2E 92 C9 93 15 01>)
(   2,<2006-03-15 11:52:05.79 +000>,<MAYBRIDGE\nmr>,<NMR_250MHZ>,
      <Start of raw data processing
       ef LB = 0.3 FT_mod = 6 PKNL = 1 SI = 32K 
       data hash MD5: 32K
       BF 31 A6 2A 42 2B 14 D3 8A 1F 70 D8 1E ED 7F 00>)
(   3,<2006-03-15 11:52:08.01 +000>,<MAYBRIDGE\nmr>,<NMR_250MHZ>,
      <apk 
       data hash MD5: 32K
       7D 36 96 C1 91 97 82 EE 16 50 85 67 50 19 C1 17>)
(   4,<2006-03-15 11:52:08.87 +000>,<MAYBRIDGE\nmr>,<NMR_250MHZ>,
      <abs ABSG = 5 
       data hash MD5: 32K
       C5 0C FA 71 45 24 75 40 B4 83 9F 75 D0 72 C1 F7>)
$$ ##END=
$$ 
$$ hash MD5
$$ 86 6A 3C 17 2E 6E F3 30 BD 77 F8 35 1D 64 F2 2C
##$RELAX= 
##$RELAX= 
##$RELAX= 
##$RELAX= 
##$RELAX= 
##$RELAX= 
##$RELAX= 
$$ Bruker specific parameters
$$ --------------------------
##$DU= <C:\u>
##$EXPNO= 770
##$NAME= <ADRS>
##$PROCNO= 1
##$TYPE= <nmr>
##$USER= <dgb>
##$AMP= (0..31)
100 100 100 100 100 100 100 100 100 100 100 100 100 100 100 100 100 100 
100 100 100 100 100 100 100 100 100 100 100 100 100 100 
##$AQSEQ= 0
##$AQ_mod= 3
##$AUNM= <au_zg>
##$AUTOPOS= <22 >
##$BF1= 250.13
##$BF2= 250.13
##$BF3= 250.13
##$BF4= 250.13
##$BF5= 500.13
##$BF6= 500.13
##$BF7= 500.13
##$BF8= 500.13
##$BYTORDA= 1
##$CFDGTYP= 0
##$CFRGTYP= 5
##$CHEMSTR= <none>
##$CNST= (0..31)
1 1 145 1 1 1 1 1 1 1 1 1 1 1 1 1 1 1 1 1 1 1 1 1 1 1 1 1 1 1 1 1 
##$CPDPRG= <>
##$CPDPRG1= <>
##$CPDPRG2= <>
##$CPDPRG3= <>
##$CPDPRG4= <mlev>
##$CPDPRG5= <mlev>
##$CPDPRG6= <mlev>
##$CPDPRG7= <mlev>
##$CPDPRG8= <mlev>
##$CPDPRGB= <>
##$CPDPRGT= <>
##$D= (0..31)
0 1 0 0 0 0 0 0 0 0.06 0 0 0 0 0 0 0.0002 0 0 0 0 0 0 0 0 0 0 0 0 0 0 
0 
##$DATE= 1142423505
##$DBL= (0..7)
120 120 120 120 120 120 120 120 
##$DBP= (0..7)
150 150 150 150 150 150 150 150 
##$DBP07= 0
##$DBPNAM0= <>
##$DBPNAM1= <>
$$ [...]
##$SUBNAM7= <"">
##$SUBNAM8= <"">
##$SUBNAM9= <"">
##$SW= 20.6930455092707
##$SWIBOX= (0..15)
0 0 3 0 0 0 0 0 0 0 0 0 0 0 0 0 
##$SW_h= 5175.983436853
##$TD= 65536
##$TD0= 1
##$TE= 294.16
##$TE2= 300
##$TE3= 300
##$TEG= 300
##$TL= (0..7)
0 120 120 120 120 120 120 120 
##$TP= (0..7)
150 150 150 150 150 150 150 150 
##$TP07= 0
##$TPNAME0= <>
##$TPNAME1= <>
##$TPNAME2= <>
##$TPNAME3= <>
##$TPNAME4= <>
##$TPNAME5= <>
##$TPNAME6= <>
##$TPNAME7= <>
##$TPOAL= (0..7)
0.5 0.5 0.5 0.5 0.5 0.5 0.5 0.5 
##$TPOFFS= (0..7)
0 0 0 0 0 0 0 0 
##$TUNHIN= 0
##$TUNHOUT= 0
##$TUNXOUT= 0
##$USERA1= <user>
##$USERA2= <user>
##$USERA3= <user>
##$USERA4= <user>
##$USERA5= <user>
##$V9= 5
##$VALIST= <valist>
##$VCLIST= <CCCCCCCCCCCCCCC>
##$VD= 0
##$VDLIST= <DDDDDDDDDDDDDDD>
##$VPLIST= <PPPPPPPPPPPPPPP>
##$VTLIST= <TTTTTTTTTTTTTTT>
##$WBST= 1024
##$WBSW= 4
##$XGAIN= (0..3)
0 0 0 0 
##$XL= 0
##$YL= 0
##$YMAX_a= 766639
##$YMIN_a= -858682
##$ZGOPTNS= <>
##$ZL1= 120
##$ZL2= 120
##$ZL3= 120
##$ZL4= 120
##$ABSF1= 16.522
##$ABSF2= -4.171173
##$ABSG= 5
##$ABSL= 3
##$ALPHA= 0
##$AQORDER= 0
##$ASSFAC= 0
##$ASSFACI= 0
##$ASSFACX= 0
##$ASSWID= 0
##$AUNMP= <proc_1d>
##$AZFE= 0.1
##$AZFW= 0.1
##$BCFW= 0
##$BC_mod= 0
##$BYTORDP= 0
##$COROFFS= 0
##$CY= 12.5
##$DATMOD= 1
##$DC= 0
##$DFILT= <>
##$DTYPP= 0
##$F1P= 14.0000005364418
##$F2P= -0.99999901652339
##$FCOR= 0.5
##$FTSIZE= 32768
##$FT_mod= 6
##$GAMMA= 0
##$GB= 0
##$INTBC= 1
##$INTSCL= 1
##$ISEN= 128
##$LB= 0.3
##$LEV0= 0
##$LPBIN= 0
##$MAXI= 10000
##$MC2= 0
##$MEAN= 0
##$ME_mod= 0
##$MI= 0
##$NCOEF= 0
##$NC_proc= -2
##$NLEV= 6
##$NOISF1= 0
##$NOISF2= 0
##$NSP= 0
##$NTH_PI= 0
##$NZP= 0
##$OFFSET= 16.522
##$PC= 1
##$PHC0= 169.2918
##$PHC1= 8.535415
##$PH_mod= 1
##$PKNL= yes
##$PPARMOD= 0
##$PSCAL= 4
##$PSIGN= 0
##$REVERSE= no
##$SF= 250.13
##$SI= 32768
##$SIGF1= 0
##$SIGF2= 0
##$SINO= 400
##$SIOLD= 32768
##$SREGLST= <1H.CDCl3>
##$SSB= 0
##$STSI= 32768
##$STSR= 0
##$SW_p= 5175.98343685301
##$SYMM= 0
##$S_DEV= 0
##$TDeff= 65536
##$TDoff= 0
##$TI= <Analysis number 999999
Compound Code 99
Book Reference 9
Project Code 9>
##$TILT= no
##$TM1= 0
##$TM2= 0
##$TOPLEV= 0
##$USERP1= <user>
##$USERP2= <user>
##$USERP3= <user>
##$USERP4= <user>
##$USERP5= <user>
##$WDW= 1
##$XDIM= 32768
##$YMAX_p= 501120633
##$YMIN_p= -42946
$$ End of Bruker specific parameters
$$ ---------------------------------
##NTUPLES= NMR SPECTRUM
##VAR_NAME=  FREQUENCY,     SPECTRUM/REAL,   SPECTRUM/IMAG
##SYMBOL=    X,             R,               I
##VAR_TYPE=  INDEPENDENT,   DEPENDENT,       DEPENDENT
##VAR_FORM=  AFFN,          ASDF,            ASDF
##VAR_DIM=   32768,         32768,           32768
##UNITS=     HZ,            ARBITRARY UNITS, ARBITRARY UNITS
##FACTOR=    0.157963299565203, 1,           1
##FIRST=     4132.6476996994, 0,             0
##LAST=      -1043.33573715361, 0,           0
##MIN=       -1043.33573715361, -42946,      0
##MAX=       4132.6476996994, 501120633,     0
$$ Real data points
##PAGE= N=1
##DATA TABLE= (X++(R..R)), XYDATA
$$ [...]
22653a137l155j345o11l657j087m9K142O196N73k439L795q23j742R2J378m991
22637f860M3N58k152N540J3456K648j661M302n322k082m045q80l873l312k491
22622f131m43K965O541J320o80p345l207j64m952L976j828J897j589j997k403
22607a4040l972J021j577L781L816N89M150M428M620J317k317L414P87O10N32
22592G159q42l769k080n602l819o83J19K047L949m23m637k074N943R782K27k212
22576C085M87m582O08j036j692k810m417k404j585J517l91R361K794J362K475
22561B772J288l789J05K61m804O5k196J771Q92j381L247n68K08R15Q001Q73k816
22544D844O067m840q563k086N213K978n552k031l148J923K892P698L576m297k345
$$ y = [-1137, -4292, -5637, -6248, -9905, -10992, -11041, -8899, -2703, -2130, -4569, -774, -1597, -3339, -3247, -1869, -6860, -6817, -6259, -8411, -2871, 10585, 13233, 11572, 15874, 10552, 8470, 4425, 3545, -328, -3640, -6131, -6574, -3609, 2932, 4252, 3572, -3773, -6980, -7144, -12096, -8120, -9948, -8051, -9640, -11637, -14040, -18012, -16991, -18568, -14787, -10971, -10382, -6232, -1804, 2816, 4133, 1816, 5230, 6017, 6627, 7159, 6317, 2548, 468, -5134, -8953, -9636, -9517, -7470, -3521, -3944, -8581, -10655, -4712, 5070, 5297, 3085, 3572, -1010, -402, -1438, -3130, -5940, -10357, -12761, -14346, -12829, -13220, -3859, -1065, 297, 2772, 4060, 271, 376, 637, -4167, -4102, -6298, -4527, -3635, -5016, -1769, -2337, -2129, -1214, 6787, 7660, 4844, 10911, 6071, -2492, -4578, 635, 3613, -1939, -3970, -7118, -5195, -2303, 5395, 8971, 4674, 2329]
22529B329K414k570j931j623m398K302J447K48J168o297k624M232K829o19K528
22514e65J1262J1736m581r144k108J023l437M75m140l507J929L651L756l740n385
22499b775l443P758l162m379j791k517J604J2409R427p034l704K827k495n80R19
22484C064l7q055P318j545r651J217N676M28o093K225j025o82K190P150n085q592
22468a1497Q696M476l53p426k078P456K515M49o300m535J346R693L217K179J873
22453I711n301m263J55p769q391J57K671k47N901N988Q566L265r067q525n618
22438a2767j550N573k843j116L639O488M817m801l738p31j318j122N25P5L283
22423e586P71J508L479k711r845k689k19l906N733N590J617L144k383j963K074
$$ y = [2329, 4743, 2173, 242, -1381, -5779, -3477, -2030, -1782, -614, -6911, -9535, -5303, -2474, -3093, -565, 10697, 22433, 17852, 8708, 6600, 7623, 4186, 4661, 521, -2986, -1057, 2594, 6350, 2610, -2775, -6218, 1540, -1622, -6001, -7792, -10309, -8705, 3704, 13131, 6097, 2393, 5220, 2725, 2145, 3064, 3027, -5028, 2290, 745, -8906, -7689, -2013, -1585, -7678, -5453, -6478, -7160, -4970, 2180, -2905, -11497, -2801, 1675, 1322, -6104, -8182, -726, 1789, 2238, -4062, -8597, -7251, 2442, 5659, 7838, 9711, 4410, 147, 302, -7467, -15858, -15701, -13030, -13277, -7376, -1388, 7178, 10443, 1376, -7149, -12767, -14317, -8744, -11587, -12703, -9064, -2576, 2241, -2560, -6298, -7029, -8347, -9469, -8944, -8869, -5586, -4815, -3307, 172, -2539, -12384, -15073, -15292, -19198, -13465, -7875, -6258, -3114, -5497, -7460, -5386]
22408e386J277n364L057P467m97m448l903K274j381m91K171N94P21P271N001k306
22392F057R55k970L138l8k890l70K451K915J025k119j888k136Q74k323P132l198
22376F615n953m053n529L459L100O37q191M24N669O018J625M445o717O50L827
22361F026o889k427R5Q093m079J468p455P73O849J446Q835j005p390m923k989
22346c572M766j028Q09k789k163M109j649L376M884j933j919k262J10J530J170
22331C439k43k47m07o586m698j252k849P340j302k41k830l802K519N345p586J034
22315a2366K166M21K478J406k642O881M890M686j501J660N854j834l498l590j759
22300C252k530l335M644J317n404R12j055k050j772k916L268N672k980q292O858
$$ y = [-5386, -4109, -9473, -6416, 1051, 554, -3894, -7797, -5523, -6904, -7395, -5224, -4630, -3909, 3362, 8363, 6057, 7012, 4042, 7180, 7142, 4252, 3882, 6333, 9248, 10273, 8154, 6266, 4130, 5004, 2681, 9813, 6615, 662, -3391, -8920, -5461, -2361, -1724, -9915, -9491, -3822, 2196, 3821, 8266, 1549, 2199, 6026, -863, -3290, -3195, 4898, 819, 2287, -5168, -4395, 2454, 3900, 12735, 11730, 4340, -583, -3572, 1194, 166, 975, -1814, -3977, 132, -1517, 1859, 6743, 4810, 2891, 629, 739, 2269, 3439, 3196, 2949, 2542, -4044, -8742, -9994, -12843, -5503, -6805, -7046, -9876, -13678, -11159, -5814, -13400, -12366, -10200, -9779, -7301, -5895, -8537, -1656, 3234, 7920, 6419, 8079, 13933, 12099, 8601, 5011, 3252, 722, -2613, 2031, 3348, -2056, -1144, -2199, -4249, -6021, -8937, -5669, 3, -2977, -11269, -4411]
22285d411L165J263N271J049j360K40n98j216j137L522M560L003J252q937j0340
22270d674j277K732l333m90j360j48M19k001o75P42Q242M569j434l917q013R53
22254i665J559n8m884Q203M602k019l774m783R94j92N193N665R35L106o23L038
22238G297o35o346p753K203N577J470J053k991p132o066l908M817K925J808O321
22223a360Q31k115j0712M97M934L530R122j443j309J00n68j390l095p629j325
22208a1932j652Q039M572m757M736K559J401j667n393N437K118p712O569J507
22194C825l625j389L8p52l020l221P500M898o751o338J380K648o525m881j927
22179a8140O328L970L330K681J63p11k980n208p517j328j225P250K430J824Q014
$$ y = [-4411, -1246, 17, 5288, 6337, 4977, 5217, 4619, 3403, 2266, 5788, 10348, 13351, 14603, 5666, -4674, -5951, -3219, -6552, -7042, -8402, -8550, -8131, -10132, -10807, -10065, -1823, 2746, 1312, -2605, -10618, -9665, -8106, -8164, -13048, -4845, -243, -2262, -6036, -10819, -9825, -10017, -4824, 841, 1776, 4882, 4259, 7297, 6662, 316, -7437, -5234, 343, 1813, 2866, -125, -7257, -13323, -17231, -12414, -9489, -7681, -1360, -529, -2644, -13356, -12859, -7925, -4395, 4727, 3284, 1975, 2075, 1507, 117, -2978, -10607, -11932, -13584, -5545, -973, -5730, -994, 1565, 2966, 1299, -4094, 1343, 3461, -4251, 2318, 3825, 200, -1189, -1151, -1903, -4923, -8144, -644, 4254, -2497, -8835, -7455, -4807, -11332, -16213, -18140, -11812, -7842, -4512, -1831, -1668, -2379, -5359, -10567, -18084, -19412, -20637, -13387, -10957, -9133, -1119]
22164a119N343l377k420k392p672N750M519L356l392O68M528j444J002K872N030
22149A1252k983n661M514m251l700r127m917K959P757J6945m491j1834k294L642
22135b189N694l203M863N559l581m769j345L686j222L866q28j948Q89K102k934
22120D640k034n41q51J428r86j024o83j632j71K10q8k478r16j885L872R72p484
22103i651n536N998J2396O657j249o858N2j150P99r667m64J999P149J905O680
22088I060j184j500K711M519J402j0178n260k369n89M543O314k861J069pp828
22073b158m58K542j569m992k830J1688R081o83n80k412n623l737j261L577P50
22058A335o971J566j773k252N038P787j191J616J053k021o063j0082k390O069
$$ y = [-1119, 4224, 847, -1573, -3965, -11637, -5887, -1368, 1988, -1404, -736, 3792, 2348, 3350, 6222, 11252, 8269, 2608, 7122, 2871, -829, -9956, -14873, -11914, -4157, 12788, 8297, -3537, -5831, -2189, 3505, 302, 5165, 10724, 7143, 2374, 1029, 4715, 3493, 7359, 6531, 4583, 5472, 7574, 4640, 2606, 2065, 1214, 2642, 1656, 632, -51, -1683, -1854, -1644, -1732, -4210, -5126, -7011, -3139, -2167, -9651, -15187, -9189, 3207, 9864, 8615, 1757, 1809, 659, 1458, -8209, -8673, -6674, 475, 2380, 9060, 7876, 6376, 9087, 13606, 15008, 4830, -430, -2799, -3388, 1155, 7469, 4608, 5677, 5670, -2158, -2616, -74, -1643, -6635, -9465, 2223, 11304, 10621, 10041, 7629, 2006, -1731, -2992, 585, 1335, -5636, -4070, -5843, -8095, -3057, 4730, 3539, 5155, 6208, 4187, -1876, -11958, -14348, -8279]
22044h279L035m902k700M543J436L759N51P991K634P35m327l746m057Q03L267
22029G43j972M664N857K300J727n245j0003O078K375o626m747k75Q88K519M932
22014C215j110O56M975M12j742K734R422L920m998q823M091l32m514n854p983
21999e931k514L348J945k42l181j950n92M019J143O713N009q396j1974J515M373
21984f715P767K869n150j832L882L886L402N88j988j1453n561j7K214R99m502
21969a1611Q772M764l651J255M604k47l55p905k475N508p17J811j303j190k502
21954e242j154l765m061O344Q286p51m27n458o241N198K91K781n379J258J098
21939g222M019k966j534R45L573L974N96N796J13J215j103n609M15k079j531l930
$$ y = [-8279, -5244, -10146, -12846, -8303, -6867, -3108, -2557, 5434, 8068, 8803, 4476, 730, -3327, -2524, 743, -1229, 3435, 9292, 11592, 13319, 8074, -1929, 4149, 6524, -102, -4849, -5124, -4236, -1717, 3215, 2105, 2761, 7736, 8148, 6406, 9140, 18562, 22482, 17484, 8661, 12752, 12420, 7906, 2052, -5931, -8445, -5097, -3152, -3394, -6575, -8525, -9117, -5098, -3955, 2758, 7767, -629, -12603, -11088, -6715, 1052, 3921, -1229, -3061, 821, 4707, 8109, 8697, 6709, -4744, -10305, -10322, -8108, -7109, -11611, -2839, 1925, -1726, -471, 4133, 3886, 3531, -4374, -6849, -1341, -2058, -247, -1550, -2740, -5242, -6396, -10161, -14222, -7878, 408, -343, -770, -6228, -12469, -7271, -6980, -4199, -9578, -8320, -7222, -3203, -6169, -7703, -6758, -3185, 789, 1385, 7181, 7294, 8509, 7406, 1797, 2212, 133, -1398, -5328]
21923e328K260M583n744N72k582j612k805K816K734Q64J097M999J411n427k015
21908d177j398l444j564L429j844m856p37l76l348K796Q947N618k47l772K532
21893b441j859K560n115r98O4L224M912j560M62N347K73p161j4351J899P676P41
21877f327N64L366J388J95j579K415K285J566l98m235n169L26m715k241J571N204
21861e784K966j409o833m793m40M539l45O103L072L873j16M72j280Q09K444J738
21845E016Q53k388m099l577j325J232l10o482K163M692J368m811p63J193L838
21830c400Q384l958r696o63L758M837k160n271N74n158j068j933o57L093M436
21815h882L429k762j178j966L042O34k817n540k15L461K080M479K7J277L192k219
$$ y = [-5328, -3068, 1515, -4229, -3657, -6239, -7851, -10656, -7840, -5106, -4242, -3145, 1854, 3265, -2162, -4177, -5575, -9019, -10583, -7154, -8998, -13854, -14591, -14967, -18315, -15519, -6572, -954, -1201, -4973, -2441, -4300, -1740, -6855, -7853, -7789, -4565, 347, -1213, -751, 4596, 4869, -2292, -16643, -14744, -7068, -6327, -5763, -2397, -1009, -814, -2393, 22, 2307, 3873, 3475, -760, -5929, -5603, -10318, -12559, -10988, -5784, -2818, -4227, -11060, -15853, -16293, -11754, -12099, -5996, -2924, 949, 833, 1305, 25, 834, 3278, 5016, 5869, 3481, -618, -4195, -5520, -4288, -4598, -11080, -8917, -4225, -2857, -7668, -8431, -7238, -3400, 4984, 1026, -8670, -9333, -5575, -738, -2898, -8169, -7595, -12753, -13821, -15754, -16411, -13318, -8882, -5453, -8215, -9393, -11359, -8317, -7683, -10500, -16040, -16255, -12794, -10714, -6235, -6208, -4931, -1739, -3958]
21799c958O7j212P701J370k325J157q646J059O113j933j937K042k663p252L781
21784f636K776J354j578p08m829K656J203P201K582m029p970k262O791J374o411
21769h486M687J582r542m036N018M158M387k665O89r756j691r01l456P745J3634
21754A367k691p046M040L764R42l035j136l535j817l392K204O954p13n293j718
21739a1105M455Q182K178p158P3M540N70L890l428M20j875k398r32q84J109R92
21723a371m968k107M675J0061P16m850k54M138J722Q071k337q388l06L813J675
21708A0290j771p642q176l432k722K482K746n231K494K386m855m491O211N244
21694f467n32K928P291K098n508m499L175Q976L710m741p394j198k115k668p49
$$ y = [-3958, -3891, -5103, 2598, 3968, 1643, 2800, -5846, -4787, 1326, -607, -2544, -502, -3165, -10417, -6636, -3860, -2506, -4084, -4792, -9621, -6965, -5762, 1439, 4021, -8, -7978, -10240, -3449, -2075, -8486, -3799, -2217, -11759, -15795, -10777, -6619, -2232, -4897, -4208, -13964, -15655, -16556, -20012, -12267, 1367, -1324, -8370, -4330, -566, 376, -2659, -3795, -7330, -9147, -12539, -10335, -3381, -4094, -9387, -11105, -6650, 1532, 3710, -3448, -3375, 1165, 1735, 5625, 2197, 2617, 742, -1656, -2588, -3472, -2363, -1371, -6339, -8446, -3771, 6290, 7006, 2156, 1902, 6040, 7762, 15833, 13496, 5108, 4802, 8615, 10290, 8519, 877, -7299, -10731, -13453, -10971, -8225, -13456, -10962, -8576, -13431, -17922, -11711, -6467, -6999, -4071, 3220, 5318, -190, -4689, -1514, 7462, 11172, 6431, -963, -2161, -4276, -6944, -7693]
21679g693n756J974L741l189k206p01N149P087k125p221M197P98p591k118O218
21664i436N564j853k191J377O342k190j724J221J328m827J15K221R419P18m853
21649A231q64k238M565L431m780p224o685K514N412l90q17O738o835l739M091
21634e590K314l548n586l574Q171J399J642j901o59k272o641l216N328N328j336
21619a0141K849M077j24n46J003K186N797O820K473l367l483p823j0608n86k022
21604a3495P204O277j383m169n530M271l771K858K577k854K538O742R61n639l467
21589f880l14m915L154Q125J690j164k204K79N530q6k44l532o205k944j921L58
21573a1273Q796j650j91M740Q63r81l114J857K258l962k394j003l05j0245J440
$$ y = [-7693, -13449, -11475, -7734, -10923, -13129, -13830, -8681, -1594, -3719, -10940, -6743, -5945, -13536, -15654, -9436, -3872, -5725, -7916, -6539, -197, -2387, -4111, -2890, -1562, -6389, -6274, -4053, 5366, 6084, 1231, 367, -1871, 2694, 6125, 1345, -5879, -12564, -10050, -4638, -5028, -5845, 893, -5942, -9681, -5590, -3276, -6824, -12410, -15984, -7813, -6414, -4772, -6673, -7332, -9604, -16245, -19461, -14133, -8805, -10141, -7292, -3215, -3339, -3885, -2882, -696, 5101, 11921, 14394, 11027, 7544, -279, -10887, -11473, -13495, -6291, -14, -1397, -5566, -11096, -6825, -10596, -7738, -5161, -8015, -5477, 1265, 2226, -3413, -6880, -7194, -12109, -8955, -830, 860, -304, -2508, -2229, 3301, 3215, 2971, -561, -6766, -9710, -11631, -11273, -2477, -4127, -4318, 422, 1285, 304, -2810, -953, 1305, -2657, -5051, -6054, -6359, -16604, -15164]
21558a5164J856N412M411J558K733J170N420o335k546k159J492K475k66n613j902
21543g458K26K140J669N148r23j697q55o065l12K065J562O062N925M806m768m072
21527C453Ql79K050M561m540l950p106j741J914P961Q652J585o351r09q040m00
21511c232L498q56K296M220N75O33q31k97j878m191p435n246K265k749O339N097
21495a792m418l526m969M917O234P348j503p14k832l231k320J665O684M472l335
21480B680l895O65j330PP41L832m051n303p37j091l251k284R05O716M455j681
21464c622j969O075R360L005n648n006J581n173n454m163j785M102p76M250M245
21449i78P029J735k12K26n624n935m665L11O16l179O00m042K0J838M208L19q57
$$ y = [-15164, -13308, -7896, -3485, -1927, 806, 1976, 7396, 1061, -1485, -3644, -2152, 323, 57, -5556, -7458, -7232, -5092, -3423, 1725, 802, -895, -1750, -7815, -8127, -6062, -4500, 1562, 7487, 12293, 7525, 3453, 3461, 3082, 5132, 9693, 5153, 1203, -5903, -7644, -5730, 2231, 10883, 12468, 6117, 5208, -2832, -3232, 266, -590, 1706, 5926, 6501, 7134, 6303, 6006, 4128, -63, -7498, -12744, -10479, -13228, -6889, -1792, -6210, -9736, -14705, -9788, -3554, 3794, 2291, 1577, -1255, -4486, -6806, -5141, 1543, 6015, 2680, -1215, -550, -1880, -1873, -1132, 2700, -1351, -6654, -7391, -8482, -11733, -14017, -13112, -6396, -1941, -3622, -5591, 484, 9844, 12849, 7201, 2195, 3776, -1397, -6851, -11014, -12799, -8697, -9473, -5223, -978, 6051, 7786, 7574, 7800, 2176, -3759, -8424, -8113, -7497, -10676, -10076, -14118, -14098, -12260, -8052, -7733, -8590]
21432h590M648J0126L538j361l790n303L013L145l053M657P231m466r279n639
21418e123l575j477J906J603M085r095j803R091P469J342L378o258r310o157m865
21403a8789M48J0434O559N54J157L67M754N195q030n692n287K296l271N794K060
21388a451N918l310q411l586O108K392m76j151j018m021k326Q770m24k321m235
21373i542j394O166P343L46o320J753J707l624K34K158l826j570L022M370l046
21358b223l008l156J125K166k580K829j161k586K853M946k920j04j124m502q22
21343a0267L75J52P606Q81J762k557L4k360l308L103j971L5M091p403j456N201
21327f082L589m918r03N334J0777N499p480n126k285k108L423j821k214Q31n472
$$ y = [-8590, -3942, 6184, 9722, 8361, 4571, -732, 2281, 5426, 2373, 7030, 14261, 9795, 516, -5123, -8698, -10175, -8269, -6666, -2581, -11676, -13479, -4388, 3081, 4423, 7801, 1543, -7767, -13924, -18789, -18341, -7907, -1348, -794, 363, 730, 5484, 10679, 2649, -3043, -8330, -6034, -9305, -3511, -1451, 4467, 1157, -7254, -10840, -4732, -2340, -2816, -3967, -4985, -9006, -11332, -2562, -2986, -5307, -9542, -10936, -4770, 2573, 2919, -3401, -1648, 59, -3565, -3331, -1173, -4999, -6569, -3547, 823, -2223, -5231, -8387, -7262, -5096, -7676, -4847, -6008, -8594, -5741, -795, -3715, -3819, -4943, -9445, -10267, -9892, -9740, -2134, -1253, 509, -2048, -2014, -4374, -7682, -4579, -6550, -6515, -2424, -9827, -11283, -6082, -2493, -7411, -8314, -2980, 7797, 13296, 5816, 690, -1595, -3703, -280, -2101, -4315, -3484, -8956]
21312h956L250M559k044M331n132n70k648o98Q477K318q78K429Q3K076p698n037
21296f138J693L433N05N920K894j914r134l699q67N768K641J332J0960r47j0189
21281B258j2434N018R239l839j904j761m472O495K810O62n477J664J536m400n218
21266i823M458Q269O990j08J5o246j3533m127J497K160n30p069K529K068n613
21251a9063J155M171k672j47K068O366O072o898j626N957j819o015j423J1379
21237b495M025K843M319L828n706l121r67K389k09m839m83L394j210n410L470
21222a72M36m991j259j114k220k912J569K002L31l234L68p218o847J090J0190
21207a3981R78N812O433n18K77n57q490K65K246O709L466j326N850l127k51K24
$$ y = [-8956, -5706, -1147, -3191, 1140, -3992, -4562, -7210, -7908, 569, 2887, 2009, 4438, 4521, 6597, -1101, -6138, -4445, -1012, -507, 5413, 8307, 6393, -2741, -6440, -7307, -1539, 1102, 2434, 13394, 12447, 2258, -10176, -5158, 4081, 242, -1662, -3423, -7895, -1400, 1410, 2072, -3405, -1741, -205, -4605, -9823, -5365, 2904, 9894, 9786, 9801, 3555, -9978, -14105, -12608, -10448, -10978, -18047, -15518, -13450, -19063, -17908, -13737, -16409, -16556, -14488, -8122, -2050, -8948, -10574, -4617, -6436, -12451, -13874, -2495, 1530, 4373, 8692, 12520, 6814, 3693, 2726, 5115, 4906, 67, -416, 2978, 1768, -3642, -172, 264, -4727, -5986, -7100, -9320, -12232, -10663, -8661, -8330, -11564, -11196, -18414, -25261, -24171, -13981, -13003, -7191, -758, -1276, -999, -1556, -10046, -9781, -7535, -826, 2640, 1314, 7164, 4037, 3786, 4010]
21191D010N882m914r793k840J102R636N411k344j752n923n771l597L411J649J683
21176d150N321K228n816m863l265M96j220N485O596l635m392L94Q549n624p874
21161a1770m619J203Q050O476n56m061o860l296k386J1596M305l680m25K461L657
21146I5j81M838k601n227j890J840j460L042j050p336j504n003M244J22O55R4
21130a1322p49L313j329M654N790J315j205J964j490r661k988J515N67R03Q7J561
21114g075L465M317n55m221K196O554m098j0512r729N402P179L342l110l25K416
21099d754O348o87j519j067m560n376Q320k598K381J505L340J984k395l217K8
21084b267L258q22m171k964o40p37n018m38l752k642P044k411j513K541K113R291
$$ y = [4010, 9892, 4978, -4815, -7655, -6553, 3083, 8494, 6150, 4398, -1525, -7296, -10893, -7482, -5833, -4150, 1171, 3399, -2417, -7280, -10545, -10049, -11269, -5784, 812, -2823, -7215, -6821, 1728, -3896, -11770, -16389, -15186, -7136, -660, -1216, -5277, -12137, -15433, -17819, -6223, -1918, -5598, -6023, -3562, 95, -86, 4752, 2151, -3076, -4966, -3126, -4586, -1544, -2594, -9930, -11434, -16437, -12193, -12071, -11416, -11322, -12071, -8758, -10087, -5433, 357, 1672, 467, 2431, 941, -8720, -11708, -10193, -9626, -8723, -8636, -7075, -3610, 707, 152, -4069, -1873, 4681, 583, -9929, -19658, -14256, -7077, -3735, -6845, -7170, -4754, 1594, 907, -612, -1679, -6239, -11615, -3295, -5893, -3512, -2007, 1333, 3317, 922, -2295, -2267, 991, 169, -4002, -6966, -7606, -8343, -13361, -13799, -17551, -20193, -13149, -15560, -17073, -14532, -12419, -3128]
21068c128K943j815p273M327L651P77p91j643j941m521l346O528N21r2Q08m770
21052i765j098l731J2560Q133j069J518r22J379n748l744r51K900R049J813k06
21037A0118m80n176k095p428k562K12K52j440N597L176l961r96L789M030o901
21022c865o822K338R026k800p359P37L621RL536L197P24j706l81l084J144O599
21006D914p075o674j539K592M006q44j982K020n570l0M292k129J796k896J025
20991h094O414K257m659M968m778l116M861j560p248O094Q76k188K430k670j0
20976f423k056J515J324j662l130O043k282o982K975Q67j749P8L437J21R85K149
20960d790qo13j499m853p84m220j325O851Q735O084q278q653m46m501k444N235
$$ y = [-3128, -185, -2000, -9273, -4946, -1295, -518, -1309, -2952, -4893, -9414, -12760, -6232, -5711, -5803, -4995, -9765, -10863, -14594, -2034, 6099, 5030, 6548, 5626, 7005, 1257, -2487, -3438, -538, 8511, 10324, 10118, 9638, 4462, 2367, -5061, -7623, -7411, -7159, -8599, -3002, 174, -3787, -4783, -994, 3036, -3865, -10687, -8349, 677, -2123, -9482, -8745, -5124, -5115, -1579, 1618, 2342, 636, 255, -2829, -1685, 4914, -2161, -8835, -10374, -7782, -3776, -4620, -6602, -4582, -10152, -10182, -5890, -8019, -6223, -9119, -8094, -1680, 577, -4082, 886, -3892, -7008, -2147, -3707, -10955, -4861, -3985, -6173, -3743, -6413, -6423, -8479, -6964, -5640, -7302, -10432, -4389, -6671, -13653, -10678, -9811, -11560, -11482, -8045, -7924, -6939, -4790, -4798, -5411, -6910, -11763, -12547, -16767, -18092, -11241, -2506, 3578, -4700, -13353, -13799, -18300, -20744, -15509]
20944a5509M297J041m276k9P161J845P732N323o61o666j466j534J109O731n35
20929D563p882j212N438l047n60l53k399J909J181n010j2412K094Q210L116j446
20914g810K639k339M24N507j51k97k788l253L683M279K103n05j028o99l536K678
20898a093m953o705P18O877O669q1q109L478M159l371R115O592J902j3771p965
20883f538K534L001K366l542k966N618M505n986o411N74M990jm256P21J648l157
20867f900K272K487K978K54j921m470n354j231Q940l173k774j594j015k327M15
20852a3413K918Q375N757P19m20K81k650j143n899k212J52N238K548K457O499
20837I207K229r212m072L86j29k676p876j6l548L838K711r15M669j964l456R163
$$ y = [-15509, -11212, -10171, -14447, -14476, -7315, -5470, 2262, 7585, 6924, 258, -1208, -2742, -1633, 5098, 4563, -3319, -4531, 907, -2140, -2700, -3053, -5452, -3543, -2362, -7372, -19784, -17690, -9480, -6364, -7810, -5171, -7510, -7086, -1579, -1730, -2027, -4815, -8068, -4385, -106, 1997, 1492, 464, -235, -3771, -1093, -6046, -12751, -12033, -5156, 1513, 1432, -6677, -3199, 960, -2411, 6704, 13296, 15198, 1427, -6538, -4004, -1003, 1363, -2179, -5145, 473, 4978, -1008, -7419, -6845, -1855, -1856, -6112, -5391, -3743, -6900, -4628, -2141, 837, 1091, -830, -5300, -10654, -11885, -2945, -6118, -8892, -10486, -11501, -13828, -13413, -10495, -2120, 3637, 4356, 3936, 4217, 1567, 424, -5475, -7687, -7535, -2297, 251, 2708, 9207, 11436, 2224, -1848, -1462, -1591, -4267, -12143, -12159, -15707, -11869, -9158, -10073, -5404, -7368, -10824, -1661]
20821a661P292K736J537O65k471j432K057j005k578J321M88J344k318k211P435
20806A1199l48m137p777m426o77%L017N189L505K163N124k377q733j664R3p34
20790e83l543l418m816J023O147P11M360P806K00l410m60j960l219j911n910K745
20774f238R475N663o597K842N152K954p642k637j145p086M682L039n24K908J745
20759F591o442n034j923J50l447o204K954R808L775R47m659n914J59P622P805
20744F188j814o124n335j711K229J698L137j315m332k669N647K053o108k761M667
20729f550P295N501m417j697N38j0091q04k11l322O164p23O244M24j464j576l080
20713g769K50K221M990J689l774M45L086m256p690l95j117L465J40K079M775K502
$$ y = [-1661, 5631, 8367, 9904, 10569, 8098, 6666, 8723, 7718, 5140, 6461, 6949, 8293, 5975, 3764, 11199, 10851, 6714, -1063, -5489, -6166, -6166, -3149, 2040, 5545, 7708, 12832, 10455, 1722, 58, 151, -583, -4126, -7544, -12360, -11337, -5190, -4479, -119, 7687, 7887, 4477, 4017, 2057, -1162, -3073, -8983, -6238, 3237, 8900, 2303, 5145, 10297, 13251, 5609, 2972, 1827, -5259, -577, 2462, 1938, 4846, 6591, 149, -4885, -6808, -6658, -10105, -16309, -13355, -3547, 228, 1175, -3484, -9398, -9239, -1617, 6188, 4374, -1750, -7085, -8796, -6567, -4869, -1732, -3047, -7379, -10048, -4401, -2348, -8456, -11217, -6550, 745, 6246, 1829, 132, 670, -9421, -10225, -10436, -13758, -7594, -8317, -2073, -1649, -3113, -4689, -7769, -7519, -5298, -308, 1381, -2393, -1948, 1138, -3118, -10808, -11203, -12320, -8855, -8715, -6636, -1861, 641]
20697F41K175l263M114J523k338p327L157K093o305P404R727k081k225k985m418
20682a08M305L886l727m64J395k267j582L932k99n413n210J090o12K986j382k62
20666c732Q27k695j67K378o78K117J902L258k184k046N061r07q904N777P475K77
20650G759K32q499n671m35P94m210j301M44K820N269J098l76j253K241M287n213
20634b014o22l102L037k408J442r60n39l219j192O680O551N018L095L770m403
20619A1134k410L9n90k927o229m383j259K429L315k694q541j754P555Q141L400
20604E226J201O017n099q608P000q5m42k361K550M249l679q864j784K34j220K302
20588c363L721K907P334J292p403j848L002l984r919M199K502L15m716j583Q92
$$ y = [641, 2816, -447, 3667, 5190, 2852, -4475, -1318, 775, -5530, 1874, 11601, 9520, 7295, 4310, -108, 4197, 8083, 4356, 3892, 5287, 3020, 1438, 5370, 5071, -342, -5552, -4462, -5074, -2088, -3470, -3732, -2905, -5600, -5767, -3389, -4067, -1950, -48, 3210, 1026, -1020, 4041, 3134, -5770, 7, 7482, 7759, 7991, -508, -6179, -6614, -5820, -10030, -11331, -10887, -8067, -2798, -1700, -2076, -3329, -1088, 3199, -2014, -2636, -5738, -2701, -5109, -3667, -4627, -5166, -8385, -9577, -2897, 3654, 8672, 11767, 15537, 11134, 8724, 8763, 8173, 5246, -983, -5366, -6625, -4196, -881, -3575, -12116, -13870, -6315, 1826, 5226, 6427, 12444, 7345, -1263, 5737, 5652, 5210, 2849, 5399, 9648, 5969, -2895, -4679, -4445, -5665, -3363, 358, 3265, 10599, 11891, 4488, 2640, 5642, 1658, -8261, -4062, -1560, -1245, -5961, -7544, -6652]
20573f652L941L618K864n479m442L778j921L381m67n730o9k194M27j481j991K56
20557a2161J375R155N78N372J685n005j641N643j515l144j092m27q57k965ll83
20541e385j092K680l792j835J0010M930l342j455J217J482K394m700K125q503
20527e266p229K98O210N774m098J551N319j650j165m745L169O122K107O40j100
20512E937k818M004l195J138j286l369M515M989o71J313j513J285N581n907L619
20497A3622n523o497J012o528m049M32P54Q430J912j359j279q302o791J681L761
20482h724Q813N906k461l657J447J217k00p532k058J786K465m275n887O896J753
20467d511J312L670l811p078m739l3L858O117N840N41m126R96N645L062k675o092
$$ y = [-6652, -2711, 907, 3771, -1708, -6150, -2372, -4293, -912, -1379, -7109, -7178, -9372, -8945, -10426, -12417, -12161, -10786, -1631, -1053, 4319, 6004, 999, -642, 5001, 3486, 342, -750, -1177, -2034, -4999, -5002, -5385, -6477, -3797, -7589, -9424, 586, 5516, 2174, 719, 1936, 3418, 5812, 1112, 3237, -5266, -12495, -12197, -5987, -213, -4311, -2760, 2559, 909, -256, -5001, -1832, 4290, 6397, 7037, 5937, 3119, 7123, 3928, 5066, 3780, 411, 4926, 9915, 9244, 10557, 9044, 10329, 15910, 10003, 13622, 8099, 1602, 2614, -3914, -7963, -7531, -6777, 1653, 3565, 2206, 927, -7375, -14166, -12485, -8724, 89, 5995, 3534, -123, 1324, 2541, 2341, -5191, -7249, -5463, -2998, -7273, -13160, -6264, -4511, -3199, 471, -3340, -10418, -15157, -15190, -11332, -5215, 625, 1166, -2960, -1964, 3681, 6743, 4068, -2024]
20451b024p5K826Q777l584m536n64J29k595N845Q03j4897p161j093K919P320J0945
20435C035N237o18m101M192O33l633j562n79K383m865q567K345k95k36j526P55
20419g402M046j193r105n580k874K081N464J2225n134J438j515j04q29N336J137
20404b009K544L902P439j251j645n974l343o44m63k181p184m927L90K622O87R569
20388b468r32m228k340m81N451J271o175l616M574Q788k543j0147N04K332N902
20373d108J246p99K165O09j41J371o58J026r712l751p33P428P921J074o499l015
20357f576M433Q03l940m27m669M191J1609R572M222o574m781n2k249N143K658
20342A3363L645j51J85m74K15p609n386n315L599P69l467n791p317m274P786O715
$$ y = [-2024, -2099, 727, 9504, 5920, 1384, 820, 949, -1646, 4199, 5002, -9895, -17056, -18149, -15230, -7910, 3035, 8272, 7654, 3553, 7745, 8378, 4745, 3183, 2604, 4987, 122, -8445, -6100, -6395, -6631, -8157, -7402, -3356, -4549, -13654, -19234, -22108, -20027, -14563, -2338, -7472, -6034, -7549, -7653, -8482, -3146, -2009, 535, 4437, 11876, 10625, 8980, 3006, -337, -981, -1444, -3625, -10809, -15736, -15346, -12724, -12037, -2468, -3400, -7628, -9968, -10449, -4998, -3727, -9902, -13518, -8944, -156, -2699, -12846, -12342, -10010, -4108, -2862, -3661, -1496, -887, -1028, 343, -315, 711, -9001, -12752, -13485, -6057, 1864, 2938, -3561, -6576, -2143, -1340, -5280, -5707, -10376, -6185, 5424, 14996, 19218, 12644, 7863, 7811, 5562, 10705, 13363, 17008, 16857, 17042, 16568, 16783, 9174, 3788, -1527, 2072, 2841, -626, -6417, -13734, -18008, -10222, -3507]
20326c507o71K07J388j779L418M928K480j573p797m285l300r49O155R431N678
20311I824M14o407j0826L147J1595K800o602m266J197k135J318J953m279m379
20297f646j130L648N756l330K980k36o182K165J763k946r137K057N658j800k976
20282a0356j746M837M951L000N478L354j1929Q73M442R53J027m774N85J089J523
20267C307N542j2231q251n862O115N738P62L677k78J426N051L775o187o018K561
20252h73Q37J413P104K281J432l117o112n516k408K250j679m560O575J0273k520
20237E380K94O558j368m999N274j64o563n248L60M346O700k165r218n596l213
20222i622j177N326L852J618N54n71L390j005j895M134l692l812j952M590N725
$$ y = [-3507, -4178, -3971, -2583, -4362, -944, 3984, 6464, 4891, -2906, -7191, -10491, -11440, -5285, 4146, 9824, 10238, 3831, -6995, -3848, 7747, 10547, 3945, -321, 876, -1259, 59, 2012, -2267, -6646, -7776, -4128, 1628, -1702, 1278, 1042, -5140, -2975, -1212, -4158, -13295, -11238, -5580, -7380, -10356, -12102, -7265, -2314, 686, 6164, 9518, -2411, -1538, 2904, 3857, 4884, 110, 695, 1784, 3307, 8849, -3382, -11633, -17495, -11380, -5642, -4880, -1203, -1481, -55, 4996, 8771, 2584, -3434, -873, -36, 1377, 8481, 10762, 12194, 9077, 2965, -2551, -4959, -2709, -4388, -8948, -2373, 7900, 5380, 5674, 12232, 10864, 5865, 11139, 10975, 4412, -836, -476, 3870, 10570, 8405, -813, -6409, -9622, -10799, -5473, -1621, -3, 551, -20, 3370, 2365, 470, 4604, 912, -2900, -4852, -262, 5463]
20207E463L03o738l88o382L266N253N539l276o149k198L549O534p31l445K394
20192B994M32k306j991L044K492m522M581k492j183J1168L804j027j128j237j423
20177A1206K157j0468j2537M048j076p264J987R852L007J46O5J030p50Q74m306
20162b029l011J013M223K40r25K177k393l008o10M931K189j104K176O32j336k624
20146E41r999m126J634J789Q44L640k111M477M675m075k139L820k735k589J067
20131e287L788M977M165l259m221r00K727J64l7m158p294N841l450j655l6M268
20115d367k463m025J456j515n76M015L963m60r64l814M536L479J34K316j031j778
20099a094M697Q31q729N056P252n725r844J547K789K375q210J619J505K240r32
$$ y = [5463, 5766, -972, -1360, -7742, -4476, 777, 6316, 3040, -3109, -5307, -1758, 4776, 4045, 600, 2994, 3426, 1120, -871, 2173, 4665, 143, 4724, 2232, 1049, 12217, 16021, 14994, 13866, 12629, 11206, 13363, 2895, -9642, -5594, -6670, -13934, -11947, -2095, 912, 1058, 1123, 2153, 1403, 2277, -2029, -5040, -4027, 196, 436, -489, 1688, -705, -3713, -4323, 608, 2797, 1693, 3869, 4501, 3165, 541, -9458, -13584, -11950, -10161, -9317, -5677, -7788, -3311, 1364, -2711, -4850, -1030, -3765, -6354, -5287, -1499, 3478, 7643, 4384, 163, -737, 1990, 2154, 2117, -2041, -9335, -3494, -6944, -8599, -8635, -4367, -6830, -10855, -9399, -10914, -11490, -7475, -3512, -3972, -4936, -8750, -4214, -735, -601, 1715, 684, -1094, 3603, 4434, -4295, 761, 8013, 2288, -7556, -6009, -3220, -845, -9055, -7436, -5931, -3691, -4623]
20084d623M687l040j96L923L48J694O809k916q43K393p241K987O482p976J974
20069D462l575n186J0516m193r956R344O702m245j13m3k478K07m29k440J785J332
20053A690p004k228Q59j511N062p06n08M600J681N319n1o813Q36L752r09m370
20037c01K806N923n017o261n060j219L221j602M932P746N415n131o38M413J099
20022A0326m942n872M38P5n73O910J521q65k514j666q664m12m134j528M178J520
20006f202J331N824M533j209m739m541L567O36k674l432O241M47l894m782J701
19991g193J1653L791m627l921o387K35K04N936R554o788o899m034j509L888m96
19976f593L639L477j225O76J692o175J265j979n803K784J0226K308m077Q00O095
$$ y = [-4623, 64, -2976, -3172, 751, 1099, 2793, 9602, 6686, 5843, 8236, 995, 3982, 10464, 2488, 4462, 887, -4299, 6217, 2024, -7932, 1412, 8114, 3869, 3756, 3713, 1235, 1442, 1013, -1427, 358, 1690, -5314, -7542, -6683, -8194, -3132, -3838, -4346, 254, 1935, 7254, 7203, 390, 1226, 4978, 4069, -301, 2505, 8428, 3411, -2850, -7910, -9129, -5908, -7510, -2578, 5168, 10583, 5452, 4814, 9227, 10326, 5384, -488, -50, 25, -548, 6362, 7883, 7018, 4504, 2838, -5826, -6238, -10372, -11900, -7722, -6202, -4871, 953, 5486, 4277, -462, -5003, -1436, -800, -3474, -6906, -665, -218, -4112, -8894, -7193, 4460, 8251, 3624, -297, -6684, -6449, -6245, -309, 9245, 2457, -4442, -8476, -9985, -6097, -6593, -2954, 523, -702, -26, 1666, -4509, -3244, -5223, -11026, -8242, 1984, 4292, 215, 1015, 7110]
19961G110n21q99m251K212L1k470J405k289J874L16j138n67Q4j18k092n4k162
19944c529J00M705K612R44l754J357J075L945L01N840N713m819o500j0230n858
19929h098K239J619J756j283k92L108o41J95R46k883l163O55L039k063Q36l797
19913g827L201K440n24j476j669K846J0949n45n381M163k613K683k234M96P41
19898E250j230L488p93N37l634m731l093R290K902o920k851N741m30m539j793
19883b806M908J534o51J387L536m365j744M481J668k081n602p225j85J0490P330
19868A0675n314j197J48j21L826M924J417l012m875m2L246n250n908K839K520
19853C876K189q736K984l868q23J280M90l009K058j103n262k733Q997O789M72
$$ y = [7110, 6589, 5690, 1439, 3651, 3682, 1212, 2617, 328, 2202, 2518, 1380, 813, 897, 779, -1313, -1367, -3529, -3429, 1276, 3888, 4832, 1078, 2435, 3510, 7455, 7756, 13596, 19309, 14490, 7990, -2240, -8098, -5859, -4240, -2484, -3767, -4059, -951, -1592, -1397, -451, -3334, -6497, -5842, -2803, -4866, -4030, -7827, -4626, -2186, -2710, -4186, -5855, -3009, 7940, 7395, 2014, 6177, 3564, 6247, 4013, 4509, 5250, 4020, 7508, 6715, 7252, 3618, -1113, -4206, 5084, 7986, 1066, -1785, 3956, 3526, -1013, -2806, 2102, 3636, 2985, 4372, 7908, 3543, 1799, 6280, 7948, 5867, 265, -6960, -7145, 3345, 10675, 5361, 4164, 4312, 4191, 8017, 12941, 14358, 11346, 6471, 6429, 9675, 4425, -1483, 1356, 3876, 6065, -2671, 313, -3555, -4378, -3098, -2608, -5617, -3559, -4662, -9924, -12657, -3660, 3129, 3601]
19838C601r292R145R531J445k227o178m214J44J749O117O28p664p928O691K237
19823C785j463k143n727l521L202R699M286J2604M543k977l280j0111q852M536
19809D581K138l604m695q80k410J714j886J949O573M876l369l225o235m322K416
19794f379N318K62J912K446q59k903j601n407k125k484J895R754K101J681M793
19779H404K283K414M376l945M56j260m02o435n561m437o019M00j087k056O695
19764f174m426K915L221M483P99j408l335m742N112N286K190k611J2566J825m702
19749A0999k152n76m993L305J630k064o301L508L919p014l554J296N023N06l750
19734b18o796n650p94M724Q223J1076N123o356j1201j638J417p099k6O705K03
$$ y = [3601, -5691, 3454, 12985, 14430, 12203, 6025, 1811, 1955, 3704, 9821, 10449, 2785, -5143, 1548, 3785, 2322, 179, -5548, -9069, -5867, 3832, 8118, 20722, 25265, 22288, 19008, 8897, 45, 4581, 6719, 3115, -1580, -2460, -4870, -3156, -5042, -3093, 3480, 8356, 4987, 1762, -4473, -8795, -6379, -1061, -799, 1113, 3559, 2700, -203, -1804, -7211, -9336, -11820, -9925, -171, 1930, 3611, 8404, 10687, 13101, 17477, 13532, 13988, 12728, 12326, 5891, 330, -4107, -10126, -9726, -10813, -12869, -6174, -10600, -7685, -4464, 19, 818, -590, -3925, -8667, -3555, 1731, 3921, 1310, 13876, 15701, 10999, 8847, 8271, 3278, 6583, 8213, 6149, -152, 3356, 7275, 261, -3293, -1997, 3026, 3532, -218, -7014, -12664, -13458, -8734, -511, 10565, 15688, 9332, -1869, -3507, -2090, -9189, -9215, -2510, -2307]
19719b307k422l532M513L526m147N313K571n593P120P349K80n092l924m37l418
19704b00O05k361m23N529L342J78n373p26P636L509k894M577N966l205j4663m067
19688b570j536K520j335m428O57K730K106J324N627Q45R59L468N611P93m219l091
19672I461m454q32N592j525o522l450M476N072m62o355m237M124Q320P277j238
19657A5247j1993n442J380L35O79l103n93O127L089M070Q79R0j589k280l311r244
19641e659j819N813L288o783K767J328K433m201M678m78n385P825J653o234J325
19626E51O443l259J627l243N107K533l436l147N201o668k894N034J423m191q605
19611g524m897J35N67j649L467R005J759q73p02j2227j893J2315N199m91j704
$$ y = [-2307, -4729, -8261, -3748, -222, -4369, 944, 3515, -2078, 5042, 12391, 12671, 7579, 3655, 3218, -200, 405, -1956, -2379, 3150, 6492, 6670, 1297, 571, 8207, 11716, 8822, 13399, 19365, 16160, 1497, -2570, -4106, -1586, -2921, -7349, -6692, -3962, -1856, -532, 5095, 5940, 6899, 10367, 15978, 16771, 12552, 9461, 5007, 4175, 9767, 8242, 1720, -1730, 2746, 7818, 7356, 1001, -3236, 888, 9208, 16485, 15247, 3254, -2188, -808, -473, 206, -2897, -3490, 2637, 5726, 9796, 10675, 10765, 9176, 6896, 3585, -5659, -7478, -1665, 1623, -5160, -2393, -1065, 1368, -2833, 1845, 1367, -4018, 3807, 5460, -774, 551, 6994, 3735, 5362, 2119, 7226, 9759, 6323, 3176, 8377, 1709, -1185, 3849, 5272, 1081, -7524, -12421, -12286, -11719, -13368, -9901, -896, 863, -10, -712, -12939, -14832, -2517, 2682, 2191, 487]
19596D87j234M157P060n587m34N771m345k955K71j816kL063n95o8l176n004J580
19579b827J1730K260m837q550p157j3639j0033J4225J6438j521J223l64k064k979
19565h095J400L421N062K703M861j415R3j080o801q470M376N824P34o181p082
19550a0650L095j871J92m392n362N838L389M307M990J114K892M532j302k366N901
19535A0307J191p600k963l426K945L266n237p456m595J560M862O324J834k256
19521a244M165P529N88q010n70O679j894K747R07j86L03Q04j139o265K087J676
19505H177p807N141P420M605o792j1099J949J986j233l387k329j271P738L783
19491F881l013m959j79M662R054K16n303l692K621k650m25M949k496k858p476
$$ y = [487, -747, 3410, 10470, 4883, 4449, 10220, 5875, 2920, 3191, 1375, 1373, 4436, 3841, 3773, 597, -4407, -2827, 8903, 11163, 6326, -2224, -9381, -23020, -33053, -18828, -2390, -3911, -2688, -3052, -5116, -8095, -6695, -3274, 1788, 4491, 9352, 7937, 8030, 6950, 149, -8321, -3945, 1879, 2613, -3568, -10650, -7555, -9426, -9234, -13626, -18988, -13150, -9761, -5454, -464, 650, 3542, 8074, 6772, 4406, 10307, 11498, 3898, 935, -2491, 454, 3720, -1517, -8973, -13568, -12008, -7146, -822, 1012, -1244, 2921, 10450, 11038, 3028, 2458, 9137, 7243, 9990, 10897, 10711, 11014, 11818, 10679, 4414, 6501, 8177, 370, 5511, 12931, 17536, 10744, -355, 1594, 3580, 2347, -1040, -3369, -4640, 3098, 6881, 3868, -1091, -1270, 3392, 12446, 12662, 7359, 3667, 6288, 3638, 3213, 8162, 5666, 2808, -4668]
19476d668k001K286j100K002n8J554J634N872K303l617p562l758L937K124k261
19461c313J971L67p139J567O956K021j677M174q3k696J054J310Q71n124K295M285
19445F839K549l816l281n941L168j0q72n466L360M444L230l946L531o93j4734
19430a1638k611O066M376l939N104L202K630O055m93K77l004n688m441n973k213
19415a2290k70J265R514M229o819q17O39Q035K76k690J893k387o947j271j633
19400i273M284Q9k223j797J023J186M573P226p282J168K357J078N777r21M808
19385A2073l775l465j683J044J158q196J200M756M42J733R66J681l046k623n56
19370A709M966k851K269J24q98N538L861o380r351P574L220J041o946n552J525
$$ y = [-4668, -6669, -4383, -5483, -3481, -3539, -1985, -351, 5521, 7824, 4207, -3355, -7113, -3176, -1052, -3313, -1342, -975, -8114, -6547, 409, 2430, 753, 4927, 4844, 2148, 3202, 4512, 5383, 259, 2554, 6839, 9388, 5572, 2291, -3650, -482, -492, -1364, -6830, -3470, 974, 4204, 258, 3789, 3096, -11638, -14249, -8183, -3807, -7746, -2642, 560, 3190, 9245, 8752, 9029, 6025, 337, -4104, -10077, -12290, -12560, -11295, -1781, 2448, -4371, -5188, -4549, 3486, 3762, 1072, 2965, 578, -6369, -7640, -9273, -4989, -4900, -7123, -8920, -7897, -6711, -2138, 5088, -2194, -1026, 1331, 2409, 8186, 7265, 12073, 8298, 4833, 3150, 4194, 5352, -2844, -1644, 3112, 3554, 5287, 6253, 7934, 4888, 2265, 1709, 6675, 3824, 6093, 6217, 5319, 10857, 14718, 8338, -1013, 6561, 9781, 10822, 3876, -1676, -151]
19355a51Q487M532l212L006M92j841p307O3P206n000p71L20K626J746K927m056
19339I067L74J008L466L759J390o990q744r249k123O54j419Q021N912L415p7k38
19323H226K525k388q004n533n586K624L756Q928J443K310O608N983O873L31j6817
19308A1279r168k34J372J105J06L716o400J881J4753J925n21j594p353M94m421
19293F940K088j106m517N908K913n187p479K694L226j772j082n046j304j679O356
19278I53K098J476L175M363m338M32k094j128j302k771O175K844N235k49l462
19263A1407m374Q79m496q648K03O214M763K305k175p927j227r85n24K734L327
19248A476J2971L495j0170q74M944m034l917P392L574m214p474k331L812j427
$$ y = [-151, 8336, 12868, 9656, 12662, 13154, 11313, 4006, 4069, 11275, 6275, 5504, 5824, 8450, 10196, 13123, 9067, 9441, 10449, 13915, 17674, 19064, 12074, 3330, -5919, -8042, -7388, -8807, -786, 5126, 8541, 8464, 8226, 10751, 8363, 359, -5174, -10760, -8136, -4380, 4548, 5991, 8301, 14909, 20892, 27765, 28096, 11279, 2111, 1877, 3249, 4354, 4460, 8176, 1776, 3657, 18410, 20335, 19814, 18220, 10867, 11361, 6940, 9028, 7922, 3405, 9313, 12226, 7039, -440, 2254, 5480, 3708, 2626, -2420, -3724, -5403, 953, 3051, 4527, 7702, 12065, 7727, 8159, 6065, 4937, 3635, 864, 7039, 9883, 15118, 14869, 11407, 7033, 7912, 3416, -5232, -5029, 1185, 5948, 8253, 6078, -1849, -3076, -4061, -4585, -1851, 1476, 14447, 17942, 7772, 6898, 11842, 7808, 3891, 11283, 14857, 10643, 3169, 838, 4650, 3223]
19234C223j281J990l642O923O984j0301q209M231L870K526K553K284P38m276K736
19219A0349m100k702j1j049K847L71K951K343P2n519k925M390N365n022L248K844
19203A3452o119p712l653J695N552N681K604L09K287n435N879K96l148M42q587
19188C543r507j122N903O166N134n116L80m176k337L053k301L088q1L025j267
19173D385m182n63J516m292l822J1593P040o78J068q196o111J489k713K337j730
19158b859k983K603L674K817j264l47K304N910l639j497J715J282Q66k709O83
19143F556l541J88j002K080N876q375k102q61l779J403P616Q014J877k109o350
19128E491r177j400l911n758L825J3411R323J595R234O194l673p168m219j0921
$$ y = [3223, 1942, 3932, 290, 7213, 14197, 3896, -4313, -82, 3788, 6314, 8867, 11151, 11889, 7613, 10349, 6249, 3547, 3536, 2487, 5334, 5705, 8656, 10999, 11071, 5552, 2627, 7017, 12382, 7360, 10608, 13452, 7333, -379, -4032, -2337, 3215, 8896, 11500, 11809, 14096, 8661, 14540, 14836, 11688, 12130, 3543, -5964, -7086, -1183, 4983, 10117, 5001, 5381, 1205, -1132, 1921, -380, 2708, 2627, 5652, 4385, 203, -360, 1156, -3136, -6958, 4635, 11675, 10997, 12065, 3869, -2242, -753, -3466, -1129, -2859, -5842, -3239, 435, 3252, 1988, 1641, 3945, 9855, 6216, 4719, 6434, 7716, 8582, 5873, 6556, 3015, 3203, 2201, 4281, 10157, 1782, -320, -1181, -4960, -3557, 4059, 12073, 13950, 11841, 5491, -3686, -5086, -8997, -14755, -10930, 2481, 11804, 13399, 22633, 28827, 25154, 17986, 13767, 2846]
19114B846r404j352q09Q440L611l047l630n32P010M710N702M057j886k113r512
19099D091o606q80k574M766L277n952m17P046R02P817J1617O79p521p27j742m019
19083I757j767j050M588o985q872K209N967K940O395J496k661q045J997N314L952
19068A5235o364K955J2600L124m906J4l480j1680o707K78k395J494K546L123R002
19053A4839L265R88k872l036n142m862o236O393P927K572n165n408m352k715J999
19038a805K181j414Q45N73J187K636k768R251L792K448J958o812q204j323m062
19023a517p67k816L500M419K867l593m853J00J784L874J150l24k553n48Q59K719
19007D301O840n847k385K449Q192L403p305j0212k133J165k832K098O907N569
$$ y = [2846, -6558, -7910, -8719, -279, 3332, 285, -3345, -3877, 3133, 7843, 13545, 17602, 15716, 13603, 4091, -2515, -3395, -5969, -1203, 2074, -3878, -4295, 2751, 3653, 11470, 23087, 23766, 16245, 15518, 13776, 9757, 7990, 6940, 11528, 4543, -4329, -2120, 3847, 6787, 13182, 14678, 12017, 3972, 5969, 11283, 15235, 8871, 11826, 24426, 27550, 22644, 22658, 19178, 7498, 791, 1069, -1326, 168, 2714, 5837, 14839, 18104, 19092, 16220, 13184, 8042, 3180, -3056, 3337, 11264, 13836, 8671, 3263, -1089, -3804, -1805, 376, -1038, -193, 380, 1567, 4203, 1435, 10686, 14478, 16926, 18884, 12072, 3868, 2545, -1517, -2284, -5100, -1600, 2819, 5686, 2093, -2760, -2660, -876, 2998, 4148, 3824, 1271, 723, 1582, 4301, 11141, 5294, 2909, 5358, 13550, 16953, 9648, -564, -2697, -1532, -4364, -2266, 4641, 10210]
18993A0210K80j334L0L899j493L040M184P310j090o475m124K762n300R75K145
18978A5019M679j616n549L998N938J107o615m734K329l078j359K63m005M28N513
18963A2318q31k135n714l812L496R73o4m601m99P322Q724O087J020L664Q100L238
18947C7286m054l732j685r577o623o634n157O844J892O478J0933J1136O823N91
18933D4521p371o61n849j1103o351K984N503K092M460M403p419k058j147j0047
18919A1957K634M553L948J829n971l886J564K463p191J386k270n028m240n13J012
18904B247L608j152N46K235N80m353O80K896L598J61k315M947R914q94q842r600
18888D256N26O081K75K84K322M585j621l155j61m046m008r88N34L60M205o82j311
$$ y = [10210, 10490, 9156, 9186, 13085, 11592, 14632, 18816, 26126, 25036, 18561, 14437, 17199, 11899, 12874, 15019, 19698, 18082, 12533, 16531, 22469, 23576, 16961, 12227, 14556, 11478, 10119, 10382, 6377, 6805, 12318, 11487, 9352, 3638, -174, 3322, 4295, 4231, -370, -869, 6453, 15177, 21264, 22284, 25948, 34048, 37286, 33232, 29500, 27815, 18238, 11615, 4981, -176, 6668, 8560, 15038, 25971, 37107, 43930, 44521, 37150, 36489, 30640, 19537, 13186, 16170, 21673, 23765, 28225, 32628, 25209, 23151, 22004, 11957, 14591, 19144, 23092, 24921, 18950, 15064, 16628, 19091, 11900, 13286, 11016, 5988, 1748, 1235, 2247, 5855, 4703, 5249, 7484, 8064, 3711, 4391, 7287, 10885, 11046, 8731, 13678, 23592, 22698, 13856, 4256, 4782, 10863, 11138, 11422, 13744, 18329, 16708, 13553, 13392, 9346, 5338, 4350, 4884, 5244, 9449, 8767, 7456]
18871G456l233k268L665L122M574O119l096k953N263O764p229j1412L914Q914
18857A9600k453K990M232o751m479K17L022l56J233M461q98k080q926q205j740
18842a33P331J383j585M954l036j00N06J073J061K993L456K413j711M058m298
18827A8365o135P86l492L71N89N56M164J949j739j305n005k570j57J006O90q06
18811G267Q562J853o909K165l612K753N637N767K195p536r179m598k416K428p372
18796b995j086j680j795R084Q790M163p9n095j486j6k424K114J603M574k128o580
18780D964J929J968k175q26L010K555K976K375j859R86M17K290J4025J9956K484
18765E5075j1667m417k032j249m860j0690l04j389l86j3270m065P98P095k543
$$ y = [7456, 4223, 1955, 5620, 8742, 13316, 19435, 16339, 13386, 18649, 25413, 18184, 6772, 10686, 19600, 17147, 20137, 24369, 17618, 13139, 13356, 16378, 16022, 17255, 21716, 20818, 18738, 9812, 1607, -133, 7198, 8581, 6996, 11950, 8914, 8814, 9320, 10393, 11454, 14447, 17903, 20316, 18605, 22663, 18365, 12230, 13016, 9524, 9895, 10484, 11040, 15204, 17153, 15414, 14109, 9104, 6534, 6377, 7383, 8073, 7267, 15829, 17682, 10773, 12938, 9326, 12079, 17716, 23483, 25678, 18142, 8963, 4365, 1949, 4377, -2995, -4081, -5761, -7556, 1528, 10318, 14481, 14402, 9307, 7821, 7805, 5381, 7495, 9098, 13672, 11544, 4964, 6893, 8861, 6686, 5860, 8870, 11425, 14401, 16776, 14917, 15903, 16320, 18610, 32635, 52591, 55075, 43408, 38991, 36959, 35710, 30850, 20160, 19856, 18467, 18081, 4811, 746, 1544, 8639, 6096]
18751F096K825R07k983j743M572n245k288l493m223K595J796k592Q89Q569J859
18736G541j079k082k534N029L969k937m312K360O3l779N174L075j125N98Q23K201
18720A2985k672k529n86J187J66J653m042L16o142M58l339J0008J0276J812k139
18705A7412r054j404n37j366k197N978M084k300K722J932j302p167L98m11o544
18690B44n994n45Q463K857M401Q045N079k12J278j553m27j590N26J006k492j354
18674A7732n683j40J457M465k693n853M349M664o96l134q259J154k705n306Q87
18659B39L946j776O20J1783O58o180o345L191M368K535k344L132M884L397O887
18644B8995k023o158o736L033P38L940l045j1496n346L747K662j249m553O233
$$ y = [6096, 8921, 9828, 6845, 5102, 9674, 4429, 2141, -1352, -5575, -2980, -1184, -3776, -2887, 5682, 7541, 6462, 4380, 1846, 6875, 10844, 7907, 3595, 5955, 6018, 2239, 7413, 10488, 9363, 9961, 10784, 12985, 10313, 7784, 7198, 8385, 8551, 10204, 6162, 6478, 336, 794, -2545, 7463, 17739, 19551, 17412, 8358, 6954, 6417, 5051, 2854, 8832, 12916, 10616, 13338, 15270, 13968, 6801, 7199, 6788, 244, -5750, -6295, 2168, 5025, 9426, 17471, 22550, 22338, 23616, 22063, 21636, 20046, 20572, 21578, 19086, 17732, 12049, 11909, 13366, 17831, 15138, 9285, 13634, 18298, 17602, 14468, 6209, 7363, 4658, -648, 239, 4185, 2409, 3029, 14812, 15470, 9290, 2945, 6136, 10504, 13039, 10695, 13827, 18711, 22108, 28995, 26972, 20814, 14078, 17111, 17849, 21789, 18744, 7248, 1902, 5649, 8311, 7062, 2509, 8742]
18630H742P449j602m70l292K298l733L012M180m040j331O958o023o810L347M547
18615A3232k691N170M719Q117k926p346q571O725k05K309O263j421m380M610k884
18600B0721M27N731L732n953j3394K022P165J090j061l828k117m715m422o8k288
18585C042n07M753J299L8J354O84J953J406l116m64O774K23m191n423P047j147
18569A3725l921J044j637q38J023L874n042K162K686n538O43N610J428L058J933
18554B0210R75m487o108o83m389k635K152M286Ko455O524J781O242l652p098R32
18538G597j298p185M481N212L893Km169O13n26m89l411m6k994o826M383M976N707
18521I920K310N234P989Q202K18J952J724j078j4305q973n64J926N349M738L886
$$ y = [8742, 16191, 14589, 14119, 10827, 13125, 9392, 12404, 16584, 12544, 11213, 18171, 12148, 5338, 8685, 13232, 10541, 15711, 20430, 28547, 25621, 18275, 9704, 16429, 16224, 18533, 24796, 23375, 18995, 23605, 20721, 21148, 26879, 30611, 24658, 11264, 13286, 20451, 21541, 20480, 16652, 14535, 9820, 5398, 5330, 3042, 2535, 7288, 8587, 8625, 9979, 10663, 12616, 14022, 10906, 10442, 17216, 17439, 13248, 7825, 14872, 13725, 9804, 10848, 9211, 8373, 9396, 13270, 8228, 10390, 13076, 7538, 8181, 13791, 15219, 18277, 20210, 21185, 16698, 10590, 9907, 5518, 2883, 5035, 9321, 9323, 2868, 9392, 11173, 17415, 13763, 6665, 7597, 6299, -886, 3595, 8807, 12700, 12702, 8533, 9146, 8620, 8131, 4720, 4674, 1680, -5146, -763, 4213, 9920, 12230, 17464, 25453, 33655, 33873, 35825, 37549, 36471, 22166, 13193, 12629, 14555, 19904, 24642, 28528]
18506B8528M162O054j624n511K500P98q472j838l100q190m361J145N847K218l047
18491A5109m93O157L294n626M481J0462n074j3438p957n45K076J068M039M06n082
18476H877Q093O387k115M37j419o913p712N683Q103K547k235Q305K368o697p978
18461A5731L814N752L702l761p045l676j106j361L08O597J022K973l734l259K871
18446A8828l040l297l238N639N169N161j891j180k673m343M103J733m692J690
18432A7969p03M755j072o228L122K604L565p224k891M201L94l918R36q13L026
18417A7723N579M912J608r391j328L120P203N010q71r512l837k12p058j380j558
18402A0008O626N196m097l117L511K757m034J137K502l578k994m292J244L060
$$ y = [28528, 32690, 38744, 37120, 31609, 34109, 34907, 26435, 24597, 21497, 13307, 8946, 10091, 15938, 18156, 15109, 14616, 20773, 24067, 18441, 22922, 33384, 28310, 14872, 6915, 6370, 8446, 9514, 13553, 13959, 8877, 16970, 23357, 21242, 21679, 20260, 13347, 5635, 11318, 19421, 21968, 19733, 28038, 30406, 23709, 15731, 19545, 25297, 28999, 25238, 18193, 14517, 13411, 12050, 12358, 18955, 19977, 22950, 19216, 15957, 18828, 15788, 12491, 9253, 14892, 20061, 25222, 23331, 22151, 19478, 15135, 19238, 20971, 16279, 17969, 17266, 22021, 20949, 14721, 17843, 20447, 24012, 16788, 13897, 18098, 18492, 14574, 15510, 14697, 17723, 23302, 28214, 29822, 20431, 19103, 22223, 29426, 34436, 33565, 24053, 20216, 20004, 12946, 11566, 10008, 16634, 21830, 17733, 14616, 18127, 20884, 16850, 17987, 20489, 16911, 13917, 9625, 10869, 13929]
18388A3929O354O256J975l516J477K529m517l937j540J181P422n347n090L091
18374B0267M937l595p934m721J097N156M985n61k602K2k706K600J0380j100L633
18359B9858K455O949O999o217o748k813L409l772o801J464k133m23k230J55M099
18344B4251N125N06K754N811o75N70J651p852n244n98k622n100J888J975n316
18329A7124J321N395m65L6o55l158Q83l89l992j680j319R654O586L453J430p348
18313B6876K571L190l286J151L547j81j420J943l260r746R18J987K636P66o97
18298B6995M114Q48r364m153L972o682m896M772O279o367L259M309L44J608o149
18283A8889P77L095O43l986K334K455J590K671Q655k607m832k187J186k184l361
$$ y = [13929, 20283, 26539, 28514, 24998, 26475, 29004, 24487, 20550, 19010, 20191, 27613, 22266, 17176, 20267, 25204, 21609, 13675, 8954, 10051, 15207, 20192, 19631, 17029, 17051, 14345, 16945, 27325, 26225, 29858, 32313, 39262, 46261, 40044, 33296, 30483, 33892, 30120, 23319, 24783, 22650, 22227, 19997, 20152, 24251, 29376, 29882, 32636, 38447, 37772, 38342, 39993, 32141, 26897, 26299, 23677, 18577, 20465, 22440, 17124, 18445, 23840, 23375, 23411, 22756, 19598, 20481, 20092, 16100, 14420, 13101, 22755, 29341, 32794, 34224, 26876, 29447, 32637, 29351, 30502, 34049, 33868, 32448, 34391, 31131, 21385, 22303, 24290, 26926, 27692, 26995, 31109, 31957, 22593, 18440, 22412, 15730, 10834, 15606, 21885, 15518, 18777, 23086, 23430, 25038, 18889, 19666, 22761, 23404, 19418, 21752, 24207, 25797, 28468, 37123, 34516, 29684, 27497, 28683, 26499, 23138]
18268B3138N083O797J490n533j731l479O405P884n65j603l580K28o319o309j826
18253B0080O968N300l135l763k27P1k338N322O908M617q9j995J333l407q897K425
18237B9173M402l804q27J0438O668k022l254l622o434K7M046K436N495L56o068
18222C7010j0670q25j601M99m208J216J0148N516j229L800K483k802o330n096
18208B7911J140J263O133k137r11L642m89L434l939k081n813n709k963N792Q271
18193C3544K219j201j623K558L135o678j75J749J1090n725l618J705l062p978
18179B5940n98K60N407j612K167J695L611K724J631J0440J97J72j636j820J017
18164D9595j481J065p922K967Q625L646m463m927M712J736m854j03O763J312k571
$$ y = [23138, 28221, 35018, 36508, 30975, 29244, 25765, 32170, 40054, 39489, 37886, 34306, 34534, 28215, 21906, 20080, 27048, 32348, 29213, 25450, 25223, 25294, 22956, 28278, 35186, 39803, 39714, 37719, 39052, 35645, 26748, 29173, 33575, 29771, 28944, 39382, 46050, 44028, 40774, 37152, 30718, 30745, 34791, 37227, 42722, 43078, 37010, 26340, 25515, 23914, 24413, 20205, 21421, 31569, 37085, 35856, 39656, 42139, 39337, 33007, 27911, 29051, 30314, 36447, 34310, 33399, 37041, 36552, 39986, 36047, 33966, 28153, 22444, 19481, 25273, 33544, 35763, 34562, 32939, 35497, 38632, 31954, 31779, 33528, 44618, 38893, 35275, 36980, 33918, 25940, 25342, 25602, 31009, 29397, 31564, 33259, 36870, 39594, 41225, 51665, 51862, 52034, 50398, 48578, 49595, 48114, 49179, 41257, 44224, 52849, 56495, 52032, 47105, 51817, 53553, 48699, 48596, 55359, 56671, 54100]
18149E4100p367O634J0468K148n02M510j545o173j873O646L866O001p37k455L243
18134G6964Q866R350Q304P291N956P262J4813P075R508J9975K0569J9735K6341
18121B42009K8122M3961N8941P0964Q9703J13077J56499K33493L72496O51084
18111B060349J211792K291320L581654K481070j137135k782581k671068j903740
18103C131661j091050o24011l75433k30389j64612j11448p4894m8298m7282l9315
18093C24929m2509l8115k3043j9038j4114q748r295r728n631p743j2078o629k95
18080A27963K747l344j2183q740n380j580q684l717m696r509j0569l699q752L108
18066E2965O745o321p477m558M12N112N065o048j441K485R1L72J851m831K402
$$ y = [54100, 46733, 53367, 63835, 65983, 65481, 69991, 68446, 62273, 60400, 67046, 70912, 76913, 76176, 73721, 76964, 85830, 95180, 103484, 110775, 116731, 123993, 138806, 145881, 155389, 175364, 195933, 215668, 242009, 270131, 314092, 373033, 443997, 533700, 646777, 803276, 1036769, 1409265, 2060349, 3272141, 5563461, 9145115, 11626185, 10489050, 7706469, 5035401, 3131661, 2040611, 1416600, 1041167, 810778, 646166, 534718, 459824, 411526, 364244, 324929, 282420, 244305, 221262, 202224, 188110, 179362, 170067, 160339, 154708, 146965, 134887, 128258, 127963, 130710, 127366, 115183, 106443, 101063, 99483, 90799, 87082, 82386, 72877, 62308, 58609, 49857, 52965, 59710, 53389, 45912, 41354, 41766, 46878, 51943, 45895, 44454, 46939, 47030, 47402, 49253, 44422, 46824]
18051D6824k27K475l420m078K877N675L309j508j395p699m156o477N435P056M04
18036D5095k753j732l663J392l183P019p0o111j220N443K511j679j853J610O757
18021D7563m121J929j999r562P99o33L415l63q761L100Q699J83O284L206J606
18006E1345o99p379N866l9n864l296k970J0429Q266P84n037n481o361j40O758
17991D6182k095j783m732L405k032J029M055R892K338o87J171n07m373J657J750
17976E5270l422j389l934P146J747m153M946j13p623j716N5q550k772j438M819
17961C8873N405N042J333m884K308R331m558k571l111j91l948M71L511M260l417
17946D7854J653l405m75j174j242O722N865J830M539l601M951R753O136Q04j088
$$ y = [46824, 46597, 49072, 45652, 41574, 44451, 50126, 53435, 51927, 50532, 42833, 38677, 32200, 37635, 44691, 45095, 42342, 40610, 36947, 38339, 35156, 42175, 42105, 35994, 34774, 40217, 42728, 41049, 39196, 40806, 47563, 43442, 45371, 43372, 33810, 34609, 33976, 37391, 37028, 28267, 31367, 40066, 40249, 46533, 49739, 51345, 50646, 43267, 49133, 49094, 43230, 39934, 36964, 47393, 55659, 56443, 51406, 45925, 39564, 39424, 46182, 44087, 42304, 37572, 40977, 38945, 39974, 44029, 53921, 56259, 55572, 56743, 56236, 51863, 53520, 55270, 51848, 50459, 46525, 53671, 55418, 51265, 56211, 56098, 48475, 46759, 46814, 38264, 35492, 34054, 38873, 44278, 49320, 50653, 45769, 48077, 57408, 52850, 50279, 47168, 46977, 43029, 43500, 47011, 51271, 47854, 49507, 46102, 45627, 44453, 43211, 49933, 55798, 57628, 62167, 58566, 63517, 73270, 79406, 80210, 79122]
17931G9122O743K415J701Q639Q533O707J2061K7277L9300O8555Q3900P3723M4258
17918D62934R555l106j6127l6520o4231p9986p3813m3340k2196k1312j7042r719
17906H5097n324k177k895o971n265J449j941M1Q267r517n674L378N972O711M028
17891G5179k485j4191j128Q836M959o570k613N529J0409L559O63K833L444P717
17877I6141J1654K2481L0968M3151Q1424Q7122P4820M7909K4468J4225p079n1893
17865D75391q8245q9929p1265m4879l6365j5912j1724j2386o584r172l926m625
17853H0379m850N76J829p79m282n198P702J444L783O204M785j211n489q794J94
17838G6293j026m119n757r72O972O580N937L413Q630L316o540j250m46K275J983
$$ y = [79122, 85865, 88280, 89981, 98620, 107153, 113860, 125921, 153198, 192498, 261053, 344953, 418676, 462934, 472489, 469383, 453256, 416736, 352505, 272519, 198706, 155366, 133170, 111858, 94816, 85097, 79773, 77596, 74701, 67730, 62465, 63914, 61973, 62014, 70281, 60764, 55090, 58468, 64440, 71151, 75179, 72694, 58503, 57375, 66211, 71170, 64600, 61987, 67516, 77925, 81484, 82147, 84980, 88424, 96141, 107795, 130276, 161244, 204395, 285819, 372941, 447761, 495670, 520138, 534363, 527284, 475391, 387146, 297217, 225952, 181073, 144708, 128796, 117072, 104686, 98102, 88930, 85004, 80379, 75529, 76105, 77934, 77155, 72873, 67675, 75377, 76821, 80604, 86808, 91593, 90382, 84893, 76099, 76293, 75267, 71148, 65391, 64419, 71391, 77971, 83908, 87321, 95951, 99267, 92727, 91477, 91031, 93306, 95289]
17823I5289L380L569J5510J7036J1861K1837L5505M9912O0659P2743P8129N2841
17811E18271K1837J1403k7304m1370m0118k7383j1728J4982M2128N1071L0605
17800E42394J7438K09m3547o9444p0785o7286n0556l6394k5436k591J1664K2767
17788B28433K1536J6658J9235J3513r226j4511j4995j8678j3790r520J0076K1516
17776B50247K2275J3296J2735l634j9760k7676k2004k5068l4399k5780j3775j0250
17764A16207j0102J175O630j935m060k938J603j380o049N62M005Q92J838j243
17750A05205K402M658n42N182p598j038M875J151R895K2841L6126M1418L1108
17737B55683K5858L0782K7544L361j4729j9405j2749j2072j2219k659J4355K4212
$$ y = [95289, 98669, 102238, 117748, 134784, 146645, 168482, 203987, 253899, 314558, 387301, 465430, 518271, 540108, 551511, 524207, 482837, 442719, 415336, 403608, 418590, 460718, 511789, 542394, 559832, 560041, 516494, 447050, 376265, 308979, 258423, 222029, 196593, 194002, 205666, 228433, 249969, 266627, 285862, 299375, 290149, 275638, 260643, 241965, 228175, 218655, 228731, 250247, 272522, 285818, 298553, 294919, 275159, 247483, 225479, 200411, 166012, 140232, 126457, 116207, 106105, 107280, 113910, 111975, 107915, 104977, 106580, 105200, 99151, 99713, 103718, 104610, 106448, 105205, 107607, 112265, 111723, 116905, 109307, 108269, 113144, 114295, 124190, 147031, 183157, 224575, 255683, 281541, 312323, 339867, 343228, 328499, 309094, 296345, 284273, 272054, 269395, 283750, 307962]
17725C07962K2273J9509R052j8339k7838l5486l4120l7734l1195k1376k0355j6582
17713A15771n271q503j662M282j20l316J048j619n185K81j253r34Q924J3097K646
17698A18186j0213L034L885J926j869q329n541n40j029k674o354R370J1864m242
17684A07474n662J354L503R142L92Q15J931j89O707L638j799M023L421j0303m682
17669A19765M366l44n313j268n146j002j187J801R019Q505P275Q043O971L752
17655A55237j878M056l71j446m014K699N75n225j0701k973L15k136m741N770J467
17640A36634L394O82R492O149K4399L3367K9800J7668j056j1103k2314j8660j1495
17627A96957k039J6028K5635L9828O4977N5743L1819N542l3875n3614m3874l8143
$$ y = [307962, 330235, 349744, 358796, 340457, 312619, 277133, 243013, 205279, 174084, 152708, 132353, 115771, 110500, 101997, 100335, 104617, 104497, 101181, 102229, 100610, 95425, 95706, 94453, 93519, 102443, 115540, 118186, 107973, 111007, 114892, 116818, 114949, 106620, 101079, 100539, 99510, 96836, 90482, 99852, 111716, 107474, 101812, 103166, 106669, 115811, 116203, 117018, 118949, 118760, 125467, 129105, 127306, 131329, 134750, 124447, 119765, 124131, 123787, 118474, 117206, 112060, 111058, 109871, 111672, 120691, 129196, 136471, 144514, 151485, 155237, 153359, 157415, 157044, 155598, 151584, 154283, 154858, 149633, 138932, 135959, 136274, 134138, 129397, 135167, 136634, 140028, 140710, 150202, 156351, 180750, 214117, 243917, 261585, 260529, 249426, 227112, 208452, 196957, 194918, 210946, 236581, 276409, 341386, 397129, 428948, 434490, 400615, 347001, 303127, 264984]
17615B64984k7090j1058j196l904k897M442Q074J5139O479R753K758Q047J2092
17602B85623J7085L3462N7111R6549J07533P1195J7258o7587r8370q6250n1209
17591C82400j3168K5165N6247J15108J79416J67020Q9700P186r1022p2192k089
17580H43771K0661J03k7257q9943j35330j20746r9785n9593k9008j7625L968K0412
17568C09628K3258J5622P807l006k5390l2942k2668j1488j3604p755o382n076
17556B28004l469j580L405J2902J4827J1162L65p104q219L124J2106K657j439
17543B66741l297j462p645n324p955l097l23l49L452J578l123L12M301n09P312
17528B50612J2937P283Q295P451R846J2880k173P078J2462K4785K8969M0023M9687
$$ y = [264984, 237894, 226836, 225640, 221736, 218839, 223281, 231355, 246494, 252973, 262726, 265484, 273531, 285623, 302708, 336170, 393281, 489830, 597363, 668558, 685816, 618229, 519859, 433609, 382400, 369232, 394397, 450644, 565752, 745168, 912188, 1001888, 1009074, 918052, 845860, 843771, 864432, 864535, 837278, 747335, 612005, 491259, 391474, 331881, 302873, 285248, 289216, 309628, 332886, 348508, 356315, 353309, 327919, 294977, 272309, 260821, 247217, 239462, 233080, 228004, 224535, 222955, 226360, 239262, 254089, 265251, 265616, 258512, 250293, 253417, 265523, 268180, 266741, 263444, 261982, 254337, 249013, 241058, 237961, 237638, 237289, 240741, 242319, 239196, 239508, 243809, 243300, 250612, 263549, 270832, 279127, 286578, 296424, 309304, 307131, 314209, 326671, 351456, 380425, 420448, 470135]
17515D70135N3259N7080N5447K0100j8449m4397n7580m3650j0793R706L5696M3643
17503E70197K0991O644m522k5767m2080m7629m0849l2548k3373j7170j5274n300
17491C43320J006Q191J0417J0658P887J9772J7657J917o669q74q435j1568N067
17478C98346J2365R887J5935K3230J0752P845N781l057j1266j78L172J895J702
17465D76409m428O485O162O054J2898R306J4238L8744P5162J20812J93443K14606
17453A169891R5085q1643j66236j51241j09525p0395l7988k3690J356J7114L8196
17442F80924N1254M5947M0057M8859O3697P1864R3553J05238P8547Q5278J19841
17431A485059J47854J40156Q9102N0822M5905L4980l5k798J876J657J6560K5020
$$ y = [470135, 523394, 580474, 635921, 656021, 637572, 593175, 535595, 491945, 481152, 490858, 526554, 570197, 591188, 597832, 593310, 567543, 525463, 477834, 436985, 404437, 381064, 363894, 348620, 343320, 344326, 352517, 362934, 373592, 381479, 401251, 418908, 420825, 414156, 413282, 404847, 393279, 398346, 410711, 420598, 436533, 459763, 470515, 478360, 484141, 481084, 469818, 469640, 472812, 474707, 476409, 471981, 478466, 484628, 490682, 503580, 512886, 527124, 565868, 641030, 761842, 955285, 1169891, 1264976, 1183333, 1017097, 865856, 756331, 685936, 647948, 624258, 625614, 642728, 680924, 732178, 778125, 818182, 867041, 930738, 1002602, 1096155, 1201393, 1279940, 1365218, 1485059, 1632913, 1773069, 1862171, 1912993, 1958898, 1993878, 1993843, 1991045, 1992921, 1994578, 2011138, 2036158]
17419B036158M7937J17749J96958K73964L62482M74613O28633Q19839J088567
17410F046900J576876K441529M049450O805533J0156484J1293266P842613L238309
17402E3450960J613742L9917m630835r411597j0681697q980526o254424l972218
17394A1173322k518311j663068j139947q18624o16841m66800l52859k58507j68507
17385C169858q5455j1294M9694J22534J88989K08376J72738J55050J20284N3084
17375D143858r594k6167j6444k733K6546Q2903J79939L34141M87818O52989Q79679
17364F732935J187219J570455K065771K872655M356173P023284J1703716J8342049
17356E5854257K2962062J9406208J0495347N902580L645642m968216j7027616
$$ y = [2036158, 2084095, 2201844, 2398802, 2672766, 3035248, 3509861, 4138494, 4958333, 6046900, 7623776, 10065305, 14114755, 20920288, 31076772, 42370038, 50212651, 53450960, 55064702, 55104619, 50473784, 41062187, 30380490, 21399964, 15145540, 11173322, 8655011, 6991943, 5851996, 5033372, 4416531, 3949731, 3596872, 3338365, 3169858, 3084403, 3073109, 3122803, 3245337, 3434326, 3642702, 3815440, 3970490, 4090774, 4143858, 4134264, 4108097, 4091653, 4088920, 4115466, 4198369, 4378308, 4712449, 5200267, 5853256, 6732935, 7920154, 9490609, 11556380, 14429035, 18785208, 25808492, 37512208, 55854257, 78816319, 98222527, 108717874, 114620454, 118266096, 113297880, 96270264]
17349I6270264k2916283k1313503j5859553j0416344o549016m171755k758050
17342A2285760j979714j547623j211832r23960o85059m94477l21232j80748q5787
17333D855328m0728M8666J42717J65364J92977L70594O13671N09222j34347o49657
17323F073807p06848n38958k86798j22025k8754M7646Q6640J51578K47936L48117
17313E272341M65470N87296O88843Q58246J104083J493480K182669L349974N010549
17304B1012951O392950P442091R291269R548916P080047N578605M399362M9754
17296G0795945k843935j174380J762395N428562Q151490J1734446J1817926M627077
17288A10299526m14040l306137r366421j4188168j4140757j3356776j1533796
$$ y = [96270264, 73353981, 52040478, 36180925, 25764581, 19215565, 15043810, 12285760, 10306046, 8758423, 7546591, 6622631, 5937572, 5443095, 5121863, 4941115, 4855328, 4814600, 4863266, 5005983, 5171347, 5364324, 5734918, 6348589, 6857811, 6723464, 6073807, 5366959, 4828001, 4541203, 4419178, 4390424, 4438070, 4524710, 4676288, 4924224, 5272341, 5737811, 6325107, 7013950, 7872196, 8976279, 10469759, 12652428, 16002402, 21012951, 27405901, 34847992, 44139261, 53688177, 60768224, 66346829, 70746191, 70795945, 67952010, 66777630, 68540025, 73968587, 82120077, 93854523, 105672449, 110299526, 109885486, 106579349, 97212928, 83024760, 68884003, 55527227, 43993431]
17281D3993431q148617m568697r59776K764431O948121J0321059R724094Q337071
17273F8411117J0463620P718830k454631p483044p427812q774675r460000o978028
17265D4015377l177818o34526L65937K424202K928252j165951m393330m453757
17257C5908386n052067o005086n695579m582918l268767k176522j449481r76731
17249F701235o88667n18419l98763l24670k68809k11762j57466j23520q8249l9688
17239C881222j9551k3816j6960M160N6748J36477K58523M31238O99901J147544
17229F555486J872232L008856M376469M570351L723575M412026M662550R28384
17221C4109929k480118k567361k803524l432871k684533q44951O12934R28227
$$ y = [43993431, 35844814, 31276117, 30316341, 33080772, 40028893, 50349952, 60074046, 68411117, 78874737, 86593567, 84138936, 76655892, 69228080, 60453405, 50993405, 44015377, 40837559, 40203033, 40568970, 42993172, 45921424, 44755473, 40362143, 35908386, 30856319, 24851233, 19155654, 14572736, 11303969, 9127447, 7677966, 6701235, 6012568, 5494149, 5095386, 4770716, 4501907, 4290145, 4132679, 4009159, 3920910, 3881222, 3861671, 3837855, 3820895, 3825055, 3881803, 4018280, 4276803, 4708041, 5407942, 6555486, 8427718, 11436574, 15813043, 20383394, 24106969, 28518995, 33181545, 34109929, 31629811, 29062450, 26258926, 22826055, 20141522, 19296571, 19909505, 20837732]
17213B0837732J726590K673982P60893k128075k551355k656334l429213l620929
17205A1613291l041330k226941j459717r45892o35979m25906k98088k39246k12162
17196B128030j84206j61322j22251j01651r3817p3772n1067n8526o9238o6982
17186A145198p4902q1599p1141p2204o6212n0254l6268k1096k6108m3992l6829
17175E64593l3902m3470m6800l4207k5972j8689j6540o909n298r310j0264l451
17163C09781J389j2740j0225k114j0295j1684j1048j5991j3518j4010j3617j2615
17151A83313n103l69k927O619O617j316K583l945j621O471l327r398o272j822
17137A69503K268J092l58r97l514L05n161j0677l188J808o501P36J899M034o832
$$ y = [20837732, 22564322, 25238304, 25999197, 23871122, 21319767, 18663433, 15234220, 11613291, 8571961, 6345020, 4885303, 3939411, 3303432, 2877526, 2579438, 2340192, 2128030, 1943824, 1782502, 1660251, 1558600, 1464783, 1391011, 1339944, 1281418, 1212180, 1145198, 1070296, 988697, 917556, 845352, 779140, 728886, 692618, 671522, 645414, 601422, 564593, 530691, 487221, 440421, 406214, 380242, 361553, 345013, 338104, 332806, 323496, 313232, 309781, 311170, 298430, 288205, 286091, 275796, 264112, 253064, 237073, 223555, 209545, 195928, 183313, 178210, 177841, 174914, 181533, 188150, 186834, 189417, 185472, 183851, 190322, 186995, 177597, 171325, 169503, 171771, 172863, 172505, 171508, 167994, 168299, 163138, 152461, 149273, 151081, 144580, 145316, 147215, 151249, 144417]
17122A44417n999n198Q49m251o23K047k248L727J07J79j3097p595k229m052q283
17107I7751o633L598N121J653L51m423o753j0563r407j1267m218J299K121p722
17093E0908n092l987j645p811k911Q953N545O115j199r604n297N566O297j844
17079D3994n837m381P991P726N007L272P846J464k697N90O69l400j586k400o985
17064E1273k847l17m018m828J596l624n38O5P721l021r24j86k111r509o966k883
17048A8883Q246o10L046m187J345L589k394r613l76K506l347k943l750j269O476
17033A5602J673J804J275J933k753p024J176j442k577p72m314R77Q02K398J454
17018A0212O20L104r660r57J752L77J911P606N726k613n589J955M209M204k472
$$ y = [144417, 138418, 133220, 134069, 129818, 129195, 131242, 128994, 132721, 132828, 133007, 119910, 112315, 110086, 106034, 97751, 91118, 94716, 99837, 101490, 101841, 97418, 90665, 80102, 70695, 59428, 55210, 56509, 58630, 50908, 45816, 41829, 40184, 32373, 29462, 38415, 43960, 50075, 48876, 39272, 33975, 39541, 45838, 43994, 38157, 33776, 41767, 49493, 54500, 57772, 65618, 67082, 64385, 64975, 65644, 62244, 60658, 58258, 51273, 48426, 48109, 44091, 39263, 40859, 37235, 36697, 36762, 44483, 41462, 40538, 40352, 38241, 28732, 21766, 18883, 27129, 26519, 29565, 25378, 26723, 30312, 27918, 18305, 17929, 20435, 17088, 14145, 10395, 9126, 15602, 17275, 19079, 20354, 22287, 19534, 12510, 13686, 12244, 9667, 8895, 4581, 5558, 6360, 8758, 10212, 10832, 13936, 4276, 3319, 5071, 5448, 7359, 14965, 20691, 18078, 12489, 14444, 18653, 22857, 20385]
17003B0385l846j2594o716k224R548K653J659k136n122M861M47J338l925n917
16989a589L385N599J1818j428p759p03P311m142l090j26j683j324M710P509k08
16974A8280M657O396m031k387j068l958J866k94o575l823k313n526K784M87J583
16959F078J501p919j942P987p434n998J103N243J533k590K470P605R07q190j1192
16944a0838l685J299J0197L752L113m42k413q458k901J140L883J0537O308k872
16930H620l079J849r47Q82k592j102M502n66J204L459K351o384o299k92M167O738
16914A2511K744j579L626q77o230k970Q61l68J461j097j371q226k478L049L549
16899B605L017N039k222l158K179j919k656N995q59k962K258k2P08K800J255M003
$$ y = [20385, 16539, 3945, -2771, -4995, 4553, 7206, 8865, 6729, 1607, 6468, 6915, 8253, 4328, -1589, 1796, 7395, 19213, 17785, 10026, 9323, 16634, 12492, 9402, 9276, 7593, 6269, 10979, 18488, 18280, 22937, 29333, 25302, 22915, 21847, 17889, 19755, 19461, 12886, 9063, 6750, 1224, 4008, 4495, 6078, 7579, -340, -2282, 5705, -1729, -7727, -6624, -1381, 152, -2438, 32, 7637, 8544, 354, -10838, -14523, -13224, -3027, 725, 3838, 3396, 983, -7475, -10376, -9236, -5353, 5184, 11492, 8620, 5541, 7390, 6443, 7325, 4733, 3631, 8133, 7567, 8771, 12230, 14581, 8197, 1898, 1606, 5773, 12511, 15255, 13676, 17302, 16425, 10195, 7225, 8086, 7718, 9179, 8082, 6711, -1515, -3993, -944, 2605, 5622, 10661, 8439, 5281, 7460, 5541, 2885, 8880, 8021, 5059, 7317, 7295, 8003, 10803, 12058, 16061]
16883A6061J2473P458O770O845J6255K1888K6012N0137P5324J09345J04519P9144
16871E32231M2457j0277m9019q7378j04356r3618o6557m0606l7449k2270j3614
16860D9544n293o42m969o341P038n895k934m69K970K627n524O54O810O065j829
16845D1812j955L447N876l81j4146q235n264p10m201j148k086N816l00O457J7226
16830D2208P523J1892J9573K5632M0901O8718Q2621P9624N1671K2163p532n1778
16818C93216p5114q3221o9318m4170l1328k4669j1348l846m500r762p888Q10k736
16805B6126N3O608O345K840M002k16n325N63J1936O614l187n36J0230Q627N604
16790H0284P032J4911J5640K4567L6118N3762O2057P5017P4834N2607K8596O774
$$ y = [16061, 28534, 35992, 42762, 49607, 65862, 87750, 113762, 163899, 239223, 348568, 453087, 532231, 574688, 564411, 515392, 428014, 323658, 230040, 163483, 122877, 85428, 63158, 49544, 44251, 43609, 38640, 32299, 39337, 33442, 30508, 30039, 33009, 35636, 30112, 30766, 37576, 43641, 41812, 39857, 43304, 49180, 48799, 34653, 26418, 21154, 20444, 16243, 15095, 13009, 18825, 18525, 24982, 42208, 49731, 61623, 81196, 106828, 147729, 216447, 299068, 378692, 430363, 452526, 444994, 393216, 318102, 234881, 165563, 121393, 90065, 65396, 54048, 50202, 45702, 35940, 28052, 28862, 26126, 26179, 32787, 39132, 41972, 45974, 45758, 40433, 40996, 52932, 59546, 56359, 55823, 66053, 74680, 80284, 87316, 102227, 117867, 142434, 178552, 232314, 294371, 369388, 444222, 496829, 525425, 532199]
16778E32199l6069n4391m3596k6695k204K1840N9929Q4078O6937L9997K7485k848
16766F66662l3470o9344r1729p7908n3286m6566l5365j3427O274R246J3344K1351
16754B95782l599k3542l3042k5158k8171l5146l7112k3280j4195o772o651n184
16742E3930r594j700m670p147K291R840M835n83o827o32p511o27O935P086J078
16727D6704p440n397N020P729J1365J7665J9335K4970K5342L1596L1021K6347
16715B34257P039j2972j7337j4013j7285j1144m352O098J3259Q577K5112J7261
16703B34500r365k4691k1427k7684l2446k1567j7319j2360p927q380q17J115m416
16690D7216j1574j0394p15j117R74k375K81K710m073o277p029J447j200J593M25
$$ y = [532199, 496130, 441739, 398143, 371448, 369244, 391084, 451013, 535091, 602028, 642025, 669510, 666662, 633192, 563848, 472119, 394211, 340925, 294359, 258994, 245567, 251841, 261087, 274431, 295782, 292183, 268641, 235599, 210441, 182270, 147124, 110012, 86732, 72537, 65765, 59114, 53930, 44336, 42636, 37966, 30819, 33110, 42950, 47785, 47202, 40375, 39743, 32232, 31605, 38540, 45626, 46704, 39264, 33867, 38887, 46616, 57981, 75646, 94981, 119951, 145293, 176889, 207910, 234257, 241296, 228324, 210987, 196974, 179689, 168545, 164193, 170291, 183550, 192127, 217239, 234500, 225135, 200444, 179017, 151333, 118887, 97320, 80001, 67641, 59714, 51334, 50517, 51632, 47216, 35642, 25248, 24533, 23416, 24390, 22015, 22296, 25006, 20933, 14656, 7627, 9074, 7874, 9467, 9892]
16675I892K708L210J449k303k710k814m112k904L269K793n886j646M27k603P820
16660F590O858M13k77N832L761K59O497K583J554L164o481j0845m269j793k495
16645A1351N412N737k673L190O297k602P087K190K468K673l890L333O285M992
16631E1850Q60L147M048J0504J0699Q529J9462K5897L7502M1069N0683P7136J09253
16618D50639J84858L18830N46678P62426N38364j63334n82269o20774m86044k89752
16608F59622j77390j14858p8242n9599m8558l0609k4352j4313j2700p388q447
16597H3166j0718j3057j3118n124J664M274K831j1366j6123k836Q692R000k12
16584C7073O51m055n317K372K337m911m311j697n671L548N494l060o833r02Q715
$$ y = [9892, 12600, 15810, 17259, 14956, 12246, 9432, 5320, 2416, 5685, 8478, 2592, 946, 1373, -1230, 6590, 13448, 13861, 13584, 19416, 23177, 23436, 29933, 32516, 34070, 37234, 30753, 19908, 15639, 13846, 11351, 16763, 22500, 19827, 23017, 29314, 26712, 33799, 35989, 38457, 41130, 37240, 40573, 46858, 51850, 52710, 55857, 59905, 70409, 81108, 89637, 109099, 134996, 172498, 213567, 264250, 341386, 450639, 635497, 954327, 1501005, 2263431, 2801795, 2638461, 2056192, 1435418, 949374, 659622, 482232, 367374, 289132, 229533, 180975, 150366, 126014, 111701, 99001, 91613, 83166, 72448, 59391, 46273, 41149, 42813, 47087, 49918, 38552, 22429, 19593, 28285, 37285, 37073, 37724, 33669, 28352, 30724, 33061, 28150, 23839, 22142, 16471, 20019, 25513, 22453, 15620, 14718, 23433]
16569B3433J936L421k347k950n927r464L020M826O50l06P59J554L044L057R52
16554B5658k634o777p805n249l899m125J82L884M308N69m50o59J354O45N105j804
16538H303k282n05Q826Q814j260M879J576O758J8764J2439J670q997j0505j0149
16524C8331r376r263j2765j0743M19M575Q722L816o247j927j217n377o942p59
16510h753K452M89O417R611L867k360o775k586P00O593O372k467k556L593n961
16495H636l946O176Q508N042P954J2724J939j964M67q022j1233k632n178k638
16481A5833k456J483m889L068M872J865Q54M323K364M063R265M779M32j105m474
16466D0277J759J473n656N027l395M81O908P965N304J72J916K33j103p956P12
$$ y = [23433, 25369, 28790, 26443, 23493, 17566, 8102, 11122, 15948, 16598, 16292, 17051, 18605, 21649, 24706, 25658, 23024, 16247, 8442, 3193, -706, -4831, -4649, -765, 3543, 4112, 3662, 3003, 4357, 5002, 10107, 8303, 6021, 5516, 14342, 23156, 21896, 26775, 28351, 35109, 53873, 66312, 67982, 58985, 48480, 38331, 28955, 19692, 6927, -3816, -3397, 1178, 9900, 13716, 7469, 5542, 4325, -1052, -7994, -8753, -6301, -5812, 605, 10216, 14083, 11723, 4948, 2362, 3062, 9655, 16027, 13560, 11004, 14597, 8636, 4690, 10866, 19374, 24416, 32370, 45094, 47033, 45069, 45536, 37514, 26281, 23649, 18471, 15833, 13377, 14860, 9971, 13039, 17911, 19776, 20630, 24953, 27317, 31380, 40645, 45424, 45856, 44751, 40277, 42036, 43509, 37853, 42880, 39485, 39966, 46874, 54839, 60143, 60315, 62231, 62464, 61361, 53405, 54117]
16451E4117k357j3325m217P282J5355N931j1889n306J21J178P050j983J08K761
16437E4826K521k521n999Q254J2814j380J422l264j595L218k465J069j780j004
16423F4116o49J149J154k081P048K139l378n825m48m474M079M277m682j0810n325
16408D6290r92j468O276J2520L219R70j730l557j645p37K744n036j264R889r64
16393F4515o74O10j15l600q120o507j627j03O29O563P900L304N841m27n832l510
16377E8847R19m935r118J047K284o84m279K703L956L528O572o450q123K82Q237
16362E4786l156n309J680R695m876j3932k911k787j0787n400O024O197L195N292
16348C7711P467M564J4481R670l83p2Q148j582n246O554J1209J1654j671k713
$$ y = [54117, 51760, 38435, 34218, 41500, 56855, 62786, 50897, 45591, 45712, 46890, 53940, 51957, 52065, 54826, 57347, 54826, 48827, 57081, 69895, 68515, 69937, 66673, 65078, 68296, 65831, 66900, 65120, 64116, 63467, 64616, 65770, 63689, 70737, 72876, 69498, 63673, 63225, 58751, 62830, 67107, 62425, 51615, 46290, 45298, 43830, 50106, 62626, 65845, 66815, 65085, 61528, 59883, 59146, 61890, 56854, 55590, 65479, 64515, 63841, 64451, 64336, 60736, 52616, 46109, 44482, 44379, 45008, 51571, 59471, 62775, 68616, 68189, 62357, 58847, 59766, 54831, 45713, 46760, 49044, 48360, 44081, 46784, 50740, 54268, 60840, 54390, 46267, 46549, 54786, 51630, 46321, 48001, 57696, 52820, 38888, 35977, 33190, 22403, 17003, 23027, 29224, 32419, 37711, 45178, 49742, 64223, 73893, 73510, 73438, 81586, 80004, 74758, 81312, 92521, 104175, 102504, 99791]
16334I9791m563m653O585k055O011J2458K1553O452j4811J1764L4540O6164N1763
16321B90999P580m267k3710m6272n0321l5728Q998K5796J2087k7683l8722j3396
16309A05361K063k111l030J713M445p96l132M191R829N347o148j0099o288l040
16295I8305R26o826n422p995k796p320r607m398o399N465L770N776J5928J7822
16281I7229K6042K6907J7215J6740K5199J9788K7585K2167j130k0617l7324l9378
16269A80423l3952k4875m954J1567J5038J2475R87J1129Q245j3716l9444j9751
16257A03172j3072K693L435p763j1278l458J1607K7657L4925L4510K3310J4481
16245B20219J8549R048j1628k2201k7378j5577p912j3633j9734m472J693j769
$$ y = [99791, 95228, 90575, 97160, 95105, 101116, 113574, 135127, 141579, 126768, 138532, 173072, 239236, 290999, 298579, 294312, 270602, 224330, 174009, 138281, 147279, 173075, 185162, 157479, 118757, 105361, 107424, 105313, 102283, 103996, 108441, 107645, 104513, 108704, 118533, 123880, 117732, 107633, 101345, 98305, 99231, 92405, 86983, 78988, 76192, 68872, 59265, 54867, 48468, 53933, 57703, 63479, 79407, 97229, 123271, 150178, 167393, 184133, 209332, 229120, 256705, 278872, 277742, 257125, 219801, 180423, 146471, 121596, 116642, 128209, 143247, 155722, 156709, 167838, 176083, 162367, 122923, 103172, 90100, 92793, 96228, 88465, 77187, 73729, 85336, 112993, 147918, 182428, 205738, 220219, 238768, 247816, 236188, 213987, 186609, 171032, 163120, 149487, 129753, 125281, 126974, 125205]
16233A25205P79n470n06Q199J0360k759l814p909l9426l7301o118J0037L8362
16220H9639L5274J264j0619j4099l857R282L1228L6867N447k801j01N904P031
16207A90459K818l462L013j0456k3855l2417l0022l3630l5597j6646J8486K8509
16195E7200P7511O2699M4549N1136L5651K2401J7465J3907J543l579m580k0591
16183C55312j7498n039k927L987J45J353R294J0333L690J311O480J6393J9714
16170D02548J4933j172l537l301O029O238K849j1093j1084j515J584J0644J8299
16157D31422K4005K2936R169K1460M9043O7905P2976N3327L3930N1476J03639
16146I41288J72653K98942N16228O67509M51740p4378m80900n58260m51861k92100
$$ y = [125205, 125984, 120514, 120008, 128207, 138567, 135808, 131994, 124085, 84659, 47358, 41240, 51277, 89639, 124913, 126177, 115558, 101459, 97602, 106884, 138112, 174979, 180426, 177625, 177524, 183428, 190459, 193277, 189815, 192828, 182372, 158517, 126100, 96078, 62448, 26851, 10205, 28691, 57200, 134711, 197410, 241959, 293095, 328746, 351147, 368612, 382519, 384062, 380483, 375903, 355312, 337814, 332775, 329848, 333835, 333980, 335333, 344627, 354960, 358650, 359961, 366441, 382834, 402548, 417481, 416309, 412772, 409471, 415500, 421738, 424587, 413494, 402410, 400895, 402479, 413123, 431422, 455427, 478363, 487532, 508992, 558035, 625940, 698916, 752243, 786173, 837649, 941288, 1113941, 1412883, 1929111, 2596620, 3048360, 2973982, 2493082, 1934822, 1482961, 1190861]
16136A190861j64329p7328k3431J5632m2J232L749K522k260n354k448k019R377
16123I46162J2735K2269L6069O3766N3853L1760L4407M6565N2948N1799O7935
16112A420268R4829J51386K21727K36011J25572J2435R235K9785L1594J1200j1997
16101B332045K2717R4838J28358J45944J78667K25666K52716K83737L36411L74902
16091D376001L78739M33343N38630O68059P72459Q88641J050280J183953J300663
16082A1590768J701205K379203L052495L909684N212451P128630R691892J2296310
16074E6962638J6475968K6901319M8035336Q6148046J34796552J22911544Q889230
16067E01120633r0321378j12598617r9761821o5604654l8027421k3194391j5810065
$$ y = [1190861, 1026532, 949204, 925773, 941405, 941363, 942595, 946344, 948866, 946606, 941252, 938804, 936785, 946162, 958897, 981166, 1017235, 1081001, 1134854, 1166614, 1201021, 1247586, 1300534, 1352333, 1420268, 1515097, 1666483, 1888210, 2124221, 2249793, 2262228, 2271463, 2301248, 2332842, 2344042, 2332045, 2354762, 2449600, 2577958, 2723902, 2902569, 3128235, 3380951, 3664688, 4001099, 4376001, 4754740, 5188083, 5726713, 6394772, 7167231, 8055872, 9106152, 10290105, 11590768, 13291973, 15671176, 18723671, 22633355, 27845806, 34974436, 44666328, 56962638, 73438606, 100339925, 148375261, 234523307, 369319859, 492231403, 501120633, 410799255, 298200638, 198438817, 132834163, 94806742, 71612351, 55802286]
16060E5802286j1549426q801247o516045m704114l512442k853089k333155j896682
16052A3636086j581768j283890j009617p90023o75206o24732n32615m28758l62336
16043F347141l63257l73523l69037l62012l46046l39000l21858l13710l36258
16034C222440l40438l09162k51079j88919j47497j40597j35046j19170r5823q2791
16024A411918q3064p8909o3572m4500l7826l3179k3085k2662k2212r284K2726
16013A016351P3340J32785J09661n7992j74992j83341j22972o6649l6360k5265
16003F64566j7218q150k1149l5650l3425l1088k9533k2230j7719k3833l1740k3831
15991C69000j5705l159n768j970L843m035j590l64p086j8014k1157j4622P6p068
$$ y = [55802286, 44252860, 35451613, 28935568, 24231454, 20719012, 17865923, 15532768, 13636086, 12054318, 10770428, 9760811, 8970788, 8295582, 7670850, 7138235, 6709477, 6347141, 5983884, 5610361, 5241324, 4879312, 4533266, 4194266, 3872408, 3558698, 3222440, 2882002, 2572840, 2321761, 2132842, 1985345, 1844748, 1709702, 1590532, 1494709, 1411918, 1328854, 1249945, 1186373, 1141873, 1104047, 1070868, 1047783, 1025121, 1002909, 993625, 1016351, 1089691, 1222476, 1332137, 1274145, 1099153, 915812, 792840, 726191, 689831, 664566, 647348, 639198, 618049, 582399, 548974, 517886, 488353, 466123, 448404, 424571, 392831, 369000, 353295, 350136, 344368, 342398, 346241, 342206, 340616, 340252, 333166, 315152, 293995, 279373, 279449, 272381]
15977B72381n721n775q789j7514k5692k4188k1308q617j7979o301o878q461J702
15964A16860J0487J889o97j872j333p08n895r725j1567q208j5042k3903k2386
15951B7900k4950q088k614M93J8827M3621P6059P6505M0082L3767K6046K8996
15939C36644K5265j8415m2723n4205m1143k7432k7559j7544r132r399n511n923
15927A02923l167q836j273P357J7668K1929J1947n082j2344j4852n07K5154L6066
15914A76983K0315j6974k7677k4587j9642p394r027j2280r420J425P350P148K961
15901H9181J947R775q20p061k3203j6907p254m868k0206j8696k1175j747R325
15888a1709K6077L7633L4394J5971l172j4694l839K058o349k1613j8435j7789
$$ y = [272381, 266660, 260885, 252096, 234582, 208890, 184702, 163394, 154777, 136798, 130497, 123619, 115158, 116860, 127347, 129236, 128539, 126667, 125334, 124626, 118731, 109006, 97439, 89231, 74189, 50286, 27900, 2950, -5138, -7752, -7259, 11568, 55189, 131248, 207753, 247835, 281602, 307648, 336644, 361909, 343494, 300771, 246566, 205423, 177991, 150432, 132888, 123756, 114357, 108846, 102923, 99756, 90920, 89647, 97004, 114672, 136601, 148548, 143466, 131122, 116270, 115763, 140917, 176983, 197298, 180324, 152647, 128060, 108418, 101024, 91997, 79717, 70297, 71722, 79072, 86220, 89181, 91128, 100903, 100083, 93022, 69819, 52912, 45658, 40790, 20584, 1888, -19287, -21034, -11709, 14368, 52001, 86395, 102366, 99194, 84500, 80661, 82719, 76370, 54757, 36322, 18533]
15876A8533j9182o141m253l363R74J5780J8685O742L008o091j3506r864l695q824
15862a1197j0716m782m286q112l853J5746J3833J4225K1154J9858J0684J0561
15850F3115L890p76p664j2188n333q153o493j2667q086J100k584o705o067q39
15836i450Q879L666k808L439P948N856M569n236o577M933L049P780L655k908N237
15821C2032J789M285J336j2916L641L144L616Q551J170l293q860n792j2412r743
15807F548r228m082j425J150k395r019j931M129L017M013L701k552J462L932L389
15792G09O948J2993P697Q512k696L643Q712J207o77n971l595l116n673r223k073
15777A7397J636j515o697m254M825J05p286j404Q421M522N25p384q255R60Q297
$$ y = [18533, -649, -6790, -11043, -14406, -13432, 2348, 21033, 27775, 30783, 24692, 11186, 1322, -2373, -11197, -21913, -26695, -30981, -39093, -42946, -27200, -13367, 858, 22012, 41870, 52554, 63115, 67005, 66229, 58565, 46377, 41044, 32891, 26398, 13731, 5645, 6745, 4161, -2544, -8611, -9450, -571, 3095, 287, 3726, 11674, 17530, 22099, 16863, 10286, 15219, 18268, 26048, 29703, 26795, 32032, 33821, 38106, 39442, 26526, 30167, 33311, 36927, 45478, 46648, 43355, 34495, 28703, 16291, 6548, -2680, -6762, -8187, -7037, -9432, -18451, -20382, -16253, -13236, -9223, -5522, -8074, -6612, -2680, 709, 7657, 20650, 28347, 36859, 34163, 37806, 46518, 47725, 47048, 41077, 37482, 34366, 28693, 19470, 17397, 19033, 17518, 10821, 6567, 11392, 11497, 4211, 2807, 11228, 15750, 16275, 8891, 636, 1596, 9893]
15762I893j090k807l965K834j316q015j175p83n013M905J0583M429O655M145j0933
15747H347j1155R4l894j0739k18K422n93m095j57K021L612J713K158n909j4869
15732c1262M63J7021P596Q40j569o985K100K354L943k015q39L328l502Q285N62
15717C20j764K035n225n876k118k795M483L822l687j668m00j992M54N972k029
15702a0468l149m265K878m104J868O952L935L628N01J035o453j532k764n485L189
15687a4234j182q692k429k268q370k81N165L697Q352R092Q564l061k485M505k048
15672e675j0602k889m275j2411L833J1927J1862R612j857m660O628l417l548N976
15658E04L911K1L777q10n640j969j216J507l846L258M064j3077K224Q791L368
$$ y = [9893, 8803, 5996, 2031, 4865, 3549, -4466, -5641, -6424, -11437, -6532, 4051, 8480, 15135, 19280, 8347, -2808, -2714, -6608, -17347, -17565, -15143, -15736, -19831, -19988, -17967, -14355, -12642, -10484, -16393, -31262, -30799, -13778, -6182, -5342, -6911, -13896, -11796, -9442, -5499, -7514, -8353, -5025, -8527, -242, 320, -1444, 591, -4634, -10510, -12628, -15423, -10940, -7118, -10805, -12473, -12873, -14865, -14411, -8439, -10468, -13617, -17882, -15004, -19108, -17240, -10288, -6353, -2725, -2224, -1189, -7642, -9174, -11938, -17423, -14234, -15416, -24108, -26537, -28805, -37175, -37456, -32291, -28594, -20242, -11150, -2586, -5647, -8132, -3627, -5675, -16277, -19166, -23441, -35852, -32019, -20092, -8230, 1382, -475, -5135, 1493, -1924, -5472, 504, 4415, 4436, 8213, 7403, 1763, -206, -1422, 85, -3761, -503, 3561, -9516, -7292, 1499, 4867]
15643D867n58J348K384J891R082j94L683k198j0707J328n078n046K055O945J8032
15628B7834M781R45o22J273j2460n226k634n322k350N975L965n706j1593o894
15614h034J53K188k938j0055p065l836r001J61O303P871M683K475J0513J0520
15600C938N301l526o791j366R34Q014N321k714l629K709N697R73M740J977K916
15585B4494o196n673o394J638L442o344m094L220N548m238k501k082J51M818M32
15570F221m270n486p134k708O003M801M982P278L99k321j03K830K054k55j2582
15555b91J694k075L520K564R828K80J807K648j665K08Q73l082k537J032k806L188
15539A5186N345K479j631N372J421N479M150N356L884L915O082N446J6718J7903
$$ y = [4867, 4309, 5657, 8041, 9932, 19014, 18820, 22503, 20305, 9598, 10926, 5848, 802, 2857, 9802, 27834, 32615, 33560, 32938, 34211, 21751, 16525, 13891, 8569, 6219, 12194, 16159, 10453, -1140, -8034, -7881, -5693, -8631, -18686, -25751, -29587, -38588, -38427, -32124, -24253, -19570, -17095, -6582, 3938, 9239, 5713, -1078, -2444, -1510, 6504, 11825, 9111, 5482, 8191, 13888, 14861, 19601, 21578, 24494, 18298, 12625, 6231, 7869, 11311, 4967, 873, 4093, 9641, 5403, 2902, 820, 971, 5789, 6221, 1951, -3535, -10669, -13377, -7374, -2573, 2409, 9687, 10086, 7765, 7662, 10492, 12546, 12291, -291, 1403, -672, 2848, 5412, 15240, 15520, 17327, 19975, 18310, 18518, 19391, 16309, 13772, 14804, 11998, 15186, 20531, 23010, 21379, 26751, 28172, 33651, 37801, 43157, 47041, 50956, 57038, 62484, 79202, 97105]
15525I7105K1908K5490L3464N6621O7721Q8612J37840K44232M44244P07138P12429
15514B636804J35210m74091o32939n47582l67891k20297j31957r3647o8580n3753
15504A81277m0149k5334j6887j8092j4470q183q948r530n210N468J785L122k985
15491D1864r462l046n60p34j399k549n234j356j165L855l891q191R35L95L271
15476A2733m951m284l789j570o14k588L895J087j793k376L199J847J45k579K255
15461F17M325Q171l488m662k785J723j44l11K160j268o427m79J0087o166n314
15446c961k526p96l338m968L09O023J735j80K267k04K80m941J560k146j543O322
15430f107K668K527K934j12L968k217m692M326j969P465J7206K037J528L870j658
$$ y = [97105, 119013, 144503, 177967, 234588, 302309, 390921, 528761, 772993, 1217237, 1924375, 2636804, 2772014, 2297923, 1664984, 1117402, 749511, 529214, 397257, 303610, 235030, 181277, 141128, 115794, 98907, 80815, 66345, 58162, 49214, 39684, 34474, 39942, 41727, 44849, 41864, 32402, 29356, 28796, 28062, 26663, 24114, 18880, 17524, 16359, 20214, 16323, 8132, 9067, 9462, 12733, 7782, 3498, -291, -1861, -2475, -5063, -1168, -81, -1874, -4250, -1051, 796, 941, -1638, 617, 4942, 13113, 9625, 4963, 2178, 3901, 3757, 3446, 5606, 4338, -2089, -2568, 7519, 1353, -3961, -6487, -7283, -10621, -15589, -15280, -9257, -7522, -7702, -5435, -5639, -5359, -10300, -8740, -10886, -12429, -6107, -3439, -912, 2022, 1910, 5878, 3661, -1031, 3295, 1326, 8791, 25997, 28034, 29562, 33432, 31774]
15415C1774K796N267n108j691k92R424J7053L4581M6841Q6418J44764J97281K10827
15402G79935J90863J04531k1485j22211j92960k09344j73178j25442q4391n1135
15392I5183k6486k1979p074l992P94M741J363l476m232o956q635m243J095P56
15378A6859j673n281j1098n390L597P169N854P21m966n737j168o172o35l78j87
15363h485M627m317j777M949M059n830n836l339K469N776j604k667m267l464l689
15348b3395K713R755M677K821m871K66K024m864O527M912k382m849K234K346R086
15333G000J615j1089q255m331K958M264K029o260l29J0642N081l05j329j494o76
15318d79m843r662j608K318P2J790O195q99o923q604K061K045l813P008K441L400
$$ y = [31774, 34570, 39837, 34729, 33038, 32746, 42170, 59223, 93804, 140645, 227063, 371827, 569108, 779935, 970798, 1075329, 1053844, 931633, 738673, 529329, 356151, 230709, 146318, 95183, 68697, 46718, 39644, 35652, 36446, 41187, 42550, 39074, 34842, 27886, 19251, 15008, 16103, 16859, 15186, 9905, -1193, -6583, -2986, 4183, 10037, 10758, 5792, 55, -1113, -7285, -7920, -8298, -8485, -3858, -8175, -9952, -5003, -944, -6774, -12610, -15949, -13480, -7704, -9308, -11975, -16242, -19706, -23395, -20682, -10927, -6250, -3429, -8300, -8034, -6010, -10874, -4347, 565, -1817, -6666, -4432, -2086, 7000, 8615, -2474, -10729, -15060, -12102, -7838, -5809, -12069, -12398, -1756, 3325, 3020, 1691, 197, -479, -5322, -14984, -16592, -14274, -14202, -12412, -6217, -7116, -14039, -22643, -20582, -18537, -22350, -15342, -12901, -9501]
15302i501J76j263k344N53q1j963n077q348M118L359R50L183m670O698M843L786
15286e581k650L498o331n592O116k507J238J947M547j448j3258n99j370k45O212
15271a6023M65l000M205J3773L064p136Q218p5j0818q250o386n801P583J0876
15257i305L605K618O91J265n62k143l428p749M144K358o405l404K157R45M848
15242a0365q707n397K735O471L674l738m803M224k517K8j250m0O540j865N611
15227i399J0558M79o783J192j100P360j505K707N280o34q483k313o685q865K332
15212a5859J0285j516n083o976N43O627R81j613J284K042J208q684o659P60L664
15197a8996O098L698K368J273J7j145R26k047r58r60o16M11m962L052R626P723
$$ y = [-9501, -9325, -10588, -12932, -12379, -12460, -14423, -19500, -27848, -23730, -20371, -19421, -16238, -20908, -14210, -9367, -5581, -8231, -4733, -11064, -16656, -10540, -13047, -11809, -9862, -5315, -6763, -20021, -20620, -21990, -22235, -16023, -15558, -18558, -14353, -580, 2484, -4652, 3566, 3491, -7327, -15577, -21963, -27764, -20181, -9305, -5700, -3082, -2391, -1126, -1688, -3831, -7259, -15008, -10864, -8506, -14911, -18315, -16158, -15213, -10365, -19072, -24469, -21734, -15263, -11589, -15327, -20130, -15906, -18423, -18395, -19645, -19685, -13145, -15010, -9399, 1159, 1638, -5145, -3953, -5053, 2307, 802, 3509, 8789, 8155, -328, -2641, -9326, -18191, -15859, -5574, -7090, -12173, -19149, -18606, -11979, -10998, -12611, -11327, -9285, -8077, -16761, -23420, -22660, -18996, -12898, -9200, -6832, -5559, -5542, -6687, -5761, -7808, -8766, -9726, -10342, -9931, -14893, -11841, -2215, 5508]
15181E508O121q98j2859o251r086r411j147P615L584J0897J3522j725p487j0767
15167a2384j866L904m015l601N99Q416K890p519N594M681k103J92m524o822M386
15152a2172R411O090k416p320p312N2M900l236J649K065m32l691o949j391J656
15137a9096m009M483R117O188J293m539J671P492N531l368j0007o250Q49P92L339
15122f514L215j670K75k703k099J395N783p668m182M767R419j633m37k656j904
15107f612j187k223p55P391n114l382O049o587l01o143r74n56P233M181l572j232
15091a3784J71J972P290L376p210o699o295O56M501N819P856n32r362m262J532
15076a4971L121J463L201j652o767M38M490k93N756N263J835j8652r006m67Q050
$$ y = [5508, 11629, 10731, -2128, -8379, -17465, -26876, -28023, -20408, -16824, -5927, 7595, 5870, -1617, -12384, -14250, -10346, -14361, -17962, -17363, -8947, -6057, -13576, -7982, -3301, -5404, -5212, -9736, -16558, -12172, -2761, 3329, 913, -6407, -13719, -13667, -8767, -12003, -10354, -8289, -8721, -12412, -19361, -20752, -19096, -23105, -18622, -9505, -3317, -2024, -6563, -4892, 2600, 8131, 4763, -5244, -11494, -10645, -9853, -6514, -3299, -4969, -4694, -7397, -9496, -8101, -2318, -9986, -14168, -9401, 18, -1615, -2052, -4708, -6612, -7799, -10022, -10777, -3386, -8500, -11882, -5833, -12420, -12721, -18864, -19838, -20394, -13161, -8980, -12552, -13784, -13613, -11641, -4351, -975, -8185, -14884, -21179, -20523, -16022, -10203, -2347, -2879, -12241, -16503, -14971, -11850, -10387, -7186, -8838, -15605, -15167, -10677, -10970, -5214, 49, 1884, -16768, -25774, -26241, -18191]
15061a8191J713K464q153j524k032M522J55r42L285O328L421j219m784l564k16
15046a8737O418R524L367j365p7K524m20J409o296L785m436n371L976M677r12
15031a934j285j0373n889N143O517L852k113p969k865l752l091K706L77N72Q281
15016a1823P698l903K135M964j520n41j189k48J67L969O123R331k7n91P59l787
15000A1517l99K690l852n263J134K351N422m471p401L287r98r028M708M243J804
14985E744m605j1009m813L251K120o012M185K083m554m121K383L73J64K917j843
14970a3737L965K885L309K348k782r976n033k555N173J1175j166m784k392J231
14956a2339O496r53J213L897L641q405j0234j39M35N438Q378K280L111O50K43
$$ y = [-18191, -16478, -14014, -22167, -23691, -25723, -21201, -21046, -21988, -18703, -12375, -8954, -10173, -14957, -18521, -18737, -12319, -2795, 572, -793, -870, 1654, 1234, 2643, -3653, 132, -4304, -9675, -5699, -1022, -1934, -3219, -13592, -19481, -14338, -7821, -3969, -6082, -14051, -16916, -20668, -23759, -21053, -20676, -20104, -11823, -4125, -8028, -5893, -929, -2449, -2990, -4179, -4427, -4260, -291, 5832, 15163, 15136, 14545, 15304, 11517, 11118, 13808, 9956, 4693, 5827, 8178, 13600, 9129, 1728, 5015, 4017, -5011, -303, 3940, 5744, 1139, -9870, -14683, -11432, -9312, -15324, -11139, -9056, -13610, -17731, -15348, -14975, -14811, -11894, -13737, -9772, -6887, -3578, -1230, -4012, -13988, -19021, -21576, -16403, -5228, -6394, -11178, -13570, -12339, -5843, -6796, -5583, -1686, 1955, -6450, -16684, -16823, -16388, -10950, -2572, -292, 2819, 3469, 3712]
14941C712l642j716o509j434K160L482L514l07M47L672K450l406n933p10j99m254
14925h673o9k068J898j648o182K289M439M702m250k456j45O86l862J99P648P044
14909d48k089J007q54P743m203r244K239P737L784k290n385n376o236L009j156
14894a1762l033K616n10Q449k05l893J946q93O682Q56K299O795j588n697j0192
14879h130j819j262J986J455K237R82l061m492k780J1023L274j1180k19K851j547
14864a0682L835K515l468L531m303l999k187L783O332K536m435k020P345R152
14850G935j2917j995j784k751j457k3Q039K923l295p09K402L135P76K350j0526
14835g897o390P328Q668n785m260k193M060L942j024J803k590k839j878n29j479
$$ y = [3712, 70, -1646, -8155, -9589, -7429, -3947, -433, -740, -293, 3379, 5829, 2423, -3510, -4220, -4419, -8673, -8742, -10810, -8912, -10560, -16742, -14453, -10014, -5312, -9562, -12018, -12163, -11477, -15339, -15140, -7492, -448, -2537, -1530, -2384, 5359, 1156, -8088, -5849, 1888, 5672, 3382, -2003, -7379, -13615, -10606, -11762, -14795, -12179, -12689, -4240, -4445, -8338, -6392, -7285, -603, 253, 2552, 9347, 7759, 2062, -8130, -9949, -11211, -9225, -7770, -5533, -4551, -7612, -12104, -14884, -3861, -587, -11767, -11986, -9135, -10682, -6847, -4332, -7800, -4269, -8572, -12571, -14758, -10975, -4643, -2107, -6542, -8562, -1217, 7935, -4982, -6977, -8761, -11512, -12969, -12992, -4953, -2030, -5325, -6034, -3632, -497, 279, 2629, -7897, -14287, -6959, 1709, -4076, -8336, -10529, -6469, -2527, -3551, -1748, -4338, -7177, -9055, -9584, -11063]
14820a1063j508P898K550j1162l440L027R63j176l601M591N166K971m800l977
14806a3561k287j250NJ177P440M894q55n941M684N415J13l68m463j875j902l553
14790a2327Q61m447N88R425M517k88n497K294P251r298j2407n114K152L610K337
14775a6343R98J333m210n048N869L697l128K106k681p022M217P151l191q920m20
14760b5592O586O783N099j649k108k40n533M796J1551O5l406J232Q004j528n161
14745a101Q32k129o441n896m358J154O540N247K037J228k478m242m882L30N545
14730h614k13p20L140N092O344N898J844o935l929q993n261N390J439m974j85
14715a0677J56N965Q581j212j589k912N412l37j225n268m091l781K995M268j273
$$ y = [-11063, -12571, -4673, -2123, -13285, -16725, -13698, -12735, -13911, -17512, -12921, -7755, -4784, -9584, -13561, -15848, -17098, -17093, -15916, -8476, -3582, -4437, -10378, -5694, -279, -166, -534, -4997, -6872, -8774, -12327, -11466, -15913, -15325, -5900, -1383, -1671, -7168, -4874, 2377, -6921, -19328, -24442, -22290, -18680, -16343, -15345, -14012, -18222, -23270, -17401, -13704, -16832, -14726, -17407, -24429, -20212, -13061, -16252, -25172, -25592, -19006, -12223, -7124, -8773, -10881, -11121, -16654, -11858, -307, -242, -3648, -2416, 5588, 4060, -1101, -269, -2398, -8839, -14735, -19093, -17939, -11399, -6152, -4115, -2887, -5365, -9607, -14489, -14159, -8614, -8827, -9547, -6407, -1315, 5029, 10927, 12771, 5836, 1907, -7086, -12347, -6957, -5518, -10492, -10677, -10521, -4556, 4025, 2813, 1224, -1688, 3724, 3387, 2162, -3106, -7197, -10978, -7983, -3715, -4988]
14700d988q982K144N165l416l578O324M166n901o306o606M034J871Q140J1337
14686C404K362k473o825l082K263o112J627j628k041L646p853K3M947L731k964
14671a0975l38M000j107j0751J512Q391L017M035M96l338O351K992j683q382j575
14656g355K192o05k591O353o346m933k53P380L004l676l421%N657j655k993N3
14640i189L277K998k181J605M821l829j124m52o030M900M969K483J0448N560J734
14625A9990l889q605l096J895m59q859K470M458j095j600k858L312k40n010k294
14610e880L611P151k505l206L365o771k747j731j472J085L252K167o10K54k224
14595f261l98Q25J1324R510N258Q520k19M13N219L892M538k612n760j3223q822
$$ y = [-4988, -13970, -11826, -6661, -10077, -13655, -7331, -3165, -9066, -15372, -21978, -17944, -16073, -7933, 3404, 5766, 3293, -3532, -6614, -4351, -10463, -8836, -10464, -12505, -8859, -16712, -16689, -11742, -8011, -10975, -11313, -7313, -8420, -19171, -17659, -9268, -6251, -2216, -1720, -5058, 1293, 4285, 2602, -5780, -7355, -5163, -5768, -8359, -2006, -8352, -13285, -13538, -6158, -3154, -6830, -10251, -10251, -4594, -6249, -9242, -9189, -5912, -2914, -5095, -3490, 1331, -2498, -3622, -4074, -10104, -5204, -235, 2248, 12696, 18256, 19990, 16101, 7496, 4400, 6295, 5836, -3023, -553, 3905, 2810, 1210, -1648, 1664, 1424, -3586, -5880, -2269, 4882, 2377, -829, 2536, -4235, -6982, -8713, -10185, -9100, -5848, -3681, -4291, -4037, -6261, -6659, -5834, 5490, 15000, 20258, 28778, 28559, 28972, 34191, 38083, 42621, 40009, 34249, 21026, 12204]
14580A2204j52o613k192N288Q72n912n053l170n692L499K370n004Q51K779L522
14565b403N811O70l793q092M05k501l342r64L390Q60O649N390P640Q278J987p059
14549A2926L699K2087K0819J4077m388j7314q188q946k0352j1477K943l174M470
14536G182P011m997j1160q367j625L513m52l199O760L514l538j889K882J865K502
14521BL067Q53o150l803K419K850N889O775o137o357J643O222P15J2273J5050
14506C5311J5585K79j4346j6004j0957o688m159q47k150p65P680l382n612o75
14492f730M437L74l957Q24M629m596J662l847p200j543J403J0071M94j133p60
14477e872M908J003Q300K531n279m305Q53m748l074L59J5608O104n012l582q285
$$ y = [12204, 12052, 5439, 3247, 8535, 9407, 3495, -1558, -4728, -10420, -6921, -4551, -9555, -8704, -5925, -2403, 3408, 4078, 285, -7807, -7402, -9903, -13245, -14209, -10819, -9959, -3310, 2080, 9720, 17998, 19985, 12926, 16625, 38712, 59531, 73608, 69220, 51906, 43718, 34772, 14420, 2943, 5886, 2712, 7182, 14193, 9196, -1964, -10331, -11956, -8443, -8895, -12094, -5334, -1820, -5358, -7247, -4365, -2500, 2, 3069, 3922, -2228, -6031, -3612, -762, 5127, 11902, 5765, -592, 1051, 7273, 7988, 20261, 35311, 50896, 51175, 36829, 20825, 9868, 3180, -979, -1826, -3976, -4741, 2939, -443, -6055, -6730, -2293, -1919, -5876, -5052, -423, -5019, -3357, -7204, -14404, -15947, -14544, -4473, -3979, -5112, -5872, -964, 39, 8339, 10870, 5591, 1286, 2139, -2609, -5683, -5324, 10284, 16388, 11376, 7794, -491]
14462d91r988j665O65K000k140R54O303n48O46M376m10r034o06j938L418M385
14446d073N635r05n148k678M86J272j1221K7K850J553O885O304N70l06L305P73
14430E329L014j713m934l944k045m97K60l607M30K298J393P866L218o950n869
14415e751j62m21J660J299m823k18m150J873Q797M084O839P019n072n319m930
14400G25J234j894J475m56q330k621m53r75K176N973N142M240m865n848p56M223
14384a010j415l789k945j523N039P846K092N98r84J918j355p02l218q017L702
14369c763m811j3018k712K392M888K539Q071j101L271k008j0323o450M734J8525
14355B34J016j396m764j267p594m859q40P710O470L741Q000j267k843o230o43
$$ y = [-491, -10479, -12144, -11479, -9479, -11619, -10665, -4362, -4910, -4264, 112, -298, -9332, -9938, -11876, -8458, -4073, 1562, 657, -4491, -7169, -6683, -5411, -16632, -16605, -13755, -12202, -5317, 987, 1557, 1251, 4556, 5329, 8343, 6630, 1696, -2248, -4293, -4790, -4530, -8137, -7707, -5409, -4016, 3850, 7068, 118, -5751, -5913, -6334, -4674, -3375, -8198, -8416, -12566, -10693, -1896, 2188, 9027, 16046, 10974, 5655, 725, 1959, 65, 1540, 1084, -7246, -9867, -10320, -11295, -9119, -3146, 1996, 6236, 1371, -4477, -5233, -1010, -2425, -6214, -9159, -10682, -5643, 2203, 4295, 4893, 3909, 5827, 4472, 3770, 552, -7465, -3763, -8574, -21592, -24304, -21912, -17024, -14485, -6414, -7515, -4244, -6252, -16575, -23025, -18291, 234, 1250, -146, -4910, -6177, -13771, -18630, -19470, -11760, -5290, -1549, 6451, 5184, 2341, -3889, -4532]
14340d532M241N229j730o054R32L175M51K564L656q520q118p772Q784L627L10
14325c757n230n087L011m201K017j026J2442O688o700J639k623J964L785n120
14311b198j034K344j773N72j120J392j680j109J839M550M506K326k553j638Q06
14296E230r375j0138Q16m06L855K780l96J278L858n113j820j80L515k866j249
14281a0211j64P429K004Q597J325k892p690k829l682m754n374R403O612M759J083
14266C616n198k873K300O20j12l572k82k77L412l857n74L370M385o24o823N169
14250a320L089n89p2j018Q53j971m775J593j712Q83P484K548L232o271j255k488
14234a789o577m858O157L830j077j094j052j045J1191N955l146k9M435j749m860
$$ y = [-4532, -291, 4938, 3208, -2846, -1914, 1261, 1712, 4276, 7932, -588, -8706, -16478, -7694, -4067, -3757, -8987, -14074, -11063, -15264, -13247, -14273, -1831, 4857, -1843, -204, -2827, -863, 2922, -2198, -3232, -888, -2661, -2089, -3209, -1817, -3497, -4606, -2767, 1783, 6289, 8615, 6062, 4424, 5230, -4145, -14283, -13467, -13873, -10018, -7238, -7634, -6356, -2498, -7611, -9431, -9611, -6096, -8962, -10211, -10375, -2946, -942, 7655, 8980, 6088, -1602, -4431, -8113, -12867, -18241, -8838, -2226, 2533, 3616, -1582, -4455, -2155, -1535, -1647, -5219, -5501, -5778, -2366, -6223, -6797, -3427, 958, 334, -6489, -1320, 1769, 1180, 1108, 90, 943, -1028, -5803, -4210, -5922, -5039, 2445, 4993, 8225, 1954, 699, -1789, -8366, -13224, -7067, -3237, -4314, -5408, -6460, -7505, 3686, 9641, 6495, 6466, 10901, 9152, 4292]
14219D292N332r108k221M361J293j286m045N205N958P65k405k353l060o349L824
14204B03L476N105j432K664N47L197J40r233m501l445k623m872L252K819q362
14189a3065K984J0399N203l14l366J946j603l084J714Q26m387j803K96m900j694
14174a0848M607M980j057Q7k359K078K938J057L055K272k11k729J661k457n681
14159b607Q85r75l271o18J0632O792K721j962P7M374K147k317k328o289J704l66
14143H599l267k715l734k299M88J478n613l946k700N369O729P519l519m529L039
14128H99P068k351j970p047l969J0631L235J7k598l106L795N102J063p47r882
14113A40j217p646K951N436j982p630n726K594L562J1580Q938j379p024K135l056
$$ y = [4292, 9624, 516, -1705, 2656, 3949, 2663, -1382, 3823, 9781, 10546, 8141, 5788, 2728, -3621, 203, 3679, 8784, 7352, 10016, 10563, 13760, 13900, 4667, 166, -3279, -5902, -10774, -7522, -4703, -13065, -10081, 318, 5521, 5207, 1841, 3787, 2184, -900, 814, 1640, -2747, -4550, -4254, -9154, -10848, -6241, -1261, -2318, -2231, -4590, -2512, 426, 1483, 4538, 6810, 6599, 3870, 5531, 3074, -2607, -1722, -2697, -5968, -6586, 4046, 10838, 13559, 11597, 11674, 16048, 18195, 15878, 13550, 7261, 8965, 8599, 5332, 2617, -1117, -3416, -2928, -1450, -7063, -11009, -13709, -8340, -1611, 5908, 2389, -2140, 899, 7967, 5616, 3646, -3401, -7370, 3261, 6496, 6513, 3915, 809, 4604, 9706, 10769, 10022, 140, -1077, -8723, -5772, -336, -2318, -9948, -15674, -13080, -9518, 2062, 11000, 9621, 2597, 4732, 1676]
14098A676k648O013m03r243k295Q4N536L733j206J54j110k431r9m936j612K825
14082e962l529K540N474J439k630j94K463o495m02p13O70J165J48J986l147L980
14066c207K474j314R63j641J741p88K605K697J738P984n78j630l731o762k49K193
14050B495n046n88k835M129N2k49O598O41Q10K6j003j396K155L58j524l010R0
14033A703L231j706m380m570J738M720l134K718Q132K394m551q359J221J2149
14019A1306P56m007o79j454J558k510q812r7O197L039P19K436j008j785N43K761
14003H963j223n813l145J31p701Q279L132l18L177J046o90q65K937L677L516P68
13987A5871m718n027l265m361j939K657N84O107M361l770j850j527L808J709k205
$$ y = [1676, -972, 5041, 4638, -4605, -6900, -6816, -1280, 2453, 1247, 1401, 291, -2140, -2239, -7175, -8787, -5962, -9491, -6951, -1477, -38, -2668, -2862, -399, -6894, -7296, -8009, -7339, -6174, -6026, -4040, -7187, -3207, -733, -2047, -1084, -2725, -984, -1772, 833, 3530, 5268, 13252, 12674, 11044, 7313, 551, 302, 2495, -2551, -3139, -5974, -1845, -1793, -2042, 4556, 5197, 6007, 6033, 5030, 3634, 5789, 6147, 4623, 1613, 1703, 4934, 3228, -1152, -5722, -3984, 736, -2398, 320, 8452, 10846, 6295, -2064, -843, 11306, 12062, 8055, 7376, 5922, 7480, 4970, -3842, -3939, 2258, 5297, 6016, 8452, 7444, 5659, 6202, 8963, 7740, 1927, -1218, -1087, -8788, -509, 2623, 2305, 5482, 6528, 5838, 4973, 7910, 11587, 15103, 15871, 11153, 6126, 2861, -1500, -3439, -782, -198, 5909, 10270, 6500, 4650, 3123, 6931, 8640, 6435]
13972F435k863M900m142o267n418j290j855L482O487R462J183J589j455j828J207
13957I627n297m760rk00P238J0317l839j770M124n56l367l187p372l236m61O825
13941D077L483k864o342J322N80j14k06l247j105L172J51j803N414J590m116q420
13925h428r926J499Q333J624K189M713r5J09K84k439M77J556K275j508K703q92
13909B474K199o369L441O041k083m035K172j113p895J131m730L882K823K928M758
13894E624N670l468O19k291K024R78n090m778p202L30J686P530M547k120l99m706
13878a046p819l3r05Q953O228o547l546K457K112k396K327L300J598M541K460
13863A1684M614m731p207m79j758J88J292J712j372K02L030L319n886p334N02
$$ y = [6435, 3572, 8472, 4330, -1937, -7355, -8645, -10500, -7018, -531, 8931, 10114, 11703, 10248, 8420, 9627, 4330, -430, -439, -639, 6599, 16916, 13077, 11307, 15431, 14875, 11508, 8321, 949, -2287, -2748, 4077, 7560, 4696, -1646, -324, 256, 142, -64, -3311, -4416, -1244, -1093, -2896, 2518, 4108, -8, -8428, -18354, -16855, -8522, -6898, -4709, 4, -91, 18, 302, -2137, -1660, -104, 2171, 663, 3366, 2474, 4673, -1696, 1745, 7786, 5703, 1668, 3840, 2727, -5168, -4037, -8767, -4885, -2062, 866, 5624, 11294, 7826, 8445, 6154, 8178, 9156, 4066, -712, -7914, -7584, -5898, 1632, 6179, 4059, 3660, -1046, -8865, -8898, -9803, -850, 5378, -1169, -4715, -2258, -146, -2542, -215, 3085, 4683, 9224, 11684, 16298, 11567, 4360, 3881, 2123, 2311, 3603, 5315, 3943, 4145, 7175, 10494, 4608, -2726, -2224]
13848b224Q068M675o769o375L484J0013K966p372p650J396j266P98P813N817n580
13833G794o156q092l846O032M341M614L312l451l124k38K30M988O546Q8l100M511
13817A4449L348Q1K119k943q228l853J594O083J804n205l659O951N525K301n429
13802A4938l565K566J2443P007J482k82K900J1342O905p27N615O886K850N172
13788G5532J1707K5225K6676M7437R4466J38753J93100K13879K00627J43772L4167
13777A205341q1063j65092k09361k07128j62464j11355o7099l9352k5694j3433
13767A23300j2847j5878j3066o55m963j1455j5931m596Q78r373o252l709j825
13754B3628m87p04J853M948l740o02o203j130L7l152m790M392R67k575L612l313
$$ y = [-2224, 5844, 10519, 3750, -2625, 859, 10872, 13838, 6466, -1184, 212, -1054, -256, 7557, 13374, 7794, 1638, -6454, -10300, -4268, 73, 4687, 7999, 4548, 1424, 1186, 1416, 6404, 12950, 13038, 9938, 14449, 17797, 17878, 19997, 17054, 8826, 4973, 6567, 12650, 14454, 9249, 5590, 12541, 18066, 20367, 14938, 11373, 13939, 26382, 33389, 34871, 34589, 37489, 48831, 55736, 55009, 60624, 67510, 70360, 75532, 87239, 112464, 139140, 186577, 281043, 419796, 612896, 826775, 1027402, 1171174, 1205341, 1124278, 959186, 749825, 542697, 380233, 268878, 201779, 162427, 136733, 123300, 110453, 94575, 81509, 80854, 75891, 64436, 48505, 43909, 44787, 35414, 29162, 25453, 23628, 23141, 22437, 24290, 29238, 25498, 24896, 18693, 17563, 17600, 14448, 9658, 14050, 15017, 12442, 16054, 12741]
13738A2741j469k969n76l394m405k546N78M374N289j0681R6Q373j305M077N600
13723A3783l295q214n947J687Q600L603r881J990O741Q259j818N18M373L83l882
13708A6900q430l91M40j147K293N556m49O171O915j0561j1544l100N22j301J110
13693B984l441L565L024n06O0r167l474P402J0291L526o166o814k754L079K651
13678D260M763L073p29q376n587l648r88J318J587M222K447k419L206R11K853
13663F893R98m607K319K174J292n4K512j359k924J124J14o988m83M848J844k800
13647D903M393Q81j396L777M373j636n806n866K366O391k468p442j611K406l190
13632G5L342N00j971J0961j259m817J124o131k961L718n692j495m193q51J1684
$$ y = [12741, 11272, 8303, 7727, 4333, -72, -2618, -2040, 2334, 7623, -3058, -2962, 5411, 4106, 8183, 13783, 10488, 2274, -3673, -1986, 6614, 10217, 336, 2326, 9067, 17326, 15508, 16026, 20399, 20782, 16900, 8470, 8079, 8519, 7372, 9665, 15221, 14772, 20943, 27858, 17297, 5753, 2653, 3175, 1874, 2984, -457, 3108, 6132, 5626, 5686, -3481, -6955, 447, 10738, 14264, 8098, 1284, -1470, 1609, 4260, 9023, 12096, 11367, 2991, -2596, -6244, -7232, -5914, -4327, -105, 2342, -77, 3129, 4040, 6893, 7891, 3284, 5603, 7777, 9069, 9015, 11527, 10168, 7244, 8368, 8482, 1494, 1011, 5859, 7703, 4903, 9296, 10177, 8781, 12558, 16931, 15295, 9489, 3623, 5989, 12380, 9912, 2470, 859, 3265, 75, 3417, 3917, 1946, 12907, 11648, 6831, 7955, 1824, -1137, 2581, -3111, -4606, -8799, -9650, 2034]
13617B034N226o212m057K291m716N070K74J996k626K833K956m115Q37J970K657
13602F418L078P851P17q721m841N015O764l580l352L599N667k192o332l074Q232
13587A5249K533o700J94M875K074L560p8j4679j5787m784j900J149Q029O775K593
13572C103L946P53q480k505N6L101L293L005Q569p85l029O638L14n268k573n54
13556I584l228M86J120j074p270L4O405K726n708k750P001R48K40p6L961N066
13540A7465n872K42k583l016m168k943M47l755M62P494L915k949l403l422L089
13525A003L593K966K720m350n095M364R482P191M872M354o208j1733k946M40M172
13510A4825k937L376P784L46n384r792J081n98L50j429l120N707J645N60n19j048
$$ y = [2034, 7260, 1048, -3009, -718, -5434, -364, -90, 1906, -720, 2113, 5069, 954, 1791, 3761, 6418, 9496, 17347, 18064, 9343, 4502, 9517, 16281, 12701, 9349, 12948, 18615, 16423, 10091, 7017, 15249, 17782, 11082, 11276, 16151, 18225, 21785, 21707, 7028, -8759, -13543, -15443, -14294, -6265, 510, 3103, 7049, 7802, -678, -3183, -3127, -26, 3267, 6272, 14841, 14056, 11027, 17665, 17979, 12711, 10138, 9584, 6356, 6842, 7962, 6888, -382, -348, 6057, 8783, 3075, 325, 7326, 8274, 8514, 8438, 12399, 17465, 11593, 11835, 9252, 6236, 2068, -875, -428, -4183, -3721, 3773, 7688, 4739, 1336, -2086, 1003, 4596, 7562, 10282, 5932, 837, 5201, 14683, 21874, 26746, 31100, 24892, 13159, 10213, 10653, 14825, 11888, 15264, 23048, 23394, 18010, 8218, 9299, 8701, 9051, 7622, 4502, 10209, 11854, 12414, 11895, 10847]
13494A0847m01L833k015o406L106l350K102P304p88p217L115K3864J2629J590
13480D8213N745k311n774o298j258L484J40q517m970J833j26l921J786j632J623
13465B8017J51l943q190p727L228P967J2156J1472J3843J8185J1241j863M010
13452H8547R553l633o49N830J6994K2748K5171M1614N4237R7553J57688K23273
13440G38926K86775K81991K45620K01006Q2731o8180j77147k32350k79706k72051
13430H07615k19958j63560j05398o1143m2985k4734j6611j2684q668P62j71m345
13418A48120r543q11j1558j0598j0244r561j1542k616l410P1L25M190J501m838
13404G9486j467o213n929k539j193m116l435L392o311m089P37k695l273J192R389
$$ y = [10847, 10446, 14279, 12264, 5858, 8964, 5614, 7716, 15020, 14232, 7015, 10130, 33994, 46623, 48213, 53958, 51647, 45873, 39575, 38317, 41801, 41941, 33424, 28454, 30287, 30161, 26240, 28026, 26394, 28017, 28168, 24225, 16035, 8308, 11536, 19503, 31659, 43131, 56974, 75159, 86400, 84537, 88547, 98100, 94467, 93818, 99648, 116642, 139390, 164561, 206175, 260412, 357965, 515653, 738926, 1025701, 1307692, 1553312, 1754318, 1837049, 1768869, 1591722, 1359372, 1079666, 807615, 587657, 424097, 318699, 257556, 214571, 189837, 173226, 160542, 151874, 152636, 152465, 148120, 138577, 137766, 126208, 115610, 105366, 95805, 84263, 81647, 78237, 78308, 78633, 82823, 84324, 79486, 78019, 71806, 65877, 63338, 62145, 58029, 54594, 57986, 51675, 47586, 48323, 45628, 42355, 43547, 52936]
13389E2936Q405q062J746j638l547l613L775L947Q746q92j238O41k096j953K029
13374E9186J438L99l29M3m557l854L995K093p74l353n64j387n220q937n8N252
13358D3373M720j372O951J577p76l184m633p75K795J072J903m339R79m525K185
13343D5951m661r54L315m936j839m135J899K266l451J502J0546Q284j239l848
13329D8700j054M83K341n03p263m979L704k729m198P010J0430n215J267n0L810
13314E1754n261m530J594j603l610o079L290J037k883n32K158J335N60M002m46
13299D0786K705R813J2978J1316M957P451K566J812N292K925m784q249o011l498
13285H0059j232J148L845R120K102J3N860J1939J3381K0890K2289J8453J9280
$$ y = [52936, 61341, 53279, 55025, 53387, 49840, 46227, 50002, 53949, 62695, 61803, 60565, 61206, 59110, 57157, 59186, 60624, 61023, 60694, 60737, 56180, 52326, 56321, 58414, 57640, 54287, 53723, 52336, 47116, 38179, 38121, 43373, 48093, 46721, 53672, 55249, 54473, 51289, 46656, 45881, 48676, 49748, 51651, 47312, 48291, 43766, 45951, 41290, 40336, 43651, 38715, 36876, 32741, 34640, 36906, 33455, 34957, 45503, 53787, 52548, 48700, 47646, 48129, 50470, 49967, 42704, 37725, 41429, 38700, 34502, 41512, 51942, 46727, 47994, 47944, 51754, 46493, 41963, 43557, 41954, 38344, 32265, 35555, 36592, 33709, 33177, 35335, 36670, 37230, 41232, 40786, 43491, 53304, 66282, 77598, 82555, 90006, 92572, 94384, 99676, 102601, 97817, 89568, 83557, 80059, 78827, 79975, 83820, 92940, 95042, 95055, 100915, 112854, 126235, 147125, 169414, 187867, 207147]
13272B07147J8702O622K983q068j6223j3461j8261j1631p721q577j0128j1234
13260A30150r874r142n495N87l63j20J173K340N052O504K637k75K334K632P130
13245A35270N899N063L9156O8016O6089N6581L9090l990n0255p2226o1281m2744
13233A84668k3823j5892n007L966K099k067P308L664k163j1507m033j694n520
13220A29999n042L152l788o238P01P060M393N593J59L242o242j3198j1057j5372
13206I3362j0457k885l220N768j54K718J0605J3538N905R851P128L517R37l211
13192A33402j2119j6513n394l916r158j560p652n217M823N864o25O090Q303P33
13178I7061p099j3750k1171j1232P54N726K470O319Q774j83O579O398L717J0837
$$ y = [207147, 225849, 232471, 235454, 227386, 211163, 197702, 179441, 167810, 160089, 151512, 141384, 130150, 120276, 111134, 105639, 106226, 105863, 105743, 106916, 109256, 114308, 120812, 123449, 123174, 125508, 128140, 135270, 141169, 146232, 185388, 253404, 319493, 376074, 415164, 411174, 360919, 288693, 227412, 184668, 160845, 144953, 139946, 143912, 146011, 143944, 151252, 154916, 152753, 141246, 137213, 135519, 129999, 124957, 128109, 124321, 118083, 118784, 125844, 130237, 135830, 135989, 139231, 132989, 119791, 108734, 93362, 82905, 80020, 76800, 82568, 82414, 85132, 95737, 109275, 115180, 125031, 132159, 135676, 136613, 133402, 121283, 104770, 99376, 95460, 86302, 84742, 77090, 71873, 76696, 82560, 81935, 88025, 96328, 97061, 89962, 76212, 55041, 43809, 44563, 50289, 52759, 59078, 67852, 67669, 74248, 80646, 84363, 95200]
13164I5200J1955J1276J0826O786K445M576M321o45n035q950l202j1441k9326
13151H8786k5693k1495j6250l605J0935K0509K9575L8620L7560M7178M3135K9389
13139B78644J3430J2989Q258L286n82n998n952p754n806n378p254r12k585O236
13125B80622J2258P455K172P379J4761J0998Q636P043K960n766o397M343K36m761
13111C41939q206o645K369L696M800j142O024N591J4939J9722J3376J7473K4231
13098D38167K0384J2772J4142J6725O460o056R05J791j783K317M458R651Q662
13085E28595J8022K6319K8986L2533M0275L5618L1390K6114K3195N109Q292K2883
13073H27331J8393J3122J8629L1294L6458M0213M7568N4337N7546N7800O6913
$$ y = [95200, 107155, 118431, 129257, 136043, 138488, 143064, 147385, 146740, 141705, 132755, 129553, 118112, 88786, 63093, 41598, 25348, 21743, 32678, 53187, 82762, 121382, 158942, 206120, 249255, 278644, 292074, 305063, 313321, 316607, 316025, 310027, 304075, 296321, 290515, 285137, 277883, 276971, 274386, 280622, 292880, 300335, 302507, 309886, 324647, 335645, 344281, 351324, 354284, 348518, 342121, 346464, 346700, 341939, 333733, 327088, 329457, 333153, 337953, 336811, 342835, 348426, 363365, 383087, 396463, 413936, 438167, 458551, 471323, 485465, 502190, 508650, 502594, 503499, 505290, 503507, 505824, 510282, 519933, 528595, 546617, 572936, 601922, 634455, 674730, 710348, 741738, 767852, 791047, 796156, 804448, 827331, 845724, 858846, 877475, 908769, 945227, 985440, 1033008, 1087345, 1144891, 1202691, 1269604]
13062A269604P2154O9702R4080J02644J11080J12424J14789J23408J24704J24779
13052B319368J44707J72888K38674L33535M45258N19108N47511N80215N72184
13043E873448N01532N10922O45102Q32456J026781J197277J278207J245266J158735
13034A4269726J049338R77126J124285J551322K253115L303330M881731P277567
13026C6687540J1176766J7855066K8967296M3468004N2391283M9835055M4327935
13019B84708945L5663991J3191164j3140158k9638781m1366749n1217351n1417551
13012A46783510m2058074l0154146j9671207j2583116q245105n507051l712469
13005B4852342k551505j775967j267369j081293j108599j185849j296787j394500
$$ y = [1269604, 1341758, 1411460, 1505540, 1608184, 1719264, 1831688, 1946477, 2069885, 2194589, 2319368, 2464075, 2636963, 2875637, 3209172, 3654430, 4173538, 4721049, 5301264, 5873448, 6374980, 6885902, 7531004, 8363460, 9390241, 10587518, 11865725, 13110991, 14269726, 15319064, 16296190, 17420475, 18971797, 21224912, 24528242, 29409973, 36687540, 47864306, 65719372, 94686668, 138154672, 190545955, 240381010, 284708945, 320372936, 333564100, 320423942, 290785161, 249418412, 198201061, 146783510, 104725436, 74571290, 54900083, 42316967, 34071862, 28564811, 24852342, 22300837, 20524870, 19257501, 18176208, 17067609, 15881760, 14584973, 13190473]
12997A3190473j381970j213806r63839p03928n10751l77707l25548l95369n01464
12988F816091n77424o27433o53129o18825n38247m55519l60030k83470k38618
12979B463396k00777j64765j33161j15731r7340r2616q5368q3050p3841p3257
12969A343490o3965n7342n0705n1964n5585n3317m4009n6094n3796m4488l3307
12958G78918k7715j7209j9396j4464j4092j1001j6913j1458j9438j7989j8942
12947E90301j7881k2365k6133l0249k7810k5279j7486j6655q142j2763j0P975
12935C93503N625p819o799n414M84n083q539j8387j8105p833p395o402j9295j3030
12921B75511j4673j5011j1778j0125j0497j0475r548n29L516Q208p61j40m111
$$ y = [13190473, 11808503, 10594697, 9630858, 8926930, 8416179, 8038472, 7712924, 7317555, 6816091, 6238667, 5611234, 4958105, 4339280, 3801033, 3345514, 2985484, 2702014, 2463396, 2262619, 2097854, 1964693, 1848962, 1751622, 1659006, 1573638, 1490588, 1416747, 1343490, 1279525, 1222183, 1171478, 1119514, 1063929, 1010612, 966603, 910509, 856713, 812225, 778918, 751203, 733994, 714598, 700134, 686042, 675041, 658128, 646670, 627232, 609243, 590301, 572420, 550055, 523922, 493673, 465863, 440584, 423098, 406443, 398301, 385538, 385528, 393503, 399128, 391309, 384510, 379096, 379580, 374497, 365958, 347571, 329466, 321633, 314238, 307836, 288541, 275511, 260838, 245827, 234049, 223924, 213427, 202952, 193404, 192875, 196391, 204599, 203838, 203698, 199587]
12908A99587j1151j0923q632j3601j6546j9164j5488j2328n878j289R234K3818
12896A17639L1795K9720L5533L9830M7757K6784J3376P978j768j3625k7090l3176
12884B74753l1521k5899j9223j0162j4953j0577p511o637L672J6825Q206n829
12872A71144M241N875j80L636M010P799J50R70R903L445o808j3444j2852j4493
12858A63396j5457j6678m3K847m636J132J71j0585j5N168o822j0131j0849j0227
12844H7271m636j0586m824k787j809k257L658J0226J4395J5231J7504M603p410
12831A18579n783p057j2100j4290j2222j2216p007l700k682l259J792M676P855
12818E2586K153K792n430p738n471m702n499l664k689q930j2409M95J7401J9987
$$ y = [199587, 188436, 177513, 168881, 155280, 138734, 119570, 104082, 91754, 85876, 84587, 93821, 117639, 149434, 179154, 214687, 254517, 302274, 329058, 342434, 350412, 348644, 335019, 307929, 274753, 243232, 217333, 198110, 187948, 172995, 162418, 154907, 148270, 151942, 168767, 176973, 171144, 175385, 181260, 181080, 184716, 188726, 196525, 196675, 197645, 207548, 210993, 204185, 190741, 177889, 163396, 147939, 131261, 131218, 134065, 129429, 130561, 130732, 120147, 120132, 125300, 118478, 108347, 97498, 87271, 82635, 72049, 67225, 64438, 62629, 60372, 64030, 74256, 88651, 103882, 121386, 125989, 118579, 112796, 105739, 93639, 79349, 67127, 54911, 47904, 44204, 41522, 38263, 40055, 44731, 52586, 54739, 57531, 52101, 44363, 38892, 34190, 28691, 25027, 22338, 13408, 999, 1494, 18895, 38882]
12804C8882J2864J0270J2536Q200O317K550p646o690n581l855p639n427j316l331
12790E0134j482m237r31j968m77o718K036P765k913m831M708N253P59j948L819
12775D8969N248l361J549J507K889j065K891j551n842j019M375O124j843k159
12761E6712l522k895j894p789J12n270o894k448M277r33j1411l623p414N196J4425
12746B6629R260J0339K517L79k293L520L428Q564J901L722N291L342L00n839n087
12731F5973J480j595m513l238m947q978l180j622J086J0494J935p562r566Q900
12717D4667L396j013m330p59j267m383L323J184l076m59m484k854j3745K510O745
12702B5455K860j746m955J897j983J364l124J324l158o680j826J392k527j359
$$ y = [38882, 51746, 62016, 74552, 82752, 89069, 91619, 83973, 77283, 71702, 67847, 60208, 54781, 53465, 50134, 48652, 44415, 43484, 41516, 41039, 34321, 36357, 44122, 41209, 36378, 41086, 46339, 47098, 45150, 48969, 54217, 50856, 52405, 53912, 56801, 55736, 58627, 57076, 51234, 50215, 54590, 60714, 58871, 56712, 53190, 50295, 48401, 40612, 40724, 35454, 28560, 26112, 30389, 29456, 18045, 14422, 7008, 12204, 26629, 35889, 46228, 48745, 49124, 46831, 50351, 53779, 62343, 64244, 67966, 73257, 76599, 76899, 71060, 65973, 67453, 65858, 61345, 58107, 53160, 44182, 41002, 39380, 40466, 50960, 52895, 45333, 35767, 44667, 48063, 47050, 42720, 41961, 40694, 36311, 39634, 40818, 37742, 37283, 32799, 29945, 16200, 18710, 25455, 28315, 26569, 21614, 23511, 21528, 22892, 19768, 21092, 17934, 11254, 9428, 10820, 8293, 6934]
12688F934o18K620l85m370M164J592k319Q60O025J246k309r98k901K84R315o369
12672A2771q173L329K813K680l023M544J0762l636j3111L243l873r25M260O517
12658A8178m955m375r89M454j032n177l289N87L662k567l15j69K218j18L286P426
12642A6825l400q098M58J0050N939j144k59l697r514m778L246N315N007O10k195
12627A4365L912O3N523P826Q33l785J652K06O592J0341K805p47Q431M489J5959
12612G8465J8391Q968R388N729N514J3235J0611J4553K8255M1688P4268J23909
12600D32974J86262K49532K82417K64319K28492J47349K448j28001j96096k45559
12590A224137k74749k46582j87458j30577q7311n4669m6801l2981j9803j6498
$$ y = [6934, 6316, 8936, 8551, 4181, 8345, 9937, 7618, 8478, 14503, 15749, 13440, 12442, 9541, 9825, 19140, 12771, 4598, 7927, 10740, 13420, 10397, 14941, 25703, 22067, 8956, 12199, 8326, 7401, 11661, 18178, 13223, 8848, 7859, 12313, 11281, 6104, 2815, 3402, 7064, 4497, 4182, 4013, 6231, 6113, 9399, 16825, 13425, 5327, 5785, 15835, 21774, 20630, 20371, 16674, 7160, 2382, 5628, 10943, 15950, 16560, 14365, 18277, 18340, 23863, 31689, 32522, 28737, 30389, 30595, 37187, 47528, 50333, 49586, 58017, 62506, 78465, 96856, 105824, 115212, 120941, 126455, 139690, 150301, 164854, 193109, 234797, 309065, 432974, 619236, 868768, 1151185, 1415504, 1643996, 1791345, 1793793, 1665792, 1469696, 1224137, 949388, 702806, 515348, 384771, 297460, 242791, 195990, 163009, 143206, 126708]
12580A26708r534K894k308J689M381j0395j6294q477j2113r629m52k76o245j2056
12566D7893l29n58o944o279q691j1152l546N483j1438q658K564M864Q841Q183
12552B0233M798N96L827n479m529l657J341O646R963j276J237P967O120Q424L704
12537E9915n359L535k326j683o028k603m916l838n948m439k557L167j040K475
12523B8355o828n258N17o601q65K370M011K804K36l888n840L13J778l215q22R10
12507G977K221O424o31J26J504j195l868M9k794L091K708l123L77j8o496r90k836
12490B526k884J43N360R201K991j075j722M127L31k470L714M447m388l480j548
12475A5273k657M788k31k846N658O152K098k348l319l648k475Q211l547k149j665
$$ y = [126708, 117174, 120068, 117760, 119449, 123830, 113435, 97141, 88664, 76551, 66922, 66470, 66194, 59949, 47893, 47564, 47006, 40062, 33783, 25092, 13940, 10394, 15877, 4439, -4219, -1655, 3209, 12050, 20233, 25031, 25627, 29454, 23975, 19446, 15789, 17130, 23776, 33739, 32463, 33700, 41667, 47787, 56211, 59915, 54556, 58091, 55765, 54082, 48054, 45451, 40535, 36697, 30749, 26310, 23753, 26920, 25880, 28355, 21527, 16269, 16786, 10185, 9320, 11690, 15701, 18505, 18741, 14853, 9013, 9326, 11104, 7889, 7067, 7977, 10198, 16622, 15991, 16117, 17621, 16426, 12558, 12607, 9813, 12904, 15612, 12489, 12866, 12848, 6352, 5362, 2526, -358, -215, 5145, 14346, 17337, 16262, 14540, 18667, 18998, 16528, 20242, 24689, 20301, 16821, 15273, 12616, 17404, 17173, 14327, 19985, 26137, 28235, 25887, 22568, 18920, 16445, 24656, 21109, 18960, 17295]
12460A7295j648L79m200n590p02Q21J257p12k57J043j296m379o115l578M367J720
12444a595J532m9k138L460R75q842k534P294N570L606L369J200n804j371Q262
12429A2935N206k885j492k413J391N72N366L818J014j290o183L030j069K315j40
12414B0175n580J758L987j186l027l410o485n282J376O68m021R426L594n355j605
12399E033k141L032Q989R53l100N466O384L626q538r840K557P204j228M373k887
12384A9883m685m84m982l213K481N165o269K99J1017J3951J6383K2666J9240J6627
12370A08079K4441J4548J328m901j2388k5444l0571k0460j7400j0094j723o06
12358B4809k763k591n15l090P823K557j353K948k359p94p811j4007o531O167L890
$$ y = [17295, 15647, 16026, 11826, 6236, 5534, 6355, 7612, 6900, 6643, 7686, 6390, 2011, -4104, -7682, -3315, -1595, -63, -112, -2250, 1210, 2185, -6657, -9191, -1897, 3673, 7279, 10648, 11848, 6044, 4673, 12935, 18141, 15256, 13764, 11351, 12742, 13314, 18680, 22498, 23512, 22222, 16039, 19069, 18000, 20315, 20175, 14595, 16353, 20340, 19154, 16127, 12717, 6232, 950, 2326, 2994, -1027, 8399, 11993, 6638, 5033, 2892, 5924, 14913, 15866, 12766, 18232, 24616, 28242, 19704, 9864, 12421, 19625, 18397, 22770, 19883, 15198, 14714, 9732, 6519, 9000, 14165, 7896, 8195, 19212, 33163, 49546, 72212, 91452, 108079, 132520, 147068, 148396, 143495, 131107, 105663, 75092, 54632, 37232, 27138, 25415, 24809, 22046, 19455, 18940, 15850, 23673, 26230, 24877, 27825, 25466, 24672, 16861, 2854, -3677, 2490, 6380]
12343F380J212M037j256n798M39M80J419Q26J789m093K820J105n448Q504K66l980
12327H702k24R146L987p236n802K06M966N963p556j0156j50k337J592L198m018
12312B81l910K456M183K749q09n092L071k498J823Q448K459n896m699r22K759
12297D403K525L810m04L747K398m813j233J444Q56l686l697q50m282k794J417
12282a159r37J734L500M047L393j522M297l841n103l351m424j59O536j664o198
12267d851K109N058n184j127M726K342L932q78q553m81M796M573L69j218j620
12252C993m657L26N22K125l199L158l542n670o292R675O249J698p356l655O006
12237f19L012k935q706K064P669K041n868p814L575Q951N283M43o071n447k901
$$ y = [6380, 7592, 11629, 10373, 4575, 5014, 5494, 6913, 7739, 9528, 5435, 8255, 9360, 3912, 12416, 12682, 8702, 8478, 17624, 21611, 14375, 8573, 8779, 13745, 19708, 12152, 1996, 1846, -491, 1101, 4299, 281, -3629, -1173, 3010, 5759, 4950, -142, 2929, 431, 2254, 10702, 13161, 7265, 2566, 1644, 4403, 6928, 10738, 10334, 14081, 16479, 11666, 10433, 11877, 12733, 9047, 5350, 4500, 218, -2576, -1159, -2096, -362, 3138, 7185, 10578, 9056, 13353, 9512, 4409, 1058, -3366, -3525, 3011, 1347, -4851, -2742, 2316, -2868, -3995, 731, 3073, 7005, 6127, -2426, -2907, 1889, 6462, 6831, 5613, 3993, -664, -338, 184, 2309, -890, 2268, -1274, -6944, -13236, -3561, 2688, 4386, -2970, -6625, -619, 2393, -542, -9248, -7184, 485, 2526, -3342, -11156, -7581, 1370, 6653, 7096, 1025, -4422, -7323]
12222g323j67K123m875P065L891J640j46k353o018r21M991M210P732N265K544
12207A7658r451n081l913L340K892M65j30K184k743p070J320K454M079L265m03
12192H866m689K270k849p362J52J003m85j44m495K296M90n464j942R525M471n509
12176c866j376M385l908P16m082r79R322P651l368o351p409N750O387N345N166
12161A3383J47l215m97M560k97p824m337K244N283J918Q029L102K575J138R294
12146C5503J2984J9029K2803M0126N1779O0961N4188M1879L2123J064l3801n4044
12134B84594n8715n3031m7563l3374j9673j3957l163k133j0843q655k244m955
12122B6288k804m487n650o77j149K818L49k801O548m593j619j605j768K160M24
$$ y = [-7323, -7490, -5367, -10242, -3177, 714, 2354, 2208, -145, -6163, -7084, -2093, 2117, 9849, 15114, 17658, 8207, 3126, -787, 2553, 5445, 5910, 5780, 7964, 5221, -1849, -529, 1925, 6004, 9269, 8866, 4177, 6447, 3598, -3764, -3612, -2609, -3094, -3238, -7733, -5437, -4947, -10411, -12353, -2828, 1643, -3866, -5242, -857, -4765, -4049, -8131, -9110, 212, 7863, 4495, -1856, -9265, -3515, 2872, 8217, 13383, 13530, 10315, 9818, 14378, 14081, 6257, 1920, 4164, 9447, 11365, 19394, 22496, 25071, 26209, 35503, 48487, 67516, 90319, 130445, 182224, 243185, 297373, 339252, 371375, 372439, 338638, 284594, 225879, 172848, 125285, 91911, 72238, 58281, 55118, 52985, 42142, 33487, 31243, 26288, 23484, 18997, 13347, 12670, 11521, 14339, 14688, 11887, 18435, 13842, 12223, 10618, 8850, 11010, 11434]
12107A1434n212Q4K973o19m048n494p53M021o092o025K994l513M81J3735R785
12092A3751j226j094L860o584r097J301M756j292o206M100O772o010p801j132
12078e902j005L938J800Q67J670O229J931l144l995K860N514j375o195K238m276
12063A155n032l406L24j306j281Q622R405J958o183n515K746J05k411K300J680
12048C161m170K452o209J276K935k950m462L344N517l71k193k699k315Q871K368
12033D555p858l692O896N261j325l273Q55M178j757m916M831J88l672J185O211
12018G667n726r265p20R05l035k218L323P212J842k461n650P08K76l66Q76L58
12002f274O675k154o193K380J768m631M61o16Q26M769r50k426M376j710n810J650
$$ y = [11434, 6222, 6306, 9279, 8660, 4612, -882, -1635, 2386, -3706, -9731, -6737, -10250, -9769, 3966, 13751, 12525, 11431, 15291, 8707, -390, 911, 5667, 4375, -1831, 2269, 9041, 3031, -4770, -5902, -6907, -2969, -1169, -302, 1368, 7597, 9528, 6384, 2389, 5249, 10763, 9388, 3193, 5431, 1155, -3877, -7283, -6959, -8265, -9546, -924, 8481, 10439, 4256, -1259, 1487, 1592, -819, 1481, 3161, -1009, 1443, -4766, -3490, -555, -3505, -7967, -4623, 894, 523, -1670, -4369, -6684, 2187, 4555, -3303, -6995, -99, 5162, 3837, 564, 1419, 5597, 3840, -1076, 3755, 3943, 271, 1456, 7667, 1941, -7324, -8044, -7139, -10174, -12392, -9069, -1857, -15, -2476, -8126, -7418, -7142, -7508, -6632, -6274, 401, -1753, -7946, -5566, -3798, -8429, -7968, -8584, -7758, -2989, -3939, -6365, -1989, -3699, -9509, -7859]
11986g859K703J752j003M939J594p133l819K887O294k282m859n844K205K916K544
11971d965n658n22L873K998K891K669L827k06n30K901m893q831K625M172N458
11956E809l817k818j050l83L777Q085k547r545j131J377K283k934O88k361L808
11941g59k755j268l761Q476j63n486j1778Q59K504L208L250P597k443o105l817
11926a2441K304j635m828l06R889L839J793k817M311q30K375Q121J041n107o078
11911c69P75j395J936k390q1J791O777m264k62Q133k008o219J598l127k955j328
11895c388J595P147m258j376K204m753q538j933J428O883k755K070J0583K603
11881G512k369m695n455m822J555J0801J312N145J717p648l039K030L42l841J926
$$ y = [-7859, -5156, -3404, -4407, 532, 2126, -5007, -8826, -5939, 355, -1927, -6786, -12630, -10425, -7509, -4965, -10623, -11145, -7272, -4274, -1383, 1286, 5113, 4907, 4377, 7278, 2385, -6446, -3821, 351, 5809, 1992, -826, -1876, -2259, 1518, 9603, 7056, -2489, -3620, -2243, 40, -2894, -2206, -4567, -759, -3514, -4782, -8543, -67, -230, -5716, -17494, -16635, -14131, -10923, -7673, -76, -2519, -8624, -12441, -10137, -11772, -16600, -16906, -7017, -3178, -1385, -4202, 109, -721, 1654, 9775, 10816, 5709, -369, 406, -989, 947, -1443, -1524, 267, 7044, 2780, 2518, 10651, 8643, 2424, 4022, 895, -2060, -3388, -1793, 5354, 1096, -280, 1924, -2829, -11367, -13300, -11872, -4989, -7744, -5674, 4909, 7512, 5143, 448, -5007, -9829, -8274, 2527, 3839, 8984, 10701, 3053, 14, 2044, 2386, -1455, 471]
11866D71K805L418N189n322o507J08l148o443J968O118M592M230p652q974K781
11851f366k319O51l546J157M617J789M542j628M972O45m210l355j714K385k979
11836e359L538N95l390k273j329m368J13K177J006K95O669L543j304R67m951j503
11820e574O201L03Q61M748J452k04n318k182O368N257n475r620j27K628K808K400
11804D526L668J925J402Q84k557m789M452k118n079l239L589R296Q104o225r358
11789D481l185k493n181J353P065p606k717K800J894Q878L30l897m864j309K195
11774b256O306N398r168n606J322K613Q276J78n237o914k097J441j183k712K394
11759g245L548L526k075j883K733m19q465K205M243Q66L200l563R71M436j952
$$ y = [471, 3276, 6694, 11883, 6561, 54, 162, -2986, -9429, -7461, -1343, 3249, 7479, -173, -9147, -6366, -8685, -8034, -11580, -10423, -5806, -4017, 525, -1103, 3869, 4514, 304, -3051, -4765, -2380, -5359, -1821, -1226, -4616, -6889, -8218, -12586, -12473, -10296, -9290, -8995, -2326, 1217, -87, 880, -4071, -5574, 627, 930, 1791, 6539, 7991, 7787, 2469, 287, 6655, 11912, 6437, -3183, -3310, -682, 2126, 4526, 8194, 10119, 11521, 12405, 9848, 5059, 9511, 7393, 2314, -925, 2664, 11960, 20064, 13839, 4481, 1296, -1197, -6378, -5025, 2040, -5566, -8283, -5483, -3589, 5289, 5619, 1722, -3142, -4451, -2256, 4050, 9448, 280, -5326, -4004, -1391, 6885, 7063, 1826, -5088, -7185, -5744, -6927, -9639, -7245, -3697, -171, -2246, -4129, -1396, -1815, -10280, -8075, -3832, -2966, 234, -3329, -2358, 2078, 126]
11744A26l912J618j655j011k703Q01K186M493O492K229n935m456l36l463o23r88
11728g137k037p29J193n129L191J687K64J876K256N194M943N246k376j3177o933
11713a1668M302N310m88M323M643P684l648j928l760J249J363o117j609K883l849
11698a310m437K027j000K649K981L743j431m16p767O27N448n61N608l68L241J036
11682A0070o670k756K650K995p083m038M932M287o027l819K441M17n770q78K970
11667f279k43J819n744o685l82L925J389Q035k769n724n754M783O743P33O48r80
11651f485K698m017k728K908J389k280L571r4k938j317m521M188O897rp284o893
11635a6915l394O239O914j750J002O687J172k279j079J383O523M56n925l557r645
$$ y = [126, -3786, -2168, -3823, -4834, -7537, -6736, -4550, -57, 6435, 8664, 2729, -1727, -2063, -5526, -6149, -7137, -9174, -9903, -8710, -13839, -10648, -8961, -8697, -6821, -4565, 629, 5572, 10818, 8442, -4735, -11668, -7366, -2056, -2544, 1779, 6422, 14106, 10458, 8530, 4770, 6019, 7382, 1265, -344, 2539, -1310, -5747, -3720, -4720, -2071, 910, 4653, 3222, 2806, -4961, -4334, 1114, 553, 6161, 5793, 9034, 10070, 3400, 644, 3294, 6289, -794, -4832, 100, 4387, -1640, -5459, -3018, -2601, -8371, -9249, -6279, -6522, -4703, -10447, -17132, -17514, -13589, -12200, -4165, -6934, -12658, -18412, -13629, -6886, -6153, -5505, -6485, -3787, -7804, -10532, -7624, -6235, -8515, -4944, -5038, -7976, -9293, -13814, -9626, -2729, -2738, -10022, -16915, -20309, -14070, -7156, -8906, -7904, -1217, -45, -2324, -3403, -2020, 4503, 4959, -966, -4523, -14168]
11620a4168J785O747L539l9J941K172L441k085m683L944M188m811L180o010K045
11605A186o691m761P163P051R86j678l827j517q020l81k150P91O170L391j629
11590c916j895o252j0010K65J0298J201P51J191K180M810o286M546M998J137l94
11575B624O182R818o546q902L21j06p966j639L115K779M03k539k504J077q316
11560a2199m179K965N031k845J628R407N848k156p270L353j134r889p043O393
11546a2090O457N601M236k589j049l005L031n473R95j916l791J536K039Q15J641
11531c562O111K631J440K849l589o420R72L343k228K09J183m172l98k431P1O296
11515B305L354R35n993J38J716l218L182J489N17r290p184M582O392r12o898O167
$$ y = [-14168, -12383, -5636, -2097, -2136, -195, 1977, 5418, 3333, -1350, 2594, 6782, 1971, 5151, -859, 1186, -5505, -10266, -3103, 3948, 4934, 3256, -571, -2088, -10108, -10489, -12639, -11848, -5678, -2287, -3916, -5811, -12063, -22073, -21808, -11510, -10309, -9558, -8367, -6187, -1377, -7663, -3117, 1881, 3018, 2624, 8806, 18624, 12078, 3176, 3497, 3391, -4575, -6214, -3099, -320, 83, -2456, -4960, -3883, -12199, -16378, -13413, -8382, -11227, -9599, -192, 5656, 3500, -3770, -417, -1551, -11440, -18483, -12090, -5633, -32, 4204, 1615, 566, -2439, 592, -4881, -3886, -5802, -9593, -8057, -6018, -5203, -3562, 2549, 5180, 6620, 9469, 5880, -540, 432, 3775, 1547, 1756, 2939, -1233, -1631, -4062, -3991, 2305, 5659, 6594, 601, 739, 2455, -763, 2419, 3908, 4425, -4865, -12049, -7467, -1075, -1987, -8885, -2718]
11499b718M297L682n888k862K327o86Q60N834N512K440k989q570j645n237j767
11484g410L386J886m89O94L596k424q975o02L89K480N106k122l152K75J503J100
11468d759j92p549K631P496K618k177k335o824p574J896N551R103M64o017k540
11453a0208K106L303k738m532R99J671R75j779j486P516j858k664R544l817p407
11438a0375k982M122n650R7o29J893N570J985M841j714m201k86K421M882J163
11423A137L141Q77l782r599J078K195m032P366O554K270l81p212l621M763M119
11408D873J17M86k70p510m077k39J0081K055p712J663K646m16l412K499m054k477
11392e747Q190N685N06l715j078j795K445p093l398L112M473q15l30l259M649
$$ y = [-2718, 1579, 5261, -627, -3489, -1162, -1848, -988, 4846, 10358, 12798, 9809, 1239, -406, -5643, -7410, -4024, -2138, -2627, -1933, 1663, -761, -9736, -10338, -9949, -7469, -2363, -4485, -7637, -7362, -5859, -4759, -4951, -12500, -9869, -2373, 245, -1932, -4267, -11091, -18665, -16769, -11218, -2115, -1651, -7668, -10208, -8102, -4799, -7537, -12069, -11070, -9399, -8424, -10203, -11689, -4173, -6031, -8695, 849, -2968, -10375, -13357, -9235, -14885, -14788, -15417, -13524, -7954, -5969, -1128, -2842, -7043, -7329, -4908, -26, 1137, 4278, 5155, 1373, -8226, -7148, -4953, -8985, -1619, 4935, 7205, 6824, -388, -4009, 754, 4873, 4990, 5476, 5206, -2304, -6381, -6620, 3461, 5516, -2196, -533, 2113, 1697, -1715, 784, -3270, -5747, 2443, 8128, 8634, 4919, 3841, 2046, 4491, -2602, -6000, -2888, 1585, 770, 440, -2819, 1830]
11377A830J108p154L670N267K641j111R17K070O591J772k814p305j0905O085K068
11362D730k107Q7j430J814N790m54r267m636J514L236j690k545j469m801Q862
11347b366N991p309j880l997K967L776j458m081M669N442L928k620K084J682m428
11332B400M01K023o190l691j030L452J306K359l095K243P303n340l065J253k936
11317b607k735J156J081l53N466R1Q22K032n5q727k340j197k653p142K421R069
11301e671j547m940k491M079J3176M660m468q19r4K229L099k926N356l047j169
11286E427j811j520j356l502l716L351l17o86j974M746j277q33N081r20p01K382
11270B374P53l476j953L25j860M308M090m93j312j145n55q319k569j603m528J524
$$ y = [1830, 2938, -4216, -546, 4721, 7362, 6251, 7168, 9238, 15829, 17601, 14787, 7482, -3423, 2662, 4730, 2623, 2710, 1280, 3094, 8884, 8430, -837, -5473, -3959, -723, -2413, -4958, -6427, -11228, -2366, 3625, -3684, -5564, -9561, -6594, -2818, -4276, -8357, -3688, 1754, 5682, 3062, 5146, 6828, 2400, 2801, 4824, -1366, -5057, -6087, -2635, -1329, 1030, -2065, 178, 7481, 2141, -924, 329, -2607, -5342, -4186, -3105, -3458, 2008, 2099, 2921, 4953, 4898, -3829, -6169, -7366, -10019, -17161, -14740, -5671, -7218, -12158, -14649, -10570, 2606, 7266, 2798, 1979, 1885, 4114, 7213, 4287, 9643, 6596, 5427, 3616, 2096, 740, -2762, -6478, -3127, -3444, -4130, -6104, -1358, -2635, -3468, 1613, 693, -8, 2374, 3127, -349, -2302, -1977, -3837, 471, 4561, 4068, 2756, 1611, 1056, -7263, -9832, -11435, -15963, -14439]
11254a4439L014K581K802p66j602J66K827N921R396K028l723K226J033m717m632
11239B115j034k539n458o056K222J556M125m932j626O063M105J05K385P303n317
11224C017m340j181J51J321J263K723p53n733K853O57L207J037r336P66Q96r48
11208d400l994K321O301J436P38L213m332m983m493N05L251N842K419n54L732
11193G002o00k757n90m431K156l085n525p2m210Q10R95L059L722j361M365M751
11177D229J724k533L789L607J135n783j671o753J163N7r224m306R923O422o159
11162d380K117l333j386J23K033L031k124n103r46M35m997L987Q719n414K158
11147e080l311m916O5O888J40q91N212p23r39m070p740o69R225O833M561l630
$$ y = [-14439, -11425, -8844, -6042, -6808, -8410, -8244, -5417, 504, 9900, 11928, 8205, 10431, 11464, 6747, 2115, 1081, -1458, -6916, -12972, -10750, -9194, -5069, -10001, -11627, -5564, -1459, -1354, 1031, 8334, 3017, -1323, -2504, -2353, -1032, 231, 2954, 2201, -3532, -679, -22, 3185, 4222, -5114, -4348, -3452, -4400, -8394, -6073, 228, 1664, 2402, 5615, 1283, -3700, -8193, -7688, -4437, 1405, 3824, 3270, 7002, 6402, 3645, 3055, -1376, 780, -2305, -7830, -7902, -12112, -11302, -10307, -7248, -3526, -4887, -522, 4229, 5953, 3420, 7209, 10816, 11951, 6168, 4497, -2256, -1093, -1036, -10260, -14566, -4643, 1779, -4380, -2263, -5596, -6982, -6859, -4826, -1795, -3919, -9022, -9968, -9533, -14530, -10543, -1824, -7238, -5080, -8391, -13307, -13242, -6354, -6214, -7105, -1893, -2616, -3555, -7625, -15365, -16034, -6809, 24, 4585, 955]
11131I55l446k165J421l99K61K805m64n121p730J323K642O839Q386m731l505L17
11115b612n46J530j4696r647M403N505J0878l90n641j980M951Q476O634J804p119
11100A550M13m779m697K170K81M667O611M921q99k82L554O75k002m978k052k356
11084B797n557m707k414P537M61j441L365j773J05L598k308J883k869L859J983
11069D519o122K050K203k836K171n205R50k192J389P813K841m558R15j725q147
11054e934k678r55J28L939j417q89j580Q329l379j0871p887L19M400M456Q6q62
11038a4795N839M055J57j887N81L01O379m4p43l808J816K502p89k523P34N312
11022C087L41r16l785L080L308k692o67J672o781k58k914l343L34K858L472m608
$$ y = [955, -2491, -4656, -3235, -3634, -3373, -568, -1032, -6153, -13883, -12560, -9918, -3079, 5307, 576, -2929, -2612, -3158, -1628, -16324, -25971, -21568, -16063, -5185, -5575, -11216, -13196, -8245, 231, 6865, 8669, 1550, 1963, -2816, -7513, -5343, -5062, -395, 6216, 11137, 10238, 9956, 13510, 14185, 12183, 7205, 5153, 2797, -2760, -7467, -9881, -2344, -1883, -3324, 41, -1732, -1627, 1971, -337, 1546, -1323, 2536, 4519, -1603, 447, 2650, -186, 1985, -3220, -2270, -4462, -3073, 4740, 7581, 3023, 3938, 2213, -5934, -8612, -9567, -9439, -5500, -6917, -7806, -9386, -1057, -4436, -15307, -23194, -22875, -18475, -14019, -13933, -14795, -8956, -4901, -4744, -6631, -6050, -5749, 630, 586, -157, -3965, -2149, 353, -436, -2959, -2225, 3087, 3428, 2512, -1273, 1807, 5115, 2423, 1756, 3428, -3353, -3611, -6525, -9868, -9534, -6676, -3204, -7812]
11006g812M225Q516L085l362k383O145J371k743p076J585P172L921r79J78o649
10991E194K275L712q223J135J315J364o09p551n707N474M556j146j463l096p475
10976a0245r576j198Q349M433K824O07R67J235l307j08J684J283k505j746K804
10961d499K403J90k033J782o96o156P640L027J169k622j429N2l369J914m283M421
10945b489K124O089J94o577L138J264M065r04N60o639p232l107J271N209L068
10930C4j536M014J583l070o539K836J202m699l759j838l48R290M278R34j167j660
10914d45r23M481j411l466j734l853l156L563M268k957K741l149M33K683n950
10899h875L049J321j803j648J851Q204K080j668q918j108J1267k311l854N988
$$ y = [-7812, -3587, 4929, 8014, 4652, 2269, 8414, 9785, 7042, -34, 1551, 8723, 12644, 11665, 11843, 5194, 7469, 11181, 2958, 4093, 5408, 6772, 6163, -1388, -7095, -1621, 2935, 1789, 326, -2770, -10245, -19821, -21019, -12670, -8237, -5413, -4806, -3839, -2604, -5911, -6019, -4335, -3052, -5557, -7303, -4499, -2096, -1906, -3939, -2157, -2853, -9009, -1369, 1658, 2827, 205, -1224, -1172, -4541, -2627, -6910, -2489, -365, 5724, 5918, -659, 2479, 3743, 7808, 6904, 7464, 825, -6407, -9514, -8243, -3034, 34, -1502, 2512, 4095, 1025, -5514, -2678, -1476, -6175, -9934, -11772, -12120, -2830, 1448, 2382, 1215, -445, -1368, 3113, 1702, -1764, -3498, -7351, -10507, -6944, -2676, -5633, -2892, -6041, -5608, -2925, -8875, -5826, -4505, -6308, -7956, -6105, 2099, 4179, 2511, -6407, -7515, 3752, 1441, -2413, 3575]
10885C575l463J718K601n925j0013L28J0188L594j0078l591l597K09M017O116
10871d321O81M47j629m376k533K626R112K125K976m949P475j695o315q525k724
10856a1625N595Q336j654m102k39k54l784J90J095k299j801J685J631L091j296
10841e431l039j206M33M508O843P591K21K74m229m690J142R638N568j0688j094
10826E841r76j558o400M449L602N025J769J225m547r108p431J857L041L26l114
10811e999L195p613n442P406p64m853L539L895J456K48j021j468J451L220N928
10796C178L979q16l110l301k439o052J685M935M431o006j202j257k338Q15q23
10781h321J597N859M239j972k777n233j319J063l45j313L282N775J848o962p094
$$ y = [3575, 112, 1830, 4431, -1494, -11507, -11179, -991, 2603, -7475, -11066, -14663, -14454, -10437, -4321, -3640, -3193, -4822, -9198, -11731, -9105, 7, 2132, 5108, 159, 7634, 5939, -376, -8901, -11625, -6030, 2306, 652, -3450, -3689, -3943, -7727, -7537, -6442, -8741, -10542, -8857, -7226, -4135, -5431, -8470, -9676, -9243, -4735, 2108, 9699, 9920, 10194, 5965, 1275, 2417, 12055, 17623, 6935, 5841, 4865, 3307, -3093, 1356, 4958, 9983, 11752, 12977, 8430, -678, -8109, -6252, -3211, -2885, -5999, -2804, -10417, -15859, -8453, -9217, -14070, -10531, -6636, -5180, -4932, -5953, -7421, -5970, -2750, 3178, 7157, 6341, 3231, -70, -2509, -8561, -6876, -1941, 2490, -3516, -4718, -5975, -8313, -7498, -8321, -6724, -865, 3374, 1402, -1375, -6608, -7927, -6864, -7209, -8522, -5240, 535, 2383, -4579, -11673]
10766a1673P563K02J032Q325m223j503p238l299J907n199M316N119K004m38r906
10751a3011L676J1456m453o98P281P72l775L662l056K134L254n930n738k955l576
10736a0957K397O845k811n27Q354K709n035r527n812R19R59N887J32n707N44K181
10720i449L772j35n98r18J1469j336q471J159j170N957L538j339j235l414Q35
10705a335n70K257n46n884n661L167Q385J604j710j712k415K061l832J517K231
10690b443k125m594K026J1382R8k979L901L206j858q372m698k812L356P295J431
10675B814j973L272M665l642j2257j2590l412P05L822M492l58k756j264J746L853
10660a2883O765k275Q95Q04M028L345M219M784l971j251k463m484J265n398p586
$$ y = [-11673, -4110, -3908, -2876, 5449, 1226, -277, -7515, -10814, -8907, -14106, -9790, -4671, -2667, -3105, -13011, -9335, 2121, -2332, -3030, 4251, 5023, 1248, 4910, 1854, 3988, 7242, 1312, -4426, -7381, -10957, -8560, -1715, -4526, -5053, 3301, 6010, 975, -8552, -14364, -13445, -12486, -6599, -6467, -12174, -11630, -9449, -5677, -5812, -6410, -7328, 4141, 2805, -5666, -4507, -5677, 280, 3818, 2479, 1244, -2170, -1335, -1905, 352, -194, -6078, -11739, -8572, -187, 1417, -293, -2005, -4420, -2359, -6191, -4674, -2443, -4568, -9162, -7136, 4246, 4344, 1365, 5266, 8472, 6614, -1758, -6456, -9268, -5912, 1383, 2814, 841, 4113, 8778, 5136, -7121, -19711, -23123, -22418, -18596, -14104, -14462, -17218, -18482, -16736, -12883, -6118, -8393, -7498, -6694, -2666, 679, 4898, 9682, 5711, 4460, 1997, -2487, -1222, -6620, -14206]
10645a4206N657O817N825K180l766k670k708k633J155J306p98L877L271j367q021
10630f081l345n40k614j254R452P824K586j97p139m215j350J406O37j91K194K570
10614b57L263P237L066L5q726m740L884n936k73J545q653k488L744l217R223P328
10598E035J383J198p244q250Q74O670o248j2221J668R326m79N054j285m970P55
10583h734M012n229j276J650P346o329l882q61J118L91J453O13N141Q48O56m88
10567c571p94l28j669Q36P6o360M764n064R09N455M008O415O52n764Q25L183J061
10550D634o538p808l048J261P678K240J114K230n15N967j336m307K124J598j778
10535C516K205J16K519L419L93q377m166j241K654o226l564J083N101n9l341l258
$$ y = [-14206, -8549, -1732, 4093, 6273, 2507, -163, -2871, -5504, -4349, -3043, -3841, 36, 3307, 1940, -6081, -9426, -9966, -12580, -13834, -4382, 3442, 6028, 5831, -1308, -5523, -6873, -5467, -4830, -5021, -2827, -257, 3006, 10243, 13309, 13344, 4618, -122, 3762, -2174, -2447, -902, -9555, -12043, -8299, -11516, -2293, 5035, 6418, 7616, 372, -7878, -7004, -334, -6582, -18803, -17135, -7809, -8288, -3234, -4519, -9489, -8734, -4722, -9951, -11227, -9577, -2231, -8560, -12442, -13303, -12185, -11794, -10341, -9728, -4587, -3739, -3083, -3571, -4365, -4693, -6362, -5526, -5450, -11810, -7046, -12110, -11201, -5746, -1738, 4677, 5329, -435, 390, 3573, 4634, -1904, -9712, -12760, -11499, -3821, -1581, -467, 1763, 1248, 7215, 5879, 1572, 3696, 5294, 3516, 5721, 5837, 8356, 11775, 12168, 3791, -375, -1616, 1038, -5188, -8752, -7669, -2568, -2627, -5968, -9226]
10519i226j016L179j786n554l027n433Q06k483P290N429R387L641j364m199l584
10504g940j895j433L826M257K138P064n855m634M122M920N584j321r52m898L4
10489C017r80o389L683M173o96J746N74M421k584o525J042N664j919q555l373
10474f701k323m949j785N876J687N532o565k946K135N396l518M298M318n08j156
10459a209m681K70L951J259j25m79k08M185R595l617o051n423k624k174M735N236
10443B640Q019J962n386j797k862m813l439K931P429M170N156p201k388m889l946
10428d414K343k058j954k569n457K708J385L026M086L669L593l390l730o86K060
10413a388j068n233R325J903j384k328O195L240p709n007j74O399k673r594R61
$$ y = [-9226, -10242, -7063, -8849, -14403, -17430, -22863, -22057, -24540, -17250, -11821, -2434, 1207, -157, -4356, -7940, -9835, -11268, -7442, -3185, -1047, 6017, 162, -4472, -350, 4570, 10154, 8833, 7881, 2983, 3017, 2037, -4352, -669, 3504, 2808, 4554, 5128, 9549, 6965, 440, 1482, 7146, 5227, -3328, -6701, -9024, -13973, -15758, -9882, -8195, -2663, -9228, -12174, -10039, -4643, -8161, -3863, 455, -53, -1209, -5890, -5620, -1669, -410, -535, -1014, -1222, 2963, 12558, 8941, 2890, -2533, -5157, -7331, -2596, 2640, 10659, 12621, 7235, 5438, 2576, -2237, -5676, -2745, 4684, 8854, 14010, 6809, 4421, -468, -4414, -2071, -4129, -6083, -8652, -14109, -11401, -10016, -6990, -2904, 765, 4358, 968, -2762, -3448, -1388, -2456, -7689, 1636, 3539, 2155, -173, 6022, 9262, 1553, -3454, -3628, 2771, 98, -9496, -8535]
10398h535M269L238m246j440N947M747r451k718L730K962R082J694m266n902l429
10383d318M348Q02l923P659K320n833L140M502n340p332K2R55l012k87L921J489
10367h87k272k697l944m598J92Q49L296N120J147l459k881j259P74O22J173O556
10351b268L623L502k176k243j0364K303M035n641J504O976J767k976L089r38n22
10336c29K787L948L092P250l166q276k544k322r939m851J777Q125k480m216L102
10321h042O580j457l495m64J985K324K66j379J0325M66l646l473m853n382q73
10306a1118M900P622L201K221p549j870j991m046J226L87l318N47l323K909J0748
10291E46M526l919o617J394O062J1064l466r153l456k691k739R12N684r68k934
$$ y = [-8535, -4266, -1028, -5274, -6714, -767, 3980, -5471, -8189, -4459, -1497, 7585, 9279, 5013, -889, -4318, 30, 832, -3091, 4568, 6888, 1055, 4195, 8697, 3357, -3975, -3953, -2998, -6010, -6297, -2376, -887, -3159, -5856, -9800, -14398, -14206, -13357, -10061, -4941, -3794, -7253, -10134, -11393, -10619, -9997, -8824, -2268, 1355, 4857, 2681, 438, -9926, -7623, -3588, -9229, -7725, -749, 1018, -1958, 1131, 193, -329, 2458, 6406, 9498, 16748, 13582, 5306, 2762, 440, -9499, -14350, -12573, -4448, -6928, -11144, -8042, -1462, -2919, -6414, -6878, -4893, -2569, -2303, -3682, 6643, 7109, 3463, -10, -4863, -10245, -11118, -6218, 1404, 4605, 6826, -723, -2593, -4584, -8630, -7404, -7017, -10335, -9788, -13111, -10202, 546, 5072, 1153, -5464, -4070, 1992, 13056, 9590, 437, -3019, -5710, -8449, -7537, -1853, -2821, -5755]
10276e755k205j642J334m50J835J287N740L789k790N228J517O86o183k670Q269
10261G990L134n263j1063k923L482K382k535M937K846K776m434l13O40j195J1
10246D72J693j139o979k796R599O984q086J274R02j356k300M247K888l172j251
10231I80M109l950L136n353l357L016j767q968K711Q045M021N76q07k352K523
10216B563M715p037n926m462l69j922O813o881J782O080L074R01j257n358j796
10201i080K435J209l01J549N124L894O68p70P87n650K936P144p429n367K803J625
10185A577k307l185P31L377j020l724l883J0092m818l565L508r94p193O499M458
10170d47L312O355j6l44l738M44j865J20n194m313K502j697o152j409Q141J0257
$$ y = [-5755, -7960, -9602, -8268, -8718, -6883, -5596, 144, 3933, 1143, 6371, 7888, 8574, 2391, -279, 7990, 11124, 5861, -5202, -8125, -4643, -2261, -4796, 141, 2987, 5763, 1329, 1016, 1656, 461, 472, 2165, 1026, -5953, -8749, 850, 7834, -252, 1022, 1924, 568, -1732, 2515, 5403, 2231, 980, 5089, 1139, 4275, -1078, -4435, -1419, -3186, -12154, -9443, -1398, 2623, 3199, 2392, 40, 2563, 7278, 241, -5685, -10147, -10516, -12438, -5625, -12506, -10724, -4644, -1570, -669, -1926, -7284, -9080, -6645, -5436, -5737, -4188, 936, 4830, 5498, 4728, 5515, -135, 2801, 9945, 2516, -2851, -48, 1577, -730, -3915, -3184, 193, -827, -4551, -8434, 1658, -3160, -6725, -3217, -4211, -11404, -4905, -447, 2865, 9220, 9204, 8860, 5122, 5566, 3701, 3821, -1373, -5686, -3184, -4881, -11033, -12442, -4301, 5956]
10154E956l622l509k909l729P528M880k047J116o460m581P140J0343m068m331
10140A707O018m244n594J380j046j853l530K853N263p65l502N86j123M254R28
10125A332j199N149L005p029l858K954L803J069q097q275k54P769l181n344L622
10110h534J1217J1778N135k132m745m058m080k361k287m103p47k373K777K2j072
10095e563R12N580L266J176o683j980l43M77n128q46k96L495K881K249K594J416
10079C207p516P08J5449K929m929k519j498n510L977j309j608l545l203l764j056
10064a0187Q742J761J907L919K563k930n370p67K532J0788J0547J769R855L073
10050C8202l959j753J016o629n730k884k928o895l65q63k319k30m504p910l153
$$ y = [5956, 2334, -1175, -4084, -7813, -285, 4595, 2548, 3664, -2796, -7377, -237, 10106, 6038, 1707, 7725, 3481, -2113, -733, -1779, -3632, -7162, -4309, 954, 189, -3313, -2727, -3850, 404, 1332, 133, 5282, 8287, 1258, -2600, 354, 4157, 5226, -2871, -11146, -11400, -3631, -6812, -12156, -8534, 2683, 14461, 19596, 17464, 12719, 8661, 4581, 2220, -67, -4170, -4917, -7290, -4513, -4491, -5563, -4651, 929, 4195, 5371, -1312, -3292, -3635, -3158, -8286, -9132, -9428, -5933, -3052, -803, 1791, 3207, -4309, -3601, 11848, 14777, 9848, 7329, 5831, 321, 4298, 2989, 1381, -2164, -5367, -9131, -10187, -1445, 316, 2223, 6142, 8705, 5775, 405, -362, 2170, 12958, 23505, 25274, 35129, 38202, 34243, 32490, 33506, 26877, 21147, 18263, 15335, 8440, 8075, 7212, 4893, 4663, 159, -7751, -10904]
10035a0904k535Q404M110m307O836L259R57l133k717o567m207k043r70P189K662
10020c966o908K210M764O032l902k350K2K219K360M82m827K675L095J186k781
10005C11q08J681M269N54k361n336J721J773o37j383J062q836o862L589Q312N487
9989B536n222j99l412l054L477J145J747P256l42j309l140l775L734J211m703
9974d050k880j349O620Q700l514n340L78o742m100m649L742P666O53l73O103k174
9958a309M259O92m121m677r53M640K448m135n399L770l419p187L329L624N749
9943b689J1871m385L796P13r77P1j659l608O446K483r326K317J288k97k476O11
9927D179n349q191j767P128M82o790K556J1562J369M482K58l599l847r44K062
$$ y = [-10904, -13439, -5035, -925, -5232, 1604, 4863, 5820, 2687, -30, -6597, -10804, -12847, -13817, -6628, -3966, -10874, -8664, -3900, 2132, -1770, -4120, -4098, -1879, 481, 963, -3864, -1189, 1906, 3092, 311, -497, 1184, 5453, 6007, 3646, -1690, 31, 1804, 1167, -216, 846, -7990, -14852, -11263, -2951, 2536, -2686, -2885, -6297, -9351, -5874, -4729, -2982, 4274, 3932, 2623, -517, -4292, -558, 653, -4050, -6930, -8279, -1659, 7041, 3527, -1813, -1435, -8177, -12277, -16926, -13184, -5518, -4865, -5238, 865, -1309, 2950, 3642, -479, -5156, -6109, -1469, 979, -3156, -8555, -4785, -8204, -15391, -12062, -8438, -2689, 9182, 4797, 8593, 9306, 8329, 8400, 6741, 3133, 9579, 12062, 2736, 5053, 6341, 6044, 3568, 4179, -1170, -9361, -11128, -4000, -3518, -10308, -7752, 3810, 5179, 9661, 9919, 6320, 2473, 1529, 3591]
9912C591l279o58o62l272p412n641N920J1921K87k090l985K194P256J94j367N206
9896H203L311J88J27j664p328p552l808k728l232J181J077N476J0631L659J333
9881H874L248r02l423m895M175M745o911n934P15K49J672l040L20L822k352l156
9865b793n308j402N049R265N197j0202m623L056k242k787J471l13k218j98L764
9850d284K920j473K571K976m535r858k063N580L491l300k240J0473Q619J131k832
9835G176m286m20j934Q82m363k110J558J280m884m124K932K2k713M075P513K957
9819C561n040O75N931P765L024j778l579l734L709L513p875j3487n896K285M634
9804f292R106Q52M98K864k266k556L376J478J808l787j0J516l307K716K159M894
$$ y = [3591, 312, -346, -1008, -4280, -11692, -17333, -11413, 508, 795, -1295, -5280, -3086, 4170, 4364, 2997, 8203, 11514, 11702, 11829, 10165, 2837, -4715, -8523, -11251, -14483, -13302, -12225, -6749, 3882, 7541, 8874, 12122, 11220, 7797, 2902, 7077, 11822, 4911, -1023, -308, -59, 1613, -1427, -1107, 2715, 363, -2793, -8101, -9503, -4454, 4811, 10008, -194, -4817, -1761, -4003, -6790, -5319, -5632, -7850, -8048, -4284, -1364, -2837, -266, 2710, -1825, -11683, -13746, -8166, -4675, -7975, -10215, 258, 8877, 10008, 7176, 2890, 2470, 536, 1418, -2945, -5055, -3497, -2217, -7101, -11225, -8293, -8271, -10984, -6909, 604, 3561, -1479, -804, 5127, 12892, 15916, 14138, 10559, 6825, 10534, 14047, 6172, -7315, -13211, -10926, -6292, 2814, 3666, 4164, 7028, 4762, 2206, 5582, 7060, 8868, 5081, 5071, 6587, 3280, 5996, 8155, 13049]
9788A3049O43j614j0337p146J512O341R6l332K920k633p263K172R268M105l806
9773C975l177k626R39P443J401q513Q48K4k287k720m424l45J316L39M93R37R89
9756e388m715n765R361P644K785N432l542o777n328p27K298rk100j470N699L627
9740A025o83K682l564n189p355K031l000j204K264N812M562O59l946l717P55K936
9724e932M394n002K490P13l923N165M432j366j644N520o043m813j391l40r1J282
9708f549o824k951j96P973Q261O847m748q473M931r31n118L336R20J291N014J119
9692C902o868j169K135M534n358K392K182j026P99k644K824l795n774k3K422O817
9676A350n862j854o166o430K018M02L722L099K91J705R291P323m64l759m692j20
$$ y = [13049, 13692, 12078, 1741, -5405, -3893, 2448, 2544, -788, 2132, -501, -7764, -5592, 3676, 7781, 3975, 798, -1828, -889, 6554, 7955, -558, 290, 314, -1973, -4693, -9117, -9462, -8146, -7807, -7314, -6377, -5388, -10103, -15868, -6507, 1137, 3922, 9354, 5812, -965, -6293, -7020, -4722, -4731, -6831, -8301, -2602, 1025, 342, 3024, -540, -5729, -13084, -11053, -14053, -15257, -12993, -7181, -2619, -1960, -5906, -9623, -8868, -5932, -1538, -6540, -4050, -3337, -7260, -2095, 2337, 971, -673, 4847, -1196, -6009, -7400, -7740, -7831, -6549, -13373, -16324, -16520, -8547, -286, 6561, 1813, -6660, -1729, -2660, -7778, -4442, -3522, -2231, 2783, 3902, -2966, -4135, -2000, 2534, -2824, -432, 1750, 724, 1523, -1121, 1703, -2092, -7866, -7889, -5467, 1350, -4512, -6366, -12532, -18962, -16944, -16542, -12820, -9721, -9430, -7725, 1566, 8889, 8425, 4666, -26, -146]
9660a46R985K070L849j40q826K058J132l820p959q41N67l83J990L088r0m18n705
9643c589o94K319k915J312l72L067K327j98l083P210M600l451j2349p594K265
9628a1145P20L231L669K078M049p713l003l10K79k992L215m256l177N055O181
9613d119l319k072O92n83q76L607n728Q4K984O790p522K855J008l844k183k695
9597a4921K039L219k331N750P636l121q011l667M711M775L770j863n576J473N568
9582e49J856J875q34k639j711J083r34k115l082j709P411L522j607l329L087O422
9566F747n452j1864l123j729O799n202O082K935k341p03L925M372M482O801K69
9551A1998k125k417p012k022j782k355J738J049J925K274J777p99m872j0084O725
$$ y = [-146, 9839, 11909, 15758, 15618, 6792, 8850, 9982, 6162, -1797, -2638, -2071, -2454, -464, 2624, 2534, 2116, -3589, -4283, -1964, -4879, -3567, -3939, -872, 1455, 1257, -1826, 5384, 9984, 6533, -5816, -13410, -11145, -10425, -7194, -3525, -1447, 2602, -5111, -8114, -8424, -8145, -11137, -7922, -12178, -15355, -10300, -4119, -7438, -9510, -8818, -9401, -10277, -6670, -12398, -12314, -9330, -2540, -10062, -7207, -6199, -10043, -12226, -14921, -12882, -9663, -11994, -6244, 1392, -1729, -9740, -13407, -8696, -3921, -151, -2014, -7590, -6117, -549, 1307, 3182, 2348, -291, -2002, -919, -1853, -3968, -7050, -8759, -1348, 2174, 567, -2762, 325, 6747, 1295, -10569, -13692, -15421, -8622, -13824, -7742, -4807, -7148, -7851, -3926, 446, 4928, 11729, 11998, 9873, 7456, 444, -1578, -3360, -5715, -3977, -2928, -1003, 1271, 3048, 2249, -2623, -12707, -5982]
9536e982J2132l9j941n797o893o804L564L156N373N52k897n32M43n24J228Q629
9520C668N934l559j520L981O59m158p316L911Q9n603Q35N241N209K992m018p320
9504i75j891K275q944p20L835Rj972l189j897L733J360r6N923N520L003J469m342
9487C101l696k845N818p58o544M020P116j673m287n667j2709j137J0541Q944L68
9472E92m003R1j556j385N686P125K890k481n14k855j360K992L998n466m907l49
9456a502J117L383m898L086j318k181R5K714P573K155o030q042J963L936L844
9441E895j220Q17L103R113K787k786n123n03k949N92K350l572J682L274K954m817
9425A1597n530o591m514m950P891M420m261p433P179R476Q81N02J590q172j0835
$$ y = [-5982, 6150, 6111, 4170, -1627, -8520, -15324, -11760, -8604, -3231, -2679, -5576, -6108, -5665, -6189, -4961, 3668, 9602, 6043, 4523, 8504, 9163, 5005, -2311, 1600, 1689, -3914, -3079, 2162, 7371, 10363, 6345, -975, -2866, -591, -9535, -10255, -6420, -6411, -8383, -11572, -13469, -9736, -8376, -8472, -2549, 2971, 5974, 7443, 3101, -595, -3440, 2378, 1620, -4924, -904, 6212, 4539, 252, -5415, -18124, -19261, -8720, 224, 592, -3411, -3320, -4876, -6261, -575, 6550, 9440, 6959, 6445, 3590, 2230, 5222, 9220, 3754, -1153, -1502, -385, 2998, -1900, 1186, -132, -2313, -2218, 496, 8069, 10224, 4194, -3848, -1885, 2051, 5895, 4675, 5492, 8595, 17708, 20495, 17709, 12586, 12083, 9134, 9726, 12076, 8504, 10186, 13460, 16414, 11597, 6067, -524, -5038, -9988, -2097, 2323, -1938, -9371, -2192, 7284, 8165, 8667, 10257, 2085, -8750]
9410h750k779k590l567K474L383Q302Q174L32l575O14M748m715l911K32K090l785
9394c323l156j822K750L523n774k129M076L712P323l722p681L161Q717k23j167
9379D265o82R168q45n577K031L393L036m641J034K639n642l974n62J56J7l818
9363bo287n332m228J285J514P459O249K249m236j291K096M66l848J364m28k395
9347e365l63n54L742J451m008k152n811j530K266L250m061L749J1359p87J135
9332B321j029j472L44k978M645J542q957n485Q18M136L008l037m982k85j023K636
9316i798L628M54k930m12L292j482P92M344J548m66L302l306L395q7o243l682
$$ y = [-8750, -11529, -14119, -17686, -15212, -11829, -3527, 4647, 4979, 1404, 2018, 6766, 2051, -1860, -1628, 462, -3323, -6479, -8301, -5551, -2028, -7802, -9931, -5855, -2143, 5180, 1458, -6223, -3062, 5655, 5432, 4265, 3583, 12751, 11906, 6329, 8360, 11753, 14789, 10148, 11182, 13821, 8179, 4205, 3643, 3799, 3816, -2, -6289, -11621, -15849, -14564, -13050, -5591, 658, 2907, -1329, -2620, -524, -58, -3906, -2542, -2970, -5365, -5728, -6282, -2540, -1089, -5097, -7249, -13060, -14590, -12324, -9074, -13135, -9386, 1973, 1186, 2321, 1292, -180, 164, -2814, 1831, 3373, -5584, -11069, -10251, -6115, -3107, -6144, -11126, -11411, -12434, -9798, -6170, -5716, -8646, -9058, -5766, -7248, -6456, -2112, -564, -1030, 2272, -1034, 2361, 2274, -3969, -7651]
$$ [...]
##END NTUPLES=NMR SPECTRUM
##END=
