##TITLE=Analysis number 318462
Compound Code cc 50824
Book Reference 481/8
Project Code adrs
Chemist Name bruced
##JCAMPDX= 6.0         $$ Bruker NMR JCAMP-DX V2.0
##DATA TYPE= NMR SPECTRUM
##DATA CLASS= NTUPLES
##ORIGIN= Bruker BioSpin GmbH
##OWNER= nmr
$$ XWIN-NMR		Version 3.5
$$ Wed Mar 29 14:12:58 2006 GMT Daylight Time (UT+1h)  MAYBRIDGE\nmr@NMR_250MHZ
##.OBSERVE FREQUENCY= 250.131544655141
##.OBSERVE NUCLEUS= ^1H
##.ACQUISITION MODE= SIMULTANEOUS (DQD)
##.ACQUISITION SCHEME= undefined
##.AVERAGES= 16
##.DIGITISER RES= 18
##SPECTROMETER/DATA SYSTEM= dpx250
##.PULSE SEQUENCE= zg30
##.SOLVENT NAME= CDCl3
##.SHIFT REFERENCE= (INTERNAL, CDCl3, 0, 16.522)
##AUDIT TRAIL= $$ (NUMBER, WHEN, WHO, WHERE, WHAT)
$$ ##TITLE= Audit trail, XWIN-NMR		Version 3.5
$$ ##JCAMPDX= 5.01
$$ ##ORIGIN= Bruker BioSpin GmbH
$$ ##OWNER= nmr
$$ C:\u/data/dgb/nmr/ADRS/1740/pdata/1/auditp.txt
$$ ##AUDIT TRAIL=  $$ (NUMBER, WHEN, WHO, WHERE, WHAT)
(   1,<2006-03-29 14:12:34.59 +100>,<MAYBRIDGE\nmr>,<NMR_250MHZ>,
      <created by zg, POWCHK disabled, PULCHK disabled
       configuration hash MD5:
       84 BC 41 DB A1 6E 1D 46 DA 25 12 A5 C1 ED C5 3A
       data hash MD5: 64K
       0C 03 69 C3 4D D6 AA A3 D6 22 9F 4E E0 4B B2 B0>)
(   2,<2006-03-29 14:12:48.36 +100>,<MAYBRIDGE\nmr>,<NMR_250MHZ>,
      <Start of raw data processing
       ef LB = 0.3 FT_mod = 6 PKNL = 1 SI = 32K 
       data hash MD5: 32K
       D5 4C DB 9D 58 F8 C2 7D C9 77 34 2D 3D BC 82 D6>)
(   3,<2006-03-29 14:12:50.13 +100>,<MAYBRIDGE\nmr>,<NMR_250MHZ>,
      <apk 
       data hash MD5: 32K
       D1 17 95 9F 12 72 58 0A 83 F7 B0 75 A4 4F 07 9B>)
(   4,<2006-03-29 14:12:50.92 +100>,<MAYBRIDGE\nmr>,<NMR_250MHZ>,
      <abs ABSG = 5 
       data hash MD5: 32K
       FE 0D 60 10 1C 59 44 AE 93 6E EC 4F 80 EC B9 35>)
$$ ##END=
$$ 
$$ hash MD5
$$ 27 37 0A 12 90 A7 4C B8 72 26 EB 86 47 3D AB 0B
##$RELAX= 
##$RELAX= 
##$RELAX= 
##$RELAX= 
##$RELAX= 
##$RELAX= 
##$RELAX= 
$$ Bruker specific parameters
$$ --------------------------
##$DU= <C:\u>
##$EXPNO= 1740
##$NAME= <ADRS>
##$PROCNO= 1
##$TYPE= <nmr>
##$USER= <dgb>
##$AMP= (0..31)
100 100 100 100 100 100 100 100 100 100 100 100 100 100 100 100 100 100 
100 100 100 100 100 100 100 100 100 100 100 100 100 100 
##$AQSEQ= 0
##$AQ_mod= 3
##$AUNM= <au_zg>
##$AUTOPOS= <35 >
##$BF1= 250.13
##$BF2= 250.13
##$BF3= 250.13
##$BF4= 250.13
##$BF5= 500.13
##$BF6= 500.13
##$BF7= 500.13
##$BF8= 500.13
##$BYTORDA= 1
##$CFDGTYP= 0
##$CFRGTYP= 5
##$CHEMSTR= <none>
##$CNST= (0..31)
1 1 145 1 1 1 1 1 1 1 1 1 1 1 1 1 1 1 1 1 1 1 1 1 1 1 1 1 1 1 1 1 
##$CPDPRG= <>
##$CPDPRG1= <>
##$CPDPRG2= <>
##$CPDPRG3= <>
##$CPDPRG4= <mlev>
##$CPDPRG5= <mlev>
##$CPDPRG6= <mlev>
##$CPDPRG7= <mlev>
##$CPDPRG8= <mlev>
##$CPDPRGB= <>
##$CPDPRGT= <>
##$D= (0..31)
0 1 0 0 0 0 0 0 0 0.06 0 0 0 0 0 0 0.0002 0 0 0 0 0 0 0 0 0 0 0 0 0 0 
0 
##$DATE= 1143637953
##$DBL= (0..7)
120 120 120 120 120 120 120 120 
##$DBP= (0..7)
150 150 150 150 150 150 150 150 
##$DBP07= 0
##$DBPNAM0= <>
##$DBPNAM1= <>
$$ [...]
##$SUBNAM7= <"">
##$SUBNAM8= <"">
##$SUBNAM9= <"">
##$SW= 20.6930455092707
##$SWIBOX= (0..15)
0 0 3 0 0 0 0 0 0 0 0 0 0 0 0 0 
##$SW_h= 5175.983436853
##$TD= 65536
##$TD0= 1
##$TE= 294.16
##$TE2= 300
##$TE3= 300
##$TEG= 300
##$TL= (0..7)
0 120 120 120 120 120 120 120 
##$TP= (0..7)
150 150 150 150 150 150 150 150 
##$TP07= 0
##$TPNAME0= <>
##$TPNAME1= <>
##$TPNAME2= <>
##$TPNAME3= <>
##$TPNAME4= <>
##$TPNAME5= <>
##$TPNAME6= <>
##$TPNAME7= <>
##$TPOAL= (0..7)
0.5 0.5 0.5 0.5 0.5 0.5 0.5 0.5 
##$TPOFFS= (0..7)
0 0 0 0 0 0 0 0 
##$TUNHIN= 0
##$TUNHOUT= 0
##$TUNXOUT= 0
##$USERA1= <user>
##$USERA2= <user>
##$USERA3= <user>
##$USERA4= <user>
##$USERA5= <user>
##$V9= 5
##$VALIST= <valist>
##$VCLIST= <CCCCCCCCCCCCCCC>
##$VD= 0
##$VDLIST= <DDDDDDDDDDDDDDD>
##$VPLIST= <PPPPPPPPPPPPPPP>
##$VTLIST= <TTTTTTTTTTTTTTT>
##$WBST= 1024
##$WBSW= 4
##$XGAIN= (0..3)
0 0 0 0 
##$XL= 0
##$YL= 0
##$YMAX_a= 389728
##$YMIN_a= -376943
##$ZGOPTNS= <>
##$ZL1= 120
##$ZL2= 120
##$ZL3= 120
##$ZL4= 120
##$ABSF1= 16.522
##$ABSF2= -4.171173
##$ABSG= 5
##$ABSL= 3
##$ALPHA= 0
##$AQORDER= 0
##$ASSFAC= 0
##$ASSFACI= 0
##$ASSFACX= 0
##$ASSWID= 0
##$AUNMP= <proc_1d>
##$AZFE= 0.1
##$AZFW= 0.1
##$BCFW= 0
##$BC_mod= 0
##$BYTORDP= 0
##$COROFFS= 0
##$CY= 12.5
##$DATMOD= 1
##$DC= 0
##$DFILT= <>
##$DTYPP= 0
##$F1P= 14.0000005364418
##$F2P= -0.99999901652339
##$FCOR= 0.5
##$FTSIZE= 32768
##$FT_mod= 6
##$GAMMA= 0
##$GB= 0
##$INTBC= 1
##$INTSCL= 1
##$ISEN= 128
##$LB= 0.3
##$LEV0= 0
##$LPBIN= 0
##$MAXI= 10000
##$MC2= 0
##$MEAN= 0
##$ME_mod= 0
##$MI= 0
##$NCOEF= 0
##$NC_proc= -3
##$NLEV= 6
##$NOISF1= 0
##$NOISF2= 0
##$NSP= 0
##$NTH_PI= 0
##$NZP= 0
##$OFFSET= 16.522
##$PC= 1
##$PHC0= 16.40855
##$PHC1= 6.345152
##$PH_mod= 1
##$PKNL= yes
##$PPARMOD= 0
##$PSCAL= 4
##$PSIGN= 0
##$REVERSE= no
##$SF= 250.13
##$SI= 32768
##$SIGF1= 0
##$SIGF2= 0
##$SINO= 400
##$SIOLD= 32768
##$SREGLST= <1H.CDCl3>
##$SSB= 0
##$STSI= 32768
##$STSR= 0
##$SW_p= 5175.98343685301
##$SYMM= 0
##$S_DEV= 0
##$TDeff= 65536
##$TDoff= 0
##$TI= <Analysis number 999999
Compound Code 99
Book Reference 9
Project Code 9>
##$TILT= no
##$TM1= 0
##$TM2= 0
##$TOPLEV= 0
##$USERP1= <user>
##$USERP2= <user>
##$USERP3= <user>
##$USERP4= <user>
##$USERP5= <user>
##$WDW= 1
##$XDIM= 32768
##$YMAX_p= 411712665
##$YMIN_p= -196738
$$ End of Bruker specific parameters
$$ ---------------------------------
##NTUPLES= NMR SPECTRUM
##VAR_NAME=  FREQUENCY,     SPECTRUM/REAL,   SPECTRUM/IMAG
##SYMBOL=    X,             R,               I
##VAR_TYPE=  INDEPENDENT,   DEPENDENT,       DEPENDENT
##VAR_FORM=  AFFN,          ASDF,            ASDF
##VAR_DIM=   32768,         32768,           32768
##UNITS=     HZ,            ARBITRARY UNITS, ARBITRARY UNITS
##FACTOR=    0.157963299565203, 1,           1
##FIRST=     4132.6476996994, 0,             0
##LAST=      -1043.33573715361, 0,           0
##MIN=       -1043.33573715361, -196738,     0
##MAX=       4132.6476996994, 411712665,     0
$$ Real data points
##PAGE= N=1
##DATA TABLE= (X++(R..R)), XYDATA
$$ [...]
22705B318Q13K166l284N55P06K087k76P29j691k246l715K666r91k26O840J594
22689H045j206m991m290q70m47l691r46L201K621M421j613n064l552l447J0491
22674a338M762K095j752q79p03J572m239J114L188R88j233l144m449l648P19K322
22658d625J53O004l354k30j331k055j892L629L170L402M42l506n788m609l155
22643a3745P591O176l09j90j498M19P446K221j700l195N3j175p24q997k69Q086
22627A90Q17K529m663l275O374K157m4k731m867l425k291R18K084Q78J925N359
22611A935L392J377k81j628M33P09k333j033L146l913m32L91m061l771j303K89
22595g083M321N242J150k879n075O167J387K38j92J567L318M44m419l409k691
$$ y = [2318, 3131, 5297, 2013, 2568, 3274, 5361, 5085, 5814, 4123, 1877, -1838, 828, -163, -389, 6451, 8045, 6839, 1848, -2442, -3312, -3759, -7450, -8396, -5195, -2574, 1847, 234, -4830, -8382, -11829, -1338, 3424, 5519, 3767, 2888, 2185, 3757, -482, 632, 3820, 4808, 3575, 431, -4018, -7666, -6947, -4625, -4472, 1532, -1822, -2052, -3383, -5438, -7330, -3701, -531, 2871, 3313, -193, -5981, -10590, -13745, -6154, 22, -287, -477, -1975, -1556, 5890, 8111, 6411, 3216, 3269, 2094, 1370, -7627, -7896, 190, 1007, 3536, -1127, -4402, 1972, 4129, 4085, 1354, -3513, -6938, -9229, -8311, -6227, -5349, -3424, 1935, 5327, 6704, 6423, 4795, 5228, 5937, 3604, 2571, 5717, 1804, 1372, 1763, -2298, -6069, -7372, -7083, -2762, 2480, 3630, 751, -4324, 1843, 3230, 3468, 3276, 4843, 8161, 8605, 4186, 777, -1914]
22580a914Q9m572L378M209L855L065o34K403j390m315l907r275J548O621K398
22565A559j644Q64K71L74q77K535J575p46J416j642k992j718j097p56k646J887
22549c637L045L32l51m063k839j317o44j32K229O869J296k789J304K421N192m360
22533B556l873n025J584N354J26J584k323l100l258j508N527o28l690L901J563
22518a210m751l719R378Q962l361J492R39j924K714L341j973k337o31p864q39
22503a783L298R55J222j499j66k940k497P15l21R53J622J887l4m207l954n41J155
22486f135M631r12K157K459m018j910Q82j336K050J637K999J899J429j635l127
22471A070j302K142K090J11p74k744o09J762O89Q6j906L904K691n167r758m04
$$ y = [-1914, -1825, -6397, -3019, 1190, 5045, 8110, 7476, 9879, 8489, 4174, 267, -9008, -7460, -839, 1559, -85, 779, 1050, 1424, 547, 3082, 4657, 3911, 5327, 3685, 693, -1025, -2122, -2878, -5524, -3637, -592, -260, -611, -4674, -7513, -8830, -9474, -9606, -7377, -508, 788, -2001, -697, 1724, 6916, 2556, -1317, -6342, -4758, 596, 722, 2306, -17, -3117, -6375, -7883, -2356, -2984, -6674, -2773, -1210, -5961, -9680, -302, 8660, 5299, 6791, 7730, 5806, 8520, 11861, 9888, 7551, 6920, -944, -1783, 1515, 2470, 3692, 2193, 2027, -913, -3410, -2695, -3016, -2063, -441, 1446, 1412, -2795, -6749, -7290, -6135, -1504, -2416, -259, 2200, -1818, -3728, -2846, -4182, -2132, -495, 2504, 4403, 5832, 4197, 1070, -232, 1910, 4000, 4111, 3337, 593, -16, 1746, 2435, 2521, 615, 4519, 7210, 2043, -7715, -8119]
22455h119n7J136M635M806K09J773K85L260l925p562n208N06J757J106j207m787
22439a1392n822K415M849L886N259J086N2j003M097j835J547j073p228p028M054
22424h136P61l369J956R140O351n877k451j52o14j022K7K482K174r5j746j401
22408a972J219O87m091N79q32K258R07k461L618j92J577j47n37J211L19q81k416
22391a154M073J386j658n541j040K498O454J591m497l518K406k747K350M98J836
22376B937L62k958j080j516j718J566k908n96J581K718K472M89l478l633L176
22361b586L689j49j127q05m893o86O415L226l65N63k131J581l347j546N340P1
22345C250N5J661j476l123j603j283K502J352K595P33L760M71l589l272p759l773
$$ y = [-8119, -8176, -7040, -2405, 2401, 2610, 4383, 4668, 7928, 4003, -3559, -8767, -8261, -6504, -5398, -6605, -11392, -17214, -14799, -9950, -6064, -805, 281, 333, -670, 3427, 1592, 3139, 2066, -5162, -12190, -8136, -7375, -10744, -8788, 352, 6703, 826, -1625, -1777, -2391, -3413, -3386, -904, 1270, 1175, -571, -1972, -753, -66, -4157, -3578, -4410, -2152, -1245, -3706, -88, -280, 1297, 1150, 613, 1824, 2143, 1262, -1154, 2919, 4305, 2647, -2894, -3934, -1436, 5018, 6609, 2112, -1406, 1000, -1747, 603, 1101, 2937, 3299, 341, -739, -2255, -3973, -2407, -5315, -5911, -4330, -1612, 860, 1349, -2129, -5762, -2586, 1103, 954, -173, -978, -5871, -6557, -142, 3084, 2719, 3282, 1151, 2732, -615, -2161, 3179, 3250, 3305, 4966, 3490, 367, -1236, -2519, -17, 1335, 3930, 4663, 8423, 8894, 5305, 2033, -5726, -9499]
22329i499N503K635J653J60q45N376K970k179m802N78L696n46J068J914j757j440
22313D485L88m641j861j005j095k122J653J739L802L24j953q27l426K566J140
22298h33M832L003j900k708m48r66K321K540k559j754l945j066M220L081M10l467
22282G61p24k446k362j73m25K092O558R2m553o098N273N286j132o095r51K772
22266b125R99L741k94M19j303l026k949K601k146K433J085l451l97Q63K168k69
22250a651L30j624j606l289N022O208M049j010m396m018j006k7O111K299k573
22235B819j649k838l805l357K384M654R79m273J528J549j286L61j97M397L968
22220E234L91l571k442K216l20L2J085J298J76O03j412K443J485l796j691K319
$$ y = [-9499, -3996, -1361, 292, 452, -393, 4983, 7953, 5774, 972, 1550, 5246, 4700, 5768, 7682, 5925, 4485, 4873, 232, -1629, -2634, -3729, -5851, -4198, -2459, 1343, 1667, -286, -1113, -4539, -1973, -833, 3999, 7002, 5102, 2394, 1946, 980, 3301, 5841, 3282, 1528, -2417, -3483, 737, 3818, 4228, 761, 37, -2409, -4771, -4944, -5369, -3277, 3281, 3373, -1180, -7278, -2005, 3281, 2149, -3946, -4897, -2125, -1126, 2615, 2321, 2740, 1437, -1589, -4538, -1937, -4083, -1650, -565, -4016, -4413, -3550, -1382, -1651, -1321, -2945, -4551, -7840, -2818, 3390, 7439, 6429, 2033, -1985, -2991, -3018, 3093, 5392, 2819, 1170, -1668, -5473, -8830, -6446, -1792, -813, -5086, -3558, -2009, -3295, -2934, -3131, 1266, 5234, 5625, 2054, -388, 1828, 1508, 1540, 2625, 3923, 4099, 4702, 3290, 5733, 7218, 3422, 1731, 4050]
22204D050K751q732r718N35P136K383J512l44L39J642j346N46L853L437q72n816
22188A356j407j811J448l357l829j772O19L852J534l513N936L402m68M42j280
22173A152l338J080k847K164K969L296J502J67m091L172j055j123k524J109L740
22158E373n91K596j053k886m430j224P82m875J153P58K14q97q18o75K375K167
22142b031M461K133j797l937k911j408j490L953L313N79J64j651k273k010l259
22127h164n18P182M372O53m627J02K173K418O242K242j371m821m852k158m56j340
22111b923m312k907m335O43Q640K136j923l10L548k162N92J167k200J105K074
22096a167J505m99l47K820k804p03J383k063k184K485K484J734o687n81J57J959
$$ y = [4050, 6801, -1931, -11649, -11114, -3978, -1595, -83, -427, -88, 1554, 208, 754, 4607, 8044, 7172, 1356, -51, -1862, -414, -3771, -7600, -9372, -8753, -4901, -3367, -6880, -944, 2458, 1990, 2432, 1152, -2186, -1106, -3953, -1789, 1180, 4476, 5978, 6145, 2054, 5226, 4171, 3048, 524, 1633, 5373, 4782, 7378, 6325, 3439, -991, -2215, -1433, -6308, -5155, -4397, -4183, -5080, -5898, -6573, -4198, -2031, 2430, 4563, 2766, -1171, -4082, -5490, -6980, -3027, 286, 865, 1029, -622, -2895, -4905, -8164, -8682, -1500, 2872, 3525, -1102, -1000, 1173, 3591, 9833, 12075, 10704, 5883, 1031, -1127, -1583, -2923, -7235, -10142, -14477, -13834, -5194, -3058, -4981, -5291, -1743, -3905, -3313, -2146, -4346, -3241, -1167, 338, -161, -508, 2312, -492, -1195, 188, -1875, -4059, -1574, 910, 2644, -4043, -4624, -4467, -2508]
22080b508n618k321J625O16l802O092L706N708l672m304m21K840j612L611q16
22065h76N575K110k45m773m167k279J936j370K720N018R85k991l853N40J944j398
22049a124r22L752k720m925n31M366J003J097P60R17r94K159n4k661k63L93l226
22032b973k445R92j311L996M139K124j432j055K246l141n228k91j18l412P421
22017d88Q273l325k649K72j564n382k409L340O45M127k755p0O34l91k058k979
22001f779j199J821J01J592q52J772L009M780j919L062K133k924k342P93l525
21986d77j685L830J174j0054J664N110K001j305K974J06j536j04j342K707l099
21971c6j950O56J048J608K124j651m261j239M130L256P43k655k587o94m390j640
$$ y = [-2508, -8126, -10447, -8822, -8206, -12008, -5916, -2210, 3498, -174, -4478, -4899, -2059, -3671, -60, -876, 4699, 6809, 6564, 1791, -2376, -4655, -2719, -4089, -1369, 3649, 4634, 1643, -2210, -1670, 274, -1124, -2046, 1706, -1014, -5939, -6470, -2104, -1101, -4, 756, 1673, 679, 2838, 2784, 123, -140, 253, -2973, -5418, -4426, -5737, -1741, 2398, 4522, 3090, 2035, 4281, 1140, -4088, -4379, -4497, -7909, -488, 7785, 4460, 1811, 2083, 519, -4863, -7272, -3932, -3287, 840, -1915, -1985, -1351, -1742, -3800, -6779, -7978, -6157, -6056, -4464, -5316, -3544, -535, 4245, 2326, 5388, 7521, 4597, 2255, 3048, -477, -2162, 1668, 2842, -7212, -5548, -438, 1563, 258, 3232, 3338, 1802, 1698, 356, 3063, -36, -1986, -1330, -282, 1326, 3450, 1799, -2462, -3701, 429, 3685, 4428, 1773, -814, -1508, -5898, -7538]
21955g538K26o14J497L742l211k731l46J128L375N007K973m74k628J032J094n544
21939c012p04J722K232k071n266J254O762N795N340j258J350k51q369q49q29m098
21923b252Q82N617q64j399J529j202l425J73L902R58j042r83k599k434L835J507
21907B203j432K113m386m112j658J047K483o05L79J316M883J905j203L018K016
21892G967j756j072o975J005Q555N456J468j338n613k125o00l897O91N37N799
21877H102n57m942k356P00J861J91P23j65j618o109j75N052k665L209M450L507
21861I208n697j852J623j348k606K824J545K63k428k557p90k578K155P317l29
21846D750j354M31j103J138m65o877J208J513j507q10o672M42R94n18q73K561
$$ y = [-7538, -7312, -7926, -6429, -2687, -5898, -8629, -8975, -7847, -4472, 535, 3508, 3034, 406, 1438, 2532, -3012, -3716, -1994, 238, -1833, -7099, -5845, 917, 6712, 12052, 10794, 12144, 11893, 3524, 2675, 1846, -2252, -1370, 4247, 3383, 1984, 3513, 2311, -1114, -941, 2961, 3919, 2877, 1894, -705, -3139, 696, 2203, 771, 2884, -1502, -5614, -7272, -6225, -3742, -4347, -3968, -2652, 2231, 4136, 2933, 5951, 7967, 6211, 5139, -1836, -831, 7724, 13180, 14648, 13310, 7697, 5572, 4972, 1075, 1766, 2303, 8102, 7545, 2603, 247, 947, 2808, 2999, 3722, 3557, 1939, -4170, -4345, 707, -1958, 1251, 5701, 9208, 3511, 1659, 3282, 1934, -672, 2152, 3697, 3960, 1532, -1025, -1815, -4393, -2238, 5079, 4750, 3396, 3827, 2724, 3862, 3397, -3480, -2272, -759, -2266, -3076, -9748, -9306, -8312, -8830, -9703, -7142]
21830g142L094k813n061K371J096J930J620N06o6M95j329P09J662K254n37J386
21814A75M170n061m924r31o02K604n54J591r91Q54J522O22l475j250J617L276
21798a357N163M631J398J136j436k452l795k716J396n521O37l143J890m38J178
21783c429O281K74q160n138J978K582J093K338K837j549K079J475j914m865K095
21768b023j59J906N102l688n439J278J819K618j405j737L795Q02o569J363L384
21753A047J826J949l88p81p656q58K015l551M889M998J204n451k163J369K968
21738A417K099J693J240k889o521l678L280K153J15j478j675K056M733N043N43
21723H131l592r63l487L82K868l591j778J782k032mK577M437R34Q33J442j056
$$ y = [-7142, -4048, -6861, -11922, -9551, -8455, -6525, -4905, -4399, -4465, -3970, -5299, -4590, -2928, -674, -1211, 175, 4345, -716, -5640, -6571, -7173, -4569, -5123, -3532, -4523, -3669, -2147, -1525, -5000, -6250, -4633, -1357, 3806, 8437, 9835, 10971, 9535, 7083, 3288, 572, 1968, -3553, -2916, -6059, -4169, -4607, -3429, 2852, 3126, -5034, -10172, -8194, -5612, -4519, -2181, 656, -893, 1186, 2661, 747, -4118, -2023, -2182, -276, 4826, 1138, -4301, -3023, -1204, 1414, 9, -1728, 2067, 2869, -3700, -2337, 1047, 2873, 4822, 4434, 3653, -4003, -4861, -2846, -6397, -1508, 3490, 4694, -757, -2920, -1551, 1417, 3516, 5209, 6449, 3560, -2961, -6639, -3359, -1206, -1091, -2569, -4244, -2188, 2545, 7588, 8131, 4539, 3576, 89, 471, 3339, -252, -2030, -248, -2280, -2284, 293, 4730, 5664, 6497, 7939, 6883]
21707F883k821n551J099M235n57k330j94M62j146m305P37L629M362J219J80r69
21691D933l70j658q532R22J186k585K45j51N48L70N968k196j143j552q102k506
21675a4623J703J0715L529j648j492M51L922l97j491n990k625N643L035k101k047
21660c416l31l322o82K121K740M79n41k414O47L388n188K782M244K43K264L605
21644F619J237p485r04M35q55J98K382j892k466l715m923J573N215K35j270N449
21628a67Q74m230k867l998M349j266R4M885P92n689m31L219k129m01L347K366
21612a252k574j507k527L992k131l53R10K14L74l537l577N314M331J668K236r86
21596E95n116k306K51J558p53L919K289m26m759l758M509L759k763M37j998N10
$$ y = [6883, 4062, -1489, -390, 3845, 3288, 958, 764, 1226, 80, -4225, -3488, 141, 4503, 5722, 5902, 4933, 4563, 2905, -5627, -4705, -3519, -6104, -5859, -6010, -5462, -5092, 876, -1320, -2463, -4015, -12117, -14623, -12920, -2205, 1324, -324, -1816, -1365, 2557, 2160, 669, -5321, -7946, -2303, 732, -1369, -3416, -3747, -7069, -7751, -5630, -2890, -2411, -2952, -5366, -4719, -1331, -6519, -3737, 507, 750, 3014, 6619, 7856, 371, -533, -98, -953, -755, 1627, -265, -2731, -6446, -11369, -9796, -4581, -4346, -5616, -167, 707, -3523, -6390, -10388, -6039, -7305, -7211, -2326, -1534, -7223, -7654, -4435, -6564, -6965, -3618, -1252, -3826, -5333, -7860, -3868, -5999, -6352, -5442, -5228, -4854, -8391, -11968, -6654, -2323, -655, 1581, 595, -4521, -6827, -6576, -5018, -5771, -1852, 437, 11, -4748, -8506, -3997, -238, -3001, -2564, -4562, -4052]
21580d052k815l80j724K107P359J139p833k524J292J225R27O599k790q073n67
21565a0110P54J107M001L240j457j729M118n410o027n766K775J484K518L505K179
21550d818o05k929n94L28L348q19P7L036K720l588l797L457L390J191O696O341
21534A3434k536q693l289L986L733J710k771p377M49O646l045l089k681p38k877
21519g138P1L777k73J515j376K025R04n808l991M216K467L250R58K579J896J980
21503G052K010m706n300P85K922K508k530q843n318J792K935N292N54j254J333
21488g68j027K658K869P30j357o81J013m261p090o24J195l722j920J234L361L462
21472d928m82r97L948M65j442l40J622l492r74J02K737L998p688n269K101L017
$$ y = [-4052, -6867, -7247, -8971, -6864, 495, 1634, -6199, -8723, -7431, -6206, -5279, 1320, -1470, -9543, -10110, -9356, -8249, -4248, -1008, -2465, -4194, -76, -5486, -11513, -17279, -14504, -13020, -10502, -6997, -4818, -5423, -8352, -8946, -8618, -5270, -6089, -6012, -2976, -256, -3844, -7641, -4184, -794, 397, 7093, 13434, 10898, 2205, -1084, 2902, 6635, 8345, 5574, -1803, -1354, 5292, 2247, -842, -3523, -4261, -7138, -7067, -3290, -3563, -2048, -3424, -1399, -495, -6303, -10294, -6078, -3611, -361, 597, 3176, 5072, 7052, 9062, 4356, -944, -159, 2763, 5271, 2741, -6102, -11420, -9628, -6693, -1401, -847, -2101, -768, -1795, 863, 3732, 4462, 3105, 2424, 3437, -824, -7914, -8538, -7343, -11065, -12985, -11751, -8390, -4928, -5410, -6407, -2459, -1994, -3436, -3776, -2154, -5646, -6620, -6518, -3781, 217, -7471, -12740, -10639, -7622]
21456g622L126K404M142J108J002J29O30R20m227j133q34n76l118k487J968O556
21440A988j715N77l789k162l29k300q97K287L075K272r55K885L468n003p670j554
21424i822o7Q52N188N778J487K655J978m025l575R35l349m276J971j089K90M096
21408i73N794j891k846L569o2n64o55M69j62J98p79k587j296l839j134J667j027
21391f118J564r46J660J986L508J08O38m98M374k80m370j667N446J545r98R0j565
21374D477l960k997N69L214L906j631l471n92l342p96J647K785j186l479L611
21359a245M632k064j620n529L682K092J348l05L246j5o046N44K614K904r88k572
21343F78m031k440P792N238j771j259o67k358m06n350p94K727O19p62j788K735
$$ y = [-7622, -4496, -2092, 2050, 3158, 4160, 4289, 4919, 5839, 1612, 479, -355, -931, -4049, -6536, -4568, 1988, 273, 850, -2939, -5101, -5430, -7730, -8627, -6340, -3265, -993, -1948, 937, 4405, -598, -8268, -9822, -9889, -9037, -3849, 1929, 3416, 6071, 8049, 4024, 449, 1384, -1965, -6241, -4270, -5359, -5069, -973, 4821, 2930, 84, 3653, 3591, 3027, 2372, 2841, 2679, 2877, 2098, -489, -1785, -5624, -6758, -5091, -6118, -4554, -5500, -3840, -1854, 1654, 1762, 2400, 1902, 6276, 5996, 1626, -41, 5405, 6950, 5952, 6042, 4477, 517, -2480, -1911, 1303, 5209, 3578, 107, -485, -3827, -4623, -2976, -191, -1377, -4856, -1245, 3387, 1323, -297, -5826, -2144, -52, 1296, 991, 4237, 4222, -1824, -1280, 1334, 4238, 3250, 678, -3353, -5793, 1999, 7237, 5466, 4207, 3540, 1182, 776, -4574, -5368, -2641, -2022, -2784, -4572, -1837]
21327a837K584r69k716K991j618P89j973J617l444o22P222L580j432o19J409k823
21311B139m725R1P07j981L532N090j503n319K223K065r30m094J669M24J739J461
21295B588K026N416m909o327k650J591o05M74r36j514k134j224K35l18m330L92
21279a2225P423N195K077k030j328k65l57P78m356J214O813l19K73k946k713K876
21263A10K632l425p387k00N376J801l651K160r14l248j523L454J324l354j634
21248h479M083K253j548K138J38N066l24m156l523k75j198q2L063K465P29l30
21232B0K789J584n758N03J044K803L866l280j790L192j481j304j952m20m753j541
21216f478K275K637K002k618J945N775j258j040N478m069l526j933K044L83q75
$$ y = [-1837, 747, -222, -2938, 53, -1565, -776, -2749, -1132, -4576, -5198, 2024, 5604, 4172, 3553, 4962, 2139, -2586, -2495, -1788, -3769, -237, 4853, 3350, -1969, 254, 2319, 1389, -2705, -1036, -612, 1127, 2588, 4614, 10030, 5121, -1206, -3856, -2265, -2870, -2396, -3332, -4846, -6980, -8204, -7969, -8287, -12617, -12225, -4802, 393, 2470, 440, -888, -1153, -1510, -732, -5088, -3874, 2939, 2620, 2893, -53, -2766, 110, 2742, -683, -8070, -8270, -2894, -1093, -4744, -2584, -3498, -6746, -8269, -4815, -3491, -6845, -8479, -4396, -2143, -3691, -1553, -1415, 3651, 3327, -829, -4352, -4627, -5825, -5907, -2844, -379, 350, 20, 2809, 4393, -1365, -862, 182, 2985, 6851, 3571, 1781, 4973, 3492, 2188, 236, -184, -4937, -6478, -4203, -1566, 436, -2182, -237, 5538, 4280, 3240, 8718, 4649, 1123, -810, 1234, 1617, 742]
21201G42L754n61m041K646O80j844k273j029R6L561M71m658l490L177r38j859
21185e566J624P62j518K726J510J23k401l113n860k411M524L53j919J254k021
21170a1933m6L574j759p01J363j167J961L484J410k25K871K436l714m054j083
21155g583n433k535M889J1265N553o600J781L316r45m443l546K596M799K309l520
21140A903k758L074J19m32j885n681L138M962j344l950m474l053j356J97K043
21125i497Q12J07k074N400r52J192J670o546j688Q54k070K943N089J126j617j704
21109f955J070P035M984l269l554k90J292j883k025K541K486M028j068p06k367
21094A319j590J614L468l109j237O62J514p458j235K75J938J535J563O555k16
$$ y = [742, 4496, 3935, -106, 2540, 3220, 1376, -897, -1926, -1830, 1731, 2202, -2456, -5946, -2769, -3707, -5566, -3942, -3180, -4698, -1972, -462, -339, -2740, -5853, -11713, -14124, -9600, -9247, -11166, -9912, -11933, -11979, -8405, -10164, -10865, -9502, -10669, -8708, -5224, -3814, -4039, -1168, 1268, -2446, -6500, -7583, -13016, -15551, -10662, 603, 6156, -444, 1337, 4653, 3708, -735, -4281, -1685, 3114, 5423, 1903, -855, 2219, 2338, 1906, 21, -5660, -2522, 2440, 1096, -2854, -7328, -10381, -11737, -11540, -9497, -8685, -8578, -10652, -5252, -6204, -5012, -3342, -9888, -11576, -10722, -12792, -9849, -4760, -3634, -5251, -6955, -5885, 1150, 6134, 2865, -689, -979, 313, -1570, -3595, -1054, 1432, 5460, 4392, 3686, 1319, -271, 1343, 4811, 1702, 465, 1127, 2641, -4817, -6052, -5777, -3839, -2304, -741, 5814, 5598]
21079E598j771j99j838O1K264K64m782r72J027L542J653N46Q14n778k079r3J399
21062c44l955K242M374k909p92O500k231n751Q60N658M715K22k353k306k240l380
21046a690j339J654m137o190j874L453L012j519N42J200M922K717N80K615P04
21031D650j992k064j1l240k540N053L586n10m031J276M50l637l250m530m419K966
21015a2243L118M50L255J465O278L459m996L008l212m038m17J264rn76k863K853
20999c204L766P26R42Q1k157l365k87L03J209P44p428k422K017j01L092R655N488
20982I059n377j0161P77P900l431l805j258J016J686k020o555j073M053L857K182
20967c150L228J612m594r117k374l78K932Q96O13M1J847M026O902p42rK87m206
$$ y = [5598, 3827, 3628, 1790, 1851, 4115, 4379, -403, -1375, -348, 3194, 4847, 5393, 6207, 429, -1650, -1743, -344, -4299, -2057, 2317, -592, -1384, 5116, 2885, -2866, -2006, 3652, 8367, 8589, 6236, 3930, 1690, -1690, -3029, -1375, -5512, -11702, -13576, -10123, -7111, -8630, -8088, -6888, -1966, 751, 1331, 3946, 4650, 2658, 594, 583, -2657, -5197, -144, 3442, 2932, -1099, 177, 627, -3010, -6260, -10790, -15209, -12243, -9125, -8675, -5420, -3955, 2323, 5782, 786, 3794, 582, -3456, -3873, -2609, -2618, -3194, -6057, -3204, 562, 1288, 2230, 2311, 154, -3211, -3498, -3195, -1986, -1242, -8670, -11092, -9075, -9176, -6084, 3571, 9059, 3682, -6479, -5702, 2198, -1233, -5038, -6296, -5280, -3594, -5614, -12169, -13242, -9189, -5332, -3150, 78, 1690, -2904, -12021, -14395, -14773, -11841, -10945, -10332, -10291, -8444, -4418, 2484, 1742, 1733, 2020, -2186]
20950b186j828j739K049j776p970l521K455M028j423M270k716n94J107r10L313
20935g441M373j402r49j331R61K191K087k758j452o97K765O633P97j902l678j830
20919c633j379m773j11m3p23L526k264o117m31R421P973J320j119j48K969J73
20903D641k311k964j469L53k788j120L360M075K118P03j038l679m576k475k013
20888i183J980K868p86Q25P92K670Q056K718o063o976m229J580J73j684N24R4
20872f641L189j079k571j067l236J937J487l00j248J795J633O756R502N020j428
20857A3749m719k962p269J373j297k212M007L396k633m59k836j099J511k515l599
20842g564K315J671J221N474K234l823n251j433J793k284l53p45j262k429o778
$$ y = [-2186, -4014, -5753, -3704, -5480, -13450, -16971, -14516, -10488, -11911, -7641, -10357, -10951, -9844, -10754, -7441, -3068, -4470, -5419, -6750, -5789, -3598, -1511, -4269, -5721, -6418, -3653, 2980, 3777, 1875, -1803, -3633, -5012, -9785, -9896, -9939, -10662, -7136, -9400, -15517, -15948, -6527, 1446, 2766, 1647, 1499, 4468, 4641, 2330, -634, -2103, -1750, -4538, -5658, -2298, 1777, 3895, 4598, 3560, -119, -4695, -7170, -9183, -7203, -4335, -5121, -4296, -3504, -834, 7222, 9940, 3877, -3099, -7328, -5748, -5575, -7259, -6735, -6641, -3452, -4531, -7102, -8169, -11405, -9468, -7981, -8281, -9529, -7734, -6101, 655, 10157, 15177, 13749, 9030, 6068, -1201, 172, -1125, -3337, 670, 4066, 1433, 974, -1862, -2961, -1450, -3965, -7564, -5249, -3578, -2357, 3117, 5351, 1528, -3723, -5156, -3363, -5647, -6000, -6745, -8007, -10436, -17214]
20827a7214l011J772P391M339j576K083P010n72l976n99j45j588j353N538J104
20812g97p786K768M704J531L57K906J813R67j926j276L446k256p32l102o588n779
20796a1750J42M229K724J771J147O48O380l10j665J375l118m060l09j711J244
20781c263j169j25M672m340p83j15J232K580m319k970j159P47K56L58K384l498
20765i512M517l60J152o82J968K474J241l386m9n223J868P27k677j34L169M446
20749d61L623m636k119J306J242k059m809L642l279P06J31L104q06k51L733r47
20733a880k529L672r80l351k705O09K708j883K97K931L191M67l607J082K701n68
20717A55p440q70j901M727K05J454N47o16J3J51K648K362M146J207P445P39m542
$$ y = [-17214, -20225, -18453, -11062, -6723, -8299, -6216, 794, 222, -3754, -4353, -4498, -6086, -7439, -1901, -797, -8583, -5815, -1111, 420, 777, 3683, 5496, 6463, 4537, 3261, 6707, 4451, 3719, 617, -5971, -11750, -11608, -7379, -4655, -2884, -1737, -1089, 5291, 4981, 3316, 4691, 1573, -2487, -2796, -4507, -3263, -4432, -4557, 115, -4225, -5008, -5123, -3891, -1311, -5630, -8600, -9759, -9012, -8756, -8398, -6014, -9512, -4995, -5355, -4203, -4885, -2917, -443, 798, -2588, -2637, -7860, -5992, -5265, -7942, -8076, -4907, -461, 3162, -1474, -3593, -2287, -1045, -3104, -7913, -4271, -7550, -6844, -6713, -3609, -4415, -4666, -933, -1880, -4409, -737, -1717, -5068, -7773, -7164, -4456, -6339, -6042, -3111, 80, 547, -3060, -1978, 723, 155, -7285, -8155, -10056, -5329, -5124, -3670, -3123, -3739, -3726, -3575, -927, 1435, 5581, 6788, 14233, 14972, 10430]
20700A0430L208m014o774m511l444p029M5P48M554l328J70J438O021N368j964
20685I18l159Q1J618k483m647k116J522k138J700J389P228K506l821l026Q05m21
20669d044K338j796p944k46J531k998l647K771Q903K005J36K410L320k355P67
20654A151k674l817K602O00K254j501J097J771q9K211J719J07k7m107n62L415
20638D150q27j93j891l591N117k052k080J043o02n080j738L122M97L60k193P5
20622e883N816k802j304M492l3J090l03m041M534r14p017m791M75j700L260L738
20606e383N246L86J963j463n828m42M534N336k739j360k194o45K243l343n361
20591i050n21K521L186K563j368K315K027l742q62K427L524R80J899J674P33k793
$$ y = [10430, 13638, 9624, 2850, -1661, -5105, -12134, -12089, -11341, -6787, -10115, -9945, -8507, -2486, 2882, 918, -2241, -2160, -542, -3025, -7672, -9788, -8266, -10404, -8704, -7315, -87, 2419, -1402, -4428, -3623, -4044, -1706, -3502, -11446, -11692, -10161, -13159, -16806, -14035, -5132, -3127, -2991, -581, 2739, 384, 1151, -1523, -5340, -2738, -2138, 116, -1385, -288, 1483, 1394, 3605, 5324, 5431, 5404, 1297, 735, 4150, 3323, 3130, 1239, -2352, 2765, 713, -1367, -324, -926, -6006, -7744, -4622, -4125, -3765, -5958, -5883, -67, -2869, -4173, 319, 286, 1376, 1073, -2968, 1566, 652, -6365, -11156, -10681, -12381, -9121, -5383, -137, 249, 2212, 749, -5079, -5521, -987, 4349, 1610, 250, -1944, -2589, -346, -3689, -9050, -9571, -7050, -3864, -1301, -2669, -354, 1673, -2069, -2931, -504, 3020, 4000, 5899, 7573, 8306, 5513]
20575E513p113J823l979k496K871J50L016L160J047k554Q32J747K626N460j395
20560A0708K89l946k939r52j858j614j220K68p67L70Q96L76Q59j480O72r40j477
20543b755R69N378l20O7k141N882k71o068k069p51L382K09j882l228k950qj715
20526h271L980j761k05K492J803L623K618P19m808l710J044K199j881l574J346
20511d386L652K722k927r90L485n882l952j354L287J120J916K488j865k053J777
20496b962J701R52j000k498m983o062N085L489l646M031L319L536k557k009L81
20481c223J898m866K769L763k835m358p59Q6J202j406K650L333Q61L801Q15m274
20465e43J708M841l702k250q30k137o168j816M283j067N62L152q60p23N417P215
$$ y = [5513, -1600, 223, -3756, -6252, -3381, -3231, -215, 2945, 3992, 1438, 2270, 4017, 6643, 12103, 10708, 10997, 7051, 4112, 3160, 1302, -312, -1532, -1264, -2031, -1661, -765, -389, 470, -1010, -338, -1278, -2755, -1786, 3592, 3272, 3339, 1198, 7080, 6809, 741, -1328, -2079, 1303, 1512, -370, -3598, -6548, -6556, -8271, -4291, -6052, -6257, -3765, -1962, 1661, 4279, 4998, 190, -3520, -2476, -277, -2158, -5732, -4386, -734, 1988, -939, -1929, 1556, -4326, -8278, -9632, -6345, -5225, -3309, -821, -2686, -4739, -2962, -1261, -309, -1309, -3807, -8790, -14852, -9767, -6278, -9924, -5893, -2574, 962, -1595, -3604, -3223, -1325, -6191, -3422, 341, -2494, -6852, -7611, -7525, -6323, -7729, -5079, -1746, -885, 2916, 3731, -543, 1165, 6006, 2304, 54, -776, -2913, -9081, -10897, -6614, -7681, -7119, -3967, -4827, -5550, -133, 7082]
20449G082L55l759l977l761L975n1J999r79j048m707j977O015j185n941p196M055
20433a1100K621J612L212m26l580j670N522L285L308Q83l014K43l003p57L433
20418E69l460j797k28j274j068J720R72L979K103j830n671J937M298J586l068
20403a232n399M63N756J049j500J214L03m561j558J31l60j879k562j855R359L225
20387E94J57q72L00k297L91j929p88N634K448k203M546L924k805p434l717j458
20371e509m203j93K810J874K773k944j573K454n406k943j534N532N086k753N99
20356e930M363K845r16J341l593J750K454J915k831p66j392q40P8K663J101k398
20340a56l541n000j768j579K434K532K761j019k391o65j398L297m491l985M543
$$ y = [7082, 7437, 3678, -299, -4060, -85, -136, 1863, 884, -164, -4871, -6848, -833, -2018, -7959, -15155, -11100, -8479, -6867, -3655, -4081, -7661, -9331, -3809, -524, 2784, 3667, 653, 896, -2107, -2864, 569, -2891, -4688, -4916, -6190, -7258, -5538, -4566, -587, 1516, -314, -5985, -4048, 250, 1836, -1232, -6631, -6168, -412, 637, -863, 351, 654, -3907, -5465, -5334, -5694, -7573, -10135, -11990, -2631, 594, 751, -121, 179, -2118, -1727, -3656, -4444, 1190, 3638, 1435, 5981, 9905, 7100, -334, -4051, -5509, -9712, -9905, -7095, -5221, -2448, -5392, -6965, -4511, -9917, -12860, -14394, -8862, -3776, -6529, -5930, -1567, 1278, 362, 1703, -1890, -140, 2314, 4229, 1398, 632, -760, -1600, -1522, 1141, 2242, -156, -3697, -8697, -10465, -12044, -9610, -7078, -4317, -5336, -7727, -8392, -9790, -6493, -10984, -14969, -10426]
20325a0426J157j772K028N580M728L7J623n93o586j499m378L65K348N005q98m5
20309c326M165k860J326L827K442j521l854j269m19k470k947J610L184l528J572
20294d068K747J337p64m722p35K068L024N180K199k526p448o121j312l618J345
20279a3414M669J646j964L388P07J839q21l323k594K583J581K084L34q357K517
20264i125M145o12K98J585M244M861n825p816l72J936J18M726J612N73N43K15
20248A106M295k96m199l38m626M21r09J009n397l795K366O556L907J698l061j550
20232b813J351k698j761L339k28m650L749k5K26j183M740M2J888j062j888k060
20216c033O21n70j09K653L666p56q875J665m083j246m8J428k213K225P658K236
$$ y = [-10426, -9269, -11041, -9013, -3433, 1295, 1332, 2955, 2362, -4224, -5723, -10101, -9736, -7388, -2383, -3281, -3326, 839, -2021, -695, 3132, 5574, 4053, 199, -1070, -1489, -3959, -6906, -5296, -2112, -5640, -4068, -1321, 16, -748, -5470, -6205, -4137, -1113, 4067, 6266, 3740, -3708, -9829, -11141, -14759, -13414, -8745, -7099, -9063, -5675, -4968, -3129, -3950, -7273, -9867, -7284, -5703, -3619, -3285, -11642, -9125, -4980, -5592, -5294, -3709, 535, 5396, -429, -8245, -8617, -6681, -6563, -1837, -225, 348, 891, 1106, 5401, 5105, 906, 568, -4058, -3637, -4546, -3537, -8934, -12729, -10363, -3807, 100, 1798, -1263, -2813, -1462, -4160, -5921, -2582, -2810, -7460, -3711, -3736, -3510, -4693, 47, 89, 1977, 915, -973, -3033, -2412, -2982, -3091, -438, 3228, 2472, -6403, -4738, -8821, -10067, -10115, -8687, -10900, -8675, -1017, 1219]
20200A219j673j732q54m65m13l127O29k11N903K416j279o607k153L62Q93K159
20184d933K333J16J464m706l889N444K814r49j238l728l856N526N505j985m053
20169f135j37J283M274J192o182K295l983k025M125J056k9K237K088J169m34k163
20153a369k948Q62M082k669m924k228M015K912L438R85J02j885n364k763J040
20138f714l31K881K517K915Q47K019J965o610o096M56J332L787M14j988J073L86
20122a147M42j774j488K544j387m395J139o0k759J666N32K122j469J004K176J79
20106b675K057Q20l157o493l442J111K444k789l360K704j183M423M349k642k52
20091h085L580K556l403q76J357Q99j20k762j58K15M246J506j551M414P15j389
$$ y = [1219, -454, -2186, -3040, -3505, -3918, -7045, -6416, -6627, -724, 1692, 413, -6194, -8347, -7985, -7092, -4933, -2600, -2484, -1020, -5726, -9615, -4171, -1357, -2306, -3544, -7272, -11128, -5602, -97, -2082, -6135, -6272, -4989, -715, 477, -5705, -3410, -7393, -9418, -5293, -4237, -4266, -2029, 59, 1228, 794, -1369, -4317, -3455, 627, -2042, -6966, -9194, -5179, -2267, 1171, 2156, 2258, 373, -4991, -7754, -6714, -7045, -4164, -1647, 1268, 2115, 4134, 6099, -511, -6607, -6151, -4819, -1032, -618, -2606, -1533, -1147, -705, -2479, -3967, -1423, -2810, -7205, -6066, -6126, -8885, -7219, -6687, -4565, -6034, -5030, -2854, -2675, -618, 202, -2955, -9448, -12890, -11779, -9335, -12124, -15484, -12780, -13963, -9540, -5191, -7833, -8085, -4505, -1949, -5352, -6228, -4871, -3972, -4092, -6854, -7012, -6797, -2551, -1045, -2596, 1818, 2533, 1144]
20075A144o091k620n685Q71M835J177K021m297k303l77k79K471N1K064K466K176
20059b376K029k991q502K426L436m667J074M89Q65L871j223J145o02p27J73M584
20043i96J239j884J029l735j426J705q60O014N12n820l238L458M931K628k216
20028A341m377L757R49m629j11j689l481n41N884k862Q42L891R43O26l143K348
20012b52J235j673j188K881m813l603L93N820M070l289n8L645J065m613l363p258
19996a1001K044O289K648n758j706M108M483k522L218J729l373k943M32J908J123
19981F79J490J984m122N211n31n251J383J024j802n31l446m053l014m031l88M366
19965a1032L597m464m2J65q24P42M118L267N877l062m792P59o32l20L526k896
$$ y = [1144, -4947, -7567, -13252, -12381, -7546, -6369, -4348, -8645, -10948, -11325, -11604, -9133, -9082, -7018, -4552, -2376, -347, -3338, -11840, -9414, -5978, -10645, -9571, -9082, -8217, -4346, -5569, -4424, -5026, -5753, -5580, -996, 243, -1641, -612, -4347, -5773, -4068, -4928, 1086, 1598, -4222, -7460, -4002, 929, 3557, 1341, -3036, 721, 1670, -2959, -3070, -4759, -8240, -8781, -2897, -5759, -4917, -1026, -83, 543, -2600, -252, 983, -690, -1878, 1003, -3810, -7413, -7020, -1200, 2870, -419, -477, 3168, 4233, -380, -3743, -11001, -8957, -2668, -20, -5778, -7484, -3376, 1107, -1415, 1803, 3532, 159, -2784, -2352, -444, 679, 2169, 4153, 31, 5242, 4711, -540, 843, 1867, 65, -466, -3912, -7965, -10979, -15010, -15398, -11032, -7435, -11899, -11941, -11776, -12600, -11858, -7740, -4473, 1404, -1658, -6450, -5691, -6323, -6643, -3117, -6013]
19949f013k466M225K605L596O65o413J918L178Q62m446j089k022l543M100J27
19934d716j920L696J595k579p5P141K856n836k120j69N59n293o510J826j781K46
19918a3080L171N910j353k504o32K845o87J723j28p65J264K668k55l255J802M464
19902A188m3M556o32k851m701R67J042l270k058o35J707M274J528K300k65k858
19886B49m740l071k407L029J063N624k21n03K899N183L668j273m170k173l874
19871g17j505n19n840l510m159q68M365N777K759j142K378k24J623J119j160J490
19855a33j829j760J679K23q31K96r72J817j475J63K282K058J931k96r93L73j387
19838A146l990q06L922R41j009M10j939P85M475J885m956n156J64k281m40K08
$$ y = [-6013, -8479, -4254, -1649, 1947, 2612, -3801, -1883, 1295, 2157, -2289, -3378, -5400, -8943, -4843, -4716, -6636, -2940, -1345, -3924, -3999, 3142, 5998, 162, -1958, -2127, -1568, -6861, -13371, -11545, -13326, -13080, -9909, -3999, -5352, -7856, -8488, -5643, -6330, -4607, -4735, -5500, -4236, -1568, -1823, -5078, -3276, 1188, 1145, 5701, 5069, 2218, -2483, -1516, -474, -3744, -5802, -6437, -4730, -456, 1072, 3372, 3107, 249, -4491, -7562, -9969, -6940, -5877, -253, -474, -977, 1922, 7105, 10773, 9500, 5330, 3157, -717, -2222, -2741, -8581, -12091, -16250, -17118, -12753, -6976, -4217, -5359, -2981, -3205, -1582, -463, -1623, -133, -1962, -3722, -2043, -1820, -2651, -2355, -3327, -1510, -2985, -2822, -540, 1518, 3449, 3153, 2160, 2533, 1146, -2844, -3650, 272, 1213, 204, 614, -1325, -540, 3935, 5820, 864, -4292, -4128, -6409, -6849, -6641]
19822f641L498j049J602J442J077m520m136r72O966j297J677J977J451m558K137
19807a346J869j588J00j98o64j018l522l64K426O172M71m567m061J217K51K273
19791b549J492r56l158J626M692J647l022Q47L373N795N066M409Q696L354p159
19776B4153m14l554q026J945M981K690R880M211o178m621n133k580p436r791k711
19761b584k965j215j02K842P909l55j73k482l093L681l002k259M61P172K226k459
19745C602k077l71K936K306j184m788Q02j955J006k291m971L229L763l194j658
19730d845J447r07J20r169n902N307L738j505J860P52J020n00J753N471k673m557
19714h590P93o897n913P86M402N825K964M24M118R080K036k358k626j277j721
$$ y = [-6641, -3143, -4192, -2590, -1148, -71, -4591, -8727, -9699, -2733, -4030, -2353, -376, 1075, -3483, -1346, 523, -1065, -965, -1163, -1827, -2845, -6367, -6731, -4305, 1867, 2338, -2229, -6290, -5073, -4822, -2549, -1057, -2013, -5171, -3545, 1147, 2794, -228, 619, 3992, 9787, 14853, 19262, 27958, 31312, 24153, 23739, 20185, 12159, 14104, 19085, 21775, 31655, 35866, 29688, 25067, 19934, 17354, 9918, 127, -2584, -5549, -6764, -6866, -4024, 3885, 3530, 3357, 875, -2218, 1463, -1539, -3798, -3337, 3835, 6061, 3602, 1525, 1154, 4090, 6396, 5212, 424, 1226, -729, 277, -2014, -6985, -3756, 7, -3187, -4845, -3398, -4305, -4185, -13354, -19256, -13949, -10211, -11716, -9856, -9104, -8084, -8584, -6831, -1360, -4033, -8590, -7797, -14694, -20607, -19821, -15419, -9594, -6630, -6206, -2088, 6992, 9028, 6670, 4044, 2767, 1046]
19699A046k790K84N75j19q54k14M67J151K214K89m568q572L54J685K824M42k037
19682g823L321Q44j830M84L75M08l703J493Q25M276N614l340j5922q675L293P841
19666a2519J6039J7661N101r968j7126j3068l09K734M386K187r37k243j180r50
19652a0192O992M213J435k196j465q11k083k225k958L181J391J91k607k56k98
19637g688n841K712N373N351k278l975M33o75K460J178N98k861k437j167R00r157
19621a7074r201J5584K4307J1408P788N931k2132k5176j3437r426M926J3276O962
19608f264m97j160M392K313N34l094j995J56M916K204q0m899J259K267M123J723
19592E898j995n858L001L851J69n829j237n197j488L649Q90m482j302L378N540
$$ y = [1046, -1744, -1460, -885, -1004, -1858, -2072, -1605, -454, 1760, 2049, -2519, -11091, -10737, -9052, -6228, -5786, -7823, -4502, -3658, -5488, -5004, -4629, -4221, -7924, -6431, -5606, -1330, 4284, 944, -14978, -23653, -20360, -12519, 3520, 21181, 26282, 16314, -812, -13880, -14189, -11455, -7069, -4882, -5819, -8062, -9242, -10192, -3200, 1013, 2448, 252, -1213, -2024, -4107, -6332, -9290, -6109, -4718, -4527, -7134, -7390, -7688, -13529, -10817, -5444, -93, -2371, -6346, -5913, -6588, -4128, -2950, -2352, -5213, -7650, -8817, -7917, -17074, -26275, -10691, 13616, 25024, 32812, 38743, 16611, -8565, -22002, -31428, -26502, -13226, -6264, -6761, -7921, -3529, -1216, -682, -3776, -5771, -5615, -699, 1505, 1425, -3474, -2215, 52, 4175, 5898, 3903, -1955, 1046, 4897, 5066, -763, -2000, -7197, -8685, -5036, -4146, -8628, -9930, -6552, -1012]
19577a012j921r887j0783M514J2917J5225J3938L562q546j9917q845N42N24j560
19563a1249Q66M060k87k271K280J451M637o00l197k358m084M578J406j505j250
19548g523j874j110L507J790L898k410l418k09L565K414L639K76m436m397j886
19533h174M161K530P63l476m500l723p50N989k554l951J714L640M365p46m061
19518h773j681l75l794L600N21M413j20J471J081j411N9M50k579j433M43m381
19502a2509p26k264K165M915Q293L383l025m730Q4O3q87p68K612j063o745r28
19486a2130M688J40n47M342O295J508P09k429lJ176p115l546Q07K155K970k229
19470c209l408k927L867K440K718j809l018J777j201n50J763j002J751L947k410
$$ y = [-1012, -2933, -12820, -23603, -19089, -6172, 9053, 22991, 26553, 18007, -1910, -10755, -10213, -9689, -11249, -10383, -6323, -6610, -8881, -6601, -5150, -513, -1113, -4310, -6668, -10752, -6174, -4768, -6273, -7523, -9397, -10507, -7000, -5210, -1312, -3722, -7140, -7349, -3784, -1370, 2269, 2545, -1891, -6288, -8174, -4013, -1483, -720, -4196, -8696, -12419, -13169, -7180, -9734, -13685, -11971, -8331, -3966, -4712, -8773, -10454, -10829, -14623, -11023, -10502, -6089, -6209, -4738, -3657, -5068, -5009, -4559, -7138, -8571, -8128, -12509, -13235, -15499, -13334, -8419, -126, 3257, 232, -4498, -4414, -4351, -5238, -6006, -3394, -4457, -11202, -12130, -7442, -7302, -7849, -3507, 2788, 4296, 5005, 2576, 2573, 3749, -3366, -6912, -6105, -3950, -980, -3209, -6617, -9544, -5677, -3237, -519, -2328, -5346, -3569, -4770, -5320, -3557, -4559, -2808, 1139, -1271]
19455a271k214J083M599M349j89j205j700k558n180p582j943J861K633m68m009
19440a3794M281p62J404L193K557J310J031r80M242K637J653k481m440L91o847
19425f605o933Q552N441k390j389q43m119l406R65P327M44K173Q35M066M140m90
19409G768J027n492j120n136n598j774J68K929L298J555K40k456k04n79l802n00
19393i676M708O79j093P13j297l4k092L7L592K995P43o95k039n25n86J360M11
19376b799k087m720k676K456K977r83M41N058J176k449m636k67M435N907j067
19361G66m495L720M368Q65L438L990O765L888q39K380M171M448k84j620j376l344
19345B6841k657j609m556n307k175J524k117p106k74k546Q86J610K10k157o531
$$ y = [-1271, -3485, -2402, 2197, 6546, 6357, 5152, 3452, 894, -4286, -11868, -13811, -11950, -9317, -9785, -13794, -9513, -10275, -8871, -5678, -3121, -1811, -780, -1760, 2482, 5119, 6772, 4291, -149, 242, -6605, -13538, -4986, 455, -1935, -3324, -4167, -8286, -11692, -10727, -3400, -2956, -783, 52, 4118, 8258, 7768, 8795, 3303, 2183, -2953, -8551, -10325, -10157, -7228, -3930, -2375, -2135, -4591, -4795, -5374, -9176, -9676, -4968, -4289, -5382, -4669, -5966, -6000, -8092, -8055, -4463, -1468, -725, -1420, -3459, -3984, -4570, -3210, -2799, -4886, -9606, -12282, -9826, -6849, -7832, -7391, -2333, -1157, -3606, -8242, -8509, -4074, 1833, 766, -3729, -9, 4359, 5224, 8662, 12652, 19417, 23305, 22466, 24846, 29017, 33465, 33181, 31561, 30185, 26841, 24184, 22575, 18019, 12712, 10537, 12061, 9944, 2838, 2564, 18, 904, 2514, 2724, 567, -5964]
19330e964l881k75l372R20Q230K092l065k139L522N113K354k66n246p46k37k950
19314e910n90K104p96j467j794L413M382L470k225o610j946L87L432Q452J618
19299E920p958O87N970j818k642M84j042j049k043L512O960N37j108j375r50m661
19283e76o378k857O35M517N340k551l766O662N748l271o48J094n602p079J657
19268g075L699l912K923K628M604l15m789O98k901q17m304J829L789J867k715
19253d791K544J502l116m585J818J837O519n06r93j169N32j544l019n46R79L239
19237a299L247Q14m114m869l762M43K091Lk134l03K086L265j830J356L533k16
19221a689k096J88j753l311J895M599j90k916J716l833J90k745J57J249K078N041
$$ y = [-5964, -9845, -10120, -13492, -12572, -4342, -2250, -5315, -7454, -3932, 1181, 3535, 3269, -1977, -2723, -2960, -5910, -6500, -4396, -5192, -6659, -8453, -5040, -658, 2812, 587, -6023, -7969, -7582, -4150, 4302, 5920, -2038, -1351, 4619, 2801, 159, 643, -399, -1448, -3491, 21, 6981, 7518, 6410, 5035, 4085, -576, -6954, -9811, -9176, -4659, 681, -1870, -5636, 1026, 6774, 3503, 2855, 3949, -1653, -8732, -7075, -3376, -7288, -4365, -1737, 2867, 2552, -2237, -1539, -4440, -5257, -9561, -7732, -3943, -2076, -4791, -2247, -745, -3861, -8446, -6628, -4791, 1728, 1222, 229, -940, -408, -1952, -4971, -5517, -4538, -1299, 1948, 2762, -1352, -6221, -9983, -9540, -7449, -7446, -9580, -9883, -7797, -4532, -6362, -5006, -1473, -1689, -3785, -3597, -5350, -8661, -6766, -2167, -2357, -5273, -3557, -7390, -7200, -9945, -9788, -8539, -6461, -1420]
19205a420L897j997j603p975l706J803M521r1o342L354J056M603L630N384j047
19190D067q410k303Q44m395R52O249K499O58j081o648j89l551j937M61O002K891
19174c891j679j36M161J590M106j200J132n29K462J743o583L13J516n445l415
19159e855j658J363R92k193M455L063o47P73N95q58r24p45L01k771l04N616J547
19142B750J955m430o424l741l15R40n40L186N645N393k003j826r83l726K637j204
19126b686M865K06N81R73k237n496l471J789M541L219J787L018l439j473l343
19111a166m055l675m768j023K773o10M610O558r67o495J199L242j182j862n314
19096a2735j502K744O630N489j01k190k300J843K395m10o68R0k493L020j66J13
$$ y = [-1420, 2477, 480, -1123, -9098, -12804, -11001, -6480, -6571, -12913, -9559, -8503, -3900, -270, 5114, 4067, -4343, -6646, -5802, -10197, -9245, -2996, -497, 161, -920, -7568, -7757, -11308, -13245, -12784, -6782, -3891, -5570, -5706, -1545, 45, 4151, 2951, 4083, 3554, 6016, 7759, 1176, 1489, 3005, -2440, -5855, -7513, -6150, -5158, -7351, -2896, 167, -480, 293, 888, 30, -894, -1639, -1338, -4109, -4413, 1203, 2750, 4705, 275, -6149, -9890, -10205, -9265, -9805, -6619, -974, 4419, 2416, 590, -393, -4119, -1482, -2686, 2179, 2385, 2966, 3939, 1702, -3794, -7265, -5476, -935, 2284, 4071, 7089, 3650, 2177, -1166, -5221, -8896, -13664, -14687, -11914, -12524, -7914, -1356, -2323, -8818, -7619, -4377, -5559, -7421, -12735, -14237, -11493, -4863, 626, 525, -1665, -3965, -2122, 273, -137, -805, -715, -3208, -188, -354, -241]
19080b41K404J614o509o759m217o95N39M925L251J514J259J400K062m40K72m20
19064d1j650o416O32M976L918L620o77o331n522n38n249j356M873Q12m08J59m407
19047a3605l818K789L630k793j307O621J814M367L713R17m177J353K618j51J016
19032B987k390M12l620l270j241j273N172K097K152o08K373L919m123k406J330
19017A511J910n252o77J517O312N792r030l660K40R85N842J084k984o662O74k850
19001e248j456L700J933O677J663o290l138K29L068k41k332q12L08J382K60n52
18985h49J007l322n735K307L431m412J784L689L74j007l71K407K572o863m560
18970i548M461M223n651m394L609M270j527J976M802k317p663K005P273l073k006
$$ y = [-241, 2163, 3777, -2732, -9491, -13708, -14403, -13864, -8939, -5688, -4174, -2915, -1515, 547, 107, 379, -41, -1691, -8107, -7475, -2499, 1419, 5039, 4362, -1969, -7491, -8029, -13278, -14634, -9761, -8949, -9357, -9198, -13605, -17423, -14634, -11004, -13797, -15104, -8483, -6669, -2302, 1411, 2328, -1849, -496, 2122, 1971, 2987, 597, 1009, -2611, -5881, -7122, -8395, -3223, -1126, 1026, 418, 2791, 6710, 2587, 181, 1511, 3421, -1831, -2508, -991, 5321, 11113, 2083, -1577, -1337, -352, 5490, 6574, 3590, -3072, -2398, -5248, -6704, -3004, -1071, 5606, 7269, 979, -2159, -1930, 1138, 897, -1435, -2247, -1939, -557, -297, -849, 158, -3164, -8899, -6592, -3161, -7573, -5789, -2100, -1726, -2733, -3104, -697, 1875, -4988, -9548, -5087, -864, -6515, -10909, -7300, -3030, -4557, -2581, 2221, -96, -7759, -5754, 1519, -1554, -3560]
18955c560J621M231o841j217K724j870N015j59m008j14K347K277K195m378J49
18940a588K622k502L428j119K7K879q46j258j849K089J621q96m66j781j513l432
18924d584M14L362L747j616K118J42J447m69L66K686j943l02J453m645l880J270
18908d34J948j1J74j269j755m157q645r48Q496O195q09k19K209k716l682p165
18892a2788N63P518N954K252q18l883l391j247o49l99L289k402j962K180M438
18877a345J067j52l932l121l592m269L264R656J433n436R82M779j606R05r76O86
18861a657O80O36m157k140k549L926j903p72M821K509O14k278j981L626k051l20
18845b996J205M40l499k199K558k477k438J079N553K169l25J887K241k798n314
$$ y = [-3560, -1939, 2292, -4549, -5766, -3042, -4912, 103, -56, -4064, -4178, -1831, 446, 2641, -1737, -1588, 1034, -1468, 1960, 841, 868, 3747, 2901, 1643, -206, 1883, 3504, 2608, 2142, 361, -1152, -4584, -4170, -808, 2939, 1323, 3441, 3583, 5030, 4561, 4927, 7613, 5670, 5368, 6821, 2176, -1704, -434, 1514, 1503, 1677, 408, -1347, -5504, -14149, -15097, -6601, -406, -1215, -1434, 775, -1941, -5623, -12788, -12225, -4707, 1247, 3499, 2681, -1202, -4593, -5840, -6489, -6888, -3599, -6001, -7963, -5783, -1345, -278, -430, -4362, -7483, -11075, -15344, -12080, -2424, -991, -6427, -5445, -666, -2272, -1367, -2343, -1657, -977, -341, -4498, -6638, -9187, -5261, -7164, -7936, -3115, -606, 8, -2270, -4251, -625, -2676, -2996, -1791, -1351, -4850, -7049, -4491, -6968, -9406, -8327, -2774, -605, -930, 957, 3198, 400, -4914]
18830d914N41j054K591n11j105j256j826j00L720L649L817L66L99k059J264j941
18814A581J246k871j544K232K790J081m736m37j293J778L193M255O91k116j339
18799D511k939m34L655N374k230k190k202l674k9o47m320J313l433R95m485l572
18783a4307O916L327L47n240J455L867M417L92l431k043k70N62J13p170l75P028
18767d412M675P93N150J4613J5900N607n905j2053q547q307l230k180J365N990
18753I459K004M065r57r510k326m609j982J044J46J09L34K050J154J42M197Q63
18737F183r568m552m603J460L065L136N50K406M308K948k292K567J166M693N010
18722A6477k505q451n701m860n010N90K221O520N098k088l698K066R70K279J787
$$ y = [-4914, -4373, -5427, -2836, -3347, -4452, -5708, -7534, -7634, -3914, -265, 3552, 3918, 4317, 2258, 3522, 1581, 2827, -44, -1588, 644, 3434, 4515, -221, -658, -1951, -173, 3020, 7275, 7966, 5850, 4511, 1572, 1138, 4793, 10167, 7937, 5747, 3545, -129, -158, -805, -5125, -3812, -7245, -6250, -10735, -14307, -7391, -4064, -3717, -8957, -7502, -3635, 782, 1174, -2257, -4300, -4570, -4008, -3895, -11065, -11440, -4412, 263, 1056, 6206, 20819, 36719, 42326, 36421, 24368, 15821, 7514, 4284, 2104, 3469, 9459, 11463, 15528, 14571, 5061, 2735, -1874, -3856, -2812, -2666, -2557, -2223, -173, 981, 1123, 5320, 6183, -3385, -7937, -12540, -11080, -8015, -4879, -4329, -1923, 2385, 5333, 3041, 5608, 6774, 11467, 16477, 13972, 5521, -180, -5040, -10050, -9460, -7239, -719, 4379, 2291, -1407, 659, 1629, 3908, 5695]
18707E695j041m073P35k872n532K328N651K436l020m223J694K517Q96K854k92
18692C753L779j543j147Q0n562l393P6N642N934O022J033j156n614r551j222k184
18676e053L378M423j349l416k446j215L595K399N30p07J339K806j651k010m01
18661B22Q06l817n611N81J521K398P26j396K191K589J139m248m67m513J515R58
18645e406q01K1Q441K868l78n442o341j553J532l461L721O539k86n407q31K346
18629d438M484J80k523k288m420M293L333j027j925L790J880l814k028L041R111
18614G649j302j62l133k372j432j665l346O74K128p03k796l20K593K586l200k599
18598g400L485P72m06K332K076L213K124k440J149J222m848k936j357L139n23
$$ y = [5695, 4654, 581, 1316, -1556, -7088, -4760, 891, 3327, 307, -3916, -2222, 295, 1191, 4045, 3753, 7532, 5989, 4842, 4922, -640, -4033, -3957, 1685, 7619, 13641, 14674, 13518, 7904, -1647, -2869, -5053, -1675, 2748, 1399, -2017, -4463, -5678, -2083, 316, 846, 139, 1478, 4284, 2633, 623, 222, 1028, -2789, -8400, -7819, -6298, -3900, -3174, -4570, -2379, 210, 1349, -2899, -3366, -7879, -6364, -5406, -6207, -6186, 2255, 5123, 4745, -697, -7038, -8591, -7059, -10520, -6799, -260, -546, -5953, -6784, -4438, 46, 226, -2297, -4585, -9005, -4712, -1379, -2406, -4331, -541, 1339, -2475, -4503, -1462, 7649, 6347, 6185, 3052, 680, -752, -2417, -5763, -5089, -2961, -3664, -6460, -6780, -4187, -1601, -4801, -7400, -3915, -3143, -3549, -1217, 859, 4072, 6196, 3756, 4905, 6127, 1279, -1657, -3014, 125, -398]
18583c98K272M111k226n898k27l275n090J345M904O671J120J297M51k766j248
18568A043r08l49j120j444j508k928K88O96L405M730J562L117O29j56M762P836
18552A9655N102O092N454M17p067j4273q028l018o21N31p467l710N418L738K87
18537B510l3n114m083K02j11k980K021M675K451O425q28k095q61N65N160k998
18521D906m756m195K41K567K011r62m234K147j249J215K59O32L27p62J42O57j335
18504b389K167K663j368n2j445R54r33J578j251L710J937k541q05q78l598K477
18488B26m327j601q28J882J485N029M942j802q53L571R08k360m311k208m173m7
18472d467O31J806l773m41j237J828n89j575L421Q90j254N594n01j552K154j607
$$ y = [-398, 1874, 5985, 3759, -2139, -2366, -5641, -10731, -9386, -4482, 2189, 3309, 4606, 5057, 2291, 1043, 135, -214, -1334, -2778, -4286, -7214, -6926, -6230, -2825, 1905, 3467, 6584, 7213, 7057, 11819, 19655, 24757, 30849, 36303, 36720, 29653, 15380, 7352, 4334, 3713, 4244, -3223, -6933, -1515, 2223, 2510, 2477, -2637, -6720, -6518, -6629, -9609, -7588, -2913, -462, 5963, 5135, 3040, 2179, 2744, 7904, 4906, 150, -4045, -3804, -1237, 774, -188, -4422, -2275, -3524, -2309, -2050, -1418, -1091, -1853, -1711, -1054, -2389, -222, 2441, 1073, 1021, -424, 530, -403, 1175, -76, 3634, 5571, 3030, 2225, 1347, -2251, 226, -4101, -5702, -6530, -4648, -3163, 1866, 6808, 5006, 4153, 7724, 8632, 6272, 1961, -247, -4420, -4467, -3836, -2030, -5803, -6244, -7481, -5653, -6242, -7817, -4396, -3506, -4760, 834, 333, -1219, 935, -672]
18456f72l614J563L384K601l85l847q26O81M069J737l244j523K300K107J675J055
18440G061j489l25n071l179N263q39k055Q61l96J360K071k699J467j475j588j805
18424b838Q073R36N1p09N70o67m487l046L05r67K873K952P34j854k503J267k182
18407a492j943K243K02m018M0k113K994j71k508J305k526l833Q691N991J688K2
18391D572K463k525m317j588K33J837N212K201J080k610j004m348l477L48L716
18376A793M526K060J74j930q949m69M023K800m605j574J847J974k32p9l4M668
18360E993M890n094n212m74L936P11L210j402l900J689M354K418l298N16L6P4
18344H447j479J751L889k447j294N07k798r97L788l569k641K913j296k338n590
$$ y = [-672, -4286, -2723, 661, 3262, 2877, -970, -1796, -1115, 2954, 4691, 1447, -76, 2224, 4331, 6006, 7061, 5572, 5247, 176, -3003, 2260, 1421, -634, 227, -169, 1191, 3262, 563, 2030, 555, -1033, -2838, 5235, 6171, 6222, 5513, 6083, 5416, 929, -2117, -1812, -2779, 94, 3046, 3780, 1926, -577, 690, -1492, -3435, -1192, -990, -5008, -4968, -7081, -4087, -4258, -6766, -5461, -7987, -11820, -3129, 2862, 4550, 4572, 7035, 4510, 193, -1395, -1162, 675, 5887, 8088, 9168, 6558, 5554, 1206, -2271, -1923, 1793, 6319, 8379, 8553, 6623, -2326, -2795, 1228, 4028, -577, -2151, -304, 1670, 1438, 1359, 1325, 5993, 10883, 5789, 577, 103, 4039, 4750, 7960, 6558, 2658, 4347, 8701, 11119, 7821, 8337, 8373, 8447, 6968, 8719, 12608, 10161, 8867, 9374, 6576, 5579, 9367, 5798, 3157, 6070, 4774, 2436, -3154]
18329c154k554J426J670K921J209N074M372K096k445p210k659m735j668O839L585
18314D767K248j247O01m706k580K035k110P41N19m95J689q22l338K017N571L998
18298H888j251l899J022K334j0l082j630J566N057m608o275k974M86J435M38o44
18282c147j631J895Q22n07l904J470L343L905k28m417l774j11J414K288l235N258
18266e59O392M763O446Q603J024m742p713l496j660k328o428k804J363r18Q87
18251a170Q689K24P54K207J835j417K83j344l230J409k989m29M087N037l062m626
18235F258m286L14M805k184M931N075Q133P066N044R26j834n429l966j531l014
18220B0308o41j829n303l857J473L894R3m456o847Q35J83j190P04L472k224m660
$$ y = [-3154, -5708, -4282, -2612, 309, 1518, 6592, 10964, 13060, 10615, 3405, 746, -3989, -5657, 1182, 4767, 7015, 5768, 6369, 1663, -917, 1118, -992, -251, 268, -227, 1462, 640, -2698, -681, 4890, 8888, 7637, 3738, 4760, 7094, 7084, 4002, 2372, 3938, 8995, 4387, -1888, -4862, -4376, -2941, -2503, -3147, -4778, -2883, -2061, -2568, -6472, -5002, -1659, 2246, 2018, -2399, -6173, -6284, -4870, -2582, -5817, -559, 5833, 10596, 17042, 25645, 26669, 21927, 14214, 10718, 9058, 6730, 302, -2502, -1139, -2057, -1170, 7519, 7743, 8497, 10704, 12539, 11122, 11405, 10061, 6831, 8240, 5251, 4822, 8909, 13946, 10884, 6258, 1972, 2286, 7091, 4907, 9838, 14913, 23046, 30112, 35156, 36082, 34248, 28819, 24853, 23322, 20308, 19667, 17838, 12535, 8678, 10151, 14045, 14138, 9682, 2835, 3670, 3853, 2663, 3367, 6839, 4615, -45]
18204d5o3L398K356L64l318Q30k395R76J509p2K701K357M295k459l968P36k516
18187D686O95k95j456O434l56J216K249N673K671K761P458O121Q734J5254N908
18172F7753o239j0209j2058j3864n987j837J105k063J233o58j247k292j101K109
18158A4645O977P469p85k796q455l788K45P531O862m27J261N665P819M502M761
18143E1486Q850J0160K1878K7121J8972P91j3487k5959k6974j4677p607K445j253
18130E1746j302m481l429O142J0207J1415Q860R810Q016J1463P483K125P972J6474
18116A42501K4107K5057L8737N8572Q0499J16696J75788K85196M94824R26116
18106B368093J739773K455673J530741k81396j327542k164663j739114r84427
$$ y = [-45, -108, 3290, 5646, 6010, 2692, 3522, 1127, 2103, 3612, 3540, 6241, 8598, 12893, 10434, 6466, 7202, 4686, 5381, 5086, 3630, 10064, 9708, 10924, 13173, 18846, 21517, 24278, 31736, 37857, 46591, 61845, 67753, 61514, 51305, 39247, 25383, 19396, 17559, 18664, 16601, 17834, 17176, 15929, 13637, 12536, 14645, 21622, 29091, 28306, 25510, 17055, 13267, 13512, 21043, 27905, 27478, 28739, 34404, 42223, 46725, 51486, 60336, 70496, 92374, 119495, 138467, 139258, 125771, 99812, 72838, 58161, 50554, 52999, 51746, 50444, 45963, 42534, 48676, 58883, 70298, 79158, 88968, 96984, 108447, 115930, 118055, 126027, 142501, 166608, 191665, 230402, 288974, 369473, 486169, 661957, 947153, 1441977, 2368093, 4107866, 6563539, 8094280, 7812884, 6485342, 4320679, 2581565, 1597138]
18098A597138n07386k72245j51383r8784o2766l6352l3877k9158k3687k8466l2706
18087C20328l9328m0076l3318k9411l1400k5833j2864q758m542m716r013p806
18075G3263q590o574j0450o371o89j334l019o84P40J185Q90L47k880o36l704l053
18059B8441K619J515j541l069l491J96k942K961L66j765M374j030n755j334L647
18044B3192J422R94N047R976O472J1432K1850K1922K9056L0646K2925J4855O908
18031B06697p225k0019l0543k8345j7704n206q737l040K395M117R17j787k757
18018H8763o679p936o460m349m717n535m439j728L48K850P257Q627J4895J8220
18004I9117Q719L183O679J2256K0317J5329J3215M201p870j3438j8495j2447j1216
$$ y = [1597138, 1089752, 817507, 666124, 567340, 504574, 468222, 434345, 405187, 381500, 353034, 320328, 281000, 240924, 207606, 178195, 146795, 120962, 108098, 99340, 94798, 90082, 81069, 73263, 64673, 58099, 47649, 41278, 40589, 39255, 36236, 35552, 36292, 37477, 38367, 38714, 35834, 35198, 31494, 28441, 31060, 32575, 31034, 27965, 24474, 24670, 21728, 24689, 25055, 23290, 27664, 26634, 20879, 19545, 23192, 24614, 25608, 30655, 40631, 47103, 58535, 80385, 102307, 131363, 162009, 184934, 199789, 206697, 199472, 179453, 148910, 120565, 102861, 97655, 88918, 85878, 88273, 92390, 93307, 91520, 88763, 82084, 74148, 67688, 63339, 58622, 53087, 48648, 46920, 47268, 50118, 57375, 66002, 80897, 99117, 107836, 111019, 117698, 129954, 150271, 165600, 178815, 183016, 175146, 161708, 143213, 130766, 119550]
17991A19550j0166l705L968K970J0310K4985M5692M9059M0140L1892J9055K762
17979C36512k2846m3152n5007n5087l9724k1410l043J729J3329J9044K0386J7389
17967A68120J1354l378j4274k6576k5644k2833j7079q286o429l525n973p166m376
17954C3935j192R39j065l059n006L115O877M22l65P90K321N291K570R944R363
17939F4880R149J0703J3244J8403J5870K3348K2576K1408J1974Q626K375j311
17927B21245o281P7k05Q782K0497K1677J1178J5810J5841J7161Q112k012j5362
17914C16520k9507l7273m4660m5478l7814l2459j7264j3137r612n018O44j50L31
17901D5123m495j235K686l458m241J183j921K81j229j387K769L002k078J455l11
$$ y = [119550, 109384, 105679, 109647, 112617, 122927, 147912, 193604, 242663, 282803, 314695, 333750, 336512, 313666, 270514, 215507, 160420, 120696, 99286, 96243, 97972, 111301, 130345, 150731, 168120, 179474, 176096, 161822, 135246, 109602, 86769, 69690, 61404, 54975, 51450, 45477, 38311, 33935, 32743, 33682, 32617, 29558, 24552, 27667, 34544, 34966, 34601, 35391, 37712, 43003, 45573, 55517, 64880, 74029, 84732, 97976, 116379, 132249, 155597, 178173, 199581, 211555, 220181, 222556, 221245, 214964, 215041, 214836, 223618, 244115, 265792, 276970, 292780, 308621, 325782, 333894, 331882, 316520, 287013, 249740, 205080, 159602, 121788, 89329, 72065, 58928, 49316, 44298, 44942, 44792, 45123, 40628, 39393, 42079, 38621, 34380, 35563, 33642, 33923, 32694, 31307, 34076, 37078, 35000, 36455, 36144]
17886C6144M20m331M88M009L960j949l8J922M843Q925P592Q684Q089K4732L8679
17871A42169N5877P7855R0119Q4990O2407L6450J77m3994o4676p9211p1386n5742
17859B35035l5466k0060j0879K524K2912J7239N090J0756K986p506o065j6827
17847A99739j7374j4819j5210l131N016P284J6852J6857Q057J207q261j8988k0470
17834A56759j6664j3726j8433j7487r812l651J504R27M338J0517J3935K7014M2645
17821A77866N8405P7542P3302O3745M6029J2877k6183n2032o8085p5317o2393
17810B25756m5974l1765k2838j3881p634k044N335N671Q48o851p988q277j0487
17797G9871j4333q874n723q28K357r09o942m94k547k630p89j461J60k376M155
$$ y = [36144, 36564, 32233, 32721, 36730, 40690, 38741, 38703, 40625, 45468, 54393, 61985, 70669, 78758, 103490, 142169, 198046, 275901, 366020, 451010, 513417, 549867, 550044, 506050, 441374, 362163, 290777, 235035, 199569, 179509, 168630, 171154, 194066, 211305, 216395, 227151, 230137, 222631, 216566, 199739, 182365, 167546, 152336, 149205, 154221, 161505, 178357, 195214, 203271, 204478, 196217, 177229, 156759, 140095, 126369, 107936, 90449, 80637, 76986, 78490, 79417, 83755, 94272, 108207, 135221, 177866, 236271, 313813, 387115, 450860, 496889, 509766, 483583, 431551, 363466, 288149, 225756, 179782, 148017, 125179, 111298, 103664, 101620, 106955, 112626, 113474, 106623, 98635, 90358, 79871, 65538, 56664, 50941, 50113, 52470, 51561, 44619, 44125, 41578, 38948, 38159, 36698, 36858, 34482, 38637]
17782C8637M50j182K06j695M426N449N462L558L057j656m579J392o553m305K0
17767D2687N771o69N613Q739J0465J5593K1700L2037M3989N5107O3059N3028L8462
17754C95581K8993j68k0291k0620k7287j4324N313K3812M6404M8892L6225K2958
17742E25488j0033l6600n3840o6547o2389m8378m2426k8424j3928k031K305J355
17730A64552k241N384j581m889q034j4129j4622j568P797J6543J2272J4796J9305
17717A93585J2659q66L80p842j3930j0400p157K53k726N083K1520J8545n646j0965
17703A92493j4849j9226k3632k7855j9382p692m393j0177J002J0840O593L926
17691H7648Q767M666m80R065M112m295o354p853p139o11J925k609L225J0073O320
$$ y = [38637, 39087, 37905, 38111, 36416, 40842, 46291, 51753, 55311, 58368, 56712, 52133, 53525, 46972, 42667, 42687, 48458, 47789, 53402, 62141, 72606, 88199, 109899, 141936, 185925, 241032, 304091, 357119, 395581, 424574, 424406, 404115, 383495, 356208, 341884, 347197, 371009, 417413, 466305, 502530, 525488, 515455, 478855, 425015, 358468, 296079, 247701, 205275, 176851, 162923, 160892, 163197, 164552, 162311, 167695, 166114, 161225, 153191, 139062, 124440, 122872, 130669, 147212, 159484, 174280, 193585, 206244, 205378, 205758, 197916, 183986, 173586, 166429, 166682, 163956, 169039, 190559, 209104, 203458, 192493, 177644, 158418, 134786, 106931, 87549, 79857, 75464, 65287, 66289, 77129, 83722, 87648, 96415, 101081, 100601, 109666, 113778, 109483, 103129, 95276, 88137, 87526, 89451, 86842, 90067, 100140, 106460]
17676A06460J24l511P043J0131J3570K1816K8784K1108K3987K0674J1519n720
17664B55985j2054j9203j6080o554j626O065J2281J9290J6086P546j2482j4942
17652B34312k1764k4782k9757k9878j9117j5368j5705j1108k045k514J527M297
17640F8098j739o223k213M66M056o257p687k896o60n030J362M181k71J484N509
17625E2180N707L874o091L016M027L013l898j2729o148j520L704j144K695M256
17611E0942K310J738Q820Q663M473N001R165J0432K558l221k969K644j908l252
17597I5396r025j1145j3473o729l034j922l315n90j30j175k610J676R89k346j061
17582D1506k564j995p59K645k080L670K500L31L298K129K678L539k017J464O197
$$ y = [106460, 106584, 103073, 110116, 120247, 133817, 155633, 184417, 205525, 229512, 250186, 261705, 255985, 243931, 224728, 208648, 202094, 200468, 206533, 218814, 238104, 254190, 261736, 249254, 234312, 212548, 187766, 158009, 128131, 109014, 93646, 77941, 66833, 64788, 62274, 63801, 68098, 66359, 60136, 57923, 58389, 62445, 56188, 48501, 45605, 44945, 39915, 41277, 45458, 45187, 46671, 52180, 57887, 61761, 55670, 58686, 62713, 65726, 61828, 49099, 42951, 41431, 45135, 43991, 46686, 50942, 53252, 54990, 63810, 72473, 76946, 81947, 91112, 101544, 104102, 100881, 97912, 100556, 98648, 95396, 86371, 75226, 61753, 55024, 51990, 50068, 46753, 46163, 46033, 44858, 42248, 43924, 44913, 42567, 41506, 38942, 36947, 36188, 38833, 36753, 40423, 42923, 43254, 46552, 48681, 51359, 54898, 52881, 54345, 60542]
17567F0542L396N878L280M091M801O979K180k075m612j440o053J788O856P471
17553I3082Q844J1829N990m133j1785j6959j3644j4414l275L940J0789J7280J8182
17540A05726J2008Q633r37r226r148j2058q205p384K89k573j680M573P479R063
17526I6560J4186J8299L1648M0248L2456K5814J0238k77r249j7330j4814Q74O262
17513B34915J7399L0462K4192J8331O531j1629k4788k5648l5881l5765k6543k0022
17501A51554j4127n985r027j0066k570k514P675J6546K1358L1770K7762K6555
17489B38931J1039j2310j8123k5909k9026j8013o429j335J2384J5461J0128l22
17477A76476k156o901j6013j8184j6686q649m506L780J0852J8961J5827J0304
$$ y = [60542, 63938, 69816, 73096, 77187, 81988, 88967, 91147, 89072, 84460, 83020, 76967, 78755, 85611, 93082, 101926, 113755, 119745, 115612, 103827, 86868, 73224, 58810, 55535, 59475, 70264, 87544, 105726, 117734, 126367, 125430, 116204, 107056, 94998, 86793, 79409, 79698, 77125, 75445, 80018, 87497, 96560, 110746, 129045, 160693, 200941, 233397, 259211, 269449, 269172, 259923, 242593, 227779, 228653, 234915, 252314, 282776, 306968, 325299, 331830, 320201, 295413, 269765, 233884, 198119, 171576, 151554, 137427, 131442, 122415, 112349, 109779, 107265, 114940, 131486, 152844, 184614, 212376, 238931, 249970, 237660, 219537, 193628, 164602, 146589, 140160, 138825, 151209, 166670, 176798, 176476, 174320, 167419, 151406, 133222, 116536, 107887, 103381, 107161, 118013, 136974, 152801, 163105]
17465A63105k203j1511j8983j5028j5330j0673M317J3795L8416L6256L2707L8383
17453B53251M6612O0926J01473J42229J66029J35311O4601m1254j21917j49069
17443F58192j26106q3484l9708j3288j9948j9006k5752l9719l9656j9559J0579
17432B42545L0749L4848M5369L4699Q463n909k6940l7587l8605l7839k9567k1705
17420A98521j4615j1200m115k892q43j90N636O631L419J676l414l806J144j545
17406A74407n641q281l563M07O773J3018J3981J7609K1553K6995L5014M8468N0370
17393C91110N0844L8350K5303J1433O736j244m772j821M50J7148L8723O1370R4144
17380G27774J20539J32020J25407J06175P8023M8714J1664p420m363P574L4384
$$ y = [163105, 160902, 149391, 130408, 115380, 100050, 89377, 93694, 107489, 145905, 182161, 214868, 253251, 299863, 360789, 462262, 604491, 770520, 905831, 970432, 929178, 807261, 658192, 532086, 448602, 408894, 395606, 375658, 356652, 330900, 291181, 251525, 231966, 242545, 273294, 308142, 353511, 388210, 396673, 390764, 363824, 326237, 287632, 249793, 220226, 198521, 183906, 172706, 168591, 165699, 164856, 164666, 170302, 176933, 180352, 182028, 178614, 174808, 175952, 174407, 168766, 160485, 156922, 157329, 164102, 177120, 191101, 208710, 230263, 257258, 292272, 340740, 391110, 441954, 480304, 505607, 517040, 523776, 522532, 517760, 515939, 516389, 533537, 572260, 633630, 727774, 848313, 980333, 1105740, 1211915, 1289938, 1338652, 1350316, 1342896, 1338533, 1346107, 1380491]
17369A380491Q1881J37332K09738L11855M38650N98851Q20409J188794J804933
17360F972934K894823M810347P541756R779093R638726P148581M236006N14779
17352E3537045l981988p544718r455629r326574p278869m722043k855866j786395
17344F584963j207046q66970o47078m96625l91562k98180k14979j39529o9850
17335B253144o852N1336J05636J50979J70290J69677J43616R9792M1205j3887
17325C164936n5037p6098o1395k7638L1436J13453K07155L28996M86114O91576
17315D803498R49785J302795J849036K761877M335550P171831J1723220J6822069
17307E1719661J8961805J6217681J1444751N585630k558501j1035915j6719432
$$ y = [1380491, 1462372, 1599704, 1809442, 2121297, 2559947, 3158798, 3979207, 5168001, 6972934, 9867757, 14678104, 22219860, 31998953, 41637679, 48786260, 53022266, 53537045, 49555057, 42010339, 32554710, 23228136, 15949267, 11227224, 8371358, 6584963, 5377917, 4510947, 3863869, 3367244, 2975682, 2677502, 2462523, 2322994, 2253144, 2246292, 2297628, 2403264, 2554243, 2724533, 2894210, 3037826, 3137618, 3178823, 3164936, 3109899, 3033801, 2972406, 2944768, 2976204, 3089657, 3296812, 3625808, 4111922, 4803498, 5753283, 7056078, 8905114, 11666991, 16002541, 23174372, 34897592, 51719661, 70681466, 86899147, 98343898, 103929528, 101371027, 90335112, 73615680]
17300G3615680j8947773j6715066j1899844p387916m484287k876988j986975j483678
17292G833153j164771r40214p51364n53936l52781j68100k0396P2668R3687O0456
17282D108402n3596j67269k64000l24362l34475l03840k34745j57385p1234O314
17272B203810O6488J28677J91043K46732L14847L71276K99714J38814J8251l8087
17262C941565L1506J90045L58628N06695O34234Q31723J165047J728693K769715
17253A2157851M264034N661701O928333Q765286R052320O871624N751444L594360
17245F3046953n89399k004235j862902p94748K279046N143598Q480465Q685077
17237H2383855M809491K470623j949603p972985j0339405j1933514j2695996j0642267
$$ y = [73615680, 54667907, 37952841, 26052997, 18665081, 14180794, 11303806, 9316831, 7833153, 6668382, 5728168, 4976804, 4422868, 4070087, 3901987, 3881591, 3954259, 4047946, 4108402, 4054806, 3887537, 3623537, 3299175, 2964700, 2660860, 2426115, 2268730, 2197496, 2203810, 2270298, 2398975, 2590018, 2836750, 3151597, 3522873, 3822587, 3961401, 3979652, 3941565, 3973071, 4163116, 4521744, 5028439, 5662673, 6494396, 7659443, 9388136, 12157851, 16421885, 22083586, 29011919, 37777205, 46829525, 53701149, 59452593, 63046953, 62457554, 60453319, 58590417, 57795669, 60074715, 65218313, 73698778, 82383855, 87193346, 89663969, 87714366, 79741381, 69401976, 57468462, 44772466, 34130199]
17229C4130199q312185o193047m045933k474660j561100j069049p67692n88143
17221I118390m29572k21535N4071M30061R40153J687317K896967M836827P173371
17212B6486050Q191764P571805Q190568Q058567L793934q42679l368508n879904
17204E2201597o431243m996974l294015j703043j02187J993350K865946P45425
17196D1278856j705600l159250m801627n422525n151338m881312m126958k862781
17188I167465j826432j183180p89218n51671m15511l54300l04091k47010k03248
17179C292804j50218r7967n3688q809K3350L6683L7157K9635N6451J09457K03356
17168C478211L65306O32503J060869J775714K833295L722204L660035L678879
$$ y = [34130199, 25818014, 19624967, 15579034, 13104374, 11543274, 10474225, 9706533, 9118390, 8688818, 8467283, 8521354, 8951415, 9891568, 11578885, 14475852, 19312679, 26486050, 34677814, 42249619, 50440187, 58498754, 62292688, 61450009, 58081501, 52201597, 45770354, 40773380, 37479365, 35776322, 35674135, 37667485, 40533431, 41278856, 39573256, 36414006, 31612379, 26189854, 21038516, 16157204, 12030246, 9167465, 7341033, 6157853, 5368635, 4816964, 4401453, 4047153, 3743062, 3496052, 3292804, 3142586, 3044619, 2990931, 2982122, 3005472, 3042155, 3079312, 3108947, 3165398, 3274855, 3478211, 3843517, 4476020, 5536889, 7312603, 10145898, 13868102, 17528137, 21207016]
17160B1207016M178386L241096O39054q02895k025410k794357k430445j459781
17152A9752664o22687Q0188J044982K035180J554408l09017j326971k352727l118069
17143A6737951l185672l011191k787170k087034j331203q34351n44660l73787
17135B582883k68314k06583j84473j71852j50574j28103j02229q6996p2116n3634
17125A158009n1542m6252m8218o0578o4178n8149n3084m1141l4154k9814j8747
17114F52152j9227l2115l5194l3757k3932j7908k3194k1348j2953j5431j4943
17103D02150j5898j9951j5527j4420j5679q760j2011j3161j0282r774l009k035
17091B61643k117j1655j3794j8438j4338j0055k472K117J3629J4397J1902J1959
$$ y = [21207016, 25385402, 28626498, 29265552, 28462657, 26437247, 23642890, 21212445, 19752664, 19129977, 19210165, 20255147, 22290327, 23844735, 23535718, 22208747, 19856020, 16737951, 13552279, 10541088, 7753918, 5666884, 4335681, 3501330, 2956670, 2582883, 2314569, 2107986, 1923513, 1751661, 1601087, 1472984, 1370755, 1283759, 1211643, 1158009, 1106467, 1060215, 1011997, 951419, 887241, 829092, 776008, 734867, 700713, 670899, 652152, 632925, 600810, 565616, 531859, 507927, 490019, 466825, 445477, 432524, 417093, 402150, 386252, 366301, 350774, 336354, 320675, 311915, 299904, 286743, 276461, 266687, 263678, 261643, 259526, 247871, 234077, 215639, 201301, 191246, 188774, 190891, 204520, 218917, 230819, 242778]
17079B42778P958N55j0654j5791j5402j3071j6935j0229n010r42J575M923N3L00
17065A70108q848j484p704j3373l264k104L087R467Q867J3594Q025K494M173j335
17051A81703m568n087q44k819N07J0351O876j913m025N71m958p167p252r937j1573
17036A39865j1336q716j0786l24L214L866K739J197j964q154q328m423m319o24
17022I1907m38P33Q137J0902Q868k14k630q253m692j536K433L554M65l21M300
17007A13215J205O50K033p104M082M927l24M53j570l991K157L129L323N349l294
16992A24240l919p518q02q126j1763p661k102k9j227k174l25o434m723k15l63
16977F6859K911P08k067O153Q987K408m287n905o705K375n146n483k183o530j940
$$ y = [242778, 250736, 251291, 240637, 224846, 209444, 196373, 179438, 169209, 164199, 163257, 164832, 169755, 169808, 170108, 161260, 159776, 152072, 138699, 135435, 133331, 136418, 145885, 154752, 168346, 176371, 178865, 183038, 181703, 177135, 172048, 171204, 168385, 168892, 179243, 186119, 184206, 180181, 180752, 175794, 168627, 161375, 151438, 139865, 128529, 119813, 109027, 108703, 111917, 115783, 118522, 119719, 117755, 109601, 101273, 96850, 92531, 91907, 91469, 92202, 100339, 111241, 120109, 119895, 117265, 109012, 104320, 102784, 105217, 108771, 109236, 108915, 113215, 114420, 115070, 117103, 109999, 114081, 119008, 118684, 119137, 117567, 113576, 115733, 118862, 122185, 127534, 124240, 120321, 112803, 112001, 103875, 92112, 84451, 82349, 82320, 81093, 78919, 78594, 72160, 67437, 67222, 66859, 69770, 70478, 68411, 74564, 83551, 85959, 81672, 75767, 69062, 71437, 66291, 60808, 58625, 52095, 50155]
16962E0155K731j114O38Q818M760J325R17p572l842J802j306l459K551M66k296
16947E4574k62l629m05k204J05J743K317M647l880O62J156J819J2N156O279m736
16931F3354k96l14K79k483j003M74M505P160K178o275n652m581r494p589L098
16916D3361K082O98l810m170K114P720P36p642l202j242j620R57Q079k47k216
16901D1598n448L462Q560K878L08k633j420j808n633L85N449O155J474l184p824
16886D2319k613J576m01o894j696J700J182l832k272o84J054K584j477k196L61
16871B8711Q53j134l04k387j250j878n546Q68K360M770P06k67M597K355j76l94
16855C1884N39M085J481L605N605k054N86l5j00M120N395J48m727P64J914L871
$$ y = [50155, 52886, 51772, 52410, 61228, 65988, 67313, 68230, 60658, 56816, 58618, 57312, 53853, 56404, 56870, 54574, 54312, 50683, 50278, 48074, 48179, 49922, 52239, 56886, 53006, 53668, 54824, 56643, 56655, 61811, 68090, 63354, 63058, 62744, 63023, 60540, 59537, 60011, 64516, 71676, 73854, 67579, 61927, 57346, 47852, 40263, 43361, 45443, 46141, 42331, 38161, 40275, 47995, 48731, 41089, 37887, 36645, 35025, 35982, 44061, 43814, 41598, 36150, 39612, 48172, 51050, 51358, 48725, 47305, 45497, 39864, 40249, 45698, 51853, 53327, 50143, 42319, 39706, 41282, 40881, 33987, 32291, 33991, 35173, 31341, 29069, 28385, 29439, 32023, 30546, 28350, 28711, 29564, 28430, 28126, 25739, 24489, 22611, 17065, 17933, 20293, 25063, 25769, 25502, 30099, 32454, 32278, 31884, 32423, 36508, 37989, 41594, 47199, 45145, 45731, 45696, 45596, 49716, 55111, 55259, 50532, 51296, 53210, 57081]
16839E7081K994L014O805P029L018R072J5561K0922M8081P4463R0933Q8937O0878
16826D88788K1506j9376n8173p8064q5885p1661n3992l5537j7424j1253j1373
16815F7556m813m504o030o746k555l85L579L915l548l101n189j203K857k393k725
16800C4715L53o07M198j409q159j862J883L798L12L69N795M568M911J938O562
16785E7365O891J1529J6030K3272M4516O7409P4554O3995M0648J2177k0878n2357
16773C45151o9345o8946n7582l9725j9824j1361p394p084q235j2546k172N26l866
16760C7597j226o686j735N212N956O07l099j640k112r43O236P018L484J739j265
16745D9143L457P013N671M292J3354J8257K8085L4616M8667O3291O7988N2805
$$ y = [57081, 60075, 63089, 69894, 76923, 79941, 89013, 104574, 125496, 173577, 248040, 338973, 427910, 488788, 510294, 490918, 432745, 354681, 268796, 197135, 143143, 107606, 90182, 78929, 67556, 62743, 58239, 52209, 45463, 42908, 42523, 46102, 50017, 46469, 43368, 38179, 36976, 39833, 37440, 34715, 35068, 34461, 38659, 37250, 29091, 27229, 29112, 32910, 33222, 33591, 39386, 43954, 48865, 50803, 57365, 64256, 75785, 91815, 115087, 159603, 227012, 301566, 365561, 406209, 418386, 397508, 345151, 275806, 206860, 149278, 109553, 89729, 78368, 70974, 63890, 55655, 43109, 40937, 41463, 37597, 36371, 29685, 27950, 33162, 39118, 39725, 36626, 34986, 32874, 31931, 38167, 45185, 48669, 50408, 49143, 52600, 59613, 65284, 69576, 82930, 101187, 129272, 163888, 212555, 275846, 343834, 396639]
16733C96639L7244K5590j4418l0733l2439l9225j6798n19K0691L7056L1286J7170
16721D31544K615k3233m5297n5214n7366m9382m2365k6942j1153l657O068J6947
16709A42565J7569K4253K9824K7681J4383j508r444j0728j9490j2162k994K507
16697B02456R332J0591J9107R479q189j6346k8227l1278k5926k2770k2939k0340
16685G4950r029q451p506l305n436p21j967j282Q78m98j654j736J124j198m221
16670B9948l464R23R79R92k469j940P490O331J0578J5751J8002K3107K4730K8302
16656A59260K5448J1498M944p254j7636j4606o705k760j702Q408J8807J0739N121
16643A93562n262j2390k1229k4466j4585k0330k1183j7070j5166n134m785n310
$$ y = [396639, 433883, 459473, 445055, 414322, 381883, 342658, 325860, 325341, 346032, 383088, 414374, 431544, 434159, 410926, 365629, 310415, 253049, 203667, 161302, 134360, 123207, 119550, 125618, 142565, 160134, 184387, 214211, 241892, 256275, 254767, 245323, 234595, 215105, 202943, 199949, 202456, 211788, 222379, 241486, 250965, 242776, 226430, 198203, 166925, 140999, 118229, 95290, 74950, 65921, 57470, 49964, 46659, 41223, 40502, 38535, 37253, 38131, 37633, 35979, 34243, 35367, 34169, 29948, 26484, 27407, 28386, 29378, 26909, 24969, 32459, 38790, 49368, 65119, 83121, 106228, 130958, 159260, 184708, 196206, 201150, 193896, 176260, 161654, 154949, 152189, 150487, 158895, 177702, 188441, 193562, 188300, 175910, 154681, 130215, 115630, 95300, 74117, 57047, 41881, 36747, 31962, 26652]
16631B6652M226p17o518o461M442K225r73r06j767L091j796L54N513J528m056
16616B4837k247k289o34j196j561O590J0775L389n957j353m424k616k672k802
16602A7840r58K892J635j310m71M372M82m572j180M51j542j078k745N009J200
16587B0025K007K95Q80N279K223L740L431n77L306Q323J303l890M629J1567N624
16572F8165O096J7721K8091L9447M7322O5345R7248J55130K77191M82327O23752
16561A907835L98356m8510l52744n49733m78102k98165j69762j00061o8323m7301
16551A93490l2370k1708j8461j6891j4544q154n047p377o347k706p255j1667p307
16538C3656q45K919r43m057l375k80k586j710j305Q56N065m006m878M69l240o480
$$ y = [26652, 30878, 30161, 23643, 17182, 21624, 23849, 22876, 21970, 20203, 23294, 21498, 21852, 27365, 28893, 24837, 22590, 20301, 19667, 18471, 16910, 23500, 34275, 37664, 31707, 30354, 25930, 23314, 20642, 17840, 16882, 19774, 21409, 20099, 19628, 24000, 24482, 19910, 18730, 19181, 17639, 16561, 13816, 18825, 20025, 22032, 22327, 23207, 28486, 30709, 34449, 37880, 37303, 40609, 48932, 50235, 46345, 50974, 62541, 68165, 74261, 91982, 120073, 159520, 206842, 272187, 369435, 524565, 801756, 1284083, 1907835, 2306191, 2257681, 1904937, 1355204, 877102, 578937, 409175, 309114, 240791, 193490, 161120, 139412, 120951, 104060, 89516, 81362, 76315, 68938, 62591, 59885, 52630, 40963, 33656, 32811, 35730, 34787, 30730, 27355, 27075, 24489, 22779, 21474, 22330, 27395, 23389, 18511, 18980, 15740, 9260]
16522I260j868M370N284k715m608M946N406K14l47K97J298K08o947k928M72o4
16506A2278J428K706J090K970k041l983m858o100m681P072P548P060q98n087m048
16491A0456L73N756N63j22n810m949r516q504r171j5020j1717K871M433P161J3844
16476a9352J2539M616P883M268M413K447K049j311q566o36K052J561m32K493P964
16461B1988K623L950J767m404M7j2l608q745k228j95K814j918j09l895M333j856
16445A0552m308o72K298o45m45j008M398q25K059L502J639M306r8q94N309J300
16429B6468Q642M820m848j687n662q099r60K936L170K442N592K051K375m13l759
16414C3068n908n141p10N022k98M172L086l916r94k949P84M821Q82J626m198J765
$$ y = [9260, 7392, 11762, 17046, 14331, 9723, 14669, 20075, 20289, 19942, 20239, 21537, 21745, 14798, 11870, 12342, 12278, 13706, 16412, 17502, 20472, 18431, 14448, 9590, 3490, -1191, 5881, 13429, 20489, 19591, 14504, 10456, 10829, 16585, 17148, 17026, 11216, 6267, -3249, -11753, -20924, -35944, -47661, -44790, -40357, -33196, -19352, -6813, -2197, 5686, 9954, 14367, 16814, 18863, 17552, 8986, 8350, 10402, 11963, 11531, 14024, 21988, 24611, 28561, 30328, 25924, 25971, 25959, 22351, 13606, 11378, 11183, 13997, 12079, 11970, 8075, 12408, 10552, 6244, 5572, 7870, 7225, 6780, 5772, 10170, 9345, 11404, 14906, 16545, 20851, 20753, 19859, 25168, 26468, 35110, 39930, 35082, 33395, 27733, 19634, 18674, 21610, 24780, 27222, 32814, 34865, 37240, 36827, 33068, 27160, 22019, 21309, 26331, 26033, 30205, 33291, 29375, 28381, 25432, 26216, 31037, 31919, 33545, 29347, 31112]
16398C1112k962j906n37k849k605p34L472Q715L591k041n858j426K012M086O291
16383C8361L185J917N76J398r03k523l632q214q726K599K427M926p04l223j676
16368B5788k371J440k760J47L500P9K487O73L014R548J245l359m895O74Q28m279
16352C1759J9M800k210j482R24j95l677J179l573j752n18J394m568J429J2867
16337C6396O741K174N288L345k112r306j5149l2347l8187k4456j0385k01Q845
16324f9354K4221K4122J9059K4703K6091K3423J0311k238j0792j3479j0053l664
16312D2350j964j132k934J314J342j656l69M91K803K439J735M786P71nn080m261
16296D0630q08l004n384J19j196Q705K994K130k12k510j301m962l286l89J0815
$$ y = [31112, 28150, 26244, 25707, 22858, 20253, 19519, 22991, 31706, 35297, 33256, 27398, 25972, 27984, 32070, 38361, 41546, 43463, 44039, 45437, 44534, 42011, 38379, 30165, 21439, 24038, 26465, 31391, 30687, 27464, 25788, 23417, 24857, 22097, 22244, 25744, 25823, 28310, 28983, 31997, 41545, 42790, 39431, 34536, 35210, 36038, 31759, 31778, 36578, 34368, 32886, 33810, 33615, 29938, 31117, 27544, 25792, 25274, 26668, 22100, 23529, 36396, 43137, 45311, 50599, 53944, 51832, 42526, 27377, -4970, -43157, -67613, -77998, -78199, -69354, -45133, -21011, -1952, 22751, 48842, 72265, 82576, 80338, 69546, 56067, 46014, 42350, 40386, 39254, 36320, 37634, 38976, 37320, 36951, 37442, 40245, 42684, 44419, 49205, 49976, 49971, 44891, 40630, 39822, 36818, 31434, 31553, 30357, 39062, 42056, 44186, 43974, 41464, 40163, 35201, 31915, 31526, 42341]
16281D2341J6827J4295J1685P062K0182J8459Q474K7956J860J7089K2599l3584
16269A75245o742o5608J2335K6037n317j8791L656J1918p686o697n214l1581l2671
16256D8884j8633q265q776k961L018j376K136O034l410m245j905J73K997m560
16242I111j533O4l433O576J1550L230Q336N040N499l060p949J294J925j3386j2999
16227A0265r119p908r050m874k158j549Q521J2685K253J446j91O248O459O322
16213A9350j747j1621k1820m7519m1439N198L8455K8357L0678N4146L7571R945
16201I9554J0548J4266q721j8970k0060k2394k0812j6806j1295m179k373k027
16189c269j264L623N818n16r92K664o754m365K564N454p346j6558j9490l9327
$$ y = [42341, 59168, 73463, 85148, 92210, 112392, 130851, 139325, 167281, 169141, 186230, 208829, 175245, 168503, 102895, 115230, 141267, 135950, 117159, 120815, 132733, 125047, 118350, 113136, 81555, 48884, 30251, 21986, 13210, 10249, 13267, 11891, 14027, 20061, 16651, 12406, 10501, 10674, 13671, 9111, 7578, 7642, 4209, 10785, 22335, 25565, 33901, 38941, 44440, 41380, 33431, 34725, 36650, 23264, 10265, 1146, -6762, -15812, -20686, -22844, -24393, -15872, -3187, -934, 512, 321, 6569, 13028, 19350, 17603, 5982, -15838, -63357, -104796, -99598, -61143, -32786, -2108, 52038, 89609, 99554, 110102, 124368, 115647, 96677, 76617, 54223, 33411, 16605, 5310, 1131, -1242, -3269, -4533, -910, 4908, 4392, 3400, 6064, -690, -5055, -2491, 2963, -4383, -20941, -40431, -79758]
16175g9758n6301m9796j0883L7713O0782Q7940Q2297M8807K0660M789J143l672
16163A43721j1914j5947j1605p733q488j2407j0948o923K760P539j69l990j7901
16150D5995m7548n7309O054K1638K6398Q1889J11094J29767J16484Q1820q194
16139E08088p0709r4328p1192l6747j2557K0757O3847R7314P5219N906m9690q7128
16127C48780p4638l8944j9874n646l285j3586k0108j3812j2353j2347m916J1130
16115A40401J7135J7002K3243J8771K4769L9225M8008M2572K2718J998r523o366
16103C79953j2318j3949j3858j9983j2714J4533M5557Q6639J11851R3470K5472
16092F84653k8986p5116p9443m3944k1759n115J0466J3164J128j6780l3611k1791
$$ y = [-79758, -136059, -185855, -196738, -159025, -98243, -10303, 71994, 120801, 141461, 146250, 147393, 143721, 131807, 115860, 104255, 96522, 88034, 75627, 64679, 57756, 60516, 68055, 67886, 63896, 45995, -1553, -58862, -52808, -31170, -4772, 77117, 188211, 317978, 434462, 516282, 508088, 437379, 343051, 271859, 235112, 222555, 243312, 307159, 404473, 479692, 485598, 435908, 348780, 274142, 235198, 215324, 209678, 206393, 192807, 172699, 158887, 146534, 134187, 129271, 140401, 157536, 174538, 197781, 216552, 241321, 280546, 328554, 371126, 393844, 395842, 386319, 379953, 367635, 353686, 339828, 319845, 307131, 321664, 367221, 453860, 565711, 659181, 684653, 655667, 580551, 501108, 457164, 435405, 430290, 440756, 453920, 455048, 438268, 404657, 382866]
16080C82866p871Q641J8251K7827M2552M4486L4717K8415L8461M6959M6366M4022
16068G55692O5362J01555K11821L80317M95812K93753k1164k17279l27071j78209
16058A560589P0027L32584N71350N21867J25300j39689l46995l41399k01022r9223
16048B053389m2627k875K8192Q2631J31510J47220J82688K47702L27537M45651
16038C601018N05206N13533N23791N40350O31769P46489Q46827J050891J312913
16029A0272787J779345K534967L629797N250664P280730R589046J3045278K0403531
16021G3786145L4911331O3092778J00538522J03985185L5398704k5416356p0735313
16014C15560996r9632159p7431757m5517825k5320097j5661441j0688154q154019
$$ y = [382866, 374995, 383636, 401887, 429714, 472266, 516752, 551469, 579884, 618345, 665304, 711670, 755692, 821054, 922609, 1134430, 1514747, 2010559, 2304312, 2283148, 2065869, 1738798, 1560589, 1630616, 1963200, 2534550, 3056417, 3181717, 3042028, 2695033, 2353634, 2152612, 2053389, 2010762, 2007887, 2036079, 2118710, 2250220, 2397440, 2580128, 2827830, 3155367, 3601018, 4106224, 4619757, 5143548, 5683898, 6315667, 7062156, 7908983, 8959874, 10272787, 12052132, 14587099, 18216896, 23467560, 30748290, 40337336, 53382614, 73786145, 108697476, 171790254, 272328776, 376313961, 411712665, 386296309, 315560996, 215928837, 138497080, 92979255, 67659158, 51997717, 41309563, 33155544]
16007C3155544o264422m642977l470164k704418k224743j851192j525060j258241
15999I214327r98886q22153o75747n29536m08493l16519l08720l29247l18782
15990D506244k93012k70656k59072k80910l03609k62894k17877j82859j37447
15981B297908j18575j13935j28183j22225r9626q4768r1181j13835j16409q7800
15971A221371n5440m2685m3656l5723m2713n5479o1025o9604o0562m1617l4730
15960F78137k5516o758l835k444L335j1679j5299k5873m3027m9072m0660k4243
15948D33066j2717k2784j9722k1777j4902q139q887j0485r029r220j934J3691
15936C07161L740q367j9407l1258l2681j5532j142J208o53J554M720P182J3138
$$ y = [33155544, 26891122, 22248145, 18777981, 16073563, 13848820, 11997628, 10472568, 9214327, 8215441, 7393288, 6717541, 6188005, 5779512, 5462993, 5154273, 4825026, 4506244, 4213232, 3942576, 3683504, 3402594, 3098985, 2836091, 2618214, 2435355, 2297908, 2179333, 2065398, 1937215, 1814990, 1715364, 1630596, 1539415, 1425580, 1309171, 1221371, 1165931, 1123246, 1079590, 1043867, 1001154, 945675, 884650, 815046, 754484, 712867, 678137, 652621, 645863, 642028, 639584, 642919, 631240, 615941, 590068, 547041, 497969, 457309, 433066, 420349, 397565, 377843, 356066, 341164, 333025, 324138, 313653, 304624, 295404, 293470, 307161, 310901, 302534, 283127, 251869, 219188, 203656, 202514, 203722, 203069, 204623, 209343, 216525, 229663]
15923B29663J3700M255k549N964Q961j374N423m531j3033j1199j6372k1866j2659
15910A84383p937j279P850j52j205P197J731m222m886m600j1274j5644j8725k8287
15896A02950o0139j01240q5919k9794M8797J00250Q5674R3664P1677M0110K490
15885B68520k5741k1687l9155l0622p059J660K725n142j0566j0698j6301q153
15873I7781m037o22o882k0866q671r53J324Q247L2496O6336R4402P5046L3492
15860C67093J0382k1271o0927n9490l7572k4942j5728r418k910l047l116k67K41
15847A39028j167M938P179M67n514m971p673p098j4887k0747k7393k5351j1213
15834B5598o325M866K1453J0604L689L6525N4356K7548J8523K8902j0488m9136
$$ y = [229663, 243363, 247618, 245069, 251033, 259994, 258620, 264043, 259512, 246479, 235280, 218908, 197042, 184383, 176446, 175167, 183017, 182865, 181660, 188857, 190588, 186366, 181480, 176880, 165606, 149962, 131237, 102950, 42811, -58429, -144348, -174142, -125345, -25095, 60579, 154243, 225920, 266030, 268520, 242779, 221092, 181937, 151315, 144256, 145916, 148641, 143499, 132933, 122235, 105934, 97781, 93744, 93122, 86240, 65374, 56703, 55750, 57074, 65321, 97817, 164153, 258555, 333601, 367093, 377475, 356204, 295277, 235787, 198215, 173273, 157545, 148127, 145217, 142170, 139054, 138787, 139028, 137861, 142799, 149978, 150445, 144931, 139960, 132287, 125189, 110302, 89555, 62162, 36811, 25598, 19273, 24139, 45592, 56196, 59885, 96410, 150766, 178314, 196837, 225739, 215251, 166115]
15822A66115m0273k1450r941j96M182O411J530R29K82N11J561J823N525P918j405
15807A23522j2144j3312j2120j0620l402j1027o884N191Q921P592O488j88M004
15794H6021Q456O670J746o798l482k696n130k952k730P83o95J882R93l485J044
15779G9627o5r431j0848j1189p541l418L385J1058O00k400M1j498o607L805K228
15764D7747j700P946j958l515j2203r914L993J905n707K099K38R198J0958K399
15750E1486p792j2658m439n214J753J0857O395J32j053j351R32m869p165l225
15736B3789l243P85K816L427m92K73L628K925k900R08J832J331k335k455l341
15721B6948P475K085n692L442O610r70L67P092O458Q366J4095J5515J6415J9258
$$ y = [166115, 125842, 104392, 94451, 94255, 98437, 104848, 106378, 107307, 107589, 108100, 109661, 111484, 117009, 124927, 123522, 111378, 98066, 85946, 75326, 71924, 60897, 54013, 59204, 68125, 75717, 82205, 82017, 86021, 94477, 101147, 102893, 96095, 92613, 89917, 84787, 81835, 79105, 79888, 79193, 81075, 82068, 78583, 79627, 79562, 70131, 59283, 48094, 40553, 37135, 40520, 51578, 52178, 49778, 49819, 48321, 41714, 45519, 47747, 46047, 53993, 52035, 48520, 36317, 26403, 30396, 32301, 26594, 28693, 28931, 38129, 49087, 51486, 43694, 31036, 26597, 21383, 23136, 33993, 40388, 40520, 39467, 38116, 39048, 34179, 27014, 23789, 20546, 21331, 24147, 27574, 27082, 27355, 30983, 33908, 31008, 31916, 33748, 35079, 32744, 30289, 26948, 34423, 36508, 30816, 34258, 40868, 39898, 40265, 47357, 53815, 62181, 76276, 91791, 108206, 127464]
15707A27464R630n815j7189k7950l2844j7991j1676r782q72L844Q86M420J0354
15694C2479M040o528l906k660n233K286L382K138n807l991J34L372K207K009M281
15679B8203l65M89J455j702r49M690M073k013l081p58O645Q420o011m164j954
15664C2978o794n469k079j779K119L465r674n529J060k815l52m09K74J482N45
15649G023L84J364L185O470J587j374L352j129K96L035L430j989o028n714O007
15634A9899J825j292L330k874p778l525j015N95N303K608q45L868M124r20n630
15619A7673o632j816M64L074K196J644K819N71m704l15k911m114j02p088k691
15604a932M151L124M178K599j540J852L117k659j986M969P216L878q649k323K024
$$ y = [127464, 137094, 131279, 114090, 86140, 53296, 35305, 23629, 13847, 12975, 16819, 17705, 22125, 32479, 36519, 29991, 26085, 23425, 18192, 20478, 23860, 25998, 20191, 16200, 16334, 19706, 21913, 23922, 28203, 27838, 28327, 29782, 28080, 27131, 31821, 35894, 33881, 30800, 30042, 36687, 45107, 39096, 34932, 32978, 26184, 20715, 18636, 16857, 18976, 22441, 12767, 7238, 8298, 5483, 5131, 4722, 4996, 6478, 7023, 7407, 8771, 11956, 18426, 20013, 18639, 21991, 20862, 21158, 24193, 27623, 25634, 19606, 13892, 19899, 21724, 20432, 23762, 20888, 13110, 9585, 8570, 9165, 14468, 17076, 16231, 20099, 24223, 23303, 17673, 11041, 9225, 9689, 12763, 14959, 16603, 19422, 19993, 15289, 14974, 12063, 7949, 7847, 759, -1932, 2219, 5343, 9521, 12120, 10580, 12432, 15549, 12890, 10904, 15873, 23089, 26967, 18318, 15995, 18019]
15589A8019M094J581j061l776N021k487n20N976J961P55k275j2180n655k061J93
15574G585k61K913J035J251K091q42m742O76j452l220J413O33J708M508O158K315
15558B1769M377Q432Q849R371R822L702l498r296p706o402j1185j2170p369j488
15544G208N463J363m555j0746m130N627J016N825M917L269J366j745k316j83R92
15529A3371l117l175N27j279l885J645Q285M869Q8j131n133O47l886m036m86P751
15513A1055K625L067L397K4L96j536l632J010J823l458k475M188L127M108K915
15498B6634R66l378k843M514n9n219n740J759L354N62K42j590J503L441P421K792
15482C4359O172L863k069M83P959R942R210J7809K7552L5281M5602N9022Q7342
$$ y = [18019, 22113, 23694, 22633, 18857, 23878, 21391, 20871, 26847, 28808, 29563, 27288, 15108, 9453, 7392, 7585, 7324, 10237, 11272, 12523, 14614, 13772, 9030, 9706, 8254, 5034, 6447, 7080, 8788, 13296, 19454, 21769, 26146, 34578, 43427, 52798, 62620, 66322, 62824, 53528, 45822, 39420, 28235, 16065, 8696, 7208, 12671, 14034, 9479, -1267, -5397, 230, 1246, 7071, 11988, 15257, 16623, 14878, 12562, 12379, 13371, 10254, 7079, 7606, 6327, 2442, 4087, 12372, 17241, 17329, 16198, 11065, 11712, 7826, 3790, 3304, 11055, 13680, 16747, 20144, 20168, 20564, 19028, 15396, 16406, 18229, 14771, 12296, 16484, 19611, 23719, 26634, 27600, 24222, 21379, 25893, 25834, 20615, 14875, 16634, 19988, 20550, 20792, 19202, 20705, 24146, 31567, 34359, 40531, 44394, 42325, 42808, 50767, 60709, 69919, 87728, 115280, 150561, 196163, 255185, 342527]
15469C42527J48681K62622M65989O27694M38529o889l25302n46859m93192l13158
15459F00642j75142j05209p1424n1951l7684l2153j8700j8801q286j1718j1624
15448E7950n514n594m899m912q66O809K479m350k922m587j0980k642L227k589
15434B0610l555n538m874M44J477K964J001l372k511n506r52l024J571J790k431
15419a906k007K704M822L380q66q33N737N179J850J032j43m819o949n048J918
15404D051K855L819O185J153N52l557n605o168k804k888j907j966K001N920n43
15389A098l335J176N965L718J276p05j183o829L030N564j66K8J340j064k655o182
15373A076P93J670L376Q571J444o192o07k682o239K604K949j329L37O91oQ72M198
$$ y = [342527, 491208, 753830, 1219819, 1847513, 2286042, 2279153, 1953851, 1406992, 913800, 600642, 425500, 320291, 248867, 196916, 159232, 127079, 108379, 89578, 81292, 69574, 57950, 52436, 46842, 41943, 37031, 36165, 42974, 45453, 41103, 38181, 33594, 22614, 19972, 23199, 20610, 17055, 11517, 6643, 7087, 8564, 11528, 12529, 9157, 6646, 1140, 188, -2836, -1265, 525, -1906, -3913, -1209, 3613, 6993, 6127, 5294, 11031, 16210, 18060, 19092, 18949, 14130, 7181, 2133, 4051, 6906, 10725, 16910, 18063, 18615, 15058, 9453, 3285, 481, -2407, -4314, -6280, -4279, 1641, 1098, -2237, -1061, 4904, 8622, 9898, 9193, 8010, 1181, 4211, 9775, 9609, 9637, 10977, 9913, 7258, 1076, 1869, 3539, 6915, 15486, 16930, 10738, 10131, 7449, 1210, 3814, 6763, 5434, 5771, 6462, 6456, 7328, 11526]
15356A1526q41r00p4P1r310m770K123J678j075j199L840o01k997p8K069J334m204
15339c408o065j741L423L560N661L137J297n290k911k149n316O57K175L246P616
15324C892k389j559K330j433l315j438L38k988l300j072P268M235J280J063l561
15309f49j836k820O18J696P58R20K546P58K273k883p381J834N141K007m232n072
15293f322J940J210K491K672L151O05l353m713j369J260L69K085J656m851m314
15278g483J68J517N280O898K493k535L179L684j791r250n917j485j328J04M146
15263b320K041j137k275l668P00K284L926M62K515N95k877K038L878q676n298
15248g812j429N445K906K550L817R5o971r63K073J435K110j007n035P575j301
$$ y = [11526, 10685, 9785, 9711, 9782, 472, -4298, -2175, -497, -1572, -2771, 1069, 468, -2529, -2607, -538, 796, -3408, -9473, -11214, -7791, -4231, 1430, 4567, 5864, 574, -2337, -4486, -9802, -9145, -6970, -3724, 3892, 1503, -56, 2274, 841, -2474, -3912, -3574, -6562, -9862, -10934, -3666, 569, 1849, 2912, -649, -2485, -5305, -4687, -2991, -2233, -1313, 1233, 1991, 4264, 1381, -6000, -4166, 975, 2982, -1250, -6322, -4382, -3172, -681, 1991, 5142, 5747, 2394, -2319, -3688, -2428, -2059, 26, 1682, -3169, -7483, -7315, -5798, -518, 6380, 8873, 6338, 9517, 13201, 11410, 2160, -3757, -5242, -6570, -6466, -2320, -279, -1416, -3691, -7359, -6659, -4375, -449, 13, 2528, 3123, 246, 2284, 6162, -2514, -7812, -9241, -3796, -890, 1660, 5477, 5572, -1399, -2362, -289, 1146, 3256, 2249, -2786, 4789, 3488]
15233C488j899l047n7q33K951N015J673o43m536n982j048L153L8R40k375R58k297
15216d501k270R51L344j983l444O169O143K627p30L59k936j195R24j881l127N128
15200C578N179k685o424p88j938o05J760l99r13k16K552L741l476k734L318K024
15184A974l507j43J967J769K655M70m774K2N215J818j459m070m000l747L505K079
15168b26l480n540J541M400K297r54r50K106l616n880L285Q37J967O900m104j396
15152b813K16L937L665j705m407n771o260n41K467N97P91L945M114m81M77K059
15136B90M379K578L025j579q530k4j587Q66M059O540n252p288L227J39J491K254
15120D588l852k91J010N099P85k354n067j401L780j505o366k026M88K470l075
$$ y = [3488, 1589, -1458, -1515, -2348, 603, 5618, 7291, 6648, 2112, -3870, -4918, -1765, -1727, -787, -3162, -2204, -4501, -6771, -5820, -2476, -4459, -7903, -1734, 4409, 7036, 6306, 6665, 3729, 2534, 3458, 1577, -1550, 3578, 8757, 6072, -352, -1140, -3078, -3683, -1923, -2322, -3235, -3451, -899, 2842, -634, -3368, -50, 1974, -1533, -1676, 291, 2060, 4715, 5185, 411, 433, 5648, 7466, 6007, 1937, -2063, -5810, -2305, -226, -3706, -9246, -7705, -3305, -1008, -1962, -2912, -806, -4422, -10302, -7017, -6180, -4213, 2687, -1417, -2813, -2597, 1340, 5005, 3300, -1107, -6878, -13138, -13679, -11212, -10615, -9824, -5879, -1765, -2246, -1769, 290, 4669, 7247, 10272, 8693, 163, 139, -1448, -582, 3477, 10017, 4765, -2523, 704, 843, 2334, 4588, 736, 445, 1455, 6554, 7339, 4985, -82, -1483, 2297, 792, -5574, -7600, -7112, -4642, -7717]
15105g717R19O739M858L57k023j386J323O55j194L123m15m945n62n523M92K067
15089c232L899L421o723m970J050k418L543M114n277L168L004k74o03L635l176
15074h39l009k71M152j467n43M48J861K391K426j199l186j176m95n17O49K652
15058A877j346m836K117M528J437N54J294l14n701m142l462N016N171l467l753
15043e027j833l041J565r70J9M510O489L27n345J590K657j440o395r96J516K325
15027d049M524l778l693k809J112n19J092J25p55o37M552J020m246J979K572k904
15011f414j623L531J736p59k486P56K342k67m540j847K71j329M314l50K91P020
14995F46K834p561j826j245j468l23J34L657O822n10o152j923l137n40K866M113
$$ y = [-7717, -6798, -59, 4799, 5156, 3133, 1747, 3070, 3725, 2531, 5654, 5239, 294, -268, -5791, -5299, -3232, 667, 4088, -2635, -7605, -6555, -8973, -5430, -1316, -6593, -3425, -421, -695, -1298, 2337, -839, -3848, -4119, 33, -1434, -1977, -1529, 332, 2723, 5149, 3950, 764, -412, -907, -1424, -775, 1877, 531, -4305, -2188, 2340, 3777, 4331, 5625, 5311, -390, -4532, -7994, -2978, 2193, -1274, -5027, -6860, -9901, -8336, -9306, -9287, -4777, 1712, 2039, -3306, -1716, 941, -499, -6894, -7890, -6374, -4049, 475, -3303, -6996, -9805, -8693, -9212, -8120, -7995, -8750, -9387, -4835, -3815, -8061, -6082, -3510, -6414, -8037, -4506, -2770, -3529, -6015, -5259, -2917, -3184, -7724, -9571, -9300, -10629, -6315, -6665, -6374, 646, 3480, -4081, -5907, -7152, -8620, -8943, -8809, -5152, 1670, 1160, -4992, -6915, -10052, -10592, -7726, -3613]
14979c613O455P051k559o179n988j055j033k670l576l736J547J521J0786K263
14965g86k203M141J621Q65J489k765m962n549n696N55M052l752L48J321L727r16
14949h510L094J988j228q56k618j907m853P43Q939J567j375j510J496J933K770
14934c27O859K091J876K387J582m25l638q382p500n863j949P55K315L401L650
14919c168J208j845O55M337k985m275K96M280K503k832n046k061k85O613M676
14904B071o145l665k410M821O348l339n706p34J755N032J233n200j795N369O775
14889D410K954K662L881j729o052o375m680k647M233j108L3P84m474K801k732
14874h039n244J04K13K256L713P977R81m761Q35k840o32o57m620K66K588j104
$$ y = [-3613, 2842, 9893, 7334, 1155, -4833, -5888, -6921, -9591, -13167, -16903, -15356, -13835, -3049, -786, -2989, 1152, 2773, 3638, 5127, 2362, -2600, -8149, -13845, -13290, -9238, -12990, -12642, -11321, -7594, -8510, -5416, -3428, -4656, -5512, -8130, -10037, -14890, -14147, -5208, -3641, -5016, -6526, -5030, -3097, -327, 6532, 8623, 10499, 12886, 14468, 14043, 10405, 2023, -5477, -11340, -13289, -12534, -10219, -6818, -3168, -1960, -3805, -3150, 1187, -1798, -6073, -5777, -1497, 1006, -1826, -6872, -8933, -9218, -2605, 2071, -4074, -7739, -10149, -5328, 1020, -2319, -8025, -8759, -7004, -1972, -739, -5939, -7734, -2365, 4410, 7364, 10026, 13907, 12178, 6126, -249, -4929, -7576, -3343, -4451, -4418, -3634, -8108, -5307, -8039, -13283, -13179, -12966, -10710, -6997, 980, 1961, -2800, -1965, -4805, -5437, -6094, -10714, -10448, -7860, -8964]
14858h964j13J492K747k387j507m4J962j246j416L131l732j220j751l846M99M150
14842a2245L330M951K47l67j145N274m750l365J958l253M5m02J291M897O005K044
14826D515N970m234l49K219p179p588N9k81J248j376L277K215k5j548j646K830
14810a893J740l069O20J719m702p91M197J2593R21j916P789M262l976O648K942
14795B7084j1847n791q226o023j751K707Q214j174p988J713o4m670j416l558l135
14780a5925k126J882J227j528m77O076L782j197Q1O83L369m75m562k081K338M097
14764d836Q23l651l44L9L878K842l922k884N47R15o492n30J588Q51k357j556j988
14747a7077Q297N579j045j426p90l468p22Q14K808K390j414L412R491K603M669
$$ y = [-8964, -9077, -7585, -4838, -7225, -8732, -8776, -6814, -8060, -9476, -6345, -10077, -11297, -13048, -16894, -16395, -12245, -8915, -3964, -3717, -4084, -5229, 45, -4705, -8070, -6112, -9365, -9320, -9722, -8431, -3534, 2471, 4515, 10485, 6251, 5902, 8121, 942, -6646, -6587, -6868, -5620, -6996, -3719, -1504, -1529, -3077, -4723, -1893, -153, -3222, -2602, -883, -5585, -6376, -2179, 10414, 11335, 9419, 17208, 21470, 17494, 24142, 27084, 15237, 9446, 1220, -4803, -6554, -3847, 4367, 3193, -4795, -3082, -3146, -7816, -9232, -12790, -15925, -18051, -16169, -14942, -16470, -16947, -10871, -7089, -8286, -8205, -7522, -4153, -4628, -9190, -11271, -8933, -4836, -4013, -7664, -8008, -7969, -4091, -1249, -5171, -8055, -7508, -6593, -13085, -13615, -12027, -11176, -13533, -15089, -17077, -8780, -3201, -4246, -5672, -6462, -9930, -10652, -9838, -7030, -4640, -6054, -2642, 6849, 9452, 14121]
14732A4121O970K735r0k97m868p769r393o326m693k964L475O713J467K131K226
14717C438k243K101J497m045j778J341R30l999m730L192K248R46j343k553k553
14702g551J259N00M471K714j116q22j333K999J414j270P07o418k659n35P3n792
14686a3359L013L429K752N87N233j64j303K934K094o528p310j881L895L252K324
14671a032J941j787n23J925m667K392N613j691l487k524K266J262l434p57K204
14656b299L319o737n946M823P173K057l839o64J66l208j583k547k586J110O17
14641a0144o95R74L30k419P76l4m079m032L89K590K71O442K796o42l16L07K727
14624d759J213j870J486j917j431j022J470J743K141k33o970N59P439m37Q8M10
$$ y = [14121, 21091, 23826, 23736, 23439, 18571, 10802, 1409, -4917, -9610, -12574, -9099, -2386, -919, 1212, 3438, 1195, 3296, 4793, 748, -1030, 311, 1241, -2758, -7488, -4296, -2048, -1102, -2445, -4998, -7551, -6292, -5792, -1321, 1393, 277, -545, -1878, 1121, 2535, 1265, 1972, -4446, -7105, -7640, -7567, -13359, -10346, -6917, -4165, -3578, 1655, 1491, 188, 3122, 5216, -1312, -8622, -10503, -6608, -3356, -1032, 909, -878, -1401, 524, -4143, -1751, 3862, 2171, -1316, -3840, -1574, -312, -3746, -4503, -2299, 1020, -5717, -11663, -6840, 333, 2390, -1449, -2113, -1947, -5155, -6738, -9285, -11871, -10761, -10144, -10839, -9865, -9535, -11954, -11178, -11212, -15291, -19323, -18934, -16344, -16073, -9631, -6835, -7477, -7793, -7486, -4759, -3546, -5416, -3930, -5847, -7278, -8300, -6830, -5087, -2946, -3179, -10149, -9590, -2151, -2588, -2500, -2090]
14608b090K759N176o13o806K322J402K200J218k520o05r48p75j10K681j183Q9
14592B197k923k476Q52j79N612J062l893j49l839k34J035K697K549K53n312j639
14576d387q52q47N98L459K21k289j947L593M759L627K250r399j0299j023R810
14561b726K226j102k766o1j240O428k063j001J794j165N17L638K526r87p820K661
14545a141Q052L141k343m084q347m191N471K742M5l959k199O656j335L78Q65j219
14529a468p89M207r5n220Q3j281l276l272L785N414J239j403k866k118n85K939
14513d706j052N1j278R82j053l42k74K909j062M355N719k519o330j835n14L700
14497c249J442j093m712L62J561K260k068k954K037j60N637J514J844M048j335
$$ y = [-2090, 669, 5845, 5232, -1574, 748, 2150, 4350, 5568, 3048, 2443, 1495, 720, 610, 3291, 2108, 2197, -726, -3202, -2350, -2529, 3083, 4145, 252, 103, -3736, -3970, -2935, -238, 2311, 2564, -2748, -4387, -5239, -6086, -5488, -2029, -1808, -4097, -6044, -2451, 2308, 5935, 8185, -1214, -11513, -12536, -2726, -500, -1602, -4368, -4429, -5669, 759, -1304, -2305, -511, -1676, -1159, 2479, 5005, 4018, -3802, -1141, 6911, 10052, 7709, 3625, -4722, -8913, -3442, -700, -655, -4614, -6813, -157, -1492, -1114, -249, -1468, -2257, 1950, 1855, -3365, -3282, -4563, -7839, -11111, -7326, -1912, -673, -2076, -4942, -7060, -7645, -4706, -5758, -5707, -6985, -6003, -7056, -7398, -7672, -4763, -5825, -1470, 4249, 1730, -4600, -6435, -6949, -3249, -1807, -2900, -7612, -7250, -5689, -3429, -5497, -8451, -6414, -6574, -937, 577, 2421, 6469, 5134]
14482E134j605j876N437J762r19k186L74q64n64N121O003N621L902N604K354m178
14466B9120o220q804n851o383l758K355J178n23P582K769l401q78k147o319j397
14451b677K8l399L461r32J454J530j167l405l169J036J169K892K809M353J094
14436E077n79M358K59J461R743P453L775O025L034l683o276p824o686k594K92
14421A3835J998M866L823K920j964J70l066q786p328j582j812m88m32j903K951
14406C202j653j303k592l704j36j580R03K042k263l484M700o80r59N159K364O413
14390F429M174n534o878l106J899M379L241J025N777M283K537M852P44l754M48
14375B0516J237m671o423O31j673l517m675l377K676J754j484J610k483M39J342
$$ y = [5134, 3529, 1653, 7090, 8852, 7933, 5747, 6121, 5257, 4693, 9814, 15817, 21438, 25340, 30944, 33298, 29120, 22900, 14096, 8245, 1862, -1896, 459, 1637, 1114, 8696, 11465, 8064, 7186, 5039, -1280, -2677, -2649, -6048, -2587, -3519, -2065, -535, -1702, -5107, -8276, -7240, -6071, -3179, -370, 3983, 5077, 4498, 8856, 9115, 10576, 20319, 27772, 31547, 37572, 40606, 36923, 30647, 22823, 16137, 13543, 13835, 15833, 20699, 24522, 27442, 25478, 25648, 22582, 13796, 6468, 4886, 3074, 2586, 2154, 251, 3202, 1549, 246, -2346, -6050, -6186, -7766, -6863, -4821, -7084, -10568, -5868, -6548, -7507, -2348, 16, 6429, 10603, 5069, -1809, -4915, -3016, 1363, 4604, 5629, 11406, 15689, 18226, 23078, 23822, 20068, 20516, 21753, 17082, 10659, 11290, 9617, 6100, 1425, -1952, 724, 2478, 994, 2604, 121, 560, 1902]
14360A902l416k974j596j109j746j427L234j763L502N733L309m0o139m431j186
14345h147o012J60P056O09r19L162k091j883O721O141K584n211o640j062l615
14330i147K860M217J30J182o23l507K329P90J099k55n051m406J544K355K098l337
14314g722j28M050K038j383J466K708j465L958j246l967j114k211N68k96N532
14299G88J975J282p939P5O250K327n105j839J822r6m681l580P230K747R06L690
14283E852j568O81n086n930J984j319K291J021l431k082r76k305M284P029J269
14268A714l365R89J153m090l96K87J215L311M314q76m150J867Q15k241k664l488
14252e605j161n862J58L919J787J887j042N87M472K49n846n211l755k090l32N791
$$ y = [1902, -1514, -4488, -6084, -7193, -8939, -10366, -7132, -8895, -5393, 340, 3649, 3609, -2530, -6961, -8147, -14159, -13999, -6943, -6334, -7253, -4091, -6182, -8065, -1344, 4797, 7381, 2170, -4470, -5532, -9147, -6287, -2070, -1940, -758, -1381, -4888, -2559, -1769, -670, -925, -5976, -10382, -8838, -6483, -4385, -7722, -7850, -3800, -1762, -3145, -1679, 1029, -436, 3522, 2276, -1691, -2805, -5016, -4448, -4744, 788, 2763, 4045, -3894, -3819, 2431, 4758, -347, -2186, -364, -460, -5141, -8721, -1491, 1256, 2162, 5852, 4284, 4965, -121, -6051, -4067, -5386, -3095, -2074, -5505, -7587, -8563, -10868, -6584, 445, 1714, -1651, -662, 491, -3599, -3995, -3708, -2493, 818, 5132, 4256, 106, 1973, 2788, 547, -2117, -5605, -6766, -12628, -12470, -8551, -6764, -4877, -5919, -5332, -860, -611, -6457, -11668, -15423, -17513, -17845, -12054]
14236a2054O974j20m584n71K967M664n22k244Q62L127R42J771k625j657j643j130
14220e843j045n1J102L162R80k979K645J570p79o568K177j417n158J175M711k09
14204f527n77L302J391m162j487J327N892K66l242k765m660k425l106l314M459
14189a5628M265M114L363K692L659k271m199o02j065J585J177m45p585K842J480
14174f618M513K36k483p49m92N354K984K184k792j873l051K832J019l169j746
14159c851L078J942l392m202l767L545R914m52k24K190n766M76k900l525J834
14144e100N646j893n770k191M541j57m924q97M037j30J198o52o084j761O342L689
14128d106n401l621J62K349J913P62L338L389m114p366L924L692M979P96r520
$$ y = [-12054, -5080, -5200, -9784, -10355, -7388, -2724, -3246, -5490, -4628, -1501, -559, 1212, -1413, -3070, -4713, -5843, -6888, -6939, -5837, -2675, -1695, -4674, -2029, -459, -1238, -7806, -5629, -7046, -12204, -11029, -6318, -6527, -7104, -3802, -2411, -6573, -8060, -6733, -841, -575, -3817, -6582, -11242, -13667, -16773, -20087, -15628, -11363, -7249, -3886, -1194, 2465, 194, -4005, -4607, -5672, -4087, -2910, -3355, -10940, -8098, -6618, -2105, -1869, -4352, -5101, -5593, -239, 2745, 4929, 2137, 264, -2787, 45, 1064, -2105, -3851, -773, 1169, -2223, -6425, -10192, -6647, 3267, 2815, 2591, 4781, -985, -509, -3409, -6934, -5100, 546, -1347, -7117, -9308, -4767, -4924, -9848, -10745, -6708, -6838, -5640, -6292, -12376, -14137, -7795, -4106, -9507, -13128, -12966, -10617, -8704, -7942, -4604, -1215, -5329, -12695, -8771, -5079, -100, 696, -8824]
14113h824l451N602N930M48k329J63J788l088l751J391J499K121o244m126k128
14098a4999L684K548k135p729M73K193p37J11P838l07M40N234K147k712o49K08
14082d392J31m51L500p9k906J199K256j684j834n8J93j317k828L702M692K008
14066B132q72n880j989O49M78j102K90n62J411N476j10j181l529K282J683J712
14050H88O28k811Q49q16j955k194N947O86l903q32k901j734P374L037M13k185
14034D91n644r12n83K931N728K121o16m423k975m090k696Jo04J148J854P266K463
14017A460k767r20j889K96l86o713m477M692K141J6l17K490o00j120M539L32K188
14000a035L270k981k707j892M449J101l60r0J847K45J751J1l388o695N46O457
$$ y = [-8824, -12275, -6673, -743, -295, -2624, -2461, -673, -3761, -7512, -6121, -4622, -2501, -8745, -12871, -14999, -11315, -8767, -10902, -18631, -18158, -15965, -16702, -16591, -8753, -9060, -8620, -3386, -1239, -3951, -4600, -4392, -4261, -4712, -1212, -1291, -4197, -2998, -742, -2426, -4260, -4318, -4125, -5442, -8270, -4568, 124, 2132, 1260, -4620, -6609, -5960, -5482, -6584, -6294, -6856, -5445, 31, -79, -1260, -4789, -2507, -824, 888, 1516, -1295, -446, -1262, -3217, -5411, 536, 1222, -2681, -3513, -6414, -8148, -774, 2263, 2676, 491, -5153, -6065, -6648, -3717, 2011, 4132, 3516, -907, -3882, -7972, -10668, -10667, -11271, -10123, -8269, -1003, 1460, -1307, -2227, -4116, -3820, -4206, -10919, -15396, -10704, -8563, -8547, -8864, -6374, -6974, -8094, -3555, -3223, -1035, 2235, -746, -3453, -5345, -896, 205, -155, -245, 1602, 1847, 3598, 3609, 221, -6474, -5928, 529]
13984E29l99j288k658k913r45j171K061J577n8R34N01k782J186M499L572K329
13968D974k585K508J886n816l347K090l655o369K271K772M04j995J428L913Q36
13953f85l353j383N328L074J576j398m228r828O79J493k248M714M078L301K855
13938C975j390R86M819k072j704J177L531J542p23o276m480J217K158n661k230
13923e131J885m579k813J491J20Q11j122N35K653L294J797m722l002N061l91l259
13907g372L451P692J407q311k587J318J311N07l081o49L404k676l690j64N73J859
13891g008k266l35L030k767K626L390J121J987M908m517l913L668L931j007J618
13876D466l510j459j407q12m197K594K760L900M895N21j536q37l615l766l903
$$ y = [529, 130, -1158, -3816, -6729, -7674, -8845, -6784, -5207, -5265, -4331, -3830, -6612, -5426, -927, 2645, 4974, 2389, 4897, 6783, 967, -2380, -290, -3945, -10314, -8043, -5271, -4867, -6862, -5434, -1521, -685, -4038, -5421, -93, 2981, 4557, 3159, -1069, -10897, -10218, -8725, -10973, -6259, -2181, 1120, 3975, 2585, 3571, 8390, 6318, 4614, 5791, 9322, 10864, 10141, 3865, -615, 602, 2760, -2901, -5131, -3246, -7825, -10638, -9147, -9027, -8216, -9338, -8803, -6150, -2856, -1059, -5781, -8783, -3722, -4113, -7372, -3921, 3771, 5178, -3133, -5720, -4402, -3091, -2584, -5665, -6314, -2910, -5586, -9276, -9440, -8867, -7008, -9274, -9609, -6579, -9346, -6720, -3330, -2209, -222, 4686, 169, -3744, -76, 3855, 2848, 4466, 956, -503, -1910, -2722, -6919, -4325, -1565, 2335, 7230, 7751, 6215, 5378, 1763, -2003, -5906]
13861e906L252Q842j514k935n378j883N44N997K904l405o255K003M082J093m200
13846b759p152q78P815K754J683m412l693l690L323K238K465K039l420J050J766
13831h71J211l319m428J261K073r76l556K777J943o55n0L901L931J755l360l741
13815b104p49J323J49J200M427O977O91j710j058k63k164J497J518L742L080K387
13799A8943J569L960j19R14j785O592M618R950J8868K2523L2466N9037R3295J43917
13785D14748J78970J94506J74384R2592O42q4545j60803j96773j78647j35768
13775B99306r4193n6233l6230k2841j2579p375q823j0301o647l428Q06Q89l35
13762D2016L602M097R32K753n11n413o103n405r738l539n527l482k332k269r95
$$ y = [-5906, -2654, 6188, 4674, 1739, -3639, -5522, -4978, 1019, 3923, 518, -5737, -3734, 348, 1441, -2759, -9911, -10789, -2974, -220, 1463, -2949, -6642, -10332, -7009, -4771, -2306, -267, -3687, -2637, -871, 340, -2979, -7407, -6146, -4073, -5049, -8605, -5828, -3885, -4540, -4590, -689, 3242, 4997, 1637, -2104, -2853, -1530, -1381, -181, 4246, 11223, 11914, 10204, 9146, 8883, 6719, 8216, 9734, 13476, 16556, 18943, 20512, 24472, 24353, 25267, 23482, 30074, 34692, 44642, 63510, 86033, 118499, 177536, 270831, 414748, 593718, 788224, 962608, 1055200, 1055842, 971297, 810494, 613721, 435074, 299306, 205113, 148880, 112650, 89809, 77230, 69855, 61032, 50731, 44084, 40656, 41462, 42351, 42016, 45618, 49715, 50647, 53400, 52889, 47476, 41373, 35968, 26230, 22691, 17164, 13682, 11350, 9081, 8086]
13747H086m922k170l108k25M403j682l202k417l333j213L193r45L044L224N625
13732D358K687k728k507o133k20J406m75n28j544J9k495K483P048k163k316J63
13716b945j427p330J488K614J491K310k48J551J597O172M292R6Q60k381l001o598
13700a459L26K231l257j899l491k442K207L288l077o54l397J368M873J829J126
13685b428k454j479O323Q36o164j884k311N291N79o592k530j558K624N442J215
13670e090k336K43P62l83R85P96l052L118j394k48J875O348M352R71j679l206
13654B062m50j195k790J623L19l879j324J30J819K043k092k130l741L193P807
13639A395O556O772N408m641p456m421m057l29J294R21j559j407j960K602J243
$$ y = [8086, 3164, 994, -2114, -2339, 2064, 382, -2820, -5237, -8570, -9783, -6590, -7535, -4491, -1267, 4358, 7045, 4317, 1810, -4323, -4543, -3137, -3612, -4140, -5684, -5665, -8160, -5677, 1371, -792, -3108, -2945, -4372, -11702, -10214, -7600, -6109, -3799, -4047, -2496, -899, 5273, 9565, 9661, 10521, 8140, 5139, -1459, -1133, 1098, -2159, -4058, -7549, -9991, -7784, -4496, -7573, -8227, -11624, -10256, -5383, -3554, -2428, -4882, -6361, -38, 798, -5366, -7250, -9561, -4270, -3691, -10283, -12813, -14371, -11747, -6305, -5090, -7426, -7183, -6421, -6804, -5819, -5023, -8075, -4957, -6351, -6599, -4724, 1624, 5976, 6947, 5268, 2062, 1612, 417, -2373, -750, -431, -4310, -5634, -5504, -3685, -1642, -3734, -5864, -9605, -6412, 1395, 7951, 14723, 20131, 15490, 8034, 3613, -444, -773, 521, 1442, -117, -1524, -3484, -882, 361]
13624C61l132J370j694L719K887j962N66J43j221j964K249r45J477L190l01L489
13608H232R2o822n750N378Q388J795o060o170j388K55k391J393k354L05N874J605
13592B382j423j320J014K293k694J52j024K412l684l796j529j768j274M47L430
13577f382k661J193P076K247j731K411L010L254l645j2451l752J308L020M388
13563b715o08R91J056M458P94j071j25j950J403k054j965J045O49J668L002J503
13547F081n22m907m34k379k434O508K81J00M484L773o181J063J359J049j653K98
13531F486L009M649K492l387j528K564J405L76r76k951o529J279k117k021q56
13516A895nq13o861r49l565l516K609O871j332j451o92J313L235M443K951l098
$$ y = [361, -2771, -1401, -3095, 624, 3511, 1549, 2115, 2258, 1037, -927, 1322, 377, 1854, 5044, 4743, 8232, 8324, 1502, -4248, 1130, 9518, 11313, 5253, -917, -2305, -2050, -4441, -3048, -5402, -5097, 777, 2382, 959, -361, 653, 2946, 252, 404, -620, 1792, -1892, -5688, -7217, -8985, -10259, -9812, -6382, -9043, -7850, -774, 1473, -258, 2153, 5163, 8417, 4772, -7679, -11431, -10123, -7103, -2715, -3323, -2332, -1276, 3182, 3976, 2905, 2780, 830, 2233, 179, -1786, -741, -92, 1576, 4578, 6081, 5559, 652, 218, -2161, -4595, 1913, 2194, 2294, 6778, 10551, 4370, 5433, 6792, 7841, 6188, 6486, 9495, 14144, 16636, 13249, 11721, 14285, 15690, 16066, 15090, 12139, 5610, 6889, 4772, 2751, 1895, 1890, 1077, -5784, -6733, -10298, -13814, -11205, -4334, -5666, -7117, -7809, -6496, -3261, 1182, 4133, 1035]
13500A035k430K583L942M716J967q3K633O970O301J813k085l047J820N075M747
13485C5957M520R36p744o335L175l072m12l635o834j1896q741O420N064j36j755
13470E512l799J175R18J291r71k665J754K89n872j277Q24J83r77M21M39j476N545
13453A314O149n96J367J963k750n14J455l419k665k09M645P415J899k244J712
13438A5522M956p90l187j027k941m286m606k637k725O89M738L532j927k683K8
13423B656k863M07J884J891j320Q68M57m77M392l306p200P33K426j19L610j785
13407B254k226k134J34k052L29m13J941J543j337j065L182o143j969k097k461
13392a2514J445O510L240l9L4j140p201j968J075P458N495N34K3P15p77o634k059
$$ y = [1035, -1395, 1188, 5130, 9846, 11813, 11730, 14363, 21333, 27634, 29447, 27362, 24315, 26135, 31210, 35957, 40477, 41413, 33669, 27334, 30509, 27437, 27025, 23390, 16556, 4660, -4081, 2339, 7403, 7267, 5512, 1713, 2888, 3806, 5097, 4126, 1461, 3215, 3504, -2368, -3645, -2821, -2638, -3615, -3194, -2755, -4231, 1314, 7463, 6867, 8234, 10197, 7447, 6933, 8388, 4969, 2304, 2095, 6740, 14155, 16054, 13810, 15522, 20478, 19688, 16501, 15474, 12533, 8247, 3641, 1004, -1721, -1032, 3706, 7238, 5311, 2628, 2656, -207, 200, 2084, 3975, 2655, 3523, 3980, 3503, 7895, 4589, -2611, -1878, 548, 429, 4039, 2254, 28, -2106, -1972, -4024, -3695, -4108, -2167, -624, -1961, -3026, 156, -5987, -7956, -10053, -12514, -11069, -4559, -1319, -1358, -1324, -2464, -9665, -11633, -10558, -3100, 2395, 2929, 2952, 3667, 2890, -3744, -5803]
13375e803l985O29K162J889N915q13l066j626O55M7l903m22j646K383N575K015
13359FP26K900q47k016l779l83q79n452L149K229K40k229m79M097J210j327k419
13342e253M884J604N21k148n052j849j366K90M160M324J550k46J555n66n686M36
13326b842M331J66l711m837k746M213N958r7k007P31o162m61N536k391K551o11
13310b379k87l256L044J511k310J380J452k890k684J938O469J426m321J345J750
13295B188L6o463M60M190J360K477J284m120m299l503n79M552j846k737j211k142
13279a0353J758J553k688L652K927k83m192j557K831R370J1914l693o680j446
13265C113O44m950n878q06L928k077j406L270O630K248M88m947m218J726Q64m65
$$ y = [-5803, -9788, -9159, -6997, -5108, 807, -6, -3072, -4698, -4043, -3996, -7899, -8321, -9967, -7584, -2009, 6, 732, 3632, 2785, 769, -3010, -3393, -4272, -9724, -6575, -4346, -4106, -6335, -6814, -2717, -1507, -2834, -5253, -369, 1235, 1756, -392, -5444, -7293, -8659, -8369, -4209, 115, 1665, 1419, 2974, 2408, -3278, -2842, 1489, 1655, -2056, -6893, -9639, -5426, 532, 435, -1572, -841, -7003, -7464, -1928, -4319, -1768, -2379, -2666, -5922, -2878, -1367, -3677, -2297, -845, -3735, -6419, -4481, 1988, 3414, -907, 438, 2188, 2224, -4239, -3779, 411, 1771, 4248, 5532, 1412, -2887, -6390, -6969, -2417, -4263, -7000, -8211, -10353, -8595, -7042, -9730, -6078, -3151, -3434, -7626, -9183, -6352, 3018, 14932, 11239, 4559, 3113, 3757, -1193, -7071, -7877, -3949, -6026, -7432, -4162, 2468, 4716, 5204, 257, -3961, -2235, -1371, -1836]
13249a836J126l907l240J444M174N802M04J236l870q93Q75P26r55j840O76p2N292
13232E142o81k335N44m044M168k129n93K071j638J783K008l306n598l748p31J959
13216g128q68K750J02J003J028J372l072l187j617j852l135l09N288O450P40k397
13200d832J101K066J517r08k020L173r57j90J262L781J927K67m355K610M430n262
13184C610m787k761r13m00K007O81l629J347r88j342J886L281l58L965l23j536
13168b60L760L613J705k023l540L07J913j445q77j133k088k512l096l08J532q45
13152e297O61j315K455J969k47L178m23r30k612J155k577J09M654j482K690n187
13136c199l747k621N145j726o01K140k66M392M184J371M87k094J128O43k583J532
$$ y = [-1836, -710, -4617, -7857, -6413, -2239, 3563, 3967, 5203, 1333, 440, 1315, 2041, 1086, -754, -78, -150, 5142, 4461, 2126, 2670, -1374, 2794, 665, 72, 2143, 505, 2288, 4296, 990, -4608, -8356, -9087, -7128, -7996, -5246, -5144, -4141, -3113, -1741, -4813, -8000, -9617, -11469, -14604, -14913, -9625, -3175, -2435, -4832, -3731, -1665, -148, -1056, -3076, 97, -860, -1050, 212, 3993, 5920, 6187, 1832, 4442, 8872, 3610, -1177, -3938, -4851, -5251, -3244, -2563, -6192, -4845, -5833, -7175, -5289, -2008, -2366, 1599, 1276, -260, 3500, 7113, 8818, 6795, 3255, 3562, 5475, 4030, 3153, 2020, -68, -2580, -5676, -5984, -4452, -5297, -4636, -5951, -3496, -1527, -1774, 1404, 981, 51, -2561, -1406, -3983, -3874, 780, -702, 1988, -3199, -6946, -9567, -4422, -6148, -6749, -4609, -4875, -483, 3701, 5072, 5559, 3465, 4593, 5236, 2653, 4185]
13120D185J008P70L21n603J133p37n146J470L257R53J091R21P11p22r90K532k414
13103B740j358j245J575L95m702m78n494q1L473O949k225K80K962M201l931o943
13087c882j029Q57K710K628j182M3N22P198j615r805l415j701P54N727K721j85
13071C46J006M49n386j622O56L56M125j371n041J091P790J047k677k184K981O87
13055B253l419K736J775k55l067O78j799J471J799J213l04k693j10k31j016J485
13039E16n28k007o11p54J338O639l341m725J679K897K139n419j798M87l11N781
13023A982K851k714l318K713k61L592J715p32K915L014P81r82m206L16L228j822
13007I072l799K389j08k690k608J489L479K597K643M0j455j998m769l445k090
$$ y = [4185, 5193, 5963, 6284, 681, 1814, 1077, -4069, -2599, 658, 1611, 2702, 3623, 4334, 3612, 2622, 5154, 2740, 1382, 137, 1712, 2107, -2595, -3073, -8567, -8648, -5175, 1774, -451, -171, 2791, 6992, 3061, -3882, -4911, -4054, -1344, 1284, 102, 145, 667, 7865, 6250, -3555, -6970, -8671, -7917, -2190, 531, 346, 1352, 1801, -3585, -5207, -4551, -4195, -70, -1441, -6482, -5391, 2399, 3446, 769, -1415, 1566, 2253, -1166, 1570, 3345, 3090, 23, 701, -1098, 373, 2172, 3385, 3081, 388, 278, 47, -969, 516, -12, -2019, -2630, -3384, -2046, 4593, 1252, -3473, -1794, 1103, 3242, -2177, -3975, -3488, -3799, 1982, 4833, 2119, -1199, 1514, 1253, 4845, 6560, 5828, 8743, 11757, 12538, 11556, 7350, 7666, 10894, 9072, 5273, 7662, 7554, 4864, 2256, 3745, 7224, 9821, 12464, 12504, 11049, 9051, 4282, 837, -1253]
12992a253J795J04Q90q222p24o98l798K188P47L058N260J472L388k308n87j953
12976f41L191M82r94j507J53j251N33M865O741J934O78j134K220J222J683J820
12960A9995k200M622K115N986J761K93P961J021q11l468j862L242L99k54O775
12945D5575J7525K0747L4336O5850R1546R6386O7472R967m3408q1605q8867o9511
12933A66013n0556k8796j9801j3396q750n319o709n023n429o454K383r88j014
12920A6161M065M305L457L384J3076J1029M912M755m725q287p929n037j997k089
12906C5080O89M453N619O847N967J3729K0474K1702L3167N9832R5580J43512J97740
12893F44391J79625Q9978j9063j17636j61524j48054j28407r4219n3526k7720
$$ y = [-1253, 542, 646, 1536, -6686, -7410, -8108, -11906, -9718, -8971, -5913, -653, 819, 4207, 1899, 1312, -641, 2550, 3032, 2038, 531, 684, -567, -34, 4831, 11572, 13506, 14184, 13050, 15270, 16492, 18175, 19995, 17795, 22417, 24532, 30518, 32279, 32572, 40533, 41554, 40743, 37275, 35413, 38655, 39054, 38800, 45575, 63100, 83847, 118183, 184033, 275579, 371965, 439437, 449404, 405996, 324391, 235524, 166013, 115457, 86661, 66860, 53464, 44714, 39395, 32686, 27663, 22234, 15780, 18163, 17175, 16161, 20226, 24531, 27988, 31372, 44448, 55477, 60389, 65144, 60419, 52132, 44203, 39166, 37169, 35080, 35769, 40222, 45841, 52688, 58655, 72384, 92858, 114560, 147727, 207559, 303139, 446651, 644391, 824016, 913994, 894931, 777295, 615771, 467717, 339310, 245091, 191565, 163845]
12883A63845q523j4824k1589k3426k1890j6419j0367m616n58j300J74K403r18
12870D1992p81j360r39n17k544M89Q32j436j309k872K75N462M236J639o38L744
12854D6273O586Q942J8845K0293L1535N7233Q2080J11105J10261N8858r050o4303
12842D78658r6567r3274p5336n6169l6048k7604k2254j3718r991l006k863k382
12830C9446j253O24l319R80l303m10j621l399p684l326n58N821K992j275N737
12815B9452j316j899K982J79J982K193N581J2694K0851J3556M635l124j3177j2577
12801F2012r975n412o414k268k253n739o635k45M63m435j404M091L875L890K627
12786C2178k252M623Q535M849m399k133M980n419j0841j4216r719n021j02K188
$$ y = [163845, 155322, 140498, 118909, 95483, 73593, 57174, 46807, 42191, 41633, 40333, 40507, 42910, 41992, 41211, 39851, 38912, 38395, 35851, 36340, 37172, 35736, 34427, 31555, 31830, 37292, 41528, 43167, 42529, 46273, 52859, 61801, 80646, 100939, 132474, 189707, 271787, 382892, 493153, 552011, 542961, 478658, 382091, 288817, 213481, 157312, 121264, 93660, 71406, 57688, 47697, 44691, 41828, 39446, 38193, 38817, 35498, 36478, 33175, 32765, 31144, 27745, 20061, 16735, 16177, 21998, 24990, 23715, 29452, 28136, 26237, 29219, 29398, 31380, 33573, 39154, 51848, 72699, 86255, 90890, 87766, 74589, 62012, 52037, 46625, 40211, 37943, 35690, 29951, 23316, 23071, 23534, 19099, 17695, 21786, 25661, 29551, 32178, 29926, 34549, 43084, 47933, 43534, 41401, 46381, 40962, 30121, 15905, 6186, 1165, 1063, 3251]
12772C251K57k327J0817L591J627n58J63J384j226n47M471P883M391M405M065
12757D1647O132M301J2502J5234Q627L618o399k0416j6218q185k004l862k125
12744C2852k634M332n26n310j192q0R21Q558R231P551N368l679j1291j3130j1049
12729A9922j4164p628m315N875Q562J0444R366R764J2341M037M097N2O023l471
12715F0905J222L43q70l161j317k694o737R33l637l768j241J603k106j643n430
12700C2402m442K68K840J93j923m161k195L482J773J169K067M210J032j194j472
12685C4049k543O831Q042N451N242M323j825P81L102J1141N652K666K276N402
12671I0590n619p908k361q480Q717K631n546m357j018l671q270l682j2887j8801
$$ y = [3251, 3508, 1181, 11998, 15589, 17216, 16658, 16821, 18205, 16979, 16432, 20903, 28786, 33177, 37582, 41647, 47779, 52080, 64582, 79816, 88443, 92061, 85662, 65246, 49028, 40843, 38839, 34977, 32852, 30218, 34550, 34024, 28714, 27522, 27442, 28363, 36921, 46152, 53703, 59071, 55392, 44101, 30971, 19922, 5758, -1870, -6185, -310, 8252, 18696, 28062, 37826, 50167, 54204, 58301, 58353, 64376, 60905, 62127, 62470, 61600, 58439, 57122, 54428, 47691, 48624, 44987, 41219, 39978, 41581, 39475, 37832, 32402, 27960, 28228, 31068, 31261, 29338, 25177, 22982, 26464, 28237, 29406, 31473, 35683, 36715, 35521, 34049, 31506, 38337, 46379, 51830, 57072, 61395, 59570, 60351, 63453, 74594, 80246, 82912, 85188, 90590, 84971, 77063, 74702, 66222, 74939, 77570, 72024, 67667, 66649, 62978, 54708, 51026, 38139, 19338]
12657A9338j0322j1781j938N337J2088J4004P533L183m604Q42k22k420n532l949
12643B1557j26L289J201l828j789J878K211P402M998J864J733K271k887r3M722
12628D4403K005o322k375k113n709r186j7516j0596q114O038J6057J6292J0316
12615C3180O104L314L751j2006j7722j8592r534J007L182R014J5665J1273Q262
12602C6898J0856R502L372j19q984j8531j8975j2636l396M436J1452K0326K1123
12589E5324K5235K0340R398o989j5271j9026j6009r126l200q80l573k711k622
12576C0890m572j0421n284k584J1358K0133L3828L4186L2542J5006O295q297j8642
12563A34438k1893j1193J999L758J0203K0049J8993L2014M9587N6437M8739K2788
$$ y = [19338, 9016, -2765, -4703, 634, 12722, 26726, 34259, 37442, 32838, 33680, 33458, 31038, 25506, 21557, 21431, 24720, 25921, 22093, 20304, 22182, 24393, 31795, 36793, 38657, 40390, 42661, 39774, 39681, 44403, 46408, 40086, 37711, 35598, 29889, 20703, 3187, -7409, -15523, -9485, 6572, 22864, 33180, 39284, 42598, 46349, 34343, 16621, -1971, -11505, -10498, -7316, 1698, 17363, 28636, 36898, 47754, 57256, 60628, 60509, 51525, 32994, 14019, 1383, -2013, 2423, 13875, 34201, 55324, 80559, 100899, 110297, 103308, 88037, 69011, 53002, 43876, 40676, 39796, 36223, 33512, 30890, 26318, 15897, 10613, 8029, 19387, 39520, 73348, 107534, 140076, 155082, 161377, 153080, 134438, 112545, 101352, 103351, 107109, 117312, 137361, 156354, 188368, 237955, 294392, 343131, 365919]
12551C65919k0723n5728o3780n3681l6273l702K1057L6346M5627L9859K3430K698
12539C01049j5543k2727j9822j8532j0515o22M673J3418K5809K2632Q308K289
12527B90417O276J2057K0400L1005J7390M488j0806k1391j4456p999O944P993
12515C42318J2127K8915M8875P5310J17362J50611J54020J27184N8113j2810o3755
12504A038270r7887j13057r5610p5283m6431r664K0233M1087M7668M4356L4681
12493G88363K9589K0758J7408L2024N6276Q3661J13532J52681J80940J98564J91160
12482A864956J61042J35874J45842J97133K79322M01693N38317O84462Q66779
12473E275420J107469J482603K078702L145150N070641Q415666J3282165J7285744
$$ y = [365919, 345196, 289468, 225688, 172007, 135734, 132032, 153089, 189435, 235062, 274921, 298351, 301049, 285506, 262779, 242957, 224425, 213910, 213288, 217961, 231379, 257188, 279820, 288128, 290417, 296693, 308750, 329150, 360155, 377545, 382033, 371227, 349836, 335380, 327381, 334325, 342318, 354445, 383360, 432235, 507545, 624907, 775518, 929538, 1056722, 1114835, 1102025, 1038270, 940383, 827326, 731716, 656433, 610002, 600338, 620571, 661658, 709326, 753682, 788363, 817952, 838710, 856118, 888142, 944418, 1028079, 1141611, 1294292, 1475232, 1673796, 1864956, 2025998, 2161872, 2307714, 2504847, 2784169, 3185862, 3724179, 4408641, 5275420, 6382889, 7865492, 9944194, 13089344, 18159985, 26575651, 39857816, 57143560]
12465E7143560J6115984R791522p33873j1061825j5659935j5747665j2114028
12458B7733740p826112m812726l064874k045368j437804j083852q69632p40752
12450E852620o38920n31887m15946l09546k09915j07543j941J39408L44561O49182
12440D770073Q81599O87596J82612k03915m57690l73668r4279J57015L87962O34432
12430F571737R00751J174768J487820J916800K494377L396890N001320P725572
12422C0670035J2538444K0554472L0834131L5805056K5903718P801589o747476
12415A57359969k0909760k8092377k6255467k3275181j7549665j1180512o804649
12408B3292358m319528k981234k248324j827960j559380j352597j120394r06962
$$ y = [57143560, 73259544, 83051066, 82317193, 71255368, 55595433, 39847768, 27733740, 19907628, 15094902, 12030028, 9984660, 8546856, 7463004, 6593372, 5852620, 5213700, 4681813, 4265867, 3956321, 3746406, 3638863, 3636922, 3776330, 4120891, 4770073, 5651672, 6339268, 6521880, 6317965, 5860275, 5486607, 5392328, 5549343, 5937305, 6571737, 7472488, 8647256, 10135076, 12051876, 14546253, 17943143, 22944463, 30670035, 43208479, 63762951, 94597082, 130402138, 156305856, 164107445, 157359969, 136450209, 108357832, 82102365, 58827184, 41277519, 30097007, 23292358, 18972830, 15991596, 13743272, 11915312, 10355932, 9003335, 7882941, 6975979]
12400F975979o98041m97628k89873m5795K79036N96557N61759N4249l74164o77547
12390E884532o97190m59557k33160q4470L0466J53303K87059M45232O07095P96311
12380F729621J029900J355904J887516K783880M350556P101575J1688858J7537380
12372E4465190K0673869J6832908P386330o063270j6026540j9456444j7621409
12365D0190634j2474296p757621m730497k998997k024440j498100j197089j026531
12357F483063r10893p90093o64444n36647m31420l49950k73186k25804j82726
12348B117900j42956j21735j08674j09841j04433j03056j07381j03705j00839
12339A115280q1668n8463m3986l6077l2955l1785l4717m1945m2826l5312l2589
$$ y = [6975979, 6277938, 5780310, 5490437, 5444642, 5723678, 6320235, 6881994, 6936243, 6562079, 5884532, 5187342, 4727785, 4494625, 4410155, 4440621, 4593924, 4880983, 5326215, 5933310, 6729621, 7759521, 9115425, 11002941, 13786821, 18137377, 25238952, 36927810, 54465190, 75139059, 91971967, 99358297, 93295027, 77268487, 57812043, 40190634, 27716338, 19958717, 15228220, 12229223, 10204783, 8706683, 7509594, 6483063, 5572170, 4782077, 4117633, 3580986, 3149566, 2799616, 2526430, 2300626, 2117900, 1974944, 1853209, 1744535, 1634694, 1530261, 1427205, 1319824, 1216119, 1115280, 1033612, 975149, 931163, 895086, 862131, 830346, 795629, 753684, 710858, 675546, 642957]
12328F42957l6852l5589k7217k0623j4844j3108j5053j0647j4883j6780j3628
12317D23733j7958j9930j6938j5599j0223j0140M570J6658J2632J0254K174j1181
12305C68052j9105k6189k9236j5398j1553p714j1551j7559j8636l5850l4817j5647
12293A24797K477J3450K2523L0887L1907K6049N107r142j3289j2062j8530j8096
12281A86078q442j897J634L979J402Q191L767M679j379o073o534M27o898r782
12267A69152o141P725K6732M5926N3019L6266J6414n631l4770l7056k8135k8827
12255B14674k0757r255q151q625j1792k2074k6693k3980o223j129Q098J7976J8185
12242A20254J9434J4634L734k509j0092j7985j5449j0570q352j595J467K042R681
$$ y = [642957, 606105, 570516, 543299, 522676, 507832, 494724, 479671, 469024, 454141, 437361, 423733, 405775, 385845, 368907, 353308, 343085, 332945, 337515, 354173, 366805, 377059, 379233, 368052, 348947, 322758, 293522, 278124, 266571, 258857, 247306, 229747, 211111, 175261, 140444, 124797, 127274, 140724, 163247, 194134, 226041, 252090, 257197, 248055, 234766, 222704, 204174, 186078, 177636, 175739, 177373, 181352, 182754, 190945, 194712, 199391, 198012, 191939, 185405, 185832, 178934, 169152, 163011, 170736, 197468, 243394, 296413, 332679, 349093, 343462, 308692, 271636, 243501, 214674, 193917, 184662, 176511, 167886, 156094, 134020, 107327, 83347, 77124, 75995, 84093, 102069, 120254, 139688, 154322, 158056, 155547, 145455, 127470, 112021, 101451, 93099, 91504, 92971, 95013, 104694]
12229A04694J4375J5964R294J1499K85j5272j7223j3707j2854q604K078J5293
12217A05822J5046K3773J7143R756J791k340l532j3250j6773j3227j0819l955
12205A09435p105n305j81m926k402R15M448M466J265N312N968K048m350p534j1201
12190I0853q700o712q108n147N195O466L904j252O701J1173M663L641M517j676
12176A05518j1302j5724q887m121N069O217l55k998O20l019m827L198M913L870
12162G8172l796n967J45J316Q77N56K677K774M401P97L181K956o358q305r996
12147F3430k532n737k38K662k19K19k287m8j373j84l276k334l629n113m693k151
12131C2497R71L472M145q18l806k388J897K812K281l25J609J089L166n34k268
$$ y = [104694, 119069, 135033, 144327, 155826, 156111, 140839, 123616, 109909, 97055, 88451, 90529, 105822, 120868, 144641, 161784, 171540, 173331, 170991, 167459, 154209, 137436, 124209, 113390, 109435, 102330, 97025, 96844, 91918, 89516, 90431, 94879, 99345, 100610, 105922, 111890, 113938, 109588, 102054, 90853, 82153, 75441, 67333, 62186, 67381, 73847, 77751, 76499, 83200, 94373, 99036, 102677, 107194, 105518, 94216, 78492, 69605, 65484, 70553, 76770, 76415, 73417, 74037, 71018, 66191, 69389, 74302, 78172, 74376, 68409, 68554, 69870, 70747, 71303, 73980, 76754, 81155, 81952, 85133, 88089, 81731, 73426, 63430, 60898, 55161, 54923, 57585, 57366, 57585, 55298, 55250, 53877, 53693, 50417, 48083, 44454, 39341, 34648, 32497, 33468, 36940, 41085, 40267, 36461, 34073, 35970, 38782, 41063, 40738, 42347, 43436, 46602, 46068, 43800]
12116D3800J055L744O612R186M555r43M577R931K850j952J027n874j6749j5337
12102D6482o650j1144j1790j322N198O945K108J850J84r70o647n575j261N88K94
12087A8290L031K209M036P258k741m912K495M389k62k246Q88k767o206o987K618
12072A9093R697P098R16k484j498Q28L961N044lj771L425P748K436m273m135N95
12056D6677j3545j1698k445m231J007L699N150K687R17N36k180L388K803o55J629
12041C3739q14j612K46j901Q92n243k878J848o50R55j365n87J550l491j055l175
12025A6459K406M140M948k470o267M24K670L044j040l883K168L291l649k071j998
12010A8172J386o93j913k422Q312J622l92J912J0034J0458M326j90k227R32j218
$$ y = [43800, 44855, 48599, 55211, 64397, 68952, 68009, 72586, 82517, 85367, 83415, 84442, 78568, 61819, 46482, 39832, 28688, 16898, 15576, 20774, 27719, 29827, 31677, 31861, 30891, 24244, 18669, 17408, 17996, 18290, 21321, 23530, 27566, 34824, 32083, 27171, 29666, 34055, 33793, 31547, 32435, 29668, 23462, 16475, 19093, 28790, 35888, 36804, 34320, 32822, 33650, 37611, 42655, 42652, 40881, 44306, 52054, 54490, 50217, 46082, 46677, 33132, 21434, 18989, 14758, 15765, 19464, 24614, 27301, 28218, 28754, 26574, 29962, 32765, 32110, 33739, 32925, 31313, 31559, 29658, 30550, 25307, 22429, 24277, 23627, 24582, 23217, 22630, 24180, 20689, 19634, 16459, 18865, 23005, 27953, 25483, 19216, 19640, 22310, 25354, 24314, 20431, 22599, 25890, 22241, 20170, 18172, 19558, 18865, 16952, 14530, 22842, 24464, 24072, 25984, 36018, 46476, 50802, 50612, 48385, 49317, 48099]
11995D8099n18K354K075K705O558J0304J7079K3695L9540O1174O5999M7754K4353
11982C51171O553p246k8236m6206n0223n1180l9846k7495j8193q184p246p448
11970F6221m446J548p68n227o059n361l365m303l68K079k02K779J1437Q248J0486
11955G2699J0023J542k876l125j947J900L41k529Q240Q888R045K3885K9170L9843
11941A95099O2584R6905J19869J17653R3234N3590K723k9989n6263r5788j09608
11930D50009j06252r1718o1703l5342l0227k1110j0478p453q216o147q148r207
11918E4008q786k331J044p00L757Q433M094K065l626J004l244l336K065K870j005
11903E6312l083k123M875N202Q258R214J4214K1155K8314L6142N5773P7857P0791
$$ y = [48099, 47581, 49935, 52010, 54715, 61273, 71577, 88656, 112351, 151891, 213065, 279064, 326818, 351171, 357724, 350478, 322242, 276036, 225813, 174633, 134787, 107292, 89099, 80915, 73669, 66221, 61775, 63323, 62555, 57328, 51269, 45908, 42543, 38240, 37872, 39951, 39749, 42528, 53965, 62213, 72699, 82722, 84264, 81388, 78263, 76316, 78216, 78557, 76028, 84268, 93156, 102201, 126086, 155256, 195099, 257683, 354588, 474457, 592110, 685344, 738934, 741657, 711668, 655405, 559617, 450009, 343757, 252039, 190336, 154994, 124767, 103657, 93179, 85726, 77510, 71363, 63215, 54008, 45222, 42891, 43935, 43235, 46992, 55425, 59519, 61584, 57958, 58962, 55718, 52382, 54447, 57317, 56312, 53229, 51106, 55981, 61183, 69441, 78655, 92869, 114024, 142338, 178480, 234253, 312110, 382901]
11890C82901N7239L7714J3243k9326o3971q4613q1999n6369l9816k5031j9726
11879I0246j1131j1763j1057o571n289J231j456r312o517j01R25L160j508l522
11865B7335j244m688J229O34J887M585l903m926K305p80l843n265k442M221P28
11850A5833j263K233j902m791l331k168K102k227O234L300n45o13K130p00k233
11835A2059l744L361K338k378n58M215M46l166o67m233m623M572N615o8p74j178
11819A1217J46P69M173K410L017m04j475j601m428K982L720r45P295K710J240
11804C0826L017J031J890k070p535j376N682J79M047J5782K3178L2704M4784N1223
11790B03362N3178N7916M7318K7453R881n368k4884m0941n2023m7935l9967l6205
$$ y = [382901, 440140, 477854, 491097, 461771, 397800, 313187, 231188, 174819, 135003, 109972, 90246, 79115, 67352, 56295, 49724, 44435, 45666, 44210, 34898, 28381, 28280, 29205, 32365, 30857, 27335, 26091, 21403, 22632, 23266, 25153, 29738, 25835, 20909, 23214, 22434, 18591, 13326, 10884, 15105, 15833, 14570, 16803, 14901, 10110, 6779, 4611, 6713, 4486, 10720, 14020, 13475, 12862, 14992, 14292, 12059, 8315, 11676, 14014, 11636, 11078, 15293, 15739, 12573, 11906, 7673, 3050, 7622, 13237, 13169, 12395, 11217, 11363, 12132, 16305, 18715, 21732, 21328, 19853, 18252, 13824, 16806, 20526, 19581, 26876, 29586, 30826, 33843, 34874, 36764, 34694, 27159, 25783, 31465, 31644, 35691, 51473, 74651, 107355, 152139, 203362, 256540, 314456, 361774, 389227, 399108, 393740, 368856, 327915, 275892, 227957, 187990, 151785]
11778A51785k9889k0597j5414j5788n678l564k056K757m073n931J26P480L231
11765F2389o246j789M516O75P71n51q69L021o494p59O457M688q17K005M741J0792
11749H2530J8541K6331L8737N8571P1308Q1592Q5959P8100O9700M2885J2438j8677
11737F48015m9640o8749q0202q0879p7005o2929m4264l3910k9476j5223j1037
11726I4701r960r555l196k245j977j588r8m10l518n298j726J136m068m184J211
11711D9225k81j32j008J977L304L035M828N599P906R501J0127J3505K6454L3336
11697A67376L6335L5998K9332K2285J1587K583j1186k8743l6217l9877l8923l0667
11685A19883k6541j9320j3365p791p368m750J757P265R84k500J212J67j390m004
$$ y = [151785, 121896, 101299, 85885, 70097, 64419, 60855, 58799, 61556, 57483, 51552, 51678, 59158, 62389, 56143, 54354, 58870, 59545, 60316, 59765, 58896, 61917, 55423, 54664, 61121, 65809, 64992, 66997, 71738, 82530, 101071, 127402, 166139, 224710, 296018, 377610, 463569, 541669, 611369, 654254, 666692, 648015, 598375, 529626, 449424, 368545, 291540, 228611, 184347, 150437, 120961, 105738, 94701, 84741, 75186, 71990, 69745, 67768, 66180, 66082, 65672, 62154, 56856, 55130, 56266, 52198, 48014, 49225, 48944, 48812, 47804, 49781, 53085, 56120, 60948, 66547, 74453, 83954, 94081, 107586, 134040, 167376, 203711, 239709, 269041, 291326, 302913, 305496, 294310, 265567, 229350, 189473, 150550, 119883, 93342, 74022, 60657, 52866, 45498, 40748, 42505, 49770, 50754, 48254, 49466, 49633, 48243, 44239]
11671D4239n373m501J301K844K899j887k484p61j576k762m226R55K356L158M318
11656C8500P37l209J38O400O47o453l787l723l637K131j510m302o642r88o340
11641G962k808R274J3830N525N23J654O297R271K314J299P55k68k324O55N339
11626E9298N173J099K502J583J091K022Q23O384R646Q010k558o999l132n536n425
11611G3981m059o994o985q817r340o426j100m460j858K192Q328N365M475j778
11597D2524K798j235L6K847O192R035J0251N804O206K572J039K135k85o70O97
11582H9946L545J199J4086K2552K4162K9543L5983M0746K8112K0975J7314R23
11570C29086o728k0293k2137k5207k3743j1541Q375K8033M1850N3214N1385K7598
$$ y = [44239, 38866, 34365, 35666, 38510, 41409, 39522, 37038, 36277, 34701, 31939, 27713, 28668, 31024, 34182, 38500, 39237, 36028, 36166, 42566, 43213, 36760, 32973, 29250, 25613, 27744, 26234, 21932, 15290, 14302, 7962, 5154, 14428, 28258, 33783, 34306, 35960, 42257, 51528, 53842, 55141, 55896, 55628, 53304, 53959, 59298, 64471, 65570, 68072, 69655, 70746, 72768, 73591, 79975, 89621, 97631, 95073, 88074, 84942, 79406, 73981, 69922, 62928, 55943, 47126, 37786, 31360, 30260, 25800, 23942, 26134, 34462, 39827, 44302, 42524, 45322, 44087, 44123, 46970, 53162, 62197, 72448, 78252, 84458, 87030, 88069, 90204, 89919, 89249, 89946, 93491, 94690, 108776, 131328, 155490, 185033, 221016, 261762, 289874, 310849, 328163, 329086, 322358, 302065, 279928, 254721, 230978, 219437, 227812, 255845, 297695, 350909, 402294, 429892]
11558D29892R480k1529m8851o1694n7963m8697l9410k0160p954O286M528J3503
11546A57431J5291J4403J2182R376J348r049j2356j6249j7460j9817p949P221
11534A34372J9791M4797N9314O4771O6950N8229L8868R195j5708l4636m8433n3415
11522C44095m5252l4608q808J4630L9816O7087Q7030J02625R1268O4640J4804
11511G37327l2238p3274r8578j03813q1455n4846k8575r231R948J9852J9267K4176
11499C28560J9650P119k885j4787k8314k9495k8754k8198k4974j6330J921J7486
11487B00999K2069K7705L0456K1570J1039n357j2634k5177k7627k8623k2646j2085
11475A79689m198L758J6218K4567L2511M3656M8665M4122L0103J3888j5597l9417
$$ y = [429892, 439372, 417843, 368992, 307298, 249335, 200638, 161228, 141068, 133114, 139400, 143928, 157431, 172722, 187125, 199307, 208683, 210031, 200982, 188626, 172377, 154917, 135100, 127151, 134372, 154163, 198960, 258274, 323045, 389995, 448224, 487092, 496287, 480579, 445943, 397510, 344095, 298843, 264235, 255427, 270057, 309873, 376960, 463990, 566615, 657883, 722523, 737327, 705089, 631815, 533237, 429424, 347969, 293123, 264548, 255317, 265265, 285117, 304384, 328560, 348210, 355329, 352444, 337657, 309343, 279848, 251094, 222896, 197922, 181592, 183513, 200999, 223068, 250773, 281229, 302799, 313838, 308481, 295847, 270670, 243043, 214420, 191774, 179689, 175491, 179249, 195467, 220034, 252545, 296201, 344866, 388988, 419091, 432979, 417382, 377965]
11463C77965m4226l7865k2377r328N190J5252K7114K5063K1796J7548O387p663
11451C74856j7155k1530k1288k8287l1874k4055j3383j9728j5686l34N803K217
11439A89556L925J2230J2108J2742N321M325M184L959P361P046N131O647J1818
11426B86353J3680J1261J7088J8464J5397J0819J8706K0443K1204K5678K4288
11415D83381L2131M3024M8214N3289N3704N3828N2980N1283N5789O6073Q3180
11404A076876J08547J48086J95978K54116L07935L45992L67772L61338L38582
11395C505222K92898K55915K59152L12317M35323O69898J048818J645523K596972
11386A1022038M071170O054896Q108974R681242J0374558R816483P774159M485329
$$ y = [377965, 333739, 295874, 273497, 264169, 269359, 284611, 311725, 336788, 358584, 376132, 382519, 374856, 357701, 336171, 314883, 286596, 254722, 230667, 217284, 197556, 181870, 181536, 187339, 189556, 193481, 205711, 217819, 230561, 235882, 240207, 244391, 248350, 255711, 262757, 267888, 274535, 286353, 300033, 311294, 328382, 346846, 362243, 373062, 391768, 412211, 433415, 459093, 483381, 515512, 558536, 606750, 660039, 713743, 767571, 820551, 871834, 927623, 993696, 1076876, 1185423, 1333509, 1529487, 1783603, 2091538, 2437530, 2805302, 3166640, 3505222, 3798120, 4054035, 4313187, 4625504, 5060827, 5730725, 6779543, 8425066, 11022038, 15093208, 21148104, 29257078, 38938320, 49312878, 59129361, 66903520, 71388849]
11378G1388849L72871l746308p091098r258455j0072554r560560q031920o112166
11370A7888659m233389k764557j794640j179980p74102m97860l10447j74905p2757
11361F086022K2357Q9609J09957J21894J37787J23934R7149R8734J18953J45886
11351G152282J62935J97202K16710K28749K58257L36729M99708Q03118J326029
11342A1181719K173882L531470N594708Q253558J1189688J4404672J7078228J7401642
11334I0809567J5371517J1941168O524473n10442p153576j2364919j5962228j7236120
11326G1419440j6223508j3885095j0721600p457238m896430l194331k114079j410185
11318A1516974r39222o14222l81333k37295j93050k20891k67917l52106m57592
$$ y = [71388849, 71761720, 68015412, 60924314, 51665859, 41593305, 32032745, 24000825, 17888659, 13655270, 10890713, 9096073, 7916093, 7141991, 6644131, 6333684, 6158779, 6086022, 6108379, 6197988, 6307945, 6429839, 6567626, 6691560, 6788709, 6887443, 7006396, 7152282, 7315217, 7512419, 7729129, 7957878, 8216135, 8552864, 9052572, 9855690, 11181719, 13355601, 16887071, 22481779, 30735337, 41925025, 56329697, 73407925, 90809567, 106181084, 118122252, 124646725, 124136283, 116982707, 104617788, 88655560, 71419440, 55195932, 41310837, 30589237, 23131999, 18235569, 15041238, 12927159, 11516974, 10577752, 9963530, 9582197, 9344902, 9151852, 8930961, 8663044, 8310938, 7853346]
11309G853346n06541n08084m67688l87702k87366j88458j09228m6649j6237J0273
11299E345666O0473J50643L15182N74442R63841J568135K518745L924766N656152
11290B1078045P258324Q393395Q682979P731733N548694K487803j078226m418543
11282E5684204o915344q321825q566541p724702o228955m589342l121527k052344
11274H163624j361622r17409o26269m37774l23210k60290k44427k55961k74689
11265C461973l01886l18576l19666l00388k61061k17921j77006j48271j26252
11256A290946j01282r1346p3281o5097n4766m2860l7883l6605l7304l0337k9960
11245F90225m0801l6498k8666k3633j8267j4227j6155j7664j5818j6514j5837
$$ y = [7853346, 7346805, 6838721, 6371033, 5983331, 5695965, 5507507, 5398279, 5351630, 5335393, 5345666, 5406139, 5556782, 5871964, 6446406, 7410247, 8978382, 11497127, 15421893, 21078045, 28336369, 36729764, 45412743, 53144476, 58693170, 61180973, 60102747, 55684204, 48768860, 40447035, 31880494, 24155792, 17926837, 13337495, 10215968, 8163624, 6802002, 5884593, 5258324, 4820550, 4497340, 4237050, 3992623, 3736662, 3461973, 3160087, 2841511, 2521845, 2221457, 1960396, 1742475, 1565469, 1417198, 1290946, 1189664, 1098318, 1025037, 959940, 905174, 862314, 824431, 787826, 750522, 720185, 690225, 649424, 612926, 584260, 560627, 542360, 528133, 511978, 494314, 478496, 461982, 446145]
11234D46145j4903k3374j6418j5290j1531r913j0535l147P13K930N995m928K36
11221C45980p489j4978j7303j1563j7666j5987j5473j7404j9453j6533j7740j8248
11209A56143j5489l620P590J3752K1548K3279K1830N601N49J836n08p510l912
11196B21089p563m842J959L536K742j81k366n401r902q041o139l210o780q472
11182A66429O755J3580J3262J7213J9427J6058J0390N472P47q585j3854j6575
11170B30319j9458j8474j5541j8228j5574j1382j1529o887J257j38J971J0352
11158A26688P833R482O982P711K059J238n149q407j1541o761q9N6N147R15n87
11143A35577O751L134Q4o901p288l347p171o417n87R412Q855Q546P331P597P594
$$ y = [446145, 431242, 407868, 391450, 376160, 364629, 354716, 344181, 341034, 341747, 344677, 350672, 345744, 345980, 338491, 323513, 306210, 294647, 276981, 260994, 245521, 228117, 208664, 192131, 174391, 156143, 140654, 137034, 144624, 158376, 179924, 203203, 225033, 230634, 231183, 233019, 232511, 225001, 221089, 213526, 208684, 210643, 214179, 216921, 216740, 214374, 208973, 199071, 191030, 184891, 181681, 174901, 166429, 173184, 186764, 200026, 217239, 236666, 252724, 263114, 268586, 269333, 260748, 246894, 230319, 210861, 192387, 176846, 158618, 143044, 131662, 120133, 113246, 114503, 114365, 116336, 126688, 134521, 144003, 150985, 158696, 160755, 161993, 156844, 148437, 136896, 130135, 130046, 130102, 135249, 136164, 135577, 142328, 145462, 145546, 138645, 131357, 128010, 120839, 114422, 113835, 123247, 132102, 140648, 147979, 155576, 163170]
11128A63170M909k787r813j4730r356n045n808q462n677l133n448l611K130J496
11114I7835l220j681J285N56l79m072l990j94k138n856m826l000J634N46K9L698
11098G6227N180L483J350J599J605l814o973K439k032r017j649J877M896O391
11084H1562K175N113M697l118k287n190n460Q98l92j807j590r52m02j282L61K81
11068G2607r00l550o808k474N09j646l871k202L220J813J746j397J069J27l257
11053E4986j012o805l838j302L046n64O82j417N289j47j756j089j277n62j168
11038D3066j398K513J025J644J48l051K694M601o38R73N057O015N818M207J798
11023G4472M585q90M21k878j3982m866o201o506o891p363j0043k854J2997O747
$$ y = [163170, 168079, 165292, 155479, 140749, 131393, 126348, 120540, 112078, 106401, 103268, 97820, 94209, 96339, 97835, 94615, 92934, 94219, 94775, 94396, 90324, 86334, 86140, 84002, 78146, 73320, 70320, 71954, 72500, 72529, 76227, 81407, 84890, 86240, 87839, 89444, 85630, 78657, 81096, 79064, 70047, 68398, 70275, 75171, 81562, 83737, 88850, 93547, 90429, 88142, 82952, 77492, 78390, 77998, 76191, 74601, 73649, 73247, 71965, 72326, 72607, 71707, 68157, 61349, 58875, 59384, 57738, 53867, 51665, 54885, 56698, 58444, 57047, 58116, 58243, 54986, 53974, 47169, 43331, 42029, 45075, 44511, 45193, 43776, 49065, 48918, 47162, 46073, 44796, 44234, 43066, 41668, 44181, 45206, 46850, 46998, 43947, 46641, 51242, 50604, 51577, 56634, 62649, 68467, 72674, 74472, 79057, 78167, 78588, 75710, 61728, 56862, 50661, 44155, 37264, 29901, 19858, 17004, 30001, 36748]
11009C6748j952RJ448l819j030n812L127M353l836K174J016N354L710n016l581
10994C2893J473N851J323J797j298k886k223m328K8L976M403M330M356M370P250
10979F1315J0828N829L721M825O87K827O418J9860L2777M0903M5894N1695M8471
10966C36050L9653J9914o940k1958m2687n0576m9595l9958l2828k8694j9900j4979
10954H7502j2731q532k100k723J743k081m523m072k096L820K332L929m038K06
10940E6636P56K80k332N116p25O88N484K570j749J603R459R781J6108J4768K7888
10925A46331M6122O4438Q1956R3753R8808Q9239O4623K8174j1129m7455p8565
10914E76295r4753q9334q2961p1753n8584l9177k1511j1053j0246p374q288o955
$$ y = [36748, 34796, 34805, 36253, 32434, 31404, 25592, 28719, 33072, 29236, 31410, 32426, 37780, 41490, 36474, 32893, 34366, 40217, 41540, 43337, 42039, 39153, 36930, 32602, 32630, 36606, 41009, 45339, 49695, 54065, 61315, 72143, 77972, 81693, 86518, 87205, 90032, 96450, 116310, 149087, 189990, 235884, 287579, 336050, 375703, 395617, 388677, 366719, 324032, 273456, 223861, 183903, 151075, 122381, 102481, 87502, 74771, 66239, 64139, 61416, 63159, 61078, 56555, 52483, 50387, 54207, 56539, 60468, 56430, 56636, 57392, 57672, 55340, 60456, 59731, 60419, 65903, 68473, 66724, 68327, 77786, 87567, 103675, 118443, 146331, 192453, 256891, 338847, 432600, 531408, 620647, 685270, 713444, 702315, 654860, 576295, 481542, 392208, 309247, 237494, 178910, 139733, 118222, 107169, 96923, 89549, 81261, 74306]
10902G4306k732k509K044j318l635l025m249J245l36l828m338k873j201M647j024
10887E1174p184K098j963K864O571R095R064L948J3999K1064K7832M2353N6202
10874B37117M5550M0142K9433Q219r134j8372l6349m5314m7185m5615l4727k8809
10862I4956k3019r985p012r504r367l732K901N702K991j174l54j270l045k430
10848C5658J364L06j187J308k38m501n114K877k859m137O16m236l603J577N438
10833B3269M573O09p717Q20L144q03N785J209k208k664R55K489L268n76m318n287
10817B2548k690n322J35k86K49J247k177N92N808l288n288J613O152J939j781
10802A9451l231n122J199M342J714j961k522m076j60M76M195J463k38j562K424
$$ y = [74306, 71574, 69065, 71109, 69791, 66156, 63131, 58882, 60127, 59791, 55963, 51625, 48752, 47551, 52198, 51174, 43990, 46088, 44125, 46989, 53560, 62655, 71719, 75667, 89666, 110730, 138562, 180915, 237117, 282667, 322809, 352242, 360461, 351327, 332955, 296606, 251292, 204107, 158492, 123765, 94956, 71937, 61952, 54940, 45436, 36069, 32337, 35238, 40940, 43931, 42757, 42403, 41133, 38088, 35658, 37022, 37328, 36141, 37449, 37211, 32710, 27596, 30473, 27614, 23477, 24093, 19857, 16254, 17831, 23269, 27842, 28451, 20734, 21554, 24698, 23895, 29680, 30889, 28681, 26017, 26972, 29461, 32729, 32153, 27835, 22548, 19858, 14536, 14671, 14385, 14634, 15881, 13704, 14296, 20104, 16816, 11528, 13141, 19293, 21232, 19451, 16220, 11098, 12297, 16639, 18353, 16392, 13870, 9794, 9634, 10110, 14305, 15768, 15530, 13968, 16392]
10787A6392J627j466j590k811P89o78n2R39k50L319K400j692n612j614o44J58
10771I215R11p34R89M98N945m88L7k321l134M086j503L73j93r92N57J55K3J12
10753A3536l482j627P1j123Q7L904M271n22m753q54Q384j688k037m37k530k270
10737H930m317p19P689J47l914o495L279J827P32j957N25J737J174l54M293j08
10721A2469L31N620M938j131m817k499K421l269k33r10p149l221K586M46J49J842
10705G573j036j179K12J41j711l976l008j30p14Q380J361j690k284N163K022Q05
10689I929j396l154R81L418J058K40o75j189j245L124K557l173L009l38m840m902
10673C404q39P43J273K311ok052N77n259j723L507J41k447L146J656m54N611K587
$$ y = [16392, 18019, 16553, 14963, 12152, 12941, 12263, 12211, 13150, 12900, 16219, 18619, 16927, 11315, 9701, 9057, 9215, 10126, 9392, 10381, 10879, 16824, 16336, 16373, 14052, 10918, 15004, 13501, 13874, 13681, 12689, 13246, 13401, 13424, 13536, 10054, 8427, 8498, 7375, 7462, 11366, 15637, 15115, 10362, 9508, 17892, 16204, 14167, 13730, 11200, 8930, 4613, 3894, 11583, 11730, 7816, 1321, 4600, 6427, 7159, 5202, 5727, 7464, 8638, 8284, 12577, 12469, 12800, 18420, 23358, 22227, 17410, 14911, 17332, 14063, 13830, 12920, 5771, 2550, 5136, 5582, 5731, 7573, 6537, 5358, 5570, 5711, 4000, 24, -2984, -3114, -3828, 4552, 5913, 4223, 1939, 7102, 9124, 9929, 8533, 5379, 6360, 9778, 10836, 11076, 10401, 9212, 7967, 11091, 13648, 10475, 13484, 13146, 8306, 3404, 2565, 3308, 4581, 6892, 6886, 4834, 5411, 152, -1571, 1936, 2077, -370, 2776, 4432, 3978, 9589, 12176]
10656A2176K385m234j347k729o90J622N189K07j110L12K705l281O95J876j470
10641A2306j22K999R95k396r86n552n09j031k082j16K03q17l711K286j593m373
10625d499k215K612L964L426K708p61p98L482K476J744m391k400L799J56J477
10610A0780K74J700k585r54J2J563l263l336J18J382m48k409L105L755L85k132
10594G947k821k990K826K272j346K886M237J233J29n845p416k801K460K596m3
10579C324J576K141L652k238q07N602P433M113l227j331l013J480L233o401j878
10564A3659q47k418m80M03N418k42n617J885L507k368n530K160L532k157k602
10549H303j896J9j470l665k275M643M759N111N522J105N1p45M30l487p231k314
$$ y = [12176, 14561, 10327, 8980, 6251, 5561, 7183, 12372, 12579, 11469, 11781, 14486, 11205, 11900, 13776, 12306, 12184, 15183, 16178, 13782, 12796, 7244, 6735, 5704, 3622, 3506, 3709, 2892, -819, 1467, -126, -4499, -6714, -4102, -138, 3288, 5996, 5235, 4437, 7919, 10395, 12139, 7748, 5348, 9147, 9303, 10780, 11054, 12754, 10169, 9215, 9227, 10790, 7527, 4191, 4309, 5691, 5243, 2834, 5939, 9694, 10079, 7947, 5126, 2136, 4962, 7234, 5888, 8774, 13011, 14244, 14373, 8528, 1112, -1689, 771, 3367, 3324, 4900, 7041, 10693, 8455, 7648, 13250, 20683, 24796, 21569, 20238, 17225, 18705, 21938, 15537, 13659, 12812, 10394, 9914, 10317, 15735, 15493, 9876, 11761, 15268, 12900, 7370, 9530, 13062, 10905, 8303, 6407, 6426, 4956, 1291, -984, 3659, 8418, 13529, 19051, 20156, 20207, 19462, 19892, 16405, 9174, 6860]
10533F860J747l337j962J486J780l966N16L94j752k015O165N923M615K231p951
10518A0734j525K429j576o777L290K692J8M619N6m621l881J355j776l132k355
10503d50N842N113k135j732K4k587k029K485J636p02j965k228j580l002j290o80
10487e280O82N55N284P053N551m342L692j19l918q95k856k577R41J183k874j373
10471G07L6j95l166L349l379k168M649M69j483Q95L639O58j115P70O15J199l63
10454E117J321K049J926k188r28q86k162J217o25l379k76O80L57J019J335o29
10438C948j526m36L282J937m433j507P19k650J8P55j814j571J898l42l223j604
10422f549L245M425L929L662N39m329p034o665L626O110L232J077o384k157O107
$$ y = [6860, 8607, 5270, 3308, 4794, 6574, 2608, 3124, 3518, 1766, -249, 5916, 11839, 16454, 18685, 10734, 9209, 11638, 10062, 3285, 6575, 9267, 9285, 13904, 13960, 9339, 5458, 6813, 5037, 1905, -450, 5392, 10505, 8370, 6638, 6662, 4075, 2046, 4531, 6167, 5465, 3500, 1272, -308, -3310, -4600, -5280, -4598, -4043, 1241, 8294, 13845, 9503, 13195, 13076, 9158, 8263, 5407, 2830, 3771, 4954, 2080, 707, 743, 548, -2618, 731, -2648, -4816, -167, 302, -1181, -286, 3353, 4011, 2896, 3666, 4281, 5480, 5117, 6438, 8487, 10413, 8225, 7297, 6411, 4249, 5466, 4841, 1462, 1186, 1866, 2223, 3242, 4577, 3948, 2422, 1986, 5268, 7205, 2772, 1265, 1984, -666, -648, 107, -1707, -3278, -1380, -1722, -4945, -6549, -3304, 1121, 5050, 8712, 9251, 4922, -2112, -8777, -5151, 959, 4191, 5268, -1116, -3273, 2834]
10407B834P71K265j007j967o97K433r34N239q51J320J196m684j031L675L802J792
10391A4156k344j118m710o14k335M72O630l017o913j109J69k76j247K106M769
10376D619m09m782R31k87j898P94P098K659l157p83K830L123K99m148m61J910
10360H338j391J713L029j409k683K444l478k724J330k600q561j411P463O168K421
10345H649MK794k851J779m81k277L360K651j056l422R73m261l508J576J899m05
10329E424j448j971m984k429K916N021L918L601j351j284J776j238J282K048j870
10314I411J094K561J977o016k982J503k715j915L470M766k559p08n785r91J164
10299B275N20J537j731j463k580J160N730M268J894j854j646K3j016k14r07K212
$$ y = [2834, 3605, 5870, 4863, 2896, 2199, 4632, 3698, 8937, 8086, 9406, 10602, 5918, 4887, 8562, 12364, 14156, 11812, 10694, 5984, 5370, 3035, 3507, 10137, 7120, 207, -902, -733, -1009, -2256, -150, 4619, 4210, -572, 359, 72, -1826, -1032, 6066, 8725, 5568, 4785, 7615, 10738, 11037, 6889, 6428, 8338, 6947, 8660, 11689, 10280, 7597, 10041, 6563, 3839, 5169, 2569, -5992, -7403, 60, 6228, 8649, 8653, 11447, 8596, 10375, 9894, 7617, 10977, 13628, 12572, 9150, 10123, 5862, 2354, 3930, 5829, 5424, 3976, 2005, -2979, -5408, -2492, 2529, 6447, 10048, 8697, 7413, 9189, 7951, 9233, 11281, 9411, 10505, 13066, 15043, 9027, 6045, 7548, 4833, 2918, 6388, 11154, 8595, 7887, 2102, 1111, 2275, 2795, 4332, 2601, 1138, -1442, -282, 5448, 9716, 11610, 9756, 8110, 8133, 7117, 6903, 5996, 8208]
10283H208m14j644j154J181J038k481l340o939J383K407R61J90L527j412n175
10268c664n479j967k1L984N179K003j199k288k916r27M648Q01Q45P81J804L441
10252E025L283m621j106J41L44J125n5j251n429j008P218N297l09j900k258Q52
10236E348k169j249K951K403k724j915k263O37N834L268j330j552K83K85n979
10221A828k689L310N421K48m356m255J561M927n634L517O278q34n670m88J204
10206D368K375N125o51l150R83m00O307L336j174J271J524K985L332O486P803
10191D0520N498K932J144P94o379k842q965j0058m424n3j639p705l340O10K908
10176I001J255j194K78R43m329L97m06j782k416J847l935j618J882K23j176J322
$$ y = [8208, 7794, 6150, 4996, 6177, 7215, 4734, 1394, -5545, -4162, -1755, -794, -604, 2923, 1511, -3664, -9143, -11110, -11131, -7147, -1968, 35, -1164, -3452, -6368, -7295, -2647, -1846, -1001, -220, 1584, 5025, 8308, 3687, 2581, 2722, 3066, 4191, 4136, 2885, -2544, -3552, 3666, 8963, 8654, 6754, 4496, 5348, 3179, 1930, 4881, 7284, 4560, 2645, 382, 1019, 6853, 10121, 8791, 7239, 7522, 7807, 1828, -861, 2449, 7870, 8118, 3762, -493, 1068, 5995, 361, 3878, 10156, 9322, 3652, 3164, 4368, 6743, 11868, 11217, 8067, 9050, 8650, 14957, 18293, 17119, 18390, 19914, 22899, 26231, 32717, 40520, 46018, 48950, 50094, 50888, 44509, 41667, 32702, 22644, 18220, 18167, 16528, 8823, 5483, 6093, 9001, 10256, 9062, 9340, 10283, 5954, 6351, 5945, 4163, 1747, 3594, -341, -1959, -77, 146, -1030, 292]
10160B92L240J528M418O484k31n319j78K00M20J546l480O04K009J510Q01k780
10144A1064j76L185l148j13J37J263L523l126L5r86l736K157j592n970p0j253
10128A194J059P305N732l219o203J125J36j304l132K831N94j369K790J430L056
10113A2025L234p17Q6K99l63m851l502l596L476N921K218L015j762K495K33l409
10097A4802m226n061K52J341l608k65L051l489r61k442j605k185K660K258j854
10082a332k063J78q21n51j435j831L335L321N6k461j67K062L610j94l524K731
10066I14K042J629J99k114j369m124l937k037j487O842K822N64l018M53j679M01
10050c899N097j808k0J982K326J509K691k19l141k04k192k914j467K401o17k786
$$ y = [292, 3532, 5060, 9478, 15962, 15731, 10412, 10234, 10434, 10854, 12400, 8920, 9524, 11533, 13043, 13844, 11064, 10888, 14073, 10925, 10812, 10949, 12212, 15735, 12609, 12644, 11658, 7922, 10079, 8487, 2517, 2447, 1194, 2253, 9558, 15290, 12071, 5868, 6993, 7129, 5825, 2693, 5524, 6118, 4749, 7539, 8969, 12025, 15259, 14542, 14628, 14927, 14564, 9713, 6211, 2615, 6091, 12012, 14230, 17245, 15483, 17978, 18211, 14802, 10576, 5515, 5767, 7108, 3500, 3235, 6286, 2797, 1836, -606, -2211, -4396, -1736, 522, -1332, -3395, -3217, -4038, -4589, -6024, -7855, -4520, -1199, -1143, -3604, -3771, -1709, 1901, 1707, -1817, 914, 2956, 4585, 4784, 2670, 1301, -2823, -6760, -8797, -10284, -3442, -620, -56, -3074, -2621, -4300, -3899, 1198, -610, -630, 1352, 3678, 5187, 7878, 7659, 4518, 4314, 2122, -792, -2259, 142, -475, -3261]
10034c261J875m809M647M437l938J35j203K409Q49L194J94m311k998O29O35l85
10018a901K8K410J117k788J335J417j58N89j158o428m031O7O312J652L287n11
10002A239j834m186O708J102j595j238j282J982j458j233K586K352n929l000J750
9987d036m927o86M692R532k87m218o61P753j183M503J3p788j052L392n523k702
9971c178K336p56L724N728r69j171n38k93J016l472k950k05J803J788K349j974
9955C238k091k014M32n046l71M441K694m33N773J543q01k311j989M938O026o7
9939A3962N974L96m591o940k554l938j972O58q91K492P06n903l523J299j118J30
9923e813L629O789O07k383j606M844q5o386J014J219L89k029J066L380M099J365
$$ y = [-3261, -1386, -6195, -1548, 2889, -1049, -914, -2117, 292, 1141, 4335, 4529, 218, -2780, -2151, -1516, -1901, -1873, 537, 1654, -1134, 201, 1618, 1460, 2049, 891, -5537, -9568, -9501, -3189, -1537, 1750, 1239, -595, -4781, 1927, 3029, 1434, 196, -1086, 896, -562, -1795, 791, 3143, -2786, -5786, -4036, -8963, -9649, -4957, 4575, 4288, 70, -591, 7162, 5979, 10482, 10495, 2707, 1655, 5047, -476, -3178, -842, -1598, 2126, 7854, 6885, 5714, 5176, 4883, 5899, 2427, -523, -728, 1075, 2863, 5212, 3238, 1147, -867, -435, -5481, -5852, -1411, 1283, 850, 6623, 8166, 7365, 5054, 3065, 8003, 14029, 13962, 19936, 20332, 15741, 8801, 6247, 2309, 337, 995, 104, 2596, 3302, -2601, -6124, -4825, -5943, -5813, -2184, 4605, 5212, 2829, 1223, 6067, 5982, -404, 610, 1829, 2218, 189, 1255, 4635, 8734, 10099]
9907A0099p26j169n339m45O2j407J896M485Q30l64o13k368j626L428j769l567
9891A407J917j542M1M792L498m678m581J440O12k121K794M743o146j489j636R26
9875b3n80m70K445K076L854N814k074n802j15q90p28J821L910R35k162J491J116
9858A0618Q0m999o430J5j054N10K318r17l637J755M362M212j415m38K429k648
9842D761r448j546K896R628M243K91r5J004j288j120k101m856k784K43K148Q46
9826B822m97K587J90L13m081K559J5K517M296l110J325l215k497k50k91L089j526
9809D246j96J561J601k64j285J779j99j006m112n204j459M847Q80J528M605r40
9793F382n647k470l757J664N57N870L167o002k407K34L961O59J702k732l102r45
$$ y = [10099, 9373, 8204, 2865, 2420, 2482, 1075, 2971, 7456, 8286, 7922, 7309, 4941, 3315, 6743, 4974, 1407, 3324, 1782, 1823, 6615, 10113, 5435, 854, 2294, 2906, 785, 3579, 8322, 2176, 687, -949, -23, -603, -1073, 1372, 3448, 7302, 13116, 11042, 5240, 5125, 4235, 3507, 5328, 9238, 10173, 8011, 9502, 10618, 10698, 5699, -731, -716, -1770, -1260, 1058, 141, -3496, -1741, 2621, 6833, 5418, 4980, 7409, 4761, -4687, -6233, -3337, 6291, 10534, 10825, 10730, 11734, 10446, 9326, 7225, 2369, -415, -172, 1976, 2822, 2325, 4912, 5102, 5415, 1334, 3893, 3908, 6425, 10721, 7611, 8936, 5721, 3224, 2974, 2683, 5772, 4246, 4050, 5611, 7212, 6948, 5663, 7442, 7243, 6237, 2125, -3079, -4538, 309, 1189, 2717, 7322, 6382, 735, -1735, -5492, -3828, -3271, 2599, 5766, -236, -2643, -2409, 1552, 2211, 3913, 1181, -1921, -2866]
9777b866M73P14r90j56J058l478K500P52l322L0O377K181L037q51j912m65k139
9760I43k396P003L250m653K466j89K473J657L31k630N89J018r25l99J885N589
9744A6012j410j397j890M332K401l694l657k727J209K886L428l287j803k87J758
9729A1874j403K081l214k788M984L871j131k210M565n4k844M500j079j097m990
9714A1065k425J450J012J580K574j438J09P697J0456P650N596K657m973j2207
9700C0803l763o113r10l825q72n36O8m451J621l26l774K837N545n6l963M933J792
9683A9010M701m646l305N747k825l581k855j628k521l337m189r38r05j942O806
9668C592L954K459K809N875J063o051m981K96Rk278l788j297o6M227J552m717
$$ y = [-2866, -2393, -1679, -2669, -2825, -1767, -5245, -2745, -1993, -5315, -5285, 1092, 3273, 6310, 5459, 3547, 3082, 943, -1453, 5550, 8800, 4147, 6613, 6424, 8897, 10554, 10885, 8255, 8844, 9862, 8937, 8538, 10423, 16012, 14602, 13205, 11315, 15647, 18048, 14354, 10697, 7970, 9179, 12065, 15493, 12206, 10403, 10116, 11874, 10471, 12552, 9338, 6550, 11534, 15405, 14274, 12064, 16629, 16575, 13731, 18231, 17152, 16055, 11065, 8640, 10090, 11102, 12682, 15256, 13818, 13927, 21624, 32080, 39730, 45326, 47983, 43010, 30803, 27040, 20927, 20017, 16192, 15320, 14784, 14852, 10401, 12022, 11696, 7922, 10759, 16304, 16248, 12285, 17218, 19010, 23711, 19065, 15760, 21507, 18682, 15101, 12246, 10618, 8097, 4760, 571, -367, -1272, -3214, 3592, 7546, 10005, 12814, 18689, 19752, 13701, 8720, 9016, 9025, 6747, 2959, 1662, 1596, 5823, 7375, 2658]
9652B658k298K196Q25l619J846P544J877m642l785n223k342M83J308o6L58j375
9636d255J786L588k077j6M66M186K392K319k787n426k552l246K765N504J1446
9621A4093K340p575o244q47N453k128k424l307K091M597N66K239k810l882j740
9606D22j818M100l596M172N488M656K21N84j759o638m529J030j678K943m73L785
9590F910N11p944j011K915l6N41O639O268j064p603n698K203K219l158J678L453
9574F823M784M92J774L74j798l81n103k477j35l37R65N35q34l520L6L26K320K251
9556F095j296r094l710R876O997k691O14k846j636J430m323j98K671K920k054
9541B755j282K922k193P61l754j612J231j431J534P554M21m209k813K638O024
$$ y = [2658, 360, 2556, 3381, -238, 1608, 9152, 11029, 6387, 2602, -2621, -4963, -4480, -3172, -3238, -2880, -4255, -2469, 1119, -958, -974, -508, 3678, 6070, 8389, 5602, 176, -2376, -5622, -2857, 2647, 14093, 16433, 8858, 2614, 1767, 7220, 5092, 2668, -639, 1452, 6049, 6615, 8854, 6044, 2162, 422, -1396, 2704, -892, 3280, 8768, 13424, 13645, 14229, 12470, 5832, 1303, 2333, 655, 3598, 3125, 6910, 7421, -523, -1534, 1381, 1345, 1886, 8525, 14793, 13729, 6126, 428, 2631, 4850, 1692, 3370, 6823, 11607, 12099, 13873, 14247, 12449, 12068, 6965, 4488, 4353, 4016, 4981, 5516, 4682, 1162, 1198, 1524, 3844, 6095, 4799, -4295, -8005, 1871, 8868, 6177, 6791, 3945, 2309, 3739, -584, -782, 1889, 4809, 2755, 1473, 4395, 2202, 2963, -791, -2403, -1172, -2603, -1069, 6485, 6906, 2697, -116, 2522, 8546]
9526H546N680J35j095j345m54m62q85J139J32l669N70j796r228O99M005K113j729
9509B356j948n156K839J348j485M756L771j892j255j295p420J052M354M504j527
9494C002q204m313M96O847M452L716m119j244J020M254K255N56o3j872K598j16
9478I265m603l833m0J49j263k157K410K757L847L041j185J136J199j97m306K996
9462I216J394l993k032N903k70j799l874J55K144j631j767j966J171J705M885
9447I241m90k725R87J526j138O09n209N43L751J47l827J58M717k379o073m261
9431d423L562L118k386K62J517J256K118n75M647o360m083L424O211L462n734
9416F016k697K197j677K130J665j66J104j324k190j173J600o13l355K009K405
$$ y = [8546, 14226, 14361, 13266, 11921, 11467, 11005, 10120, 11259, 11391, 7722, 8292, 6496, -2732, -2033, 1972, 4085, 2356, 408, -4748, -1909, -561, -2046, 2710, 6481, 4589, 3334, 2039, -5381, -4329, 25, 4529, 3002, -5202, -9515, -9019, -2172, 2280, 5996, 1877, 633, 1653, 5907, 8162, 8718, 8655, 6783, 9381, 9265, 4662, 829, 789, 938, -325, -2482, -72, 2685, 6532, 9573, 8388, 9524, 10723, 10526, 6220, 9216, 10610, 6617, 4585, 10488, 10218, 8419, 4545, 4700, 6844, 5213, 3446, 1480, 2651, 4356, 9241, 8751, 6026, 7013, 8539, 7401, 8010, 2801, 3344, 7095, 7242, 3415, 3573, 8290, 5911, -162, -4423, -861, 2257, -129, 133, 1650, 2906, 5024, 4449, 9096, 2736, -1347, 2077, 8288, 11750, 6016, 3319, 5516, 3839, 5969, 7634, 7468, 8572, 7248, 5058, 3885, 5485, 4872, 1517, 3526, 5931]
$$ [...]
##END NTUPLES=NMR SPECTRUM
##END=
