##TITLE=Analysis number 318398
Compound Code cc 50910
Book Reference 452/172/2
Project Code adrs
Chemist Name peted
##JCAMPDX= 6.0         $$ Bruker NMR JCAMP-DX V2.0
##DATA TYPE= NMR SPECTRUM
##DATA CLASS= NTUPLES
##ORIGIN= Bruker BioSpin GmbH
##OWNER= nmr
$$ XWIN-NMR		Version 3.5
$$ Tue Mar 28 09:15:26 2006 GMT Daylight Time (UT+1h)  MAYBRIDGE\nmr@NMR_250MHZ
##.OBSERVE FREQUENCY= 250.131544655141
##.OBSERVE NUCLEUS= ^1H
##.ACQUISITION MODE= SIMULTANEOUS (DQD)
##.ACQUISITION SCHEME= undefined
##.AVERAGES= 16
##.DIGITISER RES= 18
##SPECTROMETER/DATA SYSTEM= dpx250
##.PULSE SEQUENCE= zg30
##.SOLVENT NAME= CDCl3
##.SHIFT REFERENCE= (INTERNAL, CDCl3, 0, 16.522)
##AUDIT TRAIL= $$ (NUMBER, WHEN, WHO, WHERE, WHAT)
$$ ##TITLE= Audit trail, XWIN-NMR		Version 3.5
$$ ##JCAMPDX= 5.01
$$ ##ORIGIN= Bruker BioSpin GmbH
$$ ##OWNER= nmr
$$ C:\u/data/dgb/nmr/ADRS/1540/pdata/1/auditp.txt
$$ ##AUDIT TRAIL=  $$ (NUMBER, WHEN, WHO, WHERE, WHAT)
(   1,<2006-03-28 09:15:04.20 +100>,<MAYBRIDGE\nmr>,<NMR_250MHZ>,
      <created by zg, POWCHK disabled, PULCHK disabled
       configuration hash MD5:
       84 BC 41 DB A1 6E 1D 46 DA 25 12 A5 C1 ED C5 3A
       data hash MD5: 64K
       26 1A D7 DD 2B 77 9C 97 C7 92 22 B0 92 B1 27 9B>)
(   2,<2006-03-28 09:15:17.56 +100>,<MAYBRIDGE\nmr>,<NMR_250MHZ>,
      <Start of raw data processing
       ef LB = 0.3 FT_mod = 6 PKNL = 1 SI = 32K 
       data hash MD5: 32K
       DF 32 61 3B 1F 2F F9 63 85 63 F4 23 87 C0 4E 66>)
(   3,<2006-03-28 09:15:19.38 +100>,<MAYBRIDGE\nmr>,<NMR_250MHZ>,
      <apk 
       data hash MD5: 32K
       17 98 8B 2C BB 17 F0 F9 50 99 91 33 F7 05 94 A3>)
(   4,<2006-03-28 09:15:20.24 +100>,<MAYBRIDGE\nmr>,<NMR_250MHZ>,
      <abs ABSG = 5 
       data hash MD5: 32K
       7F E5 7F 6A 2B B7 1B 6A FC 2B 8C BC 7B 5A 43 15>)
$$ ##END=
$$ 
$$ hash MD5
$$ 07 D0 B9 ED A4 98 24 76 EA 0A 78 6C B3 37 F6 BD
##$RELAX= 
##$RELAX= 
##$RELAX= 
##$RELAX= 
##$RELAX= 
##$RELAX= 
##$RELAX= 
$$ Bruker specific parameters
$$ --------------------------
##$DU= <C:\u>
##$EXPNO= 1540
##$NAME= <ADRS>
##$PROCNO= 1
##$TYPE= <nmr>
##$USER= <dgb>
##$AMP= (0..31)
100 100 100 100 100 100 100 100 100 100 100 100 100 100 100 100 100 100 
100 100 100 100 100 100 100 100 100 100 100 100 100 100 
##$AQSEQ= 0
##$AQ_mod= 3
##$AUNM= <au_zg>
##$AUTOPOS= <4 >
##$BF1= 250.13
##$BF2= 250.13
##$BF3= 250.13
##$BF4= 250.13
##$BF5= 500.13
##$BF6= 500.13
##$BF7= 500.13
##$BF8= 500.13
##$BYTORDA= 1
##$CFDGTYP= 0
##$CFRGTYP= 5
##$CHEMSTR= <none>
##$CNST= (0..31)
1 1 145 1 1 1 1 1 1 1 1 1 1 1 1 1 1 1 1 1 1 1 1 1 1 1 1 1 1 1 1 1 
##$CPDPRG= <>
##$CPDPRG1= <>
##$CPDPRG2= <>
##$CPDPRG3= <>
##$CPDPRG4= <mlev>
##$CPDPRG5= <mlev>
##$CPDPRG6= <mlev>
##$CPDPRG7= <mlev>
##$CPDPRG8= <mlev>
##$CPDPRGB= <>
##$CPDPRGT= <>
##$D= (0..31)
0 1 0 0 0 0 0 0 0 0.06 0 0 0 0 0 0 0.0002 0 0 0 0 0 0 0 0 0 0 0 0 0 0 
0 
##$DATE= 1143533703
##$DBL= (0..7)
120 120 120 120 120 120 120 120 
##$DBP= (0..7)
150 150 150 150 150 150 150 150 
##$DBP07= 0
##$DBPNAM0= <>
##$DBPNAM1= <>
$$ [...]
##$SUBNAM7= <"">
##$SUBNAM8= <"">
##$SUBNAM9= <"">
##$SW= 20.6930455092707
##$SWIBOX= (0..15)
0 0 3 0 0 0 0 0 0 0 0 0 0 0 0 0 
##$SW_h= 5175.983436853
##$TD= 65536
##$TD0= 1
##$TE= 294.16
##$TE2= 300
##$TE3= 300
##$TEG= 300
##$TL= (0..7)
0 120 120 120 120 120 120 120 
##$TP= (0..7)
150 150 150 150 150 150 150 150 
##$TP07= 0
##$TPNAME0= <>
##$TPNAME1= <>
##$TPNAME2= <>
##$TPNAME3= <>
##$TPNAME4= <>
##$TPNAME5= <>
##$TPNAME6= <>
##$TPNAME7= <>
##$TPOAL= (0..7)
0.5 0.5 0.5 0.5 0.5 0.5 0.5 0.5 
##$TPOFFS= (0..7)
0 0 0 0 0 0 0 0 
##$TUNHIN= 0
##$TUNHOUT= 0
##$TUNXOUT= 0
##$USERA1= <user>
##$USERA2= <user>
##$USERA3= <user>
##$USERA4= <user>
##$USERA5= <user>
##$V9= 5
##$VALIST= <valist>
##$VCLIST= <CCCCCCCCCCCCCCC>
##$VD= 0
##$VDLIST= <DDDDDDDDDDDDDDD>
##$VPLIST= <PPPPPPPPPPPPPPP>
##$VTLIST= <TTTTTTTTTTTTTTT>
##$WBST= 1024
##$WBSW= 4
##$XGAIN= (0..3)
0 0 0 0 
##$XL= 0
##$YL= 0
##$YMAX_a= 301806
##$YMIN_a= -334379
##$ZGOPTNS= <>
##$ZL1= 120
##$ZL2= 120
##$ZL3= 120
##$ZL4= 120
##$ABSF1= 16.522
##$ABSF2= -4.171173
##$ABSG= 5
##$ABSL= 3
##$ALPHA= 0
##$AQORDER= 0
##$ASSFAC= 0
##$ASSFACI= 0
##$ASSFACX= 0
##$ASSWID= 0
##$AUNMP= <proc_1d>
##$AZFE= 0.1
##$AZFW= 0.1
##$BCFW= 0
##$BC_mod= 0
##$BYTORDP= 0
##$COROFFS= 0
##$CY= 12.5
##$DATMOD= 1
##$DC= 0
##$DFILT= <>
##$DTYPP= 0
##$F1P= 14.0000005364418
##$F2P= -0.99999901652339
##$FCOR= 0.5
##$FTSIZE= 32768
##$FT_mod= 6
##$GAMMA= 0
##$GB= 0
##$INTBC= 1
##$INTSCL= 1
##$ISEN= 128
##$LB= 0.3
##$LEV0= 0
##$LPBIN= 0
##$MAXI= 10000
##$MC2= 0
##$MEAN= 0
##$ME_mod= 0
##$MI= 0
##$NCOEF= 0
##$NC_proc= -2
##$NLEV= 6
##$NOISF1= 0
##$NOISF2= 0
##$NSP= 0
##$NTH_PI= 0
##$NZP= 0
##$OFFSET= 16.522
##$PC= 1
##$PHC0= 175.8525
##$PHC1= 5.915574
##$PH_mod= 1
##$PKNL= yes
##$PPARMOD= 0
##$PSCAL= 4
##$PSIGN= 0
##$REVERSE= no
##$SF= 250.13
##$SI= 32768
##$SIGF1= 0
##$SIGF2= 0
##$SINO= 400
##$SIOLD= 32768
##$SREGLST= <1H.CDCl3>
##$SSB= 0
##$STSI= 32768
##$STSR= 0
##$SW_p= 5175.98343685301
##$SYMM= 0
##$S_DEV= 0
##$TDeff= 65536
##$TDoff= 0
##$TI= <Analysis number 999999
Compound Code 99
Book Reference 9
Project Code 9>
##$TILT= no
##$TM1= 0
##$TM2= 0
##$TOPLEV= 0
##$USERP1= <user>
##$USERP2= <user>
##$USERP3= <user>
##$USERP4= <user>
##$USERP5= <user>
##$WDW= 1
##$XDIM= 32768
##$YMAX_p= 327950609
##$YMIN_p= -142478
$$ End of Bruker specific parameters
$$ ---------------------------------
##NTUPLES= NMR SPECTRUM
##VAR_NAME=  FREQUENCY,     SPECTRUM/REAL,   SPECTRUM/IMAG
##SYMBOL=    X,             R,               I
##VAR_TYPE=  INDEPENDENT,   DEPENDENT,       DEPENDENT
##VAR_FORM=  AFFN,          ASDF,            ASDF
##VAR_DIM=   32768,         32768,           32768
##UNITS=     HZ,            ARBITRARY UNITS, ARBITRARY UNITS
##FACTOR=    0.157963299565203, 1,           1
##FIRST=     4132.6476996994, 0,             0
##LAST=      -1043.33573715361, 0,           0
##MIN=       -1043.33573715361, -142478,     0
##MAX=       4132.6476996994, 327950609,     0
$$ Real data points
##PAGE= N=1
##DATA TABLE= (X++(R..R)), XYDATA
$$ [...]
16607b0365j064N2569R933j4733J4052k1969j6891r719J5699n001k174Q947j0610
16594a326k02J1112o254p812j2226k0065R05N219K1211L4779P595r754j6218O932
16580A3896j6600l30M6812k3968j5765L3580j4252l9758L2242L3631K557l4650
16568A7395P253J383m071r424j5043k5165l204j7247P344J9051j6026J2967K6790
16555B003K0678K9495L732l7131k3316J6546J17j5141J8254L297J988n496l9447
16542b4421P807j792N324j4325J776O837l7125J7817K4108n492l5407j6830K8317
16529d3406J2595N280q61l298o23m1245m9693L5555M7623K2506M548J8961R323
16516A7265r968m74l197Q71K1623j263r530J3671O732J605l9275k3560j7768J3982
$$ plain form
16607 -20365 -21429 31140 41073 26340 40392 18423 1532 -8187 7512 2511 337 9284 -1326
16594 -1326 -1528 9584 3330 -4482 -16708 -36773 -35868 -30649 -9438 25341 32936 23182 6964 13896
16580 13896 -2704 -3034 43778 19810 4045 37625 23373 -16385 15857 49488 52045 17395
16568 17395 24648 26031 21960 12536 -2507 -27672 -30876 -48123 -40779 -21728 -37754 -24787 2003
16555 2003 22681 52176 55908 18777 -4539 12007 12124 -3017 15237 18534 20522 15026 -24421
16542 -24421 -16614 -18406 -13082 -27407 -25631 -18794 -55919 -38102 -13994 -19486 -54893 -71723 -43406
16529 -43406 -30811 -25531 -26392 -29690 -30313 -71558 -121251 -85696 -38073 -15567 -11019 7942 17265
16516 17265 7297 6823 3626 4497 26120 24857 15327 28998 35730 37335 -1940 -25500 -43268 -29286
16502b9286L0685j1422j4828j5299K3119q107j3272K6798p63k863J8428J3371
16490A6561j5984K125K2657m5630k4099L118J8525q576K019j5195R519j101J3075
16477b2986J2815R37p392n532K1402J4251K0531N758m307k8891j2797O524j363
16464a050j708q482j4049l027j2925J939p898j047J1826R366J7682K7312K8674
16451D6613j9063m8921j9414k519j964K3119K2256K0184J9213j0432J6375l799
16439D1648l3686j5165Q995K0028m0061o2232N092K7182M9673K1442j8898j239
16427B779k39k0733p768K0243J2003n934J4750J0312q799L4755q619J3668n665
16414E0753j7830k5032q722J9378k0825j7117K5871J3245M88j3657o920j4392
$$ plain form
16502 -29286 1399 -10023 -24851 -40150 -17031 -25138 -38410 -11612 -12375 -15238 3190 16561
16490 16561 577 2702 25359 -20271 -44370 -41252 -22727 -31303 -29284 -44479 -34960 -36061 -22986
16477 -22986 -10171 -9234 -16626 -22158 -756 13495 34026 39784 35477 6586 -6211 313 -1050
16464 -1050 -2758 -11240 -25289 -28316 -41241 -39302 -47200 -48247 -36421 -27055 -9373 17939 46613
16451 46613 27550 -21371 -40785 -43304 -45268 -22149 107 20291 39504 29072 45447 41648
16439 41648 7962 -7203 1792 21820 -18241 -80473 -75381 -48199 1474 22916 4018 2779
16427 2779 2540 -18193 -25961 -5718 6285 351 15101 25413 16614 51369 42750 56418 50753
16414 50753 32923 7891 -831 18547 -2278 -19395 6476 19721 20209 6552 -368 -14760
16402a4760j6259r92K6910J0142j0183k2849j00J6603j8820n171O319n510k0305
16389e4975j7134L0102L1827J2058l888K104K2995K5291R186q223J456j1725J2715
16376E1789Q006K7507k1478l1472r628l2546J8346L1230j7296J2634J6906J8606
16364G2604k0249j4698r522k4370k0092k0342j383J5563R306J1305J0444K2259
16352C0825Q200k3416k9502K0646n225j0152J7728Q145M977J2351K3876o409k1713
16339C0331J1061o482k0006j9739l048j946l079K4747K1165N984j6584K944K041
16326B7389Q181p553j8036J5134L990k9874j1335l852l938K7742o01l7104K2448
16313g409j0634N223J7832k2522k7405K0114K7092K3790k1599j3345L205j1781
$$ plain form
16402 -14760 -31019 -32011 -5101 5041 -5142 -27991 -28091 -11488 -30308 -35479 -29160 -34670 -54975
16389 -54975 -72109 -42007 -10180 1878 -2010 94 23089 48380 57566 49343 50799 39074 51789
16376 51789 59795 87302 65824 34352 24724 -7822 10524 41754 24458 37092 53998 72604
16364 72604 52355 37657 28135 3765 -16327 -36669 -38052 -22489 -13183 -1878 8566 30825
16352 30825 39025 15609 -13893 6753 1528 -8624 9104 17249 22226 34577 58453 52044 30331
16339 30331 41392 34910 14904 -4835 -7883 -9829 -12908 11839 33004 38988 22404 25348 27389
16326 27389 35570 28017 9981 25115 29105 -769 -12104 -15956 -19894 7848 7247 -29857 -7409
16313 -7409 -18043 -12820 5012 -17510 -44915 -24801 2291 26081 4482 -8863 -5658 -17439
16301a7439N853Q380J9562J5234k7998l0692m964N235o636K0403j7718j737J2252
16288b0265M717L0566r392N092K4030L633q860q632o581J3413P839l5197k1323
16275b0960J4189P979q022J5867o865L676j1663k5007m555J1867J2569J3821Q90
16262C786N89r033J5086K3002p109N866m1327j3998J4899L0455j952l5086r730
16249b4552J8163j5161M29J9217k475K334O363k4752j9681k743J9001K2240l4363
16236c5980m9981P709M5879L851P162J040J28j8947K0065L2231K7709o848j0314
16223B3704L823k5812l804l043l9411K993l037J7858J6934n857K6073K1640J2419
16210D4480k8390m0869n963J3501J773L093L1865l3112l2823J2735K930J1237
$$ plain form
16301 -17439 -11586 -3206 16356 31590 3592 -27100 -32064 -26829 -33465 -13062 -30780 -32517 -20265
16288 -20265 -15548 15018 5626 10718 34748 38381 29521 20889 14308 27721 35560 363 -20960
16275 -20960 -6771 1208 -6814 9053 2188 5864 -5799 -30806 -35361 -23494 -10925 2896 3786
16262 3786 4375 -4658 10428 33430 26321 32187 -9140 -23138 -8239 22216 20264 -14822 -24552
16249 -24552 -6389 -21550 -21121 -1904 -4379 -2045 4318 -20434 -40115 -42858 -23857 -1617 -35980
16236 -35980 -85961 -78252 -32373 -28522 -21360 -20320 -20192 -39139 -19074 13157 40866 34018 23704
16223 23704 27527 1715 -2089 -5132 -44543 -41550 -44587 -26729 -9795 -15652 10421 32061 44480
16210 44480 16090 -24779 -30742 -17241 -15468 -12375 19490 -13622 -46445 -33710 -30780 -19543
16198a9543J254n458q006J4453J0210L489O621m695j5404m081J5872O463k5324
16185b4149k8346K3575r43n196j1411O600K5218l333j5518q861j5448R854N315
16172d2643O1090Q808l776k2919J3896L3969l3471p798q381J1650P430l4772k1733
16159c8650J6336M628K5199j97m853J8079j0832L459O319K4572q97j8458o08J0550
16145C4647Q619n509n585l616O315l0608K301J0320j0525q28k6160k2767N547
16132c7849j2773j8943k6J0104J7225K7933n915P01K2754M1967J4933l6874k4252
16119a015O12j4677k6003r824K7240J7060K72m522M125J2927L9702J6236m1945
16106B0188j8991J2820j0361k8105j4437J0924L3682J8865j7240j3547r738K4204
$$ plain form
16198 -19543 -18289 -23747 -31753 -17300 -7090 -3601 3020 -1675 -17079 -21160 -5288 1175 -24149
16185 -24149 -52495 -28920 -29863 -35059 -46470 -39870 -14652 -17985 -33503 -42364 -57812 -47958 -42643
16172 -42643 18447 27255 23479 560 14456 48425 14954 7156 -1225 10425 17855 -16917 -38650
16159 -38650 -22314 -17686 7513 7316 2463 20542 9710 13169 19488 44060 43163 24705 24097 34647
16145 34647 43266 37757 32172 28556 34871 4263 6564 16884 6359 5531 -20629 -43396 -37849
16132 -37849 -50622 -69565 -69591 -59487 -42262 -14329 -20244 -19543 3211 45178 60111 23237 -1015
16119 -1015 -403 -15080 -41083 -50907 -23667 -6607 -6335 -10857 -6732 6195 45897 62133 20188
16106 20188 1197 14017 3656 -24449 -38886 -27962 5720 24585 7345 -6202 -15940 8264
16094H264J4649J2432k3477M41K688q349l6115q93K3295J3451L6299N502J8219
16081F6406j9929l4312r103j354N32P219r414J341J2214J4083l211M684q67k2891
16067E398r164j3962K1542r53j8240K942J6448P590Q325n831K0413J5673l4337
16054A5844K3683R92k9661J618K2023k4354m8749K5686M4020n608l3714R842L6712
16041C8334O340l6375k0005J9547J3647p342k9744L339L327J6805q492l934J7494
16028A2941J3900M606K800j6072K1479k7086k7899q828M549J1776J9179l776N505
16015A3074J3107j2395k3668Q160M040q642q768Q300m131j9502J0809O1J7376
16002b179j2644J7310L4231l433r829k5471k4168k616j7311r363J6833k2988M3509
$$ plain form
16094 8264 22913 35345 11868 12309 14997 6648 -29467 -30360 -7065 6386 42685 48187 66406
16081 66406 46477 12165 3062 1708 2240 9459 45 1386 13600 27683 24472 29156 28289 5398
16067 5398 -3766 -17728 3814 2861 -15379 -12437 4011 11601 19926 14095 34508 50181 15844
16054 15844 39527 40519 10858 12476 34499 10145 -38604 -12918 31102 25494 -8220 1622 38334
16041 38334 44674 8299 -11706 7841 21488 14146 -15598 -12259 -8932 7873 -619 -4553 12941
16028 12941 26841 31447 34247 18175 39654 12568 -15331 -24159 -19610 -7834 11345 7569 13074
16015 13074 26181 13786 -9882 -1722 2318 -6324 -15092 -6792 -10923 -30425 -19616 -19555 -2179
16002 -2179 -14823 2487 36718 33285 23456 -2015 -26183 -28799 -46110 -55473 -38640 -61628 -18119
15989a8119N535J4375K789j4130k4229k1270Q895M2063K275k2581n116K6661R803
15976F951O701Q89J0988l515j6511n944k9776J9435K3721l3214j0128Q69k8102
15963e7636j8288K6503M3065J2773J3165n459K5336N209J3157K514j4077j1450
15951C4812j4389j7524j9674q103N121j409J8366K2113M558k3196Q952M2667J0501
15938F2795m3505l0188L652m22k8482j8046J4133O472J4463J6073k6954J957n101
15925c3153L351L5042J6276L93j8359l749n6j911J4000j2939N129j6414K2978
15912A0588O513J8828M237q889k0320J6526M967r600j3929l257J6946K451J605
15899B6666j5183p763P2l1612j7907M4621L1647j1209m827j2981j9937J497n153
$$ plain form
15989 -18119 -12584 1791 4580 -9550 -33779 -55049 -46154 -4091 -1816 -24397 -29513 -2852 6951
15976 6951 13652 14541 25529 22014 5503 -441 -30217 -10782 12939 -20275 -30403 -29534 -57636
15963 -57636 -75924 -49421 -6356 6417 19582 14123 39459 44668 57825 60339 46262 34812
15951 34812 20423 2899 -16775 -24878 -19757 -21166 -2800 19313 23871 675 9627 52294 62795
15938 62795 19290 -10898 -7246 -7668 -36150 -54196 -40063 -33591 -19128 -3055 -30009 -28052 -33153
15925 -33153 -29802 5240 21516 21909 3550 -199 -255 -2166 11834 -1105 4024 -12390 10588
15912 10588 17101 35929 40166 31277 10957 27483 32450 22850 8921 5664 22610 25061 26666
15899 26666 11483 3720 3792 -27820 -45727 -1106 30541 19332 14505 1524 -18413 -16916 -22069
15886b2069l487L0990j1463k7081o527J2476L7813k5998o787M032l3149R296K0655
15873b1299M193j6023J5851K8733m921O40J5161J9979J2537j1418k2012j2602
15861H819k109L4166J6423o376j7376j1814j9424m8887J1066O629q26k0785L4016
15848a6478L6320k5144n6889j3245J946L1012L2581M974j8507l0690L5582P702
15836a0836o44K0246L1410J4080m116O593J2032k3419k7896m454k4075j4761o199
15823c2039J3352K8072J378k0806j9710o702L0322o859J4748J4969j3756k3568
15811b0599j9707J0364L6052m788k0726j4432l475p705R824K6355L30K91K4797
15798A6581L2883m4438l5105j4942J4629J0768q233M844j5766j7925j616N119
$$ plain form
15886 -22069 -25556 5434 -6029 -33110 -39637 -27161 10652 -15346 -22133 -18101 -51250 -41954 -21299
15873 -21299 -17106 -33129 -17278 11455 6534 7174 22335 42314 54851 43433 21421 8819
15861 8819 6710 40876 57299 50923 33547 21733 2309 -46578 -35512 -28883 -29709 -50494 -16478
15848 -16478 19842 -5302 -62191 -75436 -73490 -42478 -9897 -4923 -23430 -54120 -18538 -10836
15836 -10836 -11480 8766 40176 54256 50140 56733 68765 45346 17450 12996 -11079 -25840 -32039
15823 -32039 -18687 9385 10763 -10043 -29753 -36455 -6133 -12992 1756 16725 2969 -20599
15811 -20599 -40306 -29942 6110 1322 -19404 -33836 -37311 -45016 -35192 -8837 -8507 -8216 16581
15798 16581 49464 5026 -30079 -45021 -30392 -19624 -27857 -23013 -38779 -56704 -58320 -53201
15786e3201K3386K0585r48p106R508J0391k30j5074o467O549K6617Q751j1299
15773A1462o779l5631r146J3845l277J6802O382j0524L8453N80k5128j8890r857
15760c1708M397J1480J3430J90l1815k5536J8098L1449L9415j6736l4152l5020
15748e6508L6176J1034k4501l3319j6299K4070J5168j0945m522L2255J6721o519
15736a7189K2983K7101r174l6131j2863j3794j2298j1345j5895K6415J7980K0754
15724a3456K906k876J202j7228k9270J8564O30K4312R472r862k682j6607m916
15711c9811N705J3631L881l208L4734R7l251K7089j868J5038K2634o182l4633
15698C3856k0480o76m464L094l4894q089K815N64j324l133L567j9578J8578j1709
$$ plain form
15786 -53201 -29815 -9230 -10178 -17284 -7776 2615 2385 -12689 -19156 -12607 14010 22761 11462
15773 11462 4683 -30948 -40094 -26249 -29526 -12724 -6342 -16866 21587 22167 -2961 -21851 -31708
15760 -31708 -27311 -15831 -2401 -2211 -34026 -59562 -41464 -10015 29400 12664 -21488 -56508
15748 -56508 -20332 -9298 -33799 -67118 -83417 -59347 -44179 -55124 -59646 -27391 -10670 -17189
15736 -17189 5794 32895 23721 -12410 -25273 -39067 -51365 -62710 -78605 -52190 -34210 -13456
15724 -13456 -10550 -13426 -12224 -29452 -58722 -40158 -39528 -15216 -5744 -15606 -18288 -34895 -39811
15711 -39811 -34106 -20475 -16594 -19802 14932 15029 11778 38867 36999 52037 74671 68489 33856
15698 33856 13376 12700 8236 11330 -23564 -31653 -28838 -28274 -29598 -32731 -29164 -48742 -30164 -41873
15684d1873j0130J1226p965O202J2404K9728J8215r890n0823L599K1495L706J5878
15671A772K5831l326o350k9904k6030k0742M649J2822K2898o382n6J969L5989
15658A3140J0884k077K50P838q688L631K2278K648o091j9866j0569l3750l909
15645b4281J5509n275r251J5790l3303p905O282j804J3829K3666J3997p175j2109
15632a2030O848L5544j0372k8048m686K0605J0566r579k7217M143j19L414K4273
15619A3342J2977J8498j8540j2360n421J0577J1423M618k413j837Q313r926k6418
15606B833l8516o606K0566j0602R089N870o647M0847j0582P109K3875l5973m4945
15593d3682p459L2691J684j3046K81K0423j2721l363J9863R54K2877K7052K314
$$ plain form
15684 -41873 -52003 -40777 -48742 -42540 -30136 -408 17807 7917 -42906 -39307 -17812 -14106 1772
15671 1772 27603 24277 17927 -11977 -38007 -58749 -54100 -41278 -18380 -24762 -24818 -22849 13140
15658 13140 24024 21947 22197 30035 21347 24978 47256 49904 43813 23947 13378 -20372 -24281
15645 -24281 -8772 -14047 -23298 -7508 -40811 -48716 -42434 -44238 -30409 -6743 7254 79 -12030
15632 -12030 -5182 30362 19990 -8058 -12744 7861 18427 8848 -18369 -14226 -14345 -10931 13342
15619 13342 26319 44817 26277 13917 8496 19073 30496 35114 32701 30864 39177 29251 2833
15606 2833 -35683 -42289 -21723 -32325 -23236 -17366 -24013 16834 6252 13361 37236 1263 -43682
15593 -43682 -51141 -18450 -16766 -29812 -29531 -9108 -21829 -25192 -5329 -4375 18502 45554 47868
15580D7868j8526j1659j6441l4893j4417j8034J4671K4273P914j1819K6574J142
15568c347m1531k143L9993P181m1301k583R77N059m604k1666J4534K3934M7229
15555B1732O701j4839P039K6857J91L885j959k0218J306k233J1333L456m037j748
15541C7466Q220k7024l6973q142K1175M187j4747o095K288J2924K5452Q634k5360
15528B005K668L813L70j6395k631p111k7820L4339K3127k3394j5903P876J0041
15515i015K3583n016m2295m9464J7158M6067L4777j9829K543j4111K3347J6757
15503B4502j8613k2963Q337L7432P969m1564k9270k0180o2J9559N163J4704r424
15490b4410J5105l133L651J495k0121P928M2578O830l3824k1059j7981l790J2707
$$ plain form
15580 47868 29342 17683 1242 -33651 -48068 -66102 -51431 -27158 -19244 -31063 -4489 -3347
15568 -3347 -44878 -47021 -7028 153 -41148 -43731 -42754 -37695 -42299 -63965 -49431 -25497 21732
15555 21732 28433 13594 20633 47490 47681 51566 49607 29389 30695 28462 39795 43251 39214 37466
15541 37466 45686 18662 -18311 -26453 -5278 -1091 -15838 -21933 -19645 -6721 18731 27365 2005
15528 2005 4673 8486 8856 -7539 -10170 -17281 -45101 -10762 12365 -11029 -26932 -19056 -9015
15515 -9015 14568 9552 -32743 -82207 -65049 -18982 15795 -4034 -1491 -15602 7745 24502
15503 24502 5889 -17074 -8737 28695 36664 -4900 -34170 -54350 -54412 -34853 -29690 -14986 -24410
15490 -24410 -9305 -12438 -8787 -7292 -27413 -19485 23093 29923 -3901 -24960 -42941 -46731 -34024
15477c4024K384O581K5788J1342J2731r381N803J9148p06j3696j4195J7904R819
15464C9498j2k1743j4202J6480L3899j7508l1337n123j3459k4680j0209o855j950
15451e7201L8916K5854j6076j2751r945J1678K1923J095j8488o024k284J371Q644
15438a3288K0328K351l2558p714m41L4051O25j8014o320J2044L0225j878O260
15425B5671l0728J4907j5356j7372J2330N814J3016O44k6383j3446K4377J4813
15413H287o855j8163L754O919k2441J2490L1191Q180J0721N194k2889O045M356
15400B6789k1626m3886J283L9306K753j2273j3188J708P017n518K050q588J4320
15387i853K9337K802J5635k9368n5892j3079J7406J3124j4512M0991K5037j6764
$$ plain form
15477 -34024 -31640 -25059 729 12071 24802 15421 21224 40372 39666 25970 11775 29679 39498
15464 39498 39486 17743 3541 20021 53920 36412 5075 -48 -13507 -38187 -48396 -55251 -57201
15451 -57201 -18285 7569 -8507 -21258 -31203 -19525 2398 3493 -14995 -21019 -23303 -21932 -13288
15438 -13288 7040 9391 -23167 -30881 -31322 2729 3354 -14660 -20980 -8936 21289 19411 25671
15425 25671 -5057 9850 -5506 -22878 -10548 -4734 8282 8926 -17457 -30903 -6526 8287
15413 8287 1432 -16731 -12977 -6058 -28499 -16009 15182 23362 34083 39277 16388 22433 26789
15400 26789 5163 -38723 -37440 1866 4619 -7654 -20842 -19134 -12117 -17635 -15585 -24173 -9853
15387 -9853 19484 22286 37921 8553 -47339 -60418 -43012 -29888 -44400 -3409 21628 4864
15375D864l4900l1775M558J8565P925K1766L9708j4221k6551l3J0669K2730k064
15362B1241m5116J4194K8187n72j0261j2450L2531J755p882m399J4126m382k0431
15349F541n8077q104J2239K6143K9407J2521k3956o714k486o498p506l0375j2468
15336f9333M4509M7233J3633m1595o084J669o2k820j4642k4901j1320J2557K0727
15323c0429M0344J8616N726K3728j3677l0943j2279n532K2248K4747J0811k6195
15311B7165m192j1437J1707l257j1122j5927r808k3432K4162M6653m739q893j7010
15298a30M879p696J8547L9237k1758j5686j0664l076M368J2046O799m815J0361
15285C2412l0321j3535j4619J9860K5495j363p872k2797j8778J1959J7244J4320
$$ plain form
15375 4864 -30036 -61811 -57253 -38688 -30763 -8997 30711 16490 -10061 -10094 575 23305 21241
15362 21241 -23875 -9681 18506 17934 7673 -4777 27754 29509 21627 17228 31354 26972 6541
15349 6541 -51536 -59640 -47401 -21258 8149 20670 -3286 -10000 -12486 -18984 -26490 -56865 -69333
15336 -69333 -24824 22409 36042 -5553 -11637 -9968 -10030 -12850 -27492 -52393 -63713 -51156 -30429
15323 -30429 9915 28531 34257 57985 44308 13365 1086 -4446 17802 42549 53360 27165
15311 27165 22973 11536 23243 19986 8864 -7063 -16871 -40303 -16141 30512 25773 16880 -130
15298 -130 4749 -2947 15600 54837 33079 17393 6729 3653 8021 20067 26866 22051 32412
15285 32412 2091 -11444 -26063 -6203 19292 17929 10057 -12740 -31518 -19559 -2315 12005
15273A2005j9814j5097r581m0760L889K6773M2626J3070K346P205j8784j8920
15261a5042j9955q161p844K3884J1578n541O45J0873K5164J5566m508j048K4177
15248D9788q2l2850l0924m7991n3123J3789J0795M3956K3232Q044J1525J671l576
15235e746L245O359M894j1743l6864l990K5847j1573j8740n090J7009O561K180
15222b7651j66L2423J8449j9059j392J9686L0145o606m2378n150L332J4747J0225
15209B6605k1468k3946q302J665k150r640k267K626N367q31P543J6711M772R906
15195F591N978J4181n662l2752j6648K5932K434N926K1309K728j3875J5415O702
15182C8259l0957o0129J1132L0196M4322L1798K9657j2028l6360k8370j4357Q776
$$ plain form
15273 12005 -7809 -22906 -32487 -73247 -69358 -42585 41 13111 15457 22662 3878 -15042
15261 -15042 -34997 -43158 -51002 -27118 -15540 -21081 -20436 -9563 15601 31167 26659 25611 49788
15248 49788 49706 16856 -14068 -62059 -115182 -101393 -90598 -46642 -23410 -15366 -3841 -2170 -5746
15235 -5746 -2501 3858 8752 -2991 -39855 -43845 -17998 -29571 -48311 -53401 -36392 -29831 -27651
15222 -27651 -27817 4606 23055 3996 2604 22290 52435 45829 3451 -1699 1633 16380 26605
15209 26605 5137 -18809 -27111 -25446 -27596 -37236 -39503 -36877 -31510 -32341 -24798 -8087 -3315 6591
15195 6591 12569 26750 21088 -11664 -28312 -2380 54 5980 27289 30017 16142 31557 38259
15182 38259 7302 -52827 -41695 -11499 32823 64621 94278 82250 45890 17520 3163 11939
15170A1939j1185N9J0011j144M884k410R862o704k5546O284N693p642L856j3270
15156a5313j5799M2780M576n06p131K7614L1758J4987J043j8440o2657m4861R695
15143c2254J4326J7684n83N928j7556j0690O566J4960Q202J411N762K8907k3743
15130A8920J8529J2464l0286L0330J1665k9146k4662J935N582J604r939j034O701
15117A2663p866q962J2606J6341J4485r50k1402j2785J754J9345j4210K967j4903
15104i17j8994m0735N431J0596J3499J9583j0445J1958j1488o027M4256Q819m466
15091B1070l969k8579K7419K9363j6495m2334o326Q849L5237J9714j1737k9993
15079B219M967K0548j1573J5508K3058J073j023q829j2065O306P312J0983j0542
$$ plain form
15170 11939 754 813 10824 9680 14564 12154 22016 15312 -10234 -3950 1743 -5899 -2043 -15313
15156 -15313 -31112 11668 16244 15738 8607 36221 67979 82966 84009 65569 2912 -41949 -32254
15143 -32254 -17928 -244 -827 5101 -12455 -23145 -16579 -1619 6583 7994 13756 42663 18920
15130 18920 37449 49913 19627 49957 61622 32476 7814 9749 15331 16935 6996 5962 12663
15117 12663 4797 -4165 8441 24782 39267 38317 16915 4130 5884 25229 11019 13986 -917
15104 -917 -19911 -60646 -55215 -44619 -31120 -11537 -21982 -10024 -21512 -27539 16717 25536 21070
15091 21070 17101 -11478 15941 45304 28809 -13525 -19851 -11002 24235 43949 32212 2219
15079 2219 7186 27734 16161 31669 54727 55800 54777 45948 33883 40189 47501 58484 47942
15066D7942n2530M835L510j0363j6809q49J0262j355p77J1075L436j3362Q148
15053f837l209k0120L618l183K8454M405q158j3819M992L2502j1066r800J8780
15040A6559K8272k1721n955M576J4910n999k3242k1114j1431J0678J3818K7932
15028B7283O998m2551o850L9576o462l5359j5898L0696j6010l0930Q955J9721
15016b0831J6990q182J0277p378j0574L436L5931l01l0769p278L8793J5272K8980
15003F4366P7056O1351J03535J62232O7117j02672j85106j29567p3731j7761J7221
14992D4041M224r651M468o843j0723j4606l645O071k6050k1503J3523P631K6334
14979A3271p82K0867O708l6490j6219j3826J0649j6412j9393J9620J3814M011
$$ plain form
15066 47942 -4588 247 3757 -6606 -23415 -24264 -14002 -15357 -16134 -5059 -1623 -14985 -6837
15053 -6837 -10046 -30166 -26548 -29731 -1277 3128 -5030 -18849 -13857 18645 7579 -2221 16559
15040 16559 44831 23110 17155 21731 36641 30642 7400 -13714 -25145 -14467 -649 27283
15028 27283 34281 -8270 -15120 24456 17994 -17365 -33263 -2567 -18577 -49507 -40552 -20831
15016 -20831 -3841 -12023 -1746 -9124 -19698 -16262 19669 19368 -11401 -18679 20114 35386 64366
15003 64366 141422 202773 306308 468540 535657 432985 247879 118312 44581 26820 44041
14992 44041 48265 38614 43082 36239 25516 10910 7265 13336 -12714 -34217 -20694 -13063 13271
14979 13271 12489 33356 40064 3574 -12645 -26471 -15822 -32234 -51627 -32007 -18193 -14182
14967a4182k2224K746L2411m145Q161K561j4846l2888Q633K7473k020p212J0678
14954d854N400R970j1684o616K3448L1250k0855j3666K096K5897j2732j1465j6396
14941b07l573J5772j4233j7548k3280m277O647K5328K2695k3231j3098N5884J3632
14928D0511l351j095k8230L997j3080k6849m183K4437J7046M39j2498L6695r115
14915B4724j5938K2032L106j073m483j2827q528J415n535J0604p641m6633k833
14902d3610L8709r435O378R586N297N811j2963J9971K298j2893k5676j5698K0567
14889a1658L3881j5914L009K9779P790q523l9679j7770J1054j1290k1417L2918
14877g820M6104J2642k5091J1169l0534o877J7021K4281J1090j9589n2677k9783
$$ plain form
14967 -14182 -36406 -33660 -1249 -5394 2767 5328 -9518 -42406 -33773 -6300 -8320 -15532 -4854
14954 -4854 546 10516 -1168 -7784 15664 46914 26059 12393 14489 40386 27654 16189 -207
14941 -207 -3780 11992 -2241 -19789 -43069 -47346 -40699 -15371 7324 -15907 -29005 26879 40511
14928 40511 37160 36065 7835 11832 -1248 -28097 -32280 -7843 9203 9642 -2856 33839 24724
14915 24724 8786 30818 33924 32851 28368 15541 7013 8428 2893 13497 5856 -40777 -43610
14902 -43610 -4901 -14336 -7958 1628 6925 12736 -227 19744 22042 9149 -16527 -32225 -11658
14889 -11658 22223 6309 9318 39097 46887 38364 -1315 -19085 -8031 -19321 -40738 -7820
14877 -7820 38284 50926 25835 37004 6470 -407 16614 40895 51985 32396 -20281 -50064
14865e0064L5601k314L457L1063M749m186k1147L737N822k2381L935L1727O473
14852B6472j8583J090Q898j0355p720N228J7221K102j935j8751l638j1628Q769
14839b830M0223l449n797K481j3524J0860j3290j2761k3701K0360l8150l0196
14827f9774j2541J1549L1763J4256o473L916l743K9407K271m6851p011q807M0263
14814b1775J5496o377M580k4959r723K5318L8240J4668n3714o124L7794J3151
14802B6575n560j9209k0352Q089K2627o551j5533l5633o992J8440K8858L0054
14790B4813l694L521k1535l476M081l5084J0329L1379l363J0629k240L097r440
14777I017P456K5450J2655q048k2777P577j0193j7326K1370o646j3760j4401j5378
$$ plain form
14865 -50064 -14463 -16777 -13320 17743 22492 18306 -2841 896 6718 -15663 -11728 19999 26472
14852 26472 7889 8979 17877 7522 -198 5030 22251 24353 22418 3667 29 -11599 -2830
14839 -2830 37393 33944 28147 30628 17104 27964 14674 1913 -21788 -1428 -39578 -69774
14827 -69774 -82315 -70766 -39003 -24747 -31220 -27304 -31047 -1640 631 -46220 -53231 -62038 -21775
14814 -21775 -6279 -12656 -8076 -33035 -42758 -17440 20800 35468 -18246 -24370 13424 26575
14802 26575 21015 1806 -18546 -10457 12170 5619 -9914 -45547 -52539 -34099 -5241 24813
14790 24813 21119 24640 3105 -371 3710 -31374 -21045 10334 6971 17600 15360 18457 9017
14777 9017 16473 41923 54578 46530 23753 31330 21137 3811 25181 18535 4775 -9626 -25004
14764b5004j3518J6231J3240k641K726J2246J7091R635o667K0991l0689K668J2504
14751B8813j7490k606K68L7940R304l2221n085j7655j143J6305L135n105j1914
14738B546J8275o390p206j165l8981j3660L0448N163k9108K2380J4875O374N734
14725I285k7098p340M4398j228J3363n082p932J752k2688J568K2403J151j0890
14712A1662j8315M757N442K2016q030j8416L0367J1431k0284k3043l6818J4930
14700b4301P626J3309J3421K139k22j6476j0406j043K2728L2390j336J8789L4688
14687I1306j4019l8905P405m310k1067J1554N023J0036r802J924r104j5524j1236
14674C281j348k2536o785L0058J0830m2808l0876M491q72K9012J9882K9830k8628
$$ plain form
14764 -25004 -38522 -22291 -9051 -11692 -8966 3280 20371 30006 23339 44330 13641 16309 28813
14751 28813 11323 8717 8985 46925 56229 24008 18923 1268 125 16430 19565 14460 2546
14738 2546 20821 14431 7225 6060 -32921 -46581 -16133 -10970 -40078 -17698 -2823 3551 9285
14725 9285 -17813 -25153 19245 18017 31380 26298 18366 20118 -2570 -1002 21401 22552 11662
14712 11662 -6653 -1896 3546 25562 17532 -884 29483 40914 20630 -2413 -39231 -24301
14700 -24301 -16675 -3366 10055 12194 11972 -4504 -14910 -15953 6775 39165 37829 56618 91306
14687 91306 77287 38382 45787 41477 20410 31964 36987 47023 37221 39145 30041 14517 3281
14674 3281 1933 -20603 -27388 2670 13500 -29308 -60184 -55693 -56565 -27553 -7671 22159 -6469
14661f469l3975K0349K7439K0069L4477m1677l8756l523o520R828K6547J6473
14649B4262P93K758M3437K969q1155l7360R561J8424J5198K402J3479J9259l0661
14636C366j6415k5472j6767M2267O707m193p669p080K6731K8511p449j8301p276
14623c040j0999k1707j3613K8284L1237L0922J7218m3024m4216l625K8400n58
14611d721j20j7725k4561j6967k1359J0934K2784m363k435q896K5850L1232K3899
14598A3552k1614m563J4500j4967o18L857k594J3754J5843o862L003O460l218
14585A6533j7199m26O608j3502k2928O264J0745L1889K1648j3912j7098j5564
14573f942j2604K4178j8242m3000K0593J0632M899J9282p964q222k850Q305Q242
$$ plain form
14661 -6469 -40444 -20095 7344 27413 61890 20213 -18543 -22066 -28586 -18758 7789 24262
14649 24262 25055 27813 71250 74219 -6936 -44296 -34735 -16311 -1113 1289 14768 34027 3366
14636 3366 -13049 -38521 -55288 -13021 -6314 -10507 -18176 -25256 1475 29986 22537 4236 -3040
14623 -3040 -14039 -35746 -49359 -21075 10162 41084 58302 15278 -28938 -32563 -4163 -4721
14611 -4721 -4841 -22566 -47127 -64094 -85453 -74519 -51735 -56098 -58533 -67429 -41579 -10347 13552
14598 13552 -8062 -12625 1875 -13092 -13710 -9853 -12447 1307 17150 10288 13291 19751 16533
14585 16533 -666 -1092 5516 -7986 -30914 -24650 -13905 17984 39632 25720 8622 -6942
14573 -6942 -19546 4632 -13610 -56610 -36017 -25385 -20486 -1204 -9168 -17390 -20240 -11935 -3693
14560c693l939J714j6003M156n090j912J0635K8121J6628k1447l5117k730k134
14547c0811K5968J0412J3786P451j3634j2813J8483J1749J9169k2528k4182n592
14535b542j2126O293J5071n096m426j8391P311K9034l0535j6042K6164J4976k6699
14522a7008k0290k678J4988J5517o452j9214L123K6834j0151N537k1353P138L3142
14509I133J4654k0237j0181k0842k5121K7459K0053j4126j5144K26L5035j9501
14497a8592k7714P889j4379K8703M2726p076j2295j9971r770k6105L764L7335
14485a5485Q0J0473L1627N355j1328j2177j159q151o296K7688K6075k1401o858
14472A8443m576L509k3190J5174o299m28l6752j4086K1094K2543J4451l4756k3176
$$ plain form
14560 -3693 -7632 -5918 -21921 -17765 -22855 -24767 -14132 13989 30617 9170 -25947 -28677 -30811
14547 -30811 -4843 5569 19355 26806 13172 359 18842 30591 49760 27232 3050 -2542
14535 -2542 -14668 -8375 6696 1600 -2826 -21217 -13906 15128 -15407 -31449 -5285 9691 -17008
14522 -17008 -37298 -39976 -24988 -9471 -15923 -35137 -32014 -5180 -15331 -9794 -31147 -24009 9133
14509 9133 23787 3550 -6631 -27473 -52594 -25135 -5082 -19208 -34352 -34126 909 -18592
14497 -18592 -46306 -38417 -52796 -24093 18633 11557 -738 -20709 -30479 -56584 -52820 -15485
14485 -15485 -15405 -4932 26695 32050 20722 8545 7386 -765 -7061 20627 46702 25301 18443
14472 18443 13867 17376 -5814 9360 3061 2633 -34119 -48205 -27111 -4568 9883 -24873 -48049
14459d8049K2924J058P673j621K3095J923k3130R21r433O04j2542j6149L463q650
14445e7913K0928K4700l17J0225K9059m180l7776J2686L294o561j0416M237k2195
14432c4229j1300j6153K707R746j64J9379N310r334J4097J5314j8016Q445M101
14419a0097L329q93k3196p421R73K8103K8462K1575L984R613j0903k1252j2509
14406I768J368k0701l908j8601p23K1334Q319j015l122r751N715K2946k3486Q467
14392c390O526O648K8649J348k6867m7916k2557K9626J447k181l6241k2474J1125
14379g6257K0528J1275K5898p121r276J1540k921K7887P401j0597J1721P766j5292
14366B552j3785j3592k328J3679N065j2991J4111J5842j5094n808R708N918K6065
$$ plain form
14459 -48049 -25125 -24067 -16394 -18015 5080 7003 -16127 -15206 -24639 -24035 -36577 -52726 -49263 -57913
14445 -57913 -36985 -12285 -12602 -2377 26682 22502 -15274 -2588 706 -5855 -16271 -12034 -34229
14432 -34229 -45529 -61682 -58975 -49229 -49393 -30014 -24704 -34038 -19941 -4627 -22643 -14198 -10097
14419 -10097 -6768 -7661 -30857 -38278 -37305 -9202 19260 40835 44819 54432 43529 22277 9768
14406 9768 11136 -9565 -13473 -32074 -32797 -11463 -3144 -4159 -7281 -17032 -11317 11629 -11857 -3390
14392 -3390 3136 9784 38433 39781 12914 -35002 -57559 -27933 -26486 -28667 -64908 -87382 -76257
14379 -76257 -55729 -44454 -18556 -25677 -34953 -23413 -26334 1553 8954 -1643 10078 17844 2552
14366 2552 -11233 -24825 -27153 -13474 -8409 -21400 -7289 8553 -6541 -12349 -2641 3277 29342
14353B9342R298O69j7122p343R297j6373o324r439Q389P723m3446j3725J3662
14340c5392K5482J9055n664J5131q337j6692j1680L729K0429K825J6198o978R288
14327B7394r544j8843j8973P648j3073j5726m5228J317K7631K9046J2094n199
14315b1456j1345P790L2968j7002o40K4236j104l5815m356K4635J8066K5839J3546
14302E5362j5754J0074l2869j7615Q648M764j0724p199J162l654K3671l978r765
14289B123p910J2156Q255k1331l6414j3459k009L6198j1810q488J3657m011K328
14276c0715J4476K9624J6104j5951m112L5569o611k7066J7372j8287k6373k2604
14264c8574k4725J4258M4286J9028K5836j2169j5898N56K7671R953N169j6443
$$ plain form
14353 29342 38640 39309 22187 14844 24141 7768 1444 -7995 394 8117 -35329 -49054 -35392
14340 -35392 -9910 9145 3481 18612 10275 -6417 -18097 -14368 6061 8886 25084 18106 27394
14327 27394 17850 -993 -19966 -12318 -25391 -41117 -86345 -85028 -57397 -28351 -16257 -21456
14315 -21456 -32801 -25011 7957 -9045 -9685 14551 13447 -22368 -26724 -2089 15977 41816 55362
14302 55362 39608 49682 16813 -802 7846 12610 1886 -5313 -4151 -7805 15866 11888 2123
14289 2123 -5787 6369 14624 -6707 -43121 -56580 -58589 -22391 -34201 -42689 -29032 -33043 -30715
14276 -30715 -16239 13385 29489 13538 9426 44995 38384 11318 28690 10403 -15970 -38574
14264 -38574 -63299 -49041 -4755 14273 40109 27940 12042 12598 40269 50222 55391 38948
14252C8948k1482J1187k7080l2016m131K8603J5649k1493j1335m718N921K5452
14240C505j5483j2845J4944K0382M4182r889o542J4296l3762r024n193K938J2346
14227A9855M0002k530m3176j8964J3775j7714j7720r85L8616n469q662L3258l341
14214B6945k8744J6555J0326k0120J878M2063J5090l5529k6655M653q549J4803
14202A2716j3064L338j4487m7301N126K7657j3769q727J1978N982M3836J8142
14190C1427l083j6180r517J7327p718o403P733J1087j6012K1043K3558j3638k3686
14177A5938k9497l001M434J5024j3865k5223L9351R851Q54J9306J2351N329J2761
14164F3613J4286k2017j0674m4084o760R488j4733l2123M39K4645K8581Q008k5238
$$ plain form
14252 38948 17466 28653 1573 -30443 -34574 -5971 9678 -11815 -23150 -27868 -21947 3505
14240 3505 -11978 -24823 -9879 10503 54685 44796 38254 52550 18788 9764 4571 7509 19855
14227 19855 59857 57327 14151 -4813 8962 -8752 -26472 -27457 11159 5690 -2972 30286 26945
14214 26945 -1799 14756 25082 4962 6840 48903 63993 28464 1809 6462 -2087 12716
14202 12716 -348 2990 -11497 -58798 -53672 -26015 -39784 -48511 -36533 -30551 13285 31427
14190 31427 28344 12164 2647 19974 12256 5853 13586 24673 8661 29704 53262 39624 15938
14177 15938 -13559 -16560 -12126 2898 -10967 -36190 3161 13012 13866 33172 45523 50852 63613
14164 63613 77899 55882 45208 1124 -5636 3852 -10881 -43004 -42565 -17920 10661 18669 -6569
14151f569j7895L780N344M2575j7066j3691J6792m506j1959j7583l296k5096M464
14138d4706N91L5333M4331j203m3173q816N679n840O738o566l0892p101L4758
14125b0867J8644j7808l950L0547k5042j1260Q698K3902K1535k5217m106K4293
14113A9369P540j8085j4532m076N021J3129L5696Q477o038j0449m1919j946k46
14100h059k3187M900K9847J0225J528k5839j5328j616J3682j4780q655k0654m111
14087f2047M8137K7593L4341l7396k3012J6975j479p114K3529j870k9097j4149
14075b5589R193J3148m19J1689k8961P00J2713j3242J5193O7O754j6586m695J7474
14061b561L95J2774j1546m971J576L136M695k1113k820k8718k7370J0366K5984
$$ plain form
14151 -6569 -24464 -20684 -15340 27235 10169 -3522 13270 8764 -3195 -20778 -24074 -49170 -44706
14138 -44706 -44115 -8782 35549 34346 -8827 -17643 -11964 -17804 -11066 -17632 -48524 -55625 -20867
14125 -20867 -2223 -20031 -23981 6566 -18476 -29736 -21038 2864 24399 -818 -4924 19369
14113 19369 26909 8824 -5708 -9784 -4763 8366 44062 52539 46501 36052 -5867 -7813 -8059
14100 -8059 -31246 -26346 3501 13726 15254 -10585 -25913 -27529 -13847 -28627 -37282 -57936 -62047
14087 -62047 -13910 13683 48024 10628 -12384 4591 3112 -4002 19527 17657 -11440 -25589
14075 -25589 -16396 -3248 -3667 8022 -20939 -20239 -7526 -20768 -5575 -5508 1246 -15340 -20035 -2561
14061 -2561 -2166 10608 -938 -5909 -4333 -1197 3498 -17615 -20435 -49153 -76523 -66157 -40173
14048d0173o062L6668L9099l9843k964P487O354j1471J3543L7639J7505l0014
14036B7768R92j765r290k397J0952m701R300j9697o562K685j9894p179J3673M710
14022a405l6148N220J7139Q42J259j5387r849J512L1045R731j2477Q88K4420J6575
14008C3365m919J4729J8072j4965R522j0110o880j5599K5802Q061l6423j4165
13996F490K740M771j4383j7348O454J7153O718P966J7369l0450M124M091l7341
13983b1646K800K1165J2499K4053K1251R44j3090j1136j9677k923l7044J3934
13971h870K0881j8958k5390N549l620o147M244Q095l31m621O495j6376J317Q037
13957b9695P860J068k3025P530K3417M095J4658R980k4683j4123L31K5202J5670
$$ plain form
14048 -40173 -46235 -9567 29532 -10311 -13275 -5788 566 -10905 2638 40277 57782 27768
14036 27768 28760 26995 17705 15308 26260 21559 30859 11162 4600 7285 -12609 -19788 -6115 -1405
14022 -1405 -37553 -32333 -15194 -14352 -13093 -28480 -38329 -36817 -5772 3959 -8518 -7630 16790 33365
14008 33365 28446 43175 61247 46282 55804 45694 38814 23215 49017 57078 20655 6490
13996 6490 9230 14001 -382 -17730 -11276 5877 12595 20561 37930 7480 11604 15695 -21646
13983 -21646 -18846 2319 14818 38871 60122 61066 47976 36840 17163 14240 -22804 -8870
13971 -8870 12011 -6947 -32337 -26788 -30408 -36555 -32311 -24216 -24547 -29168 -22673 -39049 -37732 -29695
13957 -29695 -21835 -20767 -43792 -36262 -12845 -8750 5908 15888 -8795 -22918 -22587 2615 18285
13944A8285J208K2059j6593k1283M597M293o193l196k4811K3300j3959j2514k0689
13931d5496n938J9750J5493k905n641j5796O231J8559L4164J470l2461j5896O810
13918b1656J9024M453r428J4973J4101j7266k0550k0753J6239Q028j8110k4271
13906e5216j2030L4600J7595K041j2790m069K7270L2788k1932l1261J8518J5986
13894A1500Q404J2072o660m0422L541p91j6317P878N8666J5747m5866l0293l957
13881b6498o839L749K0974k4481l1758O985J2687L646j1304j5813J4927L5191
13869a8534K261R276J730K5277J4574k6448q343k5538j1253l992J5306K2258P763
13856D337l5058n052m992K3308l56p291J3135j6920M696j1259P314K7321J3589
$$ plain form
13944 18285 19493 41552 24959 3676 8273 12566 6373 3177 -21634 1666 -12293 -24807 -45496
13931 -45496 -51434 -31684 -16191 -19096 -24737 -40533 -34302 -15743 18421 19891 -12570 -28466 -21656
13918 -21656 -2632 1821 -7607 7366 21467 4201 -16349 -37102 -20863 -12835 -30945 -55216
13906 -55216 -67246 -32646 -15051 -13010 -25800 -29869 -2599 30189 8257 -23004 -4486 11500
13894 11500 19904 31976 25316 -15106 -11565 -12356 -28673 -20795 37871 53618 7752 -22541 -26498
13881 -26498 -33337 -29588 -8614 -33095 -64853 -57868 -45181 -41535 -52839 -68652 -53725 -18534
13869 -18534 -16273 -6997 -5267 20010 34584 8136 -207 -25745 -36998 -40990 -25684 -3426 4337
13856 4337 -30721 -35773 -40765 -17457 -17813 -25104 -11969 -28889 -24193 -35452 -28138 -817 12772
13843A2772k5204j5394K4071L8763K1580j6830l0945j1136K0913j7564j68n910
13831e052m288K210j6893l0930J1190M525j860K3113l605j1339P983J8619j7445
13818b3772j9021k366L0276K7507R91j1010k1439N621L274r620J9282K2122J5546
13805C7391j7041k8768J2865o215j3813O60J0758J8511R009j3094p091L1838K3939
13792E8949Q638j0340n00j4405n061O227L405k0834J5078j4397j3743k1373Q06
13779g550R656k8627l78J1799J0943j4634J5307K7309M640j4605J3272j6841l502
13766F789P53O972K4526J8158k7851k8731k1977j155K2377J0212m071r609k9730
13753c3337K3196k32j4985R244N692j0850J0448K319k4717l0275k4866J2911L2419
$$ plain form
13843 12772 -12432 -27826 -3755 35008 56588 39758 8813 -2323 18590 1026 858 -5052
13831 -5052 -9340 -7130 -24023 -54953 -43763 -39238 -41098 -17985 -21590 -32929 -24946 -6327 -23772
13818 -23772 -42793 -45159 -14883 12624 13615 2605 -18834 -13213 -9939 -19559 -277 21845 37391
13805 37391 20350 -8418 4447 -1768 -15581 -14921 -4163 14348 23357 10263 3172 35010 58949
13792 58949 67587 57247 56747 42342 37281 43508 46913 26079 41157 26760 13017 -8356 -7550
13779 -7550 2106 -26521 -26899 -15100 -4157 -18791 -3484 23825 28465 13860 27132 10291 6789
13766 6789 7542 14514 39040 57198 29347 616 -21361 -22516 -139 10073 6002 -3607 -33337
13753 -33337 -10141 -10373 -25358 -16114 -10422 -21272 -10824 -8505 -33222 -63497 -88363 -75452 -43033
13740d3033K7936J1424l884k3698n742k5234m047J1412n359k3366m887J4871J3401
13727f0206J9934J8294P972Q372k2488K4008j588j8957j9360q657K1229J4340
13715a7107J6168K385l707k3897O257k966j3241R138J7031L3405m34k205j7135
13702C692m009O719Q970k0124k6453M931O030P610m157Q132j854J6944j975j4158
13688i702L6208j4335o086k878k1205L152P222j4568j2970K0183L6694J820l0069
13675f534O197L679N766k5063O469J6855J8048j8314J3824M1667R397m3648k2550
13662E793l2077n030K599J6146K7572j8796l6338j6043K4824J6247l838k0034
13650c8975n78M0927J1832j3038J1731P345O466J2700k7116l3401m498M9655K1200
$$ plain form
13740 -43033 -15097 -3673 -7557 -31255 -36997 -62231 -66278 -54866 -60225 -83591 -88478 -73607 -60206
13727 -60206 -40272 -21978 -14006 -5634 -28122 -4114 -5702 -24659 -44019 -52676 -31447 -17107
13715 -17107 -939 1446 -2261 -26158 -19901 -22867 -36108 -26970 -9939 23466 23032 20827 3692
13702 3692 -317 6402 15372 -4752 -31205 -26274 -20244 -12634 -16791 -8659 -10513 6431 4456 -9702
13688 -9702 26506 12171 6085 3207 -17998 -14846 -7624 -22192 -35162 -14979 21715 23535 -6534
13675 -6534 -337 3342 9108 -15955 -9486 7369 25417 7103 20927 62594 71991 28343 5793
13662 5793 -26284 -31314 -28715 -12569 15003 -3793 -40131 -56174 -31350 -15103 -18941 -38975
13650 -38975 -39553 1374 13206 168 11899 19244 25710 38410 11294 -22107 -26605 23050 44250
13637D4250j6471J2575K8308j3967n3903k9547r452J6445K8472J6863K86j3223
13625A0636l3220j9332R787o301k0884l365J6195K1287J7698J3975j335L6853
13613D1994L505J4137J847m6054l3334J5835m4599L873P42j620J7668Q729R853
13600g424J635N444K1368j680j5967m80K6443K1011k2402k4784l7391M659K5634
13587c934n171k0419j8367N913L7699j69n60j2370j6318J5034R032k1673l774
13574c5077j4585m434J9066K3327k9871R043L3399n197k0425J3440p59K4085L220
13561A5232j1198k1982j3532J7386K1339J0777j2612P242l527K5549q628L727
13549B9773j7660Q106J9397K091o552J9332n602j3780j4190O265K5215j5652m3228
$$ plain form
13637 44250 27779 40354 68662 54695 792 -28755 -38207 -21762 6710 23573 23859 10636
13625 10636 -22584 -41916 -32129 -38430 -59314 -62679 -46484 -25197 -7499 6476 5141 41994
13613 41994 45499 59636 61483 15429 -17905 -2070 -46669 -42796 -42054 -43674 -26006 -17277 -7424
13600 -7424 -5789 -345 21023 19343 3376 2896 29339 50350 27948 3164 -34227 -29568 -3934
13587 -3934 -9105 -29524 -47891 -41978 -4279 -4448 -5008 -17378 -33696 -18662 -9630 -31303 -35077
13574 -35077 -49662 -54096 -35030 -11703 -41574 -32531 868 -4329 -24754 -11314 -12073 12012 15232
13561 15232 4034 -17948 -31480 -14094 7245 18022 5410 12652 9125 34674 26046 29773
13549 29773 12113 20219 39616 41707 35155 54487 48885 35105 20915 27180 52395 36743 -6485
13536f485j3465l638m499J1805J9717J1495j7770K9052J6788o871J392r80j7310
13523A9231J645J0090J4619p549k4007j114J487J1590k9445p595m922j1999J0115
13510a7854K8490j2957M7j2924o491J1851J0464j6616q728M243l662L4203L5067
13497D5133J1731l235J043k5205n718j0195j452l7352L781J1336K1344k0478l5911
13484d5178j4171m784L6048M149j910j5698L4791J8184J161M563m2086o432j2227
13471d3590M755J6927J8089j4226q664P774K1589K4870L178j7809R520q87j872
13458A9654j6630J1773L086m265j4970j1885P283m412N345L554j8049k859J3409
13445h966j7147r826J0227K6286J9476q177L254K7539k4488j8013J5660p562J9606
$$ plain form
13536 -6485 -19950 -23588 -28087 -16282 3435 14930 -2840 26212 43000 36129 37521 36541 19231
13523 19231 20876 30966 45585 38036 14029 12915 14402 25992 -3453 -11048 -15970 -27969 -17854
13510 -17854 10636 -2321 -2274 -15198 -21689 -9838 626 -15990 -24718 -20475 -24137 10066 45133
13497 45133 56864 53629 54672 29467 23749 13554 12102 -25250 -21469 -10133 11211 -9267 -45178
13484 -45178 -59349 -64133 -28085 -23936 -25846 -41544 -6753 11431 12592 17155 -24931 -31363 -43590
13471 -43590 -38835 -21908 -3819 -18045 -26709 -18935 2654 27524 30702 12893 22413 21526 19654
13458 19654 3024 14797 17883 13618 -1352 -13237 -5954 -10366 -5021 -1467 -19516 -22375 -8966
13445 -8966 -26113 -35939 -25712 574 20050 11873 15127 42666 18178 165 15825 8263 27869
13432B7869L9238j5651m7968k8892p301K2120J37K1621p263J8575j8572j6104
13420a2191o072o361J9899J420q129M561J5641k7957R081K1163J0363m401K5951
13407D2968J2484k3006j2254k7119r786l268j743L6902K6025R418K3201k7974
13395D5848k7473R626M5865j1786j3430l7945J5484J8994J192k8418k985J2630
13383B7602J1143n945j8042p637l8496J8166J7284q723M604J1399j7700j9682
13371b6027K3659M85L480j3825l0293J6677N148J2753L1898L8062p182m4794j0735
13358f94K4093k0767j3639p937R071j945r503Q447J0895p39J380J5351n491o757
13344A765R609Q17J073K2924L957o675k1697j9149L917L7558K5074j5269k4536
$$ plain form
13432 27869 67107 51456 3488 -25404 -32705 -10585 -10448 11173 3910 22485 3913 -12191
13420 -12191 -18263 -24624 -4725 -3305 -11434 -6873 8768 -19189 -10108 11055 21418 17017 42968
13407 42968 55452 32446 20192 -6927 -16713 -19981 -21724 15178 41203 50621 73822 45848
13395 45848 18375 28001 73866 62080 48650 10705 26189 45183 46375 17957 14972 27602
13383 27602 38745 32800 14758 7121 -31375 -13209 4075 -4648 -44 11355 -6345 -26027
13371 -26027 -2368 -1883 1597 -12228 -42521 -25844 -20696 -7943 23955 62017 54835 10041 -694
13358 -694 23399 2632 -11007 -18944 -9873 -11818 -21321 -12874 -1979 -2718 -1338 14013 8522 1765
13344 1765 11374 12191 13264 36188 40145 33470 11773 -7376 -3459 34099 59173 43904 19368
13331A9368j1577m2420n4621K8199J3917K3933J5782R384l2822j5506J0964L9386
13319C987p175j0792L152r232L160Q715M6391R842p094k1175m6062j0614J8329
13306a8568K2406J5573j0098j9339K50Q208j8646R969J4881J0122n551P680k803
13293A4084j8448q105N226J4449j6620k207j1690J4495L3814l2864j9056o292
13281c3214J2356K5749k840j2411Q315L825P126l1093j5432K718M9521J2609k8329
13268a100j0565o853K5705J0603l1460k675K504L169J0490K9167K648j5773n3043
13255c7183J345K4155m590J010J5720r851K8640J0600j525k636l0197n964L741
13242f735k328q902J8529k618P543j7016J0297J3617j50o970j6910j0961O080
$$ plain form
13331 19368 7791 -34629 -89250 -61051 -47134 -23201 -7419 1965 -30857 -46363 -35399 3987
13319 3987 -3188 -13980 -10828 -20060 -16900 -8185 38206 48048 40954 19779 -26283 -36897 -18568
13306 -18568 3838 19411 9313 -10026 -9776 -1568 -20214 -10245 4636 14758 9207 16887 14084
13293 14084 -4364 -12469 -7243 7206 -9414 -11621 -23311 -8816 24998 -7866 -26922 -33214
13281 -33214 -20858 4891 2051 -10360 -2045 1780 8906 -22187 -37619 -34901 14620 27229 -1100
13268 -1100 -11665 -18518 7187 17790 -13670 -16345 -13841 -10672 -182 28985 31633 15860 -37183
13255 -37183 -35838 -11683 -16273 -15263 457 -9394 19246 29846 28321 25685 -4512 -10476 -6735
13242 -6735 -9063 -17965 564 -2054 5489 -11527 -1230 12387 12237 5267 -11643 -22604 -16524
13229a6524N563R282j9705m030k188J7070K0503j5994k8582Q856r713j1118n220
13216e1800J2502J3673N523k450k2200L631K5178L3490j0080k5535r942R021K0071
13203A082Q032K0043n9997o645M6390j5181M41j1914K225K6018N58L939J0203
13190B5194l14j4020N549j1975J3156o02m6985j9979J8599K0260J3597K1808K2052
13177D6340J7739j5139l1896j8186O051j0132l444l105o851J4007j7096J501L6581
13164A6370K1173r663l5451k7864K36p0K183J7177J9188R423r751j0078P887J8988
13150A9748K7932k0269j6845R183n379K468M405j9626k2350j4125J1990n828J5699
13137a2997J2721J9868L558j0351K098M910l781Q011L609J4177l673k9291j9115
$$ plain form
13229 -16524 -10961 -1679 -21384 -25414 -27602 -10532 9971 -6023 -34605 -25749 -35462 -46580 -51800
13216 -51800 -39298 -25625 -20102 -22552 -44752 -41121 -15943 17547 7467 -18068 -28010 -18989 1082
13203 1082 9114 29157 -30840 -37485 8905 -6276 -5835 -17749 -15524 10494 11052 14991 25194
13190 25194 24880 10860 16409 4434 17590 16988 -29997 -49976 -31377 -11117 2480 24288 46340
13177 46340 64079 48940 17044 -1142 4909 -5223 -8667 -11772 -18623 -4616 -21712 -20211 16370
13164 16370 37543 27880 -7571 -35435 -35199 -35269 -33086 -15909 3279 12702 2951 -7127 760 19748
13150 19748 47680 27411 10566 19749 14370 16838 21243 1617 -20733 -34858 -22868 -28696 -12997
13137 -12997 -276 19592 23150 12799 14897 19807 16026 24037 27646 41823 38150 8859 -10256
13124a0256k4537P423o972K4237N0087L7292l1961n008R245k9073k6201K0675
13112A4951O626p669j3504k3275M267J4745J7152l1579j4832K8688L5117j2524
13100A8163q922J1919Q01M811P060j3340K7381R13Q48l8086l4760L014J5793k7012
13086c1417L4558J1950r875k8434r889r583k429K8330L1109J2466K5839l6470
13074A6155j7177J1760J5597M663J1263j6057p206l460k1553j3588J6928l3574
13062c6249K1049O3495r954n7440j8116J1996M0418K6175n829J2172r196p0929
13050c2408k2259J8511M4328L061n909K726J1710p734n214k8832p213K4519K6543
13037B1829j8687k8553J943Q83m78j7993k2845K6095O2586J7389j3740K3323j2213
$$ plain form
13124 -10256 -34793 -27370 -34342 -10105 39982 77274 45313 40305 49550 20477 -5724 14951
13112 14951 21577 13908 404 -22871 -18604 -3859 13293 -18286 -33118 -4430 30687 18163
13100 18163 9241 21160 21961 26772 33832 20492 47873 48786 49634 11548 -23212 -20198 -4405 -31417
13086 -31417 3141 15091 5216 -23218 -33107 -42690 -45119 -16789 14320 26786 52625 16155
13074 16155 -1022 10738 26335 30998 42261 26204 18998 15538 -6015 -19603 -2675 -36249
13062 -36249 -15200 48295 38341 -19099 -37215 -25219 15199 41374 35545 47717 38521 -32408
13050 -32408 -54667 -36156 8172 11233 5324 8050 19760 12026 6812 -22020 -29233 -4714 21829
13037 21829 3142 -25411 -23468 -22585 -23063 -41056 -63901 -37806 24780 42169 28429 51752 39539
13024C9539j4615l5204j252O839j7136j2259R807K2087J0047j2841L503L333j4145
13011a2297R311Q314m581j8634K75k1802k6663K5114P5896K5382J7876l539l6791
12998C7861k7916l804J1967J4018M949j7458k8120k1553n002J2680O4R253J2603
12985d58L1648P645j4533o500j7661J9046J5018k768K068m0540O0J8106k1657
12972a0526j4066J116m864J6287L0797j370j4956j1258n6423o26J523j0762N3078
12959b2050M3906O788q478k6751r548K3697n952p418K7647M8021k8913l9542m8893
12946d7486k6516L46K0933M269K966K1352K3389K9902J0762n877j2290k5509J3898
12933A0139K3391j0372k7150j2389O513K9364j6769j5951j7625j0358J6907k326
$$ plain form
13024 39539 24924 -10280 -11532 -4693 -21829 -34088 -24281 -2194 7853 -4988 -1485 1848 -12297
13011 -12297 -2986 5328 747 -17887 -17612 -39414 -66077 -40963 34933 60315 78191 74652 37861
12998 37861 9945 6141 18108 32126 37075 19617 -8503 -30056 -35058 -22378 -22314 -13061 -458
12985 -458 31190 38835 24302 17802 141 19187 34205 31437 33505 -7035 -6975 11131 -10526
12972 -10526 -24592 -23476 -28340 -12053 18744 17374 2418 -8840 -65263 -65889 -64366 -75128 -22050
12959 -22050 21856 28644 20166 -6585 -16133 7564 1612 -5806 21841 69862 40949 1407 -47486
12946 -47486 -74002 -73656 -52723 -48454 -45488 -24136 -747 29155 39917 34040 21750 -3759 10139
12933 10139 33530 23158 -3992 -16381 -9868 19496 2727 -13224 -30849 -41207 -24300 -26626
12921b6626k548Q868J5659r243R122K1727J163R06q750J0069R43j1407p589r426
12907g132q188r698Q063Q680j274j6892j1958L252R329K4132Q322j3640J1383
12894D379j3485j1410J5543j1058R655K3118j0093R221j7116j7180j722K7399
12882G251L5788k1884j6814k756m080J9436J9564R900P254k7495k4122j9396j9328
12869c6682J3316j0148j9767j7505K4358P073m86K6338L6687l198l2891j5772
12857b8677l196J0913L1586j5685k0993k6260l056M0584L3963J1004k54k7247
12845B682M445N686N085L201K243Q766J5458k042l8268l8595k8563J7819n004
12832d7087j4109n237L854J7625K1365j5602k4387J2922J0906j347K1619O191
$$ plain form
12921 -26626 -29174 -20306 -4647 -13890 -4768 16959 18122 19028 10278 20347 21290 9883 2294 -7132
12907 -7132 -15320 -25018 -16955 -8275 -9549 -26441 -38399 -35147 -25818 -1686 6636 -7004 4379
12894 4379 -9106 -20516 -4973 -16031 -6376 16742 6649 15870 -1246 -18426 -20148 7251
12882 7251 43039 21155 4341 1585 -2495 16941 36505 46405 53659 26164 2042 -17354 -36682
12869 -36682 -23366 -33514 -53281 -70786 -46428 -39355 -39841 -13503 23184 19986 -12905 -28677
12857 -28677 -31873 -20960 10626 -5059 -26052 -52312 -55368 -14784 19179 30183 29929 2682
12845 2682 7127 12813 17898 21099 23342 32108 47566 45524 7256 -31339 -59902 -42083 -47087
12832 -47087 -61196 -66433 -62579 -44954 -23589 -39191 -63578 -50656 -39750 -41097 -19478 -13287
12820a3287J355R530O450k3333j1123k5683Q474J7351K8485O718J081o122Q294
12807H190q951l240M097K1431R128j682l794r598j3927P905O422N442n403o107
12793I913K390k3155P93J5652J2952J7490j5938n2482j8564L1206O0162K6052
12781F6471p750l7065j9832Q123j104l937L661j2001J0962J5297j9048n968L6661
12768C4470L0990J6497k5787j2029j3780l9179k2272K4088K7941K769L2598j0398
12756D5908m0391j7040j2636k40j8992l075P776J7440J7761K8896J0535l140K1610
12743E4412M786k6294j4433K14m368m229j4256J398k5318R837j0999N939L4377
12730A1066j5362r919J0723Q118R691L662j9961k0897J7939J820j9709r017J22
$$ plain form
12820 -13287 -11932 -2402 4048 -19285 -30408 -56091 -47617 -30266 -1781 4937 6018 -104 8190
12807 8190 -761 -4001 96 21527 30655 28973 25179 15581 1654 9559 15981 21423 16020 9913
12793 9913 12303 -10852 -10059 5593 18545 36035 20097 -32385 -50949 -19743 40419 66471
12781 66471 58721 21656 1824 9947 8843 4906 8567 -3434 7528 22825 3777 -2191 34470
12768 34470 65460 81957 56170 44141 30361 -8818 -31090 -7002 20939 23708 56306 45908
12756 45908 5517 -11523 -24159 -24399 -43391 -46466 -38690 -21250 -3489 25407 35942 32802 54412
12743 54412 59198 32904 18471 18685 14317 10088 -4168 -2770 -28088 -18251 -29250 -23311 11066
12730 11066 -4296 -14215 -3492 4626 14317 17979 -1982 -22879 -4940 -3120 -22829 -31846 -31724
12717c1724l075j4742j1505Q098Q358l18K7530J4489k9180M227l88Q616J0219
12704i395k8009n938K8563M105j3222L488k0066K8188j6139j4189P879p780k2463
12691f4978Q7M258l313k0201M1328L2759j459J346J4906j7241K2107K549k4122
12678a1974l364L14N227K3320J7258l7131j0368K0708j4209q773J0883J4930J241
12665H062j1908R476K3014J0762J735O921j205j2525N644J7769q951M73k4477
12652B4790k854J8498O507j25N36k0597q78q04R22j2672j9335j9254j1073l805
12638d0144M0K900k6387O028J8222J4274J4646J836K3747o792O652l0748k6726
12625d2452o204P686R726L3394K0465j6652j5757J86j8562k4394J4786K2206J931
$$ plain form
12717 -31724 -34799 -49541 -61046 -52948 -44590 -44908 -17378 -2889 -32069 -27842 -28230 -19614 -9395
12704 -9395 -37404 -43342 -14779 -10674 -23896 -20408 -40474 -12286 -28425 -42614 -34735 -42515 -64978
12691 -64978 -64891 -60633 -63946 -84147 -42819 -10060 -11519 -10173 4733 -12508 9599 12148 -11974
12678 -11974 -15338 -15024 -9797 13523 30781 -6350 -16718 3990 -10219 -18992 -8109 6821 8062
12665 8062 -3846 5630 28644 39406 41141 48062 46857 34332 39976 57745 48794 49267 24790
12652 24790 21936 40434 46941 46816 47352 26755 25877 25073 25995 13323 -6012 -25266 -36339 -40144
12638 -40144 -40104 -37204 -63591 -57563 -39341 -25067 -10421 -8585 15162 8370 15022 -15726 -42452
12625 -42452 -48656 -40970 -31244 2150 22615 5963 -9794 -9608 -28170 -52564 -37778 -15572 -13641
12612a3641l0634J2805L385k7591O248P830L0298M4808J763l2294k1794k2469
12600d1286K3111L2091n364J6506K0773n441O281J5700r025k2664p286L1910q311
12587D6995p686m943L4690j7804k0492J7392J4065l4459j5899M545q320J4216
12575B2300M2955O070k9703o0951j1861K0911j6281j9454K3307L4853j6160J9626
12563A5612J4155j8115L023k073J2366P916J2829r62K786k0114j6657r46M054
12550A3874J3287J3111k6422j1044j9835K0264N273n36M287J31k0043O754j7698
12537a8597J3272j768P629J9195k4857l2469j6924k760M680J1791L8862P832M336
12524A0222k065k5419l807k4154Q286Q983l61j0250l329L2819Q637j0687L3685
$$ plain form
12612 -13641 -44275 -31470 -28085 -55676 -49428 -41598 -11300 33508 35271 2977 -18817 -41286
12600 -41286 -18175 13916 8552 25058 45831 40390 46671 62371 53346 30682 23396 55306 46995
12587 46995 39309 34366 69056 51252 30760 48152 62217 27758 11859 16404 8084 22300
12575 22300 65255 71325 41622 -19329 -31190 -10279 -26560 -46014 -22707 12146 -4014 15612
12563 15612 29767 11652 14675 12602 24968 32884 45713 44751 47537 27423 10766 9820 13874
12550 13874 27161 40272 13850 2806 -17029 3235 8508 7972 12259 12390 -7653 -899 -18597
12537 -18597 -5325 -7093 536 19731 -5126 -37595 -54519 -57279 -52599 -40808 -1946 5886 10222
12524 10222 8157 -17262 -21069 -45223 -36937 -27954 -28315 -38565 -41894 -9075 -438 -11125 22560
12511B2560k1760l1364J4765P656J9435Q395J0436n149O164J4903j6046q089l3478
12498a1572M024J64k0854r826j7751j0966m844N227J5268K9501J1966J8032N968
12485A4337j2520k8590l0113p257j3565L4073P998p472K9317m316k925L070L5829
12472A7866j086j4155L1693Q320l0483j0966J5166N4392r884m4889M191j0970
12460I195k2794k621q14K4002j696k2333j8593Q887L2498J3147j1344J747j4449
12447e168j7508P72j2279L2500K2667M073J7287j4280j8473j9929j6524o359K3319
12434i902K6875k5777j7254m481K9119K2751m1894k3215K155M4164J8924l7540
12422a6075m864L165K8518L150J22k6183m2955M0072L1934K2220Q311j7595j4359
$$ plain form
12511 22560 800 -30564 -15799 -8143 11292 19687 30123 24974 31138 46041 29995 21906 -11572
12498 -11572 -7548 -7384 -28238 -38064 -55815 -66781 -71625 -66398 -51130 -21629 -9663 8369 14337
12485 14337 1817 -26773 -56886 -64143 -77708 -43635 -35637 -43109 -13792 -18108 -21033 -17963 17866
12472 17866 16780 2625 34318 42638 12155 1189 16355 70747 60863 15974 20165 9195
12460 9195 -13599 -16220 -17034 6968 5272 -17061 -35654 -26767 5731 18878 7534 9281 -5168
12447 -5168 -22676 -21904 -34183 -1683 20984 25057 42344 28064 9591 -10338 -26862 -33221 -9902
12434 -9902 16973 -8804 -26058 -30539 -1420 21331 -20563 -43778 -41623 2541 21465 -16075
12422 -16075 -20939 -17774 10744 13894 14016 -12167 -55122 -15050 16884 39104 47415 29820 15461
12409A5461J3699j2642j6952k389m782L1729K5641k407k3008k096l272j695q515
12396H772l2651j7648j4959J9441M3167O390k8122J658J0522M4784k7850j8460
12384d956J0935l291J5907j448J2072J3326J4714j1327m5265m0079P548K3703
12372h161L1052K948J8975q784k6967K0087J4376K376J5651J252k6950k7081k3073
12359a4299k072j6117o690J2286J3144K0639k2351l2114N842j5177J9669K2259
12347a4981k4312j290P700N805M2073J2834l3171k8973j1643J3088J9597J1013
12335b260k0061q756J1471l715K7884j4306J3033L2312J0308k216l8789k2645
12323a7740r594J5498j7473J2591Q363j5356j2677K4562L1622k339l3249j0724
$$ plain form
12409 15461 29160 16518 -434 -2823 -7605 24124 49765 47358 24350 22254 18982 17287 8772
12396 8772 -23879 -41527 -56486 -37045 6122 12512 -15610 -13952 -3430 41354 13504 -4956
12384 -4956 5979 2688 18595 17147 29219 42545 57259 45932 667 -39412 -31864 -8161
12372 -8161 22891 25839 44814 36030 9063 29150 43526 45902 61553 62805 35855 8774 -14299
12359 -14299 -16371 -32488 -39178 -26892 -13748 6891 -15460 -47574 -41732 -56909 -37240 -14981
12347 -14981 -39293 -40583 -32883 -27078 14995 27829 -5342 -34315 -45958 -32870 -13273 -2260
12335 -2260 -22321 -31077 -19606 -23321 4563 -9743 3290 35602 45910 43694 4905 -17740
12323 -17740 -27334 -11836 -29309 -16718 -8355 -23711 -36388 -11826 19796 17457 -15792 -26516
12311b6516m243J8799J2839j2556l337q758J1262K3962J6962j978m758l8636m6455
12298f3413K3794L094J233r087k4743J8916L6212Q439k030j2139J5748m844Q430
12285c90J3806J9691J7591k150l2967l7254j9784L9569K9675l406l3398N410k417
12272f024J569j4836j6789J5013N708J5192K6034j1619k1627j2248J982J2962
12260d683J001n078m0236L221j5934K2684j0429Q598J6415J802M1490J5892k7589
12247G154J369M200J6210j531l2175j1524N220J9010J2890j4324q687K8924j7573
12234I163k734M5364Q000k8453l2441j1885m111K3118L0782j6859j2330n719L6617
12221C8512N399l5319L522J5472O399k942k1986Q415r184q330J4725J2458k3925
$$ plain form
12311 -26516 -30759 -11960 879 -11677 -15014 -23772 -12510 11452 28414 26436 21678 -16958 -63413
12298 -63413 -39619 -36525 -35292 -44379 -69122 -50206 -13994 -5555 -7585 -19724 -3976 -8820 -390
12285 -390 13416 33107 50698 48548 15581 -21673 -41457 -1888 27787 24381 -9017 -3607 -6024
12272 -6024 -4455 -19291 -36080 -21067 -15359 -167 25867 14248 -7379 -19627 -17645 -4683
12260 -4683 -3682 -8760 -48996 -45775 -61709 -39025 -49454 -40856 -24441 -22639 18851 34743 7154
12247 7154 8523 12723 28933 27402 -4773 -16297 -11077 7933 20823 6499 -2188 26736 9163
12234 9163 6429 51793 59793 31340 -1101 -12986 -17097 6021 36803 19944 7614 1895 38512
12221 38512 43911 8592 12114 27586 33985 31043 9057 17472 8288 -42 14683 27141 3216
12208C216k6698K0253J6320q612L4241O5606R512l9391l5933l0978j6808p934
12196a7206P470N483K0461p010k7860k9048j991J5096J0911j968K2970k3262j2228
12183c8182K610J9788Q123J9219M824j9077j3871L638j2035K8539L0183J2714
12171D6473k9547k9771l0079M17J5224R752k814J3480O645k4622L756L4125o882
12158F157J684L4492O092j7909j0740R570n551J5222j4465q273o516j7447P921
12145B37K4701k835j2560J7188k99l6413R505j311K7850J5742l4116o342M935
12132F282j7383L601j4055J5237N761N761k4313Q29k898J7741Q607J3135J1032
12119B9337L420j3725l7526j0711J5786m529K0880J3476J1532J6238r352j0203
$$ plain form
12208 3216 -23482 -3229 13091 4479 38720 104326 113838 74447 38514 7536 -9272 -17206
12196 -17206 -9736 -4253 16208 9198 -18662 -47710 -49701 -34605 -23694 -25662 -2692 -25954 -38182
12183 -38182 -35572 -15784 -7661 11558 16382 -2695 -16566 -12928 -24963 3576 33759 46473
12171 46473 16926 -12845 -42924 -42507 -27283 -17531 -20345 -6865 -220 -24842 -21086 13039 6157
12158 6157 7841 42333 48425 30516 19776 29346 23795 39017 24552 16279 9763 -7684 237
12145 237 24938 22103 9543 26731 26432 -9981 -476 -1787 26063 41805 7689 1347 6282
12132 6282 -11101 -7500 -21555 -6318 -557 5204 -19109 -18280 -21178 -3437 5170 18305 29337
12119 29337 32757 19032 -18494 -29205 -13419 -17948 2932 16408 27940 44178 34826 24623
12107B4623j4467j9337l169J5553l766L639R116k7055Q93L0729l7909K842K3211
12094D903k0989k6757j3975r755L2112K1335L0014K6543n002m0146k5093M0172
12082A3362O646j7581j9942Q243J9189N447P538J1898j2048m5377j5699K120L029
12069c3175L6210q17j0008j796k3201R867Q26l8328L655K2039J9766J0838K0299
12056A6175J992p679q924P98m208k1918j4021k7724J0589K4893J9439k40j4887
12043b5715j6113R022j425K741J143j086K2751N149l1343L8151M2617o440k1383
12030A8069k4685q542Q643K2964j2288L764J1050j8375k7966L7364J6203O788
12018C2989M902j3481l5877r11p807l0438K0639R26K671M374K2123j971k3333
$$ plain form
12107 24623 10156 -9181 -12350 3203 -563 3076 12192 -14863 -13970 16759 -21150 -18308 4903
12094 4903 -16086 -42843 -56818 -66573 -34461 -13126 16888 43431 38429 -1717 -26810 13362
12082 13362 20008 2427 -17515 -9272 9917 15364 22902 34800 22752 -22625 -38324 -36204 -33175
12069 -33175 3035 2218 -7790 -9586 -32787 -22920 -22094 -60422 -56767 -34728 -14962 -4124 16175
12056 16175 18167 10488 1564 2362 -1846 -23764 -37785 -65509 -54920 -30027 -10588 -10828 -25715
12043 -25715 -41828 -32806 -34231 -31490 -30347 -31433 -8682 -3533 -34876 3275 45892 39452 18069
12030 18069 -6616 -15158 -6515 16449 4161 7925 18975 600 -27366 9998 26201 32989
12018 32989 37891 24410 -11467 -12378 -20185 -50623 -29984 -29058 -26387 -22013 110 -1861 -25194
12005b5194J578L3149K2820K542j869k9812k5527k729K3828J0600J5088L6292
11993F0766J4204l482j6608j6157J1039n635k2856k4766l0851L394K3066n730
11981a3616m033m794r057j295K657K3519J556j4968j8823j5037K0563M4334j1013
11968gk7157O977m141J9295N661J5230N471k1973J408j4665j9776l4318K6109
11955d1886K8967j8412k2859M769N2957J594l5846J3793J8673k196P053p722j4652
11942a5767j342L6622j2485p160j4771k6032m334L7752K2841J8343k8475k1968
11930a6776j1683K4195k519P412M7701K982l7091j597n173j102J8245n557N980
11917B5017j81k5469m1774m966J6454J3615j6057J0300J6674K3622J2689K0764
$$ plain form
12005 -25194 -23616 9533 32353 34895 33026 3214 -22313 -25042 -1214 9386 24474 60766
11993 60766 74970 71488 54880 38723 49762 44127 21271 -3495 -34346 -30952 -7886 -13616
11981 -13616 -17649 -22443 -31500 -32795 -30138 -6619 -5063 -20031 -38854 -53891 -33328 11006 -7
11968 -7 -27164 -20187 -24328 -5033 628 15858 21329 -644 764 -13901 -33677 -67995 -41886
11955 -41886 -12919 -31331 -54190 -49421 3536 5130 -30716 -16923 1750 -446 6607 -1115 -15767
11942 -15767 -17109 19513 7028 -132 -14903 -40935 -45269 -7517 15324 33667 5192 -16776
11930 -16776 -28459 -4264 -6783 629 48330 51312 14221 12624 7451 6349 24594 19037 25017
11917 25017 24836 -633 -42407 -47373 -30919 -17304 -33361 -23061 -6387 17235 29924 50688
11905E0688J4275k8287j7195j4992j1548o017o962L949M9614J0984k8490Q678
11893B4697j9901j7840j157l77j2528r750J8951L7849O508M342L8455j8179p2208
11880b1138o031P61j2153q189L2838K0029n330j3863L0906j6015J782K3752l712
11867B3637j5901n650J0055m242l3675O457N3657J7795j6622l0391k9504j079
11855b5463q1J1474J2927m798l425j0911q321K6226K7966J279p514k0451j1622
11842a2714k176j496l65K761p319R120J9616L3995l5112p107j6584J9696J0472
11829A2787j1067l0828J5544K2529J4320L1976J0371j8075j8037j8159p08J7791
11817B8444K9042l968k7596j9656j7311J2054K785o963k258O264J1827L3276j7370
$$ plain form
11905 50688 64963 36676 19481 4489 -7059 -13076 -20038 -16089 33525 44509 16019 24697
11893 24697 4796 -13044 -14201 -14578 -27106 -36856 -17905 19944 26452 30794 69249 51070 -21138
11880 -21138 -27169 -26408 -38561 -46750 -13912 6117 787 -13076 17830 1815 3597 27349 23637
11867 23637 7736 2086 12141 7899 -25776 -19319 34338 52133 35511 5120 -24384 -25463
11855 -25463 -25544 -14070 -1143 -5941 -9366 -20277 -28598 -2372 25594 26873 19359 -1092 -12714
11842 -12714 -14890 -16386 -16751 -13990 -21309 -12189 7427 41422 6310 -797 -17381 2315 12787
11829 12787 1720 -29108 -13564 8965 23285 55261 65632 47557 29520 11361 10653 28444
11817 28444 57486 53518 25922 6266 -11045 1009 3794 -3169 -5427 837 12664 45940 28570
11804B8570n854l1803n338O143K0836M3021K3737P711J107k0241k5548j9582N759
11791B8518r447p831q62K080J9296l593k0655q238j1671j8942P350j5637j6406
11778e6038P853L0930M2511J6180J9240k7017k0282J1475J6801j6541n0669K5879
11766C22J5872K395k6675O145r777K663p497o455N959k8706J0561J8374J0696
11753f123J3730m704r363k0641J8151m49j3562M4529K1662j0304k6696N34k1811
11740a5047K8891O290k3203K8487K9386k2298k2901J1952J8903j4620l5139l745
11728a3044j4361j7475Q574L862l1745K7481M367L6661M5273n365J873l4964j513
11715I624k1464K048P117k18k1449q817J5941M338L9792J2916J8636k0669l4357
$$ plain form
11804 28570 22716 -9087 -14425 -8282 12554 55575 79312 87023 88130 67889 42341 22759 28518
11791 28518 19071 11240 10378 12458 31754 28161 7506 -732 -12403 -31345 -23995 -39632 -56038
11778 -56038 -48185 -17255 25256 41436 60676 33659 13377 24852 41653 25112 -25557 322
11766 322 16194 18589 -8086 -1941 -11718 -9055 -16552 -23007 -17048 -45754 -35193 -16819 -6123
11753 -6123 7607 2903 -6460 -27101 -8950 -9399 -22961 21568 43230 32926 6230 6764 -15047
11740 -15047 13844 20134 -3069 25418 54804 32506 9605 21557 40460 25840 -9299 -13044
11728 -13044 -27405 -44880 -36306 -32444 -64189 -36708 -32341 4320 49593 44228 46101 11137 9624
11715 9624 -11840 -9792 -2675 -2893 -24342 -33159 -17218 -12880 26912 39828 58464 37795 3438
11702C438k9149O120J7276j8879l9654J6202K3742K2994M1277j1967k2242M167
11690A3325j6383k1916j7489K0650L8249K1400L767k2364k9150k943Q924J7095
11678A3165k4553l1019P641R737Q862M575k5090P618M743K865k66J5979O37O104
11664I98K8749j4978l1290j5443Q181P733k5223r659Q31j1002j0114J3323K784
11651e5110J1920K6113L5180K2834n702j7115j2224j4976O744q597J9504J5418
11639B3989J8727k7453k7215j0051m266K7354L553j9551j4960j250J5754n911
11627b1280L3433Q614q758J177K880K457K475L706p43k0974r792j2796L5570L7116
11613E3085j8545j8220j3009k2953J4321L539L3513L826m2448r018K8009R27J359
$$ plain form
11702 3438 -25711 -19591 -2315 -21194 -60848 -44646 -20904 2090 43367 31400 9158 13325
11690 13325 -3058 -24974 -42463 -21813 16436 37836 41603 19239 -9911 -12854 -3930 13165
11678 13165 -11388 -42407 -34766 -25029 -16167 -11592 -36682 -29064 -24321 -21456 -21722 -5743 -5106 998
11664 998 29747 14769 -16521 -31964 -23783 -16050 -41273 -50932 -50101 -61103 -71217 -57894 -55110
11651 -55110 -43190 -17077 18103 40937 35235 18120 5896 -9080 -2336 -10933 8571 23989
11639 23989 42716 15263 -11952 -22003 -26269 1085 4638 -14913 -29873 -31123 -15369 -21280
11627 -21280 12153 20767 12009 13186 16066 18523 20998 24704 23961 2987 -6805 -19601 15969 53085
11613 53085 34540 16320 3311 -19642 -5321 -1782 31731 35557 -6891 -15909 12100 13027 14386
11600A4386k0406j2567L2311K0322n227k1854q864l935M699l982j0219J8266L5622
11587C8552J7008J3085J521K176m1315P911n386k7898J4185J931j9297k8699J0976
11574a5250O013R409k6118R353K1805J0718m670K9835Q082j8319k1629n912l110
11561B07l138P320j9645k5198L6230J1558K035n799q529o839j5529N961j3262
11548c4628J5457j2661L1805J3266j2172M210k3908O717L8927K3607K4470p826
11536F7264k0946j8608k1863j225j1957l3712j0221J8604K1209K079r694R253
11524i817Q955O557O160j4602K436k3085k0338j4231l931q436R363N317j298m056
11510f1006J4659M050J8000L1020M4952j3250k1020k1218k4732J0553K9551j4451
$$ plain form
11600 14386 -6020 -18587 13724 34046 28819 6965 -1899 -5834 -1135 -5117 -15336 2930 38552
11587 38552 55560 68645 70166 72342 31027 38938 33552 5654 19839 21770 2473 -26226 -15250
11574 -15250 -9237 172 -25946 -16593 5212 15930 11260 41095 49177 30858 9229 3317 207
11561 207 -2931 4389 -15256 -40454 -4224 7334 9369 3570 -4959 -11798 -27327 -21366 -34628
11548 -34628 -19171 -31832 -27 13239 1067 5277 -18631 -11914 27013 50620 75090 67264
11536 67264 46318 27710 5847 4622 -7335 -41047 -51268 -32664 -11455 -9376 -19070 -9817
11524 -9817 -862 5695 11855 -2747 -311 -23396 -43734 -57965 -61896 -70332 -60969 -55652 -56950 -61006
11510 -61006 -46347 -42297 -24297 6723 51675 38425 17405 -3813 -28545 -17992 11559 -2892
11498b892n331j1783L1944J3641k5772j7814Q200M643J5020l326j4230K2738K6684
11485D1722j5734k1838J7424K901j26J2853L4753k649l2834j4914o926J6586J8635
11472D9853o185p368O917j8769j9884r009J0699k4568l6016l0968J1810L0096
11460d3392L5135N224J116n501m27l8643n248L186l548J3033J3141L3105O99j8481
11446a0601k0281Q673J7036J2014r16j6461n375K0338j8103K9846K8695k887j5842
11433B6136j9875k4976J5038J5976n6l565p288L3926j927k6853r924l74j7214
11420b0976J187L4309j2109q09K4788M758K8013K7215o024n1669k2452L964J7326
11407B7521K4398K2188N333j9563m7832l480j2176k5090N225Q156M41N59P805
$$ plain form
11498 -2892 -8223 -20006 11938 25579 -193 -18007 -9807 -5164 9856 6530 -7700 15038 41722
11485 41722 25988 4150 21574 24475 24349 37202 71955 69306 36472 21558 14632 31218 49853
11472 49853 43668 36300 43217 24448 4564 -4445 6254 -18314 -54330 -85298 -73488 -43392
11460 -43392 -8257 -3033 -1917 -7418 -7845 -46488 -51736 -48550 -52098 -39065 -25924 7181 7880 -10601
11446 -10601 -30882 -22209 -5173 6841 5925 -10536 -15911 4427 -13676 16170 44865 41978 26136
11433 26136 6261 -18715 -3677 12299 12243 8678 1390 35316 33389 6536 -3388 -3762 -20976
11420 -20976 -19789 14520 2411 1602 26390 31148 59161 86376 80352 28683 6231 10195 27521
11407 27521 51919 74107 79440 59877 12045 8565 -3611 -28701 -23476 -15320 -14879 -14320 -6515
11394f515J8232J1783j0324L621K093J415Q537k104j7039M659k5465j3061J0128
11381a4040N385N761L278O930K6379p212j8330k0966K5651K2407o588Q23r902
11368A9576j4930K1272L8518J0038j0089k057j4520k6188j8463m777j1103J0593
11356b130K1443j6960j0321L9132k529m27J0321k8883k2991l4421l5324K5912
11344e7178M0368K0537J0329o780l7269j7562j4932J4900P857k991J3545K2007
11332g169o834r152p68k4452M570p665L9830M6643r679l0809j5764j4581q433
11319d4263L4309K0746M951k046o638R096L547l742r827k4465k2546J8128J649
11306b1101k2299n36J0644l55R893N0554o91l3872j1810p765J7021K4823j5329
$$ plain form
11394 -6515 11717 23500 13176 16797 18890 20305 28842 26738 9699 14358 -11107 -24168 -14040
11381 -14040 -8655 -2894 384 7314 33693 26481 8151 -12815 12836 35243 28655 29478 19576
11368 19576 4646 25918 64436 74474 64385 62328 47808 21620 3157 -1620 -12723 -2130
11356 -2130 19313 2353 -7968 31164 28635 28208 38529 9646 -13345 -47766 -83090 -57178
11344 -57178 -16810 3727 14056 7276 -29993 -47555 -62487 -47587 -39730 -42721 -29176 -7169
11332 -7169 -14003 -23155 -23923 -48375 -43805 -51470 -11640 35003 25324 -5485 -21249 -35830 -44263
11319 -44263 -9954 10792 15743 13697 7059 16155 19702 15960 6133 -18332 -40878 -22750 -21101
11306 -21101 -43400 -43936 -33292 -33647 -23754 26800 26109 -7763 -19573 -27338 -10317 14506 -823
11293h23J6916K275J561J4643l0233k3283j5515j5618j0211p98J0116L9608L1483
11280B0121k4153o3813M4337N1645k0728k7530J8506L6966L094k2599n349n285
11268E212k4129l735K1564L5729M619R065n520m4040K5028L2115M866k6365j7356
11255A7053J0599R382P478K917j847k4030k5234l524K9446J9113j1442j9508l060
11242G343o790K2325K2521K2908j3930j8521o522l1366m868K4603J7716r790j2752
11229A2877m5255q395M3229L5820j0313J4987k2109j4125l046J3535j6953j759
11217a507M3022K2991j4847k2705J276m2595j1499p267K6407J1040j2343O60K5900
11204A8533P121j2861k8876l911k7923r983M3181K2253J6694K5579j4690K256
$$ plain form
11293 -823 16093 18368 19929 34572 4339 -18944 -34459 -50077 -60288 -61086 -50970 -11362 20121
11280 20121 -4032 -67845 -23508 28137 7409 -20121 -1615 35351 38445 15846 10497 5212
11268 5212 -18917 -22652 -1088 34641 39260 48325 42805 -1235 23793 55908 60774 34409 17053
11255 17053 27652 37034 44512 47429 45582 21552 -3682 -7206 22240 41353 29911 10403 7343
11242 7343 553 22878 45399 68307 54377 35856 29334 -2032 -6900 17703 35419 25629 12877
11229 12877 -32378 -40773 2456 38276 27963 42950 20841 6716 3670 17205 252 -1507
11217 -1507 41515 64506 49659 26954 28230 -14365 -25864 -33131 -6724 4316 -8027 -7367 18533
11204 18533 25654 12793 -16083 -19994 -47917 -57900 -14719 7534 24228 49807 35117 37373
11192C7373K0153n7591m1464N41M739j1380m864J0826J7353J9506J4170P408p454
11179I316L221L213k3326N798l1374j0335J8330J8681K375J436N785M4321K6019
11166G3460j412j9331K694j5036r395l5238l8763n992K9877P692j8596j1451L4550
11153f941K9890k4614J4998J0298j7299k3885J3343J2186M4074q089n6145j2913
11141b5097J8001p618l565K5919j0829q806l1425o977J874J6507K4902N177Q282
11128F345R496k500J6346k0451k96L2744M71l461k723n906l5804M691J6162j8580
11114c466J050K5417j110M030k1153J8572K79o983j8322k0676o967k550K0367
11101a1512K2655o17R257k593J210O115m16j0087m499k2996R204R014J5096j5829
$$ plain form
11192 37373 57526 -65 -41529 -40988 -36249 -47629 -52493 -41667 -24314 -4808 9362 16770 9316
11179 9316 12537 15750 -7576 -1778 -33152 -43487 -25157 -6476 -4101 -2665 3120 47441 73460
11166 73460 72048 52717 55411 40375 30980 -4258 -43021 -49013 -19136 -11444 -30040 -41491 -6941
11153 -6941 22949 -1665 13333 23631 6332 -17553 -4210 7976 52050 43961 -12184 -25097
11141 -25097 -7096 -14714 -18279 7640 -3189 -11995 -43420 -50397 -48523 -32016 -7114 -1937 6345
11128 6345 15841 13341 29687 9236 8940 41684 42155 38694 35971 30065 -5739 -1048 15114 -3466
11114 -3466 -2416 23001 21891 25921 4768 23340 23619 16636 -1686 -22362 -29329 -31879 -11512
11101 -11512 11143 10526 19783 17190 18400 24515 24099 14012 9513 -13483 -4279 4735 19831 4002
11087D002k5925r588L9596M4595R828J5550j5124l8364l1090O292M631J5370j4690
11074E083j6902j6031J5498K0716K3918l917p136k0816j5952M1763Q633m721k6652
11061C484l2571l8106K948J1091L8952N2425K0223r727m559M474j7431j5524Q477
11048B4156l2697k2809k736J270j08R951J7221k120M5446R391l0309j6544j5583
11035a5471K7926L7088R433l7589j8881k8349M422K3405O936o152J8771L383j4541
11022A0381K2581N897l0523j7732m659J7741K3494J7497P944j7229j213k0748
11010A3431J5445j8134l403k8719j1430L0946J5350R751K1887J5627m784J0871
10998F6838l1610n2739J712J3104L8863J4887p073M802O228J9710j8985j5901
$$ plain form
11087 4002 -21923 -31511 8085 52680 62508 78058 62934 24570 -6520 -228 4403 19773 5083
11074 5083 -11819 -27850 -12352 8364 32282 28365 21229 413 -15539 26224 34857 30136 3484
11061 3484 -29087 -67193 -64245 -53154 -14202 38223 58446 48719 44160 48634 31203 15679 24156
11048 24156 -8541 -31350 -34086 -32816 -32924 -22973 -5752 -7872 37574 46965 16656 112 -15471
11035 -15471 12455 49543 58976 21387 2506 -25843 -21421 1984 8920 2768 21539 24922 10381
11022 10381 32962 38859 8336 -9396 -14055 3686 27180 44677 52621 35392 34179 13431
11010 13431 28876 10742 7339 -21380 -32810 -1864 13486 23237 45124 60751 55967 66838
10998 66838 35228 -17511 -15799 -2695 36168 51055 43982 48784 55012 74722 55737 39836
10986C9836l642k8266j0069J8554o28k6406J5266L7115N28K154j393O428j342
10973D8135k713p237q210K8225j1378J9515Q611m0556l8926K9986j2272K1879
10961C5059k961O758j527l1060k242Q108O729K9395K2279k0859j1668j7352r918
10948A0741L5339J7812J6493J709J9676j0011O2102O3036K5166O0292J58449K97482
10936G58286M53784M07361R3053l21324m59398l08418k04518j26419p8955l7302
10926A76150l0861m570j4584j579o667k0074k1003q347j9448o413O335k6747k9485
10913g293K7436J4607Q028K0078J5020m506R054l8423K6090O393k5268k090L518
10900E2644J9201k1384k3731j0091l1629j3029M593K6382K2673K0112J1828k834
$$ plain form
10986 39836 36194 7928 -2141 16413 15785 -10621 4645 41760 42288 44442 43049 49477 48135
10973 48135 45422 38185 29975 58200 46822 66337 74948 34392 -4534 25452 13180 35059
10961 35059 32098 38856 37329 6269 4027 12135 18864 48259 70538 49679 38011 20659 10741
10948 10741 46080 63892 80385 82094 101770 91759 153861 216897 242063 302355 460804 758286
10936 758286 1212070 1619431 1712484 1391160 931762 623344 418826 292407 213452 176150
10926 176150 145289 140719 126135 124556 117889 97815 76812 68465 49017 42604 48939 22192 -7293
10913 -7293 20143 34750 42778 62856 77876 73370 82424 44001 70091 76484 51216 49126 52644
10900 52644 71845 50461 26730 16639 -14990 -28019 -23426 2956 25629 45741 57569 54735
10888E4735k7604l920j0957J5080J2004k1507j5102j214p546M200O235P507L580
10875A5491L600K6410K7665K206l0388k0807j8491p922j100J8927J1316O222k0746
10862A2383k0694J3510J551j6536J5411O279j0735J3776J9004r229j1620J8168
10850C1268K7029k036k1299r205P45k5666K4440K8862j5505k1392Q469k372m4799
10837b1461l9190k8752p806N1597J4985J3330R699J5646P763M5436M1548l4830
10825F7965l6415R325O907P930j6907l2230o678m969L0120j130k5759j541Q73
10812b509N748j1955k5523p133L5293k395J795K7306P340J3167n412N209m478
10799C6453j1003l685L0425p162R08J6470J6388k1589q034j325J3291K9426K1024
$$ plain form
10888 54735 27131 23211 12254 27334 39338 17831 2729 1515 -6031 -1831 4404 11911 15491
10875 15491 19091 45501 73166 75372 44984 24177 5686 -2236 -3336 15591 26907 33129 12383
10862 12383 -8311 5199 6750 -9786 5625 11904 1169 14945 33949 24720 13100 31268
10850 31268 58297 56261 34962 25757 26502 836 25276 54138 38633 17241 25710 23338 -21461
10837 -21461 -60651 -89403 -97209 -45612 -30627 -17297 -7598 8048 15811 61247 102795 67965
10825 67965 31550 40875 47782 55712 38805 6575 -103 -5072 25048 23918 -1841 -3382 -2509
10812 -2509 3239 -8716 -34239 -41372 -6079 -8474 -6679 20627 27967 41134 35722 40931 36453
10799 36453 25450 21765 52190 45028 45936 62406 78794 57205 49171 47846 61137 90563 111587
10786A11587j7109j4261M763r116K1565K4116L9402O1978P7489j6580n1194p4775
10774A57865o8796o0742j7940J4843r136J5489K1509m702M609J8076k4482j5073
10762C1520o760Q541P753k800J307j586o530Q166J9657J1101L5189J1824q06r463
10748A07113J2491L52K0453M949k9011k3534J4742J7679k9770k0092K0903J6839
10736A13114j0977j9433J2447J0284k0703L427J903j6509J5834J1925J0787K7474
10724A39573J9445l4507p868R576J7967k6166p3554k5891J1201j9070p634J9934
10712B3006J7464P781J269J9053L8852k4848J2858m024O052M848j2727k1573k5441
10699D2570m006Q602j5972L425K9280R480n423j5485k8869m846L2014L0725L2772
$$ plain form
10786 111587 94478 80217 84980 75864 97429 121545 160947 222925 300414 283834 232640 157865
10774 157865 89069 28327 10387 25230 16094 31583 53092 48390 52999 71075 46593 31520
10762 31520 24760 33301 41054 38254 39561 37975 31445 39611 59268 70369 105558 117382 116576 107113
10748 107113 119604 119956 140409 145358 116347 92813 107555 125234 95464 75372 96275 113114
10736 113114 102137 82704 95151 105435 84732 88159 90062 73553 89387 101312 112099 139573
10724 139573 159018 124511 116643 126219 144186 118020 44466 18575 29776 10706 3072 23006
10712 23006 40470 48251 49520 68573 107425 82577 95435 91411 97463 102311 89584 68011 42570
10699 42570 38564 47166 31194 34619 63899 73379 67956 52471 23602 18756 50770 81495 114267
10686A14267N1217M4977K7964N3178K2028o0092q3030q6730m9242k9217M23m175
10674A568o0076J0266M2113K8459j076M197J3315J3351P064j3976J0079R352K865
10661F7501J4243M2622L1351O28j6180J6280J4614j8335l6278n0290o5907l8957
10649c8708q836J0012M967n735l492K2242J4615K7131J6722K1537N1279K757m5215
10636F9276L429q637k3611K752P183J922L7418L4881j9396K2791j1778L699j8255
10623A01674p979K1972O753K985J4899j304j9691N84j1522m948M5194J9216O47
10610A68480m2696j8348k6735q12m162Q508J5309K8720n807l5696j250K2278M1462
10597A49251P536j7274J7641M6009L3130J8525O039J8151r495j9399p629J9158
$$ plain form
10686 114267 165484 210461 238425 291603 313631 253539 170509 83779 34537 5320 5743 1568
10674 1568 -58508 -48242 -6129 22330 21254 25451 38766 52117 59181 45205 55284 64636 67501
10661 67501 81744 124366 155717 156345 140165 156445 171059 152724 116446 66156 249 -38708
10649 -38708 -47544 -37532 -32565 -38300 -41792 -19550 -4935 22196 38918 60455 111734 114491 69276
10636 69276 72705 64068 40457 43209 50392 52314 89732 124613 105217 128008 116230 119929 101674
10623 101674 93695 115667 122420 125405 140304 139000 119309 119893 108371 103423 148617 167833 168480
10610 168480 125784 107436 80701 79889 75727 84235 99544 128264 122457 86761 85511 107789 149251
10597 149251 156787 139513 157154 203163 236293 254818 260857 279008 269513 250114 242485 261643
10585B61643J8274K9556L8831L218J0594O628K8966Q689K7938M318J695K9580
10573D69930K2980M9613L1866n073L2490P2389M1627M925K6826K9634M9022M1074
10561H67303L5596N2540L6430K5472K9804O0058J05065J33729J36171K28612L64232
10550B075012M72334O37549O74181L05764j22404j59019J22973L73431N39724
10541D919545O09588P28642R10850J107072J412347J782289K279517K973685L961691
10532B0685226N669572Q656337J3951589K3980983M3469885P5677842R3602388
10525B85693822M2256787m4209640r1611310p1108081m0603350k2991986j4111171
10518D3315071r548917o820134n018321l891010l072609k336695j745825j354863
$$ plain form
10585 261643 279917 309473 348304 351522 362116 368744 397710 406399 434337 438655 440350 469930
10573 469930 492910 542523 574389 569316 601806 674195 715822 720747 747573 777207 826229 867303
10561 867303 902899 955439 991869 1017341 1047145 1107203 1212268 1345997 1482168 1710780 2075012
10550 2075012 2547346 3184895 3859076 4164840 4042436 3883417 4006390 4379821 4919545
10541 4919545 5529133 6257775 7168625 8275697 9688044 11470333 13749850 16723535 20685226
10532 20685226 26354798 35011135 48962724 72943707 116413592 192091434 285693822
10525 285693822 327950609 283740969 192129659 121021578 80418228 57426242 43315071
10518 43315071 33766154 26946020 21927699 18036689 14964080 12627385 10881560 9526697
10510I526697j094791r13492o93132n20505m26968k85875j46384j3938J42184
10501E573796J34l91488o56813n95605m21712l40541k51043j86201k08886k18713
10491B302928j97467j57722j03641j35235j39223j17346j68415j08200p2699n6830
10481A046150p0907p1987o7293j1282l8189j2414k6899n6161n1788k8750j4749
10470E95731k3486l9254k3794l8221P267J6621l7907o5057k2266J3462O046K1666
10458D10808l2139l5774K0027J8244k4155j2815J7698q050j4601n5918J862K61
10446B85448k52n119m335M607J5613J2585n0867n1394K2748l6950j6016J6114
10434A92182j3565k5192Q216J130j594K826R286K1495M242l2678p843J1958Q429
$$ plain form
10510 9526697 8431906 7518414 6825282 6304777 5877809 5591934 5445550 5431612 5573796
10501 5573796 5573930 5182442 4525629 3930024 3508312 3167771 2916728 2730527 2521641 2302928
10491 2302928 2105461 1947739 1844098 1708863 1569640 1452294 1283879 1175679 1102980 1046150
10481 1046150 975243 903256 835963 824681 786492 774078 747179 691018 639230 610480 595731
10470 595731 572245 532991 509197 470976 478243 494864 456957 391900 369634 383096 389142 410808
10458 410808 378669 342895 362922 381166 357011 344196 361894 353844 339243 283325 285187 285448
10446 285448 285196 280077 275742 280349 295962 308547 257680 206286 229034 192084 176068 192182
10434 192182 178617 153425 161641 162771 161177 164003 173289 194784 199026 166348 158505 170463 178892
10421A78892Q763o011J462j6896Q248M223l0904j5517J0003L5683k2868l8684
10409A16394K2466K4574K913K3567n994R914L2931M0691L0755j8566n0230l1745
10397A97670n121o1691m4853q669j5Q704J994j7091L800M831J4256J5539J2019
10384A21373K991l502j705o668J2500J0060K9933K5402k3223n047p725n2634l834
10371I7921k655q1758j12363p500K4128K2031L985K9925P235q373L1868n65J4813
10358A8692j1736k1453K9094m930j7899k676J9129K6177k523j8149N128j2115
10346F739J0570j0625p127j4323M5805K08l0316K0604Q400j1942j3577k6613k5039
10333d7236J5800l66n579j4627r291l0217l3407q474r081K5836J7423O0232L6859
$$ plain form
10421 178892 187655 181644 183106 166210 174458 178681 147777 132260 142263 177946 155078 116394
10409 116394 138860 163434 166347 189914 183920 193834 226765 267456 298211 279645 229415 197670
10397 197670 192549 130858 86005 77336 77321 86025 88019 70928 74728 79559 93815 109354 121373
10384 121373 124364 120862 119157 112489 124989 135049 164982 190384 167161 162114 154389 101755 97921
10371 97921 95266 13508 -98855 -106355 -82227 -60196 -56211 -26286 -19051 -27424 4444 3879 18692
10358 18692 6956 -14497 14597 9667 -8232 -10908 8221 34398 31875 13726 18854 6739
10346 6739 17309 6684 -443 -14766 31039 31247 931 21535 29935 17993 4416 -22197 -47236
10333 -47236 -31436 -31802 -37381 -52008 -61299 -91516 -124923 -133397 -142478 -116642 -99219 -38987 -2128
10320b128k6303M993O652J6666J2798J3615K7426n964k3043k4899N269Q987M362
10307A8431J0738K2489J2561J0025L048j1060j3832j0022j7336q773K5021L9161
10295H0451k1220k5507r209J057k0785l3635J8871p510j6165J3265O284J8312
10283D209P659q600k360K629k1015P200k244J5579j6855l885J7347P23J6817j5947
10269A257J148J2898k9031k932L1907k2281p715L5793J1221l542j5964K447j1774
10256C432k4312j1919J7463J8043k7845L499L7151N494j419O883K8183J093j0885
10243D4861j7000j3397N417N652K13l1325j7993M4650L113k0936m299K6478l2631
10230g197j4426K7685j386R492K1991l568J5010l8786j9512R950O909J2727K267
$$ plain form
10320 -2128 -28431 -23438 -16786 -120 12678 26293 53719 47755 24712 -187 5082 14069 18431
10307 18431 29169 51658 64219 74244 77292 66232 52400 42378 25042 16269 41290 80451
10295 80451 59231 33724 24515 25572 4787 -28848 -9977 -17487 -33652 -20387 -14103 4209
10283 4209 11868 3268 908 3537 -17478 -10278 -12522 3057 -13798 -17683 -336 387 17204 1257
10269 1257 2405 15303 -13728 -16660 15247 -7034 -14749 21044 32265 28723 12759 15206 3432
10256 3432 -20880 -32799 -15336 2707 -25138 -21639 15512 21006 19587 26470 54653 55746 44861
10243 44861 27861 14464 19881 25533 25746 -5579 -23572 21078 24191 3255 -1044 25434 -7197
10230 -7197 -21623 6062 4676 14168 36159 32591 47601 8815 -10697 -747 6162 18889 21156
10217B1156j4012K6347M2728J8704j3584n9919P217J2235p479m149J241o169j8548
10204E768l392J0587J6686j2498K394J4739M693j5096j6195L172K8718L94k3717
10191A6253k908j558n49j5259j9627J8880J4964j0270k0213k712J5228M826k1417
10178b4362k1169k851M7694O517q632J9530j1198n713N402J9801K4873j3271k8992
10165G629j1770m601k5675k1028K5257J3569l02J4758n512j5032n613j1760k2634
10152f2714q094L3618L6635K6288p514r794j6795Q850K0768P407j8281P53J5785
10139B6912r691q200j3442K4329J4434K3073J7162J3670k526l9352m6133L8254
10127C8490J7647m337j1970o732Q58L774K4236n227L3597M9147k384J7525P8557
$$ plain form
10217 21156 7144 33491 76219 94923 81339 21420 28637 40872 33393 29244 30485 24316 5768
10204 5768 2376 12963 29649 17151 19545 34284 38977 23881 7686 10858 39576 39970 16253
10191 16253 13345 11787 11238 -4021 -23648 -4768 10196 -74 -20287 -22999 -7771 -2945 -24362
10178 -24362 -45531 -48382 -688 5829 -2803 16727 5529 -184 5218 25019 49892 36621 7629
10165 7629 -4141 -8742 -34417 -55445 -30188 -16619 -16921 -2163 -7675 -22707 -28320 -40080 -62714
10152 -62714 -70808 -37190 -555 25733 18219 8425 -8370 480 21248 28655 10374 11127 26912
10139 26912 17221 9021 -4421 19908 34342 57415 74577 88247 85721 46369 236 38490
10127 38490 56137 51800 39830 33098 33956 37730 61966 56739 90336 139483 137099 154624 233181
10114B33181J41063K55446L68704M64662K30191k26206m68244l75560k34145r1856
10104B97236p3503k9002r395r925l4731j8950k6408q911l3801k4280j5888j6305
10092c863Q494l886m3401K528J6345O0962J2804l1713j2535J0647K0375Q971k3298
10079B2430O733o713k0665R730J5131q313M540L0849j1518n205r476j3825n159
10066H539M2083N062k0414l0357N828j5172k5113j0584J725P220J1327J2226K5279
10053A7649K6762n91m5968j8853n330l261Q340K5688l3424l6797K4520J6018o500
10040c1747M6553O1849o205j6269k7921o6585J229R949J0522K4993P124j1345
10028B147k9738K8320J1393Q455k4196l977l274k838J9665j1867l582M806k7736
$$ plain form
10114 233181 374244 629690 998394 1463056 1693247 1467041 998797 623237 389092 297236
10104 297236 223733 194731 185336 175411 140680 121730 95322 86411 52610 28330 12442 -3863
10092 -3863 4631 745 -42656 -40128 -23783 37179 49983 18270 5735 16382 36757 45728 22430
10079 22430 29163 22450 1785 11515 26646 18333 22873 53722 42204 36999 27523 13698 8539
10066 8539 50622 55684 35270 4913 10741 -4431 -29544 -40128 -38403 -31183 -19856 -7630 17649
10053 17649 44411 43820 -2148 -21001 -26331 -29592 -21252 4436 -28988 -65785 -41265 -25247 -31747
10040 -31747 14806 76655 70450 54181 26260 -40325 -39096 -29147 -18625 6368 13492 2147
10028 2147 -27591 729 12122 20577 -3619 -7596 -10870 -13708 5957 -5910 -9492 -4686 -32422
10015c2422Q70k6894J023M354J7333L9020J2599M207o259p059j4851J3771J1330
10002A7022j5552j9246j3089j3004m736K3241M4323J3673m518j4483K0769L5849
9990G0249j8886j5100L827n554j3256M6r108J8939k2367j3541J2834j8358k9439
9977c9714K6713Q321k2942n80J7190M006L973J021j691J6285j3020j5868J732
9964a4574J3782j5156j4112K1518N451J2486J1837K2122J0368K5808J1512k9811
9952F1231M749J2006l991k2942j2499j2722L71L013j1239K667m663j4911q320
9939g250L408K7263j1046l4163j6315j2749L182L7643K1016k0832j9606R45K7927
9926e77N551N868Q742Q446k7803m438J3435K6015J5314j0496l9929j6732L3147
$$ plain form
10015 -32422 -31552 -58446 -57423 -53069 -35736 3284 15883 20090 13831 6772 -8079 5692 17022
10002 17022 1470 -17776 -30865 -43869 -48605 -25364 18959 32632 28114 13631 34400 70249
9990 70249 51363 36263 40090 34536 21280 21326 12218 31157 8790 -4751 8083 -10275 -39714
9977 -39714 -13001 -4680 -27622 -28202 -11012 -7006 -3033 -2012 -3703 12582 -438 -16306 -14574
9964 -14574 -792 -15948 -30060 -8542 -3091 9395 21232 43354 53722 79530 91042 61231
9952 61231 65980 77986 73995 51053 38554 25832 26203 29216 17977 20644 15981 1070 -7250
9939 -7250 -3842 23421 12375 -21788 -38103 -50852 -47670 -10027 10989 -9843 -29449 -28504 -577
9926 -577 4974 10842 19584 28030 227 -4211 9224 35239 50553 40057 128 -16604 16543
9913A6543J1558j4238J8042k528k2727k6244m1198j2755N4959M700k3802R249
9901b8441K5716q106l3236J0176J5726m846P444K6268J641Q188K9440R698k1665
9888C8003l3401j691j6779k0570Q142l316P649m130N06K509J8812n509K1884M979
9874A7088k7422j3930M2657K1936j2185k6324J7201q443k9350k0103R320L1577
9862B022L3797j1731m949J1443m19j1489J0937L7262K6535o757k3338k3211o079
9849C4023l440p218l818L1091O107K215m0838M409J4551k795k9314j1818m093
9836a0938j3155J3413K3542n340m143K8083J9984J2784K761l4405j8713p181J060
9823G752Q372k837K1610o655K809j0240k3513j4059o799l519L6689j3732M011
$$ plain form
9913 16543 28101 13863 31905 29377 6650 -19594 -60792 -73547 -18588 -13888 -37690 -28441
9901 -28441 -2725 -10831 -44067 -33891 -18165 -23011 -15567 10701 12342 20530 49970 59668 38003
9888 38003 4602 2911 -13868 -34438 -26296 -29612 -21963 -26093 -25587 -23078 -4266 -9775 12109 17088
9874 17088 -10334 -24264 18393 40329 28144 1820 19021 10578 -18772 -38875 -29555 2022
9862 2022 35819 24088 19139 30582 30163 18674 29611 66873 93408 86651 63313 40102 34023
9849 34023 30583 23365 19547 50638 56745 58960 18122 22531 37082 34287 4973 -6845 -10938
9836 -10938 -24093 -10680 12862 7522 3379 31462 51446 64230 66991 32586 13873 6692 7752
9823 7752 16124 13287 34897 28242 31051 20811 -2702 -16761 -23560 -27079 9610 -4122 -111
9810a11j2495j0845L1131K5093P862k2892q671m022j8036J5510k369M273m598
9797a70j6840N1662K899k8619M838j8333K5432J6719l533K302K1313j4075J5653
9784E9248j7629j7673j8297k6115M743K5175R706j0430J0109R017j1119J809M510
9771B3054J4693k474r415J8348j7092j8363J0776m867p105J187j3456J1874p144
9758A6l9961J3858K4586r448j2019m471J3190J9831M855J3448n009l7793Q319
9745a0598q157K832K7433K1576l1776M70R689J5194j2901l9567K8429k3734k6244
9732d7354J5304M15j210o286J0911J3804L3320p345k1050l6270l275P476j9002
9719f0562M967k77J0865R752J1422J9699j048N549J8721K142j6118l0199k397
$$ plain form
9810 -111 -12606 -23451 7680 32773 40635 17743 9072 5050 -12986 2524 155 4428 -170
9797 -170 -17010 34652 37551 8932 13770 -4563 20869 37588 34055 36357 57670 43595 59248
9784 59248 41619 23946 5649 -20466 -15723 9452 19158 8728 18837 27854 16735 18544 23054
9771 23054 37747 35273 25858 44206 27114 8751 19527 14660 7555 8742 -4714 7160 16
9758 16 -39945 -26087 -1501 -10949 -22968 -27439 -14249 5582 10437 23885 18876 -18917 -10598
9745 -10598 -18755 -15923 11510 33086 1310 1780 11469 26663 13762 -25805 2624 -21110 -47354
9732 -47354 -32050 -31635 -32845 -39131 -28220 -14416 18904 11559 -9491 -45761 -49036 -41560 -60562
9719 -60562 -55595 -55872 -45007 -35255 -23833 -4134 -5182 367 19088 21230 5112 -25087 -27484
9706b7484k1756J0432K5709L316K6211J4400p657J1227j0545l4907k9614o308
9694d6976J1373J0439n088O5939J3244j6722k4089M622r582M586O304P424M842
9681B6316j6916L6961j9081j9668J2548R97k3123j6948m683J6338j2327Q821M3012
9668C2247m5066j9311L9730K4299k4064l9926r796K4664L1178J0856m094j6095
9656D622K6306k4674l1565J88L5767L2567j1597j1774j6010j4010k024J1183o5
9643a086L852O741j4206K2231M2798Q985j9601k3454m65J7205P669Q678j4754
9630D4593l934k1593k244k1821k1910R877L6184O515Q671j6773R668k60m931j3339
9616H703m509M0838K0823k3542q412m90P85M418o0926j6371K0915L5555p791R710
$$ plain form
9706 -27484 -49240 -38808 -13099 -9783 16428 30828 23171 34398 23853 -11054 -40668 -46976
9694 -46976 -35603 -25164 -30252 35687 48931 32209 8120 12742 3160 7746 14050 21474 26316
9681 26316 9400 46361 27280 7612 20160 21157 -1966 -18914 -23597 -7259 -19586 -10765 32247
9668 32247 -12819 -32130 7600 31899 7835 -32091 -41887 -17223 13955 24811 20717 4622
9656 4622 30928 6254 -25311 -25123 10644 43211 31614 19840 3830 -10180 -12204 -1021 -1086
9643 -1086 2766 9507 -4699 17532 60330 69315 49714 26260 25795 43000 50669 59347 44593
9630 44593 40659 19066 16822 -4999 -26909 -17032 19152 25667 34338 17565 27233 26973 22042 8703
9616 8703 4194 45032 65855 42313 33901 33411 34196 38614 -22312 -38683 -17768 17787 9996 19706
9602A9706J9807K968k7816l3321r137o660J1622J6345L972N752k3877l652J8684
9589e607K6000j1084j2551L024J7708J9225L688K610j693p696k1509j2550J6068
9576A5633J5091k6227J1673K4638L857J157l92k3450p09l6369M36N491L1383N1719
9562G3931J1737l0126J4022q820n432l5855j0226n350K247L585q854J2090k2381
9549i432J6476L3772J8540K859J0928j1620l6264j4287M7624J9400k2434j0941
9537D4621J8329N160j9144n968j7594l744J4181N1160J5460o390J7884m0439m4831
9524B8685O563m368j5886J3818M706j7357J6721K444m1019J086Q249p767j040
9511e165J3713j0950O682J8730P702j1938L5021j635K513k1520J5751j0778J5879
$$ plain form
9602 19706 39513 42481 14665 -18656 -27793 -34453 -22831 -6486 -2514 3238 -20639 -24291 -5607
9589 -5607 20393 9309 -3242 -218 17490 36715 40403 43013 41320 33624 12115 -435 15633
9576 15633 30724 4497 16170 40808 44665 45822 45430 21980 21271 -15098 -14662 -9171 22212 73931
9562 73931 85668 55542 69564 60744 55312 19457 9231 3881 6128 9713 859 12949 -9432
9549 -9432 7044 40816 59356 62215 73143 61523 25259 10972 58596 77996 55562 44621
9537 44621 62950 68110 48966 42998 25404 21660 35841 87001 102461 96071 113955 73516 28685
9524 28685 35248 30880 14994 28812 33518 16161 32882 35326 -5693 -4607 3642 -4125 -5165
9511 -5165 8548 -2402 4280 23010 30712 18774 53795 52160 54673 33153 48904 38126 54005
9498E4005K8603m2647j4160j717N285n698k984J9443n116l612k9993q623J5928
9485H714R00K739m450K366J1432J9540j1847j1095l437L0936K5325q138l2051
9472C0934k9417J5273L228K5414R674l98J1327j286M166l8100k0238J0058K8875
9459D9510j4422j0768Q478K0503q747j7155N55J8774k843N772Q714K012J733o316
9445E5800J2962o443J874r57p450l7298l7092o833J0201J9056j6347J1283N607
9432D363J7841K9179k5066M982O195r844J4616j1620m9131L0475J0964Q813J9582
9419E1349K906j1830Q324r383p848J0768K8965m058K0443N1584m709m7153k8264
9406F1094J3652J3378P108j0638j0937P199L169k2517l2465J7549j8059j5900
$$ plain form
9498 54005 82608 39961 25801 24084 29369 23671 20687 40130 35014 31402 1409 -7214 8714
9485 8714 9614 12353 7903 10269 21701 41241 29394 18299 14862 45798 71123 62985 30934
9472 30934 1517 16790 20018 45432 55106 54708 66035 64749 68915 30815 10577 20635 49510
9459 49510 35088 24320 32798 53301 44554 27399 27954 46728 43885 49657 58371 60383 62116 55800
9445 55800 68762 62319 64193 63236 55786 18488 -18604 -25437 -15236 3820 -12527 -1244 4363
9432 4363 22204 51383 26317 31299 37494 27650 42266 30646 -18485 11990 22954 31767 51349
9419 51349 54255 42425 50749 41366 33518 44286 73251 69193 89636 141220 136511 89358 61094
9406 61094 74746 88124 95232 84594 73657 80856 84025 61508 29043 46592 28533 12633
9394A2633L0746K5752j90P30k249J3409m58L0292l8921k6627J2871N8106k1j3373
9380A02700K2784j1473o299j125j3469k8827j4750N517k072R418K1090Q121J1287
9367A02902k0525k1964o960J3407Q235q667k1333J197J2950q75J8988Q967k4425
9354F1897q548L4461K218j6830q321q81k5968M869J5633j526L041k35J4650L2807
9340A07267l246j9137P980k8322K350M998J8597J9537k0065O159l926k0589K450
9327G4053M166p114K9739N1833P105J2036j1717n7240l5838J2255P555k1838o097
9314E8898L4904M9166j6624j5624n437p755k5452M242J0576m646o254P314l4345
9301D8963j8913J1455K2173L5929K3187J7213j245J8270N470l2283l0523K1227
$$ plain form
9394 12633 43379 69131 68941 69671 67422 80831 80373 110665 71744 45117 57988 116094 116073 102700
9380 102700 125484 114011 107712 106587 93118 64291 49541 55058 52986 62404 83494 91615 102902
9367 102902 82377 60413 53453 66860 75095 66428 45095 46292 59242 58367 77355 86322 61897
9354 61897 53349 87810 90028 73198 64877 63996 38028 42897 58530 57004 60045 59810 74460 107267
9340 107267 104021 84884 92864 64542 66892 71890 90487 110024 89959 96118 92192 71603 74053
9327 74053 78219 71105 100844 152677 159782 171818 160101 102861 67023 79278 86833 64995 58898
9314 58898 93802 142968 126344 110720 105283 97528 72076 76318 86894 82248 75994 83308 48963
9301 48963 30050 41505 63678 99607 122794 140007 138762 157032 162502 130219 99696 120923
9289A20923J1278J1966j5780J188K5486J977l5805M267K3888J070l6079j2200
9277A02179K4477l2211r244J3571L0618L2099J6800j6356l1138R799j3724R370
9265A36240k56k7438Q450J6411k579M047K4297L870p809J2834K6026r510k9598
9252A54985k3939R321R822O879K8298k1698K4655k3441k9074J3172J8977K9666
9240A97623K9305j7726M153q572J7593k4475Q495j3594n703J3539j2748k0893
9228A66997K530J5638o730Q623J7571J5982q864J4456K3660j8586k4508j0142
9216A96627Q964M2209M5872J0870j3945K0656j4918k2809l9762j2356K0332L4332
9204B76072O359J6355j8202l6398j660R988J1223L0721K6404J046m589O614J814
$$ plain form
9289 120923 132201 144167 128387 129575 155061 157038 121233 125500 149388 150458 114379 102179
9277 102179 126656 94445 85201 98772 129390 161489 178289 161933 130795 140594 126870 136240
9265 136240 135984 108546 116996 133407 130828 134875 159172 163042 155233 168067 194093 184583 154985
9252 154985 131046 140367 150189 157068 185366 163668 188323 164882 135808 148980 167957 197623
9240 197623 226928 209202 213355 204783 222376 197901 206396 192802 187099 200638 187890 166997
9228 166997 169527 185165 178435 187058 204629 220611 211747 226203 249863 231277 206769 196627
9216 196627 205591 247800 293672 304542 290597 311253 296335 273526 233764 221408 241740 276072
9204 276072 282431 298786 280584 244186 242526 252514 263737 294458 320862 321908 317319 323933 325747
9191C25747O364Q049K6838R092k2311k3078J3844n887K980L998j5216L3942J141
9178C65503m0367K862J7133J9655J5612M7482J3891j6399l9677P12J1301j4054
9166C83654K8766N114Q805j7827L54J0871m693K4065L3022j112k1100M15K5561
9153D75895j7368p565L111L3849k0523Q1j1317j7882j6932j0358n143K9776J0172
9140D45796j2485J5957J5015M0926l1864l0016R721R396l6516j7290M7435L3812
9128D89887k3681m4976j599J6282J0234R478Q682j1175K9395O346j8060o19P328
9115D77522J4032J4052q28q525N556K810k5694j6616J265p149l612q318L711o289
9101D41917q167k6882J9802K0638n602K3811j4910L531J4255R41l9100n2331k0395
$$ plain form
9191 325747 332111 340160 366998 376090 353779 330701 344545 338658 341638 345636 330420 364362 365503
9178 365503 325136 327998 345131 364786 380398 427880 441771 425372 385695 386407 397708 383654
9166 383654 412420 417534 426339 408512 408866 419737 415044 439109 472131 471019 449919 450334 475895
9153 475895 458527 450962 454073 487922 467399 467480 456163 438281 421349 410991 405848 435624 445796
9140 445796 433311 449268 464283 505209 473345 443329 453050 462446 425930 408640 456075 489887
9128 489887 466206 421230 419631 435913 446147 455625 464307 453132 482527 488873 470813 470194 477522
9115 477522 491554 505606 504778 496253 501809 504619 478925 462309 463574 456425 452813 444495 448206 441917
9101 441917 433750 406868 426670 447308 441706 465517 450607 454138 468393 469334 430234 377903 357508
9088C57508N212J6216J8660K8600k2188l0517K3861l321l0382k341j9930j851
9076C39527K4494M4489j9491k6147J576L2327P38k8604l5252p514N76L8129L884
9063C68732k8993l098J0443N952M167o168j4570J6375L922J8448m618l4371j7551
9050C18670j6489J5110N37l0372R470O380J844n675k0121l8079k7989o66J1119
9037B23739J5462j8701R335O885J7039Q0k941J880L0132k5609n3144m676J3933
9024B13414j4642j1866P45L2813L8614L765l9056j6408j8562l5212N329L3873
9012A92807l946n71j2862j2272j6964N2337K0719N334l3512J2678J0757R781j5204
8999B09082k8705q315k413J5778J964k2684j3379L074J9380J8551K5642N993m8749
$$ plain form
9088 357508 362720 378936 397596 426196 404008 373491 397352 394031 363649 361308 341378 339527
9076 339527 364021 408510 389019 362872 364448 396775 397513 368909 333657 326143 326719 364848 368732
9063 368732 339739 336641 347084 353036 357203 351035 336465 352840 356762 375210 370592 336221 318670
9050 318670 302181 317291 317828 287456 296926 303306 305150 299475 279354 241275 213286 212620 223739
9037 223739 239201 220500 229835 236720 253759 253839 250898 252778 282910 257301 204157 199481 213414
9024 213414 198772 186906 187651 220464 259078 262843 223787 207379 188817 153605 158934 192807
9012 192807 188861 188290 175428 163156 146192 198529 219248 224582 191070 203748 214505 224286 209082
8999 209082 180377 172062 169649 185427 187391 164707 151328 154402 173782 192333 217975 223968 175219
8986A75219l4599Q202K5557j035q16M579J0493k3923l1678l4791Q597K4849p381
8973A23273L3644Q718j0743k8850J3910L6943m62m74J0377n036N262p451l0792
8960A48319l550n919l1701l696K0624q525p286k2097n308K1621Q542k726j8492
8947H9806j9734j0801N401k6080K1994M6128R937q87j576J5736j0170m265j9604
8934I5885O387J4936k549J706n700k5269j8658l279M792o684J3414j2054j1910
8921E1017L0823L4695k0143l5110p935k7271k0503K6310L5800R605J0940O375
8909I4603k0975l216j2185J2194K1243M0517N627l0451l7357J8294M604k0573
8897G2325J5956L964p879j6568P958J6915k4838l3213M445J3801L1406l75j3464
$$ plain form
8986 175219 140620 148822 174379 173344 172528 177107 187600 163677 131999 97208 105805 130654 123273
8973 123273 156917 165635 154892 126042 139952 176895 176433 175959 186336 181300 186562 179111 148319
8960 148319 144769 138850 107149 103453 124077 115552 108266 86169 80861 102482 111024 108298 89806
8947 89806 70072 59271 64672 38592 60586 106714 116651 115764 114188 129924 119754 115489 95885
8934 95885 102272 117208 114659 116365 110665 85396 66738 63459 68251 61567 74981 62927 51017
8921 51017 81840 116535 96392 61282 53347 26076 5573 31883 67683 77288 88228 94603
8909 94603 73628 70412 58227 70421 91664 132181 137808 107357 70000 88294 92898 72325
8897 72325 88281 92245 84366 67798 75756 92671 67833 34620 39065 52866 84272 83897 70433
8884G0433J3755J9889n583j7609j4294j0491J2459L179L51M761j7989p919l3506
8871A7436K1408N968j5815J4378M46L876Q305k2044l007p757r183J0660M274j5521
8857A3424K2612L1205J842Q251J1382J3355k7222k8364k4546n647J8125K0920
8845E5337p082P335J409L881J911K0822M428q785j0665k5866o375m256J8088j5516
8831C4666M161o814L251o44k2208l9385L7611K2857R029L0084R105l5423l0566
8818A5724r992K039J6556N314K221k9863o37J4903k414J3909J5426O080J0227
8805E9493j5587j9154J2862L6647l30k3555j2527o97M003n580m247J8692L5201
8792H5221k3592j3113J0240m600R347k002l238R043l415k3107l5918k027M4073
$$ plain form
8884 70433 84188 104077 98494 80885 66591 56100 68559 71738 72089 76850 58861 50942 17436
8871 17436 38844 44812 28997 43375 43821 47697 56002 33958 30951 23194 14011 24671 28945 13424
8857 13424 36036 67241 69083 77334 88716 102071 74849 46485 21939 16292 34417 55337
8845 55337 48255 55590 56999 60880 62791 83613 88041 79256 68591 42725 36350 32094 50182 34666
8831 34666 38827 32013 35264 34620 12412 -26973 10638 33495 42524 72608 81713 46290 15724
8818 15724 5732 7771 24327 29641 31862 1999 1362 16265 13851 27760 43186 49266 59493
8805 59493 43906 24752 37614 74261 73931 50376 37849 37152 41155 35575 31328 50020 85221
8792 85221 61629 48516 58756 54156 63503 61501 58263 67306 63891 40784 4866 2839 46912
8779D6912J8938k7123k0557J5516J4422J5k7321n2541j8828K9625K2736n931M5384
8766D1247R233l6094j7624K450N1550m553j60q827r381K4561r64j8739J7171K204
8752E2074k5040j5092J1945l4737J0318K3974L428r117j1770l1065l181O789K0307
8739a167P750P449j7227k586O878J4043R972O224m67q391K2542K2320q400J0185
8725F9125J4067j4528m4296J225R669j342P075K6259l1k3324m2499j9042O984
8712a0658k3540k0269K9293L1681j8609l0502J8214L0802K3381N780k7544K3311
8700C1340L957j3198K8985K1417k7796O967l365R281K8539l0312n3737n404j6879
8687b0205N10o750k383M735K906j399J9846K3720K70m3879K5498N971m10L34j3126
$$ plain form
8779 46912 65850 38727 18170 33686 48108 48123 20802 -31739 -50567 -20942 1794 -4137 41247
8766 41247 50480 14386 -3238 -788 50762 46209 46049 37222 27841 52402 51438 32699 49870 52074
8752 52074 27034 11942 23887 -10850 -532 23442 26870 17753 5983 -25082 -28263 -21474 -1167
8739 -1167 6583 14032 -3195 -5781 1097 15140 25112 31336 30869 22478 45020 67340 58940 69125
8725 69125 83192 68664 24368 25593 35262 33920 40995 67254 67223 43899 1400 -17642 -10658
8712 -10658 -34198 -54467 -25174 6507 -12102 -42604 -24390 6412 29793 35573 8029 31340
8700 31340 35297 22099 51084 72501 44705 51672 48307 57588 86127 55815 2078 -3326 -20205
8687 -20205 -19695 -26445 -28828 -24093 -21187 -22586 -2740 20980 21250 -22629 2869 8840 8430 8764 -4362
8672d362q952J5696Q308j7319Q879J1290J442J0O997j691l277m660J1442q871
8658A4932J4160P878l2841k6972J9484j0649k659O077q614K7308O030m377P625
8645A7382J6389J7596K516k346J764J2257j2163k3914o295L557L1932J5617r968
8632F4324j0329m9494k6701L0913K3015j6205J734p382O015q712j8833k78L489
8619h444P767J0743j411K32K6552k308j3656R173o874M870j4874N980M0360K6583
8605H4693O657l0513Q429L6329J2806j0048j7767l877J7834J3255Q703K7906K4933
8592A79340J1759l064q189K1380K2121J0799K5536J1667k775k2315p6713k4393
8580A45153r537j4768Jj7342k2715j8940O2J4154N646J2610j367j3477o515L454
$$ plain form
8672 -4362 -13314 2382 10690 -6629 2250 13540 14982 14992 21989 20298 17021 12361 23803 14932
8658 14932 29092 36970 4129 -22843 -3359 -14008 -16667 -10590 -19204 8104 14134 9757 17382
8645 17382 33771 51367 53883 51537 53301 65558 53395 29481 23186 26743 58675 74292 64324
8632 64324 53995 4501 -22200 8713 31728 15523 17257 9875 15890 7178 -11655 -11933 -8444
8619 -8444 -677 10066 8655 8887 35439 33131 19475 28648 21774 26644 11770 17750 58110 84693
8605 84693 91350 60837 69266 105595 118401 108353 90586 86709 104543 117798 126501 154407 179340
8592 179340 191099 188035 179846 201226 223347 234146 259682 271349 268574 246259 169546 145153
8580 145153 135616 120848 120849 103507 80792 61852 61914 76068 81714 94324 92957 79480 72965 76419
8566G6419k3779k5084j775l7959K3180M0116J411J8707J1709l9507l3321k834
8554G283j0196j5743p097L0437K0514L969J4880j4468j698j8843n191J9453J184
8541B4484j7024j9031J0209l654j2135Q279Q069K5673M314k4667j9593j9405K4418
8528a0063K8823J6292j51J1325l897k182M489k0363k5002j436J5873O887q634
8515A1961O310N2806J6545r813J7801l8332j6654j8330J1042k0843o607J657J0870
8502A8413m462k6431j4732N314O684k765j2821L167j806M3994K8168l219j441
8489C8063j2214j3368J7490K165J5924L748n0079j575n177J2718l762j6372K9322
8476A6883J3625j1401m1480n084L1790m095k3581j1763K7479J2920o2j1983j1261
$$ plain form
8566 76419 52640 27556 25781 -12178 11002 51118 52529 71236 82945 43438 10117 7283
8554 7283 -2913 -18656 -25753 4684 25198 29167 44047 29579 27881 9038 3847 23300 24484
8541 24484 7460 -11571 -1362 -5016 -17151 -8872 -803 24870 29184 4517 -15076 -34481 -10063
8528 -10063 18760 35052 34901 46226 42329 40147 44636 24273 -729 -2165 13708 20595 11961
8515 11961 18271 71077 87622 77809 95610 57278 40624 22294 33336 12493 5886 7543 18413
8502 18413 13951 -12480 -27212 -21898 -15214 -17979 -30800 -27633 -29439 14555 42723 39504 38063
8489 38063 25849 12481 29971 32136 48060 51808 1729 154 -5023 7695 3933 -12439 16883
8476 16883 30508 19107 -22373 -27457 4333 238 -23343 -35106 -7627 5293 5231 -6752 -18013
8463a8013k0795J9150M2546O464l8321n925K770J6405J0880L3755l207m4724k0598
8450a9613R660O31q926O63J0388j1068j7418M184J8612K0792L897M989J3294J937
8436C2022j3900k1092j6325J6868k3415n558k815q270j86k91J6450K7333K5199
8423B6020J1072j0325J9332j2217o753j1534l4006j3691R399J128Q843L5473j1517
8410A1224N714M1210q547o1526q67K1669k8613j1690n794q600K8733K0332k056
8397A189p245k0007l865q755J4468j5770K6500J8384k2603q409K2355l024J812
8384d970K7374J5030j0600l0614k5956k4908J7908L7469M7815j9853j7062K2375
8372C4008R964m8717l7477o614L3973j2660o376M911J0045J6185L5395K390k0311
$$ plain form
8463 -18013 -38808 -19658 22888 29352 -8969 -14894 -12124 4281 15161 48916 45709 985 -19613
8450 -19613 -9953 -9322 -18248 -17585 -7197 -18265 -35683 -31499 -12887 7905 11802 16791 30085 32022
8436 32022 18122 -2970 -19295 -2427 -25842 -31400 -34215 -42485 -42671 -42962 -26512 821 26020
8423 26020 37092 26767 46099 33882 27129 15595 -18411 -32102 -22703 -21575 -12732 22741 11224
8410 11224 16938 58148 49601 -11925 -12792 8877 -19736 -31426 -37220 -45820 -17087 3245 1189
8397 1189 -6056 -26063 -29928 -38683 -24215 -39985 -13485 4899 -17704 -26113 -3758 -6782 -4970
8384 -4970 22404 37434 26834 -3780 -29736 -54644 -36736 733 48548 28695 11633 34008
8372 34008 43972 -4745 -42222 -48836 -14863 -27523 -33899 -28988 -18943 -2758 32637 35027 14716
8359A4716j4116N512M9409m310j5823l6506k4474q063L921K1194J4881p499k536
8346c694l0407l4230j8443J9944M551n342J7687j133J6455J4300J1822K2459L4368
8333D8337m358j3614j7137k5579L002n495k504N902j916l5217j5517J8473M5961
8320C38J8110J1571J4704J0370j1125j9791k8677n30K280o080K455K5255K7489
8307D6369p235o977q81R452j5531J4940J4784k2281O122j1354l6416J7629L1010
8294C9631j7200j4391j7739K1534J2329k5470j0580j1733K976O147K5005l98n487
8281D624j7931l887J6845N839j4561j9430K9544M3837r931o059j8778J1941J0237
8268C2290j1768k0532N336O205O11m361L1523m983J850J1696n38l4096k8137L1655
$$ plain form
8359 14716 600 6112 55521 51211 35388 -1118 -25592 -33655 -29734 -8540 6341 -1158 -3694
8346 -3694 -34101 -68331 -86774 -66830 -62279 -67621 -49934 -51067 -34612 -20312 -8490 13969 48337
8333 48337 43979 30365 13228 -12351 -9349 -14844 -17348 -11446 -13362 -48579 -64096 -45623 338
8320 338 18448 30019 44723 55093 43968 24177 -4500 -5030 -2750 -8830 -6375 18880 46369
8307 46369 39134 32157 31276 40728 25197 40137 54921 32640 38762 27408 -9008 8621 39631
8294 39631 22431 8040 -9699 11835 24164 -1306 -11886 -23619 -20643 -14496 10509 10111 4624
8281 4624 -13307 -17194 -349 5490 -9071 -28501 1043 44880 34949 28890 10112 22053 32290
8268 32290 20522 -10 5326 11531 12142 7781 39304 34321 36171 47867 47329 13233 -14904 16751
8254A6751K6742k8021n729k1884k877j7171n559J3696M658K9958K0629L2788K5637
8241H9618j1119k5326j6121J3009j1868J4072n150j0635k6256J1823R486J1391
8229D2924j6917r430J6418J926Q956P519J8557p196K560j0130l0786k3246j1693
8216a0538n961K0961R809j5484J1704k5067J044K767j2496R250R339K731j967
8203c908O747m391L2056N1685p759p457j0162J885r407K6655J691o502l6394l8192
8189c453M554J6421j2882j1018L5240J3391j6100J9376J0455k3348k8552l9766
8177c5682q808P057K2672K8922K2614q10j4157R072p675j1776j0857J3790K0106
8164C4468m563l5479J2557K614j6544J4332L723J506K3144o578J903k0454k5981
$$ plain form
8254 16751 43493 15472 9743 -12141 -15018 -32189 -37748 -24052 -19394 10564 31193 63981 89618
8241 89618 78499 53173 37052 50061 38193 52265 47115 36480 10224 22047 31533 42924
8229 42924 26007 16577 32995 34921 43877 51396 69953 62757 65317 55187 24401 1155 -10538
8216 -10538 -16499 4462 14271 -1213 10491 -14576 -13532 -10765 -23261 -14011 -4672 -1941 -3908
8203 -3908 2839 -1552 30504 82189 74430 66973 56811 58696 49289 75944 77635 71133 34739 -3453
8189 -3453 1101 17522 4640 -6378 28862 42253 26153 45529 55984 32636 4084 -35682
8177 -35682 -44490 -37433 -14761 14161 36775 35965 21808 30880 23205 11429 572 14362 34468
8164 34468 29905 -5574 6983 9597 -6947 7385 11108 12614 35758 29180 31083 10629 -15352
8151a5352O458K0097n24K3148J4061l0378l3370L0213J3996l830l555o014L481
8138A8431j3048j4589K6511j6792o033l406O201r82Q295J9955p000o351j5064
8125c872K7923k322o927j7748l4741m593K7048R882M6O052K4474k7882j2532J0291
8111d901J2183q274L34J4430k7290k8520p195J102p162J1074l167L6528L732j7528
8097b4654J5137J8350j8337j1978j1297L2234J5375k8001l660K7596K9478K7677
8085F7920l62l3852r127J1781o287r194l3621J0411P298J6976o14n649n700j6810
8071f830j8831K1086L4623J0060R357M414Q251M722r48k2843j8045Q977k2658
8058A1335l4967q900K6093m705j1231o560j4617m41j364K3690J046J2184M038
$$ plain form
8151 -15352 -8894 11203 10679 33827 47888 17510 -15860 14353 28349 24519 20964 14950 18431
8138 18431 5383 -9206 17305 513 -5520 -8926 -2725 -3707 4588 24543 17543 11192 -3872
8125 -3872 24051 21729 14802 -2946 -37687 -42280 -15232 -5350 -5304 748 25222 -2660 -15192 -4901
8111 -4901 7282 -992 -658 13772 -13518 -42038 -49233 -48131 -55293 -44219 -47386 -10858 -7126 -24654
8097 -24654 -9517 8833 -9504 -21482 -32779 -545 14830 -13171 -16831 10765 40243 67920
8085 67920 67558 33706 24579 36360 30073 20879 -12742 -2331 4967 21943 21329 15680 9980 -6830
8071 -6830 -25661 -4575 30048 40108 49465 53879 62130 66852 65904 43061 25016 33993 11335
8058 11335 -23632 -32532 -6439 -11144 -22375 -28935 -43552 -43993 -45357 -21667 -20621 -8437 -4399
8045d399j3273P815M2373m056k5348j663P683l2573m609K5867J5445j0757p033
8032d528Q57k3354k9756J8412N1251R458p382p960K8976L2237J2209l8117k1976
8019B0327k7553j6820n006J4749K9939J7274j7819j6437L235r039J6217J3243
8007B2310j5151j2680K474K747J1135K3855L6558o74j1797R479r099l8368j0881
7994I908o083K8481K0871K0789k1684M308p737j1762m061m165k2206K4957j4240
7981A7376j3498K444K7345k245m1998r882K4942M557R994L2141j0908k1242j1297
7968G729k987O462J5902K1912l618m197r389J0764J6892j6523j2313L8621J585
7955G0840l808k5932K09K0459j7520m5328k9040L665J353J6764Q940J9027k275
$$ plain form
8045 -4399 -17672 -9857 32516 28460 3112 1449 9132 -23441 -28050 -2183 13262 2505 -4528
8032 -4528 -3671 -27025 -56781 -38369 12882 22340 14958 6998 35974 68211 80420 42303 20327
8019 20327 -7226 -24046 -29052 -14303 15636 32910 15091 -1346 1889 -7150 9067 22310
8007 22310 7159 -5521 -3047 -300 10835 34690 71248 70574 58777 68256 59157 20789 9908
7994 9908 3825 32306 53177 73966 52282 56590 48853 37091 33030 28865 6659 31616 17376
7981 17376 3878 6322 33667 31422 -10576 -20458 4484 9041 19035 51176 40268 19026 7729
7968 7729 4742 11204 27106 49018 45400 41203 31814 42578 59470 42947 30634 69255 70840
7955 70840 67032 41100 41309 61768 44248 -1080 -30120 -26455 -25102 -8338 602 19629 17354
7942A7354O647j5845m770N83J4561M762L0704j3316j5401k6221k0837L2815K0929
7929C1965l7342L813M025j527j78L0260J6420L824j6245J2701L827K8048j9763
7916E9828j9284l6359k1411K0989R924j7353l143J1032j9251J837K3309N1665
7904F1783J6554n860j5409m6078k0587j8754p058o903K9882L5381k7329O91J7410
7891A3723P622l478N331M322Q899K2129R968k6864l7543J7297k9767j8948l082
7878c0391j5713K8118J8478J2272j5821k4180q332l094K809K9864o360l173j2983
7865b8506J8967K1146L734J8508q895J9019J1099k5685j7895j798J9102J4261
7853D3057N887o805l1791n772l105J5104J6222j0476j3627k2144J7756J3096k177
$$ plain form
7942 17354 24001 8156 3386 3969 18530 23292 53996 40680 25279 -942 -21779 11036 31965
7929 31965 -5377 -1564 2461 934 756 31016 47436 51260 35015 47716 51543 79591 59828
7916 59828 40544 4185 -17226 3763 13687 -3666 -6809 4223 -15028 -13191 10118 61783
7904 61783 78337 72477 57068 10990 -9597 -28351 -35409 -42312 -12430 22951 -4378 -3687 13723
7891 13723 21345 17867 23198 27520 36419 58548 68516 41652 4109 21406 -8361 -27309 -30391
7878 -30391 -46104 -17986 492 12764 -3057 -27237 -35569 -38663 -35854 -5990 -12350 -15523 -28506
7865 -28506 -9539 11607 15341 33849 24954 43973 55072 29387 11492 9694 28796 43057
7853 43057 48944 42139 10348 4576 1471 16575 32797 22321 8694 -13450 4306 17402 15225
7840A5225J695j2533K1683J7006j4629k7384k2223j599K1939L0082L9177R542
7828G7981j5161j0248k5446j0632P745K986j5784p43J164J1063O880l0962j8559
7815a9716q355l0010q450J4729R189L393L4346K2425J6641K01N546L957K408J5972
7801F2276k4183k2844K405k0453k1000J3234l994L556J4199K6428l100k0964k0489
7788a4929o188J3039J7116p601k1955R549M1625P919J2486M751j7713r357R222
7775C7964J3375K007r162J8656j8053j5663J5481K561Q659j8464N26k512l2228
7762C147n9733j337K9897J027O981q824q85M8954K916j7980q974j3999J2248L2614
7748B6052P982j3911M6018M421k0252n621j5493m166k6626l3463q197N654J867
$$ plain form
7840 15225 16920 4387 26070 43076 28447 1063 -21160 -22759 -820 29262 68439 77981
7828 77981 62820 52572 27126 16494 24239 27225 11441 10698 11862 22925 29805 -1157 -19716
7815 -19716 -28071 -58081 -66531 -51802 -42613 -39220 -4874 17551 34192 34393 39939 43896 46304 62276
7801 62276 38093 15249 17654 -2799 -23799 -10565 -14559 -11003 3196 29624 26524 5560 -14929
7788 -14929 -21117 -8078 9038 1437 -20518 -10969 30656 38575 51061 55812 38099 28742 37964
7775 37964 51339 53346 44184 62840 44787 29124 44605 47166 55825 37361 37887 35375 3147
7762 3147 -56586 -57923 -28026 -26999 -20018 -28842 -29727 19227 22143 4163 -4811 -18810 -6562 26052
7748 26052 34034 20123 66141 70562 50310 44689 29196 25030 -1596 -35059 -43256 -37602 -35735
7735c5735J8392K1950K2917J0747R789J2704L748k6370r668L553o641r508L898
7722A9776o652j1031K5856j5734j1088K1656j5365j4825j6977q038P334q836J9655
7709a4269J7716J5871K5888K6476j8585j2145j4672k3754J0561J0922k1996j6173
7697a4160j6638K2139J8484K375k3042j3195K3931M90m1020K035Q451J5985j692
7684a5857j5390k9587L564K5180J5594K5480j2080l3182j6645K22L0717J0786
7672a1198k1055J0876J8316j069K0350j5957j8652j343l671n443j6957K3877K6318
7659D392K2376N546P571O522j4117k8878r502k2744k5865j4127J6816k7574k690
7646h2274K3306k6741K781K4930K2370K4739L9104k4540k0348J0954q148l7631
$$ plain form
7735 -35735 -17343 4607 27524 38271 48060 60764 64512 38142 28474 32027 25386 15878 19776
7722 19776 13124 2093 27949 12215 1127 22783 7418 -7407 -24384 -32422 -25088 -33924 -14269
7709 -14269 3447 19318 45206 71682 53097 40952 26280 2526 13087 24009 2013 -14160
7697 -14160 -30798 -8659 9825 12200 -10842 -24037 -106 384 -40636 -38601 -30150 -14165 -15857
7684 -15857 -31247 -60834 -57270 -32090 -16496 8984 -3096 -36278 -52923 -52701 -21984 -11198
7672 -11198 -32253 -21377 -3061 -4130 16220 263 -18389 -19732 -23403 -28846 -45803 -21926 4392
7659 4392 26768 32314 39885 46407 32290 3412 -6090 -28834 -54699 -68826 -52010 -79584 -82274
7646 -82274 -58968 -85709 -82928 -57998 -35628 -10889 28215 3675 -16673 -5719 -13867 -51498
7634e1498N270J1617J6536l86l2584k0404R837K2380L1887L493l0493k7023m842
7621f6210J2988J4364k0340K5196J4949n517K85p281J4558j6340M447Q182k4233
7608d4952J2380K5934k561j3565p504J1134J004J9350j8236j6616L918P582k514
7595b4646J1086K5878J5545l272P934L8852r472j2664j0891m5880j6202n963O440
7582b3255P382j1603l254k449L2018M997k806k4580j1099L2082N416J6076K2778
7569D1703l1915o011J5304p794j9793k6221R449J2044M964m678L965J0863J0243
7556A2123K4318M337k8608o810m844N25Q146l879l531m41K8263j4655N616K4299
7542D4859k6249k7126M533j4818k0032K8404J4162J0844P028J5780L8895j7990
$$ plain form
7634 -51498 -46228 -34611 -18075 -18461 -51045 -71449 -61612 -39232 -7345 -3852 -34345 -61368 -66210
7621 -66210 -53222 -38858 -59198 -34002 -19053 -24570 -24285 -31566 -17008 -33348 -28901 -20719 -44952
7608 -44952 -32572 -6638 -9199 -22764 -30268 -19134 -18130 1220 -17016 -33632 -29714 -22132 -24646
7595 -24646 -13560 12318 27863 24591 32525 71377 61905 49241 38350 -7530 -23732 -29695 -23255
7582 -23255 -15873 -27476 -30730 -33179 -1161 3836 1030 -23550 -34649 -2567 2849 18925 41703
7569 41703 9788 3777 19081 11287 -8506 -34727 -25278 -13234 -8270 -12948 -8983 1880 12123
7556 12123 36441 40778 12170 5360 516 1041 9187 5308 1777 1336 29599 14944 20560 44859
7542 44859 18610 -8516 -3983 -18801 -38833 -10429 3733 14577 21605 37385 76280 58290
7530E8290j7734J3936O883n998K726K827j7270l9278l662r176O926M609j4790
7517a1711j1368J0179k7956P503K8012M679j4035q284K3544J8405j7487l0133
7505b8652p919n276K1130K5580J7589R917k9647k9131k1710j0396K2613K5600
7493a0302n513n081K706K3061n135l4789j3768J8258N939J7403J1857J6914p016
7480A4534j8445K8013J1946J4620k273n2854q000O695K3226L0428P515k0811p362
7467B7232k5637K7208J6328r601o082l531m897J1130k9955n015j2479k858r36
7454a9093j2620j4119k4543L2746J4002j1145J3803J4574o998r820m860J0584
7442a7489M393K2965L2109k9917K6K9598q641j1961j8025J469K6650J7855K3914
$$ plain form
7530 58290 40556 54492 61375 55377 58103 60930 43660 4382 720 -8456 -1530 3079 -11711
7517 -11711 -23079 -12900 -40856 -33353 -5341 -662 -14697 -22981 563 18968 1481 -28652
7505 -28652 -36571 -41847 -20717 4863 22452 32369 2722 -26409 -48119 -58515 -35902 -10302
7493 -10302 -15815 -20896 -18190 4871 -264 -35053 -48821 -30563 -24624 -7221 4636 21550 14534
7480 14534 -3911 24102 36048 50668 48395 -4459 -12459 -5764 17462 47890 55405 34594 27232
7467 27232 1595 28803 45131 35530 29448 25917 21020 32150 2195 -2820 -15299 -18157 -19093
7454 -19093 -31713 -45832 -70375 -37629 -23627 -34772 -20969 -6395 -13393 -23213 -28073 -17489
7442 -17489 -13096 9869 41978 12061 12087 41685 33044 21083 3058 4527 31177 49032 72946
7429G2946l9119r519j5838j6015m170K1819Q861J970J4227q429l638m2001m121
7416b3027K4587q127R459P81j181j2431L912l792k2869N737O68K3214P560K2478
7402B6969K1014j2563k452P630K213k1149k9842j7463j3157L6506K3868K424k1419
7389B579k0583K038q384j8543J4809K7299K7438j5858j8866K9356r948J5958m463
7376B2832K139k1596l4326N669J6489J645j7314k2364k8435Q930N2745K8678J4368
7363B9460K0172l0516k759o509k5896J4126M684l6934J6690L0993j805M080j6957
7350a171k7792M7617Q016m0154l5892o430L893K5567L1771J5934k6631k195J2623
7337E156m665m068J9421J1210J214j4234k6097q102j4274q703J8381M771k522
$$ plain form
7429 72946 33827 24308 8470 -7545 -11715 10104 18965 20935 35162 26733 23095 -18906 -23027
7416 -23027 1560 -6567 2892 3673 2492 -9939 -6027 -9819 -32688 -26951 -26283 -3069 4491 26969
7402 26969 47983 35420 32968 40598 42811 21662 -8180 -25643 -38800 -2294 21574 23998 2579
7389 2579 -18004 -15966 -24350 -42893 -28084 -785 26653 10795 -8071 21285 11337 27295 22832
7376 22832 24971 3375 -30951 -25282 -8793 -7148 -24462 -46826 -75261 -66331 -13586 15092 29460
7363 29460 49632 19116 16357 9848 -16048 -1922 2762 -34172 -17482 13511 11706 15786 -1171
7350 -1171 -28963 18654 26670 -13484 -49376 -55806 -51913 -26346 5425 21359 -5272 -7467 5156
7337 5156 491 -3577 15844 27054 28268 14034 -12063 -20165 -34439 -43142 -24761 -19990 -22512
7324b2512M364r275L5732M610j6639k0129Q734j5088j7839N745L4437J9011l3670
7311b2519m4329n929J6208J2451k3j748K4016L4532k0721n323q748O858J1689
7298c586P553Q259J1762k3792J0751J7716k0282p354J0762j3695j9531J7959P286
7285C808k9990K3184K4643r98P043K784k7088l1218K429J9884k899l6215k2125
7272f6758J4910l92p751P490L558O455J7015K1487O704j232n373j0623r930N605
7258a8835p766K1480o569j5587J5560q105k4776k0881j473P287K438j7734J5507
7245e9454n581j7287L449l054j9732o943N2352K6748K3423J7253R918M602j4596
7232A1098k7872j8519L92q753k244l471L033R829q87J5734J348q896O782j6385
$$ plain form
7324 -22512 -18148 -27423 8309 12919 -3720 -23849 -15115 -30203 -48042 -42297 -7860 11151 -22519
7311 -22519 -66848 -72777 -56569 -44118 -44141 -45889 -21873 12659 -8062 -13385 -22133 -15275 -3586
7298 -3586 3967 12226 23988 196 10947 28663 8381 1027 11789 -1906 -21437 -3478 3808
7285 3808 -26182 -2998 21645 20647 27690 30474 3386 -27832 -25403 -5519 -8418 -44633 -66758
7272 -66758 -51848 -52240 -59991 -52501 -48943 -42488 -25473 -3986 2718 1486 -3887 -14510 -24440 -18835
7258 -18835 -26601 -5121 -11690 -27277 -11717 -19822 -44598 -65479 -66952 -59665 -57227 -74961 -59454
7245 -59454 -65035 -82322 -78873 -81927 -101659 -108602 -56250 -29502 -6079 11174 21092 25694 11098
7232 11098 -16774 -35293 -34901 -43654 -45898 -49369 -46336 -36507 -37394 -21660 -20312 -29208 -22426 -38811
7218c8811j5918K0728M997P549Q741j2902k731K6543K3046L645K0129J1092k4509
7205C1599k9845j4888P991l3103p231J3988j6840j8272j519J3928J9765L1229
7193c198j887k7050K0814Q052K5758L060j2642O6607J0176k5823j854k0327j2924
7180B8762j7419j0250j0358o921K8922Q33m239o717J3604m9319J0356l615j735
7167b8096r128K2033k166k1778N535m388M2767L2639J9724j0003k7055j6478k7305
7154b3699L3769k0740j6604l148J6403n169k9184j2736L77j8503L4865L0899L160
7141a0310j4055j1419O131K2881m105j0320j4600J6327q245J1028J5358n097K81
7128f145o131K1630M436n964o002J4124r472L1281P52n8121j4785j4029Q223J3023
$$ plain form
7218 -38811 -54729 -34001 -29004 -21455 -12714 -25616 -28347 -1804 21242 24887 45016 56108 31599
7205 31599 1754 -13134 -5143 -38246 -45477 -31489 -48329 -66601 -68120 -54192 -34427 -3198
7193 -3198 -5085 -32135 -11321 -3269 22489 25549 12907 79514 89690 63867 62013 41686 28762
7180 28762 11343 1093 -9265 -16186 12736 13569 9330 2613 16217 -33102 -22746 -26361 -28096
7167 -28096 -37224 -15191 -17357 -39135 -33600 -37988 4779 37418 57142 47139 20084 3606 -23699
7154 -23699 10070 -10670 -27274 -30422 -14019 -19188 -48372 -61108 -60731 -79234 -44369 -13470 -10310
7141 -10310 -24365 -35784 -29653 -6772 -10877 -21197 -35797 -19470 -27715 -16687 -1329 -6426 -6145
7128 -6145 -12276 9354 13790 7826 1824 15948 6476 37757 38509 -19612 -34397 -48426 -40203 -27180
7114b7180p725L898J0824J8895j1608j9276j5384k779J2389r105m6374J7425M9755
7101b6245o628m440l799j2565o564m697J929P690L6616M931O735q976r13K5481
7087H555J6878j2734l672j6225k2665M311r37k9846J0927q255J727j9994K4163
7074d7767K9604L8775q963j7382k11K249J4397J9489J535j4854j380J9567O780
7061D1839j3954p354j8862k206N855k343L824k5995k1024l257K9029J9116j720
7048B948n642l6201l1426M648M4778J6093l977M391k1443p152q442J8531J0088
7035a2806j9184k0247K6475L5980m4891n0403O746L4756M5505J6764L3460k6598
7023B5557k4949k0036L5476R821K174o543m194N747J3701Q094k8739l228l0697
$$ plain form
7114 -27180 -34905 -31007 -20183 -1288 -12896 -32172 -47556 -50335 -37946 -47051 -93425 -76000 -26245
7101 -26245 -32873 -37313 -41112 -53677 -60241 -64938 -63009 -55319 -18703 -13772 -7037 -16013 -16926 8555
7087 8555 25433 12699 9027 -7198 -29863 -25552 -26489 -56335 -45408 -53663 -51936 -71930 -47767
7074 -47767 -18163 20612 11649 -5733 -5944 -3695 10702 30191 31726 16872 15492 35059 41839
7061 41839 27885 20531 1669 -537 5318 2975 6799 -19196 -40220 -43477 -14448 4668 2948
7048 2948 -2694 -38895 -70321 -65673 -20895 -4802 -8779 -4388 -25831 -32983 -41425 -22894 -12806
7035 -12806 -31990 -52237 -25762 10218 -34673 -85076 -78330 -43574 1931 18695 52155 25557
7023 25557 608 -19428 16048 25869 28043 21500 17306 23053 36754 44848 16109 12881 -17816
7010a7816k0213J3124j188J5684K4389j0325J0280k087k448O291R908j9192k9764
6997b3357j0562p585J7642k5473J9312L6316L301J3286j1468o396K7023K1454
6985E3493j1959j9433l0607K9649l681k8478p421l213K881j8639p578k495m719
6972e2200K3163k009r716K3602J4667K5858m293L8294P992m603k9686l2202j0546
6959a1679N509K637J2274K0790j0559K2740J3290k5396m648j6693o826j2180j6246
6946b6987L775j7127K6812L4823l326j443K287j4277j6606j5824k0364J824L324
6933d3109K3579K2179M484q731l3106q665K9660J8060p268k2138K2173O875k7316
6920b3323j0759L8678O082J7699P835m8648o970L3062o956j9279J8932K6957l6583
$$ plain form
7010 -17816 -38029 -24905 -26093 -10409 13980 3655 13935 11848 9400 15691 25599 6407 -23357
6997 -23357 -33919 -41504 -23862 -49335 -30023 6293 9594 22880 11412 5016 32039 53493
6985 53493 41534 22101 -8506 21143 17462 -11016 -18437 -21650 -18769 -37408 -44986 -47481 -52200
6972 -52200 -29037 -31046 -40762 -17160 -2493 23365 19072 57366 65358 60755 31069 -1133 -11679
6959 -11679 -6170 -3533 8741 29531 18972 41712 55002 29606 24958 8265 1439 -10741 -26987
6946 -26987 -23212 -40339 -13527 21296 17970 16527 18814 4537 -12069 -27893 -48257 -46433 -43109
6933 -43109 -19530 2649 7133 -1598 -34704 -43369 -13709 4351 -2917 -25055 -2882 3993 -23323
6920 -23323 -34082 4596 10678 28377 36212 -12436 -19406 13656 6700 -12579 6353 33310 -3273
6907c273k0012J9961j6525K3029l310j5087m8209q615L8734R65J0473N427J9474
6894C032n243M88j5110j3464M28K1787l399l219L211O163l5210J424L3664j6271
6880b1719j1096m426l7407n543K6376L3372J2181j9791n044K691P434l944k1888
6867d8804k271J9653j3079k1834L4090M6168m488k5772k1666k2270m649K4756
6855d0166M2911J7843j6626Q466p1n478Q098j3193j6141J3225L1473n611j5324
6842I406j2978q529J3968L1213o937j9673Q414r587j3385j5584k7109L1801K6106
6829G126j5421j888q444N603o954j3643J2118K1669K4615j0039l2182j5723J1599
6816b1564J5830R73k7573K4534K4334J5707k7537k4424k0681O697M712R514j0345
$$ plain form
6907 -3273 -23285 -3324 -19849 3180 -130 -15217 -63426 -72041 -33307 -32342 -21869 -16442 3032
6894 3032 -2211 -1723 -16833 -30297 -29869 -8082 -11481 -14700 -11489 -5326 -40536 -39112 -5448 -21719
6880 -21719 -32815 -37241 -74648 -80191 -53815 -20443 -8262 -28053 -33097 -30406 -22972 -26916 -48804
6867 -48804 -51075 -31422 -44501 -66335 -32245 13923 9435 -16337 -38003 -60273 -64922 -40166
6855 -40166 2745 20588 3962 12428 12357 6879 14977 1784 -14357 -1132 30341 24730 9406
6842 9406 -3572 -12101 1867 33080 26143 6470 14884 5297 -8088 -23672 -50781 -18980 7126
6829 7126 -8295 -10183 -18627 -13024 -19978 -33621 -21503 166 24781 14742 -17440 -33163 -21564
6816 -21564 -5734 -4761 -32334 -7800 16534 32241 4704 -19720 -40401 -33704 -28992 -19478 -29823
6803b9823J22l007N249K2765M8963j8326j9635l1864J4338Q939Q193K5454J8886
6790E0254J4355k7346l9001O124r353o843j7235K0932j1589J7345j0408l8295
6778e1060J1209J0171k0381J5537l983m861J5805J69j687L936R453O27k624L0589
6764A2900M7523p889k3271l1516j0191J7664q691L891K0520K3530k9525l2471
6752a7526j0562j849J9229J9688n449m938K2876k5772j349J1429K1820j955p875
6739A7767j5547K1402K6174j2285l1019l0167k1087j0775M866J5162J745J7564
6727a6200J10q225O964O33k097J8968k3781q546L542J609K0083P0860M3584L9241
6713A46745J9307j9919n9319m1883r624l0155k8617q325M4996J8642K132l0634
$$ plain form
6803 -29823 -29701 -32708 -27459 -4694 44269 25943 6308 -25556 -11218 -2279 5914 31368 50254
6790 50254 64609 37263 -1738 4386 -4967 -11810 -29045 -8113 -19702 -2357 -12765 -51060
6778 -51060 -39851 -29680 -50061 -34524 -38507 -43368 -27563 -27394 -29081 -25145 -15692 -15065 -17689 12900
6764 12900 60423 52534 29263 -2253 -12444 5220 -3471 420 20940 44470 14945 -17526
6752 -17526 -28088 -29937 -10708 8980 3531 -1407 21469 -4303 -5652 5777 27597 25642 17767
6739 17767 2220 23622 49796 37511 6492 -23675 -44762 -55537 -50671 -35509 -33764 -16200
6727 -16200 -16090 -24315 -17351 -16718 -18815 153 -23628 -32174 -28632 -27023 -6940 63920 107504 146745
6713 146745 166052 146133 86814 44931 35307 5152 -23465 -31790 13206 31848 33980 3346
6701C346j9025j1179K23n689j3887J4591L0830J0575j698n596N302J1423j3442
6688E774j4424j5553l2001M553K2028O724J0504K8478j0130j831k3744j7925L4671
6675b876J4174k719R9n82k7267j4877J2525L6723P947m409J271j5273J6900K6467
6661D8103j0073m0084n326J3926p596J4763K6103q606m549N875m107j7526r53
6648I950j7896j5966j402J0035K3337L0929l4407l5008J7098L0143J5267l5271
6636c191n16o983p562m1852J5054r65j2666j1579L1480J6290K0069K133j9564
6623a9852l5618j5709P854q079J6520M0888l450K3457k2444k1443p58j1231M040
6610d5825j0365J4077K3005M4412K467l952k1827l6557m0901j1810K7816J1819
$$ plain form
6701 3346 -15679 -26858 -26635 -32324 -46211 -31620 -790 9785 8087 2491 7793 19216 5774
6688 5774 -8650 -24203 -56204 -51651 -29623 -22899 -12395 16083 5953 4122 -19622 -37547 -2876
6675 -2876 11298 8579 8678 8096 -19171 -34048 -21523 15200 23147 18738 20009 4736 21636 48103
6661 48103 38030 -2054 -7380 6546 -1050 13713 39816 31210 26661 32536 28429 10903 9950
6648 9950 -7946 -23912 -25314 -15279 8058 38987 4580 -30428 -13330 16813 32080 -3191
6636 -3191 -3707 -10690 -18252 -60104 -45050 -46015 -58681 -70260 -38780 -22490 -2421 -288 -19852
6623 -19852 -55470 -71179 -63325 -71404 -54884 -13996 -17446 6011 -16433 -37876 -38634 -49865 -45825
6610 -45825 -56190 -42113 -19108 25304 27771 23819 1992 -34565 -75466 -87276 -59460 -47641
6598d7641J8471Q91K1543L0024k9886J2943n927l4152l6364r00K7719K7853P156
6585h270j775j9388j0166n033l3451R76L2192J7207K507l513j8466K7646K8955
6572I421k4388N71l108j7395n021J1111K662N597K348j990R923j6554K6015J9754
6558A8946j251k2484J887J5734k6181Q755K264O549k5095j5934m651J2696O054
6545b2711j0947r227o599o279Q797j1223J9070K3006J5075M032J7412N341N378
6532C1125r166n96L0609k6309l4740m8179J3488K9441J4748j2181k8953q561J0833
6519c8441K9239K4803L9612N160P41k5267j8021R63N147J4731M21J0438j3737
6506C5789K97j4363j1147j3499Q404K8287K378l4142j7281J166j6054j2112K2281
$$ plain form
6598 -47641 -29170 -28279 -6736 23288 -6598 6345 418 -33734 -70098 -70998 -43279 -15426 -8270
6585 -8270 -10045 -29433 -39599 -44632 -78083 -77107 -44915 -27708 -25201 -28714 -47180 -19534 9421
6572 9421 -14967 -14396 -17504 -34899 -39920 -28809 -26147 -20550 -18202 -20192 -10269 -26823 -808 18946
6558 18946 17695 -4789 -2902 12832 -13349 -4594 -2330 4219 -20876 -36810 -41461 -28765 -22711
6545 -22711 -33658 -42885 -49484 -55763 -46966 -58189 -39119 -16113 -1038 2994 20406 25747 31125
6532 31125 21959 21363 51972 25663 -9077 -57256 -43768 -14327 421 -11760 -40713 -49274 -38441
6519 -38441 -9202 15601 55213 60373 61114 35847 17826 18789 23936 38667 39088 49526 35789
6506 35789 36086 21723 10576 -2923 5481 33768 36146 2004 -15277 -14111 -30165 -42277 -19996
6493a9996J5824J666M260j0391K2774J0564j4262k1438k4033J2543O681M238Q383
6480c187m358M790j7040J1450R273K0461K882j860N379m890L674p571l4055l62
6466a5414j228N293k4725J3698J1456k2856j2764p676K1774j779K9794k955k7564
6453c4946k3910K0030l828k023j2230L2835P703P146n608M458l503L092k3075
6440c3859k8026N628J0702q182m451n798K8999L3749r39K1077j522K7569j6411
6427B8536k7604p821Q418k4466L266Q031J9378J8374j4259m1611j9678L3443l455
6414a9448j0559j1085J1870j1473k8934O859L5484K0589R373J4432k8388J6354
6402E074O402j6936M122m612J2816k4505j5761K3086J9102p264j3719k588L6895
$$ plain form
6493 -19996 -4172 -2506 1754 -8637 14137 24701 10439 -10999 -35032 -22489 -15808 -11570 -3187
6480 -3187 -7545 -2755 -19795 -8345 928 21389 24271 22411 27790 22900 26574 19003 -15052 -15414
6466 -15414 -16642 -11349 -36074 -22376 -10920 -33776 -46540 -54216 -32442 -34221 -4427 -7382 -34946
6453 -34946 -58856 -38826 -42654 -44677 -56907 -24072 -16369 -9223 -14831 -10373 -13876 -10784 -33859
6440 -33859 -61885 -56257 -45555 -53737 -58188 -63986 -34987 -1238 -2177 18900 17378 44947 28536
6427 28536 932 -6889 1529 -22937 -19671 -11640 7738 26112 11853 -29758 -49436 -15993 -19448
6414 -19448 -30007 -41092 -29222 -40695 -69629 -62770 -27286 -6697 2676 17108 -11280 5074
6402 5074 11476 -5460 -1338 -5950 6866 -17639 -33400 -10314 8788 1524 -12195 -14783 22112
6389B2112K2344J5440J0554R6p042m353j123r159j7001r50l9386L745J0079j9222
6375a3866O630L29j8518N491M4278k845j9887k4258J4595K2254N612k3182L0557
6362B7190o358k8536k2380P003P852L904N977R654l286K7991J3152k5216l7066
6349b0119j5396M014J6374K944j3909J888J5177L9023J2470j9937m9725l050l511
6336c3757j3347j306M333L1073K6410Q885J875J2375l8129k3068Q97k0339j6690
6323f0788K1368K2911K3083M609j1255N844j2469j7458J0339J4917l045M877K114
6310E047l1441Q116J5862r198m744j0034O49M721k1514j2700L9444J8843j3141
6297a0090m418O417l284P934p641M306L2707O86l6971j974J5093K9143J0759j1877
$$ plain form
6389 22112 44456 59896 70450 70546 63504 59151 58028 48869 31868 30918 -8468 -4723 5356 -13866
6375 -13866 -7236 -6907 -25425 -19934 24344 21499 1612 -22646 -8051 14203 19815 -3367 27190
6362 27190 20832 -7704 -30084 -23081 -15229 -11325 -5348 4306 1020 29011 42163 16947 -20119
6349 -20119 -35515 -31501 -15127 -12183 -26092 -24204 -9027 29996 42466 22529 -27196 -30246 -33757
6336 -33757 -47104 -48410 -44077 -13004 13406 22291 24166 36541 -1588 -24656 -23759 -44098 -60788
6323 -60788 -39420 -16509 6574 11183 -72 5772 -6697 -24155 -13816 1101 -1944 2933 5047
6310 5047 -26394 -18278 -2416 -11614 -16358 -26392 -25743 -21022 -42536 -55236 -15792 3051 -10090
6297 -10090 -14508 -8091 -11375 -3441 -11082 -6776 25931 26617 -10354 -12328 2765 31908 42667 30790
6283C0790L530m638k3970m249m914n971j8681k2820P969J9718r218K0183q870
6270b1141q534nO301j3890l818L855M424K1251n695n955k9105K69P153q768R492
6255d4166K3293J1294m150j2455P678K5303j0325O387J8275k2050k1098r512L952
6242b7574P768J7787q92J2444j6235K793J8145j6250q017J7294n738k866J8702
6229A7361k9795k4849R757K3247J9897Kn056J0320l1400m7983J382K3479j1832
6216d5470p852Q639K3173j4114J011j28k5609O513N236O4814K4980o0664k260
6203b1731M6055J0686J4518j3525j5135R994P764n253j8844q582J9396J8354J896
6190D5593l8649k3095J0529N291k4575j467K559P727K7182L573l1970l761J5636
$$ plain form
6283 30790 34320 29682 5712 1463 -3451 -9422 -28103 -50923 -42954 -23236 -32454 -12271 -21141
6270 -21141 -29675 -29680 -23379 -37269 -41087 -37232 -32808 -11557 -17252 -23207 -52312 -52043 -44890 -53658 -44166
6255 -44166 -20873 -9579 -13729 -26184 -18506 6797 -3528 2859 21134 -916 -22014 -31526 -27574
6242 -27574 -19806 -2019 -2911 9533 -6702 -3909 14236 -2014 -10031 7263 1525 -1341 17361
6229 17361 -12434 -37283 -27526 -4279 15618 15620 10564 20884 -10516 -58499 -57117 -33638 -45470
6216 -45470 -53322 -44683 -21510 -35624 -34613 -34741 -60350 -53837 -48601 16213 41193 -19471 -21731
6203 -21731 24324 35010 49528 36003 20868 30862 38626 33373 14529 5947 25343 43697 45593
6190 45593 6944 -16151 -5622 -331 -24906 -26373 -23814 -16087 11095 14668 -17302 -21063 -5427
6177e427K3754L1739j531j7099k9747m6238J7743L5509j4244j4576k224L8776
6165A6435l7349j0955J3697J9328q893r703j8485J9256P188o321o897k2471J7598
6152b7572J5227J2533L5481K3330j5851j9129j0988J7166K3727N58k4344j9579
6140A0559q094J4135l887k0975O638J9958l2562p422K2099J5238K0792K821r88
6127C8312P311k0440j5849j427q28k8032R053J6505j9861j403J6457L014Q785
6114A1597q392k9525P872j2342p130J9618J5319q212n270O893J9024K844P299
6101A9595Q27k4739q151k3607J3332L9605j1704K5499K2985k8826k3124j7675
6089a5983n41J0328j4070p745j2841k2837J5515L2591M6624k4j4770q527K772
$$ plain form
6177 -5427 18327 50066 48535 31436 1689 -44549 -26806 8703 -5541 -20117 -22341 16435
6165 16435 -20914 -31869 -18172 1156 -7737 -17440 -35925 -16669 -9481 -15802 -22699 -45170 -27572
6152 -27572 -12345 188 35669 58999 43148 24019 13031 30197 53924 54482 30138 10559
6140 10559 2465 16600 12713 -8262 -1624 18334 -14228 -21650 449 15687 36479 39300 38312
6127 38312 45623 25183 9334 7907 7079 -20953 -11900 4605 -15256 -16659 -202 2812 11597
6114 11597 3205 -26320 -18448 -30790 -37920 -18302 -2983 -11195 -16465 -9572 9452 12296 19595
6101 19595 20422 -4317 -12468 -36075 -22743 16862 5158 30657 53642 24816 1692 -15983
6089 -15983 -16524 -6196 -20266 -28011 -40852 -63689 -48174 -15583 31041 31017 16247 7720 10492
6076A0492N588j7618L46J6170L049l9838j8653j1773k0272M3664L0238M351k280
6063C464o267m283k1829J2748M4289k0117o3877J8411R323K7845n045J2225L3296
6050D0183Q830m1140n167m311j6141M0247K3140R905j2729k4807J6153m85L457
6037C7135l891l1282P699K0743N826J0855k9273l5135K2823J9361j6180Q89J2320
6024B1890j5492R361P52j4664N725K804L812j1450r631K5279K479J4329k643J145
6010C3696K8688k3293m445O064m202j2609p282j6470q4Q017J0918J8838k0950
5997A6886j0126L14J5320k220M62k8366j3458L3681J6779P178j7301l3521o663
5984b1035J3591j9062k6089L1309j4920n611K833J4972K5186o048J6360J1422
$$ plain form
6076 10492 16080 -1538 -1192 14978 18027 -21811 -40464 -52237 -72509 -28845 1393 5744 3464
6063 3464 -2803 -7086 -28915 -16167 28122 8005 -55872 -37461 -28138 -293 -5338 6887 40183
6050 40183 49013 7873 2706 -1605 -17746 22501 45641 55546 42817 18010 34163 33678 37135
6037 37135 33244 1962 9661 30404 36230 47085 17812 -17323 5500 24861 8681 9570 21890
6024 21890 6398 15759 16511 1847 7572 10376 14188 2738 -6893 18386 20865 35194 32551 33696
6010 33696 62384 39091 34646 40710 36508 23899 16617 147 63 8080 18998 37836 16886
5997 16886 6760 7074 22394 20174 20636 -7730 -21188 12493 29272 36450 19149 -14372 -21035
5984 -21035 -7444 -26506 -52595 -21286 -36206 -41817 -38984 -24012 1174 -4874 11486 22908
5972B2908j5812l312k470J2713l804J643J2995j239l1511m1246n921L1169N864
5959a8023j4530J631J6446K640Q198K6459J6087O856l0151q697p32K399J9702
5946B8285k4096l5365q516r531K6452Q210J2392k14j1608L8723J6695J064J7637
5933F0128j4012K5415k2850l0090l621L799K999P392J7825k7496k8446j1380k7954
5920d8291R78J6431R229k449L099k9798J5274O23K316K4546L078J465j0144j1695
5906b5338k1586J5491J8119k9894K7357M2612J4063j1502j1483N457K844j5328
5894A0812k1978K226n431J9708J9452N338k97p143r719j8319j8794N335n478k5783
5880e0071J6257J4815L1588K426j4162L0952J2969j6005q765j2278j6925K0510
$$ plain form
5972 22908 7096 3784 1314 14027 10223 11866 24861 23622 -7889 -49135 -55056 -23887 -18023
5959 -18023 -32553 -30922 -14476 -11836 -3638 22821 38908 45764 15613 6916 6184 8583 28285
5946 28285 4189 -31176 -39692 -49223 -22771 -14561 -2169 -2383 -13991 24732 41427 42491 60128
5933 60128 46116 71531 48681 18591 14970 18769 21768 29160 46985 19489 -8957 -20337 -48291
5920 -48291 -47313 -30882 -21653 -24102 -21003 -50801 -35527 -34904 -32588 -8042 -4964 -3499 -13643 -25338
5906 -25338 -46924 -31433 -13314 -43208 -15851 26761 40824 29322 17839 23296 26140 10812
5894 10812 -11166 -8940 -14371 5337 24789 30127 29830 22687 12968 -5351 -24145 -18810 -24288 -50071
5880 -50071 -33814 -18999 12589 15015 853 31805 44774 28769 20004 7726 -9199 11311
5868A1311k6990j1744J1992n807J0719K736J268k8714m1709m593k962J7409J2253
5855e4831J3641K0506J8685O608K2126k1108L903K6959J4129r957l6878j2430
5843h647N88L0055j8152m6983J5684K2282J7655r647q205m809J2096L158k0408
5830a5333p824R561J1236J1382k6563R601J9391j6594k2066j0737J8165Q587j7983
5817b9177L7211k0163k2558o244L9739L5779m4767q38K9647o418j4009j8703k6439
5804d6940O789K9406J4994K4038k512l148k1765k1915K2285P755j7020M177o516
5791a0372K3765R540k754L0459j4769j2695K8Q508l4318l8125j1629J5738K2657
5778a3967j74j0805p192M6812K1611k0915k7256j334J9735L6382J5141m5460j5190
$$ plain form
5868 11311 -15679 -27423 -15431 -21238 -10519 -7783 -6515 -35229 -76938 -81531 -84493 -67084 -54831
5855 -54831 -41190 -20684 -1999 4609 26735 5627 9530 36489 50618 40661 3783 -8647
5843 -8647 -8059 21996 3844 -43139 -27455 -5173 12482 2835 -5370 -10179 1917 5075 -15333
5830 -15333 -23157 -13596 -2360 9022 -17541 -7940 11451 -5143 -27209 -37946 -19781 -11194 -29177
5817 -29177 8034 -12129 -34687 -40931 -1192 34587 -10180 -11018 18629 12211 -1798 -20501 -46940
5804 -46940 -40151 -10745 4249 28287 25775 22627 862 -21053 1232 8987 -8033 -3856 -10372
5791 -10372 13393 22933 20179 50638 35869 23174 23202 31710 -2608 -40733 -52362 -36624 -13967
5778 -13967 -14141 -24946 -32138 14674 36285 15370 -11886 -13220 6515 42897 58038 12578 -2612
5765b612l81j8220Q438M958J1895J3604l58j4604K0057K713k7082j2759L3880
5752A9529O624j5917J7118j2193k2898M932J8552J1431j464j1145k4212K271J3261
5739E889q796K4818M035K2211Q760m1863m6671J1874J1209m259j766m874J6411
5726c022J2065J3510P444o013m38k0741k765o924J5652l118k8084Q797o536k5994
5712d6167J3856L3706j329j5543o390R182J638M2697K1202q811j7567k2686l8887
5699c5099N85L8644P493j9008l1221K8630J7551k548J2552o98m131k578q720j6591
5685a5139R992l2954q007L0295k1942L8916K565j2407Q818k946J7583R186o177
5672A7783L9O577o639m4086j4432j328k5443J3573J4462K8173J6675n092J1767
$$ plain form
5765 -2612 -2993 -21213 -12775 -7817 4078 17682 17324 2720 22777 25490 -1592 -14351 19529
5752 19529 26153 10236 27354 15161 -7737 -2805 15747 27178 25714 14569 -9643 -7372 5889
5739 5889 -2907 21911 25946 48157 56917 15054 -31617 -19743 -8534 -12793 -14559 -19433 -3022
5726 -3022 9043 22553 29997 23984 23546 2805 40 -6884 8768 5650 -22434 -13637 -20173 -46167
5712 -46167 -32311 1395 66 -15477 -21867 -12685 -11047 31650 52852 44041 26474 3788 -35099
5699 -35099 -34514 4130 11623 -7385 -38606 -9976 7575 5027 17579 16881 12750 10172 1452 -15139
5685 -15139 -5147 -38101 -46108 -15813 -37755 1161 3726 -8681 137 -2809 14774 23960 17783
5672 17783 17822 24399 17760 -26326 -40758 -42086 -67529 -53956 -39494 -11321 5354 262 12029
5659A2029j7791k3055j3005q172P573K493m116L9609O486j9453k8642j5914P921
5646e4037L1427K0964K8116j5056k2529k355k052n44K553O807j1514R223J3938
5633D941m672J825n815l557L4099R458j9876k2955j2706o170J3685K7722K0743
5620C6722j6415M672K142k3971j6222k0888n157q030J9687J5427J4808j7903L559
5607a1569k992j3648l409J5992K2201l3283L085L8521K3673k5119j7735o952j2609
5594b3844J8507j5956q538l876M864q36j7726q169J1146J7853m070o56o697P035
5580c0963R171P697J7242Q041k447j2102p590p035J5762J4390L00Q88J0977J205
5566B5536l2065k5154k4873n76M653N7367K1838n6594l1036J308J8156j0882q44
$$ plain form
5659 12029 -5762 -28817 -41822 -49994 -42421 -39928 -44044 -4435 2051 -17402 -46044 -61958 -54037
5646 -54037 -22610 -1646 26470 11414 -11115 -13470 -15522 -16066 -13513 -6706 -18220 -8997 4941
5633 4941 269 2094 -3721 -7278 26821 36279 16403 -6552 -19258 -25428 -11743 15979 36722
5620 36722 20307 24979 27121 3150 -13072 -33960 -39117 -47147 -27460 -12033 2775 -15128 -11569
5607 -11569 -14561 -28209 -31618 -15626 6575 -26708 -23623 14898 38571 13452 -4283 -11235 -23844
5594 -23844 -5337 -21293 -29831 -33707 -28843 -29679 -47405 -55574 -44428 -26575 -30645 -31301 -37998 -30963
5580 -30963 -21792 -14095 3147 11188 8741 -3361 -10951 -17986 -2224 12166 12466 13354 24331 25536
5566 25536 -6529 -31683 -56556 -57132 -52479 4888 26726 -29868 -60904 -59596 -41440 -52322 -53166
5553e3166J6382J9501J5961M322l517Q889P685l537J1259J960l3495J4658p344
5540d42j0105P745l838j667o317J3621K8511j326o591q381j2056j5623J3087N114
5526A732k1045j506J5926J0109k542k3908K069K0649R094n46k1682P571J0415
5513F336r967l0416J885K4754K3462l6624j9068K1071K2557J0339j2842r067p944
5500a5524k1088K7571M3360P208j1475n2991k4083j0880l427o206r535N0051L7571
5487A0552l357k5169K457N809j942L144l5511l5362K1029K0548J2191P048J9152
5474E89N626j4777j5670K2095n789K2160J865J3098o706l0845n2955j2593M5023
5461b8879K2989J0560J7198o638L40j2662j8658J5156Q03J5800j4303J912J2563
$$ plain form
5553 -53166 -36784 -17283 -1322 3000 -517 8372 16057 12520 23779 25739 -7756 6902 -442
5540 -442 -10547 -2802 -6640 -8307 -14624 -1003 27508 26182 19591 11210 -846 -16469 -3382 1732
5526 1732 -19313 -20819 -4893 5216 2674 -21234 -19165 1484 10578 10032 -11650 -4079 6336
5513 6336 -3631 -34047 -32162 -7408 16054 -20570 -39638 -18567 3990 14329 1487 -7580 -15524
5500 -15524 -36612 -9041 34319 41527 30052 -22939 -47022 -57902 -61329 -67535 -77070 -27019 10552
5487 10552 7195 -17974 -15517 -9708 -11650 -8506 -44017 -79379 -58350 -37802 -25611 -18563 589
5474 589 6215 -8562 -24232 -2137 -7926 14234 16099 29197 22491 -8354 -61309 -73902 -28879
5461 -28879 -5890 4670 21868 15230 15570 2908 -15750 -594 209 16009 1706 3618 16181
5448A6181l8302j1318K2449N656l164j8312j0160k2070P385M5556J8568j5780
5436c311j1640J5724k792r013o873N941L1518J3254j1553o574P62K9428K1679
5423F6550K7418k4029k3632o1982k5979P729Q02O936K130J2302n110r612j727
5410b8204j1097j3267M523J5834K1467L1883L298r963l1053j6562J4119k765p968
5397b9755L6750m269N168j0005j2971Q512l0170M266K8269p536k4895k1607K9436
5384b8807J0800l036k0940K6130J6245r702k0564R56L2568q6j4371J9450M918
5371A3561k4254J280l482J0846K5404j0318j3028p687r219j4955J4889K3615m351
5358B301m7639K1477J8213j0101o738j0632q985Q261J4931P012r141j419J843
$$ plain form
5448 16181 -22121 -33439 -10990 -5334 -8498 -26810 -36970 -59040 -51655 -6099 12469 -3311
5436 -3311 -14951 773 -2019 -11032 -17905 -11964 19554 32808 21255 14681 15443 44871 66550
5423 66550 93968 69939 46307 -15675 -41654 -33925 -33123 -26187 -24057 -11755 -16865 -26477 -28204
5410 -28204 -39301 -52568 -48045 -32211 -10744 21139 24437 14474 -16579 -33141 -19022 -21787 -29755
5397 -29755 6995 2726 7894 -2111 -15082 -6570 -36740 -32474 -4205 -11741 -36636 -58243 -28807
5384 -28807 -18007 -21043 -41983 -15853 392 -9310 -29874 -28918 3650 3564 -10807 8643 13561
5371 13561 -10693 -9413 -12895 -2049 23355 13037 9 -7678 -16897 -31852 -16963 6652 2301
5358 2301 -45338 -23861 -5648 -15749 -22487 -33119 -42104 -33843 -18912 -11900 -21041 -22460 -20617
5345b0617j4886N874J6786J8568l1948j1494M4185L170N997j9720j1345J982l546
5332a6994K7050J075O2J2873j0824j5151k0674J7958L515L571L4618J916k1526
5319A7469j1335j4480R085j5404K088J4420k589L9456L039J3489k5621m6059l1815
5306d8257m685r58N491J590p674L0874L3090O479k3522m3783j1002J2245J3441
5293c6671K6619J8248K6047m937l0079j2925l135j4799k403N154J476K4866J2974
5280A0435j3440J9481p546j5763j7640M984J1057O081M651J1748k2803j3751J4194
5267h312Q863j765n198K0269M5963o428j9622J1596l4899J6147j5799l8380M4899
5254A7334K3189j5422K3433K9j8982j450K6382j5065j8414j7753p093p15J6411
$$ plain form
5345 -20617 -35503 -29629 -12843 5725 -26223 -37717 6468 9638 15635 -4085 -15430 -13448 -16994
5332 -16994 10056 11131 11193 24066 13242 -1909 -22583 -4625 -1110 2461 37079 38995 17469
5319 17469 6134 -8346 739 -14665 -12577 1843 -746 38710 41749 55238 29617 -16442 -48257
5306 -48257 -52942 -53900 -48409 -46819 -54493 -23619 9471 15950 -7572 -51355 -62357 -50112 -36671
5293 -36671 -10052 8196 34243 29306 -773 -13698 -16833 -31632 -34035 -28881 -27405 -2539 10435
5280 10435 -3005 16476 8930 -6833 -24473 -19489 -8432 -2351 2300 14048 -8755 -22506 -8312
5267 -8312 551 -1214 -6412 13857 59820 53392 33770 45366 10467 26614 10815 -27565 17334
5254 17334 40523 25101 48534 48563 29581 28131 54513 39448 21034 3281 -3812 -4527 11884
5241A1884J8200j956j9581Q280K151j2733K5566K951j2367o66j8006k7443k60
5228b3980N737K7959r850k5546J2794N452O659o276j1442M85O524l586J5907R102
5214I939k0459M397J777j8676k7826j0980K0709K6293N419k6k569K825J9564K0704
5200C1091K0418j9016l2862p872J0318j4068J1583R934m255M26J1504P412k960
5187B1653k6289J9262m475j0224k0485k4331k02J0844K7699O880k1113K886O324
5174a1571q29o618P638L2689P804N800j590J2796l196j6086l4439l4001L120J9855
5160a8628O625k246k956j106J1951p967k1596k246M9327J3785k0928K2645j9973
5147F687l5800J7059l1997j0075K3902m45j637j8980j0476J8344L4745N566k9863
$$ plain form
5241 11884 30084 28128 8547 16827 18978 6245 31811 34762 22395 21729 3723 -23720 -23980
5228 -23980 -18243 9716 -134 -25680 -12886 -7434 -775 -7051 -18493 -18008 -11484 -15070 837 9939
5214 9939 -10520 -6123 -4346 -23022 -50848 -61828 -41119 -14826 -9407 -9433 -12002 -9177 10387 31091
5200 31091 51509 32493 -369 -8241 2077 -11991 -408 9526 5271 5697 17201 24613 21653
5187 21653 -4636 14626 10151 -73 -20558 -44889 -45091 -34247 -6548 332 -20781 -17895 -11571
5174 -11571 -12400 -19018 -11380 21309 29113 34913 33323 46119 42923 26837 -7602 -41603 -38483 -18628
5160 -18628 -12003 -14249 -17205 -18311 -6360 -14327 -35923 -38169 11158 24943 4015 26660 6687
5147 6687 -29113 -12054 -44051 -54126 -30224 -30669 -32306 -51286 -61762 -43418 -8673 -3107 -32970
5134c2970m5045J552K2108K5162J2045J6294K0935k337J337k337k0134k1495k810
5121b7695j8064L2925J5727J0342K7387p002k1826J4925J6378l655r110l3234
5109b902l8246R549K8689J6831k0374N088R685R239j3413m05o741j6123j2788
5096c1911J3955k7318j4598L8843j5735r758P843L8491O985j7410n097K0910k1978
5083a6778k291L6124j8327J1058J585J151k8352j4301j3502K524p31Q881L2844
5070a15M953j0583l4645O454J404n133K1761J6245R401k71k0654j7185Q531Q197
5056a1640O251L135J2923J024l384J4619j7008p857m61k2735m2351R911M3589
5043a3984L4070R247j0648k8079j0004k0591O067J6963M595Q858r454j0718K1223
$$ plain form
5134 -32970 -78015 -76463 -54355 -29193 -17148 -854 20081 17744 19081 16744 -3390 -24885 -27695
5121 -27695 -45759 -12834 2893 13235 40622 33620 11794 26719 43097 39442 30332 -2902
5109 -2902 -41148 -31599 -2910 13921 -6453 -1365 8320 17559 4146 3741 -3000 -19123 -31911
5096 -31911 -17956 -45274 -59872 -21029 -36764 -46522 -38679 -188 6797 -10613 -15710 5200 -16778
5083 -16778 -19069 17055 -1272 9786 11371 12522 -15830 -30131 -43633 -41109 -41840 -32959 -115
5070 -115 4838 -5745 -40390 -33936 -32532 -37665 -15904 341 9742 9471 -11183 -28368 -19837 -11640
5056 -11640 -5389 -2254 10669 11693 8309 22928 5920 -1937 -2398 -25133 -67484 -57573 -13984
5043 -13984 20086 29333 18685 -9394 -19398 -39989 -33922 -16959 -12364 -3506 -12960 -23678 -2455
5030b455K6296o628p913j8629l2995l05K6777K2637J0775k136k9366p475o467
5017b7884k6544k4677j9693M8061K6392J1789j0895j206m481J4558Q218p520P172
5004f710O6N663K1115O85l2566j7479J3701O007J7381J2648o603l540l998j6568
4990a0198O413J6063j3249o123J6908J8706R203l972k7530j1144r185K0501o233
4977A60J7396q083K276j4772k8589K773O6R119O866J3786J2541k4301J2038N156
4963F432l841j0452j9264j6528L2910M0355L948k4960m193J2098q969k5892L5275
4950A6919L437r208O138k5618k2117K8554Q166l6802j5434L2985L1801j4006p840
4937c025L28j9619l0977L882J3087j9384M455M0690J8792k5579m854J6159J6288
$$ plain form
5030 -2455 23841 17213 9300 -9329 -42324 -42629 -15852 6785 17560 15424 -13942 -21417 -27884
5017 -27884 -54428 -79105 -98798 -50737 -24345 -12556 -23451 -24657 -29138 -14580 -6362 -13882 -6710
5004 -6710 -6644 -981 20134 20819 -11747 -29226 -15525 -9518 7863 20511 13908 10368 6370 -10198
4990 -10198 -3785 12278 -971 -7094 9814 28520 37723 33751 6221 -4923 -14108 6393 160
4977 160 17556 9473 11749 -3023 -31612 -28839 -28773 -19654 -12788 998 13539 -10762 1276 6432
4963 6432 2591 -7861 -27125 -43653 -10743 29612 33560 8600 4407 16505 7536 -18356 16919
4950 16919 20356 11148 17286 -8332 -30449 -1895 6271 -30531 -45965 -12980 18821 4815 -3025
4937 -3025 -2697 -22316 -53293 -49411 -36324 -55708 -51253 -10563 8229 -17350 -22204 -6045 10243
4924A0243k1173o72L322J7527M744m246o742J0549r991M305J493O503j9086n252
4910h476j2854l390K0033J9059k222L026K3641j686m4088j4955j760j5274K3305
4897a5641p640m0966j076M6747K0704l602k6902l9601k3442K8138K3029L7238
4885c014J0677q011l00j0100k0857k2189j299K9907O169K5135j1614J019o361
4872a0838k5071k1346J3567K4202O832J0531K6727O373j9294J4776J3075K3428
4860F2962k2509k6479k7803P914l205R636k8913q926K7709J1106j2102r873n008
4847b5491K006K617k0498J7555J458J2250K3556j0762j0227j9499R764n175L5132
4834A2686J0765J848k4357J5288k9272L204J0862J7455O849j2332O159n956J1222
$$ plain form
4924 10243 -10930 -11602 -8280 9247 13991 9745 3003 13552 3561 7866 9359 15862 -3224 -8476
4910 -8476 -21330 -24720 -4687 14372 12150 15176 38817 37131 -6957 -21912 -23672 -38946 -15641
4897 -15641 -23281 -64247 -65323 -18576 2128 -1474 -28376 -67977 -91419 -63281 -40252 -3014
4885 -3014 7663 -348 -648 -10748 -31605 -53794 -55093 -25186 -19017 6118 -5496 -4477 -10838
4872 -10838 -35909 -57255 -43688 -19486 -12654 -2123 24604 30977 11683 26459 39534 62962
4860 62962 40453 13974 -13829 -5915 -9120 516 -28397 -37323 -9614 1492 -10610 -20483 -25491
4847 -25491 -23485 -20868 -41366 -23811 -22353 -10103 13453 2691 -7536 -27035 -17271 -22446 12686
4834 12686 23451 25299 942 16230 -13042 -9838 1024 18479 25328 12996 19155 13199 24421
4821B4421j2196k1403R637j9133k3606J9672K5282J6611J7126j3237j5660Q706
4809A6220J5829r193j0373j1214r127j9149J1928j870l5793j0370M307j6530J5145
4796f0190M1095P578J5320J0827j4735j5332J2048J4137J6764j3941j596j5256
4784c281q256q995K0320K8015j8548l449q182j9038J0070M5791P187j5809j5802
4771A0023j0931j0473J0425K8709P677j2799M79j7841j3628l855J4916j3244O261
4758d281n643J9120K4110K3252J0159j7691r396K726o493o153l4764K2194K4035
4745D1175r064l6283j2832R410K7598R76l898k5502q559k2783j7190K1150q425
4732d4227Q438J3780K6745j4777k0011o482K3848K9272j146k0896p971Q821J4614
$$ plain form
4821 24421 12225 -9178 459 -18674 -42280 -22608 2674 19285 36411 23174 7514 16220
4809 16220 32049 22856 12483 1269 -7858 -27007 -15079 -16949 -52742 -63112 -58805 -75335 -60190
4796 -60190 -19095 -11517 3803 14630 -105 -15437 -3389 10748 27512 13571 11975 -3281
4784 -3281 -11537 -20532 -212 27803 9255 5806 -2376 -21414 -11344 34447 41634 25825 10023
4771 10023 -908 -11381 -956 27753 35430 22631 23110 5269 -8359 -12214 2702 -10542 -4281
4758 -4281 -9924 9196 33306 56558 66717 49026 39630 42356 35863 29710 -5054 17140 41175
4745 41175 32111 -4172 -17004 -7594 20004 20980 17082 -8420 -16979 -39762 -56952 -35802 -44227
4732 -44227 -35789 -22009 4736 -10041 -30052 -36534 -12686 16586 15440 -5456 -13427 -4606 10008
4719A0008K4301L2815j0919o3577m7497j928M3318J7847K015r25l1119k8908J2369
4706d2200J7909N365n914J9545J2110j7034m525j9725q190P873L4625L3059M403
4693C7301J8567p118k2998k5387k1107J4774K4338q607o554n965K1148J9003k7915
4680I480n363Q263K554q540j2493k852l1658o910K522Q49K2521K5304J79J3675
4666A7531N560k0064K1858L6194k181m1997k9986N026j1403M7476j1498j8236
4654a720l5521j0696K3900P644Q992J5274k6679m532J8658L8023j3424J1276j874
4641B9321k2820j2768K313j2525O108J7017j028n300L1526l122k9435j8580j9498
4628c8791P521Q974N521R202J810n809Q879J3788J5031K658j945M418J4345J7777
$$ plain form
4719 10008 34309 67124 56205 -7372 -54869 -56797 -13479 4368 6383 5458 -25661 -54569 -42200
4706 -42200 -24291 -18926 -24840 -5295 6815 -10219 -14744 -34469 -42659 -34786 -161 32898 37301
4693 37301 55868 48750 25752 365 -20742 -5968 18370 9763 3209 -2756 18392 37395 9480
4680 9480 4117 12380 14934 6394 -6099 -8951 -40609 -47519 -44997 -44148 -21627 3677 3856 17531
4666 17531 23091 3027 24885 61079 58898 16901 -13085 -8059 -19462 28014 16516 -1720
4654 -1720 -37241 -47937 -24037 -16393 -7401 7873 -18806 -23338 -4680 33343 19919 31195 29321
4641 29321 6501 -6267 -3954 -16479 -10371 6646 5618 318 31844 28722 -713 -19293 -38791
4628 -38791 -31270 -22296 -16775 -7573 -5763 -11572 -2693 11095 26126 28784 26839 31257 45602 63379
4614F3379k5006j6902J0876j3865l421L3009K2601k2344m4334o832k211j3319
4602a8369n664l5829R512N0165K9697k1831m0809J786k3270n210J8693K6476K9988
4589A5335J2633j2902r468k7588l4908K3016J2037K6935J058j9559r946j2334
4577c5691K9281J4358J2410J6021J523j162N911l522n141R969M823n1568j954
4564d742R789L5721K6810j9025l3043k2198j14J8861J641p964k3722j7011L344
4551c1653l395J1165N363L874J5308J203k845j099j2304j7816j8096J3289J4931
4538b2075N362p833J434N316K1520k21N903m340n957q363q668n728K7330q096
4524d416j1612j2150P784k8251j0913K4321N8120J5034l3211n1129j5964J142
$$ plain form
4614 63379 38373 21471 32347 18482 15061 48070 70671 48327 3993 -2839 -5050 -18369
4602 -18369 -24033 -59862 -50350 -185 29512 7681 -33128 -31342 -54612 -59822 -41129 -14653 15335
4589 15335 27968 15066 5598 -21990 -56898 -33882 -21845 5090 6148 -13411 -23357 -35691
4577 -35691 -6410 7948 20358 36379 37902 36740 42651 39129 33988 43957 48780 -2788 -4742
4564 -4742 5047 40768 67578 48553 15510 -6688 -6802 12059 13700 5736 -17986 -34997 -31653
4551 -31653 -35048 -23883 -18520 -14646 662 1865 -980 -2079 -14383 -32199 -50295 -37006 -22075
4538 -22075 -16713 -24546 -23112 -17796 3724 3503 9406 5066 -891 -9254 -17922 -23650 3680 -4416
4524 -4416 -16028 -28178 -20394 -48645 -59558 -35237 22883 37917 4706 -46423 -62387 -61245
4512f1245k991O2211K0829J8816j421o02j2469k2649k5582r872q642P341J2762
4499b3514Q283O637j7811m515l980L749r227m211K0005%M899K4796L467j185j0032
4484b639m8974J2734J5760k8022k1341J2060J1433o373J8677J8729J2795J7658
4472A2497j3010j0713J5512J5685j8034n50j17j1647j995J1762n91J157j2437
4459a2481P913Q574k4207l4462M517P872j5703n764m460K0079O668M2544N700
4446F790Q969k2051j6152j4778J8320J7265L1877L402o3457l6466K1345K4079
4434b0857J8315K3430M2641J297p478j3164J5229l5216m031r499j6420Q798l875
4421h30J1656L1777R664j2283j3711k1014k6123J2290K8654r751J9259l494k357
$$ plain form
4512 -61245 -64236 -2025 18804 37620 36199 35597 23128 479 -25103 -34975 -43617 -36276 -23514
4499 -23514 -15231 -8594 -26405 -30920 -34900 -31151 -40378 -44589 -24584 -24584 -19685 5111 8578 7393 -2639
4484 -2639 -51613 -38879 -23119 -51141 -72482 -60422 -48989 -55362 -36685 -17956 -5161 12497
4472 12497 -513 -11226 4286 19971 1937 1387 1270 -10377 -12372 -610 -1201 -44 -12481
4459 -12481 -4568 4006 -20201 -54663 -50146 -42274 -57977 -63741 -68201 -48122 -41454 1090 6790
4446 6790 15759 -6292 -22444 -37222 -18902 -1637 30240 33642 -29815 -66281 -44936 -20857
4434 -20857 -2542 20888 63529 64826 57348 44184 59413 24197 20166 10667 -5753 3045 -830
4421 -830 10826 42603 52267 39984 26273 5259 -20864 -8574 20080 10329 29588 26094 23737
4408B3737J1786J1216j5813j6710p175j3459k2884K2477J9860L902r330Q520j9866
4395c739j2794J0792Q107j3977J4762k6199q992L149J8765L6715K2483j0262k6250
4382A2560r933O892K0164J6543j9238k2303Q716P688J399l6244r17L1091J8255
4369C4673L794L029m3411k5114L7633M0829k0823k1093J3230M815l7630j4820
4357b4888J997J4034J5362j1146l4386k4977L0269L8579J6534k2872p76L147J3685
$$ plain form
4408 23737 35523 46739 30926 14216 7041 -6418 -29302 -6825 13035 16937 7607 16127 -3739
4395 -3739 -16533 -5741 2366 -11611 3151 -23048 -32040 -28891 -10126 26589 49072 38810 12560
4382 12560 2627 9519 29683 46226 26988 4685 13401 21089 22488 -13756 -14673 16418 34673
4369 34673 38467 41496 -1915 -27029 10604 51433 30610 9517 22747 27562 -10068 -24888
4357 -24888 -22891 -8857 6505 -4641 -39027 -64004 -33735 4844 21378 -1494 -2270 877 14562
$$ [...]
##END NTUPLES=NMR SPECTRUM
##END=
