##TITLE=Analysis number 318744
Compound Code cc 51504
Book Reference 438/118
Project Code adrs
Chemist Name antons
##JCAMPDX= 6.0         $$ Bruker NMR JCAMP-DX V2.0
##DATA TYPE= NMR SPECTRUM
##DATA CLASS= NTUPLES
##ORIGIN= Bruker BioSpin GmbH
##OWNER= nmr
$$ XWIN-NMR		Version 3.5
$$ Wed Apr 12 11:36:00 2006 GMT Daylight Time (UT+1h)  MAYBRIDGE\nmr@NMR_250MHZ
##.OBSERVE FREQUENCY= 250.131544655141
##.OBSERVE NUCLEUS= ^1H
##.ACQUISITION MODE= SIMULTANEOUS (DQD)
##.ACQUISITION SCHEME= undefined
##.AVERAGES= 16
##.DIGITISER RES= 18
##SPECTROMETER/DATA SYSTEM= dpx250
##.PULSE SEQUENCE= zg30
##.SOLVENT NAME= CDCl3
##.SHIFT REFERENCE= (INTERNAL, CDCl3, 0, 16.522)
##AUDIT TRAIL= $$ (NUMBER, WHEN, WHO, WHERE, WHAT)
$$ ##TITLE= Audit trail, XWIN-NMR		Version 3.5
$$ ##JCAMPDX= 5.01
$$ ##ORIGIN= Bruker BioSpin GmbH
$$ ##OWNER= nmr
$$ C:\u/data/dgb/nmr/ADRS/2600/pdata/1/auditp.txt
$$ ##AUDIT TRAIL=  $$ (NUMBER, WHEN, WHO, WHERE, WHAT)
(   1,<2006-04-12 11:35:41.62 +100>,<MAYBRIDGE\nmr>,<NMR_250MHZ>,
      <created by zg, POWCHK disabled, PULCHK disabled
       configuration hash MD5:
       84 BC 41 DB A1 6E 1D 46 DA 25 12 A5 C1 ED C5 3A
       data hash MD5: 64K
       35 03 8E 9C C8 AA 89 AF 8A 2B 7A C5 2A 10 DF 50>)
(   2,<2006-04-12 11:35:53.13 +100>,<MAYBRIDGE\nmr>,<NMR_250MHZ>,
      <Start of raw data processing
       ef LB = 0.3 FT_mod = 6 PKNL = 1 SI = 32K 
       data hash MD5: 32K
       9C 15 AA 92 7C 69 4A C0 65 0D 4D 2C 9B FD 4F D7>)
(   3,<2006-04-12 11:35:54.88 +100>,<MAYBRIDGE\nmr>,<NMR_250MHZ>,
      <apk 
       data hash MD5: 32K
       4A 81 DE E9 A9 F3 03 D0 4C 42 DE 57 D6 9C 35 6B>)
(   4,<2006-04-12 11:35:55.68 +100>,<MAYBRIDGE\nmr>,<NMR_250MHZ>,
      <abs ABSG = 5 
       data hash MD5: 32K
       03 2C A3 2F 33 0F B8 EA 11 D8 84 25 89 C7 C5 C4>)
$$ ##END=
$$ 
$$ hash MD5
$$ 42 C2 19 EA 4A 62 BE AC E4 B7 7A AA DE C4 E8 83
##$RELAX= 
##$RELAX= 
##$RELAX= 
##$RELAX= 
##$RELAX= 
##$RELAX= 
##$RELAX= 
$$ Bruker specific parameters
$$ --------------------------
##$DU= <C:\u>
##$EXPNO= 2600
##$NAME= <ADRS>
##$PROCNO= 1
##$TYPE= <nmr>
##$USER= <dgb>
##$AMP= (0..31)
100 100 100 100 100 100 100 100 100 100 100 100 100 100 100 100 100 100 
100 100 100 100 100 100 100 100 100 100 100 100 100 100 
##$AQSEQ= 0
##$AQ_mod= 3
##$AUNM= <au_zg>
##$AUTOPOS= <19 >
##$BF1= 250.13
##$BF2= 250.13
##$BF3= 250.13
##$BF4= 250.13
##$BF5= 500.13
##$BF6= 500.13
##$BF7= 500.13
##$BF8= 500.13
##$BYTORDA= 1
##$CFDGTYP= 0
##$CFRGTYP= 5
##$CHEMSTR= <none>
##$CNST= (0..31)
1 1 145 1 1 1 1 1 1 1 1 1 1 1 1 1 1 1 1 1 1 1 1 1 1 1 1 1 1 1 1 1 
##$CPDPRG= <>
##$CPDPRG1= <>
##$CPDPRG2= <>
##$CPDPRG3= <>
##$CPDPRG4= <mlev>
##$CPDPRG5= <mlev>
##$CPDPRG6= <mlev>
##$CPDPRG7= <mlev>
##$CPDPRG8= <mlev>
##$CPDPRGB= <>
##$CPDPRGT= <>
##$D= (0..31)
0 1 0 0 0 0 0 0 0 0.06 0 0 0 0 0 0 0.0002 0 0 0 0 0 0 0 0 0 0 0 0 0 0 
0 
##$DATE= 1144838140
##$DBL= (0..7)
120 120 120 120 120 120 120 120 
##$DBP= (0..7)
150 150 150 150 150 150 150 150 
##$DBP07= 0
##$DBPNAM0= <>
##$DBPNAM1= <>
$$ [...]
##$SUBNAM7= <"">
##$SUBNAM8= <"">
##$SUBNAM9= <"">
##$SW= 20.6930455092707
##$SWIBOX= (0..15)
0 0 3 0 0 0 0 0 0 0 0 0 0 0 0 0 
##$SW_h= 5175.983436853
##$TD= 65536
##$TD0= 1
##$TE= 294.16
##$TE2= 300
##$TE3= 300
##$TEG= 300
##$TL= (0..7)
0 120 120 120 120 120 120 120 
##$TP= (0..7)
150 150 150 150 150 150 150 150 
##$TP07= 0
##$TPNAME0= <>
##$TPNAME1= <>
##$TPNAME2= <>
##$TPNAME3= <>
##$TPNAME4= <>
##$TPNAME5= <>
##$TPNAME6= <>
##$TPNAME7= <>
##$TPOAL= (0..7)
0.5 0.5 0.5 0.5 0.5 0.5 0.5 0.5 
##$TPOFFS= (0..7)
0 0 0 0 0 0 0 0 
##$TUNHIN= 0
##$TUNHOUT= 0
##$TUNXOUT= 0
##$USERA1= <user>
##$USERA2= <user>
##$USERA3= <user>
##$USERA4= <user>
##$USERA5= <user>
##$V9= 5
##$VALIST= <valist>
##$VCLIST= <CCCCCCCCCCCCCCC>
##$VD= 0
##$VDLIST= <DDDDDDDDDDDDDDD>
##$VPLIST= <PPPPPPPPPPPPPPP>
##$VTLIST= <TTTTTTTTTTTTTTT>
##$WBST= 1024
##$WBSW= 4
##$XGAIN= (0..3)
0 0 0 0 
##$XL= 0
##$YL= 0
##$YMAX_a= 448276
##$YMIN_a= -360843
##$ZGOPTNS= <>
##$ZL1= 120
##$ZL2= 120
##$ZL3= 120
##$ZL4= 120
##$ABSF1= 16.522
##$ABSF2= -4.171173
##$ABSG= 5
##$ABSL= 3
##$ALPHA= 0
##$AQORDER= 0
##$ASSFAC= 0
##$ASSFACI= 0
##$ASSFACX= 0
##$ASSWID= 0
##$AUNMP= <proc_1d>
##$AZFE= 0.1
##$AZFW= 0.1
##$BCFW= 0
##$BC_mod= 0
##$BYTORDP= 0
##$COROFFS= 0
##$CY= 12.5
##$DATMOD= 1
##$DC= 0
##$DFILT= <>
##$DTYPP= 0
##$F1P= 14.0000005364418
##$F2P= -0.99999901652339
##$FCOR= 0.5
##$FTSIZE= 32768
##$FT_mod= 6
##$GAMMA= 0
##$GB= 0
##$INTBC= 1
##$INTSCL= 1
##$ISEN= 128
##$LB= 0.3
##$LEV0= 0
##$LPBIN= 0
##$MAXI= 10000
##$MC2= 0
##$MEAN= 0
##$ME_mod= 0
##$MI= 0
##$NCOEF= 0
##$NC_proc= -3
##$NLEV= 6
##$NOISF1= 0
##$NOISF2= 0
##$NSP= 0
##$NTH_PI= 0
##$NZP= 0
##$OFFSET= 16.522
##$PC= 1
##$PHC0= 12.59017
##$PHC1= 8.166558
##$PH_mod= 1
##$PKNL= yes
##$PPARMOD= 0
##$PSCAL= 4
##$PSIGN= 0
##$REVERSE= no
##$SF= 250.13
##$SI= 32768
##$SIGF1= 0
##$SIGF2= 0
##$SINO= 400
##$SIOLD= 32768
##$SREGLST= <1H.CDCl3>
##$SSB= 0
##$STSI= 32768
##$STSR= 0
##$SW_p= 5175.98343685301
##$SYMM= 0
##$S_DEV= 0
##$TDeff= 65536
##$TDoff= 0
##$TI= <Analysis number 999999
Compound Code 99
Book Reference 9
Project Code 9>
##$TILT= no
##$TM1= 0
##$TM2= 0
##$TOPLEV= 0
##$USERP1= <user>
##$USERP2= <user>
##$USERP3= <user>
##$USERP4= <user>
##$USERP5= <user>
##$WDW= 1
##$XDIM= 32768
##$YMAX_p= 451868655
##$YMIN_p= -137352
$$ End of Bruker specific parameters
$$ ---------------------------------
##NTUPLES= NMR SPECTRUM
##VAR_NAME=  FREQUENCY,     SPECTRUM/REAL,   SPECTRUM/IMAG
##SYMBOL=    X,             R,               I
##VAR_TYPE=  INDEPENDENT,   DEPENDENT,       DEPENDENT
##VAR_FORM=  AFFN,          ASDF,            ASDF
##VAR_DIM=   32768,         32768,           32768
##UNITS=     HZ,            ARBITRARY UNITS, ARBITRARY UNITS
##FACTOR=    0.157963299565203, 1,           1
##FIRST=     4132.6476996994, 0,             0
##LAST=      -1043.33573715361, 0,           0
##MIN=       -1043.33573715361, -137352,     0
##MAX=       4132.6476996994, 451868655,     0
$$ Real data points
##PAGE= N=1
##DATA TABLE= (X++(R..R)), XYDATA
$$ [...]
16605C3825k219o154q48j104J79N928J056n685L052k460k740J0370L205p869J0767
16590C9303K606J793m941O19m893r721n135J28O361m621l468L315M779Q04K58
16575B7187N372j839k884k247m531M689K786M078M823m720m066P932K172k675
16561C6077r172o565K226O29J593n640m822N029L690R216M028K409n894j0861
16547B1943o734l150k92M310P448O20N808n150K6J866L902l429M00J0445o684
16532C1329o491p042k862L505M966m944k287N505O746J534k795r357n824M627
16518A6610k496O67M948j635r43Q948Q209p540j475L34k710n992L264P474M368
16503C2031k460j183J385M521n621q40R04o18l587K389J7690J5941N911L403J1153
$$ plain form
16605 33825 31606 25452 24604 23500 23679 29607 30663 24978 28030 25570 22830 33200 36405 28536 39303
16590 39303 41909 43702 38761 39380 34487 24766 19631 19759 26120 21499 18031 21346 26125 26929 27187
16575 27187 32559 30720 27836 25589 21058 25747 28533 32611 37434 32714 28648 36580 38752 36077
16561 36077 26905 20340 22566 23195 24788 19148 14326 19355 23045 32261 36289 38698 32804 21943
16547 21943 15209 12059 11767 16077 23525 24145 29953 24803 24829 26695 30597 27168 27568 38013 31329
16532 31329 24838 17796 14934 18439 23405 18461 16174 21679 28425 29959 27164 17807 11983 16610
16518 16610 14114 14781 19729 18094 17151 26099 34308 26768 25293 25627 22917 16925 20189 27663 32031
16503 32031 29571 28388 29773 34294 28673 27833 28737 28119 24532 26921 44611 60552 66463 69866 81019
16488H1019K257j497K016o904J084j0060j6460r804j075j52k12n927k012K991
16474C5264k019n215N484J838M043k612j0615k197O214O296K658r887o215L584
16460B6621J174R33k352o899o60M438J967J064K571m432j45K796j540l68j926
16445B3242K299O499O199O031Q171R466J0251N535R920P028k575p047j1034j4449
16431E9536r978k648k810K073l166N90m705m936Q02j785L81J110N307M8k257l33
16415C7229L89J232o64j132k327q33J398M369j980m681J484K324k243Q174l001
16400C9738O71J0587M442n25k993R660J0868J32O956M743J665p819p024o212l682
16385F1207q527n147n531l792j527J587L289o853K036j997p508j229j110r93L018
$$ plain form
16488 81019 83276 81779 83795 76891 77975 67915 51455 41651 40576 40424 40212 34285 32273 35264
16474 35264 33245 28030 33514 35352 39395 36783 26168 23971 30185 36481 39139 29252 23037 26621
16460 26621 27795 28728 26376 19477 18817 23255 25222 26286 28857 24425 24280 27076 25536 25168 23242
16445 23242 25541 32040 38239 44270 52441 61907 72158 77693 87613 94641 92066 85019 73985 59536
16431 59536 49558 46910 44100 46173 43007 43597 38892 33956 34758 32973 33354 34464 39771 39819 37562 37229
16415 37229 37618 38850 38186 37054 34727 33894 35292 39661 37681 33000 34484 36808 34565 42739 39738
16400 39738 40409 50996 55438 54913 51920 61580 72448 72580 79536 84279 85944 78125 71101 64889 61207
16385 61207 52680 47533 42002 38210 36683 38270 41559 34706 36742 34745 27237 26008 24898 23905 26923
16370B6923j793M703K24l590J795K614L713m12p91J800j907n153N517O455k466
16355C7632j222l336m016K000m236O415M304P090P496K932k036O803K131K412
16341F4369R564L234k035K933o132q277l518j28q889r578k624n036m916J007o230
16326B3744N411k301o521N963M454j646j02j46L203n883n809n25M415N861n288
16311B4830k234j55K438O235N777k621j1397l453N143M535L286m539l465M821
16297B9201K143L533k252l255j696l922k7j833O171k759l593r46J883J298o851
16282A7095j58P14m603N659m600n419j625R335K966m412k773P9L610J968j687
16267A6149N6Q925L491l647p257n105N703o64o043K099L414Q847K307n655j2724
$$ plain form
16370 26923 25130 29833 30057 26467 28262 30876 34589 34177 33386 35186 33279 28126 33643 40098 37632
16355 37632 36410 33074 29058 31058 26822 33237 37541 44631 52127 55059 53023 59826 61957 64369
16341 64369 73933 77167 75132 78065 71933 63656 60138 60010 51121 41543 38919 33883 28967 29974 23744
16326 23744 29155 26854 20333 26296 30750 29104 29002 28856 32059 26176 20367 19842 24257 30118 24830
16311 24830 22596 22441 24879 31114 36891 34270 22873 19420 24563 29098 32384 27845 24380 29201
16297 29201 31344 34877 32625 29370 27674 23752 23725 21892 28063 25304 21711 20765 22648 23946 17095
16282 17095 16937 17651 13048 18707 14107 8688 7063 16398 19364 14952 12179 12258 15868 17836 16149
16267 16149 16205 25130 28621 24974 17717 12612 18315 17651 11608 13707 17121 25968 28275 22620 9896
16252I896R46L601M421J453K642L946K45r515p022m203j404K3Q031L861N732L380
16236B6033r462m308m021M09L866L07J547J801l090m319O040k781m050P91K703
16221A1466k905R25k385l109n131J002Q44N763R781L847K747l4o40O375J620l956
16205B6210M771M012p711l419p89k146j0436N870j58k778j05M023K06k857j327
16190A3366K262j185L957M680n891k697l174L187N275L418k666k656p3L23L674
16175B1800l00q876k522K136j870l68M392J215L075K360p995r80O300K419j642
16160A9144L58L782o826n971K470J197n420J6J09M186J221o604p62N921L703K345
16144A8869L700k708j731k623K933O064O732p980j1346l626L950L110J441m406
$$ plain form
16252 9896 10842 14443 18864 20317 22959 26905 27150 17635 10613 6410 5006 5029 13060 16921 22653 26033
16236 26033 16571 12263 8242 8651 12517 12824 14371 16172 13082 8763 14803 12022 7972 8763 11466
16221 11466 8561 9486 7101 3992 -1139 -137 707 6470 16251 20098 22845 22811 22171 28546 30166 26210
16205 26210 30981 34993 27282 23863 23074 20928 10492 16362 16204 13426 13321 17344 17550 14693 13366
16190 13366 15628 14443 18400 23080 17189 14492 11318 14505 19780 23198 20532 17876 17803 18126 21800
16175 21800 21500 12624 10102 12238 10368 10000 14392 15607 18682 21042 13047 12067 18367 20786 19144
16160 19144 19502 23284 16458 10487 12957 14154 8734 8750 8859 13045 14266 7662 6900 12821 16524 18869
16144 18869 22569 19861 18130 15507 18440 24504 31236 23256 11910 8284 12234 15344 16785 12379
16130A2379l649l006L780M837L558R226N185M54n78m403j5468j0012L062L970
16116I335L926K236j972m439j796J125M633J207J668J649J810L345n051k549n671
16101I456m802k821M235j124m502J845m628l245P106J0422r83J781M113o247o002
16086D604N620k035m462K880Q291Q24q087k492N608k996p605o230j788J1453p21
16071B864k588M987j439r40p668R54Q152J50k214m387O602N399k57Q013K408q668
16055A1368l471M292O874k200n500j0050M069O114j19J031J649K292p38j9j3131
16040B461p73M772n376l643J443O758k689J423P062oJ850n853q369j194k770K881
16024b023R798P764K46m138n840m99q238n17O953L303L977K130M982j017m844
$$ plain form
16130 12379 8730 5724 9504 14341 17899 27125 32310 32764 32186 27783 12315 2303 5365 9335
16116 9335 13261 15497 13525 9086 7290 8415 13048 14255 15923 17572 19382 22727 17676 15127 9456
16101 9456 4654 1833 6068 4944 442 2287 -2341 -5586 1520 11942 10959 12740 16853 10606 4604
16086 4604 10224 8189 3727 6607 14898 15722 7635 5143 10751 7755 150 -6080 -7868 3585 2864
16071 2864 276 5263 3824 2884 -4784 -3830 4322 4472 2258 -2129 4473 9872 9615 17628 20036 11368
16055 11368 7897 12189 19063 16863 11363 1313 5382 11496 11377 12408 14057 16349 15611 15592 2461
16040 2461 1688 6460 1084 -2559 -1116 5642 2953 4376 11438 11432 13282 7429 -940 -2134 -4904 -2023
16024 -2023 7775 15539 15785 11647 5807 5308 -2930 -3447 3506 6809 10786 12916 17898 16881 12037
16009A2037j15J245l464j836k088m052K694J425O800M492L57l890p610n463L22
15994H54P41Q07P710m13K376k988o050k572o342J017J655j703j766P037l094N179
15978B448L274n063l882k474k525O656N656L067O25o38J246M382o709N663R648
15963B1374J339l240K017m441r163n203k350l74m191j761k119J368O370J537j994
15948h31o443J070N100j001Q162K111L973j493q065j421Q359R297N75m586k992
15933A1815j801M818M73J544n15l993m18M292m721o770Q66m066j907M084N499
15918I200J901J21J454j515M501k850l683J734l54K493l002j756K912J341j014
15903A1483n453k152K083O683k126k941Q893L023k178j098j0683r22N431J1122
$$ plain form
16009 12037 11922 13167 9703 7867 5779 1727 4421 5846 12646 17138 17495 13605 5995 532 854
15994 854 1595 2402 10112 9699 12075 9087 3037 465 -5877 -4860 -3205 -4908 -6674 363 -2731 2448
15978 2448 5722 659 -3223 -5697 -8222 -1566 4090 7157 7782 7144 8390 12772 6063 11726 21374
15963 21374 22713 19473 21490 17049 7886 2683 333 -41 -4232 -5993 -8112 -6744 -374 1163 -831
15948 -831 -7274 -6204 -1104 -2105 6057 8168 12141 10648 2583 1162 9521 18818 19393 14807 11815
15933 11815 10014 14832 15305 16849 16334 12341 11923 16215 11494 4724 5590 1524 -383 3701 9200
15918 9200 11101 11222 12676 11161 15662 12812 9129 10863 10509 13002 10000 8244 11156 12497 11483
15903 11483 6030 3878 5961 12644 10518 7577 16470 19493 17315 16217 5534 4612 10043 21165
15889B1165R251o115q281n173l568l467m352J361j245K374K748N720P840m290
15875A3968o03j575J001K564l451k604o72K615M30o579o800m250L284N113M167
15860F608m656r124M428m221j557J0777j734k194L938K969O07j959M139j838l600
15845B583M341J533J5n175j615p29M595M058N47m084j151l493N735K233n816L7
15829C614k090J000N574N276L103j315m962L93l109l223Q707l31p077o6o06L523
15813H411j761l306J2l89N313K472M223k345K158L13j090O970Q073l476n899n350
15797A4329Q56l767j562M387K309J82k639J434P428J067q19q882l880l55M537
15782A4625N70K86N610R021L900m27m791r880k979n39k558J256M074j37L421K306
$$ plain form
15889 21165 30416 24301 16020 10847 7279 3812 -540 821 -424 1950 4698 10418 18258 13968
15875 13968 13365 11790 12791 15355 11904 9300 8628 11243 11673 5094 -1706 -5956 -2672 2441 6608
15860 6608 1952 -7172 -2744 -6965 -8522 2255 521 -1673 2265 5234 5841 3882 8021 6183 2583
15845 2583 6924 8457 8472 3297 1682 953 5548 9606 10153 6069 4918 1425 7160 9393 3577 3614
15829 3614 1524 2524 8098 13374 16477 15162 10200 10593 7484 4261 12968 12637 5560 5494 4888 8411
15813 8411 6650 3344 3356 2967 8280 10752 14975 12630 14788 15101 14011 20981 29054 25578 19679 14329
15797 14329 15185 11418 9856 14243 16552 16734 14095 15529 22957 24024 23205 14323 10443 10088 14625
15782 14625 15195 15481 21091 30112 34012 33585 28794 18914 15935 15396 12838 14094 18168 18031 21452 23758
15766B3758p25o774l29M104O66o13N312J0818L934j115o413p544O383M959J805
15751C8226o083K066k737j0006p524N71N274J882j623m619p385l958K718N676
15737A2478K766P670O248r765n458N457l261j466j864P77K672M450j918n514o105
15722G167k114N349O90J57M862J470q037n385J258j79o014K178O239r67o628q328
15706h282N736M665n90o933k522l324P784L802R551Q335j550j705p80l553r935
15691F99o650j831M519l66N532J774k40p00K870J740j366j508l679K708m924l815
15675e237M352N990M971l259O089l840m371O816p67k164l574l684M70J766l000
15660E58k210k231J32j121M293P952N085k329n465o899q21K349K704r152K095
$$ plain form
15766 23758 23033 16259 15930 20034 20700 20087 25399 36217 40151 39036 32623 25079 31462 36421 38226
15751 38226 32143 34209 31472 21466 13942 14513 19787 21669 20046 15427 8042 4084 6802 12478
15737 12478 15244 22914 29162 19397 13939 19396 16135 14669 12805 13582 16254 20704 18786 13272 7167
15722 7167 5053 10402 11092 11249 16111 17581 9544 4159 5417 5238 -776 1402 7641 6674 46 -8282
15706 -8282 -2546 2119 1529 -5404 -7926 -11250 -3466 336 9887 18222 16672 14967 14187 10634 699
15691 699 -5951 -7782 -3263 -3629 1903 3677 3437 2737 5607 7347 5981 4473 794 3502 -1422 -5237
15675 -5237 -885 5105 10076 6817 12906 9066 4695 11511 10744 8580 5006 1322 1792 3558 558
15660 558 -1652 -3883 -3751 -4872 -579 7373 12458 10129 4664 -2235 -3056 -707 1997 -7155 -5060
15645e060M940M975M85K806R10L617N692q96m412j1618l532L972K148J866j630
15630D263m293k334j140R91j228q103M927M812l990M45J322o94l04N465N5L808
15614D002K918q682n19M43r741k229Q504N265J241K421r58j2941j165L668M849
15599b924n39n31J845M08m928k661k410R01L571L413L586l344J19K906k967J780
15583a775N810j110o627j575j210P970l34m677P626M84J56j154n066k640N294
15568A172R123j324n591n391o804p29M890k464K03j940L086j730J776J052J310
15553c361N973O23k872m133r74K747k794r745l438L467J0185P680q236n165l080
15538a3123L437J1055K022o097K707j304K555l850l902j22L553l213j49R024l08
$$ plain form
15645 -5060 -120 4855 5340 8146 9056 12673 18365 17469 13057 1439 -2093 1879 4027 5893 4263
15630 4263 -30 -2364 -3504 -2513 -3741 -11844 -6917 -2105 -6095 -5650 -4328 -5022 -5326 139 194 4002
15614 4002 6920 -1762 -2281 -1838 -11579 -13808 -5304 -39 1202 3623 2665 -10276 -11441 -7773 -2924
15599 -2924 -3463 -3994 -2149 -1741 -6669 -9330 -11740 -10839 -7268 -3855 -269 -3613 -3494 -588 -3555 -1775
15583 -1775 4035 2925 -3702 -5277 -6487 1483 1149 -3528 4098 4582 4738 3584 -1482 -4122 1172
15568 1172 10295 8971 3380 -2011 -8815 -9544 -4654 -7118 -6915 -8855 -5769 -7499 -5723 -4671 -3361
15553 -3361 2612 3235 363 -3770 -4744 -1997 -4791 -14536 -17974 -14507 -4322 3358 -4878 -10043 -13123
15538 -13123 -9686 1369 3391 -2706 1 -1303 1252 -2598 -6500 -6622 -3069 -6282 -6431 2593 2285
15523B285l15K330p077p2M275M3k1K308r46M877R488m420r482k057m878m083M243
15506c502k950q494j281O073j202m085O840o336m909N462L875j95l634K541N842
15491e955J249N88J765k209L660p59j4227M180J081L076J459M430J048j93l960
15476d767q131L701K838k79P701Q57j761n761j048r71n157L838m754k330N352
15461a0672M189j790O80o64n13k947M282J337j465N976Q237k041j188q604M21
15446d762O988J445j730m655n3j45m915K323O010q411p018M455J1202K289J426
15431D449J44J334o632L199o621k13J1254p077q807j613o339N161M271k362J375
15416h477Q52M403L641j119q16j168m822L942K44k588N271l027j201l357J050
$$ plain form
15523 2285 1970 4300 -2777 -2849 1426 1469 1448 3756 2810 7687 17175 12755 3273 1216 -3662 -7745 -3502
15506 -3502 -6452 -14946 -16227 -10154 -11356 -15441 -8601 -14937 -19846 -14384 -10509 -10704 -14338 -11797 -5955
15491 -5955 -4706 -4118 -2353 -4562 -902 -1661 -15888 -11708 -10627 -7551 -6092 -1662 -614 -807 -4767
15476 -4767 -12898 -9197 -6359 -6638 1063 1920 159 -5602 -6650 -7621 -12778 -8940 -13694 -16024 -10672
15461 -10672 -6483 -8273 -7593 -8257 -8770 -11717 -7435 -6098 -7563 -1587 6650 4609 3421 -5183 -4762
15446 -4762 2226 3671 1941 -2714 -2767 -2912 -7827 -5504 506 -7905 -14923 -10468 734 3023 4449
15431 4449 4593 5927 -705 2494 -4127 -4340 6914 -163 -8970 -10583 -16922 -11761 -7490 -9852 -8477
15416 -8477 -7625 -3222 419 -700 -1516 -2684 -7506 -3564 -3320 -5908 -637 -3664 -4865 -8222 -7172
15401g172j022J308R65m863n520j471J769N395m64k187N737K444Q301m718J785
15386B87p49p094k785O297m715l366L034L206O48J76j156L658l931m27M902M618
15370B603l611k384M94k884m072K234m460N86n33M752Q204L74L14M090k523r092
15354e908q230J405M541M510K109J535R50L970j770q069k753Q5J29O770O807Q364
15338A4445n226n017R88j500j205j836q325n11N047K521l453j940K79o378m585
15323a6696j557O606L170k461p058o435N096P348j262O612N483J199l826m449
15309h230N478M404q884n065K832O990M65K931L611j241K626q41K462l661l587
15294B90l678n191K960J718p658O257L940j87K34J380M328J501j597P28l961r87
$$ plain form
15401 -7172 -8194 -6886 -5921 -10784 -16304 -17775 -16006 -10611 -11075 -13262 -7525 -5081 3220 -1498 287
15386 287 -462 -7556 -10341 -4044 -8759 -12125 -9091 -5885 -5237 -5061 -6217 -2559 -6490 -6917 -2015 2603
15370 2603 -1008 -3392 -2898 -5782 -9854 -7620 -12080 -11494 -12027 -7275 929 1303 1617 5707 3184 -5908
15354 -5908 -14138 -12733 -8192 -3682 -1573 -38 912 4882 3112 -4957 -7710 -7625 -7496 -726 6081 14445
15338 14445 9219 4202 5190 3690 2485 649 -7676 -8187 -3140 -619 -4072 -6012 -5733 -12111 -16696
15323 -16696 -18253 -11647 -8477 -10938 -17996 -24431 -19335 -11987 -13249 -6637 -1154 45 -3781 -8230
15309 -8230 -2752 1652 -7232 -12297 -9465 -2475 -2010 921 4532 3291 5917 5076 7538 3877 290
15294 290 -3388 -8579 -5619 -3901 -11559 -5302 -1362 -1549 -1315 65 4393 5894 4297 5025 1064 77
15278G7n401k171o07L87m732L703J599j972K317j31j717N959K360r237l920m653
15262a8139N83L77J040k073K536K49l402L160L609l765K536K285k341k191o423
15247b1959J983O448r9m288k624L814L72L613N45k291O947N598M35k696m513k558
15231a1273l25O99l10O470J850K599p092j153n653j314J228O881J750l753O707
15216b689l098m174o830J312m23n813Q48Q03k69K343N294N736J151l93k737l168
15200a2107L698l074m510j378K642j173L020p20k740o770R49L579o23k943o67
15185b2817j622K598O318N568j017M749L306l750l780o774r40K184K552j534J1
15170a4948k341j226l306J920K514J581N950l032m140q52N882P300k59m22j346
$$ plain form
15278 77 -5324 -7495 -8102 -7715 -12447 -8744 -7145 -9117 -6800 -6931 -8648 -2689 -329 -9566 -13486 -18139
15262 -18139 -17556 -17179 -16139 -18212 -15676 -15427 -18829 -15669 -12060 -15825 -13289 -11004 -13345 -15536 -21959
15247 -21959 -19976 -13528 -13627 -17915 -20539 -16725 -16353 -12740 -12195 -14486 -7539 -1941 -1506 -4202 -8715 -11273
15231 -11273 -11598 -10899 -11209 -4739 -2889 -290 -7382 -8535 -14188 -15502 -14274 -7393 -5643 -9396 -2689
15216 -2689 -5787 -9961 -16791 -15479 -15902 -21715 -20867 -20064 -20333 -17990 -12696 -6960 -5809 -6202 -8939 -12107
15200 -12107 -8409 -11483 -15993 -17371 -14729 -15902 -12882 -13602 -16342 -23112 -22163 -18584 -19207 -22150 -22817
15185 -22817 -24439 -21841 -15523 -9955 -10972 -6223 -2917 -6667 -10447 -17221 -18161 -15977 -13425 -14959 -14948
15170 -14948 -17289 -18515 -21821 -19901 -17387 -15806 -9856 -12888 -17028 -17880 -11998 -4698 -4957 -5379 -6725
15155f725k407J43l734q20M188m598j104K465n15l66M20L091m48K331J297j712
15139h494K001k3l227m85O62L58N521K208l693N603o844r105k699k853O400j288
15123a5958K341l440j631N32N797P111N431n462o236r20L821k36M506r566l156
15108a7066K483K080L183L941m775n182P81m088o410K901k26r14J1587N335l800
15093a0170j625J011o595l6R451L908l731Q73M981l589K090L932q691K000K095
15078d096n004L199R81q6l677K436m112P1J075M809r4M98K76l267L3k011k121
15061a1090M588M743m062M561k691j433n331j934N735N186M603j100K399L943
15047H117N300k311m519J159l517j0806k479j327J189m332o379J323M124j157
$$ plain form
15155 -6725 -9132 -8989 -12723 -13543 -9355 -13953 -15057 -12592 -13107 -13473 -13053 -9962 -10410 -8079 -6782 -8494
15139 -8494 -6493 -6516 -9743 -10228 -9566 -9208 -3687 -1479 -5172 431 -6413 -15518 -18217 -21070 -14670 -15958
15123 -15958 -13617 -17057 -18688 -18156 -12359 -5248 183 -5279 -11515 -12435 -8614 -8850 -4344 -13910 -17066
15108 -17066 -14583 -12503 -9320 -5379 -10154 -15336 -14555 -18643 -25053 -22152 -22378 -23292 -11705 -6370 -10170
15093 -10170 -11795 -10784 -17379 -17415 -7964 -4056 -7787 -6914 -1933 -5522 -3432 500 -8191 -6191 -4096
15078 -4096 -9100 -5901 -4920 -5006 -8683 -6247 -10359 -10288 -9213 -4404 -4498 -4000 -3724 -6991 -6958 -8969 -11090
15061 -11090 -6502 -1759 -5821 -1260 -3951 -5384 -10715 -12649 -6914 -1728 2875 1775 4174 8117
15047 8117 13417 11106 6587 7746 4229 -6577 -9056 -10383 -9194 -13526 -19905 -18582 -14458 -15615
15033a5615J162q9l72J56P364N273K081K41k44m767m685j981N949j548j448N449
15017c074K161l410K111J983k821r747o619j85M980J634K569J372K984M469l841
15002e434o603o351M282j090O414J727r83o894j226J948j904p88N85J325J905
14987a3087m537K314R365O95m12P588m75J2545k869l593M335o889N66n39l392
14972A615n907O407J0699J2304J2685P117P673J3889J8668K1166K8317O2223J09129
14959C05985K11937L82622N52488N16203K43688k71414o22996m80701k55514j41346
14949D40952r3983n2554m7906l5615j7692j3731j8184j0383q937j0607p832n466
14937A18062n310j501j1403n276o46l975o294j742j1247o075l829l627r68M013
$$ plain form
15033 -15615 -14453 -14542 -14914 -14758 -7394 -2121 -40 201 -43 -4810 -9495 -11476 -5527 -7075 -8523 -3074
15017 -3074 -913 -4323 -2212 -229 -3050 -12797 -19416 -19601 -14621 -12987 -10418 -9046 -6062 -1593 -5434
15002 -5434 -12037 -18388 -14106 -15196 -8782 -7055 -8038 -14932 -16158 -14210 -16114 -16902 -16317 -14992 -13087
14987 -13087 -17624 -15310 -5945 -5250 -5662 1926 1451 13996 11127 7534 11869 4980 5546 5007 1615
14972 1615 -4292 2115 12814 25118 37803 44920 52593 66482 85150 106316 134633 196856 305985
14959 305985 517922 900544 1453032 1969235 2212923 1941509 1318513 837812 582298 440952
14949 440952 346969 294415 246509 210894 193202 179471 161287 150904 141967 131360 123528 118062
14937 118062 112752 111251 99848 94572 93926 89951 83657 81915 70668 64593 60764 57137 56169 60182
14923F0182N540K184l394j08r525n924L813j064l191l363L96N574J425m883l138
14908D4524l072p165n843J534L663J711m634M25L59r235j116L13k12M186J227
14893B6665p268l457o872K926O083J681l378k581m394L5k749L43J977j330m892
14878B789L349P195m399o281j54J143l83R88P416j490O09K238J000k394k804j595
14862G227j787o096n812k295j805N238L711K452j206o287r119m101Q43J817M176
14847a3044N298R357p44M12N73M776l030j451m234l907K312L91L163N180L8q806
14831c716N880j446j57o30j488J832k914j99n471R28J67O76k689j840L92R641
14815a034M453m376l800l623k483P656L630o761q864K29J1527K943O971m515r87
$$ plain form
14923 60182 65722 67906 64512 64404 54879 48955 52768 51704 48513 45150 45546 51120 52545 47662 44524
14908 44524 41452 34287 28444 29978 33641 35352 30718 31143 31502 22267 21151 21464 21252 25438 26665
14893 26665 19397 15940 9068 11994 18077 19758 16380 13799 9405 9440 6691 7034 9011 7681 2789
14878 2789 6138 13333 8934 2653 2499 3642 3259 4247 11663 10173 10782 13020 14020 11626 8822 7227
14862 7227 5440 -656 -6468 -8763 -10568 -5330 -1619 833 -373 -6660 -15779 -19880 -19037 -17220 -13044
14847 -13044 -7746 1611 867 1279 1852 6628 3598 2147 -2087 -5994 -3682 -3291 -128 5052 5090 -3716
14831 -3716 2164 718 561 -69 -1557 275 -2639 -2838 -8309 -7381 -7214 -6538 -9227 -11067 -10675 -1034
14815 -1034 3419 -957 -4757 -8380 -10863 -3207 423 -6338 -15202 -14973 -3446 -503 6468 1953 966
14800I66k824m411q098l271l214r749K542O065K656l698j65j948M296M944N773
14785a0136m643p94M880M044j019k965M038j176q213k470j942O664J6576j348
14771A496p848k466M531M98Q30k291L340m107o669M944M049j227l930k889L88
14756a1351l258O684n63m149m648Q20M963L545l768N368J809L93o16k045M449
14741b367j947n944l91K348j693k244K051L113m283l112K346l787L851K774M89
14726h796l386k212K091M277j392k255J514K71k912k756M101k71r35o422M21O005
14710a2657M825R64K112K870k091J428l713j0647N577J975r73q968J731j973j511
14695b1051O06J2879k709m914l498O274O321p11o264n59n688M964K986p16o888
$$ plain form
14800 966 -1858 -6269 -14367 -17638 -20852 -30601 -28059 -21994 -19338 -23036 -23201 -25149 -20853 -15909 -10136
14785 -10136 -14779 -15573 -10693 -6649 -7668 -10633 -6595 -7771 -15984 -18454 -20396 -13732 2844 1496
14771 1496 -6352 -8818 -4287 -3789 -2959 -5250 -1910 -6017 -12686 -7742 -3693 -4920 -8850 -11739 -11351
14756 -11351 -14609 -7925 -8488 -12637 -17285 -16465 -11502 -7957 -11725 -6357 -4548 -4155 -4771 -6816 -2367
14741 -2367 -4314 -10258 -10649 -8301 -9994 -12238 -10187 -7074 -11357 -14469 -12123 -15910 -12059 -9285 -8796
14726 -8796 -12182 -14394 -12303 -8026 -9418 -11673 -10159 -9888 -12800 -15556 -11455 -11726 -12661 -19083 -18662 -12657
14710 -12657 -7832 -6868 -4756 -1886 -3977 -2549 -6262 -16909 -11332 -9357 -10330 -19298 -17567 -19540 -21051
14695 -21051 -20445 -7566 -10275 -15189 -18687 -12413 -6092 -6803 -13067 -13626 -19314 -14350 -11364 -12080 -18968
14680a8968n160j743k063M484R06k348l11M398L338p70J806L546J716m708k003
14665a7880m339L250N641n153p870O71N409L786O144o69n301n61L036P87K110
14650a0939n040N516P173K969m398k987N672m447P91m84k774p722k929J93K68
14635a9138P072M033J250M80l502q051p80L846m990M625K82J813L52J705M314
14620f689Q67M002M690q569p104l387j163J55M713K608o641q111q697Q375J5748
14605i203N719j462q278j1130n435k670l364J0867Q899K396o633k196k28N34J421
14590b0763j67K109K845j716o691o466K501M476l177m551J720M477J730k933R928
14575a6678L614r80K472r99m450k556M16k691q813p50R661K574j171L402p38m443
$$ plain form
14680 -18968 -24128 -25871 -27934 -23450 -22544 -24892 -25203 -20805 -17467 -18237 -16431 -12885 -11169 -15877 -17880
14665 -17880 -22219 -18969 -13328 -18481 -26351 -25680 -20271 -16485 -10341 -11010 -16311 -16872 -13836 -13049 -10939
14650 -10939 -15979 -10463 -3290 -321 -4719 -7706 -2034 -6481 -5690 -6174 -8948 -16670 -19599 -19406 -19138
14635 -19138 -12066 -8033 -6783 -6303 -9805 -17856 -18636 -14790 -19780 -15155 -14873 -13060 -12708 -11003 -6689
14620 -6689 -5822 -1820 2870 -5699 -12803 -16190 -17353 -17198 -12485 -9877 -16518 -24629 -33326 -24951 -9203
14605 -9203 -3484 -4946 -13224 -24354 -29789 -32459 -35823 -24956 -16057 -13661 -20294 -22490 -22718 -22184 -20763
14590 -20763 -20930 -18821 -15976 -17692 -24383 -30849 -28348 -23872 -27049 -31600 -29880 -25403 -23673 -26606 -16678
14575 -16678 -13064 -14044 -11572 -12571 -17021 -19577 -19161 -21852 -30665 -31415 -21754 -19180 -20351 -16949 -17687 -22130
14559b2130J0304K050J384L616o277p167l00q124r2N032J0250R54J186n989q648
14544b3951j508L208N369p638p758N12q90J049l608O046N005M484m59p021k446
14529b9606P158j589J09J698P94N240N860m432r798l618K76L657N500j295N162
14514a4884l628m230M484M468j888J797o155J633L978j719m038L039L400K501
14500a1242m975q027k339M090J196k044P109L70k159k648j555K319K575k857q154
14485b8341k797n86j936q77M767j816M637J851J491J544K39P2k740l77L829J739
14469a9301n416m856p02N10O341L392m15j617o03L564N245m685K090L708Q856
14454c889n765o53K294o049j260L651L509J8j088K715J996o218j2139M64K863
$$ plain form
14559 -22130 -11826 -9776 -8392 -4776 -11053 -18220 -18520 -26644 -26736 -21704 -11454 -10500 -9314 -15303 -23951
14544 -23951 -25459 -22251 -16882 -24520 -32278 -31766 -32656 -31607 -35215 -29169 -24164 -19680 -20139 -27160 -29606
14529 -29606 -22448 -24037 -23928 -22230 -21436 -16196 -10336 -14768 -24566 -28184 -27908 -24251 -18751 -20046 -14884
14514 -14884 -18512 -22742 -18258 -13790 -15678 -13881 -20036 -18403 -14425 -16144 -20182 -17143 -13743 -11242
14500 -11242 -16217 -24244 -26583 -22493 -21297 -23341 -16232 -15862 -18021 -20669 -22224 -19905 -17330 -20187 -28341
14485 -28341 -31138 -31724 -33660 -34537 -29770 -31586 -26949 -25098 -23607 -22063 -21824 -21752 -24492 -24869 -21040 -19301
14469 -19301 -24717 -29573 -30275 -29765 -23424 -20032 -20447 -22064 -22667 -19103 -13858 -18543 -16453 -12745 -3889
14454 -3889 -9654 -10307 -8013 -14062 -15322 -11671 -8162 -8144 -9232 -6517 -4521 -10739 -22878 -22414 -19551
14439a9551o87P94N8m538j041j964L553M935O567m010k999M843J0249k829m242
14424a0862o363l382l828K335K181k336K064L607N908n619j776k220k119L191
14410a9219J026O805N599p060o92K179p49m983l477Q95O07m980j174M820k073
14395b2476K909M199N590M542K209R176J133m992j3367M2M502K188k059n642p157
14380a9203M580O416j157N773j693o358m199Q095L058K571n993o61K628o871p000
14365b0014K790N951K30q612N50K833M962j098k381m243K724j035k098J499M175
14350a3767J661K438n672l846k941o899N370M234P015K242j402m20j724m363J788
14335a6286n94n27M208M257J007p8p721j956K897j11l370k142P94K531M035L509
$$ plain form
14439 -19551 -20238 -19444 -19386 -23924 -24965 -26929 -23376 -18441 -11874 -15884 -18883 -14040 -3791 -6620 -10862
14424 -10862 -17225 -20607 -24435 -22100 -19919 -22255 -20191 -16584 -10676 -16295 -18071 -20291 -22410 -19219
14410 -19219 -18193 -11388 -5789 -12849 -13541 -11362 -12111 -17094 -20571 -19676 -19069 -24049 -25223 -20403 -22476
14395 -22476 -19567 -15368 -9778 -5236 -3027 6149 7282 2290 -11077 -11035 -6533 -4345 -6404 -12046 -19203
14380 -19203 -14623 -8207 -9364 -3591 -5284 -11642 -15841 -7746 -4688 -2117 -8110 -8771 -6143 -13014 -20014
14365 -20014 -17224 -11273 -11043 -19655 -19105 -16272 -11310 -12408 -14789 -19032 -16308 -17343 -19441 -17942 -13767
14350 -13767 -12106 -9668 -15340 -19186 -22127 -29026 -23656 -19422 -12407 -10165 -11567 -11987 -13711 -18074 -16286
14335 -16286 -16880 -17407 -13199 -8942 -7935 -8013 -15734 -17690 -14793 -14904 -18274 -20416 -19622 -17091 -13056 -9547
14319i547l856o837O46k597j943M12N672M479N420j512m743O17K822m709r634
14304b5310P66N177J1863L869m864l59m25k445j033R04k314N19k47m320N221L845
14288i153k204l447p971N776L261m113L64j199p01J253J110P312N355p832K393
14273i796K519n683O25k442m182J582j582k374J1432j680j042k56r870m534j096
14258b8379L800K679l63J13P958L792M787m058m432K835L905L496m839p383j1361
14243b7450k455P477Q866L810q405m649l628m546N004M570O923K008j513l405
14229a7393q07o40M51O555p78j688m894M423k573m548L599N292k687l496N808
14214a3376J793m21O48k218J494k819l356O010O30r234q03k589O25r77l925M351
$$ plain form
14319 -9547 -13403 -20240 -19594 -22191 -24134 -23722 -18050 -13571 -8151 -9663 -14406 -13789 -10967 -15676 -25310
14304 -25310 -24544 -19367 -7504 -3635 -8499 -8858 -9283 -11728 -12761 -11857 -14171 -13652 -13899 -18219 -12998 -9153
14288 -9153 -11357 -14804 -22775 -16999 -13738 -17851 -17487 -18686 -19387 -18134 -17024 -9712 -4357 -12189 -9796
14273 -9796 -7277 -12960 -12335 -14777 -18959 -17377 -18959 -21333 -9901 -11581 -12623 -12879 -22749 -27283 -28379
14258 -28379 -24579 -21900 -22263 -22150 -14192 -10400 -5613 -9671 -14103 -11268 -7363 -3867 -8706 -16089 -27450
14243 -27450 -29905 -22428 -13562 -9752 -18157 -22806 -26434 -30980 -25976 -21406 -14483 -12475 -13988 -17393
14229 -17393 -18200 -18840 -18389 -11834 -12612 -14300 -19194 -14771 -17344 -21892 -18293 -13001 -15688 -19184 -13376
14214 -13376 -11583 -12004 -11356 -13574 -12080 -14899 -18255 -12245 -11615 -20849 -21652 -24241 -23616 -24593 -28518 -24167
14198b4167L792n162n194J111O063K522K572J413P79N447K96m160J600m987L09
14183a7766l689n361j112K376K290j0328J05M8O622R237K83N672J666n666j2306
14168b7929j489M567K758j224l578M227P772J125K00J026k198P28o250Q5Q056
14153a2124j224J884O0n41m342k672N258j752m046J239n26J938j912M94L834N230
14137i202K017p736l058M115L197n308m56L446L462O371l875k719K52l712N689
14122g517J582r17L679O59q859j0221M983m514J435M18j1k333K764K650O446k316
14106a2072k101k174p133k432M73N446q27m082K036N753K618K072R47R01M651
14091e924L317k700p691o642J470M759k295L234L005k303o281l8R200M333O1r925
$$ plain form
14198 -24167 -20375 -25537 -30731 -29620 -23557 -21035 -18463 -17050 -16271 -10824 -10528 -14688 -13088 -18075 -17766
14183 -17766 -21455 -26816 -27928 -25552 -23262 -33590 -33485 -33437 -26815 -17578 -17295 -11623 -9957 -15623 -27929
14168 -27929 -29418 -24851 -22093 -23317 -26895 -22668 -14896 -13771 -13571 -12545 -14743 -14015 -20265 -20180 -12124
14153 -12124 -13348 -11464 -11404 -11945 -16287 -18959 -13701 -15453 -19499 -18260 -18786 -16848 -18760 -18266 -14432 -9202
14137 -9202 -7185 -14921 -17979 -13864 -10667 -15975 -16431 -12985 -9523 -3152 -7027 -9746 -9494 -13206 -7517
14122 -7517 -5935 -6852 -3173 -2514 -11373 -21594 -16611 -21125 -19690 -19272 -19283 -21616 -18852 -16202 -9756 -12072
14106 -12072 -14173 -16347 -23480 -25912 -25439 -19993 -20820 -24902 -22866 -17113 -14495 -12423 -11476 -10575 -5924
14091 -5924 -2607 -5307 -12998 -19640 -18170 -13411 -15706 -12472 -9467 -11770 -18051 -18089 -8889 -4556 -4495 -14420
14075a4420M60M201P856m725m565j289K637o421M286L667k308j930R84k404j407
14060a5378L056K669J428o609K890K192j61M071N801M420k891r087j332j071J5215
14045E213N124j091j880m164o574n366l88J370K584m979o461L274m39k939L279
14030a3437k715J420M51j342L178N666j621n436q96J705M064L778o08q751l020
14015a7564K927j026j069J591L195J833q76n293j961P363P349N015L485m00q438
14000c869m433k837q956m018L706j22J9O91M346Q411n58k01j67p35n135n65K994
13983a1429k194l48O587R687L78M00L687p105K895L903l011L476n284J215k037
13968H20j273J91J406L819j443k112k655k71J524p5m534K351L649L788K676J349
$$ plain form
14075 -14420 -13960 -9759 -1903 -6628 -11193 -12482 -9845 -16266 -11980 -8313 -10621 -12551 -11567 -13971 -15378
14060 -15378 -12322 -9653 -8225 -14834 -11944 -9752 -9913 -5842 -41 4379 1488 -7599 -8931 -10002 5213
14045 5213 10337 9246 7366 3202 -3372 -8738 -9126 -7756 -5172 -10151 -16612 -13338 -13777 -16716 -13437
14030 -13437 -16152 -14732 -14281 -15623 -12445 -6779 -8400 -13836 -14732 -13027 -8963 -5185 -5793 -14544 -17564
14015 -17564 -14637 -15663 -16732 -15141 -11946 -10113 -10989 -16282 -18243 -10880 -3531 1484 4969 4569 -3869
14000 -3869 -8302 -11139 -20095 -24113 -20407 -20529 -20510 -19819 -15473 -7062 -7620 -7821 -7988 -8723 -13858 -14423 -11429
13983 -11429 -13623 -13971 -7384 2303 2681 3081 6768 -337 2558 6461 3450 6926 1642 2857 820
13968 820 -453 -262 1144 4963 3520 1408 -1247 -1518 6 -69 -4603 -2252 1397 5185 7861 9210
13952I210J043l963m976k570n90k174L095N523j009m444j159O714o97O52O61k178
13936C138K453k351K210J130l357L71L327o664k289O53P823O208k843m309R8L227
13920H825K375j355K071O92m58J61m21K88Q89L808J438N686J645q505p738l402
13904E999J3390P054r08N486K44k868Q731L213k869n185m261j787L63O881J172
13889C4655k725l767p30j86q61N933K246K75j059m803M118O67K356q35O749R59
13873D2992j248n908k127Q307L178l307K577N148L704k334L824M844k304l046
13859E4300n463m022j89M946R73j399k539l275N504k314k079Q77R07j408R55l402
13843D2372k797J581j165j101K91L813M987n863o34n797o371k522N100L725p855
$$ plain form
13952 9210 10253 6290 1314 -1256 -1846 -4020 -925 4598 3589 -855 -2014 4700 4003 4655 5316 3138
13936 3138 5591 3240 5450 6580 3223 3594 6921 257 -2032 -1379 6444 12652 9809 5500 5598 8825
13920 8825 11200 9845 11916 12608 12150 12311 11890 12178 13067 16875 18313 23999 25644 17139 9401 5999
13904 5999 19389 26443 25535 31021 31265 28397 37128 40341 37472 32287 28026 26239 26602 33483 34655
13889 34655 31930 28163 27433 27247 26386 32319 34565 34840 33781 28978 33096 33763 36119 35284 42033 42992
13873 42992 41744 35836 33709 42016 45194 41887 44464 49612 53316 50982 54806 59650 57346 54300
13859 54300 48837 44815 44626 49572 50545 49146 46607 43332 48836 46522 44443 45320 46227 44819 45774 42372
13843 42372 39575 41156 39991 38890 39181 42994 47981 42118 41484 35687 29316 26794 31894 35619 27764
13828B7764j0193J389R240K865k648L481p07j310L216R230N05o187r979m951K873
13813B4588J000L77l774M245Q482k248k941o54K15J274K709K365j606l909J142
13798C1265L598l43l271L960J490l548m911j00O178j500q395O34L478K053j495
13783B9093P056J07l817L286J508J631j269M425K367P4m102m101k987k820l759
13768B6692k41P384J336R6l490n06o030o02L641Q45j404J2133O307j93p753J582
13752C9797p77R21n435m293K672M099K712p65p274k510R561k968k735l68n529
13737B7108J063M471J572j224N081R623j534Q6o202o919P97p995j5854j290Q088
13722A6871M876P364J829l051j659l135l888o173J428N645N519K982J094O910
$$ plain form
13828 27764 17571 18960 28200 31065 28417 31898 31191 29881 33097 42327 42832 36645 26666 21715 24588
13813 24588 25588 25965 22191 26436 34918 32670 29729 29075 29290 30564 33273 35638 34032 30123 31265
13798 31265 34863 34520 31249 35209 36699 33151 28240 28140 34318 32818 24423 25057 28535 30588 29093
13783 29093 36149 36256 32439 35725 37233 38864 37595 42020 44387 44461 40359 36258 33271 30451 26692
13768 26692 26451 33835 35171 35267 31777 31271 25241 24639 28280 29125 27721 39854 46161 45968 38215 39797
13752 39797 39020 39941 34506 30213 32885 36984 39696 38931 31657 29147 38708 35740 33005 32637 27108
13737 27108 28171 32642 34214 32990 38071 47694 46160 46246 40044 33125 33922 25927 10073 8783 16871
13722 16871 21747 29111 30940 27889 26230 23095 19207 13034 14462 20107 25626 28608 29702 36612
13708C6612j333k499J441p20k326j734j166l121n136K380O493J024j950L530O8
13693C1563j370k772J0571j371k62P788l379m198m952m719L447M799l946r50P156
13678C7405j202o223l289J805l650Q36K913l62J429J608q007M38q09j980M597
13663B5509q17m326k246M679R643M284k764n531m224k146N788M154m13J59k710
13648B9039n826M905L436K793K720L209k196L48L815N216j509k246K322J860M125
13633E2011J234P470J8626J7166J9267K7388K8811L0407J0453j3401k8076k4619
13621A46737j3178j0033k0517j2575n936j1710l689M354K417M891m303q321J539
13608F9676J504j61m14P003j769P608J0593J5038R155N33L151K584J5817K4287
$$ plain form
13708 36612 35279 32780 34221 33501 31175 29441 28275 25154 20018 22398 28891 29915 27965 31495 31563
13693 31563 30193 27421 37992 36621 36359 44147 40768 36570 31618 26899 30346 35145 31199 30249 37405
13678 37405 36203 29980 26691 28496 24846 25682 28595 28233 29662 31270 23263 23701 22892 20912 25509
13663 25509 24692 20366 18120 22799 32442 36726 33962 28431 24207 22061 27849 32003 31590 31749 29039
13648 29039 23213 28118 31554 34347 37067 40276 38080 38428 42243 47459 45950 43704 46026 47886 52011
13633 52011 53245 60715 79341 96507 115774 143162 171973 202380 212833 199432 171356 146737
13621 146737 133559 123526 103009 90434 84498 72788 69099 73453 75870 80761 76458 68137 69676
13608 69676 71180 71019 70605 77608 75839 83447 94040 109078 118233 118766 121917 124501 140318 164605
13594A64605L4263M6506O4209N2237L9534M943k5006n5085n0711l8836l2756j6418
13582A87485j3648j1589j2072l778l327K134L616l976j3286l444L799o80j797
13569A29437k4n849J075L596r60j972j918N991J2502J3823R420R133J9520L0298
13555B24072L0557K0314p920k5387k9774k1531k0535j8683j4072m174l761k143
13543A26963j771o845O558j817o99L516k342j2100l289K718m557r10j1207j172
13529I3046k036n076l349L511o27k006q46K229J533j948p031o404j595K485Q54
13514G2740m079N585K430O30q428r412R26j512R95P490P073m825o286k067R11
13499F2171J0433L315K022o156o312k543n037J972P63n206k584O678K362R763
$$ plain form
13594 164605 198868 245374 309583 361820 401354 406297 381291 326206 275495 236659 203903 187485
13582 187485 173837 162248 150176 146398 143071 145205 148821 144845 131559 128115 131914 131234 129437
13569 129437 129413 123564 124639 128235 127275 125303 123385 129376 141878 155701 165121 174254 193774 224072
13555 224072 254629 274943 267023 241636 211862 190331 169796 151113 137041 132867 129106 126963
13543 126963 125192 118347 124905 123088 122389 125905 123563 111463 108174 110892 106335 105425 94218 93046
13529 93046 91010 85934 82585 86096 85469 83463 82617 84846 86379 84431 77400 70996 69401 71886 72740
13514 72740 68661 74246 76676 77306 68878 59466 60392 58880 59875 67365 74438 69613 63327 61260 62171
13499 62171 72604 75919 77941 71785 65473 62930 57893 59865 60628 55422 52838 59516 61878 71641
13485G1641N360k152o288o865k984l945k122O441K83l668q294k237L3o078j595
13470C7530M555P891Q14k64K971n393n861O257K487m99J299j662M488l772Q5K111
13454E3037M17J03L911j30l450N177K696o738j45j954n45n374J435P089o783j3234
13438C5512J803L832k64N139L274k872P082R490o563j329j667K719N831m008l881
13423E4098m301l526m226o741L472J0189K534K090Q475M975q108o72k976l618
13409E1665k949k350M739J526p276k084J744O110M605P49L616N5J872N107M897
13394G2026J128N835Q553M05n434n523q280k436l622m971K28o026N85K241P597
13379F2306r31q346p957j801p12J257O451k284j442J83J346O021Q599L628o029
$$ plain form
13485 71641 77001 74849 68561 61696 58712 54767 52645 59086 59369 55701 47407 45170 45203 39125 37530
13470 37530 42085 49976 50790 50526 53497 48104 42243 48500 50987 50488 51787 50125 54613 50841 50926 53037
13454 53037 53454 53557 57468 57338 53888 59065 61761 55023 54878 52924 52379 47005 48440 55529 48746 35512
13438 35512 37315 41147 40883 46022 49296 46424 53506 62996 56433 55104 53437 56156 61987 57979 54098
13423 54098 49797 46271 42045 35304 38776 48965 51499 53589 62064 67039 58931 58259 55283 51665
13409 51665 48716 46366 51105 52631 45355 43271 45015 51125 55730 56479 60095 60150 62022 67129 72026
13394 72026 73154 78989 87542 87947 82513 76990 68710 66274 62652 57681 57909 51883 52468 54709 62306
13379 62306 61375 53029 45072 43271 42559 43816 50267 47983 46541 46724 48070 54091 62690 66318 60289
13364F0289j839l347L57N77K320K338J566J862K134j278p226m622J146r979Q85
13349D5183K742M464k876L760M85k81l464j130j833o87j961o63l603K943r89k605
13333C9485k310o194n428m290J244n484N18Q296J1048Q9j709M2j904J577M027
13318C9007L002N907N201j255j257K187Q727M461m356N082J3479K1784J7749J9757
13304A39475L3884K6301J9508P879L424Q71j8794k6227j8562j3151J0493J6273
13292A81374K6802K5868J1608l868j6446k1426j6356j6314j2581o188j291j488
13280A49694N317Q91n304K764L360J5187K1748J4769K5506K8666L3925N1297O0365
13267D08185N4902M2690K9151J4605o618k6137k9901j9197n91J3705K1522K9040
$$ plain form
13364 60289 58450 55103 55460 56037 58357 60695 62261 64123 66257 64979 57753 53131 54277 44298 45183
13349 45183 47925 52389 49513 53273 53758 53477 50013 48883 47050 46363 44402 43739 40136 43079 42090 39485
13333 39485 37175 30981 25553 21263 22507 17023 17541 25837 36885 36974 35265 35307 33403 34980 39007
13318 39007 42009 47916 53117 51862 50605 52792 61519 65980 61624 66706 80185 101969 119718 139475
13304 139475 173359 199660 219168 227047 230471 231342 212548 186321 167759 154608 165101 181374
13292 181374 208176 234044 245652 241784 225338 203912 187556 171242 158661 152473 151182 149694
13280 149694 155011 155902 150598 153362 156722 171909 193657 208426 233932 262598 296523 347820 408185
13267 408185 463087 505777 534928 549533 542915 516778 486877 467680 467089 480794 502316 531356
13255E31356K2867N456j4489l1793l6043l4016l5018k5936j1486R973J6711J9135
13243D16717K5290J6804l646j7683j8063j3615k787L881P125J8545J9192L0986
13231D82746L0177K1573M208J294j076j5543j2074j4613q454R283K5341K4858
13219E47720K5186L5652L3284K0953J3618K2124K3475J4133j7791l7027n199L0688
13207G06816M2765N2517L3282J007j6582k5100j7282N84J4352K7289L6445M3058
13195H99151M8802N7241P2471Q0985R7962J17746J42502J87426K46655L03683
13185B254624L94885N02087O30490Q41807J182902J765230K710074M063281N535719
13176A9881099O355968N555927K740408j229612m493210n623559m895381l569961
$$ plain form
13255 531356 554223 559679 545190 513397 477354 443338 408320 382384 370898 380871 397582 416717
13243 416717 442007 458811 455165 437482 419419 405804 403017 406898 414023 432568 451760 482746
13231 482746 512923 534496 538704 539998 538922 523379 511305 496692 488238 497521 522862 547720
13219 547720 572906 608558 641842 662795 676413 698537 722012 736145 718354 681327 676128 706816
13207 706816 749581 802098 835380 836387 819805 794705 777423 778007 792359 819648 856093 899151
13195 899151 947953 1005194 1077665 1158650 1256612 1374358 1516860 1704286 1950941 2254624
13185 2254624 2649509 3151596 3782086 4623893 5806795 7572025 10282099 14345380 19881099
13176 19881099 26237067 31792994 34533402 33303790 28810580 23187021 18291640 14721679
13168A4721679k456927j724122j251857r28990o59028m33391k62842j67184j57795
13159F679543k10964k67180k51658j68446o3788L8819J39381K52627L86429N42985
13149G077748P37814R87270J316231J822907K687447M131535O380431R250731
13141C4392114J1738534J2165900R098583K707379m613656r728059j1182321r749913
13133C4828561p214014m955367l380533k377415j746804j332969j035892q14210
13125A1971357o07551m15820k71306j91168j73327j75918j64340j10389p1768
13116I789770p1389q7627n9572N7563K58893N06111Q61518J395408K240048L510731
13106A8401454N069953O329349O268584M107015J36386l955733o199528o064904
$$ plain form
13168 14721679 12264752 10540630 9288773 8359783 7700755 7267364 7004522 6837338 6679543
13159 6679543 6468579 6201399 5949741 5781295 5717507 5756326 5895707 6148334 6534763 7077748
13149 7077748 7815562 8802832 10119063 11941970 14629417 18760952 25141383 34392114
13141 34392114 46130648 58296548 67395131 70102510 65488854 55760795 44578474 34828561
13133 34828561 27614547 22659180 19278647 16901232 15154428 13821459 12785567 11971357
13125 11971357 11363806 10947986 10676680 10485512 10312185 10136267 9971927 9861538 9789770
13116 9789770 9718381 9630754 9571182 9628745 9887638 10393749 11255267 12650675 14890723 18401454
13106 18401454 23471407 29800756 36069340 40176355 40312741 36357008 30157480 24092576
13098B4092576m678520l260117k229057j573803j155138q79399o82681n19633
13090I114228l59489j89769l6528M6287J4737j36362l22711m70976n16521m72553
13080F670343m03838l30078k70446k39846k19846j93649j70556j54965j35226
13071D551893j16692j12195j14057j00148r4519q2039o7451o2862n5827n5016
13061C691087m4637l2721k9109k7735k1378l1570k4881K2445R1474J37398J45864
13050C876237J04644M582j27379k10999k24726j91508j48297j16356r8554q6136
13040B781508q4258p7947p0816o7864n7653m7463m2069m5678n3089m6836m2514
13029B145321m2941l3948k7892k2200k1678n494j094j3551k0743l0087l5633k7656
$$ plain form
13098 24092576 19414056 16153939 13924882 12351079 11195941 10316542 9633861 9114228
13090 9114228 8754739 8564970 8528442 8574729 8589466 8453104 8130393 7659417 7142896 6670343
13080 6670343 6266505 5936427 5665981 5426135 5206289 5012640 4842084 4687119 4551893
13071 4551893 4435201 4323006 4208949 4108801 4014282 3932243 3864792 3801930 3746103 3691087
13061 3691087 3646450 3613729 3584620 3556885 3535507 3503937 3479056 3501501 3592975 3730373 3876237
13050 3876237 3980881 3985463 3858084 3647085 3422359 3230851 3082554 2966198 2867644 2781508
13040 2781508 2697250 2619303 2548487 2480623 2422970 2375507 2333438 2287760 2234671 2187835 2145321
13029 2145321 2102380 2068432 2040540 2018340 1996662 1991168 1990074 1976523 1955780 1925693 1890060 1862404
13017A862404n950N294O288N171R601n961l8959l7094k8936l1599k6654j9978
13005A693627j2907j7527k1071k7769k8861l0449k8481k9135k8659k7418k7251
12994A414099j8893j0332j0237j3297j5172j3149j4499r971j968q245l622m235
12982A290479p411n89K709L515m860J887p603j8138k6729k6416k5728j9765j8535
12969A142816j2429j6133j4576m783q797q639j2264j0375j9638k2171j9400j1042
12957I82569j5479j1364j1917j0838l656l930p099j2745r948p116r612j5913j7295
12944H45657j5298j1608j2656q936l732p424j5486j6758j1235j1781j0729r855
12932G10159j1335p189J720k876n254m672l019k810n192j5340k1564j7073r544
$$ plain form
13017 1862404 1856454 1861748 1868036 1873207 1882808 1876847 1837888 1800794 1771858 1740259 1713605 1693627
13005 1693627 1680720 1663193 1642122 1614353 1585492 1555043 1526562 1497427 1468768 1441350 1414099
12994 1414099 1395206 1384874 1374637 1361340 1346168 1333019 1318520 1308549 1306581 1298336 1294714 1290479
12982 1290479 1283068 1282479 1285188 1288703 1283843 1285730 1278127 1259989 1233260 1206844 1181116 1161351 1142816
12969 1142816 1130387 1114254 1099678 1094895 1086098 1077459 1065195 1054820 1035182 1013011 993611 982569
12957 982569 967090 955726 943809 932971 929315 925385 918286 905541 895593 888477 878865 862952 845657
12944 845657 830359 818751 806095 797159 793427 786003 770517 753759 742524 730743 720014 710159
12932 710159 698824 691635 693355 690479 685225 680553 677534 674724 669532 654192 632628 615555 606011
12919F06011q702m665J97p643m248j2292j2986l2j2009r524j1275n425J356k910
12905E15853l157r116j2513p968j0711q382n009p126q015m803L35l065m31k062
12891D33830l95o925k881m566j3247j2353j223k387n968o039k034k392r245m197
12877C59978P30q298l682n793p226O277M194r889j0486q409n601p167j5942q070
12863B80616m374n393q48O534J876j153m610k566K098K035q505p131j0198p027
12849B41354r22o823o997l635j270Q697M056m829K232m153p964q321q715N45M978
12834B08233j0017o425m366p286m173j4O62J16J713M051N389k120M662j607j0265
12819A78553j936J47k759J76q388m565M784j69p598l500m990n738k500k588p178
$$ plain form
12919 606011 597309 592644 592841 585198 580950 568658 555672 555640 543631 534107 522832 517407 518763 515853
12905 515853 512696 503580 491067 483099 472388 464006 458997 451871 443856 439053 439388 436323 435892 433830
12891 433830 433435 426510 423629 419063 405816 393463 392240 389853 383885 377846 375812 373420 364175 359978
12877 359978 360708 352410 348728 342935 335709 341986 346180 336291 325805 317396 311795 304628 288686 280616
12863 280616 276242 270849 270001 276535 278411 277258 272648 270082 272180 274215 265710 258579 248381 241354
12849 241354 240432 233609 226612 222977 221707 230404 234460 229631 231863 227710 219746 211425 202710 203255 208233
12834 208233 198216 191791 187425 180139 175966 175952 176614 176730 178443 182494 187883 185763 190425 188818 178553
12819 178553 176617 176764 174005 174181 165793 161228 166012 165843 158245 154745 149755 144017 141517 138929 131751
12804A31751K329N14j131n21j856j847L440N206k175k936j766L609l711l430k90
12789A27186K357L136l129l669o496K752j458L781L185o539n755J307L904P397
12775A27959R10p48l248k0K119L833m956k745O925J306l466l095K636k309L8m375
12759A20764P49j159m43O152K658N69o679m323n46n871J906L938J801K257M074
12744A25847M132J4q60n149l086j0187n759j552k060K583J172k70M168N883N049
12729A19925R74P84J597L611R625M961P990K356O479M503J4758J7779K6377K3761
12715B45480J1688J620j0832j8349j8119j9023j6778j3410p146j952Q88K501L559
12702A60127j910o847n869L333l205o005n683l194M784k600j86j89N30Q691O267
$$ plain form
12804 131751 134080 134594 133463 132942 131086 129239 132679 137885 135710 132774 131008 134617 130906 127476 127186
12789 127186 129543 132679 129550 125881 119385 122137 120679 124460 127645 121106 115351 116658 120562 127959
12775 127959 128869 128121 124873 124853 126972 130805 125849 123104 130029 131335 127869 124774 127410 125101 125139 120764
12759 120764 121513 120354 119911 126063 128721 129290 122611 118288 117742 111871 113777 117715 119516 121773 125847
12744 125847 129979 129993 129133 123984 120898 110711 104952 103400 101340 103923 105095 104825 108993 114876 119925
12729 119925 120899 121683 123280 126891 136516 141477 149467 151823 158302 162805 177563 195342 221719 245480
12715 245480 257168 258788 247956 229607 211488 192465 175687 162277 155131 153179 154067 156568 160127
12702 160127 158217 151370 145501 148834 145629 139624 133941 130747 135531 132931 132745 132556 133086 141777 148044
12687A48044N032J8365K3043L0672M1419M8044N4295M5844K4535m846l7106n4810
12675C42531m6137l0398l6532k7394j4590j5697q825k920l782n475k828k718n440
12662A39795q63R322N60m123j602M102L91j68l680m478K614q89J283J1246J8548
12647A72058K4518K9897K7968J4156k076j1543j7565k9659k7182k1784j4356j0157
12635A34275q402q004k681K822o138j545r93m166q04q06O535M197j604l881r583
12620I9222n751o163j60K666j0815K71k008l945M416k427m702j125m83J716p220
12605F3492k81k273P04K378K720m524o15K868J041k342p54k081j549J747k616
12590E7915L014k442R60j241n34O099l167j1300P54R64N828l554j895o130J81
$$ plain form
12687 148044 153076 171441 194484 225156 266575 314619 368914 414758 439293 434447 397341 342531
12675 342531 296394 265996 229464 202070 187480 171783 162958 160038 156256 150781 147953 145235 139795
12662 139795 138932 148254 148814 144691 143089 147191 147582 147414 143734 139256 141870 140981 142264 153510 172058
12647 172058 196576 226473 254441 268597 266521 254978 237413 207754 180572 158788 144432 134275
12635 134275 125873 117869 115188 118010 111872 110327 109334 105168 104364 103558 110093 114290 112686 108805 99222
12620 99222 93471 87308 87148 89814 78999 79270 77262 73317 77733 75306 70604 69479 68996 70712 63492
12605 63492 63211 60938 61642 64020 66740 62216 61601 64469 65510 63168 62414 60333 58784 60531 57915
12590 57915 60929 58487 59447 58206 57672 63771 60604 49304 50058 51022 56850 53296 51401 45271 45452
12575D5452J285O480j115M408P18o371q605L980K125l071J854J920L38l831j384
12560D4183L784K92j995m998o1M990M106J0801p29q034l359J788K961j592n180
12545D6957K232M676o76j650l669m393N330O003K952O811l314P8p250j2833n561
12530C5693K148N566j879n711l896K631L439L792J253O60j794l551K514N744M31
12515D7040j147l157K838l105N307n69K430r20l735m818j48k570l792k279K080
12500C3455q16L719O407N26J823q258r1J392j158J595o024j2553k430O699J406
12485B5692j942L73j616R147K377m28N845P660K119n837K28M69r191j0486o58
12470B3752R816L717j95L378o328n603n480l12J267R00L420K441M462N671K084
$$ plain form
12575 45452 46737 53217 52102 56510 57228 50857 42252 46232 48357 45286 47140 49060 49398 45567 44183
12560 44183 47967 48259 46264 41266 41205 46195 50301 61102 60373 52339 48980 50768 53729 52137 46957
12545 46957 49189 53865 53189 51539 47870 43477 48807 54810 57762 64573 61259 61337 54087 41254 35693
12530 35693 37841 43407 41528 35817 31921 34552 37991 41783 43036 43696 41902 38351 40865 46609 47040
12515 47040 45893 42736 45574 42469 47776 47207 49637 48717 44982 40164 40016 37446 33654 31375 33455
12500 33455 32639 36358 42765 43291 45114 36856 36765 38157 36999 38594 32570 20017 17587 24286 25692
12485 25692 23750 24123 22507 31654 34031 33603 39448 47108 49227 43390 43618 44087 34896 24410 23752
12470 23752 33568 37285 37090 40468 34140 28537 23057 22745 24012 24912 28332 30773 35235 40906 42990
12455D2990j147L421m749l697m394k276q97N177Q27R28k013l39k784p490k095
12440B1462K687r87P65q70L801Q6m335o611R40j17J79j207N455K651p306m397
12424A2196j94J328P109M260o396P0P971J156l635M687j037N208J0561M928J78
12409D8390O917N10n82q487p943K34l413k040j16O04M410M224L5M404L80R02Q59
12392D9288l45k975k02k104n171l461N440J701K390M632j0453J754L530L648O821
12377E4493N22M372N81m468N176P682R326M526j620o551M234R557R180l312l610
12362I0088K668N8P702J259Q743J831m812p693k122j451L280J0838L002Lj45M923
12346A18172K244M233K973J667L216n015m138m559o718q664j1782k087l671l362
$$ plain form
12455 42990 41843 45264 40515 36818 32424 30148 29251 34428 35255 36183 34170 33831 31047 23557 21462
12440 21462 24149 23162 23927 23057 26858 26944 22609 15998 16938 16821 17000 15793 21248 23899 16593 12196
12424 12196 12002 13330 20439 24699 18303 18373 26344 27500 23865 28552 27515 32723 43284 48212 48390
12409 48390 55307 55817 55235 46748 38805 39039 35626 33586 33470 34074 38484 42708 42743 47147 47527 48429 49288
12392 49288 48943 45968 45766 43662 38491 35030 40470 42171 44561 49193 38740 40494 44024 47672 54493
12377 54493 55015 59387 59968 55500 60676 68358 77684 82210 80590 74039 78273 87830 97010 93698 90088
12362 90088 92756 92814 100516 101775 110518 112349 107537 99844 97722 96271 99551 110389 113391 113394 113249 118172
12346 118172 120416 124649 127622 129289 132505 127490 123352 118793 112075 103411 91629 89542 85871 82509
12332H2509M10m75L751N290j369m822n615n085N586K110j2331p491N178J634l085
12317F6195L102j192j28m199k803m702M763J205R244L045k936j1724k18M785j518
12302F2919j088j410k48O731N34j4180o995P680J517L196Q507K266o394J869O148
12287G1052n178k091M317L922l033m522P001P934l203k337K165P08N878M936J085
12272H8634J820O484O886l20m397j226k918J332k971q502q497j0743J922Q153
12258G5657K710n782j230l513M175k962n993l770L171J554p466O92J210J511K83
12243F0247j389K651R544M245O260K106K451j548L344P148O304M162m199K61M809
12228A06396P641M870j811k988k789L821O980k524K475O533J1001O864J337P235
$$ plain form
12332 82509 82919 82444 86195 91485 90116 85294 79679 74594 80180 82290 69959 62468 67646 69280 66195
12317 66195 69297 68105 67977 63778 60975 56273 61036 62241 71485 74530 71594 59870 59652 64437 62919
12302 62919 61831 60421 60173 66904 67438 53258 46263 53943 55460 58656 67163 69429 63035 64904 71052
12287 71052 65874 63783 68100 72022 68989 64467 71468 79402 76199 73862 76027 76735 82613 87549 88634
12272 88634 90454 96938 103824 103504 99107 97881 94963 96295 93324 84822 76325 65582 67504 75657
12258 75657 78367 72585 71355 67842 72017 69055 63062 59292 62463 64017 56551 57243 58453 59964 60247
12243 60247 58858 61509 71053 75298 81558 83664 86115 84567 87911 95059 101363 105525 101326 101587 106396
12228 106396 114037 118907 117096 114108 111319 115140 122120 119596 122071 128604 139605 146469 147806 155041
12214A55041Q228R976J0970N637O034J5900J2326Q213J3897R356O291L936J9771
12201B85576K3099J5429K0133J5812J5930K9405K4565J6887K1714K1781J7213
12190E07544K2821J2410J5566M592L355K082l901j1642n68n543j2798j9417j5639
12177D98862j0984q580j1183n180j4685j6452j4043q205k15l795j2913j3243o490
12164C72894q57o909k581j4621j0928J946K164k180k580o10k479j3058j4546l497
12150C02158K029L576p68L453J050n509r775l810n43Q981M460j2023p721m30L880
12135B89008p651l176K310j574m230l650J188O03l100n909k781l937o909j0444
12121B39748k083M025L827r2m701o75l929r73j537p298n399j175q381l130o218
$$ plain form
12214 155041 163269 173245 184215 189852 195886 211786 224112 232325 246222 255578 261869 265805 285576
12201 285576 308675 324104 344237 360049 375979 405384 429949 446836 468550 490331 507544
12190 507544 530365 542775 558341 562933 566288 568370 564469 552827 552259 546716 533918 514501 498862
12177 498862 487878 479298 468115 462935 448250 431798 417755 409550 409335 405540 392627 379384 372894
12164 372894 372037 365128 362547 347926 336998 338944 341108 338928 336348 335738 333259 320201 305655 302158
12150 302158 304187 307763 306995 310448 311498 305989 296214 292404 291861 300842 305302 293279 285558 285128 289008
12135 289008 281357 278181 280491 278917 274687 271037 272225 272828 269728 263819 261038 257101 250192 239748
12121 239748 237665 241690 245517 245425 240724 240049 236120 235147 233610 226312 220913 219738 211357 208227 202009
12106B02009j601n168q17K373o645K366N485J079l164R26k274k458m634r551k264
12091A75662Q0m655m98M522q60k816p920r012j983k062q97k036l706J117j0826
12076A34110n921L834N239K521l5J266n907q539k827j522o562n494K251mr39m367
12060A07104p282j344Q63k501k046M278O093l772L651R195j331q401J573M070
12046A10150n378n754q392j0214k455L699L01L628P519J202l15j032o869n951
12032H0139K077n75l574J667r40Q24n703r57o82J813k122q395k176k563M010Q621
12016G1464J85J103j281j1970p783K924J336L074K261N031M096o15J325m797q404
12001E7949N41O592K797o128l331l141j219k036L388j045k1p639L063O175L536
$$ plain form
12106 202009 200408 195240 194423 196796 190151 192517 198002 199081 195917 196843 194569 192111 187477 177926 175662
12091 175662 175742 171087 170589 175111 174251 171435 163515 154503 152520 150458 149561 147525 143819 144936 134110
12076 134110 128189 132023 137262 139783 139748 141014 135107 126568 123741 122219 115657 110163 112414 112410 111471 107104
12060 107104 99822 98478 99341 96840 94794 99072 105165 101393 105044 114239 112908 104507 106080 110150
12046 110150 104772 99018 90626 80412 77957 81656 81957 85585 93104 94306 93991 92959 86090 80139
12032 80139 82216 81641 78067 79734 78794 79618 73915 72958 72276 74089 71967 63572 61396 58833 62843 71464
12016 71464 71649 72752 71471 59501 51718 54642 55978 59052 61313 66344 70440 69825 71150 66353 57949
12001 57949 58490 65082 67879 61751 58420 55279 54060 52024 55412 54367 54346 46707 49770 55945 59481
11986E9481r60m232q48m908n259l218R79Q321P037l484j931j306J216N7R28L720
11970E5593J031k622m642n312l540M767R519r261j2950p37K86Q13N170k609O57
11955C6163n272K132K14M453J21L111O042K47J082N362k724K455L709r021n221
11940D2853l509k235l363K022J535n015j493j633r78J548K824J957L591o457j427
11925C0220J86k966P800J3813O522n170q292j0634m97o690k603L629J784m55J141
11910B7788j065O711L378M994q640l545N281L96L068L288J412m795j336q692N081
11895C3324O641j288L441L219m26q847p693k31R064j788k963l884k949L531L188
11880C2339l225k418L729O64o63k317m902K916J428j512L74N20N066k95l12o02
$$ plain form
11986 59481 58521 54289 53441 48533 43274 40056 41035 49356 56393 52909 50978 49672 50888 50945 51873 55593
11970 55593 56624 54002 49360 44048 40508 45275 54794 45533 32583 31846 32132 32945 38115 35506 36163
11955 36163 30891 33023 33237 37690 37811 40922 46964 47211 48293 53655 50931 53386 57095 48074 42853
11940 42853 39344 37109 33746 35768 37303 32288 30795 29162 28184 29732 32556 34513 38104 31647 30220
11925 30220 30406 27440 35240 49053 55575 50405 42113 31479 30982 24292 21689 25318 27102 26647 27788
11910 27788 26723 33434 36812 41806 33166 29621 34902 35298 38366 41654 43066 38271 36935 28243 33324
11895 33324 39965 38677 42118 45337 44911 36064 28371 28140 37204 35416 32453 28569 25620 29151 32339
11880 32339 29114 26696 30425 31089 30426 28109 23207 26123 27551 26039 26413 26933 31999 31704 31392 30790
11864C0790M536R50k004L346m53J503k614k567r118r957k073J338K13N348M605
11849B3843M639k861K25M203k545m310L10m808K35M231j15n374p491m758n216
11834B08P75K549O874l08N68O06m357k174K996l326o572R15L803L882N770N018
11818A7227L63J9L388n31r973j319O105m187m717k342l372L287J3412J745p743
11803A1362o297l229n01L66K448L681R464P690o888m444J624k662k522l901j662
11788D529p248l558N398K919N886k396p545M770K934J768N93j568L85M249M316
11773A5432K530l69r63n382n859K835P420L141k479p291L011j262q64k39M001
11758A3662J056k021p564j097L937J018m974J628L818j464k48O074k056n143R8
$$ plain form
11864 30790 35326 36276 34272 37618 37165 38668 36054 33487 24369 14412 12339 13677 13890 19238 23843
11849 23843 28482 25621 25846 30049 27504 23194 23504 18696 18931 23162 23047 17673 10182 5424 208
11834 208 983 3532 10406 10098 10666 11272 6915 4741 7737 4411 -2161 -1246 2557 6439 12209 17227
11818 17227 17590 17609 20997 20466 10493 9174 15279 11092 6375 4033 661 3948 17360 19105 11362
11803 11362 5065 1836 1335 1701 4149 7830 17294 24984 18096 13652 15276 12614 10092 6191 4529
11788 4529 -2719 -6277 -879 2040 7926 5530 -2015 2755 5689 7457 8050 6482 6867 11116 15432
11773 15432 17962 17593 16630 11248 5389 8224 15644 18785 16306 9015 12026 10764 9900 9661 13662
11758 13662 14718 12697 5133 4036 7973 8991 4017 5645 9463 7999 7751 13825 11769 6626 6724
11743F724j643n403j124P851O687L281k015l07J590K904o091j0880m508O035L332
11728F433J403K02o662p413J967P319j611r28K022j397M867K602n888k180J370
11713B106O133L790n243o136m487N273P319k007J851R18J936l557p28K307M094
11698A3569P313J363p29L417n27p314m816nM567l333r757L582O947M669L082p47
11682B1281L02j39J093J94o561k336L528l85m613j370K067n401p13L475K749M175
11666A7346M693j812J442m777j694K99L015O96M446K048Q981L540k587n001n458
11651B5177l799p582l61P509O150M799N033p296k692Q16j85O462O608j753n0N115
11635D3951O68L274M040M552M970Q645K914k722m64N571P714q73L46l255J946
$$ plain form
11743 6724 5081 -322 -1446 6405 13092 16373 14358 14051 15641 18545 12454 1574 -2934 3101 6433
11728 6433 7836 8038 1376 -6037 -4070 3249 1638 710 2732 1335 6202 8804 2916 736 2106
11713 2106 8239 12029 6786 650 -3837 1436 8755 6748 8599 9517 11453 7896 7168 9475 13569
11698 13569 20882 22245 21516 24933 24406 17092 12276 12271 16838 13505 3748 7330 14277 18946 22028 21281
11682 21281 21583 21444 22537 22731 16170 13834 17362 16977 12364 10994 13061 7660 6947 10422 13171 17346
11666 17346 22039 20227 21669 16892 15198 15497 18512 19208 23654 25702 34683 38223 35636 30635 25177
11651 25177 21378 13796 13435 20944 27094 31893 36926 29630 26938 27754 27569 34031 40639 38886 38836 43951
11635 43951 44619 47893 51933 56485 61455 70100 73014 70292 69828 75399 83113 82240 82586 79331 81277
11620H1277l52p319o621j358N63J735j2346n606o878J79L999j334l432Q42M787
11605D8136Q165k315j1679o696m338J016J066l083n591m103J034K501k115Q60
11591B2858K744J946K240j334q71j799K256Q308j997o284m992m927L758N004j724
11576B5186j622J622P386R41m077k911O986K036l594L084n55o60j5214m101k617
11561A1890K375k978j539P322l61J078N075L064l966o586J683J912J310k325k543
11546A5411l355M820K219L853P31l034P6o238l754K435M105M601K605N90M706
11531B9771o728o421M747M094J856N34M833M351m428J464k343q002q379K168m947
11516A2570P465O621p348o805L881M872J332p029J047K590o627O08J991j619r30
$$ plain form
11620 81277 80925 73606 66985 65627 66190 67925 55579 49973 43095 43274 47273 45939 42507 43349 48136
11605 48136 56301 53986 42307 35611 31273 32289 33355 30272 24681 20578 21612 24113 21998 22858
11591 22858 25602 27548 29788 28454 27583 25784 28040 36348 34351 28067 23075 18148 21906 26910 25186
11576 25186 23564 25186 32572 33513 29436 26525 33511 35547 31953 35037 34482 33822 18608 14507 11890
11561 11890 14265 11287 9748 17070 16709 17787 22862 25926 21960 15374 17057 18969 20279 17954 15411
11546 15411 12056 16876 19095 22948 23679 20645 20721 14483 10729 13164 17269 21870 24475 25065 29771
11531 29771 23043 16622 21369 25463 27319 27853 32686 37037 32609 34073 31730 23728 15349 17517 12570
11516 12570 20035 26656 19308 12503 16384 21256 22588 15559 16606 19196 12569 13177 15168 13549 12619
11501A2619P768J332n292J46M62l94L374N713R586K763o734r56n121l325K279
11486B4220J220r521q69K287O957P462k312q377m783n644m19L764L471O902R56
11471B5314M488J033n975j306m173n144l060L489K758L582j154o180L259L915
11457B0846N75m828K542J1354P062j851q588O9k667J408o99j746K945L033M621
11442C4076R09k588J354K967J322n081o528P036P80n379L90k490J91R15j529K504
11426B8849K704N259J10j064r44R45O515J1493L658L122J9686K0392L1959M0628
11412A73312K3527N856m367j4133j2747j8133j7685j6591j0917l365k517l9P69
11399A02970M900l223N158l595j0211l322K49l25l217K748q402P06K118N039N081
$$ plain form
11501 12619 20387 21719 16427 16573 17035 16641 20015 25728 35314 38077 31343 30387 25266 21941 24220
11486 24220 25440 15919 15050 17337 24294 31756 29444 21067 16284 10640 10221 13985 17456 24358 25314
11471 25314 29802 30835 24860 23554 19381 14237 11177 14666 17424 21006 19852 13672 16931 20846
11457 20846 21421 16593 19135 30489 37551 35700 27112 27181 24514 25922 25223 23477 26422 29455 34076
11442 34076 34985 32397 33751 36718 38040 32959 26431 33467 34247 28868 29258 26768 26959 27874 26345 28849
11426 28849 31553 36812 36922 35858 34914 35859 42374 53867 57525 60647 80333 100725 132684 173312
11412 173312 196839 202695 198328 184195 171448 153315 135630 119039 108122 104757 102240 102201 102970
11399 102970 107870 104647 109805 106210 95999 92677 92926 92601 89384 92132 83730 84436 86554 91593 96674
11384I6674K626J1924J9638K6501K8720M1371N2246M0880L0459K1662o640k8101
11372C37960l2281l8970l1957k3248k1319k2280j1049m070o581l794r920p739
11360A24752J091j924k049k755p749p829n711k839l465j625p946O37M307P259
11346I4154P962J3618J6036K3768K4252L0180J6639J177j3786k5336j7888j2520
11334A58256j1757j3556j3665j0155q855m989m315j2102n528o52j544O244Q332
11321H5714l738j0450p230L034j376J572j988p016p096j09K504o074k182P463
11307E3028O091J204l671K147O01K251k4q474j961K358J758m381k544o566p883
11292C3934j092N468K755K593k006K157M782Q05N91k809k602K020J927O328j539
$$ plain form
11384 96674 99300 111224 130862 157363 186083 227454 279700 320580 351039 372701 366061 337960
11372 337960 305679 266709 234752 211504 190185 167905 156856 152786 146205 142411 132491 124752
11360 124752 125843 123919 121870 119115 111366 103537 97826 94987 91522 89897 81951 82588 86895 94154
11346 94154 102116 115734 131770 155538 179790 209970 226609 227786 214000 188664 170776 158256
11334 158256 146499 132943 119278 109123 100268 95279 90964 78862 73334 72682 71138 77382 85714
11321 85714 81976 71526 64296 67330 65954 67526 65538 58522 51426 51317 53821 47747 45565 53028
11307 53028 59119 60323 56652 58799 59400 61651 61627 53153 51192 53550 55308 50927 48383 41817 33934
11292 33934 32842 38310 41065 43658 41652 43809 48591 49396 49987 47178 44576 46596 48523 54851 53312
11277E3312Q73K063R54r406o012j948k106K464M423j011J965j684m003j653L21
11262C8552J095k798l200K601L110l957l24N116Q349L106m463J608J2130J2978
11248G3903J09p082P694J948p617j2671j4565l509N078r22p938l532K401P052
11234D0349j589j1096l088O475J2226P971l440p4K505o67p182j941K30M362R241
11219E4282P206k280p96N388Q402M821K509L323J378J305l336p012j1320N06N656
11204G0032L887J581n537q516k399P7k64o801n81N464J580k721j120L720N785
11189F4187J709j210O428N996M713J2242o93J591M765r0K690L220k166J517M030
11174A08929l9l89K456K273l298K345M853P348P528R234R320P504P096J1972K0791
$$ plain form
11277 53312 54185 56248 57202 47796 41784 39836 37730 40194 44617 43606 45571 43887 39884 38231 38552
11262 38552 39647 36849 33649 36250 39360 35403 35079 40195 48544 51650 47187 48795 60925 73903
11248 73903 74012 66930 74624 76572 68955 56284 41719 38210 43288 42366 34428 30896 33297 40349
11234 40349 38760 27664 24576 31051 43277 51248 47808 47734 50239 49572 42390 40449 40679 45041 54282
11219 54282 61488 59208 58412 63800 72202 77023 79532 82855 84233 85538 82202 75190 63870 64376 70032
11204 70032 73919 75500 69963 61447 59048 59125 58861 52060 51479 56943 58523 55802 54682 58402 64187
11189 64187 65896 64686 71114 77110 81823 94065 93372 94963 99728 99638 102328 105548 103382 104899 108929
11174 108929 108890 108501 110957 113230 109932 112277 117130 124478 132006 141240 150560 158064 165160 177132 197923
11159A97923K0852J9075K5118K6343L7728M9841N4388N6536O5609P7141P6748
11148G07302O3254N0497K6183N616k2553m7901o5907o0707n3485n6525n9414m7786
11136D38574l3804k0208k8578k2942k0931j2870j1289o818Q667O562J8118J5663
11124C30144R959J3376J5103M622N744p853l0243k8836k2367k4152j6409j1309
11112B37779j4387m366P104R834R096M559N984l949l944R62q428k03M887o163
11098B38765l478K523K951J8617J3008J6210K1266K8683L6860M7908N2486M3625
11086E19424L4888K6628R186j2961l0524l4633l6778l5934k4742j7472o144K04
11074C91142K227m853L908N480L315l904p281J95N206k86j0018m178L704l163
$$ plain form
11159 197923 218775 237850 262968 289311 327039 376880 431268 487804 553413 630554 707302
11148 707302 770556 821053 847236 852852 830299 782398 716491 655784 602299 545774 486360 438574
11136 438574 404770 384562 355984 333042 312111 299241 287952 281134 289801 296363 314481 330144
11124 330144 340103 353479 368582 373204 378948 371095 340852 312016 289649 265497 249088 237779
11112 237779 223392 219026 226130 235964 245060 249619 255603 251654 247710 248672 240244 240041 244928 238765
11098 238765 235287 237810 240761 259378 272386 288596 309862 338545 375405 423313 475799 519424
11086 519424 554312 580940 590126 577165 546641 512008 475230 439296 414554 397082 390938 391142
11074 391142 393369 388516 392424 397904 401219 397315 390034 390229 395435 395149 385131 380953 384657 381494
11060C81494K124R657R504J5925J4403J3014K0974K4527K2747K7033K4976J1581
11048E77959m80o95o295j6789k6206n233k77n138K701j065k623l648M740m206
11034E12745J646N326J1802J0315P498J2750J6516J7044R932J8672K5050K5500
11022F74796L6929L1659L7309L8858M9923N0993O2245P7165Q6888J13197J39250
11011A399212J66104J92201K14178K31677K66871L11506L85499N01702O98182
11002D367132J002483J465728K180415L160017M288552N214527N383977M308274
10994C1371105J988346r16313l366550m589433m567252l781893k808218j979453
10986A1350339j349268q80842n39142k95973j33183l4588l259l6762q2600j12662
$$ plain form
11060 381494 383618 393275 402779 418704 433107 446121 467095 491622 514369 541402 566378 577959
11048 577959 577479 576784 570489 553700 527494 522261 521984 516846 519547 518482 515859 512211 516951 512745
11034 512745 514391 519717 531519 541834 549332 562082 578598 595642 605574 624246 649296 674796
11022 674796 711725 743384 780693 819551 869474 920467 982712 1059877 1146765 1259962 1399212
11011 1399212 1565316 1757517 1971695 2203372 2470243 2781749 3167248 3668950 4367132
11002 4367132 5369615 6835343 9015758 12175775 16464327 21678854 27062831 31371105
10994 31371105 33359451 32443138 29076588 24487155 19919903 16138010 13329792 11350339
10986 11350339 10001071 9120229 8581087 8285114 8151931 8117343 8114084 8077322 7994722 7882060
10976G882060j10830r2007l2073M8002J46836K59107M06474O20400R25374J386169
10966A1439512K110823L228338M819402O782782Q707642R786481R139350O297483
10958F2311813J708409l313279p173054q872469q504879o947986n158731l649525
10950B0400299k530457j771952j239278q45351n57303l36283j87621j21231j23007
10941A2687816j72534k49441l05054l35057l38720l12024k53270j45144K2082
10932A0598654K51195N39697R45263J524659K348307L347133M292798M771115
10924B8618821M251900K514733p0766k631034m279150m662512m112024l201771
10916A6428197k330861j651232j182731q53661o29272m73492l46715k46628j97919
$$ plain form
10976 7882060 7771230 7679223 7647150 7695152 7841988 8101095 8507569 9127969 10053343 11439512
10966 11439512 13550335 16778673 21598075 28380857 37088499 46874980 56014330 62311813
10958 62311813 64020222 60706943 53533889 44661420 36156541 29208555 24049824 20400299
10950 20400299 17869842 16097890 14858612 14013261 13455958 13119675 12932054 12810823 12687816
10941 12687816 12515282 12265841 11960787 11625730 11287010 10974986 10721716 10576572 10598654
10932 10598654 10849849 11389546 12334809 13859468 16207775 19554908 23847706 28618821
10924 28618821 32870721 35385454 35314688 32683654 28404504 23741992 19629968 16428197
10916 16428197 14097336 12446104 11263373 10409712 9780440 9306948 8960233 8713605 8515686
10907H515686j87326k18876k70543l36848l71127l72114l42330k92715k46191
10898E877616k09116j81213j57099j43479j37738j31045j28974j25272j21858
10889D541822j22577j09850j08441j05649j03291r1926q7982q8356q6987q2632
10879C554131q2583p7803o8829o3213o5325n8654m7928m4996l7476l9646m4527
10868B923151m7419n8696n9160n4583m6914m8758n9751n2816m4914n0542l2542
10857B367056l8744n3816n0087l2691k9405m0701m3443m3494l3965l4204l2091
10846A934415l4585l5259l6220k9540j5688k1212k2235r637j0430j3843j1081
10835A694685N683J107p031j7679l0118m3115l6636l4663l3175l2930l5487l2262
$$ plain form
10907 8515686 8328360 8109484 7838941 7502093 7130966 6758852 6416522 6123807 5877616
10898 5877616 5668500 5487287 5330188 5186709 5048971 4917926 4788952 4663680 4541822
10889 4541822 4419245 4309395 4200954 4095305 3992014 3900088 3812106 3723750 3636763 3554131
10879 3554131 3471548 3393745 3324916 3261703 3196378 3137724 3089796 3044800 3007324 2967678 2923151
10868 2923151 2875732 2817036 2757876 2703293 2656379 2607621 2547870 2495054 2450140 2399598 2367056
10857 2367056 2328312 2274496 2224409 2191718 2162313 2121612 2078169 2034675 2000710 1966506 1934415
10846 1934415 1899830 1864571 1828351 1798811 1783123 1761911 1739676 1730039 1719609 1705766 1694685
10835 1694685 1700368 1701475 1694444 1676765 1646647 1603532 1566896 1532233 1499058 1466128 1430641 1398379
10823A398379k9069k2026l2068k9759k0620j6846n920j6856k3443j6607j7238
10812A167927k8162j4590j4975j4404r548j1135r480p203n249L940j955q368j5124
10799A031674j2307q262m704j4459j7623j9991k6367k4006j6713k0297j3849j9438
10787H33658k3137r190r717j6821j6563q035n617o206o996j7607j1635j0553j4859
10774F76722j0684m380l866j1700j3860j291n945o763o878q347j2274q318p228
10761E75188O58j919j552n197j0829k0995j4978o634m127K387n882r535K234j032
10747D97787l345n118l078n89k194m547l9O509L738L54Q919K066J5374J6925J2148
10732E44910K3157K6475L7071L5064L0638L8877L1938M0655N2684P8884J25135
$$ plain form
10823 1398379 1369310 1347284 1315216 1285457 1264837 1247991 1242071 1225215 1201772 1185165 1167927
10812 1167927 1139765 1125175 1110200 1095796 1086248 1075113 1065633 1058430 1053181 1057121 1055166 1046798 1031674
10799 1031674 1019367 1011105 1006401 991942 974319 954328 927961 903955 887242 866945 853096 833658
10787 833658 810521 801331 791614 774793 758230 750195 744578 738372 731376 713769 702134 691581 676722
10774 676722 666038 661658 657792 646092 632232 630941 624996 618233 611355 603008 590734 582416 575188
10761 575188 575846 573927 572375 567178 556349 535354 520376 513742 509615 512002 506120 496585 498819 497787
10747 497787 494442 489324 486246 485657 483463 478916 478877 485386 489124 489478 498397 500463 515837 532762 544910
10732 544910 568067 594542 631613 666677 697315 736192 768130 808785 861469 940353 1065488
10721A065488J70455K20003K55296K46201K04670J22182K465j16919j94688k30526
10711A744627k30189k05590j64705j35865j02795o9399m6211m1282l5823k4146
10701F88622j6887j2936j0202MJ2727L1748K7603K5406K8915K6513K1481p14k4097
10688G98183l9560m8467n3867n6368m3283l5585k5730k1969j6888o834j544j3165
10676D34923j8409j7340r337k937l485o720q864l158N28J2238R720P097J3811
10663D08067J3756J8771J8423J0696J6673K4279K1486J4658J2388R915k965q744
10651E57403k1919l2806k6306j9574l635L015K841K834l966j5002j2912o463j1379
10638D12131q951j5624q933l872J023r78o434p55m543j1938j2587n078p772j184
$$ plain form
10721 1065488 1235943 1455946 1711242 1957443 2162113 2284295 2286760 2169841 1975153 1744627
10711 1744627 1514438 1308848 1144143 1008278 905483 836084 789873 748591 712768 688622
10701 688622 671735 658799 648597 648601 661328 693076 720679 746085 775000 801513 822994 822280 798183
10688 798183 758623 710156 656289 599921 556638 521053 495323 473354 456466 449632 448088 434923
10676 434923 416514 399174 389837 386900 383415 376695 367831 364673 365201 377439 387159 394256 408067
10663 408067 421823 440594 459017 469713 486386 510665 532151 546809 559197 569112 566147 557403
10651 557403 535484 502678 476372 456798 453163 456178 459019 461853 457887 442885 429973 423510 412131
10638 412131 403180 387556 378623 374751 375774 374796 368362 367607 363064 351126 338539 333461 325689 324505
10624C24505o216j1992l450p13j697j3095j1656m352n430p597J2498O932O842
10611B84579J1244K3373K3974J2295L916j5131k2059j7193j8166j1810J815R491
10599B86328J2917K2245J3705Q842P505j471K218o088q644m767n901P603J8776
10586C53268K0326J6008L1527L0037M924j7351l5124l4750k0543j3291o748P533
10574C35816J4292K0213J8888J1916Q047j6330k8012k7025k7876j6839j1009r216
10562B72865n633L401J5210J4121K7108M1645L9575K9423K2220K2691L7348L4593
10550E54567K2802P74l7897o8599o4266l9604j5963P937J6062K2863L3003M0583
10538D72262M0273M1052K0277j254k3572l7427l9842m8563l2181k3637k2829j1293
$$ plain form
10624 324505 318289 306297 302847 302134 300437 287342 275686 271334 265904 258307 270805 277737 284579
10611 284579 295823 319196 343170 355465 359381 344250 322191 304998 286832 275022 276837 286328
10599 286328 299245 321490 335195 344037 351542 350071 352289 346201 337557 332790 326889 334492 353268
10586 353268 373594 389602 421129 451166 456090 438739 403615 368865 348322 335031 328283 335816
10574 335816 350108 370321 389209 401125 409172 392842 364830 337805 309929 293090 282081 272865
10562 272865 267232 270633 285843 299964 327072 368717 408292 437715 459935 482626 519974 554567
10550 554567 577369 578143 540246 471647 407381 367777 351814 359751 375813 398676 431679 472262
10538 472262 512535 553587 573864 572610 549038 511611 471769 423206 391025 367388 344559 333266
10526C33266o678n937j3685j7262n300q962l676p168O15M554o797m536N935M501
10512B68870J273l70j394J2325R187J4237R968M929R469J6950K1472K2006J1555
10499D00477M02j3130k6045j7815j8040m823N01R430J5781M599m883o089m044
10486C36321k2367l3261l6642j8931o093l874j93j3035j2884j3078j235L596N926
10473A84250N636O953R98m841j014N562O153J1268J6619P462M195q817j4688j1009
10459B08727k4805l1240l7174o4136q5913p0934l1877Q500M1701P6218Q7458O1675
10447A38200M2048K9599J6519J8113K0872K6108K7516J2060O182J3453K0373K3722
10435C94765L5655L9983N3924Q6235J18478J65426K37329L15433L68713L77183
$$ plain form
10526 333266 326588 320651 306966 289704 284404 275442 271766 264598 265213 269767 262970 258434 264369 268870
10512 268870 270143 269773 268379 280704 289891 304128 314096 319025 328494 345444 366916 388922 400477
10499 400477 400879 387749 361704 343889 325849 321026 321527 330957 346738 351337 346454 340365 336321
10486 336321 313954 280693 244051 225120 219027 215153 214960 201925 189041 175963 174728 178324 184250
10473 184250 189886 196839 197837 192996 191982 197544 203697 214965 231584 239046 243241 234424 219736 208727
10459 208727 183922 152682 115508 51372 -34541 -105475 -137352 -128852 -87151 -10933 76525 138200
10447 138200 180248 209847 226366 244479 265351 291459 318975 331035 337217 350670 371043 394765
10435 394765 430420 470403 524327 610562 729040 894466 1131795 1447228 1815941 2193124
10425B193124L36468K55086J34265l7491k04956k84847k59932j99503j45398j06117
10415A680699p6250o2984m5345k9404l4913m0384l7450l1900k9571l2999l6221
10404A223278l5505k1142p933j6599j8703p829k583l317O573J3313P000J5085
10392A151638K5669K1272J1544M825r982p252q818j2704j9994k0105j6199j0349
10380A109545k491J841m48K739l38m232j2427k1376j4127l705N581O891J2568
10367A080021Q856N801J5100J3088J7033K8572K7758K3741K4342L5556L2811L1725
10355A344404K1704R902J4186L2088M6789O1347P5463P2978O2196M4619M1933
10344A827609N3146O5112O8609O8632P0012Q8305J03608J13742J18923J09124
$$ plain form
10425 2193124 2529592 2784678 2918943 2881452 2676496 2391649 2131717 1932214 1786816 1680699
10415 1680699 1604449 1541465 1496120 1466716 1431803 1391419 1353969 1322069 1292498 1259499 1223278
10404 1223278 1187773 1166631 1158698 1142099 1123396 1115567 1112984 1109667 1116240 1129553 1136553 1151638
10392 1151638 1177307 1198579 1210123 1214948 1204966 1197714 1188896 1176192 1156198 1136093 1119894 1109545
10380 1109545 1107054 1108895 1108447 1111186 1110848 1106616 1094189 1072813 1058686 1054981 1060562 1067453 1080021
10367 1080021 1088877 1094678 1109778 1122866 1139899 1168471 1196229 1219970 1244312 1279868 1312679 1344404
10355 1344404 1366108 1376010 1390196 1422284 1469073 1530420 1605883 1678861 1741057 1785676 1827609
10344 1827609 1880755 1945867 2014476 2083108 2153120 2241425 2345033 2458775 2577698 2686822
10334B686822J03753J26365J52148J93653K47650K92480L41918L49041L52564
10325D846394L60126L87069M53616N53212O84594Q05191R08013J025768J197962
10316A1221945J423601J600535J669508J623710J525989J585636J964426K680919
10308B5296269L679751M997319O864515R847798J4866807K3326959L7095081N6829893
10300A82804392P7717820Q7062891P2191481L2092071k1488554o4928997p8043686
10293B87407418o6105327m8038724l3786993k3859951j6985664j2283106r087729
10286G7259924o896953n351537m172210l239084k611546k310117k309278k440310
10278D7928889k502972k402224k214250j992216j755093j559267j418865j314019
$$ plain form
10334 2686822 2790575 2916940 3069088 3262741 3510391 3802871 4144789 4493830 4846394
10325 4846394 5206520 5593589 6047205 6600417 7285011 8090202 8998215 10023983 11221945
10316 11221945 12645546 14246081 15915589 17539299 19065288 20650924 22615350 25296269
10308 25296269 28976020 33973339 40837854 50685652 65552459 88879418 125974499 182804392
10300 182804392 260522212 347585103 419776584 451868655 430380101 365451104 287407418
10293 287407418 221302091 173263367 139476374 115616423 98630759 86347653 77259924
10286 77259924 70362971 65011434 60839224 57600140 54988594 52678477 50369199 47928889
10278 47928889 45425917 43023693 40809443 38817227 37062134 35502867 34084002 32769983
10270C2769983j241381j169545j083728r73990q61679p95284p77055p60217p42355
10261B4364749p45332p60206p45361p17867o83384o31656n89966n54229n08914
10252A8427834m78949m60444m50234m50218m41556m12252l79350l41272l28826
10243A4684733l24993l28701l42482l42624l28414k92478k55968k33780k19093
10234A2016200k07253k08335k03787j90209j87930j78839j63903j38836j14644
10225A0422464q5212k5499N7026J09543R6002l4411k57631m49527m95830m23471
10215H913454l20663k52161k06165j75234j64466j65351j55923j49173j46070
10206G178248j36765j25065j18555j11524j06812r2133p5970m0542O009Q1819
$$ plain form
10270 32769983 31528602 30359057 29275329 28301339 27439660 26644376 25867321 25107104 24364749
10261 24364749 23619417 22859211 22113850 21395983 20712599 20080943 19490977 18936748 18427834
10252 18427834 17948885 17488441 17038207 16587989 16146433 15734181 15354831 15013559 14684733
10243 14684733 14359740 14031039 13688557 13345933 13017519 12725041 12469073 12235293 12016200
10234 12016200 11808947 11600612 11396825 11206616 11018686 10839847 10675944 10537108 10422464
10225 10422464 10337252 10311753 10368779 10478322 10574324 10539913 10282282 9832755 9336925 8913454
10215 8913454 8592791 8340630 8134465 7959231 7794765 7629414 7473491 7324318 7178248
10206 7178248 7041483 6916418 6797863 6686339 6579527 6487394 6411424 6370882 6376891 6458710
10196F458710J85939K60358K39089J00926j25853l35229m11652l74114l10346
10187E687828k56449k01790j53512j25104j12656j01116q7239o9568m8674j7039
10177D514681K2311Q9848J67569K28586K61858K41829J09725p7036k00440k29867
10167E129064k12459j98850j52971j26666j12606j10458r7141q0374o3763n1933
10157C921843n8876n5791m8550n3194n6918m3118l0517q841J0817J7020L3420
10146C627295M4034K8361l35k9425n3733r9734j50717j75459j55573j16422r6987
10135B821305q4107q2616p3878o7455n6389l7193l6437l3269l2986k3384l2199
10124B261392m4210m3182l8125l8904l5969l5370k5338k9584m2144l5805k9630
$$ plain form
10196 6458710 6644649 6905007 7144096 7245022 7119169 6783940 6372288 5998174 5687828
10187 5687828 5431379 5229589 5076077 4950973 4838317 4737201 4649962 4580394 4531720 4514681
10177 4514681 4536992 4626840 4794409 5022995 5284853 5526682 5636407 5559371 5358931 5129064
10167 5129064 4916605 4717755 4564784 4438118 4325512 4215054 4117913 4037539 3973776 3921843
10157 3921843 3862967 3807176 3758626 3705432 3648514 3605396 3574879 3566038 3576855 3593875 3627295
10146 3627295 3671329 3699690 3699355 3669930 3616197 3516463 3365746 3190287 3034714 2918292 2821305
10135 2821305 2737198 2654582 2580704 2513249 2456860 2419667 2383230 2349961 2316975 2293591 2261392
10124 2261392 2217182 2174000 2135875 2096971 2061002 2025632 2000294 1970710 1928566 1892761 1863131
10113A863131k6703k4439k5815k9847l1194k8234l7843n1671m6028k2016k130
10102A537211L489N520r809k2366k8033k2669l5649k8618j8414k0418k2342l0804
10090A307098k2506j9952j5739j4622j4897j4589q556l797j4239j0554j5763j8663
10078A133221j6729j4261j7055j7396k3673k3389j4914j6012m491r593o515o892
10066I62301n77p097j5495o745q245j3793j8444k4679l3617k5606j5498j592J3810
10053H04723P775N679L498K305l633j7469j5290j9477l1174l1132k4541j8614
10041F62650j6541r71J2134M643J813k173M396O887P259n951o726q312j2547j4245
10027F32316n043o378q000j0952j1069n001K763L945J59Q134Q24o339j3334m527
$$ plain form
10113 1863131 1836428 1811989 1786174 1756327 1725133 1696899 1659056 1607385 1561357 1539341 1537211
10102 1537211 1540700 1546220 1536411 1514045 1486012 1463343 1427694 1399076 1380662 1360244 1337902 1307098
10090 1307098 1284592 1264640 1248901 1234279 1219382 1204793 1196237 1192440 1178201 1167647 1151884 1133221
10078 1133221 1116492 1102231 1085176 1067780 1044107 1020718 1005804 989792 985301 975708 969193 962301
10066 962301 961724 954627 939132 932387 924142 910349 891905 867226 833609 808003 792505 790913 804723
10053 804723 812498 818177 821675 823980 820347 802878 787588 768111 736937 705805 681264 662650
10041 662650 646109 645138 657272 661915 663728 661555 665951 672838 680097 674146 667420 659108 646561 632316
10027 632316 627273 620895 612895 601943 590874 585873 588636 592581 592740 600874 601698 595359 582025 577498
10013E77498j0294j5080r735q733o248m156P067R450P210J173J2256K4509J9652
10000F04569J0198k1571l7690l2696j2291j0817q455k525r270j9606k7914k7039
9988D04893k8736k5916o122N533J5081J5951J1973N226m402m474k682j608j1747
9975C72970p723K3l091J061m313l138n444k796k87l936n099p156j2286j2231j1412
9960B95142K675O475L53L452q061m397O24q853n844l330K624l804K73K109M587
9945B84025J42P48n680q959oj378r962M49K577o077p022p151n447J339K031n547
9929B34082Q765N566P90K597q99k165l79m131O458M625J160l352k976m778k181
9914B43182n308j1636m586K094l536m191J992N67J57L502O259N099Q39j055l638
$$ plain form
10013 577498 567204 552124 542389 533656 527408 523252 530319 539769 546979 548152 560408 584917 604569
10000 604569 614767 593196 555506 522810 510519 499702 491247 488722 479452 459846 431932 404893
9988 404893 376157 350241 344119 349652 364733 380684 392657 397883 393481 389007 386325 384717 372970
9975 372970 365247 365270 362179 363240 358927 355789 350345 347549 347262 343326 338227 331071 318785 306554 295142
9960 295142 297817 304292 304645 308097 300036 295639 296263 287410 281566 278236 280860 277056 277329 279438 284025
9945 284025 284167 284915 279235 270276 270270 268892 258930 259379 261956 255879 248857 241706 236259 237598 239629 234082
9929 234082 242847 248413 249203 251800 250901 248736 248357 244226 250684 255309 256469 253117 250141 245363 243182
9914 243182 237874 226238 221652 223746 220210 216019 218011 218578 218735 222237 228496 233595 234434 233379 229741
9899B29741J876j547J46M132n90j395N979J1948R833J831P717J0642P679Q620
9885B96612J5224K4948K0504L4778M7219O6052J04891J47111J90038K43728K73708
9874A464813K64219K12823J18034J4541j01821j95945k39164k33886k05429j67852
9864I30333j29870r6110p9101o2529m7082m0961k8181j9784j0804j2139r145j1412
9852C83215j1736m333r918j5498j1378n955o935j2035l431n213j418k154o777
9839B86434j5855j1271j1947r205r233J184K936m142n878p215l861j424J403N157
9825B17083M606j930M38p433m458j32m785k466o494j002L304j0407l406j132k552
9810A79234k759J364P360J774K452Q14l454N193M94J48m95R96m148r261m482l732
$$ plain form
9899 229741 231617 230070 230216 234348 233758 232363 238342 250290 260123 261954 269671 280313 287992 296612
9885 296612 311836 336784 357288 392066 439285 505337 610228 757339 947377 1191105 1464813
9874 1464813 1729032 1941855 2059889 2074430 1972609 1776664 1537500 1303614 1098185 930333
9864 930333 800463 704353 625252 562723 515641 474680 446499 426715 415911 403772 394627 383215
9852 383215 371479 367146 357228 341730 330352 324397 317462 305427 301996 296783 295365 293211 286434
9839 286434 270579 259308 247361 238156 228923 230107 233043 228901 223023 215808 211947 210523 211926 217083
9825 217083 221689 219759 220197 212764 208306 208174 203389 200923 194429 193427 196731 186324 182918 181786 179234
9810 179234 176475 177839 185199 186973 189425 190239 186785 191978 192472 192620 192125 193121 188973 179712 175230 171498
9794A71498J661J766j818K06k038r874O83o257r84L001l060L951j2010r35M776
9779A50566j408p147j252P08R26K798n066L138P32N740R20m444J6K050j040r538
9763A37699n950o41R12m235m091L34P497O383K238q902k001k598M871n178J678
9748A28016K102j1N187n67K378j119J162N356L133q773r991p911q18l862l292
9733A10990K113L694N289L520L921J5N084m285o616p92p113p326N065J1489K628
9718A27676O13k202O367K514m695n556r325j3854q886N42P673Q325l566k180o858
9703I6588J949O070j19o79J735q71o08j657L067Q407L521l937o964m540k798l690
9687I5474k867K18M236N53J166p83l791n058r986J808N908K484J704Q307P971
$$ plain form
9794 171498 173159 174925 173107 173313 171275 161401 162084 155827 154843 157844 154784 158735 146725 145790 150566
9779 150566 149158 142011 140759 141467 142393 145191 140125 143263 143995 149735 150655 146211 146227 148277 147237 137699
9763 137699 131749 131108 132020 127785 123694 124028 131525 137908 140146 131244 129243 126645 131516 126338 128016
9748 128016 130118 130107 135294 134727 137105 135986 137148 142504 145637 136864 126873 118962 118144 114282 110990
9733 110990 113103 116797 122086 125606 129527 129542 134626 130341 123725 122933 115820 108494 113559 125048 127676
9718 127676 128289 126087 132454 134968 130273 124717 115392 101538 92652 93194 100867 109192 105626 103446 96588
9703 96588 98537 104607 104488 103809 105544 104673 104065 102408 105475 113882 117403 113466 106502 101962 99164 95474
9687 95474 92607 92825 97061 97614 98780 97997 94206 89148 79162 80970 86878 89362 91066 99373 107344
9672A07344K748k745J832O198n973q288N058j583O880J1825j736q425p565j2017
9658I3553p702k219Q52J0193L655K161N85J22L872l686j500L739J202J9L45m180
9642A01011J406m505N23m524N630J2551P921k701j124k267l352j0045n40M858
9628A04842R22L85r89J704l532r48M689K012m171o855o886J815j948K869l321
9613I0588n341J012J20M17l56j0239n89k447m286R121J3423O742N366k038l518
9598I7975j0598o118q866O98J712J213j087K069k532P95k42L424K007M110O007
9583I0567L87k881n440o270l436K207J926J1485Q72p572J39M67J357j033M69J579
9567H4823L406j0508o689K618J503m185k070N10L242J361q67K482n593p105j403
$$ plain form
9672 107344 110092 107347 109179 115377 109404 101116 106174 104591 111471 123296 121560 113135 105570 93553
9658 93553 85851 83632 84484 94677 98332 100493 101078 101200 105072 101386 99886 103625 104827 104846 105191 101011
9642 101011 102417 97912 98435 93911 99541 112092 120013 117312 116188 113921 110569 100524 99984 104842
9628 104842 105764 106149 105160 106864 103332 102384 107073 109085 104914 98059 91173 92988 91040 93909 90588
9613 90588 85247 86259 86379 86796 86440 76201 75612 73165 68879 78000 91423 98165 103531 101493 97975
9598 97975 87377 81259 72393 73091 74803 76016 74929 76998 74466 75261 75019 78443 80450 84560 90567
9583 90567 90954 88073 82633 76363 72927 75134 77060 88545 89417 81845 81984 82451 83808 82775 83244 84823
9567 84823 88229 77721 71032 73650 75153 70968 68898 69408 72650 74011 73144 75626 70033 62928 61525
9552F1525K983j334K904k05N018M68L387M556j311J363J091k402m104p91o593
9537F6555m298K24j535J852J11P89O307l492m273L513K184J845l748k586k916
9522F0532L722O272O166j782n952K164J619l432k998j753k182O989L048r31m136
9507F7346N60M804j491p692J344O694K891m079q329k76K332O565L38l361k885
9492F4761j902n051K584K531J791K228j406M69p1n237l873N295J225K960L747
9477G0051j218k957J735r59p582j466O834L338P08l573j510J003M088N68r88k6
9461F8046k38p042J210k017k950M522k077n76O953L564j089p899J315M769Q3n551
9445F1023J198r59p104j456R044M668o02M80k286P82N736j842o694p041j938K760
$$ plain form
9552 61525 64508 63174 66078 65873 70891 71359 74746 79302 77991 79354 80445 78043 73939 73148 66555
9537 66555 62257 62481 60946 62798 62909 63698 70005 66513 62240 65753 67937 69782 66034 63448 60532
9522 60532 64254 70526 76692 74910 68958 71122 72741 69309 66311 64558 62376 69365 72413 71482 67346
9507 67346 67906 72710 71219 63527 64871 71565 74456 70377 62048 61772 64104 70669 71007 67646 64761
9492 64761 62859 57808 60392 62923 64714 66942 65536 66005 65934 60697 56824 62119 63344 66304 70051
9477 70051 68833 65876 67611 66652 59070 57604 64438 67776 68484 64911 63401 64404 68492 69060 68072 68046
9461 68046 67808 60766 61976 59959 57009 61531 59454 58878 65831 69395 68306 60407 61722 66491 66574 61023
9445 61023 62221 61262 54158 52702 61746 66414 65812 66292 64006 64788 70524 68682 61988 54947 53009 55769
9429E5769M760K772r07k628m52O287P526K39r2l727m883K068L85K445l805j1001
9413E4756j547N244K284N66m105R06L607M360J874q274L67m95l117J524k376r093
9397D6481J415L998n248m662m80L702J534J627L180j127j390K611R05K137K062
9382E6745k134l356k925M126L156j813J360L82k109K646o110N884L499j828m683
9367E2840K410O267K760K356k933l523L764Q15r288m916K577l339j0453O836Q708
9352E4881j397p743n793j953L210L290P260K458M141o0j558k830m632J209P087
9337E7570m674n500k156L187j175j865L121j583J925l677j440O145l610o86j161
9322D4421R0j299l053p041l114Q224J529m23J24N92K612N850Q95K922N371L592
$$ plain form
9429 55769 60529 63301 62394 59766 59314 65601 73127 73366 73274 69547 64664 66732 67117 69562 65757 54756
9413 54756 53209 58453 60737 61303 57198 58104 61711 66071 67945 59671 60038 59543 56426 57950 55574 46481
9397 46481 47896 51894 46646 41984 41504 45206 46740 48367 51547 50420 49030 51641 52546 54683 56745
9382 56745 54611 51255 48330 52456 55612 53799 55159 55541 53432 56078 49968 55852 59351 57523 52840
9367 52840 55250 61517 64277 66633 63700 60177 63941 64756 55468 50552 53129 49790 39337 46173 54881
9352 54881 53484 45741 39948 37995 41205 44495 51755 54213 58354 58294 56736 53906 49274 50483 57570
9337 57570 52896 47396 45240 48427 47252 45387 48508 46925 48850 45173 43733 49878 46268 45582 44421
9322 44421 44511 43212 40159 33118 30004 38228 39757 39334 39458 40050 42662 48512 49407 52329 57700 61292
9306F1292m626k620l714k241n271L347O216N142L847Q131k289m186k135l144k026
9291E5723k370r04j788K717O203J694k944l000K708R42o255J130M438n394o115
9276D6785o776l054j876L877N245j781Q535K57k605J792Q598K413m465r677k287
9261D4981Q411K265m416m698j387K002L999p42R644k715q97j271m077J229j504
9246E0824o95K460j957q578k136L090L199N139N329K53L289r441p249L935O68
9231D8130N99M961J222l806N34L42K134o948o372M91N116K443L363M181N055r81
9215F0464j0136r006m398R40P023J4600P74j2511m444m751J386L956N426K755
9201E2078j0593n942R858J0733j537o338J01K927m399J719P44p051k871j463J774
$$ plain form
9306 61292 56666 54046 50332 48091 42820 46167 52383 57525 61372 69503 67214 63028 60893 57749 55723
9291 55723 53353 52449 50661 53378 59581 61275 58331 55331 58039 58981 52726 53856 58294 52900 46785
9276 46785 40009 36955 35079 38956 44201 42420 50955 51212 48607 50399 58997 61410 56945 47268 44981
9261 44981 53392 55657 51241 46543 45156 47158 51157 50415 60059 57344 56447 55176 51099 52328 50824
9246 50824 50129 52589 50632 42054 39918 43008 46207 51346 56675 56928 60217 50776 43527 47462 48130
9231 48130 48729 53690 54912 51106 51640 51982 54116 47168 40796 41287 46403 48846 52209 56390 61445 60464
9215 60464 50328 41322 36924 37864 44887 59487 60261 47750 43306 38555 39941 43897 49323 52078
9201 52078 41485 35543 45401 56134 54597 48259 48360 51287 46888 48607 49351 42300 39429 37966 39740
9186C9740M29L569J501K42L9o759j114K858k86K577M157j019m459M813l40m386
9170D1562M136j68p897L681N394r30j640o988J203L273m439K457M083l329q793
9155C1605n45P683J973Q96q15j808r381p936K819N840N406J409O887m7L450j435
9139D6001r308J833m260p214L438K415L067l828Q64K266K129J828R27O047j77
9124D6028J181m41o81P15L366O66p9J093n363j31K985l405l831J333q188p138
9108B8110k679m12J167N043N771K866n135j799N469k719J035O822l359J977j048
9093D1109o27J822M459L456m557K516J198n393k767m582l317o10Q452r15L575
9078D3819J29k05L768j530k795M782p251j167j266J121Q315m491m528o026l952
$$ plain form
9186 39740 40169 43738 45239 45481 45520 38761 37647 40505 40219 42796 46953 45934 41475 46288 45948 41562
9170 41562 45698 45530 37633 41314 46708 45778 44138 37150 38353 41626 37187 39644 43727 40398 31605
9155 31605 31060 38743 40716 41612 40797 38989 29608 21672 24491 30331 35737 37146 44033 43986 47436 46001
9139 46001 36693 38526 34266 27052 30490 32905 35972 32144 33008 35274 37403 39231 40158 46205 46028
9124 46028 47209 46768 46087 46802 50168 50834 50755 51848 46485 46354 49339 45934 42103 43436 35248 28110
9108 28110 25431 25019 26186 31229 37000 39866 34731 32932 38401 35682 36717 43539 40180 42157 41109
9093 41109 40482 42304 46763 50219 45662 48178 49376 43983 41216 36634 33317 32707 41159 40244 43819
9078 43819 43948 43743 47511 45981 43186 47968 40717 39550 38284 39405 47720 43229 38701 32675 28723
9063B8723L899L36j673O130Q131m600n789P28O417J668j846K124J355Q706L328
9048E7637o391p86P166K748o195n154l857k096Q15j722N592j41M781J054M656
9033E8107k174r27k759k00p067l745r024k674J761P694J787l740n275q56j58K455
9017C3205o70l260M532k31m401l40L770K294p78K519j333k332j309r221L417J0038
9001C5900N93o621J020M572N979K893m371l218N520K37j1455N406J070l546J06
8986C4085P140N963m818K407o77l078j901O968r17l110l855n666o062P271M616
8971C8366l751q090L365J1358L77m718N99q727m650K755L536M386P466Q149M739
8956E5160j2990l654k10o511J280L476L820O764n696m352k988N58Q765k075q247
$$ plain form
9063 28723 32622 32958 31285 37415 45546 40946 35157 35885 42302 43970 42124 44248 45603 54309 57637
9048 57637 51246 50460 57626 60374 54179 49025 45168 43072 43887 42165 47757 47616 52397 53451 58107
9033 58107 55933 55006 52247 52047 44980 41235 32211 29537 31298 38992 40779 37039 31764 30908 30750 33205
9017 33205 32535 29275 33807 33576 29175 28835 32605 34899 34121 36640 35307 32975 31666 22445 25862 35900
9001 35900 36493 29872 30892 35464 41443 44336 39965 36747 42267 42504 31049 36455 37525 33979 34085
8986 34085 41225 47188 42370 44777 44100 41022 39121 46089 45172 42062 38207 32541 26479 33750 38366
8971 38366 34615 26525 29890 41248 41625 36907 37506 28779 24129 26884 30420 34806 42272 50421 55160
8956 55160 42170 38516 38306 31795 33075 36551 40371 47135 41439 37087 34099 34657 43422 41347 33100
8941C3100O02l692l387r13K474P607N689m340m835j161k493j617l528J898KL423
8925B8829m171L476Q199K833l1k422k003m269j668j823J715L576K563P254n338
8910C6720m161L829M539K818n045r652p826l707O536M354K877L545P950N489l068
8895D5198n292l568M711k574o018L883L718n268n878L523j161l745O37O814p20
8880C4260l254j42L686K517M824K869J648l960m057j122p19L098N29O828m389
8865D2616P59k675O491K998q751k460j386M489O994n431j0032m292K234O799L799
8850D2152m249j930L410J287n00P36l224j1433K775J166P839L785J343k087M63
8835D1533o189m068O870R90m631m83R600j254n413L321L639N490o446m673N197
$$ plain form
8941 33100 33702 30010 26623 25710 28184 35791 41480 37140 32305 31144 28651 27034 23506 25404 25406 28829
8925 28829 24658 28134 36333 39166 39135 36713 34710 30441 28773 26950 28665 32241 34804 42058 36720
8910 36720 32559 36388 40927 43745 38700 29048 21222 17515 24051 28405 31282 34827 42777 48266 45198
8895 45198 39906 36338 41049 38475 32457 36340 40058 34790 28912 32435 31274 27529 28166 34980 34260
8880 34260 31006 30864 34550 37067 41891 44760 46408 42448 38391 37269 36550 39648 40177 47005 42616
8865 42616 43375 40700 47191 50189 41438 38978 37592 42081 49075 43644 33612 29320 31554 38353 42152
8850 42152 37903 35973 39383 40670 40170 40906 37682 26249 29024 30190 38029 41814 43157 41070 41533
8835 41533 35344 31276 38146 39136 34505 34022 43622 42368 36955 40276 43915 49405 42959 38286 43483
8820D3483Q470k264q303q58l598p54J476K31O956K744p015k261K22L660O702O719
8804E5610m093k583J184J398J154k626m939r554R8l192L65k587N243o077Q465
8789C7866J2401j517j0531l634L059O468M120n656m586l69j233j437L029P346
8775D5326j107j676P660l960m124M31J409n758q339m374K719P990L624L790J991
8760D5602l060N89J3813k677o042L174J644j799j084J714j5P30l754n515m423
8745C8897Q455J657j227L277K113O133K465n800m74L053l70l976j250j982o08
8730E0363j671m668m48O31k77L668P544L829J57K45j361k37p056m072p407M769
8714D4009L40M895n05o109o868q49J765K505N25K367M21K256K953p990N383N445
$$ plain form
8820 43483 51953 49689 41386 40528 36930 36176 37652 37883 44839 47583 40568 38307 38529 42189 48891 55610
8804 55610 51517 48934 50118 51516 52670 50044 45105 35551 35649 32457 32822 30235 35478 29401 37866
8789 37866 50267 48750 38219 34585 37644 44112 48232 42576 37990 37621 36388 34951 37980 45326
8775 45326 44219 42543 50203 46243 42119 42550 43959 38201 29862 25488 28207 36197 39821 43611 45602
8760 45602 42542 43131 56944 54267 48225 51399 53043 51244 50160 51874 51859 52589 48835 43320 38897
8745 38897 47352 49009 47782 51059 53172 59305 61770 55970 55496 58549 58179 54203 52953 50971 50363
8730 50363 48692 44024 43576 44207 43930 47598 55142 58971 59128 59373 58012 57775 50719 46647 39240 44009
8714 44009 44349 49244 48739 42630 35762 34913 36678 39183 39708 42075 42496 44752 47705 39715 45098 50543
8698E0543K617J235p39K93j771J280k012K28R593k185q368j006l12J758l296K716
8682E0574O279l494k612J980q53J974N385Q788J785n48N54M568j258L678O97K421
8666G9918l083J307P894J0211J9580L5447N4906N3152K9638l798m7601m6758l5522
8653A55291k3512j1939j2578j603l665k277j591m276L885L78l514k891Q98P77
8639I3383K650P084m951q76J043n456L144N410l204m078k689m569j416J551j755
8624H5271K576J1524N360j571K634Q552J0342L5800O6911R9466J03432P9558R306
8611E19161q1041j12578p7292m9510k5104j7465j6004r430l862j3364r603O605
8599A10513M212J39q42j449k254m231m817p594J867J649K535j0727p147L401o61
$$ plain form
8698 50543 53160 54395 53656 53949 52178 53458 51446 51674 61267 59082 50714 49708 49396 51154 47858 50574
8682 50574 56853 53359 50747 52727 51874 53848 59233 68021 69806 69258 69812 74380 73122 76800 77497 79918
8666 79918 76835 78142 86036 96247 115827 151274 206180 259332 288970 285172 237571 190813 155291
8653 155291 131779 119840 107262 105659 101994 99717 98126 93850 97735 98113 94599 91708 92606 93383
8639 93383 96033 103117 98166 97290 98333 92877 96021 101431 98227 94149 91460 86891 85475 87026 85271
8624 85271 87847 99371 104731 103160 105794 114346 124688 160488 227399 326865 430297 509855 519161
8611 519161 438120 325542 248250 198740 173636 156171 140167 130737 126875 113511 103908 110513
8599 110513 114725 114864 114022 112573 110319 106088 101271 93677 95544 97193 99728 89001 81854 85255 84594
8584H4594j191O430K859l347j138K700L093L300L369j665L957J9698J4815K6845
8570A64319M7548N2103M2319J6477k7051n1684m3847k0739j8500j0559N74M527
8558A55487j32q768N536M431j456L61j679n164r113q090O38L272k570j4209m922
8543A13622q05l452Q30O312O172n882j4247M88O157O43j484L655j638R191K068
8528A21630J534L846j178J1918J4213k671p848m123o167j457N031J2619P994J2315
8514A67656J180j0870j4251j2551o445k828j922l893j781o500m465l277n797O056
8500A00312K405r68o366M455J9O925l35j314n837k951K159N890J6489J8559p5
8485A39367j945M527J578R70M695j350k578j616n162o527n727L653O249O532j291
$$ plain form
8584 84594 83403 89833 92692 89345 88207 90907 94000 97300 100669 99004 102961 122659 137474 164319
8570 164319 211867 263970 306289 322766 295715 244031 200184 179445 160945 150386 150960 155487
8558 155487 155355 146587 152123 156554 155098 155459 153780 148616 139503 131413 132051 135323 132753 118544 113622
8543 113622 112817 109365 110195 116507 122679 116797 102550 103038 109195 109838 108354 112009 110371 119562 121630
8528 121630 123164 127010 125832 137750 151963 149292 141444 137321 131154 129697 134728 147347 155341 167656
8514 167656 168836 157966 143715 131164 124719 121891 119969 116076 114295 107795 103330 100053 94256 100312
8500 100312 102717 101749 95383 99838 99857 106782 106447 105133 99296 96345 98504 104394 120883 139442 139367
8485 139367 137422 141949 143527 144497 149192 147842 145264 143648 138486 131959 126232 129885 136134 142666 141375
8470A41375p065l489M345l906L450R426L067p202r99j156p553J826r08o554l997
8455A20660o307n818L869j993q026p234m099l341K515l22M380N080m996M863j226
8440I8005M629L810O291k659o298r017m503N769K75q720l376j473M286J131n60
8425H7590P95j0472j913l48l555P88P670L881n80O379M535m049o131L647j145
8410H7092q395n322J329Q178l490l540k698j0645k393L96M544l613L457K559r70
8395F6489j956L62m740k106K289K84P00j273P28N972M728K174L923r70l792n431
8379F7381j5813l66O915p584N463N698L398q491l663M40k319n06m288M859j405
8364D9719p10M489N979N948R7j0444k067o41J249Q79j441L438J440k90n166Po942
$$ plain form
8470 141375 134310 130821 135166 131260 134710 144136 147203 140001 139002 137846 130293 132119 131211 124657 120660
8455 120660 114353 108535 112404 110411 102385 95151 91052 87711 90226 89904 94284 99364 94368 99231 98005
8440 98005 102634 106444 112735 110076 103778 94761 90258 96027 96302 87582 84206 82733 87019 88150 87590
8425 87590 88385 77913 76000 75652 72097 72885 80555 84436 83856 90235 94770 90721 84590 88237 87092
8410 87092 78697 73375 74704 82882 79392 75852 73154 62509 60116 60512 65056 61443 64900 67459 66489
8395 66489 64533 64895 60155 58049 60338 60622 61322 60049 60777 66749 71477 73651 77574 76604 72812 67381
8379 67381 51568 51202 58117 50533 55996 61694 65092 56601 52938 53378 51059 50553 46265 51124 49719
8364 49719 49009 53498 59477 65425 65522 55078 53011 52370 53619 54498 53057 56495 57935 57645 52479 52486 45544
8347D5544p784M445O390J328M780M380J749L861L256K655j3861j0518o735q690
8333C0800L908P576K037k698n015K974J524L539L480j194l177p495J510M122N338
8318D7229N692M177L136J414R80J274o059n316j1883o167L082n18J736R111L045
8303E0933j139N129p33j396j0390o162J803K429j399N34L54J2512l397l774k600
8288D2704p838k772K062q83k346L161O806L025L583l768l507J080l831p522o738
8273B3216L301Q844Q071N636p470r96l608j3272K04O177j851M019O373m093L106
8258C7657N28K934O451l547o617k414L888N125j1826l472j156j275K396L225m53
8243C1444Q66n400j173J0343R142k241k541r93K777m94k972p24R085j027l996
$$ plain form
8347 45544 37760 42205 48595 49923 54703 59083 60832 64693 67949 70604 56743 46225 39490 30800
8333 30800 34708 42284 44321 41623 36608 39582 41106 44645 48125 46931 43754 36259 37769 41891 47229
8318 47229 52921 57098 60234 61648 62628 63902 57843 52527 40644 34477 37559 37041 38777 47888 50933
8303 50933 49794 54923 54190 52794 42404 36242 38045 40474 39075 39609 39963 52475 49078 45304 42704
8288 42704 34866 32094 34156 33273 30927 34088 40894 43919 47502 43734 40227 41307 37476 29954 23216
8273 23216 26517 35361 43432 49068 41598 40602 36994 23722 23926 30103 28252 32271 38644 34551 37657
8258 37657 38185 41119 47570 44023 37406 34992 38880 44005 32179 28707 27551 26276 28672 31897 31444
8243 31444 32310 26910 25737 36080 45222 42981 40440 39447 42224 41730 38758 38034 47119 46092 42096
8228D2096o519N016o33m903K750k778r5L801o894l859K412J225L834J239n130
8213C1562j919P302M12l281J318k962q197l062Q491J691o003q21L399K439L635
8198C4004L465P89l345j337j574j497l675k235O037l417K557O514N201m52n000
8183C6035K212M476p547o607l017m789P09M790j285L485n368p595L731N372M416
8168B9018n5k311l373n018L502N533j217o004j296M816j749m746j117M40l50M201
8152B0274N487M561L377J028l262n365j468o034m49N156K103l462r057l151R639
8137A9377K115M511K167l896m691k805J248J674N716J1115J775J235N951l250
8123D2242j5201M305O665N91n494J097J58k756K468P93m468K417M576p612k826
$$ plain form
8228 42096 35577 40593 39960 35057 37807 35029 34934 38735 31841 27982 30394 31619 35453 36692 31562
8213 31562 29643 36945 37357 34076 35394 32432 24235 21173 29664 31355 25352 24531 27930 30369 34004
8198 34004 37469 38258 34913 33576 32002 30505 26830 24595 30632 27215 29772 36286 41487 41035 36035
8183 36035 38247 42723 35176 28569 25552 20763 21472 26262 24977 28462 23094 15499 19230 24602 29018
8168 29018 28963 26652 23279 18261 21763 27296 26079 20075 18779 23595 21846 17100 15983 16423 16073 20274
8152 20274 25761 30322 33699 34727 31465 26100 24632 18598 18149 23305 25408 21946 12889 9738 19377
8137 19377 21492 26003 28170 24274 19583 16778 18026 19700 25416 36531 38306 39541 45492 42242
8123 42242 27041 31346 38011 38602 33108 34205 34363 31607 34075 34868 30400 32817 37393 29781 26955
8108B6955J182K568L995j957n562N03N387J632O013p06M898M77K818n784o565
8093C5854k466m486j109J667L831m714o522M672L375J988J960N686m282m590k236
8078B8628l169k592j98k048P735M401j066J527K753L147m128l083j22K762m96
8063C4051J311Q62k775J623o942l324P20k636K208J987L567N043J3q09o038j932
8047B6929O085k452J129K151k102m785m342L393K14j782n956K900O253m04K83
8032B7514P84L97n056J969P510J0360M112N905p56M816O020O826j995j2855o908
8017D8643l977p50n366q297m859n113L258Q378N016M460P11K376Q55j0063r816
8002B5456R38P036R26o312k290K641o1o000k670O62N858N05k91M355M990M542
$$ plain form
8108 26955 28137 30705 34700 32743 27181 27684 33071 34703 40716 40010 44908 45385 48203 42419 35854
8093 35854 33388 28902 27793 29460 33291 28577 22055 26727 30102 32090 34050 39736 35454 30864 28628
8078 28628 25459 22867 22669 20621 28356 32757 31691 33218 35971 39118 34990 31907 31785 34547 34051
8063 34051 35362 36224 33449 35072 28130 24806 25526 22890 25098 27085 30652 35695 35708 34899 28861 26929
8047 26929 33014 30562 31691 33842 31740 26955 22613 26006 26220 24438 18482 21382 27635 27231 27514
8032 27514 28298 28695 23639 25608 33118 43478 47590 53495 52739 57555 63575 70401 68406 55551 48643
8017 48643 44666 43916 38550 30253 25394 20281 23539 31917 36933 41393 42104 44480 45335 35272 25456
8002 25456 26394 33430 34356 28044 25754 28395 28334 22334 19664 20326 26184 26689 26398 30753 35743 40285
7986D0285M605p88K994K589j074N134J419J845o773q198j068J19N024Q354K899
7971E7366p639l025m825q980K927q06J581N679L295r090j031K125j42k34k304
7956C4897M503l823l627j020Q30j811J3m388l390J399J081M119P426J847J856
7941C9912n975m235M025J298l258p29L491M594M474K41n076o174m789o03N570
7926C2766k732r468j940M587J471l594m354j948K239Q196J672L414O426M702m666
7911C6771n824k365o754J0347K464l883k691j489m273P46L430j934m480P152N298
7896C2515J839q159o445M165j040m712M772M654O54m862n440k554O380O826l503
7881B5090m018j385M72M303m583K760P438l378j579K687p191L21j285k354J366
$$ plain form
7986 40285 44890 44102 47096 49685 48611 53745 55164 57009 50236 42038 40970 41089 46113 54467 57366
7971 57366 49727 46702 41877 32897 35824 35018 36599 42278 45573 36483 35452 37577 37435 37201 34897
7956 34897 39400 35577 31950 30930 31760 29949 29962 25574 22184 23583 24664 28783 36209 38056 39912
7941 39912 33937 29702 33727 35025 31767 31038 34529 39123 43597 43838 38762 32588 27799 27196 32766
7926 32766 30034 20566 18626 23213 24684 21090 16736 14788 17027 25223 26895 30309 36735 41437 36771
7911 36771 30947 28582 21828 32175 34639 30756 28065 26576 22303 23049 26479 24545 20065 27217 32515
7896 32515 34354 26195 19750 23915 22875 18163 22935 27589 28243 23381 17941 15387 21767 28593 25090
7881 25090 21072 19687 20159 24462 19879 22639 30077 26699 25120 27807 20616 20937 19652 17298 18664
7866A8664N404R92J31m02l522n78J034M31N51l602k90O601O553J101q736j08O256
7849C0480r17m618p504m593K884N078l954L59m831k433P365M680n172j318P116
7834B2622k31m203L818k948n048K902k191j105K044J935k76m062L441o24k884
7819A3190P934J432m117n579r590K836Q258J34k988j805M826k006j0758M764L631
7804A0162m62j895J981p708N256N384j143j507j641K989l450l270k955m032K593
7789C02Q819N480q349k899L24K628M013K577J618n716j69O249j514l718k087k750
7773D808k884m627M468j820k380NM11p59L244J832K063j932j843J615O187l857
7757D531L686P45m447J158P918k97k14o279p354k076O749N761j440m316M894N098
$$ plain form
7866 18664 24068 25060 25191 24789 21267 20689 21723 22154 22705 19103 18813 25414 31967 33068 24332 24224 30480
7849 30480 29563 24945 17441 12848 15732 20810 16856 17215 12384 9951 17316 21996 16824 15506 22622
7834 22622 22391 18188 22006 19058 14010 16912 14721 13616 15660 17595 17319 13257 16698 16074 13190
7819 13190 21124 22556 18439 12860 3270 6106 14364 14498 11510 9705 14531 12525 1767 6531 10162
7804 10162 9700 7805 9786 2078 7334 12718 11575 10068 8427 11416 7966 4696 1741 -2291 302
7789 302 9121 14601 6252 3353 3677 6305 10318 12895 14513 8797 8628 14877 13363 9645 7558 4808
7773 4808 1924 -2703 1765 -55 -2435 -2430 -2019 -2778 466 2298 4361 2429 586 2201 8388 4531
7757 4531 8217 8962 4515 5673 13591 13294 13080 6801 -553 -2629 4120 9881 8441 4125 9019 14117
7741A4117K610l640k295k580m927M847M334j565k726l770n56L409L393N741l112
7726A3280m974P119L181l189p237m452J28m791k4p48J484L737M982P24l60L559
7710A2419o44m445q758L16P179j997l392N642l709o906M245N135O181J765l602
7695I429o801J423m385p478J60K838O209l527l385Q402l659R45L247j635N24m529
7679b222J117O205m294j578K556L409O739o649K199K809o510n831Q91M58j165
7664a866M019O422L251N689o96j0468l568L636L492O826O87p834j924L754l708
7649G712o749o115J04M755r24K742k407J0758O03n613k117R05L919M48l824k215
7633A982N84P630N095l448p375j941N55K316m103j391J646J533j289k866n083
$$ plain form
7741 14117 16727 13087 10792 8212 3285 8132 12466 10901 8175 4405 3849 7258 10651 16392 13280
7726 13280 8306 15425 18606 15417 8180 3728 3856 -935 -959 -1707 -223 3514 8496 9220 8860 12419
7710 12419 11775 7330 -1428 -1112 6067 4070 678 6320 2611 -4295 -50 5085 11266 13031 9429
7695 9429 2628 4051 -334 -7812 -7652 -4814 1395 -2132 -5517 2885 -774 171 3418 1783 2307 -2222
7679 -2222 -1105 5100 806 -772 1784 5193 11932 5283 7482 10291 3781 -2050 -1159 -701 -1866
7664 -1866 2153 8575 11826 17515 16819 6351 2783 6419 9911 16737 17424 9590 7666 11420 7712
7649 7712 963 -5152 -5048 -293 -1217 1525 -882 9876 10479 4866 2749 3654 7573 8021 4197 1982
7633 1982 2566 10196 15291 11843 4468 2527 3082 5398 1295 -96 1550 3083 1794 -1072 -6155
7618f155j718R78j079J742l590L459K226j992L401P903j380n696m548P30K868
7603b851L65k282O693K246N829O027m981n582J699K834N45J302n68J094j555p697
7587C118L469l466j523O235K028L896P329N493p279q178n213J718m879j035J196
7572B909J203o94m791O565O620l66n26n108o178j967L243R15j863r6K973J927
7556D766n326K501L670L913J332J094j553o984M154J41l211R16L314l853R340
7541A4214J006m612j0034m888K075l114j22n60M38M467j308k794q43o39k723j325
7525a0762J564r11L168M741l012L384P453O483n521k019K11m470N129K112q580
7510a030q16l697l772P5l17M641L610n76M687P781K380j3024q176P368R269J408
$$ plain form
7618 -6155 -7873 -6895 -7974 -6232 -9822 -6363 -4137 -6129 -2728 5175 3795 -1901 -6449 -5719 -2851
7603 -2851 -2486 -4768 1925 4171 10000 16027 11046 5464 7163 9997 10542 11844 11276 12370 10815 3118
7587 3118 6587 3121 1598 7833 9861 13757 21086 26579 19300 11122 5909 7627 2748 1713 2909
7572 2909 4112 3418 -1373 5192 11812 11446 10920 5812 -366 -2333 910 1825 -38 -134 2839 4766
7556 4766 -560 1941 5611 9524 10856 11950 10397 3413 7567 7708 4497 5413 8727 4874 14214
7541 14214 15220 10608 574 -4314 -2239 -5353 -5475 -6035 -5597 -1130 -2438 -5232 -6075 -6714 -9437 -10762
7525 -10762 -9198 -10109 -6941 -2200 -5212 -1828 5625 12108 6587 4568 4779 309 5438 7550 -1030
7510 -1030 -1846 -5543 -9315 -9240 -9557 -4916 -1306 -1882 2805 10586 12966 -58 -8234 -866 8403 9811
7494I811P080M083J771J284o910l294j1164m809L718M041O874M372o846p249k518
7479B44L25M628j400n176J283n549J361J16P021m228p441J739M120n13N330R13
7463B773k213k893j444P076R477O656N918N594o72m851q696r627n362q561J519
7448e306L247l052k538K918j600N543K525j326m168l521L343J486l020J975J058
7433b436k362K725k007j0079J448O861J831l165k664M760P784K978N667K93M652
7418A6286n093j0807j779J0375J477k677o437L629J86r993q060P406O152o079
7404e414J416n7R5m630J032L72o198N481Q983l280k274J492k617j347K474M71
7388d001q155p96J994M768M39N690L118J676k535n963l752J634k986q58R640L975
$$ plain form
7494 9811 16891 20974 22745 24029 17119 13825 2661 -2148 1570 5611 12485 16857 10011 2762 244
7479 244 569 5197 3797 -1379 -96 -5645 -4284 -4168 2853 -1375 -8816 -7077 -2957 -3470 1860 2773
7463 2773 560 -2333 -3777 3299 12776 19432 25350 30944 30272 25421 16725 7098 1736 -6825 -5306
7448 -5306 -2059 -5111 -7649 -4731 -6331 -788 1737 411 -3757 -7278 -3935 -2449 -5469 -3494 -2436
7433 -2436 -4798 -2073 -4080 -14159 -12711 -5850 -4019 -7184 -9848 -5088 2696 5674 11341 11634 16286
7418 16286 11193 386 -1393 8982 10459 7782 1345 4974 5160 -4833 -12893 -5487 665 -5414
7404 -5414 -3998 -4055 -3960 -8590 -7558 -7186 -13384 -7903 1080 -2200 -4474 -2982 -5599 -6946 -4472 -4001
7388 -4001 -12156 -12952 -10958 -6190 -5751 -61 3057 4733 2198 -3765 -7517 -5883 -8869 -9727 -87 3888
7372C888n979k429j077N604N963J676n962l18J879k59n534l912n25k761M159K585
7356c002J645M86k526J357P91K810Q062k717o538k37M8o59J512m566o634Q19O053
7339c296K594O6o36k74q541Q59N334K172L342K451k210q191j740K726L870O32
7323h42m684r239P47P958J176O32L80m208R67J0524L150q260L20J434K457m301
7307a789o921o744q54M153L723J254k018K286J3410J917j887P59m057r989L32
7292f425N9K077k362P28J680k308J387J1080L188o93j994m624N416J512j307l279
7276D135l228k567q473K057P675O780l65p283j529M030n014k191L949k25K248
7261ak881J35J045l187j516p94L144J98J648J355K50n40j813J082j851M247j19
$$ plain form
7372 3888 -2091 -4520 -5597 7 5970 7646 1684 1366 3245 2986 -2548 -6460 -6985 -9746 -5587 -3002
7356 -3002 -1357 -871 -3397 -2040 -1249 1561 9623 6906 368 131 179 -480 1032 -3534 -10168 -9349 -3296
7339 -3296 -702 -636 -1272 -1546 -10087 -9228 -3894 -1722 1620 4071 1861 -6330 -8070 -5344 -1474 -842
7323 -842 -5526 -14765 -14018 -6060 -4884 -4252 -3872 -8080 -7113 3411 6561 -1699 -1379 55 2512 -1789
7307 -1789 -8710 -15454 -16308 -12155 -8432 -7178 -9196 -6910 6500 8417 6530 7289 3232 -6757 -6425
7292 -6425 -6366 -4289 -6651 -5923 -4243 -6551 -5164 5916 9104 8411 6417 1793 7209 8721 7414 4135
7276 4135 907 -1660 -10133 -8076 -401 6379 6014 -1269 -2798 1232 -3782 -5973 -2024 -2249 -1
7261 -1 -2882 -2747 -1702 -4889 -6405 -7199 -4055 -3857 -2209 -854 -604 -1144 -2957 -1875 -3726 521 402
7244D02j492R32m49J387N458J311l123m702M16l92j152j871M497K199m289n936
7228f804r25k506N052K83J425N463j646L08k77K171k736j813L735q84k141m310
7212e605j961O70P86p90M23J558P97n017j391P351M003k471j559M358N327L472
7196I951m225m118n46M930k358l785O67Q320P68k870l298j422K897K497Q23L98
7180H629n688r406J554J505J725K334M261K900k692K960P957o341k200N556l575
7165I479j1017n281n732O42J305J154O34J291O330k870m387j544M367N402k927
7150c154j843M09K602L776M61K560k1J682j705o779K272K572m478J277K600p620
7134e389J414P349M842n644m38l789k575j402j296N152K996l253m6Q72O927Q24
$$ plain form
7244 402 -1090 -158 -607 780 6238 7549 4426 -276 140 -252 -1404 -3275 1222 3421 -868 -6804
7228 -6804 -7729 -10235 -5183 -4900 -3475 1988 342 650 373 2544 -192 -2005 1730 846 -1295 -5605
7212 -5605 -7566 -6896 -6110 -6900 -6477 -4919 -4122 -9139 -10530 -3179 824 -1647 -3206 1152 6479 9951
7196 9951 5726 1608 1062 5992 3634 -151 516 8836 9604 6734 3436 2014 4911 7408 8231 8629
7180 8629 2941 -6465 -4911 -3406 -1681 653 4914 7814 5122 8082 16039 9698 7498 13054 9479
7165 9479 -1538 -6819 -12551 -11909 -10604 -9450 -8816 -7525 -1195 -4065 -8452 -9996 -5629 -227 -3154
7150 -3154 -4997 -4588 -1986 1790 2251 4811 4790 6472 4767 -2012 260 2832 -1646 -369 2231 -5389
7134 -5389 -3975 3374 8216 2572 2134 -1655 -4230 -5632 -6928 -1776 1220 -2033 -2079 -1207 5720 6544
7118F544p644p601j225L184N802N401J072l599O72N083J291l85m418l550O948
7103G575j430q961L103M429K054m783l234Q08J273J054M157L501n652p220Q59
7088b467K718L398M458j138m953p534k105P581K19L292l365p148M509M609m241
7073b167n747o187K626L216O122r3j0149K082R196J638j967k103p27k936m034
7058a1230m849l964K344K745k569r334n608N570P290M815P945J0294L599k836
7044D212j069j223L243L264l733j076M23j892k745j456m499N46J838L200m28k588
7028c983j626K265M369l071l082L335L942M734J0229K016k057o176m876m094Q40
7013B765O599R04q04k042J336k75l660l884M055O088r296j525O739k043l085n963
$$ plain form
7118 6544 -1100 -8701 -9926 -6742 -940 4461 5533 1934 2606 7689 8980 8595 4177 627 7575
7103 7575 6145 -2816 287 4716 6770 1987 -1247 -439 834 1888 6045 9546 3894 -3326 -2467
7088 -2467 251 3649 8107 6969 2016 -5518 -7623 -42 177 3469 104 -7044 -2535 2074 -2167
7073 -2167 -7914 -14101 -11475 -8259 -2137 -2230 -12379 -10297 -1101 537 -1430 -3533 -4260 -7196 -11230
7058 -11230 -16079 -20043 -17699 -14954 -17523 -26857 -32465 -26895 -19605 -14790 -6845 3449 7048 4212
7044 4212 3143 1920 5163 8427 4694 3618 4041 2149 -596 -2052 -6551 -6005 -4167 -967 -1395 -3983
7028 -3983 -5609 -3344 1025 -2046 -5128 -1793 2149 6883 17112 19128 17071 10895 6019 1925 2765
7013 2765 9364 10268 9464 7422 8758 8483 4823 939 4994 11082 1786 261 7000 4957 1872 -4091
6997d091l137K149J1788m673m842l151K071j329N719L650k688K387L45o50m59
6982C089k248K774N60j886j985k515N87m3j335K911N95K90K686N846M528J669
6966A5523o088R079J271k615p774o443l754l125K064j885K934M231J978q184n802
6951h590O8j663L598K343n271j425N614N510l407k063N94M683r92j730J533O00
6935e98k563n98K15m992L382m25N072M263K282j257o375L170M43K569n870j226
6919b508N143l101l431P87j67j347K8K925L000K643O00l657n1o60Q15J629j74
6902B474J578k61o236m812J731P400M831L586k466k158M620L173l720o583N995
6887I152O342j0168n405m49k213L340j739L929N413j308l480l468m4l496R72r01
$$ plain form
6997 -4091 -7228 -5079 6709 2036 -2806 -5957 -3886 -5215 504 4154 1466 3853 4198 3548 3089
6982 3089 841 3615 4175 2289 304 -2211 -1624 -1667 -3002 -91 504 794 3480 9326 13854 15523
6966 15523 9435 18514 19785 17170 9396 2953 -801 -3926 -1862 -3747 -813 3418 5396 -2788 -8590
6951 -8590 -8522 -10185 -6587 -4244 -9515 -10940 -5326 184 -3223 -5286 -4692 -9 -1001 -2731 -1198 -598
6935 -598 -3161 -3759 -3544 -8536 -5154 -5579 -507 3756 6038 4781 -1594 1576 2019 4588 -1282 -2508
6919 -2508 2635 -466 -3897 -3110 -3277 -4624 -4596 -1671 1329 3972 4572 915 864 204 1019 2648 2474
6902 2474 4052 3791 -2445 -7257 -5526 1874 6705 10291 7825 5667 10287 13460 9740 3157 9152
6887 9152 15494 5326 -79 -528 -2741 599 -1140 2789 8202 6894 3414 -54 -98 -3594 -2622 -3523
6871c523J089J499K028J554n537m817J328K63M4J1119o590j790m829K99k034M987
6855d910Q481M766j956j680K327J866q614q994L513O755Q820M963m853r28J220
6840A0776n874m566N012j31j0687N684j53p616q296P023M590K094m045m172l209
6825a3570N507P300k759j689o065L29L652P604K028m880m924O243Q069M266k953
6810H158o675l093M838L423j562n284M19p70j574k007K159Q92o358j692L000j860
6794g986o61P033K583r563K795J2373L130J342k156k667m464R22J657j320l071
6779e3J662l571K814K960M94K60M040J941j646j830r21J352m472j811l184j35
6763b100j080j554K804k55L055N018o381no684k400L005J401K005k118m087L71
$$ plain form
6871 -3523 -2434 -935 1093 2647 -2890 -7707 -6379 -6116 -6072 5047 -1543 -3333 -8162 -7863 -9897 -4910
6855 -4910 3571 8337 6381 4701 7028 8894 280 -8714 -5201 1554 10374 15337 10484 9556 10776
6840 10776 4902 336 5348 5217 -5470 214 61 -7555 -15851 -8828 -4238 -2144 -6189 -10361 -13570
6825 -13570 -8063 -763 -3522 -5211 -11276 -10947 -7295 309 2337 -2543 -7467 -1224 6845 11111 8158
6810 8158 1483 -1610 3228 6651 5089 -195 224 -546 -2120 -4127 -1968 -1076 -7434 -9126 -6126 -7986
6794 -7986 -8647 -1614 969 -8594 -5799 6574 9704 11046 8890 6223 1759 2681 4338 3018 -53
6779 -53 1609 -1962 852 3812 4306 4566 8606 10547 8901 7071 6150 7502 3030 1219 -1965 -2100
6763 -2100 -3180 -4734 -1930 -2185 870 5888 -493 -498 -7182 -9582 -6577 -5176 -3171 -5289 -9376 -9005
6747i005L256L854K419J265m178j585p66Q3j657K32o85j271N899l636l48L865
6731b258J241r368l136R409o73m635O144N903j480O35o664m28l321j30P794K979
6715B012K65K465O701M179m406k160k125n04q97j973N16r454l988P766J5k309
6699c897l453N738M448l590j577P976R965M057N00J860N419K603m139k131n984
6684A7795r798k109O509L006o020p864l029j840O254N880K225o646n54j814p269
6669e274J738k305r873m050L471L727M665P92L710r78K634K651l604P72L645L676
6653E397n055k049L662j789k290P022p27l754l317p1N82o85N020j77j526l765
6637c522P87M87j530P756J494k997K140q66m242m733K616M80J399J604M674N37
$$ plain form
6747 -9005 -5749 -1895 524 1789 -2389 -3974 -4740 -4657 -6314 -6082 -6767 -8038 -2139 -5775 -6123 -2258
6731 -2258 -1017 -10385 -13521 -4112 -4785 -9420 -3276 2627 1147 1782 -4882 -5310 -8631 -8761 -967 2012
6715 2012 2277 4742 11443 15622 11216 9056 6931 6427 5530 3557 4073 -5381 -9369 -1603 -1588 -3897
6699 -3897 -7350 -1612 2836 -754 -2331 5645 15610 19667 20167 22027 27446 30049 25910 23779 17795
6684 17795 7997 5888 12397 15403 9383 1519 -1510 -3350 2904 8784 11009 4363 3809 1995 -5274
6669 -5274 -3536 -5841 -15714 -19764 -16293 -12566 -7901 -7109 -3399 -4377 -1743 908 -2696 -1924 1721 5397
6653 5397 342 -1707 1955 166 -2124 4898 4171 417 -2900 -2971 -2389 -3074 1946 1769 243 -3522
6637 -3522 -2735 -2248 -3778 3978 5472 2475 4615 3749 -493 -5226 -2610 -2130 -731 873 5547 6084
6621F084J036O297o136l255l33n225n66P031L557j782K712p424p704k693j123
6606i524N848R28j515m144r01M761N643K608l058l679O66J227J257k994j760k532
6590g169k022J860m7k290M67n887l70R191q76N08N475J417L715q121o002O615
6574c536O143K242m507o926k52n45m786l877Q097O17N62J786K681M917n763m502
6558g649p06O360O870k39r670p964K307J972N5K198J86o593j845N987J0794J821
6542C884o445r248J118p6J84L621Q624j356m976N550P563R04R88o925j155q2o895
6525d722r09m484K755l55K835J670j387J733m010P26R256L606o618q60n300J775
6509d289O686p843l357P355L04o298m362j773J152J263L733P32m52L566K753k342
$$ plain form
6621 6084 7120 13417 7281 4026 3693 -1532 -2098 4933 8490 6708 9420 1996 -5708 -8401 -9524
6606 -9524 -3676 -2748 -4263 -8407 -9308 -4547 1096 3704 646 -3033 -2367 -1140 117 -2877 -4637 -7169
6590 -7169 -9191 -7331 -7378 -9668 -9201 -15088 -15458 -6267 -7143 -6635 -1160 257 3972 -4149 -10151 -3536
6574 -3536 2607 4849 342 -6584 -6836 -7381 -12167 -16044 -7947 -7330 -6768 -4982 -2301 2616 -3147 -7649
6558 -7649 -8355 -1995 4875 4636 -5034 -12998 -10691 -8719 -8664 -6466 -6280 -12873 -14718 -8731 2063 3884
6542 3884 -2561 -11809 -10691 -10767 -10583 -6962 1662 306 -4670 880 8443 9347 10335 3410 2255 2173 -4722
6525 -4722 -5631 -10115 -7360 -7715 -4880 -3210 -4597 -2864 -6874 -6148 3108 6714 96 -764 -6064 -4289
6509 -4289 2397 -5446 -8803 -1448 -1144 -7442 -11804 -13577 -12425 -11162 -7429 -6697 -7149 -3583 -830 -3172
6493c172k023n89N828M084j502O778p367m505n378m343L368L71l953N557O434
6478d12J531q326m441J471l405N094J685j491p96J601M511O939J775J922k934
6463D724r019l3k78p486l458N238Q278J208q124o56n121o309M745M929J774j652
6447a1240m147M749k404O569K849M403N30Q73N986M399M182J220n668k001r1l424
6431F785j152l293m091n257l160K935J906K464P033L978k026m634m799N47j867
6416d631r66N379l601k877K73O730K610k631L872l905p076l32J79J487m78J366
6400d601j223m187k119R08J656O021R111m415m762n038j006J181P419J854N319
6385F118n287r485m13P232K908J508P1n436J130K83o78l6n886J427N210k855n142
$$ plain form
6493 -3172 -5195 -5784 44 4128 2626 9404 2037 -2468 -7846 -12189 -8821 -8450 -12403 -6846 -412
6478 -412 1119 -7207 -11648 -10177 -13582 -8488 -6803 -8294 -9090 -7489 -2978 3961 5736 7658 4724
6463 4724 -4295 -4328 -4606 -12092 -15550 -10312 -2034 -826 -8950 -9606 -14727 -21036 -16291 -11362 -9588 -11240
6447 -11240 -15387 -10638 -13042 -6473 -3624 779 1309 2182 8168 12567 16749 17969 12301 10300 10209 6785
6431 6785 5633 2340 -1751 -7008 -10168 -7233 -5327 -2863 4170 8148 6122 1488 -3311 -2764 -4631
6416 -4631 -5597 -218 -3819 -6696 -6423 307 2917 286 4158 253 -6823 -7155 -6976 -5489 -5967 -4601
6400 -4601 -5824 -10011 -12130 -11222 -9566 -3545 5566 1151 -3611 -8649 -9655 -8474 -1055 799 6118
6385 6118 831 -8654 -9067 -1835 1073 2581 2652 -2784 -1654 -1371 -2049 -2085 -7971 -6544 -1334 -4189 -9331
6368i331P28m64k068P296J90M169O19j1744r292M129O890J865J534N765M937j541
6352C682l902j10j257n870l2O542p20J918M694j391k424L42K567j146n137l431
6336e675k24O063J16k762j233q93l121j459j789k859Q82J023j8q341M005J0771
6320e514N260m357J277J891M858O39K224l724P55m238M31j465K140k784j063L691
6304B1K693Q07L220L74j862l363K196L292O93o830K593N434j129n382J354o016
6288a905l338K666J0485k035n517l680r99j799m303r95P081j144l158K160K283
6273d198K602j656N171o77j036n921M5L683K334k282l687o099N084M679O40k417
6257c735j524K396M593O140J565k361P82m948o525K79L927J983n270l749m224
$$ plain form
6368 -9331 -8603 -9067 -11135 -3839 -3649 520 1139 -10605 -19897 -15768 -8878 -7013 -5479 286 5223 3682
6352 3682 -220 -330 -1587 -7457 -7489 -947 -1667 251 4945 3554 1130 1472 4039 2893 -2244 -5675
6336 -5675 -5899 164 280 -2482 -3715 -4608 -7729 -9188 -10977 -13836 -12954 -11931 -11949 -20290 -16285 -5514
6320 -5514 -254 -4611 -3334 -1443 3415 4054 6278 2554 3309 -929 -498 -1963 177 -2607 -3670 21
6304 21 2714 3521 6741 7115 5253 1890 4086 7378 8071 1241 3834 9268 8139 2757 4111 -1905
6288 -1905 -5243 -2577 7908 5873 356 -3324 -4323 -6122 -10425 -11420 -4339 -5483 -8641 -6481 -4198
6273 -4198 -1596 -3252 1919 1242 206 -5715 -5670 -1987 347 -1935 -5622 -11721 -6637 -1958 -1318 -3735
6257 -3735 -5259 -2863 1730 7870 9435 7074 7856 2908 -3617 -3338 589 2572 -2698 -6447 -10671
6242a0671N172j28L313l091p423P89L529L31N311M754j358K053O086M859m246
6227I280r898k701K162n522r607j251Q960P369o497m827L667N086m367O404N694
6212C952m08l939m100j0322J0377N389m185l588l113n171N353K786j682l786J766
6197a0671J911j677J849K897N7L28n339j879n807N52J1686K498k884q61L446N223
6181A329L764k082p776o36L249L195n46l037j427l291j599L537O417j181l388
6166c472L68L792J24K466l229r41M416O703J305J409r239m905j096k756K081j24
6150c098j570j743L101k692o318J451J949k77L253N118N235j553k441n554N904
6135G65m547l298J242k094J712l133m039k486j424k470L648L258Q714j48K519
$$ plain form
6242 -10671 -5499 -5627 -2314 -5405 -12828 -12039 -8510 -8179 -2868 1886 528 2581 8667 13526 9280
6227 9280 -618 -3319 -1157 -6679 -16286 -17537 -8577 -1208 -7705 -12532 -8865 -3779 -8146 -1742 3952
6212 3952 3544 -395 -4495 -14817 -4440 949 -3236 -6824 -9937 -15108 -9755 -6969 -8651 -12437 -10671
6197 -10671 -8760 -10437 -8588 -5691 -5634 -5306 -10645 -12524 -18331 -17779 -6093 -3595 -6479 -7340 -3894 1329
6181 1329 5093 3011 -4765 -5401 -2152 1043 497 -2540 -3967 -7258 -8857 -5320 1097 -84 -3472
6166 -3472 -3104 688 812 3278 49 -892 3524 10227 11532 12941 3702 -1203 -2299 -5055 -2974 -3098
6150 -3098 -4668 -6411 -3310 -6002 -12320 -10869 -8920 -9197 -5944 -826 4409 2856 415 -5139 765
6135 765 -3782 -7080 -5838 -7932 -6220 -9353 -13392 -15878 -17302 -19772 -16124 -12866 -4152 -4300 -1781
6120a781L938J141k41L613j47l963p38K209N635l963k69m23K451j199m522l671
6104a930K159J020M69K972l518l298r67K547J815n203q184L953K689r78O155M187
6088C888L58j175k304n713n806N629L224p2m152k67n465l86L411J270k435J685
6072h310K619O025k536j041K876L551M637n050o696o247P509P375l385p387m754
6057a0814L538n87r29N5o737l301M102M187Q264K007o874j372N900O665J492l662
6041A934m094j310j546K421m79N983K469o547k403J869m567k66j17p86j817k274
6025a1530J594M89L595K841k7l164J864Q158O986o73k148j262l480L166P855L729
6009A7993m252j1678j3611J026J986p31L392M408M908M91J592k018j490j314L322
$$ plain form
6120 -1781 2157 3298 3057 6670 6523 2560 1822 4031 9666 5703 5434 5011 7462 6263 1741 -1930
6104 -1930 229 1249 1718 4690 1172 -2126 -3093 -546 1269 -3934 -12118 -8165 -5476 -6454 -299 3888
6088 3888 4246 3071 767 -4946 -10752 -5123 -1899 -1971 -6123 -6390 -11855 -12241 -8830 -7560 -9995 -8310
6072 -8310 -5691 334 -2202 -3243 -367 3184 7821 2771 -3925 -10172 -2663 4712 1327 -6060 -10814
6057 -10814 -7276 -7863 -8792 -8737 -15474 -18775 -14673 -10486 -2222 -215 -7089 -8461 -2561 4104 5596 1934
6041 1934 -2160 -3470 -5016 -2595 -3074 2909 5378 -1169 -3572 -1703 -6270 -6536 -6653 -7439 -9256 -11530
6025 -11530 -9936 -9447 -5852 -3011 -3038 -6202 -4338 3820 10806 10133 7985 6723 3243 6409 14264 17993
6009 17993 13741 2063 -11548 -10522 -8536 -9267 -5875 -1467 3441 3932 5524 3506 2016 702 4024
5994D024R01j785J580j244L80o70L813Q24q884K775k04M603O117o190k345o567
5978b872o947L273O964m53J640l949M095l431m569M264R355R74j576k583K030
5963F215J589l858p392j385P082j271p605p892L601O945K127L951l147p241k607
5948a0888K761m025p84O173J037o58k547O898L053k099k950K57m509M488N113
5933A320M555n250J547O08L187j832o833L427j560p531K988R045M569K040P03
5918A0983j134n58k28L54j2774m493J04N743K654k97n278k38J544j621n017k278
5902a2534m928J749m161j70O005P014L15n236J587M536L274k87L083j263p53N957
5886D188K95K133l80k19q180m745O966J038j0202n391R609P140M922j0437l189
$$ plain form
5994 4024 4925 3140 4720 3476 3856 3186 6999 7823 -1061 1714 1510 6113 12230 6040 3695 -2872
5978 -2872 -9819 -6546 418 -35 1605 -2344 1751 -1680 -6249 -1985 7370 8344 6768 4185 6215
5963 6215 7804 3946 -3446 -4831 2251 980 -6625 -14517 -10916 -3971 -1844 2107 -1040 -8281 -10888
5948 -10888 -8127 -12152 -12936 -6763 -5726 -6384 -8931 -2033 1020 -1079 -4029 -3772 -8281 -3793 1320
5933 1320 5875 625 2172 2780 5967 4135 -2698 729 -831 -8362 -5374 3671 8240 10280 10983
5918 10983 9849 9291 9063 9417 -3357 -7850 -7746 -2003 651 354 -4924 -5162 -3618 -5239 -10256 -12534
5902 -12534 -17462 -15713 -19874 -20044 -14039 -7025 -6710 -11946 -10359 -5823 -2549 -2836 247 -1016 -1769 4188
5886 4188 4483 6616 6236 6017 -2163 -6908 58 1096 -9106 -14497 -4888 2252 7174 -3263 -6452
5871f452J020r15P32n66l587M232J260J606n465k684L540j81P979N806r02k65
5855E158j447R59k319k610K707k756J361j834N282M230j104n862j451K555j578
5840A291l397J69M555l239J125m2p60J025k462m41N31q030L24k359J533K967j080
5823h290P60K436L696L541k319J930K77k861J475P026N418K487m210k094p61K442
5807A0953K950j514k028o696q400m053P031P838J255n857M68M069J227M739l949
5792H033p658n308J674M576L408k092k342M386p457o403k670L774J813N251Q078
5777G063l180m682R84M861j041l668J656j076k987m145m5L473P401J039K6m850
5761H29n857m332o02K683l187k841N185M568K32o487l327L829Q01J984k196M501
$$ plain form
5871 -6452 -5432 -6347 -5615 -6181 -9768 -5536 -4276 -2670 -8135 -10819 -7279 -7460 519 6325 5423 5158
5855 5158 3711 4670 2351 -259 2448 -308 1053 -781 4501 8731 7627 1765 314 2869 1291
5840 1291 -2106 -1937 2618 -621 504 462 -298 727 -1735 -2176 -1645 -9675 -9351 -11710 -10177 -7210 -8290
5823 -8290 -7530 -5094 -1398 2143 -176 1754 2031 -830 645 7671 13089 15576 11366 9272 8511 10953
5807 10953 13903 12389 10361 3665 -4735 -8788 -1757 6081 7336 1479 1947 6016 7243 11982 8033
5792 8033 375 -4933 -3259 1317 4725 2633 291 4677 -2780 -9183 -11853 -8079 -6266 -1015 7063
5777 7063 3883 -799 185 5046 4005 337 1993 917 -2070 -6215 -6260 -2787 4614 5653 5679 829
5761 829 -5028 -9360 -9962 -7279 -10466 -13307 -8122 -3554 -3322 -9809 -13136 -9307 -8506 -6522 -8718 -4217
5745d217N004k106j863M929J541l405J357M582m017j426m295l260R565P944K762
5730A3095j339k880p506m202K540M041k539R060l127j1603K329J828N81M439O72
5715E389o965J402j557j471M335M777R30l412q159o491M336K175L519L427p831
5700e596k064P50J185P122m708K817O692l439k812k221Q06o291j2602L515R687
5685g159O835K582m530k495K733M08N668L402K437p577j616m242m08o094n420
5670a5476M437K690L674L345j733L091p017k569L870L857N410o010m465k088n140
5655a4124P580L618K55J351K559l207J350M007k314J557o645j807K062J555k676
5640d879J682K847j933k665k599O179N581o647K086o00K852k144l455J867K202
$$ plain form
5745 -4217 787 -1319 -3182 1747 3288 -117 1240 5822 1805 379 -3916 -7176 2389 10333 13095
5730 13095 11756 8876 1370 -2832 -292 3749 1210 10270 7143 -4460 -2131 -303 278 4717 5389
5715 5389 -1576 -174 -1731 -3202 1133 5910 6840 3428 -4731 -11222 -6886 -4711 -1192 2235 -5596
5700 -5596 -7660 -6910 -5725 1397 -3311 -494 6198 2759 -53 -2274 -1468 -7759 -20361 -16846 -7159
5685 -7159 -324 2258 -2272 -4767 -2034 -1626 4042 7444 9881 2304 688 -3554 -3962 -10056 -15476
5670 -15476 -11039 -8349 -4675 -1330 -3063 28 -6989 -9558 -5688 -1831 3579 -2431 -6896 -8984 -14124
5655 -14124 -6544 -2926 -2671 -1320 1239 -1968 -618 3389 1075 2632 -4013 -5820 -3758 -2203 -4879
5640 -4879 -3197 -350 -2283 -4948 -7547 -1368 4213 -2434 -348 -948 1904 -240 -3695 -1828 374
5625C74K290J100k933p02o58J38L783O099K1o218m744N321P539n139o239o33k325
5608b926L296O209N465n08J970j739R59J573o298j977K842l102n868m92M972j058
5592C318K113k822l648M488R33N198k427m420L50o11J432k353J36M30q64j338
5576h5K813k703K752N660l039m890J440K487J595q60m53l533n033l08o259m306
5560a4722L983N259k085k586m26J4393J3332m55o895N50p139n801O68m217j751
5545g892k416l310N875P338K878j3839J463j31O897M683L259L669j140j0333k71
5530c270M588l036q71L45K35M10o099k277j287P16M273J486j993l435J94O402
5514c619l321K903L623l741p1L467K080n894n653R721k773l113J3737P473p415
$$ plain form
5625 374 2664 3764 831 129 -529 -391 3392 9491 9512 3294 -1450 3871 11410 6271 32 -601 -2926
5608 -2926 370 6579 12044 11536 13506 11767 12726 14299 8001 6024 8866 5764 -104 -596 4376 3318
5592 3318 5431 2609 -1039 3449 4382 9580 7153 2733 3083 2472 3904 1551 1687 2117 1253 -85
5576 -85 2728 25 2777 8437 5398 508 1948 4435 6030 5170 4717 1184 -3849 -4157 -10416 -14722
5560 -14722 -10739 -5480 -7565 -10151 -10577 3816 17148 16693 9798 10348 3209 -2592 -1924 -6141 -7892
5545 -7892 -10308 -13618 -7743 -405 2473 -11366 -9903 -10034 -3137 1546 4805 8474 7334 -2999 -3270
5530 -3270 1318 -1718 -2589 -2244 -2009 -1599 -7698 -9975 -11262 -10546 -6273 -4787 -6780 -10215 -10021 -3619
5514 -3619 -6940 -4037 -414 -4155 -4226 -759 1321 -4573 -10226 -505 -3278 -6391 7346 14819 7404
5499G404o146L661o904l877K337O738K545m438n308r417K861N710K092p858m080
5484a4680J364J559N982M745O123K093o81N385L896n393r532P8J459k784J101
5469G15j803l679k029j262K269P33N520K234j207l498k098J543p010n014M109
5454a0477K266R84R73Q59K971p08R46K7r15K058J834K940m806j925r94j092m892
5437i951K431k278k193N20L982r25j539N720J0889J884l650n907k889p95L374
5422a327j610l044J673J105m07K58o974J637K664l263j651N626P590M899r379
5407b203J678j829p318j559N032O682p97o061Q673N628o89l78J054l19o310j576
5391b92N5n687n218Q662N253R99k718m310j766J070O76r11l195p125O488J2027
$$ plain form
5499 7404 1258 4919 -1985 -5862 -3525 3213 5758 1320 -3988 -13405 -10544 -4834 -2742 -10600 -14680
5484 -14680 -13316 -11757 -5775 -1030 5093 7186 6505 11890 15786 10393 861 939 2398 -386 715
5469 715 -1088 -4767 -6796 -8058 -5789 -5056 464 2698 1491 -2007 -4105 -2562 -9572 -14586 -10477
5454 -10477 -8211 -7227 -6254 -5395 -2424 -3132 -2186 -2159 -3074 -1016 818 3758 -1048 -2973 -3967 -5059 -9951
5437 -9951 -7520 -9798 -11991 -11471 -7489 -8414 -9953 -4233 6656 8540 4890 -1017 -3906 -4701 -1327
5422 -1327 -2937 -5981 -4308 -3203 -3610 -3352 -10326 -8689 -6025 -9288 -10939 -5313 2277 7176 -2203
5407 -2203 -525 -2354 -9672 -11231 -6199 483 -314 -6375 2298 7926 7237 6859 7913 7594 1284 -292
5391 -292 -237 -5924 -11142 -2480 2773 3772 1054 -3256 -5022 -3952 -3276 -4187 -7382 -14507 -8019 4008
5375D008N005o331k610K11o792M4J743L717Q83k4l913l621O16L733M735L070J744
5358F218p631m374n971j536L540J2601M330l690l227l163O065j027n803L41K978
5343c49K697j181j157p84j856Q17N208L411r71m67K238l510k96n503k948N426
5327G75M653k509l245k187L17K975K684m981m496J053k985l535j742L121Q585
5312a517R30k350j147j420l237K444N194q21m63k752l222J068R512L250l078N937
5296H328l090m344j84J742l04n502q22P241k1o814j544o546M479n447p40j941
5280a5509j629J1524Q87o53N880J506J36K082j426l363N05K86K628K011l666q999
5264g800m475R993j744k834k99q50J37L786Q101k257p46Q07L230m641p842N728
$$ plain form
5375 4008 9013 2682 72 283 -6509 -6465 -4722 -1005 -122 -146 -4059 -7680 -7064 -3331 1404 4474 6218
5358 6218 -1413 -5787 -11758 -13294 -9754 2847 7177 3487 260 -2903 3162 2135 -3668 -3327 -349
5343 -349 2348 1167 10 -774 -2630 -1813 3395 6806 5835 5368 7606 4096 3800 -1703 -4651 775
5327 775 5428 2919 -326 -2513 -2196 779 3463 -1518 -6014 -4961 -7946 -11481 -13223 -10102 -1517
5312 -1517 -587 -2937 -4084 -5504 -8741 -6297 -1103 -1924 -2387 -5139 -8361 -7293 2219 5469 2391 8328
5296 8328 5238 894 710 2452 2148 -3354 -4176 3065 3044 -3770 -5314 -11860 -7381 -12828 -13568 -15509
5280 -15509 -17138 -5614 -4727 -5380 500 2006 2142 4224 2798 -565 -60 226 2854 4865 1199 -7800
5264 -7800 -12275 -2282 -4026 -6860 -7159 -8009 -7872 -4086 4015 1758 1012 1819 5049 408 -7434 -1706
5248a706L278L422L755K752m496l056K250n122j0912L062k666o819N061R312L288
5233A403l647k421J150Q3n732m463N233J1967M445m321J020n125j467J091j401
5218b185j179L044N228J459k347O622j196l790r108O11L335R105K184n251j884
5203D648N14K132o181p62m0P732j182m824J687N825N886l762o787l087k311m971
5187e483K369l25n13o418L369J537j344k290J135j132L383M37N562O08l654J641
5171a118M329M945m17m886o71L90r76N71k784n699j572k98L928J864q701L625
5155g470M592m61O07j425J387m117l854n324L170M384J140j365p527p98P482P969
5139a610l528J970L383M516O80o643j114Q705O12n72o99l067j86o761o475o31
$$ plain form
5248 -1706 1572 4994 8749 11501 7005 3949 6199 1077 -9835 -6773 -9439 -16258 -11197 -1885 1403
5233 1403 -2244 -4665 -3515 -3432 -9164 -13627 -8394 3573 8018 3697 4717 -408 -1875 -784 -2185
5218 -2185 -3364 -320 4908 6367 4020 10642 9446 5656 -3452 -2841 494 9599 11783 6532 4648
5203 4648 5162 7294 1113 351 311 8043 6861 2037 3724 9549 15435 11673 4886 1799 -512 -5483
5187 -5483 -3114 -3439 -3952 -10370 -7001 -5464 -6808 -9098 -7963 -9095 -5712 -5275 287 895 -2759 -1118
5171 -1118 3211 8156 7739 2853 2182 2572 1596 2167 -617 -6316 -7888 -8186 -4258 -2394 -11095 -7470
5155 -7470 -2878 -3339 -2732 -4157 -2770 -6887 -10741 -16065 -12895 -8511 -7371 -8736 -16263 -17061 -9579 -1610
5139 -1610 -5138 -3168 215 4731 5411 -1232 -2346 6359 6971 6399 5700 2633 2447 -4314 -10789 -11420
5123a1420j268j997L511R682K841j975n348Q4J695j110L397p104o610M53Q226
5108f943N268N524m191k708M20N354n171K219J527J093o10l892K063n912m265
5093a0224r86l05l610O834N276K411M332L1l278k719l229m075NJ631O593M255
5077B942k507j745O731n111j469k80m136J877O177O3m457k966l392l019K670J334
5061g288n507M306L763k98L23O558M162k430k242J274N259K275m099j1441o553
5046a1938J59Q02j189J501O075O35M816l29j095J52O78k62k374j525J743P74k353
5029c730j679J129L211J020J485Q54J790o882k73M121l862L09R176L814o256M82
5013D709k45K118l415r610j669K686l493K552J094M405J572J586J029q96M288
$$ plain form
5123 -11420 -12688 -14685 -11174 -1492 1349 -626 -5974 -5890 -4195 -5305 -1908 -9012 -15622 -15169 -6943
5108 -6943 -1675 3849 -342 -3050 -2630 2724 -2447 -228 1299 2392 1782 -2110 -47 -5959 -10224
5093 -10224 -11210 -11515 -15125 -8291 -3015 -604 3728 3759 481 -2238 -5467 -9542 -9537 -7906 -1313 2942
5077 2942 435 -1310 5421 310 -1159 -1439 -5575 -3698 2479 2542 -1915 -4881 -8273 -11292 -8622 -7288
5061 -7288 -12795 -8489 -4726 -5024 -4701 1857 6019 3589 1347 2621 7880 10155 6056 -5385 -11938
5046 -11938 -11779 -10977 -12166 -10665 -4590 -3955 861 532 -563 -411 267 5 -2369 -3894 -2151 -1377 -3730
5029 -3730 -5409 -4280 -1069 -49 1436 2290 4080 -2802 -3075 1046 -2816 -2507 6669 10483 4227 4709
5013 4709 4464 6582 3167 -6443 -8112 -5426 -8919 -6367 -5273 -868 704 2290 3319 2423 6711
4998F711p145l715O889P622m850K14m184n864J703J1037L685l196n377j3854j28
4983a0452N946L014L498M083L213Q69j3819j0363J615J1394L305l919o369l050
4969a1035N984L698J369r69r178P89J177Q198Q767o62K236o60J449m542r566o329
4953i274O680q10k791K868N429J62m131l060q691K652N377m798M203J081K558
4938b545K875K80M049K874n908n365K428k149k894L773N434j64M797m899q041
4923e455K476K143J698l803J754q69k354p495K460l344K90N017O582j167k760
4908d827k542M348K517K52J433J555J793N731o730J208K073j734O08j849J56J611
4892E603j21l830j515M627m187n295N187L849O941J422q531r232M036q731o403
$$ plain form
4998 6711 -434 -4149 2740 10362 5512 5726 1542 -4322 -2619 8418 12103 8907 3530 -10324 -10452
4983 -10452 -4506 -1492 2006 6089 9302 10171 -3648 -14011 -12396 -1002 2303 -1616 -7985 -11035
4969 -11035 -5051 -1353 16 -953 -10131 -9342 -8165 33 8800 8138 10374 9714 11163 6621 -2945 -9274
4953 -9274 -2594 -3404 -6195 -3327 2102 2264 -1867 -4927 -13618 -10966 -5589 -10387 -6184 -5103 -2545
4938 -2545 330 610 4659 7533 1625 -3740 -1312 -3461 -6355 -2582 2852 2688 7485 2586 -5455
4923 -5455 -2979 -836 862 -2941 -1187 -2056 -4410 -11905 -9445 -12789 -12499 -7482 -900 -2067 -4827
4908 -4827 -7369 -3021 -504 -252 1181 2736 4529 10260 3530 4738 6811 5077 5685 3836 3992 5603
4892 5603 5482 1652 137 4764 577 -4718 469 4318 11259 12681 4150 -5082 -1046 -9777 -16180
4877a6180O371P912O14k83j308o25m30l618k222N130L942L291Q41L774m599m612
4861b002M266n02j50O043m119q275j952o480n58Q53o4K147N020p48k654j492K64
4844a0403J751m25P634M618k876o364m954L255l881k391j544K115p142L091J0619
4829f897K923q653l589J886Q453J3216K546j374j947l641k987j448M897j37o367
4814c119l483m188O665j572j53j327K206l543j113J580J901P884O287m959N951
4799I017J603J379j538n426p671k227L628k176J93O934K26k541L505k275N546
4784H177n671l749o918K988Q081K610j570k830k790m958o423L454J3124P033l370
4769G188p651l874R24Q383l941j0098k10N311l199o344j286p32L26k83P320P558
$$ plain form
4877 -16180 -9809 -1897 -1283 -1566 -2874 -3499 -3929 -7547 -9769 -4639 -697 2594 3435 7209 2610 -2002
4861 -2002 2264 1762 1612 7655 3536 -4739 -6691 -13171 -13729 -12876 -12940 -10793 -5773 -6521 -9175 -10667 -10403
4844 -10403 -8652 -9077 -1443 3175 299 -6065 -11019 -7764 -11645 -14036 -15580 -13465 -20607 -17516 -6897
4829 -6897 -3974 -12627 -16216 -14330 -5877 7339 9885 8511 6564 2923 -64 -1512 3385 3248 -3119
4814 -3119 -6602 -10790 -4125 -5697 -5850 -7177 -4971 -8514 -9627 -8047 -6146 1738 8025 3066 9017
4799 9017 10620 11999 10461 5035 -2636 -4863 -1235 -3411 -3218 3716 3942 1401 4906 2631 8177
4784 8177 2506 -1243 -8161 -5173 2908 5518 3948 1118 -1672 -6630 -13053 -9599 3525 10558 7188
4769 7188 -463 -4337 -3413 4970 1029 -9069 -9279 -3968 -7167 -13511 -14797 -15529 -15203 -15486 -8166 -608
4753f08m719K523K465Q067O148l49j373n431n53J18k463m112M411n936n252k423
4737i487j3m95O262N963M403j853l998k939N748q22m698L646M414k093o950p95
4721c707J167m197N649L292l165j766J054P329n161j17q07K676n243p040n819
4706a5855k213P350L727K956k981k327K731P847j919m375P990L392m100n85N038
4691F676J36l810n334j813m547o77M509J413N218L440N352j1175k056J380n053
4676f341K275N771n33n939O001J0471n425p602K717n5J412K281R662n02q547m149
4660A497m825J45k393n054m589j058J468K948O053L957L89K782j802K444M255
4645F217m572j627l515p66N531M942m82k439j0129l627N008K872j326m815N699
$$ plain form
4753 -608 -5327 -2804 -339 7728 13876 13527 12154 6723 6170 6288 3825 -287 4124 -1812 -7064 -9487
4737 -9487 -9500 -9995 -3733 2230 6633 4780 782 -2157 3591 2769 -1929 1717 6131 4038 -2912 -3707
4721 -3707 -2540 -6737 -1088 2204 -961 -2727 -1673 5656 495 378 -429 2247 -2996 -10036 -15855
4706 -15855 -18068 -10718 -6991 -4035 -7016 -9343 -6612 1235 -684 -5059 2931 6323 2223 1638 6676
4691 6676 6812 3002 -2332 -4145 -8692 -9369 -4860 -3447 1771 5211 10563 -612 -2668 -1288 -6341
4676 -6341 -4066 1705 1172 -4767 1234 11705 6280 -1322 1395 1340 2752 5033 14695 14193 5646 1497
4660 1497 -3328 -3183 -5576 -10630 -15219 -16277 -14809 -11861 -5808 -1851 -1462 1320 -482 1962 6217
4645 6217 1645 18 -3497 -4263 1268 6210 5728 3289 -6840 -10467 -5459 -2587 -3913 -8728 -3029
4630c029N348J817m022n158q808l009k11K307J2532L130q78l494m201Q98P434
4615F56M10k563k672j136p257o590K788O871P226O041K231o670J29J331K758n966
4599b413l530j027n248K404k590O860m804K031O830k867K310P808N523j483j284
4584H520L76j792o729j0406m945l87M264j126j04N466l584k705m91k105K836J0179
4568b733L226J47M909K301p56l334j444R72j0080k955J964M6J978M167o27j665
4552c884r83K173P993r790j0365J976P232K480r28p95J0971J0264n45l020j44
4537A2635J55j524n860o635j973P678j82j521L704j117m727j34m809p243J03Q534
4521b916J748k258K610m621R43L835j695L052o383j137O714k16l894M847P499
$$ plain form
4630 -3029 2319 4136 114 -5044 -13852 -16861 -17072 -14765 -2233 897 19 -3475 -7676 -6778 656
4615 656 1066 -1497 -4169 -5305 -12562 -19152 -16364 -9493 -2267 3774 6005 -665 -536 795 3553 -2413
4599 -2413 -5943 -6970 -12218 -9814 -12404 -5544 -10348 -8317 -1487 -4354 -2044 5764 11287 9804 8520
4584 8520 8896 7104 375 -10031 -14976 -15363 -11099 -12225 -12329 -6863 -10447 -13152 -13643 -15748 -12912 -2733
4568 -2733 493 640 5549 7850 7094 3760 2316 3288 -6792 -9747 -7783 -7737 -5759 -1592 -2219 -3884
4552 -3884 -4867 -2694 5299 -4491 -14856 -12880 -5648 -3168 -4096 -4891 6080 16344 15799 12779 12635
4537 12635 12790 11266 5406 -1229 -3202 4476 4294 2773 6477 5360 633 499 -4310 -11553 -11450 -2916
4521 -2916 -1168 -3426 -816 -5437 -4494 -659 -2354 698 -5685 -6822 -108 -324 -4218 629 8128
4506H128J306k087K983M88J666K387M04l623r681O31Q62k031k336o865L221N836
4490A289J007k076L556P87l487j453k92k97o413J27L121n2k184j925k199q67K078
4473i280L206J583P244j47k549j034K679j466r51M131J425m58m878n314K940L695
4457H26l110l840M470J639k424R74J509M183l92L39r3J037n027l859m349j662
4441i779k62p21N710N646R9N532J382k085o451n776q75M797k174l493l652O874
4425e228J227o25K695R414J2090m58j2241q877k237M480j0587J773L089r01p519
4410a3905O22O17P35J556J446k320k413m201N542Q441L758j177k617o7M463J1328
4394A1808j660M56m799p67j096q31k758m513K221Q196J0602q842r244L2M30l122
$$ plain form
4506 8128 9434 7347 10330 10818 12484 14871 15275 11652 1971 2602 3464 1433 -903 -7768 -4547 1289
4490 1289 2296 220 3776 4563 1076 -377 -669 -966 -7379 -7252 -4131 -4183 -6367 -8292 -10491 -11358 -9280
4473 -9280 -6074 -4491 2753 2606 57 -977 1702 236 -715 3416 4841 4383 -495 -5809 -2869 826
4457 826 -2284 -6124 -1654 -15 -2439 -1465 44 4227 3835 4174 4081 5118 91 -3768 -8117 -9779
4441 -9779 -10041 -10762 -5052 594 693 6225 7607 5522 -929 -6705 -7580 -2783 -4957 -8450 -12102 -5228
4425 -5228 -4001 -4626 -1931 7483 19573 19115 6874 -2003 -4240 240 -10347 -8574 -5485 -6386 -13905
4410 -13905 -13283 -12666 -11931 -10375 -8929 -11249 -13662 -17863 -12321 -3880 -122 -1299 -3916 -3983 480 11808
4394 11808 10148 10604 5805 5038 3942 3111 353 -4160 -1939 6257 16859 8017 -1227 -1195 -765 -3887
4378c887J923O824L480j819l170L932K167p560m101J062p15p02l072P136P786
4363I284o59q430k624M091J670m626j123k46j777J317k016O508M821L770K47k462
4347G745l831J044K818J628J646J616j108l288J053L06m559l252K721j513m013
4332i87J623M752l677L171L177P94j221r358q113k818L513m51K710M623o26j1380
4316a4268o347L428J1220O342O286l767n402n581k913J562P572j2M63L796p49
4301A630q367J424M426m620M378o12p221Q53J46j509m792Q404R08m746q355M552
4285a3501R699K216M55j839j03J978J617j53q18R47j290j206k473o644K595P060
4269a460L001K398j871l408Q53r05J242m008j736k285l633J600l110l571j847
$$ plain form
4378 -3887 -1964 4860 8340 6521 3351 7283 9450 1890 -2211 -1149 -1864 -2566 -5638 1498 9284
4363 9284 8625 195 -2429 1662 3332 -1294 -2417 -2663 -4440 -3123 -5139 1369 6190 9960 10207 7745
4347 7745 3914 4958 7776 9404 11050 12666 11558 8270 9323 9629 5070 1818 4539 3026 -987
4332 -987 636 5388 1711 4882 8059 8853 7632 -1726 -9839 -12657 -9144 -9595 -6885 -2262 -2888 -14268
4316 -14268 -20615 -17187 -5967 375 6661 2894 -2508 -8089 -11002 -9440 -1868 -1880 -1417 2379 1630
4301 1630 -6737 -5313 -887 -5507 -1129 -1741 -8962 -8109 -7963 -9472 -14264 -5860 -4952 -9698 -18053 -13501
4285 -13501 -3802 -1586 -1131 -2970 -3073 -1095 522 369 -449 498 -792 -1998 -4471 -11115 -8520 -1460
4269 -1460 1541 3939 2068 -1340 -487 -1392 -150 -4158 -5894 -8179 -11812 -10212 -13322 -16893 -18740
4254a8740L065Q243P755M033j822o216j136K658K948N094K436l439l032N072L50
4239G269l60O15m349j790L053k880j0239L169J2539L789j0514n681m567J822R681
4224A557K136k772K95k697r00k401j076K825k173j056N053M753j476M724j040
4209E752J078N02N655J153l701o731K272O138p355j0517k595M397p25N83L887
4194b07L004n837L549j434r207m485J779L614J199L445J136L101L550j783k581
4179a157K60m603j113k250N006L130o513l873m232N658J2249n84n324K246K741
4164A641k824j092K417K856j524o705m881L181L613l049k677n22Q121O770j629
4149C696k753p017j538K227l325K326M446O344k518K3L239K818l878n676p592
$$ plain form
4254 -18740 -15675 -7432 323 4356 2534 -3682 -4818 -2160 788 5882 8318 4879 1847 6919 7269
4239 7269 6909 7524 3175 1385 4438 1558 -8681 -5512 7027 10816 302 -5379 -9946 -8124 1557
4224 1557 3693 921 1216 -1481 -2381 -4782 -5858 -3033 -5206 -6262 -1209 3544 2068 6792 5752
4209 5752 6830 7332 12987 14140 10439 3708 5980 12118 4763 -5754 -8349 -3952 -4677 -4094 -207
4194 -207 2797 -3040 509 -925 -10132 -14617 -12838 -9224 -8025 -4580 -3444 -343 3207 1424 -1157
4179 -1157 -897 -5500 -6613 -8863 -3857 -727 -7240 -11113 -15345 -9687 2562 1978 -3346 -1100 1641
4164 1641 -1183 -2275 142 2998 1474 -5231 -10112 -6931 -3318 -6367 -9044 -9566 -1445 5325 3696
4149 3696 943 -6074 -7612 -5385 -8710 -6384 -1938 4406 1888 1911 5150 7968 4090 -1586 -9178
4134i178O836J0650l039M225p171k102N156K661n049K718J573L086k368j924q327
4119b253p334q852n12Q962p95L172P590L85j129K908k562k170M206K130j775K49
4103B220J472l980K433J076K435M86O78o19q116M2R87Q26K366m590r22k076N810
4086E28J738j950O53n805K068L869K199j863M88j884p747J678J689j124L095P944
4070E576L368k069J101n62m689p873j293J495K92n502o777P999J4701M509k582
4055G694J001N3n396n328o971L15K237l385L232l988o2J439k563J656N550L541
4039i75n12n319n5m050J329N560M015K758m321o600r606q02K542M241J0700J3780
4023A2685m66n678o99k37p681n663J892L285j699J37m04j769J77k994M744P437
$$ plain form
4134 -9178 -2342 8308 5269 9494 2323 221 5377 8038 2989 5707 7280 10366 7998 6074 -2253
4119 -2253 -9587 -18439 -18951 -9989 -10784 -7612 -22 363 -766 2142 -420 -2590 1616 3746 1971 2220
4103 2220 3692 -288 2145 3221 5656 6142 6820 6201 -1915 -1873 -886 -60 2306 -2284 -3206 -5282 528
4086 528 2266 316 969 -4836 -2768 1101 3300 1437 1925 41 -7706 -6028 -4339 -5463 -2368 5576
4070 5576 8944 6875 7976 7414 2725 -5148 -6441 -4946 -4654 -10156 -16933 -8934 5767 10276 7694
4055 7694 8695 8748 3352 -1976 -8947 -8632 -6395 -9780 -6548 -10536 -10598 -9159 -11722 -10066 -4516 -975
4039 -975 -1487 -6806 -6861 -10911 -9582 -4022 -7 2751 -1570 -8170 -17776 -18578 -16036 -11795 -1095 12685
4023 12685 12219 6541 5842 5605 -2076 -7739 -5847 -2562 -4261 -4124 -4528 -6297 -6120 -9114 -4370 3067
4007C067L816m107q14k110L031j210J154M383l328m84J960P512j432p829j67j477
3991A965L300j379k929j941k687J279K099J539M796k87l791O60J556j784L763
3976F159k162o334j024k172K664M139K528n323q46l774o88o434L231L933m010
3961a0113l990P285O997m77J939Q6l240K112L694j085n909l345k781j552l26K51
3945a0454o44j410j247Q275O671N20J627M84o542l783n401N871M843n798K540
3930d448J3201Q43m515q554j743k192j547L014N938O264J124k400r084J302N151
3915B354K408Q54n25o839n655j627N561Q605l02K629J841L176m831J364L426J635
3899A4074j026R0Q77n735q976k882n96P186K97N43J410k443o272l755K091K447
$$ plain form
4007 3067 6883 2776 1962 -148 2883 1673 2827 7210 3882 3398 5358 12870 11438 3609 3442 1965
3991 1965 5265 3886 957 -984 -3671 -2392 -293 1246 6042 5755 1964 2624 4180 2396 6159
3976 6159 3997 -2337 -3361 -5533 -2869 1270 3798 -1525 -2371 -6145 -6833 -13267 -10036 -6103 -10113
3961 -10113 -14103 -6818 179 -298 1641 1727 -1513 599 4293 3208 -2701 -6046 -8827 -10379 -10705 -10454
3945 -10454 -11098 -12508 -13755 -5480 1191 1711 3338 3822 -2720 -6503 -11904 -6033 -1190 -6988 -4448
3930 -4448 8753 9596 5081 -3473 -5216 -7408 -8955 -5941 -3 6261 7385 4985 -4099 -2797 2354
3915 2354 4762 5616 5091 -1748 -7403 -9030 -3469 5136 4834 7463 9304 12480 7649 9013 12439 14074
3899 14074 13048 13138 14015 8280 -696 -3578 -4174 3012 3309 3852 5262 2819 -3453 -7208 -5117 -2670
3883b670L95l936K104L524k264o927j092O039L741L758j132J650r86M9J152j653
3867A752L238J136l058m602L80j142O95Q109M045L92j082K52j708o240l089j595
3851b517J813K123J6l724o978N99O759j227M220N822M989l876j171J853k998q872
3835c169m160P253J1024K526q844P97k61m619K828L947r320j0349l206R481M140
3820a932L093l223k642J102J822O506R71m560l409J40K910M524O26l333n43Q676
3804A0728m539p819j515K034L587k011k828j46J45J362l114j206K678K581O56
3789E93k101J114J0J220J356l725O571j734l665o52J042j283l95k618n342o447
3773a6056J2032J1545O61M09q068q070M072j665R5j473j563k800k482J218Q103
$$ plain form
3883 -2670 -2275 -6211 -4107 -583 -2847 -9774 -10866 -4827 -1086 2672 1540 3190 2204 2253 3405 1752
3867 1752 4990 6126 3068 -1534 -1154 -2296 -1601 6508 10553 10945 9863 10115 8407 2167 -922 -2517
3851 -2517 -704 1419 1435 -2289 -9267 -8668 -1909 -3136 1084 6906 11895 8019 6848 8701 5703 -3169
3835 -3169 -7329 -76 10948 13474 4630 5427 5166 547 3375 7322 -1998 -12347 -15553 -6072 -1932
3820 -1932 1161 -2062 -4704 -3602 -1780 4726 5697 1137 -2272 -2132 778 5302 5928 2595 2052 10728
3804 10728 6189 -1630 -3145 -1111 2476 465 -2363 -2509 -2364 -1002 -4116 -5322 -2644 -63 593
3789 593 -1508 -394 -384 836 2192 -1533 5038 3304 -361 -1013 29 -1254 -1649 -4267 -9609 -16056
3773 -16056 -4024 7521 8182 8591 523 -7547 -3475 -5140 -5045 -6518 -8081 -10881 -13363 -12145 -4042
3758d042q70O35k976J720o78K575K360P97p933M741L399M96N686l12r38o608q590
3741a0538k02K815N458L586p536j9m196N713P264l604o512n92J540m107K620L243
3725e067j703O277N68j0071k532M630L604J684J062j641J848m940k496l93M865
3710d305k313n109Q277L047K154k111J910P88l256j332l96K511J462O31K995N158
3694A0111k634m100q156k029L112K129n110j447J1223R599k960l514m015j445
3680G64O661J564l803o625n344Q537L424m282k526N046P18j419j967m63N946k16
3664F015m399p087o705O029j363j030J590J259M446N552l539J572m118m685P08
3649e755j828o43M343k056l67N221L324L507m944n616p406l014J521m005J387
$$ plain form
3758 -4042 -4912 -4277 -7253 -5533 -6211 -3636 -1276 -479 -8412 -3671 -272 224 5910 5598 4660 -1948 -10538
3741 -10538 -10740 -7925 -2467 1119 -6417 -6436 -10632 -4919 2345 -1259 -7771 -8363 -6823 -10930 -8310 -5067
3725 -5067 -6770 -493 75 -9996 -12528 -7898 -4294 -2610 -1548 -3189 -1341 -6281 -8777 -9170 -4305
3710 -4305 -6618 -11727 -3450 -403 1751 -360 1550 2338 -918 -2250 -2646 -135 1327 1958 4953 10111
3694 10111 7477 3377 -4779 -6808 -3696 -1567 -6677 -8124 3099 12698 9738 6224 2209 764
3680 764 7425 8989 5186 -1439 -6783 1754 5178 896 -1630 3416 4134 2715 748 285 6231 6015
3664 6015 1616 -5471 -12176 -6147 -7510 -8540 -6950 -5691 -1245 4307 768 2340 -1778 -6463 -5755
3649 -5755 -7583 -8226 -3883 -5939 -6306 -1085 2239 5746 802 -4814 -12220 -15234 -13713 -17718 -16331
3634a6331P091K135J228P718O350L688k154j0268o722P890R998k779k556l737
3620A551n273m992j0428m37J3283M526L291j94Kj926Q739K523n636l214o866k296
3604g347n54j326O288J043l63Q692N048L686L365l509p935n234j5Q43l739j396
3588b453j116J839n790l623N952k994j760L109j603R86M704p47m571N495N056
3573B484n697j636l264J304M898Q730k942j013O472N36l629m445j96n544m000
3558g942o43Q30N253O86j1553M682Q663K085l752J561p82K500O057m344r882m507
3542a1088l075O33K321k24m817J626R178N975N9K199M869j16l472m129k453J189
3526a325N33J740R447j975j222N52j00q101j386K565j222l737n003k905p8k627
$$ plain form
3634 -16331 -9240 -7105 -5877 1841 8191 11879 9725 -543 -7265 625 10623 7844 5288 1551
3620 1551 -3722 -8714 -19142 -19579 -6296 -1770 1521 1327 1329 -597 8142 10665 5029 1815 -5051 -7347
3604 -7347 -7901 -9227 -2939 -1896 -2259 6433 11481 15167 18532 15023 7088 1854 1839 2682 -1057 -2453
3588 -2453 -3569 -1730 -7520 -11143 -5191 -8185 -9945 -6836 -8439 -7453 -2749 -3496 -8067 -2572 2484
3573 2484 -3213 -4849 -8113 -6809 -1911 6819 3877 2864 9336 9872 6243 1798 1602 -3942 -7942
3558 -7942 -8585 -7755 -2502 -1816 -13369 -8687 -24 2061 -1691 -130 -912 1588 7645 3301 -6581 -11088
3542 -11088 -14163 -13530 -11209 -11433 -16250 -14624 -5446 529 588 2787 7656 7540 4068 -61 -2514 -1325
3526 -1325 -792 948 10395 8420 7198 7750 7650 -451 -1837 728 -494 -4231 -9234 -12139 -12217 -14844
3510a4844O891K693m060q248L766Q078P026K467p907j595K308K584l708n569J260
3495h858k619l879M795J303n009M757l216n998M947J470J052J974O233L382K944
3480C278m571j291O025O567m674o774L2j364o80J825L611l04K801K81j263k194
$$ plain form
3510 -14844 -7953 -5260 -9320 -17568 -13802 -5724 1302 3769 -4138 -5733 -3425 -841 -4549 -10118 -8858
3495 -8858 -11477 -15356 -10561 -9258 -14267 -9510 -12726 -18724 -13777 -12307 -11255 -9281 -3048 334 3278
3480 3278 -1293 -2584 3441 10008 5334 -1440 -1408 -2772 -3452 -1627 1984 1680 4481 4762 3499 1305
$$ [...]
##END NTUPLES=NMR SPECTRUM
##END=
