##TITLE=Analysis number 319665
Compound Code cc 51546
Book Reference 438/126/4
Project Code adrs
Chemist Name antons
##JCAMPDX= 6.0         $$ Bruker NMR JCAMP-DX V2.0
##DATA TYPE= NMR SPECTRUM
##DATA CLASS= NTUPLES
##ORIGIN= Bruker BioSpin GmbH
##OWNER= nmr
$$ XWIN-NMR		Version 3.5
$$ Tue May 23 14:09:35 2006 GMT Daylight Time (UT+1h)  MAYBRIDGE\nmr@NMR_250MHZ
##.OBSERVE FREQUENCY= 250.131544655141
##.OBSERVE NUCLEUS= ^1H
##.ACQUISITION MODE= SIMULTANEOUS (DQD)
##.ACQUISITION SCHEME= undefined
##.AVERAGES= 16
##.DIGITISER RES= 18
##SPECTROMETER/DATA SYSTEM= dpx250
##.PULSE SEQUENCE= zg30
##.SOLVENT NAME= CDCl3
##.SHIFT REFERENCE= (INTERNAL, CDCl3, 0, 16.522)
##AUDIT TRAIL= $$ (NUMBER, WHEN, WHO, WHERE, WHAT)
$$ ##TITLE= Audit trail, XWIN-NMR		Version 3.5
$$ ##JCAMPDX= 5.01
$$ ##ORIGIN= Bruker BioSpin GmbH
$$ ##OWNER= nmr
$$ C:\u/data/dgb/nmr/ADRS/5040/pdata/1/auditp.txt
$$ ##AUDIT TRAIL=  $$ (NUMBER, WHEN, WHO, WHERE, WHAT)
(   1,<2006-05-23 14:09:12.04 +100>,<MAYBRIDGE\nmr>,<NMR_250MHZ>,
      <created by zg, POWCHK disabled, PULCHK disabled
       configuration hash MD5:
       84 BC 41 DB A1 6E 1D 46 DA 25 12 A5 C1 ED C5 3A
       data hash MD5: 64K
       CB F8 D1 E0 BD 11 A5 78 A7 FE 07 DB B8 03 B0 BE>)
(   2,<2006-05-23 14:09:25.99 +100>,<MAYBRIDGE\nmr>,<NMR_250MHZ>,
      <Start of raw data processing
       ef LB = 0.3 FT_mod = 6 PKNL = 1 SI = 32K 
       data hash MD5: 32K
       7F 80 2A 0B C0 46 93 38 61 38 3B 4D 92 2E 5B A6>)
(   3,<2006-05-23 14:09:27.88 +100>,<MAYBRIDGE\nmr>,<NMR_250MHZ>,
      <apk 
       data hash MD5: 32K
       F4 21 A5 59 46 7B C6 7A 3D 2B 25 74 DC 3B 73 4A>)
(   4,<2006-05-23 14:09:28.63 +100>,<MAYBRIDGE\nmr>,<NMR_250MHZ>,
      <abs ABSG = 5 
       data hash MD5: 32K
       B2 27 26 6D 15 2E E3 71 90 9C 76 66 3D 9F 88 18>)
$$ ##END=
$$ 
$$ hash MD5
$$ 96 20 40 DD 1D CA 6C FA D4 57 9A F3 BA 50 03 2C
##$RELAX= 
##$RELAX= 
##$RELAX= 
##$RELAX= 
##$RELAX= 
##$RELAX= 
##$RELAX= 
$$ Bruker specific parameters
$$ --------------------------
##$DU= <C:\u>
##$EXPNO= 5040
##$NAME= <ADRS>
##$PROCNO= 1
##$TYPE= <nmr>
##$USER= <dgb>
##$AMP= (0..31)
100 100 100 100 100 100 100 100 100 100 100 100 100 100 100 100 100 100 
100 100 100 100 100 100 100 100 100 100 100 100 100 100 
##$AQSEQ= 0
##$AQ_mod= 3
##$AUNM= <au_zg>
##$AUTOPOS= <43 >
##$BF1= 250.13
##$BF2= 250.13
##$BF3= 250.13
##$BF4= 250.13
##$BF5= 500.13
##$BF6= 500.13
##$BF7= 500.13
##$BF8= 500.13
##$BYTORDA= 1
##$CFDGTYP= 0
##$CFRGTYP= 5
##$CHEMSTR= <none>
##$CNST= (0..31)
1 1 145 1 1 1 1 1 1 1 1 1 1 1 1 1 1 1 1 1 1 1 1 1 1 1 1 1 1 1 1 1 
##$CPDPRG= <>
##$CPDPRG1= <>
##$CPDPRG2= <>
##$CPDPRG3= <>
##$CPDPRG4= <mlev>
##$CPDPRG5= <mlev>
##$CPDPRG6= <mlev>
##$CPDPRG7= <mlev>
##$CPDPRG8= <mlev>
##$CPDPRGB= <>
##$CPDPRGT= <>
##$D= (0..31)
0 1 0 0 0 0 0 0 0 0.06 0 0 0 0 0 0 0.0002 0 0 0 0 0 0 0 0 0 0 0 0 0 0 
0 
##$DATE= 1148389751
##$DBL= (0..7)
120 120 120 120 120 120 120 120 
##$DBP= (0..7)
150 150 150 150 150 150 150 150 
##$DBP07= 0
##$DBPNAM0= <>
##$DBPNAM1= <>
$$ [...]
##$SUBNAM7= <"">
##$SUBNAM8= <"">
##$SUBNAM9= <"">
##$SW= 20.6930455092707
##$SWIBOX= (0..15)
0 0 3 0 0 0 0 0 0 0 0 0 0 0 0 0 
##$SW_h= 5175.983436853
##$TD= 65536
##$TD0= 1
##$TE= 295.16
##$TE2= 300
##$TE3= 300
##$TEG= 300
##$TL= (0..7)
0 120 120 120 120 120 120 120 
##$TP= (0..7)
150 150 150 150 150 150 150 150 
##$TP07= 0
##$TPNAME0= <>
##$TPNAME1= <>
##$TPNAME2= <>
##$TPNAME3= <>
##$TPNAME4= <>
##$TPNAME5= <>
##$TPNAME6= <>
##$TPNAME7= <>
##$TPOAL= (0..7)
0.5 0.5 0.5 0.5 0.5 0.5 0.5 0.5 
##$TPOFFS= (0..7)
0 0 0 0 0 0 0 0 
##$TUNHIN= 0
##$TUNHOUT= 0
##$TUNXOUT= 0
##$USERA1= <user>
##$USERA2= <user>
##$USERA3= <user>
##$USERA4= <user>
##$USERA5= <user>
##$V9= 5
##$VALIST= <valist>
##$VCLIST= <CCCCCCCCCCCCCCC>
##$VD= 0
##$VDLIST= <DDDDDDDDDDDDDDD>
##$VPLIST= <PPPPPPPPPPPPPPP>
##$VTLIST= <TTTTTTTTTTTTTTT>
##$WBST= 1024
##$WBSW= 4
##$XGAIN= (0..3)
0 0 0 0 
##$XL= 0
##$YL= 0
##$YMAX_a= 474624
##$YMIN_a= -359412
##$ZGOPTNS= <>
##$ZL1= 120
##$ZL2= 120
##$ZL3= 120
##$ZL4= 120
##$ABSF1= 16.522
##$ABSF2= -4.171173
##$ABSG= 5
##$ABSL= 3
##$ALPHA= 0
##$AQORDER= 0
##$ASSFAC= 0
##$ASSFACI= 0
##$ASSFACX= 0
##$ASSWID= 0
##$AUNMP= <proc_1d>
##$AZFE= 0.1
##$AZFW= 0.1
##$BCFW= 0
##$BC_mod= 0
##$BYTORDP= 0
##$COROFFS= 0
##$CY= 12.5
##$DATMOD= 1
##$DC= 0
##$DFILT= <>
##$DTYPP= 0
##$F1P= 14.0000005364418
##$F2P= -0.99999901652339
##$FCOR= 0.5
##$FTSIZE= 32768
##$FT_mod= 6
##$GAMMA= 0
##$GB= 0
##$INTBC= 1
##$INTSCL= 1
##$ISEN= 128
##$LB= 0.3
##$LEV0= 0
##$LPBIN= 0
##$MAXI= 10000
##$MC2= 0
##$MEAN= 0
##$ME_mod= 0
##$MI= 0
##$NCOEF= 0
##$NC_proc= -3
##$NLEV= 6
##$NOISF1= 0
##$NOISF2= 0
##$NSP= 0
##$NTH_PI= 0
##$NZP= 0
##$OFFSET= 16.522
##$PC= 1
##$PHC0= 18.31264
##$PHC1= 3.383542
##$PH_mod= 1
##$PKNL= yes
##$PPARMOD= 0
##$PSCAL= 4
##$PSIGN= 0
##$REVERSE= no
##$SF= 250.13
##$SI= 32768
##$SIGF1= 0
##$SIGF2= 0
##$SINO= 400
##$SIOLD= 32768
##$SREGLST= <1H.CDCl3>
##$SSB= 0
##$STSI= 32768
##$STSR= 0
##$SW_p= 5175.98343685301
##$SYMM= 0
##$S_DEV= 0
##$TDeff= 65536
##$TDoff= 0
##$TI= <Analysis number 999999
Compound Code 99
Book Reference 9
Project Code 9>
##$TILT= no
##$TM1= 0
##$TM2= 0
##$TOPLEV= 0
##$USERP1= <user>
##$USERP2= <user>
##$USERP3= <user>
##$USERP4= <user>
##$USERP5= <user>
##$WDW= 1
##$XDIM= 32768
##$YMAX_p= 346276600
##$YMIN_p= -35570
$$ End of Bruker specific parameters
$$ ---------------------------------
##NTUPLES= NMR SPECTRUM
##VAR_NAME=  FREQUENCY,     SPECTRUM/REAL,   SPECTRUM/IMAG
##SYMBOL=    X,             R,               I
##VAR_TYPE=  INDEPENDENT,   DEPENDENT,       DEPENDENT
##VAR_FORM=  AFFN,          ASDF,            ASDF
##VAR_DIM=   32768,         32768,           32768
##UNITS=     HZ,            ARBITRARY UNITS, ARBITRARY UNITS
##FACTOR=    0.157963299565203, 1,           1
##FIRST=     4132.6476996994, 0,             0
##LAST=      -1043.33573715361, 0,           0
##MIN=       -1043.33573715361, -35570,      0
##MAX=       4132.6476996994, 346276600,     0
$$ Real data points
##PAGE= N=1
##DATA TABLE= (X++(R..R)), XYDATA
$$ [...]
16670i548J0107M476R56n918p953J611O64K394k791l659k532k428P214Q812k024
$$ -9548 559 5035 5991 73 -7880 -6269 -5605 -3211 -6002 -9661 -12193 -14621 -7407 1405 -619
16655f19n419m8q45M005L034L52P82n313j497L558K59K36m421j638J294j170j181
$$ -619 -6038 -6086 -6931 -2926 108 460 1242 -4071 -5568 -2010 -1751 -1515 -5936 -7574 -6280 -7450 -8631
16638h631R38J694L908r25K419o737j698L528L44m156k083n5m183m172N919P416
$$ -8631 -7693 -5999 -2091 -3016 -597 -7334 -9032 -5504 -5160 -9316 -11399 -11454 -15637 -19809 -13890 -6474
16622f474L012j942L94K411m578O55R99k385J006k04p33l386M042m97j319N134
$$ -6474 -3462 -5404 -5010 -2599 -7177 -6522 -5523 -7908 -6902 -7106 -7839 -11225 -7183 -7680 -8999 -3865
16606c865M064m333r14M22K112J567j871J885L242N265Q46K418j224l963j396
$$ -3865 199 -4134 -5048 -4626 -2514 -947 -2818 -933 2309 7574 8420 10838 9614 5651 4255
16591D255K856P31j819O38N4l453n958J77l177R92J466j239p78K479J144J250
$$ 4255 7111 7842 6023 6661 6715 3262 -2696 -2519 -5696 -4704 -3238 -4477 -5255 -2776 -1632 -382
16575c82R60J661N70l332j519m239O0K463R19p60m013L012K848P11j182j323K94
$$ -382 578 2239 2809 -523 -2042 -6281 -6221 -3758 -2839 -3599 -7612 -4600 -1752 -1041 -2223 -3546 -3252
16558c252L241L963j274J563k065l495q387J974N48M333m721m951K280M883J056
$$ -3252 -11 3952 2678 4241 2176 -1319 -9706 -7732 -7184 -2851 -7572 -12523 -10243 -5360 -4304
16543d304o35R96M527N58j590L973q60j529l593m752L488J13m180k422M52j522
$$ -4304 -4939 -3943 584 1142 -448 3525 2665 1136 -2457 -7209 -3721 -3608 -7788 -10210 -9758 -11280
16527a1280K667N721J655k110k615QJ238L949j804l955l645l281P34O98O82M082
$$ -11280 -8613 -2892 -1237 -3347 -5962 -5954 -4716 -767 -2571 -6526 -10171 -13452 -12718 -12020 -11338 -7256
16511g256M080m123J611K118n07K69O58p680k59j359K071M89j80K482K707k682
$$ -7256 -3176 -7299 -5688 -3570 -4077 -3808 -3150 -10830 -11089 -12448 -10377 -9888 -10068 -7586 -4879 -7561
16495g561o064J601M909n86l581M448P618l270k251j891o99k068J249n28M589
$$ -7561 -13625 -12024 -7115 -7701 -11282 -6834 784 -2486 -4737 -6628 -7327 -9395 -8146 -8674 -4085
16480d085L108k528l330L559j287m467q52r42K266L237k321l047K455j553k72
$$ -4085 -977 -3505 -6835 -3276 -4563 -9030 -9882 -10824 -8558 -5321 -7642 -10689 -8234 -9787 -10059
16465a0059K252J033M60J831l02M450p06o140p537K902L612N49K886o42K042K535
$$ -10059 -7807 -6774 -6314 -4483 -4785 -335 -1041 -7181 -14718 -11816 -8204 -7655 -4769 -5411 -3369 -834
16449h34L487Q02n810J785J453o863n055k559M227N190N518K028j029J793l061
$$ -834 2653 3455 -2355 -570 883 -5980 -11035 -13594 -9367 -4177 1341 3369 2340 4133 1072
16434A072o740j584N800J518l121p083j123J768J065k12M226J763l592k653N79
$$ 1072 -5668 -7252 -1452 66 -3055 -10138 -11261 -9493 -8428 -8640 -4414 -2651 -6243 -8896 -8317
16419h317K11k724k81j099l549P549P268L120M91j406M178L083l745o254M16q54
$$ -8317 -8106 -10830 -11111 -12210 -15759 -8210 -942 2178 2669 1263 5441 8524 4779 -1475 -1059 -1913
16403a913J234j191k120k248J880O89j924J120M337m185m258J473N876L954m463
$$ -1913 -679 -1870 -3990 -6238 -4358 -3669 -5593 -4473 -136 -4321 -8579 -7106 -1230 2724 -1739
16388a739k298K120m752o227J586N732q70O9r08n3k339J846n41J135M76j74q10
$$ -1739 -4037 -1917 -6669 -12896 -11310 -5578 -6448 -6379 -7287 -7340 -9679 -7833 -8374 -7239 -6763 -6937 -7747
16371g747L765q58p113l074M685K99K106m211K552R63l337j420L940M606M145
$$ -7747 -3982 -4840 -11953 -15027 -10342 -10043 -7937 -12148 -9596 -8633 -11970 -13390 -9450 -4844 -699
16356f99j941J084k699K354k478k676K927P702l009N104j035j900m047m7k543
$$ -699 -2640 -1556 -4255 -1901 -4379 -7055 -4128 3574 565 5669 4634 2734 -1313 -1360 -3903
16341c903k594K831M506J421l465r64L836K107j117J367j991l254L653j298j0076
$$ -3903 -6497 -3666 840 2261 -1204 -2168 1668 3775 2658 4025 2034 -1220 2433 1135 -8941
16326h941l099M496K327K921K56m298p313k283L231K988R39M104k88O337L8o523
$$ -8941 -12040 -7544 -5217 -2296 -2040 -6338 -13651 -15934 -12703 -9715 -8776 -4672 -4960 1377 1415 -5108
16310e108Q46M79J391M521k030n740j068L545Q56l142R10O371O70k443p33N320
$$ -5108 -4262 -3783 -2392 2129 99 -5641 -6709 -3164 -2308 -5450 -4540 1831 2501 58 -675 4645
16294D645L12j839K471m270L8k614j191N103r95j0032j029L893K225M487Q089
$$ 4645 4957 3118 5589 1319 1357 -1257 -2448 2655 1660 -8372 -9401 -5508 -3283 1204 9293
16279I293l732k268M764J403l564n989l666L010p58K708p64J71L377L191m09m605
$$ 9293 5561 3293 8057 9460 5896 -93 -3759 -749 -1507 1201 437 608 3985 7176 6767 2162
16263B162n631p853K993M751K078J131k712P67M538N40j987j5R37k174j664J494
$$ 2162 -3469 -11322 -8329 -3578 -1500 -369 -3081 -2314 2224 2764 777 762 1699 -475 -2139 -645
16247f45l845j87N461J932j072m78J335J20k368n166k863N414J632o069K67K364
$$ -645 -4490 -4677 784 2716 1644 1166 2501 2621 253 -4913 -7776 -2362 -730 -6799 -6532 -4168
16231d168N31j99L58K128l654m915r20K683M680J383PL80j286k33R90K522j479
$$ -4168 -3637 -3836 -3478 -1350 -5004 -9919 -10839 -8156 -3476 -2093 -2086 -1706 -2992 -3225 -2235 287 -1192
16214a192K42J991j71J358Q40j645r86l107j50j556l44j05L321K273k943k128
$$ -1192 -950 1041 870 2228 3068 1423 437 -2670 -2820 -4376 -4720 -4825 -1504 769 -2174 -4302
16198d302j643m73j252K815L315j771M83J995o169l672J0000k142o737k994K450
$$ -4302 -5945 -6418 -7670 -4855 -1540 -3311 -2828 -833 -7002 -10674 -674 -2816 -9553 -12547 -10097
16183a0097L085p97j065n4L367M882j883l310J242K249K515r81j871Q76o90J990
$$ -10097 -7012 -7809 -8874 -8928 -5561 -679 -2562 -5872 -4630 -2381 134 -847 -2718 -1842 -2532 -542
16167e42K690K465m642p405j055M222L630j19j40k590o33K815J147O72j226M883
$$ -542 2148 4613 -29 -7434 -8489 -4267 -637 -756 -896 -3486 -4119 -1304 -157 515 -711 4172
16151D172J692n548n532l125J887K29Q24k307j959J177m97K363r21j327K931M725
$$ 4172 5864 316 -5216 -8341 -6454 -6225 -5401 -7708 -9667 -8490 -8987 -6624 -7545 -8872 -5941 -1216
16135a216K992K103k455j254K376N81p84k210k004Q65k546K273M0m165K148J550
$$ -1216 1776 3879 1424 170 2546 3127 2343 133 -1871 -1006 -3552 -1279 -1239 -5404 -3256 -1706
16119a706k064J579K083k97k986k178n87K169m888k236J850J020M282m32n690
$$ -1706 -3770 -2191 -108 -405 -3391 -5569 -6156 -3987 -8875 -11111 -9261 -8241 -3959 -4391 -10081
16104a0081P81Q70K051Q53l361L82l296j138J251P6q57j248L877O629R70j019
$$ -10081 -9300 -8430 -6379 -5526 -8887 -8505 -11801 -12939 -11688 -11612 -12469 -13717 -9840 -3211 -2241 -3260
16088c260N710J150l401m147m930K127J038R80O62k744m050k650J693M389M518
$$ -3260 2450 3600 199 -3948 -8878 -6751 -5713 -4733 -4071 -6815 -10865 -13515 -11822 -7433 -2915
16073b915J209j027n316n169K77K232R64M873j57k463J462j400p36j317k464K617
$$ -2915 -1706 -2733 -8049 -13218 -12941 -10709 -9745 -4872 -5029 -7492 -6030 -7430 -8166 -9483 -11947 -9330
16057i330j651j001l21j217M830L312p88k517M31M47p08j406N435K958j992r31
$$ -9330 -10981 -11982 -12303 -13520 -8690 -5378 -6166 -8683 -8252 -7805 -8513 -9919 -4484 -1526 -3518 -4449
16041d449l689Q61q86k06K470l438m971k650R02O476N054k480L16k017r36k28
$$ -4449 -8138 -7277 -8163 -8369 -5899 -9337 -14308 -16958 -16056 -9580 -4526 -7006 -6690 -8707 -9643 -9871
16025i871L174n52l377N708M683J252j624r30k970J35k007l486Q5j911j506m10
$$ -9871 -6697 -7249 -10626 -4918 -235 1017 -607 -1537 -4507 -4372 -6379 -9865 -9780 -11691 -13197 -13607
16009a3607k57L511K294J715K666k013K026L153R87l085l864j705J109k145L710
$$ -13607 -13864 -10353 -8059 -6344 -3678 -5691 -3665 -512 475 -2610 -6474 -8179 -7070 -9215 -5505
15994e505J332j583k535k510M94L325Q47Q66n948k000N751N36m928K98M52j231
$$ -5505 -4173 -5756 -8291 -10801 -10307 -6982 -6135 -5269 -11217 -13217 -7466 -6930 -11858 -11560 -11108 -12339
15978a2339k837R11K268M517j41L773J737k801J278M19o5m506k417J661P06J048
$$ -12339 -15176 -14265 -11997 -7480 -7621 -3848 -2111 -4912 -3634 -3215 -3280 -7786 -10203 -8542 -7836 -6788
15962f788J335N255J986k537J729j273K104M388j158n878j031K121j812o96M062
$$ -6788 -5453 -198 1788 -749 980 -293 1811 6199 5041 -837 -1868 253 -1559 -2255 1807
15947A807O838J965l19j727k43n14k917p926m687k847o32L44K280K984L14L798
$$ 1807 8645 10610 10291 8564 8321 7807 4890 -3036 -7723 -10570 -11202 -10858 -8578 -5594 -5280 -1482
15931a482l45R29k97m643o96L070k737r79K174J429r20j521K755j689K627N054
$$ -1482 -1827 -898 -1195 -5838 -6534 -3464 -6201 -7180 -5006 -3577 -4497 -6018 -3263 -4952 -2325 2729
15915B729O10k859k209j219l287p04N329K465k42n426k144J240J92l970P662R243
$$ 2729 3339 480 -1729 -2948 -6235 -6939 -1610 855 613 -4813 -6957 -5717 -5525 -9495 -1833 7410
15899G410O73q142l783K227O55J606l653L864N653L498m730J529m994n000O22
$$ 7410 8083 -59 -3842 -1615 -960 646 -3007 857 6510 10008 5278 6807 1813 -3187 -2565
15884b565k627O0M84m2J072J533J32k125j302O30O046J228J018N040m856o283
$$ -2565 -5192 -5132 -4648 -4690 -3618 -2085 -1953 -4078 -5380 -4750 1296 2524 3542 8582 3726 -2557
15868b557n71q76k121j68N21j235J208M390J566l485m779m081J786k505p98M881
$$ -2557 -3128 -4004 -6125 -6293 -5772 -7007 -5799 -1409 157 -3328 -8107 -12188 -10402 -12907 -13705 -8824
15852h824Q004p83L257N259l139O17m02l071l392j422M32L396m403p223k141j495
$$ -8824 -820 -1603 1654 6913 3774 4391 3989 918 -2474 -3896 -3464 -68 -4471 -11694 -13835 -15330
15836a5330L960N707L197R11j250J023m547m97J442l162j378R848K245p075m561
$$ -15330 -11370 -5663 -2466 -1555 -2805 -1782 -6329 -6826 -5384 -8546 -9924 -76 2169 -4906 -9467
15821i467P598K928k771n281l846K48L503K521J638n571Q09j119j00O144L725
$$ -9467 -1869 1059 -1712 -6993 -10839 -10591 -7088 -4567 -2929 -8500 -7691 -8810 -8910 -2766 959
15806I59m525j753J784k155o220J191J563K720j078K988J492N630L876L911l506
$$ 959 -3566 -5319 -3535 -5690 -11910 -10719 -9156 -6436 -7514 -4526 -3034 2596 6472 10383 6877
15791F877r171r17L094M282j707J82J293l96O126q97o737m455l754p9K416K872
$$ 6877 -2294 -3211 -117 4165 2458 2640 3933 3537 9663 8766 2029 -2426 -6180 -6259 -3843 -971
15775i71l56n59J011r44n98j718j630N84j95j056k156J424J454J380J18P29K18
$$ -971 -1327 -1886 -875 -1819 -2417 -4135 -5765 -5181 -5376 -6432 -8588 -7164 -5710 -4330 -4212 -3483 -3265
15758c265k942j535M430N1o112L880L563K39j950M55O18p96K88K398J368l985
$$ -3265 -6207 -7742 -3312 -3261 -9373 -5493 -1930 -1691 -3641 -3186 -2568 -3364 -3076 -678 690 -3295
15742c295j901L024L88M228R95n249n749k35J883J408M591K692O15m188n339o178
$$ -3295 -5196 -2172 -1784 2444 3439 -1810 -7559 -7794 -5911 -4503 88 2780 3395 -793 -6132 -12310
15726a2310j825L64L502J956R72n32q24J607R55L519r0j144R41j729k9P049K642
$$ -12310 -14135 -13771 -10269 -8313 -7341 -7873 -8697 -7090 -6135 -2616 -2706 -3850 -2909 -4638 -4667 2382 5024
15709E024l363n546J035N9k641K088j937K522K637J021K7l841l352q58J312M402
$$ 5024 1661 -3885 -2850 -2791 -5432 -3344 -5281 -2759 -122 899 926 -2915 -6267 -7125 -5813 -1411
15693a411j372l978j471J236L17j112n458J814M896M397L436l210n367k287l28
$$ -1411 -2783 -6761 -8232 -6996 -6679 -7791 -13249 -11435 -6539 -2142 1294 -1916 -7283 -9570 -9898
15678i898M283J647oL513K742O02o8P34l434l065q81J52L92J68Q95N347j588l242
$$ -9898 -5615 -3968 -3974 -461 2281 2883 2815 3549 115 -2950 -3831 -3679 -3287 -3119 -2224 3123 1535 -1707
15660a707R23j247l459K29O544K770l951n674L729k1m013l619L449N009O592K815
$$ -1707 -784 -2031 -5490 -5261 1283 4053 102 -5572 -1843 -1864 -5877 -9496 -6047 -1038 5554 8369
15644H369q197n353j008n350n893R61L045L475L482m763j48M857J254J887K720
$$ 8369 172 -5181 -6189 -11539 -17432 -16471 -13426 -9951 -6469 -11232 -11380 -6523 -5269 -3382 -662
15629f62l011L569k650m39K750k575j222K227K385M131k006n059k768n39J40q76
$$ -662 -3673 -104 -2754 -3193 -443 -3018 -4240 -2013 372 4503 2497 -2562 -5330 -5869 -5729 -6605
15613f605l422P85L138R24N91N279P00n33j041J352l961q54K728J56K244l009
$$ -6605 -10027 -9242 -6104 -5180 -4589 690 1390 857 -184 1168 -2793 -3647 -919 -763 1481 -1528
15597a528l558p577k439L453J194P845Q71l366k011j103j78M460M289J193m685
$$ -1528 -5086 -12663 -15102 -11649 -10455 -2610 -1739 -5105 -7116 -8219 -8397 -3937 352 1545 -3140
15582c140k903l49L58O021J096J381j74M669J539l070J640o531n247o19m978n305
$$ -3140 -6043 -6392 -6034 -13 1083 2464 2290 6959 8498 5428 7068 537 -4710 -5329 -10307 -15612
15566a5612j976J500j44p9Q659O936k280m64J15M487l848k394M151J751o921K2
$$ -15612 -17588 -16088 -16232 -16311 -7652 -716 -2996 -3460 -3345 1142 -2706 -5100 -949 802 -6119 -6097
15550f097J560J256J181l098j425n11J069j829L50K27o54j487l027n427K917P509
$$ -6097 -4537 -3281 -2100 -5198 -6623 -7134 -6065 -7894 -7544 -7317 -7971 -9458 -12485 -17912 -14995 -7486
15534g486K482K594j156p99M48J939N1M93N66O67m307n442J105N568M617K932
$$ -7486 -5004 -2410 -3566 -4365 -3917 -1978 -1927 -1434 -868 -201 -4508 -9950 -8845 -3277 1340 4272
15518D272J381l24l817k323k909m304k441J720P18M43J061J83n2J968J979j342
$$ 4272 5653 5329 1512 -811 -3720 -8024 -10465 -8745 -8027 -7584 -6523 -6340 -6392 -4424 -2445 -3787
15502c787M463L351N92m021k206k572O024P539K599m984l709J068l817L80m802
$$ -3787 676 4027 4619 598 -1608 -4180 1844 9383 11982 6998 3289 4357 540 920 -3882
15487c882K52m16k27j650k706n53J215K468L082m76o356K339M385K341J013k08
$$ -3882 -3630 -4046 -4273 -5923 -8629 -9182 -7967 -5499 -2417 -2893 -9249 -6910 -2525 -184 829 621
15471F21n323l376m247N860K38j962L063R30J084L112R80K096m291k321k121J266
$$ 621 -4702 -8078 -12325 -6465 -6227 -8189 -5126 -4196 -3112 0 980 3076 -1215 -3536 -5657 -4391
15455d391N93L359k331j255M194l728k673O600M49l399m347J198K343J794k555
$$ -4391 -3798 -439 -2770 -4025 169 -3559 -6232 368 817 -2582 -6929 -5731 -3388 -1594 -4149
15440d149J4j475j63K090k047k176Q40J235L90j141P65l618J338O861j280l270
$$ -4149 -4135 -5610 -5773 -3683 -5730 -7906 -7066 -5831 -5441 -6582 -5817 -9435 -8097 -1236 -2516 -5786
15424e786J517J458k607n66L242M898k09k879m045j374N450K16j622k096K237
$$ -5786 -4269 -2811 -5418 -5984 -2742 2156 1947 -932 -4977 -6351 -901 -685 -2307 -4403 -2166
15409b166L782K98r66k159o736k272j110L364O270l549l665J982K394k105o68
$$ -2166 1616 1914 948 -1211 -7947 -10219 -11329 -7965 -1695 -5244 -8909 -6927 -4533 -6638 -7306
15394g306K050J907N600n65n530j267j217n45M075K562K251K728M06O31k305J18
$$ -7306 -5256 -3349 2251 1686 -3844 -5111 -6328 -6873 -2798 -236 2015 4743 5149 5780 3475 3593
15378C593r44J8j588K138n91m181j303j177j37l260L457K815K123l585p118l49
$$ 3593 2649 2667 1079 3217 2626 -1555 -2858 -4035 -4172 -7432 -3975 -1160 963 -2622 -9740 -10089
15362a0089Q651Q929J131n966j499q29K725n10l069j532K418m504P58M610J158
$$ -10089 -1438 7491 8622 2656 1157 328 3053 2543 -526 -2058 360 -4144 -3386 1224 2382
15347B382r76j000j672j318r7M765k555J996j169m202K823L580L56j853r89l231
$$ 2382 1406 406 -1266 -2584 -2681 2084 -471 1525 356 -3846 -1023 2557 2913 1060 71 -3160
15331c160k41K054J794Q37J341m322K73N153J613l511k257J037K906l933K220
$$ -3160 -3401 -1347 447 1284 2625 -1697 -1424 3729 5342 1831 -426 611 3517 -416 1804
15316A804R0O822j52p731n645o692L620K494l697m63J849j129M451K330k315M289
$$ 1804 1894 8716 8564 833 -4812 -11504 -7884 -5390 -9087 -9550 -7701 -8830 -4379 -2049 -4364 -75
15300g5R48L245j475l064l426n738O02K727K815j523l332j721M321M541K45J501
$$ -75 873 4118 2643 -421 -3847 -9585 -8983 -6256 -3441 -4964 -8296 -10017 -5696 -1155 -910 591
15284E91J173m851j577L911J510m738j030L15l521j947j563o11O82k43M102J301
$$ 591 1764 -3087 -4664 -753 757 -3981 -5011 -4696 -8217 -10164 -11727 -12338 -11656 -11899 -7797 -6496
15268f496L283J655L316k130J382l33n914J516K759K641J004j093K339J997J450
$$ -6496 -3213 -1558 1758 -372 1010 677 -5237 -3721 -962 1679 2683 1590 3929 5926 7376
15253G376r46j856m841q61M468P27k950K05J144P43l499r68L792m256l620K877
$$ 7376 6430 4574 -267 -1128 3340 4067 1117 1322 2466 3209 -290 -1258 2534 -1722 -5342 -2465
15237b465K593j648j223l374k107L779L493K514n31p110j741l21p14k895K84O657
$$ -2465 128 -1520 -2743 -6117 -8224 -4445 -952 1562 1031 -6079 -7820 -8141 -8855 -11750 -11466 -4809
15221d809O16J324l784j951N640K986Q74K716k842k658N91k517j534L505k680
$$ -4809 -4193 -2869 -6653 -8604 -2964 22 896 3612 770 -1888 -1297 -3814 -5348 -1843 -4523
15206d523m427r79J300n88o46J308M994m55R64P721o99n248j627l014j821O87
$$ -4523 -8950 -9929 -8629 -9217 -9863 -8555 -3561 -4016 -3052 4669 3970 -1278 -2905 -5919 -7740 -7053
15190g053J740J980M51J607P55K232K161j575j857k661J291J078j860k344k267
$$ -7053 -5313 -3333 -2882 -1275 -520 1712 3873 2298 441 -2220 -929 149 -1711 -4055 -6322
15175f322j766J352M9L895O32j689k51M282K703q49J083J305j37l513N007k079
$$ -6322 -8088 -6736 -6687 -2792 -2160 -3849 -4100 182 2885 2036 3119 4424 4287 774 5781 3702
15159C702m187j773k144l190l274O19J881J219Q465j028J203L010L141j779n222
$$ 3702 -485 -2258 -4402 -7592 -10866 -10247 -8366 -7147 1318 290 1493 4503 7644 5865 643
15144F43P72j412K88J86P48j697K291O258l403l293o683l36K569k663l722J326
$$ 643 1415 3 291 477 1225 -472 1819 8077 4674 1381 -5302 -5638 -3069 -5732 -9454 -8128
15128h128L485Q49P96L922j676m366l042q96J749k640k323k202J854N449M545
$$ -8128 -4643 -3794 -2998 924 -752 -5118 -8160 -9056 -7307 -9947 -12270 -14472 -12618 -7169 -2624
15113b624Q820J256M039J068m884r09J341k023m793K121R82j771J136m06J470
$$ -2624 6196 7452 11491 12559 7675 6766 8107 6084 1291 3412 4394 2623 3759 3353 4823
15098D823K318m242J376J757l690k562l214J364J936O36N58j284N47r63O171O90
$$ 4823 7141 2899 4275 6032 2342 -220 -3434 -2070 -134 502 1060 -224 323 -640 5531 6221
15082F221k783j166J100L500J221J57J861N38j81k586P31P8N87m122J593N039
$$ 6221 3438 2272 3372 6872 8093 8250 10111 10649 10468 7882 8613 8691 9278 5156 6749 11788
15066A1788j42J13l306m997L556k238m121K37M076p40j708J650k651L25L35J23
$$ 11788 11646 11759 8453 3456 7012 4774 653 890 4966 4226 2518 4168 1517 1842 2177 2300
15050B300j168j212J100o63n90J868J173k64L478l917J354l076k231K542m312
$$ 2300 1132 -80 1020 357 -233 1635 2808 2544 6022 2105 3459 383 -1848 694 -3618
15035c618j81l874n877R15L808Q174J685M40j264O068k170j440K757k351n77q25
$$ -3618 -3799 -7673 -13550 -12635 -8827 -653 1032 1472 208 6276 4106 2666 5423 3072 2495 1670
15019A670m521k073l41j122k918n2L785M54l275O705O143L806l724JL63M16K118
$$ 1670 -2851 -4924 -5265 -6387 -9305 -9357 -5572 -5118 -8393 -1688 4455 8261 4537 4538 4901 5317 7435
15002G435k504K48J618k632l9J509P79m61j281J053j627k382j288j599M893L359
$$ 7435 4931 5179 6797 4165 4126 5635 6414 5953 4672 5725 4098 1716 428 -1171 3722 7081
14986G081k435J385o07k759o27K510j66j916m515l583l13q67J33Q86J083L114
$$ 7081 4646 6031 5424 2665 2038 4548 4382 2466 -2049 -5632 -5945 -6812 -6679 -5793 -4710 -1596
14970a596l82J54o9J547n135M292j545j177L882m035J90N33r2N769o90J211L61
$$ -1596 -1978 -1824 -1893 -346 -5481 -1189 -2734 -3911 -29 -4064 -3874 -3341 -3433 2336 1646 2857 3218
14953C218k481j443J467k720l580R32m34K752O72k82J048K182l673q04k521n00
$$ 3218 737 -706 761 -1959 -5539 -4607 -5041 -2289 -1617 -1899 -851 1331 -2342 -3146 -5667 -6167
14937f167J915r04m706k064J937N145N139k427o47m09j734L504pl078K964L71
$$ -6167 -4252 -5156 -9862 -11926 -9989 -4844 295 -2132 -2779 -3188 -4922 -1418 -1425 -4503 -1539 -1168
14921a168M13j45M152k017m425k888K362J436l709L428N972j252k123j815k608
$$ -1168 -755 -900 3252 1235 -3190 -6078 -3716 -2280 -5989 -2561 3411 2159 36 -1779 -4387
14906d387n214K506J604M373L820j62k099P93J545k043m061k877J367J98l120
$$ -4387 -9601 -7095 -5491 -1118 2702 2540 441 1234 2779 736 -3325 -6202 -4835 -4637 -7757
14891g757J468K807N067K023K92n483j338l196M089J257j080n6K938l98k184n62
$$ -7757 -6289 -3482 1585 3608 3900 -1583 -2921 -6117 -2028 -771 -1851 -1907 1031 633 -1551 -2113
14875b113O79m84j390J935K806L145J329j606m301j260J747L514J134n712M582
$$ -2113 -1434 -1918 -3308 -1373 1433 4578 5907 4301 0 -1260 487 4001 5135 -577 4005
14860D005K359j220j574l80J170L23L437N14l726m996o49J726M737M386R33N67
$$ 4005 6364 5144 3570 3190 4360 4683 8120 8634 4908 -88 -737 989 5726 10112 11045 11612
14844A1612k395J049k395m6J215n5k682p6m210q0j572Om86K474L089J121j613
$$ 11612 9217 10266 7871 7825 9040 8985 6303 6227 2017 1937 365 371 -115 2359 5448 6569 4956
14827D956k789m9J622l713j170N15n80K358J670m123l77l579M130O725j637n616
$$ 4956 2167 2118 3740 27 -1143 -628 -1208 1150 2820 -1303 -1680 -5259 -1129 5596 3959 -1657
14811a657K306L625K251j105l884k671l259n401j09K712J571K296J483k743L197
$$ -1657 649 4274 6525 5420 1536 -1135 -4394 -9795 -9904 -7192 -5621 -3325 -1842 -4585 -1388
14796a388L095L26M11r30J547J360n86O1L081J932l868k211J477k994l660J115
$$ -1388 1707 2033 2444 1514 3061 4421 3835 3896 6977 8909 5041 2830 4307 1313 -2347 -1232
14780a232j41M50j79M049l266j284N53L375K745J651j246k071l314K852q65j271
$$ -1232 -1373 -923 -1102 2947 -319 -1603 -1050 2325 5070 6721 5475 3404 90 2942 2077 806
14764H06J852M16j618P403R42J877m709J882R74O03n607k946J226j567j967J692
$$ 806 2658 3074 1456 8859 9801 11678 6969 8851 9825 10428 4821 1875 3101 1534 -433 1259
14748A259K490k928m975J151j092N43K537l323L454M245n104j807J544J336o99
$$ 1259 3749 821 -4154 -3003 -4095 -3552 -1015 -4338 -884 3361 -1743 -3550 -2006 -670 -1369
14733a369r05k763J877L125K760l153J079N927K554k446j753j276j996m40K181
$$ -1369 -2274 -5037 -3160 -35 2725 -428 651 6578 9132 6686 4933 3657 1661 1221 3402
14718C402j193O26j60j73j660M991J830l053r290Q78N798P72j925q43L18M629
$$ 3402 2209 2835 2675 2502 842 5833 7663 4610 -4680 -3802 1996 2768 843 0 318 4947
14702D947M361n930k817k185Q63J153L150K525q0K092m093K218k365n434K115
$$ 4947 9308 3378 561 -1624 -761 392 3542 6067 5987 8079 3986 6204 3839 -1595 520
14687E20J634j88k863J500k605j179k991j709R87O26n73K816j310M534j73j082
$$ 520 2154 1966 -897 603 -2002 -3181 -6172 -7881 -6894 -6268 -6841 -4025 -5335 -801 -974 -2056
14671b056N110L753M77j133n312j389l62j783J394K4J052K216Q76k548l630q33
$$ -2056 3054 6807 7284 6151 839 -550 -912 -2695 -1301 -1277 -225 1991 2867 319 -3311 -4144
14655d144J860M189j004J060k547J79j607j038k110K715K353j802k973N377m45
$$ -4144 -2284 1905 901 1961 -586 -407 -2014 -3052 -5162 -2447 -94 -1896 -4869 508 63
14640F3n338L782M546j856n58k090j188M764L671K326n12k692l908J756J432p179
$$ 63 -5275 -1493 3053 1197 639 -1451 -2639 2125 5796 8122 7610 4918 1010 2766 4198 -2981
14624b981M77N457L028l539k142j546l582K57l172J573j549J820J406J413L57
$$ -2981 -2504 2953 5981 2442 300 -1246 -4828 -4571 -7743 -6170 -7719 -5899 -4493 -3080 -2723
14609b723K604k318J726o32j246M49j359j48K805J553j309l075k783n225N99K42
$$ -2723 -119 -2437 -711 -1343 -2589 -2140 -3499 -3647 -842 711 -598 -3673 -6456 -11681 -11082 -10840
14593a0840J207j318k284Q68J56K156L867O059l680j823M670M677Q55n750n399
$$ -10840 -9633 -10951 -13235 -12367 -12211 -10055 -6188 -129 -3809 -5632 -962 3715 4570 -1180 -6579
14578f579M39J726K281K382O17m69p71m121j673N200J915O9o387O1N918K702j995
$$ -6579 -6140 -4414 -2133 249 866 397 -374 -4495 -6168 -968 947 1016 -5371 -5310 608 3310 1315
14561A315p754j381K632L364P007l268o368q71L069J234J397L558j391J272O389
$$ 1315 -6439 -7820 -5188 -1824 5183 1915 -4453 -5324 -2255 -1021 376 3934 2543 3815 10204
14546A0204j89l942N70J740l710P84j431j601M281K394n60k589n610p31j249o088
$$ 10204 10015 6073 6643 8383 4673 5457 4026 2425 6706 9100 8540 5951 341 -390 -1639 -7727
14530g727L543J1J168q7K075L408J339P93k166P4L845m084J033M748q27K079j2
$$ -7727 -4184 -4173 -3005 -3092 -1017 2391 3730 4523 2357 2431 6276 2192 3225 7973 7146 9225 9213
14513I213k058m713l745k448j94j461L13P67K873j112m683K85m6P92K821l94M06
$$ 9213 7155 2442 -1303 -3751 -3945 -5406 -5093 -4326 -1453 -2565 -7248 -6963 -7009 -6217 -3396 -3790 -3384
14496c384o82n65M333M75O172J189O66N10j640j511M52j032j108M154L473l85
$$ -3384 -4066 -4631 -298 177 6349 7538 8204 8714 7074 5563 6015 4983 3875 8029 11502 11117
14480A1117K22j310o112n788J636P2j602Q45L556L368m74k12m432n551r45M17
$$ 11117 11339 10029 3917 -1871 -235 -163 -1765 -920 2636 6004 5530 5318 886 -4665 -5610 -5193
14464e193M026L613M89l972j076O588J622N48j352m580J78m620l652p12L07j00
$$ -5193 -1167 2446 2935 -1037 -2113 4475 6097 6645 5293 713 891 -3729 -7381 -8093 -7786 -7886
14448g886m26M058L072j736o38J547K228M9r32M464K056l168l987m12K420M316
$$ -7886 -8312 -4254 -1182 -2918 -3556 -2009 219 268 -664 3800 5856 2688 -1299 -1711 709 5025
14432E025L668p29n605l305J737M76J636k964j609L200O172P942J032n793l261
$$ 5025 8693 7964 2359 -946 791 1267 2903 -61 -1670 1530 7702 15644 16676 10883 7622
14417G622l702j090J522J063l916J507L264M251J35m90j373j470N88r5q574j322
$$ 7622 3920 2830 4352 5415 1499 3006 6270 10521 10656 10166 8793 7323 7911 7816 -758 -2080
14401b080N991N391m426l015L086k497j410q44O78j921j871k94P162L212j417
$$ -2080 3911 9302 4876 1861 4947 2450 1040 196 874 -1047 -2918 -3212 3950 7162 5745
14386E745K023n340M87k092k369j956n245o40K370O440O308J335J973L428j870
$$ 5745 7768 2428 2915 823 -1546 -3502 -8747 -9387 -7017 -577 5731 7066 9039 12467 10597
14371A0597l431L242K29o800k592j609l322m715k143l002N877N326J338P087L124
$$ 10597 7166 10408 10637 3837 1245 -364 -3686 -8401 -10544 -13546 -7669 -2343 -1005 6082 9206
14356I206l953m955k342K270J773L753j330k584l290j435Q03r88J05Q30J192j432
$$ 9206 5253 298 -2044 226 1999 5752 4422 1838 -1452 -2887 -2084 -3072 -2967 -2137 -945 -2377
14340b377L084J629o682q10j281L151K987M238O456o787n425J599M670k938l674
$$ -2377 707 2336 -4346 -5156 -6437 -3286 -299 3939 10395 3608 -1817 -218 4452 1514 -2160
14325b160K159J050j194o06R16R14j792K733o955J055M746J970J243L81m016l24
$$ -2160 -1 1049 -145 -751 165 1079 -713 2020 -4935 -3880 866 2836 4079 4460 444 120
14309A20K671N933K105l172m665j146o81J291O723k051o143J561n72j945O07J009
$$ 120 2791 8724 10829 7657 2992 1846 1165 2456 9179 7128 985 2546 1974 29 636 1645
14293A645K182j02%j434j325l007M739M76k508j449j441K267o43O99L170K704
$$ 1645 3827 3725 3725 2291 966 -2041 2698 3174 666 -783 -2224 43 -600 99 3269 5973
14277E973n992o72k54n45J971j404o47K339M119o93n863j817n719J85O886N418
$$ 5973 -19 -691 -945 -1490 481 -923 -1570 769 4888 4195 -1668 -3485 -9204 -9019 -2133 3285
14261C285J698j755L22K939l413J706J595R97k851J664J108J539k340n42L862
$$ 3285 4983 3228 3550 6489 3076 4782 6377 7374 4523 6187 7295 8834 6494 5952 9814
14246I814K41m038j403K357k534j67O860J695k569k308L75l530l914l324Q05L877
$$ 9814 10055 6017 4614 6971 4437 4270 11130 12825 10256 7948 8323 4793 879 -2445 -1640 2237
14230B237K392N68k271k33O703l28j610K194r15n13J122r28J94l278m139P63M967
$$ 2237 4629 5197 2926 2693 9396 9068 7458 9652 8737 8224 9346 8418 8612 5334 1195 1958 6925
14213F925l057p066R51J171J715N21l680q65j252R70r9K788M396Q03O07k635j074
$$ 6925 3868 -3198 -2247 -1076 639 1160 -2520 -3385 -4637 -3667 -3766 -978 3418 4221 4828 2193 1119
14196A119j861l859K645O689l141o56o86K198K917r1j594K53k400n42K520N824
$$ 1119 -742 -4601 -1956 4733 1592 936 250 2448 5365 5274 3680 3933 1533 991 3511 9335
14180I335P52Q3k228m987j751j393J095P536L429k697J743K925q521m497l631
$$ 9335 10087 10170 7942 2955 1204 -189 906 8442 11871 9174 10917 13842 5321 824 -2807
14165b807K115k11J195j325J667N678J425k962j846l23M965J202o22o066L591
$$ -2807 -692 -903 292 -1033 634 6312 7737 4775 2929 2606 7571 8773 8151 2085 5676
14150E676K392Q27J564p394m602N422l574k038N015J04l048j058K836J716K070
$$ 5676 8068 8895 10459 3065 -1537 3885 311 -1727 3288 3392 344 -714 2122 3838 5908
14135E908k25l786q214P65J838L607L356k421l174Q95j629r73L387M370k28k801
$$ 5908 5683 1897 -6317 -5552 -3714 -107 3249 828 -2346 -1451 -3080 -4053 -666 3704 3476 675
14119F75J682O35l075L195j32K22O063l564J281M368J812l468j271k085j878l5
$$ 675 2357 2992 -83 3112 2980 3202 9265 5701 6982 11350 13162 9694 8423 6338 4460 4425
14103D425Q28j324k72P98j920L31J813m237l879n25Q89L028J773J751k339J973
$$ 4425 5253 3929 3657 4455 2535 2866 4679 442 -3437 -3962 -3073 -45 1728 3479 1140 3113
14087C113J75N89j102R36M930L907Q57k389l700q570Q25P540k80n434M177R19
$$ 3113 3288 3877 2775 3711 8641 12548 13405 11016 7316 -1254 -429 7111 6831 1397 5574 6493
14071F493J711N525n44j302K007j193m457p0j492Q82J345m75K416j075n162q767
$$ 6493 8204 13729 13185 11883 13890 12697 8240 8170 6678 7560 8905 8430 10846 9771 4609 -4158
14055d158k239L667K718M083L244n732J176L108L31J616j823N73M024O79j682
$$ -4158 -6397 -2730 -12 4071 7315 1583 2759 5867 6198 7814 5991 6564 10588 11267 9585
14040I585L30J427Q33k047j04J489j529Q47k310k362J969J82R14l172K449k8J061
$$ 9585 9915 11342 12175 10128 10024 11513 9984 10831 8521 6159 8128 8310 9224 6052 8501 8473 9534
14023I534l83R60N46k318J095j535j915K298K181p59J899J467j0520o340R106
$$ 9534 9151 10111 10657 8339 9434 7899 5984 8282 10463 9704 11603 13070 2550 -3790 5316
14008E316Q820m48l758k881M562l753l565L95k245J864o9R19J072L650N128M856
$$ 5316 14136 13688 9930 7049 11611 7858 4293 4688 2443 4307 4238 5157 6229 9879 15007 19863
13992A9863R98j767n036o100K6k220K844q70j720j432j000K809J071O44j307P79
$$ 19863 20861 19094 14058 7958 7984 5764 8608 7738 6018 4586 3586 6395 7466 8110 6803 7582
13976G582q34l803L989M951l60m566l061n82L685L918p8j126M76j549r90m461
$$ 7582 6748 2945 6934 11885 11525 6959 3898 3316 7001 10919 10841 9715 10191 8642 7652 3191
13960C191j020L859J792M834j988j628m51l102P77k90j0341J536M844k4M116P35
$$ 3191 2171 6030 7822 12656 10668 9040 8589 5487 6264 5974 -4367 -2831 2013 1989 6105 6840
13944F840l219J923N966j67o61K635Q02R76M93l148j677k868l470n15k589J621
$$ 6840 3621 5544 11510 11343 10682 13317 14119 15095 15588 12440 10763 7895 4425 3910 1321 2942
13928B942K233K802N248M495r95o888Q63L458k574k295o36n20L02K245K816m308
$$ 2942 5175 7977 13225 17720 16725 9837 10700 14158 11584 9289 8653 8133 8435 10680 13496 9188
13912I188J261Lj665K921L352J686j083m681J36j774k189l971N505J071m779m38
$$ 9188 10449 10452 8787 11708 15060 16746 15663 10982 11118 9344 7155 3184 8689 9760 4981 4543
13896D543Q059L673N07K85k853j816k626jK746J706K378m82Q51j04k838K612l466
$$ 4543 12602 16275 16782 17067 14214 12398 9772 9771 12517 14223 16601 16119 16970 16866 14028 16640 13174
13879A3174J168n17L110K380j919l815J141l265l042J124p40j534L120O201m165
$$ 13174 14342 13825 16935 19315 17396 13581 14722 11457 8415 9539 8799 7265 10385 16586 12421
13864A2421q380K472L512J121l897j398K506M054j089l856P91J255l381k066M130
$$ 12421 4041 6513 10025 11146 7249 5851 8357 12411 11322 7466 8257 9512 6131 4065 8195
13849H195K558k02L426J797k907O32l29l450J527M795L091M752j266r484m575
$$ 8195 10753 10551 13977 15774 12867 13499 13170 9720 11247 16042 19133 23885 22619 13135 8560
13834H560N398L394l53j65L98q89j223l70N08O82m182j863L126O17J142q33J584
$$ 8560 13958 17352 16999 16834 17232 16343 15120 14750 15258 15940 11758 9895 13021 13638 14780 13947 15531
13817A5531K207L1K205l84m767l399k244o146k870K636P972P457m659k586N7m729
$$ 15531 17738 17769 19974 19590 14823 11424 9180 3034 164 2800 10772 18229 13570 10984 11041 6312
13801F312l167N905J441n345J350q69M086o635k40P611L373K331M08k620J20R51
$$ 6312 3145 9050 10491 5146 6496 5627 9713 3078 2838 10449 13822 16153 16561 13941 14061 15012
13785A5012rm080l625O53L122k816J6L706j647R01R87K558j6j497K943K757K69
$$ 15012 15003 10923 7298 7951 11073 8257 8273 11979 10332 11233 12220 14778 14762 13265 16208 18965 19234
13768A9234o08R71ol96n97n952k697k678n45j739P01K421L586Q13K235J359m350
$$ 19234 18626 19597 19591 19195 18598 12646 9949 7271 6726 4987 5688 8109 11695 12508 14743 16102 11752
13751A1752K121j23n131%J783M56L477J707J959M2J951k128J036Q56j902R76M274
$$ 11752 13873 13750 8619 8619 10402 10858 14335 16042 18001 18043 19994 17866 18902 19758 17856 18832 23106
13734B3106l99K286j00l356m033j395J76k78n614l34K203k120q34n37L244K469
$$ 23106 22707 24993 24893 21537 17504 16109 16285 16007 10393 10059 12262 10142 9308 8771 12015 14484
13718A4484K203J696Q08m564n87k328q496M33L140J211N27K963K327M11J742K091
$$ 14484 16687 18383 19191 14627 14040 11712 3216 3649 6789 8000 8527 11490 13817 14228 15970 18061
13702A8061O06O074k454J7K885m247Q48K795l834J797m53n110j915j341K861J900
$$ 18061 18667 24741 22287 22304 25189 20942 21790 24585 20751 22548 22095 16985 15070 13729 16590 18490
13686A8490q53L980J812n468o231K402L145M575O556l401M84M14k893Q93k453
$$ 18490 17637 21617 23429 17961 11730 14132 17277 21852 28408 25007 25491 25905 23012 23905 21452
13671B1452m298L196K330O26l035J973K70P69L209l26K655L814j152j57L74P82
$$ 21452 17154 20350 22680 23306 20271 22244 22514 23283 26492 26166 28821 32635 31483 31326 31700 32482
13655C2482k968M2O10K821l084o450j129J397J262K432r21k897k042j727K192
$$ 32482 29514 29556 30166 32987 29903 23453 22324 23721 24983 27415 26494 23597 21555 19828 22020
13640B2020m78m10M746J367n87j887k857J141J875K255n75k236L33K643l048Q
$$ 22020 21542 21132 25878 27245 26658 24771 21914 23055 24930 27185 26610 24374 24707 27350 24302 24310
13624B4310N42J869L432j661m624k821L139M518L268l507k900K481p21L46Q149
$$ 24310 24852 26721 30153 28492 23868 21047 24186 28704 31972 28465 25565 28046 27325 27671 35820
13609C5820j284n476m054l841O41O45l3M016M712r49P80k482Q88L93J308o6l129
$$ 35820 34536 29060 25006 21165 21806 22451 22418 26434 31146 30197 30977 28495 29383 29776 31084 31018 27889
13592B7889M568Q96n42k723p21L296J617R25j55k681k198j981j347m286l274J34
$$ 27889 32457 33353 32811 30088 29367 32663 34280 35205 35050 32369 30171 28190 26843 22557 19283 19417
13576A9417O17p31M064N013K82M772R38j979j415m910m17M583J661K905l734K179
$$ 19417 20034 19303 23367 28380 28662 33434 34372 32393 30978 26068 25651 30234 31895 34800 31066 33245
13560C3245L909j331k610l466o938l216P53L567q72j084L236J005n115j053J720
$$ 33245 37154 35823 33213 29747 22809 19593 20346 23913 23041 21957 25193 26198 21083 20030 21750
13545B1750L141p61K796M888K25L660Q2p282k446J209l866m61M798Q6n557K884
$$ 21750 24891 24130 26926 31814 32039 35699 35781 28499 26053 27262 23396 22935 27733 27819 22262 25146
13529B5146k142j679p34L397j063j627j780j724K266K703P188M84k969J870L020
$$ 25146 23004 21325 20591 23988 22925 21298 19518 17794 20060 22763 29951 30435 27466 29336 32356
13514C2356j944m527k950l41r59k27N18M090L397J504j676l962N25R9P01L564
$$ 32356 30412 25885 22935 22594 21635 21408 21926 26016 29413 30917 29241 25279 25804 25903 26604 30168
13498C0168k134k199k097l86K152j109O77M377m45l317m812N929N819J372Q869
$$ 30168 28034 25835 23738 23352 25504 24395 25072 29449 29004 25687 20875 26804 32623 33995 42864
13483D2864L670Q90L477J724L00P293O190Q326J3918J2759J3061K2684J8391J0902
$$ 42864 46534 47424 50901 52625 52925 60218 66408 74734 88652 101411 114472 137156 155547 166449
13469A66449l012j4874j8369j9611j5218j5259j3389N54L788J494m847l302j817
$$ 166449 163437 148563 130194 110583 95365 80106 66717 67271 71059 72553 67706 64404 62587
13456F2587m604M07R45k424l628j376L796J327L466L358j31L44O401Q368N811
$$ 62587 57983 58390 59335 56911 53283 51907 55703 57030 60496 63854 63723 64067 70468 78836 84647
13441H4647N626J9582K3556K8869L9141M1148L7808K5318R350j4117l5973m9299
$$ 84647 90273 109855 133411 162280 201421 242569 280377 305695 315045 300928 264955 215656
13429B15656m1121k3950k4746j6385n056m131o189o327q117p700o90J399q68k52
$$ 215656 174535 150585 125839 109454 104398 100267 94078 87751 79634 71934 71244 72643 71775 71523
13415G1523L434k031j2m481l049J503n456J536J543L984M241R238J1800J0422
$$ 71523 74957 72926 72914 68433 65384 66887 61431 62967 64510 68494 72735 81973 93773 104195
13401A04195J0144J8891K0339K0308J1857J909r180k0205k6122j9419j7346j0643
$$ 104195 114339 133230 153569 173877 185734 187643 178463 158258 132136 112717 95371 84728
13389H4728n642l568k284L876l43o071o190l360n444N78K361o352m49j83l184
$$ 84728 79086 75518 73234 77110 76767 70696 64506 61146 55702 56280 58641 52289 51840 51657 48473
13374D8473l279J455j425j209K844j060J638L289j437o347J570k983j589K452
$$ 48473 45194 46649 45224 44015 46859 45799 47437 50726 49289 42942 44512 41529 39940 42392
13360D2392L212K703j393j313K720k143k921j18O262j406k211R10L402K068l813
$$ 42392 45604 48307 46914 45601 48321 46178 43257 43139 49401 47995 45784 46694 50096 52164 48351
13345D8351j117o7K724J084m045o321k426K868M802K275L287m453o399J16K681
$$ 48351 47234 47167 49891 50975 46930 40609 38183 41051 45853 48128 51415 46962 40563 40679 43360
13330D3360R28j614L26M547J209j807J24P63M289K616k075P31m533r345J08M828
$$ 43360 44288 42674 43000 47547 48756 46949 47073 47836 52125 54741 52666 53397 48864 39519 39627 44455
13314D4455j642k55R98m83Q18K614K188K531J233R42k739R58m279m341j44r84
$$ 44455 42813 42558 43556 43073 43891 46505 48693 51224 52457 53399 50660 51618 47339 42998 42854 41870
13298D1870m528K035K588K768K554m651j343k604m561K175O982N436K107N949
$$ 41870 37342 39377 41965 44733 47287 42636 41293 38689 34128 36303 43285 48721 50828 56777
13284E6777K30l00J276l731j74L751N454N110R55j142m734j871j934j857J140
$$ 56777 57007 56707 57983 54252 54078 57829 63283 68393 69348 68206 63472 61601 59667 57810 58950
13269E8950j425m566P32J429K11l344J79M2j233l409N997r50n993J479K717K728
$$ 58950 57525 52959 53691 55120 55331 51987 52166 52208 50975 47566 53563 52613 46620 48099 50816 53544
13253E3544J427J904n055k329L986J016m95N867J748J796M871O974L851O527M919
$$ 53544 54971 56875 51820 49491 53477 54493 53998 59865 61613 63409 68280 75254 79105 85632 90551
13238I0551J665m404q186r83O76k644r554k656K82M963O50o062m778l933O85J20
$$ 90551 92216 87812 79626 78643 79319 76675 67121 64465 64747 69710 70360 64298 59520 55587 56272 56392
13222E6392K563p76K769J627L560m60k959j118M752R618M825l591m670L25L403
$$ 56392 58955 58179 60948 62575 66135 65675 62716 61598 66350 75968 80793 77202 72532 72857 76260
13207G6260M787O530N690L204j586j348k798n93q95j209o87L355j802J477m022
$$ 76260 81047 87577 93267 96471 94885 93537 90739 90146 89251 88042 87355 90710 88908 90385 86363
13192H6363l314o68J363Q85L371q947q110J708o68l482K110k782J982N031Q543
$$ 86363 83049 82381 83744 84629 88000 79053 70943 72651 71983 68501 70611 67829 69811 74842 83385
13177H3385L485N12P76N79j684j933n579l755O372O205q34o32j882p98O840P65
$$ 83385 86870 87382 88158 88737 87053 85120 79541 75786 82158 88363 87529 86897 85015 84217 91057 91822
13161I1822N410R152J348j356k579K953K6N553Q694N289K348Q8j564k697l121
$$ 91822 97232 106384 107732 106376 103797 106750 106776 112329 121023 126312 128660 128748 127184 124487 121366
13146A21366l581n56k545R41k94l63k398R8K422N540l600k111J473M802j57k032
$$ 121366 117785 117229 114684 115625 115331 114968 112570 112668 115090 120630 117030 114919 116392 121194 121037 119005
13130A19005L928L091O587J527K214K618M113Q88n52K399m41j734O786P795O813
$$ 119005 122933 126024 132611 134138 136352 138970 143083 143971 143419 145818 145377 143643 150429 158224 165037
13115A65037P760P172Q406P212M895K429m231n011p042m668o099j699N280K695
$$ 165037 172797 179969 188375 195587 200482 202911 198680 193669 186627 181959 175860 174161 179441 182136
13101A82136J157K282J132k482j683k653k479O55N851J1360N792O862J18L588
$$ 182136 183293 185575 186707 184225 182542 179889 177410 178065 183916 195276 201068 207930 208048 211636
13087B11636L063N270j803j541K378k522l732M869Q930P759M530M708J1874J6881
$$ 211636 214699 219969 218166 216625 219003 216481 212749 217618 226548 234307 238837 243545 255419 272300
13073B72300Q826M450M096J230M592M473L60P994J2589O239Q684J2132J4904R318
$$ 272300 281126 285576 289672 290902 295494 299967 300327 308321 320910 327149 335833 347965 362869 372187
13059C72187J2074J5729R933Q847J2169J7546K0106K2277K5781K5114L2739L2282
$$ 372187 384261 399990 409923 418770 430939 448485 468591 490868 516649 541763 574502 606784
13047F06784L3147L7775L8833M2391N1471O1390P1162R2061J16551J37946J64800
$$ 606784 639931 677706 716539 758930 810401 871791 942953 1035014 1151565 1289511 1454311
13036A454311K06560K59979L24379M10942N17470O61413Q65876J180238J696712
$$ 1454311 1660871 1920850 2245229 2656171 3173641 3835054 4700930 5881168 7577880
13027G577880K478251L471953M291687M367534L528836K081474J50867k190239
$$ 7577880 10056131 13528084 17819771 22187305 25716141 27797615 27948482 25758243
13019B5758243m061838m504299l722466k618122j751406j185392q38673o24970
$$ 25758243 21696405 17192106 13469640 10851518 9100112 7914720 7076047 6451077
13011F451077m70874l41994k32590j46558j01379o6069l5638q652L182L5269R6246
$$ 6451077 5980203 5638209 5405619 5259061 5157682 5091613 5055975 5047323 5050505 5085774 5182020
13000E182020J74386K71688L89210N28796P08611R44051J277594J778771K572775
$$ 5182020 5356406 5628094 6017304 6546100 7254711 8198762 9476356 11255127 13827902
12991A3827902L831593N672646P790598R174128Q753055O529054L162921j225423
$$ 13827902 17659495 23332141 31122739 40296867 49049922 55578976 58741897 57516474
12983E7516474o092440r370336r505371p409854n023276l294875k242142j625292
$$ 57516474 51424034 42053698 32548327 25138473 20115197 16820322 14578180 12952888
12975A2952888j262376j005359q10787o52178n34363m33088l29380k35621j70637
$$ 12952888 11690512 10685153 9874366 9222188 8687825 8254737 7925357 7689736 7519099
12966G519099j37448j20902j10074j12279j05311m7854O4660K08904L90284O21349
$$ 7519099 7381651 7260749 7150675 7038396 6933085 6885231 6949891 7158795 7549079 8170428
12956H170428R47050J434673K174574L178334M180964M603381M028867K660773
$$ 8170428 9117478 10552151 12726725 15905059 20086023 24689404 28718271 31379044
12948C1379044P82802j600062l933354n034649m564156l374979k307439j581338
$$ 31379044 32161846 30561784 26628430 21593781 17029625 13654646 11347207 9765869
12940I765869j132938q67573o97982n73882m82124m08602l53434l11181k77421
$$ 9765869 8632931 7765358 7067376 6493494 6011370 5602768 5249334 4938153 4660732
12931D660732k47934k25761k04272j88793j74997j60402j52019j42762j34395
$$ 4660732 4412798 4187037 3982765 3793972 3618975 3458573 3306554 3163792 3029397
12922C029397j17932j17906j09731r9780r3159q5446p6311p6465q0697p3587o0841
$$ 3029397 2911465 2793559 2683828 2584048 2490889 2405443 2329132 2252667 2171970 2098383 2037542
12911B037542n7878o0506n4145n3540n4460n4801n7233n2855n1112n2274m4454
$$ 2037542 1979664 1919158 1865013 1811473 1757013 1702212 1644979 1592124 1541012 1488738 1444284
12900A444284m1955l7350l9840l9253l6026l8823l9709l7091l8068l1807l4118
$$ 1444284 1402329 1364979 1325139 1285886 1249860 1211037 1171328 1134237 1096169 1064362 1030244
12889A030244l1309k6215k3825k6191k2732k9066k8537k1078k0244k0141j2754
$$ 1030244 998935 972720 948895 922704 899972 870906 842369 821291 801047 780906 768152
12878G68152j1940j4772k0713j7970j8416j9450j8171k0435k4684k3628j8935
$$ 768152 756212 741440 720727 702757 684341 664891 646720 626285 601601 577973 559038
12867E59038j8164k5053k1533j9312q160p105o306r100j7926j8634j5795k2134
$$ 559038 540874 515821 494288 474976 466816 459711 453405 444305 426379 407745 391950 369816
12855C69816j6634j4824j2828j2840j2645j0008n482p158o922l808n837k601L83
$$ 369816 353182 338358 325530 312690 300045 290037 284555 277397 270475 266667 260830 258229 258612
12842B58612j091j196J340k111n901q027r720o414n955o699m241l967k910o932
$$ 258612 257521 256325 257665 255554 249653 241626 231906 225492 219537 212838 208597 204630 201720 194788
12828A94788n131k544q160k938J2427J0306J120j856k579n412n635l055j48R69
$$ 194788 189657 187113 178953 176015 188442 198748 199868 198012 195433 190021 184386 181331 181183 182152
12814A82152P442J7061L1110M3179M3212M9962N3513M5992L4893K4661O230l613
$$ 182152 189594 206655 237765 280944 324156 374118 427631 473623 508516 533177 539407 535794
12802E35794k0086m3416n1760n0014m6504m0420l8403k4364j4416j3813o237o633
$$ 535794 515708 472292 420532 370518 324014 283594 245191 220827 206411 192598 186361 179728
12790A79728m933O03j074k273m470j505p647r814p319j664o206r174q635j778
$$ 179728 174795 175398 174324 172051 167581 166076 158429 148615 141296 139632 133426 124252 115617 113839
12776A13839j218k446k021n05j748k879N13L946n360o943j703J382J846l275o628
$$ 113839 112621 110175 108154 107649 105901 103022 103535 107481 102121 95178 93475 94857 96703 93428 86800
12761H6800J260L739m243L095L721P62K35J818L234K633n95j0040j026L750K158
$$ 86800 88060 91799 87556 90651 94372 95134 95369 97187 100421 103054 102459 92419 91393 95143 97301
12746I7301k229k777j825J353o081l991K547M833l569o408l696J173J897J707
$$ 97301 95072 92295 90470 91823 85742 81751 84298 89131 85562 79154 75458 76631 78528 80235
12732H0235j471L27m164j161l260k594l367o796J914J714K305O804m835N90K816
$$ 80235 78764 79091 74927 73766 70506 67912 64545 57749 59663 61377 63682 70486 65651 66241 69057
12717F9057J67J495J208j134l065J97K48L40L586j320o183o943n659K466j021
$$ 69057 69224 70719 71927 70793 67728 67925 68173 68513 72099 70779 64596 57653 51994 54460 53439
12702E3439k594J520N033J3p93m490j642j435o019Q03n655j27m99j923K435L744
$$ 53439 50845 52365 57398 57411 56618 52128 50486 49051 43032 43835 38180 38053 37554 35631 38066 41810
12686D1810n97J024n306k74Q207K744K755J878N02j406m081L63J603j915m38k968
$$ 41810 41213 42237 36931 36657 44864 47608 50363 52241 52743 51337 47256 47619 49222 47307 46869 43901
12670D3901l906K753M654J2J542k601k819j844j828j617j870k342M203J647J543
$$ 43901 39995 42748 47402 47414 48956 46355 43536 41692 39864 38247 36377 34035 38238 39885 41428
12655D1428o11L99L013L26L734O422N04K591K225K829N279Q909J1113R501O161
$$ 41428 40817 41216 44229 44555 48289 54711 55215 57806 60031 62860 68139 77048 88161 97662 103823
12640A03823L203j921R56L236k688j0520q072l563k746p368m296r15p195L282
$$ 103823 107026 105105 106061 109297 106609 96089 88017 84454 81708 74340 70044 69129 61934 65216
12626F5216K517k588o487o249R14j129k377l86n55M861L893J357L763j270O68
$$ 65216 67733 65145 58658 52409 53323 52194 49817 49431 48876 53737 57630 58987 62750 61480 62148
12611F2148J037m6r8J88p31K662j92j757k559J690L370J409j20K860J638P59J78
$$ 62148 63185 63139 63041 63229 62498 65160 64968 63211 60652 62342 65712 67121 67001 69861 71499 72258 72436
12594G2436P0K018r39m049L4L386o258n021l695k086J748L765L546M239O586R756
$$ 72436 72506 74524 73585 69536 69570 72956 66698 61677 57982 55896 57644 61409 64955 69194 75780 85536
12578H5536P824O186J494M056J0882N728L785J4722J7407K2369J5428J5714J2026
$$ 85536 93360 99546 101040 105096 115978 121706 125491 140213 157620 179989 195417 211131 223157
12565B23157O93l126j1598j2820r858j5115j6480r518n148m830l377l228k287
$$ 223157 223850 220724 209126 196306 186448 171333 154853 145335 140187 135357 131980 128752 126465
12552A26465M850N668m486k037k938k311n291m600j018N89k883M50J670R336R234
$$ 126465 131315 136983 132497 130460 127522 125211 119920 115320 114302 114891 112008 112458 114128 123464 132698
12537A32698J0287J2091J5217K5802L8408M0415M5561M1974K3427o59j8102l4167
$$ 132698 142985 155076 170293 196095 234503 274918 320479 362453 385880 385221 367119 332952
12525C32952l9823l3787k0908j4597r308K081K108K009O987P396M656O270M231
$$ 332952 293129 259342 238434 223837 214529 216610 218718 220727 227714 235110 239766 246036 250267
12512B50267N219l459k640L50p578n873m138q92m286j616K692m57N168O031R784
$$ 250267 255486 252027 249387 249737 242159 236286 232148 231256 226970 225354 228046 227589 232757 238788 248572
12497B48572J5475J7469J8017K1170J3948M415k376j4956k6745k2239j6232j3122
$$ 248572 264047 281516 299533 320703 334651 339066 336690 321734 294989 272750 256518 243396
12485B43396j2946j1951k906m374o541j913l230J820o75K538M110L336J693K687
$$ 243396 230450 218499 215593 211219 204678 202765 199535 201355 200680 203218 207328 210664 212357 215044
12471B15044M598O044L079K932P326L551O423N907L109O474P204O187L747L722
$$ 215044 219642 225686 228765 231697 239023 242574 248997 254904 258013 264487 271691 277878 281625 285347
12457B85347J862M659k904K825J1422M879J944P283Q348N855J0210N960N877P981
$$ 285347 287209 291868 288964 291789 303211 308090 310034 317317 325665 331520 341730 347690 353567 361548
12443C61548R285O639M819J4885J4398J7775K0082J8049J6392K1434J9266J4287
$$ 361548 370833 377472 382291 397176 411574 429349 449431 467480 483872 505306 524572 538859
12431E38859J0562J9171K0708J8811L1806M2498L9768L7433M7115M6261M4500
$$ 538859 549421 568592 589300 608111 639917 682415 722183 759616 806731 852992 897492
12420H97492M8729N3862N6244O2960P2257R0636J01083J11047J28411J44188J75408
$$ 897492 946221 1000083 1056327 1119287 1191544 1282180 1383263 1494310 1622721 1766909 1942317
12409A942317K16784K59350L19546L92048M60180N33021O01512O59240P21599
$$ 1942317 2159101 2418451 2737997 3130045 3590225 4123246 4724758 5383998 6105597
12400F105597Q00717R29582J136420J475428K054058K963790M265448N865709
$$ 6105597 6906314 7835896 8972316 10447744 12501802 15465592 19731040 25596749
12392B5596749P570678R162582J0353002J0720829R909534P898577N024296J635117
$$ 25596749 33167427 42330009 52683011 63403840 73313374 81211951 86236247 87871364
12384H7871364k001184n455330q090893r508441r768800r177248p965472o354277
$$ 87871364 85870180 80414850 72323957 62815516 53046716 43869468 35903996 29549719
12376B9549719m673766l266417k280478j656704j289521j088991r84581r37740
$$ 29549719 24875953 21609536 19329058 17672354 16382833 15293842 14309261 13371521
12368A3371521r06152q79304q43506p82952o97192o16479n32322m71705m15420
$$ 13371521 12465369 11586065 10742559 9959607 9262415 8645936 8113614 7641909 7226489
12359G226489l68032l36270l14399k85564k63592k44068k21410k00739j86182
$$ 7226489 6858457 6522187 6207788 5922224 5658632 5414564 5193154 4992415 4806233
12350D806233j69636j55325j39581j28994j19405j17558j17151j13373j13518
$$ 4806233 4636597 4481272 4341691 4212697 4093292 3975734 3858583 3745210 3631692
12341C631692j17847j22346j15440j13934j08214j01511r3349q7425q4489p9998
$$ 3631692 3513845 3391499 3276059 3162125 3053911 2952400 2859051 2771626 2687137 2607139
12331B607139p8764p3305p5229p5831p5532p2138o5556o1034o1195n8023n6990
$$ 2607139 2528375 2455070 2379841 2304010 2228478 2156340 2090784 2029750 1968555 1910532 1853542
12320A853542n4141n0623n2424n4126n4222m9986m3066m5963m1741m4850m8014
$$ 1853542 1799401 1748778 1696354 1642228 1588006 1538020 1494954 1448991 1407250 1362400 1314386
12309A314386m5514l9616l5880l2961l3184k5567k0129l0332k9487k8570k0708
$$ 1314386 1268872 1229256 1193376 1160415 1127231 1101664 1081535 1051203 1021716 993146 972438
12298I72438k0029l0668k4871k1945k0413j9298k3015k1886j9875k2494j6053
$$ 972438 952409 921741 896870 874925 854512 835214 812199 790313 770438 747944 731891
12287G31891j3654j8948k2464j4675p980j2456j1579n814j2347j1883j4020j3588
$$ 731891 718237 699289 676825 662150 654170 641714 630135 624321 611974 600091 586071 572483
12275E72483j1708j3055j6551k1056j9796k5694k1803k1138j8230j6459j5076
$$ 572483 560775 547720 531169 510113 490317 464623 442820 421682 403452 386993 371917
12264C71917j8108j7155j7995j6963j8566j7055j6057j5736j4174j6748k0533
$$ 371917 353809 336654 318659 301696 283130 266075 250018 234282 220108 203360 182827
12253A82827j9525j5474j1398m056m21n544k027J09J327l013k364J215j715J152
$$ 182827 163302 147828 136430 132374 131953 126409 124382 124491 125818 122805 120441 121656 119941 121093
12239A21093l215n854l382m282j148k433K351J653j608m939j338j959M94N471
$$ 121093 117878 112024 108642 104360 103212 100779 103130 104783 103175 98236 96898 94939 95433 100904
12225A00904K676K804k103j980O52l543n906m856n263o672k933o523m432J26m323
$$ 100904 103580 106384 104281 102301 102953 99410 93504 88648 83385 76713 73780 67257 62825 62951 58628
12210E8628m797J907L687r05L50J64k340K665N063J824Po95l355k868l114M531
$$ 58628 53831 55738 59425 58520 58870 59034 56694 59359 64422 66246 66253 65558 62203 59335 56221 60752
12194F0752O240k996l58j085L383N261M263k052J562K057N73J853l295q568p590
$$ 60752 66992 63996 63638 62553 65936 71197 75460 73408 74970 77027 77600 79453 76158 67590 60000
12179F0000n48P44k847k699k172J580n47J856K644J587n49l122o60J137l633o44
$$ 60000 59452 60196 57349 54650 52478 54058 53511 55367 58011 59598 59049 55927 55267 56404 52771 52127
12163E2127J056l595n088K433k602J856P348J611j070M299M519J97M08j005O982
$$ 52127 53183 49588 44500 46933 44331 46187 53535 55146 54076 58375 62894 63091 63499 62494 69476
12148F9476O555k255J801P15l525n148n068m214k678J05m047L763N207k118n126
$$ 69476 76031 73776 75577 76292 72767 67619 62551 58337 55659 55764 51717 55480 60687 58569 53443
12133E3443q05j471N42j097m390l349k336j928l75N253n327r643q905o58K548
$$ 53443 52638 51167 51709 50612 46222 42873 40537 38609 38234 43487 38160 28517 19612 18954 21502
12118B1502K205k355o492L764M753M67K323k301j681q258p101M2K977K046k340
$$ 21502 23707 21352 14860 18624 23377 23844 26167 23866 22185 13927 6826 6868 9845 11891 9551
12103I551K978N096J662o337k795M415K480j86n206j104K478k328M333M187J43
$$ 9551 12529 17625 19287 12950 10155 14570 17050 16864 11658 10554 13032 10704 15037 19224 19367
12088A9367n849q68P66n96J32J057J360M642M847L377O48J027l964m673J842P5
$$ 19367 13518 12650 13416 12820 12952 14009 15369 20011 24858 28235 28883 29910 25946 21273 23115 23190
12072B3190k009N008L421j115o98j53n234p975k705K430R98k064m151k467j047
$$ 23190 21181 26189 29610 28495 27797 27644 22410 14435 11730 14160 15158 13094 8943 6476 5429
12057E429N826Q83o142m472J493k037O83K279o48K530L471M469J350j495J031
$$ 5429 11255 12138 5996 1524 3017 980 1663 3942 3294 5824 9295 13764 15114 13619 14650
12042A4650k435m218L137L72k048l226K192N114K823m428k505J09l148j018L908
$$ 14650 12215 7997 11134 11506 9458 6232 8424 13538 16361 11933 9428 9537 6389 5371 9279
12027I279K827J14K337k015j043M787J183J961M27j303k148P15L678M138R758
$$ 9279 12106 12220 14557 12542 11499 16286 17469 19430 19857 18554 16406 17121 20799 24937 34695
12012C4695m22q82O710P504J3328J1492R34J406N443O090M144Q88l666q600q399
$$ 34695 34273 33391 40101 47605 60933 72425 73359 74765 80208 86298 90442 91330 87664 79064 70665
11997G0665J794o7j0658j2144n569j838n729l545J468N580L842k435R33k81L736
$$ 70665 72459 72392 61734 49590 44021 42183 36454 32909 34377 39957 43799 41364 42297 42016 45752
11982D5752J858m896j202L776O062P044R024N806P142J0667K757O128J6476J3410
$$ 45752 47610 42714 41512 45288 51350 58394 67418 73224 80366 91033 93790 99918 116394 129804
11968A29804K9379L8619M1724N2233N4312M6461M0690K9631J9060j479k2968l5403
$$ 129804 159183 197802 239526 291759 346071 392532 433222 462853 481913 480434 457466 422063
11956D22063m7439m7789m6426m2294l6889l0748k7736j2296r451j0199m152k888
$$ 422063 374624 326835 280409 238115 201226 170478 142742 130446 120995 110796 106644 103756
11944A03756m349o335q741o358m497k166k590n422m401m873p42J820k481j607
$$ 103756 99407 93072 84331 77973 73476 71310 68720 63298 58897 54024 53282 55102 52621 51014
11930E1014l864j627L244K952l762K652j19m063p99M828k48m957K23K43l124j265
$$ 51014 47150 45523 48767 51719 47957 50609 50490 46427 45628 50456 50208 45251 45474 45717 42593 41328
11914D1328M641L245j34j074j326q66J788M75j238l837r06k369K483K947j283
$$ 41328 45969 49214 49080 48006 46680 45814 47602 48077 46839 43002 42096 39727 42210 45157 43874
11899D3874k967P231P684R095Q487k876K970K981L69J013J1587J1436J2315J6285
$$ 43874 40907 48138 55822 64917 73404 70528 73498 76479 76848 77861 89448 100884 113199 129484
11885A29484J5356J4552J4017J6245J9229K5283K3362L0580L6041M9777P2743
$$ 129484 144840 159392 173409 189654 208883 234166 257528 288108 324149 373926 446669
11874D46669J06335J46610J88271K32039K70321K90613K94929K57106J89929J04185
$$ 446669 553004 699614 887885 1119924 1390245 1680858 1975787 2232893 2422822 2527007
11864B527007Q57r4795j83151k45725k74537k73553k40563k02855j59458j18892
$$ 2527007 2527864 2433069 2249918 2004193 1729656 1456103 1215540 1012685 853227 734335
11854G34335q8733o2218m7199l9186l0384k7123l0739k7619k5032k3841k3939
$$ 734335 645602 583384 536185 496999 466615 439492 408753 381134 356102 332261 308322
11843C08322k1651j5080j0351j1111j6213j8038q723q815j3603n075r343j809
$$ 308322 286671 271591 261240 250129 233916 215878 207155 198340 184737 179662 170319 168510
11831A68510J799o520p192m187n641j0721q042k964j615K332n519n470p156l278
$$ 168510 170309 163789 156597 152410 146769 136048 128006 125042 123427 125759 120240 114770 107614 104336
11817A04336M609J188m391q148o36M355J111k787j547n230j0794j500P89NJ573
$$ 104336 108945 110133 105742 97594 96958 101313 102424 99637 98090 92860 82066 80566 81355 81360 82933
11802H2933k644p612n600j320l740J75K794J130j581K54l766k770M740M510o33
$$ 82933 80289 72677 67077 65757 62017 62192 64986 66116 64535 64789 61023 58253 62993 67503 66870
11787F6870o00j015j566k845K538K740L772k121r749k641J725l768l050p64j939
$$ 66870 66270 65255 63689 60844 63382 66122 69894 67773 58024 55383 57108 53340 50290 49526 47587
11772D7587J090L5n965l110l973k326j41J373P30M345K63m505k450k329K09J403
$$ 47587 48677 48712 42747 39637 35664 33338 33197 34570 35300 39645 39908 35403 32953 30624 30833 32236
11756C2236q03L961L256o488j292P07O673K110k33j196P90n152o248l288k022
$$ 32236 31433 35394 38650 32162 30870 31577 38250 40360 40127 38931 39721 34569 28321 25033 23011
11741B3011L174J068L823m585m814K55L275q10Q1n63j635L580j867m69K070m017
$$ 23011 26185 27253 31076 26491 21677 21932 25207 24397 24478 23915 22280 25860 23993 23524 25594 21577
11725B1577n397M137K795L829N157J253m876L358K103k722m157o879J038M540
$$ 21577 16180 20317 23112 26941 32098 33351 28475 31833 33936 31214 27057 20178 21216 25756
11711B5756M402N37l83r45K723K104r51q65j036m070J556K850R93m50L50m724
$$ 25756 30158 30695 30312 29367 32090 34194 33243 32378 31342 27272 28828 31678 32671 32221 32571 27847
11695B7847k345k787R95M410j825n258N34K78j134k287l04K001L322J887k498
$$ 27847 25502 22715 23710 28120 26295 21037 21571 21849 20715 18428 18124 20125 23447 25334 22836
11680B2836n255j425K076M046j214j888N127K865k631J227k062J448J15l417J188
$$ 22836 17581 16156 18232 22278 21064 19176 24303 27168 24537 25764 23702 25150 25265 21848 23036
11665B3036l30N363k923l199j44L263J239L576Q62K047J153K811k198p699n209
$$ 23036 22706 28069 25146 21947 21803 25066 26305 29881 30743 32790 33943 36754 34556 26857 21648
11650B1648O094J445p463m030M525K652L833k714q34r29M051P619q26m218j463
$$ 21648 27742 29187 21724 17694 22219 24871 28704 25990 25156 24227 28278 35897 35071 30853 29390
11635B9390K77m64k370m260K605n40l222p5k656k175N631O724m188j105K141O7
$$ 29390 29667 29203 26833 22573 25178 24638 21416 21341 18685 16510 22141 28865 24677 23572 25713 25780
11619B5780j946j807K574l61l350j635l509m282M884J391j946J356j800K778R737
$$ 25780 23834 22027 24601 24240 20890 19255 15746 11464 16348 17739 15793 17149 15349 18127 27864
11604B7864k247L23j204m789L519M750N895J442l273M39q35j509j978J794l011
$$ 27864 25617 25940 24736 19947 23466 28216 34111 35553 32280 32719 31884 30375 28397 30191 27180
11589B7180R69P99K010l740M558K164n318j315J341j923l737p80R052M479l056
$$ 27180 28149 28948 30958 27218 31776 33940 28622 27307 28648 26725 22988 22208 31260 35739 32683
11574C2683n502k182K68N836L330n64k425L16J276j971P51n545J130L219K274
$$ 32683 27181 24999 25267 31103 34433 33869 31444 31760 33036 31065 31816 26271 27401 30620 32894
11559C2894K579L240j622j765K43k104K90o89J621m98M018o24k939j279J052j288
$$ 32894 35473 38713 37091 35326 35569 33465 33755 33066 34687 34189 38207 37583 34644 33365 34417 33129
11543C3129k235j795Q13R6J727j648o34j249L392K466m299p02K988l092n17K143
$$ 33129 30894 29099 29912 30008 31735 30087 29453 28204 31596 34062 29763 29061 32049 28957 28440 30583
11527C0583K645n3n702Q82J496n69L984M194J952j4J92m047J660O283K280k500
$$ 30583 33228 33175 27473 28355 29851 29282 33266 37460 39412 39398 39590 35543 37203 43486 45766 43266
11511D3266m134j077o162l988K73O008K430l452K098M037k123K130M6o997L776
$$ 43266 39132 38055 31893 27905 28178 34186 36616 33164 35262 39299 37176 39306 39352 32355 36131
11496C6131L169P11j892k195J802N140k347R07k799l477M651Q309M22n550p584
$$ 36131 39300 40011 38119 35924 37726 42866 40519 41426 38627 35150 39801 48110 48532 42982 35398
11481C5398j695L070j037k90k752J78l69m135j292K23N105M447L217j008l514
$$ 35398 33703 36773 35736 35446 32694 32872 32503 28368 27076 27299 32404 36851 40068 39060 35546
11466C5546J815K830M716l4j156K428K545j356j339J964K221j278J59J561k769
$$ 35546 37361 40191 44907 44873 43717 46145 48690 47334 45995 47959 50180 48902 49061 50622 47853
11451D7853k952r53j443N737M753L139K153l000Q74N086k442o260R41j015n467
$$ 47853 44901 43948 42505 48242 52995 56134 58287 55287 56161 61247 58805 52545 53486 52471 47004
11436D7004k544j975J253K39k700m61r78L93J597k39P106M532r56n325j385M602
$$ 47004 44460 42485 43738 43977 41277 40816 39838 40231 41828 41589 48695 53227 52271 46946 45561 50163
11420E0163M764l771l266k040M462L6n05k399k18N403J293k678m427m000M455
$$ 50163 54927 51156 47890 45850 50312 50348 49843 47444 47226 52629 53922 51244 46817 42817 47272
11405D7272j094l203J429k581k417j52L522m526j572L280K42K607j062J633M795
$$ 47272 46178 42975 44404 41823 39406 39254 42776 38250 36678 39958 40200 42807 41745 43378 48173
11390D8173O289l181K501l504k731J531L856M195l87n516p775L883L798l470J076
$$ 48173 54462 51281 53782 50278 47547 49078 52934 57129 56742 51226 43451 47334 51132 47662 48738
11375D8738k750k68l952O30O303M081M399j361q65l826j100O787N961p32k098
$$ 48738 45988 45720 41768 42398 48701 52782 57181 55820 54955 51129 50029 56816 62777 62045 59947
11360E9947l411j162j268M08L196L760J260j264l886k690m37K711l25k201M068
$$ 59947 56536 55374 54106 54514 57710 61470 62730 61466 57580 54890 54453 57164 56839 54638 58706
11345E8706M262M90J435l76L461Q760n705o896j190J309J009J773R558R677M814
$$ 58706 62968 63458 64893 64517 67978 76738 71033 64137 62947 64256 65265 67038 76596 86273 91087
11330I1087R339J6964K0970K1611J9043J4750P350k942j2990j9199j5011j2276
$$ 91087 100426 117390 138360 159971 179014 193764 201114 198172 185182 165983 150972 138696
11318A38696j3704j3813j1703l619M844j869l395o104l1M973L466M665l18l127
$$ 138696 124992 111179 99476 95857 100701 98832 95437 89333 89302 94275 97741 102406 102088 98961
11304I8961N59J212Q614O653J0545R737J3851J8536K2363L6060N6418O3145O7324
$$ 98961 99520 100732 109346 115999 126544 136281 150132 168668 191031 227091 283509 346654 413978
11291D13978N7729M4499K6722k767k7763m2198m8260m7152m4319m1170l0148k6203
$$ 413978 471707 516206 542928 540161 512398 470200 421940 374788 330469 289299 259151 232948
11279B32948k0866j1974r868r309n044n353j295k340k703m888M320J3251J3166
$$ 232948 212082 200108 190240 180931 175887 170534 169239 166899 164196 159308 163628 176879 190045
11266A90045K1232K7698L0530L0875M2041M1607L6626K8963K2673J8101L693j0608
$$ 190045 211277 238975 269505 300380 342421 384028 420654 449617 472290 490391 494084 483476
11254D83476j5586k1294l0209l1736k8246l3459l2584k5259j7178j9595j5963
$$ 483476 467890 446596 416387 384651 356405 322946 290362 265103 247925 228330 212367
11243B12367j3555j2228o618n287j570K85L018L624N81J258N944J650L787J2910
$$ 212367 198812 186584 179966 174679 173109 173394 176412 180036 180617 181875 187819 189469 193256 206166
11229B06166K3852L1885L4224J8033J1292j593j9642l7931l7365k6883j7928j3465
$$ 206166 230018 261903 296127 314160 325452 323859 304217 266286 228921 202038 184110 170645
11217A70645j1329j2094o842J110m161k765k864j5L812k325j1820p865K802o927
$$ 170645 159316 147222 140380 141490 137329 134564 131700 131685 135497 133172 121352 113487 116289 109362
11203A09362k976K840r378l740Q858K946l199K763j191K982j368o950k631o426
$$ 109362 106386 109226 99848 96108 104966 107912 104713 107476 106285 109267 107899 100949 98318 91892
11189I1892j301M173L986L42R12p30K081k973q020j585O297q17k127j173J542
$$ 91892 90591 94764 98750 99092 100004 99274 101355 98382 90362 88777 95074 94257 92130 90957 92499
11174I2499L996J337l0L297j148L307K217j260k290M501M316J622q87j033J081
$$ 92499 96495 97832 97802 101099 99951 103258 105475 104215 101925 106426 110742 112364 111477 110444 111525
11159A11525k666J416J931l143p314k058K09J059j349l270K814L908J061m256
$$ 111525 108859 110275 112206 109063 101749 99691 99900 100959 99610 96340 99154 103062 104123 99867
11145I9867k939L342N664J272l649N358k411j068J708K017j6J49K059j546Q64
$$ 99867 96928 100270 105934 107206 103557 108915 106504 105436 107144 109161 109145 109294 111353 109807 110671
11130A10671L728Q727J1684Q903j544M557M53l735K092N93m042l303J68p722m135
$$ 110671 114399 123126 134810 143713 142169 146726 147179 143444 145536 146129 142087 138784 138952 131230 127095
11115A27095l02p148n315k302p24j186m679J177N344J412j043L244K197N798L804
$$ 127095 126793 119645 114330 112028 111304 110118 105439 106616 111960 113372 112329 115573 117770 123568 127372
11100A27372j938j687J762J975K808K754J204o1K633N327L399O90M192k053j565
$$ 127372 125434 123747 125509 127484 130292 133046 134250 134189 136822 142149 145548 146238 150430 148377 146812
11085A46812J413j621M305J769j99k166m472o13L472K003o048m840l685p82j305
$$ 146812 148225 146604 150909 152678 152479 150313 145841 145228 148700 150703 144655 139815 136130 135348 134043
11070A34043n691L534K456j394N892J2622J492N043L542l310j0195l436L925j700
$$ 134043 128352 131886 134342 132948 138840 151462 152954 157997 161539 158229 148034 144598 148523 146823
11056A46823J374P199N976j822l480J934L052M893J500M921P318j95j809O120
$$ 146823 148197 155396 161372 159550 156070 158004 161056 165949 167449 172370 179688 179493 177684 183804
11042A83804M861K589n71K090K802L941K076J763l718o140p422K385O95J909m028
$$ 183804 188665 191254 190683 192773 195575 199516 201592 203355 199637 193497 186075 188460 189155 191064 187036
11027A87036n065r03J29k623J770J136J163N36J221N175N657N221P762L789k177
$$ 187036 181971 181068 181197 178574 180344 181480 182643 183179 184400 189575 195232 200453 208215 212004 209827
11012B09827J94L345q69K625L492n167j331N192M617O865J0968J2985M101N967
$$ 209827 210021 213366 212497 215122 218614 213447 212116 217308 221925 228790 239758 252743 256844 262811
10998B62811Q735l2l696l508k028p711l677O691k000q530m521J93L690P135O668
$$ 262811 271546 271514 267818 264310 262282 254571 250894 257585 255585 247055 242534 242727 246417 253552 260220
10983B60220r55n77L421J95K474M985N351Q212N403K565L100K993K326k221k239
$$ 260220 259265 258688 262109 262304 264778 269763 275114 283326 288729 291294 294394 297387 299713 297492 295253
10968B95253N277P306L08R275J2073N068L596P862J1010R538M523r25N718P280
$$ 295253 300530 307836 308144 317419 329492 334560 338156 346018 357028 366566 371089 370164 375882 383162
10954C83162P662J1631J0908J4606J0078P217Q447J1110J5745J1396Q874J1835
$$ 383162 390824 402455 413363 427969 438047 445264 453711 464821 480566 491962 500836 512671
10942E12671J5731J9835K2949K4002K8339L1625L4526L2163L3592L4532M3350
$$ 512671 528402 548237 571186 595188 623527 655152 689678 721841 755433 789965 833315
10931H33315N2984O3263P6955J00542J27499J49699J71062J94666K19408K46516
$$ 833315 886299 949562 1026517 1127059 1254558 1404257 1575319 1769985 1989393 2235909
10921B235909K93185L56268M46948O06754Q60253J235336J767004K473268L263726
$$ 2235909 2529094 2885362 3332310 3939064 4799317 6034653 7801657 10274925 13538651
10912A3538651L898316M052438L520441K318624O17588j288402k925606l803923
$$ 13538651 17436967 21489405 25009846 27328470 27946058 26657656 23732050 19928127
10904A9928127l774994l138653k331802j628988j110776p64730n21407l53906
$$ 19928127 16153133 13014480 10682678 9053690 7942914 7178184 6656777 6302871
10896F302871k39976j61236j15494q4712p5750o0773l2558O004P8339J53040K30935
$$ 6302871 6062895 5901659 5786165 5701453 5625703 5564930 5532372 5538376 5616715 5769755 6000690
10885F000690L18056M27246N85977Q23292J182541J742676K586878L802666N326461
$$ 6000690 6318746 6745992 7331969 8155261 9337802 11080478 13667356 17470022 22796483
10876B2796483O843801P797866P618241O051515L266510l19010l993418o745649
$$ 22796483 29640284 37438150 45056391 51107906 54374416 54055406 50061988 43316339
10868D3316339p796686p206470n712003m124251k855839j976795j403628j025469
$$ 43316339 35519653 28313183 22601180 18476929 15621090 13644295 12240667 11215198
10860A1215198p70179o03341m96781m20246l62932l17416k74335k29044j83165
$$ 11215198 10445019 9841678 9344897 8924651 8561719 8244303 7969968 7740924 7557759
10851G557759j37119q3610j4518Q3509J95814L07383M23428N94034Q40813J183973
$$ 7557759 7420640 7337030 7322512 7406021 7601835 7909218 8332646 8926680 9767493 10951466
10841A0951466J710925K431269L130495L486521L266100K383989R66977p49739
$$ 10951466 12662391 15093660 18224155 21710676 24976776 27360765 28327742 27578003
10833B7578003k403240l512548l786211l351275k604005j880814j318250r48874
$$ 27578003 25174763 21662215 17876004 14524729 11920724 10039910 8721660 7772786
10825G772786p09839n45977m33037l55082l19536k94801k72292k67057k58094
$$ 7772786 7062947 6516970 6083933 5728851 5409315 5114514 4842222 4575165 4317071
10816D317071k38262k14008j93022j75018j59446j47195j33196j21264j20179
$$ 4317071 4078809 3864801 3671779 3496761 3337315 3190120 3056924 2935660 2815481
10807B815481j16431j01034r1430q3517q0367p4762o9808p1611o1793o2115o4422
$$ 2815481 2699050 2598016 2506586 2423069 2342702 2267940 2198132 2126521 2064728 2002613 1938191
10796A938191n5686n0717n2521m7818m2213n0107n5415m9681m9145m3338l7861
$$ 1938191 1882505 1831788 1779267 1731449 1689236 1639129 1583714 1534033 1484888 1441550 1403689
10785A403689l5603l8869k8740l5709l9993l9012l5027l2084k8625k8969l1095
$$ 1403689 1368086 1329217 1300477 1264768 1224775 1185763 1150736 1118652 1090027 1061058 1029963
10774A029963k7643k5741k7080k6849k3375k3970k7421j9610j5517j2365q454
$$ 1029963 1002320 976579 949499 922650 899275 875305 847884 828274 812757 800392 791938
10763G91938q539q575j3125j8690k0144k6195k6267k2228j4749k0990k3534j2591
$$ 791938 783399 774824 761699 743009 722865 696670 670403 648175 633426 612436 588902 576311
10751E76311p137j6566j2307q139j6623j5806j5148j7510j8914j7077j9267j1587
$$ 576311 569174 552608 540301 532162 515539 499733 484585 467075 448161 431084 411817 400230
10739D00230r857p996j0314q652n368l458p027k472k221M851L278M4M363K369
$$ 400230 390373 382377 372063 363411 358043 354585 347558 345086 342865 347716 350994 351038 355401 357770
10725C57770o014m520n901j0286j4200q010k708n551j2208r65k661o478l594k945
$$ 357770 351756 347236 341335 331049 316849 308839 306131 300580 288372 287407 284746 278268 274674 271729
10711B71729m06K101P479M967L596n140j0456j0017o148p979j0285n314M175J3383
$$ 271729 271323 273424 280903 285870 289466 284326 273870 263853 257705 249726 239441 234127 238302 251685
10697B51685O725J1096J4591J5313J8418J6212K3702K3604L4313N0793P6411J02204
$$ 251685 258410 269506 284097 299410 317828 334040 357742 381346 415659 466452 542863 645067
10685F45067J31934J81290K16963K36347K23416J65532Q0502o299r3843j60540
$$ 645067 777001 958291 1175254 1411601 1635017 1800549 1881051 1874752 1780909 1620369
10675A620369j99439k08387j84775j56282j17298p9610n7201m1713l1281k0028
$$ 1620369 1420930 1212543 1027768 871486 754188 674578 617377 575664 544383 524355
10665E24355k0563k0033j8337j8661k5690k4054j6717j0091o475l424q410n934
$$ 524355 503792 483759 465422 446761 421071 397017 380300 370209 363734 360310 351900 345966
10653C45966k06j71K75o600q742n651m150n595n838n241j516n266j843L705M577
$$ 345966 345760 345589 345864 339264 330522 324871 320721 315126 309288 304047 302531 297265 295422 299127 303704
10638C03704p24L405P712M978j595r969j2602p614p247m389p509r862j0101n999
$$ 303704 302980 306385 314097 319075 317480 307511 294909 287295 280048 275659 268150 258288 248187 242188
10624B42188M319J2222N742P248N771M676N392Q998O754p22o728q911j6724j7438
$$ 242188 246507 258729 264471 271719 277490 282166 287558 296556 303310 302588 295860 286949 270225 252787
10610B52787p985M565O176J1977N789K786P831J7220J6438R145j666r073m766
$$ 252787 244802 249367 255543 267520 273309 276095 283926 301146 317584 326729 325063 315990 311224
10597C11224n55r28j266j095L533L283m598p156l617j152j734r545j1700m960
$$ 311224 310669 309741 308475 307380 310913 314196 309598 302442 298825 297673 295939 286394 274694 269734
10583B69734L171J0584k229l660j0601j1931r829o933J39L348L997K027O757O770
$$ 269734 272905 283489 281260 277600 266999 255068 245239 238306 238445 241793 245790 247817 254574 261344
10569B61344K436N175O237J1041J8136J6789K0512K0679J7826M408Q722J2086
$$ 261344 263780 268955 275192 286233 304369 321158 341670 362349 380175 384583 393305 405391
10557D05391K1888K8111K5129J5405J3160J3412Q972L76j4582k5348j4893j610
$$ 405391 427279 455390 480519 495924 509084 522496 531468 531844 517262 491914 477021 475411
10545D75411R909J9376K5485L2089M0195N5863Q2458J29227K08151K93363L01206
$$ 475411 485320 504696 530181 562270 602465 658328 740786 870013 1078164 1371527 1672733
10534A672733K17168J27272L3892j54035l27617l18478k12451j32290q6313n4878
$$ 1672733 1889901 2017173 2051065 1897030 1569413 1250935 1038484 906194 819881 765003
10524G65003m0865l2457k3065k1841j0300J3433L2567M2069M6030L4863J2134
$$ 765003 724138 691681 668616 646775 636475 649908 682475 724544 770574 805437 817571
10513H17571q981k1852k7633k4846j8901j6875j3351o029K805M626K021j240k617
$$ 817571 808590 786738 759105 734259 715358 698483 685132 679103 681908 686534 688555 687315 684698
10500F84698k043r84J551N700O708J9011K4227L2541L6802L7244L1212L3550K7851
$$ 684698 682655 681671 683222 688922 695630 714641 738868 771409 808211 845455 876667 910217 938068
10487I38068J1612N014J100j1227k3228k0051r945J3150K5675L1867M3295M8177
$$ 938068 949680 954694 955794 944567 921339 901288 891343 904493 930168 962035 1005330 1053507
10475A053507M8410L7947K6438J9327K4836K6014K2038J6586L2081M7295N7722
$$ 1053507 1101917 1139864 1166302 1185629 1210465 1236479 1258517 1275103 1307184 1354479 1412201
10464A412201O1159N8614N8110N7242O1416O5763P7104J19481J50683J78349K04379
$$ 1412201 1473360 1531974 1590084 1647326 1708742 1774505 1851609 1971090 2121773 2300122 2504501
10453B504501K14274K24351K37889K48727K68856L00709L60359M48136N15240
$$ 2504501 2718775 2943126 3181015 3429742 3698598 3999307 4359666 4807802 5323042
10444E323042N43743N73885O01127O24974P43343J004084J351387J789097K378374
$$ 5323042 5866785 6440670 7041797 7666771 8410114 9414198 10765585 12554682 14933056
10435A4933056L222573M494646O517136R854496J5454943K3831066L2017101L2401389
$$ 14933056 18155629 22650275 29167411 39021907 54476850 78307916 110325017 142726406
10427A42726406K3384977J3502421L153621j5869386l4919809l5937554k5513203
$$ 142726406 166111383 179613804 182767425 166898039 131978230 96040676 70527473
10420G0527473j6038716j0217700o847526m850254l618287k815187k208811j736844
$$ 70527473 54488757 44271057 37423531 32573277 28954990 26139803 23930992 22194148
10412B2194148j404815j193537j081157j012887r54953r17257r21499r14333q42620
$$ 22194148 20789333 19595796 18514639 17501752 16546799 15629542 14708043 13793710 12951090
10403A2951090p38469o55403o03534n55962m96024m35490l81984l48553l35055
$$ 12951090 12212621 11557218 10953684 10397722 9901698 9466208 9084224 8735671 8400616
10394H400616l18118k95122k49480k02487j71941j54983j31184j12844j16673
$$ 8400616 8082498 7787376 7537896 7335409 7163468 7008485 6877301 6764457 6647784
10385F647784j49014j91654k29912k33531k18433k06421j96703j83569j73450
$$ 6647784 6498770 6307116 6077204 5843673 5625240 5418819 5222116 5038547 4865097
10376D865097j58652j34097j11585r9061r8206j10351j18627j16608j02461q9766
$$ 4865097 4706445 4572348 4460763 4361702 4263496 4153145 4034518 3917910 3815449 3725683
10366C725683q5312r1180r6286r4471r4260r7157j00362q7115p8967o5942o2069
$$ 3725683 3640371 3549191 3452905 3358434 3264174 3167017 3066655 2979540 2900573 2834631 2772562
10355B772562p1836o8697n8190n4229n5947n2841m3700m1235m0104l7233k4729
$$ 2772562 2700726 2632029 2573839 2519610 2463663 2410822 2367122 2325887 2285783 2248550 2223821
10344B223821j0411j586l727j1354j1009j5004k3922k9616l9494l9097l7032l1087
$$ 2223821 2213410 2211824 2208097 2196743 2185734 2170730 2146808 2117192 2077698 2038601 2001569 1970482
10332A970482k5361j7281o081L283M023l22p577m063j0122m956P423J9118J8715
$$ 1970482 1945121 1927840 1921759 1925042 1929065 1928743 1921166 1917103 1906981 1902025 1909448 1928566 1947281
10319A947281J2853Q167J556Q867K4617M3272N3135N1088L4392K1754J0184j0578
$$ 1947281 1960134 1968301 1969857 1978724 2003341 2046613 2099748 2150836 2185228 2206982 2217166 2206588
10307B206588r086J564J6841M1036O8534J06478J35972J46507J42259J19677R6911
$$ 2206588 2197502 2199066 2215907 2256943 2325477 2431955 2567927 2714434 2856693 2976370 3073281
10296C073281Q9346R0099R5387J27390J77144K40656K90461L26035L50557L95854
$$ 3073281 3162627 3252726 3348113 3475503 3652647 3893303 4183764 4509799 4860356 5256210
10286E256210M67385N61865O68048P93887R52043J142910J332102J457535J503376
$$ 5256210 5723595 6285460 6953508 7747395 8699438 9842348 11174450 12631985 14135361
10277A4135361J515437J580535J734174K041893K657499L658496N110220P158642
$$ 14135361 15650798 17231333 18965507 21007400 23664899 27323395 32433615 39592257
10269C9592257J0217049J5042588K2872298L4781952M9127248N8614723N4928087
$$ 39592257 49809306 64851894 87724192 122506144 171633392 230248115 285176202
10262B85176202L9773225K1327173j376592l1867656n7675033o1773669m8509129
$$ 285176202 324949427 346276600 344900008 313032352 255357319 193583650 145074521
10255A45074521l2567080k1187108j4234812j0050454p425941n644249m315994
$$ 145074521 112507441 91320333 77085521 67035067 59609126 53964877 49648883
10248D9648883l304394k629933k277435k130127k094483k132356k188736k143336
$$ 49648883 46344489 43714556 41437121 39306994 37212511 35080155 32891419 30748083
10240C0748083j985883j807896j635030j486564j351243j230465j092828r69512
$$ 30748083 28762200 26954304 25319274 23832710 22481467 21251002 20158174 19188662
10232A9188662q60696p78322p24386o86625o48331o01115n36689m76957m09350
$$ 19188662 18327966 17549644 16825258 16138633 15490302 14889187 14352498 13875541 13466191
10223A3466191l53153l08574l02653l20625l54024l81941l94383m03923l96318
$$ 13466191 13113038 12804464 12501811 12181186 11827162 11445221 11050838 10646915 10250597
10214A0250597l81379l60243l27305k95053k67593k41408k22176k25865k39036
$$ 10250597 9869218 9508975 9181670 8886617 8619024 8377616 8155440 7929575 7690539
10205G690539k47275k43117k28804k19306j98706j83728j84500j78558j77201
$$ 7690539 7443264 7200147 6971343 6752037 6553331 6369603 6185103 6006545 5829344
10196E829344j76907j70841j59032j48895j39713j33823j44914j50321j47842
$$ 5829344 5652437 5481596 5322564 5173669 5033956 4900133 4755219 4604898 4457056
10187D457056j44905j43392j42117j36166j26295j12989j01611q4826p6761p5438
$$ 4457056 4312151 4168759 4026642 3890476 3764181 3651192 3549581 3464755 3387994 3312556
10177C312556p6904q0189q3950q5977p9364p8949p7789o8590o2778o1490p2979
$$ 3312556 3235652 3155463 3071513 2985536 2906172 2827223 2749434 2680844 2618066 2556576 2483597
10166B483597p2160p1151o7125o1916n5327n5416n2612m9315m6963l1463j7078
$$ 2483597 2411437 2340286 2273161 2211245 2155918 2100502 2047890 1998575 1951612 1920149 1903071
10155A903071p974j8725k6931l4602m5613n2720n7956o2484o8365p7944p8803
$$ 1903071 1895097 1876372 1849441 1814839 1769226 1716506 1658550 1596066 1527701 1449757 1370954
10144A370954p7342o6842o3073o1401o1323m7955l7353k6532k3678l3507n5091
$$ 1370954 1293612 1226770 1163697 1102296 1040973 993018 955665 929133 905455 871948 816857
10133H16857p4849q2170p7791o1509m7656l7616k2680j6311j1897k974N914J1649
$$ 816857 742008 659838 582047 520538 472882 435266 412586 396275 384378 381404 387318 398967
10121C98967Q088Q199k032o954p755m354j177j863j94M540o44j171N0J455m124
$$ 398967 407055 415254 413222 406268 398513 394159 392982 391119 390925 395465 394821 393650 393700 395155 391031
10106C91031j0015j1492j3688n726R285J7888K8064L7669L7920L1264J0795L042
$$ 391031 381016 369524 355836 350110 359395 377283 405347 443016 480936 512200 522995 526037
10094E26037J805J4080J7829J6234J9321L7909O4349Q0186R2160J20020J71281
$$ 526037 527842 541922 559751 575985 595306 633215 697564 777750 869910 989930 1161211
10083A161211K36185L38221M91264P40802J079914J440975J646161J492967J037763
$$ 1161211 1397396 1735617 2226881 2967683 4047597 5488572 7134733 8627700 9665463
10074I665463M20060l85880j245549j706887j570802j160643p89551n27777l61588
$$ 9665463 10085523 9699643 8454094 6747207 5176405 4015762 3226211 2698434 2336846
10065B336846k64480j95578j46535j20755j01451q9125q0711p6423p0488p2050
$$ 2336846 2072366 1876788 1730253 1609498 1508047 1418922 1338211 1261788 1191300 1119250
10055A119250p4679p0024o3861m3674m3837m1354l0248k5963k5869k0604k1964
$$ 1119250 1044571 974547 910686 867012 823175 781821 751573 725610 699741 679137 657173
10044F57173k6727k5939k7812k2622j8448j5822j1394j9642j5586k320J675o069
$$ 657173 630446 604507 576695 554073 535625 519803 508409 488767 473181 470861 472536 466467
10032D66467m3l859m61K629n622q722r424j1161j1093p042o968j551J830m051
$$ 466467 466424 462565 462104 464733 459111 450389 440965 429804 418711 411669 404701 403150 404980 400929
10018D00929m471o137p272q216j2589o959J199J4873J6312K1989L5080N4649R5955
$$ 400929 396458 390321 383049 374833 362244 355285 356484 371357 387669 409658 444738 499387 595342
10005E95342J44826J72875J48607Q9287K6741n2625j56190k03950j67972j16799
$$ 595342 740168 913043 1061650 1150937 1177678 1125053 968863 764913 596941 480142
9995D80142p7240n4254m1198k8295j8389j0069j2467j3082j2440j6918j7376j6824
$$ 480142 402902 348648 307450 279155 260766 250697 238230 225148 212708 195790 178414 161590
9983A61590j4993j0831o835L29O951k424j153n456l482q51l775j0409q679m554
$$ 161590 146597 135766 128931 129260 136211 133787 132634 127178 123696 122845 119070 108661 99982 95428
9969I5428R15K79o811p110j0138q651o668n537N43j93M578R083J418j062J692
$$ 95428 96343 96622 89811 82701 72563 63912 57244 51707 52250 52057 56635 65718 67136 66074 67766
9954F7766l956j1253q186l392j70N179L802K176p37n139j3381m540R92O152Q701
$$ 67766 63810 52557 44371 40979 40809 45988 49790 51966 51229 46090 32709 28169 29161 35313 44014
9939D4014J6860J5200R146J1383P774N037K4J56j0458j8382k1619j9572j3782
$$ 44014 60874 76074 85220 96603 104377 109414 109438 109594 99136 80754 59135 39563 25781
9926B5781n114l837L205k860n864m789l512M428L722N28O97N622J65M613L980
$$ 25781 20667 16830 20035 17175 11311 6522 3010 7438 11160 11688 12385 18007 18172 22785 26765
9911B6765k618o704q596q635n781j890k440m985J086J613K459m156k647j832j310
$$ 26765 24147 17443 8847 212 -5569 -7459 -9899 -14884 -13798 -12185 -9726 -13882 -16529 -18361 -19671
9896a9671N24N076N825J469M465j067k261j053n448m852M720k08j742K72O141
$$ -19671 -19147 -14071 -8246 -6777 -2312 -3379 -5640 -6693 -12141 -16993 -12273 -12481 -14223 -13951 -7810
9881g810J227p20J418k022n320k406M964L471J60l547K359k343j171j26J664N548
$$ -7810 -6583 -7303 -5885 -7907 -13227 -15633 -10669 -7198 -7038 -10585 -8226 -10569 -11740 -11866 -10202 -4654
9865d654P97M658L311P566K497j071L212J102n34L355P525P856J4388J3524J1860
$$ -4654 -3857 801 4112 11678 14175 13104 16316 17418 16884 20239 27764 35620 50008 63532 75392
9850G5392J3371J4309K4798L4782M5122O4685R5034J28374J64186J93572K11085
$$ 75392 88763 103072 127870 162652 207774 272459 367493 495867 660053 853625 1064710
9839A064710K06204J68608J04122K3822p4013j45058j93507k08636j86970j50273
$$ 1064710 1270914 1439522 1543644 1567466 1493453 1348395 1154888 946252 759282 609009
9829F09009j23087r0496o1805m0157l2676j9766j5167j8462j8249p459m874j2668
$$ 609009 485922 395426 333621 293464 260788 241022 225855 207393 189144 181685 176811 164143
9817A64143j5247j1807j5161o429p967q077q085r916r815j4270o617J400J325
$$ 164143 148896 137089 121928 115499 107532 99455 91370 81454 71639 57369 50752 52152 53477
9804E3477M262K45r90n586j0980l779r585o027k975j353j029k357j303M96j700
$$ 53477 57739 57984 56994 51408 40428 36649 27064 21037 18062 16709 15680 13323 12020 12516 10816
9789A0816j490J674p14m848l923j121L361N159O196k409k810j827q980q251k836
$$ 10816 9326 11000 10286 5438 1515 394 3755 8914 15110 12701 9891 8064 -916 -9167 -12003
9774a2003j06P587M174l52J802N082k371m537n404l451J40N763j508p7K682l658
$$ -12003 -12109 -4522 -348 -700 1102 6184 3813 -724 -6128 -9579 -9439 -3676 -5184 -5261 -2579 -6237
9758f237k121L933j229l002m166k08M94j677n671k734j80O051L065Q54p23k048
$$ -6237 -8358 -4425 -5654 -8656 -12822 -13030 -12536 -14213 -19884 -22618 -22798 -16747 -13682 -12828 -13551 -15599
9742a5599l164j691R8K989k231j820J68L56J165J45k422k32L581L751k747R08
$$ -15599 -18763 -20454 -20356 -17367 -19598 -21418 -21250 -20894 -19729 -19584 -22006 -22238 -18657 -14906 -17653 -16745
9726a6745R60K152l75o058p970K901L242P46Q97k821n559j193K341q32m779m4
$$ -16745 -15785 -13633 -14008 -20066 -28036 -25135 -21893 -21147 -20250 -23071 -28630 -29823 -27482 -28314 -33093 -33137
9710c3137k77J199p88j348R0K598J372L397j34j75O96M095k87l449K335P055m336
$$ -33137 -33414 -32215 -33003 -34351 -34261 -31663 -30291 -26894 -27028 -27203 -26507 -22412 -22699 -26148 -23813 -16758 -21094
9693b1094k955k85j590K240L087N329L903J087k017p91m684n384k805l386m044
$$ -21094 -24049 -24334 -25924 -23684 -20597 -15268 -11365 -10278 -12295 -13086 -17770 -23154 -25959 -29345 -33389
9678c3389O228R20L894J3Q79K638l239r493m021L079K536K065L702O001K251K174
$$ -33389 -27161 -26241 -22347 -22334 -21455 -18817 -22056 -31549 -35570 -32491 -29955 -27890 -24188 -18187 -15936 -13762
9662a3762P457J887j857K092R679L478l524N253R961P117k93L551j922k811o117
$$ -13762 -6305 -4418 -6275 -4183 5496 8974 5450 10703 20664 27781 27488 31039 29117 26306 20189
9647B0189j1286j3602p531k832k5J531K717R278j584m666j076p059m475l202n932
$$ 20189 8903 -4699 -12230 -15062 -15087 -13556 -10839 -1561 -3145 -7811 -8887 -15946 -20421 -23623 -29555
9632b9555R37N87k454M260Q008j3Q4K90p815j966J057N020M651M55J545j197p192
$$ -29555 -28618 -28031 -30485 -26225 -18217 -18230 -18146 -17856 -25671 -27637 -26580 -21560 -16909 -16454 -14909 -16106 -23298
9615b3298j464M371L190l5j023P58J407j859l596o332j256K981P003J755N07k747
$$ -23298 -24762 -20391 -17201 -17236 -18259 -17501 -16094 -17953 -21549 -27881 -29137 -26156 -19153 -17398 -16891 -19638
9599a9638l512k885J48N364J37K455p56l566N86R27J1L70j28N368J441p0k71j552
$$ -19638 -23150 -26035 -25887 -20523 -20386 -17931 -18687 -22253 -21667 -20740 -20729 -20359 -20487 -15119 -13678 -13748 -14019 -15571
9581a5571k044J859k984n372R60M611l484J14J518p35P57L846O052M33j293o246
$$ -15571 -17615 -15756 -18740 -24112 -23152 -18541 -22025 -21911 -20393 -21128 -20371 -16525 -10473 -10040 -11333 -17579
9565a7579o374N095K840n286l367k370k402j772l747M343J076j96m38k49L461
$$ -17579 -23953 -18858 -16018 -21304 -24671 -27041 -29443 -31215 -34962 -30619 -29543 -29739 -30177 -30426 -26965
9550b6965K893r4J86j123M91M158K392k121n8K676j936m080k26r02n85N31j129
$$ -26965 -24072 -24166 -23980 -25103 -24612 -20454 -18062 -20183 -20241 -17565 -19501 -23581 -23807 -24709 -25294 -24763 -25892
9533b5892K926j635n041Q3n567L715O118J358R41l218L380Q70l265N41Q053P68
$$ -25892 -22966 -24601 -29642 -29559 -35126 -31411 -25293 -23935 -22994 -26212 -22832 -21962 -25227 -24686 -16633 -15865
9517a5865n645K925k654k295M983K330k935J90M454K97m923rM533k010J13j944
$$ -15865 -21510 -18585 -21239 -23534 -18551 -16221 -19156 -18966 -14512 -14215 -19138 -19147 -14614 -16624 -16511 -18455
9501a8455O78N98l026J343J199k843J597K956L690m01O38k924k117L111l902m747
$$ -18455 -17777 -17179 -20205 -18862 -17663 -20506 -18909 -15953 -12263 -12664 -12026 -14950 -17067 -13956 -17858 -22605
9485b2605J905J519nL151M221j780j350n052p48j28j534L867J771L157K984p48
$$ -22605 -20700 -19181 -19186 -16035 -11814 -13594 -14944 -19996 -20744 -20872 -22406 -18539 -16768 -13611 -10627 -11375
9469a1375m918q68J090l628M228N977k025j3422j61O432q20N181l26k924n87k910
$$ -11375 -16293 -17161 -16071 -19699 -15471 -9494 -11519 -24941 -25102 -18670 -19490 -14309 -14635 -17559 -18146 -21056
9453b1056M029M675M017l942k718n980m831J657M167P659K870N11M88J622L604
$$ -21056 -17027 -12352 -8335 -12277 -14995 -20975 -25806 -24149 -19982 -12323 -9453 -8942 -8454 -6832 -3228
9438c228J01m879q380%L419P488P78l929j294K206O24q60M57L57J344J667l360
$$ -3228 -3127 -8006 -16386 -16386 -12967 -5479 -4701 -8630 -9924 -7718 -7094 -7954 -7497 -7140 -5796 -4129 -7489
9421g489p921j659n05q74M482R443L899n86m655J367j483n793J307k917j589J492
$$ -7489 -15410 -17069 -17574 -18448 -13966 -4523 -624 -1210 -5865 -4498 -5981 -11774 -10467 -13384 -14973 -13481
9405a3481J31K193N840m57l097K248M973K007l241p301k63k416j620m540M94M838
$$ -13481 -13350 -11157 -5317 -5774 -8871 -6623 -1650 357 -2884 -10185 -10448 -12864 -14484 -19024 -18530 -13692
9389a3692Q996q26k245n074K446q13j848j621M485k917k318M298M118k038k798
$$ -13692 -4696 -5522 -7767 -12841 -10395 -11208 -13056 -14677 -10192 -13109 -15427 -11129 -7011 -9049 -11847
9374a1847K98m84l107k122j802N190P9O13J205rP90j76j834k508m77K048N86J708
$$ -11847 -11549 -12033 -15140 -17262 -19064 -13874 -13795 -13182 -11977 -11986 -11196 -11372 -13206 -15714 -16191 -14143 -13557 -11849
9356a1849J949n7J999j698j518K373jQm315L564l290J050J507M133K769m570p821
$$ -11849 -9900 -9957 -7958 -9656 -11174 -8801 -8802 -8794 -13109 -9545 -12835 -11785 -10278 -6145 -3376 -7946 -15767
9339a5767N286L409L806m300P87K867K517J155j3m31K39j286o22K45r54o90L900
$$ -15767 -10481 -7072 -3266 -7566 -6779 -3912 -1395 -240 -253 -684 -445 -1731 -2353 -2108 -3062 -3752 148
9322A48L747k194l815J944L312l920j474K024O99L246K510m692m158n32L97m44
$$ 148 3895 1701 -2114 -170 3142 -778 -2252 -228 471 3717 6227 1535 -2623 -3155 -2758 -3202
9306c202p638n006M242j696J053N620L766K59L368K10q507q952j497J117M990
$$ -3202 -10840 -15846 -11604 -13300 -12247 -6627 -2861 -2602 766 976 -7531 -16483 -17980 -16863 -11873
9291a1873N511Q26J962M249m419K549N313L986k442J507k90k047q74J80n70l289
$$ -11873 -6362 -5536 -3574 675 -3744 -1195 4118 8104 5662 7169 6879 4832 3958 4138 3568 279
9275B79j822j031L561L653k031p159K62O009M866n179l381K763K609M535p09J449
$$ 279 -1543 -2574 987 4640 2609 -4550 -4288 1721 6587 1408 -1973 790 3399 7934 7225 8674
9259H674k4n124l078P97O11L29q31j332j711o65m41k605M319K738j012J784L895
$$ 8674 8650 3526 448 1245 1856 2185 1354 22 -1689 -2354 -2795 -5400 -1081 1657 645 2429 6324
9242F324j112m441K906J997l207l187j890M88K600M804j706m065k01O01Q40Q01
$$ 6324 5212 771 3677 5674 2467 -720 -2610 -2122 478 5282 3576 -489 -690 -89 751 1552
9226A552K659j727j830K983j175n82p67K54O35j981n87L149r77o11K09n19m793
$$ 1552 4211 2484 654 3637 2462 1880 1113 1367 2002 21 -566 2583 1606 995 1204 685 -4108
9209d108O2M291l56l211k223J021J004M21M829L006N459J937m549p346o33P26
$$ -4108 -4046 245 -111 -3322 -5545 -4524 -3520 -3099 1730 4736 10195 12132 7583 237 -396 330
9193C30j819j765Q658O809k527q50j335n486N914K653n35L84J770J575k050k554
$$ 330 -1489 -3254 5404 12213 9686 8836 7501 2015 7929 10582 10047 10431 12201 13776 11726 9172
9177I172M046O02o381j487P728r99J437m769l884j619j753m44K886O013k139L753
$$ 9172 13218 13820 7439 5952 13680 12681 14118 9349 5465 3846 2093 1649 4535 10548 8409 12162
9161A2162L060q833p263J602L132J098l7K462L979J654j34k704j930K218n28K235
$$ 12162 15222 6389 -874 728 3860 4958 4921 7383 11362 13016 12882 10178 8248 10466 9938 12173
9145A2173j641l431K997L058m122j836M65N46K93K015l53J545L353N922j404o325
$$ 12173 10532 7101 10098 13156 9034 7198 7663 8209 8502 10517 10164 11709 15062 20984 19580 13255
9129A3255n369k484R35M823O20q01l455J691K626O606M515q901q12K803J023P16
$$ 13255 7886 5402 6337 11160 11780 10979 7524 9215 11841 18447 22962 14061 13249 16052 17075 17791
9113A7791R10k045j842R02l814K348R526K846n191J467L769L97J468m690J60M32
$$ 17791 18701 16656 14814 15716 11902 14250 23776 26622 21431 22898 26667 27064 28532 23842 24002 24434
9097B4434j665m435n84J009n099l015j468N246K349J901m060j44pK275j15J180
$$ 24434 22769 18334 17750 18759 13660 10645 9177 14423 16772 18673 14613 14469 14462 16737 16622 17802
9081A7802R68j940p05L518J352J683M040p461l994L165L188L520J275l24L737
$$ 17802 18770 16830 16125 19643 20995 22678 26718 19257 15263 18428 21616 25136 26411 26087 29824
9066B9824m60o752k497n32J0J855L994q68J771K018M147m88o815l140M067N116
$$ 29824 29364 22612 20115 19583 19593 21448 25442 24574 26345 28363 32510 32022 25207 22067 26134 31250
9050C1250J024O34J86k349m379j415j124L4r96O066P838j17k765l230j443J867
$$ 31250 32274 32908 33094 30745 26366 24951 23827 23861 22865 28931 36769 36652 33887 30657 29214 31081
9034C1081Q79N575N648j002p600l746k531k641k705J150K562N830k829p309j210
$$ 31081 31960 37535 43183 42181 34581 30835 28304 25663 22958 24108 26670 32500 29671 22362 21152
9019B1152O796J199J976K621J62K325m299N33n95P51M555J197K891j211l974k610
$$ 21152 27948 29147 31123 33744 33906 36231 31932 32465 31870 32621 37176 38373 41264 40053 36079 33469
9003C3469j575K41J639m30N91N50O059K594L566M466J58n292n155k746m752J827
$$ 33469 31894 32135 33774 33344 33935 34485 40544 43138 46704 51170 51328 46036 40881 38135 33383 35210
8987C5210M079K952k560J196j170M297n96j616K392K422r38k38J932j770J674
$$ 35210 39289 42241 39681 40877 39707 44004 43408 41792 44184 46606 45668 45430 47362 45592 47266
8972D7266N201k9j758l000k11K666q32l612R27l434L871L730J657k703l580j33
$$ 47266 52467 52438 50680 47680 47469 50135 49303 45691 46618 43184 47055 50785 52442 49739 46159 46026
8956D6026K6J958M112j789m568J596J294l516k115K47K647L610K603j848K849
$$ 46026 46052 48010 52122 50333 45765 47361 48655 45139 43024 43271 45918 49528 52131 50283 53132
8941E3132J359J266j884J884O411K351m881K67m98jk701k534l251N98J112j423
$$ 53132 54491 55757 53873 55757 62168 64519 59638 59905 59407 59406 56705 54171 50920 51518 52630 51207
8925E1207R09L239K530J746n147m76L890J012Q06l195L402n94r29o41J861M349
$$ 51207 52116 55355 57885 59631 54484 54008 57898 58910 59716 56521 59923 59329 58400 57759 59620 63969
8909F3969M381n15l246J423l131l35J235J037p87L575N380j795j968l29j264K218
$$ 63969 68350 67835 64589 66012 62881 62546 63781 64818 64031 67606 72986 71191 69223 68894 67630 69848
8893F9848j627M240K318k206p50K850N885k039j446q22l738J504L765j668n180
$$ 69848 68221 72461 74779 72573 71823 74673 80558 78519 77073 76251 72513 74017 77782 76114 70934
8878G0934K940O063M681j049K224l899l808K967N050R33l776k997j005P19O855
$$ 70934 73874 79937 84618 83569 85793 81894 78086 81053 86103 87036 83260 80263 79258 79977 86832
8863H6832m29j966k375K36r01M969M728N85l990k600J656M788M321k942N594M955
$$ 86832 86403 84437 82062 82298 81397 86366 91094 91679 87689 85089 86745 91533 95854 92912 98506 103461
8847A03461K811M064L71k894o747m145K708K498m12K278K362J740m756m902J361
$$ 103461 106272 110336 110707 107813 101066 96921 99629 102127 101715 103993 106355 108095 103339 98437 99798
8832I9798m286j307N043j237M167Q558J584J691k049J780K590k153j38J762K433
$$ 99798 95512 94205 99248 98011 102178 110736 112320 114011 111962 113742 116332 114179 114041 115803 118236
8817A18236K019p13j653K234M164k130l136M314l246l252R37M310N416J992j68
$$ 118236 120255 119542 117889 120123 124287 122157 119021 123335 120089 116837 117774 122084 127500 129492 129324
8802A29324j485l565j280K94J123M187R049P433m20M582L740O1p253m030M704
$$ 129324 127839 124274 122994 123288 124411 128598 137647 145080 144660 149242 152982 153043 145790 141760 146464
8787A46464Q869j697k377L448L929L016N151J522p967j949N982K664o58m77L959
$$ 146464 155333 153636 151259 154707 158636 161652 166803 168325 160358 158409 164391 167055 166397 165920 169879
8772A69879M530q78K953J954L330l965k73M858Q455J441J98m940m749J759l20
$$ 169879 174409 173531 176484 178438 181768 177803 177530 182388 190843 192284 192482 187542 182793 184552 184232
8757A84232j948O504P008O11k104m114K854N282N134N18J063Q843N279m608K12
$$ 184232 182284 188788 195796 196407 194303 190189 193043 198325 203459 203977 205040 213883 219162 214554 214766
8742B14766N765N169L29L073N585K59m395l686O312N534K939o14k324O09K76K080
$$ 214766 220531 225700 226029 229102 234687 234946 230551 226865 233177 238711 241650 241036 238712 239321 239597 241677
8726B41677M791M063J95O933M829m595L288L382L90Q585J246J130N597L015M396
$$ 241677 246468 250531 250726 257659 262488 257893 261181 264563 264953 273538 274784 275914 281511 284526 288922
8711B88922K383J173K085k90k008J398J296K994L791M936L555L424P094R016J348
$$ 288922 291305 292478 294563 294273 292265 293663 294959 297953 301744 306680 310235 313659 320753 329769 331117
8696C31117j53J4L477L105O988Q267J677K442R661N692K520M970J943M227l95
$$ 331117 330964 330978 334455 337560 344548 352815 354492 356934 366595 372287 374807 379777 381720 385947 385552
8681C85552N869L440Q769O332J33O15J2280M346M662J8J229J5464P852J469r09
$$ 385552 391421 394861 403630 409962 410095 410710 422990 427336 431998 432016 433245 448709 456561 458030 457121
8666D57121R293J2983L351P307P888k21L414J1908J3983N669N056R931O911P109
$$ 457121 466414 479397 482748 490055 497943 497722 501136 513044 527027 532696 537752 547683 554594 561703
8652E61703J662N120M260P061J3241Q320R994P286P344O333Q901R475P487J1416
$$ 561703 563365 568485 572745 579806 593047 601367 611361 618647 625991 632324 641225 650700 658187 669603
8638F69603J1078J2431J0583Q672P954Q684J1959R838J1386J3646J4042J3814
$$ 669603 680681 693112 703695 712367 720321 729005 740964 750802 762188 775834 789876 803690
8626H03690J5814J5059J2575J3039O811J0857J2334J6322J3023J5007J7954J5023
$$ 803690 819504 834563 847138 860177 866988 877845 890179 906501 919524 934531 952485 967508
8614I67508J5471J5624J4983K3717K0151J9166K2882K1084K2035J8104J7789J5211
$$ 967508 982979 998603 1013586 1037303 1057454 1076620 1099502 1120586 1142621 1160725 1178514 1193725
8602A193725J9678K1092K2241K5248K7985K1682K6418L2069K7536K8270K7614
$$ 1193725 1213403 1234495 1256736 1281984 1309969 1331651 1358069 1390138 1417674 1445944 1473558
8591A473558K3545K3220L2851L6038L1910L1826L2588L9744L9071M0281L8697
$$ 1473558 1497103 1520323 1553174 1589212 1621122 1652948 1685536 1725280 1764351 1804632 1843329
8580A843329M2850M4702L9439M5643M8307L8950M2435N1614N8142N0958N2300
$$ 1843329 1886179 1930881 1970320 2015963 2064270 2103220 2145655 2197269 2255411 2306369 2358669
8569B358669M9376N8876O1708O0478N9642N9781O6096O6252O9243O9386O9020
$$ 2358669 2408045 2466921 2528629 2589107 2648749 2708530 2774626 2840878 2910121 2979507 3048527
8558C048527O9236O8649P6937P7649P8427Q1386Q5643Q2049Q6333Q2153Q5910
$$ 3048527 3117763 3186412 3263349 3340998 3419425 3500811 3586454 3668503 3754836 3836989 3922899
8547C922899R0548R0606Q7313R0806R0433R6984R7224R6987R2184R0641R1777
$$ 3922899 4013447 4104053 4191366 4282172 4372605 4469589 4566813 4663800 4755984 4846625 4938402
8536D938402Q8534R2988Q7889Q8453P8988P8363P7811P6987P7459O9093O5095
$$ 4938402 5026936 5119924 5207813 5296266 5375254 5453617 5531428 5608415 5685874 5754967 5820062
8525E820062N5985M2918N0831M4770L3162L2942K6663J7848J2215O620l437q578
$$ 5820062 5876047 5918965 5969796 6014566 6047728 6080670 6107333 6125181 6137396 6144016 6140579 6132001
8513F132001j1737j5121k4673k3928l3910l7907m3450n3219n6067n8636n8601
$$ 6132001 6120264 6105143 6080470 6056542 6022632 5984725 5941275 5888056 5831989 5773353 5714752
8502E714752o3876o8738o9987p2811p3304p7694q6129q1428p5711p9715q3189
$$ 5714752 5650876 5582138 5512151 5439340 5366036 5288342 5202213 5120785 5045074 4965359 4882170
8491D882170q5871q3505q3263q5695q9275q0827p4487p8417q1227p7424p9914
$$ 4882170 4796299 4712794 4629531 4543836 4454561 4373734 4299247 4220830 4139603 4062179 3982265
8480C982265p7014p2562p1801p2372p2128p0751p3258o5796o6823o7706o7641
$$ 3982265 3905251 3832689 3760888 3688516 3616388 3545637 3472379 3406583 3339760 3272054 3204413
8469C204413o6559n8313n9524o3797n4924n7743n6047n6261n8264n3439m6584
$$ 3204413 3137854 3079541 3020017 2956220 2901296 2843553 2787506 2731245 2672981 2619542 2572958
8458B572958m7103m7375m7933n3789m6567m1498l9143m2864m4105l8286m2945
$$ 2572958 2525855 2478480 2430547 2376758 2330191 2288693 2249550 2206686 2162581 2124295 2081350
8447B081350m6532m1235m0791l1564k9268l0903l2129l2968l4166l5612m1920
$$ 2081350 2034818 1993583 1952792 1921228 1891960 1861057 1828928 1795960 1761794 1726182 1684262
8436A684262l0442k5484k8404l0562k7917k6693k7507k9671k5255k4871k6839
$$ 1684262 1653820 1628336 1599932 1569370 1541453 1514760 1487253 1457582 1432327 1407456 1380617
8425A380617k5614k5817k6172k2241k2260j8125k3886k0545j8435k2224j9339
$$ 1380617 1355003 1329186 1303014 1280773 1258513 1240388 1216502 1195957 1177522 1155298 1135959
8414A135959j8406j9661j7580j4684k0205k0166k2160j5627p859j4548j4149j5424
$$ 1135959 1117553 1097892 1080312 1065628 1045423 1025257 1003097 987470 979611 965063 950914 935490
8402I35490k0261j5005r531j4802j7252j9872j4085m686o072j3595j2673j9672
$$ 935490 915229 900224 890693 875891 858639 838767 824682 819996 813924 800329 787656 767984
8390G67984j2542p877j2860j4111j2408j3358q108j0667j1399j0839j1882r230
$$ 767984 755442 747565 734705 720594 708186 694828 686720 676053 664654 653815 641933 632703
8378F32703q938q711j0350j1546o278o877j0898q462r071r681q552n857p062o807
$$ 632703 623765 615054 604704 593158 586880 580003 569105 560643 551572 541891 533339 527482 520420 513613
8364E13613n826j964o365o708k153o675q139n076o617q426o512j0805p194j935
$$ 513613 507787 505823 499458 492750 490597 483922 475783 470707 464090 455664 449152 438347 431153 429218
8350D29218l999q767l714p66n963m664m368m851n304l894k709J09m49k552q601
$$ 429218 425219 416452 412738 411972 406009 401345 396977 392126 386822 382928 380219 380328 379879 377327 368726
8335C68726q880m009j453n752l595j399n336m230l91o487q764j0430n844o35K718
$$ 368726 359846 355837 354384 348632 345037 343638 338302 334072 333681 327194 318430 308000 302156 301521 304239
8320C04239p950n066k654m164o197l121j688l228k21k137k367k175k448M4M005
$$ 304239 296289 291223 288569 284405 278208 275087 273399 270171 269950 267813 265446 263271 260823 260867 264872
8305B64872L230l742K050K022l460k731k241j201n636k609n000J011N74J934o855
$$ 264872 268102 264360 266410 268432 264972 262241 260000 258799 253163 250554 245554 246565 247139 249073 242218
8290B42218q204l016N90n683p074l449q85k016l178k199n062n624K466K268j239
$$ 242218 234014 230998 231588 225905 218831 215382 214497 212481 209303 207104 202042 196418 198884 201152 199913
8275A99913K662k844J89j207o39p61O198P665O389M61L513J5775K5050K9967K8667
$$ 199913 202575 199731 199920 198713 198074 197313 203511 211176 217565 218026 221539 237314 262364 292331 320998
8260C20998J2042K487q222j9722k8490l0368j7851j5524q877n597n240l675m781
$$ 320998 333040 335527 327305 307583 279093 248725 230874 215350 206473 200876 195636 191961 187180
8247A87180m521k111k015k742k33o312r491j514q844l815L641j611J575q99l327
$$ 187180 182659 180548 178533 175791 175558 169246 159755 158241 149397 145582 149223 147612 149187 148288 144961
8232A44961J745J232J206K96m31J722L638R049O877J0777J6652K3824K7616J9044
$$ 144961 146706 147938 149144 149440 149009 150731 154369 163418 170295 181072 197724 221548 249164 268208
8218B68208J2123M489j5924l0952l6202k4675j5307q028l677j0760m374p59n138
$$ 268208 280331 284820 268896 237944 201742 177067 161760 153732 150055 139295 134921 134162 129024
8205A29024r74k266k835r111j499k397r10J57K618K178j295n046k975j565k218
$$ 129024 128050 125784 122949 113838 112339 109942 109032 109189 111807 113985 112690 107644 104669 103104 100886
8190A00886m836j603l27p08K343n182j054M045L391P92l304l960r76n13j783j328
$$ 100886 96050 94447 94120 93412 95755 90573 89519 93564 96955 97747 94443 90483 89507 88994 87211 85883
8174H5883n308m162m55J374J174N595l469j471K59O12K639j133l44l81M426Q40
$$ 85883 80575 76413 75958 77332 78506 84101 80632 79161 79420 80032 82671 81538 81194 80813 85239 86079
8158H6079l411l919l974n248l579J774N782j582m306M297k052r31k823j680M670
$$ 86079 82668 78749 74775 69527 65948 67722 73504 71922 67616 71913 69861 68930 66107 64427 69097
8143F9097M437J698j981J242M756L102l778K855k02o151n838p277n503j064m236
$$ 69097 73534 75232 73251 74493 79249 82351 78573 81428 81226 75075 69237 61960 56457 55393 51157
8128E1157K29j717M001K468R6j356L89J102M945q63m505k299O704J258m170J968
$$ 51157 51386 49669 53670 56138 56234 54878 55267 56369 61314 60451 55946 53647 60351 61609 57439 59407
8112E9407L263l298m800l123K416j751M0n05O31l711k924j81n51j598l030N550
$$ 59407 62670 59372 54572 51449 53865 52114 52154 51649 52280 48569 45645 45464 44913 43315 40285 45835
8096D5835o0m916Q13K920J742j581k1R69L274j991k939p926R45k750K365N283
$$ 45835 45775 40859 41672 44592 46334 44753 44732 45701 48975 46984 44045 36119 37064 34314 36679 41962
8080D1962j190J384k825K916r1J095O764J040r409n891L80J69l425J307K095q24
$$ 41962 40772 42156 39331 42247 42156 43251 50015 51055 41646 35755 36135 36304 32879 34186 36281 35457
8064C5457o20l087j101M599k261k488L394j576J096M305J693m901p991p00K913
$$ 35457 34837 31750 30649 35248 32987 30499 33893 32317 33413 37718 39411 34510 26519 25819 28732
8049B8732J268n229k350l33J707k201k185K279L235O050L361j686j199K878m29
$$ 28732 30000 24771 22421 22088 23795 21594 19409 21688 24923 30973 34334 32648 31449 34327 33898
8034C3898n482n769L026J109K045N71p89p34L887M60L41m527n043l438J111J441
$$ 33898 28416 22647 25673 26782 28827 29398 28609 27875 31762 32222 32563 28036 22993 19555 20666 22107
8018B2107m964O85Q624M963k334m11L928l482k443J166p60K757k96l741j476K236
$$ 22107 17143 17828 26452 31415 29081 28670 32598 29116 26673 27839 27079 29836 29540 25799 24323 26559
8002B6559R81J750K042M75%l300p30j872J659L152l768p285O24K705k78n474r18
$$ 26559 27540 29290 31332 31807 31807 28507 27777 25905 27564 30716 26948 19663 20287 22992 22714 17240 16322
7985A6322J103L176Q70n787k924K736L63l486l721K267k190o779o261Q79L115
$$ 16322 17425 20601 21471 15684 12760 15496 15859 12373 8652 10919 8729 1950 -4311 -3432 -317
7970c17L017M469L672P358K683J343K912m566j018j626J924j240L183J153O86
$$ -317 2700 7169 10841 18199 20882 22225 25137 20571 19553 17927 19851 18611 21794 22947 23633
7955B3633q85R53L130K526l058o068p404l841j962Q374P030K120O48J230N178
$$ 23633 22748 23701 26831 29357 26299 20231 12827 8986 7024 15398 22428 24548 25196 26426 31604
7940C1604J108n551l377M954J194k767l17L324k647k507l921k834J243K694L782
$$ 31604 32712 27161 23784 28738 29932 27165 26848 30172 27525 25018 21097 18263 19506 22200 25982
7925B5982M317j49k528k291o41N7P63K658j128n208o956n66l368M501N147K322
$$ 25982 30299 30150 27622 25331 24690 24747 25510 28168 27040 21832 14876 14310 10942 15443 20590 22912
7909B2912j822j985j533j047O660n23j265M025L37j269K672o45p51l174K060p13
$$ 22912 21090 19105 17572 16525 23185 22662 21397 25422 25759 24490 27162 26517 25766 22592 24652 23939
7893B3939l457l670J700q1j064p19j828J253j229L080K349L774r02p498k166M661
$$ 23939 20482 16812 18512 18431 17367 16648 14820 16073 14844 17924 20273 24047 23145 15647 13481 18142
7877A8142L512k019R54k473n26K824K195n06p294n055k356P029q19o141N400K175
$$ 18142 21654 19635 20589 18116 17590 20414 22609 22103 14809 9754 7398 14427 13608 7467 12867 15042
7861A5042j310M650k488l035l316k68M30J487M620m258k828p62l030L370L862
$$ 15042 13732 18382 15894 12859 9543 9275 9705 11192 15812 11554 8726 7964 4934 8304 12166
7846A2166M53k951l468q84r61M768p91J042j764K506l4J440l973n212M034L917
$$ 12166 12619 9668 6200 5316 4355 9123 8332 9374 7610 10116 10082 11522 7549 2337 6371 10288
7830A0288K693K790m147J394m141L37Q06K88M244r61l781j603k936K718L064l007
$$ 10288 12981 15771 11624 13018 8877 9214 10020 10308 14552 13591 9810 8207 5271 7989 11053 8046
7814H046o72M769L674M873O19k930k50n11P216J476m120j368q50o955o222L01
$$ 8046 7374 12143 15817 20690 21309 18379 18129 17618 24834 26310 22190 20822 19972 13017 6795 7096
7798G096Q99K040L137m028m271k047Q067j975j5279k141M463N727K029o489k003
$$ 7096 7995 10035 13172 9144 4873 2826 10893 8918 -6361 -8502 -4039 1688 3717 -2772 -4775
7783d775K836j032k06M875L444k562j306r42j0J736J311j521l619L970M867O00
$$ -4775 -1939 -2971 -3177 1698 5142 2580 1274 332 322 2058 3369 1848 -1771 2199 7066 7666
7767G666m305k408k578J145L159M311l817o811j531j546m468R73L459O044K174
$$ 7666 3361 953 -1625 -480 2679 6990 3173 -3638 -5169 -6715 -11183 -10210 -6751 -707 1467
7752A467j597l489R50K612j252o121q17k956o40L832N754N102J717N321j284l757
$$ 1467 -130 -3619 -2669 -57 -1309 -7430 -8247 -11203 -11843 -8011 -2257 2845 4562 9883 8599 4842
7736D842K227l880k081R78J933k449j588L976L448j42m20p78k743J803j876l420
$$ 4842 7069 3189 1108 2086 4019 1570 -18 3958 7406 7264 6844 6066 3323 5126 3250 -170
7720a70r71L642k415l447P26N970L876j931j359j364O33M42m410J312N331M589
$$ -170 -1141 2501 86 -3361 -2635 3335 7211 5280 3921 2557 3190 3632 -778 534 5865 10454
7704A0454Q453M256N268K298j0138q143m284P5j815j930n211k320L255J32m723
$$ 10454 18907 23163 28431 30729 20591 12448 8164 8239 6424 4494 -717 -3037 218 350 -4373
7689d373k965J886L945M738K122L58J785J245L127r67J343l498o577L461J62m773
$$ -4373 -7338 -5452 -1507 3231 5353 5711 7496 8741 11868 10901 12244 8746 2169 5630 5792 1019
7673A019j511K701L853n161R74K990K974o33n468o038M602p29j677n035k827l090
$$ 1019 -492 2209 6062 901 1875 4865 7839 7206 1738 -4300 302 -427 -2104 -7139 -9966 -13056
7657a3056M387J188l23k32O090M777r43j594p76J568l806j824k501j820O39j590
$$ -13056 -8669 -7481 -7804 -8036 -1946 2831 1888 294 -482 1086 -2720 -4544 -7045 -8865 -8226 -9816
7641i816K405L470J93J052l79J912M697K811Q55N61j591n015O77r23R09m99j254
$$ -9816 -7411 -3941 -3748 -2696 -3075 -1163 3534 6345 7200 7761 6170 1155 1832 909 1818 1319 65
7624F5k789l085J053L776J936L676K721M211l347n705m860o32K262K47k594l979
$$ 65 -2724 -5809 -4756 -980 956 4632 7353 11564 8217 2512 -2348 -2980 -718 -471 -3065 -7044
7608g044J422p57l672L153O707L143j290l069m607k128n858j55R670N094L510
$$ -7044 -5622 -6379 -10051 -6898 -191 2952 1662 -1407 -6014 -8142 -14000 -14155 -4485 609 4119
7593D119m331n405j383k161p38L519J711l37L049m017l31m18L368J602j383J241
$$ 4119 -212 -5617 -7000 -9161 -9899 -6380 -4669 -5006 -1957 -5974 -6305 -6723 -3355 -1753 -3136 -1895
7577a895N183L720N338Q77l543k696j197K520k103p393l923J713P551Q67m153
$$ -1895 3288 7008 12346 13223 9680 6984 5787 8307 6204 -1189 -5112 -3399 4152 5019 866
7562H66l92M175J631m271l000r65o908l43l01J843J317l196N96J382N384K446
$$ 866 474 4649 6280 2009 -991 -1956 -8864 -9207 -9508 -7665 -6348 -9544 -8948 -7566 -2182 264
7546B64q4j16M788k536l745k236N275K665M339M565k241m690k568l668l282k741
$$ 264 180 64 4852 2316 -1429 -3665 1610 4275 8614 13179 10938 6248 3680 12 -3270 -6011
7530f011o784n13m22k086M420K370O20j130K779N339K127L26k001j130K02l113
$$ -6011 -12795 -13308 -13730 -15816 -11396 -9026 -8406 -9536 -6757 -1418 709 1035 -966 -2096 -1894 -5007
7514e007J819j39J409K283j142J981m649l232J042K163P468Q503K189n320l079
$$ -5007 -3188 -3327 -1918 365 -777 1204 -3445 -6677 -5635 -3472 3996 12499 14688 9368 6289
7499F289N245j164l994k861p353o76n42J722p41j716j278j134K359p9q06J776
$$ 6289 11534 10370 6376 3515 -3838 -4514 -5056 -3334 -4075 -5791 -7069 -8203 -5844 -5923 -6729 -4953
7483d953O894P91k622r44j405q15k061J683j224J915K959M640P83m176k372J928
$$ -4953 1941 2732 110 -834 -2239 -3054 -5115 -3432 -4656 -2741 218 4858 5641 1465 -907 1021
7467A021j21j171K256k701J997J269J77j843j238L922L270J507k001k456l230
$$ 1021 900 -271 1985 -716 1281 2550 2727 884 -354 3568 6838 8345 6344 3888 658
7452F58k787K538P168k119k844j780j211j009l292K089K900K706N34k848k859
$$ 658 -2129 409 7577 5458 2614 834 -377 -1386 -4678 -2589 311 3017 3551 703 -2156
7437b156j101k387j83k153j6K609L037J173p46l977P49J472LM965J026n313j250
$$ -2156 -3257 -5644 -5827 -7980 -7996 -5387 -2350 -1177 -1923 -5900 -5151 -3679 -3676 1289 2315 -2998 -4248
7420d248J595l41j340L010O688K342l363j621m545l509R99J072n950L20n485R99
$$ -4248 -2653 -2994 -4334 -1324 5364 7706 4343 2722 -1823 -5332 -4333 -3261 -9211 -8891 -14376 -13377
7404a3377Q798J942L404J595m402n692j477J159j311k017M624L337j542j872L863
$$ -13377 -4579 -2637 767 2362 -2040 -7732 -9209 -8050 -9361 -11378 -6754 -3417 -4959 -6831 -2968
7389b968K999o583k092j495J914q77J319N148Q26l556k484j626J493m223K055
$$ -2968 31 -6552 -8644 -10139 -8225 -9102 -7783 -2635 -1809 -5365 -7849 -9475 -7982 -12205 -10150
7374a0150o387o426J593N141j703K810Q178M867N273K326l249q53k151J450K610
$$ -10150 -16537 -22963 -21370 -16229 -17932 -15122 -6944 -2077 3196 5522 2273 1420 -731 719 3329
7359C329m427n537P590L498o60Q35l166O96j955k33m36l600j085l48j791j636
$$ 3329 -1098 -6635 955 4453 3793 4628 1462 2158 203 -30 -466 -4066 -5151 -5499 -7290 -8926
7343h926J786L584K004k332J222l528M46k861l205M667L747L022j273k739L546
$$ -8926 -7140 -3556 -1552 -3884 -2662 -6190 -5744 -8605 -11810 -7143 -3396 -374 -1647 -4386 -840
7328h40K193n96j537J185K049l006l866n230j144O363k140m50M488P668K629m936
$$ -840 1353 757 -780 405 2454 -552 -4418 -9648 -10792 -4429 -6569 -7019 -2531 5137 7766 2830
7312B830j184K082m614m176M788m31j264m449J442Q284K891j134j079j96j980
$$ 2830 1646 3728 -886 -5062 -274 -705 -1969 -6418 -4976 3308 6199 5065 3986 3790 1810
7297A810l011j596l561n62j751k061N064J183k803J089j263n442k410L463N180
$$ 1810 -1201 -2797 -6358 -6920 -8671 -10732 -5668 -4485 -7288 -6199 -7462 -12904 -15314 -11851 -6671
7282f671K600k800l138j559L891n93j952J280j898k991q69K814O815K226l61m019
$$ -6671 -4071 -6871 -10009 -11568 -7677 -8270 -10222 -8942 -10840 -13831 -14700 -11886 -5071 -2845 -3206 -7225
7266g225J037n65J135M62K34p91K81l47J00J684j816j115K324l73r548J368J918
$$ -7225 -6188 -6753 -5618 -5156 -4922 -5713 -5432 -5779 -5679 -3995 -5811 -6926 -4602 -4975 -14523 -13155 -11237
7249a1237L722L141j304k94K414J694R49K83l434j973j484o351m30j444j778L532
$$ -11237 -7515 -4374 -5678 -5972 -3558 -1864 -915 -632 -4066 -6039 -7523 -13874 -14304 -15748 -17526 -13994
7233a3994L992k559K321K194K457J299r74m253l357k558k211M375M364M514M126
$$ -13994 -10002 -12561 -10240 -8046 -5589 -4290 -5264 -9517 -12874 -15432 -17643 -13268 -8904 -4390 -264
7218b64L64j953j347K63j756l832j602N98L937k51j180R79K014Q38K619l203l867
$$ -264 100 -1853 -3200 -2937 -4693 -8525 -10127 -9529 -5592 -5843 -7023 -6044 -4030 -3192 -573 -3776 -7643
7201g643m728J326J665p22L702k58L367j177l272l255J472L263J235K990P87M739
$$ -7643 -12371 -11045 -9380 -10102 -6400 -6658 -3291 -4468 -7740 -10995 -9523 -6260 -5025 -2035 -1248 3491
7185C491k798O38o070m856o114L896N704M150R63M25M469p612K000O694J084p809
$$ 3491 693 1331 -4739 -9595 -15709 -11813 -6109 -1959 -996 -571 3898 -3714 -1714 4980 6064 -1745
7169a745o752m018K936j66K704N10l689n85k136L018K547k23k179K771L765l296
$$ -1745 -8497 -12515 -9579 -9745 -7041 -6531 -10220 -10805 -12941 -9923 -7376 -7599 -9778 -7007 -3242 -6538
7153f538j031j638k059N07k34l15K832R88j931L49j998m37j718P084K023J567
$$ -6538 -7569 -9207 -11266 -10759 -10993 -11308 -8476 -7488 -9419 -9070 -11068 -11505 -13223 -6139 -4116 -2549
7137b549J43n163m247L264K303J898R39r77j147p33N67k645k021N004K832N80
$$ -2549 -2406 -7569 -11816 -8552 -6249 -4351 -3412 -4389 -5536 -6269 -5702 -8347 -10368 -5364 -2532 -1952
7121a952O62R94l177m368pK04k389j518PL415p59K19M141j626l415M552M005O39
$$ -1952 -1290 -296 -3473 -7841 -7848 -7644 -10033 -11551 -11544 -8129 -8888 -8669 -4528 -6154 -9569 -5017 -1012 -373
7103c73k19j459l589n311J114K869L947l752K78R90k579k924k072k299K439K369
$$ -373 -592 -2051 -5640 -10951 -9837 -6968 -3021 -6773 -6495 -5505 -8084 -11008 -13080 -15379 -12940 -10571
7087a0571J984L343K998j053j236m298l350L647N651r36j070N031l013k602o50
$$ -10571 -8587 -5244 -2246 -3299 -4535 -8833 -12183 -8536 -2885 -3821 -4891 140 -2873 -5475 -6125
7072f125m691J733J687q57j031J882j013j853j422j709K353L240O038L511m389
$$ -6125 -10816 -9083 -7396 -8253 -9284 -7402 -8415 -10268 -11690 -13399 -11046 -7806 -1768 1743 -2646
7057b646n059k279m499M400L303j762n08J906K564L25j161j117l17j618L236M87
$$ -2646 -7705 -9984 -14483 -10083 -6780 -8542 -9050 -7144 -4580 -4255 -5416 -6533 -6850 -8468 -5232 -4745
7041d745j97k070O25j749L686M862J927r46n633j493K188k960N63J147k918j484
$$ -4745 -4942 -7012 -6387 -8136 -4450 412 2339 1393 -4240 -5733 -3545 -6505 -5942 -4795 -7713 -9197
7025i197o53L165J031o437J371K616L03j385M037K871j22k970l474j603j560P79
$$ -9197 -9850 -6685 -5654 -12091 -10720 -8104 -7801 -9186 -5149 -2278 -2400 -5370 -8844 -10447 -12007 -11228
7009a1228M261J079p9K265j257r9L169J205L386n566l97P145L841n402o455l633
$$ -11228 -6967 -5888 -5967 -3702 -4959 -5058 -1889 -684 2702 -2864 -3261 3884 7725 2323 -4132 -7765
6993g765P32Q49K769J000j828J41j036m205L730N453l08l019n33M42K768K457
$$ -7765 -7033 -6184 -3415 -2415 -4243 -4102 -5138 -9343 -5613 -160 -468 -3487 -4020 -3578 -810 1647
6977A647k53j587m238q82j714j463L870k139k849M902K052p7o77k816m37L81J843
$$ 1647 1394 -193 -4431 -5313 -7027 -8490 -4620 -6759 -9608 -4706 -2654 -2731 -3408 -6224 -6661 -6280 -4437
6960d437J233m591J291k271l509M033O089J532l47K715r85j989o306j284N090
$$ -4437 -3204 -7795 -6504 -8775 -12284 -8251 -2162 -630 -977 1738 753 -1236 -7542 -8826 -3736
6945c736J653L158J333J05M12o06M40m658k07J21k553J91j146k643K05J613l293
$$ -3736 -2083 1075 2408 2513 2925 2319 2759 -1899 -2106 -1985 -4538 -4347 -5493 -8136 -7931 -6318 -9611
6928i611M166M667k046l861n622J807J737J115K049k91l407o271P120M841m58
$$ -9611 -5445 -778 -2824 -6685 -12307 -10500 -8763 -7648 -5599 -5890 -9297 -15568 -8448 -3607 -4065
6913d065L72K813m450j615M129k518k450N271J92J427k461q65N087J346m157o515
$$ -4065 -3693 -880 -5330 -6945 -2816 -5334 -7784 -2513 -2321 -894 -3355 -4220 867 2213 -1944 -8459
6897h459P37M152j529Q17P41J521l101m696o7m372M069L173K941o26l738o7M21
$$ -8459 -7722 -3570 -5099 -4282 -3541 -2020 -5121 -9817 -9884 -14256 -10187 -7014 -4073 -4699 -8437 -8504 -8083
6880h083k562m76L520l18m16K997K771j987L570n985p286l09J500j028K28K147
$$ -8083 -10645 -11121 -7601 -7919 -8335 -5338 -2567 -4554 -984 -6969 -14255 -14564 -13064 -14092 -13864 -11717
6864a1717L105Q802o192m388J172P637m16k781p65k4J625M31p06K416K154J619
$$ -11717 -8612 190 -6002 -10390 -9218 -1581 -1997 -4778 -5543 -5567 -3942 -3511 -4217 -1801 353 1972
6848A972l63j482L12N26Q6j098J808j61m239m355k89j606M8K38l654M37O592n577
$$ 1972 1609 127 439 965 1051 -47 1761 1600 -2639 -6994 -7283 -8889 -8841 -8603 -12257 -11820 -5228 -10805
6830a0805l157M362L421J385Q13j930k834L514K924k273j815J934J744Q73k158
$$ -10805 -13962 -9600 -6179 -4794 -3981 -5911 -8745 -5231 -2307 -4580 -6395 -4461 -2717 -1844 -4002
6815d002m005j173P13l88L24L967P497j405l130P45m64j720k771j627K900P19
$$ -4002 -8007 -9180 -8467 -8855 -8531 -4564 2933 1528 -1602 -857 -1321 -3041 -5812 -7439 -4539 -3820
6799c820j877l683N832K352k074m513j838K13Q81K446N398K088K266n50k172k814
$$ -3820 -5697 -9380 -3548 -1196 -3270 -7783 -9621 -9408 -8527 -6081 -683 1405 3671 3121 949 -1865
6783a865K79l985n10J210k716m072P346K43n360J25L617K466k093m927k196j570
$$ -1865 -1586 -5571 -6081 -4871 -7587 -11659 -4313 -4070 -9430 -9305 -5688 -3222 -5315 -10242 -12438 -14008
6767a4008O938Q551o42n44n368O25J408L33J511m921j070j53M035k847j217K876
$$ -14008 -7070 1481 839 295 -5073 -4448 -3040 -2707 -1196 -6117 -7187 -7340 -3305 -6152 -7369 -4493
6751d493k078j944J642J878R72L455j17N03l67K707o63j29K64L8K1j653l867Q23
$$ -4493 -6571 -8515 -6873 -4995 -4023 -568 -685 -182 -549 2158 1495 1366 1630 1668 1689 36 -3831 -3008
6733c008r6K128k568m655O24p63j784J954L17M749N950j242l458J7K068L583j196
$$ -3008 -3104 -976 -3544 -8199 -7575 -8338 -10122 -8168 -7851 -3102 2848 1606 -1852 -1835 233 3816 2620
6716B620j959j564R55J967m652m587k505k233M910M983K859n167n018l006o76
$$ 2620 661 -903 52 2019 -2633 -7220 -9725 -11958 -7048 -2065 794 -4373 -9391 -12397 -13073
6701a3073j40M137P78M917K162R98j438kj422M011O170K728k676N79p122p202
$$ -13073 -13213 -9076 -8298 -3381 -1219 -221 -1659 -1661 -3083 928 7098 9826 7150 7729 607 -6595
6685f595l136J56L080N701j416P30j314J139J178l76k983L003j934m917K19L524
$$ -6595 -9731 -9575 -6495 -794 -2210 -1480 -2794 -1655 -477 -853 -3836 -833 -2767 -7684 -7465 -3941
6669c941N301L528n044p417k263M55M936M211m770j493L086J208j441p94O04K134
$$ -3941 1360 4888 -156 -7573 -9836 -9381 -4445 -234 -5004 -6497 -3411 -2203 -3644 -4438 -3834 -1700
6653a700m71j897L373M852k308m401j096n901l723M581L745j468L180k828m284
$$ -1700 -2171 -4068 -695 4157 1849 -2552 -3648 -9549 -13272 -8691 -4946 -6414 -3234 -6062 -10346
6638a0346L047N009j98p289K339P349L083j86q874n302K06m2L071K610J387K288
$$ -10346 -7299 -2290 -2488 -9777 -7438 -89 2994 2808 -6066 -11368 -11162 -11204 -8133 -5523 -4136 -1848
6622a848K044K975k295K068j528j261N197n742J052K564k390m261J758k950P26
$$ -1848 196 3171 876 2944 1416 155 5352 -390 662 3226 836 -3425 -1667 -4617 -3891
6607c891L173l340n129L80L781M28o15n95K517k58k581n621J350r63K506L061
$$ -3891 -718 -4058 -9187 -8807 -5026 -4598 -5213 -5808 -3291 -3549 -6130 -11751 -10401 -11364 -8858 -5797
6591e797j920J692K09M699J493J512k210L509k497k920K017J565R55J915l451
$$ -5797 -7717 -6025 -5816 -1117 376 1888 -322 3187 690 -2230 -213 1352 2307 4222 771
6576G71j441K112l905J602O75m511L724O73P27j680j755r69j873K833k756O37
$$ 771 -670 1442 -2463 -861 -186 -4697 -973 -300 427 -1253 -3008 -3977 -5850 -3017 -5773 -5136
6560e136L130K415l208m499J199l198n12J631L275o12j741k526J247P712N686
$$ -5136 -2006 409 -2799 -7298 -6099 -9297 -9809 -8178 -4903 -5515 -7256 -9782 -8535 -823 4863
6545D863n570r84J371l863k500j26M060N214K940m468m843L565l69L567k394l948
$$ 4863 -707 -1691 -320 -4183 -6683 -6809 -2749 2465 5405 937 -3906 -341 -710 2857 463 -3485
6529c485n873K546N113K332l920j780q87m86J261L770k27J207L042J260K945k299
$$ -3485 -9358 -6812 -1699 633 -3287 -5067 -5954 -6440 -5179 -1409 -1636 -429 2613 3873 6818 4519
6513D519l913m520j432J764j424J497J587n755l953R09J321J537Q8J283q23k419
$$ 4519 606 -3914 -5346 -3582 -5006 -3509 -1922 -7677 -11630 -10721 -9400 -7863 -7775 -6492 -7315 -9734
6497i734M875R23O24r30j043L46J545K034l965l099J682K110J042j018m4k049
$$ -9734 -4859 -3936 -3312 -4242 -5285 -4939 -3394 -1360 -5325 -8424 -6742 -4632 -3590 -4608 -4652 -6701
6481f701L073N716m058j394J395J713m239M58l138m001l665K570P8J29K026o6
$$ -6701 -3628 2088 -1970 -3364 -1969 -256 -4495 -4037 -7175 -11176 -14841 -12271 -12193 -12064 -10038 -10104
6465a0104j44L804L627J452k120N281l035m365r43J093j039j159R17l733J061
$$ -10104 -10248 -6444 -2817 -1365 -3485 1796 -1239 -5604 -6547 -5454 -6493 -7652 -6735 -10468 -9407
6450i407L092J920j465n093Q95N47j24L237K257m37R22K918k586M72K460M804
$$ -9407 -6315 -4395 -5860 -10953 -10058 -9511 -9635 -6398 -4141 -4578 -3656 -738 -3324 -2852 -392 4412
6434D412j363K452o66r90j620k929n396n72k410K947L963j15k741L328J428j709
$$ 4412 3049 5501 4835 3845 2225 -704 -6100 -6672 -9082 -6135 -2172 -2287 -5028 -1700 -272 -1981
6418a981K619j155o91K943K978j915R16k181M86l042j931k776O38k517q33M47
$$ -1981 638 -517 -1208 1735 4713 2798 3714 1533 2019 -1023 -2954 -5730 -5092 -7609 -8442 -7995
6402g995K126J247J471L137l323j550k098K269N245n70j74j19K011o752j095L89
$$ -7995 -5869 -4622 -3151 -14 -3337 -4887 -6985 -4716 529 -41 -215 -334 1677 -5075 -6170 -5781
6386e781k534J561O427P46p555k720K432K634J250l748l248K400J710K6K651J616
$$ -5781 -8315 -6754 -327 419 -7136 -9856 -7424 -4790 -3540 -7288 -10536 -8136 -6426 -6400 -3749 -2133
6370b133o09k014k198P57J174R66L003J256l732m223K389P138k010j782k88Q3
$$ -2133 -2742 -4756 -6954 -6197 -5023 -4057 -1054 202 -3530 -7753 -5364 1774 -236 -2018 -2306 -2223
6354b223k63l770L070K328R68j338m012J689j220N48m893K421P138J220k189L707
$$ -2223 -2486 -6256 -3186 -858 110 -1228 -5240 -3551 -4771 -4223 -9116 -6695 443 1663 -526 3181
6338C181L232o932n908o162r15L889O323l975k026K211M65k875J783K99q00M347
$$ 3181 6413 -519 -6427 -12589 -13504 -9615 -3292 -7267 -9293 -7082 -6617 -9492 -7709 -7410 -8210 -3863
6322c863q09k259j806J50l389J003O812N277K945j619k026Q63j625j629J724K82
$$ -3863 -4672 -6931 -8737 -8587 -11976 -10973 -4161 1116 4061 2442 416 1279 -346 -1975 -251 31
6306C1j245k416J471l778k207K282M51J722k654j485P37m9m48N63o79O24M936
$$ 31 -1214 -3630 -2159 -5937 -8144 -5862 -5411 -3689 -6343 -7828 -7091 -7140 -7588 -7025 -7704 -7080 -2144
6289b144J968K117L163n273n214J002N711k170m14L891J001K73n943k169j373
$$ -2144 -176 1941 5104 -169 -5383 -4381 1330 -840 -1254 2637 3638 3911 -2032 -4201 -5574
6274e574L711J706K788j045m86r88k113k722J183O189K958p022p097L87K967r8
$$ -5574 -1863 -157 2631 1586 1100 112 -2001 -4723 -3540 2649 5607 -1415 -8512 -8125 -5158 -5256
6258e256j169k890q2L53l20O86N386M470j301n352l774J400K030j830K70M119
$$ -5256 -6425 -9315 -9397 -9044 -9364 -8678 -3292 1178 -123 -5475 -9249 -7849 -5819 -7649 -7379 -3260
6242c260k13k294J43J245J925L945n149K46l65n7N221k520l207m597j509K555
$$ -3260 -3473 -5767 -5624 -4379 -2454 1491 -3658 -3412 -3777 -3834 1387 -1133 -4340 -8937 -10446 -7891
6226g891K551l45j517n15o5J535l547m334L23M630L966r06L127P51m895j462L499
$$ -7891 -5340 -5685 -7202 -7717 -7782 -6247 -9794 -14128 -13805 -9175 -5209 -6115 -2988 -2237 -7132 -8594 -5095
6209e095R66k749K528l01K893l16j887J786j067R03M537K445l881n227l171M436
$$ -5095 -4129 -6878 -4350 -4651 -1758 -2074 -3961 -2175 -3242 -2339 2198 4643 762 -4465 -7636 -3200
6193c200J569M075m229K02J273Mp693K062K583l9j926j812O856m00m480k532N696
$$ -3200 -1631 2444 -1785 -1583 -310 -306 -7999 -5937 -3354 -3393 -5319 -7131 -275 -675 -5155 -7687 -1991
6176a991K184k951l59L185k17M8L846j842j633O10p8m34l750P04k519j485L51
$$ -1991 193 -2758 -3117 68 -149 -101 3745 1903 270 880 802 368 -3382 -2678 -5197 -6682 -6331
6159f331P543P440p71J528m994n076k770J524j058o288j085M81j157J292O302
$$ -6331 1212 8652 7881 9409 4415 -661 -3431 -1907 -2965 -9253 -10338 -9857 -11014 -9722 -3420
6144c420J973n408j835R688L362k50j380m68j86M36l570Q67j019j344K436M994
$$ -3420 -1447 -6855 -8690 998 4360 4110 2730 2262 2076 2512 -1058 -191 -1210 -2554 -118 4876
6128D876j879m052O93m436J306K534R66k71J386k600l611K567K614K829k514M12
$$ 4876 2997 -1055 -362 -4798 -3492 -958 8 -263 1123 -1477 -5088 -2521 93 2922 408 820
6112H20M086j536k896n478q79O439P79m629j350J424l067n59o60J440l538J384
$$ 820 4906 3370 474 -5004 -5883 556 1335 -3294 -4644 -3220 -6287 -6846 -7506 -6066 -9604 -8220
6096h220J281K703M52k693p69l517j412J340M353J247k81k530O28l53n33R15L962
$$ -8220 -6939 -4236 -3784 -6477 -7246 -10763 -12175 -10835 -6482 -5235 -5516 -8046 -7418 -7771 -8304 -7389 -3427
6079c427k444k308l169j315k970M387P200j959j351O503L328L844J859q794n240
$$ -3427 -5871 -8179 -11348 -12663 -15633 -11246 -4046 -6005 -7356 -853 2475 6319 8178 -616 -5856
6064e856m16K109r75P31K086L271j090m842l223J652K531k125k449N944j561K983
$$ -5856 -6272 -4163 -5138 -4407 -2321 950 -140 -4982 -8205 -6553 -4022 -6147 -8596 -2652 -4213 -1230
6048a230M379m186n264p63k70J95J910m12m476K455k7M494N41N59m502k190K152
$$ -1230 3149 -1037 -6301 -7064 -7334 -7139 -5229 -5641 -10117 -7662 -7689 -3195 -2654 -2095 -6597 -8787 -6635
6031f635j520Q87M395l433j159P54L122m84J643j610k31M31J989Q75K05Q93Q51
$$ -6635 -8155 -7268 -2873 -6306 -7465 -6711 -3589 -4073 -2430 -4040 -4271 -3840 -1851 -976 -771 122 973
6014I73N61K277J954m475q518K145L388K419o06m135m007m470J842K368j488o304
$$ 973 1534 3811 5765 1290 -7228 -5083 -1695 724 118 -4017 -8024 -12494 -10652 -8284 -9772 -16076
5998a6076K714L519j114k663j812N194L404r17L644O225M265r71l836m054o406
$$ -16076 -13362 -9843 -10957 -13620 -15432 -10238 -6834 -7751 -4107 2118 6383 5412 1576 -2478 -8884
5983h884p36J78J043J895N733K455j082l184M650K153q810n015N525M990k36k015
$$ -8884 -9620 -9442 -8399 -6504 -771 1684 602 -2582 2068 4221 -4589 -9604 -4079 911 675 -1340
5967a340o474M267k202j775P362K949k929o42m123k378N488L759o20l791k592
$$ -1340 -7814 -3547 -5749 -7524 -162 2787 -142 -784 -4907 -7285 -1797 1962 1342 -2449 -5041
5952e041M581j333P96L315Q87r3j248l628j544K964j700j774j929J000M275L382
$$ -5041 -460 -1793 -997 2318 3205 3112 1864 -1764 -3308 -344 -2044 -3818 -5747 -4747 -472 2910
5936B910k798l278j416j685n186k703P31J922j583k330N528P080L599K391q091
$$ 2910 112 -3166 -4582 -6267 -11453 -14156 -13425 -11503 -13086 -15416 -9888 -2808 791 3182 -4909
5921d909p969l845M996K935j627K366K763k363J527N209k511k555J41K544J29
$$ -4909 -12878 -16723 -11727 -8792 -10419 -8053 -5290 -7653 -6126 -917 -3428 -5983 -5842 -3298 -3169
5906c169M3k007k182j651K64N045O103M67J470n631j248L860K631L92n127l238
$$ -3169 -3126 -5133 -7315 -8966 -8702 -3657 2446 2913 4383 -1248 -2496 1364 3995 4387 -740 -3978
5890c978J406k257k054j019J666O759K955l981r076l650L697k064k383O254Q933
$$ -3978 -2572 -4829 -6883 -7902 -6236 523 3478 -503 -9579 -13229 -9532 -11596 -13979 -7725 1208
5875A208k86k044O74K893J445k773J205L58j705k491J719M225l51N29K515k015
$$ 1208 922 -1122 -448 2445 3890 1117 2322 2680 975 -1516 203 4428 4077 4606 7121 5106
5859E106k907J833k001j568J703K042m084j733m555k585M22j547J983J527l104
$$ 5106 2199 4032 2031 463 2166 4208 124 -1609 -6164 -8749 -8327 -9874 -7891 -6364 -9468
5844i468N95m35J411J608L042R32L227K543k524n918k268R63L753j131m162J952
$$ -9468 -8873 -9308 -7897 -6289 -3247 -2315 912 3455 931 -4987 -7255 -6292 -2539 -3670 -7832 -5880
5828e880J85M428L536K485J5q3m09k605j865j68J261k497J390j208l680p60P971
$$ -5880 -5695 -1267 2269 4754 4769 4686 4277 1672 -193 -361 900 -1597 -207 -1415 -5095 -5855 2116
5811B116L412P36j159n149j001J511j113P62L120j233j471P1j778k047K057K973
$$ 2116 5528 6264 5105 -44 -1045 466 -647 115 3235 2002 531 602 -1176 -3223 -1166 1807
5795A807M910n18k160m523k754j84P82M1k444J929K046j213k143j711J823N741
$$ 1807 6717 6199 4039 -484 -3238 -3422 -2640 -2599 -5043 -3114 -1068 -2281 -4424 -6135 -4312 1429
5779A429K291j053L843l984j012L808k706p110J929R281r12p007k994M149O533
$$ 1429 3720 2667 6510 2526 1514 5322 2616 -4494 -2565 6716 5804 -1203 -4197 -48 6485
5764F485K936J217n035m475O96J08K954L977r3M50K28P35l750j290j508K358j299
$$ 6485 9421 10638 5603 1128 1824 1932 4886 8863 8770 9220 9448 10183 6433 5143 3635 5993 4694
5747D694K13j657o324m188J328Q65N520J649J462M672R44l982l078l568k234j389
$$ 4694 4907 3250 -3074 -7262 -5934 -5069 451 2100 3562 8234 9178 5196 2118 -1450 -3684 -5073
5731e073m279J038j30N17K601O446K58l352m6L407M347L99m338j452o670l72J796
$$ -5073 -9352 -8314 -8444 -7927 -5326 1120 1378 -1974 -2020 1387 5734 6133 1795 343 -6327 -6699 -4903
5714d903O139N381l985j891R64j711J718k577l86J755mj389N336j321p07K552
$$ -4903 1236 6617 2632 741 1705 -6 1712 -865 -1251 504 500 -889 4447 3126 2419 4971
5698D971l118J778l124p07p63j194J216M15K10n313n615L878L866k593m941m59
$$ 4971 1853 3631 507 -200 -963 -2157 -941 -526 -316 -5629 -11244 -7366 -3500 -6093 -11034 -11493
5682a1493k588N222J701j061r05J755P43K459K086L849M491K091J584l850p440
$$ -11493 -14081 -8859 -7158 -8219 -9124 -7369 -6626 -4167 -2081 1768 6259 8350 9934 6084 -1356
5667a356l946K685j798j588j469r2o2L527J189P08k799j570L184L538j623m667
$$ -1356 -5302 -2617 -4415 -6003 -7472 -7564 -7626 -4099 -2910 -2202 -5001 -6571 -3387 151 -1472 -6139
5651f139k123M196K851k770o323M854M082K119K66n004l184J271L099N00o579
$$ -6139 -8262 -4066 -1215 -3985 -10308 -5454 -1372 747 1013 -3991 -7175 -5904 -2805 -2305 -8884
5636h884K8Q358L349k406N008l265n762P14M90k964k463J713j027J497O05M86
$$ -8884 -8856 -498 2851 445 5453 2188 -3574 -2860 -2370 -5334 -7797 -6084 -7111 -5614 -5009 -4523
5620d523J854L14n71n539O50N322L555j834j898l510L767J505p01J268K34n797
$$ -4523 -2669 -2355 -2926 -8465 -7815 -2493 1062 -772 -2670 -6180 -2413 -908 -1609 -341 -107 -5904
5604e904J113J023q46L202O635n47j313k322o675q5Q9K475j108n029l672K114
$$ -5904 -4791 -3768 -4614 -1412 5223 4676 3363 1041 -5634 -5719 -5630 -3155 -4263 -9292 -12964 -10850
5588a0850o277J954P464j999J573N042k432q77l480k035r76K232L234M523Q44
$$ -10850 -17127 -15173 -7709 -9708 -8135 -3093 -5525 -6402 -9882 -11917 -12893 -10661 -7427 -2904 -2060
5573b060q77j44m58j528L393L26j590p24J729L428N533k811n562m672j653M887
$$ -2060 -2937 -3081 -3539 -5067 -1674 -1348 -2938 -3662 -1933 1495 7028 4217 -1345 -6017 -7670 -2783
5557b783l752l341K996N192m53M421K20J244q52k600p690k34J440j250r58J579
$$ -2783 -6535 -9876 -6880 -1688 -2141 2280 2500 3744 2892 292 -7398 -7632 -6192 -7442 -8400 -6821
5541f821R68k429P17M591q68l104K15l757K633M089J087m707l838j897L314J044
$$ -6821 -5853 -8282 -7565 -2974 -3842 -6946 -6731 -10488 -7855 -3766 -2679 -7386 -11224 -13121 -9807 -8763
5525h763l18L004L303Q93L87l28J311J828k629L20L365N902o79l516l342L853
$$ -8763 -9081 -6077 -2774 -1881 -1494 -1822 -511 1317 -1312 -992 2373 8275 7596 4080 738 4591
5509D591n580o458K19N996L887j897l977K67O168J265K576p322p57M109Q13o14
$$ 4591 -989 -7447 -7228 -1232 2655 758 -3219 -2952 3216 4481 7057 -265 -1022 3087 3900 3286
5493C286J761J119J026l404l780M96K02K505k201L92J359J814q43o93q37K401
$$ 3286 5047 6166 7192 3788 8 504 706 3211 1010 1402 2761 4575 3732 3039 2202 4603
5477D603m520J074K796J549J609m901J015N150l966j114j101k215L319O86k950
$$ 4603 83 1157 3953 5502 7111 2210 3225 8375 4409 3295 2194 -21 3298 3984 1034
5462A034k423P62n19K604J810K951p56k161k188n664k17M631k10K78K841l266
$$ 1034 -1389 -627 -1146 1458 3268 6219 5463 3302 1114 -4550 -4767 -136 -346 -68 2773 -493
5446d93l000L016L268l961l854K812O54k96K183M87j331K737k030K036K347m829
$$ -493 -3493 -477 2791 -1170 -5024 -2212 -1558 -1854 329 816 -515 2222 192 2228 4575 -254
5430b54p76p86P10l2k861m19N67j252m44P012o222k62r04j381P11J832J275K513
$$ -254 -1030 -1816 -1106 -1138 -3999 -4418 -3851 -5103 -5547 1465 -4757 -5019 -5923 -7304 -6593 -4761 -3486 -973
5412i73L724l947j2M293N040K795K141l459j861n135m559j341N19j394l920k978
$$ -973 2751 -1196 -1208 3085 8125 10920 13061 9602 7741 2606 -1953 -3294 -2775 -4169 -8089 -11067
5396a1067j827J734R92J911N035M87k202o59N091K445o547j558L292m75m427O154
$$ -11067 -12894 -11160 -10168 -8257 -3222 -2735 -4937 -5596 -505 1940 -4607 -6165 -2873 -3348 -7775 -1621
5380a621K736K657L389jj655n895l982J751L260k168j222P120Q17m137r80l856
$$ -1621 1115 3772 7161 7160 5505 -390 -4372 -2621 639 -1529 -2751 4369 5186 1049 69 -3787
5364c787Q76N233q63J251n481J927L542J674k71k418n508l136k205L782J967n01
$$ -3787 -2911 2322 1459 2710 -2771 -844 2698 4372 4101 1683 -3825 -6961 -9166 -5384 -3417 -3918
5348c918k477M40L828N999J457J775l35n599n704K595K945n019j639N380L417
$$ -3918 -6395 -5955 -2127 3872 5329 7104 6769 1170 -4534 -1939 1006 -4013 -5652 -272 3145
5333C145n00m409k664J5o45J458l83Q84J927J401J957l609m960R8L052j080j612
$$ 3145 2645 -1764 -4428 -4413 -5058 -3600 -3983 -3099 -1172 229 2186 -1423 -6383 -6285 -3233 -4313 -5925
5316e925M676K452K222J674j466m269q145K407N305k091k868M76P304J118j421
$$ -5925 -1249 1203 3425 5099 3633 -636 -8781 -6374 -1069 -3160 -6028 -5552 1752 2870 1449
5301A449j43l644q47L906K023j242p8j84M45Q60r2K947J937l363j707j955Q19
$$ 1449 1306 -2338 -3185 721 2744 1502 1424 1240 1685 2545 2453 5400 7337 3974 2267 312 1131
5284A131R45O335K873l794k693o097J842K597m171J555M121K989m800k99K071
$$ 1131 2076 8411 11284 7490 4797 -1300 542 3139 -1032 523 4644 7633 2833 2534 4605
5269D605k726o280N26k63m179K30J542R14J954n90m730n70N042N006k180j259
$$ 4605 1879 -4401 -3875 -4138 -8317 -8087 -6545 -5631 -3677 -4267 -8997 -9567 -4525 481 -1699 -2958
5253b958N154M004K990l61j535j480j965K839j339p051j950L128K163k234j210
$$ -2958 2196 6200 9190 8829 7294 5814 3849 6688 5349 -1702 -3652 -524 1639 -595 -1805
5238a805M754R99r97n083l72J764K605L499l250L11K007J822K381m459m896j378
$$ -1805 2949 3948 2951 -2132 -2504 -740 1865 5364 2114 2425 4432 6254 8635 4176 -720 -2098
5222b098M592l90j689K62M952m403m505Q85M765K093j989l995k344M509O647m50
$$ -2098 2494 2104 415 677 5629 1226 -3279 -2394 2371 4464 2475 -1520 -3864 645 7292 6842
5206F842n923l672o420l501J613L869O544L455j368m412l139K025K38K657K668
$$ 6842 919 -2753 -9173 -12674 -11061 -7192 -648 2807 1439 -2973 -6112 -4087 -3849 -1192 1476
5191A476Q57J739j619J71L023K30o558o11l377j975q79o75k952j857n74K759O239
$$ 1476 2333 4072 2453 2624 5647 5877 -681 -1292 -4669 -6644 -7523 -8198 -11150 -13007 -13581 -10822 -4583
5174d583j488M177J826M992K917l22k567j673k039j237k29Q40J300J097k523J164
$$ -4583 -6071 -1894 -68 4924 7841 7519 4952 3279 1240 3 -226 614 1914 3011 488 1652
5158A652K934k070N4M234R32J795K941K17p964o256L742l846l613m529K238O927
$$ 1652 4586 2516 2570 6804 7736 9531 12472 12689 4725 -1531 2211 -1635 -5248 -9777 -7539 -612
5142f12L88j007k05K415L83k173K851j259L021m852j541L286M240J385m101k553
$$ -612 -224 -1231 -1436 979 1362 -811 2040 781 3802 -1050 -2591 695 4935 6320 2219 -334
5126c34L022k026O96K481J194r193p510L414K739j379j314j517M33M002K423N144
$$ -334 2688 662 1358 3839 5033 -4160 -11670 -8256 -5517 -6896 -8210 -9727 -9294 -5292 -2869 2275
5110B275P140J425m621q68l987j961J361O945J252j396l176j141j784J254j17
$$ 2275 9415 10840 6219 5351 1364 -597 764 7709 8961 7565 4389 3248 1464 2718 2601
5095B601k913J99p86o80J492l022J487L5K33j042J516j433l163l759J07P207k71
$$ 2601 -312 -113 -899 -1579 -87 -3109 -1622 -1587 -1354 -2396 -880 -2313 -5476 -9235 -9128 -1921 -2192
5078b192K241N693K223k727l771o198j792O845O135O224k48l71q16m654l596n528
$$ -2192 49 5742 7965 5238 1467 -4731 -6523 322 6457 12681 12433 12062 11246 6592 2996 -2532
5062b532m780Q20L433l100M85J044q80J078j415j114R33M614L703l085k980J384
$$ -2532 -7312 -6492 -3059 -6159 -5674 -4630 -5510 -4432 -5847 -6961 -6028 -1414 2289 -796 -3776 -2392
5046b392P42n8K042N000l181l165n969j046L442J840k301K657j336k448p37L527
$$ -2392 -1650 -1708 334 5334 2153 -1012 -6981 -8027 -4585 -2745 -5046 -2389 -3725 -6173 -6910 -3383
5030c383M914N58l483j736K235j979j205N425N713o767q001J765O427k982m799
$$ -3383 1531 2089 -1394 -3130 -895 -2874 -4079 1346 7059 292 -7709 -5944 483 -2499 -7298
5015g298J057O63M010O14k196K780n800L400N379j684m013j731O20J117k381k448
$$ -7298 -6241 -5578 -1568 -954 -3150 -370 -6170 -2770 2609 925 -3088 -4819 -4199 -3082 -5463 -7911
4999g911R65K379M158l63k604m88L85L885k376J435L894P91k444k385K156J735
$$ -7911 -6946 -4567 -409 -772 -3376 -3864 -3479 406 -1970 -535 3359 4150 1706 -679 1477 3212
4983C212j42r30J124k446p49J655M77N47k192l32n526M423N606j826j646p4r91
$$ 3212 3070 2140 3264 818 69 1724 2201 2748 556 224 -5302 -879 4727 2901 1255 1181 190
4966A90j636K98L567M135o16M458m658J59o74J237J346K75p282j838J275K530
$$ 190 -1446 -1148 2419 6554 5938 10396 5738 5897 5223 6460 7806 8081 799 -1039 236 2766
4950B766k204j462M224L748j867L09k760q172o331K605N549N338K681k099l797
$$ 2766 562 -900 3324 7072 5205 5514 2754 -5418 -11749 -9144 -3595 1743 4424 2325 -1472
4935a472M945K103L234L877k244o497k489J032M438K517j424l584j734M9L692
$$ -1472 3473 5576 8810 12687 10443 3946 1457 2489 6927 9444 8020 4436 2702 2751 6443
4920F443P676l913m325K271l100m432J723M309k337J064k36k854j618K678K687
$$ 6443 14119 10206 5881 8152 5052 620 2343 6652 4315 5379 5143 2289 671 3349 6036
4905F036p972j638K45j789N989r40P19L093P37K296q33j053m442M37j578q99K900
$$ 6036 -1936 -3574 -3329 -5118 871 -69 650 3743 4480 6776 5943 4890 448 885 -693 -1592 1308
4888A308j275K117K067j279m341o46N960k004J166N132L84k39k601Q99l88l57
$$ 1308 33 2150 4217 2938 -1403 -2049 3911 1907 3073 8205 8589 8350 5749 6648 6260 5903
4872E903m39k463n49N92l730l7j473N157N589l915o297k703M740j827l510M704
$$ 5903 5464 3001 2452 3044 -686 -723 -2196 2961 8550 4635 -1662 -4365 375 -1452 -4962 -258
4856b58q78o243K459L536L606J537m869l912J681M57l890L264L864M390K288J23
$$ -258 -1136 -7379 -4920 -1384 2222 3759 -1110 -5022 -3341 -2884 -6774 -3510 354 4744 7032 7155
4840G155J244k918l307m502L72J412N89l702K073M27m818j029J524K759Q96J488
$$ 7155 8399 5481 2174 -2328 -1956 -544 45 -3657 -1584 -1157 -5975 -7004 -5480 -2721 -1825 -337
4824c37P36j706J020N179L206p533q76K392L405k2j93p146k194N906q81J006K253
$$ -337 399 -1307 -287 4892 8098 565 -311 2081 5486 5464 5271 -1875 -4069 1837 956 1962 4215
4807D215J362j038k653J694L075j71k355n468p350L210j078j717N234j39k514
$$ 4215 5577 4539 1886 3580 6655 6484 4129 -1339 -8689 -5479 -6557 -8274 -3040 -3179 -5693
4792e693l661J478M752j86q87L600o558n49M574O794q09o42L279n561p20J610
$$ -5693 -9354 -7876 -3124 -3310 -4197 -597 -7155 -7704 -3130 3664 2855 2213 5492 -69 -789 821
4776H21r88l708j174k221N798K467p636j033L429K049J39L385k164q33K905K618
$$ 821 -167 -3875 -5049 -7270 -1472 995 -6641 -7674 -4245 -2196 -2057 1328 -836 -1669 1236 3854
4760C854j548j156K974Q1j146O84k884k38l851J408M216L251n401q260M263N823
$$ 3854 2306 1150 4124 4205 3059 3743 859 621 -3230 -1822 2394 5645 244 -8016 -3753 2070
4744B070R15o782J903Q56k391J163j507q55K178j944K469K484J272M187m73l210
$$ 2070 2985 -3797 -1894 -1038 -3429 -2266 -3773 -4628 -2450 -4394 -1925 559 1831 6018 5545 2335
4728B335l998j953R23N310K565j096j363j342j616j941l49j208j261l063M107
$$ 2335 -1663 -3616 -2693 2617 5182 4086 2723 1381 -235 -2176 -2525 -3733 -4994 -8057 -3950
4713c950L194k957j249M547j442R50M014k494l788m215m052L780L930L679K347
$$ -3950 -756 -3713 -4962 -415 -1857 -907 3107 613 -3175 -7390 -11442 -7662 -3732 -53 2294
4698B294P46Q85J821p137j32K849R79l729k082j335M507J63M83l591j725L142
$$ 2294 3040 3925 5746 -1391 -1523 1326 2305 -1424 -3506 -4841 -334 -171 312 -3279 -5004 -1862
4682a862M747M743k669m560J558P139K692Q59Q32n663m039l422m826j436N199
$$ -1862 2885 7628 4959 399 1957 9096 11788 12647 13479 7816 3777 355 -4471 -5907 -708
4667g08J874L67J601L14n629Q29N030j275n183m465L765K396k331M795O400O096
$$ -708 1166 1533 3134 3448 -2181 -1352 3678 2403 -2780 -7245 -3480 -1084 -3415 1380 7780 13876
4651A3876J005o641K766k877k533j719l747n69k396K506n19l702o313K462R59
$$ 13876 14881 8240 11006 8129 5596 3877 130 -439 -2835 -329 -848 -4550 -10863 -8401 -7442
4636g442P25J810N575k26n544K025K154N080Q553k000k267q989L325L569n260
$$ -7442 -6717 -4907 668 442 -5102 -3077 -923 4157 12710 10710 8443 -546 2779 6348 1088
4621A088N714J666l75N48m3n732l606k539J618L271L406K968N36L288m470k485
$$ 1088 6802 8468 8093 8641 8598 2866 -740 -3279 -1661 1610 5016 7984 8520 11808 7338 4853
4605D853K963J268o97Q92j244m344k418j921j71Q7J870j172K522N153K579o970
$$ 4853 7816 9084 8387 9279 8035 3691 1273 -648 -819 -732 1138 -34 2488 7641 10220 3250
4589C250k268m970j537J673J995l18j259J429l130k058J758J021J435j333o77
$$ 3250 982 -3988 -5525 -3852 -1857 -2175 -3434 -2005 -5135 -7193 -5435 -4414 -2979 -4312 -4989
4574d989J457l267M37L77M022O497k13m342K72L257j794m329J977K454N669K717
$$ -4989 -3532 -6799 -6362 -5985 -1963 4534 4321 -21 251 3508 1714 -2615 -638 1816 7485 10202
4558A0202K91J889n185q460l682O480K409j004L428J137j640o514M31P775L947
$$ 10202 10493 12382 7197 -1263 -4945 1535 3944 2940 6368 7505 5865 -649 -218 7557 11504
4543A1504p18l993l149J49J479J09k174o30L455j54k920k924l191O772K815k587
$$ 11504 10786 6793 3644 3793 5272 5381 3207 2577 6032 5878 2958 34 -3157 3615 6430 3843
4527C843o0k195O80J505j493J458J764K411l789l203j707p36m535L481N34k605
$$ 3843 3783 1588 2268 3773 2280 3738 5502 7913 4124 921 -786 -1522 -6057 -2576 -2042 -4647
4511d647J808N843K395m261R29O55l96J242q9k923m779n7R254N247k935l067k372
$$ -4647 -2839 3004 5399 1138 2067 2722 2326 3568 3479 556 -4223 -4280 4974 10221 7286 4219 1847
4494A847J194J681k898j636m738P65L488m75l934o58J224J193O006M340l90J869
$$ 1847 3041 4722 1824 188 -4550 -3785 -297 -772 -4706 -5364 -4140 -2947 3059 7399 7009 8878
4478H878j667n771M140O715P60n019n839N08K11L776M17Q59R15k133o350q11O24
$$ 8878 7211 1440 5580 12295 13055 8036 2197 2705 2916 6692 7109 7968 8883 6750 400 -411 213
4461B13j399m315o271O17p63N77J506O190L548j624M725J094M795m110K771m91
$$ 213 -1186 -5501 -11772 -11155 -11918 -11341 -9835 -3645 -97 -1721 3004 4098 8893 4783 7554 7063
4445G063o315k161L448n327J101j062N580o3k918p89m162J669P858K610K186n834
$$ 7063 748 -1413 2035 -3292 -2191 -3253 2327 2264 -654 -1443 -5605 -3936 3922 6532 8718 2884
4429B884r192o907R32L829K833M652J644k866K742J23n05K666J69k507L556l676
$$ 2884 -6308 -13215 -12283 -8454 -5621 -969 675 -2191 551 674 169 2835 3004 497 4053 377
4413C77m929L914O353J243m002K433r05n543L375P491k486j97k475k21j172P70
$$ 377 -4552 -638 5715 6958 2956 5389 4484 -1059 2316 9807 7321 7124 4649 4428 3256 4026
4397D026K43J0j222q83j516l101K555K008K315l453m701j135O94l9K853Q24M874
$$ 4026 4269 4279 3057 2174 658 -2443 112 2120 4435 982 -3719 -4854 -4160 -4199 -1346 -522 4352
4380D352O190l514m247J635j052m34P89N99J12l91o94J640J217l113n132j030
$$ 4352 10542 7028 2781 4416 3364 2930 3719 4318 4430 4039 3345 4985 6202 3089 -2043 -3073
4364c073K57j39k151K0j054P452L000j809j37q04k912K017j79n8K539j371j404
$$ -3073 -2816 -2955 -5106 -5086 -6140 1312 4312 2503 2366 1562 -1350 667 488 430 2969 1598 194
4347A94K689k770j271q75k351M816M387L396J666k476l773M674j477q766n676
$$ 194 2883 113 -1158 -2033 -4384 432 4819 8215 9881 7405 3632 8306 6829 -1937 -7613
4332g613p85J583K600j77J601L48L464K229J255o77m575j614O60K16k180m596
$$ -7613 -8398 -6815 -4215 -4392 -2791 -2443 1021 3250 4505 3828 -747 -2361 -1701 -1485 -3665 -8261
4316h261M945N408j923l273J670j257J117J523k741j484K225M341J423l130k713
$$ -8261 -3316 2092 169 -3104 -1434 -2691 -1574 -51 -2792 -4276 -2051 2290 3713 583 -2130
4301b130L609K401l032J410m953o78N596N623K073m024K97k98k732L764o217m095
$$ -2130 1479 3880 848 2258 -2695 -3373 2223 7846 9919 5895 6192 5894 3162 6926 709 -3386
4285c386p16O09L946J765J381o364n923N479J627j636p301K160J3783r96n470
$$ -3386 -4102 -3493 453 2218 3599 -2765 -8688 -3209 -1582 -3218 -10519 -8359 5424 4428 -1042
4270a042o80j5M920m114K251O432j928p041l785j099q65M708K102K411L752k59
$$ -1042 -1722 -1737 3183 -931 1320 7752 5824 -1217 -5002 -6101 -6966 -2258 -156 2255 6007 5748
4254E748p28k99l598Q654o1n731q62J495l35m93o35j195k975m058L514P472K88
$$ 5748 5020 4721 1123 9777 9716 3985 3123 4618 4283 3790 3155 1960 -1015 -5073 -1559 5913 6201
4237F201n021j309K571k324l264m525k136L966J288L50m41J925j28l256l130L278
$$ 6201 1180 -129 2442 118 -3146 -7671 -9807 -5841 -4553 -4203 -4644 -2719 -2847 -6103 -9233 -5955
4221e955L241p66r6k156L608L346m369J952k628Q71Q69J547O45n1q76p38M586
$$ -5955 -2714 -3480 -3576 -5732 -2124 1222 -3147 -1195 -3823 -2952 -2083 -536 109 58 -818 -1556 3030
4204C030N582K649k301j061l616r95l673k604M317K935M865o19m99j792j735J034
$$ 3030 8612 11261 8960 7899 4283 3288 -385 -2989 1328 4263 9128 8509 8010 6218 4483 5517
4188E517R97m061l803p54L649Q43m769N004J608k332l014k722n48R8L674K296
$$ 5517 6514 2453 -1350 -2104 1545 2388 -2381 2623 4231 1899 -1115 -3837 -4385 -4287 -613 1683
4172A683J408M785n50K149L646k083n243k002m566J215J138J035K243k476k243
$$ 1683 3091 7876 7326 9475 13121 11038 5795 3793 -773 442 1580 2615 4858 2382 139
4157A39j900j52r76K081M15k880J799L35J810K028L667K6n425J23j11k988j757
$$ 139 -1761 -1913 -2889 -808 -393 -3273 -1474 -1139 671 2699 6366 6392 967 1090 979 -2009 -3766
4140c766k277J149M469K862j229j169l202K112L117j788j944j806j5K002Q82l942
$$ -3766 -6043 -4894 -425 2437 1208 39 -3163 -1051 2066 278 -1666 -3472 -3487 -1485 -603 -4545
4124d545K65L330k127J246l90K405K032k342j1j280M0K474L527j364Q1M118l115
$$ -4545 -4280 -950 -3077 -1831 -2221 184 2216 -126 -137 -1417 -1377 1097 4624 3260 3341 7459 4344
4107D344k469Q86p65J8q62j09O88L121n18l313L606Q54p48j311K310k779l501
$$ 4344 1875 2761 1996 2014 1152 1043 1731 4852 4334 1021 4627 5481 4733 3422 5732 2953 -548
4090e48l628M963j85M55M218Q54l193l134k849k427M762J879m111k5j068J482
$$ -548 -4176 787 602 1057 5275 6129 2936 -198 -3047 -5474 -712 1167 -2944 -2969 -4037 -2555
4074b555K438M105j392p38j673j770M67O257L8J22r98L048J531o185K057L182
$$ -2555 -117 3988 2596 1858 185 -1585 -1118 5139 5177 5299 4301 7349 8880 2695 4752 7934
4058G934j606n816p8l777m66n77L786L004J626N89j661n633j130l557M227O908
$$ 7934 6328 512 434 -3343 -3809 -4386 -600 2404 4030 4619 2958 -2675 -3805 -7362 -3135 3773
4042C773j173J464K80j718k55j240N174K448l85m681K426O9k989J042J375K952
$$ 3773 2600 4064 4344 2626 2371 1131 6305 8753 8368 3687 6113 6182 3193 4235 5610 8562
4026H562L2l987k745m040j633k229N46J368j995J417M328J100pJ187J734j6m187
$$ 8562 8594 4607 1862 -2178 -3811 -6040 -5494 -4126 -6121 -4704 -376 724 717 1904 3638 3622 -565
4009e65J042P445K024l355n456J443J303J004K74J879l694p461j610L315J827
$$ -565 477 7922 9946 6591 1135 2578 3881 4885 5159 7038 3344 -4117 -5727 -2412 -585
3994e85l376J029M476K452j633j083r28j209N73k817j676K307M894O270J680j341
$$ -585 -3961 -2932 1544 3996 2363 1280 352 -857 -284 -3101 -4777 -2470 2424 8694 10374 9033
3978I033j797j800k303k517J639K009k027m964M344J273M1p496R62j125j878L027
$$ 9033 7236 5436 3133 616 2255 4264 2237 -2727 1617 2890 2931 -4565 -3603 -4728 -6606 -3579
3962c579o53K5j420j00n36J619K197M898p44l283L621K532P19N421l052j238l053
$$ -3579 -4232 -4207 -5627 -5727 -6263 -4644 -2447 2451 1707 -1576 2045 4577 5296 10717 7665 6427 3374
3945C374j588Q76K242K560l971k587K282K42l943m397N513R35J967k166n978L864
$$ 3374 1786 2662 4904 7464 3493 906 3188 3430 -513 -4910 603 1538 3505 1339 -4639 -775
3929g75O033k690l358k981K372M312k657j846r6K858J661J653K36m462l847L178
$$ -775 5258 2568 -790 -3771 -1399 2913 256 -1590 -1686 1172 2833 4486 4722 260 -3587 -409
3913d09O736j169r30l61k838l104J663J527J719L500j606j269J057J180J836J960
$$ -409 6327 5158 4228 3867 1029 -2075 -412 1115 2834 6334 4728 3459 4516 5696 7532 9492
3897I492k94j172K990l672o596m246L68m064J721L413L004M508M05n769l5k65
$$ 9492 9198 8026 11016 7344 748 -3498 -3130 -7194 -5473 -2060 944 5452 5857 88 53 -212
3881b12O00J242J368O5k130K800M85k816M998q31n640m032K760P341L299q92l309
$$ -212 388 1630 2998 3063 933 3733 4218 1402 6400 5569 -71 -4103 -1343 5998 9297 8405 5096
3864E096K196K36l156j702Q58L119m763K951K816k875j132j017J02k481j248L579
$$ 5096 7292 7528 4372 2670 3528 6647 1884 4835 7651 4776 3644 2627 2729 248 -1000 2579
3848B579K094m921n265N689l1o15J556r42K576K001j728O26L335n57J008K59n572
$$ 2579 4673 -248 -5513 176 145 -470 1086 144 2720 4721 2993 3619 6954 6397 7405 7664 2092
3831B092l001j059M608J800k030m754M689L246l755m785j445M153K381q90k522
$$ 2092 -909 -1968 2640 4440 2410 -2344 2345 5591 1836 -2949 -4394 -241 2140 1250 -1272
3816a272o173j333N559L445k207J774K533K392K218l344o62K574k149j885m242
$$ -1272 -7445 -8778 -3219 226 -1981 -207 2326 4718 6936 3592 2930 5504 3355 1470 -2772
3801b772J002L473K79O47k49j848K515Q14O442k51p884p833j494L681O013K942
$$ -2772 -1770 1703 1982 2629 2380 532 3047 3861 10303 10052 2168 -5665 -7159 -3478 2535 5477
3785E477J451j272o62j542j565M83n47L62P36k173l692l055M349M287K026n716
$$ 5477 6928 5656 4994 3452 1887 2370 1823 2185 2921 748 -2944 -5999 -1650 2637 4663 -1053
3769a053Q48j497l264K352m06N939K730j252K642j510n988n863O19R99L385J666
$$ -1053 -205 -1702 -4966 -2614 -3020 2919 5649 4397 7039 5529 -459 -6322 -5703 -4704 -1319 347
3753C47J801j870m379J648N274l549j771L652K512j701l257m508M357j033l109
$$ 347 2148 278 -4101 -2453 2821 -728 -2499 1153 3665 1964 -1293 -5801 -1444 -2477 -5586
3738e586O922J71l685j90n628j125O628O974K449j655l608Q32l679Q6k979K443
$$ -5586 1336 1507 -2178 -2368 -7996 -9121 -2493 4481 6930 5275 1667 2499 -1180 -1094 -4073 -1630
3722a630M463r47k036j729k417j022M764K399P176Q36m78k489q224k75l20K506
$$ -1630 2833 1886 -150 -1879 -4296 -5318 -554 1845 9021 9857 9379 6890 -1334 -1609 -1929 577
3706E77K338O39M133m18m307J138k023L13j138j49j772M575M189K947N4L287k248
$$ 577 2915 3554 7687 7269 2962 4100 2077 2390 1252 1103 -669 3906 8095 11042 11096 14383 12135
3689A2135j1266J062J121q07J76k045M340N90m420k212N60J080l013L956J914
$$ 12135 869 1931 3052 2245 2421 376 4716 5306 886 -1326 -766 314 -2699 1257 3171
3674C171J108j65l029j097K642P45n279M652k22l263j453Q93j626K250K176J932
$$ 3171 4279 4114 1085 -12 2630 3375 -1904 2748 2526 -737 -2190 -1297 -2923 -673 1503 3435
3658C435j782M023j72m088k712k910R36k556k340K821K780M09J338P70j59q66
$$ 3435 1653 5676 5504 1416 -1296 -4206 -3270 -5826 -8166 -5345 -2565 -2156 -818 -48 -207 -1073
3642a073j713N4L187J123k431r68j64J089O289K370k135p020j650N760M793j364
$$ -1073 -2786 -2732 455 1578 -853 -1821 -1985 -896 5393 7763 5628 -1392 -3042 2718 7511 6147
3626F147l590j000j114L291r06n91K961K071j365L22l749l643K733L226k187k986
$$ 6147 2557 1557 443 3734 2828 2237 5198 7269 5904 6226 2477 -1166 1567 4793 2606 -380
3610c80m42N55N04J784J283k066R05L626j977m210m089j692p8L911J39J379N127
$$ -380 -822 -267 237 2021 3304 1238 2143 5769 3792 -418 -4507 -6199 -6277 -2366 -2227 -848 4279
3593D279r96p348K685P216k326J880J815l185J675q60o94J760L451j192k95q38
$$ 4279 3283 -4065 -1380 5836 3510 5390 7205 4020 5695 4835 4141 5901 9352 8160 7865 7027
3577G027k775m380n527M270n58n136m986N485L353K967N741M709j151n268j41
$$ 7027 4252 -128 -5655 -1385 -1943 -7079 -12065 -6580 -3227 -260 5481 10190 9039 3771 3630
3562C630L5Q36m732n160K829N840J298R34R99m745l574R42p99L88k379k100l86
$$ 3630 3665 4501 -231 -5391 -2562 3278 4576 5510 6509 1764 -1810 -868 -1667 -1279 -3658 -5758 -6144
3545f144K846M621J689k768j98k959k549N199P603k385r914r05J651l76L359L058
$$ -6144 -3298 1323 3012 244 46 -2913 -5462 -263 7340 4955 -4959 -5864 -4213 -4589 -1230 1828
3529A828Q64K95J14o28j422j679r400K096J610Q94J104q73J176M90k85m293Q81
$$ 1828 2692 2987 3101 2473 1051 -628 -10028 -7932 -6322 -5428 -4324 -5197 -4021 -3531 -3816 -8109 -7228
3512g228O579M643j951M36J641l884l509K422O505k75p14l419k393K835J475L806
$$ -7228 -649 3994 2043 2479 4120 236 -3273 -851 5654 5379 4665 1246 -1147 1688 3163 6969
3496F969Q6l3m973j075J497k566J393p10k905k950Q493O537k164j242K15M14j220
$$ 6969 7055 7022 2049 974 2471 -95 1298 588 -2317 -5267 3226 9763 7599 6357 6572 6986 5766
3479E766L616n664k701k602j084j65K716J437k101k70K025r94n254M359O865l070
$$ 5766 9382 3718 1017 -1585 -2669 -2834 -118 1319 -782 -1052 973 -21 -5275 -916 5949 2879
3463B879k379J4j735qn39J718L22k187j659l461L343O006Q3m099K366N222l330
$$ 2879 500 514 -1221 -1229 -1768 -50 272 -1915 -3574 -7035 -3692 2314 2397 -1702 664 5886 2556
3446B556l031n16J224j187L434K075J172P51N022k061k982j021l181P90K439L77
$$ 2556 -475 -991 233 -954 2480 4555 5727 6478 11500 9439 6457 5436 2255 3045 5484 5861
3430E861j759M053J382J619l440j292k591n09j467j25J40J800L254J285N6m189
$$ 5861 4102 8155 9537 11156 7716 6424 3833 3324 1857 1732 1872 3672 6926 8211 8267 4078
3414D078k047l101o18K507N710J530m774J244K409J855J27k127k303q62J065n344
$$ 4078 2031 -1070 -1688 819 6529 8059 3285 4529 6938 8793 8920 6793 4490 3628 4693 -651
3398f51M726L212k990J765j394j600m168K709Q731L415K467n51q05J328n477m657
$$ -651 4075 7287 4297 6062 4668 3068 -1100 1609 10340 13755 16222 15671 14866 16194 10717 6060
3382F060O43L178K99j765j427m218N29k343r41N632Q06j575O95l814M410k301
$$ 6060 6703 9881 10180 8415 6988 2770 3299 956 15 5647 6453 4878 5573 1759 6169 3868
3366C868n058j519L981N76J125Q25k700M327K280m447l51J971m017k005J216N042
$$ 3868 -1190 -2709 1272 1848 2973 3798 1098 5425 7705 3258 2907 4878 861 -1144 72 5114
3350E114M16K500j937J614M032n329o677m583O431K0o684m199L603M32M551R33
$$ 5114 5530 8030 6093 7707 11739 6410 -267 -4850 1581 1601 -5083 -9282 -5679 -5247 -696 237
3334B37j008j456l093j728q56L251P085L056K77M022r41l591j526j484L213J180
$$ 237 -771 -2227 -5320 -7048 -7904 -4653 2432 5488 5765 9787 8846 5255 3729 2245 5458 6638
3318F638m276j282M009m564l92K866o809l370M183M438N832N430l359j807p05
$$ 6638 2362 1080 5089 525 133 2999 -3810 -7180 -2997 1441 7273 12703 9344 7537 6832
$$ [...]
##END NTUPLES=NMR SPECTRUM
##END=
