##TITLE=Analysis number 319058
Compound Code cc 53210
Book Reference 449/96/1
Project Code adrs
Chemist Name davee
##JCAMPDX= 6.0         $$ Bruker NMR JCAMP-DX V2.0
##DATA TYPE= NMR SPECTRUM
##DATA CLASS= NTUPLES
##ORIGIN= Bruker BioSpin GmbH
##OWNER= nmr
$$ XWIN-NMR		Version 3.5
$$ Fri Apr 28 11:24:51 2006 GMT Daylight Time (UT+1h)  MAYBRIDGE\nmr@NMR_250MHZ
##.OBSERVE FREQUENCY= 250.131544655141
##.OBSERVE NUCLEUS= ^1H
##.ACQUISITION MODE= SIMULTANEOUS (DQD)
##.ACQUISITION SCHEME= undefined
##.AVERAGES= 16
##.DIGITISER RES= 18
##SPECTROMETER/DATA SYSTEM= dpx250
##.PULSE SEQUENCE= zg30
##.SOLVENT NAME= CDCl3
##.SHIFT REFERENCE= (INTERNAL, CDCl3, 0, 16.4557)
##AUDIT TRAIL= $$ (NUMBER, WHEN, WHO, WHERE, WHAT)
$$ ##TITLE= Audit trail, XWIN-NMR		Version 3.5
$$ ##JCAMPDX= 5.01
$$ ##ORIGIN= Bruker BioSpin GmbH
$$ ##OWNER= nmr
$$ C:\u/data/dgb/nmr/ADRS/3400/pdata/1/auditp.txt
$$ ##AUDIT TRAIL=  $$ (NUMBER, WHEN, WHO, WHERE, WHAT)
(   1,<2006-04-28 11:24:29.14 +100>,<MAYBRIDGE\nmr>,<NMR_250MHZ>,
      <created by zg, POWCHK disabled, PULCHK disabled
       configuration hash MD5:
       84 BC 41 DB A1 6E 1D 46 DA 25 12 A5 C1 ED C5 3A
       data hash MD5: 64K
       BD 2F 10 1D 9C 2B 28 D7 58 98 4E 86 5F 27 A3 B5>)
(   2,<2006-04-28 11:24:43.08 +100>,<MAYBRIDGE\nmr>,<NMR_250MHZ>,
      <Start of raw data processing
       ef LB = 0.3 FT_mod = 6 PKNL = 1 SI = 32K 
       data hash MD5: 32K
       9F B6 BB BF 07 C3 A5 23 CC CC 2F F6 37 77 A5 58>)
(   3,<2006-04-28 11:24:44.66 +100>,<MAYBRIDGE\nmr>,<NMR_250MHZ>,
      <apk 
       data hash MD5: 32K
       BF 02 DA F4 A7 F2 87 DB 34 04 D0 F7 9A CF 62 78>)
(   4,<2006-04-28 11:24:45.36 +100>,<MAYBRIDGE\nmr>,<NMR_250MHZ>,
      <abs ABSG = 5 
       data hash MD5: 32K
       66 86 93 50 21 BD 0C B5 03 A0 B1 C2 07 3A E0 04>)
$$ ##END=
$$ 
$$ hash MD5
$$ 78 25 04 66 91 62 C7 B1 C1 20 FE CF 0B EE C9 2C
##$RELAX= 
##$RELAX= 
##$RELAX= 
##$RELAX= 
##$RELAX= 
##$RELAX= 
##$RELAX= 
$$ Bruker specific parameters
$$ --------------------------
##$DU= <C:\u>
##$EXPNO= 3400
##$NAME= <ADRS>
##$PROCNO= 1
##$TYPE= <nmr>
##$USER= <dgb>
##$AMP= (0..31)
100 100 100 100 100 100 100 100 100 100 100 100 100 100 100 100 100 100 
100 100 100 100 100 100 100 100 100 100 100 100 100 100 
##$AQSEQ= 0
##$AQ_mod= 3
##$AUNM= <au_zg>
##$AUTOPOS= <21 >
##$BF1= 250.13
##$BF2= 250.13
##$BF3= 250.13
##$BF4= 250.13
##$BF5= 500.13
##$BF6= 500.13
##$BF7= 500.13
##$BF8= 500.13
##$BYTORDA= 1
##$CFDGTYP= 0
##$CFRGTYP= 5
##$CHEMSTR= <none>
##$CNST= (0..31)
1 1 145 1 1 1 1 1 1 1 1 1 1 1 1 1 1 1 1 1 1 1 1 1 1 1 1 1 1 1 1 1 
##$CPDPRG= <>
##$CPDPRG1= <>
##$CPDPRG2= <>
##$CPDPRG3= <>
##$CPDPRG4= <mlev>
##$CPDPRG5= <mlev>
##$CPDPRG6= <mlev>
##$CPDPRG7= <mlev>
##$CPDPRG8= <mlev>
##$CPDPRGB= <>
##$CPDPRGT= <>
##$D= (0..31)
0 1 0 0 0 0 0 0 0 0.06 0 0 0 0 0 0 0.0002 0 0 0 0 0 0 0 0 0 0 0 0 0 0 
0 
##$DATE= 1146219868
##$DBL= (0..7)
120 120 120 120 120 120 120 120 
##$DBP= (0..7)
150 150 150 150 150 150 150 150 
##$DBP07= 0
##$DBPNAM0= <>
##$DBPNAM1= <>
$$ [...]
##$SUBNAM7= <"">
##$SUBNAM8= <"">
##$SUBNAM9= <"">
##$SW= 20.6930455092707
##$SWIBOX= (0..15)
0 0 3 0 0 0 0 0 0 0 0 0 0 0 0 0 
##$SW_h= 5175.983436853
##$TD= 65536
##$TD0= 1
##$TE= 295.16
##$TE2= 300
##$TE3= 300
##$TEG= 300
##$TL= (0..7)
0 120 120 120 120 120 120 120 
##$TP= (0..7)
150 150 150 150 150 150 150 150 
##$TP07= 0
##$TPNAME0= <>
##$TPNAME1= <>
##$TPNAME2= <>
##$TPNAME3= <>
##$TPNAME4= <>
##$TPNAME5= <>
##$TPNAME6= <>
##$TPNAME7= <>
##$TPOAL= (0..7)
0.5 0.5 0.5 0.5 0.5 0.5 0.5 0.5 
##$TPOFFS= (0..7)
0 0 0 0 0 0 0 0 
##$TUNHIN= 0
##$TUNHOUT= 0
##$TUNXOUT= 0
##$USERA1= <user>
##$USERA2= <user>
##$USERA3= <user>
##$USERA4= <user>
##$USERA5= <user>
##$V9= 5
##$VALIST= <valist>
##$VCLIST= <CCCCCCCCCCCCCCC>
##$VD= 0
##$VDLIST= <DDDDDDDDDDDDDDD>
##$VPLIST= <PPPPPPPPPPPPPPP>
##$VTLIST= <TTTTTTTTTTTTTTT>
##$WBST= 1024
##$WBSW= 4
##$XGAIN= (0..3)
0 0 0 0 
##$XL= 0
##$YL= 0
##$YMAX_a= 383870
##$YMIN_a= -426068
##$ZGOPTNS= <>
##$ZL1= 120
##$ZL2= 120
##$ZL3= 120
##$ZL4= 120
##$ABSF1= 16.45567
##$ABSF2= -4.237503
##$ABSG= 5
##$ABSL= 3
##$ALPHA= 0
##$AQORDER= 0
##$ASSFAC= 0
##$ASSFACI= 0
##$ASSFACX= 0
##$ASSWID= 0
##$AUNMP= <proc_1d>
##$AZFE= 0.1
##$AZFW= 0.1
##$BCFW= 0
##$BC_mod= 0
##$BYTORDP= 0
##$COROFFS= 0
##$CY= 12.5
##$DATMOD= 1
##$DC= 0
##$DFILT= <>
##$DTYPP= 0
##$F1P= 14.0000005364418
##$F2P= -0.99999901652339
##$FCOR= 0.5
##$FTSIZE= 32768
##$FT_mod= 6
##$GAMMA= 0
##$GB= 0
##$INTBC= 1
##$INTSCL= 1
##$ISEN= 128
##$LB= 0.3
##$LEV0= 0
##$LPBIN= 0
##$MAXI= 10000
##$MC2= 0
##$MEAN= 0
##$ME_mod= 0
##$MI= 0
##$NCOEF= 0
##$NC_proc= -2
##$NLEV= 6
##$NOISF1= 0
##$NOISF2= 0
##$NSP= 0
##$NTH_PI= 0
##$NZP= 0
##$OFFSET= 16.45567
##$PC= 1
##$PHC0= 167.6647
##$PHC1= 5.189599
##$PH_mod= 1
##$PKNL= yes
##$PPARMOD= 0
##$PSCAL= 4
##$PSIGN= 0
##$REVERSE= no
##$SF= 250.13001659
##$SI= 32768
##$SIGF1= 0
##$SIGF2= 0
##$SINO= 400
##$SIOLD= 32768
##$SREGLST= <1H.CDCl3>
##$SSB= 0
##$STSI= 32768
##$STSR= 0
##$SW_p= 5175.98343685301
##$SYMM= 0
##$S_DEV= 0
##$TDeff= 65536
##$TDoff= 0
##$TI= <Analysis number 999999
Compound Code 99
Book Reference 9
Project Code 9>
##$TILT= no
##$TM1= 0
##$TM2= 0
##$TOPLEV= 0
##$USERP1= <user>
##$USERP2= <user>
##$USERP3= <user>
##$USERP4= <user>
##$USERP5= <user>
##$WDW= 1
##$XDIM= 32768
##$YMAX_p= 336346955
##$YMIN_p= -26895
$$ End of Bruker specific parameters
$$ ---------------------------------
##NTUPLES= NMR SPECTRUM
##VAR_NAME=  FREQUENCY,     SPECTRUM/REAL,   SPECTRUM/IMAG
##SYMBOL=    X,             R,               I
##VAR_TYPE=  INDEPENDENT,   DEPENDENT,       DEPENDENT
##VAR_FORM=  AFFN,          ASDF,            ASDF
##VAR_DIM=   32768,         32768,           32768
##UNITS=     HZ,            ARBITRARY UNITS, ARBITRARY UNITS
##FACTOR=    0.157963299565203, 1,           1
##FIRST=     4116.056860791, 0,              0
##LAST=      -1059.92657606201, 0,           0
##MIN=       -1059.92657606201, -26895,      0
##MAX=       4116.056860791, 336346955,      0
$$ Real data points
##PAGE= N=1
##DATA TABLE= (X++(R..R)), XYDATA
$$ [...]
16192c294m143J771J485N392M870j291L136J856l24L611j919r217J111p0m031
16177a057k740M93j257j621M279Q89L69m821k588N341O664k061l076q286l289
16162a2761P255k51k076L47O023L655Q2k698o868l708K045j662n474O470P600
16147b021J169m970J747M374j993K703K039J69O361l398N162n422j311l257L502
16132D854L514o718l190j113J435K125M11k543m538k807k687j553l029O468M153
16117e218l60Q85J864P791O9j576K959M540l909k195J38J471k982p203m714O245
16101b195P538M652K614p721n444l970Q53J495m384L389J035O424J213l440k757
16086f98j955m065L15N95l808j644M499O725J131O341m190l285r716J32L303L667
$$ y = [-3294, -7437, -5666, -4181, 1211, 6081, 4790, 7926, 9782, 9458, 13069, 11150, 1933, 3044, 2974, -1057, -3797, -3304, -4561, -6182, -1903, -1014, -645, -5466, -8054, -2713, 3951, 1890, -1186, -9472, -12761, -5506, -5757, -7833, -7486, -1463, 2192, 2274, -424, -7292, -11000, -8955, -10617, -16091, -9621, -2021, -852, -5822, -4075, 299, -1694, 1009, 3048, 3217, 9578, 6180, 11342, 5920, 4609, 1352, 4854, 8368, 1650, -1540, -2653, -1218, 907, 1318, -1225, -5763, -8570, -11257, -12810, -15839, -9371, -5218, -5578, -4693, -2829, 4962, 5031, 3455, 6414, 10954, 7045, 4850, 4988, 6459, 3477, -3726, -8440, -2195, 5343, 9995, 12609, 4888, -556, -4526, -3673, -2178, -6562, -3173, -2138, 4286, 5499, 2059, -698, -2653, -6718, -6403, -5808, -9616, -11260, -6761, -36, 1095, 7436, 3246, -39, -9755, -9623, -6320, -2653]
16070b653o091p199m3J118Q673O054o022k595Q322O771l605m107L90K492P539
16055I044J444J39l830m89M519J735o138k33o993k305J411N725j001p360k822
16040g154O838M681r87j979m076J276K535j094M040l268p1m176j139N679J1549
16025A2654l453k426k602j594p401O60Q19L733j973r65l834k200N073J301j396
16010c604r039k770j352L335j453M263P705N074l011o706p27o390K447Q946J0586
15995G304J82n697j070k052p427j895O154M124j2m00k927K629O4n524r56N677
15979a826k397Q57L480J40L768P30l913m754n59j111L612j26o603k850m727L603
15963a2676j368N212O015N89J500k722j882O8J1082R66J566k818j487q98J801
$$ y = [-2653, -8744, -15943, -15986, -14868, -6195, -141, -6163, -8758, -436, 6335, 2730, -1377, -987, 1505, 9044, 10488, 10627, 6797, 6308, 10827, 12562, 6424, 6191, -802, -3107, -1696, 4029, 3028, -4332, -7154, -316, 4365, 3378, 1399, -2677, -1401, 1134, 40, 4080, 812, 741, -3435, -4574, 1105, 12654, 9201, 6775, 4173, 2579, -4822, -4162, -3343, 390, -1583, -2548, -6382, -8582, -3509, -2208, -3604, -12643, -15413, -16765, -13430, -14883, -10620, -2915, 2159, -852, -7558, -8285, -14675, -12228, -3282, 7304, 7486, 1789, 719, -1333, -8760, -10655, -4501, -377, -389, -789, -3716, -1087, -1023, -6547, -7503, -1826, -4223, -3366, 114, 254, 4022, 4752, 839, -3915, -4474, -5585, -1973, -2099, -8702, -11552, -16279, -12676, -14044, -8832, -2817, -2228, -728, -3450, -5332, -5264, 5818, 6784, 8350, 5532, 4045, 3147, 4948]
15948D948K783K139L646q584l705k190R49R60M477J262n713r40P128J625J141
15933I926l569l860p995K683P001m82R67l296J865l782M311l794j1611L061N109
15918c466O952j377p416j24L739M633L729r79n604j492J276o865k169J013m421
15903a2571J485P77j797K370N730R780M446Q00j0938m714Q50N247K342l034l805
15888c032l600n00m745Q88M101m1o205k52N758N393k208J686k885k666M741P86
15872b781l137l536J320M4m482R86k250L099R324O22K908o043j357k337N734J1914
15856A0028m566k186m357k111j42J933k46J595J300J21Q295J155o567k123m325
15841b196l087j491N823L057o41m745P3Q73J230l566M055K59j719o418K409P882
$$ y = [4948, 7731, 9870, 13516, 4932, 1227, -963, -14, 946, 5423, 6685, 972, 32, 7160, 8785, 9926, 6357, 2497, -5498, -2815, 4186, 3704, 4671, 1375, 3240, -542, 3769, -25, -11636, -8575, -3466, 3486, 2109, -5307, -5431, -1692, 2941, 6670, 5691, 87, -1405, -129, -6994, -9163, -8150, -12571, -11086, -10309, -12106, -9736, -4006, 5774, 10220, 11020, 82, -4632, -3782, 1465, 3807, 773, -3032, -6632, -7132, -11877, -10989, -6888, -6929, -13134, -13386, -7628, -2235, -4443, -2757, -5642, -8308, -3567, -2781, -5918, -9454, -8134, -8090, -12572, -11586, -13836, -10737, -1413, -791, 2117, -3926, -5283, -7620, -1886, 10028, 5462, 3276, -1081, -3192, -3334, -1401, -1647, -52, 1248, 1369, 9664, 10819, 4252, 2129, -2196, -5283, -6774, -951, 2106, 1465, -3280, -3207, -2334, -1104, -4670, -615, -356, -2075, -8493, -6084, 1798]
15825A798L258n442l61k285k7K072Q2J61o220j121L777l259K765M359l533o56
15809d632L61j48L608L714Q12j029K271r447n480j474m44P310L05m227K676n578
15793a1402N74P566L262N745k024m651L327J199n144J077l333K845N983j362l486
15778A76k440l148K26r61o07K988n05j886m862O615L171l393K349J277m498n48
15762f046j223N872O663m536q002J900K148J03J535m936o00j710m300N47L485
15747i100J62L484M877l322o294j583j228K159k034k360J111J81M641O92m082
15732a2696M104P13J98Q138L429k265k143J085J631K858p006m634J109j97M57
15717e219k864J118k117J028L027N133j769J10J790L061r621k152P872Q456o370
$$ y = [1798, 5056, -386, -747, -3032, -3059, -987, -905, -744, -6964, -8085, -4308, -7567, -4802, -443, -3976, -4632, -4271, -4419, -811, 2903, 3715, 2686, 4957, -4490, -9970, -11444, -11888, -4578, -4273, -8500, -5824, -11402, -10828, -3262, 0, 5745, 3721, -930, 2397, 3596, -1548, -471, -3804, -959, 5024, 3662, 176, -2264, -5412, -5186, -6147, -6754, -3766, -4271, -6157, -11019, -4404, -1233, -4626, -2277, -1000, -5498, -6046, -7269, -1397, 5266, 730, -7272, -5372, -3224, -3121, -1586, -6522, -7122, -8832, -13132, -12585, -9100, -8938, -5454, -577, -3899, -10193, -11776, -13004, -10845, -12879, -15239, -14128, -13947, -9306, -8614, -12696, -8592, -7879, -7681, 457, 3886, 1621, -522, 563, 2194, 5052, -1954, -6588, -5479, -5676, -5219, -8083, -6965, -9082, -8054, -5027, 106, -1663, -1553, 237, 3298, -6323, -8475, -603, 7853, 1483]
15702A483m563N918K780J784q060m845L060J997q5N248M325K963J823j881r845
15687B102k467PJ804m1O966l056o777l248P825m62J513k320o444P76J354j19m466
15670g053m616K113M267k049m191O136K741J099O880n192m216o122r26m3M961
15655f211R538K872k226l621m416J973l703P435Q640l691k022n229l240q75N469
15640F93K822q375j0793k867P364J830O19K783k062K347J978L261p944K163N015
15625a166J886l865n069P315k00K813P897p09q293n929L691M689n412n977K850
15610e479m914K5j088L626K037m671m302M751M608j984K174J292j218j892k987
15595a0022l515Q354M351L954k88j017m502n742J268J840j999l706J515L640j339
$$ y = [1483, -3080, 2838, 5618, 7402, -658, -5503, -2443, -446, -531, 4717, 9042, 12005, 13828, 11947, 2102, -365, -358, 1446, 1405, 8371, 5315, -1462, -4710, 3115, 2653, 4166, 1846, -4598, -3822, -2468, -2587, -7053, -11669, -9556, -5289, -7338, -11529, -5393, -2652, -1553, 5327, 135, -4081, -10203, -11129, -11172, -6211, 3327, 6199, 3973, 352, -4064, -2091, -5794, 1641, 10281, 6590, 4568, -661, -3901, -4776, 693, 3515, -4860, -15653, -18520, -11156, -9326, -8707, -5924, -7986, -5639, -3661, -400, -8344, -6181, -1166, 720, -3145, -8214, -899, -1099, 1714, 9611, 8902, 609, -5320, -1629, 3060, -2352, -8329, -5479, -10393, -10368, -11456, -7830, -5793, -10464, -14766, -10015, -5407, -7391, -5217, -3925, -5143, -7035, -10022, -13537, -5183, -832, 3122, 2834, 1817, -2685, -8427, -7159, -5319, -7318, -11024, -9509, -5869, -7208]
15580g208j378L00p382L860Q738n05P159N076k588j543J10q78l202K755q18M559
15564G055R92m918k284k628l014L190j648m292l516P49j175M482K548j444K393
15549c510j88M019k918K639Q447J187n207m658m348Q340L222n231K406n07j188
15534B505k662j882l129k79M620N392k823l429m301p447M69N448P398L291m400
15519a229K262K159K862p615L17M999K252p278j539j91Q84l20L852j188q893J381
15503g285m119K367O465L783N976j145p364l276L780N445J000J49K242p05p430
15488a17n184Q20L512m965R62M185L621l644o551j613l056j569R316K909k834
15473d208q78L156L964m094l105k961J397M119j985L85m05l622j192N467M718
$$ y = [-7208, -8586, -8286, -15668, -11808, -3070, -3575, 3584, 8660, 6072, 4529, 4639, 3761, 559, 3314, 2496, 7055, 8047, 3129, 845, -1783, -4797, -1607, -3255, -7547, -11063, -10314, -11489, -7007, -4459, -5903, -3510, -3698, 321, -2597, 42, 8489, 9676, 4469, -189, -4537, 3803, 7025, 1794, 4200, 3693, 2505, -157, -2039, -5168, -5447, -827, 4565, 1742, -1687, -5988, -13435, -12966, -7518, -120, 3171, -1229, 1033, 3192, 6054, -1561, -1244, 3755, 6007, -1271, -2810, -3001, -2117, -2437, 1415, 227, -8666, -7285, -11404, -9037, -2572, 1211, 7187, 6042, -1322, -4598, -818, 4627, 5627, 5776, 8018, 7313, -117, -5301, -4481, -969, -5934, -4972, -787, 2834, -810, -7361, -8974, -12030, -13599, -4283, -1374, -4208, -5086, -1930, 2034, -2060, -5165, -8126, -6729, -2610, -4595, -4210, -4615, -8237, -9429, -3962, 756]
15458G56j822L954k457o85p43J658n354k67Q402j143l425j377K418j95J209J05
15442A034j593r311k958P459P914l429k236K97k172j883N223J859j44k253Q073
15427E880N002j220m325j442N994k636m949J988j596l914k346K910m463J772k771
15412f116O09q97K584m920K537O680L968K929o306L284l36n36j622K540j79n172
15396i53o28L697k831k365n078m080J990K955J220L512K327N92N438j229K033
15381F600K39J380R05l826k830m876n717P60K666K803M327J181P44J109K065J699
15365I229l606J730L524o502r546j303N217m150j56M960o908r70J308m572K082
15350i663k968P56M079O471J466O773j806o000l846l188L594L156J823K717J326
$$ y = [756, -1066, 2888, 431, -254, -997, 661, -4693, -4960, 3442, 2299, -1126, -2503, -85, -280, 929, 1034, -559, -9870, -12828, -5369, 2545, -884, -3120, -2823, -4995, -6878, -1655, 204, 60, -2193, 5880, 10882, 9662, 5337, 3895, 9889, 7253, 2304, 4292, 2696, -1218, -3564, -654, -5117, -3345, -6116, -5507, -6404, -3820, -8740, -6203, 477, 4445, 7374, 1068, 4352, 4016, 3480, 1858, 4398, 4219, -953, -1581, 2116, -715, -3080, -8158, -12238, -10248, -7293, -6073, -2561, -234, 358, 5796, 4567, 6600, 6839, 8219, 9124, 5298, 2468, -2408, -8125, -7365, -4699, -1896, 2431, 3612, 4356, 5465, 7530, 9229, 5623, 7353, 10877, 4375, -5171, -6474, -1257, -5407, -5563, -603, -7511, -8481, -7173, -11745, -9663, -12631, -11875, -7796, -1325, 141, 6914, 5108, -892, -4738, -7926, -4332, -1176, 647, 3364, 4690]
15335D690M074r91j3184j5369Q562J3462N410l561O81J828m123J067K495k166
15321B875q169p05n14K340L373J656k947P9j512k158M062M176n102o685j428K061
15305h598N44j68J1277K094n161k163M003J545m61J36o778o188J015K146k089
15290h846n683O597L007m247N690j727l240L228N494m36m09R132l767K887k711
15275D969q398J417J0345R208l162k338m628m680K496J587p802J315n194k131
15261f996J29J731L668m924n332N868M641R77m828j494j987l940o955J052M858
15246a3532P557L101k288J886J817l984M883Q26k601l895m566L016J0414L453
15232F087l4o681N093j198j351k407l113O453O299j169k723J76l761m343k150
$$ y = [4690, 8764, 7773, -5411, -20780, -12218, 1244, 6654, 3093, 3774, 5602, 1479, 2546, 5041, 2875, -5294, -5999, -6513, -4173, -800, 856, -2091, -2012, -3524, -5682, -1620, 2556, -2546, -9231, -10659, -8598, -8054, -8222, 3055, 5149, -12, -2175, 1828, 3373, 2912, 3048, -3730, -9918, -8903, -6757, -8846, -14529, -7932, -4925, -9172, -3482, -5209, -8449, -5221, 273, -163, -572, 8560, 4793, 7680, 4969, -3429, -2012, 8333, 17541, 14379, 12041, 7413, 2733, 5229, 6816, -986, 329, -4865, -6996, -6867, -5136, -1468, -6392, -11724, -5856, -1215, -238, -5066, -6560, -8547, -12487, -19442, -18390, -13532, -5975, -2874, -5162, -3276, -1459, -5443, -560, 266, -2335, -6230, -10796, -7780, 2634, 6087, 6053, -628, 4465, 3267, 1916, -491, -3604, 2849, 9148, 7979, 5256, 5432, 1671, -2672, -4822]
15217d822j98N574q25l522m321n333M342P113k051L735L664k215m673J243j561
15202c850j57L481n737JL684q02j123K992n599j862L783j237k062J083P37L427
15186c241J069o216n509K968k824k765R544N375L374o515J723J0212Q040k885
15172A2350j263l061q499J34o420l058J734K34M482Q138K429J165J388J563p099
15157D217n763n163M020o66P19J0504N720j299n766j644O594N073n911k093j519
15142G023o532n558j666O237L915n50L717l702k565K1N33j527J116M025l84P59
15126D862N21K984j322o162o618l37n719L73J721L217K16M055M055K80p3N223
15110G276N716L30J001j377o081o64k653k086n21K702j54J184N322K216n854j374
$$ y = [-4822, -5020, 554, -271, -3793, -8114, -13447, -9105, -1992, -4043, -308, 3356, 1141, -3532, -2289, -3850, -4007, -526, -6263, -6262, -2578, -3380, -4503, -1511, -7110, -8972, -5189, -6426, -8488, -7405, -6668, -3241, -2172, -8388, -13897, -10929, -13753, -16518, -6974, -1599, 1775, -4740, -3017, 7195, 15235, 12350, 11087, 8026, -473, -339, -6759, -9817, -8083, -7849, -3367, 4771, 7200, 8365, 9753, 11316, 4217, -1546, -6709, -2689, -3355, -2636, 7868, 13588, 12289, 6523, 4879, 11473, 16546, 10635, 8542, 7023, 491, -5067, -6733, -496, 3419, 2869, 6586, 2884, 319, 340, 873, -654, 462, 4487, 4103, 4862, 5383, 8367, 7045, 883, -5735, -6072, -11791, -11418, -9697, -6480, -6264, -2209, 1846, 2126, 2053, 7276, 12992, 13322, 14323, 12946, 6865, 6201, 3548, 1462, 941, 3643, 3489, 4673, 9995, 12211, 6357, 4983]
15094D983m432L12K210l11k716j413Q83q72j942O432J795m945k576n861k754O8
15078a1139K238M079k018k119M975N780N796N17j0275O32M874m369p503K146P324
15063I38m715n602J692j105l040M822P954O950p24n916j284n600P3J1047k550
15048B940j3295j848L874M568j53M116k875Q0J746N486l179m497L666L687K701
15033G017j782o804j0063l415L975N991O546M718o773m628L488O64n10p99M92
15018a883K72p3o200l372O22q69L778M128k581m304J105j229J09M986N464Q36
15002G89j329k031k764K902J687N226r17JM53n782j154K933P81k277J359m16k349
14985b888n92M118P978L7o245m137J498m257q233K086p963K201J3704J0521M67
$$ y = [4983, 551, 863, 3073, 2762, 46, -1367, -484, -1356, -3298, 3134, 4929, -16, -2592, -8453, -11207, -11139, -8901, -4822, -6840, -8959, -3984, 1796, 7592, 8109, -2166, -1534, 3340, -1029, -8532, -6386, 938, -3777, -9379, -7687, -8792, -11832, -7010, 944, 7894, 7170, 1254, -30, -5630, -5557, 5490, 2940, -10355, -12203, -8329, -3761, -3914, 202, -2673, -2593, -847, 4639, 1460, -3037, 629, 4316, 7017, 5235, -1569, -11632, -15047, -11072, -5081, 1465, 6183, -590, -5218, -1730, -1066, -1576, -2375, -1883, -1611, -1684, -7884, -11256, -10634, -11503, -7725, -3597, -6178, -10482, -9377, -10606, -10497, -5511, -47, 789, -540, -2571, -5335, -2433, -746, 4480, 3563, 3564, 4017, -1765, -2919, 14, 795, -1482, -123, -539, -2888, -3480, 638, 8616, 8653, 2408, -1729, -231, -4488, -12721, -10635, -18598, -16397, -2693, 7828, 8295]
14970H295k435l539j216k680J097k29M874k474L772m259r493M767m378p212N516
14955i594K085M164K00L405n778j661k157J1014J1835M849k606J350P39n801k717
14940I327K614n142k650o723K541L482R905N714M993P341J0753K3221J6294Q5
14926H1755R383R270o53m426l337m078j2398j4441r430n339n051r689j4423o857
14912A0286M851k81O688k870n402j902k041p684Q73n170j995M835L059J444J493
14897F184k109l585J076K133J201j383L953N635J6M89J218j466k12k399K713j0762
14881B702j3638k510Q503P198K204n563j680N019J980P113q078m397K345J168
14867B366k120P29j131m552q242Q376l236l377K416R099O411o525Q55l113j730
$$ y = [8295, 5860, 2321, 1105, -1575, -478, -707, 4167, 1693, 5465, 1206, -8287, -3520, -7898, -15110, -9594, -7509, -3345, -3145, 260, -5518, -7179, -9336, 1678, 13513, 18362, 15756, 17106, 17845, 12044, 9327, 11941, 6799, 4149, -2574, -33, 3449, 13354, 19068, 24061, 31402, 42155, 65376, 81670, 81755, 91138, 100408, 99755, 95329, 91992, 87914, 75516, 61075, 51645, 46306, 41255, 31566, 17143, 10286, 15137, 14856, 21544, 18674, 13272, 11370, 9329, 1645, 2518, -2652, -4647, 188, 3247, 4691, 6184, 4075, 490, 1566, 3699, 4900, 3517, 7470, 13105, 13121, 13610, 14828, 13362, 13150, 10751, 13464, 2702, -10936, -13446, -4943, 2255, 4459, -1104, -2784, 2235, 4215, 11328, 3250, -1147, 1198, 2366, 246, 975, -156, -4708, -12950, -4574, -7810, -11187, -8771, 328, 6739, 214, 1069, -2044, -3774]
14852c774P68l536o15M856N250O027M39o206n294j845k0J910K778Q358O076q594
14836F578R33o2l853j120k238j83M728J068m191k144M506R41J141J729L54O68
14820H855k817q53n469j0453j053M314M012K850K443K630Q58M15p78K03j513m95
14804C149o078o539k105K500j291N489L986L338l488j867L20k921O39l687n536
14789a4091J650Q590k356k279m891K837K327o22l890J078J0560N331q724o931
14775a1411M457O803o21k255L896p79n82M527j059K335L112l905p705j896L530
14760a553O913L413p14j555M601q429p27J369K805J712j457m744n775n073m553
14745a3767N838J990m571J501N187M625O120N260k115n758j0844K584N535m822
$$ y = [-3774, -3006, -6542, -7157, -2301, 2949, 8976, 9415, 3209, -2085, -3930, -3950, -2040, 738, 9096, 15172, 6578, 7511, 7449, 3596, 2476, 238, 55, 4783, 5851, 1660, -484, 4022, 4963, 6104, 7833, 8187, 8855, 6038, 5185, -284, -10737, -11790, -7476, -3464, -614, 1829, 4459, 5317, 5732, 4954, 5157, 3644, 3149, -2929, -9468, -11573, -9073, -10364, -4875, -889, 2449, -1039, -2906, -2586, -5507, -4868, -8555, -14091, -12441, -3851, -6207, -8486, -13377, -10540, -8213, -8835, -12725, -11647, -1087, 4244, -4480, -11411, -6954, -151, -772, -3027, 869, 90, -492, 4035, 2976, 5311, 8423, 4518, -3187, -5083, -1553, 5360, 8773, 8059, 6504, 11105, 2676, 1949, 3318, 6123, 7835, 6378, 1634, -4141, -9214, -13767, -7929, -5939, -10510, -9009, -3822, 803, 6923, 12183, 10068, 4310, -6534, -3950, 1585, -3237]
14731c237k244K351K630o479j746L908J627K92M771m861m53J487R71Q50J960L860
14715E687J787r85j424k695m433M62P904j722n477J136o747J621j546L789N76
14700b067k098J870N341J458l512K336L060m035m258J964L093n770k090L448l367
14685d627N874l552m941m566m57J918l70J726k279j17M016O532L72p131p908L537
14669a1973L336J193L659K403J723n34L525k301l165q63M61J0444L306j046M401
14654A4569M911n887p443n902m492K923o62l13K32r92j849Q63J000j594L637m56
14638a455o420Q17K648k552k666N480m00N712K518o839J387O64K6k254l401N316
14622a419J600n351m148k935K778M719L291J770R001L304o833o220l359j453j457
$$ y = [-3237, -5481, -3130, -500, -6979, -8725, -4817, -3190, -2898, 1873, -2988, -3441, -1954, -983, -133, 1827, 5687, 7474, 6489, 5065, 2370, -2063, -1601, 6303, 4581, -896, 240, -6507, -4886, -6432, -2643, -2067, -4165, -2295, 3046, 4504, 992, 3328, 6388, 2353, -1905, 59, 3152, -2618, -4708, -1260, -4627, 1247, -2305, -7246, -11812, -12269, -10351, -10721, -8995, -11274, -11391, -7375, -843, -471, -7602, -15510, -11973, -8637, -7444, -3785, -1382, 341, -193, 3332, 1031, -2134, -2997, -2536, 7908, 11214, 10168, 14569, 19480, 13593, 6150, 248, -4244, -1321, -1983, -2296, -2064, -3056, -4905, -4042, -3042, -4636, -999, -1455, -7875, -7058, -4410, -6962, -9628, -4148, -4548, 1164, 3682, -3157, -1770, -1106, -1080, -3334, -6735, -1419, 181, -5170, -9318, -12253, -9475, -4756, -1465, 305, 9306, 12610, 5777, -443, -3802, -5255, -6712]
14607f712P715o84k856L105m106l694j246M325j651J862n116J652j855N35N381
14592c345j71J191R914k066q475m794j628O150j56j2245O56K181j110K259J734
14577i905L360K678M752J617k67l99l667m667J052k199J559N129K682j772P459
14562G412k57K194j786P502L663m351k791n83J809o149n058O7k875o094k735n045
14546a5077q74J363N060M533O888k043k003N976O331o628p808o988N078O993L160
14531C961N875L330k538m859O40J846n457m636j160N6n333n107P001N928L0j520
14515a943j331M686L984k082l95j20k202N646Q190r96l490p720j1833n845J869
14500a3582K416N133M926M077K120l851m06n34m879p197O824R768o18l755M888
$$ y = [-6712, 1003, 319, -2537, 568, -3538, -7232, -8478, -4153, -5804, -3942, -9058, -7406, -9261, -8726, -3345, -3516, -2325, 7589, 5523, -2952, -7746, -9374, -3224, -3380, -15625, -14969, -12788, -13898, -11639, -9905, -6545, -3867, 885, 2502, 2235, 1836, -1831, -6498, -5446, -7645, -6086, -957, 1725, -47, 7412, 7155, 9349, 7563, 15065, 18728, 14377, 11586, 11003, 12812, 6663, 1605, 1672, -1203, -7297, -10032, -15077, -15951, -14588, -9528, -4995, 1893, -150, -2153, 3823, 10154, 3526, -4282, -11270, -6192, 801, 3961, 9836, 13166, 10628, 5769, 6409, 8255, 2798, -1838, -2998, -2942, -8275, -13382, -6381, -453, -423, -1943, -3274, 1412, 5396, 3314, 2919, 2799, 597, 6243, 14433, 13437, 9947, 2227, -9606, -15451, -13582, -11166, -6033, -1107, 2970, 5090, 1239, 833, 299, -4580, -11777, -4953, 4815, 4197, 442, 5330]
14485E330K670m608K45J422k894o08j649m74K008L090K095n197m560J815o66m481
14469f462N06O358m11p24M572m78k38j24J584ro082J713k296K958N126K026l241
14452D778o115J703k329p82K995k731j994R5L870P72p198o182M406K305l795k518
14436a2720M051O127O40p543m422K664R445j366n065J936p13M485j02n930M829
14421c684O668k259r603p876rR872J1195P00m826L144K099j540n385j2347j295
14406a5146K042k463P144J739Q92K146j87l977o36L968O695M223J467m22o013
14391A472L592L458r905n839O758L299J006K48j543m306k851N205o62L369J889
14376E190o606M13L462L486K65J458l296l217k449j522o760K628L995K816r49
$$ y = [5330, 8000, 3392, 3637, 5059, 2165, 1557, -92, -566, 1442, 4532, 6627, 1430, -3130, -1315, -1981, -6462, -5956, 402, -9, -733, 3839, 3361, 3123, 2999, 4583, 4574, -1508, 205, -2091, 867, 5993, 8019, 4778, -1337, 366, -1963, -2745, 250, -2481, -4475, -4380, -510, 262, -6936, -13118, -8712, -6407, -10202, -12720, -8669, -2542, -1902, -9445, -13867, -11203, -1758, -3124, -8189, -6253, -6966, -2481, -2583, -8513, -3684, 2984, 725, -8878, -16754, -16763, -6891, 4304, 5004, 178, 3322, 5421, 3881, -1504, -13851, -15146, -13104, -15567, -8423, -6684, -5792, -3646, -3833, -7810, -8446, -4478, 2217, 6440, 7907, 7485, 1472, 5064, 8522, -1383, -7222, -464, 2835, 3841, 4089, 2546, -1760, -4611, 594, -68, 3301, 5190, -1416, -1003, 2459, 5945, 6210, 7668, 4372, 1155, -1294, -2816, -9576, -6948, -2953, -137, -1086]
14361a086p36P187l155k95K191j495L522K81r208P10L652j396k783m508k227J524
14345g822k549P048L762j946n278m714J4176M508l910J624j292j1113k060R96
14331h570J20k978kP33R148J421L3J504p667p898l011j99O051Q653j729q16K857
14314b350J643k727j4m788l34R80P39O107R13l928k696j676J115L67J282m71N729
14297a09J104J541R538l470o381J370N815m714p649N164J117n93L273j022l405
14282A579m368M165j715m845j959j548P47K290J340k984L433N178J965k298n609
14267d629o915L732N520K308O66J9K1K619k24K506n900r893L242J393J509O5j587
14250e548K742n141J022O906J387O266n29m084K684q56q981J136K13l43K653J327
$$ y = [-1086, -1822, 5365, 2210, 1915, 4106, 2611, 6133, 6414, -2794, -2084, 1568, 172, -2611, -7119, -9346, -7822, -10371, -3323, 439, -1507, -6785, -11499, 2677, 7185, 3275, 4899, 3607, -7506, -9566, -8570, -8450, -11428, -11430, -10697, -1549, -128, -95, 1409, -6258, -14156, -17167, -17366, -11315, -2662, -4391, -5207, -2350, -707, -3434, -3448, -8236, -8570, -7590, -6851, -744, 169, -3759, -6455, -8131, -7016, -6649, -5367, -5838, -109, 995, 2536, 12074, 8604, 2223, 3593, 9408, 4694, -2955, 2209, 3326, 2733, 6006, 4984, 1579, -2789, 1376, -339, -5184, -7143, -8691, -7944, -5654, -4314, -7298, -3865, 1313, 3278, 980, -4629, -11544, -7812, -2292, 16, 682, 701, 722, 3341, 3117, 5623, -277, -10170, -6928, -5535, -4026, -3961, -5548, -2806, -7947, -6925, -19, 1368, 7634, 7105, 3021, 5705, 4849, -4132, -2996, -2783, -3126, -473, 854]
14234H54J972m020K241P357K68M177M51o487L910l173m947R13J817K841p292r953
14218i071l386Q887P192L29j630J596M519K174P56J126j0575l087o141l676N50
14203a0437J143j193O04R285J2290K799J813K898o901m767n40k053m958o808N498
14188a327j582o663R547N429n460n136P059j489m482L675P758J977l406k476l220
14173B04m578l514K809M88L2j896k923J719l925k015J932Q064N241J871j493q382
14157f366n547j568j101K19P193N690j394O30K946K322N836N968l701o324P28
14142E531R57k313j829L67m201l572N516J2580m897O20K413j422o232q624k607
14127g713p009R67M845j496K550R799K156m004L269O59j3070j2477k684K296J092
$$ y = [854, 2826, -1194, 1047, 8404, 8672, 12849, 13300, 6813, 10723, 7550, 2603, 3516, 5333, 8174, 882, -9071, -12457, -3570, 3622, 3951, 2321, 3917, 8436, 10610, 11366, 12492, 1917, -1170, -7311, -10987, -10437, -9294, -10487, -9883, -598, 11692, 14491, 16304, 19202, 12301, 7534, 6994, 4941, -17, -6825, -1327, -2909, -9572, -25, 5404, -56, -5192, 1867, 378, -4104, -429, 7329, 9306, 5900, 3424, 204, -4374, -7888, -5079, -4591, -4559, -6455, -9378, -7659, -11584, -13599, -11667, -3603, 1638, 3509, 2016, -6366, -11913, -13481, -14582, -14363, -7170, -1480, -2874, -2244, 702, 3024, 8860, 14828, 11127, 4803, 5531, 6488, 4175, 2346, 2713, -1488, -5060, 456, 13036, 8139, 8759, 11172, 9750, 3518, -5106, -7713, -14722, -13755, -8910, -10406, -7856, 1943, 4099, 95, 3364, 4023, -9047, -21524, -24208, -21912, -20820]
14112b0820N320M532R28J261O01M97K211l027P437K420j956J0250K337r016p269
14097d294q263N19Q98M265L846J714P327R41l295j370m938m182k117P37M324O258
14081B370M480q50n181Q046R8p673J417k848o494K23j338O860R00K011n67P110
14065H564R963o167r408m49J425o141j0527p575k47J0465p23K918M609m751K940
14050e104k15R37m038r17K357j136K665K818k801k04p763r55O346Q755N20k381
14034a116K86J808k661m58O65r69j737O15J460o771NR31j651n37P31K097n79o50
14016h531K745M68j952p43j651K542P013l54j196k199m406N751K586j041k094
14001c062k611l963J901l342M626J339n577N25m906j881L104Q302L260j975k422
$$ y = [-20820, -15500, -10968, -10040, -8779, -8178, -7681, -5470, -8497, -1060, 1360, -596, 9654, 11991, 2975, -4294, -12557, -12038, -11140, -6875, -3029, -1315, 6012, 6953, 3658, 2288, -2650, -6832, -8949, -8212, -3888, 2370, 6850, 6000, 819, 8865, 8963, 1290, 2707, -141, -6635, -6412, -7750, -890, 10, 2021, 1454, 8564, 18527, 12360, 2952, 2503, 3928, -2213, -12740, -20315, -20562, -10097, -10820, -7902, -3293, -8044, -5104, -5319, -4382, -8420, -9337, -6980, -8116, -5451, -2633, -5434, -5638, -13401, -14356, -8010, 745, 1265, -1116, -830, 978, -1683, -2141, -1476, -2445, -4182, -3567, -2107, -8878, -8873, -7942, -9593, -10130, -9399, -7302, -7881, -8531, -5786, -5318, -7270, -8013, -9664, -7122, -109, -463, -1659, -3858, -8264, -2513, 73, -968, -3062, -5673, -9636, -7735, -11077, -6451, -5112, -10689, -10164, -15070, -16951, -13847, -5545, -2285, -4260, -6682]
13986f682J858N294K412O87l32J354O753J833l226p599l20l61j136L419L724n858
13970A820J216q57L149L377j34m7j119m124k159K427j748n507l131L790L043n745
13954e749o576M377M023J154M068M966K44m115k484O111P552K887m280o784J281
13939F675J040m293q965k830j130k98k297r71P4l829P817P866P715p21k079j68
13923C606o014L4K103k577k421O855L684j168k82M163n04J206j764j916j653j815
13907A537k416j47K111L332q98o81q088r19K262N271l801o00M448k926p650j811
13891a0976J604k136j438J088L402L546J189J454L15k77J451n59q768q09O128
13876d786Q899K8m358n355L657M84n233m418K384N15J153r75j436K011m154j512
$$ y = [-6682, -4824, 470, 2882, 3569, 3237, 4591, 11344, 13177, 9951, 2352, 2032, 1671, 535, 3954, 7678, 1820, 3036, 2179, 5328, 8705, 8571, 8524, 7405, 3281, 1122, 3549, 1801, -3706, -6837, -3047, -4, -5749, -12325, -7948, -3925, -2771, 1297, 6263, 6507, 2392, -92, 6019, 13571, 16458, 12178, 5394, 6675, 7715, 3422, -5543, -8373, -9503, -9801, -12098, -13069, -12995, -16824, -9007, -1141, 6574, 5853, 3774, 3606, -2408, -2374, -271, -2848, -5269, 1586, 5270, 4102, 3820, 7983, 7479, 8685, 6921, 5005, 3352, 1537, -879, -1026, 1085, 4417, 3519, 2838, -5250, -6169, -3907, 1364, -2437, -3037, 1411, -1515, -9165, -10976, -9372, -11508, -12946, -11858, -8456, -4910, -3721, -2267, -1952, -2229, -778, -1337, -10105, -10914, -4786, 4113, 4141, -217, -5572, -1915, -1431, -6664, -11082, -8698, -8183, -7030, -8005, -9441, -7430, -11584, -13096]
13860a3096K886Q240N22m76N12M013K656j778p014K036J26J069p179r99K196l217
13844i503M544N799p471O191K975o88K310l819K537J825k399j863m257l327m048
13829a1194Q408l14k960J1986K131o763q101K880M394K284N155N372K132j269
13815A4141p391r852m95J867J935j760l169j70N681K859p774j003N579M818n413
13800a47n290j251O96k038q0J073K308N446O602J723L867N182n226j0408m448
13785a991K102j049J800j391K897J417n971m240l603k113m685M92J1950j69n570
13770a0124L421Q433Q47k89n4m786J420l178o629j80r13N052j600M241Q392k52
13754C801k544R12P085O95K79J250l445p330r125K469M073K135m656j923L882
$$ y = [-13096, -10210, -1970, -1448, -1924, -1412, 2601, 5257, 3479, -3535, -1499, -1373, -304, -7483, -8482, -6286, -9503, -4959, 840, -6631, -440, 2535, 1847, 4157, 338, 2875, 4700, 2301, 438, -3819, -7146, -11194, -2786, -3100, -6060, 5926, 8057, 1294, -6807, -3927, 467, 2751, 7906, 13278, 15410, 14141, 6750, -3102, -3597, -1730, 205, -1555, -4724, -4894, 787, 3646, -4128, -5131, 448, 5266, -147, -5437, -6688, -5992, -8030, -8110, -7037, -4729, 717, 7319, 9042, 12909, 18091, 12865, 2457, -1991, 111, -938, 862, -529, 2368, 3785, -2186, -6426, -10029, -12142, -16827, -16335, -4385, -4554, -10124, -6703, 1730, 2577, 2288, 2234, -2552, -1132, -4310, -10939, -11119, -12032, -6980, -8580, -4339, 4053, 3801, 1257, 2169, 9254, 9949, 10228, 11478, 8033, 703, -8422, -5953, -1880, 255, -4401, -6324, -2442]
13739b442L330K76n282K420n44K663L754o25p9m468l533k179K244Q185o862r754
13723a2896r07O817L246n032l846J030J073J0943O443m348p875m757L060J000
13709f049j828R321m316J426L788K54k143Q48j20k585L752k380j445K290q545
13694g732j979M98P887M144o93j821N470K706K846M286r20o823l51m581k024j83
13678G30j054J337Q60n929j650K684m965K289R28L930M217j328J38j019l343p067
13662i242J675K180M767J480j145L057N501K413J928n917k358q39J589P006O96
13647A2791m648k896K222K435n393j915o620r310K488N072j816k591L41j82J53
13632i869M316l01J149j193l263k809L489O160j380N711K423j223P08J497k987
$$ y = [-2442, 888, 1164, -4118, -1698, -2242, 421, 4175, 3550, 3471, -997, -4530, -6709, -4465, 3720, -3142, -12896, -13803, -6986, -3740, -8772, -12618, -11588, -10515, 428, 6871, 2523, -5352, -10109, -7049, -6049, -7877, 1444, -2872, -1446, 2342, 2596, 453, 1301, 1181, -1404, 2348, -32, -1477, 813, -7732, -9711, -9213, -1326, 2818, 2125, 304, 5774, 8480, 11326, 15612, 14692, 7869, 7518, 2937, 913, 730, -324, 1013, 1873, -4056, -5706, -3022, -7987, -5698, -4770, -840, 3377, 2049, 2187, 1168, -2175, -9242, -7567, -5387, -620, 860, -285, 2772, 8273, 10686, 12614, 6697, 4339, 3500, 5089, 12095, 12791, 8143, 5247, 7469, 9904, 4511, 2596, -4024, -13334, -10846, -5774, -7590, -10181, -9840, -10022, -9869, -5553, -5854, -4705, -5898, -9161, -11970, -8481, -2321, -3701, 2010, 4433, 3210, 3918, 5415, 2428]
13617B428k284J045J051j798l961J459j788L744Q277J96j370l052K888L266K418
13602A2519J171l050k157J962l543l387L104m371J178N353m373m967l258J237
13588b582K289L130P91L263L249k016R53J675m333R95J430Q64m911O7m84j537
13572B843n183l791J638R54q503j343K035l5O799Q554R497j682m894M517L176
13557A4582J231L58K596j138n881m321o01N99k071O06m495J353m03j92K066K656
13541F945M745q94Q69L581K735j831o004k687j947L608o431l558M78J042j697
13526a046r63n584K660r24p70k68L122N990O63n895l804L447O841M943M949J258
13510A4619j500j32j637j018j0539m484P290P991L249o274m228J281l87o2k015
$$ y = [2428, 144, 1189, 2240, 442, -3519, -2060, -3848, -104, 8173, 8369, 6999, 3947, 6835, 10101, 12519, 13690, 10640, 8483, 10445, 6902, 3515, 6619, 2248, 3426, 8779, 4406, -561, -3819, -2582, -293, 2837, 3628, 6891, 10140, 8124, 9077, 10752, 6419, 7414, 8844, 9708, 4797, 4864, 4380, 2843, -2340, -6131, -4493, -3539, -12042, -13385, -11350, -11385, -4586, 3968, 13465, 11783, 6889, 11406, 14582, 15813, 16171, 18767, 17629, 11748, 7427, 6826, 7425, 5354, 5960, 1465, 2818, 2415, 2223, 4289, 6945, 11690, 10796, 11665, 15246, 17981, 16150, 10146, 7459, 5512, 9120, 2689, -869, -391, 651, -1046, -2009, -7593, -4933, -5857, -6627, -6895, -3773, 2217, 2880, -3015, -6819, -3372, 3469, 8412, 13361, 14619, 13119, 12987, 11350, 10332, -207, -4691, 2599, 10590, 13839, 7565, 3337, 4618, 4231, 4169, 2154]
13495B154n766j52j900j141k50L240L281P57J688J334j0138p323n172J1423R222
13480A257M511J48j0924J125l041m593l7J330K806K569N988P030k743k910n310
13465b794k117J451M279L905N85j984l984K447O874J35l717o61q201m785k089
13450a0656M49K947j418J791K126K288Q25K443N84j959J322j649J205J0797Q023
13435A9118l011m767k494J51j238k450o864r385K354K513P006L094j966K441k550
13420A952L007k850K085K84r89k286n838m277k532R627Q966K516r041o340o0M745
13404a031J768l906Q00M653J421k610j842j942k005K692J504J793M724l300j011
13389A708K33p541k163L096l953l571M88K062j248M821P53J335n644M116O183
$$ y = [2154, -3612, -3764, -5664, -6805, -7055, -3815, -534, 223, 1911, 3245, -6893, -14216, -19388, -7965, 1257, 5768, 5916, -5008, -3883, -6924, -11517, -11554, -10224, -7418, -4849, 1139, 8169, 5426, 2516, -2794, -4911, -3460, 819, 4724, 5309, 3325, -659, 1788, 8662, 8797, 5080, 4419, -3782, -8567, -10656, -10207, -7260, -8678, -6887, -4761, -2473, -1648, 795, 1379, -580, 742, -907, 298, 11095, 19118, 16107, 11340, 8846, 8997, 7759, 5309, -1555, -10940, -8586, -6073, 933, 4027, 2061, 4502, 1952, 4959, 2109, 4194, 4478, 3489, 1203, -4635, -8912, -11444, -1817, 7149, 9665, 624, -5716, -5776, -1031, 737, -3169, -2369, 2284, 3705, 1095, -747, -2689, -4694, -2002, -498, 1295, 6019, 2719, 1708, 1941, -5600, -7763, -4667, -8620, -12191, -11703, -9641, -10889, -6068, -5315, -3980, -9624, -5508, 675]
13374F75M455J837q66k486J002q312k973N784r90L244O453N45k060o782n507K639
13358c342O279j081m328l836O439L257j52J274l890L829k229m473R69J0695m12
13343H999K168P864o006l752n94r248j816N97J2K67k113k078n19j140n51k325
13327a0235K820L316K100j815m9n928K73P869J675K657J48J077k751j909l047
13312c799L741M273J147N489j241n41k525k858o22M96J509o911r87N390J012P2
13296C645n956n847P17N464L035p161K356L333j818L441L386L67K827k821k29
13281D739m23N131M628p104j1131L84P743K805K621k272J081J0473J3252L950
13267C5877m495K489m070k185j019L27n131q308n868Q49M441N227K794l023p761
$$ y = [675, 5130, 6967, 6101, 3615, 4617, -3695, -6668, -884, -1874, 1370, 7823, 8368, 6308, -474, -5981, -3342, 2937, 1856, -2472, -6308, 131, 3388, 3236, 4510, 620, 4449, 2220, -2253, -1284, 9411, 8999, 11167, 19031, 13025, 9273, 8679, -569, -2385, -1788, -1776, -1509, -3622, -5700, -6219, -7359, -7910, -10235, -7415, -4099, -1999, -3814, -3863, -9791, -9518, -1649, 26, 2683, 2831, 3908, 1157, -752, -3799, -58, 4215, 5362, 10851, 9610, 9069, 6544, 3686, 3064, 3560, 5069, -1842, -2829, 2561, 3573, 3645, -2311, -8158, -7441, -1977, 1058, -6103, -3747, -414, -2232, 1209, 4595, 4962, 7789, 4968, 4739, 4316, 9447, 14075, 6971, -4160, -3776, 3967, 6772, 9393, 7121, 8202, 18675, 31927, 35877, 31382, 33871, 29801, 27616, 26597, 26924, 21793, 13485, 7617, 8466, 12907, 18134, 20928, 17905, 10144]
13252A0144p229r79J0700k34p777o600L197M063J135O508j496o446K013N455k34
13237A2220l742j725l966L076L695J860O76l393j738Q370j78L693Q11K279K540
13222B4478M051J1844M882l034j151Q318m742k071m225n535P23J424Q90q8K663
13207C8427n814m267k950N347R455N112Q943K765L487m134P636J2039J8356K2146
13193A16548K1197L8358P2092R8939J63400K33892K57404K24028J45527L5245
13183A406630r6982k15324k61330k25468j48718q8283n4816m4657k6790j7277
13173B26985j5464j3026j2767j0548j3080o235l226j070j812M138k76N312k307
13160A56624N1O676P492O910O856J0137R462J5953K3146L7668M8311N5900Q1885
$$ y = [10144, 2915, 1936, 12636, 12402, 4625, -1975, 1222, 5285, 6420, 12928, 11432, 4986, 6999, 12454, 12220, 8478, 6753, 2787, 5863, 9558, 11418, 12094, 8701, 6963, 15333, 15155, 18848, 19659, 21938, 24478, 28529, 40373, 45255, 42221, 41070, 49388, 44646, 42575, 38350, 32815, 33538, 34962, 35852, 35764, 38427, 32613, 28346, 25396, 30743, 40198, 45310, 54253, 57018, 60505, 56371, 64007, 76046, 94402, 116548, 137745, 176103, 248195, 347134, 510534, 744426, 1001830, 1225858, 1371385, 1406630, 1309648, 1094324, 832994, 607526, 458808, 370525, 315709, 271052, 244262, 226985, 211521, 198495, 185728, 175180, 162100, 155865, 152639, 151569, 149757, 153895, 153619, 158931, 156624, 156675, 163351, 170843, 177753, 184609, 194746, 204208, 220161, 243307, 280975, 329286, 385186, 467071]
13147D67071J11562J69196K74354M39225O43200P86790P43535N29987K05353j82792
13137D187481n84879q19622p70351n34160l26626j92522j25382q8672o7660o3069
13127F14538n2092m5743m0561k8829k1426j3346j4447j1007j3073q428n361k907
13115C57318p565o064L82k066L698R063J2343J3100J5477K7392M3029N5264O7662
13102E89033R9202J50447K45202M00504O10593P82680P81657N88494K78061r3971
13092D431902n06006q01398q24151o22153l80971k33301j46534r6976p1660o5669
13082F83083m8097m7606m3285l5310k1716j7234j9490j9690j8544j9825k3325
13071C68961j5633o105p499k38l609q629j0487k009N224M418L742P684J0742J9355
$$ y = [467071, 578633, 747829, 1022183, 1461408, 2104608, 2891398, 3634933, 4164920, 4370273, 4187481, 3602602, 2782980, 2012629, 1478469, 1151843, 959321, 833939, 745267, 677607, 614538, 562446, 516703, 476142, 447313, 425887, 412541, 398094, 387087, 374014, 365586, 360225, 357318, 349753, 343689, 344071, 342005, 345703, 354766, 367109, 380209, 395686, 423078, 466107, 521371, 589033, 688235, 838682, 1083884, 1484388, 2094981, 2877661, 3659318, 4247812, 4525873, 4431902, 3925896, 3124498, 2300347, 1678194, 1297223, 1063922, 917388, 820412, 748752, 683083, 634986, 587380, 544095, 508785, 487069, 469835, 450345, 430655, 412111, 392286, 368961, 353328, 347223, 339724, 339486, 335877, 327248, 316761, 314752, 319976, 324394, 328136, 335820, 346562, 365917]
13057C65917K8305M2932O9241J16872J75638K47071K67938K09943J15033j5294
13047A623596j49368k55221k71302k23213j54063r1777n6354l0916l1527k9692
13037C30163k3441j4802j6924j9880j1363j5502q967j0621o121n465l518p271
13025A86288o783m194m944q228j120K59o229Q6n031k993L156M697l383q884q2
13010A42615k054p856j0005o369m477J238n236n639p945k389l887p300r42J986
12996H1740K409K220K726J114p70k247l647K957L349m077q917l790J914m580L743
12981G4144K148r455l543M391L630j804J122j156L84L130J711J085O913J053j3130
12966G0623q122j771J630j246l145J190j629p268k188J802m011r024k739j427
$$ y = [365917, 394222, 437154, 506395, 623267, 798905, 1045976, 1313914, 1523857, 1638890, 1623596, 1474228, 1219007, 947705, 724492, 570429, 478652, 422298, 391382, 359855, 330163, 306722, 291920, 274996, 255116, 243753, 228251, 219284, 208663, 202542, 197077, 193559, 186288, 179505, 175311, 170367, 162139, 161019, 161278, 155049, 155135, 150104, 147111, 150267, 154964, 151581, 142697, 142615, 140561, 132705, 122700, 116331, 111854, 113092, 107856, 102217, 94272, 91883, 87996, 80696, 79754, 81740, 84149, 86369, 89095, 90209, 89439, 87192, 83545, 86502, 89851, 85774, 76857, 73067, 74981, 70401, 74144, 76292, 66837, 63294, 67685, 71315, 69511, 70633, 69477, 69861, 72991, 74702, 75787, 82700, 83753, 70623, 62501, 60730, 62360, 61114, 57969, 59159, 57530, 50262, 48074, 49876, 45865, 36841, 34102, 32675]
12952C2675O454L179k273k239k514l204o592k229Q211P189j876o598j943L543
12938C1783L54K004M073j825o305l718j816J449q99q95O839N964j357o648p231
12923B1772P151J2128j775o81l337j025q67Q23n954K575l793l074N181M638j776
12908C1986o603q271P12K126L332k543K58N07l241p764l864O60J036o620M75P554
12892I740J1114N282J095J680l397K115j0365j2420j904j484j949q05N634L055
12878G391m94m067k546P855O057J127r0m380j5l672q946l149j109M803P501M503
12862A0769N249m346j0451k587N902j843k979J759j471n220j148n77P587l095
12848b451J44L143L678K775N17j1335p741P549Q571L097o822m828j02O886P71
$$ y = [32675, 39129, 42308, 40035, 37796, 35282, 32078, 25486, 23257, 31468, 38657, 36781, 30183, 28240, 31783, 32137, 34141, 38214, 36389, 30084, 26366, 24550, 25999, 25100, 24205, 31044, 37008, 35651, 29003, 21772, 28923, 41051, 39276, 38595, 35258, 34233, 33366, 34189, 28235, 30810, 27017, 23943, 29124, 33762, 31986, 25383, 17112, 17824, 19950, 23282, 20739, 20997, 21504, 18263, 10499, 6635, 7295, 8331, 1711, 2186, 9740, 20854, 26136, 27231, 28911, 25514, 27629, 17264, 4844, 2940, 1456, -493, -1298, 4336, 7391, 6897, 2830, 284, 8139, 14196, 15323, 15233, 10853, 10838, 7166, -1780, -4929, -6038, -1235, 6266, 10769, 16018, 11672, 1221, -1366, 4536, 2693, -286, 1473, 2, -5218, -6366, -6943, 644, -2451, -2307, 836, 4514, 7289, 7806, -3529, -11270, -3721, 4850, 7947, 1125, -3703, -3805, 3081, 3852]
12833C852J687M037L457j0370l735L126j215o837p2M297Q29O171N300K504K176
12818A5207l971o992n013r444j677P317J0064O41j991m436k441R913q646j5752
12804a7221M056J8342M02o707J30l387l341k71L615O23J297J320M571q02M214
12789F841L776k943J236r8j740o55l02l428n275o83O002k41k320l521L388J121
12773A158M225M021o963J960L354J053n911m121L639o46m293n476m846r86o35
12758a4467P316K585l811j645k527J840L863P0l344N068J0518j847l405K426l309
12743f69K28L246k523k473l545k050K364O28R32O737J358l656q87k059j757J050
12727c076l581n457k696R174Q272K594r61k220O12Q43l561O479K490n80k839r256
$$ y = [3852, 5539, 9576, 13033, 2663, -1072, 2054, 839, -5998, -6070, -1773, -944, 5227, 10527, 13031, 15207, 11236, 4244, -769, -10213, -11890, -4573, 5491, 6132, 4141, -295, -2736, 7177, -1469, -17221, -13165, 5177, 5579, -1128, -998, -4385, -7726, -7997, -4382, -3759, -2462, -1142, 3429, 2627, 6841, 10617, 7674, 8910, 8812, 7072, 6417, 6115, 2687, -2588, -3271, 2731, 2490, 170, -3351, 37, 1158, 5383, 9404, 2441, 4401, 7755, 8808, 2897, -1224, 2415, 1769, -2524, -8000, -12846, -13832, -14467, -7151, -4566, -8377, -10022, -12549, -10709, -6846, -6776, -10120, -5052, 5466, 3619, 214, 2640, -669, -441, 2805, 282, -2191, -5736, -7786, -5422, -4794, -3862, 2875, 4233, 577, -310, -2369, -4126, -3076, -6657, -12114, -14810, -5636, 2636, 5230, 4269, 2049, 2661, 3504, -57, 6422, 8912, 8332, 5493, -3763]
12711c763o234J466M700M198q75o584K664N321Q83o43P337k289j096k1k015k279
12695G70n375p752l135J698L504Q34N117J574K106k39k151l140k6k878k261r6
12679a1450J914J482J609K483J455P712q98J0044P151K509K01P7o718m166r717
12664C688m321L46O19l83K388k072K001M408J429J80N15K720j431r175n034j487
12648e609K536l014M948N359j992j126N92M294N103p951j086N74K784N022j527
12633H907n039m854n762K860L149L537P781l425K296j925J298M310j959N35K586
12618A4295o878J291P442k436l389o985n527m871O490J404m330o340k979J130
12604a1683r91J363J1913Q31N34j499m443J432K261n336k596M572J3330O499p984
$$ y = [-3763, -9997, -8531, -3831, 367, -508, -7092, -4428, 893, 1776, 1133, 8470, 6181, 5085, 5064, 3049, 770, -4605, -12357, -15492, -13794, -10290, -9456, -4339, -2765, -659, -898, -3049, -6189, -6215, -9093, -11354, -11450, -9536, -8054, -6445, -3962, -2507, 5205, 4307, 14351, 21502, 24011, 24212, 24289, 17571, 13405, 3688, -633, -287, 332, -51, 2337, 265, 2266, 6674, 8103, 8283, 8798, 11518, 10087, 912, -4122, -5609, -3073, -6087, -1139, 4220, 2228, 1102, 1694, 5988, 11091, 3140, 2054, 2628, 5412, 10434, 8907, 3868, -986, -6748, -3888, -739, 2798, 10579, 7154, 9450, 7525, 8823, 13133, 11174, 11709, 14295, 7417, 8708, 16150, 13714, 10325, 3340, -2187, -7058, -568, 836, -3494, -9834, -12813, -11683, -12674, -11311, 602, 1433, 1967, 468, -3975, -2543, -282, -5618, -8214, -3642, 9688, 16187, 8203]
12589H203j1760j616m241O79P795O604L301O67M726L444k312p014m5l79n94j682
12573E776n8j518n01J505O142j814j0990n148j445N760K595L032l34n643L971
12558A330O814R10R24m080n229L363l684o565q934K865J836O978Q235J0950n411
12543A0302p825l389l328j275m26q52j359r839o96M693L146J651J60L264J742
12528d031O381K947M148j785r142o540M326J952N700l357j115N523n028p038o382
12513a3441N213R285p31q911l337N34P07k898m17P485L725m20K89K531l85L031
12497B260M446Q0k746j1626o214K196k433J686M489O984k481l521K291k467o428
12482a3484O640R214M911m619o689K716J227J775J021K7q628M629J0583N051K868
$$ y = [8203, -3557, -5173, -9414, -8735, -940, 5664, 8965, 9632, 14358, 17802, 15490, 8476, 8431, 8052, 7458, 5776, 5718, 4200, 3699, 5204, 11346, 9532, -1458, -6606, -8051, -2291, 304, 3336, 3002, -2641, 1330, 8144, 9054, 9978, 5898, 669, 4032, 348, -6217, -15151, -12286, -10450, -3472, 4763, 15713, 10302, 2477, -912, -4240, -5515, -5941, -6793, -8152, -17991, -18687, -13994, -10848, -9197, -9037, -5773, -4031, 2350, 5297, 9445, 7660, -1482, -8022, -3696, -1744, 3956, 599, -516, 5007, -21, -7059, -13441, -8228, 1057, 326, -8585, -11922, -11388, -10681, -13579, -13996, -6511, -2786, -3206, -2917, -386, -771, 2260, 6706, 6786, 4040, -7586, -13800, -11604, -14037, -12351, -7862, -878, -3359, -6880, -4589, -7056, -13484, -6844, 2370, 7281, 2662, -4027, -1311, -84, 1691, 2712, 2739, -5889, -1260, 9323, 14374, 17242]
12467A7242m656l792k546o31o707m330O26J461J10J172L273m014L702K983j857
12452B036K29j126M370P731j1040k653J85N500J632j672K513J898j2045k57k11
12437b910p711m155K52O648M921R970J414l534m643r290l56R237N92k914j531
12422d010m323m174k92O118P023J732k936m220J72J799Q913M103n006o30l828
12407D41P2p11m414Q14N09P711M69q058L350O031n984m107P629o2o074j234N607
12390A989J804K049K184n132q00o809M578k466k047N835r03j175k096o634L890
12375e733J785k66K099L740K957q417o388L604O440n125l86O261k81J763k932
12360h79J309n892N188R31l565K174K592P73J0894K526j3876J404n090n246L48
$$ y = [17242, 12586, 8794, 6248, 5617, -1090, -5420, -4794, -3333, -3223, -2051, 1222, -2792, 910, 3893, 2036, 2265, 1139, 5509, 13240, 2200, -453, -268, 5232, 6864, 5192, 7705, 9603, -2442, -2699, -2910, -10621, -14776, -14524, -7876, -2955, 7015, 8429, 4895, 252, -9038, -9394, -157, 435, -2479, -4010, -8333, -12507, -12799, -6681, 342, 2074, -862, -5082, -4910, -3111, 5802, 9905, 4899, 4269, 441, 513, -198, -4612, -3798, -3289, 4422, 4891, -3167, 183, 6214, 230, -3877, 3752, 3690, -2384, -3618, 1989, 3793, 5842, 8026, 2894, 2094, -4715, -137, -2603, -4650, 1185, 282, -893, -2989, -9623, -5733, -3948, -4214, -2115, 1625, 4582, -3835, -10223, -6619, -179, -5304, -5690, 571, 290, 2053, -879, 430, -5462, -274, 657, -2908, -734, 1858, 2631, 13525, 16051, 2175, 3579, -1511, -6757, -6409]
12345f409j56o63J643K945L275k030K324N536k735M62n99q99l383k644P304J327
12329E298j0361j375J406N972J576j962L790K128q38M33O78p274l531K425m796
12314f431k56K34j07M402P827K698o019o994j667M589k886p529M982j199j038
12299i394K273l901n526K089m094N933N371j238J879N031n626l738k94M996K755
12284c484o04k093M064L028J348l604m057K056N850J237m238j1709o769l058N08
12269b1525K781R122M635j497K507M198l19k790m668j1041q210J0522J2800J041
12255b444L693q3n161j329K112J115j134l575k381J195O419L356M959k256n943
12240a457J615j368J326j0144L79K494J650L353q95K97M206L08n699K943K543
$$ y = [-6409, -6565, -7228, -5585, -2640, 635, -1395, 929, 6465, 3730, 4192, 3593, 2694, -689, -3333, 3971, 5298, -5063, -6438, -5032, 940, 2516, 554, 4344, 6472, 5634, 6067, 6745, -529, -4060, -1635, -6431, -6687, -6453, -6560, -2158, 5669, 8367, 2348, -4646, -6313, -1724, -4610, -12139, -7157, -8356, -9394, -7121, -11022, -16548, -14459, -18553, -12620, -7249, -8487, -6608, -1577, -7203, -10941, -11235, -6239, -3484, -4088, -6181, -2117, 911, 2259, -1345, -5402, -3346, 2504, 3741, -497, -12206, -18975, -22033, -21525, -18744, -9622, -4987, -6484, -3977, 221, -98, -2888, -7556, -18597, -26807, -16285, -3485, -2444, 1249, 1166, -3995, -5324, -3212, -2097, -3231, -6806, -9187, -7992, -1573, 1783, 6742, 4486, -1457, 158, -1210, 116, -10028, -9649, -7155, -5505, -2152, -3047, -2750, 1456, 1764, -3935, -992, 1551]
12225A551M974k139q036p492N01P420j463m839k886K594oL173N660j354p467O46
12209i163O016M074p01k306L142Q25p8o394j6O793j155l393j230K95M6K848J088
12192F91Q42n000J191l327j080L577m685L082N558m89J306K354p62o93J173k634
12176A104k824j510M86O653N06k531k64k81p009J822p61m786M86J309K859K932
12160a809k061k122L866k771o637M322O802m94l429K456J904M665J844m179o224
12145c867L193l775m822m37K778K146j513Q75L117O180j668k511j74l436r85n878
12129a0777M951L920m615J448r69j734M046m273k562L214O934J262k151N664N797
12114A0155J064n239j0683J427k370N343O799j66q08m873J930K821m463L198j79
$$ y = [1551, 6525, 4386, -3650, -11142, -10641, -3221, -4684, -9523, -12409, -9815, -9821, -6648, -988, -2342, -9809, -9163, -3147, 927, 226, -2080, 1062, 1887, 1809, -4585, -4601, 2192, 1037, -2356, -3586, -3291, -3245, -397, 691, 1533, -3467, -2276, -5603, -6683, -3106, -7791, -4709, 849, 360, 1666, 4020, 3258, 2565, 3738, 1104, -1720, -3230, -2744, 3909, 4415, 1884, 1620, 1339, -5670, -3848, -4609, -9395, -8909, -7600, -4741, -1809, -3870, -5992, -2126, -4897, -11534, -7212, -410, -904, -4333, -1877, 27, 4692, 6536, 2357, -3867, -674, -4449, -9271, -9708, -6930, -4784, -6297, -5422, -2305, 3875, 2207, -304, -478, -3914, -4899, -10777, -5826, -1906, -6521, -5073, -6042, -7776, -3730, -8003, -10565, -7351, -417, 845, -1306, 4358, 10155, 11219, 5980, -4703, -3276, -5646, -303, 6496, 6330, 5522, 649, 2579, 5400, 937, 4135, 3956]
12099C956q99m593j671j960o403k467M955q93M439N413j360l041L61j564q676
12084a4403J259J1775R147l354L771L456J787p159r04L478k500k597q803m964
12070a0011J661N180J044k066j63r46K09L806l68P834k936p867p510J400M127
12055f606J311l260l66O501N565l04l262l503O556r72l018M295j228m157n017
12040g465l128M395O27j341p78k695K242K872K07j460L009J022l643O447m16P31
12024F26J964Q517m377p417j975M620k097L034k81n437J565K385m902p643l509
12009a4927K202L277l718m616K186J0058M388l305j221J523m351K273k97Q075
11995A547j866k724j55k058q40p441L770J576L53l534k057K127N529N238J413
$$ y = [3956, 3057, -1536, -3207, -5167, -11570, -14037, -9082, -9975, -5536, -123, -1483, -4524, -4163, -5727, -14403, -13144, -1369, 7778, 4424, 8195, 11651, 13438, 6279, 5375, 8853, 6353, 3756, -5047, -10011, -8350, -3170, -2126, -4192, -4355, -5301, -5092, -1286, -1654, 6180, 3244, -4623, -12133, -10733, -6606, -5295, -8555, -8921, -2420, 3145, 2841, -421, -3924, 2632, 1660, -1358, 2937, 1709, -2448, -7465, -10593, -6198, -5571, -6912, -7690, -10385, -8143, -5271, -5064, -6524, -3515, -2493, -6136, 311, -105, 626, 2590, 11107, 6730, -687, -2662, 1958, -139, 2895, 2614, -2823, -1258, 1127, -3775, -11418, -14927, -12725, -9448, -13166, -17782, -15596, -5538, -1150, -4455, -5676, -4153, -8504, -6231, -6528, 1547, -319, -3043, -3198, -5256, -6096, -13537, -9767, -8191, -7838, -11372, -13429, -11302, -5773, -535, 878]
11980H78m821o4j837K045L799l73J554J367O27m171p04m335k741M94O49J571J0858
11963D796L260l584k967N98m592l276O386j522L560O789r03l116k563K138m987
11948A7j712q379o632O903N464K376O407L080m471K860J334N460J860l217K859
11933A4209n021r419q08Q470K777p416o15k764L223M472j145O95m564o683k817
11918g406R44j399K136M065N03K939K102J231J247n129q426o30j40k098K69K299
11902g493N261R14J742m093m596k02N934J2831k066m297o957o056O415N730p935
11887d868n783Q55J0068j48O84k387m019q745M872J2143J945M290l340o071n145
11872e649n440k914O913K876P453M757J149M009n564J018o011n27K094N524j551
$$ y = [878, -3943, -4007, -5844, -3799, 0, -373, 1181, 2548, 3175, -996, -1700, -6035, -8776, -8282, -7633, -6062, 4796, 8056, 4472, 1505, 2103, -2489, -5765, 621, -901, 2659, 9448, 8545, 5429, 2866, 5004, 17, -1695, -10074, -16706, -9803, -4339, -1963, 4444, 7524, 3053, 5913, 7247, 12707, 14567, 11350, 14209, 9188, -231, -1039, 7431, 10208, 2792, 2177, -587, 2636, 7108, 5963, 6658, 2094, -4589, -7406, -6462, -7861, -5725, -1660, -1157, 1782, 3884, 5115, 6362, 1233, -7193, -7823, -7963, -10061, -9792, -7493, -2232, -1318, 424, -3669, -8265, -8467, -2533, 10298, 8232, 3935, -3022, -9078, -2663, 3067, -4868, -10651, -9796, 272, 124, 808, -1579, -5598, -14343, -9471, 2672, 4617, 8907, 5567, -504, -5649, -11089, -14003, -7090, -4214, 3239, 7996, 9145, 13154, 7590, 8608, 2597, 2070, 4164, 9688, 8137]
11857H137l595l097O372N981o1K954m699n59k187n125l195q919k235M092L46k70
11841f060q99k795M941O889k45M67j253L51M513m976q251j977j41K889M239L171
11825H63J356j734k970n250p429P222L030O22l711J121M345J557O034N385K532
11810A2973n313j2720K651O866k870l727N313j481J1270M435q934r434m728j47
11796e846j811J33J821J400M041j171L714N916k82m858n475L62J0607r84o03K1
11780F985l259j510r67l700J246j224P092K515o662m747O18j91r41J518j597l904
11764h728m184L194M755L053J964J806m936L63m059j129j552k446l851m338K175
11749a7913P220k163n55P615P670n41l607J61J5j202l711o270n433P426M241L729
$$ y = [8137, 4542, 1445, 7817, 13798, 13737, 16691, 11992, 11433, 9246, 4121, 926, -7993, -10228, -6136, -5790, -6060, -6959, -9754, -4813, 2076, 1831, 2298, 1045, 1396, 5909, 933, -7318, -9295, -9436, -6547, -2308, 863, 2219, 485, -2485, -7735, -15164, -7942, -4912, -4290, -8001, -6880, -2535, -978, 5056, 10441, 12973, 7660, -5060, -2409, 4457, 1587, -2140, 3173, 1692, 12962, 17397, 8463, -971, -5699, -5846, -7657, -7524, -5703, -4303, -262, -1433, 2281, 8197, 7915, 3057, -2418, -2056, 8551, 7567, 6964, 6985, 3726, 2216, 1249, -2451, -1205, -2429, 4663, 7178, 516, -4231, -3613, -3804, -4745, -3227, -4824, -8728, -12912, -9718, -4963, -1910, 54, 1860, -3076, -2713, -6772, -7901, -9453, -11899, -15750, -20088, -17913, -10693, -12856, -13411, -5796, 1874, 1333, -2274, -2113, -2098, -3300, -7011, -13281, -18714, -11288, -7047, -3318]
11733c318J494L224p37k066J518p002o309N887K800J927L470M592l531j755N055
11718E249j198p187j027j352L728k300P557N514l971o063o483j834n965p600l963
11703b6895Q585O053N719N823J367l858p78l553k151l25J1667m52o590N19J0531
11688E662M980l415k607k497P83l350p1K523K212O362k985m156m318n00j906k516
11672e799m467k249J944K02P722l019o051M133K627K459O008J498J080K108n93
11657G603o844l692l489k116m513K635O178N579M967k516j941j727k724k295p056
11642a1951K240K017L509K71L035K638L412j353l540k51p578L497J690j450l063
11627f877K507O899R004L083Q66p48r929l607R78o686o374M123K12J08K436J121
$$ y = [-3318, -1824, 1400, 663, -1403, 115, -6887, -13196, -7309, -4509, -2582, 888, 5480, 1949, 194, 5249, 4051, -3136, -4163, -5515, -1787, -4087, 3470, 8984, 5013, -1050, -7533, -9367, -15332, -22932, -26895, -18310, -12257, -6538, -715, 652, -3206, -3984, -7537, -9688, -10013, 1654, 1202, -5388, -4869, 5662, 10642, 7227, 4620, 2123, 2906, -444, -515, 2008, 4220, 10582, 7597, 3441, -877, -1377, -3283, -5799, -10266, -12515, -10571, -10369, -2647, -5666, -11717, -7584, -4957, -2498, 3510, 5008, 6088, 8196, 7603, 759, -2933, -6422, -8538, -13051, -10416, -4238, 1341, 6308, 3792, 1851, 124, -2600, -4895, -11951, -9711, -7694, -4185, -3914, -879, 1759, 5171, 3818, 278, 27, -7551, -4054, -2364, -3814, -6877, -4370, 2529, 11533, 14616, 15482, 14734, 4805, 1198, 2176, -4510, -10884, -6761, -6549, -6441, -4005, -2884]
11611b884K899M179l384l68l675r659m001l249J2394Q077L754M098n350j592k203
11596i64r106j983J584K855o517R046R536n195n186K614M166K725N17o406m19
11581b733J924L9k577P96L131J638o903O70n317q902l32L405K031k910o446q98
11565b3384O389O770o89M368m597o646M63Q214L250m245P619N348j762j086j813
11550a801K7j267O496j901m053J0101K234P812M129n639m794J964n538o317o506
11535e053o086j065q87M615n014L032L256J965J29K436K646N464j083m766K387
11520A976k059l171J670L390M251R547q663j0502k93K507J212J331l156l868k620
11505h448K450l203J191n640k854Q578J1140J802j769J803J409L973K394m769
$$ y = [-2884, 15, 4194, 810, 442, -3233, -12892, -16893, -20142, -7748, 329, 4083, 8181, 2831, 1239, -964, -10070, -12053, -10469, -7614, -14131, -5085, 4451, -744, -5930, -3316, 850, 3575, 4092, -2314, -2733, -809, -770, -3347, -2551, 580, 2218, -4685, -4015, -9332, -18234, -18566, -15161, -13130, -16040, -22486, -23384, -16995, -10225, -10914, -6546, -11143, -17789, -17326, -9112, -5862, -10107, -2488, 2860, 1098, 12, -1801, -1774, -3041, 3455, 1554, -2499, 7602, 9836, 17648, 21777, 16138, 11344, 13308, 7770, 1453, -5053, -11139, -12204, -13091, -8476, -13490, -10458, -7202, -5237, -5108, -2672, -26, 5438, 4355, -411, 1976, -83, -3254, -1584, 1806, 6057, 15604, 6941, -3561, -3854, -1347, -135, 1196, -1960, -5828, -8448, -5998, -9201, -8010, -13650, -16504, -7926, 3214, 5016, 3247, 5050, 6459, 10432, 12826, 8057]
11491H057j4592q23J572j303p88K408L351K753k699M013K856l555o761l727L319
11476e919J208O434L581m173m72l919j306k144j929L754q33L244N250M348K782
11461I906q802n532L586o437L562N400L285n655p057L485L792j921N452L062r357
11446c231J323M552j760K505J115o924Q39j055l703J03L764O336J613m480l446
11431b449j063l475M277M501o90l002p741K59R925l406o371R88J1256L560p05
11416E864j994m616q15r28l87l479k561R397l124l852K594n713L084N956o507
11401g081l057P032J354N84m389o099M798Q23K329J032O767j341P393J1131n230
11386A6046j906l253l722o950m17k222k831K345K419k445j515N949R82j109N14
$$ y = [8057, -6535, -7358, -5786, -7089, -7877, -5469, -2118, 635, -2064, 1949, 4805, 1250, -5511, -9238, -5919, -4711, 1723, 5304, 1131, 659, -3260, -4566, -6710, -8639, -4885, -5718, -2474, 2776, 7124, 9906, 1104, -4428, -842, -7279, -3717, 1683, 4968, -687, -7744, -4259, -467, -2388, 3064, 6126, -3231, -1908, 2644, 884, 3389, 4504, -2420, -1581, -2636, -6339, -6236, -2472, 3864, 5477, 997, -2449, -3512, -6987, -2710, 1791, 1101, -1901, -9642, -9383, 542, -2864, -9235, -8247, 3009, 6569, 5864, 3870, -746, -1561, -2489, -2876, -6355, -8916, 481, -2643, -6495, -3901, -9614, -6530, -574, -7081, -10138, -3106, -1752, -1168, -5557, -11656, -6858, -6035, -3706, -2674, 4093, 2752, 10145, 21276, 16046, 14140, 10887, 7165, 215, -202, -2424, -5255, -2910, -491, -2936, -4451, 1498, 2480, 1371, 1885]
11371A885l932k54qL858M595l313j0605L542M913o853j862J133m515n109J820
11356a4705j102N492N618O81j4R08L052j752k982J672K111M364R176l101k615
11341F803N798j772r371q897q53M511O995N175K174m101o012n564m13O739P43
11326A955k570o8k224N012O513l029P34n159q699k43l520J620n21j64q37J89j398
11309a2409J427R279R352j25m077O569M219o64o804k643q78j120n715O25R028
11294F064K602l160m493j85o198m419M75O381O458N94q809l651Q934j09l819P7
11278c258O02l25K892O206r766p012k090M918M240k706L698N134o142m672l314
11263a1595j292o0O796J782j107L432Q881O027M10r078p099M494k579k417j386
$$ y = [1885, -2047, -2301, -2309, 1549, 6144, 2831, -7774, -4232, 681, -6172, -8034, -6901, -11416, -16525, -14705, -15807, -10315, -4697, -4016, -4030, -3122, -70, -1822, -4804, -3132, -1021, 3343, 12519, 9418, 6803, 12601, 10829, 1458, -7439, -8292, -3781, 3214, 8389, 10563, 6462, 450, -5114, -5527, 1212, 1955, -615, -683, -2907, 2105, 8618, 5589, 6323, 1164, -7535, -7778, -11298, -9678, -10199, -10363, -11200, -11011, -12409, -10982, -1703, 7649, 7524, 3447, 10016, 14235, 13571, 6767, 4124, 3246, 2126, -3589, -2964, 6064, 8666, 5506, 1013, 828, -5370, -9789, -9314, -2933, 3525, 4119, -4690, -8341, 593, 484, -3335, -3258, -2656, -2981, -89, 6117, -3649, -10661, -12751, -7833, -3593, -6299, -2601, 2533, -3609, -8281, -11595, -12887, -12947, -6151, -4369, -5476, -2044, 6837, 12864, 13274, 4196, -2903, 1591, -988, -3405, -4791]
11248d791j993k545J158J438Q838P255L143p17j0497n443m807k101J596m196J264
11233a2398O297J558j120R52O035n060J932J324L35L561k309m772l535J566K435
11218c199L834O788r99K69M1p667p873N518P550J000q396q95R21L069m054o357
11202a0450M675l050m597P43O087M467N248M936N27o914p864L65N669J807L170
11187D819j834M00j053K48K329k321l237k616N883L67J925n246k163L544o246
11172e201m222J461R413O983n434o465Q29O502l504n296K585K406L68l062k038
11157d675J348J365M886j591q115l53M042K003j383L211J228K700m500k803O102
11142C465J682m651J875j524n413j037L943L33j72n960l078J0259Q367m833m096
$$ y = [-4791, -6784, -9329, -8171, -6733, 2105, 9360, 12503, 11786, 1289, -4154, -8961, -11062, -9466, -13662, -12398, -6101, -4543, -5663, -4711, 1324, -3736, -1804, -480, -145, 3416, 1107, -3665, -7200, -5634, -3199, 635, 7423, 6424, 6693, 6734, -933, -8806, -3288, 4262, 5262, -3134, -4029, -3108, -39, -4093, -10450, -5775, -8825, -13422, -12679, -6592, -2125, 3123, 8059, 8586, 1672, -6192, -5827, -158, 1649, 4819, 2985, 3385, 2332, 2580, 4909, 2588, -649, -3265, 2618, 2985, 4910, -336, -2499, 1045, -5201, -9423, -7962, 1451, 8434, 3000, -3465, -2636, 3866, 362, -4934, -2349, 57, 425, -2637, -4675, -3327, -1962, 2924, 1333, -6782, -7135, -3093, -1090, -2473, 738, 1966, 4666, 166, -2637, 3465, 5147, 496, 2371, 847, -4566, -5603, -1660, -1327, -1499, -7459, -10537, -278, 8089, 3256, -840]
11127h40J345O608J664m566l114Q18k722k070m139m239O295J834K961L062l305
11112d08L33J871j632L519M441R81P302L88m742j528J671n529l789l00R64q15
11096B727p767r6M243k375k31L106K639l637n74J066n06N35J868k05q67l782J670
11079b186M880J413l30j069j842m921J664K760m21L178j324k126n70O97o0l276
11063c533l510j077l551j586P937R020K772M573K145k139j568K827M152N201J0663
11048C2326L021N934M746L552l030m729o504k575m266p553q654j55M613J798k174
11033A6350J1985P222L311K383l545j370K535k090n24O16k23r905k421o306k757
11018A5261P893k637n670o262k372M032N37n329m439j356O45J486J563p52N012
$$ y = [-840, 505, 7113, 8777, 4211, 1097, 1915, -807, -2877, -7016, -11255, -4960, -3126, -165, 2897, -408, -75, 1796, 164, 3683, 8124, 9105, 16407, 16795, 12053, 10525, 12196, 6667, 2878, 2578, 3542, 2727, -5040, -5136, -893, -3268, -3499, -393, 2246, -1391, -1965, -899, -1405, -870, 998, 793, -74, -3856, -2186, 2694, 4107, 3777, 2708, 866, -4055, -2391, 369, -52, 3126, 1802, -324, -894, -197, -257, -3533, -7043, -8120, -11671, -13257, -5320, 3700, 6472, 11045, 13190, 11051, 9483, 12310, 16462, 21663, 32326, 35347, 41281, 46027, 49579, 46549, 41820, 35316, 32741, 28475, 20922, 12268, 12113, 16726, 18524, 16350, 28335, 35557, 38868, 41251, 37706, 36336, 38871, 36781, 36257, 36873, 36650, 26745, 24324, 18018, 15261, 23154, 20517, 14847, 8585, 6213, 10245, 10782, 5453, 1014, -342, 303, 1789, 3352, 2600, 7612]
11003G612N703n469k934Q10L648J482o81m02l828o413K090l148j248K762J615
10988A599J722j839M872L020o758jM264J521K757n697k585p99K631L330n890M090
10972F237O862o673j672l309J688O789k50p709j825J067L764K483n653k611K353
10957A541J083O735l01l91K081n850j0356p897L487O608M004R45j480M64K837
10942C510J290n389J283O165p66k217m048p328l167N997N005j800j083l019N379
10927a88M480o250n11K216J32K811P894M817k536p540q51K686Rk040l424j881
10911a76K387J373J408K916O341L174m70n750n004L179J528L50r88p99j0440j283
10895b254L956k981l716K514L379L848L285l443m032l486l763M333M608K748o193
$$ y = [7612, 13315, 7846, 4912, 5722, 9370, 10852, 10171, 9769, 5941, -472, 1618, -1530, -2778, -16, 1599, 3321, 1482, 6354, 9374, 2616, 2615, 6879, 8400, 11157, 5460, 2875, 2076, 4707, 8037, 2147, 6237, 13099, 6426, 4754, 1445, 3133, 9922, 9672, 1963, 138, 1205, 4969, 7452, 1799, -812, 1541, 2624, 9359, 9058, 8667, 10748, 4898, -5458, -13355, -9868, -3260, 744, 1689, 209, 673, 3510, 4800, -589, 694, 6859, 6093, 3876, -172, -7500, -10667, -4670, 335, -1465, -2548, -5567, -188, 4292, -1958, -2469, -253, -121, 2690, 10584, 15401, 12865, 5325, 4474, 7160, 7169, 5129, 1705, -176, 2211, 3584, 4992, 7908, 14249, 17423, 16953, 11203, 6199, 9378, 10906, 11256, 10268, 9469, -971, -2254, 1702, -1279, -4995, -2481, 898, 4746, 8031, 4588, 556, -2930, -6693, -2360, 2248, 4996, -1197]
10880a197j84o37k427j89J971J122N063J164m737k789l42j168k019K131l973K563
10864e648O246Q096n71L226k533p811j664M299M251P544l755m891l954j691j275
10849a31k859J18N733O160q9q22o341K490M775l910m272l149L113O085o48n452
10833H01J090o108r67K885q97L920M237n461r90R96l027m13k103J837J173p62
10817c789K931L507K030J055M235K217J692l63m784K516n018k457J995l09j140
10802D318N11M097j971j068l979k637L970J087J570n087J800K504O64N372m0O007
10786A7118Q853K354M996J22M571R252Q544J5789J4534O241K077L065r7j694j3552
10771H2173j2747j1028q501o860l16o307m840n123m293k044n1P0j478l54k709
$$ y = [-1197, -1381, -2018, -4445, -4634, -2663, -1541, 3522, 4686, -51, -2840, -3182, -4350, -6369, -4238, -8211, -5648, 598, 8694, 8123, 11349, 8816, 1005, -659, 3640, 7891, 15435, 11680, 6789, 2835, 1144, -131, -2990, -2872, 2861, 9021, 8932, 8110, 1769, 4259, 9034, 5124, 852, -2297, 816, 6901, 6253, 801, 1891, -4217, -5184, -2299, -3196, 724, 4961, -500, -1490, -494, -3521, -3934, -6037, -4200, -3027, -3789, -858, 2649, 4679, 5734, 9969, 12186, 13878, 13515, 8731, 11247, 6229, 3772, 5767, 5458, 4318, 4829, 8926, 6955, 5887, 1908, -729, 3241, 4328, 5898, 811, 2611, 5115, 5779, 11151, 11111, 17118, 25971, 28325, 33321, 33443, 38014, 47266, 55810, 71599, 86133, 92374, 94451, 97516, 97419, 95725, 82173, 69426, 58398, 49897, 43037, 42721, 36414, 31574, 26451, 22158, 20114, 20063, 20133, 18655, 18301, 15592]
10756A5592j625j545j723p741l788N596J626M178K01J357N206k655j393j182M569
10741A6673O848l579O96j082n208p666m051L317j162j01j64J718j250K895m149
10726C735P470L273J347Q45j386l680l404L027J027q49J507k455o580n918M910
10711B869P228L206K046J428k080l788j982n30n248J733J934N312P257m573k794
10696A2018j912o186M930N409K491l221j183k529j988k397m970K79M935o66K469
10681G479K169l443M574J244m646p889n638L169K34J668O219K435l042l514O911
10666G930J0678M027k917m153n786L358k835J428P68r643M71J122q5J529P456
10651A3348L244o259K81j312J94O787J810k151k580m121k60K5m223p635p025K270
$$ y = [15592, 13967, 12422, 10699, 2958, -830, 4766, 6392, 10570, 10771, 12128, 17334, 14679, 13286, 12104, 16673, 23521, 19942, 20638, 19556, 14348, 6682, 2631, 5948, 4786, 4685, 4521, 6239, 4989, 7884, 3735, 11205, 14478, 15825, 16670, 15284, 11604, 8200, 11227, 12254, 11405, 12912, 10457, 3877, -2041, 2869, 10097, 13303, 15349, 16777, 14697, 10909, 8927, 8397, 3149, 4882, 6816, 12128, 19385, 14812, 12018, 10106, 3920, 8850, 14259, 16750, 13529, 12346, 9817, 7829, 5432, 462, 741, 5676, 5010, 7479, 9648, 6205, 10779, 12023, 7377, -512, -6150, -2981, -2747, -1079, 5140, 7575, 4533, 1019, 7930, 18608, 22635, 19718, 15565, 9779, 13137, 10302, 11730, 12498, 2855, 3326, 4448, 4363, 5892, 13348, 16592, 10333, 10614, 9302, 9496, 16283, 18093, 15942, 13362, 9241, 8981, 9006, 4783, -2852, -9877, -7607]
10635g607K256J4796O223M370q728p947R91M441P92k495q565l750K639l2l582
10620f198j24O494K502J417P406K165r17k583n165K845P445J018J398O86j934
10605A6455K955r89k808J59k647M388K527q693p483n270K627P425o105K52J0178
10590A2971l60n059n24k041l417O58M81M018k664J188n695K088m119n708m642
10575a2825K405M76J2452N606O391j603r1k383k099N064O1l63n52J056R164O83
10559B3442l049j283l797r1J036N59r622p353N395L760k523p069n554J627O241
10544A719M132j531O31j846K84l139N076Q355p874L762n462j2660M092K388L06
10529a767k22N181l95n281o3K343Q42K770L512L359k459p049l203M957L573o163
$$ y = [-7607, -5351, 9445, 15668, 20038, 11310, 3363, 4354, 8795, 9587, 7092, -1473, -5223, -2584, -2616, -6198, -6322, 172, 2674, 4091, 11497, 13662, 12745, 10162, 4997, 7842, 15287, 16305, 17703, 18389, 16455, 19410, 18421, 15613, 15772, 13125, 17513, 20040, 11347, 3864, -1406, 1221, 8646, 2541, 2793, 12971, 12611, 7552, 7028, 4987, 1570, 2228, 2709, 6727, 4063, 5251, -444, 1644, -2475, -8183, -12825, -10420, -9944, 2508, 8114, 14505, 12902, 12811, 10428, 8329, 13393, 13454, 13091, 12539, 13595, 22759, 23442, 20393, 19110, 15313, 15222, 16258, 16817, 7195, -158, 5237, 8997, 6474, -595, -6149, -4522, 1719, 5851, 4320, 4951, 3105, 3389, 250, 5326, 13681, 5807, 9569, 4107, -8553, -4461, -2073, -1767, -1989, 3192, 2797, -2484, -2547, -204, 638, 3408, 6920, 10279, 7820, 771, -2432, 2525, 6098, -65]
10513f5k746l655j275L238Q466L100m948j821k899q690r1Q000L746K54l498J585
10497a299Q836j714j471N318j277k51o998M993J04n351L303L613J298O932n34
10482A5502k360n9k657j52j440L26N460J612k617q15N965J755p139j3470J164
10467A075K978N448M20k894k121M555k512N393k688m531j673N151n056j872k269
10452e96M363O422L551l383n279k817M533N253j113q45J85M719j577p567j911
10437C938L265p46j830J467R19k81P38K274j204m892p69J0498j740l248m626k53
10421C510l92j371Q35N173O384j041l440l523K125n8j897R309l677k187L690M116
10405A7556j698m87M767J32r70k21k24m338m521K673l755K440K274K800K122j316
$$ y = [-65, -2811, -6466, -7741, -4503, 3963, 7063, 2115, 294, -2605, -11295, -11386, -3386, 360, 614, -2884, -1299, 7537, 5823, 4352, 9670, 8393, 8142, 1144, 6137, 6241, 890, 4193, 7806, 9104, 16036, 15502, 13142, 13083, 10426, 10274, 8834, 9160, 14620, 16232, 13615, 12800, 18765, 20520, 13381, -89, 1075, 4053, 9501, 9921, 7027, 4906, 9461, 6949, 12342, 9654, 5123, 3450, 8601, 3545, 1673, -596, 3767, 10189, 13740, 10357, 5078, 2261, 6794, 12047, 10934, 10089, 10274, 14993, 13416, 5849, 3938, 7203, 6457, 4627, 6094, 7013, 6732, 7470, 9744, 8540, 3648, 2879, 13377, 11637, 8389, 3763, 3510, 3118, 1747, 2582, 7755, 14139, 13098, 9658, 6135, 8260, 8202, 6305, 15614, 11937, 9750, 13440, 17556, 15858, 15371, 20138, 20270, 19300, 19079, 18855, 14517, 9996, 12669, 8914, 11354, 13628, 16428, 18550, 17234]
10389A7234o360J660J977O649L422l442n079l734j019K254l786M786M336N91R80
10374B0469n458p102M735J879l66m53k840l813p187J689J794O693O389M7k658
10359A3818p060L411j161M463M828q066K455j9L600k501K750o892Q8o330L456
10344F840R202K352J1l094k101L524n60k803r247k515J078O178j369l512J524
10329E508k408m451K756M676m11l219O009O002N972J545r00j498P171J645j805
10314B6592k189n884l998m166o001P317M909Q3O196r476r587M655L046n698j383
10299D416k279N068l08M6l283m091J362k314j122M544P089j946L57N38o456J2982
10283A4603N025m706l121J504k694M758O694N496K371m828j0769m611Q344K028
$$ y = [17234, 10874, 12534, 14511, 21160, 24582, 21140, 16061, 12327, 11308, 13562, 9776, 14562, 18898, 19489, 20469, 15011, 7909, 12644, 14523, 14157, 13704, 10864, 7051, -136, 1553, 3347, 10040, 16429, 16476, 13818, 6758, 10169, 9008, 13471, 18299, 10233, 12688, 12669, 16269, 13768, 16518, 9626, 9714, 3384, 6840, 16042, 18394, 18405, 15311, 13210, 16734, 16174, 13371, 4124, 1609, 2687, 8865, 7496, 3984, 5508, 3100, -1351, 1405, 6081, 5670, 2451, 8460, 14462, 20434, 21979, 21079, 19581, 26752, 28397, 26592, 24403, 18519, 14521, 10355, 4354, 11671, 16580, 16663, 22859, 13383, 3796, 8451, 11497, 5799, 4416, 2137, 7205, 6897, 6943, 3660, -431, 931, -1383, -2505, 2039, 9128, 7182, 7539, 8077, 1621, 14603, 19628, 14922, 11801, 13305, 10611, 15369, 22063, 27559, 29930, 25102, 14333, 9722, 18066, 20094]
10269B0094l885O55R120K566l328J452l155k550L216N741K072j675p203j984J173
10254B2309J855o577k242N288K408j763k684k840K134L962J1101J1812J3311J6575
10240G4649J8617R598L186j861j247j2296j9236j7803j5234o744p715l653R53
10227B1214m717J004LM534P604k595K58Q718m845l182K432n977l176J644l34J971
10211B4556o219q219p044P590K248K354j859M795K95k907P548N245m511q048p878
10196G946j433K775o006o1J373J456J0567O009k555m67O911K190L131P757M220
10181D3813n861j0620O135K765p081n91j41j313l049r650K268K31M84j689K253
10166A7954j285N548q53n402k858k032l756J756L780K440l41r11L62l147p084
$$ y = [20094, 16209, 16864, 25984, 28550, 25222, 26674, 23519, 20969, 24185, 29926, 31998, 30323, 23120, 21136, 22309, 24164, 17587, 15345, 20633, 23041, 21278, 18594, 15754, 17888, 21850, 32951, 44763, 58074, 74649, 93266, 102864, 106050, 104189, 102942, 90646, 71410, 53607, 38373, 31629, 23914, 20261, 21214, 16497, 17501, 17504, 22038, 29642, 27047, 27305, 36023, 31178, 27996, 30428, 24451, 21275, 22919, 22585, 24556, 18337, 10118, 3074, 10664, 12912, 15266, 13407, 18202, 18497, 15590, 23138, 28383, 23872, 15824, 7946, 6513, 9288, 3282, 3221, 4594, 6050, 16617, 22626, 20071, 19604, 26515, 28705, 31836, 39593, 43813, 37952, 27332, 33467, 36232, 29151, 28560, 28419, 27106, 24057, 14407, 16675, 16906, 17390, 15701, 17954, 16669, 22217, 21364, 15962, 13104, 11072, 7316, 9072, 12852, 15292, 14951, 14040, 14402, 11255, 4171]
10151D171M823J884L718P166Q915j42n627q319k610J078O49j109n638Q421M130
10136B1510Q565K496P8M541K725J451q791o194l211O092p57q791j697j330J522
10121A8209l343P7r92K340K696N880j716R84l630M50K467J2421P813o730k534
10106C4392n752k98l19k748j531L524k972M47j681M157J995r55K806L562o91R33
10090C4869Q48k352n57M418l816j014K955O174P075j309k868k228Q33l403K106
10075D1731l341R155m93p684J610n560l692J0n625Q453l492M3p712r93L147M067
10059B9624j797k578N87J750K833L060O663k414n281l66O1J362k9k260O135L732
10043D1082l134J488P323n077p916n678Q455P330o805k325m149l792K606M246
$$ y = [4171, 8994, 10878, 14596, 21762, 30677, 30535, 24908, 16589, 13979, 15057, 15706, 14597, 8959, 17380, 21510, 30075, 32571, 32649, 37190, 39915, 41366, 32575, 26381, 23170, 29262, 28505, 19714, 18017, 16687, 18209, 14866, 14943, 13951, 16291, 18987, 24867, 23151, 24135, 20505, 20955, 23422, 35843, 43656, 36926, 34392, 28640, 28342, 28023, 25275, 23744, 27268, 24296, 24743, 23062, 27219, 29214, 28259, 31065, 34627, 33936, 34869, 35717, 33365, 32808, 37226, 33410, 32396, 35351, 41525, 48600, 47291, 44423, 42195, 43028, 39625, 41731, 38390, 47545, 47052, 39368, 40978, 35418, 31726, 31736, 26111, 34564, 31072, 31115, 23403, 22410, 25557, 29624, 27827, 25249, 25836, 27586, 30419, 33479, 40142, 37728, 32447, 32081, 32142, 33504, 33475, 31215, 37350, 41082, 37948, 39436, 46759, 41682, 33766, 28088, 36543, 43873, 37068, 34743, 30594, 26802, 29408, 33654]
10029C3654L346n197n818O21K285M268K222M062O975j82r48l896j0419L818J0334
10014D5125M791q613j0883m023O538O068K442q20o33l598O513o50J784J249K237
9999D7527R847R322m048n409k189m634j2030m26Q054m84m112L129Q45J580j193
9984D5779o571k352K008P776J145K40L439j32q160n410K675L286J287M684J1581
9969F1275J6569N456k392M174N238J4645K0834N898P198O067m95j824j103k364
9955A39176J093j4695r856j3875j4533j3337j0780l307R58n757n688L194M62m041
9941D9014J294J584O008m947o756O25l953l771Q756J0676j529Q14L819n927k255
9926E3452M957J853J892p080l250O76m805p549p90J536N675J1076k015m894M151
$$ y = [33654, 37000, 31803, 25985, 26606, 28891, 33159, 35381, 39443, 46418, 46236, 45288, 41392, 30973, 34791, 45125, 49916, 41303, 30420, 26397, 32935, 39003, 41445, 40625, 39992, 36394, 42907, 42257, 44041, 45290, 47527, 57374, 66696, 62648, 57239, 55050, 50416, 38386, 37960, 46014, 45530, 41418, 44547, 45392, 46972, 45779, 39208, 36856, 38864, 46640, 47785, 48025, 51464, 51332, 43172, 37762, 40437, 43723, 45010, 49694, 61275, 77844, 83300, 80908, 85082, 90320, 104965, 125799, 131697, 138895, 144962, 144467, 142643, 141540, 139176, 140269, 125574, 115718, 101843, 87310, 73973, 63193, 59886, 60844, 55087, 49399, 52593, 53055, 49014, 50308, 51892, 57900, 52953, 46197, 46822, 42869, 39098, 47854, 58530, 57001, 57815, 61634, 55707, 53452, 58409, 60262, 62154, 55074, 51824, 52500, 47695, 40146, 39356, 40892, 46567, 57643, 55628, 50734, 54885]
9911E4885P195M458j249r06k276m276m048J540L67o042Q213P067O504Q80L300
9896G5612o12p517n200M061Q26o284j179m133Q814M666L046k124j218M215j509
9881G1464o545m310K994N912L307l422k096L035R257J5102J0874L71L994K035
9867A11972K885j717k522M381m240J43N005J6912K1641J9501K8318K8317L5030
9854B65626L4809K6465K4171K2703J6701J6466K3594K9852M0133N2436P0818Q7524
9842G11298J16473J53601K21255L42623N45374R05538J554714K624384L746548
9833A0921808L909320K827906J421295j20178k313786m161350m015948k626637
9825E842430j450819q45653n44234l72369k80565k18477j74333j47270j28563
$$ y = [54885, 62080, 66538, 65289, 64383, 62107, 57831, 53783, 55323, 55690, 49648, 57861, 64928, 71432, 72312, 75612, 75000, 67483, 62283, 66344, 67170, 60886, 59707, 55574, 64388, 69054, 72100, 69976, 68758, 72973, 71464, 64919, 60609, 63603, 69515, 72822, 69400, 67304, 70339, 79596, 94698, 105572, 105943, 109937, 111972, 114857, 113140, 110618, 114999, 110759, 110902, 115907, 132819, 154460, 173961, 202279, 230596, 265626, 300435, 326900, 351071, 373774, 390475, 406941, 430535, 460387, 500520, 552956, 623774, 711298, 827771, 981372, 1202627, 1545250, 2090624, 2996162, 4550876, 7175260, 10921808, 14831128, 17659034, 19080329, 18960151, 16646365, 12485015, 8469067, 5842430, 4391611, 3545958, 3001724, 2629355, 2348790, 2130313, 1955980, 1808710, 1680147]
9816A680147j03964q0187o4309n3949l8460l6320l1949m0922m0393m3918o3065
9805A082711o6528n3707m3293l2526k6835k5492k7500k8470k7742j9893k4938
9794G05787j9255j6458j6526q100j2951j4789j5098j1263m223j1042r628j8457
9782E47997q474k848j4936j6705j5146j8151k2023j3897j1462j068j3972j5186
9770C94129q398o798j4803k242K692o731o999p155r625j3231l841N793O648p417
9756C22022j6363n704m235p955J797J042k590o921k350j3N775L999j061J861M657
9741B93961J0151J8727J1664R784K2040K4302L0283M5453N4949O8970R0126R9258
9729G79668J08868J18457J19677J06336Q8572N3489J4968k1328n5694q4726j01792
$$ y = [1680147, 1576183, 1495996, 1431687, 1377738, 1339278, 1302958, 1271009, 1230087, 1189694, 1145776, 1082711, 1016183, 962476, 919183, 886657, 859822, 834330, 806830, 778360, 750618, 730725, 705787, 686532, 670074, 653548, 645448, 632497, 617708, 602610, 591347, 587124, 576082, 566454, 547997, 539523, 536675, 521739, 505034, 489888, 471737, 449714, 435817, 424355, 423287, 409315, 394129, 385731, 378933, 364130, 361888, 364580, 357849, 350850, 343695, 334070, 320839, 316998, 322791, 329439, 322022, 305659, 299955, 295720, 287765, 289562, 290604, 288014, 281093, 278743, 278730, 284505, 288504, 287443, 289304, 293961, 304112, 322839, 334503, 344287, 366327, 390629, 420912, 466365, 521314, 590284, 680410, 779668, 888536, 1006993, 1126670, 1233006, 1321578, 1375067, 1390035, 1368707, 1313013, 1228287, 1126495]
9718A126495j12842j13002j15096r3505p3218n4256m2049l7691k7308j7094j185
9707D39249N255j069J240l199j1183j4679k2910k3407k6689k2901j7983j4730
9695B86994j7213j6687p440m289l674k357k993o932J178k743n600q605j147k696
9681B05796r276L670r10J72m359j379K40j9j1940q812p449p01j0048j1238m900
9666A38847m537j868J1787Q331n718r241O183Q676m711o469r06J063l862l367
9652A34208L689M650o300j0683m656J3K021N979k829q918j200m286J530l155K932
9637A12995M804K612N816L265K620K042l205q373m921J529r67K78M943M259L701
9622A31398j738k076l589N355J28m388j2289o611L869P467R30Q2M201K072n4k72
$$ y = [1126495, 1013653, 900651, 785555, 692050, 618832, 564576, 522527, 484836, 457528, 440434, 439249, 444504, 443435, 444675, 441476, 430293, 415614, 392704, 369297, 342608, 319707, 301724, 286994, 269781, 253094, 245654, 241365, 237691, 235334, 232341, 225409, 226587, 223844, 218244, 209639, 208492, 205796, 196520, 200190, 199280, 199452, 195093, 193714, 193954, 193935, 181995, 173183, 165734, 165033, 154985, 143747, 138847, 134310, 132442, 144229, 152560, 146842, 137601, 143784, 152460, 147749, 141280, 140374, 141437, 137575, 134208, 137897, 142547, 136247, 125564, 120908, 120921, 122942, 128921, 126092, 117174, 115974, 111688, 113218, 110063, 112995, 117799, 120411, 126227, 129492, 132112, 134154, 130949, 122576, 117655, 119184, 118217, 118495, 123438, 127697, 131398, 129660, 127584, 123995, 129350, 129478, 125090, 112801, 106190, 110059, 117526, 118456, 118538, 122739, 124811, 124757, 124485]
9606A24485O441l653m474p060K276L18M666N184L130l917k033P82k838l680O396
9591A26023J0884J1898J0277R820J6703J6161J0818J665M769J490o630n452M017
9578B12443J0881M675J2979J3720L273n008j627o475m271Q57L55j7838k5119k5749
9564A73096j4916P33N743O176O55M353m666Q77K413Q488N388l244r701p278k699
9549A65418K501p373q540q121o134l796m008J426m95L831l692n099l919r807m928
9534A07264J796O6J741P608k868l889r104q852q302o910J1O000M174P66q147o377
9518G4977Q810N259Q742P424P884L139k7029m6500k2716Q826K1978K0420K0184
9505I1398J5932K781j741j377j492m937n831P3K518j65K962P863Q390P507L563
$$ y = [124485, 130926, 127273, 122799, 115739, 118015, 118333, 122999, 128183, 131313, 127396, 125363, 126145, 123307, 119627, 126023, 136907, 148805, 159082, 168902, 185605, 201766, 212584, 214249, 219018, 220508, 213878, 208426, 212443, 223324, 227999, 240978, 254698, 257971, 252963, 251336, 244861, 240590, 241447, 241802, 223964, 198845, 173096, 158180, 158913, 164656, 170832, 171487, 175840, 171174, 172051, 174464, 182952, 188340, 185096, 175395, 168117, 165418, 167919, 160546, 152006, 143885, 137751, 133955, 129947, 131373, 130878, 134709, 131017, 125918, 121999, 112192, 107264, 109060, 109126, 110867, 118475, 115607, 111718, 102614, 93762, 85460, 78550, 78561, 84561, 88735, 89501, 81354, 74977, 83787, 89046, 97788, 105212, 113096, 116235, 89206, 42706, 19990, 28816, 50794, 71214, 91398, 107330, 110111, 108370, 106993, 105501, 100564, 94733, 94806, 97324, 97159, 100121, 107984, 116374, 123881, 127444]
9490A27444O703Q997M195o229r009j2533j1443p255k235j998o369l58K768M513
9476I7191O820K927Q991J3340K4216K1177K4050J1653P776K4008K8437K9441L4144
9463C34171N0956O1013P2604Q0333R5415J16951J49588J94910K20977K11079J55346
9452A743343J05877Q3150Q9908L6838l7831r4101j91552k67488k39137j77222
9442A051785j27528p9530m2403m1344l7116k5598j3879j1857j2808l88R002J5900
9430F84236J3427J2913J6899O675Q267R395Q834P115J1635J6400Q365J963J675
9417H07799n281j4305k1540j7897l064Q917k107K734O544J3433K7667K5376K5199
9404H53475K4403J7649J5722k121j2137q933q012m197R126J6469K7620M3626N4259
$$ y = [127444, 134147, 143144, 147339, 141110, 132101, 119568, 108125, 100870, 98635, 96637, 90268, 89910, 92678, 97191, 104011, 106938, 115929, 129269, 153485, 174662, 198712, 210365, 218141, 242149, 270586, 300027, 334171, 385127, 446140, 518744, 599077, 694492, 811443, 961031, 1155941, 1376918, 1587997, 1743343, 1849220, 1932370, 2022278, 2059116, 2021285, 1927184, 1735632, 1468144, 1229007, 1051785, 924257, 844727, 802324, 760980, 723864, 698266, 684387, 672530, 659722, 659334, 668336, 684236, 697663, 710576, 727475, 734150, 742417, 751812, 760646, 767761, 779396, 795796, 804161, 806124, 807799, 802518, 788213, 766673, 748776, 745712, 754629, 752522, 755256, 761800, 775233, 802900, 828276, 853475, 877878, 895527, 911249, 909128, 896991, 888058, 880046, 875849, 884975, 901444, 929064, 972690, 1026949]
9391A026949L9863M0781L8388K0090J2420N044k678k9298k4284k810M304J9225
9379A147994K8587J9222K5440K5565K4629J9431K3173K5518L8026N3750P3339
9368A504674Q2119J10821J16893J11180J05019J00184R7741J01548J10454J31647
9358B572280J41342J65540J96082K00915K43217K99767L43095L67158L92536M28647
9348E350579M72636N28569O06559P06342Q17291R76319J204514J475673J765453
9339A3903935K079403K427635K745045K997154L341895M052719N236467P132218
9331D3916471J0406331J5792116K4183390L6809016N2922218O2693479N1751415
9324B98474436K8028647R843872j3078897m9202664o6359165n3289523l5199375
$$ y = [1026949, 1066812, 1107593, 1145981, 1166071, 1178491, 1183535, 1180857, 1151559, 1127275, 1124465, 1128769, 1147994, 1176581, 1195803, 1221243, 1246808, 1271437, 1290868, 1314041, 1339559, 1377585, 1431335, 1504674, 1586793, 1697614, 1814507, 1925687, 2030706, 2130890, 2228631, 2330179, 2440633, 2572280, 2713622, 2879162, 3075244, 3276159, 3519376, 3819143, 4162238, 4529396, 4921932, 5350579, 5823215, 6351784, 6958343, 7664685, 8481976, 9458295, 10662809, 12138482, 13903935, 15983338, 18410973, 21156018, 24153172, 27495067, 31547786, 36784253, 43916471, 54322802, 70114918, 94298308, 131107324, 184029542, 246723021, 298474436, 326503083, 336346955, 323268058, 274065394, 207706229, 154416706, 119217331]
9317A19217331k2841263j5387814j0770991p745046n745700m486003l699463l195999
9309D5345052k919833k788624k692539k507376k200599j917495j684463j468879
9301B7165244j280999j138752j039047r51685q81084q18049p60863p22890o78320
9292A8893555o62217o43389o16601n81021n57654n53214n32564m84071m66732
9283A3796092m28676l87103l49852l27850l12134l11558l14265l18708l25092
9274A0720854l28157l10147l00443k72622k46550k24765k21590k09161k00508
9265H406911j90059j93083j93923j94640j81375j60293j36386j06852o8884l6352
9255F945064J906K3022L6739L4891J700o2756j30164j99094k71161k90612k84538
$$ y = [119217331, 96376068, 80988254, 70217263, 62472217, 56726517, 52240514, 48541051, 45345052, 42425219, 39636595, 36944056, 34436680, 32236081, 30318586, 28634123, 27165244, 25884245, 24745493, 23706446, 22754761, 21873677, 21055628, 20294765, 19571875, 18893555, 18231338, 17587949, 16971348, 16390327, 15832673, 15279459, 14746895, 14262824, 13796092, 13367416, 12980313, 12630461, 12302611, 11990477, 11678919, 11364654, 11045946, 10720854, 10392697, 10082550, 9782107, 9509485, 9262935, 9038170, 8816580, 8607419, 8406911, 8216852, 8023769, 7829846, 7635206, 7453831, 7293538, 7157152, 7050300, 6981416, 6945064, 6946970, 6969992, 7006731, 7041622, 7043322, 6980566, 6850402, 6651308, 6380147, 6089535, 5804997]
9244E804997k74041k38748k01998j64692j54609j44163j29278j20221j19202j14078
9234D143967j04060j00462q7922q0975q0475q2892p2200o7439o5663o3226o3058
9223C275595o2600n6633n1541n3431l9066k1298j5395r397j5557r192j3406k0324
9211B907755k2433j5279r607K564N160J1999K1995L3858P8467J48013K28996K56331
9199C647819K33575J90243J14570J4398n0551j12577j86103k32733k79097k94376
9189C045168k73898k17627j66917j13620q1195p4448o8613o2231n6483n0316n4546
9178A825274m8124l6433l5303l8346l6391l6785m0724l3284k3188k2064k5551
9167A449081l0470l3943l4581m0933l3803l0850l4734k5163k3324k1476j5815
$$ y = [5804997, 5530956, 5292208, 5090210, 4925518, 4770909, 4626746, 4497468, 4377247, 4258045, 4143967, 4039907, 3939445, 3851523, 3770548, 3690073, 3607181, 3534981, 3467542, 3401879, 3338653, 3275595, 3212995, 3156362, 3104821, 3051390, 3012324, 2991026, 2975631, 2966234, 2950677, 2941485, 2928079, 2907755, 2885322, 2870043, 2860436, 2863000, 2868160, 2880159, 2902154, 2936012, 3014479, 3162492, 3391488, 3647819, 3881394, 4071637, 4186207, 4200605, 4150054, 4037477, 3851374, 3618641, 3339544, 3045168, 2771270, 2553643, 2386726, 2273106, 2191911, 2117463, 2048850, 1986619, 1930136, 1879820, 1825274, 1777150, 1740717, 1705414, 1667068, 1630677, 1593892, 1553168, 1519884, 1496696, 1474632, 1449081, 1418611, 1384668, 1350087, 1309154, 1275351, 1244501, 1209767, 1184604, 1161280, 1139804, 1123989]
9156A123989j2079j0744r938q308j9194k0966k0168j6230j5364j7117j6085k4335
9144I33461j9428j2948j8409l09M215m269q804j5818l5320k8836j3770O35J065
9131G81465j0480k3647j4971p920j0578p554r096j0273j1207j2855j7030j7591
9119F28263j3846j3004j8052j9419j4502n138o769p041j0894j4931n049j3057
9107D86561j2279m469j0519j3244n006p421j0597j7626j4100j3058j1559l617
9095C63066j2133l86o089l515Q260O134k08N790QM422L58o926j0440n447l873
9080C39021l812r31j846m461m797j0213j896m257q034j953o15k842R25k167j1866
9065B80256j6278m817N67j0312j400K31L605J759m197m062n94n233l979r47M55
$$ y = [1123989, 1111910, 1101166, 1091228, 1082920, 1063726, 1042760, 1022592, 1006362, 990998, 973881, 957796, 933461, 914033, 901085, 882676, 882367, 886582, 882313, 873509, 857691, 822371, 793535, 779765, 780400, 781465, 770985, 747338, 732367, 724447, 713869, 706315, 697219, 686946, 675739, 662884, 645854, 628263, 614417, 601413, 583361, 563942, 549440, 544302, 537533, 530492, 519598, 504667, 499618, 486561, 474282, 469813, 459294, 446050, 441044, 433623, 423026, 405400, 391300, 378242, 366683, 363066, 350933, 350547, 344458, 340943, 349203, 355337, 355129, 360919, 360927, 365349, 365707, 358781, 348341, 342894, 339021, 335209, 334278, 332432, 327971, 323174, 312961, 311065, 306808, 298774, 296821, 296206, 293364, 294289, 292122, 280256, 263978, 259161, 259728, 249416, 248016, 248247, 251852, 253611, 249414, 245352, 244758, 239525, 235546, 234599, 235054]
9050B35054m417q033o548j4032k978N633k052n190l33L562p622j0359K139n23
9036A84301m020l604j612o835l04L71O522Q309k653j6493j4322n684L13o94r321
9021A34274k832k68L020K087j0466m310n846p352m029Q89J6701P009k6l925n420
9006A19506N8K78o896P967l75K81p007p397p226N870K940o535m826n568J851L651
8990I6572J107M202O370Q262Q600J1799Q292R783Q604l414k0744j1449n986r624
8976A12374n077m388l388o762O8p764n082L588L76M145n77J277K625j61M937J702
8960I7893m504k373K307K674O279K344J876j336L596M070Q475P087O263Q389Q635
8945A51675R153P929Q620J6149L3738L9383N2725Q6498J34864J76587J74755J08027
$$ y = [235054, 230637, 222604, 216056, 202024, 199046, 204679, 202627, 197437, 197104, 200666, 193044, 182685, 184824, 184301, 180281, 176677, 175065, 168230, 167926, 168297, 174819, 183128, 180475, 163982, 149660, 143976, 144289, 143595, 134274, 131442, 131174, 134194, 136281, 125815, 121505, 115659, 108307, 104278, 105167, 121868, 128877, 128851, 124926, 119506, 119564, 119842, 112946, 120913, 120538, 120819, 113812, 106415, 99189, 105059, 107999, 101464, 96638, 91070, 92921, 96572, 97679, 101881, 108251, 116513, 125113, 136912, 145204, 154987, 163591, 160177, 139433, 127984, 121998, 112374, 107297, 102909, 99521, 92759, 92827, 85063, 79981, 83569, 83945, 88090, 87513, 88790, 91415, 91254, 96191, 97893, 93389, 91016, 93323, 95997, 102276, 104620, 106496, 105160, 108756, 112826, 121301, 128388, 134651, 143040, 151675, 160828, 168757, 177377, 193526, 227264, 266647, 319372, 405870, 540734, 717321, 892076, 1000103]
8933A000103N5001M283r7750j65338j32177n3843K328M2077O7083R1878J12818
8922I26463J22285J12671R4657P0280L5008J143m3401p7247r1868j12092j18612
8911I19287j14161j03292r0933p3252n9382n3472m5450l7432k2106j8594k5015
8900B76198k7688j8132o002j2693j7428j1603q055o676j355o389p251l716j317
8887A47893o146l517l36k53m541l280J966l538k17r032n836p452j064J117j1277
8872I4487j1848r72Q00l126j3918m304m704K382N096O115O480O334k40l927o051
8857G2604r055O684J5438P574j492P068Q999P248K1144L5763M5644M9310M2041
8844C08970K2861M468j3024m9251n4666m1032k5814k2496k3755j5566p855R63
$$ y = [1000103, 1055104, 1059387, 961637, 796299, 664122, 610279, 612607, 654684, 721767, 813645, 926463, 1048748, 1161419, 1256076, 1326356, 1361364, 1362507, 1319106, 1241859, 1149991, 1037899, 919287, 805126, 701834, 610901, 537649, 478267, 424795, 379345, 341913, 319807, 301213, 276198, 248510, 230378, 224376, 211683, 194255, 182652, 174597, 167921, 166566, 160177, 152926, 149210, 147893, 141747, 138230, 137894, 137641, 133100, 129820, 131786, 128248, 128031, 118999, 113163, 105711, 104647, 105764, 94487, 82639, 81667, 82467, 79341, 65423, 61119, 56415, 58797, 63893, 70008, 76488, 82822, 82582, 78655, 72604, 63549, 70233, 85671, 93245, 91753, 98821, 107820, 115068, 136212, 171975, 217619, 266929, 308970, 331831, 336299, 323275, 274024, 219358, 178326, 152512, 130016, 106261, 90695, 82840, 83803]
8832H3803k598j278L92q265q921j1339n121L281K698j31k172N269M092L153M478
8817F7341P110k883m430l492l456J590l319L114P836k758m574p915j071O031K198
8802F1322j786l241R06J934k922m125R6L047j117J742N623m569j583K455O9N17
8786E8368j741m685j744p161o522m808l364K596k336J170k3J0130O377o160o549
8771C3548l546J051Q219j901p219L61N624N377K143O759L474l90L987m57P84J131
8755E8945L626K314L55j394n115o189p101o773M46J269l846l3O808L648p041q746
8739C1173n799M215L264J82J001K468l021j726L764O732M437J367j107l899n685
8724C7366M71M34k496L253K606J051R047J2574J0238N558O130J571o920j965R234
$$ y = [83803, 81205, 79927, 80319, 72054, 63133, 51794, 46673, 49954, 52652, 52521, 50349, 55618, 59710, 62863, 67341, 74451, 71568, 67138, 63646, 60190, 61780, 58461, 61575, 69411, 66653, 62079, 54164, 53093, 59124, 61322, 59536, 56295, 57201, 59135, 56213, 52088, 52184, 55231, 54114, 55856, 61479, 56910, 55327, 57782, 57851, 58368, 56627, 51942, 50198, 43037, 36515, 31707, 28343, 30939, 28603, 29773, 29750, 39880, 46257, 40097, 33548, 30002, 31053, 39272, 37371, 30152, 30513, 36137, 41514, 43657, 50416, 53890, 53500, 57487, 57030, 57814, 58945, 62571, 64885, 65240, 63846, 58731, 52542, 45441, 38668, 39114, 40383, 36537, 36504, 43312, 46960, 39919, 31173, 25374, 29589, 32853, 33035, 34036, 36504, 33483, 31757, 35521, 42253, 46690, 48057, 46950, 43051, 37366, 37837, 38271, 35775, 39028, 41634, 42685, 51732, 64306, 74544, 80102, 86232, 87803, 80883, 78918, 88152]
8709H8152k85L245q621q973l707j01m718o918j933J955N743k522k347m942j3690
8694D0338j807N794M750j872m520o138J546L565k160J576j310O521m29k200J971
8679D5625N86p43K192j66o59J204p47J936R278N868l05P364N473M710l719o1P029
8662H4865K74n038L682l416k662k437L48J0318J1619N689P6O610K775N024L122
8647A20849R155J5798J8449K6149K0889J7687K8717M2060L7790M8342Q5119J41090
8635F12094K36532L99218O76116J012521J039579N96396K62876K6050o81251j233150
8625B946981r48035n35384l02016j94788j32600q8788o3309n5094l6101k2174
8615E68692j9523j4338j7823k8147j6984o972q500j2886n899k697M507Q29M150
$$ y = [88152, 87867, 91112, 82491, 73518, 69811, 69710, 64992, 58074, 56141, 58096, 63839, 61317, 58970, 54028, 40338, 38531, 44325, 49075, 47203, 42683, 36545, 38091, 41656, 39496, 41072, 39762, 46283, 45854, 43654, 45625, 46211, 45468, 47660, 47494, 46835, 48039, 47292, 49228, 58506, 64374, 64069, 71433, 76906, 81616, 77897, 77836, 84865, 85139, 80101, 83783, 80367, 77705, 75268, 75616, 85934, 97553, 103242, 103318, 109928, 112703, 117727, 120849, 130004, 145802, 164251, 190400, 211289, 228976, 257693, 299753, 337543, 385885, 471004, 612094, 848626, 1247844, 1923960, 2936481, 3976060, 4572456, 4835332, 4861382, 4180131, 2946981, 1998946, 1463562, 1161546, 966758, 834158, 745370, 682061, 626967, 590866, 568692, 549169, 534831, 517008, 488861, 471877, 464905, 456405, 443519, 437620, 434923, 439430, 440259, 444409]
8602D44409P398K1034L8764L6071L6811L4050L9052N7218P0331R3301J58807K46343
8590A283589L96458O67620J164647J910044K189125J373683N90330K76108r74061
8581H877543k460815k081418j185258o69512m19926k81849j90757j44339j13478
8572A330191r6890p2148o4214n9903m6418m1995m2509n0116m4716l4701l0403
8561G46178j9142j7005j5629j7414j6464k884K2J630Q011K137L547R081K8498
8548G10566L4665N2104R7764J70055K82912M89926Q15974J041530P91399L50401
8538D837296J49023k81986j053219j125736o97840l92989k36511j54032j12052
8529I31954q4456n6512m1068l5700l2313k7200k9857l2834k8638k4386k6143k5460
$$ y = [444409, 451807, 472841, 511605, 547676, 584487, 618537, 657589, 714807, 785138, 878439, 1037246, 1283589, 1680047, 2347667, 3512314, 5422358, 7611483, 8985166, 9575496, 9851604, 8877543, 6416728, 4335310, 3150052, 2480540, 2060614, 1778765, 1588008, 1443669, 1330191, 1233301, 1161153, 1096939, 1037036, 990618, 948623, 906114, 855998, 811282, 776581, 746178, 727036, 710031, 694402, 676988, 660524, 657640, 657662, 659292, 667303, 669440, 672987, 682068, 710566, 745231, 797335, 895099, 1065154, 1348066, 1837992, 2653966, 3695496, 4486895, 4837296, 4986319, 4704333, 3651114, 2525378, 1827538, 1434549, 1198038, 1044006, 931954, 847498, 790986, 749918, 714218, 681905, 654705, 624848, 592014, 563376, 538990, 512847, 487387]
8517D87387k0081j5502p259j2061j6503j2991p302o490j2791j2755o407p799j2046
8504C37400o699n620q725l647k639p730o258p394r269j2437j1079q405l183l933
8490B40382j0340o733p756j4366J477n420N28l314p763m135J571n640n096P71
8476A74166o14o622l947k12n176j1580k788O12l433l647o9q754m726O754J1540
8461A41504R469O360L498L247j841r018O78l985p298l695k323o074n974m742m785
8446A15021k367p156k554n577j728J211K142n600l566j274O35p69m021l934j390
8431G9073M62M811k032o996O518M086n390p52j33j70m956K402j771J170J998L799
8415H2119L233L480k594K348j259J313L702p133p343L90M26n335l309o464j0906
$$ y = [487387, 467306, 451804, 444545, 432484, 415981, 402990, 395688, 389198, 376407, 363652, 357245, 349446, 337400, 330701, 325081, 316356, 312709, 310070, 302340, 296082, 288688, 279419, 266982, 255903, 247498, 244315, 240382, 230042, 223309, 215553, 201187, 202664, 197244, 197772, 194458, 186695, 182560, 184131, 178491, 173395, 174166, 173552, 166930, 162983, 162771, 157595, 146015, 143227, 143839, 140406, 136759, 136690, 127936, 123210, 129964, 141504, 150973, 157333, 160831, 164078, 162237, 153219, 153897, 149912, 142614, 138919, 136596, 130522, 124548, 119806, 115021, 112654, 105498, 102944, 97367, 95639, 96850, 98992, 93392, 89826, 88552, 89187, 88418, 84397, 80463, 79073, 79535, 84346, 82314, 75318, 81836, 85922, 80532, 79780, 79647, 79477, 74521, 76923, 75152, 76322, 78320, 82119, 85352, 88832, 86238, 88586, 87327, 88640, 92342, 85209, 77866, 78256, 78682, 73347, 70038, 63574, 52668]
8400E2668o749L56j482L7Q68Q23m90l666J291M210m407j409J900K040K337K849
8384E1176L095n364L490Q51j2086j250J285j814l531L698q127q852L007L468l84
8369B8662q387j062j700J194L523N980K775m40k91j258M340j256j01l976m372
8354B3631K547q44k237P061p27k127Q0J583l124j592M316R35L847M200m288n179
8338B8082M176l93j669n99m145l785N75p77q767l459J2611N723O007k966n591
8323B5023p519n230K566k634M179l497m091k293j430Q573R212J581j340J488N5
8308B4643l207j511O511k089l609o77j900k498k664L585O357K621J719k49j552
8293B5480n571l841l989L327K830L009k524q423l913L150J851N646J017q22M205
$$ y = [52668, 45919, 46275, 44793, 44830, 45698, 46521, 46031, 42365, 43656, 47866, 43459, 42050, 43950, 45990, 48327, 51176, 54271, 48907, 52397, 53248, 41162, 39912, 41197, 39383, 35852, 39550, 31423, 22571, 25578, 29046, 28662, 20275, 19213, 17513, 18707, 22230, 28210, 30985, 30545, 30254, 28996, 33336, 32080, 31979, 28003, 23631, 26178, 25334, 23097, 30158, 29431, 27304, 27384, 28967, 25843, 24251, 28567, 29502, 33349, 37549, 33261, 28082, 32258, 31865, 30196, 29597, 25452, 21667, 22242, 21465, 12698, 9239, 21850, 27573, 33580, 30614, 25023, 17504, 12274, 14840, 12206, 16385, 12888, 8797, 6504, 5074, 13647, 22859, 24440, 23100, 24588, 24643, 21436, 19925, 26436, 24347, 20738, 20061, 18161, 15663, 12999, 16584, 22941, 25562, 27281, 27032, 25480, 19909, 16068, 12079, 15406, 18236, 21245, 18721, 10298, 6385, 9535, 11386, 17032, 18049, 17227, 21432]
8278B1432P74o991j660N329Q009n43l007m012n753m322p61P96k020J060P506L81
8262A6218o576l231K825L030m253Q07N714p90j807n886m137K255P056M236J146
8247A6607n602n066o279K40K667P8m319J548L295M260l346N495R62j377M025J0319
8231B3507L086K730n207J990L234M367M125K522k541l939n273j766q60j0427o35
8216A4913q675m700J072l353q44M591J275N694k84l71M391n726m513n813J861
8201d82k6L087P651J051k342l910K084K611j748j840K647L328L869m108m417Q610
8185A6065l770L107J0475J1327J0849N052O473l387j3924n657j811q347p843K794
8171B1403L079k114M135p983m214J195k757q02n627m629M150K150j876m363q09
$$ y = [21432, 22206, 15215, 13555, 18884, 26893, 26350, 23343, 19331, 13578, 9256, 8495, 9291, 7271, 8331, 15837, 16218, 9642, 6411, 9236, 12266, 8013, 8820, 14534, 13744, 11937, 6051, 1914, 4169, 11225, 15461, 16607, 11005, 5939, -340, -100, 2567, 2645, -1674, -126, 3169, 7429, 4083, 9578, 10540, 9163, 13188, 23507, 26593, 29323, 24116, 26106, 29340, 33707, 37832, 40354, 37813, 33874, 28601, 26835, 25975, 15548, 14913, 6238, 1538, 2610, -743, -1587, 3004, 4279, 9973, 9689, 9318, 13709, 7983, 3470, -2343, -482, -508, 2579, 10230, 11281, 8939, 5029, 7113, 9724, 7976, 6136, 8783, 12111, 15980, 11872, 7455, 16065, 12295, 15402, 25877, 37204, 48053, 53105, 59578, 56191, 42267, 36610, 34799, 26452, 18609, 21403, 24482, 22368, 26503, 18520, 14306, 15501, 12744, 11942, 6315, 1686, 5836, 7986, 6110, 1747, 938]
8156I38o25M335P083P541k169P28l360n551k952K296J039l891M02p16Q309M601
8140A8008P420P143P201L717j204J088K547l149j2301n368p086q255L290J823
8126A4874o834j843O338N029k319l992J068j802r95l793j383j245j887n260J123
8111b921K368K110N587J403K527L330R42k771R12Q358n674m499l016J302K841
8096A2799O146J462L870K406m676q195L029O018j892o008N771j386l115K376j449
8081A7156k476p033L077K069j191N715J287r21J479p229j488O412L567j987l795
8066A4642j636n60j110j163m858Q22J781P184K518P45k363l505Q003K128q918
8051A3710p071J481Q476M978n252n625j562J10L323Q906L955k982K05k807n756
$$ y = [938, 313, 4648, 11731, 19272, 17103, 17831, 14471, 8920, 5968, 8264, 9303, 5412, 5814, 5098, 13407, 18008, 25428, 32571, 39772, 43489, 42285, 43373, 45920, 42771, 30470, 25102, 18016, 9761, 13051, 14874, 8040, 6197, 12535, 17564, 15245, 11253, 12321, 10519, 9524, 5731, 4348, 3103, 1216, -4044, -2921, -553, 1557, 7144, 8547, 11074, 14404, 15346, 12575, 13487, 21845, 16171, 11672, 8656, 9958, 12799, 18945, 20407, 24277, 26683, 22007, 13812, 16841, 22859, 20967, 14959, 20730, 19344, 16229, 18605, 17156, 14680, 7647, 10724, 12793, 11602, 17317, 18604, 17683, 19162, 11933, 10445, 16857, 20424, 18437, 14642, 13006, 12446, 11336, 10173, 5315, 6137, 7918, 15102, 17620, 18365, 16002, 12497, 20500, 22628, 13710, 6639, 8120, 16596, 21574, 16322, 10697, 9135, 9245, 12568, 21474, 25429, 22447, 22652, 19845, 14089]
8036A4089J787N45j525j110N6N766M657M029o382O94n51J066n691K691L480N948
8020B9549m113r63Q63p91k437J269m116N770p52n519M785J1616l306n960K747
8005B8642L302m356o892J937L90o663L809L973m0j546N37L233J237J735O493k405
7989C3386J24Q973N46L290N709M203n421j340P561P310r021n015j62M00K655m613
7973D8585j0596l110R04K892p33L114K90j0619k046Q201L696l383Q89k482r386
7958B6216l129r89k100P949N841o546j246j362J474Q677P316N21k574o143l728
7943C0177R350M120J764Q680k741J90M029J967m907n454j086L849p23l028j770
7928D4417N196o409j090M405k704l787l509k684n931m844N675O319m338J298j981
$$ y = [14089, 15876, 16421, 14896, 13786, 13842, 19608, 24265, 28294, 21912, 22606, 22055, 23121, 17430, 20121, 23601, 29549, 25436, 24473, 25336, 24545, 22108, 23377, 19261, 25031, 24279, 18760, 23545, 35161, 31855, 25895, 28642, 31944, 27588, 20696, 22633, 23023, 16360, 20169, 24142, 24102, 22556, 23093, 26326, 27563, 29298, 35791, 33386, 33510, 42483, 43029, 46319, 52028, 56231, 50810, 49470, 57031, 64341, 55320, 50305, 50143, 50543, 53198, 48585, 37989, 34879, 35783, 38675, 37942, 41056, 41346, 30727, 28681, 36882, 40578, 37195, 38084, 35602, 26216, 23087, 22098, 19998, 27947, 33788, 27242, 25996, 24634, 26108, 34785, 42101, 42622, 40048, 33905, 30177, 39527, 43647, 45411, 54091, 51350, 51540, 55569, 57536, 52629, 47175, 46089, 49938, 49215, 46187, 44417, 49613, 43204, 42114, 46519, 43815, 40028, 36519, 33835, 27904, 23060, 28735, 35054, 30716, 32014, 30033]
7913C0033K747K430j1378k670K56j768O608l892n807M113J0930L729k499q93r392
7898B2547J699K316j891k708l556L682M026j375k068M094n603k600j08O600K339
7883B7394K911J896r203p306l044p681N13K024O50M143K736K49O7J041m823j0030
7867A537m324N250L234O758N698j724K323%k349j203o4r831l365J662k420j992
7851h10M711R64l514M075n19P94j25L282l344m946l77J446j687K66l890L080Q449
7834G855O839o403k96N644P074n837p563j692O879J50r66l191Q65j663L674O24
7818A1993k791n872j018n87j1386M50J3349P396Q51p326k661J517j948n160m675
7803g868m529R50K99Q298R020J906j540m556J552L727k676l401j810K066J0496
$$ y = [30033, 32780, 35210, 23832, 21162, 21418, 19650, 26258, 22366, 16559, 20672, 31602, 35331, 32832, 31939, 22547, 24246, 26562, 24671, 21963, 18407, 22089, 26115, 24740, 22672, 26766, 21163, 18563, 18455, 25055, 27394, 30305, 32201, 22998, 15692, 12648, 4967, 5480, 7504, 8154, 12297, 15033, 15282, 15349, 16390, 11567, 1537, -2787, 2463, 5697, 12455, 18153, 16429, 18752, 18752, 16403, 15200, 15136, 5305, 1940, 3602, 1182, -810, 3901, 4865, 1351, 5426, 4907, 5701, 5576, 8858, 5514, 568, 191, 1637, -50, 216, -3674, -594, 7855, 14694, 8291, 7995, 13639, 20713, 14876, 7313, 5621, 12500, 12650, 11684, 8493, 9358, 7695, 11369, 11993, 9202, 3330, 2312, 1725, -9661, -9211, 4138, 11534, 12385, 5059, 2398, 3915, 1967, -3193, -7868, -12397, -11447, -11148, -2850, 6170, 8076, 6536, 1980, 3532, 7259, 4583, 1182, -628, 1438, 11934]
7788A1934K563K198k488k914p64l387o923J02N717J440q685K415M63N75p052l748
7772h554J001K151J412n086k301j39J1611K749j989L091m701Q22K185M9J560R81
7756D842j684j603m341M930K425o49N524J292K073J807o97q007m213M803O476
7741A2978l426q478l054M254K26O00j628j618n46l6Q378m787k420P276q54q019
7725a154m752J326L943J093j217K312j871L994K215p01l997j684l289o111O89
7710i204K995J511K583J276j194M05m248M488N360J131j842m415K89K209P197
7695H541p02K668n620k965m575j909K224k449N007M737K703J006k528K900k332
7680F706M06J220Q01q654m227J935j17j085N573N771J792J119R00o24j0594k293
$$ y = [11934, 14497, 16695, 14207, 11293, 10529, 7142, 219, 321, 6038, 7478, -1207, 1208, 1671, 2246, -4806, -8554, -7553, -5402, -3990, -9076, -11377, -11516, 95, 2844, 855, 3946, -755, 67, 2252, 2301, 3861, 4842, 3158, 1555, -2786, 2144, 4569, 3920, 9444, 10736, 12809, 14616, 13919, 5912, 1699, 6502, 12978, 9552, 1074, -1980, 2274, 2500, 3100, 1472, -146, -692, -728, 7650, 2863, 443, 7719, 6865, -1154, -5906, -4580, -637, 456, -761, 1551, -320, 3674, 5889, 5188, 1191, -493, -3782, -9893, -9204, -6209, -4698, -2115, -839, -2033, -1628, -5876, -1388, 3972, 5103, 3261, -1154, -865, 1344, 8541, 7839, 10507, 4887, 1922, -2653, -4562, -2338, -4787, 220, 4957, 7660, 8666, 6138, 9038, 6706, 7112, 8332, 9133, 479, -3748, -1813, -1930, -3015, 2558, 8329, 10121, 11240, 12140, 11516, 922, -1371]
7664a371L749p15L451L811n305l573R483k631q578L06O954k971m599M176M104
7649F291m02m620l556M682O512q406m405k722j340N215J1102N739o951L3J178
7634H350n416o968q352M120M856L676O948J37J15m147p369q660j813K186N131
7619g206Q742k759j726m372J539J731J06M772R309L798o252q807k465o528j235
7604a1353L221N879l647m630Q490r16m946N443N890N052n570l803k949L112J932
7589A205k227N42N119j166O2j46o775n432M99l74O92M831m033K63J768p98K900
7572c070M491M468l744p639k294R70K280J490l54n57L436k516N924m090k271J3172
7556I696J049j3668J47o22j483J304K64Q688O788L446n305r046J134J77q23M31
$$ y = [-1371, 2378, 1663, 5114, 8925, 3620, 47, 9530, 6899, -1679, -1373, 5581, 2610, -1989, 2187, 6291, 5889, 1269, -2287, 2395, 8907, 501, -3904, -6626, -7966, -2751, 8351, 14090, 7139, 7172, 8350, 2934, -4034, -12386, -8266, -3410, 266, 7214, 7351, 7466, 3319, -4050, -12710, -14523, -12337, -7206, 1536, -1223, -2949, -7321, -5782, -4051, -3945, 827, 10136, 13934, 7682, -1125, -3590, -10118, -11353, -8132, -2253, -5900, -10530, -2040, -2956, -7902, -2459, 3431, 8483, 2913, -890, -3839, -727, 1205, -1022, -480, 4639, 3473, 3535, 3389, -3386, -8818, -8319, -8693, -8001, -3170, -7203, -6940, -5172, -5970, -3070, 1421, 5889, 2145, -5494, -7788, -6818, -4538, -3048, -3402, -3959, -523, -3039, 2885, -1205, -3476, 9696, 10745, -2923, -2776, -3398, -4881, -3577, -3313, 5375, 12163, 15609, 10304, 1258, 2392, 2569, 1746, 2177]
7540B177k804l219j704J263N441L536j266k979l937n158P110q63J574J717L700
7525D588J671L493J986j35r829l065M492L79O59p319m208K542O76n841k992K158
7509a0745M739M77M576M113P50J536l750n643l00L257M55N023O986l217Q51J523
7493A0631n313k303j283K8n900l075M62L643N751n43j062N926k756k526j671n351
7477e342J350Ok574J348o60k277M576N145L116o96m166J49M416n999o256l314
7461a1178J273L950M342m28l191M914K383k098o030K776O183j307l558l542M955
7446e56M449L758J273m152k734m273L67j738j130P986Q61m548m405O859j13l823
7430a919l736K369j228Q86N644L47q784J870J0930r58j0920L093J2287K93K504
$$ y = [2177, -627, -3846, -5550, -4287, 1154, 4690, 3424, 445, -3492, -8650, -1540, -2403, -829, 888, 4588, 6259, 9752, 11738, 11603, 1774, -1291, 3201, 3580, 4239, -3080, -7288, -4746, -4070, -9911, -12903, -10745, -6006, -5529, -953, 3160, 3910, 5446, 1696, -3947, -4247, -990, -535, 4488, 11474, 8257, 9108, 10631, 5318, 3015, 1732, 1760, -4140, -7215, -6753, -3110, 2641, 2098, 1036, 6962, 4206, 1680, 9, -5342, -3992, -3986, -6560, -5212, -5872, -8149, -3573, 1572, 4688, 3992, -174, -25, 4391, -1608, -7864, -11178, -9905, -5955, -1613, -2041, -5232, -318, 2065, -33, -6063, -3287, 2896, 1589, -1969, -5511, -556, 3893, 7651, 8924, 4772, 2038, -2235, -1868, -3606, -4736, 3250, 4111, -437, -4842, 2017, 1904, -1919, -5655, -3286, -4514, -3628, 2016, 2363, -6421, -4551, 6379, 5421, -5499, -2406, 9881, 10174, 12678]
7415A2678M882n855o123k275l679n964o41J0274M711M19M977O07k059j442q632
7400A878p215J440M007m916J578J650K196L714O972n034J726L882l229k266k21
7385F162m953q53k301P23P793m44m253j622k315m40r82k421P261K097k284M305
7369E473O82n97K089J098k744N213r53m782k576k350q358n8K030k36N157J824
7353I12l450M733L64k591K410m024J602K959r326n016M49R359J574J822P49K087
7337D613k999p011l177J895m527n355J4343J1551Q24j231n533j887J098n22m747
7322b665m783L017M192N0M55r46l138k77P6n626n209r52O190P987J701j132M553
7305C493L984j401l539k470o91k482m606K778N19J667L3K773k003O161M728l830
$$ y = [12678, 17560, 11705, 5582, 3307, -372, -6336, -6977, 3297, 8008, 8427, 13404, 14011, 11952, 10510, 1878, -5337, -3897, 110, -4806, -3228, -1578, 618, 4332, 11304, 6270, 7996, 11878, 8649, 6383, 6162, 1209, 356, -1945, -1222, 6571, 6127, 1874, 252, -2063, -2503, -3485, -5906, 1355, 3452, 1168, 5473, 6155, 5558, 7647, 8745, 6001, 11214, 10261, 5479, 2903, 553, -7805, -7863, -5833, -6069, -912, 912, -2538, 2195, 2559, -32, 2378, -1646, -44, 2915, -6411, -11427, -10978, -1619, -45, 1777, 2526, 4613, 1614, -5397, -8574, -6679, -11206, -16561, -2218, 9333, 10157, 8926, 3393, 1506, 2604, 2082, -2665, -7448, -4431, -239, -189, 266, -680, -3818, -4095, -4019, -9645, -14854, -15806, -9616, -1629, 72, -1060, 3493, 7477, 6076, 2537, 67, -624, -3106, -7712, -4934, -4415, -2748, -2715, 58, -1945, 4216, 8944, 5114]
7289E114j32M021q611p748l778K051J61P415k07J978j989q632K016j844k060K826
7273i419J0383Q331Q75o461m962k26n224o267O16Q415J857M429J509l977m163
7258d284m364L418O541J920J720R493O561q752q828P83O24k430j895K159J974
7243D640l798j194n300O62R448K888p69p632p371K217q8j706l038J499L053L423
7227c066k700J338j068m392J623K496q14L527M395m586j309N32M089L913j123
7212B855Q47Q680l542p681pk408M74j643R4N216J577n96N45o897L7N520J0381
7195A3452K000n287m357n603j1081p824J0291P741m51L316K989l884J418j867
7181H53m636k366J673l649l654N166p161m196L621L787l969M269L338J651p59
$$ y = [5114, 4982, 9003, 392, -7356, -11134, -9083, -8922, -1507, -1714, 264, -1725, -10357, -8341, -10185, -12245, -9419, 964, 9295, 10170, 3709, -1253, -1479, -6703, -12970, -12354, -3939, -2082, 2347, 3856, -121, -4284, -8648, -5230, 1311, 3231, 4951, 14444, 21005, 12253, 3425, 4208, 4832, 2402, 507, 2666, 4640, 842, -352, -5652, -4990, 4458, 7346, 6577, -1055, -8426, -6209, -6297, -8003, -11041, -9542, -6489, -3066, -5766, -4428, -5496, -9888, -8265, -5769, -6583, -3056, 1339, -3247, -4556, -4024, 65, 3978, 2855, 3702, 12382, 8840, 1159, 1152, -1256, -782, -2425, -2331, 2885, 4462, 3866, 4411, -2486, -2449, 3071, 13452, 15452, 10165, 5808, 205, -10876, -18700, -8409, -668, -1119, 2197, 5186, 1302, 2720, 853, -3783, -6149, -4476, -8125, -11779, -6613, -13774, -17970, -14349, -10562, -14531, -10262, -6924, -5273, -6032]
7166f032k251n564l763q82M017j67L108M451M177N040M715K65j0771j225L084
7151a798J059q47pJ063o633n656M224O485J288K778k088l477m21L089K242K462
7135C763M861J043L142k429p642m1M826n102n933M08L147J517R34k022l300L978
7119A150O155l304m036l322j924J421j539M287N267J461K299m769l35k11m178
7104a578j473n979m247J924P878M591l917l013M504M033K53k874m692l621L655
7089d556n391j756j819K363K809M16L441J1390l758l166N505m801n040m439M715
7074d087L695O290n377n105j232K096O911k203l285J500j238j864m683j359k942
7059a2883R292P492l57M551j03j410K14m967o78m714m516N6K232L963k641J115
$$ y = [-6032, -8283, -13847, -17610, -18492, -14475, -14642, -11534, -7083, -2906, 2134, 6849, 7114, -3657, -4882, -1798, -739, -1586, -1593, -530, -7163, -12819, -8595, -2110, -822, 1956, -132, -3609, -4030, -941, 1301, 3763, 8624, 9667, 12809, 10380, 2738, 2697, 7523, 2421, -3512, -3104, 43, 1560, 2494, 472, -2828, 1150, 7305, 4001, -35, -3357, -5281, -3860, -5399, -1112, 4155, 5616, 7915, 3146, 2811, 2600, -1578, -3051, -9030, -13277, -11353, -3475, 1116, -2801, -5814, -1310, 2723, 2976, 102, -4590, -8211, -4556, -9947, -11703, -13522, -11159, -8350, -7934, -4493, 6897, 3139, -27, 5478, 677, -4363, -8802, -4087, -392, 5898, 521, -4584, -5816, -3720, 3191, 988, -2297, -797, -2035, -3899, -8582, -9941, -12883, -3591, 3901, 3544, 8095, 7992, 6582, 6796, 1829, 1151, -3563, -8079, -8023, -5791, -1828, -4469, -3354]
7043c354j661R22J705m082o25M061k015J224O145K886M140k438o677k523Q179
7028E887k95J428q07k245m851K737L686J111l28l165k899r75M053M36k602p821
7012f650o10k665l956L715j536R33L70M861N774j011M977O55J969K800k538m604
6996B484m104n10p27L896K869j74k018n032K575J346K529P351j412n059m418L591
6980C187k833p87k125r26k693O410L762l665K670j143L022j296k932K569J409
6965D629N030k310M485j610o674p827j358K154J01l967k082k117K166K998M315
6950b067L270m058p11l111K837R113n302m639J438M61L983n05K151K622o391k534
6934c443J332m153L528k775k353k161j024N568K521J817J690N179j410J442r589
$$ y = [-3354, -5015, -4093, -2388, -6470, -7095, -3034, -5049, -3825, 2320, 5206, 9346, 6908, 231, -2292, 5887, 5592, 7020, 6213, 3968, -883, 1854, 5540, 6651, 6323, 3158, 259, -716, 3337, 3773, 1171, -6650, -7260, -9925, -13881, -10166, -11702, -10769, -10399, -5538, 236, -775, 4202, 4857, 6826, 9626, 7088, 2484, -1620, -2130, -2857, 1039, 3908, 3734, 1716, -3316, -741, 605, 3134, 10485, 9073, 4014, -404, 3187, 354, -433, -2558, -3484, -6177, 233, 3995, 330, 3000, 1857, 4879, 3583, 651, 3220, 4629, 9659, 7349, 11834, 10224, 3550, -4277, -5635, -3481, -3380, -7347, -9429, -11546, -9380, -6382, -2067, 1203, -2855, -3566, -6677, -3840, 5273, -29, -4668, -3230, -2769, 1214, 709, 2860, 5482, -909, -3443, -2111, -6264, -2736, -5511, -7864, -10025, -11049, -5481, -2960, -1143, 547, 5726, 4316, 5758, -3831]
6919c831j0649L242q299o37J615m608R353N696R5K91M222P55O75M15P195M234
6903I764k530p543p628Lr039m80O048L059Q127M8J375M491m310l504P968L209
6887I058J802J114k676m181j421o464k933n099k960K162J267K850m82j838J020
6872h781o10r70q15L859k839j545l013N606m16O59M692K669L7k709K07m34l185
6855g588K976O501J381L70J974j796k084n765j457M072k942o089K408K584L438
6840b017K62m793m23l80N266j089k366M14k393M291J775m27n819M774N04l435
6824e856K282O460N296p52l993L930j894P21k22J147k548l002n559j893Q780R60
6808C857k900l566n273J713n47k798p35k489P80J0399N978r46K507L504k248l553
$$ y = [-3831, -14480, -11238, -19537, -20174, -18559, -23167, -13814, -8118, -8023, -7732, -3510, -2755, -2080, -1665, 5530, 9764, 7234, -309, -7937, -7934, -16973, -17453, -11405, -8346, -219, -171, 1204, 5695, 1385, -2119, 5849, 9058, 10860, 11974, 9298, 5117, 3696, -2768, -5701, -10800, -13760, -11598, -10331, -7481, -7963, -9801, -8781, -9391, -10361, -11176, -7317, -10156, -11701, -14714, -9108, -9524, -8865, -4173, -1504, -1467, -4176, -3969, -4403, -7588, -4612, 1889, 3270, 3640, 5614, 3818, 1734, -4031, -5488, -1416, -4358, -10447, -8039, -5455, -2017, -1755, -6548, -6971, -7351, -2085, -3174, -5540, -5126, -7519, -3228, -1453, -1880, -7699, -2925, -2421, -5856, -3574, 2886, 8182, 7430, 3437, 7367, 5473, 6194, 5972, 7119, 4571, 1569, -3990, -5883, 2897, 3857, 957, -2609, -7882, -6169, -6716, -9514, -10249, -12738, -11958, -1559, 4419, 3473, 5980, 9484, 7236, 3683]
6792C683o906k736N924j37p748M77r72O010N669j254k889R40m579L736Q237l091
6776D364l969n572N63R55K624L518j523l824k307m185j419L387O979J173l246
6761b482K587J351K721k314J462r06m481N847n92m55P789p70j625O475l50M921
6745A9178K775j810r312L36O30J747m778N44L548J0624O54k323N459l260O218
6730C0230J085o854k940N99J551j677M685P332J9867O600L073J4332J3687K3039
6716A14609L6666M7103P7692R0663P6952L8824J1884k3100p9087j06629p7598
6705B07979n0945k7978k6336k9782j2630q329m118K631M22m835l871L292j657
6692D3843M58P2q4K556k363p699K971l376m004l021j430k6o158k536k7L687K628
$$ y = [3683, -3223, -5959, -35, -172, -7920, -7443, -8415, -2405, 3264, 2010, -879, 61, -4518, -782, 7455, 4364, 395, -5177, -4614, -3659, -1035, 2483, 960, -2864, -5171, -9356, -10775, -7388, -409, 764, -2482, 105, 1456, 4177, 1863, 3325, 2419, -2062, 3785, 3193, 2738, 10527, 9757, 8132, 14607, 14257, 19178, 21953, 20143, 10831, 11167, 11797, 13544, 8766, 9310, 12858, 23482, 24136, 21813, 27272, 24012, 30230, 31315, 24461, 21521, 22120, 23671, 21994, 26679, 34011, 53878, 60478, 63551, 77883, 91570, 114609, 151275, 198378, 276070, 366733, 443685, 482509, 494393, 471293, 392206, 285577, 207979, 157034, 129056, 102720, 72938, 60308, 51979, 47861, 50492, 50914, 46079, 42208, 45500, 43843, 44301, 44373, 44289, 46845, 44482, 36783, 39754, 36378, 32374, 29353, 27923, 27897, 21739, 19203, 19176, 22863, 25491]
6675B5491m669j288M091N917j219r731k045J072K359K524J820J15j193p196q456
6660G592l232O700M363j380m013j985J780Q72M5K914j280o773l211K803K600o297
6644A498l027m583P531K778m268p580R32J215Q319J30L02P376L871k691n660K49
6628F392J443L969J133l156n696n251M76M986M972k828l58l283J706O899O464
6613A7868l896l957r29o894n977P24O972k830k608l909K626k911K172k540k950
6598i039k271N435O628o445o511m528K821L140L555M749m24k400k386k94Q247
6583B77p81k906J774K086J741n089O72j511k982K829K001l24O235N247j845j726
6567E698j676k95k907m834J348J292M256L250k737K785J323N21M168l92j0326
$$ y = [25491, 20822, 19534, 23625, 29542, 28323, 18592, 16547, 17619, 19978, 22502, 24322, 24437, 23244, 16048, 7592, 4360, 11060, 15423, 14043, 10030, 8045, 9825, 10697, 10742, 13656, 12376, 5603, 2392, 5195, 7795, 1498, -1529, -6112, 1419, 4197, -71, -7651, -6719, -5504, 2815, 2945, 3247, 10623, 14494, 11803, 6143, 6392, 7835, 11804, 12937, 9781, 4085, -1166, -690, 4296, 9268, 6440, 6082, 2799, 4505, 11404, 17868, 13972, 10015, 9086, 2192, -3785, -3061, 3911, 1081, -1527, -5436, -2810, -5721, -3549, -6089, -9039, -11310, -5875, 753, -5692, -12203, -16731, -13910, -10770, -7215, -2466, -2890, -5290, -7676, -7970, 277, -504, -3410, -1636, 450, 2191, -2898, -2226, -3737, -6719, -3890, -1889, -2213, 4022, 9269, 7424, 5698, 4022, 3727, 820, -4014, -2666, -1374, 2882, 6132, 3395, 6180, 7503, 8024, 12192, 11800, 1474]
6552A474q634j374L735R059j457M29k814l289J339j39L660J430L1k06K185m607
6536H22k179J0033M406k756l05j835r61K395n070m556J083j534j998N152Q06j351
6520B152p597K581K763m6o764j091L468K561O177M421L017n602n034K65n587o731
6504a1047j434L397O363L119J239m879j60N584k637m577M20j179O962M574k173
6489C572l910l573J86l516l35L237m167m989K574J1542N98r213q09o089l136P178
6473a0850J905K407J720n871N00J30k283j60m340l361R191O358M612P758M799
6458A2515n825q777q01K177j695n79N68k467k904N5k628J045l32O896K417m272
6442d607J440L121J438n66Q503m920o032l134n920K463P528r90k271k491J064
$$ y = [1474, -7160, -8534, -4799, 4260, 2803, 3232, 418, -2871, -1532, -1671, 1989, 3419, 3450, 3244, 5429, 822, -1357, 8676, 13082, 10326, 10021, 8186, 7225, 9620, 4550, -6, 1077, -457, -2455, 2697, 3503, 2152, -5445, -2864, -101, -147, -6911, -8002, -4534, -1973, 4204, 8625, 11642, 6040, 1006, 1271, -4316, -11047, -12481, -9084, -2721, 398, 1637, -3242, -3402, 2182, -455, -5032, -4612, -5791, 1171, 5745, 3572, -338, -3911, -3725, -7241, -7576, -4339, -8506, -13495, -10921, 621, 1219, -7994, -8803, -14892, -18028, -10850, -8945, -6538, -4818, -10689, -10189, -10059, -12342, -12502, -16842, -20203, -11012, -4654, -42, 7716, 12515, 6690, -2087, -2888, -711, -2406, -2985, -2417, -4884, -7788, -7733, -10361, -9316, -9648, -2752, -335, -4607, -3167, -46, 1392, 826, 9329, 4409, -1623, -4757, -10677, -8214, -686, -1676, -3947, -6438, -5374]
6427e374L95o788L244M054L293M106L583l349o096p91J128Q92k353m662L687l666
6411h697l626L19M330o54L876J79K514J09l94j038J356K026K010m7O297J255n431
6394D384J149J683m035k347k719M53o612j997J0304J0013P03l842o196k71l699
6379c029k993K847N685O483K683m99j81l900n137o59j058j030j210L234J582K384
6363E202m341o257L790K135J767o039P344N485p975p504l558q99P617R111j13
6348E765n81o18R4k616o895j957O285K449M254p83rj987j816n93k381p509M505
6331d393M389r80m723j1534O46O213N961J1581o797k818N367o66p58p59o006j327
6315f604l081J91Q154l630K738Q14J082k700l675J999L962J104J154l752L035
$$ y = [-5374, -4979, -11767, -8523, -4469, -1176, 2930, 6513, 3164, -2932, -3723, -2595, -1703, -4056, -8718, -5031, -8697, -12323, -12004, -7674, -8328, -4452, -4273, -1759, -1650, -2044, -3082, -1726, 300, 2310, 2263, 8560, 9815, 4384, 5533, 7216, 3181, 834, -1885, -1432, -8044, -10041, 263, 10276, 10979, 7137, 941, 670, -3029, -6022, -3175, 2510, 8993, 11676, 11177, 10996, 7096, 1959, 1300, 242, -788, -1998, 1236, 2818, 5202, 861, -5396, -1606, 529, 2296, -3743, 3601, 9086, 1111, -6393, -9951, -10850, -3233, 5878, 5765, 5184, 4566, 4660, 2044, -4851, -6808, -523, 1926, 6180, 5397, 5388, 3401, 1585, 992, -1389, -8898, -4393, -4, -984, -5707, -17241, -16595, -10382, -4421, 7160, 363, -2455, 2912, 2246, 1488, 729, -5277, -6604, -9685, -9494, -1340, -4970, -2232, -1418, -336, -3036, -6711, -4712, -750, 354, 1508, -2244, 791]
6300G91K115n018L534N074j284k599l509L293L055K949l126o041p771l500J523
6285a0514N521k089N271N639L925m359M22N532m222K653j974n081j917l088M06
6270c875J1790M227m647j168J13k950K480j742o384l70L29K783M232r567o118
6255a0867M898Q428j392m145m293o203K078q02L658K389M59k689O927l082m409
6240i045M417R660M956m526j395n128J218K340L517k023n521l151K652K085p594
6225g538q33M215k77r9l763m687K844M479p66L092J778J600J581r25r22M741L920
6208H440k332m831l904o433p99N99K590j034L161L03R90M589J961m365k501L503
6192f3M990p224p280M897O909N34r72o773k069M949J874l68Q385J916k906p163
$$ y = [791, 2906, -2112, 1422, 6496, 5212, 2613, -896, 2397, 5452, 8401, 5275, -766, -8537, -12037, -10514, -4993, -7082, -1811, 3828, 7753, 3394, 3816, 9348, 5126, 7779, 5805, 724, -1193, -4281, -3875, 7915, 12142, 7495, 6327, 6440, 3490, 5970, 4228, -2156, -2526, -2197, 586, 4818, -4749, -10867, -5969, 2459, 1067, -3078, -7371, -13574, -11496, -12298, -8640, -6251, -5792, -8481, -1554, -4636, -9045, -4628, 5032, 9988, 5462, 4067, -1061, 157, 2497, 6014, 3991, -1530, -4681, -2029, 56, -7538, -8371, -4156, -4433, -4532, -8295, -12982, -10138, -5659, -6425, -3333, -1555, 45, 1626, 701, -221, 4520, 8440, 6108, 1277, -2627, -9060, -9859, -9260, -6670, -7704, -4543, -4240, -3250, 1339, 3300, -1065, -3566, -63, 4927, -2297, -9577, -4680, 2229, 2763, 1791, -4982, -7051, -2102, -228, -596, 7789, 9705, 6799, -364]
6176c64k373L146N212l536r89k992j1756k958J2697K891l483j573L429N267K591
6161E209l827j226R79o743l286O032N965J395n371j700KJ503j856m160L631L228
6145b25L016k885k419n135l831l80M96K56L422K647K487K159K213J234M158n399
6129A814m902n17M539l724k157p69r08n331J563Q636L363K301j44l088m794J344
6113b774j046M943l399k992j860m616j560J401M155P003J1589J303o656m911n291
6098d711n281K130j997P528L781r90k829l144O851K681K409K424L640r50p035
6083D507l866J419L182P62l082j036r92L346j686R41j806k074L79P12k135n21
6067a950k244l220M542O453m924m258M446n091n30M149k287Q93m388j111R008
$$ y = [-364, -2737, 409, 5621, 2085, 1096, -1896, -13652, -16610, -3913, -1022, -4505, -6078, -2649, 2618, 5209, 1382, 156, 1135, -5608, -8894, -2862, 3103, 4498, -873, -2573, -2571, -1068, -2924, -7084, -3453, -225, 2791, -94, -2513, -7648, -11479, -11859, -11363, -11107, -7685, -5038, -2551, -392, 1821, 3055, 7213, 1814, -3088, -3605, 934, -2790, -4947, -5716, -6624, -11955, -10392, -1756, 1607, 3908, 3764, 676, -4118, -2774, -3820, 1123, -2276, -5268, -7128, -11744, -13304, -11903, -7748, -745, 10844, 12147, 5491, 580, -4711, -9992, -7862, -9859, -2331, 1450, 460, -2369, -5513, 1338, 4019, 6428, 8852, 12492, 11542, 4507, 641, 2060, 5242, 6004, 2922, 1886, 894, 4240, 2554, 3495, 1689, -385, -6, 706, -1429, -1950, -4194, -7414, -2872, 3581, -1343, -5601, -1155, -6246, -6776, -2627, -4914, -4021, -8409, -9520, -512]
6052e12k701n526L357K952j74O805Q40Q90J384j075k456j1462N898J864j597j565
6036c078K364k846o697J702J3282j146l348J195J381J311J641J339k991j038K064
6021E135Q56m537k639l259N73n88P102l814K848K257q953L936l871M78m584K842
6005f218j014J403p848J94j29k034P733J0355p019Q27N539m998n304N898M183
5990A568K447r5j772m480k928l718J051K553R698K740o759o129J391K789P111
5975E467K414k576p560q462O383P88K681J008K365p965j706p86P719J035m520
5960c715j453n329L022N246R358k056p340l731l179K272N034o27p789M137L220
5945b930j129M663M056J52j074O3L0L263O15J75j248l037J476j806j675N601o15
$$ y = [-512, -3213, -8739, -5382, -2430, -2604, 4201, 5041, 5931, 7315, 6240, 3784, -7678, -1780, 84, -1513, -3078, -714, -3560, -10257, -8555, 4727, 3581, 233, 1428, 2809, 4120, 5761, 7100, 4109, 3071, 5135, 5991, 1454, -1185, -4444, -3871, -4459, 2643, -1171, 1677, 3934, -5019, -1083, -4954, -4476, -9060, -6218, -7232, -5829, -13677, -13483, -13612, -15646, -7913, 2442, -4577, -3750, 1789, -3209, -8513, -2615, 1568, 4015, 3920, 2148, -2332, -5260, -8978, -7927, -5374, 4324, 7064, 305, -5824, -4433, -1644, 5467, 7881, 5305, -2255, -10717, -4334, -3546, -865, 143, 2508, -5457, -7163, -7949, -230, 805, -3715, -5168, -10497, -7475, -2229, 7129, 5073, -2267, -5998, -9177, -6905, -1871, -2498, -10287, -6150, -2930, -4059, 604, 4660, 4812, 3738, 3801, 3831, 7094, 7709, 7884, 6636, 3599, 5075, 3269, 1594, 7195, 6580]
5928F580o859m100k270k126O27K281O286K402j1234m385M521P957M946L988J016
5913I630j1801p948l590O84M918J251M428P80m99m135m302j081K00m115M194L846
5897g540L414j50q782j983r65M8K025j64M18Q870J5282N939j2190j0488P08J320
5881d238N124R13m034m245M29O403P394j268q955j814O438j217O43K673J709n744
5865B11o924k137R777j0405q212n90r10M029Q859P545J309K753N842k948n073
5850C126R357j585j0856K154k88J160J502l311J1987N947o015p992n958r278m104
5835a4154P013P385L868q143M821L828n548l336J019n72L805O406k976n720M682
5820B378r36K655o434m594L750P74j7j768M500n97p02M482k027p280K305K634
$$ y = [6580, -279, -4379, -6649, -8775, -8148, -5867, 419, 2821, -8413, -12798, -8277, -320, 4626, 8614, 9630, -2171, -10119, -13709, -13025, -8107, -6856, -2428, -1648, -2147, -6282, -10584, -11665, -11465, -15580, -11386, -7540, -4126, -4276, -13058, -15041, -16006, -15958, -13933, -14097, -13679, -4809, 10473, 16412, 4222, -6266, -5558, -4238, 886, 1799, -2235, -6480, -6051, 352, 7746, 6478, -2477, -4291, 2147, 930, 1573, 4246, 5955, 211, -6713, -8850, 927, -9478, -17690, -18280, -19190, -15161, -6302, 1243, 2552, 5305, 11147, 8199, 3126, 12483, 10898, 42, 2196, 1908, 3068, 4570, 1259, 13246, 19193, 13178, 5186, -772, -10050, -14154, -7141, 244, 4112, -4031, 790, 4618, -930, -4266, -3247, -3819, -14, 6392, 3416, -2304, 2378, 1442, 4097, -2337, -6931, -3181, -2407, -2424, -4192, 308, -289, -991, 3491, 1464, -5816, -3511, -877]
5804h77J679l11l745M563m88l891p327L293L71J935K741l005l48L150J459K918
5788B117l183N129M647k268m312l867k048J922J656k238p658k89m089N132Q773
5773e76L424J628k330k89P11J575K693m212m254j615j96J334n757P420M675R73
5757E204L247l818r47j358j192J1067O348m197p888j1366J822l64n266l35K603
5742f440L603M423M577m288j805l380K344Q331m589l846l790M945L207p909o280
5727a0897M987K110j336J264M13J556l867J031J936k55N35l436n274k696l391
5712a7320n73K468P501J602N828J060m285J45L053J071m853n19J462R37j228j916
5696e567M859k722m719M237N191P589K493J150j954l527m902o475l36J138k528
$$ y = [-877, 802, 491, -3254, 1309, 821, -3070, -10397, -7104, -6733, -4798, -2057, -5062, -5410, -2260, -801, 2117, -1066, 4063, 8710, 6442, 2130, -1737, -3785, -1863, -207, -2445, -10103, -10392, -14481, -9349, -576, 2848, 4476, 2146, 1857, 2568, 4143, 6836, 2624, -1630, -3245, -3441, -2107, -7864, -444, 4231, 5204, 8451, 4633, 3686, 2328, 1136, 12203, 18551, 14354, 6466, -4900, -3078, -3442, -8708, -9043, -6440, -2837, 1586, 6163, 1875, 70, -3310, -966, 7365, 2776, -1070, -4860, 85, 3292, -4617, -10897, -5910, -3800, -5136, -3872, -3459, -1903, -5770, -4739, -2803, -3058, -2523, -5959, -11233, -13929, -17320, -17893, -15425, -7924, -6322, -494, 566, -3719, -3574, -521, 550, -4303, -4822, -3360, -2423, -3651, -5567, -708, -3430, -8149, -3912, 1279, 8868, 11361, 12511, 10557, 7030, 2128, -4347, -4683, -3545, -6073]
5681f073q417N64M838J937j49J491l994j863J362R88K815N53R121M314k092j873
5665C522K211m01j0003q424N140L820j483n088l608K355k799M171J905k405L377
5650g710J718j654L281j204j686l13k501j784J927J1053L426r74o893J112K645
5635D43J801J378K18l51K629n303m282k831j943K457L986N48m674k923J519P217
5619a11K398M46L559n337J219K293O63m819k549o570k397L825m6QK655m26m276
5602i465K713L380m200k251O107P527J404L199M738j277m407j888M449N913M032
5587A9974j305O801k933r392j0543m186l416m696j217J2451J230m904o355j6K569
5572e938l351l973M850M350K795l103o666p3N167J0662R675o037q268o862m492
$$ y = [-6073, -14490, -13926, -9088, -7151, -7300, -5809, -9803, -11666, -10304, -9316, -6501, -5948, 3173, 7487, 5395, 3522, 5733, 5332, -4671, -13095, -7955, -4135, -5618, -10706, -14314, -11959, -14758, -10587, -8682, -11087, -7710, -5992, -7646, -4365, -5569, -7255, -7568, -10069, -11853, -9926, 1127, 4553, 3579, -3314, -2202, 443, 2244, 3622, 3840, 3489, 6118, 815, -3467, -6298, -8241, -5784, -1798, -1250, -5924, -8847, -7328, -111, 2287, 2733, 6292, 955, 2174, 4467, 5130, 311, -2238, -8808, -11205, -7380, -7426, -7418, -4763, -5189, -9465, -6752, -3372, -7572, -9823, -3716, 3811, 5215, 8414, 13152, 11875, 7468, 5580, 10029, 15942, 19974, 18669, 25470, 22537, 13145, 2602, -1584, -5000, -9696, -10913, 1538, 2768, -2136, -8491, -8507, -5938, -9289, -13262, -8412, -4062, -1267, -4370, -11036, -11109, -5942, 4720, 14395, 8358, 90, -6772, -11264]
5557a1264M957J1093L744o656m952j315N51L474m72k934L778M786L419n234K568
5542E543K392K253m809l973J79L507n220n442K300M739Q27m013J829k321J424
5527g85r70K657O208P272m203n347k719k096q065J4K490K616J278m077M749N85
5511c93n121l923K801N03k903j214J08O01N702Q716O490J568K022r94o50n491
5495G822l534j560l234j921J496l389n897N660M865J608P048N87m812n526m621
5480e408J868L028L297P355k545l633k155L941K008o170k813L278j610m06m313
5465d278k746L506N716N365L391P858J181k81r363p350l906m61P430j35j411O69
5449E185o336J572O657R068j707j0264n878o250P434K761m504J91j015N830l418
$$ y = [-11264, -6307, 4786, 8530, 1874, -3078, -4393, -3842, -368, -840, -3774, 4, 4790, 8209, 2975, 5543, 7935, 10188, 5379, 1406, 1585, 5092, -128, -5570, -3270, 1469, 2296, -1717, 112, -2209, -785, -1755, 902, 7110, 14382, 10179, 4832, 2113, 17, -8048, -8034, -5544, -2928, -1650, -5727, -978, -393, -5514, -9437, -6636, -6133, -9036, -10250, -10142, -9541, -3839, 4877, 11367, 12935, 14957, 13963, 13313, 7822, 4288, 2728, -506, -2427, -931, -4320, -10217, -4557, 308, 1916, 8964, 9551, 4739, -787, -5408, -3540, -512, 2785, 10140, 7595, 3962, 1807, 5748, 7756, 1586, -1227, 2051, 441, 35, -4278, -7024, -3518, 2198, 7563, 10954, 18812, 19993, 19712, 10349, 2999, -907, -1368, 6062, 5927, 4516, 5185, -1151, 421, 7078, 16146, 14439, 4175, -1703, -7953, -519, 2242, -2262, -2071, -3086, 2744, -674]
5434f74O902J2710j740r262p565n334K464M963l142n23k943L30N13Q773M402r548
5418C26k36M806O574r27j5431j0235L668K605k121Q91N439Q42K83j386O04O321
5402B023R05M515k129j871K282P299j945m068k225J10n725n732j473R01J906M387
5386h40l971J273N335k208j1954p26O824N297M35p049l942K269k29M259K792l610
5370f045l543K319m15M396Q863j481j0683j442P858K963k558q053M16m905o602
5355a8912N337J2372J2945m43j811l364q225k555K394j486l871L434J2209O0m630
5340C454m365m437k190K470k720m873N960J88l581J907J635N509k279k243N780
5325B15p413L847K670K7r93r33o201j562k09K394M55O031K391j224q907J619Q894
$$ y = [-674, 6228, 18938, 17198, 7936, 371, -4963, -2499, 2464, -678, -1201, -4144, -3814, -3301, 5472, 9874, 326, 90, 4896, 11470, 10543, -4888, -15123, -11455, -8850, -10971, -10080, -4641, -3799, -3516, -4902, -4298, 2023, 2928, 7443, 5314, 3443, 5725, 13024, 11079, 7011, 4786, 4896, -829, -6561, -8034, -7133, -5227, -840, -4811, -3538, 1797, -411, -12365, -13091, -6267, -970, -535, -7584, -11526, -9257, -9486, -5227, -2435, -6045, -9588, -7269, -7684, -3288, 5575, 4094, -6589, -8031, -173, 2790, 232, -7821, -7405, -12310, -18912, -13575, -1203, 11742, 11299, 9488, 6124, -2101, -4656, -2262, -3748, -7619, -4185, 8024, 8084, 3454, -911, -5348, -7538, -5068, -7788, -12661, -6701, -6513, -10094, -8187, -6552, -1043, -3322, -5565, 215, -7198, -3351, -681, -654, -1647, -2580, -8781, -10343, -10552, -8158, -7703, -1672, 719, -505, -9412, -7793, 1101]
5308A101L704l727o766J047P305L057J445m147p678j0058K584P161J658M345K212
5293C243P63J750k032J539j692q40O018o11m902l236P97o95l176L748O763p79
5277F658l733k556k486J594L909J328j485k918L050N439k272j961n930n397m398
5262a1158L551M335k843L384n840L688n614n098J38M216R698P516l481J241N878
5247I611K006l953p868k654M273l113o875J438P533P026J697J964N14k72q870
5232B457l131M08r20J096m577K459J39K167k765o11K877m341O326P586L662l324
5216I508R01m326j436K221j728n640L180r32J013l690J367K715q26Q615n576m610
5200G56O1Q40l552N381k61Q01r35m960p63K256M141J195p13j372k908M187l656
$$ y = [1101, 4805, 1078, -5688, -4641, 2664, 5721, 7166, 3019, -4659, -14717, -12133, -4972, -3314, 1031, 3243, 4006, 5756, 3724, 5263, 3571, 2731, 8749, 8138, 3236, 0, 797, 102, -3074, 674, 7437, 6658, 2925, 369, -2117, -523, 3386, 4714, 3229, 311, 3361, 8800, 6528, 4567, -1363, -6760, -11158, -7607, -3272, -6115, -2731, -8571, -4883, -10497, -15595, -15457, -11241, -1543, 5973, 2492, 3733, 9611, 11617, 7664, -204, -2858, 1415, -1698, -8573, -7135, 398, 7424, 9121, 11085, 11599, 11327, 2457, -674, -266, -1186, -90, -4667, -2208, -2069, 98, -2667, -3278, -401, -4742, 1584, 9170, 12832, 9508, 10409, 6083, 4647, 6868, 5140, -500, 2680, 1748, 2761, -929, 438, 3153, 2327, 10942, 5366, 756, 817, 1657, -1895, 3486, 3225, 4026, 3091, -1869, -2632, -376, 3765, 4960, 4247, 2875, -33, 4154, 498]
5183D98l935l772L689K596p058j356J157L960j325k318N963R327k035n788L229
5168B832M397j232k262n481M229M063K081P841n324j1179K071J078l138n839k389
5153h252k885N025J331k735M289k05j029J959K496n709j191J871N349N309j785
5138C838m509k151L587M535K728M173m668o494j283R05M219J00o602j144M14r174
5122a1526p158j111M060Q251J003r15M774N672O885r179o018J157O444N960m086
5107D213l251K295K635M087l866k711n41l483l279m376J071K544N550O319J788
5092H995p814j353M343M966r43l964p592m891P519J959o037j117Q759M038k184
5077D684n00l748j841L330o92J193j727k452j32L517p32J063J665r05J186r630
$$ y = [498, -3437, -7209, -3520, -924, -7982, -9338, -8181, -4221, -5546, -7864, -1901, 7426, 5391, -397, 2832, 7229, 5997, 3735, -1746, 2483, 6546, 8627, 16468, 11144, -35, 2036, 3114, -24, -5863, -8252, -11137, -6112, -4781, -7516, -3227, -3432, -4461, -2502, -6, -5715, -6906, -5035, 314, 5623, 3838, -671, -2822, 765, 5300, 8028, 12201, 7533, 1039, -244, 661, 4880, 4980, -1622, -2766, -2352, -11526, -18684, -19795, -15735, -7484, -6481, -7396, -2622, 3050, 9935, 756, -5262, -4105, 2339, 8299, 4213, 962, 3257, 5892, 9979, 6113, 3402, 2861, -622, -3901, -8277, -7206, -4662, 888, 7207, 8995, 1181, -172, 4171, 9137, 8194, 4230, -3362, -8253, -734, 1225, -4812, -5929, 2830, 6868, 4684, 4184, 436, -1405, 1925, 1233, 2426, 699, -1753, -1885, 1632, 900, 1963, 3628, 2723, 3909, -5721]
5061e721o263K140M269M012L88j956k442O367K384k37k031m642K970J293L695
5046D226n01q424j480m477j314M041L087M715K1j939l299L372N665m283J602R09
5030A921j967p498J858M968J743K738p44J792O114J35K145n857n858m48J432K587
5014E061O17q80m847p174J552P520k12j486o473m71k536L518L589J244o778n209
4998a2965J3799J2491p13r6J788j558M642j47j1450m230l180R611Q308K153l217
4983A5236m896K850n388K661m548j0245r35N866J577J89l639J559P039L394n935
4968D785m332m647l044N65P227j987l930p782N21O114N71J533N40n667n86K551
4952g568M316k216M617j432j590Q38l669J219K645P81L672O979k361K297M583
$$ y = [-5721, -11984, -9844, -5575, -1563, -1175, -3131, -5573, 794, 3178, 2941, 910, -3732, -762, 531, 4226, 3725, -4699, -6179, -10656, -11970, -7929, -4842, -127, -106, -2045, -5344, -1972, 3693, -590, 1012, 1921, -46, -7544, -5686, -718, 1025, 3763, 3019, 4811, 10925, 11060, 13205, 7348, 1490, 1042, 2474, 5061, 5678, 4798, -49, -7223, -5671, 1849, 1637, 151, -6322, -6793, -9329, -5811, -2222, -978, -7756, -12965, 834, 13325, 12612, 12516, 14304, 12746, 17388, 17241, 5791, 1561, -1619, 7992, 16300, 18453, 15236, 10340, 13190, 7802, 10463, 5915, -4330, -5265, 601, 2178, 2367, -1272, 287, 7326, 10720, 4785, 453, -4194, -7238, -6673, 554, -1433, -5363, -13145, -12624, -6510, -5939, -4406, -3866, -9533, -10119, -7568, -3252, -5468, -851, -2283, -3873, -3035, -6704, -5485, -2840, -2059, 1613, 8592, 6231, 8528, 13111]
4937A3111n352J189L494l484j0058l571J983R27M096m588k2M450K280O36j789
4922C302N45N853K7j962M04q423n777k970L419M768j35L264o82J684l4J483K679
4905G445O80m163p344m30n832l890J698K756o4n43j932n476k770J0073N552k476
4889f716K976k466m830J281J0724Q79l493o83l501J750Q001Q66o193Q4q149l163
4873a2633J675M449r11j501J969l062K873J471m103k778M479j74L122P823j779
4858I20p476M54K302N7l826q88o56K224L159N16O54l207k933m478L961N209M967
4841I59J945p187J547K661l215M683L353n053n389n16N157j760k354L826L445
4826B102N043k289p445j898l64L50N519O72l209k386k109K416O261o93n135j223
$$ y = [13111, 7759, 8948, 12442, 8958, -1100, -4671, -2688, -1761, 2335, -2253, -2275, 2175, 4455, 5091, 3302, 3847, 9700, 9727, 7765, 8169, -254, -6031, -9001, -5582, -814, -949, 2315, 1633, 3317, 3283, 4766, 7445, 8125, 3962, -3382, -3812, -9644, -13534, -11836, -9080, -9144, -9687, -11619, -17095, -19865, -9792, -4240, -6716, -3740, -6206, -11036, -9755, 969, 1848, -1645, -2328, -5829, -4079, 3922, 4788, -1405, -1321, -9470, -12633, -10958, -6509, -7420, -8921, -6952, -10014, -7141, -5670, -9773, -12551, -8072, -8246, -5124, 2699, 920, -6556, -6102, -3800, -3743, -7569, -8457, -9113, -6889, -3730, -3214, -2560, -5767, -8700, -13178, -9217, -4008, 959, 2904, -4283, -2736, -75, -3290, 1393, 4746, -307, -5696, -6212, -1055, -2815, -5169, -1343, 2102, 7145, 4856, -2589, -4487, -4851, -4501, 1018, 1690, -1519, -3905, -6014, -3598, 2663, 1970, -3165, -4388]
4810d388K936J373K174M928k263q989k689J1583K27q259j1066j494J1261Q639
4796C973M028J04p473o978n48J262j635R51r84N562J717j020l625K469o734j66
4780i097O261R238O33j0663j1601J040P821L547M467K909m635r46N862N001j529
4765H308o738p650L133N77J807N509J405j306k86O115k527q990L098J734N78J674
4749F441L082o186J29J639R811n197j429J751j312l460q31o128j827K002N642
4734D127n082q277M180L792J854J285M81J1P15p941l686J97L669O258O475j487
4718F571k562L795K177k416o895K981j564p015Q52k059L838L255K65L32m090K534
4702aM249m934n14p072m085K656N130k153Q88l89J339L911J244L004J688j969
$$ y = [-4388, -1452, -79, 2095, 7023, 4760, -4229, -6918, 4665, 4892, -3367, -14433, -15927, -4666, 3973, 8001, 8105, 632, -6346, -6894, -5632, -7267, -6316, -7300, -1738, -21, -1041, -4666, -2197, -8931, -9097, -2836, 6402, 7035, -3628, -15229, -14189, -6368, -2821, 1646, 4555, -80, -1026, 4836, 9837, 8308, 1570, -6080, -2947, -2370, -563, 4946, 6351, 5045, 4759, 10874, 8347, -643, 2455, 4189, 4767, 6441, 9523, 3337, 3466, 5105, 14916, 9719, 8290, 10041, 8729, 5269, 4438, -1690, -3517, -1515, 4127, -955, -9232, -5052, -1260, 594, 1879, 2360, 2371, 3086, -4855, -8541, -8344, -4675, 1583, 8058, 6571, 4009, 7804, 9981, 7565, 670, 3651, 2087, -4928, -4076, -6135, -2297, 958, 1223, 1555, -2535, -1, 4248, -686, -1200, -8272, -12357, -9701, -4571, -6724, -5836, -6225, -4886, -975, 269, 3273, 4961, 2992]
4686B992J199L498K315K842k423J215j803n379j515K949J29L474o379l632K573
4671B055K436r45k763q42O548r69q79k531l900o985p478K744J113L612M929N891
4655B036J734J882n723J068N73N174o185l305q55P97N271K094j501k590l627o279
4639i436l86Q64K152J1047k077q946k707M23j796P671L661o227p808K602j057
4624a2020j072K433L953P598r55J229J988L40o705n86n19J998M943M765M815p169
4608E036j505k845O455J999k691j518j489l499p168J735N242N214M674l84o743
4593B513L792J383k208M42j778j300j976K626k749L41o813k597O719P335P872
4578A3602n555m162k892j049k050l991j276M434K293o163J691Q88k325K418M613
$$ y = [2992, 4191, 7689, 10004, 12846, 10423, 11638, 9835, 4456, 2941, 5890, 6019, 9493, 3114, -518, 2055, 4491, 3546, 783, -59, 6489, 5520, 4641, 2110, -1790, -8775, -16253, -13509, -12396, -8784, -3855, 2036, 3770, 5652, -71, 997, 1570, 6744, 559, -2746, -3601, -2804, 2467, 4561, 3060, 470, -3157, -9436, -9822, -8958, -6806, 4241, 2164, -6782, -9489, -9066, -10862, -3191, 470, -5757, -13565, -10963, -12020, -13092, -10659, -6706, 892, -63, 1166, 3154, 3494, -3211, -3797, -4316, -2318, 2625, 7390, 12205, 5036, 3531, 686, 7141, 9140, 6449, 4931, 3442, -57, -7225, -5490, -248, 4966, 9640, 9256, 2513, 6305, 7688, 5480, 5922, 4144, 2844, 868, 3494, 745, 1086, -5727, -8324, -1605, 5730, 13602, 8047, 3885, 993, -56, -2106, -6097, -7373, -2939, -646, -6809, -5118, -4230, -6555, -4137, 476]
4563D76l41k640k515J876J127n76L967j109K554K508k40k39j472Q345L664q326
4547G059p252j061l867j646K650L484P390J623l419p951j622N966K519j1096l248
4532a0471P599M371o765q140P85M535Q454j492o03o17K593J530m462k416J853
4517c246k7O853K503j1428p193M656J1455o44n141k321J262L82p18j484J558j83
4501c716M047j23P160K862J84m11k945r35m247M715J256j0020q848O67P867O889
4485D402K277l271k974o77P215m341o457j037J142N592J759j212K815L335m433
4470D135n300k684J570N231N64K644K145j454j836j475J640n688p01J311j1082
4455a0980n975R776R555j187p098l205J223m069J1519P847n612l064P125l351
$$ y = [476, 135, -2505, -5020, -3144, -2017, -2593, 1374, 265, 2819, 5327, 5087, 4848, 3376, 11721, 15385, 7059, -193, -1254, -5121, -6767, -4117, -633, 6757, 8380, 4961, -2990, -4612, 1354, 3873, -7223, -10471, -2872, 1499, -5266, -13406, -12621, -8086, 368, -1124, -1727, -2344, 249, 1779, -2683, -5099, -3246, -3273, 3580, 6083, -5345, -12538, -7882, 3573, 2929, -2212, -4533, -3271, -2889, -3607, -5091, -3533, -3716, 331, 208, 7368, 10230, 10414, 10003, 7058, 6123, 1876, 6591, 7847, -2173, -11021, -10354, -2487, 4402, 6679, 3408, 434, -243, 6972, 2631, -3826, -4863, -3721, 1871, 3630, 2418, 5233, 8568, 4135, -1165, -3849, -2279, 2952, 3516, 6160, 8305, 6851, 5015, 3540, 5180, -508, -1209, 102, -10980, -16955, -7179, 2376, 1189, -5909, -9114, -7891, -11960, -441, 7406, 1794, -1270, 5855, 2504]
4441B504j649j616l465o416m61K924P822M553J029N34m862k993M977l226J164
4426H19K431n326o907J412m309K949o82m768K293O633K180j050m9N090N238k085
4410C869m686J83M243n307p139m330j617J124O630M810j618k842j673N504N384
4395B535k852K093k975n324m22O150J844n127p462n973L715Q585j229J72l300
4380i570N32m223K989K140N350L966l193k130N124K505m058p90L419k608M514
4365C967J358k626l686m612o907K582N636L727K252m411o006J570O628M503K188
4350F163k254p110M11m511o26L339J1038L484n573R2j479J666j593m728l196k417
4334g294L777m868J450L612O559L627m578L681l687p876K915J1118L219j769J107
$$ y = [2504, 855, -761, -4226, -10642, -11103, -8179, -357, 4196, 5225, 5759, 897, -2096, 2881, -345, 819, 3250, -2076, -8983, -7571, -11880, -8931, -9613, -14381, -12088, -5455, -3275, -4325, -4374, 716, 5954, 3869, -817, -634, 3609, -1698, -8837, -13167, -14784, -13660, -7030, -2220, -3838, -6680, -8353, -2849, 2535, -317, 1776, -1199, -6523, -6945, -795, 1049, -4078, -11540, -17513, -13798, -5213, -6442, -6270, -9570, -9038, -13261, -10272, -8132, -2782, 1184, -2009, -4139, 985, 3490, -568, -1358, 2061, -547, 3967, 5325, 2699, -987, -5599, -12506, -9924, -4288, -561, 1691, -2720, -8726, -7156, -528, 3975, 6163, 3909, -3201, -2790, -7301, -7927, -4588, 6450, 9934, 4361, 4453, 2974, 4640, 3047, -1681, -4877, -7294, -3517, -8385, -6935, -3323, 3236, 6863, 2285, 5966, 2279, -5597, -2682, 8436, 11655, 9886, 10993]
4319A0993n250M334m423j324p912o895p32J816L927M595J250j860l054n28n364
4304a0427J057O603J881j213r94l949J15M748N396r32J395J103K017p175m417
4289d792m089o75o042J667L517p45N924O132K775o981K56N659j80J559N076k032
4273G029k356l654R155P097O81j0116k244K629m784l709o07p429O916M992M409
4258H009N23O20j565N82l71l238n295m684k161P015n737o451q47M233P906N156
4242C695O926j116m754k989k69J040J806o14m844k749k242n994P271k947Q42P486
4226E48K058p982J613J614k327L693R59P55p064l269K516P674N533J968k440n018
4210H31j069o735j739L847L687K951k751l949O61M169L63j552P162M542o560n719
$$ y = [10993, 5743, 10077, 5654, 4330, -3582, -10477, -11209, -9393, -5466, -871, 379, -1481, -4535, -5063, -10427, -9370, -2767, -886, -2099, -3093, -7042, -6927, -2179, 3217, 2285, 3680, 4783, 6800, -375, -4792, -8881, -9556, -15598, -13931, -10414, -11159, -5235, 897, 3672, -3309, -3053, 2606, 2426, 3985, 9061, 7029, 4673, 1019, 10174, 17271, 17952, 7836, 5592, 8221, 3437, -272, -879, -8308, -1392, 3600, 8009, 8532, 9152, 7587, 8169, 7798, 4560, -735, -5419, -7580, -565, -6302, -12753, -13600, -9367, -1461, 3695, 10621, 9505, 4751, 1762, 1493, 2533, 4339, 3725, -1119, -3868, -6110, -12104, -4833, -7780, -6938, 548, 2606, -5376, -3763, -2149, -4476, -783, 176, 931, -6133, -9402, -6886, 788, 6321, 8289, 5849, 831, -238, -6973, -8712, -4865, -1178, 1773, -978, -4927, -4266, -97, 266, -1286, 5876, 10418, 3858, -1861]
4194a861O65j743m857M49K940O631k288l766K590l595p020l987n80N215M857O437
4178H7r2p837Q134M617M840K828J829p821j366P303k643l371l929q498j608q02
4162h329P114M10q258k458M389P432p61o38K567M157J418K730K317k701o085l944
4146f40j891l71l831j591L649O954J533m616m002J014N838Q094K800j227o455
4131E258L009L648j1900r00K654J246M459n225L527L922n32N39j014p644M748
4116E795N320J925L33N87n582j0618j582q28J673P23o20J725m347L629l299K416
4100b750j135j511j667N749L324l68n62o16j740j378M512K941j364K43L401r3
4084F986q28K451O244l227j470l09O25j196o778o751k982j689K6j752R418P120
$$ y = [-1861, -1196, -2939, -7796, -7347, -4407, 2224, -64, -3830, -1240, -4835, -11855, -15842, -16422, -11207, -6350, 87, -5, -7842, 292, 4909, 9749, 12577, 14406, 6585, 5219, 12522, 9879, 6508, 2579, -5919, -7527, -8329, -1215, -805, -9063, -11521, -7132, 300, -461, -1099, 1468, 5625, 7043, 9773, 12090, 9389, 3304, -640, -2531, -2902, -6733, -8324, -4675, 2279, 3812, -804, -4806, -3792, 2046, 10140, 12940, 11713, 5258, 8267, 11915, 15, -885, 1769, 3015, 7474, 2249, 5776, 9698, 9166, 9705, 8691, 1047, 5795, 11115, 13040, 13373, 13960, 8378, -2240, -3822, -4650, -2977, -2254, -2874, -1149, -5496, -1867, -5166, -2750, -3885, -5396, -7063, -1314, 2010, 1642, 1080, 464, -1276, -2654, 1858, 4799, 3435, 3678, 7079, 6986, 6158, 8609, 14853, 11626, 10156, 9847, 10472, 9276, 2498, -4253, -7235, -8924, -8898, -10650, -1232, 5888]
4068E888L095K40j377K0K531k10o532l056J000m408K6L573J291k841o349o712
4052a3821o55R148J65K570j009J344k588m21P327J712J854J115M94m12m228l397
4036h02L239j741L095K365J074n42n2m440l661o264j279K017L498K931O404J556
4020G398m308l836o659j288K284l813k917M19J057N956N895j871k0L206l872p484
4004i853k161R506K692n48m033M19m992k385N185M507m52k362k411M890N296n888
3988b590M259N231j091m809Q026Q870J86l308m24Q056n924q029o714m151n147
3973g559J893Pj331N447k599O33n049o7P537p13j101j172M776N695o14m438M041
3956E386J585o70j767N59l61n720m53N442M632J985m601l534L053L005O614Q63
$$ y = [5888, 8983, 9223, 7846, 7866, 10397, 10187, 3655, 599, 1599, -2809, -2783, 790, 2081, -760, -7109, -13821, -14476, -5328, -5163, -2593, -3602, -2258, -4846, -5267, 2060, 3772, 5626, 6741, 7235, 6823, 2595, -802, 2437, 696, 3791, 6156, 7230, 6688, 6636, 2196, -1465, -7729, -9008, -6991, -3493, -562, 5842, 7398, 3090, -746, -7405, -8693, -6409, -10222, -13139, -12720, -11663, -5707, 188, -1683, -1703, 1503, -2369, -9853, -12014, -2508, 184, -364, -4397, -3978, -8970, -11355, -6170, -1663, -2115, -4477, -6888, -1998, 3298, -2590, 1669, 6900, 5809, 1000, 9026, 17896, 18082, 14774, 14350, 22406, 16482, 8453, 1739, -2412, -7559, -5666, -5659, -6990, -1543, -4142, -3509, -8558, -8625, -1088, -1801, -2902, -4074, 702, 6397, 5783, 1345, 5386, 6971, 6301, 4534, 5093, 4732, -988, -1441, 4001, 8633, 10618, 6017, 2483, 5536, 8541, 15155, 16018]
3940A6018j0253n942o310O882N575o168k32O929n52l629k164l246K779p03l03
3925a319l736o897J211O015J362L88M493L922o178n874P901k629k329k738L590
3910b818R97m293N024J985m152j978J609N081O387q014k818R65M124q231R11L182
3894b039L324L419J572n181m895k349J022R897K453l935n156K564J976l073J755
3879A354L672n61R88P70L527q77k20J376k872j2730m167J162P099N291o825n410
3863h423N298K178k362k273M715P610k442L473L829j608m762J395J0995k317o221
3848I085q85l720o785n578L76O616L684K727k038K415L801L194l148r079p203
3833f538m817Q46K519K518j692p208K530P236r57j1881J302n461J0379R438l553
$$ y = [16018, 5765, -177, -6487, 395, 5970, -198, -430, 6499, 5947, 2318, 154, -3092, -313, -1016, -1319, -5055, -11952, -10741, -4726, -3364, -2976, 1517, 5439, -739, -6613, 1288, -1341, -3670, -6408, -2818, -1821, -6114, -1090, 895, -3257, -5235, -3626, 1455, 7842, -172, -2990, -2025, 2099, -6132, -5221, -2039, 1285, 4704, 6276, 1095, -3800, -6149, -5127, 4770, 7223, 3288, -1868, 696, 2672, -401, 1354, 5026, 4465, 5453, 6223, 9750, 8873, 8653, 10029, 7157, -5573, -9740, -8578, -1479, 3812, -3013, -8423, -3125, -947, -3309, -5582, -867, 6743, 4301, 7774, 11603, 9995, 5233, 6628, 17623, 15306, 9085, 8200, 4480, -2305, -7883, -7507, -891, 2793, 5520, 3482, 5897, 9698, 12892, 9744, 665, -6538, -11355, -10509, -7990, -5472, -7164, -14372, -11842, -4606, -5563, -17444, -16142, -21603, -11224, -1786, -5339]
3818e339l376j0741K211J0241J360r75K805l51q346K769n974n909n79J74M514
3803a7516L743K771j159O004J086l803j176n03Q522J635N402J0846K032q92k255
3788A4737r58J888N17o121m423R68K559m445J80O426j132L94l401l743j0035L466
3772c123J2399N987j292j0010m434l181j530l236N684J134J853J0200O131j814
3758A4768q905n617n481K020Q049M014k037n514r273n586M415O184M812k656m410
3743e217l261N910L753j049n326k33O045J594J614L932l006q124o293O143N464
3728A946o004n158K736L4L977O366K633r279P459R46J19n932K409n228n820O267
3712b529N703K675N45J924J077n906j0766j829L910M322Q692n633l730k013m119
$$ y = [-5339, -8715, -19456, -17245, -7004, -5644, -6619, -3814, -4165, -12511, -9742, -15716, -21625, -22204, -22030, -17516, -13773, -11002, -12161, -6157, -5071, -8874, -10050, -10553, -2031, -396, 5006, 15852, 17884, 16992, 14737, 13779, 15667, 16184, 10063, 5640, 6608, 9167, 4722, 4902, 11328, 10196, 10590, 7189, 3446, -6589, -3123, 9276, 15263, 13971, 3961, -473, -3654, -5184, -8420, -2736, -1602, 251, 10451, 16582, 14768, 5863, 246, -5235, -3215, 4834, 8848, 6811, 1297, -7976, -13562, -9147, -2963, 1849, -807, -5217, -8478, -2568, 1185, 136, -5190, -5423, 622, 2216, 3830, 7762, 4756, -3368, -9661, -3518, 1946, -4058, -9216, -6480, -6446, -2469, 3897, 6530, -2749, 4710, 5656, 5775, -157, 2252, -2976, -8796, -2529, 3174, 5849, 6394, 8318, 9395, 3489, -7277, -9106, -5196, -874, 7818, 2185, -1545, -3558, -7677]
3697g677q49J431l03J454q86j665j113J300k131o259M841K615M957k80n791R848
3681e08R139K938o585j1566J982m67L790L699J023m169o473L929N532l953l825
3666e514L110J358K21n814p304n788M853P989M006J133K710p800M9K094k035l684
3650a0416L001N538K979K902l285j818J851k936K091L380P714m186L222J46m043
3635F140m889k882j63Q892L95m129l62R016n018q440K246m712m665o18N026J0771
3619F608P863K651m192m426n014m284K206K588L05Q34M04J677N23r66J819k265
3603F331J936j801j2488l854j177k202N161O101k246n638J1051j600q659K248
3589f837O318k086N142j314j3679K255Q165P424L415K802m352n032K212J906q793
$$ y = [-7677, -8526, -7095, -7398, -5944, -6830, -8495, -9608, -8308, -10439, -16698, -11857, -9242, -4285, -4565, -10356, -508, 8631, 11569, 4984, -6582, -4600, -5067, -1277, 2422, 3445, -724, -7197, -3268, 2264, -1689, -5514, -2404, -1046, -825, -6639, -13943, -19731, -14878, -6889, -2883, -1750, 960, -6840, -6791, -4697, -6732, -10416, -7415, -1877, 1102, 4004, 719, -1099, 752, -2184, -93, 3287, 11001, 6815, 10037, 10183, 6140, 1251, -1631, -1794, 7098, 7493, 3364, 3002, 12018, 7000, -1440, 806, -3906, -8571, -9189, -4163, 6608, 14471, 17122, 12930, 8504, 3490, -794, 1412, 4000, 4305, 5139, 5543, 7220, 7743, 6777, 8596, 6331, 8267, 6466, -6022, -9876, -11053, -13255, -8094, -1993, -4239, -9877, 1174, -426, -9085, -6837, -519, -2605, 2537, 1223, -12456, -10201, -2036, 5388, 8803, 11605, 7253, 2221, 4433, 6339, -2454]
3574b454j2337m908L391R259O973O1m494p041J480Q120k286l33J459J334m268
3559f044Po2J241J901K812L3M505J680L168M917j030k429n124j255N13R15l02
3542E446O476m245j0117j1880l40M223R153K423n50o628o596J0594j57l052J76
3527e074l11n604q53L703R733Q058m397m857k805p376r45J0144j402j072k728
3512e786L172k558K646N622k379l256m810M165J337k522M325r3O326l220J728
3497D697L508m527r499k196M169O81J10K543j614M625j453L859N737L092J493
3482A5225p441o947K462l444K92J374n407L267L385K9L95n542N81o27J485K12
3466g01J104l413K001P553L558m624m507J765q37L084K694n547p960m52p811q40
$$ y = [-2454, -14791, -19699, -16308, -7049, -76, -15, -4509, -11550, -10070, -1950, -4236, -4569, -3110, -1776, -6044, -6037, -6099, -4858, -2957, -145, -112, 4393, 6073, 9241, 14158, 13128, 10699, 5575, 4320, 4833, 5748, 5446, 11922, 7677, -2440, -14320, -14660, -10437, -1284, 1139, 589, -6039, -12635, -2041, -2198, -5250, -5074, -5385, -10989, -11842, -8139, 1594, 9652, 5255, 398, -2407, -9783, -10728, -584, -1986, -3058, -5786, -2614, -5172, -2526, 3096, 717, -2539, -7349, -3184, -1847, -4369, -44, -137, 6189, 2969, 4697, 8205, 3678, -5821, -8017, -3848, -3167, -3057, -514, -2128, 2497, 1044, 4903, 10640, 13732, 15225, 7784, 837, 3299, -145, 147, 1521, -3886, -619, 2766, 2795, 3190, -2352, -1771, -2398, -913, -701, 403, -3010, -1009, 6544, 10102, 5478, 971, 2736, 1899, 4983, 7677, 2130, -5830, -6282, -14093, -14933]
3450a4933N237o56N510P221P921K134k406n688n609l12j738R52j893l13j748K759
3434c562K095j347p749J237O128N408J2551P210o407j6125m616o4P257P368J552
3419A0936K98k543r997j617J204l003O037P469k17L273K640j383m788j704m765
3404A840m212k13r58L826K705k408n446l949K218n56N38k085m231N72Q487M038
3388A66j736m303r5k51n912J976R899j353J472K241k597q767m762q92K54M166
3372a0494M036k30L635j164j509K819k820l959M961K865l376L659P161j01k888
3357B595k595M257N391m480o367k043j544J983N087k707l500K003M228L114j0785
3342e363J177J903j836Q825m493N71N06M595L788J376K831n618l030j059R29L113
$$ y = [-14933, -9696, -10352, -4842, 2379, 10300, 12434, 10028, 4340, -1269, -1581, -3319, -2367, -4260, -4573, -6321, -3562, -1467, -2814, -10563, -9326, -3198, 2210, 14761, 21971, 15564, -561, -5177, -5241, 2016, 9384, 10936, 11234, 8691, -1306, -2923, -1719, -4722, 1315, 8784, 8567, 11840, 14480, 13097, 8309, 6605, 1840, -2372, -2585, -3543, 283, 2988, 580, -4866, -8815, -6597, -7153, -6615, -8700, -12931, -12359, -3872, 166, -1570, -5873, -5968, -6219, -12131, -10155, -256, -1609, -137, 2104, -493, -9260, -14022, -14914, -14660, -10494, -6458, -6688, -3053, -4217, -5726, -2907, -5727, -9686, -4725, -1860, -5236, -1577, 5584, 5483, 2595, 0, 4257, 9648, 5168, -1199, -3242, -4786, -2803, 2284, -423, -3923, -1920, 2308, 5422, -5363, -4186, -2283, -4119, 4706, 213, 784, 1290, 5885, 9673, 11049, 13880, 8262, 5232, 4173, 5102, 8215]
3326H215K101k839q592l614k035L02k119K315J740M124M136l979p571O30J0128
3311B942j12p127o009L90L608J577N205P143L147o231m307m553q098m467L510
3296a3382J774J262M075M196P83K210M680o95r10l052m123O226Q039j393k536
3281G154r002p761P271J176k68j095K75q67l274J560J975k244K865L147j579K356
3265A689n16J810N44O761n643k632k739q592p98q45L608j366J55O183N476K636
3249E731K178j242J72j732p685n107q54R830R86k651q11rR195N81L490N505j2338
3232E239r013o649N552r97K500K908N655N594j634k292n1j979J134l602O9k028
3216D06o678K399L668J121j669K262K7m097r02J83R518K400M723J56r690k517
$$ y = [8215, 10316, 7477, -1115, -4729, -6764, -6462, -8581, -6266, -4526, -402, 3734, -245, -7816, -7186, 2942, 2830, -4297, -10306, -9916, -6308, -4731, 474, 7617, 10764, 4533, 226, -4327, -12425, -16892, -13382, -11608, -10346, -6271, -2075, -1292, 918, 5598, 4903, 3993, 941, -3182, 3044, 11083, 9690, 7154, -1848, -9609, -2338, -1162, -1430, -2525, -2250, -3117, -6391, -4831, -2856, -5100, -2235, 912, -667, 1689, 1173, 2983, 3527, 10288, 4645, 2013, -726, -9318, -10116, -10961, -7353, -8719, -8564, -2381, 3095, 5731, 7909, 6667, 6839, 5107, -2578, -7685, -8539, 1291, 2277, -374, -1185, -1194, 8001, 8582, 12072, 17577, 5239, -3774, -10423, -4871, -5868, -3368, -460, 5195, 10789, 9155, 6863, 6812, 4833, 5967, 2365, 2434, 406, -6272, -3873, -205, 916, -753, 1509, 1536, -2561, -3463, -3280, 6238, 8638, 13361, 13517, 3827, 1310]
3200A310O265p946o500Q930n78L459j401o189k143K543j487K00k248o02n04P141
3184B50J011l394n337k195N378J95k726r20J326M73L067J0254p37k093p751p113
3168a0312P9Q834J0228j269l761n422l070R04K453J1489L652o559J672k621j0253
3153c956l286R186J711j43K70k093l010J502k636j693L507L369K936m178o640
3138e154m689r16L031O258N987k821k061J958P552o228o197N845J077k753M248
3123E137O780k229p439k926q01n093p76M046K916j886q372l790K149n300M854
3108a2730J6348N07J416n94o276n966k447M443N842L924o1q912k805L210r36p89
3092e826R9J0462q56q700L745Q489j059p090j921j340J846O022n063o51N351K348
$$ y = [1310, 7575, -371, -6871, 2059, 1481, 4940, 3539, -2650, -4793, -2250, -3737, -3537, -5785, -6387, -6891, 250, 1261, -2133, -7470, -9665, -4287, -4092, -6818, -7738, -6412, -5939, -2872, 7382, 6645, 4552, -3199, -10312, -10233, -1399, 8829, 7560, 3799, -1623, -4693, -3789, -1336, 10153, 13805, 7246, 8918, 6297, -3956, -7242, 1944, 3655, 3512, 3782, 1689, -1321, 181, -2455, -4148, -641, 2728, 5664, 1486, -5154, -9843, -10759, -7728, -1470, 4517, 1696, -365, 1593, 9145, 2917, -3280, 2565, 3642, 889, 5137, 11917, 9688, 2249, -677, -1478, -6571, -7347, -3301, -385, -2271, -10643, -14433, -12284, -17584, -12730, 3618, 4125, 5541, 4947, -1329, -7295, -9742, -5299, 543, 4467, 4406, -4506, -7311, -4101, -5037, -5826, -5727, 4735, 3879, -4821, -1076, 7413, 6354, -736, -2657, -3997, -2151, 3871, -1192, -1843, 3508, 5856]
3076E856L180o471n655J474P501k453J576J633l255K243l796r736p26L635j202
3061f196K344j511l262k519L63M476P230j328n001M722R92j349j6m63J579J99
3045B60K582J687N437o421o293k812L438l281k567Q88Q83r63p50o954J827L277
3029i762J642K935K902j137l208M245L967N79m036M668l112J749M810N433o780
3014D895l973o469L204J564P72N29J98L395q63n017j54k345m927l758R01R289
2998b759K561P026Q683m146r612O976k260j090L589K350P04m076k613M015j675
2983G673k577l828p02L595o559q672j010P441Q483L907k448o201K947M478j765
2968D762j645l133o36m64m150m439L183Q34r82K481k746R018j831j3249n666L368
$$ y = [5856, 9036, 2565, -3090, -1616, 5885, 3432, 5008, 6641, 3386, 5629, 1833, -7903, -8629, -4994, -6196, -3852, -5363, -8625, -11144, -10781, -6305, 925, -403, -5404, -682, 310, -1039, -1055, -1518, 61, 260, 2842, 4529, 9966, 3545, -2748, -5560, -2122, -5403, -7970, -7082, -6199, -7162, -7912, -14866, -13039, -9762, -8120, -5185, -2283, -3420, -6628, -2383, 1584, 2163, -1873, 2795, -317, 1432, 6242, 11675, 4895, 922, -5547, -2343, -779, -7, 522, 720, 4115, 3252, -1765, -1919, -4264, -9191, -12949, -12048, -2759, -198, 6828, 15511, 11365, 1753, 8729, 6469, 5379, 8968, 11318, 12022, 7946, 5333, 9348, 7673, 5096, 1268, 566, 4161, -2398, -11070, -12080, -4639, 3844, 7751, 5303, -898, 2049, 6527, 4762, 3117, -16, -652, -1116, -5266, -9705, -6522, -5688, -6670, -4189, -6935, 2083, 252, -12997, -18663, -15295]
2952a5295L885R002m326k965l499l293L587N289O167J57j924j762M899n216n750
2937a1044L320l180K325O823J1056M858p69q136o495j231q50P736M911L262j910
2922A0676j2524o757L993P526k20k262k062l583J075L864M463J559m310l472k039
2907d073j927J815k074K176m034J917N862J930l750m477j689p11K322K455M770
2892E12J969l076L367m37j625N2m266L344K436k268k003p102P66l77L637L776
2876a295K38p864K225N697R05O89l538L50m634j013N491q16J566J1972K637p369
2860E241k343n37J055j190r490M64N884P135k376J6o917n027p11M349l905M377
2844c975Q787M09l456o034J867L468P18k496j750N305R287n0l290J391J369k035
$$ y = [-15295, -11410, -2408, -6734, -9699, -13198, -16491, -12904, -7615, -1448, -1291, -3215, -4977, -78, -5294, -11044, -7724, -10904, -8579, -1756, 9300, 14158, 13389, 5253, -1242, -2473, -3323, 4413, 9324, 12586, 10676, -1848, -8605, -4612, 2914, 2694, 432, -1630, -5213, -4138, -274, 4189, 5748, 1438, -2034, -4073, -6000, -4185, -6259, -4083, -8117, -6200, -338, 1592, -2158, -6635, -8324, -9035, -6713, -4258, 512, 2481, -595, 2772, 2335, 710, 762, -3504, -160, 2276, 8, -1995, -9097, -8331, -8708, -5071, -1295, -1057, -8921, -6696, -999, -94, 595, -2943, -2593, -7227, -8240, -2749, -3565, -1999, 9973, 12610, 5241, 2898, 2361, 3416, 2226, -7264, -6800, -916, 6219, 3843, 3859, -3058, -8085, -8796, -4447, -8352, -3975, 4812, 5221, 1765, -4269, -2402, 1066, 1784, -712, -2462, 2843, 12130, 12080, 8790, 10181, 11550, 9515]
2828I515n590k60M063k613l245j151p983K62K328J385Q532N861l586o082L076
2813D512L549p974n920m83j602N315K018N101l626j0688L451M62j066j091M624
2798c418J282k996K409l04L453N134m406L601o045l361o42m278M030j078N690
2783i29Q14p847j102m32K605m579l653n67k495q2k305O729O317M809K338J783
2767A404m309L238k978k119L298L659J893j301K3L623L30l040m223M320M433l28
2751G923j0420l671J318j493M831M287O116J134p424l479M704j401r208n08O353
2736i38L067k317M944o63j0433n07J036M475N336n848l74J311N41k548K525N82
2720A89J637L820p17L29l804q46Q50N171K105r78j708J807k515K618J38m033j247
$$ y = [9515, 3925, 3665, 7728, 5115, 1870, 719, -7264, -7002, -4674, -3289, 5243, 11104, 7518, 1436, 4512, 8061, 87, -5833, -6316, -7918, -2603, -585, 4516, 890, -9798, -6347, -5885, -6951, -8042, -3418, -2136, -5132, -2723, -3027, 426, 5560, 1154, 4755, -1290, -4651, -5293, -9571, -5541, -6619, -929, -115, -7962, -9064, -9496, -6891, -11470, -15123, -15690, -18185, -18267, -20572, -13843, -7526, -2717, -379, 1404, -2905, 333, -2645, -4764, -1466, 2193, 4086, 2785, 2808, 6431, 6761, 3721, -502, 3818, 8251, 7923, -2497, -6168, -4850, -6343, -1512, 2775, 8891, 10025, 2601, -878, 3826, 2425, -6783, -7291, -938, 2129, -188, 4756, 4093, -6340, -6847, -5811, -1336, 4000, -1848, -2222, -911, -370, -2918, -393, 189, 1826, 5646, 4929, 5258, 1454, 608, 1458, 6629, 8734, 7756, 6048, 7855, 5340, 7958, 8096, 4063, 2816]
2703B816k893n511k027R798k904j082L324k090k399q578m809L323J2387M850J446
2688E651k522l403o934l309R637J2730J973l329k852j633j709J535K315j120J973
2673I003J814k764l082K107k883o807L484K536j002k903j1086k722K099M797N938
2658a471K272L091m827l823k329O701K622m475L331M159Q225l204m742o607K36
2643h41J281n134O83K643R68l7m586J03K559k347j179N088K235O326L266r407
2627A621o920o391p372J2512R452M889K654J305j509r998j039M460L60k056m025
2612b057m744m233m296O642o70k17M23J137P530R727n330n335m047n360m42J358
2596i914K853L917R360N934j033j893m576R12K823o458M843N732n892q098m743
$$ y = [2816, -77, -5588, -7615, 2183, -721, -1803, 1521, -569, -2968, -11546, -16355, -13032, -645, 4205, 5651, 3129, -274, -7208, -10517, -880, 11850, 13823, 10494, 7642, 6009, 4300, 5835, 8150, 7030, 9003, 10817, 8053, 4971, 7078, 4195, -2612, 872, 3408, 2406, -497, -11583, -14305, -12206, -7409, -1471, 801, 3892, -935, -4758, -7087, -386, 2236, -2239, 1092, 5251, 13476, 10272, 5530, -1077, -841, 440, -4694, -4011, -1368, -400, -437, -5023, -4920, -2361, -4708, -5887, -799, 1436, 7762, 11028, 1621, -5299, -11690, -19062, -6550, 2902, 7791, 10445, 11750, 10241, 243, -796, 3664, 4024, 1968, -2057, -6801, -11034, -15330, -8688, -9358, -9575, -9152, -8015, -485, 9242, 3912, -1423, -5470, -10830, -11272, -9914, -7061, -3144, 6216, 12150, 11117, 9224, 4648, 5560, 8383, 1925, 6768, 12500, 6608, -1490, -6233]
2581f233M966R55o03j040P42j249k79J023j5j786j642Q27N41n39j534L018j999
2564d847k666Q850P680J902m922n45k389k043l217l261n215M738P576J978o610
2549b991j934l22k989L970k448J014O797O364O149P22r134o887P48L096M653J627
2533H435Q39J371n033J970K557j483j4192q156M597N361J061N359L785M39k674
2518D236k871o584n318J679O040J611P084K496n876l738l660K609K118L653K098
2503E577j1503p057K711M947N608P426r14k421r377K289J580k987j142N678L346
2488C761Q636j993p847m793n762l92Q00M627n062k782Q24L273P344J25l201k122
2472d564J261q18k050M028j72n540j826J209N752n583k403R577K358p911Q683
$$ y = [-6233, -1267, -312, -915, -1955, -1213, -2462, -2741, -1718, -1733, -3519, -5161, -4334, -3793, -4332, -5866, -2848, -4847, -7513, 1337, 9017, 10919, 5997, 5452, 3063, 1020, -2197, -5458, -10673, -5935, 1641, 3619, -2991, -4925, -5247, -8236, -4266, -6714, -5700, 1097, 7461, 13610, 14332, 5198, -1689, -941, 2155, 6808, 8435, 9274, 10645, 5612, 7582, 10139, 8656, -5536, -13692, -9095, -3734, -2673, 2686, 6471, 6910, 4236, 1365, -5219, -10537, -8858, -2818, -1207, 5877, 8373, 2497, -1241, -4901, -2292, -174, 3479, 5577, -5926, -12983, -10272, -5325, 283, 7709, 6795, 4374, -5003, -2714, -1134, -4121, -5263, 415, 3761, 12397, 10404, 2557, -2236, -7998, -8390, -7590, -2963, -8025, -10807, -9983, -6710, 634, 759, -2442, -4564, -3303, -4121, -6171, -2143, -2315, -7855, -9681, -8472, -2720, -8303, -10706, -1129, 1229, -6682, 2001]
2457B001k53k837P310j669n597k937J084l873o130k241J1526J1073J2426j94r087
2442A0602r466J587K207n650n57m127J618L730m218M447O855P478m689m902j820
2427C095J253n18l557j405m053L032j177k657m45L106j714n776l970K422N028
2412g336k336k034o17M279L757K913k512j565M355J547n337L431M421l470J446
2397I42L309m098l121j197j917K444n269L677J646j254l932j014M891L058K558
2382G23j375N423k494K389M727q270r20k869o448l999M133j200m3P113M182M697
2366E769l51m34q778k607P107J720l808P002m566k945k232j018m536j58R6N567
$$ y = [2001, 1748, -1089, 6221, 4552, -1045, -3982, -2898, -6771, -12901, -15142, -3616, 7457, 19883, 19689, 10602, 1136, 2723, 4930, -720, -1277, -5404, -3786, -56, -4274, 173, 7028, 14506, 9817, 4915, 3095, 4348, 3830, 273, -1132, -5185, -2153, -3330, -5987, -6432, -3326, -5040, -10816, -14786, -12364, -7336, -9672, -11706, -12323, -8044, -4287, -1374, -3886, -5451, -1096, 451, -4886, -1455, 2966, -504, 942, 4251, 153, -2968, -4165, -6082, -3638, -8907, -5230, -3584, -4838, -8770, -9784, -4893, -1835, 723, -652, 4771, 2277, 4666, 9393, 1123, 203, -2666, -9114, -13113, -8980, -10180, -10223, -3110, 1072, 5769, 5418, 4984, -3794, -6401, 706, 2426, -1382, 5620, 1054, -1891, -4123, -5141, -9677, -9835, -9739, -4172]
$$ [...]
##END NTUPLES=NMR SPECTRUM
##END=
