##TITLE=Analysis number 328333
Compound Code cc 62604
Book Reference 494/164
Project Code adrs
Chemist Name craigr
##JCAMPDX= 6.0         $$ Bruker NMR JCAMP-DX V2.0
##DATA TYPE= NMR SPECTRUM
##DATA CLASS= NTUPLES
##ORIGIN= Bruker BioSpin GmbH
##OWNER= nmr
$$ XWIN-NMR		Version 3.5
$$ Fri May 25 09:35:21 2007 GMT Daylight Time (UT+1h)  MAYBRIDGE\nmr@NMR_250MHZ
##.OBSERVE FREQUENCY= 250.131544655141
##.OBSERVE NUCLEUS= ^1H
##.ACQUISITION MODE= SIMULTANEOUS (DQD)
##.ACQUISITION SCHEME= undefined
##.AVERAGES= 16
##.DIGITISER RES= 18
##SPECTROMETER/DATA SYSTEM= dpx250
##.PULSE SEQUENCE= zg30
##.SOLVENT NAME= CDCl3
##.SHIFT REFERENCE= (INTERNAL, CDCl3, 0, 16.4526)
##AUDIT TRAIL= $$ (NUMBER, WHEN, WHO, WHERE, WHAT)
$$ ##TITLE= Audit trail, XWIN-NMR		Version 3.5
$$ ##JCAMPDX= 5.01
$$ ##ORIGIN= Bruker BioSpin GmbH
$$ ##OWNER= nmr
$$ C:\u/data/dgb/nmr/ADRS/1480/pdata/1/auditp.txt
$$ ##AUDIT TRAIL=  $$ (NUMBER, WHEN, WHO, WHERE, WHAT)
(   1,<2007-05-25 09:34:55.81 +100>,<MAYBRIDGE\nmr>,<NMR_250MHZ>,
      <created by zg, POWCHK disabled, PULCHK disabled
       configuration hash MD5:
       76 6E 9A 78 1E 09 19 81 EC 84 63 8F B0 6A 59 2D
       data hash MD5: 64K
       CB CC 69 91 1C 24 73 F5 B9 EF A2 A5 C7 08 80 32>)
(   2,<2007-05-25 09:35:11.17 +100>,<MAYBRIDGE\nmr>,<NMR_250MHZ>,
      <Start of raw data processing
       ef LB = 0.3 FT_mod = 6 PKNL = 1 SI = 32K 
       data hash MD5: 32K
       08 8B 13 7B 58 77 95 1E CE 78 BC 73 14 51 6A A2>)
(   3,<2007-05-25 09:35:12.89 +100>,<MAYBRIDGE\nmr>,<NMR_250MHZ>,
      <apk 
       data hash MD5: 32K
       04 19 F8 56 64 8B 91 F9 D8 AD F1 6A 58 CB F9 1D>)
(   4,<2007-05-25 09:35:13.56 +100>,<MAYBRIDGE\nmr>,<NMR_250MHZ>,
      <abs ABSG = 5 
       data hash MD5: 32K
       E8 10 CE 6D 05 82 B2 32 0D 26 CA F1 BA FF 7C CD>)
$$ ##END=
$$ 
$$ hash MD5
$$ E3 82 B4 6C 81 1D 37 40 F2 70 B7 A9 D2 4E 5C 89
##$RELAX= 
##$RELAX= 
##$RELAX= 
##$RELAX= 
##$RELAX= 
##$RELAX= 
##$RELAX= 
$$ Bruker specific parameters
$$ --------------------------
##$DU= <C:\u>
##$EXPNO= 1480
##$NAME= <ADRS>
##$PROCNO= 1
##$TYPE= <nmr>
##$USER= <dgb>
##$AMP= (0..31)
100 100 100 100 100 100 100 100 100 100 100 100 100 100 100 100 100 100 
100 100 100 100 100 100 100 100 100 100 100 100 100 100 
##$AQSEQ= 0
##$AQ_mod= 3
##$AUNM= <au_zg>
##$AUTOPOS= <54 >
##$BF1= 250.13
##$BF2= 250.13
##$BF3= 250.13
##$BF4= 250.13
##$BF5= 500.13
##$BF6= 500.13
##$BF7= 500.13
##$BF8= 500.13
##$BYTORDA= 1
##$CFDGTYP= 0
##$CFRGTYP= 5
##$CHEMSTR= <none>
##$CNST= (0..31)
1 1 145 1 1 1 1 1 1 1 1 1 1 1 1 1 1 1 1 1 1 1 1 1 1 1 1 1 1 1 1 1 
##$CPDPRG= <>
##$CPDPRG1= <>
##$CPDPRG2= <>
##$CPDPRG3= <>
##$CPDPRG4= <mlev>
##$CPDPRG5= <mlev>
##$CPDPRG6= <mlev>
##$CPDPRG7= <mlev>
##$CPDPRG8= <mlev>
##$CPDPRGB= <>
##$CPDPRGT= <>
##$D= (0..31)
0 1 0 0 0 0 0 0 0 0.06 0 0 0 0 0 0 0.0002 0 0 0 0 0 0 0 0 0 0 0 0 0 0 
0 
##$DATE= 1180082094
##$DBL= (0..7)
120 120 120 120 120 120 120 120 
##$DBP= (0..7)
150 150 150 150 150 150 150 150 
##$DBP07= 0
##$DBPNAM0= <>
##$DBPNAM1= <>
$$ [...]
##$SUBNAM7= <"">
##$SUBNAM8= <"">
##$SUBNAM9= <"">
##$SW= 20.6930455092707
##$SWIBOX= (0..15)
0 0 3 0 0 0 0 0 0 0 0 0 0 0 0 0 
##$SW_h= 5175.983436853
##$TD= 65536
##$TD0= 1
##$TE= 683.16
##$TE2= 300
##$TE3= 300
##$TEG= 300
##$TL= (0..7)
0 120 120 120 120 120 120 120 
##$TP= (0..7)
150 150 150 150 150 150 150 150 
##$TP07= 0
##$TPNAME0= <>
##$TPNAME1= <>
##$TPNAME2= <>
##$TPNAME3= <>
##$TPNAME4= <>
##$TPNAME5= <>
##$TPNAME6= <>
##$TPNAME7= <>
##$TPOAL= (0..7)
0.5 0.5 0.5 0.5 0.5 0.5 0.5 0.5 
##$TPOFFS= (0..7)
0 0 0 0 0 0 0 0 
##$TUNHIN= 0
##$TUNHOUT= 0
##$TUNXOUT= 0
##$USERA1= <user>
##$USERA2= <user>
##$USERA3= <user>
##$USERA4= <user>
##$USERA5= <user>
##$V9= 5
##$VALIST= <valist>
##$VCLIST= <CCCCCCCCCCCCCCC>
##$VD= 0
##$VDLIST= <DDDDDDDDDDDDDDD>
##$VPLIST= <PPPPPPPPPPPPPPP>
##$VTLIST= <TTTTTTTTTTTTTTT>
##$WBST= 1024
##$WBSW= 4
##$XGAIN= (0..3)
0 0 0 0 
##$XL= 0
##$YL= 0
##$YMAX_a= 388043
##$YMIN_a= -360537
##$ZGOPTNS= <>
##$ZL1= 120
##$ZL2= 120
##$ZL3= 120
##$ZL4= 120
##$ABSF1= 16.45263
##$ABSF2= -4.240543
##$ABSG= 5
##$ABSL= 3
##$ALPHA= 0
##$AQORDER= 0
##$ASSFAC= 0
##$ASSFACI= 0
##$ASSFACX= 0
##$ASSWID= 0
##$AUNMP= <proc_1d>
##$AZFE= 0.1
##$AZFW= 0.1
##$BCFW= 0
##$BC_mod= 0
##$BYTORDP= 0
##$COROFFS= 0
##$CY= 12.5
##$DATMOD= 1
##$DC= 0
##$DFILT= <>
##$DTYPP= 0
##$F1P= 14.0000005364418
##$F2P= -0.99999901652339
##$FCOR= 0.5
##$FTSIZE= 32768
##$FT_mod= 6
##$GAMMA= 0
##$GB= 0
##$INTBC= 1
##$INTSCL= 1
##$ISEN= 128
##$LB= 0.3
##$LEV0= 0
##$LPBIN= 0
##$MAXI= 10000
##$MC2= 0
##$MEAN= 0
##$ME_mod= 0
##$MI= 0
##$NCOEF= 0
##$NC_proc= -4
##$NLEV= 6
##$NOISF1= 0
##$NOISF2= 0
##$NSP= 0
##$NTH_PI= 0
##$NZP= 0
##$OFFSET= 16.45263
##$PC= 1
##$PHC0= -54.73928
##$PHC1= 4.932673
##$PH_mod= 1
##$PKNL= yes
##$PPARMOD= 0
##$PSCAL= 4
##$PSIGN= 0
##$REVERSE= no
##$SF= 250.130017351101
##$SI= 32768
##$SIGF1= 0
##$SIGF2= 0
##$SINO= 400
##$SIOLD= 32768
##$SREGLST= <1H.CDCl3>
##$SSB= 0
##$STSI= 32768
##$STSR= 0
##$SW_p= 5175.98343685301
##$SYMM= 0
##$S_DEV= 0
##$TDeff= 65536
##$TDoff= 0
##$TI= <Analysis number 999999
Compound Code 99
Book Reference 9
Project Code 9>
##$TILT= no
##$TM1= 0
##$TM2= 0
##$TOPLEV= 0
##$USERP1= <user>
##$USERP2= <user>
##$USERP3= <user>
##$USERP4= <user>
##$USERP5= <user>
##$WDW= 1
##$XDIM= 32768
##$YMAX_p= 552717259
##$YMIN_p= -253858
$$ End of Bruker specific parameters
$$ ---------------------------------
##NTUPLES= NMR SPECTRUM
##VAR_NAME=  FREQUENCY,     SPECTRUM/REAL,   SPECTRUM/IMAG
##SYMBOL=    X,             R,               I
##VAR_TYPE=  INDEPENDENT,   DEPENDENT,       DEPENDENT
##VAR_FORM=  AFFN,          ASDF,            ASDF
##VAR_DIM=   32768,         32768,           32768
##UNITS=     HZ,            ARBITRARY UNITS, ARBITRARY UNITS
##FACTOR=    0.157963299565203, 1,           1
##FIRST=     4115.29639959171, 0,            0
##LAST=      -1060.6870372613, 0,            0
##MIN=       -1060.6870372613, -253858,      0
##MAX=       4115.29639959171, 552717259,    0
$$ Real data points
##PAGE= N=1
##DATA TABLE= (X++(R..R)), XYDATA
$$ [...]
20228 478384 440662 462279 398628 313256 239662 254743 309511 323236 247008 146156 123066
20217 123066 143558 202199 231194 235662 210043 112214 103085 165397 158282 117471 87930 56873
20205 56873 61976 69300 77642 116790 136903 112172 159004 156215 118276 61847 81929 59450
20193 59450 76193 91320 88715 91183 109105 131698 129977 97105 162655 187784 186943 212461 224990
20180 224990 169096 162820 186348 261355 330097 379361 481961 489913 545600 580768 622820 674986
20168 674986 712684 683550 604868 534882 573216 637297 591832 570936 519015 456078 442845
20157 442845 433113 349258 261737 241558 224550 181746 250342 231658 236988 256265 294123 246985
20145 246985 167808 151867 165886 132042 85723 153963 198842 174633 192407 150329 161728
20134 161728 219039 259540 195706 193940 187098 132129 134592 178595 179165 141539 194500 266075
20122 266075 243180 199217 199617 178345 170115 207474 184544 119443 136474 207477 172797 120403
20110 120403 163091 178654 152403 122539 75221 75310 103355 120438 137336 138815 129614 161502
20098 161502 146715 164152 106888 77863 98569 79223 77921 129932 173953 159267 141662 112718
20086 112718 108959 131044 151652 115230 108641 80490 99500 116762 142669 217238 175155 192337
20074 192337 204281 210993 223930 258172 276996 292154 397319 514252 604060 769475 904882
20063 904882 925080 878971 773917 687261 560049 395357 338950 291691 240428 268330 305490
20052 305490 350961 343409 246027 179286 169489 121072 135376 138101 165607 116582 135530 202535
20040 202535 144323 129148 58316 59599 136372 175704 205053 216169 181947 193510 121766 60953
20028 60953 81646 148956 178606 232278 238261 181802 141352 96796 148391 171519 167952 196945
20016 196945 194910 211933 171942 170488 193732 112297 97682 122084 119641 99663 58092 57434
20004 57434 93242 128404 94911 34822 64199 40587 13174 30148 100084 149015 200266 204070
19992 204070 206587 190390 165136 147155 149846 125559 103322 146468 140533 193643 223929 154964
19980 154964 160177 232598 260656 289615 245368 219122 241392 188240 138987 152406 225610 216692
19968 216692 187095 207568 185449 161187 99496 79853 126336 134918 86120 81516 54714 49033
19956 49033 91184 133096 165545 116878 83169 131124 152855 131202 77298 47853 63908 68909
19944 68909 97209 98226 54789 85270 147072 177818 223934 172230 140666 151702 164588 150486
19932 150486 193041 135513 155555 224922 249680 279206 318639 313237 300138 222501 121576
19921 121576 58501 67141 125239 120213 187771 222615 201825 168320 123173 145958 150614 149628
19909 149628 182654 195139 149461 155709 180995 165083 170410 171466 174099 158575 155179 212897
19897 212897 206423 168856 152380 138841 180277 204492 176592 135073 126172 149327 214021 275413
19885 275413 268349 209078 172073 129865 117520 194447 254122 298228 321307 312365 332988 367767
19873 367767 391199 405516 408755 381902 359230 368007 365638 318099 332256 358448 378792 329297
19861 329297 340394 388295 354026 330437 318277 303593 279397 253271 251245 279623 345391 427750
19849 427750 391108 424621 446137 464941 480953 473314 444655 380367 365026 439553 461940 378622
19837 378622 346830 378017 352950 298456 258909 285961 315356 330630 310109 300985 329246 366783
19825 366783 341428 324415 332572 338153 304364 263799 283819 304536 335588 400649 369914 353711
19813 353711 333760 290501 356930 438085 401577 374424 328185 355701 357016 342767 332998 350498
19801 350498 326489 288202 288018 311156 349589 381743 464550 507570 495870 471174 440438 387417
19789 387417 354325 418470 510617 492488 456838 462264 504469 509018 536062 567392 574760 576492
19777 576492 572433 481671 438042 509974 526325 558891 556573 573918 550197 528251 471952 414125
19765 414125 405076 455166 462126 472188 443678 459728 530682 575522 559697 579545 603257 616766
19753 616766 661615 617019 590351 611720 624122 638924 623638 647323 670297 682134 744514
19742 744514 789339 825256 796026 822117 839200 813016 802229 897898 1014724 1095176 1064017
19731 1064017 1045413 1043982 1098350 1133686 1164823 1188498 1204338 1257651 1330524 1342021 1378283
19720 1378283 1444563 1474742 1399617 1345998 1331793 1413131 1568751 1628334 1637538 1642712 1649458 1679696
19708 1679696 1724847 1753840 1756193 1777653 1819631 1828467 1871075 1902353 2034069 2172746 2231177
19697 2231177 2250826 2340976 2460765 2565156 2663642 2706414 2750275 2845073 2990584 3149696
19687 3149696 3237867 3372349 3473623 3552102 3737105 3976338 4149365 4391299 4612435 4812987
19677 4812987 5028998 5378165 5714614 6023542 6309857 6656176 7011303 7393186 7754561
19668 7754561 8249905 8822785 9476246 10209965 11013330 11869993 12896640 14121532 15613218
19659 15613218 17260391 19232903 21703912 24592090 27948686 31917588 36525594 41718331
19651 41718331 47506691 53721274 60299125 66996698 73535837 79668115 84972524 89264669
19643 89264669 92277130 93837062 93964189 92496286 89799939 85926665 81030917 75598276
19635 75598276 69769253 63928183 58237632 52902833 47990112 43612473 39899429 36732348
19627 36732348 34044511 31769202 29804679 28213878 26905898 25739519 24761271 23875340
19619 23875340 23109902 22503589 22002215 21599834 21375752 21178952 21083280 21183020 21401846 21914867
19609 21914867 22710459 23825353 25312006 27230204 29770332 33023260 37146181 42349906
19601 42349906 48647402 56057152 64446275 73604465 83134052 92417066 101013237 108201109
19593 108201109 113392308 116214412 116410824 114026397 109313009 102616078 94453052 85501080
19585 85501080 76314632 67389181 59182162 51824311 45577603 40257206 35870642 32271936
19577 32271936 29341204 26941699 24881976 23177775 21724201 20506419 19418682 18438072
19569 18438072 17619191 16822471 16065003 15377657 14778431 14210789 13682540 13140663 12629907
19560 12629907 12171654 11661394 11113695 10634956 10130626 9658940 9202032 8711764 8230393
19551 8230393 7680103 7234265 6845266 6447603 6133155 5822599 5478291 5154179 4894756
19542 4894756 4615105 4338075 4123994 3892081 3689849 3489439 3338763 3250807 3157546 3060714
19532 3060714 2905138 2755791 2582402 2516708 2466743 2402583 2330000 2241024 2175659 2122873 2097268
19521 2097268 2056220 1983008 1953930 1921884 1886079 1886551 1807141 1720474 1692132 1625334 1507332
19510 1507332 1442765 1429529 1428180 1352907 1291861 1254938 1188435 1120286 1048313 989186 1003174
19499 1003174 1008539 969980 942482 902718 854946 895085 902367 832568 826609 865250 858412 819158
19487 819158 872557 849966 794883 819507 837899 812121 804939 769854 752793 788590 801057 775532
19475 775532 772797 739740 750856 843622 877250 825382 840586 900399 840329 817837 868226 894685
19463 894685 900068 797699 769282 756483 704255 659155 652367 613956 624393 658007 689025 647339
19451 647339 635233 640796 588022 610001 579290 537381 595460 594560 580975 590492 598320 618031
19439 618031 588909 542433 516405 552480 569662 562824 576677 557461 535828 499662 515623 527572
19427 527572 507585 498946 470571 466336 455354 463265 436235 468521 511430 515262 577683 651650
19415 651650 678900 711624 707906 651834 608861 556450 599477 624266 701823 751638 809734 781549
19403 781549 685699 664475 710623 689150 689604 689798 633532 611305 599344 617507 620815 581094
19391 581094 515060 448766 475799 451328 440467 467370 505752 483572 409016 398436 408472
19380 408472 403522 330663 291259 236414 215470 200655 267569 287943 331064 391905 410190 408832
19368 408832 485325 501364 471998 443988 425423 355801 408270 511962 552773 583970 588878
19357 588878 634229 581542 505909 466819 515215 476535 393124 451995 437984 398148 389284 401170
19345 401170 364198 331103 342511 303683 299938 313357 338423 299544 308202 310752 340767 360562
19333 360562 297276 309267 359007 347457 392487 396301 401876 394613 341928 335658 347525 350064
19321 350064 356750 322547 315388 337293 376175 305510 319466 329521 270892 263148 303835 311430
19309 311430 313104 311937 343535 360381 285544 302957 320267 284622 277888 326643 282304 243439
19297 243439 210879 149018 110299 157170 171955 227530 220915 186446 185623 256315 361209 460890
19285 460890 442054 448167 488442 486806 518175 606579 635114 614034 570163 525713 494457 498045
19273 498045 536120 605044 651544 664952 659988 676524 735943 798659 786194 779124 732643 662354
19261 662354 661307 604325 565997 573211 623482 705644 725519 721860 674642 650309 688378 665883
19249 665883 589031 546062 459174 403896 368742 402799 389081 332675 290733 280271 294879
19238 294879 303916 285715 295096 319156 330080 431212 434937 329126 270514 305034 356623 312974
19226 312974 332013 331843 284627 248903 242219 295688 336135 360947 414877 420342 375551 232422
19214 232422 159390 145309 176384 232299 259064 255207 297282 347081 383038 422044 428213 374497
19202 374497 336774 378030 344896 308365 330662 370237 393605 351060 314909 324527 319410 352931
19190 352931 333009 336218 415959 462466 462196 460875 422004 400898 376421 397309 313752 243576
19178 243576 238251 197200 242643 292698 304135 292168 377891 351917 280406 275550 244337 219291
19166 219291 194378 215374 247632 231579 246271 219836 212516 270196 295737 337373 335433 308757
19154 308757 217190 283553 366320 419212 423844 421036 419159 388193 425766 434635 448316 512267
19142 512267 538475 568824 617854 703054 814537 862073 902905 934096 888387 784409 731753
19131 731753 681279 620375 600358 543898 420960 359240 379057 359172 352030 408397 434628
19120 434628 440857 452389 380607 278592 224776 261705 313145 331526 321021 354492 382621
19109 382621 361599 353208 386550 375479 388428 364114 299776 268590 246530 258210 261150 252629
19097 252629 276245 257131 279737 350655 400838 410559 443208 508390 536392 584550 612782 630044
19085 630044 656052 663734 629751 543144 488472 462750 428634 412865 429839 422895 359457 314883
19073 314883 298253 221985 257596 296146 316579 367646 365170 315282 249076 229305 172710 162783
19061 162783 223297 229556 283032 392125 404891 434831 417699 463680 452484 425298 479047
19050 479047 531585 618046 685126 690707 709727 793828 842160 847047 858702 822103 786725 771004
19038 771004 715505 692500 723511 705990 617528 641958 596027 503220 568328 624777 578549
19027 578549 529011 568979 604114 632720 591283 589286 620673 673186 733532 757033 788991 761850
19015 761850 861340 927531 960807 940163 949740 986963 1020863 1007544 919753 887308 963489 948460
19003 948460 927167 883926 871603 810960 741233 680349 704373 749475 741834 729576 696231 687773
18991 687773 690978 675849 733499 800456 752311 708206 719759 741317 699887 695122 699313 681282
18979 681282 672931 654091 669022 702781 644812 577512 611073 594009 619535 723592 715236 688114
18967 688114 674543 673447 751305 800102 793519 804806 819289 751008 787324 821752 771185 757037
18955 757037 777423 813144 880544 890860 870718 827294 781266 883627 891260 850144 888979
18944 888979 908817 899479 853495 805057 831840 888822 865752 908940 900261 928928 1000135 1107204
18932 1107204 1207970 1313084 1402026 1522198 1626233 1638766 1728857 1794923 1865198 1928543
18922 1928543 2112691 2331343 2533511 2643044 2720581 2882265 3100995 3256916 3496627 3824591
18912 3824591 4291779 5064342 6207981 7808699 10187487 13824544 19729961 27103360
18904 27103360 31477764 31689261 29877116 27716461 27523601 31320956 39609445 49692628
18896 49692628 57422158 59843999 55140729 47032990 38899390 33316908 32085635 35306343
18888 35306343 40298448 41353990 37689016 31635959 24789968 19259328 15745841 13731705
18880 13731705 12462597 11553188 10810630 10236540 9746530 9415324 9291398 9280555 9356285
18871 9356285 9460528 9602389 9599058 9572424 9563319 9776044 10085656 10703534 11815759 13453131
18861 13453131 15885904 19682803 26105422 35758744 45202079 48457842 46779809 43178728
18853 43178728 40444806 42108831 50074683 63442239 77035158 86312853 86272187 76629145
18845 76629145 64084102 52918374 46671728 47261999 53672887 59549461 57888900 50659177
18837 50659177 40713183 30819410 23613992 19237842 16532323 14699771 13394214 12276648
18829 12276648 11399242 10771823 10295255 9888799 9572896 9329278 9057210 8616270 8142022
18820 8142022 7703164 7246528 6843465 6612318 6402066 6186727 5929588 5594793 5254413
18811 5254413 4876391 4536893 4250361 4011284 3801143 3653104 3525705 3388807 3259832
18802 3259832 3152607 3030795 2885621 2753286 2651686 2656902 2630010 2623091 2610977 2643037 2645632
18791 2645632 2653958 2662935 2704413 2667261 2596764 2627712 2760693 2904126 3097220 3346212 3669014
18780 3669014 3872059 4009602 4261942 4523802 4705802 4909590 5219501 5748307 6458082
18771 6458082 7452540 8876843 10858718 13886814 18299085 24933478 35108528 47520762
18763 47520762 56553123 63077361 68631584 67628653 61353336 54641656 49517041 49616276
18755 49616276 56004029 63007659 67583121 72854682 76633333 77880491 81627644 85113871
18747 85113871 85193785 86389193 86076146 79128965 70016933 61723286 56800824 58619069
18739 58619069 65044432 68929903 70618378 70839389 65407294 55830189 45731372 35851656
18731 35851656 28125098 23113116 20003346 17878446 16373930 15266888 14497950 13863901
18723 13863901 13250866 12595634 12027124 11493390 10941620 10375599 9789738 9232808 8747577
18714 8747577 8297956 7920798 7519239 7178440 6889833 6526900 6166701 5868172 5569437
18705 5569437 5359069 5126763 4916648 4684600 4451301 4322077 4272294 4078460 3873294 3785210
18695 3785210 3713581 3555535 3431372 3389724 3290950 3093430 2977287 2960537 2917950 2966966
18685 2966966 3048825 3130357 3185582 3368934 3618065 4012658 4733260 5739285 7144273 9201646
18675 9201646 12226159 16797996 23698084 32487604 40722344 48988488 54941185 55253734
18667 55253734 52541735 46823218 38024018 29535925 22302704 16774623 13127596 10813072
18659 10813072 9304472 8308125 7568483 7003620 6571709 6310656 6138220 5973772 5863527
18650 5863527 5815475 5765886 5757404 5791261 5801674 5856654 5905426 5874016 5776396 5603674 5427295
18639 5427295 5259859 5165174 5055971 4990252 5088701 5259225 5588145 6021367 6792602 7917206
18629 7917206 9505116 11804832 15313617 20579508 28189571 37519290 48314521 62179289
18621 62179289 76464342 87389969 96501455 101338346 97364518 88873364 77512844 62637147
18613 62637147 48660663 37208020 28272532 22190042 18241095 15662225 13830483 12459025
18605 12459025 11395801 10582286 9926187 9462586 9114425 8817122 8628920 8574389 8584427
18596 8584427 8651923 8641886 8595088 8556703 8489171 8272585 7977944 7673291 7339598 6969289
18586 6969289 6632712 6399530 6313448 6321078 6438550 6754592 7350847 8376056 9902240 12129227
18576 12129227 15588165 20861147 28717173 37925224 46251338 54610610 59376304 58354116
18568 58354116 54628798 47498563 37856243 29132413 21865546 16375426 12790347 10601191
18560 10601191 9172661 8095591 7307384 6703821 6194087 5815531 5517075 5296071 5119834
18551 5119834 4958823 4897549 4888949 4932227 4963340 4955187 4903220 4875766 4816028 4682251 4555516
18540 4555516 4382646 4170439 3949096 3661231 3394891 3103166 2831919 2599736 2401600
18531 2401600 2327506 2245682 2105550 1938255 1842896 1792032 1743353 1675314 1650620 1596018 1545820
18520 1545820 1487760 1446260 1391581 1382316 1355050 1253598 1273016 1303351 1255187 1260640 1269316 1233433
18508 1233433 1189486 1202978 1197649 1170894 1170338 1164695 1156492 1135726 1105572 1085159 1095227 1129910
18496 1129910 1163312 1216234 1230537 1251227 1234409 1245909 1314750 1467938 1557087 1581951 1417504
18485 1417504 1294556 1236280 1205261 1210607 1179387 1184317 1191836 1279764 1298424 1270118 1239320 1156471
18473 1156471 1098916 1153092 1222044 1330623 1322967 1300762 1258621 1268790 1244074 1301492 1363841
18462 1363841 1444783 1442745 1393878 1365019 1351239 1353934 1367651 1373379 1363466 1321522 1296767 1294287
18450 1294287 1328147 1362386 1373601 1345564 1424682 1488869 1619248 1697633 1696642 1755378 1886178
18439 1886178 1926331 1980004 2083080 2220578 2464296 2678828 2878690 3071810 3369850 3725427
18429 3725427 4175901 4702544 5473260 6480426 7707269 9509883 12336923 16555254 23191326
18420 23191326 33611281 46089083 51805042 49945244 44725327 38535644 35802412 39024073
18412 39024073 48147003 56455476 55781020 50303777 42498277 35826401 33787255 37137922
18404 37137922 45462691 53472952 53962625 49907960 43578930 38141890 37061929 41608034
18396 41608034 49826595 52968412 48731765 41001100 31397708 23548964 18622806 15721211
18388 15721211 13874002 12578716 11625164 10883041 10257276 9823138 9575053 9316835 8979531
18379 8979531 8796280 8768188 8807396 8980789 9387651 9937096 10847176 12403401 14808781
18370 14808781 18555252 24613515 32642444 37349101 36522030 33164563 28657270 25840492
18362 25840492 26692557 31486542 36964591 37369202 34249678 29461347 24964978 23172785
18354 23172785 24816944 29930181 35892953 37112009 34663004 30486639 26329505 24823256
18346 24823256 26934145 31909819 34657442 32355679 27528726 21338163 15874896 12358322
18338 12358322 10279174 9004932 8168048 7584804 7082720 6661006 6315508 5969858 5658508
18329 5658508 5389269 5201138 5012837 4764637 4568624 4313247 4030575 3860293 3710086
18320 3710086 3594346 3419394 3276147 3081934 2909816 2798215 2579104 2407399 2263836
18311 2263836 2168321 2066246 1948753 1843118 1742271 1663269 1517138 1439460 1384171 1243353
18301 1243353 1158551 1107052 1074035 1023869 962551 962169 920613 877043 870538 898773 845768 817461
18289 817461 780573 706995 672815 644565 627571 651219 613062 584163 634483 601777 536031
18278 536031 473562 455444 462404 446669 455737 522078 473601 434777 431953 400620 412491 423776
18266 423776 430210 385606 346524 352875 331614 350896 333013 249532 259112 273355 337691 332219
18254 332219 316531 339001 294124 299401 333226 370369 360143 370242 422565 508566 547979 660375
18242 660375 816760 925523 915780 895490 902794 879266 831721 834377 838634 824927 908409 953419
18230 953419 1007939 1005530 995738 992015 936955 932422 965791 950025 931224 978422 958403 906975
18218 906975 904961 958491 1013060 1039910 1033533 960105 857233 770691 664383 600492 624827
18207 624827 657646 647851 667179 702521 671152 649722 578387 501336 513364 555846 558156 575934
18195 575934 625583 563918 519453 556125 524102 466030 488141 503955 518906 560874 549587
18184 549587 570801 585314 589213 619918 648876 640361 656249 649123 611696 585401 538487 564503
18172 564503 615251 587356 580923 580390 619802 585757 496749 531208 596872 652695 617926 575231
18160 575231 533089 496015 489474 536611 554277 556239 576317 572388 536263 532390 505337 533947
18148 533947 655226 718547 786746 846254 861332 934710 936377 867518 854070 854921 803405 795986
18136 795986 724244 701801 743897 752444 742038 764250 807657 845975 921860 1000912 999781 1058130
18124 1058130 1170467 1286937 1427633 1637346 2008288 2513017 3261880 4280807 5764476
18115 5764476 7837858 10866943 15443798 22262156 33446189 53641169 83494337 96736815
18107 96736815 87938528 71261649 48580700 30364094 20022649 14682338 11647123
18100 11647123 9710118 8436624 7641498 7023402 6525718 6056661 5639139 5291925 5021398
18091 5021398 4739734 4446919 4219064 4098380 4057951 4019046 3917228 3920011 3849900 3676446
18081 3676446 3396115 3151262 2929561 2762655 2592514 2415755 2226144 2113586 2005989
18072 2005989 1902035 1773171 1633144 1554879 1407692 1302533 1234170 1142088 1072795 994493
18062 994493 978084 972007 885138 839841 743080 698290 618545 591744 655757 666608 699634 729049
18050 729049 692299 691686 702538 718069 713225 674663 630582 587780 532717 450737 403897 403088
18038 403088 395540 378882 342667 267631 259345 234342 216600 248554 271091 228763 109112 106160
18026 106160 129351 139210 154341 149788 189259 218132 179719 182193 239653 270644 278614 251381
18014 251381 172089 151203 133901 74265 66047 62976 40034 55709 99208 110326 102846 123367
18002 123367 143205 231048 293918 378457 383198 318368 224922 210959 217768 209168 239252 250175
17990 250175 182970 108220 91267 102987 124102 107036 31853 89961 202624 269982 298898
17979 298898 354965 393699 416191 399733 378194 332922 237937 200778 180533 142938 116213
17968 116213 67147 109895 143967 147184 147411 184135 130936 105694 129723 153890 179155 263203
17956 263203 279550 199400 175801 188201 217701 229090 192566 179746 139350 133118 133375 180472
17944 180472 208989 195487 231538 207553 204336 211441 174624 154333 151491 184388 218607 248670
17932 248670 262883 269603 230084 188035 231050 187447 182977 198265 233652 156740 56166 46393
17920 46393 96125 159896 193096 133917 159818 138657 140697 197272 255434 250386 275762 287933
17908 287933 257284 205761 178963 182462 254602 313275 334427 312342 331733 327652 255757 221489
17896 221489 210047 204509 219500 192873 233958 248806 293296 365730 358432 349825 312366 368651
17884 368651 396986 397155 433321 424310 421771 442148 435762 439674 414126 327728 233574 224528 160111
17871 160111 106407 84995 112138 76841 52069 85537 82198 56645 66275 107176 84983 68500
17859 68500 128652 117556 65343 41950 78042 97191 94310 105727 113718 228390 306105 278834
17847 278834 213212 189070 180188 142957 219962 278443 269385 234058 155697 116219 195804 247418
17835 247418 209295 192506 259506 278473 205616 158843 159437 188784 173291 108125 100372 57850
17823 57850 7479 54374 99349 92180 50044 57960 105215 126399 55160 20032 27059 29068
17811 29068 10289 -35551 -62860 -19818 76462 75745 78395 146482 164011 149227 152752 94874
17799 94874 74032 48136 -55169 -50812 -21179 6861 32474 -28340 -61922 -9562 -3867 -30224
17787 -30224 13456 46689 69446 116917 117638 102536 130803 162334 67610 56306 100178 99090
17775 99090 29501 -22964 -13720 25316 19248 -27947 -32418 -6390 8258 -3258 -15011 -40201
17763 -40201 -33565 -34800 -45836 -36156 19636 51298 -1741 -62861 -54437 -58567 -74650 -76492 -99186
17750 -99186 -115912 -66001 -31894 -12982 -32396 11229 22807 66119 92483 88020 10829 -22287
17738 -22287 -24383 805 60545 89530 145602 222802 193451 184603 146656 80446 33009 18859
17726 18859 61626 84456 77957 109266 197008 138978 102896 94744 72611 1273 -30793 14423
17714 14423 102464 154260 113881 90854 94528 98319 55469 29669 60188 63138 52449 51115
17702 51115 36807 34428 40499 70359 15061 24113 24905 35801 62544 38760 47400 23708 57277
17689 57277 125168 131018 111488 54934 -16677 -62555 -55110 -6558 -22866 -75618 -122477 -28966
17677 -28966 88210 117168 124388 72936 66007 9646 25189 10641 -4920 -29892 -5576 27304
17665 27304 40719 85470 116908 113985 127728 133973 126319 87146 62476 28666 -10582 102525
17653 102525 141519 95877 48856 13483 9321 -281 -3801 28810 32465 -13598 -84443 -81247
17641 -81247 -80976 -78254 -79935 -108642 -88667 -50034 -26720 -25795 -92724 -68920 -29763 -5677 76436
17628 76436 139511 175864 133550 108679 82531 45688 42821 34392 66455 51554 8351 7386
17616 7386 -5412 -1274 43742 8463 -62504 -37959 -17690 -25631 59632 43814 -263 -49221
17604 -49221 -51080 -36771 -89972 -68069 -9348 8053 30552 29693 28497 53462 81146 95251
17592 95251 29962 5793 849 -1317 -77093 -38637 -28417 -30229 62260 96728 44911 13039
17580 13039 24406 -4376 -3329 -2444 59187 30165 36791 28723 6017 -79817 -146654 -103698 -52299
17567 -52299 -80749 -117880 -102948 -30659 9160 47048 42546 22908 8246 24394 7108 -25475
17555 -25475 -23878 -42796 -31112 10096 -24325 -72998 -57218 -3172 76257 79572 67335 15448
17543 15448 -24262 -15895 16662 51362 103735 99984 123803 155341 129452 62722 -12641 -33031
17531 -33031 -52782 -80126 -93167 -52192 -31299 -59222 -63794 -45376 -38064 -74557 -63962 -27825
17519 -27825 -15999 -47134 -76341 -55386 -93432 -95587 -141514 -166751 -179478 -137083 -91899 -66321
17507 -66321 -49347 -14314 38335 53069 15844 698 22107 106290 89943 39162 4910 25309
17495 25309 22925 9951 -52066 -87963 -94291 -109705 -113529 -85191 -65124 -74453 -92805 -65992
17483 -65992 -680 14576 15464 69451 14138 -57364 -66568 -73592 -97125 -47859 15603 -3379
17471 -3379 16781 4796 35445 33057 -20179 -24004 30850 25251 33843 8144 -3311 -17261 -9280
17458 -9280 17335 -11362 -40470 -34812 -24785 -43773 -36611 -29500 -30744 -13636 40326 143782
17446 143782 279233 365263 405182 485251 580628 463866 335235 219033 181959 179242 136179
17435 136179 127676 98145 67566 65331 84594 94865 117847 104596 26436 13733 16573 45630
17423 45630 99515 55709 49011 17158 -33041 -24929 9681 -9667 -22928 -3575 20646 -41652
17411 -41652 -29905 27797 31288 16026 -17536 15475 45777 53990 -6483 -4977 33728 31593
17399 31593 32897 65066 27171 12118 -9361 -131 -17344 26137 9137 -18078 -51719 -76627
17387 -76627 -57572 -33855 13070 -3533 -1125 -48177 -61208 5384 -5545 -25041 -79519 -156888
17375 -156888 -221535 -222282 -192721 -157142 -123623 -47935 44974 43085 25284 -2417 -34470 -38010
17363 -38010 -40469 25720 73335 61983 71611 74954 45651 3728 -17102 -17567 29597 20275 24380
17350 24380 59653 52605 -7717 19753 50298 39555 6036 -28264 -36874 -30859 -36736 -14010
17338 -14010 -46892 -54487 -69974 -108767 -99307 -77408 -78709 -21004 13878 -5060 -66941 -101467
17326 -101467 -79155 -47687 -63681 -109867 -44773 -12933 39807 63126 70496 14508 -33117 2163
17314 2163 14047 7596 21360 -15230 -5924 -15635 -8333 26627 2189 20854 58535 33601 -50917
17301 -50917 -41441 -20943 -7668 21807 -13010 -15558 49685 8959 26948 114716 64741 -37515
17289 -37515 -30430 11372 -5731 -16307 7920 -47974 -47514 -37309 -55182 -85927 -41849 13889
17277 13889 -5481 -40388 -37256 -77472 -40329 -11667 -14998 37082 60016 54092 -19899 -57506
17265 -57506 -62294 -45553 5203 67017 32871 -60022 -102399 -66986 -31842 -37294 -15491 -16382
17253 -16382 39746 55921 62935 53361 2645 -91562 -60953 -71823 -65626 13985 32223 -16122
17241 -16122 -81148 -88754 -46215 -2054 -54080 -111303 -71911 -75211 -64786 -30720 81440 41805
17229 41805 -4645 45464 25619 -10828 9877 20318 15352 10014 -33636 30513 61532 54259
17217 54259 34610 64114 91039 97490 119540 128458 62112 -19198 -25742 -72133 -33821 -39875
17205 -39875 -41243 -45795 -38687 -28673 -33320 -45427 -32026 -65035 -77268 -129638 -93404 -50336
17193 -50336 12969 -4923 -30728 -51716 -98048 -143715 -113704 -122984 -157595 -164859 -144596 -138857
17181 -138857 -117057 -24573 4491 17460 55510 73855 54509 20205 -6016 5811 15811
17170 15811 33447 -17041 -22382 11773 61083 76741 47906 -24 -12945 -43561 -20129 30389
17158 30389 16101 29455 52005 124926 86406 6826 -48604 -85421 -79621 -37792 -65940 -79536
17146 -79536 -81057 -146804 -120274 -99106 -83641 -113629 -114117 -92347 -62107 -41238 -126923 -149905
17134 -149905 -83520 -35143 60471 39314 -34436 -45227 -84735 -98920 -87802 -57004 -60832 -38756
17122 -38756 8953 44375 -11320 -45250 -40402 -51449 -53730 -31521 20718 22009 55158 52446
17110 52446 -121 -30708 -54962 -3125 47409 -60 -34355 -25812 -58496 -116476 -123622 -149333
17098 -149333 -135873 -75844 -86454 -106036 -138284 -129098 -98432 -27370 -14736 15104 -65326 -73628
17086 -73628 -21879 42021 -15986 -38256 7846 59036 90997 54362 9542 -12927 -20611 -26985
17074 -26985 -9335 46244 57446 15491 -19295 -52880 -116083 -132853 -110727 -96434 -100079 -87122
17062 -87122 -65454 -35387 45581 37094 -11120 32782 15781 15900 -12496 6226 15658 60405
17050 60405 95294 56455 -4587 -53525 -34430 -90327 -68150 -21989 -75359 -119290 -70143 -69065
17038 -69065 -95232 -56829 -24433 -30662 -82278 -75971 -85876 -89113 -22459 -24325 -91561 -58126 -106564
17025 -106564 -134913 -109419 -96845 -144667 -166426 -171251 -114910 -61108 -37054 -17131 -16826 605
17013 605 2305 -44020 -370 -30950 -44404 -23266 -6046 -31958 -40526 -48077 6240 22827 -23153
17000 -23153 -105859 -117288 -70163 -3653 18575 24916 -17751 -67745 -33242 -38412 -83244 -52771
16988 -52771 -24228 -38116 -83860 -72454 -93750 -86253 -111777 -85818 -57242 -25708 -28628 -7954
16976 -7954 30906 63622 17902 -22684 -30545 -29798 -49834 -76520 -27203 -8393 -82496 -62822
16964 -62822 -36443 6435 10091 -28428 -3395 -33902 -12649 -22767 -32825 -28547 5834 17798
16952 17798 -13045 4733 403 -5258 -36543 -67442 -65267 -56848 -30198 -31244 -18822 12069 8678
16939 8678 30004 14696 4050 -6179 17276 -12405 65 5267 -3920 -22413 -60406 -67585
16927 -67585 -99218 -86126 -67454 -60264 -66678 -79641 -42200 -1241 18063 10068 14135 39498
16915 39498 5757 -38243 -78303 -29353 -66013 -99344 -45565 -12011 -62159 -94419 -93724 -29519
16903 -29519 14970 43849 -7380 -90864 -70742 -19186 -38864 -75059 -75517 -118777 -117861 -93916
16891 -93916 -98757 -106385 -67954 -78363 -74712 -33614 81778 90239 79972 64767 44858 30062
16879 30062 25208 -29300 -48132 -128736 -140120 -121642 -109905 -111963 -81112 -80419 -92671 -132196
16867 -132196 -163419 -130383 -96505 -83814 -1284 20301 -69599 -91364 -24965 -8184 31550
16856 31550 29100 27347 45394 33982 -10576 -33353 -38672 -75418 -36401 40578 34096 -2589
16844 -2589 10625 66666 68760 96602 75712 30458 9179 49602 66980 106198 83561 25602
16832 25602 285 -45158 -82083 -91267 -112591 -140431 -126570 -27424 12752 -20451 -17604 7134
16820 7134 -10697 -3553 1623 16562 -54946 -96256 -94590 -103685 -100652 -93121 -82946 17488 -15445
16807 -15445 -51637 -56591 -22410 -20632 -41123 -62599 -105473 -150238 -129953 -91476 -82802 -101041
16795 -101041 -98343 -53659 32577 53100 38854 34035 66763 110878 103602 37688 30420 63051
16783 63051 75537 76185 12300 -7506 -28782 -5780 31642 57825 74112 76263 26818 8839
16771 8839 -46005 -81128 -73642 -67949 -91556 -103448 -50514 -57244 -90743 -38946 -1345 -16330
16759 -16330 -15163 -25797 -96375 -112184 -81552 -12350 -29441 -58263 -83800 -86309 -74055 -80089
16747 -80089 -56221 -70926 -85929 -60777 -38775 -78638 -63155 -37086 -2775 -14757 -17044 -14682
16735 -14682 -50634 -27134 -8329 -25491 -34770 -11619 -39178 -37993 -40904 17167 -19638 39186
16723 39186 52867 6756 -15526 19879 40363 -5033 -12350 -8119 33441 10645 -28855 -104401
16711 -104401 -82841 15779 -40936 -73867 -65303 -65925 -85220 -120171 -81372 -33968 -13193 40532
16699 40532 52173 -30185 -117579 -166077 -97034 3488 -1152 1945 -2236 -77621 -130457 -115601
16687 -115601 -98021 -45792 13414 14451 -69041 -36491 -34841 -46097 -83576 -71600 -9399 -7744
16675 -7744 -23769 -9282 15207 68130 76538 47321 -20032 -12508 19158 32450 25035 4070
16663 4070 -15149 -10877 -39585 -50756 -74644 -95462 -53698 -6791 16046 64248 57141 56726 -16246
16650 -16246 -10023 17675 23282 -10498 -4244 -6941 11315 24189 10965 49468 44880 -12036 -19960
16637 -19960 -11251 42222 36401 37226 56221 42940 17648 77305 -23856 -90438 -62562 -52733
16625 -52733 -86390 -76909 6929 10151 15778 -23766 -133773 -137792 -74998 -10682 11520 44299
16613 44299 53013 46308 82396 103180 62644 33241 -11238 -51627 27959 59805 -9370 -93452
16601 -93452 -91291 -56926 -43538 -61674 -96484 -56631 -10692 1356 44995 4204 -16459 -45512
16589 -45512 -80341 -77420 -67050 -74716 -41416 20457 -15647 -29893 -54030 -46527 -10051 -17664
16577 -17664 -47161 -53531 -77082 -108647 -93147 -111204 -103269 -109991 -73119 -79344 -84550 -83452 -44980
16564 -44980 13758 23389 -28333 -12928 51596 43548 18826 3551 -24523 -5431 -14969 -73436
16552 -73436 -137948 -93473 -69021 -10193 -41929 -124477 -117164 -107971 -49970 -30335 -70011 -83475
16540 -83475 -66698 -65072 -67179 -42362 -17546 -19122 -17332 -7411 -40592 -3624 -22696 -46662 -70611
16527 -70611 -81127 -80105 -86727 -67865 2014 -3569 -7412 -3407 -35639 -17490 14261 -52477 -65802
16514 -65802 -41044 -25598 -47166 -54738 -12055 20050 45376 88778 64426 61509 27242 805
16502 805 -32788 -44005 -69558 -47049 10746 92920 61810 91673 101897 84170 97891 53244
16490 53244 6740 2705 23705 76517 53878 36397 -10283 -13935 -55820 -39771 -36312 -31931
16478 -31931 5528 -6299 -47805 -79115 -73130 -58037 -131935 -109842 -53389 -63941 -31667 17038
16466 17038 -9624 -75466 -37069 -45166 -13923 -26288 -26101 -99806 -147562 -109617 -56166 -59796
16454 -59796 -87111 -85167 -55295 -16129 -2038 -30221 40423 36196 48443 18556 81610 58692
16442 58692 37110 28977 -16706 -41858 -4921 -42325 -46558 -35463 62626 107493 45558 8101
16430 8101 -21755 37911 42936 -11667 -17315 -60096 -76239 -56972 -41882 -37321 -64694 -45714
16418 -45714 -51719 -93002 -86182 -82081 -28728 -42537 -102732 -75797 -71868 -98794 -135927 -76787
16406 -76787 -30047 -76668 -37536 -27303 -9393 5911 -1986 23008 34768 -3159 -31017 19899
16394 19899 37955 -2903 -25705 -19319 25838 12514 35763 -10726 -48072 -121159 -52443 34860
16382 34860 8292 -12948 4897 -6111 -45625 -120454 -97220 -38685 -50055 -6323 -6496 -20233
16370 -20233 10957 -22502 -12272 49713 21905 -9463 1029 43025 81796 76978 70412 83827
16358 83827 44947 55954 43208 10971 -26552 -27644 -23481 -36868 19837 19562 3550 15836
16346 15836 -66205 -102156 -146978 -168581 -164646 -144591 -139440 -116076 -50522 -8259 -62037 -53890
16334 -53890 -38385 -47017 -65327 -34596 -42160 -35094 11062 56337 31066 -9340 -73723 -86989
16322 -86989 -51904 -8639 94622 71103 49752 9858 25029 12874 -2480 4712 53981 82218
16310 82218 40579 1609 -49411 -50052 31827 44513 37366 41838 31758 -2792 -3185 6493 -57353
16297 -57353 -71330 -104141 -64306 -99163 -7020 24484 -38699 -51533 -3726 14699 -12658 -4987
16285 -4987 15394 9252 -8254 -41280 -59961 -86790 -111585 -119206 -64406 5812 55022 64014
16273 64014 12139 11595 -619 -68826 -57413 -13325 -58380 5316 -33085 -131423 -108158 -81197
16261 -81197 -103461 -60406 9629 38876 5337 -41707 -27003 13629 15921 -73547 -80150 -60823
16249 -60823 -21142 -95255 -91926 -81078 -40346 355 -42465 -122500 -92236 -30948 -20424 -6008
16237 -6008 56934 70174 6934 -48433 -56177 -45989 -25469 15916 14565 21437 40532 26926
16225 26926 55037 67230 96986 87380 65831 39702 -10187 -37572 -13586 27961 51788 97351
16213 97351 58028 30829 25979 -35773 -81015 -78301 -15646 26437 5283 22053 21776 9207
16201 9207 20753 21202 80841 137329 59600 19680 30892 825 -25356 -63297 -88747 -55752
16189 -55752 -25408 -19909 -38531 -53936 14460 35881 78454 73065 73685 50514 72637 39460
16177 39460 -22328 -33594 -14205 -9038 26287 15399 -8453 -37282 11772 47097 -54412 -95732
16165 -95732 -70019 -86455 -101383 -78682 -77972 -84829 -27767 34772 101934 71545 -30465 -2011
16153 -2011 -19804 -32578 -50945 -35128 -4435 -27179 -82020 -136831 -104505 -109583 -91162 -49093
16141 -49093 -36323 -52509 -31012 -7270 -41171 -40149 47573 112702 65251 -36794 -46522 -58954
16129 -58954 -53761 -35418 -35936 -71551 -101252 -92118 -28987 5022 5980 32553 17262 -16659 -20037
16116 -20037 -673 19310 7316 20462 18240 -14078 -3654 -24277 -36609 -52214 -25113 -41529
16104 -41529 -28076 25745 710 -36699 -34265 -23796 -16709 -44252 -65812 -106339 -144449 -153065
16092 -153065 -145221 -73467 -31324 -32475 -28729 -73629 -73250 -15896 12484 -18853 -62050 -28468
16080 -28468 -19833 -43835 -55842 -6797 40884 21842 -57835 -116904 -108089 -84575 -16073 -9285
16068 -9285 -12202 9265 -17765 -5930 51777 58810 29899 63747 130626 62322 -6331 -39225
16056 -39225 -34637 -20995 6121 -5697 -32794 -24812 -55252 -78766 -105485 -61935 -49929 -14072
16044 -14072 5469 20976 22888 -21297 16596 26573 55521 100146 74369 74720 34793 -67671
16032 -67671 -73721 -34710 2772 15311 -26791 -36422 -38635 -8710 -42891 12215 81711 76877
16020 76877 -38848 -60838 -53353 -8813 -6034 -64982 -47482 -59583 -59093 -61585 -42568 -4714
16008 -4714 -34005 -57287 -48517 36976 57957 10411 6102 28863 24869 42239 27248 33702 -53875
15995 -53875 -18297 3497 -30662 -60865 -47798 -8468 46001 85032 75497 60769 105545 83837
15983 83837 52603 14447 -57588 -99496 -133378 -134920 -119813 -128262 -83829 -103459 -82098 11705
15971 11705 14158 24577 32780 -17571 36758 81378 64363 35714 67664 59351 11349 -31377
15959 -31377 -45908 -63317 -48630 -43542 -25381 -52274 -39714 7489 28505 35610 -19293 -17668
15947 -17668 -40211 -91939 -55044 3117 12238 -47599 -42952 -12423 -33964 -101768 -83979 -11362
15935 -11362 31044 59615 -2194 -59578 -97476 -86855 -68695 -46937 1083 42384 7520 -24435
15923 -24435 -3840 62168 38807 -43055 -42784 5168 -35980 -63580 -54225 -65401 -28971 41873
15911 41873 13380 -42474 -70245 -86362 -78697 -68642 -118899 -154487 -144455 -96650 -79009 -49716
15899 -49716 -12800 18296 57197 68552 22166 -4013 -2258 25615 67893 50747 46996 -3279
15887 -3279 -19167 -19235 -23808 -45765 -84666 -74613 -30323 -34036 -63927 -35791 7232 24094 55173
15874 55173 24962 57344 66043 31015 -15090 28572 122551 130599 84755 43563 47267 6245
15862 6245 -17111 -13240 12636 -44194 -37619 -27979 -14781 -10074 -60302 -61822 -72183 -39841 17028
15849 17028 24690 29687 8915 -41174 -39410 -45549 -36803 -53728 -50583 2626 23688 29845 -13683
15836 -13683 -4291 18910 -44682 -81803 -78387 -43677 7329 4484 -5694 15965 42288 30282
15824 30282 52811 20958 -20951 -18801 11597 31951 7163 -6329 -31775 -3677 19351 -63407
15812 -63407 -73335 -94291 -92751 -41795 -55713 -67191 -56230 -29666 -25440 12443 -93859 -179755
15800 -179755 -178884 -157469 -112780 -109189 -113885 -87877 -58255 7509 15627 -30913 -28337 -59901 -11376
15787 -11376 -15529 -27380 -17694 -25270 -3440 14245 3650 -59470 -66793 -52570 19972 91806
15775 91806 116628 100254 91656 40122 80073 114948 70039 30352 32536 5624 8344 -3172
15763 -3172 1725 -36696 -40926 -20775 -15641 -18901 -27204 -65413 -53114 -6190 -35764 -91776 -55109
15750 -55109 25248 48523 43275 30306 -851 -35739 -65146 -70416 -69314 -793 -12272 24416
15738 24416 27398 58870 93191 73007 44175 -10492 -7392 -22519 -7196 31795 27690 -32405
15726 -32405 -16626 28784 14369 -1013 -911 9904 59134 30526 8076 44629 48862 33674
15714 33674 25949 46137 -12258 -17830 15012 41449 18127 29880 40080 57232 57458 54900 7332
15701 7332 31937 14086 11261 -12898 -58467 -44977 -56876 -2879 27119 77897 72952 59740
15689 59740 35624 -4361 -30809 -85986 -108130 -134266 -131396 -100342 -43880 -6497 -16546 -58301
15677 -58301 -48655 -36540 12156 -30737 -113421 -127256 -45626 42405 31554 13516 26073 25846
15665 25846 -23461 -49858 -52002 -63198 -25720 -58066 -14783 -7115 -19085 -63924 -94871 -74408
15653 -74408 -58105 -63447 -68909 -56010 -56599 -3247 33600 -4698 -62597 -52983 19476 84324 61813
15640 61813 58538 34012 -8519 24708 13557 -44835 -109913 -120170 -87392 -40705 -63304 -67429
15628 -67429 -38698 -37497 6021 45614 -3096 -56461 -3747 -25152 -72894 -82112 -61382 -94344
15616 -94344 -51529 -86889 -183996 -182226 -124731 -45037 6711 35030 18146 -18042 -71612 -79205
15604 -79205 -58614 46591 79002 60233 74674 64730 46362 34364 32865 28162 -33822 -69763
15592 -69763 -13116 29659 90858 47499 19864 34012 48335 43492 38645 72545 83563 39303
15580 39303 11064 44576 40544 -11196 -25784 -19001 -12023 -34879 -91757 -52118 -51890 -32798 -60528
15567 -60528 -98090 -112122 -82876 -22570 -45981 -18234 -39941 -46234 -63117 -80171 -42209 -12739
15555 -12739 -18076 -31548 4350 -55744 -7907 42962 -18209 -16841 -28999 13222 45471 56918
15543 56918 68418 79597 35724 65154 30008 -28000 -81725 -46860 19604 95082 90032 81079
15531 81079 133802 175863 140917 58950 -11601 -48909 -65147 -39870 -18356 -13830 -41051 -37064
15519 -37064 47843 42090 42365 49891 63035 44164 -8995 -69948 -72529 -17643 33379 2040 -14087
15506 -14087 -12257 -11858 -441 -1883 -36853 -56735 -75863 -85312 -56464 -55002 -63840 -28419 -51572
15493 -51572 -88450 -81008 -34714 -77490 -114436 -104399 -44844 -29413 20998 -11297 -24931 39464
15481 39464 44302 -22974 -97895 -118215 -153749 -150279 -160444 -174964 -157903 -119484 -127329 -69833
15469 -69833 -10119 22402 23252 28880 26484 -63491 -66976 -49990 -16783 -73667 -80155 -44340 -16292
15456 -16292 -42000 -48674 -70723 -104635 -57198 -57679 -77397 -96525 -139709 -133304 -130698 -72289 -33465
15443 -33465 8772 35237 -10750 -27236 -50101 -46917 4681 4995 17387 16399 8701 -71 -19263
15430 -19263 -49003 -101202 -84941 -361 12251 -24895 -89812 -78238 -1811 65991 -14 -42647
15418 -42647 -26348 -11281 29452 56311 91496 83370 83640 65089 59470 36364 74328 49471
15406 49471 -6668 -53927 -40567 -8618 -23030 -19614 2436 42117 95036 57948 4662 758
15394 758 19732 48848 53220 37627 39110 11063 16511 -36034 -111129 -74643 -37023 -35374 12127
15381 12127 35720 38476 80300 63570 21591 22481 19695 12638 5919 54988 81626 26829 -59059
15368 -59059 -66239 -71554 -40599 12973 38734 29676 -13723 -33251 -53682 -55232 -66983 -86270
15356 -86270 -104003 -9931 -2072 -40939 -74378 -67553 -17997 40860 58790 39672 -4115 16544
15344 16544 94407 86603 48496 37152 13401 45320 46814 22660 18617 8878 -8049 29554
15332 29554 41622 -6220 -3448 57943 2711 -25996 1758 -5227 8631 352 -11811 -373
15320 -373 -25629 -72924 -103987 -95620 -71245 -138866 -97496 -63088 -11477 13459 56464 53389
15308 53389 33200 90045 96475 53024 -5120 -72491 -76248 -42746 -54160 -46088 -33523 -4791
15296 -4791 23416 56503 37149 -7050 -10894 8942 16467 51099 70379 17731 -34159 4759
15284 4759 -27069 -37756 13992 21039 20095 20601 3561 52060 93250 62797 26508 8536 -10324
15271 -10324 -5179 40813 42380 18891 -23776 -58894 -71258 -61095 -50159 -44916 21556 13752
15259 13752 -6362 -23307 16262 2606 -10777 -16037 -26944 -9217 9561 52730 67835 42630
15247 42630 16444 48172 -13627 -52680 -74070 -90284 -116732 -83316 2721 -13368 18168 60254
15235 60254 111472 57099 34786 43591 69185 40181 13161 -5018 -44676 -60943 -77753 -70649
15223 -70649 -31418 17610 2454 -13794 -7429 -2871 -45228 -44916 -22044 45216 41340 48230 19366
15210 19366 -11410 -2155 43344 49560 28401 32022 76209 107186 59015 68501 36224 5436
15198 5436 60881 88161 91262 101788 158837 114886 31671 -476 13178 26288 29736 64627
15186 64627 -16022 -73257 -53509 -43863 -57701 -5204 31551 38701 44985 43214 20203 31000
15174 31000 68750 63435 53890 -49333 -89836 -75160 -131535 -181814 -124991 -43931 24222 11796
15162 11796 -41392 -80899 -82180 -65100 -47010 -19308 -16498 -21775 -37629 -23459 -38618 -25209
15150 -25209 -33714 -43964 -48291 -33001 -50469 -77555 -88246 -65420 -28314 -13459 -5448 19098
15138 19098 84 -6028 -57919 -111312 -72095 -47113 1812 -30624 -38640 -62158 -80965 -11056
15126 -11056 41140 8634 4664 80043 52049 14453 -9648 -4202 -2003 14949 6094 -24424
15114 -24424 -35487 -77427 -99687 -117707 -119857 -111469 -47276 -48721 -26085 -32515 -37800 -4556 -5446
15101 -5446 -20834 -389 46977 32323 4193 -10268 19791 47754 32381 17802 24837 -40761
15089 -40761 -14595 38252 51564 -17063 -77475 -33551 -13361 -36349 -42751 -33721 -76431 -79500
15077 -79500 18244 24779 21597 -50198 -60741 -57133 -76298 -95144 -72635 -32345 42284 77291
15065 77291 77215 27492 -34868 -40756 -15932 5583 -16468 60150 100637 104050 44301 8969 81217
15052 81217 122565 121129 120254 98643 49490 30971 47332 4356 -31910 -3910 -29168 -64700
15040 -64700 -68367 -54665 -25793 -26149 -12465 -46238 -28984 -13299 -13705 -4862 42211 86127 89227
15027 89227 60911 16467 22690 59991 85655 97041 110372 59056 36645 10414 44822 30511
15015 30511 32686 63136 47228 -27139 -69217 -71117 -62790 -798 45089 47074 -6027 -1262 57551
15002 57551 129068 130975 226212 366940 493712 626479 1013555 1691134 2606859 2919588
14992 2919588 2653754 2144348 1513472 973418 613022 450966 363798 335988 316373 238622
14982 238622 149509 118046 116565 106906 112062 126542 139855 165544 158165 88714 70173 67375
14970 67375 73401 169010 152345 147514 109340 54745 82453 81179 36118 23484 22921 36255 80288
14957 80288 60322 20257 -1617 22975 57761 20918 3374 -3224 12407 15055 8290 57259
14945 57259 36289 -19908 -67541 -101777 -75341 -15539 361 -30008 -65191 -112100 -127558 -68625
14933 -68625 -45393 -38207 -38494 -20375 -17479 -29925 -8394 28716 27011 42507 40555 79756 94507
14920 94507 49679 44381 78560 58011 17430 -60030 -89774 -65946 -21996 13331 76957 58467
14908 58467 37168 43456 15481 43225 11166 -18188 -82504 -71897 -9411 -4233 20516 50210
14896 50210 92048 54735 -16640 5583 -25495 -83389 -76804 -79714 -47722 6460 12487 -25316
14884 -25316 -12916 -29460 -53290 -82341 -34818 16585 10457 -13400 12147 85108 97626 62835
14872 62835 26673 -38117 -78328 -86134 -101455 -63391 797 -12975 -47536 -82421 -127523 -119521
14860 -119521 -43841 68892 42615 27793 29719 18763 -64445 -96810 -58481 -33343 -20609
14849 -20609 -12654 -5537 8630 22318 -19959 11087 25951 20432 9783 43561 82380 73102
14837 73102 70768 53622 30338 -6435 4438 74719 74903 71642 52470 23839 16552 -16873 -39976
14824 -39976 -78781 -25222 -4780 -60494 -75140 -60510 -77125 -80403 -85683 -73775 -96880 -131939
14812 -131939 -142757 -117005 -74972 -50779 -67592 -86180 -162216 -132968 -99798 -59937 -42698
14801 -42698 3882 20303 -27208 -57540 -37499 -25020 -52697 -57484 -21175 -5425 29738 55175
14789 55175 107782 87979 59406 92585 31837 -7549 -7414 -32424 1789 67363 41227 -12333
14777 -12333 6144 50264 14641 16485 30576 3887 -87911 -65444 -23018 -32793 -44607 -37296
14765 -37296 10335 48827 -18022 -37749 22532 64280 61369 48646 46876 49010 52963 -5483
14753 -5483 -47429 -61115 -43359 2562 51477 64553 43075 52482 -3363 -49273 -83691 -119492
14741 -119492 -134755 -137724 -76640 -48239 -51684 -30044 -67384 -88741 -28285 -24455 -13243 -27308
14729 -27308 -129283 -123451 -127928 -162325 -127462 -61683 -58978 -69949 -84376 -76058 -34657 -16366
14717 -16366 -30722 -64898 -66382 -105671 -106281 -57054 -9878 39806 92208 155874 184626 102697
14705 102697 81595 105287 52991 41023 91222 111551 74347 56109 31978 -8758 -1871 40957
14693 40957 91110 72871 32683 73745 102150 12360 -11643 -12604 -65855 -68905 -31889 -18939
14681 -18939 12550 -13361 37914 71283 69106 44158 63535 63957 93124 58073 -22869 -43203
14669 -43203 -35470 -18512 24460 45322 5873 -30905 -84466 -87925 -133357 -143587 -84658 -61060
14657 -61060 -9069 8708 -11753 11262 24843 24979 54307 7744 -28181 -19366 -27049 -29977 -14312
14644 -14312 -20461 -8934 1358 -49198 -86410 -45026 -2661 31837 -25432 -113586 -109020 -46850
14632 -46850 -28010 -7006 -11219 -9749 11048 -42640 -67852 -27096 -34307 -41038 -51564 -118489
14620 -118489 -144277 -42353 35535 26577 25662 -44296 -69001 -91469 -82636 -41920 15994 17327
14608 17327 -49551 -77489 -21562 -30575 -12149 -16672 -6712 -3838 59385 73548 60524 72223
14596 72223 40363 -17806 -17948 -34814 -78271 -72460 -72099 -63046 -113678 -146045 -60897 -20307 -122899
14583 -122899 -90909 -99922 -106987 -51216 -14015 -5820 -34975 -55565 -50541 -53494 -59996 -68531 -50535
14570 -50535 33689 55083 28887 25134 646 -2824 -10245 -47200 -52811 -32009 -40279 -797 11834
14557 11834 -5187 -55576 -48130 -16203 -7224 -15243 -44093 -48868 -5453 15713 -12984 -15690 13774
14544 13774 -26281 -46164 -26745 -26695 -15242 32523 25402 26303 -15340 59083 62532 18744 -70751
14531 -70751 -116671 -61301 -11585 38913 63595 16164 -70721 -66544 -89557 -50018 3046 17501
14519 17501 11844 11180 -58264 -94450 -108742 -70678 -34546 -62755 -76293 3801 20630 -12452
14507 -12452 -5587 52726 15829 -88988 -84862 -51924 -38053 -51904 -26193 -27123 -37017 -57009
14495 -57009 -21339 -599 -1916 10171 -15056 -2039 1199 -24244 -14953 -6422 -4386 29664 -16602
14482 -16602 -58756 -48971 -24288 7040 -5159 -60261 -64256 -17093 56847 85895 39205 -610
14470 -610 -26687 -33551 -7273 33049 -7326 31544 73244 145279 132898 130644 84636 -1977
14458 -1977 -65829 -100660 -78755 -39519 20813 76305 64646 37823 -10037 -54546 -60744 -13855
14446 -13855 -17517 20472 25267 -21711 -37137 17617 17442 -1949 -20606 -23230 -54234 -103686 -77765
14433 -77765 -43310 -16720 -30374 1284 25671 117142 146020 157452 88770 28921 30753 6090
14421 6090 -217 -8605 -10471 15700 15729 17762 -28581 -48630 -42060 -37824 20329 49001 27371 1330
14407 1330 26818 80289 52723 1559 -14637 26631 65540 39990 30847 39589 44799 59362
14395 59362 18136 -23380 -11966 15630 -13406 4776 -1959 -66463 -73822 -46790 1327 -9407
14383 -9407 -8027 -40340 -31625 9623 69204 22718 56678 74442 46258 -53319 -91163 -26984
14371 -26984 37336 93510 105592 35933 -31417 -51411 -39306 13113 11888 -77869 -92277 -82370
14359 -82370 -69156 10970 11581 22488 40041 68785 65583 27146 52197 47026 29471 26567 31859
14346 31859 30822 -2498 -33469 -60666 -109945 -88268 -49989 -48871 -28235 -64502 -102078 -66493
14334 -66493 -43429 -59016 -16156 -50405 -126716 -113953 -36335 -7914 -19680 -20764 -5025 191
14322 191 6670 9370 -49485 -66056 -15950 29770 43433 51923 15271 39127 91611 116835 60134
14309 60134 69911 109904 135726 130835 130732 116083 80972 61215 -7233 -22057 25299 51257
14297 51257 74295 27145 -8842 22045 39389 37270 15871 19475 62130 39832 29171 -57311
14285 -57311 -119177 -102930 -72532 -25373 38055 23093 11499 10398 22885 25930 45278 62129
14273 62129 69494 74373 45409 -1512 9201 -1097 -460 -14561 -3727 49556 -2810 -42950
14261 -42950 -38497 -60600 -33787 -12191 7160 -48144 -44672 -69258 -57620 -38053 -37272 -72909
14249 -72909 -79072 -36148 29724 -7799 2841 66574 75563 133189 126284 108050 105702 56376
14237 56376 -3986 -97633 -111809 -76399 -10759 -7371 12671 84900 2186 -19969 1391 -38532
14225 -38532 -44115 6034 43770 72909 64535 87502 98780 54876 27322 11264 -25012 -3467
14213 -3467 -61220 -36487 7638 54214 48814 -2249 -5372 4508 19987 -8680 -19992 54445
14201 54445 59016 1029 58350 81073 73981 59534 43793 38090 78469 28645 11160 30238
14189 30238 186 29159 59022 66726 40297 18247 -17620 -7717 -4621 15519 -20989 13844
14177 13844 28828 56604 36926 76529 77869 32025 8934 -6678 23876 -50954 -28850 -18600
14165 -18600 -52706 -94040 -60026 42234 24763 25819 7145 19014 -25681 -59936 -26883 18710
14153 18710 21711 40132 72254 89568 99940 153627 97610 69227 53993 74765 34234 47548
14141 47548 50459 32843 55988 16365 -17399 12589 46383 103546 77644 56744 83717 65393
14129 65393 7671 -18492 -62131 -44785 17417 -5237 -19641 -17935 615 -22136 11162 57398
14117 57398 58574 9864 88 -21477 -27687 -37668 -28613 -3703 -2973 -9527 45814 25495 3681
14104 3681 17781 -14848 -44217 4928 47248 65846 72405 69833 34516 62963 41545 -12423
14092 -12423 -27102 -33182 -8757 72186 112741 55024 -200 44672 74737 59464 36178 24987
14080 24987 50105 44819 28411 1454 5755 3951 -73914 -80072 35894 16332 -2106 -49090
14068 -49090 -99352 -70470 -70659 -75457 -22946 -740 -13928 -6085 -42283 -4966 -36471 -74326
14056 -74326 -60276 -39215 -27796 15132 30464 68902 84453 54965 61848 60661 37961 -12859
14044 -12859 -6690 15119 20688 12649 -69715 -50244 13258 25372 -9928 -4391 24480 -3867
14032 -3867 -44682 -61351 -82776 -41992 42255 41621 27121 79615 50767 -22257 -12919 45922
14020 45922 75867 84085 27375 -559 -13673 83570 141171 133337 117965 94146 108010 72664
14008 72664 14669 8801 25908 15938 40875 46895 15703 48780 69819 31410 13131 -37514
13996 -37514 -57972 -50208 -53090 -41346 -41571 -62293 -53006 -22312 -3558 -28795 -4054 -70769 -107219
13983 -107219 -122211 -121171 -69920 -66558 -124649 -166871 -112762 -71763 -30420 -22296 -14222 -50490
13971 -50490 -39296 -67644 -126248 -174400 -176184 -105880 -36410 8466 -31070 -99859 -65576 -4364
13959 -4364 -3107 -24165 -18057 -11864 -31433 -34295 9569 29741 24953 22943 35357 49563 23043
13946 23043 -4834 -1688 40558 11792 -24940 -37538 -76362 -66817 -23292 -32524 -34138 -12952
13934 -12952 15951 -16401 -41249 -7256 -22675 -70387 -90518 -79763 -65370 -43225 -66882 -69877
13922 -69877 -74749 -67346 -49094 -53378 -22122 -9247 7366 -5637 16142 17249 6789 -22526
13910 -22526 -26508 -63804 -78495 -42005 -83513 -94329 -65430 -42245 -15724 -96963 -85780 -18861
13898 -18861 43079 64533 46016 16752 6925 2178 -51597 -112697 -98877 -74260 -58432 -70138
13886 -70138 -61522 -50791 10663 63685 89354 -11665 -48707 -34617 -30720 -36455 -72604 -25330
13874 -25330 -18510 10089 24967 11611 -5018 13010 27291 33717 51419 71949 96713 43084
13862 43084 34820 -2912 4780 43533 38613 52884 62810 77596 52073 -20931 -51482 -45171 -27747
13849 -27747 -41721 -46623 23779 46037 9956 23055 51564 18108 40296 14514 -25508 -20838
13837 -20838 48117 52926 6002 -21647 -88849 -117029 -57126 -57512 -93797 -105529 -79800 -93758
13825 -93758 -84636 -62894 -13440 15209 55418 56887 -12296 -12417 -44143 -49125 -17394 -15761 -20312
13812 -20312 37537 59903 -4704 -77819 -29172 10832 -17911 -3208 10480 -6853 22350 44167
13800 44167 52421 53947 52412 9842 -29784 -5353 54219 111944 101196 23198 39009 40247
13788 40247 33537 33454 31442 55098 21463 30188 -17483 -62199 -25176 -31503 -49216 -49261 -41420 -20465
13774 -20465 12795 -11153 -42693 -28608 -5443 -11965 -21140 -11909 -38087 -4363 50871 51143 32601
13761 32601 6257 42304 112645 121475 129985 69986 14459 -40956 3822 46706 63140 56438
13749 56438 -6988 -50120 -44381 -63241 -57221 12662 6470 -5796 6559 -37243 -44412 -53048 -980
13736 -980 28521 8579 13748 55205 48646 35501 -29570 -2849 39627 20236 -25327 -45960
13724 -45960 -70410 -27000 -1339 -2789 -17759 -40379 -56889 -23843 11617 25474 93917 85230
13712 85230 88975 78211 63831 29148 57788 44109 28038 27421 61322 37665 45758 -8766
13700 -8766 -45417 -51728 -101668 -56913 -37307 -28986 9438 21811 25133 6897 -1590 -25403 -23859
13687 -23859 -36222 -44145 -78630 -73096 -61638 -50566 -7861 4446 36434 -2070 -27912 -37836
13675 -37836 -7181 28555 15419 13783 -15424 -7331 13252 -40201 -14293 -6616 -42327 -30996
13663 -30996 -15774 19089 6827 1243 -39043 -82884 -49788 -54313 -46892 -61744 -33432 -58132
13651 -58132 -92205 -117920 -85530 -27921 -33629 12437 30368 22421 -7926 29952 51731 -24311
13639 -24311 5164 38975 28366 8019 28545 61951 -13582 -77881 -72473 -34678 1694 86826
13627 86826 66396 52323 -2406 -25451 -22391 -15771 27436 21726 34929 -74627 -73782 22214
13615 22214 51720 -6467 -16123 39426 53252 98205 124548 69370 49657 36106 34032 39778
13603 39778 70544 70211 100915 -20929 -51237 -17786 13004 12937 -31611 -37974 -30565 -8541 -6265
13590 -6265 -17275 -20048 19602 66797 69431 58759 111490 100430 74262 72980 61243 -33691
13578 -33691 -88917 -116693 -85351 -41416 -15640 30195 73960 97321 140997 66939 -29479 -103097
13566 -103097 -125101 -24477 117723 151291 170631 119207 12822 -62738 -118239 25258 84557
13555 84557 69430 7536 24908 11725 -15802 237 -1510 22572 23816 11220 30791 36013
13543 36013 8104 -20449 -73560 -96683 -113916 -123706 -90539 -40910 -20544 -85701 -134572 -105594
13531 -105594 -56747 -42598 -21994 -9087 -54740 -66730 -104028 -156506 -114662 -58254 -38185
13520 -38185 -77926 -88748 -70315 -89949 -94763 -12580 25241 40915 10984 26282 -3841 -18092
13508 -18092 32820 96032 123501 64224 39465 39682 -39888 -97304 -95720 -26293 7684 16408
13496 16408 47944 38943 -6148 20207 -2494 -53338 -9456 -31705 19528 89688 73884 8635
13484 8635 -25359 -7145 33280 18452 21754 -20597 -82265 -52577 -57316 -28025 -18164 -9690 -16207
13471 -16207 1773 81742 64561 88747 98726 49585 37548 12891 51859 72145 31227 -32499
13459 -32499 -84852 -62924 -33336 -53326 -56021 25892 21298 -13655 -64392 -74799 -59692 -36146
13447 -36146 -8227 57211 28117 -27249 -17617 -19117 -19743 -27731 -71129 -80714 -46798 -12155 -43209
13434 -43209 -57902 -5097 42249 38210 22489 -13483 -44458 -49559 1543 16519 52684 112996
13422 112996 76171 25568 -13264 -20808 -53683 -59249 -78022 -84442 -67043 -60583 -66142 -36309
13410 -36309 -32819 -56569 -86925 -106142 -65842 -14982 34647 38563 62167 51414 62035 10383
13398 10383 -27620 -63002 -108809 -81737 -56062 -46161 -11278 31649 17805 -27059 -75764 -27911
13386 -27911 75412 54943 37408 105683 78932 -30385 -62504 28913 34761 26657 22422 20102
13374 20102 22488 53440 -4756 -592 32347 13682 25725 24211 43418 -13609 -87475 -98024
13362 -98024 -107084 -126037 -83208 24236 34243 -54391 -75510 -29701 -31397 -352 83562 79315
13350 79315 71786 69691 66559 36281 -33943 -47471 -83265 -147183 -118345 -56269 -54749 -36327
13338 -36327 48300 56358 69211 29723 -3630 -28364 -84664 -89564 -143679 -53197 -11082 -15656
13326 -15656 -19768 -50812 -91066 -106763 -121035 -148790 -101876 -38292 -20914 -19019 20870 64315
13314 64315 48859 46690 93360 132248 86474 94681 92302 13146 -10954 -2079 12580 32563
13302 32563 -27491 -62507 -87249 -37899 29953 49903 59942 113351 125093 106418 147338 160430
13290 160430 168915 171322 147561 107614 50938 16649 -1746 24424 59116 23519 15901 29446
13278 29446 9042 33008 -8954 1312 51964 46496 -10328 -4572 -15238 -42714 -135953 -121037
13266 -121037 -48557 9144 -29415 -62141 -12880 32016 -26387 -54407 -36145 80657 122118
13255 122118 44837 -14338 -10501 -22791 -18516 -16903 38119 103083 180557 157923 113128 80236
13243 80236 52072 13281 -10782 81778 92779 -1422 -35499 -28076 27012 43222 40393 6183
13231 6183 44342 55234 104733 130991 140035 112272 117814 85249 35804 24470 -33353 -72361
13219 -72361 -64378 -79176 -69033 -45566 9766 54835 33884 36343 60084 48359 14738 31167
13207 31167 23998 -27486 5025 88636 126314 58983 14886 -9199 18198 12664 32485 60748
13195 60748 2358 -3135 71516 27357 -35944 -45202 -80320 -102159 -56197 -30253 27828 85742
13183 85742 49884 20735 542 17782 3444 -12113 25676 61310 27209 38850 31356 20193
13171 20193 16706 -7753 -41469 -31405 2324 26402 35883 44999 91677 59851 64267 108556
13159 108556 119899 133094 162714 168082 63929 33476 41989 21843 -12041 -2397 -31371 -57945
13147 -57945 -10662 22303 -75076 -131040 -157451 -143111 -112109 -62350 -13635 -4141 1781 -26419
13135 -26419 -28770 8651 -34553 -89047 -57593 -7305 78662 99977 103768 99851 66248 28015
13123 28015 35256 66397 49148 14890 14424 25448 17862 35553 98352 134232 139276 61679 -23343
13110 -23343 -74944 -66115 -69481 -70557 -17036 -24314 -3751 20012 68157 99621 70441 86793
13098 86793 29741 34777 45315 91666 95150 58067 17420 -9084 25253 30361 52466 75074
13086 75074 69266 36008 16367 51079 16764 -44416 1417 39908 40588 34889 50064 81537
13074 81537 99608 92693 59111 6273 -30490 -32065 -47031 -55692 -29810 -14191 -37377 -47511
13062 -47511 -2260 7355 49152 94489 111534 47111 52524 50530 52580 69777 86940 43653
13050 43653 15143 31057 21138 26101 -20817 -90323 -71467 -10037 38774 110803 152689 62745
13038 62745 -29358 -39227 -7415 18426 42767 75402 66994 5041 -13732 5171 38305 16304
13026 16304 -31922 -46638 -64494 -38310 15955 10962 -447 -5457 -28171 -42005 -46902 -51359
13014 -51359 -63774 -68007 -72780 -5092 -27486 -17736 23888 16962 8203 -3486 29182 26546 2366
13001 2366 -32589 -13276 -49252 -64498 747 -6384 -24282 25273 75835 105776 67442 9608
12989 9608 -42334 -35499 3292 -12870 -39588 -13299 -12108 -8963 -36713 -61564 -28970 -21041 -347
12976 -347 59071 34677 -1616 14117 50475 70331 52875 5187 -11002 -12421 -9977 25345
12964 25345 -48761 -77735 -55056 -21315 -75217 -66298 -56412 -23577 69791 63470 32154 15227
12952 15227 11905 21497 52744 76672 30584 -29045 -78982 -68962 -30653 6957 -7435 33652
12940 33652 48750 37544 -23672 -30334 -78701 -109987 -45679 15448 -31531 -43063 -70708 -106446
12928 -106446 -96842 -50828 -10295 -9325 32020 116471 80425 5161 -48152 -78221 -90035 -71608
12916 -71608 -93189 -66805 -63253 -124786 -144057 -114715 -150935 -103759 -45752 -30903 -82434 -90593
12904 -90593 -78200 -34404 -1913 -34611 -40531 -52221 -25784 -28564 -27993 -33770 -37845 3997 9285
12891 9285 -19703 -13094 5474 -2815 10067 45878 47837 5314 -63950 -54581 -6448 26783 2276
12878 2276 -44520 -47364 -65373 -73237 -69437 -60394 -45430 51068 53882 -35463 -101298 -83289 1084
12865 1084 84847 77343 46186 22409 97669 133562 146344 113656 69018 68802 27094 22572 21036
12852 21036 54164 58795 64570 56355 26411 26110 32262 58502 36842 -2631 -45634 -52260 53147
12839 53147 142744 259847 378235 369091 365400 337605 228686 83716 54958 65204 63962
12828 63962 83402 75825 79387 74614 66211 39236 75910 89706 84588 138976 171245 177629 165273
12815 165273 140462 159467 212090 162281 165306 240628 219152 242032 279015 234615 167830 98875
12803 98875 102468 126398 90323 40379 1644 -18443 65954 91312 99771 142955 111188 35524
12791 35524 39274 100782 71877 36464 23925 -16831 -32466 -15019 326 75256 115505 158714
12779 158714 155487 161016 195338 185185 151003 128006 120666 158488 169109 132548 173416 185164
12767 185164 176579 148299 141820 98328 48054 19087 52379 66549 77531 120416 182657 191015
12755 191015 115945 47749 -14514 -13009 10365 78596 88073 76321 116801 163472 244849 286563
12743 286563 282348 257669 285630 495491 821241 1280504 1885489 2589506 2887785 2715638
12733 2715638 2206890 1584519 1047965 677071 454046 322241 260777 223656 205741 203594
12723 203594 268934 279997 258673 216129 253727 259772 178877 138133 152197 176574 161094 112680
12711 112680 114535 133642 163837 173846 156644 115895 143325 116194 12626 -8122 -24087
12700 -24087 19801 6208 -32518 -5463 2980 -40800 -50654 3701 57850 29373 -38667 -68329
12688 -68329 -31190 18594 55649 98097 83354 82546 81999 68760 21749 -28710 -26325 66581 29029
12675 29029 -33554 -59629 -57446 -10251 28689 70172 99710 61761 42049 -27470 -49177 -65011
12663 -65011 -51987 -74973 -57657 29257 48547 17709 -27966 31955 66582 -8840 -41588 -42873
12651 -42873 -11951 52927 66396 17499 -37739 -58855 -21892 19048 8525 47814 24234 -19665
12639 -19665 33745 62121 75645 77879 36729 17847 46933 87821 46119 -17500 -72409 -501
12627 -501 32152 28032 -48858 -42042 -38677 -66686 -23227 -6101 19111 9401 -7615 37215 30777
12614 30777 42921 42875 35878 49516 22605 3119 11781 13564 -19756 10732 108156 128647 50994
12601 50994 60900 64961 90312 87471 63278 65389 78385 46963 -7245 -32076 -9583 20004
12589 20004 30430 49206 47647 82997 105807 19081 3852 18719 -174 17896 26936 27911
12577 27911 -40396 -62702 -52441 -49134 -100030 -96614 -15659 51028 33583 22202 12723 -11880
12565 -11880 -99384 -60290 -43052 -57638 -55012 -1550 -4303 31828 24324 -37219 -17075 26699
12553 26699 -8260 -73441 -103167 -92275 -78040 -131601 -102915 -84621 -27249 22758 -25352 -25615
12541 -25615 -40048 -20806 -15497 3805 3578 -5982 35974 39872 -16977 -70760 -80807 -78901 -85404
12528 -85404 -33721 21265 30160 18140 -10579 14433 -16047 -33401 -45999 -52255 -56047 -31621
12516 -31621 -11703 34575 36192 48425 50938 43209 65095 50211 58560 -8745 7265 76427
12504 76427 42413 -18893 -38646 -32839 -29415 -39989 -55735 -89257 -79787 781 43846 43855 22627
12491 22627 49062 62570 96446 44166 44780 29944 49746 20640 8290 20776 58017 19906
12479 19906 -2768 -1450 -6832 -65749 -81127 -64723 14189 9584 -1564 -8772 -49141 -81491
12467 -81491 -45026 1298 28363 59991 95441 65118 2074 -43574 -30231 -47237 -63715 -79665
12455 -79665 -74557 -129586 -156135 -137492 -88442 -87720 -106086 -52863 23992 68572 72497 55670
12443 55670 47500 -1281 2700 26687 61996 72454 -12862 -86802 -116395 -60947 -76443 -89711
12431 -89711 -37452 -18284 -13870 -2047 -11878 -52871 -126524 -64298 4802 14269 67118 107187
12419 107187 154783 114138 39073 -11904 -53404 -36224 14795 -34513 -73169 -69818 -21203 23797
12407 23797 -30599 7399 51281 132953 133121 127777 109362 107643 101092 77731 24563 -13071 -34561
12394 -34561 -19820 8311 37342 -3651 -12078 -22543 -14698 38542 16742 -23596 -49195 -41594
12382 -41594 -14154 -63947 -35953 30571 60478 51190 64288 22834 -10161 -43331 1019 43758
12370 43758 21826 41556 34045 49280 27818 -9246 -20376 -12934 50171 55677 11304 -54280
12358 -54280 -84678 -92063 -79227 -38786 -5780 -686 8267 -9433 -45499 -33011 -33480 -63487 -52159
12345 -52159 -38322 -101344 -74830 -63666 -24145 -6318 71019 73267 46673 9806 47873 20154
12333 20154 14089 38579 7816 -27929 -55496 -63250 -38255 -10815 12739 29966 38911 -46418
12321 -46418 -54557 -87820 -59515 -21966 -18212 -32297 18543 53823 47238 63832 90835 78052
12309 78052 27714 -33375 -54265 -15788 -85825 -127304 -83654 -14710 62859 86668 63609 59174
12297 59174 83464 49744 15202 -74861 -69179 -41255 -76146 -69138 -17820 45209 17912 2516
12285 2516 28479 82965 71855 34549 23415 23106 40904 -5635 17683 80563 68133 56681
12273 56681 33184 -10364 -69053 -97799 -78132 -38135 -35342 -40040 3680 20265 23760 22377
12261 22377 45505 36718 45101 -13734 -7365 19181 1266 4121 19450 51827 54371 17898 42471
12248 42471 29697 27578 44931 62197 6519 -34203 -33222 16470 14642 12374 20146 7444 -10499
12235 -10499 12292 14830 -21294 2658 38778 51485 1604 -48201 -46489 -95483 -78523 -50712
12223 -50712 -4798 2304 40097 78405 52021 56587 57096 36761 38758 48651 27487 24776 -18753
12210 -18753 -66613 -121336 -150065 -112133 -57505 -55529 2487 8754 -5419 -29763 -42692 41737
12198 41737 60767 -3284 -44956 -6443 77071 73035 -4445 -28047 -70721 -30412 40496 -53032
12186 -53032 -72772 -55760 -42819 5326 19989 6887 -1415 -31400 -23921 -48547 -61159 -33822
12174 -33822 20392 80382 43095 -5009 119 35215 81970 69721 86921 72654 26584 -41775
12162 -41775 -70204 -47078 -11299 -6649 -22264 20391 43230 2335 -35382 -33674 -48917 -35104
12150 -35104 -23380 -26076 -66427 -44307 -42608 -89878 -94325 -72400 -51604 27179 48080 -3618
12138 -3618 -6489 2412 -20888 -21927 56488 142983 128848 74210 -2336 26357 73402 98310
12126 98310 81164 32859 -46807 -18451 26681 -2967 38731 61677 13915 13518 32308 -27255
12114 -27255 -84003 -13775 -16046 -30613 -26716 -66211 -43064 -6307 23604 69546 36315 -986
12102 -986 28608 12455 38361 52086 58192 63706 29644 -6431 -20454 -48583 -9603 33196
12090 33196 66431 60043 67517 79806 69288 -2851 -42463 25471 24352 65525 75883 49082
12078 49082 -521 -25151 17785 64343 66454 99827 71576 3852 -27745 -14970 8846 5380
12066 5380 -2339 -61293 -68713 -78864 -112471 -120043 -87042 -37829 -41956 8585 12839 -14302 -46300
12053 -46300 -37384 15581 3494 -23658 -76793 -83323 -54567 35367 36388 25781 48735 78826
12041 78826 100128 65655 65639 56305 20379 22583 27369 -18473 -17769 -7498 8968 24696 51674
12028 51674 54106 106251 103929 85546 83819 77986 110479 78037 40438 47722 75934 115994 127194
12015 127194 48686 -39292 -36613 -40219 -17730 -35078 -26103 -2610 11063 21470 -7627 -20290
12003 -20290 33036 48995 -4001 12678 33398 24246 23157 -49953 -8471 20659 32104 17449
11991 17449 -15203 -58701 -30309 -38459 -45191 -97612 -50512 -44962 -76320 -45082 -23973 4284
11979 4284 36683 -13040 -13709 9060 18192 2219 36040 77791 650 -88182 -95918 -96927 -98239
11966 -98239 -42811 -17764 -1933 -4683 -47601 -24294 -9593 -67310 -81900 -19649 14245 52945
11954 52945 58414 52941 121240 130085 111923 79866 37228 3659 -10524 -2541 -3650 -21770 -36601
11941 -36601 -37393 -60131 -66145 -96600 -14757 3265 -38181 -67563 -106717 -51195 -38177 -53610
11929 -53610 -23265 -50458 -31413 -27683 -80605 -105038 -136532 -120668 -14826 20123 18630 -14900
11917 -14900 7187 52615 30430 91284 132301 118327 101586 89076 106334 53828 -20994 -21402
11905 -21402 -34722 16070 -14325 -20913 -3963 -39172 -96144 -32265 -46177 -43295 -37018 -17073
11893 -17073 -21279 -57533 -73195 -13185 25034 -12825 -51180 17206 61915 8240 -17128 7275
11881 7275 -2558 -27482 -49824 -24356 -37056 -9130 -14563 -36921 -26744 -15120 26466 91292
11869 91292 149102 116735 72753 86502 107870 102146 81855 84009 122093 108461 52166 -735
11857 -735 -29390 11133 32803 -2685 -2495 26390 44019 53692 92455 89018 87106 84231 56598
11844 56598 29607 8602 1003 12537 50067 48353 28439 58106 25990 -25268 -27565 -8197
11832 -8197 32407 14613 -37184 -55809 -46483 -28671 1310 31822 28379 -4034 -63362 -99982
11820 -99982 -58326 -33050 -11917 48113 36156 6271 -15126 -7503 -13879 -12333 -39672 -44519
11808 -44519 -75397 -63516 -39806 39380 34261 -15680 -32159 -25680 -70177 -47938 -73838 -88597
11796 -88597 -140454 -132285 -103342 -78007 -94450 -80049 -28278 -57666 -48078 -40797 -48306 -68375
11784 -68375 -102427 -51385 -34372 4490 11920 18823 29272 37778 23180 4805 19712 48031
11772 48031 39315 -54091 -102025 -144909 -114965 -52284 22280 75521 59461 1879 -68751 -67861
11760 -67861 -49091 -9617 32278 26835 -17886 -49370 -40514 -15650 1611 -16547 -41934 12674
11748 12674 -2020 9645 7714 -24499 -80888 -72332 -63006 -43182 19772 48371 -9002 10890
11736 10890 76326 48577 13384 -20318 -15734 -36006 -61135 -93660 -52236 -56949 -83128 -78110
11724 -78110 -75244 -8340 -20651 -61355 -71498 -55976 -18816 -22374 -38542 -52862 -90773 -95631
11712 -95631 -41267 -50768 -72050 -55435 22641 7526 -23331 -9736 -13562 -38153 3746 34444
11700 34444 40127 -12778 -76194 8513 91862 118090 48050 27046 10824 48963 74032 57582
11688 57582 19566 -23629 359 52134 22923 2720 17340 37300 -35560 -92478 -56756 20388
11676 20388 41218 21668 7315 -22264 -60739 -40976 -25292 27606 33166 17164 9385 -32453
11664 -32453 -10544 -9099 -30740 -86847 -60878 40001 21835 -32448 -85589 -15605 39537 22045
11652 22045 -46032 -29060 7072 29322 42426 -6140 -19985 -12110 -701 9653 20905 31933
11640 31933 1138 -33245 -71640 -43730 -29929 -36532 -69826 -66859 -65597 -55086 -74066 -72017
11628 -72017 -37279 -28206 -3398 36344 50916 38600 3419 27807 24425 7601 -43340 -115236
11616 -115236 -96452 -53929 63867 117477 117204 54443 -13006 -47814 -29188 -25406 18913 58132
11604 58132 39873 25727 -18732 8311 -6071 -35379 -24821 27069 -11111 -38016 -41906 -37821
11592 -37821 -40946 -30423 4910 -27930 -19306 9008 -13032 -3439 30244 38979 16447 39535
11580 39535 77734 49016 30983 61988 77876 46150 14543 -40734 -82375 -83494 -15053 26084
11568 26084 -11099 -14962 -18346 26931 50883 -6440 -39758 -76295 -67229 -32396 -19154 -13124
11556 -13124 -16122 20215 10320 56937 92305 74499 26579 -45679 16349 122176 74675 117094
11544 117094 124596 42152 -49068 -21089 15052 -14393 -75362 -34105 -52816 -23515 11531 51729
11532 51729 5943 -24584 -4865 -16565 6955 42968 42936 9634 -21848 -31194 -9476 -28882
11520 -28882 -41039 -13316 -3779 -124473 -84534 -7672 9661 15918 43790 81605 64267 -10448
11508 -10448 -24023 11249 73399 24202 60008 76348 60419 37668 80765 139304 161016 142939
11496 142939 167212 139651 15056 -13686 -7857 6338 -2606 -10821 17691 18644 25744 53974
11484 53974 49638 72223 54344 7948 755 29707 68017 54927 64240 11360 -26575 -40962
11472 -40962 -22481 -65226 -110905 -156335 -71447 25236 2228 11529 14299 90444 98540 78405
11460 78405 91308 53895 11418 3111 -7772 2282 35668 7308 -6035 -57509 -77379 -39610
11448 -39610 -29319 -2706 33123 4850 -33041 7805 38197 93660 97139 114234 116365 137610
11436 137610 94327 40353 17917 30155 62807 59924 95486 59750 -16991 25054 47735 -7969
11424 -7969 -34512 -64759 -24145 -10905 -23249 -14506 -6782 -44724 -87081 -99364 -56261 41267
11412 41267 78856 53575 55487 59814 -12154 -43701 -64222 -100130 -79886 -47488 33594 76631
11400 76631 15431 -4868 -27896 16131 20059 26432 29079 -24518 53513 106266 119145 69905
11388 69905 66959 70072 39747 30007 1810 -38802 -104990 -71784 -50558 -18396 6515 7699
11376 7699 50184 14409 2566 -5549 -11470 -24380 -44066 -505 50157 88729 42194 59845
11364 59845 34494 28273 -21731 -34317 -32038 -2143 17214 98103 121283 92143 76063 17474
11352 17474 -30303 -43508 -8798 -51552 -95527 -50059 -51958 6685 46566 80611 56448 -5399
11340 -5399 30628 37627 50396 66805 96932 89357 81675 69465 24795 9779 38355 16706
11328 16706 -16383 30537 58255 30286 55617 106779 82408 88932 62063 12650 99822 142897
11316 142897 79194 -26117 -70290 -56332 -48371 -10647 -21041 -34126 -27470 13283 26127 -6764
11304 -6764 -48842 -61425 -62727 -10542 26553 54491 15805 31442 111140 174486 153808 106343
11292 106343 106074 77896 149597 209905 200194 139887 122385 105437 55901 9901 -1630 -14220
11280 -14220 7749 19846 68109 47640 -9492 15746 35345 42296 44747 -9284 30295 20552
11268 20552 -59928 -56578 -17704 -42117 -81688 -52124 -24448 4289 24432 49377 64213 63553
11256 63553 98420 114272 100780 78628 57907 118742 82021 12464 55825 96269 116012 68522
11244 68522 65876 39227 32498 13751 53448 80812 26643 7001 -14491 37007 53937 27764
11232 27764 38178 101429 57389 -26620 -7445 -25835 -40344 -57857 -50488 10094 51962 56871
11220 56871 33580 58567 91365 87908 72799 91019 69801 46127 23779 79059 117876 87743
11208 87743 53275 37128 23923 20101 25497 9902 22960 82369 52903 30233 -1889 -8434
11196 -8434 -58514 -66367 -82999 -50962 -14877 -5211 5606 81193 136532 172044 131713 43216
11184 43216 38340 44056 68752 99957 76703 61722 82890 55196 -6397 1550 73028 65405
11172 65405 66922 50686 31229 50049 72426 31811 53618 89448 82804 70590 68076 67729 82743
11159 82743 65238 67077 45372 20545 38917 119640 134091 124691 75550 23890 17113 64140
11147 64140 102497 118457 62069 26513 33364 53090 55682 55631 44066 9736 29893 54950 61318
11134 61318 21422 28078 37708 15541 -21006 -80108 -124041 -158384 -144667 -122011 -85160 -84080
11122 -84080 -25288 11885 42240 27792 15264 70955 69396 91121 61629 63014 37637 40241
11110 40241 77196 79482 89591 69198 60245 46214 48522 128632 118764 65992 68655 109212 118073
11097 118073 132363 100679 78913 12787 -25392 22351 31712 -47397 34365 87676 83799 46131
11085 46131 48385 116938 152493 127066 105802 90216 130257 124680 5574 -20852 -57659 -45850
11073 -45850 10532 25455 67221 55117 42644 40762 32675 35367 24885 -26134 -21122 -39107
11061 -39107 -61306 -57338 -41854 -2835 -10101 2076 7337 31528 14348 -11755 12405 -2843
11049 -2843 -31941 -7739 -65159 -119336 -129805 -94287 415 -12899 -35866 20236 46917 8527
11037 8527 -25727 40723 45374 56245 51365 52671 16929 47434 73880 33742 -8551 -28379
11025 -28379 -47707 -9063 41866 84460 13993 -22067 20884 64995 65796 104370 77996 9205
11013 9205 -58499 -43524 -34986 41222 39237 -6535 -23443 10284 41142 22789 100265 146131
11001 146131 154202 136974 57062 -36621 -56455 -19724 -24524 -30705 5146 33724 28557 4968
10989 4968 -18543 7954 32050 -65420 -115468 -54407 -44606 -19031 -10552 -27979 -66723 -57418
10977 -57418 -17136 -39190 -34168 16210 60671 35988 25699 58230 114696 158208 131481 87470
10965 87470 72318 68870 84482 92869 93696 85118 116699 208939 200216 149185 145378 116257 122124
10952 122124 168533 170224 135824 173257 185465 181765 133530 90267 50952 53890 114641 112416
10940 112416 71031 48589 1999 -31897 -55088 -19944 26919 49047 107945 144371 129193
10929 129193 119211 132612 104938 58820 19787 37028 76328 142077 172286 194423 177147 186172
10917 186172 173115 176723 204693 191037 142952 114088 123591 89047 21110 1849 34418 109641
10905 109641 159403 198314 145874 81910 36692 11046 41506 27913 -4977 -18564 38813
10894 38813 37623 62054 94273 117324 181712 133542 126728 152134 100065 58622 53942 71938
10882 71938 80995 30343 10587 27670 -3216 2073 32 -11592 -26908 27707 56989 65567
10870 65567 95422 83331 61880 60933 82665 32932 36626 144787 155553 164027 217182 206457
10858 206457 200806 198096 152237 157847 137255 140358 99622 142251 113406 111631 143594 177635
10846 177635 194969 225047 244994 315635 424250 524136 736719 1048724 1473580 1811394
10836 1811394 1990410 2291381 2692839 2979305 3003062 2810023 2615393 2452772 2221794 1868125
10826 1868125 1527067 1165534 886388 718593 605940 567459 491379 311440 262674 336754
10816 336754 355302 280866 279784 315975 301763 318394 313883 297894 316804 312820 251985 291643
10804 291643 284111 201439 198203 210797 198618 141204 106221 121043 139384 81827 101789 88224
10792 88224 136024 154184 149031 211625 192396 163644 151879 171734 156021 144349 188019 176756
10780 176756 118821 93497 96339 88391 104570 149544 156391 168375 144040 126580 127361 130580 129954
10767 129954 78800 84154 106698 177273 207857 168882 114796 151112 143048 156217 195051 156899
10755 156899 111495 95164 98851 127745 74224 43049 61518 93407 143291 130040 145151 109200
10743 109200 105654 37671 33919 18212 -31218 -55772 -31805 -14436 10931 -5761 16105 65823
10731 65823 101356 95137 89510 174155 178815 153141 142978 135173 164723 200447 169846 186537
10719 186537 115311 104417 144163 170723 197557 169366 93504 87938 114616 182166 199680 227456
10707 227456 241417 271753 250361 236133 201733 263176 257992 241135 297911 331338 367156 374353
10695 374353 371793 339104 364617 403819 439136 429531 449490 469834 423629 378633 356088 385408
10683 385408 406364 402745 376546 373666 368805 317297 285172 315010 269576 286858 308679 324687
10671 324687 262730 247423 266928 230990 208167 167135 178182 134291 91932 190715 256090
10660 256090 301065 290171 299930 311532 343016 341515 290652 262444 200381 187007 227515 234618
10648 234618 216689 208765 187103 140118 189587 209964 211720 194970 153604 178907 188088 238741
10636 238741 272858 224207 193082 216887 192502 213979 194854 209368 258429 263862 324506 375972
10624 375972 357851 413528 437862 534061 636980 669232 684122 692918 677167 617570 553640
10613 553640 516934 446230 323298 243894 259323 282132 173581 160247 85776 52532 117310
10602 117310 141961 90247 129094 140908 176666 240761 257471 240103 233599 281320 273010 300797
10590 300797 299374 326591 272848 250516 283189 331535 363238 409240 387932 300430 253794 185652
10578 185652 227414 300690 332967 346524 404997 506607 609750 646389 679540 701940 732656
10567 732656 814423 820860 760010 736996 781709 763182 679628 561527 548075 505771 455907
10556 455907 395627 405037 389968 439421 477886 500817 497510 500787 512944 566742 602307 570064
10544 570064 601572 604127 636607 751569 819982 796348 760383 767666 799075 862014 962945
10533 962945 1007232 1035679 1091392 1179119 1177295 1136660 1179139 1301164 1314639 1286036 1234454
10522 1234454 1188043 1186865 1213789 1243480 1265820 1285635 1324948 1333325 1314149 1337671 1363649 1386968
10510 1386968 1391933 1333830 1343162 1481353 1542243 1529476 1503333 1529133 1578111 1632429 1706799
10499 1706799 1702454 1712293 1641759 1619724 1670752 1793270 1796496 1810820 1846523 1915325 2009269 2077041
10487 2077041 2156007 2315658 2482624 2645805 2836454 3041012 3100024 3059455 3078130 3096183
10477 3096183 3090130 3109051 3170535 3275034 3330862 3348185 3424873 3557454 3789598 4152246 4702249
10466 4702249 5166221 5613277 6104553 6658994 7182685 7528856 7719844 7983219 8312081
10457 8312081 8625171 9039999 9612411 10160752 10725116 11577272 12764728 14018823 15226482
10448 15226482 16522511 18029681 20058257 22660661 26064751 30453840 36382628 44856967
10440 44856967 57175796 75044701 101001946 140368159 201250327 280648078 343968583
10433 343968583 387698242 439685859 506401169 552717259 544294379 506765974 462913462
10426 462913462 420547396 363606235 300073635 235675302 176080895 133029193 106037898
10419 106037898 89098621 77794542 69827318 63893043 59119950 55337217 52345569 49828106
10411 49828106 47678085 46050148 44557270 42973427 41426670 40002470 38578099 36853620
10403 36853620 34873334 32886055 30864451 28802272 26826376 25059853 23341813 21772445
10395 21772445 20355484 19074286 17897128 16797550 15747525 14765061 13839143 13005804
10387 13005804 12188452 11451936 10712252 10082528 9465100 8870548 8296047 7735813 7175271
10378 7175271 6684976 6349462 6028305 5749472 5424419 5123780 4910979 4709113 4544197
10369 4544197 4332202 4054834 3786171 3550269 3407233 3265542 3084578 2955034 2803571
10360 2803571 2571836 2374521 2284284 2207364 2105408 2060653 2028473 1928370 1761950 1648428
10350 1648428 1615884 1525131 1443650 1339127 1230624 1230327 1170039 1080917 975947 937639 904652
10339 904652 839601 771125 765823 698074 639080 557602 482193 463801 430340 454857 438706 411999
10327 411999 417734 415926 404978 341678 330292 399128 371140 347362 314756 269222 289439 374959
10315 374959 481987 558159 603059 701531 737530 765999 869667 959354 1048276 1192214 1333336
10304 1333336 1496382 1623957 1751270 1750326 1674950 1590897 1579306 1500798 1357501 1138145 941566
10293 941566 819830 752985 732889 756957 771757 763324 808369 782632 750966 669124 612923
10282 612923 570203 551741 563637 585182 618516 633228 607424 681974 721534 705783 756983
10271 756983 752335 718137 748284 772299 733239 767666 787304 755752 673320 656610 660762 602859
10259 602859 552685 574014 615829 654277 623815 603074 619250 693314 663576 637815 622165
10248 622165 579364 570877 587590 568137 603725 604553 545443 504811 534616 518847 430565 442399
10236 442399 419958 380054 380414 398664 368768 334835 292121 275457 223041 212419 169163 107208
10224 107208 130622 154230 172628 182163 217745 209697 206275 194644 143955 181439 149653 136279
10212 136279 168074 183087 162893 108775 32249 12211 34472 32982 40197 26672 12937 -2463
10200 -2463 -2637 -14988 -8107 42961 79782 29956 -46672 -90479 -2431 87679 68945 -14123
10188 -14123 -64346 -53604 -33328 1761 34449 39440 26624 43931 29514 1775 -14622 83877
10176 83877 120344 108239 7853 -58973 -23170 15867 74981 78636 62541 75758 89561 47366
10164 47366 72748 53284 80998 71248 43120 3342 -75849 -88447 -46930 -71954 -52610 -21532
10152 -21532 48153 31833 23733 33940 12441 39957 70134 65959 80831 66088 29420 -22741
10140 -22741 25576 3240 -16468 -14220 6942 62821 95076 78152 19356 11218 26013 101647
10128 101647 172956 179716 143698 232775 337074 290814 210357 200958 238938 253828 236634 260118
10116 260118 205127 131253 107852 103413 101856 88622 34415 -14337 -22938 4725 -33206 -88985
10104 -88985 -91231 -39657 55373 67272 16244 -24509 1713 34427 13708 36527 116226 115593
10092 115593 102558 79906 57090 15584 15775 83393 122928 107733 100101 69679 62823 57197
10080 57197 35381 55796 -3159 -71596 -53191 -3097 7550 17982 -1576 -31978 -19133 -41671
10068 -41671 9476 18811 -5639 -21603 92769 140774 62244 5273 -34556 -56164 -3843 -15265
10056 -15265 -4447 -28965 -306 71172 84531 39065 -10388 31575 -10178 -65440 16325 107983
10044 107983 210734 205186 223940 224776 197358 160671 138422 102417 69133 73979 132806 217573
10032 217573 295889 377793 525998 753382 1027691 1371301 1714411 1994061 2297777 2652913
10022 2652913 2939290 3002133 2777483 2477023 2225422 1921963 1616362 1283245 1011241 749847
10012 749847 564570 512296 413080 305898 269093 224948 227130 294705 309336 234248 157829
10001 157829 119899 125868 131435 89190 70233 93565 148877 185509 242309 229144 206185 257956
9989 257956 269685 196690 158126 207467 108497 66778 99610 71998 114834 124172 87211 99013
9977 99013 56066 46509 31676 -32303 -33103 36155 128454 119358 51373 -18729 -20978 -26080 22203
9964 22203 21384 -37686 -17196 40537 10945 -29156 32148 79593 79741 6528 6320 -11524 -30344
9951 -30344 27793 39804 69958 105182 36005 -21127 -48278 -22927 16839 34373 4569 -87421
9939 -87421 -121129 -113512 -56451 -38845 -40571 -6795 -5768 10040 15472 -1688 50052 51658 78394
9926 78394 68963 61692 40017 48212 51292 26589 61916 39240 -18230 -11987 58662 22278 -82385
9913 -82385 -62130 -48767 -27988 12852 8591 -20196 -71660 -87487 -137742 -38620 32218 29811
9901 29811 -6626 -41601 -59678 -57712 -85031 -69266 -29060 -24527 -42449 -31748 -8753 4943
9889 4943 21880 -60899 -70195 -37921 -33858 17812 9311 -10620 19602 23005 -108620 -128486 -139638
9876 -139638 -67729 -38154 -61435 -94331 -147018 -125399 -59875 -8555 11014 68943 10669 -57560
9864 -57560 -9922 -5118 9195 -17594 -42897 -12063 -13493 -36831 -53231 -79831 -80981 -115752
9852 -115752 -96285 -48953 -22328 26082 46560 39992 20434 69795 29452 6294 23955 88575
9840 88575 72193 33719 -14088 -29230 -10953 -10643 -48184 -35133 19020 67474 66129 27427
9828 27427 -5254 21681 53257 -27728 -54744 -8016 -14712 -37249 -30645 -323 -4354 -15700
9816 -15700 -23206 -17503 29308 30529 6661 -15093 -78054 -51901 -10282 -26795 -43037 -46753 -63982
9803 -63982 -36081 -61559 -35809 -36802 -26750 16480 1887 20755 -10726 -41242 -44475 2569
9791 2569 43954 80247 32347 -27616 -39412 -23768 -78986 -69718 -49942 -41219 -48195 -23791 -6045
9778 -6045 -48526 -71359 -44842 17650 68505 28029 49279 137704 102073 17281 -10974 -48005
9766 -48005 -33357 -24114 -27348 -39703 -16703 -35005 -26486 -26003 -26717 -86189 -113556 -119201 -107859
9753 -107859 -82635 -61290 -43396 -50999 -42521 -76064 -69975 -9424 51278 113075 122352 8641
9741 8641 -31432 -10466 24534 -14613 -56475 -24561 -47288 -65029 -15933 51495 100354 115721
9729 115721 94104 82104 21847 -7505 -6291 -52889 -49688 -55928 -52031 -59065 -93608 -109444 -98259
9716 -98259 -66611 -39342 43584 51499 32372 2935 -33365 -14210 10443 3277 -8210 728
9704 728 23607 -20319 -51332 -81254 -110502 -74020 -26758 -47216 -79161 -57650 -16256 -34944
9692 -34944 -20571 -35092 -17351 -8012 11461 53763 104464 95559 69294 65029 102378 59152
9680 59152 26091 40883 48229 20210 1329 -15781 -227 -40160 -1689 -25201 -7500 -7022
9668 -7022 -9950 -34493 -28503 -43503 18899 12577 -25744 -12914 -11594 31508 38010 -27219 18997
9655 18997 19058 41399 16652 -46135 -8799 -4457 29358 -3615 37578 41503 18831 40785 17885
9642 17885 -4908 -36149 -25243 12953 -59382 -38395 16019 38918 38830 12789 -40621 -47447 -65436
9629 -65436 -41829 -21393 4503 38758 -11043 -61213 -97727 -126060 -84849 -28331 42856 20981
9617 20981 28121 45681 34521 32046 38505 1317 -70639 -120886 -104217 -52127 12898 60419
9605 60419 19709 4647 20120 27592 28885 73434 82003 70284 43587 74564 30435 42508
9593 42508 86216 55559 39327 16631 1567 -9118 19714 75479 57700 -3124 5687 17683
9581 17683 -4860 -28002 -5516 -38723 -8810 47617 34375 37516 79985 32879 -13093 -20290
9569 -20290 -19877 27472 30822 21668 -30889 -29645 -30284 -32562 -24467 5594 12172 -62887 -78505 -73033
9555 -73033 -119296 -161757 -87393 -53037 -54639 -78597 -50857 -23183 -2990 16323 -1172 15435
9543 15435 38478 25668 7985 20256 46879 20076 -85116 -117040 -110257 -83068 -8433 -47806
9531 -47806 -96903 -68143 1288 28931 3169 -32390 -27557 -7318 32622 44801 58345 48093
9519 48093 34892 4826 -10205 -27200 -72372 -32357 3288 -45621 -82747 -96506 -105032 -8763
9507 -8763 8993 -2999 31551 -12137 -38336 -6113 -3324 -6208 -50019 -56540 -8818 -3233 -85277
9494 -85277 -80762 -8139 -68912 -60757 -38475 -33670 -53567 -67444 -14431 -3858 4810 58087 78688
9481 78688 44614 37946 71289 83661 65166 52327 51372 55158 39548 -773 -22975 -14779 -10302
9468 -10302 21155 15037 -12851 -47634 20617 -52952 -97977 -66341 -57267 -96400 -111696 -113382
9456 -113382 -59103 -47481 -51369 -58365 -9072 625 -34282 -71384 -58055 21106 6216 -14249
9444 -14249 3365 24193 -16681 5000 -47987 -43070 -50809 -53166 -31819 -11597 58679 48946 24385
9431 24385 6738 -73670 -96153 -61593 -56923 -61981 -20828 11699 -701 22845 -11988 22937
9419 22937 -126 -134455 -123931 -42002 -16164 -32037 -7982 18598 -42360 -60291 31117 92727
9407 92727 71970 59911 17670 20837 31163 -20387 -21949 -10099 -31540 13452 72164 27198
9395 27198 11912 22784 -6335 14718 944 2055 45416 123276 90264 15098 -11367 28808
9383 28808 15441 -14931 -62818 -53868 -40705 -41128 -49402 -65343 -27984 -13339 -31601 33154 70086
9370 70086 46584 78640 87557 10694 -2486 7173 -4644 61544 62355 68091 35069 -36319 -48340
9357 -48340 22823 81191 120964 125458 86600 56201 24186 65046 108382 78122 49290 17047
9345 17047 56309 41480 25199 46238 44874 77630 66815 91458 105369 72188 46175 23733
9333 23733 101248 116789 112752 69597 -3028 -43674 24158 48723 42007 45786 32756 643
9321 643 15693 42207 65589 101011 123045 118873 111568 68218 51038 56306 87154 69387 72537
9308 72537 75589 71694 122649 87026 35491 9840 39251 80565 67910 43970 34578 27059 -35234
9295 -35234 10371 73288 136324 190094 134018 63466 12830 28979 55771 46958 47096 85975
9283 85975 84695 55459 88723 173784 147003 105578 105172 94869 161422 190496 215725 145427
9271 145427 170703 136975 111635 136064 219099 305014 342172 384268 376830 305886 284196 220741
9259 220741 221470 300461 325982 387804 459335 499613 507751 533240 649934 797691 1014428 1220713
9247 1220713 1543049 1962339 2545258 3437777 4776661 6814812 9992448 15315025 24454753
9238 24454753 34569830 35503654 31197308 24076142 15834500 10087365 6992270 5339950
9230 5339950 4357228 3667350 3172779 2809394 2546034 2325756 2170236 2057431 1950419 1786818
9220 1786818 1780044 1731328 1605351 1514309 1465522 1545535 1653741 1678993 1571986 1489780 1344060
9209 1344060 1163054 1092490 1055124 1073698 1068156 1063479 1077329 1128264 1216736 1336421 1585347
9198 1585347 2054778 2709494 3600973 4093537 4039447 3765996 3421297 3300619 3644290 4315484
9188 4315484 4571284 4303795 3896464 3459225 3288578 3646435 4120526 4068834 3566509 2865335
9178 2865335 2199199 1731653 1452330 1195010 1016421 859345 774680 702592 620567 558560
9168 558560 545552 516376 503703 485578 460154 466238 434467 426975 473142 488044 458622 412252
9156 412252 383286 347895 328452 325607 319122 304952 207384 147468 177270 148381 114470 168686
9144 168686 233789 219213 160488 165081 134569 86649 74453 26156 15999 137399 200057 164424
9132 164424 143280 60497 555 37285 1555 2095 -14093 -7123 -10621 -29849 -14468 8615
9120 8615 1426 44282 44261 93622 125645 176558 103400 37662 55789 62685 67009 75748 100502
9107 100502 106961 33932 32533 50497 46993 54522 65469 81042 90825 62806 4298 -24728 -35644
9094 -35644 -977 22763 -18780 -82300 -91355 -75822 -46091 -54268 4133 17409 16178 12534 -20128
9081 -20128 -37189 31238 85760 87181 20046 77 31632 54443 51733 32482 6126 38150
9069 38150 37877 29636 11166 9454 61022 69696 54220 55405 72278 79538 66118 32226 -28137
9056 -28137 -54392 -34345 35930 36549 9875 18128 44444 67951 25955 8092 23801 55129
9044 55129 24900 35293 66233 74702 118851 99890 74347 64498 108009 146809 127229 76751
9032 76751 42568 7631 37188 66145 95558 82144 -16806 -69153 -84739 -73804 -17350 -2908
9020 -2908 20080 25730 28099 -12083 -25424 -55352 -41981 37074 22030 27264 15936 -18071 -46534
9007 -46534 -16274 -20347 -55459 -55270 -54690 -90586 -70578 -68270 10581 27816 80782 118177 162991
8994 162991 224935 227621 186255 150573 73357 33478 60705 59648 55712 43655 43083 55900 73419
8981 73419 101096 67783 -21936 945 8522 -19594 16489 81730 115666 89107 56868 54305
8969 54305 20293 67826 29404 2490 31979 46776 77737 30289 72002 93016 83265 46726
8957 46726 56218 66394 100478 190330 252295 308903 358438 356161 310122 246621 176534 175617 117165
8944 117165 94157 101676 70715 66754 62150 -4726 -35753 -52261 226 50775 46181 39157 72751
8931 72751 105514 113026 145317 95527 69784 42359 75531 137241 154261 164633 134677 90911
8919 90911 -25708 -102699 -64899 -19961 14813 45133 110519 87278 62963 51263 53000 76129
8907 76129 90064 110745 146329 143759 156164 142896 144465 75415 7128 16820 22326 30894 93896
8894 93896 89032 108545 121085 117530 73575 28628 64691 86036 43384 -15309 -12182 63681
8882 63681 72122 85704 86793 92706 76360 82860 99528 69073 51404 42371 -4129 -25674 -46225
8869 -46225 -41622 5004 -8358 -42744 -46837 -44320 -33683 18747 -19198 -50129 14974 45021
8857 45021 50356 38172 28328 6158 25140 27264 -22138 6328 88606 103165 102337 101214 79148
8844 79148 18657 26490 18610 15304 17306 20653 69034 87351 55098 -12277 -11206 32373 57717
8831 57717 55935 73614 62427 54258 41944 20845 15089 -58672 -99205 -36959 70884 168875
8819 168875 166493 114436 72554 30290 -5992 -36722 -59487 -79387 -54545 -56311 -124956 -112819
8807 -112819 -67237 -30350 11529 76896 100547 42625 56122 109178 117234 106960 150798 164196
8795 164196 92343 54275 66391 136756 156426 183924 189864 123180 29601 -64604 -89385 -60080
8783 -60080 25145 26457 32979 65235 29236 15326 73966 129367 113576 125889 169901 170292 141738
8770 141738 127800 145508 69258 72848 123542 140791 160560 173442 139395 53884 -11140 21545
8758 21545 19953 -10374 -19255 -39584 10427 23641 -17306 45650 88552 103486 28228 31127
8746 31127 83858 93177 103530 110374 74529 48808 77236 99065 117724 132412 81954 29377
8734 29377 34162 86349 141883 99769 104064 123080 98965 96454 73081 22796 6242 64618
8722 64618 78407 52688 123012 132584 103350 119741 148440 151219 121482 165315 145580 141406
8710 141406 152165 164803 207821 164980 140404 136951 142673 128336 111369 163451 155357 123453
8698 123453 94928 136089 101189 92030 108663 132630 123759 116947 106878 97657 95438 139780 153458
8685 153458 195562 162803 175639 221370 239185 210136 194730 199289 139535 139975 193924 189329
8673 189329 126585 117816 98077 135886 184410 200078 175683 178773 118728 141195 136255 150280
8661 150280 186142 160498 190841 182639 170041 169264 170074 143032 87602 76479 58480 148134 194467
8648 194467 245896 275996 245228 235530 239086 287786 245850 262084 313595 296669 358129 368794
8636 368794 299904 232531 189382 138345 134451 203541 257993 224440 209848 237766 230728 232019
8624 232019 285625 340878 372909 301130 266159 329908 330578 287445 289977 286822 348397 365995
8612 365995 376966 421306 446169 369471 333954 355146 401537 429632 513997 516210 499841 491168
8600 491168 519090 549973 608455 669031 750798 779794 863522 916529 947260 1049990 1160917
8589 1160917 1269031 1354807 1395907 1466738 1540002 1531099 1405208 1279106 1141357 992429 850919
8578 850919 761748 673396 641529 613926 525933 480249 473456 437895 415707 453244 423870 344300
8566 344300 301204 283910 309675 332800 278576 246298 285318 344887 339223 312636 297498 319995
8554 319995 303406 246050 305273 340000 344047 340448 299391 228567 172974 218340 206980 266465
8542 266465 310266 302594 337728 373584 438994 456293 358884 256504 136397 134613 195724 188987
8530 188987 156508 150038 155300 173220 200148 217334 204804 180144 178245 186594 161679 136610
8518 136610 116285 121047 165240 177553 99762 43683 72637 91205 104411 99726 107893 125501
8506 125501 115171 135539 174699 143291 127788 64319 46018 73410 80084 67802 49559 61382
8494 61382 67644 93718 77225 87504 123022 177383 206088 156967 113356 83453 90600 92239
8482 92239 85150 85891 82564 59828 46096 1197 39376 111482 118768 122521 157503 154077 136199
8469 136199 81128 89005 73971 66137 139266 199912 169956 93717 96238 90145 65325 55659 56849
8456 56849 86629 117045 130266 84240 73148 102369 122873 111826 30520 -12514 -1444 59984
8444 59984 92496 100804 49733 -27512 -57418 8877 35834 30266 3152 32089 68523 50751
8432 50751 25776 63980 61588 41940 62642 29027 32679 56167 63138 92649 125845 64786
8420 64786 49267 61264 59253 50816 65037 94316 60817 54468 75102 116645 152658 141688
8408 141688 109821 124653 73595 13200 19087 44748 51565 54749 80356 102294 124037 143387
8396 143387 79583 64682 25040 5666 8817 52342 32511 7251 -29119 -18122 56412 85622
8384 85622 107581 66964 19664 30829 55375 62931 64785 82964 59990 -802 -54417 8646
8372 8646 -14923 -38896 -20541 -39398 10915 41341 54088 68900 70540 132407 156050 44547
8360 44547 -10067 9407 23480 37750 68699 77001 110108 39681 -24581 22881 96721 103477
8348 103477 96307 81838 69562 4025 -38095 -74521 -58803 7008 121271 207283 178669 152739
8336 152739 116822 93846 16057 102 65203 56996 12301 -33539 -92376 12458 29249 -25991
8324 -25991 -34986 28260 33766 31374 37515 55925 17844 -13535 38397 59792 28400 -11359 -13739
8311 -13739 18635 28252 16692 -24984 18851 113468 143750 44828 -70966 -111565 -123686 -68506
8299 -68506 -37626 40853 15509 -15066 -31232 -42920 -75186 -7755 53756 104795 131184 71713
8287 71713 44772 50535 6915 5012 17418 38444 68680 13958 -29384 -44689 -25699 28891
8275 28891 15394 -20659 -15321 32048 72836 41748 -44971 -36386 4716 -2418 -6723 -40203 -42219
8262 -42219 -8358 14167 18600 18187 29803 43767 36351 -10419 -52706 -15010 -8628 -27404 -52037
8249 -52037 -24355 -21508 -60456 -100570 -79265 -27306 13569 63564 57962 -14177 -35359 -26113
8237 -26113 -10558 49379 78808 58832 53759 35627 22450 31395 19982 -8490 15173 -11876
8225 -11876 993 34036 38586 26309 45125 33261 47691 29427 16027 30752 19062 22458
8213 22458 43103 32821 65405 74167 8638 -55835 -17554 5998 7755 -26091 -17179 -29013
8201 -29013 -20163 36700 66390 101248 74389 73363 37713 -6179 -1399 9683 -44700 -46623 -21392
8188 -21392 -2516 -1167 40186 7542 17208 18926 -1526 -26910 1219 32209 63276 57117 -28980
8175 -28980 -34517 7368 4640 27988 80668 4483 -56016 -13861 -7056 15822 26658 -26733
8163 -26733 -1036 30338 53020 29330 8401 -7110 31013 -9331 -16631 3737 33721 48298
8151 48298 -4516 -18986 -6666 4707 -696 -14172 -7913 -45816 -11267 10931 82373 153429
8139 153429 152685 100876 97595 50043 26724 20674 10225 40309 21644 2924 10845 15784 -64695
8126 -64695 -104517 -84068 -14663 13618 14915 2900 -76385 -39948 48257 81441 40390 35064
8114 35064 18430 36748 81501 108394 91024 36683 -16215 17019 62928 87145 116980 91781
8102 91781 94530 80540 101438 120709 101739 149922 103275 52088 116341 148684 92937 64709
8090 64709 100655 125576 130632 65814 62743 121639 137111 81517 44345 79954 114279 98903
8078 98903 108966 98996 -4469 13948 36730 116375 132007 85495 60560 58581 59448 25686
8066 25686 37832 18860 3531 34421 68315 94036 114745 169942 139215 90748 63788 134685
8054 134685 204260 108842 80375 102420 111974 101450 73508 83591 55399 90132 140702 139358
8042 139358 93782 74380 95649 134949 179148 201085 209943 143068 158421 150740 148922 141528
8030 141528 160901 115710 96486 102574 196553 265053 259498 215745 192975 159676 145991 138560
8018 138560 178677 224977 225487 194041 199599 234292 243369 254876 220468 239197 266349 207735
8006 207735 169004 107430 131772 193376 205995 210377 264235 242536 223685 208142 276936 328387
7994 328387 311652 260499 268172 275907 279236 284240 270373 204429 181100 193901 255108 281675
7982 281675 262126 262429 271670 282543 235477 176476 91332 43074 52845 116284 155355 173221
7970 173221 171210 164810 169129 206968 255069 257493 194486 196040 236533 267586 307251 286516 292886
7957 292886 369608 381426 384771 378001 378883 353887 345938 307157 241764 237635 221051 195598 222273
7944 222273 248867 269783 252204 226316 235278 253263 247940 242760 255485 283864 289499 241598
7932 241598 195420 205648 156242 122829 126150 130657 128226 63477 60500 76492 66866 62300 528
7919 528 -30092 13307 80094 85514 116630 174555 154080 128149 161075 193229 212836 211139 210366
7906 210366 236445 250727 227068 255721 247639 203016 253724 241444 217569 225597 183498 115674
7894 115674 115528 149269 130332 109677 121729 141688 89899 10718 43453 125282 160440 166410
7882 166410 192299 119932 110878 127783 145058 139579 130366 170213 137568 152117 182312 159193
7870 159193 127925 68791 59817 6443 58870 80367 106548 77069 74535 169593 160887 75752
7858 75752 16816 -20646 27586 61843 43794 16686 -7363 -25615 -55326 -33653 -29035 76105
7846 76105 82939 66365 57506 1266 -28522 -23626 38625 51178 27432 17972 751 19461 65028
7833 65028 91094 84013 51511 -7143 -68593 -96527 -57935 -24338 -7120 -16929 -6136 27237
7821 27237 2074 38016 23109 4165 4301 91529 100283 13425 -773 -13255 22436 88814
7809 88814 86465 41857 11759 9164 875 -3899 -23252 -19105 10982 65518 120019 96235 -1203
7796 -1203 -35422 -63104 -51298 -42348 13491 39611 66677 85658 41457 13916 99042 46883
7784 46883 -9745 3470 -20167 -16637 -4652 -15986 -6678 38476 8544 20558 42177 36532
7772 36532 -25615 -59220 -90362 -67762 -44298 -59423 -55740 -73970 -101245 -107450 -7991 100411
7760 100411 67655 69038 117166 117780 120630 88892 86363 52565 68232 33809 18938 -45868 -1161
7747 -1161 31586 19836 30547 -5191 -61828 -94140 -97827 -17911 15451 25180 54026 29726
7735 29726 -24735 -62521 -23335 13548 23110 -43526 -107075 -102194 -60496 -39574 -54052 -14489
7723 -14489 25051 19923 4100 70959 106411 73856 82091 54437 2466 -7504 19321 -32248
7711 -32248 -50641 -19362 -47113 -61106 -35163 -18022 -13341 -28511 -68272 -51888 -22289 -41847
7699 -41847 -4305 -391 17486 51067 22921 -60907 -76572 17333 20452 25801 5878 42418
7687 42418 48044 81377 73676 92294 92600 33988 -3334 -1540 -110737 -150419 -108618 -1670
7675 -1670 35415 -17723 -5248 15067 11474 40671 78213 74404 40409 25466 -50725 -62847
7663 -62847 -53297 -32098 -12668 1769 -3820 -21530 24144 37870 15289 5389 11949 59877 22563
7650 22563 -46440 -90333 -81479 -20567 -24275 -21236 12581 32704 72046 -7350 -44721 -22585
7638 -22585 -2353 -34517 -63061 -35621 -25120 -12089 -20963 -70232 -57121 -66626 -35600 -73879
7626 -73879 -60915 -32968 -63910 -69671 -41349 -105454 -129137 -112552 -106403 -101601 -85525 -39948
7614 -39948 51218 -21425 -72516 -64299 23465 40664 41197 97938 143367 139372 111357 41037 43300
7601 43300 26898 -19290 -53769 -9458 -4546 21557 45137 65930 98323 36327 61641 65379
7589 65379 53435 33578 -24132 -31931 -16770 -59937 -40861 28838 24695 -4511 -14140 12186
7577 12186 37620 31448 -19944 -33120 -26813 34270 49196 59937 36395 46005 57767 -29602
7565 -29602 -53733 -56880 -87500 -15643 44343 128884 141382 99622 48748 18777 -56248 -31416
7553 -31416 28841 17216 -56850 -110947 -128784 -91225 -43851 -71561 -33923 -3670 58184 56158
7541 56158 26001 33534 73702 42781 8220 13846 -39593 -76922 -37183 3068 9707 -2385
7529 -2385 -61293 -128474 -108689 -94103 -58355 -70152 -84791 -21418 -18971 -269 43385 -4464
7517 -4464 -23613 -4371 13984 -13656 -76086 -38093 -7227 -30115 -117495 -121502 -117881 -80538
7505 -80538 -24412 -55077 -59542 -63278 -60523 24784 10994 8236 46442 30451 -66896 -106291 -123145
7492 -123145 -113375 -49021 -25916 -22572 -40563 -63562 -16443 42281 15571 21458 5002 31492
7480 31492 18777 7626 19420 10620 4608 35849 47434 24287 -9280 -13923 18948 41763
7468 41763 -29668 -114591 -59817 14843 54188 -29720 -41688 -30092 13451 36553 -17014 -44839
7456 -44839 -75233 -141083 -54730 19795 46796 38855 5416 19516 55905 19530 -30993 -67808
7444 -67808 -56514 -62160 -73690 -58910 -4793 48461 12045 -20270 -37334 -80442 -73191 -85884
7432 -85884 -56696 -39020 -34112 -643 10385 14202 47408 -27524 -74482 -100629 -55629 -51270
7420 -51270 -84790 -78404 -58491 -87547 -34420 -2990 -39308 -38745 -3841 23603 32753 7780 -18140
7407 -18140 -36712 -55399 -70144 -40030 -34963 -88680 -83932 -82999 -80244 -64028 -39111 -30730 -46124
7394 -46124 -44039 -63113 -65485 -10148 -9391 -51126 -37006 -14554 -39415 -92591 -101821 -103880 -88578
7381 -88578 -86936 -26011 45519 53270 40948 35441 5343 -70250 -47195 -17355 -20143 -57212 -95344
7368 -95344 -75869 -81006 -150393 -145852 -111725 -34566 25758 15408 -30265 -28555 -16262 2340
7356 2340 -9897 -91327 -65739 -45245 -100168 -112291 -81270 -45229 -25819 -9231 20375 55571
7344 55571 99846 14694 -3695 9082 5162 -22945 -6717 -853 45174 46707 -29836 -43992
7332 -43992 -49402 -64523 -71534 -13538 32739 36840 21581 19035 5721 -19559 -11761 -19376 -48710
7319 -48710 -48846 -52788 -51536 -71220 -63154 -54512 -94355 -57484 -3431 -23979 1751 35197 -27069
7306 -27069 -87614 -16596 -6701 -27084 28645 33092 49532 61221 62875 71993 75027 56606 70522
7293 70522 16130 -78142 -41105 -31102 -47694 -35409 -54656 -101508 -90554 11079 47715 50292
7281 50292 33664 84435 48862 -38971 -102186 -65908 -55910 -96032 -88331 -60566 595 75087
7269 75087 85447 16887 -17887 -69430 -107437 -63582 822 29811 21741 25820 61016 22409
7257 22409 -12681 -47450 -20630 -4220 -13943 -41082 -7659 -25268 -77469 -122053 -104554 -92779
7245 -92779 -77082 2619 33099 -17333 -109082 -180830 -142386 -78824 -44352 -53828 -84315 -156653
7233 -156653 -136276 -43018 -46508 -15650 -30024 15289 84274 45482 20203 9645 -3821 -32362
7221 -32362 -84837 -60659 -51985 -26147 7639 38031 73198 54165 -1958 8387 -42367 -15797
7209 -15797 -40024 -42243 -34348 14352 30416 2382 -12689 -49279 -65268 -20352 3200 31162
7197 31162 11948 -16413 -71232 -91175 -99750 -76380 -25557 -12607 19375 16058 90322 100977
7185 100977 45289 18320 33091 66227 94205 42765 -6886 -49867 -8808 -4862 4606 -11719
7173 -11719 8609 44028 35461 30675 -29060 -18199 28661 57801 54502 -28142 -37929 -74545 -52848
7160 -52848 -14517 -7320 27771 12107 -6559 11796 -3760 -84574 -134947 -41240 -6260 47531
7148 47531 52494 -31043 -141574 -146043 -62185 20699 46440 9880 -14601 -20415 -27516 -46574
7136 -46574 -70336 -91120 -57067 -57240 -68643 -83899 -64868 -48140 -17454 -16304 -38774 -49070
7124 -49070 -41368 -113627 -120937 -88309 -92280 -103972 -117300 -153846 -141517 -106438 -81588 -59894
7112 -59894 -36284 -40248 -131871 -116270 -58741 -63105 -103005 -99584 -111681 -92447 -64826 -21476
7100 -21476 21211 82796 73016 1140 -100587 -93956 -19644 -42039 -50488 -56543 -90038 -116879
7088 -116879 -112644 -74415 -33282 -53264 -114056 -100361 -41167 -60394 -23032 -45718 -65202 -76084
7076 -76084 -32490 39531 2667 31952 24339 17334 38505 63125 17473 -10871 27905 44793
7064 44793 26564 -24682 -48445 -103306 -108691 -74460 -72322 -32819 24512 4386 22002 960
7052 960 23871 54441 -22798 -44945 182 47969 52722 68753 16121 -13240 -75062 -123309
7040 -123309 -92425 -49232 -34885 -25659 -12975 -10012 -26902 -63881 -29876 -22526 -60482 -3633
7028 -3633 -10177 -46890 -81850 -54522 -65496 -72399 -90722 -55998 -72941 -44163 -46589 -6584 12079
7015 12079 -1798 -20935 -43310 -61707 -54081 -39049 -2628 65372 49111 30235 7001 -45471
7003 -45471 -102421 -109716 -83450 -78828 -34171 9772 -28173 -1880 75675 78143 43793 90472
6991 90472 105089 57395 43198 13707 -6189 -6515 -28229 -40421 -34528 -19170 22034 -5735
6979 -5735 9910 18633 14356 -27745 -49534 2587 23525 49096 36429 18014 5975 -20967
6967 -20967 -51083 -22064 8464 -16603 -95138 -80608 -29979 16245 25703 27213 31793 -9585
6955 -9585 -71289 -105007 -115955 -69218 -77333 -79102 -66907 -69027 -51875 -44806 -33847 -10057 -36948
6942 -36948 -77128 -189560 -163215 -54194 29558 121850 122121 79648 24685 11246 21183 37973
6930 37973 2661 -43790 -30914 -6122 20421 55121 -16784 -67752 -61743 -38112 -55635 -66519
6918 -66519 -34768 -48048 -76553 -61636 -21479 20021 -12608 13163 114474 75138 33288 -17641
6906 -17641 56246 63577 55326 21872 -10793 -1360 39365 47928 58502 71169 126096 76321 53665
6893 53665 71153 57521 50795 22696 21822 -40925 -54870 -52046 -49778 -63778 -74176 -90118 -39500
6880 -39500 57757 5886 -53932 -48314 -74342 -20412 4198 -7676 -23761 -17243 -22437 -35890
6868 -35890 511 19770 -35106 -79692 -76994 -42921 -40111 -30636 -60456 -47000 -29466 -6524
6856 -6524 -58307 -110306 -95412 -52016 5224 -60738 -128414 -94647 -104942 -119648 -96770 -113763
6844 -113763 -90306 -93050 -85152 -83810 -54341 -18837 -21949 -39461 17831 19930 18156 12507 16478
6831 16478 -23396 -68430 -48310 -12124 7723 -25377 -60383 -44182 -41967 -9756 23443 -19439
6819 -19439 -30017 -6434 -20314 -55965 -30745 -33182 -29259 -85267 -149066 -155977 -133054 -64175
6807 -64175 -44646 -87323 -79681 -21268 10384 -30940 -54331 -4855 62309 87635 28995 -7267
6795 -7267 -6520 250 -90214 -90467 -66123 6067 82399 43296 35044 40644 55648 59749 20530 -32134
6781 -32134 5731 24322 -8885 7639 54142 43591 -5426 -39325 -1188 3906 -32697 -26484
6769 -26484 30956 30043 -29595 -49576 -93937 -93039 -65125 -19599 7617 -2367 1354 -48045 -70152
6756 -70152 -37000 37420 7590 -61509 -101532 -24027 -33019 -26119 39044 -4683 -42202 -53638
6744 -53638 -45204 -66514 -70785 -37739 5533 47810 64338 91384 101855 2691 15769 46682
6732 46682 -2231 -65952 -91842 -36558 -1753 27925 49122 65358 89800 151616 212012 175843
6720 175843 179453 229967 326427 616024 901658 1000559 909766 761301 579352 398075 275989
6709 275989 151701 20759 -41102 -33228 -43068 -44270 -73271 -45740 19843 -9602 -6684 441
6697 441 3962 -10796 24034 29603 26733 58636 88415 78528 57259 84997 39908 50401 56473
6684 56473 57667 70749 40330 42364 67871 76698 96563 72014 37868 12280 -36777 -46088 -50659
6671 -50659 -84788 -53845 -72595 -71605 -43229 -77081 -34165 22460 1661 19438 62553 25800
6659 25800 -7594 23152 -21616 -16216 57102 14191 -53402 -76413 -32294 17471 17912 -5829
6647 -5829 6556 6933 -36981 -109217 -30408 74727 39370 28116 3709 -6468 -2769 -14529
6635 -14529 22089 62913 -43522 -58991 -38154 -57867 -16032 28300 25991 38101 5153 -33966
6623 -33966 2728 18771 105157 150648 157402 82868 54856 13770 -25102 -24439 -31463 -89797 -105227
6610 -105227 -46580 -10766 26624 27465 -5935 -6174 -4617 -19630 -51194 -54100 -28764 -18355 -39626
6597 -39626 -66878 -99152 -61213 -13931 -27844 -25931 5149 -15576 49062 15132 5113 52613
6585 52613 74860 48404 -2609 -15228 37064 19418 -26983 -26973 -12304 -25800 -13924 -51547
6573 -51547 -19597 4539 3342 -44528 -49252 -44740 -9726 8814 -24727 -83202 -110340 -73591
6561 -73591 -22512 -5099 -6500 41175 66523 60756 87458 40300 20311 45136 80554 68496
6549 68496 36086 67297 59276 34761 34549 -20739 -67973 -46427 21719 322 -52903 -86369
6537 -86369 -18548 -9396 20839 57217 93818 79167 63798 19778 22574 25843 -13271 -2936
6525 -2936 -15125 -10719 -11722 1966 -30418 -82721 -55650 -51776 -38016 -17827 12004 20615 52753
6512 52753 73482 61904 -21539 -27992 -8329 -147 -4292 41613 33432 -13113 -48758 -87054 -136897
6499 -136897 -67526 -80982 -88834 -56961 -41887 -76164 -58559 -331 19212 31433 -74688 -125061
6487 -125061 -111243 -139275 -104156 -52710 -2993 35224 -52073 -66357 -30496 -26789 -70335 -123437
6475 -123437 -157691 -78689 -55208 -82452 -113426 -75214 -42059 -16648 -43462 -18394 4387 -40613
6463 -40613 -77897 -101955 -92358 -14238 14143 72701 87407 86050 67365 18951 -54533 -115453
6451 -115453 -138928 -132291 -101849 -38962 -2940 18360 -34004 15412 42206 -5133 -39578 -8817
6439 -8817 -7923 -79842 -76003 -27261 -1269 -58302 -57885 -20182 -19327 13535 18428 21327 57515 83791
6425 83791 47911 -23104 -53903 -12506 7100 16456 20238 12997 79384 74414 64984 49971 8362
6412 8362 42667 9636 -46144 -66980 -66487 23297 94831 122133 127146 60055 -13260 -62682 -121193
6399 -121193 -112026 -20249 56002 49731 32895 9511 -84746 -124604 -99517 -110487 -107577 -84157
6387 -84157 -89394 -17030 32947 10464 -24821 -58747 -18447 6932 2302 -16300 -28337 -5388
6375 -5388 -44100 -50890 -60349 3637 15550 -39595 -37402 -47415 12395 66556 58714 38561 -10648
6362 -10648 -11731 -21722 -33552 -28514 -15791 -7890 72192 86131 50388 92377 82998 50191 80056
6349 80056 74380 33516 -12120 21417 13211 2853 33611 65901 65189 98562 93847 57831 47445
6336 47445 -372 -17351 -31175 -84753 -54720 18945 10957 49188 16367 16829 57675 82221
6324 82221 100073 125167 92058 51349 -6917 -12883 -7690 -9764 2207 36443 26176 6097
6312 6097 -27824 -81317 -78806 -81040 -80851 -27601 4879 -3133 -14152 -38208 -101870 -56516 -69563
6299 -69563 -59748 -3866 -9774 -38347 -66614 -30935 24396 64460 -12171 -102702 -34306 43821
6287 43821 15310 -63890 -79230 -35254 17496 8152 -22646 -52016 -42799 -40500 24577 51541
6275 51541 35125 57020 57924 23163 -34384 20222 34740 67637 107268 68731 44491 39961
6263 39961 11543 30026 53211 35524 1359 4428 23894 -5180 8491 55590 67347 27337
6251 27337 2587 -27943 -58841 -61152 -82021 -98872 -135095 -97905 -52165 -36975 -55948 -18945
6239 -18945 42035 49281 4045 8596 27275 46304 46152 29021 -13371 -79516 -42380 -29055 33685
6226 33685 65707 20490 -21167 -8746 17885 36814 55725 63531 34568 52312 16770 -67135
6214 -67135 -113153 -57069 -22908 1963 -26038 -36302 -32937 -10126 -19921 -19404 35269 52403 7796
6201 7796 -4196 14547 -51469 -124564 -31423 32564 34523 30634 39818 39109 -6408 5293 2255
6188 2255 61720 93686 55318 95987 96567 39374 -5466 -42825 -101367 -94569 -88766 -114914 -89451
6175 -89451 -46009 -33891 -24789 -61702 -85916 -81222 -80924 -83147 -48444 -7848 -43116 -76690 -48226
6162 -48226 -11247 -24513 -1000 4395 14214 11379 34278 43836 32377 69160 49332 13618 33859
6149 33859 82134 88962 5312 838 -62659 -76440 -99327 -105930 -96597 -68318 -33876 -47178 -29662
6136 -29662 -23977 12408 55918 75960 53260 79679 86237 -4795 -64380 35069 28449 29696 11399
6123 11399 -15493 -18907 -48845 -16744 -67371 -102514 -109513 -88151 -73974 -47354 -67984 -26304
6111 -26304 51338 71537 20221 -40315 -61464 12321 25282 -14835 16089 48469 24248 58121
6099 58121 1416 -111126 -124062 -55874 -66958 -101173 -75535 -30949 -47659 -66044 -104164 -135396
6087 -135396 -170275 -91299 -46835 -47122 -77688 -108453 -162596 -206929 -206350 -130171 -135731 -66883 -46538
6074 -46538 -52044 -60151 -60078 -3615 33701 20465 -3187 -32608 -83028 -69051 -46518 -47141 -20202
6061 -20202 693 -15726 -6669 25211 49251 52479 56439 52464 9748 -4023 -388 13684 34974
6048 34974 10693 -26926 -26257 -29578 -15798 896 -14104 9552 -10239 -45531 -38093 -39604 -67984
6035 -67984 8861 94523 35298 14663 -37412 -27407 -33115 -15931 -20216 -75094 -68776 -69528 -73856
6022 -73856 -58609 -42528 -52127 24894 54628 64730 47013 44198 -4965 -55462 -74195 -72133
6010 -72133 -87401 -78473 -50641 -24049 -63414 -73692 -37350 -7819 -20162 52726 29282 4946
5998 4946 -12164 9874 32582 18704 12983 -35343 -42884 -3454 -15871 -58723 -36746 -33979 49992
5985 49992 23421 -227 9162 41426 71189 794 1454 28359 23992 34959 20598 38125 66727
5972 66727 33526 16659 16326 -5573 -53502 -48537 -19001 -12960 6288 45450 24778 -48994 -133330
5959 -133330 -137478 -77687 -38982 -13788 -2824 -21041 -29397 -33590 -99498 -91990 -94555 -165024 -172320
5946 -172320 -49476 -39012 -54180 6902 51064 44680 44525 51192 18286 -54348 -45327 42396
5934 42396 68861 58396 61514 48147 -33227 -116752 -111014 -101037 -89830 -97022 -101620 -71664 -17255
5921 -17255 -46901 -17685 -4834 1111 30467 29646 1397 -66816 -33097 -112 -10318 -80766
5909 -80766 -104285 -84245 -73517 -115438 -154011 -134432 -57568 -88833 -31909 -9963 -19177 -16712
5897 -16712 37076 36422 33166 8599 6354 19629 82370 51693 -14423 -58980 -47307 -59251 -80846
5884 -80846 -62561 -218 49149 -17968 -26724 -39744 -50694 -9253 -40533 -25582 13137 -1222
5872 -1222 -4308 56251 61431 38285 28187 -42787 -46311 -42122 83 20880 33187 303 46295
5859 46295 1268 -9154 12752 28916 13347 -7342 -29249 -42380 -45551 -18418 -37813 -107195
5847 -107195 -134612 -76745 -67007 -2982 7752 -1139 -34244 -27891 -34139 -51214 -74375 -72362 -109582
5834 -109582 -175255 -143521 -106794 -90204 -73571 -67323 -47731 -25257 -70729 -47810 29595 34887
5822 34887 -9039 -34115 3909 -4544 -25786 -71917 -83953 -76180 -83842 -60910 -24658 27097
5810 27097 -10539 -26033 -22837 -69797 470 84410 96989 69745 66559 93720 78469 -27284
5798 -27284 9136 21930 20261 71008 31843 -9464 -19139 -56179 -36713 -19623 -42107 -9719
5786 -9719 -2294 43065 48356 47495 -26985 -52455 -25609 -57778 -83671 -53036 -51554 10042 6062
5773 6062 -54025 -92322 -70505 -20871 -15531 14610 -4166 3731 -10402 -24780 -12215 25777
5761 25777 70035 64663 62563 64452 30902 -63057 -88864 -11728 3223 -2674 45719 82933 93697
5748 93697 39317 68901 42420 65971 92788 136232 126101 37484 -14134 3745 35851 27426
5736 27426 -2180 26997 32519 75328 50781 26108 45118 15098 24130 13106 27193 -11959
5724 -11959 -47820 -51333 -48025 -67919 -60445 -30152 -30500 -103805 -126971 -69948 13410 52334 -30993
5711 -30993 -107999 -93892 -37208 -71265 -48247 -80047 -91436 -78673 -11547 44506 64099 52963
5699 52963 79002 109939 136514 111507 74461 120147 45649 -17904 -20017 -35602 -13740 20873
5687 20873 -6864 8997 -29212 -32494 -37185 -5476 -780 -15011 -41002 3062 -2820 -20081 -48204
5674 -48204 -53911 -92083 -137071 -118008 -109567 -12226 -11661 -153 -14750 -6447 -19691 7850 5960
5661 5960 -9679 -6690 8297 9445 -26376 -36422 -34935 -33864 -23217 1035 2318 -16856 16824
5648 16824 25665 -81633 -126784 -65001 -29001 -60142 -36535 24686 43833 -7594 -25795 -23016
5636 -23016 15853 73945 68988 47763 -27239 -83041 -61629 -78458 -98506 -115256 -89098 -39987
5624 -39987 -30682 -10459 -2280 -42136 -59928 -27330 -5811 -45875 -92803 -80638 -2235 -10973
5612 -10973 -65436 -98134 -74932 -32754 -33278 18467 -6309 -15174 5819 24848 33846 -36483 -12867
5599 -12867 -16539 -15216 -52154 -1510 60916 111657 17145 -57059 -61558 -42029 -28387 -27680 -128265
5586 -128265 -137482 -50035 -49103 -59973 -23200 -45597 -56137 9158 55126 47004 1088 6237 4159
5573 4159 26795 12915 -22895 -30503 -2974 27269 -5334 -19247 42409 37589 -18043 -23814 -26644
5560 -26644 -8123 -14571 -28586 14023 -57811 -84766 -68509 -36828 -4444 45476 49754 27803
5548 27803 11997 -55175 -115349 -99615 -63665 -142367 -108478 -83231 -8493 -3854 -16088 6691
5536 6691 14955 24551 -1392 -39997 20731 48051 41682 11393 22302 66232 36502 2689 -42317
5523 -42317 6159 30584 5920 -5228 14296 -7656 -105942 -168801 -184072 -185740 -150593 -54059
5511 -54059 10262 -1699 25235 42043 18174 4207 10503 -4903 -54710 -3833 -5842 11864
5499 11864 26089 -8736 -21686 13429 17437 -10430 -28172 -34203 -45628 850 19346 -18917
5487 -18917 -57246 -57997 -60558 -53760 -66145 -40573 2758 9469 15504 50549 -12656 -21464 -27354
5474 -27354 -94214 -77011 -33062 -6070 34370 14701 -93413 -107439 -24923 -15932 7845 9635
5462 9635 2900 -22204 -91119 -86505 -51263 -27272 -11840 43612 56861 -32625 -19347 -20403 -57075
5449 -57075 -29031 -15506 31534 41063 41884 83166 101210 146848 169141 151205 85879 69080
5437 69080 34546 -18274 -17467 14626 38272 34006 30166 8535 -34148 -109596 -91676 -121000 -138027
5424 -138027 -166212 -169868 -164300 -136916 -125686 -126207 -97805 -73202 -85780 -69753 -49994 -50010 -87593
5411 -87593 -146468 -146099 -114310 -19798 47536 4512 -37022 -39677 -48885 -91060 -84473 -100193 -108856
5398 -108856 -74916 -41754 -27036 -15849 40648 50211 16595 -32875 -47527 -4086 32888 -9151
5386 -9151 -16204 -12184 -15066 -23037 -41926 -69790 -43488 -72645 -82580 -72961 -80371 -101530 -71627
5373 -71627 -32767 1746 8139 -41598 -49282 19845 -6546 -56845 -48068 -38647 -67157 -54879 -34590
5360 -34590 -19086 22814 -37328 -74521 -41141 8838 38868 -18194 -50293 -54407 -13746 37007
5348 37007 -17839 -70301 -87383 -93893 -119677 -69626 -86384 -92457 -24635 -16054 -3959 47684
5336 47684 45711 5175 -46173 -18697 679 -12143 -20712 -29882 -57388 -46433 -18767 40698
5324 40698 62914 89647 64399 20570 -23002 -93146 -92010 -42762 -55397 -55446 -75207 -44057 -56884
5311 -56884 -55972 -86753 -50894 -20083 -17093 -24128 11021 82210 135937 123819 125814 117892 61803
5298 61803 -21317 -47759 -59630 -50744 24563 60002 17358 -27829 -18579 -8395 33439 9465
5286 9465 -77406 -79051 -70255 -64322 -75228 -74168 4407 73182 48479 73991 66165 43048 -20304
5273 -20304 -58936 -26277 -10176 -28027 257 30579 -21941 -41988 -5805 10580 9508 21797
5261 21797 39845 75745 35057 -23685 -83110 -49834 6409 -4238 -35228 -32676 -31512 -80309
5249 -80309 -98679 -62812 13385 84755 76417 23394 -15128 10960 65978 115371 107018 109634
5237 109634 64531 40941 53094 46108 27232 54154 101915 76807 79248 55206 -4967 -20573
5225 -20573 -23503 43515 93545 37269 -33830 -39196 18358 4428 -4784 2909 -56767 -48652 -55680
5212 -55680 -85992 14124 40613 24099 29430 23438 30290 20548 -25030 -41437 -61363 -24458
5200 -24458 -29017 -8052 32769 66801 40236 -38135 -98429 -110521 -41840 22297 5712 -1919
5188 -1919 -22764 -15659 7211 -17041 -72787 -35219 16701 53023 41655 20630 31350 35167
5176 35167 -13761 -71365 -28187 17977 -224 -6154 -26872 -70622 -87610 -51710 -46677 -12122
5164 -12122 23059 40428 -46715 -57783 489 21584 43784 16574 1525 -36821 -51840 -30790
5152 -30790 -6900 -380 16556 16832 -28238 -28113 40853 -16014 -74038 -35561 -18889 11702 71305
5139 71305 45399 -35088 -38944 -7735 -75933 -89852 -38612 -29523 -3666 25307 -33224 -55846
5127 -55846 -118671 -124814 -118893 -140627 -131237 -45871 -21500 3373 10504 4915 -1077 43113 79931
5114 79931 73159 23384 9978 37385 67482 70203 93853 27727 -19422 -76609 -115284 -96488
5102 -96488 -134010 -118921 -75309 -23907 6610 56012 80024 101149 68696 34191 59987 18650
5090 18650 -31316 -28883 -29032 20329 36505 10565 -13865 -45604 -101846 -67449 -51757 4019
5078 4019 39930 121772 97652 -22770 -36460 32667 12339 6188 -31675 -78031 -47835 -58794
5066 -58794 -55762 -37533 -36747 -26477 -10462 10140 36272 54220 128543 148111 107107 100243 105500
5053 105500 70510 6838 -12791 -46414 -53101 -17114 -10939 15189 108060 132704 126708 125126
5041 125126 56124 -4497 -21130 -29773 -4452 29850 68608 41889 -67119 -42093 21819 26637
5029 26637 -45793 -63011 -15662 22266 -323 -36915 -41407 23448 48111 31758 -14974 -7050
5017 -7050 -14122 -21692 -53804 -106317 -101419 -89751 -58847 -28396 -86652 -97460 -82096 -47723 -44161
5004 -44161 -58789 -71692 -80484 -59360 -47184 -98012 -45209 58451 52985 -32995 -32890 -8386
4992 -8386 -17523 8528 23453 82084 119157 120301 66496 12595 -46635 -146864 -162808 -88293
4980 -88293 -16093 76 -10437 -38843 -36511 28916 37471 17730 -25891 -56216 -28481 40803
4968 40803 12674 -42993 -17182 -38455 -46342 -29450 -31791 -11079 -9874 -37343 -66632 -98696
4956 -98696 -72511 -60774 -43528 -11305 11899 -34536 -59121 18721 28220 -4237 -47576 -69102
4944 -69102 -42340 25763 29599 15707 48152 -29252 -23878 -76734 -110662 -114305 -162644 -131097
4932 -131097 -124653 -73953 -50481 -35973 -12158 707 3350 11901 58721 67222 38067 -579
4920 -579 -27706 -82016 -68837 -1235 41877 68682 54370 -11280 -93620 -104353 -75668 -44952
4908 -44952 -36616 -101591 -88985 14544 40099 27282 43644 70221 80071 69769 99999 96848
4896 96848 39042 -13841 -7751 -33782 -113461 -89044 -88486 -55558 -12066 -4781 -34353 -49339 -18158
4883 -18158 -41641 -32559 18193 11132 46192 98900 34682 21426 -3133 -51213 -54059 -58075 -45925
4870 -45925 33557 20887 15 -5486 54807 43422 -17644 55911 110473 33104 -68406 -52328
4858 -52328 -1900 -5517 15435 1435 4739 4394 -10283 4369 18566 -8762 -17486 -11846 -23168
4845 -23168 35838 69062 53221 -49647 -85149 -16689 12286 13958 43067 33985 27610 -31449
4833 -31449 -96245 -28681 29177 481 4516 -22544 -25806 -40835 -38103 5807 -2158 -21914 -22796
4820 -22796 -37575 -40720 -43553 -24511 -27839 -1403 4842 -47425 -90726 -91235 -56730 -51025 -51199 -86690
4806 -86690 -111077 27223 55555 19020 -55766 -84833 -65838 -67461 -16428 14107 22857 28991
4794 28991 24603 8486 -58564 -133590 -133104 -88896 -36661 10488 43589 4905 25893 105531
4782 105531 40376 -34555 -15548 48494 98830 99910 45979 29617 5265 -29865 -93351 -112170
4770 -112170 -149958 -147886 -93351 -64307 -70150 -17738 -27370 -12011 -34804 -82631 -56036 -16509
4758 -16509 -9126 -45592 -51406 -53270 -28433 18046 56264 37153 12750 -36175 -65313 -75617
4746 -75617 -68640 -66040 -44896 15746 -23488 -23403 -42863 -15321 70180 92642 75766 39372 12755
4733 12755 -14973 -26232 -17042 -15924 -15827 -25792 6914 36259 51366 -18656 -73538 -88074 -62589
4720 -62589 -86999 -95317 -101870 -102867 -70194 26671 66022 45706 28884 -15982 -22421 45229 44957
4707 44957 107254 56508 50976 50322 138 2704 -25252 -107858 -70983 -46842 -33420 6918 76904
4694 76904 87976 89231 94285 23928 6918 -23632 -61291 -28736 -82572 -105704 -76558 -48328
4682 -48328 -43105 -14257 10541 76989 36667 -31256 -40847 -33988 -32766 -52763 -17492 1153 -14175
4669 -14175 -48712 -77146 -26008 -12549 59643 103608 38992 -4137 -3889 -17309 -34354 -23326
4657 -23326 -52673 -23124 45960 61447 68663 113643 107262 87808 108955 113664 94530 45801
4645 45801 -2320 -37034 -92891 -30774 25433 23051 -17577 -40571 32066 80342 35331 26054
4633 26054 487 -4572 39851 29672 8383 -37053 -8021 -10857 -517 -7196 -36353 -30619 -4691
4620 -4691 41728 32841 8984 -20050 -49242 -32464 -77420 -107134 -85000 -40354 -60716 -121024
4608 -121024 -72960 -90475 -69323 -47518 -70731 -29090 -27757 -5711 -15482 -15635 -6478 -46454 -45994
4595 -45994 -68681 -21447 76528 80083 -2014 -49017 -72529 -31073 -23185 -93405 -90997 -27776
4583 -27776 8534 15820 10274 -2413 -3336 10782 24866 21034 25828 28518 -22467 -13858 -5120 -53096
4569 -53096 1834 5432 -55403 -53669 -3652 -27513 -69955 -90294 -115081 -56777 -49503 -77967
4557 -77967 -38584 44628 36089 11700 44436 86882 54823 33953 86278 80977 41030 66459
4545 66459 43816 11124 72303 47034 6636 1288 8229 10055 -51689 -59505 -51345 -101702 -124763
4532 -124763 -118784 -88020 -40759 -81066 -178627 -208464 -91423 -14561 -36793 3136 -22184 -36636
4520 -36636 24801 -14686 -82349 -35196 43666 56544 30937 -33178 -65660 -100039 -86051 -62187
4508 -62187 -4482 62559 22311 -9199 6270 58207 35263 -43624 -64030 2064 -16898 -78367
4496 -78367 -57819 18878 92224 97385 83462 66277 -2412 39208 43209 19953 -14896 -71327
4484 -71327 -29516 11035 19882 24524 34363 22987 81332 76018 288 -29346 40766 58567 72468
4471 72468 67539 37911 -4319 7318 61843 52446 12494 -69505 -103553 -64948 -26353 13879
4459 13879 76495 71108 17985 -29573 -9588 36109 40945 -9669 -29598 -32444 -6705 -22766
4447 -22766 -93398 -95188 -57779 -54062 20179 33760 -10591 -54869 -73285 -76328 -63229 23656
4435 23656 44429 -37611 -72879 -66081 -23398 -22611 29246 33350 41182 61144 18679 16847 11107
4422 11107 82 15611 5880 10739 -39249 -116449 -151174 -100868 -46823 -88568 -56943 -18080
4410 -18080 -32512 -64993 -21379 63103 86924 42274 -18648 8865 -2173 -24623 -7743 -3398
4398 -3398 37042 38552 84428 110985 81742 81439 73016 48124 42603 13278 -16963 -50260 -77115
4385 -77115 -6213 87885 124952 92849 98450 108502 12905 3080 19751 29241 3785 -5451 9601
4372 9601 39549 29501 -30059 -40756 -19272 -28488 40216 30823 -5552 -10969 -13535 -61285 -67950
4359 -67950 -10355 -81033 -146715 -87756 -14372 -7268 -86607 -97658 -104075 -78793 -22672 10747
4347 10747 -5874 6601 -24510 -16381 -48963 -67063 -66166 -105322 -113989 -57463 -3489 14429 1355
4334 1355 -10229 1603 43463 81545 82762 63572 78778 65481 75702 41871 -13952 4286
4322 4286 69200 55941 43286 107115 117082 92131 40304 32861 90109 44711 30733 40766
4310 40766 74435 77773 47584 16554 24283 16274 -9572 -3633 12331 43676 -72 -49374 -27615
4297 -27615 55541 91508 49752 31693 26934 40613 -22968 -36128 -12852 -16017 -123102 -124504
4285 -124504 5724 80616 38825 -66674 -75751 -38376 -21708 12469 23904 5784 27905
4274 27905 66072 70903 37600 113456 73960 -20785 -62390 -96492 -159203 -123473 -148741 -137238
4262 -137238 -82957 -82905 -37068 15558 48326 34773 29099 19668 60026 80906 65604 85286 105091
4249 105091 49824 -35754 -64433 -83249 -55314 6639 9845 15959 -2156 -4428 5236 -50866
4237 -50866 -88240 -7750 11055 67254 74598 6643 -61503 -58725 -82227 -89566 -47950 -54942 -28921
4224 -28921 -11693 63210 113129 85608 19679 7486 -68319 -14857 66178 89906 80919 32729
4212 32729 -30261 -59410 -8055 -6312 -4266 -9842 -24887 3828 15112 -28360 -53150 -60319 -62653
4199 -62653 -88274 -44558 4522 54775 98125 100057 80305 82526 30913 39037 83210 67218
4187 67218 22192 14136 70377 167704 184197 147517 95528 103607 182165 179110 116561 71368
4175 71368 25310 16542 49272 60972 41870 21932 1631 47010 37596 -44210 -101566 -36498
4163 -36498 15142 4806 50618 40929 28890 97702 120715 100568 60745 65768 84900 108586
4151 108586 4016 -70844 -56520 -51228 -59570 -50194 -52206 -15792 43662 88382 112957 90472
4139 90472 -19171 -49536 -54510 -78662 -46890 -10313 15940 39766 38371 914 -8996 -1786
4127 -1786 16632 78010 86906 58865 62610 43604 48069 -662 -64441 -76811 -80402 -107268 -56549
4114 -56549 -52329 -69722 10790 39704 -38001 -44110 -14510 16502 24173 30942 11983 -5653 -43501
4101 -43501 3470 -1222 -28834 -65241 -86111 -108845 -68467 -8516 -4183 -24962 -35866 -55613
4089 -55613 -91235 -121556 -124076 -85257 -27739 -20524 -38670 -104984 -92575 -47680 -20571 -45415
4077 -45415 -58004 13701 39847 59857 55591 6227 -11059 28742 19555 6871 -20423 -44228
4065 -44228 1017 26695 79683 79907 23032 -26269 -17812 -28302 -51847 -36349 -37748 -10431 16886
4052 16886 -3867 -12142 -28625 42243 71860 44589 17335 50477 17525 13293 5936 -1629 65293
4039 65293 103319 81068 15890 -42559 -64289 7207 -12227 -17406 -48481 -39220 10587 3477
4027 3477 -18493 2072 4485 27426 29841 19931 70385 103736 48476 -36584 28899 62656 -33681
4014 -33681 -50843 -16638 -35870 -77868 -90799 -97096 -83569 -53827 -32935 -10092 -41014 -58323
4002 -58323 -43441 -39630 -19369 13227 -17135 16541 52342 32861 1836 3359 72989 96057
3990 96057 54965 37651 15217 26263 53759 57646 60789 50617 33549 53205 49907 27242
3978 27242 -24982 -3921 -24937 8101 25845 37834 41233 46106 53977 42775 29543 -1033
3966 -1033 10665 22667 51670 71831 17606 -29576 1285 19426 -26653 -31479 -245 -2991
3954 -2991 -14343 378 57074 -7462 -74717 -45565 -27027 -15941 16985 34321 48169 53881
3942 53881 91934 108817 117073 83674 92162 155428 192400 156358 43622 7660 -786 -11271
3930 -11271 -3948 -21461 -97817 -91036 -44739 -53217 -17836 65182 78955 39201 26636 16847 36307
3917 36307 25604 -19765 -70656 -19647 -17852 -91451 -96403 -94593 -56234 -35811 10648 -12031
3905 -12031 6211 -14495 -10645 159 56451 70698 62577 50911 96794 65153 81303 57334
3893 57334 12197 -18436 -12754 -20361 -43097 -81369 -62498 -62548 -49645 -24418 -19416 3048 -19592
3880 -19592 -68949 -154228 -108811 -55451 -51251 -87026 -104899 -45869 -46876 -87255 -69916 -27861
3868 -27861 -39300 1704 -20394 -62052 6562 -470 -44779 -32669 17703 3341 -29469 -56706
3856 -56706 -68971 -115042 -107412 -68534 -83284 -60433 24751 41423 -3991 -57433 -71822 -4005
3844 -4005 33170 -41456 -88259 -78449 -60149 -38770 3950 8730 -9728 -27344 5933 2541 20493
3831 20493 39431 41066 21983 31445 26184 -4465 -17506 25129 53590 33880 17502 55250
3819 55250 80904 84696 41475 -645 -40957 -6520 52682 42636 -9348 -65780 -39862 -46508
3807 -46508 -10220 19971 -9116 -56180 -68564 -65396 -8018 1158 -61976 -108318 -69295 38297
3795 38297 93081 114870 172025 200852 159001 144605 78620 93968 53208 -18178 -504 -2822
3783 -2822 -21415 368 -28481 -4384 -60 3168 39732 76345 47206 26685 -24221 -41297
3771 -41297 -21974 -39331 -45114 -4736 -6937 -11750 -30623 -42706 -58796 -26369 -29481 36089 21143
3758 21143 13620 8561 28547 31184 -1461 -41293 -65110 -25623 13582 -3902 -40126 -31876 -37027
3745 -37027 -8069 13704 45755 87691 92382 55252 45492 6309 -28914 -59051 -39380 1153
3733 1153 6218 3162 6903 18154 -32840 -74086 -36875 -74241 -100545 -70561 -71185 -79212 -87896
3720 -87896 -76594 -31310 13211 -32064 -56566 -42544 -81468 -129792 -99009 -68134 -49694 -3989
3708 -3989 -2511 10310 4311 4815 8191 24122 18561 -9941 -25414 38526 87135 95329 23002
3695 23002 -21874 13676 37448 17762 -69178 -95545 -59060 -37695 8214 28336 56913 29623
3683 29623 -407 -16409 -40240 -82108 -56232 174 -11925 11912 -4659 -35782 23756 41720
3671 41720 -25060 -29513 -22149 -22678 -72825 -74312 -16425 20369 12288 -23010 -50037 -12299 30716
3658 30716 45148 2223 -45482 -19532 6420 -45060 -124998 -108561 -11388 34240 80989 97389
3646 97389 5802 -63026 -48442 32546 69003 55788 17126 -16791 -341 -39552 -65331 -104399
3634 -104399 -128665 -107484 -55524 9250 29563 -12679 11578 56048 63884 52222 31643 26692
3622 26692 19306 8266 38480 51552 60357 86926 -10000 -37249 -74938 -63593 24211 24207 48481
3609 48481 17657 8014 -24053 -8896 7479 -5883 29508 57675 29617 54445 62527 -6228
3597 -6228 -54928 -70261 -67499 -53241 3342 -34624 -36860 -16521 5692 -30677 -98936 -101749 -74902
3584 -74902 -33401 -48911 -82693 -125665 -125759 -97429 -22683 26598 7047 5034 10079 -39430 -135342
3571 -135342 -112757 -44884 -2649 -11808 -20663 3299 75919 90484 -23551 -71316 -40081 -6668
3559 -6668 6405 3055 20195 -1834 16431 5601 -14136 10513 18425 28561 26000 20807 45437
3546 45437 71577 57219 -14962 -10828 -7724 -26047 5136 17459 -9986 -28883 -64048 -36032
3534 -36032 -24748 2605 9868 35294 -6085 -60806 -37904 21905 37615 55609 49563 2234
3522 2234 -17147 5911 4954 48351 63584 18784 18991 23196 10909 -45984 -84352 -22844 -36387
3509 -36387 -62771 -26919 46073 65656 51361 15341 -36860 -35727 -30281 -60051 5250 57773
3497 57773 31582 -5206 -41460 -720 61040 111675 128370 65961 3534 -31498 30668 62339
3485 62339 35302 54869 51026 37682 40984 29430 -15237 -2548 -13840 -62240 14945 22416
3473 22416 14318 12559 53288 56905 51750 78364 64700 72599 38507 17853 41091 3937 -53814
3460 -53814 -58304 -50848 -15262 -83522 -83036 -40315 48347 18162 29023 24763 16779 55579 55223
3447 55223 20527 -38958 -26247 -45385 -23097 38067 18958 22960 -5831 -25994 -12978 -33903
3435 -33903 -60552 -20283 -48474 -44494 -45884 11538 36870 66670 25616 9091 28776 8884
3423 8884 1709 -28878 -14813 36171 133350 132428 96273 76208 42674 -4036 42124 43791 12660
3410 12660 2125 39769 32982 17366 31964 43052 10841 -42170 -90917 -101512 -28187 -77449
3398 -77449 -115757 -90616 -65680 -55077 -42221 -95347 -48063 6589 53603 108572 147070 126007
3386 126007 35020 26145 64532 98948 109591 114239 146000 112907 80472 86249 135504 117663
3374 117663 27110 9191 46323 60185 44100 37565 27329 -51524 -77841 -26829 38 -31634
3362 -31634 -20166 7004 47016 58915 56699 58293 42332 22664 3313 -67900 -70882 -44354
3350 -44354 -64117 -38405 -7914 32091 19545 -14878 -28119 -17410 9092 -13823 -70757 -91340
3338 -91340 -40642 -311 45937 56833 14773 -74481 -85042 -26935 -2677 -694 -64707 -129048
3326 -129048 -77763 66840 95593 52876 45406 6894 16873 50399 23682 27323 83503 85724
3314 85724 50387 30921 54023 17683 -10067 23656 -20791 -56547 -70924 -69072 -83741 -81424
3302 -81424 -42725 -47496 -93546 -92993 -43112 40754 49679 17423 -959 1726 -45931 -43746 -45900
3289 -45900 -50994 -23675 8904 -57091 -129474 -130282 -17783 -22327 -31484 -32213 -13466 2010 16755
3276 16755 4999 44003 18224 10785 -7178 23258 47588 20205 9844 -13257 -30071 -81289
3264 -81289 -40160 -4323 -38117 -72180 -28353 30767 15506 -626 -17099 -14713 -38336 6789
3252 6789 46700 43196 27022 41208 94687 113616 70675 -21617 -53766 -208 17920 -39044
3240 -39044 -15548 -812 5514 -216 -18777 14896 -34207 -32986 -56898 -84573 -90799 -58716 12844
3227 12844 67173 82819 57170 -35739 -72486 -100287 -88289 -66799 -56419 -27117 30518 50190
3215 50190 47092 -4403 -63258 -49079 -44920 -36037 -31471 6939 54786 71096 31391 -16881 -18962
3202 -18962 -20997 -12463 11281 40 -26426 -21626 -47658 -47597 -34379 -47650 -35212 -56152 -68641
3189 -68641 -63297 -31159 -72955 -146570 -122686 -58493 7248 49796 51111 47065 22122 -14551
3177 -14551 -76783 -108913 -87898 -24751 -57714 -95955 -123047 -128144 -95198 -76459 -60732 -51004
3165 -51004 -52597 -22547 29888 44676 18475 -1952 -17064 -32510 10386 21209 -10666 -6473
3153 -6473 2023 -8986 -43728 -18273 -14148 4033 52392 49142 -5821 -22429 -26710 -7981 -50122
3140 -50122 -73526 -76874 -43286 47347 3346 -19474 -126226 -147050 -123485 -98831 -58398 10417
3128 10417 -35217 -88565 -86866 -84392 -57516 -8883 32170 6916 -6584 24398 80002 116393
3116 116393 129162 142002 113325 23626 720 80293 42648 -17730 -62414 -50764 2775 96986
3104 96986 79288 40681 53998 71675 125994 118109 38505 67845 61343 8323 3447 248 -37184
3091 -37184 -96492 -95331 -68825 -82200 -55193 -19315 -28160 -66357 -54216 -40568 -76183 -42697
3079 -42697 -36285 -41151 -19661 22003 1601 -22970 -2400 53685 76610 68992 77377 61536 32258
3066 32258 5965 34236 77378 46604 23601 25099 -30303 -47210 -10564 -32422 -86346 -84536
3054 -84536 -44348 -1728 81299 72964 50713 66940 53194 1313 -4546 -5650 -36720 5665
3042 5665 -37647 -77399 -85492 -32829 -8357 -26798 12519 2653 -5283 -10608 -31245 -31463 -2079
3029 -2079 14668 -8977 13704 61048 20847 -64612 -98028 -40957 20250 14921 25075 -11095
3017 -11095 -71576 -69595 -81255 -75243 60 2668 -17882 12629 -4592 -33928 -446 -20753
3005 -20753 -22168 15073 36205 -13202 -58386 -84959 -84812 -111018 -156336 -109918 -103013 -107669 -27020
2992 -27020 -41002 -103162 -51191 -41142 -68746 5672 -19830 -85472 -71513 -31207 14046 41612
2980 41612 57948 26448 -40721 -139741 -197528 -141889 -77092 -38089 -49237 -43383 -35075 -31083
2968 -31083 -59988 -49319 -1573 630 -6407 53456 100752 100161 47147 56838 30155 1109 27860
2955 27860 19547 19860 -1377 -13147 -10469 -15446 -46576 -19930 -19865 14376 41450 2056 51764
2942 51764 91947 68056 9842 5430 -25724 -42845 -27016 -21430 -22045 10305 13707 28923 25583
2929 25583 -437 -23658 -18714 -15816 38401 22759 -19541 23909 97778 63308 23674 816
2917 816 607 21590 90240 53759 -7545 -50290 -54901 -13575 -7021 -37662 -14144 26964 -25017
2904 -25017 -87638 16814 -38999 -59288 -86402 -38918 -17910 -37093 -99530 -137249 -91729 -80375
2892 -80375 -43861 -45719 -65289 -4393 21401 -5228 -30050 -22752 -67442 -79285 -28733 -13892
2880 -13892 -108902 -117768 -120329 -124649 -89110 -29147 21951 67634 21808 -58150 -55676 -14087 -30698
2867 -30698 -30499 -24937 -2729 76459 84995 44674 -7556 -15198 -3179 -28474 -10067 20464 -18296
2854 -18296 -16742 36649 83833 67904 21626 -32932 -9095 -38690 -3888 21439 25683 16128
2842 16128 4981 -9095 -30281 3102 -542 8733 40609 -2453 -81521 -108515 -92680 -99234
2830 -99234 -130698 -170910 -61682 53946 69164 91490 86735 56519 12199 19587 -22988 -22691
2818 -22691 14207 46572 34777 29186 33269 43609 56851 51861 53098 61450 15514 1805 -21498
2805 -21498 -25007 -50122 -10389 52880 67673 58408 71491 86412 142015 173776 99726 46299
2793 46299 19866 57532 83118 29186 47542 66104 40907 8811 12079 70992 41680 2109
2781 2109 -5065 -51943 -77497 -58775 -13623 20333 -11179 -20932 -11982 -9566 18573 39115 27248
2768 27248 16000 -24373 -56471 -21254 -26801 -30221 21499 45394 26414 23613 -10320 9631
2756 9631 33411 100595 94991 48401 30653 40647 51072 91621 145075 91784 70001 49874
2744 49874 32934 33816 -22244 -79665 -64010 -19012 -80039 -100468 -105827 -41402 -41258 4664 37702
2731 37702 12184 19226 24135 128779 111829 47330 44738 77275 98724 62681 -2971 -4576
2719 -4576 -42457 -66185 -45966 -26473 2086 15731 -1180 57656 75917 72190 59498 50074
2707 50074 65450 21676 -68703 -113859 -101088 -86247 -51498 -20161 -22182 16281 95958 102153
2695 102153 37471 36058 38688 5692 -34517 -18856 62131 154938 164245 69831 20127 51784
2683 51784 58881 61274 72651 36806 -25561 7843 46071 63908 13488 -26266 -40752 -85567
2671 -85567 -123856 -66307 -36524 -25288 14985 50746 29526 38777 47938 -30732 -77703 -99904
2659 -99904 -77139 -87341 -105208 -60306 -19834 59221 35227 -9822 55318 55806 22332 43957
2647 43957 63773 51012 29745 22724 -1444 -25452 9511 17913 56061 47848 25721 35055 17862
2634 17862 51369 77771 30290 37587 167 -40861 -65399 -4662 37268 50202 52664 92860
2622 92860 48155 56477 25211 -37784 -102960 -78928 39909 59614 23607 -25634 -36301 -47223
2610 -47223 -55266 -24252 -822 -85305 -105216 -124705 -158828 -131675 -35885 5349 44601 13334
2598 13334 -29834 -32913 -3416 -20555 -73101 -10149 -7997 -76306 -100695 -13161 28033 -11872
2586 -11872 -5110 -3070 -6967 42005 58056 58990 46494 -44694 12924 58068 38364 16479 26201
2573 26201 17075 -11791 -18977 33951 43140 -4448 49388 42732 -485 -27500 -27594 -4731 20287
2560 20287 56056 25929 10571 -944 -1573 15352 -1499 -50132 -49400 -34708 -66456 -96254 -82579
2547 -82579 -37863 -21692 -5331 -42685 -10514 47929 41325 48578 35205 -28757 -15112 -13320
2535 -13320 26215 83205 83372 20528 -17040 -42748 -34079 -58325 -36108 3692 34781 36522 -28051
2522 -28051 -32003 9073 59263 107054 90113 40328 29060 -58 -29664 -100202 -200080 -121633
2510 -121633 -73207 -35273 -16484 -24748 -80558 -48622 -36749 -85952 -77608 -37816 -67365 -95826
2498 -95826 -91798 -25545 12296 20263 64903 84809 78963 72789 34978 63858 10448 31236 58114
2485 58114 -3787 -6734 -19981 -72142 -17595 76632 97861 49633 18688 -13537 -9541 63113
2473 63113 42435 -8336 13810 48021 50420 47826 17084 -16727 -5932 62007 105812 124511
2461 124511 98718 28719 5769 6112 32266 94546 77001 113641 142480 92469 119633 88051
2449 88051 21279 -502 32831 51252 44473 53593 40741 23116 40674 55996 98542 92537
2437 92537 48398 -156 -33701 -75303 -81773 -78406 -3260 -20053 -47820 -107742 -145651 -134827
2425 -134827 -67368 -103193 -42977 8140 55728 23875 -994 -49185 -45726 -10688 49617 39634
2413 39634 24482 65215 53227 8938 -11973 -3115 -4083 -12637 1872 6756 -34959 -45209 27020
2400 27020 59347 23487 30315 61140 -4236 -15298 -10955 -69525 13455 66859 56924 2958
2388 2958 -46671 -101105 -92310 -42001 -57548 -74688 -66005 -109268 -90554 -28985 30036 30108 74253
2375 74253 83390 98065 47382 12149 -4161 19098 11647 32352 18252 -23814 8114 47871
2363 47871 74400 81565 18668 -3119 64561 85814 49696 14163 -29819 -40915 -8678 -39968
2351 -39968 -47847 -11486 -6447 15305 -2197 -13444 -51414 4252 9980 15947 12316 -9744 -16186
2338 -16186 -33029 -38210 -19750 -9217 -15242 -43125 -72115 -49271 7239 9618 43903 16009
2326 16009 -4633 -21880 -15066 -17153 1127 46461 80185 57089 7267 19388 17575 17740 45427
2313 45427 25965 -4560 19872 43240 62849 83703 -18259 -60397 -108443 -95504 -11433 32028
2301 32028 36762 30082 117007 107093 71788 71074 41016 49998 59893 78863 99915 91786 83299 109263
2287 109263 55477 34705 13513 -40861 -121281 -106315 -58956 -30845 -66387 -41367 -16977 -51773
2275 -51773 -37702 -8789 8174 13803 28433 72446 56258 47521 -8645 -38432 24954 67750
2263 67750 26023 -5918 33937 68948 56757 15096 -3023 597 29694 -72 -18444 -14228
2251 -14228 -17260 18576 57228 44633 43220 11335 -19963 -39865 -68477 -52983 1977 -5295
2239 -5295 65701 90839 93139 76343 41632 40380 97418 162105 148066 104613 69991 29222
2227 29222 32806 65243 2453 17241 69854 92052 59250 13860 -30165 -15581 -6425 7671
2215 7671 7716 -31141 -23885 31595 -25609 -29918 -22786 -17423 -57255 -26419 54405 28406 -2814
2202 -2814 -8978 -49346 -20275 21272 46182 81566 57268 5078 -28925 -19439 -157 -31478
2190 -31478 -101493 -78810 -93123 -141962 -106655 -49332 -23617 17255 5495 -3218 -38691 -75663
2178 -75663 -45229 -10990 -17003 -67704 -72854 -47238 -27849 -26158 -49376 -5163 -5004 28110 74585
2165 74585 50423 -8168 -62561 -28675 10749 -4913 -65291 -83958 -61808 -58389 -219 35578
2153 35578 43755 -12280 -19752 16959 10660 26501 49878 28513 -48056 -65415 -14489 1614
2141 1614 33619 33051 -3815 -28460 36875 32639 18161 22267 27764 30282 29866 5618 21258 27925
2127 27925 22614 22710 54591 55993 63565 75257 58066 47161 6523 -50162 -37277 39046 7157
2114 7157 -2034 -23570 -35415 -7313 2635 19758 56375 45173 31144 80997 100397 76601
2102 76601 40121 47135 -2426 -28205 -15370 3994 -3798 -43329 -57537 2883 35742 34476
2090 34476 67557 113730 82790 54717 -55527 -76193 -57919 9636 20697 36767 -13433 -55453
2078 -55453 -4597 -22699 -34895 38288 13211 -20340 2907 13650 -45287 -48112 3050 34646
2066 34646 16920 28894 23043 13651 5688 23671 -11388 3946 -20333 -35973 -24420 33352
2054 33352 73790 73821 34036 -7072 -33841 8800 -18772 -27278 -47500 -142457 -119116 -14964
2042 -14964 23720 16511 -3596 2106 -20018 3539 -5430 -4496 23194 4026 12860 -24700 -65930
2029 -65930 -45975 18314 -45459 -126596 -88479 -50153 -10208 -33625 8748 110304 33744 30484
2017 30484 53724 -40051 -89156 -49641 8488 56672 55100 19930 -16847 19180 5733 -33076
2005 -33076 -1078 13784 48853 32530 27730 48161 12158 -18935 -7520 34825 -19168 -75491
1993 -75491 -28608 47761 97128 91227 97275 7496 -53887 -95677 -113819 -97255 -34281 24257
1981 24257 73030 59245 -1771 20734 -13267 -29616 59051 65334 59452 54178 75828 63155
1969 63155 -10226 -13238 -5155 -19128 -56371 -51849 23186 38949 -19507 -31483 -51513 -34282
1957 -34282 -24312 40935 86450 75421 25455 -24378 -31869 16222 4997 -4921 13042 881
1945 881 -65204 -62694 -52478 -30989 -14994 -39449 -61203 -64790 -51308 -68454 -61834 -35595 -19389
1932 -19389 3987 33506 45900 58424 57073 30195 25324 43786 61386 25694 -50704 -75841
1920 -75841 -61575 -76451 -78853 -42274 10514 37242 67552 41936 19590 -11805 -14121 49911
1908 49911 46699 8943 62726 45338 16795 7010 -60222 -66427 -133744 -134925 -128284 -54416 10163
1895 10163 34146 34917 -3780 -52454 -54412 -55269 -41925 -26006 -20771 -8417 -34491 -48678 -79145
1882 -79145 -52974 -15272 -47639 -49738 -98726 -71507 -3352 67714 62774 20352 -10097 -30345
1870 -30345 -48103 -49770 -79791 -75111 -56500 -15814 6876 64316 44915 12621 46698 67805
1858 67805 40927 36212 31760 24729 26603 39668 -12821 -33297 45673 96182 119134 131955 127691
1845 127691 65583 7626 39663 84543 55103 23690 54232 20062 43553 59078 47210 24407
1833 24407 46005 50336 24912 24276 -9341 -21667 11755 -32087 -39609 40656 35483 1920 -32923
1820 -32923 -26835 -17869 49773 31588 29815 46909 46914 88509 63791 60481 58771 22768 54923 74157
1806 74157 64548 100939 96779 55606 25321 86405 15726 -27542 8238 -42604 -57560 -25821
1794 -25821 15813 76014 10294 -34848 -86568 -23917 743 15304 23967 21668 447 -31185
1782 -31185 -30379 -47056 -39101 -62836 -141806 -148251 -130253 -37455 19929 26573 31059 54787 56007
1769 56007 32504 40160 55481 94779 66747 25881 10030 14955 24280 13126 40376 49945 48545
1756 48545 7196 2700 -14503 -2415 35511 33338 -26579 8754 -53491 -85640 -54354 -62019
1744 -62019 -45146 -26226 -15510 -49511 -23507 7155 24738 29666 -48868 -8090 -37853 -38191
1732 -38191 13366 89544 97836 116590 47341 -36866 27365 94645 113084 144284 133974 37491
1720 37491 -16373 -2388 12937 46146 118526 162711 88732 -17399 28094 60997 56833 19180
1708 19180 -3222 18373 93623 46947 -22058 -7157 -14878 -63042 -82955 -40066 -29040 -44186
1696 -44186 -56299 -38137 -27088 4382 30077 65193 92684 38995 3408 53407 54167 71182
1684 71182 33957 23942 28910 17301 20933 57793 56226 40290 13227 -549 -3786 5806 3125
1671 3125 54115 23070 38395 16749 -7863 9057 -5281 -19733 -27607 -92 26547 33673
1659 33673 89060 119512 140712 65705 30035 61866 46859 30927 16390 51383 36509 27343
1647 27343 66280 110165 144317 76591 -6364 -45380 21147 77757 96095 59930 -6680 -10144
1635 -10144 1910 -30375 -27530 -37104 -16517 -30767 -26374 -24039 -20991 -18777 -64606 -93953 -8261
1622 -8261 34080 57982 62696 45693 64480 105125 117659 166618 126052 121063 71263 35347
1610 35347 59459 82332 65121 21061 -25311 -35209 -34891 42581 35050 -30145 -47950 -14387 16220
1597 16220 23910 79584 104033 37458 29744 19143 -11216 -13466 -54094 -93636 -96678 25871
1585 25871 108080 109602 74504 18686 26109 10941 -47029 -6089 -15573 -22715 -27133 -64082 -86045
1572 -86045 -142 91479 54684 30481 33424 17371 37116 67557 51680 24564 5057 -27054
1560 -27054 -58413 3525 73557 75431 50528 37804 102485 75476 28548 20879 -8075 9608
1548 9608 -57225 -45660 -17337 11681 26764 55560 86378 23674 23320 7487 -16379 -142
1536 -142 -28264 28822 56522 43893 -41120 -68917 14688 92938 40043 56192 68109 -72
1524 -72 4067 -24965 44546 71118 71989 131058 122249 97452 68882 40258 11216 -990 46077
1511 46077 36470 -30580 -44255 -27545 -9001 35117 -27567 -60183 -29346 30875 27557 45299
1499 45299 30793 -2216 -57067 -76914 16194 74691 90479 39502 -32080 -94319 -75149 -32789
1487 -32789 -23620 -15561 -26635 -52802 -41065 -2200 -24500 -76079 -63563 -19592 -75612 -84470
1475 -84470 -42079 -19608 -7812 42526 10026 5829 22284 26866 -14907 -42822 -7209 15930
1463 15930 4589 -7692 24000 15711 -21374 -10890 11093 52008 33332 7365 -636 -580 -44781
1450 -44781 -49468 -25183 12300 -3356 45051 24101 18518 20897 16996 3680 -49891 -71885 -62867
1437 -62867 -73892 -27877 -51098 -144268 -192176 -135777 -57201 -36905 -20247 -59262 -86679 -93665
1425 -93665 -41614 5390 -7961 24066 93044 126420 148590 160138 120939 82792 91345 109371
1413 109371 34478 29439 -34727 -84712 -62277 -42726 -31533 -59792 -75470 -87088 -48765 -34810
1401 -34810 -20626 37121 50482 -1122 -13885 -44788 -29910 -54255 -388 30406 40440 -11420
1389 -11420 -39026 -1710 51337 98519 54745 -3839 22544 18230 43695 69345 10711 20319
1377 20319 66172 75606 82197 83510 76777 58519 51878 100830 131545 100144 91480 57338 39187
1364 39187 29185 45191 63293 70187 23367 -57302 -19660 50505 50916 56695 -6361 -46877 -97502
1351 -97502 -55178 -37125 -12322 -33204 -24948 -38464 -79370 -86196 -55318 -46006 -40422 -596 72970
1338 72970 112348 124459 85602 35297 20472 13366 11367 25840 82053 69098 50869 63041
1326 63041 38564 -3945 -89013 -168259 -132788 -75741 -44675 -70518 -46020 -1618 4577 288
1314 288 -18733 -52106 -45684 13759 43011 44125 19470 21313 44635 20511 -9892 4223 -12139
1301 -12139 -50831 -27235 29562 -2853 -19558 -18522 4373 15244 25258 60844 90983 109000
1289 109000 39844 22254 51514 41593 -31478 -92888 -85726 -56780 -4395 15194 -19444 -24774
1277 -24774 4865 -29344 -22426 -34784 18239 31646 32415 18360 15349 30764 49178 19914 -4082
1264 -4082 -75782 -92760 -41784 10367 12059 -23203 -12742 21649 -13073 32143 57766 92462
1252 92462 114646 102838 95102 78190 35660 39644 51485 37250 -41891 -73317 -36653 -18698
1240 -18698 23243 34160 -6716 -45814 -73244 -42050 12715 8389 -31885 -52093 -66522 -72150
1228 -72150 -43030 -39452 -50167 13274 24473 -9494 -19709 20409 18507 9877 19648 -24524 -33522
1215 -33522 -31453 -866 31000 69391 87837 69619 30902 6389 8891 -25449 -106198 -132028
1203 -132028 -59446 8112 47904 91745 55401 -5606 -71149 -39886 -48078 -48528 -13442 -59814
1191 -59814 -89241 -29573 -690 -23023 -14400 -33283 -6682 40242 39446 30175 17697 -22436 37713
1178 37713 113407 140534 121642 78784 80894 68895 34437 24192 36688 72708 45638 -27161
1166 -27161 -29356 15174 -11224 -7370 6363 -6929 24968 38123 67581 89903 57067 2676
1154 2676 -16743 34216 83786 53878 3838 29053 41390 53488 31385 -84808 -103815 -114442
1142 -114442 -125313 -123803 -36484 -9914 -3876 -38003 -38035 10363 -35631 -86816 -56172 -13274 49121
1129 49121 67474 65254 52011 62244 67398 18287 -49151 -73965 -62936 -17119 21075 -30859
1117 -30859 -31983 27017 42344 76785 43190 4307 -13517 -25627 -43224 -34458 -4707 -7016
1105 -7016 -11442 8110 -68577 -76770 -38271 -10924 4758 -8130 -26065 16173 78174 122425
1093 122425 153301 161522 146658 111067 43574 47791 25449 -4440 -5303 -22968 -6418 50540
1081 50540 94759 92196 84974 90494 148155 141025 60178 25468 36528 -22484 -75118 -69051 -32353
1068 -32353 -2223 22548 3910 31668 31346 31444 20343 -14440 -55427 -78967 -72230 6302 29362
1055 29362 20050 4620 13594 -22500 -28301 -49127 -42797 -23565 38030 23608 -8231 291 42045
1042 42045 17434 10125 -7786 -77123 -143116 -106742 -69179 -12256 -65851 -120645 -43838 -12178
1030 -12178 3970 41738 33625 36308 19054 -5035 49483 44218 34836 -33483 -41152 -10655 -34528
1017 -34528 -7883 66162 40785 37786 65976 18520 -16988 -19643 -72620 -146043 -100476 -20023
1005 -20023 56849 99872 63597 94534 73358 26088 8919 13254 -27836 -79272 -16978 29623
993 29623 -29821 -27373 -77963 -51412 -59735 -62387 -44004 -20262 1774 -35654 -52805 -11748 -20416
980 -20416 -47290 -37706 12049 17988 16716 -26993 -34879 -51001 -42547 -56705 -30721 -5731 41493
967 41493 57591 22411 -34383 -58298 -44854 -61626 -16784 -23680 -29339 -61104 -33255 7338
955 7338 16746 94831 80155 42960 61148 85285 55107 82338 136302 129135 112562 81375 52476
942 52476 1611 -1014 35570 84102 117219 61618 -22182 -61190 -5442 68864 7704 -63024
930 -63024 -78307 -46290 -36049 6646 -3103 -32894 -48009 -39324 1539 -3575 45628 74995 77438
917 77438 92372 56176 3934 826 -1582 -69900 -96885 -111258 -54318 39655 104622 54492
905 54492 21587 66971 20032 -28515 -91725 -109901 -89842 -84446 -50474 -16812 -17104 -74930 -38963
892 -38963 -36287 -42323 -56584 -5971 -3050 -9893 13129 44829 12363 -7497 -51173 -45258 -60005
879 -60005 -6243 32423 56075 69146 34586 869 -6017 -18192 -7755 -26490 -21764 -20569 -6962
866 -6962 -5187 -66407 -58218 -72809 -54752 -50447 -40159 -26338 -35769 -111472 -45274 16426 -61911
853 -61911 -75775 -30014 -16590 -53209 -102791 -152878 -171423 -214360 -125940 -32839 -7194 8378
841 8378 52359 33601 14112 44574 -4582 -69903 -48749 -7692 21325 101348 128018 77740
829 77740 84379 101101 64397 20630 12885 15707 61077 75180 17981 -75509 -100416 -39946 -38016
816 -38016 -36643 -40724 -34330 -35793 -63336 -94415 -119648 1814 56614 -1916 -1059 37422 47577
803 47577 72579 25981 -26075 -16403 -15811 341 43186 74323 99229 67942 -56137 -130494
791 -130494 -75316 -81654 -55875 -17270 -78935 -63409 -39983 -43644 -30605 30271 59691 -4569
779 -4569 -17013 3271 -145 44613 31091 -17483 -11023 -3638 -26368 -47067 -367 53218 43274
766 43274 21110 23296 74891 89672 37204 23565 20148 4839 -563 -38429 -40698 -46205 57
753 57 -7301 -15468 40342 27228 -58770 -55456 -12916 -25937 -92787 -119363 -71799 -30365 -12119
740 -12119 -10448 -16282 18014 -6803 20290 32605 26393 23408 7153 -8967 73199 58061 34835
727 34835 -25376 6153 10877 12555 7519 50481 4244 -4108 27442 5071 -41613 -50185 -74022
714 -74022 -90882 -97115 -55024 -1282 76160 71733 31530 -36763 -41184 -36841 13473 63560 52146
701 52146 80193 91049 64305 18666 17879 16416 -31203 -50176 -46834 -69777 -33986 8703 56289
688 56289 39639 36592 21009 15755 -33907 -85678 -113448 -93847 -29232 -26517 -11321 -10520 -21050
675 -21050 -9913 -37238 -26778 -10672 -85514 -74123 -48822 -88192 -68155 13749 52196 34367
663 34367 42927 17001 24128 11186 25330 -30345 -48119 4740 14365 13739 -8053 -51779 -84177
650 -84177 -104431 -85743 -12624 -24779 -48516 -37436 42148 66384 82041 41437 -8383 -66223
638 -66223 -102842 -33547 34016 66815 36733 2194 -56438 -101997 -61204 -6390 39941 42884
626 42884 92037 49528 -40828 -61174 -30637 12074 -18985 1638 3213 -23330 -75989 -27300
614 -27300 6805 -5087 34527 -3599 -50031 -85211 -50216 17697 19812 -20045 -22004 -74408
602 -74408 -70691 -28907 -11473 37898 10609 -44076 -109254 -130236 -66818 3640 -10071 -28305
590 -28305 -47319 -30971 22699 29841 17176 -22941 -85474 -46266 -42669 21523 131024 125925
578 125925 116147 109050 63816 -23715 -36394 10896 33862 34841 50880 -41455 -72758 -69706 -50324
565 -50324 -34074 -93568 -66245 -45647 -32085 -47708 -24247 7263 6593 35330 21672 15433 69596
552 69596 38362 4977 -42632 -7612 -36990 -64963 399 -23168 -36477 -30834 -38601 16622
540 16622 37831 4446 -27600 -12257 31237 41439 3577 -33331 -68948 -117848 -69572 -39211
528 -39211 -69573 -84107 -116167 -106137 -86988 -44172 1307 39332 27186 -6241 -71595 -88518
516 -88518 -95739 -49060 -19737 45188 67314 18526 -26347 6534 -8699 -75427 -102156 -123746
504 -123746 -108639 -54818 14342 -18655 -95887 -161928 -174451 -142243 -79511 -19644 -43622 -37323
492 -37323 -88825 -68906 -39809 2629 79823 53342 22691 66916 31733 4405 1073 39908
480 39908 57764 26077 -11038 -28669 -82707 -99010 -87473 -41024 -11093 -29567 -11169 -4765
468 -4765 -31016 -29465 16523 28916 4236 -11056 -37393 -58703 -79401 -16235 16735 -12090
456 -12090 10410 21276 47149 4838 41651 94469 66918 86093 89043 75273 30802 40991
444 40991 68384 32135 47926 67240 30759 -54301 1252 -5090 -76218 -86765 -25850 -15068
432 -15068 -16149 25638 22025 -31652 -42431 -71778 -62420 -56270 -54117 -41102 -497 -18950 -75860
419 -75860 -21862 -6633 29117 69023 62399 -16492 20978 55712 -2617 -58111 -27054 -3132
407 -3132 -6123 17442 74322 74212 44502 12151 12979 -14522 -70536 -77439 -84865 -82232 -69956 -38742
393 -38742 -44785 -17635 3347 -18735 -27324 -18705 -40354 -63336 227 21955 10503 40397 80694
380 80694 30041 6487 22774 -9733 -31593 -10608 -6876 -19125 -19877 -51105 -28768 -67222 -31421
367 -31421 -16710 -55826 -41439 -26953 -14120 9754 -4769 -8959 -10980 15175 55840 18079
355 18079 -32255 -42571 -44233 -41278 -22088 -15354 -11749 47411 33619 20907 -7189 -19488 -18552
342 -18552 -25393 -52996 -31580 -42824 -38510 -30512 -10428 -33207 -45772 -13903 -795 -23906 -25821
329 -25821 -36148 -55594 -62010 -77595 -112062 -81211 -41377 -40849 -56644 -20948 -17874 -7442 -15245
316 -15245 -29375 -63774 -50101 -50418 -49236 -25562 -64254 -97151 -45250 -23927 -33438 -40494 -42766
303 -42766 -31125 777 -6978 -31800 10953 61906 104479 124930 74720 114001 94431 27771
291 27771 -6945 9400 48433 73261 50886 35979 49447 54432 -18855 -79046 -76013 -61888
279 -61888 -76066 -56207 -51790 -87973 -77160 -61676 -39735 16477 32735 218 -17819 230
267 230 12669 1972 11561 8849 -28256 -34634 -33962 -36780 -39903 -3242 11729 25046 29672 14641
253 14641 -32685 -56237 -16618 -2335 -37886 -12027 22536 -5289 20209 26402 18778 -6330
241 -6330 -25795 -17 8907 15131 -29401 -78019 -53760 -19133 -60760 -27833 11244 11668 -45885
228 -45885 -105518 -76047 -54340 -66808 -72595 -86840 -85307 -74160 -55447 -27624 -12990 46072
216 46072 54775 8214 2537 -13927 -5183 -35974 -62943 -34921 -7307 22978 3626 -43434 -16942
203 -16942 11305 -7550 -15508 -13008 22237 -14241 -54445 -54073 -23848 -13849 -57172 -102740 -111903
190 -111903 -84890 -31912 -26748 -22917 -4553 9971 -20282 -13707 -16269 -39695 -60643 -87050 -70582
177 -70582 -22732 17502 9704 -47680 -32006 -511 1603 -27937 -43711 -54404 -60818 -26822 -83876
164 -83876 -66861 -64090 -66387 -77399 -79524 -61580 -16837 -6042 86595 94444 47049 -5487 -36162
151 -36162 -83015 -97246 -131289 -105675 -70303 -56052 -53128 -43405 -40208 -59074 -47299 4036 26410
138 26410 21736 17722 -34183 -69066 -49433 -43605 -33093 -44618 -36638 -36627 -30077 -30166 -36366 -53234
124 -53234 -9348 55873 22462 13780 1018 -4778 14909 35010 39152 23130 -37752 -81252 -83797
$$ [...]
##END NTUPLES=NMR SPECTRUM
##END=
