##TITLE=Analysis number 328495
Compound Code cc 62609
Book Reference 494/178
Project Code adrs
Chemist Name craigr
##JCAMPDX= 6.0         $$ Bruker NMR JCAMP-DX V2.0
##DATA TYPE= NMR SPECTRUM
##DATA CLASS= NTUPLES
##ORIGIN= Bruker BioSpin GmbH
##OWNER= nmr
$$ XWIN-NMR		Version 3.5
$$ Mon Jun 11 10:08:09 2007 GMT Daylight Time (UT+1h)  MAYBRIDGE\nmr@NMR_250MHZ
##.OBSERVE FREQUENCY= 250.131544655141
##.OBSERVE NUCLEUS= ^1H
##.ACQUISITION MODE= SIMULTANEOUS (DQD)
##.ACQUISITION SCHEME= undefined
##.AVERAGES= 16
##.DIGITISER RES= 18
##SPECTROMETER/DATA SYSTEM= dpx250
##.PULSE SEQUENCE= zg30
##.SOLVENT NAME= CDCl3
##.SHIFT REFERENCE= (INTERNAL, CDCl3, 0, 16.522)
##AUDIT TRAIL= $$ (NUMBER, WHEN, WHO, WHERE, WHAT)
$$ ##TITLE= Audit trail, XWIN-NMR		Version 3.5
$$ ##JCAMPDX= 5.01
$$ ##ORIGIN= Bruker BioSpin GmbH
$$ ##OWNER= nmr
$$ C:\u/data/dgb/nmr/ADRS/630/pdata/1/auditp.txt
$$ ##AUDIT TRAIL=  $$ (NUMBER, WHEN, WHO, WHERE, WHAT)
(   1,<2007-06-11 10:07:50.00 +100>,<MAYBRIDGE\nmr>,<NMR_250MHZ>,
      <created by zg, POWCHK disabled, PULCHK disabled
       configuration hash MD5:
       76 6E 9A 78 1E 09 19 81 EC 84 63 8F B0 6A 59 2D
       data hash MD5: 64K
       C9 85 BB 13 7D EF D0 71 6A FC BC A6 9E E5 A0 12>)
(   2,<2007-06-11 10:08:01.02 +100>,<MAYBRIDGE\nmr>,<NMR_250MHZ>,
      <Start of raw data processing
       ef LB = 0.3 FT_mod = 6 PKNL = 1 SI = 32K 
       data hash MD5: 32K
       E6 1B 3E 7F 07 FA B2 CA D5 D5 B9 03 AF EF 20 CD>)
(   3,<2007-06-11 10:08:02.78 +100>,<MAYBRIDGE\nmr>,<NMR_250MHZ>,
      <apk 
       data hash MD5: 32K
       66 65 98 D8 06 CD 87 9D 9B BA 7B 3E 56 51 CE 6A>)
(   4,<2007-06-11 10:08:03.53 +100>,<MAYBRIDGE\nmr>,<NMR_250MHZ>,
      <abs ABSG = 5 
       data hash MD5: 32K
       56 05 0C B6 90 75 74 46 6D DA 49 D7 5E AE 30 FB>)
$$ ##END=
$$ 
$$ hash MD5
$$ D7 28 F1 07 8C DE 21 8A C0 2F 9E 95 D2 1B 7F 38
##$RELAX= 
##$RELAX= 
##$RELAX= 
##$RELAX= 
##$RELAX= 
##$RELAX= 
##$RELAX= 
$$ Bruker specific parameters
$$ --------------------------
##$DU= <C:\u>
##$EXPNO= 630
##$NAME= <ADRS>
##$PROCNO= 1
##$TYPE= <nmr>
##$USER= <dgb>
##$AMP= (0..31)
100 100 100 100 100 100 100 100 100 100 100 100 100 100 100 100 100 100 
100 100 100 100 100 100 100 100 100 100 100 100 100 100 
##$AQSEQ= 0
##$AQ_mod= 3
##$AUNM= <au_zg>
##$AUTOPOS= <50 >
##$BF1= 250.13
##$BF2= 250.13
##$BF3= 250.13
##$BF4= 250.13
##$BF5= 500.13
##$BF6= 500.13
##$BF7= 500.13
##$BF8= 500.13
##$BYTORDA= 1
##$CFDGTYP= 0
##$CFRGTYP= 5
##$CHEMSTR= <none>
##$CNST= (0..31)
1 1 145 1 1 1 1 1 1 1 1 1 1 1 1 1 1 1 1 1 1 1 1 1 1 1 1 1 1 1 1 1 
##$CPDPRG= <>
##$CPDPRG1= <>
##$CPDPRG2= <>
##$CPDPRG3= <>
##$CPDPRG4= <mlev>
##$CPDPRG5= <mlev>
##$CPDPRG6= <mlev>
##$CPDPRG7= <mlev>
##$CPDPRG8= <mlev>
##$CPDPRGB= <>
##$CPDPRGT= <>
##$D= (0..31)
0 1 0 0 0 0 0 0 0 0.06 0 0 0 0 0 0 0.0002 0 0 0 0 0 0 0 0 0 0 0 0 0 0 
0 
##$DATE= 1181552869
##$DBL= (0..7)
120 120 120 120 120 120 120 120 
##$DBP= (0..7)
150 150 150 150 150 150 150 150 
##$DBP07= 0
##$DBPNAM0= <>
##$DBPNAM1= <>
$$ [...]
##$SUBNAM7= <"">
##$SUBNAM8= <"">
##$SUBNAM9= <"">
##$SW= 20.6930455092707
##$SWIBOX= (0..15)
0 0 3 0 0 0 0 0 0 0 0 0 0 0 0 0 
##$SW_h= 5175.983436853
##$TD= 65536
##$TD0= 1
##$TE= 297.16
##$TE2= 300
##$TE3= 300
##$TEG= 300
##$TL= (0..7)
0 120 120 120 120 120 120 120 
##$TP= (0..7)
150 150 150 150 150 150 150 150 
##$TP07= 0
##$TPNAME0= <>
##$TPNAME1= <>
##$TPNAME2= <>
##$TPNAME3= <>
##$TPNAME4= <>
##$TPNAME5= <>
##$TPNAME6= <>
##$TPNAME7= <>
##$TPOAL= (0..7)
0.5 0.5 0.5 0.5 0.5 0.5 0.5 0.5 
##$TPOFFS= (0..7)
0 0 0 0 0 0 0 0 
##$TUNHIN= 0
##$TUNHOUT= 0
##$TUNXOUT= 0
##$USERA1= <user>
##$USERA2= <user>
##$USERA3= <user>
##$USERA4= <user>
##$USERA5= <user>
##$V9= 5
##$VALIST= <valist>
##$VCLIST= <CCCCCCCCCCCCCCC>
##$VD= 0
##$VDLIST= <DDDDDDDDDDDDDDD>
##$VPLIST= <PPPPPPPPPPPPPPP>
##$VTLIST= <TTTTTTTTTTTTTTT>
##$WBST= 1024
##$WBSW= 4
##$XGAIN= (0..3)
0 0 0 0 
##$XL= 0
##$YL= 0
##$YMAX_a= 349431
##$YMIN_a= -283220
##$ZGOPTNS= <>
##$ZL1= 120
##$ZL2= 120
##$ZL3= 120
##$ZL4= 120
##$ABSF1= 16.522
##$ABSF2= -4.171173
##$ABSG= 5
##$ABSL= 3
##$ALPHA= 0
##$AQORDER= 0
##$ASSFAC= 0
##$ASSFACI= 0
##$ASSFACX= 0
##$ASSWID= 0
##$AUNMP= <proc_1d>
##$AZFE= 0.1
##$AZFW= 0.1
##$BCFW= 0
##$BC_mod= 0
##$BYTORDP= 0
##$COROFFS= 0
##$CY= 12.5
##$DATMOD= 1
##$DC= 0
##$DFILT= <>
##$DTYPP= 0
##$F1P= 14.0000005364418
##$F2P= -0.99999901652339
##$FCOR= 0.5
##$FTSIZE= 32768
##$FT_mod= 6
##$GAMMA= 0
##$GB= 0
##$INTBC= 1
##$INTSCL= 1
##$ISEN= 128
##$LB= 0.3
##$LEV0= 0
##$LPBIN= 0
##$MAXI= 10000
##$MC2= 0
##$MEAN= 0
##$ME_mod= 0
##$MI= 0
##$NCOEF= 0
##$NC_proc= -4
##$NLEV= 6
##$NOISF1= 0
##$NOISF2= 0
##$NSP= 0
##$NTH_PI= 0
##$NZP= 0
##$OFFSET= 16.522
##$PC= 1
##$PHC0= -56.32777
##$PHC1= 9.318539
##$PH_mod= 1
##$PKNL= yes
##$PPARMOD= 0
##$PSCAL= 4
##$PSIGN= 0
##$REVERSE= no
##$SF= 250.13
##$SI= 32768
##$SIGF1= 0
##$SIGF2= 0
##$SINO= 400
##$SIOLD= 32768
##$SREGLST= <1H.CDCl3>
##$SSB= 0
##$STSI= 32768
##$STSR= 0
##$SW_p= 5175.98343685301
##$SYMM= 0
##$S_DEV= 0
##$TDeff= 65536
##$TDoff= 0
##$TI= <Analysis number 999999
Compound Code 99
Book Reference 9
Project Code 9>
##$TILT= no
##$TM1= 0
##$TM2= 0
##$TOPLEV= 0
##$USERP1= <user>
##$USERP2= <user>
##$USERP3= <user>
##$USERP4= <user>
##$USERP5= <user>
##$WDW= 1
##$XDIM= 32768
##$YMAX_p= 509358711
##$YMIN_p= -241971
$$ End of Bruker specific parameters
$$ ---------------------------------
##NTUPLES= NMR SPECTRUM
##VAR_NAME=  FREQUENCY,     SPECTRUM/REAL,   SPECTRUM/IMAG
##SYMBOL=    X,             R,               I
##VAR_TYPE=  INDEPENDENT,   DEPENDENT,       DEPENDENT
##VAR_FORM=  AFFN,          ASDF,            ASDF
##VAR_DIM=   32768,         32768,           32768
##UNITS=     HZ,            ARBITRARY UNITS, ARBITRARY UNITS
##FACTOR=    0.157963299565203, 1,           1
##FIRST=     4132.6476996994, 0,             0
##LAST=      -1043.33573715361, 0,           0
##MIN=       -1043.33573715361, -241971,     0
##MAX=       4132.6476996994, 509358711,     0
$$ Real data points
##PAGE= N=1
##DATA TABLE= (X++(R..R)), XYDATA
$$ [...]
16113g9048L712M365m1252j3113O4848k2719k6479Q0675R921m5714l2743L7536
16101f0011J8124q932J2429K578n195k5772J8153O7066n7253l6514K8810k4783
16089g1300l7233Q6013K3565k822P1652j1346p8344j2238J7494k2673j4464j2658
16077f4354j875n5877o3895M2132N3516j0340L8039L3646L6328J0721j2492p913
16065b364n762m5411p432J4450K6968j3327m2428J1243N8583J7869n0736o5109
16053a03456J2898K6000O3992P5438k9821m2967n7713K0860j5207L9403j9313
16042b9886J8274M460P548l2204J3011k9378l5499K2049M797l5197L923M0180
16030d7922M0862l1191k9035k0708k3580K7816k5352M2567K9122j6695O190m9222
$$ plain form
16113 -79048 -75336 -70971 -112223 -125336 -60488 -83207 -109686 -29011 -19090 -64804 -97547 -60011
16101 -60011 -41887 -50819 -38390 -35812 -41007 -66779 -48626 18440 -38813 -75327 -46517 -71300
16089 -71300 -108533 -22520 1045 -1777 69875 58529 -19815 -32053 -14559 -37232 -51696 -64354
16077 -64354 -66229 -122106 -186001 -143869 -90353 -100693 -62654 -29008 7320 18041 5549 -2364
16065 -2364 -8126 -53537 -60969 -46519 -19551 -32878 -75306 -64063 -5480 12389 -38347 -103456
16053 -103456 -90558 -64558 -566 74872 45051 2084 -55629 -34769 -49976 -10573 -29886
16042 -29886 -11612 -7152 396 -31808 -18797 -48175 -83674 -61625 -56828 -92025 -88102 -47922
16030 -47922 -7060 -38251 -67286 -87994 -111574 -83758 -109110 -66543 -37421 -54116 -47926 -97148
16018i7148J7625m3928K5611Q5826j0299j6999J1156L7196m632m2811j650j2117
16006e2170M7980L3470o6652L422q13k1934O001M4552l4220q4725P104n305L2744
15993i0546O8675J7048j1746m0510L5734J0683O639J0291J9071N7830J219o7658
15981A6730m7189k56l2146P5979P9728m3622k6339k384n0369q6360k7397K7228
15969a16397J6054N1331O4700N0593L7966J99k1518q5251j2130K7389m3723r4189
15957a24976m0660M8066q133j17K6092M0184k5270o2022L2945O1159j2015q965
15945g3712k6149m246L9203J1501k296L4524j0756K5052M2146l3569m0659m3158
15933h2119m0762L8047N2824K5984l1024n4012L8663O030k9639j3081l6063j424
$$ plain form
16018 -97148 -79523 -123451 -97840 -12014 -22313 -39312 -28156 9040 4408 -38403 -40053 -52170
16006 -52170 -4190 29280 -37372 -33950 -34763 -56697 -50696 -6144 -40364 -125089 -117985 -123290 -90546
15993 -90546 -21871 -4823 -16569 -57079 -21345 -10662 -4023 6268 25339 83169 84388 16730
15981 16730 -30459 -30715 -62861 13118 92846 49224 22885 20501 -29868 -116228 -143625 -116397
15969 -116397 -100343 -49012 15688 66281 104247 104446 82928 -2323 -14453 12936 -30787 -124976
15957 -124976 -165636 -117570 -125703 -125820 -99728 -59544 -84814 -146836 -113891 -52732 -64747 -73712
15945 -73712 -99861 -104107 -64904 -53403 -55699 -21175 -31931 -6879 35267 1698 -38961 -82119
15933 -82119 -122881 -84834 -32010 -6026 -37050 -91062 -52399 -46369 -76008 -89089 -125152 -126576
15921a26576L0003O0717r606m2745k5924m007K5334M2997N6713J9697k9899o374
15909i670j6647m8839J1447J2266L159m6278N2927K8512l9791o350J3850o2143
15897a07557K2887J3776R040N8837j8609k9649k2904K0759J5868j2405K3084M1680
15885A4807m4160j5034K3942m7771l2674M4171k1454j4956M2130K1311J7993N3093
15873D1398L1239q4539q3663j3291k6188M138N3363M9478m2071l993L0978Q493
15861c4658k7157k6071L1219j4377k1453K9441M9010Q158r011o9691r77L5958
15849d9609J9173K9229M3336K1396j5118q0351k1165M9264M0771m0628k5400R034
15837b0068j8870R953o411p5012q372M6203j9159j0724K7737K1461Q388O6171
$$ plain form
15921 -126576 -96573 -35856 -45462 -88207 -114131 -118138 -92804 -49807 6906 26603 -3296 -9670
15909 -9670 -26317 -75156 -63709 -51443 -48284 -94562 -41635 -13123 -52914 -59264 -45414 -107557
15897 -107557 -84670 -70894 -61854 -3017 -21626 -51275 -74179 -53420 -37552 -49957 -26873 14807
15885 14807 -29353 -44387 -20445 -68216 -100890 -56719 -78173 -93129 -50999 -29688 -11695 41398
15873 41398 72637 -11902 -95565 -108856 -135044 -130906 -77543 -28065 -70136 -74129 -43151 -34658
15861 -34658 -61815 -87886 -56667 -71044 -92497 -63056 -14046 -5888 -14899 -84590 -85567 -49609
15849 -49609 -30436 -1207 42129 63525 48407 -31944 -53109 -3845 36926 -3702 -29102 -20068
15837 -20068 -38938 -28985 -35396 -110408 -118780 -72577 -91736 -102460 -74723 -53262 -44874 21297
15825B1297k5842k3187n2412p924N1821K1407m6855j4687N0289J04105L4861k0222
15813I2651r2727j3545J3100K9360k838m4009j0432k394J386K7017o3697l3760
15801i9888j1780M85j6597N8030L1434k839l2831k7998J4155j2625m422K8300
15789g6576q662M0610M792k7195L14K0496J6303O4304j5300m7232j1098K5935
15777a3309L0398j9742o21l4342m0062Q892j1252p4751n9516q432N5964P2345
15765i4428P6545J3450K2830K293m7772l5916J4330L3834N5436P815k915p8162
15753c2660J7212O240l5955J7077j1906K0528j780m1016j5824P7790R720o8060
15741e8634r060k2565J5932O350R302K0713k0008R285K3482L8095K2837J2466
$$ plain form
15825 21297 -4545 -27732 -80144 -88068 -36247 -14840 -61695 -76382 -26093 78012 112873 92651
15813 92651 -76 -13621 -521 28839 26001 -18008 -28440 -30834 -29448 -2431 -66128 -99888
15801 -99888 -111668 -111183 -127780 -69750 -38316 -41155 -73986 -101984 -87829 -100454 -104876 -76576
15789 -76576 -85238 -44628 -39836 -67031 -66717 -46221 -29918 34386 19086 -28146 -39244 -13309
15777 -13309 17089 -2653 -3274 -37616 -77678 -68786 -80038 -154789 -214305 -222737 -166773 -94428
15765 -94428 -17883 -4433 18397 20690 -27082 -62998 -48668 -14834 40602 48417 45502 -32660
15753 -32660 -15448 -9208 -45163 -28086 -39992 -19464 -21244 -62260 -78084 -294 9426 -58634
15741 -58634 -67694 -90259 -74327 -67977 -58675 -37962 -57970 -48685 -25203 12892 35729 48195
15729D8195J4544l7011n3685l4337K639j4420k826L7311P884m2717r738K835M768
15716g6558K3700J8981J6572J3400J7931J7153m163j4239m2742K6223P0270J5497
15704H2025j7207l8952m5136O422k9882l1852k0356L7782l2140j7499L4139L596
15692f9060L170j5134N0720N5559K0657j1633l1369m8544k6454K3907j380o7016
15680a16577j3058Q1085j7187p77j8234q2091N2694K3146K4891k3977j7566k831
15668a10482L8849N7053n0869j3743O7306j4149n0257J6582M4977M0588m8000
15657b2145Q037M4438m8009m6692L0184j2283j676M6734k9907k1880L744M2985
15645f470K4135J1481k0879j7657J2624l4501M8991l5319m6382o547L3522Q305
$$ plain form
15729 48195 62739 25728 -27957 -62294 -59655 -74075 -76901 -39590 -31706 -74423 -84161 -81326 -76558
15716 -76558 -52858 -33877 -17305 -3905 14026 31179 27016 12777 -29965 -3742 66528 82025
15704 82025 64818 25866 -19270 -12848 -42730 -74582 -94938 -57156 -89296 -106795 -72656 -69060
15692 -69060 -65890 -81024 -30304 25255 45912 34279 2910 -45634 -72088 -48181 -49561 -116577
15680 -116577 -129635 -48550 -65737 -66514 -84748 -166839 -114145 -90999 -66108 -90085 -107651 -110482
15668 -110482 -71633 -14580 -65449 -79192 -11886 -26035 -76292 -59710 -14733 25855 -22145
15657 -22145 -14108 30330 -17679 -64371 -34187 -46470 -48146 -1412 -31319 -53199 -49455 -6470
15645 -6470 17665 29146 8267 -9390 3234 -31267 17724 -17595 -63977 -70524 -37002 -28697
15633b8697m8596J5239K7661K8516l3817L1614k5322n8189r417K5750P4084M1001
15621C9827L0660m9419q2555j1559N4838J5062J0276K2793l9798o3896p8596j4548
15609a66915J1230L9007m5406k2459J11553J9619m379K2253j7918m0102k3025
15598a16542k9545N0737L7123k1909j4055N4290j3584j2805l5378k2238L7202
15587h6704Q354N10P767J4314k0602j7078J036J6868M8682l119m5437K7901N0033
15574B525J8219n4951m5350K5333M1818L6734j3914m1496M0380m0498K3294J18152
15562A10246j0146p3964l7258J3378l0448R484j1043J6914K0736L2363j584J4411
15550E3089k6019j7086j0213M1467M7217Q492p0039m7230O199m86P2127L3939
$$ plain form
15633 -28697 -77293 -62054 -34393 -5877 -39694 -8080 -33402 -91591 -101008 -75258 -1174 39827
15621 39827 70487 21068 -61487 -73046 -18208 -3146 7130 29923 -9875 -73771 -152367 -166915
15609 -166915 -155685 -116678 -162084 -184543 -72990 -53371 -57750 -35497 -53415 -93517 -116542
15598 -116542 -146087 -95350 -58227 -80136 -94191 -39901 -53485 -66290 -101668 -123906 -86704
15587 -86704 -78350 -77840 -70073 -55759 -76361 -93439 -92403 -75535 -26853 -29972 -75409 -47508 2525
15574 2525 20744 -34207 -79557 -54224 -12406 24328 10414 -31082 9298 -31200 -7906 110246
15562 110246 100100 26136 -11122 2256 -28192 -18708 -29751 -12837 7899 40262 38678 53089
15550 53089 27070 9984 -229 41238 88455 96947 26908 -20322 -14123 -14609 57518 91457
15538I1457r0115m6220k2236M805k1853l9741J4571J4351r176M0680N5108M5585
15526C7216j6931q2453m8715j8900M0105O8876M712j789j8757M3838J6445m3618
15514a9971o8860R5684M5254M5546P120m128n3488j9791J0095p370l3988m2397
15502d6294j8615P686K9228L0477j0103k1874M3304L9751j949o4567n0434p188
15490g0578l5807l968j2212j0009Q0458m6828n4675M0617j2950R4178L9726j9315
15478a1363n6522m0282K1907M3366l972m561M6764K3434J781L835j1439o0487
15466d7539p8357j2611L2783L0797M3933k8413o407j7725L720K8315J7307J0217
15454b3980o137L0759l086J0176o1249K2410k6559O278P661o6896R134M6113l7261
$$ plain form
15538 91457 1342 -44878 -67114 -62309 -84162 -123903 -109332 -94981 -104157 -63477 -8369 37216
15526 37216 20285 -62168 -110883 -129783 -89678 -20802 -16090 -17879 -36636 7202 23647 -19971
15514 -19971 -88831 6853 52107 97653 104773 100645 47157 27366 37461 30091 -3897 -46294
15502 -46294 -64909 -57223 -27995 2482 -7621 -29495 13809 53560 51611 -12956 -63390 -70578
15490 -70578 -106385 -110353 -122565 -132574 -52116 -98944 -153619 -113002 -125952 -31774 7952 -11363
15478 -11363 -67885 -108167 -86260 -42894 -46866 -51427 -4663 18771 20552 24387 12948 -47539
15466 -47539 -125896 -138507 -105724 -74927 -30994 -59407 -65814 -83539 -79819 -51504 -34197 -23980
15454 -23980 -30117 642 -2444 7732 -53517 -31107 -57666 -51388 -43727 -110623 -101489 -55376 -92637
15441i2637n7029r795N5531Q9749L1453l5047K8345J3009m1476q0763j0072l3080
15429a41812K3843N3266o786k7914l2301p110P2265R2868l4570q4362L0755O6557
15417D699K7507j0183K7361k7234K5146l3593l3436j3663K05L6204l9238L626
15405c2599L5486J6582O7105p480p0280O63k7818o0942k8658K87p5271L0819Q565
15392a43541N9689L7681l1992j901L4150K1580L1963L668n7511k5323j6792l0271
15380a18600M5932O2090J0543m252k1243J884J602k027o5362N8007m1260n4020
15368a26706J2708Q6518P304j9487l1482m1853K2271J5903L2044k0149r654J00594
15356B8011J5108J6708p275o0657m8191Q757J10844k2714l0557l2850r583R939
$$ plain form
15441 -92637 -149666 -159461 -103930 -14181 17272 -17775 10570 23579 -17897 -98660 -108732 -141812
15429 -141812 -117969 -64703 -71489 -99403 -131704 -138814 -66549 26319 -8251 -92613 -61858 4699
15417 4699 32206 22023 49384 22150 47296 13703 -19733 -33396 -33191 3013 -36225 -32599
15405 -32599 2887 19469 86574 79094 8814 9477 -18341 -79283 -107941 -107654 -182925 -152106 -143541
15392 -143541 -83852 -46171 -78163 -80064 -45914 -24334 7629 11297 -46214 -71537 -88329 -118600
15380 -118600 -72668 -10578 -35 -4287 -25530 -23646 -22044 -24071 -89433 -31426 -72686 -126706
15368 -126706 -113998 -27480 -20176 -39663 -71145 -112998 -90727 -74824 -42780 -62929 -72583 28011
15356 28011 43119 59827 52552 -8105 -56296 -47539 63305 40591 10034 -22816 -32399 -22460
15344b2460n3555L266L0485j1050j5416l2755r1017l2578J02077L1638p284K596
15332i6053K6100N6644l2074n3299K0528L6306L0071J8174j8145n4693J1409L0526
15320b4506J7218l2213J1616L1320Q689K2689l3057o4672P707N3965j7818j3397
15308c2459K686M416k3667k4951Q179K1606N7604J5172p33j2309K0363K6890j7976
15295D4821l9712n0398l0599J9567L4866j5272l099j1495n0642m7334R809K1905
15283a17583K0094L4339j3649n2282J3290R7759M1389m4525l5992l1480J8933
15272f9707k7739o3123K7895J4351K7087J1152J5471J9303m0767K370J9984k6253
15260h9976P704N1066L8982L2587r321N8052n2968l3776l8696m9894N906J285
$$ plain form
15344 -22460 -76015 -72749 -42264 -53314 -68730 -101485 -192502 -225080 -123003 -91365 -98649 -96053
15332 -96053 -69953 -13309 -45383 -98682 -78154 -41848 -11777 6397 -11748 -66441 -55032 -24506
15320 -24506 -7288 -39501 -27885 3435 12124 34813 1756 -62916 -55209 -1244 -19062 -32459
15308 -32459 -29773 -25357 -49024 -73975 -65796 -44190 13414 28586 27853 15544 35907 62797 44821
15295 44821 5109 -45289 -75888 -56321 -21455 -36727 -39826 -51321 -101963 -149297 -139488 -117583
15283 -117583 -97489 -63150 -76799 -129081 -115791 -18032 23357 -21168 -57160 -88640 -69707
15272 -69707 -97446 -160569 -132674 -118323 -91236 -80084 -64613 -45310 -86077 -83707 -63723 -89976
15260 -89976 -82272 -31206 7776 40363 31042 89094 36126 2350 -36346 -86240 -80334 -79049
15248g9049N4821K9298M0806J4255j3415m5025n6811L4181n2372L6750L4170r568
15236a1959j653J5535N6477k9688l8847K1478n98L1996L5552o141J5803o1189
15224B6766q5226J6770R017O1683L3799J3216M349r8990r9621j8917J146M787
15212a31221J4487O8668M8778J0208Q476J9723l5490m1334l3720L3825O3037J9360
15200D4797O1335O1546k6910j6512l3251o8072k7815m7761O1880M2527m4679K082
15188I167J7810m6155K7595K4414Q678n627j2355J1411N199O097k3012l6111p1109
15175h3998M6668M4468j2029l112n529K3105P693k2737K6959o229K3099J0510
15163D8868n257n608p077J0220K8746L294m3749o1148k4921L6731o961q529l1677
$$ plain form
15248 -79049 -24228 5070 45876 60131 46716 1691 -55120 -20939 -73311 -36561 -2391 -11959
15236 -11959 -13612 1923 58400 28712 -10135 11343 10745 42741 78293 72152 87955 26766
15224 26766 -58460 -41690 -32673 29010 62809 76025 80374 -18616 -118237 -137154 -136008 -131221
15212 -131221 -116734 -48066 712 10920 19396 39119 3629 -37705 -71425 -37600 25437 44797
15200 44797 106132 167678 140768 124256 91005 22933 -4882 -52643 9237 51764 7085 9167
15188 9167 26977 -19178 8417 32831 41509 35882 23527 34938 40137 46234 23222 -12889 -83998
15175 -83998 -37330 7138 -4891 -8003 -13532 9573 17266 -5471 21488 15259 38358 48868
15163 48868 43611 38003 30926 41146 69892 73186 29437 -31711 -56632 -19901 -26862 -35391 -67068
15150f7068l0233j3272M3562K2433M3956M7037M638m7598n2869j98M206m4682
15138i0088k8842M3861M8198l5843N7383M300K6717M2573j00877m9075N6255N10
15126b4928K5114l7338m1694M959O8863M2829n2771m8463q760J0629O1418k2571
15114b2713j0451j1209Q502O982l2287J7033n237R0453K6873J1491n4323P412
15102C2526o467q5064J0691J5181J1644N1827K5220j1961j2513l9218q9737J5325
15090h2546K4973l7153N815j1960n038O2280L0601m2417k7614O7740J8925M1650
15078D5256l1414l3703M6890J2498n0035r1700r452M068j011p268J5129Q9284
15066a1458M790j9680N5383N3049l8160q9459l1530N4870K9010l7223n1766k5157
$$ plain form
15150 -67068 -97301 -110573 -67011 -44578 -622 46415 51053 3455 -49414 -49612 -45406 -90088
15138 -90088 -118930 -75069 -26871 -62714 -5331 -1031 25686 68259 -32618 -81693 -25438 -24928
15126 -24928 186 -37152 -78846 -73887 -5024 37805 -14966 -63429 -72189 -61560 -142 -22713
15114 -22713 -33164 -44373 -35871 -28889 -61176 -44143 -49380 41073 67946 79437 25114 32526
15102 32526 26059 -59005 -48314 -33133 -21489 30338 55558 43597 31084 -8134 -97871 -82546
15090 -82546 -57573 -94726 -88911 -100871 -105909 -43629 -13028 -55445 -83059 -15319 3606 45256
15078 45256 13842 -19861 27029 39527 -10508 -102208 -111660 -107592 -108603 -115871 -100742 -11458
15066 -11458 -6668 -26348 29035 82084 43924 -45535 -77065 -22195 6815 -30408 -82174 -107331
15054a07331m869p038j4874R841l319J0216j4919J2370k1639l4894P2122L0057
15042g4277L6046O4429l7304p4313K6621L9129J5263K8873J755l4811j6231j6124
15030d0944L1069k2144o6791j6266N1321j8286m8276j9118N311P4498r159r720
15018h8505L6533J8948K1861r99O266P747M0152j4789M0830R0910j6036q9047
15006E3871L3109J6190p964k9499m1954o3630j5106J1837M1897J6365l7918o547
14994b9349O9207j6412L026j5771j9451k4208K4691J9800n038j0654n3288l17
14982e7764O019j3900n879l17m9002j5976J2527J7935J4792L998j2450L1857N6717
14969a1443J5772o8875m494K9451K0857q736O6591Q900j1059n0086j4275J0959
$$ plain form
15054 -107331 -112200 -119238 -134112 -124271 -127590 -117374 -132293 -119923 -141562 -176456 -104334 -74277
15042 -74277 -38231 26198 -11106 -85419 -58798 -19669 -4406 24467 26222 -8589 -24820 -40944
15030 -40944 -9875 -32019 -98810 -115076 -63755 -82041 -130317 -149435 -144124 -69626 -78785 -88505
15018 -88505 -51972 -33024 -11163 -12162 -5896 1851 42003 27214 68044 158954 142918 53871
15006 53871 86980 103170 95206 65707 23753 -39877 -54983 -43146 -1249 15116 -22802 -29349
14994 -29349 39858 23446 26472 10701 -8750 -32958 -8267 11533 6495 -4159 -57447 -57764
14982 -57764 -51745 -65645 -71524 -71841 -120843 -136819 -124292 -106357 -91565 -87567 -100017 -68160 -11443
14969 -11443 4329 -64546 -69040 -39589 -18732 -27468 39123 48023 36964 -13122 -27397 -16438
14957a6438j4551k3580K1313P4381k309p2085l8538m0650k8091J11287K2399m3163
14945e0025l4029J6792L2743O3107J7166l5884L89N7294N021o7517L5552L022
14933D3631n5427J64L6586p648M140q527m5330J7198K2548J5630J1655j8167m7336
14920c0883K2476N1614J0748k461k2732M86P476n1760j4045L3459M8784N2655
14908A05817J366l6214K237k7529n4061r514Q790j9818n0027K404K0865N4074
14896a610P8961L792M6483m3126m873k555o7256J6295L0108k0799m1596o4032
14884g0208K1696M359k4495J2701J9631P682L0548k8969m525q813L9683O2626
14872F1916k7383m1056k608L4494m454q118m9018p728N1865R959L4293j0434J6998
$$ plain form
14957 -16438 -30989 -54569 -33256 41125 38816 -33269 -71807 -112457 -140548 -29261 -6862 -50025
14945 -50025 -84054 -67262 -34519 28588 45754 9870 10259 67553 72574 5057 40609 43631
14933 43631 -11796 -11632 24954 17306 21446 12919 -32411 -15213 7335 22965 34620 16453 -30883
14920 -30883 -8407 43207 53955 51494 28762 29248 36724 -15036 -29081 4378 53162 105817
14908 105817 107183 70969 73206 45677 -8384 -17898 -9108 -28926 -78953 -76549 -55684 -1610
14896 -1610 77351 81143 127626 84500 79627 77072 9816 26111 56219 35420 -6176 -70208
14884 -70208 -48512 -44153 -68648 -55947 -36316 -28634 1914 -27055 -31580 -40393 -710 61916
14872 61916 34533 -6523 -9131 25363 20909 12791 -36227 -43955 7910 17869 52162 41728 58726
14859E8726j0230Q803K4466J2012n1670n9189j262j9850j1266k783M5248J9043
14847A2048J8109o3326l2090L4073K4632M7809j0833l9047K8581M382k8311l9724
14835d3697k0529P714N562j2852K3697M3048L727l0728J1567m7504n6195N6546
14823e9644l88n0112M2865M4408P946k996r815j3637J8996M5130J7079k0023l2977
14810a3168l9425L3530M6814L578J4636K6756j4388j9676l9753M4424l287o3458
14798b3417k6782j765L0020k1431q346j8159l3554K4378n5111J5312N419j6682
14786a30118O8222O8684J7352m1017n8050N7087j696M1483j0825m5382j8204R018
14774d3446j1875k4820k3167L3515J0773l671M9649Q8425K6382k7937q9350J1866
$$ plain form
14859 58726 48496 57299 81765 93777 42107 -17082 -18344 -38194 -49460 -52243 -6995 12048
14847 12048 30157 -33169 -65259 -31186 -6554 41255 30422 -8625 19956 24338 -3973 -43697
14835 -43697 -64226 -56512 -50950 -63802 -40105 2943 6670 -24058 -12491 -59995 -116190 -59644
14823 -59644 -60032 -110144 -67279 -22871 -14925 -17921 -27736 -41373 -22377 22753 39832 19809 -13168
14810 -13168 -52593 -19063 27751 31329 45965 72721 58333 38657 -1096 43328 40041 -23417
14798 -23417 -50199 -51964 -21944 -43375 -51721 -69880 -103434 -79056 -134167 -118855 -113436 -130118
14786 -130118 -61896 6788 24140 -16877 -74927 -17840 -19536 21947 11122 -34260 -52464 -43446
14774 -43446 -55321 -80141 -103308 -69793 -59020 -62691 -13042 75383 101765 73828 -15522 -3656
14762c656L8455N1013l3095N053m140J9468n514k7271k1248k5509J3322J6001
14750B2879j2405l5865m2934m7162P4373N5143q79k8894k7602k8653K5297J5966
14738c0736M1115J89J6617L9941k2576q462k7281J4741N4470j4798l0171O4109
14726I7158J9954k1146l3595J8937P273n7178k6513L800j78R987P176J3908k7058
14713A2525P902M6057J7816m3378j6642n9946o9344J852N6672O6249j3110K0977
14701B7630N4690l7006j8021N376Q207j3021o3981m5922J3980N8983R9418J01364
14689A91697L1498P780J9438J6637J0882O466J555M3935Q2454k4316Q493K5413
14677D21932l9549j02771j0249L7528o9835q3731l8152j8672K2434J0739j6705
$$ plain form
14762 -3656 34799 85812 52717 57770 53630 73098 67584 40313 19065 -6444 6878 22879
14750 22879 10474 -25391 -68325 -115487 -41114 14029 13150 -15744 -43346 -71999 -46702 -30736
14738 -30736 10379 10568 27185 67126 44550 36088 8807 23548 78018 63220 33049 97158
14726 97158 117112 95966 62371 81308 88581 31403 4890 8690 8512 18499 25675 39583 12525
14713 12525 20427 66484 84300 40922 24280 -35666 -105010 -103158 -46486 19763 6653 27630
14701 27630 82320 45314 27293 32669 40876 27855 -36126 -82048 -68068 -9085 90333 191697
14689 191697 223195 230975 250413 267050 277932 284398 285953 329888 412342 388026 396519 421932
14677 421932 382383 279612 269363 306891 237056 153325 115173 96501 118935 129674 112969
14666A12969K101P52Q8406N4846m3022P7716P1237J7013K8282K7147m5379n2875
14654C39193j578q5624n6537j5427j3237K0709j6339n7853n4735l0873K0975N572
14642E4246O828k2998j3095M950M3080j8606m7205L509J9345o974J666M566k8976
14629C36q406l0611J9858m173o241M026K7994L7169p9597R857K2774j9469K9025
14616B542J8545n8959L18L4146n200P4290M0195j4871J253k3248Q99n858o0537
14603C515j1988K7441N7499N2601n0336p9763l7652L7454j5120M8244L154k4698
14591A0351r809l8559j1000N4809J8160k1020n331K1809m2016K8077M356J8347
14579B8174K6816R5632j5647o0270K8923m5288l685N856q2487M2111P9699k1488
$$ plain form
14666 112969 115070 115822 204228 259074 216052 293768 365005 382018 410300 437447 392068 339193
14654 339193 337615 251991 195454 180027 166790 187499 171160 113307 58572 27699 48674 54246
14642 54246 61074 38076 24981 29931 73011 54405 7200 10709 30054 23080 24746 29312 336
14629 336 -8070 -38681 -18823 -22996 -29237 -25211 2783 39952 -39645 -29788 -7014 -26483 2542
14616 2542 21087 -37872 -37554 -3408 -8608 65682 105877 91006 92259 69011 69910 64052 3515
14603 3515 -8473 18968 76467 129068 78732 -1031 -38683 -1229 -16349 31895 35049 10351
14591 10351 542 -38017 -49017 5792 23952 2932 -2399 19410 -22606 5471 9827 28174
14579 28174 54990 150622 134975 74705 103628 58340 54655 60511 -21976 20135 99834 78346
14567G8346K8783k313k7150l0212m8517J3635R752K9932M4828N1613M5898n7544
14555A37051k6731Q8113p678j3373l3971l8604P686R5629J0999q321j8938k5857
14543A66005L4372L1011l9885R7080J08381M534K4492L2263L5860L6916k1360
14532E09669O2362O019l589j4837J3853j3650j8851R721n914r392k945k55l1595
14519E00596K208J4283K5038L5247j2751p090l9671O05K8801p1507k1437M0569
14507D94891J8490k2842J686j2791M4564N6386q531K267M2488O7430O4288J12015
14495H60341J40807J43764Q5900J65483K28521J45578J10290J10549M2478j6389
14485B017322o9697p3150j42807j79733j77669j54661j69044k01486j54991j48830
$$ plain form
14567 78346 107129 104816 77666 47454 -1063 12572 22324 52256 97084 148697 194595 137051
14555 137051 110320 198433 190755 177382 143411 104807 112493 208122 219121 210800 191862 166005
14543 166005 200377 231388 191503 288583 396964 401498 425990 458253 494113 531029 509669
14532 509669 572031 578050 574461 559624 573477 559827 540976 550697 544783 535391 532446 532191 500596
14519 500596 502804 517087 542125 577372 564621 557531 517860 518465 547266 475759 454322 494891
14507 494891 513381 490539 492225 479434 523998 580384 571853 574120 616608 684038 748326 860341
14495 860341 1001148 1144912 1230812 1396295 1624816 1770394 1880684 1991233 2033711 2017322
14485 2017322 1947625 1874475 1731668 1551935 1374266 1219605 1050561 849075 694084 545254
14475E45254o5072o9401o1247j5229j76M5251J1956l4578M448p1535l6670j2700
14463B40301K7576o805L6416L8599j5991m7348K4905J04593P3662J09310M5625
14452F30843j5343O9256M0764O9115k4166q0883l0201n3455l3718j1267k864n2029
14440E06052k3120l4881j00611o2916N1392k87p41k9365p0090j6065L3906l3978
14428B19296N706j1697j223k1950n4023n5591m5960r355j3656J2738L0909L0017
14416H5211L124M019P4685j0405o272N60j6825p5266M953K1986K2567J570m6965
14403F2942R33N5311J5213L2093K457K8056L5526p045l3437k6148k1387j098L2937
14390A76353j4736j745j208l378n0903j3116K0684K2732L275l9291L0384J4465
$$ plain form
14475 545254 480182 410781 349534 334305 334129 379380 391336 356758 361206 289671 253001 240301
14463 240301 267877 261072 297488 336087 320096 272748 297653 402246 475908 585218 630843
14452 630843 615500 684756 725520 794635 770469 689586 659385 605930 572212 560945 558081 506052
14440 506052 482932 448051 347440 284524 335916 335629 334888 305523 235433 219368 253274 219296
14428 219296 225002 213305 212082 190132 136109 80518 34558 25203 11547 24285 55194 85211
14416 85211 88335 92354 167039 156634 150362 150922 134097 58831 63784 85770 108337 109907 62942
14403 62942 63875 119186 134399 166492 168949 197005 232531 225486 192049 165901 144514 143416 176353
14390 176353 161617 159872 158664 155286 104383 91267 111951 134683 137958 98667 129051 143516
14378A43516n381n1556m5587l2181K1899J2598O727Q0338k7648j8006j3069N7406
14366A29056k99j1311k9599l9503k755N956L4934M521j3710j0109O0381p692m7899
14353G1971l985p276q475N3525j5255l4488j6404J4391N9828K0973j4597K306
14341A22514m5504j9196J2501K5479o837K7242N6818L6234k1799M0577j7873n4662
14329A55494j8477j0985k624n460J9427K7679k3181k4633n11m490J6474M7229
14317A75942J1377m1657k6224J557K1317K2138K1441l1374k8484n2014p2493L7417
14305C8943O5990M973J236l898P9083j9461o8422M2992L256l459j9707L3276l2049
14292A22753J5633L5390m746l345Q463m108j2869n4267n2910n3013M3282N4477
$$ plain form
14378 143516 138135 86579 40992 8811 30710 43308 50035 130373 102725 84719 71650 129056
14366 129056 128757 117446 87847 48344 45589 51545 86479 91000 77290 67181 127562 119870 71971
14353 71971 67986 60710 52235 105760 90505 56017 39613 54004 113832 134805 120208 122514
14341 122514 77010 57814 70315 95794 88957 116199 173017 209251 187452 228029 210156 155494
14329 155494 137017 126032 123408 117948 137375 165054 141873 117240 116729 112239 128713 175942
14317 175942 187319 145662 119438 120995 142312 164450 185891 154517 126033 74019 1526 38943
14305 38943 104933 109906 111142 107244 186327 166866 98444 141436 144692 141233 121526 154802 122753
14292 122753 138386 173776 169030 165685 174148 170040 157171 102904 49994 -3019 40263 94740
14280I4740l768L8504K3290k3289O0549k53K1395J6899o1062n7706J8977O4882
14268A93158l4613k6196Q193k4145M5898M1666N206L0385k1817j8011k4381p466
14256A67877j7961K4164Q584j5851m0269L9542J2480l4146j8047n396n087M7327
14244A63217L3214j8756l3542j1029J2989J4060J7746J4234m6777k6396O541K5995
14232A51496L2470J8096J3011L2596P1394m017L895l1989r943J3746R695r977
14220B90473m6055M8004O9450J4913p1927r7317M746L5967M2594J4229J3655M4921
14208C63653J6238m0894p5704n6870r979N3418N6763K1278J8006q634J8388N4642
14196D10305J7259R286m6859n8324j1331N3272o726K3357m6376k4637n352K7000
$$ plain form
14280 94740 90972 129476 152766 129477 190026 189773 211168 228067 167005 109299 128276 193158
14268 193158 158545 132349 140542 116397 162295 203961 209167 239552 217735 199724 175343 167877
14256 167877 149916 174080 182664 166813 126544 166086 178566 144420 126373 120977 115890 163217
14244 163217 196431 177675 144133 133104 146093 160153 177899 192133 145356 118960 125501 151496
14232 151496 183966 202062 215073 247669 319063 315046 318941 286952 277009 290755 300450 290473
14220 290473 244418 292422 361872 376785 304858 207541 212287 248254 290848 305077 318732 363653
14208 363653 379891 338997 263293 206423 196444 249862 306625 327903 345909 337275 355663 410305
14196 410305 427564 436850 389991 331667 320336 373608 366882 390239 343863 319226 313874 340874
14184C40874R573J4878L1807J4219N9201J4693k010q3355o7175M2533O8150O4015
14172E07403Q0394j6148J2045n266L1072K1657J8752J01251J0433l1684l3952
14161F95957j6522k2417R0018P362L2551Q0770M8752j505o88L9891N0872J2408
14149A017449L8568L5586K7650L9190K2454Q3798J20245J07649P8064R6863Q8473
14138A755989N5393Q5401M7792O3808J16201R9429J42350J56155J01421J53331
14128B777270J82382J68282J70697K10909K19069K18002K59429L44106L82250
14119D932396L67218L60894M02943M18346M94753O30780O95255P69414P95588
14110I867587Q56822J011149J130746J260290J398060J486015J645845J883349
$$ plain form
14184 340874 350447 365325 397132 411351 470552 485245 483235 399880 332705 375238 443388 507403
14172 507403 587797 571649 583694 578428 609500 631157 649909 751160 761593 729909 695957
14161 695957 679435 657018 747036 754398 786949 867719 916471 914966 914278 954169 1005041 1017449
14149 1017449 1056017 1091603 1119253 1158443 1180897 1264695 1384940 1492589 1570653 1667516 1755989
14138 1755989 1811382 1896783 1944575 2008383 2124584 2224013 2366363 2522518 2623939 2777270
14128 2777270 2959652 3127934 3298631 3509540 3728609 3946611 4206040 4550146 4932396
14119 4932396 5299614 5660508 6063451 6481797 6976550 7607330 8302585 9071999 9867587
14110 9867587 10724409 11735558 12866304 14126594 15524654 17010669 18656514 20539863
14102B0539863J992828K247054K461695K711645K981620L144335L324303L518994
14094D2922337L610012L808330L928406L942284L864476L739099L645814L439425
14086G2900183L248568K981664K688508K376019K036076J778558J502074J230477
14078I0742127R72530P30658N30463L59027J84862L4416j16767k85543n10082
14069I2641691p15707r34142j168275j436509j852168k151974k373236k759218
14061G9250462l049802l302249l516981l784691l849432l868096l892988l873888
14053E0112335l828824l601718l392327l259726l114082k919866k641517k451935
14045B4902340k179191j967264j819540j742144j544082j400646j244428j079449
$$ plain form
14102 20539863 22532691 24779745 27241440 29953085 32934705 36079040 39403343 42922337
14094 42922337 46532349 50340679 54269085 58211369 62075845 65814944 69460758 72900183
14086 72900183 76148751 79130415 81818923 84194942 86231018 88009576 89511650 90742127
14078 90742127 91714657 92445315 92975778 93334805 93519667 93554083 93437316 93151773 92641691
14069 92641691 91925984 90991842 89823567 88387058 86534890 84382916 82009680 79250462
14061 79250462 76200660 72898411 69381430 65596739 61747307 57879211 53986223 50112335
14053 50112335 46283511 42681793 39289466 36029740 32915658 29995792 27354275 24902340
14045 24902340 22723149 20755885 18936345 17194201 15650119 14249473 13005045 11925596
14037A1925596j013173r10253q41015o88217o66779o05165n56315m64472m45877
14028E734330l58625l21422l76393k36031k38928k65564k00205j80994j86105
14019C370063j78977j33724j24048j65057j23904j10013q8069r7498k0538l0068
14009B298167o4144o5612r7134m1803q360j05561j69967q3850L1512k1913m4286
13998A627049m4042k3663l8945l139l4635j1996k9474L5949n600p1235o5755j7002
13986A317512j7688k9967j6423q4852j22596n6644K2324J7388k506k4385n5103
13975I47060j3474j1028p5627n6076J5073l2858j9653j082l8171l7267l6027J421
13963F42291j954q610j8630L404l7691m72K4000R87j6024J2383l4691o8459n1548
$$ plain form
14037 11925596 10912423 10002170 9161155 8472938 7806159 7200994 6644679 6180207 5734330
14028 5734330 5375705 5054283 4677890 4441859 4202931 3937367 3737162 3556168 3370063
14019 3370063 3191086 3057362 2933314 2768257 2644353 2534340 2446271 2348773 2328235 2298167
14009 2298167 2234023 2168411 2071277 2029474 2021114 1915553 1745586 1661736 1693248 1671335 1627049
13998 1627049 1583007 1559344 1520399 1517260 1482625 1470629 1441155 1477104 1471504 1400269 1334514 1317512
13986 1317512 1299824 1269857 1253434 1168582 1045986 989342 1011666 1029054 1026548 1002163 947060
13975 947060 933586 922558 846931 790855 805928 773070 753417 752335 714164 676897 640870 642291
13963 642291 640337 631727 613097 616501 578810 578338 602338 603325 587301 599684 564993 496534 444986
13950D44986j2046J2017L1312M2080m230j6788J960O384M2806n0672m7766J2701
13938D62744J5534k6028m0507K6491M9136K1060K5998M5959J336J6181O047l2454
13926E71497k1639n406K5917Q7184N6324k1389n6203l5278o0551n2358n8925l1657
13914C97516N134j8245m6813O3n26j4349P8691L9707l9926m7627k6044O2452N5591
13901D45624J7112l1086j06514p4063k521J8936Q0740P6222M6865r376r1079p5281
13889B95579O4138P8956L1030J9685N0671k8378p4459o678m655l427L2593J9631
13877D74686j6399K7861K3126j1097l2466m2412k7357N7116L6917k4561j6604
13866D48810L8545k1648p2738n156q695o1920l1168j8564j5402L0286O6385K6830
$$ plain form
13950 444986 432940 444957 476269 518349 514119 497331 499291 505675 548481 497809 450043 462744
13938 462744 478278 452250 411743 438234 487370 508430 534428 580387 581723 597904 603951 571497
13926 571497 549858 544452 570369 657553 713877 692488 636285 601007 540456 488098 429173 397516
13914 397516 402650 384405 337592 337655 337129 322780 401471 441178 401252 353625 327581 390033 445624
13901 445624 462736 431650 325136 251073 248552 267488 348228 424450 471315 461939 370860 295579
13889 295579 359717 438673 469703 489388 540059 511681 437222 430544 425889 422462 455055 474686
13877 474686 458287 486148 509274 498177 465711 423299 395942 453058 489975 465414 448810
13866 448810 487355 465707 392969 387813 379118 317198 286030 267466 252064 282350 348735 375565
13854C75565O7931j996l8520J0211p587p0345m4885L3062L263k3178P628k6985
13842B84164P324M707q7239l6216K1780N6649l2643k8070k9167l2457L7199m1701
13830A24330J7418l4510q489K319L8565K2614n3628k2731k7860p67J552L3636
13818I2449L2373l3890k2353q39j9245n239Q062K8347j9588M753K9085M099m3011
13805E5003l0664J8286N4626N687j1896j464O6l072m7362k8892L9985l6159k5121
13792a0977L4099K9545L6781j9045l0079P09l457o4808R286k0085l9226j803J01509
13779B2449M4493n7057j6001j6697N5908K0595r72n3729j8800j6860R228m2153
13767f9596O1771L0060L6709N0685m7035k9190n4890j21652j5143P0256Q5349
$$ plain form
13854 375565 443496 441500 402980 413191 405604 335259 290374 323436 326699 303521 311149 284164
13842 284164 291488 296195 208956 172740 194520 251169 218526 190456 161289 128832 166031 124330
13830 124330 141748 107238 98749 101068 139633 162247 108619 85888 58028 57261 58813 92449
13818 92449 124822 90932 68579 67740 48495 43256 51318 79665 60077 64830 93915 98014 55003
13805 55003 24339 42625 97251 102938 91042 89578 89644 86572 39210 10318 50303 14144 -10977
13792 -10977 23122 52667 89448 70403 40324 41033 37576 -27232 -17946 -38031 -77257 -79060 22449
13779 22449 66942 9885 -6116 -22813 33095 53690 52718 -1011 -19811 -36671 -27443 -69596
13767 -69596 -7825 22235 58944 109629 62594 33404 -21486 -143138 -158281 -88025 -2676
13756b676P8735P850q455o7609k8741r073k017j1040N6525n544K0688K6980J1180
13743F6803l8878l4030k938L5333J8154p4968k8155O1296j2802n8851J3854j362
13731e6544j2883M3340k6351l5347J3876J1130n426K8784P236j9533k7903P2986
13719f635J9369j9689k6788L088J4030M851j9317L3167Q0485j2472k9363L0403
13707G1129j4704n2114J6754M7160L724J5534j6219p7366j1915n491L2590J8755
13695B7837k0030k3378M5469N1936J0243k0796M0961L6342j3983n85q592K9041
13683A54465k746m1845m2533K2678K4286K9363r224N039m2603o845r245K629k7252
13670E6167L8096M7013m8411J0686N2836K2901j0408Q632n6515K7170q13o3051
$$ plain form
13756 -2676 76059 83909 75454 7845 -20896 -29969 -31986 -43026 13499 7955 28643 55623 66803
13743 66803 27925 -6105 -9043 26290 44444 -30524 -58679 2617 -10185 -69036 -55182 -56544
13731 -56544 -69427 -26087 -52438 -87785 -73909 -62779 -68205 -39421 -32185 -51718 -79621 -6635
13719 -6635 12734 -6955 -33743 -30655 -16625 -11774 -31091 2076 82561 70089 40726 71129
13707 71129 56425 4311 21065 68225 71949 87483 71264 -6102 -18017 -23508 9082 27837
13695 27837 7807 -15571 29898 81834 92077 71281 112242 148584 134601 134016 125424 154465
13683 154465 151719 109874 67341 90019 114305 143668 134444 139483 96880 90035 80790 83419 56167
13670 56167 94263 141276 92865 103551 156387 179288 168880 177512 120997 148167 147354 84303
13658H4303l5669L876l4976K9621N1225P0879L1247l2966m4728M503j5978R758
13646A21095k9293j8939N9091J8227M152K0693q195J9607Q0455K8306j3169L6508
13634C18538J9968K6439M9389M4728l670j3595j7488n886k0672l3461K1564P439
13622C93293K8772N8504K9405k2057M752J2204k3795M379K4836j4629q2478N0584
13610D63770M6766k3854O7427n4892j05588j4381k700R799L307j3853l655n1504
13598C20642k3282k6396r545p455n446p588J58K549N83r685O960L083l8372k6912
13584A79294l3336J3483K6589r282l6204K1292K9992N0556m3202n2813q983n9270
13572G8116n599O0921N0663J2385L4422q8846k7633k6818j746L4804J3719L3026
$$ plain form
13658 84303 48634 52510 17534 47155 98380 169259 200506 167540 122812 127315 111337 121095
13646 121095 91802 72863 131954 150181 154333 175026 166831 186438 266893 295199 282030 318538
13634 318538 338506 364945 414334 459062 455392 441797 424309 418423 397751 364290 385854 393293
13622 393293 422065 480569 509974 487917 492669 504873 481078 485457 510293 495664 413186 463770
13610 463770 510536 486682 554109 499217 393629 379248 376548 386347 389654 375801 372146 320642
13598 320642 297360 270964 261419 253964 248518 240930 241088 243637 244220 234535 241495 244578 206206 179294
13584 179294 145958 159441 186030 176748 140544 161836 191828 242384 199182 146369 137386 78116
13572 78116 72517 133438 184101 196486 230908 142062 114429 87611 85865 120669 134388 167414
13560A67414L9309r979K0151j8250J217o1527k1641N2432K9333K6341R979L2582
13548B67361J7270n0333m8570p980L9462P024l2010j5989l1750L3065J2442L9486
13536B29478P2057m3055K7870J9354m2673k6063O604M5724K9889M40K8150k6953
13524C20822l235k1884J2654l2081o0380j7861O4255j4534k2739q540o1408j2284
13512A42785N332l7552j7378L3572l7698q6075J6591N5634P1707K6379j176p3949
13500I8172o6146K5241N262l1388L9074N4970M752l2557k0531R951q849K379l2903
13487D7427k0338R529K399o1111R580J8891O3839m882n9109k0146P19N0670Q616
13474D6084l2589k608K3478P0278R556m6081J4293n0989r294M3950K9454k3476
$$ plain form
13560 167414 206723 196744 216895 198645 199862 138335 116694 169126 198459 224800 234779 267361
13548 267361 284631 234298 185728 177748 217210 224234 192224 176235 144485 177550 189992 229478
13536 229478 301535 258480 286350 305704 263031 236968 243572 289296 319185 319625 347775 320822
13524 320822 317587 295703 308357 276276 215896 198035 262290 247756 225017 216477 155069 142785
13512 142785 148117 110565 93187 126759 89061 2986 19577 75211 146918 173297 172121 98172
13500 98172 32026 57267 62529 31141 70215 125185 129937 97380 76849 86800 77951 80330 47427
13487 47427 27089 36618 39017 -22094 -12514 6377 70216 65334 6225 -13921 -13202 37468 46084
13474 46084 13495 10887 34365 104643 114199 68118 82411 31422 22128 66078 95532 72056
13462G2056l7901j8149K7072M2590J6447j8440l148k4120m589p376l2645L4174
13450D5971m2726j4260k7594L0102P3200o067j8001n228L141L1348M4104j2726
13438A01264L0663l6496p3865k4036j508l6984K3544J3934l0976L5445N9086N55
13426F0626L215q6357q982M066n048l78K652J5581O8851L4036m9159m3692J3985
13413I396K7598O946m7248m3624N1201j0269j1026n119j6878K49N4127M7281l2758
13400B9876n5580O4285l5350k4715J7933l070j7070j3949Q631L7744o724o5897
13388f3886j6872K7639o798J8650K9599K5806j8592o2682k1866K3041P171j7929
13376g6719Q269K8876l076K6395K0556l0658q778J4088K7448R333j1833m1931
$$ plain form
13462 72056 34155 16006 43078 85668 102115 83675 80527 56407 51818 44442 11797 45971
13450 45971 3245 -11015 -38609 -8507 64693 58626 40625 35397 38538 69886 113990 101264
13438 101264 131927 95431 21566 -2470 -3978 -40962 -17418 -3484 -34460 985 60071 60626
13426 60626 63841 -22516 -31498 -27432 -32480 -32858 -30206 -14625 54226 88262 39103 -4589 9396
13413 9396 36994 43940 -3308 -46932 4269 -6000 -17026 -22145 -39023 -38774 15353 62634 29876
13400 29876 -25704 38581 3231 -21484 -3551 -6621 -23691 -37640 -29009 8735 2011 -63886
13388 -63886 -80758 -53119 -59917 -41267 -11668 14138 -4454 -67136 -89002 -65961 -58790 -76719
13376 -76719 -68450 -39574 -42650 -16255 4301 -26357 -35135 -21047 6401 15734 3901 -38030
13364c8030m2999K7010K8608L3745n0569k0406k0166l9217M3379Q1440J9877J1555
13352C4227N060m8678q7444l4392L9225K1481M6210k051M7212l5479L1617O720
13340B3708J3892n241N0302J5235J43m7215o2833k2650J2936J0277j510k181R205
13327e932j0982n2173k975L1802L2120k016k4601j8508l8905m050M7419J7480
13315c1321J2652L9453n8425j15L339M3095K9246k8072J1561K1P364K6491k0223
13302C5066k7675N2554j3082p629m7945k004K8430K5254r745m9720k4776L3077
13290h195L1115M8753k3186m4005n8755j0031Q7497K0383L900l1280n44K4265
13278C9917J8232l2243j7599o6229M3909M1657m0101j0179L2321N8752N7772m7775
$$ plain form
13364 -38030 -81029 -54019 -25411 8334 -42235 -62641 -82807 -122024 -78645 2795 22672 34227
13352 34227 39287 -9391 -96835 -131227 -92002 -70521 -24311 -26362 20850 -14629 16988 23708
13340 23708 37600 32359 82661 97896 98039 50824 -12009 -34659 -21723 -11446 -12956 -15137 -5932
13327 -5932 -16914 -69087 -72062 -40260 -8140 -10156 -34757 -53265 -92170 -96220 -48801 -31321
13315 -31321 -18669 20784 -37641 -37756 -34417 8678 37924 9852 21413 21434 28798 55289 35066
13302 35066 7391 59945 46863 39234 -8711 -10715 17715 42969 33224 -16496 -41272 -8195
13290 -8195 22920 71673 48487 4482 -54273 -64304 23193 43576 47476 16196 15652 39917
13278 39917 58149 25906 8307 -57922 -14013 27644 -12457 -22636 9685 68437 126209 78434
13266G8434o8615m8528O142P723j3195m2373n800K4183L1557M2358Q5433O1555
13254A58874l7516m3924J0262l0720l6952L1218L9247K8468n1227l3720k4481
13243I529l8569J2825M1112K0635l2628r745j7920M469k2403N1884p0n718J7565
13230C0966J425J9459j2845p0336k9345r493J33150P9078M6519m4730o1938o767
13218G5143J4529m5864k6416J13378N348l8926m0012J1619n610l1797J4325J2512
13206E8229O6372k8360n3805l1377J0304M5343L9754K9098K2165k9981j4870p82
13194A12090k5118J2923L9719j9718l6564m9547j8995M145N8898K7193J3646K7332
13182A46004J0630p5868n2786o365Q230L7552J0409N0017J5102j0317m696J9184
$$ plain form
13266 78434 9819 -38709 -32567 -24844 -38039 -80412 -86212 -62029 -30472 11886 97319 158874
13254 158874 121358 77434 87696 56976 20024 51242 90489 118957 67730 34010 9529
13243 9529 -29040 -16215 24897 45532 12904 3159 -14761 -10292 -32695 19189 19119 13401 30966
13230 30966 32391 51850 39005 -31331 -60676 -70169 62981 142059 188578 143848 81910 75143
13218 75143 89672 43808 17392 130770 136118 97192 57180 68799 63189 31392 45717 58229
13206 58229 124601 96241 42436 11059 21363 66706 106460 135558 157723 127742 112872 112090
13194 112090 86972 99895 139614 119896 83332 33785 14790 18935 77833 105026 118672 146004
13182 146004 156634 80766 27980 21615 29845 67397 77806 127823 142925 132608 127912 147096
13170A47096m8065k872r459l0370l8984O2583L0653m3879m3954K4184K6910p5601
13158a758q0365M5745O9263P799J1619R542J7653k0189k2362j8722k6943J813
13146f905P544j4570r7481Q682K9315M0577m134Q495j2436m0913J3633P403L0792
13133b9998N5954L0993o250j7718l4117L3680O25j4123K9331p4895m9564M438
13121g1644L6914J1623L360r489j334J5651j2231m7579J4064P5531N3095j3079
13109E4882k8857J2938K9081N2537J7569o1373m6656j8138K7671k1368k1053O16
13097b151N4251j6923n5909j578r226k1057l4366K5956K0325k2568k0646L2565
13085e1327L5363L790L2611P052m5593j6722N5821L2362l5633n3982R151k0162
$$ plain form
13170 147096 99031 96159 86700 56330 17346 79929 110582 66703 22749 46933 73843 -1758
13158 -1758 -82123 -36378 32885 40684 52303 61845 79498 59309 36947 18225 -8718 -6905
13146 -6905 639 -13931 -111412 -102730 -73415 -32838 -36972 -28477 -40913 -81826 -68193 -60790 -29998
13133 -29998 25956 56949 50699 32981 -1136 32544 33169 19046 48377 -26518 -76082 -71644
13121 -71644 -34730 -23107 -19747 -29236 -30570 -14919 -27150 -74729 -60665 14866 67961 54882
13109 54882 26025 38963 68044 120581 138150 76777 30121 11983 39654 18286 -2767 -2151
13097 -2151 52100 35177 -20732 -22310 -31536 -52593 -86959 -61003 -40678 -63246 -83892 -51327
13085 -51327 -15964 -12174 20437 27489 -18104 -34826 20995 53357 17724 -36258 -27107 -47269
13073d7269k9406L4326N6619M4711K3781n1793o719l5962j9085J2358N635K5230
13061A2426P181M6446q2343m4052L8538O745m58L3104j5364k6363P5700l1678
13049A9882q3290O2959M4312j9111j2572m700P884K87K3702J468M263j4676j9657
13036A0751m2958K0095K598r678N9207o1939n0950k9611J1680L8010P2890K8892
13024D8987k796j05072m2358M3559J0422m6102j209k3414q997P900J9603L4066
13012f5411Q463Q4673K3169M886Q57N648p225L447K543J9672m2594k2107j1025
12999D996N1730Q106K716O633j2760J0236J3981n0910n464K0544j561n4871L9999
12986C3375O06n6714p1970k3391M2591M855r831K0615L0958l3862m6585J8429
$$ plain form
13073 -47269 -76675 -42349 14270 58981 82762 30969 24250 -11712 -30797 -18439 -12804 12426
13061 12426 19607 66053 -16290 -60342 -21804 -15059 -15517 17587 2223 -24140 51560 19882
13049 19882 -63408 -449 43863 24752 12180 7480 15364 15651 39353 40821 45084 30408 10751
13036 10751 -32207 -12112 -9514 -19192 40015 -21924 -72874 -102485 -90805 -52795 20095 48987
13024 48987 46191 -58881 -101239 -57680 -47258 -93360 -94569 -117983 -126980 -119080 -99477 -65411
13012 -65411 -56948 27725 50894 55780 56637 62285 55060 58507 61050 80722 38128 16021 4996
12999 4996 56726 64832 67548 74181 61421 71657 85638 34728 29264 49808 48247 -6624 33375
12986 33375 33981 -22733 -94703 -118094 -75503 -70648 -80479 -59864 -28906 -62768 -109353 -90924
12974i0924J17815n975n2779m8137K3395L7092N674r6439j2834J2438M9257Q7380
12962B5963L2088j7590K1817k3208j5198L1021n1189o3581n5128l1465K8669L3512
12950h4289O0133L9698l270j15M9836m5052l5085K6002M699K3490J6045L5231
12938H7323j9947j12595m0984m0407R440K3859L4299j7714j1561N3619L8899r881
12926e650k1896m185n819r877K4526k9755q0214J5026j2754J9401j7669L0847
12914i8019M0329M0532K8562L7245l1516j1878K6160L6775K4922m6707n1385l3509
12902c8489j7315k0875J3148L4777N9203m091m9721k1176L3513J1254P110R173
12890A6511k3337j3908R82r423K9449J5800L9051P0364m6779k7507j6758o3482
$$ plain form
12974 -90924 26891 20916 -31863 -80000 -56605 -19513 -13839 -110278 -123112 -110674 -61417 25963
12962 25963 58051 40461 62278 39070 23872 54893 3704 -59877 -115005 -146470 -117801 -84289
12950 -84289 -24156 15542 12272 12157 61993 16941 -18144 7858 12557 36047 52092 87323
12938 87323 67376 -45219 -86203 -126610 -117170 -93311 -59012 -76726 -88287 -34668 4231 -5650
12926 -5650 -27546 -31731 -37550 -47427 -22901 -52656 -132870 -117844 -130598 -111197 -128866 -98019
12914 -98019 -57690 -17158 11404 48649 17133 5255 31415 68190 93112 46405 -4980 -38489
12902 -38489 -55804 -76679 -63531 -28754 30449 26358 -23363 -44539 -11026 228 7338 16511
12890 16511 -6826 -20734 -19752 -29175 274 16074 55125 125489 78710 51203 34445 -29037
12878b9037k2773m8970n1396K9266N4303O5945K4700O1793J3403p4354J9017J3958
12866E5855l5581l4217Q6444P8019j2097n9309l0385k1936M163n808r471l5266
12854a9589l9212N0831M7021l986j4473J1640J8891O0986r4871n6348J7844N5883
12842C4617k54m4077j9830m992k584n503K2924J5240n9845o3004J1650N8147L6520
12829b0991n499n8390J0822P3344J2863n308M2707L0520l6640n4171R27n464K0170
12816D890O3971K4121P3800l0259q1066M0555Q5110P3961m1966q8209o9539n4445
12804I24k4200P648r545l5351k3552J2093P937L9173O6620M261n3209m0004l2038
12791g9243K5531L2125l1673q42O7750K4299J1315J9781l0343p6362l7312L5332
$$ plain form
12878 -29037 -51810 -100780 -152176 -122910 -68607 -2662 22038 83831 97234 22880 41897 55855
12866 55855 20274 -13943 72501 150520 138423 79114 48729 26793 30956 25148 15677 -19589
12854 -19589 -58801 -7970 39051 35065 20592 32232 51123 112109 17238 -39110 -21266 34617
12842 34617 34363 -9714 -29544 -34536 -37120 -42623 -19699 -4459 -64304 -127308 -115658 -57511 -20991
12829 -20991 -26490 -84880 -74058 -714 12149 6841 49548 80068 43428 -10743 -9816 -15280 4890
12816 4890 68861 92982 166782 136523 55457 96012 181122 255083 213117 124908 55369 924
12804 924 -23276 -15628 -25173 -60524 -84076 -71983 -64046 -24873 41747 46008 -7201 -47205 -79243
12791 -79243 -53712 -21587 -53260 -54102 13648 37947 49262 69043 38700 -37662 -74974 -39642
12779c9642M9678J5130J0235k9681m4133n7675j1032n07l5338J6831M8952K4224
12767e2958l1924m7052L5801N5823k2049k3010J9482J3917J7079k5669m0009j7935
12755a18504M0438Q9955K196l5272K8741J676o904m3404J6463L5888K8428j3864
12743B5837m3866L8555j4663q919J4502J0582R835L8520O2651N5447P5766Q1098
12731C45345m7610l4524j6960r3707p7817r744M9911K0074P017O0939j782m4046
12719A57096n6091m608n3869k0065N8766J3432J2421o5907m0541o8596k3276P7928
12707a3310M4869j3065p9464q305k095K7125N6498l3484L7913L958L0007l178
12695D7469K798k8647J6232M3448o1351p0872l6264N3799N8345J675j13741n0209
$$ plain form
12779 -39642 10036 25166 35401 5720 -38413 -96088 -107120 -107627 -142965 -126134 -77182 -52958
12767 -52958 -84882 -131934 -96133 -40310 -62359 -85369 -65887 -51970 -34891 -60560 -100569 -118504
12755 -118504 -78066 11889 14085 -21187 7554 9230 2326 -41078 -24615 11273 39701 25837
12743 25837 -18029 20526 5863 -3056 11446 22028 31863 70383 133034 188481 264247 345345
12731 345345 297735 263211 246251 152544 74727 64983 114894 134968 141985 202924 201142 157096
12719 157096 101005 96397 42528 22463 81229 94661 107082 41175 634 -67962 -91238 -13310
12707 -13310 31559 18494 -60970 -69275 -71370 -44245 12253 -21231 16682 20640 50647 47469
12695 47469 50267 21620 37852 81300 19949 -50923 -87187 -33388 24957 26632 -87109 -137318
12683a37318K9284R1598R387N6754O3053J2285k4592k7240j5069J1172j3567q1758
12671b6011r0024J7704Q7701O5001J0476j7768r977M097l54K0464N0746R226k1458
12658I9823K5570M5564L2915j8843N2565P4255J53427K25872L20980N71029P00013
12647B283170L55303j87516n22406n27806m40041l03548j85353j43607r7833k8076
12637B02287k4527l8999l4525r1843k5778L8701K5218l5015m939J4568L3540M1775
12625A00463M1141l420p4301o6210q6717K9629M0061M738P205N7412J2263L4888
12613I7152R3046J3737k4663q0690j31815m8909L5870J1326j3948N3634J3962
12602A8702K4249j9062l8095N767k7816j4050K2824Q549Q270P362j0090o844N999
$$ plain form
12683 -137318 -108034 -16436 -7049 49705 112758 125043 100451 73211 58142 69314 55747 -26011
12671 -26011 -116035 -98331 -10630 54371 64847 47079 37102 41199 40845 61309 112055 121281 99823
12658 99823 125393 170957 203872 185029 237594 311849 465276 691148 1012128 1583157 2283170
12647 2283170 2638473 2450957 1928551 1400745 960704 657156 471803 328196 230363 202287
12637 202287 177760 138761 104236 12393 -13385 25316 50534 15519 10580 25148 58688 100463
12625 100463 141604 138184 63883 -2327 -89044 -59415 -19354 -14616 -7411 50001 62264 97152
12613 97152 190198 203935 179272 98582 -33233 -82142 -46272 -34946 -48894 4740 18702
12602 18702 42951 23889 -14206 -8439 -36255 -50305 -27481 -18932 -10662 -3300 -13390 -20234 -14235
12589a4235p559K763P592j8602M3922J7433O412n954J1138N8345j6594m4209j8358
12576B2094N4581J663l9798K8516K2393l4335n3480k8246j4931M8479N965l3716
12564b0815j7312N7102j7166k796k2383l4938J6056k6285L50k2590l6884k9298
12552a56959l98K4224p304L1308N0031L2533K6875M1045M5914L237q6479j5745
12540a1718J5924k2612K7995L2338k2962l1694m5174M1924K5635O979K004k0218
12528a579L2750j5078j7982R513m3483p4621K2943L9498N2601O0612j4302j8299
12516C2573j6210q059K1002l653l8516m1538r152l5002k267R2925M4727K7275
12504F4105p1280j26107K0596Q4921l1198l896M7018L2560l2992l523k4573J7126
$$ plain form
12589 -14235 -21794 -19031 -11439 -30041 13881 31314 37726 31772 42910 101255 84661 40452 22094
12576 22094 76675 78338 38540 67056 89449 55114 1634 -26612 -41543 6936 12901 -20815
12564 -20815 -38127 18975 1809 -987 -23370 -58308 -42252 -68537 -68187 -90777 -127661 -156959
12552 -156959 -157357 -133133 -140437 -109129 -59098 -26565 310 41355 87269 90506 4027 -11718
12540 -11718 4206 -18406 9589 41927 18965 -12729 -57903 -15979 9656 16635 18639 -1579
12528 -1579 31171 16093 -1889 7624 -35859 -110480 -87537 -48039 4562 65174 50872 32573
12516 32573 16363 8304 29306 25653 -12863 -54401 -63553 -98555 -100822 -7897 36830 64105
12504 64105 -7175 -133282 -112686 -27765 -58963 -62859 -15841 16719 -16273 -19796 -44369 -27243
12492b7243R109J7204J2674n3728n6344O296R406L6121J763K3994k4K8466M4263
12479E1957J9713l2329n8744Q295m367j4827l8995q4047K0425O7201N4215K8120
12467A6617J6080l71m6127l9879n0608K2047M2828L3988j1218j7713j408o539
12455d2303j1901J0753L2084J0445L3809l946o9800o0221M9253J1525k2321M298
12443e8325l2432l3994J9719J6650K6210P3263K1980J7280L9360m2081J1542K4176
12431H3348J6613K8995l1797M317n9514n7228J3348J9015k7715l2514K2349N8169
12419C7386L0193r375m3001r217m9250n6025O5306O2467J8396k7561r224k5907
12407a5812QP8156J0913l5778L9606M4256j0572p8644l1831K6945K314k6621n8111
$$ plain form
12492 -27243 -18134 -930 11744 -41984 -98328 -92032 -82626 -46505 -44742 -20748 -20772 7694 51957
12479 51957 71670 39341 -19403 -11108 -15475 -30302 -69297 -153344 -132919 -65718 -11503 16617
12467 16617 32697 32326 -13801 -53680 -104288 -82241 -39413 -5425 -16643 -34356 -35764 -42303
12455 -42303 -54204 -43451 -11367 -922 32887 28941 -40859 -101080 -51827 -40302 -62623 -58325
12443 -58325 -90757 -124751 -105032 -88382 -62172 11091 33071 50351 89711 47630 59172 83348
12431 83348 99961 128956 97159 101476 41962 -15266 -1918 17097 -10618 -43132 -20783 37386
12419 37386 67579 58204 15203 5986 -43264 -99289 -33983 28484 46880 19319 10095 -15812
12407 -15812 -15804 62352 73265 37487 77093 121349 110777 32133 302 27247 29561 2940 -55171
12394e5171k8736J0678N6008M2474l5534M1287j793k5222J8491M1564o255n700
12382E2091K3536L0506o3016j4845J784J5070R596p9407l0860K1510Q5624Q6560
12370A38149J21807K09263K07616J52142m8164j87506j59412j92000j03677r9615
12360C8603n7786O474Q0544L8392j8967j10367K6381K4459P321j8512l5510j0610
12348b9578q792J1859l9442M011L2015n353J5261M8775l1623m9310Q034P2011
12336B7868K1364k2537l4964M1998L6177K1688j9544K5525M1191k4106k3966k2039
12324F8655m0597n3128n274M9766L454n8659j0419J0543M6587L0863m6715j6422
12312b1346k8393k4166k292K1089J594K7702J5184K846l9781j3583n2593L0120
$$ plain form
12394 -55171 -83907 -73229 -17221 25253 -10281 31006 29213 3991 22482 64046 57791 52091
12382 52091 75627 106133 43117 28272 30056 45126 54722 -24685 -55545 -34035 51589 138149
12370 138149 259956 469219 676835 828977 780813 593307 433895 241895 138218 38603
12360 38603 -19183 -12709 67835 106227 87260 -23107 3274 27733 35054 16542 -18968 -29578
12348 -29578 -38370 -26511 -65953 -61942 -29927 -35280 -20019 28756 -2867 -52177 -44143 27868
12336 27868 49232 26695 -8269 33729 69906 91594 72050 97575 138766 114660 90694 68655
12324 68655 28058 -25070 -30344 19422 22876 -35783 -46202 -35659 10928 41791 -4924 -21346
12312 -21346 -49739 -73905 -76197 -55108 -53514 -25812 -10628 -7782 -47563 -61146 -113739 -83619
12300h3619J34570N6818j109n4967q2177M5258r59n2751n8391M4424K9165L2503
12288H765L1887L7398k0249n423p835k8715j0850L0254R14J0458L2286n983p4528
12275a621r971J6016l6217k6573N163M237L3830j9909j4610L0866P673j6263k8685
12262e6064N279K6847j663M297l3593n1797L7098M7194K7865o4340J9813J036
12250c8028J0286K8139J6587k1384Q921M9202N1986J4913r0821n0362K5350K8331
12238C3120K5464L0999J2224l9223o1981P707R222L1768O018l992m3346K502j08
12225A0374j9269J3609K7286J1461k1332j14394k4695P1344Q0513L721l7136k0796
12213a9314j2521L7068R2424j0354m1446m7191l2514k567N6558J8136n6408l4305
$$ plain form
12300 -83619 50951 107769 106660 51693 -30484 14774 13815 -38936 -97327 -52903 -23738 8765
12288 8765 40652 78050 57801 52378 44543 15828 4978 35232 36146 46604 78890 72907 -1621
12275 -1621 -11592 4424 -31793 -58366 -53203 -48966 -15136 -35045 -49655 -18789 -11116 -27379 -56064
12262 -56064 -50785 -23938 -25601 -21304 -54897 -106694 -69596 -22402 5463 -58877 -39064 -38028
12250 -38028 -27742 397 16984 -4400 4521 53723 105709 120622 29801 -20561 4789 33120
12238 33120 58584 89583 101807 62584 603 8310 17532 49300 55318 51326 7980 10482 10374
12225 10374 -8895 4714 32000 43461 22129 -92265 -116960 -45616 34897 38618 1482 -19314
12213 -19314 -31835 5233 97657 87303 45857 -1334 -33848 -36415 20143 38279 -18129 -52434
12201e2434M9036J6594L0162k3067m9063L6792R3647k9136N7414O890j0801J5566
12189A41600k076m6212m1836m4185k5057N2348M4956k0315j2693O5551M345l5518
12177H0908l4721J4330k701J1509o0576k0647j0581m3482M0371j856k1047N2884
12165D391P081o4975j911L6738M5989M3031j0567o6553n7491J9345M4092j2012
12153a2842l7525M1228O5559M4166l1424P357L8685j3082j7157N125m393k3509
12141F2188n967j7709J0793j9069l0900k5706q545J7539K4568l1096j605K5861
12129C52J4354J7990L4623R286R66m580K98k3902m2758Q02R098K2760J01j2766
12115B6624O9287j709K0286Q388R2979L7918M406n0985k0207l672R282M0721o5067
$$ plain form
12201 -52434 -3398 13196 43358 20291 -28772 8020 101667 72531 129945 136835 126034 141600
12189 141600 139524 93312 51476 7291 -17766 34582 79538 59223 46530 112081 116426 80908
12177 80908 46187 60517 57816 69325 8749 -11898 -22479 -65961 -25590 -27446 -48493 4391
12165 4391 11472 -53503 -55414 -18676 27313 70344 59777 -6776 -64267 -44922 -830 -12842
12153 -12842 -50367 -9139 56420 100586 69162 76519 115204 102122 84965 90090 85697 62188
12141 62188 56221 38512 49305 30236 -664 -26370 -34915 -17376 7192 -23904 -25509 352
12129 352 14706 32696 67319 76605 77571 72991 73289 49387 6629 7431 16529 39289 39390 26624
12115 26624 95911 94202 114488 122876 215855 253773 258179 207194 186987 183315 192597 233318 168251
12102A68251j9487l0935k8356k7272J5104k1935K2169l4738k2651k9560l5627
12091d5037L0791N0349M535k8205j5309K0770k9500l8974j8693N8161J5640m9226
12079d4698l9819k0663M2006R016N1299M4108J7549k8967m8001J5356L176L3080
12067C3442M4654Q855k3410p941j1345N439K5969k8912P333n299M289O5148n4560
12054F3662l964J0330j9976M7553J8090j6850K5828m1577j16201n330L7425M67
12042e43k3233L0454k3827l9049J2089K725m191j4585L4707j8372M643P9470K1030
12029F1318n410m3864Q910K4516M301L9074j3194k2062n1658l7503M5795M1298
12017E1521r586O89n3088m1487o356M7377L2381j6504l7732N062r923J1222J3605
$$ plain form
12102 168251 148764 117829 89473 62201 77305 55370 77539 42801 20150 -9410 -45037
12091 -45037 -14246 36103 40638 12433 -2876 17894 -11606 -50580 -69273 -11112 4528 -44698
12079 -44698 -84517 -105180 -63174 -54158 -2859 41249 58798 29831 -18170 -2814 362 33442
12067 33442 78096 86951 63541 55600 44255 49694 75663 46751 54084 48785 53074 118222 63662
12054 63662 59698 70028 50052 97605 115695 98845 124673 83096 -33105 -38435 -1010 -543
12042 -543 -23776 6678 -17149 -56198 -44109 -41384 -45575 -60160 -25453 -43825 -39182 40288 61318
12029 61318 55908 12044 20954 45470 49771 88845 75651 53589 1931 -35572 10223 51521
12017 51521 41935 42624 -10464 -51951 -58307 -10930 21451 4947 -32785 -27723 -37646 -26424 -12819
12004a2819J6864L007j0181l5151q618m2514P0N5105L1677J8245p1865p1288j3127
11991a40595L3521L7723L2653L0073k1258k0133J250L2474o513L9435N6560l049
11979G2141k6492k6684O853n87O067J1480n0011K0073O1204j7005k6071k4286
11967F682M6056J803N321l8094n381k7480M069M9280J4866l1390N76j4266J7509
11954B9551m6644j7772O434p332M0542l5778m6563L6962L7628K4460r931J2866
11942B4423j0151k5206l8974n15J0378k6967K8791J3963l905k3647j2937j3514
11930g8261j4085j345j2237O2217M5931k5182m50M6040J1394m5045L251L4213
11918B6441N7355M3059L6912q985l3025M7947R7686K7281l83q8963n1549J3585
$$ plain form
12004 -12819 4045 7052 -3129 -38280 -46898 -89412 -89342 -34237 -2560 15685 -56180 -127468 -140595
11991 -140595 -107074 -69351 -36698 -6625 -27883 -48016 -46766 -14292 -20805 18630 75190 72141
11979 72141 45649 18965 25818 25231 31298 42778 -7233 12840 74044 57039 30968 6682
11967 6682 52738 54541 59862 21768 16387 -11093 -7024 42256 57122 25732 26308 12042 29551
11954 29551 -17093 -34865 -28431 -35763 4779 -30999 -77562 -40600 -2972 21488 11557 24423
11942 24423 14272 -10934 -49908 -50423 -40045 -67012 -38221 -24258 -28163 -51810 -64747 -78261
11930 -78261 -92346 -93691 -105928 -43711 2220 -22962 -23412 22628 34022 -11023 -7772 26441
11918 26441 83796 126855 163767 154782 121757 169704 267390 294671 294288 205325 153776 167361
11906A67361K9689l6131l936j707P759L3414j8460o3612j7548K495N2115R639
11894A61078n1742J4992j1498o3154k8029M1145M6199N8354M2928K9453L1824
11883B71550j9118j5655k2709j8663k9185o4116n4431O4358J0011N3913l272J3051
11871A85734j6725J7686j0733m4538r2309K5033m6044q7375m7341M7699K5417
11860d3496p151M416m776J5327P4646P7299n0525l4438l629j4502J8933k309j4759
11847A5036k3163J2559P87n70j8165o01l1468j2035j6848Q9053j5592n4006J8291
11834c6722j0329l6046L8449P0042K7439o782k064j4221l5473m8207O1422N2397
11822E9905l3406n6248l3456j2207l085j7325L2363O737K3713M4337N8258K6417
$$ plain form
11906 167361 197050 160919 156983 155276 163035 196449 177989 114377 96829 99324 151439 161078
11894 161078 109336 124328 112830 49676 21647 62792 108991 167345 210273 239726 271550
11883 271550 252432 236777 214068 195405 166220 102104 47673 112031 122042 175955 172683 185734
11871 185734 169009 186695 175962 131424 39115 64148 18104 -69271 -116612 -68913 -43496
11860 -43496 -50647 -46231 -51007 -35680 38966 116265 65740 31302 27673 13171 32104 29795 15036
11847 15036 -8127 4432 5219 4649 -13516 -14117 -45585 -57620 -74468 14585 -1007 -55013 -36722
11834 -36722 -47051 -83097 -44648 25394 52833 46051 43987 29766 -5707 -53914 7508 59905
11822 59905 26499 -29749 -63205 -75412 -78497 -95822 -63459 -56722 -33009 11328 69586 96003
11810I6003J1887O985M8904M7572o1749l1663j1004k033n1568K2154L015j27k557
11797G5819O131n502J0752K3817R2636J3462q5171k461L1648O30o7543p176L4015
11784A21057P691J5590p2215l9292q48q579K9526O0765N876j5599m4983J7667
11772G6656j7901k3325K8562m5063m5576Q8193k2482L2278K1130r688j7347m3032
11760B2405Q450P8518K0324j2524k234J779m585j0198m4836o9113l3386J7567
11748b7833N6100K1305m1858p6903k4005l2324L3196N7320P810k2721J2497N7517
11736B0101L9615m0609n5116P78k2964M554J1756j3879J9722J6335M3792L8228
11724F2313l3813N620q514l6888n877Q8848j0963j7477n5009m1871J912j9538
$$ plain form
11810 96003 107890 114875 163779 211351 149602 117939 106935 104902 53334 75488 78503 78376 75819
11797 75819 81950 76448 87200 111017 203653 217115 131944 129483 161131 161761 94218 87042 121057
11784 121057 128748 144338 72123 32831 31983 23404 52930 113695 119571 103972 58989 76656
11772 76656 58755 35430 63992 18929 -26647 61546 39064 71342 92472 82784 65437 22405
11760 22405 30855 109373 129697 117173 114939 116718 112133 101935 57099 -12014 -45400 -27833
11748 -27833 28267 49572 7714 -69189 -93194 -125518 -92322 -35002 -27192 -49913 -37416 20101
11736 20101 59716 19107 -36009 -35231 -58195 -53641 -41885 -55764 -36042 -19707 24085 62313
11724 62313 28500 34120 25606 -11282 -17159 71689 60726 43249 -11760 -53631 -51719 -71257
11712g1257L4657K9481j0306l000k7636j8371L2917K0823o052j1032l0150J6259
11700d3667L7485L7917j4368o202k2106k6063k4002L9614j6791l251K2810p305
11688b5929q261J1003k9966L0844M6856J4416j7040k3039J1513p648l33m1648
11676c9232l6176J7159m788l0447N9065M0020M3603L5182K4778J2046k7525l0044
11664F3641n4322o1202k6926L9248J0072K3504J2527m5734k0715L6731J1702j3067
11652b4541L1940J8032L7257N913k9146k6301Q0690L5615m5561k6892j4183J0024
11640E2847j1982n1765k0306J7461J5328k1111p6915j2772K7613K6727L1122L354
11628b0399M8216m1606j851K7599l944l6770J6492K806L2115O450m8348q7412
$$ plain form
11712 -71257 -36600 -7119 -17425 -20425 -48061 -66432 -33515 -12692 -18744 -29776 -59926 -43667
11700 -43667 -6182 31735 17367 11165 -10941 -37004 -61006 -21392 -38183 -41434 -18624 -25929
11688 -25929 -34190 -23187 -53153 -22309 24547 38963 21923 -1116 10397 2749 2416 -39232
11676 -39232 -75408 -58249 -63037 -93484 -34419 5601 49204 84386 109164 121210 93685 63641
11664 63641 9319 -51883 -78809 -39561 -29489 -5985 6542 -39192 -59907 -23176 -11474 -24541
11652 -24541 7399 25431 62688 68601 39455 13154 93844 129459 83898 57006 42823 52847
11640 52847 40865 -10900 -31206 -13745 1583 -19528 -96443 -109215 -81602 -54875 -23753 -20399
11628 -20399 27817 -13789 -15640 11959 8015 -28755 -12263 -9457 22658 29108 -19240 -106652
11616a06652j3696Q5640M4609q875j2089j4230p546K1031j1983L8053J6490M3414
11604G4166k5474p176m2265L6239m0501j16863o3438P0526J8931r280J5253O7168
11592b2714N8349l6253K535k2457n7381j0538N569k3352q899K473L26L3532R1448
11579A2638O4235K4341l7806K848J8086R689m7882l4330l5319K6141R880m0157
11567b7636m9728j2211N5228L70l5852j0990L2978M0776k3656k1900P0664K8065
11555D6108k4629q5452r852K4954K2711Q949J5181N795j6366K3772K5781k0016
11543A6936K9569j214p0553k1829L5170P5343N5000j610p8456o663l2922m576
11531e805r903J1563L3245M1368K2632n1253p9248L845L6817J814o2585K2465
$$ plain form
11616 -106652 -120348 -34708 9901 1026 -11063 -25293 -32839 -11808 -23791 14262 30752 74166
11604 74166 48692 41516 -749 35490 -5011 -121874 -185312 -114786 -95855 -105135 -89882 -22714
11592 -22714 35635 -618 1917 -20540 -77921 -88459 -82890 -106242 -115141 -112668 -112342 -78810 12638
11579 12638 76873 101214 63408 66256 84342 94031 46149 11819 -23500 2641 12521 -27636
11567 -27636 -77364 -89575 -34347 -33977 -69829 -80819 -47841 -7065 -30721 -52621 18043 46108
11555 46108 21479 -63973 -73825 -48871 -26160 -17211 -2030 3765 -12601 11171 36952 16936
11543 16936 46505 45291 -25262 -47091 -11921 63422 118422 116812 38356 31693 -1229 -5805
11531 -5805 -15708 -4145 29100 70468 93100 41847 -37401 -33556 3261 5075 -57510 -35045
11519c5045J3358R353k371k0338J5006K891p303j6801K4007J8220l3474j4899
11507d7396j4693O1410J1257m4268p3274r915Q8354Q9147j9989j8224L181m515
11495B1075k2884Q721l7199N599q599l8357N523L122k5387N3714k0568j8468P0392
11482c316O7546q0933M8178j0043J9336K748K5634n401l3042n5014j5725J7323
11470b2709p122j8743K6115k5808j2620L9085k7868l700Q5062L5100J4037l2210
11458D8619r8556j9699M4541N0146m9369n4649j7750J4779j7200j13451k9382
11447b41971M5177P3847K3262L4269k8939N256J504M6910L5590k8092o1242J8958
11435g5471R508M2526P5361L6980o7814m0922L136J2587L3650j5957n2515n0347
$$ plain form
11519 -35045 -21687 -12334 -14705 -35043 -20037 -17146 -24449 -41250 -17243 977 -32497 -47396
11507 -47396 -62089 -679 10578 -33690 -106964 -116879 -28525 60622 40633 22409 25590 21075
11495 21075 -1809 6912 -30287 -24688 -33287 -71644 -66121 -62999 -88386 -34672 -55240 -73708 -3316
11482 -3316 64230 -16703 31475 21432 40768 43516 69150 63749 30707 -24307 -40032 -22709
11470 -22709 -29831 -48574 -22459 -48267 -60887 -21802 -49670 -53370 31692 66792 80829 48619
11458 48619 -49937 -69636 -25095 25051 -24318 -78967 -96717 -81938 -99138 -212589 -241971
11447 -241971 -196794 -122947 -99685 -65416 -94355 -89099 -87595 -40685 -5095 -33187 -94429 -75471
11435 -75471 -65963 -23437 51924 88904 21090 -19832 -16696 -4109 29541 13584 -38931 -89278
11423h9278r249L4526j2039j2596P5965M1460m4553n6645J0880L8326K3535K4040
11411B4372K6989l904p968n0275k2170R1402M8676j786Q47J3209Q888p6921l8194
11398A3165j6066Q289N6864p3041J2170K0566l6246q8432k7645O3141N4646p1312
11386h3901k1211M7576N4879l3718n99M3400K1770N0507j9322j06011M1450Q5193
11374H0013J5948J2236n8021j4115L24J0383o9640n00O8423O9618P063j5246n8342
11361D8144j1291K0652J5808l8085j2455o0551l3358K1375j7137J1017O076L276
11349d6529O4503Q1855K0497l8312k0947k8244l1961n9333L5432P8180O5494L9590
11337A60225J4042m3188n6539j6316K0385k516m515k5880m4110K6066N0207L6554
$$ plain form
11423 -89278 -98527 -64001 -76040 -88636 -12671 28789 -15764 -72409 -61529 -23203 332 24372
11411 24372 51361 47457 39489 -10786 -32956 58446 107122 105336 106183 119392 128280 51359 13165
11398 13165 -2901 5388 62252 -10789 1381 21947 -14299 -102731 -130376 -67235 -12589 -83901
11386 -83901 -105112 -57536 -2657 -36375 -36974 6426 28196 78703 59381 -46630 -5180 80013
11374 80013 95961 108197 50176 36061 36385 46768 -22872 -23372 45051 114669 121732 106486 48144
11361 48144 36853 57505 73313 35228 22773 -37778 -71136 -49761 -66898 -55881 -49805 -46529
11349 -46529 17974 99829 120326 82014 61067 32823 862 -58471 -23039 55141 120635 160225
11337 160225 174267 131079 74540 58224 78609 76093 71578 45698 1588 27654 77861 114415
11325A14415j6253j7927N4238J2743L4019l5246m5703O947L9066o4893n3114l7609
11313i317R444J8071L5638m966j4561k4251o5985l0661N5590P2967j9478l6570
11301a4079l73L1190K8089K9148J8242j2863j723L2802l3687q8633q173N0765
11289C0705j2032l3328l1748r054L0891Q54j1193J10212N9177l4641j9125k7304
11277E3414o7437L2978J6437M954j146j2111o656m6074n3603m0223M2815N3217
11265b3435L6948Q310o80l5655n6233j6414L225k3501M9400O8694L938m7000o801
11252c9204p471j9873l5072N3408O911r734N6085K7726q2319l2398n0728N8169
11240g4500O5960O5373L6639n3221j916M485o7391k1278L5578q674O812l2042
$$ plain form
11325 114415 98162 80235 134473 147216 181235 145989 100286 107233 146299 81406 28292 -9317
11313 -9317 127 18198 53836 48870 34309 10058 -55927 -86588 -30998 41969 22491 -14079
11301 -14079 -14452 16738 44827 73975 92217 79354 77631 110433 76746 -11887 -20060 30705
11289 30705 18673 -14655 -46403 -55457 -24566 -23712 -34905 75307 134484 99843 80718 53414
11277 53414 -14023 18955 35392 40346 39200 27089 20433 -25641 -79244 -119467 -76652 -23435
11265 -23435 13513 21823 21143 -14512 -70745 -87159 -83934 -107435 -58035 10659 14597 -32403 -39204
11252 -39204 -46675 -66548 -101620 -48212 -41301 -51035 5050 32776 -49543 -81941 -132669 -74500
11240 -74500 -8540 56833 93472 40251 38335 42820 -24571 -45849 -10271 -18945 -12133 -44175
11228d4175L2250j2324L9494m434J5119L8605l3190l3226J6078J217l9064L197
11216b0453K6030Q0304k1932r7107K3798M099m3306l2885O7359O4798k0948N2
11204B9809k2827J6640M2434K6268n9820m6317L4152J5715J5365M1125R943j4101
11192H8386l6351k7629P796K4764k4950L9037j6172J1739K554l185o1962l6320
11180c2293M2741M6543m22l5791m8076j6052j1458Q587R881M5672k289M6922J3458
11167F7423m7029O381J7764k6368K5778J1565j4652K2251m934j5465k0516L7759
11155E9957N8623k8440l0836p5904n191P0070K5280m9377l4875P108J7497p1599
11143e7687k5722P6295j60K0116J9572J0085K271k9821k1048N6294O3569p543
$$ plain form
11228 -44175 -11925 -24249 15245 10811 25930 64535 31345 -1881 14197 15414 -23650 -20453
11216 -20453 5577 85881 63949 -33158 -9360 -5261 -48567 -81452 -14093 50705 29757 29809
11204 29809 6982 23622 66056 92324 32504 -13813 20339 36054 51419 92544 102487 88386
11192 88386 52035 24406 32202 56966 32016 71053 54881 66620 69174 65989 4027 -32293
11180 -32293 10448 56991 56569 20778 -27298 -43350 -54808 -46221 -36340 9332 7043 53965 67423
11167 67423 20394 26775 44539 18171 43949 55514 40862 63113 58179 42714 22198 59957
11155 59957 118580 90140 59304 -16600 -21791 48279 73559 24182 -10693 -3585 13912 -57687
11143 -57687 -83409 -7114 -7274 12842 32414 42499 44770 14949 -6099 50195 113764 106221
11131A06221m3805r604j5406j9636J4703j9591o8118j8733N8581N1115Q4068J3448
11119A33243p6542l5946k0134o4123J1518J00761Q735J4073r67j8716j1923L0846
11107G0825M5747j33k7383l6292j7394M1900N8714J046k0021k6844l6475J0848
11095F4538r941k924k4028R354j3524K803J8043P4439p5972p0120n8246j7915
11083a03493N4734j7305L5306Q3513J8812l6141j7644M2332q514k7997m4724n1151
11071g2272l2980O5235M1593R963L3861l820M0315M751k7934J1980J6895k8961
11059E8626m2636n845l2412n4879K0650M2910O7813l3312l938j6385o8232J2632
11047e5008N7125J6714k8611J4569M8298M1403K2366r341k5464n7586l5291k8926
$$ plain form
11131 106221 62416 52812 37406 17770 32473 12882 -55236 -73969 -15388 35727 119795 133243
11119 133243 56701 20755 621 -63502 -51984 48777 57512 71585 70618 51902 39979 70825
11107 70825 116572 116439 89056 52764 35370 77270 135984 137030 117009 90165 53690 64538
11095 64538 54597 51673 27645 36999 23475 26278 44321 118760 42788 -27332 -85578 -103493
11083 -103493 -48759 -66064 -30758 52755 71567 35426 17782 60114 51600 23603 -21121 -72272
11071 -72272 -105252 -40017 1576 11539 45400 41580 81895 86646 58712 70692 87587 58626
11059 58626 15990 10145 -22267 -77146 -56496 -13586 54227 20915 16977 592 -67640 -55008
11047 -55008 2117 18831 -9780 4789 53087 94490 116856 107515 82051 24465 -10826 -39752
11035c9752k3393j6351m5643L2021l5997K8357R0353M5365K2761p2047m7083K2587
11023c8822J139L5498j0093l8786k5402J9606K0808p5958k7290K6668O0602N845
11011d6185J9880q569l234Q2J6091k4677K8656O8686L2799n443j7346n305N1218
10998A06653K107k7580l5416l8923l721l7786k2715J9312O7022O5072k4522K6691
10986I6194K659j5792j03651R171J8769J1343k4927p4395Q003Q698K7578O6453
10974C0103N0708o0912k2999P3338M6203K6201L3326M5277P1619K5169o2908j03166
10962A51959j2614p047j4766n848k2856k5250r7680N148P3057O351n62l1895J1705
10949B9702l4041r447L7824J2955o8453k9064O4292L420K8729L1802L5497r745
$$ plain form
11035 -39752 -63145 -79496 -125139 -93118 -129115 -100758 -10405 34960 57721 -14326 -61409 -38822
11023 -38822 -37683 -2185 -12278 -51064 -76466 -56860 -36052 -112010 -139300 -112632 -52030 -46185
11011 -46185 -26305 -34874 -38108 -38026 -21935 -46612 -17956 50730 83529 78086 60740 55435 106653
10998 106653 108760 81180 45764 6841 3120 -34666 -57381 -38069 28953 94025 69503 96194
10986 96194 98853 83061 -20590 -11419 7350 18693 -6234 -80629 -72626 -63928 -36350 30103
10974 30103 80811 19899 -3100 70238 116441 142642 175968 221245 292864 318033 255125 151959
10962 151959 139345 132298 117532 111684 88828 63578 -34102 -28954 44103 50454 49892 17997 29702
10949 29702 -4339 -13786 24038 36993 -31460 -60524 3768 7188 35917 67719 103216 93471
10937I3471m8851o6394k2590L7607O626n3510N0234Q743m9052L6713N4128L7055
10925H4180l0819k4453J2800Q872m5019j8962o565P6517N4801K1485R304o1389
10913H0752q9333l3763l0320l420J4683N4917M0131J3211M6758O291K7968k103
10901A25772j989K437q71j5255o6481K9417M2755l0792k0282m1287j5939K8812
10889C6297r601p15N5777l6749N685J3033l6240K9891O7902l1292M42L9964O336
10876A40730j8432J5112J6714n4649l9872J064K7582N621p3695J1801L9664Q3148
10864A54788J35401k3081r421J5885R5760J93936J72701J69798L08234L76727
10854A590728K87246J85706K13413K60732J79774j78296k94815j99565k35596
$$ plain form
10937 93471 44620 -21774 -44364 -6757 -131 -53641 -3407 5336 -43716 -7003 47125 84180
10925 84180 53361 28908 41708 50580 5561 -13401 -19966 56551 111352 132837 142141 80752
10913 80752 -8581 -42344 -72664 -76084 -61401 -6484 33647 46858 93616 99907 127875 125772
10901 125772 123783 126220 125349 110094 43613 73030 115785 84993 64711 23424 7485 36297
10889 36297 26696 25981 81758 45009 50694 63727 27487 57378 125280 93988 94430 134394 140730
10876 140730 122298 137410 154124 99475 59603 60667 88249 93870 20175 31976 71640 154788
10864 154788 290189 267108 257687 273572 369332 563268 735969 905767 1214001 1590728
10854 1590728 1877974 2063680 2277093 2537825 2717599 2539303 2244488 2044923 1809327
10845A809327l19595l89292l41267j99861r0369m7674p8332j00844j6187M3922
10835B69828J7538P903m3056m6628m9988m6322j6356Q040k7662L5651k5821j8938
10823F4189O1076N6130k2831k2374k6226k5269o0881j8829K3547J5278n00Q7917
10811A31227N1718k1843q9747r711l5758J3183r896p3684N1310O7395M8282l4146
10799H8330K723k7362o6954n1018N1755J6460K620j1642P5413M7009j6122j08957
10787B255l4699J5692O2632L4320l8838r229L5861j2892k9279k2037N6068K8002
10775H7856M416k2289l2036K7731K0126M2879N800p6026n8656M5019L1296O0002
10763A36118K0715L631j6553n2134m3947k296j9569J6593K6627J946K0208K6281
$$ plain form
10845 1809327 1489732 1100440 759173 559312 468943 421269 342937 242093 225906 269828
10835 269828 287366 295269 252213 205585 155597 109275 92919 100959 73297 108948 83127 64189
10823 64189 125265 181395 158564 136190 109964 84695 23814 4985 28532 43810 43310 131227
10811 131227 182945 161102 71355 61644 25886 39069 29173 -44511 6799 74194 122476 88330
10799 88330 91053 63691 -3263 -54281 -2526 13934 16554 4912 80325 127334 111212 2255
10787 2255 -32444 -16752 45880 80200 41362 32133 67994 55102 25823 3786 59854 87856
10775 87856 92272 69983 37947 65678 85804 128683 134483 58457 -199 44820 76116 136118
10763 136118 156833 160464 143911 91777 47830 45534 25965 42558 69185 71131 91339 117620
10751A17620m3207q1431J6395J9136K0392j4471K770q90O1922N334l8887j5268
10739D9415J3668k3905j1990K5847O4784n380N6170j6242n1726J9952K757J081
10727A24431m5719n0675m8538P2698K7212p1880l2043N3459k8788L138P3959J5080
10715I2334m5337J4145L9167J4907n8945K0140P9640R2400O480J9262N5722j1300
10703C18615L1518N20m231M0706j0184o2588j9090K9238k6820o6294m7166k2782
10691A61442L526L2267n2788p9254j2527k0473j2449J1133o4033L8484P6348N2963
10679A34639m6135k2975K5783J7735K9895n698r703l770n557k0201p1534L1793
10667E4272M2657n2062j3844M4020O9824M8604j2614q915m6532n7836k5319N4089
$$ plain form
10751 117620 74413 -7018 9377 28513 48905 34434 37204 36314 98236 103570 64683 49415
10739 49415 63083 39178 27188 53035 117819 112439 168609 152367 100641 120593 123350 124431
10727 124431 78712 28037 -20501 52197 79409 7529 -24514 28945 157 3295 77254 92334
10715 92334 46997 61142 100309 115216 56271 76411 156051 248451 254931 274193 329915 318615
10703 318615 350133 350653 346422 387128 376944 314356 295266 324504 297684 231390 184224 161442
10691 161442 164968 197235 144447 65193 52666 32193 19744 30877 -33156 5328 81676 134639
10679 134639 88504 65529 91312 109047 138942 133244 123541 119771 114214 94013 22479 54272
10667 54272 96929 44867 31023 75043 144867 193471 180857 171942 125410 67574 42255 96344
10655I6344Q3438j1124O357n7427m8224J3569P599K5738k4251l2227m6902q920
10643C970K4812J7750N49J6472O0710N7683J7240l3136n825m4915l5002k7494
10631E2814n0309J2511N2710j0534K4418k1357N5200R2279m9004r2452K0992Q0875
10619A68143R776L54M6445k762p7150J0607O1207j6850j6355j6396O2985Q1115
10607C11119o741N241R15l4803J4425N979J3514M3412j0026l5356M4804K451p3975
10594B80959o7987m8991L3471L6990L7683K0731K5672P3877L1686N7854J4326
10583D96271Q031P60J3613J12402R6142Q7313O9333M8977J770r7208n7714o7282
10571G12408q5955j83405j02955o4680J3822N1809N047l3297m7237k6811L8522
$$ plain form
10655 96344 179782 168658 175015 117588 69364 82933 90532 116270 92019 59792 12890 3970
10643 3970 28782 46532 47081 63553 124263 181946 199186 166050 160225 115310 80308 52814
10631 52814 2505 15016 67726 57192 81610 60253 115453 207732 158728 66276 87268 168143
10619 168143 177919 178273 224718 221956 144806 155413 216620 199770 183415 167019 230004 311119
10607 311119 304378 309619 310534 275731 290156 296135 309649 353061 343035 307679 352483 354934 280959
10594 280959 212972 163981 197452 234442 272125 292856 318528 392405 424091 481945 496271
10583 496271 504302 505062 518675 631077 727219 814532 883865 932842 934612 837404 779690 712408
10571 712408 626453 443048 340093 275413 289235 341044 346091 312794 265557 238746 277268
10560B77268K4344l5826M6146J8962m720M4823P4572L4023J5447k1673o2122j26288
10548B84956n4709R1923L1983J4714p201j6247j1074M12n54M636P0611M7332K0853
10535D77635L9281M1642j2469n9323l9888n4150p873M6018K0102j4237Q1657J01220
10523F19615L2289Q9881j343L0634j3759k1703L1184O4784J0349j2139K6264O121
10511H62177J5973j5192P663N6323J15076M8441j4038r001L4997Q328J03286P2507
10499A286540P2146N2473N0299K9062Q5056N6411O9598P4242P2944N9151J56111
10488B064033J44910J43521J62595J79160J84737J46914K28212L14962L48256
10479C917300L61454L43217M38001M56356M88936P24513Q94659Q72727Q19746
$$ plain form
10560 277268 301612 265786 311932 330894 326174 370997 445569 479592 495039 473366 411244 284956
10548 284956 230247 322170 354153 368867 361666 345419 334345 334757 334203 338839 409450 456782 477635
10535 477635 516916 558558 546089 486766 446878 392728 384855 430873 450975 436738 518395 619615
10523 619615 651904 741785 740442 771076 757317 735614 766798 831582 841931 829792 856056 862177
10511 862177 878150 862958 870621 926944 1042020 1090461 1076423 1067422 1102419 1110747 1214033 1286540
10499 1286540 1358686 1411159 1461458 1490520 1575576 1631987 1701585 1775827 1848771 1907922 2064033
10488 2064033 2208943 2352464 2515059 2694219 2878956 3025870 3254082 3569044 3917300
10479 3917300 4278754 4621971 5059972 5516328 6005264 6729777 7624436 8497163 9316909
10470I316909R46794J273475J488094J446159J458790J761398K240084K775521
10462B2707224L357406M170813N510335P897653J1456991J6773865K5299472L8326291
10454A35500050N6450176P3543227O4363255L1851694L5276717O1164021N1209571
10447E09358711j6742853o1436805m8091838k9177749m6189860p1735475o4979290
10440A71004841m8939775l3373994k1310646j3749066r182039o371818m658597
10433C3418906l750241k963746k344954k035530j831869j561909j340764j474613
10425A6115280j561828j386865j135644j098751j223434j051141q43832p33585
10417G080200o07125n16184l70396k65900k18075j44525n7436N2726J35241K53853
$$ plain form
10470 9316909 10263703 11537178 13025272 14471431 15930221 17691619 19931703 22707224
10462 22707224 26064630 30235443 35745778 43643431 55100422 71874287 97173759 135500050
10454 135500050 191950226 265493453 329856708 361708402 396985119 458149140 509358711
10447 509358711 492615858 431179053 383087215 353909466 307719606 235984131 171004841
10440 171004841 122065066 88691072 67380426 53631360 44449321 38077503 33418906
10433 33418906 29668665 26704919 24359965 22324435 20492566 18930657 17589893 16115280
10425 16115280 14553452 13166587 12030943 10932192 9708758 8657617 7813785 7080200
10417 7080200 6473075 5956891 5586495 5320595 5102520 4957995 4900559 4953285 5088526 5342379
10407E342379L15061L39059J98537J41559J72232J08844j75039m21985m86067
10398E534580l63859l89131n65898n93774m76224l65354k55899j96112j50485
10389B177844j11817r0453j62660j17092l9299p8061m8222l7065o2727n2374p9111
10378A298963n7799K1844l1297r8143j1385o5460n3892j7725m035l54M0813J9896
10366A041426o588j6515l6835o0775q0886p458K6371K8965l5749m9840J4759n491
10354H11384Q7132O883l8026m4604m6485o482l864O105j2164m3315l230O0784
10342G74118M7672m1356p9659K7721M0471j7631l9816K6252o77L6561O492l0081
10330G50067J8406O0342O9536R2153M1444q955M572L2118j289j02215j75351l4131
$$ plain form
10407 5342379 5657440 5996499 6195036 6336595 6508827 6617671 6442632 6020647 5534580
10398 5534580 5170721 4781590 4215692 3621918 3145694 2780340 2524441 2328329 2177844
10389 2177844 2066027 1975574 1812914 1695822 1656523 1578462 1530240 1493175 1430448 1378074 1298963
10378 1298963 1241164 1263008 1231711 1133568 1122183 1056723 1002831 985106 981071 980717 1021530 1041426
10366 1041426 1034838 1018323 981488 920713 839827 832369 858740 887705 851956 802116 816875 811384
10354 811384 898516 905399 867373 822769 776284 769802 765938 772043 759879 716564 713334 774118
10342 774118 821790 780434 700775 728496 768967 751336 711520 737772 737095 773656 780148 750067
10330 750067 768473 828815 898351 990504 1031948 1022993 1027565 1059683 1058394 956179 780828 746697
10318G46697j6741j00960r1254j07517L0261k5028o0374k4815j8153K6855L4458
10307C93429k871q991j7273r414K9861N698m6335M4382Q0606N466N7613R7192
10295F29363O9425O9766L2165M0763K8717j9626o1402p9961l2023j9802p2762
10284E84623r5951L7089L3824N6339K4121Q1544J06876J4551l12K2180N5437P3556
10272I93877O3498j03438j09736j40273j42160q4295n1328k4133m9383n8848m8903
10261B44878J1521K7057l5662o3992j4870L1463L0007r81k0161n836K1428K7007
10249B51859N0850K1760n497l4291m3356R099k140R138o3921n6392K2446o758
10237A52797p640L8869J4001k4191M5342J1075l3444K5144m358l0000L6921L1798
$$ plain form
10318 746697 729956 628996 537742 430225 460486 435458 375084 350269 332116 358971 393429
10307 393429 390558 381567 364294 354880 384741 390439 344104 388486 469092 474558 532171 629363
10295 629363 698788 768554 800719 841482 870199 850573 789171 709210 677187 657385 584623
10284 584623 488672 525761 559585 615924 640045 721589 828465 843016 842704 864884 920321 993877
10272 993877 1057375 953937 844201 703928 561768 477473 426145 402012 352629 293781 244878
10261 244878 256399 283456 247794 183802 168932 200395 230402 229421 209260 203424 224852 251859
10249 251859 302709 324469 318972 284681 241325 250424 248284 257422 193501 137109 159555 152797
10237 152797 145157 184026 198027 173836 219178 230253 196809 221953 217595 187595 224516 256314
10225B56314q1768o7209m2496M0121J3363j4492J5522K1233K0408k0277k3794
10214A16925O7780J9950R803J9933J5532k0744l217q093l658j7511J0600L0092
10202B37392m2352n0798j3875o986L6161J8099J538P1981j6780n2021l753J2893
10190A91499k0555Q282N8127J6353J3883p5920l9750J2577k939j4892n740J4302
10178A55227R295J2212j7823k7862N0932J1956K8003q058p3185j8464J0032m4510
10166H7755o5511L9644K7886K3550K8028l0295n0885m043K0058N7986j1762n8365
10154F4046J8416J5762m7755P476lO412j3546J2319k1949m8499N2501N9147K5905
10141A30232M9217L0233l9773k164m7247l1838l0224j7747L8061L8860K4870m5297
$$ plain form
10225 256314 174546 107337 64841 104962 118325 103833 119355 140588 160996 140719 116925
10214 116925 184705 204655 214458 234391 249923 229179 225962 217869 214211 196700 207300 237392
10202 237392 195040 144242 130367 123381 159542 177641 179179 251160 234380 182359 178606 191499
10190 191499 170944 179226 237353 253706 267589 191669 151919 164496 161557 146665 140925 155227
10178 155227 164522 176734 158911 131049 181981 193937 221940 213882 140697 122233 132265 87755
10166 87755 22244 61888 89774 113324 141352 111057 60172 56129 76187 134173 122411 64046
10154 64046 82462 98224 50469 57945 57942 64354 50808 63127 41178 -7321 45180 104327 130232
10141 130232 179449 209682 169909 167745 120498 88660 58436 40689 78750 117610 142480 97183
10129I7183q215l4512m6526N1308O3231j1589n0750M6280Q393l8756m2538q546
10117B4963M5948L914J5094k9829n7497j3972M6215O4293L689L0604j1763m919
10105A16740j6625K4664l5996J877r560N245l1285K993L8084N8383l1858l2673
10093H9989j6887J7432N764K6506j5489K0155L9752n685J8090N0750L2362J6341
10081B79080o5625n7374M9096M5330l1599L0396Q904j095l7351k4031m9801j2634
10069A33296J3776M1169n341m389K1321J7819j429L791n7087q853M1509N2538
10057B48120K1338O5139n7750k9522l9925J6147J44580J31437J46596J07536K32110
10046I85806M16618M58664M54398L24844M60708O28514L52694l73828o35386n20377
$$ plain form
10129 97183 88968 54456 7930 59238 122469 110880 60130 106410 114803 76047 33509 24963
10117 24963 70911 74825 89919 60090 2593 -11379 34836 99129 102818 133422 121659 116740
10105 116740 100115 124779 88783 90660 81100 86345 55060 58053 96137 154520 122662 89989
10093 89989 73102 90534 96298 122804 107315 127470 167222 161537 179627 230377 262739 279080
10081 279080 213455 156081 205177 250507 218908 249304 258208 257113 219762 195731 145930 133296
10069 133296 147072 188241 182900 178511 199832 217651 216222 220013 162926 154073 195582 248120
10057 248120 269458 334597 276847 247325 207400 223547 368127 499564 646160 753696 985806
10046 985806 1402424 1861088 2315486 2640330 3101038 3729552 4082246 3708418 3073032 2552655
10036B552655l64732m08690l63620k85589l17233j99496q4187o1184j1899p901
10026D48124j03163j28186k7054J2589m418N9251K2523K6538J980k6310m7885
10015B33989R27L46l0927p343L9308J5462k1217L1287L4373R00j320m3946m0435
10002B11404p9638l1986J3788r650K1193N7266M3185R382O430r075M074K6608
9990B62981p587L997Q1424k0108m8692r966M1312P949K4495l5275j076K6586L133
9977C29173r869j083K194J5687O2342L0651O821N0215k0074n6466K2621K7187
9965D59399q543j8257l837m424m1458k9132P4691O4995Q097j8644j119O740j0914
9952D77594K8283J2396O349j5642J9456N7210k5362m1697p473M9049j2413o917
$$ plain form
10036 2552655 2187923 1779233 1415613 1130024 812791 613295 529108 467924 456025 448124
10026 448124 344961 216775 189721 202310 197892 257143 279666 306204 308184 281874 233989
10015 233989 234916 235262 204335 196992 236300 251762 230545 261832 296205 297105 295785 251839 211404
10002 211404 131766 99780 113568 103918 125111 182377 225562 234944 241374 232299 236373 262981
9990 262981 255394 259391 340815 320707 272015 262049 303361 311310 335805 300530 299454 326040 329173
9977 329173 319304 318221 320415 336102 398444 429095 435916 486131 466057 409591 432212 459399
9965 459399 450856 432599 428762 424338 382880 353748 428439 493434 501531 482887 481768 488508 477594
9952 477594 505877 518273 524622 508980 528436 585646 560284 518587 511114 560163 547750 540833
9940E40833m4425P709M7106l12j7613N4376P4495M1329o912j4304m7900k7543
9928F06839M5622j2437J1834M963Q7765J02016N198l6952j2003P458j7045K7532
9916H20790j2803n4160N4218P9071j3514L6712N7526L296j2288N1736J5129L0291
9904A056004P6396P8799L6555Q3436p674M0297K9521L651O3196O0256R0239R6987
9892A707663M8881J10335J18008R7869N0350O4980O1950J01539P9341K5447O9016
9881B535379Q0781J15084J63431J58414J96890J82345J71134J68148J27101J65498
9871D064205K02152L02474K71171K54611L21246L10709K89561L22442K90090K99685
9861F928346L61846M00612L68770L49878L95371M08076L36363L80052M88454M82314
$$ plain form
9940 540833 496408 504117 551223 550911 533298 587674 662169 703498 696586 682282 634382 606839
9928 606839 652461 640024 651858 656821 744586 846602 851800 814848 802845 810303 793258 820790
9916 820790 807987 753827 808045 887116 873602 910314 967840 971136 958848 1010584 1025713 1056004
9904 1056004 1132400 1211199 1247754 1331190 1323516 1363813 1393334 1396985 1460181 1520437 1610676 1707663
9892 1707663 1756544 1866879 1984887 2082756 2133106 2198086 2260036 2361575 2440916 2466363 2535379
9881 2535379 2616160 2731244 2894675 3053089 3249979 3432324 3603458 3771606 3898707 4064205
9871 4064205 4266357 4568831 4840002 5094613 5415859 5726568 6016129 6338571 6628661 6928346
9861 6928346 7290192 7690804 8059574 8409452 8804823 9212899 9549262 9929314 10417768 10900082
9851A0900082L60358K88976L32370L24611L55972L78955M14456M05249M28098
9842A4189127M29046L53580L90180L98536L43402L58222M08011M54745M43326
9833A7768175N19206N45189O01429N95344O00239O59430P56228P47226P80938
9824B3573404Q22220P62401Q08403P82368P15500O32686O29538M99713M20978
9815B9647211K99507J44080N8194n8952j53561l01382l12246m57078n94699o39719
9805B7631355o96179o36335o84051p25710p51813p27566o66617n68779n42952
9796B1631353n70629n18844n45515n19191m74870l95385l71202m67477m28721
9787A7339519m22534m15715l96330m28081l92129l49157l58175l98758m07437
$$ plain form
9851 10900082 11260440 11549416 11881786 12206397 12562369 12941324 13355780 13761029 14189127
9842 14189127 14618173 14971753 15361933 15760469 16103871 16462093 16870104 17324849 17768175
9833 17768175 18287381 18832570 19433999 20029343 20629582 21289012 22045240 22792466 23573404
9824 23573404 24395624 25158025 25966428 26748796 27464296 28096982 28726520 29226233 29647211
9815 29647211 29946718 30090798 30148992 30090040 29936479 29635097 29322851 28865773 28271074 27631355
9805 27631355 26935176 26298841 25614790 24889080 24137267 23409701 22743084 22174305 21631353
9796 21631353 21060724 20541880 19996365 19477174 19002304 18606919 18235717 17768240 17339519
9787 17339519 16916985 16501270 16104940 15676859 15284730 14935573 14577398 14178640 13771203
9778A3771203m68345m45747m04121m50209m21151m50305m62983m84789m87404
9769I696149l83974l40021l91444l84335m08824l79051l53448l47337k65765l17861
9759F124089l21676k83481k47162k22305k15129k02257k45491j92242j93744j84842
9749C815760j36519j08154j33805j43156j76861j64632j06085j30922j14905m6004
9739B554717j02127j03833n8238m6242j02053j08189m9830n0575q8397l0374o0688
9728A754171k9059l4638m6407l1690l3248m7157r3068m480l7926n4581o399m2935
9716A292583r7785j6018O7216n1732l6111l9124L5847n7702k7061j8009m523j3844
9704A033737k556J7278o944m2635L817o0333n7871k8552L4207L0768m0655k5209
$$ plain form
9778 13771203 13302858 12857111 12452990 12002781 11581630 11131325 10668342 10183553 9696149
9769 9696149 9312175 8972154 8580710 8196375 7787551 7408500 7055052 6707715 6441950 6124089
9759 6124089 5802413 5518932 5271770 5049465 4834336 4632079 4386588 4194346 4000602 3815760
9749 3815760 3679241 3571087 3437282 3294126 3117265 2952633 2846548 2715626 2600721 2554717
9739 2554717 2452590 2348757 2290519 2244277 2142224 2034035 1984205 1933630 1845233 1814859 1754171
9728 1754171 1725112 1690474 1644067 1612377 1579129 1531972 1438904 1434424 1396498 1341917 1335518 1292583
9716 1292583 1194798 1178780 1245996 1194264 1158153 1119029 1154876 1097174 1070113 1052104 1047581 1033737
9704 1033737 1031181 1048459 1041515 998880 1002697 942364 884493 855941 890148 920916 880261 855052
9692H55052M189k4452p200o5735J7096N6589n4016l5507J4971N9744j0847r1680
9680G18204m6763O3219N1192q6671j18853R335N2190q293O539K5643k2056J0181
9668F53867j5255l3583k3825q441l6983R478O8555J2913p1009j9772J3821j5158
9656E34608l0451j8955J1766j8115L1128R769N481N6923J0442n3677j0083l3981
9644D94855L309j5942j1944n938J9810L1808j6537j9631l5301j2974l2844J8405
9632D17076Q260M936M0470M2854m5134o0163l6475l6614L8498K7187J5720M0968
9620D57583r435k3062R095l8875j1798J3681K3039M3800l592k5164Q843l339n0892
9607C89884K2705N5064o9674p1540m5351K6836K9599J7043K7541k8784M0785Q060
$$ plain form
9692 855052 859241 834789 827589 761854 778950 835539 781523 746016 760987 820731 809884 718204
9680 718204 671441 734660 785852 699181 580328 589663 641853 633560 640099 665742 643686 653867
9668 653867 638612 605029 581204 572763 535780 545258 613813 626726 555717 535945 549766 534608
9656 534608 504157 485202 496968 478853 509981 519750 525231 582154 592596 538919 528836 494855
9644 494855 498164 482222 470278 464340 484150 515958 499421 479790 444489 431515 398671 417076
9632 417076 425336 430272 470742 513596 468462 408299 371824 335210 373708 400895 416615 457583
9620 457583 448148 425086 434181 395306 383508 397189 420228 464028 460436 435272 444115 440776 389884
9607 389884 412589 467653 397979 326439 281088 307924 337523 354566 382107 353323 394108 402168
9595D02168l2910p665j2053l005M0013J1029j9208n1432L0208M2297l096j0748
9583C85598k9438l8647o8284L2979K6871K0439L8072J9556j7412n765J3901J3972
9571C91842N321k1372o95K9880l3605j0356O6641N3597l4413j2704j6809n1976
9559C65351J1942K8950j5962n3466k3467K5948p212K5082k8589J1331K674K9598
9547C72180L1025J7037n3694j0224m067J3205L1770l1144n4833J3529j4202k0891
9535B89691j9034L702k2787o6493R595P9006K104m6011J0217N8333l850k286M683
9522B96870N7059j6540l7092l5322o63M6847J6105k1006m472j7764j3013j557
9510B69452K6998k953M4921O6424o7308p0147o2564j1386o553K1212P5241j2197
$$ plain form
9595 402168 369258 361593 349540 346535 386548 397577 378369 326937 357145 399442 396346 385598
9583 385598 356160 317513 249229 282208 309079 329518 367590 387146 369734 363969 377870 391842
9571 391842 397163 375791 375096 404976 371371 361015 427656 481253 446840 434136 417327 365351
9559 365351 377293 406243 390281 336815 313348 339296 332084 357166 328577 339908 342582 372180
9547 372180 403205 420242 366548 356324 352257 365462 397232 366088 311255 324784 310582 289691
9535 289691 270657 274359 251572 185079 194674 273680 275784 229773 239990 298323 294473 292187 296870
9522 296870 353929 337389 300297 264975 264312 311159 327264 306258 301786 284022 271009 269452
9510 269452 296450 293497 338418 404842 337534 267387 204823 193437 186884 208096 283337 271140
9498B71140k7057r252p67M313K9679J1297L4705O2985q096l8570r865J0563K7542
9485C58617l1843k0759n8850K7305L2977L647k9979k0227L4230K3879J3202J5551
9473C47750l803n0820L1318Q952N742l5233j1283j1216k6594p6095j7804K8812
9461A89726L9478M0273j3381n4470j6485Q1713K7468Q6103l3336l6313j2660k3691
9449B74425k8696K5712K6275r634K8553K7943o7123q5775n522M4806j794K2682
9437B51852j412K8278m1714J1959j1640l2190j9255M4554K5490N5723N6818M6926
9425D15389k0118n166K6787l1787o2358n2257J052M7030J0752l7357m8585m9963
9413A93419M8124N6125K4435P1227p815j3380l0473j6558J8045j2189n9079L2738
$$ plain form
9498 271140 244083 234831 234064 238377 268056 279353 314058 377043 368947 330377 320512 331075 358617
9485 358617 326774 306015 247165 274470 307447 311094 281115 260888 295118 318997 332199 347750
9473 347750 343947 293127 324445 333397 339139 303906 292623 281407 254813 178718 160914 189726
9461 189726 229204 269477 256096 201626 185141 266854 294322 380425 347089 310776 298116 274425
9449 274425 245729 271441 297716 288082 316635 344578 277455 191680 186158 230964 229170 251852
9437 251852 250440 278718 237004 248963 237323 205133 185878 230432 255922 311645 368463 415389
9425 415389 395271 390105 416892 385105 322747 270490 271542 318572 329324 291967 243382 193419
9413 193419 241543 297668 322103 393330 385515 372135 341662 325104 343149 330960 271881 304619
9401C04619K9136j8047K2446M901m199J338M5096L9963j0277k2596m2748K3854
9389C73486J544n1044j2227l5948K2978L5122M1774J8842O1202K2540L0450o0132
9377D48587n6980j3316O812M7071Q4482K814n9364k7893M3007K8643Q755o790
9365E05828k6709k6019Q73l2861J06280O1002K3721J3216N0689K751k8463k6300
9353F24008R30K9056K713O36J9756L4596O0711M2652L542k6765o8940l9885L5320
9340G18330J5331L0099L9550N6464K681L9497M2762m106L7052K5142j2230M3337
9328A033909O123M4453L824m4092k2653N9881N3674Q0141O0797l3865P889M3714
9316A293795K0179R2602L4742J6358K9333J0009R3833O2635P0963N9493j0748
$$ plain form
9401 304619 333755 315708 338154 343055 338856 340194 385290 425253 414976 392380 349632 373486
9389 373486 375030 323986 311759 275811 298789 333911 375685 394527 455729 478269 508719 448587
9377 448587 391607 378291 385103 432174 516656 519470 460106 432213 475220 503863 512618 505828
9365 505828 479119 453100 453973 421112 527392 588394 612115 625331 676020 678771 650308 624008
9353 624008 624938 653994 656707 657343 677099 711695 772406 815058 818600 791835 722895 683010 718330
9340 718330 733661 763760 803310 859774 862455 901952 944714 940608 977660 1002802 990572 1033909
9328 1033909 1040032 1084485 1088309 1044217 1021564 1081445 1135119 1215260 1276057 1242192 1250081 1293795
9316 1293795 1313974 1406576 1441318 1457676 1487009 1497018 1590851 1653486 1724449 1783942 1773194
9305A773194M8856O0271Q5346J06563M2194J4852M0751J03297J19682J47219J48033
9294B690258J14334Q6721J32055J03424Q8461J47290J83779J73399J80763J51463
9284D051947J81082J85243J62146K21214K30222K78271L35973K93675L02145L29018
9274F570936M02518L76497L30376L14860M29875M53667M03578L71231M03439M12038
9264A0469015L50364L11102K79002K97039K47814J22305K5878J1861o652j64961
9254A1942767j30663k63632l32656l46282l45995l75101m07109l56137l77993
9245I007199m51945m77450m39442m41227m01326l38991l05903l18268l31988l48709
9235E151950k23822k38894k12886k59830k60344j20413k11093j86586j95129j19842
$$ plain form
9305 1773194 1822050 1882321 1967667 2074230 2116424 2131276 2172027 2275324 2395006 2542225 2690258
9294 2690258 2804592 2891313 3023368 3126792 3215253 3362543 3546322 3719721 3900484 4051947
9284 4051947 4233029 4418272 4580418 4801632 5031854 5310125 5646098 5939773 6241918 6570936
9274 6570936 6973454 7349951 7680327 7995187 8425062 8878729 9282307 9653538 10056977 10469015
9264 10469015 10819379 11130481 11409483 11706522 11954336 12076641 12102519 12114380 12107728 11942767
9254 11942767 11812104 11548472 11215816 10869534 10523539 10148438 9741329 9385192 9007199
9245 9007199 8555254 8077804 7638362 7197135 6795809 6456818 6150915 5832647 5500659 5151950
9235 5151950 4928128 4689234 4476348 4216518 3956174 3835761 3624668 3438082 3242953 3123111
9225C123111j15872j60241j60512j09692j15439r6565j26002j34527j03756j12941
9215A887564n6308l5215q8975q7639o1080L637q662q4116n0181o6214o2605K1158
9203A311364O0169p3254j30803r5125k3201k6607J118j4775k1497k4109l6451
9192I26829k1816o8417o1399l6335K341k7429q283J4573j9633m6432j4650o686
9180F32663j9111k2992j9975K468L9660r174l2661j6803J1369K3002j3829n3486
9168E21131j3460M780l2682k9901J7543K5681o750k0834j1344n6946o8943J3514
9156C41789N7214J5911k1234l2391J9690P7349o9279n1930k7320j7611q436l5763
9144B47989L6321L6628k2022j3305J1654n5410K1843Q309l6655K3695L745j0256
$$ plain form
9225 3123111 3007239 2846998 2686486 2576794 2461355 2364790 2238788 2104261 2000505 1887564
9215 1887564 1831256 1796041 1707066 1619427 1558347 1561984 1553322 1469206 1419025 1352811 1290206 1311364
9203 1311364 1371533 1298279 1167476 1072351 1049150 1022543 1023661 1008886 987389 963280 926829
9192 926829 905013 836596 775197 738862 741203 713774 705491 720064 700431 653999 639349 632663
9180 632663 613552 590560 570585 573053 612713 603539 570878 554075 565444 588446 574617 521131
9168 521131 507671 512451 479769 449868 467411 493092 486342 465508 454164 397218 328275 341789
9156 341789 399003 414914 393680 361289 380979 458328 389049 337119 309799 292188 283752 247989
9144 247989 284310 320938 298916 285611 297265 241855 263698 272007 235352 259047 262792 252536
9132B52536k0535L9666J1306q951l617n9645o2929m7743K1803Q9766k545l1370
9120A77742j8846L8705J6947J6259K2351N2803k8867n6431P839j5858j915K4293
9108B35022j7521l4045L0025l05L3010j3583m3659J4240m784L0431K1725k2899
9096B27657k9727K465J5216O207r367o1652k4364L6673M15j1303k672j1599l822
9083A34127n9865m0072O548K0892l6036K8570O4166J3810n4421l9522O2315L6247
9071A36759j4619n7110m1618M693J0830P860M9558J0086j9777p628N34L1889J6396
9058A27853m6342K1669O0164R21M867k8755N9085J5226j9617l5060l8145N6425
9046A78291K186k3576j6546j8588m7799J8776M1863m1493k5827n1258K4257L7921
$$ plain form
9132 252536 232001 271667 282973 274022 270405 210760 147831 100088 121891 211657 209112 177742
9120 177742 158896 197601 214548 230807 253158 305961 277094 220663 228502 212644 210729 235022
9108 235022 217501 183456 213481 213176 246186 232603 188944 203184 198400 228831 250556 227657
9096 227657 197930 200395 215611 221818 212451 150799 126435 163108 163523 152220 149548 137949 134127
9083 134127 74262 34190 40738 61630 25594 54164 118330 132140 77719 38197 100512 136759
9071 136759 122140 65030 23412 28105 38935 46795 96353 106439 86662 79034 79568 111457 127853
9058 127853 81511 103180 163344 164265 169132 140377 199462 214688 195071 160011 121866 178291
9046 178291 180477 156901 140355 121767 73968 92744 134607 93114 67287 16029 40286 78207
9034G8207M9375K4668m1j9669q532j1989p420m4488l566k597M6193J4907j1612
9021A03436n3920L6870K6083L3923l6518l7874k8272L2142m0438r476Q3118L1597
9009A40671m1805k7253q7838m459Q4214K0670K426p860r503Q079K4099N7293M405
8996A63139l8140q665j12877k3818l6723j34L2957O2943L4912K8864n6064l5872
8984A0522M0163o3501k3667R0070K2280o4172j789K2099l781J3174l768J9940
8972E7570O040l4578k2823j725K6852M0605L6360O3871k9616o7959M7066k1175
8960A00488l1934O0896L874M9612o287l7926P2511M2652n8286m12o7369j12005
8948A5814k3359O705N1929J7679P407Q645l0953K7897J9115o6196o749K2448J9454
$$ plain form
9034 78207 127582 152250 152209 132540 124008 112019 104599 60111 56545 53948 100141 115048 103436
9021 103436 49516 86386 112469 146392 109874 72000 43728 75870 35432 25956 109074 140671
9009 140671 98866 71613 -16225 -20684 63530 84200 86626 78766 69263 77342 101441 158734 163139
8996 163139 124999 116334 3457 -20361 -57084 -57218 -24261 38682 73594 102458 46394 10522
8984 10522 50685 -12816 -36483 53587 75867 11695 9906 32005 28224 41398 37630 57570
8972 57570 63610 29032 6209 4484 31336 71941 108301 172172 142556 74597 121663 100488
8960 100488 68554 129450 133324 182936 176649 138723 211234 253886 195600 195188 127819 15814
8948 15814 -7545 -840 51089 68768 76175 84820 53867 81764 100879 34683 27934 50382 69836
8935F9836Q1937M2017r198l1718L8467M909l1442n4209j4698L6583O051r7057
8923D1478r2658K6028M6077J9676l5306n5972J467K4820L6383r165O615M2571
8911E2014O3617L5729n204j5502l4549l3899K0057N06l754m8505p1000M6711K6968
8898C3189m5258P1202J7028l2948J9375N4727K4316j7034m9143k0842O0402K8631
8886A43645m8201n400j8946p7732l1634J2675R5028N1182M8020m7801p6394N2986
8874I7428M0826k5385l7302M5560K8138m9205K0790l2319j9914l3328k1987N655
8862A8957Q0159O8617n5941n7202j583k4378J5907j8611L8641J2715K914O684
8850H6879J2132j9260j2541k5209j305J7906M5840J5752m8832m5071Q27J7966
$$ plain form
8935 69836 151773 193790 184592 152874 191341 196250 164808 110599 95901 132484 138535 41478
8923 41478 -51180 -25152 20925 40601 5295 -50677 -49210 -24390 11993 2828 9443 52014
8911 52014 115631 151360 146156 130654 96105 62206 82263 82769 79015 30510 -40490 6221 33189
8898 33189 -12069 59133 76161 43213 62588 117315 141631 124597 75454 54612 115014 143645
8886 143645 95444 90044 71098 -6634 -38268 -25593 69435 120617 168637 120836 44442 97428
8874 97428 138254 112869 75567 121127 149265 100060 120850 88531 68617 35289 13302 18957
8862 18957 99116 167733 111792 54590 53007 28629 44536 25925 64566 77281 80195 86879
8850 86879 99011 79751 67210 42001 40696 58602 104442 120194 71362 26291 27118 45084
8838D5084K2527N1897L1464m1611m3211L0298M5010l028j0099l3539K7592j2966
8826A09418k713Q757n4129j4697L7927M0239p797k5669j902J8106Q197j6350j1889
8813H7498M3046Q1061n0858j7998p5773J124J4594M0165K3501L9228J1338k9712
8801A67214J1030q7486m7709k7274N1225o980j1876N7771M4689k7301n3670q885
8789F0748R498M0211j3269l226K5526l562l4982m551n0852n6551j0946N2224M5908
8776E6176L2822K6660L1627N5936K5269m0245r0954p0269j563p328M4602N900
8764F8633l1001L1273J1190K3425P663n0646l831L9655k6145m2024J7190P308
8752E2690M5218l3160j8151n721Q5799q667j7106m1966j2441j7684k0833k0289
$$ plain form
8838 45084 67611 119508 150972 109361 66150 96448 141458 138430 128331 94792 122384 109418
8826 109418 106705 115462 61333 46636 84563 124802 117005 91336 89434 107540 115737 99387 87498
8813 87498 130544 211605 160747 142749 66976 68100 82694 122859 146360 185588 196926 167214
8801 167214 178244 90758 43049 15775 67000 60020 48144 105915 150604 123303 69633 60748
8789 60748 70246 110457 97188 93962 119488 115926 80944 76393 25541 -31010 -41956 10268 56176
8776 56176 88998 115658 147285 203221 228490 188245 97291 27022 25459 18131 62733 68633
8764 68633 37632 68905 80095 103520 111183 60537 56706 96361 70216 28192 45382 52690
8752 52690 97908 64748 46597 40876 126675 118008 100902 58936 46495 28811 7978 -12311
8740a2311j878Q315K8088Q957J1501p880L7835P7070l2420m539M2134J2509j4431
8727A52950k488L2176l4639j8091q222M7618k4015M2965n54J5991m61L106n2874
8714A53462p1152L9947O7807j229q363l0804L0228J671M1140l170k8352P9k5231
8701A66033o0203j0891Q0230M902k5176Q507J5889k5931l7735O1598k0836m3506
8689A12881q3675j3986O1318K2878L9827J1013K4436m772q0917k1714N9682K5525
8677A52496j7217J4578N339O109mm4843l3408N0241J3357q225q459J1761M0069
8664A81794J1042O688j0890j1341J1669K3279P336K1659j5852j2283M0802p546
8652B46357J3827j8943J0821l91K3720l7522J4897L4957l2665K131M4088O6850
$$ plain form
8740 -12311 -14189 -5874 22214 31171 42672 34792 72627 149697 117277 112738 154872 167381 152950
8727 152950 150462 182638 147999 129908 121686 169304 145289 188254 187700 203691 203230 206336 153462
8714 153462 82310 122257 190064 188835 180472 149668 179896 181567 222707 219537 191185 191264 166033
8701 166033 105830 94939 175169 180071 154895 163402 179291 153360 115625 177223 156387 112881
8689 112881 29206 15220 76538 99416 139243 150256 174692 169920 89003 67289 126971 152496
8677 152496 135279 149857 155196 161305 161301 116458 83050 133291 146648 138423 129964 141725 181794
8664 181794 192836 199524 188634 177293 188962 212241 219577 241236 225384 213101 253903 246357
8652 246357 260184 241241 252062 251671 275391 237869 252766 287723 255058 257189 301277 368127
8640C68127j1526l3421K341J2779l0300K2179J0945r290n0717q50l9827o775j7009
8627B16656o995P1840J02392j415m43M9322m202p084k2703q799K5458J7757M5198
8614D76982O2491j5298j5990R585L5499N8521K434J9009P791J7895O6538j9417
8602G06040J2053J05239J28342J16841Q6337N6740O6807M9384j7600M4686L3747
8591A388616k2240m6532m0040r1426j08383j10730j48428j50897n3723K2061k5476
8580F12802j4576k2430m2882J2293k2101n7601n5489k6432j5351m6572o9962j19499
8568A32200K2692M0146N6L5396J7693K111M595k2852J9376o793l4481k8028L4615
8555B16726M6790M1528J2876K2354O543p4242l1699j1306k3595j8813K0762j2172
$$ plain form
8640 368127 356601 323180 325521 338300 308000 330179 341124 331834 281117 280267 240440 233665 216656
8627 216656 209661 281501 383893 382478 382035 431357 427155 420071 397368 388569 414027 431784 476982
8614 476982 539473 524175 508185 517770 553269 611790 614224 633233 641024 658919 725457 706040
8602 706040 718093 823332 951674 1068515 1154852 1211592 1278399 1327783 1310183 1354869 1388616
8591 1388616 1366376 1319844 1279804 1188378 1079995 969265 820837 669940 616217 638278 612802
8580 612802 598226 575796 532914 545207 523106 465505 410016 383584 368233 321661 251699 132200
8568 132200 154892 195038 195094 230490 248183 250294 254889 232037 251413 244620 210139 182111 216726
8555 216726 263516 305044 317920 340274 346817 272575 240876 229570 205975 187162 207924 195752
8543A95752k1004l4033M6842J9231l9566O399K2154k4452k015Q6627M4535l5324
8531B65146K3271k2510n8630m3505n477K166K8007j9499m2422p658o4643k7883
8519B6363K9329L3654O4408J6545k4343j8738j449N8920j2176n4132k1651p959
8507H8771j1350O9648j934l1486N3997k7669l0254L4726M300K0447l820m2931
8495A22445J169m248R3921K3629l8287J4320J4631K930M9569n3729m3986k0342
8483A62022K0558l1507m6179k85Q456J47J580N230k8840n8656L378O2964K204
8470A01072O0276M3253m149k0479j6362O0801L5234K0160R1516J83550J80971
8459G35843J72182J47174Q7322l1647q1292q2366j46135j83177j26220j17368
$$ plain form
8543 195752 174748 140715 187557 206788 167222 173621 195775 171323 169308 255935 300470 265146
8531 265146 288417 265907 207277 163772 158295 160461 188468 168969 126547 118889 54246 26363
8519 26363 55692 89346 153754 170299 145956 127218 125769 184689 172513 118381 96730 88771
8507 88771 77421 147069 145135 113649 167646 139977 109723 144449 148749 169196 165376 122445
8495 122445 123614 119366 213287 236916 198629 212949 227580 230510 280079 226350 182364 162022
8483 162022 182580 151073 104894 104609 113065 113212 114792 120022 91182 32526 35904 98868 101072
8470 101072 161348 204601 200452 179973 163611 224412 259646 279806 371322 554872 735843
8459 735843 908025 1055199 1142521 1110874 1029582 947216 801081 617904 491684 374316
8449C74316j19740o8460k2936N148L1784L9720J0498q0330l5684R832N712K613
8437A52473l4395j2850Q822r777J8896O3736n1301q1650L7249N9128J1806M887
8425A67024K3336J2425M0284K7811N9821L9505L4736J36075J83023J72809J46291
8414A043140K2143n3369o7088q7907j23192j35802j79526o3682L1677n9848q0941
8403B45605J9933n3020n2982J7942l4579n4920J6361K0956J959k0333k6063n9444
8391B1415L4218M6030J9361K7440L5448n6831M415l1204m5670K2765k1226n9176
8379c015Q150P2990K8768O2020q199J3796n983R823o454k7894J0859o6721k4520
8366F3620K9319L962k2820o1888m1391J8798R3039J2954j4714k8388K6723j5394
$$ plain form
8449 374316 254576 186116 163180 168328 200112 239832 250330 170000 134316 144148 149860 152473
8437 152473 118078 105228 114050 104273 123169 186905 135604 53954 91203 150331 162137 167024
8425 167024 190360 202785 243069 270880 330701 370206 404942 541017 724040 896849 1043140
8414 1043140 1065283 1011914 944826 856919 733727 597925 418399 354717 386394 326546 245605
8403 245605 265538 212518 159536 177478 142899 87979 104340 125296 127255 106922 80859 21415
8391 21415 55633 101663 121024 148464 183912 127081 131496 100292 54622 77387 56161 -3015
8379 -3015 5135 78125 106893 168913 160714 174510 168527 178350 171896 144002 154861 88140 63620
8366 63620 92939 96901 74081 12193 -29198 -10400 82639 95593 80879 52491 79214 63820
8354F3820O3198O3405m4088m1917K1891R047p1893j2701L1095r209m2888J0197
8342C9957o2933k8888K293O5118M0959p259N6101M4946J9323l4195o9473l7748
8330B8201L4280J6858m577J5232o0494m9628L7881J2970L414L170l138K138K0546
8317E6853l0868k0105J8445N1460j1081n3970n8925R137Q753N3334M7385K5596
8305I6014m160k4676q2163J0074N6016k6281J1516n1336J2816L1604o8J7602l7481
8292I477l6288N3621R728P034l8469J6009K1057j9327o861O337R614Q637J035
8279D1604N179l626p449R30k9367R342M0750j3401n6257J9766O1205k9198J1052
8266E0530j1409o0486J5263N8724j5877k7907l5106M6585L9769l6847j0584O0673
$$ plain form
8354 63820 127018 190423 146335 104418 126309 135356 63463 50762 81857 72648 29760 39957
8342 39957 -22976 -51864 -49571 15547 56506 49247 105348 150294 169617 135422 65949 28201
8330 28201 62481 79339 74762 89994 29500 -20128 17753 30723 34137 37307 34169 36307 56853
8317 56853 25985 5880 24325 75785 64704 10734 -48191 -39054 -30301 23033 70418 96014
8305 96014 91854 67178 -14985 -4911 51105 24824 36340 -14996 -2180 29424 29356 46958 9477
8292 9477 -26811 26810 36538 43572 5103 21112 42169 22842 15981 22318 31932 40569 41604
8279 41604 46783 43157 35708 36638 7271 16613 57363 43962 -12295 7471 68676 39478 50530
8266 50530 39121 -21365 -6102 52622 36745 8838 -26268 20317 60086 23239 12655 73328
8254G3328k042n2878l268L0872J3913L9487L016k5565n428J4869M1890K7297p2115
8241H3376n6966l939p392r340k2074J1138J5673K7804l564k2179J0497l404j8164
8228A466j2237K7888R930K3814K5080K2212m1266N3144p063o6662n6194Q888J3650
8215B650j0754J6220M8774J8127k9791J1843m3620n053M9549Q012K709j7822k5936
8202B4908K1454J9090j829J7354o282k156J4962N2232M484k1206J1719r541M7452
8189A72641N7801N781k0036q300o9404m2739m7413j3592m6363k1602L0904M0908
8177C8586N215K6444L4440O559n750j5070J8893k8374p6639L746O691l2206J47
8164a7318l9424m9035N0786J17059L3220R634j5439k9130O6069n3853k909l022
$$ plain form
8254 73328 71286 18408 15140 46012 59925 99412 102428 76863 71435 86304 128194 155491 83376
8241 83376 26410 22471 15079 5739 -16335 -5197 10476 38280 34716 12537 23034 19630 1466
8228 1466 -10771 17117 27047 50861 75941 98153 56887 110031 102968 36306 -19888 -11000 2650
8215 2650 -8104 8116 56890 75017 45226 57069 13449 8396 57945 65957 68666 50844 24908
8202 24908 46362 65452 63623 80977 74695 72539 87501 139733 144217 123011 134730 125189 172641
8189 172641 230442 236223 216187 207887 138483 95744 48331 34739 -11624 -33226 -2322 38586
8177 38586 43801 70245 104685 111244 105494 90424 109317 80943 4304 8050 14741 -17465 -17318
8164 -17318 -56742 -105777 -54991 62068 95288 104922 89483 60353 126422 72569 69660 66638
8152F6638M6888l8771m0895Q6352J26156K8627m1740p948l6188p2271m6877L4481
8140A04452r371j4920o4556j5546j7561j2380j0935j4513O4840N2607r655k4932
8128B7530k4150m9323j1647N3818L3258K7153L9133j0157J047J6338P455m9786
8116F0669l3784l1371L1749L5344o1567m4781M6700M0128j6016M790o31Q859k5383
8103A4706Q784J8381O182R014N9320J9165K842K527o096j3356l3944M0288j0588
8090A17225l3197l5581n4551j9404o510M5952R2480K5747K1229M8278o438q0246
8078A14984n9876j5168J3037J08989N105o1482j6678J5442M2205Q198k2140R99
8066A33615j3602k3357j8882j1115O0331N5770K8787k7433l1503P831K2236j1867
$$ plain form
8152 66638 113526 74755 33860 120212 246368 274995 233255 225307 189119 116848 69971 104452
8140 104452 95081 80161 15605 59 -17502 -29882 -40817 -55330 9510 62117 52462 27530
8128 27530 3380 -45943 -57590 -3772 29486 56639 95772 85615 86662 103000 110455 60669
8116 60669 26885 -4486 27263 62607 1040 -43741 2959 43087 27071 31861 31230 40089 14706
8103 14706 23490 41871 48053 57067 116387 135552 138394 140921 134825 121469 87525 127813 117225
8090 117225 84028 48447 -6104 -25508 -32018 13934 106414 132161 153390 201668 195230 114984
8078 114984 55108 39940 52977 161966 167071 105589 88911 104353 146558 154756 132616 133615
8066 133615 120013 96656 77774 66659 126990 182760 211547 184114 152611 160442 182678 170811
8054A70811k7724o2572M8440P017J909l6265q90j5658M2467L3484Q598j4003K978
8041A58592m1035j8126Q0046N431n4232j4313L2563j559n4292q461J2927O324
8029A03865N9630L4458o9658j2810K2825K075j8398j8365N0822Q727k3595j988
8017A37588N5704l64l2560m3362M3028L8167K7046M5850R086j3707o5183J1062
8005B12355M0638L334J3962K3405j1560L1218J4894L4371K7585l6275k219j8652
7993C33056o4970n0291m019J1482k2768j8174K1659K755k2625K8340k4933k5864
7981A63648O1416K4257k0233j6118k2868p0383L4351L9439J6961j7319k5605J4493
7969A82039J1743N2049N795q325j5768k6701J6366K1914P4863k0584l3356K1283
$$ plain form
8054 170811 143087 80515 128955 135972 137881 101616 100726 85068 127535 161019 169617 155614 158592
8041 158592 117557 99431 179477 184908 130676 116363 148926 147367 93075 84614 97541 103865
8029 103865 163495 197953 128295 115485 138310 140385 121987 103622 154444 163171 139576 137588
8017 137588 193292 192928 160368 117006 160034 198201 225247 271097 280183 266476 201293 212355
8005 212355 252993 256327 270289 293694 282134 313352 328246 362617 390202 353927 351708 333056
7993 333056 268086 217795 213776 225258 202490 184316 205975 208730 186105 214445 189512 163648
7981 163648 225064 249321 229088 212970 190102 119719 154070 193509 210470 193151 167546 182039
7969 182039 193782 245831 251626 243301 227533 200832 217198 239112 313975 293391 260035 281318
7957B81318J4207K9026k3001o6688j31K2245M6727M3682N9794J0593k3581J0990
7945D05181k6923q9010l8907r078p1514n5026K1407O6934Q205M4540Q688q3026
7933A81471k3298n4667k2078O8605J0756m139k222m0651J5971j4933J1160L3223
7921A59198k861M0812m5849m0145J9496j4474j7012K5125M2663J7962j295m6733
7909A36887L5885K730k1181j5183l7720k4659K4271J02382j4037R940P280r4568
7897A12027l5180M7855p1546n8249M4362N0257J1179L0720m261l7696l787N3681
7885A39362n0519o3973k2560n2750O0030L4262R082M5492M6161J0551j5026J2619
7873A52731m2123N107O608j4253J8489o1512k1923L4078J3706q807R810k9716
$$ plain form
7957 281318 295525 324551 301550 234862 234731 256976 303703 347385 407179 417772 394191 405181
7945 405181 378258 289248 250341 241263 169749 114723 136130 203064 211269 255809 264497 181471
7933 181471 158173 103506 81428 150033 160789 156650 154428 113777 129748 114815 125975 159198
7921 159198 156337 197149 151300 111155 130651 116177 99165 124290 166953 184915 183620 136887
7909 136887 172772 175502 154321 139138 101418 76759 101030 203412 189375 199315 206595 112027
7897 112027 76847 124702 53156 -5093 39269 89526 100705 131425 127164 89468 85681 139362
7885 139362 88843 24870 2310 -50440 9590 43852 52934 98426 144587 155138 140112 152731
7873 152731 110608 115715 122323 108070 126559 65047 43124 77202 90908 82101 91911 62195
7861F2195o8176J946j1660q759k590n9711q805N7057R0021J0922k7132o2811j6623
7848d4126Q9398L5880L7299k865m2142K1559j6246k9189p2l9979R870M3196J1732
7835G4315l213r0619o910k4191K9830J2570N696J8929O2361m8261o1332P626J1771
7822a1428P141m7245R980J4398P1478m0029l9442k2567j0477Q3247J8617r426
7810B4247N442J3727m1327k6687n0168P09J2913N4676Q5185L5360K8340o764j03243
7797C2410p6343O620R352L3984N4485M0698k7451L7627O730Q257l6310m3672m6705
7784c18j496n763J5066k2979p5477K7650M2848J5523M0617j4537N309p5792J2392
7771c6957J4616M2109k6195k5914j0065K6104J2960L1552j145l4995j6904N0494
$$ plain form
7861 62195 -5981 -4035 -15695 -24454 -27044 -86755 -95560 -38503 51518 62440 35308 -27503 -44126
7848 -44126 45272 81152 118451 115586 73444 95003 78757 49568 49496 9517 19387 62583 74315
7835 74315 71102 -19517 -26427 -50618 -20788 -8218 -2522 16407 78768 30507 -30825 -23199 -11428
7822 -11428 -4287 -51532 -41552 -27154 44324 4295 -35147 -57714 -68191 15056 33673 24247
7810 24247 29689 43416 2089 -24598 -74766 -74057 -61144 -6468 78717 114077 142417 135653 32410
7797 32410 -43933 -37313 -27961 6023 60508 101206 73755 111382 118112 126369 90059 46387 -318
7784 -318 -1814 -7577 7489 -15490 -90967 -63317 -20469 -4946 35671 21134 26443 -49349 -36957
7771 -36957 -22341 19768 -6427 -32341 -42406 -16302 -3342 28210 27065 -7930 -24834 25660
7759B5660l355o1602M0213O1375J5079n706r4983m6656p680K106J7647J5165O4782
7746B2045N1795O6614m2803r9169p9892p793j6635J00413L2936M3921K1758J0495
7734A03685j0265n7504K1074N4392j6613K5523l8914R637j8970P704K7360m8436
7722E8673J35r0808o6448P8749M2895j8859L2723J1012L2723O048j8789M0815
7710A08869L6874k7850k6955p388k1618k7677J8467M158k62J8203j8422l1221
7698B5178K8051m7895k5621j2441M4614M0819l111l5725K4408n3722m3942J5114
7686d4273N6764J8754m3658j7580N906L6233J6170n40l4592j01684m9829O4315
7674i4014R3045n8435p1004N8462K1212O4865M1549j0995j05551l453N791L0430
$$ plain form
7759 25660 22305 -39297 916 62291 77370 71664 -23319 -69975 -77655 -75549 -57902 -42737 22045
7746 22045 73840 140454 97651 -1518 -81410 -89203 -105838 -5425 27511 71432 93190 103685
7734 103685 93420 35916 56990 111382 94769 120292 81378 91015 72045 79749 107109 58673
7722 58673 58808 -32000 -98448 -19699 23196 4337 37060 48072 80795 86843 68054 108869
7710 108869 145743 117893 90938 83550 61932 34255 52722 56880 56618 74821 56399 25178
7698 25178 53229 5334 -20287 -32728 11886 52705 49594 13869 38277 -15445 -59387 -44273
7686 -44273 12491 31245 -12413 -29993 -24087 12146 28316 27776 -6816 -108500 -158329 -94014
7674 -94014 -969 -59404 -130408 -71946 -50734 14131 55680 44685 -60866 -64319 -58528 -28098
7662b8098M1773J558l196l1171k5651N0648L3044K1403r251o6268k2402N7497
7650A9886J6208k4971m075J5045q386M3942N3025J0072l1055l6047n2597k9448
7638b8401L1994J6665m6909l2065m8605j6315J9456L1368J2645J3291M671q905
7626e1110J2938L3494j5830N5610N5827q1090N4875m0074o0599J4219m879l4240
7614f0859o387j2607k128O6558J1097R694l2463N9344K5238r0861P910K4938J6798
7601A6272O174m5555j8634m0735m70J9331O8430k1484k1052N8751m1536J5960
7589d548L9269M6670k2621m6870m4665N5735Q6753n486l3431n476j4955K0265
7577G0640m2518n5989n3477K5415M3323l0735o5434m912L5688L7627J0427m077
$$ plain form
7662 -28098 13675 15233 12037 -19134 -44785 5863 38907 60310 51059 -15209 -37611 19886
7650 19886 36094 11123 7048 22093 13707 57649 110674 120746 89691 53644 1047 -28401
7638 -28401 3593 20258 -26651 -58716 -107321 -123636 -104180 -72812 -60167 -46876 -42205 -51110
7626 -51110 -38172 -4678 -20508 35102 90929 9839 64714 24640 -35959 -21740 -26619 -60859
7614 -60859 -67246 -79853 -81981 -15423 -4326 5368 -27095 32249 57487 -33374 -25464 -526 16272
7601 16272 22446 -23109 -41743 -82478 -82948 -63617 4813 -16671 -37723 21028 -20508 -4548
7589 -4548 34721 81391 58770 11900 -32765 22970 109723 104237 70806 65330 50375 70640
7577 70640 28122 -27867 -81344 -55929 -12606 -43341 -108775 -113687 -77999 -40372 -29945 -34022
7565c4022K0636K0034k9794J4841M3571M7626l1418o8813l2897o395K022J7210
7553c7399j6645J2879K0189k2240o3006N7656O3428O4570K5895n4333l2927O6923
7541H4990J3607k2080n6847o8595q524K1392j1757k6405n062L3733J8558k7283
7529e4273L0731M6669l6908j2539m1124P127J6408M465L4558m616J3094N398l1318
7516b2328k832J8560K098N6359m5268m9782j792k5252O136J1032k3992j761n0373
7503a29195J3111M3273O6275Q006p9829Q834J6607K9922l751n6332l1955m9725
7491a64759o2732Q430K1563M0632J11177M1657l82k9067q186l1255j9816J9129
7479g3609r742R625J2623M1182j7678M1493j6539o180L4777K7213k6231K447j7891
$$ plain form
7565 -34022 -13386 6648 -23146 -8305 35266 82892 51474 -17339 -50236 -56631 -54609 -37399
7553 -37399 -54044 -41165 -20976 -43216 -106222 -48566 14862 79432 105327 50994 18067 84990
7541 84990 98597 76517 19670 -48925 -57449 -36057 -47814 -74219 -79281 -45548 -26990 -54273
7529 -54273 -23542 23127 -13781 -26320 -67444 -60317 -43909 -39444 -4886 -9502 3592 8990 -22328
7516 -22328 -25160 -6600 -4502 51857 6589 -43193 -44985 -70237 -64101 -53069 -77061 -78822 -129195
7503 -129195 -116084 -72811 -6536 1470 -78359 -69525 -52918 -22996 -26747 -83079 -115034 -164759
7491 -164759 -227491 -219061 -197498 -156866 -45689 -4032 -4414 -33481 -41667 -72922 -92738 -73609
7479 -73609 -83351 -73726 -61103 -19921 -37599 3894 -12645 -18825 15952 43165 16934 19381 1490
7466A490o7569l7615m1764N7491O2167k3330j1355J3160J1868k2804j6389r920
7454h4570l8172n0175q005p179K0014M9389M8689K6465j9589n0442Q269K9761
7442g5545j5659k3511N0196Q094P670K7407l6818p4771M0479J0771j1969M6390
7430d7266N1205J0810l2905n0840l4286N3541J0048N3524K1622J754n6143k348
7418b1284K7615l2881L4208K8351J0599K7931m8910n2892Q960j43k2216k48l6821
7405g7731N526K1882m6690L8850L0384o2879j0228L5997N2175L1487L1032k2408
7393B7397o7159l1582m0785J530O086L4931M2289K7409K4580J4279n0402M2854
7381C1427L8624j432k142n8073m1684M0736L0482J8195K76j5985j7139k4335p077
$$ plain form
7466 1490 -66079 -103694 -145458 -87967 -25800 -49130 -60485 -47325 -35457 -58261 -74650 -84570
7454 -84570 -122742 -172917 -180922 -188101 -168087 -118698 -70009 -43544 -63133 -113575 -105306 -75545
7442 -75545 -91204 -114715 -64519 -56425 -48755 -21348 -58166 -132937 -92458 -81687 -93656 -47266
7430 -47266 3939 14749 -18156 -68996 -103282 -49741 -39693 13831 35453 37207 -18936 -21284
7418 -21284 6331 -26550 7658 36009 46608 74539 25629 -27263 -18303 -18446 -40662 -40910 -77731
7405 -77731 -72205 -50323 -97013 -58163 -27779 -90658 -100886 -64889 -12714 18773 49805 27397
7393 27397 -39762 -71344 -112129 -110599 -104513 -69582 -27293 116 24696 38975 -11427 31427
7381 31427 70051 68619 66477 8404 -33280 7456 37938 56133 56409 40424 23285 -1050 -8127
7368h127N0561l7879l9773J8592L5680j4405j2878l3297M4386J8036j4042o5875
7356e9021j2665J5122M447n2391N1190L7077J4434Q881J4868m9553p025o822K5787
7343a5671q84p575k0362k5864J2097L6727K4051l2696o1614p30L2264k0790j1648
7330i2695P4690L4301J8029j2868r651J5217K841J0859j0125M0569k6220P559
7318E2506r825k1344k7026L806K4379P079n8196L6546L2460O2820l0654m7876
7306B4675q0407K0625K4528j8036k9208j3126K7603m8194l277N6950P270k923
7294c3520M4194K7581k7288n231m2744K2212J3150p1524l4986r245J5902L8686
7282f2813M3679q1625o8126K6923Q613N1504N4968K5601m8936k8363O198m84k2562
$$ plain form
7368 -8127 42434 4555 -35218 -16626 19054 4649 -8229 -41526 2860 20896 6854 -59021
7356 -59021 -71686 -56564 -52117 -104508 -53318 -16241 -1807 7074 21942 -27611 -34636 -41458 -15671
7343 -15671 -16555 -24130 -44492 -70356 -58259 -21532 2519 -30177 -91791 -92521 -60257 -81047 -92695
7330 -92695 -18005 16296 34325 21457 11806 27023 29864 40723 30598 71167 44947 52506
7318 52506 42681 21337 -5689 -1883 22496 29575 -28621 7925 40385 103205 72551 24675
7306 24675 -55732 -35107 -10579 -28615 -57823 -70949 -43346 -91540 -94817 -37867 -30597 -33520
7294 -33520 10674 38255 10967 5736 -37008 -14796 -1646 -73170 -108156 -117401 -101499 -62813
7282 -62813 -19134 -100759 -168885 -141962 -133349 -81845 -26877 -1276 -50212 -78575 -72377 -72861 -95423
7269i5423l0023m6661k3063r512M9302R7818N6034o679o507L5744p471m1237M6223
7256A8545K9699L4303k1987m4999l2131k3541l4681j4835M4745k3834j1993O6654
7244a4055J5928l8980J7456R0273K4124n866n727l4284m8021j7975m7914J6519
7232d8522K2746J6176K4573o2752k7209K6340k9058K214K3195j6641L9191L625
7220b6122m6738K3294M1310o1504k0419K5603L7556J1449q350L6127k3012L7557
7208B6751J8326n6536n4403p2122m9684N3657L4484m135L9179q434n748K9494
7196d9171J2471M1302m8460k1316N7026L6704k3466J5093l4011j9343m014l5116
7184g2301r706J4126K465L6270J8060K0304K8712l4205k8184N5106L0850m3952
$$ plain form
7269 -95423 -125446 -172107 -195170 -204682 -155380 -57562 -1528 -8207 -14714 21030 13559 -27678 18545
7256 18545 48244 82547 60560 15561 -16570 -40111 -74792 -89627 -44882 -68716 -80709 -14055
7244 -14055 1873 -37107 -19651 70622 94746 88880 83153 48869 848 -17127 -65041 -48522
7232 -48522 -25776 -9600 14973 -47779 -74988 -48648 -77706 -75492 -52297 -68938 -29747 -26122
7220 -26122 -72860 -49566 -8256 -69760 -90179 -64576 -27020 -15571 -23921 12206 -10806 26751
7208 26751 45077 -11459 -65862 -137984 -187668 -134011 -99527 -103662 -64483 -72917 -78665 -49171
7196 -49171 -36700 4602 -43858 -65174 -8148 28556 5090 20183 -13828 -33171 -37185 -72301
7184 -72301 -82007 -67881 -65416 -29146 -11086 9218 37930 3725 -24459 30647 61497 17545
7172A7545K3208J8842m9424k442p273j7306j0698J5863P436J6584j8736Q400l5142
7159c3143L4210j6126J3454K4064j1404J1420j764k2393m8913k7947L663P56L9248
7146c4875k2993M378N5460M5930k1145m4374l0299J4751K6558L4794L56l3804
7134e263m6378K7602P2989M3k7176O284m4062l2137k0868J0811L0784M7727n0322
7121b9966p016M3381M46J2968l1686n3917m199l229J5955K1722j0619J2516J8514
7108a5130O391L6710L372n611m0910R095P5541O4820j2007k3258q6031l6312M0345
7095A7015j928j517O6261k552k6586m5900K6871J3757l3200l4613L2313l615K1057
7082B7363q078J1241K5208o2525l2065J996J8185K2520j9064j6470j0567k4544
$$ plain form
7172 17545 40753 59595 10171 7729 456 -16850 -27548 -11685 -4249 12335 -6401 1999 -33143
7159 -33143 1067 -15059 -1605 22459 11055 22475 20711 -1682 -50595 -78542 -74879 -74123 -34875
7146 -34875 -57868 -53490 1970 47900 26755 -17619 -47918 -33167 -6609 28185 28541 -5263
7134 -5263 -51641 -24039 48950 48993 21817 28101 -15961 -48098 -68966 -58155 -27371 20356 -29966
7121 -29966 -36982 6399 6845 19813 -11873 -65790 -69989 -73218 -57263 -35541 -46160 -33644 -15130
7108 -15130 -8739 27971 31343 25732 -15178 -6083 69458 134278 122271 99013 12982 -23330 17015
7095 17015 15087 13570 79831 77279 50693 4793 31664 45421 12221 -22392 9921 6306 27363
7082 27363 19285 30526 55734 -6791 -38856 -36860 -18675 3845 -15219 -31689 -42256 -66800
7070f6800M454N2232J04356J9082n6889m5712o1799M232L6898J5521l1284n2785
7058g8494k436k2501P204K7536K2069j3384O7288M5343k3844o5602j919L5807
7046b933M7869J3267K1415o1127l5059q902r391k2800J6457L2657j2405k4158
7034d5110P3873J5313r061P638J9251l3053l5357k831o562q297l6113k1641O4173
7021a7777r993l0557K8944P3579k4707R091j6109L7628k2702j2466l3683R363
7009i389j2518m677N4413O4329k9916p6325J5656R379L784j2591n5629l2206P0261
6996a5429J9637k7506o4031m0546J7120L9468j0655K0231K1639m74L3917q240
6984a4869j1313l2390l2267j3893N8486L7382L1215M775Q314k6003l5974j3285
$$ plain form
7070 -66800 -62346 -10114 94242 113324 56435 10723 -51076 -46844 -9946 5575 -25709 -78494
7058 -78494 -80930 -103431 -96227 -68691 -46622 -60006 7282 52625 28781 -36821 -38740 -2933
7046 -2933 44936 58203 79618 18491 -16568 -25470 -34861 -57661 -41204 -8547 -20952 -45110
7034 -45110 28763 44076 35015 42653 61904 28851 -6506 -9337 -15899 -24196 -60309 -81950 -17777
7021 -17777 -27770 -58327 -29383 44196 19489 28580 12471 50099 27397 14931 -18752 -9389
7009 -9389 -21907 -26584 27829 92158 62242 -14083 1573 10952 14736 2145 -53484 -85690 -15429
6996 -15429 4208 -23298 -87329 -127875 -110755 -71287 -81942 -61711 -40072 -40546 -6629 -14869
6984 -14869 -26182 -58572 -90839 -104732 -46246 -8864 22351 27126 35440 9437 -26537 -39822
6972c9822K4429M9609K2241j4554j2407j8555j6762J9885m077l7829j4057k8891
6960g0790j7149n4517j45R5001Q3931Q2413q086j4167l1681n3427l8061m7696
6948g4374J1744K1591j4794K101K2677n8833l0424K3805L5383Q3643M8650k8581
6936D2588l2078j7158k9062J3916J1977l2555n6517K2052O4107N1503M6641J6539
6924A01953q4065k1628N651m9111r248N7792L382n5891m9822j2266J2673K4227
6912g6353R613J4377m7047J317N2271n3150o2576l523L3827N7381m319R234P906
6899f1042J6545j4687J7247J2204K394O0847N9330n793n777L642l3172J3050L4639
6886I9427N4573j8218q0686k9713J0941j3334l0613m4950o4517l1541M3769K4103
$$ plain form
6972 -39822 -15393 34216 56457 41903 29496 10941 -5821 14064 9987 -27842 -41899 -70790
6960 -70790 -87939 -142456 -142601 -47600 36331 118744 110658 96491 64810 11383 -26678 -74374
6948 -74374 -62630 -41039 -55833 -53732 -31055 -89888 -120312 -96507 -61124 22519 71169 42588
6936 42588 10510 -6648 -35710 -21794 -9817 -42372 -98889 -76837 -12730 38773 85414 101953
6924 101953 17888 -3740 1911 -47200 -56448 1344 4726 -51165 -100987 -113253 -100580 -76353
6912 -76353 -66740 -52363 -99410 -98093 -45822 -98972 -161548 -165071 -131244 -73863 -78182 -68948 -61042
6899 -61042 -44497 -59184 -41937 -29733 -27339 33508 92838 87045 81268 84910 51738 64788 99427
6886 99427 154000 135782 55096 25383 36324 22990 -7623 -52573 -117090 -148631 -104862 -80759
6874h0759L8082k424K4333m372J1245M6060l7440o7642k665j4795M0238J1776
6862c8363k1152J1024j416j0515K4134L3853J548J4207K0232j6858n3620K6641
6850a0285m375R310L0814j8152Q311K6248l0448L9578j8840l4948N4836k16n7089
6837e256J0501K1881n4210M82l3861M4186l8737j2869l3212L6526M3828K6029
6825E288N240p2315n1560n346M6589N1446N7103k5415o3993N764L3292K0050J747
6812G890j2018J4646J5133P934J5482m549o9419j1719J868m8539k4605O3193J1258
6799c3445m6572k835o810J8067M3379M8928n1164Q260Q444p9866n5023K4271m259
6786a28625M644N1964j9489K7091M5088P666k1031n1766l7580J9076l2416m1072
$$ plain form
6874 -80759 -42677 -45101 -20768 -25140 -13895 32165 -5275 -72917 -75582 -90377 -50139 -38363
6862 -38363 -59515 -48491 -49907 -60422 -36288 -2435 -887 13320 33552 16694 -36926 -10285
6850 -10285 -14660 -5350 25464 7312 15623 41871 11423 51001 32161 -2787 52049 51833 -5256
6837 -5256 5245 27126 -27084 -26602 -60463 -16277 -55014 -67883 -101095 -64569 -20741 5288
6825 5288 10528 -61787 -113347 -118693 -72104 -20658 36445 11030 -52963 -47199 -13907 6143 7890
6812 7890 -4128 10518 25651 33585 49067 44518 -24901 -36620 -34752 -83291 -107896 -44703 -33445
6799 -33445 -80017 -82852 -89662 -71595 -28216 20712 -30452 -22192 -13748 -93614 -148637 -124366 -128625
6786 -128625 -123981 -72017 -91506 -64415 -19327 -11661 -32692 -84458 -122038 -102962 -135378 -176450
6774a76450m0952M8775J35019O6757o5565L174M490L4085J175m7201j3844J2329
6762c8208j9550P8342Q0206j6867l6589k7378K4144Q641l1906l0521l6748K5052
6750b1382K8677k7554j5503M1821J4258j6538k8019m4556k052K6801K8601o1727
6738g7173m0213K4936P2982J6195r144k667j0386l1130M207J554j3596k6973N803
6725h5605N2479J5820M9240l641L4276k343L5509j9620k2447p674j3868m4735
6713a2609l6928M2733M6705J2757L621o6974l336o149l1650l5825K4668J2556
6701e0431k3982P7426L4378k1220K6340K2801l6600j1576q209k8562j760l2703
6689e4098k7044j1061J7312K3750M802L0486M5696m0719o2496l5834k9092Q2323
$$ plain form
6774 -176450 -217402 -168627 -33608 33149 -32416 -29242 -24752 9333 10508 -36693 -50537 -38208
6762 -38208 -57758 20584 100790 83923 47334 19956 44100 52741 20835 -9686 -46434 -21382
6750 -21382 7295 -20259 -35762 6059 20317 3779 -24240 -68796 -70848 -44047 -15446 -77173
6738 -77173 -117386 -92450 -19468 -3273 -12417 -15084 -25470 -56600 -52393 -50839 -64435 -91408 -85605
6725 -85605 -33126 -17306 31934 28293 62569 60226 95735 76115 53668 45994 32126 -12609
6713 -12609 -49537 -6804 39901 52658 56279 -10695 -14031 -20180 -51830 -87655 -62987 -50431
6701 -50431 -74413 3013 37391 16171 42511 65312 28712 17136 8927 -19635 -21395 -54098
6689 -54098 -81142 -92203 -74891 -51141 -46339 -15853 29843 -10876 -73372 -109206 -138298 -55975
6677e5975N4602l6696o9242L8703N5453n0312k6807M9976M8129o460j261k0083
6665a9973m6754k0870Q128K7962J1751M3230k9841l7651K8558k5126m466L3405
6653c1647N5370n6254J221O347J1621k6557k3015N0755M8339j8126m2431k5318
6641d9695l7501N9168n690l2780L1753M0249k3737n8853m8366K9792P337k0130
6629a08453k5412O6947J0193j1438n4864p848k8702Q6681O5513K469n634J5518
6617D970L6660K7330M194K6844N972m3011o9153l3441m7929n70m7480K8350R899
6604i7365P772k8590P537Q7225N1266Q795q462m2310n5361o326J8604J500m9170
6591a04885L6879M6760K8434J685o8294L1164N0988L3098J1207n4568n8639M3721
$$ plain form
6677 -55975 -1373 -38069 -107311 -68608 -13155 -63467 -90274 -40298 7831 1371 110 -19973
6665 -19973 -66727 -87597 -79469 -51507 -39756 3474 -26367 -64018 -35460 -60586 -65052 -31647
6653 -31647 23723 -32531 -31310 -24963 -13342 -39899 -62914 -12159 36180 18054 -24377 -49695
6641 -49695 -87196 -28028 -33718 -66498 -34745 5504 -18233 -77086 -125452 -95660 -88323 -108453
6629 -108453 -133865 -66918 -56725 -68163 -123027 -130875 -159577 -72896 -7383 -4914 -10548 4970
6617 4970 41630 68960 73154 99998 105970 62959 -6194 -39635 -87564 -88134 -135614 -107264 -97365
6604 -97365 -89593 -118183 -110646 -23421 27845 36640 28178 -14132 -69493 -75819 -57215 -55715 -104885
6591 -104885 -68006 -21246 7188 8873 -59421 -28257 22731 55829 67036 12468 -46171 -2450
6579b450O5966L8309p3260j7492K1728N7008m653k7326j1115n7502l3733l1179
6567g5699n316K5630M5367P2114L4762J9322l5469m191L5054j6069k9136L2307
6555I8676P0458j8844q9675p0706J7710N2233K9239o6080l0249k6573J0130N5316
6543C1635L1956l0306m0914p584n407J7219K2519J4811n5270m6283L3499K4098
6531a0027j9502K9500M7387l5096o4473P810L8316K1919n637k6795M636P3623
6519F1661M8606j1488l316q299k9270j0576m6916j5750L3772m9960j5058j8708
6507f5302m621J6859r227L8265O3409P319k9197M562K3557j2051O175J618M1916
6494H3282M0561m498l2339Q746l3164m810p434n1196l1809k1832K7352k6158o320
$$ plain form
6579 -2450 63516 101825 28565 11073 32801 89809 85156 57830 46715 -10787 -44520 -75699
6567 -75699 -81015 -55385 -10018 62096 96858 116180 80711 76520 111574 95505 66369 98676
6555 98676 169134 150290 60615 -10091 7619 59852 89091 23011 -7238 -33811 -23681 31635
6543 31635 63591 33285 -7629 -15213 -20620 -3401 19118 33929 -21341 -67624 -34125 -10027
6531 -10027 -29529 -29 47358 12262 -52211 -44401 -6085 15834 10197 -16598 -11962 61661
6519 61661 110267 98779 95463 87164 57894 47318 402 -15348 18424 -31536 -46594 -65302
6507 -65302 -69923 -53064 -62291 -24026 39383 46702 17505 22067 45624 33573 39748 41366 83282
6494 83282 123843 119345 87006 95752 62588 57778 50344 -852 -32661 -54493 -27141 -53299 -59619
6481e9619j0611q028J5692J5279K3312j7689P991j8914J6203L4354J8563l4378
6469a7845j2342J1370N026o6242K4419M1936j042n266m215K1377j5508M5150J9061
6456D5879l249m4482M6585N6746M459l9907j2909K027k140M2879l8188k8983L87
6443B9104L1701K193r370L0170m300m2107M418j2946P8014K9680k0588q8834q6589
6430e9454m281K8921N4959L7438j0998p325m0657j4987m711k3015n9955L5958
6418f8107P7520M4936n005n4567J2762O061O067l739n313N1228K5522l2145K0605
6405G5825k9664o3877P6620K9685o4679J6196L8983n1079k884P886o2356k6785
6393e6129j3417l6261l6348o896K7686M1084L1995J0856L51n344o534m0179K4048
$$ plain form
6481 -59619 -70230 -78258 -62566 -47287 -23975 -41664 -33673 -52587 -36384 -2030 16533 -17845
6469 -17845 -30187 -18817 -13791 -80033 -55614 -13678 -14720 -19986 -24201 -2824 -18332 26818 45879
6456 45879 42630 -1852 44733 101479 105938 66031 53122 55149 53009 95888 57700 28717 29104
6443 29104 60805 62998 53628 83798 79498 37391 41809 28863 106877 136557 115969 27135 -59454
6430 -59454 -63735 -34814 20145 57583 46585 39260 -1397 -16384 -21095 -44110 -104065 -68107
6418 -68107 9413 54349 49344 -5223 7539 13600 19667 15928 10615 61843 87365 55220 75825
6405 75825 46161 -17716 58904 88589 23910 40106 79089 28010 25126 33012 -29344 -56129
6393 -56129 -69546 -105807 -142155 -149051 -121365 -80281 -48286 -37430 -37079 -42423 -48957 -89136 -65088
6380f5088p476J4551k5254J4494K4118M4996j159m9396J6067Q905m4079l090M5336
6367b7075O382k952N592n80l1331l6046j9797L4639M7784p806k0564k9293J9645
6354f1402K4730P560R131m0841j4653m169j5737N5941K4769q715M6797K6575L573
6341E3559n523m4910k5387k871M079m6334J5976l329M1072J4208k4132J3108k3055
6328c3539j1986R334m7723o731L3681P6105O881n4288L9859j7005o3454Q048J0766
6315e0052J1734O0201m2419p6071M5217L8974j3659L1029K6471o9385p1590N0914
6303e8636M4904m262n333o2692J514M7992k1222j1068L6358Q0914l9082j6639
6291g252L2506M0983j4394p001m6854q6813m8478L1758L39l2607M9942l992L4761
$$ plain form
6380 -65088 -72564 -58013 -83267 -68773 -44655 341 -818 -50214 -34147 -25242 -69321 -72411 -27075
6367 -27075 -20693 -23645 -18053 -18633 -49964 -86010 -105807 -71168 -23384 -31190 -51754 -81047 -61402
6354 -61402 -36672 -29112 -19981 -60822 -75475 -79644 -95381 -39440 -14671 -23386 23411 49986 53559
6341 53559 48036 3126 -22261 -25132 -21053 -67387 -51411 -54740 -13668 540 -23592 -10484 -33539
6328 -33539 -45525 -36191 -83914 -90645 -56964 19141 26022 -28266 11593 -5412 -68866 -60818 -50052
6315 -50052 -38318 21883 -20536 -96607 -51390 -12416 -26075 4954 31425 -37960 -109550 -58636
6303 -58636 -13732 -17994 -23327 -86019 -84505 -36513 -57735 -68803 -32445 48469 9387 -7252
6291 -7252 25254 66237 51843 44842 -2012 -88825 -137303 -105545 -105206 -137813 -87871 -91863 -57102
6278e7102K9906K2312n1854k7343o4491J0111N9011k6396j0654K4362J3655J9493
6266e8990L1548M4848L0443o4623m8803L318L2335K8382j5662m2616O2648L3009
6254C5837j8466j7017k0749P022l3190l2979K8827j7097K1718m405l8908M6767
6242d2640K8537o943o132L7836J7511k8840M2420l886m2326L4308L536j6254l8427
6229b1300m020K3149j7194J2529l052n9182K4377L0140k5363M7781L0691l1192
6217G364N9129J3734p1179j8738K404n5070m2114l339J9888L621N1861P838J1339
6204a3262j6321m7216N3894k6263m279L2404K5117j079n0791j7983J1705K6596
6192b7478M575k5692N912N1410l695j2700k22L5936M920n964j5734K7023m857
$$ plain form
6278 -57102 -27196 -4884 -56738 -84081 -148572 -138461 -79450 -105846 -116500 -92138 -78483 -58990
6266 -58990 -27442 17406 47849 -16774 -65577 -62259 -29924 -1542 -17204 -59820 2828 35837
6254 35837 17371 354 -20395 -13373 -46563 -79542 -50715 -67812 -46094 -50499 -89407 -42640
6242 -42640 -14103 -21046 -27178 10658 28169 -671 41749 37863 -4463 29845 33381 17127 -21300
6229 -21300 -25320 -2171 -19365 -6836 -9888 -69070 -44693 -14553 -39916 7865 38556 7364
6217 7364 66493 80227 9048 -9690 -7286 -62356 -104470 -107809 -87921 -84300 -32439 -24601 -13262
6204 -13262 -29583 -76799 -22905 -49168 -53447 -21043 4074 2995 -47796 -65779 -54074 -27478
6192 -27478 -22903 -48595 -42683 8727 5032 -7668 -7890 28046 32966 27002 11268 38291 33434
6179C3434j1049o4189l058J9664K5852j5676k7566J5219L5783l7945K4245j069
6167f355k08j8971L0621j723j8414K5916K126j1768L3605k655m3074N401J1905
6154F406r999m2454J1926K9558K6091n766o0618L7093K7646k6807n6189K2351
6142d0762N3079m76k2008r797J9758K7253p034L3662n9511m2229M3201j0896k0315
6129c6075k1616k2938P8080N1l5498m9694n032M6691K4614n845r254k0129J3766
6116d2879O1905j9910n104O2973M6784q069l6602p6861o5016l066O2438O6800
6104D3393K8514l6139l1328l2807l721M6878N4946n564l4972p471o4893m1712
6092h4876Q5541M1180p0032K1108J3554L6863J0073M509K6029n1934J7787Q084
$$ plain form
6179 33434 22385 -41804 -44862 -25198 654 -15022 -42588 -27369 8414 -29531 -5286 -6355
6167 -6355 -6563 -25534 5087 3364 -15050 10866 12992 1224 34829 32174 -10900 -5499 6406
6154 6406 -3593 -46047 -34121 -4563 21528 15762 -44856 -7763 19883 -6924 -63113 -40762
6142 -40762 12317 11841 -10167 -19964 -206 27047 20013 53675 -5836 -48065 -4864 -15760 -36075
6129 -36075 -57691 -80629 -2549 -2498 -37996 -87690 -92722 -46031 -21417 -27262 -36516 -56645 -42879
6116 -42879 19026 -884 -5988 56985 103769 95700 59098 -17763 -82779 -85845 -23407 43393
6104 43393 71907 35768 4440 -28367 -32088 14790 69736 64172 29200 21729 -43164 -84876
6092 -84876 665 41845 -28187 -7079 6475 43338 53411 57920 83949 32015 49802 57886
6080E7886l7551k2648j2694l5456J1174M2124L3529J5923m9342J4881J4155J2031
6068D4012l5508o0333j6279k746k7742j4271O0188J2756m43K6744n176J0726k2128
6055c0200L0873O6293L5189l924o2630m2621o4592o9007M1735O4264k0912m8423
6043a03955J0309R2925O3856j4631l952J8919K8196n7093r3784l6009K6090J5586
6031e3543j9196P903K2833N761j064m8757O895N1464o925p5038p3593J3277K3806
6018a46177M9297J4855l1128j1870R0689R599j7150M5366L5671R1756q473o9721
6006E2714k9520P5678N0834n5665m9991o7534j9249n7369J3179M0493K7315K7455
5994H340N3043l3964K0092N7952k3297q4310o0254M5899M6574Q745l033j8160
$$ plain form
6080 57886 20335 -2313 -15007 -50463 -39289 2835 36364 52287 2945 17826 31981 44012
6068 44012 8504 -51829 -68108 -70854 -98596 -112867 -52679 -39923 -40366 -13622 -18798 -8072 -30200
6055 -30200 673 66966 102155 98231 35601 -7020 -71612 -140619 -98884 -34620 -55532 -103955
6043 -103955 -93646 -721 63135 48504 44552 63471 91667 34574 -59210 -95219 -69129 -53543
6031 -53543 -72739 -64836 -42003 -36242 -37306 -86063 -79168 -27704 -34629 -109667 -183260 -169983 -146177
6018 -146177 -96880 -82025 -113153 -125023 -34334 -24735 -41885 3481 39152 130908 122435 52714
6006 52714 23194 98872 149706 94041 44050 -23484 -42733 -100102 -86923 -46430 -19115 8340
5994 8340 61383 27419 47511 105463 82166 -2144 -62398 -16499 30075 38820 35787 17627
5982A7627K2428k1680m8058K1921K5899K9216p182J489l5660k4159J4202K7631
5970B3674k789L5071j0441k6547o2920N4431o733L8341r578j8590O347p898K5481
5957C7849p805q3572L1142P9968K904p721J1815n5445l7823o3180k353l8371k1403
5944a53995J4021L6151O3011l6614K2606m02k9631J0896L4664K9978K17N1776
5932D2678Q07j5894k273K4243J1223p5652k2954J3547J1788j7084n076O9627K7222
5919F2202L2621L5893k5675m1984n6149n7153m9675r925k5772k3469R2681k5118
5907i1523L7535L9497k5863J619p796n5754K3382L7021m972n7424J0743P0761
5895b2774N1071l4315l2500k0036M5525l0026k2699P2491k4027J0419m0121l0161
$$ plain form
5982 17627 40055 18375 -29683 -7762 18137 47353 40171 41660 6000 -18159 -3957 23674
5970 23674 20885 55956 45515 18968 -43952 10479 3746 42087 32509 13919 20266 12368 37849
5957 37849 30044 -53528 -22386 57582 60486 52765 64580 9135 -28688 -91868 -94221 -132592 -153995
5944 -153995 -139974 -103823 -40812 -77426 -54820 -55222 -84853 -73957 -39293 -9315 -9098 42678
5932 42678 43485 27591 25318 49561 60784 -14868 -37822 -24275 -12487 -29571 -34647 34980 62202
5919 62202 94823 130716 105041 63057 6908 -50245 -99920 -109845 -135617 -159086 -66405 -91523
5907 -91523 -53988 -14491 -40354 -38735 -46531 -102285 -78903 -41882 -46854 -104278 -93535 -22774
5895 -22774 28297 -6018 -38518 -58554 -13029 -43055 -65754 6737 -17290 -6871 -46992 -77153
5883g7153M4622K1380P465Q023J6302n7622j9010P3414O64j4448J2610j8092K7498
5870B5653J600m2300j0509j0679P839K328j0344k1741k1036P192J7685J6362R262
5857b8688M4166r837P939j4810J8088J4479m5948m5074L425J7361O255p19r468
5844d2831J0418P577k9868m7804O3648Q0885Q406m1694m1462L9324m9583M6007
5832C023L0669M850l0107k4525L5674k7614k8450j221j7895k5511o7116Q272R5361
5819d4590J58976K9035j2162k0074p7819n4958K9386K5429J3618k9021k5787j853
5807i820l5084J3435K4312L5397k758K2711L7721n1672r2060l9159J7843L7998
5795d1136O510K0408Q223J86K2452J7903n9495j6635O1132k404O23j3495n6575
$$ plain form
5883 -77153 -32531 -11151 -3686 4337 20639 -36983 -55993 17421 18085 3637 16247 -1845 25653
5870 25653 27253 -15047 -25556 -36235 -28396 -26068 -36412 -58153 -79189 -71997 -54312 -37950 -28688
5857 -28688 15478 5641 13580 -1230 16858 31337 -14611 -59685 -56260 -38899 -32644 -33363 -42831
5844 -42831 -32413 -24836 -54704 -102508 -38860 42025 50431 8737 -32725 6599 -42984 3023
5832 3023 33692 38542 8435 -16090 19584 -8030 -36480 -37701 -55596 -81107 -148223 -139951 -44590
5819 -44590 114386 143421 131259 111185 33366 -21592 7794 33223 46841 17820 -7967 -9820
5807 -9820 -44904 -31469 -7157 28240 25482 48193 85914 34242 -57818 -96977 -79134 -41136
5795 -41136 -34626 -14218 -5995 -5809 16643 34546 -24949 -41584 19548 17144 17767 4272 -52303
5782e2303J0261L4111j6104K3937M125J165l8160j8652r4865p260R8037M7605
5770h103k902M0497q777j2778o9129l1243O88j5289J08o603Q990L073P2236N4838
5756B5606k821l0797k1970O5900p756k0747n486M5512L071K521J293n511j1795
5743C7020N1744L3073k7389o1568o4883j04716n6156M2066L1418l7895M6656M5706
5731f4924j5488L1994O1325Q083K533l5940j7443L3173M6040m787P070m7231k4556
5718b0151K262P839M8285Q085j0599n4784M1587L9641K9436p073k769o0110k9292
5705g643Q484J1320L6829l166o3907k9346q49M8665o2699n5027j3542M0191J9788
5692g0902k9227M1347M5633k9804j9133J2822M1140O7483Q178l5633j3331p8118
$$ plain form
5782 -52303 -42042 -7931 -24035 -98 4027 5192 -32968 -51620 -146485 -153745 -55708 -8103
5770 -8103 -11005 29492 20715 7937 -61192 -92435 -91747 -107036 -106928 -113531 -104541 -101468 -29232 25606
5756 25606 22785 -8012 -29982 35918 28162 7415 1929 47441 50512 53033 54326 48815 37020
5743 37020 88764 121837 94448 32880 -32003 -136719 -192875 -150809 -119391 -157286 -110630 -64924
5731 -64924 -80412 -48418 12907 20990 23523 -12417 -29860 3313 49353 44566 51636 4405 -20151
5718 -20151 -17889 -10050 38235 46320 35721 -19063 22524 62165 91601 84528 81759 21649 -7643
5705 -7643 841 12161 48990 45824 -18083 -47429 -48278 387 -62312 -117339 -130881 -90690 -70902
5692 -70902 -100129 -58782 -13149 -42953 -62086 -49264 -8124 59359 67537 31904 18573 -59545
5680e9545M6832k7155j4457L9256Q4608L0635M676n0375p4187K8987j4190j2178
5668a7093j3596j03842j0182Q2671K9352Q735j1204K1074j65m9187L36J5644M6296
5655a161k1689J5383O450p4890l4381P9843J4065k4958l6518k1126L6218m3177
5643a05941Q946M7539J1500m8100q1947K5130N1857k639K1304J1232k0279k5727
5631a07125L6109K7722L6294m9218m8479j4247M0536J7083L9738J1011r849l4794
5619e5219K9258l3510J6647K5597k648k2774M2350K0281J412l4496M2822j4406
5607A5314l5837J4650L027L7280K2467q8671n4396j138O903L9212R7584L4886
5595I1281k7092l7610o3819M1477M024k2694K0605N2968N4683J6613o2202m6902
$$ plain form
5680 -59545 -12713 -39868 -54325 -15069 69539 100174 104850 54475 -19712 9275 -4915 -17093
5668 -17093 -30689 -134531 -144713 -62042 -32690 -23955 -35159 -14085 -14250 -63437 -63101 -47457 -1161
5655 -1161 -22850 -7467 -1017 -75907 -110288 -30445 -16380 -41338 -77856 -98982 -62764 -105941
5643 -105941 -96995 -49456 -37956 -86056 -168003 -142873 -91016 -93655 -72351 -61119 -81398 -107125
5631 -107125 -71016 -43294 -7000 -56218 -104697 -118944 -78408 -61325 -21587 -10576 -20425 -55219
5619 -55219 -25961 -59471 -42824 -17227 -19875 -42649 -299 19982 21394 -13102 29720 15314
5607 15314 -20523 -5873 -2846 34434 56901 -31770 -86166 -87304 -80401 -41189 56395 91281
5595 91281 64189 26579 -37240 4237 8261 -14433 6172 59140 113823 130436 68234 21332
5583B1332K051K8534k4679l2557l663n4711J2949j7641k8018l1789L5280M5670
5571d7242j570m636K8363M1034j770j9179k8261J2549q974k3034n251N1381m0670
5558d7260J495k7539j1102j1035N6653R3091N8092j8420p0724l3566J0838p011
5546f488p5008L8209P3047L0851J3984j9223J4634L3597m9562q9182q2672O6338
5534e1475R6903O152o7387n3160K9365L6649K886K5117J6013l8430r6183K9066
5522f4484J5358j9345M2200L7969K0981j8126N9J8872L318k5545j6143l532L4049
5509B5631m5250r389l6620l9291J1741J1598k7607L8241J7480m0353O0511K7131
5497f177j6060l2124N258L063L048L2670O861j05945l1906R554M2217K0766j5585
$$ plain form
5583 21332 23383 51917 27238 -5319 -8982 -63693 -50744 -68385 -96403 -128192 -92912 -47242
5571 -47242 -48812 -53448 -25085 15949 14179 -5000 -33261 -20712 -29686 -52720 -57971 -6590 -47260
5558 -47260 -45765 -73304 -84406 -95441 -38788 54303 112395 93975 23251 -10315 523 -6488
5546 -6488 -81496 -43287 29760 60611 74595 55372 70006 103603 54041 -35141 -117813 -51475
5534 -51475 45428 51580 -15807 -68967 -39602 -2953 -67 25050 41063 2633 -93550 -64484
5522 -64484 -49126 -68471 -26271 11698 32679 14553 14612 33484 36802 11257 -4886 -8418 25631
5509 25631 -19619 -29008 -65628 -104919 -93178 -81580 -109187 -70946 -53466 -93819 -33308 -6177
5497 -6177 -22237 -54361 -49103 -46040 -42992 -10322 -3461 -109406 -141312 -131758 -89541 -68775 -84360
5484h4360L8113j0956j9490J3182j2406o942P7631K6978k5600J3591M5816j0735
5472D4822o0607L7308n0692m9192J3912J7488m1599q642Q9828L2886L4458j4706
5460D5264j8784k75k1691J7775l4013m9611m1990J4452N032M8783M6246M2493
5448E3681L2811k3450j0777L7314n4826j2478K8869J0138k0523L4395k3464l6424
5436A5266m5848K1097L6821K4034l7827J3250J8866l2518j182k8833J8137K2106
5424B3369N4089R990n3456l6682k3430l2810j4947L8922J4878l0616o2105N3083
5412e9715P4990J6455K9152j801k3950J1868k2458O110J9928j8065k9177l0186
5400b6849k4166K3869J2555q242l779L2236j7743L7411q963l1639j1735o936j1364
$$ plain form
5484 -84360 -46247 -57203 -76693 -63511 -75917 -82859 -5228 21750 -3850 9741 55557 44822
5472 44822 -15785 21523 -29169 -78361 -64449 -46961 -88560 -97202 -7374 25512 59970 45264
5460 45264 26480 26205 4514 22289 -11724 -61335 -103325 -88873 -83841 -35058 11188 53681
5448 53681 86492 63042 52265 89579 34753 22275 51144 61282 40759 75154 51690 15266
5436 15266 -30582 -9485 27336 51370 13543 26793 45659 13141 11959 -16874 1263 23369
5424 23369 77458 87448 33992 -2690 -26120 -58930 -73877 -34955 -20077 -50693 -112798 -59715
5412 -59715 15275 31730 60882 59081 35131 46999 24541 30651 50579 32514 3337 -26849
5400 -26849 -51015 -27146 -14591 -22833 -26612 5624 -12119 25292 16329 -15310 -27045 -33981 -45345
5387d5345J1400J2641k6103n7237m7066J148N1324J9813p6996R993M8144R0707
5375g577L316K0301j5647p7769j9206J6374J04733O5572r701m5081j9156M1603
5363E7762k7835j8320K804J3761L9831L5496j2011j7611l688l6887k7532j62l6933
5350c1325L7080k099j8750K1370n9551k2556l4329P3957J13753P651k5115l3959
5338B6127l6306j9434P7864R514j7754k2376p2487r565M7536J9629L6539N02n882
5325C3907M8502J6117n1581l6913n19J3768P7976j0084J639Q918p523m0162l0886
5312B3159m8027k2907L5195k3354O716L3563n9011j808o246L1502K5345J0333
5300D460k3293r259j3015m703K2239j5227k3127J1200O0219K5800l332R092j7821
$$ plain form
5387 -45345 -33945 -21304 -47407 -104644 -151710 -150562 -99238 -79425 -156421 -146428 -98284 -7577
5375 -7577 -4261 16040 393 -77376 -96582 -80208 24525 90097 80396 35315 16159 57762
5363 57762 29927 11607 14411 28172 68003 103499 91488 73877 70189 33302 5770 5608 -31325
5350 -31325 5755 3656 -15094 6276 -53275 -75831 -110160 -36203 77550 85201 60086 26127
5338 26127 -10179 -29613 48251 57765 40011 17635 -54852 -64417 -16881 2748 39287 39789 33907
5325 33907 82409 98526 46945 10032 9513 23281 101257 91173 92812 101730 94207 54045 23159
5312 23159 -24868 -47775 -12580 -35934 -29218 4345 -54666 -56474 -62720 -31218 -5873 4460
5300 4460 -18833 -28092 -41107 -45810 -23571 -38798 -61925 -50725 9494 35294 31962 41054 23233
5287B3233k5052j1382m2836L036N0157K7398J8360l3661j8992J1697L9027k8306
5275A2679l1274l5570l0357O213L1817O7084J1385l5381k9207m8315m5768m274
5263a30968l8356M4632O4708J880m059k3525l438L8628J2764J2069M3523j9128
5251a270L0078N5806m5907n871k3390n6759p0137M7475N8188L0628K8402j665
5239D5578m5085m5279J279K7678k5406n850N982K8645O4720N2154p7372l1943
5227d899P714L5482l5236J4832k1439o3975k8829N3778K579p115l5116L5322k097
5214d8999J6481K0094J1701L6466l6793m3273m932J4456k3825l0482l070N2187
5202c9989O5947m1866k2284j3273m3327J2633J6534j096k5164K956M5827l807
$$ plain form
5287 23233 -1819 -13201 -56037 -53001 -2844 24554 42914 9253 -9739 1958 40985 12679
5275 12679 -18595 -54165 -84522 -78309 -46492 20592 31977 -3404 -32611 -80926 -126694 -130968
5263 -130968 -169324 -124692 -59984 -58104 -62163 -85688 -89126 -50498 -37734 -25665 17858 -1270
5251 -1270 28808 84614 38707 32836 9446 -47313 -117450 -69975 -11787 18841 47243 45578
5239 45578 493 -44786 -43507 -15829 -41235 -47085 -41103 -12458 52262 104416 27044 -4899
5227 -4899 2815 38297 3061 17893 -3546 -67521 -96350 -42572 -39993 -47108 -82224 -46902 -48999
5214 -48999 -32518 -12424 -723 35743 -1050 -44323 -49255 -34799 -58624 -89106 -92176 -39989
5202 -39989 25958 -15908 -38192 -51465 -94792 -82159 -65625 -66721 -91885 -88929 -43102 -46909
5190d6909l4720J3860m1805P682K9081j1970Q387L7217K7811j7032J5060k9874
5178d3212n2682J1429N3315K5348p3088j3908p670J6373M203J6294n2802K9241
5166h7159J7123j6942k801n405k1537L6592L8567J498M176m1526j0548j3766O683
5153i5045L0626L3830k557J4646J0757M4467m7130J64K337j2798J9152J9345l1501
5140a3707L9R38m165k5388j3692j8875L0281M2954L5363J0363K6990k172k0597
5127D8332r317L027n18k7541L294k8498j0682j4181j1976P432K8624k5294n9613
5114i6911j6030m0015J4576l555L1611L5154J5855l3146k8909m2407N0674k690
5102a15793M5391O5016p723k2146j0907Q7085K7660k3596J7176L6299m1111p9254
$$ plain form
5190 -46909 -81629 -67769 -109574 -101892 -72811 -84781 -76394 -39177 -11366 -28398 -13338 -43212
5178 -43212 -95894 -84465 -31150 -5802 -78890 -92798 -100468 -84095 -79892 -63598 -116400 -87159
5166 -87159 -70036 -86978 -89779 -95184 -116721 -80129 -41562 -40064 -35888 -77414 -87962 -101728 -95045
5153 -95045 -64419 -30589 -33146 -18500 -7743 36724 -10406 -10242 -7905 -20703 -1551 17794 -13707
5140 -13707 -13668 -12730 -16895 -42283 -55975 -74850 -44569 -1615 33748 44111 71101 68929 48332
5127 48332 39015 42042 41524 13983 17277 -11221 -21903 -36084 -48060 -40628 -12004 -37298 -96911
5114 -96911 -112941 -152956 -138380 -141935 -110324 -75170 -59315 -92461 -121370 -163777 -113103 -115793
5102 -115793 -70402 -5386 -13109 -35255 -46162 40923 68583 44987 62163 98462 57351 -21903
5090b1903p450O901k448q631m5721M5832r425K761K2451J4722j2995K9262K9462
5077D2818j4171j3070n3159m5363N1941M8681J7732N024l4856p0988K0265N9089
5065A3943k5850j7596P3630O7795l3079j05886p4443K4870L9368J7627m0304K5857
5053c4068M4479n546J2415o264p0581j4990O0203k8512l8678K0534k1571L5723
5041d6856L8390L237l0540l5520k1485q753O8986K9472k5692l9913J092j4934
5029h2516j4364K2435Q986q246J2775J7509o9414N66R5152K0335O2639N1011n1309
5016F5559n0424O0225j7242l5139m3950L5288j5933n7439L4088L9420J6612o4948
5004c3883o4327N8256L5751j7678q5823P8482O4550n0178l7992k87j7656N4924
$$ plain form
5090 -21903 -29353 -22452 -24900 -33531 -79252 -33420 -42845 -40084 -17633 -2911 -15906 13356 42818
5077 42818 28647 15577 -37582 -82945 -31004 17677 35409 40433 5577 -65411 -45146 13943
5065 13943 -11907 -29503 44127 111922 78843 -27043 -101486 -76616 -37248 -19621 -59925 -34068
5053 -34068 10411 4865 17280 11016 -59565 -74555 -14352 -42864 -81542 -61008 -82579 -46856
5041 -46856 -8466 -5229 -35769 -71289 -92774 -101527 -32541 -3069 -28761 -68674 -67582 -82516
5029 -82516 -96880 -74445 -65459 -73705 -60930 -43421 -112835 -112269 -17117 3218 65857 116868 65559
5016 65559 15135 75360 58118 22979 -20971 14317 -1616 -59055 -24967 14453 31065 -33883
5004 -33883 -98210 -39954 -4203 -21881 -107704 -29222 35328 -14850 -52842 -53129 -70785 -15861
4992a5861O7694l0634M0098L3990q467m3053K948L6216k9769L337L4594j6830
4980G4263P810r82Q269k1452m7551j1828o2821m3065L0020O1508O145p2980p899
4967h0563M2269J9637l364n2520j0020P6140K8646q108J099n43l109p474L0345
4954C2435k2188k991k7273m250j0935k3382J2339j267O1374j5930L4558K5621
4942E8111o71l4371j0805n0002k8805Q8108L432j2631j8275P094k5827K102j5222
4929c7762j2769Q062O601k3825O486M3257O1888J7428n2783k8931m8396k0366
4917h1110J3187Q308l740l5051K695K6133J0889Q3616K5098k4883l0860k0358
4905b6076J410J00505L4760o3655O150Q991L9815K93j18218p8995M8496K8912
$$ plain form
4992 -15861 51833 21199 61297 95287 86820 43767 46715 82931 53162 56499 91093 74263
4980 74263 82073 81091 89360 67908 20357 8529 -54292 -97357 -67337 -5829 316 -72664 -80563
4967 -80563 -38294 -18657 -22021 -74541 -84561 -8421 20225 12117 13216 12673 9564 2090 32435
4954 32435 10247 7256 -20017 -24267 -35202 -58584 -46245 -47512 13862 -2068 32490 58111
4942 58111 57440 23069 12264 -37738 -66543 21565 24997 12366 -5909 1185 -24642 -22540 -37762
4929 -37762 -50531 -42469 -35868 -59693 -53207 -9950 51938 69366 16583 -12348 -60744 -81110
4917 -81110 -67923 -59615 -63355 -98406 -95711 -69578 -58689 24927 50025 25142 -5718 -26076
4905 -26076 -24666 75839 110599 46944 53094 62085 101900 102193 -16025 -95020 -46524 -17612
4893a7612o0513J1412N3828L7451J9667l936k2341j8636m1101J2595J7009O8693
4881E6516N2138m9030n3980r939P778P6372K4036j3448q3811p7228L2706k93k2960
4868f1143J6375j0635L605k5631j9529k288J9120K4925K2932L3780J3102J6668
4856C1281K3858j2768o3760j9208L3753m8008J3528k5335K7550L0409K0459K1098
4844C2857L9527J7381q415L8082J4666J1709o5497l2351K1868p5869j11794N5820
4832f2016N9774R238N3912k8189o9768K3313N4998k3361n3741l2487K3649k6893
4820g1571J2122J8709M9446o261j23384j02320K3625J06518P9191J6922K1684
4809B4681k2875k6457J1483L1936l2017l8749k8937m0594K3900k1082O538J4958
$$ plain form
4893 -17612 -78125 -66713 -12885 24566 44233 40297 17956 -680 -41781 -29186 -12177 56516
4881 56516 108654 59624 5644 -4295 3483 79855 103891 90443 6632 -70596 -37890 -38183 -61143
4868 -61143 -44768 -55403 -51798 -77429 -96958 -99246 -80126 -55201 -32269 1511 14613 31281
4856 31281 55139 42371 -21389 -40597 -6844 -54852 -41324 -66659 -39109 -8700 11759 32857
4844 32857 72384 89765 81350 119432 134098 145807 80310 47959 69827 -6042 -117836 -62016
4832 -62016 -2242 6996 60908 32719 -37049 -13736 41262 17901 -35840 -68327 -44678 -71571
4820 -71571 -59449 -40740 8706 2445 -120939 -223259 -199634 -93116 -13925 2997 24681
4809 24681 1806 -24651 -13168 18768 -13249 -51998 -80935 -121529 -97629 -118711 -112173 -97215
4797i7215j1113J7832M2264M5017K7586M8399P392l9689p4016r438K9287N2694
4785C9000l1464n5811J0105j5522J4385K8920J3877l6798l1108j9514J1357N168
4773f7405l4998j5073M7826O4248J5234j5031o6035K5340P781m734L3650L4156
4761B4959k4871j9146r952Q0966l7999l2653m6079r469r540L2644M0272L3748
4749B2880L4772j983m138j1891m535L711k5767J8062j8539o8558O71O1981K2413
4736B9079k3953r0738k3558K6641J10273K9789o994p11m4890k1886K4314L3612
4724D0978J2500J7550L5235m1535q3540L954j3686R106L3482j7132k8236o559
$$ plain form
4797 -97215 -108328 -90496 -48232 -3215 24371 72770 80162 40473 -33543 -42981 -13694 39000
4785 39000 7536 -48275 -38170 -53692 -39307 -10387 3490 -33308 -64416 -83930 -72573 -67405
4773 -67405 -102403 -117476 -69650 -5402 9832 -5199 -71234 -45894 -38113 -42847 -9197 24959
4761 24959 88 -19058 -29010 51956 13957 -18696 -64775 -74244 -83784 -51140 -10868 22880
4749 22880 57652 55669 51531 39640 35105 38816 13049 31111 12572 -55986 -55315 6666 29079
4736 29079 5126 -85612 -109170 -82529 27744 57533 50539 49828 4938 -16948 7366 40978
4724 40978 53478 71028 106263 64728 -18812 -14858 -28544 -19438 14044 -3088 -31324 -37883
$$ [...]
##END NTUPLES=NMR SPECTRUM
##END=
