##TITLE=Analysis number 328486
Compound Code cc 62646
Book Reference 494/176
Project Code adrs
Chemist Name craigr
##JCAMPDX= 6.0         $$ Bruker NMR JCAMP-DX V2.0
##DATA TYPE= NMR SPECTRUM
##DATA CLASS= NTUPLES
##ORIGIN= Bruker BioSpin GmbH
##OWNER= nmr
$$ XWIN-NMR		Version 3.5
$$ Fri Jun  8 11:49:57 2007 GMT Daylight Time (UT+1h)  MAYBRIDGE\nmr@NMR_250MHZ
##.OBSERVE FREQUENCY= 250.131544655141
##.OBSERVE NUCLEUS= ^1H
##.ACQUISITION MODE= SIMULTANEOUS (DQD)
##.ACQUISITION SCHEME= undefined
##.AVERAGES= 16
##.DIGITISER RES= 18
##SPECTROMETER/DATA SYSTEM= dpx250
##.PULSE SEQUENCE= zg30
##.SOLVENT NAME= CDCl3
##.SHIFT REFERENCE= (INTERNAL, CDCl3, 0, 16.522)
##AUDIT TRAIL= $$ (NUMBER, WHEN, WHO, WHERE, WHAT)
$$ ##TITLE= Audit trail, XWIN-NMR		Version 3.5
$$ ##JCAMPDX= 5.01
$$ ##ORIGIN= Bruker BioSpin GmbH
$$ ##OWNER= nmr
$$ C:\u/data/dgb/nmr/ADRS/560/pdata/1/auditp.txt
$$ ##AUDIT TRAIL=  $$ (NUMBER, WHEN, WHO, WHERE, WHAT)
(   1,<2007-06-08 11:49:27.04 +100>,<MAYBRIDGE\nmr>,<NMR_250MHZ>,
      <created by zg, POWCHK disabled, PULCHK disabled
       configuration hash MD5:
       76 6E 9A 78 1E 09 19 81 EC 84 63 8F B0 6A 59 2D
       data hash MD5: 64K
       27 46 96 D3 48 4B 45 84 37 13 3F B0 AF 37 E6 4E>)
(   2,<2007-06-08 11:49:41.57 +100>,<MAYBRIDGE\nmr>,<NMR_250MHZ>,
      <Start of raw data processing
       ef LB = 0.3 FT_mod = 6 PKNL = 1 SI = 32K 
       data hash MD5: 32K
       F4 AF 96 94 C7 D1 73 97 9B E8 FE 9B E4 54 1E 0A>)
(   3,<2007-06-08 11:49:44.02 +100>,<MAYBRIDGE\nmr>,<NMR_250MHZ>,
      <apk 
       data hash MD5: 32K
       23 92 93 BA 8B 99 A2 AD F5 F6 B7 25 53 BB 09 DF>)
(   4,<2007-06-08 11:49:44.80 +100>,<MAYBRIDGE\nmr>,<NMR_250MHZ>,
      <abs ABSG = 5 
       data hash MD5: 32K
       21 2E F8 0A 7B 0F 1B A6 2B 71 A8 18 6E 90 A2 4B>)
$$ ##END=
$$ 
$$ hash MD5
$$ 56 0F E8 63 63 90 D5 36 59 7D E1 0F DE FD E2 85
##$RELAX= 
##$RELAX= 
##$RELAX= 
##$RELAX= 
##$RELAX= 
##$RELAX= 
##$RELAX= 
$$ Bruker specific parameters
$$ --------------------------
##$DU= <C:\u>
##$EXPNO= 560
##$NAME= <ADRS>
##$PROCNO= 1
##$TYPE= <nmr>
##$USER= <dgb>
##$AMP= (0..31)
100 100 100 100 100 100 100 100 100 100 100 100 100 100 100 100 100 100 
100 100 100 100 100 100 100 100 100 100 100 100 100 100 
##$AQSEQ= 0
##$AQ_mod= 3
##$AUNM= <au_zg>
##$AUTOPOS= <9 >
##$BF1= 250.13
##$BF2= 250.13
##$BF3= 250.13
##$BF4= 250.13
##$BF5= 500.13
##$BF6= 500.13
##$BF7= 500.13
##$BF8= 500.13
##$BYTORDA= 1
##$CFDGTYP= 0
##$CFRGTYP= 5
##$CHEMSTR= <none>
##$CNST= (0..31)
1 1 145 1 1 1 1 1 1 1 1 1 1 1 1 1 1 1 1 1 1 1 1 1 1 1 1 1 1 1 1 1 
##$CPDPRG= <>
##$CPDPRG1= <>
##$CPDPRG2= <>
##$CPDPRG3= <>
##$CPDPRG4= <mlev>
##$CPDPRG5= <mlev>
##$CPDPRG6= <mlev>
##$CPDPRG7= <mlev>
##$CPDPRG8= <mlev>
##$CPDPRGB= <>
##$CPDPRGT= <>
##$D= (0..31)
0 1 0 0 0 0 0 0 0 0.06 0 0 0 0 0 0 0.0002 0 0 0 0 0 0 0 0 0 0 0 0 0 0 
0 
##$DATE= 1181299765
##$DBL= (0..7)
120 120 120 120 120 120 120 120 
##$DBP= (0..7)
150 150 150 150 150 150 150 150 
##$DBP07= 0
##$DBPNAM0= <>
##$DBPNAM1= <>
$$ [...]
##$SUBNAM7= <"">
##$SUBNAM8= <"">
##$SUBNAM9= <"">
##$SW= 20.6930455092707
##$SWIBOX= (0..15)
0 0 3 0 0 0 0 0 0 0 0 0 0 0 0 0 
##$SW_h= 5175.983436853
##$TD= 65536
##$TD0= 1
##$TE= 296.16
##$TE2= 300
##$TE3= 300
##$TEG= 300
##$TL= (0..7)
0 120 120 120 120 120 120 120 
##$TP= (0..7)
150 150 150 150 150 150 150 150 
##$TP07= 0
##$TPNAME0= <>
##$TPNAME1= <>
##$TPNAME2= <>
##$TPNAME3= <>
##$TPNAME4= <>
##$TPNAME5= <>
##$TPNAME6= <>
##$TPNAME7= <>
##$TPOAL= (0..7)
0.5 0.5 0.5 0.5 0.5 0.5 0.5 0.5 
##$TPOFFS= (0..7)
0 0 0 0 0 0 0 0 
##$TUNHIN= 0
##$TUNHOUT= 0
##$TUNXOUT= 0
##$USERA1= <user>
##$USERA2= <user>
##$USERA3= <user>
##$USERA4= <user>
##$USERA5= <user>
##$V9= 5
##$VALIST= <valist>
##$VCLIST= <CCCCCCCCCCCCCCC>
##$VD= 0
##$VDLIST= <DDDDDDDDDDDDDDD>
##$VPLIST= <PPPPPPPPPPPPPPP>
##$VTLIST= <TTTTTTTTTTTTTTT>
##$WBST= 1024
##$WBSW= 4
##$XGAIN= (0..3)
0 0 0 0 
##$XL= 0
##$YL= 0
##$YMAX_a= 469626
##$YMIN_a= -517495
##$ZGOPTNS= <>
##$ZL1= 120
##$ZL2= 120
##$ZL3= 120
##$ZL4= 120
##$ABSF1= 16.522
##$ABSF2= -4.171173
##$ABSG= 5
##$ABSL= 3
##$ALPHA= 0
##$AQORDER= 0
##$ASSFAC= 0
##$ASSFACI= 0
##$ASSFACX= 0
##$ASSWID= 0
##$AUNMP= <proc_1d>
##$AZFE= 0.1
##$AZFW= 0.1
##$BCFW= 0
##$BC_mod= 0
##$BYTORDP= 0
##$COROFFS= 0
##$CY= 12.5
##$DATMOD= 1
##$DC= 0
##$DFILT= <>
##$DTYPP= 0
##$F1P= 14.0000005364418
##$F2P= -0.99999901652339
##$FCOR= 0.5
##$FTSIZE= 32768
##$FT_mod= 6
##$GAMMA= 0
##$GB= 0
##$INTBC= 1
##$INTSCL= 1
##$ISEN= 128
##$LB= 0.3
##$LEV0= 0
##$LPBIN= 0
##$MAXI= 10000
##$MC2= 0
##$MEAN= 0
##$ME_mod= 0
##$MI= 0
##$NCOEF= 0
##$NC_proc= -3
##$NLEV= 6
##$NOISF1= 0
##$NOISF2= 0
##$NSP= 0
##$NTH_PI= 0
##$NZP= 0
##$OFFSET= 16.522
##$PC= 1
##$PHC0= -55.44125
##$PHC1= 5.36903
##$PH_mod= 1
##$PKNL= yes
##$PPARMOD= 0
##$PSCAL= 4
##$PSIGN= 0
##$REVERSE= no
##$SF= 250.13
##$SI= 32768
##$SIGF1= 0
##$SIGF2= 0
##$SINO= 400
##$SIOLD= 32768
##$SREGLST= <1H.CDCl3>
##$SSB= 0
##$STSI= 32768
##$STSR= 0
##$SW_p= 5175.98343685301
##$SYMM= 0
##$S_DEV= 0
##$TDeff= 65536
##$TDoff= 0
##$TI= <Analysis number 999999
Compound Code 99
Book Reference 9
Project Code 9>
##$TILT= no
##$TM1= 0
##$TM2= 0
##$TOPLEV= 0
##$USERP1= <user>
##$USERP2= <user>
##$USERP3= <user>
##$USERP4= <user>
##$USERP5= <user>
##$WDW= 1
##$XDIM= 32768
##$YMAX_p= 406525333
##$YMIN_p= -56264
$$ End of Bruker specific parameters
$$ ---------------------------------
##NTUPLES= NMR SPECTRUM
##VAR_NAME=  FREQUENCY,     SPECTRUM/REAL,   SPECTRUM/IMAG
##SYMBOL=    X,             R,               I
##VAR_TYPE=  INDEPENDENT,   DEPENDENT,       DEPENDENT
##VAR_FORM=  AFFN,          ASDF,            ASDF
##VAR_DIM=   32768,         32768,           32768
##UNITS=     HZ,            ARBITRARY UNITS, ARBITRARY UNITS
##FACTOR=    0.157963299565203, 1,           1
##FIRST=     4132.6476996994, 0,             0
##LAST=      -1043.33573715361, 0,           0
##MIN=       -1043.33573715361, -56264,      0
##MAX=       4132.6476996994, 406525333,     0
$$ Real data points
##PAGE= N=1
##DATA TABLE= (X++(R..R)), XYDATA
$$ [...]
$$ plain form
16639 -7564 1465 8252 -3231 -1342 438 -11442 -28091 -29340 -18438 -8306 -9610 2345 -3672
16626 -3672 -9264 -13117 -18929 -15655 -20740 -5386 -4006 -9004 -9786 -19684 -18328 -13850 -17871 -21984 -28044
16611 -28044 -28142 -32602 -20202 -24813 -17696 -19302 -21606 -18539 -23228 -21079 -20426 -12030 -2037 300 -4330
16596 -4330 -11030 589 6956 14765 8631 -4692 -16220 -6258 -5386 -6106 -5222 -1900 5932 -1681 -11342
16581 -11342 -11183 -2090 462 8869 18640 15358 2395 -9706 -15991 -3568 4391 -13486 -13619 -10966
16567 -10966 -14622 -8424 101 23525 40488 22554 574 -15227 -10393 -16772 -13197 -11327 -2713
16554 -2713 -6324 -8667 -28586 -21062 -6820 2433 10342 10658 10369 9844 2634 4239 13132 4106 -4346
16539 -4346 2901 4280 -2780 -4520 45 9665 10715 -1157 -7119 -18443 -20791 -14912 -12463 -3660
$$ packed form
16639g564R029O787j1483J889J780j1880j6649j249J0902J0132j304J1955o017
16626c672n592l853n812L274n085J5354J380m998p82r898J356M478m021m113o060
16611b8044r8m460J2400m611P117j606k304L067m689K149O53Q396R993K337m630
16596d330o700J1619O367P809o134j3323j1528R962Q72p20Q84L322P832p613r661
16581a1342J59R093K552Q407R771l282j2963j2101o285J2423P959j7877j33K653
16567a0966l656O198Q525K3424J6963j7934k1980j5801M834o379L575J870Q614
16554b713l611k343j9919P524J4242R253P909L16k89n25p210J605Q893r026q452
16539d346P247J379p060j740M565R620J050j1872n962j1324k348N879K449Q803
$$ plain form
16525 -3660 -8231 -4359 1831 -4910 -11888 -10705 -20431 -36530 -28203 -23234 -7366 6568 20458 4405
16511 4405 -16306 -5686 -7179 -26630 -26388 -9105 4543 142 -6129 -13249 308 10995 4636
16498 4636 2747 -8549 -21760 -22055 -9168 -14759 -6888 3449 -6088 -15984 -17897 -12740 -8854 -14890
16484 -14890 -16070 -10207 5120 1132 -16619 -18325 -25261 -29255 -17008 -14326 -2370 177 -302 -22470
16470 -22470 -27983 -9655 -1150 -6575 -12989 -19926 -21209 -29847 -17640 -12872 689 2608 -16133
16457 -16133 -18547 -11242 -12974 -6005 1442 -23270 -25081 -6902 -4525 -2821 -11277 -23364 -20883 -14650
16443 -14650 -18310 -26098 -20068 -21398 -13692 -6773 -6975 -6115 -20386 -18329 1028 3447 372 -17382
16429 -17382 -20475 -30065 -44436 -56264 -52957 -37566 -28951 -489 9876 6135 -9784 -22572 -21539
$$ packed form
16525c660m571L872O190o741o978J183r726j6099Q327M969J5868J3934J3890j6053
16511D405k0711J0620j493j9451K42J7283J3648m401o271p120J3557J0687o359
16498D636j889j1296j3211k95J2887n591P871J0337r537r896j913N157L886o036
16484a4890j180N863J5327l988j7751j706o936l994J2247K682J1956K547m79k2168
16470b2470n513J8328Q505n425o414o937j283q638J2207M768J3561J919j8741
16457a6133k414P305j732O969P447k4712j811J8179K377J704q456j2087K481O233
16443a4650l660p788O030j330P706O919k02Q60j4271K057J9357K419l075j7754
16429a7382l093r590j4371j1828L307J5391Q615K8462J0365l741j5919j2788J033
$$ plain form
16416 -21539 -29224 -25857 -20377 -28739 -24625 -25993 -29874 -38110 -29833 -14281 -7413 -17299 -19523 -16381
16402 -16381 -6100 -484 -3887 -14266 -19255 -21956 -29613 -21560 -12974 -11361 -18856 -24934 -22041 -16112
16388 -16112 -21370 -20728 -18486 -2300 -6044 -22253 -17059 -8589 -8722 -25735 -18088 -1516 -17494 -21664
16374 -21664 -26689 -22891 -9718 -13938 -11383 -12419 -10735 -1162 -20897 -23917 -21862 -12785 -3223 1749
16360 1749 -7913 -19414 -23872 -22497 -11859 -13760 1734 2888 -12869 -9676 1841 -5018 -20659
16347 -20659 -25113 -28253 -33904 -42629 -38476 -33959 -31146 -34227 -27922 -17662 -12822 -7664 -6460 -9202
16333 -9202 -7788 -20459 -27675 -15366 -11019 -8687 -15831 -16773 -13224 -4661 417 5205 4696 -1298 -18652
16318 -18652 -12037 -8136 -10686 -11934 -13575 -10001 -476 -4582 -6732 5593 312 -14955 -18805 -16144
$$ packed form
16416b1539p685L367N480q362M114j368l881q236Q277J5552O868r886k224L142
16402a6381J0281N616l403j0379m989k701p657Q053Q586J613p495o078K893N929
16388a6112n258O42K242J6186l744j6209N194Q470j33j7013P647J6572j5978m170
16374b1664n025L798J3173m220K555j036J684R573j9735l020K055R077R562M972
16360A749r662j1501m458J375J0638j901J5494J154j5757L193J1517o859j5641
16347b0659m454l140n651q725M153M517K813l081O305J0260M840N158J204k742
16333i202J414j2671p216J2309M347K332p144r42L549Q563N078M788n09n994j7354
16318a8652O615L901k550j248j641L574R525m106k150J2325n281j5267l850K661
$$ plain form
16304 -16144 -1206 1155 6978 6894 -940 4225 -318 -398 8671 -344 -9713 -4280 -700 -4760 -17909
16289 -17909 -28336 -29991 -16381 -15105 -20906 -20335 -13433 -10224 -14660 -11215 -3429 5114 5706 -595
16275 -595 -21020 -28543 -16030 -17712 -15046 -8981 -608 -1798 822 -6832 -14964 -12282 -8512 -12751
16261 -12751 -12138 -14178 -12318 -22452 -24100 -11577 -5971 -8255 -18840 -27886 -28254 -13643 -5523 -14407
16247 -14407 -25724 -22907 -24199 -29046 -21929 -13484 -9681 -12209 -14389 -7180 450 -2947 484 4637
16233 4637 -4765 -10020 2937 9020 3871 1590 5248 19106 18506 8602 -13118 -7639 -5451 3267
16219 3267 -1406 -27222 -42185 -17861 506 -922 -3597 -1269 -8815 -14348 -27302 -22411 -14881
16206 -14881 -12101 -10621 -12610 -18137 -30370 -27921 -13806 -7938 -17107 -10659 -14979 -28769 -42029
$$ packed form
16304a6144J4938K361N823q4p834N165m543q0R069r015r369N433L580m060j3149
16289a7909j0427j655J3610J276n801N71O902L209m436L445P786Q543N92o301
16275e95k0425p523J2513j682K666O065Q373j190K620p654q132K682L770m239
16261a2751O13k040J860j0134j648J2523N606k284j0585r046l68J4611Q120q884
16247a4407j1317K817j292m847P117Q445L803k528k180P209P630l397L431M153
16233D637r402n255J2957O083n149k281L658J3858o00r904k1720N479K188Q718
16219C267m673k5816j4963K4324J8367j428k675K328p546n533j2954M891P530
16206a4881K780J480j989n527j2233K449J4115N868r169O448m320j3790j3260
$$ plain form
16193 -42029 -28653 -21386 -16612 2623 7265 7350 7039 -10213 -15587 -15392 -12423 -16697 -20300 -20948 -4303
16178 -4303 -2096 -14011 -19123 -20855 -30696 -39231 -39188 -28213 -21900 -21981 -16100 -9609 -10700 -18905 -12788
16163 -12788 -11571 -23664 -26709 -17078 -15076 -20370 -18066 -20982 -13662 -16087 -23729 -28007 -30632 -18681
16149 -18681 -18819 -29031 -29843 -22613 -11981 -14495 -2580 -1297 -7859 -24875 -24597 -8579 -6125 -97
16135 -97 3399 24943 16362 -4073 -3214 7273 3221 12951 7880 -4782 -12265 -15316 -11036 -10179 -6318
16120 -6318 756 1181 2327 10415 6268 -1103 -19964 -16273 -2067 -7852 -1434 4752 -4579 -16538
16106 -16538 -9366 7804 -3749 -19187 -14753 -8594 -12984 -16299 -22064 -21484 -17341 -14762 -19294 -22837
16092 -22837 -16315 -2359 -6487 -12730 -17325 -20612 -19881 -13105 -7359 -7439 -7187 -541 5220 -1676 -12769
$$ packed form
16193d2029J3376P267M774J9235M642Q5l11j7252n374J95K969m274l603o48J6645
16178d303K207j1915n112j732r841q535M3J0975O313q1N881O491j091q205O117
16163a2788J217j2093l045R631K002n294K304k916P320k425p642m278k625J1951
16149a8681j38j0212q12P230J0632k514J1915J283o562j7016K78J6018K454O028
16135i7L496K1544q581k0435Q59J0487m052R730n071j2662p483l051M280Q57L861
16120f318P074M25J146Q088m147p371j8861L691J4206n785O418O186r331j1959
16106a6538P172J7170j1553j5438M434O159m390l315n765N80M143K579m532l543
16092b2837O522J3956m128o243m595l287P31O776N746q0K52O646N761o896j1093
$$ plain form
16077 -12769 -23764 -22401 -16126 -15429 -13151 -17805 -21508 -14751 -10153 -9558 -9487 -290 -4494 -17486 -19351
16062 -19351 -8710 4238 10543 10047 10388 12953 9083 -9684 -21642 -25364 -35207 -34888 -29421 -15440
16048 -15440 6502 9312 -10846 -17577 -28454 -34576 -29407 -27554 -12087 7811 16342 28689 11261
16035 11261 -6536 -3799 -4972 -17342 -33281 -44725 -33737 -26149 -24906 -24857 -29284 -33479 -48573
16022 -48573 -34889 -16130 -7074 -9041 -12944 -17507 -21920 -27724 -13151 -11114 -17646 -18284 -2999 872
16008 872 -9232 -17774 -24215 -11125 119 758 -9831 -27450 -28190 -17295 -22123 -19472 -15003 -11534
15994 -11534 -11998 -10826 -23938 -19286 -18318 -12389 -8264 -16977 -33706 -37829 -25480 -16972 -13737 -12487
15980 -12487 -1362 -12552 -19170 -19869 -17140 -18807 -16931 -15725 -29324 -38594 -33085 -31209 -31120 -36475
$$ packed form
16077a2769j0995J363O275O97K278m654l703O757M598N95P1R197m204j2992j865
16062a9351J0641J2948O305m96L41K565l870j8767j1958l722r843L19N467J3981
16048a5440K1942K810k0158o731j0877o122N169J853J5467J9898Q531J2347j7428
16035A1261j7797K737j173j2370j5939j1444J0988P588J243M9m427m195j5094
16022d8573J3684J8759R056j967l903m563m413n804J4573K037o532o38J5285L871
16008H72j0104q542o441J3090J1244O39j0589j7619p40J0895m828K651M469L469
15994a1534m64J172j3112M652R68N929M125q713j6729m123J2349Q508L235J250
15980a2487J1125j1190o618o99K729j667J876J206j3599r270N509J876Q9n355
$$ plain form
15966 -36475 -30450 -18710 -23604 -28235 -23098 -14876 -3022 -3339 -8379 -6938 -15520 -24489 -17390 -12619
15952 -12619 -2801 -10947 -26389 -19013 -12421 -7927 7518 2282 -10030 -20798 -24816 -35348 -31462
15939 -31462 -16569 -18472 -18810 -17093 -28618 -31559 -36591 -21536 -12455 -22379 -19934 -11904 -13050 -3501
15925 -3501 -3737 -6367 -5877 1038 -8680 -16712 -9569 -17895 -20418 -17860 -10157 2918 10550 4606 8891
15910 8891 8794 1859 5472 5999 2224 -4601 -12825 -14895 -20165 -30284 -33348 -39161 -32196 -28080 -30155
15895 -30155 -25894 -27782 -36489 -43531 -42713 -33249 -19674 -4442 -13281 -13026 -5875 -1875 -4564 -10189
15881 -10189 -13426 -19850 -8020 32 -686 -7487 -24347 -27382 -30565 -20821 -8332 -12031 -16218 -8685
15867 -8685 -14457 -16095 -16102 -8821 -4038 -6964 -13219 -8389 6677 -187 -12056 -19688 -20194 -19107 -14008
$$ packed form
15966c6475O025J1740m894m631N137Q222J1854l17n040J441q582q969P099M771
15952a2619R818q146j5442P376O592M494J5445n236j2312j0768m018j0532L886
15939c1462J4893j903l38J717j1525k941n032J5055R081r924K445Q030j146R549
15925c501k36k630M90O915r718q032P143q326k523K558P703J3075P632n944M285
15910H891r7o935L613N27l775o825q224k070n270j0119l064n813O965M116k075
15895c0155M261j888q707p042Q18R464J3575J5232q839K55P151M000k689n625
15881a0189l237o424J1830Q052p18o801j6860l035l183R744J2489l699m187P533
15867h685n772j638pP281M783k926o255M830J5066o864j1869p632n06J087N099
$$ plain form
15852 -14008 -6258 -16165 -19969 -12510 -19755 -19039 -15701 -16569 -16197 -22012 -13123 -4805 -7413 -13652 -15936
15837 -15936 -13214 -10350 -10146 392 -8624 -11488 1173 7086 8878 -20364 -36430 -40878 -43548 -34682
15823 -34682 -22493 -19872 -14542 -7833 -5074 -27585 -32716 -29167 -19327 -9478 -6065 -9998 -13469 -4561
15809 -4561 -5369 4604 7313 5355 1742 -4957 461 -2989 -10859 -11260 -8449 -10161 -14985 -12681 -14402
15794 -14402 -16020 -24703 -27119 -15276 -1789 4532 -1105 -2052 8503 20333 12304 3368 -8718
15781 -8718 -229 -563 -1235 1347 6137 7612 4675 -4493 -11787 -21947 -22705 -18367 -12582 -2239 -7218
15766 -7218 -9404 -1271 -1180 3954 14722 21588 24057 4133 -5844 -10846 -20028 -24532 -15327 3987
15752 3987 12567 9416 13579 19201 2225 -8093 -9852 -14793 -17485 -14315 -27997 -39602 -36814 -31717
$$ packed form
15852a4008P750r907l804P459p245P16L338q68L72n815Q889Q318k608o239k284
15837a5936K722K864K04J0538r016k864J2661N913J792k9242j6066m448k670Q866
15823c4682J2189K621N330O709K759k2511n131L549R840R849L413l933l471Q908
15809d561q08R973K709j958l613o699N418l450p870m01K811j712m824K304j721
15794a4402j618q683k416J1843J3487O321n637r47J0555J1830q029q936j2086
15781h718Q489l34o72K582M790J475k937r168p294j0160p58M338N785J0343m979
15766g218k186Q133R1N134J0768O866K469j9924r977n002r182m504R205J9314
15752C987Q580l151M163N622j6976j0318j759m941k692L170j3682j1605K788N097
$$ plain form
15738 -31717 -23273 -20613 -26296 -16376 382 6611 5150 574 -8170 3431 9260 4697 327 -7314
15724 -7314 2948 905 -3531 -2412 -3133 8902 2026 751 -6579 -3194 -8467 5779 7713 11617
15710 11617 8718 -3085 -6195 -5756 -11321 -18665 -19936 -5867 9415 15993 5891 -10361 -23153
15697 -23153 -21713 -15625 -13033 -10896 4080 -1099 -11289 -18647 -13512 -7575 -10520 2134 3189 361
15683 361 7797 10750 -843 -20603 -20711 -21986 -28474 -21837 -236 -1868 -16228 -24945 -19003 -7310
15669 -7310 698 1846 -6643 -14915 -15257 -23054 -17164 -3843 3338 1781 -10822 -18156 -11597 -4055
15655 -4055 -14875 -23601 -24438 -28585 -24078 -20376 -20043 -27395 -35499 -37341 -30364 -22395 -30970 -34105 -21529
15640 -21529 -12749 -1170 -12281 -23152 -23894 -30501 -21441 -10993 4597 8303 -5124 -9195 -1581
$$ packed form
15738c1717Q444K660n683R920J6758O229j461m576q744J1601N829m563m370p641
15724g314J0262k043m436J119p21J2035o876j275p330L385n273J4246J934L904
15710A1617k899j1803l110M39n565p344j271J4069J5282O578j0102j6252j2792
15697b3153J440O088K592K137J4976n179j0190p358N135N937k945J2654J055k828
15683C61P436K953j1593j9760j08j275o488O637K1601j632j4360q717N942J1693
15669g310Q008J148q489q272l42p797N890J3321P181j557j2603p334O559P542
15655d055j0820q726q37m147M507L702L33p352q104j842O977P969q575l135J2576
15640b1529Q780J1579j1111j0871p42o607R060J0448J5590L706j3427m071P614
$$ plain form
15627 -1581 -8991 -10567 -15365 -12518 -274 653 -9319 -10021 -7359 -10939 -21930 -18325 156 3276
15613 3276 1141 9393 6375 -5209 -14032 -14858 -11381 -11185 -2732 -134 -13631 -1790 11390 8124
15599 8124 -6472 -16849 -2650 -1814 -15592 -12833 -11017 -13508 -23121 -3994 -7870 -1267 74 -59
15585 -59 -8757 -11588 -19641 -24943 -20970 -14409 -5680 -8195 -4698 7314 1931 -7146 -9471 -7546 102
15570 102 -3672 -20214 -11903 4831 -10478 -12080 -13324 -24519 -31084 -28188 -29089 -16023 -22048 -31271
15556 -31271 -23582 -14916 -6323 -2273 -3018 -17925 -26787 -20451 -9777 3336 -4127 -7607 -18654 -21169
15542 -21169 -14169 -8682 -11993 -19114 -20041 -22122 -6866 -1806 -6719 -22147 -29550 -21143 -2803 2339
15528 2339 12035 15209 17987 22625 8237 -2668 -2356 -19229 -19697 -24666 -27309 -22614 -17089 -25511
$$ packed form
15627a581p410j576m798K847J2244R27r972p02K662l580j0991L605J8481L120
15613C276k135Q252l018j1584q823q26L477J96Q453K598j3497J1841J3180l266
15599H124j4596j0377J4199Q36j3778K759J816k491r613J9127l876O603J341j33
15585e9q698k831q053n302L973O561Q729k515L497J2012n383r077k325J925P648
15570A02l774j6542Q311J6734j5309j602j244j1195o565K896r01J3066o025r223
15556c1271P689Q666Q593M050p45j4907q862O336J0674J3113p463l480j1047k515
15542b1169P000N487l311p121r27k081J5256N060m913j5428p403Q407J8340N142
15528B339R696L174K778M638j4388j0905L12j6873m68m969k643M695N525q422
$$ plain form
15514 -25511 -20725 -18967 -26570 -24776 -22946 -14882 -2689 -4117 -4620 -3049 1860 1874 15613 7996 785
15499 785 5219 694 -19560 -20902 -3510 -1171 -3543 -13228 -25636 -23754 -19258 -32012 -35392 -26985
15485 -26985 -13495 2830 1164 -8523 -6795 1336 7477 8896 14737 8697 5185 8338 8748 180
15471 180 13209 19356 2594 -8279 -21694 -24708 -19285 -19638 -6537 -3808 -11530 -8717 -12762 -11233
15457 -11233 4836 12312 13442 11288 16798 9313 4720 -2979 -2406 -1705 7414 20234 13507 10348
15443 10348 15100 3458 4115 -5308 -734 2175 2797 -4901 -23163 -22043 -17794 -17508 -23351 -16662 -9804
15428 -9804 -1879 1773 -1920 -18010 -26427 -11957 -1093 -5878 -24546 -21549 -3230 -1733 -14591
15415 -14591 -19938 -15632 -13211 -18322 -13106 -21067 -18096 -17589 -12406 -13196 -27708 -28939 -18750 -20783
$$ packed form
15514b5511M786J758p603J794J830Q064J2193j428n03J571M909J4J3739p617p211
15499G85M434m525k0254j342J7392K339k372r685j2408J882M496j2754l380Q407
15485b6985J3490J6325j666r687J728Q131O141J419N841o040l512L153M10q568
15471A80J3029O147j6762j0873j3415l014N423l53J3101K729p722K813m045J529
15457a1233J6069P476J130k154N510p485m593p699N73P01R119J2820o727l159
15443A0348M752j1642O57r423M574K909O22p698j8262J120M249K86n843O689O858
15428i804P925L652l693j6090q417J4470J0864m785j8668K997J8319J497j2858
15415a4591n347M306K421n111N216p961K971N07N183p90j4512j231J0189k033
$$ plain form
15401 -20783 -21847 -14646 -11013 -18708 -23570 -17780 -16758 -20745 -24232 -25382 -22563 -21138 -13286 -10393
15387 -10393 -10815 -16109 -29151 -48337 -35351 -24232 -21889 -26111 -21057 -10165 -13913 -23107 -28409
15374 -28409 -23413 -11567 -4745 3029 3811 -4565 -8734 -17471 -20520 -26522 -25174 -16327 -5111 -10051
15360 -10051 -13144 -21761 -14689 -7876 -18660 -21610 -27361 -27780 -27420 -22236 -18344 -16990 -18008 -8565 -10774
15345 -10774 -20549 -25667 -20446 -12786 -6768 -4359 4208 7820 4253 -1050 -14073 -22263 -21471 -21785 -23991
15330 -23991 -15361 -14510 1535 15909 -1185 -17863 -18634 -10796 -4877 2046 3504 -5523 -14491 -22404
15316 -22404 -21706 -13535 -11787 -6791 -3722 -7689 -20858 -23970 -9797 -1876 2222 7271 345 -8671
15302 -8671 -10769 2879 3615 10869 -1010 -16185 -6769 558 1741 2527 2375 -10737 -12107 -12223 -13557
$$ packed form
15401b0783j064P201L633p695m862N790J022l987l487j150K819J425P852K893
15387a0393m22n294j3042j9186J2986J1119K343m222N054J0892l748r194n302
15374b8409M996J1846O822P774P82q376m169q737l049o002J348Q847J1216m940
15360a0051l093q617P072O813j0784k950n751m19L60N184L892J354j018R443k209
15345a0774r775n118N221P660O018K409Q567L612l567n303j3023q190P92l14k206
15330b3991Q630Q51J6045J4374j7094j6678p71P838N919O923J458r027q968p913
15316b2404O98Q171J748M996L069l967j3169l112J4173P921M098N049o926r016
15302h671k098J3648P36P254j1879j5175R416P327J183P86j52j3112j370j16j334
$$ plain form
15287 -13557 -20217 -18664 -3659 -3123 -9622 -5817 -8670 -14616 -21953 -16894 -5223 -7613 -15568 -22976
15273 -22976 -31124 -35158 -31841 -21641 -12450 -9530 -24362 -19769 2186 4453 -3555 956 -20887
15260 -20887 -35132 -26593 -30428 -37169 -33874 -32192 -11210 7725 5362 11813 12424 -3035 -22451
15247 -22451 -20415 -13235 -18114 -21717 -20408 -24598 -18820 -10281 -21255 -20926 -15287 -13487 -19531 -25381
15233 -25381 -19705 -12934 -6217 -5201 -4110 -4312 3430 8918 7269 3251 12219 8122 8928 10639 6977
15218 6977 1524 -11648 -17813 -17880 -14950 -15835 -16659 -27296 -33366 -30812 -17908 -17481 -11527 -14935 3703
15203 3703 9901 -3401 -1131 6830 -946 -17021 -13467 -2147 17641 23677 9661 -1184 -10953
15190 -10953 -12912 -8855 -2646 4834 13530 6607 -3858 -8037 -2815 8666 2814 -4631 -7735 -7330
$$ packed form
15287a3557o660J553J5005N36o499L805k853n946p337N059J1671k390p955p408
15273b2976q148m034L317J0200R191K920j4832M593K1955K267q008M511k1843
15260b0887j4245Q539l835o741L295J682K0982J8935k363O451O11j5459j9416
15247b2451K036P180m879l603J309m190N778Q539j0974L29N639J800o044n850
15233b5381N676O771O717J016J091k02P742N488j649m018Q968m097Q06J711l662
15218F977n453j3172o165o7K930q85q24j0637o070K554J2904M27N954l408J8638
15203C703O198j3302K270P961p776j6075L554J1320J9788O036j4016j0845r769
15190a0953j959M057O209P480Q696o923j0465m179N222J1481n852p445l104M05
$$ plain form
15176 -7330 4723 9259 12981 8017 3084 -4153 -3192 -9881 -9154 -9096 -14264 2609 12303 5839 14012
15161 14012 9240 3665 8530 9949 3796 8258 -3813 -2717 -9814 -18060 -20486 -13913 -2794 4442
15147 4442 2079 -12198 -9873 -9015 -11772 -2076 -17318 -21170 -1031 2788 5094 6138 9040 -5794
15133 -5794 -2919 -521 907 -9615 -23286 -23464 -7432 -2096 -1498 -13251 -27114 -31376 -26626 -15170
15119 -15170 -12477 -6146 -3854 -10801 -12551 -7 9136 5264 3102 7147 8341 2508 7787 -4460
15105 -4460 -24218 -26501 -5694 -646 1365 -821 1815 7731 9961 20522 20606 8644 -1064 684
15091 684 7552 12435 4001 -6698 -6137 -7812 -14725 -17640 -25839 -27356 -20056 -12918 -1113 -12970
15077 -12970 -4928 3693 844 -1224 -5690 -1997 -3031 3705 9485 9146 2878 -6224 -14482 -5031 -2425
$$ packed form
15176g330J2053M536L722m964m933p237R61o689P27N8n168J6873R694o464Q173
15161A4012m772n575M865J419o153M462j2071J096p097q246k426O573J1119P236
15147D442k363j4277K325Q58k757R696j5242l852K0139L819K306J044K902j4834
15133e794K875K398J428j0522j3671j78J6032N336N98j1753j3863m262M750J1456
15119a5170K693O331K292o947j750J2544R143l872k162M045J194n833N279j2247
15105d460j9758k283K0807N048K011k186K636N916K230J0561Q4j1962r708J748
15091F84O868M883q434j0699N61j675o913k915q199j517P300P138J1805j1857
15077a2970Q042Q621k849k068m466L693j034O736N780l39o268r102q258R451K606
$$ plain form
15062 -2425 -1646 -3982 -16054 -14396 -8299 -9429 1228 12949 10411 -3200 -20266 -8993 924
15049 924 7349 12561 19767 13303 -1417 -9315 -9236 3901 7062 -9366 -20768 -29945 -11999 6317
15035 6317 4193 1056 7887 -1566 -12420 -17107 -9813 -5525 -12816 -7876 -20549 -38396 -32914 -26868
15021 -26868 -24395 -14379 -14426 4474 16159 -93 -3012 908 -5467 -12373 -2093 -4758 -4584 -1537
15007 -1537 10957 11629 5766 -4164 -15169 -20699 -15043 -1612 -249 4883 1312 -14479 -29307 -41360
14993 -41360 -31005 -15816 -11009 -8403 -7081 -7901 -7499 -6036 -1028 1866 10818 4955 -1856 4756
14979 4756 -2347 -8290 -5048 -12135 -11417 -9321 -11399 -3617 8065 3836 4909 15377 20043 4670
14965 4670 4792 7663 5567 8509 24015 19876 6775 14117 10636 8980 12621 9457 8484 -1196 -2178
$$ packed form
15062b425P79k336j2072J658O097j130J0657J1721k538j3611j7066J1273R917
15049I24O425N212P206o464j4720p898P9J3137L161j6428j1402r177J7946J8316
15035F317k124l137O831r453j0854m687P294M288p291M940j2673j7847N482O046
15021b6868K473J0016m7J8900J1685j6252k919L920o375o906J0280k665J74L047
15007a537J2494O72n863r930j1005n530N656J3431J363N132l571j5791j4828j2053
14993d1360J0355J5189M807K606J322q20M02J463N008K894Q952n863o811O612
14979D756p103n943L242p087P18K096k078P782J1682m229J073J0468M666j5373
14965D670J22K871k096K942J5506m139j3101P342l481j656L641l164r73r680r82
$$ plain form
14950 -2178 1945 6650 4902 -1082 4999 184 6448 13314 19212 10899 -8722 -18082 -15950 -11248
14936 -11248 -3198 -509 6550 14928 17047 26116 16932 4934 8697 14249 12924 15968 22880 32195
14922 32195 38059 48180 58262 86014 108786 157565 234794 330082 437541 532944 586770 573223
14910 573223 507121 413149 317203 216444 130473 96618 66877 54039 55564 55776 51606 46369
14898 46369 30806 29755 44632 29202 25273 17522 8951 923 12112 20367 19322 17616 17016 23712
14884 23712 24351 30081 32331 17261 3915 -2844 -2509 -18697 -11657 -13461 -16220 -23802 -19048 -8358
14870 -8358 6872 12823 1217 -6985 -11465 5980 25517 27279 16336 -4831 -15783 -3412 13579
14857 13579 18102 12722 -6712 -21918 -18906 -13322 -6104 -16845 -21375 -19302 -14935 -19893 -25526 -17115
$$ packed form
14950b178M123M705j748n984O081m815O264O866N898q313j9621r360K132M702
14936a1248Q050K689P059Q378K119R069r184j1998L763N552j325L044O912R315
14922C2195N864J0121J0082K7752K2772M8779P7229R5288J07459R5403N3826j3547
14910E73223o6102r3972r5946j00759q5971l3855k9741j2838J525K12m170n237
14898D6369j5563j051J4877j5430l929p751q571q028J1189Q255j045j706o00O696
14884B3712O39N730K250j5070j3346o759L35j6188P040j804k759p582M754J0690
14870h358J5230N951j1606q202m480J7445J9537J762j0943k1167j0952J2371J6991
14857A3579M523n380j9434j5206L012N584P218j0741m530K073M367m958n633Q411
$$ plain form
14843 -17115 -2529 -317 2483 -2826 -302 -1036 -5027 -8230 1071 2343 13245 9933 12012 15806
14829 15806 -1357 -20325 -21782 -8637 -6045 -11125 -2782 -6399 1137 907 -7363 -7173 806 10653
14815 10653 25167 20069 18484 11716 4604 -2527 -5224 -624 -3685 -781 -2155 289 10006 7911
14801 7911 -10824 -7333 -2037 -6048 2320 6281 4292 4296 -8949 -5614 -6124 -7728 339 7379 3189
14786 3189 6745 8059 7494 9248 2286 -11356 -16919 -3689 13186 8924 10492 14466 10598 3616
14772 3616 -3681 -8942 -6011 -8520 -10100 -9585 -9700 -16932 -16091 -7560 -2404 1746 -6246 -1843 2385
14757 2385 -5269 -5911 3069 954 -12389 -15370 -7257 -9363 3085 11333 15645 21287 22662 14416
14743 14416 -5711 -23108 -15804 -12517 -13938 -20111 -21934 -7947 -12317 -9919 -17843 -24939 -7868
$$ packed form
14843a7115J4586K212K800n309K524p34l991l203R301J272J0902l312K079L794
14829A5806j7163j8968j457J3145K592n080Q343l617P536k30q270J90P979R847
14815A0653J4514n098j585o768p112p131k697M600l061K904j374K444R717k095
14801G911j8735L491N296m011Q368L961j989Mj3245L335n10j604Q067P040m190
14786C189L556J314n65J754o962j3642n563J3230J6875m262J568L974l868o982
14772C616p297n261K931k509j580N15j15p232Q41Q531N156M150p992M403M228
14757B385p654o42Q980k115j3343k981Q113k106J2448Q248M312N642J375q246
14743A4416k0127j7397P304L287j421o173j823J3987m370K398p924p096J7071
$$ plain form
14730 -7868 374 11579 7788 957 383 8368 7461 8144 2541 -17197 -22576 -25443 -21811 -12466 -10839
14715 -10839 -21272 -12931 -7648 -9387 -7165 -9200 -300 5820 9261 17404 21762 14077 10593 18528
14701 18528 18375 23023 23969 19156 25283 13453 -203 -16685 -22430 -21952 -21000 -21011 -22330 -39704 -30202
14686 -30202 510 21031 12811 1885 -12340 -6694 2798 16653 25665 31039 28117 17158 1251
14673 1251 -443 -3101 3747 5144 9286 4953 220 -9274 -10175 -3901 9319 14751 10054 12194 384
14658 384 -12277 -14776 1427 -4318 -8490 -10381 -18389 -19499 -9713 -7742 -13101 -9469 21548 24479
14644 24479 4505 9321 20163 7320 2992 14657 28076 28877 6137 -3447 3673 5777 11851
14631 11851 11458 -4277 -355 3020 3665 1240 1441 12311 6678 14528 20285 5728 3036 8869
$$ packed form
14730g868Q242J1205l791o831n74P985r07O83n603j9738n379k867L632R345J627
14715a0839j0433Q341N283j739K222k035Q900O120L441Q143M358p685l484P935
14701A8528j53M648R46m813O127j1830j3656j6482n745M78R52j1j319j7374R502
14686c0202L0712K0521q220j0926j4225N646R492J3855R012N374k922j0959j5907
14673A251j694k658O848J397M142m333m733r494r01O274J3220N432m697K140j1810
14658C84j2661k499J6203n745m172j891q008j110R786J971n359L632L1017K931
14644B4479j9974M816J0842j2843m328J1665J3419Q01k2740r584P120K104O074
14631A1851l93j5735L922L375O45k425K01J0870n633P850N757j4557k692N833
$$ plain form
14617 8869 3292 3701 2240 3386 372 -2466 4281 16672 25424 24710 25210 14142 1725 -2324 1313
14602 1313 2180 2975 7007 1259 -8144 -10183 2588 4042 -24900 -26936 -5202 -554 1209 -4195
14588 -4195 -7810 8279 10333 842 -7040 -9630 3278 11968 8142 2381 7673 10382 12294 3537
14574 3537 -3271 -11763 -23094 -27001 -16262 -8096 6129 8291 -2251 1889 6434 3291 -3925 -12505
14560 -12505 -16617 -18247 -19649 -8492 -1335 8983 9903 6321 3229 2126 7 8120 13575 3219
14546 3219 -167 -9915 -13504 4258 4018 8730 11519 -1152 -7902 -4473 -6477 -19116 -28513 -18715
14532 -18715 -19369 -11275 -2921 -6582 -3667 1821 1731 15132 19232 5315 -18516 -28113 -33073 -18799
14518 -18799 -12411 -8262 -6472 994 6211 9825 334 2638 -1323 -6648 -5178 -7021 -510 18184
$$ packed form
14617H869n577M09j461J146l014k838O747J2391Q752p14N00j1068j2417m049L637
14602A313Q67P95M032n748r403k039J2771J454k8942k036K1734M648J763n404
14588d195l615J6089K054r491p882k590J2908Q690l826n761N292K709J912q757
14574C537o808q492j1331l907J0739Q166J4225K162j0542M140M545l143p216q580
14560a2505m112j630j402J1157P157J0318R20l582l092j103k119Q113N455j0356
14546C219l386r748l589J7762k40M712K789j2671o750L429k004j2639r397R798
14532a8715o54Q094Q354l661K915N488r0J3401M100j3917k3831r597m960J4274
14518a8799O388M149J790P466N217L614r491K304l961n325J470j843O511J8694
$$ plain form
14504 18184 22309 -7806 -24043 -22286 -14822 1197 281 -9716 -12866 -15327 -15367 -19703 -3425 7329
14490 7329 5948 3199 -1998 -772 -984 -754 8776 8185 3843 -351 2539 7652 9886 6709 10749
14475 10749 2027 3927 1184 5638 7277 2723 16191 24514 13279 16031 10674 -4023 -598 5093
14461 5093 12264 1338 10568 10958 3887 -2947 1679 -4334 2220 7827 7791 2972 -10 3966 3273
14446 3273 -1556 -444 9253 12036 2863 12026 11314 11970 6216 4159 -11 -1390 -1798 3576 -1151
14431 -1151 -8924 -10980 -8393 -5875 -9867 -6653 3399 -12008 -10964 -243 -6687 -25905 -37252
14418 -37252 -29031 -27578 -24646 -18972 -17296 -11827 -7978 -2116 -10406 -9578 6756 22836 21234 13654
14404 13654 10144 10987 9492 8505 20488 10977 3632 -13267 -24810 -20551 -18572 -20438 -19871 -21579
$$ packed form
14504A8184M125l0115j6237J757P464J6019r16r997l150k461m0m336J6278J0754
14490G329j381k749n197J226k12K30R530n91m342m194K890N113K234l177M040
14475A0749q722J900k743M454J639m554J3468Q323j1235K752n357j4697L425N691
14461E093P171j0926R230L90p071o834M626o013O554N607l6m819k982L976o93
14446C273m829J112R697K783r173R163p12O56n754k057m170j379m08N374m727
14431a151p773k056K587K518l992L214J0052j5407J044J0721o444j9218j1347
14418c7252Q221J453K932N674J676N469L849N862q290Q28J6334J6080j602p580
14404A3654l510Q43j495r87J1983r511p345j6899j1543M259J979j866N67j708
$$ plain form
14390 -21579 -164 14197 11412 -609 -679 -8100 -13008 -1840 -484 -8973 -16787 -25817 -28286 -24487
14376 -24487 -5574 9935 8670 5152 2046 -11030 -24720 -27070 -24182 -14148 6013 13220 5671
14363 5671 -5945 -4608 417 -3580 -6044 2745 3573 2585 1802 -16294 -28227 -9227 3616 7638
14349 7638 -5512 -7647 4767 -6010 4682 11125 3884 5230 3758 1904 -159 8637 13129 6069
14335 6069 -273 -8168 -14107 -3176 6475 -899 -7517 -27653 -16477 643 6903 9619 3886 14964
14321 14964 29489 30685 26187 14892 8821 -2977 -1138 10778 7829 4375 8383 865 -11153
14308 -11153 -24142 -25033 -18561 -24034 -7472 8777 12613 12266 14492 -1185 -16404 -15713 1388 9400
14294 9400 6738 -5986 -4363 11694 9618 8454 13013 3675 -11855 -4367 1121 -11806 -7627 539
$$ packed form
14390b1579K1415J4361k785j2021p0p421m908J1168J356q489p814r030k469L799
14376b4487J8913J5509j265l518l106j3076j3690k350K888J0034K0161P207p549
14363E671j1616J337N025l997k464Q789Q28r88p83j8096j1933J9000J2843M022
14349G638j3150k135J2414j0777J0692O443p241J346j472j854k063Q796M492p060
14335F069o342p895n939J0931R651p374o618k0136J1176J7120O260K716n733J1078
14321A4964J4525J196m498j1295o071j1798J839J1916k949l454M008p518j2018
14308a1153j2989q91O472n473J6562J6249L836l47K226j5677j5219O91J7101Q012
14294I400k662j2724J623J6057k076j164M559r338j5530P488N488j2927M179Q166
$$ plain form
14280 539 3557 1350 -10515 -11128 -1872 -15990 -14272 1923 11288 3428 -1757 -231 -9421 -16234
14266 -16234 -10846 -8384 -2132 3052 12307 16819 -5228 -13990 -22880 -23989 -19231 -12187 -8029 -12809
14252 -12809 -9059 692 17464 13177 20667 17529 7769 9356 659 7156 21120 11862 3331 6785
14238 6785 -4843 -7757 4845 9789 9441 17102 -1344 1686 6241 2317 8993 5054 5198 -1946
14224 -1946 3224 9117 11818 10678 7806 6592 27564 22838 4662 -2126 -6072 9280 20189 6951
14210 6951 -1042 7595 7763 -4389 -7837 -4854 1622 12979 20433 27093 15312 19045 18187 18431 23269
14195 23269 11633 6282 -7030 -6659 -8472 6067 14029 3992 6275 6475 7273 23708 36736 26572
14181 26572 7816 1161 944 -608 -9579 -16715 -10311 2365 13723 -2980 -3804 27101 28352 16160
$$ packed form
14280E39L018k207j1865o13R256j4118J718J6195R365p860n185J526r190o813
14266a6234N388K462O252N184R255M512k2047q762q890j109M758P044M158m780
14252a2809L750R751J6772m287P490l138r760J587q697O497J3964r258q531L454
14238F785j1628k914J2602M944l48P661j8446L030M555l924O676l939J44p144
14224a946N170N893K701j140k872j214K0972m726j8176o788l946J5352J0909j3238
14210F951p993Q637J68j2152l448K983O476J1357P454O660j1781L733q58K44M838
14195B3269j1636n351j3312L71j813J4539P962j0037K283K00P98J6435J3028j0164
14181B6572j8756o655k17j552q971p136O404J2676J1358j6703q24L0905J251j2192
$$ plain form
14167 16160 10575 -5814 -6517 -6745 -3357 6399 -106 -8603 -8044 1721 17475 3750 -4252 4393
14153 4393 2951 7554 16626 12763 8734 3888 -5232 -324 8492 18526 13191 7068 7832 8976 19834
14138 19834 24570 7739 -882 -8945 -5481 6551 4127 -1829 11204 33234 28265 13201 7403
14125 7403 8917 1714 -14293 -15911 2350 4572 3820 -2203 1791 -5252 -16414 -13312 -3412 -2469
14111 -2469 14645 7057 -13363 5701 19772 17106 3168 -2710 -8015 676 9204 21627 18978
14098 18978 10806 15974 23074 24493 22838 22465 20287 12332 11147 5354 -1619 5244 -7002 -8651
14084 -8651 6574 12018 -9483 -11883 -9878 -10059 -21073 -9003 -8894 -1621 1227 4772 12175 15783
14070 15783 16584 17251 6201 -14158 -6589 -4136 8242 13812 12628 11238 24439 30110 19202 21498
$$ packed form
14167A6160n585j6389p03k28L388R756o505q497N59R765J5754j3725q002Q645
14153D393j442M603R072l863m029m846r120M908Q816J0034n335o123P64J144J0858
14138A9834M736j6831q621q063L464J2032k424n956J3033K2030m969j5064n798
14125G403J514p203j6007j618J8261K222p52o023L994p043j1162L102R900R43
14111b469J7114p588k0420J9064J4071k666j3938n878n305Q691Q528J2423k649
14098A8978q172N168P100J419j655l73k178p955j185n793o973O863j2246j649
14084h651J5225N444k1501k400K005j81j1014J2070J09P273K848L545P403L608
14070A5783Q01O67j1050k0359P569K453J2378N570j184j390J3201N671j0908K296
$$ plain form
14056 21498 23066 30047 29199 12311 9368 18566 31084 36738 20478 7041 14533 23245 20376 28004
14042 28004 31772 20203 21416 9561 2450 23646 30609 31533 35941 37067 40347 43600 55383 65091
14028 65091 65109 73977 72536 69590 70984 80737 90887 105281 130901 165416 213700 279807 362221
14015 362221 473698 622522 782992 952221 1138285 1326356 1482125 1563873 1608478 1600866
14005 1600866 1552446 1429476 1260276 1074262 904370 741793 579350 434954 348339 290589
13995 290589 245122 204890 162448 130860 104979 116181 112165 92119 79882 65390 54532 50761
13983 50761 50065 46180 35913 36168 37327 45934 32518 43960 40937 35160 39570 45700 53331 52407
13969 52407 38821 34173 22830 34827 42489 41104 42814 47717 48203 36464 20995 25652 20631
$$ packed form
14056B1498J568O981q48j6888k943R198J2518N654j6260j3437P492Q712k869P628
14042B8004L768j1569J213j1855p111K1196O963R24M408J126L280L253J1783R708
14028F5091J8Q868j441k946J394R753J0150J4394K5620L4515M8284O6107Q2414
14015C62221J11477J48824J60470J69229J86064J88071J55769Q1748M4605p612
14005A600866m8420j22970j69200j86014j69892j62577j62443j44396q6615n7750
13995B90589m5467m0232m2442l1588k5881J1202m016k0046j2237j4492j0858l771
13983E0761o96l885j0267K55J159Q607j3416J1442l023n777M410O130P631r24
13969E2407j3586m648j1343J1997P662j385J710M903M86j1739j5469M657n021
$$ plain form
13956 20631 23562 18280 15017 30548 40490 25632 20255 17218 35669 51049 48319 35604 26315
13943 26315 32136 30726 20635 10262 14239 18758 20866 16983 11511 3624 -7409 -7940 -681 12316
13929 12316 22728 2104 1566 7886 18902 15369 14862 21035 14735 8432 19535 18302 23837 22445
13915 22445 23322 18287 8002 13593 6717 544 3866 4475 15145 25364 13284 3119 -8784
13902 -8784 -7777 10054 7321 1439 -8327 -3087 -7437 -5048 1675 -11132 -7614 -1360 -639 -1631 367
13887 367 3788 9209 10198 15298 22849 28433 29519 26839 23367 21154 16645 24686 29505 31059 40368
13872 40368 42965 34935 26745 27270 36902 26536 24562 25365 24544 40975 46098 38468 42042 59537
13858 59537 46109 32048 32439 38708 47809 56858 45821 53402 51946 62469 61057 55527 52064 50643
$$ packed form
13956B0631K931n282l263J5531R942j4858n377l037J8451J5380k730j2715r289
13943B6315N821j410j0091j0373L977M519K108l883n472p887j1033n31P259J2997
13929A2316J0412k0624n38O320J1016l533n07O173o300o303J1103j233N535j392
13915B2445Q77n035j0285N591o876o173L322O09J0670J0219j2080j0165j1903
13902h784J007J7831k733n882r766N240m350K389O723j2807L518O254P21r92J998
13887C67L421N421R89N100P551N584J086k680l472k213m509Q041M819J554R309
13872D0368K597q030q190N25R632j0366j974Q03q21J6431N123p630L574J7495
13858E9537j3428j4061L91O269R101R049j1037P581j456J0523j412n530l463j421
$$ plain form
13844 50643 41289 42531 51155 52751 38525 39060 36128 26520 31196 24453 17468 18645 15834 15166 24806
13829 24806 25300 29618 35856 25820 22009 20871 36689 39718 43861 47184 34548 25728 18734 18071
13815 18071 6481 -2831 2277 27139 27005 24442 25501 30613 28432 18089 11291 9534 -1075 -1413
13801 -1413 -576 -3481 -8557 -16556 -22162 -13774 1804 22575 26178 16691 14160 2606 -3445 -3472 -559
13786 -559 4755 3393 5700 3038 -8297 -5516 2036 13864 3640 6 -1695 4479 16996 22025
13772 22025 15077 15225 19639 8782 11079 12482 18276 22925 26544 22731 15483 15984 25997 32552
13758 32552 26229 24014 21811 17373 9813 17648 20963 11341 12269 17152 25763 36265 37786 33039
13744 33039 30547 18364 4116 -6329 3989 10445 13164 15938 5165 8495 10253 23450 17341
$$ packed form
13844E0643r354J242Q624J596j4226N35k932r608M676o743o985J177k811o68R640
13829B4806M94M318O238j0036l811j138J5818L029M143L323j2636q820o994o63
13815A8071j1590r312N108K4862j34k563J059N112k181j0343o798j757j0609l38
13801a413Q37k905n076p999n606Q388J5578K0771L603r487k531j1554o051k7K913
13786e59N314j362K307k662j1335K781P552J1828j0224l634j701O174J2517N029
13772B2025o948J48M414j0857K297J403N794M649L619l813p248N01J0013O555
13758C2552o323k215k203m438p560P835L315r622R28M883Q611J0502J521m747
13744C3039k492j2183j4248j0445J0318O456K719K774j0773L330J758J3197o109
$$ plain form
13731 17341 5559 7006 19714 32632 38676 30227 21925 15182 11776 20054 30009 36457 28160 1408
13717 1408 11826 25024 30993 26649 22680 31426 35224 41361 53040 54667 54981 49535 38908 38612
13703 38612 24689 43680 61577 66174 65405 70011 69296 58879 60619 66186 66710 56101 32226 23156
13689 23156 18499 6084 19155 43747 50646 36773 21625 31395 45799 28110 35927 41790 30869
13676 30869 23633 17091 16784 23396 26319 22914 29621 30755 13799 9323 13380 20592 29648 29459 23045
13661 23045 16256 12751 16026 15305 13258 25025 32243 30736 19501 -3276 -2131 17674 9666 5418
13647 5418 18097 25382 16865 23345 20220 12777 25432 35655 32534 29507 26207 15583 20124 17723
13633 17723 17742 23570 29023 29382 17157 12509 16918 16311 11040 19828 21989 26281 36767 42328 41176
$$ packed form
13731A7341j1782J447J2708J2918O044q449q302o743l406Q278R955O448q297k6752
13717A408J0418J3198N969m344l969Q746L798O137J1679J627L14n446j0627k96
13703C8612j3923J8991J7897M597p69M606p15j0417J740N567N24j0609k3875r070
13689B3156m657j2415J3071K4592O899j3873j5148R770J4404j7689P817N863j0921
13676C0869p236o542l07O612K923l405O707J134j6956m476M057P212R056j89o414
13661B3045o789l505L275p21k047J1767P218j507j1235k2777J145J9805q008m248
13647E418J2679P285q517O480l125p443J2655J0223l121l027l300j0624M541k401
13633A7723J9N828N453L59j2225m648M409o07n271Q788K161M292J0486N561j152
$$ plain form
13618 41176 33698 15198 16224 23538 28488 34526 34641 27319 34471 37686 27970 14033 6391 -4156
13604 -4156 8722 18180 22383 29052 30477 20993 15013 17001 17892 26467 39903 34342 31780 33739
13590 33739 43328 42493 39309 19037 16293 20618 14695 13055 10967 30789 45723 42138 28774 13865
13576 13865 12412 25892 36662 44216 33472 5471 3455 1200 -1093 6900 25066 29921 34003
13563 34003 34107 40361 46581 49582 42482 34852 26137 24858 41660 58148 57074 36088 24934 21182
13549 21182 28316 30306 30070 21593 15618 16043 19323 25103 14314 8844 18606 1766 4462 17069
13535 17069 12163 7733 9328 11788 17650 16594 17233 18348 3820 6604 20695 27205 17494 12840
13521 12840 20209 27481 30879 26056 21726 23454 31002 31404 29765 25391 22884 21175 19388 5968
$$ packed form
13618D1176p478j8500J026P314M950O038J15p322P152L215r716j3937p642j0547
13604d156J2878R458M203O669J425r484n980J988Q91Q575J3436n561k562J959
13590C3739R589q35l184k0272k744M325n923j640k088J9822J4934l585j3364j4909
13576A3865j453J3480J0770P554j0744k8001k016k255k293P993J8166M855M082
13563C4003J04O254O220L001p100p630q715j279J6802J6488j074k0986j1154l752
13549B1182P134J990k36q477n975M25L280N780j0789n470R762j6840K696J2607
13535A7069m906m430J595K460N862j056O39J115j4528K784J4091O510r711m654
13521A2840P369P272L398m823m330J728P548M02j639m374k507j709j787j3420
$$ plain form
13507 5968 12655 21140 18867 7567 11139 17369 3735 2411 25080 30784 26721 19903 19069 26310
13493 26310 12789 -2045 -13032 -6992 5191 13730 28855 22934 17011 11585 7833 10031 18299
13480 18299 18750 11633 12198 19995 6644 12270 16685 26350 29802 13892 12607 19620 22539 28545
13466 28545 32447 31289 31906 20168 21856 25484 23578 31058 30930 28311 25956 26627 16609 11021 19760
13451 19760 28175 18199 19821 29429 42717 47975 32877 24971 41726 37560 31281 38554 54200
13438 54200 57785 51202 48636 44929 38727 44939 43902 37026 26393 32931 51926 61132 67108 64669
13424 64669 62653 67759 75092 81859 93266 114469 135873 154927 183556 207361 252715 307055
13412 307055 341776 378509 400207 385196 380270 376890 359635 325309 287190 259607 240351 234952
$$ packed form
13507E968O687Q485k273j1300L572O230j3634j324K2669N704m063o818q34P241
13493B6310j3521j4834j0987O040J2183Q539J5125n921n923n426l752K198Q268
13480A8299M51p117N65P797j3351N626M415R665L452j5910j285P013K919O006
13466B8545L902j158O17j1738J688L628j906P480j28k619k355O71j0018n588Q739
13451A9760Q415r976J622R608J3288N258j5098p906J6755m166o279P273J5646
13438E4200L585o583k566l707o202O212j037o876j0633O538J8995R206N976k439
13424F4669k016N106P333O767J1407K1203K1404J9054K8629K3805M5354N4340
13412C07055L4721L6733K1698j5011m926l380j7255l4326l8119k7583j9256n399
$$ plain form
13400 234952 231455 242149 262294 295369 329992 362079 399766 431227 455493 466294 467105 457981
13388 457981 433118 390685 337649 287729 239877 205662 171383 155315 134473 113308 101198
13377 101198 95042 97149 98557 81966 70684 61149 53501 38778 34678 29422 29735 26106 25581 36654
13363 36654 42666 47389 47859 53117 65273 67325 66884 58183 56995 58725 56250 57264 59854 61838 66049
13348 66049 61894 57044 55746 66822 74465 81870 79785 74327 88588 88925 85786 95581 100700 94939
13334 94939 107870 124318 119166 137120 154037 195796 240935 281828 318276 348485 381567 421145
13322 421145 443242 451381 430868 397662 379323 347481 335687 339680 334647 330991 317708 333576
13310 333576 364728 428486 484787 519705 553112 575816 574416 562407 543158 516438 480278 427280
$$ packed form
13400B34952l497J0694K0145L3075L4623L2087L7687L1461K4266J0801Q11r124
13388D57981k4863m2433n3036m9920m7852l4215l4279j6068k0842k1165j2110
13377A01198o156K107J408j6591j1282r535p648j4723m100n256L13l629n25J1073
13363C6654O012M723M70N258J2156K052m41q701j188J730k475J014K590J984M211
13348F6049m155m850j298J1076P643P405k085n458J4261L37l139R795N119n761
13334I4939J2931J6448n152J7954J6917M1759M5139M0893L6448L0209L3082L9578
13322D21145K2097Q139k0513l3206j8339l1842j1794L993n033l656j3283J5868
13310C33576L1152O3758N6301L4918L3407K2704j400j2009j9249k6720l6160n2998
$$ plain form
13298 427280 374074 326658 282962 236221 216747 205170 180190 156732 144382 142107 144846 136836
13286 136836 118611 104092 103875 105459 108911 106617 103683 101922 94673 97393 97370 93346 89155 95657
13272 95657 89920 82491 75775 73158 72418 78396 75768 90958 90969 98317 103100 99454 97561 93069 92647
13257 92647 97468 90332 88741 100632 113712 104659 100564 104819 103912 97220 97260 94297 119113 133578
13243 133578 131251 117587 107019 101037 122059 122035 116863 120227 132069 136553 134544 141953 135476 116184
13229 116184 111153 116496 113502 108528 119407 130420 129559 134834 135688 145657 143787 157142 152031 150773
13215 150773 143751 151823 153508 139469 143511 154662 149598 141093 148765 157925 142444 145036 149632
13202 149632 153234 168859 172168 156588 152292 148493 138472 142807 129400 131503 157497 180088 191853
$$ packed form
13298D27280n3206m7416m3696m6741j9474j1577k4980k3458j2350k275K739q010
13286A36836j8225j4519k17J584L452k294k934j761p249K720k3m024m191O502
13272I5657n737p429o716k617p40N978k628J5190J1P348M783l646j893m492m22
13257I2647M821p136j591J1891J3080r053m095M255r07o692M0k963K4816J4465
13243A33578k327j3664j0568n982K1022k4n172L364J1842M484k009P409o477j9292
13229A16184n031N343k994m974J0879J1013q61N275Q54R969j870J3355n111j258
13215A50773p022Q072J685j4039M042J1151n064q505P672R160j5481K592M596
13202A49632L602J5625L309j5580m296l799j0021M335j3407K103K5994K2591J1765
$$ plain form
13189 191853 201122 200892 206277 216302 220424 216632 198607 200208 208991 211450 208733 194362 182421
13176 182421 180492 170508 173431 180748 182896 176854 159364 148848 148985 147794 157833 175906 174060
13163 174060 161926 161295 165231 171748 161764 150634 157083 162901 161428 154649 164765 174408 175884 166398
13149 166398 163079 169351 156619 149070 155017 171252 167792 174977 175089 179126 167163 171154 191389
13136 191389 206935 214671 222793 225261 210147 195351 175978 158010 156807 156243 143951 133163 132927
13123 132927 134088 133312 130702 135844 131688 125317 130900 124045 115069 113342 103932 97947 101399 111487
13109 111487 121864 119887 108304 99591 99117 100233 95172 113472 133118 126340 118132 116500 119035
13096 119035 117722 111408 127952 136924 132161 145615 162028 172462 173328 168375 155031 120748 99470
$$ packed form
13189A91853R269k30N385J0025M122l792j8025J601Q783K459k717j4371j1941
13176A82421j929r984K923P317K148o042j7490j0516J37j191J0039J8073j846
13163A74060j2134o31L936O517r984j1130O449N818j473o779J0116R643J476r486
13149A66398l319O272j2732p549N947J6235l460P185J12M037j1963L991K0235
13136A91389J5546P736Q122K468j5114j4796j9373j7968j203n64j2292j0788k36
13123A32927J161p76k610N142m156o371N583o855q976j727r410n985L452J0088
13109A11487J0377j977j1583q713m74J116n061J8300J9646o778q208j632K535
13096A19035j313o314J6544Q972m763J3454J6413J0434Q66m953j3344l4283k1278
$$ plain form
13083 99470 93395 82707 75783 82816 86112 75618 59649 62551 75390 84101 75762 73645 72121
13070 72121 60878 65181 77466 76765 95656 105452 90605 59397 46725 46874 46711 37505 38774 48615
13056 48615 47321 48557 48199 48852 48694 52130 51989 50944 49049 49052 52337 58047 68141 77158 72804 62688
13040 62688 54292 52510 47306 46392 43473 41251 46820 43732 27698 14258 11732 5285 7691 17681
13026 17681 18365 9616 15228 30792 47495 57550 79249 97345 97385 100287 113927 128477 131121
13013 131121 124202 122681 114336 107175 108987 116259 109788 91641 82219 79591 101006 120195 128148
13000 128148 133698 136290 131566 136792 150273 177994 198843 226691 253844 291508 351971 432063
12988 432063 513834 590726 690913 788695 877213 928724 925439 892237 830573 730676 628960
$$ packed form
13083I9470o075j0688o924P033L296j0494j5969K902J2839Q711q339k117j524
13070G2121j1243M303J2285p01J8891R796j4847l1208j2672J49j63r206J269R841
13056D8615j294J236l58O53j58L436j41j045j895LL285N710J0094R017m354j0116
13040F2688q396j782n204r14k919k222N569l088j6034j3440k526o447K406R990
13026A7681O84q749N612J5564J6703J0055K1699J8096M0K902J3640J4550K644
13013A31121o919j521q345p161J812P272o471j8147r422k628K1415J9189P953
13000A28148N550K592m724N226J3481K7721K0849K7848K7153L7664O0463Q0092
12988D32063Q1771P6892J00187R7782Q8518N1511l285l3202o1664r9897j01716
$$ plain form
12977 628960 530760 432453 373207 310240 254879 217675 194721 174387 160772 142546 132649 129035
12965 129035 116729 117371 123835 116495 93182 82162 87734 84369 76426 67043 62484 58036 65523 72872
12951 72872 72100 52832 61882 79253 72606 66108 69869 67660 72431 68695 61614 53512 49664 55201
12937 55201 68167 85963 68894 65686 77049 81044 68901 75629 80520 71627 71718 71652 73701 77696
12923 77696 72005 67102 71813 80415 111468 143916 175773 195643 225995 269227 310793 342866
12911 342866 362636 369708 361593 334954 295416 257013 214926 178672 164348 144910 123732 108388
12899 108388 108137 101198 80036 65552 62551 46685 32153 40286 46256 49179 44810 60460 68702
12886 68702 71935 79826 76062 71227 68689 69174 55733 44672 48739 53016 54402 50454 36915 27968
$$ packed form
12977F28960r8200r8307n9246o2967n5361l7204k2954k0334j3615j8226r897l614
12965A29035j2306O42O464p340k3313j1020N572l365p943r383m559m448P487P349
12951G2872p72j9268R050J7371o647o498L761k209M771l736p081q102l848N537
12937E5201J2966J7796j7069l208J1363L995j2143O728M891q893R1o6K049L995
12923G7696n691m903M711Q602L1053L2448L1857J9870L0352M3232M1566L2073
12911C42866J9770P072q115k6639l9538l8403m2087l6254j4324j9438k1178j5344
12899A08388k51o939k1162j4484l001j5866j4532Q133N970K923m369J5650Q242
12886F8702L233P891l764m835k538M85j3441j1061M067M277J386l948j3539q947
$$ plain form
12872 27968 23414 5849 23900 24750 23830 24061 36120 51225 70220 70793 80181 76027 74963 77136
12858 77136 73967 68134 55528 44026 50129 59650 64982 57767 55031 45027 49916 78806 98648
12845 98648 96513 90923 88116 96944 104720 122403 140427 175213 235475 346176 515252 605738
12833 605738 548054 405741 284122 204638 163303 148825 144301 141217 123891 123832 123322 126505 147683
12820 147683 158492 159625 165933 177107 191638 203342 197158 186472 170606 149097 129525 120286
12808 120286 109417 110692 117304 115624 126768 141054 139213 128154 148680 151458 149951 156731 147798
12795 147798 134698 131554 125690 120628 110598 93928 94865 93276 89447 82186 77141 75581 80384 80661
12781 80661 91483 101118 98119 96965 101964 85485 67164 69078 95213 104534 100553 111638 119359
$$ packed form
12872B7968m554j7565J8051Q50r20K31J2059J5105J8995N73R388m154j064K173
12858G7136l169n833j2606j1502O103R521N332p215k736j0004M889K8890J9842
12845I8648k135n590k807Q828P776J7683J8024L4786O0262J10701J69076R0486
12833F05738n7684j42313j21619p9484m1335j4478m524l084j7326n9n10L183K1178
12820A47683J0809J133O308J1174J4531J1704o184j0686j5866k1509j9572r239
12808A20286j0869J275O612j680J1144J4286j841j1059K0526K778j507O780q933
12795A47798j3100l144n864n062j0030j6670R37j589l829p261n045j560M803K77
12781H0661J0822R635k999j154M999j6479j8321J914K6135R321l981J1085P721
$$ plain form
12768 119359 110881 113185 116414 126990 115027 95141 81516 98941 110802 105211 104687 108286 112819
12755 112819 110393 102354 114040 129092 124815 115350 112483 104073 102312 103010 112299 108445 111090 118321
12741 118321 138950 161183 188481 200250 192253 176799 171409 156783 162627 172928 171908 171980 157978
12728 157978 149809 155266 138659 129539 140942 142409 151710 150129 151458 153840 147567 164434 170536
12715 170536 170807 182042 196116 203466 198954 194467 182750 181053 171750 171855 178102 174429 184858 194376
12701 194376 195794 204480 210272 208201 191435 180770 195121 224705 253108 285856 313427 344589
12689 344589 381145 411095 433683 443225 446509 451196 435498 416304 391180 353556 334064 324470
12677 324470 323861 323534 320365 306452 299867 305449 301550 307725 313463 316701 322374 322962 340480 377972
$$ packed form
12768A19359q478K304L229J0576j1963j9886j3625J7425J1861n591n24L599M533
12755A12819k426q039J1686J5052m277r465k867q410j761O98R289l854K645P231
12741A18321K0629K2233K7298J1769p997j5454n390j4626N844J0301j020P2j4002
12728A57978q169N457j6607r120J1403J467R301j581J329K382o273J6867O102
12715A70536K71J1235J4074P350m512m487j1717j697r303J05O247l673J0429R518
12701A94376J418Q686N792k071j6766j0665J4351K9584K8403L2748K7571L1162
12689C44589L6556K9950K2588R542L284M687j5698j9194k5124l7624j9492r594
12677C24470o09l27l169j3913o585N582l899O175N738L238N673N88J7518L7492
$$ plain form
12663 377972 408277 410848 417249 398130 386224 379105 393537 412937 407546 405950 407908 396190 393986
12650 393986 396670 405794 412392 416215 421743 426547 423333 430040 437123 450126 453415 467390 493140
12637 493140 511107 521230 538171 546480 561710 579648 602915 629623 653898 678405 696973 740070
12625 740070 795317 842697 906136 997798 1128991 1327075 1582683 1787698 1808465 1664522
12615 1664522 1480104 1330632 1228250 1183017 1163987 1164845 1189511 1205622 1219101 1244018 1273309
12604 1273309 1327152 1377157 1431524 1506537 1596247 1681705 1783787 1897944 2016107 2149191
12594 2149191 2290334 2435039 2600063 2781178 2980845 3209768 3466955 3770350 4131713
12585 4131713 4578192 5130222 5815735 6635866 7595535 8689282 9912924 11239216 12680090
$$ packed form
12663C77972L0305K571O401j9119j1906p119J4432J9400n391j596J958j1718k204
12650C93986K684R124O598L823N528M804l214O707P083J3003L289J3975K5750
12637D93140J7967J0123J6941Q309J5230J7938K3267K6708K4275K4507J8568M3097
12625G40070N5247M7380O3439R1662J31193J98084K55608K05015K0767j43943
12615A664522j84418j49472j02382m5233j9030Q58K4666J6111J3479K4917K9291
12604A273309N3843N0005N4367P5013Q9710Q5458J02082J14157J18163J33084
12594B149191J41143J44705J65024J81115J99667K28923K57187L03395L61363
12585D131713M46479N52030O85513Q20131R59669J093747J223642J326292J440874
$$ plain form
12576 12680090 14326875 16294280 18788294 22154752 26981007 34052957 44141613 57506585
12568 57506585 73716871 91924460 111115925 129828069 145884795 157192303 162599519
12561 162599519 161770559 154719809 142017970 125293034 106736878 88187349 70867441
12554 70867441 55747702 43542698 34407146 27916896 23349823 20049889 17534658 15532893
12546 15532893 13836081 12319534 10947717 9696881 8570876 7548476 6638135 5853970
12538 5853970 5189646 4629224 4154301 3753226 3400645 3107527 2845951 2623578 2426585
12529 2426585 2241690 2101621 1990193 1858017 1733055 1634128 1555407 1482577 1426841 1364784
12519 1364784 1292809 1230484 1175656 1122510 1073155 1024895 976983 936209 899565 872950 847632
$$ packed form
12576A2680090J646785J967405K494014L366458M826255P071950J0088656J3364972
12568E7506585J6210286J8207589J9191465J8712144J6056726J1307508N407216
12561A62599519q28960p050750j2701839j6724936j8556156j8549529j7319908
12554G0867441j5119739j2205004r135552o490250m567073l299934k515231k001765
12546A5532893j696812j516547j371817j250836j126005j022400r10341p84165
12538E853970o64324n60422m74923m01075l52581k93118k61576k22373j96993
12529B426585j84895j40069j11428j32176j24962r8927p8721p2830n5736o2057
12519A364784p1975o2325n4828n3146m9355m8260m7912m0774l6644k6615k5318
$$ plain form
12508 847632 805597 785916 777442 761266 738199 734927 739056 750443 769871 797567 815369 828246
12496 828246 837046 847616 842703 838971 821678 801219 765876 739161 738229 736316 736295 757107 790098
12483 790098 807700 812697 821625 831162 835440 816079 786360 750045 712448 667349 610284 548042
12471 548042 487117 448013 415040 387593 356549 330139 309855 285801 273318 271260 268477 279608
12459 279608 276760 269027 245495 243835 248475 227584 227685 235373 232151 228082 230813 217302 218704 226071
12445 226071 226497 231507 219848 201074 186712 183139 165827 164263 170145 179557 195342 209001 209414
12432 209414 213205 222390 235789 239399 239038 241956 236735 234711 236583 222946 198317 193451 210054
12419 210054 216332 204697 193174 186871 187864 181110 157840 147610 146544 148636 156117 153435 155722
$$ packed form
12508H47632m2035j9681q474j6176k3067l272M129J1387J9428K7696J7802J2877
12496H28246Q800J0570m913l732j7293k0459l5343k6715r32j913k1K0812L2991
12483G90098J7602M997Q928R537M278j9361k9719l6315l7597m5099n7065o2242
12471E48042o0925l9104l2973k7447l1044k6410k0284k4054j2483k058k783J1131
12459B79608k848p733k3532j660M640k0891J01P688l222m069K731j3511J402P367
12445B26071M26N010j1659j8774j4362l573j7312j564N882R412J5785J3659M13
12432B09414L791R185J3399L610l61K918n221k024J872j3637k4629m866J6603
12419B10054O278j1635j1523o303R93o754k3270j0230j066K092P481k682K287
$$ plain form
12406 155722 170656 170909 176509 197897 210163 219584 245182 263771 262861 271241 291548 313498 329706
12393 329706 343528 370902 397616 417305 456307 496355 521954 566666 607889 645276 670803
12382 670803 691039 708061 721277 726385 729186 714333 673776 638619 601158 551940 512255 493447
12370 493447 466922 416549 363891 331899 307915 285733 280625 283856 280700 281740 280201 279907 282856
12357 282856 279312 276571 276320 286798 297106 290562 286875 287600 285676 319071 357598 384951 420577
12344 420577 459745 503760 557231 607941 677476 767140 877692 1028383 1211373 1425096 1654211
12333 1654211 1894788 2124724 2322762 2503810 2612866 2642933 2605445 2493652 2305046 2084744
12323 2084744 1848953 1609269 1370227 1167285 1004521 856969 724414 635480 574861 524461
$$ packed form
12406A55722J4934K53N600K1388J2266R421K5598J8589r10Q380K0307K1950J6208
12393C29706J3822K7374K6714J9689L9002M0048K5599M4712M1223L7387K5527
12382F70803K0236J7022J3216N108K801j4853m0557l5157l7461m9218l9685j8808
12370D93447k6525n0373n2658l1992k3984k2182n108L231l156J040j539k94K949
12357B82856l544k741k51J0478J0308o544l687P25j924L3395L8527K7353L5626
12344D20577L9168M4015N3471N0710O9535Q9664J10552J50691J82990K13723K29115
12333A654211K40577K29936J98038J81048J09056L0067l7488j11793j88606k20302
12323B084744k35791k39684k39042k02942j62764j47552j32555q8934o0619n0400
$$ plain form
12313 524461 482637 460967 418186 381654 360771 337225 307839 284769 255166 248487 234879 223647
12301 223647 208171 194291 188201 177917 185645 191579 186842 184687 200121 230606 246017 246019 244270
12288 244270 244530 239862 224219 207457 195907 185311 181031 171374 160932 161031 138752 125658 125203
12275 125203 139132 145886 148480 150929 151107 136328 130569 140593 151380 131714 106927 85361 86959
12262 86959 81040 85490 92001 101610 109322 124068 136768 144964 154609 144576 137147 145261 163215
12249 163215 167269 171419 175573 159447 144439 143950 149735 150995 146647 143507 156233 157263 168809
12236 168809 179111 190084 201748 228403 274826 333180 387256 443146 500901 567175 634136
12225 634136 675154 701302 686181 629846 563336 500822 429685 386520 332959 308966 286024
$$ packed form
12313E24461m1824k1670m2781l6532k0883k3546k9386k3070k9603o679j3608j1232
12301B23647j5476j3880o090j0284P728N934m737k155J5434L0485J5411Kj749
12288B44270K60m668j5643j6762j1550j0596m280r657j0442R9k2279j3094m55
12275A25203J3929O754K594K449J78j4779n759J0024J0787j9666k4787k1566J598
12262H6959n919M450O511R609P712J4746J2700Q196R645j0033p429Q114J7954
12249A63215M054M150M154j6126j5008m89N785J260m348l140J2726J030J1546
12236A68809J0302J0973J1664K6655M6423N8354N4076N5890N7755O6274O6961
12225F34136M1018K6148j5121n6335o6510o2514p1137m3165n3561k3993k2942
$$ plain form
12214 286024 279778 271871 267976 263837 241988 230769 224217 221739 202260 172855 159484 147574 125771
12201 125771 100077 87133 95312 103539 97956 94792 104206 103234 94964 95510 98785 103204 87487 85822
12187 85822 84778 90837 87471 76410 68862 67028 65730 54045 63945 79053 94862 94310 104330
12174 104330 101719 107752 112266 120822 132673 154396 173866 218296 291619 366234 440452 524793
12162 524793 607190 644611 634510 575902 489979 425874 366222 309383 273920 238915 234256 245191
12150 245191 246344 250766 253625 266985 277867 320963 368232 447371 551795 693493 868374
12139 868374 1048513 1205865 1328145 1391598 1374972 1304114 1193927 1051145 890586 750779
12129 750779 617288 514217 428461 363585 305770 266338 235353 198889 166074 135414 120520
$$ packed form
12214B86024o246p907l895m139k1849j1219o552k478j9479k9405j3371j1910k1803
12201A25771k5694j2944Q179Q227n583l164R414r72q270N46L275M419j5717j665
12187H5822j044O059l366j1061p548j834j298j1685R900J5108J5809n52J0020
12174A04330k611O033M514Q556J1851K1723J9470M4430P3323P4615P4218Q4341
12162E24793Q2397L7421j0101n8608q5923o4105n9652n6839l5463l5005m659J0935
12150B45191J153M422K859J3360J0882M3096M7269P9139J04424J41698J74881
12139H68374J80139J57352J22280O3453j6626p0858j10187j42782j60559j39807
12129G50779j33491j03071q5756o4876n7815l9432l0985l6464l2815l0660j4894
$$ plain form
12118 120520 111433 83936 64521 68862 65276 48772 41670 43697 33206 19377 10043 9558 15726
12105 15726 18852 26395 53555 64174 76757 74289 76674 79549 79434 80037 94337 110777 111862 100690
12091 100690 85086 87554 93955 98305 93755 94738 103461 108706 120820 136289 163787 199928 244041
12078 244041 300590 361163 417340 471803 482697 442787 386518 329061 276539 242614 210516
12067 210516 170838 133266 121427 115166 108408 93596 78228 74486 76251 70411 58739 59839 59042
12054 59042 53221 54403 60774 51641 53350 50144 44415 39545 58366 77620 73513 53510 65866
12041 65866 71398 67846 79512 107467 113297 109791 108204 111161 116623 115921 116926 107871 96409 82496
12027 82496 72768 76810 75120 76608 76645 78360 96324 97410 81706 74966 63882 53183 50635 67898
$$ packed form
12118A20520r087k7497j9415M341l586j6504p102K027j0491j3829r334m85O168
12105A5726L126P543K7160J0619J2583k468K385K875j15O03J4300J6440J085j1172
12091A00690j5604K468O401M350m550R83Q723N245J2114J5469K7498L6141M4113
12078B44041N6549O0573N6177N4463J0894l9910n6269n7457n2522l3925l2098
12067B10516l9678l7572j1839o261o758j4812j5368l742J765n840j1672J100p97
12054E9042n821J182O371r133J709l206n729m870J8821J9254m107k0003J2356
12041F5866N532l552J1666K7955N830l506j587K957N462p02J005r055j1462j3913
12027H2496r728M042j690J488L7J715J7964J086j5704o740j1084j0699k548J7263
$$ plain form
12013 67898 64999 59724 55442 43105 38535 32917 30376 24594 42585 43248 31172 19432 35118
12000 35118 41528 33028 28125 28419 28288 26661 19572 19487 25238 39057 58484 55448 40418 37357 52246
11985 52246 49796 30782 10866 12478 25454 42399 53754 47919 50110 58020 40258 24635 19951
11972 19951 15886 28314 39181 29085 13680 5511 7133 5333 -6836 -118 12712 19890 26723
11959 26723 37873 41534 23850 23371 39256 34014 20806 5496 12201 26212 25220 28512 24959
11946 24959 15538 25044 37516 43174 39787 30583 27332 31331 40757 45325 51462 55902 38894 19906
11932 19906 30480 27736 23768 14132 15258 23308 18696 25677 40839 47719 32406 25515 20252 18736
11918 18736 29083 30776 44420 62042 74106 84885 90704 97603 116312 135504 150797 153735
$$ packed form
12013F7898k899n275m282j2337m570n618k541n782J7991O63j2076j1740J5686
12000C5118O410q500m903K94j31j627p089q5N751J3819J9427l036j5030l061J4889
11985E2246k450j9014j9916J612J2976J6945J1355n835K191P910j7762j5623m684
11972A9951m065J2428J0867j0096j5405q169J622j800j2169O718J2830P178O833
11959B6723J1150L661j7684m79J5885n242j3208j5310O705J4011r92L292l553
11946B4959r421R506J2472N658l387r204l251L999R426M568O137M440j7008j8988
11932A9906J0574k744l968r636J126Q050m612O981J5162O880j5313o891n263j516
11918A8736J0347J693J3644J7622J2064J0779N819O899J8709J9192J5293K938
$$ plain form
11906 153735 153782 180504 205529 231262 287898 361019 464420 639891 947356 1510886 2581004
11895 2581004 4189693 5319671 5074833 3818713 2450743 1516265 999062 712532 536373
11886 536373 424117 349299 293478 264605 245246 214361 187659 176130 167885 159846 150036 123986
11874 123986 111940 107637 104850 98436 85353 66474 51523 49623 50300 54973 51233 36871 32941
11861 32941 45834 59380 63223 59288 50218 42472 43087 42389 55275 54274 39198 36755 38103 32336
11847 32336 38130 46421 50311 48166 36150 18047 10900 18346 24864 30795 34418 11541 -2428
11834 -2428 8372 15801 15650 14103 21780 28326 36029 32353 33157 25716 45443 55788 59234 51607
11820 51607 42549 57013 51819 41779 58337 63444 56793 59253 56664 51405 50815 57663 65974 67107
$$ packed form
11906A53735M7K6722K5025K5733N6636P3121J03401J75471L07465N63530J070118
11895B581004J608689J129978k44838j256120j367970r34478n17203k86530j76159
11886E36373j12256p4818n5821k8873j9359l0885k6702j1529q245q039r810k6050
11874A23986j2046m303k787o414j3083j8879j4951j900O77M673l740j4362l930
11861C2941J2893J3546L843l935r070p746O15o98J2886j001j5076k443J348n767
11847C2336N794Q291L890k145j2016j8103p147P446O518N931L623k2877j3969
11834b428J0800P429j51j547P677O546P703l676Q04p441J9727J0345L446p627
11820E1607r058J4464n194j0040J6558N107o651K460k589n259n90O848Q311J133
$$ plain form
11806 67107 43285 28776 22836 20956 20170 13348 12378 11291 19653 25683 35544 40414 47130 46472 33511
11791 33511 35436 30679 22512 27196 38501 35637 35702 33897 33899 35106 17479 4167 -6460 -2693 8340
11776 8340 17780 27962 21599 10156 8749 7585 -1436 11969 23004 9212 4975 20760 19000
11763 19000 23876 47646 63756 70821 67223 56458 40275 40710 35059 27606 16679 14629 18407
11750 18407 28434 37518 34543 36830 37381 41324 40499 37917 40515 46956 40963 11255 17762 33173
11736 33173 34258 29194 24220 19012 12236 16229 13168 13857 10012 6936 -8491 -1770 5835 2022
11722 2022 3614 -4527 -11119 6488 21541 19733 18305 12702 16236 16406 24276 18813 18456 25243 22963
11707 22963 24602 35327 37840 33253 43087 58761 54274 35236 41452 46274 44225 44742 49161 37769
$$ packed form
11806F7107k3822j4509n940j880p86o822r70j087Q362O030R861M870O716o58j2961
11791C3511J925m757q167M684J1305k864O5j805KJ207j7627j3312j0627L767J1033
11776H340R440J0182o363j1443j407j164r021J3405J1035j3792m237J5785j760
11763A9000M876K3770J6110P065l598j0765j6183M35n651p453j0927k050L778
11750A8407J0027R084k975K287N51L943q25k582K598O441n993k9708O507J5411
11736C3173J085n064m974n208o776L993l061O89l845l076j5427O721P605l813
11722B022J592q141o592J7607J5053j808j428n603L534J70P870n463l57O787k280
11707B2963J639J0725K513m587R834J5674m487j9038O216M822k049N17M419j1392
$$ plain form
11693 37769 26375 23563 13738 8452 11356 13680 16423 23673 19106 26725 27761 30239 27165 21126
11679 21126 19585 26143 32865 29728 34176 31140 37610 42255 35597 21949 8442 5171 7432 9170
11665 9170 13452 19341 27838 36245 35070 37246 38981 44414 44444 32691 31451 26199 19590 30826 36632
11650 36632 19574 9376 17019 34239 38262 31464 30767 16940 14003 17888 32010 48692 51570
11637 51570 41554 29386 20196 29706 41117 48503 54698 59601 63053 57838 53011 44017 42840 38140
11623 38140 43045 40258 41683 32994 23268 23072 31070 21275 15007 20626 20517 22330 29999 36099 36117
11608 36117 32591 33207 24803 21661 33788 34606 40722 51019 56437 50548 45690 32507 30026 37037
11594 37037 41735 34257 38341 27434 37013 59077 62159 70550 69698 41582 42126 39566 30409 19643
$$ packed form
11693C7769j1394k812r825n286K904K324K743P250m567P619J036K478l074o039
11679B1126j541O558O722l137M448l036O470M645o658j3648j3507l271K261J738
11665I170M282N889Q497Q407j175K176J735N433L0j1753j240n252o609J1236N806
11650C6632j7058j0198P643J7220M023o798o97j3827k937L885J4122J6682K878
11637E1570j0016j2168r190R510J1411P386O195M903L452n215m827q994j177m700
11623C8140M905k787J425q689r726j96P998r795o268N619j09J813P669O100J8
11608C6117l526O16q404l142J2127Q18O116J0297N418n889m858j3183k481P011
11594C7037M698p478M084j0907R579K2064L082Q391q52k8116N44k560r157j0766
$$ plain form
11580 19643 10355 7674 23109 39739 39800 30594 21785 7898 14859 20025 30310 30730 28474 40124
11566 40124 21291 13150 25678 35792 38505 38121 39635 32992 36838 43057 53640 53615 43676 31125
11552 31125 27679 23992 16814 16952 25135 26542 24216 34607 40408 28823 41729 33222 25936 37657
11538 37657 39227 38632 47791 47731 41271 36412 54480 63983 58853 69007 51461 36028 31775 28437
11524 28437 22677 21211 21662 39407 49467 57101 50341 48139 46925 49538 44234 52561 63908 81731
11510 81731 95926 97647 81916 51069 44526 43941 45105 51545 34693 25678 29699 27448 28900 25429
11496 25429 23608 33367 38296 49103 47516 51512 50317 47373 29755 18516 20653 24778 36417
11483 36417 36928 33521 27782 20207 20355 30526 33771 25228 28381 43553 58080 49709 46531 53370
$$ packed form
11580A9643r288k681J5435J6630O1r206q809j3887O961N166J0285M20k256J1650
11566D0124j8833q141J2528J0114K713l84J514o643L846O219J0583k5r939j2551
11552C1125l446l687p178J38Q183J407k326J0391N801j1585J2906q507p286J1721
11538C7657J570n95R159o0o460m859J8068R503n130J0154j7546j5433m253l338
11524B8437n760j466M51J7745J0060P634o760k202j214K613n304Q327J1347J7823
11510H1731J4195J721j5731l0847o543n85J164O440j6852r015M021k251J452l471
11496B5429j821R759M929J0807j587L996j195k944j7618j1239K137M125J1639
11483C6417N11l407n739p575J48J0171L245q543L153J5172J4527q371l178O839
$$ plain form
11469 53370 56328 52169 61093 57514 48196 56415 66173 63257 48156 38996 38294 40209 39680 48148 36370
11454 36370 19436 17603 19044 14573 15978 27997 14577 15365 39418 52634 50899 50003 54347 58070
11440 58070 57864 67549 65543 59153 57324 66249 64106 71799 73845 65034 73558 96998 95525 75905
11426 75905 77006 75701 86050 91410 82796 80940 79070 86075 99163 107972 119796 140722 163533
11413 163533 190308 215628 221137 230427 265152 310845 365650 413644 489437 587666 734480 929189
11401 929189 1161868 1431103 1683185 1836133 1833552 1679392 1434670 1176044 953777 763670
11391 763670 611101 516967 435938 377194 341544 307910 291521 257127 225560 204881 187576
11380 187576 168792 162229 138220 129282 127987 119803 95171 94675 98831 103132 99218 100072 86101 99985
$$ packed form
11469E3370K958m159Q924l579r318Q219R758k916j5101r160p02J915n29Q468j1778
11454C6370j6934j833J441m471J405J2019j3420P88K4053J3216j735q96M344L723
11440E8070k06R685k006o390j829Q925k143P693K046q811Q524K3440j473j9620
11426G5905J101j305J0349N360q614j856j870P005J3088Q809J1824K0926K2811
11413A63533K6775K5320N509R290L4725M5693N4805M7994P5793R8229J46814J94709
11401I29189K32679K69235K52082J52948k581j54160k44722k58626k22267j90107
11391G63670j52569r4134q1029n8744l5650l3634j6389l4394l1567k0679j7305
11380A87576j8784o563k4009q938j295q184k4632m96M156M301l914Q54j3971J3884
$$ plain form
11366 99985 117228 92876 79579 74777 73970 73983 71834 82139 69485 67709 80951 106736 113584
11353 113584 125522 129780 133475 128250 105615 93922 83533 75339 64228 66560 72505 67184 55253
11340 55253 58397 67593 85442 87577 84282 86325 72494 61442 58397 49117 45718 41148 37069 28142
11326 28142 37838 60660 79520 92373 103409 113167 104300 89924 86968 93066 82277 74551 61174
11313 61174 51587 59280 70038 71614 70259 67375 77055 83465 77282 77659 85207 86409 81839 76606
11299 76606 67904 66044 49004 37376 38939 44390 64239 72704 74942 72828 84836 109396 125783
11286 125783 165642 207386 236098 234028 182980 151270 123303 112014 105247 95170 90215 84326
11274 84326 91087 94234 88637 86538 76889 82445 98390 92938 89378 88403 79632 75598 79613 99208
$$ packed form
11366I9985J7243k4352j3297m802q07J3k149J0305j2654j776J3242K5785O848
11353A13584J1938M258L695n225k2635j1693j0389q194j1111K332N945n321j1931
11340E5253L144R196J7849K135l295K043j3831j1052l045r280l399m570m079q927
11326B8142R696K2822J8860J2853J1036R758q867j4376k956O098j0789p726j3377
11313F1174r587P693J0758J576j355k884R680O410o183L77P548J202m570n233
11299G6606q702j860j7040j1628J563N451J9849Q465K238k114J2008K4560J6387
11286A25783L9859M1744K8712k070n1048l1710k7967j1289o767j0077m955n889
11274H4326O761L147n597k099r649N556J5945n452l560r75q771m034M015J9595
$$ plain form
11260 99208 110505 121258 124299 120881 133034 138980 155872 196412 243151 290019 302504 291982
11248 291982 262944 240136 216233 204595 193779 197482 200783 198217 177345 144876 130190 110493
11236 110493 104680 115041 105555 100026 101245 93197 70001 72905 76307 75435 63478 71591 67356 52480
11222 52480 48711 51769 53856 53309 64795 67823 49764 47276 64427 69503 52659 53427 68225 80057
11208 80057 88870 88163 90698 90547 78647 77507 70946 74559 73057 56494 42091 46840 53166 58527
11194 58527 74987 83747 81472 76433 60590 59884 58388 51538 50413 51417 65069 71228 61948 51338
11180 51338 59109 58899 57731 41010 50506 58785 72929 83895 84147 84781 91417 95753 93890 87161
11166 87161 86380 72397 85179 99060 98597 98531 94334 102281 113578 129993 140496 157644 181950
$$ packed form
11260I9208J1297J0753L041l418J2153N946J6892M0540M6739M6868J2485j0522
11248B91982k9038k2808k3903j1638j0816L703L301k566k0872l2469j4686j9697
11236A10493n813J0361r486n529J219q048k3196K904L402q72j1957Q113m235j4876
11222E2480l769L058K087n47J1486L028j8059k488J7151N076j6844P68J4798J1832
11208H0057Q813p07K535j51j1900j140o561L613j502j6563j4403M749O326N361
11194E8527J6460Q760k275n039j5843p06j496o850j125J004J3652O159r280j0610
11180E1338P771k10j168j6721R496Q279J4144J0966K52O34O636M336j863o729
11166H7161p81j3983J2782J3881m63o6m197P947J1297J6415J0503J7148K4306
$$ plain form
11153 181950 207941 219030 235606 245730 258887 266972 270269 257444 234883 207982 188333 156972
11141 156972 141187 135436 128587 131542 119342 110014 95930 79952 73422 84676 78847 81022 82194
11128 82194 89325 101941 98003 102557 106518 104033 93704 87028 91960 95623 100918 110333 114561 94720
11114 94720 93067 96089 100994 89643 87233 91057 99258 98052 91573 102060 104092 89002 66112
11101 66112 57072 53808 65042 74168 78787 85993 80803 72220 67462 71860 80030 64367 64492 69234
11087 69234 70069 58933 56010 44669 46319 65108 84363 77354 82118 82999 84378 78328 63837 56841
11073 56841 57263 64637 57817 46729 55220 58569 48358 43667 42288 48513 52951 42050 49974 61310
11059 61310 63130 48929 48701 51735 50069 60460 78556 84793 93582 87971 92867 86046 64629 63825
$$ packed form
11153A81950K5991J1089J6576J0124J3157Q085L297j2825k2561k6901j9649l1361
11141A56972j5785n751o849K955j2200r328j4084j5978o530J1254n829K175J172
11128H2194P131J2616l938M554L961k485j0329o676M932L663N295R415M228j9841
11114I4720j653L022M905j1351k410L824Q201j206o479J0487K032j5090k2890
11101F6112r040l264J1234R126M619P206n190q583m758M398Q170j5663J25M742
11087F9234Q35j1136k923j1341J650J8789J9255p009M764Q81J379o050j4491o996
11073E6841M22P374o820j1088Q491L349j0211m691j379O225M438j0901P924J1336
11059F1310J820j4201k28L034j666J0391J8096O237Q789n611M896o821k1417q04
$$ plain form
11045 63825 74541 74852 65786 60930 62487 61869 59167 46807 48284 48064 53321 71440 84256 77274
11031 77274 77495 80198 76019 71783 57566 51625 53335 64421 81132 94677 93561 87540 74116
11018 74116 60549 59952 75933 68248 70103 71697 52617 45811 37795 33102 48110 47378 38362 38501
11004 38501 47276 60779 67795 89998 88088 81173 75163 82171 79468 75875 85055 80702 66221 63078
10990 63078 80762 78521 81666 80000 82011 86359 83510 68675 59875 61899 67253 71759 82443 89871
10976 89871 81997 70091 66049 62519 75012 78362 73201 65220 65151 70058 59541 65453 58344 64333
10962 64333 74561 66533 59468 61649 57751 49867 51536 54327 51527 56017 74585 80390 99407 126000
10948 126000 141408 133769 108275 76717 37991 6707 10285 35231 78649 121890 177218 221209
$$ packed form
11045F3825J0716L11r066m856J557o18k702j2360J477k20N257J8119J2816o982
11031G7274K21K703m179m236j4217n941J710J1086J6711J3545j116o021j3424
11018G4116j3567n97J5981p685J855J594j9080o806q016m693J5008p32r016J39
11004C8501Q775J3503P016K2203j910o915o010P008k703l593R180m353j4481l143
10990F3078J7684k241L145j666K011M348k849j4835q800K024N354M506J0684P428
10976H9871p874j1906m042l530J2493L350n161p981o9M907j0517N912p109N989
10962F4333J0228q028p065K181l898p884J669K791k800M490J8568N805J9017K6593
10948A26000J5408p639k5494l1558l8726l1284L578K4946M3418M3241N5328M3991
$$ plain form
10936 221209 238632 242522 242291 236224 225127 218603 215281 207142 203854 188045 190310 168046 155893
10923 155893 166528 163063 161327 173278 184838 193849 193249 212421 230869 228482 231229 241866 256688
10910 256688 273155 288524 309206 350823 415530 519055 685156 946141 1315626 1774556
10900 1774556 2161147 2244986 1999982 1595279 1199742 893699 658778 495484 414087 367538
10890 367538 338531 312353 301766 307431 311582 302655 292428 284078 274567 275149 272694 257046 257793
10877 257793 244433 233450 225818 221783 222320 227925 209306 191211 194551 197175 196555 181269 170714
10864 170714 160522 163695 158030 176309 183170 177563 171916 165494 166825 164548 149639 142614 149700
10851 149700 166565 173333 194586 210029 218151 221713 232778 263747 324026 413447 526090 701135
$$ packed form
10936B21209J7423L890k31o067j1097o524l322q139l288j5809K265k2264j2153
10923A55893J0635l465j736J1951J1560R011o00J9172J8448k387K747J0637J4822
10910B56688J6467J5369K0682M1617O4707J03525J66101K60985L69485M58930
10900A774556L86591Q3839k45004m04703l95537l06043k34921j63294q1397m6549
10890C67538k9007k6178j0587N665M151q927j0227q350r511N82k455j5648P47
10877B57793j3360j0983p632m035N37N605j8619j8095L340K624o20j5286j0555
10864A70714j0192L173n665J8279O861n607n647o422J331k277j4909p025P086
10851A49700J6865O768K1253J5443Q122L562J1065L0969O0279Q9421J12643J75045
$$ plain form
10839 701135 927981 1105480 1220575 1359009 1556467 1690070 1645645 1492087 1349053 1230370
10829 1230370 1068603 864707 673426 515327 417172 360703 322350 297661 275384 260898
10819 260898 237060 221788 216210 197497 186991 189965 197735 188005 177711 181350 179864 173444 157057
10806 157057 162961 178127 188464 192752 190682 190147 207807 215451 196152 194035 197493 183571 173030
10793 173030 160137 132393 99242 81452 74474 93089 112808 120870 119148 122896 120967 103541
10781 103541 103318 109272 114090 96551 91093 84351 67767 76949 85740 89168 92014 106106 107662 115248
10767 115248 126932 144916 144337 150923 146245 131629 132022 129638 117427 113627 104907 125931 151779
10754 151779 157775 156879 164903 160742 155833 157572 167406 175793 182070 168053 163242 152191 139227 144187
$$ packed form
10839G01135K26846J77499J15095J38434J97458J33603m4425j53558j43034j18683
10829A230370j61767k03896j91281j58099r8155n6469l8353k4689k2277j4486
10819B60898k3838j5272n578j8713j0506K974P770r730j0294L639j486o420j6387
10806A57057N904J5166J0337M288k070n35J7660P644j9299k117L458j3922j0541
10793A73030j2893k7744l3151j7790o978J8615J9719Q062j722L748j929j7426
10781A03541k23N954M818j7539n458o742j6584R182Q791L428K846J4092J556P586
10767A15248J1684J7984n79O586m678j4616L93k384j2211l800q720K1024K5848
10754A51779N996q96Q024m161m909J739R834Q387O277j4017m811j1051j2964M960
$$ plain form
10740 144187 153386 174637 206028 276148 347405 413290 433623 387430 299651 235510 222062 214034
10728 214034 194564 183041 182682 173945 169276 175040 177954 171475 163160 185705 216541 235687 236910
10715 236910 229319 219017 216687 229520 237963 244074 238786 244882 253179 264447 250809 222946 220638
10702 220638 215059 211690 227200 239055 251146 265807 270434 262946 274506 282425 290755 305812 333122
10689 333122 369318 408178 428907 472497 515683 512398 451810 385596 340532 315191 289287 263094
10677 263094 266320 279002 302443 308474 299661 285750 265942 265426 280449 296436 309782 318675 319420
10664 319420 322113 329472 327232 321865 328748 347273 339116 340956 342870 336144 327143 312333 288497
10651 288497 290515 292866 303197 313054 312808 309878 306833 317774 322528 329976 322620 318934 321627 353139
$$ packed form
10740A44187R199K1251L1391P0120P1257O5885K0333m6193q7779o4141j3448q028
10728B14034j9470j1523l59q737m669N764K914o479q315K2545L0836J9146J223
10715B36910p591j0302k330J2833Q443O111n288O096Q297J1268j3638k7863k308
10702B20638n579l369J5510J1855J2091J4661M627p488J1560P919Q330J5057K7310
10689C33122L6196L8860K0729M3590M3186l285o0588o6214m5064k5341k5904k6193
10677B63094L226J2682K3441O031q813j3911j9808n16J5023J5987J3346Q893P45
10664C19420K693P359k240n367O883J8525q157J840J914o726r001j4810k3836
10651B88497K018K351J0331R857k46k930l045J0941M754P448p356l686K693L1512
$$ plain form
10637 353139 373240 375151 394793 403922 411594 405881 420158 431317 421923 403828 386147 360111
10625 360111 349705 325658 307218 297984 305584 311034 317260 315053 333427 350319 362922 375222
10613 375222 380928 404373 458461 522629 635296 807423 984162 1082375 1078865 1019135 940589
10602 940589 868171 800223 732966 685411 656722 639246 609582 591319 578885 579003 581959 595258
10590 595258 609703 634208 650827 668456 684942 690514 695330 692309 686052 697053 711162 710918 706447
10577 706447 700597 693424 700505 716479 709283 704042 705381 734875 754193 779982 827228 867976 907816
10564 907816 984287 1115192 1277234 1459925 1643027 1817141 1950685 2023566 2025597 1993875
10554 1993875 1907620 1803206 1692033 1584831 1512865 1462359 1405345 1374733 1353486 1360819 1374794
$$ packed form
10637C53139K0101J911J9642R129P672n713J4277J1159r394j8095j7681k6036
10625C60111j0406k4047j8440r234P600N450O226k207J8374J6892J2603J2300
10613C75222N706K3445N4088O4168J12667J72127J76739R8213l510n9730p8546
10602I40589p2418o7948o7257m7555k8689j7476k9664j8263j2434J18K956J3299
10590E95258J4445K4505J6619J7629J6486N572M816l021o257J1001J4109k44m471
10577G06447n850p173P081J5974p196n241J339K9494J9318K5789M7246M0748L9840
10564I07816P6471J30905J62042J82691J83102J74114J33544P2881K031l1722
10554A993875q6255j04414j11173j07202p1966n0506n7014l0612k1247P333J3975
$$ plain form
10543 1374794 1415654 1480485 1538806 1579189 1611384 1645448 1701748 1765823 1813121 1835049 1849274
10532 1849274 1881408 1933913 1986744 2039032 2102901 2180299 2270406 2383639 2483867 2554637 2617911
10521 2617911 2704951 2818515 2983286 3203487 3442828 3628743 3746797 3835112 3960290 4120314
10511 4120314 4283592 4440455 4621029 4856874 5185004 5592298 6076798 6644683 7284712
10502 7284712 8052102 9011100 10207274 11576355 12937390 14152107 15352948 16795243
10494 16795243 18655545 21084365 24251939 28333371 33719669 40980673 51102759 65767556
10486 65767556 87966541 122761392 177352615 256636245 346999520 406525333 401000763
10479 401000763 338479074 254311271 180277755 127634481 93164579 70720515 55653390
$$ packed form
10543A374794M0860O4831N8321M0383L2195L4064N6300O4075M7298K1928J4225
10532A849274L2134N2505N2831N2288O3869P7398R0107J13233J00228P0770O3274
10521B617911Q7040J13564J64771K20201K39341J85915J18054Q8315J25178J60024
10511D120314J63278J56863J80574K35845L28130M07294M84500N67885O40029
10502G284712P67390R58998J196174J369081J361035J214717J200841J442295
10494A6795243J860302K428820L167574M081432N386298P261004J0122086J4664797
10486F5767556K2198985L4794851N4591223P9283630R0363275N9525813n524570
10479D01000763o2521689q4167803p4033516n2643274l4469902k2444064j5067125
$$ plain form
10472 55653390 45072113 37330180 31501485 27010140 23566300 21040003 19275223 18157171
10464 18157171 17455131 16841580 16021757 15020762 14080707 13413630 13116205 13143639 13355827
10455 13355827 13679656 14104373 14618199 15064847 15327740 15466339 15677064 16134150 16909164
10446 16909164 18003938 19430556 21397998 24379953 28972303 36008281 47155050 65602067
10438 65602067 96146731 138725487 176801401 199526946 220363414 255505575 289876703
10431 289876703 292398981 264718395 233783726 214487620 191625190 155848168 115096322
10424 115096322 81445661 59102741 45168628 36264681 30422318 26439546 23450576
10417 23450576 21050329 19241071 17919288 16711543 15373101 14066508 13028862 12080810
$$ packed form
10472E5653390j0581277p741933n828695m491345l443840k526297j764780j118052
10464A8157171p02040o13551q19823j000995r40055o67077k97425K7434K12188
10455A3355827L23829M24717N13826M46648K62893J38599K10725M57086P75014
10446A6909164J094774J426618J967442K981955M592350P035978J1146769J8447017
10438F5602067L0544664M2578756L8075914K2725545K0836468L5142161L4371128
10431B89876703K522278k7680586l0934669j9296106k2862430l5777022m0751846
10424A15096322l3650661k2342920j3934113q903947n842363l982772k988970
10417B3450576k400247j809258j321783j207745j338442j306593j037646r48052
$$ plain form
10409 12080810 10989599 9906682 8995129 8275367 7720839 7383818 7408438 7778375 8196501
10400 8196501 8547115 9092283 10164376 11498579 12264768 12246785 12148093 12587560 13170044
10391 13170044 12953187 11824425 10603971 9892265 9313425 8343062 7105633 6022351 5253943
10382 5253943 4615831 4019276 3506419 3098090 2773607 2488039 2220610 1998591 1827907
10373 1827907 1687193 1573358 1474847 1381343 1298799 1218831 1155671 1105375 1055641 1026261 999251
10362 999251 980097 920180 840149 760006 673612 553721 419987 364387 407296 517470 637415
10351 637415 703214 708525 680139 654308 628015 606632 613928 618042 616376 613596 591373 584134 583901
10338 583901 572423 541305 497612 462236 418964 374264 341984 321939 322546 341397 348994 345980
$$ packed form
10409A2080810j091211j082917r11553p19762n54528l37021K4620L69937M18126
10400H196501L50614N45168J072093J334203P66189j7983r8692M39467N82484
10391A3170044k16857j128762j220454p11706n78840r70363j237429j083282p68408
10382E253943o38112n96555n12857m08329l24483k85568k67429k22019j70684
10373A827907j40714j13835r8511r3504q2544p9968o3160n0296m9734k9380k7010
10362I99251j9154n9917q0031q0143q6394j19891j33734n5600M2909J10174J19945
10351F37415O5799N311k8386k5831k6293k1383P296M114j666k780k2223p239k33
10338E83901j1478l1118m3693l5376m3272m4700l2280k0045O07J8851P597l014
$$ plain form
10326 345980 355513 380825 425756 475458 493998 499176 505980 534338 546068 528096 488428 457054
10314 457054 434129 383926 317131 242781 189259 159425 128005 96290 69223 84565 162795
10303 162795 233911 278701 310488 344376 376898 396178 391729 386001 390664 400447 398585 400282 402149
10290 402149 389201 365326 347236 346508 369354 417431 470404 542040 599327 645150 702193 751582
10278 751582 772127 768851 737716 679560 613504 550578 503392 470936 452109 452426 452178 439571
10266 439571 418413 399885 373764 368657 365117 361495 340239 315238 300545 274377 246596 224201
10254 224201 204141 200841 201590 205386 224087 225000 224584 219062 214307 216587 201030 185297 187684 179301
10240 179301 181905 203209 220062 238448 277853 312701 342831 354289 350960 356643 362249 351125
$$ packed form
10326C45980R533K5312M4931M9702J8540N178O804K8358J1730j7972l9668l1374
10314D57054k2925n0203o6795p4350n3522k9834l1420l1715k7067J5342P8230
10303A62795P1116M4790L1787L3888L2522J9280m449n728M663R783j862J697J867
10290D02149j2948k3875j8090p28K2846M8077N2973P1636N7287M5823N7043M9389
10278G51582K0545l276l1135n8156o6056o2926m7186l2456j8827L17k48j2607
10266D39571k1158j8528k6121n107l540l622k1256k5001j4693k6168k7781k2395
10254B24201k0060l300P49L796J8701R13m16n522m755K280j5557j5733K387q383
10240A79301K604K1304J6853J8386L9405L4848L0130J1458l329N683N606j1124
$$ plain form
10228 351125 324751 282762 259672 256191 258631 278313 306649 370858 438285 479744 462208 389355
10216 389355 332371 291111 247590 217400 191295 178490 171700 170085 162956 164428 158545 141581
10204 141581 142958 137287 119411 112971 106578 106525 86456 80080 94795 94836 99813 109106 109560 125457
10190 125457 147215 145989 153674 172602 170167 179487 198166 187366 184634 181698 184117 202945 194105
10177 194105 186483 191716 188625 196793 222575 237927 232283 206093 172425 154727 137575 136528 138678
10164 138678 149351 151790 153428 170123 196008 196120 200265 202298 200611 207229 231208 272212 343996
10151 343996 428028 522059 609253 652004 627769 567770 497580 434811 396329 372057 367320 386266
10139 386266 402190 428246 455325 492352 521727 547222 601099 670713 762788 879979 1045714
$$ packed form
10228C51125k6374m1989k3090l481K440J9682K8336O4209O7427M1459j7536p2853
10216C89355n6984m1260m3521l0190k6105j2805o790j615p129J472n883j6964
10204A41581J377n671j7876o440o393n3k0069o376J4715M1M977R293M54J5897
10190A25457K1758j226P685J8928k435R320J8679j0800k732k936K419J8828q840
10177A94105p622N233l091Q168K5782J5352n644k6190l3668j7698j7152j047K150
10164A38678J0673K439J638J6695K5885J12M145K033j687O618K3979M1004P1784
10151C43996Q4032R4031Q7194M2751k4235n9999p0190o2769l8482k4272m737J8946
10139C86266J5924K6056K7079L7027K9375K5495N3877O9614R2075J17191J65735
$$ plain form
10128 1045714 1261661 1560475 1981769 2543100 3265718 4140881 5028213 5684195 5880555
10119 5880555 5560951 4848727 3996692 3173529 2490975 1957882 1562336 1274563 1065050
10110 1065050 921788 818923 732478 653361 589970 546047 517069 498189 473149 453684 440191
10099 440191 428804 419409 415030 388728 370923 348373 322010 279447 245614 239371 226022 203561
10087 203561 197869 193387 179317 170496 164864 174477 185575 186218 183056 175681 175340 177402 186295 182236
10073 182236 186206 195625 197987 186769 196812 211392 216697 222515 250158 295896 362151 448439
10061 448439 560340 730201 1000814 1386431 1847440 2183630 2193102 1893732 1449247 1049576
10051 1049576 776754 594200 472497 375229 315780 275265 255857 242844 233996 221787 201989
$$ packed form
10128A045714K15947K98814M21294N61331P22618Q75163Q87332O55982J96360
10119E880555l19604p12224q52035q23163o82554n33093l95546k87773k09513
10110A065050j43262j02865q6445p9117o3391m3923k8978j8880k5040j9465j3493
10099D40191j1387r395m379k6302j7805k2550k6363m2563l3833o243j3349k2461
10087B03561n692m482j4070q821n632R613J1098O43l162p375l41K062Q893m059
10073A82236L970R419K362j1218J0043J4580N305N818K7643M5738O6255Q6288
10061D48439J11901J69861K70613L85617M61009L36190R472k99370m44485l99671
10051A049576k72822j82554j21703r7268n9449m0515j9408j3013q848j2209j9798
$$ plain form
10040 201989 194645 183777 184438 190028 197602 201823 218886 258313 299045 407196 590535 812786
10028 812786 991865 1102836 1231908 1432735 1604809 1614062 1513470 1415916 1349399 1231458
10018 1231458 1045053 852496 680700 588531 546113 522782 522817 542626 569527 624948 703929
10007 703929 817389 966275 1155125 1366250 1593450 1807720 1938250 1944616 1841538 1639477
9997 1639477 1409726 1187333 978274 797304 674251 583697 525388 467540 409254 360653
9987 360653 341836 340005 337009 345678 351035 343935 331701 327428 339318 324785 301353 285558 262492
9974 262492 237552 223240 218391 212886 208241 221104 216272 206961 194213 194595 201233 186174 176667
9961 176667 177205 153254 140290 136933 128054 117157 127866 125916 126582 147188 154065 129690 116104
$$ packed form
10040B01989p344j0868O61N590P574M221J7063L9427M0732J08151J83339K22251
10028H12786J79079J10971J29072K00827J72074R253j00592r7554o6517j17941
10018A231458j86405j92557j71796r2169m2418k3331L5J9809K6901N5421P8981
10007G03929J13460J48886J88850K11125K27200K14270J30530O366j03078k02061
9997A639477k29751k22393k09059j80970j23053r0554n8309n7848n8286m8601
9987C60653j8817j831k996Q669N357p100j2234m273J1890j4533k3432j5795k3066
9974B62492k4940j4312m849n505m645J2863m832r311j2748L82O638j5059r507
9961A76667N38k3951j2964l357q879j0897J0709j950O66K0606O877k4375j3586
$$ plain form
9948 116104 119523 132825 126017 114102 90122 82868 82633 78693 79252 89818 90362 84287 87525 87550 71802
9933 71802 78270 92975 100506 105408 114228 120090 123218 116296 117847 112271 104587 93766 104729 103540
9919 103540 79928 57643 55852 69352 77645 79056 70165 67047 63964 65452 74001 71208 81787
9906 81787 85813 71498 67578 66746 53976 54865 49398 61199 66422 74122 73704 69391 64954 58318 59268
9891 59268 61626 61040 59475 62143 76199 85400 80011 63290 59634 76818 76424 67225 58835 62879
9877 62879 73764 61729 70613 77410 80335 72613 62981 65151 60951 63401 88589 103392 97835 93003
9863 93003 87294 78248 70596 63565 58851 64336 55746 53737 60659 71257 76226 73840 55973 47331
9849 47331 46291 53897 63130 47948 27137 25490 46544 49922 38983 46044 43270 44702 63674
$$ packed form
9948A16104L419J3302o808j1915k3980p254k35l940N59J0566N44o075L238K5j5748
9933G1802O468J4705P531M902Q820N862L128o922J551n576p684j0821J0963j189
9919A03540k3612k2285j791J3500Q293J411q891l118l083J488Q549k793J0579
9906H1787M026j4315l920q32j2770Q89n467J1801N223P700m18m313m437o636R50
9891E9268K358n86j565K668J4056R201n389j6721l656J7184l94r199q390M044
9877F2879J0885j2035Q884O797K925p722r632K170m200K450K5188J4803n557m832
9863I3003n709r046p652p031m714N485q590k009O922J0598M969k386j7867q642
9849D7331j040P606R233j5182k0811j647K1054L378j0939P061k774J432J8972
$$ plain form
9836 63674 72202 76086 55425 53280 74460 81958 70307 76648 102356 145949 194053 258117 359262
9823 359262 435731 440443 377780 284367 204789 139682 116580 110478 99578 93272 95076 96534 85276
9810 85276 74745 68040 75656 84755 82506 73547 64534 59013 60039 59314 55276 57958 59467 56754 51871
9795 51871 59643 49316 42004 38675 46981 47341 53560 61378 53425 46896 53227 59525 50211 48648 48646
9780 48646 60606 58098 57961 64881 70888 66908 62773 62157 71173 79717 79058 75271 75537 69234 70488
9765 70488 67175 63183 50516 32636 38100 52267 63420 50379 38582 40232 54464 53264 50605
9752 50605 45844 54788 70145 71724 71764 70612 66309 70485 63422 62751 63169 63827 86514 100900 88721
9737 88721 82198 79701 80493 89954 90568 95028 92519 90154 83124 78366 75446 68922 56703 50727 69016
$$ packed form
9836F3674Q528L884k0661k145K1180P498j1651O341K5708M3593M8104O4064J01145
9823C59262P6469M712o2663r3413p9578o5107k3102o102j0900o306J804J458j1258
9810H5276j0531o705P616R099k249q959r013n521J026p25m038K682J509k713m883
9795E1871P772j0327p312l329Q306L60O219P818p953o529O331O298r314j563k
9780D8646J1960k508j37O920O007l980m135o16R016Q544o59l787K66o303J254
9765G0488l313l992j2667j7880N464J4167J1153j3041j1797J650J4232j200k659
9752E0605m761Q944J5357J579M0j152m303M176p063o71M18O58K2687J4386j2179
9737H8721o523k497P92R461O14M460k509k365p030m758k920o524j2219n976J8289
$$ plain form
9722 69016 75197 73751 81077 92599 80117 76873 73342 81204 81884 79435 64301 53301 40388 37530
9708 37530 51382 65498 60010 45589 46574 49567 63811 62786 55757 54519 59417 57862 73878 90250
9694 90250 97156 92406 80234 79064 91139 90163 73178 84267 84410 74944 75048 79083 69496 58541
9680 58541 51011 55271 58347 50949 53801 71783 72882 78986 88341 81964 76676 69932 63252 70915
9666 70915 75006 76864 68897 69884 68652 72595 77268 73819 62571 71350 83560 69161 71777 69398
9652 69398 56179 51436 62562 73022 70828 63708 62814 55810 52057 49232 42952 58476 68466 76876
9638 76876 78859 73979 58937 55155 58336 50878 45285 48452 45904 58465 50263 61840 66118 69619
9624 69619 54918 56174 55811 58044 66176 72159 60060 49250 46413 47825 45034 51736 58384 58218
$$ packed form
9722F9016O181j446P326J1522j2482l244l531P862O80k449j5134j1000j2913k858
9708C7530J3852J4116n488j4421R85K993J4244j025p029j238M898j555J6016J6372
9694I0250O906m750j2172j170J2075r76j6985J1089J43r466J04M035r587j0955
9680E8541p530M260L076p398K852J7982J099O104R355o377n288o744o680P663
9666G0915M091J858p967R87j232L943M673l449j1248Q779J2210j4399K616k379
9652F9398j3219m743J1126J0460k194p120q94p004l753k825o280J5524R990Q410
9638G6876J983m880j5042l782L181p458n593L167k548J2561q202J1577M278L501
9624F9619j4701J256l63K233Q132N983j2099j0810k837J412k791O702O648j66
$$ plain form
9610 58218 50871 51073 58860 73981 72785 58016 60049 68346 59895 53593 52071 54305 61429 62103 56368
9595 56368 61982 65781 67365 74119 77722 75254 82479 78946 75074 75058 74597 64310 67084 66622 74619
9580 74619 71690 83020 92489 103129 111205 98904 84368 84323 83976 83591 91186 94877 87343 84575 101640
9565 101640 100644 98028 92547 73428 76552 87413 93924 106474 100110 100972 111039 106789 85886 64652
9551 64652 62348 79358 88929 96355 108813 112654 101237 100702 101994 81303 66060 54135 49963
9538 49963 67137 72136 73433 68586 66463 68055 67644 65861 54529 56945 70881 65008 82220 94960
9524 94960 89672 86601 97885 86965 93673 84112 74949 93378 100022 90417 90233 87159 67062 72810
9510 72810 78815 80889 89735 97412 87961 67600 67077 65580 71899 81183 72822 76122 73641 78729 64174
$$ packed form
9610E8218p347K02P787J5121j196j4769K033Q297q451o302j522K234P124O74n735
9595E6368N614L799J584O754L603k468P225l533l872j6m61j0287K774m62P997
9580G4619k929J1330R469J0640Q076j2301j4536m5l47l85P595L691p534k768J7065
9565A01640r96k616n481j9119L124J0861O511J2550o364Q62J0067m250k0903k1234
9551F4652k304J7010R571P426J2458L841j1417n35J292k0691j5243j1925m172
9538D9963J7174M999J297m847k123J592m11j783j1332K416J3936n873J7212J2740
9524I4960n288l071J1284j0920O708r561r163J8429O644r605j84l074k0097N748
9510G2810O005K074Q846P677r451k0361n23j497O319R284q361L300k481N088j4555
$$ plain form
9495 64174 64566 72785 65890 65812 74467 79839 82870 76502 73455 56474 53786 67811 80086 88213 89972
9480 89972 92545 107096 109564 94024 83610 72007 67465 64935 68981 72550 77000 74509 65001 68944
9466 68944 75078 92176 95935 91801 96625 85416 75449 83811 73032 63020 80903 84502 93498
9453 93498 95250 86334 91606 83511 67270 55128 67394 74859 73179 71852 84969 91086 80149
9440 80149 74436 69712 74082 78308 92404 106212 114314 110012 95543 85667 92429 86333 98316 89495
9426 89495 85395 88133 80273 78651 81115 85998 67545 66940 87654 91907 85356 86829 85790 84440
9412 84440 90075 94978 93599 94221 98748 101743 92715 95925 110735 119992 114180 100805 87051 87091 80880
9397 80880 73221 76496 75757 80150 94697 95598 103797 107309 89686 74228 83685 91420 91575 100736 92006
$$ packed form
9495F4174L92Q219o895p8Q655N372L031o368l047j6981k688J4025J2275Q127J759
9480H9972K573J4551K468j5540j0414j1603m542k530M046L569M450k491r508L943
9466F8944O134J7098L759m134M824j1209r967Q362j0779j0012J7883L599Q996
9453I3498J752q916N272q095j6241j2142J2266P465j680j327J3117O117j0937
9440H0149n713m724M370M226J4096J3808Q102m302j4469r876O762o096J1983q821
9426H9495m100K738p860j622K464M883j8453o05K0714M253o551J473j039j350
9412H4440N635M903j379O22M527K995r028L210J4810R257n812j3375j3754M0o211
9397H0880p659L275p39M393J4547R01Q199L512j7623j5458R457P735J55R161q730
$$ plain form
9382 92006 75927 84804 78531 79270 99252 117796 113952 119395 126751 116120 100637 89866 86630
9369 86630 93259 94312 96389 101679 110342 112896 102256 95947 101381 96161 91608 90166 93708 105170
9355 105170 92845 80929 90620 90367 97544 102536 98902 98949 92484 90156 97662 106179 111543 114920 118094
9340 118094 114695 107215 114030 98555 95932 92250 92858 104532 107634 99254 93202 78078 78668 83054
9326 83054 85684 93739 92861 98040 108868 103498 89816 81520 91729 102978 107129 105328 117753 112528
9312 112528 101119 104626 111449 107921 104114 101486 106715 98276 90181 104321 112985 121224 120567 116540
9298 116540 104825 113734 129968 128533 119605 116083 121605 126759 115335 114502 119312 122276 131615 127436
9284 127436 122710 116127 113278 108711 111054 122169 123909 116004 113103 118516 119127 124895 124353 122962 121984
$$ packed form
9382I2006j6079Q877o273P39J9982J8544l844N443P356j0631j5483j0771l236
9369H6630O629J053K077N290Q663K554j0640o309N434n220m553j442L542J1462
9355A05170j2325j1916R691k53P177M992l634M7o465k328P506Q517N364L377L174
9340A18094l399p480O815j5475k623l682O08J1674L102q380o052j5124N90M386
9326H3054K630Q055q78N179J0828n370j3682q296J0209J1249M151j801J2425n225
9312A12528j1409L507O823l528l807k628N229q439q095J4140Q664Q239o57m027
9298A16540j1715Q909J6234j435q928l522N522N154j1424q33M810K964R339m179
9284A27436m726o583k849m567K343J1115J740p905k901N413O11N768n42j391r78
$$ plain form
9269 121984 128116 143592 136609 110297 105101 112379 121411 125917 128429 141875 147099 136416 134499
9256 134499 139094 133604 125189 133952 146840 150943 144021 133666 129202 126233 122946 133893 147480
9243 147480 158581 161056 154460 146901 144568 128472 135937 146579 143948 134718 137859 147317 149442 153638
9229 153638 140241 127055 133488 148612 152863 139039 142168 146924 147994 163436 171289 173348 164555
9216 164555 143069 141496 142552 148716 156391 149110 156590 149395 141599 155721 163306 156086 151881 149915
9202 149915 145589 143066 161554 163903 165259 156662 158411 152756 155520 156388 155399 152506 146789 144359 146903
9187 146903 162880 172507 184069 186390 173226 165685 171109 170857 172791 174761 180061 170055 153332
9174 153332 157202 156010 149259 165285 166043 148457 138907 143036 142956 153567 158336 157013 162528 160975
$$ packed form
9269A21984O132J5476o983k6312n196P278R032M506K512J3446N224j0683j917
9256A34499M595n490q415Q763J2888M103o922j0355m464k969l287J0947J3587
9243A47480J1101K475o596p559k333j6096P465J0642k631r230L141R458K125M196
9229A53638j3397j3186O433J5124M251j3824L129M756J070J5442P853K059q793
9216A64555k1486j573J056O164P675p281P480p195p796J4122P585p220m205j966
9202A49915m326k523J8488K349J356q597J749n655K764Q68r89k893n717k430K544
9187A46903J5977R627J1562K321j3164p541N424k52J934J970N300j0006j6723
9174A53332L870j192o751J6026P58j7586r550M129q0J0611M769j323N515j553
$$ plain form
9160 160975 166941 196223 205536 194518 177071 189717 201437 204655 202479 206721 199394 190535 200986
9147 200986 196370 182688 180312 189990 187816 183295 193277 201804 203036 203066 193214 193451 196483 202206 205886
9132 205886 202693 201015 207039 202012 202596 203472 198732 195157 197395 193977 192875 191136 191575 190917 191528 189192
9116 189192 197024 192042 199592 203259 213747 203865 204941 211228 210416 210652 224261 233337 233259 240122 242252
9101 242252 231051 211065 206539 212417 215675 208072 211257 218543 235341 238316 252056 248587 226256
9088 226256 225786 233540 244771 247898 238761 251182 251813 251418 261579 268811 266681 255816 257842 262902
9074 262902 254301 254010 255673 268246 276540 276100 282703 289623 292589 280758 271544 269951 272978 285509
9060 285509 290739 296316 295984 293120 288984 291629 294513 302463 299011 291536 293468 296070 292613 293734 293978
$$ packed form
9160A60975N966K9282R313j1018j7447J2646J1720L218k176M242p327q859J0451
9147B00986m616j3682k376R678k174m521R982Q527J232L0r852K37L032N723L680
9132B05886l193j678O024n027N84Q76m740l575K238l418j102j739M39o58O11k336
9116A89192P832m982P550L667J0488r882J076O287q12K36J3609R076p8O863K130
9101B42252j1201j9986m526N878L258p603L185P286J6798K975J3740l469k2331
9088B26256m70P754J1231L127r137J2421O31l95J0161P232k130j0865K026N060
9074B62902q601k91J663J2573Q294m40O603O920K966j1831r214j593L027J2531
9060B85509N230N577l32k864m136K645K884P950l452p475J932K602l457J121K44
$$ plain form
9045 293978 286033 299833 310697 308867 318318 337219 334703 331708 331069 330375 343064 350008 346349 355025
9031 355025 370607 374690 374137 366585 366154 375455 389038 396758 395289 384677 388255 386372 376455 372928
9017 372928 380327 386209 395560 404468 395176 377490 393156 402941 415032 428817 431797 434010 434793 431523
9003 431523 430959 428735 435839 439680 440445 444176 450834 451953 453030 463338 464959 459131 455532 449592 450429
8988 450429 453568 471977 477779 482140 493157 501409 514683 511579 513619 539048 548639 541435 543647
8975 543647 547771 553776 543404 536940 543851 543735 553534 548204 540979 554861 570645 586056 583421 586564
8961 586564 597633 601874 593822 600671 615505 619029 623505 633071 655002 660416 660346 661558 660505 657376
8947 657376 674035 691073 697361 709422 716832 721581 725762 744391 751344 768556 794649 811519 822955
$$ packed form
9045B93978p945J3800J0864j830R451J8901k516k995o39o94J2689O944l659Q676
9031C55025J5582M083n53p552m31R301J3583P720j469j0612L578j883r917l527
9017C72928P399N882R351Q908r292j7686J5666R785J2091J3785K980K213P83l270
9003D31523n64k224P104L841P65L731O658J119J077J0308J621n828l599n940Q37
8988D50429L139J8409N802M361J1017Q252J3274l104K040K5429R591p204K212
8975E43647M124O005j0372o464O911j16R799n330p225J3882J5784J5411k635L143
8961E86564J1069M241q052O849J4834L524M476R566K1931N414p0J212j053l129
8947F57376J6659J7038O288J2061P410M749M181J8629O953J7212K6093J6870J1436
$$ plain form
8934 822955 850876 853267 854250 847754 855193 859555 860195 872755 891240 889391 891675 899594 922544 935730
8920 935730 944700 944960 946905 957861 981349 1007232 1007608 1012631 1028055 1042267 1058775 1073994 1089392
8907 1089392 1105138 1121868 1153083 1177027 1193345 1226767 1236858 1246974 1261731 1281011 1296731
8896 1296731 1314481 1336454 1355744 1384922 1413068 1438713 1466161 1491178 1505754 1543492 1573811
8885 1573811 1589767 1609753 1621361 1639401 1665246 1697156 1727735 1759588 1808692 1837172 1862178
8874 1862178 1905384 1947177 1981170 2020910 2058023 2095729 2152434 2195620 2229689 2275327 2309039
8863 2309039 2358918 2410979 2476090 2542169 2600873 2660124 2716964 2788388 2854072 2924224 2993683
8852 2993683 3060390 3132740 3200138 3270917 3357363 3454482 3540476 3620641 3705548 3799515 3907721
$$ packed form
8934H22955K7921K391R83o496P439M362O40J2560J8485j849K284P919K2950J3186
8920I35730Q970K60J945J0956K3488K5883L76N023J5424J4212J6508J5219J5398
8907A089392J5746J6730L1215K3944J6318L3422J0091J0116J4757J9280J5720
8896A296731J7750K1973J9290K9178K8146K5645K7448K5017J4576L7738L0319
8885A573811J5956J9986J1608J8040K5845L1910L0579L1853M9104K8480K5006
8874A862178M3206M1793L3993L9740L7113L7706N6705M3186L4069M5638L3712
8863B309039M9879N2061O5111O6079N8704N9251N6840P1424O5684P0152O9459
8852B993683O6707P2350O7398P0779Q6446R7119Q5994Q0165Q4907R3967J08206
$$ plain form
8841 3907721 4022563 4135891 4257736 4375154 4502556 4628130 4752098 4889532 5039995 5178587
8831 5178587 5315143 5471859 5631048 5788207 5968307 6147065 6340821 6548715 6760247 6972832
8821 6972832 7170572 7391154 7624108 7868873 8125143 8375631 8611147 8857136 9122929 9408222
8811 9408222 9687212 9952646 10232053 10530251 10821140 11094969 11379520 11665709 11938879 12219325
8801 12219325 12493052 12752654 13005593 13238282 13449888 13640753 13827914 13999529 14151926
8792 14151926 14265096 14354781 14430118 14470233 14477905 14470305 14434112 14380008 14307988 14199272 14065045
8781 14065045 13910955 13724307 13512940 13299243 13076098 12832000 12567415 12278150 12006178
8772 12006178 11741150 11465027 11184938 10903612 10618427 10339683 10054821 9771969 9489360
$$ packed form
8841C907721J14842J13328J21845J17418J27402J25574J23968J37434J50463J38592
8831E178587J36556J56716J59189J57159J80100J78758J93756K07894K11532K12585
8821F972832J97740K20582K32954K44765K56270K50488K35516K45989K65793K85293
8811I408222K78990K65434K79407K98198K90889K73829K84551K86189K73170K80446
8801A2219325K73727K59602K52939K32689K11606J90865J87161J71615J52397
8792A4151926J13170Q9685P5337M0115P672p600l6193n4104p2020j08716j34227
8781A4065045j54090j86648k11367k13697k23145k44098k64585k89265k71972
8772A2006178k65028k76123k80089k81326k85185k78744k84862k82852k82609
$$ plain form
8763 9489360 9211301 8936223 8677797 8408941 8151356 7908703 7683367 7451523 7232661 7027083
8753 7027083 6830751 6636502 6426914 6238003 6057436 5883412 5711510 5549107 5381734 5209967
8743 5209967 5057809 4919559 4770591 4624954 4493635 4390247 4277444 4155351 4039164 3931783
8733 3931783 3823163 3716428 3634264 3536279 3433118 3341651 3258879 3185311 3105630 3030525 2965382
8722 2965382 2897298 2820282 2758311 2693878 2631754 2572371 2518424 2463261 2408580 2345965 2289605
8711 2289605 2254037 2223476 2176103 2133051 2087076 2044275 2008066 1966676 1927224 1895310 1846446
8700 1846446 1793387 1768888 1745676 1728706 1692288 1647570 1628415 1615854 1586252 1555155 1516586
8689 1516586 1488056 1458546 1421730 1396589 1371190 1350399 1346207 1313811 1292253 1273359 1261028 1241341
$$ packed form
8763I489360k78059k75078k58426k68856k57585k42653k25336k31844k18862k05578
8753G027083j96332j94249k09588j88911j80567j74024j71902j62403j67373j71767
8743E209967j52158j38250j48968j45637j31319j03388j12803j22093j16187j07381
8733C931783j08620j06735q2164r7985j03161r1467q2772p3568p9681p5105o5143
8722B965382o8084p7016o1971o4433o2124n9383n3947n5163n4681o2615n6360
8711B289605l5568l0561m7373m3052m5975m2801l6209m1390l9452l1914m8864
8700A846446n3059k4499k3212j6970l6418m4718j9155j2561k9602l1097l8569
8689A516586k8530k9510l6816k5141k5399k0791m192l2396k1558j8894j2331j9687
$$ plain form
8677 1241341 1230537 1218530 1198613 1176107 1157728 1136730 1139481 1144142 1148102 1152843 1154982 1146720 1157602
8664 1157602 1158433 1144784 1129928 1098356 1064588 1041152 1018300 994985 969124 963085 942892 923337
8652 923337 925879 919626 890894 866870 863168 863149 850395 839276 835477 833596 838033 827651 823270 809379
8638 809379 789703 771032 770570 774949 765855 757964 753048 754132 769174 772231 785044 809814 837596
8625 837596 890489 931515 931668 914032 858150 811393 786965 762769 737873 724384 708598 693888
8613 693888 702547 705579 686965 687012 674680 667199 642609 629349 626792 628738 619067 623502 632802 649780
8599 649780 648785 656286 678743 695342 705372 705867 714297 725809 735372 741602 764533 782341 810934
8586 810934 857691 897609 946924 991078 1062329 1145903 1239839 1337545 1389542 1393793 1339263 1247705
$$ packed form
8677A241341j0804j2007j9917k2506j8379k0998K751M661L960M741K139q262J0882
8664A157602Q31j3649j4856l1572l3768k3436k2852k3315k5861o039k0193j9555
8652I23337K542o253k8732k4024l702j9j2754j1119l799j881M437j0382m381j3891
8638H09379j9676j8671m62M379r094p891m916J084J5042L057J2813K4770K7782
8625H37596N2893M1026J53j7636n5882m6757k4428k4196k4896j3489j5786j4710
8613F93888Q659L032j8614M7j2332p481k4590j3260k557J946r671M435R300J6978
8599F49780r95P501K2457J6599J0030M95Q430J1512R563O230K2931J7808K8593
8586H10934M6757L9918M9315M4154P1251Q3574R3936R7706N1997M251n4530r1558
$$ plain form
8574 1247705 1153818 1057833 978309 905463 849412 813303 774114 732763 676853 642099 631311
8563 631311 618935 599951 580985 568302 540020 496228 464129 458685 450174 443309 429043 420853
8551 420853 422103 403185 399793 407603 413158 406987 409264 386039 375910 370328 375593 379460 374476 377936
8537 377936 372181 379859 398836 419495 435902 418125 384990 362547 366087 371481 358859 346346
8525 346346 354650 370357 356623 331044 320103 316765 314266 327318 333723 334515 323718 331606 335044
8512 335044 329351 324892 310700 295189 281725 286272 294721 290463 295694 294987 287936 273701 266405 271440
8498 271440 266941 256000 249504 245220 241774 248570 243318 245628 253763 266553 273118 279661 275761 266761
8484 266761 265102 291200 311804 310369 313541 310401 308735 288260 294738 298347 281426 278990 276562
$$ packed form
8574A247705r3887r5985p9524p2846n6051l6109l9189m1351n5910l4754j0788
8563F31311j2376j8984j8966j2683k8282m3792l2099n444q511o865j4266q190
8551D20853J250j8918l392P810N555o171K277k3225j0129n582N265L867m984L460
8537C77936n755P678J8977K0659J6407j7777l3135k2443L540N394j2622j2513
8525C46346Q304J5707j3734k5579j0941l338k499J3052O405P92j0797P888L438
8512C35044n693m459j4192j5511j3464M547Q449m258N231p07p051j4235p296N035
8498B71440m499j0941o496m284l446O796n252K310Q135J2790O565O543l900r000
8484B66761j659K6098K0604j435L172l140j666k0475O478L609j6921k436k428
$$ plain form
8471 276562 267576 224423 221350 241580 245762 252880 247643 234949 231928 227147 209956 201750 200540
8458 200540 198086 207457 204197 193863 192980 184649 192801 208336 213390 215292 206814 191604 198966 212591
8444 212591 209891 200097 198730 213884 242293 240814 241960 234994 240774 244027 249912 254158 247042 229264
8430 229264 216209 211991 206862 182390 169629 168605 166096 165973 169621 172470 170874 168209 164940 169150
8416 169150 175978 192012 194580 178229 178252 181133 169222 153779 160931 150020 140515 146073 141946 145790
8402 145790 145186 140389 158756 166366 174724 162362 148633 142676 141605 138252 136291 157222 165651 149981
8388 149981 141110 143179 144299 138227 128198 112521 117340 128884 130091 122120 119998 122079 114410 112835
8374 112835 123573 116297 118729 128736 120479 116419 121489 121707 107900 105461 114147 116046 122346 131792
$$ packed form
8471B76562q986m3153l073K0230M182P118n237j2694l021m781j7191q206j210
8458B00540k454R371l260j0334q83q331Q152J5535N054J902q478j5210P362J3625
8444B12591k700r794j367J5154K8409j479J146o966N780L253N885M246p116j7778
8430B29264j3055m218n129k4472j2761j024k509j23L648K849j596k665l269M210
8416A69150O828J6034K568j6351K3K881j1911j5443P152j0911r505N558m127L844
8402A45790o04m797J8367P610Q358j2362j3729n957j071l353j961K0931Q429j5670
8388A49981q871K069J120o072j0029j5677M819J1544J207p971k122K081p669j575
8374A12835J0738p276K432J0007q257m060N070K18j3807k439Q686J899O300R446
$$ plain form
8360 131792 150047 151239 148090 137936 122682 126023 128554 128847 135678 142628 152736 150893 142652 145070
8346 145070 135581 119501 124162 119354 113651 110040 102283 104739 101675 105068 107979 111693 117651 106837
8332 106837 107854 121001 117017 108727 100051 104576 104705 101259 92000 93543 87427 80687 85794 88931
8318 88931 95493 93323 97493 120046 124053 123123 119728 119988 116936 105204 105222 107968 88923 82632 85068
8303 85068 95656 89995 82491 74262 88146 101316 115401 120874 113900 111380 108031 100246 89339
8290 89339 74837 80936 82366 77076 83054 91771 99144 99539 100942 109798 102949 85206 93466 108919
8276 108919 109617 117438 113649 106734 112940 101573 96871 96173 96740 95983 95469 84410 89970 87126 83367
8261 83367 82054 83692 78465 92989 103252 108339 94986 91298 89627 78710 62571 51098 57814
$$ packed form
8360A31792J8255J192l149j0154j5254L341K531K93O831O950J0108j843q241K418
8346A45070r489j6080M661m808n703l611p757K456l064L393K911L714N958j0814
8332A06837J017J3147l984q290q676M525J29l446r259J543o116o740N107L137
8318H8931O562k170M170K2553M007r30l395K60l052j1732J8K746j9045o291K436
8303H5068J0588n661p504q229J3884J3170J4085N473o974k520l349p785j0907
8290H9339j4502O099J430n290N978Q717P373L95J403Q856o849j7743Q260J5453
8276A08919O98P821l789o915O206j1367m702o98N67p57n14j1059N560k844l759
8261H3367j313J638n227J4524J0263N087j3353l688j671j0917j6139j1473O716
$$ plain form
8248 57814 67020 72648 74896 66122 53826 53362 46415 56885 66651 66819 78032 76710 57282 66527
8234 66527 89104 97268 88011 86403 94547 82785 70241 74708 73939 83783 86188 78559 70834 72282
8220 72282 74235 77086 76715 81130 84163 79797 75176 85989 88288 88176 93668 91584 86182 68497 64830
8205 64830 70260 75974 74736 71589 82759 83254 74069 67114 67486 60679 67876 86075 95264 84077
8191 84077 79368 83681 79708 72920 61964 55562 68078 79146 79666 71762 64830 58145 44938 44999
8177 44999 40689 52623 67566 73424 58349 52002 53071 42127 28674 43105 49165 44929 44813
8164 44813 55373 47868 39925 49430 50322 41624 47085 49535 58608 60988 53535 41085 44812 47202
8150 47202 48983 43698 42217 47631 56922 59149 52619 43692 51786 50296 54259 58108 63602 63421 63766
$$ packed form
8248E7814R206N628K248q774j2296m64o947J0470R766J68J1213j322j9428R245
8234F6527K2577Q164r257j608Q144j1762j2544M467p69R844K405p629p725J448
8220G2282J953K851l71M415L033m366m621J0813K299j12N492k084n402j7685l667
8205F4830N430N714j238l147J1170M95r185o955L72o807P197J8199R189j1187
8191H4077m709M313l973o788j0956o402J2516J1068N20p904o932o685j3207O1
8177D4999m310J1934J4943N858j5075o347J069j0944j3453J4431O060m236j16
8164D4813J0560p505p943R505Q92q698N461K450R073K380p453j2450L727K390
8150D7202J781n285j481N414R291K227o530q927Q094j490L963L849N494j81L45
$$ plain form
8135 63766 70352 65418 58552 64268 66809 62277 52151 58259 61641 68428 78657 73164 58484 67753
8121 67753 86523 77265 67908 69764 61253 54685 53693 52276 58672 69701 67259 54842 55321 50928
8107 50928 61697 69644 67051 66022 64860 58424 57807 62438 57057 52549 50797 59907 79617 80962
8093 80962 89254 84489 69112 59010 42571 47630 62515 65084 62260 60585 70049 61521 62727 70357
8079 70357 63926 68652 80088 76226 78774 83321 77329 59155 63019 71744 68026 61264 68865 82450
8065 82450 95599 100412 99863 87045 74186 64342 62907 63749 62624 60072 49438 54759 73375 73103
8051 73103 68149 50513 58028 84451 94358 92730 91579 90979 89518 85845 78519 72905 70007 81860
8037 81860 100188 96790 88102 79793 79457 76632 72963 86483 109646 102959 111346 118024 112969 117414
$$ packed form
8135F3766O586m934o866N716K541m532j0126O108L382O787J0229n493j4680R269
8121F7753J8770r258r357J856q511o568r92j417O396J1029k442j2417M79m393
8107E0928J0769P947k593j029j162o436o17M631n381m508j752R110J9710J345
8093H0962Q292m765j5377j0102j6439N059J4885K569k824j675R464q528J206P630
8079G0357o431M726J1436l862K548M547n992j8174L864Q725l718o762P601J3585
8065H2450J3149M813n49j2818j2859r844j435Q42j125k552j0634N321J8616k72
8051G3103m954j7636P515K6423R907j628j151o00j461l673p326n614k898J1853
8037H1860J8328l398q688q309l36k825l669J3520K3163o687Q387O678n055M445
$$ plain form
8023 117414 123311 129377 121941 117679 110267 111160 113320 109820 111712 109512 112265 122716 122843 118009 116258
8008 116258 119844 129150 147479 150909 141982 130290 130476 136788 143698 156615 155881 165060 164430 160597
7994 160597 164188 170873 170584 158935 140216 138667 154442 171267 169711 183923 192253 202852 220351
7981 220351 238945 251578 239845 220919 208106 205174 192791 179904 188198 175596 166589 170683
7969 170683 164923 154402 138442 146814 142592 135211 128406 126436 122803 123343 131605 146998 145221 133842
7955 133842 128963 133560 143655 162207 183267 207127 202293 199672 187296 183005 190894 198373 198149
7942 198149 215611 226040 225777 229821 250690 255440 237924 229418 226039 210868 198197 181869 167967
7929 167967 166439 155401 151331 147985 135969 129115 125524 113692 95519 90145 97657 106004 99798
$$ packed form
8023A17414N897O066p436m262p412Q93K160l500J892k200K753J0451J27m834j751
8008A16258L586R306J8329L430q927j1692J86O312O910J2917p34R179o30l833
7994A60597L591O685k89j1649j8719j549J5775J6825j556J4212Q330J0599J7499
7981B20351J8594J2633j1733j8926j2813k932j2383j2887Q294j2602r007M094
7969A70683n760j0521j5960Q372m222p381o805j970l633N40Q262J5393j777j1379
7955A33842m879M597J0095J8552K1060K3860m834k621j2376m291P889P479k24
7942A98149J7462J0429k63M044K0869M750j7516q506l379j5171j2671j6328j3902
7929A67967j528j1038m070l346j2016o854l591j1832j8173n374P512Q347o206
$$ plain form
7916 99798 98222 101884 114588 107701 102562 118746 119904 98000 99020 101419 109554 111932 121552 136423
7902 136423 160619 164502 154150 152830 156512 149327 131605 121853 111142 95502 93165 102802 111821
7889 111821 116807 117650 109020 105295 95236 82434 89775 95776 97019 87423 74860 74185 77246 60878
7875 60878 63723 58495 62211 62457 51211 39318 41862 32855 47133 62591 69595 68549 64051 50786
7861 50786 47654 56503 60354 56944 60442 57463 59168 47063 51969 49281 51973 62555 65091 77373
7847 77373 70094 61308 48504 37976 52724 61023 49167 45503 30277 26368 24133 50197 59342
7834 59342 49971 35542 34471 50049 48999 41740 35449 41091 26300 14298 9660 18616 23839 24713
7820 24713 29532 32722 37432 45466 46182 53211 54382 54132 28008 8604 14013 35175 46109 49690
$$ packed form
7916I9798j576L662J2704o887n139J6184J158k1904J020K399Q135K378R620J4871
7902A36423K4196L883j0352j320L682p185j7722r752j0711j5640k337R637R019
7889A11821M986Q43q630l725j0059j2802P341O001J243r596j2563o75L061j6368
7875F0878K845n228L716K46j1246j1893K544r007J4278J5458P004j046m498j3265
7861E0786l132Q849L851l410L498k979J705j2105M906k688K692J0582K536J2282
7847G7373p279q786j2804j0528J4748Q299j1856l664j5226l909k235K6064R145
7834E9342r371j4429j071J5578j050p259o291N642j4791j2002m638Q956N223Q74
7820B4713M819L190M710Q034P16P029J171k50k6124j9404N409K1162J0934L581
$$ plain form
7806 49690 54318 46757 41512 44184 37425 39280 41983 35847 34856 35284 30674 11086 13050 18451 33202
7791 33202 34712 42068 43512 54701 57466 54614 44407 33898 31842 31706 27410 37219 39129 34493
7777 34493 35181 30207 22415 32379 31209 11134 -4960 -4587 17504 40417 51358 51319 42181 32794
7763 32794 27100 31634 19526 19483 26329 16871 26356 45586 48673 48256 33003 16810 15686 16091 31354
7748 31354 36191 17256 22891 22252 19214 18813 16960 12784 12095 19878 18604 3366 480 292 1611
7733 1611 6334 30707 27342 10151 -1705 -3736 11253 9411 13821 7230 -3636 -8378 -17014 -20465
7719 -20465 -2833 9250 17958 21983 15476 10064 4201 7317 -3667 -14205 -19990 -17789 1840
7706 1840 13000 13135 12636 -4490 -12470 498 3494 -2588 -2078 9783 26263 27062 17401 5045
$$ packed form
7806D9690M628p561n245K672o759J855K703o136r91M28m610j9588J964N401J4751
7791C3202J510P356J444J1189K765k852j0207j0509k056j36m296R809J910m636
7777C4493O88m974p792R964j170k0075j6094L73K2091K2913J0941l9r138r387
7763C2794n694M534j2108m3O846r458R485J9230L087m17j5253j6193j124M05J5263
7748C1354M837j8935N635o39l038m01j853m176o89P783j274j5238k886j88J319
7733A611M723K4373l365j7191j1856k031J4989j842M410o591j0866m742q636l451
7719b0465J7632J2083Q708M025o507n412n863L116j0984j0538n785K201J9629
7706A840J1160J35m99j7126p980J2968K996o082N10J1861J6480P99r661j2356
$$ plain form
7692 5045 8451 6590 1559 7170 11921 25487 26381 22865 17244 16068 25371 38847 30080 12843
7678 12843 23372 25399 22615 27047 20004 15139 19080 17160 22663 26959 13960 13852 21760 14101
7664 14101 11404 13885 24421 13183 1044 -16619 -18253 -11399 596 11553 22774 12757 -1875
7651 -1875 4749 7785 7968 11188 15072 12857 9202 5237 -1561 -4095 -5545 9029 19138 11862 13882
7636 13882 12697 9743 15724 22177 18662 13899 2415 -4478 -8691 -10530 926 3281 -5557 -13213
7622 -13213 -4718 9838 6349 4027 -1596 -8977 -12079 -542 -1381 -3159 3847 29729 39726 29711
7608 29711 26342 15939 -2362 -10742 -9977 -3884 13627 16311 8094 7070 3818 914 -4752 -7977
7594 -7977 -12511 -17256 -15243 605 -344 241 -6505 -8284 -5537 827 -4783 -7293 -5430 -5063 -6039 -12386
$$ packed form
7692E045L406j861n031N611M751J3566Q94l516n621j176R303J3476q767j7237
7678A2843J0529K027k784M432p043m865L941j920N503M296j2999j08P908p659
7664A4101k697K481J0536j1238j2139j7663j634O854J1995J0957J1221j0017j4632
7651a875O624L036J83L220L884k215l655l965o798k534j450J4574J0109p276K020
7636A3882j185k954N981O453l515m763j1484o893m213j839J1456K355q838p656
7622a3213Q495J4556l489k322n623p381l102J1537q39j778P006K5882R997j0015
7608B9711l369j0403j8301q380P65O093J7511K684q217j024l252k904n666l225
7594g977m534m745K013J5848r49N85o746j779K747O364n610k510J863L67r76o347
$$ plain form
7578 -12386 -10966 -26212 -34607 -22062 -5475 -1853 9896 4409 3500 -4405 -21478 -3928 -1864
7565 -1864 -8644 -10957 -14846 -16473 -4339 -1007 8287 6684 1906 13036 13303 1391 -9125 -10760
7551 -10760 -11110 -8674 7634 20154 15770 18706 21165 22341 18582 3110 661 14503 27020 34099
7537 34099 27242 20041 23034 23986 29299 32511 24240 17313 12171 9832 26599 36245 9765 -10415
7523 -10415 -1258 10453 -6879 -17548 -11666 22641 24415 16104 14091 1271 -4605 3526 15190
7510 15190 16165 9275 -1907 -3671 913 -9682 -7361 788 8452 12325 27937 30582 9609 2945
7496 2945 -8327 -7646 -5731 -1222 -474 -14750 -30434 -46720 -49790 -27147 -13229 0 8732 9352
7482 9352 3742 -6320 -514 1275 -8139 -10070 5113 2234 -52 -9747 -12073 -15822 -12802 -4546
$$ packed form
7578a2386J420j5246q395J2545J6587L622J1749n487r09p905j7073J7550K064
7565a864o780k313l889j627J2134L332R294j603m778J1130K67j1912j0516j635
7551a0760l50K436J6308J2520m384K936K459J176l759j5472k449J3842J2517P079
7537C4099o857p201K993R52N313L212q271o927n142k339J6767R646k6480k0180
7523a0415R157J1711j7332j0669N882L4307J774q311k013j2820n876Q131J1664
7510A5190R75o890j1182j764M584j0595K321Q149P664L873J5612K645k0973o664
7496B945j1272O81J915M509P48j4276j5684j6286l070K2643J3918J3229Q732O20
7482I352n610j0062N806J789r414j931J5183k879k286r695k326l749L020Q256
$$ plain form
7468 -4546 -8949 -7381 5764 1232 -779 6326 21475 23425 18558 11209 -2365 -11049 -14516 -3208
7454 -3208 3321 9154 19029 25877 19138 -154 9871 13811 7820 8130 5508 572 5631 15792
7440 15792 11903 5724 5938 13475 19647 6917 -12646 -22298 -25379 -10392 87 11769 12064 1288
7426 1288 -8665 -19423 -20985 -91 13179 17772 16591 763 -7041 -7245 -5717 -11333 -6891 -5451
7412 -5451 -10195 -10907 -7596 -7959 648 8969 16620 22945 10901 -3298 -6576 -19584 -14321 -4484 -6643
7397 -6643 -18323 -16427 -10739 -868 3547 6099 -4818 -2056 4382 3901 -3737 -9345 -6724 1129 -9843
7382 -9843 -16546 -26795 -26109 -16912 -20777 -12649 -5668 483 3517 7450 6257 -8087 -11396 7673
7368 7673 -4401 -6397 -10089 -11480 -4029 -2292 -4159 -9365 -16424 -10938 -11344 -2632 13425 14312 4723
$$ packed form
7468d546m403J568J3145m532k011P105J5149J950m867p349j3574q684l467J1308
7454c208O529N833R875O848o739j9292J0025L940n991L10k622m936N059J0161
7440A5792l889o179K14P537O172j2730j9563r652l081J4987J0479J1682K95j0776
7426A288r953j0758j562K0894J3270M593j181j5828p804k04J528n616M442J440
7412e451m744p12L311l63Q607Q321P651O325j2044j4199l278j3008N263R837k159
7397f643j1680J896N688R871M415K552j0917K762O438m81p638n608K621P853j0972
7382i843o703j0249O86R197l865Q128O981O151L034L933j193j4344l309J9069
7368G673j2074j996l692j391P451J737j867n206p059N486m06Q712J6057Q87r589
$$ plain form
7353 4723 9843 18753 18045 17256 17618 5181 10079 15716 7791 7087 100 -7059 -2040 4821 4821 -1017
7337 -1017 8665 2745 3249 5414 13529 21739 4371 -12956 -11852 -11046 -19903 -30162 -27797 -23033 -21857
7322 -21857 -18442 -14428 -25119 -17288 5572 15558 7177 -11732 -11998 -4439 1573 387 3211 5167
7308 5167 -7151 -5717 2224 -2007 -2006 6933 7607 -4302 -3702 -7225 -11775 -3753 3388 9658 5434 4571
7292 4571 9644 19597 21648 23303 10954 12102 13597 8448 2353 9659 4740 1701 -3761 384 13573
7277 13573 10357 -9065 -185 -2274 -14944 -17434 -24620 -18601 -14232 -11139 -11444 783 15189 298
7263 298 602 6275 7408 8796 15291 -2529 -15467 -5967 9528 2043 -11149 -7504 12158 11854
7249 11854 173 6188 16706 19047 21783 26048 22705 19520 17774 6448 -12015 -12883 -3189 -2125
$$ packed form
7353D723N120Q910p08p89L62j2437M898N637p925p04o987p159N019O861%n838
7337a017R682n920N04K165Q115Q210j7368j7327J104Q06q857j0259K365M764J176
7322b1857L415M014j0691P831K2860R986q381j8909k66P559O012j186K824J956
7308E167j2318J434P941m231JQ939O74j1909O00l523m550Q022P141O270m224q63
7292D571N073R953K051J655j2349J148J495n149o095P306m919l039n462M145J3189
7277A3573l216j9422Q880k089j2670k490p186O019M369L093l05J2227J4406j4891
7263B98L04N673J133J388O495j7820j2938R500J5495p485j3192L645J9662l04
7249A1854j1681O015J0518K341K736M265l343l185j746j1326j8463q68R694J064
$$ plain form
7235 -2125 -3742 -3664 -4457 -12772 -4474 -15570 -26606 -21917 -25857 -24477 -23940 -18963 -24743 -25507 -29370 -21844
7219 -21844 -31095 -26530 -21618 -15938 -13716 -21371 -9205 -381 -893 5209 4343 -791 -15796 -23613 -22517
7204 -22517 -7790 -3546 -10867 -2160 -2998 -21271 -16326 -15081 -15617 -30325 -38781 -24190 -7245 -10141
7190 -10141 -6778 9442 17231 12931 1907 -18961 -14380 -9096 587 11894 2305 -7857 -12305
7177 -12305 -13969 -3361 2334 -1730 -3080 1197 -9931 -25518 -18139 -10914 613 12260 14035
7164 14035 6903 -6002 -23897 -8418 2298 5998 9865 4171 12397 13908 2052 -8345 -13692
7151 -13692 1718 13419 4982 -19974 -23993 -7954 -13974 -24646 -26254 -13414 -3940 -12390 -2962
7138 -2962 -5924 -12761 -13576 -5828 -6654 -5386 -9097 -21977 -24985 -27580 -25231 -23287 -26466 -28718 -27929
$$ packed form
7235b125j617P8p93q315Q298j1096j1036M689l940J380N37M977n780p64l863P526
7219b1844r251M565M912N680K222p655J2166Q824n12O102q66n134j5005p817J096
7204b2517J4727M244p321Q707q38j8273M945J245n36j4708q456J4591J6945k896
7190a0141L363J6220P789m300j1024k0868M581N284R683J1307r589j0162m448
7177a2305j664J0608N695m064j350M277j1128j5587P379P225J1527J1647J775
7164A4035p132j2905j7895J5479J0716L700L867n694Q226J511j1856j0397n347
7151a3692J5410J1701q437k4956m019J6039o020j0672j608J2840R474q450R428
7138b962k962o837q15P748q26J268l711j2880l008k595K349J944l179k252P89
$$ plain form
7123 -27929 -16068 -5117 -3210 -1963 6143 -3658 -2507 -14663 -12951 -13666 -20987 -16550 9380 16248
7109 16248 15 1242 1448 -3744 -8926 -5996 4160 20883 14766 10937 14829 7452 5199 5158 8349
7094 8349 10632 -172 -10743 -13578 -16902 -17346 -20131 -8655 595 -5577 -4535 4055 2452 5149
7080 5149 22155 20796 15243 21784 11652 -2132 4401 18111 10332 -4691 -2790 -1450 -14556
7067 -14556 -5472 1597 -3103 -17673 -16443 -2989 -2393 -7085 7238 2198 -5688 -4873 -530 7989
7053 7989 1672 -12958 -15044 -4795 3015 14302 5348 4965 4798 -3272 -4067 -3444 -5629 -9742 -678
7038 -678 11801 13708 11472 -1273 -7541 -10676 684 -1051 -3030 2591 8115 2849 -14555 -2680
7024 -2680 11766 12620 10471 4972 554 6974 -7881 -17555 -10562 -7081 -7162 2646 -2176 3374 1366
$$ packed form
7123b7929J1861J0951J907J247Q106r801J151j2156J712p15p321M437K5930O868
7109A6248j6233J227K06n192n182K930J0156J6723o117l829L892p377k253m1L191
7094H349K283j0804j0571k835l324m44k785J1476R250o172J042Q590j603K697
7080E149J7006j359n553O541j0132j3784O533J3710p779j5023J901J340j3106
7067a4556R084P069m700j4570J230J3454N96m692J4323n040p886Q15M343Q519
7053G989o317j4630k086J0249P810J1287q954l83j67q070p95O23k185m113R064
7038f78J2479J907k236j2745o268l135J1360j735j979N621N524n266j7404J1875
7024b680J4446Q54k149n499m418O420j4855r674O993L481q1R808m822N550k008
$$ plain form
7009 1366 1801 -9549 -17703 -11138 -11383 -16175 -8756 -10943 -18051 -21876 -18653 -19459 -19667 -907 11183
6994 11183 15524 20064 12758 7356 24708 29178 19055 7993 -12825 -29870 -45864 -42205 -42926
6981 -42926 -28855 -9856 -8128 -18616 -20946 -11612 870 4905 6399 3600 -3163 -10834 -24311
6968 -24311 -13259 -18171 -17355 -8970 4015 8398 -12038 -25553 -27672 -14712 -3953 -7322 -16023
6955 -16023 -12196 6998 15823 -5033 -2767 4502 11973 6412 -7204 -6423 -1013 -720 -11933 -16648
6941 -16648 -23598 -30162 -26725 -21989 -9120 -2184 -2853 3368 7212 -8117 -18455 -15591 -8953 1411
6927 1411 -8940 -19817 -19557 -20915 -11055 -16127 -5556 6922 13466 7081 2448 -6128 -10736 -6106
6913 -6106 662 4878 2798 -10550 -26397 -22902 -12633 2866 12932 10392 -5280 -5855 5470
$$ packed form
7009A366M35j1350q154O565k45m792P419k187p108l825L223q06k08J8760J2090
6994A1183M341M540p306n402J7352M470j0123j1062k0818j7045j5994L659p21
6981d2926J4071J8999J728j0488k330R334J2482M035J494k799o763p671j3477
6968b4311J1052m912Q16Q385J2985M383k0436j3515k119J2960J0759l369q701
6955a6023L827J9194Q825k0856K266P269P471n561j3616P81N410K93j1213m715
6941a6648o950o564L437M736J2869O936o69O221L844j5329j0338K864O638J0364
6927A411j0351j0877K60j358R860n072J0571J2478O544o385m633q576m608M630
6913f106O768M216k080j3348j5847L495J0269J5499J0066k540j5672n75J1325
$$ plain form
6900 5470 -7279 -16915 -11233 -3613 9213 18276 19391 24073 14262 8356 -2286 6949 667 751 -9220
6885 -9220 -25065 -34850 -22814 -11650 6836 8606 8250 6384 -1909 -4108 -955 3110 7963 20322
6871 20322 7846 -1169 1088 2409 8681 5670 -4668 -9884 -9952 -24194 -24435 -4413 9790 30407
6857 30407 39909 26540 14661 8307 -845 -9434 -15049 -14868 -15649 -7459 3886 16702 28442 26668
6843 26668 5775 4487 2329 -9920 -11128 -4184 -8332 -12429 -20815 -19133 -24516 -23451 -7520 -9390
6829 -9390 -19136 -5012 -784 4239 -9519 -24171 -25640 -32599 -10705 8882 7338 -959 -1744 -11179
6815 -11179 -12208 -19478 -19170 -129 6843 5111 -4380 -15193 -5823 3887 10874 1305 -3545 9034
6801 9034 11927 -6553 -12057 -16769 -10396 -3790 1809 13420 10055 8527 4871 6158 22792 22982
$$ packed form
6900E470j2749r636N682P620J2826R063J115M682r811n906j0642R235o282Q4r971
6885i220j5845r785J2036J1164J8486J770l56j866q293k199L153M065M853J2359
6871B0322j2476r015K257J321O272l011j0338n216o8j4242k41K0022J4203K0617
6857C0407R502j3369j1879o354r152q589n615J81p81Q190J1345J2816J1740j774
6843B6668k0893j288k158j2249j208O944m148m097q386J682n383J065J5931j870
6829i390r746J4124M228N023j3758j4652j469o959K1894J9587j544q297p85r435
6815a1179j029p270L08J9041O972j732r491j0813R370R710O987r569m850J2579
6801I034K893j8480n504m712O373O606N599J1611l365j528l656J287J6634J90
$$ plain form
6787 22982 7065 10125 18355 27203 23793 11385 -639 -7009 -16276 657 -83 3705 -1937 -8961
6773 -8961 -24624 -32113 -35579 -21375 -12132 -13817 -12854 -16526 -29071 -23948 -5249 -10799 -13653 -2168
6759 -2168 -5962 -14062 -4483 526 -1496 3339 16444 17580 2297 -10153 -16725 -30512 -23826 -18546
6745 -18546 -14880 -8324 -8992 -4731 -5506 -5769 -3259 6833 9622 5919 -2105 4422 6879 3569 -3921
6730 -3921 8161 14415 25952 30143 15932 4327 776 345 11630 9930 -1385 2265 15506
6717 15506 22849 23583 22818 16694 14398 15453 27853 52811 65170 76099 64758 53351 45733 40701
6703 40701 29474 12881 2495 2450 4000 -11711 -13741 -2975 1568 -764 9504 13552 9713 6251
6689 6251 397 1057 9389 10318 9449 6026 5600 10382 -4698 -26147 -32974 -32563 -9842 5267 3305
$$ packed form
6787B2982j5917L060Q230Q848l410j2408j2024o370r267J6933p40L788n642p024
6773h961j5663p489l466J4204R243j685R63l672j2545N123J8699n550k854J1485
6759b168l794q100R579N009k022M835J3105J136j5283j2450o572j3787O686N280
6745a8546L666O556o68M261p75k63K510J0092K789l703q024O527K457l310p490
6730c921J2082O254J1537M191j4211j1605l551m31J1285j700j1315L650J3241
6717A5506P343P34p65o124k296J055J2400K4958J2359J0929j1341j1407p618n032
6703D0701j1227j6593j0386m5J550j5711k030J0766M543k332J0268M048l839l462
6689F251n854O60Q332R29q69l423m26M782j5080k1449o827M11K2721J5109j962
$$ plain form
6674 3305 -5366 -718 -2439 -4902 3694 -1241 -6695 -4636 3374 8304 20366 18505 7239 -7020
6660 -7020 -12395 -4851 327 -3252 -9090 -12190 -10390 -17626 -27710 -23312 -4296 16980 18358 5812
6646 5812 -4409 4733 10592 17448 9461 4277 6233 -3526 -15400 -21248 -12052 -967 -4458 -8472
6632 -8472 -11317 -3053 4281 4387 -7618 -10245 1465 8383 16516 18558 3820 247 -11051 -21956
6618 -21956 -29472 -20706 -8551 10059 -4135 -7929 1728 4031 -3680 -7157 6913 12109 12959 7407
6604 7407 15282 11029 9459 -1251 10749 7383 5698 -5398 -9468 -13263 -2282 5330 11108 1317
6590 1317 -8086 -15185 -15687 -23768 -22476 -16417 -8108 -12643 -18427 -10389 492 -11433 -12952 -5965 -4174
6575 -4174 6298 -5731 -11591 -3345 5106 701 6098 2685 -7675 -12627 -11274 -8062 -5523 -7940
$$ packed form
6674C305q671M648j721k463Q596m935n454K059Q010M930J2062j861j1266j4259
6660g020n375P544N178l579n838l100J800p236j0084M398J9016K1276J378j2546
6646E812j0221R142N859O856p987n184J956r759j1874n848R196J1085l491m014
6632h472k845Q264P334J06j2005k627J1710O918Q133K042j4738l573j1298j0905
6618b1956p516Q766J2155J8610j4194l794R657K303p711l477J4070N196Q50n552
6604G407P875m253j570j0710J2000l366j685j1096m070l795J0981P612N778r791
6590A317r403p099n02q081J292O059Q309m535n784Q038J0881j1925j519O987J791
6575d174J0472j2029n860Q246Q451m405N397l413j0360m952J353L212K539k417
$$ plain form
6561 -7940 -179 8670 -2645 -14696 -14573 -13074 -9200 -1428 -6049 -23116 -27826 -27093 -16898 -3270
6547 -3270 -4204 8085 16108 7907 3830 -8442 7027 9428 -1397 -9735 -7679 -3601 5600 23395
6533 23395 25879 12281 -5372 -14382 -12439 -8413 56 -380 4660 -1663 -1519 -2198 -25014 -37103
6519 -37103 -24899 -16489 -25764 -33883 -30159 -27936 -18645 -4252 -3671 1579 17241 9199 -4428 -13526
6505 -13526 -9729 -5020 7034 13639 -6661 -14165 -14073 -12508 -22820 -27898 -17222 -11180 1813 -1291
6491 -1291 -16767 -12097 -19570 -11600 1734 -3628 -1640 -5155 -5261 -11443 -8890 -12899 -17812 -27527 -14189
6476 -14189 -12270 -16996 -12936 17897 26608 23896 20774 15310 12189 15704 11531 -3743 -9021 -9406
6462 -9406 -9171 -4632 9592 9758 -12608 -26796 -10569 -13318 -11418 -15548 -20867 -16563 -2012 -5472
$$ packed form
6561g940P761Q849j1315j2051J23J499L874P772m621j7067m710P33J0195J3628
6547c270r34J2289Q023q201m077j2272J5469K401j0825q338K056M078R201J7795
6533B3395K484j3598j7653r010J943M026Q469m36N040o323J44o79k2816j2089
6519c7103J2204Q410r275q119L724K223R291J4393N81N250J5662q042j3627r098
6505a3526L797M709J2054O605k0300p504R2J565j0312n078J0676O042J2993l104
6491a291j5476M670p473P970J3334n362J988l515j06o182K553m009m913r715J3338
6476a4189J919m726M060L0833Q711k712l122n464l121L515m173j5274n278l85
6462i406K35M539J4224J66k2366j4188J6227k749J900m130n319M304J4551l460
$$ plain form
6448 -5472 -14953 -5059 -2794 -7269 991 8145 8248 2852 -9667 -5757 2559 8855 10473 1322 -2907
6433 -2907 2216 5646 -2507 -651 6493 6347 13238 23272 19408 8058 4571 18724 13872 1035
6419 1035 -9219 -20141 -6422 2762 7405 9269 12428 16903 7341 6299 -363 -11558 -6012 -7227
6405 -7227 -13791 -11059 14566 10781 -4391 -9280 2174 13707 10951 11901 17867 21470 14515 4901
6391 4901 1604 -7077 4599 -1356 -1486 -16606 -22417 -15685 -7066 -17673 -19533 -15908 -20459 -4220
6377 -4220 16246 21047 8524 -9504 -23004 -21653 -5020 -8762 -15521 -19690 -16464 -29551 -32571
6364 -32571 -19973 -18983 -20479 -22566 -15094 -24692 -21891 -6620 6276 9876 -1153 -1467 5591 6129
6350 6129 12835 23742 10637 8656 15243 25948 17158 15814 14924 7195 -11027 -13925 -15115 -16627
$$ packed form
6448e472r481R894K265m475Q260P154J03n396j2519L910Q316O296J618r151m229
6433b907N123L430q153J856P144j46O891J0034l864j1350l487J4153m852j2837
6419A035j0254j0922J3719R184M643J864L159M475r562j042o662j1195N546j215
6405g227o564K732K5625l785j5172m889J1454J1533k756R50N966L603o955r614
6391D901l297q681J1676n955j30j5120n811O732Q619j0607j860L625m551J6239
6377d220K0466M801j2523j8028j3500J351J6633l742o759m169L226j3087l020
6364c2571J2598R90j496k087P472r598K801J5271J2896L600j1029l14P058N38
6350F129O706J0907j3105j981O587J0705q790j344q90p729j8222k898j190j512
$$ plain form
6336 -16627 -19785 -25254 -25010 -21175 -15423 4929 5306 1612 249 -10289 -12587 -14529 -8049 953 5737
6321 5737 4471 -1067 463 6478 11461 13877 11878 754 6600 20891 15635 18273 24454 28175
6307 28175 29322 34864 33242 14345 8090 1701 5484 13302 11443 8200 7965 8139 -8126 -19381
6293 -19381 -13749 -11318 -11394 -20508 -9248 -14493 -23858 -12345 -931 1610 -3082 -280 7674 6510
6279 6510 -5673 -20185 -17420 -7773 -5426 -746 -2817 5082 -1081 -5248 -5657 -2371 3599 11030 -5428
6264 -5428 -8922 3820 966 -2214 -669 -2435 -4582 -23977 -25659 -14704 -6976 -2661 5324 14127
6250 14127 21976 21635 11931 -10425 -25637 -18874 4985 26270 22560 10391 7819 16845 9362 8996
6236 8996 14262 5604 -7805 -22153 -15405 -9787 -6483 -13510 -22616 -13913 -4224 -8624 -5830 -228
$$ packed form
6336a6627l158n469K44L835N752K0352L77l694j363j0538k298j942O480R002M784
6321E737j266n538J530O015M983K416j999j1124N846J4291n256K638O181L721
6307B8175J147N542j622j8897o255o389L783P818j859l243k35J74j6265j1255
6293a9381N632K431p6r114J1260n245r365J1513J1414K541m692K802P954j164
6279F510j2183j4512K765R647K347M680k071P899o163m167m09L286N970P431j6458
6264e428l494J2742k854l180J545j766k147j9395j682J0955P728M315P985Q803
6250A4127P849l41r704k2356j5212O763K3859K1285l710j2169k572R026p483l66
6236H996N266q658j3409j4348O748N618L304p027r106Q703R689m400K794N602
$$ plain form
6222 -228 -6438 -22370 -32728 -20485 -11960 -15451 -177 2545 2132 9996 6198 10593 1322 9612
6208 9612 15887 20053 10280 3532 7148 2398 6414 5468 -9084 -22029 -16166 -15013 -15075 7116 21449
6193 21449 14460 11016 -3343 -5519 -12518 -8541 3346 2758 -3602 3545 -2755 -10534 -14445 -4346
6179 -4346 1357 -6346 -13176 -892 23795 26543 11006 2203 -2232 6110 7254 -5211 -15944 -5955
6165 -5955 -4746 -3345 13518 25844 27807 9564 1969 -2980 986 -7449 -19157 -23861 -22719 -11519
6151 -11519 -11040 -24579 -32594 -34743 -17172 -19288 -18392 -25025 -12916 2432 -8421 -10110 2540 4378
6137 4378 -4857 -6847 -12030 -9889 -25359 -17977 -7224 -3627 -10895 -18870 -27002 -24652 -17295 -8148
6123 -8148 -16156 -7974 5659 9713 2058 23051 20830 7883 -181 6166 -5789 -15987 -18880 -15247
$$ packed form
6222b28o210j5932j0358J2243Q525l491J5274K722m13P864l798M395r271Q290
6208I612O275M166r773o748L616m750M016r46j4552j2945N863J153o2K2191J4333
6193B1449o989l444j4359k176o999L977J1887n88o360P147o300p779l911J0099
6179d346N703p703o830J2284K4687K748j5537q803m435Q342J144j2465j0733R989
6165e955J209J401J6863J2326J963j8243p595m949L966q435j1708m704J142J1200
6151a1519M79j3539q015k149J7571k116Q96o633J2109J5348j0853j689J2650J838
6137D378r235j990n183K141j5470P382J0753L597p268p975q132K350P357R147
6123h148q008Q182J3633M054p655K0993k221j2947q064O347j1955j0198k893L633
$$ plain form
6109 -15247 -13473 -22514 -23879 -17391 2527 7041 -4244 -16183 -28089 -24853 -25040 -31260 -29082 -15873
6095 -15873 -11287 -9352 9469 4107 -13513 -10645 -5130 1308 2518 3671 -6961 -6320 -6871 -13897
6081 -13897 -1108 -404 -10497 -7988 -10492 -29969 -26779 -18467 -10431 -2112 -4979 -3277 -19855 -31815
6067 -31815 -29871 -31284 -37124 -28302 -11054 608 6507 470 7239 12281 19614 24553 15293 19714
6053 19714 1813 -15020 -7792 4582 2482 -12823 -18800 -15857 -8544 -9869 -13840 -6162 2573 -3084
6039 -3084 -6712 -15419 -17468 -19741 -20472 -13894 -8552 -3914 1172 7548 9591 19186 13072 3711 6993
6024 6993 5886 10416 -2886 -21413 -25194 -17407 -5064 2448 -7271 -4843 -7756 -9682 -10816 -11885
6010 -11885 -12545 -6964 -9643 -17985 -22894 -8531 4287 11245 8826 14012 18385 6324 7131 837
$$ packed form
6109a5247J774r041j365O488J9918M514j1285j1939j1906L236j87o220K178J3209
6095a5873M586J935J8821n362j7620K868N515O438J210J153j0632O41n51p026
6081a3897J2789P04j0093K509k504j9477L190Q312Q036Q319k867J702j6578j1960
6067c1815J944j413n840Q822J7248J1662N899o037O769N042P333M939r260M421
6053A9714j7901j6833P228J2374k100j5305n977K943P313j325l971P678Q735n657
6039c084l628q707k049k273p31O578N342M638N086O376K043R595o114r361L282
6024F993j107M530j3302j8527l781P787J2343P512r719K428k913j926j134j069
6010a1885o60N581k679q342m909J4363J2818O958k419N186M373j2061Q07o294
$$ plain form
5996 837 -6690 351 12967 19315 4534 -7253 -8473 -7907 -12811 -10614 1558 3204 7022 7132 316
5981 316 -1260 -2156 1244 -2140 -3707 -10731 -11698 -13371 -17183 -17858 -21736 -30542 -23959 -11763 -2226 -10263
5965 -10263 -9111 -14551 -15551 -8864 -11943 -6288 2662 12380 18086 15834 664 -12231 -15243 -4433
5951 -4433 1826 -6927 -2225 1298 -1837 -2472 -2746 -7675 -7742 -7091 -14792 -4913 6819 -2482 -6705 -2349
5935 -2349 -8789 -13700 -17248 -19504 1437 3769 -5944 -9048 -7601 2538 10221 6058 1870 -4063
5921 -4063 5150 -4258 -9550 -21410 -25535 -29745 -13617 -9137 -13361 5550 14112 6241 1716 15859
5907 15859 -1187 -17372 -5779 8416 2383 -12526 -7041 93 952 1608 1599 -8340 3696 970
5893 970 -16396 -12104 -11137 -5099 5744 12945 10207 4704 -3953 -1811 -4832 -11921 -11035 4500 2906
$$ packed form
5996H37p527P041J2616O348j4781j1787j220N66m904K197J2172J646L818J10o816
5981C16j576q96L400l384j567p024r67j673l812o75l878q806O583J2196R537q037
5965a0263J152n440j000O687l079N655Q950R718N706k252j5170j2895l012J0810
5951d433O259q753M702L523l135o35k74m929o7O51p701R879J1732r301m223M356
5935b349o440m911l548k256K0941K332r713l104J447J0139P683m163m188n933
5921d063R213r408n292j1860m125m210J6128M480m224J8911Q562p871m525J4143
5907A5859j7046j6185J1593J4195o033j4909N485P134Q59O56rr939J2036k726
5893I70j7366M292R67O038J0843P201k738n503q657K142l021p089Q86J5535j594
$$ plain form
5878 2906 10711 24783 16925 13445 13298 9131 9312 2941 8278 20423 21943 32307 36164 34261 28824
5863 28824 21830 7596 -4814 -90 3988 -19171 -33303 -30403 -29586 -27114 -17572 -11713 -8249 -10989
5849 -10989 -22856 -21920 -8038 2818 3431 1980 -6045 -9006 -13428 -13213 -17914 -23722 -16683 -4849
5835 -4849 -3392 -9116 2886 13317 22262 17119 16422 14294 10082 7093 11094 10034 1254 -12867
5821 -12867 -8942 -2607 1720 -978 -1380 -8119 -14827 -10396 -11912 -10388 -11830 -9416 -14406 -9033 -20527
5806 -20527 -13777 -9449 -16045 -13606 -20081 -15136 -9246 -162 4219 673 -7185 -13831 -13745 -22760 -12827
5791 -12827 2598 -4451 -6407 -2418 6243 20832 14796 5363 5905 -15338 -28109 -19298 -6124 2612
5777 2612 -6625 -9863 -10495 -11005 -8496 -9191 -16037 -28350 -27506 -9191 2769 -644 1419 9429 13825
$$ packed form
5878B906P805J4072p858l480j47m167J81o371N337J2145J520J0364L857j903n437
5863B8824o994j4234j2410M724M078k3159j4132K900Q17K472R542N859L464k740
5849a0989j1867R36J3882J0856O13j451q025k961m422K15m701n808P039J1834
5835d849J457n724J2002J0431Q945n143o97k128m212k989M001j060q780j4121
5821a2867L925O335M327k698m02o739o708M431j516J524j442K414m990N373j1494
5806b0527O750M328o596K439o475M945N890R084M381l546p858o646Q6r015R933
5791a2827J5425p049j956L989Q661J4589o036r433N42k1243j2771Q811J3174Q736
5777B612r237l238o32n10K509o95o846j2313Q44J8315J1960l413K063Q010M396
$$ plain form
5762 13825 9497 -2464 -6873 1604 8628 -8110 -25656 -23545 4822 24579 29592 12715 2601
5749 2601 -11693 4039 13797 18327 25205 20984 396 -7032 2612 2388 -5564 -8897 -14913 -17693
5735 -17693 -11827 -14392 -4201 6872 1128 -6527 -6938 -15349 -5903 2165 2524 10113 14996 13834 -1982
5720 -1982 -8330 -13239 -18121 -7540 -2236 -19479 -19449 -15490 -1314 10430 7048 2708 -24 -8898
5706 -8898 -11987 9148 7466 11987 17069 13555 3004 -4251 2093 -4396 -12101 -10123 -3408 9812
5692 9812 20781 23043 23919 16163 9364 -1257 -4683 -5490 854 1462 8380 7850 7828 15215 14066 -1554
5676 -1554 -10628 -11816 -14149 -6968 -859 -723 6029 6695 8292 1506 -4858 -11829 -16335 -8644 3227
5661 3227 5081 -1430 2589 8084 -4726 -10531 -9282 2890 10499 1732 -3519 -11334 -6419 -5629 -3447
$$ packed form
5762A3825m328j1961m409Q477P024j6738j7546K111K8367J9757N013j6877j0114
5749B601j4294J5732R758M530O878m221k0588p428R644k24p952l333o016k780
5735a7693N866k565J0191J1073n744p655m11q411R446Q068L59P589M883j162j5816
5720a982o348m909m882J0581N304j7243L0L959J4176J1744l382m340k732q874
5706h898l089K1135j682M521N082l514j0551p255O344o489p705J978O715J3220
5692I812J0969K262Q76p756o799j0621l426q07O344O08O918n30k2P387j149j5620
5676a554r074j188k333P181O109J36O752O66J597o786o364o971m506P691J1871
5661C227J854o511M019N495j2810n805J249J2172P609q767n251p815M915P90K182
$$ plain form
5646 -3447 7907 -826 -6874 -13413 -13575 -11603 -12306 -68 9247 12783 18482 8389 -9348 -10915
5632 -10915 1248 6696 -12886 -8400 3493 7637 2625 -14770 -20320 -2172 6795 10137 12724
5619 12724 6067 -1652 -2875 1118 2703 8465 -2073 -12657 -12605 -6027 -835 1853 612 4313 -2838
5604 -2838 -7414 -11522 -21218 -15538 -16367 -12075 -9448 -4015 9612 18250 13424 6658 3416 -3183 21
5589 21 -5279 -5976 -14446 -18805 -22974 -18646 -13351 -14322 -12619 -10574 -9836 -10836 -13433 -13164 -14561 -9224
5573 -9224 4717 5615 2179 -16310 -16319 -7994 -42 -2709 3970 13215 7746 -6011 -7964 -14084 -21919
5558 -21919 -12961 2460 7699 12836 7646 15923 8473 557 71 -4711 -10111 -15017 -10715 -9333 -14485
5543 -14485 -17150 -12091 -2017 14207 30148 35202 25246 378 1290 7988 1131 -1929 341 -2179
$$ packed form
5646c447J1354q733o048o539j62J972p03J2238R315L536N699j0093j7737j567
5632a0915J2163N448j9582M486J1893M144n012j7395n550J8148Q967L342K587
5619A2724o657p719j223L993J585N762j0538j0584N2O578N192K688j241L701p151
5604b838m576m108r696N680q29M292K627N433J3627Q638m826o766l242o599L204
5589B1n300o97q470m359m169M328N295r71J703K045P38j000k597K69j397N337
5573i224J3941Q98l436j8489rQ325P952k667O679R245n469j3757j953o120p835
5558b1919Q958J5421N239N137n190Q277p450p916m86m782n400m906M302J382n152
5543a4485k665N059J0074J6224J5941N054r956k4868R12O698o857l060K270k520
$$ plain form
5529 -2179 -3801 5864 6690 7098 11045 60 2425 -336 3022 -12538 -12099 -19631 -16809 -15616 -13155
5514 -13155 -4101 -5777 3801 12421 2084 -6162 -7437 -2653 -7431 -4603 -11988 -6760 -1337 -8432
5500 -8432 -15967 -21791 -19671 -15326 -5433 5966 2911 -10192 -16323 765 3036 -9793 -14597 -11255
5486 -11255 -9176 -14622 -15471 -9788 -3056 8418 14825 9776 5916 -5248 -3029 -4035 -14497 -33540
5472 -33540 -31594 -21600 -13073 -5566 4310 -4173 597 8414 -95 -5590 1278 5868 2683 5366 9625
5457 9625 8240 11291 8921 -7367 -1907 -6894 -4414 -8556 -13393 -14235 -13464 -7596 6399 12202 13174
5442 13174 -7907 -9204 -12380 -17125 -24983 -12954 -9619 -1796 -1625 -10004 -16015 -13018 -18080 -26044
5428 -26044 -11224 1259 -7193 -25687 -27970 -12912 -4191 -2735 1980 13 6694 2075 -9987
$$ packed form
5529b179j622R665Q26M08L947j0985K365k761L358j5560M39p532K822J193K461
5514a3155R054j676R578Q620j0337q246j275M784m778K828p385N228N423p095
5500h432p535n824K120M345R893J1399l055j3103o131J7088K271j2829m804L342
5486a1255K079n446q49N683O732J1474O407n049l860j1164K219j006j0462j9043
5472c3540J946R994Q527P507R876q483M770P817q509n495O868M590l185K683M259
5457I625j385L051k370j6288N460m987K480m142m837q42P71N868J3995N803R72
5442A3174k1081j297l176m745p858J2029L335P823J71q379o011K997n062p964
5428b6044J4820J2483q452j8494k283J5058Q721J456M715j967O681m619j2062
$$ plain form
5415 -9987 -7585 -4456 -1424 -22414 -25817 -24618 -19441 -19841 -13040 -4336 -8262 -12916 -7846 2850 5176
5400 5176 13520 17124 10787 6771 -38 3347 -5151 -2802 7098 5609 6379 97 -11104 -11162 -5927
5385 -5927 12479 16753 22206 24201 16094 5462 11464 12219 5615 -9273 -8975 -4974 -2299 -4662 650
5370 650 -5891 -6902 -10382 -255 -1020 -5199 -9607 -3538 -16287 -17601 -11169 -4566 -7060 -708 -5477
5355 -5477 -27699 -26203 -23679 -25029 -26646 -22657 -22323 -13337 -12617 -13061 -5279 -8921 -14240 -914 44
5340 44 -3503 -10073 -9905 11994 30322 27665 28738 23921 20077 13001 31580 19252 -8317 -7862 5525
5325 5525 23922 16392 6490 -2144 -439 11259 15144 15697 18369 -311 -747 9956 -7430 -9275
5311 -9275 -3559 7893 4574 5795 8589 12479 23467 24914 19510 17765 22084 18155 2955 2112
$$ packed form
5415i987K402L129L032k0990l403J199N177m00O801Q704l926m654N070J0696K326
5400E176Q344L604o337m016o809L385q498K349R900j489P70o282j1201n8N235
5385e927J8406M274N453J995q107j0632O002P55o604j4888K98M001K675k363N312
5370F50o541j011l480J0127p65m179m408O069j2749j314O432O603k494O352m769
5355e477k2222J496K524j350j617L989L34Q986P20m44P782l642n319J3326R58
5340D4l547o570J68K1899J8328k657J073m817l844p076J8579j2328k7569M55J3387
5325E525J8397p530r902q634J705J1698L885N53K672j8680m36J0703j7386j845
5311i275N716J1452l319J221K794L890J0988J447n404j745M319l929j5200q43
$$ plain form
5297 2112 13045 7772 822 5074 17009 21031 3057 -6842 -14412 -19727 -21462 -14630 -1334 9483
5283 9483 17252 9334 560 -5284 1518 -3586 -199 8555 5198 -14157 -18252 -1099 12804 17267
5269 17267 11467 3299 -4709 -330 3730 4084 2823 16867 25765 11759 1697 -11109 -16676 -909
5255 -909 4012 -907 -9965 -9696 -12942 -13843 -13100 -6262 1415 1528 2656 10383 1587 -1074 3021 14384
5239 14384 9187 4651 3430 6094 1369 6931 -3567 -17519 -27599 -26239 -14669 -9193 2527
5226 2527 6391 -4372 8551 15258 2851 -6926 -13384 -5329 6137 11838 -3559 -16957 -4070
5213 -4070 1519 4996 5269 1177 13970 7905 -4436 -13485 -15058 -23990 -9709 -7571 -2005 -7289
5199 -7289 -11505 -22633 -24344 -843 17349 16647 14076 6374 -8346 -4446 17267 9073 -5500 -8548
$$ packed form
5297B112J0933n273o950M252J1935M022j7974r899p570n315j735O832J3296J0817
5283I483P769p918q774n844O802n104L387Q754l357j9355m095J7153J3903M463
5269A7267n800q168q008M379M060L54j261J4044Q898j4006j0062j2806n567J5767
5255i09M921m919r058K69l246r01P43O838P677J13J128P727q796k661M095J1363
5239A4384n197m536j221K664m725N562j0498j3952j0080J360J1570N476J1720
5226B527L864j0763J2923O707j2407r777o458Q055J1466N701j5397j3398J2887
5213d070N589L477K73m092J2793o065j2341r049j573q932J4281K138N566n284
5199g289m216j1128j711K3501J8192p02k571p702j4720L900K1713q194j4573l048
$$ plain form
5185 -8548 -15138 -24344 -11689 -25055 -31247 -18343 -9973 -13133 -24414 -27854 -27374 -20224 -10681 4421
5171 4421 11706 17787 8054 -5317 -20790 -18605 -7067 -3286 -11650 -15873 54 18819 21222 9676
5157 9676 6833 7257 9259 1531 -656 9202 9877 15017 -2367 -17545 -15756 1968 19239 22559
5143 22559 9627 18394 25040 9878 3659 4009 6091 3873 2404 11547 15625 10719 579 1968
5129 1968 5675 15954 1359 3040 8783 19775 13635 26988 21749 11128 9008 1237 -10946
5116 -10946 -11210 -16255 -15314 -15893 -12919 -18057 -13716 -8344 -15794 -10023 -3901 -10578 -13611 -11650 -3021
5101 -3021 3968 1933 -107 6496 13446 19316 18784 19156 18256 -848 -15091 -15862 -11176 -8878 -11192
5086 -11192 -13883 -7024 -5593 -6783 -10771 4724 -10296 -8234 -6796 -11687 -6690 -17813 -11282 -10688
$$ packed form
5185h548o590r206J2655j3366o192J2904Q370l160j1281l440M80P150R543J5102
5171D421P285O081r733j3371j5473K185J1538L781q364m223J5927J8765K403j1546
5157I676k843M24K002p728k187R858O75N140j7384j5178J789J7724J7271L320
5143B2559j2932Q767O646j5162o219L50K082k218j469R143M078m906j0140J389
5129A968L707J0279j4595J681N743J0992o140J3353n239j0621k120p771j2183
5116a0946k64n045R41n79K974n138M341N372p450N771O122o677l033J961Q629
5101c021O989k035k040O603O950N870n32L72r00j9104j4243p71M686K298k314
5086a1192k691O859J431j190l988J5495j5020K062J438m891M997j1123O531N94
$$ plain form
5072 -10688 -19273 -16047 -20450 -26955 -29914 -14291 -390 4204 1406 -7567 -25764 -28013 -13297 -5261
5058 -5261 -10703 -9419 -334 -2686 -2997 8271 5624 -10269 -6892 -10039 -4270 7942 5359 7117
5044 7117 16215 13976 11255 17988 5075 -2903 3539 -1394 1839 -67 -1415 -2861 -1877 -3366 4504
5029 4504 15214 18506 16700 29830 16383 7677 10031 12347 12879 -2834 -21457 -12768 -8130 2446
5015 2446 20162 16399 20747 12803 6140 16936 13804 -9069 -11873 -10539 -3929 -308 -12353 -1887
5001 -1887 1584 -2959 -5038 4070 1830 -3135 5540 7578 6271 13343 4894 -5726 -14540 -16368 -10484
4986 -10484 -5652 8573 5313 -4961 -16155 -24474 -27649 -20735 -14078 -8670 721 -1393 -6125 -11942
4972 -11942 -10017 -12861 -13613 -12691 -8903 -4775 -2542 -7392 -2794 -2216 4307 12326 14760 13432 13526 2363
$$ packed form
5072a0688q585L226m403o505k959J5623J3901M594k798q973j8197k249J4716Q036
5058e261n442J284R085k352l11J1268k647j5893L377l147N769J2212k583J758
5044G117R098k239k721O733j2913p978O442m933L233j906j348j446R84j489P870
5029D504J0710L292j806J3130j3447q706K354K316N32j5713j8623Q689M638J0576
5015B446J7716l763M348p944o663J0796l132k2873k804J334O610L621j2045J0466
5001a887L471m543k079R108k240m965Q675K038j307P072q449j0620q814j828N884
4986a0484M832J4225l260j0274j1194q319l175O914O657N408R391k114m732n817
4972a1942J925k844p52R22L788M128K233m850M598N78O523Q019K434j328R4j1163
$$ plain form
4956 2363 -8400 -547 -2108 -6958 -12594 -11945 -10755 -13206 -1196 6279 9999 -8275 -22801 -25487
4942 -25487 -17683 -29775 -24390 710 16929 16981 9679 8149 11218 12497 12343 19414 11730 9641 10464
4927 10464 -1359 -8535 -8901 -12118 -11592 -7536 -4210 -1576 -8905 -19108 -20854 -25413 -26490 -20198 -11182
4912 -11182 -4548 -7801 -6579 -6852 -23356 -34650 -24482 -4942 1146 -2316 -5310 -7605 -7095 -12572
4898 -12572 -14026 -26382 -32241 -31597 -32537 -29861 -28320 -20428 -3567 6631 3479 -6057 -9188 -16405
4884 -16405 -18192 -17025 -16115 -2094 4079 4268 -8033 -1315 6911 14817 23339 27956 26894 12446
4870 12446 -390 921 13736 -2417 -7713 -12081 -1366 168 -7692 1021 11000 19797 22553 8080
4856 8080 -2890 -8406 -1068 4035 -4339 -1082 -5443 -346 -9862 -15739 -15654 -16634 -19971 -18302 -7845
$$ packed form
4956B363j0763P853j561m850n636O49J190k451J2010P475L720j8274j4526k686
4942b5487P804j2092N385K5100J6219N2p302j530L069J279j54P071p684k089Q23
4927A0464j1823p176l66l217N26M056L326K634p329j0203j746m559j077O292R016
4912a1182O634l253J222k73j6504j1294J0168J9540O088l462k994k295N10n477
4898a2572j454j2356n859O44r40K676J541P892J6861J0198l152r536l131p217
4884a6405j787J167R10J4021O173J89j2301O718Q226P906Q522M617j062j4448
4870A2446j2836J311J2815j6153n296m368J0715J534p860Q713R979Q797K756j4473
4856H080j0970n516P338N103q374L257m361N097r516n877Q5r80l337J669J0457
$$ plain form
4841 -7845 12488 2034 -7414 -17152 -25487 -11803 5142 5765 -4390 -9924 -15537 -12714 3391 3552
4827 3552 6903 11857 8226 -15454 -12778 -8857 -20304 -9977 7081 4503 6079 10785 7039 20975
4813 20975 18942 7606 4638 18 -2713 -4218 -2670 6830 2415 -1669 6378 6501 2665 -7326 -13640
4798 -13640 -13049 -294 18450 26715 24985 22711 16896 14522 8493 14095 15698 7459 -1658 -1479 -4985
4783 -4985 -10231 -2474 -3288 -6179 -2885 -2504 734 -1598 5711 4304 9188 6717 9673 -65 -14654
4768 -14654 -18482 -19158 -14633 -6810 -14405 -13388 -6980 -15498 -19072 -9539 -10665 -4384 -11897 -9220 -1249
4753 -1249 685 9222 13498 10314 4315 -3430 -3597 3288 837 -7929 2842 12203 1202 -8395 -10382
4738 -10382 -17389 -12120 -20025 -31951 -18906 -1377 -564 10302 9024 6295 4133 5155 2942 4904
$$ packed form
4841g845K0333j0454r448r738q335J3684J6945O23j0155n534n613K823J6105J61
4827C552L351M954l631k3680K676L921j1447J0327J7058k578J576M706l746J3936
4813B0975k033j1336k968m620k731j505J548R500m415m084Q047J23l836r991o314
4798a3640N91J2755J8744Q265j730k274n815k374o029N602J603q239r117J79l506
4783d985n246P757q14k891L294L81L238k332P309j407M884k471K956r738j4589
4768a4654l828o76M525P823p595J017O408q518l574R533j126O281p513K677P971
4753a249J934Q537M276l184n999p745j67O885k451q766J0771R361j1001r597j987
4738a0382p007N269p905j1926J3045J7529Q13J0866j278k729k162J022k213J962
$$ plain form
4724 4904 574 6550 15678 12332 -4018 -6458 -16223 -16615 -9593 -11804 -15846 -10250 5137 -1965 -2992
4709 -2992 -4695 -9663 -159 -5111 -3265 -5338 -12885 -21685 -12005 -3128 -2446 -10836 -12210 -1036 -6795
4694 -6795 -7087 -8110 -28272 -31390 -14406 366 1679 -13672 -12513 -6051 8028 3387 -9745 -19102
4680 -19102 -11256 3361 13240 14962 14720 4991 -348 8483 19815 22613 10222 3722 -3371 -12643
4666 -12643 -9188 -8298 -15026 -7903 -1827 -2580 -8442 -7269 -3804 -6372 154 12905 16548 15831 18946
4651 18946 13872 9185 -2485 -4629 -5871 -2321 -7968 -10927 -20276 -10204 -3347 -215 -610 -22427
4637 -22427 -31073 -22337 -20474 -16213 -6750 -12125 -20430 -12686 -2369 -2243 -6764 -2406 -7676 -20530
4623 -20530 -21886 -18319 -16052 -15396 -16752 -11687 -27049 -35646 -35116 -21520 -18056 -15060 -17246 -9909 -7347
$$ packed form
4724D904m330N976R128l346j6350k440r765l92P022k211m042N596J5387p102j027
4709b992j703m968R504m952J846k073p547q800R680Q877O82q390j374J1174n759
4694f795k92j023k0162l118J6984J4772J313j5351J159O462J4079m641j3132r357
4680a9102P846J4617R879J722k42r729n339Q831J1332K798j2391o500p093r272
4666a2643L455Q90o728P123O076p53n862J173L465k568O526J2751L643p17L115
4651A8946n074m687j1670k144j242L550n647k959r349J0072O857L132l95k1817
4637b2427q646Q736J863M261R463n375q305P744J0317J26m521M358n270j2854
4623b0530j356L567K267O56j356N065j5362q597N30J3596L464K996k186P337K562
$$ plain form
4608 -7347 -9986 -8346 1999 5988 10757 15418 16567 15891 5076 -4293 8175 13663 5842 12801
4594 12801 19113 2757 9058 8751 -24016 -30039 -14701 -27297 -18583 -20135 -27980 -23196 -11362 -3559
4580 -3559 8186 8450 -3303 -10248 -6621 -3102 19459 34694 26270 16314 8948 -655 -9264 -15456
4566 -15456 -8429 -3978 -3720 -11142 -12252 -11106 -18307 -1108 6796 10594 11758 15332 13418 8713 690
4551 690 -5794 -9784 -15778 -12283 -7995 -10824 -11602 -16600 -21411 -23093 -10531 -4368 8790 2704 -1872
4536 -1872 -7581 -3387 3175 5498 -10846 -15466 -1773 12064 11306 18461 16402 13017 494 -8149
4522 -8149 3971 6856 -667 -60 -4960 -3672 -3613 3886 8349 8559 -10058 -6441 15200 16116 -6547
4507 -6547 -14685 -7087 -3944 8037 9813 -6193 2143 8154 2168 -7471 -4297 -3283 -6815 -8194
$$ packed form
4608g347k639J640J0345L989M769M661J149o76j0815r369J2468N488p821O959
4594A2801O312j6356O301l07l2767o023J5338j2596Q714j552p845M784J1834P803
4580c559J1745K64j1753o945L627L519K2561J5235q424r956p366r603q609o192
4566a5456P027M451K58p422j110J146p201J7199P904L798J164L574j914m705q023
4551F90o484l990n994L495M288k829p78m998m811j682J2562O163J3158o086m576
4536a872n709M194O562K323j6344m620J3693J3837p58P155k059l385j2523q643
4522h149J2120K885p523O07m900J288N9P499M463K10j8617L617K1641R16k2663
4507f547q138P598L143J1981J776j6006Q336O011n986r639L174J014l532j379
$$ plain form
4493 -8194 -2156 -9246 -8852 -4164 1800 4982 21577 20239 11094 280 4579 9479 7088 3026 15826
4478 15826 20009 21742 16430 5265 -7498 780 5529 3538 -12547 -24367 -15392 -1005 -1120 -4343
4464 -4343 -1516 -4618 -6842 -8609 992 -8560 -17126 -17997 -13127 -8901 4409 7174 410 -898 329
4449 329 -3042 -2018 14782 20344 28169 14546 3267 4367 10916 17691 16601 11691 7358 3686
4435 3686 -7927 -12493 -12869 6329 8505 -298 -8103 -8832 -2226 5413 7557 16274 20412 6364 4635
4420 4635 1511 1804 4644 -15292 -23489 -14533 -14710 -13982 -1568 13670 4270 1937 -8362 -16684 -25313
4405 -25313 -18129 -6577 3089 5374 4261 3653 4295 3750 -45 4761 12311 5926 7544 8001 7016 3002
4389 3002 -2341 -2624 -1383 -5337 -9423 -7157 -10576 -6881 -9774 -12196 -14876 5952 9433 5569 -5143
$$ packed form
4493h194O038p090L94M688N964L182J6595j338r145j0814M299M900k391m062J2800
4478A5826M183J733n312j1165j2763Q278M749j991j6085j1820Q975J4387j15l223
4464d343K827l102k224j767R601r552q566q71M870M226J3310K765o764j308J227
4449C29l371J024J6800N562P825j3623j1279J100O549O775j090m910m333l672
4435C686j1613m566l76J9198K176q803p805p29O606P639K144Q717M138j4048j729
4420D635l124K93K840j9936q197Q956j77P28J2414J5238r400k333j0299q322q629
4405b5313P184J1552R666K285j113o08O42n45l795M806P550o385J618M57r85m014
4389C002n343k83J241l954m086K266l419L695k893k422k680K0828L481l864j0712
$$ plain form
4374 -5143 -22406 -25530 -23975 -21711 -19165 -12213 -4497 375 13436 4135 -14019 -4586 604 -33
4360 -33 2298 3858 8220 5965 3133 -9108 -10534 5484 9638 19698 25022 19113 11451 6717 9361
4345 9361 4668 -12877 -19023 -2959 1547 -304 -10407 -18353 -5877 2002 -7556 -22215 -18475 -1470
4331 -1470 -2418 -566 -14177 -9467 13924 14996 14068 15504 6427 1261 -933 -11235 -10327 -4503 -4268
4316 -4268 6352 4636 -6435 -8291 -14337 -25451 -21258 -13108 -18386 -18244 -18493 -26542 -25580 -13093 -17323
4301 -17323 -13633 527 8831 5366 293 4589 7335 6302 15993 24126 21752 6995 -317 -12221
4287 -12221 -13510 -11783 -4486 -5281 -3839 -6159 -8824 -9052 -12771 -6515 1080 -5565 -20843 -9923 3337
4272 3337 -1218 -3833 -1769 2939 14713 -4626 468 8853 13917 15013 -805 -7766 -233 -534
$$ packed form
4374e143j7263l124J555K264K546O952P716M872J3061r301j8154R433N190o37
4360c3K331J560M362k255k832j2241j426J6018M154J0060N324n909p662m734K644
4345I361m693j7545o146J6064M506j851j0103p946J2476P879r558j4659L740J7005
4331a470r48J852j3611M710K3391J072r28J436r077n166k194j0302R08N824K35
4316d268J0620j716j1071j856o046j1114M193Q150n278J42k49q049R62J2487m230
4301a7323L690J4160Q304l465n073M296K746j033R691Q133k374j4757p312j1904
4287a2221j289J727P297p95J442k320k665k28l719O256P595o645j5278J0920J3260
4272C337m555k615K064M708J1774j9339N094Q385N064J096j5818o961P533l01
$$ plain form
4258 -534 -347 7356 -505 -4394 988 282 -14495 -2735 1721 5082 -1632 -3649 -4270 -7351 -5319
4243 -5319 -14875 -11163 -10572 -2367 1675 -1462 3013 5491 10850 10950 11792 5653 -13427 -21933 -13912
4228 -13912 -7975 -16175 -6977 -8552 -9411 -8176 -22100 -22209 -8660 7658 -5743 9516 22516 30990
4214 30990 14355 -7133 -30009 -16761 -3070 1183 7255 6636 4764 8314 1858 -5062 -8654 4791
4200 4791 13636 4938 -5890 -5657 -6637 -19957 -24595 -8543 -7152 -20154 -12272 -1851 6362 13402
4186 13402 17449 14155 6708 915 -7147 -10502 1823 10425 -2662 -21547 -25523 -11533 -2619 -4543
4172 -4543 1577 -10052 -6817 2455 -6755 -10846 -8611 -15753 -17765 -21725 -22364 -20497 -21484 -11251 -1187
$$ packed form
4258e34J87P703p861l889N382p06j4777J1760M456L361o714k017o21l081K032
4243e319r556L712N91Q205M042l137M475K478N359J00Q42o139j9080q506Q021
4228a3912N937q200R198j575q59J235j3924j09J3549J6318j3401J5259J3000Q474
4214C0990j6635k1488k2876J3248J3691M253O072o19j872L550o456o920l592J3445
4200D791Q845q698j0828K33r80j3320m638J6052J391j3002P882J0421Q213P040
4186A3402M047l294p447n793q062l355J2325Q602j3087j8885l976J3990Q914j924
4172d543O120j1629L235R272r210m091K235p142k012l960o39J867r87J0233J0064
$$ [...]
##END NTUPLES=NMR SPECTRUM
##END=
