##TITLE=Analysis number 328023
Compound Code cc 62714
Book Reference 494/158
Project Code adrs
Chemist Name craigr
##JCAMPDX= 6.0         $$ Bruker NMR JCAMP-DX V2.0
##DATA TYPE= NMR SPECTRUM
##DATA CLASS= NTUPLES
##ORIGIN= Bruker BioSpin GmbH
##OWNER= nmr
$$ XWIN-NMR		Version 3.5
$$ Thu Apr 26 08:19:59 2007 GMT Daylight Time (UT+1h)  MAYBRIDGE\nmr@NMR_250MHZ
##.OBSERVE FREQUENCY= 250.131544655141
##.OBSERVE NUCLEUS= ^1H
##.ACQUISITION MODE= SIMULTANEOUS (DQD)
##.ACQUISITION SCHEME= undefined
##.AVERAGES= 16
##.DIGITISER RES= 18
##SPECTROMETER/DATA SYSTEM= dpx250
##.PULSE SEQUENCE= zg30
##.SOLVENT NAME= CDCl3
##.SHIFT REFERENCE= (INTERNAL, CDCl3, 0, 16.522)
##AUDIT TRAIL= $$ (NUMBER, WHEN, WHO, WHERE, WHAT)
$$ ##TITLE= Audit trail, XWIN-NMR		Version 3.5
$$ ##JCAMPDX= 5.01
$$ ##ORIGIN= Bruker BioSpin GmbH
$$ ##OWNER= nmr
$$ C:\u/data/dgb/nmr/ADRS/3120/pdata/1/auditp.txt
$$ ##AUDIT TRAIL=  $$ (NUMBER, WHEN, WHO, WHERE, WHAT)
(   1,<2007-04-26 08:19:35.31 +100>,<MAYBRIDGE\nmr>,<NMR_250MHZ>,
      <created by zg, POWCHK disabled, PULCHK disabled
       configuration hash MD5:
       76 6E 9A 78 1E 09 19 81 EC 84 63 8F B0 6A 59 2D
       data hash MD5: 64K
       53 9C C7 5D 47 64 C4 CA 7D 98 FF 66 DA 3A AC D7>)
(   2,<2007-04-26 08:19:49.55 +100>,<MAYBRIDGE\nmr>,<NMR_250MHZ>,
      <Start of raw data processing
       ef LB = 0.3 FT_mod = 6 PKNL = 1 SI = 32K 
       data hash MD5: 32K
       4A 38 A6 21 DA 76 55 C8 4D EB EB 91 27 3C 0C 21>)
(   3,<2007-04-26 08:19:51.19 +100>,<MAYBRIDGE\nmr>,<NMR_250MHZ>,
      <apk 
       data hash MD5: 32K
       B4 B7 41 2E 19 62 1B B6 7F 85 8D D9 85 99 24 03>)
(   4,<2007-04-26 08:19:51.89 +100>,<MAYBRIDGE\nmr>,<NMR_250MHZ>,
      <abs ABSG = 5 
       data hash MD5: 32K
       08 91 BF 0D 27 F0 CA 7B 5A A1 82 8C AA A4 30 6D>)
$$ ##END=
$$ 
$$ hash MD5
$$ 09 8B 5D C1 0B 33 B0 95 F5 AA 63 A8 13 E8 26 72
##$RELAX= 
##$RELAX= 
##$RELAX= 
##$RELAX= 
##$RELAX= 
##$RELAX= 
##$RELAX= 
$$ Bruker specific parameters
$$ --------------------------
##$DU= <C:\u>
##$EXPNO= 3120
##$NAME= <ADRS>
##$PROCNO= 1
##$TYPE= <nmr>
##$USER= <dgb>
##$AMP= (0..31)
100 100 100 100 100 100 100 100 100 100 100 100 100 100 100 100 100 100 
100 100 100 100 100 100 100 100 100 100 100 100 100 100 
##$AQSEQ= 0
##$AQ_mod= 3
##$AUNM= <au_zg>
##$AUTOPOS= <4 >
##$BF1= 250.13
##$BF2= 250.13
##$BF3= 250.13
##$BF4= 250.13
##$BF5= 500.13
##$BF6= 500.13
##$BF7= 500.13
##$BF8= 500.13
##$BYTORDA= 1
##$CFDGTYP= 0
##$CFRGTYP= 5
##$CHEMSTR= <none>
##$CNST= (0..31)
1 1 145 1 1 1 1 1 1 1 1 1 1 1 1 1 1 1 1 1 1 1 1 1 1 1 1 1 1 1 1 1 
##$CPDPRG= <>
##$CPDPRG1= <>
##$CPDPRG2= <>
##$CPDPRG3= <>
##$CPDPRG4= <mlev>
##$CPDPRG5= <mlev>
##$CPDPRG6= <mlev>
##$CPDPRG7= <mlev>
##$CPDPRG8= <mlev>
##$CPDPRGB= <>
##$CPDPRGT= <>
##$D= (0..31)
0 1 0 0 0 0 0 0 0 0.06 0 0 0 0 0 0 0.0002 0 0 0 0 0 0 0 0 0 0 0 0 0 0 
0 
##$DATE= 1177571974
##$DBL= (0..7)
120 120 120 120 120 120 120 120 
##$DBP= (0..7)
150 150 150 150 150 150 150 150 
##$DBP07= 0
##$DBPNAM0= <>
##$DBPNAM1= <>
$$ [...]
##$SUBNAM7= <"">
##$SUBNAM8= <"">
##$SUBNAM9= <"">
##$SW= 20.6930455092707
##$SWIBOX= (0..15)
0 0 3 0 0 0 0 0 0 0 0 0 0 0 0 0 
##$SW_h= 5175.983436853
##$TD= 65536
##$TD0= 1
##$TE= 683.16
##$TE2= 300
##$TE3= 300
##$TEG= 300
##$TL= (0..7)
0 120 120 120 120 120 120 120 
##$TP= (0..7)
150 150 150 150 150 150 150 150 
##$TP07= 0
##$TPNAME0= <>
##$TPNAME1= <>
##$TPNAME2= <>
##$TPNAME3= <>
##$TPNAME4= <>
##$TPNAME5= <>
##$TPNAME6= <>
##$TPNAME7= <>
##$TPOAL= (0..7)
0.5 0.5 0.5 0.5 0.5 0.5 0.5 0.5 
##$TPOFFS= (0..7)
0 0 0 0 0 0 0 0 
##$TUNHIN= 0
##$TUNHOUT= 0
##$TUNXOUT= 0
##$USERA1= <user>
##$USERA2= <user>
##$USERA3= <user>
##$USERA4= <user>
##$USERA5= <user>
##$V9= 5
##$VALIST= <valist>
##$VCLIST= <CCCCCCCCCCCCCCC>
##$VD= 0
##$VDLIST= <DDDDDDDDDDDDDDD>
##$VPLIST= <PPPPPPPPPPPPPPP>
##$VTLIST= <TTTTTTTTTTTTTTT>
##$WBST= 1024
##$WBSW= 4
##$XGAIN= (0..3)
0 0 0 0 
##$XL= 0
##$YL= 0
##$YMAX_a= 451609
##$YMIN_a= -354535
##$ZGOPTNS= <>
##$ZL1= 120
##$ZL2= 120
##$ZL3= 120
##$ZL4= 120
##$ABSF1= 16.522
##$ABSF2= -4.171173
##$ABSG= 5
##$ABSL= 3
##$ALPHA= 0
##$AQORDER= 0
##$ASSFAC= 0
##$ASSFACI= 0
##$ASSFACX= 0
##$ASSWID= 0
##$AUNMP= <proc_1d>
##$AZFE= 0.1
##$AZFW= 0.1
##$BCFW= 0
##$BC_mod= 0
##$BYTORDP= 0
##$COROFFS= 0
##$CY= 12.5
##$DATMOD= 1
##$DC= 0
##$DFILT= <>
##$DTYPP= 0
##$F1P= 14.0000005364418
##$F2P= -0.99999901652339
##$FCOR= 0.5
##$FTSIZE= 32768
##$FT_mod= 6
##$GAMMA= 0
##$GB= 0
##$INTBC= 1
##$INTSCL= 1
##$ISEN= 128
##$LB= 0.3
##$LEV0= 0
##$LPBIN= 0
##$MAXI= 10000
##$MC2= 0
##$MEAN= 0
##$ME_mod= 0
##$MI= 0
##$NCOEF= 0
##$NC_proc= -3
##$NLEV= 6
##$NOISF1= 0
##$NOISF2= 0
##$NSP= 0
##$NTH_PI= 0
##$NZP= 0
##$OFFSET= 16.522
##$PC= 1
##$PHC0= -51.33378
##$PHC1= 6.546337
##$PH_mod= 1
##$PKNL= yes
##$PPARMOD= 0
##$PSCAL= 4
##$PSIGN= 0
##$REVERSE= no
##$SF= 250.13
##$SI= 32768
##$SIGF1= 0
##$SIGF2= 0
##$SINO= 400
##$SIOLD= 32768
##$SREGLST= <1H.CDCl3>
##$SSB= 0
##$STSI= 32768
##$STSR= 0
##$SW_p= 5175.98343685301
##$SYMM= 0
##$S_DEV= 0
##$TDeff= 65536
##$TDoff= 0
##$TI= <Analysis number 999999
Compound Code 99
Book Reference 9
Project Code 9>
##$TILT= no
##$TM1= 0
##$TM2= 0
##$TOPLEV= 0
##$USERP1= <user>
##$USERP2= <user>
##$USERP3= <user>
##$USERP4= <user>
##$USERP5= <user>
##$WDW= 1
##$XDIM= 32768
##$YMAX_p= 375827942
##$YMIN_p= -102372
$$ End of Bruker specific parameters
$$ ---------------------------------
##NTUPLES= NMR SPECTRUM
##VAR_NAME=  FREQUENCY,     SPECTRUM/REAL,   SPECTRUM/IMAG
##SYMBOL=    X,             R,               I
##VAR_TYPE=  INDEPENDENT,   DEPENDENT,       DEPENDENT
##VAR_FORM=  AFFN,          ASDF,            ASDF
##VAR_DIM=   32768,         32768,           32768
##UNITS=     HZ,            ARBITRARY UNITS, ARBITRARY UNITS
##FACTOR=    0.157963299565203, 1,           1
##FIRST=     4132.6476996994, 0,             0
##LAST=      -1043.33573715361, 0,           0
##MIN=       -1043.33573715361, -102372,     0
##MAX=       4132.6476996994, 375827942,     0
$$ Real data points
##PAGE= N=1
##DATA TABLE= (X++(R..R)), XYDATA
$$ [...]
20722 -7366 -17348 -29606 -20742 -22479 -31329 -29274 -25158 -17262 -15424 -41729 -38277 -32476 -21599 -14725
20708 -14725 -16837 -38109 -28309 -30763 -44528 -23318 8156 -10284 -47581 -49171 -29872 -21827 -12865
20695 -12865 2265 -18746 -36746 -27246 1 -5027 -33652 -20821 -13861 -8088 5729 5648 -1696
20682 -1696 9376 14214 -13867 -17716 -25182 -26856 -20532 -21155 -29514 -31763 -28718 -47461 -52391 -47728
20668 -47728 -37564 -57991 -48367 -45000 -39551 -34002 -26110 -31551 -39671 -24218 -11919 -4748 6419
20655 6419 13887 -801 342 24794 45984 18614 9972 16143 2732 -4215 8219 -3910 -1859
20642 -1859 8860 19137 20204 18909 42602 39405 17006 -9178 16013 34628 6580 -21652
20630 -21652 -36923 -29768 -38138 -52793 -45106 -25288 2987 15438 34171 14607 2804 -14607
20618 -14607 -27122 -414 3067 958 455 -4417 -17445 -29749 -30261 -37991 -37230 -11107 -3500 -19836
20604 -19836 -2044 8233 32033 30573 42922 37881 6013 -204 -4358 -9009 -7185 -15905 -9388
20591 -9388 1262 -20832 -25616 -27308 -29147 -26661 -53629 -57511 -15071 -5931 -14399 5676 9898
20578 9898 -25219 -43445 -41282 -32286 -16081 6507 23901 -1171 -14523 -18900 -8378 -18300 -25616
20565 -25616 -10551 28249 49063 53085 45624 26314 10793 19150 27140 25558 25176 11194 -15700
20552 -15700 -35077 -36438 -44826 -39590 -21872 -26692 -19272 -15792 -39001 -36011 -23638 -16209 -25606
20539 -25606 -24294 -27289 -25466 -5297 3969 3678 22287 38444 21008 15303 5864 -7740 13223
20526 13223 7202 10370 2473 -23663 -44217 -38547 9981 33210 32019 12004 -5397 2687 9753
20513 9753 18131 19057 -3162 -18781 -19345 -14695 -10647 -23244 -70223 -80572 -66357 -55373 -46512
20500 -46512 -44145 -29369 -8295 -20092 -36356 -50635 -22316 -32898 -34721 -31005 -19497 -39277
20488 -39277 -38269 -37762 -26366 -43540 -51249 -47726 -35176 -19641 -12670 1748 -14346 -42954 -44965
20475 -44965 -32266 -10052 -4245 -2194 -11917 -10366 -1901 -717 -4747 -25590 -39614 -31024 -16422
20462 -16422 -12274 934 -14576 -9738 18092 20360 29849 38993 30342 16568 7837 18203 -2396
20449 -2396 -27062 -5200 -5687 -5822 1145 -5173 -6877 -10288 7923 -9602 -11851 -4825 -1589 -4269
20435 -4269 1984 -7105 -13443 -12347 -7277 -23124 -34216 -25775 -3799 18980 27905 21676 6987
20422 6987 -842 20220 4135 2234 -17571 7858 13395 -2838 -14380 -31110 -40457 -40612 -28549
20409 -28549 -21405 -28870 -46292 -42053 -251 15955 753 -13873 -27804 -42174 -41673 -14774 2372
20396 2372 11807 -19844 -19264 -1140 20041 15505 4195 -5183 -17042 -39665 -42720 -47182 -44747
20383 -44747 -19286 2044 20838 17682 19458 14663 19244 33452 14518 -29063 -33730 -21323 -24286
20370 -24286 -13092 1641 21619 13163 25913 20872 -12390 -26788 -42998 -38239 -14145 -21985
20358 -21985 -27077 -42116 -47913 -33085 -47590 -56353 -33040 -20375 -3067 -428 -7185 22984 11605
20345 11605 -6255 -11735 -30184 -35246 -45631 -40617 -18976 -22545 -19265 -18277 5022 9355 -2468
20332 -2468 -22649 -38310 -28571 -4687 8404 19065 22849 21378 12307 8148 7113 15394 17622
20319 17622 13169 25966 38032 21806 34859 59116 64760 54310 62040 38255 9066 -2379
20307 -2379 5174 5824 -8182 -18648 -6374 -798 -1859 -9576 -17945 -3772 -4207 14604 14614 9418
20293 9418 -8671 6073 25607 50659 51368 30145 28359 37257 12751 6190 8751 -5444 -27205
20280 -27205 -31615 -37844 -39722 -19280 -9628 -3707 -20761 -10885 -890 5241 3449 -10376 -6761 5547
20266 5547 8578 13105 10515 6819 -9321 -14259 -9397 -340 16065 2114 -5126 -11011 3557 -4420
20252 -4420 -11877 -7358 18761 37522 41885 16472 -20243 -40528 -44805 -38103 -47198 -57590 -58443
20239 -58443 -40022 -34482 -58271 -60203 -45107 -33287 -21930 -44400 -28021 -1875 -13814 1882
20227 1882 -850 -27120 -46196 -64346 -32119 -35089 -46144 -62863 -60347 -43765 -24520 -9894
20215 -9894 4560 846 -2559 -9451 -22452 -18382 1231 -1003 -18955 -28601 -43843 -44608 -29960
20202 -29960 -2412 10381 15490 39156 27400 8486 5373 -5973 -19442 -28121 -26717 4909
20190 4909 31529 146 -7045 -5408 -14610 -8904 4735 -1370 -6919 -7793 -1922 -4413 9082 1638
20176 1638 -7129 8797 21669 27082 28634 22636 22664 24270 2313 -10149 -3181 1443 -7810 -21166
20162 -21166 -25176 -14976 -10999 -16482 -25935 -28685 -13132 16232 47622 31709 2419 -16336 -12902
20149 -12902 -10726 -18022 -31299 -43919 -36392 -24838 -12501 -29972 -27741 -3736 9422 5060 -6310
20136 -6310 -12719 -2963 -1267 6890 16106 3818 9810 3788 -8759 -30958 -32592 -28494 -19195 -25115
20122 -25115 -34075 -26826 -18632 -48864 -50520 -19037 -3365 -11541 -4226 11953 9117 14919 -8293
20109 -8293 -30970 -34236 -30150 -15975 -22939 -21434 2943 12028 5213 -2254 -22585 -20176 -30758
20096 -30758 -23519 1220 -59 -7994 -10179 -14042 -4899 -5499 -10811 -18025 -37563 -47054 -49322 -40222
20082 -40222 -11507 -3356 -11638 -20069 -19420 -16403 -22990 -17972 535 13766 10298 1446 -3825 -10749
20068 -10749 -17529 -10567 26430 38484 27762 26676 9249 -1826 5153 3389 -15749 -15933 6010
20055 6010 18970 27970 32225 23143 23903 16196 2020 3084 408 13098 10553 -7184 1209 25061
20041 25061 35662 8326 656 1024 5535 2851 6301 11832 11207 -5345 -9158 27476 45687 32009
20027 32009 -713 -8144 4467 26369 10338 11939 36945 44832 54642 76422 96313 134677
20015 134677 218022 298660 341079 411587 469728 504249 533947 536678 536404 521599 500927 437735
20003 437735 353748 297153 235614 205926 146767 124414 116915 87109 49839 44428 19535 -11730
19991 -11730 1543 4057 -13935 -18147 -9129 -2824 1120 6839 6860 11748 15146 29709 49940 27729
19977 27729 30751 16008 25828 29110 40135 39197 38624 53825 48272 34755 14720 20305 21479 27433
19963 27433 29126 36458 34339 50332 62408 53089 37810 39005 30265 25255 17472 42928 68847
19950 68847 86751 86656 72958 94073 104061 130722 167964 176545 209382 299570 379752 424667 456768
19937 456768 481194 487841 522863 501184 461753 437315 389768 309006 250448 205953 157164 128452
19925 128452 107420 61417 35164 28435 22903 34739 23350 25438 23531 24165 22672 30642 5542
19912 5542 -19286 -2820 2758 43300 57205 64123 58016 37081 6412 -17402 -23733 -14051 -4303
19899 -4303 -13325 -12155 -15155 -1116 623 11089 26424 15959 7727 11402 47880 61992 55161
19886 55161 31068 25123 21882 37099 47037 18817 3032 19189 24950 16208 7143 -3227 -12659
19873 -12659 -29259 -14489 -4504 -14721 -10492 -4257 -2608 9626 -315 5599 17074 -8363 -20741
19860 -20741 2287 -955 -4704 -30928 -12144 9779 8553 -3363 -14159 -8405 32461 48735
19848 48735 43558 14537 1867 7715 13230 8914 1190 23882 35195 31379 16837 -1729 -15362
19835 -15362 -15642 -16826 2754 4026 -5032 -10462 -10095 -8047 3896 5956 -6166 10465 18851 15674
19821 15674 -1538 -24451 -32066 -28097 -27553 -10441 -27775 -41786 -45159 -53882 -52998 -37656 -1393
19808 -1393 41634 42658 19220 6956 -2048 -1700 14073 29049 26022 14374 18471 21153 27231
19795 27231 19230 26909 49169 58124 71002 49249 47806 64703 47115 20798 16330 13624 6940
19782 6940 19958 17692 -4282 -6797 18942 43293 51409 50350 61027 51977 16948 -2274 1596
19769 1596 27326 39630 47063 34637 16041 17532 30610 32199 21298 25644 29851 39017 35158
19756 35158 27025 15409 40661 66119 80532 74548 35993 6433 -3675 21921 22441 24664 23284
19743 23284 11410 19638 28126 26888 20783 45382 48005 26297 14794 14606 13169 17789 4512
19730 4512 1594 -2412 -12265 -32291 -16660 11539 3830 -2824 14284 9376 11603 6862 18458
19717 18458 26405 20565 -5754 -18807 -14295 15423 35791 29699 26851 42833 32739 37743 45699
19704 45699 36919 41124 68281 57876 46375 48099 71486 85662 64171 64627 66070 82465 76468
19691 76468 68499 79823 72247 54313 32583 38666 37984 52624 66332 69021 61851 36855 16126
19678 16126 37734 41737 66376 77958 72530 51664 41501 46443 46089 42704 20632 39473 29922
19665 29922 47431 80742 100096 107987 111034 93511 72977 48730 48437 45873 10973 -21281 -15415
19652 -15415 -19249 -3241 30100 14941 9020 19320 27189 25604 17592 17172 7780 17695 35987
19639 35987 32795 38703 47504 34723 24682 25106 21907 33337 26587 1508 1141 23806 17421 -58
19625 -58 8857 15366 29632 29145 21772 36662 14416 15167 34006 36165 24429 29915 38299 60912
19611 60912 57100 35952 34412 39665 55567 65126 72541 40706 30561 54258 52913 66199 87984
19598 87984 104562 102780 106819 112216 155089 129686 83160 72021 86349 85522 70593 89354 67746
19585 67746 65208 79812 72416 91110 99723 101082 100533 97121 89325 77375 71790 89093 92214 100625
19571 100625 108967 105959 95088 111081 116884 115952 119235 128150 162589 194411 189314 170498 180063
19558 180063 173071 199614 219333 207240 220001 206499 165936 143404 131609 137247 142561 101514
19546 101514 117920 139878 158640 129058 120976 115045 114153 115731 104892 109196 119144 118624 132781
19533 132781 155727 162375 171373 150734 132616 133712 154270 116731 77882 88221 113524 136466
19521 136466 130879 112397 118753 153392 186425 196776 211783 244487 276816 290402 294720 335185
19509 335185 379285 387085 382836 401852 400906 392871 401460 389064 374639 389988 424921 430055 410733
19496 410733 397290 388097 401536 413949 427001 442908 475513 483131 491954 487369 501109 495045
19484 495045 516134 518727 529154 529489 576352 624783 664651 719387 826130 975464 1116391
19473 1116391 1263757 1468187 1675144 1852504 1998100 2113089 2212717 2273193 2276332 2276027 2218561
19462 2218561 2152342 2087011 2049688 2040266 2089092 2174934 2291629 2456773 2694094 2982864 3350610
19451 3350610 3796955 4350245 5052412 5999172 7297770 9111089 11775952 15808176 21676946
19442 21676946 29110671 37450098 47978197 62054146 75820547 84751644 93226542 102939849
19434 102939849 107058116 103109619 96734647 90338414 80226561 67121705 53599322
19427 53599322 42245335 32776741 24752785 18294859 13620705 10458512 8303021 6756134
19419 6756134 5638601 4806844 4174694 3670411 3261636 2949770 2717433 2501992 2323235
19410 2323235 2210347 2149538 2103913 2111356 2133314 2173279 2229649 2322062 2357115 2387633 2406189
19399 2406189 2380681 2260009 2121489 1976938 1829559 1698986 1553421 1406372 1278986 1200571
19389 1200571 1152488 1106739 1079865 1094657 1116188 1166606 1223594 1288045 1380271 1480763 1570355
19378 1570355 1689163 1790139 1869076 1917816 1969678 2062205 2132216 2199013 2296072 2429454 2557588
19367 2557588 2694540 2883045 3089407 3355687 3664572 4036897 4556692 5273783 6248084
19358 6248084 7596467 9544942 12444342 16869977 22906557 29489947 36482053 45357481
19350 45357481 57232677 69772875 77335327 82749833 89384705 95172218 96436550 91133761
19342 91133761 85447828 80414547 72420004 61606311 49826145 40184860 32380887 25359867
19334 25359867 19189249 14270114 10802519 8470949 6885196 5759310 4963472 4344030
19326 4344030 3869095 3517365 3200747 2975316 2794263 2647440 2515560 2369165 2233861
19317 2233861 2145026 2108351 2067164 1984629 1888150 1783589 1679275 1590706 1477343 1345965
19307 1345965 1223802 1096570 976744 874017 782676 710868 675379 636193 578719 569874 534280
19296 534280 499355 452087 440171 429009 413543 404894 375933 352071 352716 360874 363899 327433
19284 327433 297246 289131 261519 226506 249773 244779 214591 219144 222406 194412 184700 170459
19272 170459 174429 184100 176076 173788 190862 192255 183166 181629 198651 196450 154224 148281 169356
19259 169356 188140 204693 204276 175122 148772 126637 142576 144972 135621 130419 128955 120960 133474
19246 133474 126187 115687 110006 129811 116319 111121 118934 108509 96756 82150 65290 65609 85582
19233 85582 98597 126400 147877 140536 123518 125627 156514 173212 181848 146279 111272 124548
19221 124548 115641 102459 92468 115577 109819 75860 67773 86139 101314 86009 82559 72592 76071
19208 76071 85453 76207 37926 35578 50336 67897 57079 67150 84416 104079 137765 154333
19196 154333 131499 123037 121117 117292 132499 119220 94967 80697 99666 127161 136008 157276
19184 157276 144597 128778 96550 75802 78708 87299 80855 96521 99288 72990 56062 48600
19172 48600 45018 34961 23760 49326 70540 58077 54204 91270 99784 90217 105601 107087 100539
19159 100539 62173 33097 67592 87658 56518 23878 -810 9227 36764 32714 34833 38111
19147 38111 28885 31892 11360 -15138 -4390 5504 20464 58244 59373 69054 55206 56281 61158
19134 61158 77682 79156 77704 50006 28187 49151 53286 27989 13466 2824 18393 10741
19122 10741 -488 14955 35760 35662 22555 12973 31381 42607 21787 15358 31713 34704 27659
19109 27659 5717 10034 18860 -6705 9295 24219 53093 73860 58880 33950 20532 22364
19097 22364 10212 21583 40425 30435 22281 17518 22323 30371 17871 25835 34177 27592 16703
19084 16703 974 8725 25786 37638 45519 43041 13205 -2128 2120 7906 3610 6293 8004
19071 8004 10169 754 23414 35155 59654 66774 63036 74309 70064 42023 47460 73034 142262
19058 142262 209315 273090 357823 440822 556155 719294 863987 884002 866206 881831 935658
19047 935658 875751 745681 611883 544645 455219 346934 269332 197209 129208 100402 89101
19036 89101 98885 75322 48587 29843 20659 -6883 -11540 -7331 1911 2059 19933 31178 9624
19023 9624 9365 27495 25002 18212 18141 43459 42996 59877 72447 27727 404 6335 -14646 -19002
19009 -19002 -8105 -4629 -20954 -31572 -17714 -10426 -26045 -9725 5082 -14838 -21172 -3181
18997 -3181 -2789 -20069 -11030 -2038 16779 19283 -11497 -24039 -35765 -43507 -8090 11551 -3717
18984 -3717 -13267 -2657 -1268 -4126 -30784 -38072 -55860 -31054 -7955 1834 15177 5104 -9724
18971 -9724 -30815 -55107 -39211 -16040 -10875 -10519 -12408 2497 14651 -385 3453 13790 -16217
18958 -16217 -22218 -16497 -19205 -1579 -10453 4422 12337 748 4124 -10506 -16220 -20244 -13450
18945 -13450 17008 9728 -11612 -9143 870 -12607 -16889 -20629 11159 59302 69576 70900 52139
18932 52139 -2531 -22185 -17439 -24134 -20459 -28259 -31704 -33675 -40080 -35061 -5418 7013 -14421
18919 -14421 -20720 -21678 18725 20585 -13202 -36693 -31953 -36079 -26202 6410 14517 36609 41066
18906 41066 24809 14081 6672 7952 15285 11797 -11750 -15722 -2563 -13706 7537 1310 -7712
18893 -7712 -17241 -23054 -8999 -13920 -29959 -42869 -33269 -18198 -17930 3923 5415 -17932 -44100
18880 -44100 -25829 273 10408 36835 54349 36506 29205 16333 32831 37278 18592 37078
18868 37078 48874 44370 43244 40709 61539 82095 108499 156902 223921 275301 331962 387054
18856 387054 434089 477683 522975 574942 582041 537579 474679 427236 375117 294450 221709 168408
18844 168408 120683 80114 46106 35052 19725 27066 29213 26355 26883 29374 13930 10517 -5250
18831 -5250 -23337 -33368 -35180 -8791 -6531 6192 34410 19864 404 25183 60723 71023
18819 71023 58772 35281 23467 -761 5849 506 5602 1847 -21801 -18640 -2425 -6137 3833
18806 3833 24899 26679 917 -5385 19203 -1369 -37397 -30746 -5777 20075 25857 13089 14537
18793 14537 15584 27575 28930 13190 5653 15974 6231 -1585 988 -8021 803 12296 12334 14722
18779 14722 31231 26078 21898 36561 47820 46911 44450 46024 56621 56465 65075 125299 260820
18766 260820 335198 295228 205688 142888 116980 69220 39182 70638 90283 114301 151664
18755 151664 180651 228847 280418 345616 398025 423765 481434 535254 541114 529951 517107 480406
18743 480406 445359 397325 314176 239762 175959 136737 100392 69020 57143 46919 34187
18732 34187 20181 6542 -3306 -24313 -6786 19090 29977 -8618 -14872 -4217 458 14019
18720 14019 -11651 -37144 -14918 -698 12777 12872 -4249 -3623 20616 29746 8950 85 -812
18707 -812 -4756 -5232 458 3776 -3296 15849 19864 -14849 -49386 -31612 -11528 537 2237 -6953
18693 -6953 -30693 -31365 -9530 21374 24444 8975 -16107 -10337 25655 36209 29137 20445 13429
18680 13429 11365 12008 -4468 -18898 -11738 -897 1219 -4978 5950 1047 -16320 -18783 -8744
18667 -8744 9419 17995 36130 51737 38040 13362 11560 2462 13261 10181 -4107 -21241 -26905
18654 -26905 -14005 50 -441 -5668 -18355 -11435 -4038 -1481 4699 -19873 -28174 -17349 -30737
18641 -30737 -25911 -7092 -24508 -9728 -6818 -10157 -11377 -14316 -31526 -31879 -26446 -15629 -6529
18628 -6529 -18201 -16180 13764 1612 -6293 -2960 19122 24794 -3139 -2505 -2519 481 -8155 -13870
18614 -13870 -6101 -23908 -27113 -14074 -17810 -20981 -21263 -27703 -43229 -55608 -23936 -15537 -34760
18601 -34760 -31099 -4151 8637 -2202 -8898 -26907 -15421 -16256 -29453 -3570 6651 -14199
18589 -14199 -27942 -37930 -30788 -31279 -33759 -26819 -6613 520 3171 -4585 -13505 -2473 4134 -1546
18575 -1546 -33524 -32465 -20366 14998 14504 6359 26573 30901 24519 21112 13007 9411 20791 9155
18561 9155 2994 -1623 -8672 15908 32692 12820 569 -11153 -42092 -32612 -4183 16489 -3639
18548 -3639 -15100 -5566 1857 -24776 -25524 -15212 -13614 -6869 6038 10915 4627 14605 -8351 -15539
18534 -15539 -8455 -13262 -4912 3159 19362 22943 22984 20080 26857 20743 20242 26978 11427 -12409
18520 -12409 -17077 -15026 -16790 -19938 -18365 -10646 -4653 3795 -9430 13850 20461 -5666 -5434 23
18506 23 28780 12526 -23331 -38949 -31555 -25092 -12785 -4590 16890 37241 41525 24615 13179
18493 13179 106 1777 12378 24729 34465 42061 39758 19043 23200 29080 44927 53542 69252
18480 69252 86935 81056 69539 67472 73580 91547 84448 48097 38200 44600 38807 27455 29801
18467 29801 24405 22607 23114 8722 -4678 -13691 -11586 -2301 -11580 -2232 1080 7074 7258 4691
18453 4691 8291 19648 31085 33230 24299 24163 22311 -3265 11957 3661 13676 35274 28491
18440 28491 8301 -4263 1220 36561 36094 12594 -6290 1157 11906 14541 32789 25906 28766
18427 28766 27341 60577 89723 86160 68878 49009 7610 -20002 -8048 -3823 -14247 -6862
18415 -6862 -1859 -13226 -17518 -13892 -13815 -23489 -10994 -21181 -22001 2834 24427 23903 24888 18118 -10201
18400 -10201 -12956 6568 10520 5081 12878 13547 4035 -25505 -24686 -6172 14950 3882 6295 3872
18386 3872 11991 11915 11291 8439 8037 -200 432 164 3772 -6096 -11376 4681 704 2595 2474 -9496
18370 -9496 3346 20367 2323 -6417 -4019 -7861 180 30243 44119 37655 49255 42090 10240
18357 10240 6338 25877 39167 32857 18358 26605 37444 52380 57378 41248 48894 55643 74357
18344 74357 79460 77838 97506 130725 129213 79210 61226 54310 15229 19581 22371 29376 34347
18331 34347 27974 36323 35502 31519 30756 10658 27202 20339 7326 14469 -2150 -28863 -49671
18318 -49671 -23958 -14000 -10596 -7482 5811 57306 76369 57734 28113 24191 18199 18454 9168
18305 9168 9690 30785 42839 28831 6464 10689 8648 9592 32181 35930 40123 53487 66487
18292 66487 51598 33446 15979 7946 20526 52084 77860 56983 48690 51698 55779 50564 58654
18279 58654 72260 46122 22336 15350 8550 24890 36156 32068 30724 36217 40151 57010 68372
18266 68372 43390 19629 -6290 -1703 31270 67137 51957 45959 40021 50545 70007 86237
18254 86237 91523 83882 61718 44264 32267 21438 7989 21624 24584 25247 31771 24999 22751
18241 22751 37192 69799 84086 63581 40303 22629 45256 68418 75058 63622 62743 47464
18229 47464 33633 27099 36566 35359 20809 -9541 -19325 -2582 19137 586 -17967 -3040
18217 -3040 -4025 15465 14920 26024 30987 29513 31414 22586 7928 -774 11688 25964 16754 25586
18203 25586 32907 40537 3943 -12852 -5456 4211 3969 -3304 -15485 15911 36037 51372 42922
18190 42922 22541 42015 34022 28715 39325 52795 52113 36074 33834 47885 46615 56951 59924
18177 59924 56861 44215 36759 45833 32185 17035 37047 45433 66380 94903 124078 178038
18165 178038 193754 199543 215186 231630 266097 305436 357886 352345 297196 245833 224834 197811
18153 197811 176672 193617 216259 230928 255649 322459 363420 355469 350219 360676 387672 436729
18141 436729 457844 437797 409505 359429 318661 311747 341401 401128 459262 466642 452878 444586
18129 444586 470922 505411 509129 556526 629027 683829 721781 800649 934800 1106400 1340637
18118 1340637 1626287 1991791 2493369 3228983 4324910 5963132 8628173 13150327 21543032
18109 21543032 37821046 52911198 49983894 38492435 23801977 14340215 9370171
18102 9370171 6562975 4823729 3638669 2811901 2263444 1871555 1616494 1462667 1340583
18093 1340583 1233886 1082182 933991 798603 717532 666073 644134 645843 665306 684758 644097
18082 644097 570487 489596 409020 337768 299806 266111 287525 331121 316160 264205 252132
18071 252132 238308 212616 187460 166203 150047 138745 131549 125810 156045 174798 167662 150372
18059 150372 132204 101045 88441 94861 101935 88437 76661 103075 103549 121733 140181 129769
18047 129769 125724 134878 150884 138545 134556 113268 96194 106001 83981 68739 92571 121424
18035 121424 148594 110265 75879 97799 104676 105147 123589 115435 81847 72355 65902 56636 55226
18022 55226 74899 83232 88089 80485 59616 54422 69549 71478 65690 60363 74678 74014 92238
18009 92238 93343 84182 77246 87039 80701 78626 90876 88451 92827 110439 95138 65116 50277
17996 50277 55190 75974 81903 78012 61110 62582 68576 87280 84175 99406 107083 88681 80193
17983 80193 67266 62182 86201 100386 106673 107945 72586 58767 52688 42357 56550 65192 69012
17970 69012 86615 91775 99592 94218 82722 107403 99057 70285 51196 35494 55458 63802 65306
17957 65306 62725 69884 66993 55580 36226 48407 86136 95974 87230 66189 34649 55795 69414
17944 69414 82077 80718 68686 65581 77194 84655 75496 61875 58845 101596 125392 115695 99797
17931 99797 96416 81848 98081 90007 87481 78355 63868 83618 111194 120141 116122 126823 127728
17918 127728 106792 100379 102682 117178 131319 130246 113032 112153 131029 151321 146611 140449 127079
17905 127079 127669 116191 97137 111007 127834 114069 107485 114289 119671 155119 190117 204148
17893 204148 178811 151444 141738 123274 114719 111047 118634 135472 154661 133878 128467 128461 128115 119857
17879 119857 113631 115539 114860 113402 98570 86487 70778 81973 81868 55237 59857 89917 109252
17866 109252 141872 144235 127913 118891 118560 116246 114297 123367 116069 124295 157814 174806 161091
17853 161091 191696 219791 196197 180972 172111 166610 163341 171636 168499 180800 182329 164642 162017
17840 162017 158232 144589 109707 102104 99435 82832 64515 34691 16289 20724 51062 90746
17828 90746 90524 81397 78828 85778 75913 78388 42441 38914 73292 107414 100621 83259 73885 86369
17814 86369 94833 96945 105766 126797 134129 129686 112992 109972 85304 78546 86862 73397 71917
17801 71917 72419 65285 75372 92740 92568 64659 39240 32920 49117 53071 62373 90592 125240
17788 125240 133537 141784 124447 129246 119183 105529 79715 64465 99721 108844 85460 93810
17776 93810 139701 144883 124416 134133 134845 156394 169796 154456 146530 156271 189136 224560 255763
17763 255763 295483 333572 336276 321488 316745 293912 290852 297749 306908 312317 309954 331461 312667
17750 312667 293817 297964 304143 316062 360632 371519 343181 286410 237673 223955 226076 230801
17738 230801 231313 224716 216014 223695 234409 225887 253357 308847 314827 307882 311045 296549 303322
17725 303322 300722 282903 291200 327728 372891 390954 428101 434847 445615 467342 504362 570601
17713 570601 624398 704943 704141 671859 651848 632874 678621 767885 884649 1000996 1056264
17702 1056264 1014509 936798 838078 737789 683272 643471 631286 649809 664194 686113 684671
17691 684671 686058 720180 813793 949432 1090901 1144909 1146266 1136916 1156441 1161809 1152647 1139524
17679 1139524 1175323 1247139 1317724 1430708 1614852 1909531 2312127 2734610 3256035 3941632
17669 3941632 4989895 6785483 9111442 10116180 9360865 7687447 6104475 5174159
17661 5174159 4725615 4587166 4691946 5058382 5515607 6050092 6708188 7680714 9131956
17652 9131956 11296250 14634557 19750331 27780668 41304193 65013594 97100654 113062278
17644 113062278 113055670 101610834 81308913 61088361 43356139 31107759 23858019 19710868
17636 19710868 17719192 17578917 19391560 23724714 31174830 38442948 38634129 32798458
17628 32798458 24367200 17306107 12793241 9971069 8162996 6995322 6260465 5819877
17620 5819877 5608859 5597925 5683678 5831186 5978780 5978439 5912556 5900421 6110576 6659254 7636155
17609 7636155 9203061 11577293 15188569 20995640 30162573 40436551 43966276 40155416
17601 40155416 32607005 25601512 21420360 19771249 20270082 22772376 27649807 35960271
17593 35960271 50227004 74179470 104610597 133283583 158201549 153852668 125172482
17586 125172482 88169015 57016619 38053511 27055501 20426614 16172172 13218186
17579 13218186 11052742 9517872 8472680 7802430 7413954 7159077 7028800 7205004 7966377
17570 7966377 9775850 13074444 16030444 15659393 13032046 9665390 7160562 5695306
17562 5695306 4771431 4028500 3346396 2777289 2363321 2042594 1765360 1578532 1450867
17553 1450867 1306818 1170263 1076071 999450 923886 879603 863801 813268 774155 734674 710811
17542 710811 699787 669926 641065 587921 536029 493993 458376 454532 458672 454130 467642 483806
17530 483806 502033 492806 493892 458481 409755 412553 395593 383336 386985 385781 385098 371261 351114
17517 351114 358513 360347 339816 325442 314983 293044 289240 283821 295195 312049 310279 315445 302667
17504 302667 304156 292232 285806 261711 256936 257650 245917 235732 239945 245097 232156 219896 196783
17491 196783 170116 161835 148989 158147 187796 204553 211311 203744 188180 187123 181767 191982 182777
17478 182777 169753 194336 220644 242595 262712 242915 245421 251591 228783 183562 191101 225819
17466 225819 235663 236516 223387 197466 213240 247143 252738 230443 213685 196630 203437 221714
17454 221714 229397 237039 233933 211790 193213 202126 193566 212212 250054 265772 331874 404780
17442 404780 493189 541544 502074 375476 283383 226562 193772 164936 150015 142475 154800
17431 154800 153073 143019 119764 101108 106293 117894 120162 118910 119320 141096 133256 117641 127344
17418 127344 139527 137578 149289 175641 169020 154703 157759 147108 126633 116364 127200 151690
17406 151690 150010 143789 158240 172946 179168 155367 135702 119660 100589 56569 57919 62156
17394 62156 74193 119068 148456 173768 193745 200811 188874 194456 191750 170376 171596 192891
17382 192891 183776 171667 178418 216570 220474 207069 189488 170126 175413 196390 186644 180444 171079
17369 171079 167684 189418 246056 249553 246782 270679 304248 309263 293025 278773 276682 275930 266856
17356 266856 231901 194954 190844 195322 181567 183157 202686 229374 234980 214177 219451 220328 212794
17343 212794 213693 209744 227180 233397 229653 249763 268383 265287 223771 191455 186792 201379 208855
17330 208855 213088 236646 244557 274498 292234 311572 325262 345819 368749 395467 378623 345624
17318 345624 320078 327671 350776 350666 367282 387263 416326 434021 428697 432424 475211 532693
17306 532693 556242 572864 563426 559914 554049 574528 573682 541824 527666 521608 521844 551435 567097
17293 567097 585150 623759 674235 726782 763988 807630 870301 914989 1013088 1105005 1233864
17282 1233864 1445949 1740865 2121835 2451315 2652610 2809885 2883929 2982989 3235723 3770584
17272 3770584 4772138 6520996 9508862 13710128 15984088 14988878 12275650 9454049
17264 9454049 7695203 6774534 6362967 6300013 6551365 7048415 7787979 8840934 10354601
17255 10354601 12614757 16057169 21074577 28487674 40329806 60411941 95236399 137085242
17247 137085242 155337892 153688396 130760825 99647410 71431183 49777885 36136526
17240 36136526 27990606 23302077 21007684 20629973 22239516 26490801 34212424 42783064
17232 42783064 44113281 38113543 28702620 20338469 14842017 11400865 9246804 7870554
17224 7870554 6918867 6311786 5898177 5582404 5391398 5295511 5313121 5431582 5517063 5650232
17214 5650232 5877334 6272026 6992765 8190426 10081357 13110325 17980374 25764223 35286493
17205 35286493 39354436 36300223 29567681 23189383 19407092 17805442 17927822 19894911
17197 19894911 24286629 32160243 45653232 66027544 85429829 103485036 119733294
17190 119733294 112550088 90562368 62949804 41226394 28151228 20246827 15182192
17183 15182192 11813880 9506071 7915109 6796959 5958004 5307012 4833411 4582647 4554042
17174 4554042 4708079 5189900 6241868 8173222 10161877 10144030 8607150 6449623 4726812
17165 4726812 3695161 3121051 2808489 2595408 2398862 2237805 2010835 1738450 1452023
17156 1452023 1252284 1112577 1017974 945444 897197 864614 813987 782159 725612 697319 679277
17145 679277 680570 691875 718515 730262 751689 737693 740502 722620 704197 735553 817315 821800
17133 821800 779297 702179 636892 632061 706896 798453 872241 909940 901997 864161 799120 696750
17121 696750 655840 684314 731309 782047 758079 666696 551619 469706 406779 385722 410033
17110 410033 459471 519768 533143 503694 445338 397045 343211 292309 261341 248757 250286 239855
17098 239855 240326 226836 229391 203934 211583 241037 259107 268536 303726 320250 314162 304833 296509
17085 296509 290328 266828 248318 241820 246962 273374 313338 381210 428631 441287 434734 426452
17073 426452 435181 476268 527989 553943 547284 515287 464291 419403 371638 338515 363828 399630
17061 399630 434209 458930 487102 540367 593483 619937 598801 518299 433465 353837 286735
17050 286735 262390 225377 180885 162784 164728 158486 165782 210214 232777 230741 218614 163489
17038 163489 145498 134624 132941 130887 144559 152497 135876 126522 122210 122255 135890 132903 119085
17025 119085 122068 124566 144280 143763 129047 137582 127620 134008 169639 208516 210791 202543 188073
17012 188073 158143 130445 129333 124083 121624 105687 104302 133608 169494 164165 157449 146877 181271
16999 181271 192068 153127 117276 80014 68291 81474 80756 56511 60555 69333 56321 69542
16987 69542 86858 81462 69636 68253 71578 57166 55612 50552 29342 13797 17130 28563 43083
16974 43083 67258 43203 30310 41781 32679 47200 84402 109996 126790 128459 121091 102613
16962 102613 95929 64966 55543 70523 110256 114378 88603 67405 49789 44727 55389 81114
16950 81114 91151 95873 113910 111387 87417 80624 83785 57131 30676 26475 15688 24043 43910
16937 43910 69975 69315 48878 1779 -30442 -7252 13134 24038 11555 3203 14106 27913
16925 27913 50019 36151 19459 22761 19861 10603 14770 -1722 -7696 13001 38298 50995 27200
16912 27200 1745 9714 27045 20351 11891 17357 18546 22300 24760 21464 20541 27699 25068 43982
16898 43982 52158 39359 21060 -756 11680 31386 37287 42842 48032 65856 48130 21877
16886 21877 29972 37897 1497 -302 30266 15303 -24145 -41647 -41134 -40250 -24337 -12004 25
16873 25 15845 29904 32786 34283 38578 29880 -10862 -28124 -23570 -10752 5976 -2587 7735
16860 7735 34838 30925 33683 31839 5676 -24763 -45742 -40561 -14912 14543 28263 23896 19811
16847 19811 21629 6585 186 -29135 -5510 27076 21397 4689 -9057 -25180 -18278 -16311 -24983
16834 -24983 -14148 -22852 -32201 -46642 -46099 -21271 -11203 -8124 -9533 -25553 -24611 -14434 2239
16821 2239 7756 11342 12723 6700 -9544 -20880 -7691 14251 -9218 -26816 -37847 -4065 14767
16808 14767 19369 12149 5126 631 5404 6692 -17840 -33655 -29312 -4878 15535 14985 -5087
16795 -5087 -17149 -2760 16020 3807 -38975 -52992 -64895 -67466 -61526 -34652 -30827 -5119
16783 -5119 7625 23957 28333 5044 9347 33501 36904 19303 9736 5712 3954 7881 24304
16770 24304 35086 44818 53552 72701 78341 87359 90008 86843 88016 80901 63525 71531 123215
16757 123215 200625 285683 314857 277605 238769 190399 167092 178294 204467 237334 266975
16746 266975 242701 211088 208749 224598 192504 162618 191297 263160 298309 291435 260328 214911
16734 214911 142640 93742 75504 62795 55238 83597 85822 83603 123577 145619 145970 130833
16722 130833 116114 101263 107146 117691 123796 106244 109970 89541 78008 55474 51186 77386
16710 77386 105382 149327 189322 261148 275040 248892 211148 191352 182301 206532 270020 316385
16698 316385 310373 300781 272555 221972 219385 233955 228187 178554 147253 162865 162974 147780 123215
16685 123215 101857 96737 87779 115090 187225 253394 237790 187535 145831 135044 151051 159411
16673 159411 144153 114930 81480 21166 17514 42410 67283 60596 59906 65847 80779 57268
16661 57268 36407 44406 42617 49074 50526 25674 19037 14584 19862 14800 36620 45014 54941 80639
16647 80639 79620 60996 28569 -8764 -27744 -3758 12996 28309 26796 12643 4297 -13380
16635 -13380 -14992 -1312 8650 5331 24047 40881 47998 27228 8211 -1321 -4737 14370 17065
16622 17065 19236 20121 -24709 -50496 -47073 -27322 232 -27100 -23088 -1616 18816 7660 15347
16609 15347 4458 6735 17089 9289 -13115 -42309 -62593 -56505 -19738 -19699 -11152 9252 -3785
16596 -3785 -27547 -992 -4075 -6127 13930 20979 8575 -1165 -28414 -40264 -19908 377 10189
16583 10189 -14104 -20134 -28176 -49798 -24309 4010 29475 40176 38981 22608 -4405 -28098
16571 -28098 -28012 -16647 -9768 22531 50140 50216 34553 16532 16431 36561 8956 -15602 -998
16558 -998 -6525 -8817 -2255 -6202 -20397 -20727 -503 4594 19728 6497 -3449 4490 16630 -1757
16544 -1757 -42323 -69342 -47803 -21332 -27207 -44937 -60424 -39099 12274 40441 11212 -23970
16532 -23970 -19842 631 647 -20064 -38213 -51818 -40071 -38441 -23425 -20493 -31168 -8490 6664
16519 6664 -3057 -42587 -45804 -24780 -4560 -7751 6261 16905 13771 33049 41935 29232 33190
16506 33190 23515 45969 58838 52760 36557 29491 29717 41656 63439 53048 2247 -21784 -25626
16493 -25626 -10723 10639 10576 11355 8591 17850 38606 44440 15340 10861 5336 -2719 -884 5019
16479 5019 3666 400 -18685 -28037 -18015 6093 25910 -20157 -53713 -53715 -31122 -23158 -19208 -27550
16465 -27550 -36736 -36931 -23889 -39174 -29022 -28437 -31951 -21197 -10585 17831 39255 32773 11075
16452 11075 -18613 -26242 7407 18411 15916 3491 -9408 -18845 -7803 11292 -12929 -22091
16440 -22091 -14473 6792 24742 25344 10024 21415 31231 34020 27122 24952 19656 10735 4562 -4409
16426 -4409 -13614 2064 3512 -7244 -2891 15369 3515 -3612 -16466 -14661 4496 18361 6710
16413 6710 -13621 -9685 -17843 -1330 13110 21956 14167 21954 26457 19644 11564 20058 34658 43073
16399 43073 58811 68501 52528 3719 -421 577 5204 11727 19068 36787 26296 10740 3854
16386 3854 3047 47050 86267 121458 118485 94711 71638 59338 46277 14364 13565 12597 3455
16373 3455 4424 14497 15500 16425 5692 -8617 3137 26568 18528 9237 10296 2620 3380 9736
16359 9736 -947 -9043 -3320 -962 -1963 -18584 -9580 -12540 -26539 -43307 -44498 -26901 -19488
16346 -19488 -34057 -35049 -21024 -13514 -2836 -13762 -11419 -25004 -50588 -48623 -52956 -43053 -23165
16333 -23165 -4236 -9165 -13669 -31869 -40320 -27224 -26285 -60385 -64062 -39483 -20599 -8633 586
16320 586 12808 -7656 -24284 8334 8483 8390 1743 3108 923 -16906 -30453 -21464 -4782 -11878
16306 -11878 -15963 -20327 -6999 -4783 -22449 -54487 -62909 -62153 -43649 -7854 -9026 3630 10491
16293 10491 7406 -13704 649 7732 1378 -17326 -16966 -35272 -35681 -7616 -2626 -1312 4897 -6698
16279 -6698 -30638 -33154 -29675 -18682 -5514 -30949 -28915 -16943 -17222 -17693 -22206 -22284 -12470 5506
16265 5506 23690 6158 17208 18481 14856 3142 -10393 -14242 -12110 14672 23063 -6584 -20404
16252 -20404 -9791 -3486 11846 17356 30757 29031 25488 24508 32965 18375 4469 -21005 -40980
16239 -40980 -37167 -27596 -1690 -4577 -29122 -42311 -38460 -19098 -16638 -13101 -10388 -16402 -16833 -10888
16225 -10888 -15099 -15569 -786 38244 40440 31441 21299 21757 19528 14311 -2430 -17624 3847
16212 3847 25087 18371 18627 7154 6397 -12621 -37549 -42736 -38815 -47933 -28473 -18119 -28009 -24928
16198 -24928 -36002 -41294 -26865 3070 6425 -10154 -29530 -25411 -7492 -20508 -21107 -9079 -11848
16185 -11848 -15159 -6168 -8063 -13502 -9681 -36711 -30540 10341 19001 1351 9675 11743 -1397
16172 -1397 8922 18964 13238 -7881 -16953 -35070 -38680 -27791 -20529 -19549 -18465 16545 34301
16159 34301 15949 -3850 1512 1567 -25149 -23990 -11606 -508 -4382 -8460 -11029 -37049 -26293
16146 -26293 -30309 -36201 -18453 -1750 6850 -6029 -35689 -22005 -13782 -35269 -44751 -48780 -31487
16133 -31487 -4424 -8372 -4313 -3601 -20252 -10239 -26214 -43367 -32131 -22194 -18900 -13616 -13203
16120 -13203 -14797 -23172 -25712 -28521 -11663 8636 11583 24272 31196 26867 -5898 -18387 -24256
16107 -24256 -2071 12088 -11950 -33479 -2832 3442 -7719 -9625 -44870 -66860 -24656 -4488
16095 -4488 9943 1819 12740 11821 -12838 -43089 -51221 -40449 -36600 -30923 -22651 -9227 -4760
16082 -4760 -416 -21948 -29691 -6635 -30861 -59230 -16700 16741 3575 -5303 -9558 -22232 -32518
16069 -32518 -12755 16983 23130 16256 -10204 -1089 11323 3116 1683 15338 1286 -18355 -30674
16056 -30674 -35996 -14462 -3002 12506 15742 -4652 -6898 4088 5119 -1717 -2780 -9385 -8661
16043 -8661 -22471 -35944 -46403 -22009 -9877 -16021 -24034 -21260 -24750 21624 39239 38508 27904
16030 27904 20042 -1657 -6478 -6519 -7550 -8819 -17620 1857 -2607 -19418 -63387 -59115 -4839 1548
16016 1548 844 16082 19891 -9457 -14189 -7874 -3235 2393 8091 11657 -20924 -28152 -24081 -8883
16002 -8883 3376 -8736 -22951 -22617 -13920 -491 2702 -14551 -22411 -13586 7312 33973 55355
15989 55355 49786 42499 19545 17405 11555 -29557 -41009 -23619 -20485 -719 -6839 -32142 -1983
15976 -1983 6431 14512 15963 10458 18966 18018 4786 3696 932 17302 6789 -295 -3641 -6737
15962 -6737 -9135 -33988 -13842 583 -8239 -26452 -21180 -5334 -21820 -34999 -32941 -4100 4261
15949 4261 34349 48682 17205 -4239 12570 5774 -14971 -24036 -39979 -31999 -35897 -35495 -33698
15936 -33698 -31894 -74 8601 -8080 10623 22663 6369 14172 20609 -7794 -28188 -20102 6267
15923 6267 2902 -2406 -21334 -13144 4038 25691 24860 42555 29117 47197 51661 19551 7976
15910 7976 19738 15367 -13608 -24224 -34266 -25241 -21609 -29011 -36900 -23136 4934 5508 -18059
15897 -18059 -18418 -12603 -21939 -11845 -6327 9737 -9586 -17406 -29116 -16488 -2207 -6514 7897
15884 7897 5158 -9160 -17528 -9244 -10250 -8807 -19568 -35928 -33642 -27191 2757 14446 24462
15871 24462 12815 15623 41717 42385 16256 24697 40934 20347 -6161 -4207 21049 5745 -12613
15858 -12613 5408 16236 -3270 4902 -5630 -15627 3055 6261 -3252 10821 20377 24419 17993
15845 17993 18902 15781 -1904 2548 22822 9561 11297 18313 26842 23273 18422 6494 4707 7032
15831 7032 -3739 -14807 -6387 -6861 -7063 6369 22537 29062 29861 24439 11056 -7478 9387 13652
15817 13652 12193 20849 15416 -14418 -21001 -20854 -35419 -44658 -12435 348 12321 6886 -3821
15804 -3821 -7825 12774 6852 -24439 -29832 -42591 -29018 -19034 -18598 -17065 19523 26215 3217
15791 3217 -9222 17420 29661 13147 -12210 -17783 -27773 -1380 13163 -2660 -5521 -8134 -43435
15778 -43435 -57716 -51732 -25280 -21990 -17463 -10878 9288 -3468 -20971 -14532 -18069 -4632 -1302
15765 -1302 -16939 -19458 3324 5495 -5776 10442 -5627 -30645 -32240 -28615 -28199 -22373 -5925
15752 -5925 33171 40348 24135 -20709 -35533 -28384 -17198 -338 16688 20313 31748 36255 30205
15739 30205 15649 11476 15878 2926 3585 -4885 -5875 -7019 113 2969 -830 7134 30245 21155
15725 21155 -1449 -16527 -24044 -19435 -22995 8056 16984 19016 12670 -46 -18683 -16776 -7786
15712 -7786 2496 10496 17306 5611 -16991 -2705 24324 13218 9774 24874 12048 -4552
15700 -4552 699 -12174 -21011 -20367 -15485 -4215 -7565 -10100 -19387 -21101 -9825 -4501 -7694 -32933
15686 -32933 -8142 1247 -20715 -32500 -26984 -18566 -31256 -36959 -43048 -34201 -24298 -37696 -53883
15673 -53883 -72600 -57383 -42086 -21684 -24545 -13529 -32108 -41783 -49322 -49328 -38763 -56432 -36700
15660 -36700 -28369 -15147 -1938 -1266 -25629 -26666 -38461 -62816 -67913 -84235 -57825 -26477 -6505
15647 -6505 16408 27586 11312 -9629 9614 38370 27729 17018 -8761 -11889 -7858 -990
15635 -990 15447 21808 25657 -4904 -4913 25934 38725 38347 29007 2936 9985 -1878 -7936 -30365
15621 -30365 -27033 -30933 -32598 -14044 -22721 -17143 -23631 -22769 -9415 24757 9458 -1609 3812
15608 3812 -13932 -47736 -40503 -29619 -35294 -55735 -49801 -25108 6547 24935 34485 47658 38250
15595 38250 23034 -5141 -3543 2618 -125 20983 32318 31497 -2323 -24174 -13381 -18906 -18563
15582 -18563 -17070 -8391 -9030 -2188 5865 -2336 -8911 -38488 -42613 -7766 23220 11262 -24693
15569 -24693 -26144 -37245 -48575 -28306 24745 39298 37382 48417 39612 20041 7280 -8840
15557 -8840 -6857 -10675 -17937 612 -2796 -14556 -34887 -43479 -19297 -12138 -30615 -27074 -31377
15544 -31377 -51718 -31114 -24205 -13417 -9602 -21026 -13784 -18246 -35586 -6360 22418 11370
15532 11370 -10818 -24742 -21194 -29572 -9546 5452 12225 8810 -7886 -31418 -23682 -31686 -41973
15519 -41973 -12355 6928 22125 37127 20014 -11177 -20621 -1218 22488 16070 11925 -1680
15507 -1680 5678 11381 18215 16969 19311 -595 -11631 -31729 -44684 -49656 -26551 -16100 2683
15494 2683 25161 20821 2615 -19908 -45428 -55459 -14042 8404 693 -22211 -34798 -35576 -19846
15481 -19846 -42254 -56596 -31526 -21051 -16549 -27244 -35516 -29254 -30136 -28038 -18449 5294 -15701
15468 -15701 -47890 -45612 -24404 -10552 -22675 -22793 -16210 -6843 -4635 2305 29979 17844 26879
15455 26879 54716 45226 25549 10342 19502 26138 28485 24666 41176 32270 3486 -30180 -17595
15442 -17595 -14252 -27732 -43781 -53146 -69563 -86775 -73596 -51086 -45833 -52151 -32853 -14203
15430 -14203 -8773 5872 -7617 -3911 -878 5505 -8192 -5298 -12934 -11897 -818 3607 -11274
15417 -11274 -16493 -14812 -1022 13433 4350 -22578 -33785 -17880 -22399 -30365 -31938 -41652 -38327
15404 -38327 -33133 -19546 3691 -10037 -17908 -5353 -13636 -16611 -17199 -4544 9198 -4521 -40805
15391 -40805 -26791 -12302 -19583 -22177 -36386 -45047 -51292 -50327 -45214 -31184 -28428 -37381 -49900
15378 -49900 -42862 -5009 8996 -25951 -28569 619 22097 8441 21634 26926 2090 -13175
15366 -13175 -11375 -16358 -15960 18156 22446 12788 7972 13891 32655 45468 56779 55314 51855 39591
15352 39591 20960 -8687 -4278 -3400 1185 12689 33805 25652 8459 -2027 2132 -7955 -15115
15339 -15115 4288 15543 27471 24492 11690 -9164 -16792 13424 24190 6109 -7599 1720
15327 1720 12184 1650 -27145 -16286 -15832 -10750 1015 36182 30993 1509 -11049 -1446 -3429
15314 -3429 -13706 -42881 -77218 -86072 -71591 -59981 -34579 -17506 -8309 -4516 895 -8999 -17943
15301 -17943 -13285 -30511 -14728 -9323 -30255 -24354 -16570 -18040 8631 33893 44153 56667 30199
15288 30199 12252 6053 27251 38665 18733 17613 42305 28680 33025 51286 34476 34142 15375
15275 15375 -3571 -7647 -25054 -22058 1693 6663 -19890 -33909 -25069 9961 18763 18627 15857
15262 15857 -3774 4865 11053 -6910 -18657 -5807 22785 23600 14284 13979 1439 -5025 -1865
15249 -1865 19301 -1444 2357 6581 -31210 -46309 -16219 3581 -7050 -27812 -59961 -56361
15237 -56361 -37289 -39127 -30640 -26169 -22010 -17493 -18454 -17270 -17986 -12277 -15541 -35476 -56465 -64772
15223 -64772 -44756 -33941 -25259 -13307 -3468 742 -3143 -10029 1845 -7164 -6539 9675 1640
15210 1640 -5212 -19877 -34033 -5253 14201 4781 -24778 -38018 -37266 -59612 -48343 -28368 -11507
15197 -11507 -14336 -38308 -52188 -52115 -27079 -26694 -23135 -27557 -24906 -33414 -42324 -36549 -38635 -36283
15183 -36283 -33621 -36425 -28039 -13568 -12990 -33050 -25383 -23430 -32062 -30980 -22772 -20557 -25122 -39016
15169 -39016 -32732 -29656 -28101 -12336 -15248 -18366 -5494 -630 -4865 -20315 -12042 -6703 -13120 -19520
15155 -19520 -36921 -68217 -45344 -43533 -26086 -25668 -23083 -13742 -23018 -14461 -12399 -17967 -21544 -6576
15141 -6576 -13123 -41 -7888 -26466 -40466 -20646 -19904 -6140 16070 6206 -18052 -41117 -26035
15128 -26035 -15252 -15814 -18360 -22996 -24483 -23193 -4333 2460 11356 21310 17982 -14709 -14733 -5460
15114 -5460 -7860 4672 15253 15969 -1861 -3260 -12044 -36247 -26714 -21602 981 748 -22793 -39790
15100 -39790 -19199 -28232 -11103 14472 21300 18915 -2194 -19854 -38758 -28823 5596 1471 -7514
15087 -7514 9762 -4277 -22745 -35014 -22535 -7292 -25983 -29661 -22407 -36887 -39638 -36302 -35998
15074 -35998 -21095 -3401 19554 30684 5042 -21172 -26502 -20443 -23062 -37857 -62184 -52070
15062 -52070 -38064 -13644 9770 16576 5373 -10159 -21692 -36248 -63482 -45976 -26168 -34663
15050 -34663 -55127 -49551 -47077 -53702 -44822 -27794 -5152 -432 -9338 -27375 -7798 9683 4486
15037 4486 13167 20995 14503 -14029 -33196 -16598 -10330 9155 1668 10876 5228 -12496 -14145
15024 -14145 -2125 -7656 -1709 32742 18539 -4202 -35977 -42819 -7188 6317 -14982 -10362
15012 -10362 -19026 -29007 -25360 -10772 -18941 -28373 -33870 -29140 -37236 -30275 -385 3109 -25367 -58484
14998 -58484 -69281 -61142 -55266 -61305 -50830 -43962 -27318 -546 25270 15556 -14769 -16804 3100
14985 3100 18476 801 -9010 -26695 -42203 -31964 -36841 -56351 -80052 -51773 -3969 32447
14973 32447 42221 35228 38463 27691 -1067 -8366 -12265 -31373 3331 22267 14149 -3078 -28577
14960 -28577 -21072 14923 46480 35765 -16741 -37054 -31825 -17100 -286 -8035 -5392 -10997 -21329
14947 -21329 -33951 -52800 -34951 -5649 -12374 -2227 39900 50675 20810 -13208 18072 31933
14935 31933 40613 30017 7377 -3655 -20628 -25507 -2049 -21420 -18560 23794 34250 20958
14923 20958 5038 -5075 -8641 13665 15883 13532 24421 23453 8417 29659 13597 -5920 2521
14910 2521 5141 -610 1422 -7185 -13174 4925 23670 23010 11736 -8036 -12577 3296 991 -3266
14896 -3266 -6044 -2280 13905 -2359 -8459 -14726 -16161 -110 33634 42543 14119 -824 -4530
14883 -4530 4937 -22962 -15078 -5467 -499 7233 -11377 -14673 -13392 -23531 -28190 -64534 -49765
14870 -49765 -24557 -8888 8494 -5759 -19264 6171 21934 9876 -921 12985 24978 33289
14858 33289 11335 -388 15225 24115 26515 19950 33976 18325 6414 965 -19577 -41795
14846 -41795 -30788 -11883 -17885 -24107 -20567 -14624 -30860 -39171 -22819 8053 15106 13036 -10567
14833 -10567 -17357 -14217 -12078 7327 6024 -2167 14079 27964 32155 48755 26893 -9354 -25757
14820 -25757 -37276 -45356 -21367 -5853 -10618 -11383 19332 36121 15745 12430 20631 26874 17502
14807 17502 2691 -12494 -9158 -21566 -37178 -35233 -25086 -25547 -7592 -7623 -22887 -11867 8547
14794 8547 3117 -18775 -22241 -26109 -27153 -29753 -45027 -47883 -25925 -11410 -6867 -33652 -33473 -10698
14780 -10698 -532 -10433 -16973 902 7419 8680 30863 20541 21952 19530 17360 7313 -3235
14767 -3235 -2338 2035 20018 36289 32135 32329 19921 28581 27425 20198 6610 13400 14601 -2168
14753 -2168 9236 10925 29985 21193 -10918 -21528 -37105 -39257 -24915 6876 20810 28018 16884
14740 16884 11630 -4177 -27338 -16129 10023 35516 36023 38525 16880 2788 13391 23245 31292
14727 31292 17651 7517 21829 16011 3063 6122 -9449 -9211 10616 19433 14282 1716 6329
14714 6329 17181 13261 20911 29512 13075 -1156 -31097 -28369 -16746 5919 7515 4606 13808
14701 13808 14313 22151 45539 40713 27384 4506 24149 24922 -1794 11513 27736 2206 -30259
14688 -30259 -18437 -16240 -13826 -13846 -16000 20937 45236 37072 29037 23340 -7129 -17214 -16718 -6828
14674 -6828 3263 27711 13749 -15176 4796 48330 65249 44915 20388 947 -1961 4716
14662 4716 -8761 19865 24306 17109 27805 18666 17623 22104 12972 10412 -13798 -21558 -17986 -18024
14648 -18024 -45933 -36977 -32468 -15086 -2043 -5176 -23837 -15352 -3597 2264 25661 3006 -7036
14635 -7036 -7221 -16171 -38808 -58015 -67626 -48893 -27476 -948 -17002 -61237 -60160 -47041 -40577
14622 -40577 -30961 -17796 -7235 -3571 -1596 28166 16724 -4570 9439 33144 41512 33273 27079
14609 27079 32923 9910 -23556 -8459 -9661 5157 15801 -8439 -8525 -9810 -4515 1236 -338
14596 -338 -5886 -15836 -8946 15909 11012 4655 11445 23608 33592 29923 46683 40302 4871 -7411
14582 -7411 3964 -4754 -28731 -59034 -74271 -44094 -27920 -19946 -11451 13138 3124 -90 4850
14569 4850 8432 15664 13603 15165 -60 -29288 -24311 3081 -3809 -28187 -35090 -39456 -44187 -14071
14555 -14071 9226 8496 9208 13001 -2611 -27699 -3092 1013 628 -2503 -653 -19891 -41395 -15799
14541 -15799 12365 -2286 4434 7545 12190 15226 24440 42677 38517 8024 -11803 2558 14781
14528 14781 17974 5688 -9427 -4345 -17014 7441 23540 13663 2518 -13590 -10522 -217
14516 -217 7715 12893 30338 21343 16046 -1682 8864 31366 36814 1568 -10597 -14806 -17911
14503 -17911 -17175 -1743 20995 12147 -8233 1618 9789 -3331 -14794 -22256 -26025 -17488 -13001
14490 -13001 -18882 -1513 -4122 -25347 -27084 -33369 -40782 -28222 -4236 22433 8163 10952 21563
14477 21563 22882 27035 24302 -1475 -15352 -25896 -24386 -16369 -22068 -8509 2639 -8488 -13548
14464 -13548 -9162 -14873 20388 9503 -25360 -24042 -7965 4676 8591 17270 24801 1071 -14579
14451 -14579 -23546 -21595 -21232 -35693 -37566 -20636 -36705 -36958 7882 11262 12829 3913 -8836 -21167
14437 -21167 3572 5111 -26412 -42125 -55770 -52155 -45431 -27370 -18467 -15684 158 7259 -3928
14424 -3928 7325 18915 147 5099 13122 7657 2908 8821 13424 28117 1313 -16729 -27901
14411 -27901 -19403 -14869 -12104 -15960 -20668 -24154 4179 -1269 -7075 -11840 -19893 -28593 -36505 -10862
14397 -10862 -22682 -15525 -5703 -20932 -37217 -32733 -45867 -44868 -40583 -23134 11712 39481 23034
14384 23034 14369 4915 -16075 -45857 -57403 -35000 -13892 -5886 -5954 233 2206 7106 4939 18203
14370 18203 23227 19877 7599 -12 -17353 -24721 -6903 -24718 -42253 -45608 -52599 -62309 -47163
14357 -47163 6414 1280 8122 12235 -1070 12813 23116 35798 25905 5597 -7722 5239
14345 5239 27144 45008 31024 8816 -11473 -25416 -41483 -25057 -2721 409 1956 22729
14333 22729 28172 33106 23288 17441 155 -8341 2443 32258 21504 -1944 -12057 -15183 -10838
14320 -10838 9867 -3271 -22237 -38167 -31340 -23633 -13511 -16728 -21110 -14343 -19529 -14859 -333
14307 -333 13202 23970 30676 9740 -27163 -10451 -3209 -10859 -25104 7410 28664 14334 -5695
14294 -5695 -502 9608 2880 -12619 12199 27171 16333 -19617 -63961 -66456 -58964 -51750 -28373
14281 -28373 -11863 -15171 3190 13283 -7042 -32250 -35485 -30886 -6389 5644 -3805 -7636 -25911
14268 -25911 -34249 -32889 -24503 -31455 -55605 -47489 -52154 -44129 -12746 3805 -7586 -10998 -21463
14255 -21463 -2268 16165 5893 -12097 -16632 -6771 -1743 16050 -6070 -25786 -35552 -32681 16807
14242 16807 25568 -3303 -26561 -30337 -17409 -4122 13278 21827 -4476 -16247 6694 6154 -12381
14229 -12381 -39943 -30415 -1051 -3765 -3386 -20013 -10396 -22021 -18551 -45888 -63026 -37653 -18358
14216 -18358 -13107 -2225 -8445 -1106 -14462 4650 8319 13447 6380 -4783 3713 -4748 -15544
14203 -15544 -8934 -27853 -18609 -7178 6036 8345 1182 4694 -21197 -36699 -25690 -12553 -20799
14190 -20799 -1938 -3603 -13014 14181 24300 18262 -2099 2572 24424 30219 5562 8625 33306
14177 33306 30821 22833 14196 -3036 -4768 16210 5254 -7314 -20500 -24883 -31475 -34749 -44062
14164 -44062 -19932 -14232 7031 16696 25381 38425 14485 -2154 3159 2398 4522 -5909 -34359
14151 -34359 -19770 -21271 -26956 -10393 -23231 -36947 -30635 -27375 -32962 -35371 -40022 -42404 -19978
14138 -19978 -9692 -31787 -18984 -14091 -39616 -42565 -42957 -51957 -42290 -8863 -958 -4757 9452
14125 9452 -232 -18258 -20394 -6508 14339 5409 -12594 -8077 -452 -12113 -38909 -30461 -18684
14112 -18684 3057 19292 37028 27959 32630 24057 20774 -11542 -11291 -1360 -2481 -14109 -26455
14099 -26455 -36826 -28729 -2245 8999 21891 12085 -3685 5169 -13517 -16976 -18692 -9439 -30021
14086 -30021 -32448 -29032 -40011 -40359 -9037 24144 40892 51979 49512 35933 19513 21770 18760
14073 18760 7520 -10456 3416 24191 21309 19737 -6434 -31883 -40205 -26980 -7251 23205
14061 23205 29591 11093 23238 24919 12328 -174 14806 9005 -3746 -1370 1245 16551 -16062
14048 -16062 -37293 -19021 4481 18912 20807 18292 12505 -4449 -45313 -54097 -37212 -13276
14036 -13276 -4034 11354 6785 -24249 -33356 -24764 -28799 -27724 -10580 -1578 9380 12513 24031
14023 24031 24014 25806 33181 31997 20235 -2233 12414 3001 -7974 -15809 -14351 2046 -16055
14010 -16055 -7560 10309 30661 24551 20253 28459 18698 -3815 -34396 -48246 -23936 -745 9458
13997 9458 -1107 258 -16589 -10632 -462 14260 12674 -2376 9572 1418 -16030 -20336 -11393
13984 -11393 10712 7847 -19546 -23715 -16826 -16046 -19833 -3152 -12419 -22505 -8815 -9236 -1601 10396
13970 10396 38141 35961 27353 6324 -6798 16748 13927 16581 7377 5951 -6833 11956 5690
13957 5690 4234 10610 27261 35484 17426 10595 14515 17259 36815 28723 -1884 -8402 -27894
13944 -27894 -6238 13081 -11674 -37789 -35638 -27406 -8686 -1576 7912 79 -7925 -11777 -22078
13931 -22078 -14280 168 6195 16773 20744 1284 2041 1891 2421 -16114 -24910 -43881 -21632 5383
13917 5383 4871 1174 -4778 -2601 -5100 6557 11872 16411 2856 17552 21195 10591 -2151 -27408
13903 -27408 -22312 4917 10560 -12921 -31851 -38822 -7002 6603 -2358 -10222 -1834 20761 13801
13890 13801 -6863 -6104 10758 9754 -13979 -3094 -3453 -3572 7947 17689 17274 -10880 -12296 -22383
13876 -22383 -53786 -71996 -73441 -72288 -76175 -73928 -62232 -26828 -33490 -27976 -29624 -37013 -2592
13863 -2592 16327 3497 -12116 -21988 5784 10259 21666 11320 2614 -7876 1270 23046 12210
13850 12210 22668 58700 40228 15916 5246 449 21989 32692 24935 8500 12730 30388
13838 30388 32848 17606 2882 15779 15922 23081 29194 28184 10220 -3137 -5898 -759 2751
13825 2751 -17464 -16241 11305 29448 39520 29713 17826 -25677 -48709 -25548 -9812 6550
13813 6550 20494 2585 -6654 -18080 -13270 -16332 -17699 -1460 18252 3656 -2790 -28029 -46314
13800 -46314 -31503 -16089 -949 -2098 -4254 8167 -47 -14128 -55126 -76818 -61527 -37038
13788 -37038 -32299 -26236 -9821 -113 23237 19998 5471 -3509 -25888 -27039 1184 2445 -1568
13775 -1568 5724 16667 7621 14644 5143 5589 -3017 -17964 -20958 -15611 -13904 -29457 -42796 -31259
13761 -31259 417 -1388 540 5382 14769 16197 21888 29671 -2346 15260 47617 66738 55603
13748 55603 24681 19361 -1166 -20382 -20074 -21121 -14688 -4007 23818 11586 -30305 -19973 -13875
13735 -13875 -14924 7929 -6957 3464 1602 -2786 -494 -4290 -11340 -17288 -7440 13043 20796
13722 20796 34903 57474 43675 -1290 -7138 9765 663 4878 21848 9998 -32833 -32683 -2968
13709 -2968 -651 -5515 3185 1007 23820 33892 28162 14512 21089 21990 3726 -5464 5326 1705
13695 1705 22023 32260 5112 -14800 -33983 -48881 -54509 -48797 -72884 -76210 -36778 -10882
13683 -10882 -5010 -28230 -28125 -4266 20267 27255 12602 -462 -8064 -19476 -26997 -23287 -26944
13670 -26944 -63264 -62048 -43452 -15813 21577 18324 -17455 -29889 -4241 18657 13248 -22055
13658 -22055 -20333 6998 17058 3387 -31476 -42218 -49482 -51115 -22276 1763 7395 -12683
13646 -12683 -8591 -34121 -49205 -39175 -22476 -13853 -15456 998 12252 3848 2771 18831 25850
13633 25850 34006 29489 19020 27119 10840 -5498 -27138 -29158 -4622 -14349 -5913 -8909 3657
13620 3657 28063 31169 20008 -2459 -22166 -19840 4077 18386 15625 1627 -4512 6565 435
13607 435 -22596 -43308 -36241 -42066 -35753 -22559 -4930 23747 40251 42509 17260 6560 -700
13594 -700 12149 3577 -3560 -2615 18014 30488 33626 13128 -634 16752 11826 -18896 -50713
13581 -50713 -6585 14600 17328 6498 -20711 -13870 -718 -35291 -50076 -40569 -28250 -7408
13569 -7408 4352 10029 -2219 1276 21523 49210 32958 495 -1566 18545 27335 16681 6868
13556 6868 10120 15977 21067 -6312 -23756 5079 25825 17565 11803 14786 5919 1661 21004
13543 21004 21813 24210 34706 23044 21685 13113 13523 24918 5699 3701 6446 15262 -6398 -28103
13529 -28103 -26206 -23972 -24294 -22522 -13325 5373 -1853 -19029 -11483 -4128 -14732 -16091 -37063 -56732
13515 -56732 -53632 -36980 -21237 -3156 1352 -2628 -15471 -6684 7905 16088 21820 28698 7957
13502 7957 -16288 -18256 11276 28521 44000 45612 30840 46069 40147 43480 31300 30958 33151
13489 33151 16889 7486 14993 11313 4762 -9304 -19832 11449 19093 38675 34246 34897 60135
13476 60135 56581 44424 31986 10055 14969 14662 30425 53100 50978 19908 573 1276 -11772
13463 -11772 2074 20376 16767 22984 28989 5073 -14283 -8129 -7770 -6782 -2660 4504 3754 375
13449 375 -12425 -14772 -40186 -46578 -15640 -6096 8774 37995 37373 28424 22717 -3036 -2949 7246
13435 7246 2626 -1827 9830 19476 23065 8325 7514 6807 -10740 -4843 28183 28467 14895 16320
13421 16320 32641 33308 25873 16800 20802 -13237 -21508 4553 1847 -1742 -12629 -44162 -38071
13408 -38071 -6004 -6121 -15172 2501 5055 -5220 10870 44469 36739 -2831 -18690 12724 18112
13395 18112 11998 -1496 -25412 -29353 -10804 -6749 -17285 -24763 -31248 -10965 -7427 -16390 -15995
13382 -15995 304 22811 17679 5504 7040 21127 15284 6961 14151 34823 23082 9819 20745
13369 20745 7192 -14125 -6988 -15016 -19503 -28117 -37524 -16931 59 -18138 -40643 -33333 -27401
13356 -27401 -22489 -6654 10858 16013 -4374 -38364 -35757 -7521 10617 27337 16547 19914
13344 19914 18182 16271 20800 25824 11124 12174 996 2683 13107 30367 49243 49795 44975
13331 44975 17872 18282 7456 9562 12925 -3504 -1068 10443 17675 9193 -7444 -9150 -2705
13318 -2705 -2818 -4528 -16909 -11090 15024 15109 11604 -8166 -16960 -36907 -24604 682 -13804 -34648
13304 -34648 -28081 10841 22007 18372 24418 27160 21065 11452 48181 49302 25563 36475 41303
13291 41303 48484 45534 37569 45364 34012 28313 29133 29214 30033 3393 -4607 13069 40761 58645
13277 58645 42910 35726 39871 42450 19232 -13840 273 22853 20682 20362 23096 33867 42155
13264 42155 45575 23280 11621 17306 19239 19469 23444 60954 66933 53247 31994 25269 36519
13251 36519 42839 27616 20284 20746 17286 19914 43891 67825 96232 77583 77797 60420 49446
13238 49446 35073 22479 21253 16605 25012 50841 77797 106872 115482 83920 57235 24291
13226 24291 -6520 -14093 3912 8610 3371 -12275 -15295 -11314 -12860 1766 18799 29338 13290
13213 13290 12124 12932 8154 -1531 18516 37194 23735 6027 14825 17045 17493 41556 53775
13200 53775 53294 49185 16492 35865 76721 96298 68942 63524 48449 35204 28837 19324 15289
13187 15289 20431 43520 45475 21831 -9104 4413 1314 -21908 -5514 9693 10793 -8946
13175 -8946 2053 4006 371 -2730 -3614 10809 30048 18658 7323 16773 26653 8916 27635
13162 27635 35131 20617 16035 21131 20201 56191 61108 62823 77739 124913 182401 211588 226238
13149 226238 231398 208097 144980 93902 51060 31281 49121 53474 21669 -1929 3175 37081
13137 37081 55096 43143 34268 28226 44160 54950 57290 58552 45249 46575 46195 50118 42756
13124 42756 34268 34685 36742 65300 55701 58597 70345 70066 60514 37625 29721 38329 38882 35979
13110 35979 35438 60343 95461 159141 203229 225151 209348 184369 147900 98112 64158 55379
13098 55379 52662 40406 38347 48618 46653 44405 51364 39006 39880 28978 34614 39270 35769 40214
13084 40214 8447 2375 15125 31375 30731 23994 5957 19905 35650 69893 75109 45978 38449
13071 38449 40859 49890 58299 52935 37952 25670 18368 50416 66173 64045 76245 75700 54787
13058 54787 53705 67444 81718 63868 56067 38849 29913 22170 41002 48839 39349 22052 29667
13045 29667 37463 45863 27411 39238 59728 62304 55206 53881 77623 64609 45558 30018 56891
13032 56891 73383 53951 42365 41985 24461 53905 57626 68682 53766 29175 19919 35958
13020 35958 42737 53983 60598 63813 53873 30769 16823 6619 -8685 7537 22248 28094 17867
13007 17867 24468 39956 74947 94742 66751 31993 45383 53166 43451 41188 57814 64990 68873
12994 68873 72748 75538 87417 62569 54303 51957 40117 26714 14685 27424 49226 72579
12982 72579 71096 67176 85933 68481 79039 117247 133215 109516 79973 59448 50446 52363
12970 52363 54077 52535 64648 63613 62277 53255 80031 92011 77568 90282 92215 106463 95476
12957 95476 66711 58616 62107 61685 79549 76700 60926 53288 34235 22727 44230 64625 92894
12944 92894 97888 85997 73028 58077 60278 46756 47146 55166 55749 53764 51637 62866 77612
12931 77612 74555 60240 76736 92175 71418 75150 77234 63762 80676 94608 92289 87963 79638
12918 79638 81756 89113 98332 80023 88573 104426 104578 89715 98298 92621 90724 99490 113823 104001
12904 104001 96200 97687 102716 108427 111343 117736 101721 85028 88881 102932 90076 77121 97721
12891 97721 94615 75471 61307 58164 73281 86456 68170 56800 72211 93163 92538 107307
12879 107307 130079 125477 126950 136449 130591 107354 98849 101880 113686 113479 147005 169947 166908
12866 166908 146992 132385 153305 160205 132518 122146 117234 98461 131819 126493 114250 134538
12854 134538 136951 137281 135172 138245 130229 123441 97696 99606 107789 118308 122527 125712 137673 116428
12840 116428 108273 110108 104880 133854 136623 123746 90854 82514 100051 120756 148888 165889
12828 165889 186994 172582 157010 153055 142233 119251 130110 143323 142129 165445 166645 157731
12816 157731 148847 158329 174110 166423 149843 141542 138255 166774 180834 186260 173085 133365 119466
12803 119466 146770 160684 165705 174638 167976 145365 139495 138398 147395 161144 165630 179540 198090
12790 198090 182152 170108 181723 172006 135532 139783 158381 165607 173422 179402 206109 224739
12778 224739 208346 165286 132571 171070 186133 188411 190408 185125 191259 192846 194577 181637 186680
12765 186680 190908 188307 192837 181284 162387 177288 185866 184828 168204 152384 165442 185005
12753 185005 178589 180836 187890 194715 209424 230600 232682 213579 215830 222122 226173 207783 199446
12740 199446 218682 216398 215242 215728 231580 227724 217788 241309 242711 221908 228701 234244 232740
12727 232740 223678 221095 218343 231403 222103 237827 253756 263425 266631 278975 266560 253141 238404
12714 238404 243969 264860 272388 256122 269361 271161 258125 271249 277171 272397 236153 257773
12702 257773 276606 295250 291837 256106 249836 277361 288378 278219 276496 289142 323352 316321
12690 316321 323423 326410 310088 312521 329976 333380 319715 305939 327171 317693 326849 347647 359663
12677 359663 355640 357419 361503 375255 383598 375421 340651 331627 338818 337450 330746 352811 370474
12664 370474 353271 363977 375795 373692 367836 352391 365268 398801 404858 413997 438096 414725
12652 414725 396333 411990 431231 430631 416431 409541 412653 410016 439032 455635 463124 470362 470954
12639 470954 455296 422282 378582 411432 439147 456341 478843 486799 504666 510719 485611 487691
12627 487691 501840 530745 539797 533981 557322 545954 523903 520788 534882 540384 533620 531263 534463
12614 534463 584015 622499 632654 630033 611472 595061 580764 592340 627789 660820 650748 639707
12602 639707 641242 636285 635715 639131 685059 712999 727799 739090 717989 701944 693617 713600 736850
12589 736850 744920 753510 745935 762829 764655 764364 778860 798664 831164 825352 838184 851650 833267
12576 833267 867875 892373 896200 888898 893878 914815 944225 934090 921728 934237 951764 960611
12564 960611 987176 1017023 1040633 1064390 1077583 1078567 1074986 1082108 1089455 1069128 1076221 1113305 1142846
12551 1142846 1162565 1168520 1175141 1191433 1230539 1255850 1273898 1302346 1320246 1313818 1331138 1367098
12539 1367098 1381874 1390989 1447694 1503716 1517767 1526426 1547840 1567404 1599294 1636580 1655331 1673968
12527 1673968 1692754 1711674 1734669 1755255 1767828 1811768 1852644 1891906 1922747 1962487 1976334
12516 1976334 1966456 1981171 2035417 2098120 2142358 2185446 2250000 2281376 2327453 2366382 2398898
12505 2398898 2447566 2473075 2515283 2572998 2630874 2653324 2701272 2775892 2841893 2894452 2953842
12494 2953842 3052400 3105832 3129692 3170283 3228793 3309249 3381452 3449046 3532607 3636456 3729639
12483 3729639 3809425 3885307 3976947 4085337 4189163 4263499 4369317 4493641 4622554 4720546
12473 4720546 4826896 4963163 5079332 5197794 5340204 5474559 5614069 5783443 5948133
12464 5948133 6134258 6324891 6530506 6732953 6934928 7158187 7359800 7559853 7775869
12455 7775869 8034940 8297119 8562953 8842554 9134666 9459863 9811465 10168270 10532543
12446 10532543 10891701 11293464 11717294 12149016 12593011 13044174 13522074 14025182 14572879
12437 14572879 15144914 15746268 16361994 16993783 17631476 18313726 19057475 19850226 20653571
12428 20653571 21460592 22309029 23237168 24130785 25049697 26023460 26986347 27985190 28987206
12419 28987206 29985874 31002482 32006433 33013686 33964481 34899511 35790116 36609919 37361273
12410 37361273 38038682 38621071 39115595 39510240 39781090 39937766 39980135 39891403 39687814 39396372
12400 39396372 38982476 38457245 37853139 37156598 36376237 35550154 34691846 33773086 32816184
12391 32816184 31854935 30866101 29849626 28824157 27822932 26855118 25897000 24935730 24045205
12382 24045205 23159288 22274817 21415302 20601447 19813838 19067696 18383754 17720443 17067107
12373 17067107 16438513 15822521 15255649 14708621 14168716 13636565 13146385 12681883 12237685
12364 12237685 11806629 11401167 11025182 10671600 10326964 9953731 9639714 9355604 9062072
12355 9062072 8775489 8524270 8265814 7985431 7717906 7490599 7278300 7067826 6860859
12346 6860859 6689534 6523916 6350840 6188542 6025295 5860396 5693257 5535994 5373748
12337 5373748 5234442 5079728 4945010 4844848 4702834 4583005 4476067 4401156 4329182 4220737
12327 4220737 4103116 4012208 3934988 3809751 3710816 3641751 3561019 3497527 3432154 3375865 3316598
12316 3316598 3241770 3174153 3089980 3052073 3008978 2934795 2873002 2865559 2844093 2792521 2728235
12305 2728235 2656809 2604679 2601160 2552900 2461566 2419047 2376772 2335311 2294798 2233856 2185375
12294 2185375 2147852 2130832 2122068 2083135 2043574 2002601 1989411 1960618 1916886 1902896 1871193
12283 1871193 1834820 1794900 1760140 1744020 1717877 1706321 1702844 1681772 1641175 1611674 1590278
12272 1590278 1557582 1529346 1506531 1483388 1458283 1426764 1407772 1411976 1392428 1352721 1318517
12261 1318517 1302662 1271793 1251887 1259796 1274153 1247639 1229600 1221164 1218170 1194840 1193315 1179935
12249 1179935 1177657 1178635 1167132 1143127 1123093 1098563 1065051 1038519 1034706 1047425 1029994 1046202
12237 1046202 1028948 1020602 1060481 1079855 1072881 1063916 1047973 1048842 1016068 986560 956053 882246
12225 882246 843955 848269 874645 864448 830797 834648 827516 800898 798933 811263 798517 767918
12213 767918 765150 768970 769024 762740 766409 743415 701792 701920 709657 679487 683294 695305 693320 713013
12199 713013 703181 679633 667977 677494 655742 626000 638926 654384 660295 655592 627273 625270
12187 625270 627523 619384 614278 622065 626367 607050 589934 591515 589113 577181 581395 561108 540343
12174 540343 527851 522187 490092 473447 478955 471529 473097 496259 498422 460880 444934 452118 448255
12161 448255 468461 472982 466599 460256 470441 483775 466729 464072 462838 460274 447747 450629 445668
12148 445668 447692 433266 422426 418527 406217 406554 415892 440131 434687 409846 406591 420033 419401
12135 419401 428475 420834 389657 378684 350585 341162 347426 356881 358140 370792 376811 362274 363499
12122 363499 365981 369917 374093 360549 347561 355762 337457 320469 311494 298280 285578 282466 317849
12109 317849 303725 294967 294319 285629 295961 302425 318777 305869 307194 298933 295563 314397 329051
12096 329051 352710 341831 299014 295984 300969 273341 279311 261725 254304 273574 283724 278183
12084 278183 271922 234948 209669 198391 213016 238627 233387 222264 218481 219669 223805 235189
12072 235189 238893 252813 245015 243560 242530 232062 226283 211747 220713 224461 227585 238721 236809
12059 236809 233470 239979 232267 216568 211800 225945 256897 270679 251632 251747 234577 226485 217778
12046 217778 203126 183827 171111 183719 192151 183891 195784 199330 198905 208414 209660 195911 187244
12033 187244 193102 202816 197517 181666 173815 171773 163172 175468 184828 182868 173864 166172 172074 188192
12019 188192 199592 207049 186831 174096 187156 169408 158465 179485 178259 174878 164360 163583
12007 163583 181209 198725 208035 189165 184665 161306 155123 172058 179912 183600 164206 138972
11995 138972 120116 126210 139717 145016 136707 128118 105045 80622 95216 119248 128802 145093
11983 145093 147646 129435 136773 148247 147894 143394 126511 116799 123816 141246 139977 119448 136513
11970 136513 157695 141716 119717 124831 120309 88800 93646 98550 112969 129249 143458 129586
11958 129586 125632 138430 119085 118127 125910 115994 92357 88730 91082 92637 114153 117954 100897
11945 100897 105116 122845 114630 125669 107481 68151 96396 106347 100315 97334 87721 94923 105233
11932 105233 93718 100170 106311 102566 102370 104714 108635 124543 128774 130710 118152 112787 122145 125250
11918 125250 126706 127742 113259 107357 98795 91043 113402 125230 118781 97407 85482 72426 64216
11905 64216 74290 98807 116733 108895 91927 96713 111265 121465 112009 113793 90754 92377 88746
11892 88746 71034 81299 83847 62458 56806 54815 59203 79921 77536 59641 47034 46276 68653
11879 68653 83221 82764 80107 68591 70865 79105 78198 67151 56436 80885 86686 88804 84756 84009
11865 84009 95255 102757 75640 71288 94218 107661 108306 86435 92057 87216 98722 89779 92934
11852 92934 98765 114293 110816 104099 80790 70124 63524 64102 61337 72315 74610 74535 79472 70964
11838 70964 73774 64158 48115 53410 74035 67903 63747 76620 74714 88917 88302 87309 85330 89095
11824 89095 80888 60099 45530 27283 23904 21645 40213 48351 58756 63848 61901 54901 32686
11811 32686 36023 64515 54999 42792 61470 66752 80632 79408 75879 78788 74229 69679 44001
11798 44001 39908 56023 57384 57353 39438 23469 31762 50465 39396 26606 12941 -5516 -600
11785 -600 -2067 8515 28870 38984 65357 61471 49751 40077 17431 37789 70991 63308 43500
11772 43500 51732 54210 61360 43712 57483 64770 56512 49905 72301 93106 75348 72137 74877
11759 74877 78622 88618 93931 98993 108842 83033 59091 78731 98818 82267 67124 61436 74722
11746 74722 88318 78624 65441 58747 60500 33306 33289 46395 30753 12771 46469 66247 65254
11733 65254 59265 54851 51313 79101 86978 96290 102975 73620 55496 62313 63392 88599 93344
11720 93344 66804 47371 51089 43595 26021 22936 26281 25789 26772 26668 29955 34932 14655 5359
11706 5359 18189 16403 15621 27215 40645 56007 50422 20521 8332 33061 33927 53984 47756
11693 47756 34078 51180 64732 68569 58773 46042 41921 26471 14019 30585 31168 39293 23228
11680 23228 16048 15315 21671 49931 46381 34577 41111 44450 32397 11034 22912 35142 51140
11667 51140 41274 25319 14070 -18161 -38717 -24255 -13995 -10722 13371 10615 2506 -5721 -9937
11654 -9937 2333 14769 37523 33268 34528 35603 35715 28256 23162 23556 41277 53628 36520 5852
11640 5852 -2800 11105 29556 44655 36521 42502 58972 59039 53559 41722 42085 24884 22111 15306
11626 15306 10842 37453 23971 29616 16107 1897 20651 42510 44070 36807 32147 22550 30989
11613 30989 33234 15989 15724 43871 34737 14237 13628 32975 29309 23341 14068 13276 31416 59775
11599 59775 53401 55812 50994 15512 16657 35834 17895 17746 28100 43048 54496 34527 9682
11586 9682 -4432 21256 20893 31132 51053 73146 75748 41113 19749 14961 22937 37930 46727
11573 46727 39902 46962 57596 80037 69516 50223 34997 23636 22959 18501 25674 39820 54762
11560 54762 40078 33046 28477 14251 8134 18287 -7555 -18259 -30700 -35674 -1996 35993
11548 35993 47991 38026 41609 47791 38923 31319 28823 788 -7117 10561 9383 2154 15579
11535 15579 32144 22454 -6883 31502 46366 41333 15976 18762 -3563 -8216 -14289 -21469 -30735
11522 -30735 -28925 -47438 -25300 -12223 -4906 22880 15559 -2475 -13292 6957 679 27678
11510 27678 51484 69143 65465 57381 37629 17049 22401 18835 27164 39967 62278 45741 16027
11497 16027 12755 23319 23156 2799 6094 1084 -10041 -2832 16849 10352 -2031 7548 20040
11484 20040 26996 50602 71376 94469 99501 98716 100160 85018 50531 18306 -9439 1545 8761
11471 8761 27092 32719 8224 -3845 5513 2823 -7476 -12531 -10610 5062 9524 12240 28059
11458 28059 21274 22030 21758 29314 23311 46278 58008 48037 35735 28815 15835 -11090 -30138
11445 -30138 -38838 13427 36706 33522 24849 25940 20037 10773 26193 16341 835 7608 18534
11432 18534 14730 17391 24876 13440 -20619 -13285 6971 27027 16165 10264 24026 37172 27652
11419 27652 18419 4142 -252 -12705 -2203 -24762 -21862 -17641 -5395 -9481 -15266 -14665 7128
11406 7128 26828 24206 15188 7218 -8039 -4801 -5576 -8791 -628 13733 32589 18669 7247
11393 7247 4667 2833 9506 -16469 -5553 22622 11633 -7717 -3823 -2361 -8333 -14626 9744
11380 9744 34420 39350 45507 46519 43571 29254 28113 38912 51565 47541 36663 19530 2288
11367 2288 1722 872 -6341 3194 4807 7048 8849 27710 22117 34959 51759 1285 -27139 -35355
11353 -35355 -18863 -15416 -25526 -25550 -21928 -7159 20531 34414 28667 21831 18786 4389 8135
11340 8135 22638 43747 61838 65026 46683 50473 71495 92292 128471 166396 243565 393379
11328 393379 660556 931506 916606 729444 475822 301342 195381 142091 111489 88443
11318 88443 63070 49699 50655 53617 64237 54212 35237 40186 47738 40843 29606 36845 9561
11305 9561 -17708 3049 44777 47746 41043 42530 42897 51031 49814 48385 42843 21550 1359 -2987
11291 -2987 20037 28294 60443 65166 51517 43051 36851 22117 7290 35118 56221 38929 27721
11278 27721 23755 22898 44770 39101 35269 22538 6375 10855 8722 16951 32786 42013 47268 23741
11264 23741 9033 -16135 -44441 -49383 -29259 -9135 4632 4419 -1050 -16377 -7622 -2671 13471
11251 13471 4750 -4802 -20332 -25354 9271 16491 7232 26896 41084 38890 56877 31306 -14757
11238 -14757 -24168 -18330 -19567 -3913 26716 29334 38686 28329 25573 21649 21504 10665 -16967
11225 -16967 -54258 -55581 -28739 -14793 -16390 -24807 -17186 -8548 -18725 -23986 -12753 -14037 -4989
11212 -4989 -11203 -8737 -3457 15958 8976 -6936 -10060 2817 -1038 -7725 -2305 5375 6882 -1365
11198 -1365 -34174 -20684 19777 28028 20887 -12370 -24318 -7174 -209 5427 2363 -3225 -3102
11185 -3102 -10623 -4792 9176 25898 9892 -1734 -9730 -7832 19069 16207 16097 34678 42718
11172 42718 30352 28846 26881 23000 10624 -954 20461 10415 -14886 -7714 3235 4630 -5616
11159 -5616 -29143 -30956 -14866 4246 25227 20211 -5446 -21106 -12873 -195 7901 39737 35421
11146 35421 41804 50388 29805 28775 40905 16458 15804 11900 8062 4695 241 -4217 -7153 -7622
11132 -7622 -25046 -33321 -5200 22917 21532 -5643 -488 27684 34026 24990 2844 -10711 -4550
11119 -4550 21353 36326 43183 25328 6713 -11739 -9300 691 -17205 -26005 -801 5089 -5537
11106 -5537 1772 31730 47908 40927 33178 55061 62727 33141 -19412 -13297 330 -8699 -6695
11093 -6695 -6136 7070 5027 14727 11377 -2992 -16720 -34417 -24954 -26322 -7406 19350 1573
11080 1573 -25755 -14613 7067 32555 11532 -21243 -31428 -25115 -2365 9691 33949 33513
11068 33513 27783 17607 -13883 -17656 -11982 -14894 7638 6094 -8695 -13926 -1884 -9765 20587
11055 20587 28044 23882 33656 12195 -18903 -18276 504 5456 -7824 3719 24041 9256 7501
11042 7501 19279 28496 -2736 -19084 -19472 -25941 -33238 -7942 -7429 -1428 -8982 -15931 -6457 -19317
11028 -19317 -27623 -10260 -5435 10918 3879 3221 19796 21364 23979 20648 19693 23708 9356 -7264
11014 -7264 -13590 -1884 15269 8776 -2522 -16491 -35847 -22134 -16254 -33890 -28008 -8825 -6205
11001 -6205 2261 -427 -5893 7052 -4343 -613 6225 2910 -5909 3701 2342 13993 20359 30201
10987 30201 13664 11181 22200 12654 12486 12462 -13201 11135 46461 40915 17871 -3528 5580
10974 5580 30257 33503 25811 17767 35761 34507 18490 10047 5151 -1024 -10189 -6319 9555 3885
10960 3885 -4344 866 -15112 -30293 -22486 -14128 -17603 -23308 -27263 -3010 -1699 -7837 5233 1684
10946 1684 6853 1527 -9088 -15494 -7860 274 26532 29045 60807 67721 65218 51455 52795 30996
10932 30996 -4660 -4533 8070 23569 22960 39136 54557 64327 45020 50093 38796 63587 64976
10919 64976 58056 64092 68975 46174 38931 23197 8554 -1764 10391 8692 -15117 456 1423
10906 1423 -1075 -5075 11135 22560 30177 42350 65907 75960 94694 107479 102009 69089 57396
10893 57396 55782 38560 18133 37917 22211 10827 756 -156 24820 18055 23782 40696 50400
10880 50400 46761 55816 103436 99651 83768 77589 83122 68553 59764 83742 72708 39829 67570
10867 67570 98333 103580 106371 94077 82011 66118 57534 75320 90099 110661 124882 135414
10855 135414 126732 156332 178770 215276 283432 375152 533739 729132 1001680 1238918 1397953
10844 1397953 1562389 1839024 2017405 1938184 1750171 1571755 1454156 1240104 971474 698005
10834 698005 509643 400413 296152 237050 174586 140672 166572 181467 174712 136348 113520
10823 113520 96344 91779 88410 77842 92329 86345 94412 84272 64488 39242 46825 12491
10811 12491 -14058 -11114 -2673 21567 41604 48361 61936 63205 52566 33636 22368 26876 32203
10798 32203 41531 30062 24781 43822 49943 46615 20559 7804 14935 11816 13941 12954 14902 25899
10784 25899 40541 50758 83088 95725 82172 59979 45421 39331 69156 81393 87705 74490
10772 74490 52421 40420 56992 53439 35176 28028 30876 23176 24248 38684 59647 35156 35379
10759 35379 44324 54546 67793 82330 77786 105073 125293 136966 102372 70869 43880 24619
10747 24619 26054 35595 10425 -14238 -33342 -35480 -43525 -73159 -76708 -66449 -47672 -45098 -21986
10734 -21986 -12410 -8080 -28025 -58131 -48191 -35647 -32903 -43012 -44054 -58693 -46662 -13380 -3687
10721 -3687 -20735 -25739 -28542 -13621 5093 7032 21627 28752 52187 54448 72385 85279 75352
10708 75352 72968 69040 74606 73146 71085 76423 79920 92026 93368 93710 116682 128017 142231 152974
10694 152974 133192 118212 123432 148888 133035 107318 100070 105479 98460 66887 67890 97547
10682 97547 128735 140260 121685 127696 132936 117273 118044 115840 124502 121285 117557 103236 100612
10669 100612 69801 53857 55954 38741 61622 94739 97536 64196 34689 25919 44956 45901
10657 45901 17373 17864 32865 46578 58039 77283 67890 81926 124295 130343 71794 63981 65947
10644 65947 75056 55032 41612 54749 83123 83548 63754 69319 91117 78834 58081 73124
10632 73124 76688 66050 35873 7458 9191 29601 63218 48606 25982 12684 961 -19821
10620 -19821 -43875 -49437 -58848 -74845 -55710 -28004 6435 10895 9982 8082 15053 20067 11852
10607 11852 7102 -1293 26984 57183 80956 89453 85940 91755 87307 67995 45236 40681 54962
10594 54962 45114 37791 45982 29415 31413 30961 40561 58521 58605 68199 65091 78312 98274 118123
10580 118123 126082 168024 190874 211223 263469 308315 314052 301167 293193 327132 373819 356612
10568 356612 331683 318465 390585 449808 420132 342622 339208 405768 426792 415402 360576 329898
10556 329898 305373 309596 296100 271710 253277 259512 267364 261208 242775 264588 277683 292308
10544 292308 309769 328065 334579 374699 416619 427880 461813 494769 506916 506592 477141 419293
10532 419293 379541 348404 333896 330814 347695 345561 327562 317094 318638 311483 344290 375467
10520 375467 381675 422397 444360 451951 474831 480858 526889 532228 530807 559489 548861 543201 555552
10507 555552 559650 581311 584241 568615 584093 594233 624851 662387 691291 711090 748817 802003
10495 802003 818875 857104 910734 924146 944094 976680 1009774 1011434 1048126 1082414 1116537 1152745
10483 1152745 1226749 1327574 1428968 1500112 1576906 1717058 1850408 1981810 2122617 2255192
10473 2255192 2416092 2605738 2785468 3026531 3329852 3678967 4079152 4625259 5306176
10464 5306176 5953524 6625293 7401508 8407288 9514780 10556387 11529187 12633599 14090878
10455 14090878 15838993 17952925 20443302 23743184 28591903 35650625 45955404 61747354
10447 61747354 87035872 128928591 188097398 232817556 256367486 283693907 334704379
10440 334704379 375827942 364958156 322933613 285192033 264917188 229784276 180879471
10433 180879471 128814053 89106044 64143701 48338822 37873976 30771784 25883195
10426 25883195 22266365 19361670 17069344 15263498 13756581 12476689 11471585 10601409
10418 10601409 9652865 8706633 7909784 7291749 6646077 5955488 5291360 4736051 4312187
10409 4312187 3950361 3630331 3365763 3129665 2928340 2771770 2642478 2548373 2455796 2355159
10399 2355159 2259867 2174385 2107465 2029632 1935161 1827508 1720921 1631770 1566979 1526473 1450128
10388 1450128 1359843 1301642 1233234 1184198 1116277 1077969 1051144 1037334 1003290 999618 1032506
10377 1032506 1072148 1094133 1076376 1067957 1084441 1052819 1009135 951920 909582 851155 769557
10366 769557 721850 680430 628023 593169 596094 606440 595347 581101 569218 566015 568266 557498
10354 557498 566029 565719 538596 523555 531458 516734 506104 494773 476367 462162 485466 515344
10342 515344 493513 469602 421851 411333 438484 424330 415266 412113 415516 400866 390955 389031
10330 389031 396795 410721 445301 479491 466634 452930 478781 492581 478131 461046 439193 447398
10318 447398 457803 445560 417977 384052 365442 377074 403445 406775 357117 295140 312396 360347
10306 360347 393105 399892 411655 459371 495464 531191 617277 748304 949740 1252172 1781246
10295 1781246 2635831 3399216 3577552 3497183 3550478 3760264 3472788 2815573 2023894 1417322
10285 1417322 1061000 814376 644110 541533 494474 451814 405942 367756 350351 332976
10275 332976 305542 322490 321696 308574 275514 284013 315381 326492 321018 290038 282564 287245 298894
10262 298894 311912 290045 272784 295902 305775 275561 258417 237580 243277 243530 227004 213595
10250 213595 186322 165591 136314 139255 130342 107736 99998 84485 87574 104190 102995 116763
10238 116763 123372 133229 133504 98662 69260 75230 88667 119940 109744 91666 92128 100558 117284
10225 117284 126714 130372 131375 146551 155930 143518 125725 104498 111698 102384 108341 128994 137644
10212 137644 134486 139634 124072 113223 132143 155283 152264 150226 141187 135187 156800 178896 198360
10199 198360 202524 215482 200400 191915 201824 197515 176509 174561 152487 129316 107837 118297
10187 118297 138645 197377 256663 295797 322304 292927 280259 285720 305589 316178 269980 228646
10175 228646 192374 185405 152714 139277 147150 135805 114727 92040 88630 109909 90251 97210
10163 97210 132816 144118 130617 123480 135175 136192 111311 101582 107096 102079 109460 129922 129064
10150 129064 133898 133195 136847 128647 126899 155788 168601 180036 183898 178263 171333 149666 153583
10137 153583 167491 167618 141356 92665 63650 51675 88583 74533 49811 16289 20125 34060
10125 34060 43906 16047 4786 21286 16293 6433 14108 14954 20567 13624 26166 57508 55010
10112 55010 37805 46326 70232 64633 48046 10645 -1188 -3066 18528 30078 30936 38088 67420
10099 67420 80839 68303 70474 72385 63158 44627 39186 32909 39524 53526 61653 68947 111923
10086 111923 167558 181417 164859 141161 119528 112062 103267 110317 106736 84756 84055 70900 72164
10073 72164 81758 91188 74973 66140 75351 81296 64602 53629 53808 51925 35573 33670 30356 33581
10059 33581 46270 38335 48324 52035 49928 53996 54902 71008 87780 101504 104873 108324 120802
10046 120802 140749 165411 211642 292486 361744 449419 565124 692193 880915 1150325 1335770
10035 1335770 1454098 1637373 1939512 2089003 1942013 1694449 1538694 1427721 1216089
10026 1216089 940183 665815 482340 346197 254812 212351 194075 186284 148732 106952 85597
10015 85597 84400 102272 100629 75493 50513 33523 11559 -7553 -6085 -997 27352 20608 16769
10002 16769 19979 24390 13102 4693 5599 20762 11325 3433 -11584 -20015 -18402 -10108 2192 3610
9988 3610 11530 16507 -2170 -12180 -18696 -53789 -79513 -94780 -69915 -34786 -12086 12940 3887
9975 3887 -9926 -889 12403 14480 25694 31821 29856 36392 51988 78789 65654 61161 64017
9962 64017 50313 45731 40623 21225 16849 4091 -72 20324 37458 28816 25951 35605 38663
9949 38663 46022 30267 44138 39579 27113 30949 35133 41584 41458 24191 14197 24206 -16640
9936 -16640 -30385 -32071 -25120 -5789 17452 26918 26909 23441 32531 44114 36160 42483 25386 22465
9922 22465 46420 57971 38151 27809 36206 27443 47337 57103 61618 52759 20563 517 2927
9909 2927 3195 10948 30526 27848 22702 45861 62021 51707 55497 59722 28344 20163 30204 27492
9895 27492 10453 20890 30309 38310 27586 14055 26904 58088 86926 86050 82810 119672 122161
9882 122161 94931 66217 57998 40404 39375 23029 4576 31660 23569 7549 15825 20223 15357
9869 15357 14926 27273 55843 74604 64315 53326 74165 61448 50613 38661 33883 25192 9469
9856 9469 18024 61721 68945 59815 56509 36980 51536 91817 104465 109734 164752 267057 395811
9843 395811 574736 799294 919594 863080 676897 462069 308850 230662 186001 160216
9833 160216 120935 69461 87742 102430 86996 53864 46849 39855 24665 27997 42798 57477
9821 57477 77475 52484 57270 43386 25077 31218 21741 33478 45700 57210 43122 31102
9809 31102 33788 40324 31636 24028 58768 70088 70505 67986 57151 46157 33736 45891 34044
9796 34044 4717 -6813 22561 52328 50524 45939 44053 51113 90080 107182 111327 91209 71624
9783 71624 56504 48360 36743 14667 20255 24181 39057 44109 65588 74172 87204 104834 128470
9770 128470 157050 183016 238933 307935 293635 215173 152860 106216 64054 29596 36668 42594
9758 42594 13833 22786 30949 36264 27695 29532 41059 47230 43572 47089 40731 40960 55949 51322
9744 51322 41149 46047 37054 22877 32101 39696 19931 18777 28842 34027 48531 24163 -3753
9731 -3753 21095 26331 17160 22605 15218 17172 43354 48076 43497 23416 2219 -13072 -16628 -1423
9717 -1423 8883 16933 9551 27805 25587 28699 39439 60553 50735 44697 41452 39821 28448 21252
9703 21252 33954 57084 35329 12861 13435 -1928 -794 -11117 1220 10822 14379 30160 41650
9690 41650 41930 29542 15825 23320 56799 68458 66739 56456 38986 46937 52237 62101 61929 61777
9676 61777 40777 35605 34310 9547 5354 6314 14854 21338 33005 40018 17210 24996 32571 27411
9662 27411 -726 12404 39926 67205 88714 98778 92431 74201 69971 61799 69239 65027 48740
9649 48740 49734 41434 37538 59750 51270 38974 30577 10615 27550 43838 36975 37225 35418 41687
9635 41687 33413 17777 23628 4312 -3692 11993 28307 43182 54420 60530 74518 71917 66692
9622 66692 59234 66502 86172 94423 78216 49796 32400 31948 62525 49306 25705 22862 28505
9609 28505 27883 36628 49958 64540 61207 83082 109729 102004 77557 76961 98164 103209 87038
9596 87038 78550 68260 62822 77182 93263 109630 89698 81435 63130 70680 69483 88407 88358
9583 88358 102488 104357 91098 77762 83749 99329 109185 119627 105397 108940 108076 88919 88495
9570 88495 84401 80184 86299 102749 109499 134525 137130 113609 96933 90687 84364 85032 96238 137900
9556 137900 207186 235657 240062 228822 173142 128060 122106 96689 89140 92051 85982 103149 114611
9543 114611 113192 118164 106707 88322 74003 89564 131203 121355 115518 137975 130011 110109 103426
9530 103426 110342 130241 147923 148588 157374 157632 166601 181852 179688 168809 145725 142074 138898 140563
9516 140563 137492 162974 178704 184177 174066 150886 144373 144948 145371 122080 124753 135074 113102
9503 113102 104895 124085 121878 112429 124785 132028 174155 199861 182844 178318 170776 170548 173400
9490 173400 155861 132148 129111 154477 171757 183999 195379 194844 193348 193049 222409 242160 244750
9477 244750 230323 208280 210069 209529 199800 214142 206064 214201 222898 239950 258313 261156 236476
9464 236476 203244 209717 230606 229014 239749 237491 253406 281800 275294 275139 286819 274367 274013
9451 274013 297901 282255 272200 278127 269016 276528 303227 331065 344823 348071 343911 342373 351241
9438 351241 351918 341163 351457 358173 351133 340602 350012 378689 385838 370781 364770 365674 365839 383581
9424 383581 399334 393555 400996 424631 432617 429430 456652 472667 490177 498548 498042 513813 543360
9411 543360 556971 558293 541694 530435 532629 534147 525331 528984 546151 533858 570368 610931 615206
9398 615206 592167 592006 623171 643427 633151 631630 629956 657193 675474 668800 677194 681305 670695
9385 670695 671507 698954 712657 722293 707376 718520 731661 728498 744174 741993 752668 772427 773517
9372 773517 790508 770604 781368 765118 765183 756172 757591 778282 767748 736546 752140 774520 758514
9359 758514 756698 749647 732544 728996 733224 730025 728738 725024 695929 702266 702780 704812 696938 659942
9345 659942 651284 678342 689286 685987 668672 656702 660172 658684 665908 648934 622459 612727 587062
9332 587062 562231 558593 574426 577607 564396 541741 533589 528410 532215 514135 494801 486502 482856
9319 482856 502857 492007 490577 491711 497936 496183 471069 468285 444548 432793 400007 407447 413306
9306 413306 379922 368246 361139 336196 323572 328707 338600 326239 318835 325099 328309 311810 319901
9293 319901 334013 327252 302475 287074 286876 315632 306478 288735 296207 297366 287337 277884 278412
9280 278412 278199 264610 240748 226432 226747 222254 215028 234743 220912 197621 196885 191003 175382
9267 175382 187614 182839 182834 196773 197214 202643 198424 190026 186630 200460 212429 198087 176379 156570
9253 156570 160262 168254 191096 203586 189289 187459 151947 151543 158352 144977 128257 122888 98115
9240 98115 106969 138557 155071 166664 144619 137830 155620 154286 153876 159896 159632 137528 116443
9227 116443 137228 134129 121862 131157 120314 136602 117052 91318 83049 82431 65959 62539 97678
9214 97678 108263 94524 79783 84832 103976 99285 82331 109879 118272 127352 134731 138921 116345
9201 116345 102478 113231 116729 114574 109240 104003 99785 71638 65786 87533 85332 83543 90817
9188 90817 82708 81594 96618 115976 105476 89722 75011 73660 84565 55683 55229 61148 43063
9175 43063 55255 75885 83562 77255 70095 67519 77279 91624 95587 75850 49561 60513 72278
9162 72278 79728 79115 76089 44964 29379 41940 50015 41624 52911 59130 58199 53801 41647 62473
9148 62473 81893 73798 59226 48473 41161 43025 41375 39861 29192 38437 42398 45274 38294 42497
9134 42497 43058 35368 26400 46311 73695 76689 56463 67588 58008 51889 48991 54791 53817 39863
9120 39863 34571 19416 40870 58839 86847 88560 63223 49311 41477 6170 11501 26361 11522
9107 11522 25419 30413 18526 -178 9638 26200 43277 35116 23665 26016 15044 14189 21870
9094 21870 18112 33036 48503 47484 34163 28316 31526 58860 50095 23003 26339 46509 58103
9081 58103 63719 58717 28142 -5392 2617 6232 14250 8117 3372 2544 -6952 -12220 1266 37345
9067 37345 76593 79572 34250 18878 30755 23998 2395 9392 16725 20805 32311 39936 52344
9054 52344 59636 34736 36533 42648 58887 68544 47979 32096 30182 42830 47689 57088 24905
9041 24905 31618 33734 28255 25026 40497 37191 5435 1530 -7500 15250 51210 40323 40736 51903
9027 51903 66860 66721 49324 65881 71041 62196 76867 88017 97336 112498 137695 153610 213007
9014 213007 301878 410391 529936 643654 701780 615206 470070 354587 269665 217368 195082
9003 195082 187937 205758 209880 238697 206044 145849 107578 100297 93045 82180 77240 68899 57261
8990 57261 83257 111047 130746 155289 173355 176115 224847 267091 267633 250297 201513 126311
8978 126311 110666 102072 69885 68108 62751 63123 97197 96186 78610 68748 39792 31291 21316
8965 21316 21090 16704 22692 2399 2110 30511 49329 43194 18039 -4788 -16434 -13349 -10814 -12316
8951 -12316 12525 2093 2624 23357 11228 25865 42641 45758 43425 20516 14378 6468 17660
8938 17660 26575 46669 74654 92231 74317 81895 111259 141052 200905 268834 333371 367147
8926 367147 357562 305529 229980 167947 136487 121473 104997 94081 95745 103737 105528 78930
8914 78930 43011 22668 1266 28714 51102 45630 55802 68563 64096 49944 25296 -4702
8902 -4702 -7045 29255 61537 65208 73723 55020 31391 35868 39296 24528 22424 36774 10303
8889 10303 -3815 7458 13052 14866 14733 -6276 -12643 -13760 -3710 -840 12305 -9864 3993
8876 3993 16564 -2770 -8216 18730 20858 14286 265 7673 11963 -6478 -21088 -14974 4364
8863 4364 33867 25793 9088 -1536 3806 28030 53061 70747 77691 43524 28184 25468 37153
8850 37153 47431 37254 18319 9099 20632 2357 -6304 -653 194 -13103 -28788 -9453 18039
8837 18039 15160 -7231 9890 27189 37818 37084 56578 57757 52374 46788 42651 42271 36832 37891
8823 37891 13512 -2049 6381 25690 29118 17767 7437 -13993 -21480 2716 49187 56215 13404
8810 13404 -9960 -19651 -7801 2822 8156 -6375 10104 19310 19552 9922 10626 17611 9709 5462
8796 5462 21102 24174 14205 11826 18907 34599 29137 14350 -2526 -19761 -28546 -24596 6405
8783 6405 23282 2995 -9094 9173 21794 12439 8650 1171 7702 14889 45729 54750 63161
8770 63161 43385 46783 25569 4095 6135 2256 -16895 -28800 -17395 -14758 -13273 -4027 14234
8757 14234 23209 5861 -9483 -46837 -50298 -23509 -6472 18805 24447 12344 16274 22414 24963
8744 24963 20729 47368 45757 46289 48325 41025 45852 40066 30983 27476 8089 1302 8590 13024
8730 13024 14344 31847 54307 73474 79731 76354 80452 63293 56598 53688 35735 47303 45753
8717 45753 45853 59260 53696 35567 39310 5854 -18474 -11416 7414 20091 23754 25240 18779
8704 18779 8157 9755 20284 28188 41701 40744 28132 21268 27525 7686 23939 22877 2848
8691 2848 -5665 -11231 1405 19386 24866 20955 25574 10437 -1992 1113 7679 41830 52974
8678 52974 41668 14128 10810 23177 23592 9568 -7990 -6735 10508 26128 51893 35967 30524
8665 30524 35520 47065 48622 33118 35071 37486 20033 10393 7866 23703 9797 20120 38048
8652 38048 51929 36227 33272 41036 31542 30011 24863 39735 61494 91924 128015 195124 261681
8639 261681 279606 235640 195307 175882 145690 148749 130703 106869 104977 89890 72497 85344
8627 85344 63912 30772 21242 26536 34160 26401 48560 50168 31085 12041 11597 23056 2911
8614 2911 -9644 13813 34600 55063 57871 55082 67691 81428 75037 76018 64686 76637 92327
8601 92327 113843 115503 150075 210906 269026 378701 516344 538172 472441 379564 318779 285305
8589 285305 282132 280203 287576 309921 308848 222803 142209 126676 122860 104722 85243 98995 86461
8576 86461 64938 54756 86017 91003 74781 38960 15114 15612 13015 44982 48035 28328 33152
8563 33152 39448 33507 26594 24412 45465 44493 58973 69358 94928 129057 130329 125120 165789
8550 165789 201536 217288 204896 148105 99322 59024 24282 28923 39473 26469 48381 77933
8538 77933 70231 65461 57874 52289 50659 43428 33055 33817 26093 4072 8564 27641 26346 29944
8524 29944 7746 9606 24731 28770 41554 33667 -2384 -229 13480 -4788 -16243 16351 8098
8511 8098 -902 13047 23273 25250 -376 11632 28496 10301 -19124 -8157 14499 -6882
8499 -6882 -11512 6879 23138 50884 30620 35184 26838 -3489 -25572 -4702 29759 37231 33640
8486 33640 27582 20485 25970 19053 1667 9693 12591 18858 31771 26828 23697 21624 22932 19756
8472 19756 17624 10408 12041 12633 -8835 -20554 -17162 -11650 -11683 -13142 522 -7726 -33385 -20420
8458 -20420 -20587 -15115 -18024 -17012 1309 22760 13732 -9305 -12955 -5609 11035 19609 23947 2297
8444 2297 10116 33796 29071 21940 28595 33192 27681 16113 13758 -13864 -45535 -62945 -65142 -35230
8430 -35230 -25000 -27289 -6773 -11353 14206 31908 38255 29029 25463 4582 21363 44258 39048
8417 39048 7311 -16589 -27605 6744 11085 11168 12767 456 593 11993 25029 18291 38115
8404 38115 26351 18626 43553 26320 2711 4531 26550 9514 2620 4152 8457 9786 6186
8391 6186 9205 11050 -21183 -8753 3330 5908 -20882 -22140 -17541 -10651 9475 27178 27538 6234
8377 6234 4427 10927 21286 15207 -6532 2908 25392 36291 33118 7877 18883 44546 50187
8364 50187 47823 54215 67819 70277 56254 18028 6517 4890 19087 5590 -10327 -9889 -23567
8351 -23567 -3806 -13128 -10590 -3821 4276 6455 11179 22411 17397 27235 31768 24108 3280 9282
8337 9282 8914 5657 1185 14392 13155 -14552 -40466 -36095 -14771 -4798 -11497 -865 27919 45061
8323 45061 37905 34838 26655 536 -7836 36936 56400 31603 8488 5159 -10008 -19390 -12829
8310 -12829 -7528 -16032 -15551 -496 1402 -4505 14438 7220 -15021 -18782 -44381 -44309 -32935 -26989
8296 -26989 -23712 6477 25965 13056 6538 -8436 -2525 21146 10963 1656 -12836 -19488 -15404
8283 -15404 -2223 -5835 -7386 -14698 -26523 -7377 5405 14377 8655 -4312 -9297 -12308 -8984
8270 -8984 -25160 -19994 -17791 -10081 -5276 -14254 -25059 -20061 -22699 -30150 -37622 -5037 2168 10725
8256 10725 -6880 -8461 3718 28183 40331 44453 42830 45705 28778 6748 -740 19741 33050
8243 33050 42084 58606 39666 -2174 -2499 5393 1501 -16233 -33117 -33822 -11252 -4480 -7744 -3929
8229 -3929 17054 25343 16727 -1427 1671 -1492 -3675 -10477 1178 30454 30130 7387 -12487 -29435
8215 -29435 -15852 -5949 -23291 -32555 -28892 -9733 -9829 887 10178 4345 531 -1279 -5296 14909
8201 14909 4448 -30148 -34696 -28277 -17889 5086 9029 21414 25968 11723 18441 19681 2604
8188 2604 -7732 10515 698 1898 6413 17503 8098 4840 3212 22681 47454 66240 47674
8175 47674 26879 3466 -11835 -7189 -19658 -33002 -20957 14890 17096 -5419 -6082 -7496 2100
8162 2100 26504 18244 5595 209 26318 35618 24202 11360 8466 39062 24478 14082 2065
8149 2065 -28620 -18145 -12489 -328 14764 17559 9183 -32206 -27251 2635 17750 16456 5411
8136 5411 1626 11565 7190 -2340 -10038 -2372 9454 14225 10005 -1213 -21427 -18698 -14426 -11757
8122 -11757 -2241 -30823 -25010 -3291 3284 1462 -10112 -30979 -5918 24702 40558 20848 -2695
8109 -2695 9789 12170 20375 40254 57727 29384 14132 -7939 -14479 5784 34283 19150 -9974
8096 -9974 -34028 -41800 -35216 -359 18530 18052 6646 -7298 -1950 11257 12646 10266 -12872
8083 -12872 -8409 -3891 34911 71742 72556 59646 56825 39311 27169 18796 20086 3591 -5138
8070 -5138 -8316 -5626 3156 9461 13291 9023 -2267 1085 24254 31115 21750 6171 9763 20050
8056 20050 22835 7413 -3143 2907 -2683 6476 27149 41492 40569 36574 34057 27036 16977 35837
8042 35837 47653 31325 3401 1279 22880 47801 40352 21169 36278 40216 19697 21137 30344
8029 30344 32749 29534 39648 32993 12926 9261 15193 20162 45664 69454 37549 30706 45142
8016 45142 42078 29624 36091 71612 85084 80068 38875 6501 -5000 8451 21836 13990 10212
8003 10212 4411 14042 -10752 -18639 -6033 -15235 -1461 2122 6372 18523 11098 759 -22157
7990 -22157 -4523 22203 32926 10332 -5816 -12218 8017 26618 25692 7470 2073 9195 16179
7977 16179 26442 26638 24024 43071 48916 37381 46153 67164 58363 29692 4963 10509 12482
7964 12482 21543 20232 25935 63523 78861 68315 44120 34768 31820 28981 18711 41264 62405
7951 62405 79242 64182 47712 42478 33992 26314 21474 35663 38533 35467 15049 25435 33343
7938 33343 22945 14422 1807 2517 8320 15999 6594 6984 -9636 -20851 -1794 23385 14741 27236
7924 27236 37366 43350 35017 10675 16243 13158 9518 22414 36104 11305 -13852 -29345 -5324
7911 -5324 18233 7898 18114 5584 8854 19578 22628 17098 35144 39429 29770 16093 12308
7898 12308 7467 14138 12463 -1534 9603 6437 9824 14832 27182 45790 42856 38656 43093 25935
7884 25935 6292 6757 21449 48319 58703 54463 35961 33007 18872 15843 11367 -4013 1588
7871 1588 15860 27745 38136 38918 12614 36311 41925 14980 -634 10529 -9412 -12918 -17981
7858 -17981 -27714 -21739 -6831 -1962 11748 13978 37294 21541 13771 4408 -5206 -15280 7947
7845 7947 1237 -4893 -6200 -1565 -10029 -31056 -54241 -57731 -37608 -26471 -13218 13263 20411
7832 20411 -20678 -55466 -40404 -44122 -27109 -20602 -1339 20491 16689 11478 1821 -28209 -42891
7819 -42891 -41768 -48309 -46854 -36134 -40468 -25942 23536 49933 9988 -11793 -3158 714 -335
7806 -335 7074 -3861 -299 -6346 -10652 6145 25827 17021 -13367 -24767 1139 1133 4787 6271
7792 6271 3824 1748 -22662 -31589 2598 -159 -25327 -48165 -48532 -52022 -41016 -33667 -27545 -361
7778 -361 -9107 -16140 7127 12416 6159 989 -1415 -713 -12945 -30346 -25467 -22961 -1549 -5117
7764 -5117 -19975 -43638 -65205 -63299 -51662 -38941 -43047 -41157 -20952 -19350 -12669 2810 12407
7751 12407 11342 12626 9535 9480 -15350 -23953 -23161 -18150 -15727 -14114 -5042 943 -15227 -43033 -42752
7736 -42752 -38234 -47264 1383 26790 13356 -842 3530 -13428 -30402 -38237 7902 38571 33225
7723 33225 13366 14972 16780 8522 16771 15569 15170 18642 9592 6154 7475 -609 -16289 -12829
7709 -12829 9443 19848 15764 7188 -9030 -21447 -9586 15185 30292 13701 -7965 -25256
7697 -25256 -10655 -655 7883 9200 -1190 -22823 -11866 -7763 -16088 -17689 -31764 -42103 -43382
7684 -43382 -40911 -42013 -21421 -33502 -50686 -28538 -20524 -28664 -33109 -23774 -12525 -7715 -3075
7671 -3075 -8814 -8578 -12315 -17688 -20435 3118 2975 -13533 -29724 -29414 -28622 -30474 -29980 -30528 -18484
7656 -18484 -16392 -15888 -24512 -22462 -8751 24156 2020 -20012 -21948 -13498 -14652 -16703 -2801 -1371
7642 -1371 -10228 -4370 -24330 -29658 -7861 3476 2472 6667 5937 -13218 -44803 -20523 -15690 -4690
7628 -4690 7802 20745 1332 -34311 -48681 -56198 -43951 863 17850 25184 6417 -4751
7616 -4751 15362 30273 23952 5079 15230 12531 2270 3006 -6579 -7725 -30935 -27199 -13087
7603 -13087 -23643 -12868 -15197 -37855 -54930 -57153 -37057 -13559 -11575 5345 15853 3721
7591 3721 -21020 -18994 -6586 -10830 -25606 -12084 2065 9318 5181 5857 5485 11046 -1571 -6283
7577 -6283 4013 -2896 -881 5753 -315 -2828 -8858 -8947 34359 54588 30974 24160 14505 -7895
7563 -7895 -11677 -8765 -15281 11396 34398 52122 43076 39549 44875 40283 29850 5474 -317 7069
7549 7069 3160 -9416 15946 62997 40272 1674 -16466 -4242 -9091 2951 6639 -8884 600
7536 600 19850 7354 -17277 -21077 -26912 -13625 -14561 -33903 -32382 -28632 -14374 -5351 -5483 2184
7522 2184 9871 26149 37529 34833 15756 -18887 -6177 5627 6951 8398 -8376 11781 7366
7509 7366 1625 27177 31164 8530 -380 -15767 -30712 -26978 -41465 -46225 -18047 10715 25671
7496 25671 -31 -21851 -38834 -40447 -50369 -41175 -21841 -9586 -26702 -40334 -27053 -21838 -25364
7483 -25364 -23504 -14249 -33825 -37427 -21052 2714 -1675 97 7839 22087 33768 31274 21006
7470 21006 5870 9220 -655 9112 -4703 -5801 -18374 -18893 933 5214 5464 11508 -6168 -10192
7456 -10192 21147 14014 17173 15430 -9755 -27618 -9986 10979 17155 -1789 21916 38748 3987
7443 3987 -7936 -3316 3585 -4042 -7083 13493 20637 -131 12979 3317 12229 24249 15738 -4348
7429 -4348 -7915 -18898 -7526 -3913 13427 23544 17700 15832 6211 3006 1052 -14860 -15986 -22245
7415 -22245 -5490 -18820 -26565 -37608 -45778 -63633 -64697 -46728 -42561 -20802 -5884 31923 22335
7402 22335 -4609 -20241 -27229 -3400 -5152 -10613 -22907 -11031 5153 22694 11881 3931 5391
7389 5391 11715 19459 13132 1158 -6022 30593 50345 50218 21227 8668 -1274 -27049 -38106
7376 -38106 -31011 3408 6534 8252 19572 672 -20425 -18286 -14850 -637 13669 21632 28520
7363 28520 23899 2133 -21542 -18642 -36028 -33457 -22533 -17375 -3721 -9339 -980 -13345 -22328
7350 -22328 -41246 -53974 -48273 -27432 -15919 -7735 797 8489 10250 -14700 -20583 -10792 4706
7337 4706 12178 6598 -10162 -7295 -3004 -28988 -19944 -29389 -38674 -20419 4430 12166 -15987 -25185
7323 -25185 -11274 3391 11876 19460 248 -12262 -13666 -39338 -55096 -54755 -54089 -29179 -16788
7310 -16788 -28763 -25620 -12069 -8776 -15617 13127 26774 21459 15202 -3047 -20940 -43407 -29973
7297 -29973 -12107 -17181 -32385 -21693 -22889 -58193 -73876 -52285 -49766 -25145 -16028 8695 10127
7284 10127 -6150 -5036 -41228 -53239 -55947 -43368 -34295 -8155 -11454 7389 45473 46390 41090
7271 41090 25653 7866 10896 -4516 -5347 2673 -4504 -7419 -6787 -22870 -32106 -28694 -3777 -24241
7257 -24241 -1858 10038 -6653 -23803 -27488 -16825 -31834 -53449 -54985 -38342 -43237 -55169
7245 -55169 -58657 -48164 -31715 -36801 -38075 -9132 11753 8536 4264 -5310 -32531 -55206 -49302
7232 -49302 -42849 -26622 -4567 -13870 -32861 -18892 -6515 -16985 -11460 -1248 -23160 -31097 -17693
7219 -17693 -17271 -13673 -32260 -34102 -24432 -6311 -17088 -44896 -46483 -29427 4277 36930 35913
7206 35913 25448 33516 35165 14774 -1667 -6730 -11005 4058 3378 1131 -13779 -10798 -7444 -4547
7192 -4547 -14959 -10892 24258 37648 14534 14755 30260 4756 -24969 -55549 -52309 -33739 -36695
7179 -36695 -38844 -29194 -16290 -27672 -15555 -29225 -34644 -33509 -22247 5238 -826 3520 16639
7166 16639 4427 -8950 -10209 -18861 -48682 -35083 -40576 -43345 -29721 -39885 -45026 -24537 -26911
7153 -26911 -31219 -64794 -69825 -59751 -54016 -26698 -37975 -57179 -62070 -35672 -31181 -46322 -35811
7140 -35811 -15821 -19699 1381 -1643 112 14948 5232 -4647 1127 -1305 -10537 -28351 -35141 -38336
7126 -38336 -22635 -11251 -5534 6493 27793 10884 -7009 -11925 -16895 -21618 -22949 -5116 -5691
7113 -5691 172 -4932 -3149 -14265 -15881 -18963 -22413 -15515 -8781 -11220 -18002 -29163 -13816 5107
7099 5107 3901 -997 -5567 -5581 9054 32764 17125 14456 6761 7328 -6098 -28629 -8199 7076
7085 7076 11212 -844 -13841 -17378 -3110 2325 14154 7297 -24447 -27754 -18351 4655 21721
7072 21721 2924 -27079 -23048 2953 4464 729 -540 -27571 -30828 -9111 16704 13504 3419
7059 3419 -4212 -17902 -49932 -52504 -44660 -30470 -28534 -21241 -10503 2959 9201 -6081 -29764
7046 -29764 -28986 -7134 8850 4142 -14483 -16744 4720 30053 26527 6741 -14238 -12228 -11784
7033 -11784 7337 14510 20432 -7763 -22516 -36760 -67610 -63380 -46853 -31678 -27908 -26529 -19345
7020 -19345 -9827 20440 40229 34060 23435 26321 27171 24455 39708 28482 23118 5876 -10962
7007 -10962 -19233 -24092 -35391 -34193 -28805 -16864 -18740 -9302 9991 10868 8360 947 -1913 -8284
6993 -8284 10196 24279 32034 15449 -16123 -3699 2605 8539 -6841 -33006 5128 27120 9393
6980 9393 -29436 -54342 -38555 -22392 8284 17575 -11269 -18696 -4268 8962 2136 8702 -7574
6967 -7574 -21019 -19805 -14813 6185 26740 38232 12078 -10368 5808 6591 10634 -289 2637
6954 2637 18276 12657 -7130 -159 10178 18314 -2692 -19436 -35092 -53664 -39492 -11427 14232
6941 14232 13578 31378 28207 12987 -13705 -5402 -8698 7069 23321 20224 4628 13612 13139 2382
6927 2382 -18312 -39231 -36314 -36824 -41756 -44535 -40409 -16671 -26176 -19850 5649 11555 12007 10943
6913 10943 17925 29684 28172 22762 17569 1688 6393 10241 17817 19568 14548 12582 3755 -21842
6899 -21842 -44409 -44612 -46399 -55426 -84295 -62045 -38965 -31408 -42569 -42556 -29695 -23373 -20677 -12358
6885 -12358 -5754 -9307 -5379 1220 3066 21132 22415 4864 -11803 -11177 -1826 14784 15972 21291
6871 21291 3391 -9678 15042 7012 6633 -23291 -25438 -2105 -7068 -35837 -25666 -24317 -32368
6858 -32368 -15102 -12746 -2964 0 8184 16354 10104 5069 -8829 -6715 -12867 3972 2570 -17070
6844 -17070 -21275 -27967 -15063 -10529 -18867 -36458 -31187 -22663 -16071 -4577 -9185 8567 7908 -5049
6830 -5049 10270 -395 -8195 -5061 -3988 -16927 -9908 -5125 -10546 1010 12752 17688 14315 -15866
6816 -15866 -24559 -11053 1252 -2335 10275 11176 -7195 -5835 -9186 -5494 12505 -681 -22323
6803 -22323 -25338 -2108 5537 -4163 -7210 2873 7634 -9831 -22551 -57669 -45071 -32764 -33704
6790 -33704 -53117 -49918 -27804 -27187 -7958 3981 3208 5845 15354 22371 27581 12987 6677 21756
6776 21756 19172 13243 8014 11673 -14724 -35756 -35743 -29070 11466 2430 -14220 -40764 -35154 -20149
6762 -20149 -36006 -32660 -32513 -27227 -20989 -43196 -35554 -10315 13775 19469 20528 -6225 -15818 -27357
6748 -27357 -38286 -3602 -2469 -20848 -25720 -28340 -8971 -24638 -28949 -19510 -8887 -15947 -23618
6735 -23618 -23609 -11782 -8529 -1178 1104 -4055 4129 1844 -8204 -21031 -11377 -2305 -22610 -31812
6721 -31812 -12304 -19495 -21873 -390 5142 6023 -156 -12956 -29882 -47157 -52192 -42202 -27785
6708 -27785 -9666 -2965 10748 -888 -25830 -44018 -65413 -70558 -72812 -53855 -46832 -39053 -4850
6695 -4850 33111 27479 20592 24175 31065 14277 -1141 -1188 -7015 2849 6563 721 110 -13642 -32665
6680 -32665 -48740 -39232 -43901 -46547 -40940 -37824 -20043 985 9281 -22461 -35686 -32875 -36189
6667 -36189 -14053 -2560 -3374 1407 4134 -2875 -1034 9819 3298 -18702 -26419 -22821 -13751 -335
6653 -335 -11747 -15540 -18627 -17110 -23961 -24014 -19855 -33514 -61913 -52389 -20312 -7287 -8608 -17925
6639 -17925 -19380 -13947 -5253 5237 -3813 5498 -9824 -15281 1610 8336 -9256 -27340 -15214
6626 -15214 -1731 24441 18382 26985 40843 32498 29495 17681 22868 29516 33719 22845 17251
6613 17251 2521 31557 28537 8884 -1379 -6437 -12028 -32175 -33769 -24518 -4949 13605 29320
6600 29320 18210 -6062 -12526 -7122 924 -5566 308 -2023 -30803 -45475 -30026 -12560 -6180
6587 -6180 -552 794 -9515 -15348 -29094 -36352 -32074 -13461 -14854 -31221 -23779 -23198 -33820 -26733
6573 -26733 -4506 -4898 -15368 -10765 -13818 -22779 -32245 -28173 -20864 -6504 -891 -12497 -1802 4232
6559 4232 2510 -778 8859 5033 -3728 8561 -21056 -44834 -15454 2423 -7951 -18123 -25573
6546 -25573 -21299 -10756 -15012 -27082 -21890 -32131 -24833 -31612 -25200 -19097 -22902 -22184 -15369 -20197
6532 -20197 -23802 -24002 -20932 -29945 -27469 -28260 -14540 -1967 -20361 -38596 -30501 -18617 3051 8622
6518 8622 -8945 -4226 -21656 -22656 -3666 4230 20944 22186 20697 14154 7686 -3247 -18294
6505 -18294 -20682 -35147 -38607 -24129 -32964 -41886 -29889 -10648 -23610 -6979 -803 -9691 -34382
6492 -34382 -44126 -27896 -15012 -1409 -24381 -28731 -32546 -31314 -33328 -45004 -64357 -65343 -48856
6479 -48856 -26757 -14661 3780 -13116 -33108 -23012 9524 9270 -3393 -8576 -17855 -5041 10818
6466 10818 13775 30892 38950 33299 19788 -25141 -40446 -14906 -9183 1663 12973 715 -2410
6453 -2410 -7999 -9854 4220 26507 -1796 -30149 -27507 -19429 -34876 -27168 -22343 -21295 -26309 -63873
6439 -63873 -61868 -42187 -12384 -24569 -32819 -21395 -14687 -16747 -8309 -9189 -14900 -26170 -13503
6426 -13503 6072 992 17674 19596 -6101 -34140 -34371 -8078 460 -9033 -7363 -3252 2268 -12335
6412 -12335 -29404 -41722 -24972 -18151 -1745 1753 -23855 -15326 -7353 -15921 -26866 -17951 -709
6399 -709 -19220 -17389 -23474 -23088 -8700 -6794 -12000 -24204 -10316 -8112 -9891 -4136 -3005 -24367
6385 -24367 -22901 -8945 -8199 -12425 -22699 -29176 -15554 -14964 -15921 -19083 -41229 -57399 -47753 -65091
6371 -65091 -72102 -62843 -60750 -55783 -28776 -11051 -16592 -35903 -31624 -31249 -17191 -3120 -13157
6358 -13157 -26330 -12460 6164 -10928 -20206 -20441 -10969 5105 -917 -3705 -4708 3480 -15507
6345 -15507 -8522 535 -14201 -19016 -6486 -13391 -14136 472 11514 7481 -36891 -54316 -17280
6332 -17280 -5888 -14318 -12803 -15768 -40879 -38863 -47166 -61171 -45125 -35074 -40523 -47489 -47150 -21437
6318 -21437 -5611 26637 26521 3632 -15181 -53521 -55414 -25034 -12593 -22487 -37634 -28543 -26038
6305 -26038 -23583 -15861 -1554 -15764 -39502 -48155 -50400 -26952 4701 6277 14712 29967 31691
6292 31691 16228 19789 29548 34744 11017 -23560 -40982 -36086 -35470 -23006 -35385 -53995 -50335
6279 -50335 -31150 -409 11717 -2925 -32682 -35586 -12946 -11858 -23686 -19945 -18988 -1134 33191
6266 33191 34307 16014 19185 17843 5676 -2404 -10410 13136 42466 70016 76837 66008 54890
6253 54890 35239 28325 8931 11165 4541 -22915 -36858 -3587 -1153 -18687 -35391 -37971 -43787
6240 -43787 -48241 -8978 16681 17814 13756 -33594 -52364 -7414 -1703 -1590 -9992 -8000 1982 38426
6226 38426 58967 51163 47738 28286 18726 -147 -10382 -15688 -16235 -11871 -27575 -17782 4395
6213 4395 -6822 -20949 -22583 -33010 -29979 -35714 -38022 -48646 -37682 -5590 -3506 -10139 -24930
6200 -24930 -39734 -53243 -53280 -40609 -46446 -35485 4754 13918 5187 8669 1858 -18160 -26886 -34565
6186 -34565 -25661 -51257 -50608 -31534 -21041 -24907 -44899 -28743 -5864 -13850 -6905 -14985 -14290 4923
6172 4923 -3988 -29788 -44493 -53734 -48747 -49496 -23499 -26829 -44909 -57735 -74466 -75975 -47974
6159 -47974 -32009 -43627 -23453 -14755 -4027 6502 -7506 -7952 -22634 -25370 -37012 -26888 -23443
6146 -23443 -27136 -21236 -21704 -21921 6336 4321 -2108 -1470 -746 -13548 -37136 -36667 -20642 -3520 392
6131 392 -26032 -51730 -36887 -16646 -509 14353 -3961 -32970 -24633 7168 -17401 -30319
6119 -30319 -30502 -34309 -27793 -15980 -17100 -27117 -30276 -39896 -20964 -24291 -10453 -1595 -13013 -12448
6105 -12448 -21907 -27512 -26879 -26964 -22457 -29386 -23798 -9764 1326 -8755 -21492 -26731 -28972 -4876
6091 -4876 26617 35156 12788 -7537 -16083 -20436 -20943 -2227 17123 -3217 -47892 -53925 -50158
6078 -50158 -29360 -26720 -36846 -50989 -57795 -34530 1274 2705 7302 15766 -3210 -16242 -27889
6065 -27889 -16599 -8066 15647 9392 968 4732 1999 -30683 -40986 -18259 -633 -4845 -18961
6052 -18961 -33728 -17396 -13664 -28230 -24893 -11749 -12176 -16790 -17578 -25771 -31298 -35622 -1273 12062
6038 12062 -9535 -35625 -41726 -28131 -29030 -34159 -33050 -13555 -10570 -23928 -28511 3962 6703
6025 6703 17490 16410 5189 -19846 -12443 -22250 -19067 -8103 -10244 -4207 -22185 -22015 -15683 108
6011 108 -1002 1390 22046 10624 13882 -8731 -9684 -2587 -12153 6173 26989 4007 -25722 -27489
5997 -27489 -21773 -28107 -24014 -16615 -19117 -30605 -27398 -22482 -28099 -47450 -42327 4861 21801 1538
5983 1538 -227 4735 -15011 -26186 -1363 17789 29402 19634 22380 43154 46741 22031 -18494
5970 -18494 -20010 -5413 9421 14405 2127 -32192 -31640 -17026 -23834 -19981 -8270 -10597 -16580
5957 -16580 -777 -5599 -9008 -10073 9985 6467 8840 10057 5934 8220 -10770 -15891 -9798 -3447
5943 -3447 -12475 -40910 -42814 -32763 -5570 5922 -8346 -41400 -32643 -45622 -54890 -42670 -23091
5930 -23091 -16537 -11746 5563 24051 17520 25193 62060 57018 40474 8193 -9960 14632 19628
5917 19628 1584 -8491 4048 -1682 -3826 -2500 5061 1842 -7174 -16757 -37399 -15769 1907
5904 1907 -3926 11418 20106 13844 5459 4898 -4417 -253 -421 -26894 -32960 -5315 4745 -2664
5890 -2664 -14161 2118 9398 14214 5377 -5614 1680 17965 14336 4883 -5864 -3329 -3666 11495
5876 11495 28076 43528 35686 9432 -10182 -11315 -20551 -9188 -25798 -23914 -17193 -7060 -5344
5863 -5344 7212 4705 -8289 -20952 -26258 -38611 -37251 -23577 -15813 -18902 -5659 -26927 -45785
5850 -45785 -13067 32283 30043 9665 -11030 -4303 3961 -22007 -37977 -7024 6373 -2379 2798
5837 2798 5564 -11679 -32573 -27078 -33017 -31558 -23429 -9812 -3231 9501 23035 34530 35675
5824 35675 19497 -3507 -16531 -13025 -6346 10354 11489 21133 -2683 -36352 -43537 -30638 -24270
5811 -24270 -926 -16083 -42549 -34650 -23743 -11927 -2997 -2301 13083 12232 -4592 7087 23987
5798 23987 21386 -179 -23715 -25438 -15801 -721 1830 251 -25705 -32949 -26526 -25181 -3279
5785 -3279 -5815 34025 35143 -3554 -39865 -37682 -15642 -16061 -13842 -11918 -15627 -21273 -40687 -27249
5771 -27249 -28686 -16373 -11430 -22353 -10517 -10469 -29991 -38064 -19702 419 24330 26792 29550
5758 29550 27999 17843 -23612 -45343 -32750 -16560 -4817 -5854 -10680 -10925 -17616 -16880 -19965 -13544
5744 -13544 -22769 -22673 -4474 -1288 -7511 -13375 -12738 4322 -20261 -29071 -17671 -26966 -51855 -26530
5730 -26530 14407 8164 -1508 -4584 -91 -15657 -10676 10170 5560 2778 -12154 -19805 -1304
5717 -1304 9257 16306 24506 7057 -30810 -32923 -21630 -463 2642 -9541 -15304 -5954 -24989
5704 -24989 -31394 -30692 -24600 -13859 -23109 -9500 -15956 -20452 -20155 -19418 -45377 -46282 -27492 -27276 -14001
5689 -14001 -25321 -20978 -26043 -19806 -10945 -9437 -13556 -12531 -13747 -1660 9536 24009 30742 40906
5675 40906 45717 37700 43985 3201 -17088 -1732 2965 -535 -6697 -11395 -34259 -38198 -18649
5662 -18649 -18097 -17098 -14057 -39332 -48916 -16990 24799 27962 20411 23821 23511 32959 6037 -8614
5648 -8614 -2735 21888 48102 35339 26722 26549 23859 4377 5879 -5236 -3841 -12956 -19940 -14104
5634 -14104 -17591 2300 13832 10799 803 -15331 -22225 -30852 -15187 -12476 -29 3296 -30537
5621 -30537 -33887 -37678 -29852 -18671 6341 9830 -2687 4471 34172 15309 -3482 4736 -255
5608 -255 6051 12035 19274 7063 -6425 -798 -17615 -30120 -35129 -11893 7175 14024 7899 -4244
5594 -4244 968 5446 -1328 8710 12832 13940 9839 -19066 -12765 1319 10395 -2042 -2798 -23772
5580 -23772 3034 15206 -15484 -12165 14662 26263 47101 40141 28768 -3419 -18891 -1666
5568 -1666 1496 -12709 -28796 -24057 9350 10513 16696 8498 -13814 -21481 -14416 -5565 -28405 -27357
5554 -27357 -37822 -45840 -34264 -2856 5529 11837 15288 19605 10922 -12706 -38318 -32030 6384
5541 6384 19056 27117 19830 16151 17643 14196 6917 -10419 -18190 -23460 -11597 6365 6514 18792
5527 18792 -1192 -10776 -17528 3391 9590 6892 -2483 -33192 -47149 -29522 -31917 -40045 -11461
5514 -11461 19777 12229 8461 1357 9026 24723 27581 29245 34238 41672 35027 20776 29258 39391
5500 39391 30848 -1269 -12035 -2766 2768 -18970 -21456 -22711 -36271 -42370 -28807 -33039 -55233
5487 -55233 -43856 -21946 -3297 -6646 -36616 -41796 -46591 -58341 -49885 -52896 -36239 -13710 -14392
5474 -14392 -14753 1047 -12052 -15452 -8140 -24726 -28686 -19329 5656 4127 -6897 -3569 -8559 -8657
5460 -8657 -11739 -20087 -24783 -32985 -39817 -52952 -44705 -26396 -17775 -17461 -34096 -23818 -19905 -9046
5446 -9046 -22194 -39378 -28770 -17342 -39216 -35457 -38775 -37097 -14029 -20444 -34736 -18141 -33987
5433 -33987 -21417 -9509 11873 14796 16552 -1397 -29253 -53892 -70131 -71804 -23658 -40814
5421 -40814 -50937 -22529 -18344 11713 7743 -5721 8694 -8224 -36233 -49940 -40274 -9561
5409 -9561 -10154 -9867 -6426 -14207 -27413 -14430 -7437 -6730 -22395 -33489 -27389 -1355 22222 4277
5395 4277 -17180 -20966 -8551 -6132 13463 8269 6371 -925 -3514 9065 12735 -8433 -35394
5382 -35394 -37244 -45955 -39846 -28869 -34376 -16757 -10120 -15130 1239 11121 -3817 -13812 -6850 -25737
5368 -25737 -32315 -11467 112 -7036 -10707 -15482 -36064 -19882 -16117 -12721 -21794 -3852 7944
5355 7944 1177 -19484 -30886 -19153 1918 -13727 -35398 -17466 -6016 -9209 -37245 -31001 -27543
5342 -27543 -39566 -31039 -11406 -16518 -36329 -33403 -27153 -22091 -17843 -6821 -10037 -4035 4997 7556
5328 7556 -7494 -15632 -34961 -32119 -28382 -30260 -20825 -35135 -25463 -15157 -18434 -15909 -3793 4966
5314 4966 -2382 -22835 -17358 -17047 -5305 5331 7476 9509 1494 14299 1747 -15866 12801
5301 12801 6558 -21552 -25278 -19386 -13734 17030 38441 36552 27347 43086 49172 53345 33033
5288 33033 8302 -10396 -10509 -14649 2328 22933 7188 -1630 -33860 -47106 -35976 -24831 6157
5275 6157 29189 21658 14800 4666 -5098 5925 8335 1828 10041 -6410 -26115 -38443 -7853
5262 -7853 4570 8249 8282 6355 20736 36727 9280 1709 8106 21853 31506 20214 -1965 -3363
5248 -3363 4314 8807 14714 -8350 -22044 -4994 5472 -9785 -36724 -31913 4382 16277 7694
5235 7694 4600 21474 43426 12235 -36884 -51581 -43417 -41221 -54166 -60669 -35543 -24000 -19178
5222 -19178 -13373 -36 1849 1053 -8746 -11257 -7597 -28678 -11081 -14839 -22819 -6220 8973 -311
5208 -311 -2403 27653 25249 2266 -11646 -20440 -9902 -11616 -8956 10713 8143 26561 29093 10140
5194 10140 -8480 -20927 -14623 9680 56368 71593 43383 9158 -573 -1853 19959 19878 7878
5181 7878 8823 13577 31003 21433 14906 2798 17401 12608 -6438 -21998 -18207 -2111 1501 11791
5167 11791 9681 -3271 -30395 -16228 -8280 -24154 -16329 -12400 -14966 -24182 -42029 -57937 -37723
5154 -37723 -29231 -28042 -54431 -92951 -102372 -68326 -34304 -8225 -5297 287 8869 -4194 -18689
5141 -18689 -25776 -2128 9488 -11480 -21087 -13511 19382 41575 30175 1748 -5805 -20522 11008
5128 11008 35996 23370 -4347 -11666 -17162 -9815 -18193 -14512 -17919 6901 15707 15376 -1301 -12170
5114 -12170 -15284 -16757 -4808 18812 28451 34974 18324 -2838 923 30930 37955 25782 8930
5101 8930 6540 174 -3573 -21835 -51334 -43391 -41033 -39201 -11059 -27877 -39501 -40343 -24421 8346
5087 8346 18261 25958 -1799 -13293 948 21196 10470 12623 6251 3812 -6588 -28950 -40188
5074 -40188 -28311 -24114 -21476 -3893 -7481 -18599 -27517 -28438 -24296 4341 4713 -4981 -11936 -16764
5060 -16764 12974 53472 61302 48728 44452 42663 36018 26106 -19469 -23720 -7045 13845 -1783
5047 -1783 -12990 -8428 -2295 -8540 -11577 5828 27709 24165 18866 15506 -925 -4595 9308 10957
5033 10957 -4910 -41304 -24799 -23174 -24679 -25900 -38658 -26992 1120 22497 17554 10618 2268
5020 2268 1266 -19486 -17117 -3027 -15930 -17420 8705 27585 39738 14363 -986 19021 42045
5007 42045 48943 56404 42992 20065 3395 -8145 4829 17674 25952 17868 -4414 -15777 -5385
4994 -5385 1623 -1394 -3593 10892 3803 -249 -12056 -19996 -23107 -21067 -38685 -32178 -32741 -35146
4980 -35146 -51654 -77690 -64120 -15891 -8437 -14330 -39284 -23554 -18031 -15525 3579 14955 23146
4967 23146 28366 10715 8673 66 -11073 -15001 -3706 -25828 -30764 -26543 -26581 -14819 3671 -10709
4953 -10709 -16138 -9295 -9704 -8113 -8723 -9439 3941 3271 -5760 22641 57031 58450 47857 15938
4939 15938 -17401 -12584 7359 40296 49289 38622 29245 20529 -2054 -20506 -45774 -29926 -13704
4926 -13704 -15529 -10325 -2296 5160 20981 28738 44016 43949 14041 18560 28123 14590 26152 26008
4912 26008 15164 12741 -14113 4533 14607 13783 6857 -11878 2105 15805 -1192 -15371 -21654
4899 -21654 -14768 -11803 -20771 -24239 -11807 -7915 -20460 -30874 -41556 -61608 -53093 -38900 -5855
4886 -5855 22588 26210 36351 32162 15165 -3914 -16301 -22685 -11309 -5835 -23436 -41293 -6551
4873 -6551 1955 14762 56884 62699 21421 4546 -5997 -6482 -3627 7267 480 18102 20732
4860 20732 1390 -2513 8952 -6216 -2760 5274 996 32689 12939 -1329 2875 -15207 -32832
4847 -32832 -32481 -41413 -42716 -3964 7601 -1100 7218 -777 -13187 -16884 -19115 -13951 632 38048
4833 38048 42335 28393 14254 -13904 -7216 -11656 -6776 -11500 -1887 15620 8606 10444 11493 -16084
4819 -16084 -30482 -27072 -5944 2461 13997 -13837 -42909 -12993 25742 37177 2342 2917 9896
4806 9896 8794 30249 43948 57261 45740 33129 34890 19195 3076 -12575 4068 2253 -17907
4793 -17907 -1392 37315 51588 41660 23650 6417 28638 26967 10375 1718 -19888 -34426
4781 -34426 -28487 -22881 -4697 -3139 -961 -12239 -876 8398 -7510 306 -4685 2539 7907 -8752
4767 -8752 -18227 -9385 -16661 -13133 5897 4865 -3916 -24833 -39530 -29740 -31230 -37022 -10634 4903
4753 4903 30100 40044 10620 -729 20867 17837 10011 13949 -13300 -11987 13055 25324 35914
4740 35914 34938 35954 36805 29141 20742 12927 16038 40293 51063 56276 37655 34602 37333 34663
4726 34663 53602 61038 52408 38835 26355 19145 10024 40061 50787 34645 26475 28752 11223
4713 11223 -3051 -8410 -13728 -16510 -11320 227 1641 19902 28201 7011 5250 7986 6692 14576
4699 14576 16173 11073 -13682 -18945 -17317 -16230 -18778 -13122 -26162 -5274 3957 -13441 -19970 -13214
4685 -13214 -13013 -25962 -14866 -18779 -11490 -12972 -25808 -27872 -36047 -8627 -388 -7702 1029 26168
4671 26168 31516 10579 736 13022 20981 22758 21169 42762 25957 11081 -16965 -41554 -14744
4658 -14744 1172 -15081 3998 298 11377 6094 7420 16105 4254 -12395 -1582 18768 3080
4645 3080 7356 31251 22862 -1710 -7661 -4563 16789 7389 4266 25623 32556 16771 -6481
4632 -6481 -24129 -12492 -6031 11128 7629 -6094 -9784 -2796 -10149 -19144 17171 3928 -2170
4619 -2170 -1962 -25428 -34414 -20914 -3276 -20858 -23885 -20674 -3471 37693 28493 26277 -49
4606 -49 -16226 -16221 -16957 -27532 -47888 -27444 1111 4098 -10649 -12509 -13842 -21777 -60978 -58255 -12289
4591 -12289 28092 26272 15831 4134 -5041 -10188 596 3011 21447 24228 197 -16719 -14668
4578 -14668 -13202 -19247 -20994 -32912 -28949 -17234 2232 -7249 -20132 175 15136 -14646 -4060
4565 -4060 4265 28187 24669 28410 53467 41124 3877 -10676 -24936 -26971 -38061 -27351 -28984
4552 -28984 -33053 515 14533 27657 13146 393 -9682 -14074 -32769 -38857 -34918 -30967 -14661
4539 -14661 -18367 -24581 -17703 -10872 -2540 -10842 -17305 -22610 -16628 -24579 -25541 -24487 -14174 -15389 -15354
4524 -15354 16129 23337 16386 -7678 -13813 -10339 -6163 -12215 -27327 -2300 22065 22580 12938 9480
4510 9480 17627 14723 -12627 -31159 -37339 -31896 -39791 -29809 -23549 -21907 -11201 -7989 -14764 -9572
4496 -9572 528 -4421 25438 39400 34176 22316 23495 -23626 -29663 -7124 -8994 -27410 -9692
4483 -9692 31596 35888 44602 42888 23943 16322 18482 977 -15668 -23500 -13677 8847 21776
4470 21776 13850 27479 17702 -775 -13844 10153 15129 13565 -12373 -18474 -21986 -5892 18995
4457 18995 12483 6306 -23786 -27115 -15405 14116 6691 -16882 1122 10325 14052 6103 -6211
4444 -6211 2134 4904 10283 18243 8637 -5390 -26307 -35200 -27370 -1349 -6520 -16120 -26546 -18008
4430 -18008 -21157 -28488 -2671 10771 19974 22480 37907 41674 25213 970 401 14805 20876
4417 20876 18728 15444 28517 15435 740 -7563 -4010 -21031 -10188 -8975 -23641 -43458 -47045
4404 -47045 -30773 -28926 -19536 -4575 -6853 2924 -4410 -1092 -7949 -22208 -40568 -35702 -7248
4391 -7248 -1096 -22146 -37154 -27666 -27124 -14851 5461 18867 27571 44579 22558 2833 13237
4378 13237 1520 -227 15807 32408 39912 26258 17602 20053 2537 -5241 -6727 -2187 -2823 -9933
4364 -9933 -447 1460 -38790 -47451 -22134 -5014 5044 9840 14818 20152 10428 3605 3069 16102
4350 16102 26045 6353 12075 27106 42736 29093 1986 19006 32746 4489 -7356 2543
4338 2543 -12012 -21017 9734 38206 49261 45499 36760 16753 9082 2339 -7849 -27706 -12432
4325 -12432 18651 42899 39267 36409 27535 22302 18486 24621 36801 67760 66958 31039 28176 24832
4311 24832 26045 13901 1301 -1816 26444 18395 8316 26241 8707 -10532 -21785 -22036 509
4298 509 -8395 -20251 -5846 9683 40734 54420 31622 19332 14834 -11932 15933 37729 27447
4285 27447 9182 19564 46019 53030 23080 -6777 9797 5929 2110 15294 5399 -5533 -12678
4272 -12678 -11384 -25106 -17220 11558 15627 -2807 -1302 -33193 -68892 -80946 -53322 -21856 -4368
4259 -4368 2200 9477 -8675 -7636 2230 3935 4785 -11499 -9437 4907 14633 5338 -4542 -25904
4245 -25904 -35059 -1964 -9769 -6037 -2921 -18746 -18822 1214 18097 22395 43461 37461 44345 22959
4231 22959 20948 37042 25234 -124 -20307 -34162 -40141 -28535 -33170 -44383 -48261 -45173 -44050
4218 -44050 -55916 -50400 -31653 -12261 -7952 -1542 10043 10612 22252 30725 32425 17678 -7933
4205 -7933 3550 -2967 5995 17212 -3771 -25191 -47908 -43023 -29266 -18276 -17474 -20354 -12524
4192 -12524 5923 -5201 -8565 8047 -2608 -12015 -16592 -30839 -10253 4119 -10047 -16841 4187
4179 4187 10189 14626 385 1524 -3062 -21794 -36492 -48828 -40121 -12344 -10755 -18805 -6602
4166 -6602 10285 23557 31285 30831 37267 22446 -7819 -27886 -23109 -6639 1061 2433 -4367 -19415
4152 -19415 -19122 -14750 -19826 -25486 -19628 -4433 -5465 -4549 1095 8116 13842 21348 24026 -3243 -7712
4137 -7712 5824 3914 8480 11081 30565 51838 54719 45877 33802 6307 -4368 -924 -22578
4124 -22578 -42090 -36980 -29382 -18687 -9134 4585 -1285 21550 38224 43541 35577 27177 10616
4111 10616 1314 12613 37290 33236 12163 4627 -2742 4247 370 16209 8477 -4496 -5814
4098 -5814 -19227 -2298 2209 10500 -30817 -32013 -14655 -26705 -35677 -11850 -38289 -35384 1185
4085 1185 9641 9133 -2552 -3643 -9805 -15138 -9495 -13423 -5195 9435 17425 12639 13120 21903 12129
4070 12129 -9344 -28709 -1842 22078 29327 20847 5406 -3761 -11180 -24596 -27169 -41222 -23572
4057 -23572 -14288 -3510 -2624 -35707 -47630 -34400 -26847 -17886 -6539 7373 -13596 -34289 -32884
4044 -32884 -28486 -20925 -27019 -26205 -25980 -4039 5195 9840 -7428 -30524 -50252 -39992 -15439 -21349
4030 -21349 -784 24691 31927 37655 31103 6345 -9020 -4197 1867 -5460 9378 14788 -7309
4017 -7309 -25618 -11972 15516 30096 58694 79293 61337 61754 51374 26904 2820 -19237
4005 -19237 -9023 -2083 10834 6152 16993 18180 -314 -6075 -2147 -11136 -2766 9745 17211
3992 17211 11845 10253 -2030 -5399 13803 28321 37440 26598 8078 -12687 -16112 -27445 -18836
3979 -18836 -5480 -8188 19717 40684 33858 16437 16641 26777 16463 28322 20460 -1460 -16694
3966 -16694 -17876 -4973 -4879 -14148 -10392 -1926 19370 18830 4556 -3462 10936 2156 -5708 -19462
3952 -19462 -24154 -25807 -37738 -38559 -30290 -15140 4134 1965 8320 23190 4052 -13335 -20838
3939 -20838 -51260 -70646 -83390 -86158 -62954 -47503 -57039 -34664 -8424 -30318 -38365 -25083
3927 -25083 -19509 -25329 -16817 -29438 -45192 -64928 -58070 -48192 -26236 -21297 -27181 -28900 -9805
3914 -9805 -14716 -39790 -50572 -38831 -16176 4809 6667 -7471 13777 12118 -17241 -21538 -32571
3901 -32571 -41815 -45875 -48878 -41430 -10754 13168 -4103 -26654 -31731 -34116 -25781 -19918 13101
3888 13101 12766 -2716 -6575 6468 -5666 -11740 -77 -16498 -23706 -20175 -14437 -15982 -55517
3875 -55517 -49143 -38180 -56681 -48949 -40963 -44989 -35488 -31245 -45482 -39034 -28455 -16239 -12834
3862 -12834 -20030 -18824 -4264 14100 8579 -6399 8465 839 -200 -16969 -28359 -19975 310
3849 310 -2837 -1477 -7183 5245 20218 14381 -24520 -34013 -15233 -9551 -10521 -7048 6219 -9783
3835 -9783 -25581 -16165 -3133 -5024 9220 1608 6898 8451 18350 11346 -14277 -40461 -29649
3822 -29649 -23473 -11458 14259 19485 -1813 12483 -21516 -59409 -50857 -28920 -16964 -11311 -11920
3809 -11920 -10087 -9801 -4282 -30472 -19180 -21747 -18199 -6907 -13855 -9926 12581 26376 27803 12316
3795 12316 -5656 5368 13654 11016 -5256 2277 1848 -15946 -19592 6596 1519 -15198 9719
3782 9719 27981 13803 -6156 7940 21779 34563 17231 7605 26900 41123 32141 34429 18456
3769 18456 -4186 -7436 -12396 -12982 -10109 11878 29104 29490 20725 31618 41330 21048 16561 15277
3755 15277 6961 -10222 -23437 -23452 -32522 -21370 -31441 -40619 -30524 -5725 -14021 -37581 -27450
3742 -27450 4138 -8559 -13662 -6401 5440 2722 9974 17912 24117 -8431 -11811 4294 351
3729 351 -8255 7294 11387 -7294 -12023 -429 6680 26066 17458 20574 19783 -1878 -23178 -38555
3715 -38555 -40792 -20643 -11292 -831 14521 -3226 -4333 7331 15819 2739 9473 3333 8149
3702 8149 12486 18595 8352 1017 -15193 -1199 14895 14741 30561 27452 30509 34051 53469 43655
3688 43655 30113 12116 -9724 -6407 -11125 -24644 -32260 -26647 -1363 7889 -1023 20689 30796
3675 30796 11045 20345 25327 26305 8375 4069 13805 48970 56188 58269 53300 38592 23494 34957
3661 34957 36003 246 -22128 5413 30816 21356 18213 10129 -10352 -18184 -30876 -17995 -21056
3648 -21056 -36045 -27754 8900 27919 12285 2465 6692 -2658 277 717 31657 39637 7515
3635 7515 -15433 -6761 19685 56724 57976 36247 19332 -34 -5073 -37080 -37916 -30502 -14913
3622 -14913 14074 26635 10023 6097 -315 -15756 -36711 -39503 -18630 -37259 -48781 -40739 -28400
3609 -28400 -29378 -33911 -12845 -37155 -20826 -4528 1566 16880 17925 15540 19332 6469 1904
3596 1904 11606 -8608 -7171 1611 3836 -867 -8671 -2007 -7266 -8356 -5091 3456 -1503 -11170 -1321
3581 -1321 33054 34884 17850 24759 29181 29194 21860 6372 -6975 -25596 -30571 -18215 -13036 -56539
3567 -56539 -55955 -33299 -14163 -13659 -9080 -18709 -15318 -16612 -21536 -18201 -174 -6234 -13888 -23244
3553 -23244 3628 25418 27319 35845 11378 -10391 -21435 -24730 -10996 2336 -10145 -26439
3541 -26439 -19133 -12078 1726 3237 3714 22584 40405 34637 1280 -10932 -6651 10243 11624
3528 11624 -370 -4328 -14153 -3829 6773 4052 -22437 -40536 -51565 -44500 -22615 -6158 16983
3515 16983 21678 -1408 -14572 -17804 -28645 -53538 -59777 -48825 -21231 -180 -11888 -6807 -19051
3502 -19051 -14924 -19676 -8731 4184 12731 1685 -30738 -43515 -42919 -16075 -9006 -2614 -14185
3489 -14185 -12317 -3930 -11779 -8939 -16164 3077 -1171 -3997 -5577 -8422 10475 24532 31082 31360
3475 31360 26975 20665 4526 -7151 10006 38849 59823 46311 41521 40960 26614 26901 32857
3462 32857 36652 24075 3638 12296 -1647 -1569 -2672 1449 2843 36287 39192 24607 2489 -30722
3448 -30722 -45529 -38187 -5812 -23121 -20538 4032 -17073 -39097 -24937 -3042 9634 -14889
3436 -14889 -36831 -27779 -19915 -19954 -16041 -9291 23615 38248 48368 52747 53666 57072 49266 38531
3422 38531 47408 64704 57870 62068 72042 48877 8136 4788 23057 29174 12828 3101 -2334
3409 -2334 -7526 -7961 -6167 -24721 -33809 -25386 -3137 -13918 -40740 -49384 -40544 -36715 -46982 -37212
3395 -37212 -32434 -1742 13334 8870 -2803 220 12056 8345 16613 -3791 -4094 12938 13901 23160
3381 23160 6089 -16493 -12642 -620 419 10665 -5047 -15537 -4401 9411 11614 8571 -11025
3368 -11025 -27097 -35097 -26993 -19499 1112 2523 11619 -12431 -44217 -26794 -17354 -20 -32212
3355 -32212 -46392 -21304 -2274 -7922 -23370 -28838 -32480 -15591 -9986 -25498 -25534 -20294 -700
3342 -700 -3993 -12922 -27443 -21807 -246 -5760 -17082 -2609 5778 12963 -13712 -2492 8391
3329 8391 10991 29307 30479 26288 18824 884 -4602 368 -17485 -18410 -3124 -455 5864 16464
3315 16464 17964 16517 839 -12817 7737 4739 12541 21279 30335 338 -2003 14062 -2458
3302 -2458 -683 -255 369 14766 21970 49191 58619 49243 35369 21145 46633 46761 59493 48818
3288 48818 26368 2533 -12579 -21808 -13953 -32576 -20698 -8773 -5113 -6237 -14169 -18941 -1501
3275 -1501 17550 3531 3027 7217 -8443 -36154 -33413 -13575 15356 41237 53884 26485 301
3262 301 -9200 -2691 -9569 -6724 -3168 15954 28279 2457 -6790 -15785 -10214 12671 13808 17187
3248 17187 2908 4132 17073 -13772 -51584 -31195 3499 29991 34322 19831 -15709 -36886
3236 -36886 -33063 -27289 7039 21229 -6095 -4436 5875 5191 -11648 -17579 -11239 11551 21992
3223 21992 7595 16814 23766 18962 6015 -640 18357 -2202 921 -9089 -19259 -10400 -4121
3210 -4121 -7516 -6795 -4314 -26431 -45156 -34332 254 26054 21307 13005 3215 -19859 -8808
3197 -8808 -16113 -10878 -21404 -23835 -39063 -36897 9328 3093 -12627 -11614 -10293 -35780 -24434
3184 -24434 9792 33852 10156 -18513 -18213 -21776 -21593 1454 9331 5208 -20443 -16944 -11258 -3473
3170 -3473 8533 5133 4554 687 5659 1168 14057 11285 -1965 -3894 30618 25389 14648 -11755
3156 -11755 -12653 11113 27436 29476 30000 -5564 6149 25905 -1436 18161 35164 36119 19062
3143 19062 -4300 -4489 -2197 9446 -10027 5082 40284 18884 -18311 -17668 -14832 -31432 -27556
3130 -27556 -34343 -61228 -21600 -8608 -13607 -21449 -20533 -35114 -36825 -23331 2032 36529 34496
3117 34496 18108 18918 25524 11079 -9026 -6992 2283 3271 -18119 -31472 -16451 -6522 -6448 22996
3103 22996 33668 24013 12926 -6758 -12330 -7313 -21557 -20814 -8422 -9711 -29687 -28517 -17852
3090 -17852 9238 28461 19192 29811 21889 2007 -2068 -1935 27104 20193 -11501 -14274 -4544
3077 -4544 -8876 3038 -7315 -21308 -17377 -22530 -14166 -16884 -24309 -14597 -7638 -3030 -6104 -16792
3063 -16792 -16759 -25532 -19846 -27913 -21807 -16873 -15088 -21409 -11212 -3623 17652 19578 -19311 -43018
3049 -43018 -36149 12130 7107 -17681 -22607 4937 13280 -6206 -6290 10659 14263 17397 17596 17852
3035 17852 12268 -4514 -7192 -520 6406 -3205 -19030 -27589 -18666 4649 13517 2608 12711
3022 12711 5521 -15597 -19203 -21383 -28890 -37067 -40805 -31073 -3530 6706 8182 8291 -4974 1874
3008 1874 444 -7045 -18419 -11525 -11212 9518 14351 -3902 -10666 -29865 -28647 -20190 -22610 -2529
2994 -2529 748 -19274 -30487 -22416 -6253 850 989 7532 8223 9074 32312 14842 -11503 -3236
2980 -3236 10282 22696 25434 14149 7166 22456 22724 16242 -1072 8049 31130 19137 18514 21872
2966 21872 27677 26080 39862 27439 38525 30968 11365 13406 17949 24664 27338 28677 30503 15248
2952 15248 -443 9704 12064 11963 35863 38746 36149 20984 -5766 -9762 231 5195 -14680
2939 -14680 10664 20602 -7528 -10336 -7413 -5564 5202 13619 28996 32241 17432 21575 56257
2926 56257 37235 4296 2689 14012 8900 -11290 -19182 -26826 -5966 25997 47039 58621 49822
2913 49822 31558 28741 55737 44726 23711 3768 -25834 -42731 -45702 -43447 -40402 -37295 -27872
2900 -27872 -22878 -6183 8221 10126 -6137 -10610 3379 11257 1094 -7163 6806 27983 21608
2887 21608 23628 32297 36856 12689 3852 -786 -1526 -6682 -14320 -39872 -38085 -32456 -17839 -9415
2873 -9415 13628 35808 41564 32264 -6440 -36969 -26388 -17835 302 10328 -7567 -12124 -33943
2860 -33943 -18855 -20058 -28516 -23283 -15737 -13121 -34864 -12021 18997 18325 18822 5488 -9063 -13082
2846 -13082 -7855 520 -5378 12817 11292 -8686 -18734 1389 10599 4064 -11890 -24652 -25468
2833 -25468 -17394 -25225 -41504 -43221 -15305 -5474 -17191 -27418 -30862 -23270 -24423 -25168 -22846 -11845
2819 -11845 2152 29534 36876 17538 9574 -284 -6388 1200 30449 31831 10684 7097 -780
2806 -780 -194 5956 4948 -6884 1730 -8485 5933 7142 10199 -9746 -2345 -6379 -7682 10825
2792 10825 18933 19135 14840 12851 4134 10165 20235 41646 22838 -19701 -23278 -19150 -28208 -22047
2778 -22047 -19929 -12822 -4155 8611 15415 2362 11763 -20320 -38605 -1836 1587 19722 17629
2765 17629 12903 -3244 -22061 -27262 -46275 -36734 -39380 -22198 -2010 -2739 -4437 -9356 -31978
2752 -31978 -25299 -31081 -34101 -14984 3736 -13170 -12168 -23865 -11068 13387 23689 21101 23715
2739 23715 40870 53232 43210 41775 24765 5274 -8985 -3260 1351 23439 18769 4336 -7141
2726 -7141 177 -19244 -24088 -12968 -15917 -30128 -35053 -19227 9100 19775 -1234 -21002 -9052
2713 -9052 46 12086 34894 46362 41680 16610 16881 13929 1694 11608 27199 13679 14869
2700 14869 24190 35771 30618 36233 36111 -842 -14440 -33570 -40607 -18529 -23405 -34310 -34676 -21695
2686 -21695 11850 52762 37587 17151 10749 11180 16830 -851 4409 14608 21106 32973 39382
2673 39382 26765 13949 6633 13311 30587 24978 7325 -23274 -35826 -32919 -19767 11306 3923
2660 3923 -12991 -17262 -50518 -51281 -53851 -49303 -9833 33117 41247 34563 1009 5686 8810 -6486
2646 -6486 1835 13620 2850 -4151 -5627 -13177 -15393 -14213 -31547 -30637 -39347 -31536 -13673 -7860
2632 -7860 -48194 -26707 928 1819 -2849 -20135 -38110 -42322 -33182 -23877 -22075 -8666 2643
2619 2643 332 -3031 -13081 -13315 -13045 1586 23983 32775 27884 47287 35579 20817 27189 33127
2605 33127 21317 19265 4673 1137 -2923 881 9894 18438 19579 25774 28842 22143 10440 17083
2591 17083 13096 -8892 7380 19600 9411 8884 19167 14204 7966 -2591 -9035 -10657 5446
2578 5446 23431 63575 59597 10823 10748 15512 17747 -2945 -11669 -3932 14279 19506 24025 15881
2564 15881 30361 5815 -27258 -18387 3626 11137 14627 39332 30157 9867 -9345 -15773 -23630
2551 -23630 -50012 -36030 -22717 1440 -4601 685 17254 24325 12490 19892 47595 44491 13547
2538 13547 12638 24744 9092 1394 -5394 2301 780 -1452 -1539 -5934 -17568 -32820 -20579 -6712
2524 -6712 8682 8981 1143 -6753 -5369 -13473 13353 37974 33656 27220 25829 33035 42427 25165
2510 25165 -4919 -22955 -19538 -22029 -29226 -41908 -45789 -24613 -24830 -34978 -22377 -22593 -41835
2497 -41835 -51819 -41961 -23755 7310 -9640 -14546 -3904 -11173 -14725 -17209 -15226 -18609 -11868 -19495
2483 -19495 -11994 -3683 9186 18966 11822 -12724 -20577 -18109 -8590 -2100 15712 41169 43417 10261
2469 10261 16933 32198 14127 14787 14826 -1622 -6078 2292 22418 45310 50215 46642 40026 2934
2455 2934 2009 13204 4851 -17784 -8818 13211 21919 15740 10951 35598 39985 -6790 -12663 733
2441 733 3100 16129 34116 48874 38579 21523 25072 8962 -10990 -27219 -40733 -42568 -43691
2428 -43691 -54912 -54559 -37727 2288 -5712 -7174 5178 17703 10180 -1495 2143 -7576 -3903
2415 -3903 27038 32154 23335 20769 -7207 -34090 -30190 -19215 -1449 18503 24173 18934 42458
2402 42458 45720 13326 -13041 -18697 -15201 -4824 6807 3185 -10750 -22497 -21758 -13250 14041
2389 14041 10027 -2572 2296 7391 12161 30549 16406 -15107 -45789 -25384 8431 34899 36142
2376 36142 23110 -598 -6160 -14242 -5999 3755 11316 -2738 13537 5976 12979 16027 21438 20280
2362 20280 13156 6252 -2819 1577 18388 13558 -13945 -8997 14964 43920 17800 -8630 -8798
2349 -8798 -6522 -10589 -28943 -29611 -25439 -23348 4968 39737 20108 11463 7241 -19574 -33857 -28203
2335 -28203 -7675 18530 35029 33823 18481 -1533 -1245 8947 7587 -5605 12005 19992 10173
2322 10173 20168 37435 23263 8792 21633 39754 22158 1878 3475 7667 1976 3351 16610
2309 16610 28452 25625 31059 20718 -9760 -4481 9590 17124 10352 22656 10857 -16879 -30203
2296 -30203 -43205 -36907 -24553 4990 21088 14883 1957 -12411 -20984 -35428 -28792 -21001 -11299
2283 -11299 -3119 13121 3191 310 -2173 -14728 -23573 -21007 -1966 868 -21063 -14186 -18342 -36006
2269 -36006 -27676 -18893 -8382 -21705 -33310 -13181 -2484 -16706 -21696 -12424 23519 62694 53579
2256 53579 29906 20447 -496 -1503 -2597 -17966 -15900 -14882 -25002 -9191 6199 23541 31832
2243 31832 20417 22815 11822 -28932 -32357 -12888 11589 -12425 -28536 -39265 -35751 -14753
2231 -14753 -26505 -38012 -21232 5816 -1214 -2424 -4698 6196 -8289 -35436 -6549 -4959 -36502
2218 -36502 -21659 -2410 -14865 -21721 -15718 -16225 -25318 -38611 -40339 -35185 -16701 323 7202
2205 7202 -8182 -14133 -20915 14179 15271 19111 10165 28860 39577 21656 8150 -110 -5182
2192 -5182 -2727 -18032 -5567 3460 3768 22299 22943 -8962 -45006 -38822 -2587 -6859 -18733 -20386
2178 -20386 -27761 -21213 -7883 -9975 7471 19980 12655 8795 10551 15561 1393 -5813 13742
2165 13742 8526 13466 11057 15106 -9727 13664 30791 27074 6655 -1601 3209 17435 18324 17784
2151 17784 17580 24422 40753 30426 39936 2096 -24989 -31453 -26690 -18666 2076 29820 52856
2138 52856 88096 76258 48541 48640 20568 -7635 -575 18262 35821 35101 15974 2745 17637
2125 17637 -3055 -12366 7481 42805 57009 43067 33151 4162 -123 -15247 -23758 -21210 -10481
2112 -10481 -8781 -7665 -21841 -22476 -28657 -30752 -6577 9072 8029 2429 46 -10766 -19895 -15563
2098 -15563 -18468 -20495 -19026 -16661 12757 24869 32903 24575 7632 -2914 9721 -201 23975
2085 23975 32260 5934 21932 46751 50083 17263 -2134 14062 35269 44371 28764 5217
2073 5217 778 -10985 -699 1789 -12426 -17660 -24081 2307 25023 32521 60856 53878 37415
2060 37415 14105 10157 19989 22769 19148 13037 -11714 -8802 -2144 25479 53966 58904 36973
2047 36973 8940 11163 16208 27146 26029 31068 21039 24477 27447 25949 32465 28635 19139 9000
2033 9000 16277 35144 23655 18173 12843 19572 25493 35628 34732 25227 -3008 9872 15397 16389
2019 16389 -5097 -4388 -4967 -14623 -1454 -14205 -6775 1859 14681 20271 15953 2074 -13416 246
2005 246 19365 17570 16468 18670 19938 20124 12797 26619 6847 -13400 -28293 -20652 3926 7931
1991 7931 4911 -8791 -23414 -2056 23560 14948 4786 -6882 -198 15946 -11027 -12836 2200
1978 2200 7011 19155 22746 36480 21334 2368 -14972 2095 978 -13795 -5062 18368 32062
1965 32062 30737 35779 38494 37932 35760 8607 -5945 7114 15608 12988 2454 238 19459 23734
1951 23734 40421 23223 -7636 9228 34759 28689 13636 8356 -4667 -4057 22245 33108 40889
1938 40889 28874 36187 36815 10311 16695 31547 39389 37437 29707 30377 39147 9496 12979 28440
1924 28440 11477 9424 24586 21047 4579 -19922 -38238 -17212 11394 26739 22776 21061 31367
1911 31367 38286 33318 19931 25995 5904 -7548 -6022 -4524 18914 28099 3780 -21451 -39169
1898 -39169 -20463 -23701 -21782 -3623 2707 -3859 7240 17407 20759 25877 9145 -4289 9950
1885 9950 20863 7329 -29355 -37461 -18104 -8645 -20374 -9076 11734 28382 36185 25947 6541
1872 6541 23226 19596 21425 27276 9305 -5658 -14628 -20290 -3783 -6193 3094 6285 28697 56492
1858 56492 55260 31023 22375 -13432 -19200 17463 34688 30612 17062 11889 2777 -8944 -7206
1845 -7206 -2553 -18064 -28220 -3777 17788 28451 37744 2880 -36197 -33594 -47565 -41364 -28984
1832 -28984 -20139 -3757 26234 20904 30345 28322 12181 9738 25985 22917 -1878 -16812 -9839
1819 -9839 11327 17438 7446 22117 15993 17659 27104 23166 -9991 -36617 -31245 -24674 -21736 -14027
1805 -14027 -8438 11538 40258 32101 21702 8029 7829 3436 -9440 -24791 -39750 -26126 -18118
1792 -18118 -12241 7868 -3031 -12034 10828 23534 21218 -20491 -23813 -29874 -6760 10465 20889
1779 20889 33808 21027 15153 35158 32325 30009 20768 24152 42020 47066 19648 21494 32988
1766 32988 12991 -21453 -32178 -39751 -17368 20944 42117 27789 8831 13194 -349 1309
1754 1309 7217 9924 28405 41532 17312 6742 2418 15926 7652 -25029 -9769 10687 1699
1741 1699 19611 28682 27070 18177 31211 38198 40416 30101 10226 -14523 -4166 1295 -9058
1728 -9058 -6815 -4969 -2545 -11706 -14156 2199 2484 7890 2675 -3210 8654 17240 3517 -6797
1714 -6797 -1728 -1205 -22801 -12567 4364 7566 9313 10187 14743 16788 24254 17226 35808 41022
1700 41022 42061 34839 20940 26986 16159 9855 12203 11520 3891 -12832 10589 28614 22553 -4039
1686 -4039 -834 -4910 -5686 -3571 -13562 -11081 4388 16068 7686 8061 15883 16477 39761 33098 23114
1671 23114 12299 8396 -7059 -15000 3504 -13570 -12789 -10458 -43525 -70273 -57851 -29950 -12893
1658 -12893 -15155 -5493 31936 64439 74846 48381 13351 5466 -14436 -17882 8915 22439 36184
1645 36184 42771 46414 47051 31537 11694 2252 6221 -1860 -11717 -10047 7530 3682 786 17312
1631 17312 15754 7942 9762 28059 24110 28928 9329 29595 31628 22852 32797 18408 -2368
1618 -2368 -3257 -14941 -7931 -24964 -56264 -64248 -45566 -30687 -2279 -4067 -16619 -16306 -48898
1605 -48898 -44021 -30227 -3794 14530 22104 12386 -2378 -11400 4550 23968 21463 26204 39655
1592 39655 34159 4144 -32974 -38295 -39362 -10815 20363 29354 16305 23640 26556 29242 13080
1579 13080 -13270 -23116 -18262 -9655 -4500 -4318 4402 -11240 21 12562 17589 -11445 -4208 -19332
1565 -19332 -15036 -7475 3358 12862 13768 -4576 -42980 -51949 -26390 -6674 3721 1318 -9086
1552 -9086 -4353 77 -26496 -33386 -16752 -2852 15249 -2698 -7139 -11018 -22706 -14383 -10224
1539 -10224 8270 26167 16934 23445 28293 -18071 -43501 -21789 -25644 -21581 -13449 -13347 -15570 -24874
1525 -24874 -49943 -43424 -31166 -23212 -6755 -23439 -28392 -27800 -14299 10513 16994 647 -16829
1512 -16829 -4532 4498 19422 28949 5495 -5325 10299 14464 -1726 9317 25790 25175 45682
1499 45682 57522 34935 24841 33110 15678 -17679 -22222 -5014 9151 -8796 -6861 13343
1487 13343 21635 36744 31580 16227 20086 25124 22629 24193 16037 2560 15826 30475 27895
1474 27895 5455 -3626 -6819 4081 -658 16244 2723 236 11196 6760 2001 3144 -1782
1461 -1782 -8146 -20089 -6789 -23177 -27478 -17002 6561 25007 3444 -797 18377 30068 31053
1448 31053 32765 53861 50373 60087 33270 9720 32020 24643 7301 -16651 -48006 -36691 -21465
1435 -21465 -7464 6571 -389 6097 14195 -676 7196 9241 -4422 -4433 -8505 -3906 -29933 -16956
1421 -16956 13956 7159 8845 18011 21727 18337 25729 10630 6759 209 -10957 -11082 -31873 -46717
1407 -46717 -34840 -23723 -16184 -24157 -27939 -30226 -12743 9836 20647 30490 32800 12913 -20292
1394 -20292 -35631 -50331 -29167 1352 7886 3011 4804 6503 -7907 -2833 12872 -8944 -10211
1381 -10211 -28883 -23228 -19078 -29536 -6874 11465 7837 4193 10699 10007 3776 -1717 -36030 -41964
1367 -41964 -10013 -5129 -17750 -19929 3755 4967 -21009 -28695 -17427 -18425 -23468 -33309 -34599 -20117
1353 -20117 -12743 -15423 -7644 -2890 23988 24015 -504 -14977 -9464 16010 5260 4921 5883 10320
1339 10320 3156 -4394 -9822 2799 16652 28794 18312 6201 -6504 -7967 -3152 -29021 -25434
1326 -25434 -34521 -34936 -32701 -41914 -46920 -14213 -1477 -14891 -32728 -29308 -13433 10197 -2716
1313 -2716 -22560 -17831 1790 -2000 -17510 5872 -1070 -24718 -31935 -46210 -41467 -40115 -42975
1300 -42975 -26457 -18302 7443 20091 20590 26475 28766 18113 61 -7000 4498 14808 7631
1287 7631 22156 39804 46232 33635 3286 -15365 -19173 -23953 -9856 5697 13934 9603 10363
1274 10363 -79 48 1504 17939 12842 10196 8785 -6005 -2848 1121 -5691 -27764 -28913 2469
1260 2469 52325 58095 39730 32156 11405 2638 -38155 -48419 -34098 -1689 12459 34968 11812
1247 11812 9429 1554 4043 9381 18394 28879 13519 20487 24620 39380 39766 16830 13026 13697
1233 13697 13353 14011 14293 7980 2285 -8426 -9232 17283 29619 20174 28201 27213 32701 30590 27102
1218 27102 21959 8263 856 1865 11905 39931 41594 29173 8845 -25181 -11053 10723 -1420
1205 -1420 -8539 -27276 -6322 25679 24292 -12496 -19282 -4310 -675 4543 -6669 -23704 -16452
1192 -16452 6448 33733 42031 45023 31981 29724 19024 29362 59304 50985 13600 13950 8503
1179 8503 192 5970 -18525 -44058 -47993 -34402 -21101 -17940 -16828 -9637 29607 35952 2298
1166 2298 -18857 -8851 -2785 -296 -1275 29542 38391 34029 18127 25077 45992 41766 24759 25246
1152 25246 29988 7658 -16572 -9041 13834 28609 15643 6079 -195 -351 2350 -9137 -31956
1139 -31956 -22993 7431 667 -26957 -40032 -25252 1095 11734 4135 -4196 -4419 843 -6356
1126 -6356 -7777 -16295 13249 10738 5019 -2885 -18212 -14068 24086 52345 42782 37744 16857 17631
1112 17631 4519 -2055 5606 1801 8598 6061 5811 7128 5180 -3391 7049 22986 30257 24723
1098 24723 28193 50861 45498 38517 28054 4487 -7098 -16367 -22583 -19199 -8141 8917 6778
1085 6778 1455 -9822 -9171 -28409 -30051 -4639 9871 21252 27569 4025 11019 13873 2464
1072 2464 -8256 -28203 -33179 -20458 4469 -7975 3994 9058 -25139 -27017 -22123 -21185 -3432
1059 -3432 16209 17468 15638 2661 37487 41448 17123 34165 35834 16116 3913 3056 3526 -5493
1045 -5493 -7378 2752 -12648 9337 28550 16101 -9208 -15623 5295 9450 -17025 -14575 -12918
1032 -12918 -16902 -1782 7074 21785 -2626 -25182 -19420 -6457 102 -5085 11871 14717 19775
1019 19775 24680 25362 13497 8019 4405 -11290 -18328 -16909 -21937 -17302 -23638 -2159 -2850 -11156
1005 -11156 12318 20346 24112 10427 12793 23184 -4911 -13556 8905 26001 12678 6437 -3797
992 -3797 5824 7728 -1571 -6115 577 995 -14210 -32696 -48358 -35364 -7491 4549 9638 9438
978 9438 9376 1406 -9424 -5622 -4389 -28331 -33273 -24664 -3232 35395 31887 18510 822 -15527
964 -15527 -1869 -12112 -35304 -37253 -15117 -3587 -17339 -27422 -4251 23000 13381 113
952 113 5860 12067 9945 16414 16264 17455 21689 19104 24358 11648 -4642 10844 14612 23002 41152
937 41152 39128 11969 6931 36538 29116 16112 27930 18243 11698 14844 9905 21298 -8151
924 -8151 -36644 -41258 -20696 -15585 -20861 -7864 5715 6394 6360 9236 -15129 -25602 -23406 -10697
910 -10697 13070 28806 1514 -12716 3271 11727 -4636 -12750 24625 50211 55113 52652 42143
897 42143 18017 11178 10778 -3584 -4677 31670 31857 6329 -17382 -20312 -28150 10368 37057 34548
883 34548 37326 24297 20939 -834 -8632 4326 10723 2043 18799 -1461 -30354 -20913 -11156
870 -11156 -2537 13575 39920 48405 36763 4839 5667 6383 12240 24731 14537 3555 16064
857 16064 7803 6413 -17570 -28736 -10873 -19969 -7561 8781 -27836 -16113 -18564 -9705 10715
844 10715 27101 31934 28533 12900 -10584 -7619 5249 17808 14525 17281 -5349 -18842 -6247
831 -6247 -14789 -18895 -17988 15822 18304 8515 2943 26886 39556 24144 -7898 12863 41444 40649
817 40649 32068 23557 34580 60444 46502 10357 13490 10573 -3574 11953 8298 27788 28228
804 28228 7151 -26062 -61642 -26488 4800 12035 28162 23576 25926 8985 1318 -5709 -9153
791 -9153 -13938 4479 14091 3186 10649 22646 22532 19763 36805 17705 8798 12710 12323 12687 24318
776 24318 16988 2133 21414 20380 6599 -5288 -11870 -33403 -23196 -20010 -11985 12266 19750
763 19750 22501 31123 27199 40852 24702 -4871 -16029 -7596 -9157 15331 8426 12550 -12208
750 -12208 -758 15450 7589 16767 11429 -23412 -24385 -12160 7429 40135 49249 43899 52323 40163
736 40163 18091 21253 28800 23925 12798 12865 17093 23833 7221 -12943 -18951 -8456 7097 31520
722 31520 51032 20997 5310 -10151 -2385 26735 10454 -14117 -31356 -21003 -44266 -73712
710 -73712 -57542 -35415 -35233 -17723 -11222 10611 24473 4333 -23646 7523 20236 19126 13012
697 13012 -424 5046 3062 -27717 -9145 11916 22445 45434 28199 20527 39471 55943 49082
684 49082 36190 30276 17374 26829 33336 41984 54593 17644 27526 23174 9307 6858 1549 9436
670 9436 22481 25241 34218 13981 -15825 -13520 325 1905 13297 34710 24706 -4150 19039
657 19039 35702 31442 13484 30643 28520 31806 30828 33317 14469 5667 6552 10407 5681 -17745
643 -17745 -42733 -44925 -15127 262 12851 35857 49325 43703 8911 -20783 -32628 -27129 -2626
630 -2626 836 18494 40469 42441 13769 -13770 -1643 16285 29327 12301 -2067 18300 33291
617 33291 38289 24905 15746 6474 -4037 -6166 -13766 -6343 16912 34018 14728 -993 3392
604 3392 36146 49781 49907 35146 6729 -4875 13925 19552 24893 4358 -9371 -22816 -16756
591 -16756 11740 33292 42324 48254 19655 -18899 -5849 -2585 4232 16943 31757 45693 54279
578 54279 28117 -4726 2495 23222 8309 -12654 -12734 -4989 6753 -1045 -4841 -3835 -8442 12615
564 12615 27194 36894 38522 40121 29560 50585 45917 34195 41912 54325 50250 44477 34041
551 34041 33308 36342 23722 23711 18440 45893 58974 45621 37635 34728 27831 44292 56696 49771
537 49771 25411 8864 7309 9538 20256 18250 24534 29534 11736 5401 4373 -381 -1086 -1915
523 -1915 -10863 653 7785 -7134 -28776 -18817 -593 15383 39081 56673 48547 39359 27011
510 27011 33149 18481 6211 2216 -1816 -4197 -4412 3960 29204 39990 24748 255 -22225
497 -22225 -19350 -4139 6765 16889 46279 53621 44248 10962 -11802 -23143 3423 9799 152
484 152 4998 12484 15310 11777 -2683 -10571 5212 3160 -6931 -2399 13659 23206 6510 597
470 597 7369 19387 36446 17244 6419 6404 -7988 -13194 -27256 -17067 -15235 -14641 -2616 14453
456 14453 5477 -24 9532 13686 18855 2379 -6591 26860 40303 18267 3249 12082 17830 636
442 636 -6327 -5781 -12870 -13463 -4371 7795 13205 6854 10348 3990 -8741 4655 25945 14462 -492
427 -492 -6964 1800 34180 44341 53268 47791 51212 49744 14884 5893 7934 -26923 -35688 4839
413 4839 20946 -11278 -28609 -27922 -19932 24982 42494 53863 48930 41624 41987 27081 -415 4101
399 4101 16702 20971 21473 25572 25211 35313 39571 50798 54905 32453 8449 4021 3340 3076 10041
384 10041 7333 11502 1933 -18887 -9302 -3889 -8065 10307 2018 -19286 -27688 -7583 -4105 13292
370 13292 23962 31219 7501 2914 -11985 -38280 -30377 -19833 2427 28648 22336 28918 43107
357 43107 40909 22308 31466 59059 35471 2807 5871 31550 43462 38354 30613 38774 21282
344 21282 -2044 11489 14388 -407 1661 16443 48512 44097 25928 37989 27709 -10749 -21217
331 -21217 -18214 -16066 -4210 9503 35022 51104 48092 13583 -164 17116 20752 4380 -11447
318 -11447 -26082 -7575 5240 2860 3142 4369 -12455 -19744 -4934 11495 14168 4453 -10338
305 -10338 489 24452 51417 56263 37320 23567 16881 2680 7652 11248 33482 31945 31417
292 31417 25089 14446 19736 27302 10986 -5000 5445 13170 -8334 -13183 1566 -1565 -24740
279 -24740 -36927 -23191 -8274 -7037 15005 37398 40054 29520 32060 30422 3326 22996 54159
266 54159 42993 25522 20032 25354 20926 49096 53873 41890 52270 62347 56052 30590 17453
253 17453 8921 7401 -3777 -12621 -14960 -464 14853 21293 8856 -6072 -6996 14666 29728
240 29728 25750 23166 26499 21639 37306 48405 53063 57127 20554 1821 13417 20751 13875 27650
226 27650 26003 31299 46151 46333 24987 15038 29642 34502 20958 14976 30519 31942 14947 25377
212 25377 34826 25101 17209 23441 -2497 -29644 -16458 4360 20765 6408 3876 23109 43643
199 43643 50544 41536 23124 11315 21019 29593 20075 12334 -10219 -17888 -346 -5120 -15356 -4371
185 -4371 28105 36336 46022 53432 39918 30913 33086 17431 -15013 -20515 -18744 -10908 3457 6138
171 6138 20778 24345 12599 21689 28259 40104 40590 36619 24231 18683 20406 17049 21071 34708
157 34708 24479 10288 31869 39478 40929 25089 20948 16992 7731 12079 8046 14633 28974 30961
143 30961 30515 17013 12738 15383 15733 7918 9597 17718 30816 32252 22308 26981 14673 17741 28997
128 28997 21784 33545 47203 48382 38377 19743 14894 18942 12794 7056 8555 16139 26877 27024
114 27024 14980 15482 -4315 -9001 1732 14981 19165 6990 14853 25822 27012 12407 -2784
101 -2784 -19000 -23490 2127 5731 -9062 -12980 -12451 -8034 -1375 -701 10711 20631 13889 1453
87 1453 12239 15614 16077 14810 5461 -5616 423 2053 10961 20187 9758 325 1342 16160 26209
72 26209 31526 19032 15207 20031 32921 44679 44911 26358 21512 10834 5232 14767 11839 9598
58 9598 4639 5111 19533 28917 18817 9228 7389 -3617 -11289 -5984 -4226 -738 11131 19243 36038
43 36038 38535 20464 5453 957 13458 14843 -983 -11858 -270 5751 9991 10159 14170 5829
29 5829 5459 31159 29261 23256 24364 17112 17889 15828 11571 23332 34741 37784 37946 33839 38448
14 38448 30230 35245 44097 36262 21704 20602 31332 25612 17593 15122 18792 23405 28755 28237
0 28237
$$ Imaginary data points
##PAGE= N=2
##DATA TABLE= (X++(I..I)), XYDATA
32767 72979 66690 62888 63387 64833 97602 118011 105098 107339 99840 85406 77560 77776 96884 104421
32753 104421 113085 98896 106993 128547 126967 126475 127798 132379 122394 110644 115626 120174 101313
32740 101313 71942 94044 121427 123718 99471 96255 105115 110872 123073 126276 126808 128535 126632
32727 126632 118700 129843 143389 151731 145372 136432 125494 132784 129462 132730 125963 135162 138797
32714 138797 131566 128776 122081 117416 129160 154085 146327 143419 141602 145423 139523 138986 140803 151768
32700 151768 159420 166891 175530 180105 181026 178729 163918 153354 154437 169266 169448 187445 189072 161935
32686 161935 165315 182024 172969 170626 156470 137092 135860 149020 148577 172469 188299 181464 177958
32673 177958 181194 165472 148215 143384 168183 181693 191647 195004 204340 192542 179440 182848 183597
32660 183597 182521 169798 179079 186512 196593 201086 205963 212781 210164 196816 184102 172095 162379
32647 162379 164547 165600 184687 207388 225330 223610 212429 209640 209677 211558 200389 206550 194352
32634 194352 196968 211055 208968 214287 223673 227569 235288 238657 222700 222100 195270 195517 195615 193609
32620 193609 190284 190772 199236 197969 204336 206970 218181 221672 215773 210336 232267 240664 238770 225323
32606 225323 207196 200968 204365 212151 225080 228179 210622 204913 214892 231186 231541 225674 235866
32593 235866 232961 247874 270013 281532 251135 229156 208415 197552 200170 205699 244816 260100
32581 260100 256914 248288 242490 254128 258497 255567 267112 259142 270170 297996 303338 287712 284018
32568 284018 292023 280374 271769 254664 266388 283931 285007 297128 294991 273176 275347 282414 285005
32555 285005 298057 282542 269571 273221 292692 286725 292210 276991 274288 283139 282591 286834 275583
32542 275583 265332 265653 268507 278764 297726 299226 304976 290859 279118 294195 312120 315291 315496
32529 315496 313602 299027 294217 280249 292619 303521 305215 308086 301422 307995 314225 287544 289674
32516 289674 305211 293140 294273 294166 297879 304536 284525 293289 320921 319536 320580 302258 269446
32503 269446 269710 281583 306257 301010 296041 297867 301762 311822 311966 295605 282611 284416 279960
32490 279960 298212 297680 296974 293932 304055 309955 310321 317551 311631 293112 284094 306014 329871 330397
32476 330397 321416 305621 319272 319937 314198 321245 344268 341971 335990 335611 342856 351061 346879 346099
32462 346099 329903 333881 334574 346230 369874 357026 347185 340118 342085 335637 325358 302513 311780
32449 311780 319624 314663 320751 326665 317813 326069 333166 321763 317011 329336 332194 342180 348935 330128
32435 330128 317560 323533 306739 303734 313778 311426 313792 313030 305513 304444 304735 325604 340963
32422 340963 340145 329674 318975 329107 334728 314399 297179 310774 302063 296920 316409 337759
32410 337759 350668 356972 330546 306543 297449 305555 327722 333252 328902 324372 347705 360438 374098
32397 374098 380733 379478 362585 382670 395638 393055 375273 363519 352626 368982 376851 390130
32385 390130 383887 350029 334176 342444 359709 353299 327007 339714 339795 354366 351653 372288 360871
32372 360871 320698 308458 311626 331593 333896 347742 371397 391483 398501 378244 371983 374499
32360 374499 359865 368031 364318 353031 358850 345004 364260 387797 395554 374851 366538 374152 356969
32347 356969 355976 357395 352237 343724 336226 348457 372358 376526 352865 357872 386149 407920 391906
$$ [...]
##END NTUPLES=NMR SPECTRUM
##END=
