##TITLE=Analysis number 328220
Compound Code cc 62826
Book Reference 518/107
Project Code adrs
Chemist Name colinb
##JCAMPDX= 6.0         $$ Bruker NMR JCAMP-DX V2.0
##DATA TYPE= NMR SPECTRUM
##DATA CLASS= NTUPLES
##ORIGIN= Bruker BioSpin GmbH
##OWNER= nmr
$$ XWIN-NMR		Version 3.5
$$ Tue May 15 09:09:21 2007 GMT Daylight Time (UT+1h)  MAYBRIDGE\nmr@NMR_250MHZ
##.OBSERVE FREQUENCY= 250.131544655141
##.OBSERVE NUCLEUS= ^1H
##.ACQUISITION MODE= SIMULTANEOUS (DQD)
##.ACQUISITION SCHEME= undefined
##.AVERAGES= 16
##.DIGITISER RES= 18
##SPECTROMETER/DATA SYSTEM= dpx250
##.PULSE SEQUENCE= zg30
##.SOLVENT NAME= CDCl3
##.SHIFT REFERENCE= (INTERNAL, CDCl3, 0, 16.522)
##AUDIT TRAIL= $$ (NUMBER, WHEN, WHO, WHERE, WHAT)
$$ ##TITLE= Audit trail, XWIN-NMR		Version 3.5
$$ ##JCAMPDX= 5.01
$$ ##ORIGIN= Bruker BioSpin GmbH
$$ ##OWNER= nmr
$$ C:\u/data/dgb/nmr/ADRS/1000/pdata/1/auditp.txt
$$ ##AUDIT TRAIL=  $$ (NUMBER, WHEN, WHO, WHERE, WHAT)
(   1,<2007-05-15 09:08:54.79 +100>,<MAYBRIDGE\nmr>,<NMR_250MHZ>,
      <created by zg, POWCHK disabled, PULCHK disabled
       configuration hash MD5:
       76 6E 9A 78 1E 09 19 81 EC 84 63 8F B0 6A 59 2D
       data hash MD5: 64K
       CD 8B 92 21 78 C9 7A 84 53 5D A5 E4 81 92 22 FF>)
(   2,<2007-05-15 09:09:10.20 +100>,<MAYBRIDGE\nmr>,<NMR_250MHZ>,
      <Start of raw data processing
       ef LB = 0.3 FT_mod = 6 PKNL = 1 SI = 32K 
       data hash MD5: 32K
       44 96 F0 88 F3 3E E4 A3 45 8E 28 4B DE 63 FA 2C>)
(   3,<2007-05-15 09:09:12.01 +100>,<MAYBRIDGE\nmr>,<NMR_250MHZ>,
      <apk 
       data hash MD5: 32K
       9F FD 01 F3 E8 A5 C4 E1 5F 34 62 E4 EF 76 0F 50>)
(   4,<2007-05-15 09:09:12.79 +100>,<MAYBRIDGE\nmr>,<NMR_250MHZ>,
      <abs ABSG = 5 
       data hash MD5: 32K
       37 6A 3D A6 B0 1A 36 5F 81 B4 75 CD C3 2E 57 E2>)
$$ ##END=
$$ 
$$ hash MD5
$$ D8 46 E1 80 D1 89 3F 10 FB 3C 17 1D A0 D9 18 B8
##$RELAX= 
##$RELAX= 
##$RELAX= 
##$RELAX= 
##$RELAX= 
##$RELAX= 
##$RELAX= 
$$ Bruker specific parameters
$$ --------------------------
##$DU= <C:\u>
##$EXPNO= 1000
##$NAME= <ADRS>
##$PROCNO= 1
##$TYPE= <nmr>
##$USER= <dgb>
##$AMP= (0..31)
100 100 100 100 100 100 100 100 100 100 100 100 100 100 100 100 100 100 
100 100 100 100 100 100 100 100 100 100 100 100 100 100 
##$AQSEQ= 0
##$AQ_mod= 3
##$AUNM= <au_zg>
##$AUTOPOS= <41 >
##$BF1= 250.13
##$BF2= 250.13
##$BF3= 250.13
##$BF4= 250.13
##$BF5= 500.13
##$BF6= 500.13
##$BF7= 500.13
##$BF8= 500.13
##$BYTORDA= 1
##$CFDGTYP= 0
##$CFRGTYP= 5
##$CHEMSTR= <none>
##$CNST= (0..31)
1 1 145 1 1 1 1 1 1 1 1 1 1 1 1 1 1 1 1 1 1 1 1 1 1 1 1 1 1 1 1 1 
##$CPDPRG= <>
##$CPDPRG1= <>
##$CPDPRG2= <>
##$CPDPRG3= <>
##$CPDPRG4= <mlev>
##$CPDPRG5= <mlev>
##$CPDPRG6= <mlev>
##$CPDPRG7= <mlev>
##$CPDPRG8= <mlev>
##$CPDPRGB= <>
##$CPDPRGT= <>
##$D= (0..31)
0 1 0 0 0 0 0 0 0 0.06 0 0 0 0 0 0 0.0002 0 0 0 0 0 0 0 0 0 0 0 0 0 0 
0 
##$DATE= 1179216533
##$DBL= (0..7)
120 120 120 120 120 120 120 120 
##$DBP= (0..7)
150 150 150 150 150 150 150 150 
##$DBP07= 0
##$DBPNAM0= <>
##$DBPNAM1= <>
$$ [...]
##$SUBNAM7= <"">
##$SUBNAM8= <"">
##$SUBNAM9= <"">
##$SW= 20.6930455092707
##$SWIBOX= (0..15)
0 0 3 0 0 0 0 0 0 0 0 0 0 0 0 0 
##$SW_h= 5175.983436853
##$TD= 65536
##$TD0= 1
##$TE= 683.16
##$TE2= 300
##$TE3= 300
##$TEG= 300
##$TL= (0..7)
0 120 120 120 120 120 120 120 
##$TP= (0..7)
150 150 150 150 150 150 150 150 
##$TP07= 0
##$TPNAME0= <>
##$TPNAME1= <>
##$TPNAME2= <>
##$TPNAME3= <>
##$TPNAME4= <>
##$TPNAME5= <>
##$TPNAME6= <>
##$TPNAME7= <>
##$TPOAL= (0..7)
0.5 0.5 0.5 0.5 0.5 0.5 0.5 0.5 
##$TPOFFS= (0..7)
0 0 0 0 0 0 0 0 
##$TUNHIN= 0
##$TUNHOUT= 0
##$TUNXOUT= 0
##$USERA1= <user>
##$USERA2= <user>
##$USERA3= <user>
##$USERA4= <user>
##$USERA5= <user>
##$V9= 5
##$VALIST= <valist>
##$VCLIST= <CCCCCCCCCCCCCCC>
##$VD= 0
##$VDLIST= <DDDDDDDDDDDDDDD>
##$VPLIST= <PPPPPPPPPPPPPPP>
##$VTLIST= <TTTTTTTTTTTTTTT>
##$WBST= 1024
##$WBSW= 4
##$XGAIN= (0..3)
0 0 0 0 
##$XL= 0
##$YL= 0
##$YMAX_a= 235675
##$YMIN_a= -233143
##$ZGOPTNS= <>
##$ZL1= 120
##$ZL2= 120
##$ZL3= 120
##$ZL4= 120
##$ABSF1= 16.522
##$ABSF2= -4.171173
##$ABSG= 5
##$ABSL= 3
##$ALPHA= 0
##$AQORDER= 0
##$ASSFAC= 0
##$ASSFACI= 0
##$ASSFACX= 0
##$ASSWID= 0
##$AUNMP= <proc_1d>
##$AZFE= 0.1
##$AZFW= 0.1
##$BCFW= 0
##$BC_mod= 0
##$BYTORDP= 0
##$COROFFS= 0
##$CY= 12.5
##$DATMOD= 1
##$DC= 0
##$DFILT= <>
##$DTYPP= 0
##$F1P= 14.0000005364418
##$F2P= -0.99999901652339
##$FCOR= 0.5
##$FTSIZE= 32768
##$FT_mod= 6
##$GAMMA= 0
##$GB= 0
##$INTBC= 1
##$INTSCL= 1
##$ISEN= 128
##$LB= 0.3
##$LEV0= 0
##$LPBIN= 0
##$MAXI= 10000
##$MC2= 0
##$MEAN= 0
##$ME_mod= 0
##$MI= 0
##$NCOEF= 0
##$NC_proc= -5
##$NLEV= 6
##$NOISF1= 0
##$NOISF2= 0
##$NSP= 0
##$NTH_PI= 0
##$NZP= 0
##$OFFSET= 16.522
##$PC= 1
##$PHC0= -53.56538
##$PHC1= 13.19269
##$PH_mod= 1
##$PKNL= yes
##$PPARMOD= 0
##$PSCAL= 4
##$PSIGN= 0
##$REVERSE= no
##$SF= 250.13
##$SI= 32768
##$SIGF1= 0
##$SIGF2= 0
##$SINO= 400
##$SIOLD= 32768
##$SREGLST= <1H.CDCl3>
##$SSB= 0
##$STSI= 32768
##$STSR= 0
##$SW_p= 5175.98343685301
##$SYMM= 0
##$S_DEV= 0
##$TDeff= 65536
##$TDoff= 0
##$TI= <Analysis number 999999
Compound Code 99
Book Reference 9
Project Code 9>
##$TILT= no
##$TM1= 0
##$TM2= 0
##$TOPLEV= 0
##$USERP1= <user>
##$USERP2= <user>
##$USERP3= <user>
##$USERP4= <user>
##$USERP5= <user>
##$WDW= 1
##$XDIM= 32768
##$YMAX_p= 420059205
##$YMIN_p= -679860
$$ End of Bruker specific parameters
$$ ---------------------------------
##NTUPLES= NMR SPECTRUM
##VAR_NAME=  FREQUENCY,     SPECTRUM/REAL,   SPECTRUM/IMAG
##SYMBOL=    X,             R,               I
##VAR_TYPE=  INDEPENDENT,   DEPENDENT,       DEPENDENT
##VAR_FORM=  AFFN,          ASDF,            ASDF
##VAR_DIM=   32768,         32768,           32768
##UNITS=     HZ,            ARBITRARY UNITS, ARBITRARY UNITS
##FACTOR=    0.157963299565203, 1,           1
##FIRST=     4132.6476996994, 0,             0
##LAST=      -1043.33573715361, 0,           0
##MIN=       -1043.33573715361, -679860,     0
##MAX=       4132.6476996994, 420059205,     0
$$ Real data points
##PAGE= N=1
##DATA TABLE= (X++(R..R)), XYDATA
$$ [...]
28322 -386615 -321027 -206419 -151651 -125175 -36088 -61889 -136152 -28625 -78103 72839 179289
28311 179289 108834 71651 22607 43564 -114653 -176987 -79895 -35397 -71136 112029 109934
28300 109934 -22617 -102060 -143501 -146125 -200325 -238231 -330544 -244389 -82170 161071 149181
28289 149181 -113549 -208638 -131185 175573 375590 453611 553393 464459 126770 10572
28279 10572 186138 197331 61931 135046 259065 154510 -123005 -105545 22503 60484
28269 60484 15792 -30401 -163878 -247860 -117134 -20333 9300 174489 -11508 -79931 -66462
28258 -66462 -9993 -75348 -1248 -4321 -45087 -177200 -196229 -80163 -44711 -37536 -34462 -19012
28246 -19012 18329 104705 133302 3184 -108024 -30138 101336 226959 282985 189592 152610
28235 152610 134027 104896 110460 -18344 -142610 -86608 -112049 -94976 -75964 -55438 -11766
28224 -11766 122713 68455 -13745 -91526 -61942 -69313 -116184 -46495 67460 91529 -51978
28213 -51978 -30874 85773 60246 59646 -24668 -67919 -90844 -165414 -52345 93742 74130
28202 74130 8393 -116897 -165443 -72580 -166350 -77693 4125 58066 105141 190276 213932
28191 213932 200489 321152 177809 25835 -118633 -82496 13796 52907 79935 78819 89176
28180 89176 147569 245024 98596 -68528 48890 33054 104385 191900 -32530 -98274 -222880
28169 -222880 -216127 -40224 43285 -79719 -119716 -84046 -73430 997 -708 -21942 -54726
28158 -54726 -189048 -223907 -182506 18704 378112 519214 621095 450964 220833 63980
28148 63980 -49828 -278613 -375865 -314438 -222959 -323331 -280017 -115512 -137990 -8453 104770
28137 104770 39912 -100513 -179109 -79547 -87917 -82052 -114108 -198670 -119850 -90085 -141084 -113309
28125 -113309 -35813 -200083 -217181 15638 231020 140209 99245 73588 76835 90579 88986
28114 88986 221222 172697 2216 19469 32884 -63797 -42158 -167108 -132551 23670 156125
28103 156125 152695 -92099 -163778 22590 141931 30165 -45763 -138508 -139488 -68733 -103118
28092 -103118 42672 6325 -210648 -186337 -55330 56176 120335 203589 32729 -31799
28082 -31799 -44774 -41287 6450 73454 -22097 20107 103058 292493 304272 160077 27934
28071 27934 -60701 -29259 42876 84027 247159 262564 442362 298747 193467 203054 148365
28060 148365 213646 20394 -151464 -219334 88179 146236 31025 -150696 -193287 -88844
28050 -88844 -10650 39638 -195731 -128689 7602 28649 181145 200458 203804 338043 151203
28039 151203 181521 350155 363167 238722 -101 -166732 -219606 -390175 -242054 46556
28029 46556 85031 123671 156441 112246 -4647 -120110 -60623 96914 41751 -959 74514
28018 74514 17210 175466 282844 202071 164346 225869 173101 187261 91971 -93534 -219093
28007 -219093 -209074 -232983 -227716 -110291 -3518 -4503 69661 142788 81662 -36776 -90895
27996 -90895 -17165 42726 269295 261794 37313 -136562 -81230 -118583 -104028 -52153 -138640
27985 -138640 -237900 -154837 5720 89482 -1725 -146980 -147211 -193468 -173773 -5857 18915
27974 18915 -140496 -175508 -188786 -275393 -99091 15120 79766 -40961 -71864 -31859 112269
27963 112269 63678 -17307 132863 68884 7563 116033 224719 294884 262395 389396 325308
27952 325308 271546 183997 28011 -114432 -252334 -156778 -182309 -67742 -79949 -126122 -100486
27941 -100486 -183860 -43580 147389 89230 21031 -146810 -137504 -3909 6755 -158504 -74167
27930 -74167 -19524 -174840 -192615 -128168 -59568 48899 116502 233672 391992 418163 166813
27919 166813 -54315 -168199 -92911 -31760 16666 -38800 -57937 -130892 -133955 68028 -2727
27908 -2727 -61899 18821 25634 9248 -50704 -119450 -245681 -315570 -199253 -156383 -107661 -73902
27896 -73902 -205827 -232054 -173109 -85921 -71902 58793 113787 -24101 -77721 -21916 43409
27885 43409 150097 47592 -124929 -34975 108211 20660 112868 198131 107284 17893 80030
27874 80030 16430 35050 95128 115810 29364 -119782 -226199 -47304 25519 3185 -40858
27863 -40858 -46929 159942 276554 187201 91229 77900 63813 -33910 -68709 -24594 -5157
27852 -5157 -21383 59713 237447 189803 72549 44767 138359 220819 231922 182748 156299
27841 156299 102562 6421 -56452 1352 119708 87226 58154 94611 20793 -69724 -148109
27830 -148109 -141517 -106864 -25683 -4680 -56055 -90952 49813 9000 -142762 -86346 -34616
27819 -34616 83152 135037 7340 -39139 -202929 -179588 116222 296330 267778 5829
27809 5829 -153932 -107698 -127633 -189355 -66298 38824 -84579 -142604 -34442 122430 -45600
27798 -45600 -42998 -18894 -150357 -211454 -129345 -15080 49721 245325 405059 288811 170674
27787 170674 178327 247291 266345 277204 110432 286530 394860 338045 260971 117388 34932
27776 34932 -57537 -58092 -174807 -217642 -218706 -100445 57714 34302 -111592 -179257 -130291
27765 -130291 -49488 -204914 -198160 -210405 -273739 -169903 -146499 -124620 -125924 -182712 -175384 -138995
27753 -138995 -61881 -121878 -117907 46175 33037 -78712 -51576 -9583 178529 319621 306736
27742 306736 362429 349976 90219 118055 272924 126260 -43845 114332 96790 52810
27732 52810 157198 76222 -126683 -37453 100526 148500 82951 19592 -24767 -197514 -99336
27721 -99336 12459 143513 65633 112623 56570 95691 347213 257093 -62898 -92679 -97394
27710 -97394 -311206 -312727 -350057 -191900 -103668 -137308 -95587 -9694 166097 250260 239411
27699 239411 222513 82683 175085 183250 34812 -174299 -177156 -240018 -318362 -239308 -91747
27688 -91747 17998 -448 102680 66377 -19751 72329 159503 -113385 -130673 157559 99646
27677 99646 98175 231863 270568 245265 166064 198259 241010 145794 83225 92939 181351 151114
27665 151114 29895 2153 65250 163132 106421 8522 141302 134959 -69501 -216629 -235513
27654 -235513 -4766 57342 -49906 -361768 -321690 -126961 -44027 -109129 -254540 -39517
27644 -39517 -93981 -206938 -76253 4031 -109342 -89055 -65439 -99846 -168404 -284113 -205345
27633 -205345 -157674 -40697 84814 156365 40838 -181778 -259979 -395283 -353653 -264782
27623 -264782 -151745 38876 91067 -5114 -112129 -138409 -102276 72182 72496 44983 136584
27612 136584 42162 19458 181819 173445 165437 112573 186107 164396 190113 184660 -1635 -114396
27600 -114396 -95329 -11350 -49395 35748 117994 178003 208278 78109 141541 309544 376582
27589 376582 153783 116028 101225 110513 -30385 -89583 -67602 95139 130191 27624 85750
27578 85750 99864 -100588 -135283 -42860 35970 114975 80223 -4325 148335 303294 321132
27567 321132 357639 187314 -5098 26780 172369 -5089 -178212 -121624 -160967 -251320
27557 -251320 -303228 -276891 -92057 -63750 -57481 -9973 83650 84390 18962 10667 24960 -138683
27545 -138683 -97761 116084 57330 -3478 -169013 -331125 -149646 57514 272816 202040
27535 202040 12453 28274 -139469 -146836 -79036 57777 103425 233382 236738 210339 68703
27524 68703 37741 158120 6579 6739 137198 163508 118474 97324 213945 26561 -91752
27513 -91752 -171025 -124202 85473 121762 -37247 93085 357466 462120 383601 308866 147649
27502 147649 130245 149315 20898 37206 69027 -9749 -215440 -268487 -202408 -157528 -74456
27491 -74456 -200204 -417852 -568005 -323573 -82947 -89442 -35937 175207 135941 -185009
27481 -185009 -484153 -548562 -411340 -341222 -391782 -354626 -241396 -230078 -245342 -87922 24996
27470 24996 92904 137146 123357 71091 97657 79508 6145 45079 -71517 -105313 -159770
27459 -159770 -220531 -134438 -96670 -180916 -194982 -137487 168255 279526 324021 307477 146152
27448 146152 117811 74971 58333 -120767 -254041 -257934 -126677 16256 220878 255067 183609
27437 183609 110192 -87310 -149792 -173998 -121330 -31134 -63791 -61659 -125188 -212526 -139764
27426 -139764 -115208 -95991 -25633 -108176 -103905 -71093 -75144 24097 225236 211761 106849
27415 106849 -35208 -136046 -277082 -338830 -233101 -127301 -76272 180270 284692 358788
27405 358788 345700 343888 163365 116690 147254 306348 267792 183683 159370 240342 139280
27394 139280 54980 117761 167742 264712 221297 181051 106817 152899 15960 -110024 -100976
27383 -100976 235336 371140 279296 95329 128689 65292 -36474 136570 65862 -2062
27373 -2062 60155 82251 34864 8691 -26269 24295 -129100 -215119 -204475 -137766 -69246 16397
27361 16397 69328 142752 2198 -53880 -39072 -61387 115531 288458 196599 63301 11573
27350 11573 -35333 -17805 -80416 79183 61830 2413 20678 90601 114595 218326 230246
27339 230246 364152 529056 401513 267552 229457 190512 175161 140275 167722 176151 191400
27328 191400 233560 325054 434080 262131 67531 54401 43918 164672 165865 149624 159873
27317 159873 120596 103394 -48191 -31199 129338 225727 254429 25362 -133476 -53589 -107098
27306 -107098 -163039 -79400 -107847 -139044 -95319 -63062 -20547 25046 48339 -42494 -134968
27295 -134968 -123057 -53870 62064 -32722 22929 15563 96396 111912 223090 277611 255342
27284 255342 340957 204920 -17589 -64398 5984 59990 -54283 -122484 -105329 -15707 132038
27273 132038 89916 42319 -61639 -190978 -301915 -235839 -201871 -61936 109487 69942
27263 69942 -50799 -111478 -192188 -61980 -3680 103494 141235 27812 38942 8300 -25900
27252 -25900 -118227 -92082 -23891 54382 112040 -44443 -3522 239817 351411 275062 244937
27241 244937 300874 262951 122592 194111 256465 360684 350382 214982 167029 45645 -14812
27230 -14812 75612 113478 49776 7236 -46596 -227723 -284643 -206364 -257451 -437042 -386523
27219 -386523 -333638 -338729 -162407 -179990 -46996 47093 21608 186181 153422 56683 152852
27208 152852 345440 103529 -65037 1847 74884 113461 123323 -20115 -128149 -3440
27198 -3440 125662 256766 198057 107774 44161 60296 44941 113447 274249 297821 373991
27187 373991 227774 144200 97271 -17314 15805 119565 113873 41642 187049 335944 198583
27176 198583 191075 159752 238640 165662 91343 66767 -87124 -26842 -2124 17340 62636
27165 62636 209000 391561 399235 201641 -29066 -137932 -87673 41017 51884 154641
27155 154641 339873 352896 195161 54370 183423 249749 198066 48488 -31843 89418
27145 89418 213977 179795 148208 173643 -61987 -104438 -68012 -218619 -207164 -113301 -175311
27134 -175311 -166159 -46627 -21364 -86111 59145 -104556 -87832 -67425 -129203 -26785 18370
27123 18370 29303 79572 176334 114328 52708 21118 11588 -45389 -154375 -87582 -8211 -56049
27111 -56049 -41695 -54929 19441 174999 251199 396904 355763 301768 343059 328385 232854
27100 232854 191931 291303 361154 315639 89837 -223145 -218527 -79079 148228 224035 245070
27089 245070 325490 300947 187923 135065 260393 301235 212809 63964 -111586 -147617 -113867
27078 -113867 100171 188649 -61776 -138836 -170360 -204132 -84949 12913 56372 -71912 -130789
27067 -130789 -120281 123391 156571 207395 281301 80690 80732 -48492 -108842 -160735 -224630
27056 -224630 -238849 -221889 -169189 -154156 -203334 -189591 -136595 -145788 -270206 -312990 -49092
27045 -49092 218009 219991 156818 88236 38485 -158824 -315688 -307087 -118761 25372 150995
27034 150995 70731 75526 123613 187089 116555 -163900 -153545 -186042 -154938 -143704 -15264
27023 -15264 150311 174920 125301 -31280 -114988 -108009 -173217 -254568 -346178 -174691 -106083
27012 -106083 29040 89558 -119542 -186605 -101796 -88164 -63274 -273119 -404692 -284015
27002 -284015 -149545 -122338 -67489 -8981 33045 -32627 98959 -56782 -93598 18082 100103
26991 100103 44808 67658 22761 36167 49835 122744 150462 113715 -13150 9047 70826
26980 70826 47834 122090 139809 9678 -78578 -79965 -62687 -103605 -140665 -46870 76458
26969 76458 163102 82577 -75120 -122105 -117693 -84698 63481 60619 138326 179373 149514 4051
26957 4051 -341553 -389083 -304508 -304281 -137664 -105538 -63160 -83588 -55127 -12313 -124027 -106766
26945 -106766 -37942 65311 87544 217314 286301 73970 38670 -103399 -137650 -20647
26935 -20647 53063 -24876 -61781 273520 467202 296535 98507 -35951 -2647 80617 52371
26924 52371 -384 -8690 194706 374915 265743 222606 125704 131298 -52937 -315631 -303458
26913 -303458 -204574 -201707 -270219 -372588 -288372 -49387 205425 272830 241754 137395 168114
26902 168114 144307 -71220 -288565 -266092 -213345 -106067 -22583 -71315 -212211 -95831
26892 -95831 86205 314071 196738 -127512 -161692 -178274 -95692 116635 251530 57710
26882 57710 30649 -145206 -303516 -223301 -115262 -34814 -73944 -116545 -29167 -5986 343
26871 343 -130137 -53063 10250 142067 203976 200022 300847 295080 133113 90952 156251 243536
26859 243536 171447 31991 170576 311909 395421 351429 288263 221402 171053 83376 133849
26848 133849 -5525 -109027 15921 83314 134876 195415 32274 -25590 17878 -44015 -96003
26837 -96003 -182984 -168132 -93803 11144 248973 418501 305319 34534 -2948 -184329
26827 -184329 -178476 -81640 -199752 -270888 -46355 78192 114149 136011 33686 -125079 -41166
26816 -41166 28841 33837 147601 225343 169276 -82241 -207817 -301183 -191738 -34102 122586
26805 122586 154981 66337 -17557 -240332 -120641 -53131 -79795 -110643 -61941 18227 -149168
26794 -149168 -197782 -117616 63668 163158 186063 59686 -140501 -256279 -245625 -200293 -115137
26783 -115137 -25824 52059 -36985 -12642 117182 142477 -27778 -188445 -191720 -230023 -79323
26772 -79323 4869 -42960 -95813 -136037 -33599 238647 131144 214583 289169 181507 -36137
26761 -36137 -127696 -98201 -24473 -88764 -20578 1627 20215 2718 72906 68544 11424 -134548
26749 -134548 -22840 129027 82808 141748 185124 217436 258171 232233 204076 75716 -118863
26738 -118863 -42399 -80202 6997 159598 210321 138953 122327 17160 -60349 -88891 -58441
26727 -58441 -204057 -259980 110906 179105 34370 -98242 -21317 118187 95387 48823 -15969
26716 -15969 -111275 -51544 39382 57816 -153815 -406219 -444156 -490381 -355029 -192547 -40754
26705 -40754 22793 -42655 -33583 14035 -96238 -90177 23004 34971 -8164 87322 101549 47337
26693 47337 131659 188879 108031 -61148 -127114 -144738 -97173 -46588 -32237 -96076 -185170
26682 -185170 -232674 -126321 126885 284633 276227 285249 263475 58285 99398 111362 127044
26671 127044 13110 160718 196338 263167 368927 334999 235497 196928 311238 421745
26661 421745 473983 242713 140717 104767 26518 50096 12984 213384 204383 131095 175214
26650 175214 97830 68932 72038 8243 11350 -46193 -132492 -85620 77018 119806 -78332
26639 -78332 -236160 -325892 -334040 -299832 -277777 -148225 -223184 -64585 134766 141969 -2406
26628 -2406 -72539 -94270 40314 66500 76564 -33579 -105736 42029 -46140 -187848 -308384
26617 -308384 -232258 166280 275703 187363 230401 300550 354753 277084 121469 178291 92647
26606 92647 106900 115729 103548 110896 115967 68865 52508 -6217 -22051 -25356 -89536 -6203
26594 -6203 -55996 1276 37485 129176 237760 166801 242488 145632 36040 36329 181651 92273
26582 92273 -30760 95814 78270 129437 88356 -113794 -125758 65296 226548 281627 173805
26571 173805 73022 123258 -24370 -76445 -18878 3140 64591 110250 236610 173893 98146
26560 98146 50752 7031 46250 -70097 -213281 -331140 -169942 -11118 2927 -153293
26550 -153293 -173590 -263693 -132313 48647 54023 71431 -49153 -153744 -39855 80546
26540 80546 108647 -79189 -210405 -335968 -266713 21462 216534 -14356 -209956 -184972
26530 -184972 -113424 -74320 -82233 -192055 -234857 -205467 -73812 -155115 -237677 -332479 -394219
26519 -394219 -361888 -344313 -234088 -145780 -28516 -70354 -102193 -162777 -109231 -46170 15799
26508 15799 12194 -111675 -61693 107906 161841 170733 168412 11006 -80442 -131854 -111592 -142963
26496 -142963 -251301 -251274 -121525 24485 96381 1808 -12432 86462 -2898 -37108 -51635
26485 -51635 -22413 215185 357805 230440 278793 132566 -41366 -6926 40965 75022 110410
26474 110410 165721 94659 -154965 65923 185869 101556 -55289 -96798 -107868 80086
26464 80086 8487 334 -43857 80773 69026 113433 69132 -159765 -153918 -177619 -252154 -359836
26452 -359836 -368516 -237215 -104527 -161689 -75094 27414 78232 57297 20659 -38843 -37895
26441 -37895 45532 -30318 -250039 -212076 -180627 -159325 -172042 -233248 -202719 -161217 -60014
26430 -60014 -92836 -12723 -42883 -39007 -44840 -93060 -162774 -134805 -61702 74217 200973 138137
26418 138137 37856 -76402 -92017 -90655 -254711 -204895 -37447 106995 7794 -66097 -32117
26407 -32117 -174265 -228912 -224838 -22786 126653 75262 78345 140078 44761 171683 186154
26396 186154 15522 -117897 -159380 -191691 -13414 -54729 -11635 -103952 -14040 -22958 -127174
26385 -127174 42356 117478 214095 246054 215722 193782 99834 70864 27654 -36703 17192
26374 17192 76 -61667 -37239 70900 24030 -143380 -187008 -44201 44318 224760 348521
26363 348521 241276 69203 47620 -27072 -132840 -186254 -293773 -241254 -311802 -309359 -281529
26352 -281529 -224981 -148404 -250604 -87067 -66066 -109476 -22626 -56639 -180529 -154801 -208887
26341 -208887 -185621 -253592 -373399 -59437 79390 14269 -83815 -90652 -87719 -7636 330307
26330 330307 282825 86199 -23888 76242 249401 161905 121496 117670 121893 239054 120119
26319 120119 79283 -43217 40727 32772 -74148 -78557 -68421 -88657 23575 75106 -9134
26308 -9134 71489 296778 183807 1658 -193666 -111290 43473 -98840 -306243 -253287
26298 -253287 -87488 -28426 112724 121172 193219 204982 178018 45023 8507 -8711 116128
26287 116128 -12516 -89290 12368 97175 180874 309543 280951 152596 188896 74561
26277 74561 -7059 -37027 43825 15323 -122167 -182133 -32720 -96873 -58408 11661 126441
26266 126441 203897 206428 146598 137551 200468 77055 -132616 -275384 -136548 -43158 -124458
26255 -124458 -102954 46373 -199058 -220195 -79055 117489 242921 274556 306473 213415
26245 213415 101675 -35782 -246667 -314683 -71046 145887 276019 234874 64155 8139
26235 8139 98707 -19782 -39056 107767 193441 225440 141909 -21870 -22943 -20805 14249 133667
26223 133667 179073 237929 121876 82460 34965 -58729 -110044 -18294 -59628 1819 41946
26212 41946 -83830 -212265 -87066 -63870 -205755 -210015 -186115 -218406 -186082 -286763 -358176
26201 -358176 -266233 3976 194100 141479 73697 198630 12058 -47183 -209863 -167889
26191 -167889 57213 4048 87812 42515 85970 162264 94283 -31814 -95655 -134232 -181447
26180 -181447 -143395 -105195 38903 52624 -6101 -80704 -108584 -14459 74423 232521 160006
26169 160006 180786 29463 -101491 -284727 -115035 229426 268807 212098 131065 102782
26159 102782 139948 81589 161707 75534 -21023 -12859 -221 -54563 -120723 -130399 -234761 -229689
26147 -229689 -325154 -290681 -72984 113541 -8483 -5169 43845 65027 -38064 -112713 -141898
26136 -141898 -46719 44295 5951 -116382 -96023 -6965 277421 439834 373744 352913 209616
26125 209616 75374 65578 -82843 -84201 4267 103739 76900 63860 132514 156977 185877
26114 185877 174373 105558 185914 224951 210763 197052 239101 212314 15237 -74565 33979
26103 33979 -103836 -137223 -185468 -97467 -1112 -49102 -222279 -144134 -176355 -192126 -246692
26092 -246692 -62621 -48189 -67478 -123344 -250994 -257473 -68051 37223 -55904 -99559 -221056
26081 -221056 -236022 -173405 -71736 -22258 -9697 46459 167646 110064 47197 63882 128750
26070 128750 173947 74787 -86257 -130583 -330606 -299496 -43618 45884 -887 7741 -7537
26059 -7537 103008 47866 -11129 -4975 48597 59770 23193 177592 254661 253359 223072 148241
26047 148241 7433 45547 63019 20904 -129185 -131908 -148540 -9927 212504 192895 202197
26036 202197 191772 -46733 -47665 -65635 15217 -87289 -140353 -143895 -114716 -72455 44732
26025 44732 67302 -146107 -201676 -25391 -56594 14206 35946 -53376 -185574 -128377 -183322
26014 -183322 22109 91563 149911 99981 -67130 -18260 134665 27202 -57116 -3095 49151
26003 49151 124811 -9351 -122501 -216952 -131997 73230 155045 61292 50041 -225037 -210274
25992 -210274 -40521 83603 169671 271458 159392 15419 -33065 -25400 -108308 -4949
25982 -4949 -32435 -91434 -98337 -92880 -153477 -176975 -69066 -12397 105334 24940 -43346 -151440
25970 -151440 -66416 19035 137534 196851 69757 -125421 -192107 -65314 46718 -4706
25960 -4706 -132183 -206961 -248762 -126997 -97998 -58681 78705 242404 294355 308468 294264
25949 294264 148013 66061 129349 156169 128485 83883 136877 -15054 -26348 177118 85831
25938 85831 -60843 -187071 -85455 77929 250328 175832 103522 -3487 -97197 -147503
25928 -147503 -167838 -214056 -186330 -147939 -79896 -84020 -115939 -138825 -196387 -167491 -80149 23182
25916 23182 -19150 -64737 -125632 -91119 -143333 -181688 -281229 -344953 -145171 75000 32533
25905 32533 115010 42507 -135288 -121191 -147146 -301531 -190636 -155147 -91707 -77497 -166267
25894 -166267 -136187 -14195 -7219 -45065 -15846 3592 62302 86079 -109067 -76938 76650
25883 76650 45008 -47151 105614 -447 -136224 -105348 -54013 86866 194842 49338
25873 49338 -221636 -298253 -196598 -136784 -64304 -88274 -83674 -121996 -190494 -94472 65369
25862 65369 114843 -182092 -177023 -69844 -18616 -104690 -306758 -247452 -26565 58559 83071
25851 83071 19559 66697 -67812 -209998 -182838 -109381 32295 81415 52272 -69320 -285079
25840 -285079 -196388 -21812 33564 -72352 -89091 -269462 -306218 -116609 -105195 -106045 -105527
25829 -105527 -137710 -229352 -174703 -203171 -196338 -158812 -131241 -196523 -232201 -185351 75575
25818 75575 296508 193740 121339 222230 275393 248003 194318 175336 99176 195550 114125
25807 114125 40677 5548 40615 6272 165820 200819 25099 -46785 -72814 -71185 57101
25796 57101 41380 -144282 -240261 -307948 -389342 -187375 -166239 -171896 -107519 15532 5410
25785 5410 -18611 54882 52899 -28881 -76412 45626 53682 124331 298827 199772 140722 273560
25773 273560 312171 390656 230651 95778 -12551 70173 60198 -232932 -231250 -36970 -178479
25762 -178479 -120904 41944 -29330 48287 96818 73146 34838 133792 255460 251548 245398
25751 245398 -64411 -272960 -389265 -464454 -397732 -261196 -258378 -230334 -92051 121743
25741 121743 281151 220971 -21415 -19564 121624 54981 -139379 -241133 -221019 -291308 -225728
25730 -225728 -86062 -2699 -22051 -103036 -215139 -219492 -93109 -131090 -359001 -311424 -202137
25719 -202137 -142688 -97478 -105149 -104905 -142051 -373193 -326697 -159455 -180440 -209721 -144408 -122804
25707 -122804 -136622 -138088 -114800 86611 294138 265275 98427 166200 144771 -41484 7409
25696 7409 30337 -20911 -119724 -263381 -387114 -230386 28196 139370 244270 239189 -27230
25685 -27230 -203330 -210079 -162042 -97709 -156341 -156227 -154449 -207890 -299593 -293296 -290019 -173507
25673 -173507 -139535 -152667 -121611 -204426 -263467 -273353 -234668 -165871 -133735 -172438 -208687 -50932
25661 -50932 61641 -18483 17505 111488 234689 237702 156767 29681 -115228 -51016 -25817
25650 -25817 31400 -32989 67918 74125 110500 79671 140911 31073 -127835 -92352 -6713
25639 -6713 88634 117550 12850 10349 64326 -60394 70641 121110 143940 17996 -100262
25628 -100262 25479 -4394 84140 38231 92196 117515 54473 -62072 -28863 -16480 -2824
25617 -2824 -11067 -80080 -33386 -71728 -36655 69388 -71712 -61135 37076 74916 -106298
25606 -106298 -231952 -102471 2079 -37195 -148858 -151454 -28942 95303 68741 -14419
25596 -14419 88783 161333 94751 40891 -105830 -122769 -73662 -125311 -120569 8920 186594
25585 186594 229923 210133 136390 304853 382548 267850 167480 104857 25978 -76047 106275
25574 106275 307325 294767 338386 201789 156053 41211 -93450 -126992 -83751 -202158
25564 -202158 -103709 -77948 -217480 -351569 -219993 -196743 -97530 -92636 -35217 69487 74802
25553 74802 168560 113083 279719 203059 94001 240727 225985 -85682 -253693 -164820 -176516
25542 -176516 -147146 -121749 -46257 7107 38391 44334 10797 58501 56784 -51963 101696
25531 101696 112886 44506 136950 155207 197554 199292 311566 289237 205845 30551 -91437
25520 -91437 -23546 138779 197197 208591 104427 540 52104 151428 99089 -15345 -141014
25509 -141014 -191674 -22310 -19491 -39983 63430 13187 66514 52512 106990 129291 121227
25498 121227 45192 11692 -52471 -51072 -41464 -87080 -124802 -155516 -40988 84119 153323
25487 153323 92284 12025 -118073 -59385 -46047 -660 7913 210152 279086 143248 155259
25476 155259 99148 -59033 -60702 -88118 -34757 121047 48904 -72880 -10332 58467 78333
25465 78333 76508 89977 152131 63722 70797 139273 94182 54464 29002 -8520 187995 177144
25453 177144 80797 -88473 -50100 24112 -18535 34659 9277 -110125 -243223 -326463 -256489
25442 -256489 -112869 -114350 -259064 -328161 -176923 -43717 210920 311668 263711 374740
25432 374740 325131 45055 -261015 -150983 -66696 -65859 -75823 -155167 -206351 -203268 -278940 -364970
25420 -364970 -303073 -235338 -137282 -10434 -35870 -132969 -49280 3107 -130123 -263410 -173254
25409 -173254 -114526 11136 157850 6460 -174966 -98847 -4557 52864 125889 -3079
25399 -3079 22297 84884 -19961 -195535 -196768 -190611 -155073 -75861 -14844 3893 53404 -98437
25387 -98437 -122760 -97923 20837 106733 87280 154633 95052 65016 -137549 -219405 -265718
25376 -265718 -316292 -67356 95360 197150 198942 224852 119794 139031 195089 211828 196404
25365 196404 262121 168925 224749 226588 1972 -172263 -246440 -133256 47702 140959 129408
25354 129408 37783 45502 -5125 -108498 77792 290428 337816 231712 450388 336609
25344 336609 133882 31803 34138 -4502 -125087 -194686 -104635 -123689 -94710 -33592 25842
25333 25842 106812 186154 235405 237411 187475 123007 123610 -18667 -156860 -159344 66625 113939
25321 113939 -25984 -84612 -138605 -142894 134172 124588 20156 3548 53177 120190 276483
25310 276483 261700 273088 309843 191193 95141 92761 174459 247506 186728 129022 99926
25299 99926 170621 105315 44578 -89453 -165241 -179875 -87976 12351 43189 59124 -142054
25288 -142054 -209892 -4157 22610 -118796 -208645 -144767 -213793 -205435 -99234 -83815 -106499
25277 -106499 36058 -13081 -102569 -147602 -83838 93320 267451 256842 223406 182410 230365
25266 230365 43037 -123818 -196206 -340493 -176393 -199161 -132986 26097 51174 142210
25256 142210 19455 -23629 -24598 -12848 149894 -14859 -203328 -167321 -106780 -2581 5589
25245 5589 -107679 -27449 -45758 -77779 -69065 -25945 53329 -56163 -59640 -49034 71370 127804
25233 127804 144355 183374 233678 299320 242565 130852 -72323 -97003 -79685 -65244 -8064
25222 -8064 -51646 4705 44594 -94069 -36584 -48251 -212911 -302197 -288738 -366468 -352039
25211 -352039 -321027 -219599 -224088 -151625 6281 85385 121331 75578 -163697 -231825 -302865
25200 -302865 -274240 88978 406020 224223 25245 97475 272605 296126 266721 155785
25190 155785 175086 246141 296835 267908 200897 133215 210090 135302 12046 -29315 -10124
25179 -10124 -44792 9627 91010 161250 114546 57509 -15769 37047 37511 -51585 -42387 59594
25167 59594 71968 64070 -96036 -13453 58686 3318 30911 80216 216459 346011 272790
25156 272790 23934 -140518 -13475 74100 50307 -17157 -59777 -156894 -228193 -149774 -129475
25145 -129475 -102728 -99200 -81137 -66627 -8494 -27100 -64404 -62940 -23040 -68808 -51277 113115
25133 113115 177181 167230 165865 204030 218082 175790 42448 31929 68540 94037 168231 273883
25121 273883 31522 -168438 -117601 -63526 -31007 -168753 -335636 -329963 -264575 -116389 -159800
25110 -159800 -81414 -92227 -31837 199624 255747 306738 259010 144508 -80345 -25989 27239
25099 27239 17218 -65625 120677 122598 40121 72494 119723 82556 24969 -42019 -58072 -105736
25087 -105736 -66797 -76838 37703 20448 -22145 212003 166166 -1901 -140576 -17047
25077 -17047 22685 -2304 -40657 -17151 182509 117265 -70339 -101840 -133844 -149158 -116318
25066 -116318 81832 144183 53161 22780 -56691 1421 96853 532 -113196 -134118 -160534
25055 -160534 -34229 31941 47952 25175 -82018 1247 126510 237449 233333 -33698 -54058
25044 -54058 -16797 24339 119384 95748 241400 236490 100476 81193 79448 21274 168694
25033 168694 111151 -112190 -186134 -252843 -207492 -95808 -45563 109298 121874 42452 -65785
25022 -65785 -249789 -87444 -27136 -171934 -31406 141113 102544 -6010 3089 80529 30535
25011 30535 27182 -101246 -102653 -4094 171148 256969 150261 259575 260921 -55713 -96161
25000 -96161 -26973 -31669 -110393 -199858 -226675 -148722 -81060 123756 341322 370593 237550
24989 237550 128565 102518 235591 335367 284177 264047 189483 32703 100559 47868 62489
24978 62489 28841 -89759 -131880 -28885 -200429 -101577 -36596 -165260 -114749 49130 69103
24967 69103 -6882 43750 94253 -2838 -116957 -51355 -78517 6031 -21707 -152179 -73812
24956 -73812 6051 129333 156628 227081 302078 389297 414929 214369 -61415 -224040 -40974
24945 -40974 2250 -73102 63264 157195 77615 -135238 -157969 -26627 -155216 -81124 -121444
24934 -121444 -91919 -133584 -255870 -30165 123246 -43339 -234469 -310888 -162965 -159030
24924 -159030 -105129 -84177 -235815 -205465 -164585 -43736 80821 104552 32974 75454 176298
24913 176298 -27628 -15358 169302 153155 -19870 -79512 61420 -12476 -10023 13751 -19735
24902 -19735 -57265 -153462 -135320 -66025 97621 279384 192445 184755 108440 145541 96763
24891 96763 -213970 -393862 -360399 -205159 -71254 -145597 -178304 -86645 153705 209443 223625
24880 223625 97139 54814 13364 -58113 -39080 -107100 -183767 -17757 -40007 -35863 16172
24869 16172 79287 -52528 -4670 -32779 -95263 -93803 104785 148397 -46835 -28195 102367
24858 102367 99742 203427 178204 18504 -88353 -126973 -57446 -69792 -32142 -75246 35853
24847 35853 134682 8599 73405 158417 120212 4161 -73663 -45535 303 126260 87368
24836 87368 -40635 -71533 23905 148208 242202 188870 195769 266445 356655 326127 183927
24825 183927 49271 70584 100704 86173 78527 69575 91875 179480 66396 126632 291474
24814 291474 357489 269784 154292 162567 50418 44196 -29874 -162518 -7123 -25992 -6357
24803 -6357 -57508 -136651 -139054 -60704 -2922 -59978 -2938 34 -1430 -16294 -11310 -29397 -156860
24790 -156860 -89227 -126658 -153395 -139736 -313096 -342554 -281261 -143107 -49045 -139469 -261434
24779 -261434 -276980 -220287 3922 154838 205059 175874 104722 -40982 -37587 -76763 -35857
24768 -35857 158397 255199 144866 7946 -73330 -132629 -174279 -84999 -104976 -75314 -26094
24757 -26094 -8423 -20612 -66559 -106776 -110222 -119460 3193 -48010 -178727 -234299 -167078 21395
24745 21395 2962 -20002 -106331 -73531 -185233 -343249 -187111 -16377 -194934 -325646
24735 -325646 -162750 91349 88730 -11206 -75596 100507 211890 268588 45090 -76888
24725 -76888 -159856 -145628 13118 82225 77666 55462 85129 -3189 -107315 20951 158313
24714 158313 218629 403112 282244 114909 -65990 -26198 90547 58300 56301 91403 47089
24703 47089 90004 105302 -51766 -181518 -56051 -23550 35641 4226 32128 -54712 -121255
24692 -121255 26478 55154 172999 374430 361841 434797 320744 231045 370890 427557
24682 427557 263010 72012 -64751 -65678 -113919 -67367 -180785 -139074 -88830 -173348 -195342
24671 -195342 -21983 -116755 -186870 -276157 -111586 -27170 31545 87103 206351 216580 311404
24660 311404 221952 95398 41691 -53451 -39633 20859 78477 -33734 161172 159051 50023
24649 50023 -24938 -24605 -145789 -3167 9723 4681 9718 14176 64817 153854 52014 193502
24637 193502 139179 181940 106001 93419 284012 241959 130343 77745 -24702 -44463 -33162
24626 -33162 99465 241320 204401 349111 437047 396651 305873 289437 214976 84422 -30869
24615 -30869 32296 27262 110250 97364 106339 232408 243674 180311 266378 175976 93374 101505
24603 101505 191220 61360 97979 84157 -26936 -131348 -8059 172732 249457 106010
24593 106010 -93168 -205416 -171068 -479 -123506 -262657 -315422 -296699 -113960 -5492
24583 -5492 -14282 47625 54565 158 109120 168555 213959 48953 13555 12491 -36040 -161906
24571 -161906 -34432 44175 -189651 -140846 -51223 -43811 -18288 42845 151002 277194 327112
24560 327112 182156 34643 -190190 -239113 -171705 -15265 -19425 -12106 41022 155265 70474
24549 70474 -16772 78327 151879 223635 309869 194702 3260 -161784 -192595 -114095 -29829
24538 -29829 50710 -54217 77214 229602 336268 203851 30953 137754 251709 309360
24528 309360 101548 -53670 -178618 -166856 -83620 -64160 -79170 48794 112171 37270 -123689
24517 -123689 -257382 -138063 50210 155290 4 -137577 -126052 -110586 -64678 -57703
24507 -57703 38835 -60370 -32211 -131075 -247168 -321926 -304320 -224146 -97410 24752 -46407
24496 -46407 -136464 -11613 178332 276295 182018 143810 51759 -66012 49108 13 -122944
24485 -122944 -204485 -49579 -159601 -234081 -249325 -204951 -69496 -13377 -118530 -208597 -114155
24474 -114155 55485 -23024 -78573 -135729 -44193 66336 71901 78130 52774 48573 -33707 49213
24462 49213 115200 -21501 -81215 -90154 372 -66055 -93429 -39475 -48779 -85691 -86973 -102466
24450 -102466 -77221 -211310 -328291 -364230 -250769 -89406 -145249 -303059 -240719 -298854
24440 -298854 -424851 -290886 -6244 -36422 -157916 -195176 -79500 -112183 -223262 -133250
24430 -133250 -63788 51372 111190 201827 189127 137914 116609 42258 -86009 -144470 -60286
24419 -60286 -120271 -58049 -22706 9491 217520 226435 280571 210466 23773 82971 131070
24408 131070 125686 134244 -19834 34202 -23530 32646 33284 -28759 138941 176257 260304 235071
24396 235071 79115 -90112 6362 68449 87310 77684 -33876 71668 79819 -117651 -159531
24385 -159531 -47172 166195 220928 99388 70271 124521 -69267 -243690 -364420 -272764
24375 -272764 -248053 -214262 -220110 -158184 -76695 -104701 -78059 -140684 -124320 -82251 42178
24364 42178 48825 -42995 -40588 94959 95731 213368 155533 49281 46781 38818 31560 -186151
24352 -186151 -283610 -43102 47357 -23678 -204527 -164163 -149940 -199256 -195569 -144253 -57820
24341 -57820 -76981 -183112 -260759 -170968 -135560 -104628 -153038 -176887 -177462 -334392 -351849 -103167
24329 -103167 60401 226117 212493 126046 4131 138862 109895 -11299 11436 -69725
24319 -69725 -188087 -59633 -129674 -268106 -277536 -189043 -120782 -159250 -196336 -260526 -270170
24308 -270170 -207306 -204049 -170989 -155148 -31549 191611 234271 242165 98867 -9211 -100276
24297 -100276 -14870 -133870 -231646 -357011 -280629 -56982 143558 105020 222363 263074
24287 263074 120255 -77931 -56662 -105322 -271263 -345409 -292177 -250175 -317261 -205809 -90831
24276 -90831 -76683 -44607 -80608 -169231 -178844 30032 129666 102743 54682 90619 45256 -59330
24264 -59330 -84825 -178299 -226910 -183077 -200534 -128499 -82701 -22826 -71434 -289172 -264494
24253 -264494 -266006 -335589 -263419 -182088 -52875 -29415 -35804 -79431 -64344 -31991 -14596 -143409
24241 -143409 -402245 -444460 -301872 -233475 -184051 -35997 91592 177790 145933 81056 -44092
24230 -44092 -36487 89393 -56401 -108802 -153620 -226413 -236951 -241144 -112311 -18808 130326
24219 130326 138757 22875 114461 182152 207188 71593 16134 98492 190307 176192 -61865
24208 -61865 -166543 -198630 -131041 -3594 124472 225902 155039 78389 13427 12315 39240
24197 39240 -22063 13016 126136 104516 -88797 -161322 -52509 20307 -80427 -145729 -55805
24186 -55805 113698 191224 95215 -8697 -114755 130084 257459 206266 235764 74309
24176 74309 -24756 903 211783 206806 182860 -6836 23965 153754 303732 209742 -21930
24165 -21930 -121665 -228165 -215835 -218854 -296586 -102236 -88121 -133683 -472748 -496839 -395896
24154 -395896 -294863 24287 209361 154629 52846 104174 152501 42271 -30386 -70938
24144 -70938 -22134 47574 -19442 80320 218810 255894 217223 57491 -4040 38864 39098 184359
24132 184359 -37984 -211858 -108476 -150350 -188730 -107794 -369 38922 -42642 -17443 -12733
24121 -12733 41837 -92629 -193262 -133580 -81453 -6525 254277 213763 30881 33945 120059
24110 120059 88656 -47909 -133790 -224854 -205542 -16657 42793 123338 164160 84628 -6087
24099 -6087 -33694 74965 -21732 -94836 -17351 -9976 46610 191632 83354 -79121 -29131
24088 -29131 212283 319918 168985 70653 39322 -24787 30495 76163 18392 25598 -114844
24077 -114844 -36203 62507 48309 -60563 23925 172948 -3090 -233669 -399951 -329917
24067 -329917 -154475 27595 40064 -59902 -68365 -45704 28053 80222 128121 177627 136322
24056 136322 91143 118524 90475 46086 120831 219088 87048 108532 127337 -36158 16325
24045 16325 110298 60335 -68095 -115885 64840 1888 19560 105455 -34544 -77416 16947
24034 16947 -63436 -179270 -140511 -298879 -188190 146271 259576 172423 -68761 -223708
24024 -223708 -155856 9314 -35503 -234284 -228748 -231026 -200738 9727 160071 85776 42410
24013 42410 63717 67482 53609 60689 210923 292858 116931 116274 149220 108047 35399 -67890
24001 -67890 -163488 -49484 170953 -15171 -165230 -218394 -209699 -272182 -238961 -249243 -316740
23990 -316740 -414139 -250511 53053 116438 207440 145955 135483 -13273 -178998 -230676 -395294
23979 -395294 -389956 -161383 -47892 -35764 72053 70480 184338 276615 193781 6644 17274
23968 17274 31266 17959 63734 205757 325630 187408 89527 -47122 20154 142302 192041
23957 192041 99024 -17760 -156042 -239643 -86491 160065 207790 28601 -34652 -160813
23947 -160813 -105377 198778 353093 160984 -23298 -83818 -84921 -250212 -228102 -245909 -190921
23936 -190921 -210115 -271998 -139619 -108527 19800 180410 125833 -100779 -239223 -293845
23926 -293845 -187204 -173422 -37728 -59023 -127055 10210 -52940 -128224 93797 134122 81079
23915 81079 160442 77346 103072 105409 86451 -67357 -173389 -222562 -235601 4621 -22085
23904 -22085 -190558 -246685 -48048 -85144 -218647 -246533 -175373 -121988 28228 -11004 65228
23893 65228 146149 14629 -200769 -149869 -161251 -17941 131479 85038 -26325 -59564 -85255
23882 -85255 -139323 -293167 -224236 -108266 -59437 58369 -64973 -161105 -58749 75691
23872 75691 65803 -69165 -140448 -86625 -55059 244099 258293 92506 -44763 -90935 -142070
23861 -142070 -164227 -263916 -155815 -156264 -195032 -199192 -74623 63097 78197 57843 35211
23850 35211 -47790 -145040 -90504 1321 -104603 17867 170056 205836 273225 284873 334372
23839 334372 408146 446682 433390 406564 376693 180287 88784 114580 -26708 -139345 -23821
23828 -23821 -44860 -51902 122204 140483 -174494 -303237 -226021 -29362 43747 -3512 -119782
23817 -119782 102155 251048 182385 33589 -33171 27806 23938 -84479 48718 149537
23807 149537 68974 189266 261365 117284 88695 3607 -152958 -380380 -355074 -243318
23797 -243318 -140361 -135386 -106230 -135898 -308612 -167241 38693 90921 -33255 -167650
23787 -167650 -217852 -182197 66758 140682 162402 179042 42144 19393 -44337 -114673 -79474
23776 -79474 -74573 -167702 -248142 -166230 -51262 242147 258749 120344 44669 1542 -18148
23765 -18148 -103160 -69004 28214 228389 243600 152344 66715 162748 245342 182001 230993
23754 230993 224919 133363 60798 173005 140077 92283 -49966 -205141 -119433 -244271 -370350
23743 -370350 -276554 -79143 -148525 -53909 -130668 -283141 -283036 -236422 -196723 -177154 8589
23732 8589 -29955 -163505 -112397 191295 223592 290612 312880 139547 60392 119790 250772
23721 250772 322026 427767 398601 177067 97557 288108 248569 -8426 -108813 -189649
23711 -189649 -386893 -400005 -215361 -182676 -189917 -24963 124906 279682 335986 84167
23701 84167 20994 31503 13519 37874 63331 128757 129855 105210 37722 -60614 -2606 44043
23689 44043 66534 134964 109834 149702 113506 52484 -97147 -211572 -269759 2962 235823
23678 235823 222379 77224 36533 52024 14269 -40507 -158463 -229703 -269988 -235435 -112953
23667 -112953 4690 249028 253885 129203 -113762 -147485 -111016 -125318 -34631 -30513 -27907
23656 -27907 -83856 -112784 -103350 34270 66330 170651 25230 -154835 -135741 -189135 -226307
23645 -226307 -204488 -62272 4150 -78409 -181594 -115738 -18292 122596 97759 -67052 -125665
23634 -125665 -22440 -74714 -131744 -90274 21591 67925 182577 187535 77789 -60454 -21133
23623 -21133 -86158 49290 -30782 -60835 103906 195719 -20243 -52984 -105175 -100798 -167014
23612 -167014 -200356 -59824 11955 -186328 -230410 4795 6227 -100768 -318508 -176858
23602 -176858 13721 28399 -181401 -8800 23413 16378 107086 159083 139007 -28251 -180263
23591 -180263 -90380 -342035 -407665 -270835 -81662 52008 85226 123377 -28833 -125579
23581 -125579 24138 -108197 -221147 -208129 -231880 -175741 -149070 -171536 -130151 -53790 28702
23570 28702 139074 216572 111735 70276 381 31513 -7144 -20543 -87997 3995 30683
23559 30683 109153 194570 274707 222885 86305 -83715 -125244 -222522 -228517 -245834 -185866
23548 -185866 -77753 36816 186934 77188 94702 59641 -12353 -165326 -213401 -243168
23538 -243168 -135128 -10686 116171 122409 226917 160001 184320 129513 145740 75991 136249
23527 136249 50356 102485 234746 99627 39499 17578 41427 29122 -14982 -13862 218225
23516 218225 231645 -18354 -22884 -43674 -139003 22320 171878 263002 205130 139866 150118
23505 150118 56337 -27131 -25725 2828 -17840 -132298 -18290 78790 -42500 1520 32191
23494 32191 -76790 -87429 -24732 -58294 6091 -14883 -54401 125976 209912 159282 278484
23483 278484 207704 19336 -43665 -205473 -341526 -535852 -512404 -358597 -170730 35883
23473 35883 135843 79143 -50241 -145183 -4586 84173 179520 -112549 -187243 -84255 19341
23462 19341 55497 56876 231541 363781 203285 105587 12050 -53826 98264 175805 146611
23451 146611 61821 -117320 -168612 -152721 -64154 -69514 -45999 -37862 24091 -41478 -81377 -96582
23439 -96582 -183319 -293734 -430160 -606536 -542273 -520483 -191801 -110843 -155966 -169113 -152763
23428 -152763 -153977 125614 168293 59865 -679 -28338 -46587 -15297 -149414 -136275 110346
23417 110346 96663 83222 23084 40325 122959 74289 94064 37790 42368 160534 192505
23406 192505 76879 36223 -84142 -77826 -130515 -121052 -58313 -128660 -92481 -68085 155472
23395 155472 54030 67170 102704 44233 -81223 58527 73347 -23633 22487 32282 -136055
23384 -136055 -130847 12140 -29693 2920 -276071 -445150 -301246 -192272 1114 119992
23374 119992 48596 18014 214311 166440 37400 -120818 -16904 -77755 -70164 98607 -42984
23363 -42984 -202308 -62406 -76694 -192634 -209000 36428 127852 -67657 -7702 50372 18265
23352 18265 88195 105904 96887 97012 -28590 -144596 -73313 -16274 120904 199629 211934 174386
23340 174386 30512 11898 3485 -204109 -364176 -272003 -250831 -186916 -92428 -174529 -101384
23329 -101384 -126447 -129139 -112279 104634 250089 93234 50482 -14741 -43186 3567 4156
23318 4156 -219513 -268748 -176330 -131850 -169466 -246984 -279346 -185679 -111285 144094 160940
23307 160940 31654 78913 -2535 -7928 -2009 -83999 -97818 -139747 -67899 -40641 125343
23296 125343 246032 9615 -123117 -168199 -58320 66527 34612 -11450 -54998 -45923 -99637
23285 -99637 -5304 -75949 -206641 -108863 -100080 -48725 48377 221809 194874 139835 135249 36450
23273 36450 46890 63815 23872 -41818 25736 114716 73778 -109096 -23947 132521 62426
23262 62426 -26584 108148 178324 226350 166473 114249 99137 -2249 92160 138263 203213
23251 203213 132999 94972 -90012 -227680 -252760 -89818 -57312 -13573 96296 237880
23241 237880 325986 228696 22733 -80483 7922 94822 34140 -105936 32796 -35943 -49763
23230 -49763 149591 80074 -199965 -223420 -73270 -132739 -246276 -300895 -274884 -134287 -197300
23219 -197300 -211624 -282178 -368002 -247067 -1906 -17426 -81154 -171552 -171848 -202160 -288138
23208 -288138 -400765 -465324 -405195 -324724 -214114 -1283 203901 240326 162333 75562 -110121
23197 -110121 -233848 -229259 -254762 -162791 -331215 -602588 -521582 -217772 -130249 -215702 -180763
23186 -180763 95680 327642 111689 46496 209273 99693 10870 -19883 -136855 -104155
23176 -104155 -23205 -138338 -175848 -146581 -221810 -154056 -147507 -320738 -251441 -43177 -152228
23165 -152228 -122518 1659 -124169 -119072 -877 -128743 -100066 -54587 3579 -69168 -194505
23154 -194505 -105285 -139234 -124525 -151295 -186661 -43591 59358 -15990 -95567 -147963 -251167
23143 -251167 -143929 -222355 -162043 112762 167226 -145862 -358051 -392848 -280961 -235622
23133 -235622 -22503 21909 -56564 -109533 -47450 -8494 -12630 -48617 -57875 -64090 -204906 -229489
23121 -229489 -129910 12389 108743 234166 195563 -22690 -173336 -149426 -112616 -117805 -83037
23110 -83037 -111123 -6514 -77366 -144425 -11690 -119895 -297962 -110347 9447 -74952
23100 -74952 -156052 -211867 -283265 -260425 -54632 110848 -92606 -189148 -68481 19580 117844
23089 117844 187390 345160 269380 250052 247613 80324 -82443 -254505 -118043 15842
23079 15842 -166181 -411136 -424417 -235870 -40010 116094 99372 49054 -83787 -205616
23069 -205616 -377925 -361535 -261586 -94990 19695 -77401 -283830 -198560 -78363 -87287 -193714
23058 -193714 -63972 40307 -56092 -243773 -122870 -96538 49872 4093 -15681 -67773
23048 -67773 -33928 18342 -194624 -300530 -63631 184925 198358 168144 293070 365567 104555
23037 104555 101212 174307 176069 264812 359439 213422 174117 125057 -4306 -62065 -145732
23026 -145732 -4576 30650 -144408 -199089 -281065 -259641 76536 260357 213192 108087
23016 108087 224597 294490 248337 96170 72055 132379 113979 36474 -219863 -314477 -230035
23005 -230035 -119272 -55654 -29974 -107999 -110580 -27269 -102014 -74505 -129015 -244792 -176395
22994 -176395 -112054 -232948 -325441 -252193 -143821 50701 6435 -112645 2513 28419
22984 28419 -57446 -97360 36497 -84607 -270066 -260170 -215673 -210508 -283109 -195312 10576
22973 10576 52936 41335 69129 72349 78255 125578 60657 -129059 -86493 -22742 -185728 -331562
22961 -331562 -294364 -108690 -162480 -93551 89334 191141 197061 247003 61362 -81519 12477
22950 12477 -21013 -144284 -127929 45796 -10871 55113 126152 -31967 9329 165326 231753
22939 231753 302781 298393 235917 331539 446747 441478 152374 51643 73689 -52512 -149798
22928 -149798 -172086 -153108 50815 108509 8682 -58377 -232665 -294351 -106265 58667 25338
22917 25338 41164 -2695 -116447 -81514 195332 361790 160044 312589 290346 187482
22907 187482 173726 178622 112301 1082 -72300 -13158 4222 44849 -156927 -319297 -418082
22896 -418082 -510146 -489145 -285984 -117419 -29550 70991 107112 55419 40184 -80056 -159353
22885 -159353 -124120 3236 161314 162318 153492 35893 -101292 -54201 25563 6004 -3378
22874 -3378 -182596 -242897 -251615 -244771 -230257 -124540 -96038 -68930 -9503 -165815 -259101 -84309
22862 -84309 -65736 -220893 -207761 -245252 -334831 -109818 -63474 -23280 -59787 -194467 -186759
22851 -186759 -226667 -117394 -25605 5130 12768 -2763 -139415 -178692 -135291 -98380 -159035
22840 -159035 -210775 -99311 -37069 -66107 66318 161422 107424 144611 138015 112971 18636
22829 18636 -34334 65442 -33328 -33999 36332 130856 114206 110335 136247 110583 27258 52819
22817 52819 22172 10524 -72903 -22357 -106233 -199816 -3958 150327 4395 11662 114045
22806 114045 3295 -71032 -54979 -32426 -11927 -168227 -200090 -182953 -49177 -25879 77894
22795 77894 139202 102361 185432 -3722 -210448 -165919 52339 140332 14247 -57792 -31216
22784 -31216 -56650 -40856 -134435 -122033 32326 148162 111969 39002 -24712 -91235 -85126
22773 -85126 44218 172236 118660 53305 -56282 -98298 -146900 -340777 -324585 -4595 135349
22762 135349 -65093 -93115 77085 220606 238349 261391 93171 150133 188456 11677
22752 11677 102211 122593 14703 39321 129738 352482 358579 306540 194620 -37266 -111133
22741 -111133 -64507 -101801 16639 33222 -72244 -114405 -252465 -327036 -170787 -56721
22731 -56721 -167091 -137361 -105098 -57163 -16205 119498 201373 225543 210063 210552 182866 26230
22719 26230 -70590 -124797 25779 139371 137526 114026 228707 280535 160542 33434 -108958
22708 -108958 -94949 -74489 -83760 -209210 -202512 -181463 -79551 60310 146080 177176 60682
22697 60682 74306 55615 51836 -12372 -102415 -114407 -187606 -141972 -78438 -95345 -171114 -159050
22685 -159050 -67125 -112303 -166346 -248596 -218594 -262957 -285684 -275474 -201428 -3506 160849
22674 160849 214398 160340 75209 118355 236121 244202 171478 264773 104777 -126919 -180195
22663 -180195 -322959 -358540 -309444 -190898 -35141 19076 -14485 124156 153932 29405
22653 29405 -134453 -214055 -213766 -151980 -211540 -242963 -251781 -377450 -113361 49667 -106062
22642 -106062 -57294 34949 186115 225484 -118134 -124494 35040 182966 316514 390186 370514
22631 370514 281041 229296 25462 -17217 160720 160708 89501 56433 22042 -108461 -64320
22620 -64320 -13239 36459 55004 26731 115207 158028 37025 -96537 -67767 6960 -70782
22609 -70782 -281941 -227848 33170 32259 -155681 -100999 1857 22344 33440 70591 111685
22598 111685 -769 -36674 47263 181454 175747 87044 152999 202236 88944 -86304 -89212
22587 -89212 36915 46635 -60352 -99267 -63985 -3076 46399 113697 21796 -191608 -250441
22576 -250441 -385106 -266489 -40763 44237 -166695 -153602 -26201 -37993 15323 136625
22566 136625 52001 -65443 -86210 -165268 -25894 65215 -7352 57864 70184 -72566 -11366
22555 -11366 55100 160332 -2893 -114799 -151464 -127049 -15886 109569 29685 44588 -15195
22544 -15195 -75455 -99750 -21715 215 114990 8055 -114642 -111792 -43302 -109774 -156165
22533 -156165 -184427 -213866 18031 -12579 75979 116938 39080 8031 -1797 33523 155621
22522 155621 288820 142026 121609 79049 76798 -30691 35722 152985 165207 126838 114707
22511 114707 -53647 -109459 -192469 -165692 21189 52764 160342 140562 274123 219403 81226
22500 81226 49217 -36705 -42513 -53827 -2922 -202349 -284899 -254561 -178400 -128896 -218028 -302670
22488 -302670 -356603 -284217 -195149 -180149 -233414 -274237 -350196 -317558 -253474 -56351 -89307
22477 -89307 -189414 -49690 22763 -140277 -305917 -306492 -323715 -351679 -235995 -57359 -102451
22466 -102451 -156903 -107311 63462 224168 145472 95388 130553 97614 128587 20801 -105224
22455 -105224 -228433 -340112 -308588 -129541 -161349 -144595 8962 199435 57630 -87931
22445 -87931 71884 52886 -97870 -176844 -220630 -300127 -135563 138778 177651 241146 210198
22434 210198 16130 -43322 132292 239066 207269 186235 201564 121676 -65688 -190134
22424 -190134 -222841 -92911 -31381 -182805 -86009 22790 87889 18182 -172377 -136166 -284302
22413 -284302 -366151 -85389 104314 101818 33654 35613 13070 -55199 73446 145990 71170
22402 71170 8197 186051 327010 221861 -9691 -15019 113041 -19769 -61339 5999 127735
22391 127735 348815 487259 475982 243513 72694 -60091 -177453 -36452 121616 113030
22381 113030 -25881 -11166 -45487 -65356 -9645 -75770 -138960 -73751 -86897 -159655 -58139
22370 -58139 50374 83897 63669 -21219 -35971 -139131 -186676 -41704 -87160 -98338 -137786
22359 -137786 -84585 67343 195154 232794 120303 21770 -33404 131432 117281 199982 139814
22348 139814 71728 9656 56069 5916 -96915 -4535 -106410 38849 133391 179149 151774
22337 151774 34208 -50952 -57048 -70074 -181129 -151412 -51684 -49386 -57788 -126739 -314993
22326 -314993 -344274 -230813 -103992 24791 83296 198971 -24731 -44293 124524 291109
22316 291109 448283 358686 276660 291367 128222 47476 -340 -12106 68506 39022 -96637
22305 -96637 -109278 -137598 -98660 93424 122397 181631 258708 155960 113775 33542 -48311
22294 -48311 28395 68978 15938 -159712 -251906 -120639 41884 91279 125644 193947 105022
22283 105022 -684 62304 81533 -81867 -48776 -271875 -243540 63041 187265 207571
22273 207571 258034 141397 -57428 -36491 70052 86840 100596 84353 -41948 -120618 -85394
22262 -85394 10297 189538 123609 -6920 -34353 -63619 -70696 -9402 28127 97843 43432
22251 43432 149675 34463 -18159 20565 -23093 -47312 -12651 28564 -71380 -22694 91175
22240 91175 211260 191170 33489 -70797 4704 140371 80397 4769 -28781 -92193 -245131
22229 -245131 -150127 -115636 -126431 -124564 -152065 -191786 -140752 -153388 -158757 -121660 -83793 20038
22217 20038 115616 185044 234446 184785 218165 380514 390156 239186 66649 26819 59570
22206 59570 29855 -141857 -299357 -430911 -488621 -307423 -60249 -54499 -37909 70540 16986
22195 16986 1682 -63844 -76826 125899 216024 239064 213692 203331 72618 -134990 -165661
22184 -165661 -177692 -86193 -51803 -50546 290 -44933 61676 2232 -139646 -60277 62840
22173 62840 33954 188816 192934 150522 1667 -217113 -326689 -371240 -357796 -376293 -457817
22162 -457817 -225011 -320183 -215509 -118974 -18665 -163641 -322999 -219512 -113260 46109
22152 46109 266854 308533 230636 268180 293558 292353 223814 88860 -140270 -188497 -176631
22141 -176631 -62905 214561 428255 381645 282300 100226 -166860 -176602 -169823 -120046 -11529
22130 -11529 126060 165471 56427 1888 -16619 -14468 -106533 -214024 -237295 -51627 27107
22119 27107 -68404 -271160 -45922 -33558 -98348 -233533 -289455 -168816 -138233 -65818 -35910
22108 -35910 38121 76702 -92448 -39304 -40754 -37779 -59310 -9036 55414 25686 -71433 -124621
22096 -124621 -69073 -144257 -102740 -154071 -11312 51238 2210 124469 132659 25414 -111515
22085 -111515 -258264 -353438 -242586 -179871 -173253 -86015 -34471 185416 119864 -24055 19885
22074 19885 193859 254993 276501 236188 80969 95258 44853 148845 174354 179330 216653
22063 216653 232307 247947 135361 66208 72218 48864 122162 121748 -49790 14794 66528 -22092
22051 -22092 -80459 -94559 -68224 37134 23266 80299 -75524 -35110 73525 109711 135960
22040 135960 119738 102371 22661 -61767 -10742 62684 79708 101143 55500 144712 226782
22029 226782 91108 -834 110332 10537 84391 145357 135831 113186 -22916 -20981 -51023
22018 -51023 -124876 23548 129951 295249 387870 267174 316773 343499 158265 -100728
22008 -100728 -260312 -124008 -118829 -91110 -4909 18162 -82193 -114591 -142906 7442 327633
21997 327633 364594 356248 171289 -67602 -148087 -149875 -233376 -211342 -220866 -109305 -93805
21986 -93805 -92864 -69374 -36811 12629 -91084 -79460 -103472 -88395 -120266 -228615 -257903 -414529
21974 -414529 -382460 -364833 -433400 -157968 71075 82098 10859 -11552 -4015 -86132 -98306
21963 -98306 -38148 -133639 -148374 -131395 -150784 -64152 -66014 -60074 -40130 -104031 -181974 -192922
21951 -192922 -189344 -186357 -219237 -279031 -175458 151257 181780 -12687 -71373 -127805 -105732
21940 -105732 36160 -13264 13382 224622 372702 316185 208415 23295 -5504 48980
21930 48980 11248 -128633 -218014 -133400 8782 -152134 -207312 -92434 -33637 57943 12513
21919 12513 111465 -13109 68684 60190 -109134 -170348 -135455 -45244 -6388 -50264 -39417
21908 -39417 -94237 -98830 -206728 -81294 -25432 -32694 105 35229 36579 -97120 -96706 -21018
21896 -21018 29064 113905 236480 331748 269074 181160 53349 -119625 -102847 -110315 -64953
21885 -64953 145124 202803 149891 76374 184190 158064 40515 -103363 -139925 -214806 -160758
21874 -160758 61619 27946 38990 160057 198501 212184 173512 -99162 -279489 -136529
21864 -136529 -111125 -186662 -242315 -187023 -4634 80643 151955 201837 187214 130765 49074
21853 49074 62574 74108 -68745 -193321 -68504 -82646 -185678 -202452 -109324 32856 -93373
21842 -93373 -109831 -89366 -25534 -54024 -190169 -151193 -54632 94124 138101 154110 58369
21831 58369 -48164 -153375 -123583 80525 85499 -179668 -228227 -158333 -29843 238499 257721
21820 257721 234226 151174 17664 46772 16975 130613 145717 115633 248779 324003 299145
21809 299145 211760 175139 286708 121501 -59719 -94495 -81881 -62312 16003 -72188 -113597
21798 -113597 -97070 35587 -51142 -194662 -212927 -197346 -278363 -228948 -180010 -65064 -198063
21787 -198063 -109837 27533 3472 -97375 -83843 138873 69486 -146280 2132 16213
21777 16213 -6106 39387 40160 -73689 45469 205814 56219 -83464 -244350 -235017 -148805
21766 -148805 27804 -10021 -23956 197365 288180 227938 70938 39959 25305 -60344 -73839
21755 -73839 -15429 80515 39645 -30479 18000 68979 -45578 -115239 38520 -37185 -250460
21744 -250460 -227650 -92366 -52688 -59732 -139246 -197263 -267240 -267300 -36128 48058 19125 -117286
21732 -117286 -188182 -96023 36433 26314 3610 -264456 -299905 -147658 -75397 -87909 -41890
21721 -41890 115040 122740 148287 -136287 -182392 -97078 3317 -9726 13667 42284 -23348
21710 -23348 -146935 -208126 -137501 -295704 -261234 1037 59536 138266 175398 194247 152368
21699 152368 191273 309653 56881 -113262 29709 197037 64777 41715 39982 -16237
21689 -16237 136094 123616 32807 109006 103978 11545 -120066 -116611 4340 102979 127573
21678 127573 160136 359270 289592 289928 115867 39210 117142 100336 28457 -75539 -121606
21667 -121606 -91817 29320 121704 36760 -229198 -201586 -106067 7932 -22489 -44135 89386
21656 89386 147832 70863 5989 40604 36488 84507 166210 149930 104825 110052 70803 158137
21644 158137 142135 9188 -57869 10890 70091 184787 167243 169170 169740 -7257 -63273
21633 -63273 44704 178932 -48716 -75417 -65404 -69827 -102088 61678 136009 -15459 29757
21622 29757 19136 9499 -39318 -32462 -79085 -92224 -131120 -5586 114367 -48090 -144704
21611 -144704 -102745 -70019 -202342 -233810 -181690 -175026 -65419 132165 234903 261817 44484
21600 44484 42719 137676 201196 184543 188411 179916 83983 118725 74254 210801 388439 416091
21588 416091 341582 128276 -80246 -152823 -86071 15888 59634 45873 15669 16089 -39861
21577 -39861 5770 214408 158077 46081 -32094 55293 226349 154324 10715 -67622 127791
21566 127791 227391 164396 149671 133725 211728 27774 -229445 -282143 -211332 83017 254480
21555 254480 327524 256533 182097 152504 257687 255612 -24198 -150244 -143922 -18145 65897
21544 65897 54518 160108 53526 99461 133807 147756 169854 204793 -18676 -111045 68310
21533 68310 214392 124947 -12523 -17552 -40009 54048 20521 -58121 -157346 -134182 -160821
21522 -160821 -117283 -54187 -117621 -193492 -151609 -68075 70008 17497 -200047 -333409 -229316
21511 -229316 -42492 -1798 35645 53087 -120874 -36368 26191 585 -20375 25338 20547
21500 20547 -65770 -60319 51965 131082 298595 251061 219455 96845 -107362 -185602 -5130
21489 -5130 24321 40836 66168 -65452 39644 208339 168529 232788 271103 287227 102297
21478 102297 -35486 -110885 -71907 -117544 -39340 -108372 -104566 56656 30759 -101907 162472
21467 162472 88678 88784 -71116 -157635 -198357 -250687 -204658 -94912 -199624 -201819 -152987
21456 -152987 -132237 -152259 66832 215729 303380 214726 18753 239999 465280 368463
21446 368463 120939 -121797 -180439 -53304 66610 -39281 15184 -50588 -140281 -26111
21436 -26111 19321 -79574 -145083 -69543 1327 59191 111352 185665 187851 257582 172365 261295
21424 261295 140987 54361 62574 100336 25624 -260426 -299524 -211250 -82054 91625 115993
21413 115993 245020 198554 18961 6889 -14376 23350 60865 22053 -125149 -266378 -192488
21402 -192488 14368 -102397 -339958 -388387 -245863 -105503 -162922 -355527 -384730 -244379
21392 -244379 -117459 -107659 -151982 -202475 -283200 -190507 -90625 -193144 -285418 -262846 -399227
21381 -399227 -443845 -337448 -212431 -180955 -102507 -75409 -16879 59787 112667 69807 106268
21370 106268 -15159 38998 22692 -105752 -117704 -172640 -175496 -133829 -32750 -31327 -53620
21359 -53620 23213 -88430 -222985 -260174 -169164 -220956 -211211 -166392 -237785 -131493 -141367
21348 -141367 11911 142893 46065 32678 91967 50054 171212 419700 320073 103174
21338 103174 19215 35746 -41136 -49899 55634 131673 117861 -21800 -110828 -50977 46581
21327 46581 73035 -131474 -197001 -181355 -128174 -119946 -202290 -287984 -360394 -206041 -16294
21316 -16294 -46276 -259535 -205024 -107478 -174303 -239424 -77626 22011 88645 115900 -11172
21305 -11172 -52421 126256 105855 24250 -175808 -210172 -14008 127533 24036 -40519 -14782
21294 -14782 -168861 -177759 -87643 459 79371 20417 -193518 -336072 -223020 -98427 -100455
21283 -100455 -46575 -15676 170015 138502 73650 -184166 -195433 -89795 -129078 -274788 -249878
21272 -249878 -19591 79657 91980 124565 206948 249644 228666 195376 242575 313227 274462
21261 274462 118843 8038 -90018 -151382 -164033 -107395 -148038 -271208 -173957 -44511 107724
21250 107724 131668 138955 208492 271624 173628 74897 92529 150140 142146 52516 28694 -89300
21238 -89300 -213401 -200374 -35896 78079 55069 125021 37998 -174462 -133113 -152044 -33033
21227 -33033 132984 242208 428588 515481 286808 7703 -87727 -99265 -67335 -39167 25949
21216 25949 40315 34875 -60430 -227939 -156517 -104921 -157073 -34762 16326 47388 -68448
21205 -68448 -127006 -162837 -37302 90596 -36157 -152198 -157560 -48430 17801 -90755 -55382
21194 -55382 -198700 -359086 -355739 -337817 -218286 -247076 -330204 -316531 -229517 -223935 -32914
21183 -32914 182686 198060 177542 106300 73499 177285 147248 -9996 -94891 67331 1632
21172 1632 74226 249098 226061 128100 -39431 -59482 -213658 -268351 -157053 -45555 -28295
21161 -28295 -10622 -1851 68231 96425 -63921 -34683 19379 85073 258585 318685 214251
21150 214251 253199 125600 -13261 -86729 25317 68683 9699 -14590 -1834 2004 286
21139 286 -54830 -44224 -193885 -269004 -242134 -29508 24841 -132019 -191279 -191327 -232855 -214435
21127 -214435 -221530 -228475 -171332 -225231 -100772 43909 -27244 -52181 -134900 -321514 -224933
21116 -224933 -183948 -131303 -135380 -98640 -26476 -45230 -25229 5308 30539 -91723 21755
21105 21755 183250 66021 -77117 -87942 -72675 -3243 -69391 -211227 -175699 -276086 -135948
21094 -135948 162708 145697 979 -28662 -27372 -79126 -190115 -264203 -98115 23090 1225
21083 1225 -47410 62981 7549 -84247 -194056 -217955 -258643 -148870 -75618 -42842 -43431 39497
21071 39497 138971 186356 182779 61000 18522 -99875 -196677 -151173 -214905 -210854 -226415 -209710
21059 -209710 -162644 18157 23638 49771 222749 268598 262143 207831 232816 216819 102400
21048 102400 -16145 7146 -60588 -64429 -86352 -145829 -216087 -210327 -119812 11739 197353
21037 197353 209026 58117 59808 15287 -203583 -150180 75997 39694 -34819 133511 154943
21026 154943 -36705 -26063 62198 5453 -74002 -132596 -182551 -131687 44002 394268 411342
21015 411342 386033 325074 59752 -6583 -64853 48132 -14045 -41690 55760 192695 186318
21004 186318 161438 70320 213975 402299 276054 274081 307908 361097 314978 313573 132374
20993 132374 -88737 -93325 -66584 -19715 -19339 96279 279999 234648 125197 21192 106271
20982 106271 35006 -189523 -90798 -46204 -50158 -58415 180928 203955 79717 74815 25222
20971 25222 92428 234677 251713 264865 209250 154773 107633 38243 -79284 -20372 57360
20960 57360 43278 45316 -1208 59509 46852 58222 76182 118344 -27586 -58625 -197798
20949 -197798 -199073 -143401 -70100 -80477 -207018 -236367 18098 61452 17660 -46621 -226401
20938 -226401 -197876 -94911 23339 -52967 -168023 -132080 -204179 -264824 -157696 -13289
20928 -13289 103063 139797 106956 61469 39807 -103023 -160317 -143433 -181820 -296419 -252684
20917 -252684 -22448 30859 -30551 -32186 109670 25808 -125144 -279889 -246680 -250926 -192266
20906 -192266 -152255 -69626 -55540 -37261 165979 212858 1154 -162498 -307500 -192463
20896 -192463 -248937 -154441 -159282 -82272 -57164 -40331 -153908 -46187 70151 -131788 -294903
20885 -294903 -316188 -231415 -110184 -221353 -129779 -7573 -19628 -94106 12088 -24370 -13912
20874 -13912 34339 52285 -161406 -411783 -317188 -170216 -46795 14438 68380 237520 252889
20863 252889 169073 87849 -9753 -185274 -347977 -334710 -264000 -164523 -201858 -191541 -6126
20852 -6126 -8035 -89932 -103829 113973 146845 23628 35375 48154 -33269 -212224 -239249
20841 -239249 -315596 -290642 -136678 -86160 38812 -44298 -204809 -162882 18650 11377 -96944
20830 -96944 113989 207287 76225 -45423 22984 -48876 -194876 -115412 76784 154837 200925
20819 200925 113734 125852 110021 106619 211631 133683 65622 43549 65834 76327 49177
20808 49177 -107213 -112876 15360 6396 34220 81038 111866 208423 238630 105997 51379
20797 51379 90590 166238 63438 -136220 -69770 -52828 -17370 22160 262875 298437 164693
20786 164693 37134 46752 -8033 -117568 -117778 -19244 -71147 -148191 -98676 -116105 -48890 77712
20774 77712 123773 172082 102901 85612 12000 50583 90574 150869 53616 -97117 -133042
20763 -133042 -107065 -165597 -162269 -228773 -265092 -244745 -123016 -99564 -127235 42448 172594
20752 172594 195917 129326 132417 192738 140988 -39770 2491 -74587 -98623 -145132 -53048
20741 -53048 1887 49598 6573 136503 342219 382790 460592 488545 169384 9813 14619
20730 14619 106320 259644 246392 208394 -27393 -62847 77370 43630 70082 92366 82878
20719 82878 -116780 -161978 -153761 -148829 44416 140087 192415 204217 134691 52068 -66630
20708 -66630 -168456 -301394 -229395 -57505 -94515 -73182 20774 33506 38967 142126 181461
20697 181461 40977 -69228 -181236 -214357 -273219 -246124 -107145 -35686 56096 -14350 -15222
20686 -15222 -163527 -27076 -12034 -113290 -230917 -154244 -103930 -57121 -72987 -114452 -38692
20675 -38692 183248 210619 169953 -41495 -160518 -66775 -141529 -189342 -270612 -120454 -119050
20664 -119050 -223997 -76095 35388 136368 -22542 -84324 36975 55200 140375 129585
20654 129585 11922 40839 -4039 114249 214076 303713 256151 128419 86983 20969 29631
20643 29631 -30042 -28836 -191609 -99862 -23678 70329 166248 128090 -3894 -61628 -89802
20632 -89802 -316283 -317957 -293359 -135018 -187794 -193656 -83852 -190388 -181445 -218242 -257168
20621 -257168 -82372 157502 180140 98331 101711 15968 159966 36864 -193225 -258193 -269062
20610 -269062 -149826 -107073 -80006 -12623 59300 223223 349618 469566 376568 340469 244407
20599 244407 220594 190196 47387 66423 95394 217480 31031 9318 160774 81032 170178
20588 170178 227533 136446 123422 222922 102997 -3463 72352 117655 175101 101272 -54700
20577 -54700 -79156 191420 196020 122528 256990 76514 -96043 -160633 -170868 -223511 -390078
20566 -390078 -452262 -430724 -362146 -188738 -40279 -30805 -36857 -99438 -113153 -40135 -99001
20555 -99001 -111607 40658 -83755 -155467 -28635 -32758 -70317 -59167 30225 126745 325258
20544 325258 278926 133797 -13803 36113 6333 115149 89173 88834 143833 -25918 -160933
20533 -160933 -159264 -106669 14181 -50465 -104739 13444 17433 -109423 -55572 -150454 -190458
20522 -190458 -211068 -179097 -51368 -25049 12588 44790 72260 369406 459486 274409 -9593
20511 -9593 -6758 61298 -32498 41260 -10057 -128824 -187066 -84303 36248 138708 168824
20500 168824 195501 44190 -120415 -82996 19173 -6145 39430 72012 -8284 -106574 -25725
20489 -25725 -22358 -315642 -274513 -28914 104269 291673 245162 144638 43682 23594 -73016
20478 -73016 -51709 8959 259962 207560 62597 99659 98029 -42614 -199676 -218118 -144419
20467 -144419 -72124 -163229 -153131 -72590 71492 117052 181412 194036 276917 238301 108338
20456 108338 113455 134709 322124 367438 297087 417950 343730 153179 190718 168942 -2817
20445 -2817 45166 197735 207489 228064 237606 96160 -18538 -101449 -9416 -11397 85746 96787
20433 96787 99675 -43596 -75711 -85128 -20084 -38898 -73836 75746 83777 179484 195884 153393
20421 153393 93784 121731 94960 187384 179824 225244 271996 96844 57321 127428 231403
20410 231403 272614 245801 223955 49931 158678 257739 173510 163752 75669 38488 -9139
20399 -9139 99829 267170 216424 33932 -139399 -69298 289620 185225 -98539 -180128
20389 -180128 47959 93033 168420 387784 382568 364511 349929 435212 568390 373539 211084
20378 211084 265816 161697 21153 -120475 -175401 -45422 179555 375250 518804 475179
20368 475179 253802 79546 24508 23130 46222 85672 22488 -44790 -129011 79874 131276
20357 131276 144111 141907 284984 297919 263257 421779 473667 324386 349746 4224 549
20346 549 111962 232675 309156 375156 376959 340265 214232 230676 179374 95413 78670 30980
20334 30980 166080 413666 441463 339386 219688 208725 200564 121671 19432 47748 110531
20323 110531 247343 287761 191455 215951 205368 364906 612092 506542 387639 490470
20313 490470 614686 611640 411153 307362 377027 461551 573191 565318 601453 642850 725711
20302 725711 590300 485221 560637 666204 680804 669773 762194 680400 696650 763742 885109
20291 885109 946839 1003526 1101809 1049301 1004569 863554 792779 783443 833666 840482 817565 845922
20279 845922 885518 1026892 1057302 1093892 1105879 1032097 988057 881577 973634 947431 778977
20268 778977 896435 1032447 1185403 1289547 1185943 1144360 912400 697052 627888 865106
20258 865106 879388 733572 833301 929509 1083572 1034042 990271 824045 859091 906163 852883
20247 852883 855301 752526 747438 730313 596795 610634 607488 711067 758821 755136 621049
20236 621049 585686 663641 673731 711166 768708 752174 673721 588791 734734 821129 759705
20225 759705 759634 799184 776759 914575 803717 792291 662346 799006 775652 468513 299421
20214 299421 322117 270018 367096 543091 530552 333402 299263 367576 422011 363740 404675
20203 404675 514199 535409 495716 253925 244695 364417 478446 389009 312534 317596 310085
20192 310085 376783 385071 515327 532572 363059 165105 25289 -10199 140044 322046
20182 322046 212350 234271 210374 152366 49584 150106 231162 146541 223500 344657 359723
20171 359723 193515 127738 67732 -87719 43629 75859 197302 361471 269009 104601
20161 104601 149796 165031 264784 254932 173337 60677 80050 56459 330158 453525 424982
20150 424982 289749 219521 96823 -79152 -194585 -198003 23882 152756 145387 239199 102183
20139 102183 -106404 -228805 -157690 -116763 -16260 89582 101835 -3583 80851 55757
20129 55757 -32442 -225143 -216527 -179275 -205484 -300392 -64828 154491 212603 307876 182815
20118 182815 54604 77866 136099 119760 184983 179566 63687 60310 66839 19954 13580 78962
20106 78962 75816 70869 43186 34535 85186 122335 171461 148160 79878 66815 -43051 185998
20094 185998 255828 234753 10361 35122 99349 91582 108641 211989 181843 192488 175596
20083 175596 150683 30830 -114868 -127190 78049 157063 -19126 -177843 -250894 -115010
20073 -115010 103329 -46665 -183117 -31754 -74155 -31551 201779 247046 173753 186868
20063 186868 244406 7166 -139544 -172986 42176 67089 188078 236902 54409 49229 3071
20052 3071 34237 49736 192119 17411 -83079 -19315 44817 178796 58316 -162038 -243877
20041 -243877 -175767 -177703 -315152 -445132 -378732 -276169 9376 54682 29134 127746 52717
20030 52717 15407 -35856 -125938 -239459 -177173 -30466 81899 -36380 -106334 175141 261565
20019 261565 102405 -104072 -202519 -213178 -96550 -81309 -128106 -119826 -133347 -178611 -187933
20008 -187933 -75069 -4496 210267 243049 116083 93898 234092 188439 167700 232360 348431
19997 348431 176746 228286 178146 80005 74115 68516 -56563 -27638 -55887 33193 -76673
19986 -76673 -18766 100592 297809 312902 174367 65055 15045 103312 91002 140091 169453
19975 169453 83786 17327 -77558 -240876 -152235 -153936 -94366 -20577 87411 210621 320946
19964 320946 330236 231315 -33670 -15264 -95106 -25722 -134377 -271770 -106344 -34361 66505
19953 66505 24142 -65804 -103561 -43103 -44106 -116452 -117124 14737 -48657 -124676 -66824 128316
19941 128316 139718 -88600 -92964 32745 76108 70168 -18682 -121041 54931 132395 -78748
19930 -78748 -133375 23161 71777 123839 252400 204978 48160 146852 158288 -46417 37016
19919 37016 14899 -158392 -203814 -214230 -134476 -107976 -182066 -132822 -372860 -422958 -275640
19908 -275640 -80444 125348 -45875 -145756 -11380 28811 105511 245717 122905 22592
19898 22592 44858 176876 207255 327858 275417 217699 217620 318436 494107 460357 71305
19887 71305 36538 211102 253698 113985 218140 149181 62837 -120633 -134767 -109250 -17933
19876 -17933 -70949 -33888 -78246 -49885 49636 86469 66719 82013 50247 8358 50690 181652
19864 181652 31400 -32900 123225 249232 202690 87911 141543 253003 279436 86953
19854 86953 56318 135084 170573 65839 81182 152435 230518 219049 212170 338393 351575
19843 351575 311295 299626 99862 92452 273582 275963 118768 134130 228743 211008 186972
19832 186972 245951 196692 96872 -22406 -1815 64791 -36246 -46434 5405 35904 -17202
19821 -17202 -54464 -149474 -119880 150711 372665 262219 257389 387303 293522 149596 16183
19810 16183 215200 251910 162803 75548 69741 231850 221691 42542 42473 -12458 26346 -62724
19798 -62724 905 -114392 13502 -1949 -72612 -69867 -59014 -109842 -142533 26694 149139
19787 149139 9708 8711 46518 -43950 -77837 79300 159887 138010 221269 64085 78383
19776 78383 135306 103861 47135 -63961 -117326 -4876 -44157 -171194 -238082 -254772 -220554
19765 -220554 -60589 45628 -14342 -97703 -70839 -29711 18269 161281 145577 60312 244295
19754 244295 174941 218905 342576 384200 236439 110483 6895 105374 -32994 -71691
19744 -71691 -72389 32811 60215 61359 88293 71101 -12648 40301 41549 -61462 -36701 116710
19732 116710 65177 27947 -147465 -181512 -197234 -28914 58571 54644 242265 265854 -15783
19721 -15783 -292964 -252844 -243341 -186178 -119830 -124706 -179165 -18953 152472 134902 194493
19710 194493 347825 224253 -25381 -119735 -179905 -65334 -68210 -105913 -120764 -128053 -82750
19699 -82750 -90589 3713 31379 -4650 97859 42269 -208985 -214467 -197283 -234358 -236028 -216997
19687 -216997 -113384 38803 -84706 -133384 -120634 72351 153653 48928 100646 204152
19677 204152 194076 155083 111059 133839 142477 -18383 -166013 -317423 -182554 -62973 32073
19666 32073 142088 219410 131878 152618 95348 101539 60717 10506 -60106 -44816 86140
19655 86140 107481 105273 150973 310286 372680 287924 250315 190002 60403 -104018 15695
19644 15695 143546 170613 203025 217934 169349 -54639 -213546 -151654 -108663 -189495 -134456
19633 -134456 -17316 99705 180423 120427 -48850 -53893 31110 121078 234901 129457 -29960
19622 -29960 -50550 -151481 111700 319575 237080 370143 292532 190738 41293 50608 255807
19611 255807 378031 263719 256195 248088 141630 10570 -131881 -153411 -117916 -141558 -220073
19600 -220073 -244730 -42972 138277 367658 535044 634625 682221 766966 844733 707504
19590 707504 721571 689440 670148 820260 834544 936112 1162252 1311750 1485874 1560714
19580 1560714 1731109 1705465 1264321 676723 288183 225060 284279 341285 366647 374786 191317
19569 191317 -28590 43319 168363 217239 114857 180100 117860 10336 -107042 -101336 -46308
19558 -46308 -6148 -56749 150428 218137 140334 126260 74620 66847 199472 55941 10442
19547 10442 84536 -47506 -255054 -195720 -7484 78536 7296 -45874 -96213 6034 44420
19536 44420 134656 236103 148795 75925 90376 144856 141355 12565 -31343 21639 -73505
19525 -73505 -200895 -221525 -172227 -35632 164447 324479 331673 280975 355172 321667 307620
19514 307620 167605 -41384 -286260 -296597 -271462 -269223 -230944 -168604 62732 136397 73326
19503 73326 45696 344957 526644 449898 306729 200814 135848 90304 235148 392493
19493 392493 349790 287836 210952 209652 283961 306350 274063 146239 77495 135489 47950
19482 47950 3104 83347 200964 49083 -8089 -34009 -102406 -39197 -46470 -5000 -876 12597
19470 12597 80152 209867 214082 156739 80253 146331 63705 -14131 -54642 69131 51973
19459 51973 -67788 -16138 -66977 -58381 152944 13525 -121248 -65197 13696 103400 219541
19448 219541 297019 207550 243722 216717 143697 297515 350725 465021 426001 239412 241496
19437 241496 267586 273585 347471 417065 316539 370617 249806 17284 -133412 -284530 -139501
19426 -139501 -82358 64544 163199 87966 145139 144699 34831 -39740 -33334 124568 327574
19415 327574 286386 170708 29344 -62020 -140272 76263 264800 252562 -5004 -10910 226419
19404 226419 301329 179373 287028 224439 211322 125124 137612 163321 188591 85055 122087
19393 122087 172959 274565 134651 126314 253497 255058 186686 94504 68895 128010 90494
19382 90494 -104351 -195550 -47461 32323 106493 -45098 -17612 101557 41818 -74180 -107795
19371 -107795 -27014 214868 354079 309608 330875 232643 198481 201884 143611 94335 147758
19360 147758 189884 153792 230021 263609 261485 258603 226423 51757 -166500 -88824 31290
19349 31290 -72885 -175524 -127576 -93317 -14802 42096 182114 394180 474819 445832 473061
19338 473061 418328 300756 335741 267417 264202 298847 347526 315503 259014 263814 226772 15873
19326 15873 -138959 46890 127378 -108294 -242383 -209205 -85272 10721 175495 172207 89660
19315 89660 109391 93093 93966 -7628 -17269 9509 167353 296745 101648 747 -53284
19304 -53284 -34283 84412 98395 99786 232379 255235 115533 90173 183622 301676 320950
19293 320950 337764 302159 235242 227034 351792 303046 162198 -13143 176924 99592 -15166
19282 -15166 -60790 -68766 -26243 68521 295031 240178 107232 2130 -200674 -294968 -173602
19271 -173602 32691 140664 115730 52976 230857 225294 282557 270176 131422 42295 292218
19260 292218 266235 257233 266951 300724 228139 127003 166153 332214 427855 244410 68298
19249 68298 26000 93573 202526 142770 43716 108114 50881 185788 169345 96963 36808
19238 36808 185442 284892 121791 -55247 -36099 117391 137358 8607 54826 98175 252988
19227 252988 375351 277537 178276 303210 456932 506980 434979 188280 96109 175201 491793
19216 491793 717352 777454 603921 445756 360455 299173 201170 235003 167578 38857 -137615
19205 -137615 -61908 147391 204500 178215 207162 231477 357082 187215 57488 132306 213029
19194 213029 160765 133058 184682 304633 287154 49984 109722 355277 365265 283438 290267
19183 290267 93587 108421 235978 112400 91756 131333 230785 136636 99142 157288 181269
19172 181269 158860 -24328 -63790 -118779 -263946 -275596 -71423 -20075 151255 314882
19162 314882 391003 403161 239127 184793 228270 314433 249174 204186 246609 277865 360581
19151 360581 316653 193962 124816 30839 203344 99887 36916 -121225 -18449 12046
19141 12046 78780 38833 -65681 50680 186696 405504 425561 446355 389581 326761 352836
19130 352836 328362 214712 234808 351219 388158 323130 432861 321079 282230 413859
19120 413859 289534 261894 296999 318761 298672 194339 364679 382274 289553 345976 374165
19109 374165 164347 322261 595677 593490 508595 457285 652238 929315 893167 891266 920726
19098 920726 959798 875375 709482 555038 544993 415627 287698 171526 18276 151890
19088 151890 399034 683648 792471 657844 565278 532908 572854 610201 643948 581413 490133
19077 490133 379816 233831 270869 498458 482699 541678 501297 514006 493758 393464 372059
19066 372059 448661 535310 642260 655260 645121 568861 482179 411646 431205 304879 344310
19055 344310 464663 471678 568882 686157 637311 595728 543125 719930 859505 820676 887333
19044 887333 810945 839253 767813 847834 850170 924003 1033746 1026664 1158613 1122529 938706
19033 938706 886880 954294 1127475 1211079 1273112 1223560 1026000 961998 979289 1064719 1024082
19022 1024082 1123711 1277006 1228405 1048678 1056924 1196939 1308686 1601064 1771967 1764568
19012 1764568 1809742 1896723 2072530 2253317 2321202 2440285 2582344 2736203 3105381 3579845
19002 3579845 4080244 4337721 4651783 5152410 5786788 6119397 5695148 5053660 4995933 5304234
18992 5304234 5400648 5473589 5867200 6441075 7112850 7980845 8884185 10065806 11606030
18983 11606030 13530435 15891920 18670781 22342394 27265232 33745679 43032205 58110820
18975 58110820 82141795 117499273 162997259 212951074 269344715 346704407 420059205
18968 420059205 392186347 262012384 149589653 88860719 57946758 41225400 31396086
18961 31396086 24395040 19097894 15424935 12921240 11407012 10280428 8706583 7153853
18953 7153853 5862808 4942759 4269204 3778870 3319641 2919405 2705668 2603793 2807229
18944 2807229 3017023 3346204 3633953 3974170 4335223 4182790 3524899 2471207 1665166
18935 1665166 1383003 1533127 1546711 1540420 1454470 1433018 1367621 1083402 1107965 1077866 1057727
18924 1057727 935673 776995 731500 650646 532149 535346 513068 577013 550407 365563 299509
18913 299509 358210 373949 413497 422978 567198 580882 476121 337271 328947 232164 205744
18902 205744 326662 412849 489357 524573 599548 690216 986005 1071799 911868 816417 857089
18891 857089 779712 859491 1128404 1148108 1102931 1111356 1197613 1258460 1294877 1423064 1372145
18880 1372145 1238501 1218991 1086730 844027 712828 653141 548158 445685 415068 379375
18870 379375 420452 523972 350630 123428 159633 226767 334928 232807 288342 384722
18860 384722 428319 313936 95721 2354 -32930 27210 107131 210042 232850 415645 389801
18849 389801 389047 695391 798371 784664 797268 770382 610084 532963 373265 284598 303412
18838 303412 336644 617031 843961 945169 920044 749498 631210 577251 754063 578669
18828 578669 366457 146181 161761 237710 88734 225465 390567 410157 392967 284751
18818 284751 86319 -163502 -314761 -191019 -81917 -13277 36704 81870 35963 -75204
18808 -75204 46452 123707 -38066 -152216 -155619 -214773 -74911 69306 -175033 -407953
18798 -407953 -363784 -255807 -80280 85783 70463 -4760 8101 -40708 -78082 -177995 -210348
18787 -210348 -238428 -135595 -72714 -238260 -322086 -187715 -140263 -124121 -86371 -25073 -163227
18776 -163227 -221426 -187979 -287192 -183757 102361 269423 360409 619202 933385 1330692
18766 1330692 1725592 2047633 1698377 1082583 618151 427888 621004 606678 430303 365779
18756 365779 458107 414606 94104 -10968 35814 -8085 121010 239113 333753 236873 139948
18745 139948 109893 -61117 14812 62374 55156 -150408 -205186 -67765 54289 69486 -10654
18734 -10654 19633 46088 142665 151369 65598 15401 62058 -50453 -75784 -104099 -57118 -55575
18722 -55575 -137906 -268286 -167527 -17819 -15913 -63707 -143518 -79860 70279 187055 154944
18711 154944 67956 106837 -112771 -194578 -162451 -136691 -164548 -296242 -163528 153896 293333
18700 293333 205082 -125758 -257700 -97129 26043 23325 -2542 -11305 27361 61234 119569
18689 119569 174557 22508 -149882 -233630 -225138 -172179 -25729 -66434 -167457 -121906 47949
18678 47949 146674 176331 232201 -37353 -40796 127179 39771 133075 115006 37119 -224582
18667 -224582 -291263 -218340 -114252 5797 42853 70387 165797 100040 64563 18040 -12145
18656 -12145 -89132 -59427 74752 151468 107158 171691 206922 8362 -22827 -56541 24024
18645 24024 66548 -47080 -71164 -76635 -73798 -143619 -260219 -234915 -154060 -142294 -25449
18634 -25449 167517 330502 342439 111128 -63560 -211099 -258443 -9163 52651 -27969
18624 -27969 -139928 -203214 -5144 112378 106530 12081 -82784 -99607 -92449 -97836 -103043 -152368
18612 -152368 -219399 -87951 22764 121414 82562 -95789 -142086 -197082 -6500 91756 -144705
18601 -144705 53221 98272 -86318 -115077 30404 15407 -60142 -21410 -64444 -43356 20671
18590 20671 135417 304158 384312 397396 407813 416350 410905 251074 250867 86144 -166193
18579 -166193 -216778 -101603 -4971 219263 219524 267806 251807 325012 385042 341402 330162
18568 330162 324178 325911 360621 496494 520337 664203 1059614 1373775 1558189 1881571 2433323
18557 2433323 2940491 2823382 2179308 1371495 663060 492377 218416 72897 20718 -41183
18547 -41183 90281 133434 167582 283625 305497 457799 589178 440441 412700 250850
18537 250850 79333 -45290 70832 57674 36754 152974 286400 179755 154339 154067 111987
18526 111987 -138358 -228423 -127223 -69320 11089 -78064 -118192 -31367 70292 37970 -216593
18515 -216593 -337419 -296832 -135627 -89903 -41519 48188 27336 4580 -77298 -12089 2415
18504 2415 89728 -1270 -92137 -74152 93350 148593 118708 45929 -97656 -184667 -218256
18493 -218256 -100986 -113017 -6218 12629 -93769 -12524 51670 -22022 -24902 46293 48986
18482 48986 28698 -147531 -95708 -77269 -100434 18801 295104 345553 312035 229418 58943
18471 58943 36913 141206 231149 111242 -34114 -147971 -88225 65117 120096 50027 -45590
18460 -45590 -7129 -148021 -162696 -48191 -129654 -116108 -55302 22288 126055 -71146 -108235
18449 -108235 5824 58504 -15573 -45376 -126536 -167230 -104185 75448 61221 -33155 16100
18438 16100 -17523 -95181 -151008 -69564 69955 181992 103573 95739 -20026 129021 293515
18427 293515 255607 314428 284743 174153 134921 121700 170612 90182 177279 167266 243208
18416 243208 328214 191040 157866 12706 -80361 -83406 -156403 45434 137638 13065 230290
18405 230290 377025 296250 124384 169768 342852 275586 94106 168937 304255 374255
18395 374255 400459 284743 274419 228585 289725 311330 112696 72824 64303 77708 156879
18384 156879 296872 308728 137127 65389 38316 117971 75466 -214468 -164701 -515 -3883
18373 -3883 124785 247388 281845 140993 107279 30605 -5157 10682 81611 274607 467306
18362 467306 429556 411965 519126 790795 860793 823710 815176 1117988 1368724 1478705 1648391
18351 1648391 1934488 1869996 1656476 1484230 1001579 658440 449458 232612 274267 379633
18341 379633 437665 381829 123519 -57130 -47908 107288 316169 313390 266400 187844 324987
18330 324987 545500 600212 511562 450275 315295 153354 279835 609764 701174 710434 683102
18319 683102 541550 498615 394022 312316 452246 409697 658483 639192 713643 769183 778360
18308 778360 857426 1042008 1367355 1271110 1177276 1161214 1174870 1194904 1304557 1227627 1270265
18297 1270265 1282282 1310092 1440329 1420696 1482522 1393851 1216290 1089895 1082338 1253197 1317328
18286 1317328 1205809 1081260 1144294 1316963 1220924 1132833 1050068 968013 990149 1162666
18276 1162666 1278566 1308972 1119477 1070584 1219292 1271961 1282076 1417396 1626374 1649553
18266 1649553 1668995 1587700 1381189 1484189 1521115 1543704 1770367 1800870 1697677 1565832
18256 1565832 1608564 1689166 1686024 1703433 1623291 1478758 1535682 1612281 1625145 1666825 1743783
18245 1743783 1836291 1614386 1509780 1634583 1870712 1872649 1667213 1577260 1495674 1685459
18235 1685459 1669152 1527815 1319957 1249969 1094942 963675 877069 945529 946886 989036 1031201
18224 1031201 1055411 1186843 1311630 1384240 1374591 1328032 1214948 1175902 1184719 1180760 1189462
18213 1189462 1014739 801461 886437 882842 907253 879649 1003296 1046367 1018651 772050 509949
18202 509949 448002 647963 747959 828778 780042 683483 627006 601082 490412 522348 540013
18191 540013 459185 533925 841914 867022 822978 949966 942505 1053305 977652 887982 820964
18180 820964 812204 753493 728907 754122 760891 761161 697969 703119 771664 769460 727691 805144 828759
18167 828759 822980 924533 1064935 1101481 1154559 1204991 1207986 1138377 1003430 780374 719573
18156 719573 955802 1019381 1282674 1393743 1420664 1568087 1568661 1482305 1487444 1497349 1501351 1462664
18144 1462664 1697846 1984741 2156631 2289376 2316612 2468709 2385833 2228756 2384038 2487074
18134 2487074 2647704 2649524 2969588 3335954 3732707 4221511 4536217 4897035 5210184 5504689
18124 5504689 6260188 7105413 8259013 9571721 10941041 13104999 15780110 19495464
18116 19495464 24602690 32506343 45183868 65534101 95723838 133555256 172129451
18109 172129451 217630862 286279969 345417835 294002444 174305573 96381660 58668533
18102 58668533 38941129 27797437 20897106 16272743 12672815 10037615 8129791 6723259
18094 6723259 5740638 4916368 4246955 3661088 3209883 2696022 2383440 2111408 2004546
18085 2004546 1920808 1728296 1518472 1494166 1562228 1477584 1286852 1046372 894453 735866
18075 735866 510633 310574 415654 541551 505465 502773 439494 296110 197824 195725 257666
18064 257666 162059 227048 312613 335143 320819 193027 163493 142963 116305 129411 68281
18053 68281 110948 49796 180169 173472 152602 185678 200396 235832 211551 224257 157865 -50754
18041 -50754 -188193 -183522 -174199 -77620 -90611 -191808 -269192 -155833 28368 54050 58422
18030 58422 161523 132597 -40885 -245110 -86206 -74963 -225128 -154275 -243673 -321385 -199822
18019 -199822 -126074 -118762 -374921 -505371 -381707 -391772 -399175 -480138 -536038 -350523 -142843
18008 -142843 -35200 -15024 6176 -14570 44383 49017 -533 46534 -149901 -261670 -172026
17997 -172026 -225637 -120548 41885 -10730 -70476 84732 167800 38716 2083 60138 227243
17986 227243 195846 41650 7506 -147077 -351904 -440958 -455865 -448967 -388191 -366963 -279588
17975 -279588 -247376 -5948 -8505 19354 125954 292783 201003 18135 18383 -81827 -117972
17964 -117972 -90572 -62601 69851 -42025 37356 208796 187924 189432 176024 106775 52685
17953 52685 -21089 65374 -24195 -77053 15757 -113922 -114781 -89470 -108241 -90802 27194 -42564
17941 -42564 82152 293425 192193 145223 104716 10050 -36120 -64825 -32477 -74702 -206816
17930 -206816 -172431 -132045 -5134 -78159 -66252 -272370 -288999 -122904 -99986 -108538 -123008
17919 -123008 -79354 25116 -90262 -64337 103111 157607 91057 96660 -74992 -36497 -51023
17908 -51023 -4200 -117564 -271913 -303655 -145000 -328812 -492795 -416644 -157334 -199671
17898 -199671 -179936 -183035 -251832 -59209 57605 29364 -22045 -106309 -140841 -67996 -140423
17887 -140423 -135515 8969 -29418 -11543 -113856 -186425 -88753 -72690 -8971 -3217 9931
17876 9931 84484 53446 43970 103522 91282 87011 -13741 -142063 -234899 -88505 2168 -158033
17864 -158033 -196114 19129 176503 222916 114185 130480 180943 39098 5777 -36962 -118098
17853 -118098 -84646 89808 127578 38867 -79095 -63954 -193172 -338196 -353577 -200180
17843 -200180 -161948 -90493 -39241 -6374 -117007 -204696 -120313 -207080 -351013 -356932 -303103
17832 -303103 -362359 -243511 -144939 -214184 -176230 -37064 -73043 -169843 -127602 42811 88888
17821 88888 -27797 -38223 -5007 -17398 -108066 35201 92507 87595 183295 149299 269047
17810 269047 228227 166704 64739 56997 3420 47521 241308 317090 348776 330439 222033
17799 222033 133073 185709 299285 212236 -86336 -323715 -368158 -282772 -191679 -267960 -368460
17788 -368460 -376556 -393793 -336683 -76593 205472 106651 -99512 36729 264016 382361
17778 382361 340142 215224 179363 151244 67333 -96829 -173672 -114802 -86742 -49270 -8648
17767 -8648 -171059 -115323 -19462 -27071 -99152 -6121 27098 53189 46870 47393 150881 217766
17755 217766 55107 -26697 -49412 129311 227013 132939 68043 15680 8975 108826 38506
17744 38506 157104 323919 255585 199896 131889 138478 55462 -23359 -29719 71421 121145
17733 121145 69717 216436 287585 231157 122250 113176 223162 198188 125554 156543 135308
17722 135308 16791 -22505 -47260 -93264 -79038 -163594 -111048 -242816 -547721 -471693 -323125
17711 -323125 -197241 -34693 33446 18396 50238 25814 109216 83815 -57983 -114750 71653
17700 71653 47659 45607 41416 131550 204769 35272 -115544 -211057 -234573 -145184 -90842 -90928
17688 -90928 -154236 -24573 74743 151090 217303 214559 147373 77727 42737 23083 -36014 35281
17676 35281 289675 215938 200373 190495 195847 35796 -43451 -20369 -17773 -194231 -284787 -58161
17664 -58161 -156685 -321109 -70120 42187 -50370 -153881 -361760 -252661 -132156 -123902
17654 -123902 -126762 -117222 -235336 -193474 -88934 74690 109767 209264 12299 -79684 -136505
17643 -136505 -214400 -52296 -2930 -69067 -103888 117097 211129 62275 125615 125564 -48802
17632 -48802 37153 3416 -151613 -321181 -344239 -367099 -277327 -272842 -188811 -115073 -6717
17621 -6717 -24165 -32192 90970 144461 -70234 -115639 -62708 13777 50164 25146 -51722 -156338
17609 -156338 -239793 -370430 -249312 -171858 -200665 -151539 -27373 -55144 -79307 -139835 -221779
17598 -221779 -223388 -355616 -419644 -351527 -388890 -262683 -153418 -149236 -116861 -66974 -147131
17587 -147131 -131362 -80987 -124872 -224318 -326155 -222492 -141252 -100718 -61769 -202350 -125814
17576 -125814 2559 -20524 -39913 -57372 -145945 -27413 80186 -104329 -211304 53477
17566 53477 113631 108060 -14170 -13469 90166 126540 39959 -76749 -245507 -375516 -376691
17555 -376691 -115451 42160 -163743 -420824 -428716 -350364 -169737 -82132 -84792 -129076 -132256
17544 -132256 -191742 -194697 -106108 -120283 -134045 -55041 -102205 -227097 -178608 -118439 -69900
17533 -69900 49154 18704 123395 39905 -182869 -145511 -132262 -118673 -206728 -471319 -442191
17522 -442191 -381513 -256397 -207150 -240738 -166128 -186928 -163536 -3662 119958 64967 67486
17511 67486 83001 -9325 19557 145694 125861 104648 86771 -44382 -193895 -101695 -71601
17500 -71601 -26298 -1831 70919 81561 70080 23219 -62188 -144195 -226053 -299616 -374332 -218040
17488 -218040 -168673 -148408 64753 164675 202642 315359 236279 -20773 -77853 -34749 126503
17477 126503 101888 64845 -19867 33228 -29833 -3819 3333 35137 -90141 -187357 -114316
17466 -114316 -54805 -74720 -109968 -71268 -70454 -12484 -26979 -95886 35303 109105 252803
17455 252803 229837 158516 121849 3795 -104262 18823 203457 218818 360277 631860
17445 631860 816631 964844 1070477 1291573 1685427 1664415 898380 381878 -29613 -126907
17435 -126907 -37459 -65431 -61369 -73875 -3086 82135 -69370 56239 121280 -64218 -208596
17424 -208596 -223112 -81658 79584 44535 13285 -36625 27707 -137356 -234441 -57324 -84109
17413 -84109 -140607 -244235 -191740 1452 18238 82861 125725 17497 212274 220943 5140
17402 5140 51425 46297 -147885 -259277 -301127 -214732 -33382 18256 -85762 -213985 -136331
17391 -136331 24916 -28911 -53293 74215 80373 -67367 -84155 -148345 -198694 -62029 46310
17380 46310 79876 17106 -63153 -153049 40344 171296 69671 1059 81128 153333 52872
17369 52872 213538 184680 -94647 -274052 -253391 -189033 -242200 -413242 -402201 -476042 -679860
17358 -679860 -671880 -407772 -381309 -359643 -275895 -218484 -220401 -95246 32761 -22709 -82267
17347 -82267 50623 155345 -55406 -345594 -320135 -104825 66084 -26978 -201254 -201687 -252357
17336 -252357 -128343 120 5960 136154 171990 117428 213393 192733 43169 -62447 75014
17325 75014 235313 263801 166768 -6744 -81294 -196291 -109369 50103 131347 87443 143780
17314 143780 201101 131170 118388 194857 206064 19243 -67198 -10899 22974 88740 125166
17303 125166 14529 -40735 -10148 37502 99916 85220 155782 -77303 -255102 -121628 -113201
17292 -113201 -103292 -70949 -165478 -150013 -186811 -91053 25365 140753 178486 154585 30205
17281 30205 -115208 -68616 -26267 -249678 -207679 -174267 -156747 -39441 42771 104268 -110164
17270 -110164 -212438 -128945 -294753 -402691 -341862 -215886 -211295 -284828 -276362 -165693 -103580
17259 -103580 -19114 -60105 80525 271142 288720 498241 444294 411460 307329 344297 61824
17248 61824 -150085 -109113 -128567 -84826 60938 9495 -241321 -322276 -278745 -466187 -497552
17237 -497552 -298856 -273875 -194577 -5492 42716 -139025 -344181 -440038 -373455 -242751
17227 -242751 -284452 -336871 -245585 -144369 -285439 -274815 16455 -149049 -88581 108233
17217 108233 19191 -85625 -35316 21022 99896 215300 -9193 -261195 -365477 -278112
17207 -278112 -185307 -76362 -120409 -255247 -284398 -92758 -36498 -31810 4104 103400 228983
17196 228983 381118 316653 361924 523734 548097 329973 212246 -46872 -99064 95110
17186 95110 33905 -51718 -151922 -100101 11653 -38872 -272912 -354613 -284024 -82235 -4737
17175 -4737 -121465 -58714 76111 121086 230416 219326 8893 32638 197804 186265 101224
17164 101224 -135603 -176563 -121563 -258955 -245161 -94623 -40314 -39118 -44120 -24459 -65197
17153 -65197 -67934 -79487 -183526 -305805 -182453 -126754 -100325 -58917 -99400 -71016 -130276
17142 -130276 -214144 -41418 -42964 -251869 -289616 -239712 -277673 -154264 -66963 -193310 -216093
17131 -216093 -212602 -110089 -141871 -14401 5844 116608 52406 -103332 -69202 89743 1406
17120 1406 -65356 -160908 -186401 -72067 -17795 -2480 -46905 -242432 -185179 -60200 -98731
17109 -98731 -190729 -244682 -294637 -166459 -176406 -267672 -216918 -210517 -76456 83851 135797
17098 135797 4703 -6699 -40744 -93179 -213980 -234472 -147907 -158830 -220814 -249885 -348927
17087 -348927 -297629 -279852 -188922 -170628 -243346 -244650 -233048 -184113 -207088 -310273 -210679
17076 -210679 -140800 -124803 -81118 -63422 30826 -8819 -264996 -288394 -153063 -17205 -113637
17065 -113637 -93322 -184165 -271607 -287067 -254461 -148173 -1049 88104 120494 156881 139707
17054 139707 115841 19524 -143747 -217171 -294946 -108915 70547 8465 -84225 -80834 70178
17043 70178 22891 -38320 -33992 -38494 -60274 -102071 -131404 -29740 70020 88793 177051 175800
17031 175800 123591 177095 118493 95635 35017 -28646 -190848 -337604 -203757 -184543 -193153
17020 -193153 -139257 -186141 -208558 -31866 76943 15296 -102604 -80162 -137932 -203120 -171544
17009 -171544 -197414 -167539 -82797 -5411 24840 -60750 -57468 -159864 -71629 115385 -33110
16998 -33110 -316309 -281890 -66787 -45250 -110882 140869 219805 69353 307 73941 89501
16987 89501 146830 72160 -83674 -55945 -149303 -200249 -83205 16061 53487 106689 73775
16976 73775 50260 255034 158415 148112 71983 -37107 158741 369224 372377 271197 230219
16965 230219 176936 39970 -15206 92877 140376 84640 2950 -66992 -118302 -106506 -118120
16954 -118120 -158249 -40786 20768 231305 168439 151310 12758 -53971 -71956 62676 16175
16943 16175 -29731 -66253 -175446 -211837 -165804 -141054 -217516 -194381 11201 -34179 -148029
16932 -148029 -123806 -64125 25666 95430 38386 -60779 -83789 -100123 -70169 -69067 -112537 -189754
16920 -189754 -278153 -232981 -120859 -2075 -59533 -155403 -168270 -106293 -255986 -436626 -405464
16909 -405464 -283281 -156428 -225857 -246575 -256546 -172184 -125935 -183794 -161338 102583 215761
16898 215761 35334 -26922 -137833 -110136 -3129 -15581 -92514 -93261 -3716 19750 10551
16887 10551 67473 150481 55159 -92815 -203946 -204760 -79204 -152590 -135694 77120 -27667
16876 -27667 -122496 -140370 -123818 -139525 62695 151850 33215 127421 20806 5050 -62056
16865 -62056 -323096 -405622 -377579 -452114 -345935 -348189 -276340 -158711 -178072 -215261 -176808
16854 -176808 -246194 -224481 -275505 -328736 -236867 -169467 -244778 -278805 -147899 -163969 -344423
16843 -344423 -293643 -144375 -147210 -180253 -128810 -203963 -358984 -294787 -30683 -22827 44467
16832 44467 193667 166038 -57494 -143683 140077 260112 108539 92520 111338 273528
16822 273528 223527 65769 -34490 -241528 -253923 -101260 41530 -35663 -111699 -41243
16812 -41243 14351 -91645 -188930 -90531 -132781 -99080 -137004 -112784 -85167 28074 9935
16801 9935 -205239 -298168 -296220 -140195 -77509 -12715 -81792 -147103 57367 159921 171547
16790 171547 38230 -138715 -150446 -103890 33822 -113177 -152532 -182829 -67067 -22199
16780 -22199 23254 31657 -25479 90651 -24512 45490 3215 -302298 -139518 -49271 119908
16769 119908 160562 197987 -78884 -194177 66163 92935 177418 66716 8649 34999 -56984
16758 -56984 -50248 13421 -21154 -38137 44358 122224 153548 72208 -15428 -167006 -151149 -142830
16746 -142830 -242912 -174898 -298061 -123684 -148560 -182582 -354272 -276820 -154758 -256345
16736 -256345 -304758 -365329 -234119 -242409 -256450 -145908 -149467 64206 226298 208627 105698
16725 105698 135094 272062 237166 141296 129356 127309 117643 -71056 -189771 -82487 26632
16714 26632 104976 122879 -14558 95223 302560 336965 261099 37713 -48872 116465 205777
16703 205777 124385 -4611 -80404 -67620 -5588 -68680 -179797 -238082 -267116 -241644 -124490
16692 -124490 -62708 -201661 -193762 -180583 -67298 64015 75616 6150 -121592 -169735 -96933
16681 -96933 43530 -76203 -202448 -218480 -177890 2384 71503 43712 8865 -35550 45184
16670 45184 51887 -64536 -38625 -60523 -11610 -116162 -145266 62367 238617 364562 445882
16659 445882 440042 269335 -29315 -27954 178786 197931 11148 24204 3014 -14361 -72120
16648 -72120 -153396 -82375 -11869 19135 -52937 -16466 76198 -15838 10663 56847 17249 -94351
16636 -94351 -247777 -269419 -402088 -380685 -113820 -22649 7210 -112719 -101492 -151764 -92606
16625 -92606 4331 33978 -154217 -283063 -256628 -191486 -77082 -68340 -61194 101092 71995
16614 71995 84197 -44976 -11094 -50526 7769 83369 95320 154021 209580 4311 -73800
16603 -73800 13821 -168386 -257824 -166602 -297447 -357701 -294751 -296518 -272810 -361956 -311125
16592 -311125 -130675 -14942 -113578 -48686 -24591 -155131 -214821 -310172 -415356 -331869 -161434
16581 -161434 27927 -28577 -132949 -121237 24397 30092 -126609 -221722 -278659 -224479 -187902
16570 -187902 -230365 -222156 -203134 -67188 10749 81385 76431 -83905 -199970 -242996 -92250
16559 -92250 -82433 8354 -15962 -58222 -66423 -79863 -158375 -182910 -156385 -137513 109690 253354
16547 253354 226053 111941 -24205 -78474 -31219 -6150 -106006 -112230 -108127 -199584 -51633
16536 -51633 -172737 -223794 28689 46556 -75886 -122614 -149154 -190153 -264821 -316100 -326564
16525 -326564 -250437 -50391 -21142 -56476 -71256 15760 -37026 -281707 -193011 -159701 -145682
16514 -145682 -25995 39819 35038 -35371 -59931 -158424 -163561 -88916 -40891 -203502 -87396
16503 -87396 31968 13789 22626 123961 32684 -83747 -114418 -108229 -315634 -339793 -174267
16492 -174267 -35756 233213 240030 77665 -73660 -26017 -3974 -8048 -52477 112147 73578
16481 73578 51499 123699 184598 95416 132283 234485 90046 40002 37584 -68480 -229636
16470 -229636 -254831 -279790 -167532 -240884 -182531 -160278 -83190 -138711 -23268 -68457 -86985
16459 -86985 -112855 -268021 -293354 -343263 -250716 -232798 -96573 -26129 18779 -55090 -65430
16448 -65430 -57399 -128353 -243836 -288324 -177887 -82087 -196555 -128871 98901 62541 -6221
16437 -6221 45693 -129533 -165592 -193572 -254818 -174172 -132493 -29657 73586 26890 15066
16426 15066 -75491 -160960 -166651 14612 -129015 -257362 -286988 -170646 -106845 -145710 -108167
16415 -108167 -73984 -85340 -81510 -52532 59652 67568 65849 16264 133879 88646 -12511
16404 -12511 -52657 -45536 137046 10042 39145 105640 131115 165007 298539 189577 3007
16393 3007 -99581 -42373 -177569 -116178 -4881 16804 -54701 -229686 -270374 -162730 4474
16382 4474 168396 307789 279791 224697 179055 -56939 -174880 -95096 21266 -85299 -112178
16371 -112178 -122487 -60009 23597 121925 109880 208353 228326 103732 -17724 -157351 -194511
16360 -194511 -261236 -225638 -172678 -199772 -115781 255379 277094 285811 113571 -11977 -91872
16349 -91872 -84432 92195 -15308 -106329 -162500 -159821 -43947 -43927 -97826 -71737 24881 45823
16337 45823 54004 9545 -20502 -62417 -96889 -53604 75762 112203 122608 -91826 -196197
16326 -196197 -273362 -333650 -160786 -72245 -156399 -309573 -282876 -111658 18338 -239874
16316 -239874 -332933 -191817 1469 -8165 75901 147519 -49981 -72161 24414 123637 18906
16305 18906 -51406 -63117 -139160 -212980 -135952 -39160 -24460 22020 242575 199202 109717
16294 109717 8239 -85364 -174622 -115641 54123 -70703 -137358 -19494 -130480 -9233
16284 -9233 20009 -157710 -142988 -105897 -188653 -182278 -182451 -158191 -211568 -224925 -168944 -170740
16272 -170740 -184296 -175146 -99309 -217514 -198474 -229284 -335313 -319778 -261183 -213882 -79200
16261 -79200 144142 237478 89735 -198121 -352955 -299325 -152149 -71321 32260 99435
16251 99435 120146 24208 68440 148245 237104 194412 212850 31021 -86220 1483 86059
16240 86059 111635 -39413 -1775 -23510 -179919 -170523 -67266 -80869 -147462 -37475 -72019
16229 -72019 80938 173141 244935 70339 -325034 -250078 -160305 -37943 49565 178083 83046
16218 83046 128316 135958 170668 297400 227477 49647 -42696 -103373 -16269 -13390 -160462
16207 -160462 -112611 -23154 52118 15077 16344 54414 81879 76651 220985 27973 -95651
16196 -95651 -89303 -178245 -51112 -171193 -241976 -265850 -527992 -390592 -168880 -120181 -52559
16185 -52559 118970 104797 -95593 -127139 -60879 55000 5646 138708 121278 -15931 29108
16174 29108 125386 183121 216605 119757 61622 53299 146237 -7533 -22465 -69752 -42455 97973
16162 97973 194321 219052 142998 110640 -50533 -2207 -6230 -10552 -77790 -208549 -253116 -294896
16150 -294896 -234551 -148291 -102010 -125109 -76747 -44928 -22632 -21986 13316 -152632 -147736 -31622
16138 -31622 -330 -76976 -217032 -60897 75636 13465 -31731 72267 188163 38791
16128 38791 45986 181728 237090 120010 81616 14591 13111 46569 20259 -12285 -85504 -36793
16116 -36793 -176446 -26274 191229 147742 144095 -31234 -66037 -23878 200529 303886 234682
16105 234682 181214 19873 -152886 -187642 -23356 -38022 -61833 78814 149622 110319 48625
16094 48625 136441 190766 191484 250782 219008 179002 18098 -87071 -56632 -90386 -53146 79316
16082 79316 100912 -23994 114520 144608 -39915 -173106 -54301 -169420 -241211 -326215
16072 -326215 -252593 -263314 -256736 -200915 -31929 -124812 -290007 -276581 -321449 9732 25539
16061 25539 27362 -31625 -19398 80742 3210 76604 -9621 -67596 39308 211087 189414
16050 189414 167920 160178 -39464 -235088 -176174 121898 139688 58383 23301 -26795 -23535
16039 -23535 53551 28203 -71781 -208619 -180175 -178310 -225246 -139236 -7279 60172 137588
16028 137588 200302 97576 12871 104040 113443 114629 121624 250525 188278 153869 56712 65126
16016 65126 -3900 -170258 -182525 -250096 -285387 -439734 -346503 -94964 17259 -17938 -113963
16005 -113963 -156078 -155469 52015 111299 93171 -38351 -88711 74779 127599 104424 54223
15994 54223 154369 158656 106015 173806 226462 191922 287340 313787 254141 68709 171027
15983 171027 288686 170602 49940 26564 -80045 -53051 44832 254570 352504 323377
15973 323377 330820 265640 127964 239503 380228 261526 113355 1293 -142563 -108034
15963 -108034 -168270 -191361 -199482 -136134 -224634 -200703 -177148 -180220 -159800 -203028 -78068 -18961
15951 -18961 -163527 -33679 51923 -14773 -171544 -182578 -375555 -349459 -222800 -172543 -249821
15940 -249821 -237039 -116384 12875 44402 180610 82001 25205 287992 412730 590824
15930 590824 582056 446573 373775 182317 -27277 -131965 -231981 -185107 -147224 -34611
15920 -34611 62358 80397 -74113 -92917 -70885 -229406 -374619 -223385 -135775 -108650 -115102
15909 -115102 22661 198892 219222 34685 34519 116741 89861 108202 114960 227271 154511
15898 154511 53071 63273 82092 37220 -47632 -105273 -9367 -18217 35226 -32666 -116959
15887 -116959 81958 233413 178557 93972 137305 290927 420641 403346 342381 318174 157997
15876 157997 87351 182447 70095 138849 169366 168121 -25613 -58969 37364 -56812 -51818
15865 -51818 95180 107693 56045 -42071 13600 43755 148357 39739 -10458 -94567 -179483
15854 -179483 -254283 -425702 -257447 -114005 -69756 -56090 -118110 -41543 -23546 -154473 -176977
15843 -176977 -29488 56757 104667 151981 55918 57419 -56002 -78940 -59066 26203 113531
15832 113531 33815 -143056 -245053 -253136 -107404 31340 -19412 -139517 -153192 -111934 -57007
15821 -57007 -132090 -231561 -162231 -301660 -369796 -279025 -47358 -73620 -192815 109069 231512
15810 231512 -58673 -50064 153456 154911 181370 214632 66909 24817 -79429 -125134 -252134
15799 -252134 -246843 -265254 -120861 -89910 -206982 -214071 -142038 -195146 -356805 -264044 -130933
15788 -130933 -17454 32861 -28349 -107186 -125780 -101649 44507 141024 155085 139604 126173
15777 126173 69769 -305674 -261824 -129836 -106407 3405 24758 3506 -40535 -114811 -70386
15766 -70386 -68886 -106799 -127502 -85630 55278 -34663 22146 10626 67816 -14813 -20081 -119715
15754 -119715 -116553 58056 181926 204351 154729 97468 213905 160650 -43961 -85001 122516
15743 122516 234403 35040 -22718 -28205 -28467 -97780 -267640 -59204 184600 283881 102740
15732 102740 61154 -7796 -188787 -214110 -269946 -298343 -381897 -166257 44425 106821 51472
15721 51472 -133790 -111495 -121342 50807 107252 125836 86887 43080 95672 144875 98264
15710 98264 66019 57309 26506 -27648 -55719 -249437 -361422 -293993 -329348 -318603 -172047
15699 -172047 -46472 74354 111496 137276 65858 114186 50025 75670 166856 111862 -57568
15688 -57568 -127863 -8190 48030 8586 -13684 -81827 -267990 -364229 -218428 -37493 30472
15677 30472 11911 -44571 -100430 -15765 63458 -88154 -174361 -271762 -268061 -241088 -235406 -164717
15665 -164717 -145429 -255060 -278270 -99604 16456 -5486 10748 63472 112734 135260 170073
15654 170073 157754 132195 48355 -162473 -282285 -232541 -122976 133214 351676 388576
15644 388576 297917 93635 259375 341518 139577 -7530 -136508 -315951 -199756 -20503
15634 -20503 -23626 57684 28870 -95797 -135498 -110832 -16490 100024 59468 -41453 124276
15623 124276 150442 11161 -71361 -16878 -14228 -111397 -38954 23296 -1030 -163241 -261766
15612 -261766 -192439 -1346 67242 1666 -105308 -108766 51893 -35940 -108335 -65734 137128
15601 137128 56514 -132394 -179917 -195162 9233 -15569 -23110 123322 152653 215339 156099
15590 156099 -47263 -273230 -544866 -291904 -85047 8274 91910 -73841 -208312 -258759
15580 -258759 -199459 -125336 -121296 -99341 -15244 -102288 -99047 -155589 -89833 -45141 -81258 -220791
15568 -220791 -129824 139359 85544 -53051 -173008 -243668 -225799 -295272 -309054 -383416 -281038
15557 -281038 -286051 -346950 -325961 -234457 -126780 -115782 -134469 -78230 -116862 -119159 -136066 -137244
15545 -137244 -137831 -94065 -72966 40109 47251 81624 38312 68170 -99786 -52810 28575 -123355
15533 -123355 -150312 -146489 -149047 -100712 -98219 -90166 -36188 -66775 106880 184006 189842 161669
15521 161669 66051 71367 181477 278805 367248 439293 264179 96144 -53374 -288046 -381581
15510 -381581 -291294 -121437 -103913 20058 77860 195370 183045 209669 27851 -160586
15500 -160586 -134438 -106838 -5559 24091 -113355 -105744 35414 -81040 -122739 -96654 -32913
15489 -32913 -19953 -36186 -26428 19525 -18816 118292 169027 165221 149854 131363 341177 449929
15477 449929 298515 96195 38880 111883 105654 249651 267594 134160 88527 107199 -4159
15466 -4159 -84015 -215680 -92272 161673 108248 35209 122234 201953 100666 206038 210222
15455 210222 76142 98838 177073 242900 311606 303640 211400 210285 241138 202706 123334 227845
15443 227845 453670 484567 268589 -58077 -39044 2207 52405 35566 -7252 106645 127160
15432 127160 48230 -49633 14398 34048 108666 159847 117154 -42341 -54748 -3882 -41338
15421 -41338 10232 -107363 -59408 -109952 -113198 -81452 -100290 -65966 -170790 -173533 2767
15410 2767 77037 44963 53222 -48028 -104785 -76107 -149923 -215135 -115216 -35740 5141 -23284
15398 -23284 193165 264850 42019 -165425 -137093 -157933 -125318 -81601 123407 -49489 -246295
15387 -246295 -226049 -161983 -136313 -128603 -80341 -203359 -287182 -180965 -182911 -231161 -343398
15376 -343398 -203057 -112876 -86581 -214238 -425140 -541573 -503149 -495848 -326188 -284213 -265724
15365 -265724 -163346 -82529 -67493 47235 91923 85853 -41519 -166868 -4144 1041 169692
15354 169692 245973 119312 59211 -183052 -13271 102021 -34452 -97662 53550 109896
15344 109896 -26621 -184523 -231339 -34480 46107 243615 364363 233042 264666 186037
15334 186037 33804 110101 33753 -90191 97699 160645 95817 213638 272113 214878 194244
15323 194244 177583 40052 -58389 -9902 50271 92193 -6148 62357 45163 -55530 -20674
15312 -20674 -142500 -231092 -64468 -154761 -254720 -112217 56153 -8705 -79699 -65287 -82466
15301 -82466 -100802 -145621 -3945 176070 111673 75802 -29846 62971 65002 -82378 -251633
15290 -251633 -139237 -64919 -92387 -84934 -99136 71884 -88596 -167045 -1854 111092 61308
15279 61308 -67067 -102719 -76627 -81694 -75382 -81793 -118714 -42362 164905 268737 332167 296591
15267 296591 124606 999 -74568 14720 67498 -96744 -128442 -108028 -215615 -108675
15257 -108675 -29679 -32176 -106160 -95774 11179 -58657 186251 346388 262342 81299 -32346
15246 -32346 -67432 -47653 17346 18668 -115707 -17350 22982 17797 -66149 -267570 -155661
15235 -155661 -144643 -129100 -12429 76334 35618 141472 189064 82062 45058 -94699 3029
15224 3029 38691 58378 233712 64823 54934 138369 220838 147965 32222 82162 120735
15213 120735 56916 181884 235147 141222 41763 -64055 -66574 -58232 -236696 -215639 -127577
15202 -127577 -78802 -46774 37049 72982 99115 136444 99360 -62402 -116206 -82600 -68671
15191 -68671 -113895 -112837 71122 233654 329445 289285 187259 11098 54856 50801 -175987
15180 -175987 -266657 -386701 -414594 -343453 -262545 -139427 -78937 -48933 -17685 -130755 -30612
15169 -30612 63223 -147529 -235070 -17871 -702 -130273 -245826 -93503 106019 156341
15159 156341 148232 158126 103323 -45946 23283 -287 -52510 -50741 11118 33057 -15752 -30214
15147 -30214 -23426 182341 248754 102145 33035 -94841 47995 39043 -29103 -141303 -290595
15136 -290595 -210407 -9010 60791 -23930 -206072 -205733 -157188 -89290 -55321 -152521 -54927
15125 -54927 1240 -25474 -176648 -19576 30282 51829 109633 -1282 -73198 109610 234951
15114 234951 263618 -13077 -90564 -145102 -217735 -53741 1282 45619 135433 158111 192241
15103 192241 54231 -4457 89076 -7192 13831 13283 40331 48826 73001 44882 -81919 -173159
15091 -173159 -122962 -104067 -172214 -59357 44665 -108349 -132131 -77110 97998 62404 -60967
15080 -60967 80434 193855 79903 -123832 -82274 -29155 -133621 -280600 -285719 -152831
15070 -152831 -103666 -223720 -58526 -78 118887 64563 89860 110866 -134143 -149603 33462
15059 33462 32346 -21861 43494 90057 -138624 -268663 -274342 -187518 -168024 -139245 -88861 -10945
15047 -10945 -106128 -93281 -4743 36317 50494 -117683 -201511 -214121 -42495 -103548 -243531
15036 -243531 -253706 -272207 -283281 -292302 -248985 -37771 83715 70720 78935 121770 248849
15025 248849 110355 -17776 54800 147576 209512 163946 253718 296085 50918 -37181 -125933
15014 -125933 -303309 -311981 -211278 -60253 95806 86142 18404 -51832 -105088 -39309 184473
15003 184473 276507 212033 222356 357713 170572 113679 73983 44779 63660 -116023 -113834
14992 -113834 -103394 -82789 86709 70881 -16976 -115333 52520 12343 31349 50830 121716
14981 121716 214073 101209 -25731 -206188 -417212 -447329 -355766 -250009 -67003 65728
14971 65728 -4072 -53591 -14022 56759 -208966 -124735 -130021 -88734 -119759 -8856 152290
14960 152290 166642 43924 45593 100456 138231 221016 -17423 88305 37113 -16972 121350
14949 121350 -9937 -249035 -329377 -214717 70441 243721 46864 -10768 54688 136947
14939 136947 86099 101636 212718 7844 -67892 -200919 -183621 -138919 -24789 63401 250211
14928 250211 191754 10414 -54537 -25144 80065 60726 29559 21660 10634 61689 81868
14917 81868 -108459 -137070 40565 59398 -13855 -91480 44264 197827 70969 64388 75693
14906 75693 71196 34393 53985 63420 77255 -121031 -173775 -82935 40342 60765 73929 100565
14894 100565 232820 291195 213052 116366 153672 128629 70271 -59096 -106214 -12382 -14631
14883 -14631 -18506 -45207 -239226 -328138 -225019 -118595 -117182 -181059 -15460 -53264 -52725 -63221
14871 -63221 53484 108841 215321 446389 483848 340885 302799 221300 165613 51363 -22770
14860 -22770 -86991 -167126 -33379 68347 -30191 -234922 -184349 -82441 -125670 -260450 -292641
14849 -292641 -268912 -139236 -151596 -93017 122901 214173 239935 331935 339818 93769 -179882
14838 -179882 -290352 -143949 11344 150030 164412 28871 98676 -42821 -180008 -191210
14828 -191210 -120289 2538 -87906 100769 163595 147955 258508 226446 118021 49494 9616
14817 9616 -66977 -21268 144887 22667 -134261 -274420 -108215 92660 -16474 -92786
14807 -92786 -151720 -16597 -14973 -92887 -271868 -345527 -115675 119022 166515 -86359 -118520
14796 -118520 40777 121861 28040 -118128 -239760 -327800 -260882 -170934 97763 153963 70723
14785 70723 38571 26002 -151439 -263689 -232699 -157998 -171324 -114443 -35072 -54123 -214632
14774 -214632 -241980 -150460 -128371 -215857 -209937 -87423 -5247 -137332 -199773 -24987 31700
14763 31700 -107359 -70252 69166 98916 55643 18417 187814 326189 152423 -143284
14753 -143284 -176572 -97208 -85167 -89889 -132776 -84200 -147550 -216329 -226135 20623 196782
14742 196782 129405 -16015 -43142 -186233 -55973 136382 195872 226106 215708 250249 143299
14731 143299 11896 -76682 -216792 -223764 31667 56916 -127420 -277714 -290691 -223954 -107724
14720 -107724 -139924 -15986 104014 108084 112912 233268 240465 182615 51030 -44939 -81134
14709 -81134 -165760 -320124 -413859 -290366 1708 93001 37352 14725 32520 -30183 -94243
14698 -94243 -18093 22529 -17923 50524 101574 47362 49681 -39853 -54985 -82647 -91831 54099
14686 54099 147991 -24030 -170298 -156006 -138081 -130898 -236914 -116427 39089 24123 -29282
14675 -29282 52748 -101318 -198176 -121950 -183242 -52821 124151 149768 62146 -36829 -79222
14664 -79222 -93288 -18167 93724 147297 123256 103742 133550 123667 24799 44197 109222 103263
14652 103263 -161006 -190836 -51337 -73553 -87653 -32866 47104 81269 -41313 -69974 101189
14641 101189 162426 304622 278582 186962 19105 -8471 112828 112177 98294 108206 32220
14630 32220 -60389 -108940 -22937 -23328 -42626 91907 84511 -148436 -222410 -171397 -71306 110668
14618 110668 67260 -13010 -8746 -80575 -190922 -224466 -169288 118046 120289 21267 156577
14607 156577 151642 -56832 -124140 8698 51896 86245 111605 40421 -43062 -46414 41550
14596 41550 147404 154910 230701 336795 129713 -124399 -136975 -100382 49732 149300 197927
14585 197927 343861 386024 297850 196829 35610 -36515 -93889 -7641 196192 322280
14575 322280 237044 126942 -31700 -13473 -19568 -177538 -136560 -15812 31250 137730 252844
14564 252844 135530 -37811 -51101 -123448 -8733 8241 79083 372401 287301 32801
14554 32801 -51624 67796 79227 -50640 -68095 -115942 -129804 28181 89555 173583 203359
14543 203359 180776 134833 205141 206710 116392 145726 155257 289071 271040 237142 192073 153474
14531 153474 90806 81521 280761 313133 161610 190572 166150 64149 224677 185630 -40919
14520 -40919 -80673 141828 230234 184007 27336 17212 109138 75919 -117331 -22646 -13863
14509 -13863 -116693 -148379 -133043 -144673 -133351 92484 19643 2116 45152 -134973 -140060
14498 -140060 -143158 -99817 -70626 149244 273815 266964 199561 357033 260324 83774 -32785
14487 -32785 6588 147170 319991 288804 287154 136831 -73385 -88691 -44878 -107961 -26559
14476 -26559 71289 -28151 -250693 -234163 -42724 -51693 -72354 85299 110439 -27869 -32702
14465 -32702 25079 -31750 -151041 -274965 -249009 -138157 -74606 80716 181060 180785 188554
14454 188554 104600 118401 148639 212766 15760 -3417 88590 190182 221195 75343 -142183
14443 -142183 -124303 -22090 -120225 -211534 -108318 -128745 -76917 68426 125175 25751 -38637
14432 -38637 -169465 -222931 -26873 -73224 -165045 -206150 -1415 -28557 29044 232649 236267
14421 236267 189893 234242 136691 21992 -75389 -243986 -481075 -525696 -315964 -121455
14411 -121455 -69206 -118865 -115953 -36319 -87398 49911 142898 106862 78873 100142 201350
14400 201350 108078 77973 63469 -88651 -122911 -72140 25324 2757 -164117 -340705 -267801
14389 -267801 -3151 34087 -29571 -62605 41721 -118344 -289887 -354609 -343159 -339110 -209909
14378 -209909 -55665 -147090 -233965 -211153 -222053 -184146 -63421 85991 2561 51719 249983
14367 249983 267374 266169 302268 323093 284124 251231 197221 19015 -223035 -176670 -90617
14356 -90617 -146475 -317040 -295164 -23870 25056 190424 161066 212497 135667 47865 -25325
14345 -25325 -25288 -54859 23795 107381 -16676 -106101 -20907 -24669 34062 -65666 -82600 117980
14333 117980 188806 173842 67869 146093 262808 109044 153945 261932 243471 215748 154858
14322 154858 155989 172284 75843 23166 47026 226852 297574 390880 426573 235538 -72388
14311 -72388 -58533 -139538 -137350 34209 2779 -31551 -238023 -239065 -141000 -13843 7251
14300 7251 -15392 60207 -224301 -375604 -350105 -12393 259737 213054 53320 106355 67193
14289 67193 213236 239938 218140 346659 308907 171147 88095 165251 227561 170005 66453
14278 66453 36512 141948 75966 57032 151170 97181 180648 171463 70843 -63391 40905
14267 40905 109625 200338 265901 162165 207158 214930 89751 -69042 -7322 140603 215801
14256 215801 135591 -37880 -114591 -84540 -81646 -42091 97543 64337 50871 53790 -77594
14245 -77594 -38128 156766 51111 -69669 -1549 94959 109444 115395 65923 159606 228665
14234 228665 93699 98284 -98221 -186360 6304 12947 -152128 -4289 151402 202760 70467
14223 70467 -123050 -148409 -32615 -24731 -44033 -89616 -110894 102421 136259 46274 -90147
14212 -90147 -33406 -110004 87264 225444 108298 28964 -34657 -56340 40216 49020 221438
14201 221438 247671 23891 -39379 81755 230181 368892 262701 43025 34082 -67503
14191 -67503 -165635 -99457 -82697 -102304 -54775 -86663 57570 160028 276314 194123 68746
14180 68746 -465 123927 15822 -15891 -20598 -21420 -39756 83437 -38658 105315 279515
14169 279515 203773 26704 14386 -44727 76212 157711 44331 -32357 128189 160352 97715
14158 97715 42894 38637 81416 -2798 -18537 -3235 93283 95088 80523 77291 103546 13579
14146 13579 -205037 -30627 57562 33267 19856 92121 61788 2170 106393 -65645 -130138
14135 -130138 -157524 -148323 -187823 -64905 157648 42585 82459 212163 229926 166195 92455
14124 92455 -71919 -103833 73883 11271 12259 66375 147785 210860 80216 -174020 -238600
14113 -238600 -92634 120767 120826 30597 -157316 -80012 -42433 -150101 -285307 -401415 -358965
14102 -358965 -255051 -118555 -82391 -149642 -127533 -137252 -120521 -179802 -17269 124663 249705
14091 249705 198706 -69795 -102679 -151312 -82084 -128782 -208842 -283974 -264474 -289384 -290937
14080 -290937 -310461 -239338 -247591 -245670 -200577 -4261 -54250 -59491 110264 116995 -10381 -98910
14068 -98910 -93062 -184169 -165081 -64847 39292 72621 52862 78795 -51661 -2023 68765
14057 68765 176400 158527 142875 109477 -4431 81651 223309 201116 116131 131321 51654
14046 51654 47202 147844 100701 65136 -16393 51450 125008 230434 261088 75162 -182783
14035 -182783 -181766 -31152 55149 171752 157039 17707 -196899 -186094 -279090 -231765 42685
14024 42685 207946 91285 -50614 -83652 -38856 -137059 -132608 -110556 28217 80297 186073
14013 186073 -15063 -70397 -36032 38571 140531 237267 150139 303859 248701 177006 110303
14002 110303 93324 59658 -59070 -79098 -19138 -145496 -120349 149276 338160 237219
13992 237219 65651 -6536 -23886 30199 -95473 -101073 -236543 -307116 -215572 -185446 -284928
13981 -284928 -319301 -174377 -180735 -169781 -151667 -253951 -150625 -28385 69545 65861 88696
13970 88696 123809 301028 219617 65480 -44389 -51943 -152897 -44918 -90588 -68748 -25708
13959 -25708 20247 -5448 -55990 3547 114451 -75214 -145360 -47261 -70046 -81029 -124548
13948 -124548 -151707 -71900 -191001 -45016 23728 -106551 -119821 -235404 -232356 -286821 -367529
13937 -367529 -380651 -410319 -400683 -398508 -231295 -112730 -46486 22963 76432 67532 -118804
13926 -118804 -242374 -79475 103321 141661 148123 297774 263863 257826 2824 -156480 -102709
13915 -102709 37008 168800 -7367 -114196 29995 9769 -75562 -116001 -173808 -270344
13905 -270344 -201038 -159225 -120459 -32744 119945 79156 -5098 -73182 -58036 79596 170416
13894 170416 -50412 -111439 70202 205917 175862 146882 237983 214479 150750 71920 62897
13883 62897 49437 -9402 116017 -5354 -120911 -19766 86503 74969 33406 -24948 -79362
13872 -79362 -59984 -25129 -98935 -45029 101960 103414 -102127 -218347 -134027 -44668 40819
13861 40819 -52375 -40312 32431 165149 8936 -11971 -16523 -162588 -94458 -109186 -81942
13850 -81942 29453 51148 68164 -26141 17171 -109588 -260661 -153715 -53140 10699 103870
13839 103870 79734 100166 -68168 -165844 -3318 41101 45667 -41491 26681 130257 115500
13828 115500 127078 40398 -126628 -121247 11292 118550 144569 203076 144819 90171 62530
13817 62530 70895 87919 42130 87446 244634 147106 64993 108022 245737 362286 299370
13806 299370 202125 145364 148441 277549 242031 82930 94972 73621 86268 -3744 -23201
13795 -23201 -116393 -154540 -85822 -104600 -240353 -227471 -168429 -14929 25316 188544 316121
13784 316121 201364 -18856 -57604 -36719 -57077 -84800 60014 85413 152209 -10866 -219444
13773 -219444 -111713 98437 91183 45242 37169 95527 192178 -60605 -27343 235734 307263
13762 307263 239888 -34389 -170594 30680 25292 -61704 -145477 -156459 -50436 -52897 -55110
13751 -55110 81674 142972 233605 345454 76583 -26296 -152143 -157627 -35903 -8827 -151601
13740 -151601 -167911 -226157 -32797 109863 200896 227211 287613 162716 104250 238885 370842
13729 370842 332331 202045 139572 203759 146042 48208 -40594 -118398 -25262 -85112 -200083
13718 -200083 -6695 84256 172659 162768 200480 88317 1715 44773 91079 -5318 66843
13707 66843 19774 399 60578 74068 -6670 -45517 -12912 174994 143825 146205 125902 -35437
13695 -35437 -591 24476 -122165 -229181 -289734 -280393 -246729 -63624 -70799 -280101 -289939
13684 -289939 -263268 -103447 -38509 130451 115111 -86517 -125077 62919 78463 -131878
13674 -131878 -236715 -378329 -350433 -293174 -130614 -204397 -235562 -157762 -105931 -10219 124630
13663 124630 181419 123675 105469 209343 316958 295023 228714 221292 106341 37997 70756
13652 70756 95008 105875 61178 13244 4620 7688 -19908 -23582 66370 44100 -9979 78309
13640 78309 -25087 5281 48029 37807 -17829 -58578 -3617 -54934 -140527 -57186 -34100
13629 -34100 33789 83858 70866 37949 169080 195492 243152 101299 108873 -41238 -52084
13618 -52084 -71295 -1902 59241 44323 -92620 -63260 36152 91247 83463 62144 -43360
13607 -43360 57740 225454 104277 83241 86880 81104 61080 12559 -169767 -347271 -273256
13596 -273256 -134252 -49185 -58402 -57617 29407 -81491 -280189 -171388 -52049 10341 117504
13585 117504 184410 -37392 -47462 -11664 72420 162354 87228 143864 192618 249062 240001
13574 240001 376886 403825 344944 194885 91540 90849 120644 12431 -139617 -239496 -25500
13563 -25500 113848 193135 -40686 -166858 -100439 17334 51148 90015 257540 213003 -16378
13552 -16378 15263 98368 52447 31546 95073 36998 826 -44024 -610 153483 304766
13541 304766 110730 -81233 -75266 -53609 18482 62831 67130 80554 256808 338773 183201
13530 183201 -17488 -5574 -74744 12220 108907 18629 -24800 3815 52770 -51328 -63495
13519 -63495 -36837 -59286 -192893 -37952 99199 31738 -8218 -1906 -66499 -51483 -34430
13508 -34430 -93444 -117556 91080 107040 191354 56162 93050 -86256 -210792 -271588 -145996
13497 -145996 -53988 -74120 -121166 -143103 -106973 -68458 -73003 -78742 -55169 100915 91918 21381
13485 21381 55621 1180 -47212 7555 6487 112558 114942 138165 186144 301395 271295 210867
13473 210867 -16449 52521 256055 222853 52629 -52996 -49886 73185 196676 279869
13463 279869 323300 296485 320105 168090 41762 24400 -39935 -71471 -34901 98093 134366
13452 134366 174876 21376 99800 118809 -9154 -110155 -187099 -109788 -52002 109216 119479
13441 119479 218242 163943 91463 119874 161574 130760 161081 283021 244736 76761 83580
13430 83580 283966 450663 379216 345613 299368 202638 67809 8811 26676 -45737 -41634
13419 -41634 -113181 -257444 -170915 -62374 -10459 126314 240110 340218 427008 388300 264143
13408 264143 199465 182313 203436 347960 249556 166097 -2301 64916 170183 -98690 -253182
13397 -253182 -130231 -135968 -40540 181261 328435 430489 407630 202866 142400 86805 153474
13386 153474 164344 168938 191764 226690 398185 338992 210644 156598 349756 448573 306605
13375 306605 266451 284092 392884 308059 184111 67705 1865 -3825 87303 80160 196547
13364 196547 159980 104834 -7929 -193815 -188527 81888 132128 53384 -78085 -68957 212780
13353 212780 324421 183606 -19161 71581 222973 316899 301592 180354 15080 -70313
13343 -70313 8360 98913 31860 -17404 69106 63933 65523 -163423 -73669 129727 133837 242936
13331 242936 245257 203819 177947 83150 -5136 96707 219625 248615 232699 77831 -46380
13320 -46380 74916 118428 193770 170801 76818 88285 -34928 -26427 68137 -3445 44817
13309 44817 104374 97233 287886 146304 175346 189732 66797 23739 25922 143594 202406
13298 202406 241195 241261 380664 334533 286946 191418 139035 197965 250706 172992 21650 96343
13286 96343 230120 148720 138442 126071 304433 569271 534722 349030 353844 279777 122597
13275 122597 148401 230549 109371 30289 152071 301546 402169 243909 464401 517067
13265 517067 267440 48963 -56252 117336 163772 159406 -34367 -120803 -194429 -76163
13255 -76163 -61683 -81884 -143826 -107851 54733 279536 180691 84500 68226 -41745 -39647
13244 -39647 -44038 -57536 29328 -25011 -143390 94947 345109 313526 132575 114416 214747
13233 214747 149381 213616 423127 172997 -29559 -24994 -27819 -24003 -25766 169546 342630
13222 342630 209114 165822 231490 234109 167942 171831 105429 49348 -15602 -85610 -108808 -93041
13210 -93041 -47304 -138060 -132591 -186369 -13768 112815 176124 214967 147873 -54150 -93441
13199 -93441 -27417 89265 67059 258389 391864 508961 372693 194212 202855 197912 148279
13188 148279 127837 145563 190980 139705 171443 113177 155371 296446 465172 426209 427750
13177 427750 408573 403567 388567 478103 520790 589897 644790 1004415 1055548 1131337 1189946
13166 1189946 1269964 1157217 978683 947391 914966 948145 796663 744810 578268 557571
13156 557571 560676 742615 753769 639024 593044 703965 672113 807498 987039 1070715 1068732
13145 1068732 1165223 1291712 1301014 1283843 1331924 1449165 1495998 1544131 1557871 1822546 1830672
13134 1830672 1803148 1647126 1484076 1322248 1281309 997106 891946 973003 1007300 1098871
13124 1098871 1189567 1033129 974194 837000 838848 674089 585589 671139 522751 456598 658220
13113 658220 667224 494385 596036 672147 829112 988578 1252166 1420482 1446870 1323090
13103 1323090 1130193 987224 990468 902718 785139 702038 575448 661581 758450 610643
13093 610643 394392 264524 206857 179352 42176 202354 294879 189915 218770 101576
13083 101576 -33312 45629 223422 366608 522612 430703 507647 540564 309354 231606
13073 231606 335607 405362 316360 218500 -15236 -96436 111514 311907 376839 333253 273073
13062 273073 396663 414040 414480 210982 147814 313230 279259 326346 396619 206340 88766
13051 88766 204341 171205 149519 38006 156244 206762 92127 160457 297442 382963 417259
13040 417259 484756 556751 445657 400482 265978 201552 182367 308792 305571 432371 439654
13029 439654 491569 307442 103441 72439 148614 148758 113303 96189 150736 187907 139549
13018 139549 163130 60731 45590 52751 -96403 -137656 -128085 105383 323225 245124 56864
13007 56864 115875 128092 138517 169903 298759 363645 316921 300442 96366 10365 100633
12996 100633 293131 436804 356706 348709 101302 33227 2791 133041 172337 120624 248153
12985 248153 219122 242805 286356 135294 83801 77569 166315 398428 460028 431402 362583
12974 362583 413581 342845 330394 335232 532041 438561 262014 314968 449664 462119 458524
12963 458524 439734 257801 231510 410908 524399 566287 420443 360569 528744 721488
12953 721488 859018 807459 650200 650626 629613 534671 679499 811877 739124 687134 656321
12942 656321 680616 842453 933564 864124 804110 724833 604807 599372 690314 757883 755951
12931 755951 613113 605133 640955 726830 738247 903724 987637 982661 940590 769372 732954
12920 732954 955267 1015127 914791 856422 819123 752566 612016 605782 525905 357916 448362
12909 448362 557951 646631 614373 491723 584535 722288 573348 592935 767328 844711
12899 844711 770956 693370 695824 599736 543901 701397 666298 696249 653711 624378 597870
12888 597870 415486 391786 550214 620989 619821 670618 840846 742429 626902 517824 515973
12877 515973 526342 606907 474952 519387 770460 854424 916903 919035 801399 884232 826501
12866 826501 821316 811329 826001 747915 616667 621939 597315 531588 631342 835878 842015 793213
12854 793213 913142 869321 807041 809625 940042 1124477 1092020 1027485 1338059 1459376 1634595
12843 1634595 1619500 1657750 1595864 1641102 1599524 1587717 1574054 1546522 1426571 1235261 1086570
12832 1086570 1129294 1149679 1045237 974857 1114769 1139818 1049801 1112194 1248518 1318948 1063314
12821 1063314 913555 1058806 1077205 1118900 1407706 1571405 1594022 1410619 1427242 1432440
12811 1432440 1492499 1423418 1261523 1209782 1152116 1137809 1031777 1092810 1266779 1230352 1151625
12800 1151625 1226842 1250000 1215795 1178931 1031487 1161060 1223277 1277711 1309834 1507864 1469206
12789 1469206 1513512 1584506 1701442 1872279 1938122 1948362 1957069 2049071 2051684 2211781 2280627
12778 2280627 2249262 2165685 2171077 2280318 2147438 1926987 1975650 2096450 2155139 2239629 2310402
12767 2310402 2456505 2353572 2346059 2323695 2245270 2420688 2688100 2794050 2844098 3007573
12757 3007573 3137279 3116921 3340596 3674192 4039912 4327605 4307078 4320960 4362296 4419438
12747 4419438 4629910 5027169 5339294 5423835 5630413 5743209 5815525 6134347 6583671 7139957
12737 7139957 7821036 8599280 9548912 10580444 11418277 12482701 13782022 15094489 16652789
12728 16652789 18711046 21086264 23880861 27362982 31892064 37803900 45838800 56648322
12720 56648322 70965006 89305318 111811583 137921716 166423675 194706784 217030233
12713 217030233 226821160 220742831 200272506 171400434 141358651 115522024 96049377
12706 96049377 82360246 73174005 67505709 64811424 64285754 66033632 70361947 76931702
12698 76931702 85337180 95400473 106720752 118822388 130546363 141638863 154580680
12691 154580680 171038822 191154279 213124905 234898968 255707723 275778393 294840531
12684 294840531 310113777 316390204 307465306 282373351 248565541 216060708 191475587
12677 191475587 176332812 168433771 165040480 163869595 162574144 159613948 153629223 144427990
12669 144427990 134372183 125804060 119457562 113064114 105027306 96444778 89553990 85377341
12661 85377341 84873378 88776299 97186503 110675301 129895239 155078290 185874419 220493986
12653 220493986 256002811 286492149 303765610 299384005 271182305 226886732 179635825
12646 179635825 138851001 107422235 83949958 66839530 54554139 45454234 38438617
12639 38438617 32853150 28541676 25174927 22362459 20024291 17994757 16282707 14621121
12631 14621121 13218877 11821933 10662257 9664313 8989764 8550289 8121182 7646427 7257730
12622 7257730 6952296 6438773 5934571 5520535 5155622 4900836 4846381 4780008 4556637 4329046
12612 4329046 4060323 3955614 3890816 3628028 3520105 3319356 3083134 3115483 2972825 2812834
12602 2812834 2652036 2478558 2329203 2264715 2277873 2248268 2018049 2006971 2112399 2160242
12592 2160242 2345705 2522110 2586622 2458242 2315292 1988904 1900328 1773747 1675531 1603343
12582 1603343 1696226 1728468 1702054 1704383 1625962 1526275 1510933 1439255 1318543 1260954 1241976
12571 1241976 1268064 1258612 1137320 1184157 1222933 1215252 1142609 1094248 1180706 1238511 1191938
12560 1191938 1160774 934921 837118 851985 865113 987485 1076060 954813 923903 843890 939617
12549 939617 922892 1037293 1177058 1103313 1142144 1099903 923470 944237 981093 1088142 1110132
12538 1110132 1075785 1270702 1269184 1222732 1493839 1739758 1968030 2212996 2375239 2552070
12528 2552070 2659809 2601157 2462404 1907534 1401781 1195577 995807 1017521 824138 784757
12518 784757 682462 760679 827580 685678 807672 1132423 1031947 900092 815923 742911
12508 742911 691752 899656 795064 661173 526492 410023 372028 509180 586184 621487
12498 621487 770776 856802 835158 858180 745041 633574 691553 754377 605772 456421
12488 456421 505748 582899 639474 693776 613992 582853 665589 914685 826429 698094 631230
12477 631230 516310 482066 669219 558664 601666 558001 598783 720787 822118 875733
12467 875733 769985 464867 420041 543165 672057 463645 483805 677402 549181 478432
12457 478432 545515 693045 821357 828050 703837 636779 665177 558310 568546 811634 821744
12446 821744 831104 871291 900217 923445 844745 824786 925896 893070 892368 912611 884178 901646
12434 901646 899447 1015809 965301 864724 810597 678872 623262 784906 854343 1058053 1032129
12423 1032129 732612 545886 519411 875300 1046996 1185086 1506256 1849787 1834504 1842255
12413 1842255 1925739 1999239 2250741 2491025 2737148 2682557 2723343 2655271 2418397 2235147
12403 2235147 2008308 1812101 1722139 1679195 1485106 1215105 1153415 1084785 1039843 957744
12393 957744 1032360 1139053 1175287 1117183 1125549 1182273 1047418 994072 1139788 1368350 1562891
12382 1562891 1556973 1695373 1745563 1594961 1593521 1806235 1755016 1678654 1722622 1574068 1504883
12371 1504883 1426280 1349943 1396502 1625264 1719583 1585672 1405526 1469601 1390304 1210358
12361 1210358 1160668 1208638 1376970 1585735 1739333 1685088 1789958 2092696 2283215 2277362
12351 2277362 2101274 2051559 2095800 2267879 2265536 2083251 2176706 2145580 2074920 2008294 1961314
12340 1961314 2045969 2173662 2333369 2466670 2539883 2789701 2979721 2966889 2770222 2688582
12330 2688582 2795165 2934402 3048073 3285535 3446918 3521014 3731032 3983802 4114598 4491875
12320 4491875 4774972 5029479 5255278 5396832 5698898 6057337 6366531 6700506 7056362
12311 7056362 7448219 7906644 8378857 9047124 9673243 10341942 11327383 12405975 13576845
12302 13576845 14889624 16501217 18555059 20987906 24018172 27761138 32427415 38307403
12294 38307403 45757999 55321673 67956003 85000017 107030893 134455463 167435872
12287 167435872 204538734 242946242 277436613 299975241 301987210 280559461 241802645
12280 241802645 197760620 158888096 129577524 109409111 96645622 89057340 85582062
12273 85582062 85620718 88676624 94100272 101652620 110388438 118580482 124939310 130095951
12265 130095951 136287289 145045513 155939662 166680782 174128964 176432619 175734468 177333244
12257 177333244 185361228 201115390 223270613 249303532 275106136 294884403 302978850
12250 302978850 297500231 280950774 259205384 238407675 219893265 201115791 180719437
12243 180719437 160354640 142423476 128853856 119233133 111573408 103242620 93200736
12236 93200736 82510876 73956633 68467049 65859641 66102098 69183969 74952017 83944922
12228 83944922 96626210 113126603 133244827 156097014 179986105 202161094 218125227
12221 218125227 222240695 210640451 184560765 150797185 117972157 91096846 71024804
12214 71024804 56563972 46242664 38611180 32600114 27956444 24025437 20772630 18147503
12206 18147503 15776819 13882662 12579342 11484838 10583307 9604346 8772751 8178967 7597785
12197 7597785 7185390 6828555 6692588 6450308 6150393 5852586 5714382 5621073 5448131 5236402
12187 5236402 5314329 5631019 5946931 5833840 5547633 4884281 4307185 3992758 3859310 3858915
12177 3858915 3660143 3553147 3597144 3593936 3390630 3233025 3065180 2865392 2742200 2776013
12167 2776013 2938600 3097246 3089214 3079480 3227200 3143035 3078574 3101701 3163164 3016596 2920830
12156 2920830 2879776 2903366 3138161 3297882 3483159 3514134 3350668 3330024 3103022 2912123
12146 2912123 2750413 2692340 2486597 2312640 2237298 1989293 1883730 1946523 2016798 1961455
12136 1961455 1739153 1516975 1480494 1496262 1611190 1836521 1816205 1779431 1929980 2195094
12126 2195094 2510307 2514453 2558848 2659793 2675289 2651389 2527385 2279962 1861465 1670701
12116 1670701 1524625 1282933 1125876 971720 1003133 1232619 1345171 1129022 960817 889710
12106 889710 988014 1046124 1031367 1057015 1140690 1075425 904920 669299 784586 840274 755639
12095 755639 687025 740795 558614 487037 470882 583081 652002 597567 515070 659923 788225
12084 788225 737192 754198 804582 855247 986061 1018380 1053904 1002830 953650 989075 836319
12073 836319 780799 688496 690546 911587 1089309 926114 784068 755734 574043 666490 695309
12062 695309 582848 807033 960848 862523 674698 579981 572646 652061 661873 669728 709804
12051 709804 652191 590273 664880 695268 711736 545072 530042 347251 222575 271243 211699
12040 211699 281307 345325 323219 155569 243706 416511 352475 270369 128124 113096 98698
12029 98698 312627 617580 641957 475635 423486 328460 204595 319483 517452 573882
12019 573882 552911 332729 190370 311199 288490 249551 305460 248051 278709 286338 371387
12008 371387 377723 470376 541164 435615 496190 669815 648243 611365 696833 603594 562987
11997 562987 417266 291655 218542 55624 51752 189298 499256 543265 565692 615878 627783
11986 627783 692574 679246 837458 1018199 924907 643167 428809 351583 329953 323282 367653
11975 367653 380735 291278 317768 303278 292219 222407 150386 147695 280761 233004 -8589
11964 -8589 -117275 -59379 65105 -36726 -58233 -41358 -39219 12528 72013 285776 452072
11953 452072 431489 226859 131987 56168 43575 90437 405256 527023 439809 211085 -30606
11942 -30606 -268577 -233252 -178068 18977 81396 110346 144810 117676 78600 87789 199084
11931 199084 149873 183821 49012 212053 302504 292016 290512 172462 127853 334480 312302
11920 312302 298969 340218 356265 423776 392777 298002 247062 258214 325329 292677 -22912
11909 -22912 -44551 -17160 95203 178059 230077 97160 30101 -70861 72869 66091 15539
11898 15539 67577 293952 201564 171453 146717 145404 91595 45724 66589 125041 126621 101696
11886 101696 73254 181592 149597 206461 339048 388775 321566 187407 310613 317908 202071
11875 202071 310507 165212 190997 177078 337405 219852 63526 103884 47379 130249
11865 130249 147415 225313 222181 137825 178386 247745 320299 321917 348942 318465 234664 220534
11853 220534 118263 -16157 94980 277346 465968 534330 699980 950057 1197398 1403292
11843 1403292 1388739 1423469 1368692 1450577 1244221 1150035 1141938 1009806 877837 715431 530349
11832 530349 396489 292692 222603 413858 644773 652558 720501 618306 422480 550832
11822 550832 620986 764454 1024478 1096395 978021 919721 1035485 1130312 1074168 1115876 1357068
11811 1357068 1491264 1401584 1176235 1078966 1024943 1096983 1086869 912310 724760 748316
11801 748316 731235 724724 596288 471594 355142 474861 561303 557578 442810 371053 243638
11790 243638 182720 175783 320859 293880 303638 351712 403351 547765 781383 1127035 1339275
11779 1339275 1295724 1194283 914600 698579 608073 572577 424740 327870 321609 341109 393394
11768 393394 457702 409536 227200 195120 168875 82501 38289 -10824 -171571 -251127 -192570
11757 -192570 -52017 -36078 -160554 -243505 -243644 -218285 19899 180905 234752 174365 160933
11746 160933 159284 11305 110343 113620 7114 -118581 -108025 49812 77095 -12606 -24658
11735 -24658 22215 10857 -178170 -175504 10081 101328 87172 117026 191763 157424 -5115
11724 -5115 -93228 27627 -93238 -126977 -160045 -178660 -166550 -199709 -222801 -234144 -125494
11713 -125494 -162640 -225747 -206282 -166250 -111686 -21691 85380 79190 -63710 -135696 -179457
11702 -179457 -234621 -209668 -77782 -41134 -5670 18472 -141059 -189422 -50800 90682 113588
11691 113588 40222 -26236 -188609 -233289 -136191 -26166 76772 170692 117954 -93038 -162494
11680 -162494 -221406 -294532 -199651 -189237 -132274 -170267 -117797 -164892 -265976 -184502 -122722
11669 -122722 -102957 -223203 -278259 -217571 -97828 -117173 -104387 -181072 -140197 -201415 -176043
11658 -176043 -106534 7618 19753 155712 218674 41589 105697 191253 65906 -146433
11648 -146433 -80343 58520 -32877 -241049 -214608 -154388 102437 146220 152157 242381 293232
11637 293232 308824 174200 125131 48849 -30861 -8769 66168 193867 206927 211648 95516
11626 95516 103181 277624 300966 331267 296495 199130 229373 184247 176252 219804 144786 -5773
11614 -5773 -96217 -185542 -166504 34654 242964 388383 266990 157151 148652 57657 -38391
11603 -38391 -209044 -244305 -146258 -31611 -70970 -94714 -124252 -87719 20838 101569 95260
11592 95260 179647 178682 72397 61410 135304 183873 242640 318852 233199 119528 96505 90648
11580 90648 48196 -88389 10984 -58234 -71681 53020 94174 -33770 -206779 -194820 -179250
11569 -179250 -176824 -124512 -10573 134727 232713 262297 379262 295676 252076 99324 42643
11558 42643 -85451 83809 325806 357794 122239 110077 36187 -28152 44430 59994 120417
11547 120417 63268 10366 153022 96635 65613 -70615 -224240 -206720 -207615 -130509 2540
11536 2540 161602 203413 122936 101619 8074 27839 208352 228891 186108 117912 -26716
11525 -26716 -68884 -139409 -84167 -16748 83857 228927 176522 -14859 -75700 35996 224357
11514 224357 286381 236648 117578 110778 21264 -72458 -87319 40529 -11059 130889 200918
11503 200918 194591 169620 147836 157760 276039 253245 143323 142230 153944 25072 117808
11492 117808 -3072 -20851 21708 63063 204914 197289 132080 -29020 -6023 48146 151273
11481 151273 244783 81057 -80242 -50459 29882 -6922 -45260 -41354 -165001 -214306 -154818
11470 -154818 -138231 -40513 113433 310991 260925 175067 -58451 -114869 -171072 -144835 -191963
11459 -191963 -201366 -161223 -29143 156288 214473 310521 178034 -139884 -259087 -155619
11449 -155619 -77997 -98257 -73785 -14365 65454 5656 -23342 -116124 -176827 -34086 135374
11438 135374 53809 38467 139408 96145 -85764 -287953 -373367 -509316 -343716 -214220
11428 -214220 -91457 -204415 -308365 -307856 -172644 -6910 11579 -48671 -138209 -180099 -241111
11417 -241111 -253431 -340992 -445054 -434737 -261140 -262866 -251286 -226041 -155040 -50741 6836
11406 6836 53845 57323 103427 130474 -58793 -184253 -34122 170201 273205 116498 88385
11395 88385 -22495 -61448 -86239 -20474 21928 36084 205359 151199 59312 70623 -53817
11384 -53817 -124936 -145514 -192321 -204214 -120375 -19521 62561 -155343 -262395 -107073 240986
11373 240986 39065 -79291 34097 128752 -96278 -95077 37153 -56661 -117060 -244850
11363 -244850 -225122 -76698 -41996 9047 70679 -10161 44163 -121410 -223729 -42974 -183062
11352 -183062 -313403 -274300 -270879 -255507 -304769 -57022 96100 39591 192093 99198 -176295
11341 -176295 -161678 -110352 -123332 -280550 -203389 -124083 -220124 -19662 -51657 -106063 -204482
11330 -204482 -182471 -26358 -55313 -119160 -365309 -583233 -631070 -272187 -20579 -69524
11320 -69524 -168475 -148164 -24098 125131 12576 -109559 -163041 -145977 71072 146068 -9182
11309 -9182 -128382 -38572 -128858 -55749 -86518 -123990 -159786 -67399 129090 246003 283282
11298 283282 261815 120291 178148 350040 265040 111811 157294 77977 -67389 -37430 -97086
11287 -97086 -157156 -161368 -10202 59625 38475 -109399 -165945 -288065 -429173 -423065 -255884
11276 -255884 -161900 -119840 -103453 -6248 -28317 -32968 9968 -96998 -172787 -123980 -114876 16982
11264 16982 35097 32977 183619 157749 -41950 88153 112821 51766 30405 -80634 -34085
11253 -34085 110958 14477 -20135 -107759 -303774 -226106 -156921 -95653 -116088 -33644 -54037
11242 -54037 -156631 3166 16987 -126359 -89267 -73508 -76354 -83725 35412 97076 165087
11231 165087 92660 58624 54336 61322 98814 256857 110599 106523 124760 81406 -34105
11220 -34105 7025 -17235 223553 288953 271934 71773 -27299 13317 3672 -48082 99195
11209 99195 110554 250866 159092 186893 108846 -214210 -441992 -418908 -38891 194944 33699
11198 33699 5214 -146704 -8522 -33719 -17666 32081 -73160 -74589 -89786 -192204 -191908
11187 -191908 -5799 116439 227038 183379 117465 -18163 -12886 -53552 -329367 -364630 -344060
11176 -344060 -316214 -304638 -283743 -196750 6355 -10011 -63640 33429 -86652 -255382 -272846
11165 -272846 -266636 -325230 -107137 129790 57388 -147430 -78459 -241673 -257115 -141607 -173021
11154 -173021 -293698 -69259 45946 50232 213820 151136 123278 37103 -132780 -181105 -158875
11143 -158875 -264476 -183344 74854 98869 -42927 -87060 -135620 -168768 -176132 -233343 -177385
11132 -177385 -173691 -140073 -150823 -174833 -47705 121491 35375 -105320 -22825 113638 245040
11121 245040 153933 116230 -32101 -22157 -133421 -75261 69737 118351 120003 188007 -69969
11110 -69969 -173949 -80638 101655 43853 -41868 181823 177283 244716 225314 107485 5959
11099 5959 -60582 71879 5220 8449 84022 177293 90212 -86670 -26856 -65452 -54187 -142892
11087 -142892 -53045 92127 13350 -21784 5457 -83583 -34593 143735 57107 31253 108022
11076 108022 179941 193333 207374 167219 180626 91960 4786 -98190 -163987 -257868 -369001
11065 -369001 -225253 -166952 -178649 -124645 -143603 -96863 -85834 -57744 46148 46976 18449
11054 18449 15173 55152 136020 110630 -80357 -48306 40723 124463 34187 -156679 -261234
11043 -261234 -271301 -289121 -231937 -287474 -183748 -85663 1314 -42232 -128897 -153037 -28311
11032 -28311 -6301 -20266 84282 133893 -134726 -212089 -62997 -87137 -181655 -121051 -87598
11021 -87598 -97662 -55656 -103421 -4012 48396 133400 97506 -10166 9249 -61784 -38025
11010 -38025 -96013 -199027 -104603 -80817 -101442 -157058 -74257 -223316 -227613 -52404 55050
10999 55050 -143503 -173011 -195688 -207489 -167836 -92713 44133 87123 184605 361682 405847
10988 405847 361738 238064 175940 137465 29586 137180 156650 147238 131146 146794 44076
10977 44076 89076 -6488 12048 -84532 13431 -40845 -92082 -50734 -184410 -334232 -255456
10966 -255456 -90095 37377 -24768 -143999 -234969 -196489 -140094 -226939 -218725 -46889 60911
10955 60911 85991 41234 -16990 -61850 -91256 -132370 -170806 -171352 -49134 -46775 37732 54307
10943 54307 167358 177928 62000 20722 -214732 -320231 -273110 -138590 -172625 -23845
10933 -23845 -71177 -47877 -91780 -123703 4391 -120473 -233169 -79191 46639 -166987
10923 -166987 -93561 35105 154270 7861 -135961 -47366 -87901 -154864 -68936 93027
10913 93027 50198 121735 157530 180169 81384 72702 67826 10377 9415 60861 81338 38090
10901 38090 17719 -113700 -35318 146759 268671 349566 232338 230400 167765 26335 -72218
10890 -72218 6526 16248 54379 35324 -91139 261 124201 417729 381831 211666 93785
10879 93785 -23079 -47715 15321 43120 178678 119704 15091 -141456 -350114 -272809 -90158
10868 -90158 -69499 -71721 -14772 -1638 -99239 -144721 -180519 -173477 -105107 -68496 43361 164321
10856 164321 243117 145050 -16245 50522 163445 200600 188507 218550 94510 -37550 -90466
10845 -90466 34390 58510 129753 48494 -84239 -149231 -28017 50381 79042 116034 83943
10834 83943 39627 -37035 171816 210917 62751 47193 161137 119196 132662 112099 -22163
10823 -22163 -204708 -165016 -109594 -212055 -318320 -297675 -281270 -216613 -123087 -186674 -182456
10812 -182456 -231328 -130029 46322 50826 -1325 -18072 -52317 -15751 -54790 -205740 -301225
10801 -301225 -177416 -157111 -228155 -224542 -86996 128048 284589 194351 155413 53375 76181
10790 76181 -55772 -128076 -34877 69277 12108 -24823 -5691 -35010 -60677 16843 -32194
10779 -32194 -33223 -61458 -158171 -42665 72479 111820 61734 -26145 31795 60095 41169
10768 41169 126507 -20136 -66448 -175550 -232685 -62473 11374 -267033 -258720 4960 22594
10757 22594 -64012 -146745 -139898 -144699 -75127 36537 50596 -34178 21550 174509 118504 16298
10745 16298 3548 51850 43184 -128665 -198495 -260530 -119961 34395 110578 65051 98645
10734 98645 134610 4120 -196798 -85190 -165666 -240075 -203319 -131688 -83580 146917 216812
10723 216812 168466 196515 248235 29169 -112386 102739 15499 -105254 -182502 -112802 -19937
10712 -19937 119479 47589 -11983 -42927 -119649 -128527 -104770 -186182 -208378 -201076 -128141 -103213
10700 -103213 -312801 -317746 -245313 -292734 -242687 -67828 -142326 -183031 -202825 -235246 -182949
10689 -182949 -59383 35831 -30778 -131803 52772 95926 113796 61838 -66932 -43319 -101720
10678 -101720 -225234 -212032 -171918 -71486 876 -63471 -58632 16274 96579 60003 -19302
10667 -19302 -24830 -92769 -104238 -10631 179381 151198 238517 436311 274352 134569 -94315
10656 -94315 -277757 -279010 -238878 -305061 -202971 7676 111906 -110985 -271586 -382172
10646 -382172 -278946 -133838 -102075 -208201 -160999 -102508 -28869 -16864 -234793 -254742 -219570
10635 -219570 -104487 -17795 -119235 -144955 42836 -25208 -13228 -144784 -164903 -26944
10625 -26944 -47966 -12662 -46784 5040 88364 128074 174860 214787 117119 7781 -146038
10614 -146038 -299788 -249647 -237194 -148387 -53903 -70529 -57382 -166432 -96659 36830 130256
10603 130256 128418 130765 111263 29598 82165 63001 26905 60114 112513 243353 209998 15204
10591 15204 -218416 -231414 -130762 37086 220438 219580 85091 141685 214079 149736 143711
10580 143711 208055 255678 149105 -2877 54988 197542 181987 186441 15287 -78939 -183146
10569 -183146 -164654 -48837 153271 171036 139827 -101342 -123443 -207315 80660 72665 -33116
10558 -33116 -17761 2400 43241 89264 -53731 -113089 -102046 -146438 -323600 -319969 -388753
10547 -388753 -383098 -342823 -389571 -356253 -138629 -160735 -149473 -183530 -39415 1684 194743
10536 194743 253969 109003 -83954 -162221 -147165 -65771 58570 121834 254998 261041 106652
10525 106652 71390 -508 15120 180821 157627 -44207 -48533 -51609 -113800 -67115 78788
10514 78788 93133 -967 -39284 -51891 -250645 -99298 44160 63957 -20738 33002 42234
10503 42234 44772 61600 -21833 -74499 -131248 -95695 -52253 3361 109480 112564 -23688 -97861
10491 -97861 -97584 -215967 -122238 -194285 -313614 -282023 -237221 -197346 -43411 51522 -47847
10480 -47847 -230947 -86902 172215 159885 291566 188974 42148 -13685 33995 34351 -20243
10469 -20243 -764 -26832 99201 98302 39932 -93476 -132832 -81745 108424 137717 8662
10458 8662 -9313 237337 175321 203061 331523 229417 21731 -68883 -108241 -188677 -163861
10447 -163861 -66918 -82667 12835 -63341 -121845 52097 9752 -70352 -124089 -101248 -42832
10436 -42832 -104998 -76607 -48046 -56674 40888 148380 58708 132603 59783 -80386 13606
10425 13606 157414 138509 12964 127823 252742 187573 98220 165019 140990 192061 223676
10414 223676 190582 -27276 -188467 -182754 -30228 163825 83177 80806 147194 162048 244233
10403 244233 214178 67376 -35487 -92844 -83185 -27189 -23342 -126873 -45905 -12736 -141789
10392 -141789 -303801 -132212 21257 78027 37521 93811 -71803 -131934 27765 99246
10382 99246 -8105 -139326 -258863 -161395 3480 29612 6841 33883 53963 65752 -43103
10371 -43103 -196759 -311962 -388020 -339370 -247626 -133322 120484 37942 -22658 -39679 7903
10360 7903 123834 224194 122053 52121 79685 109639 222425 178903 -21870 -142223 -172083
10349 -172083 -91263 -99497 -57415 10863 63956 -67047 -94856 -231076 -277020 -32368 166460
10338 166460 179277 194033 178329 -2026 32365 -97391 -229006 -368534 -220862 2012
10328 2012 251213 395505 262385 -49625 -306985 -351141 -292362 -190879 -56148 -68801
10318 -68801 -81094 -72233 -70682 -100968 -86883 -121496 -83488 96851 92699 -107287 -160298 -177632
10306 -177632 -78325 -48584 -65199 -54016 82345 121190 -105702 -80368 -13081 287847 381478
10295 381478 223832 144976 128426 87468 -34727 -221529 -51007 86314 13543 182854
10285 182854 298381 203806 244134 364347 312547 321619 138792 -49516 78150 28016 1830
10274 1830 -78087 -166627 -227240 -225004 -33036 34133 20969 42510 44127 40716 120424 -33604
10262 -33604 -65653 52176 67478 114481 105167 -25433 -101008 -7570 115829 85914 -195599
10251 -195599 -258901 -133897 -44462 161012 112483 -64380 -35298 -40853 -187443 -215878 -237452
10240 -237452 -432470 -231498 -90044 -257063 -330666 -232438 -158921 -316152 -227363 -80853
10230 -80853 -27279 96649 154418 139051 214653 107941 114730 154346 42535 -98735 -248515
10219 -248515 -409278 -222090 -113004 -68016 144710 44485 -14873 -883 -92484 -86718 -76860
10208 -76860 -156364 -85575 -8972 178446 157839 -4694 -36990 -12067 32272 222605 276776
10197 276776 263401 291796 409351 486899 506782 457508 430520 288563 232964 158894 76590
10186 76590 173614 221314 206223 219871 -41953 -50815 -70830 -206228 -80159 -110451 -99260
10175 -99260 -64467 -40963 -151554 -227752 -45572 -30931 -202144 -282562 -306939 -152279 101140
10164 101140 210174 23760 -65180 176837 242498 266131 162101 166484 97404 -52076 -8512
10153 -8512 -187435 -236203 -238773 -382413 -294353 -161682 -194915 -171842 -161300 -181500 31793
10142 31793 -16184 -23913 -12638 -36097 40842 83108 -136568 -206974 -193534 -155874 -109578 -110941
10130 -110941 104115 215694 383671 352746 101544 -35029 -100572 8174 132265 109170
10120 109170 -24425 65103 78646 22117 -149152 -210658 -8922 -13980 -166941 -200553 -145866
10109 -145866 30634 137868 130555 180031 256176 19022 -269026 -312506 -173250 6226
10099 6226 908 -60875 -65380 -47922 -133986 -57301 -123464 -30677 39306 61562 90629 7403
10087 7403 -54902 -89160 -196503 -169973 -95141 -94313 -148892 -133949 -218087 -165677 -49488 139894
10075 139894 94008 -33457 -125086 -27739 84521 -18488 -102297 -74805 27455 77189 66051
10064 66051 137520 309088 196968 63864 29844 -20479 -40437 -45339 30748 96114 67240
10053 67240 119623 34307 -125685 -110410 138982 282012 281470 121325 -99237 -154499 -209174
10042 -209174 -23369 35900 100674 277704 276634 266489 203851 169810 115900 -38384 -40447
10031 -40447 12993 -21552 27208 -70576 -277990 -255930 -218325 -53945 95291 -25229 -89454
10020 -89454 -177521 -325990 -337372 -309512 -257573 -18809 53521 156367 95630 -100255 -272143
10009 -272143 -432767 -371909 -205078 -40541 27575 200452 209994 112009 106630 -57611 -172671
9998 -172671 -125833 -6813 -40021 -4632 156462 193578 165143 234274 93201 71509 19299
9987 19299 -124411 -34894 29838 30876 14779 84019 36663 -116167 -132001 -83292 -51695 -294264
9975 -294264 -374746 -219874 -108282 46050 40824 -10166 -62793 -13473 22788 -95358 -311359
9964 -311359 -239902 -125404 -19774 -96964 4307 307462 112547 48520 4570 174607
9954 174607 207384 204787 325424 283268 26807 18157 29180 169475 205532 265150 344412
9943 344412 340819 240421 139868 110571 183987 198946 159162 284551 203844 178890 183247
9932 183247 146728 259551 254315 126438 85692 180196 183484 158886 85828 74920 62851 151358
9920 151358 148457 -56274 -192050 -135424 35736 137914 109116 -18717 2865 65275 56559
9909 56559 148603 122859 115759 47214 -93215 -98701 -127944 -40864 -22342 20897 108397 247020
9897 247020 155320 107976 134611 190912 108452 -202450 -229596 -19684 178192 202533 217866
9886 217866 374362 234817 33221 -9972 95342 140918 97924 25882 -66513 85371 254078
9875 254078 327692 339396 214232 151283 173922 235618 183298 101768 24486 -27085 29240
9864 29240 10782 -25213 55240 9539 139780 234511 230065 385521 464505 290073 100192
9853 100192 47397 28150 113287 145895 12931 -181239 -162936 26157 44007 -9618 60252
9842 60252 45325 -31071 73147 108514 87551 -52480 -123523 69117 219617 248396 15188
9831 15188 -116482 -128744 -56049 -275096 -241648 -108015 2770 159168 138234 215789 134854
9820 134854 -56321 -16063 328996 378537 165086 -33741 43591 179329 218623 223404 303467
9809 303467 256989 256776 280726 228377 290805 225148 154008 170830 214801 131091 -7439 -157032
9797 -157032 -182351 -197965 -80882 -10944 -58147 22593 185133 228611 369743 265686 155773
9786 155773 73916 17584 14501 -180574 -257457 -58769 65923 41867 -1512 109917 176746
9775 176746 268230 171431 77403 -27453 -24992 -112965 -111082 50180 126301 99691 -52036
9764 -52036 -113094 -111234 -17127 80475 344044 467410 404968 219695 142521 259136 261089
9753 261089 203124 203461 143756 99114 77575 8934 133354 273940 257272 222553 217676 127034
9741 127034 40835 -16272 -129867 -30897 102664 175678 52359 46720 52765 -7894 37871
9730 37871 67941 197274 273635 262707 213049 237088 278939 218223 82948 -29797 15524
$$ [...]
##END NTUPLES=NMR SPECTRUM
##END=
