##TITLE=Analysis number 327600
Compound Code cc 63826
Book Reference 511/84
Project Code adrs
Chemist Name stevem
##JCAMPDX= 6.0         $$ Bruker NMR JCAMP-DX V2.0
##DATA TYPE= NMR SPECTRUM
##DATA CLASS= NTUPLES
##ORIGIN= Bruker BioSpin GmbH
##OWNER= nmr
$$ XWIN-NMR		Version 3.5
$$ Tue Mar 27 15:34:22 2007 GMT Daylight Time (UT+1h)  MAYBRIDGE\nmr@NMR_250MHZ
##.OBSERVE FREQUENCY= 250.131544655141
##.OBSERVE NUCLEUS= ^1H
##.ACQUISITION MODE= SIMULTANEOUS (DQD)
##.ACQUISITION SCHEME= undefined
##.AVERAGES= 16
##.DIGITISER RES= 18
##SPECTROMETER/DATA SYSTEM= dpx250
##.PULSE SEQUENCE= zg30
##.SOLVENT NAME= CDCl3
##.SHIFT REFERENCE= (INTERNAL, CDCl3, 0, 16.522)
##AUDIT TRAIL= $$ (NUMBER, WHEN, WHO, WHERE, WHAT)
$$ ##TITLE= Audit trail, XWIN-NMR		Version 3.5
$$ ##JCAMPDX= 5.01
$$ ##ORIGIN= Bruker BioSpin GmbH
$$ ##OWNER= nmr
$$ C:\u/data/dgb/nmr/ADRS/2290/pdata/1/auditp.txt
$$ ##AUDIT TRAIL=  $$ (NUMBER, WHEN, WHO, WHERE, WHAT)
(   1,<2007-03-27 15:33:57.57 +100>,<MAYBRIDGE\nmr>,<NMR_250MHZ>,
      <created by zg, POWCHK disabled, PULCHK disabled
       configuration hash MD5:
       49 4B E0 1D 92 C2 6B 37 9F E6 65 BC 52 41 86 1D
       data hash MD5: 64K
       9A 4A BA 24 E3 36 18 B5 D3 ED 0B 21 DB 3A 73 A9>)
(   2,<2007-03-27 15:34:11.47 +100>,<MAYBRIDGE\nmr>,<NMR_250MHZ>,
      <Start of raw data processing
       ef LB = 0.3 FT_mod = 6 PKNL = 1 SI = 32K 
       data hash MD5: 32K
       B3 74 2D 09 7C 7F 72 FB 42 AC 29 E1 05 A7 56 10>)
(   3,<2007-03-27 15:34:13.19 +100>,<MAYBRIDGE\nmr>,<NMR_250MHZ>,
      <apk 
       data hash MD5: 32K
       B0 57 F8 8F EC 46 D8 64 E2 F6 4F 45 37 49 63 E3>)
(   4,<2007-03-27 15:34:14.08 +100>,<MAYBRIDGE\nmr>,<NMR_250MHZ>,
      <abs ABSG = 5 
       data hash MD5: 32K
       9D 47 04 FB DC 09 40 83 2C 02 41 E3 02 A1 69 E8>)
$$ ##END=
$$ 
$$ hash MD5
$$ 6B 5C D4 A6 8A C2 CA 9E EB 59 88 92 3E DB AA 8C
##$RELAX= 
##$RELAX= 
##$RELAX= 
##$RELAX= 
##$RELAX= 
##$RELAX= 
##$RELAX= 
$$ Bruker specific parameters
$$ --------------------------
##$DU= <C:\u>
##$EXPNO= 2290
##$NAME= <ADRS>
##$PROCNO= 1
##$TYPE= <nmr>
##$USER= <dgb>
##$AMP= (0..31)
100 100 100 100 100 100 100 100 100 100 100 100 100 100 100 100 100 100 
100 100 100 100 100 100 100 100 100 100 100 100 100 100 
##$AQSEQ= 0
##$AQ_mod= 3
##$AUNM= <au_zg>
##$AUTOPOS= <50 >
##$BF1= 250.13
##$BF2= 250.13
##$BF3= 250.13
##$BF4= 250.13
##$BF5= 500.13
##$BF6= 500.13
##$BF7= 500.13
##$BF8= 500.13
##$BYTORDA= 1
##$CFDGTYP= 0
##$CFRGTYP= 5
##$CHEMSTR= <none>
##$CNST= (0..31)
1 1 145 1 1 1 1 1 1 1 1 1 1 1 1 1 1 1 1 1 1 1 1 1 1 1 1 1 1 1 1 1 
##$CPDPRG= <>
##$CPDPRG1= <>
##$CPDPRG2= <>
##$CPDPRG3= <>
##$CPDPRG4= <mlev>
##$CPDPRG5= <mlev>
##$CPDPRG6= <mlev>
##$CPDPRG7= <mlev>
##$CPDPRG8= <mlev>
##$CPDPRGB= <>
##$CPDPRGT= <>
##$D= (0..31)
0 1 0 0 0 0 0 0 0 0.06 0 0 0 0 0 0 0.0002 0 0 0 0 0 0 0 0 0 0 0 0 0 0 
0 
##$DATE= 1175006035
##$DBL= (0..7)
120 120 120 120 120 120 120 120 
##$DBP= (0..7)
150 150 150 150 150 150 150 150 
##$DBP07= 0
##$DBPNAM0= <>
##$DBPNAM1= <>
$$ [...]
##$SUBNAM7= <"">
##$SUBNAM8= <"">
##$SUBNAM9= <"">
##$SW= 20.6930455092707
##$SWIBOX= (0..15)
0 0 3 0 0 0 0 0 0 0 0 0 0 0 0 0 
##$SW_h= 5175.983436853
##$TD= 65536
##$TD0= 1
##$TE= 683.16
##$TE2= 300
##$TE3= 300
##$TEG= 300
##$TL= (0..7)
0 120 120 120 120 120 120 120 
##$TP= (0..7)
150 150 150 150 150 150 150 150 
##$TP07= 0
##$TPNAME0= <>
##$TPNAME1= <>
##$TPNAME2= <>
##$TPNAME3= <>
##$TPNAME4= <>
##$TPNAME5= <>
##$TPNAME6= <>
##$TPNAME7= <>
##$TPOAL= (0..7)
0.5 0.5 0.5 0.5 0.5 0.5 0.5 0.5 
##$TPOFFS= (0..7)
0 0 0 0 0 0 0 0 
##$TUNHIN= 0
##$TUNHOUT= 0
##$TUNXOUT= 0
##$USERA1= <user>
##$USERA2= <user>
##$USERA3= <user>
##$USERA4= <user>
##$USERA5= <user>
##$V9= 5
##$VALIST= <valist>
##$VCLIST= <CCCCCCCCCCCCCCC>
##$VD= 0
##$VDLIST= <DDDDDDDDDDDDDDD>
##$VPLIST= <PPPPPPPPPPPPPPP>
##$VTLIST= <TTTTTTTTTTTTTTT>
##$WBST= 1024
##$WBSW= 4
##$XGAIN= (0..3)
0 0 0 0 
##$XL= 0
##$YL= 0
##$YMAX_a= 112086
##$YMIN_a= -242134
##$ZGOPTNS= <>
##$ZL1= 120
##$ZL2= 120
##$ZL3= 120
##$ZL4= 120
##$ABSF1= 16.522
##$ABSF2= -4.171173
##$ABSG= 5
##$ABSL= 3
##$ALPHA= 0
##$AQORDER= 0
##$ASSFAC= 0
##$ASSFACI= 0
##$ASSFACX= 0
##$ASSWID= 0
##$AUNMP= <proc_1d>
##$AZFE= 0.1
##$AZFW= 0.1
##$BCFW= 0
##$BC_mod= 0
##$BYTORDP= 0
##$COROFFS= 0
##$CY= 12.5
##$DATMOD= 1
##$DC= 0
##$DFILT= <>
##$DTYPP= 0
##$F1P= 14.0000005364418
##$F2P= -0.99999901652339
##$FCOR= 0.5
##$FTSIZE= 32768
##$FT_mod= 6
##$GAMMA= 0
##$GB= 0
##$INTBC= 1
##$INTSCL= 1
##$ISEN= 128
##$LB= 0.3
##$LEV0= 0
##$LPBIN= 0
##$MAXI= 10000
##$MC2= 0
##$MEAN= 0
##$ME_mod= 0
##$MI= 0
##$NCOEF= 0
##$NC_proc= -5
##$NLEV= 6
##$NOISF1= 0
##$NOISF2= 0
##$NSP= 0
##$NTH_PI= 0
##$NZP= 0
##$OFFSET= 16.522
##$PC= 1
##$PHC0= 235.1512
##$PHC1= 5.935135
##$PH_mod= 1
##$PKNL= yes
##$PPARMOD= 0
##$PSCAL= 4
##$PSIGN= 0
##$REVERSE= no
##$SF= 250.13
##$SI= 32768
##$SIGF1= 0
##$SIGF2= 0
##$SINO= 400
##$SIOLD= 32768
##$SREGLST= <1H.CDCl3>
##$SSB= 0
##$STSI= 32768
##$STSR= 0
##$SW_p= 5175.98343685301
##$SYMM= 0
##$S_DEV= 0
##$TDeff= 65536
##$TDoff= 0
##$TI= <Analysis number 999999
Compound Code 99
Book Reference 9
Project Code 9>
##$TILT= no
##$TM1= 0
##$TM2= 0
##$TOPLEV= 0
##$USERP1= <user>
##$USERP2= <user>
##$USERP3= <user>
##$USERP4= <user>
##$USERP5= <user>
##$WDW= 1
##$XDIM= 32768
##$YMAX_p= 374658503
##$YMIN_p= -776479
$$ End of Bruker specific parameters
$$ ---------------------------------
##NTUPLES= NMR SPECTRUM
##VAR_NAME=  FREQUENCY,     SPECTRUM/REAL,   SPECTRUM/IMAG
##SYMBOL=    X,             R,               I
##VAR_TYPE=  INDEPENDENT,   DEPENDENT,       DEPENDENT
##VAR_FORM=  AFFN,          ASDF,            ASDF
##VAR_DIM=   32768,         32768,           32768
##UNITS=     HZ,            ARBITRARY UNITS, ARBITRARY UNITS
##FACTOR=    0.157963299565203, 1,           1
##FIRST=     4132.6476996994, 0,             0
##LAST=      -1043.33573715361, 0,           0
##MIN=       -1043.33573715361, -776479,     0
##MAX=       4132.6476996994, 374658503,     0
$$ Real data points
##PAGE= N=1
##DATA TABLE= (X++(R..R)), XYDATA
$$ [...]
23213b49959j5322J31454O3546j59866j16652J10513J17701O5653m8528L1281
23203g0179J66826Q770j32150J36756O190l48477l9424m5349m7152K85380K28641
23192A49832J44798J09973j49393j55268k1687L9730K0184O684r876j21776k13907
23181b00706k67309m183O7559j5494L7550K70649L19736n9989o6801j22241k50675
23170b91904J39805K7640L425L03126j32114j62158J03044r130m347N3878j30617
23159i9352Q668r6800K13761J36557j36493q8089L8800j36678j33724Q8064J24019
23148h1267O4412k26192j28790J00846m7666p7668J05571N5806J25415Q0621j20193
23137a49105k15132J07574K02467N504l8120N3292r573J59297n1873k32344k4741
$$ plain form
23213 -249959 -265281 -133827 -70281 -230147 -346799 -236286 -118585 -52932 -101460 -70179
23203 -70179 96647 105417 -26733 110023 116213 -232264 -271688 -317037 -364189 -78809 149832
23192 149832 294630 404603 255210 99942 78255 117985 138169 144853 134977 13201 -200706
23181 -200706 -468015 -472198 -404639 -420133 -382583 -111934 207802 147813 81012 -41229 -291904
23170 -291904 -152099 -124459 -121034 182092 49978 -112180 -9136 -18266 -22613 31265 -99352
23159 -99352 -90684 -187484 26277 162834 26341 -61748 -22948 -159626 -293350 -205286 -81267
23148 -81267 -16855 -243047 -371837 -270991 -318657 -396325 -290754 -234948 -109533 -28912 -149105
23137 -149105 -364237 -256663 -54196 -48692 -86812 -33520 -43093 116204 64331 -168013 -192754
23126a92754K92169J70364q0456j74747k22498k72319j48132K77170K90730K19056
23116A58583j3988r8736J14415m0227j0485j48629j11695L34609R1933j87512
23106H8268k5208j61575j89608J6087R531j81696k4532Q7649j4195J2505J45067
23095b37707J49046R3303J46412k3714j4844j71687l8516j78295N5803o4673J25078
23084a59794K55606N0043n8618p2043j35809N6648M16L9188P700N121j65460l4862
23072b11864Q2622N2730k9206o8482J70006L9805j33433m1446P5811J5570k18214
23061b66101o0615J26002j30552j78648J85964K9212J21156J76119p6956j35559
23051b09978l6783M8293J92204M8794p1728J64407l7167J8863j170k0607j21471
$$ plain form
23126 -192754 99415 269779 189323 14576 -207922 -480241 -628373 -351203 -60473 158583
23116 158583 144595 45859 160274 120047 109562 -39067 -150762 183847 275780 88268
23106 88268 63060 -98515 -288123 -272036 -262505 -444201 -468733 -381084 -395279 -382774 -237707
23095 -237707 -88661 4642 151054 127340 112496 -59191 -97707 -276002 -220199 -284872 -159794
23084 -159794 95812 145855 87237 15194 -120615 -63967 -63551 -24363 -16663 -11542 -177002 -211864
23072 -211864 -129242 -76512 -105718 -174200 -4194 35611 -97822 -139268 -63457 -47887 -266101
23061 -266101 -326716 -200714 -331266 -509914 -323950 -294738 -173582 2537 -74419 -209978
23051 -209978 -246761 -198468 -6264 42530 -29198 135209 98042 116905 115735 95128 -26343
23040b6343M76o3107K24596J01712r0986K9441l6264M58j59685j29034j08669
23029b57405J00116j33484l2588K7940Q4146J8316K56287R6766j6274P4369n4159
23018A64030j25590k08986J1644K65106j02523m5523J08297J54642j29997k71888
23008a80788n6224Q2007P5498N6227J05458L0945l0292j07310j67848l396N9056
22997a36667J51245j19850j41800L6201j10840p8965K0787J12394J43913J44967
22987B1385J00434k7409R3956r4998q454R953L6781R4123j17452l0279l8011J5907
22975E5936K0881j5426q5749O8128J59231l4349N1772r5861k08677j60338k7308
22964b71760L30515k4844K8849m2732k6195j02280Q6076k5460l1814J08486J8114
$$ plain form
23040 -26343 -25867 -88974 135622 237334 146348 175789 139525 139983 -19702 -148736 -257405
23029 -257405 -157289 -290773 -323361 -295421 -211275 -192959 63328 160094 143820 218189 164030
23018 164030 38440 -170546 -158902 106204 3681 -41842 66455 221097 91100 -180788
23008 -180788 -237012 -155005 -79507 -23280 82178 113123 82831 -24479 -192327 -195723 -136667
22997 -136667 14578 -105272 -247072 -210871 -321711 -400676 -379889 -267495 -123582 21385
22987 21385 121819 94410 188366 93368 84914 94867 131648 225771 108319 78040 40029 55936
22975 55936 76817 61391 -24358 43770 203001 168652 220424 124563 -84114 -244452 -271760
22964 -271760 58755 33911 62760 20028 -6167 -108447 -22371 -47831 -79645 28841 46955
22953D6955j75399j24344J69635J7206j34789q0834J7981K01520J17150r1745
22943c6664l3152N7428j34573m354j20643O1966K10900o0205l83961K4255L34942
22932h4061J8020L2308p59R743J09728n0277j14814N3095J44357j17523k6788
22921b6971K2700l9547q5162n1588J18001J3460O2698j84771l1755J15168K17864
22910A30097K22193j98611l790j0818o7332j10930j67715n6656J63198n3191l9529
22899a93084Q3760L21402P9077N0990k13936k48439J31106J62332j46122j15624
22889h8538R5447R4037q679j39547k51677J18213J88352o6097q8942p0458k12366
22878d30255P694J51950k4765K217k4421k6098L14414J45765m8468M4436j3115
$$ plain form
22953 46955 -128444 -252788 -83153 -65947 -200736 -281570 -263589 -62069 55081 -36664
22943 -36664 -69816 -12388 -146961 -151315 -271958 -209992 908 -59297 -443258 -419003 -84061
22932 -84061 -66041 -33733 -34492 -24749 84979 34702 -80112 -27017 117340 -183 -26971
22921 -26971 -4271 -43818 -128980 -180568 -62567 -49107 13591 -171180 -202935 -87767 130097
22910 130097 352290 153679 149889 139071 71739 -39191 -206906 -263562 -100364 -153555 -193084
22899 -193084 -109324 212078 291155 342145 128209 -120230 10876 173208 27086 -88538
22889 -88538 6909 100946 92267 -47280 -298957 -180744 7608 -58489 -147431 -217889 -430255
22878 -430255 -422561 -270611 -295376 -293159 -317580 -343678 -29264 116501 68033 112469 99354
22867I9354k86320J9981N1293J9345K11921m4347k02585o6610J5306L9365J18007
22856b5290k6778K00l075l8785J95294J56278K2615m074j67710j43968j56352
22845a91645l4213J36644j51227K3115Q8888R0577J52013p1804o8286o3419n6324
22834a45681J38433J80660l1210L7395j47984J6936p8613n0310m6814R2352m52
22823c5288l1592r7903L2612r9954M3657J23000P9397J93440l8361o8120K7228
22812A28116k2215k88954k99005j77034K05089J96181m4646M3380P444j4542L9078
22801b27108Q8826M0846k1339j50549P9614j1114K7674J12536K2968k1376l1329
22790i0351j34934O4644Q4857j57251p1663r2414j11700J17989K14259p082J9777
$$ plain form
22867 99354 -186966 -166985 -115692 -96347 115574 71227 -131358 -197968 -182662 -143297 -25290
22856 -25290 -52068 -51868 -54943 -93728 101566 257844 280459 276385 108675 -35293 -191645
22845 -191645 -225858 -89214 -240441 -217326 -128438 -37861 114152 42348 -25938 -89357 -145681
22834 -145681 -7248 173412 142202 179597 31613 48549 -30064 -80374 -127188 -34836 -35288
22823 -35288 -66880 -164783 -132171 -232125 -188468 -65468 13929 207369 169008 100888 128116
22812 128116 105901 -183053 -482058 -659092 -454003 -257822 -302468 -259088 -251644 -266186 -227108
22801 -227108 -138282 -97436 -118775 -269324 -189710 -200824 -173150 -60614 -37646 -59022 -90351
22790 -90351 -225285 -160641 -75784 -233035 -304698 -397112 -508812 -390823 -176564 -183646 -163869
22779a63869O426M6962q3922J93477P2376q6337p0085R7778K43559j34480L7851
22768A59736J87326k97223k81722P8016K25666J15124n2696p652k2903l5563j96250
22757a28141J11189J40273k6236l2243L9518l3216q1156n5923o6911J19670R9578
22746H6402R2168j6236J50854K65215n9696j13168k28713j9061n1371j10668q4634
22735h8908j11864k0474K62442J09285j35030j41005j1006l0451J2555P7219P4315
22724b922o5006K03407m0267k20608p8871J23542j6337K6629J38856p2936J10820
22713A06307J04549k10947j04299L6259J79219j33293k29470N2646N2503J87985
22703D1459J7651J00032k565j91634Q0045K11628j12178j88900K4523k0005Q8075
$$ plain form
22779 -163869 -157443 -110481 -194403 -926 71450 -14887 -84972 12806 256365 121885 159736
22768 159736 347062 49839 -231883 -153867 71799 186923 134227 126575 103672 68109 -128141
22757 -128141 -16952 123321 97085 64842 104360 71144 -10012 -65935 -132846 -13176 86402
22746 86402 178570 162334 313188 578403 518707 405539 176826 157765 106394 -4274 -88908
22735 -88908 -200772 -221246 41196 150481 15451 -125554 -136560 -167011 -154456 -77237 -2922
22724 -2922 -67928 135479 95212 -125396 -204267 -80725 -97062 -70433 68423 -4513 106307
22713 106307 210856 -91 -104390 -68131 111088 -22205 -251675 -199029 -146526 41459
22703 41459 59110 159142 156577 -35057 44988 256616 144438 -44462 -19939 -39944 48131
22692D8131J11940O0653l7086J26108M1911k11828j86125J2916O1694J68704N7645
22681B54663k11277j18793J03118R6539J94268M5162J40201j05276k28868K2919
22671A92656q4835N083K01798j85327N6494K18666q6299n8783j0415p4080r5626
22660G9332q7402k7171K0027j74439R6793q5657q5909J904M46944R4040k77880
22649E82m0410J20674K11438n0763j54695O4016k9259o5711r397K312J0538R6414
22637A55739q6436k26326m5306j2570m5671M5461o4915j00946j2326l4101L9201
22626c88196J83528m8396J55693J24251J07727R4936O0818k3365k39902N671j11812
22615g9047Q2757O0025m134j05080n9480Q5728k6711j96482O6942J05503K41172
$$ plain form
22692 48131 160071 220724 183638 309746 351657 139829 -46296 -33380 28314 197018 254663
22681 254663 43386 -75407 27711 124250 318518 363680 503881 398605 169737 192656
22671 192656 107821 112904 314702 129375 185869 404535 318236 259453 249038 174958 79332
22660 79332 -8070 -35241 -15214 -189653 -92860 -178517 -264426 -262522 184422 278462 582
22649 582 -39828 80846 292284 241521 86826 150842 121583 55872 46475 48787 59325 155739
22637 155739 69303 -157023 -202329 -214899 -260570 -215109 -280024 -380970 -393296 -427397 -388196
22626 -388196 -204668 -253064 -97371 26880 134607 229543 290361 266996 27094 32765 -79047
22615 -79047 3710 63735 59601 -45479 -104959 -19231 -45942 -242424 -175482 -69979 171193
22604A71193r9245P206J60826j12602j19978j7640k10538n0555R2728L26890k0042
22593A28243j16945k49776m3343J44537K7974o9896L3630J8849Q2695N6175j2237
22582i4P7173p7265j45518R6495n7737J34648Q2113L5752j13631r3890K8895K9611
22570c448k35081p8451J21920K20428J19241Q8617O9963N5170j49092k37660P2603
22559D4210p872l4459K0303J962N8382R7601N6895k42113l8584J64147M8018l4657
22547A33833K0084l884Q5042j25941M7236J00260j69989k3431o7732j36031j43290
22536b83843m4229J75476J66443j96579j92927K00356K09733Q8826r146J88522
22526C02632L989k76506n3316j40j26134r7898p4864l419K20848J13957o0306
$$ plain form
22604 171193 71948 79154 239980 127378 7400 -10240 -220778 -271333 -178605 148285 128243
22593 128243 11298 -238478 -281821 -137284 -109310 -179206 -145576 -126727 -44032 12143 -94
22582 -94 77079 -186 -145704 -49209 -106946 27702 109815 145567 31936 -61954 -33059 -3448
22570 -3448 -238529 -316980 -195060 25368 144609 233226 303189 358359 209267 -28393 44210
22559 44210 36338 1879 22182 24144 82526 180127 237022 -5091 -43675 120472 168490 133833
22547 133833 153917 150033 235075 109134 156370 256630 86641 63210 -4522 -140553 -283843
22536 -283843 -328072 -152596 13847 -182732 -375659 -175303 34430 123256 114110 302632
22526 302632 306621 30115 -23201 -23341 -149475 -247373 -322237 -325656 -104808 9149 -51157
22515e1157j51910K8097J2081L66328R2536q8847O0967M1614p3486j37789k43072
22504a44638l107L3982o2798J12502P8357J03976l9343o4119n4230j90660J3126
22493b16952J06070Q0051M1221J40429p0518j25863Q6014J76917P7506J16483
22483D11358O9001r4998j00048J50274Q5281k48128k07795j49298k0550K5755
22473g9148r6418O3986j29769K5731n1634p0607J27407J26547j00511r8635m2884
22462c25935R7535N2299J34437O3552k74409l3350K42237J30044L6318l11625
22452a88897m2812J45353j91666o6393J25090J2476M4052P5999J45895L4047o9435
22441B3709j16446k2993J48407L5396j00292k4966J51325M4890p1965l09541j05135
$$ plain form
22515 -51157 -203067 -174970 -162889 203439 295975 207128 268095 309709 236223 98434 -144638
22504 -144638 -147745 -113763 -176561 -64059 14298 118274 78931 14812 -39418 -230078 -216952
22493 -216952 -110882 -30831 10390 150819 80301 -45562 40452 217369 294875 411358
22483 411358 480359 385361 285313 435587 520868 272740 64945 -84353 -104903 -79148
22473 -79148 -175566 -111580 -241349 -215618 -267252 -337859 -210452 -83905 -184416 -283051 -325935
22462 -325935 -228400 -176101 -41664 21888 -252521 -285871 -43634 86410 122728 -188897
22452 -188897 -231709 -86356 -278022 -344415 -219325 -206849 -162797 -86798 59097 93144 23709
22441 23709 -92737 -115730 32677 68073 -32219 -57185 94140 139030 67065 -242476 -347611
22430c47611m5628J07303o9779N3519k4518M3541O9351Q3570J73805n728j90037
22419a52212j29154k9904L4433K64136O7554m839j37161r4570K4837o3798n8119
22408b78797J47714M00316J04016k63916o7168R579j83723K4692o2792J10508
22398e9571R6398J66912j87811o5695q2544o6892L3081j22671J3156J31089J02171
22387d2377R9164J7116j26161L5698K5354j666l0213l8258P2504K72617K5911
22376C09689m8260r2820p5107k25238L1966J39923l4099J16371J45256o7913K5886
22365B25654r9464p0587P9771P166j21569j94099j3519K0968N6309k7386R426
22354a27330l2548m1403j60429l1257K39569K69259r6386K4411J07099K51982
$$ plain form
22430 -347611 -393239 -285936 -355715 -302196 -326714 -283173 -213822 -130252 43553 37825 -152212
22419 -152212 -281366 -311270 -276837 -12701 54853 50014 -87147 -181717 -156880 -220678 -278797
22408 -278797 -131083 269233 373249 109333 42165 51744 -131979 -107287 -170079 -59571
22398 -59571 36827 203739 15928 -49767 -132311 -199203 -166122 -288793 -275637 -144548 -42377
22387 -42377 56787 73903 -52258 -16560 8794 7128 -23085 -61343 11161 283778 309689
22376 309689 261429 168609 93502 -131736 -99770 40153 6054 122425 267681 199768 225654
22365 225654 126190 55603 135374 142540 20971 -173128 -186647 -165679 -109370 -136756 -127330
22354 -127330 -159878 -201281 -361710 -392967 -153398 115861 19475 43886 150985 402967
22344D02967M2012j61523m6906N6520M5143m9883P3125j07847k10032k36578l4869
22333b27871l0312J75304J35108j47016N8303J84371K31616O2851l31007j41278
22323b9931k1582J16824Q1122n9113j61739P6891L7179J40218m321j82218M6871
22312D0201n7477j89900L3510R8865o3744O7984N3418J13772l6031R358n4697
22301A5259J17284K06510n6556m7154o2018n6812j9736j3386O2961J9937q4650
22290H1639N3133q5424k2364L9562J64253p5355k13932q0730j8760k11244L9262
22279c29960K39002L50188j16710J05863j20073k1999o153n0145j05385r159j6374
22268h0905J80020k18630j57983j99953r3461L48908J34211n5888Q9150L01455
$$ plain form
22344 402967 444979 283456 236550 293070 338213 288330 361455 253608 43576 -193002 -227871
22333 -227871 -258183 -82879 52229 -94787 -36484 147887 379503 442354 111347 -29931
22323 -29931 -51513 65311 146433 87320 -74419 2472 39651 179869 175548 -6670 40201
22312 40201 -17276 -207176 -173666 -74801 -138545 -70561 -17143 96629 60598 69956 15259
22301 15259 132543 339053 282497 235343 173325 116513 96777 83391 146352 166289 81639
22290 81639 134772 49348 26984 66546 230799 155444 -58488 -139218 -157978 -369222 -329960
22279 -329960 -90958 259230 142520 248383 128310 106311 100158 50013 -55372 -64531 -80905
22268 -80905 99115 -119515 -277498 -477451 -570912 -222004 -87793 -143681 -54531 246924
22258B46924L3910k90235l18005M851L19894K47222p1329k57588j61028J48615
22248i6769O0130j47989P2120L5474j16677J5549j01551J11623P8500l9173l6174
22237a64937m2043o4880K0050o1353p7092J43592M3078j90164O2473N2250L9611
22226b39415o9884P8480P104j95156J6486m7691J08050K48597R8665P5237J46739
22215B27212k5446j17415l0586O3962j01498J04089J3544Q9064J39314J78779
22205E41019k06418k51036L6402L1967j05000q0517J68091J91136L5688j18414
22195B42918j22628k22442j16570L5097J61018q0060r3511M9633j28693n7036
22185c32274K36764J30430j29979j83266J01726J73994J53926M5686j51399o6861
$$ plain form
22258 246924 280834 -9401 -327406 -322555 -2661 244561 173232 -84356 -245384 -96769
22248 -96769 -36639 -184628 -112508 -77034 -193711 -178162 -279713 -168090 -89590 -128763 -164937
22237 -164937 -206980 -271860 -251810 -313163 -390255 -246663 -203585 -393749 -331276 -279026 -239415
22226 -239415 -309299 -230819 -223715 -418871 -402385 -450076 -342026 -93429 5236 80473 227212
22215 227212 201766 84351 53765 117727 16229 120318 133862 222926 362240 541019
22205 541019 334601 83565 119967 151934 46934 -33583 134508 325644 361332 242918
22195 242918 120290 -102152 -218722 -183625 -22607 -102667 -196178 -146545 -275238 -332274
22185 -332274 -95510 34920 -95059 -278325 -176599 -2605 151321 197007 45608 -21253
22175b1253J30813J3933P1200o0509k3018j41830n9304K0310o7970j38039N6149
22164b19518J04229K7107l6144p9300K36562M2887N8534j11237P8050O1738j35387
22153B7521m710K08435J79861l7210j45850k4560J48653R6009j9994j11356J15594
22142D32393j51647j84787q3355J66793k7471q3870j56369J05811m9642m9052
22132h1196n4186J78462K42835L0563j56797l5150J73087j04476j78576J11584
22122A26150J43979O4131M1657j21691j74800j45142l6448j46861k6194J51929
22112a23290J32529p1644K7240J97828J59771J0489j50945j10915k9118J28216
22102A70161j67988j0477j68650n6846Q196Q534K4132O5981j41690r46J1876r0242
$$ plain form
22175 -21253 109560 123493 194693 134184 111166 -30664 -89968 -69658 -137628 -275667 -219518
22164 -219518 -115289 -88182 -124326 -203626 32936 75823 134357 23120 101170 162908 27521
22153 27521 22811 231246 411107 373897 228047 203487 352140 448149 428155 316799 432393
22142 432393 280746 95959 12604 179397 151926 68056 -88313 17498 -32144 -81196
22132 -81196 -135382 43080 285915 316478 159681 124531 297618 193142 14566 126150
22122 126150 270129 334260 375917 254226 79426 -65716 -102164 -249025 -275219 -123290
22112 -123290 9239 -62405 -35165 162663 322434 332923 181978 71063 41945 170161
22102 170161 2173 -8304 -176954 -233800 -225604 -217070 -192938 -126957 -268647 -269593 -257717 -347959
22090c47959Q6144O1596o7174j06143k39501K1064P2129J50699J45032Q1725L66821
22079B24433n3279k71346j6099R2611J21891J07038j88996k51178J74556K99951
22069B39582K24443L4424k18267j88542K9234j18487j47472p7592q8410R6909
22059b14178j0059J50033Q604P1269K6223q9125j29864j33578P7055J92532L622
22048d7466o6905j58335m9814K61274Q1885N777J01191j3972K0629j17133k02636
22037a85505j27577j7894M7865K67809P1248J65874R7930J60147k31751m10518
22027a62372P3518K26904j63699j34582m4096k865L5338J4960r9353K853J7769
22016b35625R3448J6278K04386m3156l0820J44975K2589J48669M0204k27976j7246
$$ plain form
22090 -347959 -261815 -200219 -267393 -373536 -613037 -591973 -519844 -369145 -224113 -142388 224433
22079 224433 171154 -100192 -116291 -23680 98211 205249 16253 -234925 -60369 239582
22069 239582 464025 498449 280182 91640 120874 2387 -145085 -222677 -311087 -214178
22059 -214178 -224237 -74204 -65600 5669 31892 -57233 -187097 -320675 -243620 -51088 -47466
22048 -47466 -114371 -272706 -322520 -61246 20639 26416 127607 113635 134264 17131 -185505
22037 -185505 -313082 -330976 -283111 -15302 55946 221820 319750 479897 248146 -162372
22027 -162372 -88854 138050 -25649 -160231 -204327 -207192 -171854 -156894 -256247 -253394 -235625
22016 -235625 -142177 -125899 78487 35331 4511 149486 172075 320744 360948 132972 115726
22005A15726j36411k84048O7142J83735n860J89482k1517r9225K6541L61279J09378
21994E06222j51019j86108j53421l4562Q9797k18055j82117J84857L1279K51124
21984A37997J3263k91358l0681J57861p4446l9315P1832J02298N5773j03931o4453
21973f5160Q6754J25034j1986N9040q9334r8397r4114k9821O2137M1373j20341
21962a34815K52773M9924j47449j54256j31967j30412j08204o6270J10769K25194
21952b34713K97174O3001l19154m2848P6230K46910K26419M0435j13091q0682
21942A59681j20140j8798K1830M3527n7371J39382J42736k92742o3491j0469K1012
21931c4843Q3459r6199j28442J20405J2127j57964p5263J30488n218j07550l948
$$ plain form
22005 115726 -20685 -304733 -237591 -53856 -59716 129766 108249 9024 35565 396844 506222
21994 506222 355203 169095 15674 -18888 70909 -147146 -329263 -144406 -113127 137997
21984 137997 151260 -140098 -170779 -12918 -87364 -126679 -54847 47451 103224 -707 -65160
21973 -65160 21594 146628 134642 193682 104348 5951 -88163 -117984 -55847 -14474 -134815
21962 -134815 117958 167882 20433 -133823 -265790 -396202 -504406 -570676 -459907 -234713
21952 -234713 62461 125462 -193692 -236540 -160310 86600 313019 353454 240363 159681
21942 159681 39541 20743 42573 86100 28729 168111 310847 18105 -45386 -55855 -34843
21931 -34843 48616 -47583 -176025 -55620 -43493 -201457 -276720 -146232 -151450 -259000 -262948
21920b62948o9331J3278N3190L7414r0065o4139K1801J15405k1819O6585K90429
21909H9800N5118k62308p4777R230K45931J43866P379k42407j89311j70206J97433
21898a90252J18939J54058Q8516K00821j9415j59521q1117j02816K54J4209j3912
21887I764R8144J42316k3259n450k21873r8928O1504p861p5703j07912N1722q3193
21875b60729J05830j11226j41267o9089K42905K64927J06181O6433J29949j55459
21865A78455k3564K5378j71674o3556J29749R2005j18891J6351l8802j47275j6420
21854a38244J33203N5338q0735K205K79595R0305j93517o1234J87822M61979l3232
21843G03485l58240j12421o2924L6857r9177j55481k28351R2990J61792J38586
$$ plain form
21920 -262948 -332279 -319001 -265811 -228397 -318462 -382601 -360800 -245395 -267214 -200629 89800
21909 89800 144918 -117390 -192167 -182937 62994 206860 214239 -28168 -217479 -387685 -190252
21898 -190252 -71313 82745 171261 372082 352667 193146 112029 9213 9467 23676 9764
21887 9764 107908 250224 226965 221515 -358 -99286 -37782 -45643 -121346 -229258 -177536 -260729
21875 -260729 -154899 -266125 -407392 -476481 -233576 31351 137532 203965 333914 178455
21865 178455 154891 180269 8595 -54961 74788 166793 47902 64253 25451 -121824 -138244
21854 -138244 -5041 50297 -30438 -28233 251362 341667 148150 86916 274738 736717 703485
21843 703485 345245 232824 169900 206757 107580 -47901 -276252 -183262 -21470 117116
21833A17116k3207k9475J61599Q578k7140o8318j52387j15699r2421J10087K2276
21822h8991N7824j72104r0834N2135K57150N3462n909L33337J71310j64462j97844
21811B05074j49247r58p1407O2087K17160J20839K1228j93216j43579l5258m5149
21800a2426n8674m1643q3727j18680J13834J86932Q4475J18494M0694J6488j3394
21789B32373M3058j87464p9826j01296J5636l5142O5003J30504o1427k0988P40
21778A171j54985r3353p6072P9394J48966K3044K793j95804N0380q5166k1742
21767c21374Q4010J69840j99689R8552L06496J61040L3596L932j37433k20635
21757b1665J0280k4787p141j83031Q6908O4107j69661j81974j05570K40506K27931
$$ plain form
21833 117116 93909 64434 226033 234611 207471 139153 -13234 -128933 -221354 -111267 -88991
21822 -88991 -31167 -203271 -294105 -241970 15180 68642 62733 396070 567380 402918 205074
21811 205074 55827 54869 -16538 45549 262709 383548 404776 211560 67981 32723 -12426
21800 -12426 -71100 -112743 -196470 -315150 -201316 -14384 70091 188585 229279 245767 232373
21789 232373 275431 87967 8141 -93155 -77519 -112661 -47658 82846 21419 431 1171
21778 1171 -153814 -247167 -323239 -243845 -94879 -71835 -69042 -264846 -214466 -299632 -321374
21767 -321374 -237364 -67524 -267213 -168661 137835 298875 332471 336403 198970 -21665
21757 -21665 -11385 -36172 -43313 -226344 -139436 -75329 -244990 -426964 -532534 -292028 -64097
21746f4097Q9620j13927l7219J04575M0044r8640m2778K57627O6756l4222p7324
21735I0415j10631k46607j32803J59534J55369O5331m8913o3356r7149N6484m2336
21724b14662Q6264K3039M1125K1943N2640k63633q7005L2356l4530p9067J150
21713d20380J27843K60814J80325Q356j37564j26473j69118Q3850R4131o2254
21703a60470j6767M7988J61483J20104q0984q757j3118q0986m6414L7691J6293
21692b3937j69975j89022M8359J62838J68072R0983m6817j48237J16037J7878
21682B6179p6418N9765o6173J72322l374k41489j48983k3491K20734J7194p5115
21671a38849j69464N0514J59893J40123K4707q3820O0160k30758R8378J46081
$$ plain form
21746 -64097 25523 -88404 -125623 -21048 18996 -79644 -122422 135205 201961 167739 90415
21735 90415 -20216 -266823 -399626 -240092 -84723 -19392 -68305 -131661 -228810 -172326 -214662
21724 -214662 -128398 -105359 -64234 -42291 10349 -253284 -340289 -307933 -342463 -421530 -420380
21713 -420380 -292537 -31723 148602 156958 19394 -107079 -276197 -192347 -98216 -160470
21703 -160470 -177237 -129249 32234 152338 71354 62597 49479 -31507 -77921 -40230 -23937
21692 -23937 -193912 -382934 -334575 -171737 -3665 87318 40501 -107736 8301 26179
21682 26179 -50239 9526 -56647 115675 112301 -129188 -278171 -301662 -80928 -63734 -138849
21671 -138849 -308313 -257799 -97906 42217 66924 -16896 43264 -187494 -89116 56965
21661E6965k57568k02220K856J68229P5068n3271L7175J08897J39189j06765m7045
21650g8490J29964K38166K32724j08123l21319j47853n5753N6495N5237p5537
21640g4489L8904O0761q1472k3193M6077J34026O5916j18033j72554j75867k3509
21629c23433L11525M1245l2048O9425n1798j51494P2751K4643o6879J01370Q6592
21618H1899j04742j27942L8979J80827M2170j03820j8314P4705m9567j96574r6002
21607b78381J06845K26794K11980M1778L5711m7853k54525k41319K8835K06610
21597C6475p2603p5833j7273n2898O2311O9277M8135K39683J93213l2030j6648
21586C81809q6777j34353k34042j03936K13971N8437j91853j00758j31521l6408
$$ plain form
21661 56965 -200603 -402823 -399967 -231738 -156670 -209941 -172766 -63869 75320 -31445 -78490
21650 -78490 51474 289640 522364 414241 92922 -54931 -110684 -54189 1048 -74489
21640 -74489 -35585 25176 -56296 -79489 -33412 100614 166530 48497 -124057 -299924 -323433
21629 -323433 -11908 29337 -2711 66714 14916 -136578 -63827 -39184 -106063 -4693 81899
21618 81899 -22843 -150785 -111806 69021 111191 7371 -10943 63762 14195 -182379 -278381
21607 -278381 -171536 55258 267238 309016 344727 296874 42349 -198970 -170135 36475
21597 36475 -36128 -111961 -129234 -182132 -119821 -50544 -2409 237274 430487 398457 381809
21586 381809 295032 160679 -73363 -177299 36672 95109 -96744 -197502 -329023 -365431
21576c65431m6031J5382J85765j61903M1104P2688J18622J47592M9501O7316J08600
21565B33205m1264o0102R340M9087J00188p3404k51457Q5483P5886n2765J31505
21554B05702r1190j35852k1417m4311O2482j97615J05505K31690k7028m18307
21544c30341j27531J68117J96286O4368J2390P5631K3657q7155M8943J17944j45721
21533A6588j28561O2822o9416j5733N9324j6890j97027m1393K90560L0691J1592
21522B557r8386m0131q836M6762j13686j07890J68271K06819Q403j1591l6144
21511A6148r0852K9559j12500o4386q4256p1636J40023K83108o4659p2743m4655
21500a36849N1132j5635j03792j06758P53K59212K01037M8992j6489j85074j49286
$$ plain form
21576 -365431 -411462 -396080 -210315 -372218 -331114 -258426 -139804 7788 57289 124605 233205
21565 233205 191941 131839 141179 190266 290454 217050 -34407 51076 126962 74197 205702
21554 205702 114512 -21340 -42757 -87068 -24586 -222201 -116696 114994 87966 -330341
21544 -330341 -457872 -289755 -93469 -29101 -16711 58920 82577 -4578 44365 162309 16588
21533 16588 -111973 -49151 -118567 -134300 -74976 -91866 -288893 -330286 -39726 -9035 2557
21522 2557 -95829 -135960 -144796 -98034 -211720 -319610 -151339 55480 63883 52292 16148
21511 16148 -74704 -45145 -157645 -222031 -306287 -377923 -237900 45208 -19451 -92194 -136849
21500 -136849 -85717 -101352 -205144 -311902 -311149 -51937 149100 198092 181603 -3471 -152757
21489a52757J18765J13017L1543k2743j78422Q4472M9351J08392J27907j99794
21479G9731k8416J1653Q0660L3154q3554j68529Q0830r3469j26680K44794J64273
21468A94447k6112j32797j02103L0741j8610M0416J45655J36641j53640j56437
21458d1799p7306k9187j11635J36183Q7141M7416j46460j79966J30578K52988
21448F7953O405o5945L0456K08317J79249p5339m1733p3019M873n4800N6465j58872
21436H4010j77053l03952Q3198J22300J50248p8163J20388R2225m4155k06884
21426a57838m6405L9799p4404P7170J42390k4568J9413K04355J16613j88829L2337
21415A40033p4900l1802J65790N6586J12045K1954J00407r611j40057k60630l7421
$$ plain form
21489 -152757 -33992 79025 110568 87825 -90597 -6125 43226 151618 279525 79731
21479 79731 51315 62968 143628 176782 93228 -75301 5529 -87940 -214620 30174 194447
21468 194447 168335 35538 -66565 -35824 -54434 -14018 131637 268278 114638 -41799
21458 -41799 -119105 -148292 -259927 -123744 -36603 10813 -135647 -315613 -185035 67953
21448 67953 74358 8413 38869 247186 426435 351096 309363 236344 241217 186417 242882 84010
21436 84010 -93043 -396995 -313797 -191497 -41249 -119412 976 93201 49046 -157838
21426 -157838 -204243 -164444 -238848 -161678 -19288 -43856 -24443 179912 296525 107696 140033
21415 140033 65133 33331 199121 255707 367752 389706 490113 480502 340445 79815 42394
21404D2394Q0727N5690j15158l16813j03694p0333j543L04206m236J38128J96125
21393B05493q3459k0095N278P8672j04663q4335m4941o77m5466o9531r2983p7251
21381c33958Q0296J17879J60258j76313K9230L02243J46883j47896j37446n7214
21371a6038p4322Q004j16322K0565J01405n9764J62294K66680r6333K8959M747
21360B29875j58763o6900j10511K7159J27779p5902j53889j56888M3292M5790
21350b48958K11186r6544m8505Q6939n3443k05762M7898K64406J20170J94421
21340B71808R8262m0570j68412j60652r9203j5003M1528m8951j00004j5917R9456
21329a37658N0818m2016K14452R741k87674p8914J40031J63551N706M6135n6036
$$ plain form
21404 42394 123121 178811 63653 -253160 -356854 -427187 -428730 -124524 -128760 9368 205493
21393 205493 122034 101939 107217 185889 81226 -3109 -48050 -48727 -94193 -163724 -256707 -333958
21381 -333958 -253662 -135783 24475 -151838 -122608 179635 326518 178622 41176 -16038
21371 -16038 -90360 -82356 -198678 -178113 -76708 -136472 25822 292502 196169 225128 229875
21360 229875 71112 4212 -106299 -79140 48639 -27263 -181152 -338040 -294748 -248958
21350 -248958 -37772 -134316 -182821 -95882 -149325 -355087 -307189 -42783 77387 271808
21340 271808 370070 329500 161088 436 -98767 -113770 -72242 -121193 -221197 -237114 -137658
21329 -137658 -86840 -128856 85596 95337 -192337 -271251 -131220 32331 38037 84172 28136
21318B8136J3623R2513K1176j54064k6143r6989O3610m4394l7405K8630J29601
21307A8294k7867J2652r9215M9558j9512J38219K1415l4061L7236r6831r8538
21296i8650p7937O1934p1009j13802o8675J39942J70441J4063J05475p5705j38556
21285a52479k6310o600J09386j41319M1824L61408J66331j86598j56895k4324
21275a5576K4521n7039M8357P8176k2007k5564P028j17486j31151N5853J13223
21264d1665J52910k6941J17622p1561k5869j2233Q9251k6642j19093J4041j30116
21253h0296L6089l5921l0696J1318N3766M6249p148k7177J40571J58912j21288
21242A44379j68752N0505J05236n3695j40794k28907j02339j40299J4552o2677
$$ plain form
21318 28136 41759 134272 155448 1384 -24759 -121748 -58138 -102532 -139937 -111307 18294
21307 18294 -9573 3079 -96136 -46578 -66090 72129 93544 59483 96719 -112 -98650
21296 -98650 -176587 -114653 -185662 -299464 -368139 -228197 -57756 -43693 61782 -13923 -152479
21285 -152479 -178789 -185389 -76003 -217322 -175498 185910 352241 165643 8748 -15576
21275 -15576 8945 -48094 263 78439 56432 30868 37896 -79590 -210741 -154888 -41665
21264 -41665 111245 84304 201926 130365 104496 92263 181514 154872 35779 49820 -80296
21253 -80296 -44207 -80128 -110824 -99506 -45740 509 -6639 -33816 106755 265667 144379
21242 144379 -24373 26132 131368 77673 -63121 -292028 -394367 -534666 -520114 -582791
21232e82791K37494K73822M0217L8884J14106Q6871j41342l87129j79351k77260
21222g76479K61223P2946P1026K3149J10462K95773P6278j68265j56723J13790
21212g6820n3117K7628O0027j04742n5493Q6880Q5705o2046r7066Q6022J63342
21201F0320l7203L1892P1923j53210k57077r3081K0511L15045K33046j6229k76892
21190a00955q2542m4561p6766P3102p9546m1535J18234N5076L7893K5159j609
21179a18050j3286L1900n930J10993J5770o6217Q4878l0021n4844j10490j18553
21168b73850J27680J60901j3237J59315K6079o5433m0370k5733j00884o1756j40084
21157b47372j49583L9904L3838J4246j14446J33045J23209J68857J93270J56877
$$ plain form
21232 -582791 -345297 -71475 -31258 7626 121732 208603 67261 -319868 -499219 -776479
21222 -776479 -515256 -442310 -371284 -348135 -237673 58100 134378 -33887 -190610 -76820
21212 -76820 -129937 -102309 -42282 -147024 -202517 -115637 -29932 -91978 -189044 -103022 60320
21201 60320 23117 55009 126932 -26278 -283355 -376436 -355925 -40880 192166 175937 -100955
21190 -100955 -183497 -228058 -304824 -231722 -311268 -352803 -234569 -179493 -141600 -116441 -118050
21179 -118050 -131336 -99436 -105366 5627 21397 -44820 40058 10037 -44807 -155297 -273850
21168 -273850 -146170 14731 1494 160809 186888 121455 81085 55352 -45532 -107288 -247372
21157 -247372 -396955 -357051 -323213 -308967 -423413 -290368 -167159 1698 194968 351845
21147C51845j8780j48349q9611L0378J1651j66286j14635O2164O3270j78226n3667
21136b50246J42799J08099L1208k60732j2258j8901o9133j29296N3725K36848
21126a67887K43679J49082j74700j19461Q7339J19153p6611l4312j7019J569J11902
21115A22734J02961Q7723J22400j32266k92444m5070K9982j7629k29083p3635
21105c24327l092j08671R5092L6521J49282J58865l3695j17996J7528Q1001L6491
21094a3001J37586J82525J12679k55558k10256o2006J9415L348j07666n0379P6149
21083a67164k4651k5563q8639J24750K78711r3063r9076p6918N5056o7535p1626
21072b55718o3699M1135J95187k573Q0763J80123J26188j42931j75030L0924j06581
$$ plain form
21147 351845 333065 184716 95105 125483 137134 -29152 -143787 -81623 -18353 -196579 -250246
21136 -250246 -107447 652 31860 -228872 -241130 -260031 -329164 -458460 -404735 -167887
21126 -167887 75792 224874 50174 -69287 18052 137205 60594 26282 9263 10832 122734
21115 122734 225695 313418 435818 303552 11108 -33962 -3980 -21609 -250692 -324327
21105 -324327 -327419 -436090 -340998 -304477 -155195 3670 -30025 -148021 -130493 -49492 -13001
21094 -13001 124585 307110 419789 164231 -46025 -108031 -88616 -85268 -192934 -243313 -167164
21083 -167164 -191815 -217378 -306017 -181267 97444 4381 -94695 -171613 -116557 -184092 -255718
21072 -255718 -319417 -278282 -83095 -85668 -4905 175218 301406 158475 -16555 14369 -92212
21061i2212l8689M2421J0185K32340j9055k83485k16331l11172k766J16609J49847
21050d12308J07026J01089N2966j08899K2844J57810n8361l0875M2129K0716L962
21039a01901l952l0932L5843J20929J39694J09222p7734j26037j81609j19189
21029b35666J39657J78105J25043j18546j80475q8407K32067j5835k66356n8623
21019b89036j34348J38155K92939n5640P1515N8636l9862P073l9940r0924j49684
21008b31116M8522K83502O0233j80527j98902J29803J68582O6757r9258m0148
20998G448n0956J48161J09868N225j05616k12919l07024m8508K40880J56152R5522
20987C8233N8879O4l2760J061M2183q6074j16876r6941L8164L7075P6025J86232
$$ plain form
21061 -92212 -130901 -88480 -78295 154045 134990 -148495 -364826 -675998 -678764 -562155 -412308
21050 -412308 -305282 -204193 -151227 -260126 -237282 -79472 -137833 -168708 -126579 -105863 -101901
21039 -101901 -105853 -136785 -100942 19987 159681 268903 191169 65132 -116477 -235666
21029 -235666 -96009 82096 207139 88593 -91882 -180289 51778 35943 -230413 -289036
21019 -289036 -423384 -285229 7710 -47930 23585 82221 42359 49432 9492 -81432 -231116
21008 -231116 -182594 100908 161141 -19386 -218288 -88485 80097 146854 47596 7448
20998 7448 -43508 104653 214521 219746 114130 -98789 -405813 -454321 -213441 -57289 38233
20987 38233 97112 97176 64416 65477 107660 21586 -95290 -192231 -154067 -116992 -40967 145265
20975A45265r3998n6694J19725j939k40922j70780J44666M25117P7927j93258
20965A55109o1557q7518l2022R4459m7661j6674r7080m9167J14485M6306r45k60931
20953b43196J0774R0333o552m234q3344J23619l8585j40180j11482M5868j05777
20942d62756j0683J13848K06347J52963m3994l4488J37704j10291j61382J11201
20932a01531P4696J46639o5457l30422m6744L5724m7222J20422M3497J6541K44009
20921I0152R8306n8409J20024j50579N7855J85199o429r1796l9548j01446j98242
20910i4913q4835P1077N5341R9196j01205k8440o1671l9742j42144M553J07949
20899b14834L0313l3619m2073L01003J14455j23889r297m2016M1938J37105J29922
$$ plain form
20975 145265 51267 -5427 114298 112359 -128563 -299343 -154677 270440 348367 155109
20965 155109 93552 6034 -25988 68471 20810 4136 -92944 -142111 -27626 18680 17735 -243196
20953 -243196 -232422 -142089 -148641 -152875 -236219 -112600 -151185 -291365 -402847 -356979 -462756
20942 -462756 -473439 -359591 -153244 -281 -44275 -78763 58941 -51350 -212732 -101531
20932 -101531 -26835 119804 54347 -276075 -322819 -287095 -334317 -213895 -170398 -153857 90152
20921 90152 188458 130049 250073 99494 157349 342548 336119 244323 204775 103329 -94913
20910 -94913 -179748 -108671 -53330 45866 -55339 -83779 -145450 -185192 -327336 -322783 -214834
20899 -214834 -184521 -218140 -260213 40790 155245 31356 22059 -19957 21981 159086 289008
20888B89008k30597k71805K03467K41178J8664J77244M4847N9025J48734J47376
20878H27141k9138q3985k723J2491j01852k12262j60896K4510o638k354K4840
20867B89134l6979j92832q3933q4674k05054o283J22348o402K58J0066J42663
20856e1688K07695o9546k75606J04522P3494N5245K42169o0303r9789j74329N0522
20845B386P4772j89395l9663J53278J05232j05457j34325k24152j14728k22849
20835f94901N5630J32671R1210o2311r0825K47836J75395q496j26663L6326r7121
20824c41249p4774K4527R0303L9887O1064K13522O4304j51403r038J62743j53771
20813g3885r8674J02733k0004M3941l6831n7577j335j11966j71406K10427K96211
$$ plain form
20888 289008 58411 -213394 -9927 231251 249915 427159 472006 531031 679765 827141
20878 827141 798003 714018 711295 723786 621934 409672 248776 273286 266648 264294 289134
20867 289134 252155 59323 -24610 -109284 -314338 -320621 -198273 -204675 -204417 -194351 -51688
20856 -51688 156007 86461 -189145 -84623 -11129 44116 286285 225982 126193 -48136 2386
20845 2386 77158 -112237 -151900 1378 106610 1153 -133172 -357324 -472052 -694901
20835 -694901 -639271 -506600 -415390 -477701 -568526 -320690 -145295 -153791 -280454 -244128 -341249
20824 -341249 -416023 -391496 -301193 -261306 -200242 13280 77584 -73819 -82857 79886 -73885
20813 -73885 -172559 -69826 -89830 -45889 -82720 -140297 -141632 -253598 -425004 -214577 81634
20802H1634O709j32059J30765O808j10182O5461N3865j29033l2472m8395K4194
20791h2705m1440P3605Q9202j45505j46464j27388J60638L15581J9216j55674
20781d0934o5476q022K130Q9789p1433J62667K74036P2087j69424O3071l9940
20770B68551q8479J2262J2734j34141j40816Q5193Q6835R869j12517l0733o9260
20759a00502K01672J20735K2157k29575p4912J42924R7344j12002j52781M2089
20749d2851n9816N9309J01855j31058o0187j15420l6265j62740j57868L1235Q3731
20738d90075j6436J99713K93939L0531N0839J5151m554m1043L4625p393J6915
20727H2212P4304j06062L4222M5674r4843R8072K01793n0340J24953m0463j58315
$$ plain form
20802 81634 88343 -43716 87049 93857 -16325 49136 103001 -26032 -58504 -106899 -82705
20791 -82705 -124145 -50540 38662 -106843 -253307 -380695 -220057 95524 114740 -40934
20781 -40934 -106410 -114432 -112302 -22513 -93946 68721 342757 414844 245420 308491 268551
20770 268551 180072 192334 205068 70927 -69889 15304 102139 112008 -509 -31242 -100502
20759 -100502 101170 221905 244062 14487 -60425 82499 179843 67841 -84940 -42851
20749 -42851 -102667 -43358 58497 -72561 -132748 -248168 -284433 -447173 -605041 -573806 -490075
20738 -490075 -506511 -306798 -12859 17672 68511 83662 79108 38065 72690 65297 82212
20727 82212 156516 50454 84676 130350 35507 133579 335372 285032 409985 369522 211207
20716B11207o8976k5367j43424j41520M8527J55700M5703j45615q1555M9187J48003
20705E1870j49365n584L625J1302k8725K8846O4464J06326M7748J70909M3651
20694C45067j70095M9845R3726o8965q4554J88377l5976l7192m1421l9859j0323
20683A88630j42793p4592J38483k3873j04926j16532M4476j3628j14715L6653
20673a82817j0037p4835K9160J171r6377J37888j9976j8895J95628K59817m641
20662B16086k2092j7437K5467M9107j53183k17520Q2947J7775L6480L3738m0752
20651A0616K03126n8606p7312k24225j31293K354J87719J66961n7136j34547n8185
20640a70528m6644J43981J19408N1589j69089o8901L777m7709o7353J83501J66888
$$ plain form
20716 211207 142231 116864 -26560 -168080 -119553 36147 81850 -63765 -145320 -96133 51870
20705 51870 -97495 -103079 -99454 -88152 -116877 -88031 -23567 82759 130507 301416 345067
20694 345067 174972 224817 318543 249578 165024 353401 317425 280233 238812 198953 188630
20683 188630 45837 -28755 109728 85855 -19071 -135603 -91127 -104755 -219470 -182817
20673 -182817 -192854 -267689 -238529 -237358 -333735 -195847 -215823 -234718 -39090 220727 216086
20662 216086 193994 176557 202024 251131 97948 -119572 -36625 -18850 17630 51368 10616
20651 10616 213742 155136 77824 -146401 -277694 -275340 -87621 79340 22204 -112343 -170528
20640 -170528 -217172 -73191 46217 97806 -71283 -140184 -136407 -184116 -251469 -67968 98920
20629I8920J7385p4863N4225n5834k05977j00247J50019O5697O2735m4726o7629
20618a00295l5256J6172l6572L7615N4781P1453j12336j62416r7017L4918K87099
20607d1854J35354n3139L0211m9906p5820N8728j2407J42334L4609o4528O4155
20596A67737K7060j84216j5632N2662P0058m4531O8575k7521j17698m9870l3531
20585h6907j19164j54080m1812r9649L40642J91571r3643j48071R4510m094J46505
20574B5808J00002M3879J03744j17370p3446j7509J60397j03566j89412O932n5267
20563a15808j06454j86866N737P1423l1136J93425J72228K0194J86544j46718
20553F2569r8501j18638j09778J8667J33384J9622Q4909o7548o085L9559m6578
$$ plain form
20629 98920 116305 41442 95667 39833 -166144 -266391 -116372 -50675 12060 -32666 -100295
20618 -100295 -135551 -119379 -155951 -118336 -63555 7898 -104438 -266854 -363871 -328953 -41854
20607 -41854 93500 40361 70572 20666 -55154 3574 -8833 133501 168110 103582 167737
20596 167737 194797 10581 -5051 47611 117669 73138 141713 114192 -3506 -53376 -86907
20585 -86907 -206071 -360151 -401963 -501612 -160970 30601 -63042 -211113 -116603 -120697 25808
20574 25808 125810 169689 273433 156063 82617 65108 225505 121939 -67473 -60541 -115808
20563 -115808 -222262 -409128 -403391 -331968 -363104 -169679 2549 22743 209287 62569
20553 62569 -35932 -154570 -264348 -245681 -112297 -92675 -7766 -75314 -81399 -41840 -88418
20542h8418J92331J32224j7709L5083M1775j17143k35750l4149P5684N9160J35562
20531A78650k8472j28886o3160J9568Q8757j15269j6360J96879O8449K1428r4584
20520A27000J84448M8365N5861j49586k8575j22637P142p784j99581J05562j04936
20509h4721k00385N1377J90970P7023m0073j50705k01602J30360R9997J00462
20499b7297Q973K31011n7983k40852o0588O4935m4506k6835k1525k87329J26341
20488c35655K68276m4709J8979K08937J77231M2347j61681k30293n4327P2702
20478c8193P7544J14082Q3862l8584j29223j48436J4495J82377j3259k17904j59717
20467b72956N5021K7086j28829j46647N1944M3008J20125L14493J46032N2722
$$ plain form
20542 -88418 103913 236137 218428 253511 295286 178143 -57607 -91756 -16072 43088 178650
20531 178650 150178 21292 -41868 -22300 66457 -48812 -65172 131707 200156 221584 127000
20520 127000 311448 359813 415674 266088 237513 114876 122018 114234 -85347 20215 -84721
20509 -84721 -285106 -233729 -42759 34264 -5809 -156514 -358116 -227756 -127759 -27297
20499 -27297 -18324 212687 154704 -86148 -146736 -81801 -126307 -153142 -174667 -461996 -335655
20488 -335655 -67379 -112088 -93109 115828 293059 335406 173725 -56568 -110895 -38193
20478 -38193 39351 153433 237295 198711 69488 -78948 -64453 117924 104665 -113239 -272956
20467 -272956 -217935 -190849 -319678 -466325 -414381 -371373 -251248 63245 209277 261999
20457B61999q0723m6782m0642N6117k9936j16892L2204m910n4392n1042J13500
20446C8501j10454k15523k8090J33467o0916L9332l4053p6410J99408K62210J93230
20435C40702j86894j67173r5978m6005j02189p6297J34597m6524J3324K29705
20425b732L7039J895L3911l3520L3238K7769Q4682J3631o2273M1706n6874j20843
20413b371j5105o1786n9985j8353J86685K4618K2593N9636k5348P6977J2071j32804
20401F6828J23301J37136J21239p2959o5488r0418m577m3519k1446r1006P0055
20390A29146l8578j33779K7312J36370J69097L4610j44849j41734k29153P9788
20380a11770K26385R1201q4526j32659J79478l6532j28759j45041J27457K10455
$$ plain form
20457 261999 181276 134494 93852 149969 120033 3141 35345 30435 -23957 -74999 38501
20446 38501 -71953 -287476 -315566 -182099 -243015 -203683 -237736 -314146 -114738 147472 340702
20435 340702 153808 -13365 -109343 -155348 -257537 -333834 -199237 -245761 -232437 -2732
20425 -2732 34307 36202 70113 36593 69831 97600 182282 195913 133640 175346 118472 -2371
20413 -2371 -17476 -79262 -139247 -157600 29085 53703 76296 135932 110584 187561 199632 66828
20401 66828 190129 327265 448504 375545 310057 219639 215062 171543 150097 59091 129146
20390 129146 90568 -43211 -15899 120471 289568 324178 179329 37595 -191558 -111770
20380 -111770 114615 205816 121290 -11369 168109 131577 2818 -142223 -14766 195689
20370A95689j34617l2485o4474R3773R6581j726l0273J95656J60919j79287J7079
20359C16835q1780n0609j86462l9171K2103j87639l26556o1929J10763L03879
20349a80566J32593J21188O3815j60464R514J24700m2514j50376n1186j91993
20339c25289m3633P6280L10019K37451K42708j04107j76119K9368q813J81959
20329D19824j0414K1415l3535j4453J5034j33310k04076Q3266M0833J97794Q2763
20318D65141Q9375j77198M013L7828q0476K01720K35887j81307K6968K43202J59023
20307A024176j86149l8851O8222j37620J42241J21548J65311O5212j55789J9527
20297A087828J64415J96118J40337J89902M0488l2054k66045J24132K03561K65480
$$ plain form
20370 195689 61072 28587 -35887 57886 154467 152741 122468 318124 479043 299756 316835
20359 316835 235055 184446 -2016 -41187 -19084 -206723 -533279 -595208 -484445 -180566
20349 -180566 -47973 73215 137030 -23434 -13920 110780 68266 -82110 -133296 -325289
20339 -325289 -368922 -292642 17377 254828 497536 393429 217310 246678 237865 419824
20329 419824 409410 430825 397290 382837 397871 264561 60485 143751 184584 382378 465141
20318 465141 554516 377318 381331 419159 338683 540403 776290 594983 621951 865153 1024176
20307 1024176 838027 799176 867398 729778 872019 993567 1158878 1224090 1068301 1087828
20297 1087828 1252243 1448361 1588698 1778600 1819088 1787034 1520989 1645121 1848682 2114162
20287B114162J37790L23023L44607N98648M15609J04193m30791n70924k17593
20278B818724M826j31121j05708R9692J18852K61943P7333L88535L85783M62335
20268D381194N41227P00929O93040R06703R91870J262618J756833K188244K924913
20259A6347571L563951M781396O727617R259160J2637138J8112283K5896813L6638971
20251A33964900M6175179L9238674P027633k8905911m6768609m4090412l1986567
20244G4654887k0815577j3521512q605492o188081m792112l444263k723295k042647
20236A2521908j578862j444254j321959p14986o15437n40376m36750o49498m40516
20227D779270l69174n07044j15092k13873k24827j09842J7574K45951L29117J36781
$$ plain form
20287 2114162 2251952 2574975 2919582 3518230 3933839 4038032 3607241 3036317 2818724
20278 2818724 2823550 2692429 2586721 2686413 2805265 3067208 3144541 3533076 3918859 4381194
20268 4381194 4922421 5623350 6316390 7223093 8214963 9477581 11234414 13422658 16347571
20259 16347571 19911522 24692918 31420535 40679695 53316833 71429116 97325929 133964900
20251 133964900 180140079 219378753 226406386 197500475 150731866 106641454 74654887
20244 74654887 53839310 40317798 31712306 25524225 20732113 17287850 14564555 12521908
20236 12521908 10943046 9498792 8176833 7461847 6846410 6306034 5869284 5219786 4779270
20227 4779270 4410096 3903052 3787960 3574087 3349260 3239418 3256992 3502943 3832060 3968841
20217C968841J55476K05087L0672k79019k96218m1705k7794R436M18389P52284
20207D895449J237962J793524J375899J83132p54782j529561j571444j068013
20199D562166o53374n07548m45714m92884l15418k04581l28516k51214q5885l8401
20189A238631m6660j76421k45827j31280j87928r7731J86331K99083p571N8135
20179H88762k30486j12882L6374k3307J2636K3574J46748M1694k18935N3941j19658
20168D98461O5541R6130O4971j85241k25517l4641j93795j47760q5961n4861K48993
20157D6320J75341q6638j24402J63502O0858Q5853o0948o8214L7648N7444N2087
20146C38851J8856j07416j11710J12456k1890k43315j11205N0111J16329k57972
$$ plain form
20217 3968841 4124317 4329404 4360076 4081057 3784839 3743134 3715340 3724776 4143165 4895449
20207 4895449 6133411 7926935 9302834 9485966 8731184 7201623 5630179 4562166
20199 4562166 3908792 3401244 2955530 2462646 2147228 1942647 1614131 1362917 1277032 1238631
20189 1238631 1191971 1015550 769723 638443 450515 352784 539115 838198 830627 888762
20179 888762 658276 545394 581768 558461 571097 594671 741419 783113 564178 618119 498461
20168 498461 564002 660132 725103 539862 314345 279704 85909 -61851 -147812 -202673 46320
20157 46320 221661 135023 10621 174123 234981 320834 259886 191672 229320 286764 338851
20146 338851 357707 250291 138581 251037 229147 -14168 -125373 -75262 41067 -216905
20136b16905q6106p0812Q2701O1073m7966j23600J72100J13160L12143Q4279n2267
20125B27800O2026q6513K9943R615L8018N773p0275O1454J8416m8186M3497P5728
20113C67296J28283o4247k62768r3300o7957K2434Q9208P7502j12896L2399J22446
20102B38400j14673j94659k8073j886M9808J00032K451j72014l6464l7187J78893
20091a5372J18016j02900k6731P6547m1387p4345L6687N7833J0130j35117o8514
20080a65153K7049j49706J66317J9278r0493n7828l5361l0819k5522K28804J90351
20069G6917P6128p1744j98984k68048r2713J71557O9747K84846j17244j33386
20059b02924j16111J90092J89129K17861p0097r854n8407P8704m5457j53972Q3863
$$ plain form
20136 -216905 -303011 -373823 -291122 -230049 -278015 -401615 -229515 -116355 195788 280067 227800
20125 227800 289826 203313 233256 242871 280889 286662 216387 277841 296257 248071 291568 367296
20113 367296 495579 431332 168564 75264 7307 29741 118949 196451 83555 115954 238400
20102 238400 123727 -70932 -99005 -100891 -51083 48949 51400 -120614 -157078 -194265 -15372
20091 -15372 102644 -256 -26987 49560 8173 -66172 -29485 28348 38478 -96639 -165153
20080 -165153 -138104 -287810 -121493 -102215 -192708 -250536 -285897 -316716 -342238 -113434 76917
20069 76917 153045 81301 -117683 -385731 -478444 -306887 -237140 47706 -69538 -202924
20059 -202924 -319035 -128943 60186 278047 207950 198096 139689 218393 172936 18964 102827
20048A02827J49272O347p2814j79179l1570j22858k00558N8543K15282J37854
20038F3146k1013k38260R1183J33947k18178J18541j57517R6801k3168j17198
20028b71716j86586K0406K49872j53297J27218Q8953N7850j27314j8868M9262
20018a64220Q4137l9351j24831Q1093M9085M6384L7342J16232m0169m0815j25194
20007a20307r9159j4540J00775l8898j01345p2140L3421J20266J42216Q9007p4158
19996c4862Q519J07475j74623m5107N1643Q9990R880k9637M9167K04849j2883
19985B24411j04651o7123k4054m3952j24476J50868J06877l59391r5010l7541
19975c74042N5252M1629M2163J11554Q8161R4737R9394k27114j39555M1484J76703
$$ plain form
20048 102827 252099 258446 185632 6453 -25117 -147975 -348533 -289990 -74708 63146
20038 63146 42133 -196127 -104944 29003 -189175 -70634 -228151 -131350 -154518 -271716
20028 -271716 -458302 -437896 -188024 -341321 -214103 -125150 -67300 -194614 -213482 -164220
20018 -164220 -80083 -119434 -244265 -163172 -114087 -67703 -30361 85871 45702 4887 -120307
20007 -120307 -219466 -234006 -133231 -172129 -273474 -345614 -312193 -191927 -49711 39296 -34862
19996 -34862 -26343 81132 -93491 -138598 -86955 3035 12915 -16722 32445 237294 224411
19985 224411 119760 52637 28583 -15369 -139845 11023 117900 -241491 -336501 -374042
19975 -374042 -318790 -277161 -234998 -123444 -35283 59454 158848 -68266 -207821 -166337 10366
19964A0366J19338M0657q5812j30749n4379m0031l5329q6093J59349K61711o2581
19953I6447m61557q4375Q3597l621j0208P1281r18N5809K73820J03824o038j6690
19941A01371J0250n7815N6085J5710j4601m1823L5465j6937J7682P6299O7531
19930B49217j50571L04j69424L2505O9443L8723L5385n9189n7O7130k7542K2849
19918A08773p6178j48477J55089N0037J44495L2512n2481J5554r758j28192J43261
19907B34635o8336j23649p3307k054J26267j15559q5748J22469K28297Q8946j51081
19896A80880k82491r6244P642r1284K07289p3636l8584l5969L2694J17285j3382
19885h5800O3648l9034j09612Q7058J18649J63739j40081q2092J39833r0951j43304
$$ plain form
19964 10366 129704 170361 84549 -46200 -100579 -140610 -175939 -262032 -102683 159028 96447
19953 96447 -365110 -449485 -365888 -369509 -379717 -308436 -309354 -253545 20275 124099 118061 101371
19941 101371 111621 53806 109891 125601 111000 69177 104642 87705 105387 181686 249217
19930 249217 98646 98950 -70474 -37969 31474 70197 105582 46393 46336 113466 85924 108773
19918 108773 32595 -115882 39207 89244 233739 266251 213770 229324 219566 91374 234635
19907 234635 166299 42650 -30657 -32711 93556 -22003 -107751 14718 243015 331961 180880
19896 180880 -101611 -197855 -190213 -281497 -74208 -147844 -186428 -222397 -189703 -72418 -85800
19885 -85800 -22152 -61186 -170798 -83740 34909 198648 58567 -23525 116308 25357 -117947
19874a17947q0164L9368J49430j18804j37272K56174K31751j28593N1728L3893
19864A79564l7234R5632M9251j84752j12057l8633O2340j21977r1402M7849O8203
19853h3216J11616L8485J7181k74867Q770j51744k9401J22180K09264M0292m0266
19842c1706p895J5469j09025j4323P8859n5481m9069P4357O0202K01921K23598
19831C86907j08893j00414K3211Q0824q3775J50211M9357j27914j32507k37874
19821a00867k4056N6733m890j846P6558M5463j2266q3402N4297J15090m8003M993
19809G7804P364j64113R3644o9105j63527k0361j01177O3960P5851J35702q3061
19798a47019r7669J25200N5203j4223N3180K62484j08244m1854Q4859N5402k4455
$$ plain form
19874 -117947 -198111 -158743 -9313 -128117 -265389 -9215 222536 93943 145671 179564
19864 179564 142330 237962 287213 102461 -9596 -48229 14111 -107866 -199268 -151419 -83216
19853 -83216 28400 66885 84066 -190801 -182031 -333775 -363176 -240996 -31732 8560 -31706
19842 -31706 -39601 -24132 -133157 -147480 -68621 -124102 -173171 -98814 -38612 163309 386907
19831 386907 278014 177600 200811 281635 197860 348071 397428 269514 137007 -100867
19821 -100867 -124923 -68190 -73080 -74926 1632 47095 34829 -48573 5724 120814 72811 77804
19809 77804 85168 -78945 14699 -54406 -217933 -238294 -339471 -275511 -199660 -63958 -147019
19798 -147019 -244688 -119488 -64285 -78508 -25328 237156 128912 87058 171917 227319 202864
19787B02864m2679k06685j20476k2819m3826P1078P5068P3996J32470N9741O2855
19776B41587K97489J58689j62053m22001l09076l5898j22041N7402J32952Q3266
19766g9684o4403Q0937J7144Q5062O0083J14151k00831k28053J33065j73030k72190
19755e27749R4587J77990Q0539J28772m8227J68934k6363n137l2426q5630m8797
19744a23507j25157l4221L2841L2075j43236J73718Q0483O3914o8858r9318m708
19733b15974n2337m7945l4799R8553K02679J33167K3140J11383O3499q5925j45021
19722E0420R908M6812o6858r7854J9864j53345K4531J08455L03789l7836k64630
19711e6744J07633L4j37954j54372r7358l656J19557K72496Q9755J0113p4804
$$ plain form
19787 202864 160185 -46500 -166976 -189795 -233621 -162543 -87475 -13479 118991 178732 241587
19776 241587 539076 697765 535712 113711 -195365 -231263 -353304 -295902 -162950 -79684
19766 -79684 -144087 -63150 -46006 39056 99139 213290 12459 -215594 -82529 -255559 -527749
19755 -527749 -433162 -255172 -174633 -45861 -94088 74846 48483 43346 10920 -74710 -123507
19744 -123507 -248664 -282885 -250044 -217969 -361205 -187487 -107004 -43090 -111948 -211266 -215974
19733 -215974 -268311 -316256 -351055 -252502 -49823 83344 106484 217867 281366 195441 50420
19722 50420 60328 107140 40282 -57572 -37708 -191053 -166522 -58067 245722 207886 -56744
19711 -56744 50889 50923 -87031 -241403 -338761 -342417 -222860 49636 139391 149504 74700
19700G4700O386L2582r0127M7334K08133j77518q5941P4385j29052r3852k23987
19689c56957k29820J38241K47646K24955P3009L1205j95766j51599J05844J96046
19679H2804j61883k60191J14528J81318k44J19609J5330k11905j04607J09805
19669a15436J5845j64191j11566N1119l3832J33424j40247J04990R3155J17462
19659d9277o3463N210R7916j21780k00151R2846J88496o6952k00768N6663J04360
19648a56900k0126R1423M3328K3945Q981o6000O8538j16716j21704n7943O9724
19637b33450N3990m3777J41745J73310k39204j66821J04103P0788j1041P0959
19627g9398J09533J42735q1229k29079k1664J44934K41988J41461J03201L8904
$$ plain form
19700 74700 81086 113668 23541 70875 279008 101490 15549 89934 -39118 -132970 -356957
19689 -356957 -586777 -448536 -200890 24065 97074 128279 -67487 -219086 -113242 82804
19679 82804 -79079 -339270 -224742 -43424 -43668 75941 91271 -120634 -225241 -115436
19669 -115436 -99591 -263782 -375348 -324229 -358061 -224637 -364884 -259894 -166739 -49277
19659 -49277 -112740 -107530 -9614 -131394 -331545 -238699 -50203 -117155 -317923 -261260 -156900
19648 -156900 -177026 -85603 -42275 -18330 -9349 -75349 -6811 -123527 -245231 -303174 -233450
19637 -233450 -179460 -223237 -81492 91818 -147386 -314207 -210104 -139316 -150357 -79398
19627 -79398 30135 172870 91641 -137438 -159102 -14168 227820 369281 472482 511386
19617E11386J05757J69031q9681n606O8408j4321j07527j69196k08989k12067
19607D7195J1630O5188J34855o6916p3353j38880j0234K9216J3935q3110l41999
19596d12473o6682K451K69875J88234P5057j05400J53300K33937P9268j90434
19586B27133j94667O5862N5220j37803q8989J43138J35875j15474q0929J61551
19576A70917m684j55797J5610J68229M4014j77801j46054N6202m4295M4817O2232
19565C3390R7461n8906j48637n530q8026o2068J46199J76764J60707p3822j27433
19554E0099L1578J40034j93085R5920r2526J5826R3060j12656k68471J808L30420
19543I2007J7560r5197l680m8507L555J23548J89173m6820j66988P2765K04932
$$ plain form
19617 511386 617143 786174 696493 690887 759295 744974 637447 468251 259262 47195
19607 47195 58825 124013 258868 191952 118599 -20281 -30515 -1299 12636 -70474 -412473
19596 -412473 -479155 -476704 -206829 -18595 56462 -48938 104362 338299 417567 227133
19586 227133 32466 98328 153548 15745 -73244 69894 205769 90295 9366 170917
19576 170917 166233 10436 26046 194275 238289 60488 -85566 -29364 -73659 -28842 33390
19565 33390 130851 71945 -76692 -82222 -170248 -232316 -86117 90647 251354 177532 50099
19554 50099 81677 221711 28626 124546 32020 47846 140906 28250 -240221 -238413 92007
19543 92007 109567 14370 10690 -37817 -34262 89286 278459 231639 64651 137416 342348
19532C42348J54445l02254k92269K4892l6987m126n0878J56842l6732K0403q7073
19521a11389q0293Q4082n3835j43155J53860J13451Q8255J6519m2608p6390J6572
19510c4931p7314J09569J40458J0523o8167o7321k53839J39377K2330Q5685J60501
19499A66871m0989J35903J34069j14710n3184M14637K46697M1474l63949j54523
19489D12296K890o0545j4395j06101k37284K6601m949j12327j25999K3460q1128
19478b77481J9412p2067P3300K06458J47037r5466J02950J03607l106j95428n5810
19467d6594k4244m7726N0470K10824K32704J56625J21983j89603j2392L35465
19457G87512R3887j85130j39236j42428j22749j35194j35023m3291j33089R8428
$$ plain form
19532 342348 496793 194539 -97730 -72838 -109825 -113951 -164829 -7987 -44719 -24316 -111389
19521 -111389 -191682 -107600 -161435 -304590 -150730 -37279 50976 67495 24887 -51503 -34931
19510 -34931 -112245 -2676 137782 148305 80138 12817 -241022 -101645 -79315 6370 166871
19499 166871 125882 261785 395854 281144 227960 642597 889294 930768 566819 412296
19489 412296 415186 354641 340246 234145 -3139 23462 18513 -93814 -219813 -196353 -277481
19478 -277481 -258069 -330136 -256836 -50378 96659 1193 104143 207750 204644 9216 -46594
19467 -46594 -70838 -118564 -68094 142730 375434 532059 654042 464439 452047 787512
19457 787512 881399 696269 557033 414605 291856 156662 21639 -21652 -154741 -56313
19447e6313J75759n2507j1746K48415q2570j38978p6666o0737K6222P8754j24070
19436g4437k7763j13629M657J06310k0469j33255j35736j3765l5364J57744K61014
19425b4693K4043k53164K2361N15771O0153j46590j82752j43879m4494J61080
19415a2164J1282R347r3767j30238M2083J23115J01563j4697J79731K8646o7990
19404A76911j77146M0046j6479j44307O7413J11538Q7189N2895j03762K2619n0120
19393F6797p7411j16161j6680r3005o9742J16180L5813M7344J39194J40329k47037
19382g4379l20158J65528J13522j53043K28153L4436j58441N7191K34383j45314
19372a8122m9813j34688j88038O125K4120J21410N6544r9333k4443l2655J12137
$$ plain form
19447 -56313 119446 66939 55193 303608 221038 82060 5394 -55343 -29121 49633 -74437
19436 -74437 -102200 -215829 -211172 -104862 -125331 -258586 -394322 -408087 -443451 -285707 -24693
19425 -24693 -650 -253814 -231453 284318 344471 197881 15129 -128750 -173244 -12164
19415 -12164 -882 8465 -85302 -215540 -173457 -50342 51221 36524 216255 244901 176911
19404 176911 -235 39811 23332 -120975 -53562 57976 145165 198060 94298 116917 66797
19393 66797 -10614 -126775 -143455 -236460 -306202 -190022 -154209 -106865 32329 172658 -74379
19382 -74379 -394537 -229009 -115487 -268530 -40377 -5941 -164382 -107191 127192 -18122
19372 -18122 -67935 -202623 -390661 -384536 -360416 -239006 -182462 -281795 -306238 -338893 -226756
19361b26756J77772J38023J73395J12282j12111j14732j62353P8616r174J01628
19351A56590J1623q1084J08293P8842j02261k53425j9654J47261K80811K4073
19341C51069n11406l12352k07526J20073K14456P4507K787j6490j09607K13467
19331a81022L0633P4241J40202J478j3287M4936n4268J37973J23672M7984j60340
19320A92202j78035k39103k11841L3435J14743O6329K45791j22517k64525l1276
19310c94797L13790K85975j5700j62617J29348Q7255L6689N0060j34762j23211
19300G2030Q9036q8n355J45164r2817p7761j61163K7991J13997k09178L6705M4391
19288a7048P817K7737j8068k07756o9953J33218J32854Q3877n1068J96710J60809
$$ plain form
19361 -226756 -48984 89039 262434 374716 262605 147873 -14480 64136 54962 156590
19351 156590 168213 87129 195422 274264 172003 -81422 -101076 46185 326996 351069
19341 351069 -160337 -472689 -680215 -560142 -345686 -271179 -268392 -284882 -394489 -181022
19331 -181022 -150389 -76148 64054 65532 52245 97181 42913 180886 304558 352542 192202
19320 192202 14167 -224936 -436777 -403342 -288599 -222270 23521 -98996 -363521 -394797
19310 -394797 -81007 204968 189268 26651 155999 243254 279943 330003 195241 72030
19300 72030 161066 160978 155623 300787 207970 130209 -30954 -2963 111034 -98144 -61439 -17048
19288 -17048 -9231 18506 438 -207318 -277271 -144053 -11199 72678 21610 218320 379129
19277C79129k49365l00721q4875K39416P9191j51267k21080J05883P9600j717
19267a25806K7693O0645r6941j63835m1056Q0039J55350J10226p3580k07720J54546
19256a20439K46573Q2295q60k47234J8498k0405k09006N044J15580k004J34624
19245B666Q282J94045J01641k42969j58381N8140J37374J25842O2494j08431j97659
19234a6956n8733K42163K59605k17785l49963o1719M0071J6782p6655Q6230J09051
19223b7909m845j79244j57160J1343Q1303P5485J0128J11866K5441j16052J22878
19212d6766O4566j98040r5377K58104j84129j34025N3597M2973k1854J59985n260
19201a06226P1098L39673P9801j32002l4374k29964j81720o2511p8412P7832L5944
$$ plain form
19277 379129 129764 -170957 -255832 -16416 62775 -88492 -309572 -203689 -124089 -125806
19267 -125806 -98113 -37468 -134409 -298244 -339300 -259261 -103911 6315 -67265 -274985 -120439
19256 -120439 126134 208429 207569 -39665 -21167 -41572 -250578 -245534 -129954 -131958 2666
19245 2666 10948 204993 306634 63665 -94716 -36576 100798 226640 289134 180703 -16956
19234 -16956 -75689 166474 426079 208294 -141669 -203388 -163317 -146535 -223190 -136960 -27909
19223 -27909 -32754 -211998 -369158 -357815 -276512 -201027 -190899 -79033 -53592 -169644 -46766
19212 -46766 17800 -180240 -275617 -17513 -201642 -335667 -282070 -239097 -260951 -100966 -106226
19201 -106226 -35128 304545 384346 252344 217970 -11994 -193714 -256225 -334637 -256805 -220861
19190b20861J07877J26196m2360q3594J66396q0054L4362j34230P6852p3247N7029
19179f5634J82131L2485j77024j00473L4459K80181j0976k9748M171j18387R5714
19168A26899M3202j11733K7146k6592j16432n3192L2154J44438L6547o7989P2473
19157A06921P4683j37549j5363P8214J31674j06767j84659j02325K6048l4905
19147a64028j80735k4947J11499J34699q9206j80763K80961J18965M8390n904
19137D8931q4838J56568O6924j90649k18596n9092K5954Q5748K7399r0811n6342
19126b88804K51649J29170j16643J18078j8493j49789j9639M6468J17072m231
19116F4838j856k21679r1942J81254J14718R5360M6887N3518M4855j38893q0587
$$ plain form
19190 -220861 -112984 13212 -29148 -112742 53654 -26400 7962 -126268 -49416 -122663 -65634
19179 -65634 116497 148982 -28042 -128515 -94056 186125 175149 145401 149572 31185 126899
19168 126899 170101 58368 85514 58922 -57510 -110702 -78548 65890 102437 34448 106921
19157 106921 181604 44055 28692 106906 238580 131813 -52846 -155171 -129123 -164028
19147 -164028 -344763 -369710 -258211 -123512 -212718 -393481 -112520 6445 54835 48931
19137 48931 -35907 120661 187585 -3064 -221660 -280752 -254798 -169050 -141651 -232462 -288804
19126 -288804 -37155 92015 -24628 93450 74957 -74832 -94471 -48003 69069 64838
19116 64838 62982 -158697 -250639 -69385 45333 140693 187580 241098 285953 147060 66473
19105F6473N2207j13853j3285o380r7841m3460O5285J35388K11247R5499j17091
19094B34189L4092O4511r3079o0053L9111n7951K20240R9441j09045k42317j59810
19083c0671p8356j45578J47011J34391N2837j8872j25330j30800J37655o7922
19073a25635O7712M559j686j03143m4112r816N2468O9155j22542q6190m7760j7440
19061c64430J67895J16686J39807r7195o4387N4549r5067r254l67r9208N3412
19050a97559J36531j31636j85631J18496K45173J05330o5616j29172J72382J46185
19040B14483J17765j6222k51141j17817k19255j25330Q5961Q8018N68P9319j72967
19029c16618l4783J05229L2749J02772R3371J60563J96899K04228m7144k71552
$$ plain form
19105 66473 118680 4827 -8458 -14838 -112679 -156139 -90854 44534 255781 351280 234189
19094 234189 268281 332792 239713 179660 218771 160820 381060 480501 371456 129139 -30671
19083 -30671 -109027 -254605 -107594 26797 79634 60762 -64568 -195368 -57713 -125635
19073 -125635 -57923 -53364 -55050 -158193 -202305 -212121 -159653 -90498 -213040 -299230 -346990 -364430
19061 -364430 -196535 -79849 59958 -37237 -101624 -47075 -142142 -151396 -151763 -250971 -197559
19050 -197559 -61028 -192664 -378295 -259799 -14626 90704 25088 -104084 68298 214483
19040 214483 332248 316026 64885 -52932 -272187 -397517 -311556 -223538 -222970 -143651 -316618
19029 -316618 -351401 -246172 -213423 -110651 -17280 143283 340182 544410 497266 225714
19019B25714p0916m9530j57046K7090J38558K9851k36813j78764N532K09175R6968
19008C9819k8282j14794o7827K02532j4611q4032K8995J9565J30832n6604j69501
18997a13908j55384r763K15979J37429N8869k2944K34110J58211Q373j68646l7597
18986C04729n9289J83291m3556j82204j59544j6195m825j68129N0405J25134Q1831
18975A11648p7810J63474M7603p8897P3492l4831o7271m0752J58794J13045o335
18964C62160o4911n1212k715K7297K14909P4952Q2178j28071L8182K59877K16961
18953A029607K54945J14686N0949m8047l30412k5414K5280j12052j39746m9708
18943G70088P4502L30012J32264J02313K2389k19799j72305J02033j33790j24328
$$ plain form
19019 225714 154798 105268 -51778 -24688 113870 143721 -93092 -271856 -266324 -57149 39819
19008 39819 11537 -103257 -171084 31448 16837 -67195 -38200 -18635 112197 55593 -113908
18997 -113908 -269292 -279055 -63076 74353 133222 110278 344388 502599 510972 342326 304729
18986 304729 245440 428731 385175 202971 43427 27232 22407 -145722 -95317 29817 111648
18975 111648 33838 197312 244915 166018 239510 204679 137408 96656 255450 368495 362160
18964 362160 297249 246037 243322 270619 485528 560480 642658 514587 552769 812646 1029607
18953 1029607 1284552 1399238 1450187 1402140 1071728 1046314 1071594 959542 819796 770088
18943 770088 844590 1174602 1306866 1409179 1431568 1211769 1039464 1141497 1007707 883379
18933H83379K07266R7039j53265J03661K55645R2752o9856L23555O11318M51755
18923B803249M12116M59766K64554J44609M71712O72716J031369J410534J919764
18914I590389K729311L934782N359940P311933J1116415J7351360K7639636L3140496
18906A18174262J3223021j6289582l1173845k9334333j8645265j0658376o220223
18899A9075659m218103k982338k017363j284287q96834m93619k69570l15032l01489
18890F297024j48280L90167K09716R2138K23813j56729M130O35780J007902J444824
18880A0000485J878673K676318L968348N698813Q148462J1780251J7889515K8411066
18872I0451931L8590901K4575724r845593l2328891l6229302k5773830j5597496
$$ plain form
18933 883379 1090645 1187684 1034419 1138080 1393725 1486477 1416621 1740176 2351494 2803249
18923 2803249 3215365 3675131 3939685 4084294 4556006 5228722 6260091 7670625 9590389
18914 9590389 12319700 16254482 21614422 28926355 40042770 57394130 85033766 118174262
18906 118174262 131397283 115107701 83933856 54599523 35954258 25295882 19075659
18899 19075659 14857556 11875218 9857855 8573568 7676734 7183115 6913545 6598513 6297024
18890 6297024 6148744 6538911 6748627 6840765 7064578 6907849 6911979 7547759 8555661 10000485
18880 10000485 11879158 14555476 18523824 24222637 32371099 44151350 62040865 90451931
18872 90451931 129042832 153618556 143772963 111444072 75214770 49440940 33843444
18865C3843444r393662o028094l999786k675471j881463j322582j282064r00740
18857F359582m46105m12717m58608l97219n49682m63585l28420k57813k84306
18848B761127k23264K5075p2996k23758k24346j11476L032J57872J25519K60411
18838B477196M70115Q93721Q61327R24465Q75378j15701r81629j579257j038386
18829B787229n53373n32534k73769k64498j38687k20424r6873k08566O1444p477
18819E52472k6461j88213j02317J12350N4710J35702Q5653N3448j56618k60588
18809B60138k22948J78126J5996k5163J4794L5207q8590J29430P1457L5404n6908
18798C46943J16611Q5524m9859Q5531K9142O2007l8161L3980k49181k52199P8538
$$ plain form
18865 33843444 24449782 18421688 14421902 11746431 9864968 8542386 7260322 6359582
18857 6359582 5913477 5500760 5042152 4644933 4095251 3631666 3303246 3045433 2761127
18848 2761127 2537863 2562938 2489942 2266184 2041838 1930362 1933394 2091266 2216785 2477196
18838 2477196 2947311 3841032 4702359 5626824 6502202 6386501 5404872 3825615 2787229
18829 2787229 2233856 1701322 1427553 1163055 1024368 803944 707071 498505 559949 552472
18819 552472 526011 337798 235481 347831 402541 538243 623896 677344 520726 260138
18809 260138 37190 215316 231312 206149 220943 256150 167560 296990 368447 403851 346943
18798 346943 463554 549078 499219 584750 613892 675899 637738 671718 422537 170338 248876
18787B48876J05610j19392O4391j1351M3642M9453p2126K9157l2275j78040K53285
18776C81230K79104r804n1021J65323n5116j61736J00979M80316M72876L69630
18766A971781K44226j91210l20711n41403m10070j83783K8161q1294j04428r0816
18756C20453k02576k2439j62197k1063K17043O2180r5023m591K83357K16719k66630
18745C25233j26995j613L62957L07240r4572o3519j6777l2056O1817m1751J00500
18734G80464J20109j99441p5980m1922J25012K8290J36992R8046J22050J75279
18724A268899N2277J45056J29918j67440l89346n9789j21084k18704J2494K65344
18714I17625R6801P6951J65691q074j07776j90591l56581j27173k79711j61380
$$ plain form
18787 248876 354486 235094 299485 288134 331776 381229 309103 338260 305985 127945 381230
18776 381230 660334 650530 599509 764832 709716 547980 648959 1129275 1602151 1971781
18766 1971781 2216007 2024797 1704086 1162683 752613 568830 596991 515697 411269 320453
18756 320453 117877 95438 -66759 -87822 129221 191401 96378 91787 375144 591863 325233
18745 325233 198238 196625 559582 866822 772250 708731 691954 659898 721715 679964 780464
18734 780464 900573 701132 625152 583230 708242 736532 873524 971570 1093620 1268899
18724 1268899 1321176 1466232 1596150 1428710 1039364 979575 858491 639787 652281 917625
18714 917625 1014426 1091377 1257068 1248994 1141218 950627 594046 466873 187162 25782
18704B5782K0636l2246j28961J6384K89052J3614n9422l8390k50172L3001R3875
18693a6847J00774J71396j12598k31590K8927N7523J719L098l028P3234o0518
18682A2090N6920O7063L43J49702K64156q4929p6178J28548Q8306P9934j08959
18671E76996P0154j85059j10366m3918K44672J40992J03853p766o1182p1344j2777
18660F44255j79754L2558r3683j48206n3362j40954j11572K76062K95443M1275
18650E62062l7955N5212p3641j704j06831j74455J4490o0893j12738j36712J22520
18639D9355J32176J2968j53464q4542Q8746q1310p7995J93578P4131N4777K49805
18628D58225o4919j88865P3621K25210J97990M27680J25285j72731r8301p5655
$$ plain form
18704 25782 46418 14172 -114789 -98405 190647 204261 144839 106449 -143723 -110722 -16847
18693 -16847 83927 255323 142725 -88865 -59938 -2415 -696 2402 -626 72608 12090
18682 12090 69010 136073 136416 286118 550274 465345 389167 517715 606021 685955 576996
18671 576996 647150 462091 351725 307807 552479 693471 797324 789558 728376 657032 644255
18660 644255 464501 497059 403376 255170 201808 60854 -50718 225344 520787 562062
18650 562062 524107 579319 505678 503974 397143 222688 237178 176285 63547 -73165 49355
18639 49355 181531 194499 41035 -43507 45239 -36071 -114066 79512 153643 208420 458225
18628 458225 393306 204441 278062 503272 701262 1128942 1254227 1081496 983195 907540
18618I07540J69077Q3944J64865J56670k3811j30169O6268J71318K1877j17454
18608A470125m34369k49475m0956j52408q3484M03593L09065j38577j78247k48998
18598F56269j58371j73857j35710j01008n6409n6647P6093Q5111J7544J26733
18588B79748J88264o0082m9057j6334j20887k41199J20191L51547J68844p7875
18578E43160N80k6202j99800k83207m2735N58332L26865K48497J84356j04593
18568A205253k82072j63349j53247k6279l734K04507L56421J87864p8748k33810
18558A012806j13158l31168L0621J17226J66714J7051j85347k74083j98304j5096
18548B27262j6850n3993K05508m3582k29855K727P480J45245j36324l9997J19988
$$ plain form
18618 907540 1076617 1160561 1325426 1482096 1458285 1328116 1394384 1565702 1587579 1470125
18608 1470125 1035756 786281 745325 592917 509433 913026 1222091 1083514 905267 656269
18598 656269 497898 324041 188331 87323 30914 -25733 50360 135471 153015 279748
18588 279748 468012 407930 358873 342539 221652 -19547 100644 452191 621035 543160
18578 543160 543740 517538 317738 34531 -8204 550128 876993 1125490 1309846 1205253
18568 1205253 923181 759832 606585 580306 576572 781079 1137500 1325364 1246616 1012806
18558 1012806 899648 568480 599101 716327 883041 900092 714745 440662 242358 227262
18548 227262 210412 156419 361927 318345 88490 91217 98697 243942 107618 67621 187609
18537A87609Q3901N0423j21316k02935M5478J28242K46229J30817m3578j71420
18527C33450k36483k31565K0858J09495j23035j12956J05504J53338j86842M1101
18517a27135J81866N5897l3595L9183l2547l7788Q0118K0291K1690Q8036L7865
18506B93881j6544j79973j17382O4388J03590J42961l9119o1187j70968O734N9488
18495H5869Q2186j3904J22494J23835k11110N4652N3155j46546r9820j29172m6890
18484a25251L13057L59582l9749j69408J93053R0339k2585J91252J96180j89192
18474G97278j89613k5895K22617J39235j40804J75462q096l5729R0277J13643
18464A138375K71185K68096K41528K16078M55222P0801J1719K6757L4849J37689
$$ plain form
18537 187609 271510 321933 200617 -2318 43160 171402 417631 548448 504870 333450
18527 333450 96967 -134598 -113740 -4245 -127280 -240236 -134732 18606 -168236 -127135
18517 -127135 54731 110628 77033 116216 83669 45881 125999 146290 167980 256016 293881
18506 293881 277337 97364 -20018 44370 147960 290921 251802 190615 19647 26381 85869
18495 85869 168055 154151 276645 400480 189370 244022 297177 150631 50811 -78361 -125251
18484 -125251 187806 547388 507639 338231 531284 621623 599038 790290 986470 797278
18474 797278 607665 581770 804387 943622 802818 978280 970184 934455 1024732 1138375
18464 1138375 1409560 1677656 1919184 2135262 2590484 2661285 2673004 2699761 2734610 2872299
18454B872299J16143K76374L37785M45647N75293P39224J015564J171643J649157
18445I199129K004231K355566L328538M988375P712757J1709098J8159293K8376025
18437H7833012L7247540K4070578q609746l1673045l5602293k5582455j5115693
18430C2567898q904557n360758l120357j946993j163470p79385p38377p01246
18422I852755p47892o95887p07580p96836k41894o4952K79339K85697M64461P04223
18412H331434R30823J070079J108424J538267K883207M312922O124978R148938
18404C5449072J4569244K2921794L2290287K6258018q65377k5198448l3182186
18397G2242404k5617602j5481283q898853n516003l557030k362796j675382j272570
$$ plain form
18454 2872299 2988442 3264816 3602601 4048248 4623541 5362765 6378329 7549972 9199129
18445 9199129 11203360 13558926 16887464 21875839 29588596 41297694 59456987 87833012
18437 87833012 125080552 149151130 140541384 108868339 73266046 47683591 32567898
18430 32567898 23663341 18302583 15182226 13235233 12071763 11292378 10554001 9852755
18422 9852755 9104863 8408976 7701396 6904560 6662666 6597714 6877053 7162750 7627211 8331434
18412 8331434 9262257 10332336 11440760 12979027 15862234 20175156 26300134 35449072
18404 35449072 50018316 72940110 105230397 131488415 130623038 105424590 72242404
18397 72242404 46624802 31143519 22244666 16728663 13171633 10808837 9133455 7860885
18389G860885p82933o48657q32239n38218m92894k49010q6820j24997j11927m5819
18379C947371k25065Q8185K76380Q5005N5416j22642k596O2640R7533q6454L49459
18368D525232O44639O38509J01068p83444j043854j081305q37332m11344k75968
18359A476201l02918j93454k15322q3264j01771P6099j03819K3635m1889j1893
18349E21605J09566J03034N6393J23074j16327o0155P9627j66411r5374K2496
18339E77528k3826r9593J42101P0359l13672k40901Q8963R8752n1236k4197N4866
18328B79144N410o2922K34540M68338J33908r9324M081n4522l5714k37480k46457
18317C89002J8271J27805J29843J77540Q7010L3467j36726j74509O1616P2533
$$ plain form
18389 7860885 7077952 6429295 5597056 5058838 4565944 4316934 4230114 4105117 3993190 3947371
18379 3947371 3722306 3810491 4086871 4171876 4227292 4104650 4102054 4164694 4262227 4175773 4525232
18368 4525232 5169871 5808380 5909448 5126004 4082150 3000845 2163513 1752169 1476201
18359 1476201 1173283 979829 764507 681243 579472 655571 551752 575387 533498 521605
18349 521605 631171 734205 790598 913672 797345 737190 816817 650406 555032 577528
18339 577528 553702 454109 596210 666569 352897 111996 200959 299711 248475 224278 279144
18328 279144 284554 221632 456172 924510 1058418 959094 963175 908653 872939 635459 389002
18317 389002 407273 535078 664921 842461 929471 962938 826212 651703 713319 785852
18307G85852j0549j20039j25147k116N2391l4401k25575L5702J5982j71046N775
18296B06829L09318J06495j42571n7686k08754j94731l2747l5228P9209n3707
18286b3573p4351K71853O2237k6814K46087j81761k13203j96443K3753R7516K61074
18275B46375L57627J40800j08704M9228j8993k30177l04475K04K42234M5633K2941
18264D42693n5581j87353n6645l7559J6044N9399m0463J1886K0666J93454J543
18253C68084n2991l6881j452r7531q3174J34765J97719P7884J89419p3311p0914
18242E51617j17175q6393j60468j01102N4354j39107o5309j70717n1077J06691
18232a78686p9565L133J80285K49229L57101N2054k55319j74224q4232j7169R0114
$$ plain form
18307 785852 775303 655264 530117 528001 580392 545991 320416 356118 372100 201054 206829
18296 206829 516147 622642 480071 422385 213631 18900 -13847 -49075 30134 -23573
18286 -23573 -97924 173929 236166 209352 455439 273678 60475 -135968 -112215 -14699 246375
18275 246375 604002 744802 636098 685326 666333 436156 131681 131885 374119 419752 442693
18264 442693 387112 199759 143114 105555 121599 180998 140535 152421 173087 366541 368084
18253 368084 315093 278212 276760 179229 96055 230820 428539 506423 695842 622531 551617
18242 551617 434442 348049 187581 86479 140833 1726 -63583 -234300 -285377 -178686
18232 -178686 -258251 -255118 -74833 174396 531497 583551 328232 154008 69776 52607 142721
18221A42721J07989j03470m0478K3812n4589M7588M5838P9045l9427k587l0149
18210A76293k16369k22387J50127L8577K72259m6547j37075l9738J52409j5613
18200A11936o2526Q7016M517J1205n8741Q8817Q2133J8093R2458J7778o6219J28471
18188D54938M9052q8402m438m3717J09100m9943J22697j9057M0206m1504r9411
18177D29521j44328q06j22215P2535J36100L0361j371p5860J60240P3407k29192
18166C28392p0677K38285J15715N0998J53162O8904r5030l84945J4360J89582
18156F08746J76228p633L7892Q033N0587o394m8906O2870Q4145R5879J13625J13031
18144A288103K2217L8041j2404Q394q1157P5284K76296O5777P7150Q6902K07811
$$ plain form
18221 142721 250710 147240 106762 130574 75985 123573 169411 248456 209029 206442 176293
18210 176293 -40076 -262463 -112336 -73759 198500 151953 14878 -24860 127549 111936
18200 111936 49410 136426 140943 152148 93407 182224 264357 282450 374908 392686 326467 454938
18188 454938 503990 415588 411150 367433 476533 426590 549287 530230 570436 528932 429521
18177 429521 285193 284387 162172 234707 370807 401168 399797 323937 484177 557584 328392
18166 328392 257715 496000 611715 662713 815875 884779 789749 404804 419164 608746
18156 608746 784974 777341 815233 823266 873853 867459 818553 881423 965568 1061447 1175072 1288103
18144 1288103 1310320 1348361 1335957 1344351 1263194 1338478 1614774 1680551 1757701 1844603 2052414
18133B052414M4557L00427L92121L12245M25413N81585M58340N17067N37459P00980
18123F322608J003496J325516J368972J748847K366163L190868M295911N482350
18115B7104731P742738J1329910J5779912K3911778L7629421O0523150R4123915
18108B78145555R0377898O135050p1835029r9582783p6856840m4370311k4659997
18101E7353543j4889853r836430o547100m724173l588883k653027k121082j848262
18093A1144733j345478j056566j017136q83758o85691o63615p73632n31469k04874
18084C982514k33059k35817j43036n30993l73602P7547k34615j43990r7740k42449
18074A824760l14369P5337L668j58128j75681M4828o6331j37236O3440j91319
$$ plain form
18133 2052414 2096971 2397398 2789519 3101764 3527177 4108762 4567102 5084169 5621628 6322608
18123 6322608 7326104 8651620 10020592 11769439 14135602 17326470 21622381 27104731
18115 27104731 34847469 46177379 61957291 85869069 123498490 184021640 278145555
18108 278145555 368523453 374658503 302823474 203240691 126383851 82013540 57353543
18101 57353543 42463690 32627260 26080160 21355987 17767104 15114077 12992995 11144733
18093 11144733 9799255 8742689 7725553 6841795 6156104 5492489 4718857 4187388 3982514
18084 3982514 3749455 3513638 3370602 2839609 2466007 2543554 2308939 2164949 2067209 1824760
18074 1824760 1510391 1585728 1589396 1431268 1255587 1300415 1234084 1096848 1160288 968969
18064I68969R95J6403j18456j0355o3040l8299m9410K5389n8706j15299R0283
18053F48474K08738k6799j8823n1225q9685k24457j48207p4858K9933R771l8459
18042B24403N1338j1646j17915P2377O5738j02922j8360P8356p7541n6092o6195
18031D1541K6292J90592j04587p0283J6438p0363M1132n5064J44727J28800j9848
18020B69377K04988L1152o0900j40612j56574m2859R1273P443j68604M542J40791
18009A80017j38828o7004O6343K18286K4062N578k76645j19949J16113P0060J08400
17998A86433R1316R5324j82282r6153k0069J43844J32525J9736p0381j52850n3360
17987I4083k67863q1617Q472k0747j2728J97360M05233m8763r2856j83092j7384
$$ plain form
18064 968969 969964 986367 867911 857556 794516 756217 706807 732196 673490 558191 648474
18053 648474 857212 830413 811590 760365 670680 446223 298016 223158 253091 262862 224403
18042 224403 275741 264095 146180 218557 284295 181373 163013 241369 163828 107736 41541
18031 41541 67833 258425 153838 83555 99993 29630 70762 15698 160425 289225 269377
18020 269377 474365 505517 444617 304005 147431 104572 195845 203288 34684 39226 180017
18009 180017 41189 -25815 40528 258814 282876 288454 11809 -108140 7973 78033 186433
17998 186433 277749 373073 190791 94638 74569 218413 350938 370674 300293 147443 94083
17987 94083 -173780 -255397 -246925 -267672 -280400 -83040 322193 273430 180574 -2518 -19902
17976a9902P4313J79225J38914j2237j19807k09374j27970J14360m6030n0478
17966g8986j35455P7122K0401J3971P2918J02266q1798j14008M8190N0416N2798
17955B7835J38241n4891j33017N1502P5477J38492q2554j19016P0646r6620n3288
17944c7193n0098K538o5006J71555K03370j5278R3450j47992j76495p312j82758
17933b11219R4049l7856M3430k5953J34098j53810k97023J26376J69924p193j34136
17922b99313N8315N3795Q8364k8727O2989j33002j55060O572J98344J63645q7550
17911g1628j96376m912o1119J52624J14644J3599Q8633j29166K2504N9929n3117
17900f4385k15676j06755L2302n040J29775J71524J10634P9435o8304J01612J03286
$$ plain form
17976 -19902 54411 233636 372550 360313 240506 31132 -96838 17522 -28508 -78986
17966 -78986 -214441 -137319 -116918 -102947 -30029 72237 -9561 -123569 -75379 -24963 27835
17955 27835 166076 111185 -21832 29670 105147 243639 161085 42069 112715 16095 -37193
17944 -37193 -87291 -84753 -149759 21796 225166 209888 303338 155346 -21149 -28461 -211219
17933 -211219 -117170 -155026 -111596 -137549 -3451 -157261 -454284 -327908 -157984 -165177 -299313
17922 -299313 -240998 -187203 -98839 -127566 -64577 -197579 -352639 -346067 -147723 15922 -71628
17911 -71628 -268004 -272916 -334035 -181411 -66767 -53168 35465 -93701 -71197 -11268 -64385
17900 -64385 -280061 -386816 -354514 -359554 -229779 -58255 52379 131814 63510 165122 268408
17889B68408J06323q7755J15218K6389K4507R0102j65597J8021j5521j2925K8287
17878C95457l555m2693k0835q5076k6536L68321J309l80087j79194L9790m2483
17867B4418M1423j61053p345R506O7783O9352j05529P8548J6657j90920l6384
17856a93544K6545J67102P8949Q3701n1313N2762p548N355J30793r9242j42258
17845E1302p6550o8551N7099o3706n8844M1536L9254n0630K37692J45878l79642
17834a25162k73261L0939K46438M0467o2991J4161M1883O9297n9206q2621k6983
17823a87039J0597L3513J37287m4902n1620k8369M3511M57511J17631l7374J310
17812D52056j87142n0557q8818M9236l4059l15093J06745J50423J17539m9746
$$ plain form
17889 268408 374731 286976 402194 428583 453090 543192 377595 395616 380095 367170 395457
17878 395457 391902 349209 328374 243298 216762 585083 586392 206305 27111 66901 24418
17867 24418 65841 -95212 -102557 -93051 -25268 44084 -61445 17103 33760 -157160 -193544
17856 -193544 -166999 103 79052 162753 111440 164202 156654 162009 292802 193560 51302
17845 51302 -25248 -93799 -36700 -100406 -159250 -117714 -78460 -129090 108602 254480 -125162
17834 -125162 -398423 -367484 -121046 -80579 -143570 -129409 -87526 -18229 -77435 -160056 -187039
17823 -187039 -176442 -142929 -5642 -50544 -102164 -130533 -87022 370489 488120 450746 452056
17812 452056 264914 214357 125539 174775 140716 -174377 -67632 82791 200330 150584
17802A50584k333P8922p4961k26394j69171J80106J04212M4789k01093k78121
17792c93460L308J75263J15239J20491m3308J273O1276K96620K43797r6072k21192
17781B63235j40472j70065j16042n1353P4056j07672k16886k2848L10049J6306
17771a61692J77956J49082j42505r9855j33492q5338l0706j6637J91826Q9256
17761f2105r0759l6371p8709l8943l3062o0417J48962Q459Q2439p049L5443K09566
17749G7454k8434j88922J08948p9280k57701J68738K11572R794j10258K18780
17739A30691J26265k63174k55209Q5480K2199m4908j5193J41160r0694L87327
17729B23944P1989l18479j03691j15652O226R0240K03415j6896P2306J7825o7701
$$ plain form
17802 150584 148251 227173 152212 -74182 -243353 -63247 40965 85754 -115339 -393460
17792 -393460 -390152 -214889 -99650 20841 -22467 -21194 40082 336702 580499 484427 263235
17781 263235 122763 -47302 -163344 -214697 -140641 -248313 -465199 -488047 -177998 -161692
17771 -161692 16264 165346 22841 -77014 -210506 -295844 -326550 -343187 -151361 -62105
17761 -62105 -152864 -189235 -267944 -306887 -339949 -400366 -251404 -242945 -160506 -167555 -132112 77454
17749 77454 49020 -139902 -30954 -110234 -367935 -199197 12375 22169 -88089 130691
17739 130691 256956 -6218 -261427 -175947 -153748 -198656 -213849 -72689 -163383 223944
17729 223944 295933 -22546 -126237 -241889 -235663 -145423 57992 41096 113402 131227 63526
17718F3526l6474L9267Q2636l6896j06728l0913k7235k4703k7961j4854l5509
17707a55844P247J07973P4697j35624j77537m7966J43891Q1120P5076J80100j5610
17696A37523j89066n7699L9454K5655n2847j81394k36542K40120K31301K04280
17686A60785O1827J0985l4772J2926N0112k05779r3244k14780P4517J88798J37035
17675A48410K0166p2734p2457P4430J9512k4919o2344O4034J57261l6999j87133
17664B7227n281p0102q1939M923R8606q2491l1169J9152J10580j65789J35862
17653d0421K07919P3606j03754j55801j20914J0655P9531O0561J46950N086O7624
17642B31042Q7430j35934l5898j80067m766j0803m9609j28096P3013n1674N3686
$$ plain form
17718 63526 27052 66319 148955 112059 5331 -25582 -52817 -77520 -105481 -120335 -155844
17707 -155844 -148597 -40624 34073 -101551 -279088 -327054 -183163 -102043 -26967 153133 137523
17696 137523 -51543 -109242 -69788 -44133 -96980 -278374 -514916 -274796 -43495 160785
17686 160785 222612 233597 198825 211751 261863 56084 -37160 -251940 -177423 11375 148410
17675 148410 168576 95842 23385 97815 117327 92408 30064 94098 251359 214360 27227
17664 27227 21946 -48156 -130095 -125172 -26566 -109057 -140226 -121074 -10494 -176283 -40421
17653 -40421 167498 241104 137350 -18451 -139365 -128710 -49179 11382 158332 163418 231042
17642 231042 318472 182538 146640 -33427 -38193 -48996 -98605 -226701 -153688 -205362 -151676
17631a51676J54785N8850N6442j1934j85044p3635L3671L8866J23793L4157O8945
17620A47220r445n3811k38996N8986J9924K27600J53065j58238l35750N8883N3682
17609g6880j6211l8424j2713K95625J23247j94242k76309j08306q2709P394J0676
17598c68852O8064J44665J75887L6526p1463P8389J41806o864r8278j72007p9287
17587a51414P4190j01312k2196k92018O3146J47390J57884O1246j40579j1791
17577b15454M3479L2176J26727m4197k14057J09709Q5482P6614J32542l3087k83890
17566a83956J02444j2259J89001p491j98924n1056J80093K2340j95364P5895J43201
17555F3924j62429p1785M1002K19908p4650m7435L3975j672J53920M9720k98470
$$ plain form
17631 -151676 3109 61959 118401 106467 -78577 -152212 -118541 -79675 44118 78275 147220
17620 147220 137775 83964 -155032 -96046 -76122 151478 304543 146305 -189445 -130562 -76880
17609 -76880 -93091 -131515 -144228 151397 274644 80402 -195907 -304213 -386922 -379528 -368852
17598 -368852 -300788 -156123 19764 56290 -15173 63216 205022 198158 99880 -72127 -151414
17587 -151414 -77224 -178536 -200732 -492750 -429604 -282214 -124330 -63084 -203663 -215454
17577 -215454 -171975 -139799 -13072 -57269 -271326 -161617 -76135 479 133021 99934 -183956
17566 -183956 -81512 -93771 95230 87739 -111185 -162241 17852 40192 -155172 -79277 63924
17555 63924 -98505 -170290 -129288 90620 15970 -31465 2510 838 154758 204478 -93992
17544i3992q6647p5316k68870k4400K54579J97552p8196R0710p925j09215k0579
17533b22299j4240J851O7139J19664M8830j1481L0291q1188j07059k15144Q1752
17522c01884N8975J58752l5396k47836J23795J21302O3006Q4025J15090p8052
17512F1777r8971p9523n8609j96330K14431K21382l3968R700k53271j93780Q7476
17501c19686J56068R8552q9867M31n805m5545k6036L8002n6337M564K41666M9244
17489D5251m7007P7081j34817Q1648O9791K6190J29095l4205l11661L4208r946
17478g4372J44558o3912k72807j56420K61490N9360r790J07959R284p5348l0722
17467a00720p466P3268R3317K6280J1255k4000Q3170o1316M0600k8224j36117
$$ plain form
17544 -93992 -180639 -255955 -524825 -549225 -294646 -97094 -175290 -84580 -92505 -201720 -222299
17533 -222299 -236539 -234688 -167549 -47885 945 -10536 19755 -61433 -168492 -383636 -301884
17522 -301884 -242909 -84157 -119553 -367389 -243594 -122292 -59286 24739 139829 61777
17512 61777 -37194 -116717 -175326 -371656 -157225 64157 30189 39889 -213382 -407162 -319686
17501 -319686 -163618 -65066 -154933 -154502 -160307 -205852 -231888 -193886 -250223 -245659 -3993 45251
17489 45251 -1756 75325 -59492 22156 91947 118137 247232 213027 -98634 -64426 -74372
17478 -74372 70186 6274 -266533 -422953 -161463 -102103 -111893 -3934 5350 -69998 -100720
17467 -100720 -108186 -34918 58399 84679 95934 71934 155104 93788 134388 106164 -29953
17456b9953k1346n36O6074N1539k0240o379K54893K02905k10567l5124J15143
17445C66409K41326K62236M84558O55265Q8676n54652n37850k98603k47026j50766
17435C09573k60234J14481J20927P5125k5696j06212o3059j89105j0500J42319
17425A07619j56915k02878L4093K62085Q2096k21025j8809R1552m1516q5744l0
17414a49472J07405M4789k43606J06588J22972O3256K09314Q7238r6525j082j94245
17403E6632k20781j51799n2863O4887m1584L64794J76277J03082j50112p8110
17393G0423n7401j99653q7738J15409J2227q7658j45802J08829Q9114j11055J8583
17382b74722L15497J57520l2495k1824J943N2649m5722o3590r1481J4469o9683
$$ plain form
17456 -29953 -51299 -51835 14239 65778 45538 39159 294052 496957 286390 251266 366409
17445 366409 607735 869971 1354529 2009794 2098470 1543818 1005968 707365 460339 309573
17435 309573 49339 163820 284747 359872 334176 227964 164905 -24200 -34700 107619
17425 107619 -49296 -252174 -218081 44004 126100 -94925 -113734 -22182 -63698 -149442 -149472
17414 -149472 -42067 2722 -240884 -134296 -11324 51932 261246 348484 251959 250877 56632
17403 56632 -164149 -315948 -368811 -303924 -345508 19286 195563 298645 148533 70423
17393 70423 13022 -186631 -274369 -158960 -146733 -234391 -380193 -271364 -182250 -293305 -274722
17382 -274722 40775 198295 165800 143976 145919 198568 152846 89256 -2225 12244 -57439
17371e7439o1994j69769r2456J55512K47178K28731K0172k93848j70076J92146
17361a843J271m4613Q0305Q6290r079M0609M090k10400l19378O581K51382J7498
17349i7287Q3876q1592o836P068O3852J57034j45059o1772K25544Q4615j63004
17338F6439j27598q9102j17486L3550o2663J03935L25213J76649q2200r6765m0048
17327H9924k65810q5911m2399R9303M9567m8621K47989j47827j59422j664j10201
17316c75072L67901P3243K1463n3496j29104j46454N9616J35414J24464j23109
17306d5134m0883O5524O6412r886K7937j03963j38284J21394o072j70168o0148
17295b93271J74416N7008O0397n4159O3989j306j18917p827J1340K8374J14063
$$ plain form
17371 -57439 -119433 -289202 -381658 -226146 21032 249763 269935 -23913 -193989 -1843
17361 -1843 -572 -45185 35120 121410 112331 152940 157030 -53370 -372748 -366167 -114785 -97287
17349 -97287 -13411 -95003 -101839 -94771 -30919 126115 -18944 -80716 144828 229443 66439
17338 66439 -61159 -150261 -267747 -234197 -296860 -192925 132288 308937 226737 129972 89924
17327 89924 -175886 -261797 -304196 -204893 -155326 -203947 44042 -103785 -263207 -264871 -375072
17316 -375072 -7171 66072 87535 34039 -95065 -241519 -181903 -46489 77975 -45134
17306 -45134 -86017 -20493 45919 36033 63970 -39993 -178277 -56883 -62955 -233123 -293271
17295 -293271 -118855 -61847 -1450 -55609 8380 7074 -111843 -119670 -108330 -79956 34107
17284C4107O6756j18651J3105j42174o9687K09129J87284l3503j42027P8340J7023
17273I9702j21781k26480j27871m1074M0422M0247K68742K46437n9151j21594
17263b401k1303K5716j41804J9451K95112J47485j44041j41324N2946o9002M3164
17252F3999J66104k64055r7590K40239j40328p8315j8864m9822p2972L5914k2418
17241b38108k4555K6092J36346m3209n2816P300l8989o7901Q2939r0032m392J11115
17229a96210J12978R0614k33509q6372J6446p9576l1267L9733j0687Q3306J38519
17218a56025P1218k4236q9970l872l7749m5868K6602J85375N8152j38957M0228
17207a15102j6166q2010J470J66230m5254l6914j417n6976p7375l0667j09122
$$ plain form
17284 34107 100863 -17788 -4683 -146857 -216544 -7415 179869 146366 4339 82679 99702
17273 99702 -22079 -248559 -376430 -417504 -377082 -336835 -68093 178344 119193 -2401
17263 -2401 -23704 2012 -139792 -120341 174771 322256 178215 36891 89837 20835 63999
17252 63999 230103 -33952 -131542 108697 -31631 -109946 -128810 -178632 -251604 -215690 -238108
17241 -238108 -262663 -236571 -100225 -143434 -196250 -188950 -227939 -295840 -212901 -302933 -307325 -196210
17229 -196210 -83232 7382 -226127 -312499 -296053 -375629 -406896 -367163 -377850 -294544 -156025
17218 -156025 -84807 -109043 -199013 -202885 -240634 -286502 -259900 -74525 -16373 -155330 -115102
17207 -115102 -131268 -213278 -211808 -45578 -90832 -127746 -129163 -186139 -263514 -294181 -403303
17196d03303r834M3308J25585N0965N329q3204o9518k7226R8265J63834N4673
17185e1126n7464Q0301p072O6783k4194k77158k57015J11235L05182J13783p2870
17174f9615l660Q475J9640k05786p1527O1485K9465N1850N0573M812N9360k20817
17162b85745p9300q6855R0165K01470q2637j1186K32389J39863j04666j44448
17152a30950p1614o579Q2646R0937K9447l9711l6355j17547J28824Q3263n6774
17141d4413j6851j33896m9624J43331Q2315l4171j0636k4976L9124q8315p4182
17130b12294P5958O4444K03867J2082j97349j81869j27324M5712M6102M2590k6219
17119b54300Q1601J48822j2394j72869P8082R2112l5042p6592k5777K46609j14084
$$ plain form
17196 -403303 -413137 -369829 -244244 -193279 -187950 -271154 -340672 -367898 -269633 -105799 -51126
17185 -51126 -108590 -28289 -35361 31422 7228 -269930 -526945 -415710 -110528 3255 -69615
17174 -69615 -73275 -64800 -45160 -250946 -322473 -260988 -231523 -179673 -129100 -124288 -64928 -285745
17162 -285745 -365045 -451900 -361735 -160265 -242902 -254088 -21699 118164 13498 -130950
17152 -130950 -202564 -209143 -126497 -35560 -6113 -45824 -82179 -199726 -70902 12361 -44413
17141 -44413 -61264 -195160 -244784 -101453 -19138 -53309 -63945 -88921 -49797 -138112 -212294
17130 -212294 -136336 -71892 131975 144057 -53292 -235161 -362485 -316773 -270671 -228081 -254300
17119 -254300 -172699 -23877 -36271 -209140 -131058 -38946 -73988 -150580 -176357 70252 -43832
17108d3832j13573J01784K4542j4869L229j22065j64775N0335o6062p8278J73933
17097b49631K22580R8987j10408j68826m5638k7836J60917J90741j41796l6746
17087a07656j43593J47849r0316N5448j2724O4544q1756m0340J07115p9505m3467
17076b24401j10219q3002K79948J03475j53704j09319J74557m4695R4847J06234
17066C3721Q7785n5045j84646j56845J8040N7433J31771K2069K5700j171K991
17055a8197k9474J36063k4051k20518j22250k11141R2032J17972J14995r9135
17045b63704n993J17269R4755j94640j62056m6226J63706K83619q2839j2028J6207
17034i1930k03635r4442J27360J26949K2797M787j49243p09k9205M0312j36439
$$ plain form
17108 -43832 -157405 -55621 -31079 -45948 -42719 -164784 -329559 -279224 -345286 -423564 -249631
17097 -249631 -27051 71936 -38472 -207298 -252936 -280772 -119855 70886 -70910 -107656
17087 -107656 -251249 -103400 -193716 -138268 -150992 -86448 -168204 -208544 -101429 -180934 -224401
17076 -224401 -334620 -417622 -137674 -34199 -187903 -297222 -122665 -167360 -72513 33721
17066 33721 121506 66461 -118185 -275030 -256990 -199557 -67786 -45717 -20017 -21188 -18197
17055 -18197 -47671 88392 64341 -156177 -278427 -489568 -397536 -279564 -164569 -263704
17045 -263704 -269697 -152428 -57673 -252313 -414369 -460595 -296889 -13270 -96109 -108137 -91930
17034 -91930 -295565 -390007 -262647 -135698 -112901 -108114 -257357 -258066 -287271 -246959 -383398
17023c83398K8674J53696J23919n4934n0064M2825K9834m0678p6009K8128Q0205
17012a17802L8755l8440O219r8249M0525O0810J36244J50393j92045J06157k82065
17001a89498p1258j44096J04613O1186J13271r840P8100j05564j64612P3835N0717
16990b03146l3951N8557k4284j94060j2354K08875L12144K49968j69704j29026
16980F3019M51N8811j11083p2633J89006J58923q070k5453j398Q5842j29938p9290
16968A28187J8310K0137j06039p0530k33551Q1600K08368j57703j61182M8878
16958b23525J32581J03293l01377q4357j23156l2240M770J36834L25310R833O5002
16947A2968J00187l2148o7203p6631j39260l9129j2518N9192J91088L03p4838
$$ plain form
17023 -383398 -354724 -201028 -77109 -132043 -182107 -139282 -109448 -150126 -226135 -198007 -117802
17012 -117802 -79047 -117487 -111268 -209517 -168992 -108182 28062 178455 -13590 92567 -189498
17001 -189498 -260756 -404852 -300239 -239053 -125782 -135622 -57522 -163086 -327698 -253863 -203146
16990 -203146 -237097 -178540 -202824 -396884 -409238 -200363 111781 361749 192045 63019
16980 63019 63470 122281 11198 -61435 127571 286494 278424 252971 251573 337415 207477 128187
16968 128187 146497 166634 60595 -9935 -243486 -161886 46482 -111221 -272403 -223525
16958 -223525 -90944 12349 -289028 -373385 -496541 -528781 -524011 -387177 -61867 -52034 12968
16947 12968 113155 81007 13804 -62827 -202087 -241216 -253734 -194542 -3454 -3151 -77989
16936g7989j34237j10665J74694j5113m6466Q9664J1634J98647J87265J459k4681
16925B54212k6484K9188r3956k69457j26955N1913q2194k9549K16841J10327J2750
16914D6636Q0052K7250l6074M1541K06032l8675l31315j29623J43157J06119j99
16903A14901m9118k58128j40181l1074J80923J03765K5220j69771R3620j05901
16893b35744j62749J51050J35221m9761j9427J10686k3227r7362L7354L8604K03777
16882H8422m0203k8578p2218l9288l8593P9413k3970L7323q8384O3585P7551k53381
16870b38321o4243J00152J65030p223o7146L26j09754k23215l5393J22644j8695
16859c75838Q2766L9013K9640P5538K5262r0851q28L8070j42759j2215J59285
$$ plain form
16936 -77989 -212226 -322891 -148197 -163310 -209776 -120112 -108478 90169 277434 278893 254212
16925 254212 227728 256916 162960 -106497 -233452 -181539 -263733 -293282 -76441 33886 46636
16914 46636 126688 153938 117864 159405 365437 326762 -4553 -134176 8981 115100 114901
16903 114901 65783 -192345 -332526 -363600 -182677 -78912 -53692 -223463 -129843 -235744
16893 -235744 -398493 -247443 -112222 -161983 -181410 -70724 -93951 -191313 -153959 -115355 88422
16882 88422 48219 19641 -52577 -91865 -130458 -51045 -75015 -37692 -126076 -62491 15060 -238321
16870 -238321 -302564 -202412 -37382 -44605 -111751 -111425 -221179 -444394 -479787 -357143 -375838
16859 -375838 -293072 -254059 -224419 -148881 -123619 -214470 -215298 -177228 -319987 -332202 -172917
16848a72917L65571p9203l22491r4227J49116P4559O6934N5481p4129j15511j38563
16837b85380q5147L5439J26341J05916j0645q0912p1881J11585J34576P2097M5309
16826I7298M7575N2607j98002P3724K27601j12463l60858j84141P3232K22283
16816f1144J36874n3779j15318k61196J20415K75401l1242m6405L248O5642K16645
16805B49141K0554p4954J34159r7847o7713r464j11719K7036k1069j67487k54426
16794c73789N4359J94393P5149K0275j75150M6228J2012R9746J5946j42296j734
16783a74861r461q4186P2m0865K69389o5905j49721k7436J3394P5443Q9774P5605
16771b8758p0249p832k10845j61274J14468K08018Q8562J64506P8230j55691m5902
$$ plain form
16848 -172917 192654 113451 -209040 -303267 -154151 -79592 -12658 42823 -31306 -146817 -285380
16837 -285380 -370527 -335088 -208747 -102831 -113476 -194388 -266269 -154684 -20108 51989 97298
16826 97298 144873 197480 -522 73202 300803 188340 -172518 -356659 -283427 -61144
16816 -61144 75730 21951 -93367 -354563 -234148 41253 10011 -36394 -33146 32496 249141
16805 249141 269695 194741 328900 231053 163340 153876 42157 69193 48124 -119363 -373789
16794 -373789 -319430 -125037 -49888 -29613 -204763 -158535 -146523 -46777 -30831 -173127 -174861
16783 -174861 -184322 -268508 -268436 -309301 -39912 -105817 -255538 -282974 -269580 -194137 -104363 -28758
16771 -28758 -99007 -106839 -317684 -478958 -364490 -156472 -67910 96596 174826 19135 -26767
16760b6767j26020k4308m041m5696J72818L4167j2290M8307k49898j28836J98877
16749a63687K96668R34j41692n0504k2412l6313N7738j63993j0198P0733k004
16738a64730k8538k4333n1061K0947j07633P6963J63085K18329R8545j35920j84335
16727a18681n4679m8144J52293J98875K4265j33559j89789p2830R7569O8098K07114
16716A30532J1848M0424N3657k31389p6323k05422l9675L7609J82233K10936J92626
16705C07056j02521k24044K0629K7588n7898k26675k55764J12266J45180j9316
16695b73499l7162Q6360j27286M2086J63158J72693J9343m6288j80758j17277
16685b98630J47399J83131J12568l6002j31214k5794j77034j40349J65012J14072
$$ plain form
16760 -26767 -152787 -177095 -181136 -226832 -54014 -19847 -32137 16170 -233728 -362564 -163687
16749 -163687 132981 133915 -7777 -58281 -80693 -117006 -59268 -223261 -233459 -162726 -164730
16738 -164730 -193268 -217601 -268662 -247715 -355348 -278385 -115300 103029 201574 65654 -118681
16727 -118681 -173360 -221504 -69211 129664 153929 20370 -169419 -242249 -144680 -76582 130532
16716 130532 142380 182804 236461 5072 -71251 -276673 -316348 -278739 -96506 114430 307056
16705 307056 204535 -19509 1120 28708 -29190 -255865 -511629 -399363 -254183 -273499
16695 -273499 -310661 -224301 -351587 -309501 -146343 26350 45693 -595 -181353 -298630
16685 -298630 -151231 31900 144468 108466 -22748 -48542 -225576 -365925 -200913 -86841
16675h6841k49M1369j2413N2803r6658K44262J07464k1966J4101r128k29090k21351
16663b17697N4924K27288O2212m1018L8887k1601j44240j72376k34969K9323K97374
16652a21893J07195P0392R7294l2261j26345n8812P4098j35544R1675P652q9960
16641a16509K21614j93380L363O8883j51225j8375L0673J41875J03910K3102j6038
16630I7893n7576J4258J75838k2605q5163J75448N3984N081K23913l09285l38768
16619f6982J88807J98602k28974j0189l3414m8702M8502K2325J0724j01043R8594
16608G8250K03073J34396j17726j1815j13441k5820j5309J39527m8327k72271
16598d9463J21220l9132j65856m1944J18133J43740j30787r5519J496j61645N660
$$ plain form
16675 -86841 -87090 -45721 -58134 -5331 -101989 142273 249737 227771 241872 232744 3654 -217697
16663 -217697 -162773 64515 126727 85709 124596 102995 -41245 -213621 -448590 -419267 -121893
16652 -121893 -14698 55694 152988 120727 -5618 -64430 9668 -125876 -34201 -26549 -116509
16641 -116509 105105 -88275 -84912 -16029 -167254 -185629 -154956 -13081 90829 113931 97893
16630 97893 40317 54575 230413 207808 122645 298093 352077 357158 581071 271786 -66982
16619 -66982 121825 320427 91453 81264 47850 -852 47650 69975 80699 -20344 78250
16608 78250 281323 415719 297993 286178 172737 146917 131608 271135 222808 -49463
16598 -49463 71757 32625 -133231 -175175 -57042 86698 -44089 -139608 -138112 -299757 -294097
16587b94097P6894O8740j19045o9104J34963j77086L0362j17094m1569J15095
16577c91941K28282L10865m064j23812r7602N3108m5210j23603R2944o454r3384
16566b00871k6294R4850P1867j9981q6026J00125k35208p7652J07004J23178l4684
16555a83692q4648J11957l5707O8990K12817j13969j43657j25282Q4465l6724
16545b45450n5414J02078l7446N7936l1930J59805O8902Q016n5745k34431L7214
16534b26465J05066o098K16975J29397k50129r5339R1063R4594j48792j1332J24620
16523B3560o5112M6259J12417m7912p3156O6146K9420j01210j43544j03176O4051
16512a92257K21517k4607l500J16714k9330o7183q458L8190q6514n2293N8299
$$ plain form
16587 -294097 -217203 -148463 -267508 -336612 -201649 -378735 -348373 -465467 -507036 -391941
16577 -391941 -163659 147206 143142 19330 -78272 -25164 -70374 -193977 -101033 -107487 -200871
16566 -200871 -227165 -132315 -60448 -80429 -166455 -66330 -301538 -379190 -272186 -149008 -183692
16555 -183692 -268340 -156383 -192090 -123100 89717 -24252 -167909 -293191 -208726 -245450
16545 -245450 -300864 -198786 -236232 -178296 -210226 -50421 18481 26497 -29248 -263679 -226465
16534 -226465 -121399 -127497 89478 218875 -31254 -126593 -35530 59064 -89728 -101060 23560
16523 23560 -41552 4707 117124 69212 -3944 62202 91622 -9588 -153132 -256308 -192257
16512 -192257 29260 4653 1153 117867 88537 21354 12896 51086 -35428 -87721 -29422
16501b9422j41352N9552K22347j71826r8970l5240j82066P10J38118q1002J83992
16490a35159m5301N1582N4892K01606J06280k02277P9057j789q0929M6575J06326
16479A80863N563r3843j31653L3392J06975J42213k92716j95580J38814J9162
16469h6810J20093K6395j88890j92903J31585o2304j19725J94007J30248j34660
16459a82964k84832P6577J11792K72407J1769j83835j08477J0835M6596j4627
16449b44759o0428J29182J49678n4706K0444M1156n495R2486K62320o0606J5397
16438B84669k2523r3177k42068p0533j70430J09890J46942l3687j16929j8400
16428b26246R6830J34765j20639M2897J37216J7965J80302J17748j7313J4552
$$ plain form
16501 -29422 -170774 -111222 111125 -60701 -159671 -194911 -376977 -376267 -238149 -319151 -135159
16490 -135159 -180460 -128878 -73986 127620 233900 31623 110680 108891 27962 74537 180863
16479 180863 186426 92583 -39070 -5678 101297 243510 -49206 -244786 -105972 -86810
16469 -86810 33283 59678 -129212 -322115 -190530 -252834 -372559 -178552 -48304 -182964
16459 -182964 -467796 -391219 -279427 -7020 4749 -179086 -287563 -276728 -230132 -244759
16449 -244759 -305187 -176005 -26327 -81033 -60589 -19433 -24928 67558 329878 269272 284669
16438 284669 262146 168969 -73099 -143632 -314062 -204172 -57230 -90917 -207846 -226246
16428 -226246 -129416 5349 -115290 -72393 64823 82788 263090 380838 363525 378077
16418C78077M3671l28289o5690j1814o6743o6638k58081m2988K57982Q1164k0347
16407i9696O2655P2542k3711j52757j66113J04899J68495j7629j41248q7383J11232
16396a68714K40608J64664j83938m4210r6900K5875Q5521j3231q774l19864L0956
16385b88007J72446o1290Q04k7083n3004J36640K33958J25265j25379j18558k7960
16374c2168o8458j94094j28626P4182J55709L973J4875p1279J9441K08258J20903
16363A02716L4768j45771q7098l2868r8473k8551P7442j8731M0428K17880J3542
16352G5284r5083q0670P1807Q8405k9555j50734j06046K0682J3143O6252l6463
16341a62978J42843K02951n1245j7624k07084k16217Q8373J2700j11504J64139
$$ plain form
16418 378077 421748 93459 27769 15955 -50788 -117426 -375507 -418495 -160513 -79349 -99696
16407 -99696 -37041 35501 11790 -140967 -307080 -202181 -33686 -51315 -192563 -279946 -168714
16396 -168714 71894 236558 52620 8410 -88490 -62615 22906 9675 901 -318963 -288007
16385 -288007 -115561 -176851 -176047 -203130 -256134 -119494 114464 239729 114350 -4208 -32168
16374 -32168 -100626 -294720 -423346 -349164 -193455 -189482 -174607 -245886 -226445 -18187 102716
16363 102716 137484 -8287 -95385 -128253 -226726 -255277 -177835 -196566 -156138 61742 75284
16352 75284 -19799 -100469 -28662 59743 30188 -120546 -226592 -205910 -192767 -126515 -162978
16341 -162978 -20135 182816 131571 113947 -93137 -309354 -220981 -208281 -319785 -155646
16331a55646P494M023k1612m1463r1785K2356L0818P8578J71992N8935k7918j3502
16319B2270K51045Q7014P3829j15163j02469j49341j15843K1348N3304k4144J9276
16308B1126K7601K2134j03812N4711J09129L7789q3976n7985j70419k68063K5674
16297c86091M2960J16410J29789O6613j10277J37503J68484R9445p0201j43322
16287E1313j12957j11532o9110R8631J02559J24940Q2245P8410m8543l5864k9173
16276A30919j23110j22315J30508L4695j34717l35174o2499K62723L26461L06130
16266D13621n2618k51869k5469O8081P621p092j2709Q7489R6638j77884j96968
16255e1159l4938J0764p3832j6573R3699M2273q3168o9825J57741J40682O7939
$$ plain form
16331 -155646 -148152 -144129 -165741 -207204 -298989 -276633 -245815 -167237 4755 63690 35772 22270
16319 22270 273315 360329 434158 318995 216526 67185 -48658 -27310 25994 1850 21126
16308 21126 48727 70861 -32951 21760 130889 168678 84702 26717 -143702 -411765 -386091
16297 -386091 -343131 -226721 -96932 -30319 -140596 -3093 165391 264836 194635 51313
16287 51313 -61644 -173176 -242286 -143655 -41096 83844 166089 244499 195956 160092 130919
16276 130919 7809 -114506 16002 50697 -84020 -419194 -481693 -218970 107491 413621
16266 413621 361003 109134 83665 151746 159367 152275 139566 227055 323693 145809 -51159
16255 -51159 -86097 -75333 -149165 -165738 -72039 -29766 -112934 -182759 -25018 115664 183603
16244A83603m1211n5094Q5642L654l3344K6764j28674j908j54577j097J18715
16233B473K34629J4230j63115J52796N7706j88760q6335q5152p8470J55429J70142
16222A85573j5622m116r8124N882M0716o6153m3661J61495K1728j44154K03536
16211B47100m1617k59179o7595Q8021O153L1963K18442J0927j61862n7401j5235
16200b83k02432j98358P7389J49788O2649R9357J00503J21873J26959j67383n9817
16189A10245k6892K569j0119o4119R20J9617J09300M7166p2559j70542j62745
16178b17159j68202J05936J45319K3780j7207J05521N4164J50978J6301o3397
16168A36034j86388j9790o6153K25351J04372K3402l211p9736p1647K767m2434
$$ plain form
16244 183603 142392 87298 172940 176594 143250 170014 41340 39432 -115145 -116242 2473
16233 2473 237102 251332 88217 241013 298719 109959 23624 -61528 -139998 15431 185573
16222 185573 169951 165835 67711 73593 114309 48156 4495 165990 187718 43564 247100
16211 247100 205483 -53696 -121291 -33270 -27117 4846 223288 234215 72353 14952 -283
16200 -283 -202715 -401073 -323684 -173896 -111247 -11890 88613 210486 337445 170062 110245
16189 110245 83353 85922 75803 11684 12604 32221 141521 188687 116128 -54414 -217159
16178 -217159 -385361 -279425 -134106 -110326 -127533 -22012 32152 183130 199431 136034
16168 136034 -50354 -70144 -136297 89054 193426 216828 213617 133881 62234 65001 22567
16157B2567K44544J32964P3838k6229p1636K9974j00151q4089M2855n6145o0327
16146A48165q9553J0391q7837j46620l729M7577O1607l8103j12049O7710L1128
16135a11313O3832K22571N112N1453p6958o1363p2070k3562q792o6466k27384
16124c04940j78825k7169Q3468P6120J76483j19116l8278J10916J10886L5771
16114g4684P1727O4448j3732P5429o4200n4449N7009j1223J19906q9028r5181
16103a3978N4448P733j3188j04927r9163j22174j38589Q0837P545O9900K11257
16092f0299j970o6743J28022J41421q5056j37879M5910j0566k9666L2787K44025
16081A99986p224o4332l7173q4332j33967O762Q1234n1312k4483o6532J9003K299
$$ plain form
16157 22567 267111 400075 473913 447684 376048 406022 305871 221782 264637 208492 148165
16146 148165 58612 69003 -18834 -165454 -169183 -121606 -59999 -98102 -210151 -142441 -111313
16135 -111313 -47481 175090 180202 231655 154697 93334 21264 -2298 -11090 -77556 -304940
16124 -304940 -483765 -510934 -427466 -351346 -174863 -293979 -332257 -221341 -110455 -74684
16114 -74684 -2957 61491 47759 123188 58988 4539 61548 50325 170231 81203 -13978
16103 -13978 40470 48203 35015 -69912 -169075 -291249 -429838 -349001 -341456 -271556 -60299
16092 -60299 -62269 -129012 -990 140431 55375 -82504 -36594 -47160 -76826 -44039 199986
16081 199986 192762 128430 91257 6925 -127042 -120280 -39046 -90358 -114841 -181373 -162370 -160071
16069a60071m0263P4806J28803j34614o9420N1629O4330P6988J22583j18965k00053
16058b04247p0704j14558J02386Q2611O8695M9897m3240R4867m3544J08380q8392
16047e7849J0270O3644O2574r7848J34778k02696j38375K40264R0359k64405q2397
16036b41681J39977Q6528J05612q5261j71046L7406O9211l2248r7802J0581M3575
16025a35148J81410k9062k7646j38982J39657n631J9402l9356j83678L3009J45806
16014d0219N084p7225m0257J15590l1577J01004o4568k8691p137r4267j24374
16003b86637J45018J66758J02560L3342k38976k0750K08965J14725j63792k10056
15993a48843m0037M888n2616J02378J68773j1209j20083j27020P4441J53503k2617
$$ plain form
16069 -160071 -200334 -125528 3275 -131339 -200759 -149130 -84800 -7812 114771 -4194 -204247
16058 -204247 -274951 -389509 -287123 -204512 -135817 -85920 -129160 -34293 -77837 30543 -57849
16047 -57849 -47579 16065 78639 -19209 115569 -87127 -225502 14762 105121 -159284 -241681
16036 -241681 -101704 -15176 90436 5175 -165871 -128465 -59254 -91502 -189304 -178723 -135148
16025 -135148 46262 17200 -10446 -149428 -9771 -15402 4000 -35356 -219034 -186025 -40219
16014 -40219 -35135 -112360 -152617 -37027 -68604 32400 -32168 -60859 -67996 -162263 -286637
16003 -286637 -141619 25139 127699 161041 -77935 -98685 110280 225005 61213 -148843
15993 -148843 -188880 -183992 -236608 -134230 34543 23334 -96749 -223769 -149328 4175 -18442
15982a8442q3841k847L4994M6372j4924q8786J76302k697O8483J01667l7477q9008
15970H9796k52470o6339q3420O2013J97272J48835n8172J70701o3984k11j8490
15959A25531j30028l9710J75661p4821j94332j1626j75680m6700O9047J65227
15949a37431Q4863J03129o7214n6797p3427j2198n8742K0947n2579R6154K72238
15938A18943K07619J10452l03276j8189J50572p6585j87587j31651L157J2058
15928a14487j35990k2560k4838j0900N5143K26537N6011j99561l7674K73264k6785
15917C8160j44905M5092Q0038L8334j86566m05646r3020M22038n418j06623Q5742
15906b32774k6418q4129J48800M5465J75275N0679j06985k00748k40884q3196
$$ plain form
15982 -18442 -102283 -105130 -70136 -23764 -38688 -127474 48828 46131 114614 216281 178804 89796
15970 89796 -162674 -229013 -312433 -250420 -53148 95687 37515 208216 144232 144021 125531
15959 125531 -4497 -44207 131454 56633 -137699 -149325 -325005 -371705 -302658 -137431
15949 -137431 -52568 50561 -16653 -73450 -146877 -159075 -217817 -196870 -249449 -153295 118943
15938 118943 326562 437014 133738 115549 266121 189536 1949 -129702 -126545 -114487
15928 -114487 -250477 -273037 -297875 -308775 -253632 -27095 28916 -170645 -208319 64945 38160
15917 38160 -106745 -61653 18385 56719 -129847 -535493 -628513 -206475 -211893 -318516 -232774
15906 -232774 -259192 -343321 -194521 -149056 26219 76898 -30087 -230835 -471719 -554915
15896e54915m943M2094N202N9221K02728J51639J50397O0441K5220k86915K8377
15885a21454R8124j17187k9569Q8819J92388l883R7224N7649r6526j38524P9959
15874A07020N3068j38131j0692Q6581N940j07376l0737n7064r6804l53R372K2543
15862a56633J28104n21j37485r9J71239N3692R235J91420Q534j71723q3679q8624
15850g6540j8427J44631P9771M5235j2373m5654l5487J07291l7392j90920j73392
15839b13257k7221K37218P4824j0164o6384j3612M5798M5731O2080l5150k74326
15828a74463k2951J86535J40372J63635J2033k06278j01233J84453p1447l29166
15818b18510n7208J65497o0130q6132O4277O1319j16672Q1717J43090q688r163
$$ plain form
15896 -554915 -559858 -517764 -512562 -453341 -250613 -98974 51423 111864 137084 -149831 -121454
15885 -121454 -23330 -140517 -170086 -81267 111121 107238 204462 262111 165585 27061 107020
15874 107020 160088 21957 11265 97846 103786 -3590 -34327 -91391 -188195 -188548 -179176 -156633
15862 -156633 -28529 -29050 -166535 -166634 4605 58297 67532 258952 267486 95763 12084 -76540
15850 -76540 -94967 49664 129435 174670 162297 116643 81156 188447 151055 -39865 -213257
15839 -213257 -240478 -3260 71564 61400 -4984 -18596 27202 72933 135013 99863 -174463
15828 -174463 -197414 -10879 129493 293128 305161 98883 -2350 182103 110656 -218510
15818 -218510 -275718 -110221 -170351 -256483 -192206 -130887 -247559 -165842 -22752 -31440 -40603
15807d0603L0405O5398R8884r5638j26608j93997k44192J8397J59220J4145P9138
15796b35451n4211J08174K02808j81510k66651n3916M0608J95454J5009J30627
15786i9059Q0290N3420q0107N4091R3642r7076n2187j74014l1222L8477K16784
15775C039j0270o9849m6207l47960l6659L03859K48608n1550q0007m9998n0442
15764a87436Q7257P4433K5944J82011K06967o9j17416j40983k26960O7315J54188
15753A25251O2707J60170m2851k36359j09544O5295j55273J4045J9408L1242n9551
15742a25460j61027k52455P2993r090k7679J44489J25199q2187j9125j02902N5238
15731c82006J1251j85534k4644K44619N4814R0361n0972k7633m5143j9150P1886
$$ plain form
15807 -40603 -10198 55200 154084 58446 -68162 -262159 -506351 -487954 -328734 -314589 -235451
15796 -235451 -289662 -181488 21320 -160190 -426841 -480757 -440149 -244695 -229686 -99059
15786 -99059 -18769 34651 -45456 8635 102277 5201 -46986 -221000 -252222 -213745 3039
15775 3039 -7231 -77080 -123287 -471247 -507906 -204047 44561 -6989 -86996 -136994 -187436
15764 -187436 -100179 -25746 198 182209 389176 389107 271691 130708 -96252 -28937 125251
15753 125251 187958 348128 305277 68918 -40626 24669 -130604 -116559 -97151 -65909 -125460
15742 -125460 -286487 -538942 -465949 -475039 -502718 -358229 -233030 -315217 -334342 -437244 -382006
15731 -382006 -370755 -556289 -580933 -336314 -281500 -191139 -242111 -269744 -314887 -334037 -262151
15720b62151L5171n9483J17471j1934j76396l4139L02351R7605k20955n5592J61338
15709a06714J3781O0598r8429j08057l2518R0416J0253J09678N9459O0435q2044
15698b3142q4008j48683p6369K19131J64424L8049o7112j71529k61086k0086R4379
15687c36032k7643J08100J94092J20656j4722j82459N2403r8549k54696Q3035
15677c55815L25758J31997l1494J70845n7896k20124M296j3104k551k8773j5871
15666i2732l1208P7466O5190j75214j21228J39383J7855N272m4515j64606n4534
15655c78871r2227P6512j2038J35843K58972J95853j14236l49791j2114P7672
15645b14425R6517n4659K876m2509J10622p6323j0236p2504P3806L0959J21635
$$ plain form
15720 -262151 -226980 -286463 -168992 -180926 -357322 -391461 -89110 8495 -212460 -268052 -106714
15709 -106714 -92933 -32335 -130764 -238821 -271339 -180923 -170670 -60992 -1533 58902 -23142
15698 -23142 -107150 -255833 -332202 -113071 51353 89402 22290 -149239 -410325 -430411 -336032
15687 -336032 -363675 -255575 -61483 59173 44451 -138008 -85605 -184154 -438850 -355815
15677 -355815 -30057 101940 70446 241291 183395 -36729 -32433 -45537 -48088 -76861 -92732
15666 -92732 -123940 -46474 18716 -156498 -277726 -138343 -120488 -115216 -159731 -324337 -378871
15655 -378871 -471098 -394586 -406624 -270781 -11809 184044 69808 -279983 -292097 -214425
15645 -214425 -117908 -172567 -169691 -212200 -101578 -177901 -188137 -260641 -186835 -155876 -34241
15634c4241k18276o0263j03645L4613j03109K08190M8703K9170j07962J46242
15624a60578K8714N028J06895k14067r9652J22495O0491l7496j07972K03903P2172
15613b0067j13815k8684n6823J18353R9648J34489K37013Q2179k99327k2799m1840
15602H8327l3532K4492J34969j47765j75063Q9330J2734q9953J91491j6266m4040
15591C4724j2856k8517l7079J55314k9925j70688k3202J41516L5524l7298n8498
15580c0985P0285k9625j07495L5733J21927M1535j48172J03552K42983k41150
15570E8588j49906o3570n2439j39064J04559j5396J38820J52257J10781o5680
15560G8950p5910k6606j23474k26709l1088P6677N8334J36924P4346M465O0374
$$ plain form
15634 -34241 -252517 -312780 -416425 -381812 -484921 -276731 -228028 -198858 -306820 -160578
15624 -160578 -131864 -126836 -19941 -234008 -333660 -211165 -150674 -188170 -296142 -92239 -20067
15613 -20067 -133882 -162566 -219389 -101036 -1388 133101 370114 452293 152966 130167 88327
15602 88327 54795 79287 214256 66491 -108572 -19242 -6508 -96461 95030 78764 34724
15591 34724 21868 -6649 -43728 111586 81661 -89027 -112229 29287 64811 27513 -30985
15580 -30985 39300 9675 -97820 -62087 59840 101375 -46797 56755 299738 58588
15570 58588 -91318 -154888 -207327 -346391 -241832 -257228 -118408 33849 144630 78950
15560 78950 3040 -23566 -147040 -373749 -404837 -328160 -269826 -132902 -58556 -54091 6283
15549F283J7623j6067j89696l1356K57088j21986j09308J25640M3997j32375K5548
15538a24609N4312o4725J28258K14426M8215R6683p002j30211j30595J39885l7764
15527A86873k149r7633K599K4404N8249k4581m1144j20468Q6779q1314m550K7626
15515A4691n6730o7327R9411O5857o7762k6301n2029m2234M3804J23004J06519
15504A40903q1394j29859j48344N7101O473k1376j3532o6858r0053J22857J3085
15493b10997r4096j02219J62220P4289L3000K0491K49424J81810j22967j54393
15483C6562j25783L3910K49454J3977N5410j87051M4917p9415j23029j3861j2177
15472a07086J31393l7624j58846J41008L4637J0789k2919j12612L3382J69289
$$ plain form
15549 6283 23906 7839 -181857 -213213 43875 -78111 -187419 -61779 -17782 -150157 -124609
15538 -124609 -70297 -135022 -6764 207662 255877 352560 345558 215347 84752 224637 186873
15527 186873 184724 87091 89690 114094 172343 147762 106618 -13850 72929 -8385 -12935 14691
15515 14691 -42039 -109366 -9955 55902 -11860 -38161 -90190 -132424 -88620 34384 140903
15504 140903 59509 -70350 -218694 -161593 -155120 -176496 -190028 -256886 -346939 -224082 -210997
15493 -210997 -305093 -407312 -245092 -170803 -137803 -117312 132112 313922 190955 36562
15483 36562 -89221 -55311 194143 208120 263530 76479 121396 41981 -81048 -94909 -107086
15472 -107086 24307 -13317 -172163 -31155 3482 14271 -8648 -121260 -87878 81411
15462H1411O104k08208n7389K56571K74774n8585j35240L0935Q703J63648k02253
15451A60471j73908K05J7095M1252N2432j5031j38484k14478P9402N719J16162
15440f9163K66061O9000j2913K1543p3504r2146k1201j88605M0271K03386j90883
15429d8154k45892p2248K13738J82844O295J45605l7889k26875J25054Q3466r8792
15418B7152m235O4477J98386j27749j11452J28671J60221p9833k44361q5107l0691
15407a04521p7539o3454j92504l6165J40216J17231J19994o151j48679p1137j4150
15396c36859j34907J24380K46918m9790j12016J67397K6944j71125p2277q9657
15386d00992j9443q8561k1675P7804K52051J46200J3478L2883q9030J6149j7197
$$ plain form
15462 81411 87515 -120693 -178082 78489 353263 294678 159438 190373 199076 362724 160471
15451 160471 -13437 -13232 3863 45115 97547 82516 -55968 -270446 -191044 -185325 -69163
15440 -69163 196898 265898 252985 274528 201024 108878 87677 -100928 -60657 142729 -48154
15429 -48154 -294046 -366294 -152556 30288 36583 182188 144299 -82576 42478 125944 27152
15418 27152 22917 87394 285780 158031 46579 175250 335471 255638 11277 -73830 -104521
15407 -104521 -182060 -245514 -438018 -474183 -333967 -216736 -96742 -102893 -251572 -322709 -336859
15396 -336859 -471766 -347386 -100468 -150258 -262274 -94877 -67933 -239058 -311335 -400992
15386 -400992 -420435 -508996 -530671 -452867 -200816 -54616 -41138 -8255 -97285 -81136 -98333
15375i8333J46406N556l4541Q3009j2224o0722p1890o3173N636K9769m4470k58375
15363c73352m1947O8550J54683M2760j71397J6804J81839K17063j5177j18925
15353c9099r613Q8188M132R0080J19948J5026N2806k18263J5408J19528N9567
15342B97708k00954K00729J23341n2463j44883k73158N6199M831J8420m024k5679
15331F7Q4455K638j77241L5145j4460Q3412P6347r9466q5481l20476Q5164L05753
15319b4143Q7560k6125L1821j08457j2296j22205L9153J26939k9762M8412Q662
15308A9559j27438k8528L9897N9145K9330N6369k32630j3346K20897k1396j91846
15297a89987j39967k6974J88065M0091L2363l4195J67406P1042k2366l6789j21116
$$ plain form
15375 -98333 48073 53629 19088 102097 89873 29151 -42739 -105912 -100276 -70507 -114977 -373352
15363 -373352 -415299 -346749 -192066 -149306 -320703 -303899 -122060 95003 79826 -39099
15353 -39099 -48712 39476 43608 133688 253636 268662 321468 103205 118613 238141 297708
15342 297708 96754 297483 420824 368361 223478 -49680 6519 11350 29770 25746 67
15331 67 84522 87160 -90081 -54936 -69396 14016 90363 -9103 -94584 -415060 -329896 -24143
15319 -24143 63417 37292 69113 -39344 -51640 -173845 -134692 -7753 -37515 10897 19559
15308 19559 -107879 -136407 -96510 -37365 -8035 48334 -184296 -197642 23255 1859 -189987
15297 -189987 -329954 -356928 -168863 -128772 -96409 -130604 36802 107844 85478 48689 -72427
15286g2427j77163j07657K49232K88410J26481N2991o1913p3102j87892p3125
15276c6165M0118p2383j60377O6216K38531L4522N2938n7689j68053J24281J11126
15265A73065j19070n9976M9175o0414N3825K16810j8878l36888k38589Q176J56270
15254a76494K15576J59028K36217r5975j52863j51901p6772R6446P6524J38592
15244B68378r6714j79648j7540M7237Q8394Q1695P0254O5280q8965R5251P6766
15233D10388k19041m7368j13541N6881J00078J44664L9592l3481N114k51495j53807
15222f2016O43m1159R9617q7096k2049M4107R735L4562J08101J87899J15123j30989
15210B56478n5845j68007q8834j31967j48638l2246J37794m6141q0050L1341j12071
$$ plain form
15286 -72427 -249590 -357247 -108015 180395 306876 359867 297954 224852 36960 -36165
15276 -36165 3953 -68430 -228807 -162591 75940 110462 163400 105711 -62342 61939 173065
15265 173065 53995 -5981 43194 -17220 36605 253415 234537 -102351 -340940 -332764 -176494
15254 -176494 39082 198110 434327 338352 185489 33588 -43184 53262 129786 268378
15244 268378 171664 -7984 -25524 21713 110107 191802 262056 327336 238371 333622 410388
15233 410388 191347 143979 30438 87319 187397 332061 371653 338172 343286 91791 -62016
15222 -62016 -61373 -102532 -2915 -90011 -112060 -67953 -58218 -23656 84445 272344 387467 256478
15210 256478 200633 32626 -56208 -188175 -336813 -369059 -231265 -277406 -357456 -326115 -438186
15199d38186K73640M1180k491m2294J9993j36687R2336Q3685M3913J69640L6064
15188A40793k44001l53301M090J89871j901J30535J27534j079J61685K82098n1998
15177C84326j6305o0759k68265k12330M9573K5179j1836K33112J00004l1865j86960
15166C874Q9564J31960O6715P0811r8415m0284J92285J7037m2513j11980k47989
15155C1065j73425M2411L4665j32780j46391Q7019q5397m4966J21878O5008K4707
15144a76206J68635J60104m028J5357M7347J00561j74715J87k31859n445J60234
15133F0172k2938J4938R3471J08973K31955R5946j53015l28816j67067p2582j64032
15122c02995J18982L03245j05059N0500j50227j35197J42631q3496j33356N700
$$ plain form
15199 -438186 -164546 -123366 -125857 -168151 -148158 -284845 -192509 -108824 -64911 104729 140793
15188 140793 -103208 -456509 -452419 -262548 -264449 -133914 -6380 -7459 154226 436324 384326
15177 384326 368021 307262 38997 -173333 -123760 -98581 -110417 122695 222699 190834 3874
15166 3874 93438 225398 292113 362924 264509 224225 416510 433547 391034 279054 31065
15155 31065 -142360 -99949 -65284 -198064 -344455 -257436 -342833 -387799 -265921 -200913 -176206
15144 -176206 -7571 152533 148505 163862 211209 311770 137055 137242 -94617 -100062 60172
15133 60172 37234 52172 145643 254616 486571 582517 429502 100686 -66381 -138963 -302995
15122 -302995 -184013 119232 14173 64673 -85554 -220751 -78120 -161616 -294972 -289272
15112b89272J27954J6543j41058p8973P8744J64288K42059J07924J40591M0931
15102D09731J13593R7298l14686j16613J61554J24825k51121o3229k73936k39213
15092c51797M9381J43151J09552K0337N7326J17351o6705J13128P9549r6957k57964
15081h3648r3549K74176o0178o9452M8089k2954J23609J39848J14620j18135k2431
15070B29995q0225k46924Q102m010N0385L289J22835J50205k5315k7372m6065
15059A34900J1154j08700J40027R7328j02258p2764O1020j15718l1965n0220M1256
15048D060K8354J00914q41k20153J03536K55773j22108l41354j04134K06472J15362
15037B5881O3659j17252r8170m7976K20452J61719P9476j80378j67265p1874j86842
$$ plain form
15112 -289272 -161318 -144775 -285833 -364806 -286062 -121774 120285 228209 368800 409731
15102 409731 523324 620622 305936 189323 350877 475702 224581 161352 -112584 -351797
15092 -351797 -302416 -159265 -49713 -29376 27950 145301 78596 191724 271273 174316 -83648
15081 -83648 -177197 96979 36801 -32651 15438 -7516 116093 255941 370561 252426 229995
15070 229995 149770 -97154 -89052 -93062 -42677 -39388 83447 233652 208337 180965 134900
15059 134900 146054 37354 177381 274709 172451 99687 160707 44989 13024 -37196 4060
15048 4060 32414 133328 132487 -87666 15870 271643 149535 -191819 -295953 -89481 25881
15037 25881 89540 -27712 -125882 -173858 46594 208313 287789 107411 -59854 -131728 -318570
15026c18570q1491N7398P3702O5517O7989j06588J04285L16565K731L3362j97462
15015A7438k48346r2712K2294L13929K32032Q9193j05472j34270j55629J26750
15005F5207j4232J38059M26201K77490K49571o5785l78616m59750j65333j8797
14995E4015r3236o4371J0872J80031o0851p8321r2181Q0126K4713o1931j15164
14984b16298n4167Q8299P3135p1744j7553M1896q8379k8038j25926J11947J67941
14973a18887K33751J7388o6095l30060j66652o1005K4K05502J12806j6508k18499
14962d08235K5864P4370j1783K11623K88841J27820j97722n4241K28406p2855
14952B12088J02954P4118j20323j68461m4360J4298P5556j76452J14343J90254
$$ plain form
15026 -318570 -400061 -342663 -268961 -203444 -135455 -242043 -137758 178807 181538 214900 17438
15015 17438 -230908 -323620 -301326 12603 244635 333828 228356 94086 -61543 65207
15005 65207 50975 189034 615235 892725 1142296 1076511 697895 238145 72812 54015
14995 54015 -39221 -103592 -92720 87311 26460 -51861 -144042 -63916 -39203 -101134 -216298
14984 -216298 -270465 -182166 -109031 -180775 -198328 -156432 -244811 -272849 -398775 -286828 -118887
14973 -118887 114864 132252 66157 -263903 -430555 -491560 -491536 -286034 -173228 -189736 -408235
14962 -408235 -382371 -308001 -319784 -108161 180680 308500 110778 56537 284943 212088
14952 212088 315042 389160 268837 100376 56016 70314 145870 -30582 83761 274015
14942B74015j29723O5766N0201n0736j69792l4556J05822j68765K6572o80K5715
14931f161j14631j05344K66508K63241k57703j99398M409k2978M3546N4376R3791
14920A9656R3576j31349k25313K25282J33991J56256n6579j39809j39516N4285
14910i520q2335p2300J16522p227k33569k04908J1420J06269J69873L39365J04962
14899B38552q1993p7642j32710O6786o0244J7338M1224K9993J9015o0081R639
14888I877k4909O5900p8678m5776j14929l8626K74890J25512r22J6701j80297
14877H743n285p0756l6711L5108R17r7273Q3350l3840j20587r6744K54757M4601
14865c3720r0610j49962q1156O1629N989J27442k9791J04425J43967j5525m5349
$$ plain form
14942 274015 144292 210058 260259 209523 39731 5175 110997 -57768 -31196 -31876 -6161
14931 -6161 -120792 -226136 40372 303613 45910 -153488 -149079 -172057 -128511 -74135 19656
14920 19656 113232 -18117 -243430 -18148 115843 272099 215520 75711 -63805 -9520
14910 -9520 -91855 -164155 -47633 -54860 -288429 -493337 -481917 -375648 -205775 133590 238552
14899 238552 156559 78917 -53793 12993 -47251 -29913 11311 41304 60319 238 9877
14888 9877 -15032 50868 -27810 -73586 -188515 -227141 47749 173261 172339 189040 8743
14877 8743 3458 -67298 -104009 -68901 -67984 -165257 -81907 -115747 -236334 -333078 -78321 -33720
14865 -33720 -124330 -274292 -355448 -293819 -287830 -160388 -190179 -85754 58213 42688 -2661
14854b661J04092k873l14038n9635l4216M8040P6260M5070J6849N3045j69841
14843b39908J71480Q5793j23246q4588j39661j5385J60411L03621J54601j14107
14833A59011j44237j98745j9992M4621O8842k1301J09941q6338l25684k52090
14823f65972J76640J90666J33282J02645J91162J50858k83179j7255P3529m7695
14813D681l4691n6273L6022R1079p8511J3736P4909l5788J14576J20822k40062
14802A0500j92432p5629J63239P2795N6236k24298q1259k3025j241r2316o5464
14791d52894N842L53809K02683q1510R0293l587k040K2966j5409j8613J01855
14780B03395m0101j17501k76447j83244K21500K65130n062l6393O6651J0888m1839
$$ plain form
14854 -2661 101431 98558 -215480 -275115 -309331 -261291 -185031 -139961 -123112 -70067 -239908
14843 -239908 -68428 17365 -105881 -190469 -330130 -345515 -185104 118517 273118 159011
14833 159011 14774 -183971 -203963 -159342 -90500 -111801 -1860 -88198 -413882 -665972
14823 -665972 -489332 -298666 -165384 -62739 128423 279281 -3898 -21153 52376 4681
14813 4681 -30010 -86283 -50261 40818 -37693 -23957 50952 15164 129740 250562 10500
14802 10500 -181932 -257561 -94322 -21527 34709 -189589 -270848 -293873 -295114 -387430 -452894
14791 -452894 -447052 -93243 109440 27930 118223 114636 112596 135562 120153 101540 203395
14780 203395 163294 45793 -230654 -413898 -192398 72732 67670 31277 97928 108816 66977
14769F6977j06857L0641J7473r7220Q6948j55621j89176O9545P4204N930l9527
14758b36683O3948J88415j2819j09815j8745K88235j21371m7379J31234q6492
14748C8528m5636j13970J04315p8803N8198j09102o4380k4438p6931J84702j9793
14737a47310j34637q0162Q2266J83630P3045Q9383j054o9011o335j8945L3958
14726D828J5990j63305q1993R7956j29391L3645K52790j69765j32972p6364J75318
14715a73263M1933P7926j40784n6943J32954Q0620j6451n0440K2491J12322N8833
14704H9198j01840o5706J06724j10245j59398K7528l3006j01908J10304P1696
14694a66653j12525K74653J1883o2838r509j25946n9329J6463J58689q0880P3342
$$ plain form
14769 66977 -39880 -9239 8234 -88986 -2038 -157659 -346835 -277290 -203086 -197156 -236683
14758 -236683 -172735 15680 2861 -106954 -125699 162536 41165 -6214 125020 38528
14748 38528 -7108 -121078 -16763 -95566 -37368 -146470 -210850 -235288 -312219 -127517 -147310
14737 -147310 -281947 -362109 -279843 -96213 -23168 66215 65161 -3850 -10185 -29130 4828
14726 4828 20818 -142487 -224480 -126524 -255915 -222270 30520 -139245 -272217 -348581 -173263
14715 -173263 -131330 -53404 -194188 -251131 -118177 -37557 -54008 -104448 -81957 30365 89198
14704 89198 -12642 -78348 28376 -81869 -241267 -213739 -246745 -348653 -238349 -166653
14694 -166653 -279178 -4525 7358 -55480 -64989 -190935 -250264 -233801 -75112 -155992 -82650
14683h2650J02401j07989Q8762N5774j5423k77274m7485M5096K6507L19226Q5544
14672A92489j03445o1005L5742n7877R4016p1260J0048o5635m2422K0270P7320
14661B8241j21557q7097M898R6911O0227o0111n2590J21670Q0682r143J0777R9527
14649A72435L3447j43972m5346q5401O297m1091M7331k9469Q1727j80298n5937
14638b40277J01304r5286M3035J57592J81970j34374j01759l4537r9958J86629
14628c5661J43108R4656j21420k54692q8838O2108m1245N4309J77880k4344O8236
14617C4097p1780l887J73633J12257j36709k03044k05639Q337J38505Q7554n3990
14606a20666q9299m8122K9312M0425J95338j11328p1601Q8760j30552k5857R8765
$$ plain form
14683 -82650 19751 -88238 524 56298 40875 -236399 -283884 -238788 -212281 106945 192489
14672 192489 89044 28039 63781 5904 99920 28660 38708 -26927 -69349 -49079 28241
14661 28241 -93316 -180413 -175515 -78604 -18377 -78488 -131078 -9408 71274 62131 72908 172435
14649 172435 205882 61910 16564 -68837 -62540 -103631 -56300 -85769 -4042 -184340 -240277
14638 -240277 -138973 -234259 -191224 -33632 148338 13964 -87795 -122332 -222290 -35661
14628 -35661 107447 202103 80683 -174009 -262847 -200739 -241984 -187675 -9795 -34139 34097
14617 34097 -37683 -41570 132063 244320 107611 -95433 -301072 -292735 -154230 -66676 -120666
14606 -120666 -209965 -258087 -228775 -188350 6988 -104340 -175941 -87181 -217733 -243590 -144825
14595a44825n5183J56598Q0941l458N3084o6073j30513N904J86565R1092N6917
14584B31049p838K11800p2368j47359m1063P6540J14945q5506j35039m4565k60682
14573a60086l6586r318j27507J17566J17384n91p11L49059L1759q7846m7953r7779
14561D7391R6673j09636m4885J8824J7782J06222l7672j63781r8342k5992K72573
14550G9157J41826k4804p0099N2402j9619o0322j8416j4963m9686j7328J35467
14539A33615n3230j09559m1874k9200K24529J58220J28567k7533k51529R335k1894
14528A19447q3566J66029N5798j47491j4420o64J38620J04652j70539j19792M8251
14517I6325j24709j16688j63829J21209J89229j57563R6319J0377P3216l4891
$$ plain form
14595 -144825 -200008 -43410 37531 34073 87157 21084 -109429 -103525 83040 174132 231049
14584 231049 223211 435011 362643 215284 174221 250761 365706 280200 145161 100596 -160086
14573 -160086 -196672 -205990 -333497 -215931 -98547 -99138 -99849 249210 280969 193123 145170 47391
14561 47391 144064 34428 -10457 8367 26149 132371 94699 -69082 -167424 -193416 79157
14550 79157 220983 196179 126080 178482 158863 98541 80125 65162 15476 -1852 133615
14539 133615 80385 -29174 -71048 -100248 124281 282501 411068 383535 132006 141341 119447
14528 119447 35881 201910 257708 110217 95797 95133 233753 338405 167866 48074 96325
14517 96325 -28384 -145072 -308901 -187692 1537 -156026 -59707 -49330 23886 -11005
14507a1005l3589n469q6211J81540O5350q2147J58334J76054j19350j146j00573
14496A41788J08254P2148l1017k06301j00750J37677L8860n2620p2355j32444
14486i6760N1166J30744l632o26j45758L0292J8152k06993J7460L12612J05303
14475B11960J5252j17047l6653j22085m5737N5566R3141J95102L04866q1548k38234
14464B34583j03950J73622q7776j67969J55023L8909L630r8738P6246Q1218L9655
14453C44453j08595k15680m9058p1546L9404j55575j21626Q7569K56400J53429
14443A59175L9222r9952J23332K04094o5374k67283j43695j0523O6575M833m2983
14432c2579R4264J21067j53285p483p0018j95146J63084J20198O5095J19237m8457
$$ plain form
14507 -11005 -44594 -50063 -136274 45266 110616 28469 186803 362857 243507 242361 141788
14496 141788 250042 322190 291173 84872 -15878 121799 160659 108039 35684 -96760
14486 -96760 -45594 85150 81518 80892 -64866 -34574 -16422 -223415 -205955 106657 211960
14475 211960 227212 110165 73512 -48573 -94310 -38744 54397 249499 554365 472817 234583
14464 234583 130633 304255 216479 48510 203533 242442 246072 147334 223580 304798 344453
14453 344453 235858 20178 -28880 -100426 -61022 -216597 -338223 -250654 5746 159175
14443 159175 198397 98445 221777 425871 360497 93214 -50481 -61004 5571 10404 -32579
14432 -32579 61685 182752 29467 21984 -48034 -243180 -80096 40102 105197 224434 175977
14421A75977O0632J97816q6365o9382K9930j98537l94350n0106M7296O4559q2287
14410c04817J05864R6639j0352Q1594Q2552j96296j20977o846J80777P5693J33404
14399A17235N3209O438r7582n2289P2296J11817k8469n3040J01375j0273K5428
14388B46145R6254J72145j06424m0581j51281q7144J67807L6740L4231M2383M0871
14377D51146k79503k76994N5307J80701J27519k34279j2633J06626k10386K8716
14367f3780j3141k40693J4228O1336L832J25208J72226J13739k9148k07196m6800
14356a10189L17250K79412p1964j16306j93698r8603N5446O7996J27075J35503
14346C91922K558J6267M4034k22124l14249j4140L27o6381Q7597J28544J98725
$$ plain form
14421 175977 236609 434425 348060 278678 308608 110071 -284279 -334385 -287089 -222530 -304817
14410 -304817 -198953 -102314 -112666 -31072 51480 -144816 -265793 -272639 -91862 -16169 117235
14399 117235 170444 176882 79300 27011 99307 211124 182655 129615 230990 220717 246145
14388 246145 342399 514544 408120 367539 216258 129114 296921 333661 367892 410275 451146
14377 451146 171643 -105351 -50044 130657 258176 23897 11264 117890 -92496 -63780
14367 -63780 -76921 -317614 -303386 -242050 -238218 -113010 59216 172955 143807 -63389 -110189
14356 -110189 207061 486473 414509 298203 104505 5902 61348 129344 256419 391922
14346 391922 394480 410747 454781 232657 -81592 -95732 -95405 -161786 -74189 54355 253080
14335B53080n6469j46910j80946n6541j63497J91088O5804K2079L42362K66000
14325E36050j13089j03152l3984j10964L1188M6712K8248J33603J37259k9615
14315E22256p4687k1387j13647j68259J34446k2417j27086o6919O6983Q888O418
14304A44589n219O3066p311r6407J49930K5649k3312j89920K52745Q2433k03627
14293A92616R1374K76327K08828m3400l12138j81146j64598j39873n56q8975Q3037
14282g8504K15664L2830q3690j01151r1537k23650L5668J86004p3907O8322J33286
14271A9335K8270L47823O1912j48814J0782J50442L9072P3142l8627j90590k65529
14260H7218J00968J3446j21726J63840j1265j0081l5750j64897N9637q3918p7777
$$ plain form
14335 253080 196611 49701 -131245 -187786 -351283 -160195 -94391 -72312 270050 536050
14325 536050 422961 319809 285825 174861 206049 252761 281009 414612 551871 522256
14315 522256 447569 426182 312535 144276 278722 256305 129219 62300 129283 138171 144589
14304 144589 139370 202436 195125 98718 248648 274297 250985 61065 313810 396243 192616
14293 192616 283990 560317 769145 725745 413607 232461 67863 -72010 -72566 -161541 -78504
14282 -78504 137160 169990 86300 -14851 -106388 -330038 -294370 -108366 -182273 -113951 19335
14271 19335 47605 395428 457340 308526 319308 469750 508822 581964 543337 352747 87218
14260 87218 188186 201632 79906 243746 232481 222400 186650 21753 81390 -2528 -80305
14249h0305J56395j28248k7321J00930N4508j20992j71454k1806J90506O0602
14239A2815j18684N0031J33698l2488j90937Q6295Q7246K01645J66227r0278j52186
14228A53384j27440J16787K9069p0173Q7089M8140J0699j38221J7678K87567P8077
14217D92656j15306L1509J11309j8277j40089m741m8982J65501R797M8030j33240
14206C98167l5393r3347N1121O0530O1757o9979r3589m8519j9376J50457M2424
14195D04253j61693O5872J66292N7247m8071K477r635o1055k19605M4705J40692
14184C81479J53061K26216K29280J91382j23267j43062N0665R3514k45886j32154
14174F81228L6748n7048K23371L07209K10601K24132j19167k71589K0875J87763
$$ plain form
14249 -80305 76090 -52158 -79479 21451 75959 -45033 -216487 -238293 -47787 12815
14239 12815 -105869 -55838 77860 45372 -145565 -59270 27976 229621 395848 305570 153384
14228 153384 25944 142731 171800 101627 188716 236856 247555 109334 127012 414579 492656
14217 492656 377350 408859 520168 501891 361802 357061 308079 473580 483377 531407 398167
14206 398167 362774 269427 320548 381078 442835 372856 279267 230748 211372 361829 404253
14195 404253 242560 308432 474724 531971 483900 486377 476742 415687 196082 240787 381479
14184 381479 534540 760756 990036 1181418 1058151 915089 965754 1059268 813382 681228
14174 681228 717976 660928 884299 1191508 1402109 1626241 1507074 1235485 1256360 1444123
14164A444123N0161M12460N59099K97486J88567J82804R7175L69557M70717Q19050
14154D891199R37496J038782J235349J601329J348420J591333J595767J729396
14146A5969071J588551J378267J082353J054432O58202P60021R53061Q61010N88872
14137B4893840K98548o4772o79524j291705j245734j129162j139573r53830n01951
14128A8186137m2703M89443J067476J773627K465615K907942L042999L226856
14120C3117392L367991L462369L210999K779807K251513J921133J339706N85168
14112E2036078l91445j409619k080972k777842l095011k959754k828173k787833
14104C3705429k996708k923502k572206k173851j491407o87364j88870L47857
$$ plain form
14164 1444123 1494284 1906744 2465843 2763329 2951896 3134700 3231875 3601432 4072149 4891199
14154 4891199 5828695 6867477 8102826 9704155 11052575 12643908 14239675 15969071
14146 15969071 17557622 18935889 20018242 21072674 21730876 22490897 23443958 24304968 24893840
14137 24893840 25192388 25127616 24448092 23156387 21910653 20781491 19641918 18688088 18186137
14128 18186137 18143434 18632877 19700353 21473980 23939595 26847537 29890536 33117392
14120 33117392 36485383 39947752 43158751 45938558 48190071 50111204 51450910 52036078
14112 52036078 51644633 50235014 48154042 45376200 42281189 39321435 36493262 33705429
14104 33705429 30708721 27785219 25213013 23039162 21547755 20860391 20671521 21019378
14096B1019378Q92988J127369J226662J287835J021916N98714J74667o8304Q998
14087B7290223m13153p38608o77852j89336k2065m30341p57996j086142j695960
14078B1278770j764656k035465k013298j485675j121493j006462p39651m61181
14070A0650889n12891l75196K32461M43717O04226Q80406J190014J544521J952871
14061A6611018J910944J970256J821971J624264J373229R80374L80576J65021
14053B6837653L08667O24183M75439K61200J76844J36783m82896q73059j476396
14044B5988418j596290j267060q27719l45013J70463O49782J274718K251188K728276
14035B9026763L055820L312743L234689L253684L140864L044728K874589K753317
$$ plain form
14096 21019378 21912366 23039735 24266397 25554232 26576148 27174862 27349529 27281225 27290223
14087 27290223 26877070 26138462 25460610 25271274 25249209 24818868 24060872 22974730 21278770
14078 21278770 19514114 17478649 15465351 13979676 12858183 11851721 11112070 10650889
14070 10650889 10137998 9762802 9995263 10438980 11043206 11923612 13113626 14658147 16611018
14061 16611018 18521962 20492218 22314189 23938453 25311682 26292056 26672632 26837653
14053 26837653 27146320 27770503 28245942 28507142 28683986 28820769 28337873 27464814 25988418
14044 25988418 24392128 23125068 22297349 21952336 22122799 22772581 24047299 26298487 29026763
14035 29026763 32082583 35395326 38630015 41883699 45024563 48069291 50943880 53697197
14027E3697197K108364R49822j09161j090986j700753k203504k666442l109099
14019D5875438l346444l359045l533949l513430k954896k472498k183362j490341
14011B3021473j024292k54639K37838O50381J341936J546468J390208J164194
14003B8073567J086536M65444o1999l68047n57861r77594r76084p82616q26711
13994B5074635j216214j371193j570339j875161k029402k136069k019237j587900
13986A1269120j314303j167780q37644q14802o44142n92475p37661n57732k89183
13977D313398m50042l81621k55415j20010j23595r4965j83249q2302q6903j46192
13967B389104j20882j31614p1693P5175J23513j35493n2571l4018k34422j06689
$$ plain form
14027 53697197 55805561 56755383 56646222 55555236 53854483 51650979 48984537 45875438
14019 45875438 42528994 39169949 35636000 32122570 29167674 26695176 24511814 23021473
14011 23021473 21997181 21742542 21980380 22630761 23972697 25519165 26909373 28073567
14003 28073567 29160103 29625547 29563548 29195501 28637640 27660046 26683962 25901346 25074635
13994 25074635 23858421 22487228 20916889 19041728 17012326 14876257 12857020 11269120
13986 11269120 9954817 8787037 7949393 7134591 6490449 5897974 5160313 4602581 4313398
13977 4313398 3863356 3481735 3226320 3106310 2982715 2887750 2704501 2622199 2535296 2389104
13967 2389104 2268222 2136608 2064915 2140090 2263603 2128110 2075539 2041521 1807099 1700410
13957A700410j52589k10453j95842j8039L6805r0824m07224j52934J80175P6053
13947G65538M8826M630o3287K6475R2490j75423j44364L3162j13816m9396J66306
13936E91141Q2412m0182j33749p1966P0153L3143j82275j05376K4029J37563M4674
13925D49567j82512n1226J54550N9978J0476j49039O6010l5368J08126J51203
13915E81765P7481j27788n9589k67197N3927O0528k13945M7812J42824o4174k11067
13904B0577j19656L39447K40003K7182J49809j45667j74178q9309r2833r90L7390
13893A91775n6835j3703J51160r2704j3949P7814K1717P7946R3998j08722j68595
13882A59902o9910L3353O6717J94339k0299K0608l1259j11896J25539n2226l9012
$$ plain form
13957 1700410 1547821 1337368 1141526 1123487 1160292 1069468 662244 509310 689485 765538
13947 765538 814364 818994 755707 782182 874672 699249 554885 588047 474231 424835 591141
13936 591141 673553 633371 499622 427656 497809 530952 348677 243301 267330 404893 449567
13925 449567 267055 215829 370379 430357 440833 291794 357804 322436 430562 581765
13915 581765 659246 531458 471869 204672 258599 319127 105182 152994 295818 231644 20577
13904 20577 -99079 240368 480371 507553 657362 511695 337517 248208 155375 154385 191775
13893 191775 134940 121237 272397 179693 165744 243558 265275 343221 437219 328497 159902
13882 159902 89992 123345 190062 384401 364102 384710 353451 241555 367094 314868 275856
13871B75856O0195m6307n4537q7144o8716R6955q8326l3013J06824M8738j03332
13860A07193k83378p5023o0637o1542J08624n4690P0540L7038l0258j55365J03085
13849b94413J44454Q1843N7939J65647n5082p9772L0782J03823Q0521l3507j16386
13838H5849j41873J56444k01764j55768N6252J08625N6329o2988k9474J7217K050
13827a09101M498k157j10723n3825l3362R0206N8981L7446o1372M8604J52759
13816B1954R4322J87922N3417r1183j47259J3087j15889M1899K65103n2799j01774
13805A68800o8532j00517j0504j39545k50563J69183J14866J40514O4644J629
13795H9975k13392m2591J06837O4669K05239r84m6069j15836j90200l3096J83933
$$ plain form
13871 275856 336051 289744 235207 148063 79347 176302 87976 54963 161787 210525 107193
13860 107193 -176185 -251208 -311845 -373387 -264763 -319453 -248913 -211875 -242133 -397498 -294413
13849 -294413 -149959 -68116 -10177 155470 100388 20616 51398 155221 235742 202235 85849
13838 85849 -56024 100420 -101344 -257112 -200860 -92235 -35906 -98894 -128368 -111151 -109101
13827 -109101 -104603 -106760 -217483 -271308 -304670 -214464 -155483 -118037 -179409 -130805 21954
13816 21954 116276 304198 357615 266432 119173 132260 16371 58270 323373 270574 168800
13805 168800 100268 -249 -10753 -150298 -400861 -231678 -116812 23702 88346 89975
13795 89975 -123417 -166008 -59171 5498 210737 209753 163684 47848 -142352 -175448 8485
13784H485M9096j33290l8638K22796R7768K3995K7973Q988k00576m6290q580N2828
13772F4555k5311R0788K07018L6317q7438l0937O3643j72963q2825k20935j28147
13761b86235j26898k2360Q3610L02379P7801p2579q5051j93131k5296Q8598J8980
13750b40182L4666K02022J56197j38092j80368j07624J48091J41784K1712J43653
13740A81859J83580J56566j73429j17311j77935k49724N4388J19080p7452k2393
13730a22771m6215l6622K224N5107J84705N9833r4567K3185l3090J61670P8542
13719B32001j23715j39510n5189O0283j58412j20961L5367N5085K5575k07037
13709c96513j17447L7265K63951O7520q7655P4771J85231j1656J6933j5859J02818
$$ plain form
13784 8485 57581 -75709 -114347 108449 206217 230212 258185 267173 66597 20307 11727 64555
13772 64555 39244 130032 337050 373367 285929 254992 318635 145672 62847 -158088 -286235
13761 -286235 -413133 -435493 -351883 -49504 28297 -44282 -129333 -322464 -347760 -259162 -240182
13750 -240182 -205516 -3494 152703 14611 -165757 -273381 -125290 16494 38206 181859
13740 181859 365439 522005 348576 231265 53330 -196394 -142006 -22926 -100378 -122771
13730 -122771 -168986 -205608 -203384 -148277 36428 96261 1694 24879 -8211 153459 232001
13719 232001 108286 -31224 -86413 -26130 -184542 -305503 -270136 -215051 -189476 -396513
13709 -396513 -513960 -476695 -212744 -145224 -232879 -158108 27123 15467 32400 16541 119359
13698A19359N6175m1734k0775l9606k36905j14094N8993R5482J71319m5945r3851
13687i1582j7277J1133L06574K80026O0302k7470n76O0281P0779j08086r1840
13676D52264o1219K4199R7516j10561l52437j7671o1961o0870Q5209J9182O1089
13665G4740o7758p4578L00493K23542o8570J227R5004k40238N0128N1896j77821
13654A68065M4858k6383o2077q185K2762J25601Q0752j97458j87314q2040O1360
13643f0059p1242M0033K71973M9615P3690R2362k0951j68407J10124n1055j65300
13632A00783P3676p3157q1106M9044M3282P3923r6434l1981j0912J69063J99389
13621D15570l56069k48942P6084K79049P9465Q1049n3268o4719k33402m5821L1663
$$ plain form
13698 119359 175534 133800 113025 73419 -163486 -277580 -218587 -123105 48214 2269 -91582
13687 -91582 -108859 -97726 208848 488874 549176 521706 521130 581411 652190 544104 452264
13676 452264 391045 415244 512760 402199 49762 32091 -29870 -90740 -5531 13651 74740
13665 74740 6982 -67596 232897 456439 387869 389096 484100 243862 293990 345886 168065
13654 168065 212923 186540 124463 116278 139040 264641 345393 147935 -39379 -121419 -60059
13643 -60059 -131301 -91268 180705 230320 304010 396372 375421 207014 317138 266083 100783
13632 100783 174459 101302 20196 69240 112522 186445 90011 58030 47118 216181 415570
13621 415570 59501 -189441 -113357 165692 245157 326206 272938 208219 -25183 -71004 -39341
13610c9341O3681J21915J03525k4022j44657o4637j0824M0661R0435R3125P7980
13599C07841K0220j01084j18351j7869j9142k0034L6971m7687r5862J10061J37529
13588A92593J32934K3917j56641j43562j6698J04609q666o1139J17795L0393r7750
13577A17785k8055L33033J09330J0104j58966o8370k33025q6298q2503L1235J79355
13566A23625Q5041K3293o6389q9813k12725j18Q9927J09448m1993j49423M6842
13555h2285J9087J95943J0712l1726j14019Q1788o0018j50320m4309J55204J12885
13544I2942J10873J9800j48694o3059n202j25306L6191L4663Q7747k12919k61674
13533d34638j95029K00282K76280J46272N8612n0536n0969J90940R5254J17925
$$ plain form
13610 -39341 24340 146255 249780 225758 81101 16464 5640 46301 136736 229861 307841
13599 307841 328061 226977 108626 90757 71615 51581 88552 40865 -54997 55064 192593
13588 192593 325527 349444 192803 49241 32543 137152 128486 67347 185142 215535 117785
13577 117785 89730 422763 532093 542197 383231 314861 81836 -4462 -86965 -55730 123625
13566 123625 208666 231959 165570 75757 -136968 -137086 -47159 62289 20296 -129127 -82285
13555 -82285 -63198 132745 143457 111731 -2288 79500 19482 -130838 -175147 -19943 92942
13544 92942 203815 223615 74921 11862 6660 -118646 -82455 -47792 39955 -172964 -434638
13533 -434638 -629667 -429385 -153105 -6833 51779 1243 -49726 141214 236468 354393
13523C54393k06637j42116r7132p2641m9969j9649r9626P5771J50506k90390R0736
13512c06754K59136j03647M4496J0241M2206N0761R5929j56238l79595k56033
13502f99498Q2328L25543R3427P5389k8413k14798J12973R1114J41352j4499k86282
13491c21364j3848K05766L01232J70753K408k0079q0227r741j40114Q0941L1796
13480B07523j21372j83854L7343R8038m4806N5241m9050J46270J46396p9123k2961
13469A89645j0994j8454R2615O419j55474j53253P2018l2874r9213l8026Q1434
13458f6157J07982J52455L7307j80711l22098j62267Q4184K03078J32675O0470
13448D6918k32610M4715o3257k63559j5476K77719J08790r4909r6460M5598K50347
$$ plain form
13523 354393 147756 5640 -91492 -164133 -214102 -233751 -333377 -257606 -107100 -397490 -306754
13512 -306754 -47618 -151265 -106769 -96528 -54322 -3561 92368 -63870 -443465 -699498
13502 -699498 -617170 -291627 -198200 -122811 -151224 -366022 -253049 -161935 -20583 -35082 -321364
13491 -321364 -335212 -129446 171786 342539 344947 324868 244641 234900 94786 175727 207523
13480 207523 86151 -97703 -60360 37678 -7128 48113 -937 145333 291729 212606 189645
13469 189645 178651 160197 252812 259231 103757 -49496 22522 -10352 -109565 -147591 -66157
13458 -66157 41825 194280 231587 50876 -271222 -433489 -349305 -146227 -13552 46918
13448 46918 -185692 -140977 -204234 -467793 -483269 -205550 -96760 -191669 -288129 -242531 7816
13437G816N581k0528q8274J08556j50834l48455k26084L98326K73330N0822J72764
13426A83020q1174L568J852j19664j49326M6565K7038L6584M7847J56389J3237
13415A65936l8416L5499j19838j85271N1948J12956R0887M8015m4297K0758o3211
13404G4966k10891p8060J62277k33734P2797J67425J02153Q874m4933J18055k2581
13393A16348r4081K1517j84415j31342K2855j4977m5321j6916r462J39858N3470
13382a42466K51514J08109k2690J14927r2927L8643j62587n8633J9717M7950K4086
13371A25643Q0820n4005k91722o1736K22584N2142j41864J09451J22934k14906
13361e0659K127l7750p9905n2942J70407J38567j04936j5686N2459R8812M4311
$$ plain form
13437 7816 13397 -7131 -95405 13151 -137683 -486138 -712222 -313896 -40566 10256 183020
13426 183020 101846 105414 107266 -12398 -161724 -115159 -88121 -51537 -3690 152699 165936
13415 165936 127520 163019 43181 -142090 -90142 22814 113701 161716 117419 138177 74966
13404 74966 -135925 -213985 -51708 -285442 -212645 -45220 56933 65807 20874 138929 116348
13393 116348 22267 43784 -140631 -271973 -249118 -264095 -309416 -326332 -335794 -195936 -142466
13382 -142466 109048 217157 194467 309394 216467 255110 92523 33890 53607 101557 125643
13371 125643 206463 152458 -139264 -201000 21584 73726 -68138 41313 164247 -50659
13361 -50659 -48532 -86282 -166187 -219129 -48722 89845 -15091 -30777 21682 120494 164805
13350A64805N1760Q7421o4221j05031O8453l5553j42134R465J38255M1279j13870
13339A00629K21131j1179j72981K235k657r1425l5276l0981K5954j30655n740
13328a30945j44854J82188N8420J20894j07522q3412m6616l1686N7620Q9145R2928
13317E6160m3809j03355P0920K6095J00919L8642P1910J01839r0101j41906J211
13306H8525J43963j47194p0921K31494J15642j16324k22772j7490q7158r8559
13296a80794O753n2607K0272L4794N6208L23844o4177j34710J5717r3964j66571
13285b35235M4678Q8580o4766j0614p5895J25862J12965J26277O3367J4615q3010
13274A06824k6381k4065k21162J0127R436J53219Q2028j01979J28398J57008j01439
$$ plain form
13350 164805 216565 303986 239765 134734 203187 167634 25500 34965 173220 214499 100629
13339 100629 321760 310581 137600 139835 137178 45753 10477 -20504 5450 -125205 -130945
13328 -130945 -275799 -93611 -35191 85703 -21819 -105231 -151847 -183533 -125913 -36768 56160
13317 56160 12351 -91004 -20084 6011 106930 145572 217482 319321 229220 87314 88525
13306 88525 232488 85294 14373 245867 361509 245185 22413 4923 -82235 -180794
13296 -180794 -174041 -226648 -206376 -171582 -115374 208470 144293 9583 25300 -68664 -235235
13285 -235235 -190557 -101977 -166743 -177357 -253252 -127390 -14425 111852 175219 189834 106824
13274 106824 80443 56378 -164784 -154657 -145221 7998 90026 -11953 116445 273453 172014
13263A72014n721K2240P8527L08837j77574j38445j61425j11374L6812J21222
13253A45113q3303q9960J43275l40708q8825J09883J28073J03768K1389j46017
13243i7312j13597J79850j75643P3120j6159K2139L04614n0662o8956Q0544P608
13232A45546n7948n823n3009J05628R7582M0641j64045k41073j53813k0814J7288
13221b89840Q2229J10875r428k60195J97312M90049J2517M7924n3334M6225R7629
13210D71963J0768k7402k539k6454n2687j04404L5584p8765k9182j66683J6280
13199D6479M555k10241Q7993o446k0889J32345R6633R4533J29698j66056j18718
13188F9886P7852L373n3157l4632M6167J11835p3165M9887l0697j77793j27585
$$ plain form
13263 172014 166293 188533 267060 575897 398323 259878 98453 -12921 23891 145113
13253 145113 61810 -28150 115125 -225583 -314408 -204525 -76452 27316 48705 -97312
13243 -97312 -210909 -31059 -206702 -133582 -149741 -127602 177012 126350 57394 137938 145546
13232 145546 87598 81775 28766 134394 231976 272617 108572 -132501 -286314 -307128 -289840
13221 -289840 -207611 -96736 -106164 -366359 -169047 321002 333519 381443 328109 374334 471963
13210 471963 482731 455329 452790 426336 373649 269245 304829 226064 196882 30199 46479
13199 46479 51034 -159207 -71214 -77660 -98549 33796 130429 224962 354660 188604 69886
13188 69886 147738 151111 97954 63322 109489 221324 148159 198046 167349 -10444 -138029
13177a38029j20010K2982N755K42162M2548l5392J15075R516Q1934J45327k15425
13166A56443k38336l4249j5883Q1276j1019K8535J57983K1812p8264j87987j0329
13155a30018Q3562L7270J76651P6462j68938j20941J00587O5010r0996k8454J24534
13144A24729K7136p1691K5188o0891j19486N2535J87226J33654j00629j29676
13134F8095l1218J91548r6505j49202J13355J05494m9268M642J45744j70047K6396
13123A59034R0537p3179p7532R961K58465j19227k28938m8537p6200k15034J428
13112c19222J20080J31481J40561l3802K8839j05915J4982J01624J40683L3098
13102B52409p9043j90900n5233k3192J5877J06472l4758j78998J0856n5434K813
$$ plain form
13177 -138029 -258039 -235057 -229302 12860 55408 20016 135091 144607 226541 371868 156443
13166 156443 -81893 -116142 -132025 -50749 -61768 -33233 124750 146562 68298 -119689 -130018
13155 -130018 -46456 -9186 167465 243927 74989 -45952 54635 119645 28649 195 124729
13144 124729 151865 80174 105362 44471 -75015 -22480 164746 298400 197771 68095
13134 68095 36877 228425 131920 -17282 96073 201567 152299 156941 302685 132638 159034
13123 159034 249571 176392 98860 108821 367286 248059 19121 -29416 -105616 -320650 -319222
13112 -319222 -199142 -67661 72900 39098 67937 -37978 -22996 78628 219311 252409
13102 252409 173366 -17534 -72767 -95959 -80082 26390 -8368 -187366 -176510 -231944 -229131
13091b29131J4967J34537O9233k85657j15168J06959K72651N756r9336m4754J40897
13080b9046p1464j68396J24048K98482l0994p5659j89787l5303J37146J02292
13070F1319k24042j73552K88071J26330j53938m3396M0035K5916k38619J0075
13060b81801J41691n7276J23610K03998k71488o3151J65035r3706J00413j0079
13050d2754j72669J02925K22589R7191k05846k22585l2134J24809L1988J8371
13040g8115J30918p1040O5211q1175L4434O0409P2815J44858m7223j39786j78040
13029h6734m4810J08569M866K00550q5357j11831J416n0745K4854r3168k82144
13018d14534k14382J42303K26886K34373P1889L5443r8961P05J43205m4994j20602
$$ plain form
13091 -229131 -214164 -79627 -10394 -296051 -411219 -304260 -31609 -25853 -125189 -169943 -29046
13080 -29046 -100510 -268906 -144858 153624 122630 46971 -142816 -178119 -40973 61319
13070 61319 -162723 -336275 -48204 78126 -75812 -119208 -79173 -53257 -291876 -281801
13060 -281801 -140110 -197386 -73776 130222 -141266 -204417 -39382 -133088 -32675 -42754
13050 -42754 -215423 -112498 110091 207282 1436 -221149 -253283 -128474 -96486 -78115
13040 -78115 52803 -18237 46974 -34201 233 60642 133457 278315 231092 91306 -86734
13029 -86734 -131544 -22975 -18109 182441 97084 -14747 -13331 -64076 -39222 -132390 -414534
13018 -414534 -628916 -486613 -259727 -25354 46535 81978 -16983 -16278 126927 81933 -38669
13007c8669L403k9301q0270m499M2613m5672J40380l4736n9714N8981P0076j50752
12995a28160l8523N7340J18217N217k1178j62469m0706J18700o7366j5697j1607
12984a86232n5135M9430Q3100j66640n0522L01518J51441j15590m3960o3152j15165
12973b10907j5505K43447O5377k35456L9905N5405o0630j37762P3071M5195N656
12962a32204j14162k21123j89544K21855K49368J1830R0872J9317m7997p6736
12952a88524R140J23382o1201J72864K41898N5001k44017j73054O4130j55645
12942a56026k8947j80468N8334K1169K04324J36529j36778n3522O8624J27778
12932F1017j68685j37324j33288L1110L20952Q9092k5150r711N7616j12657k58833
$$ plain form
13007 -38669 -35266 -64567 -144837 -149336 -106723 -152395 -12015 -46751 -106465 -47484 22592 -128160
12995 -128160 -166683 -109343 8874 14091 -7087 -169556 -210262 -91562 -158928 -174625 -186232
12984 -186232 -241367 -191937 -108837 -275477 -325999 -24481 126960 11370 -32590 -95742 -210907
12973 -210907 -226412 17035 82412 -153044 -113139 -57734 -118364 -256126 -183055 -137860 -132204
12962 -132204 -246366 -467489 -657033 -435178 -185810 -173980 -83108 -63791 -111788 -188524
12952 -188524 -179384 -56002 -117203 55661 297559 352560 108543 -64511 -381 -156026
12942 -156026 -184973 -365441 -307107 -285938 -81614 54915 -81863 -135385 -66761 61017
12932 61017 -107668 -244992 -378280 -347170 -26218 62874 37724 28013 85629 -27028 -285861
$$ [...]
##END NTUPLES=NMR SPECTRUM
##END=
