##TITLE=Analysis number 328541
Compound Code cc 63846
Book Reference 511/136
Project Code adrs
Chemist Name stevem
##JCAMPDX= 6.0         $$ Bruker NMR JCAMP-DX V2.0
##DATA TYPE= NMR SPECTRUM
##DATA CLASS= NTUPLES
##ORIGIN= Bruker BioSpin GmbH
##OWNER= nmr
$$ XWIN-NMR		Version 3.5
$$ Thu Jun 14 09:48:15 2007 GMT Daylight Time (UT+1h)  MAYBRIDGE\nmr@NMR_250MHZ
##.OBSERVE FREQUENCY= 250.131544655141
##.OBSERVE NUCLEUS= ^1H
##.ACQUISITION MODE= SIMULTANEOUS (DQD)
##.ACQUISITION SCHEME= undefined
##.AVERAGES= 16
##.DIGITISER RES= 18
##SPECTROMETER/DATA SYSTEM= dpx250
##.PULSE SEQUENCE= zg30
##.SOLVENT NAME= CDCl3
##.SHIFT REFERENCE= (INTERNAL, CDCl3, 0, 16.522)
##AUDIT TRAIL= $$ (NUMBER, WHEN, WHO, WHERE, WHAT)
$$ ##TITLE= Audit trail, XWIN-NMR		Version 3.5
$$ ##JCAMPDX= 5.01
$$ ##ORIGIN= Bruker BioSpin GmbH
$$ ##OWNER= nmr
$$ C:\u/data/dgb/nmr/ADRS/870/pdata/1/auditp.txt
$$ ##AUDIT TRAIL=  $$ (NUMBER, WHEN, WHO, WHERE, WHAT)
(   1,<2007-06-14 09:47:51.45 +100>,<MAYBRIDGE\nmr>,<NMR_250MHZ>,
      <created by zg, POWCHK disabled, PULCHK disabled
       configuration hash MD5:
       76 6E 9A 78 1E 09 19 81 EC 84 63 8F B0 6A 59 2D
       data hash MD5: 64K
       5A B7 1C 2A 4B 17 63 91 93 D6 75 38 79 32 E2 99>)
(   2,<2007-06-14 09:48:05.01 +100>,<MAYBRIDGE\nmr>,<NMR_250MHZ>,
      <Start of raw data processing
       ef LB = 0.3 FT_mod = 6 PKNL = 1 SI = 32K 
       data hash MD5: 32K
       05 A9 CD FC AE 3B AB 55 CF 81 ED E5 4B BB FB D4>)
(   3,<2007-06-14 09:48:06.65 +100>,<MAYBRIDGE\nmr>,<NMR_250MHZ>,
      <apk 
       data hash MD5: 32K
       21 ED 61 47 37 42 EB 37 5F BE 7A F1 19 79 64 F3>)
(   4,<2007-06-14 09:48:07.35 +100>,<MAYBRIDGE\nmr>,<NMR_250MHZ>,
      <abs ABSG = 5 
       data hash MD5: 32K
       CF DB C7 A2 A1 FF 8F 4A 36 79 39 54 1B EA 12 E6>)
$$ ##END=
$$ 
$$ hash MD5
$$ 88 79 78 29 ED 2C 2D 0B 05 D3 BE 83 06 07 1D 8B
##$RELAX= 
##$RELAX= 
##$RELAX= 
##$RELAX= 
##$RELAX= 
##$RELAX= 
##$RELAX= 
$$ Bruker specific parameters
$$ --------------------------
##$DU= <C:\u>
##$EXPNO= 870
##$NAME= <ADRS>
##$PROCNO= 1
##$TYPE= <nmr>
##$USER= <dgb>
##$AMP= (0..31)
100 100 100 100 100 100 100 100 100 100 100 100 100 100 100 100 100 100 
100 100 100 100 100 100 100 100 100 100 100 100 100 100 
##$AQSEQ= 0
##$AQ_mod= 3
##$AUNM= <au_zg>
##$AUTOPOS= <5 >
##$BF1= 250.13
##$BF2= 250.13
##$BF3= 250.13
##$BF4= 250.13
##$BF5= 500.13
##$BF6= 500.13
##$BF7= 500.13
##$BF8= 500.13
##$BYTORDA= 1
##$CFDGTYP= 0
##$CFRGTYP= 5
##$CHEMSTR= <none>
##$CNST= (0..31)
1 1 145 1 1 1 1 1 1 1 1 1 1 1 1 1 1 1 1 1 1 1 1 1 1 1 1 1 1 1 1 1 
##$CPDPRG= <>
##$CPDPRG1= <>
##$CPDPRG2= <>
##$CPDPRG3= <>
##$CPDPRG4= <mlev>
##$CPDPRG5= <mlev>
##$CPDPRG6= <mlev>
##$CPDPRG7= <mlev>
##$CPDPRG8= <mlev>
##$CPDPRGB= <>
##$CPDPRGT= <>
##$D= (0..31)
0 1 0 0 0 0 0 0 0 0.06 0 0 0 0 0 0 0.0002 0 0 0 0 0 0 0 0 0 0 0 0 0 0 
0 
##$DATE= 1181810869
##$DBL= (0..7)
120 120 120 120 120 120 120 120 
##$DBP= (0..7)
150 150 150 150 150 150 150 150 
##$DBP07= 0
##$DBPNAM0= <>
##$DBPNAM1= <>
$$ [...]
##$SUBNAM7= <"">
##$SUBNAM8= <"">
##$SUBNAM9= <"">
##$SW= 20.6930455092707
##$SWIBOX= (0..15)
0 0 3 0 0 0 0 0 0 0 0 0 0 0 0 0 
##$SW_h= 5175.983436853
##$TD= 65536
##$TD0= 1
##$TE= 296.16
##$TE2= 300
##$TE3= 300
##$TEG= 300
##$TL= (0..7)
0 120 120 120 120 120 120 120 
##$TP= (0..7)
150 150 150 150 150 150 150 150 
##$TP07= 0
##$TPNAME0= <>
##$TPNAME1= <>
##$TPNAME2= <>
##$TPNAME3= <>
##$TPNAME4= <>
##$TPNAME5= <>
##$TPNAME6= <>
##$TPNAME7= <>
##$TPOAL= (0..7)
0.5 0.5 0.5 0.5 0.5 0.5 0.5 0.5 
##$TPOFFS= (0..7)
0 0 0 0 0 0 0 0 
##$TUNHIN= 0
##$TUNHOUT= 0
##$TUNXOUT= 0
##$USERA1= <user>
##$USERA2= <user>
##$USERA3= <user>
##$USERA4= <user>
##$USERA5= <user>
##$V9= 5
##$VALIST= <valist>
##$VCLIST= <CCCCCCCCCCCCCCC>
##$VD= 0
##$VDLIST= <DDDDDDDDDDDDDDD>
##$VPLIST= <PPPPPPPPPPPPPPP>
##$VTLIST= <TTTTTTTTTTTTTTT>
##$WBST= 1024
##$WBSW= 4
##$XGAIN= (0..3)
0 0 0 0 
##$XL= 0
##$YL= 0
##$YMAX_a= 227363
##$YMIN_a= -324017
##$ZGOPTNS= <>
##$ZL1= 120
##$ZL2= 120
##$ZL3= 120
##$ZL4= 120
##$ABSF1= 16.522
##$ABSF2= -4.171173
##$ABSG= 5
##$ABSL= 3
##$ALPHA= 0
##$AQORDER= 0
##$ASSFAC= 0
##$ASSFACI= 0
##$ASSFACX= 0
##$ASSWID= 0
##$AUNMP= <proc_1d>
##$AZFE= 0.1
##$AZFW= 0.1
##$BCFW= 0
##$BC_mod= 0
##$BYTORDP= 0
##$COROFFS= 0
##$CY= 12.5
##$DATMOD= 1
##$DC= 0
##$DFILT= <>
##$DTYPP= 0
##$F1P= 14.0000005364418
##$F2P= -0.99999901652339
##$FCOR= 0.5
##$FTSIZE= 32768
##$FT_mod= 6
##$GAMMA= 0
##$GB= 0
##$INTBC= 1
##$INTSCL= 1
##$ISEN= 128
##$LB= 0.3
##$LEV0= 0
##$LPBIN= 0
##$MAXI= 10000
##$MC2= 0
##$MEAN= 0
##$ME_mod= 0
##$MI= 0
##$NCOEF= 0
##$NC_proc= -4
##$NLEV= 6
##$NOISF1= 0
##$NOISF2= 0
##$NSP= 0
##$NTH_PI= 0
##$NZP= 0
##$OFFSET= 16.522
##$PC= 1
##$PHC0= -55.16381
##$PHC1= 5.725913
##$PH_mod= 1
##$PKNL= yes
##$PPARMOD= 0
##$PSCAL= 4
##$PSIGN= 0
##$REVERSE= no
##$SF= 250.13
##$SI= 32768
##$SIGF1= 0
##$SIGF2= 0
##$SINO= 400
##$SIOLD= 32768
##$SREGLST= <1H.CDCl3>
##$SSB= 0
##$STSI= 32768
##$STSR= 0
##$SW_p= 5175.98343685301
##$SYMM= 0
##$S_DEV= 0
##$TDeff= 65536
##$TDoff= 0
##$TI= <Analysis number 999999
Compound Code 99
Book Reference 9
Project Code 9>
##$TILT= no
##$TM1= 0
##$TM2= 0
##$TOPLEV= 0
##$USERP1= <user>
##$USERP2= <user>
##$USERP3= <user>
##$USERP4= <user>
##$USERP5= <user>
##$WDW= 1
##$XDIM= 32768
##$YMAX_p= 474068805
##$YMIN_p= -105779
$$ End of Bruker specific parameters
$$ ---------------------------------
##NTUPLES= NMR SPECTRUM
##VAR_NAME=  FREQUENCY,     SPECTRUM/REAL,   SPECTRUM/IMAG
##SYMBOL=    X,             R,               I
##VAR_TYPE=  INDEPENDENT,   DEPENDENT,       DEPENDENT
##VAR_FORM=  AFFN,          ASDF,            ASDF
##VAR_DIM=   32768,         32768,           32768
##UNITS=     HZ,            ARBITRARY UNITS, ARBITRARY UNITS
##FACTOR=    0.157963299565203, 1,           1
##FIRST=     4132.6476996994, 0,             0
##LAST=      -1043.33573715361, 0,           0
##MIN=       -1043.33573715361, -105779,     0
##MAX=       4132.6476996994, 474068805,     0
$$ Real data points
##PAGE= N=1
##DATA TABLE= (X++(R..R)), XYDATA
$$ [...]
##PAGE= N=2
##DATA TABLE= (X++(I..I)), XYDATA
15278A778701L6195j4819l0565J2385M0023M150j9847k1464J3030K0950k2432
15267A796307j4081K3686K3184q920k7224j2828n107J2204j2271K8559M9038r739
15255A842808j8330j6930j7242J728L3178k533k5960L1663M2251L6596j9174j884
15243A886171j7871j6736k185r275o788k920L081n793J0407K1709N626k4153M82
15230A841755K8472K0299P67o823p236m245q570p687N943Q742J1601m697r968
15217A868353K0735l4605l6835K1612J0946J723K0699J0260J9872J2923Q969K3784
15205A948436q183j3833r85L471l5071m1869k251J3404J824J7749J8757j0990
15193A890459j7474J2809J3855J8504q322n009j3311l87M6704k468j5714j4250
$$ plain form
15278 1778701 1814896 1800077 1769512 1781897 1821920 1826070 1806223 1784759 1797789 1818739 1796307
15267 1796307 1782226 1805912 1829096 1820176 1792952 1780124 1775017 1787221 1774950 1803509 1852547 1842808
15255 1842808 1824478 1807548 1790306 1792034 1825212 1822679 1796719 1828382 1870633 1907229 1888055 1886171
15243 1886171 1868300 1851564 1849379 1840104 1833316 1830396 1833477 1827684 1838091 1859800 1865426 1841273 1841755
15230 1841755 1870227 1890526 1891293 1884470 1877234 1872989 1864419 1856732 1862675 1871417 1883018 1878321 1868353
15217 1868353 1889088 1854483 1817648 1839260 1850206 1851929 1872628 1882888 1902760 1915683 1924652 1948436
15205 1948436 1940253 1926420 1925435 1928906 1893835 1851966 1849715 1863119 1864943 1882692 1901449 1890459
15193 1890459 1872985 1885794 1899649 1918153 1909831 1904822 1891511 1891124 1937828 1935360 1919646 1905396
15181A905396O032q63J202J1835P562J6105p712n612J8640j8527j20R574M686
15168A948198r135j5216m015J080k209J5670K265J928K1970K1453K613l1342j2005
15155A941255O012K725j5972q63J0991K633K3641j0428J0203L8246k8756M648
15143A984335K2130K9608J8084k3281k0562j5410k6843n056R368k240O528J1286
15131A987947J0309J3115j9068j3809K7579K5970L0988N787j5942M170K754q289
15119B051511K3109o140j4594k150n324j6579J5720J5492k944q529K1075r233
15107B061414q079N827J3393o850j7634j6683K0700j2179R471N771M152J6470
15095B075773J3442M743L795R754j9478j1666j6925Q224J2974L1226k972p720
$$ plain form
15181 1905396 1911428 1910565 1911767 1923602 1931164 1947269 1939557 1933945 1952585 1934058 1933938 1943512 1948198
15168 1948198 1939063 1923847 1919832 1920912 1918703 1934373 1936638 1938566 1960536 1981989 1984602 1953260 1941255
15155 1941255 1947267 1949992 1934020 1933157 1944148 1946781 1970422 1959994 1970197 2008443 1979687 1984335
15143 1984335 2006465 2036073 2054157 2030876 2010314 1994904 1968061 1963005 1972373 1970133 1976661 1987947
15131 1987947 1998256 2011371 1992303 1978494 2006073 2032043 2063031 2068818 2052876 2057046 2059800 2051511
15119 2051511 2074620 2068480 2053886 2051736 2046412 2029833 2045553 2061045 2058101 2049572 2070647 2061414
15107 2061414 2053335 2059162 2072555 2065705 2048071 2031388 2052088 2039909 2049380 2055151 2059303 2075773
15095 2075773 2089215 2093958 2097753 2107507 2088029 2076363 2059438 2067662 2080636 2111862 2108890 2101170
15083B101170j3584J0371m998j9614p882j6463J9258K7233K852J0592O949Q832
15071B124716j4204j1019j584N964j4686p336J4686K8377K494j4168k1507q015
15059B083718K2233L1666p37j8434j9701j9339J0973K6767R048J7496K3189n79
15047B166300j1658j055j952J2045J5093J9028k162k9500l3108k16J958J2109
15035B146882P675L4731J8138J1450K1463k1429m593n423k6146K2294J5391j6525
15023B203908J2964r896K42P684L814K490l422P515J6174j9937r599j6656m838
15010B190443K7129p339k0442J7547K1231K421R430k816K4293p15Q775J557J4159
14997B285673N708q231j5451j3690J2188J9386j2296m608M1319K8800M043k2867
$$ plain form
15083 2101170 2087586 2097957 2092959 2073345 2065463 2049000 2068258 2095491 2098343 2108935 2115884 2124716
15071 2124716 2110512 2099493 2097909 2103873 2089187 2081851 2096537 2124914 2127408 2113240 2091733 2083718
15059 2083718 2105951 2137617 2136880 2118446 2098745 2079406 2090379 2117146 2126194 2143690 2166879 2166300
15047 2166300 2154642 2153587 2151635 2163680 2178773 2197801 2195639 2166139 2133031 2132815 2134773 2146882
15035 2146882 2154557 2189288 2207426 2218876 2240339 2218910 2214317 2208894 2182748 2205042 2220433 2203908
15023 2203908 2216872 2206976 2207218 2214902 2218716 2221206 2217784 2225299 2241473 2221536 2211937 2195281 2190443
15010 2190443 2217572 2210233 2189791 2207338 2228569 2230990 2240420 2237604 2261897 2261182 2269957 2271514 2285673
14997 2285673 2291381 2283150 2267699 2254009 2266197 2285583 2273287 2268679 2309998 2338798 2342841 2319974
14985B319974k2251l055K884R767K1315J575j4684P813j1536k1632k11P849R113
14972B306921R822k605k9286q983L4135K5885Q998k9933j5134L0886K1553o335
14960B345924k4416j7121Q189n891L352K4236J0100J6721O535N345L100K362n509
14947B372927J222L2433N333J0727P568m363k0304l242K358p051K7192j7006q522
14934B399272j58M638m946l464K0813O417J3061K3421m959k1120p230j950M126
14921B427921K2646K4415j9243k5006R839j6539k7586K7184L9022K896J8585P720
14909B491854J3656M316k7970m408L7279p907J846k6704J3575O448J1624J158
14897B514767q731N923M949j47j9828J1285R434L1574K3834k1873l1719K2728
$$ plain form
14985 2319974 2297723 2294668 2297552 2307319 2328634 2330209 2315525 2323338 2311802 2290170 2289959 2297808 2306921
14972 2306921 2316743 2314138 2284852 2275869 2310004 2335889 2344887 2314954 2299820 2330706 2352259 2345924
14960 2345924 2321508 2304387 2312576 2306685 2310037 2334273 2344373 2361094 2367629 2372974 2376074 2378436 2372927
14947 2372927 2374149 2406582 2411915 2422642 2430210 2425847 2405543 2402301 2404659 2397608 2424800 2407794 2399272
14934 2399272 2399114 2403752 2398806 2395342 2416155 2422572 2435633 2459054 2454095 2432975 2425745 2423795 2427921
14921 2427921 2450567 2474982 2455739 2430733 2440572 2424033 2396447 2423631 2462653 2465549 2484134 2491854
14909 2491854 2505510 2509826 2481856 2477448 2514727 2506820 2508666 2481962 2495537 2501985 2513609 2514767
14897 2514767 2506036 2511959 2516908 2516761 2496933 2508218 2517652 2549226 2573060 2551187 2519468 2542196
14885B542196J936l775J073K2504k094O808L517j0566l50K1585J2167P693j341
14872B601353j524j261k6007M909J6110K3393k951J2177j471K396Q466P839J1778
14859B655207r002K4529k554j6852j2649j3305J491R966L0769J6791K638J2209
14847B699238J8879K3293j3040j7261q573k411n539n477j484J0175M2966K6405
14835B767171M639q553n335J1859m762o415J3171J442o17M0017M707l4021l6113
14822B747190K4035K7546J5048m473k955j2228J8668R136K18M372j452n057k738
14809B817310k3921N120Q953Q308K1782K7931n558l8136k511J9500K4226J7163
14797B880167K3130M262j0948K3060Q594j4176j1596j6530L6564J7616J0300J0560
$$ plain form
14885 2542196 2544132 2540357 2541430 2563934 2561840 2568648 2572165 2561599 2561249 2582834 2595001 2602694 2601353
14872 2601353 2599829 2598568 2572561 2577470 2593580 2616973 2614022 2626199 2624728 2627124 2635590 2643429 2655207
14859 2655207 2646205 2670734 2668180 2651328 2638679 2625374 2626865 2636831 2667600 2684391 2687029 2699238
14847 2699238 2718117 2741410 2728370 2711109 2702536 2700125 2694586 2689109 2687625 2697800 2740766 2767171
14835 2767171 2771810 2763257 2757922 2769781 2765019 2758604 2771775 2773217 2772600 2812617 2817324 2783303 2747190
14822 2747190 2771225 2798771 2813819 2809346 2806391 2794163 2812831 2821967 2822185 2826557 2825105 2820048 2817310
14809 2817310 2793389 2798509 2807462 2815770 2837552 2865483 2859925 2821789 2819278 2838778 2863004 2880167
14797 2880167 2903297 2907559 2896611 2919671 2928265 2914089 2902493 2885963 2922527 2940143 2950443 2961003
14785B961003J6728l732J2292J8605k5574j2490J3312J599j508k8860J3754L0701
14773B995830j0132m118M829K676J2718J6311M171p159j5404L536J8522K0311
14761C042091N651r358j4240n082n673j7997k3694j8551J6958J8844L1081J4609
14749C034639P03q916J6267R111j1944j2560P626L2874J2455j650n292j5655k8144
14736C029514m439J7814J7682K5158J9952j386j0554j0870J4444j8393j0823q622
14724C059477K0438J4088N9267Q094M853j4727P97l305O211J5662J0535K1710
14712C203100l968k1938j3629L250p531j7456m893K8471R482M5911J5950j661
14700C235088j5507j2170J2632M0211K6840J4158j7126j418J2359J1478J4195
$$ plain form
14785 2961003 2977731 2973999 2986291 3004896 2979322 2966832 2980144 2981743 2980235 2951375 2965129 2995830
14773 2995830 2985698 2981580 2986409 2989085 3001803 3018114 3022285 3015126 2999722 3003258 3021780 3042091
14761 3042091 3047742 3038384 3024144 3019062 3013389 2995392 2971698 2953147 2970105 2988949 3020030 3034639
14749 3034639 3035342 3026426 3042693 3051804 3039860 3027300 3034926 3067800 3080255 3078605 3073313 3057658 3029514
14736 3029514 3025075 3042889 3060571 3085729 3105681 3104295 3093741 3082871 3097315 3078922 3068099 3059477
14724 3059477 3079915 3094003 3153270 3161364 3166217 3151490 3152287 3148982 3155193 3170855 3181390 3203100
14712 3203100 3199132 3177194 3163565 3166815 3159284 3141828 3136935 3165406 3174888 3220799 3236749 3235088
14700 3235088 3219581 3207411 3220043 3260254 3287094 3301252 3284126 3282708 3295067 3306545 3320740
14689C320740R931K0015K1339k5093j8820j611K0369L4397L2265j1091K590J1854
14677C416885l910J615j0350Q568L132J1669K7989j873J0932M548k8957k7345
14665C412903l872q484J1033K826J5441r032n224j5057K0585J8828j6887K6735
14653C449795J5359J1282K6092J6109K1192o552o336n08O73J4588l297J11O935
14640C545443K3211j0817j1845j7283j894J0669J4172M1341M537q444l9439K1952
14628C571603N6054J4311l731J3089j2188K2028R357J1318K8753N555m647J3020
14616C724522K3508J7036J255O445Q241J9795K902K2979j793M641J1856L5007
14604C876394K2648L989K0346K7549L2134L167j8864n414m649L1559K2078L607
$$ plain form
14689 3320740 3330671 3350686 3372025 3346932 3328112 3326501 3346870 3381267 3413532 3402441 3405031 3416885
14677 3416885 3412975 3414590 3404240 3412808 3415940 3427609 3455598 3453725 3464657 3469205 3440248 3412903
14665 3412903 3409031 3400547 3411580 3414406 3429847 3420815 3415591 3400534 3421119 3439947 3423060 3449795
14653 3449795 3465154 3476436 3502528 3518637 3539829 3533277 3526941 3526433 3527106 3541694 3538397 3538508 3545443
14640 3545443 3568654 3557837 3545992 3528709 3526815 3537484 3551656 3592997 3597534 3589090 3549651 3571603
14628 3571603 3627657 3641968 3638237 3651326 3639138 3661166 3670523 3681841 3710594 3716149 3711502 3724522
14616 3724522 3748030 3765066 3766321 3772766 3781007 3800802 3803704 3826683 3824890 3829531 3841387 3876394
14604 3876394 3899042 3903031 3923377 3950926 3983060 3986227 3967363 3961949 3957300 3988859 4010937 4014544
14592D014544L425J2787m211p013J7208J4980L5764Q238J230j1409L2030j0569
14580D107004J70L58O141J4777N912P36J5736K8619M0254K3297K2084L0370O231
14567D301689r140K3631P873K424m028K962M7866J6882k2008o284J4435L6631
14555D412933J3844n211J8658p033j3583K5389L9268J6471M012J9000L0753p844
14543D546657k8112j22J4383Q193K507O182K6564L5776K6353M6056L8124J6733
14531D739294l3844k8474M4827M3010M786O717K5727L6688J0856l798J45K1395
14519D867329L3974K3957M9050L8773J1131j6093K6147J9017J8867L6196m886
14508E103462p066N0114N7774L6041J1781R023J39M18K4020L4970L8015L5673
$$ plain form
14592 4014544 4017969 4030756 4026545 4019532 4036740 4051720 4087484 4095722 4096952 4085543 4117573 4107004
14580 4107004 4107174 4107532 4113673 4128450 4134362 4135098 4150834 4179453 4219707 4243004 4265088 4295458 4301689
14567 4301689 4292549 4316180 4324053 4326477 4322449 4325411 4373277 4390159 4368151 4361867 4376302 4412933
14555 4412933 4426777 4421566 4440224 4433191 4419608 4444997 4484265 4500736 4504748 4523748 4554501 4546657
14543 4546657 4518545 4518423 4532806 4540999 4543506 4549688 4576252 4612028 4638381 4684437 4722561 4739294
14531 4739294 4705450 4676976 4721803 4764813 4769599 4776316 4802043 4838731 4849587 4845789 4845934 4867329
14519 4867329 4901303 4925260 4974310 5013083 5024214 5008121 5034268 5053285 5072152 5108348 5103462
14508 5103462 5096396 5146510 5204284 5240325 5252106 5261129 5261268 5261686 5285706 5320676 5358691 5394364
14496E394364J4537q646J6450J5672J7635n101L5635M6263N502m505O417N6934
14484E591157O7451M0388p023J234M2288J1830L9462M0421J706J3189L6009J5760
14472E893872J3789J5880K3923N8659L6619K596N605Q221M5352O7395N2340K0696
14460F244947K137M1677L0827K3822J5560M8380N3209M8612J8873L5009K8165
14449F591218O7700K0134K4974L3185L8173N2713L061K7008L7844L5059M1433
14438F972502Q0150K9864K5086N2864M3607M9933L5309L4480M7134L4979M8011
14427G453919Q3142O7975N4404L3932N9479O4044O2465N5402L2101M9891R2803
14416H109557P1825N3667O4916O3680N1794P1969P4681O9686R4895M1731L5805
$$ plain form
14496 5394364 5408901 5400255 5416705 5432377 5450012 5444911 5480546 5526809 5532311 5527806 5534223 5591157
14484 5591157 5658608 5698996 5691973 5693207 5735495 5747325 5786787 5827208 5828914 5842103 5878112 5893872
14472 5893872 5907661 5923541 5947464 6006123 6042742 6045338 6050943 6059164 6104516 6171911 6224251 6244947
14460 6244947 6247084 6288761 6319588 6343410 6358970 6407350 6460559 6509171 6528044 6563053 6591218
14449 6591218 6658918 6679052 6704026 6737211 6775384 6828097 6831158 6858166 6896010 6931069 6972502
14438 6972502 7052652 7082516 7107602 7160466 7204073 7254006 7289315 7323795 7370929 7405908 7453919
14427 7453919 7537061 7605036 7659440 7693372 7752851 7816895 7879360 7934762 7966863 8016754 8109557
14416 8109557 8181382 8235049 8299965 8363645 8415439 8487408 8562089 8631775 8726670 8768401 8804206
14405H804206P0568P0568P8859R0495R4149R2553Q6946Q3503J05582J02318R6021
14394I775768J17931J31625J14364J01051Q8213R5432J53692J02318J00873J42549
14384A0923816J51687J60206J51911J42720J47193J54867J69896J79722J79758
14375A2361776J61029J19819R7619J20110J13971J19472J10065J21281J42841
14366A3467983J09445J42856J83952K11171J81954J59158J16803O3540L6141L0180
14356A4703183O3963J38756J77607K13617K78951L21693L75879M12347L48333
14347A7034329K57812K03021K06599K31597K49663K84239L19807L61454M07937
14338A9556458L57063J68890j6581k13875k76335k15886q6596O1892J68436J97531
$$ plain form
14405 8804206 8874774 8945342 9024201 9114696 9208845 9301398 9388344 9471847 9577429 9679747 9775768
14394 9775768 9893699 10025324 10139688 10240739 10328952 10424384 10578076 10680394 10781267 10923816
14384 10923816 11075503 11235709 11387620 11530340 11677533 11832400 12002296 12182018 12361776
14375 12361776 12522805 12642624 12740243 12860353 12974324 13093796 13203861 13325142 13467983
14366 13467983 13577428 13720284 13904236 14115407 14297361 14456519 14573322 14636862 14673003 14703183
14356 14703183 14767146 14905902 15083509 15297126 15576077 15897770 16273649 16685996 17034329
14347 17034329 17292141 17495162 17701761 17933358 18183021 18467260 18787067 19148521 19556458
14338 19556458 19913521 20082411 20065830 19851955 19575620 19359734 19273138 19335030 19503466 19700997
14328A9700997J98915K24455K09734P2168j66981n99989j098348j447852j502504
14319A5590595j323638j032152o65650l18325k9874J43791K19200R9877k48918
14310A2434906o77832j100067j396302j581657j645477j670554j630458j450113
14302A282446j036693m12282K04139N87649O23934L84904m668k95770m42919n35143
14292C55597o24473p09061p45303o17357m00311j56920J4859P7100P7747m497
14282b732619o2075j65385k37163k88351l68366m74462m65436k95505r7634J32867
14272e054129L26250N01957N64248N81618O52628O98537P45932P94862Q42212
14263F54115P95264P12847O03497N49446N07290N31159N59037O13849O77228P22951
$$ plain form
14328 19700997 19899912 20124367 20334101 20406269 20239288 19639299 18540951 17093099 15590595
14319 15590595 14266957 13234805 12569155 12250830 12220956 12364747 12583947 12683824 12434906
14310 12434906 11757074 10657007 9260705 7679048 6033571 4363017 2732559 1282446
14302 1282446 245753 -166529 37610 625259 1249193 1634097 1629429 1333659 890740 355597
14292 355597 -268876 -977937 -1723240 -2340597 -2740908 -2897828 -2882969 -2805869 -2728122 -2732619
14282 -2732619 -2794694 -2960079 -3197242 -3485593 -3853959 -4328421 -4793857 -5089362 -5186996 -5054129
14272 -5054129 -4727879 -4225922 -3661674 -3080056 -2427428 -1728891 -982959 -188097 654115
14263 654115 1449379 2162226 2765723 3315169 3822459 4353618 4912655 5526504 6203732 6926683
14253F926683P07638N86250L68811J03191j50746l95621m74521m19601k62212
14244F989872o6108Q7368K05456K70962K70082O3194k24505n24783q09605j019024
14234E242909j114228j186164j194497j070148p41016l04367J30651L42149K41323
14225C46612k11759q13634j348330j626307j776241j815373j872319j834767j532683
14216a2484801j037300l56947K79583O72128P58924O25101L36622j47656n84263
14207a1938609q92900j070594j177421j170631r91959p44270m64319j85130J3385
14198a8622448J16910J45636J66630J64439Q2941l6511k25606m05069m83297m31420
14188a9527795j99134N2424K93698M43203N23548N93684O15773N79052N57610
$$ plain form
14253 6926683 7634321 8220571 8589382 8692573 8541827 8146206 7671685 7252084 6989872
14244 6989872 6923764 7011132 7216588 7487550 7757632 7820826 7596321 7071538 6261933 5242909
14234 5242909 4128681 2942517 1748020 677872 -63144 -367511 -236860 105289 346612
14225 346612 134853 -678781 -2027111 -3653418 -5429659 -7245032 -9117351 -10952118 -12484801
14216 -12484801 -13522101 -13879048 -13599465 -12927337 -12168413 -11543312 -11206690 -11354346 -11938609
14207 -11938609 -12831509 -13902103 -15079524 -16250155 -17242114 -17986384 -18450703 -18635833 -18622448
14198 -18622448 -18505538 -18359902 -18193272 -18028833 -17945892 -17982403 -18208009 -18613078 -19096375 -19527795
14188 -19527795 -19726929 -19674505 -19380807 -18937604 -18414056 -17820372 -17204599 -16625547 -16067937
14179a6067937N24199M67983M05840L91465L78039L44927L36072L26873K94627
14170a2597912K83920K60831K39360K47345K25382K52251K23319K02276K18257
14161a0444971K07842J74553J92699J73509J54104J57411J62182J57141J49356
14152h916174J48144J48525J47056J21012J05652J14871J11265J15818J51593
14143g752238J23589J13190J27916P8595P4511Q7311R0134P4755R8658J12653
14133f770926J02062R7072P1583O9893P2957R0072P2302R0693R4300M9167M1880
14122e918945N6562P4128P3789Q4129N9404N7807P2348N1399M1865K2197J5569
14111e309748N3500R1301Q5649O1608M2923N4201L9080N3980N8176L1268J8341
$$ plain form
14179 -16067937 -15543738 -15075755 -14669915 -14278450 -13900411 -13555484 -13219412 -12892539 -12597912
14170 -12597912 -12313992 -12053161 -11813801 -11566456 -11341074 -11088823 -10865504 -10663228 -10444971
14161 -10444971 -10237129 -10062576 -9869877 -9696368 -9542264 -9384853 -9222671 -9065530 -8916174
14152 -8916174 -8768030 -8619505 -8472449 -8351437 -8245785 -8130914 -8019649 -7903831 -7752238
14143 -7752238 -7628649 -7515459 -7387543 -7308948 -7234437 -7147126 -7056992 -6982237 -6883579 -6770926
14133 -6770926 -6668864 -6571792 -6500209 -6430316 -6357359 -6267287 -6194985 -6104292 -6009992 -5960825 -5918945
14122 -5918945 -5862383 -5788255 -5714466 -5630337 -5570933 -5513126 -5440778 -5389379 -5347514 -5325317 -5309748
14111 -5309748 -5256248 -5164947 -5079298 -5017690 -4974767 -4920566 -4881486 -4827506 -4769330 -4738062 -4719721
14100d719721N0693M3971M8281N0049K3645K7537L8128N2690O3571M0989K1006
14089d259161J7201M5854M3304P443L4208N5866N1831K9627J4911P25M2867O4085
14077c851239M69Q151M0736M6155J3194K5594J3878K7734P3249M0695L5064Q131
14065c518189L1743K6564K9165J1532K2792L4844J3489K0464J9317K6721N0281
14054c231277K3782L3908M7132M3499J5285J9693N0637J8283K3778M2467J394
14043b911419Q385M3712K4183J542l333K4591K0178J6840K4759J7840K4766K7449
14031b680507M8060O256N441K9612M3955M6919L1013J4372j1004K351K1153K5739
14019b416640m288L1638L8229L0452L8095L221L6119K5269n20M989K0278k326
$$ plain form
14100 -4719721 -4669028 -4625057 -4576776 -4526727 -4503082 -4475545 -4437417 -4384727 -4321156 -4280167 -4259161
14089 -4259161 -4241960 -4196106 -4152802 -4145359 -4111151 -4055285 -4003454 -3973827 -3958916 -3958191 -3915324 -3851239
14077 -3851239 -3850770 -3842619 -3801883 -3755728 -3742534 -3716940 -3703062 -3675328 -3602079 -3561384 -3526320 -3518189
14065 -3518189 -3486446 -3459882 -3430717 -3419185 -3396393 -3361549 -3348060 -3327596 -3308279 -3281558 -3231277
14054 -3231277 -3207495 -3173587 -3126455 -3082956 -3067671 -3047978 -2997341 -2979058 -2955280 -2912813 -2911419
14043 -2911419 -2903034 -2859322 -2835139 -2833597 -2836930 -2812339 -2792161 -2775321 -2750562 -2732722 -2707956 -2680507
14031 -2680507 -2632447 -2626191 -2620750 -2591138 -2547183 -2500264 -2469251 -2454879 -2465883 -2463532 -2442379 -2416640
14019 -2416640 -2420928 -2389290 -2351061 -2320609 -2282514 -2279293 -2243174 -2217905 -2218425 -2213436 -2193158 -2195484
14007b195484p29J2378K1009J843J3054M4650Q809j224K0274J9881l9945L0198
13995b065286M3045K0276M624r032J479J9967L0237J3477J8973M0773K9085J9987
13983a832395K0029L550m754K8060K0935K0434j9977j6617k1918l0232p710J2274
13971a828321J0841n888J604J7676L0075J8838O734K4067r150J897j0863L9435
13959a703055M5813K2600Q257J5524K5837K5787J724J1003L117R736L4919j9899
13947a518637q229R94J7239L0213R299j3825K7190O1397L5086j0838K0359j5818
13935a365570p699P21L8582J2318Q389K5788K318K9105P835R993O145J1143j0913
13922a231845l63K6826R013N376Q609J388L5950K6896P825Q517J0774J0517L2182
$$ plain form
14007 -2195484 -2196213 -2183835 -2162826 -2160983 -2147929 -2103279 -2094470 -2095694 -2075420 -2055539 -2095484 -2065286
13995 -2065286 -2022241 -2001965 -1997341 -2006373 -2004894 -1984927 -1954690 -1941213 -1922240 -1881467 -1852382 -1832395
13983 -1832395 -1812366 -1808816 -1813570 -1785510 -1764575 -1744141 -1764118 -1780735 -1802653 -1832885 -1840595 -1828321
13971 -1828321 -1817480 -1823368 -1821764 -1804088 -1774013 -1755175 -1748441 -1724374 -1733524 -1731627 -1742490 -1703055
13959 -1703055 -1657242 -1634642 -1626385 -1610861 -1585024 -1559237 -1557513 -1546510 -1543393 -1533657 -1498738 -1518637
13947 -1518637 -1526866 -1525872 -1508633 -1478420 -1469121 -1482946 -1455756 -1394359 -1359273 -1370111 -1349752 -1365570
13935 -1365570 -1373269 -1372548 -1333966 -1321648 -1313259 -1287471 -1285153 -1256048 -1248213 -1238220 -1232075 -1220932 -1231845
13922 -1231845 -1232208 -1205382 -1196369 -1190993 -1182384 -1180996 -1145046 -1118150 -1110325 -1101808 -1091034 -1080517 -1048335
13909a048335O563l880j3674J0138P284k715J1988L0150L480r724m832J7566J8558
13896i77433p02p383m801J5073j0918m732M415K3794N374q027J4225J705j0369
13883i59779j0151K6870L6477j96K699j3477l7038j1016J8591K4686m755j4442
13871i41531J1185J8292J3J5906m264l002J6476m415K1909J4093j6573j3256O265
13858h78902j2978K0997L1531o59j0634J6316K6729J7620j5589r595J5791K9028
13846g70345j0426j3720j046J2799r059l6134J7N759L4009M2531L2722L4028l705
13833f82570k7015l321j7492J0215J1403l172K3872L7351l562p579J3443K935
13821f45492L909M0203J3842K5920P215j8002k0840J4690L5132K7229O932M587
$$ plain form
13909 -1048335 -1041772 -1045652 -1059326 -1049188 -1041904 -1044619 -1032631 -1002481 -999001 -1008725 -1013557 -995991 -977433
13896 -977433 -978135 -985518 -990319 -975246 -986164 -990896 -986481 -962687 -957313 -965340 -951115 -949410 -959779
13883 -959779 -969930 -943060 -906583 -906779 -904080 -917557 -954595 -965611 -947020 -922334 -927089 -941531
13871 -941531 -930346 -912054 -912041 -896135 -900399 -903401 -886925 -891340 -869431 -855338 -871911 -885167 -878902
13858 -878902 -891880 -870883 -839352 -840011 -850645 -834329 -807600 -789980 -805569 -815164 -799373 -770345
13846 -770345 -780771 -794491 -795537 -782738 -791797 -827931 -827914 -822155 -788146 -745615 -712893 -678865 -682570
13833 -682570 -709585 -712906 -730398 -720183 -708780 -711952 -688080 -650729 -654291 -661870 -648427 -645492
13821 -645492 -641583 -601380 -587538 -561618 -554403 -572405 -593245 -578555 -543423 -516194 -509262 -504675
13809e04675L1751k226l0411J1191M2672j0873p641K3889J4938j1867l710J489
13797d45473l054P69k072K0514J3261J0158j8388j2722K8560Q982q435L150j4979
13784d19729J56J8200k0734k237J3933Q712M079n099m957K994n031j7306R899
13771d17120N273m307k1077L0952O978l899O378k3175l56K7643m922j619q323
13758d07574J0586Q197j0435k4703L777K7861L9265L2429P117j2387J9095M4j1280
13745c18008j5199k7042j2540K8269J2355J5011j1036j0618K0908L1335K2200
13734b64365p784J0474L2667j0501k6499J966J9915N875Q639k543J0901J5946
13722b05309j0415R235M5823K1110k7587k0779j6771j3537K3630J6742Q54J177
$$ plain form
13809 -504675 -472924 -475150 -505561 -494370 -451698 -462571 -470212 -446323 -431385 -443252 -446962 -445473
13797 -445473 -448527 -447758 -449830 -429316 -416055 -405897 -424285 -437007 -408447 -399465 -407900 -404750 -419729
13784 -419729 -419573 -401373 -422107 -424344 -410411 -401699 -397620 -402719 -407676 -404682 -409713 -427019 -417120
13771 -417120 -411847 -416154 -437231 -406279 -399301 -403200 -396822 -419997 -420353 -392710 -397632 -399251 -407574
13758 -407574 -396988 -388791 -399226 -423929 -420152 -392291 -353026 -320597 -313480 -325867 -306772 -306728 -318008
13745 -318008 -333207 -360249 -372789 -344520 -332165 -317154 -328190 -338808 -317900 -286565 -264365
13734 -264365 -272149 -261675 -229008 -239509 -266008 -264042 -244127 -238252 -229613 -232156 -221255 -205309
13722 -205309 -215724 -206489 -160666 -139556 -167143 -187922 -204693 -218230 -194600 -177858 -177004 -175827
13710a75827j5596l696L9300L4673o113j397N036j2457o608K421K8159K7782j2656
13697i6979j8810J1943L2751J9557O392j1022K176J966j2348K260J5674r327J0674
13684d5093j4075j5170J8461J2756K0414K6141K622M334j3574k5023K985L5874
13672A0652J5162m682n714L457J494j532K438Q566K2193M5109R791M603j0168
13659A01369j3607j7853j7479L645L2755J077j7653k1636K4280K8585Q352O575
13647A18410m670Q640J8793j4957L744K7948N985n482q267L0555J8416Q43M208
13634B04166k809l22m053k1918k52J4302K1069K4175j0790j8261J299l0729J0402
13621A86279L4106K4823q708l5885p301J8972p545J5153L769Q785R688k1740k1682
$$ plain form
13710 -175827 -191423 -195119 -155819 -121146 -127259 -128656 -123620 -136077 -142685 -140264 -112105 -84323 -96979
13697 -96979 -115789 -103846 -71095 -51538 -45146 -56168 -53992 -52026 -64374 -62114 -46440 -55767 -45093
13684 -45093 -59168 -74338 -55877 -43121 -22707 3434 6056 10390 -3184 -28207 -25222 10652
13672 10652 25814 21132 15418 18875 20369 18837 21275 29841 52034 97143 106934 111537 101369
13659 101369 87762 69909 52430 56075 88830 89907 72254 50618 74898 103483 111835 118410
13647 118410 113740 122380 141173 126216 129960 157908 163893 158411 150144 180699 199115 199958 204166
13634 204166 201357 201035 196982 175064 174812 189114 210183 234358 223568 205307 206606 175877 186279
13621 186279 220385 245208 236500 200615 193314 212286 204741 219894 223663 232448 242136 220396 198714
13608A98714l3130K5704L7086J8141K1502l293p89K1482l0772j6516J6218J8890
13596B73237j2304L380J1530j4780K633M972j1658N928J5295R185J1371O202m170
13583C00821j6742j2793K384K6000j2723j6078j4234M927K7467L4111m403J634
13571C20371K5946L58J5950l3764k5248Q92O438L4976J9330J5878j5216k1063
13559C44848P496O337J1135K1120K7694J3646k8146j3041j2642k765J92M984J6039
13546C96897J8267O146k1738l421J1741N5205K8447k8213l4367j1820L315O183
13534D26642n87J308j1342J6221K6369r609Q5l687J7436J6248K405k5720j005
13521D54764o109J3216J1491P667r184L531L666r69J2965j2606K1341Q208j4971
$$ plain form
13608 198714 165584 191288 228374 246515 268017 264724 263935 285417 254645 238129 254347 273237
13596 273237 260933 264313 275843 261063 263696 268668 257010 262938 278233 287418 298789 304991 300821
13583 300821 284079 271286 273670 299670 286947 270869 256635 261562 289029 323140 318737 320371
13571 320371 346317 346675 362625 328861 303613 304505 310943 345919 365249 381127 365911 344848
13559 344848 352344 358681 369816 390936 418630 432276 404130 391089 378447 375682 375874 380858 396897
13546 396897 415164 421310 399572 396151 407892 463097 491544 463331 428964 417144 420459 426642
13534 426642 426055 427363 416021 432242 458611 449002 449087 445400 462836 479084 481489 455769 454764
13521 454764 448655 461871 473362 481029 471845 475376 479042 478073 491038 478432 499773 507981 493010
13508D93010j689L0585j0513o587L6036K7045k462n1064q504K3200J0954m267
13496E35744o613q436L4933R84k7035l0969K9155L5174K2242l309q062O568j5498
13483E64878p160J0619M8668L0912J3986J7109p473m9737j0682L117l893K849
13471F13193j2628L880J315N893R46k7267k893R796M009M4118M586O279K1877
13458F73104R845k5090n916K0316l872r103j4166k4234J5641N8724K6453j3301
13446G08401k730J3021K007J88k7203q108J9456J6527M7399K313l3080l1782J2959
13433G19368p020J6790K1068j0297k1898k9310j855J1815q090Q521J1958O950
13421G18000l3055j5784j4425J7484K1566L6216J9080J0954o549l8940N29K2061
$$ plain form
13508 493010 491321 521906 511393 504806 540842 567887 565425 514361 505857 529057 540011 535744
13496 535744 529131 520695 555628 556612 529577 498608 527763 562937 585179 581870 573808 580376 564878
13483 564878 557718 568337 617005 647917 661903 679012 671539 621802 611120 614237 610344 613193
13471 613193 600565 604445 605760 611653 612599 585332 582439 592235 596244 640362 644948 651227 673104
13458 673104 682949 657859 651943 672259 668387 659284 645118 620884 636525 695249 721702 708401
13446 708401 705671 718692 720699 720887 693684 685576 705032 721559 768958 771271 738191 706409 719368
13433 719368 712348 729138 750206 739909 718011 688701 686846 698661 690571 699092 711050 718000
13421 718000 684945 669161 654736 672220 693786 730002 749082 760036 753487 714547 715076 737137
13409G37137K5808Q052N505M461k6413j9806J8969M5600l579m611k1375j7454
13397G52294r674M169L852L5724K2647k818K337k0940j2007J0374J5190J7833
13385H18981P838J0987K6903M3695n866k2539N278j6376l1522K93m185J8349K8765
13372H80601N570l1227j8537j8453J6970P185j2199j1503K2890L2244j9779k0271
13360H33491O828K6733J8947j0207j1672l191L7842J9128j3139n250j0255j1069
13348H78186Q277K9315k681R948m563N743J2517l5692N930k0043o231J2189K6433
13335I19328p20K5361K8049J0393p36j0281j180m457l1812j8951j9892R369J1808
13322I16279r017K105M8348K2875l114O415J0906J2743J0478o548N767k2481J2382
$$ plain form
13409 737137 762945 770997 776502 780963 754550 734744 753713 799313 795734 791123 769748 752294
13397 752294 742620 746789 750641 786365 809012 806194 808531 787591 775584 785958 801148 818981
13385 818981 826819 837806 864709 908404 902538 879999 885277 868901 837379 837672 833487 851836 880601
13372 880601 886171 854944 836407 817954 834924 842109 829910 818407 841297 873541 853762 833491
13360 833491 840319 867052 885999 875792 864120 860929 898771 917899 904760 899510 889255 878186
13348 878186 886463 915778 913097 923045 918482 924225 936742 901050 906980 886937 880706 892895 919328
13335 919328 918608 943969 972018 982411 981675 971394 970214 965757 933945 914994 895102 904471 916279
13322 916279 907262 909367 957715 980590 977476 983891 994797 1007540 1018018 1011470 1017237 994756 1007138
13309A007138J2352N351J9130M138j0863O77o569j3211m9716l4647J8027O005
13297I57812Q572n672j9833q905M2041J1977j4197J9978J1893k484l534J4693
13285A012341K3006L627n152J8406N750P850J8394k6685M732J4554K7189K3125
13273A127137J3239k0797l8734l3888M842l4910j6068J9546K9963L224j698J844
13261A053700j2855k979j1602K903J1422J5302K9818N277j1556q674p982Q792
13249A071566K2005m702J4018L412K3662N87n808o398k0531n331O374J8645J2475
13236A129974j4040R979J1352P669J2135k972K713m475m279j5838q632M049j195
13223A126440L366J8563K7085L1498o774J5028j7689J1999j12P981L697O360J9059
$$ plain form
13309 1007138 1019490 1024841 1043971 1048109 1037246 1037923 1031354 1018143 968427 933780 951807 957812
13297 957812 966384 960712 940879 931974 974015 985992 971795 991773 1003666 1001182 997648 1012341
13285 1012341 1035347 1038974 1033822 1052228 1057978 1065828 1084222 1057537 1062269 1076823 1104012 1127137
13273 1127137 1140376 1119579 1080845 1046957 1051799 1016889 1000821 1020367 1050330 1053554 1051856 1053700
13261 1053700 1040845 1037866 1026264 1029167 1040589 1055891 1085709 1090986 1079430 1070756 1062774 1071566
13249 1071566 1093571 1088869 1102887 1106299 1129961 1130548 1124740 1118342 1097811 1092480 1098854 1117499 1129974
13236 1129974 1115934 1125913 1137265 1144934 1157069 1154097 1156810 1152335 1148056 1132218 1123586 1127635 1126440
13223 1126440 1129806 1148369 1175454 1206952 1200178 1215206 1197517 1209516 1209404 1217385 1221082 1227442 1246501
13210A246501j3460J6203L1890K502j9001m721L422j9834J4385L1448K3323j4244
13198A298414L054L9398j9409j5259P81M6340K8631L2152j3950j317K6165M1445
13186A466445L9188j3863Q730N0454N4518q801j27513j86470j55677o8461N299
13175A063849J7721R465K2810L1625K504J1658J4203K7061K7373L5363L8527M229
13163A306388J6505K1779M14J6850K0372K0663j4182J2159K6697K4955N478J1705
13151A469783l178n45M6800K3460K4694K1134M1498Q6386K6988O4822O5721N5781
13139A923344Q0880J34061J03707m6464k61238m75115n65553l55112j02504K5608
13129D61614Q0965P4803P7012O8550Q7346Q8545N8102N7687J7321K2469J6714
$$ plain form
13210 1246501 1233041 1249244 1281134 1283636 1264635 1259914 1263336 1243502 1257887 1289335 1312658 1298414
13198 1298414 1301468 1340866 1321457 1306198 1306979 1353319 1381950 1414102 1400152 1398835 1425000 1466445
13186 1466445 1505633 1491770 1500500 1550954 1605472 1596671 1469158 1282688 1127011 1058550 1063849
13175 1063849 1081570 1091035 1113845 1145470 1147974 1159632 1173835 1200896 1228269 1263632 1302159 1306388
13163 1306388 1322893 1344672 1345086 1361936 1382308 1402971 1388789 1400948 1427645 1452600 1458078 1469783
13151 1469783 1466605 1466060 1512860 1536320 1561014 1582148 1623646 1710032 1737020 1801842 1867563 1923344
13139 1923344 2004224 2138285 2241992 2195528 1934290 1459175 893622 538510 436006 461614
13129 461614 542579 617382 694394 762944 850290 938835 996937 1054624 1071945 1094414 1111128
13118A111128L1538J2009l695m75L0154M1936K8543N093J8184R721J6188J2081
13106A312405M6582M0464K7882j461L4599L6025M1073J3271N9728O3412O6280
13095A740260J07808J03913R8965J00523J3440j78708m63282n96321m74066j86024
13085B66508L8041J06582J26945J00639P0510P2335M2877K4371M7728L3694N4188
13074I84418K7375J9499K9081J1760L737j8447J4090L0672K3725L0443O877J2334
13062A175564K6993J6101L4891J9020l0864J705K6782N1402M8725j0318l4360
13051A325641J7572L7828N9022M0512L6737K7005m8652j13931j84135j89902q5975
13040I21722j8357P0859Q0340M7681R204K2967K2363J0823O591K9551J5965J7858
$$ plain form
13118 1111128 1142666 1154675 1150980 1150505 1180659 1222595 1251138 1256231 1274415 1284136 1300324 1312405
13106 1312405 1358987 1399451 1427333 1425872 1460471 1496496 1537569 1550840 1610568 1673980 1740260
13095 1740260 1848068 1951981 2050946 2151469 2164909 1986201 1522919 926598 452532 266508
13085 266508 304549 411131 538076 638715 709225 781560 824437 848808 896536 930230 984418
13074 984418 1011793 1031292 1060373 1072133 1075870 1057423 1071513 1102185 1125910 1156353 1163230 1175564
13062 1175564 1202557 1218658 1253549 1272569 1241705 1243410 1270192 1321594 1370319 1360001 1325641
13051 1325641 1343213 1381041 1440063 1480575 1517312 1544317 1495665 1381734 1197599 1007697 921722
13040 921722 903365 974224 1054564 1102245 1111449 1134416 1156779 1167602 1174193 1203744 1219709 1237567
13028A237567q246k9954Q734p789J4424K688M972o471J5853J9284m21J965J0228
13015A262834L694J9902P615N051J7151L183o672j9739j1732J2292K1156J8025
13003A332760L440L381O536j6010J0289J5j9420k455L2309K6284O557P080n369
12990A385397M88P302L394J6331J6629J956j9200r314Q378j0469K0874J6196j4936
12977A423026k3428K818q713p163L1366R257J2065L9676k829j427J262J54j0207
12964A465857L351J4271j8627k0833J1459J5603K2194Q423r636K7509K3723j2101
12952A531193p034j3815Q773m996j20Q104Q321J3393q763k0411J254K2265p357
12939A530807j557J387L85P906K0899K6827J7178P839K1422K067O796K688j5467
$$ plain form
13028 1237567 1229321 1199367 1208101 1200312 1214736 1217424 1222396 1215925 1231778 1251062 1250641 1252606 1262834
13015 1262834 1266528 1286430 1294045 1299096 1316247 1319430 1312758 1293019 1281287 1293579 1314735 1332760
13003 1332760 1336200 1339581 1346117 1330107 1340396 1340411 1320991 1318536 1350845 1377129 1383686 1390766 1385397
12990 1385397 1385885 1393187 1396581 1412912 1429541 1431497 1412297 1402983 1411361 1400892 1421766 1437962 1423026
12977 1423026 1399598 1402416 1393703 1386540 1417906 1427163 1439228 1478904 1476075 1474648 1475910 1476064 1465857
12964 1465857 1469208 1483479 1464852 1444019 1455478 1471081 1493275 1501698 1492062 1519571 1543294 1531193
12952 1531193 1524159 1510344 1519117 1514121 1514001 1522105 1530426 1543819 1535056 1514645 1515899 1538164 1530807
12939 1530807 1529250 1530637 1531022 1538928 1559827 1586654 1603832 1611671 1633093 1635160 1641956 1644644 1629177
12926A629177k3252P723R512J0634N397n77Q898J7703J6407J4069J2907j093K4610
12913A732115m333J6279J7278K5083j8684k8908l4994p9089r4391k8936k3471
12902A477949k5925M302K8545J030M470L1111J3180J8890M731K4567K7330M2434
12890A652614J3609k9949k9027k2166J4966J0623K7235K5966q165r237K5585J2802
12878A684856M947J8820Q527o049l078l322L0355L9591K2331K4265l3063n1972
12866A736208m7652m5797o9958m2377l7562k0755J8572M8994J8117K2365M481
12855A584636K4957N638k1786r660P035J9852J4623q042J6185J0955P204J3902
12843A665499K707j7784K220M638J346K1600Q23m4813j0033K4862L3402p702L659
$$ plain form
12926 1629177 1605925 1613648 1623160 1633794 1639191 1638614 1647512 1665215 1681622 1695691 1708598 1707505 1732115
12913 1732115 1727782 1744061 1761339 1786422 1767738 1738830 1703836 1624747 1530356 1501420 1477949
12902 1477949 1452024 1456326 1484871 1485901 1490371 1521482 1534662 1553552 1558283 1582850 1610180 1652614
12890 1652614 1666223 1636274 1607247 1585081 1600047 1610670 1637905 1663871 1655706 1646469 1672054 1684856
12878 1684856 1689803 1708623 1717150 1711101 1708023 1704701 1735056 1774647 1796978 1821243 1788180 1736208
12866 1736208 1688556 1642759 1572801 1530424 1492862 1472107 1490679 1539673 1557790 1580155 1584636
12855 1584636 1609593 1615231 1593445 1583785 1590820 1610672 1625295 1617253 1633438 1644393 1651597 1665499
12843 1665499 1668206 1650422 1652642 1657280 1658626 1680226 1681049 1636236 1626203 1651065 1684467 1676765 1680424
12830A680424N469j430L8321O829j6369j7594K1012J3913j2763j4229n237M463
12818A702809q099N860L406K1071L395j2242j1760J6876J3655K1830j5454j4179
12806A727168R409K5277N114j1059N05J2390J1291N47l31k306k853L707K011L918
12792A784788K5662M7098l1940q014Q867l1659j222N1505O190k3962l5514K0622
12780A812421P920j6653l198Q480m378L6709J9419K7591J9290k3602j2462J5935
12768A887472J1508K453j7019m027J3829m629j3670l923j665k193N249J6172L7877
12755A927434K9763l5175n2791o976L2039K5156J1590K6640Q914O223O129k368
12743A976578j3115K5290Q589k9036K0109K9432r540n3630j4298O049K2540J6854
$$ plain form
12830 1680424 1685893 1684463 1722784 1729613 1713244 1695650 1716662 1730575 1717812 1703583 1698346 1702809
12818 1702809 1694710 1700570 1703976 1725047 1728442 1716200 1704440 1721316 1734971 1756801 1741347 1727168
12806 1727168 1736577 1761854 1766968 1755909 1756414 1768804 1780095 1780642 1780311 1778005 1775152 1778859 1780870 1784788
12792 1784788 1810450 1857548 1825608 1817594 1826461 1794802 1793580 1845085 1851275 1827313 1791799 1812421
12780 1812421 1820341 1803688 1800490 1808970 1804592 1841301 1860720 1888311 1907601 1883999 1871537 1887472
12768 1887472 1898980 1901433 1884414 1880387 1894216 1889587 1875917 1871994 1870329 1868136 1873385 1889557 1927434
12755 1927434 1957197 1922022 1869231 1862255 1894294 1919450 1931040 1957680 1966594 1972817 1978946 1976578
12743 1976578 1963463 1988753 1997342 1968306 1988415 2017847 2008307 1954677 1940379 1946428 1968968 1985822
12731A985822J1475K4208k0352l9791L503J4461j0983p454J0138j1767j9989L6377
12719A975648L1410q083m970j6570O533J370J240P982O787j1685K6903L2360K352
12706B051277m060k7884K400m833R213J6321K1715K7984j2252N627L9051L433
12694B127992J3011j6111j6185r732j8791K1918j7746j8130J2616L486r416J4786
12682B087698J6036N053K445o65q384k092O026M480R805M708l910R057Q956k0802
12668B118411k4382J036M955K4344M142j417K7112K5824J013j6509o860j0089
12656B147580o223K3681J7573M534m073j6388m136k189m34p533j545K0654K8833
12643B200334J2387j5406k0801j394J51J5921L3437j3544j7567N824K8124J1524
$$ plain form
12731 1985822 1997297 2021505 2001153 1961362 1964865 1979326 1968343 1960889 1971027 1959260 1939271 1975648
12719 1975648 2007058 1998975 1994005 1977435 1983968 1985338 1986578 1994560 2001347 1989662 2016565 2048925 2051277
12706 2051277 2047217 2019333 2021733 2016900 2026113 2042434 2064149 2092133 2079881 2085508 2124559 2127992
12694 2127992 2141003 2124892 2108707 2098975 2080184 2102102 2084356 2066226 2078842 2082328 2072912 2087698
12682 2087698 2103734 2108787 2111232 2110567 2102183 2100091 2106117 2110597 2120402 2125110 2121200 2130257 2139213 2118411
12668 2118411 2094029 2095065 2100020 2124364 2128506 2127089 2154201 2180025 2181038 2164529 2157669 2147580
12656 2147580 2141357 2165038 2182611 2187145 2183072 2166684 2162548 2160359 2159925 2152392 2150847 2171501 2200334
12643 2200334 2212721 2197315 2176514 2175120 2175271 2191192 2224629 2211085 2193518 2199342 2227466 2238990
12631B238990k9615k5436J7871J2331j1602r933M1001M8255J1993k2559k7188
12620B244108J641j2386k0038r660q834O014J2293P046o58P745Q919L2358K6882
12607B295430k1192j7554J9448K1024K1748J7970Q457k8822k8617Q71M7561M008
12595B340332j113J7158k243R572l0036r439j698l5413J1215J7033Q198J0523
12583B334089J7602k4976j3772K072R785J6798M5777K6704L48j32l0174K361J858
12570B388340M156l0123q481j3931r256Q828K4714M1808n873j6728r454j45N891
12557B379746j5251j8445J3787k793k0622p042M2578K221m703N69N0379N0040
12545B470464q678j3566p774l486r02J8335q776q824j158q182k9016J070J8950
$$ plain form
12631 2238990 2209375 2183939 2201810 2214141 2202539 2192606 2233607 2281862 2293855 2271296 2244108
12620 2244108 2245749 2233363 2213325 2203665 2194831 2200845 2213138 2220184 2219526 2227271 2236190 2268548 2295430
12607 2295430 2274238 2256684 2276132 2297156 2318904 2336874 2345331 2316509 2287892 2288763 2336324 2340332
12595 2340332 2339219 2356377 2354134 2363706 2333670 2324231 2322533 2287120 2298335 2315368 2323566 2334089
12583 2334089 2351691 2326715 2312943 2315015 2324800 2341598 2387375 2414079 2414427 2414295 2384121 2386482 2388340
12570 2388340 2392496 2362373 2353892 2339961 2330705 2339533 2364247 2406055 2400182 2383454 2374000 2373855 2379746
12557 2379746 2364495 2346050 2359837 2357044 2336422 2329380 2371958 2374179 2369476 2370045 2420424 2470464
12545 2470464 2461786 2448220 2440446 2436960 2436058 2454393 2445617 2436793 2435635 2427453 2398437 2399507 2418457
12532B418457K6061J9646k293J9930n314K888J6590p681k5147p150L4049K0847
12520B510883k80J1592j0904k2993O894O120J6163O572q586j6128k5462J1787
12508B485658R313J0826J1060J0938j4465L2954K1795M487J5310j976J338m762
12496B582476q45J3086n0069m2617n33N529K7318L9019M783J1637k179n27o859
12483B580219J2145M821J3412J1521J0414N682j6466k1735K7488R400J612Q802
12471B647315k420j569K9699M1829k7709J201n37l8352J4223J0814k5604j1342
12459B637548K1823M0530K6320K5582j3999j8025R260P435O330l801l2603l9990
12447B666410n098J312R466O73J8996M7757k258k1975j3214K3816P106J9095J3315
$$ plain form
12532 2418457 2444518 2464164 2461871 2481801 2476487 2479375 2495965 2488284 2463137 2455987 2490036 2510883
12520 2510883 2510603 2522195 2511291 2488298 2495192 2501312 2517475 2524047 2515461 2499333 2473871 2485658
12508 2485658 2494971 2505797 2516857 2527795 2513330 2546284 2568079 2572566 2587876 2585900 2587238 2582476
12496 2582476 2581631 2594717 2544648 2502031 2501498 2507027 2534345 2573364 2578147 2589784 2587605 2587078 2580219
12483 2580219 2592364 2597185 2610597 2622118 2632532 2638214 2621748 2600013 2627501 2636901 2638513 2647315
12471 2647315 2644895 2643326 2673025 2714854 2687145 2688346 2687809 2649457 2663680 2674494 2648890 2637548
12459 2637548 2659371 2699901 2726221 2751803 2737804 2719779 2729039 2736474 2742804 2739003 2706400 2666410
12447 2666410 2661312 2662624 2672090 2672763 2691759 2739516 2737258 2715283 2702069 2725885 2732991 2752086 2765401
12434B765401k1979l0272K0516J2909k1821M75L2104K4644K0430J7740K8229r182
12422B839194m623k7016M996N334J995j6995j7750q626J3402K2150M0959L0280
12410B883300O659J0756K4461R285J9849J2681Q928J3925P445o009j4487j2833
12398B963960m6629j5848l31K154M1770N2020K4955o891j729k9049j5078K9856
12386B999160M4660L7835K9820j1446p56k1110n5554J1278j7753J6564N1621J5283
12374C099602j603j6182M957K1521k140M36K1943L6688J0574K514P937k3845l432
12361C158970J4335J5745p272k2693K9484J6638K7956J9265q544j2582R544J0652
12349C251498J7984L594O809n60k4609m786K3799K5416K4426J9370K2057L486
$$ plain form
12434 2765401 2743422 2713150 2733666 2746575 2724754 2725229 2757333 2781977 2802407 2820147 2848376 2839194
12422 2839194 2834571 2807555 2812551 2817885 2819880 2802885 2785135 2776509 2789911 2812061 2853020 2883300
12410 2883300 2889959 2900715 2925176 2934461 2954310 2966991 2975919 2989844 2997289 2991280 2976793 2963960
12398 2963960 2917331 2901483 2901152 2903306 2945076 2997096 3022051 3015160 3013431 2984382 2969304 2999160
12386 2999160 3043820 3081655 3111475 3100029 3099273 3078163 3022609 3033887 3016134 3032698 3084319 3099602
12374 3099602 3097999 3081817 3086774 3108295 3106155 3106591 3128534 3165222 3175796 3178310 3186247 3162402 3158970
12361 3158970 3173305 3189050 3181778 3159085 3188569 3205207 3233163 3252428 3243884 3231302 3240846 3251498
12349 3251498 3269482 3273076 3279885 3279325 3254716 3249930 3273729 3299145 3323571 3342941 3364998 3368484
12337C368484M590P165k1076r969M9673k724J3493O2640K4240k4326j2524Q038
12325C467704r923J9686J7883j0415P920J1308K1254J8105j5702N208K9002J8149
12313C580179j37n674r331K2695P0400K5135j0997P343R666j7937R693J5365L7410
12300C733810K7042K8605j523j0381j3147M896M8087J1859L3385L7548R456J7684
12288C927321k204j8094K4007N4913N5752M6377K5227M523j5586J1258L8684J38
12276D152316M837L3817K9396L5860O5191N0519M2353L8145R197Q622J2040M1003
12264D523296L5448N5914O5489M9129N3308O3253M9482M9711P0395M0525L2061
12253E088011N3010K5072N7602O2825J8498q153K3730P0226P7575O2123J04790
$$ plain form
12337 3368484 3373074 3380239 3359163 3349194 3398867 3396143 3409636 3472276 3496516 3472190 3459666 3467704
12325 3467704 3457781 3477467 3495350 3484935 3492855 3504163 3525417 3543522 3527820 3533028 3562030 3580179
12313 3580179 3580042 3574368 3565037 3587732 3658132 3683267 3672270 3679613 3689279 3671342 3681035 3696400 3733810
12300 3733810 3760852 3789457 3787934 3777553 3764406 3769302 3817389 3829248 3862633 3900181 3909637 3927321
12288 3927321 3925117 3907023 3931030 3985943 4041695 4088072 4113299 4117822 4102236 4113494 4152178 4152316
12276 4152316 4157153 4190970 4220366 4256226 4321417 4371936 4414289 4452434 4461631 4470253 4482293 4523296
12264 4523296 4558744 4614658 4680147 4729276 4782584 4845837 4895319 4945030 5015425 5055950 5088011
12253 5088011 5141021 5166093 5223695 5286520 5305018 5296865 5320595 5390821 5468396 5530519 5635309
12242E635309J05884Q1085Q5109J12988J06958Q1750Q0029J21944J08054J48481
12232F667591J56170J95298K12702K44751L09559L37188L47436L77270L91051
12223I239016K88830O4366k66638p03163j125402j493753j655985j577087j250569
12214A519615q48988m14918p9278J10179K22662K42508K58135K12510K21027K22987
12204A666439K09506J73351K06326K18836K17355K03190K37012K30770K16394
12195C579179K14123K53518K39324K19327K37703K86500K99393L27949L62827
12186F019843L45848K73336N9366l53890j002945j758810k294761k328536j791283
12177b831832j019959l22651J37264L42846M15520M18615L89013L57149L49173
$$ plain form
12242 5635309 5741193 5822278 5907387 6020375 6127333 6209083 6289112 6411056 6519110 6667591
12232 6667591 6823761 7019059 7231761 7476512 7786071 8123259 8470695 8847965 9239016
12223 9239016 9527846 9592212 9325574 8622411 7497009 6003256 4347271 2770184 1519615
12214 1519615 670627 255709 176431 286610 509272 751780 1009915 1222425 1443452 1666439
12204 1666439 1875945 2049296 2255622 2474458 2691813 2895003 3132015 3362785 3579179
12195 3579179 3793302 4046820 4286144 4505471 4743174 5029674 5329067 5657016 6019843
12186 6019843 6365691 6639027 6698393 6344503 5341558 3582748 1287987 -1040549 -2831832
12177 -2831832 -3851791 -4174442 -4037178 -3694332 -3278812 -2860197 -2471184 -2114035 -1764862
12168a764862K89085K21680J57163J81819J77269J36667R5954J07972J12587R3855
12158a90811R4074Q7762J05485R4233P7559Q8241Q5325P6109N8266P9500N9480
12147G15223N5179L7629N4370P7626J08330O6000L5407L7262M1095M7963M7840
12136A323924N6916M3024K8256L7873K7592L7911M9001K9847L7263M4344K6742
12125A742693K7802J9556L6732K0512J4866P703M6074K9447J7699J7867K2092
12114B003043M6846P2065J9917J6049J1848P521k333M5449L7692L3236N622J6212
12102B313167J9748J0474l576R934L9128M0313J5839J1864L1866m51N269L0403
12090B523978R365R145L770j594q79K401L3226L3292J6595K1555L1999J7488J5046
$$ plain form
12168 -1764862 -1475777 -1254097 -1096934 -915115 -737846 -601179 -505225 -397253 -284666 -190811
12158 -190811 -96737 -8975 96510 190743 268302 356543 441868 517977 576243 655743 715223
12147 715223 770402 808031 862401 940027 1048357 1114357 1149764 1187026 1228121 1276084 1323924
12136 1323924 1380840 1423864 1452120 1489993 1517585 1555496 1604497 1634344 1671607 1715951 1742693
12125 1742693 1770495 1790051 1826783 1847295 1862161 1869864 1915938 1945385 1963084 1980951 2003043
12114 2003043 2049889 2121954 2141871 2157920 2169768 2177289 2174956 2220405 2258097 2291333 2296955 2313167
12102 2313167 2332915 2343389 2339813 2349747 2388875 2429188 2445027 2456891 2488757 2488306 2493575 2523978
12090 2523978 2533343 2542488 2546258 2544664 2543785 2546186 2579412 2612704 2629299 2650854 2682853 2700341 2715387
12077B715387l138N344K5232L7524J9233k8073M952K1276L28r926J5834P856l450
12064B808379j7341L40L1537M3745K0552p718J2993l080k3294p587R234K3285
12052B891045J4575N45K5310N370K3992J9247K2047J5328J668J967J6895O413
12040C044402K4717K5676L1007K5316L091K1619K7992J4690l44j0457O735R944
12028C224388J6178j2463n796m0562j0915K2206M334N1172L1708j0035l39L2174
12016C302050L4533N7296M981k103Q945R68n34J0053K8926J5669N4046L9271O031
12003C560132k4392l7796O190N1300M3457J4436p095n334j5776m284l4891m61
11991C545486j1375k8321K5429L3547J4040L866k0208k577L4640J5862m1541k4565
$$ plain form
12077 2715387 2712249 2717593 2742825 2780349 2799582 2771509 2776461 2797737 2798065 2788139 2803973 2811829 2808379
12064 2808379 2791038 2791378 2822915 2866660 2887212 2879494 2892487 2889407 2866113 2858526 2867760 2891045
12052 2891045 2905620 2906165 2931475 2936845 2960837 2980084 3002131 3017459 3019127 3021094 3037989 3044402
12040 3044402 3069119 3094795 3125802 3151118 3154209 3175828 3203820 3218510 3218166 3207709 3214444 3224388
12028 3224388 3240566 3228103 3222307 3181745 3170830 3193036 3197370 3248542 3280250 3270215 3269876 3302050
12016 3302050 3336583 3393879 3398860 3396757 3405702 3406670 3406136 3416189 3445115 3460784 3514830 3554101 3560132
12003 3560132 3535740 3497944 3504134 3555434 3598891 3613327 3606232 3600898 3585122 3580838 3545947 3545486
11991 3545486 3534111 3505790 3531219 3564766 3578806 3582672 3562464 3559887 3594527 3610389 3568848 3544283
11979C544283j852K2689K3437q593j1514J4387K8082K2990J3096k2059m593j056
11967C619297K260l603r507J6116r360J83o919J2999Q512R365J4575L0716L4691
11954C719325M0930K1523m31L8886K2928j5321r64P686M3398L3275J4118p060
11942C918293L9483K5388P18J6098j168J1918M20q435K2687K4496J9354l083L1135
11929D097304O588N027O540K6281R196J5445K8377J7151L3972j1402J6198L0719
11917D281396O702K0803j0996k995K3471j7617K0014O503p465n938k0659q799
11905D284420K1385p225O031M4519L3886L5876J8402k9596J0920K7385m4176k3605
11893D378222L1482K0560K8460j4869l3810J20L1362J2338j1995L8113L6619K5189
$$ plain form
11979 3544283 3542431 3565120 3588557 3579964 3568450 3582837 3610919 3633909 3647005 3624946 3620353 3619297
11967 3619297 3621557 3617954 3608447 3624563 3615203 3615386 3608467 3621466 3629978 3639343 3653918 3684634 3719325
11954 3719325 3760255 3781778 3781347 3820233 3843161 3827840 3826876 3834562 3877960 3911235 3925353 3918293
11942 3918293 3957776 3983164 3983882 3999980 3998812 4010730 4011150 4002715 4025402 4049898 4069252 4066169 4097304
11929 4097304 4103892 4108919 4115459 4141740 4150936 4166381 4194758 4211909 4245881 4234479 4250677 4281396
11917 4281396 4288098 4308901 4297905 4294910 4318381 4300764 4320778 4327281 4319816 4313878 4293219 4284420
11905 4284420 4305805 4298580 4304611 4349130 4383016 4418892 4437294 4407698 4418618 4446003 4401827 4378222
11893 4378222 4409704 4430264 4458724 4443855 4410045 4410165 4441527 4453865 4441870 4479983 4516602 4541791
11881D541791N576K2332J3186j922m286K2714J8594R477K3204K7045J5717J5678
11869D709106J6435n161K146L3619M4529K5499M739J8878N5753M1656O848J266
11857D955313k508l2631L3081L7664K7724M905M1525K8239K0599K1036Q467L3877
11845E177291J1489R645o679Q796R900M5351K9679K7204K4777l361J0075K6081
11833E370248K329l298K4558M0752J3527P407Q540k652J4116J3801k9547K403
11821E462184M8372K9213L5664j167K0199J9443r070q695R753K0527K8086L2763
11809E687272m132K3837J0735J7612j756J7898J7279K7829O0125M2423K8103J8560
11797E945785K0062M6326J6167J4506k7586m735N5843N6186L9022O0941K4061
$$ plain form
11881 4541791 4547367 4569699 4582885 4580963 4576677 4599391 4617985 4627462 4650666 4677711 4693428 4709106
11869 4709106 4725541 4720380 4722526 4756145 4800674 4826173 4830912 4849790 4905543 4947199 4954047 4955313
11857 4955313 4952805 4920174 4953255 4990919 5018643 5023548 5065073 5093312 5113911 5134947 5143414 5177291
11845 5177291 5188780 5198425 5191746 5200542 5210442 5255793 5285472 5312676 5337453 5334092 5344167 5370248
11833 5370248 5372577 5369279 5393837 5434589 5448116 5455523 5464063 5461411 5475527 5489328 5459781 5462184
11821 5462184 5510556 5539769 5575433 5574266 5594465 5613908 5604838 5596143 5605896 5626423 5654509 5687272
11809 5687272 5683140 5706977 5717712 5735324 5733568 5751466 5768745 5796574 5856699 5899122 5927225 5945785
11797 5945785 5965847 6012173 6028340 6042846 6015260 6010525 6066368 6122554 6161576 6222517 6246578
11786F246578K4221q982M4546O110L1834L8145J2025r291J4752M9604M3682N6888
11774F550112M3445J1061K3923R079Q658M6694N7260K6027K6331N9637J4287k4755
11762F851759K8750L7887K4640N2968N7700L6731K2642L4342J7625K8500K3344
11751G216888L4064N4103N5054M9105O7405M8918K8437J9064L5548O6293L2369
11740G707248K1704O0757O3130M5672M1344O8395N6911K1165J9539N2314M4602
11729H202781L2129L4067N7575M8305K3314M4987O8281M3153L8680N6664P3826
11718H723762Q9912N8679L6729P8057O4838O6806O7183P6559J01704Q6845Q3643
11707I534717P4826Q1439Q8938Q2291N8417J15501J15998R4881J03292J18055
$$ plain form
11786 6246578 6270799 6261817 6306363 6312473 6344307 6382452 6394477 6385186 6399938 6449542 6493224 6550112
11774 6550112 6593557 6604618 6628541 6637620 6646278 6692972 6750232 6776259 6802590 6862227 6876514 6851759
11762 6851759 6880509 6918396 6943036 6996004 7053704 7090435 7113077 7147419 7165044 7193544 7216888
11751 7216888 7250952 7305055 7360109 7409214 7476619 7525537 7553974 7573038 7608586 7674879 7707248
11740 7707248 7728952 7789709 7852839 7898511 7939855 8008250 8065161 8086326 8105865 8158179 8202781
11729 8202781 8234910 8268977 8326552 8374857 8398171 8443158 8511439 8554592 8593272 8649936 8723762
11718 8723762 8813674 8872353 8909082 8987139 9051977 9118783 9185966 9262525 9364229 9451074 9534717
11707 9534717 9609543 9690982 9779920 9862211 9920628 10036129 10152127 10247008 10350300 10468355
11697A0468355J20727J05176R2669J13200J33822J10422J10130J42389J29551
11688A1526441J23599J00140J32033J75788J79474J44466J59530K02963K12334
11679A2956768K29103K27083K07752K36471K49071K14871K20919K48594K64329
11670A5054961K72855K97731L04172L04868K88202K33204J76642J50711J69373
11661A7252719J68454K10425L09805L93158M48312M99689N22118N30531N18720
11652B0853931N44144M45631K49121M7635j90684n13715r04790j395993j912693
11643A7222587k245387k116326j645279j051705n64430k76635j87078j52526j69922
11634H813299k99828m12241n65300q35655j185511j565591j869198j874710j599005
$$ plain form
11697 10468355 10589082 10694258 10786927 10900127 11033949 11144371 11254501 11396890 11526441
11688 11526441 11650040 11750180 11882213 12058001 12237475 12381941 12541471 12744434 12956768
11679 12956768 13185871 13412954 13620706 13857177 14106248 14321119 14542038 14790632 15054961
11670 15054961 15327816 15625547 15929719 16234587 16522789 16755993 16932635 17083346 17252719
11661 17252719 17421173 17631598 17941403 18334561 18782873 19282562 19804680 20335211 20853931
11652 20853931 21398075 21843706 22092827 22140462 21949778 21436063 20531273 19135280 17222587
11643 17222587 14977200 12860874 11215595 10163890 9599460 9322825 9135747 8983221 8813299
11634 8813299 8513471 8101230 7535930 6700275 5514764 3949173 2079975 205265 -1393740
11625a393740j191271p09618k58520J13604M35563O17251P11246P26747P01398
11616b47340O43664O54962O76710O22435N96536N94776N44372N63168N20189M93505
11606E662977N17907N17927M77199M40889M28920M59835M79393N10640N20454
11597A0016141N67729N54693N51491N67470N86381N52358N69832O27093O34657
11588A5227845N79676M56156L73094K91672L17944M05163N27876O82887P51388
11579A9613701P93826P09297O35048O06534O63246P70059Q78469Q89997O94114
11570B6254291K29504n15093j426217k231517k683196k560447j919304j221840
11562A3926181q35637q67025j408765k122607k513280k222272j403495o17044
$$ plain form
11625 -1393740 -2585011 -3294629 -3553149 -3439545 -3003982 -2386731 -1675485 -948738 -247340
11616 -247340 396324 1051286 1727996 2350431 2946967 3541743 4086115 4649283 5169472 5662977
11606 5662977 6180884 6698811 7176010 7616899 8045819 8505654 8985047 9495687 10016141
11597 10016141 10583870 11138563 11690054 12257524 12843905 13396263 13966095 14593188 15227845
11588 15227845 15807521 16263677 16636771 16928443 17246387 17651550 18179426 18862313 19613701
11579 19613701 20407527 21116824 21751872 22358406 23021652 23791711 24670180 25560177 26254291
11570 26254291 26483795 25968702 24542485 22310968 19627772 17067325 15148021 13926181
11562 13926181 13090544 12223519 10814754 8692147 6178867 3956595 2553100 1936056
11554A936056j76583k77323q55690j780728k793572l364510l156077k487446j765085
11545a4720958j454660j520853j720853j717104j424419q75464k66263L26307
11537b3374267P47450J023414J163317J165854J143399J070980J034052R82815
11529a5042986R27493Q70527P95204P54569P21151O73303O41457O21551O14151
11520h423580O07216N77011N54405N69436O08438N75642N37326N42024N48675
11511c303407N50942N18777M73617M52261M36605L81983L60097L79641L59059
11502F09575L60280L15652K50569K65337K96928L29160L12804K87559M54308O42168
11492D124340P22220P35617O98849O36910N08177L38537M8721l61319r31430j596593
$$ plain form
11554 1936056 1759473 1482150 626460 -1154268 -3947840 -7312350 -10468427 -12955873 -14720958
11545 -14720958 -16175618 -17696471 -19417324 -21134428 -22558847 -23434311 -23700574 -23374267
11537 -23374267 -22626817 -21603403 -20440086 -19274232 -18130833 -17059853 -16025801 -15042986
11529 -15042986 -14115493 -13244966 -12449762 -11695193 -10974042 -10300739 -9659282 -9037731 -8423580
11520 -8423580 -7816364 -7239353 -6684948 -6115512 -5507074 -4931432 -4394106 -3852082 -3303407
11511 -3303407 -2752465 -2233688 -1760071 -1307810 -871205 -489222 -129125 250516 609575
11502 609575 969855 1285507 1536076 1801413 2098341 2427501 2740305 3027864 3482172 4124340
11492 4124340 4846560 5582177 6281026 6917936 7426113 7764650 7813371 7452052 6520622 4924029
11482D924029k171984k459054k383282j910013j352324q51301m90917j58284J47127
11473f706003L75813M87714M15179K47814L7348l14947p46897j260342j793892
11464i258213k132843k043701j679056j130494o87522l79223j08144P9302K46182
11455a7093712L55744M48727N23396N53891N90926N87608N43068N29370N11301
11446a2449681M82326M47439M19546L84671L60717L28391L06164K88273K75351
11437i156803K61687K36151K23357J80536J93835J86382J99448K25097J98406
11428g251904J58415J70884J65180J46531J68794J51031J40381J30676J04181
11419e915831R8122J02322J17190J35682J06229R6667R6545O1974Q2673J19250
$$ plain form
11482 4924029 2752045 292991 -2090291 -4000304 -5352628 -6203929 -6694846 -6853130 -6706003
11473 -6706003 -6330190 -5842476 -5427297 -5179483 -5142135 -5457082 -6203979 -7464321 -9258213
11464 -9258213 -11391056 -13434757 -15113813 -16244307 -16931829 -17311052 -17419196 -17339894 -17093712
11455 -17093712 -16737968 -16289241 -15765845 -15211954 -14621028 -14033420 -13490352 -12960982 -12449681
11446 -12449681 -11967355 -11519916 -11100370 -10715699 -10354982 -10026591 -9720427 -9432154 -9156803
11437 -9156803 -8895116 -8658965 -8435608 -8255072 -8061237 -7874855 -7675407 -7450310 -7251904
11428 -7251904 -7093489 -6922605 -6757425 -6610894 -6442100 -6291069 -6150688 -6020012 -5915831
11419 -5915831 -5817709 -5715387 -5598197 -5462515 -5356286 -5259619 -5163074 -5101100 -5018427 -4899177
11409d899177J23614Q4379P5005J05382J04733J09199J03024L6764M0877L7551
11399d078649n706J4879N0590R1915R5433Q0675Q6421O8063R3259M0559L1601
11388c430960M2728M2277O6632Q3294P2979M7855K2165N2700O2740P8938M3627
11377b815025N0666N9519N0168K8124L0418M3050K1061L0614N3405M8612O6575
11366b332813L6429N2966N9538N7329N0835M1270L3903J5815J4738M3858K8936
11355a897196K5146L6308N4984M2738K9784L9184M2580M8638N084N754O488K7429
11343a533079L0494M3666M5114J2708J4169L3954M5695O5619K1166J7764K9184
11332a173546L6485L9895j6564Q613J9978J3508N2558M2854R571R368K5431J1369
$$ plain form
11409 -4899177 -4775563 -4691184 -4616179 -4510797 -4406064 -4296865 -4193841 -4157077 -4116200 -4078649
11399 -4078649 -4084355 -4069476 -4018886 -3926971 -3831538 -3750863 -3664442 -3596379 -3503120 -3462561 -3430960
11388 -3430960 -3388232 -3345955 -3279323 -3196029 -3123050 -3075195 -3053030 -3000330 -2937590 -2858652 -2815025
11377 -2815025 -2764359 -2704840 -2654672 -2626548 -2596130 -2553080 -2532019 -2501405 -2448000 -2399388 -2332813
11366 -2332813 -2296384 -2243418 -2183880 -2126551 -2075716 -2034446 -2000543 -1984728 -1969990 -1926132 -1897196
11355 -1897196 -1872050 -1835742 -1780758 -1738020 -1708236 -1669052 -1626472 -1577834 -1572750 -1566996 -1560508 -1533079
11343 -1533079 -1502585 -1458919 -1413805 -1401097 -1386928 -1352974 -1307279 -1241660 -1220494 -1202730 -1173546
11332 -1173546 -1137061 -1097166 -1113730 -1105117 -1085139 -1071631 -1019073 -976219 -966648 -957280 -931849 -920480
11320i20480K6934Q3341N1844L6612L1608k59l5387K196P083K2359L8975M4165
11308f11009L6132O682J7385N1925r328J8314L9567O1827J8862K0921K9101P733
11296c11888L1244J0018Q645L0064M0780N1363J2345J415O993J8959l9M1933K6523
11283c1645L4294J9543J5597J9912K2516Q482J792J7892J4419K4798K4287N102
11271A76989k1639N338K0583L0540K0765J6677N3533L9880j1801Q977K4767m458
11259C60151M389K9804K4845L6686K3110L5798L4538K1412K4718q5J2146N555
11247F13067R248K3225K459k549L3622k071J4053L6204J7008P51j5502Q73K7664
11234G58052R393J3310K0978K8448J0824K2243J2700K5185K3381O136K4884K5002
$$ plain form
11320 -920480 -893546 -810205 -758361 -721749 -690141 -690400 -725787 -723591 -716508 -694149 -655174 -611009
11308 -611009 -574877 -568195 -550810 -498885 -508213 -489899 -450332 -388505 -369643 -348722 -319621 -311888
11296 -311888 -280644 -270626 -261981 -231917 -191137 -139774 -127429 -126014 -119021 -100062 -100101 -58168 -31645
11283 -31645 2649 22192 37789 57701 80217 88699 90491 108383 122802 147600 171887 176989
11271 176989 155350 160688 181271 211811 232576 249253 302786 342666 330865 339842 364609 360151
11259 360151 364540 394344 419189 455875 478985 514783 549321 570733 595451 595366 607512 613067
11247 613067 622315 645540 647999 645450 679072 677001 691054 727258 744266 745017 729515 730388 758052
11234 758052 767445 780755 801733 830181 841005 863248 875948 901133 924514 930650 955534 980536
11222I80536K1683J1018J4040K7024J6043J4817L1959J2672K0041K4279J4060
11211A188172J3213q928J476K6402O33J3488n380O127M3984J0367q350K4683K0093
11198A325980K8324J6883j6629j0209m0437l3758j0120L563M3504J6741J1092
11187A334934K6425N1892L0270K4235J3262j0225Q701M2283l425J6944J7416J6396
11175A569108Q4J6635L0145m545o877K6683L4582K351j2114K1536M4449K4764
11163A746801O671J5904J0216K6047J3935M4972J5790J3242K1374q942n211P481
11151A908280K6286J6754p164K8336N4884L5321P880k1675K2198K2059L602K4817
11139B121578N0662J5333M12K4921J4760j2759K8622N235k2529j0494Q975J8076
$$ plain form
11222 980536 1002219 1013237 1027277 1054301 1070344 1085161 1117120 1129792 1149833 1174112 1188172
11211 1188172 1201385 1192457 1193933 1220335 1220968 1234456 1229076 1235203 1279187 1289554 1281204 1305887 1325980
11198 1325980 1354304 1371187 1354558 1344349 1303912 1270154 1260034 1263597 1307101 1323842 1334934
11187 1334934 1361359 1413251 1443521 1467756 1481018 1470793 1479494 1521777 1518352 1535296 1552712 1569108
11175 1569108 1569192 1585827 1615972 1611427 1604550 1631233 1665815 1668166 1656052 1677588 1722037 1746801
11163 1746801 1753472 1769376 1779592 1805639 1819574 1864546 1880336 1893578 1914952 1906010 1900799 1908280
11151 1908280 1934566 1951320 1944156 1972492 2027376 2062697 2070577 2048902 2071100 2093159 2096761 2121578
11139 2121578 2172240 2187573 2187985 2212906 2227666 2214907 2243529 2248764 2226235 2215741 2224716 2242792
11127B242792K276j8339l016J7294R283l0445l5670j5781K0210N0509O848j0800
11115B235161K6846J7216O361m916n619L49P989l533L524R867l18K6514K3345
11102B342786J1697j4028N049K4119K9260L4457J7897L8473O2727R357J4269L595
11090B579658K0456K8305l884J0006J4975J2950j136n85N47K4367M7381O536R902
11077B749478K8117k516J1472M1051k148j909j288J0393K5412J1628L5528K6665
11065B931883L4022L6416k4338l6811P450J5627M2563O9468L9168L7643L4882
11054C187973L09J0396M4253J8899j3296K4712M4084L1296N853N932J9651p282
11042C372780k6766k7128n4773l7014n9229o7587k4175K9039K6855M8652K7606
$$ plain form
11127 2242792 2245068 2226729 2223713 2241007 2250290 2219845 2184175 2168394 2188604 2239113 2245961 2235161
11115 2235161 2262007 2279223 2285584 2280668 2275049 2275398 2283387 2279854 2283378 2293245 2292927 2319441 2342786
11102 2342786 2354483 2340455 2345504 2369623 2398883 2433340 2451237 2489710 2552437 2561794 2576063 2579658
11090 2579658 2600114 2628419 2624535 2634541 2649516 2662466 2661330 2660745 2661292 2685659 2733040 2739576 2749478
11077 2749478 2777595 2775079 2786551 2827602 2825454 2823545 2822257 2832650 2858062 2869690 2905218 2931883
11065 2931883 2965905 3002321 2977983 2941172 2948622 2964249 3006812 3076280 3115448 3153091 3187973
11054 3187973 3188282 3198678 3242931 3261830 3248534 3273246 3317330 3348626 3354479 3360411 3380062 3372780
11042 3372780 3346014 3318886 3264113 3227099 3167870 3100283 3076108 3105147 3132002 3180654 3208260
11031C208260M239L7057J7983k835R751j530m96J3695L3404O7364L9341J5972
11019C442205L1778K5161K3757J0623L5825L4694L3667L6794J4045j5509j2147
11008C660893l7614n6236m6247o14K2794J518K5971M0716O9782M2715M2683L9901
10996C806262L3240K8087J7536k441k4470m6850o3753o0069l8268l7945m7678
10985C563651p443O264L6391J6907M4129M7913J5361K3674K2464L6509J3769M326
10973C823915O544R549L2582L2716K4572K2681M7292K6642M5200K5360L0446K9554
10961D157053M6329M8299M0765L1672L3131J1260Q183N3008j0249o505j2250p6592
10949D324104j22760o6783m3430o3463j2860L5727N4331M3460M1406L4701L0396
$$ plain form
11031 3208260 3212499 3249556 3267539 3264704 3274455 3272925 3272429 3286124 3319528 3386892 3426233 3442205
11019 3442205 3473983 3499144 3522901 3533524 3569349 3604043 3637710 3674504 3688549 3673040 3660893
11008 3660893 3623279 3567043 3520796 3520182 3542976 3544494 3570465 3611181 3680963 3723678 3766361 3806262
10996 3806262 3839502 3867589 3885125 3882684 3858214 3811364 3747611 3687542 3649274 3611329 3563651
10985 3563651 3556208 3562472 3598863 3615770 3659899 3707812 3723173 3746847 3769311 3805820 3819589 3823915
10973 3823915 3830459 3840008 3872590 3905306 3929878 3952559 3999851 4026493 4071693 4097053 4127499 4157053
10961 4157053 4203382 4251681 4292446 4324118 4357249 4368509 4376692 4429700 4419451 4412946 4400696 4324104
10949 4324104 4201344 4134561 4091131 4027668 4014808 4050535 4104866 4148326 4189732 4224433 4254829
10938D254829M690r603L2858K2590J3460L0958L7147n498J4854P8597O1050J1607
10926D547539J1296L7640M4173j9546P323L2233L3233O1152M2706J948K415M5663
10914D847775L6037J1229j5933Q462o03J4937M2877J6161L0798M2706J1341K1630
10902E067417J0676L5537L3535L2005J1079K5969J2003L0624Q3878N3781O6166
10891E462670Q2137Q4434O4775J12249J21217J21083J12098J18379N1228k84585
10881F045685p11040p63655m12564p3137Q3191J58774J34003J09865R2099R3191
10871D756412P6780P5368N6207M3564Q2410O1515K2713M5231L8617P326J9745
10860E285888K4490J5172K3565M8305J7164K3096L5662L3080M4499N4627K0638
$$ plain form
10938 4254829 4259519 4249916 4282774 4305364 4318824 4349782 4386929 4381431 4396285 4474882 4535932 4547539
10926 4547539 4558835 4596475 4640648 4621102 4628425 4660658 4693891 4755043 4797749 4799697 4802112 4847775
10914 4847775 4883812 4895041 4879108 4887570 4886967 4901904 4944781 4960942 4991740 5034446 5045787 5067417
10902 5067417 5078093 5113630 5147165 5179170 5190249 5216218 5228221 5258845 5342723 5396504 5462670
10891 5462670 5544807 5629241 5694016 5806265 5927482 6048565 6160663 6279042 6330270 6045685
10881 6045685 5334645 4570990 4158426 4085289 4168480 4327254 4461257 4571122 4663221 4756412
10871 4756412 4833192 4908560 4964767 5008331 5090741 5152256 5174969 5220200 5258817 5266143 5285888
10860 5285888 5310378 5325550 5349115 5397420 5414584 5437680 5473342 5506422 5550921 5605548 5626186
10849E626186J6914M5668K1092j1933J4295O332K9382O6232K4647N5133M8286
10838E942234K8886M6579M2676K9781R129L6376M5007K1329J3025K5368J9866
10827F260256J2591J2703J3238K5482M2621N708l063L0595J5939J953N6297P2574
10815F546894L4343J9886N1178K2097L4740L2093O457J3112L4564J5339M3324
10804F854027L0928N0673M9363M5745L9673M6651L5835M1611L1097N3461J9174
10793G298238J6767M8086K5373p986J5040j151j1463L1670L169J6770M4030L6160
10781G514703N4015L7226L2262O2053L1807L0943L7555J2098K4552N8023M2436
10770G937673L0413K7779M6254M5356M5735K0654R334O9117R044L0626O7317P5217
$$ plain form
10849 5626186 5643100 5688768 5709860 5697927 5712222 5718554 5747936 5814168 5838815 5893948 5942234
10838 5942234 5971120 6017699 6060375 6090156 6099285 6135661 6180668 6201997 6215022 6240390 6260256
10827 6260256 6272847 6285550 6298788 6324270 6366891 6372599 6369536 6400131 6416070 6418023 6474320 6546894
10815 6546894 6581237 6601123 6652301 6674398 6709138 6741231 6747688 6760800 6795364 6810703 6854027
10804 6854027 6884955 6935628 6984991 7030736 7070409 7117060 7152895 7194506 7225603 7279064 7298238
10793 7298238 7315005 7363091 7388464 7380478 7395518 7394367 7382904 7414574 7417743 7434513 7478543 7514703
10781 7514703 7568718 7605944 7638206 7700259 7732066 7763009 7800564 7812662 7837214 7895237 7937673
10770 7937673 7968086 7995865 8042119 8087475 8133210 8153864 8163198 8232315 8241359 8271985 8339302 8414519
10758H414519O5622N7175O7119M0596K3799L8102M6698N0739L9771N2072O6523
10747H962735M1641N7872K8084M8013P1774R3569P1029N0816Q2483Q4057O2175
10736I654248R2487J00536N1085N3263P9965P4956R0201Q7242P3638M478k8021
10725A0334078q0271j42843j71927j53295r5385l9771R688N4446K8301K4226Q573
10714I775820N9434P9668P3851J00464J16276J07807J24884R1873M1315R8457
10704A0669849J21045J05914O1331Q0450J17646P3573Q9753J30321R5442J08086
10694A1653410J07428J11586J01776O7638J6476m9040r9490j16532j31392j02330
10684A1559530m0388K0723O0545P6258J04789Q7535R1587J34475J07047R6209
$$ plain form
10758 8414519 8480141 8537316 8604435 8645031 8668830 8706932 8753630 8804369 8844140 8896212 8962735
10747 8962735 9004376 9062248 9090332 9138345 9210119 9303688 9374717 9425533 9508016 9592073 9654248
10736 9654248 9746735 9847271 9898356 9951619 10031584 10106540 10196741 10283983 10357621 10362099 10334078
10725 10334078 10253807 10110964 9939037 9785742 9690357 9650586 9660274 9714720 9743021 9767247 9775820
10714 9775820 9835254 9914922 9988773 10089237 10205513 10313320 10438204 10530077 10571392 10669849
10704 10669849 10790894 10896808 10958139 11038589 11156235 11229808 11319561 11449882 11545324 11653410
10694 11653410 11760838 11872424 11974200 12041838 12058314 12009274 11909784 11793252 11661860 11559530
10684 11559530 11519142 11539865 11600410 11676668 11781457 11868992 11960579 12095054 12202101 12298310
10674A2298310J31556J62290J20966J68648J24415J08846J17526R7586J04743
10665A3434886J26541J11724R8996R5961P7488R1867J54684J49856J60840J56346
10655A4659189J75002J47350J39821Q8559J13627J59503J48339J60814J61595
10646A5953799J59729J55860J57587J42603J67176J84426J27201J41401J68550
10637A7358332J64574J84644J79811K03057K47983K66622K45363K24433K16398
10628A9291217K32818K63962K54593K49518K85343L13961L07596L05678K93987
10619B1798673L09319K74571K46709L20107L71077M01487M10718M26293M46395
10610B5005349M65865M47731M41687M79062M66561M73314M79951N01879N79056
$$ plain form
10674 12298310 12429866 12592156 12713122 12881770 13006185 13115031 13232557 13330143 13434886
10665 13434886 13561427 13673151 13772147 13868108 13945596 14037463 14192147 14342003 14502843 14659189
10655 14659189 14834191 14981541 15121362 15209921 15323548 15483051 15631390 15792204 15953799
10646 15953799 16113528 16269388 16426975 16569578 16736754 16921180 17048381 17189782 17358332
10637 17358332 17522906 17707550 17887361 18090418 18338401 18605023 18850386 19074819 19291217
10628 19291217 19524035 19787997 20042590 20292108 20577451 20891412 21199008 21504686 21798673
10619 21798673 22107992 22382563 22629272 22949379 23320456 23721943 24132661 24558954 25005349
10610 25005349 25471214 25918945 26360632 26839694 27306255 27779569 28259520 28761399 29340455
10601B9340455O42007P32831P69682Q53325Q57177R45167J038130J096635J190754
10592C7466163J264229J312230J375267J458890J675897K031368K415378K740941
10584E1740363L050574L210563K882154J754278n85802m185580q478251j2279597
10576C7108702j4237777j3566332j0591436o672563l074105m59437J071955J830587
10568h590406K130543K124636J984676J835927J685941J647001J642121J673198
10560F133637J711559J728076J723438J700706J736759J772892J796401J849370
10552B0152838J862632J892910J977857K016549K051024K088608K248452K539895
10544C6830765K929110L240114L388129K969972J538075j589951o923005j4076421
$$ plain form
10601 29340455 29982462 30715293 31484975 32338300 33195477 34140644 35178774 36275409 37466163
10592 37466163 38730392 40042622 41417889 42876779 44552676 46584044 48999422 51740363
10584 51740363 54790937 58001500 60883654 62637932 62052130 57866550 49388299 37108702
10576 37108702 22870925 9304593 -1286843 -7959406 -11033511 -11492948 -10420993 -8590406
10568 -8590406 -6459863 -4335227 -2350551 -514624 1171317 2818318 4460439 6133637
10560 6133637 7845196 9573272 11296710 12997416 14734175 16507067 18303468 20152838
10552 20152838 22015470 23908380 25886237 27902786 29953810 32042418 34290870 36830765
10544 36830765 39759875 42999989 46388118 49358090 50896165 49306214 42383209 28306788
10536B8306788k0269334k1567067j6820700r109535k391794J744044L637601M207909
10528c2262088M163657L789625L323214K875964K441251K094710J909872J809235
10520i854560J776629J746087J681719J525497J281514J009978R43073J065933
10512A175870J189537J211917J191677J163217J080833J015273J028387J017647
10504A0074358J031771J054873J114694J181431J194864J244994J258719J313229
10496A9468933J390340J429604J512976J583424J588301J659438J792828J931351
10488C2357195K130693K326387K486613K651509K806749K943012L075726L144209
10480E3922093L158726L344198M050026M961392N814567O755716P881080R293897
$$ plain form
10536 28306788 8037454 -13529613 -30350313 -39459848 -41851642 -40107598 -36469997 -32262088
10528 -32262088 -28098431 -24308806 -20985592 -18109628 -15668377 -13573667 -11663795 -9854560
10520 -9854560 -8077931 -6331844 -4650125 -3124628 -1843114 -833136 109937 1175870
10512 1175870 2365407 3577324 4769001 5932218 7013051 8028324 9056711 10074358
10504 10074358 11106129 12161002 13275696 14457127 15651991 16896985 18155704 19468933
10496 19468933 20859273 22288877 23801853 25385277 26973578 28633016 30425844 32357195
10488 32357195 34487888 36814275 39300888 41952397 44759146 47702158 50777884 53922093
10480 53922093 57080819 60425017 64475043 69436435 75251002 82006718 89887798 99181695
10472I9181695J1175829J3585011J6497735J9835469K3503072K6223775K3201072
10465B33203658J352213o3066689j54703075j66241539q3713305j2193285J7291829
10458b28070193K4248145K3196167J9861917J6446539J3708055J1546054R723139
10451a09340177Q231315P114875O230216N489279M641668L676585K971967K839882
10443f8144390K943845K886384K693851K461191K181539J975890J877941J776840
10435d9346909J700469J587435J420177J355657J290448J191696J164100J096054
10427c8540873J000580Q87217Q47900Q13293P69945P53784P31650O94121O96461
10418c1345922O89445O53134N83866N40084N71295N76410N90859N52496M62135
$$ plain form
10472 99181695 110357524 123942535 140440270 160275739 183778811 210002586 233203658
10465 233203658 234555871 171489182 16786107 -149455432 -233168737 -245362022 -228070193
10458 -228070193 -203822048 -180625881 -160763964 -144317425 -130609370 -119063316 -109340177
10451 -109340177 -101108862 -93993987 -87763771 -82274492 -77632824 -73956239 -70984272 -68144390
10443 -68144390 -65200545 -62314161 -59620310 -57159119 -54977580 -53001690 -51123749 -49346909
10435 -49346909 -47646440 -46059005 -44638828 -43283171 -41992723 -40801027 -39636927 -38540873
10427 -38540873 -37540293 -36653076 -35805176 -34991883 -34221938 -33468154 -32736504 -32042383 -31345922
10418 -31345922 -30656477 -30003343 -29419477 -28879393 -28308098 -27731688 -27140829 -26588333 -26126198
10409b6126198L75822L06090K37744L07673L41281M01424M22103L94971L94720
10400b2944370L70502L48703L18325L34670L30429L02698L31565L14128K75000
10391b0018350K40675K35068K73735K68098K52620K48515K39668K64255K46664
10382a7749052K56217K34312K71823K20253J91553J65991J51381J38012J23235
10373a5996275R3511J09953J15549J40950J26370J47366J84424K07358J90060
10364a4680734J69128J24635J22974J31820J43824J44226J35995J23854J45760
10355a3438518J61718J39722J18549J46167J58724J28553J15091J39767R1936
10346a2238291N9154M8544O2482Q4403O2652P4577J12355P0908L3433O926M1756
$$ plain form
10409 -26126198 -25750376 -25444286 -25206542 -24898869 -24557588 -24156164 -23734061 -23339090 -22944370
10400 -22944370 -22573868 -22225165 -21906840 -21572170 -21241741 -20939043 -20607478 -20293350 -20018350
10391 -20018350 -19777675 -19542607 -19268872 -19000774 -18748154 -18499639 -18259971 -17995716 -17749052
10382 -17749052 -17492835 -17258523 -16986700 -16766447 -16574894 -16408903 -16257522 -16119510 -15996275
10373 -15996275 -15902764 -15792811 -15677262 -15536312 -15409942 -15262576 -15078152 -14870794 -14680734
10364 -14680734 -14511606 -14386971 -14263997 -14132177 -13988353 -13844127 -13708132 -13584278 -13438518
10355 -13438518 -13276800 -13137078 -13018529 -12872362 -12713638 -12585085 -12469994 -12330227 -12238291
10346 -12238291 -12179137 -12130593 -12068111 -11983708 -11921056 -11846479 -11734124 -11663216 -11629783 -11622857 -11581101
10335a1581101R4095J12305R9441R4806O1855J23675R5483J26354J18865J01719
10325a0552503J02892Q8385M4369N6837Q3103J03104J15278Q7776P6388P9986
10315i714385O5559M8440L7038O7305P4171P4461R8131J26624J19380R1263Q9870
10304h822143J11245Q9706N0973N4557O2441M7052O2971L8553O6725N4275O3356
10293h120289O9162K5461M3025P0946N6724P6579P5576N6375K8478J8239L8988
10282g560736N3966O8857P2004N9852M1944N7173O9984O5482O0060O9012L6153
10271f906249L9552L0549M6379J9303N1287P1492N4986L9927K9837N6326N5236
10260f411375M4444M2078L1212J8194J0888L3305M1968N6222N0905L3906O9915
$$ plain form
10335 -11581101 -11487006 -11374701 -11275260 -11180454 -11118599 -10994924 -10899441 -10773087 -10654222 -10552503
10325 -10552503 -10449611 -10361226 -10316857 -10260020 -10176917 -10073813 -9958535 -9870759 -9794371 -9714385
10315 -9714385 -9648826 -9600386 -9563348 -9496043 -9421872 -9347411 -9249280 -9122656 -9003276 -8912013 -8822143
10304 -8822143 -8710898 -8621192 -8570219 -8515662 -8453221 -8406169 -8343198 -8304645 -8237920 -8183645 -8120289
10293 -8120289 -8051127 -8025666 -7982641 -7911695 -7854971 -7778392 -7702816 -7646441 -7617963 -7599724 -7560736
10282 -7560736 -7506770 -7437913 -7365909 -7306057 -7264113 -7206940 -7136956 -7071474 -7011414 -6942402 -6906249
10271 -6906249 -6866697 -6836148 -6789769 -6770466 -6719179 -6647687 -6592701 -6552774 -6522937 -6466611 -6411375
10260 -6411375 -6366931 -6324853 -6293641 -6275447 -6264559 -6231254 -6189286 -6133064 -6082159 -6048253 -5978338
10249e978338O8687L9455K1566N7308O9757N6690M8104L3029N6797M5134J4628
10238e467183J3081L3106M2091Q569L5213M1755L4048P054J3528L3058O5488O1757
10226e078435P0298K5533m013J0788M6712O0974L3787J3859R4290L5455L0268
10215d660484L3083J3614L6673L7536N4461O6889M3391K3977K6496J7494K1305
10204d285565n315K2397K4704M4504O6665O2401K6033J9163K2507J6402K3184
10193c962920O6675L9500k045L2255M1251L6105J3408N9045M5279O3081M8991
10182c519375L5430M8677K8044L2091J8151L1100N5515M5404J3392K5900M3668
10171c142003M5214M2863M1109K1472K1106L0493K0356L5142P2838N1822M0291
$$ plain form
10249 -5978338 -5909651 -5870196 -5848630 -5791322 -5721565 -5664875 -5616771 -5583742 -5526945 -5481811 -5467183
10238 -5467183 -5454102 -5420996 -5378905 -5370336 -5335123 -5293368 -5259320 -5252266 -5238738 -5205680 -5140192 -5078435
10226 -5078435 -5008137 -4982604 -4986617 -4975829 -4929117 -4868143 -4834356 -4820497 -4726207 -4690752 -4660484
10215 -4660484 -4627401 -4613787 -4577114 -4539578 -4485117 -4418228 -4374837 -4350860 -4324364 -4306870 -4285565
10204 -4285565 -4290880 -4268483 -4243779 -4199275 -4132610 -4070209 -4044176 -4025013 -4002506 -3986104 -3962920
10193 -3962920 -3896245 -3856745 -3858790 -3826535 -3785284 -3749179 -3735771 -3676726 -3631447 -3568366 -3519375
10182 -3519375 -3483945 -3435268 -3407224 -3375133 -3356982 -3325882 -3270367 -3224963 -3211571 -3185671 -3142003
10171 -3142003 -3096789 -3053926 -3012817 -2991345 -2970239 -2939746 -2919390 -2884248 -2811410 -2759588 -2719297
10160b719297K3662L2255j5571j592O787k7662o1930N394K1854K3890J2730L4663
10148b664817M8968L5767M9308L4130L3198M8381K6526K6862N5961L9463N0420
10137b215833N0010P4431N3564M2427K9675L9976M1255O5566M6602N1753P6642
10126a643932O6344P4525O2026P0181P6641R9726J00727J09624Q0971O2183N7310
10115g83674M8847n85j06370k65627m52985m77656k75093p3001R8317J62153K03901
10104a921773J81317J06778J11045J17449J05241J09940J29680J08027J24009
10095h28287J06235J21486J74981J31618O1959o3363k28904m70298o57163o58494
10085b310230n20436k48134n0519P0073J03437J30111J63105J11953J01683J19633
$$ plain form
10160 -2719297 -2695635 -2663380 -2678951 -2680543 -2673756 -2701418 -2763348 -2757954 -2736100 -2712210 -2699480 -2664817
10148 -2664817 -2615849 -2580082 -2530774 -2496644 -2463446 -2415065 -2388539 -2361677 -2305716 -2266253 -2215833
10137 -2215833 -2165823 -2091392 -2037828 -1995401 -1965726 -1925750 -1884495 -1818929 -1772327 -1720574 -1643932
10126 -1643932 -1577588 -1503063 -1441037 -1370856 -1294215 -1194489 -1093762 -984138 -903167 -840984 -783674
10115 -783674 -734827 -735412 -841782 -1107409 -1560394 -2038050 -2313143 -2386144 -2287827 -2125674 -1921773
10104 -1921773 -1740456 -1633678 -1522633 -1405184 -1299943 -1190003 -1060323 -952296 -828287
10095 -828287 -722052 -600566 -425585 -293967 -232008 -295371 -524275 -994573 -1651736 -2310230
10085 -2310230 -2830666 -3078800 -3129319 -3059246 -2955809 -2825698 -2662593 -2550640 -2448957 -2329324
10075b329324J55624J42145J20334J01060R8142J00155J25408Q0463R9976Q3942
10065a222075P8487P3151P2260M5270j0371n6676o7350p6610j20187j12835p2942
10054a469878r1317q2767j2639P2593Q5226Q4400J00131J04965J38492J58509
10044i12285J55105J59138J25875P6996j34542n09132p48008n29765j29667Q6259
10034b360026J49608J81776J59484J59914J48068J26269O1113Q4854J07899J11600
10024a069441J06818R6457L7129O7999Q3301P5237L8737J5931j1800j01804j49607
10013h11043j88933j93041j89082j86294j32044p3977p2654j3613O5375J15812
10003a679494P4620N5834P8226O9534N7886M6429Q2752M4495Q097K6896M5671
$$ plain form
10075 -2329324 -2173700 -2031555 -1911221 -1810161 -1712019 -1611864 -1486456 -1405993 -1306017 -1222075
10065 -1222075 -1143588 -1070437 -998177 -952907 -963278 -1019954 -1087304 -1163914 -1284101 -1396936 -1469878
10054 -1469878 -1561195 -1643962 -1656601 -1584008 -1498782 -1414382 -1314251 -1209286 -1070794 -912285
10044 -912285 -757180 -598042 -472167 -395171 -529713 -1038845 -1786853 -2316618 -2446285 -2360026
10034 -2360026 -2210418 -2028642 -1869158 -1709244 -1561176 -1434907 -1373794 -1288940 -1181041 -1069441
10024 -1069441 -962623 -866166 -829037 -761038 -677737 -602500 -563763 -547832 -559632 -661436 -811043
10013 -811043 -999976 -1193017 -1382099 -1568393 -1700437 -1774414 -1847068 -1860681 -1795306 -1679494
10003 -1679494 -1604874 -1549040 -1470814 -1401280 -1343394 -1296965 -1214213 -1169718 -1161621 -1134725 -1089054
9992a089054N844J9758P4485Q8692O6303K9268N1085O8102M9287K5699K9276N2811
9980e28444M0739J1272J1806P578K6290M5936L1036M4823J5571J1968K4218L2908
9968b24299L4709j7558J3327M3k0022k2514j274L8483M3920M2413M617K7305J9091
9955f1759M7838N3024N3022M7176M742N336L0606L9236N9426l572J3683M6454
9943C35212M9896L0067L5399J2611L4733M1674L5495N5518M1700L6231L9905L660
9931G52101J1396p182j2692r95k1066j1620J9682M8587O8441M6597J9238L5628
9919I48115L1016L3092M5718M9319M7806M0415K6037M4639J7754J3357K9782P3573
9907A400623M9346L7780J4033n762Q675K7162K4822K9191J5540J7234j3743M87
$$ plain form
9992 -1089054 -1083210 -1063452 -988967 -900275 -833972 -804704 -753619 -685517 -636230 -610531 -581255 -528444
9980 -528444 -487705 -476433 -464627 -457049 -430759 -384823 -353787 -308964 -293393 -281425 -257207 -224299
9968 -224299 -189590 -207148 -193821 -193778 -213800 -236314 -237588 -199105 -155185 -112772 -108155 -80850 -61759
9955 -61759 -13921 39103 92125 139301 144043 149379 179985 219221 278647 275075 288758 335212
9943 335212 385108 415175 450574 463185 497918 539592 575087 630605 672305 708536 748441 752101
9931 752101 763497 756315 743623 742628 721562 709942 729624 778211 846652 893249 912487 948115
9919 948115 979131 1012223 1057941 1107260 1155066 1195481 1221518 1266157 1283911 1297268 1327050 1400623
9907 1400623 1449969 1487749 1501782 1496020 1504695 1531857 1556679 1585870 1601410 1618644 1604901 1605388
9895A605388L2536L8855O3480M3116K0317L6400N5287N5641J8654L0625Q7642
9884B087941L4028K7626M5627L5967M9168N9131L243N8016P2690P7606M6065P8533
9872B675641Q0228J13475J11648J25893J24103N3921q6129l20355m69906l50701
9862B057818p9812P5636J57927J49412J26838J19265O1986P4832Q4285R6763P8744
9851C003694P6061N5831O4431J08481N5325M9004R7345J08458R4910Q8100J09477
9840C911117J42423J33243J22592J39190J85349K22132K23130K47946L25624L78207
9830F030953M53300N70537O24932K46490j015921k681876l075888j774045k51974
9821h73492M53853N99064N20062M42864L76310L05122K33962J95667J80540J81093
$$ plain form
9895 1605388 1637924 1676779 1740259 1783375 1803692 1840092 1895379 1951020 1969674 2000299 2087941
9884 2087941 2121969 2149595 2195222 2231189 2280357 2339488 2342731 2400747 2473437 2551043 2597108 2675641
9872 2675641 2755869 2869344 2980992 3106885 3230988 3284909 3198780 2878425 2408519 2057818
9862 2057818 1978006 2053642 2211569 2360981 2487819 2607084 2669070 2743902 2828187 2924950 3003694
9851 3003694 3079755 3135586 3200017 3308498 3363823 3412827 3510172 3618630 3713540 3801640 3911117
9840 3911117 4053540 4186783 4309375 4448565 4633914 4856046 5079176 5327122 5652746 6030953
9830 6030953 6484253 7054790 7679722 7926212 6910291 4228415 1152527 -621518 -873492
9821 -873492 -419639 179425 699487 1142351 1518661 1823783 2057745 2253412 2433952 2615045
9811B615045J62733J48565J23614R6607R8885J20098J31591J01955O0957N6567
9801C716617Q1405P9779R3385O9869P7421Q0694R6965R7440J08714R0968R5537
9790D688794J03963J07708J03914Q3557O2591Q1979M2184n8439j42015j57137
9780D917099q2202J0617O2321J15226J47540J25341R5657J03548J12403Q4617
9770E692167R5687J11395J02197P6393Q0498J20668Q2689Q8044Q6036J14683R9320
9759F749777R8830P4364J01889J50517J32440P8560J24012J13110J33330J37271
9749G894100J03645J26980J28533J60446J53880J23764J28175J54176J68631J51605
9739I293935J39303J48769J38230J39779J33979J39478J38057J42360J32089J04528
$$ plain form
9811 2615045 2777778 2926343 3049957 3146564 3245449 3365547 3497138 3599093 3660050 3716617
9801 3716617 3798022 3877801 3971186 4041055 4118476 4199170 4296135 4393575 4502289 4593257 4688794
9790 4688794 4792757 4900465 5004379 5087936 5150527 5232506 5274690 5216251 5074236 4917099
9780 4917099 4834897 4845514 4907835 5023061 5170601 5295942 5391599 5495147 5607550 5692167
9770 5692167 5787854 5899249 6001446 6077839 6158337 6279005 6361694 6449738 6535774 6650457 6749777
9759 6749777 6848607 6922971 7024860 7175377 7307817 7386377 7510389 7623499 7756829 7894100
9749 7894100 7997745 8124725 8253258 8413704 8567584 8691348 8819523 8973699 9142330 9293935
9739 9293935 9433238 9582007 9720237 9860016 9993995 10133473 10271530 10413890 10545979 10650507
9729A0650507J42279J65521J76639J84637K13817K32476K28356K19345K19522
9720A2433099K20304J72414R8038K4261j702p0408n1697J9325O3981Q6959J52147
9709A3146721J79527K58271L21434L54801L56263L77564L95317L44110L09510
9700A6043518L14445K55015J81851J01096J1930o8459j19780o8720j2435M183
9690A6642644N2197J58643K16348K45182K32530J99388K02077J85919J83488J03751
9680A8422167N948q6414k71488m41205n27136o57827p34082p97213p88252o19652
9670A3504846l78552j35263p8374q3165j57525k44790l41279l70372m12733m35083
9660A0867710m61859m55413m80570m96615n64326o80420p19824o80671n15694
$$ plain form
9729 10650507 10792786 10958307 11134946 11319583 11533400 11765876 11994232 12213577 12433099
9720 12433099 12653403 12825817 12923855 12948116 12946414 12876006 12824309 12843634 12907615 12994574 13146721
9709 13146721 13326248 13584519 13905953 14260754 14617017 14994581 15389898 15734008 16043518
9700 16043518 16357963 16612978 16794829 16895925 16907855 16839396 16719616 16650896 16638461 16642644
9690 16642644 16694841 16853484 17069832 17315014 17547544 17746932 17949009 18134928 18318416 18422167
9680 18422167 18428115 18341701 18070213 17629008 17101872 16444045 15709963 14912750 14124498 13504846
9670 13504846 13126294 12991031 12912657 12829492 12671967 12427177 12085898 11715526 11302793 10867710
9660 10867710 10405851 9950438 9469868 8973253 8408927 7728507 7008683 6328012 5812318
9651E812318l64934k76259l23406m70133n37905m94036m17761l31624l67578n17582
9641A711100o95598p45802o07796m23533k56843j17779L9154J58491K93824L06878
9631c37904L26159L67615L94252M23993M60796M14249L21072J87047J14611J03291
9621B775181J18913J76017K58753K64108K25347J68784R4212j2676j15644k07712
9611C745283j24265R4330L53631O15067Q01936Q42875Q70208P83673N85308M17777
9601H985823L17501K42788K28789K73890L81452N39600O94764P84869P52193O00997
9591A3802666L63542P4764j95264m48363o78261q55952j082458j237734j327102
9582H415838j388756j465813j545742j610445j678529j815625j995923k035976
$$ plain form
9651 5812318 5447384 5171125 4847719 4377586 3839681 3345645 2927884 2596260 2228682 1711100
9641 1711100 1015502 269700 -338096 -761629 -1018472 -1136251 -1097097 -938606 -644782 -337904
9631 -337904 -11745 355870 750122 1174115 1634911 2049160 2370232 2557279 2671890 2775181
9621 2775181 2894094 3070111 3328864 3592972 3818319 3987103 4081315 4068639 3952995 3745283
9611 3745283 3621018 3715348 4068979 4684046 5485982 6328857 7199065 7982738 8568046 8985823
9601 8985823 9303324 9546112 9774901 10048791 10430243 10969843 11664607 12449476 13201669 13802666
9591 13802666 14166208 14240972 14045708 13597345 12919084 12063132 10980674 9742940 8415838
9582 8415838 7027082 5561269 4015527 2405082 726553 -1089072 -3084995 -5120971
9574e120971k028108j995007j928071j774252j485552j168907q24126n25914k06847
9565a7057755n9843p9798k10716l62316n57031o78058o39148n65249m49066l58785
9555b1017765k01690l844J52227K66985L01840L24519K16668M3231o5558k1185
9545b0004572O6571J52862L09451N00636O18819P13420P24155O25712L68626J2803
9535a5911517m35033p79419q88070p73286m38984m2008L04148N44895O36215O71084
9525a7111975P05175O79533O43804O42586O30937O54233O98584P54263P84315
9516a0918545P63488O96362M95828J66286k48464p19417j109149j319115j291044
9507a3483770j079414o97943l44897L6952K80820M49598N77413O43044O15997
$$ plain form
9574 -5120971 -7149079 -9144086 -11072157 -12846409 -14331961 -15500868 -16324994 -16850908 -17057755
9565 -17057755 -17117598 -17197396 -17408112 -17770428 -18327459 -19005517 -19644665 -20209914 -20658980 -21017765
9555 -21017765 -21219455 -21223299 -21071072 -20804087 -20502247 -20177728 -19961060 -19917829 -19983387 -20004572
9545 -20004572 -19938001 -19785139 -19475688 -18975052 -18356233 -17642813 -16918658 -16292946 -15924320 -15911517
9535 -15911517 -16346550 -17125969 -18014039 -18787325 -19226309 -19268317 -18964169 -18419274 -17783059 -17111975
9525 -17111975 -16406800 -15727267 -15083463 -14440877 -13809940 -13155707 -12457123 -11702860 -10918545
9516 -10918545 -10155057 -9458695 -8962867 -8796581 -9045045 -9764462 -10873611 -12192726 -13483770
9507 -13483770 -14563184 -15261127 -15606024 -15569072 -15288252 -14838654 -14261241 -13618197 -13002200
9498a3002200N49244M78391L87578K88696J55071N2199L7317O2152J27146J45065
9488a0719341J21419P5769n1828k26365k96519l47315l29589k89970j34613K7616
9478a2170736J96491L44983M50588N40081N22233M82100L50067J98888j1134k39339
9468i335778m21146n67832o88498o72902n91545m55006k66663j06484M2900J33480
9458a2929474J92891K32921K21400K45609L27365L80108M23923M50952M60282
9449i994023M24314L79705L41502K48475J47455j3158k57441n09635p61362q69041
9439a0863209q55759p39714n35837k61886M979J61824K88691L55673L82081L83146
9429a1680011L89333L72941L49704L13105K56893J31517O5378N263n8140q5035
$$ plain form
9498 -13002200 -12452956 -11974565 -11586987 -11298291 -11143220 -11091021 -11053704 -10991552 -10864406 -10719341
9488 -10719341 -10597922 -10522153 -10573981 -10800346 -11096865 -11444180 -11773769 -12063739 -12198352 -12170736
9478 -12170736 -11974245 -11629262 -11178674 -10638593 -10116360 -9634260 -9284193 -9085305 -9096439 -9335778
9468 -9335778 -9756924 -10324756 -11013254 -11686156 -12277701 -12732707 -12999370 -13105854 -13062954 -12929474
9458 -12929474 -12736583 -12503662 -12282262 -12036653 -11709288 -11329180 -10905257 -10454305 -9994023
9449 -9994023 -9569709 -9190004 -8848502 -8600027 -8452572 -8465730 -8723171 -9232806 -9994168 -10863209
9439 -10863209 -11718968 -12458682 -12994519 -13256405 -13251426 -13089602 -12800911 -12445238 -12063157 -11680011
9429 -11680011 -11290678 -10917737 -10568033 -10254928 -9998035 -9866518 -9801140 -9795877 -9854017 -9939052
9419i939052q2866r8637j48958j99152k29094k31667j61466m7728O4173J31525
9409a0942922J77887K34964K79319K86858K63421K37207K04615J47949Q0647l3601
9399i063656j46739k46054l12686l30489k73387j38836k7035O3062J14105J65861
9389a0195854J78745J72275J83640J58201J52952J67688J95537J90665J30889
9380h665262J59183J60037R9687N2988P41k0254m8963r9364j42558j40277o0955
9369h704997J2475J7057L2923Q2587J00705Q8670Q2019J07122Q5064O6979R9525
9358g929871R1463P0498R9467P9815O9678O8987N3397O5101N5997K2632Q6729
9347g166107Q9176O4918O9929M4727L1853N5434Q0311M3216L2412O3764M4946
$$ plain form
9419 -9939052 -10021918 -10120555 -10269513 -10468665 -10697759 -10929426 -11090892 -11138620 -11074447 -10942922
9409 -10942922 -10765035 -10530071 -10250752 -9963894 -9700473 -9463266 -9258651 -9110702 -9030055 -9063656
9399 -9063656 -9210395 -9456449 -9769135 -10099624 -10373011 -10511847 -10538882 -10475820 -10361715 -10195854
9389 -10195854 -10017109 -9844834 -9661194 -9502993 -9350041 -9182353 -8986816 -8796151 -8665262
9380 -8665262 -8506079 -8346042 -8246355 -8193367 -8192626 -8212880 -8261843 -8361207 -8503765 -8644042 -8704997
9369 -8704997 -8692522 -8675465 -8642542 -8559955 -8459250 -8370580 -8288561 -8181439 -8096375 -8029396 -7929871
9358 -7929871 -7838408 -7767910 -7668443 -7588628 -7518950 -7449963 -7396566 -7331465 -7275468 -7252836 -7166107
9347 -7166107 -7076931 -7012013 -6942084 -6897357 -6865504 -6810070 -6729759 -6686543 -6654131 -6590367 -6545421
9336f545421K9483M1431O8564P8382M1897K5458K7556J4368L0130L2828M0309
9325f115015O8019M8566M8688L8185J6286J2288M6461M0602L5655K2762M5239
9314e692264L1571K1671N5202N1137M4648J5374J8395J0270L3082L3944J6186
9303e360784L4473L2671M8388M2989L0299J8839J8722J7298M7530N0540J7985
9292e001050P721K3969N8866L5395K6125L1248J3664K8181N1993K7314K7092M0782
9280d628700L2059j8828N859N1832M2868K4317N9368M7286K9811P467R11J089
9268d344661K7212K9280J3959K8773K2592M1479L8223L3812O814P720L0210P825
9256d056762K725n693P769Q703K2594Q285N398L4077M7262K9630J3581J9085J8913
$$ plain form
9336 -6545421 -6515938 -6474507 -6405943 -6327561 -6285664 -6260206 -6232650 -6218282 -6188152 -6155324 -6115015
9325 -6115015 -6046996 -5998430 -5949742 -5911557 -5895271 -5882983 -5836522 -5795920 -5760265 -5737503 -5692264
9314 -5692264 -5660693 -5639022 -5583820 -5532683 -5488035 -5472661 -5454266 -5443996 -5410914 -5376970 -5360784
9303 -5360784 -5326311 -5293640 -5245252 -5202263 -5171964 -5153125 -5134403 -5117105 -5069575 -5019035 -5001050
9292 -5001050 -4993329 -4969360 -4910494 -4875099 -4848974 -4817726 -4804062 -4775881 -4723888 -4696574 -4669482 -4628700
9280 -4628700 -4596641 -4615469 -4609610 -4557778 -4514910 -4490593 -4431225 -4383939 -4354128 -4346661 -4345750 -4344661
9268 -4344661 -4317449 -4288169 -4274210 -4245437 -4222845 -4181366 -4143143 -4109331 -4102517 -4094797 -4064587 -4056762
9256 -4056762 -4054037 -4059730 -4051961 -4043258 -4020664 -4012379 -4006981 -3972904 -3925642 -3896012 -3882431 -3863346 -3844433
9243c844433J9054J2161R280J4402M4846J7598J0159K433J7232N586p35K0013
9231c672404K9387L3556K1993J6325R907n117L1532M5178L5837j1783J2360M8517
9219c404712L5199j2127K8615L5842O654K3214J6254K1740k5447q706J1372K7540
9207c244562J8176q215J3504L1376O4642K8436J1249J0273K1175L1777M1644M9123
9195b931402K3208L7584O7292K3010o808k4773Q716J0272R757n3k9771n633J1056
9182b807545K784K9281N091R420J0965M0132N8639K3492j6309M160L6916K0879
9170b582095J586n826M0468L9674o521j128K6914K3714J1089J4992M1208K434
9158b393491J1886J1076j015K8462N2500K8817PJ8345L2569N1175M6187N430j0744
$$ plain form
9243 -3844433 -3825379 -3813218 -3803938 -3789536 -3744690 -3727092 -3716933 -3714500 -3697268 -3691682 -3692417 -3672404
9231 -3672404 -3643017 -3609461 -3587468 -3571143 -3561236 -3566353 -3534821 -3489643 -3453806 -3465589 -3453229 -3404712
9219 -3404712 -3369513 -3381640 -3353025 -3317183 -3310529 -3287315 -3271061 -3249321 -3274768 -3283474 -3272102 -3244562
9207 -3244562 -3226386 -3234601 -3221097 -3189721 -3125079 -3096643 -3085394 -3075121 -3053946 -3022169 -2980525 -2931402
9195 -2931402 -2908194 -2870610 -2803318 -2780308 -2787116 -2811889 -2803173 -2792901 -2783144 -2783197 -2812968 -2818601 -2807545
9182 -2807545 -2804761 -2775480 -2770389 -2760969 -2750004 -2709872 -2651233 -2627741 -2644050 -2639890 -2602974 -2582095
9170 -2582095 -2580509 -2586335 -2545867 -2506193 -2512714 -2513842 -2486928 -2463214 -2452125 -2437133 -2395925 -2393491
9158 -2393491 -2381605 -2370529 -2371544 -2343082 -2290582 -2261765 -2261758 -2243413 -2210844 -2159669 -2113482 -2108052 -2118796
9145b118796L2822M0553k404k3218j6170K0170K3704L985K533L6040L527j4267
9133b011521J2889L7660j086J0748K4041J7048j0669L579K8141M6729L8296M0703
9121a763442L9263J1842K4701J2518J876n319R026j9603j8824J1563M0903J7879
9109a637617J1367n734J1077J9825L61L5036L7024R866K9420o052j9783P242K4959
9096a483009j1971L7502L7022L1076M0874K6458K3551m943R111K9065K2808Q680
9084a233776L5436N1123K8706j803K8646L1693l74J7021M5002M4171J2002j3506
9072i55659K05K2536M8706J9267J768R538L835K7023J7483L4197K2417M886M1516
9059g02282K5347J7372J6377R247o303L6629J2431J5263J9665l309J9475K7340
$$ plain form
9145 -2118796 -2085974 -2045421 -2047825 -2071043 -2087213 -2067043 -2043339 -2039354 -2036821 -2000781 -1997254 -2011521
9133 -2011521 -1998632 -1960972 -1962058 -1951310 -1927269 -1910221 -1920890 -1917311 -1889170 -1842441 -1804145 -1763442
9121 -1763442 -1724179 -1712337 -1687636 -1675118 -1673242 -1678561 -1669535 -1689138 -1707962 -1696399 -1655496 -1637617
9109 -1637617 -1626250 -1631984 -1620907 -1601082 -1600721 -1565685 -1528661 -1518795 -1489375 -1495427 -1515210 -1507968 -1483009
9096 -1483009 -1494980 -1457478 -1420456 -1389380 -1348506 -1322048 -1298497 -1303440 -1294329 -1265264 -1242456 -1233776
9084 -1233776 -1198340 -1147217 -1118511 -1120314 -1091668 -1059975 -1060349 -1043328 -998326 -954155 -942153 -955659
9072 -955659 -955454 -932918 -884212 -864945 -863177 -853639 -849804 -822781 -805298 -771101 -748684 -743798 -702282
9059 -702282 -676935 -659563 -643186 -633939 -640242 -603613 -591182 -575919 -556254 -559563 -540088 -512748
9047e12748L0008M2297N7979M5223j989r985n397o759L3446K2912L281J4696R634
9034b77402J7615K5589K4042J7182M0827m332o421J1499L0447J6538J9742J9612
9022f5062K8908K0930L1144L6344L6707R221K8012K2471j8002M4843M4232J5594
9010B35342J0556M3052M6200L4762J4710K4506K4999J6051J8118L4754N6714L4051
8998E93815r475j4998K2916M1100J8180K9269J6328L4328N2908K8571K2589J9427
8986H54958J7344L3697M2038K6467J7251K3746J1766R792M5999J8230J2809N450
8974A119547Q068M6846O1321L1396J4385K4370M2296L352K2226M2168J7725M249
8962A437949L7201N0928L7362P8683M2392K6838M5710J6319J7748O4216M0966
$$ plain form
9047 -512748 -482740 -440443 -382464 -337241 -339230 -349215 -354612 -361371 -327925 -305013 -301732 -287036 -277402
9034 -277402 -259787 -234198 -210156 -192974 -152147 -156479 -162900 -151401 -120954 -104416 -84674 -65062
9022 -65062 -36154 -15224 15920 52264 88971 98192 126204 148675 130673 175516 219748 235342
9010 235342 245898 288950 335150 369912 384622 409128 434127 450178 468296 503050 559764 593815
8998 593815 584340 569342 592258 633358 651538 680807 697135 731463 784371 812942 835531 854958
8986 854958 872302 905999 948037 974504 991755 1015501 1027267 1037059 1083058 1101288 1114097 1119547
8974 1119547 1127615 1174461 1235782 1267178 1281563 1305933 1348229 1351581 1373807 1415975 1433700 1437949
8962 1437949 1475150 1526078 1563440 1642123 1684515 1711353 1757063 1773382 1791130 1855346 1896312
8951A896312J1399J4364M0910J9519p962L1760L8062K0496M5109N3186K8926L1388
8939B223469L7962L8061M1545L4157L6892M1102K9142K9126L4900M0563N2539
8928B639458K8541K6392O8972O9096N0204M0652K5716L0347M7279Q2564M2915
8917C152136J9024L1123L4203O0949P4278M7101J8279O2454L8917M2504M1700
8906C622668M0073L0641O2672O0669P2002P3400O0991O7814L0583N0298N3970
8895D225781N2609M5036P4912M6024P4632R8161O7987O9656N3064O0943P1979
8884D940784M8980P1445P2803P3417P1080L8465L3930k3127j259k9289m5163q674
8872E243392K5103K5972K9946O0903O3701N0010N2456N5090J02507N7213P3388
$$ plain form
8951 1896312 1907711 1922075 1962985 1982504 1974542 2006302 2044364 2064860 2109969 2163155 2192081 2223469
8939 2223469 2261431 2299492 2341037 2375194 2412086 2453188 2482330 2511456 2546356 2586919 2639458
8928 2639458 2667999 2694391 2763363 2832459 2882663 2923315 2949031 2979378 3026657 3109221 3152136
8917 3152136 3171160 3202283 3236486 3297435 3371713 3418814 3437093 3499547 3538464 3580968 3622668
8906 3622668 3662741 3693382 3756054 3816723 3888725 3962125 4023116 4090930 4121513 4171811 4225781
8895 4225781 4278390 4323426 4398338 4444362 4518994 4617155 4685142 4754798 4807862 4868805 4940784
8884 4940784 4989764 5061209 5134012 5207429 5278509 5316974 5350904 5327777 5326518 5297229 5252066 5243392
8872 5243392 5268495 5294467 5324413 5385316 5449017 5499027 5551483 5606573 5709080 5766293 5839681
8861E839681J12390R8869R4223R9599J04549Q3221P2344M5813N5874O7236J09311
8850F783110O2595L4347J6755J2847J4415O1173N4878P0831J18523J32159J58866
8839G520499J96170K21134K40396K13719K14435K25974K38249J92397K27063K84539
8829I774575K60687K66275K64605K65564K69412K27434K09670J42918j2926k10772
8819A1457442m10807n81236o86772p12381o86526n78539m90682m39526k98398
8810F572575k06646j20273p8389j9134K7409K2341P6533J21735J35761J93480
8800F725392K01500K46978K54682J98035J27306n6260j94211m01523n37190o15556
8790E949153o03374n66955n00047m39056m14795l54573k69177j44610j8186P5235
$$ plain form
8861 5839681 5952071 6050940 6145163 6244762 6349311 6432532 6504876 6550689 6606563 6673799 6783110
8850 6783110 6845705 6880052 6896807 6909654 6924069 6985242 7040120 7110951 7229474 7361633 7520499
8839 7520499 7716669 7937803 8178199 8391918 8606353 8832327 9070576 9262973 9490036 9774575
8829 9774575 10035262 10301537 10566142 10831706 11101118 11328552 11538222 11681140 11668214 11457442
8819 11457442 11046635 10465399 9778627 9066246 8379720 7801181 7310499 6870973 6572575
8810 6572575 6365929 6245656 6167267 6148133 6175542 6197883 6274416 6396151 6531912 6725392
8800 6725392 6926892 7173870 7428552 7626587 7753893 7697633 7503422 7101899 6564709 5949153
8790 5949153 5345779 4778824 4278777 3839721 3424926 3070353 2801176 2656566 2638380 2713615
8780B713615J56772J75322K01970J98091J49701J43756J88539J96538J93297J96500
8770D514101K10991K31796K09858K08477J99302K47212K41841K55903K82663L18168
8760F920312L68453M26125M52706M47646M49953M50263M40474M00319L44110K74448
8750A0974809J58981k3713k75070m77114n68509n49445m16282l23696k11649j58655
8740H129657j90907k02224k48395m21033p16530j098615j379661j483634j355298
8731A033360j022953o19846k57651k2975N7067N1653k9227j64054l37539m64597
8721a776762n78873o24360n31528m02599l01142j70118j71172k49493l87824n23784
8711e717655o57903q17245r77484j163737j269288j241869j030189o53390k49325
$$ plain form
8780 2713615 2870387 3045709 3247679 3445770 3595471 3739227 3927766 4124304 4317601 4514101
8770 4514101 4725092 4956888 5166746 5375223 5574525 5821737 6063578 6319481 6602144 6920312
8760 6920312 7288765 7714890 8167596 8615242 9065195 9515458 9955932 10356251 10700361 10974809
8750 10974809 11133790 11110077 10835007 10357893 9789384 9239939 8823657 8499961 8288312 8129657
8740 8129657 7938750 7736526 7488131 7067098 6350568 5251953 3872292 2388658 1033360
8731 1033360 10407 -609439 -867090 -890065 -832998 -781345 -810572 -974626 -1312165 -1776762
8721 -1776762 -2355635 -2979995 -3511523 -3914122 -4215264 -4385382 -4556554 -4806047 -5193871 -5717655
8711 -5717655 -6375558 -7192803 -8170287 -9334024 -10603312 -11845181 -12875370 -13528760 -13778085
8702a3778085P611J88666K86643K91659L43161L53249L90855M37399M51297M86664
8692a0540881N19258M80881M48123M31566M16984L84467L73141M25440M80217
8683f580804N05888M68979M11934L89796L69169L07161L13553L21991K91067K56917
8673b944349K45310K54530J82862N2824j16559k80473m22659m63845n26697n52577
8663d571633o28823o60819n96953n06021m45108m64227o02910p08208q16728p11048
8653a0712478n36423k77230k1684J85683K75333K38345J58610J19127M7302n5822
8643a0579237j89201l45841n05959o36143o39484n83437n33804n04623m28162
8634a4945891m59744n12826o12749p01321q30652q22382o52211l72287j33035
$$ plain form
8702 -13778085 -13770474 -13581808 -13295165 -13003506 -12660345 -12307096 -11916241 -11478842 -11027545 -10540881
8692 -10540881 -10021623 -9540742 -9092619 -8661053 -8244069 -7859602 -7486461 -7061021 -6580804
8683 -6580804 -6074916 -5605937 -5194003 -4804207 -4435038 -4127877 -3814324 -3492333 -3201266 -2944349
8673 -2944349 -2699039 -2444509 -2261647 -2208823 -2325382 -2605855 -3028514 -3492359 -4019056 -4571633
8663 -4571633 -5200456 -5861275 -6458228 -6964249 -7409357 -7873584 -8476494 -9184702 -10001430 -10712478
8653 -10712478 -11248901 -11526131 -11547815 -11362132 -11086799 -10848454 -10689844 -10570717 -10523415 -10579237
8643 -10579237 -10768438 -11114279 -11620238 -12256381 -12895865 -13479302 -14013106 -14517729 -14945891
8634 -14945891 -15405635 -15918461 -16531210 -17232531 -18063183 -18885565 -19537776 -19910063 -20043098
8625b0043098k87537o01246l01500K68528M96783N64576N18031M42601M08527
8616a8534335M65222M60092M47548M12311L51867K80271K48509K70031K44053
8607a5354431K10240K50908K74256K58805K26872K35030K66323K46971K83342
8598a3101684K89188K40280J67844J18686J11464Q6238N0312J9761R324J9248
8588a1989339j2720o1416n4143J2406J16536K22570L01973K14211m92254j659563
8578a3401739j669950n38862J60443L36470L77639L79292L62887L08698K31325
8569a3453797J29254M6473l5808j05635j11591j60270k32385k98642l43587k86977
8559a4852965j79212m3767J01077J59705J91532K30655K08312J34257N4547p657
$$ plain form
8625 -20043098 -20330635 -20931881 -21233381 -20964853 -20468070 -19903494 -19385463 -18942862 -18534335
8616 -18534335 -18069113 -17609021 -17161473 -16749162 -16397295 -16117024 -15868515 -15598484 -15354431
8607 -15354431 -15144191 -14893283 -14619027 -14360222 -14133350 -13898320 -13631997 -13385026 -13101684
8598 -13101684 -12812496 -12572216 -12404372 -12285686 -12174222 -12087984 -12037672 -12017911 -12008587 -11989339
8588 -11989339 -12002059 -12063475 -12117618 -12105212 -11988676 -11766106 -11464133 -11249922 -11742176 -13401739
8578 -13401739 -15071689 -15610551 -15450108 -15113638 -14735999 -14356707 -13993820 -13685122 -13453797
8569 -13453797 -13324543 -13278070 -13313878 -13419513 -13531104 -13691374 -13923759 -14222401 -14565988 -14852965
8559 -14852965 -15032177 -15075944 -14974867 -14815162 -14623630 -14392975 -14184663 -14050406 -13995859 -14003516
8549a4003516l5041k386L1430Q5336J04232R0647Q8786J06359J16492J45560J43244
8538a3128857J72902K47464K31469k7777n65551p86729l20129R1069K16848K13760
8528a3655531K27675K18154J90110J57421J25727J35830J22455J15684R5456Q5798
8518a2181221P1224N4901P1360P1725L8205N3221O7642J10946Q2460N7839L0942
8507a1470756M2872N7959L4453M7409K7859K8809M3693N8244P8992M2942M7614
8496a0959910M9480O2032K7813M3861N2476L8855L8964L8662L8221K8499J3938
8485a0527109L5047O4500P0491Q0098L2809M1212L6602L4200N8968O3538O3311
8474i946333M5082K5208K6347N7950N9900M6476J0703L4821M7779M3887J8540
$$ plain form
8549 -14003516 -14038557 -14040943 -14009513 -13924177 -13819945 -13729298 -13640512 -13534153 -13417661 -13272101 -13128857
8538 -13128857 -12955955 -12708491 -12477022 -12504799 -13070350 -13857079 -14177208 -14086139 -13869291 -13655531
8528 -13655531 -13427856 -13209702 -13019592 -12862171 -12736444 -12600614 -12478159 -12362475 -12267019 -12181221
8518 -12181221 -12109997 -12055096 -11983736 -11912011 -11873806 -11820585 -11752943 -11641997 -11559537 -11501698 -11470756
8507 -11470756 -11427884 -11369925 -11335472 -11288063 -11260204 -11231395 -11187702 -11129458 -11050466 -11007524 -10959910
8496 -10959910 -10910430 -10848398 -10820585 -10776724 -10724248 -10685393 -10646429 -10607767 -10569546 -10541047 -10527109
8485 -10527109 -10492062 -10427562 -10357071 -10276973 -10244164 -10202952 -10166350 -10132150 -10073182 -10009644 -9946333
8474 -9946333 -9901251 -9876043 -9849696 -9791746 -9731846 -9685370 -9674667 -9639846 -9592067 -9548180 -9529640
8463i529640O0085M0950L3475M9379L6488K4999J9689P022J9046N0672M5480K1526
8451i120829L2959K3420L3089L4186J8816K8438L9182j4890R001K3504o86k1275
8439h915085K2037K9802K9802O3953O8925R060J8218K2788J3198K0312O7871M7317
8427h501802R452K577K6311L6541J1425J5275L3802p32n509L2348K1948Q029n325
8414h315660R22L6738M5031L4002K5453K427J2214M9157K6542O731k044o390J0573
8401h074304N8439O3160L5810K4158K5042K5652Q607o509j1981K6579P299J5763
8389g802285M2945J6661J6727J3280J7547L1603Q572J4460R769K2638M2460J7840
8377g547783j2069L4578K2278J2902k498L0983K0338K6390L0282L2905L1199K0704
$$ plain form
8463 -9529640 -9469555 -9428605 -9395130 -9345751 -9309263 -9284264 -9264575 -9257553 -9238507 -9187835 -9142355 -9120829
8451 -9120829 -9087870 -9064450 -9031361 -8997175 -8978359 -8949921 -8910739 -8925629 -8916628 -8893124 -8893810 -8915085
8439 -8915085 -8893048 -8863246 -8833444 -8769491 -8700566 -8691506 -8673288 -8650500 -8637302 -8616990 -8549119 -8501802
8427 -8501802 -8492350 -8489773 -8463462 -8426921 -8415496 -8400221 -8366419 -8367151 -8372660 -8340312 -8318364 -8310335 -8315660
8414 -8315660 -8314738 -8278000 -8232969 -8198967 -8173514 -8171087 -8158873 -8109716 -8083174 -8076443 -8078487 -8084877 -8074304
8401 -8074304 -8015865 -7952705 -7916895 -7892737 -7867695 -7842043 -7833436 -7839945 -7851926 -7825347 -7818048 -7802285
8389 -7802285 -7759340 -7742679 -7725952 -7712672 -7695125 -7663522 -7654950 -7640490 -7630721 -7608083 -7565623 -7547783
8377 -7547783 -7559852 -7525274 -7502996 -7490094 -7492592 -7461609 -7441271 -7414881 -7384599 -7351694 -7320495 -7299791
8365g299791n544K0095N256K1846K0221l521J7942R264J9104K4854k462j6352
8353g189088N4714M1999K1004J4614J7403K9808J4164J9311N945o407P672J1892
8341f956969L6399N759M739n187J8993J2206n961J0800J2370K1705J698O762J0567
8328f826119k6656L210L2741R716Q620K272J600J3358L2988K1955K1234K1535
8316f683546J119J9396K4460J6783K6911P759j8974j3962J2557M415j357M699
8304f599740J3117M152N482P088K3152L0127L0174J1532r14Q969K6840J8919L955
8291f417147J5528J1427L1006K1220j2583k3046j5923J2587L0647o655L752L1727
8279f317460L1903K9973m705J9430J7433L6610J1971k1564j513J0832Q318N616
$$ plain form
8365 -7299791 -7305335 -7285240 -7279984 -7258138 -7237917 -7241438 -7223496 -7214232 -7195128 -7170274 -7172736 -7189088
8353 -7189088 -7134374 -7092375 -7071371 -7056757 -7039354 -7009546 -6995382 -6976071 -6970126 -6976533 -6968861 -6956969
8341 -6956969 -6920570 -6914811 -6910072 -6915259 -6896266 -6884060 -6890021 -6879221 -6866851 -6845146 -6843448 -6836686 -6826119
8328 -6826119 -6852775 -6849565 -6816824 -6807108 -6798488 -6796216 -6794616 -6781258 -6748270 -6726315 -6705081 -6683546
8316 -6683546 -6682427 -6663031 -6638571 -6621788 -6594877 -6587118 -6606092 -6620054 -6607497 -6603082 -6604439 -6599740
8304 -6599740 -6586623 -6582471 -6576989 -6569901 -6546749 -6516622 -6486448 -6474916 -6475830 -6466861 -6440021 -6421102 -6417147
8291 -6417147 -6401619 -6390192 -6359186 -6337966 -6350549 -6373595 -6389518 -6376931 -6346284 -6352939 -6349187 -6317460
8279 -6317460 -6285557 -6255584 -6260289 -6240859 -6223426 -6186816 -6174845 -6196409 -6197922 -6187090 -6178772 -6173156
8267f173156L4191K3039J6260m56K962J045N599J7975j3427j1903n624L3544j1106
8254f081057O214K2050K664J2959n215K0831k142k901J3354L5730J8871J3988
8242e944654J2758Q586O398K9960j5832j8898o573J0626N986K5920L4942N676
8230e845105q025L6555j2415K641J3266P498l6245k6538j1549L629J6340K7047
8218e832901M4880J0383K808K7859P866J4646N437o997J8029N447Q525R650J5482
8205e668886j972J5612J1719J1679J2352k0972m999L0972N100J6129K9621j646
8193e565291k9653K886j990k0350M1199L7182J509J5035L0090N1089J9256j6790
8181e435828l1306p501k469l02O258o157J6837K5211o51j136q628K0894L0271
$$ plain form
8267 -6173156 -6138965 -6115926 -6099666 -6100122 -6097160 -6096115 -6090516 -6072541 -6085968 -6097871 -6103495 -6069951 -6081057
8254 -6081057 -6074843 -6052793 -6050129 -6037170 -6042385 -6021554 -6023696 -6026597 -6013243 -5977513 -5958642 -5944654
8242 -5944654 -5931896 -5923310 -5916912 -5886952 -5902784 -5921682 -5928255 -5917629 -5911643 -5885723 -5850781 -5845105
8230 -5845105 -5853130 -5816575 -5828990 -5826349 -5813083 -5805585 -5841830 -5868368 -5879917 -5876288 -5859948 -5832901
8218 -5832901 -5788021 -5777638 -5774830 -5746971 -5739105 -5724459 -5719022 -5726019 -5707990 -5702543 -5694018 -5684368 -5668886
8205 -5668886 -5670858 -5655246 -5643527 -5631848 -5619496 -5640468 -5645467 -5614495 -5609395 -5593266 -5563645 -5565291
8193 -5565291 -5594944 -5592058 -5594048 -5614398 -5573199 -5536017 -5534508 -5519473 -5489383 -5438294 -5419038 -5435828
8181 -5435828 -5467134 -5474635 -5477104 -5477406 -5471148 -5477305 -5460468 -5435257 -5435908 -5437044 -5445672 -5424778 -5394507
8168e394507J6941R370K2307k689J1352M8194R568K4804k4856j0561M595m6368
8156e331850j1571K6351J6466j641M052j84K2671O199q627J7710J2936l4286j9519
8143e301293M3622L9662j051j6253l9013j5266r626K0454O313Q299N0700L404
8131e210048l1157p077j581k042J2050K5072J3757j8361N496M6810N6156k679
8119e113604k9543Q205J2627Q260J5334j3059J9001L8122q64J5227q261l0708
8107e079263j4722K927K2710L6914P651l085L755J3751P809j3656k1142j6827
8095e053178m052j7217k2021K5600K4682J1981J5221J6654k997O746K7315M2233
8083d929033L5567j3116j8641j0853J278J3204J1588R625K5639k631M154J082
$$ plain form
8168 -5394507 -5377566 -5368196 -5345889 -5348578 -5337226 -5289032 -5279464 -5254660 -5279516 -5290077 -5285482 -5331850
8156 -5331850 -5343421 -5317070 -5300604 -5302245 -5298193 -5298377 -5275706 -5269507 -5278134 -5260424 -5247488 -5281774 -5301293
8143 -5301293 -5257671 -5218009 -5219060 -5235313 -5274326 -5289592 -5299218 -5278764 -5272451 -5264152 -5213452 -5210048
8131 -5210048 -5241205 -5248282 -5249863 -5251905 -5239855 -5214783 -5201026 -5219387 -5213891 -5167081 -5110925 -5113604
8119 -5113604 -5143147 -5134942 -5122315 -5114055 -5098721 -5111780 -5092779 -5054657 -5055521 -5040294 -5048555 -5079263
8107 -5079263 -5093985 -5091058 -5068348 -5031434 -5023783 -5026868 -5023113 -5009362 -5001553 -5015209 -5036351 -5053178
8095 -5053178 -5057230 -5074447 -5096468 -5070868 -5046186 -5034205 -5018984 -5002330 -5005327 -4998581 -4971266 -4929033
8083 -4929033 -4893466 -4906582 -4925223 -4936076 -4934798 -4921594 -4910006 -4900381 -4874742 -4877373 -4873219 -4872137
8071d872137j3047j2442K398J0825n503p580k434L8447K4645q908j714j686p397
8058d856533r483K18J2562K2994K9670k771j3600J4404L5710j767J37k862J2604
8045d758717J3957Q882J440k028J1631K5209N435N968N498K952Q854q740j2726
8032d692385P718N673q816P033L5984L22l2423p436j3044K6697M6883K1342n802
8019d608254J9091K0709k7946k2839R249J1677r2K593n35k1893J9188J2286J2911
8006d573855n262N908K9042J7635m693j5659k8234K3989K0722j3898K152L9097
7994d503056J9897J259j022L176R304j2072K882M14O174K040J0228n569p42J4554
7980d452533P14m785N159P982M5593K912j3626M086p817j6415R812q144K9898
$$ plain form
8071 -4872137 -4885184 -4897626 -4895228 -4884403 -4889906 -4897486 -4899920 -4861473 -4836828 -4845736 -4847450 -4849136 -4856533
8058 -4856533 -4866016 -4865798 -4853236 -4830242 -4800572 -4803343 -4816943 -4802539 -4766829 -4768596 -4768459 -4771321 -4758717
8045 -4758717 -4744760 -4735878 -4734438 -4736466 -4724835 -4699626 -4694191 -4688223 -4682725 -4679773 -4670919 -4679659 -4692385
8032 -4692385 -4684667 -4678994 -4687810 -4680777 -4644793 -4644471 -4676894 -4684330 -4697374 -4670677 -4623794 -4602452 -4608254
8019 -4608254 -4589163 -4568454 -4596400 -4619239 -4609990 -4598313 -4598405 -4595812 -4596347 -4618240 -4599052 -4586766 -4573855
8006 -4573855 -4579117 -4573209 -4544167 -4526532 -4531225 -4546884 -4575118 -4551129 -4530407 -4544305 -4542153 -4503056
7994 -4503056 -4483159 -4481900 -4482922 -4479746 -4470442 -4482514 -4479632 -4479218 -4473044 -4471004 -4460776 -4466345 -4467087 -4452533
7980 -4452533 -4451819 -4456604 -4451445 -4443463 -4397870 -4394958 -4408584 -4404498 -4412315 -4428730 -4418918 -4427062 -4397164
7967d397164Q479k216P365L50k2316K0398K938k0030l091K4068J5254J6909K987
7954d346069O486J3726R502r556l6667j9845J1273J0025Q08k0917L1196M2195
7942d307843j8148o772j190j8174L4120M619J6166O730K691r544k8129J3498R559
7929d302417P576J6628j4504j1168J487o137j2626L4614L9136Q031k5335k176
7917d266891p999N569L0228k5527K2273J96R494J6613m681J5575J5051k0669j0204
7904d220972P041l05J7117R097p322q072K0786k093J1870o694J9265N825q29M039
7890d151247j7068k3570j7115K9949K1546j2984p597J2770N7513r175k0435p617
7878d145030J7434J8033Q556J0647p001K70O277j9873k5602K093K053j690K3441
$$ plain form
7967 -4397164 -4388685 -4390901 -4383536 -4383186 -4405502 -4385104 -4382166 -4402196 -4405287 -4381219 -4365965 -4349056 -4346069
7954 -4346069 -4339583 -4325857 -4316355 -4325911 -4362578 -4382423 -4371150 -4361125 -4360317 -4381234 -4350038 -4307843
7942 -4307843 -4325991 -4332763 -4333953 -4352127 -4318007 -4313388 -4297222 -4290492 -4287801 -4297345 -4325474 -4311976 -4302417
7929 -4302417 -4294841 -4278213 -4292717 -4303885 -4302398 -4308535 -4321161 -4286547 -4247411 -4239380 -4264715 -4266891
7917 -4266891 -4274890 -4269321 -4239093 -4264620 -4242347 -4242151 -4232657 -4216044 -4220725 -4205150 -4190099 -4210768 -4220972
7904 -4220972 -4213931 -4214236 -4197119 -4188022 -4195344 -4203416 -4182630 -4184723 -4172853 -4179547 -4160282 -4154457 -4155286 -4151247
7890 -4151247 -4168315 -4191885 -4209000 -4179051 -4157505 -4170489 -4178086 -4165316 -4107803 -4116978 -4137413 -4145030
7878 -4145030 -4127596 -4109563 -4101007 -4090360 -4097361 -4097091 -4090814 -4110687 -4136289 -4134196 -4132143 -4133833 -4110392
7865d110392L0890N6388Q390k2958N892M568J396k0790K6489J2305l3177j9484
7853d060483j3478j371J1026R842J100J45K2960K9492K2927J5029j4082l2489
7841d009382q869O154J9179k961K274j5100K3295M185k8547k7009Q324L6035K5339
7828c967083J0841q857J2188j8989j6776J3256L3320j0972l454j831J04k6368
7816c984621J4615J1423M339J216l762p555L190k865K4224K9757Q172k479j0386
7803c914732J5527M348J322K008M1033K2296p268k353n104k5818m655k3815k346
7790c899557K1512N403P477J0424J4791J9613j8529j7655J3259R712j1362K2565
7778c822347K1207M980m006j1204K133K2369P4M196L831J0467N637J3359j9755
$$ plain form
7865 -4110392 -4079502 -4023114 -4014724 -4037682 -4031790 -4027222 -4025826 -4046616 -4020127 -4007822 -4040999 -4060483
7853 -4060483 -4073961 -4075332 -4064306 -4054464 -4053364 -4053219 -4030259 -4000767 -3977840 -3962811 -3976893 -4009382
7841 -4009382 -4018251 -4012097 -3992918 -3995879 -3993605 -4008705 -3985410 -3981225 -4009772 -4036781 -4028457 -3992422 -3967083
7828 -3967083 -3956242 -3965099 -3952911 -3971900 -3988676 -3975420 -3942100 -3953072 -3956526 -3958357 -3958253 -3984621
7816 -3984621 -3970006 -3958583 -3954244 -3953028 -3956790 -3964345 -3961155 -3964020 -3939796 -3910039 -3901867 -3904346 -3914732
7803 -3914732 -3899205 -3894857 -3893535 -3891527 -3850494 -3828198 -3835466 -3837819 -3842923 -3868741 -3873396 -3897211 -3899557
7790 -3899557 -3878045 -3872642 -3865165 -3854741 -3839950 -3820337 -3838866 -3856521 -3843262 -3833550 -3844912 -3822347
7778 -3822347 -3801140 -3796160 -3800166 -3811370 -3809237 -3786868 -3786794 -3782598 -3778767 -3768300 -3762663 -3749304 -3769059
7765c769059q445m763L029n944k1170m411J7275L0955J6737p660J8098K1728o923
7752c720553j7423l1780J9661J6961j4403l082J2774m813l740j1867K6296J3671
7740c718298P215J7236j0220j9047J48N983j6907k0078K841K4976K4246J1335
7728c690570O567K0368j986n63Q486p744N613K4933J1445j2956m72R776J4557
7715c612546l1975n84J9163J0176J4236P353j6908q853K305Q010k1092p971N902
7702c632784l1035j3104J6779K0981J1243J262q776J663K9113Q374K396O740j1581
7689c598729n395r1K177J2055J7416k386k3513m370l418K2112K8492O587o081
7676c555144l943r746L505L219L921j6427l1805k3946M4509L1271J4978L256R633
$$ plain form
7765 -3769059 -3777504 -3782267 -3779238 -3785182 -3806352 -3810763 -3793488 -3762533 -3745796 -3753456 -3735358 -3713630 -3720553
7752 -3720553 -3737976 -3769756 -3750095 -3733134 -3747537 -3750619 -3737845 -3742658 -3746398 -3758265 -3731969 -3718298
7740 -3718298 -3711083 -3693847 -3704067 -3723114 -3722966 -3716983 -3733890 -3753968 -3751127 -3726151 -3701905 -3690570
7728 -3690570 -3684003 -3663635 -3665621 -3666184 -3657698 -3665442 -3659829 -3634896 -3623451 -3636407 -3636879 -3627103 -3612546
7715 -3612546 -3644521 -3645105 -3625942 -3615766 -3601530 -3594177 -3611085 -3619938 -3617633 -3609623 -3630715 -3638686 -3632784
7702 -3632784 -3663819 -3676923 -3660144 -3639163 -3627920 -3626658 -3635434 -3633771 -3604658 -3596284 -3593888 -3587148 -3598729
7689 -3598729 -3604124 -3604215 -3602038 -3589983 -3572567 -3574953 -3598466 -3602836 -3606254 -3584142 -3555650 -3549063 -3555144
7676 -3555144 -3559087 -3568833 -3565328 -3562109 -3558188 -3574615 -3606420 -3630366 -3585857 -3554586 -3539608 -3536352 -3526719
7663c526719j7950J8028K6243l3541k500r72J839m399K5519L112j1145M198L5248
7650c483039J8184k3978j6679r309P530k70O849K9633j0521j3867p597K242J6349
7637c484473Q697O792L7656K939l6773j7359L5045J7643k2525k7177P744m532
7625c476323J1533J1342M992j1008m826K8255R321j7473Q836J0612j8719j0161
7613c453619j5456m7J4806o3J3649J8626o940r271k765j2068K0184L4563q258
7600c406659j5110N533o452J5449J0745k886j4896R288J4768P946K7017J2642
7588c342615l1494j6157J3408L1465P047J028j1895j7272K483P536m691K994j2590
7575c370753k3811L8034K0759j2740N82k0876j0407N451K5365M7526J5078R400
$$ plain form
7663 -3526719 -3544669 -3526641 -3500398 -3533939 -3536439 -3537411 -3535572 -3539971 -3514452 -3511340 -3522485 -3518287 -3483039
7650 -3483039 -3464855 -3488833 -3505512 -3514821 -3507291 -3507561 -3500712 -3471079 -3481600 -3495467 -3503064 -3500822 -3484473
7637 -3484473 -3475776 -3468984 -3431328 -3428389 -3465162 -3482521 -3447476 -3429833 -3452358 -3479535 -3471791 -3476323
7625 -3476323 -3464790 -3453448 -3448456 -3459464 -3464290 -3436035 -3426714 -3444187 -3435351 -3424739 -3443458 -3453619
7613 -3453619 -3469075 -3469122 -3454316 -3454379 -3440730 -3422104 -3429044 -3438315 -3441080 -3453148 -3432964 -3398401 -3406659
7600 -3406659 -3421769 -3416236 -3422688 -3407239 -3396494 -3399380 -3414276 -3404988 -3390220 -3382274 -3355257 -3342615
7588 -3342615 -3374109 -3390266 -3376858 -3345393 -3338346 -3337318 -3349213 -3366485 -3364002 -3356466 -3361157 -3358163 -3370753
7575 -3370753 -3394564 -3356530 -3335771 -3348511 -3347929 -3368805 -3379212 -3373761 -3348396 -3300870 -3285792 -3276392
7563c276392j9650l0695j5903Q999l610j7501K3759Q62j1129K803J3584j754j8017
7550c344644L499k22R892M6463J8782K701k6216k6471j2656K7548K1538n25J7984
7537c262327J1122j0542j8538J0895P722j2723r988k9292J4547N4678M6793l9595
7525c237248l6358j0053k5712j0965J9585L9522j0405J0076J5467j4602J5025
7514c245668L9612K208J89j4546k5995O379K5828O055L0601J8252M942k5064l1703
7501c208910q618o975k371k747K8906K2525N515j1674m5368n5L7586K0768J873
7488c169545k4115j8477p268J762L234J7394N763k9985K242J7292o619m30J4991
7475c193761J0765r322j263J9446O452j1678K1464k728j2865J0462M661R106K452
$$ plain form
7563 -3276392 -3296042 -3326737 -3342640 -3333641 -3337251 -3354752 -3330993 -3330131 -3341260 -3338457 -3324873 -3326627 -3344644
7550 -3344644 -3341145 -3341367 -3331475 -3285012 -3266230 -3263529 -3289745 -3316216 -3328872 -3301324 -3279786 -3280311 -3262327
7537 -3262327 -3251205 -3261747 -3280285 -3269390 -3261668 -3274391 -3284379 -3313671 -3299124 -3244446 -3197653 -3237248
7525 -3237248 -3273606 -3283659 -3309371 -3320336 -3300751 -3261229 -3271634 -3261558 -3246091 -3260693 -3245668
7514 -3245668 -3206056 -3203848 -3203659 -3218205 -3244200 -3237821 -3211993 -3205938 -3175337 -3157085 -3152143 -3177207 -3208910
7501 -3208910 -3217528 -3224503 -3226874 -3229621 -3200715 -3178190 -3172675 -3184349 -3229717 -3229772 -3192186 -3171418 -3169545
7488 -3169545 -3193660 -3212137 -3219405 -3217643 -3214409 -3197015 -3191252 -3221237 -3218995 -3201703 -3208322 -3208752 -3193761
7475 -3193761 -3182996 -3192318 -3193581 -3174135 -3167683 -3179361 -3157897 -3160625 -3173490 -3163028 -3158367 -3149261 -3146809
7462c146809o320j1031l271J2289J9932K5506m19j8088K7494L243j6701j2072
7450c126247J2653j1098K2130n269J5192k457m1873j2565O118K6901J3137Q547
7438c094831M823k740R173N04j4121m7650k0k655K4142J2969J0051K8939J7389
7425c054027K1737q83k1268P961k272j7661R385n853m739k0409l373M1327J511
7412c048564j4141j461J012j265L586m518k0643m910j4832M2495L5947Q155J718
7399c017421k692j4092k6626j3376r316L233J2692K4126k741N838p679O168O760
7386c035126J6488J9596O521L134K0516o418k5487J861K81J2098J9812L819l753
7373b966658j2271l2807p158J2522J7571L936M355o024Q634j597J2302K6740P161
$$ plain form
7462 -3146809 -3153129 -3164160 -3167431 -3155142 -3135210 -3109704 -3110123 -3128211 -3100717 -3097474 -3114175 -3126247
7450 -3126247 -3113594 -3124692 -3102562 -3107831 -3092639 -3095096 -3136969 -3149534 -3143416 -3116515 -3103378 -3094831
7438 -3094831 -3090008 -3092748 -3083575 -3083071 -3097192 -3144842 -3144862 -3147517 -3123375 -3110406 -3100355 -3071416 -3054027
7425 -3054027 -3032290 -3033173 -3054441 -3046480 -3048752 -3066413 -3057028 -3062881 -3067620 -3088029 -3091402 -3050075 -3048564
7412 -3048564 -3062705 -3064166 -3063154 -3064419 -3060833 -3065351 -3085994 -3090904 -3105736 -3063241 -3027294 -3019139 -3017421
7399 -3017421 -3020113 -3034205 -3060831 -3074207 -3083523 -3080290 -3067598 -3043472 -3046213 -3040375 -3048054 -3041886 -3035126
7386 -3035126 -3018638 -2999042 -2992521 -2989387 -2968871 -2975289 -3000776 -2998915 -2998634 -2986536 -2966724 -2962905 -2966658
7373 -2966658 -2978929 -3011736 -3018894 -3006372 -2988801 -2984865 -2980510 -2986534 -2977900 -2979497 -2967195 -2940455 -2933294
7360b933294l9628j9054j934J5510J3218n287M107r122j8081J061N173J6745L4223
7347b936363r913j6161L913J2520j9605j0999p714j1579K1047J1175K1594q177
7335b950262j3753K0205j0314k7080k680J8169J0675L6689K749j7637p003J806
7323b938436k4661j9764M219J6739p21K919L1579J3081N914m240R073R108K585
7310b892605k4437l6479j5851M1242l387j0661P938K9042o875M433N585j4031
7298b916086k0578k948J798K1647K6780j0543k238K157N2037j3814k7141O258
7286b882671P945n586O218Q999j4879J2497o340q709J1919p597p854k543K2717
7273b865884J5861N971J7916n704o981j5154r233O811j1410K483J2165q444l870
$$ plain form
7360 -2933294 -2972922 -2991976 -2993910 -2978400 -2965182 -2970469 -2966362 -2975484 -2993565 -2992504 -2987331 -2970586 -2936363
7347 -2936363 -2946276 -2962437 -2958524 -2946004 -2965609 -2976608 -2984322 -2995901 -2974854 -2963679 -2942085 -2950262
7335 -2950262 -2964015 -2943810 -2954124 -2981204 -2983884 -2965715 -2955040 -2918351 -2915602 -2933239 -2940242 -2938436
7323 -2938436 -2963097 -2982861 -2978642 -2961903 -2962624 -2959705 -2928126 -2915045 -2909131 -2913371 -2904298 -2895190 -2892605
7310 -2892605 -2917042 -2953521 -2969372 -2928130 -2931517 -2942178 -2934240 -2905198 -2912073 -2907640 -2902055 -2916086
7298 -2916086 -2936664 -2939612 -2937814 -2916167 -2889387 -2899930 -2902168 -2900011 -2847974 -2861788 -2888929 -2882671
7286 -2882671 -2874726 -2880312 -2874094 -2865095 -2879974 -2867477 -2873817 -2882526 -2870607 -2878204 -2886058 -2888601 -2865884
7273 -2865884 -2850023 -2844052 -2826136 -2831840 -2838821 -2853975 -2863208 -2856397 -2867807 -2865324 -2853159 -2861603 -2865473
7260b865473K4875p689k162M209L3415J3233J2462j6466K8541J7094j6078k3915
7248b797954k5246j7773P225j114l404k7050L741L4065m741J924M391K2619L043
7235b800274k224q892J4847M406Q490l9712l9879j8111K0609J4573J3067O629
7223b826471K418o067J0354j6281N614M206P047K7103J1788N892L501N934J3624
7210b751338j0647J3610K0349l9234k6811Q049K0351p748J1661J52p91K1070k5624
7197b766951j0238r905k108K1366O322L10k2749j9372O231L2585P044L718J2975
7184b740772k907M171O138j0171j5736r685j5442J4590k272m42J6025o285J3960
7171b748828J8705K8806J9876k9375j0182n815K488J4372k9027j5908K2100J039
$$ plain form
7260 -2865473 -2840598 -2848287 -2850449 -2846240 -2812825 -2799592 -2787130 -2803596 -2775055 -2757961 -2774039 -2797954
7248 -2797954 -2823200 -2840973 -2833748 -2834862 -2838266 -2865316 -2861575 -2827510 -2832251 -2830327 -2825936 -2803317 -2800274
7235 -2800274 -2802498 -2811390 -2796543 -2792137 -2783647 -2823359 -2863238 -2881349 -2860740 -2846167 -2833100 -2826471
7223 -2826471 -2824053 -2830120 -2819766 -2836047 -2830433 -2826227 -2819180 -2792077 -2780289 -2774397 -2770896 -2764962 -2751338
7210 -2751338 -2761985 -2748375 -2728026 -2767260 -2794071 -2786022 -2765671 -2773419 -2761758 -2761606 -2762397 -2741327 -2766951
7197 -2766951 -2777189 -2787094 -2789202 -2767836 -2761514 -2761204 -2783953 -2803325 -2797094 -2764509 -2757465 -2753747 -2740772
7184 -2740772 -2743679 -2739508 -2733370 -2743541 -2759277 -2768962 -2784404 -2769814 -2772086 -2772528 -2756503 -2762788 -2748828
7171 -2748828 -2730123 -2701317 -2681441 -2710816 -2720998 -2726813 -2724325 -2709953 -2738980 -2754888 -2732788 -2731749
7159b731749K0838K5028J0938J0999j0079l5144p762K1103K3357q844o840q149
7147b696304J5063J4184k6085k4938n819q775M247M24l4863J4986J5412K4669
7135b707799J4263J0892M763k2482k908l634P718k7668J011P798K2611o965J1660
7122b690740J8147q012j3995O659o468J6899k995L755N651K5110j3558k1770M488
7109b676829Q170J829m803J4435K315k664L421O742K4240j6724j864L292j1814
7096b650254j6244K4390o338k5553O727o254J4486J7072j0122m673L1441k590
7084b627912p558n023N916l99j6495K5851j390k8213j0884J2389M924L743n93
7071b645644k3722K3072K0857j0057o983Q843j453M40J7142J6217n267q10k0943
$$ plain form
7159 -2731749 -2710911 -2685883 -2674945 -2663946 -2674025 -2709169 -2716931 -2695828 -2672471 -2681315 -2688155 -2696304
7147 -2696304 -2681241 -2667057 -2693142 -2718080 -2723899 -2732674 -2728427 -2728003 -2762866 -2747880 -2732468 -2707799
7135 -2707799 -2693536 -2682644 -2677881 -2700363 -2703271 -2706905 -2699187 -2726855 -2725844 -2718046 -2695435 -2702400 -2690740
7122 -2690740 -2672593 -2680605 -2694600 -2687941 -2694409 -2677510 -2680505 -2676750 -2671099 -2645989 -2659547 -2681317 -2676829
7109 -2676829 -2668659 -2666830 -2671633 -2657198 -2654883 -2657547 -2654126 -2647384 -2623144 -2639868 -2641732 -2638440 -2650254
7096 -2650254 -2666498 -2642108 -2648446 -2673999 -2667272 -2673526 -2659040 -2641968 -2652090 -2656763 -2625322 -2627912
7084 -2627912 -2635470 -2640493 -2634577 -2634976 -2651471 -2625620 -2627010 -2655223 -2666107 -2653718 -2648794 -2645051 -2645644
7071 -2645644 -2669366 -2646294 -2625437 -2635494 -2642477 -2633634 -2635087 -2634647 -2617505 -2601288 -2606555 -2607365 -2628308
7058b628308J4274J969L509L8656J2748k0245l0194J712j3960k7072R403L4648
7046b602860K0791n721o162J6389J0304q886M216j9698j8972J4675P291j5775
7034b604408k3249J279L8139K5677j6368j3055q675k25R232j5342j1148J1600
7022b606543R367M578P52J1691K2081j569j1888j5340k6891J994K4420K2424J6645
7009b548279k685P003r752o940N048K3403P646p636o382k0699k2866j1282J4085
6996b579336N143J514K7R762J8692K0037p789N879K1100K2102L137l7390k7804
6983b544926K2295K0771p629l3878m500J1210J8474K6511J0046n1619k4207Q630
6971b548822K0407j1882o042J4223J5243j3702K7392K6899l662j008k7593K588
$$ plain form
7058 -2628308 -2614034 -2612065 -2608556 -2569900 -2557152 -2577397 -2607591 -2605879 -2619839 -2646911 -2637508 -2602860
7046 -2602860 -2582069 -2587790 -2593952 -2577563 -2567259 -2576145 -2571929 -2591627 -2610599 -2595924 -2588633 -2604408
7034 -2604408 -2627657 -2626378 -2588239 -2562562 -2578930 -2591985 -2600660 -2600885 -2591653 -2606995 -2618143 -2606543
7022 -2606543 -2597176 -2592598 -2591846 -2580155 -2558074 -2559643 -2571531 -2586871 -2613762 -2611768 -2587348 -2564924 -2548279
7009 -2548279 -2550964 -2543961 -2553713 -2560653 -2555605 -2532202 -2524556 -2532192 -2538574 -2559273 -2582139 -2593421 -2579336
6996 -2579336 -2574193 -2572679 -2572652 -2562890 -2544198 -2524161 -2531950 -2526071 -2504971 -2482869 -2479732 -2517122 -2544926
6983 -2544926 -2522631 -2501860 -2509489 -2543367 -2547867 -2536657 -2518183 -2491672 -2481626 -2533245 -2557452 -2548822
6971 -2548822 -2528415 -2540297 -2546339 -2532116 -2516873 -2530575 -2503183 -2476284 -2479946 -2480954 -2508547 -2505959
6959b505959K7894N744j5691k0422K1880M8609J4990l349l5127l0119J2029L0877
6947b448644R766Q764k468n905k0709j6042j2195J7250N815r036k4895k740o165
6934b507204l1212R326J3546J5890J8158j138j5751k88K0819N785L7847O583k3589
6921b451228k5997j0782j2817P326K3969j600P070P972O534J6643J1709k637k618
6908b426456J0854k0496j7199j2845L851K788J2651N637k3278j0197L5521P7M973
6895b434119J262j4075r402k8107M236O436J0352K2732J6688O321M748j3485j8149
6882b444562K7824K143m54L488m694m691L529N158N413L7241k5833m5495k4117
6869b465050K4928j836J0431q565n333K7833K7228J0309j2248k0938j2194R682
$$ plain form
6959 -2505959 -2478065 -2472321 -2488012 -2508434 -2486554 -2437945 -2422955 -2426304 -2461431 -2491550 -2479521 -2448644
6947 -2448644 -2438878 -2430114 -2432582 -2438487 -2459196 -2475238 -2487433 -2470183 -2464368 -2473404 -2498299 -2501039 -2507204
6934 -2507204 -2538416 -2529090 -2515544 -2499654 -2481496 -2482634 -2498385 -2498673 -2477854 -2472069 -2434222 -2427639 -2451228
6921 -2451228 -2477225 -2488007 -2500824 -2493498 -2469529 -2471129 -2464059 -2456087 -2449553 -2432910 -2421201 -2423838 -2426456
6908 -2426456 -2415602 -2436098 -2453297 -2466142 -2462291 -2459503 -2446852 -2441215 -2464493 -2474690 -2439169 -2439092 -2434119
6895 -2434119 -2432857 -2446932 -2456334 -2484441 -2480205 -2473769 -2463417 -2440685 -2423997 -2417676 -2412928 -2426413 -2444562
6882 -2444562 -2416738 -2414595 -2415049 -2411561 -2416255 -2420946 -2417417 -2412259 -2406846 -2369605 -2395438 -2440933 -2465050
6869 -2465050 -2440122 -2441958 -2431527 -2440092 -2445425 -2417592 -2390364 -2380055 -2392303 -2413241 -2425435 -2415753
6857b415753Q255n201J1510j4418l866J7604j093j1578l2523j132O872j1716m686
6844b457725j4166K0049K1722J8594K065k4011K0720J2258r625J5023K8987k2037
6832b388146m5171p555K925K235K3587K0341n839k1239O129J7413o405L3089L2619
6819b336017j8875j2484r595J5025m031k2317n138L4299J2467r101j2908Q132
6807b360543O801o086N65N867Q061k3868j4627J5583K414J6686j5511j9316k0697
6794b404671J3785J5154r706J591k42M883M2069p405j9768p675o043K015m528
6781b380541J4323K4296k6164l190J436o996j3142L81P257M936j7612j999K5888
6768b371127P20n721j0261K9918K2300m855j0617q421j648j4590J7804M1747j8971
$$ plain form
6857 -2415753 -2407498 -2412699 -2401189 -2415607 -2419473 -2401869 -2402962 -2414540 -2447063 -2448195 -2441323 -2453039 -2457725
6844 -2457725 -2471891 -2451842 -2430120 -2411526 -2409461 -2433472 -2412752 -2400494 -2410119 -2395096 -2366109 -2388146
6832 -2388146 -2433317 -2440872 -2437947 -2435712 -2412125 -2391784 -2397623 -2418862 -2412733 -2395320 -2401725 -2368636 -2336017
6819 -2336017 -2354892 -2367376 -2376971 -2361946 -2365977 -2388294 -2393432 -2359133 -2346666 -2355767 -2368675 -2360543
6807 -2360543 -2353742 -2359828 -2359263 -2353396 -2345335 -2369203 -2383830 -2368247 -2365833 -2349147 -2364658 -2383974 -2404671
6794 -2404671 -2390886 -2375732 -2385438 -2383847 -2384089 -2379206 -2337137 -2344542 -2364310 -2371985 -2378028 -2376013 -2380541
6781 -2380541 -2366218 -2341922 -2368086 -2371276 -2369840 -2376836 -2389978 -2389597 -2382340 -2377404 -2395016 -2397015 -2371127
6768 -2371127 -2370407 -2376128 -2386389 -2356471 -2334171 -2339026 -2349643 -2358064 -2359712 -2374302 -2356498 -2314751 -2333722
6755b333722j3402O932J0609J1864j3942j5535o915k637J0619R209J0659J7216
6743b309045M290K558j4981j3853R426j3884J4563p790j09K009j1796n080M6778
6730b296914r850k0850k3534O317M0646J5039r626j2563j2096J7401J3942J5446
6718b276642K0170j8735M388J9941k3458j3473J9467O434l109k462m557K0441
6706b251595j6781j0741O599M562R75m627m6213k1449K0321J386J0243M744l700
6693b306276K1667J1108l1808k1696K0108J7609K1496k5643p503J4416J9928k3466
6681b290060q597J5913O800J3994j8501k6961l484J6822K1541J1206k050K066
6669b261311p523M822J3523j0244n085k2329J4832k263j2951J6442J411j1452
$$ plain form
6755 -2333722 -2347124 -2340192 -2329583 -2317719 -2331661 -2347196 -2354111 -2356748 -2346129 -2336920 -2326261 -2309045
6743 -2309045 -2304755 -2302197 -2317178 -2331031 -2321605 -2335489 -2320926 -2328716 -2328825 -2326816 -2338612 -2343692 -2296914
6730 -2296914 -2306764 -2327614 -2351148 -2344831 -2304185 -2289146 -2298772 -2311335 -2323431 -2306030 -2292088 -2276642
6718 -2276642 -2256472 -2275207 -2270819 -2250878 -2274336 -2287809 -2268342 -2261908 -2265017 -2267479 -2272036 -2251595
6706 -2251595 -2268376 -2279117 -2272518 -2267956 -2266981 -2271608 -2317821 -2339270 -2318949 -2317563 -2307320 -2302576 -2306276
6693 -2306276 -2284609 -2273501 -2305309 -2327005 -2306897 -2289288 -2267792 -2293435 -2300938 -2286522 -2266594 -2290060
6681 -2290060 -2298657 -2282744 -2275944 -2261950 -2280451 -2307412 -2310896 -2294074 -2272533 -2261327 -2263377 -2261311
6669 -2261311 -2268834 -2264012 -2250489 -2260733 -2265818 -2288147 -2273315 -2275578 -2288529 -2272087 -2270676 -2282128
6657b282128k60j0323J6766Q986J3266n773K663K2523K3221k4056q726J9777K1502
6644b202562j6967Q941n644k7070o428K4618R81j5646k923p238N740l4258J219
6631b277237l305Q777J8679q493O962J733j0796J172J7330P163L6515j6526n921
6618b223947j4341L52M058Q91J9598M641M728r261O251M867m055j7967j9241M539
6604b238887O907J4734n598J0661K1817k9992l9531j3308K2491K2547M844j0169
6592b233484j7326M664L5781J397L347m553J3699L5106K2904k8886P602l064k8492
6579b191305p904J6179m859R620n515j3695j0300K418j4409K099N141J1407K1741
6566b179382k815l4185j2914M1835J9838j2133R360j3309l309k946q899M3854
$$ plain form
6657 -2282128 -2282388 -2292711 -2275945 -2266959 -2253693 -2259466 -2256803 -2234280 -2211059 -2235115 -2243841 -2224064 -2202562
6644 -2202562 -2219529 -2210588 -2216232 -2243302 -2249730 -2225112 -2224131 -2239777 -2242700 -2249938 -2244198 -2278456 -2277237
6631 -2277237 -2280542 -2271765 -2253086 -2261579 -2254617 -2252884 -2263680 -2262508 -2245178 -2238015 -2201500 -2218026 -2223947
6618 -2223947 -2238288 -2237936 -2233878 -2232987 -2213389 -2208748 -2204020 -2213281 -2207030 -2202163 -2206218 -2224185 -2243426 -2238887
6604 -2238887 -2231980 -2217246 -2222844 -2212183 -2190366 -2220358 -2259889 -2273197 -2250706 -2228159 -2223315 -2233484
6592 -2233484 -2250810 -2246146 -2210365 -2208968 -2205621 -2210174 -2196475 -2161369 -2138465 -2167351 -2159749 -2162813 -2191305
6579 -2191305 -2199209 -2183030 -2187889 -2178269 -2183784 -2197479 -2207779 -2205361 -2219770 -2217671 -2212530 -2201123 -2179382
6566 -2179382 -2182197 -2216382 -2229296 -2187461 -2167623 -2179756 -2170396 -2183705 -2187014 -2189960 -2198859 -2155005
6554b155005J4550j3161K0229j8867l844Q657M293p243p120j6380n3036j2287
6542b239214K3041K0369P161K1201q304N079L7215p43j3566J0583m054N508l5548
6529b171272j0339J0806J2926J9597K1512o643k0406k822P908R025K458J8673
6517b108577N64l8377m4088P747j320J124J2791K1330K7381j3013j6262M703J593
6504b144404j729j8998r528j1472P177m821L381n674j4382J5483J4320Q395J0751
6491b151501K165n327J4852J6168n040J570o369P932o629q220j8107j0141L7064
6478b131583J1297R000j7669j4514J898l95O062J5652L0378j0640j4267j6340
6466b131121J4153j334k1390J3525L5090J9425p612o346j7925R228J8351k9189
$$ plain form
6554 -2155005 -2140455 -2153616 -2133387 -2152254 -2156098 -2147441 -2143148 -2150391 -2157511 -2173891 -2226927 -2239214
6542 -2239214 -2216173 -2195804 -2188643 -2167442 -2175746 -2170667 -2133452 -2134195 -2147761 -2137178 -2141232 -2135724 -2171272
6529 -2171272 -2181611 -2170805 -2157879 -2138282 -2116770 -2123413 -2143819 -2146641 -2138733 -2129708 -2127250 -2108577
6517 -2108577 -2108013 -2146390 -2190478 -2182731 -2184051 -2182927 -2170136 -2148806 -2121425 -2134438 -2150700 -2145997 -2144404
6504 -2144404 -2146133 -2165131 -2174659 -2186131 -2178954 -2183775 -2180394 -2186068 -2200450 -2184967 -2170647 -2162252 -2151501
6491 -2151501 -2149336 -2154663 -2139811 -2123643 -2128683 -2127113 -2133482 -2125550 -2132179 -2140399 -2158506 -2168647 -2131583
6478 -2131583 -2120286 -2111286 -2128955 -2143469 -2141571 -2141966 -2135904 -2120252 -2089874 -2100514 -2114781 -2131121
6466 -2131121 -2116968 -2118302 -2139692 -2126167 -2091077 -2071652 -2079264 -2085610 -2103535 -2094307 -2075956 -2105145
6454b105145m3636j1484K7791K1816o237k0580n242o761j6519K5569K3085Q271
6442b109072p984O343j2858j3609L2206J4747K6016J5144j2805m6530j4485K6481
6430b096406Q752p878k8577j1992R98j8020N882J3525R102L6544q813k233K2744
6417b076372N768l34P195l3257j4331J7908J3289J531k2858N691J4754l232j9109
6404b103357M237o876r975J0232R680J4470L4617J2364j3142l4034l5069K142
6392b114711K0521N150o010q39O707J4797J741N31m0421j3500Q746J6505M1171
6379b059612J9154j2413J7762k9544l8172l609j9229K3008M0338J0210p554p753
6367b067414m395J8967o837J2925j6364m841J897j052q158k2796j1882R352O548
$$ plain form
6454 -2105145 -2148781 -2160265 -2132474 -2110658 -2116895 -2137475 -2142717 -2149478 -2165997 -2140428 -2117343 -2109072
6442 -2109072 -2117056 -2110713 -2123571 -2137180 -2104974 -2090227 -2064211 -2049067 -2061872 -2108402 -2122887 -2096406
6430 -2096406 -2087654 -2095532 -2124109 -2136101 -2135103 -2153123 -2147241 -2133716 -2124614 -2088070 -2096883 -2099116 -2076372
6417 -2076372 -2070604 -2070938 -2063743 -2097000 -2111331 -2093423 -2080134 -2078603 -2101461 -2095770 -2081016 -2084248 -2103357
6404 -2103357 -2099120 -2105996 -2115971 -2105739 -2096059 -2081589 -2046972 -2034608 -2047750 -2081784 -2116853 -2114711
6392 -2114711 -2094190 -2089040 -2095050 -2095889 -2089182 -2074385 -2072644 -2072113 -2112534 -2126034 -2117288 -2100783 -2059612
6379 -2059612 -2040458 -2052871 -2035109 -2064653 -2102825 -2106434 -2125663 -2102655 -2062317 -2052107 -2059661 -2067414
6367 -2067414 -2071809 -2052842 -2059679 -2046754 -2063118 -2067959 -2066062 -2067114 -2075272 -2098068 -2109950 -2100598 -2094050
6354b094050J7306K1405k290p442J6434p235j2184J0068L7786k690M06J7532J7506
6341a987448l9174m2860j8501Q369J1180J7473j0532p015N358J4277Q055j4735
6329b055553K8125k0942N505L3758o202j794L36q848o596L7537P38k7954m977
6316b026867J2807j8833l0314k4442K2149J7463J9397K736J487J9842R684N336
6304a989555k5296k0012Q799K1162r135k4011K8582K2633j4136m573p40r383j5872
6291b031537j4265r879J0524K2703J2812Q881j1312k6068o415n951J2190J8476
6279b019841J7005j6493k9877N828j449J2415R378o678L7616K524q800j7834j0153
6266b026359K2146l1977j0977L4604K1871q222q907p034J5170k8846j6980n059
$$ plain form
6354 -2094050 -2076744 -2055339 -2057629 -2065071 -2048637 -2055872 -2068056 -2057988 -2020202 -2022892 -2022486 -2004954 -1987448
6341 -1987448 -2026622 -2069482 -2087983 -2079614 -2068434 -2050961 -2061493 -2068508 -2063150 -2048873 -2040818 -2055553
6329 -2055553 -2027428 -2048370 -2042865 -2009107 -2015309 -2017103 -2016767 -2025615 -2032211 -1994674 -1993936 -2021890 -2026867
6316 -2026867 -2014060 -2032893 -2063207 -2087649 -2065500 -2048037 -2028640 -2025904 -2024417 -2004575 -1994891 -1989555
6304 -1989555 -2014851 -2034863 -2026064 -2004902 -2014037 -2038048 -2009466 -1986833 -2000969 -2005542 -2006282 -2015665 -2031537
6291 -2031537 -2045802 -2055681 -2045157 -2022454 -2009642 -2000761 -2012073 -2038141 -2044556 -2050507 -2038317 -2019841
6279 -2019841 -2002836 -2019329 -2049206 -2043378 -2044827 -2032412 -2023034 -2029712 -1992096 -1989572 -1998372 -2016206 -2026359
6266 -2026359 -2004213 -2036190 -2047167 -2012563 -1990692 -1998914 -2007821 -2014855 -1999685 -2028531 -2045511 -2050570
6254b050570K4581K0998Q250J0989J7324Q361k0917J4085J5188k683p322p118
6242a968834M923O622q003k7412k792J8247Q144j1389k9047N671Q272O951M4160
6229a944487k300m4640o149J1804r486m880J2155k6066n616K4372R819k376J6372
6216a971478K3898N195n77J2937J325l2365j011k480j2738p60K573M784p343R758
6202a968282J3181J7397k3424K210J8504J016n360R478J674k2567j834Q047K2341
6189a927619k489j9987o390J3980k4589k0332J8145P795p468J7606K5024Q216
6177a918108q536o001j3132j9202J9922J1428L3068J7158k0167l3058k1762J3466
6165a944924L5640r005j7254j2800j5767L615m443J6888L4002l424l2083k7761
$$ plain form
6254 -2050570 -2025989 -2004991 -1996741 -1985752 -1968428 -1960067 -1980984 -1966899 -1951711 -1954394 -1961716 -1968834
6242 -1968834 -1963911 -1957289 -1965292 -1992704 -1995496 -1977249 -1969105 -1980494 -2009541 -2003870 -1995598 -1988647 -1944487
6229 -1944487 -1946787 -1991427 -1997576 -1985772 -1995258 -2000138 -1987983 -2014049 -2019665 -1995293 -1985474 -1987850 -1971478
6216 -1971478 -1947580 -1942385 -1942962 -1930025 -1928700 -1961065 -1962076 -1964556 -1977294 -1978054 -1975481 -1970697 -1978040 -1968282
6202 -1968282 -1955101 -1937704 -1961128 -1958918 -1940414 -1939398 -1944758 -1935280 -1933606 -1956173 -1958007 -1949960 -1927619
6189 -1927619 -1930108 -1950095 -1956485 -1942505 -1967094 -1987426 -1969281 -1961486 -1968954 -1951348 -1926324 -1918108
6177 -1918108 -1926644 -1932645 -1945777 -1964979 -1945057 -1933629 -1900561 -1883403 -1903570 -1936628 -1958390 -1944924
6165 -1944924 -1909284 -1918289 -1935543 -1948343 -1964110 -1960495 -1964938 -1948050 -1914048 -1917472 -1949555 -1977316
6153a977316K5855J8574j2733k6498p820K0123Q482J3018K4378j984j7576O608
6141a926889n967Q909J1557j770k5253l3257j100M864L4678J3822j3111k9918
6129a963435j3893K700K0923L616K9665k0165j140j3424m562m003L0628J4753
6117a918337P316O447k881j1219r210K029J3104P181k0647M96k605q060j8574
6104a954960J1712j7005j1476K7327Q282N552L6059K6487k8695n710J0479L5307
6092a856641j8679k0300k4603k202J8064K2227M123k0528j8218j4365K7026L0193
6080a873903k2153j9585R097R570M294l989q793P013j4337l223l54J1614m826
6067a909575O119l289J1922M558K3729k8587j9048K2797K0036j0719k0289j1833
$$ plain form
6153 -1977316 -1951461 -1932887 -1945620 -1972118 -1979938 -1959815 -1951333 -1938315 -1913937 -1915921 -1933497 -1926889
6141 -1926889 -1932856 -1923947 -1912390 -1914160 -1939413 -1972670 -1973770 -1968906 -1934228 -1920406 -1933517 -1963435
6129 -1963435 -1977328 -1974628 -1953705 -1950089 -1920424 -1940589 -1941729 -1955153 -1959715 -1963718 -1933090 -1918337
6117 -1918337 -1911021 -1904574 -1907455 -1918674 -1927884 -1925855 -1912751 -1905570 -1926217 -1925721 -1928326 -1936386 -1954960
6104 -1954960 -1943248 -1960253 -1971729 -1944402 -1936120 -1930568 -1894509 -1868022 -1896717 -1902427 -1891948 -1856641
6092 -1856641 -1875320 -1895620 -1920223 -1922425 -1904361 -1882134 -1878011 -1898539 -1916757 -1931122 -1904096 -1873903
6080 -1873903 -1896056 -1915641 -1906544 -1896974 -1892680 -1896669 -1905462 -1898449 -1912786 -1916009 -1916363 -1904749 -1909575
6067 -1909575 -1903456 -1906745 -1894823 -1890265 -1866536 -1895123 -1914171 -1891374 -1871338 -1882057 -1902346 -1914179
6055a914179L771j533M617j0861o41J0743j0500J991K3252K5520K1353J2228j3568
6042a847807k9258j600J223J6722j3869l928k1344o57j3171o052O838k246k390
6029a917539O969J9025P395K577J7620L637L4051l1472k3583j8227o60R667j0818
6016a901358o56J0394K1903J3254J1375K0338j7587k4344M124l051N890j7474
6004a877192K0277K1256L431K611l713j9481n797j2304j211Q347k0185j4289J5711
5991a882539m211N96J3893L103P00K534p388j9202L4281K5766q152J3769O255
5978a820595q504l0726J0076K1413j9524K3177R29J5288j1097l752r180j1385
5966a843880j6255q318J3293L4702k9289k6198J6427Q440J0063p537L877K2056
$$ plain form
6055 -1914179 -1910408 -1911941 -1907324 -1918185 -1918826 -1908083 -1918583 -1916592 -1893340 -1867820 -1846467 -1834239 -1847807
6042 -1847807 -1877065 -1878665 -1877442 -1860720 -1874589 -1878517 -1899861 -1900518 -1913689 -1919741 -1912903 -1915149 -1917539
6029 -1917539 -1910570 -1891545 -1884150 -1881573 -1863953 -1860316 -1826265 -1857737 -1881320 -1899547 -1900207 -1890540 -1901358
6016 -1901358 -1902014 -1891620 -1869717 -1856463 -1845088 -1824750 -1842337 -1866681 -1862557 -1865608 -1859718 -1877192
6004 -1877192 -1856915 -1835659 -1832228 -1829617 -1833330 -1852811 -1858608 -1870912 -1872123 -1863776 -1883961 -1898250 -1882539
5991 -1882539 -1886750 -1886154 -1872261 -1869158 -1868458 -1865924 -1873312 -1892514 -1858233 -1832467 -1840619 -1826850 -1820595
5978 -1820595 -1829099 -1859825 -1849749 -1828336 -1847860 -1824683 -1823754 -1808466 -1819563 -1823315 -1832495 -1843880
5966 -1843880 -1860135 -1868453 -1855160 -1820458 -1849747 -1875945 -1859518 -1851078 -1841015 -1848552 -1844675 -1822619
5954a822619j6865K5766P388j8351M59j4330k7971k2459K1858J1711o500J3312
5942a848601K1829r594L851J1749k6707N835J8716j0451l7672p92L7856K7217
5930a806764j0027k9595j0972m04k113J6754P376o957o891k842M115K219J3900
5917a832201K7107O557l2502q331K7294r013l5268j164O560J9592m323K8087J0982
5904a796623R108j404J3790r117j2089N623K4561K8115k3572j2415k0671j4336
5892a809030o581J8629L092j764N288k0185J9972L7782k8495l6873j9827J3854
5880a824138J4101K1777Q861j293P302n783J6556k3598k3996o454k673j5915Q84
5867a834369K4491J681J805J2540k801j348J1908j1527j9792k0064j0069q359
$$ plain form
5954 -1822619 -1839484 -1813718 -1806330 -1824681 -1824222 -1838552 -1866523 -1888982 -1867124 -1855413 -1861913 -1848601
5942 -1848601 -1826772 -1836366 -1832515 -1820766 -1847473 -1841638 -1822922 -1833373 -1871045 -1871837 -1833981 -1806764
5930 -1806764 -1816791 -1846386 -1857358 -1857762 -1859875 -1843121 -1835745 -1842702 -1849593 -1852435 -1848320 -1846101 -1832201
5917 -1832201 -1805094 -1798537 -1831039 -1839370 -1812076 -1821089 -1856357 -1857521 -1850961 -1831369 -1835692 -1807605 -1796623
5904 -1796623 -1787515 -1788919 -1775129 -1784246 -1796335 -1790712 -1766151 -1738036 -1761608 -1774023 -1794694 -1809030
5892 -1809030 -1815611 -1796982 -1793890 -1795654 -1790366 -1810551 -1790579 -1752797 -1781292 -1818165 -1837992 -1824138
5880 -1824138 -1810037 -1788260 -1779399 -1780692 -1773390 -1779173 -1762617 -1786215 -1810211 -1816665 -1819338 -1835253 -1834369
5867 -1834369 -1809878 -1808197 -1806392 -1793852 -1796653 -1798001 -1786093 -1797620 -1817412 -1837476 -1847545 -1855904
5855a855904j176M1169L0590M072m17j2387j2785P717j4482j3636L3580n21m450
5842a798630K44J1931r520K08M814j1338K6465l871k714J4574k3771p272j684
5829a800564k3042k394j2721J6910J0339n22J1347K5174J6804j6660k3824l96
5817a799549J1651J2793K9066J0180j0578q802L3217R741q323j8182k1334o897
5805a767017k0268j7574n672k5515j3457K3528L2841J1452J5927M029J8493n366
5793a748599l3700m2856L845J9302K7634K1742j3919r58j6341j9185k8027J2446
5781a818616L8013J2775p661j2283J5898K485j1206l4195J2398L3164R887J0339
5769a749002J0534O304o182r619k9691m248J3465K5876K1241j5137P536p937M404
$$ plain form
5855 -1855904 -1857080 -1815911 -1785321 -1781249 -1781666 -1794053 -1806838 -1799121 -1813603 -1827239 -1793659 -1794180 -1798630
5842 -1798630 -1798386 -1786455 -1795975 -1795767 -1790953 -1802291 -1775826 -1779697 -1782411 -1767837 -1791608 -1798880 -1800564
5829 -1800564 -1823606 -1826000 -1838721 -1821811 -1811472 -1811994 -1800647 -1775473 -1758669 -1775329 -1799153 -1799549
5817 -1799549 -1787898 -1775105 -1746039 -1735859 -1746437 -1755239 -1722022 -1712281 -1720604 -1738786 -1760120 -1767017
5805 -1767017 -1787285 -1804859 -1810531 -1836046 -1849503 -1825975 -1793134 -1781682 -1765755 -1761726 -1743233 -1748599
5793 -1748599 -1782299 -1825155 -1821310 -1802008 -1774374 -1752632 -1766551 -1767509 -1783850 -1803035 -1831062 -1818616
5781 -1818616 -1780603 -1767828 -1775489 -1787772 -1771874 -1769389 -1780595 -1814790 -1802392 -1769228 -1759341 -1749002
5769 -1749002 -1738468 -1732164 -1738346 -1747965 -1777656 -1781904 -1768439 -1742563 -1721322 -1736459 -1728923 -1736860 -1732456
5756a732456L072M958k825p98j2652l591O702q83k6806l949M589n854J7752j3259
5742a766000r767J8308J0668K979j3953N209J0937N359O277K1149K1533k9037
5730a716338l0524L24M51m264j4163J0374L8801k834p572k2135k5390q545K4958
5717a756857L0989K8819K4909K122j3560j3062p604k7337k0992l6174k3058K3722
5705a788083J5552j5495M528M5654M926k9870J6685j1K806L115J1597L469P577
5692a717550K1936M030P794o118q389o922k3689k3551n178J5650J1137l7368j2222
5679a780440J6463J6481j4273K59M0846j9992R366n497J4664K1943j6021j2926
5667a729127J0270J24j2108k4136L577n262J7927q35k942J4002K3706Q484k3305
$$ plain form
5756 -1732456 -1729384 -1724426 -1727251 -1728049 -1740701 -1744292 -1737590 -1738473 -1765279 -1769228 -1764639 -1770493 -1752741 -1766000
5742 -1766000 -1775767 -1757459 -1746791 -1743812 -1757765 -1752556 -1741619 -1736260 -1729983 -1708834 -1687301 -1716338
5730 -1716338 -1746862 -1746538 -1746087 -1750351 -1764514 -1754140 -1715339 -1718173 -1725745 -1747880 -1773270 -1781815 -1756857
5717 -1756857 -1725868 -1697049 -1672140 -1670018 -1683578 -1696640 -1704244 -1731581 -1752573 -1788747 -1811805 -1788083
5705 -1788083 -1772531 -1788026 -1783498 -1737844 -1732918 -1762788 -1746103 -1746114 -1743308 -1740193 -1728596 -1725127 -1717550
5692 -1717550 -1695614 -1691584 -1683790 -1689908 -1698297 -1705219 -1728908 -1752459 -1757637 -1741987 -1730850 -1768218 -1780440
5679 -1780440 -1763977 -1747496 -1761769 -1761510 -1720664 -1740656 -1731290 -1736787 -1722123 -1700180 -1716201 -1729127
5667 -1729127 -1718857 -1718733 -1730841 -1754977 -1751400 -1756662 -1738735 -1739570 -1742512 -1728510 -1704804 -1696320 -1719625
5654a719625j2504k2891K689p118j265J6768R109J3205j9024O457K7370k2066
5642a728895K25k1880n343L9612K5316K9167J9596j5440k0388k4287j7182J574
5630a717925N484r013k25L3106q747j0337J3074k087J9860J5896J112R357j3015
5617a663460j5581l4047l4259L1877P061l269K4147P462n433r019o428P352k537
5604a696134l8925J3013K1698M886j4674j6764k4840J931K2238J5770N323n523
5592a712001m252j5378j0546P173K7498K0721k3306L452m802P638k966O979J9573
5579a680217k0891p41K0951J2401K0565p225O664l391l4720k1904K689J9550L4850
5566a651419K636Q762j1234k0858j428K1701k6596O66O365j375l160P967m217
$$ plain form
5654 -1719625 -1732129 -1755020 -1752331 -1759449 -1760714 -1743946 -1734837 -1721632 -1740656 -1734199 -1706829 -1728895
5642 -1728895 -1728670 -1750550 -1755893 -1716281 -1690965 -1661798 -1642202 -1657642 -1678030 -1702317 -1719499 -1717925
5630 -1717925 -1712441 -1721454 -1721679 -1688573 -1697320 -1707657 -1694583 -1696670 -1676810 -1660914 -1659802 -1650445 -1663460
5617 -1663460 -1679041 -1713088 -1747347 -1715470 -1708409 -1711678 -1687531 -1680069 -1685502 -1694521 -1700949 -1693597 -1696134
5604 -1696134 -1735059 -1722046 -1700348 -1695462 -1710136 -1726900 -1751740 -1749809 -1727571 -1711801 -1706478 -1712001
5592 -1712001 -1716253 -1731631 -1742177 -1735004 -1707506 -1686785 -1710091 -1706639 -1711441 -1703803 -1706769 -1699790 -1680217
5579 -1680217 -1701108 -1701849 -1680898 -1668497 -1647932 -1655157 -1648493 -1651884 -1686604 -1708508 -1705819 -1686269 -1651419
5566 -1651419 -1648783 -1640021 -1651255 -1672113 -1673541 -1651840 -1678436 -1677770 -1671405 -1672780 -1675940 -1667973 -1672190
5553a672190k0509k5185q184K6311J6545J9388K3563p795k6066M07R2o475k237
5540a682335j0274j3104P630K5843q179L3758P832k4589p733k3209L914M4146
5528a646300j36M640k3768k1349J5265K1828j669K6647J068k3013J069O123j988
5515a641583K024j1947k3443k7163J481K2459K2364J4355J016j0770r513k0021
$$ plain form
5553 -1672190 -1692699 -1717884 -1726068 -1699757 -1683212 -1663824 -1640261 -1648056 -1674122 -1673715 -1673623 -1680098 -1682335
5540 -1682335 -1692609 -1705713 -1698083 -1672240 -1680419 -1646661 -1638829 -1663418 -1671151 -1694360 -1690446 -1646300
5528 -1646300 -1646436 -1641796 -1665564 -1686913 -1671648 -1649820 -1651489 -1624842 -1623774 -1646787 -1645718 -1639595 -1641583
5515 -1641583 -1639559 -1651506 -1674949 -1702112 -1700631 -1678172 -1655808 -1641453 -1640437 -1651207 -1660720 -1680741
$$ [...]
##END NTUPLES=NMR SPECTRUM
##END=
