##TITLE=Analysis number 328195
Compound Code cc 64702
Book Reference 508/94
Project Code adrs
Chemist Name antons
##JCAMPDX= 6.0         $$ Bruker NMR JCAMP-DX V2.0
##DATA TYPE= NMR SPECTRUM
##DATA CLASS= NTUPLES
##ORIGIN= Bruker BioSpin GmbH
##OWNER= nmr
$$ XWIN-NMR		Version 3.5
$$ Fri May 11 10:56:37 2007 GMT Daylight Time (UT+1h)  MAYBRIDGE\nmr@NMR_250MHZ
##.OBSERVE FREQUENCY= 250.131544655141
##.OBSERVE NUCLEUS= ^1H
##.ACQUISITION MODE= SIMULTANEOUS (DQD)
##.ACQUISITION SCHEME= undefined
##.AVERAGES= 16
##.DIGITISER RES= 18
##SPECTROMETER/DATA SYSTEM= dpx250
##.PULSE SEQUENCE= zg30
##.SOLVENT NAME= CDCl3
##.SHIFT REFERENCE= (INTERNAL, CDCl3, 0, 16.522)
##AUDIT TRAIL= $$ (NUMBER, WHEN, WHO, WHERE, WHAT)
$$ ##TITLE= Audit trail, XWIN-NMR		Version 3.5
$$ ##JCAMPDX= 5.01
$$ ##ORIGIN= Bruker BioSpin GmbH
$$ ##OWNER= nmr
$$ C:\u/data/dgb/nmr/ADRS/860/pdata/1/auditp.txt
$$ ##AUDIT TRAIL=  $$ (NUMBER, WHEN, WHO, WHERE, WHAT)
(   1,<2007-05-11 10:56:11.61 +100>,<MAYBRIDGE\nmr>,<NMR_250MHZ>,
      <created by zg, POWCHK disabled, PULCHK disabled
       configuration hash MD5:
       76 6E 9A 78 1E 09 19 81 EC 84 63 8F B0 6A 59 2D
       data hash MD5: 64K
       9F 35 00 A9 22 DE CD B4 4B 51 B3 3C D0 CF A5 53>)
(   2,<2007-05-11 10:56:25.24 +100>,<MAYBRIDGE\nmr>,<NMR_250MHZ>,
      <Start of raw data processing
       ef LB = 0.3 FT_mod = 6 PKNL = 1 SI = 32K 
       data hash MD5: 32K
       A9 AE 3D 6D 59 0F 42 25 C2 94 00 4A 66 98 C8 07>)
(   3,<2007-05-11 10:56:27.63 +100>,<MAYBRIDGE\nmr>,<NMR_250MHZ>,
      <apk 
       data hash MD5: 32K
       AF DD 1C 43 B2 02 63 F0 BD A9 47 AC B1 AD D0 E2>)
(   4,<2007-05-11 10:56:28.38 +100>,<MAYBRIDGE\nmr>,<NMR_250MHZ>,
      <abs ABSG = 5 
       data hash MD5: 32K
       E0 8F 68 9D FF 8E 34 10 D1 C4 B8 05 3A 45 79 DF>)
$$ ##END=
$$ 
$$ hash MD5
$$ 3E C5 D9 56 94 64 68 E1 A0 43 DA 70 DE A8 E8 42
##$RELAX= 
##$RELAX= 
##$RELAX= 
##$RELAX= 
##$RELAX= 
##$RELAX= 
##$RELAX= 
$$ Bruker specific parameters
$$ --------------------------
##$DU= <C:\u>
##$EXPNO= 860
##$NAME= <ADRS>
##$PROCNO= 1
##$TYPE= <nmr>
##$USER= <dgb>
##$AMP= (0..31)
100 100 100 100 100 100 100 100 100 100 100 100 100 100 100 100 100 100 
100 100 100 100 100 100 100 100 100 100 100 100 100 100 
##$AQSEQ= 0
##$AQ_mod= 3
##$AUNM= <au_zg>
##$AUTOPOS= <10 >
##$BF1= 250.13
##$BF2= 250.13
##$BF3= 250.13
##$BF4= 250.13
##$BF5= 500.13
##$BF6= 500.13
##$BF7= 500.13
##$BF8= 500.13
##$BYTORDA= 1
##$CFDGTYP= 0
##$CFRGTYP= 5
##$CHEMSTR= <none>
##$CNST= (0..31)
1 1 145 1 1 1 1 1 1 1 1 1 1 1 1 1 1 1 1 1 1 1 1 1 1 1 1 1 1 1 1 1 
##$CPDPRG= <>
##$CPDPRG1= <>
##$CPDPRG2= <>
##$CPDPRG3= <>
##$CPDPRG4= <mlev>
##$CPDPRG5= <mlev>
##$CPDPRG6= <mlev>
##$CPDPRG7= <mlev>
##$CPDPRG8= <mlev>
##$CPDPRGB= <>
##$CPDPRGT= <>
##$D= (0..31)
0 1 0 0 0 0 0 0 0 0.06 0 0 0 0 0 0 0.0002 0 0 0 0 0 0 0 0 0 0 0 0 0 0 
0 
##$DATE= 1178877370
##$DBL= (0..7)
120 120 120 120 120 120 120 120 
##$DBP= (0..7)
150 150 150 150 150 150 150 150 
##$DBP07= 0
##$DBPNAM0= <>
##$DBPNAM1= <>
$$ [...]
##$SUBNAM7= <"">
##$SUBNAM8= <"">
##$SUBNAM9= <"">
##$SW= 20.6930455092707
##$SWIBOX= (0..15)
0 0 3 0 0 0 0 0 0 0 0 0 0 0 0 0 
##$SW_h= 5175.983436853
##$TD= 65536
##$TD0= 1
##$TE= 683.16
##$TE2= 300
##$TE3= 300
##$TEG= 300
##$TL= (0..7)
0 120 120 120 120 120 120 120 
##$TP= (0..7)
150 150 150 150 150 150 150 150 
##$TP07= 0
##$TPNAME0= <>
##$TPNAME1= <>
##$TPNAME2= <>
##$TPNAME3= <>
##$TPNAME4= <>
##$TPNAME5= <>
##$TPNAME6= <>
##$TPNAME7= <>
##$TPOAL= (0..7)
0.5 0.5 0.5 0.5 0.5 0.5 0.5 0.5 
##$TPOFFS= (0..7)
0 0 0 0 0 0 0 0 
##$TUNHIN= 0
##$TUNHOUT= 0
##$TUNXOUT= 0
##$USERA1= <user>
##$USERA2= <user>
##$USERA3= <user>
##$USERA4= <user>
##$USERA5= <user>
##$V9= 5
##$VALIST= <valist>
##$VCLIST= <CCCCCCCCCCCCCCC>
##$VD= 0
##$VDLIST= <DDDDDDDDDDDDDDD>
##$VPLIST= <PPPPPPPPPPPPPPP>
##$VTLIST= <TTTTTTTTTTTTTTT>
##$WBST= 1024
##$WBSW= 4
##$XGAIN= (0..3)
0 0 0 0 
##$XL= 0
##$YL= 0
##$YMAX_a= 379415
##$YMIN_a= -323024
##$ZGOPTNS= <>
##$ZL1= 120
##$ZL2= 120
##$ZL3= 120
##$ZL4= 120
##$ABSF1= 16.522
##$ABSF2= -4.171173
##$ABSG= 5
##$ABSL= 3
##$ALPHA= 0
##$AQORDER= 0
##$ASSFAC= 0
##$ASSFACI= 0
##$ASSFACX= 0
##$ASSWID= 0
##$AUNMP= <proc_1d>
##$AZFE= 0.1
##$AZFW= 0.1
##$BCFW= 0
##$BC_mod= 0
##$BYTORDP= 0
##$COROFFS= 0
##$CY= 12.5
##$DATMOD= 1
##$DC= 0
##$DFILT= <>
##$DTYPP= 0
##$F1P= 14.0000005364418
##$F2P= -0.99999901652339
##$FCOR= 0.5
##$FTSIZE= 32768
##$FT_mod= 6
##$GAMMA= 0
##$GB= 0
##$INTBC= 1
##$INTSCL= 1
##$ISEN= 128
##$LB= 0.3
##$LEV0= 0
##$LPBIN= 0
##$MAXI= 10000
##$MC2= 0
##$MEAN= 0
##$ME_mod= 0
##$MI= 0
##$NCOEF= 0
##$NC_proc= -3
##$NLEV= 6
##$NOISF1= 0
##$NOISF2= 0
##$NSP= 0
##$NTH_PI= 0
##$NZP= 0
##$OFFSET= 16.522
##$PC= 1
##$PHC0= -61.74772
##$PHC1= 21.38944
##$PH_mod= 1
##$PKNL= yes
##$PPARMOD= 0
##$PSCAL= 4
##$PSIGN= 0
##$REVERSE= no
##$SF= 250.13
##$SI= 32768
##$SIGF1= 0
##$SIGF2= 0
##$SINO= 400
##$SIOLD= 32768
##$SREGLST= <1H.CDCl3>
##$SSB= 0
##$STSI= 32768
##$STSR= 0
##$SW_p= 5175.98343685301
##$SYMM= 0
##$S_DEV= 0
##$TDeff= 65536
##$TDoff= 0
##$TI= <Analysis number 999999
Compound Code 99
Book Reference 9
Project Code 9>
##$TILT= no
##$TM1= 0
##$TM2= 0
##$TOPLEV= 0
##$USERP1= <user>
##$USERP2= <user>
##$USERP3= <user>
##$USERP4= <user>
##$USERP5= <user>
##$WDW= 1
##$XDIM= 32768
##$YMAX_p= 459216188
##$YMIN_p= -257714
$$ End of Bruker specific parameters
$$ ---------------------------------
##NTUPLES= NMR SPECTRUM
##VAR_NAME=  FREQUENCY,     SPECTRUM/REAL,   SPECTRUM/IMAG
##SYMBOL=    X,             R,               I
##VAR_TYPE=  INDEPENDENT,   DEPENDENT,       DEPENDENT
##VAR_FORM=  AFFN,          ASDF,            ASDF
##VAR_DIM=   32768,         32768,           32768
##UNITS=     HZ,            ARBITRARY UNITS, ARBITRARY UNITS
##FACTOR=    0.157963299565203, 1,           1
##FIRST=     4132.6476996994, 0,             0
##LAST=      -1043.33573715361, 0,           0
##MIN=       -1043.33573715361, -257714,     0
##MAX=       4132.6476996994, 459216188,     0
$$ Real data points
##PAGE= N=1
##DATA TABLE= (X++(R..R)), XYDATA
$$ [...]
23455A3481L143r09j2430l1723J3469m934J2100k495K261J9109p911j0364K5491
23442A8288j1945k3492O742K6706K5485j0175k4476n339O492J7812j1435k8123
23430a3460p924L621J1685k1279m5162J2607J8673J6806p202q137K2099J0205
23418g468J2845p270J3662j3114N986k669j6441j3133K8501M335m342K1159J4832
23405C6883p243m8649l3630J5616J006L6254K5940k4370k1612P727K8452J639
23393A8013k1912j3134j524K6122J4689M0079m614k2226l0152l1589K590L2227
23381H569q097r127J7800j762j1219Q303j0343J8186J1158J8876j5850j5781n680
23368E033k0186j1971J8238k3745K8707K2756j0902l515J1448k3774K4039J3320
$$ plain form
23455 13481 16624 15715 3285 -28438 -14969 -19903 -7803 -10298 -8037 11072 3161 -7203 18288
23442 18288 6343 -17149 -10407 16299 41784 31609 7133 1794 8286 26098 14663 -13460
23430 -13460 -21384 -17763 -6078 -27357 -72519 -59912 -41239 -24433 -31635 -39772 -17673 -7468
23418 -7468 5377 -1893 11769 -1345 4641 1972 -14469 -27602 899 5234 892 22051 36883
23405 36883 29640 -19009 -52639 -37023 -36017 237 26177 1807 -19805 -12078 16374 18013
23393 18013 -3899 -17033 -18557 7565 22254 62333 57719 35493 5341 -26248 -23658 8569
23381 8569 472 -8655 9145 7383 -3836 4467 -5876 12310 23468 42344 26494 10713 5033
23368 5033 -15153 -27124 -8886 -32631 -3924 18832 7930 4415 15863 -7911 16128 29448
23356B9448N201L700p350O157K2573m077k8438j9270L9066J6700k7942r810R865
23343C5823J359k3291k969k2559L409j9169R574J7633J3946R231k7674k6682J5326
23330a6043l896K214Q498J7283J2711j7175k9423J7886j7411K6120J3469j440
23318A2793P557J4549k7573k4970K0357p431N534O866K231M54k7679o735n954
23305c0001K3507J7852J6016J8406K728j4974m6760N411j1493j1284q92J4080
23293a7404K1946n004l1187l908N427K3238P170L702N483J1113L8856j5742l3529
23280A0161k6613R91O819l39J8547R494j8176j2995j2885n332K0928j7959q1j658
23266b9098K0489K0284M76l8205m2414n194K8872L311J9649j3726J2439K3290
$$ plain form
23356 29448 34649 38349 30999 37156 59729 55652 27214 7944 47010 63710 35768 25958 35823
23343 35823 37182 13891 10922 -11637 -8228 -27397 -17823 -190 13756 22987 -4687 -31369 -16043
23330 -16043 -19939 -17725 -9227 8056 20767 3592 -25831 -7945 -25356 764 14233 12793
23318 12793 20350 34899 7326 -17644 2713 -4718 816 7682 9913 10367 -17312 -24047 -30001
23305 -30001 -6494 11358 27374 45780 48508 33534 -13226 -7815 -19308 -30592 -31484 -17404
23293 -17404 4542 -462 -31649 -35557 -30130 -6892 278 3980 9463 20576 59432 43690 10161
23280 10161 -16452 -15461 -8642 -8981 9566 19060 884 -12111 -24996 -30328 -9400 -27359 -27440 -29098
23266 -29098 -8609 11675 12151 -26054 -68468 -73662 -44790 -41479 -21830 -35556 -23117 173
23254A73n397N976J6702J0444o298k1389l891J7739Q228K7281J1135j0125k3782
23241B6796P031R013P304J9104k9553r29K759j3928j9972L5709J8919k7633m1106
23228f486k5745j2174k697m012K1006J9681k439R036j529L2025J0748j5943M791
23215B6262J057j3801j8327p896K958p056J4408K8296j0422j1992k9096L623L1980
23202I994K3115Q828j3091j0326n590k0176n29Q831N285J8056j9751m2481M7307
23189I472J3075Q080k9340j1276P096k4035J982Q168m881j414j2327j3438K3236
23176b5602K9596J5402o215j4604j4869l331J2150M655L6184r072k3275J3465
23164A4484L1624j6323k5151r38K960j1489J2375l767r284m354p760R00Q1m321
$$ plain form
23254 173 -5224 752 17454 27898 21600 211 -3680 14059 22287 49568 60703 50578 26796
23241 26796 33827 42840 50144 69248 39695 38766 41525 27597 7625 43334 62253 34620 -6486
23228 -6486 -32231 -44405 -47102 -51114 -30108 -10427 -12866 -3830 -5359 26666 37414 21471 26262
23215 26262 27319 13518 -4809 -12705 -9747 -16803 -2395 25901 15479 3487 -25609 -21986 9994
23202 9994 33109 41937 28846 18520 12930 -7246 -7775 1056 6341 24397 4646 -37835 9472
23189 9472 22547 30627 1287 -9989 -2893 -26928 -24946 -16778 -21659 -23073 -35400 -48838 -25602
23176 -25602 3994 19396 13181 -1423 -16292 -19623 -7473 -2818 33366 24294 1019 14484
23164 14484 46108 29785 4634 3696 6656 -4833 7542 3775 -5509 -9863 -17623 -16723 -16642 -20963
23150b0963J976m177p530k7603J8534L5741O127r744N182L3262q073k3991N089
23137C830j4211p546L754K5664K4100l076n1080p331p48O952J5677N605M104n663
23123C1R729k3215k8860O899L592P77K8235J1939j1886m589K1586K7989m0629
23110A598J5927J3551j0802J4549J213o177o966j0918K2008K2144q585k1588j5050
23097A0904l7415J3492j360k9083M618K1189L3912j0498k3152j5004J7258J4866
23085b73r856j8130J8355J5602k4074K4470p57k9990J7473K1576j2116m701o949
23072i370J5179n631j9242J627j7419L7480J3786Q726n075q749J2522k4936j9463
23059b0565R081j4479m276K5775L112j8503K401J3684j4623o302Q722j4019K4648
$$ plain form
23150 -20963 -18987 -23164 -30694 -58297 -39763 -4022 2105 -7639 -2457 30805 22732 -1259 3830
23137 3830 -10381 -17927 -14173 11491 35591 32515 -18565 -25896 -26644 -19692 -4015 1590 5694 31
23123 31 9760 -13455 -42315 -35416 -31824 -31047 -2812 9127 -2759 -7348 14238 42227 1598
23110 1598 17525 31076 20274 34823 36036 29859 22893 11975 33983 56127 47542 25954 10904
23097 10904 -26511 -13019 -14379 -43462 -38844 -17655 16257 5759 -17393 -32397 -15139 -273
23085 -273 -10129 -28259 -9904 5698 -18376 6094 5337 -24653 -7180 14396 2280 -2421 -9370
23072 -9370 5809 178 -19064 -17437 -34856 2624 16410 25136 20061 11312 23834 -1102 -20565
23059 -20565 -11484 -25963 -30239 -4464 -1352 -19855 -17454 -3770 -18393 -24695 -15973 -29992 -5344
23046e344J0609k2605k9151P449Q533J4256K897J1270j2854l864k7655k8993J2556
23033f2896L1638N134K1239m730K045o310P946j6882p764K0770L8371p744k0403
23020D14O805J4023J9139P511l2825k1907J1736m692J101p999j1861j1107R500
23007b0162J6385j8486l0608j2795P522K6997M6365j5741j5617k0752J8748M0456
22995B2312J5403K7572m380p491j3668k0141K3028J3294j5672l6994J756K008
22983G027o167o978o49J6014J8765o79J646K662p127K759o529J4388J8232j5295
22969C8069J488o414k1843j2241L948J1477r593m780p428J1089j1822j3544O334
22956a5260J2635R315K1512j2332n293O515J4260J5700m374k8745r408j4986n986
$$ plain form
23046 -5344 5265 -17340 -46491 -39042 -30509 -16253 -13356 -2086 -14940 -18804 -46459 -75452 -62896
23033 -62896 -31258 -26124 -4885 -9615 -7570 -13880 -5934 -22816 -30580 -9810 28561 20817 414
23020 414 7219 21242 40381 47892 15067 -6840 4896 204 1305 -6694 -18555 -29662 -20162
23007 -20162 -3777 -22263 -52871 -65666 -58144 -31147 15218 -523 -16140 -36892 -18144 22312
22995 22312 37715 65287 60907 53416 39748 19607 42635 55929 40257 3263 5019 7027
22983 7027 860 -6118 -6767 9247 28012 27333 28979 31641 24514 27273 20744 35132 53364 38069
22969 38069 39557 33143 11300 -941 3007 14484 4891 111 -7317 3772 -8050 -21594 -15260
22956 -15260 -2625 6690 28202 15870 10577 17092 31352 47052 42678 13933 4525 -10461 -16447
22943a6447Q241j2661j3372P93J9238L672J7950j9085j6314J5891K536J826K3174
22930A5442k020p858J8476Q68P320J277l823j5997j1119j6517R915N468n541j2540
22916a6649r55J1491K9311k6962j2928k67O417J9901K0134k7606k1514r249K6132
22903b744M36J1763j9227l5998J2927J0212Q222M5983J0474l868k3418p72K223
22890A6213K8998J1032L313k6700l846R658j0359l4271k2160Q794K1986P799L0072
22877D0529L815j9483j7377J5575K0336O36p195l6422P107k1578l0353n557L9369
22864a0598K7145j9979j1234J3794O478l757r616r531m750J2657J366J3815R646
22851A5436k3588r842j4710J3282r240N018L309J7840j1475j0285j249J4606K5398
$$ plain form
22943 -16447 -8206 -20867 -34239 -33446 -14208 -10536 7414 -11671 -27985 -12094 -9558 -7732 15442
22930 15442 13422 5564 24040 24908 32228 33505 29682 13685 2566 -13951 -4036 1432 -4109 -16649
22916 -16649 -17604 -6113 23198 -3764 -16692 -16959 -10542 9359 29493 1887 -19627 -28876 -2744
22903 -2744 -2308 9455 -9772 -45770 -32843 -22631 -14409 31574 42048 38180 14762 13990 16213
22890 16213 45211 56243 59556 32856 29010 38668 28309 -5962 -28122 -19328 2658 10457 40529
22877 40529 44344 24861 7484 23059 43395 44031 36836 414 7521 -14057 -44410 -49967 -10598
22864 -10598 16547 -3432 -14666 -872 5606 1849 -7767 -17298 -22048 -9391 -8025 5790 15436
22851 15436 -8152 -17994 -32704 -19422 -28662 -23644 -20335 -2495 -13970 -24255 -25504 -10898 14500
22838A4500K0746m622n365j679N102M805k7814k9837P737L7970K9519j0109J2828
22825E3781j4215j1286j3174j3702l2704l7259L3152N7850q950j3013K8335J3787
22813D2602P876j2023n595j4956j4270p689L27k5911m329J3074O99M432O119l505
22799a3149O770J6054L92j9112r66l1283l267J6135q199Q386J483j3733R655K4048
22785f786K0760k5384o297J6739k9297J7129K7624k1904L820J770J878j3033j8711
22772c1692J1664K3800j0468n525J6708K950j333K3826J6234k9561r214k6516
22760a9127q014K3658O781J2589k1513j5953k6408P154J0442K1987P982K6791
22748B6369J3987l3088l1760J0241n321m587j155M0408R933j3372J7194J1255
$$ plain form
22838 14500 35246 30624 25259 23580 28682 33487 5673 -24164 -16427 21543 51062 40953 53781
22825 53781 39566 28280 15106 1404 -31300 -68559 -35407 22443 13493 480 28815 42602
22813 42602 50478 38455 32860 17904 3634 -4055 -3728 -29639 -33968 -20894 -20195 -15763 -9644 -13149
22799 -13149 -6379 9675 10067 -9045 -10011 -41294 -44561 -28426 -36625 -28239 -26756 -40489 -30834 -6786
22785 -6786 13974 -11410 -17707 -968 -30265 -13136 14488 -7416 -3596 -1826 52 -12981 -31692
22772 -31692 -20028 3772 -6696 -12221 4487 7437 6104 29930 46164 16603 7389 -19127
22760 -19127 -27141 -3483 3298 15887 -5626 -21579 -47987 -40833 -30391 -8404 -422 26369
22748 26369 40356 7268 -24492 -14251 -19572 -24159 -25314 15094 25027 11655 28849 40104
22736D0104k0311j5143J1463K600L1741J5864m988K4735n436o887j7331j4988
22724D1423l2822k9563j0783K319K2085K6556j4949R369N122j0201p718k774k1899
22711b3835q127O439J6562K0097K5690k193n151K0354m1439r980k040l5446k031
22698d1100J7194K0015K666k8330j6488O033J4466J3932K886J6428J8260m845
22686B1117l7626J0402L2535j2602K0251j6336l9343k4966K7955J8085K7248L3688
22674F0408o169l5461l0077k357j2610J8060j0072J268Q334l899k1906J03J4559
22661a9819Q054k320K8466J5026n770J6467j695o150m9970j5414l520r593L6046
22648a0192N2975L2483k3740k5299J34j0766K1548K2969k8163j9925j0541R867
$$ plain form
22736 40104 19793 4650 16113 18713 50454 66318 61330 86065 80629 73742 56411 41423
22724 41423 8601 -20962 -31745 -29426 -7341 19215 4266 13635 18757 8556 838 -1936 -23835
22711 -23835 -31962 -25523 -8961 11136 36826 34633 29482 49836 8397 -1583 -3623 -39069 -41100
22698 -41100 -23906 -3891 -1225 -29555 -46043 -40010 -25544 -11612 -8726 7702 25962 21117
22686 21117 -16509 -6107 26428 13826 34077 17741 -21602 -46568 -18613 -528 26720 60408
22674 60408 54239 18778 -11299 -13656 -26266 -8206 -18278 -17010 -8676 -12575 -34481 -34378 -19819
22661 -19819 -11765 -14085 14381 29407 23637 40104 38409 32259 -17711 -33125 -36645 -46238 -10192
22648 -10192 42783 75266 51526 26227 26361 15595 37143 60112 31949 12024 1483 11350
22636A1350K5402o556k030O571j9235k1565J4710L18j8952k2781j2990j2501p238
22623f5497L1660J8585j6352l166J1458N02m11K3561K9099O557l88j0011j9821
22610E776j6295J5977J5582j0996k8465K8517j6796j1084p592Q800K6677P967
22598A8068l9532j8069J0676M6480M534j3568O593k734k4663o065L85M25M936
22585a2534L5310O590j2539n0637j1030L4700K2408O92j5315o15J6788J8848m969
22572B7697j4614j7190N934L4220K5867q462k8537k1283j2402q28J971K0729n286
22559G816k52J8834L889k3906j239K075K3779k0739k4344j1223J700N528J8562
22546D80L123j7330J1395L6135j8763j0195j2258k4188L844P686K0402J6288K7676
$$ plain form
22636 11350 36752 30196 28166 34737 15502 -6063 8647 8965 -9987 -32768 -45758 -58259 -65497
22623 -65497 -33837 -15252 -31604 -34770 -23312 -22810 -23221 340 29439 35996 35608 25597 5776
22610 5776 -10519 5458 21040 10044 -18421 10096 -6700 -17784 -25376 -16576 10101 18068
22598 18068 -21464 -39533 -28857 17623 22157 8589 15182 12448 -12215 -18280 -17895 -17470 -12534
22585 -12534 22776 29366 16827 -33810 -44840 -10140 12268 12960 -2355 -2970 13818 32666 27697
22572 27697 13083 -4107 1827 36047 61914 53452 24915 3632 -8770 -9598 -7627 13102 7816
22559 7816 7564 26398 30287 6381 5142 7217 30996 10257 -14087 -25310 -23610 -18082 480
22546 480 3603 -13727 -2332 33803 15040 4845 -7413 -31601 -27757 -20071 331 16619 44295
22533D4295j1976l7087k2897J2480L7562k446l7265l4508j585Q194M1311K0059
22521A6137k8701l2156m881N133R722K3391J9242j2464l6806J158r216n507R90
22508e3958N0472p00j6107l2195O39K1998J9024O272P011J5516J8770o4J0189
22495D6867j8430m4592J3708k0942R620K8775n82r512M4285O038p821J4760L465
22482F5639j3738k5716j2324j3948l7978J7795K5259j4681k7884J9732K4621N153
22470A1930J4834O436l587q932J7923J1682q955Rj8876m0314Q241K4944Q149l6232
22456a2748k3080K0682J4231k9414o476M3970k900N955K6269O447m52l8518l5157
22443c1191r006j2600k0970M801N6342Q695j2836K9746K5200k8641j7559m846
$$ plain form
22533 44295 32319 -4768 -27665 -15185 22377 19931 -17334 -51842 -53427 -45233 -3922 16137
22521 16137 -12564 -44720 -49601 -44468 -34746 -11355 7887 -4577 -41383 -40225 -49441 -54948 -53958
22508 -53958 -3486 -4186 -20293 -52488 -51849 -29851 -10827 -4555 2456 17972 36742 36678 46867
22495 46867 28437 -16155 -2447 -23389 -13769 15006 14424 4912 49197 55235 47414 62174 65639
22482 65639 51901 26185 13861 -87 -38065 -20270 4989 -9692 -37576 -17844 6777 11930
22470 11930 26764 33200 29613 20681 38604 50286 41331 41340 22464 -17850 -9609 15335 23484 -12748
22456 -12748 -35828 -15146 -915 -30329 -36805 7165 4265 10220 36489 42936 42484 3966 -31191
22443 -31191 -40197 -52797 -73767 -68966 -12624 -3929 -16765 12981 38181 9540 -8019 -12865
22431a2865k512J1315j8824J7402N3659k2830k4537r170r593J6918L1712J3k5044
22418E644j2793r384L2997j1488l0754P763M575j9051j3130k6406J5220M8083
22406h724J4394n784o214j319L084J6133k1642l9233K5841J4615j1648k237k0666
22393d3400J1854K3527K4905J3728k4772l3200k3430j1696J1717L8044L0013k0626
22381c336l2043M60M6643J7733O839m997k7803j6043j5834Q461L1945L8852k0463
22368C0414j3013J4414N770l9433k0343j2811l591J011K2831P138J3184K0127
22356B5698l4159j2611m317n597K0516L1719J1773K1424o829l8793j9018l086
22344a3280J9714K5478R269k2928J5946K0055j0251j3081k770j6383r009m7330
$$ plain form
22431 -12865 -15377 -4062 -22886 -5484 48175 25345 808 -8362 -17955 -1037 30675 30688 5644
22418 5644 -7149 -16533 16464 4976 -25778 -18015 -13440 -32491 -45621 -72027 -56807 -8724
22406 -8724 5670 -114 -6328 -7647 -4563 11570 -10072 -49305 -23464 -8849 -20497 -22734 -43400
22393 -43400 -31546 -8019 16886 30614 5842 -27358 -50788 -62484 -50767 -12723 17290 -3336
22381 -3336 -35379 -34919 11724 29457 36296 31299 3496 -12547 -28381 -19920 12025 50877 30414
22368 30414 17401 31815 37585 -1848 -22191 -35002 -38593 -37582 -14751 -7613 5571 25698
22356 25698 -8461 -21072 -25389 -30986 -10470 21249 33022 54446 47617 8824 -10194 -13280
22344 -13280 6434 31912 41181 18253 34199 54254 44003 30922 28152 11769 2760 -44570
22332d4570K326M567j8742M734J951J0090M1000L5753o291k7195j7366J849Q31
22319a1063J2201q859J4716j6447N165k7336K3688N388j4762j8600O686K2387
22307f836j478J4332K3898k9751k357R058J2110j6685k7392K6425K2425k1447
22295B302k5474j8830n6K3809K1140j998o363L267J7598k54k4012j7261K3134
22282b998j3717j1432P908j0190k0168j0184K2030N207o730K3466K6129j852p453
22269A6n456K7147K5851O144O717j4935j5986K1805j5902m420k5822k8318K1124
22256b035Q859J2255J4666j3467l1574j0516j7196N53L9573K1553p136J9622j2024
22243B3133j726k1278l1353R107L8131l885Q514O846o708J5968J0791q192j3708
$$ plain form
22332 -44570 -42244 -37677 -56419 -51685 -49734 -39644 1356 37109 30818 3623 -13743 -11894 -11063
22319 -11063 1138 -7721 6995 -9452 -4287 -31623 -7935 -2547 -17309 -35909 -29223 -6836
22307 -6836 -8314 6018 29916 165 -2192 6866 18976 2291 -25101 1324 23749 2302
22295 2302 -23172 -42002 -42058 -18249 2891 893 -5470 -2203 15395 15141 -8871 -26132 -2998
22282 -2998 -16715 -28147 -20239 -30429 -50597 -60781 -38751 -33544 -40274 -16808 9321 7469 16
22269 16 -5440 21707 47558 53702 60419 45484 29498 51303 35401 30981 5159 -23159 -2035
22256 -2035 6824 19079 33745 20278 -11296 -21812 -39008 -38455 1118 22671 15535 35157 23133
22243 23133 21407 129 -31224 -22117 16014 12129 20643 27489 20781 36749 47540 39348 25640
22230B5640p644O48k7725k0474r077K1327K3058P460k4591l2016L218k671K0064
22217b2783J9768j0291q72l395j9125J975O350K086j2305K2181n503k6398k5829
22204g4141J024j750L2090K6026J9690p221k7307L671J1847O093k3708m925m079
22191d2690O049p564L325J2396O94P49K3982J2317J8222Q22j9441q980l8024l396
22177d1539K6819j402K05K846R379J049K2755J0993l0177m0763n125N700J4650
22164b4610p984K4967J6552K3472k4099J3347q914L216m505q66l606l302l846
22151a78J88J3512j0056m338r859N794J869J2376J1317J4430k7575J1242k9432
22138a0710J2844j8624j3442K4588o96K3241k5103m1430K0636J2863o093J6812
$$ plain form
22230 25640 17996 18644 -9081 -29555 -38632 -17305 5753 13213 -11378 -43394 -40176 -42847 -22783
22217 -22783 -3015 -13306 -14178 -17573 -36698 -34723 -28373 -26287 -38592 -16411 -21914 -48312 -74141
22204 -74141 -73117 -74867 -42777 -16751 2939 -4282 -31589 -27918 -16071 -9978 -33686 -38611 -42690
22191 -42690 -36641 -44205 -40880 -28484 -27790 -27041 -3059 9258 27480 28302 8861 -119 -38143 -41539
22177 -41539 -14720 -16122 -15917 -13071 -3692 -2643 20112 31105 928 -39835 -44960 -39260 -24610
22164 -24610 -32594 -7627 8925 32397 8298 21645 12731 15947 11442 10576 6970 3668 -178
22151 -178 10 13522 3466 -872 -10731 -4937 -3068 9308 20625 35055 7480 18722 -10710
22138 -10710 2134 -16490 -29932 -5344 -6040 17201 -7902 -49332 -28696 -15833 -21926 -5114
22126e114J0313K791k09p87k2507m86O007N388J3484j2244K595j7449m354O283
22112a6289p730n255j3739K8544P847J135K5709j6803j6774p119l080k5554q225
22099e7333J4693J7181M924M763J5423Q2J7230k088p757j2921k5454j839M2268
22086I172L462j7885P922J3589J8153l9050K680m762P003r43j3812J1592K1412
22073A8533J562k905J3151j2903l2318l626L8508Q042l473k994L869j0285k234
22060A2927P852q2Q261k6011l6114p969r65j7747J3522J8548J8817P401K081K1724
22046B2245r357k774q094j2740r26k4427n285j09J8653L6233k998K3460K9615
22033F3496J789l2878j3285p568k185j4696K0855J5568K0926l5080m7204j754
$$ plain form
22126 -5114 5199 7990 7781 6994 -15513 -15999 -9992 -4604 8880 -3364 -769 -18218 -22572 -16289
22112 -16289 -24019 -29274 -43013 -14469 -6622 -5487 20222 3419 -13355 -20474 -23554 -49108 -57333
22099 -57333 -42640 -25459 -20535 -15772 -349 -267 16963 14875 7118 -5803 -31257 -33096 9172
22086 9172 12634 -5251 2671 16260 34413 -4637 -1957 -6719 284 -659 -14471 -2879 18533
22073 18533 20095 17190 30341 17438 -14880 -18506 20002 28044 24571 21577 25446 15161 12927
22060 12927 20779 20697 28958 2947 -33167 -41136 -42101 -59848 -46326 -27778 -8961 -1560 521 22245
22046 22245 12888 10114 2020 -10720 -11646 -36073 -41358 -41467 -22814 13419 10421 33881 63496
22033 63496 65285 32407 19122 11554 9369 -5327 15528 31096 52022 16942 -30262 -32016
22021c2016Q201L7742o041j313J2750M2641o503n7014M207m62j4428M526j9417
22008b7127m23j976k3720m008J1892K3304K5845k3429L6289L0131l202j5142p057
21995B1377K9419N530j2742k0510k1634K625L446L9018M3910l937k9483k0204
21983C6815M681k9841q291N537J6758M185k7823k3128L1190n522p532j72J7678
21970A4535j772n526r964L1320J9770k3523k8341j2531j2301k7927J9317P393
21958b9550Q219M1070J4078m0508j5037J0105p117J6203L9584j6449k4632P514
21946C480L294J5433K1372j6122j0j1889J459j1788K795J2779J4913l6566K9041
21933B8191j4209R522Q783j1355q431j6780n783Q299R024K0316k1333k1414j0172
$$ plain form
22021 -32016 -23815 13927 7886 6573 19323 61964 55461 -1553 2654 2192 -12236 -7710 -27127
22008 -27127 -27550 -29526 -53246 -57254 -45362 -22058 3787 -19642 16647 46778 43576 28434 21377
21995 21377 50796 56326 43584 23074 1440 4065 7511 46529 90439 86502 57019 36815
21983 36815 41496 11655 3364 8901 25659 29844 2021 -21107 10083 4561 -2971 -3143 14535
21970 14535 12763 7237 -2727 28593 48363 24840 -3501 -16032 -28333 -56260 -36943 -29550
21958 -29550 -21331 19739 33817 -6691 -21728 -11623 -18740 -2537 37047 20598 -4034 3480
21946 3480 6774 22207 43579 27457 27447 15558 17017 5229 8024 20803 35716 -850 28191
21933 28191 13982 23504 32287 20932 12501 -4279 -10062 -1763 7261 27577 6244 -15170 -25342
21920b5342l2950L203R644j0681K0335K2253J5165N003J637M1605M410l3111r494
21907A1677j9686j0743J4136J1634l4198j1307L078J6873M1888J1928J0217j1581
21895C3916k8035j6169K9845J7583j6212k5871N134R798J6974K3019J7485o427
21883F1040l6452j7010J5363k81J4778L15k0655l2311k0424L1320J0339M012k3789
21870a3755k2560N135J5124M4107N587j2821j607M823j3245k1085J5917L2848
21858C8468N480r487j6658k237k641M721K1144r960q909k5934j8322Q479K8623
21845A2767J4937j3424k9858L861o391r723k0763L801K9717J7150k5107m1746
21833f4779K6328M0432L5190m250k3766L26j1490q311O44j838K9644K2979j8389
$$ plain form
21920 -25342 -58292 -55089 -45445 -56126 -35791 -13538 1627 6630 8267 49872 54282 21171 11677
21907 11677 -8009 -18752 -4616 7018 -27180 -38487 -35409 -18536 23352 35280 45497 33916
21895 33916 5881 -10288 19557 37140 20928 -4943 191 9989 26963 49982 67467 61040
21883 61040 24588 7578 22941 22660 37438 37753 17098 -15213 -35637 -4317 6022 10034 -13755
21870 -13755 -36315 -31180 -16056 28051 33638 20817 19210 24033 10788 -10297 5620 38468
21858 38468 43948 34461 17803 15566 12925 17646 38790 28830 19921 -6013 -24335 -15856 12767
21845 12767 27704 14280 -15578 -11717 -18108 -27831 -48594 -44793 -15076 2074 -23033 -64779
21833 -64779 -38451 1981 37171 32921 9155 9481 -2009 -10320 -9676 -11514 18130 41109 22720
21820B2720k0733q456j811J1893j1493q603j7385P271K8853J697Q808L614j9369
21807b994L0634J2992j3500K0292N570l1878j7715K4844p977l2826q986j6565
21795c8109j7778J0944L3220J0839j481Q881p69J057N575o425j5298L97K6420
21782A7473K1509k7432l4389K1375J238k970o369p599J8478J2629k3113n723O857
21769h036K2271k1325k8164r705J3720L3690L1940J1986m161m0723j2774r05Q570
21756c616J3052J1182Q21k4228O531N193k4411P558J1218q262k0650M763q497
21743b9346p429J3794N396L450N478n077j5669q781k1044M839J0958J5618J3525
21730a4288J0244J2647N954J193k1426k9894J0525J0146K364p75J2310j7340l390
$$ plain form
21820 22720 1987 -6469 -8280 3613 -7880 -16483 -33868 -26597 2256 3953 12761 16375 -2994
21807 -2994 27640 40632 27132 47424 52994 21116 3401 28245 20268 -12558 -21544 -38109
21795 -38109 -55887 -44943 -11723 -884 -2365 6516 5747 6804 12379 5954 -9344 -8947 17473
21782 17473 38982 11550 -22839 -1464 -226 -3196 -9565 -17164 1314 13943 -9170 -14893 -8036
21769 -8036 14235 -7090 -35254 -44959 -31239 2451 34391 46377 42216 1493 -11281 -12186 -3616
21756 -3616 9436 20618 21439 -2789 3742 8935 -15476 -7918 3300 -4962 -25612 -20849 -29346
21743 -29346 -36775 -22981 -17585 -14135 -8657 -13734 -29403 -38184 -59228 -54389 -43431 -27813 -14288
21730 -14288 -4044 8603 14557 15750 -5676 -35570 -25045 -14899 -12535 -13310 -1000 -18340 -21730
21717b1730q49j6625k3102J1799K6104L6378N138J5356K9867n016k1204j1004
21705B5112Q194j376J3337j4372n8934j2549J2412K4302J1210M1790K3258k2491
21693D9893j8691j551L980l3437m890K0675M3569L134j7236j6233k5901K71Q994
21680A2577n752j5311k4166J2229j3102K9012K0819j1129j2602k470o158J4839
21668a214J6232o551k3489j2221N582L5499K9094k7053l2420j6528L2101Q775
21656G807j986j2416k5777J2825K8089L5908r10l1016j302L2036O552l3722P96
21643A6884M192k0241k6529j2228L7597L5728k0129o666Q83K4990l0047k259J9029
21630B1204k4478k45K4036j7504m0175j9725P75m050P401M6627J5035K334k6296
$$ plain form
21717 -21730 -22579 -39204 -62306 -50507 -24403 11975 17113 32469 62336 57320 36116 25112
21705 25112 33306 31930 45267 30895 -28039 -40588 -28176 -3874 7336 49126 72384 49893
21693 49893 31202 29651 33631 194 -4696 15979 59548 62682 45446 29213 3312 3583 12577
21680 12577 6825 -8486 -32652 -20423 -33525 -4513 16306 5177 -7425 -9895 -16053 -1214
21668 -1214 15018 8467 -15022 -27243 -21661 13838 42932 15879 -16541 -33069 -968 7807
21656 7807 5821 -6595 -32372 -19547 8542 44450 43540 12524 11222 43258 49810 16088 16884
21643 16884 21076 835 -25694 -37922 -325 35403 15274 8608 9491 34481 4434 2175 21204
21630 21204 -3274 -3519 20517 3013 -37162 -56887 -56112 -60162 -52761 -6134 8901 11235 -15061
21617a5061k228j6341j848L0974m097J668M4152k1738n0825j5025L2488K5505
21605G624r711N322j7922j1316L0278J5662k0789J7916M3005J6401k3691m1899
21593A0880m0219J3056J0893K2870J345k2034M656l0811j5771J4817K9873M542
21581D097j7543K377R416l135j0428J3662J6585J4173k0293k2321K1537J6304
21569B4431l0190l8298l7451J3158K7801k2071k964M847Q900K0560O749k5075
21557d9603J6034j321L427M5170J0386n6705j3188Q028J7041J9305Q307J3039
21545A9920j208J744L894J8740J4515k4469k2864l1929J784J0749J1164Q050o661
21532C429J8113j847J2282j9059k1840L8922K6524q493N293p401k2783n46r189
$$ plain form
21617 -15061 -17289 -33630 -35478 -4504 -8601 -6933 37219 15481 -35344 -50369 -17881 7624
21605 7624 -2087 3235 -14687 -26003 4275 19937 -852 17064 60069 76470 52779 10880
21593 10880 -29339 -16283 -5390 17480 18825 -3209 1447 -29364 -45135 -30318 -445 4097
21581 4097 -13446 -11069 -1653 -4788 -15216 -1554 15031 29204 8911 -13410 8127 24431
21569 24431 -5759 -44057 -81508 -68350 -40549 -62620 -65584 -60737 -51837 -31277 -24528 -49603
21557 -49603 -33569 -34890 -31463 13707 24093 -32612 -45800 -37772 -20731 -1426 6881 19920
21545 19920 18712 20456 24350 43090 57605 33136 10272 -21657 -19873 -9124 2040 10090 3429
21532 3429 21542 19695 31977 12918 -8922 30000 56524 48031 53324 45923 23140 22594 13405
21519A3405k2980l830O100J080K0282J0591q650j8791k6217J4891P627o292P196
21506e588o079k7185Q474j8432j2149L4641K1291j0252K0134j5385j7950M405
21494b4075J8763l1092n668L2001J8237j2549k5650n432J4588L966l8L182J276
21481a2491j5802q742L0059J3954J0597j0132q894O863j2564k2013j8395o31K2920
21468b5271k0053K4132J283J1861K1039j0189P245J526j1867K8839K0743k639
21456D6649L412Q053l3142l219N319j1156Q815k4506o775J0107J039k8146k279
21443b5829J176j2013R590J3305K566k2413K3624O05J3891k508Q871O98k9389
21430a7826k2169j0544K205J3702l505R557P220J658o971K2419K0752J8296n029
$$ plain form
21519 13405 -9575 -13405 -7305 -6225 14057 24648 15998 -2793 -29010 -14119 -6492 -12784 -5588
21506 -5588 -11667 -38852 -30378 -48810 -60959 -26318 -5027 -15279 4855 -10530 -28480 -24075
21494 -24075 -5312 -36404 -42072 -10071 8166 -4383 -30033 -35465 -20877 -16911 -16949 -13767 -12491
21481 -12491 -28293 -37035 -6976 6978 17575 7443 -1451 5412 -7152 -29165 -47560 -48191 -25271
21468 -25271 -45324 -21192 -19909 -8048 12991 2802 10047 11573 -294 28545 49288 46649
21456 46649 50061 58114 24972 21753 27072 15916 24731 225 -6550 3557 4596 -23550 -25829
21443 -25829 -24653 -36666 -27076 -13771 -11205 -33618 -9994 -9389 4502 1994 10865 11563 -17826
21430 -17826 -39995 -50539 -48334 -34632 -38137 -28580 -21360 -19702 -26673 -4254 16498 34794 29765
21417B9765l0638l274k0968o067L3014K2407n82k7715r789R770Q063j3623j1926
21404b1563J0155j5963j1455j2233j224J7246j4491K1687K3114l5K957r189Q367
21391b627O157k5098N651M87j5859j4013K0607L7696J204o79K174j6907J545J4582
21377A4920k1077j9603J343n339K8699L1474J0976k2516k8548q215j3076J5313
21365a5649J8683l301j755j1909j302K1096n855q413o903K6896K6912k5757l0438
21352a7695O165J38L041K5884J5762k2777j7491j2535M023j8822K9926M1333n751
21339C1201o151j7457j516j1230N330P095o874r113r399r567J2893J53K3397K2046
21325C0808j3891K1812j5929k0577q762R365m284O287L2428P172J14j9773J2549
$$ plain form
21417 29765 -873 -4147 -25115 -31182 1832 24239 23657 -4058 -13847 -4077 3986 -9637 -21563
21404 -21563 -11408 -27371 -38826 -51059 -52283 -35037 -49528 -27841 -4727 -4762 -1805 -10994 -2627
21391 -2627 3530 -21568 -15917 -15430 -31289 -45302 -24695 13001 14205 13526 15700 -1207 338 14920
21377 14920 -6157 -25760 -24417 -29756 -1057 30417 41393 18877 -9671 -17886 -30962 -15649
21365 -15649 3034 -267 -2022 -13931 -15233 5863 8 -8405 -15308 11588 38500 12743 -17695
21352 -17695 -11530 -11392 -8351 17533 33295 10518 -6973 -19508 -15485 -34307 -4381 36952 31201
21339 31201 25050 7593 6077 -5153 177 7272 398 -8715 -18114 -27681 -14788 -14635 8762 30808
21325 30808 16917 38729 22800 2223 -6539 2826 -1458 4829 37257 44429 44543 24770 37319
21312C7319k1070j0941J3955K354j0473j1910j964r084j167r621J6994p280J1589
21299a299J6646j7706j6848j0062l817Q985J2567M883J0546J1298L863J9373j3384
21286B5045J0705p237j4998K8409R394j5707j0238m0407r341M544J160K007j8512
21273c5176K5051K5528J4016O409m9047j2257J8618r307p456N267n184J632J8464
21260c442j13L0917J5590l2562j4631k0604L02j3534n980J8495N570J2271P555
21247a66R578j185j1326o615J0205j4720k7155q756R105J3084J9598J090k9997
21234c7260J1705N1183Q899j5459j7251j234m63K703q819P464m6974k5528j3028
21221h4062K4693L5851N846J1539J7009M309N77k9210j8320L92n146n828L847
$$ plain form
21312 37319 16249 5308 19263 21617 11144 -766 -2730 -11814 -12981 -22602 -5608 -12888 -1299
21299 -1299 15347 -2359 -19207 -29269 -33086 -24101 -11534 -6651 3895 15193 19056 38429 25045
21286 25045 35750 28513 13515 41924 51318 35611 25373 -15034 -24375 -19831 -18671 -16664 -35176
21273 -35176 -10125 15403 29419 35828 -13219 -25476 -6858 -16165 -23621 -18354 -23538 -21906 -3442
21260 -3442 -3555 27362 42952 10390 -4241 -24845 -24543 -38077 -44057 -25562 -19992 -7721 -166
21247 -166 9412 8227 -3099 -9714 491 -14229 -41384 -50140 -41035 -27951 -8353 -7263 -37260
21234 -37260 -25555 25628 34527 19068 1817 583 120 2823 -5996 1468 -45506 -71034 -84062
21221 -84062 -59369 -23518 -17672 -6133 10876 15185 15762 -13448 -31768 -31376 -36522 -42350 -38503
21208c8503K1659j0297R81K0396l583o441r035K3092K7225N340l1882j3270j5707
21195c0025L5029J9870M71k5196j9686J4096n36n657K700K9787n89k5677j6387
21182b1800O954J1378P617R279K4887q735L3336Q674k1908l0472K297J1938k4930
21169H515K1852Q001r343j749n116j3325N214L0336j303k0716l5417k906J5122
21156h35L196J9544P907n138k3336N93j6022L0522l33q923L317J585l988K5500
21142C3589l4071j0819k61q582J0530n22J6076k3897j3403O552L153J0500j478
21129a2633L162J4756J320m0161K7315R097l0056k74K5691L495j9581r138P252
21116a9755j0939K693L1264L1578j0598n0281Q898L9911N415j2726K0931k6151
$$ plain form
21208 -38503 -16844 -27141 -26160 -5764 -9347 -15788 -24823 -1731 25494 30834 -1048 -14318 -30025
21195 -30025 5004 24874 25345 149 -19537 -5441 -5977 -11634 -8934 20853 20264 -5413 -21800
21182 -21800 -14846 -3468 4149 13428 38315 29580 62916 71590 49682 19210 21507 33445 8515
21169 8515 30367 38368 29025 27276 22160 8835 14049 44385 43082 22366 -13051 -15957 -835
21156 -835 2361 21905 29812 24674 1338 1931 -14091 16431 16098 7175 10492 12077 8089 33589
21142 33589 -482 -11301 -11562 -20144 -9614 -10136 5940 -17957 -31360 -24808 -21655 -11155 -12633
21129 -12633 -9471 5285 6605 -33556 -6241 2856 -27200 -27474 -1783 1712 -17869 -27007 -19755
21116 -19755 -30694 -28001 3263 34841 24243 -26038 -17140 22771 28186 15460 36391 10240
21104A0240j0708J9442P835k7435j7319J1174J2410J4924Q120l0800L1854J2087
21092D1824j8902M139R615k3804M677j8244J0333j3207k6870k031J4340O376J4630
21079B876p34Q621L8490N98m4280k7862k1025J4487K5479J7845J1173r032k1471
21066d835j5001R30J6425L8973k544l7833l5222J4947N3096M821M109J2493K0544
21053G0903k4009k1851p656J4671P098O045j9085j0210N284j7499L783J5219P655
21040C0348L570m704j0934j8334n101O99K3273p913k5044J1065K0890J0677k956
21027B5536l39k181k3123k6173p209p183L786J9829J8028j3553L5249L1783k7041
21014B7409j7931j0264j3560r61K1150J3952J1673P499J3817P312j2945n822j1005
$$ plain form
21104 10240 -468 18974 26809 -626 -17945 -6771 5639 20563 28683 -2117 29737 41824
21092 41824 22922 27061 36676 12872 17549 -695 9638 -3569 -30439 -32470 -18130 -11754 2876
21079 2876 2142 10763 49253 49851 5571 -22291 -43316 -28829 -3350 14495 25668 16636 -4835
21066 -4835 -19836 -18906 -2481 36492 33948 -3885 -39107 -24160 28936 33757 37866 50359 70903
21053 70903 46894 25043 17387 32058 39156 45201 26116 15906 21190 3691 7474 22693 30348
21040 30348 33918 29214 18280 -54 -5155 -4456 18817 10904 -14140 -3075 17815 28492 25536
21027 25536 25197 23016 -107 -26280 -33489 -40672 -36886 -17057 971 -12582 22667 54450 27409
21014 27409 9478 -786 -14346 -15307 5843 19795 31468 38967 52784 60096 47151 41329 30324
21001C0324L020j7225j3304p498r675J8371P981j1802k9856p394J3252J353L920
20988a8533L0313m91M44N774j3475K7142K2575k2323j4169R3j4241J6296p863
20975A1542p438k1905Q991k646j1973J2757J1896J0553j0366R961J2594P158k6
20962C1098l5889j8946J1123K1731J917m913J2322j3736l3203L183J0550K6758
20950A1995L2093k7232k5030K7592M052J7872L5965j4809m9848k1644J6919J003
20938H928N905K635N879o904N54J4384J0017m2775k2974j0676K7068P737o712
20925f934l2597J115j6069J9774K6535K0641Q895R646J1225l6627k0944J8534
20913C194L1641O552k3684k5899J4203L5959j9543k7167j6511J9699J6721o702
$$ plain form
21001 30324 33344 16119 2815 -4683 -14358 4013 11994 192 -29664 -37058 -23806 -22453 -18533
20988 -18533 11780 11289 11733 17507 4032 31174 53749 31426 17257 17350 3109 19405 11542
20975 11542 4104 -17801 -8810 -11456 -23429 -10672 1224 11777 1411 11372 23966 31124 31098
20962 31098 -4791 -23737 -12614 9117 11034 6121 18443 4707 -28496 -25313 -14763 11995
20950 11995 44088 16856 -8174 19418 23470 41342 77307 62498 12650 -8994 7925 8928
20938 8928 14833 17468 23347 16443 16997 31381 41398 -1377 -24351 -35027 -7959 -222 -6934
20925 -6934 -39531 -38416 -54485 -34711 -8176 12465 21360 31006 42231 5604 -15340 3194
20913 3194 34835 41387 17703 -8196 6007 41966 22423 -4744 -21255 -1556 15165 8463
20901H463M925M0650j0001p470l3090l8700Q81L7988O620p937m4710l1094L2750
20888d0725K2127J5780J6149K8774q63O534j6692j6923J6588J8607J7174o753
20876E9777N791r482l0190k3870N711K2724j3676Q999l194n369J5695J5290O253
20863E4459l0321l8475K573J6429k0067R446L0955m0976p718l461j135J253j7101
20850d4139j2302K6743M7992J1544r079m132K1099O682j175l3329o094J7563J333
20837B2706J568j9662m4200j5247J3172M2754K5982J9005k2051j0211K9362O294
20825D9472k1479l3825j2494N426k913J4206P662l124j6314o301L2171l4610j9274
20812d1397m008p289K1913n216P11J5025J524R073J7936l249J2249L661J6361
$$ plain form
20901 8463 13388 54038 44037 36567 3477 -35223 -34342 3646 10266 2329 -42381 -73475 -40725
20888 -40725 -18598 -2818 13331 42105 41242 47776 31084 14161 30749 49356 66530 59777
20876 59777 65568 56086 25896 2026 7737 30461 16785 25784 22590 17221 32916 48206 54459
20863 54459 24138 -14337 -11764 4665 -15402 -5956 24999 -15977 -23695 -27156 -28291 -27038 -44139
20850 -44139 -56441 -29698 18294 29838 20759 16627 37726 44408 43233 9904 3810 21373 22706
20837 22706 24274 4612 -39588 -54835 -41663 1091 27073 46078 24027 13816 43178 49472
20825 49472 27993 -5832 -18326 -12900 -15813 -1607 6055 2931 -13383 -19684 12487 -22123 -41397
20812 -41397 -45405 -52694 -30781 -35997 -35286 -20261 -18737 -9664 8272 5023 17272 20933 37294
20799C7294J3r320j8617k0977j6448p333L1837L5165N369j034K611q303j3550
20786A6707Q07M071J8575J9281k957n0000m8571L4823M7239L6019j1419k1224
20774D3351k6849j721L683j8888J337K1963K016k2510J6654J4708l6111j1511
20762a3878m971J5238K2562J7157K0558l2879k6584J950N992k362k3K6297j1642
20749A7415j3928J7190J1641j2285P278l209j396P332j6520J8961p5k9276k0830
20736a7702k9088j6091K7368K2953m517j4531J80J2777q719J3082K9020J7310
20724C2042j9250l1773j2041M1659j3602P867K6226k6637O7K9867j0112k746p468
20711A4099k2579q843P915J3963o118m87J3397n913k1510J0710o256J8648k2327
$$ plain form
20799 37294 37307 27987 9370 -11607 -28055 -35388 -3551 31614 36983 35949 38560 30257 16707
20786 16707 17514 21585 40160 59441 56484 6484 -42087 -7264 39975 75994 64575 43351
20774 43351 16502 14781 18464 -424 913 22876 24892 2382 19036 33744 -2367 -13878
20762 -13878 -18849 -3611 18951 36108 56666 23787 -2797 -847 5145 2783 2760 29057 17415
20749 17415 3487 20677 32318 20033 27311 24102 22706 30038 13518 32479 32404 3128 -17702
20736 -17702 -46790 -62881 -35513 -12560 -17077 -31608 -31428 -18651 -27370 -14288 14732 32042
20724 32042 12792 -18981 -31022 10637 -2965 4902 31128 4491 4558 34425 24313 21567 14099
20711 14099 -8480 -17323 -9408 4555 -1563 -2050 11347 5434 -16076 -5366 -11622 7026 -15301
20698a5301j8610j7073j5857J9605J9427P446p705K4461l362r728K8957r827o084
20685c651m768P719J2685J3262Q494k663j6509q429j5686m46p191R340R429l2094
20671c0508L8346L1632k3372k879j5187k0639p800l569J0877K0620k5343P838
20659a9984J8164j565P880Q544j468K2532K2112p112k0946J4476J4696q572m7688
20646A069l1403n178N483K905j3177P739P721K4438k327J2619J925O108j3050
20633D872j7396j5958J1565J9448j6800r069k1086K3704J9991R475J1369K145
20621B2260j1254J7448L657m149k8417j3811K7962J7277m321j1647K850j7160
20609F95P227J4332L1225j3645k7036J3768L2633k2836l3531q626k3076P858K4388
$$ plain form
20698 -15301 -33911 -50984 -66841 -47236 -27809 -20363 -28068 -3607 -6969 -16697 12260 2433 -3651
20685 -3651 -8419 -700 11985 25247 33741 31078 14569 6140 -9546 -9992 -17183 -7843 1586 -30508
20671 -30508 7838 39470 16098 13219 -1968 -22607 -30407 -33976 -23099 -2479 -27822 -19984
20659 -19984 -1820 -3385 4495 13039 11571 34103 56215 49103 28157 42633 57329 48757 1069
20646 1069 -30334 -35512 -30029 -27124 -40301 -32562 -24841 -403 -2730 9889 11814 17922 4872
20633 4872 -12524 -28482 -16917 2531 -14269 -23338 -44424 -20720 -729 8746 20115 22260
20621 22260 11006 28454 32111 27962 -455 -14266 13696 30973 26652 15005 17855 695
20609 695 7922 22254 53479 39834 12798 26566 59199 36363 2832 -5794 -28870 -21012 3376
20596C376j1339l8699o461j9304K4337M8568J2920r024j4818k0593K4252K7595
20584B0810j3958k0938j2767k1057J5962O5906N616m8080j6613J4306j7702k0017
20572d8532Q941J3264J8629k300k148J4473L4708j6826k09J3369j1350k3345r570
20559a0896N5980K9747l2856j6592k012R814q185l5944k886M875l8372J1845K4143
20546a1339J8240q565j5239k7775N477L8019K9327K2411K085n369j670k063J7330
20533F0869p170n954k8470j4924o966l480J0038K977R489M2657n448m4345l0753
20520b1480j8766K2036J3451k6786J3344J3814M149J1888j7904l203M009J3363
20508G915P444k6031j8864L1871K1042j0448l3696J180L2431j2917p878L5367
$$ plain form
20596 3376 -7963 -46662 -53123 -72427 -48090 478 13398 4374 -10444 -31037 -6785 20810
20584 20810 6852 -14086 -26853 -47910 -31948 33958 39574 -8506 -25119 -10813 -28515 -48532
20572 -48532 -39591 -26327 -7698 -9998 -12146 2327 37035 20209 20000 33369 22019 -1326 -10896
20559 -10896 45084 74831 41975 25383 23371 33185 25000 -10944 -13830 -8955 -47327 -35482 -11339
20546 -11339 6901 -1664 -16903 -44678 -39201 -1182 28145 50556 52641 47272 45602 43539 60869
20533 60869 53699 47745 19275 4351 -2615 -6095 3943 6920 16409 59066 53618 9273 -21480
20520 -21480 -40246 -18210 -4759 -31545 -18201 -4387 -238 11650 -6254 -9457 -5448 7915
20508 7915 15359 -10672 -29536 2335 23377 12929 -20767 -19587 12844 -73 -7951 27416
20496B7416J3197k34k1536J2369j152k8035N09r909j3656J9946k628O410K8929
20483C1626J2568k122M432M708k0368j3120l5507j6253J2627J2620J2500K4330
20471B8041k6001M449K558K0415q746q665J8237m719j2298l320j998R084k4170
20458g133k8730K7373Q727J2698j5895J716K1609j1415k9765J5206K7846j1992
20446A0245j1992j1752l0974K8251K4039k5876j4804M4629N0283N626r505k1692
20434C6478j1512j2585r837K6505j4133q891j0268k6556r708L0122L1206K079
20422B2900k8673m988O563j101j5228P341j968K27L3441K3051M969j8440j0649
20409A7445k4284k813m054p957k275R181p930O931K8261q837k4382j9176M570
$$ plain form
20496 27416 40613 40379 18843 31212 30060 2025 2534 -7375 -21031 -1085 -3713 2697 31626
20483 31626 44194 42072 46504 51212 30844 17724 -17783 -34036 -21409 -8789 3711 28041
20471 28041 2040 6489 9047 29462 20716 12051 30288 25569 13271 9951 7953 17037 -7133
20458 -7133 -35863 -8490 237 12935 -2960 -1244 20365 8950 -20815 -5609 22237 10245
20446 10245 -1747 -13499 -44473 -16222 7817 -18059 -32863 11766 62049 67675 58170 36478
20434 36478 24966 12381 2544 29049 14916 6025 -4243 -30799 -40507 -10385 20821 22900
20422 22900 -5773 -10761 -4198 -5299 -20527 -13186 -15154 -14927 18514 41565 46534 28094 17445
20409 17445 -6839 -9652 -13706 -21663 -23938 -14757 -22687 -15756 12505 3668 -20714 -39890 -35320
20396c5320K4062L9510q70l5112k2102R159K986m1206o742M9045K8156j007j4343
20383c784j5214l613K9689L194j1549m120k2969j1194Q746m719m595L9683J0544
20370A0099j5723j6887j0383j886J4934K0111o302j3021j2703J2886M2621L0900
20358E4646K7j373p652j781l2137k2233k9591j1641K4663K3308K6374q375j2554
20345A681P083j0681N307J5523K5269j5773j3693o150N508K1122q968m884n635
20332A5709J155J1691j3857j606q239J5565M070j3786j1268O236O395L3941J8676
20319F4682P544n554j5563J1207q938J093k4733j9307p304n7086j0086N0579J6651
20306C185q815P22q814Q424j0869M794L3714J0661m887j4691P303J3522j1012
$$ plain form
20396 -35320 -11258 28252 27382 -7730 -29832 -20673 -17687 -58893 -65635 -16590 11566 10559 -3784
20383 -3784 -18998 -22611 7078 10272 -1277 -5397 -28366 -39560 -30814 -35533 -40128 -445 10099
20370 10099 -5624 -22511 -32894 -34780 -19846 265 -6037 -19058 -31761 -18875 23746 54646
20358 54646 54673 53300 45648 43867 11730 -10503 -40094 -51735 -27072 -3764 22610 14235 1681
20345 1681 8764 -1917 3390 18913 44182 28409 14716 8566 14074 35196 26228 21344 15709
20332 15709 16864 28555 14698 13092 4853 20418 24488 10702 -566 5670 12065 46006 64682
20319 64682 72226 66672 51109 62316 53378 54471 29738 10431 3127 -53959 -64045 -13466 3185
20306 3185 -5630 -4908 -13722 -5298 -16167 -11373 22341 33002 28115 13424 20727 34249 23237
20293B3237J596Q250j1469J7676l0936k6316L2026k3484l0651J7483J9236L13
20281c039j6231m468J0598K1780J0500J0853k836k6734q494k2240j664L8156L667
20268I848j2419Q366J5596J3166L079j231p286R319R750J5747k1387k9330J8560
20255C1778K5097K0122m338k5671k7165L3993J2916j7864l2084l573J9443j1945
20243B0709K3834o046l2458K729q002o622q792P815K2977k1973m6939J4331K9143
20230i294K7725J523q607Q702J398J682j4584j6892n04K648j5824q3J074L3380
20216A2344L1903r832R293P962j8644l6694K5297K2588J5832l6773l8477j1019
20204b6220P775K1372K1573l357j8098j4816k1716K7654k1299p491M7619j2016
$$ plain form
20293 23237 24833 33083 21614 39290 8354 -17962 14064 -9420 -40071 -22588 -3352 -3039
20281 -3039 -19270 -23738 -13140 8640 19140 29993 27157 423 -8071 -30311 -31975 6181 9848
20268 9848 -2571 5795 21391 34557 37636 36405 29119 38438 48188 63935 42548 13218 31778
20255 31778 56875 76997 72659 46988 19823 53816 66732 48868 16784 13211 32654 20709
20243 20709 44543 38497 6039 8768 766 -5856 -14648 -6833 16144 -5829 -52768 -38437 -9294
20230 -9294 18431 19954 11347 20049 21447 23129 8545 -8347 -8851 -6203 -22027 -22110 -21036 12344
20216 12344 44247 34415 43708 51670 33026 -3668 21629 44217 60049 23276 -15201 -26220
20204 -26220 -18445 2927 24500 21143 3045 -11771 -33487 -5833 -27132 -34623 12996 980
20192I80r30j3415k0310J1399O194O647l018j5501K788J2151K0961J3742l33J0315
20178C1670l923J688K273j1753o133J1763L6245j7393l8207L1084J7895r147l4311
20165A1751j7446k096m446J5948J1183J6718L579l408N806k2719m289q007J4037
20152A6611n025r338K5639L238L517j6349p399K2939O849m2879J0735P853k7702
20139a1311j6910K4786K6401q667J8411J7317p153n0817n3736J0394O322J0664
20127c4299N9936L8999j4729m9621L831K7243o786N89K922r190N731L6913L251
20114F4790l3379j5563P986j6087k9145J1019K0936n106j4011N707L0603J6947
20102D4697L59l837p902J745k912l1619P572J0965j701j1074l4799Q260K9510
$$ plain form
20192 980 50 -13365 -33675 -22276 -16082 -9435 -12453 -27954 -25166 -13015 7946 21688 21355 31670
20178 31670 27747 29435 31708 19955 13822 25585 61830 44437 6230 37314 55209 46062 11751
20165 11751 -5695 -7791 -12237 3711 14894 31612 35191 31783 37589 14870 10581 2574 16611
20152 16611 11586 2248 27887 31125 34642 18293 10894 33833 40682 -2197 8538 16391 -11311
20139 -11311 -28221 -3435 22966 14299 32710 50027 42874 -7943 -61679 -51285 -44963 -34299
20127 -34299 25637 64636 49907 286 4117 31360 24574 25163 28085 18895 24626 61539 64790
20114 64790 31411 15848 23834 7747 -21398 -10379 10557 5451 -8560 -2853 27750 44697
20102 44697 45056 41219 33317 35062 32150 531 8103 19068 17367 6293 -28506 -20246 9264
20089I264N266j607k728j0522J8594J2200J1039J1337n376K473q370J0115O499
20076E8184J0533j9318m0123J0958J887j1544j6906J3916j1246M197K7764M0335
20064F8637N229r856M470J819k3238J0699n693m6831J4409L2673K2424k0988k8504
20051B5250q374K3817o325o557R512p994j4118j8246q194J9944L1036K0987P361
20038F8099K336l5875m5032o461J4611o102P773J9649k8983k4883R129j0637K88
20025c6088M0169q89R856L458m2223n084K2888J7428j8237L468J1039k901k729
20012A55j6608J5014K6906n146L7208L707n664J1247l018j2211k0363m639o010
19999B0578q026k5730J9258K9546R580o207K713n855j5424n441j8165j2035M286
$$ plain form
20089 9264 14530 12923 10195 -327 18267 30467 41506 52843 47467 49940 41570 51685 58184
20076 58184 68717 49399 9276 20234 22121 10577 -6329 7587 -3659 538 28302 68637
20064 68637 73866 64010 68480 70299 47061 57760 52067 5236 19645 52318 74742 53754 25250
20051 25250 16876 40693 34368 27811 37323 29329 15211 -3035 -11229 8715 39751 60738 68099
20038 68099 70435 34560 -10472 -16933 -2322 -8424 -651 18998 -9985 -34868 -25739 -36376 -36088
20025 -36088 4081 3192 13048 16506 -25717 -30801 -7913 9515 -8722 -5254 5785 2884 155
20012 155 -16453 -1439 25467 20321 57529 61236 55572 66819 63801 51590 31227 26588 20578
19999 20578 12552 -13178 6080 35626 45206 38999 41712 35857 20433 14992 -3173 -15208 -10922
19986a0922j4278o332K442l559Q462J7845j0512q722j6514j8312K0997M4891J8296
19973B3782L273O445j6488l5784r149J0046K477L0585K3573J8381j2982k1610
19961B2549k2344L0779K5550k4277o253k4371j3742o591o100j4750k0478L773
19949e6255K9039N9382M221k2620L483J4495j3594N827k175J5288J8798Q993P168
19936G2050j4786j5064L6861n976j8388j152r603j8902K6739m2336l6056j1146
19924c7759o625J2157J0351L7392J10j6880j0890Q928k651K6832l624J8906j058
19911C5189l3906r446J6781P839P289O494J3594L3342L285k5042R051O80m888
19898F0262j4408l8478q560k99q217R719K465j7353O465J1473J5509j443j6093
$$ plain form
19986 -10922 -25200 -31532 -29090 -32649 -24187 -6342 -16854 -25576 -42090 -60402 -39405 5486 23782
19973 23782 27055 33500 17012 -18772 -27921 -17875 -15398 15187 38760 57141 44159 22549
19961 22549 205 30984 56534 32257 26004 1633 -12109 -18700 -24800 -39550 -60028 -56255
19949 -56255 -27216 32166 36387 13767 17250 31745 18151 23978 21803 37091 55889 64882 72050
19936 72050 57264 42200 79061 73085 54697 53545 43942 25040 51779 9443 -26613 -37759
19924 -37759 -44384 -32227 -21876 15516 15626 -1254 -12144 -3216 -5867 20965 17341 36247 35189
19911 35189 1283 -8163 8618 16457 23746 30240 43834 77176 80461 55419 64470 65150 60262
19898 60262 45854 7376 -1184 -1483 -9700 19 2484 -14869 -8404 3069 18578 17135 1042
19885A042j0255K3471J6766Q02p417k0285J5303J3332r915j0824k6026k1480J5394
19872b0092R549P189K667J62J1205J0934m542k5101j7351j8496J7274K1630j131
19859f103P054K3626j1925O456J2445M749N141l6762j3615L4575J1122k3847j9981
19846g065o857J2021Q568n983J9743K2456j9563M37p860R131O407j8753j4577
19833a895k4761J7391J6092k7645J3650J5844L0738o730M773k360j4717J1896
19821C2276J0401q455k909r603J3052M147k9173p915J2662J3985J2942k7939q641
19808D830l351J7087K0249J7136o566k110j9794k1957j9647P860L6290J355k6967
19795D415k2445J132O55L74k736R916L1092q740j4514j5256J840l4701L311J9613
$$ plain form
19885 1042 -9213 14258 31024 31826 24409 4124 19427 32759 22844 12020 -14006 -35486 -20092
19872 -20092 -10543 -3354 -687 -525 10680 21614 17072 -8029 -25380 -43876 -26602 -4972 -6103
19859 -6103 951 24577 12652 19108 31553 36302 41443 4681 -8934 25641 36763 12916 -7065
19846 -7065 -13922 -1901 6667 684 20427 42883 23320 23757 15897 25028 31435 12682 -1895
19833 -1895 -26656 -9265 6827 -20818 -7168 8676 39414 32684 37457 35097 20380 32276
19821 32276 42677 34222 31313 21710 34762 38909 9736 1821 14483 28468 41410 13471 4830
19808 4830 1479 18566 38815 55951 49385 47275 27481 5524 -14123 -6263 30027 31382 4415
19795 4415 -18030 -16898 -16243 -15869 -18605 -8689 22403 13663 -851 -16107 -14267 -48968 -45657 -26044
19781b6044K9662K3117J190n05J3714K9588l5334m0708J3312M6747K3046p281
19769G0504r492j3573n922j3072o695r931P617Q126l463J4446R900j0906k3441
19756A4098r452N764j254r54j5351K061Q623J8115P36o682k296J2776L9365J745
19742F7294k1719l6138j8581J2486K8380p093N850P774J4417q38j7255j6271J6264
19729C4570n336J2060k041j8538j9857J1925J7301p129k4036j553L2188L343l321
19716B9576L193l636k1516k7154p468j6053M4467K6151k47k472j9839l4657M028
19703b5627N5648L1009J5021k0479p866o135r392k7476k6538n551j7296O834L1688
19690f160j3794o105N397j2852N279L1677J0955N991l833J0463J3848Q569p160
$$ plain form
19781 -26044 3618 26735 27925 27420 41134 70722 35388 -5320 7992 54739 77785 70504
19769 70504 61012 47439 41517 28445 21750 11819 19436 27562 24099 38545 48445 37539 14098
19756 14098 4646 10410 9156 8202 -7149 -5088 3535 21650 22386 15704 13408 26184 65549 67294
19742 67294 45575 9437 -9144 3342 31722 24629 30479 38253 52670 51832 34577 18306 34570
19729 34570 29234 41294 39253 20715 858 12783 30084 22955 -1081 -2634 29554 32897 29576
19716 29576 32769 29133 7617 -19537 -27005 -43058 1409 27560 27313 24841 5002 -29655 -25627
19703 -25627 30021 61030 76051 55572 47706 41571 32179 4703 -21835 -27386 -44682 -37848 -6160
19690 -6160 -19954 -26059 -20662 -33514 -28235 3442 14397 20388 16555 27018 40866 49435 42275
19677D2275k9163j3304p04j98k070N859O613M0504n796j4771j919R514J3376P843
19663E8059J2172k6459j9054k9334J6941K8709q757J9417J3995J8038l5594K630
19651E0763J0060K4489L948j8098k922n458O707J434j37J353M773q537j4440j3488
19637D0447P300J9610N107l0310Q158K9546J9337j2397m0860L89J0176k13o04
19624E5686K3711L5502N1086K5496P5111Q9427J19039J54485l3590j11810l4663
19613D49480P2805J59550P663j11792k1146O9770P8493q2297j14144k7709J9190
19602D99863P5852r8737k10446j06767m9191k397J5974l3736k8860k0526R989
19591E1018k647m9314j7682J3164K1895J9946l483r024P96P203J5957J8436j4650
$$ plain form
19677 42275 13112 -192 -896 -1094 -3164 2695 9308 49812 44016 29245 27326 36840 50216 58059
19663 58059 70231 43772 24718 -4616 12325 41034 32277 51694 65689 83727 48133 50763
19651 50763 60823 85312 89260 71162 68240 62782 69489 70923 70786 72139 76912 68375 53935 40447
19637 40447 47747 67357 72464 42154 50312 79858 99195 86798 45938 46327 56503 56290 55686
19624 55686 79397 114899 165985 191481 266592 356019 475058 629543 595953 484143 449480
19613 449480 522285 681835 689498 577706 556560 626330 704823 622526 508382 480673 499863
19602 499863 575715 476978 266532 159765 110574 108177 124151 90415 61555 41029 51018
19591 51018 48371 -943 -18625 -5461 16434 36380 32897 23873 24669 31872 47829 66265 51615
19578E1615O887K540k5613k9604r397K6280K8521M069j9522P551M065j7003l319
19565B7070J2987O730R031L803K762k1290Q412J1516l017k4184l8770l8601R443
19552c4108J4194K1225k390k771O6646L628j1664j2700k674l062m1554J3642L6786
19539D5198j3707N1q273N07L4219M1720k2823m9872Q228J8553J7521K856p970
19526F6208o910k4569N947k6413j348M2265K0790j6875j6689k601J9979R385k0813
19513D8356k9873k0057k1112K0816J3906l1327J2353K4891J3579p44j9880j9405
19501h497J694K3035K2704j4089J734J831L0512j0980p7n284N266O006p566k8597
19487A7692j9565p056L4083L484j8552Q370K3845K9151j6643L731r27L8453Q884
$$ plain form
19578 51615 58502 61042 35429 5825 -3572 22708 51229 55298 35776 43327 47392 30389 27070
19565 27070 40057 46787 55818 59621 62383 41093 49505 61021 58004 33820 -4950 -43551 -34108
19552 -34108 -19914 1311 -1079 -3850 62796 66424 54760 42060 39386 36324 -5230 8412 45198
19539 45198 31491 31542 23269 23776 57995 99715 76892 27020 35248 53801 71322 74178 66208
19526 66208 59298 34729 40676 14263 12915 55180 75970 59095 42406 39805 59784 69169 48356
19513 48356 18483 -1574 -22686 -1870 12036 -19291 -6938 17953 31532 30788 10908 -8497
19501 -8497 -6803 16232 38936 24847 26581 28412 58924 47944 47867 42583 47849 53855 46289 17692
19487 17692 -1873 -8929 25154 28638 10086 18456 42301 71452 54809 58540 57613 96066 104950
19474A04950j1064k5896j5148K3873k2197J7929J6744k6232m980L100J3244j4178
19462F0145J0447j0536k819N857m4196k2757L510J4736R793m529Q922k2317L08
19449F564L986m571L5087L983O132k6010j3604K959J009N545R96j5403K9772P806
19435D4251M9251N1468n6095o6247j039J2827K073R270k4614j6000J2207J8053
19423C5405j228M31L1731K6120M705n617j9623k6061k7325M135N24J2416K4503
19410F0116q211k1853j3319O36p107J4376J6000K1405k1129l3190M777Q642j9546
19397A597k0083J4485O152O627R727j5194L940o011L788k0540o132L8971J6058
19384C3385J8816k6285j1863O708j1603j1728l214K8525K9014p952l9963L3231
$$ plain form
19474 104950 93886 67990 52842 76715 54518 72447 89191 62959 57979 61079 74323 60145
19462 60145 70592 60056 57237 63094 18898 -3859 -349 14387 24180 19651 28573 6256 6564
19449 6564 10550 5979 41066 45049 51181 25171 11567 14526 15535 21080 22076 6673 36445 44251
19435 44251 93502 144970 88875 22628 21589 34416 36489 45759 21145 5145 17352 35405
19423 35405 34177 34608 66339 92459 97164 91547 71924 45863 18538 22673 23197 35613 60116
19410 60116 51905 30052 16733 17369 10262 24638 40638 62043 40914 7724 12501 21143 1597
19397 1597 -18486 -4001 2151 8778 18505 3311 7251 1240 5028 -15512 -21644 17327 33385
19384 33385 52201 25916 14053 20761 9158 -2570 -5784 22741 51755 43803 3840 37071
19372C7071O7287l1447k6382m137K2896k5090m2826r594q032J5626J1190K2207
19360B8769K9414j6273j3982p923l400J3574J3320p137K3377J7870K6846q478
19348I5977m3679l3442O670o084K2924K5059J7k0768l7579J3560j4732P295K4092
19335C9310J8604L6724j3261k0091o464r8k7432k475L0164j5491J6658N3135J9683
19322A28966k6295l5616q426j1152N829m105O422k5999q17R287j295k0126J2744
19309B9417M429K5217j0320K1358O706j4069l6130p078M375K7721J7572J762Q306
19296G9266K646k2270j77K1644j8245k1938J6312K9512O142r653k7030j2073Q882
19283E3018J1872j171m6005j2164k971j2571L8412J2843k230p510J7382K5940
$$ plain form
19372 37071 104358 72911 46529 42392 65288 40198 -2628 -12222 -20254 -4628 6562 28769
19360 28769 58183 41910 27928 20005 16605 30179 43499 36362 59739 77609 104455 95977
19348 95977 52298 18856 25526 19442 42366 67425 67442 46674 9095 22655 7923 15218 39310
19335 39310 57914 94638 81377 61286 54822 54724 27292 24817 54981 39490 56148 109283 128966
19322 128966 102671 67055 58629 47477 53306 49201 55623 29624 28807 38094 36799 16673 29417
19309 29417 33846 59063 48743 70101 76807 62738 26608 19530 23905 51626 69198 70960 79266
19296 79266 81912 59642 59465 81109 62864 40926 57238 86750 92892 83239 56209 44136 53018
19283 53018 64890 63719 17714 5550 2579 -9992 28420 41263 39033 31523 48905 74845
19271G4845j4469j4644R71q246L5681K0759j1291J3067K312m946L745k3422k9984
19258D4378L718R944J492j8895R615n65P96p732r213n502j3885q238k604K392
19244E701M642P950l798Q133K2480J9777J1997q311k6777J5796J8322J642J0070
19231H7624K1194j2420m4200k8731Q063L5316L596k8607l4129j3814K8422K0949
19219D3263k518K2078j1188j6508P840J7998o745J449Q535K2551j9396k5043j7786
19206B4530o688N481J3781K1693J8516n303K6913l141j9755k6415j5923J3188
19194D6877J4471r309l961n443K7695j8742k0360Q382Q026l453J382l01L1499
19181G6763R335k3528l264J4539j6524J980P652J3096J1308K9363J8962K301j2920
$$ plain form
19271 74845 60376 45732 46703 38457 74138 94897 83606 96673 98985 94039 97784 74362 44378
19258 44378 48096 58040 59532 40637 50252 49687 50483 42751 33538 28036 14151 5913 3309 5701
19244 5701 10343 18293 14495 22628 45108 64885 76882 68571 41794 57590 75912 77554 87624
19231 87624 108818 96398 52198 23467 31530 66846 70442 41835 7706 -6108 22314 43263
19219 43263 40745 62823 51635 35127 42967 60965 54220 55669 64204 86755 67359 42316 24530
19206 24530 17842 23323 37104 58797 77313 72010 98923 95782 76027 49612 33689 46877
19194 46877 61348 52039 48078 42635 70330 51588 31228 39610 47636 44183 45565 45264 76763
19181 76763 86098 62570 59306 73845 57321 59301 66953 80049 91357 120720 139682 141983 129063
19168A29063J9674R498n016j6467l9903k5846K4759Q222J1753J6287j1692j494
19156A18838J7384k503j5173L8140N3241N6233R6474J72559K97187M60015N93180
19145A885575O00618j99081q27636o10955k90823p6309o2119j5524K5692P2773
19135E02211J16506K36988L76665N45684O38528m6008q22870o46980l10239j99578
19125C90907j16730m8216m9894m5318m4694K168L9532L7203L07j6626k1441j161
19113A26037l076j5223r265o6j5628J044J4471k7877m388K8174M1204K005k7258
19100A10154l47p653j3993q92j6426J0679K4117k2864l0426o563J5654J666j997
19087F1109K2534N763l3948k803L4787m968k664N80J886l134j8545r066L101J9058
$$ plain form
19168 129063 148737 158235 153219 136752 96849 71003 95762 103984 115737 132024 120332 118838
19156 118838 136222 133719 118546 156686 209927 266160 362634 535193 832380 1292395 1885575
19145 1885575 2486193 2287112 1459476 848521 557698 481389 419270 403746 429438 502211
19135 502211 618717 855705 1232370 1778054 2416582 2370574 1547704 900724 590485 390907
19125 390907 274177 225961 176067 130749 86055 88223 127755 164958 165265 148639 127198 126037
19113 126037 122961 107738 98473 98407 82779 83823 98294 70417 66029 94203 135407 137412 110154
19100 110154 109807 102154 88161 87269 70843 81522 105639 82775 52349 45786 61440 63106 61109
19087 61109 83643 89406 55458 52655 87442 82474 79810 80390 82276 79142 60597 51531 54632 73690
19073G3690P835Q320J0782l504p961j3601M148j1618L847j5692L5330J0993M577
19060A07146j3940j9149r564K7927R924o540k9530o038m350q036o473p073L3998
19047F8302P308m723n807P329K563r666J4786n361m011k885L283l130J359o14
19033F8733l211l614K1821J887k6460o732K5322K4711q117l3996k026J5804R549
19020H3671K6436J8857j9962J9824J8900k1469k2782J0938K3353j4233o333l0487
19008H6713k8854m439p429L3791j0745Q507J1724j9975P75J4048q573m419K1729
18995I2853l393j1586k1458k156L531J4871n996J3289k2680n927J1406p100k0789
18982C4865k7305J9544Q7K0764L4612o564N147J6202P817J3444P209R823j4297
$$ plain form
19073 73690 81525 89845 100627 97123 89162 75561 79709 68091 71938 56246 91576 102569 107146
19060 107146 93206 74057 64493 92420 102344 95804 66274 60236 55886 47850 41377 34304 68302
19047 68302 75610 70887 65080 72409 74972 65306 80092 74731 70720 67835 71118 67988 69347 68733
19033 68733 65522 61908 83729 85616 59156 52424 77746 102457 94340 60344 58318 74122 83671
19020 83671 110107 128964 109002 128826 147726 126257 103475 114413 137766 123533 117200 86713
19008 86713 57859 53420 45991 79782 69037 77544 89268 69293 70068 84116 75543 71124 92853
18995 92853 89460 77874 56416 54260 57791 72662 66666 79955 57275 51348 62754 55654 34865
18982 34865 7560 27104 27191 47955 82567 76003 81150 97352 105169 118613 125822 135645 121348
18969A21348r389P031k4098O952J5611m2793k6855j3368L2187j7649j5082R308
18957D3203N182M7318M6573Q552l315j0376m876J7320J9366j4709k19r699r917
18944A34403L918l2249m8279m6967l1245m1641m0640L4184M5107O4884K3526N0605
18932A15606K4491K1005J3767m4876k3894p1698p5127p0200m3963K2638K5952
18921a06299N9155M9825J9661K8067L1121J2896L72j3977l5219P711j512k0627
18909C1174k4847J3148Q551J2921o563L1797P155K160r337J9894O918o214Q058
18896I4815M133l0472J2869p659j6711n462J8417J6154k035j8380K7148l966j5175
18883G3676K2555J9745J4327r95k6681J0435L1412L7477J295l0737m7797l2949
$$ plain form
18969 121348 111959 118990 94892 101844 117455 74662 47807 34439 66626 48977 33895 43203
18957 43203 48385 95703 142276 150828 147513 137137 132261 149581 168947 154238 154019 144320 134403
18944 134403 138321 106072 57793 10826 -20419 -62060 -102700 -68516 -23409 41475 65001 115606
18932 115606 140097 161102 174869 129993 106099 34401 -40726 -110926 -154889 -132251 -106299
18921 -106299 -47144 2681 22342 50409 81530 94426 94798 80821 45602 53313 51801 31174
18909 31174 6327 19475 28026 40947 34384 66181 73336 75496 66159 86053 92971 86757 94815
18896 94815 98948 68476 81345 73686 56975 51513 69930 86084 84049 65669 92817 88851 73676
18883 73676 96231 115976 130303 129308 102627 113062 144474 181951 183246 152509 104712 71763
18871G1763M787K2854J116k2139N565q044k0401L1546O773o590P903p943J644
18858H8834K121J0875J6621K336j6409K934p486O396J7458m33J484k2575o927
18845I5229J2710r02j9684j7801l2529k533L5384k1365P643J0189Q608K4661L0155
18832A29765O171O491j9403j3800j9240j0308R531M1584j1397l3451L6718L5361
18820A58022R712k2910l9336j4283o120m834M976k698J6117j117m199J6250L3434
18807A43014J8811J9163J424m7966l625j4292k2881K3460M0527M1002L7810o806
18795B29641j1102j423j5295J4923J6354L1273M6760N6238n486j39588o8599L1477
18783A85173M7599J295m0478J7741q691J6718L6020M9099L0916M3805j4624n8575
$$ plain form
18871 71763 76550 99404 100520 78381 83946 75902 55501 87047 93820 87230 95133 87190 88834
18858 88834 90955 101830 118451 120787 104378 107312 99826 106222 123680 123247 124731 102156 95229
18845 95229 107939 107037 87353 69552 37023 34490 69874 48509 56152 66341 74949 99610 129765
18832 129765 135936 142427 123024 109224 89984 79676 89207 130791 119394 85943 122661 158022
18820 158022 167734 144824 105488 91205 85085 80251 85227 82529 98646 97529 93330 109580 143014
18807 143014 161825 180988 182412 134446 130821 116529 93648 117108 157635 198637 236447 229641
18795 229641 218539 217116 201821 216744 233098 264371 311131 367369 361883 222295 153696 185173
18783 185173 232772 234067 193589 211330 202639 219357 255377 304476 335392 379197 364573 305998
18771C05998l6053J2019J9861M7367L6148N0123k6016j32116r0199j3836m0234
18760A33062k5097L4773L5576J3633M76j0887j5034j8077J8590M7342K8235l980
18748B38612j3849j2552J545M966j8176j6876K7379L316o877J0938L6110M5358
18736B99894j1784q612J6079P164L064k405k8305m3347J818L6209L850K7442J9057
18723C20124n437l7300k6190N603J8115K991p84j5684k4566m0493q08k684j3987
18710A78900j900K685J3691J5242l6651l6032L1984J4036j1673j8191r867l210
18698A39014k078M958R986K9687L3636K3361M1036k2524j1526Q77l0233n537J7146
18685B27803Q366j1598k608O079j5129k1054J4708J5217N0096O7485O416k0557
$$ plain form
18771 305998 269945 281964 301825 349192 385340 435463 409447 277331 187132 173296 133062
18760 133062 107965 142738 178314 191947 192423 181536 166502 148425 167015 214357 242592 238612
18748 238612 224763 212211 213756 218722 200546 183670 211049 214365 207488 218426 254536 299894
18736 299894 288110 279498 295577 302741 305805 303400 275095 231748 233566 269775 273625 301067 320124
18723 320124 314687 277387 251197 256800 274915 277906 277122 261438 236872 196379 195571 192887 178900
18710 178900 177000 179685 193376 208618 171967 135935 167919 181955 170282 152091 142224 139014
18698 139014 136936 141894 151880 181567 215203 238564 279600 257076 245550 246427 216194 210657 227803
18685 227803 236169 224571 221963 228042 212913 191859 206567 221784 271880 339365 345781 325224
18673C25224m683k3267n9309j0774J4621J1543N467l9526m8846n7055L4489J17318
18661B65202Q8444N764j2904m7171n7101K2721L6767J1248k0165j0223o8360r0893
18649A23329j3857N6569O0467M8504J1491N578l8394l2385J2527L7531J0993r759
18637B72594l9034p38K679n6460O121k3059m3428Q381O3033M2404K7833j7698
18625B42628k6901k9229j0015L9746N7788p642l0583k3280r099L9190P4508O0781
18613C77892K0032L8880N1199M9166n6M2048R8773Q3212J03887O6879r4726j40032
18601F97154j03972o1321l8680K9944M4257L6976k0214q86J7352q13J5301m825
18589F10273j5207m0636k9070k4654k8140j4977j7452j2380j6729L1675L7439
$$ plain form
18673 325224 320541 297274 237965 227191 241812 253355 258822 219296 170450 113395 147884 265202
18661 265202 353646 359410 346506 299335 242234 264955 301722 312970 292805 282582 214222 123329
18649 123329 109472 166041 226508 275012 286503 292081 253687 221302 233829 271360 282353 272594
18637 272594 233560 232822 235501 179041 185162 162103 118675 127056 190089 232493 260326 242628
18625 242628 215727 186498 176483 216229 274017 266375 235792 212512 203413 242603 317111 377892
18613 377892 397924 436804 488003 537169 537113 579161 677934 761146 865033 931912 837186 697154
18601 697154 593182 531861 493181 523125 567382 604358 584144 583258 600610 599797 615098 610273
18589 610273 595066 554430 525360 500706 472566 457589 440137 427757 411028 442703 480142
18578D80142J1450K4315j0910j3427m125P096o466n271j8450j1238k8439j5485
18566D09192j2821M4737P2513M7970K6970k0313N019N6782K5212k1471p3214k7470
18554E33106N5021K6840N5286K4823J5603M3050M5136k703K2162L3027m4896n959
18542H00496L1258O7038Q8384L2169N5454l1874K689K7342L3096M2114L6631L4934
18530A219731J7636M2687R0161J13012J49210J10018J51596K74804M59920O23217
18520C251992N92187j91264o61594m06053j60903p193J12402J63577K03515K89225
18510C185891M71393Q07820J261308J630334J284015n73060j425609o31291J15414
18501F126215O45941J062015P58949p1759J82639O58203J090670J433734J572825
$$ plain form
18578 480142 491592 515907 504997 491570 487445 494541 488075 482804 464354 453116 424677 409192
18566 409192 396371 441108 513621 561591 588561 568248 573267 630049 655261 633790 560576 533106
18554 533106 588127 614967 670253 695076 710679 753729 798865 796162 818324 851351 806455 800496
18542 800496 831754 898792 987176 1019345 1074799 1042925 1045614 1072956 1106052 1148166 1184797 1219731
18530 1219731 1237367 1280054 1370215 1483227 1632437 1742455 1894051 2168855 2628775 3251992
18520 3251992 3844179 3652915 2991321 2585268 2424365 2417172 2529574 2693151 2896666 3185891
18510 3185891 3657284 4465104 5726412 7356746 8640761 8067701 6642092 6010801 6126215
18501 6126215 6772156 7834171 8593120 8521361 8704000 9362203 10452873 11886607 13459432
18492A3459432J666814J227409J751735L270235M983299P565215J1875971J8956037
18484F4756147L3621872O0714245R2149611J18527448Q1942648j00927791j51017240
18477A99766940q1211225l7755987j7724695p844715j610377M878764J3372592
18470G1871297K8673769N5057065Q7099514J12399331J01420590p2341009j64646725
18463B19533832r7250282m5906689k3417955j4108070r890029o626252m244090
18456A8090465k708277j829179j279142q76635j477980j593868q73351l13442
18448G138591n0027J53549m51090j107084q09281l90334L1717M42399P98330J015924
18438F772694Q4968j379142j526891r36210m79063k98385j94761m6541n5084p8031
$$ plain form
18492 13459432 15126246 16353655 18105390 21375625 26358924 33924139 45800110 64756147
18484 64756147 98378019 159092264 251241875 369769323 451711971 350784180 199766940
18477 199766940 118555715 80799728 63075033 55230318 53619941 58498705 71871297
18470 71871297 100545066 155602131 242701645 355100976 456521566 384180557 219533832
18463 219533832 122283550 76376861 52958906 38850836 28960807 22334555 18090465
18456 18090465 15382188 13553009 12273867 11397232 9919252 8325384 7452033 7138591
18448 7138591 7088564 7242113 6791023 5683939 4874658 4484324 4516041 4958440 5756770 6772694
18438 6772694 6857662 5478520 3951629 3015419 2536356 2237971 2043210 1996669 1941585 1863554
18428A863554N3151J90505L82967N08301M72038k60556r33916p29708l53312j64802
18418A028222p2485n5074o5718j02902r0884n9774l9164m0454o0258l7074j843
18407D02592j4647L1387N8858J6351k4018j9128k2681k1833o003m5531L572K5549
18395C84468O627j0462n843j9461j3244o956m3953k0346J341K4298P498k7091
18383B76876j5897L974L8689K6981k7212m0453m2911j1886m5207L412J8003J4030
18371A98399j4940l1124l6889O233r350J4621M0212M425j0982K8653Q684J7265
18359B15207L3075k3300o0091k3356l977p25J6374k5707n574j1736K3459m818
18347A28831J3289k305l5080n2820J0456M9087K6401J4796l6085n7693R188L7657
$$ plain form
18428 1863554 1916705 2107210 2490177 2998478 3470516 3209960 2276044 1546336 1193024 1028222
18418 1028222 955737 900663 834945 732043 641159 581385 542221 501767 441509 404435 402592
18407 402592 387945 419332 478190 494541 470523 451395 428714 406881 400878 355347 358919 384468
18395 384468 391095 380633 374790 355329 342085 335129 291176 270830 272171 296469 303967 276876
18383 276876 260979 264953 303642 330623 303411 262958 220047 208161 162954 166366 184369 198399
18371 198399 183459 152335 115446 121679 112329 126950 167162 171587 160605 189258 197942 215207
18359 215207 248282 224982 164891 141535 137558 136833 153207 127500 121926 110190 133649 128831
18347 128831 142120 139815 104735 51915 62371 111458 137859 152655 116570 58877 68065 105722
18335A05722M0208K3482L453j8480o933L4744M3906j3584m3944K837L254o223
18323A68442m1173J4241k3543l6401j0516M8262M5951J375K6798R252n6769l9405
18311A06514j5867k3907j4061j8039j2068r948q825j9193l4723j5058j2583M4185
18299c3573N7169Q6054O5147m4863j13642r1272k6774K9796K6808K5765k2458
18288d1843m5671j0934n96K5413R5286P7019K1180n1809o8780j4548J0941P390
18276C048j9360k0491K82j0880k6433j9452K7080K9960M4537L9457N3098O4446
18264A65292j0447k4699m6019m0366m0680J4159J8345k5323k2373J5383K486O302
18252A2060r14J7339P899J8067K3790M6003m780N194J2247l3757k8590j2850q887
$$ plain form
18335 105722 145930 169412 172865 154385 147452 182196 226102 212518 168574 171411 174665 168442
18323 168442 127269 141510 117967 81566 71050 119312 165263 166638 193436 202688 145919 106514
18311 106514 90647 66740 52679 34640 22572 12624 3799 -15394 -50117 -65175 -77758 -33573
18299 -33573 23596 109650 174797 129934 16292 -74980 -101754 -71958 -45150 -19385 -41843
18288 -41843 -87514 -98448 -99044 -73631 21655 98674 119854 68045 -735 -15283 -4342 3048
18276 3048 -16312 -36803 -36521 -47401 -73834 -93286 -66206 -36246 8291 47748 100846 165292
18264 165292 154845 130146 84127 43761 3081 17240 35585 10262 -12111 3272 5758 12060
18252 12060 11146 28485 36384 54451 78241 124244 119464 124658 136905 103148 74558 61708 52821
18239E2821n534k2586J6180K0733N0579L6638k566r214k4774j8351k9103k754
18227F2069j0565j0232j7015J2643P174j9356J232K0017j5361k6063o942L4394
18215C1995J8146L343k5516r191q887r801l499K6743L0193K8771J0245P813o411
18202I3944M547L8398L6933l1603n2381p0884m6617J9995P979p16j7051L6276
18190A8820N2794J7646p924R381q394k5415k017J8262o68O655J3637k7696k0050
18177D5031k5679J0497j789m3612r4230n6901P1210K9176M128L5096N5284J7626
18165D5837k8036l6052k2262M7596k4723n7690o0400k1136P2867P4074M4571K9029
18153F3675J1814k3669K370K4672J5373M1704J6753l450j543L870Q808J1424K6379
$$ plain form
18239 52821 47287 24701 40881 61614 112193 148831 146265 137051 112277 93926 64823 62069
18227 62069 51504 41272 24257 36900 44074 24718 25950 45967 30606 4543 -2399 31995
18215 31995 50141 53484 27968 18777 9890 89 -3410 23333 53526 82297 92542 100355 93944
18202 93944 98491 136889 173822 142219 89838 18954 -27663 -7668 311 -405 -17456 18820
18190 18820 71614 89260 81336 90717 82323 56908 54891 73153 72485 79140 92777 65081 45031
18177 45031 19352 29849 28060 -15552 -109782 -166683 -95473 -66297 -62169 -27073 28211 45837
18165 45837 17801 -18251 -40513 7083 -17640 -75330 -135730 -156866 -83999 -9925 34646 63675
18153 63675 75489 51820 54190 78862 94235 135939 152692 149242 147699 151569 160377 171801 198180
18140A98180O843N873R483N3319K1398M772R922M4879N8724L6394L2658M5517
18128E27962N5611O4366N7131M5543N4618Q8878J39238J45236J35199K37339K87184
18117A838305L83864N35463P83537J163770J841203L175817O054599J0776370
18109B6552928J5432303J9199459O531494k0934283k0714691j0178101n575577
18102A0313532l343215j999130j216334p86260n47954l97418k65110j55504n284
18093A597323J88004L75839N12888L23392n68855q77297n09385k28226j29995
18084F83688p5496n6009p7985n2839o8544n1833j4216J957J3726k5704m1434o8
18072B35243j0131n1693k1526R204pK1162J1985J1810l3464m9540l4978j785K1673
$$ plain form
18140 198180 205023 210896 220379 273698 295096 299868 309790 354669 413393 449787 482445 527962
18128 527962 583573 647939 705070 750613 805231 894109 1033347 1178583 1313782 1551121 1838305
18117 1838305 2222169 2757632 3541169 4704939 6546142 9721959 15776558 26552928
18109 26552928 41985231 61184690 67716184 46781901 26067210 15889109 10313532
18102 10313532 6970317 4971187 3754853 2968593 2420639 2023221 1758111 1602607 1597323
18093 1597323 1785327 2161166 2674054 2997446 2428591 1551294 1041909 813683 683688
18084 683688 608192 552183 474198 421359 352815 300982 286766 288723 302449 276745 235311 235243
18072 235243 225112 173419 151893 161097 161090 182252 194237 206047 172583 123043 88065 86280 107953
18059A07953J4905L1261j0858l1201j5376k6897k9947m2022j6827J8101M4718
18048D3810k422L590Q659J3139J478m2135O776M0313K9364J745L35K3383j7597
18035A10438k9397M623j854j1130m928J2839K0109R435K089K3819k186O1135N6500
18022B51492K9243n2045n1261n1154j12329m5919l948J9533J8285J6712N0767
18011F9376M7567N3402N3535L8530m6803p6167o2058o3326l0852J1054J3046L263
17999A0567K7763j7772j3346l0976r56o425L0321L9921K6256j895k0043l8986
17987D429n3085n6893l7933n715O1449N5675J7198K644j3309K0126K9969L8401
17975F2956R69m3433q3037o8833o6260n0833M1506N4052J8536J427J3047J7741
$$ plain form
18059 107953 122858 154119 143261 112060 96684 69787 39840 -2182 -19009 -908 43810
18048 43810 41388 44978 53637 66776 68254 26119 32895 73208 102572 104317 104652 128035 110438
18035 110438 81041 85664 83810 72680 67752 80591 100700 110135 112224 136043 133857 194992 251492
18022 251492 280735 228690 177429 126275 13946 -31973 -35921 -16388 1897 18609 69376
18011 69376 116943 170345 223880 262410 215607 139440 77382 14056 -16796 -5742 7304 10567
17999 10567 38330 20558 7212 -23764 -24720 -31145 -824 39097 65353 63458 43415 4429
17987 4429 -48656 -105549 -143482 -149197 -87748 -32073 -14875 -12231 -25540 -5414 24555 62956
17975 62956 63925 20492 -62545 -131378 -197638 -248471 -206965 -152913 -134377 -132950 -119903 -102162
17963a02162J3482M352K4501j719J2995N2958l815P141k7266m8157K7656L8505
17951a529J6808j0855Q490J7145j9774j3022J619k3060P999O785j2445r193K8586
17938b446J7211j3446j5793K0422L2290j6632J6145l2915r430M964L0230J9506
17926E0106J0140r462J1641o341k4905k1323o7127l3456p61Q810M593J5493o55
17913f3247K5831q060r406L3679N3939k3967j5545R003J3275l0469p139P483J0184
17900d439J0591K8990L7793J9343p132p017j9300j3491N766O806p123j8614n091
17887B7082K6731K7148K8035J3899k3127n4063k5890k2374J894K6993j211J018
17875B6135m096j1921k0619K1595Q127j1539p03R628K7063j1967k6811J6442K6834
$$ plain form
17963 -102162 -88680 -84328 -59827 -61546 -48551 4407 592 7733 -19533 -67690 -40034 -1529
17951 -1529 15279 4424 12914 30059 10285 -2737 -1118 -24178 -16179 -9394 -21839 -31032 -2446
17938 -2446 14765 1319 -14474 5948 38238 21606 37751 4836 -4594 370 30600 50106
17926 50106 60246 50784 62425 56084 31179 9856 -57271 -90727 -91488 -82678 -78085 -62592 -63247
17913 -63247 -37416 -45476 -54882 -21203 32736 8769 -6776 2227 15502 -14967 -22106 -14623 -4439
17900 -4439 6152 35142 72935 92278 85146 78129 58829 45338 51104 57910 50787 32173 27082
17887 27082 53813 80961 108996 122895 99768 45705 19815 -2559 -665 26328 25117 26135
17875 26135 22039 10118 -10501 11094 19221 7682 6979 16607 43670 31703 4892 21334 48168
17862D8168k376K7988K4846K667J375j3328k8508j7673q640K7194J3702j5678
17850E9737o344J4359M651j5923j4851K4606L2515M6995J9391J8884K867j6592
17838A70295N284K0689P8015P0359K8500o1872j16186o9857J4742M6370m793j7664
17826A63882L730J6606K7755L3922L0575K3819L5069k6860j14326o8163M940M2410
17814A73359J3129M4451R6078Q6740J86966K85089M55146O36495L54234n38936
17804A792751p27230l81382j93720p6882n1075o59K8410Q1828J84874L19259N03395
17793A479569O02310M76636m23114q63145n22795k53051j10126p8235m4175j6609
17783B47265j3913o51L9584K3828M331k1838l6557k5704j2007j2134p256l150
$$ plain form
17862 48168 45792 73780 98626 101293 102668 89340 60832 43159 34519 61713 75415 59737
17850 59737 53393 67752 72403 56480 41629 66235 98750 145745 165136 184020 186887 170295
17838 170295 175579 196268 274283 344642 373142 311270 195084 125227 139969 186339 181546 163882
17826 163882 167612 184218 211973 245895 276470 300289 335358 308498 194172 126009 130949 173359
17814 173359 186488 230939 327017 413757 600723 885812 1340958 1977453 2331687 1792751
17804 1792751 1065521 684139 490419 413537 362462 361803 390213 472041 656915 976174 1479569
17793 1479569 2081879 2558515 2135401 1272256 749461 496410 386284 308049 263874 247265
17783 247265 233352 232701 272285 296113 300444 278606 242049 216345 204338 192204 184948 181798
17771A81798j4106J0184K0480J0363k1137O667L0256j7320k4085j8059k2711j8042
17759A24288j9024k1439k721K7035J230m768k1142M404j5397j8700j2124J1408
17747E3050Q697j3936j3189j3391J3178K3170J5738N712j9843l57K0718K9114
17735A08661m618l7557j4440j0488K0469m956k7746k3199J5571M6249O2708L9588
17723A70242n418J6289L8183P286j7793n7588R611K0270r832K2590m288l5433
17711A54119m3590n6863L8739O5546J06259M4578k7605o0312r439p137K5947K8724
17699B58966k516l6847q3634q3609j0335M0386N0789M3206L6307j341k0552n4151
17687A36669k9170Q955J6969J3250j8973J2982k0372l1343J5644j8673k9024j4015
$$ plain form
17771 181798 167692 177876 198356 208719 187582 194249 224505 207185 183100 165041 142330 124288
17759 124288 105264 83825 81104 108139 109369 104601 83459 87863 72466 53766 41642 53050
17747 53050 61747 47811 34622 21231 34409 57579 73317 79029 59186 58829 79547 108661
17735 108661 104043 66486 52046 41558 62027 57071 29325 6126 21697 67946 130654 170242
17723 170242 164824 181113 219296 226582 208789 151201 160812 181082 171250 193840 189552 154119
17711 154119 110529 53666 92405 157951 264210 308788 281183 220871 211432 204295 230242 258966
17699 258966 256450 219603 135969 52360 42025 82411 133200 176406 212713 211372 190820 136669
17687 136669 107499 116454 133423 146673 127700 140682 120310 88967 104611 85938 56914 42899
17675D2899L7280L9100J4136l586j3801m5073k9078K9753L1116o819m865J4782
17663A05844r349M8870Q9344J1733L8275L3893M3331M7982j8688k8466J0073J7411
17651C90253J4261K6970j7406l7484k4809m3082n1285L0291N7773M7556m699l4778
17639C53561L004M5167K9750K104o0025p1436k6683K3040J5744L198n619j0408
17627C01397k1139k2319K6761J2130J846L801l3430k7220K4720N5372k1403l9049
17615B61467k6038n4591q894R657L6000N7318L4782J7434J509o215j0282K2124
17603C34271K063k6320n31L2417K0481L7026L2690L5960J7720J8727N327j0981
17591D98850r170J1714P8367O8351J8407K4045K2719O759q936o39N3573N1175
$$ plain form
17675 42899 80179 119279 133415 129829 116028 70955 41877 71630 102746 95927 91062 105844
17663 105844 96495 145365 234709 246442 284717 318610 361941 409923 391235 362769 372842 390253
17651 390253 404514 431484 414078 376594 351785 308703 257418 287709 345482 393038 388339 353561
17639 353561 356565 401732 431482 433586 373561 302125 275442 298482 314226 317424 311805 301397
17627 301397 280258 257939 284700 296830 298676 302477 269047 241827 266547 321919 300516 261467
17615 261467 235429 180838 171944 181601 217601 274919 309701 327135 328644 322429 312147 334271
17603 334271 336334 310014 309483 341900 362381 399407 432097 468057 485777 504504 509831 498850
17591 498850 489680 501394 579761 648112 666519 690564 713283 720042 711106 710467 764040 815215
17579H15215L3702o216J1565Q708J409N6982J10988R3660L2609k2183N567M7085
17567A189091M8488N0288O9526J17933J19256Q4464J34590K24924K37689K80373
17557B556622M38150O07836Q95159J048174M70151J02413l7938o52921n74504
17548D853142j32141J53820L74989N21996O97087R75418J311028J804964K020099
17539A2580402J484745J350831J923331K323425L582353N506136P371267J0856008
17531D6978498J7802662L4073752O3396778R5958812J21578205P9427481j07630463
17524C51585725j54156413q0772574l5683315j5160419o022045j373759M124037
17517F2541237J1381718K5237955N2209407Q5688944J12855761R7304855p9349538
$$ plain form
17579 815215 848917 842701 854266 862974 864383 921365 1032353 1126013 1158622 1136439 1142006 1189091
17567 1189091 1237579 1287867 1357393 1475326 1594582 1679046 1813636 2038560 2276249 2556622
17557 2556622 2994772 3602608 4497767 5545941 6016092 6118505 6080567 5427646 4853142
17548 4853142 4721001 4874821 5249810 5771806 6468893 7444311 8755339 10560303 12580402
17539 12580402 14065147 15415978 17339309 19662734 23245087 28751223 36122490 46978498
17531 46978498 64781160 98854912 162251690 258210502 379788707 459216188 351585725
17524 351585725 197429312 116656738 80973423 65813004 59790959 58417200 62541237
17517 62541237 73922955 99160910 151370317 237059261 349915022 447219877 367870339
17510C67870339j59215174r2354193m2996343k1185750j2093222q579536n742829
17503B5703292l801712l202101k636070k773419k295366j584686j028780l70575
17495H010583J281J01086m71502j149559q05467l26952j1123K45868J67313o20918
17485E140610q83318n26399k02500P2039K42381M20063J31p74907p26473m44132
17475B317495l05339j79787j25118j20046p9401o0011j26705j43338j44481p4823
17465I58446n1r380o595n6713m0847l4607q557k9625o1940p9746l7350l5709l1249
17452E26077J1063L6977K17o352k46l0364q676K0662L0654N3516J00952R3307
17440H27787k8335j50279o8638n4854n9817m6759N760L5959R4722O1252r2483
$$ plain form
17510 367870339 208655165 116300972 73304629 52118879 40025657 31446121 25703292
17503 25703292 21901580 18699479 16063409 13289990 10994624 9409938 8381158 8010583
17495 8010583 8011864 8112950 7641448 6491889 5686422 5359470 5348347 5594215 5761528 5140610
17485 5140610 4257292 3730893 3528393 3600432 3842813 4262876 4263007 3488100 2761627 2317495
17475 2317495 2012156 1832369 1707251 1587205 1507804 1447793 1321088 1177750 1033269 958446
17465 958446 958395 949015 942420 885707 844860 810253 801696 772071 710131 630385 593035 557326 526077
17452 526077 537140 574117 574334 567982 567736 537372 528696 549358 580012 633528 734480 827787
17440 827787 799452 649173 580535 525681 465864 419105 424865 460824 555546 616798 524315
17429E24315j22586n2419J5446K5266M109l0762k0965k3379l5910k2427L7524
17418B98212O482k3034r387k1394l0588J2163K2449j2842k8223m3501j2190K8373
17406A86520J8496L2363k9489n3971j9640L7840N5283m3479j9766K9432L3548
17395B27137J3214R735Q586n2251m8428k4208r525R041P1940Q0988j6837m7562
17383B21830l5028k6656K7724M5849K5721o7k1512L83O4883J1328k0524j5665
17371B78266K257K6454J34279J47607J25916J841j09643j5840O3038J43442O5835
17360H63452j92946k21993l6914K3484N6823J10631R5418r5676j54092L903P0308
17349E22398M1953j09505j96319q5959J5739J6533j2779p3504j00000o6770q803
$$ plain form
17429 524315 401729 349310 364756 390022 394131 363369 342404 319025 283115 260688 298212
17418 298212 304694 281660 272273 250879 220291 232454 254903 242061 213838 170337 158147 186520
17406 186520 205016 237379 207890 153919 134279 172119 227402 183923 164157 193589 227137
17395 227137 240351 250086 258672 206421 157993 133785 124260 133301 205241 286229 269392 221830
17383 221830 186802 160146 187870 233719 259440 259373 237861 238244 303127 314455 293931 278266
17371 278266 280523 306977 441256 588863 714779 716620 606977 591137 654175 797617 863452
17360 863452 670506 448513 411599 435083 491906 602537 697955 602279 448187 452090 522398
17349 522398 564351 454846 258527 172568 188307 204840 192061 118557 18557 -48213 -57016
17338e7016J6826N8574K2050l0747m0845m1848n6402J6686R7125Q0120O9649m1272
17326I2900j22746n2775m752N3230L4360k2676l0891k7338j9353n1582L1605P5955
17314d4063L6205J3411L9181M2522J4411l0261l2594n877J978k322M0595p413
17302F5773n3174j7303J7226K1862L5844j727p853J2560J2644J8098l4277l1210
17290C8463K3005J0207j8792k319K760k2800q305J4341P124J2516K9711m124o702
17277G5085J1312l2309n9570k9630l797K0104J6763O073K3742K7904P241M720
17265F7638q327k6756r570j1017j4101k582k73j1717k755P953J725p056L197M625
17251i016p996K0368L1885Q309J7716K7047j2703n277k0540l2528q059o759p560
$$ plain form
17338 -57016 -40190 18384 40434 9687 -31158 -73006 -129408 -112722 -15597 64523 134172 92900
17326 92900 -29846 -82621 -87373 -34143 217 -22459 -53350 -80688 -100041 -151623 -120018 -44063
17314 -44063 -7858 5553 44734 87256 101667 71406 38812 32935 34913 32591 73186 65773
17302 65773 12599 -4704 12522 34384 70228 68501 60648 73208 85852 103950 69673 38463
17290 38463 61468 71675 52883 50564 53324 30524 22219 36560 43684 56200 85911 81787 75085
17277 75085 86397 54088 -5482 -35112 -38909 -18805 -2042 4031 27773 55677 62918 67638
17265 67638 59311 32555 22985 11968 -2133 -4715 -4988 -16705 -19460 -11507 -9782 -16838 -13641 -9016
17251 -9016 -17012 3356 35241 43550 61266 88313 75610 70333 49793 17265 9206 2447 -5113
17238e113N564K4199P133L4279N045l9754J3144J380j9375o016n3305N269k1417
17225d8967j206M372k8625j2377J1321l8870j18638k4724J03629J8228K7719M7373
17213f0765M1012N907K95l503q454R5933J01558n3796j93471j56513N2510O5359
17201a13928K6264K961J3553K6930O874j5023r998J6652L7309P364K4456j1844
17189A1570M748n743M788k5628j8568K568J2095Q975j0066j8001q210N789L5123
17176e60J5684j8090m843J3633j2697k9169J1019J0237J4466K8726M366m6068
17164a3296k779J2989k587j145J3135J7067Q650l3167j7949j708K8080j887m0957
17151c5554m611o340j992J3376O73K0979k887j0458j1483J7198K3794R743O119
$$ plain form
17238 -5113 451 24650 31783 66062 71107 31353 44497 45877 26502 20486 -32819 -27550 -48967
17225 -48967 -50173 -45801 -74426 -86803 -75482 -114352 -232990 -257714 -154085 -135857 -108138 -60765
17213 -60765 -19753 -13846 -13551 -17054 -25508 70425 171983 118187 -75284 -231797 -179287 -113928
17201 -113928 -87664 -84703 -71150 -44220 -37346 -52369 -62367 -45715 -8406 -1042 23414 11570
17189 11570 16318 10575 15363 -10265 -28833 -26265 -14170 -5195 -15261 -33262 -41472 -35683 -560
17176 -560 15124 -2966 -7809 5824 -6873 -36042 -25023 -14786 -320 28406 32772 -13296
17164 -13296 -16075 -3086 -5673 -6818 6317 23384 32034 -1133 -19082 -20790 7290 5403 -35554
17151 -35554 -40165 -46505 -48497 -35121 -34448 -13469 -16356 -26814 -38297 -21099 2695 12438 18557
17138A8557j0839J5185j0639p675k8726j36J0681J6369J3770J878k7873k848m422
17125a6718K5822K6248k2322J558L812k9103k2310K0287K0492k4234j8206M0011
17113E337K0241j3507l2026j1549O331J404J0566L9102J1416k0641k2601J1069
17101E142K1483k6058k7261k8046L809J5619Q320J5476J544l7932j7222K4638
17089d0488J5890Q446K6153Q699j2784l1463l9320K7185N6819J2150j7357l1864
17077a7934o380M9580J1123j5171R833K2950L9308O2962N2090M1342q0629n0819
17065A18255m0586o6688l0210K2714J0704l0433k5520J8399L5100M8184P2155
17054A32074P1047l8215q5317n1120o0490k7394j3275j3503K9242J5909M766J6129
$$ plain form
17138 18557 7718 22903 12264 4589 -24137 -24273 -13592 2777 16547 18425 -9448 -12296 -16718
17125 -16718 9104 35352 13030 14588 18400 -10703 -33013 -12726 7766 -16468 -34674 5337
17113 5337 25578 12071 -19955 -31504 -25173 -23769 -13203 25899 37315 16674 -5927 5142
17101 5142 26625 567 -26694 -54740 -50931 -35312 -26992 -11516 -9972 -47904 -65126 -40488
17089 -40488 -24598 -16152 10001 18700 5916 -25547 -64867 -37682 19137 31287 13930 -17934
17077 -17934 -24314 25266 36389 21218 31051 54001 93309 156271 208361 249703 169074 118255
17065 118255 77669 10981 -19229 3485 14189 -16244 -41764 -23365 11735 59919 132074
17054 132074 203121 164906 79589 28469 -32021 -59415 -72690 -86193 -56951 -41042 -36276 -20147
17042b0147k127L217O711O271R840j0171j4418P078l391l9222m272K1314j1378
17029e0695k2223K5882J6461r712o331j6957j7515M332K7584K900N829m090Q689
17016c5846k147m33k741l693k430m112J5531k2063P798K0179R937k516k0112r901
17002e2549K06J1169N151j6315J2533J0831j4990K398J9133j6135j3163K9570
16990b2161R317J0012l290j6277r664J5774N456J6671j4763n4798k202M7886L3586
16977A5547l8042k9530J843j63j485J9407L8969Q591K1664n08l0183J9322k3142
16964B290m2737r709L2477j5470l264r23J1592M3928L3771K0679j1869j3464K9520
16951G6821L1345K9945K1771K7102N9567J48513K67982M02616N53043O52985J02223
$$ plain form
17042 -20147 -22274 -19057 -12346 -6075 3765 -6406 -20824 -13746 -17137 -56359 -60631 -39317 -50695
17029 -50695 -72918 -47036 -30575 -40287 -46618 -63575 -81090 -76758 -49174 -46274 -40445 -44535 -35846
17016 -35846 -37993 -38426 -41167 -44860 -47290 -51402 -35871 -57934 -50136 -29957 -20020 -22536 -42648 -52549
17002 -52549 -52343 -41174 -36023 -52338 -39805 -28974 -43964 -41566 -22433 -38568 -51731 -22161
16990 -22161 -12844 -2832 -6122 -22399 -32063 -16289 -10833 5838 -8925 -63723 -65925 -18039 15547
16977 15547 -22495 -52025 -50182 -50345 -51830 -32423 6546 15137 36801 36293 6110 25432 2290
16964 2290 -40447 -50156 -17679 -33149 -36413 -37336 -25744 18184 51955 72634 60765 47301 76821
16951 76821 108166 138111 159882 186984 246551 395064 663046 1065662 1618705 2271690 2373913
16940B373913p39588o69139l19992j68616n8042n9178m0731K5940Q2273K20911
16930F47751L69277N03937O33393K53174o80700p65980l98458k17168j19670n8008
16920A67548k3851m0455m1749k4152J0699l6232n247K1765L761k3529K4405J7787
16908E0750k3615k3694l0365J0818K1891p566k7501K9205J6230l8942J785K4874
16896C870L202J3772j3430q984j1522jl538J2541N686k1054j7430k7818Q08L2661
16882c1237K0700Q605M329J1653m469n214r289K423M446j6595q172j2347P938
16869b7229q337k175J6029M95j8673K7065K1412J344l7908j2481P142K0412j0685
16856b3589r196p217j2353O819K655j2888J3922L5959K6446j7283m8499j8968
$$ plain form
16940 2373913 1634325 965186 645194 476578 418536 359358 318627 344567 426840 647751
16930 647751 1017028 1520965 2154358 2407532 1726832 960852 562394 345226 225556 167548
16920 167548 143697 103242 61493 37341 48040 11808 6561 28326 32087 8558 32963 50750
16908 50750 27135 3441 -26924 -16106 5785 -1781 -29282 -77 16153 -22789 -21004 3870
16896 3870 7072 20844 7414 -1570 -13092 -13093 -16631 -4090 1596 -19458 -36888 -64706 -63898 -31237
16882 -31237 -10537 -1932 2397 14050 9581 4367 -4922 -2499 1947 -14648 -22820 -35167 -27229
16869 -27229 -35566 -37741 -21712 -21217 -39890 -12825 8587 9931 -27977 -40458 -33316 -12904 -23589
16856 -23589 -32785 -40002 -52355 -45536 -42881 -55769 -41847 -5888 20558 3275 -45224 -64192
16844f4192l159M004J4203K3059N054j0680J7071q670j1895J2642K3896L43Q293
16831I969k2096n0113R443J7377J1794r312j2112j3126p090k517R564L6461k372
16818b4130k0077M480M1357j8705j7888m390k556J2810J1524k9615K1912J9886
16806e392j0491J1567K1845n847k5338l418m861J6343n422q681J3263Q465l1733
16793b9700k5480L8555j5717k240L4471Q534k8088k5791J1476l4825k0503J2701
16781g6607J0481K5282K1535R503N353n451o396R899J5687l7941j7661K4368J4306
16768g642j9358J4528P19q108Q294p237P630K6396k1391j568M701j6086K9424
16755A0302r720k433K7120o053k6406j6767l603J3846r479m852n813k6372m280
$$ plain form
16844 -64192 -67351 -63347 -49144 -26085 -21031 -31711 -14640 -23310 -35205 -22563 1333 1676 9969
16831 9969 -12127 -62240 -52797 -35420 -23626 -32938 -45050 -58176 -65266 -67783 -58219 -21758 -24130
16818 -24130 -44207 -39727 1630 -17075 -34963 -39353 -41909 -29099 -17575 -47190 -25278 -5392
16806 -5392 -15883 -4316 17529 11682 -13656 -17074 -21935 -5592 -11014 -19695 -6432 2033 -29700
16793 -29700 -55180 -16625 -32342 -34582 -111 8423 -19665 -45456 -33980 -68805 -89308 -76607
16781 -76607 -66126 -40844 -19309 -9806 -4453 -9904 -16300 -6401 9286 -28655 -46316 -21948 -7642
16768 -7642 -27000 -12472 -11753 -19861 -11567 -18804 -11174 15222 -6169 -7737 -3036 -19122 10302
16755 10302 582 -1851 25269 19216 -7190 -23957 -27560 -13714 -23193 -28045 -33858 -60230 -64510
16742f4510m120J8955J0973O847J0601k8430q642M4678J7764k2941n418K5249
16730A006j8077j4162Q628l703P276j889O447L409j6447k2669L5325L7100L9579
16717F1823N6634Q0858J37115J54378J5889R549k2160j60815j47204q3413m5918
16706E6736k0383k3656j6949n90m064k2385j0313K361J3337J6844K2767k3357
16694i652m822J1927K4294J1603l427l1293j951K6780Q789m7756n3390j1873M1030
16681c9741M1303J752p842j9459J6628J8763k4985j5014r492J5263K7629L74m4474
16668c9295j4080L1525m409k1897j1668J8452j026M539J1245J380K3573P628m211
16655A756n240j014P603j1269q839j84J0386m490k2758k9690J0129j67J3321O068
$$ plain form
16742 -64510 -68630 -49675 -38702 -31855 -21254 -49684 -58326 -13648 4116 -18825 -24243 1006
16730 1006 -17071 -31233 -22605 -26308 -19032 -20921 -14474 -11065 -27512 -50181 -14856 22244 61823
16717 61823 118457 199315 336430 490808 506697 516246 494086 333271 186067 102654 56736
16706 56736 36353 12697 -4252 -4842 -8906 -31291 -41604 -39243 -25906 -9062 13705 -9652
16694 -9652 -14474 -2547 21747 33350 29923 -1370 -3321 23459 32248 -15508 -68898 -80771 -39741
16681 -39741 1562 3314 -4528 -23987 -7359 11404 -13581 -28595 -38087 -22824 4805 5179 -39295
16668 -39295 -53375 -21850 -26259 -48156 -59824 -41372 -42398 -37859 -26614 -25234 -1661 5967 1756
16655 1756 -3484 -4498 3105 -8164 -17003 -17187 -6801 -11291 -34049 -63739 -53610 -53777 -40456 -34388
16641c4388k271j2077L796J345j0421p946m424K7482J6888K356l122q844Q04K8598
16627b224l693K550l16j5864k5327r666K1892L9992n352k8404j4063J0843q196
16614c7828j6270j047O05J9955j5338J4420J4583P909R789q854m898J9612K1690
16601B4328J2600j5519m2455p464J0544p196N34P278J5914L2321j2536k6720l3909
16588d2280j8640k3936J8583K3183K3596J3329j564J533j7057M732o447P926O571
16575a0471J9117K2806N387J0767m1785l4783K0459J8029J575j4656n982j9210
16563b8747O622Q605l5627o102M5263L8890l5844j1033J3640o171N020n452j0855
16550b1791K0453l0514k8070J3226J8444j7021m5479M969M2668K1236K2566M488
$$ plain form
16641 -34388 -36659 -48736 -44940 -43595 -54016 -61962 -66386 -38904 -22016 -19660 -22782 -31626 -30822 -2224
16627 -2224 -5917 -3367 -3683 -19547 -44874 -54540 -32648 7344 1992 -26412 -40475 -29632 -37828
16614 -37828 -54098 -55145 -54540 -34585 -49923 -35503 -20920 -13011 -3222 -12076 -16974 2638 24328
16601 24328 36928 21409 -21046 -28510 -17966 -25162 -24628 -17350 -1436 30885 18349 -8371 -42280
16588 -42280 -60920 -84856 -66273 -43090 -19494 -6165 -7729 -6196 -23253 -18521 -24968 -17042 -10471
16575 -10471 8646 31452 36839 47606 5821 -28962 -8503 9526 11101 -3555 -9537 -28747
16563 -28747 -22125 -13520 -49147 -55249 -9986 28904 -6940 -17973 -4333 -10504 -5484 -10936 -21791
16550 -21791 -1338 -31852 -59922 -46696 -28252 -45273 -90752 -85783 -43115 -21879 687 5175
16538E175k1794j0769J7322J7096P88k1597l2170j0145K278j0779n238J6212J3368
16525d0253K3508K4543P60O159N269k0132J3042j4854m438N264J904p788k5054
16512c2070p128M513N514J5206K2066J4957j6144l7090l967j4215k5834J7814
16500e6378M2934o84n729j7917J8090J5198k9960p052J8279K375j4762M801K1662
16487i143P550k2697j1178J152j9188q839J0269K5579M492j660j1296o216J1765
16474b9410J8971J3196k420j5666j518K3710K4969j0455m3600K638L483J4026
16462b076J1334N556J0561R597j2298k3290j0344j3059k691M9071P410q55j7506
16449A1410m3473l4493J2413K8064K970J3400j9758j9820j0997J7623J0001J0311
$$ plain form
16538 5175 -16619 -27388 -10066 7030 7818 -13779 -45949 -56094 -53816 -64595 -69833 -53621 -40253
16525 -40253 -16745 7798 8558 14717 19986 -146 12896 -1958 -6396 -1132 772 -7016 -32070
16512 -32070 -39198 -34685 -29171 -13965 8101 23058 6914 -30176 -34143 -48358 -74192 -56378
16500 -56378 -13444 -14128 -19857 -37774 -19684 -4486 -34446 -41498 -23219 -20844 -35606 -30805 -9143
16487 -9143 -1593 -24290 -35468 -34316 -53504 -62343 -52074 -26495 -22003 -23663 -34959 -41175 -29410
16474 -29410 -10439 2757 337 -15329 -16847 6863 31832 21377 -22223 -19585 -16102 -2076
16462 -2076 9258 14814 25375 34972 22674 -616 -10960 -24019 -26710 22361 29771 28916 11410
16449 11410 -32063 -66556 -54143 -26079 -23109 -9709 -29467 -49287 -60284 -42661 -32660 -22349
16437b2349j738j289m264J1082j2430l9869k5625P303L8339K4803j0069j1491
16425d7597R524l441N299Q782k408j1554J3830M985j3100M548L2664R143p436
16412C239j0744r537j779J190L0132N948K647k6876p490j5571L717n489J3069
16399a7544J1189K788m6748J0217L0986K6087j5508j9610j1308k2338j0934j3934
16387g6657L2357O276K685J6134k882j4106j4901P618J1332K2440J4202j7143
16375a2645k0765J0722M0680m718k9431p302R833n531P800k858J560o938j7690
16362c7283R153O2958K1272j7854j9536j1516m295k4946k4213m759J0801j8774
16350e8992K019j6451k4080J7770K9044J9981j6323P725K0380m797l19J5143r047
$$ plain form
16437 -22349 -24087 -25376 -29640 -18558 -30988 -70857 -96482 -89179 -50840 -26037 -36106 -47597
16425 -47597 -38073 -41514 -36215 -27433 -29841 -41395 -27565 -22580 -35680 -31132 1532 10675 3239
16412 3239 -7505 -17042 -18821 -17631 12501 18449 21096 -5780 -13270 -28841 -25124 -30613 -17544
16399 -17544 -6355 -3567 -50315 -40098 -9112 16975 1467 -18143 -29451 -51789 -62723 -76657
16387 -76657 -44300 -38024 -35339 -19205 -22087 -36193 -51094 -43476 -32144 -9704 4498 -12645
16375 -12645 -33410 -22688 17992 13274 -16157 -23459 -13626 -19157 -11357 -14215 -12655 -19593 -37283
16362 -37283 -28130 34828 56100 38246 18710 7194 2899 -22047 -46260 -51019 -40218 -58992
16350 -58992 -56973 -73424 -97504 -79734 -50690 -30709 -47032 -39307 -18927 -23724 -24043 -8900 -17947
16337a7947J1766j4744j3605L076J9728K8362K5564l9770l7596K5934K8792k2162
16325b602j9645J6028n338l2876o148j2935J8708J0419k5027J1778L660Q536j3049
16312d8491m128J6807O354r340k289p585J9321K7574r388p244L651J6332j8249
16299a6675j9658k3179j4210M7032N0409o504k4473j0330J989q797l97j9092j009
16286d4894K5432r469L025J1475N997J4041k8892l6063j5892J8267r493Q451K3026
16273c4989O817j1439J6409Q760R482J1734J2869k9768k4152K3592m760L3489
16261A8044O713o174k4996j3237k4499j3241J3235K3886q333j6506n692J1283
16249c9517q972K4548N1636J6759l8740k6654R5J8183j6045m850L0882K8992K2867
$$ plain form
16337 -17947 -6181 -20925 -34530 -31454 -11726 16636 42200 2430 -35166 -9232 19560 -2602
16325 -2602 -22247 -6219 -11557 -44433 -50581 -63516 -44808 -34389 -59416 -47638 -43978 -35442 -48491
16312 -48491 -52619 -35812 -29458 -38798 -41087 -48672 -29351 -1777 -11165 -18409 -14758 1574 -16675
16299 -16675 -36333 -59512 -73722 -26690 23719 17215 -7258 -17588 -15599 -24396 -24793 -43885 -44894
16286 -44894 -19462 -28931 -25906 -14431 -8434 5607 -23285 -59348 -75240 -56973 -66466 -58015 -34989
16273 -34989 -28172 -39611 -23202 -14442 -4960 6774 19643 -10125 -34277 -10685 -15445 18044
16261 18044 24757 18583 -6413 -19650 -44149 -57390 -44155 -20269 -28602 -45108 -50800 -39517
16249 -39517 -48489 -23941 27695 44454 5714 -20940 -20845 -2662 -18707 -23557 7325 36317 59184
16236E9184j4828k0278j4761r534m651K5172J7450j1940j3056J559l8615J3553
16224a0745J0073j6354K9852J2358k1089j2667J4265k4063m297K35j3897O252
16212c0077J6035j6391m4146k8776L7377L4069r915k1633R944L2975J0459k0379
16200c0458j012J7998Q177M4764L957m0918j4883J0985J3075j1486R626J0766
16188B0591j7540R23j1441j2979N788M910K57j9220j8608K2290M9926K9928k2477
16175C2348m0153R288J6710j8027j7396J7415q322m4559k2028p257M2133M442
16163c5406m392N443j3431q605J8743K0239M107k581k4755j7364K9849K0030j5107
16150b3230j1320j5861J3720R859k343J1927K936L553l199J75R769j0512Q883
$$ plain form
16236 59184 44356 24078 9317 -217 -4868 20304 37754 25814 12758 14317 -24298 -10745
16224 -10745 -672 -17026 12826 25184 4095 -8572 5693 -18370 -22667 -22432 -36329 -30077
16212 -30077 -14042 -30433 -74579 -103355 -65978 -31909 -41824 -63457 -53513 -20538 -10079 -30458
16200 -30458 -31470 -13472 -5295 39469 43426 2508 -12375 -1390 11685 199 9825 20591
16188 20591 3051 3974 -7467 -20446 -14658 -9748 -9491 -28711 -47319 -25029 24897 54825 32348
16175 32348 -7805 1483 18193 166 -17230 185 -8137 -52696 -74724 -81981 -39848 -35406
16163 -35406 -39798 -34355 -47786 -56391 -37648 -17409 -13302 -15883 -40638 -58002 -28153 -8123 -23230
16150 -23230 -34550 -50411 -36691 -26832 -29175 -17248 -14312 -10759 -13958 -13783 -4014 -14526 -5643
16137e643L1151o168k3680r608J3402n067r952O51r541O965J4444K5651l231j572
16123A7802l3200j8930K701Q641J9021M297l27l745k5993J1924J1397j122P152
16110c82Q21L1109R546j0218j9426l046K3327N22j9955K151O997j2198R833J248
16096B0329k3667l1008j3669J8449J6868R063k945J0017R527J6916L021J7228
16084E0129k3586j4113k914j8784r140J4450K2647j8584l4561J4742R823q417
16072a8308J0825L32Q416J1164K396j9627o310j7185l6279r035J91L4600K2965
16059a5855m113p369J2866L978m4150J5534M2497J8745J575k8066j5883o808K10
16046b6839K1880J8304q119o656L757l41k988m242J1871j7683k2676r931J4587
$$ plain form
16137 -5643 25508 19340 -4340 -13948 -546 -5613 -15565 -14914 -24455 -17490 -3046 22605 19374 17802
16123 17802 -15398 -34328 -31627 -22986 -3965 332 5 -3740 -29733 -17809 -6412 -7534 -382
16110 -382 439 31548 41094 30876 11450 8404 31731 32253 12298 14449 21446 9248 19081 20329
16096 20329 -3338 -34346 -48015 -29566 -12698 -3635 -6580 3437 12964 29880 32901 50129
16084 50129 26543 12430 9516 -9268 -18408 -3958 18689 105 -34456 -19714 -9891 -18308
16072 -18308 -7483 -7151 1265 12429 14825 -4802 -11112 -28297 -64576 -73611 -73420 -38820 -15855
16059 -15855 -19968 -27337 -14471 -10493 -54643 -39109 3388 22133 23708 -4358 -20241 -27049 -26839
16046 -26839 -4959 13345 5226 -1430 2327 1986 -1002 -5244 6627 -11056 -33732 -43663 -29076
16033b9076j3728k1686m384j05L11J5793L4829K2554k7107k0726L523k60L616
16020c6446m913J709L531J8809r690L061R663j0807K0798K1837M700q17R624k6017
16006E042j538j7336r539J4171j0244J9790r89l072l0220M513j086l900R674N698
15992a9036N409R462j873Q226o374k6269K422L4098J3922l4260K3276K9995M639
15979D3637J2187M590m252P17l99N446l796k6753p137j1695K0216p452l0520k7871
15965c3082K2593r360k2852J1122K6546k157k1609j2077l7964K8083K4894J4032
15953a1831k3736j2384J7812L7081J0503K3954J4716k131k21m8793j1193j3641
15941a9864J3437n108M515L647j999j2516P101L330q797K2208M042j9312j5745
$$ plain form
16033 -29076 -42804 -64490 -68874 -68979 -68668 -52875 -18046 4508 -22599 -43325 -39802 -40062 -36446
16020 -36446 -41359 -39650 -36119 -17310 -27000 -23939 -14276 -25083 -4285 17552 22252 21435 31059 5042
16006 5042 3504 -13832 -23371 -9200 -19444 346 -643 -3715 -33935 -29422 -30508 -34408 -24734 -19036
15992 -19036 -13627 -4165 -6038 2188 -4186 -30455 -28033 6065 19987 -14273 9003 38998 43637
15979 43637 55824 60414 56162 56879 56480 61926 58130 31377 24240 12545 32761 25309 -5211 -33082
15965 -33082 -10489 -19849 -42701 -31579 -5033 -7190 -28799 -40876 -78840 -50757 -25863 -11831
15953 -11831 -35567 -47951 -30139 6942 17445 41399 56115 53984 53763 4970 -6223 -19864
15941 -19864 -6427 -11535 -7020 -3373 -5372 -17888 -10787 -7457 -16254 5954 9996 -9316 -25061
15928b5061j7619m669N975J5927K632q602J0640K3314k333j8629j2735R06J2818
15915a7436K650j0540L5916K3747R233j2668j1277j2846j6060j2623n249k0659
15903d7812J3474r487J2995K1508P588m100M986J9512l386k4008k1330j2167j1544
15890e3771k3552Q241j3840P234J5362Q507M7693R230k8579k5512j9563M3222
15878b5328M6457J8790m23j1887m1485k2231J1434J5657l911j9410L011K5880
15866c446j7800k454O35n964k7990R476K5222j2740J0038j1507j2449J9988M8158
15853A9167J5615q123j0859l088o531k5607j3928J1186n269r639N505p608L2315
15840f864J6547O755j0462m593o395j9466l0652K8714J5151j3029p197J3685p720
$$ plain form
15928 -25061 -42680 -47349 -41374 -25447 -22815 -31417 -20777 2537 204 -18425 -31160 -30254 -17436
15915 -17436 -14786 -25326 10590 34337 43570 30902 19625 6779 -9281 -21904 -27153 -47812
15903 -47812 -34338 -43825 -30830 -9322 -1734 -5834 -848 18664 15278 -8730 -30060 -42227 -53771
15890 -53771 -77323 -69082 -82922 -75688 -60326 -51819 -4126 5104 -23475 -48987 -68550 -25328
15878 -25328 21129 39919 39496 27609 -13876 -36107 -24673 -9016 -12927 -32337 -29326 -3446
15866 -3446 -21246 -23700 -23065 -29029 -57019 -47543 -22321 -35061 -25023 -36530 -48979 -28991 19167
15853 19167 34782 26659 15800 12712 6181 -19426 -33354 -22168 -27437 -37076 -31571 -39179 -6864
15840 -6864 9683 16438 5976 1383 -5012 -24478 -55130 -26416 -11265 -24294 -31491 -17806 -25526
15827b5526K8617M882k0659j1078N994p364J98J0889q414j247o129K3362J4496
15814H021k7860k3559M7322J7617j8611l7493J043J1314o599l409J3183L095L6002
15801B0066K619k0261J1786J9629k146J454K549P248K664j9586J5071o703K116
15788C6506p679k8577j9388j3383K0597J4548k3537j2488J0747n250l5908P742
15776e6070j050L0927K0757K0234j2637j5751j4244j7381J0406K4891J8691K0208
15764B8981j2731o315q687L713o308J9537K7529p083j4477o806j1846o45j9818
15751a4956N528l170j3521O970l979L529K4300J3957J8140k4397k0593O108J1641
15738I557J6325n061N954K6276k7032n361J8606p675q489K0780K6390L907k7131
$$ plain form
15827 -25526 3091 7973 -12686 -23764 -17770 -25134 -24936 -14047 -22461 -23708 -29837 -6475 8021
15814 8021 -19839 -43398 3924 21541 2930 -34563 -33520 -22206 -28805 -32214 -19031 -15936 20066
15801 20066 22685 2424 14210 33839 31693 33147 35696 42944 45608 26022 41093 34390 36506
15788 36506 28827 250 -19138 -32521 -11924 2624 -20913 -33401 -22654 -27904 -63812 -56070
15776 -56070 -57120 -26193 -5436 14798 2161 -13590 -27834 -45215 -34809 -9918 8773 28981
15764 28981 16250 9935 1248 4961 -1347 18190 45719 38636 24159 17353 5507 4862 -14956
15751 -14956 -9428 -12598 -26119 -19149 -23128 -19599 4701 18658 36798 12401 -8192 -2084 9557
15738 9557 25882 20821 26775 53051 26019 20658 39264 31589 23100 43880 70270 74177 47046
15725D7046m5082l585J7388O13J0777j0868j202j5107k2776p724J9689K1632K079
15712A2880n497j1724j4189j3693k493K3325K7544J8428N968j4188J0760k300
15700C4821k3222j8671j1357p733P93J1611K582j1513M6252j1695m3954j9812
15688e1898K7725N125k9076J21K1419j7714j9880J7967P824J5674Q921K0574L750
15675A0532O963k949j4283j3929K2836O536r457j56n070j7070k9214j2542K334
15662e5469J8401l176M155J2556J8495K2897j4120j8099j0628J1291M1146j4809
15650A2640k3105J6843J4071j2618O891L0177k6659k3614o794m876P198l430j1754
15637b5030J2790L4152J9484k1193l061J5499k4876l4262j2570P041R117j148
$$ plain form
15725 47046 1964 -1621 15767 16380 27157 16289 15087 -20 -22796 -30520 -10831 10801 12880
15712 12880 7383 -4341 -18530 -32223 -34716 -11391 16153 34581 40549 26361 37121 34821
15700 34821 11599 -7072 -18429 -26162 -25369 -13758 -11176 -22689 23563 11868 -32086 -51898
15688 -51898 -24173 -19048 -48124 -48003 -26584 -44298 -64178 -46211 -38387 -22713 -13792 6782 10532
15675 10532 17495 14546 263 -13666 9170 15706 6249 6093 1023 -16047 -45261 -57803 -55469
15662 -55469 -37068 -40244 -36089 -23533 -5038 17859 3739 -14360 -24988 -13697 27449 12640
15650 12640 -10465 6378 20449 7831 14722 44899 18240 -5374 -12168 -17044 -9846 -13276 -25030
15637 -25030 -12240 21912 41396 20203 17142 32641 7765 -26497 -39067 -32026 -22909 -24057
15625b4057r254k4092j969L6364K6445k2208l9296k7139L0712J1085k5919K846
15613f6482M0046j3049R893K2541L594o080j4773k7161k918j8172M7571K1010
15601c980N682J4451Q454r144n835J8955k226j2736O518j8827k1826k2078J746
15588d0846L209L342M9721N2826Q872j2151k998J4503j4913k9587O364J2647j28
15575E0861m5887l0543j7462Q392M0764l476J30Q495l2733j1276j531J9233j6339
15562c1372l3152M766J3649L5579K04n392j7727K3473K9263n881o653j8287k9092
15549d0622k4366J4477o067K2710L0826R616q270J1756O57m1038J2610L2104N882
15536B0275j6615j632m1089j581N779L1685J7665k0581j407N407j0340k4217m126
$$ plain form
15625 -24057 -33311 -57403 -59372 -23008 3437 -18771 -58067 -85206 -54494 -43409 -69328 -66482
15613 -66482 -26436 -39485 -29592 -7051 -3457 -9537 -24310 -51471 -54389 -72561 -24990 -3980
15601 -3980 1702 16153 24607 15463 9628 28583 26357 13621 20139 1312 -20514 -42592 -40846
15588 -40846 -37637 -34295 15426 68252 77124 64973 61975 76478 61565 31978 38342 50989 50861
15575 50861 4974 -25569 -43031 -34639 6125 2649 2779 11274 -21459 -32735 -34266 -15033 -31372
15562 -31372 -64524 -59758 -46109 -10530 -10326 -15718 -33445 -9972 19291 13410 6757 -11530 -40622
15549 -40622 -64988 -50511 -56578 -33868 -3042 6574 -1696 10060 10717 -30321 -17711 14393 20275
15536 20275 3660 2028 -39061 -40642 -34863 -3178 14487 -6094 -7501 -2094 -12434 -36651 -40777
15523d0777k2996J1411p592K6508L4715M209k1839j0641J1161J6692q515K2829
15511A5165r210k4963k111K6804J0449o075O434J6415K1764j7274k2372k0235
15499e209k2213m185K5994p001Q242j0347m0846k6429L1270J369J5400L9087R123
15486A4255P842k70k5432j7969l8857k9884m35K5647L4175K3973k2582O242K9303
15473F008L3442k290k6979p940P530r002M333L5858J2216J754j3973r946j7701
15460A3310J104J2423R033m297k9521j5657r404M6940P562j7564l5690j1559K0892
15447a2428J0093n638j7576J8092J9620n866J6611J6196k8671j8167K1631R346
15435B3243j2225k1930J2508J4263j4935l5930j0823q382L5266K8934K8156J2303
$$ plain form
15523 -40777 -63773 -52362 -59954 -33446 1269 5478 -16361 -27002 -15841 851 -7664 15165
15511 15165 5955 -19008 -21119 5685 16134 10059 16493 32908 54672 37398 15026 -5209
15499 -5209 -27422 -31607 -5613 -12614 -4372 -14719 -55565 -81994 -50724 -49355 -33955 5132 14255
15486 14255 22097 21827 -3605 -21574 -60431 -90315 -90750 -65103 -30928 -6955 -29537 -23295 6008
15473 6008 39450 37160 10181 2241 9771 769 5102 40960 53176 54930 40957 31011 13310
15460 13310 14414 26837 35870 31573 2052 -13605 -23009 23931 31493 13929 -21761 -33320 -12428
15447 -12428 -2335 -7973 -25549 -7457 12163 6297 22908 39104 10433 -7734 13897 23243
15435 23243 11018 -10912 1596 15859 924 -35006 -45829 -54211 -18945 9989 38145 50448
15423E0448n3190j0108N06k5046O880n39j2049J755L7007J1223j1156J9204J7919
15410C2854k259j7374k5223R536L41q683m377j0977k0380j1560M633K5456O707
15397b1306J2031r208j232l385k0135j1650k585L3768L1982O209k2310K0417j3591
15384i95J438P895q983l1380J3664N407J4721M498k217m255k6164Q400J5103N481
15370B613k1042l0918K4212J7082J8449R101m776k2604J362j6563M428j0826J7337
15357a2145K2756Q469n693j9638J4359K5569J966k1196k8760k3677N745o551N7211
15344A8415K3011J6977k931n278k3916k3120k9576l3453K9638L2518k3137j0946
15332c1798M1564l41j0925n48j4848j359J9494n573r923M259j4472P054r738L1110
$$ plain form
15423 50448 -2742 -12850 -12344 -37390 -30510 -31049 -43098 -41343 -4336 6887 -4269 14935 32854
15410 32854 30595 13221 -12002 -2466 -2125 -10808 -15185 -26162 -46542 -58102 -53469 -28013 -21306
15397 -21306 -9275 -18483 -19715 -23100 -43235 -54885 -57470 -23702 8280 14489 -7821 12596 -995
15384 -995 443 8338 -645 -32025 -18361 -12954 1767 6265 4048 -207 -26371 -17971 -2868 2613
15370 2613 -18429 -49347 -25135 -8053 10396 19497 14721 -7883 -6521 -23084 -18656 -29482 -12145
15357 -12145 10611 19080 13387 -6251 8108 33677 35643 14447 -14313 -37990 -32245 -38796 18415
15344 18415 41426 58403 55472 50194 26278 3158 -26418 -59871 -30233 2285 -20852 -31798
15332 -31798 9766 9425 -1500 -2048 -16896 -18255 1239 -4334 -14257 -9998 -24470 -17416 -27154 3956
15318C956J4530k896K5960Q656l0543l7080M816J2566K107k788L703n711N595
15305B871l184K877p757P643K1786j6360J891O568K433j7534n838R560J3610J2729
15291C1295k340k0586k0178p268O006k6639J1474K8228j149j096L662J948j8510
15278a5153M538K2559J3757k113M735l654j4330j6730q63n364n423j86J6086K3656
15264B1515l0304k905m707K111l765J3779k0790L1947Q222J4964J1586K2890J4225
15251G8768k4463j6760K84j0862j6358r226m137O749j9037k554k0902K568K5126
15238a0804L3952K7523K5029Q78m1594m7761l2888J6065K9636J2753P065K9307
15226D9161j8928j2324R596p685K645p513j2372k208j0503K7192J7028j5875j0212
$$ plain form
15318 3956 18486 15590 41550 50206 19663 -17417 -12601 -35 2072 -716 2987 -2724 2871
15305 2871 -313 2564 -5193 2450 24236 7876 9767 16335 18768 1234 -4604 4956 18566 31295
15291 31295 28955 8369 -11809 -19077 -13071 -39710 -28236 -8 -1157 -2253 1409 3357 -15153
15278 -15153 -10615 11944 25701 23588 28323 24669 10339 -6391 -7254 -12618 -18041 -18227 -2141 21515
15264 21515 -8789 -11694 -16401 -14290 -18055 -4276 -25066 6881 15103 30067 41653 64543 78768
15251 78768 54305 37545 37829 26967 10609 1383 -2754 3995 -15042 -17596 -38498 -35930 -10804
15238 -10804 23148 50671 75700 76578 34984 -12777 -45665 -29600 36 12789 19854 49161
15226 49161 30233 17909 27505 19820 22465 14952 2580 372 -10131 17061 34089 18214 8002
15213H002j3951j0890l1297k0739K2633K6787K2772N74j6611n552j4777J3979
15201a9070Q300M1896j6033j9856Q620J1268K650J2776l863j7787j4200o731j6851
15188b8881r447J1550O839K7667p410n458k0812L568J5412M5997o919j5149n76
15175A6381J8029J1672J2296L392n554j5777j855K423k0607l2941k9443J9285
15163b2699M4181N532m578l2109K1978O241j2995k176j1826k2011q477J2779J7477
15150h683J8697k3712O134M2089M4604P25k3789J9806o985l0101J2252M341K596
15137E7974o593l136j9451k6959r915J0848R735Q574m241J2552k1734k7496L2075
15124A2233j5927M838M6245O87n786J4711n747K9497P7220Q7145J27137J80975
$$ plain form
15213 8002 -5949 -16839 -48136 -68875 -46242 -19455 3317 3891 -12720 -18272 -33049 -19070
15201 -19070 -10770 31126 15093 -4763 3857 15125 17775 30551 26688 8901 -5299 -12030 -28881
15188 -28881 -38328 -26778 -19939 7728 318 -5140 -25952 -22384 -6972 39025 32106 16957 16381
15175 16381 34410 46082 58378 61770 56216 40439 38584 41007 20400 -12541 -41984 -22699
15163 -22699 21482 27014 22436 -9673 12305 18546 5551 3375 -8451 -30462 -38939 -26160 -8683
15150 -8683 10014 -13698 -7564 34525 79129 79854 56065 75871 68886 38785 51037 55378 57974
15137 57974 51381 48245 28794 1835 -8080 2768 12503 21077 16836 29388 7654 -19842 12233
15124 12233 -3694 1144 47389 48076 42290 57001 51254 80751 157971 245116 372253 553228
15112E53228P1394l3460j1002j28291j85255j11221m0686M573k8666k8715Q320
15101G0219k0198k0098J8547M722l370J4318Q756k2763m6360k3771P205J4357
15089A564J5105J6888J5189j7633O143j9280m52P145J9537q409j3011O21m615
15076A8792j2970N635J2586l9350l3655m13j3843K6300J9911j764j3498J4807
15064a7462N433o650L712J4808K4369m2244k5791M3347L1583p370j1794J7201
15052B9142k582K1833M037k0661j1577o467j3986K1910k567j9213k1100k2695
15040d3926Q537K6252j4023j5765K1707J5478K1648L5958J6371Q662l7315r540
15028C4044j1882k4553N860J0593k6766L605K6854J896k0342Q747R970n589k4783
$$ plain form
15112 553228 624622 591162 580160 451869 266614 155393 114707 119280 90614 61899 70219
15101 70219 50021 29923 48470 53192 49822 64140 72896 50133 3773 -19998 -12793 1564
15089 1564 16669 33557 48746 31113 37256 17976 17524 24669 44206 35797 22786 23407 18792
15076 18792 5822 11457 24043 -15307 -48962 -49375 -63218 -36918 -17007 -18771 -32269 -17462
15064 -17462 -12029 -18679 -14967 -159 24210 -18034 -43825 -478 31105 23735 11941 29142
15052 29142 26560 48393 52430 31769 20192 13725 -261 21649 19082 -131 -21231 -43926
15040 -43926 -35389 -9137 -23160 -38925 -17218 -1740 19908 55866 72237 80899 43584 34044
15028 34044 22162 -2391 3469 14062 -12704 -9099 17755 19651 -691 8056 18026 12437 -12346
15015a2346Q663L933K5348K2005j3719m9588l1561J8714K9938j9705j4720J3704
15003a9334J0197j4424n758r030m308J1509K540J9193L4759n358k166j0716k6892
14990a9788k024J3581p418j2971J3384J7010r035k3376l759N048o437k178J6381
14977b1582K5495J1665k078l778r445k3838J6057K0815N953r463O828R92k0470
14964b849J1037M0520K3349q067j0674j7301m474n528j6115P78k1610J5517J7932
14951B2515j2973q113J0059J801L0545J8795m220o844j7720m080o2r715J3135
14938C3123J5798m986k3995k5455P946L970L8353J2678j2026k7511n524p139k143
14925C089J1217P20l9503J0616K2356j5181j0969j6460l29K0383J1022J6734l278
$$ plain form
15015 -12346 -3683 250 25598 47603 33884 -15704 -47265 -28551 1387 -18318 -33038 -19334
15003 -19334 -9137 -23561 -29319 -38349 -42657 -31148 -28608 -9415 25344 19986 17820 7104 -19788
14990 -19788 -21812 -8231 -15649 -28620 -15236 1774 -7261 -30637 -34396 -29348 -35785 -37963 -21582
14977 -21582 3913 15578 13500 9722 277 -23561 -7504 13311 19264 9801 16629 17621 -2849
14964 -2849 8188 48708 72057 63990 53316 36015 31541 26013 9898 10676 -10934 4583 22515
14951 22515 9542 1429 11488 13289 43834 62629 58409 51565 33845 29765 29703 19988 33123
14938 33123 48921 43935 19940 -5515 2431 6401 44754 57432 45406 17895 12371 5232 3089
14925 3089 14306 15026 -24477 -13861 8495 -6686 -17655 -34115 -34444 -14061 -3039 13695 10417
14912A0417j1720l3669K8822J0448r947K985J7262K9430O400k9901q275R181L5568
14899E7001k212l3245l6468J2785m310K5059K9173N303j7780j3334k5766j0126
14887a3920R936j8124k273K5490J0897J1297K0349O992k3143k0158P089O855O631
14874B7918l3664k7817Q629L7277o150k4851k2338L583N0475N1769P379j3254
14862E8956j2392k0771j8788j8031j579k0202J1146K1587R698R322k0731j3238
14850a5023J5203j6332n986K1354j7667n095J4604L8578j2768k5032K1375J4624
14838B7835m0449l3087K5999K0739k108J6851L2597N431j9806j8307j9394k6226
14826b9925K8682M038L303l3371j3401M7819K561m8938l3429K4457L2806J8329
$$ plain form
14912 10417 -1303 -34972 -6150 4298 -5649 -2664 14598 44028 50428 20527 12252 21433 57001
14899 57001 54789 21544 -14924 -2139 -6449 18610 47783 53086 35306 21972 -3794 -13920
14887 -13920 -3984 -22108 -24381 1109 12006 23303 43652 50644 27501 7343 14432 21287 27918
14874 27918 -5746 -33563 -24934 12343 6193 -18658 -40996 -37413 13062 64831 72210 58956
14862 58956 46564 25793 7005 -11026 -12605 -32807 -21661 -74 9624 18946 -1785 -15023
14850 -15023 180 -16152 -22138 -784 -18451 -23546 -8942 29636 16868 -8164 13211 27835
14838 27835 -12614 -45701 -19702 1037 -1071 15780 48377 53808 34002 15695 -3699 -29925
14826 -29925 -1243 2795 6098 -27273 -40674 7145 9706 -39232 -72661 -48204 -15398 2931
14814B931j1347K6660J8527N647j954L534j7518k0231J4823j2626p781K8325k1135
14801G855j5657L6840K4769m1726J243n364J2816k6316M139J5970K0656J8848
14789E4073j4972j7708j6738K1972R66j261j3049K3293L1973j9063J1291J8426
14777G9203j1083l5074j4354k7163l8226m430k536K4839K6725J1320Q98P600J9265
14764C6984l5248k1705Q656P730k7421j447L9880K7905m383j3375k3752Q980J9187
14751B1991j2216l6176Q930p213J5736m652j3858P619m0607l613L998K1031K1744
14738a7286j4461l3203j5353J3926N256L3817O308Q404o670J2006K355j5880k3589
14725d4370j541J2713P108k5578J8612J4347K066L4133K3888l263l3717k988j086
$$ plain form
14814 2931 -8416 18244 36771 42418 40464 43998 26480 6249 21072 8446 665 28990 7855
14801 7855 -7802 29038 53807 12081 13324 7960 20776 -5540 -1401 14569 35225 54073
14789 54073 39101 21393 4655 26627 27593 26332 13283 36576 68549 49486 60777 79203
14777 79203 68120 33046 18692 -8471 -46697 -51127 -53663 -28824 -2099 9221 10119 17719 36984
14764 36984 1736 -19969 -11313 -3583 -31004 -32451 7429 35334 30951 17576 -6176 2804 21991
14751 21991 9775 -26401 -17471 -24684 -8948 -13600 -27458 -19839 -60446 -64059 -60061 -39030 -17286
14738 -17286 -31747 -64950 -80303 -66377 -61121 -27304 -20996 -12592 -19262 -7256 -4901 -20781 -44370
14725 -44370 -45911 -33198 -26090 -51668 -33056 -18709 -16643 17490 41378 38115 4398 1410 324
14712C24k8024J3913Q250k932J6276q320K3879J4322L861L173n271j9009q17k490
14698A7135l3696L3293O010J0925M898o212O684j0932k6914k2915J6747J4476
14686I499j2480K2282J3981k1745R545r890j0183J3192l0728J1430J3723p806
14674H20m990J3488J1125j3381l8146k852J5973J6598O330m162K3303R16o390
14661A8632J993R948r873j7590o675L7P031q60j8948j2270K1532J0003k470j3167
14647a2677k0206K957K7981M104j2771m762j1910k5841R693J9360K4904L7877
14635C8709J0769j1882J678K0824R169j5145m7868m2588j6100J0302J2449L2340
14623B657n19k2971j4320K021k6037J1940P661K5038m62m463J0727O896j2206
$$ plain form
14712 324 -27700 -13787 -5537 -8469 7807 -513 23366 37688 41549 44722 39451 20442 19625 17135
14698 17135 -16561 16732 22742 33667 38565 32353 39037 28105 1191 -21724 -4977 9499
14686 9499 -2981 19301 33282 11537 21082 11192 1009 14201 -16527 -5097 8626 820
14674 820 -4170 9318 20443 7062 -31084 -33936 -17963 -1365 4965 803 24106 25022 18632
14661 18632 20625 30573 20700 3110 -3565 -3528 3503 2643 -16305 -28575 -7043 2960 490 -12677
14647 -12677 -32883 -29926 -1945 2159 -10612 -15374 -27284 -53125 -43432 -24072 832 38709
14635 38709 49478 37596 39274 60098 69267 54122 6254 -36334 -52434 -42132 -29683 2657
14623 2657 2138 -20833 -35153 -33132 -59169 -47229 -39568 -14530 -14992 -19455 -8728 -1832 -14038
14610a4038J1142L2755J2936j0224p88q906q17N688j8259j8264K864K8366J5298
14597C7753K383n639q864J4260o967Q200J4854j3678k6882k2886l0441m8344L4518
14584e1733L5383J8007Q335l5878j8289K5941L2812L8029k0252m4000J4135M7630
14572E0120J2193q999l1196j9338l94n317J0141j4730o263J0300j397j295m645
14559a0820J1022O210J5398q280K3968p91j4651j7512j6806j2404K0719K3417
14547A9470K0698J0162l9964k3685K0523J6834k7473k2163R91p612N306j5742
14535d2655l778L3993K7925L2692L911L276n245j7148k6068j5518j0642j6262
14523c5519J0791M0768J3379j0790m128j5187j2451q046j256m379m314k046j0187
$$ plain form
14610 -14038 -2896 29859 42795 32571 31783 22877 22060 27748 9489 -8775 -5911 22455 37753
14597 37753 40136 34497 25633 39893 32926 41126 55980 42302 15420 -7466 -37907 -86251 -51733
14584 -51733 -16350 1657 9992 -25886 -44175 -18234 14578 52607 32355 -11645 2490 50120
14572 50120 62313 53314 22118 2780 2386 -2931 7210 -7520 -13783 -3483 -4880 -6175 -10820
14559 -10820 202 6412 21810 13530 37498 36707 22056 4544 -12262 -24666 -3947 19470
14547 19470 40168 50330 10366 -13319 7204 24038 -3435 -25598 -24607 -32219 -26913 -42655
14535 -42655 -46433 -12440 15485 48177 52088 55364 50119 32971 6903 -8615 -19257 -35519
14523 -35519 -24728 16040 29419 18629 14501 -686 -13137 -21183 -22439 -26818 -31132 -33178 -43365
14510d3365J0131J1105j1414k719K788k0284o445L5165K2585o204K5220R466k2990
14497C039k0911K2119p653N536K3677J335k2352j5283m015j3449K48K3532J3845
14484I668n541K8605J1414n031R795L435j795j6617m3301m111J7350R132j1040
14471A963m3585j6107M000K9430j5143K1228L3107n553j1612M741L5441K280J886
14458D2076j0200q642k2353M530j11P995N371J8133o84m4102j3734K5519k4496
14445b0698j9405J2934J2782J1658Q334K635L357J8610p974q737J1588P199J2112
14432D4395r284n4429l896L8734K5086k1423n3216l8638k029L2690K0579k9085
14420e0516k521J2143R728L2092J1287k1372p611J2254J7082j4036L7726K415
$$ plain form
14510 -43365 -33234 -22129 -33543 -36262 -33474 -53758 -60203 -25038 -2453 -8657 16563 26029 3039
14497 3039 -17872 4247 -3406 2130 25807 27142 4790 -10493 -14508 -27957 -27709 -4177 9668
14484 9668 4127 32732 44146 39115 48910 52345 50550 33933 -9368 -13479 3871 13003 1963
14471 1963 -41622 -57729 -53729 -24299 -39442 -18214 14893 9340 -2272 2469 37910 40190 42076
14458 42076 31876 23234 881 5411 5300 13295 18666 36799 36115 -7987 -21721 3798 -20698
14445 -20698 -40103 -27169 -14387 -2729 5605 8240 11597 30207 22233 13496 25084 32283 44395
14432 44395 35111 -19318 -23214 15520 40606 19183 -34033 -72671 -74700 -42010 -21431 -50516
14420 -50516 -53037 -40894 -31166 926 12213 -9159 -16770 -4516 12566 -1470 36256 38671
14408C8671m1265j2337P463J7455l343l108J0815L5095R415l9045l7912J2087
14396f009j9003r84K1923J591K586p526l6599K3361M5221O069j5920r275L8455
14383D3890J4261k7262m8967j7034M6482K1384j8711l880J0183j3797j2553K803
14371c201K4812O532O095M6456r769o422l6618n4876K431L040N17K8959J8394
14358B6350k3221l8413k7233K1806J7757M081J3622n599M599L9052Q894j0186
14346C1509n244k0J5118J773j4953k4940j7817O479P800J0428J0174k6105P871
14333B073K3442J7648k9158L807k5649m5100j0297L9164M9794K4224j3309n299
14321C1340Q752j6885j5760j5316j2616j0154J2112J3148j8810q12J3251j9457
$$ plain form
14408 38671 -2594 -14931 -7468 9987 6644 3536 14351 49446 58861 19816 -18096 -6009
14396 -6009 -25012 -25996 -4073 -2482 104 -7422 -44021 -20660 24561 30630 14710 5435 43890
14383 43890 58151 30889 -18078 -35112 11370 32754 14043 10163 20346 6549 -6004 -3201
14371 -3201 21611 28143 34238 80694 70925 64503 27885 -26991 -24560 -21520 -21003 7956 26350
14358 26350 3129 -35284 -62517 -40711 -22954 -18873 -5251 -10850 -6251 32801 41695 31509
14346 31509 26265 26245 41363 43136 28183 3243 -14574 -8095 -295 10133 20307 -5798 2073
14333 2073 25515 43163 14005 17812 -7837 -52937 -63234 -24070 25724 49948 36639 31340
14321 31340 40092 23207 7447 -7869 -20485 -30639 -18527 -5379 -24189 -25001 -11750 -31207
14309c1207R229J736j3973k162J8331L3141M662n488r362m357k3276m031K7850
14296A093M966l1746j1043q814j7667O328J7989l558j3439K4366O386L0891J4287
14283B0039O76q729r792Q063M807j4334n895K8214K7223k0170p660J5390K0455
14270E8287j2139l7270p885r7P948J5273K402j8117m685K3784j5138j6844J7843
14257A3362K975J1278R385J8442j4495k1068m060l0397m105L3372R439J0899j3348
14244B1679k1530j3255J2366L2073L286J153j0801p957K173K5883j6092k1151
14232G827m149j2156J654q588L3760M779l4121j8211N266j066m19j8008O314L3460
14218c658p099O712o869R534J4727K709J6327p603L824r011j1299j676L734p750
$$ plain form
14309 -31207 -21978 -20242 -34215 -36377 -18046 15095 19757 14269 4907 550 -22726 -26757 1093
14296 1093 6059 -25687 -36730 -45544 -63211 -56883 -38894 -42452 -55891 -31525 -25139 5752 20039
14283 20039 20715 11986 2194 10257 15064 730 -5165 23049 50272 30102 22442 37832 58287
14270 58287 46148 8878 993 896 8844 24117 26519 8402 3717 27501 12363 -4481 13362
14257 13362 16337 27615 37000 55442 40947 19879 15819 -14578 -18683 14689 24128 35027 21679
14244 21679 149 -13106 -740 31333 34619 35772 24971 17014 19187 45070 28978 7827
14232 7827 3678 -8478 -6824 -15412 18348 23127 -10994 -29205 -23939 -25005 -25424 -43432 -37118 -3658
14218 -3658 -10757 -4045 -10914 -1380 13347 16056 32383 24780 28604 19593 8294 6618 10352 2602
14204B602j0325J211K075J9173n923k9056l378J9881L2366k515r233k2403p617
14191a3142K0983M7906m300l2388J8709n404n768R560K3416j2799j7386K299j1561
14178B0125K149K202K5349k187k0649k3483k2845Q377j3858j0453K413J5038K4694
14165F872N209j9535M351L340k910o550j2136J3905O111r602j4419K8275J1847
14152A4758P363O658q976j6335J3706J4501J6590M052o372j5863j8067l0604j0574
14139b9163j6533R550K707K3392M5278q124Q033M781l5263N077J1904p124j2950
14126A565j8630J9348R951j2971j3432J3771K5988j2913Q536r435J7732j7614
14114A1896r219O478j0284j4148L0502K7956K1908r227l0753l9462j216L44J8251
$$ plain form
14204 2602 -7723 -6512 -4437 14736 8813 -20243 -23621 -3740 28626 26111 16878 -5525 -13142
14191 -13142 7841 55747 51447 19059 37768 32364 26596 36156 59572 46773 29387 31686 20125
14178 20125 22274 24476 49825 47638 26989 3506 -19339 -10962 -24820 -35273 -32860 -17822 6872
14165 6872 12081 -7454 -3103 237 -2673 -9223 -21359 -7454 -1343 -10945 -25364 2911 14758
14152 14758 22121 28779 19803 3468 17174 31675 48265 52317 45945 30082 12015 -18589 -29163
14139 -29163 -45696 -36146 -33439 -10047 35231 27107 35140 39921 4658 9735 21639 14515 1565
14126 1565 -17065 2283 12234 -737 -14169 -398 25590 12677 21213 11778 29510 11896
14114 11896 2677 9155 -1129 -15277 15225 43181 65089 55862 25109 -14353 -15569 -15225 3026
14101C026K2151M282p284p517r647J151J8692J0909j5496p514m017j1945k7533
14088c0742L461l790J3426O931R642J1530J4914K96k1070l784m229M071J7113
14075A7769J9131l7479j4039K6322r416k8729J470K9277M2297M1943m577l0956
14063E3013k5432m099J2102J8934j2902k5059l2990J6733m827P984J1725P759
14051B2941J9614L0651j5707k7465K367j9028k7322j3764k0529q118J5541j8194
14039e9013J5823M2017L3290K7616J42m724J7472j8437r117J706q101k2454K5448
14026D1668J3883k7911r896p774L8p492j2849R556P581j8737J602J9955j5245
14013e621n117j137R149o640K618J3883j297J7976k5606l0111K0078L7322O103
$$ plain form
14101 3026 25177 29459 22175 14658 5011 6162 24854 35763 20267 12753 8736 -3209 -30742
14088 -30742 -27281 -31071 -17645 -10714 -1072 10458 25372 25668 4598 814 -3415 656 17769
14075 17769 36900 -579 -14618 11704 2288 -26441 -24971 4306 46603 88546 83969 53013
14063 53013 27581 23482 35584 54518 41616 16557 -16433 300 -4527 3457 15182 22941
14051 22941 42555 73206 57499 30034 32401 13373 -13949 -27713 -48242 -56360 -40819 -59013
14039 -59013 -43190 -1173 32117 59733 59875 55151 72623 54186 45069 46775 38674 16220 41668
14026 41668 55551 27640 17744 9970 10008 2516 -10333 -777 6804 -11933 -10331 9624 -5621
14013 -5621 -10738 -11875 -2726 -9366 -6748 7135 5838 23814 -1792 -31903 -11825 25497 31600
14000C1600l2235O884K4165N280j1380m572N539K9156j2886p435J5521l404J4093
13987F0326r237l2008n0312n669K6798j0419L2144J1036o580J1054k6340l3061
13975c2268j6370M984l285J6151L7224K6771j2712k7344J697j0860K86j8502J8640
13962a5588R939L244j5403l0539K2574K8561K217j3285O605O602N885j0742l265
13949c195L868J4406J778k8985k2699J5064L2212m619p77j5047j162q899N919
13936a2136L072R043K488j9741j2044K6655K8739q08O810r113j6631l1244M286
13923b0624J939JL867M3716L5703l4810M837L5903r166k6492j8839J29j1407k9596
13909b4839o516K650j77Q534Q2J5345N519J6395j165O748j0402q913j7178k534
$$ plain form
14000 31600 -635 6249 30414 35694 24314 19742 25281 54437 41551 34116 49637 46233 60326
13987 60326 51089 19081 -31231 -36900 -10102 -20521 11623 22659 16079 27133 793 -32268
13975 -32268 -48638 -43654 -46939 -30788 6436 33207 20495 -6849 -5152 -16012 -15726 -34228 -15588
13962 -15588 -5649 -2405 -17808 -48347 -25773 2788 5005 -8280 -1675 4927 10812 70 -3195
13949 -3195 673 15079 16857 -12128 -34827 -19763 12449 7830 7053 -7994 -9156 -18055 -12136
13936 -12136 -9064 -21 2467 -17274 -29318 -2663 26076 25268 32078 22965 6334 -24910 -20624
13923 -20624 -18685 -18684 -14817 28899 64602 29792 34629 70532 61366 34874 16035 16164 4757 -24839
13909 -24839 -31355 -28705 -28882 -20348 -20266 -4921 598 16993 15828 22576 12174 3261 -13917 -16451
13895a6451J1786K1012p145k4635J6938N08l479M758K9K4230n08m400j7017l677
13881A949p851K7173p968o555O178k23O032O223M781K958K9505J0493j9664j1250
13867D1781q905J4869N206k3647j8690k0056j9285K5181K7922l607o50j5199J7837
13854B2757l886J1601O205p668r652J1068J0746L613j7099k028p069k8546p016
13841a6974J0264r13P089Q06N133m448R922N315J468M562j7028m4351Q36K2185
13827a6134q433r770j2698K4559K1789J5819K2458O81l2589k4913J1219j4861
13815b2873K1063J4354k4205k6107k3166J0217L2120K1593K9782L137m277k1423
13803A0215j803L1686n247k610o221o916j551J1074j3473n065M103l3962J1791
$$ plain form
13895 -16451 -4665 16347 9202 -15433 1505 2013 -1466 3292 3321 27551 27043 22643 5626 1949
13881 1949 -5902 21271 13303 6748 12926 12703 18735 24958 29739 32697 62202 72695 53031 41781
13867 41781 32876 47745 52951 29304 10614 -9442 -28727 -3546 24376 20769 20119 4920 22757
13854 22757 18871 30472 36677 29009 19357 30425 41171 44784 27685 25657 18588 -9958 -16974
13841 -16974 -6710 -7623 -534 272 5405 957 10879 16194 17662 22224 5196 -39155 -38319 -16134
13827 -16134 -24567 -34337 -47035 -22476 -687 15132 37590 38271 5682 -19231 -8012 -22873
13815 -22873 -1810 12544 -11661 -37768 -60934 -50717 -18597 2996 32778 35915 31638 10215
13803 10215 8412 40098 34851 32241 26020 19104 17553 28627 15154 10089 14192 -19770 -7979
13790g979J2723K842k5235k2382L8465o040j352L1082Q294P644j6974r909k037
13777I142J59J9261J7988n2543J186Q973q69r455J0132J383r68K4401r808l0780
13763a1798k8366p138M66l7110O484J9586K0010O598K566J9100L1963q618k2025
13750h282L462O73O171j4977J802M590n908J2444L1451m871q372K5425k0594l622
13736A9392J8147J0350q03k3458k4044l880j0064o841L235K3274j2054j1374m0367
13723e8487J1664L8087M2759L357n1082j8725J5623K6473j175k564R32j5028q695
13710a6861j0003j1090L1366K9107K2593J0894k5045l356J8831p237n401j318
13698C2480k065j5610l8805q348M4023J6897l5088k8438P966J9051K1338L965
$$ plain form
13790 -7979 4744 7586 -17649 -40031 -1566 -7606 -8958 22124 30418 38062 21088 11179 9142
13777 9142 9301 28562 46550 -5993 -4807 4166 3297 -6158 3974 5357 4389 28790 18982 -11798
13763 -11798 -40164 -47302 -46836 -83946 -77462 -57876 -37866 -31268 -28702 -9602 22361 13743 -8282
13750 -8282 -4820 -4147 2024 -12953 -11151 -6561 -12469 -25 31426 26555 18183 43608 23014 19392
13736 19392 37539 47889 47086 23628 -416 -4296 -14360 -21201 -17966 5308 -6746 -18120 -58487
13723 -58487 -46823 -8736 34023 37380 -13702 -32427 -16804 9669 8494 5930 6862 -8166 -16861
13710 -16861 -26864 -37954 -6588 22519 45112 56006 30961 27605 46436 39199 33798 32480
13698 32480 30415 14805 -24000 -32348 11675 28572 -6516 -34954 -26988 -7937 13401 17366
13686A7366O452p682J3405L0049j5456k9770l74Q461q095J7059J0925J4296j4003
13673D2633k9680j2152L370n700L6540q90K113k3989L5551Q711l5940K3312J9516
13660F3395p763j8396l0639N570J6993J3276p076k6475M8L328K135l429j0092
13647H75J1063j9476K3061J1679j6878J1428j1116k8609J4101P192J2720o708
13635I332k307J4636p994k0222r669J154r301q208K1146J155q087P26k386L2353
13621A2328J7387J0927J5591q320q484J6053J115J05l2976l5489J4543J4178R010
13608B5968j5134K307L708K4015Q028k5889j153O246J9302L784j7910k5839k4644
13595a7211J6675J8627J7525j4398N516K3905J0336j669k3435J0157l5704j5974
$$ plain form
13686 17366 23818 16136 29541 59590 44134 14364 13990 22451 14356 31415 42340 56636 42633
13673 42633 12953 801 4171 -1529 35011 34121 36234 12245 47796 56507 20567 43879 63395
13660 63395 55632 37236 6597 12167 29160 42436 35360 8885 8933 12261 14396 10967 875
13647 875 11938 -7538 15523 27202 10324 21752 10636 -17973 -3872 3320 16040 9332
13635 9332 7025 21661 13667 -6555 -16224 -15070 -24371 -32579 -11433 -10278 -18365 -17639 -20025 12328
13621 12328 29715 40642 56233 47913 39429 55482 56597 56702 23726 -11763 2780 16958 25968
13608 25968 10834 13141 16849 40864 48892 23003 21850 28096 47398 51182 33272 7433 -17211
13595 -17211 -536 18091 35616 21218 26734 50639 60975 59306 35871 46028 10324 -5650
13583e650M0432R46j0960r385M596M46L935m360j6474J3200P087J760J428j382
13569B5619j8647n320N65K772j8183J3223K4754k4688k0164k01p355J7461L4915
13556B4751m927k3139R79J8857l541j1579k5902k6297k4790J7676J8878k415n850
13543d7299O913J2637J216j0703r755K2417J1070K0897o616K2215N276k4765k457
13530A046K2212L5088j4228k4493k0336k2020L282L222L7612R205k3686K003J1614
13517B0521k9517l1002k690J72N859N687K642L6522K2644j1411N631J6090j5008
13504B6140K1057J713J4571Q161j5788o397k5117R366K1551k4825k8719r951j1007
13491a9245K3292P796O197j8405Q457J2509n796j6804J0100j4275k485r397J3298
$$ plain form
13583 -5650 34782 35728 24768 15383 19979 20425 24360 20000 3526 16726 23813 25573 27001 25619
13569 25619 6972 1652 2217 4989 -13194 29 24783 95 -20069 -20270 -27625 -10164 24751
13556 24751 19824 -3315 -2336 16521 12980 1401 -24501 -50798 -75588 -57912 -39034 -41449 -47299
13543 -47299 -40386 -27749 -26533 -37236 -46991 -24574 -13504 7393 777 22992 28268 3503 1046
13530 1046 23258 58346 44118 19625 -711 -22731 -19449 -16227 21385 30590 6904 8907 20521
13517 20521 -8996 -39998 -42688 -42516 -36657 -30970 -28328 8194 30838 19427 25058 41148 26140
13504 26140 47197 48910 63481 71642 55854 49457 24340 33706 55257 30432 1713 -8238 -19245
13491 -19245 4047 11843 18040 -365 8092 20601 14805 -1999 8101 -6174 -8659 -18056 -4758
13478d758m200l0603K5850P426J0505K1095p331j9113K4509J2994j4174j5725
13466F475L087q738k172K5675M344m489J2782o366k9228n085p635J108n204k915
13452a8361j7115J3331L3711J9666M599n749K735M37N192k4657N359m667K012
13439A6493M626l84j6964l38l985J139J0304k3714k6896K739L8861l990k1442
13426b3551j5809M700J7308J1132Q113J1590J3109L9343j5151j3791l5518k3023
13414b1548J4822O299r825K95q582M0153J1461l1627j4738l598N767J4644P48
13401D271j9154m788q377j4523n131k168K5333J701J312k729j2908M412L198J7317
13387a2234L4906K2531k0005p269k29j1870k3377J5860l506R076p59k6814J009
$$ plain form
13478 -4758 -8958 -39561 -13711 -6285 4220 25315 17984 -1129 23380 36374 22200 6475
13466 6475 9562 824 -1348 24327 28671 24182 36964 30598 1370 -3715 -11350 -10242 -15446 -18361
13452 -18361 -35476 -22145 11566 31232 35831 30082 32817 33254 38446 13789 19148 14481 16493
13439 16493 21119 20735 3771 3433 -552 587 10891 -12823 -39719 -36980 1881 -2109 -23551
13426 -23551 -39360 -34660 -17352 -6220 1893 13483 26592 65935 50784 36993 1475 -21548
13414 -21548 -6726 -427 -10252 -9957 -18539 21614 33075 1448 -13290 -16888 -11121 3523 4271
13401 4271 -14883 -19671 -28048 -42571 -47702 -49870 -24537 -22836 -21524 -24253 -37161 -32749 -29551 -12234
13387 -12234 22672 45203 25198 17929 17700 5830 -17547 -1687 -5193 3883 3124 -23690 -22681
13374b2681m3O166J3648J6494n858k7189j0795Q576K0082J6118j2275N687J6291
13361B4221j2695j4756K1201K7437N600k1877k9306r607j8222J0599O377n796
13349a6824o022j0518j1605R785K3292J5857P112k4716k2767L1084L7573Q426
13337D0677M587Q99k4956q016J0005j8967K6872j3216n2800j5139R281K5751J6709
13324A687p777J0160p592k2376N468J3131J9454j3695k1521J1847L148L5397P489
13311C4820k4386k4669j2227N102L0039k6145j983J2035q57j6522K3362J7085
13299A5654j8320j321k210l138n367k9085j292K0122j0520N820J9064J1057K497
13286B961q150j2904m045K4962N228j9035K5748K5877J351j7565m7120J6816K7616
$$ plain form
13374 -22681 -22724 -16558 -2910 13584 7726 -19463 -30258 -21682 -1600 14518 2243 7930 24221
13361 24221 11526 -3230 17971 45408 51008 29131 -175 -9782 -28004 -17405 -11028 -16824
13349 -16824 -22846 -33364 -44969 -35184 -11892 3965 11077 -13639 -36406 -5322 32251 40677
13337 40677 45264 46163 21207 13191 23196 4229 31101 17885 -34915 -50054 -40773 -15022 1687
13324 1687 -6090 4070 -3522 -25898 -20430 -7299 12155 -1540 -23061 -11214 -8066 27331 34820
13311 34820 10434 -14235 -26462 -21360 8679 -17466 -19449 -7414 -8271 -24793 -1431 15654
13299 15654 -2666 -3987 -6197 -9335 -14702 -43787 -45079 -24957 -35477 -29657 -10593 464 2961
13286 2961 -5189 -18093 -22138 2824 8052 -10983 14765 40642 41993 24428 -22692 -5876 21740
13273B1740k3170k6242J8604j4953J5869J6397m210m811K0339J8205j0875l0182
13261c289k0337J6555K3643K2636o885R05l688j1335k931J0687m372p329m1379
13248b7119J3428K6220m617n965j4510p10J2063P576n363J2481q146m648J533
13235B223n607r679J7021j3809j3906J1478J4991O108r032j3859r179J0523L5400
13222B2673J5766o662k7263j7219j5853O704O237J5918J2170P996P995J8697j0450
13209C6709k3849l8437K577O600J4345M4685K981k1580k4890l1461o987O0519
13197B1212L6636o785K046l927j7999k4006K447L204q375j3804J6336j2702k3745
13184b9462o080R218L0367J9243M77l2025J4183J6391k8203l2306N36M417K7491
$$ plain form
13273 21740 -1430 -27672 -9068 -24021 -8152 8245 4035 -776 19563 37768 26893 -3289
13261 -3289 -23626 -7071 16572 39208 32323 33228 29540 18205 15274 25961 21589 14260 -27119
13248 -27119 -13691 12529 7912 1947 -12563 -13273 -1210 6366 1003 13484 5338 690 2223
13235 2223 -3384 -13063 3958 -9851 -23757 -12279 2712 8820 -212 -14071 -23250 -12727 22673
13222 22673 38439 31777 4514 -12705 -28558 -21854 -15617 301 12471 20467 28462 47159 36709
13209 36709 12860 -25577 -23000 -16400 -2055 42630 45611 24031 -859 -32320 -39307 21212
13197 21212 57848 51063 53109 49182 31183 7177 9624 12828 4453 -9351 6985 -5717 -29462
13184 -29462 -35542 -26324 4043 23286 23763 -8262 5921 22312 -5891 -38197 -37661 -33244 -5753
13171e753l027j8236J049M175J9915K2616j6233j2920L8162J0752m0560j117l049
13158d226K1498k3447o08M650R289J767k5624n046K728K0137J4892n952R750j2196
13144G612J3666L719p483k2015L652l15O906J2517P867l048K35k2013k104O291
13130E487j5469K610k1886r193r615J4525L7546J4200l734k33M369L3338j9711
13117C2234l7928l3915J8854K5568K3407R35j6519J2523J2671j3633n14J1037
13105C4720j1578r708J0652j2005j8952j2856k00j6201K5633K4783j7769k2175
13093b5656j1260J1617K3355O388J4196j0916p059r970J657j255L786J9350o639
13080G594j3771j0136p701K5280M0602n3l568n023n253k2345m7354L1231M783
$$ plain form
13171 -5753 -8780 -27016 -25967 -21792 -1877 20739 4506 -8414 29748 40500 -60 -1177 -4226
13158 -4226 17272 -6175 -6783 -2133 7156 8923 -16701 -21747 -19019 1118 16010 10058 19808 7612
13144 7612 21278 24997 17514 -4501 -849 -1164 5742 18259 26126 23078 23313 1300 -804 5487
13130 5487 -9982 -7372 -29258 -38451 -48066 -33541 4005 18205 14471 14238 18607 51945 32234
13117 32234 -5694 -39609 -20755 4813 28220 29155 12636 25159 37830 24197 23683 34720
13105 34720 23142 13434 24086 12081 -6871 -19727 -19927 -36128 -10495 14288 -3481 -25656
13093 -25656 -36916 -25299 -1944 4444 18640 7724 665 -9305 -7648 -8903 -5117 14233 7594
13080 7594 -6177 -16313 -24014 1266 41868 41815 38247 33224 27971 5626 -41728 -10497 -5714
13067e714J675P857q734J129L3437k6768K1255P485J4832p482J2667k4606l6034
13054i001k1488N657P25J1809N120j2947J6054J5303j8923J0832M484j8538q596
13041a9509q144j5977R130J0132J7640q305K0327j591j2141q371J189Q335K4700
13028A7415j655r829n386j9525j0933m818J1273K7066J9329j5783m2880P824O022
13015b1880p998M5776J9231p559j5787m299J7756j9467j0202o335R443J9813K352
13002B0844l009o845j877O21j4935K0562J9459p962j4665j4312J671J9333L2907
12989E1792k288k0114k5355j3300j9572j0624O582j6362J7729M168j0374J7967
12977a9751K4718L6744J3600k3575j9540q639j2505j9710K0762K9814M106j291
$$ plain form
13067 -5714 -4039 3818 -4916 -3787 29650 2882 24137 31622 46454 38972 51639 27033 -9001
13054 -9001 -30489 -24832 -24107 -12298 -7178 -20125 -4071 11232 -7691 3141 7625 -10913 -19509
13041 -19509 -27653 -43630 -34500 -24368 -6728 -15033 5294 3703 -8438 -16809 -15620 -7285 17415
13028 17415 15760 5931 545 -18980 -29913 -34731 -23458 3608 22937 7154 -35726 -27902 -21880
13015 -21880 -29878 15898 35129 27570 11783 7484 25240 5773 -4429 -10764 -1321 18492 20844
13002 20844 17835 10990 9113 9734 -5201 15361 34820 26858 12193 -2119 -448 18885 51792
12989 51792 49504 29390 4035 -9265 -28837 -39461 -32879 -49241 -31512 -27344 -37718 -19751
12977 -19751 4967 41711 55311 31736 12196 3557 -8948 -28658 -7896 21918 26024 24733
12965B4733M212j6149l0K4762n837n443P645j4871j7298J2625m785q679j6703
12952a5818j0521j0866q287j1396M536M226J1478J0818q302m343J1402K7099k7318
12939b7292J2766J8201n249q909n94P969l084J9056J5008r45j06o68o865J5872
12925C5160K5264l416k8206m613m875k4097M063n619N237r906q447k4022P940
12912c5537K7025M0597P945j5215J0080k74j4426j1591j6451L893K0224J3458
12900B9728J8488O877k2901j6356P179L5131m824o753j8744m1191K507J6756M397
12887A0294J698Q171O150K1741o695l4543l310K3746L6002j9009j201J0514j9302
12874C4256K264P600l3245l3635k7717K0114M278J5623M254M506p893j1304J3638
$$ plain form
12965 24733 28945 12796 12766 37528 31691 26248 33893 19022 1724 14349 9564 885 -15818
12952 -15818 -26339 -37205 -45492 -56888 -52352 -48126 -36648 -25830 -34132 -38475 -27073 26 -27292
12939 -27292 -14526 3675 -1574 -10483 -11077 -3108 -6192 12864 27872 26927 26821 26153 19288 35160
12925 35160 60424 57008 28802 24189 19314 -4783 -720 -6339 -1102 -11008 -19455 -43477 -35537
12912 -35537 -8512 32085 40030 24815 34895 34621 20195 8604 -7847 -3954 16270 29728
12900 29728 48216 55093 32192 15836 23015 58146 53322 46569 27825 -13366 -10859 5897 10294
12887 10294 11992 20163 26313 48054 41359 6816 3506 27252 63254 44245 43044 53558 34256
12874 34256 36520 44120 10875 -22760 -50477 -30363 -26085 -10462 -6208 -1702 -9595 -20899 -7261
12861g261J867j4999Q856J3718J354k2159Q872k053o009Q783J6472J1004r630
12848H815k1929j4834j1537K64L66r261o608J1228M4532L5128N048K660l3699
12835A0173l7176L0964L730K5306L599k8963p098J0109J3852r095l9652l2413
12823e6664R076J8446L2363K5118k7532l4013P539O666N794k2027J7776K2274
12811D816K6264j7123l2594J801M1593j6794j5041k8599l3264L2818N1273q406
12799F744j5463J7295l879l7984q5N759N329j1084j5412K3299M2917K3867K4212
12786F5515j7464n5936j642J7862J2709K954P661l910k814Q036K0364k4207l6727
12773g599J557J6399K2514J558r521l0184K676M937n382l1078k012K2761R702
$$ plain form
12861 -7261 -5394 -20393 -11537 2181 3535 -18624 -9752 -11805 -17814 -9031 7441 18445 8815
12848 8815 -13114 -27948 -39485 -39221 -38855 -48116 -54724 -43496 1036 36164 41212 43872 10173
12835 10173 -27003 3961 7691 32997 36596 7633 535 10644 24496 15401 -24251 -56664
12823 -56664 -47588 -29142 3221 28339 807 -33206 -25667 -19001 -13207 -35234 -17458 4816
12811 4816 31080 13957 -18637 -16836 24757 7963 -7078 -35677 -68941 -36123 15150 6744
12799 6744 -8719 8576 4697 -33287 -33372 -27613 -22284 -33368 -48780 -25481 17436 41303 65515
12786 65515 48051 -7885 -9527 8335 21044 23998 31659 27749 24935 32971 53335 29128 -7599
12773 -7599 -6042 10357 32871 34429 24908 -5276 -2600 2337 -3045 -34123 -36135 -13374 -3672
12760c672M018p370J3351K2819k1050j6043P504L0043j388j816j5902j029m522
12747D943j8298K7072J4474N694N443R469k3899P959j1835r150j7778n079R909
12734a076J0169J9817J0134m0306j4087K343j689O440N839J8821J3065k304m4
12721B7122j8420l115r128P435j0468L626L2615Q164n19J6167r329p91k934o044
12707C4381j5155M412N087j9675m1693J2888J8287k0569j05J9351Q111m976l8723
12694c8379o648K2180N329J5686J6332O515j9924m0662K6303L1440j563k3698
12682g089M936J2360l584J7223J0057q8k2448l2981J0179J610L5O970p00j0555
12668a4075m0810j5397L592L2362K2001L0409n37j271J1679l1352l1778k6231
$$ plain form
12760 -3672 346 -7024 6327 29146 8096 -7947 -443 29600 28212 26396 10494 9465 4943
12747 4943 -13355 13717 28191 33885 39328 48797 24898 32857 21022 11872 -5906 -10985 -1076
12734 -1076 9093 28910 39044 -1262 -15349 -13006 -14695 -8255 -2416 16405 29470 27166 27122
12721 27122 8702 5587 -3541 3894 -6574 -2948 29667 37831 37312 53479 44150 43359 40425 34381
12707 34381 19226 23638 28725 9050 -32643 -19755 -1468 -22037 -22142 -2791 5320 344 -38379
12694 -38379 -45027 -22847 -17518 -1832 14500 21015 1091 -39571 -13268 18172 16609 -7089
12682 -7089 -2153 10207 6623 23846 33903 33815 11367 -21614 -11435 -9825 -9790 -2820 -3520 -14075
12668 -14075 -54885 -70282 -66690 -34328 -12327 18082 17545 16274 27953 -3399 -35177 -61408
12656f1408K0469j871j141M8115L9207p595m8203l2076K3247P401l510m860J2710
12643i515O149K2542m659O719K6663n310j2973j8666n059K461k158K0691K1041
12630D7926q392l4623l383L096m3958K548K5908J2608j2307j2110k8481Q213M2551
12617d04l538K3295J6195p075j2409j2424Q345k5906k2159j2128L4252n281J6311
12604b926L0598J7656Q494k1204k0144N493J4593J5451p576k2983l2522J5148
12592G8k336k2066K0947K3828J4761J488N909j3622k8234j6071M3123k3307k5918
12579b1420J66K0362k0854J8118J473p582j118J0822j2189j2641J4041K5413j897
12566A2694k197k465J1484J2511j1266r297O064J1002P153l0909k1041K1740O845
$$ plain form
12656 -61408 -40939 -42810 -43951 4164 43371 35776 -12427 -44503 -21256 -13855 -17365 -22225 -9515
12643 -9515 -3366 19176 14517 21236 47899 42589 29616 10950 5891 8352 6194 26885 47926
12630 47926 39534 4911 1528 4624 -39334 -36786 -10878 1730 -10577 -22687 -51168 -42955 -404
12617 -404 -3942 19353 35548 28473 16064 3640 11985 -13921 -36080 -48208 -13956 -19237 -2926
12604 -2926 27672 45328 53822 32618 12474 17967 32560 48011 40435 17452 -15070 78
12592 78 -2258 -24324 -3377 20451 35212 36700 42609 28987 753 -15318 27805 4498 -21420
12579 -21420 -21254 -892 -21746 -3628 -2155 -9737 -10855 -33 -12222 -24863 -10822 14591 12694
12566 12694 10497 8032 19516 32027 20761 11464 17528 28530 35683 4774 -16267 5473 12318
12553A2318l5232J216K2097q218N246p493N329K0407n313k2055k31k7940r356
12540d9225Q019J3298J5098J7011N136K9219J4834l7428p187j8240k6605L6673
12528F03M0627k9164k9449K2796k5992L2641J9817P520j0010k5628k2910j819
12516b0968J0419J1184J704J184R351N569k1324p473L2022J2586L6910l1699j4922
12503B4543l0449n402J4797j8367n805L6429Q830J6368k4490k2008J2420K9895
12491C6761p008l1467J776J7256P463M966l0152j8367R73L053j8348J8364M3821
12478B9091p06k7766K737M1776J2064j2621J0598J5493m13k053q890r906l0333
12465A9071J326J9059p980P880j1466j1841p670j4902j5572j8767k1679L3185
$$ plain form
12553 12318 -22914 -21698 399 -7819 -2573 -10066 -4737 15670 10357 -11698 -11929 -39869 -49225
12540 -49225 -41206 -27908 -12810 4201 9337 38556 53390 15962 8775 -9465 -36070 603
12528 603 41230 12066 -17383 5413 -20579 12062 31879 39399 29389 3761 -19149 -20968
12516 -20968 -10549 635 2339 3523 12874 18443 -2881 -10354 21668 34254 71164 39465 24543
12503 24543 -5906 -11308 3489 -14878 -20683 15746 24576 40944 16454 -5554 6866 36761
12491 36761 29753 -1714 62 17318 24781 29747 -405 -18772 -17799 -14746 -33094 -14730 29091
12478 29091 28385 619 3356 45132 57196 44575 55173 70666 70253 68200 59310 49404 19071
12465 19071 20397 39456 31476 39356 27890 16049 8379 -6523 -22095 -40862 -62541 -29356
12453b9356K8619Q105K3585J7541j0829k4658n553O670o908j6569M186M772J3553
12440A3158K7635J1104j5377k1244j2651J4570M705K1057j2107j7331M290Q743
12428B6552K0713K335j6J1102j5363l1950l4397l6563J6984L0236K6918l3164
12416a6613O689Q354J1278o618J5583M006J2271J2146J3383j1543p933r043j5657
12403A6303p024L062j3389j3303J6643K2247J2288j3243R189k1922q420J6310
12391A8741K4517j8564l2521q655J3294p440q52J0801K367r971p69j3968J2614
12378a0406O083r683r964p708K2361O698M137j8545L879k928K02J1990J8582o636
12364H062J2685k8185j1818K563J7023L1681j0269k993k0374l3727k054K6174
$$ plain form
12453 -29356 -737 7368 30953 48494 37665 13007 7454 14124 7216 -9353 -5167 -395 13158
12440 13158 40793 51897 36520 15276 2625 17195 21900 42957 30850 13519 17809 26552
12428 26552 47265 49600 49584 60686 45323 13373 -21024 -57587 -40603 -10367 16551 -16613
12416 -16613 -9924 -1570 9708 3090 18673 22679 34950 47096 60479 48936 41003 31960 16303
12403 16303 9279 12341 -1048 -14351 2292 24539 36827 23584 32773 10851 2431 18741
12391 18741 43258 24694 -7827 -16482 -3188 -10628 -11480 -679 1688 -8283 -9052 -23020 -10406
12378 -10406 -4323 -14006 -23970 -31678 -9317 -2619 1518 -17027 -13148 -16076 -15874 -3884 14698 8062
12364 8062 20747 -7438 -19256 -16693 330 32011 21742 18749 -1625 -35352 -37406 -11232
12352a1232K600K4892J1550k5937k0893k1092j4L2438J9463j916J0445K170r590
12339A2884j4869o729J7155R814R126K856m0079q834O435l347K0447J7122L347
12326B5328j0915j2093l4898J0913N0794J2325o893j2381p433J632J5081k3911
12314G549j5160j5510O473J0541M566j5480J3908K3418M438K917j4236N142n836
12301A2730J850k1696k2795L3313J026k1548K8978J7465J0684m798l3723l1320
12289b9834K5313J1504J41K1010J1426J346J75o365j457k3740r90K3334q72j3167
12275A7824L01L352P641j1303m153k2254q884J3233Q214k2823J1036j0079J7056
12262h39O912p116P170j2676j4865j3861q838L970K3470J3646N87m121j3746J875
$$ plain form
12352 -11232 -8632 16260 27810 1873 -19020 -40112 -40126 -7688 11775 9859 20304 22474 12884
12339 12884 -1985 -8714 8441 18255 27381 30237 -9842 -18676 -12241 -15588 4859 21981 25328
12326 25328 14413 2320 -32578 -21665 29129 41454 34561 22180 14747 16379 31460 7549
12314 7549 -7611 -23121 -16648 -6107 -1541 -17021 -3113 20305 24743 27660 13424 18566 12730
12301 12730 14580 -7116 -29911 3402 4428 -17120 11858 29323 40007 35209 1486 -29834
12289 -29834 -4521 6983 7124 28134 39560 40906 41081 34716 33259 9519 8529 31863 30991 17824
12275 17824 18125 21477 29118 17815 13662 -8592 -17476 -4243 3971 -18852 -7816 -17895 -839
12262 -839 6073 -1043 6127 -6549 -21414 -35275 -44113 -40143 -16673 -3027 -2440 -6561 -20307 -18432
12248a8432J7323o983j631j4305J6928J0200P664M217l7913j7362m996l751K0754
12235b8287L2844n459l1586q181K7625K1187J7968j1387J2066N291q883N161P04
12222B9063j6176j0132o867J4022P627j243O47J8226j7866k0695l8674J0962N8378
12209B7272J6654l9758k8338l712q557K7747K5374J7143o251k4589j7168K1616
12197G433m629J401j4860M291J1968j9175l050k62o076k359O978j0096j5572o50
12183d4658R599M311L068K2531J2221L3200j0249j4049j9931j0168Q12J5352J5861
12170A7900m7197l856k70J1576N693j728j1551O764L6002l682j7367L2226k0271
12157D239m2092j1752L4550L7114J6258j1786j6669k8541o216j1382k641J42J9706
$$ plain form
12248 -18432 -1109 -8092 -9723 -24028 -7100 3100 10764 14981 -22932 -40294 -45290 -49041 -28287
12235 -28287 4557 -902 -32488 -40669 -13044 8143 26111 14724 26790 32081 23198 28359 29063
12222 29063 12887 2755 -4112 9910 17537 16294 16941 35167 17301 -3394 -42068 -31106 27272
12209 27272 43926 4168 -24170 -27882 -36439 -8692 16682 33825 27574 2985 -14183 7433
12197 7433 2804 4205 -10655 -6364 5604 -13571 -16621 -16883 -22959 -25318 -18340 -28436 -44008 -44658
12183 -44658 -35059 -30748 -27680 -5149 7072 40272 30023 15974 -3957 -14125 -13313 2039 17900
12170 17900 -29297 -33153 -33423 -21847 -16154 -17882 -29433 -22669 13333 9651 -7716 24510 4239
12157 4239 -37853 -49605 -15055 22059 38317 26531 9862 -18679 -24895 -36277 -38918 -38776 -19070
12144a9070J0477j8380j1535K4626q627r331L0914K5803L007k982M609m9393k2410
12131d2292j590J697L866K462p921J7563L3247k1576r824o10J5430n155l108J6258
12117a553J1345K4663j5324J431j0130j0797k9346j6723P734K6185K3234L1918
12105D2637J4578K2739m926J4353q991j3995j2181N351k588k427o407J0424p584
12092E0983k4263j5186j1077K0754k2848l1533K5910L2279J8320j0682o973k0460
12080E224j0695k0824R268K6060j65k3147M897m702J105K767j4543l1559l41L9628
12066a7027K8616j3543K366L864j6676k4053r821K3013k141l3900J021J2552K6574
12053a9155p446r588K2272J6650J6787N613J4218l546k8046j8774J6474K80k8042
$$ plain form
12144 -19070 -8593 -26973 -38508 -13882 -22509 -31840 -926 24877 27884 24902 29511 -19882 -42292
12131 -42292 -43882 -42185 -38319 -35857 -43778 -26215 7032 -14544 -24368 -24978 -9548 -14703 -17811 -1553
12117 -1553 9792 34455 19131 20562 10432 -365 -29711 -46434 -38700 -12515 10719 42637
12105 42637 57215 79954 75028 89381 80390 66395 54214 59565 56977 54550 48143 58567 50983
12092 50983 26720 11534 457 21211 -1637 -33170 -7260 25019 43339 32657 25684 5224
12080 5224 -5471 -26295 -17027 9033 8868 -14279 -9382 -14084 -12979 -10212 -24755 -56314 -56655 -17027
12066 -17027 11589 -1954 412 4276 -12400 -36453 -46274 -23261 -25402 -59302 -58281 -45729 -19155
12053 -19155 -26601 -36189 -13917 2733 19520 25133 39351 35805 7759 -11015 5459 5739 -22303
12040b2303j0529J4070K5639L3256L341k1511k0537n530p242j8958N907P192k188
12027a9393l4283l262K5671R449j538K9384K1373K0596l1833n5784J7145L1537
12015I062j1364l1962n882J6477J5265L83M0449J3544m2248j8004j5419j424P709
12002b3414J9910n990R612L2497N772j6618j5608j8812J0221J4310j960q071j6940
11989a5091O055n098j5860M54Q460K0957J6572K3248r856k2064J3164n459j1290
11976D192q180L1030J2967J3024J994m5666j5872J4856J4383M518k5827k2570
11964b1151j2168Q224Q646j6344J1877Q825j4829j5860j69J0565J8942k0654P141
11951b6955L896r838L4124K5308p911l836j6987m7778j6537J3678J5025K2828
$$ plain form
12040 -22303 -32832 -18762 6877 40133 43474 21963 1426 -4104 -11346 -30304 -24397 -17205 -19393
12027 -19393 -53676 -56938 -31267 -21818 -23356 6028 27401 47997 16164 -39620 -22475 9062
12015 9062 -2302 -34264 -40146 -23669 -8404 -8021 32428 45972 3724 -14280 -29699 -31123 -23414
12002 -23414 -3504 -9494 118 32615 38387 21769 6161 -12651 -2430 11880 9920 1849 -15091
11989 -15091 -9036 -14134 -29994 -29540 -21080 -123 16449 39697 29841 7777 20941 15482 4192
11976 4192 -3988 27042 40009 53033 55027 9361 -6511 8345 22728 27246 1419 -21151
11964 -21151 -33319 -25095 -16449 -32793 -20916 -12091 -26920 -42780 -42949 -32384 -13442 -34096 -26955
11951 -26955 -23059 -32897 1227 26535 18624 14788 -2199 -49977 -66514 -52836 -37811 -14983
11939a4983L1834j7068o5q693n958J8683j9170o523R979J801J3599J559L490N670
11925A4155Q937j1734N639j8159r449L532J5170K0611K382j5237r259o992r401
11912i805o764j608J5607R025j4915K169J16k3989r884L0957K5054r588K5941
11899C2316J2865j358j0459k5518k4880k0687k6405R068J0395R234P898K293M996
11886b0242K0997M0889J7147j0532k1671k1687K3523l197l8694P973J9542J6400
11874C0448j0672j0180O801j1317o071J6828K8305k4770o559L68k2494j3631N821
11861a7123m682j3759J909J2370K0732J6127K847j3040l6652k5603K3246K6354
11849g274K101O521l05j3423J4445K225K6614K5427j176m241J8218j4615k9792
$$ plain form
11939 -14983 16851 -217 -282 -8975 -14933 3750 -15420 -21943 -11964 -10163 3436 4995 8485 14155
11925 14155 23092 11358 16997 -1162 -10611 -7079 8091 28702 31084 15847 6588 -404 -9805
11912 -9805 -16569 -18177 -2570 6455 -8460 -6291 -6175 -30164 -40048 -9091 15963 6375 32316
11899 32316 45181 43823 33364 7846 -17034 -37721 -64126 -55058 -44663 -35429 -27531 -25238 -20242
11886 -20242 755 41644 58791 48259 26588 4901 28424 25227 -13467 -5494 14048 30448
11874 30448 19776 9596 16397 5080 -991 15837 44142 19372 12813 13181 -9313 -22944 -17123
11861 -17123 -21805 -35564 -33655 -21285 -553 15574 18421 5381 -31271 -56874 -33628 -7274
11849 -7274 -5173 1348 1043 -12380 2065 4290 30904 56331 55155 50914 69132 54517 24725
11836B4725j7591j9227j3555J4920n743j9494j0012P796J4682L8271L403l083
11824A5092m228j8500J8410R877l070j6847l543m760j680K5094K5480j7212l1898
11811g785J0441K9935K1168k4546j4071j4594K8671k0314l5702j6430M2660M8493
11799D7926q178l5728k4237r510j8956J3452p697j335n889J659m632j3804r213
11786g6142o26J3735L3467N2920L56l2344P031J3307j5626k4257k0342K699L80
11773d5442k299K5785q99l4025p751J3232M367K9724J4816j9737L32K135K5496
11760E734M931l282l0165o977L8002N78k3745l0284M0791J8723R042o507l452
11747A3389o300m1985k9654K6206J3795K7181K194j0289J1836J7246P288O041
$$ plain form
11836 24725 7134 -12093 -25648 -10728 -16471 -35965 -45977 -38181 -23499 14772 18175 15092
11824 15092 10864 -7636 10774 20651 17581 734 -2809 -7569 -9249 15845 41325 24113 -7785
11811 -7785 2656 32591 53759 29213 15142 548 29219 8905 -26797 -43227 -567 47926
11799 47926 39748 4020 -20217 -29727 -48683 -35231 -42928 -44263 -50152 -48493 -53125 -66929 -76142
11786 -76142 -76768 -63033 -29566 23354 23710 -8634 -1603 11704 -3922 -28179 -48521 -45822 -45442
11773 -45442 -47741 -21956 -22855 -56880 -64631 -51399 -47032 -17308 -2492 -22229 -21897 -19762 5734
11760 5734 10665 7383 -22782 -29759 8243 8821 -14924 -45208 -4417 14306 23348 16841 13389
11747 13389 7089 -34896 -64550 -38344 -24549 2632 4826 -5463 6373 23619 30907 36948
11735C6948j1986j5538m324k133N960K2005k6681j4896J7958j4107k8887K9388
11723f293P956j3323N115J5538n39q409P225P915j5261k7235J3822J4147R621
11710A0279j5923L852K5270J0388J3005p624q323j4940j2216j9096J2653J4968
11698A2293P727k4866k4558j2091m173J5511J5460K502j4295J1204Q031J8931
11686A1676L292J7757J077j9876J001K004L763J0605j5665j9335N05J5216K7290
11673C9310j0259j1470j6005k7854J2318p300j912J4662J6641J0126O590J5927
11661D0774J6613j905j3950o971J3174p682j3222k0325j0628M619l946r554l0401
11648d3404K313P520j1982J1771L9663Q530j1306R011J9600O652k1668k831K2298
$$ plain form
11735 36948 24962 9424 5100 2967 8927 30932 4251 -10645 7313 -6794 -35681 -6293
11723 -6293 1663 -11660 -6545 8993 8454 45 7270 15185 -76 -27311 -13489 658 10279
11710 10279 -5644 -1792 23478 33866 46871 39247 30924 15984 3768 -15328 -2675 12293
11698 12293 20020 -4846 -29404 -41495 -45668 -30157 -14697 -12195 -26490 -15286 -7255 11676
11686 11676 14968 32725 33802 13926 14927 16931 20694 31299 15634 -3701 -3196 12020 39310
11673 39310 29051 17581 1576 -26278 -13960 -21260 -23172 -8510 8131 18257 24847 40774
11661 40774 57387 55482 41532 34561 47735 40053 26831 6506 -4122 497 -3449 -13003 -43404
11648 -43404 -41091 -33571 -45553 -33782 5881 14411 3105 12116 31716 38368 16700 13869 36167
11635C6167J4555j7446k0412Q252j360j6462J164K217K0209k988O075m086l171
11622B2714l6424k2377k394K0957k7577o622l899J8338L7585J3189k5976K0745
11610H259J4336J3418K79k4987l2991m204K2631J10J0622J2086j5865j3248K0480
11597A0926J3365O890m078j3594Q931p489l0935j407J3309j1466m840Q762l824
11584a5450R106L3414n910j9795n617k4610k033K0375j0963j1073J538K3600J6708
11571I290O035r107J241N231L0497l5936m7858K4936L2017K1515M612j5538j3034
11558A3901j9822O034N68j3114q259K069J4606M3564N704k6745j6177l7604k3257
11545e8532j852p738M7871o753J594J0136J0870J577j0456O198J7370M886j4385
$$ plain form
11635 36167 50722 33276 12864 21116 19756 3294 4458 6675 26884 23896 29971 25885 22714
11622 22714 -13710 -36087 -38481 -17524 -45101 -51723 -55622 -37284 301 13490 -12486 8259
11610 8259 22595 36013 36292 11305 -21686 -25890 -3259 -3149 7473 19559 3694 -9554 10926
11597 10926 24291 31181 27103 13509 22440 14951 -15984 -17391 -4082 -15548 -20388 -11626 -15450
11584 -15450 -6344 27070 21160 1365 -4252 -28862 -30895 -10520 -21483 -32556 -31018 -7418 9290
11571 9290 15325 6218 7459 12690 43187 7251 -40607 -15671 16346 37861 42473 26935 13901
11558 13901 -5921 113 681 -12433 -20692 -18623 -4017 39547 45251 18506 2329 -35275 -58532
11545 -58532 -60384 -68122 -20251 -27004 -25410 -15274 -4404 -2827 -13283 -7085 10285 15171 786
11532G86J004k3334k5704j8333J9164J7419J5084J2152J4602J9487k5619j2549
11520e841J7890k8780Q453J5464O955r155j1656j065j0735J0104J7196O601J2040
11507B7471R67o707J2495k8663j8669L5751K5154J1050J0588j6738m240j6899
11495C1560j4859N502P79J1068j0449l423n332Q976p713k1835J2294J1572k5175
11482g035k3428M2747J6740J3415l0742l2801k3667K5737J0885J8410J2521k2214
11470E68J329j1436K604k318p771j0862r310J5079K0327K3268Q215o989J2520
11457C5224l6548l7199j638K2060j6466j480K8761P442j3674M268Q400P424K818
11444I392j4266o032J0694R2K3728Q212l4638K5281R550P067j1513k0121j610
$$ plain form
11532 786 1790 -21544 -47248 -65581 -46417 -28998 -13914 -1762 12840 32327 6708 -5841
11520 -5841 12049 -16731 -8278 7186 14141 4986 -6670 -7735 -18470 -8366 8830 15431 27471
11507 27471 28438 21731 34226 5563 -13106 22645 47799 58849 69437 52699 48459 31560
11495 31560 16701 22203 22982 34050 23601 20178 14846 23822 16109 -5726 6568 18140 -7035
11482 -7035 -30463 12284 29024 42439 11697 -21104 -44771 -19034 -8149 10261 22782 568
11470 568 1897 -9539 -6935 -9253 -17024 -27886 -37196 -22117 -1790 21478 29693 22704 35224
11457 35224 -1324 -38523 -40161 -18101 -34567 -36047 -7286 156 -13518 -9250 -850 6574 9392
11444 9392 -4874 -10906 -212 -120 23608 31820 -2818 22463 32013 39080 27567 7446 5836
11431E836P245P059k0700j9411J8439n785j9040J7682J1237J5669J5397k3994
11419I634q067L918R499m43q087J9316R368q065K033J2628k7913n337k3761k2986
$$ plain form
11431 5836 13081 20140 -560 -19971 -1532 -7317 -26357 -8675 2562 18231 33628 9634
11419 9634 1567 5485 14984 14541 6454 25770 35138 27073 29106 41734 13821 8484 -15277 -38263
$$ [...]
##END NTUPLES=NMR SPECTRUM
##END=
