##TITLE=Analysis number 327957
Compound Code cc 65002
Book Reference 464/130/2
Project Code adrs
Chemist Name chrisr
##JCAMPDX= 6.0         $$ Bruker NMR JCAMP-DX V2.0
##DATA TYPE= NMR SPECTRUM
##DATA CLASS= NTUPLES
##ORIGIN= Bruker BioSpin GmbH
##OWNER= nmr
$$ XWIN-NMR		Version 3.5
$$ Mon Apr 23 10:33:41 2007 GMT Daylight Time (UT+1h)  MAYBRIDGE\nmr@NMR_250MHZ
##.OBSERVE FREQUENCY= 250.131544655141
##.OBSERVE NUCLEUS= ^1H
##.ACQUISITION MODE= SIMULTANEOUS (DQD)
##.ACQUISITION SCHEME= undefined
##.AVERAGES= 16
##.DIGITISER RES= 18
##SPECTROMETER/DATA SYSTEM= dpx250
##.PULSE SEQUENCE= zg30
##.SOLVENT NAME= CDCl3
##.SHIFT REFERENCE= (INTERNAL, CDCl3, 0, 16.522)
##AUDIT TRAIL= $$ (NUMBER, WHEN, WHO, WHERE, WHAT)
$$ ##TITLE= Audit trail, XWIN-NMR		Version 3.5
$$ ##JCAMPDX= 5.01
$$ ##ORIGIN= Bruker BioSpin GmbH
$$ ##OWNER= nmr
$$ C:\u/data/dgb/nmr/ADRS/1790/pdata/1/auditp.txt
$$ ##AUDIT TRAIL=  $$ (NUMBER, WHEN, WHO, WHERE, WHAT)
(   1,<2007-04-23 10:33:17.29 +100>,<MAYBRIDGE\nmr>,<NMR_250MHZ>,
      <created by zg, POWCHK disabled, PULCHK disabled
       configuration hash MD5:
       49 4B E0 1D 92 C2 6B 37 9F E6 65 BC 52 41 86 1D
       data hash MD5: 64K
       35 FB 35 CA E8 8A 2D 76 A3 5E ED 8C 74 21 9E 1A>)
(   2,<2007-04-23 10:33:31.15 +100>,<MAYBRIDGE\nmr>,<NMR_250MHZ>,
      <Start of raw data processing
       ef LB = 0.3 FT_mod = 6 PKNL = 1 SI = 32K 
       data hash MD5: 32K
       32 D1 6D 17 90 D5 3E 05 1B 10 46 49 80 29 62 BD>)
(   3,<2007-04-23 10:33:32.76 +100>,<MAYBRIDGE\nmr>,<NMR_250MHZ>,
      <apk 
       data hash MD5: 32K
       FC 0E 9B 54 62 F1 4F 6A 69 AE 1C 92 B0 DD 0A DD>)
(   4,<2007-04-23 10:33:33.54 +100>,<MAYBRIDGE\nmr>,<NMR_250MHZ>,
      <abs ABSG = 5 
       data hash MD5: 32K
       A5 BF 7E 6E E2 56 0B 4B 61 07 6F 45 20 D0 C1 B0>)
$$ ##END=
$$ 
$$ hash MD5
$$ 4D 52 2A 34 7B FD A7 7F BE 3A 4F 4C 2F F4 F7 19
##$RELAX= 
##$RELAX= 
##$RELAX= 
##$RELAX= 
##$RELAX= 
##$RELAX= 
##$RELAX= 
$$ Bruker specific parameters
$$ --------------------------
##$DU= <C:\u>
##$EXPNO= 1790
##$NAME= <ADRS>
##$PROCNO= 1
##$TYPE= <nmr>
##$USER= <dgb>
##$AMP= (0..31)
100 100 100 100 100 100 100 100 100 100 100 100 100 100 100 100 100 100 
100 100 100 100 100 100 100 100 100 100 100 100 100 100 
##$AQSEQ= 0
##$AQ_mod= 3
##$AUNM= <au_zg>
##$AUTOPOS= <8 >
##$BF1= 250.13
##$BF2= 250.13
##$BF3= 250.13
##$BF4= 250.13
##$BF5= 500.13
##$BF6= 500.13
##$BF7= 500.13
##$BF8= 500.13
##$BYTORDA= 1
##$CFDGTYP= 0
##$CFRGTYP= 5
##$CHEMSTR= <none>
##$CNST= (0..31)
1 1 145 1 1 1 1 1 1 1 1 1 1 1 1 1 1 1 1 1 1 1 1 1 1 1 1 1 1 1 1 1 
##$CPDPRG= <>
##$CPDPRG1= <>
##$CPDPRG2= <>
##$CPDPRG3= <>
##$CPDPRG4= <mlev>
##$CPDPRG5= <mlev>
##$CPDPRG6= <mlev>
##$CPDPRG7= <mlev>
##$CPDPRG8= <mlev>
##$CPDPRGB= <>
##$CPDPRGT= <>
##$D= (0..31)
0 1 0 0 0 0 0 0 0 0.06 0 0 0 0 0 0 0.0002 0 0 0 0 0 0 0 0 0 0 0 0 0 0 
0 
##$DATE= 1177320796
##$DBL= (0..7)
120 120 120 120 120 120 120 120 
##$DBP= (0..7)
150 150 150 150 150 150 150 150 
##$DBP07= 0
##$DBPNAM0= <>
##$DBPNAM1= <>
$$ [...]
##$SUBNAM7= <"">
##$SUBNAM8= <"">
##$SUBNAM9= <"">
##$SW= 20.6930455092707
##$SWIBOX= (0..15)
0 0 3 0 0 0 0 0 0 0 0 0 0 0 0 0 
##$SW_h= 5175.983436853
##$TD= 65536
##$TD0= 1
##$TE= 683.16
##$TE2= 300
##$TE3= 300
##$TEG= 300
##$TL= (0..7)
0 120 120 120 120 120 120 120 
##$TP= (0..7)
150 150 150 150 150 150 150 150 
##$TP07= 0
##$TPNAME0= <>
##$TPNAME1= <>
##$TPNAME2= <>
##$TPNAME3= <>
##$TPNAME4= <>
##$TPNAME5= <>
##$TPNAME6= <>
##$TPNAME7= <>
##$TPOAL= (0..7)
0.5 0.5 0.5 0.5 0.5 0.5 0.5 0.5 
##$TPOFFS= (0..7)
0 0 0 0 0 0 0 0 
##$TUNHIN= 0
##$TUNHOUT= 0
##$TUNXOUT= 0
##$USERA1= <user>
##$USERA2= <user>
##$USERA3= <user>
##$USERA4= <user>
##$USERA5= <user>
##$V9= 5
##$VALIST= <valist>
##$VCLIST= <CCCCCCCCCCCCCCC>
##$VD= 0
##$VDLIST= <DDDDDDDDDDDDDDD>
##$VPLIST= <PPPPPPPPPPPPPPP>
##$VTLIST= <TTTTTTTTTTTTTTT>
##$WBST= 1024
##$WBSW= 4
##$XGAIN= (0..3)
0 0 0 0 
##$XL= 0
##$YL= 0
##$YMAX_a= 413787
##$YMIN_a= -413333
##$ZGOPTNS= <>
##$ZL1= 120
##$ZL2= 120
##$ZL3= 120
##$ZL4= 120
##$ABSF1= 16.522
##$ABSF2= -4.171173
##$ABSG= 5
##$ABSL= 3
##$ALPHA= 0
##$AQORDER= 0
##$ASSFAC= 0
##$ASSFACI= 0
##$ASSFACX= 0
##$ASSWID= 0
##$AUNMP= <proc_1d>
##$AZFE= 0.1
##$AZFW= 0.1
##$BCFW= 0
##$BC_mod= 0
##$BYTORDP= 0
##$COROFFS= 0
##$CY= 12.5
##$DATMOD= 1
##$DC= 0
##$DFILT= <>
##$DTYPP= 0
##$F1P= 14.0000005364418
##$F2P= -0.99999901652339
##$FCOR= 0.5
##$FTSIZE= 32768
##$FT_mod= 6
##$GAMMA= 0
##$GB= 0
##$INTBC= 1
##$INTSCL= 1
##$ISEN= 128
##$LB= 0.3
##$LEV0= 0
##$LPBIN= 0
##$MAXI= 10000
##$MC2= 0
##$MEAN= 0
##$ME_mod= 0
##$MI= 0
##$NCOEF= 0
##$NC_proc= -2
##$NLEV= 6
##$NOISF1= 0
##$NOISF2= 0
##$NSP= 0
##$NTH_PI= 0
##$NZP= 0
##$OFFSET= 16.522
##$PC= 1
##$PHC0= 228.6276
##$PHC1= 6.384627
##$PH_mod= 1
##$PKNL= yes
##$PPARMOD= 0
##$PSCAL= 4
##$PSIGN= 0
##$REVERSE= no
##$SF= 250.13
##$SI= 32768
##$SIGF1= 0
##$SIGF2= 0
##$SINO= 400
##$SIOLD= 32768
##$SREGLST= <1H.CDCl3>
##$SSB= 0
##$STSI= 32768
##$STSR= 0
##$SW_p= 5175.98343685301
##$SYMM= 0
##$S_DEV= 0
##$TDeff= 65536
##$TDoff= 0
##$TI= <Analysis number 999999
Compound Code 99
Book Reference 9
Project Code 9>
##$TILT= no
##$TM1= 0
##$TM2= 0
##$TOPLEV= 0
##$USERP1= <user>
##$USERP2= <user>
##$USERP3= <user>
##$USERP4= <user>
##$USERP5= <user>
##$WDW= 1
##$XDIM= 32768
##$YMAX_p= 276805527
##$YMIN_p= -70068
$$ End of Bruker specific parameters
$$ ---------------------------------
##NTUPLES= NMR SPECTRUM
##VAR_NAME=  FREQUENCY,     SPECTRUM/REAL,   SPECTRUM/IMAG
##SYMBOL=    X,             R,               I
##VAR_TYPE=  INDEPENDENT,   DEPENDENT,       DEPENDENT
##VAR_FORM=  AFFN,          ASDF,            ASDF
##VAR_DIM=   32768,         32768,           32768
##UNITS=     HZ,            ARBITRARY UNITS, ARBITRARY UNITS
##FACTOR=    0.157963299565203, 1,           1
##FIRST=     4132.6476996994, 0,             0
##LAST=      -1043.33573715361, 0,           0
##MIN=       -1043.33573715361, -70068,      0
##MAX=       4132.6476996994, 276805527,     0
$$ Real data points
##PAGE= N=1
##DATA TABLE= (X++(R..R)), XYDATA
$$ [...]
$$ plain form
17592 99360 103065 99231 93127 98521 106907 108789 106848 115649 121545 125505 134383 134057 140420 142496 140898
17577 140898 143820 147803 155350 159382 162462 171169 173318 175038 183304 192285 194524 195044 201691 207447
17563 207447 214456 216844 223645 237449 249807 256032 262911 272538 279713 294903 307074 314910 333571
17550 333571 355812 373699 387124 417933 460567 497617 525742 550785 585192 639778 712475
17539 712475 760079 770916 786716 813104 871599 954673 1041901 1089807 1134463 1190374 1267917
17528 1267917 1378206 1518512 1677452 1825601 2012739 2224434 2449694 2739500 3112410
17519 3112410 3571149 4224905 5186191 6595202 8814608 12294444 16208179 17903097 18436979
17510 18436979 19224918 22045955 29029635 39493825 42714106 39310739 34423422 30901484
$$ packed form
17592I9360L705l834o104N394Q386J882j941Q801N896L960Q878l26O363K076j598
17577A40898K922L983P547M032L080Q707K149J720Q266Q981K239N20O647N756
17563B07447P009K388O801J3804J2358O225O879R627P175J5190J2171P836J8661
17550C33571K2241J7887J3425L0809M2634L7050K8125K5043L4407N4586P2697
17539G12475M7604J0837J5800K6388N8495Q3074Q7228M7906M4656N5911P7543
17528A267917J10289J40306J58940J48149J87138K11695K25260K89806L72910
17519C112410M58739O53756R61286J409011K219406L479836L913735J694918N33882
17510A8436979P87939K821037O983680J0464190L220281l403367m887317l521938
$$ plain form
17502 30901484 32862903 40390017 44391511 39787703 33104768 25940345 22027989 21470758
17494 21470758 21617787 19811849 17527273 15554618 15062700 16732314 19384559 20169578
17486 20169578 20111577 20481265 22953935 29549927 39443557 42036141 38465927 33500581
17478 33500581 30022922 31871442 39041114 42409966 37605550 30832994 23670402 19666069
17470 19666069 18794254 18418060 16011586 12883670 9629036 7072366 5400293 4326287
17462 4326287 3593700 3078665 2712820 2429019 2190193 2011438 1843949 1692094 1565881
17453 1565881 1464729 1365098 1290853 1239121 1200045 1122941 1033323 936177 871233 846858 857659
17442 857659 848380 786564 694870 614390 563802 536372 502340 460751 424787 396467 377404 358226
$$ packed form
17502C0901484J961419P527114M001494m603808o682935p164423l912356n57231
17494B1470758J47029j805938k284576j972655m91918J669614K652245P85019
17486B0169578n8001L69688K472670O595992R893630K592584l570214m965346
17478C3500581l477659J848520P169672L368852m804416o772556p162592m004333
17470A9666069q71815l76194k406474l127916l254634k556670j672073j074006
17462D326287p32587n15035l65845k83801k38826j78755j67489j51855j26213
17453A565881j01152r9631p4245n1732l9076p7104q9618r7146o4944k4375J0801
17442H57659r279o1816r1694q0480n0588k7430l4032m1589l5964k8320j9063j9178
$$ plain form
17430 358226 334655 318590 302978 293649 280764 265300 249047 236261 225917 219536 219782 219470 213190
17417 213190 211805 199554 184504 174708 168561 166174 167347 164313 161608 161347 159666 158073 155868 156537
17403 156537 160867 154574 148478 142045 132328 127065 130807 131795 124225 121051 117240 113138 111588 113652
17389 113652 117467 118186 112199 106865 107941 107415 109658 105836 97574 97027 97108 105297 113004 103951 95005
17374 95005 93230 102961 119058 120373 102763 86617 88078 94100 100540 90487 85845 80491 75373
17361 75373 79560 80380 74958 71591 65567 58975 56140 63222 76039 73246 71778 69032 68543 73699 76848
17346 76848 79477 70733 64447 61681 62607 72619 78490 66945 50291 48891 53334 56313 56243 57797
17332 57797 55197 53518 52958 60883 69612 66127 53305 47272 46933 41924 43167 47916 51518 55408 53077
$$ packed form
17430C58226k3571j6065j5612r329j2885j5464j6253j2786j0344o381K46l12o280
17417B13190j385j2251j5050r796o147k387J173l034k705k61j681j593k205O69
17403A56537M330o293o096o433r717n263L742R88p570l174l811m102j550K064
17389A13652L815P19n987n334J076n26K243l822q262n47Q1Q189P707r053q946
17374I5005j775R731J6097J315j7610j6146J461O022O440j0053m642n354n118
17361G5373M187Q20n422l367o024o592k835P082J2817k793j468k746m89N156L149
17346G6848K629q744o286k766R26J0012N871j1545j6654j400M443K979p0J554
17332E7797k600j679n60P925Q729l485j2822o033l39n009J243M749L602L890k331
$$ plain form
17317 53077 54905 55611 55209 50870 46476 40598 36977 37388 36280 37776 40684 43137 48132 45789 42898
17302 42898 49350 47028 43827 47932 65924 73360 77653 72927 64756 48914 35810 31975 27060 23655
17288 23655 23114 24436 24545 23462 22590 19957 19606 23418 26421 21272 12877 9373 15667 25682 30669
17273 30669 28319 19777 11699 7286 13491 12415 12936 15695 22646 20591 15703 22678 31171 27591 24953
17258 24953 30278 29706 26496 23560 19775 23669 18946 13780 15821 19895 18339 15875 18099 21577 15632
17243 15632 12842 10686 9431 11053 7784 9308 18352 16924 15658 17834 17788 22341 22297 21090 30605
17228 30605 35691 24261 12589 9998 15102 15057 9845 10501 19344 24233 22608 21813 18583 19820 22436
17213 22436 24432 24280 14127 15782 22662 16458 7251 2023 4234 5032 1784 5095 9472 11284 10013
$$ packed form
17317E3077J828P06m02m339m394n878l621M11j108J496K908K453M995k343k891
17302D2898O452k322l201M105J7992P436M293m726q171j5842j3104l835m915l405
17288B3655n41J322J09j083q72k633l51L812L003n149q395l504O294J0015M987
17273C0669k350q542q078m413O205j076N21K759O951k055m888O975Q493l580k638
17258B4953N325n72l210k936l785L894m723n166K041M074j556k464K224L478n945
17243A5632k790k156j255J622l269J524R044j428j266K176m6M553m4j207R515
17228C0605N086j1430j1672k591N104m5n212O56Q843M889j625p95l230J237K616
17213B2436J996j52j0153J655O880o204r207n228K211P98l248L311M377J812j271
$$ plain form
17198 10013 12992 18168 11634 8946 11185 16084 26398 23055 12706 8765 5215 9606 12079 12241
17184 12241 10871 15945 15710 11733 10701 9198 11429 13928 15676 14752 12098 14752 13880 16894 21604
17169 21604 18172 10281 10277 12180 7199 11379 19581 22009 13191 6978 11907 8041 8731 11265 12395
17154 12395 16175 16693 12856 7114 7959 9696 14348 9513 9564 13753 11479 14581 12270 10341 5874
17139 5874 6967 10605 10539 10115 8734 8840 10678 7581 8034 10741 18018 19432 14045 15807 18595 9909
17123 9909 5733 906 -7210 -7270 -7243 -1536 3649 9686 10988 8150 5514 12067 17151 15041 8405 9626
17107 9626 9966 9734 11260 13657 8602 8206 8613 10675 3519 -5279 5210 12880 7204 5984 8178
17092 8178 4485 3751 -3259 -2002 2285 7397 9138 10691 16382 22228 21053 18060 14541 9714 5913
$$ packed form
17198A0013K979N176o534k688K239M899J0314l343j0349l941l550M391K473J62
17184A2241j370N074k35l977j032j503K231K499J748r24k654K654q72L014M710
17169B1604l432p891mJ903m981M180Q202K428q818o213M929l866O90K534J130
17154A2395L780N18l837n742Q45J737M652m835N1M189k274L102k311j929m467
17139E874J093L638o6m24j381J06J838l097M53K707P277J414n387J762K788q686
17123I909m176m827q116o0K7N707N185O037J302k838k636O553N084k110o636J221
17107I626L40k32J526K397n055l96M07K062p156q798J0489P670n676j220K194
17092H178l693p34p010J257M287N112J741J553N691N846j175k993l519m827l801
$$ plain form
17077 5913 5619 8666 6482 2358 283 -1541 -2046 -4877 -7044 -6833 1368 4966 8583 13394 10000
17062 10000 3355 -3715 -5920 -2757 9379 17881 15934 8579 11588 11212 6394 13370 16649 6077
17048 6077 5477 5416 8927 12753 5656 3118 303 6016 1436 483 408 -1884 467 2927 5261 -1108
17032 -1108 2379 9767 17124 13015 11702 16673 15470 21563 21706 10527 6407 5946 8480 10015 8098
17017 8098 11909 8112 -2205 1386 4818 8257 4191 -3056 -1254 2002 4896 8526 12310 11652 10891
17002 10891 3305 3502 8864 11124 6622 7017 12172 15250 13596 17709 12446 9921 11437 13193 13882
16987 13882 16008 19111 23464 19783 21860 26347 40918 51993 50234 48491 55459 72021 90669
16974 90669 105312 106127 106112 114935 146892 187794 225751 226351 212626 187272 183615 207018 234530
$$ packed form
17077E913k94L047k184m124k075j824n05k831k167K11Q201L598L617M811l394
17062A0000o645p070k205L163J2136Q502j947p355L009l76m818O976L279j0572
17048F077o00o1L511L826p097k538k815N713m580r53p5k292K351K460K334o369
17032a108L487P388P357m109j313M971j203O093J43j1179m120m61K534J535j917
17017H098L811l797j0317L591L432L439m066p247J802L256K894L630L784o58p61
17002A0891p586J97N362K260m502L95N155L078j654M113n263k525J516J756O89
16987A3882K126L103M353l681K077M487J4571J1075j759j743O968J6562J8648
16974I0669J4643Q15j5Q823L1957M0902L7957O00j3725k5354l657K3403K7512
$$ plain form
16961 234530 222753 188602 151612 116432 99682 104039 98286 94081 89177 81939 83689 93799 105358
16948 105358 104736 99479 115292 146209 195519 231385 220133 199047 180978 178690 202577 235633
16936 235633 226813 194508 156239 128977 113372 107879 99788 84793 66362 50974 37125 26652
16924 26652 18777 16435 9846 4772 6695 10325 10881 6896 12468 13932 16976 15092 12365 15637 17962
16909 17962 18299 12586 13249 15749 14819 9349 -656 -4445 376 3664 1269 -2096 1052 -41 -2892
16894 -2892 -3706 -4659 -5487 1306 1599 -938 -2043 -2175 -3046 -4952 -5063 -8540 -8195 -6712 -4119 -2838 5482
16877 5482 9797 14447 22982 17556 20967 20916 17473 9758 4285 -566 -10375 -21198 -16777 -9510 -4256
16862 -4256 -1391 -2688 -1846 710 4402 7945 12574 7369 2367 -3222 -4760 613 3156 2357 3029
$$ packed form
16961B34530j1777l4151l6990l5180j6750M357n753m205m904p238J750J0110J1559
16948A05358o22n257J5813L0917M9310L5866j1252k1086j8069k288K3887L3056
16936B35633q820l2305l8269k7262j5605n493q091j4995j8431j5388j3849j0473
16924B6652p875k342o589n074J923L630N56l985N572J464L044j884k727L272K325
16909A7962L37n713O63K500r30n470j0005l789M821L288k395l365L148j093k851
16894b892q14r53q28O793K93k537j105j32q71j906j11l477L45J483K593J281Q320
16877E482M315M650Q535n426L411n1l443p715n473m851r809j0823M421P267N254
16862d256K865j297Q42K556L692L543M629n205n002n589j538N373K543p99O72
$$ plain form
16847 3029 -799 -5738 -10922 -6977 -2648 3320 3606 -1311 -1444 4551 8834 10239 14390 16731 20594
16832 20594 14768 6450 2145 3579 7589 5527 8363 8202 3866 4685 9317 1970 -2663 3419 5590
16817 5590 1088 -1734 -2319 -3077 6990 10679 2352 -6831 -8487 -10160 -7791 -1426 6549 9070 4705
16802 4705 9350 9092 1547 3152 7268 5198 3979 -1518 -5268 793 2832 2875 2133 4203 11910 17937
16786 17937 10528 5346 9998 12722 12792 7212 -1848 -3288 5 6270 7570 10427 8760 8442 2514
16771 2514 2843 2363 2902 5991 7377 1072 -6464 -6826 -10755 -1313 3199 -5035 -9088 1275 3109
16756 3109 2862 1781 9959 12723 15897 15539 16736 5995 1556 -2929 -4683 -6176 622 -152 -8842
16741 -8842 -9578 -15142 -10219 -8585 -11313 -3470 8164 7813 5678 5167 8259 11158 7148 6209 6160 4604
$$ packed form
16847C029l828m939n184L945M329N968K86m917j33N995M283J405M151K341L863
16832B0594n826q318m305J434M010k062K836j61m336Q19M632p347m633O082K171
16817E590m502k822n85p58J0067L689q327r183j656j673K369O365P975K521m365
16802D705M645k58p545J605M116k070j219n497l750O061K039M3p42K070P707O027
16786A7937p409n182M652K724P0n580r060j440L293O265J300K857j667l18n928
16771B514L29m80N39L089J386o305p536l62l929R442M512q234m053J0363J834
16756C109k47j081Q178K764L174l58J197j0741m439m485j754j493O798p74q690
16741h842p36n564M923J634k728P843J1634l51k135n11L092K899m010r39m9j556
$$ plain form
16725 4604 -550 -271 -6004 -4272 1493 -3964 -9610 -9102 -8075 -3053 -3948 -5662 -3236 -4606 -3877 2816
16709 2816 3905 2954 -313 627 8044 4547 -3289 -1044 1892 2144 3742 4679 1341 -4542 -8653 -15434
16693 -15434 -15545 -5890 3382 7384 3141 2067 464 1275 3016 -1717 602 6937 3772 -708 4149
16678 4149 3553 7118 354 -2839 -5169 -3942 5714 6474 -786 -2213 3300 3524 -84 -5937 -6471 -4688
16662 -4688 -6562 -5132 1628 3974 5527 2920 2428 -5900 -4623 -167 3101 4884 8354 11345 6578
16647 6578 2865 -2909 -10324 -6815 -6186 1976 7025 6956 9785 5950 2599 7083 3041 -5788 -4648
16632 -4648 -2967 -3760 351 3682 9210 12279 8402 8797 7608 6493 -718 -11091 -8971 -6600 -3195
16617 -3195 6436 2897 1578 -1164 -4298 -5749 -8340 -4021 4182 10707 11616 11058 9249 9162 15458 13776
$$ packed form
16725D604n154K79n733J732N765n457n646N08J027N022q95j714K426j370P29O693
16709B816J089r51l267R40P417l497p836K245K936K52J598R37l338n883m111o781
16693a5434j11R655R272M002m243j074j603Q11J741m733K319O335l165m480M857
16678D149n96L565o764l193k330J227R656P60p260j427N513K24l608n853n34J783
16662d688j874J430O760K346J553k607m92q328J277M456L268J783L470K991m767
16647F578l713n774p415L509O29Q162N049o9K829l835l351M484m042q829J140
16632d648J681p93M111L331N528L069l877L95j189j115p211j0373K120K371L405
16617c195R631l539j319k742l134j451k591M319Q203O525R09n58j809q7O296j682
$$ plain form
16601 13776 9699 8922 6808 6897 6662 7105 7295 3572 4983 15116 17895 17203 17903 15575 9859 5793
16585 5793 3573 1734 268 -5723 -10937 -8294 -6384 1304 10055 8662 7517 8269 12826 12528 4198
16570 4198 5381 -1991 -3738 -6784 -2282 -1527 -1655 877 -3040 -4028 -1350 2593 -172 -1015 -5176 -7932
16554 -7932 -7848 -10942 -4767 -329 -671 3035 12707 10074 4136 4862 -326 -1608 1155 1689 1221 -338
16538 -338 -1397 1992 34 -2561 -9446 -6824 -8477 -7574 -791 -3118 773 4296 8542 14643 15582
16523 15582 15838 16611 10321 6182 3842 6098 8703 11166 12190 10709 7989 2681 -1247 1201 1663
16508 1663 3899 -4118 -13603 -10710 -7729 524 8653 7258 7148 739 -6312 -4889 -5615 -12094 -9385
16493 -9385 2168 5641 9116 4499 -2720 -10591 -10965 -7996 84 4149 7724 10161 11044 6993 5113
$$ packed form
16601A3776m077p77k114Q9k35M43J90l723J411J0133K779o92P00k328n716m066
16585E793k220j839j466n991n214K643J910P688Q751j393j145P52M557k98q330
16570D198J183p372j747l046M502P55j28K532l917r88K678L943k765q43m161k756
16554g932Q4l094O175M438l42L706R672k633n938P26n188j282K763N34m68j559
16538c38j059L389j958k595o885K622j653R03O783k327L891L523M246O101R39
16523A5582K56P73o290m139k340K256K605K463J024j481k720n308l928K448M62
16508A663K236q017r485K893K981Q253Q129j395j10o409p051J423p26o479K709
16493i385J1553L473L475m617p219p871l74K969Q080M065L575K437Q83m051j880
$$ plain form
16478 5113 5098 7521 12668 10648 -3210 -13220 -5955 -911 -2032 -7016 -9821 -11073 -12498 -13053 -15921
16463 -15921 -16120 -11565 -10470 -10947 -4479 -1420 -7456 -5169 3295 10292 14873 13226 15637 7398 -6271
16448 -6271 -11342 -9365 -1585 -3633 -4601 1073 -3264 -5197 1876 4735 3439 2198 3970 6347 3321
16433 3321 -5373 -7408 -3441 2329 492 -469 -6003 -15920 -22772 -18187 -6861 -1775 -1987 -6586 -10215
16418 -10215 -6436 -374 8853 11325 10574 6321 1599 -3995 -7602 -5909 -1572 -1108 3913 4470 1161
16403 1161 -1654 -4297 -8264 -3846 2179 2083 3714 6426 4276 -2569 2664 3188 6655 7676 9979
16388 9979 10523 2881 -4117 -8356 -9780 -3086 2491 1535 -4624 1057 1909 -7132 -2703 2641 5221
16373 5221 8040 6183 5993 3723 -2103 4685 13614 14130 10626 12379 9515 2822 -1588 -5757 694
$$ packed form
16478E113j5K423N147k020j3858j0010P265N044j121m984k805j252j425n55k868
16463a5921j99M555J095m77O468L059o036K287Q464O997M581j647K411q239j3669
16448f271n071J977P780k048r68N674m337j933P073K859j296j241J772K377l026
16433C321q694k035L967N770j837r61n534r917o852M585J1326N086k12m599l629
16418a0215L779O062R227K472p51m253m722n594l607J693M337M64N021N57l309
16403A161k815k643l967M418O025r6J631K712k150o845N233N24L467J021K303
16388I979N44p642o998m239j424O694N577r56o159N681Q52r041M429N344K580
16373E221K819j857j90k270n826O788Q929N16l504J753k864o693m410m169O451
$$ plain form
16358 694 981 2698 -2534 -5609 -2220 2572 2856 7211 11746 12575 13341 9485 3333 -4838 -11049 -9007
16342 -9007 -2786 -4103 -1757 6709 8531 -144 -10398 -11405 -1881 234 2318 5816 8637 11280
16328 11280 8673 6549 904 3820 82 -2213 -2634 -2107 -2902 -4520 3053 3162 1873 -5638 -8271
16313 -8271 -1277 -4402 -840 4735 2204 -760 -1323 798 -2574 -3391 -8833 -9882 -7957 -6567 -1670
16298 -1670 1373 2164 4824 367 -1238 3706 -835 484 5639 5264 1911 1667 9876 13385 7143
16283 7143 9089 8173 11618 5647 8018 10293 5246 5920 7000 3103 318 -557 3830 5099 5835 10068
16267 10068 3685 -5124 -12080 -7387 -850 -1387 3614 3419 -1763 -444 4430 4500 7951 12449 8657
16252 8657 6126 7795 6331 2539 -1208 -1774 -1576 -4373 -5383 -4445 -3488 -3894 -14588 -13406 -8764 -2933
$$ packed form
16358F94K87J717n232l075L389M792K84M355M535Q29P66l856o152q171o211K042
16342i007O221j317K346Q466J822q675j0254j007R524K115K084L498K821K643
16328A1280k607k124n645K916l738k295m21N27p95j618P573J09j289p511k633
16313h271O994l125L562N575k531k964n63K121l372q17n442j049J925J390M897
16298a670L043P91K660m457j605M944m541J319N155l75l353k44Q209L509o242
16283G143J946r16L445n971K371K275n047O74J080l897k785q75M387J269P36M233
16267A0068o383q809o956M693O537n37N001j95n182J319M874P0L451M498l792
16252H657k531J669j464l792l747n66J98k797j010R38R57m06j0694J182M642N831
$$ plain form
16236 -2933 2861 -2911 -2066 -441 -856 -2776 -7836 -2514 961 -375 -3243 -7398 -4091 -1661 -4612
16221 -4612 -1028 -2223 -2008 1765 3242 582 -120 -5623 -9651 -13132 -12040 -6469 1813 3 -1425
16206 -1425 -2545 -7231 -10795 -10392 -5167 -14000 -12990 -7818 -9343 -4458 -1990 -10717 -12690 -6881 -2185
16191 -2185 1224 485 -1831 -3762 -1277 1532 6498 -89 -7279 -8509 -3689 -2508 -247 -447 -3305
16176 -3305 -3771 -4363 -7736 -9446 -13355 -13898 -13196 -18298 -12077 -245 5286 3764 1045 471 -200 4578
16160 4578 7625 2728 -2724 -796 4845 2738 1799 1655 1550 5785 3296 -1460 -3287 -4695 848
16145 848 8255 5805 411 -4979 -3421 -870 -58 4725 3959 -946 4945 3076 1976 939 -1331
16130 -1331 -345 447 -783 -9191 -15722 -10674 -6150 -4900 -2366 -4985 -7558 -6822 -2896 -1875 -5024
$$ packed form
16236b933N794n772Q45J625m15j920n060N322L475j336k868m155L307K430k951
16221d612L584j195K15L773J477k660p02n503m028l481J092N571Q282j810j428
16206a425j120m686l564M03N225q833J010N172j525M885K468q727j973N809M696
16191b185L409p39k316j931K485K809M966o587p190j230M820J181K261k00k858
16176c305m66n92l373j710l909n43P02n102O221J1832N531j522k719n74o71M778
16160D578L047m897n452J928N641k107r39j44j05M235k489m756j827j408N543
16145H48P407k450n394n390J558K551Q12M783p66m905N891j869j100j037k270
16130a331R86P92j230q408o531N048M524J250K534k619k573P36L926J021l149
$$ plain form
16115 -5024 -9195 -13269 -8926 -6184 -10597 -11692 -5402 3129 3561 613 -95 -2755 -4011 -9431 -7935
16100 -7935 -5066 -2218 -2196 -8853 -6921 -1876 -4246 -8260 -4776 -2142 -4678 -4679 -3868 -7171 -12024 -4196
16084 -4196 3880 8861 4135 -1583 -7509 -3013 -4015 126 5265 7935 5420 7833 10929 5412 1119
16069 1119 -1988 -7044 -7432 -2104 -6168 -1778 2574 3122 3797 469 -1668 3996 10857 4208 -4705
16054 -4705 -8660 -6433 -4737 -597 5332 10074 8158 6196 5068 -1996 -7277 -3632 -2796 -4578 -1425
16039 -1425 337 -904 -5761 -7827 -7336 -20 4574 1860 1109 -409 -9776 -13285 -9609 1777 613
16024 613 -1337 5149 8220 -7533 -11484 -13012 -6320 -5804 -4956 1073 -842 -2736 -2734 -48 789 210
16008 210 -2102 -3932 -7227 -6569 -7371 -4552 -4549 -4043 -3904 -1817 3529 6085 819 2640 -631 -2175 2616
$$ packed form
16115e024m171m074M343K742m413j095O290Q531M32k948p08k660j256n420J496
16100g935K869K848K2o657J932N045k370m014L484K634k536jQ11l303m853P828
16084d196Q076M981m726n718n926M496j002M141N139K670k515K413L096n517m293
16069A119l107n056l88N328m064M390M352N48O75l328k137N664O861o649q913
16054d705l955K227J696M140N929M742j916j962j128p064n281L645Q36j782L153
16039a425J762j241m857k066M91P316M594k714p51j518r367l509L676J1386j164
16024F13j950O486L071j5753l951j528O692N16Q48O029j915j894KK686Q37n79
16008B10k312j830l295O58q02K819LN06J39K087N346K556n266J821l271j544M791
$$ plain form
15991 2616 -298 -6349 -3283 3893 6912 5223 5007 5000 2526 -1606 -4527 -2327 -4419 -8026 -5643 -7631
15975 -7631 -12846 -11522 -5267 2144 828 -6061 -8668 -7328 -9365 -5408 -4561 -7528 -13869 -7476 -7564
15960 -7564 -3846 -6577 -4789 -5668 -4482 -4609 -8857 -8399 -3483 -8946 -12700 -8342 1750 6796 13313
15945 13313 17895 14294 11782 6237 5012 -1654 2269 9696 3195 -832 -5579 -8167 -655 9459
15931 9459 862 -2943 -3233 -435 19 -2550 -1523 1278 1538 1040 5242 -1199 -2621 1393 3884 1378
15915 1378 -3813 -451 -1703 102 6556 8967 7149 7209 9496 524 -7415 -3469 143 1460 -2562
15900 -2562 3123 4782 -446 -3028 -4096 -9554 -6419 -549 1570 -4950 -5968 -5553 -1561 -1719 -3405
15885 -3405 5924 9616 8528 12182 14188 12048 2391 -7788 -6061 -6612 -6594 -3219 -3967 -5341 -2360
$$ packed form
15991B616k914o051L066P176L019j689k16pk474m132k921K200k092l607K383j988
15975g631n215J324O255P411j316o889k607J340k037L957Q47k967o341O393q8
15960g564L718k731J788q79J186j27m248M58M916n463l754M358J0092N046O517
15945A3313M582l601k512n545j225o666L923P427o501m027m747k588P512J0114
15931I459q597l805k90K798M54k569J027K801K60m98M202o441j422M014K491k506
15915A378n191L362j252J805O454K411j818O0K287q972p939L946L612J317m022
15900b562N685J659n228k582j068n458L135N870K119o520j018M15L992j58j686
15885c405R329L692j088L654K006k140r657j0179J727n51J8L375p48j374K981
$$ plain form
15870 -2360 -2563 -5144 -2349 732 5393 5134 468 -175 2862 -3688 -9119 -14321 -15213 -8678 -6098 -11608
15854 -11608 -5564 -6677 -5666 1270 2243 1915 -8189 -12490 -9382 -6126 -12413 -18930 -14369 -11143 -12681
15839 -12681 -9113 -7623 -6821 -12831 -13780 -4315 2984 4909 4825 402 -314 880 -305 255 -3657 -5152
15823 -5152 -647 -1806 -2111 -3967 -14035 -16730 -5781 494 3949 -5576 -12558 -18094 -16221 -9838
15809 -9838 -6463 -3448 -3028 -9096 -11518 -8193 -9435 -10741 -12820 -9234 -4500 -2648 -5107 -4634 -10392
15794 -10392 -15188 -10242 -3965 -7747 -8572 -6743 -7123 -6985 -6232 487 5340 3357 -2241 -3004 -4653 -6930
15778 -6930 -928 -2292 -6540 -9492 -11231 -3692 -3145 -7000 -4964 -6390 -5369 -5333 -4257 -3529 -4690 -115
15762 -115 1585 -155 2190 -1413 -1211 -2379 -7874 -6859 -718 45 5147 11105 5136 4270 -639 2399
$$ packed form
15870b360k03k581K795L081M661k59m666o43L037o550n431n202q92O535K580n510
15854a1608O044j113J011O936R73l28j0104m301L108L256o287o517M561L226j538
15839a2681L568J490Q02o010r49R465P299J925q4m423p16J194j185N60l912j495
15823e152M505j159l05j856j0068k695J0949O275L455r525o982n536J873O383
15809i838L375L015M20o068k422L325j242j306k079L586M734J852k459M73n758
15794a0392m796M946O277l782q25J829l80J38P53O719M853j983n598p63j649k277
15778f930O002j364m248k952j739P539N47l855K036j426J021L6J076P28j161M575
15762a15J700j740K345l603K02j168n495J015O141P63N102N958n969q66m909L038
$$ plain form
15746 2399 6370 1054 -1057 -5586 -3168 -5220 -7098 1943 522 -7340 -10808 -3810 -5234 -5432 -3455
15731 -3455 -3310 2867 6656 4281 3571 4255 5907 6787 3354 -3605 -9649 -6433 -396 6198 2805 -520
15715 -520 883 -4419 -6136 -5680 -8697 -10940 -10343 -7962 -200 709 713 -5992 -627 6860 13230 9447
15699 9447 10808 13046 11457 10646 2755 4505 10004 10491 8728 5556 2339 -6746 -18603 -22640 -11653
15684 -11653 -9818 -17553 -18604 -11366 -10544 -7084 -8689 -11663 -14918 -6919 -1154 -1697 156 -6493 -6513
15669 -6513 -5303 -82 -917 -988 207 -1544 -5575 -437 6011 8171 4576 3068 4855 9081 7718
15654 7718 8661 7318 5106 1933 8709 3049 -11096 -6945 -7173 -5619 -298 6426 11194 11038 8667
15639 8667 5050 6544 2558 -5174 -3339 829 -2607 837 8562 5697 5011 -2637 -5914 -9093 -428
$$ packed form
15746B399L971n316k111m529K418k052j878R041j421p862l468O998j424j98J977
15731c455J45O177L789k375p10O84J652Q80l433o959o044L216O037O594l393l325
15715e20J403n302j717M56l017k243N97K381P762R09Mo705N365P487O370l783
15699I447J361K238j589q11p891J750N499M87j763l172l217r085j1857m037J0987
15684a1653J835p735j051P238Q22L460j605k974l255P999N765n43J853o649k0
15669f513J210N221q35p1J195j751m031N138O448K160l595j508J787M226j363
15654G718R43j343k212l173O776n660j4145M151k28J554N321O724M768j56k371
15639H667l617J494l986p732J835M168l436L444P725k865o86p648l277l179Q665
$$ plain form
15624 -428 464 -1976 1458 2471 2800 1082 -1684 -3472 -4916 -4032 -2216 -5551 -11402 -6223 -542 5942
15608 5942 6006 3143 4319 724 659 3679 964 4274 5393 10052 119 -8773 -6746 -419 -2286 -2155
15592 -2155 2427 2240 4559 9402 9098 2826 -8813 -15940 -19831 -13929 -10197 -1188 -197 -5048 -4517
15577 -4517 -3142 -3914 -3161 2141 6556 7153 6995 2893 -166 2640 3452 3562 5628 865 -2417 -1509
15561 -1509 578 -3646 -5235 -1725 -4359 -8350 -6788 -8947 -10504 -10536 -5565 -5395 -4889 -510 3047 311
15545 311 -4140 -1238 -417 8721 6602 2054 69 -188 -420 7787 8338 2304 -1563 -4563 76 2915
15529 2915 3764 -3244 -8321 -6214 25 1230 6226 9987 5615 2110 -5047 -4324 -581 1997 5226
15514 5226 9231 4773 4048 830 -3041 -5315 -2193 5028 12150 13795 15160 17425 16702 15184 9341
$$ packed form
15624d28Q92k440L434J013L29j718k766j788j444Q84J816l335n851N179N681O484
15608E942O4k863J176l595o5L020k715L310J119M659r933q892K027O327j867J31
15592b155M582j87K319M843l04o272j1639p127l891N902L732R009R91m851N31
15577d517J375p72P53N302M415N97j58m102l059K806Q12J10K066m763l282R08
15561a509K087m224j589L510k634l991J562k159j557l2M971J70N06M379L557k736
15545C11m451K902Q21R138k119m548j985k57k32Q207N51o034l867l000M639K839
15529B915Q49p008n077K107O239J205M996L761m372l505p157P23L743K578L229
15514E226M005m458p25l218l871k274L122P221P122J645J365K265p23j518n843
$$ plain form
15499 9341 1326 -4550 -4725 2173 7741 9083 10273 2353 -69 1825 2573 417 -3124 -5226 -3378
15484 -3378 -2605 -3260 -2386 -5629 -4619 2813 8564 4621 -585 -2195 -5865 -884 -545 -3144 -5726 -9681
15468 -9681 -10648 -10787 -7885 -1328 -1434 -4088 1126 -503 5762 7699 896 -5105 -5138 1216 7125 -1170
15452 -1170 -7499 -3069 -3562 -2792 -8652 -9248 -1083 4547 3343 -1546 -1321 -5750 -9504 -8289 582 5151
15436 5151 3701 -578 -7429 -7399 -544 8495 9613 7625 2497 2405 -880 -1258 -751 -869 2545 5731
15420 5731 -1900 -6951 -7357 -7747 -1226 530 6771 9521 9369 6484 2557 -636 -107 1987 4892 2200
15404 2200 999 -267 -4149 -11289 -14896 -13929 -14481 -13739 -9442 -2617 -1265 -4051 -4434 -6720 -3847 -8734
15388 -8734 -11877 -11630 -7795 -7557 -13405 -17021 -17926 -14105 -10537 -8216 -2170 2945 6139 7118 7564 1469
$$ packed form
15499I341q015n876j75O898N568J342J190p920k422J894P48k156l541k102J848
15484c378P73o55Q74l243J010P432N751l943n206j610l670M981L39k599k582l955
15468i681r67j39K902O557j06k654N214j629O265J937o803o001l3O354N909q295
15452a170o329M430m93P70n860n96Q165N630j204m889K25m429l754J215Q871M569
15436E151j450m279o851L0O855R039J118j988n128r2l285l78N07j18L414L186
15420E731p631n051m06l90O521J756O241K750j52k885l927l193N29K094K905k692
15404B200j201j266l882p140l607R67n52P42M297O825J352k786l83k286K873m887
15388h734l143K47L835K38n848l616r05L821L568K321O046N115L194R79M46o095
$$ plain form
15372 1469 -115 -5078 -8001 -8889 -6099 2404 3817 -1736 -8279 -13418 -11496 -10034 -12408 -10530 -9796
15357 -9796 -12231 -7521 -12580 -13085 -8197 -3069 -6955 -12724 -15807 -7238 -3114 -600 2990 2794 -5247
15342 -5247 -6977 -6213 -10367 -5426 1971 -3302 -6950 -3339 2738 12771 12191 1961 5530 11975 10598
15327 10598 6496 5677 3297 -5157 -9356 -14877 -13356 -8037 -6775 -6125 -2527 -783 582 -6149 -9747
15312 -9747 -8523 -5756 -7024 -1816 5008 7215 2504 -1754 3318 -447 46 1346 18 761 3780
15297 3780 3168 2453 -2567 -10014 -5986 1193 -955 -7418 -12406 -8728 -7207 -3930 -391 -2521 1470
15282 1470 4838 3464 1033 -210 335 3045 -1975 -4793 -4388 1547 -1740 -1295 -3829 -453 2146
15267 2146 2973 2121 -3889 -8624 -8791 -9847 -5231 -8171 -9662 -7477 -10758 -11264 -12470 -10997 -4676 3687
$$ packed form
15372A469j584m963k923q88K790Q503J413n553o543n139J922J462k374J878P34
15357i796k435M710n059n05M888N128l886n769l083Q569M124K514L590j96q041
15342e247j730P64m154M941P397n273l648L611O077J0033n80j0230L569O445j377
15327A0598m102q19k380q454m199n521J521N319J262O50L598J744J365o731l598
15312i747J224K767j268N208O824K207m711m258N072l765M93J300j328P43L019
15297C780o12p15n020p447M028P179k148o463m988L678J521L277L539k130L991
15282A470L368j374k431j243N45K710n020k818M05N935l287M45k534L376K599
15267B146Q27q52o010m735j67j056M616k940j491K185l281n06j206J473O321Q363
$$ plain form
15251 3687 8596 9196 9152 6366 7757 7976 6778 4111 4100 2956 4151 1194 1454 1776 -3280 394 3913
15234 3913 4742 2391 3892 5094 -1144 -9871 -11455 -14333 -4544 3441 -2671 -1809 -2649 -6169 -1595
15219 -1595 -12162 -17387 -8638 -556 -4358 -5816 -1038 -5598 -9844 -10164 -4652 -1349 -2966 -1625 -1158
15204 -1158 5395 4865 5029 287 1427 7235 10969 9782 -2162 -2658 3168 2280 4300 6844 2348
15189 2348 -705 -1918 170 4002 4188 5921 4460 4922 7113 6333 1141 2130 -49 3726 2896 938
15173 938 -5925 -6722 -668 753 -5119 -5226 -9701 -7435 -10877 -7619 -123 -526 2059 -1010 -895 -3731
15157 -3731 -6382 -7481 -6733 -7771 -4532 -7089 -3372 2355 4799 5559 6860 5909 7772 12752 8137
15142 8137 4518 2982 -1487 216 7487 5319 2374 422 -1280 64 1348 2133 4777 9653 13320
$$ packed form
15251C687M909O00m4k786J391K19j198k667j1j144J195k957K60L22n056L674L519
15234C913Q29k351J501J202o238q727j584k878R789P985o112Q62q40l520M574
15219a595j0567n225Q749Q082l802j458M778m560m246l20N512L303j617J341M67
15204a158O553n30J64m742J140N808L734j187j1944m96N826q88K020K544m496
15189B348l053j213K088L832J86J733j461M62K191p80n192R89k179L775q30j958
15173I38o863p97O054J421n872j07m475K266l442L258P496m03K585l069J15k836
15157c731k651j099P48j038L239k557L717N727K444P60J301r51J863M980m615
15142H137l619j536m469J703P271k168k945j952j702J344J284P85K644M876L667
$$ plain form
15127 13320 11543 8476 3630 1915 -4440 -5468 -909 47 -6854 -2496 1852 901 5644 2083 -4243
15112 -4243 -7344 -9241 -12674 -14074 -11950 -13515 -12237 -6709 4698 9015 7115 6242 4158 6519 12122
15097 12122 16111 16435 9105 4230 -4618 -6793 -7616 -4953 -3040 -963 -2605 -4646 -19 1991 5271
15082 5271 2439 5612 3609 360 -6424 -6925 -2285 2390 6487 4029 -1814 -6178 -2662 3370 3517
15067 3517 -1398 -2394 -2484 4636 6145 -1686 -1925 -101 2170 2962 -897 -6449 -10022 -15339 -15426 -17745
15051 -17745 -13855 -6259 2094 8496 6523 1419 -3841 -5334 -5452 1007 5723 12743 13392 7593 931
15036 931 3277 3496 2810 -857 -6946 -8765 -9814 -7595 -8823 -11245 -15805 -17179 -13406 -8599 -7583
15021 -7583 -4709 5 126 -2298 -1797 -11889 -21253 -19036 -9028 -635 2874 -2340 -8153 -7736 -3538
$$ packed form
15127A3320j777l067m846j715o355j028M559R56o901M358M348r51M743l561o326
15112d243l101j897l433j400K124j565J278N528J1407M317j900q73k084K361N603
15097A2122L989L24p330m875q848k175q23K663J913K077j642k041M627K010L280
15082E271k832L173k003l249o784n01M640M675M097k458n843m364L516O032J47
15067C517m915r96r0P120J509p831k39J824K271P92l859n552l573n317q7k319
15051a7745L890P596Q353O402j973n104n260j493j18O459M716P020O49n799o662
15036I31K346K19o86l667o089j819j049K219j228k422m560j374L773M807J016
15021g583K874M714J21k424N01j0092r364K217J0008Q393L509n214n813M17M198
$$ plain form
15006 -3538 -5915 -4701 -6460 -3525 -3302 -3513 -3424 -4695 -6153 614 -3545 -6958 -7021 -6998 -3382 5381 2112
14989 2112 -7197 -11038 -8847 -8674 -5471 -8863 -11474 -17021 -15943 -12469 -2826 4257 4809 5851 2334
14974 2334 -41 -4818 -4953 -5984 -2042 6472 11499 5650 -1624 -5148 -9852 -9116 -5280 -8421 -6222
14959 -6222 923 4459 2953 2290 3859 7272 7731 6995 -5338 -8512 -2892 -1934 -2892 -5507 -6872 -4288
14943 -4288 155 6017 6712 5452 1033 4821 10666 9537 6257 2910 -2703 3800 7277 7774 3513
14928 3513 -1787 -977 1485 473 2985 -1812 -434 -1387 176 -921 -4962 -3805 3109 2410 -2495
14913 -2495 457 -4999 -6008 -5475 1722 85 -4168 -4620 -557 -1912 -5939 -1645 4073 -1808 -1527
14898 -1527 -2483 -5116 -483 5101 10848 14615 6915 5828 9766 9407 521 -1376 -2473 -2361 -3508
$$ packed form
15006c538k377J214j759K935K23k11Q9j271j458O767m159l413o3K3L616Q763l269
14989B112r309l841K191J73L203l392k611n547J078L474R643P083N52J042l517
14974B334k375m777j35j031L942Q514N027n849p274l524m704P36L836l141K199
14959f222P145L536j506o63J569L413M59p36j2333l174N620R58r58k615j365K584
14943d288M443N862O95j260m419L788N845j129l280l347n613O503L477M97m261
14928C513n300Q10K462j012K512m797J378r53J563j097m041J157O914o99m905
14913b495K952n456j009N33P197j637m253m52M063j355m027M294N718n881K81
14898a527r56k633M633N584N747L767p700j087L938l59q886j897j097J12j147
$$ plain form
14883 -3508 -10062 -7594 3560 11831 12558 7199 5620 2703 -7734 -12722 -11135 -3902 -3399 -2975 407
14868 407 -1101 -9156 -10811 -15159 -14316 -6509 -1499 -7051 -11130 -2253 232 2069 3474 -2684 -2617 -1407
14852 -1407 -2923 2997 11315 9861 5185 4359 3996 862 -2115 -1755 4420 1789 -3718 -8387 -528
14837 -528 1195 4917 3329 -3934 -1420 4650 3539 8858 4661 -2030 1739 6598 7984 6073 772
14822 772 4378 3551 3435 -1598 -6513 -7687 -5532 -2923 -1875 2202 -5261 -2458 -4318 -3873 3442 3612
14806 3612 -2731 -1231 1724 3864 6351 349 -6668 -12679 -10758 -8276 -10822 -9773 -10972 -8443 -5181
14791 -5181 -10370 -4661 3279 1256 206 -2071 -7121 -13356 -10238 -3044 -5403 -12890 -9621 -5994 -2324
14776 -2324 -5729 -5746 -3433 -2543 -7735 -3638 4106 4685 -283 -3769 -1634 3030 14792 20011 13622
$$ packed form
14883c508o554K468J1154Q271P27n359j579k917j0437m988J587P233N03M24L382
14868D07j508q055j655m348Q43P807N010n552m079Q877K485J837J405o158O7J210
14852a407j516N920Q318j454m676q26l63l134k977L60O175k631n507m669P859
14837e28J723L722j588p263K514O070j111N319m197o691L769M859J386j911n301
14822G72L606q27j16n033m915j174K155K609J048M077p463K803j860M45P315J70
14806C612o343J500K955K140K487o002p017o011J921K482k546J049j199K529L262
14791e181n189N709P940k023j050k277n050o235L118P194k359p487L269L627L670
14776b324l405j7K313Q90n192M097P744N79m968l486K135M664J1762N219o389
$$ plain form
14761 13622 8740 10591 5638 152 2084 4783 5166 8049 8799 4844 1229 -2623 -4781 -4474 -4471 -3643
14745 -3643 -8527 -1877 -1491 -8049 -8261 -4310 650 -4979 -8536 -1737 1767 4677 3955 2552 4798
14730 4798 4659 -703 -5760 -5650 1778 2680 608 -1065 -1325 -3545 -8208 -2117 700 2331 6212 3011
14714 3011 -2254 -3851 -2655 -7736 -4055 -275 -6 3810 1523 -3531 -8222 -9663 -4801 2413 7536
14699 7536 6973 6525 2701 -2189 -9695 -3149 1558 5588 4538 3889 4068 7504 9051 5637 3127 -3263
14683 -3263 -2244 -611 4109 9984 12840 11896 3078 -2556 -6443 -11440 -14531 -6901 -6085 -14229 -16450
14668 -16450 -17869 -17075 -11722 -13307 -13541 -4423 -1798 -5106 -5173 -3129 -588 -313 -1516 -3276 1920 7905
14652 7905 8013 4920 8740 1301 -6307 -8494 -2402 -1326 -4193 -947 3200 7895 7837 10375 10845 7502
$$ packed form
14761A3622m882J851m953n486J932K699L83K883P50l955l615l852k158L07LQ28
14745c643m884O650L86o558k12L951M960n629l557O799L504K910p22j403K246
14730D798j39n362n057J10P428R02k072j673k60k220m663O091K817J631L881l201
14714C011n265j597J196n081L681L780K69L816k287n054m691j441M862P214N123
14699G536n63m48l824m890p506O546M707M030j050o49J79L436J547l414k510o390
14683c263J019J633M720N875K856r44q818n634l887m997l091P630Q16q144k221
14668a6450j419P94N353j585k34R118K625l308o7K044K541K75j203j760N196N985
14652G905J08l093L820p439p608k187O092J076k867L246M147M695n8K538M70l343
$$ plain form
14636 7502 11637 12034 9323 4408 2506 -1262 8616 6085 -2195 -7859 -6426 -5782 -4117 -3007 -128
14621 -128 2095 -4048 -11632 -7611 -1792 -360 -1360 515 -2003 -3954 6109 8289 11533 9966 3714
14606 3714 -886 -94 891 -3679 -4093 346 774 -4770 -9101 -4009 -1510 1382 1800 627 -687 -5335
14590 -5335 -9037 -9476 -3591 -2931 -10416 -13527 -7477 4154 3757 -1453 -2588 -362 -2175 2887 1000
14575 1000 2007 11033 6477 978 4414 3120 -9182 -12071 -11679 -9481 -5991 -4132 -2347 -1850 7047
14560 7047 11217 11415 6122 6851 4076 -398 304 5915 2595 -1986 -3283 -5222 -2333 6104 6888 1382
14544 1382 339 -2172 -799 -997 -7063 -8618 -11775 -15503 -14090 -12272 -13027 -16271 -14369 -5977 -634
14529 -634 2749 4211 -4260 -11472 -7187 -2230 2329 1922 2229 4323 6164 2936 1141 -982 -7445
$$ packed form
14636G502M135L97k711m915j902l768R878k531q280n664J433O44J665J110K879
14621a28K223o143p584M021N819J432j000J875k518j951J0063K180L244j567o252
14606C714m600P92R85m570m14M439M28n544m331N092K499K892M18j173j314m648
14590e335l702m39N885O60p485l111O050J1631l97n210j135K226j813N062j887
14575A000J007R026m556n499L436j294j2302k889L92K198L490J859J785M97Q897
14560G047M170J98n293P29k775m474P02N611l320m581j297j939K889Q437P84n506
14544A382j043k511J373j98o066j555l157l728J413J818p55l244J902Q392N343
14529f34L383J462q471p212M285M957M559m07L07K094J841l228j795k123o463
$$ plain form
14514 -7445 -6313 -2301 1775 6889 4961 8070 5266 1191 4422 5625 4258 2525 -3947 -11368 -8306
14499 -8306 -3744 -1030 2263 649 -2841 1256 5982 12142 8056 2308 1598 2158 -5137 -11518 -10713
14484 -10713 -12791 -11470 -2162 -1549 -2365 -3058 2451 5341 6108 7478 5491 959 1886 -831 -4764 -2180
14468 -2180 3806 5393 3140 1407 1156 2505 950 -2554 -1115 1990 1537 429 399 -2321 -11994 -8909
14452 -8909 -9696 -7068 -3982 -1685 6221 6977 -1869 -5831 2179 7676 6221 2674 3418 1600 -2342
14437 -2342 -2519 483 -3296 -8518 -6797 -433 -1547 2268 3509 2166 3226 -1777 -7154 -3988 2002
14422 2002 9984 8844 6566 -267 -5743 -7482 -11817 -11652 -7159 -1578 -2604 -6226 745 8020 3675
14407 3675 3638 2774 -2129 -4539 -127 1250 2647 4246 1512 2072 52 1032 -257 -15 -1847 -672
$$ packed form
14514g445J132M012M076N114j928L109k804m075L231J203j367j733o472p421L062
14499h306M562K714L293j614l490M097M726O160m086n748p10N60p295o381Q05
14484a0713k078J321R308O13q16o93N509K890P67J370j987m532R27k717l933K584
14468b180N986J587k253j733k51J349j555l504J439L105m53j108l0k720r673L085
14452h909p87K628L086K297P906P56q846l962Q010N497j455l547P44j818l942
14437b342j77L002l779n222J721O364j114L815J241j343J060n003n377L166N990
14422B002P982j140k278o833n476j739m335J65M493N581j026l622O971P275m345
14407C675l7q64m903k410M412J377J397J599k734N60k020R80j289K42j832J175
$$ plain form
14391 -672 477 2269 2932 1227 4012 7520 8500 7891 3008 626 -1330 -2614 1116 -7001 -5786 588
14375 588 -1995 381 960 -2008 -6321 1848 8876 8457 10560 4444 3297 2692 4382 449 2846 5130
14359 5130 8660 7694 9034 7707 2194 -2785 -3330 -2222 2878 3590 5061 5192 2884 4343 5916 11552
14343 11552 4422 1067 1988 5953 10994 13738 8641 2921 -601 -4007 -2945 232 3434 7519 7721
14328 7721 8082 5433 4991 1878 -1617 -2276 258 -3936 -494 -1904 -2452 -2405 3921 -1786 -6813 -4410
14312 -4410 -2327 -906 -1060 -1563 1121 3425 1935 -2935 -8158 -4702 -2275 1361 -2254 -2180 1499 -1368
14296 -1368 -1385 1849 -674 1298 2070 1126 -5255 -5987 3390 10074 10551 5722 2893 5897 5630 7553
14280 7553 1557 391 -2097 -2704 3008 6661 1182 915 -327 293 2579 2945 1389 2642 10560 4740
$$ packed form
14391f72J149J792O63j705K785L508R80o09m883k382j956j284L730q117J215O374
14375E88k583K376N79k968m313Q169P028m19K103o116j147o05J690l933K397K284
14359E130L530r66J340j327n513m979n45J108N100P12J471J31k308J459J573N636
14343A1552p130l355R21L965N041K744n097n720l522l406J062L177L202M085K02
14328G721L61k649m42l113l495o59K534m194L442j410n48M7O326n707n027K403
14312d410K083J421j54n03K684K304j490m870n223L456K427L636l615P4L679k867
14296a368j7L234k523J972P72r44o381p32R377O684M77m829k829L004k67J923
14280G553n996j166k488o07N712L653n479k67j242O20K286L66j556J253P918n820
$$ plain form
14264 4740 -4088 -2676 5991 3989 2331 5462 6783 1237 -639 -5440 -4505 -413 -6052 1017 11004
14249 11004 11444 6052 62 -2856 -2141 -2251 -4075 2963 4826 6023 3237 8147 9135 4989 -2419
14234 -2419 -4266 -6013 -1788 -2384 -27 -2927 -7412 -8957 -4347 -1672 1610 -394 -6690 -8841 -1297
14219 -1297 3309 6102 3648 2600 3389 -1375 -4584 -3787 845 -387 -3327 -4278 -2141 -880 79 1753
14203 1753 -1728 -4058 -2667 -1980 -4710 -2986 -1543 -1768 884 995 2200 1260 -2338 -665 -4916 -14080
14187 -14080 -17537 -14387 -12025 -9377 -1413 681 -6756 -3844 3701 352 -178 -505 5940 12221 15092
14172 15092 8514 7335 9337 15366 15314 10430 9373 7464 7634 14904 18860 19475 20104 21162 28688 39824
14156 39824 51797 73426 116535 175112 213564 247055 250534 249004 259005 258233 255663 217426 160968
$$ packed form
14264D740q828J412Q667k002j658L131J321n546j876m801R35M092n639P069R987
14249A1004M40n392n990k918P15j10j824P038J863J197k786M910R88m146p408
14234b419j847j747M225n96K357k900m485j545M610K675L282k004o296k151P544
14219a297M606K793k454j048P89m764l209P97M632j232k940r51K137J261R59J674
14203A753l481k330J391O87k730J724J443k25K652J11J205r40l598J673m251r164
14187a4080l457L150K362K648P964K094p437K912P545l349n30l27O445O281K871
14172A5092o578j179K002O029n2m884j057j909J70P270L956O15O29J058P526J1136
14156C9824J1973K1629M3109N8577L8452L3491L479j530J0001p72k570l8237n6458
$$ plain form
14143 160968 110455 75737 49319 34810 30501 19655 15605 13970 18693 19744 13137 10957 13716
14130 13716 13802 12081 6339 4965 9429 10354 9694 4185 3986 6232 3805 4370 6241 2316 1157 2044
14114 2044 5009 1748 1875 -622 4484 4831 4258 1753 -1227 708 6102 5404 6154 2841 2892 3149 1748
14097 1748 2843 2861 7676 9604 6705 1447 -2713 -530 8699 11568 7162 1370 5571 6399 4716
14082 4716 2168 -4693 -5582 -1139 2091 -1768 -6652 -11814 -14949 -9786 -9831 -5216 158 610 -1728 -7297
14066 -7297 -9882 -1929 1929 3510 3902 10026 11622 4641 5066 2503 -1702 -3253 -9118 -6279 -2228
14051 -2228 -4749 -4392 2805 6918 9053 9156 6099 5599 6807 8182 13435 15926 19594 11655 7140
14036 7140 -340 1737 7479 8091 7006 1132 6504 13309 17562 9422 874 -3446 -2637 3771 8010
$$ packed form
14143A60968n0513l4718k6418j4509m309j0846m050j635M723J051o607k180K759
14130A3716Q6j721n742j374M464R25o60n509j99K246k427N65J871l925j159Q87
14114B044K965l261J27k497N106L47n73k505k980J935N394o98P50l313N1K57j401
14097A748J095J8M815J928k899n258m160K183R229K869m406n792M201Q28j683
14082D716k548o861q89M443L230l859m884n162l135N163m5M615N374M52k338n569
14066g297k585P953L858J581L92O124J596o981M25k563m205j551n865K839M051
14051b228k521L57P197M113K135J03l057n00J208J375N253K491L668p939m515
14036G140p480K077N742O12j085n874N372O805M253q140q548m320Q09O408M239
$$ plain form
14021 8010 5643 -1254 -4843 -7199 -11063 -11365 -8861 803 9913 23456 29190 33593 46510 64295
14007 64295 75534 73498 52518 32959 25166 19825 16199 7082 2111 2832 1473 2644 5352 8375
13993 8375 6790 6007 193 -6397 -4725 -6261 -4642 -4683 -4145 -1491 2402 2735 1977 2360 3979 731
13977 731 544 -1220 -8477 -15253 -16243 -8620 -3451 -2043 -6736 -3536 -8154 -6789 -3121 -4542 -5565
13962 -5565 -557 -2054 -479 -3666 -3141 -4060 -5593 -1377 -1109 -2511 -3155 3352 14557 15420 17594 14364
13946 14364 14357 16256 10959 11887 12125 10869 8589 11984 5700 -4569 -4112 -8142 -7714 -7610 -12707 -14231
13930 -14231 -14819 -17532 -18099 -13635 -9286 -7754 -3328 -250 -2155 -1125 1748 4822 5344 -2319 -10604
13915 -10604 -7206 -2448 -4567 -1980 2043 4941 2465 1875 -4525 -8429 -8800 -14672 -11661 -1077 -4449
$$ packed form
14021H010k367o897l589k356l864l02K504R664R110J3543N734M403J2917J7785
14007F4295J1239k036k0980j9559p793n341l626r117m971P21j359J171K708L023
13993H375j585p83n814o590J672j536J619m1N38K654L893L33p58L83J619l248
13977G31j87j764p257o776r90P623N169J408m693L200m618J365L668j421j023
13962e565N008j497J575l187N25r19j533M216K68j402o44O507J1205Q63K174l230
13946A4364pJ899n297R28K38j256k280L395o284j0269M57m030M28J04n097j524
13930a4231n88k713n67M464M349J532M426L078j905J030K873L074N22p663q285
13915a0604L398M758k119K587M023K898k476n90o400l904l71n872L011J0584l372
$$ plain form
13900 -4449 -12178 -6037 6061 5058 -451 -6805 -1281 4124 3126 6072 4725 6381 3182 982 3378
13885 3378 -3033 -3667 168 -3454 -3487 618 -866 6508 4082 -2761 -3826 -2411 -1655 -2702 -5796 -10457
13869 -10457 -8458 -6081 -4703 -8617 -6273 -3542 -4655 -4888 -1213 -3563 2000 4834 8067 5716 4481
13854 4481 3779 -1469 -5588 -4904 -8800 -11659 -6946 -5730 -12804 -12297 -6378 512 2799 5404 1606
13839 1606 4208 7348 7439 10584 13847 12553 8822 8612 5801 -2390 -2198 1480 4890 6197 388 -4032
13823 -4032 -3249 -4184 -9077 -12631 -8709 800 2243 -2871 1074 7198 7312 9079 4145 700 -2650
13808 -2650 -12881 -18300 -13935 -5945 -6098 -923 -140 -1239 2488 1238 -4930 -8074 -9960 -3549 6637
13793 6637 6373 2073 1820 897 3651 4978 4810 1882 -1490 -226 -4340 -4801 -506 -3874 -2528 -7540
$$ packed form
13900d449p729O141J2098j003n509o354N524N405r98K946j347J656l199k200K396
13885C378o411o34L835l622l3M105j484P374k426o843j065J415P56j047l094m661
13869a0457J999K377J378l914K344K731j113k33L675k350N563K834L233k351j235
13854D481p02n248m119O84l896k859M713J216p074N07N919O890K287K605l798
13839A606K602L140R1L145L263j294l731k10k811q191J92L678L410J307n809m420
13823d032P83r35m893l554L922R509J443n114L945O124J14J767m934l445l350
13808b650j0231n419M365P990j53N175P83j099L727j250o168l144j886O411J0186
13793F637k64m300k53r23K754J327j68k928l372J264m114m61M295l368J346n012
$$ plain form
13777 -7540 -7185 -2506 4297 8417 6428 3468 -5101 -2157 4275 461 -6963 -9766 -7182 -2271 -1105
13762 -1105 -648 1762 -643 -82 -4157 3529 6884 764 3286 5169 9540 7708 6980 2288 17
13747 17 4705 369 -7297 -4294 -649 -984 -8038 -5349 2775 6368 7004 5046 10391 12683 677
13732 677 -6142 -2196 1622 485 -1693 -1467 -1513 -7666 -19011 -18780 -13267 -17424 -17129 -10724 -7394 -2208
13716 -2208 -3847 -7716 -8005 -3916 -2640 6541 5584 1853 4252 6251 2392 2513 9176 12307 9855
13701 9855 2064 -3673 -4313 2261 222 -584 -950 474 -403 -4866 -12503 -15614 -9533 1974 4462
13686 4462 -3423 -8150 -7846 -2476 1275 -3657 -9117 -3535 -5501 -1919 -1755 -1353 -1341 513 3683 1385
13670 1385 -2311 -6179 -9197 -5975 -7665 -2599 -609 -1036 1818 -2050 -6519 -5078 -8625 -7874 -5778
$$ packed form
13777g540L55M679O803M120j989k960q569K944O432l814p424k803K584M911J166
13762a105M57K410k405N61m075P686L355o120K522J883M371j832p28m692k271
13747A7M688m336p666L003L645l35p054K689Q124L593O36j958N345K292j2006
13732F77o819L946L818j137k178K26m6o153j1345K31N513m157K95O405L330N186
13716b208j639l869k89M089J276R181r57l731K399J999l859J21O663L131k452
13701I855p791n737o40O574k039q06l66J424q77m463p637l111O081J1507K488
13686D462p885m727L04N370L751m932n460N582j966L582J64M02J2J854L170k298
13670A385l696l868l018L222j690N066J990m27K854l868m469J441l547P51K096
$$ plain form
13655 -5778 -2454 93 -3279 -238 846 1739 324 -2760 -4968 -11289 -5385 -3692 -6844 -4061 -1582
13640 -1582 -5719 -5238 -5544 -3399 -3184 83 7752 10875 15033 11636 263 -6989 -10029 -6025 -3161
13625 -3161 -2121 1355 1422 899 -2499 2870 2787 3391 6217 -5074 -6535 -6096 -10164 -7757 -1925 1989
13609 1989 2098 2420 751 1301 8560 10184 11073 9955 2183 -7882 -8043 -6716 -1458 6189 575 6640
13593 6640 9151 6168 3231 -79 5925 5829 2981 3456 -3413 -10427 -14668 -7053 -6254 -7272 -2847 -6148
13577 -6148 -6908 -1658 2505 1112 1038 412 -2566 -2688 -2801 -4443 -6669 -11664 -4768 3529 2006 6416
13561 6416 5479 -1491 -6020 -2967 4238 4323 1052 -1242 -2677 -233 1891 -3880 -5202 -2837 -3771 -1415
13545 -1415 -2519 -2948 2183 4023 2379 447 -6957 -7884 -3725 -3718 -3262 1056 2237 6125 7490 3325
$$ packed form
13655e778L324K547l372L041J084Q93j415l084k208o321N904J693l152K783K479
13640a582m137M81l06K145K15L267P669L123M158l397j1373p252l040M004K864
13625c161J040L476O7n23l398N369q3O04K826j1291j461M39m068K407N832L914
13609A989J09L22j669N50P259J624Q89j118p772j0065j61J327N258P647n614O065
13593F640K511k983k937l310O004r6k848M75o869p014m241P615P99j018M425l301
13577f148p60N250M163j393p4o26k978j22j13j642k226m995O896Q297j523M410
13561F416r37o970m529L053P205Q5l271k294j435K444K124n771j322K365r34K356
13545a415j104m29N131J840j644j932p404r27M159PM56M318J181L888J365m165
$$ plain form
13529 3325 -4803 -2318 -1634 -511 -1820 -6815 -6419 -4667 -3704 -297 3709 2476 -3054 -5110 -3795
13514 -3795 -2098 -2001 -6470 -5671 -6173 -8591 -4559 -1314 -2038 -5649 -1503 -693 -922 -476 -379 -3961 -2458
13497 -2458 -2301 1842 10631 14087 14523 8603 1483 -758 1514 4476 3554 340 -4124 -10176 -6969
13482 -6969 -3733 1153 4133 7533 5763 -5277 -2049 -3881 -2335 6456 141 -4384 -3325 -8278
13468 -8278 -8995 -533 -5354 -9487 -7458 -4897 -7548 -8672 -5760 -6217 -7832 -8049 -7921 -13526 -13486 -6132
13452 -6132 -3286 -4336 -5827 -5898 -3374 -5341 -11505 -7788 9 2640 5655 7228 9782 7230 5961
13437 5961 6062 5050 -1371 -1357 -2959 336 3881 -2438 -11048 -11535 -6355 1416 5397 10629 5842 4174
13421 4174 4080 3636 2557 4553 10340 15725 14340 9119 2756 3432 3000 -6965 -9443 -10594 -8213 -2110
$$ packed form
13529C325q128K485O84J123j309m995L96J752R63L407M006j233n530k056J315
13514c795J697R7m469P99n02k418M032L245p24l611M146Q10k29M46R7l582J503
13497b458J57M143Q789L456M36n920p120k241K272K962r22l214m464o052L207
13482f969L236M886K980L400j770j1040L228j832J546Q791o315m525J059m953
13468h278p17Q462m821m133K029K561k651j124K912m57j615k17J28n605M0P354
13452f132K846j050j491p1K524j967o164L717P797K631L015J573K554k552j269
13437E961J01j012o421J4j602L295L545o319q610m87N180P771L981N232m787j668
13421D174r4m44j079J996N787N385j385n221o363O76m32r965k478j151K381O103
$$ plain form
13405 -2110 2212 1456 -2759 -4080 -5797 -6146 -9549 -11714 -15925 -13106 -8897 -8289 -5395 -3276 -6556
13390 -6556 -3274 -2508 -446 -1483 602 2522 7197 8986 10651 7093 1678 -3791 -1981 3634 2398
13375 2398 -5005 -10792 -3462 -575 -6771 -8025 -4878 -6789 -7801 -11090 -18924 -22648 -23292 -12686 -392
13360 -392 4887 1725 -1257 -1797 245 -128 519 -462 -4065 -8425 -492 7378 5712 2394 -1580 -1051
13344 -1051 158 3421 4927 1832 -2411 -5373 -2892 -1125 850 -618 -7982 -14044 -11408 -5273 -3119
13329 -3119 6791 10096 8149 8325 1658 -7754 -3851 -603 -3269 3843 6430 3390 -164 3006 6567
13314 6567 -1043 2937 5483 910 3317 1536 1107 7621 5769 -5250 -7542 -886 3965 9223 10127
13299 10127 10893 10038 11838 17762 16532 8812 6425 4808 5495 4749 6530 5682 -1344 449 -503 -259
$$ packed form
13405b110M322p56m215j321j717l49l403k165m211K819M209O08K894K119l280
13390f556L282P66K062j037K085J920M675J789J665l558n415n469J810N615j236
13375B398p403n787P330K887o196j254L147j911j012l289p834l724o44J0606J2294
13360c92N279l162k982n40K042l73O47r81l603m360P933P870j666l318l974N29
13344a051J209L263J506l095m243k962K481J767J975j468p364o062K636O135K154
13329c119R910L305j947J76o667r412L903L248k666P112K587l040l554L170L561
13314F567p610L980K546m573K407j781m29O514j852j1019k292O656M851N258R04
13299A0127P66q55J800N924j230p720k387j617O87p46J781q48p026J793r52K44
$$ plain form
13283 -259 -2104 -8304 -6410 1812 2201 4026 3804 607 -1115 2110 2581 4519 2294 -4539 -3843 -3964
13267 -3964 -3159 328 4098 5935 8475 4099 3697 4836 1539 -510 -1691 -3337 -7291 -4031 -5560
13252 -5560 -5411 -8785 -5613 -1140 2654 -2703 -8761 -13925 -11769 -7684 -5158 -1540 -7272 -6784 -3645
13237 -3645 -130 1217 -4318 -5371 -8671 978 1644 -4686 -6951 -7706 -2156 -1799 -4518 -1806 -413
13222 -413 -3867 -10643 -13943 -7062 -5294 -3362 -960 -1556 -4171 -7488 -4624 2265 6026 2736 -585
13207 -585 -1940 1257 7042 6183 1713 -1059 -106 3107 277 -1112 -1690 -1679 -4853 -4796 -237 87 -4280
13190 -4280 -3490 -4645 -10601 -6841 2781 -3192 -11902 -10993 -7290 -4713 -2513 -1162 1410 7507 8147
13175 8147 9448 9448 9156 1188 -2712 -4675 7945 8991 3716 1854 2756 4479 9323 5471 -4885
$$ packed form
13283b59j845o200J894Q222L89J825k22l197j722L225M71J938k225o833O96j21
13267c964Q05L487L770J837K540m376m02J139l297k049j181j646l954L260j529
13252e560J49l374L172M473L794n357o058n164K156M085K526L618n732M88L139
13237c645L515J347n535j053l300R649O66o330k265p55N550L57k719K712J393
13222d13l454o776l300O881J768J932K402n96k615l317K864O889L761l290l321
13207e85j355L197N785q59m470k772R53L213k830j389n78J1l174N7M559L24m367
13190d280P90j155n956L760R622n973q710R09L703K577K200J351K572O097O40
13175H147J301%k92p968l900j963J2620J046n275j862R02J723M844l852j0356
$$ plain form
13160 -4885 -2443 -1574 -3710 1923 -3040 -1777 -821 -12125 -16124 -11149 -9086 -5534 -2115 -1174 -791
13145 -791 -1217 -2920 -10462 -14105 -9696 -13466 -10281 -1233 1481 -4705 -6527 -7164 -4155 -3449 -6256 -5023
13129 -5023 -7067 -10910 -5023 1609 3196 986 2961 11256 14388 15790 12231 7663 4266 7232 11945
13114 11945 11143 7105 5867 4816 1051 -378 5754 5519 2145 -2274 -1350 3399 3312 -2648 -6362 -3252
13098 -3252 2459 1209 2442 2497 642 -4973 -9236 -7497 -5397 -6760 -10915 -6411 -7941 -5340 1216
13083 1216 -187 393 2081 2008 -2055 -7397 -5200 -1218 7362 7681 1161 -4965 -11638 -10696 -8442 -6475
13067 -6475 -2680 5778 -1987 -2107 3404 1030 -1305 -5606 -7124 7859 8667 -2 -5137 128 3857
13052 3857 -3017 -3718 -2124 156 3585 7834 9158 12497 11842 17183 22086 17578 8984 5485 1646
$$ packed form
13160d885K442Q69k136N633m963J263R56j1304l999M975K063L552L419R41L83
13145g91m26j703p542l643M409l770L185R048K714o186j822o37L009P06k807J233
13129e023k044l843N887O632J587k210J975Q295L132J402l559m568l397K966M713
13114A1945q02m038j238j051l765j429O132k35l374m419R24M749q7n960l714L110
13098c252N711j250J233N5j855n615m263J739K100j363m155M504j530K601O556
13083A216j403N80J688p3m063n342K197L982Q580L19o520o126o673R42K254J967
13067f475L795Q458p765j20N511k374k335m301j518J4983Q08q669n135N265L729
13052C857o874p01J594K280L429M249J324L339o55N341M903m508q594l499l839
$$ plain form
13037 1646 -1437 1020 1557 -5568 -10777 -10882 -11981 -8575 -1959 -992 -3849 2761 3233 -796 -4777 -1834
13021 -1834 -4894 -6159 -10057 -10859 -8965 -11030 -16848 -13098 -5275 -6887 -745 3957 1764 -1110 -7387
13006 -7387 -11804 -8675 -5837 -2794 -2128 -1092 -7139 -10769 -9232 -4019 -5078 -7166 -1834 -9198 -19501
12991 -19501 -20208 -21327 -14844 -10018 -242 11905 13664 6669 416 4504 2793 3827 3897 6773 3695
12976 3695 -1591 5070 10351 9639 11039 5708 7495 9405 6273 12685 14753 9857 2355 -1279 -7711
12961 -7711 -1995 -4599 -11560 -7785 -4601 -10181 -10407 -3347 2681 2306 -2592 -2310 6338 11380 14827
12946 14827 10153 3131 -1961 -9210 -6344 -3196 154 -2580 786 3666 6391 -1275 -8191 -381
12932 -381 13663 19749 17858 16403 13815 13873 19577 10790 5732 1615 2659 2458 5698 4110 -2901
$$ packed form
13037A646l083K457N37p125n209j05j099L406O616R67k857O610M72m029l981K943
13021a834l060j265l898q02J894k065n818L750P823j612O142M702k193k874o277
13006g387m417L129K838L043O66J036o047l630J537N213j059k088N332p364j0303
12991a9501p07j119O483M826R776J2147J759o995o253M088j711J034P0K876l078
12976C695n286O661N281p12J400n331J787J910l132O412K068m896p502l634o432
12961g711N716k604o961L775L184n580k26P060O028l75m898K82Q648N042L447
12946A4827m674p022n092p249K866L148L350k734L366K880K725p666o916P810
12932c81J4044O086j891j455k588N8N704q787n058m117J044k01L240j588p011
$$ plain form
12917 -2901 -8020 -6653 -494 8412 9580 1120 -2502 -9818 -8418 -634 -2741 -4778 -10219 -13496 -8051
12902 -8051 -7651 -9158 -3221 4370 -2275 349 10706 5387 2580 -182 -1902 -6764 -6079 -3200 -9126
12887 -9126 -9118 -1175 -1259 -4473 -5857 -8123 -6074 -4382 -4048 -5086 -3698 -2231 -718 -2100 -4033 -5779
12871 -5779 -2561 2998 2734 -72 2808 6884 4918 4232 1723 -824 -961 968 -5998 -11495 -6047
12856 -6047 -1173 586 3872 9954 10117 1277 -7353 -12967 -19227 -17731 -13641 -3513 1162 -7633 -12128
12841 -12128 -13310 -9654 -396 3586 -5457 -5997 -2941 -306 2042 4241 10495 12748 11634 4605 518
12826 518 1217 46 3169 9416 9430 5998 1948 2899 190 -1757 -6059 -7477 -9535 -2240 1835 5314
12810 5314 91 1930 5008 6940 9497 637 -9855 -3407 -7146 -10646 -10348 -14199 -14274 -16028 -14538
$$ packed form
12917b901n119J367O159Q906J168q460l622p316J400P784k107k037n441l277N445
12902h051M00j507N937P591o645K624J0357n319k807k762j720m862O85K879n926
12887i126QP943q4l214j384k266K049J692L34j038J388J467J513j382j933j746
12871e779L218N559k64k806K880M076j966o86k509k547j37J929o966n497N448
12856f047M874J759L286O082J63q840q630n614o260J496M090J0128M675q795m495
12841a2128j182L656R258L982r043n40L056K635K348K199O254K253j114p029m087
12826E18O99j171L123O247J4l432m050R51k709j947m302j418k058P295M075L479
12810E314n223J839L078J932K557q860j0492O448l739l500K98l851p5j754J490
$$ plain form
12795 -14538 -9714 -9784 -9176 -7786 -4153 -3268 -3327 -10463 -8669 -9584 -4372 -7962 -13774 -14156 -14652 -6253 -3857
12778 -3857 -11078 -11690 -6854 -11883 -14995 -6399 82 -780 -8628 -13804 -9390 -6597 -5256 -6858 -3994
12763 -3994 940 -2324 -7254 -5019 7647 8817 4677 -3514 1165 -2768 -6474 -8966 -6803 328
12749 328 1883 -1146 487 445 -2764 -7062 -4586 344 1488 5808 11517 10618 5702 328 -795 -1885
12733 -1885 -4160 -6547 -676 7503 6993 5170 -2268 -3880 5067 2870 -4951 -1725 3060 3251 2478
12718 2478 2358 -3125 -7985 -5079 -1432 2804 -1189 -4540 6413 15414 20182 21691 11947 10656 4564
12703 4564 2148 8002 6884 6945 9893 4793 -3867 -13201 -9288 -1255 -2923 -3491 -2919 1130 6838 5052
12687 5052 1083 1136 2674 6224 13848 9768 -2720 -6276 -7549 -13043 -12215 -7499 -4020 -3899 -8821
$$ packed form
12795a4538M824p0O08J390L633Q85n9p136J794r15N212l590n812l82m96Q399K396
12778c857p221o12M836n029l112Q596O481q62p848n176M414K793J341j602K864
12763c994M934l264m930K235J2666J170m140q191M679l933l706k492K163P131
12749C28J555l029J633m2l209m298K476M930J144M320N709q99m916n374j123j090
12733a885k275k387N871Q179n10j823p438j612Q947k197p821L226M785J91p73
12718B478j20n483m860K906L647M236l993l351J0953R001M768J509r744j291o092
12703D564k416N854j118O1K948n100q660r334L913Q033j668n68N72M049N708j786
12687E052l969N3J538L550P624m080j2488l556j273n494Q28M716L479J21m922
$$ plain form
12672 -8821 -8080 -8444 -8082 -1735 -2948 -7837 -11754 -9274 -10477 -10707 -9759 -13029 -10867 -1113 1428 -738
12656 -738 -2044 -3288 -6577 -8712 -2180 -461 -7370 -13340 -10154 -7556 -6099 550 4596 -1000 -1766
12641 -1766 -1090 -3392 -961 6664 1755 -8545 -13269 -6694 2228 145 -2785 -3912 -4894 -2262 -3310
12626 -3310 -2681 1330 4098 5371 1232 609 -797 -7614 -9371 -7160 -3612 -5597 -10412 -12915 -10482
12611 -10482 -1843 -1222 -5048 -160 1145 3179 -3493 -6933 -4160 -9449 -10606 -5178 -6234 -1974 -949
12596 -949 -1213 4443 6850 2809 -1955 -1745 1907 8901 6345 6435 2498 -1865 -2145 2076 6371 1369
12580 1369 -282 -3062 1428 4685 2572 3208 -5987 -14004 -11942 -6222 -1701 -4122 -1060 -4186 1455
12565 1455 12706 14880 13253 2668 -3880 5522 16214 10231 2402 4775 -321 -2210 -3231 -2502
$$ packed form
12672h821P41l64L62O347j213m889l917K480j203k30R48l270K162R754K541k166
12656g38j306j244l289k135O532J719o909n970L186K598J457O649M046n596p66
12641a766O76k302K431P625m909j0300m724O575Q922k083k930j127r82K632j048
12626c310O29M011K768J273m139o23j406o817j757K211L548j985m815k503K433
12611a0482Q639O21l826M888J305K034o672l440K773n289j157N428j056M260J025
12596i49k64N656K407m041m764K10L652O994k556R0l937m363k80M221M295n002
12580A369j651k780M490L257k113O36r195q017K062N720M521k421L062l126N641
12565A455J1251K174j627j0585o548R402J0692n983p829K373n096j889j021P29
$$ plain form
12551 -2502 -650 -336 957 6896 3277 1327 -3295 -9337 -12621 -6889 -3109 23 -3261 3407 4261
12536 4261 609 -3199 361 1964 2672 746 -9384 -8510 -6117 -1477 1865 2043 3189 6321 7233
12521 7233 1802 -3639 -2333 -5806 -9250 -743 2509 1907 -6538 -14244 -8352 2267 2305 -3270 -8277
12506 -8277 -8891 -15013 -12851 -15198 -13739 -10128 -14250 -17223 -9652 -4269 2138 151 -1646 -5557 -5807
12491 -5807 -10095 -4626 -3526 5291 2976 -2299 -6629 -3526 -5211 -7266 -7177 -4120 -4604 -4454 -3414 -6192
12475 -6192 -10882 -4219 5704 5856 993 -428 3750 5339 3294 -5363 -47 2140 -4261 1755 6761
12460 6761 5236 5692 4775 1223 4893 5839 -3949 -4721 -4533 -2549 6717 9821 7545 8594 9732 6492
12444 6492 -544 -7603 -13847 -4664 -3922 4995 6227 4554 4044 7607 387 -8774 -12830 -8712 -1756
$$ packed form
12551b502J852L14J293N939l619j950m622o042l284N732L780L132l284O668Q54
12536D261l652l808L560J603P08j926j0130Q74K393M640L342J78J146L132R12
12521G233n431n441J306l473l444Q507L252o02q445p706N892J0619L8n575n007
12506h277o14o122K162k347J459L611m122k973P571N383O407j987j797l911k50
12491e807m288N469J100Q817k315n275m330L103j685k055Q9L057m84J50J040k778
12475f192m690O663R923J52m863j421M178J589k045q657N316K187o401O016N006
12460F761j525M56r17l552L670R46r788p72J88J984R266L104k276J049J138l240
12444F492p036p059o244R183P42Q917J232j673n10L563p220r161m056M118O956
$$ plain form
12429 -1756 801 5591 9651 10679 10039 10514 3005 1351 2713 8292 14502 8759 5959 9439 6187
12414 6187 -455 1201 620 2282 733 6905 6293 2208 -1906 -8490 -13181 -9339 -4880 -1861 950
12399 950 3177 4989 5673 4696 -75 2502 -2579 -1584 3729 9322 8949 3484 3557 -2468 -4500 1342
12383 1342 1592 3774 2303 -3543 -4621 -5272 -7290 -5489 -3782 -9971 -6709 -3965 1148 7994 8193
12368 8193 9093 10195 7457 3424 5722 6642 3839 11211 11313 6594 -309 -5349 -6408 -3507 1234
12353 1234 2714 747 -2695 -4648 -6053 933 6390 8567 6290 -3796 -2459 95 2677 8338
12339 8338 6230 4123 1062 -6196 -6001 -5372 -5989 -2063 660 1578 4841 6236 2903 -2296 -7027 -4334
12323 -4334 -2248 1673 6363 7522 4526 2802 316 868 1279 -1850 -2645 -905 -1172 -5499 -9884 -11134
$$ packed form
12429a756K557M790M060J028o40M75p509j654J362N579O210n743k800L480l252
12414F187o642J656n81J662j549O172o12m085m114o584m691L842M459L019K811
12399I50K227J812O84r77m771K577n081R95N313N593l73n465P3o025k032N842
12383A342K50K182j471n846j078o51k018J801J707o189L262K744N113O846J99
12368H193R00J102k738m033K298R20k803P372J02m719o903n040j059K901M741
12353A234J480j967l442j953j405O986N457K177k277j0086J337K554K582N661
12339H338k108k107l061p258J95O29o17L926K723R18L263J395l333n199m731K693
12323d334K086L921M690J159k996j724k486N52M11l129p95J740k67m327m385j250
$$ plain form
12307 -11134 -6067 -2753 -3711 -794 -7690 -13848 -11798 -8638 -11187 -14137 -13768 -15407 -12225 -5464 -2366
12292 -2366 -9143 -14873 -15129 -9558 -7439 -9412 -4775 5539 3122 -959 -350 -519 -1596 -5146 -7857
12277 -7857 -7161 -6036 -6487 -4087 -1610 2097 3166 428 -2854 3481 3896 5384 -237 -1327 -2890
12262 -2890 2206 969 2944 5794 1621 2954 5126 3151 1043 91 -938 -740 -104 -554 1256 -1884
12246 -1884 -4528 -141 -4549 -5188 -5031 -9202 -6745 -5779 -7970 -8200 -6983 -8807 -4640 -3513 -6166 -10749
12230 -10749 -9924 -5446 -2649 135 504 -6150 -9282 -4968 -1640 -3376 -12695 -15916 -27557 -23596 -15671
12215 -15671 -8994 -1126 4099 6603 3343 3335 495 3236 3869 2359 4146 -709 386 4745 2097
12200 2097 2666 3618 -2719 -2359 -2623 -8445 -3582 -3692 -4830 -3627 -4691 -5507 -9808 -8898 4531 8632
$$ packed form
12307a1134N067L314r58K917o896o158K050L160k549k950L69j639L182O761L098
12292b366o777n730k56N571K119j973M637J0314k417m081O09j69j077l550k711
12277g857O96J125m51K400K477L707J069k738l282O335M15J488n621j090j563
12262b890N096j237J975K850m173J333K172j975k108r52j029J98O36m50J810l140
12246a884k644M387m408o39J57m171K457R66k191k30J217j824M167J127k653m583
12230a0749Q25M478K797K784L69o654l132M314L328j736r319l221j1641L961P925
12215a5671O677P868N225K504l260qk840K741O33j510J787m855J095M359k648
12200B097N69R52o337L60k64n822M863j10j138J203j064q16m301R10J3429M101
$$ plain form
12184 8632 7075 1609 -20 1581 4200 3614 -4060 -9382 -6460 -3385 -6135 -5322 -3018 4310 2777
12169 2777 87 4008 4726 4635 6861 7015 -3847 -10311 -13300 -3685 8767 4688 -1457 -3037 -4684
12154 -4684 -2961 -2521 -2607 -4693 -252 2593 2294 2163 907 1713 -3971 -7743 -11285 -14835 -17129 -12894
12138 -12894 -7812 -5954 -7832 -7612 3670 135 728 2372 -2783 1470 -116 -5193 -6817 -143 1869
12123 1869 6566 5085 7265 1877 -2359 -4837 -5546 -1549 148 2297 3321 -1976 -5147 -6044 -6920
12108 -6920 -7522 -14220 -11670 -6485 -4938 -1997 -2051 -8718 -6588 -773 -4763 -12812 -16877 -15993 -14860 -11074
12092 -11074 -7885 -2713 -47 525 3654 3597 10087 3871 -3088 -3709 -933 -5077 -4324 -2972 -2153 -3401
12076 -3401 -7741 -1559 281 3827 2634 -2629 -4855 2487 8051 8122 5826 3658 5680 1322 -4046
$$ packed form
12184H632j557n466j629J601K619n86p674n322K922L075k750Q13K304P328j533
12169B777k690L921P18r1K226J54j0862o464k989R615J2452m079o145j580j647
12154d684J723M40q6k086M441K845k99j31j256Q06n684l772l542l550k294M235
12138a2894N082J858j878K20J1282l535N93J644n155M253j586n077j624O674K012
12123A869M697j481K180n388m236k478p09L997J697K149J024n297l171q97q76
12108f920o02o698K550N185J547K941n4o667K130N815l990q049m065Q84J133L786
12092a1074L189N172K666N72L129n7O490o216o959o21K776m144P53J352Q19j248
12076c401m340O182J840L546j193n263k226P342N564P1k296k168K022m358n368
$$ plain form
12061 -4046 -1781 -1297 -5761 -2878 -2379 -7118 -6551 435 1977 -7188 -9593 -8805 -7605 -6069 -2841 -5894
12045 -5894 -1590 -2097 -2320 1251 3632 1412 8893 4650 -7731 -11138 -7286 -7477 -2544 3376 555
12030 555 2110 1216 3382 5915 2395 -5249 -12305 -9059 -5929 -8119 -4891 6091 13392 10101 8466
12015 8466 442 -4114 -7498 -5524 -5713 -5881 -5620 -9920 -15394 -17938 -23554 -18417 -6474 -2296 -4056
12000 -4056 -6935 -3539 -1849 -2984 -3845 6782 12271 5561 507 761 1150 -549 -6538 -10662 -9784
11985 -9784 -3962 -2847 -11889 -7866 3910 6511 10514 6530 -1260 -8339 -6580 -609 -3041 -3005 -1732
11970 -1732 -3861 3136 -423 -1355 3518 1947 -4026 -7980 -10422 -6025 -3705 -6666 -2594 875 -3358
11955 -3358 -4391 -3178 -3684 -5266 -5613 1244 4783 3306 1146 367 2010 813 1701 2001 2397 2034
$$ packed form
12061d046K265M84m464K883M99m739N67O986J542r165k405P88J200J536L228l053
12045e894M304n07k23L571K381k220P481m243j2381l407L852j91M933N920k821
12030E55J555q94K166K533l520p644p056L246L130k190L228J0982P301l291j635
12015H466q024m556l384J974j89j68K61m300n474k544n616N137J1943M178j760
12000d056k879L396J690j135q61J0627N489o710n054K54L89j699n989m124Q78
11985i784N822J115r042M023J1776K601M003l984p790p079J759N971k432L6J273
11970a732k129O997l559r32M873j571n973l954k442M397K320k961M072L469m233
11955c358j033J213n06j582l47O857L539j477k160p79J643j197Q88L00L96l63
$$ plain form
11939 2034 -7314 -15234 -10653 -2456 3351 2035 -7072 -9436 -2544 -3262 -3937 54 1002 1950 -2950 2521
11923 2521 3290 -4004 -3483 -3423 -4832 -4751 -1280 460 3598 3743 6474 8531 9902 6087 -2401 -926
11907 -926 168 -1558 -610 -1674 -475 -1207 -420 3614 2207 1311 7639 2641 -1441 -6900 -10907 -8526
11891 -8526 -11422 -8224 -1944 1526 2699 -3435 -337 -604 -3194 -6529 -10244 -11428 -7903 -7950 -1151
11876 -1151 5125 6719 4677 2318 906 26 -1819 -5494 -12581 -9432 -5374 617 -3889 -10016 -655
11861 -655 6077 11346 4976 793 -2484 -6205 -1649 4007 7031 -4320 -9757 -7671 -5363 -8214 -7780
11846 -7780 -12135 -9283 -8174 -13449 -17950 -19906 -17458 -15605 -7015 -1514 -1406 -4442 -5436 -8095 -11322
11831 -11322 -9721 -10352 -11102 -6813 -4103 -1920 -974 -3798 1901 12198 15420 10250 857 -6678 -7172
$$ packed form
11939B034r348p920M581Q197N807j316r107k364O892p18o75L991R48R48m900N471
11923B521P69p294N21O0j409Q1L471J740L138J45K731K057J371l815q488J475
11907i26J094j726R48j064J199p32P87M034j407q96O328m998m082n459m007K381
11891h526k896L198O280L470J173o134L098k67k590l335l715j184L525m7O799
11876a151O276J594k042k359j412q80j845l675p087L149M058N991m506o127R361
11861f55O732N269o370m183l277l721M556N656L024j1351n437K086K308k851M34
11846g780m355K852J109n275m501j956K448J853Q590N501J08l036r94k659l227
11831a1322J601o31p50M289K710K183R46k824N699J0297L222n170r393p535m94
$$ plain form
11816 -7172 -2518 488 2525 -3598 -2715 795 2135 -3942 151 3348 1961 3249 6097 8275 5611
11801 5611 6498 5352 6060 1929 1092 3042 3901 -3455 -10296 -11039 -1956 762 4407 5341 7840 3530
11785 3530 -3840 -9143 -8263 -1921 2036 -1398 -1702 4525 5756 1993 -3398 -2876 -3402 -5516 1770 6782
11769 6782 1629 -8036 -11213 -7155 -3500 -3984 2060 -6079 -3928 -1685 232 -2658 -3607 -6973 -3897
11754 -3897 -972 -338 -2265 -819 -942 -1736 -1591 2267 3666 -903 -500 481 -854 -7119 -9757 -4280
11738 -4280 -2123 -3136 -2262 -5148 -4618 1531 2160 2509 -1106 -6505 -194 8523 9478 6741 475 -6489
11722 -6489 -2336 -141 1406 1121 -177 -2122 -1172 -3156 -1720 721 1416 1789 -930 -2275 -5094 -11376
11706 -11376 -10277 -2913 -5708 -6034 -2494 2016 870 3592 -2651 -7297 -5027 55 -4454 -6092 -9340
$$ packed form
11816g172M654L006K037o123Q83L510J340o077M093L197j387J288K848K178k664
11801E611Q87j146P08m131q37J950Q59p356o841p43R083K718L645R34K499m310
11785C530p370n303Q80O342L957l434l04O227J231l763n391N22n26k114P286N012
11769F782n153r665l177M058L655m84O044q139K151K243J917k890r49l366L076
11754c897K925O34j927J446j23p94J45L858J399m569M03R81j335o265k638N477
11738d280K157j013Q74k886N30O149O29L49l615n399O311Q717R55k737o266o964
11722f489M153K195J547k85j298j945R50j984J436K441O95L73k719j345k819o282
11706a1376J099P364k795l26L540M510j146K722o243m646K270N082m509j638l248
$$ plain form
11691 -9340 -5513 -2505 828 -1297 -1613 -6137 -4748 -3349 -6303 -6804 -849 5163 5748 4115 -3530
11676 -3530 -5595 -9098 -6919 -9650 -14589 -15880 -7087 -295 325 4688 4511 914 -1027 -302 6545
11661 6545 4778 3917 783 -3757 -1592 -2435 -3367 -2235 294 -7791 -5655 -1845 -5383 -8512 -3176
11646 -3176 -1229 -13 2135 2299 281 -1932 -555 1829 9706 18013 16917 12216 6275 5865 8014
11631 8014 9072 5040 2177 3340 -1034 -7920 -7064 -2855 3195 15099 15400 5459 2541 -605 -9137
11616 -9137 -11375 -6388 -3117 -5839 -5081 43 5336 -3986 -13483 -18384 -17032 -8513 -5715 -5101 -12891
11601 -12891 -16455 -12365 -5844 -2692 1805 5386 2807 7973 9734 1189 1157 6360 7105 7197 4382 -382
11585 -382 -6952 -5984 -2229 -2774 -7199 -9481 -7118 -8723 -8582 -12135 -6036 -9105 -15438 -7917 -2187 2834
$$ packed form
11691i340L827L008L333k125l16m524J389J399k954n01N955O012N85j633p645
11676c530k065l503K179k731m939j291Q793O792O20M363j77l597j941P25O847
11661F545j767q61l134m540K165q43r32J132K529q085K136L810l538l129N336
11646c176J947J216K148J64k018k213J377K384P877Q307j096m701n941m10K149
11631H014J058m032k863J163m374o886Q56M209O050J1904L01r941k918l146q532
11616i137k238M987L271k722P58N124N293r322r497m901J352Q519K798O14p790
11601a2891l564M090O521L152M497L581k579N166J761q545l2N203P45R2k815m764
11585c82o570R68L755n45m425k282K363j605J41l553O099l069o333P521N730N021
$$ plain form
11569 2834 4603 9563 7816 -1192 -4574 -5124 -3457 97 -5938 -4393 -4144 -4862 -7200 -11863 -13785
11554 -13785 -7995 -7425 -8121 -5558 -572 1283 2536 4017 4788 855 -4038 -5949 -7643 -5371 -5250
11539 -5250 -6467 -1555 -2271 -6535 -4345 -2347 -6184 -7304 -6328 -2299 1483 1304 -675 47 4616 995
11523 995 -1468 -3867 -4372 -1979 -2046 -1461 -1989 -5919 -5006 -1913 -2728 -3427 -202 1658 2841 6647 3103
11506 3103 1495 2490 -219 -3532 -2884 2854 3570 -1071 -17 -5353 -3596 -6714 -15407 -16526 -6676
11491 -6676 -1012 3155 3600 -4115 -5348 -4870 -1396 4781 9228 4497 2459 1156 921 5368 -562
11476 -562 -1315 7341 7702 1584 7110 11212 8663 6559 1667 -2607 -5836 -1103 1528 3109 6499
11461 6499 4023 -1320 241 -4642 -8225 -504 715 -5377 -2522 21 -1953 -6174 -7742 -6239 -3849
$$ packed form
11569B834J769M960j747r008l382n50J667L554o035J545K49p18k338m663j922
11554a3785N790N70o96K563M986J855J253J481P71l933m893j911j694K272J21
11539e250j217M912p16m264K190J998l837j120R76M029L782j79j979P22M569l621
11523I95k463k399n05K393o7N85n28l930R13L093q15o99L225J860J183L806l544
11506C103j608R95k709l313O48N738P16m641J054n336J757l118q693j119R850
11491f676N664M167M45p715j233M78L474O177M447m731k038j303k35M447n930
11476e62p53Q656L61o118N526M102k549k104m892m274l229M733K631J581L390
11461F499k476n343J561m883l583P721J219o092K855K543j974m221j568J503K390
$$ plain form
11446 -3849 -1234 580 -1094 372 659 7617 7571 573 5122 9023 8069 9669 10008 3059 -6646 -5258
11430 -5258 908 6928 13398 11701 7475 3250 513 3603 2624 979 3850 2052 -1300 3631 10392
11415 10392 12461 8421 4740 3131 4633 8284 7198 8163 12488 11403 9305 9772 9920 5052 6126
11400 6126 343 -3900 -1754 2185 1611 240 -4385 -2978 -2682 452 3637 4445 3840 6176 9239 5771
11384 5771 5690 8266 10959 13614 18414 17523 11781 4664 2341 3581 12490 1863 -2420 754 5219
11369 5219 4174 2817 5112 1732 1979 -4500 -4428 -2880 -8789 -5867 -8961 -6333 -6841 -7124 -6703 -8214
11353 -8214 -9619 -9759 -8877 -5311 -3507 -2761 -1534 1978 -748 -3550 -10193 -6077 2273 917 2147
11338 2147 9502 11091 14392 9316 -3205 -4113 2364 3066 -3886 -411 2097 7237 7905 15705 16674
$$ packed form
11446c849K615J814j674J466K87O958m6o998M549L901r54J600L39o949r705J388
11430e258O166O020O470j697m226m225k737L090r79j645K871j798l352M931O761
11415A0392K069m040l681j609J502L651j086R65M325j085k098M67J48m868J074
11400F126n783m243K146L939n74j371m625J407K96L134L185Q08o05K336L063l468
11384E771q1K576K693K655M800q91n742p117k323J240Q909j0627m283L174M465
11369E219j045j357K295l380K47o479P2J548n909K922l094K628n08k83M21j511
11353h214j405j40Q82L566J804P46J227L512k726k802o643M116Q350j356J230
11338B147P355J589L301n076j2521r08O477P02o952L475K508N140O68P800R69
$$ plain form
11323 16674 3539 -6755 -5743 -6178 -2484 5799 14124 14039 11425 15623 14445 8292 6570 5997 4313
11308 4313 1576 1374 3314 -459 -4844 -6489 -11769 -10595 -14933 -15289 -14464 -6518 728 1850 1663 3249
11292 3249 5082 5171 10373 6205 163 -1377 6468 10054 8129 8509 6582 14050 13216 8705 10359 8774
11276 8774 6388 6996 -2890 -7360 -7103 2561 4942 7117 7092 8280 12306 10357 2904 -1116 3208 6352
11260 6352 7019 3520 5187 9426 8498 7758 -793 -1919 -5388 -4347 -380 -3660 -4470 -1552 8395 13814
11244 13814 16206 15879 10731 8094 8064 7734 11203 14273 13140 12147 11049 20842 24029 19677 25343 26307
11228 26307 30376 31850 27882 22625 20608 19013 17730 23939 20630 16514 18174 21512 11098 10778
11214 10778 14321 19563 19989 18730 15602 11364 11186 9188 9002 4441 6020 9238 12944 12433 12990 11353
$$ packed form
11323A6674j3135j0294J012m35L694Q283Q325q5k614M198j178o153j722n73j684
11308D313k737k02J940l773m385j645n280J174m338l56Q25P946P246J122j87J586
11292C249J833Q9N202m168o042j540P845L586j925L80j927P468q34m511J654j585
11276H774k386O08r886m470K57R664K381K175k5J188M026j949p453m020M324L144
11260F352O67l499J667M239r28p40q551j126l469J041L967l280q10K918R947N419
11244A3814K392l27n148k637l0l30L469L070j133r93j098R793L187m352N666R64
11228B6307M069J474l968n257k017j595j283O209l309m116J660L338j0414l20
11214A0778L543N242M26j259l128m238j78j998j86m561J579L218L706n11N57j637
$$ plain form
11198 11353 13772 13571 8043 14590 16473 17013 12107 14288 19229 18297 15505 14876 10517 9904 13487 19955
11182 19955 17607 17919 16366 14920 9794 9258 19100 20791 18662 14962 22917 29345 28136 20977 21100
11167 21100 23709 31582 33905 28148 23998 21950 14908 9857 7466 9556 9241 10059 10481 14174 16961
11152 16961 12844 9228 9571 6269 1807 877 -357 5108 6319 9750 13077 12580 14676 19883 27881
11137 27881 27739 24044 29379 23523 26124 32224 31596 29878 27146 29119 27432 23776 20302 20132 24815
11122 24815 28005 27031 20986 24294 29698 34764 43392 40052 40936 46930 46893 52093 53222 45046 51492
11107 51492 56597 55038 60035 69570 67459 72695 79038 89495 100745 113246 133260 158467 200243
11094 200243 255247 337709 464526 673459 993975 1235921 1365576 1511818 1515730 1466918
$$ packed form
11198A1353K419k01n528O547J883N40m906K181M941r32k792o29m359o13L583O468
11182A9955k348L12j553j446n126n36R842J691k129l700P955O428j209p159J23
11167B1100K609P873K323n757m150k048p042n051k391K090l15Q18M22L693K787
11152A6961m117l616L43l302m462r30j234N465J211L431L327m97K096N207P998
11137B7881j42l695N335n856K601O100o28j718k732J973j687l656l474j70M683
11122B4815L190r74o045L308N404N066Q628l340Q84N994l7N200J129q176O446
11107E1492N105j559M997R535k111N236O343J0457J1250J2501K0014K5207M1776
11094B00243N5004Q2462J26817K08933L20516K41946J29655J46242L912m8812
$$ plain form
11084 1466918 1507948 1538485 1484991 1483557 1368131 1108627 841734 591939 426989 320374
11074 320374 249761 203594 164374 136003 121079 114004 109614 99185 88966 82181 71173 68369
11062 68369 67197 57081 48475 46475 47718 51376 54019 52475 41576 38866 42871 37751 29720 32495
11048 32495 37322 40585 35626 41388 41449 36944 36699 30796 23476 29155 34613 33803 37684 41285 38611
11033 38611 29423 22410 21543 18626 21513 25733 23692 20631 17427 19415 14487 7348 13614 22547 25207
11018 25207 25382 27181 25789 19880 13095 11091 12765 10849 10255 14744 14836 14403 17142 13981 11330 13843
11002 13843 19346 27641 40172 33899 24448 20806 27468 30261 30692 26721 19110 12950 13027 7859 -2896
10987 -2896 -11368 -13393 -11532 -10020 -4623 4134 8999 14933 14612 17947 28705 31200 38647 41719 45230
$$ packed form
11084A466918M1030L0537n3494j434j15426k59504k66893k49795j64950j06615
11074C20374p0613m6167l9220k8371j4924p075m390j0429j0219o785j1008k804
11062F8369j172j0116q606k000J243L658K643j544j0899k710M005n120q031K775
11048C2495M827L263m959N762O1m505k45n903p320N679N458q10L881L601k674
11033C8611r188p013q67k917K887M220k041l061l204J988m928p139O266Q933K660
11018B5207J75J799j392n909o785k004J674j916n94M489R2m33K739l161k651K513
11002A3843N503Q295J2531o273r451l642O662K793M31l971p611o160P7n168j0755
10987b896q472k025J861J512N397Q757M865N934l21L335J0758K495P447L072L511
$$ plain form
10972 45230 50916 49563 42690 38473 36275 40966 46160 56273 61496 69832 74616 79316 79704 88489
10958 88489 101977 111860 118840 119881 123084 128834 132971 130858 136057 142263 136809 130138 127916 116775
10944 116775 114430 119121 128600 134280 142956 152069 160623 162375 159449 155474 155987 154741 147414 141118
10930 141118 132788 117595 112189 100910 91654 93655 97707 97421 88062 83018 79004 78584 83594 80997
10916 80997 82344 84592 83230 84409 80133 75230 79115 83740 81627 81471 80055 72847 64482 56026 56311
10901 56311 50884 41877 41630 40676 41459 48942 56137 62130 60422 55841 51683 54033 66092 73980 79076
10886 79076 83772 74041 64717 63099 57175 54307 73391 87565 90919 81286 74569 73371 80272 96919
10872 96919 106560 111401 126808 139473 131091 119354 109061 100457 100761 108044 110488 106684 104753 99654
$$ packed form
10972D5230N686j353o873m217k198M691N194J0113N223Q336M784M700L88Q785
10958H8489J3488R883O980J041L203N750M137k113N199O206n454o671k222j1141
10944A16775k345M691R479N680Q676R113Q554J752k926l975N13j246p327o296
10930A41118q330j5193n406j1279r256K001M052k86r359n044m014m20N010k597
10916H0997J347K248j362J179m276m903L885M625k113j56j416p208q365q456K85
10901E6311n427r007k47r54P83P483P195N993j708m581m158K350J2059P888N096
10886G9076M696r731r324j618n924k868J9084J4174L354r633o717j198O901J6647
10872I6919R641M841J5407J2665q382j1737j0293q604L04P283K444l804j931n099
$$ plain form
10858 99654 92877 76572 63615 61670 61792 65421 56613 49647 47913 48137 53349 54276 60703 71496
10844 71496 80268 83991 84364 78465 77534 82071 86779 89453 93918 104500 111252 116991 119471 125404 125758
10829 125758 137040 149485 164715 184376 195002 199061 213617 229562 227468 236218 256855 259121
10817 259121 258729 263430 255327 267704 305511 336450 323828 310945 296409 269076 238375 257315
10805 257315 290737 299511 308944 297377 258048 227721 223084 229611 255670 261917 267391 281284 282153
10792 282153 277997 268057 267208 272192 271134 274761 272329 264538 259749 255590 261882 265937 265761 271523 271566
10777 271566 271080 276793 282492 292840 308208 316846 321212 332767 337455 334928 339730 345415 363557
10764 363557 385706 407343 418508 434955 457683 474546 491112 504137 516963 527814 539451
$$ packed form
10858I9654o777j6305j2957j945J22L629q808o966j734K24N212R27O427J0793
10844G1496Q772L723L73n899r31M537M708K674M465J0582O752N739K480N933L54
10829A25758J1282J2445J5230J9661J0626M059J4556J5945k094Q750K0637K266
10817B59121l92M701q103J2377L7807L0939j2622j2883j4536k7333l0701J8940
10805B57315L3422Q774R433j1567l9329l0327m637O527K6059O247N474J3893Q69
10792B82153m156r940q49M984j058L627k432p791m789m159O292M055j76N762M3
10777B71566m86N713N699J0348J5368Q638M366J1555M688k527M802N685J8142
10764C63557K2149K1637J1165J6447K2728J6863J6566J3025J2826J0851J1637
$$ plain form
10753 539451 557768 580443 601767 623937 645380 665161 691366 712898 739656 768762 796825
10742 796825 821146 835903 853029 863045 870061 885226 901017 924010 958689 999606 1030441 1061604
10730 1061604 1094344 1132562 1181328 1235360 1288949 1326711 1361417 1404638 1461029 1526188 1606544
10719 1606544 1674706 1746150 1841062 1940429 2044126 2155140 2275148 2411255 2577552 2764636
10709 2764636 2951344 3133645 3347609 3611225 3923976 4359997 4947386 5690938 6371865
10700 6371865 7064811 7838435 8562846 9465844 10664961 11829878 13020884 14405640 15738949
10691 15738949 17312540 19465174 22276749 26072037 31436624 39008086 50182673 67507886
10683 67507886 95695833 142900083 202153907 232839622 256642460 276805527 266409554
$$ packed form
10753E39451J8317K2675K1324K2170K1443J9781K6205K1532K6758K9106K8063
10742G96825K4321J4757J7126J0016P016J5165J5791K2993L4679M0917L0835L1163
10730A061604L2740L8218M8766N4032N3589L7762L4706M3221N6391O5159Q0356
10719A606544O8162P1444R4912R9367J03697J11014J20008J36107J66297J87084
10709B764636J86708J82301K13964K63616L12751M36021N87389P43552O80927
10700F371865O92946P73624P24411R02998J199117J164917J191006J384756J333309
10691A5738949J573591K152634K811575L795288N364587P571462J1174587J7325213
10683F7507886K8187947M7204250N9253824L0685715K3802838K0163067j0395973
$$ plain form
10676 266409554 261068806 271840556 271763089 264234099 264647134 234985943 187362693 139942953
10668 139942953 97308958 68682536 50773775 39112047 31146164 25605791 21548175
10661 21548175 18450775 16234254 14674644 13430031 12352213 11446570 10485741 9470912
10653 9470912 8615580 7974253 7372164 6897363 6491001 5933541 5343286 4775707 4273574
10644 4273574 3868580 3555717 3303708 3091039 2905703 2748639 2600854 2463956 2345955
10635 2345955 2232512 2129999 2026033 1926205 1834747 1741374 1651205 1572011 1496176 1424250 1369069
10624 1369069 1335490 1292182 1255454 1238100 1224313 1234830 1240915 1238774 1249220 1217417 1154242 1091632
10612 1091632 1008893 922881 849678 785512 747989 724865 704873 682882 663123 653864 652652 644177
$$ packed form
10676B66409554n340748J0771750p7467p528990M13035k9661191m7623250m7419740
10668A39942953m2633995k8626422j7908761j1661728p965883n540373m057616
10661B1548175l097400k216521j559610j244613j077818r05643r60829j014829
10653I470912q55332o41327o02089m74801m06362n57460n90255n67579n02133
10644D273574m04994l12863k52009k12669j85336j57064j47785j36898j18001
10635B345955j13443j02513j03966r9828r1458r3373r0169p9194p5835p1926n5181
10624A369069l3579m3308l6728j7354j3787J0517O085k141J0446l1803o3175o2610
10612A091632q2739q6012p3203o4166l7523k3124j9992k1991j9759r259j212q475
$$ plain form
10600 644177 641652 633715 621243 610113 601404 589042 576634 562033 550965 547136 543210 536580 529543
10587 529543 522789 520060 518586 516336 505579 495055 487328 478242 469148 458093 452081 445613 429274
10574 429274 411406 399366 395636 398785 394729 387102 379151 377301 362769 354102 355477 353540 349987
10561 349987 350965 360198 364931 366408 361745 363976 378127 392090 439235 505497 556359 636143 767734
10548 767734 966293 1092020 1172318 1225777 1140374 984002 810449 664214 544283 478030
10538 478030 447359 408078 384594 342949 285127 262801 261523 246525 232188 215590 198542 189194
10526 189194 185629 186873 190324 197109 202321 209169 217842 211479 204069 201141 200081 204292 204409 209845
10512 209845 208575 208962 201314 192703 189035 190705 198385 205568 215806 220286 223135 213496 203105 195219
$$ packed form
10600F44177k525p937j2472j1130q709j2362j2408j4601j1068l829l926o630p037
10587E29543o754k729j474k250j0757j0524p727r086r094j1055o012o468j6339
10574D29274j7868j2040l730L149m056p627p951j850j4532q667J375j937l553
10561C49987R78R233M733J477m663K231J4151J3963M7145O6262N0862P9784J31591
10548G67734J98559J25727Q0298N3459q5403j56372j73553j46235j19931o6253
10538D78030l0671l9281k3484m1645n7822k2326j278j4998j4337j6598j7048r348
10526A89194l565J244L451O785N212O848Q673o363p410k928j060M211J17N436
10512B09845j270L87p648q611l668J670P680P183J0238M480K849r639j0391p886
$$ plain form
10498 195219 187392 179242 175661 172024 162432 153508 141065 134299 119400 112159 107968 104232 104332 107859
10484 107859 97283 80641 78466 80384 92880 104344 115510 118798 121765 118536 111661 110630 113581
10471 113581 117345 122169 120917 113476 98553 92373 96488 102667 96941 98737 109360 107036 102691 105699
10457 105699 112273 119973 125068 115747 109530 110257 113520 113388 102245 90019 83551 70659 63344 56986
10443 56986 51787 57237 54974 56354 62489 63681 66669 68899 65196 64916 57988 51229 53316 51344 54008
10428 54008 67240 77911 78516 74528 71387 68840 72754 80841 83706 86135 83142 75758 72791 75259
10414 75259 80881 83769 81873 83491 89360 96507 101034 92527 96163 93220 88073 89939 86960 78106
10400 78106 77982 79683 77994 66555 66986 73039 69088 65023 59879 57108 62633 62168 58728 62661 65080
$$ packed form
10498A95219p827q150l581l637r592q924j2443o766j4899p241m191l736J00L527
10484A07859j0576j6642k175J918J2496J1464J1166L288K967l229o875j031K951
10471A13581L764M824j252p441j4923o180M115O179n726J796J0623k324m345L008
10457A05699O574P700N095r321o217P27L263j32j1143j2226o468j2892p315o358
10443E6986n199N450k263J380O135J192K988K230l703k80o928o759K087j972K664
10428E4008J3232J0671O05l988l141k547L914Q087K865K429k993p384k967K468
10414G5259N622K888j896J618N869P147M527q507L636k943n147J866k979q854
10400G8106j24J701j689j1439M31O053l951m065n144k771N525m65l440L933K419
$$ plain form
10385 65080 66499 70827 62558 55471 56394 54058 52521 45192 40150 40838 41581 50633 63782 74291 84712
10370 84712 88159 86604 88547 92075 98396 110727 119081 129677 141381 132913 114203 99135 85152
10357 85152 72062 62475 54951 49588 50589 55423 54767 60086 65933 69042 71011 69156 65657 68232
10343 68232 66504 68316 62234 58393 60481 60309 53303 53242 51159 44815 45222 46807 52887 60914 58851
10328 58851 64120 62469 51244 45612 51461 57788 66965 68867 66532 58739 56291 53005 51261 53063
10314 53063 53547 55602 54529 52930 59181 58747 58271 53364 55978 62047 65629 72292 78464 77584 78502 78209
10298 78209 81472 79181 82881 83927 86959 85300 93995 103949 120373 135171 149581 161794 184280
10285 184280 198220 208978 220581 237468 254603 283370 318331 369307 437829 541292 705991
$$ packed form
10385F5080J419M328q269p087R23k336j537p329n042O88P43R052J3149J0509J0421
10370H4712L447j555J943L528O321J2331Q354J0596J1704q468j8710j5068j3983
10357H5152j3090r587p524n363J001M834o56N319N847L109J969j855l499K575
10343F8232j728J812o082l841K088j72p006o1k083o344M07J585O080Q027k063
10328E8851N269j651j1225n632N849O327R177J902k335p793k448l286j744J802
10314E3063M84K055j073j599O251m34m76m907K614O069L582O663O172q80R18k93
10298G8209L263k291L700J046L032j659Q695R954J6424J4798J4410J2213K2486
10285A84280J3940J0758J1603J6887J7135K8767L4961N0976O8522J03463J64699
$$ plain form
10274 705991 1005116 1513376 2101841 2397995 2715984 3056229 3219132 3548419 3903282 3928825
10264 3928825 3993905 3974591 3578044 3147459 2729905 2298692 2055828 1812342 1453084 1124634
10254 1124634 832306 624229 495466 410180 346090 298875 270070 244689 218309 198392 183778
10243 183778 163790 152477 134334 126129 117312 106681 101606 96153 87792 81352 81263 74243 72750 75272
10229 75272 69964 62582 55269 56976 52835 45244 46106 46475 47958 43599 34448 32686 32398 35985 37065
10214 37065 41543 36608 30693 37162 38907 41772 29718 21627 30784 36953 40047 46771 45523 42661
10200 42661 42061 35209 36357 35976 38587 39266 39110 34817 32031 36419 35126 32028 30736 38421 39753
10185 39753 31156 26438 24229 25133 21408 22600 24829 25686 20793 23822 32506 36245 32993 26633 26854
$$ packed form
10274G05991K99125N08260N88465K96154L17989L40245J62903L29287L54863K5543
10264C928825O5080j9314l96547m30585m17554m31213k42864k43486l59258l28450
10254A124634k92328k08077j28763q5286o4090m7215k8805k5381k6380j9917j4614
10243A83778j9988j1313j8143q205q817j0631n075n453q361o440q9p020j493K522
10229G5272n308p382p313J707m141p591Q62L69J483m359r151j762k88L587J080
10214C7065M478m935n915O469J745K865j2054q091R157O169L094O724j248k862
10200D2661o00o852J148l81K611O79j56m293k786M388j293l098j292P685J332
10185C9753q597m718k209R04l725J192K229Q57m893L029Q684L739l252o360K21
$$ plain form
10170 26854 22986 19421 23033 33626 41996 39723 45381 54895 52122 50202 52249 60817 76284 108021
10156 108021 152147 178755 191989 203343 189918 162704 127985 95779 71065 48374 38141
10145 38141 37216 34499 32941 40122 41915 39592 31869 30261 35158 33567 32316 31652 32675 31596 33707
10130 33707 35246 33778 31236 25454 19381 17170 17878 20303 21380 20804 20017 16764 14484 9621 8338
10115 8338 13951 12170 9917 7346 7559 13686 18968 19750 18986 18210 14360 19291 19356 17852 22305 29591
10099 29591 31669 26578 28164 28097 26743 23282 20731 15766 19653 25528 18752 18740 16223 13075 16688
10084 16688 18522 13066 10115 9737 16178 15147 11820 7601 13392 12451 16287 13480 13831 13492 11936
10069 11936 9670 11957 9846 7211 15194 17194 13291 12744 20301 24292 22659 20075 17288 20649 22779
$$ packed form
10170B6854l868l565L612J0593Q370k273N658R514k773j920K047Q568J5467L1737
10156A08021M4126K6608J3234J1354j3425k7214l4719l2206k4714k2691j0233
10145C8141r25k717j558P181J793k323p723j608M897j591j251o64J023j079K111
10130C3707J539j468k542n782o073k211P08K425J077n76p87l253k280m863j283
10115H338N613j781k253k571K13O127N282P82p64p76l850M931O5j504M453P286
10099B9591K078n091J586o7j354l461k551m965L887N875o776j2k517l148L613
10084A6688J834n456k951l78O441j031l327m219N791r41L836k807L51l39j556
10069A1936k266K287k111k635P983K000l903n47P557L991j633k584k787L361K130
$$ plain form
10054 22779 23859 23346 16759 19740 25134 34154 35810 42203 59524 83736 84138 73548 56070 42525
10040 42525 31905 21797 17451 11727 12621 16650 12265 13043 22287 23757 24226 22138 30853 30362 30880
10025 30880 26112 21866 19150 11908 9729 17152 26771 28445 29444 31451 31394 26000 28513 26644 12567
10010 12567 9111 13453 14082 13317 16354 17972 20349 21039 16537 18243 16834 17515 17512 18778 19468 16755
9994 16755 18130 22998 23916 29334 28506 27568 29179 26564 19764 22400 24272 23537 27706 26244 14837
9979 14837 13445 5903 3988 7023 16834 18433 20356 21921 21256 14138 12162 17959 22721 18879 15270
9964 15270 12922 15375 18737 18544 22384 17699 18950 23618 27076 31190 43174 59515 64916 58947
9950 58947 49757 38309 28773 24535 20249 20994 20539 16795 9002 13982 15907 15342 16717 20234 24602
$$ packed form
10054B2779J080n13o587K981N394R020J656O393J7321K4212M02j0590j7478j3545
10040D2525j0620j0108m346n724Q94M029m385P78R244J470M69k088Q715m91N18
10025C0880m768m246k716p242k179P423R619J674R99K007n7n394K513j869j4077
10010A2567l456M342O29p65L037J618K377O90m502J706j409O81lJ266O90k713
9994A6755J375M868R18N418q28r38J611k615o800K636J872p35M169j462j1407
9979A4837j392p542j915L035R811J599J923J565o65p118j976N797M762l842l609
9964A5270k348K453L362j93L840m685J251M668L458M114J1984J6341N401n969
9950E8947r190j1448r536m238m286P45m55l744p793M980J925n65J375L517M368
$$ plain form
9935 24602 26749 34887 36641 40086 36114 30540 20572 19382 13156 12652 14165 8366 6605 5891 4431
9920 4431 5316 6699 15465 16921 11691 13343 11315 11754 14259 14417 11017 8943 12829 21414 17418 17279
9904 17279 20635 11690 9073 10067 8382 9597 16274 12764 19624 24624 17554 20064 23674 25685 33460
9889 33460 38228 31432 30782 26783 16290 11721 7530 4310 6253 9019 14974 13368 9971 14762 21526
9874 21526 13905 12918 16849 20079 20583 18695 20138 16735 15730 16205 21594 25282 30573 30559 29840 33303
9858 33303 33603 25380 16178 20397 25527 29901 31362 33613 35283 30252 27357 23466 21864 18329 14716
9843 14716 17493 13387 11155 12970 12099 9321 7112 11768 7219 13667 12517 8658 10266 2674 -1677
9828 -1677 1481 -1692 7738 17388 18690 18668 12541 11660 7026 4245 6119 7521 10099 10420 3765 -787
$$ packed form
9935B4602K147Q138J754L445l972n574r968j190o226n04J513n799j761p14j460
9920D431Q85J383Q766J456n230J652k028M39K505J58l400k074L886Q585l996j39
9904A7279L356q945k617R94j685J215O677l510O860N000p070K510L610K011P775
9889C3460M768o796o50l999j0493m569m191l220J943K766N955j606l397M791O764
9874B1526p621r87L931L230N04j888J443l403j005M75N389L688N291j4p19L463
9858C3303L00q223r202M219N130M374J461K251J670n031k895l891j602l535l613
9843A4716K777m106k232J815q71k778k209M656m549O448j150l859J608p592m351
9828a677L158l173R430R650J302k2o127q81m634k781J874J402K578L21o655m552
$$ plain form
9812 -787 3457 -2030 -9995 -4732 2235 8665 10066 7056 10788 14878 19075 21105 16876 14697 14348
9797 14348 10319 11616 24687 29358 22989 15367 11827 18555 20005 16530 13975 542 77 -6770
9783 -6770 -9963 -3131 7221 3131 -1458 -6807 -6258 1536 9186 16500 16787 13010 11468 4280 249
9768 249 1181 6319 5353 8253 4451 895 6389 6787 4861 1289 2983 7035 6760 6870 7900 6464
9752 6464 7040 10572 11615 9400 9311 13807 9222 3053 3678 6091 10315 4956 977 -4000 145 5896
9736 5896 2685 1923 1755 6667 6675 3824 10564 9127 5791 5796 1761 532 2930 -704 -2517 4110 9372
9719 9372 8006 8055 8848 8220 3549 3759 3009 3770 7832 6242 4742 5615 9248 13261 13838 10885 10143
9702 10143 9359 12030 15331 2991 -6522 -835 5009 8059 9776 11829 15487 15602 14076 16887 15172
$$ packed form
9812g87M244n487p965N263O967O430J401l010L732M090M197K030m229k179l49
9797A4348m029J297J3071M671o369p622l540O728J450l475k555j3433m65o847
9783f770l193O832J0352m090m589n349N49P794P650P314K87l777j542p188m031
9768B49R32N138r66K900l802l556N494L98j926l572J694M052k75J10J030j436
9752F464N76L532J043k215q9M496m585o169O25K413M224n359l979m977M145N751
9736E896l211p62j68M912Qk851O740j437l336Nm035j229K398l634j813O627N262
9719I372j366M9P93o28m671K10p50P61M062j590j500Q73L633M013N77k953p42
9702A0143p84K671L301j2340r513N687N844L050J717K053L658J15j526K811j715
$$ plain form
9687 15172 18090 12471 4402 3059 7216 4606 3564 2348 11119 17748 16857 18357 23129 18224 19965
9672 19965 17874 18020 14441 13789 11065 5532 10255 9047 6282 8580 8832 3917 -1835 -914 4929 1029
9656 1029 4145 11272 14066 15222 16660 10919 3623 -1056 -1021 4494 -2114 -8096 -1422 8255 12740
9641 12740 21543 19899 13185 12992 12004 10243 11195 7111 4268 10372 22776 26327 21199 8698 5379
9626 5379 -6666 -11284 -11801 -6218 -3924 -5301 -828 -1403 -2065 7818 12051 10993 4274 -35 1012
9611 1012 -5632 -6894 -6066 -885 3237 -175 6231 13312 10287 5434 33 -471 3227 -162 -701 2671
9595 2671 1287 7710 8861 6588 4075 6649 1144 -495 4519 11310 13237 6359 3816 4111 4601
9580 4601 6267 4342 2602 6098 10626 10361 1594 -5915 -4508 -4696 1051 7513 9540 5534 6028 6985
$$ packed form
9687A5172K918n619q069j343M157k610j042j216Q771O629q91J500M772m905J741
9672A9965k091J46l579o52k724n533M723j208k765K298K52m915n752R21N843l900
9656A029L116P127K794J156J438n741p296m679L5N515o608n982O674R677M485
9641A2740Q803j644o714j93r88j761R52m084k843O104J2404L551n128j2501l319
9626E379j2045m618n17N583K294j377M473n75o62R883M233j058o719m309J047
9611A012o644j262Q28N181M122l412O406P081l025m853n401n04L698l389n39L372
9595B671j384O423J151k273k513K574n505j639N014O791J927o878k543K95M90
9580D601J666j925j740L496M528k65q767p509J407j88N747O462K027m006M94R57
$$ plain form
9564 6985 13111 19717 11247 1443 -528 3465 7780 8418 5186 6200 11955 5440 -1597 -4982 -7621
9549 -7621 -14542 -13278 -4004 3245 3847 -4544 -3712 -2916 -471 5237 4544 1545 -6105 -7825 -5401 -2465
9533 -2465 5378 13871 12952 8624 11539 16040 13227 9582 12314 14326 7028 4224 -1024 -7564 -8393
9518 -8393 -3553 6308 10462 6030 10681 13600 10708 11936 13015 9135 -2585 -4796 2357 4481 6706
9503 6706 9806 12606 11659 9554 4734 -3543 -6108 -4980 -5720 -1674 3205 5865 10423 16061 18007
9488 18007 19611 13158 8925 5396 5945 213 1761 4596 -437 -6864 -1323 -1258 164 1115 5754 14489
9472 14489 20283 12480 12319 18856 19793 17376 19859 20820 15787 8450 7395 1202 -4213 -5149 -2589 -5895
9456 -5895 -8392 -8159 -10560 -5839 3291 4427 7967 12632 7380 5633 6376 1322 -883 -4466 -7679
$$ packed form
9564F985O126O606q470r804j971L993M315O38l232J014N755o515p037l385k639
9549g621o921J264R274P249O02q391Q32P96K445N708o93k999p650j720K424K936
9533b465P843Q493r19m328K915M501k813l645K732K012p298k804n248o540q29
9518h393M840R861M154m432M651K919k892J228J079l880j1720k211P153K124K225
9503F706L100K800r47k105m820q277k565J128p40M046M879K660M558N638J946
9488A8007J604o453m233l529N49n732J548K835n033o427N541O5J422R51M639Q735
9472A4489N794p803j61O537R37k417K483R61n033p337j055o193n415r36K560l306
9456e895k497K33k401M721R130J136L540M665n252j747P43n054k205l583l213
$$ plain form
9441 -7679 -5126 -1184 2451 6644 3464 -7028 -7036 -4286 -4694 -3362 -2633 -2917 -2112 -2849 5176 8318 865
9424 865 -2590 -9474 -7115 -1668 -1757 -5914 -2185 -3345 -4152 4144 5129 -383 -5601 -12187 -5797 296
9408 296 1378 1862 -897 -2776 -733 2741 -792 -3671 -1179 2504 1990 288 10197 14385 16155 12800
9392 12800 8716 9059 9753 4463 3741 1242 -135 654 1442 2828 3488 9071 4874 1474 2668 -906
9376 -906 1739 2941 7770 8355 10744 10450 11170 489 -2278 881 6917 12262 13600 9055 3241 6614
9360 6614 6896 11263 17428 12764 9772 12032 11271 7963 2139 3938 10026 12271 9466 2527 648
9345 648 -256 2555 7104 10206 7399 6728 5062 3006 2363 7058 5687 430 4235 1431 -1090 -4323
9329 -4323 -798 2054 8210 12828 12402 11472 13337 16638 15359 13037 3901 -1662 6721 19156 18644
$$ packed form
9441g679K553L942L635M193l180j0492qK750m08J332P29k84Q05p37Q025L142p453
9424H65l455o884K359N447q9m157L729j160q07Q296R85n512n218o586O390O093
9408B96J082M84k759j879K043L474l533k879K492L683n14j702R909M188J770l355
9392A2800m084L43O94n290p22k499j377P89P88J386O60N583m197l400J194l574
9376i06K645J202M829N85K389k94P20j0681k767L159O036N345J338m545n814L373
9360F614K82M367O165m664k992K260p61l308n824J799O088K245k805o939j879
9345F48r04K811M549L102k807o71j666k056o43M695j371n257L805k804k521l233
9329d323L525K852O156M618m26r30J865L301j279k322r136n563Q383J2435n12
$$ plain form
9314 18644 15781 8758 6300 5427 -1998 -3486 185 5318 2065 1516 -678 -956 -1697 1670 5763 2199
9298 2199 40 -163 3889 2153 -2623 -879 46 4282 4708 6533 7356 11083 5860 2152 3799 -3461
9282 -3461 -9982 -6833 -4256 -7059 1164 4651 4344 1477 -1065 131 6759 10498 6829 4116 -3019
9267 -3019 -6232 -1243 -2134 4267 14671 15615 12121 2084 -1881 2888 6087 8775 11777 16206 14870
9252 14870 8880 1335 5211 11253 9695 14677 13280 10456 8621 4500 3515 16196 18426 14209 13713
9237 13713 10481 11321 12407 12152 8606 4851 10154 17079 14340 14946 25628 21550 13631 12541 13891
9222 13891 14451 10818 2398 1383 3450 8091 16673 21172 13012 15356 17336 19751 15832 12635 11239
9207 11239 12827 19165 12843 7033 10414 7422 6157 14987 11842 5985 8445 12439 8762 3519 8059
$$ packed form
9314A8644k863p023k458q73p425j488L671N133l253n49k194k78p41L367M093l564
9298B199k159k03M052j736m776J744R25M236M26J825Q23L727n223l708J647p260
9282c461o521L149K577k803Q223L487l07k867k542J196O628L739l669k713p135
9267c019l213M989q91O401J0404R44l494j0037l965M769L199K688L002M429j336
9252A4870n990p545L876O042j558M982j397k824j835m121r85J2681K230m217m96
9237A3713l232Q40J086k55l546l755N303O925k739O06J0682m078p919j090J350
9222A3891N60l633q420j015K067M641Q582M499q160K344J980K415l919l197j396
9207A1239J588O338o322n810L381k992j265Q830l145n857K460L994l677n243M540
$$ plain form
9192 8059 9610 5793 7195 7218 6326 5540 4488 9138 12787 12471 14877 19051 17367 10358 15133 20235
9176 20235 19551 15433 14616 12754 15508 21839 21784 21154 29277 29195 26817 26162 16673 15480 17240 23092 27419
9159 27419 29521 26767 25999 27929 29264 28128 31157 34257 40071 39445 39442 39431 41858 50429 57281 65041
9143 65041 69216 72165 74753 86711 99578 106225 119998 133069 147735 162996 181535 206520 234719
9130 234719 268370 305213 356065 428590 517328 638197 803760 1030483 1357237 1836803 2519237
9119 2519237 3428781 4326631 4701440 4392562 3657015 2800429 2069677 1533542 1160791 901250
9109 901250 710749 569773 466428 399619 338684 281786 239680 210337 188294 164437 148344
9098 148344 133640 120390 111624 105231 93582 85276 81500 84318 76166 72437 65914 64457 56815 52913
$$ packed form
9192H059J551l817J402K3q92p86j052M650L649l16K406M174j684p009M775N102
9176B0235o84m118q17j862K754O331n5o30Q123q2k378o55r489j193J760N852M327
9159B7419K102k754p68J930J335j136L029L100N814o26lj1K427Q571O852P760
9143F5041M175K949K588J1958J2867O647J3773J3071J4666J5261J8539K4985K8199
9130B34719L3651L6843N0852P2525Q8738J20869J65563K26723L26754M79566O82434
9119B519237R09544Q97850L74809l08878p35547q56586p30752n36135l72751k59541
9109I01250j90501j40976j03345o6809o0935n6898m2106k9343k2043k3857j6093
9098A48344j4704j3250q766o393j1649q306l776K818q152l729o523j457p642l902
$$ plain form
9084 52913 54904 55987 56750 52958 48550 47811 44430 37486 32773 26555 30552 38861 48069 44285 40543
9069 40543 32551 27595 29239 31942 33725 32912 26043 18221 16148 11543 14986 13054 13524 21014 29003
9054 29003 22828 16354 12802 17702 20890 13282 10855 17475 14765 3174 149 2215 9375 4966
9040 4966 -451 3659 4095 10377 18667 19013 20904 17062 11618 14218 14254 16561 14288 6290 2993 5334
9024 5334 9223 11899 14540 15797 10300 5783 -426 -238 3519 -121 2535 6024 8486 8433 7092 10107
9008 10107 6909 10307 17586 15274 18159 19587 15936 11998 11503 8991 2656 6684 8229 11051 7840
8993 7840 6389 7491 983 1728 857 2261 10971 15309 13869 13604 6627 2183 5816 8605 4041 -5152
8977 -5152 -3038 -319 3584 4545 -2291 -3749 -922 411 4018 12964 10021 9182 10354 7762 3980
$$ packed form
9084E2913J991J083P63l792m408p39l381o944m713o218L997Q309R208l784l742
9069D0543p992m956J644K703J783q13o869p822k073m605L443j932M70P490P989
9054B9003o175o474l552M900L188p608k427O620k710j1591l025K066P160m409
9040D966n417M110M36O282Q290L46J891l842n444K600L6K307k273p998l297K341
9024E334L889K676K641J257n497m517o209J88L757l640K656L489K462n3j341L015
9008A0107l198L398P279k312K885J428l651l938m95k512o335M028J545K822l211
8993G840j451J102o508P45q71J404Q710M338j440k65o977m444L633K789m564r193
8977e152K114K719L903R61o836j458K827J333L607Q946k943q39J172k592l782
$$ plain form
8962 3980 6071 3369 2408 -2594 -4338 -3315 -483 2056 -2520 -689 6903 6915 2315 -3745 -162 3747
8946 3747 -1951 -410 1890 5819 9232 13756 14437 12661 12895 5375 4778 8380 5850 4745 13316 14932
8930 14932 11661 5588 4166 -1482 -5656 -4374 -151 2331 3117 2392 -516 -3221 -1085 -6343 -8128
8915 -8128 -918 5140 6027 3779 -2002 -6599 2307 9173 9726 9904 9667 -794 -1467 5224 2671 1146
8899 1146 -3833 -4975 -4639 -4657 -8839 -11828 -2713 2606 990 26 -6660 -4061 -5726 -6593 -3172 -9
8883 -9 3405 4430 5547 6404 5012 4685 12584 14529 11932 936 -5626 -5689 -1734 3741 9721 18085
8867 18085 13650 8202 7738 8380 8642 -1163 -2372 -1414 4520 8706 7355 8525 10295 7309 3881 1632
8851 1632 5575 5895 297 -659 6977 9128 5411 3483 1048 -520 -174 -2696 -2649 -851 10284 13455
$$ packed form
8962C980K091k702r61n002j744J023K832K539m576J831P592J2m600o060L583L909
8946C747n698J541K300L929L413M524O81j776K34p520n97L602k530j105Q571J616
8930A4932l271o073j422n648m174J282M223K482P86p25k908k705K136n258j785
8915h128P210O058Q87k248n781m597Q906O866N53J78k37j0461o73O691k553j525
8899A146m979j142L36j8m182k989R115N319j616r64o686K599j665q67L421L163
8883iL414J025J117Q57j392l27P899J945k597j0996o562o3L955N475N980Q364
8867A8085m435n448m64O42K62r805j209R58N934M186j351J170J770k986l428k249
8851A632L943L20n598r56P636K151l717j928k435j568L46k522M7J798J1135L171
$$ plain form
8835 13455 8541 11246 15738 16428 11576 4319 -549 2432 6906 4115 -4271 -4261 997 2028 4971
8820 4971 7165 3999 -8789 -8708 -8940 -12797 -9997 -5455 -2887 2547 7355 14540 9886 8382 13823
8805 13823 12032 1895 529 -8285 -12387 -10401 -6666 4494 5585 1589 -3752 -3900 -6331 -13711
8791 -13711 -11084 -8257 -3749 -5362 757 4034 10460 12971 14901 15745 13692 11945 16435 11005 9988
8776 9988 12347 15491 6599 -8 -2638 -3931 -5502 -6910 -3894 -3699 3177 5636 1827 1577 3363
8761 3363 1380 4542 7481 3928 4449 10022 10675 3219 1428 2207 2309 -1582 1236 2370 -1831 -6841
8745 -6841 -8229 -3019 -7353 -11972 -4302 2799 4708 8354 2914 -3594 -5496 -1257 2029 -1693 -2169
8730 -2169 -2832 1047 -1147 3297 2559 -5522 -2497 6830 8404 8548 4985 6546 -140 -322 396 -5191
$$ packed form
8835A3455m914K705M492O90m852p257m868K981M474k791q386J0N258J031K943
8820D971K194l166j2788Q1k32l857K800M542K568N434M808P185m654j504N441
8805A3823j791j0137j366q814m102J986L735J1160J091l996n341j48k431p380
8791a3711K627K827M508j613O119L277O426K511J930Q44k053j747M490n430j017
8776I988K359L144q892o607k630j293j571j408L016J95O876K459l809k50J786
8761C363j983L162K939l553N21N573O53p456j791P79J02l891K818J134m201n010
8745f841j388N210m334m619P670P101J909L646n440o508j902M239L286l722m76
8730b169o63L879k194M444p38q081L025R327J574J44l563J561o686j82P18n587
$$ plain form
8714 -5191 -2666 1546 4652 8487 6225 5884 390 -8524 -3558 2499 8908 12664 14119 13565 9985
8699 9985 2357 1847 7750 11567 12204 7530 6019 2939 6862 4695 -364 5743 1723 -157 -1224
8684 -1224 -2240 1340 -1544 -1199 3065 9294 2892 -3693 -7512 -5059 -5038 -4028 -767 -1326 -6582 -1300
8668 -1300 4658 6052 9067 7357 8495 10606 7680 5101 5996 141 -724 -159 5177 8121 11890 12443
8652 12443 8922 8964 9114 9917 14245 15506 8151 3450 558 -2826 -6087 -1903 327 7247 14360 12795
8636 12795 8562 8074 7651 10153 12945 14056 12472 13140 19678 11495 5230 4068 -2823 -7442 -11586
8621 -11586 -7503 -6136 -3220 2672 10130 14247 12495 7310 7213 844 -287 3996 9539 6182 7117
8606 7117 6714 8950 15002 19239 20138 22091 16666 6999 8857 9542 6413 3892 8314 5767 9564 9765
$$ packed form
8714e191K525M212L106L835k262l41n494q914M966O057O409L756J455n54l580
8699I985p628n10N903L817O37m674j511l080L923k167n059O107m020j880j067
8684a224j016L580k884L45M264O229o402o585l819K453K1J010L261n59n256N282
8668a300N958J394L015j710J138K111k926k579Q95n855q65N65N336K944L769N53
8652A2443l521M2J50Q03M328J261p355m701k892l384l261M184K230O920P113j565
8636A2795m233m88m23K502K792J111j584O68O538q183o265j162o891m619m144
8621a1586M083J367K916N892P458M117j752n185r7o369j131M283N543l357R35
8606G117m03K236O052M237Q99J953n425r667J858O85l129k521M422k547L797K01
$$ plain form
8590 9765 7406 3544 2317 3847 7215 6559 4849 7804 7935 6443 4635 8542 5783 5160 13970 14017
8574 14017 3097 -332 1048 3971 1960 -2022 -1217 7223 7766 8006 5601 9661 11718 8647 2518
8559 2518 2828 6924 4932 3372 6014 7919 5263 5509 8549 4614 -1682 -170 7003 3142 -5048
8544 -5048 -1631 5942 8571 7895 8799 6950 5806 4386 4067 5622 12167 13654 3241 -2994 782
8529 782 3313 -1024 -2360 -3592 -2420 -1602 -7704 -10975 -15485 -13543 -4357 -4729 -1083 252 8533 10325
8513 10325 7514 7976 4729 -1880 -2547 2316 2458 5284 11721 13445 12827 6508 105 -6406 -3520 -405
8497 -405 1125 -1480 -2500 549 9214 5211 2949 1730 1828 1842 2497 -1019 -2964 1332 10868 16612
8481 16612 11443 9214 6358 9290 7459 4600 1 791 3023 1693 5397 6536 3110 5247 836
$$ packed form
8590I765k359l862j227J530L368o56j710K955J31j492j808L907k759o23Q810M7
8574A4017j0920l429J380K923k011l982Q05Q440N43K40k405M060K057l071o129
8559B518L10M096j992j560K642J905k656K46L040l935o296J512P173l861q190
8544e048L417P573K629o76R04j849j144j420l19J555O545J487j0413o235L776
8529G82K531m337j336j232J172Q18o102l271m510J942R186l72L646J335Q281J792
8513A0325k811M62l247o609o67M863J42K826O437J724o18o319o403o511K886L115
8497d05J530k605j020L049Q665m003k262j219R8J4O55l516j945M296R536N744
8481A6612n169k229k856K932j831k859m599P90K232j330L704J139l426K137m411
$$ plain form
8466 836 5308 11318 11330 8707 -1202 -4707 2688 715 -7032 -6859 -5660 -4856 -1532 -3163 -3211 -2587 5144
8449 5144 6049 577 -3138 -5598 -4058 964 -1008 3391 6765 6920 7012 9374 2488 -3486 -6955 -4666
8433 -4666 5037 12402 7114 3206 1394 635 3827 12000 9671 6559 9412 8460 8958 8612 7640 9241
8417 9241 7072 5650 10516 5077 -1806 -2192 -2122 728 -528 -2741 -12360 -13191 -7414 -4544 -3928 -7825
8401 -7825 -7884 571 6004 178 -1782 2628 4227 1672 1769 -2021 1840 1661 -1694 -975 7672 6030
8385 6030 4158 834 3699 1783 7839 9845 7717 4248 3744 2583 1673 3482 3105 4914 -4271 -11456
8369 -11456 -6461 -4096 1137 -3462 -5310 -5794 -4825 -4173 2055 5179 11798 6940 3024 3443 1950 1492
8353 1492 -4624 -2415 5070 11727 9847 -2362 3480 8150 8174 12103 12037 7656 1571 4335 12833 13208
$$ packed form
8466H36M472O010J2k623r909l505P395j973p747J73J199Q04L324j631m8O24P731
8449E144R05n472l715k460J540N022j972M399L374J55R2K362o886n974l469K289
8433d666R703P365n288l908j812p59L192Q173k329l112K853r52M98l46r72J601
8417I241k169j422M866n439o883l86P0K850j256k213r619q31N777K870O16l897
8401g825n9Q455N433n826j960M410J599k555R7l790L861j79l355P19Q647j642
8385F030j872l324K865j916O056K006k128l469n04j161r10J809l77J809r185p185
8369a1456M995K365N233m599j848m84R69O52O228L124O619m858l916M19j493m58
8353A492o116K209P485O657j880j2209N842M670K4L929o6m381o085K764Q498L75
$$ plain form
8337 13208 7021 10299 10620 6781 3943 736 -3158 1966 8474 11993 10998 3534 2284 5033 9514
8322 9514 15915 12337 7830 2377 2368 7910 7460 5690 10000 12625 6712 3232 9049 12064 8351 -3062
8306 -3062 -10561 -8744 -6323 -4422 5546 12321 13359 13096 12983 5829 1802 4115 2543 1901 6794 7005
8290 7005 -2683 -9096 -9763 528 7382 10923 11556 9817 8237 6436 -770 -6165 -6629 -3331 -2912 -1004
8274 -1004 -5565 -11643 -9644 824 6792 2144 2326 4703 3417 -1410 -2932 -4687 -5251 -4829 -3782
8259 -3782 -3471 -6000 -2262 -3840 -1436 2054 1798 -6697 -14559 -8258 -1735 -2569 -5971 -6334 2708 4714
8243 4714 6783 4630 4758 9626 5926 991 -3115 -3485 -4679 -1993 951 5036 1949 6373 8393
8228 8393 919 -5148 -4752 -1560 5102 9381 7059 3029 3713 400 -919 -2820 -3391 97 3982 10083
$$ packed form
8337A3208o187L278L21l839k838l207l894N124O508L519r95p464j250K749M481
8322I514O401l578m507n453rN542m50j770M310K625n913l480N817L015l713j1413
8306c062p499J817K421J901R968O775J038k63j13p154m027K313j572o42M893K11
8290G005r688o413o67J0291O854L541O33j739j580j801p206n395m64L298M19J908
8274a004m561o078J999J0468N968m648J82K377j286m827j522j755n64M22J047
8259c782L11k529L738j578K404L490k56q495p862O301O523q34l402l63R042K006
8243D714K069k153J28M868l700m935m106l70j194K686K944M085l087M424K020
8228H393p474o067L96L192O662M279k322m030O84l313j319j901n71L488L885O101
$$ plain form
8212 10083 11861 6905 1775 -4787 -2463 509 4154 9027 8756 2633 4004 6833 1493 189 -4775
8197 -4775 -4255 7688 16402 17337 11105 5510 -2084 -7194 -3778 -711 -2863 -10698 -9211 -5567 -5856
8182 -5856 -4934 -4196 2506 7753 6913 9544 9822 7042 -1033 -6669 -8939 -9506 -10644 -7207 -4134 -3292
8166 -3292 -2910 3169 5031 2111 8583 16924 15364 8730 11375 7256 11061 12041 6941 1726 -1824
8151 -1824 3498 3464 1908 2834 -3259 -1985 -4737 -4326 -587 -1538 -3740 -4167 -3924 -2696 -748 4064 9401
8134 9401 8990 7824 9143 14560 13191 9676 4928 1312 -965 -201 3688 -3063 -5719 -814 2629
8119 2629 213 -61 -1735 674 1008 266 -1740 4392 7932 10281 10857 16167 16069 16081 16904 13917 6273
8102 6273 715 187 -2550 -3663 -127 2057 4788 3609 4255 9854 13262 4834 -1353 751 -1172
$$ packed form
8212A0083J778m956n130o562K324K972L645M873k71o123J371K829n340j304m964
8197d775N20J1943Q714R35o232n595p594n110L416L067k152p835J487L644k89
8182e856R22P38O702N247q40K631K78k780q075n636k270n67j138L437L073Q42
8166c292L82O079J862k920O472Q341j560o634K645m119L805R80n100n215l550
8151a824N322l4j556R26o093J274k752M11L739r51k202m27K43J228J948M812N337
8134I401m11j166J319N417j369l515m748l616k277P64L889o751k656M905L443
8119B629k416k74j674K409L34p42k006O132L540K349N76N310r8J2Q23k987p644
8102F273n558n28k737j113L536K184K731j179O46N599L408q428o187K104j923
$$ plain form
8087 -1172 -4824 -12424 -11281 -2921 -5882 -6296 -3655 1088 1132 -542 909 267 -43 -2039 -4002 -4863
8071 -4863 7 -2771 -4330 -5118 -2378 -1162 -4115 -1790 -2757 -1796 -795 -2444 3094 6754 5488 4720
8055 4720 621 2966 -5449 -11896 -7869 2445 9125 10552 8615 5091 7725 11437 6459 3374 6144
8040 6144 -576 1081 7056 9631 4913 -568 -6095 -10295 -11313 -9702 -541 7264 11727 4237 2772
8025 2772 8662 6919 -42 -2690 -3558 -2741 -6355 -2607 -1750 -6274 -4145 -1805 -713 -1175 -4101 -7401
8009 -7401 -3761 1820 6304 3581 4469 7203 6101 229 3442 372 -408 4284 4952 11768 13884 9513
7993 9513 8885 10285 11317 8222 7934 11747 10844 4634 7825 8824 14106 9623 4300 4185 4681 1667
7977 1667 4661 2671 -1023 -2835 -131 -3887 1566 5319 3478 4650 3575 5669 11011 11922 14845
$$ packed form
8087a172l652p600J143Q360k961m14K641M743M4j674J451o42l10j996j963q61
8071d863M870k778j559p88K740J216k953K325r67R61J001j649N538L660j266p68
8055D720m099K345q415o447M027J0314O680J427j937l524K634L712m978l085K770
8040F144o720J657N975K575m718n481n527m200j018J611R161P805M463p490j465
8025B772N890j743o961k648q68Q17l614L748Q57m524K129K340J092m62k926l300
8009g401L640N581M484k723Q88K734j102n872L213l070p80M692O68O816K116m371
7993I513o28J400J032l095k88L813r03o210L191R99N282m483n323j15M96l014
7977A667K994j990l694j812K704l756N453L753j841J172j075K094N342R11K923
$$ plain form
7962 14845 17906 24240 23771 20163 17545 11570 -1650 -2825 -1416 -2608 2049 -4943 -11861 -9520 -8741
7947 -8741 -1201 -489 6538 9183 7592 7853 2385 -524 -549 -2472 -4462 1445 4379 3023 7963 6135
7931 6135 6576 6491 4344 1605 9582 13845 11629 17221 15374 13354 11409 1778 -2395 1933 2804 -40
7915 -40 2735 7745 8592 5336 3634 6908 11881 12440 12303 8581 6145 7592 8845 10897 8152 4033
7899 4033 3771 3053 -1228 -1471 -1452 -5157 -5175 1086 -35 -2815 -4067 579 -1560 5708 3742 8694 14331
7882 14331 13134 4259 -1962 1387 1971 1954 2510 5228 946 -139 -1381 -3988 -454 6787 8043 14532
7866 14532 7289 5133 14994 19864 11174 10635 13677 3977 838 5817 10531 3924 -1184 1332 7324
7851 7324 6002 -1298 -57 1804 5553 7748 2854 7632 7033 2931 -1544 -3903 -9255 -6098 -6167 -1356
$$ packed form
7962A4845L061O334m69l608k618n975j3220j175J409j192M657o992o918K341P79
7947h741P540P12P027K645j591K61n468k909k5j923j990N907K934j356M940j828
7931F135M41q5k147k739P977M263k216N592j847k020j945r631m173M328Q71k844
7915d0K775N010Q47l256j702L274M973N59j37l722k436J447J253K052k745m119
7899D033k62p18m281k43J9l705j8O261j121k780j252M646k139P268j966M952N637
7882A4331j197q875o221L349N84j7N56K718m282j085j242k607L534P241J256O489
7866A4532p243k156R861M870q690n39L042r700l139M979M714o607n108K516N992
7851G324j322p300J241J861L749K195m894M778n99m102m475k359n352L157o9M811
$$ plain form
7835 -1356 -1982 3129 -5040 -2598 6509 10005 2996 -946 5088 7389 8466 5791 252 -4814 -10491
7820 -10491 -9189 603 7212 5905 4424 1789 -3784 1989 7178 -701 -4845 -3485 18 -1583 -8165
7805 -8165 -10503 -6429 -4988 -12088 -11543 -17751 -18526 -12681 -3715 -3367 -6113 -3992 -1243 -2027 640 2115
7789 2115 2742 1435 1164 -3159 655 3136 5753 444 1293 -4728 -7088 -2845 -3169 -9502 -16203 -8125
7773 -8125 2115 2671 2431 2743 -1687 -7082 -10493 -15322 -11013 -7803 -11775 -20143 -17892 -5779 3107
7758 3107 3403 4684 3439 9113 11464 8980 1716 1274 5990 -1293 -3909 -2678 -4078 -1108 6105
7743 6105 9222 11855 9559 6645 1751 -186 -2218 -2754 -4441 5048 -3041 -5415 -7055 -6786 -1391
7728 -1391 1729 -980 -1198 5709 6901 912 509 -144 -8785 -16805 -18166 -11792 -4973 -12116 -10679 -9970
$$ packed form
7835a356o26N111q169K442R107L496p009l942O034K301J077k675n539n066n677
7820a0491J302R792O609j307j481k635n573N773N189p879m144J360L503j601o582
7805h165k338M074J441p100N45o208p75N845Q966L48k746K121K749p84K667J475
7789B115O27j307k71m323L814K481K617n309Q49o021k360M243l24o333o701Q078
7773h125J0240N56k40L12m430n395l411m829M309L210l972q368K251J2113Q886
7758C107K96J281j245N674K351k484p264m42M716p283k616J231j400K970P213
7743F105L117K633k296k914m894j937k032n36j687R489q089k374j640K69N395
7728a391L120k709k18O907J192n989m03o53q641q020j361O374O819p143J437P09
$$ plain form
7712 -9970 -13186 -12465 -4231 -2702 -147 -5338 -13692 -10503 -2849 -1393 -4374 -2801 -1339 -2924 -4057
7697 -4057 -5162 -8966 -3947 -1664 -1135 -5129 -3489 1987 12214 12112 3326 -319 8735 11800 7952
7682 7952 482 -1136 -3505 -4904 -6295 -3912 4936 8977 6419 -3188 -2769 1740 2528 2124 -1664 -4722
7666 -4722 -1424 -3174 -3405 -3106 -3334 -3805 -8008 -12018 -8736 -10515 -7010 -6783 -4983 -13918 -8152 3407
7650 3407 6759 390 -1064 -3608 -7831 -4190 -18 615 1586 1605 -1573 -4951 -11152 -7748 -2871 -3779
7634 -3779 -8804 -5801 -2958 -5175 -1707 371 -1000 -3299 -2890 -2984 -3928 -1037 3757 941 -1485 500
7618 500 -977 -2924 3052 2071 3343 2356 3705 -449 -5660 3883 9032 3658 -935 -617 -336 -2551
7602 -2551 -2844 -1686 -4402 -6509 -12221 -9626 -5176 -767 -3603 -6784 -10887 -2157 506 2229 7557
$$ packed form
7712i970l216P21Q234J529K555n191q354L189P654J456k981J573J462j585j133
7697d057j105l804N019K283N29l994J640N476J0227j02q786l645R054L065l848
7682G952p470j618k369j399j391K383Q848M041k558r607M19M509P88m04l788l058
7666d722L298j750k31K99k28m71m203m010L282j779L505K27J800q935N766J1559
7650C407L352o369j454k544m223L641M172O33R71J9l178l378o201L404M877r08
7634c779n025L003K843k217L468K078j371k299M09r4r44K891M794k816k426J985
7618E00j477j947N976r81J272r87J349m154n211R543N149n374m593L18K81k215
7602b551k93J158k716k107n712K595M450M409k836l181m103Q730K663J723N328
$$ plain form
7587 7557 3336 3358 -2153 -4973 -6066 -6789 -8550 -12537 -3125 -367 4979 4506 2315 4317 -709 -9908
7571 -9908 -11445 -10118 -6033 2810 -700 -3793 -7554 -4149 1968 -2059 -5821 -5105 -6323 -1339 -1284 1830
7555 1830 4093 6428 7650 8406 3181 3785 2011 8156 8873 -3808 -3414 -494 -2536 -3010 4970 13124
7539 13124 10248 5280 2201 -1977 -3079 1360 4388 5848 2889 -324 -875 -2865 -111 1857 -65
7524 -65 18 -1936 -1 -1287 -2361 3433 3206 -110 6088 185 4210 -702 -2855 6079 6078 1791 2105
7507 2105 -600 -3544 -4552 -1172 -371 -6227 -8174 -8100 -4391 786 1828 99 -2395 -4621 2965 4970
7491 4970 -534 142 4424 4260 592 -1519 5294 2372 365 643 -1650 -87 495 -526 -2922 -7559
7475 -7559 -4248 -7018 -9030 -8389 -4701 -2888 -111 -5804 -6441 -5596 -8190 -8517 -4755 -4794 -2620 2417
$$ packed form
7587G557m221K2n511k820j093p23j761l987R412K758N346m73k191K002n026r199
7571i908j537J327M085Q843l510l093l761L405O117m027l762P16j218M984N5L114
7555A830K263K335J222P56n225O04j774O145P17j2681L94K920k042m74P980Q154
7539A3124k876m968l079m178j102M439L028J460k959l213n51j990K754J968j922
7524f5Q3j954J935j286j074N794k27l316O198n903M025m912k153Q934jm287L14
7507B105k705k944j008L380Q01n856j947P4L709N177J042j729k494k226P586K005
7491D970n504O76M282j64l668k111O813k922k007K78k293J563N82j021k396m637
7475g559L311k770k012O41L688J813K777n693o37Q45k594l27L762l9K174N037
$$ plain form
7459 2417 2036 -4125 -10359 -11022 -10878 -10269 -5223 -1862 -1182 -2082 -886 1212 1488 1670 -7908 -3123 861
7442 861 2192 1335 -1185 -1655 -3140 3126 6154 3917 -3697 3286 5106 6673 2997 -6831 -10245 -8390
7426 -8390 -4940 2631 6300 5463 5414 5738 3059 1981 -503 -2803 -1829 135 1009 2398 -1252 -10833
7410 -10833 -13459 -12982 -7536 722 382 -1522 5946 9595 3344 3322 -1566 -1846 -1221 -21 -1619 -4699
7394 -4699 -744 -6252 -8769 -2916 -4657 -9837 -15598 -9583 -5998 -8079 -3908 -3782 -2500 -5206 -10127
7379 -10127 -4323 2172 176 -3102 -9499 -14058 -9014 -4175 1136 3461 6235 4962 1175 -421 3204
7364 3204 2087 -3813 -10374 -12654 -7833 9966 15847 8096 5391 6734 -1521 -4367 -3901 -12538 -10980
7349 -10980 -4574 -495 -3084 -1332 2346 9826 12491 9868 13616 18824 19000 10851 3757 1692 6416
$$ packed form
7459B417l81o161o234o63J44O09N046L361O80r00J196K098K76J82r578M785L984
7442H61J331q57k520m70j485O266L028k237p614O983J820J567l676r828l414J855
7426h390L450P571L669q37m9L24k679j078k484k300R74J964Q74J389l650r581
7410a0833k626M77N446Q258l40j904P468L649o251k2m888k80O25J200j598l080
7394d699L955n508k517N853j741n180n761O015L585k081M171J26J282k706m921
7379a0127N804O495j996l278o397m559N044M839N311K325K774j273l787j596L625
7364C204j117n900o561k280M821J7799N881p751k705J343q255k846M66q637J558
7349a0980O406M079k589J752L678P480K665k623L748N208J76q149p094k065M724
$$ plain form
7334 6416 3381 534 -725 3867 214 -9702 -12539 -12483 -4061 -854 -3777 -7201 -5876 1882 4973
7319 4973 7237 9365 -2207 -11017 -9260 -6051 -5191 778 2883 -2020 4968 9330 6450 -500 -3010
7304 -3010 -3449 -4110 1760 -173 1112 5374 6045 3227 10008 6998 184 -494 -2102 -7135 -8917 -8931
7288 -8931 -1121 1181 -8068 -12481 -4952 -144 1037 3123 -3210 -5314 -6209 -6727 -2404 -2337 -2875 -3660
7272 -3660 -1154 -3389 -7582 -9269 -6385 -1025 2159 3530 4056 1885 2578 1072 -2600 -4783 -5750 -7945
7256 -7945 -5245 2031 6512 9997 10129 15275 12371 4964 268 -3472 -10092 -11533 -4556 -1641 -3552
7241 -3552 -2527 764 7632 11919 4098 -3945 -3926 -5025 -3100 2675 11213 14655 12414 6176 1929
7226 1929 -13 -555 407 -5432 -3360 -3045 -6881 -7077 -4856 1731 -2727 -6447 -9371 -11686 -7359 3115
$$ packed form
7334F416l035k847j259M592l653r916k837N6Q422L207k923l424J325P758L091
7319D973K264K128j1572q810J757L209Q60N969K105m903O988M362k880o950k510
7304c010m39o61N870j933J285M262O71k818O781l010o814o78j608n033j782j4
7288h931P810K302r249m413P529M808J181K086o333k104q95n18M323O7n38p85
7272c660K506k235m193j687K884N360L184J371N26k171O93j506l672k183r67k195
7256g945K700P276M481L485J32N146k904p407m696l740o620j441O977K915j911
7241c552J025L291O868M287p821q043J9j099J925N775Q538L442k241o238m247
7226A929j942n42R62n839K072L15l836j96K221O587m458l720k924k315M327J0474
$$ plain form
7210 3115 2255 1635 3115 1256 4417 -2205 -2953 1346 5924 4064 1084 297 4116 3745 7597 7212
7194 7212 4650 8790 4633 3221 4060 7633 11195 9887 7339 4181 3601 5760 11310 11266 10379 5410
7178 5410 109 3215 7619 2372 -2777 -7815 -5540 4388 5753 5311 9578 4816 -222 -3098 -6740
7163 -6740 -5778 -3387 1242 8408 1731 -2865 -6174 -9150 -701 3155 5777 1003 -5820 -12371 -12943
7148 -12943 -13365 -6250 -824 -5818 -6603 -7270 -10723 -8609 -7920 -1926 3218 2881 6142 8048 3110 638
7132 638 -2224 -2359 -4612 -8203 -6909 -1251 1319 -8288 -4014 2106 4912 3572 2545 -2066 2603
7117 2603 2732 -1171 -1407 -2850 -6158 -6022 -2017 -4760 -4191 1142 -868 -1668 -3895 -9141 -7034 -1863
7101 -1863 1322 -4312 -4904 -1624 1827 -765 -2726 -210 -3657 -5697 2126 9157 5973 2779 2571
$$ packed form
7210C115q60o20J480j859L161o622p48M299M578j860k980p87L819l71L852l85
7194G212k562M140m157j412Q39L573L562j308k548l158n80K159N550m4q87m969
7178E410n301L106M404n247n149n038K275R928J365m42M267m762n038k876l642
7163f740R62K391M629P166o677m596l309k976Q449L856K622m774o823o551n72
7148a2943m22P115N426m994p85o67l453K114O89N994N144l37L261J906m938k472
7132F38k862j35k253l591J294N658K570r607M274O120K806j340j027m611M669
7117B603J29l903k36j443l308J36M005k743N69N333k010q00k227n246K107N171
7101a863L185n634n92L280L451k592j961K516l447k040P823P031l184l194k08
$$ plain form
7086 2571 -531 -7586 -8679 -8501 -4492 -3780 -7613 -9027 -6266 -3999 3526 8379 7716 10425 1795 -684
7070 -684 5590 7085 11621 13898 12488 7641 -310 2144 2676 2403 2401 -858 -6344 -4078 344 2713
7054 2713 7169 3936 4101 5324 4366 -450 -5589 -10418 -8948 -3095 5195 8055 -93 316 -5564 -2854
7038 -2854 375 3886 5492 4361 -4228 -6666 -7091 -3968 -3070 -3549 -917 6193 9660 13528 9475 7300
7022 7300 1349 -4029 -4615 -3432 -5712 725 5687 1962 618 5600 6772 10093 9663 1070 -5273
7007 -5273 -1013 -2442 4780 10372 9682 8836 471 -9271 -6071 -2353 -2692 -5634 -4114 -877 -2366 -1981
6991 -1981 -3328 -8494 -16225 -15664 -6918 -3960 -2572 -1105 380 -3435 -3437 795 2600 8201 7285 -4199
6975 -4199 -5408 -6009 -4645 -4189 -2573 -34 398 -4246 -3900 -7244 -10501 -12043 -5486 -700 -996 -2407
$$ packed form
7086B571l102p055j093J78M009P12l833j414K761K267P525M853o63K709q630k479
7070f84O274J495M536K277j410m847p951K454N32k73kl259n486K266M422K369
7054B713M456l233J65J223r58m816n139m829J470N853Q290K860q148M09n880K710
7038b854L229L511J606j131q589k438m25L123Q98m79K632P110L467L868m053k175
7022G300n951n378n86J183k280O437M962l725j344M982J172L321m30q593o343
7007e273M260j429P222N592o90q46q365r742L200L718l39k942J520L237j489L85
6991a981j347n166p731N61Q746K958J388J467J485l815kM232J805N601r16j1484
6975d199j209o01J364M56J616K539M32m644L46l344l257j542O557M786k96j411
$$ plain form
6959 -2407 14 2313 4604 2983 -5950 -13610 -11680 -10512 -8732 653 8414 5238 3404 746 -603
6944 -603 -636 -947 -2531 -10877 -14910 -7318 4334 15821 12158 10639 4478 -3861 -8644 -9717 -9357 -4254
6928 -4254 -3310 -3483 -1706 -3420 -1766 3668 6013 6236 3705 1859 -3467 -2087 -4753 -1907 -1056 -4532
6912 -4532 -6564 -8002 -4823 -1251 -3256 -8485 -7718 -8362 -9973 -4030 1019 -1613 -7371 -7599 -5074 -1632
6896 -1632 3557 5064 1273 -3858 -3016 -3038 -111 -6588 -6848 -3360 3090 1684 4363 1444 -728 -2308
6880 -2308 -3362 -2086 -4181 -1954 3995 5406 3830 5899 7996 11822 7449 2947 6127 7606 4382
6865 4382 2901 -2523 4940 9666 11019 5886 -2433 -2177 2669 4711 -4641 -7154 -3205 -4193 -8607
6850 -8607 -3189 -2793 -2631 -4084 -1302 2039 3022 3730 5247 8412 -1438 -162 4450 -1478 -3935 -3002
$$ packed form
6959b407K421K299K291j621q933p660J930J168J780R385P761l176j834k658j349
6944f03l3l11j584q346m033P592J1652J1487l663j519o161q339m783j073L60N103
6928d254R44j73J777j714J654N434K345K23k531j846n326J380k666K846Q51l476
6912d532k032j438L179L572k005n229P67o44j611N943N049k632n758k28K525L442
6896a632N189J507l791n131Q42k2K927o477k60L488O450j406K679k919k172j580
6880b308j054J276k095K227N949J411j576K069K097L826m373m502L180J479l224
6865D382j481n424P463M726J353n133q319K56M846K042r352k513L949r88m414
6850h607N418L96J62j453K782L341R83P08J517L165r850J276M612n928k457R33
$$ plain form
6834 -3002 -2988 -905 -7264 -6932 -3140 436 -1891 -2581 -2637 -202 1347 4716 11012 9149 10507 10696 1460
6817 1460 -3167 -5700 -6056 -4685 -8821 -4839 -7915 -10179 -4513 -381 -2555 -5564 970 1614 -3060
6802 -3060 -1491 1365 1298 -530 1195 5029 14673 8619 2071 1589 -405 -867 2338 3353 2879 4076
6786 4076 2270 419 -6652 -2899 1466 -1975 -8152 -7477 -6605 -2601 -3531 -5265 -640 521 -2796 -8868
6770 -8868 -12745 -11115 1558 5606 -2059 -5393 -2012 -5278 -2947 1428 6649 15422 14190 10030 6534
6755 6534 4136 2981 5616 12767 15905 8590 6708 2318 3576 -271 1895 4078 7189 4568 970
6740 970 -5097 -837 -3690 -3131 -3776 -1454 7929 7708 5337 4776 -3002 -6995 -4877 -2612 2946 3514
6724 3514 3809 1046 759 390 -1435 -7829 -10699 -4568 -177 -858 -5109 -8232 -5320 -1452 -608 -1806
$$ packed form
6834c002J4K083o359L32L792L576k327o90n6K435J549L369O296j863J358J89r236
6817A460m627k533l56J371m136L982l076k264N666M132k174l009O534O44m674
6802c060J569K856o7j828J725L834R644o054o548m82j994m62L205J015m74J197
6786D076j806j851p071L753M365l441o177O75Q72M004r30j734M625J161l317o072
6770h868l877J630J2673M048p665l334L381l266K331M375N221Q773j232m160l496
6755F534k398j155K635P151L138p315j882m390J258l847K166K183L111k621l598
6740I70o067M260k853N59o45K322R383k21k371n61p778l993K118K265N558N68
6724C514K95k763k87l69j825o394k870O131M391o81m251l123K912L868Q44j198
$$ plain form
6708 -1806 -2369 630 1032 2925 2639 4334 1407 789 3789 -161 -5122 -6783 -7770 -5787 8859 9432
6692 9432 1556 1579 1697 1801 -271 -1768 -4358 -3474 1633 1968 -469 802 -1615 1157 3661 -950
6676 -950 -1976 -1767 -5509 -7347 -1121 2220 -4567 -2863 225 1502 9236 13896 9763 6361 -942
6661 -942 2284 8468 11506 4056 -4330 -2863 2639 1230 2241 6064 7760 4199 4612 7506 9761
6646 9761 5442 4392 1816 1557 -3190 -3978 -5895 -4260 433 7058 10893 6141 716 -3555 -3039 -5250
6630 -5250 -8334 -8914 2435 1681 2224 -778 3219 1410 -5383 -3651 8844 11931 13278 8802 4346
6615 4346 -4802 -7504 -8068 -2352 -759 -914 -2182 -4752 -3887 -3042 -7946 -7355 -516 7389 17097 16212
6599 16212 16195 13755 14796 7902 9706 9362 1951 -7946 -1759 4922 -2684 -1669 1384 6509 10002
$$ packed form
6708a806n63K999M02J893k86J695k927o18L000l950m961j661r87J983J4646N73
6692I432p876K3J18J04k072j497k590Q84N107L35k437J271k417K772K504m611
6676i50j026K09l742j838O226L341o787J704L088J277P734M660m133l402p303
6661i42L226O184L038p450q386J467N502j409J011L823J696l561M13K894K255
6646I761m319j050k576k59m747p88j917J635M693O625L835m752n425m271N16k211
6630e250l084n80J1349p54N43l002L997j809o793J732J2495L087J347m476m456
6615D346r148k702n64N716J593j55j268k570Q65Q45m904N91O839P905R708q85
6599A6212j7k440J041o894J804l44p411r897O187O681p606J015L053N125L493
$$ plain form
6584 10002 8258 3573 1011 -3709 -6700 -4786 4526 11984 14461 17536 10946 7883 5002 3202 6451
6569 6451 4890 5553 4435 5168 3461 -2321 -5927 -4047 -2328 -2365 -7348 -4501 2596 706 -2786 544
6553 544 3730 1777 3947 3931 289 -4086 4397 9628 12136 8740 9670 7943 5815 3068 1527 6443
6537 6443 4912 -869 1641 1026 -7394 -7162 -2234 897 4353 5536 -1219 -4204 -2261 -822 -2506
6522 -2506 -8283 -2998 5476 5310 -594 -8418 -4694 6668 1999 1363 4893 3677 -385 3570 317
6507 317 -2229 6040 4302 -6255 -8050 -2440 -1450 341 -1962 1730 2260 -5903 -12050 -16322 -10195
6492 -10195 -7235 -6292 5300 14424 13273 13011 6949 2890 -4769 -7677 -8378 -6667 -2166 -164 -5196
6477 -5196 -10123 -15655 -9658 -1136 4021 -1112 317 -1354 332 -1600 -1113 4129 4323 5196 1670 2252
$$ packed form
6584A0002j744m685k562m720k991J914R312P458K477L075o590l063k881j800L249
6569F451j561O63j118P33j707n782l606J880J719l7m983K847P097j890l492L330
6553E44L186j953K170j6l642m375Q483N231K508l396R30j727k128k747j541M916
6537F443j531n781K510o15q420K32M928L131L456J183o755k985J943J439j684
6522b506n777N285Q474j66n904p824L724J1362m669o36L530j216m062L955l253
6507C17k546Q269j738j0557j795N610R90J791k303L692N30q163o147m272O127
6492a0195K960R43J1592R124j151k62o062m059p659k908p01J711M501K002n032
6477e196m927n532N997Q522N157n133J429j671J686j932M87N242J94Q73l526N82
$$ plain form
6461 2252 5548 -1046 -8180 -5660 553 240 1725 -3640 -5379 -4746 -2834 1642 8833 10134 5677
6446 5677 6667 7576 6276 -19 -1788 -8494 -4178 327 236 4824 5222 4208 1134 3413 7572 4297
6430 4297 -8741 -15238 -12116 -8076 -6239 -3002 7410 8073 -58 -5377 -5570 -1767 -1930 -2802 -2251 1466
6414 1466 -5501 -5002 1294 2559 -4652 -10379 -7531 -9822 -15587 -12906 -10911 -3112 608 2668 3729
6399 3729 2931 6153 2881 -36 -3235 -1779 -2374 -1686 213 -6671 -5686 -6879 -729 2208 -1373 -457
6383 -457 3201 2588 -1756 1108 100 1299 9831 6368 2348 4396 -63 -3859 -4952 -4889 -1231 -2043
6367 -2043 -3599 -7839 -4157 -1443 3164 6805 7579 5893 3983 4070 1730 -4062 -2915 6180 7576 3733
6351 3733 4874 919 -945 5850 2132 -2750 -8136 -13404 -15479 -8059 -1694 -2783 -6758 -13116 -7870
$$ packed form
6461B252L296o594p134K520O213l13J485n365j739O33J912M476P191J301m457
6446E677R90R09j300o295j769o706M316M505r1M588L98j014l074K279M159l275
6430D297j3038o497L122M040J837L237J0412O63q131n319j93L803j63q72N51L717
6414A466o967M99O296J265p211n727K848k291n765K681J995P799L720K060J061
6399C729p98L222l272k917l199J456n95O88J899o884R85j193O150K937l581R16
6383d57L658o13m344K864j008J199Q532l463m020K048m459l796j093O3L658q12
6367b043j556m240L682K714M607L641P74j686j910Q7k340n792J147R095J396l843
6351C733J141l955j864O795l718m882n386n268k075P420O365j089l975o358N246
$$ plain form
6336 -7870 -4604 -4516 2805 4222 -1533 -2333 1169 3096 584 564 3211 2320 -8541 -14561 -12117 -2895
6320 -2895 -515 -1495 -4950 -8850 -9545 -6120 -2308 -5244 -1662 2410 -2033 -2900 -1159 -1027 -6986 -7025
6304 -7025 -4519 -2845 -7773 -4726 2897 3020 -282 911 3087 1568 319 -3822 -4004 1104 4379
6289 4379 -2743 -6325 -9328 -8085 -2522 -3480 -8292 -9849 -4260 1272 2889 -4983 -9575 -7661 -6015
6274 -6015 -11450 -7784 -10722 -8564 -6295 -394 5518 5868 5045 6105 -3775 -9446 -14380 -17089 -10072
6259 -10072 -8065 -11923 -11571 -6238 -3989 -2154 -1683 -1419 -6091 -6381 -3399 1194 -2552 -2951 -4392 -10893
6243 -10893 -1247 3774 4560 -1610 -7604 -4238 -3849 -9734 -9459 -4856 986 2410 1790 1177 -1059 -9687
6227 -9687 -13618 -7361 -6787 -3312 2755 -154 -11916 -10442 -5161 -2262 -9943 -13990 -5204 -3015 1006
$$ packed form
6336g870L266Q8P321J417n755q00L502J927k512k0K647q91j0861o020K444R222
6320b895K380r80l455l900o95L425L812k936L582M072m443q67J741J32n959l9
6304g025K506J674m928L047P623J23l302J193K176j519j249m141j82N108L275
6289D379p122l582l003J243N563r58m812j557N589N532J617p872m592J914J646
6274f015n435L666k938K158K269N901N912L50q23J060r880n671m934k709P017
6259a0072K007l858L52N333K249J835M71K64m672k90K982M593l746l99j441o501
6243a0893R646N021P86o170n994L366L89n885K75M603N842J424o20o13k236q628
6227i687l931O257N74L475O067k909j1762J474N281K899p681m047Q786K189M021
$$ plain form
6212 1006 273 -730 -4744 -10030 -12697 -12027 -7599 -2372 -10549 -10399 -9240 568 7813 10532 8438 12431
6196 12431 10957 6575 4565 8713 5948 2349 5651 3706 6494 4429 408 -3481 -3802 -7538 -9017
6181 -9017 1720 4829 2199 1751 -1108 -5834 -3364 -5031 1678 2743 1803 4356 4074 4335 1328 -3540
6165 -3540 4745 -2680 -4307 -2161 -7570 -14585 -14667 -9770 1298 2598 -1258 -4008 -9367 -8763 -1340
6150 -1340 1216 2942 10065 10826 7262 -723 -1473 -3135 -6957 -8058 -1670 -1246 -3205 -2133 -4940 -111
6134 -111 -966 -5410 -3461 -4197 -4512 -9445 -7154 -7120 -3383 -5096 -5603 -4866 -4680 -10059 -6810 -3684 -4240
6117 -4240 -3075 -4282 -32 4237 8184 7335 10151 10547 7409 -492 -4014 -7465 -1310 2246 3685
6102 3685 6915 2652 -746 -646 1449 4184 -1465 483 600 -106 1117 -4306 -4870 2001 3377 187
$$ packed form
6212A006p33j003m014n286k667O70M428N227q177J50J159R808P245K719k094L993
6196A2431j474m382k010M148k765l599L302j945K788k065m021l889l21l736j479
6181i017J0737L109k630m48k859m726K470j667O709J065r40K553k82K61l007m868
6165c540Q285p425j627K146n409p015q2M897J1068J300l856k750n359O04P423
6150a340K556J726P123P61l564p985p50j662l822j101O388M24j959J072k807M829
6134a11q55m444J949p36l15m933K291L4L737j713n07P37J86n379L249L126n56
6117d240J165j207M250M269L947q49K816L96l138p901l522l451O155L556J439
6102C685L230m263l398J00K095K735n649J948J17p06J223n423n64O871J376l190
$$ plain form
6086 187 370 -2471 -3874 -3514 -4746 -5233 589 -582 4232 -109 -2512 -1803 -5794 -5031 469 -3668
6070 -3668 -13647 -17675 -16181 -18472 -22372 -20109 -10563 -2628 -6140 -2311 384 -2666 4099 2105 1691
6055 1691 -2612 -1097 3582 2461 4784 4297 -1478 -1042 -1286 -3364 -1399 -2586 -2592 470 -1535 -810 2362
6038 2362 6842 8382 7828 4540 1397 -2781 -7506 -5368 -1811 -604 5143 9580 12489 9623 2890
6023 2890 1297 -2169 -6404 -8906 -9558 -2477 7294 -243 -5831 -2528 1289 -4878 -10456 -6296 -2074
6008 -2074 5221 4631 4532 -1050 -5758 -4158 -2424 -2588 -5542 3856 7715 4861 -1851 -7960 -3405 1448
5992 1448 -972 -4138 -3640 -1097 2128 -988 -5471 79 8608 7498 392 -3742 -5177 -13630 -17886
5977 -17886 -11197 -3550 2982 -511 -2431 -3111 -3772 4028 8316 1962 -1201 2250 4603 -1139 -3150
$$ packed form
6086A87J83k841j403L60j232m87N822j171M814m341k403P09l991P63N500m137
6070c668r979m028J494k291l900K263R546P935l512L829K695l050O765j994m14
6055A691m303J515M679j121K323m87n775M36k44k078J965j187oL062k005P25L172
6038B362M480J540n54l288l143m178m725K138L557J207N747M437K909k866o733
6023B890j593l466m235k502o52P081R771p537n588L303L817o167n578M160M222
6008b074P295n90r9n582m708J600J734j64k954R398L859k854o712o109M555M853
5992A448k420l166M98K543L225l116m483N550Q529j110p106m134j435q453m256
5977a7886O689P647O532l493j920o80o61P800M288o354l163L451K353n742k011
$$ plain form
5962 -3150 -7529 -5984 518 -3675 -8737 -12136 -11260 -1653 -5322 -13154 -12992 -10343 -9863 -6304 -1177 4810
5946 4810 2632 -117 3736 5704 2270 -968 3591 9092 7294 4665 10971 11279 9408 4856 157
5931 157 9178 13195 6839 -2825 -2518 3407 3071 -6520 -12169 -17689 -23327 -20377 -14496 -13637 -7085 3160
5915 3160 8855 2151 1701 5871 7515 4408 9163 13060 8518 -1949 -5837 -12013 -11562 -12728 -15294
5900 -15294 -8330 -1976 -5382 -7047 -11668 -10988 1110 1835 -7549 -8349 -3871 -3562 -5734 -6126 -8821 -9803
5884 -9803 -6949 -7104 -3989 -4966 -5610 1701 4839 -438 -2965 6515 8600 6832 4843 -666 3683 3701
5868 3701 9305 9704 6802 7882 5557 3906 6845 7850 286 1037 2561 104 1169 -5057 -10125
5853 -10125 -7941 -5801 -3237 -4968 39 -76 -1771 -4393 -9207 -10342 -5170 -5096 -2812 -578 -2978
$$ packed form
5962c150m379J545O502m193n062l399Q76R607l669p832J62K649M80L559N127N987
5946D810k178k749L853J968l434l238M559N501j798k629O306L08j871m552m699
5931A57R021M017o356r664L07N925l36r591n649n520n638K950N881Q59O552J0245
5915C160N695o704m50M170J644l107M755L897m542j0467l888o176M51j166k566
5900a5294O964O354l406j665m621O80J2098P25r384q00M478L09k172l92k695r82
5884i803K854j55L115r77o44P311L138n277k527R480K085j768j989n509M349J8
5868C701N604L99k902J080k325j651K939J005p564P51J524k457J065o226n068
5853a0125K184K140K564j731N007j15j695k622m814j135N172P4K284K234k400
$$ plain form
5838 -2978 -343 1509 2431 1180 -1510 -5867 -6758 -767 2346 -2592 2557 2584 596 751 -6495 -8602
5822 -8602 -10442 -11664 -11469 -8184 -10781 -5426 -5757 -11514 -11430 -6891 -2216 -2395 -1462 420 4474 12684
5806 12684 11047 5007 -970 -1825 -588 -2819 146 -3217 -7669 -12761 -4971 238 -6695 -6612 -3257
5791 -3257 -1766 -3511 -1191 -3371 3572 11747 6151 9388 8817 6012 7192 7454 6935 -1970 -10025 -12511
5775 -12511 -8546 -3684 -1519 14109 17123 8643 6536 3662 3470 6734 5208 -895 1339 3857 7018
5760 7018 7300 6886 12768 5181 -6663 -6741 -1958 5903 6287 2344 -4151 -3338 447 -1024 2083 4083
5744 4083 7637 5606 1183 -2762 -773 2935 5341 2829 1830 -2379 -5602 -4084 -5303 -7874 -5346
5729 -5346 776 2200 3843 1318 -530 -2952 -8550 -3941 1963 3651 3041 298 -2438 2245 -396
$$ packed form
5838b978K635J852R22j251k690m357q91N991L113m938N149K7j988J55p246k107
5822h602j840j222J95L285k597N355l31n757Q4M539M675j79R33J882M054Q210
5806A2684j637o040n977q55J237k231K965l363m452n092P790N209o933Q3L355
5791c257J491j745K320k180O943Q175n596L237n71k805J180K62n19q905q055k486
5775a2511L965M862K165J5628L014q480k107k874j92L264j526o103K234K518L161
5760G018K82m14N882p587j1844p8M783P861L84l943o495Q13L785j471L107K000
5744D083L554k031m423l945J989L708K406k512r99m209l223J518j219k571K528
5729e346O122J424J643k525j848k422n598M609N904J688o10k743k736M683k641
$$ plain form
5714 -396 -1850 -8102 -10671 -10287 -8094 -4195 -2701 -652 -2479 -7792 -7639 -8478 -11626 -11120 -4157 -1090
5698 -1090 -3220 -8177 -2983 6857 16848 17411 10932 2031 771 -7117 -4043 6759 6965 7439 1632
5683 1632 147 -567 3233 5456 526 -1308 3244 4715 1792 -3334 -1861 4139 6040 6035 253 -2967
5667 -2967 -6514 -1550 5337 7077 5132 579 5995 6695 3764 4746 1360 -585 -275 -3427 -6599 -8323
5651 -8323 -9535 -9042 -4737 -3891 -3265 -461 -4217 -5430 -1294 -4048 -4785 -4874 -9306 -13788 -9217 -7120
5635 -7120 -7494 -16549 -16320 -7210 -6977 -3312 -4055 -410 11095 13241 8462 3753 3682 896 3784 3158
5619 3158 4705 5598 1962 5518 4740 -3746 -14850 -13591 -2358 2318 -3853 -7484 -3153 -3806 -4981
5604 -4981 -6312 -7128 -988 4294 -1824 -9606 -9554 -9479 -5451 -4307 -1551 -1410 1128 1220 -1387 -1218 -6045
$$ packed form
5714c96j454o252k569L84K193L899J494K049j827n313J53q39l148N06O963L067
5698a090k130m957N194R840R991N63o479q901j260p888L074J0802K06M74n807
5683A632j485p14L800K223m930j834M552J471k923n126J473O000J901nn782l220
5667b967l547M964O887J740j945m553N416P00k931R82l386j945L10l152l172j724
5651h323j212M93M305Q46O26K804l756j213M136k754p37q9m432m482M571K097
5635g120l74r055K29R110K33L665p43L645J1505K146m779m709p1k786K888o26
5619C158J547Q93l636L556p78q486j1104J259J1233M676o171l631M331o53j175
5604d981j331q16O140N282o118p782N2P5M028J144K756J41K538R2k607J69m827
$$ plain form
5587 -6045 -3417 -1069 -1620 -4621 -3665 -1865 -2898 -10291 -14080 -5473 -1629 -8210 -12380 -16916 -13750
5572 -13750 -10465 -4801 -6752 -9457 -3603 108 -1368 -9845 -5249 412 -3561 -10076 -14153 -11036 -9769
5557 -9769 -7901 -2672 60 -6033 -9632 17 -3025 -8060 -8584 -9437 -9403 -7836 -5270 -5111 -4715 -2807
5541 -2807 -3504 812 -214 1145 -264 -4020 -5464 4497 2091 -3907 -1109 1096 -2884 -8985 -14578
5526 -14578 -13159 117 962 2528 -72 1015 987 1126 5736 818 272 10900 9954 5265 -512 -11387
5510 -11387 -10465 -7136 1812 1151 -323 -4121 -7009 -2314 3208 -977 -8762 -7347 -3747 -1072 1880
5495 1880 3045 -3111 -10756 -15648 -7995 -899 -1447 -2710 907 -3521 -926 3331 -2342 -4203 -6485
5480 -6485 -6114 -2817 -993 -2267 -1481 -5930 -7763 -5311 -3155 7040 6615 670 -3447 -6449 -7332 -5811
$$ packed form
5587f045K628K348n51l001R56J800j033p393l789Q607L844o581m170m536L166
5572a3750L285N664j951k705N854L711j476q477M596N661l973o515m077L117J267
5557i769J868N229K732o093l599R649l042n035n24q53L4J567K566J59L96J908
5541b807o97M316j026J359j409l756j444R961k406n998K798K205l980o101n593
5526a4578J419J3276Q45J566k600J087k8J39M610m918n46J0628r46m689n777j0875
5510a1387R22L329Q948o61j474l798k888M695N522m185p785J415L600K675K952
5495A880J165o156p645m892P653P096n48j263L617m428K595M257n673j861k282
5480f485L71L297J824j274P86m449j833K452K156J0195m25n945m117l002q83J521
$$ plain form
5464 -5811 -8894 -4887 2668 5535 -950 -10838 -14197 -13070 -9002 -1085 2606 6834 7762 4471 -4923
5449 -4923 -8754 306 5119 1889 4808 7572 7202 1236 -1612 1819 3889 2547 -6528 -7415 -1889
5434 -1889 1871 2760 4381 6946 8322 6771 1336 -5939 -3129 20 3037 3781 6838 16359 11260
5419 11260 6928 4315 3466 3425 -3896 -10985 -7731 -5545 -10591 -13545 -6752 -3984 -12979 -15856 -8759
5404 -8759 -1023 -2913 -10069 -15046 -10588 -5368 -8409 -16207 -19376 -14045 -10274 -4113 -3087 -4006 -6034
5389 -6034 -11391 -3997 -2771 -5052 3407 5416 4576 10122 10033 9115 5265 6482 182 -7154 -14074 -9077
5373 -9077 3212 3421 957 492 4189 2350 -1441 -8187 -7500 -2860 -419 -6771 -8193 -3142 -3521 -4418
5357 -4418 -4253 -3622 -2678 -2393 4138 4337 -713 -5018 -8502 -4237 -670 -5850 -9270 -9390 -5240 -3156
$$ packed form
5464e811l083M007P555K867o485r888l359J127M068P917L691M228R28l291r394
5449d923l831R060M813l230K919K764l70n966k848L431K070j342r075q87N526
5434a889L760Q89J621K565J376j551n435p275K810L149L017P44L057R521n099
5419A1260m332k613q49m1p321p089L254K186n046k954O793K768q995k877P097
5404h759P736j890p156m977M458N220l041p798l169N331L771O161J026r19k028
5389f034n357P394J226k281Q459K009q40N546q9r18l850J217o300p336o920M997
5373i077J2289K09k464m65L697j839l791o746O87M640K441o352j422N051l79q97
5357d418J65O31R44K85O531J99n050m305l484M265L567n180l420j20M150K084
$$ plain form
5341 -3156 -6848 -9445 -10634 -13161 -9209 -8576 -10233 -1008 3023 2157 -1409 -4005 -5627 -3044 -6461
5326 -6461 -13653 -14208 -14312 -13530 -11730 -1005 4459 5308 1885 1471 9399 14340 6098 4917 5758 7968
5310 7968 4401 3527 -281 -8975 -6759 -2674 -1881 -4304 -3162 -4456 -3938 805 -2607 -5168 -4222 -5260
5294 -5260 -6757 -7593 -2409 2048 2652 -377 3477 4781 5305 4124 4709 7275 11955 12126 4730 -2287
5278 -2287 -8936 -5375 -3365 -3576 -2963 -4743 -3651 -3141 -8773 -5797 -2902 -4666 -11502 -10296 -11115 -6889
5262 -6889 -10292 -9702 -2450 -7343 -10304 -3438 -1378 -1875 1460 3999 -2046 -3852 -4827 -3590 -3432 -2394
5246 -2394 -2144 -1126 3258 6702 11734 11833 2148 1726 4146 -1818 -2421 -4006 -1999 -766 126 2910
5230 2910 1792 3523 -2546 -7636 -9467 -7748 -4361 3331 5959 -1748 -4969 -841 5615 11216 7446
$$ packed form
5341c156l692k597j189k527L952O33j657R225M031q66l566k596j622K583l417
5326f461p192n55j04P82J800J0725N464Q49l423m14P928M941q242j181Q41K210
5310G968l567q74l808q694K216M085P93k423J142j294N18M743l412k561R46j038
5294e260j497q36N184M457O04l029L854J304N24j181N85K566M680J71p396p017
5278b287o649L561K010k11O13j780J092N10n632K976K895j764o836J206q19M226
5262f889l403N90P252m893k961O866K060m97L335K539o045j806r75J237J58J038
5246b394K50J018M384L444N032R9r685m22K420n964o03j585K007J233Q92K784
5230B910j118J731o069n090j831J719L387P692K628p707l221M128O456N601l770
$$ plain form
5215 7446 943 3129 3878 -1447 -8852 -4679 -4176 -2948 -2807 -3508 -7325 -2962 2883 4399 874 -2126
5199 -2126 -850 -2719 -2181 -2167 3195 2466 -2044 -1673 -4120 1960 7382 5693 8878 9207 3740 996
5183 996 -7550 -4571 -3850 -5377 -6041 -4123 6015 10723 5423 5730 11011 7380 1234 7527 8600 -5061
5167 -5061 -2788 4506 5145 5452 10130 12712 9103 12342 10604 -877 -7047 -10567 -3345 5762 7821
5152 7821 -5217 -15285 -19169 -11976 -9302 -7951 -3453 236 1456 1287 933 -382 -6496 -8790 -4058
5137 -4058 -2963 -7343 -1490 3043 1554 -2689 -6886 -9956 -5057 -2499 -1185 255 4245 3028 5057
5122 5057 1903 -989 -309 -3018 -2801 502 2471 -3706 -6313 -1845 -205 2111 3760 1768 1295 867
5106 867 -6880 -4726 -2497 -2875 -994 -6560 -4879 -3811 -2984 6742 9544 9772 10497 9019 8335 5603
$$ packed form
5215G446o503K186P49n325p405M173N03J228J41p01l817M363N845J516l525l000
5199b126J276j869N38J4N362p29m510L71k447O080N422j689L185L29n467k744
5183I96q546K979P21j527o64J918J0138M708n300L07N281l631o146O293J073j3661
5167e061K273P294O39L07M678K582l609L239j738j1481o170l520P222R107K059
5152G821j3038j0068l884P193K674J351M498L689J220j69l54j315o114k294M732
5137d058J095m380N853M533j489m243m197l070M899K558J314J440L990j217K029
5122E057l154k892O80k709K17L303J969o177k607M468J640K316J649j992m73m28
5106H67p747K154K229l78J881n566J681J068Q27R726K802K28P25j478o84k732
$$ plain form
5090 5603 -686 -5123 1268 6254 6078 3098 -3686 3427 8561 434 -423 -2711 -5053 -1993 -6381
5075 -6381 -2095 2184 2309 7247 10181 4718 -4883 -7380 -11188 -11286 -1627 1269 -1447 -2600 -5836 -11070
5059 -11070 -18511 -16996 -10157 -12229 -9031 383 1289 -6183 -7725 -5905 -3043 -3897 847 -5911 -7222
5044 -7222 -8878 -2019 4141 5582 3380 3004 5646 1313 -1847 258 4676 3770 -879 -1394 -1066 -1515
5028 -1515 -4903 -4903 -4704 -3929 -1074 2718 3247 -1272 -1998 2385 407 -1030 -3746 -7210 -5984 -2305 -1148
5011 -1148 1088 3616 2318 528 -1404 -3604 -1079 -4295 -4767 -5945 -5462 -3059 898 859 -1406 -4320
4995 -4320 -3426 2127 4911 2259 1379 10577 16956 11816 -780 -5332 -7734 -8498 -6955 -7390 -9113 -12804
4979 -12804 -16698 -13300 -5927 4113 5620 2403 4275 2574 -7862 -9868 -6858 -2136 -7381 -8847
$$ packed form
5090E603o289m437O391M986j76k980o784P113N134q127q57k288k342L060m388
5075f381M286M279J25M938K934n463r601k497l808r8R659K896k716j153l236n234
5059a1070p441J515O839k072L198R414R06p472j542J820K862q54M744o758j311
5044g222j656O859O160J441k202l76K642m333l160K105M418r06m649n15L28m49
5028a515l388%J99P75K855L792N29m519p26M383j978j437k716l464J226L679J157
5011a148K236K528j298j790j932k200K525l216m72j178M83K403L957l9k265k914
4995d320Q94N553K784k652q80R198O379n140j2596m552k402p64J543m35j723l691
4979a2804l894L398P373J0040J507l217J872j701j0436k006L010M722n245j466
$$ plain form
4965 -8847 -12901 -11365 -4756 4125 4911 -2914 1463 3989 1137 4871 9945 11124 2579 -4146 -3921
4950 -3921 -1241 2680 8423 13308 11970 3202 3029 5074 5735 7355 3345 -1285 1230 -2317 -8017
4935 -8017 -6501 -4740 -3050 -892 -7811 -5820 -972 3015 -670 -5656 -7636 -5822 -1087 -2236 -13521
4920 -13521 -17338 -16551 -13473 -15304 -13791 -9198 -3878 1661 -1350 -3246 -8074 -10510 -9776 -3858 -530
4905 -530 -6501 -9994 -9349 -5430 -3907 -2090 -2710 -9012 -7485 1514 7102 4606 1186 -4942 -4456 -4256
4889 -4256 -6340 -9462 -6003 -7794 -3284 3509 5599 2989 -785 675 2893 2001 -2197 -5271 -7538
4874 -7538 -8841 -4491 137 -2314 -6657 -5908 -2966 1791 5195 9012 9707 2680 70 -138 -5878 -19712
4858 -19712 -17048 -8130 -3717 -5362 -5475 -6318 -5071 -2647 -5801 -7752 -9471 -4337 1082 -5903 -464
$$ packed form
4965h847m054J536O609Q881P86p825M377K526k852L734N074J179q545o725K25
4950c921K680L921N743M885j338q768j73K045O61J620m010m630K515l547n700
4935h017J516J761J690K158o919J991M848L987l685m986j980J814M735j149j1285
4920a3521l817P87L078j831J513M593N320N539l011j896m828k436P34N918L328
4905e30n971l493O45L919J523J817o20o302J527Q999N588k496l420o128M86K00
4889d256k084l122L459j791M510O793K090k610l774J460K218q92m198l074k267
4874g538j303M350M628k451m343P49K942M757L404L817O95p027k610k08n740j3834
4858a9712K664Q918M413j645j13q43J247K424l154j951j719N134N419o985N439
$$ plain form
4843 -464 -3377 -9300 -7006 -5848 -2644 3565 6889 7247 7391 3065 -4147 -4385 -9342 -6839 -3694 -183
4827 -183 285 -1107 -1975 -4280 -2602 6094 9462 13300 7737 3383 -1443 -5726 -6656 -6938 -8792 -8094
4811 -8094 -12227 -5014 1626 1110 1186 1166 -5793 -7448 -9582 -6305 -9111 -9300 -4252 -343 4082 707
4795 707 -7008 -10566 -2262 7065 9837 9412 7103 -1467 -6015 -3981 -3407 -2261 -5668 -10957 -12120 -4714
4779 -4714 -9545 -14604 -8669 -5945 -1884 -4264 -7618 -11694 -12259 -9737 -4689 -277 4433 4203 1848
4764 1848 -1416 3342 5430 4042 1479 -2291 -1718 1882 4330 1150 374 295 -972 -1936 -6732 -761
4748 -761 2266 6884 7335 498 4110 5265 -3545 -1836 13469 12716 10320 11099 7967 3541 4696 6685
4732 6685 3348 -9 -353 3325 -1324 -1462 2447 5569 5690 4075 2319 475 -458 -1932 -5524 -12502
$$ packed form
4843d64k913n923K294J158L204O209L324L58J44m326p212k38m957K503L145L511
4827a83M68j392q68k305J678Q696L368L838n563m354m826m283r30k82j854O98
4811h094m133P213O640n16P6k0o959j655k134L277k806j89N048L909M425l375
4795G07p715l558Q304R327K772m25k309q570m548K034N74J146l407n289j163P406
4779d714m831n059N935K724M061k380l354m076n65K522N048M412M710k30k355
4764A848l264M758K088j388k563l770N73L600K448l180p76p9j267r64m796N971
4748g61L027M618M51o837L612J155q810J709J5305p53k396P79l132m426J155J989
4732F685l337l357l44L678m649j38L909L122J21j615j756j844r33j474l592o978
$$ plain form
4716 -12502 -15200 -6873 5208 6111 419 -2373 -2447 2564 6545 1987 -835 880 -1142 -10719 -14041
4701 -14041 -8452 -3504 -2958 -3241 -6213 -10857 -10223 -6968 -2702 4876 3650 -4091 -7624 -2085 4517
4686 4517 1936 -3211 -1699 1355 3970 -2445 -11643 -10176 -2856 3457 5359 5326 3369 -2511 -2506 -2943
4670 -2943 -5083 -2509 -1709 405 -3312 1399 7877 -1433 -4819 -1572 306 -834 -2708 -6053 -5335
4655 -5335 795 2917 -3816 5085 11552 5819 5006 717 -2790 -3237 3312 6049 4671 1553 -1553
4640 -1553 590 2080 -1765 -3338 -3673 -9067 -14300 -11340 -3461 3795 3967 1220 1599 -271 -2421 -5133
4624 -5133 -9595 -6972 -2113 1808 6688 4567 10174 6373 4281 773 -1626 7277 9662 -675 -647
4609 -647 -2872 -2935 -5521 -6260 -74 750 3994 4813 2106 -6484 -7112 -3598 1885 211 -2269 -4686 -4716
$$ packed form
4716a2502k698Q327J2081R03n692k792p4N011L981m558k822J715k022r577l322
4701a4041N589M948N46k83k972m644O34L255M266P578j226p741l533N539O602
4686D517k581n147J512L054K615o415r198J467P320O313J902l3j957n880Nm37
4670b943k140K574Q00K114l717M711O478r310l386L247J878j140j874l345P18
4655e335O130K122o733Q901O467n733q13m289l507m47O549K737j378l118l106
4640a553K143J490l845j573l35n394n233K960P879P256J72k747L79j870k150k712
4624e133m462K623M859L921M880k121N607l801k092l508k399Q903K385j0337K8
4609f47k225o3k586p39O186Q24L244Q19k707q590o28L514N483j674k480k417l0
$$ plain form
4592 -4716 -4487 -6800 -11989 -8376 -2614 2026 1930 1877 -5973 -5333 4851 1676 -6287 -5018 -6388 -12645
4576 -12645 -16367 -16215 -10033 -5785 -751 -2159 -3406 -2039 -607 1592 4031 719 -1867 -1057 -5000
4561 -5000 -906 1181 -4785 -2230 1010 2480 6298 12040 13910 7245 -1288 2156 2982 881 -1993
4546 -1993 -1275 -6298 -3827 -36 2472 5911 11860 10846 7519 3320 -2674 671 5161 3929 642
4531 642 -2127 -4383 -5009 -6379 -6489 -8902 -2283 -122 -1237 -5739 -10238 -9136 -4869 -3446 -5428 -6237
4515 -6237 -5510 -10984 -8517 -4314 -2152 5345 4198 -3765 -6788 -6203 -2198 573 2193 5103 1545
4500 1545 -6895 -11149 -8229 -1945 1666 754 -778 -4714 -5319 1368 4446 4927 8307 7822 619 1930
4484 1930 2538 4670 8762 6590 5391 5081 -4048 -3783 1736 -6601 -9792 -5744 -4653 -6410 -10120 -6267
$$ packed form
4592d716K29k313n189L613N762M640r6n3p850O40J0184l175p963J269j370o257
4576a2645l722J52O182M248N034j408j247J367J432K199K439l312k586Q10l943
4561e000M094K087n966K555L240J470L818N742J870o665q533L444Q26k101k874
4546a993P18n023K471L791K508L439N949j014l327m199n994L345M490j232l287
4531F42k769k256o26j370j10k413O619K161j115m502m499J102M267J423j982q09
4515f237P27n474K467M203K162P497j147p963l023N85M005K771J620K910l558
4500A545q440m254K920O284L611r12j532l936o05O687L078M81L380m85p203J311
4484A930O08K132M092k172j199l10r129K65N519q337l191M048J091j757l710L853
$$ plain form
4468 -6267 2081 7266 -398 -1369 4506 5904 3391 192 -3044 -2520 662 -280 4587 6026 6980 5007
4452 5007 5203 4843 6398 3999 -2153 -3444 -4901 -4611 -3530 -6896 -6541 -5251 -7640 -10164 -10846 -16751
4436 -16751 -14270 -10735 -9466 -7649 -4845 -3014 2212 -810 -9970 -6174 -1797 -554 260 -8444 -6643
4421 -6643 1264 12515 7638 -1890 -2610 3238 3014 2247 5721 7047 9773 3341 -9067 -12416 -2215
4406 -2215 677 4243 2217 -3356 154 1518 925 6353 2031 1441 -1984 -4201 -2702 421 6098
4391 6098 11976 12078 9342 5963 841 -2377 -4383 -431 -66 -4463 -10304 -9566 -6465 -5281 -6381 33
4375 33 3748 9014 7404 2300 71 -1102 -2309 271 7944 7250 6127 -314 2309 3767 2528 -3585
4359 -3585 -5579 -1414 -2739 -7345 -8726 -3785 -244 477 -2020 -4732 -5835 -1485 4089 7383 6693
$$ packed form
4468f267Q348N185p664r71N875J398k513l199l236N24L182r42M867J439R54j973
4452E007J96l60J555k399o152j291j457K90J081l366L55J290k389k524o82n905
4436a6751K481L535J269J817K804J831N226l022r160L796M377J243Q14q704J801
4421f643P907J1251m877r528p20N848k24p67L474J326K726o432j2408l349J0201
4406b215K892L566k026n573L510J364n93N428m322n90l425k217J499L123N677
4391F098N878J02k736l379n122l218k006L952L65m397n841P38L101J184j100O414
4375C3L715N266j610n104k229j173j207K580P673o94j123o441K623J458j239o113
4359c585j994M165j325m606j381M941L541P21k497k712j103M350N574L294o90
$$ plain form
4344 6693 5106 -2356 -5530 -7730 -3803 -2724 -559 3924 6803 8300 9657 9237 5523 622 -5008
4329 -5008 -639 -2770 -4606 -3583 -6123 -3267 -1774 8200 8691 7072 8019 2207 -1183 -1524 3684 2114
4313 2114 901 -299 2658 5575 5948 6420 7214 -760 -4683 -10137 -12674 -10859 -8840 -8518 -7059 -6181
4297 -6181 -1766 -2413 -3180 -1490 -5220 -5931 -7864 -9622 -12161 -10069 -7304 -7306 -15013 -12216 2417 6990
4281 6990 8618 4691 -7042 -1958 235 -3566 -5723 -7579 -3369 6493 1702 -657 -2448 -6312 -6424
4266 -6424 202 -4245 -4217 242 3629 2083 3521 -1829 -5218 -9278 -7317 -1244 6775 4819 -4263
4251 -4263 -4333 -5754 -2784 1770 5327 4264 -737 -456 -2558 3350 8393 10004 1853 448 4874 5576
4235 5576 2214 1194 -3744 -4923 -5123 -7893 -7902 -5660 -3193 3036 1885 -6327 1978 777 -2125 4164
$$ packed form
4344F693j587p462l174k200L927J079K165M483K879J497J357m20l714m901n630
4329e008M369k131j836J023k540K856J493R974M91j619R47n812l390l41N208j570
4313B114j213j200K957K917L73M72P94p974l923n454k537J815K019L22J459Q78
4297f181M415o47p67J690l730p11j933j758k539K092K765kp707K797J4633M573
4281F990J628l927j1733N084K193l801k157j856M210R862m791k359j791l864j12
4266f424O626m447K8M459L387j546J438n350l389m060J961O073Q019j956r082
4251d263p0j421K970M554L557j063n001K81k102N908N043J611q151j405M426P02
4235E576l362j020m938j179k00k770rK242K467O229j151q212Q305j201k902O289
$$ plain form
4219 4164 9623 10245 10332 9490 6495 4966 782 2474 6154 8959 2826 -2364 -2602 6496 8067 8358
4203 8358 4830 -895 1885 1841 -4811 814 -1926 -8222 -3820 -5876 -2783 10525 8558 2426 -2240
4188 -2240 -1830 -2740 -4931 -4275 -232 -3525 3392 3123 -694 -5908 -6467 -11337 -10511 -3434 -1233 -3972
4172 -3972 1249 2845 2171 360 -3503 -5583 -7175 -726 5536 5453 -12 -5119 595 2374 1714 -7931
4156 -7931 -10328 -3984 -1052 4110 14008 18131 7735 -849 3721 5394 -898 3487 5267 -3482 -11054
4141 -11054 -9524 -7082 -6414 -9155 -3771 -5093 -10780 -11533 -8593 -5952 -141 5439 9108 9529 5729
4126 5729 4529 4135 693 -5377 -157 3343 1269 796 3424 -764 2864 -12 36 3482 730 4590
4110 4590 6280 1911 2602 4028 5082 1519 -6917 -8956 -5592 1267 8765 8092 14565 12828 8710
$$ packed form
4219D164N459O22Q7q42k995j529m184J692L680K805o133n190k38R098J571K91
4203H358l528n725K780m4o652N625k740o296M402k056L093J3308j967o132m666
4188b240M10r10k191O56M043l293O917k69l817n214n59m870Q26P077K201k739
4172c972N221J596o74j811l863k080j592O449O262q3n465n107N714J779o60r645
4156g931k397O344K932N162R898M123j0396q584M570J673o292M385J780q749p572
4141a1054J530K442O68k741N384j322n687p53K940K641N811N580L669M21l800
4126E729j200l94l442o070N220L500k074m73K628m188L628k876M8L446k752L860
4110D590J690m369O91J426J054l563q436k039L364O859P498o73O473j737m118
$$ plain form
4095 8710 12521 5596 3304 -2937 -5645 -4786 -8195 -11770 -2537 311 -342 -2159 -4881 -1953 -2183 -2965
4079 -2965 -4448 -2816 935 1979 3840 12613 10606 2984 -3904 -12324 -7727 -641 -1852 -2087 -1390
4064 -1390 -10547 -8896 -9104 -12471 -12781 -9092 -5120 -333 4017 532 -5840 -2112 8612 7304 6370
4049 6370 6404 1110 -3451 -1845 -449 132 -2416 -11045 -10504 -14454 -12783 -16209 -10243 -7921 -8390 -8324 -3538
4032 -3538 -547 2531 5248 8145 5006 -80 1584 4318 3529 3265 10482 9197 2266 -1543 -2582
4017 -2582 -1890 -8533 -7449 -4815 -3436 -7338 -6614 -4173 -5994 -1327 2710 676 -2453 -3016 4390 13527
4001 13527 14102 7333 1277 -3749 1695 2471 3880 5706 3689 4678 6531 7038 3096 2563 3631 7468
3985 7468 6061 4544 5442 7252 11538 10441 713 4132 7451 5974 5967 1347 -485 3566 1448 3753
$$ packed form
4095H710L811o925k292o241k708Q59l409l575R233K848o53j817k722K928k30p82
4079b965j483J632L751J044J861Q773k007p622o888q420M597P086j211k35O97
4064a390r157J651k08l367l10L689L972M787M350l485o372L728J0724j308r34
4049F370L4n294m561J606J396N81k548q629N41l950J671l426N966K322m69O6M786
4032c538K991L078K717K897l139n086J664K734p89k64P217j285o931l809j039
4017b582O92o643J084K634J379l902P24K441j821M667M037k034l129n63P406R137
4001A3527N75o769o056n026N444P76J409J826k017R89J853N07l942n33J068L837
3985G468j407j517Q98J810M286j097r728L419L319j477pm620j832M051k118K305
$$ plain form
3969 3753 1457 1884 -328 -6035 -11620 -10654 -4311 20 2772 732 227 -6667 -2153 5400 859 -1084
3953 -1084 -2041 -4726 -5662 414 -1634 -8772 -11056 -5783 1277 8741 15768 7439 5035 5734 3717 2400
3937 2400 1142 737 1241 3096 8802 13031 13953 12501 11294 11795 16500 10702 10058 11044 10916 9018 6492
3920 6492 10148 12428 899 96 -7942 -5361 -1317 -2157 1911 6356 2382 -1578 967 8560 4022
3905 4022 -3669 623 2239 -1595 -2083 3179 -1632 -7371 -2911 -5411 -5671 1081 -5749 -9338 -6058
3890 -6058 -11316 -10487 -9050 -10189 -4794 4294 7750 2458 -8909 -14762 -9816 3782 15701 14724 7977
3875 7977 11373 12221 -1384 -267 5653 10532 14272 9980 -3104 -7727 -1663 3720 -515 -5879 -9018
3860 -9018 538 2687 3152 -7255 -12140 -7035 8663 19633 13240 8642 5287 6148 2031 2023 8626
$$ packed form
3969C753k296M27k212n707n585R66O343M331K752k040n05o894M514P553m541j943
3953a084r57k685r36O076k048p138k284N273P060P464P027q329k404O99k017j317
3937B400j258m05N04J855N706M229R22j452j207N01M705n798o44R86j28j898k526
3920F492L656K280j1529q03q038K581M044q40M068M445l974l960K545P593m538
3905D022p691M292J616l834m88N262m811n739M460k500k60O752o830l589L280
3890f058n258Q29J437j139N395R088L456n292j1367n853M946J3598J1919r77o747
3875G977L396Q48j3605J117N920M879L740m292j3084m623O064N383m235n364l139
3860i018R556K149M65j0407m885N105J5698J0970o393m598l355Q61m117qO603
$$ plain form
3845 8626 9308 8276 5708 -1187 239 2482 2285 -1480 -667 -3364 943 2585 1062 4790 4330 10520
3829 10520 7931 4574 204 -8860 -10377 -2602 1354 -706 -3825 -5590 -8000 -1545 4463 1851 -2193
3814 -2193 -3167 -1513 -5174 -6710 -4775 -4229 -1502 -2975 -2824 -2012 -910 -3083 -8114 -6930 -8305 -12922
3798 -12922 -14656 -7838 -1497 -2656 -6845 -10587 -13656 -5105 1433 4077 -725 -8228 -19150 -15957
3784 -15957 -12779 -16280 -13385 -9952 -3457 539 -4280 -10331 -11865 -5592 -5590 -11730 -11525 -4792 7129
3769 7129 11619 10930 11386 4282 2541 1090 1192 894 9719 12825 12802 7937 5265 981 -6088 -3030
3753 -3030 -2281 2105 2821 9358 1384 -5064 -8582 -8057 -2771 -2004 -1239 -2136 -3791 -7154 -6153 -12131
3737 -12131 -12033 -13797 -13115 -2905 -2742 -4372 -12752 -17690 -4471 -4220 -14397 -16007 -8669 -2359 1093
$$ packed form
3845H626O82j032k568o895J426K243j97l765Q13k697M307J642j523L728m60O190
3829A0520k589l357m370r064j517P775L956k060l119j765k410O455O008k612m044
3814b193r74J654l661j536J935N46K727j473J51Q12J102k173n031J184j375m617
3798a2922j734O818O341j159m189l742l069Q551O538K644m802p503j0922L193
3784a5957L178l501K895L433O495L996m819o051j534O273Ko140K05O733J1921
3769G129M490o89M56p104j741j451J02k98Q825L106k3m865k672m284p069L058
3753c030P49M386P16O537p974o448l518N25N286P67P65q97j655l363J001n978
3737a2131R8j764O82J0210J63j630q380m938J3219K51j0177j610P338O310L452
$$ plain form
3722 1093 2861 -3513 -3614 1697 2023 -1125 1547 5190 5781 9108 13015 12717 9306 6590 -501 -33
3706 -33 1540 3417 5963 9005 6225 4939 1085 702 -885 -230 1755 -592 -3013 -2110 -1254 -1714 -2575
3689 -2575 -1601 6949 9021 3426 2885 -2616 -2939 -36 6140 9918 5640 4931 11974 8679 3634 2186
3673 2186 -1854 -6064 -7567 -5350 274 -4668 -4031 -7530 -12380 -12316 -11362 -9919 -7279 -4949 -7341 -7599
3657 -7599 -5988 -2732 -734 -1008 4824 -2965 -5338 4366 6665 6686 11384 7739 -1791 -2865 -4027 3639
3641 3639 7904 12121 11568 11573 7207 8610 -68 1038 2610 -4195 -5781 648 -3572 -8970 -5251 202
3625 202 -416 1961 4582 2572 2582 5984 963 -8257 -4759 -6915 -6160 4940 6731 -2423 -4767 -2129
3609 -2129 2701 -630 -4812 -1726 -715 400 3557 9255 6763 6315 4878 1881 4371 -12 3405
$$ packed form
3722A093J768o374j01N311L26l148K672L643N91L327L907k98l411k716p091M68
3706c3J573J877K546L042k780j286l854l83j587O55J985k347k421R03Q56m60q61
3689b575R74Q550K072n595n41n501l23K903O176L778m278p09P043l295n045j448
3673B186m040m210j503K217N624m942O37l499m850O4R54J443K640K330k392k58
3657g599J611L256J998k74N832p789k373R704K299K1M698l645r530j074j162P666
3641C639M265M217n53Nm366J403q678J106J572o805j586O429m220n398L719N453
3625B02o18K377K621k010J0L402n021r220L498k156P55J1100J791r154k344K638
3609b129M830l331m182L086J011J115L157N698k492m48j437k997K490m383L417
$$ plain form
3594 3405 7185 7150 8203 7962 8221 8267 1751 -2085 2699 -271 -1010 -2001 -857 -3322 -1683 -2096 -3153
3577 -3153 -3794 -4069 -5013 1254 10931 5156 -2823 2636 5947 5302 6885 4662 4504 2133 1630 1963 1057
$$ packed form
3594C405L780l5J053k41K59M6o516l836M784k970p39r91J144k465J639m13j057
3577c153o41k75r44O267R677n775p979N459L311o45J583k223j58k371n03L33r06
$$ [...]
##END NTUPLES=NMR SPECTRUM
##END=
