##TITLE=Analysis number 328722
Compound Code cd 10430
Project Code adrs
Chemist Name aci
##JCAMPDX= 6.0         $$ Bruker NMR JCAMP-DX V2.0
##DATA TYPE= NMR SPECTRUM
##DATA CLASS= NTUPLES
##ORIGIN= Bruker BioSpin GmbH
##OWNER= nmr
$$ XWIN-NMR		Version 3.5
$$ Thu Jun 28 09:23:07 2007 GMT Daylight Time (UT+1h)  MAYBRIDGE\nmr@NMR_250MHZ
##.OBSERVE FREQUENCY= 250.131544655141
##.OBSERVE NUCLEUS= ^1H
##.ACQUISITION MODE= SIMULTANEOUS (DQD)
##.ACQUISITION SCHEME= undefined
##.AVERAGES= 16
##.DIGITISER RES= 18
##SPECTROMETER/DATA SYSTEM= dpx250
##.PULSE SEQUENCE= zg30
##.SOLVENT NAME= CDCl3
##.SHIFT REFERENCE= (INTERNAL, CDCl3, 0, 16.522)
##AUDIT TRAIL= $$ (NUMBER, WHEN, WHO, WHERE, WHAT)
$$ ##TITLE= Audit trail, XWIN-NMR		Version 3.5
$$ ##JCAMPDX= 5.01
$$ ##ORIGIN= Bruker BioSpin GmbH
$$ ##OWNER= nmr
$$ C:\u/data/dgb/nmr/ADRS/2170/pdata/1/auditp.txt
$$ ##AUDIT TRAIL=  $$ (NUMBER, WHEN, WHO, WHERE, WHAT)
(   1,<2007-06-28 09:22:43.99 +100>,<MAYBRIDGE\nmr>,<NMR_250MHZ>,
      <created by zg, POWCHK disabled, PULCHK disabled
       configuration hash MD5:
       76 6E 9A 78 1E 09 19 81 EC 84 63 8F B0 6A 59 2D
       data hash MD5: 64K
       97 75 D6 A2 F2 3A 14 D6 50 68 E8 44 A6 B3 A7 DC>)
(   2,<2007-06-28 09:22:58.21 +100>,<MAYBRIDGE\nmr>,<NMR_250MHZ>,
      <Start of raw data processing
       ef LB = 0.3 FT_mod = 6 PKNL = 1 SI = 32K 
       data hash MD5: 32K
       CD A9 77 F1 C1 12 14 9D E6 BE A0 62 0E 15 B0 26>)
(   3,<2007-06-28 09:22:59.91 +100>,<MAYBRIDGE\nmr>,<NMR_250MHZ>,
      <apk 
       data hash MD5: 32K
       9E EE 70 DB E1 08 85 33 BF 7D E0 A8 D3 3D E1 63>)
(   4,<2007-06-28 09:23:00.66 +100>,<MAYBRIDGE\nmr>,<NMR_250MHZ>,
      <abs ABSG = 5 
       data hash MD5: 32K
       10 87 02 50 8D 39 84 B6 CD E6 7C 3D DB 54 5A 63>)
$$ ##END=
$$ 
$$ hash MD5
$$ C5 B4 3F C2 82 E9 A2 9C A2 B0 B5 FE 5D ED 5B 0C
##$RELAX= 
##$RELAX= 
##$RELAX= 
##$RELAX= 
##$RELAX= 
##$RELAX= 
##$RELAX= 
$$ Bruker specific parameters
$$ --------------------------
##$DU= <C:\u>
##$EXPNO= 2170
##$NAME= <ADRS>
##$PROCNO= 1
##$TYPE= <nmr>
##$USER= <dgb>
##$AMP= (0..31)
100 100 100 100 100 100 100 100 100 100 100 100 100 100 100 100 100 100 
100 100 100 100 100 100 100 100 100 100 100 100 100 100 
##$AQSEQ= 0
##$AQ_mod= 3
##$AUNM= <au_zg>
##$AUTOPOS= <3 >
##$BF1= 250.13
##$BF2= 250.13
##$BF3= 250.13
##$BF4= 250.13
##$BF5= 500.13
##$BF6= 500.13
##$BF7= 500.13
##$BF8= 500.13
##$BYTORDA= 1
##$CFDGTYP= 0
##$CFRGTYP= 5
##$CHEMSTR= <none>
##$CNST= (0..31)
1 1 145 1 1 1 1 1 1 1 1 1 1 1 1 1 1 1 1 1 1 1 1 1 1 1 1 1 1 1 1 1 
##$CPDPRG= <>
##$CPDPRG1= <>
##$CPDPRG2= <>
##$CPDPRG3= <>
##$CPDPRG4= <mlev>
##$CPDPRG5= <mlev>
##$CPDPRG6= <mlev>
##$CPDPRG7= <mlev>
##$CPDPRG8= <mlev>
##$CPDPRGB= <>
##$CPDPRGT= <>
##$D= (0..31)
0 1 0 0 0 0 0 0 0 0.06 0 0 0 0 0 0 0.0002 0 0 0 0 0 0 0 0 0 0 0 0 0 0 
0 
##$DATE= 1183018962
##$DBL= (0..7)
120 120 120 120 120 120 120 120 
##$DBP= (0..7)
150 150 150 150 150 150 150 150 
##$DBP07= 0
##$DBPNAM0= <>
##$DBPNAM1= <>
##$DBPNAM2= <>
##$DBPNAM3= <>
$$ [...]
##$SUBNAM7= <"">
##$SUBNAM8= <"">
##$SUBNAM9= <"">
##$SW= 20.6930455092707
##$SWIBOX= (0..15)
0 0 3 0 0 0 0 0 0 0 0 0 0 0 0 0 
##$SW_h= 5175.983436853
##$TD= 65536
##$TD0= 1
##$TE= 295.16
##$TE2= 300
##$TE3= 300
##$TEG= 300
##$TL= (0..7)
0 120 120 120 120 120 120 120 
##$TP= (0..7)
150 150 150 150 150 150 150 150 
##$TP07= 0
##$TPNAME0= <>
##$TPNAME1= <>
##$TPNAME2= <>
##$TPNAME3= <>
##$TPNAME4= <>
##$TPNAME5= <>
##$TPNAME6= <>
##$TPNAME7= <>
##$TPOAL= (0..7)
0.5 0.5 0.5 0.5 0.5 0.5 0.5 0.5 
##$TPOFFS= (0..7)
0 0 0 0 0 0 0 0 
##$TUNHIN= 0
##$TUNHOUT= 0
##$TUNXOUT= 0
##$USERA1= <user>
##$USERA2= <user>
##$USERA3= <user>
##$USERA4= <user>
##$USERA5= <user>
##$V9= 5
##$VALIST= <valist>
##$VCLIST= <CCCCCCCCCCCCCCC>
##$VD= 0
##$VDLIST= <DDDDDDDDDDDDDDD>
##$VPLIST= <PPPPPPPPPPPPPPP>
##$VTLIST= <TTTTTTTTTTTTTTT>
##$WBST= 1024
##$WBSW= 4
##$XGAIN= (0..3)
0 0 0 0 
##$XL= 0
##$YL= 0
##$YMAX_a= 263323
##$YMIN_a= -260617
##$ZGOPTNS= <>
##$ZL1= 120
##$ZL2= 120
##$ZL3= 120
##$ZL4= 120
##$ABSF1= 16.522
##$ABSF2= -4.171173
##$ABSG= 5
##$ABSL= 3
##$ALPHA= 0
##$AQORDER= 0
##$ASSFAC= 0
##$ASSFACI= 0
##$ASSFACX= 0
##$ASSWID= 0
##$AUNMP= <proc_1d>
##$AZFE= 0.1
##$AZFW= 0.1
##$BCFW= 0
##$BC_mod= 0
##$BYTORDP= 0
##$COROFFS= 0
##$CY= 12.5
##$DATMOD= 1
##$DC= 0
##$DFILT= <>
##$DTYPP= 0
##$F1P= 14.0000005364418
##$F2P= -0.99999901652339
##$FCOR= 0.5
##$FTSIZE= 32768
##$FT_mod= 6
##$GAMMA= 0
##$GB= 0
##$INTBC= 1
##$INTSCL= 1
##$ISEN= 128
##$LB= 0.3
##$LEV0= 0
##$LPBIN= 0
##$MAXI= 10000
##$MC2= 0
##$MEAN= 0
##$ME_mod= 0
##$MI= 0
##$NCOEF= 0
##$NC_proc= -4
##$NLEV= 6
##$NOISF1= 0
##$NOISF2= 0
##$NSP= 0
##$NTH_PI= 0
##$NZP= 0
##$OFFSET= 16.522
##$PC= 1
##$PHC0= -51.20338
##$PHC1= 9.32346
##$PH_mod= 1
##$PKNL= yes
##$PPARMOD= 0
##$PSCAL= 4
##$PSIGN= 0
##$REVERSE= no
##$SF= 250.13
##$SI= 32768
##$SIGF1= 0
##$SIGF2= 0
##$SINO= 400
##$SIOLD= 32768
##$SREGLST= <1H.CDCl3>
##$SSB= 0
##$STSI= 32768
##$STSR= 0
##$SW_p= 5175.98343685301
##$SYMM= 0
##$S_DEV= 0
##$TDeff= 65536
##$TDoff= 0
##$TI= <Analysis number 999999
Compound Code 99
Book Reference 9
Project Code 9>
##$TILT= no
##$TM1= 0
##$TM2= 0
##$TOPLEV= 0
##$USERP1= <user>
##$USERP2= <user>
##$USERP3= <user>
##$USERP4= <user>
##$USERP5= <user>
##$WDW= 1
##$XDIM= 32768
##$YMAX_p= 604176015
##$YMIN_p= -279615
$$ End of Bruker specific parameters
$$ ---------------------------------
##NTUPLES= NMR SPECTRUM
##VAR_NAME=  FREQUENCY,     SPECTRUM/REAL,   SPECTRUM/IMAG
##SYMBOL=    X,             R,               I
##VAR_TYPE=  INDEPENDENT,   DEPENDENT,       DEPENDENT
##VAR_FORM=  AFFN,          ASDF,            ASDF
##VAR_DIM=   32768,         32768,           32768
##UNITS=     HZ,            ARBITRARY UNITS, ARBITRARY UNITS
##FACTOR=    0.157963299565203, 1,           1
##FIRST=     4132.6476996994, 0,             0
##LAST=      -1043.33573715361, 0,           0
##MIN=       -1043.33573715361, -279615,     0
##MAX=       4132.6476996994, 604176015,     0
$$ Real data points
##PAGE= N=1
##DATA TABLE= (X++(R..R)), XYDATA
$$ [...]
20232 -128187 -101161 -23246 -24090 -3902 -15616 -15718 -1104 -35137 -74364 -79737 7611 132907
20220 132907 141959 88104 180840 155553 95309 -3684 5098 -41548 -121828 -45650 82289 108911
20208 108911 60194 18058 35566 19 -6434 42536 20784 22059 74213 152698 72061 27097
20196 27097 77624 122003 91740 64969 12372 -34661 -58391 -98204 -106297 -52302 -32944 -21763
20184 -21763 -47727 -42973 -43729 -59779 -978 3003 30136 23764 74719 19634 -61368 -56651 -64417
20171 -64417 -65274 -90638 -138395 -152624 -99558 -34597 -49180 -45960 -47046 -16677 679 -61588
20159 -61588 -14174 4282 6250 -29327 1158 33254 -20555 -4146 -43847 -68474 -88110 -114430
20147 -114430 -45490 -3468 -41322 29779 101941 138021 48138 -15603 -4335 784 20387 -17500
20135 -17500 -22170 -51833 -37187 -14902 -21254 9693 44987 18404 78208 81409 32571 46517
20123 46517 57623 34534 41964 55492 16786 -15554 -31712 -24221 36698 -22727 -55716 -62941
20111 -62941 -111739 -169558 -125003 -18041 354 -2040 -40542 3025 86206 125611 97756 3612
20099 3612 -72258 702 35278 37951 14714 62983 51142 -6305 -22658 -51889 -29334 27458
20087 27458 19490 62496 91298 51346 -7011 -31261 -17624 -30672 -100814 -167970 -150782 -56873
20075 -56873 6767 11858 -15439 -82766 -62155 9371 39338 67504 25573 4355 19136 -13780
20063 -13780 15753 70956 52994 24702 -1075 -9736 -4112 -17133 -1968 -78848 -136167 -106649
20051 -106649 -122815 -128095 -92492 -10928 -8128 -19451 -11653 25027 33264 54935 102174 54302
20039 54302 62257 35229 30760 -42057 -429 50341 60401 31156 -5749 -63545 -128813 -113959
20027 -113959 -157583 -112271 -55085 -97922 -47565 -56943 -37799 -9163 31895 54865 29544 12646
20015 12646 -4528 -31766 -73359 -74078 -59069 -38908 -28291 -51091 -15114 51154 23707 -7587
20003 -7587 -42919 13000 26109 12059 39467 45438 23452 -11000 71670 101485 -10873 -73839
19991 -73839 -111159 -122407 -166837 -166226 -116140 -21021 -4532 -35174 -47982 -67154 -35112 48384
19979 48384 71275 -28203 -27593 31152 82928 5767 -85571 -81097 -87118 -97422 -72448 -81456 -139364
19966 -139364 -89438 -81836 -40138 -65310 -93640 -51588 -28607 -88576 -156097 -156555 -157621 -161228
19954 -161228 -76249 20063 -8943 -17386 -22361 40269 120646 163807 131868 125675 143504 49800
19942 49800 -87497 -104798 -88266 -71420 -119069 -146116 -142799 -67814 -67230 -113124 -110484 -125794
19930 -125794 -64114 -24078 -100180 -127485 -217135 -217833 -171413 -172594 -193125 -140636 -148849 -194118
19918 -194118 -169810 -144521 -154756 -85570 -46401 -93862 -133487 -166727 -108495 -121309 -26560
19907 -26560 -9220 -27966 -99629 -142436 -75686 -1906 22289 39097 43937 93093 107437 120217
19895 120217 136793 94772 52198 -13227 -68154 -18837 -25058 -26723 16628 18334 -11114 -2288
19883 -2288 -14199 21303 56113 47347 98063 136446 95332 -40525 -134606 -68657 548 2387
19871 2387 61272 2319 -3754 -65323 -87928 -50603 -41511 -10396 -80870 -101721 -37294 19015
19859 19015 67585 110192 44582 -17514 20622 50269 65741 53687 -33519 12808 77707 85018
19847 85018 33359 23600 112770 140052 94538 51480 -12758 -54328 -34630 -15195 -60380 -57347
19835 -57347 -95964 -78063 -12538 -13181 -60322 -73964 -33555 67677 36994 -5342 -8594 -47599
19823 -47599 -50090 17736 -11368 -30070 -51953 -24657 40128 24522 7864 30236 38750 39947
19811 39947 23846 -20099 -23767 -13886 -55122 -49892 -35110 25899 13515 6225 1094 -45748 -108424
19798 -108424 -134557 -118621 -93570 -33040 49420 31735 -33961 -28922 -58501 -56469 -70111 -115464
19786 -115464 -111647 -87133 -77361 -75293 -27015 -56991 -94673 -158075 -107486 -60245 -47868 -42503
19774 -42503 -38920 -24036 -18266 4593 33563 10215 -4993 -17943 1724 309 22099 7067
19762 7067 -52204 -102872 -146140 -154716 -113252 -83135 -66105 -142049 -45501 79806 64102 7607
19750 7607 -6624 -37756 -316 47662 41524 -20206 701 -49147 -109333 -142500 -144467 -130688
19738 -130688 -147821 -119329 -55860 -41220 45139 21263 -54249 -169510 -124921 -64079 -97797
19727 -97797 -62875 -36728 -50897 -52001 -4481 40992 68193 67584 51423 -22162 -72028 -39176
19715 -39176 -11222 -23544 -31048 -53114 -89668 -86945 -16338 -27291 -76624 -102837 -110074 -102135
19703 -102135 -180006 -235055 -220403 -144041 -85171 10348 16147 -5991 41436 54204 19026 -50977
19691 -50977 -45663 -71964 -37182 3736 -189 1724 16602 68802 88144 58336 24731 -5280
19679 -5280 37993 24935 -42637 -90910 -115498 -55161 -28343 -20443 20033 55058 34367 -6516
19667 -6516 -59449 -116772 -43165 -2023 1358 -10050 -33473 32215 18926 7884 -54849 -94961
19655 -94961 -158506 -136405 -158121 -141350 -48040 -31935 -89734 -109423 -76044 -30337 33513 100384
19643 100384 88507 3754 -16176 7016 772 -74384 -88047 -115518 -160924 -167239 -187124 -167723
19631 -167723 -107451 -86519 -10273 21255 44212 21878 19094 -36310 -10346 42802 101972 124333
19619 124333 97570 85720 48631 -13312 -62737 -121404 -95419 -71337 -136855 -60868 -28498
19608 -28498 -74111 -20319 -58551 -103884 -82224 489 50694 -15911 -125244 -185901 -198690
19597 -198690 -155526 -92654 -20940 -24646 8127 57007 -31546 -129180 -91378 -2900 11013 -24308
19585 -24308 -58687 -212 39661 38999 -14248 40048 54121 29258 -65348 -24639 -53660 -55934
19573 -55934 22713 56055 66186 28095 -6107 -55479 -81342 -72026 -41720 -16373 -28047 -16760
19561 -16760 2347 47258 76633 138310 118452 35500 -4041 -59200 -51307 -63265 -14792 -144
19549 -144 -7668 -41142 -51785 14721 6466 -27292 -47506 -93455 -64259 -83264 -121265 -92931
19537 -92931 -65781 -6043 -19928 -72792 -105871 -72183 -37223 -11943 10990 4172 -27184 -67716
19525 -67716 -103311 -129748 -130233 -143651 -102157 4204 72457 70701 10544 -31260 -85229 -47369
19513 -47369 -78951 -58775 -5728 -69187 -131903 -136695 -81520 -110032 -76270 2680 29550 65780
19501 65780 77377 123363 127049 69067 80571 57164 24956 34159 100752 79596 87638 116630
19489 116630 75622 14120 7363 -47293 -5694 30900 -30867 -60489 -84095 -140857 -170696 -108582
19477 -108582 -40193 -128750 -168940 -158375 -78744 -72158 25426 7944 -58741 6704 19179 -15023
19465 -15023 -19931 -25665 -7322 29838 20183 29441 13978 -34509 -14460 21112 -34408 -70509
19453 -70509 -121734 -98567 -78366 -48185 -25071 -43958 -57141 -59533 -108551 -132719 -147658 -113200
19441 -113200 -11525 -123 -64042 -65854 -19579 31281 61695 48172 65520 24151 -51035
19430 -51035 -56361 -89500 -160435 -114275 -11723 -12709 -47121 -52645 -42645 4950 11869 26532
19418 26532 20821 4036 11440 19767 -49805 -83259 -90550 -107979 -92822 -40958 -24632 -49585
19406 -49585 -18796 38226 28488 -21991 -117882 -98381 -48480 -19518 16072 22121 21933 13817 50895
19393 50895 -19948 -44089 -75181 -71518 -41557 -54062 -102568 -86554 -5725 -11142 31005 54629
19381 54629 27033 -2486 -18545 63426 114845 91552 55295 69269 48105 -2367 2608 5445
19369 5445 65159 65833 -65533 -118877 -81037 -51430 111 87553 45875 -37515 -40297 1238
19357 1238 25515 -118 -42524 10852 31066 23304 4459 -29038 -27887 -114567 -135364 -120317
19345 -120317 -47055 -77992 -24765 -57421 -110564 -97977 -44032 31613 86506 76889 40643 -7146
19333 -7146 4385 -211 55568 46336 -2435 -55843 -87649 -88796 -31351 1497 -47514 -147855
19321 -147855 -111192 -14371 -2382 -4881 -1214 23996 33241 -14253 31846 43435 41404 29786
19309 29786 46518 40912 105825 88394 52389 66438 47210 -11241 -70420 -100698 -131030 -136027
19297 -136027 -64239 -14403 16067 86447 82640 58424 -13310 -57765 -81643 -87324 -66715 25887
19285 25887 34808 -23025 -16497 -1191 10321 -62664 -54202 -68449 -27279 3840 38213 9934
19273 9934 -47328 -108744 9954 92859 100592 43873 -12618 -34351 -19937 -25675 -14289 -3736
19261 -3736 -28105 -50787 11199 14824 23493 30672 -16977 -412 -51456 -55278 8745 73922 8192
19248 8192 -101178 -82742 -52302 -54518 -57719 -109203 -125245 -120192 -139487 -93385 -99781 -87112
19236 -87112 -54913 -18578 -107574 -91454 -100054 -126464 -77098 -17267 -7152 -39475 -43628 -61288
19224 -61288 -5156 -25728 -86630 -57792 22239 25481 -21793 -13732 -15753 -25198 -44482 -57268
19212 -57268 -91708 -130428 -71978 -31186 -12297 -5629 -11396 -92709 -93759 -83114 -87192 -73658
19200 -73658 -131082 -139785 -88013 -77974 -26035 31049 15694 -52570 -65853 -81174 -131854 -139209
19188 -139209 -111649 -71317 -34877 -5198 34673 21823 -19004 -12890 52740 50236 -91749 -122416
19176 -122416 -81484 -55047 -29607 -23427 -17326 -13043 -29650 -31780 23835 117561 102267 37033
19164 37033 -14453 -21666 -30905 15482 106437 137906 110746 24362 -12105 38186 86138 24875
19152 24875 -8292 40273 28223 40602 -5281 -26383 24443 -28775 -35559 -21223 -35187 -34543
19140 -34543 -16996 -41103 -33926 -21088 -23895 -32861 -27253 -31573 -72912 -38897 8738 -41468 -41239
19127 -41239 -95941 -110741 -73395 6604 38262 -28735 -51559 -24581 -18594 14054 62832 -10751
19115 -10751 -12839 -46954 -61705 -79449 -107068 -62618 -49850 -22596 24711 4743 -7680 -23418
19103 -23418 3630 -22588 -31183 -87372 -128906 -88972 -64580 -41527 -59675 -138089 -103408 -56387
19091 -56387 -54599 -79264 -75735 908 22067 40336 -1099 -39560 -78590 -46164 36607 7090
19079 7090 -35824 62148 76663 71667 73435 51818 -64428 -125279 -124106 -141275 -150489 -85177
19067 -85177 -38464 -31409 1730 46384 22085 10554 -4125 -47781 -67208 -64934 42294 90994
19055 90994 79846 28416 -31164 -73479 13083 46250 37080 37444 96111 68808 -910 -101484
19043 -101484 -90482 29670 47991 5592 50719 80300 48354 11560 403 6663 198 9272
19031 9272 19891 36790 4466 -125823 -197077 -143946 -111304 -99625 -17874 -20134 -10829 -83440
19019 -83440 -107119 -44712 8481 -3514 -53281 -42448 -40683 -71115 -58381 -75939 -107409 -110069
19007 -110069 -43808 -23498 4344 50840 35018 -19511 9777 39890 66820 63838 11021 33819
18995 33819 -60537 -95664 -63385 -9048 54395 64605 4670 -35261 -78676 -52861 -19200 38778
18983 38778 13463 -107117 -168756 -101253 -6986 28476 47161 47595 28126 -18384 -20116 -77245
18971 -77245 -72332 -56506 -41333 -19356 -20465 -42504 -89172 -85545 -50120 26753 34042 -40507
18959 -40507 -85035 -99195 -31472 -44796 -101466 -99500 -41612 36821 53385 11652 -79996 -103741
18947 -103741 -102557 -43578 -22873 -20029 9835 -29211 -73630 -121747 -51082 -22498 -76885 -56089
18935 -56089 -81167 -41783 -54953 -71057 -99318 -118927 -90493 -66836 -29200 -58945 -65998 -27363
18923 -27363 14959 -47848 -12291 -5405 -47369 -119312 -119489 -95758 -88880 -111272 -136466 -129885 -83898
18910 -83898 -49065 -14297 33256 73854 115965 91991 66075 33935 -28658 -47650 -134587 -126483
18898 -126483 -19825 -22360 -4449 -14824 -36801 -42983 -40645 -52845 -30517 3916 -1200 44553
18886 44553 32011 -58252 -36136 -94341 -80464 4798 -17953 -50045 -54316 -65030 -3570 17416
18874 17416 6340 -42917 -65595 -62402 -84995 -16429 5250 25547 -12629 -62989 -84078 -110730
18862 -110730 -27075 -9840 -63922 -108199 -134929 -167575 -143842 -97328 -63279 -125942 -95536
18851 -95536 -68633 -77243 -79206 -73454 -26205 -12821 -25133 -29883 -59057 -62621 -10534 2863 -6418
18838 -6418 -6524 -55158 -103651 -117676 -86635 -55745 -72649 -61096 -151934 -120456 -82634 -99819
18826 -99819 -29626 -31352 -42263 -10427 -38966 -66855 -46037 -18932 -38990 -58433 -108199 -110738
18814 -110738 -73604 -93071 -81663 -89084 -54601 15550 -30416 -26961 -47169 -92961 -48161 49110
18802 49110 17380 18908 27886 98084 173104 119505 113283 94547 92230 39737 -23858 -72093
18790 -72093 -48984 -9905 63069 109029 114711 97604 48030 5520 23920 43073 -25310 -14466
18778 -14466 -13536 -57580 -19351 4636 57673 74753 76432 131661 121043 201830 386745 665036
18766 665036 815356 714613 561118 354669 178140 88083 56887 -35909 -51164 -51589 -67445
18755 -67445 -20905 3209 9656 -14735 -19770 -38662 -37218 -49859 -21584 17539 -2911 38833
18743 38833 89279 27815 -82389 -129705 -129067 -52534 -50048 -56558 -65433 -107787 -153501 -197333
18731 -197333 -133760 -50819 -23530 32875 46142 5010 50679 71573 88302 70211 27341
18720 27341 549 1519 -4545 -13545 21923 53009 9444 -27509 20523 26162 -37181 -35182 -6830
18707 -6830 39916 124417 143890 170440 134417 27876 -82163 -116652 -31914 -773 -6957 16978
18695 16978 21440 -12647 -3755 -4966 -24092 -35488 -65144 -62202 -69491 -48692 10660 30767 28764
18682 28764 -9365 -15944 -56497 -15202 78102 65287 12318 -79235 -21709 1421 -58058 -12745
18670 -12745 -13534 -17861 -71482 -64230 -10488 27305 56369 3876 -13110 -90975 -123195 -72272
18658 -72272 -19774 16707 -28783 -43970 -7791 -85684 -124401 -90518 -75282 -76741 -56489 -43559
18646 -43559 -14127 -118103 -59372 13731 49868 26395 -29504 -39062 3270 81251 207299
18635 207299 167118 121237 63035 57116 2637 27565 90197 89863 37825 -5231 -10267 -5032
18623 -5032 -71849 -44354 -85148 -70405 -26567 19077 12388 10389 65742 108099 103278 63958
18611 63958 57577 28396 -20161 -23461 -916 1229 -13379 -107766 -62596 12845 11575 -7049
18599 -7049 14084 47536 61141 65197 91230 129371 150589 102094 44692 16668 -8412 -48983
18587 -48983 -43740 29874 63651 60231 45790 40928 -10488 -57454 -46869 -12054 -56906 -120430
18575 -120430 -115617 -91492 -102442 -94122 -39817 5691 -27917 -57363 -31600 -42075 -58637 -17183
18563 -17183 -16913 -19278 20652 -718 -38117 -85861 -35046 7921 10885 -15126 -56953 -70406
18551 -70406 64086 113418 75341 -800 -2888 35657 -4912 -87606 -24312 27472 59547 44328
18539 44328 40902 13463 -5125 -14984 -83112 -99002 -85099 -110523 -124176 -51154 -29896 14983
18527 14983 -27442 -19099 38269 37993 -259 8064 13927 60111 119759 60269 52669 39791 32510
18514 32510 7142 -7195 -23021 -52584 -70969 -65121 -31615 -24803 -53354 4735 89871 79826
18502 79826 50778 7814 -24757 -7086 -5963 2568 11429 -13887 -54431 -100553 -55517 52585
18490 52585 47215 62555 52883 -18225 -20424 -47247 -49080 -26108 -57010 -15987 46083 3242
18478 3242 -66915 -99649 -38542 18145 19396 12462 -2167 12691 56432 54156 27999 -12395
18466 -12395 -35487 -14716 -19147 3472 -6299 -26275 10266 784 -14419 -20965 -3008 50268
18454 50268 66380 101098 70921 48762 67111 114584 132997 98201 79103 119647 140073 107792
18442 107792 70073 73307 82057 58843 36394 38062 105638 136904 143461 85313 35694 -3135
18430 -3135 -47692 -134718 -138438 -51400 -44432 -24069 25603 -69102 -13769 25267 53877 58867
18418 58867 26809 4536 -57931 -59957 17937 78163 29638 -6691 24338 -8762 54414 111918
18406 111918 254 -31063 -67994 -109851 -88307 -15182 478 -73860 -84196 -85909 -31183
18395 -31183 19931 21669 -4820 -16506 36305 4541 -15624 -40012 -39156 44585 117135 57041
18383 57041 11094 31764 13254 -41905 -45567 1051 24178 23138 31735 17697 3040 33464
18371 33464 -18472 -30982 48812 124480 111424 83290 38869 59889 103626 170325 148882 157806
18359 157806 154637 110298 52257 83356 127961 146504 110868 13239 -51002 -73662 -48707 18650
18347 18650 16917 -10226 -74733 -108576 -99734 -38797 -18158 -32083 -26804 -116439 -143768 -108568
18335 -108568 -58055 -78644 -69209 -40902 12205 33192 9277 4075 5747 -17595 -6787 14027
18323 14027 2764 17621 87064 149974 158476 164048 142342 50788 -51010 -20572 49178 103561
18311 103561 63827 -22188 -3800 55481 27073 7485 -23133 -37573 11860 -6376 24104
18300 24104 51359 -23651 -106576 -129247 -102009 -142776 -119583 -60897 -67220 -120720 -165364 -178967
18288 -178967 -154229 -115155 -13837 61501 57696 126077 121713 102309 57300 23116 26076 34235
18276 34235 61079 136012 32873 -14784 -5934 39449 75324 56366 -16509 -58121 -77167 -51363
18264 -51363 -58845 -116709 -98458 -63411 -55576 -50647 -31986 30038 71468 18980 55957 154391
18252 154391 193966 162385 88253 38761 -4834 13979 17130 -7513 35712 102826 142314 194524
18240 194524 231835 207484 230462 238347 196298 232559 316480 226156 189499 189310 148835 155587
18228 155587 106524 106091 106839 133409 108221 50197 74167 169317 207738 168569 141569 146990
18216 146990 207708 197817 141323 169785 132594 93784 74209 -22137 -17141 17659 100873 110654
18204 110654 98261 92962 91527 38361 28317 114162 116176 62113 112312 218057 239770 180659
18192 180659 140628 113215 117087 108579 176428 190447 179539 153865 173558 227267 261515 217338
18180 217338 180415 167159 192935 219757 235624 287229 178615 174802 213821 228923 214313
18169 214313 228660 227857 205041 202412 142741 91969 96151 154848 184953 299883 301778 298168
18157 298168 334954 301189 231941 235683 219997 193996 326822 373133 254277 210124 262525
18146 262525 310693 362042 393662 387327 410336 395140 455116 564744 588837 638009 722828
18135 722828 797193 865766 891780 958912 1019029 1009756 1109990 1221204 1332585 1425427 1668844
18124 1668844 1848918 2047866 2361343 2731485 3119509 3684012 4508450 5539889 6953581
18115 6953581 8971389 12360557 17900814 27080965 42468873 68065807 112227187 150241330
18107 150241330 133083888 100723272 64818813 38918413 25095345 17587404 13019723
18100 13019723 10026036 8011766 6521096 5493189 4745459 4103967 3538377 3087445 2704637
18091 2704637 2463239 2288986 2045623 1717909 1474119 1341303 1249318 1125833 974156 889490
18081 889490 871478 802182 796472 857145 802386 786941 719387 643741 585599 516761 549200 588424
18069 588424 529056 432968 411206 323785 269547 309475 336114 280261 288813 262736 235098 301612
18057 301612 327062 253894 199798 228050 169020 161751 173944 202817 127301 80755 152833 144811
18045 144811 98320 113880 110579 112548 117453 109096 88021 61338 -13152 -39027 -2845 18770
18033 18770 35934 15226 -6098 15341 71671 63915 44532 65544 123870 167264 152948 73402
18021 73402 85534 84311 60642 39000 17360 65311 105741 71789 48493 42829 58864 57826
18009 57826 -8220 22827 1821 -36393 20812 71195 99634 88547 20644 1189 -61264 -64446
17997 -64446 -80390 -71616 -55207 -37634 -12020 -33937 -51112 -19123 32173 152022 87655 4758
17985 4758 237 -40365 26211 126428 57619 43859 11617 -2561 65633 44420 40135 14204
17973 14204 21566 37743 54651 54221 43699 55967 22308 47845 97149 75793 44438 47594
17961 47594 11434 39305 93576 66328 52303 77826 130222 211861 234970 268590 195387 184544
17949 184544 224367 240711 194864 128503 111757 197240 170300 71406 36313 90240 202566
17938 202566 155236 140770 170434 222195 174676 177645 185993 157020 139924 156967 177973 201400
17926 201400 214154 201833 222561 207389 251781 346043 405614 514979 543756 547851 561921
17915 561921 594531 627560 666859 655814 555341 543857 542725 569616 586417 537903 509639
17904 509639 492367 449378 386351 321747 205342 120184 131999 66992 41622 59059 99641
17893 99641 98991 80923 49921 43394 10140 -12799 25479 63679 63936 142763 144014 147915 112953
17880 112953 49406 -11675 50838 106318 70481 25910 39394 -22388 28076 43769 -33674
17869 -33674 -52357 -53829 -65613 -24787 5242 19435 35347 65597 98950 49123 13212 72249
17857 72249 30759 12233 -29659 -45233 -21584 -29576 -90205 -69905 -69182 -16312 -29016 -86925
17845 -86925 -130104 -109415 -52610 -15573 -20077 23085 49349 -3521 -36606 -7602 -7007 -15730
17833 -15730 1561 15081 -33371 -22083 60551 83637 29164 17044 28020 28427 11703 12943
17821 12943 10841 16404 41539 -3733 22297 30725 -27557 -50377 -46710 -39749 -18753 -27607 -44658
17808 -44658 -61434 -11569 -1486 -54885 -62918 -10713 22769 46151 63567 25142 -21980 -47116
17796 -47116 -105970 -97041 -46563 -26919 4305 -5355 68445 117917 98038 131073 128856 30536
17784 30536 25063 72699 87728 98165 51036 15502 9107 53313 42116 101456 159109 158214
17772 158214 104454 68513 74732 112080 151505 165262 240317 283962 320218 434838 475292
17761 475292 503776 601403 669065 699287 713123 660050 578668 446660 488114 565318 544553
17750 544553 488489 453522 456839 348939 243033 262181 202521 175276 159112 179732 136421
17739 136421 92944 67589 103974 115691 92958 116398 60845 84685 110618 124438 154039
17728 154039 189403 103255 12691 22637 22682 74175 68221 76747 99196 45511 55170 63159 57529
17715 57529 35600 -34710 -7340 26016 116951 128936 96640 161349 138902 140378 121680 113152
17703 113152 105253 33681 9106 92649 74334 55072 51507 8761 -29064 82912 68295 68775
17691 68775 42194 41353 84604 98656 133134 162173 70823 108991 180181 173898 158771 134165
17679 134165 128967 104385 25508 -25398 31257 104547 132198 149535 152836 72133 70025 127586
17667 127586 133348 114908 76063 108729 199485 173020 90134 41950 42894 44611 74943 122536
17655 122536 123903 173773 161050 172339 220286 264098 234478 203191 273326 327361 311832 359240
17643 359240 476724 571785 717022 776145 891878 981690 1011446 1040641 1130204 1114371 1035988
17632 1035988 994964 950426 815795 634956 509122 338834 233430 272378 218794 113567
17622 113567 16020 10308 86817 142425 190640 165709 154631 191163 172778 182943 221390 214022
17610 214022 181813 141350 99548 57970 -34315 -11087 53034 70275 71952 58584 86505 105039
17598 105039 104464 27987 41627 64101 80718 81620 129394 126942 124809 103645 84857 41782 8499
17585 8499 42272 10781 -16041 -56386 -27364 31864 49283 96369 121450 93343 57320 59910
17573 59910 27634 -1553 24674 51503 -2419 -17497 27638 112184 200762 182784 119930 91528
17561 91528 81253 64486 74379 101928 104663 32134 76150 106764 101956 102737 81776 46272 123070
17548 123070 141256 84925 100149 118101 197432 180174 127087 66667 -17401 -50565 -112550
17537 -112550 -52779 9954 -16949 -7948 -2430 43050 79058 83376 79788 73071 67752 125413 185194
17524 185194 215363 224631 202741 213041 253376 253410 315465 340231 302326 354794 301215 282181
17512 282181 251368 282686 303372 354801 408694 372614 317422 257326 208301 210482 233179 272904
17500 272904 280053 266867 274538 255521 286744 386866 409442 375637 379297 359009 341657 315789
17488 315789 350238 378169 391474 424505 450502 420554 375651 453728 470496 448047 390197
17477 390197 435361 488075 452169 475248 513321 517594 497332 458714 406316 360960 403224 370358
17465 370358 360874 311060 312921 385568 436943 454281 441435 399398 371895 351454 385282 435250
17453 435250 464836 426505 436575 494958 485208 435205 508538 643229 706076 787115 1043696
17442 1043696 1325016 1277652 1114519 911598 773522 824391 912051 783588 724339 788996
17432 788996 859480 833226 831469 891628 964875 1006693 1053885 1118982 1210817 1321297 1372650
17421 1372650 1534350 1636713 1715509 1872623 2125477 2318681 2533241 2822535 3181930 3570811
17411 3570811 3953748 4456399 5186488 6057055 7253363 8817230 10794855 13263095 16376098
17402 16376098 20406604 25159653 30471828 36464801 43371884 51023911 58659612 65880558
17394 65880558 73102010 80746713 87692287 93270515 97433939 101234528 104626684 106523693
17386 106523693 106254163 104596345 102697881 99730290 95037015 88616764 81711166 74655226
17378 74655226 67185169 59095581 50930959 43313780 36497934 30414274 24957851 20333601
17370 20333601 16563612 13601489 11262451 9387893 7972035 6859924 6032358 5345718
17362 5345718 4771308 4292926 3844783 3547432 3296599 2949411 2591488 2304737 2140616
17353 2140616 2006461 1849690 1752152 1658106 1531878 1509622 1519188 1449944 1387489 1327128 1286126
17342 1286126 1195820 1114514 1080525 1096085 1085059 1074891 978496 902470 872672 758160 713592
17331 713592 670555 559024 482648 432275 424761 458230 482022 479491 507275 427637 372385 418985
17319 418985 545239 495928 452988 488110 491403 494868 502204 454290 401025 499131 534645 521030
17307 521030 433589 433972 450524 413891 403963 473243 536246 484711 450683 404829 445866 512944
17295 512944 487542 448617 448442 433802 495417 490253 529202 541077 560881 618077 603065 655863
17283 655863 736643 755033 720538 681308 636400 661469 735876 790393 867558 900009 956905
17272 956905 971693 963625 1041665 1064358 1102678 1217841 1338117 1443040 1577184 1724646 1953108
17261 1953108 2195115 2477587 2696148 2932320 3319956 3724197 4184758 4794324 5468302
17252 5468302 6304012 7506790 9130011 11383916 14361125 18057685 23153854 29795001
17244 29795001 37456592 45633667 55370162 66403688 75895651 84128013 93198222 100969053
17236 100969053 105202741 108246230 110809062 111792846 111638466 109722462 106533802 103705687
17228 103705687 99818285 92721587 85103723 77685005 68811840 59024557 49933444 41592477
17220 41592477 33892758 27249390 21744933 17404174 14107780 11582952 9673543 8132485
17212 8132485 6958848 6105696 5391246 4727855 4172684 3746215 3315077 2971549 2763404
17203 2763404 2531485 2352717 2150160 1955243 1826167 1699620 1597252 1588055 1545014 1420411
17193 1420411 1234808 1142780 1149517 1097134 1068475 1034383 937459 833998 749048 671270 670906
17182 670906 665183 642961 621874 640651 622440 562269 469167 375600 365481 357644 356845 340184
17170 340184 347765 335027 240250 243516 200122 234262 237897 151447 164889 183964 162760 176215
17158 176215 138812 65853 -9645 -30676 11406 16248 40746 93601 95677 71985 -720 -17423
17146 -17423 40180 30172 61533 89068 82550 118583 128245 160883 202016 174571 110331 105505
17134 105505 49075 46220 66702 73471 86006 122831 142568 150877 28540 -31801 2000 84453
17122 84453 107523 75641 6918 -6701 -66 53286 77465 89227 72565 111960 37995 -3582
17110 -3582 53472 86422 102770 41330 40856 96947 102210 150164 182917 200344 194173 153389 123013
17097 123013 49315 -21410 -2356 -3228 13304 70888 174189 175938 147192 105820 112055 90408
17085 90408 77567 112371 81929 37105 12116 31781 45584 63062 99609 120387 97075 80254
17073 80254 76350 91373 62719 111298 121661 91341 -1078 -85593 -116300 -51244 -34655 -23556
17061 -23556 4361 -3473 -16629 15310 -5417 -17118 -30254 92116 87143 15549 8523 -8702
17049 -8702 -17604 -43132 -27530 49054 95065 18606 16420 25387 -29174 -83218 -150508 -132900
17037 -132900 -42916 -30211 -79682 -39949 -7709 -16038 12562 75213 133153 141280 128079 109288
17025 109288 88113 79122 28881 -63351 32963 95425 56487 11417 -32668 -54464 -35858 -36494
17013 -36494 -21453 -54768 -98203 -40797 -26717 16468 -1165 50470 15328 20940 24029 54403
17001 54403 9174 -4167 36771 -13769 -16861 6639 -24960 -122744 -136131 -116992 -59848 -8476
16989 -8476 35635 11158 -75268 -93423 -29440 -20959 8505 -27680 -47406 -14555 -27545 -75592
16977 -75592 -42505 -48714 -71784 -104999 -98806 -84924 -99568 -133532 -124197 -75234 -36698 27147
16965 27147 35675 75 -17564 -40686 -85793 -61167 -25623 -31871 -26164 9859 42736 32096
16953 32096 -6203 -43712 -85925 -88149 -92185 -102340 -45963 36423 46354 -1487 6620 -1660 17594
16940 17594 27605 15498 59307 47477 -3392 -28702 4500 16036 52622 56490 20619 -17781
16928 -17781 -106915 -10191 50575 -42768 -95519 -63931 -78508 -103500 -70350 -41124 -82812 -99245
16916 -99245 -85823 -46054 -34941 -71485 -107050 -103614 -50095 -15570 -46569 -88407 -25170 66831
16904 66831 100417 48516 140 18344 -40058 -58193 -25846 -42558 19336 90646 112032 145830
16892 145830 141303 110453 60026 29363 46485 76101 38798 18000 31102 37754 21406 7784
16880 7784 41131 62817 106419 97584 85045 58749 2966 22279 119262 117502 92908 195552
16868 195552 318709 304967 352940 417577 381539 413317 438986 567027 608602 578747 589265
16857 589265 596440 583290 655899 663531 562210 494548 455131 410620 377475 271598 224622
16846 224622 205131 213653 181179 87890 57699 116698 146817 178948 128915 92864 118822 98588
16834 98588 86093 70543 29887 1496 -43647 -16893 23391 30830 -20103 -36413 15914 63626
16822 63626 43607 32525 9063 16804 -46591 -99412 -108041 -43673 64193 73070 10252 66289
16810 66289 124231 84535 34075 20676 42546 28670 -13250 -52648 18284 67282 10314 -69283
16798 -69283 -35050 -36294 -31134 -28596 -2455 -24942 -76425 -69962 -52288 -86206 -57331 23537
16786 23537 93730 76888 101262 136864 117544 107224 117241 63317 4784 18046 23936 26364
16774 26364 102383 67444 48101 39099 27740 2014 55958 23859 -17391 61311 100922 49668
16762 49668 41420 48521 58784 90981 115669 122209 84073 52544 31423 5861 -18027 -16326
16750 -16326 15894 -25388 -25638 -40342 -84366 -89825 -73286 -86266 -63425 -59663 -11013 27913
16738 27913 181413 213900 136064 143439 189143 177881 94693 27651 -14334 -15144 -39671 -60896
16726 -60896 -18754 -9866 14877 36448 69619 68371 40753 73751 154194 155995 168790 157881
16714 157881 161931 169840 280261 445336 488000 575749 590338 569916 592166 627793 652335
16703 652335 693367 674231 707421 663964 669117 626197 579511 489755 383086 288219 262891
16692 262891 300777 215131 122777 110032 101363 89294 109648 102834 105045 136983 92725 99431
16680 99431 167948 204031 161615 171703 174337 171587 118173 119676 160892 93778 52533 29766
16668 29766 88662 82189 47958 26086 37873 23411 5807 21766 29826 -1275 39052 24697
16656 24697 52599 88098 87413 90156 111453 121190 130848 131673 151870 177406 192738 190887 168708
16643 168708 177587 152637 88151 89382 89818 69981 68442 42031 22630 39581 70160 46662
16631 46662 20166 3206 12874 43932 26438 8388 36528 125633 132613 71019 1203 21419
16619 21419 34394 26427 70076 128042 138646 121245 103019 102609 101125 193410 161571 53836
16607 53836 -21278 -11389 32810 2583 48015 43690 -46909 -16979 50619 70916 88587 96855
16595 96855 134514 186236 132323 156681 182938 217389 200425 150777 181901 148512 156406 183102
16583 183102 142660 120677 240005 266469 239434 230082 227921 182912 80121 71044 158202 130826
16571 130826 158218 141252 86913 113662 142147 193929 249518 281192 206780 164729 139137
16560 139137 162332 202623 205168 219352 218089 227934 209252 165864 117133 88550 139604 157484
16548 157484 184650 223021 222260 209780 265905 320087 415675 461916 502881 498597 565428 621859
16536 621859 649971 678612 528888 405180 392049 402979 463239 451131 387967 293085 171281
16525 171281 68462 158857 281271 326784 244094 210588 288221 310340 231967 201837 176950
16514 176950 234181 250095 293496 253988 265033 286197 276473 240435 247494 289222 273084 330677
16502 330677 387690 398431 389510 411468 475307 456520 399017 350846 307165 347482 414481 402327
16490 402327 357066 331001 354887 305050 360300 391171 380700 310407 300719 295696 243104 228425
16478 228425 259378 281769 326433 315205 333318 398897 386577 341746 293094 312533 349172
16467 349172 364548 398869 430788 425434 429857 381188 352639 349540 385702 410594 459663 459857
16455 459857 399611 391751 373466 418118 380870 314791 396854 521811 574918 591240 562826
16444 562826 560090 528939 550698 614365 583844 567864 565930 544425 528734 553344 581989 604821
16432 604821 592273 547483 529921 537547 518220 503912 538017 550746 591606 632283 657830 677100
16420 677100 677321 635049 694151 735735 731457 719249 826050 858355 799831 778260 835635 834307
16408 834307 845847 774401 732557 709551 712038 737575 834317 876634 908569 938483 909283 940023
16396 940023 956646 945082 968521 992669 981631 1023162 1065171 1039946 1053325 1103435 1098081 1032577
16384 1032577 1013168 1032397 1044508 1053663 1094661 1103910 1113674 1159962 1226604 1289351 1296686 1311585
16372 1311585 1344593 1306830 1324211 1342865 1317118 1258292 1298762 1378265 1373780 1393063 1434706
16361 1434706 1430085 1443976 1489330 1498854 1451801 1467879 1504787 1615435 1745405 1807963 1752797
16350 1752797 1747495 1856523 1871826 1847951 1911139 1971575 2039291 2101004 2150198 2171417 2235160
16339 2235160 2295617 2303122 2324221 2291533 2304741 2328373 2400118 2453485 2505164 2526647 2574303
16328 2574303 2630259 2687236 2805333 2913100 3005555 3041198 3066693 3094426 3155198 3271956 3361072
16317 3361072 3455238 3538546 3630457 3677249 3748469 3851256 3968929 4105142 4244870 4338057
16307 4338057 4477163 4651931 4769597 4904499 5038212 5183353 5379751 5551743 5624877 5763057
16297 5763057 5938848 6138328 6349617 6536689 6745254 6980077 7264515 7506719 7654382
16288 7654382 7839689 8149180 8417307 8694868 9001700 9301515 9632441 10004112 10391538
16279 10391538 10758618 11117026 11495138 11929001 12462454 12987985 13445178 13951521 14476814
16270 14476814 14998804 15564939 16129660 16672766 17284618 17921299 18597500 19283925 19991461
16261 19991461 20731034 21497153 22214223 22970765 23681427 24377930 24980679 25665688 26357389
16252 26357389 26966165 27473515 27968074 28404843 28803774 29200796 29523437 29700045 29828863
16243 29828863 29832101 29751540 29599371 29393327 29173595 28863096 28465952 28034909 27561927 27009132
16233 27009132 26447249 25859861 25155412 24391451 23775167 23178018 22508641 21792965 21045143
16224 21045143 20294391 19574787 18861800 18231531 17577803 16922068 16344705 15812482 15287465
16215 15287465 14768802 14193513 13667459 13128349 12720127 12265918 11860185 11423518 11010076
16206 11010076 10661184 10283294 9934363 9563536 9198737 8861234 8623196 8406173 8132262
16197 8132262 7827384 7575577 7320222 7077939 6882450 6576393 6310386 6141242 5989928
16188 5989928 5831879 5673261 5529215 5397368 5240329 5061620 4935380 4804444 4659416
16179 4659416 4503056 4367817 4308561 4271075 4131749 4024594 3961951 3841678 3746412 3612976
16169 3612976 3523753 3394924 3298031 3250045 3207121 3130876 3051408 2914607 2832513 2784018 2755082
16158 2755082 2723933 2636624 2570772 2560275 2530509 2404981 2326108 2290907 2298197 2217089 2177945
16147 2177945 2204607 2260798 2217872 2076353 1965753 1864284 1829852 1843859 1792371 1647598
16137 1647598 1622323 1602555 1618958 1582351 1500742 1522303 1541180 1485487 1427429 1403000 1389853
16126 1389853 1458287 1477999 1389603 1321921 1301586 1234021 1187367 1182051 1250803 1223361 1128713
16115 1128713 1140509 1170123 1086669 1003710 942637 1000778 987792 994283 1025018 1026365 1025303 1008958
16103 1008958 1020468 1015608 977015 1007829 967948 921454 911375 900515 919082 960228 939865
16092 939865 818613 781559 780610 823583 866644 775922 742195 741425 738599 722454 690176 698506
16080 698506 727616 729190 701616 738050 701501 663940 678043 651592 655106 677755 623495 575963
16068 575963 597659 548890 524707 536217 621165 655120 611106 545692 493958 519379 543980
16057 543980 548213 528604 497893 423918 395432 419503 399342 467787 521619 473215 429453 386029
16045 386029 375391 372641 398793 404444 411224 480571 530301 447165 341724 367986 348735 313129
16033 313129 337468 306085 307850 328385 323119 349451 361627 447671 419898 331142 271565 308434
16021 308434 338165 263434 280346 352385 377124 341001 246657 244395 223834 220820 258466 241171
16009 241171 335803 347289 331892 373665 350860 333157 291518 358762 399854 441404 388574
15998 388574 300894 233779 230198 238804 215623 223849 301306 289841 240685 256608 284782 280905
15986 280905 254300 296913 336016 271931 229149 261993 310615 318499 302122 299209 310725 244960
15974 244960 205654 205622 190989 214657 232265 246409 267737 229748 230672 204817 126602 157069
15962 157069 249167 256103 269148 267026 315843 304592 278454 310448 339093 311143 239522 292138
15950 292138 364274 429249 534364 604669 580665 559530 602367 581088 503338 404279 320028
15939 320028 252224 257802 278013 267178 230514 238726 281524 187654 107554 104466 155484 132258
15927 132258 177954 135547 146156 133719 153755 100332 46153 65839 141053 175510 207470
15916 207470 194076 127307 64807 39196 31261 64414 171360 134927 19619 43863 132106
15905 132106 176041 270442 319650 333728 291071 198964 202758 176650 86264 64442 55887 8961
15893 8961 1120 73417 166611 87377 57778 66937 72412 65218 125151 99530 14381 -7725 -6781
15880 -6781 -68127 -65741 -24933 -437 44035 165937 198946 210651 191837 187935 122981 71630
15868 71630 136943 180310 147356 131530 109481 124880 91099 109042 162582 183694 86662 30184
15856 30184 87518 108288 85394 64495 108650 125368 125931 115311 86584 37428 8084 -27024
15844 -27024 -15127 -9141 -18003 -53527 -24947 -15863 11581 85177 74950 12697 5414 4804 52216
15831 52216 89233 65538 -5009 -20129 -27756 -39336 -29360 -18641 -8307 9094 43777 12716
15819 12716 27280 1030 -28982 -46308 -72600 -19519 46446 50008 62931 -23348 -117446 -99565
15807 -99565 -65805 -44302 -16599 63856 101641 110385 38615 -85687 -137093 -78551 -24053 -73926
15795 -73926 -85500 -6257 81320 104227 76023 -29158 -25542 -61070 -61183 -14847 -10663 -8750
15783 -8750 -2261 27090 15150 62595 55694 34687 -2715 -22856 69521 48715 -11728 -67756
15771 -67756 -96594 -92586 -43206 -30608 -22648 16000 56664 69456 76995 52638 54990 28672
15759 28672 43956 108243 102732 129493 130641 118875 152116 141607 110043 75661 96634 68212
15747 68212 55449 65481 7740 -53399 -64103 -21656 15225 43090 83027 76588 41393 47691
15735 47691 37490 -23325 -42250 -53466 -97510 -53908 59207 97082 36308 -55720 -52308 -7998
15723 -7998 24384 77458 85799 -7698 -43125 8281 99515 99211 80856 56291 31083 -35741
15711 -35741 -112407 -53222 15355 -31184 -33902 82373 61097 13486 -4494 -18173 -5931 -23441
15699 -23441 -25169 -17678 -40897 6617 76120 34807 -26312 -23185 -24898 -70583 -133852 -132565 -52856
15686 -52856 -24695 19177 -17809 3893 57096 50431 41069 16941 38629 28622 17262 -60390
15674 -60390 -84320 -61991 -8303 -2135 -274 19165 -3233 -5129 -13405 8094 24494 33169 -3121
15661 -3121 -19638 -29152 7684 -17770 -3958 -30444 -58467 -49927 -4825 62841 50888 -5654
15649 -5654 -135276 -164412 -122443 -93714 -51264 -3781 -50654 -69459 -36645 -21444 -34201 -128168
15637 -128168 -97397 -90157 -88859 -34250 -27834 -20865 21614 76325 45053 44504 32141 10429 -45311
15624 -45311 -71421 -51535 -54881 -40640 5561 25725 29457 3905 -37143 -42275 -49760 -43086 15073
15611 15073 5234 -3894 12332 56666 33879 49501 -23893 -50174 -25452 -30067 -42199 -53773
15599 -53773 -77015 -60511 -63882 -94162 -119597 -112887 -90467 -124585 -97786 -112901 -127811 -108486
15587 -108486 -43480 -19069 9178 -46958 -57662 -48518 -67035 -122748 -137222 -73555 30077
15576 30077 -45476 -116227 -115775 -56791 -60138 -105269 -72062 -5447 -16302 20836 21647 -53073 -84765
15563 -84765 -12119 -22385 -84521 -50541 -14835 -71800 -111694 -138099 -172324 -153395 -102472 -41031
15551 -41031 33494 57889 29826 -31802 -15590 -74062 -118681 -146733 -117699 -100621 -175106 -167734
15539 -167734 -118795 -101080 -55786 2073 -67070 -79864 20609 77161 79079 51405 7626
15528 7626 -25777 -30132 -40096 -15470 1846 -22433 -11397 45989 61807 17766 -48160 -83708
15516 -83708 -92201 -82005 -98299 -47146 6622 14948 50831 67887 95087 146075 123652 89450
15504 89450 -3975 -72622 -21709 -4724 18226 -12314 -14011 -42601 -30125 16360 29687 23316
15492 23316 -22742 -70493 -20740 11457 -22730 -43810 -86109 -135745 -134203 -88958 -36528 -418
15480 -418 23493 -22181 -60764 -34697 6120 -44121 -75323 -85460 -29969 -58518 -90015 30039
15468 30039 55827 -5575 33826 63110 48225 18028 19083 8871 6901 -42516 -74571 -106896
15456 -106896 -133439 -55534 33544 1152 -49452 -39139 4642 11181 33350 34922 22778 -42885
15444 -42885 -8073 -3763 -24998 -29414 -40600 -47531 -62909 -53416 -50696 -62953 -67616 -78018 -92834
15431 -92834 -72741 -90658 -65570 -53556 -24912 -56752 -57761 -26320 3806 85042 140285 100677
15419 100677 33138 42363 8686 -7481 -27757 -8114 -9672 -32091 -83892 -52796 -80281 -124005
15407 -124005 -102566 -74559 -46512 -12692 3430 76254 -2681 -58692 -54823 -81711 -33333 13459
15395 13459 43414 36365 -68146 -160119 -161634 -157406 -172014 -123275 -66340 -31275 -66715 -92742
15383 -92742 -34051 -25355 -70667 -57340 -59728 -139820 -178057 -209397 -223392 -214429 -163161 -61879
15371 -61879 -26444 -14286 51372 -5961 -358 3454 -66219 -82678 6522 4675 -1405 -67467
15359 -67467 -74989 -47455 -43076 -112672 -146038 -169618 -178092 -173453 -250059 -279615 -252744 -189692
15347 -189692 -125837 -138742 -169248 -146102 -78163 -6589 -3552 -88357 -112870 -149303 -112676 -102751
15335 -102751 -15229 22082 -39774 -16989 -59757 -50894 25714 -5892 -86097 -80682 -68645 -103633
15323 -103633 -84487 -91133 -60995 -21342 -33488 -77003 -52739 17399 37739 -145 -43354 -71369
15311 -71369 -78302 -62301 48423 55351 3980 12220 12310 41333 62027 -50247 -106830 -89404
15299 -89404 -103577 -132717 -90433 -3190 -27120 40173 35754 -28995 -43049 -124805 -135232 -98724
15287 -98724 -107282 -31333 13623 36498 48117 -43067 -44395 -54313 -65292 -85536 -44285 41654
15275 41654 39841 8572 -27749 -18876 3701 -71999 -112861 -86611 -91779 -150237 -132693 -59642
15263 -59642 -30640 -127287 -104540 -30829 67678 70186 -5404 -14769 -41029 -52398 -124874 -138591
15251 -138591 -35832 -6421 -58730 -56305 -11799 7570 41719 22632 10470 52931 53637 52526
15239 52526 57180 49709 2088 -60817 -93691 -129140 -121536 -19379 44083 60112 64058 64700 21837
15226 21837 -71149 -79308 -65753 -97711 -85179 -91452 -51309 24380 -6639 -22209 -61973 -94264
15214 -94264 13659 25026 -20353 -100696 -128777 -85272 -102763 -58936 -31673 -35208 -93750 -179232
15202 -179232 -123327 -61991 -22441 49975 103438 85495 17539 -33669 -17639 -30544 47093
15191 47093 53783 49352 33404 17191 -24048 -59119 24628 -9709 -25799 -50950 -99523 -143108
15179 -143108 -109864 -58982 -60454 -11251 63204 17282 -37459 -180 63381 20696 -37725 -42269
15167 -42269 19179 51461 13031 1878 12548 4428 -39308 -73013 -30455 -44363 -57063 -44952
15155 -44952 -40788 36142 85284 29139 -29888 -116946 -142006 -182972 -239628 -219807 -222951 -251982
15143 -251982 -254004 -187102 -70667 30126 65152 67411 25455 -26138 7397 22655 51983
15132 51983 53570 15960 56017 46800 16872 -76890 -59910 -102615 -92138 -78886 -133761 -98340
15120 -98340 -91791 -125782 -132416 -120138 -104794 -68099 -77529 -46815 -91912 -34228 -33092 3891
15108 3891 20494 -34331 -25419 -4475 -2733 -21177 -24699 -33006 -19490 8741 53851 -815 -12555
15095 -12555 -42611 -135794 -221981 -235315 -175523 -121406 -61240 9616 16695 -13661 -105132 -3953
15083 -3953 74750 94413 72659 44898 -13841 -10884 18150 -8132 -27478 -52855 -125214 -164647
15071 -164647 -138536 -47462 -31767 -64173 -61185 -54622 -1628 -42787 -99722 -132179 -31999 -42638
15059 -42638 -38113 13586 20202 -17083 -19978 46146 52998 88597 113975 135186 84920 -15836
15047 -15836 -84523 -59820 467 107186 132278 113371 55122 15874 -33752 -36532 -66882 -76368
15035 -76368 -104233 -69035 58076 67292 20333 -15317 2276 21526 28402 45712 48774 126470
15023 126470 110732 97528 150715 158619 44657 -47353 -74055 -101251 -97059 -46978 -19622 -76828
15011 -76828 -53807 -15229 7294 -10924 -104450 -169362 -113595 -32603 -13707 -17118 -17841 17727
14999 17727 12317 -46201 -125478 -112345 -43012 -16499 -119086 -153028 -113480 -99870 -60257 -63794
14987 -63794 -66941 -43474 -31631 -68071 -61410 10251 101344 65107 51305 -18808 -95328 -35042
14975 -35042 -11223 19378 51707 109675 100859 84694 81589 68816 30212 25900 -25387 -50993
14963 -50993 -44546 -34218 16099 -20453 -32077 -81729 -73658 -25456 51555 -6184 -104294 -70695
14951 -70695 -65875 -83793 -52604 -78902 -118271 -142418 -140677 -87877 -12433 -33788 -30042 -5453
14939 -5453 5579 -906 -48636 -12917 -12758 -115597 -106838 -62503 -112705 -58334 19070 48546
14927 48546 8283 -8549 -20677 -99937 -79592 -53844 28392 -814 -68239 -84287 -53560 -33265
14915 -33265 -7957 42866 62316 65209 61786 48570 12436 31703 39271 88248 74319 28455
14903 28455 13054 -6742 18640 4283 -60529 -20387 -24890 -16438 -74263 -114700 -128937 -146777
14891 -146777 -152368 -117428 -96362 -58786 -45162 -18135 34616 74756 88945 24646 -10522 7090
14879 7090 -31236 -88203 -137344 -158343 -140821 -144127 -139625 -109587 -44522 328 41853 23965
14867 23965 66880 61978 49862 670 -44147 -26848 13610 57083 52098 -431 -32559 75582
14855 75582 60249 -19609 -91508 -135915 -186782 -189832 -142183 -79022 -11217 51512 -3462 -15519
14843 -15519 22311 5342 -43173 -114440 -123798 -129650 -130098 -66379 -39616 18813 58889 47446
14831 47446 26037 -53458 -79258 -81230 -15182 82 -70141 -130302 -53152 -53161 -9105 24953 61882
14818 61882 78761 -23346 -63723 -61948 -71703 -3036 70949 53137 32195 -40667 -61120 -33385
14806 -33385 -36017 -82163 -151521 -213451 -205904 -135202 -99130 -150645 -162672 -113612 -70937 -92881
14794 -92881 -45527 -41255 -39928 18349 103941 125152 88004 15423 -34888 -21342 -35429 40723
14782 40723 49552 51686 75831 97202 32757 -29796 -86817 -104266 -58938 -53178 -60744 42041
14770 42041 88434 20830 -44609 -33409 41599 33053 -93430 -48383 -8619 -93488 -134445 -93948
14758 -93948 -73074 -103881 -79549 -15617 14046 7784 -87328 -132321 -59431 -4162 32204 -28029
14746 -28029 -53649 -2173 1440 -66401 -67195 -89324 -25524 48480 19315 -25903 -71991 -88264
14734 -88264 -17949 50211 37857 40403 5487 -32487 -45771 -30625 -74048 -145481 -142400 -124651
14722 -124651 -68774 -39152 -51742 -105633 -118196 -79721 -11771 47328 36924 -14729 -25194
14711 -25194 -78471 -83842 12116 97266 17527 -51580 -145543 -219791 -136117 -82291 -58437 -63952
14699 -63952 -139557 -92074 -55737 -19612 -36083 -38181 -13852 5024 -45983 -103052 -24967 45418
14687 45418 74628 25732 34933 52002 41401 -15936 -100752 -68787 -4611 -1061 -31464 -59267
14675 -59267 -40970 -62784 -38732 1747 17039 -25537 -87795 -32436 72857 105198 97696 84659
14663 84659 113672 48028 20957 41530 44188 93713 139783 45108 70875 1202 -34327 11362
14651 11362 -31290 -129234 -118936 -105169 -116628 -73909 -28627 3513 22747 21113 -9128 -56225
14639 -56225 -39424 -21045 -15508 19378 4058 -7025 -8359 7721 -8135 20429 -40322 -107844
14627 -107844 -109954 -113963 -116827 -95124 -40896 8286 32663 21047 27550 10444 72439 24351
14615 24351 -36336 -71958 -40726 -11393 -19121 -72369 -117207 -50726 16995 -5570 -21314 -15149
14603 -15149 23700 74538 82478 116118 168725 90056 1615 -17157 12699 43763 34955 24957
14591 24957 29897 55299 90441 39103 -9099 -78056 -99798 -40191 -59126 -100604 -59383 17081
14579 17081 88410 95024 73015 63261 68367 77050 17533 -53227 -56931 -55305 -46560 -8921 -16419
14566 -16419 -107792 -105607 -112948 -109710 -84947 -97641 -63336 -35557 -66493 -70921 -42290 -14511
14554 -14511 55009 88517 45771 37207 59237 59561 65150 22628 10185 91871 50807 -3099
14542 -3099 20701 -61707 -134129 -99864 -28658 -23087 -93871 -149720 -137322 -113152 -86457 -33332
14530 -33332 56403 8385 -36333 -48718 -94397 -117925 -110811 -35769 -21334 20444 68329 58973
14518 58973 95066 79211 -1298 -77705 -57768 -83205 -120785 -102167 -83357 -53510 -79559 -128486
14506 -128486 -120819 -120669 -82788 55240 105074 -48435 -132380 -130261 -114676 -87877 26314 19200
14494 19200 7572 -36416 -62180 -41011 26444 59065 -10167 -23080 3944 10750 -12281 -42137
14482 -42137 -36355 -24232 19579 52861 -1468 -67854 -70712 -94560 -204341 -182972 -92409 -120136
14470 -120136 -179333 -122437 -105469 -88009 -51429 -59946 -53113 -77871 -7418 -17540 -63040 -35971
14458 -35971 -73421 -115253 -129577 -75199 -62289 -2399 -25460 -92376 -74190 -66377 -66219 -90119
14446 -90119 -101628 -96580 -34772 -20026 14899 -2671 -67264 -49195 -87661 -85881 -18653 1859
14434 1859 -51166 -42653 -42114 -34463 -1291 3331 22739 -6012 -34852 -67098 -107742 -86046 -3984
14421 -3984 -48555 -46151 -13577 -44746 -72820 -55843 -70158 -40992 -62749 -61314 -96548 -65648
14409 -65648 -87109 -88205 -78086 -36894 -68534 -109380 -116835 -96340 -71328 -59687 -59166 -63377 -28400
14396 -28400 -47493 -17956 -38779 -5585 2251 54838 66090 51226 19758 11273 -18088 -18221
14384 -18221 -66189 -20369 -1212 -14552 -23801 -44118 -8305 7346 -23846 -32983 -26433 -34912
14372 -34912 -19467 -20119 -60342 -130314 -106382 -81624 -65845 -38997 -32528 -35665 -27336 -1769 44676
14359 44676 70458 -37684 -31606 -27317 -156233 -184035 -213307 -199037 -184427 -151646 -186146 -151827
14347 -151827 -49408 -24681 -27975 26487 93007 47231 -30452 16445 26970 5003 -45250
14336 -45250 -42169 1215 -33636 -1539 86622 23351 -18709 -56453 -85568 -89799 -78051 -106895
14324 -106895 -102873 -87709 -102497 -70790 3534 -15425 -64693 -100206 -55752 4204 41169 13772
14312 13772 5414 98163 166067 95664 85907 15006 14773 24420 61371 139385 70466 17012 8877
14299 8877 -19794 11578 -17983 -90383 -152368 -170365 -111500 -135749 -76452 -28177 -60784 -110735
14287 -110735 -119640 -126208 -79793 -60537 -37005 -23008 -43518 -11364 34608 42091 41829 1622
14275 1622 -30842 -62089 -95653 -112470 -81652 -28834 11690 60148 56824 38398 -41848 -129031
14263 -129031 -163792 -86742 17539 81018 96094 54567 4427 52189 40743 11052 52316
14252 52316 70233 18565 -29361 -1354 33801 48700 30714 1186 -39228 -64638 -53975 18181
14240 18181 34948 12087 -50732 -27297 17783 34386 -28478 -65369 -26443 18991 88337 55810
14228 55810 7862 -38679 -52735 -39449 -51911 -76487 -136688 -152083 -117644 -70024 -4138 43358
14216 43358 27886 18381 -54105 -74133 -38293 5220 -24763 -57205 -35157 -31170 -54964 8405
14204 8405 609 -18037 -60274 2039 42604 309 -8795 -10858 7455 -18342 -38667 -40691 -17310
14191 -17310 -57652 -25455 -84370 -121467 -99324 -110503 -103288 -18176 -73827 -71806 -27996 -40755
14179 -40755 -64148 -160294 -161121 -45135 -31058 -78008 -30184 -35090 -100876 -111032 -108709 -88221
14167 -88221 -94136 -116418 41480 78696 105754 85941 7761 -81482 -96910 -74426 -118506 -139394
14155 -139394 -148529 -110321 -99100 -113050 -107645 -48310 -2312 -40749 -63500 -77396 -68834 -54182
14143 -54182 -27249 -51733 -100403 -122366 -131353 -106427 -83281 -137949 -155868 -62351 8579 -12960
14131 -12960 -16124 23568 16714 3742 -82104 -81796 -77307 -67424 -90069 -43070 30893 -28674 -38234
14118 -38234 1617 -8283 17983 -28138 -100905 -68406 -36635 3666 34838 -5209 -22036 -78209
14106 -78209 -114788 -29361 -19053 54135 54286 -4446 29855 -23541 -40377 -31210 -26099 -48679
14094 -48679 -62959 -78839 -9989 -39384 26735 70029 6106 44553 40192 54176 54146 -24905
14082 -24905 -99924 -134089 -88150 -13233 3390 23628 -9838 -5186 -7354 3581 12203 31880
14070 31880 20455 -14034 -23862 57974 61766 21296 27458 -2531 22847 33910 36028 -30924
14058 -30924 -72512 -37993 -10051 -57464 -66868 -70215 -51727 16643 -45528 -12255 -8305 -41823
14046 -41823 -37337 -43336 -80037 -70192 -25566 -39099 -24092 -8600 -12635 -93694 -82159 -74653 -15814
14033 -15814 -32619 11432 -9323 -19480 25876 57106 42538 6676 -10450 -45135 -141049 -79904
14021 -79904 -13441 -11601 -22473 -18805 -34482 -50231 -49076 -73073 -45113 -74229 -126260 -118433
14009 -118433 -131514 -147551 -103193 -55311 2523 39306 50233 43222 82843 88843 67802 68854
13997 68854 93754 69043 44718 9130 -27296 -55976 -5416 9175 -73207 -140446 -116839 18586
13985 18586 45953 35998 -8969 -40709 -15465 44357 63789 730 -85872 -87137 -115884 -52171
13973 -52171 22404 58619 -9769 -47300 -25303 11456 -19345 -16918 66513 35251 4252 -9948
13961 -9948 49773 11843 -9249 43981 5315 -23824 45770 46294 31482 19029 -1043 -64309
13949 -64309 -97807 -83823 -117766 -94975 -69659 -29797 -32330 43185 110749 110287 32583 -15445
13937 -15445 54885 18782 -27265 2041 7865 25970 10747 24023 10160 -2491 -3866 5698
13925 5698 7393 41452 51034 21869 -27071 -34847 18010 39695 21624 72868 118314 83425
13913 83425 29970 41167 37419 10818 11380 82555 64574 -54886 -59794 -14272 -70017 -73804
13901 -73804 -27305 87457 148577 110601 -6730 -46188 -13341 -19177 24691 76087 92750
13890 92750 50274 5080 7526 1429 -39865 -14501 29516 92729 120481 73563 11668 -170
13878 -170 -60467 -48426 -34655 -53927 -14234 64267 59014 -11436 -73456 -71294 -6130 -62792
13866 -62792 -129655 -101092 27001 119031 116451 39894 -46105 -24653 39793 -5156 -13520 -69827
13854 -69827 -78210 -26136 -62717 -151941 -156186 -176878 -156721 -76893 -89059 -42067 -14671 4737
13842 4737 -451 -6200 -44411 -60930 -141284 -152535 -114426 953 59186 -1493 -55230 -27265
13830 -27265 -29560 -27492 -75831 -114487 -105188 -114061 -82408 -66486 -57455 -40370 5309 -15917 -14404
13817 -14404 22864 56539 22477 -19383 7817 61623 33826 -43121 -59073 -129508 -173925 -97331
13805 -97331 -17535 -71357 -81711 -56498 -7215 25397 -30494 11822 66606 107872 91543 77421
13793 77421 -4444 -58880 -33941 -14110 -55535 -35370 -44024 -37504 -24249 94451 181248 121623
13781 121623 18963 -17936 -13893 76812 115830 134266 136966 122828 67707 -7342 -48310 -80612
13769 -80612 -53720 -54637 -61716 -9062 2910 2308 34297 87296 158045 139005 71801 173454
13757 173454 174321 119094 73265 22689 3250 -49937 -34133 45277 27531 42837 55928 105500
13745 105500 158126 103702 75523 79345 77782 87930 108530 30532 15485 72959 68441 85751
13733 85751 44435 -17922 -60707 -39894 -33667 -14765 -4834 -18738 -29947 -1255 14063 -35621
13721 -35621 -68303 -26073 37314 6213 -9513 33157 29255 59839 57406 121523 119449 97859
13709 97859 69582 122372 65891 -2693 -16227 -74789 -140681 -163373 -72260 -21425 -47450 -41816
13697 -41816 -23589 -23694 -33765 -30960 -52703 -62177 -77906 -53051 -53351 -24672 15644 38419 60203
13684 60203 59912 67608 51422 -20712 -52139 8326 31654 66315 104735 109459 50420 17163
13672 17163 21216 -31745 32081 95354 81466 82916 21307 23623 72351 86501 64999 17857
13660 17857 -11760 35825 5303 -52276 -58783 46953 -10105 -28410 31781 13964 57327 81565
13648 81565 46072 74262 101471 63436 46213 24297 -10081 -29038 -52700 -82430 -82346 8794
13636 8794 72071 38249 30820 2616 -10723 51513 14662 -75591 -107418 -34366 -43396 -46167
13624 -46167 15336 87621 99532 94065 65418 -1981 44695 104119 83150 33202 -2302 -2535
13612 -2535 29582 51529 60535 17242 -30662 -47051 -46419 -55993 -26311 -20526 2219 93148 78591
13599 78591 62885 -18275 -57708 -83441 -112276 -76420 -18296 -4383 46738 30697 10599 50907
13587 50907 100982 92556 70281 95633 66897 39534 1472 -99803 -145863 -95459 12242
13576 12242 42314 -24517 12601 38340 46029 24847 31103 54422 28374 6192 17410 76709
13564 76709 48727 75318 145841 23007 -29132 21698 -14616 -24586 53467 63194 51158 88756
13552 88756 167224 149007 128849 75642 45786 88714 137102 126547 67531 72429 144053 131460
13540 131460 48220 51699 94387 124693 102609 124539 140618 172085 171507 106348 85109 52661
13528 52661 9610 -26438 27325 35202 11625 8035 31767 49085 -14916 -28747 -54801 -71624
13516 -71624 -2413 -5781 -46250 -11309 67549 106318 78027 58125 34229 -39746 -17955 -9908
13504 -9908 -44625 17210 2171 -24044 34610 87290 37319 4979 7064 50107 113746 105504
13492 105504 51877 52688 97458 124511 108167 72752 44906 33599 43904 26468 43934 68917
13480 68917 91169 76524 18757 37487 27568 -3316 61469 43692 18947 -1413 6472 55741
13468 55741 112131 161386 191196 143036 124184 171400 192609 96789 75343 150480 144685 152840
13456 152840 146724 143704 126364 58080 34480 30079 83453 45434 67682 99917 71908 9471
13444 9471 -19915 -16260 56629 96900 120919 99824 54884 60542 72925 102007 123575 147150
13432 147150 149532 80725 71730 116071 141816 50153 -20766 50303 175459 169142 104709 103055
13420 103055 185765 242156 270384 226471 206151 177979 174295 101227 109417 88559 109573 102986
13408 102986 153309 99272 32240 57671 79847 109614 93534 122971 151083 132388 154605
13397 154605 138144 117736 140131 144415 123954 106445 70541 47622 38897 110449 163659 205269
13385 205269 222423 180247 136061 81352 123743 34954 -22964 -1871 75398 73079 90383 91195
13373 91195 69039 81333 38447 4982 -19020 -19361 15177 62004 56572 96204 89097 129500
13361 129500 117905 82797 50726 51038 96931 146984 158302 184423 156756 137278 144768 121676
13349 121676 133410 149017 157589 178226 187698 154114 128994 143406 145030 132282 93971 108976
13337 108976 89832 6920 -16780 22985 22329 42554 107915 58492 3712 33528 128492 159450
13325 159450 145526 92705 135965 192005 168883 106446 86789 71568 69283 91739 88420 156273
13313 156273 184479 212617 172906 132023 75045 32759 32140 92597 121033 135173 122185 51525
13301 51525 159102 223231 164830 132929 140947 76457 69115 113585 118489 122310 134734 161715
13289 161715 188977 233064 273516 224244 153124 194562 248307 243866 251413 287632 211920 187026
13277 187026 212100 159123 130854 171944 176527 186155 225213 229932 158521 93861 68113 148173
13265 148173 168087 179757 168058 148651 225388 237094 187963 181729 175769 135106 132834 175231
13253 175231 230869 139996 103421 111337 119921 146076 169877 188418 106138 72735 139766 247468
13241 247468 295046 252539 181915 187312 166427 189929 183166 186100 204199 162263 133490 144319
13229 144319 108056 100802 71623 69128 111021 100676 45549 32196 42990 111619 125249 95571
13217 95571 152681 230528 229178 215552 182156 118590 142662 180308 171045 185392 244127 284791
13205 284791 277560 237724 156241 114374 227646 305079 274740 276062 350280 329988 305969 243585
13193 243585 184095 168623 168849 179511 249640 306200 314029 261544 189627 172285 173632 160706
13181 160706 176346 217873 271494 241843 218349 238845 238808 234286 228701 261386 221929 213680 190178
13168 190178 187991 200456 217651 282548 209799 221909 249273 303827 333563 272249 263200 294140
13156 294140 291749 267923 269173 336156 354296 323918 276040 254106 177908 214191 313975 270422
13144 270422 292666 394053 344937 299827 270097 284880 324867 395482 297797 297435 334008 333519
13132 333519 324034 346383 369412 358787 274316 246449 254887 233645 167695 174490 254960 281692
13120 281692 287268 337649 324847 240338 194504 204900 290745 306579 245177 190120 228737 305140
13108 305140 310232 353367 342875 383671 352917 338258 358273 325344 272723 275817 293648 290022
13096 290022 273421 298067 300149 325553 353352 367310 360054 316565 288911 313522 311077 342296
13084 342296 321899 312362 298761 286342 299203 317937 327178 355282 423828 490302 412432 389840
13072 389840 360131 388727 453164 459207 404843 363628 318255 337280 367150 394123 334700 397407
13060 397407 416944 370383 419451 464913 427147 430074 471621 492711 471626 477315 503746 482838
13048 482838 453919 443456 429796 439478 466782 501326 500930 461838 411139 326766 404514 505984
13036 505984 533608 494934 489615 515628 507708 535030 525210 483343 497044 520535 578655 588884
13024 588884 583792 592027 603644 611435 588672 580869 576199 617589 582975 499190 516688 593648
13012 593648 608458 586996 626297 704272 728236 661360 694115 740100 630546 582694 624829
13001 624829 618356 626760 647572 652074 675431 715337 632204 583317 614871 562616 551401 601026
12989 601026 645334 605088 564855 572590 553604 599396 693507 695174 677277 644204 598768 653528
12977 653528 702540 748651 740729 761844 763061 716317 731842 732692 701617 753163 753235 803094 941735
12964 941735 994388 904528 845955 898227 888593 856668 863051 866158 929907 994446 899325 900692
12952 900692 942911 928237 913605 935577 999610 1009492 956292 946445 967778 1020785 1086285 1030991
12940 1030991 968531 1008560 1032995 1047942 963414 977931 1034404 1017676 983242 1016597 997057
12929 997057 1043635 1069763 1088376 1082488 1028494 997099 996477 1047956 1062223 1084690 1130076 1181983
12917 1181983 1188974 1262792 1298320 1278961 1291778 1292518 1260498 1237169 1207640 1196190 1299336 1333770
12905 1333770 1313746 1288534 1270955 1361536 1398831 1399577 1405970 1437375 1406843 1402927 1483043 1526303
12893 1526303 1442427 1430557 1480201 1521346 1534864 1549301 1519309 1504381 1504752 1528433 1588918 1566562
12881 1566562 1565847 1622310 1652464 1692284 1704130 1745427 1762722 1725782 1704871 1715169 1789093 1862071
12869 1862071 1878135 1853008 1893784 1925579 1894826 1879127 1929777 1962918 1936239 1966895 1971612
12858 1971612 2017671 2092456 2132371 2025611 2000775 2060650 2162072 2212521 2276598 2233338 2226458
12847 2226458 2216556 2224097 2276574 2351408 2379765 2404983 2421287 2544326 2526436 2558066 2641703
12836 2641703 2707042 2627797 2567436 2583699 2700368 2820380 2910661 2925110 2877673 2893035 2892281
12825 2892281 2891825 3014846 3070327 3126843 3155684 3211696 3266612 3345905 3373967 3391205 3404159
12814 3404159 3459636 3528229 3547109 3541604 3563189 3591612 3667915 3786741 3854922 3846083 3882544
12803 3882544 3935362 3982741 4032704 4104564 4234194 4362159 4367740 4407811 4479118 4473001 4540755
12792 4540755 4641255 4710234 4779472 4807533 4854271 4890412 4931375 5059415 5270347 5369281 5416156
12781 5416156 5464648 5481962 5528351 5626429 5726559 5818298 5957458 6068446 6179689 6329509
12771 6329509 6457226 6526372 6622034 6666270 6689997 6817891 6981520 7032694 7220813 7464365
12761 7464365 7555021 7661894 7825303 7913339 8044046 8203849 8305197 8491503 8628539 8816809
12751 8816809 9001516 9187046 9317440 9521517 9689565 9893952 10071519 10215911 10356141
12742 10356141 10597306 10827895 10937437 11158835 11398997 11613038 11742264 11935341 12218740
12733 12218740 12508585 12804138 13061184 13322103 13574648 13894987 14166753 14463161 14746540
12724 14746540 15022617 15282701 15582028 15972211 16291106 16573156 16825856 17142918 17540992
12715 17540992 17850152 18223379 18620882 18941109 19244038 19642682 20044401 20428719 20866345
12706 20866345 21305912 21595071 21888446 22293976 22741721 23134427 23542902 23956445 24379797
12697 24379797 24777142 25180981 25585475 26003313 26458774 26824119 27098581 27466252 27847988
12688 27847988 28158645 28506435 28763689 29053477 29344983 29655835 29974648 30304627 30562056
12679 30562056 30778909 30919502 30957997 31179094 31419795 31495662 31551194 31577463 31567776 31575550 31607003
12668 31607003 31560696 31476535 31396529 31309024 31200440 31007066 30803259 30649938 30449370 30207834
12658 30207834 29984780 29745246 29497619 29225642 28885911 28551019 28233969 27937468 27586714
12649 27586714 27201323 26801834 26501240 26117706 25695626 25288534 24945148 24594779 24101893
12640 24101893 23643548 23267328 22934789 22574388 22190110 21862901 21512753 21135079 20765399
12631 20765399 20432954 20017396 19554785 19239475 18990608 18662168 18312807 17972813 17634768
12622 17634768 17255265 16874142 16567378 16205295 15943080 15618263 15316745 15047495 14800041
12613 14800041 14543301 14276620 14074736 13791493 13510449 13250409 13026739 12788669 12509276
12604 12509276 12242202 11999586 11817530 11578828 11412473 11236558 11038235 10855384 10742886
12595 10742886 10535834 10289876 10069810 9904106 9690372 9538499 9463172 9378252 9222077 9049316
12585 9049316 8881649 8738945 8554171 8431368 8325266 8297884 8147298 8011952 7888285 7684602
12575 7684602 7506314 7338107 7214723 7216351 7120258 7007025 6897592 6793948 6693968 6606000
12565 6606000 6422045 6318217 6279849 6232941 6128994 5987106 5911788 5786113 5700030 5637636
12555 5637636 5565728 5468205 5358830 5278601 5221971 5099223 5082720 5039488 4968014 4891566 4741282
12544 4741282 4669995 4588054 4557808 4549789 4580756 4515116 4374272 4311494 4293305 4312038 4344150
12533 4344150 4289452 4120970 4025516 3981716 3895762 3896847 3931660 3909939 3865086 3765078 3642415
12522 3642415 3593738 3608953 3597173 3474717 3451097 3407765 3344027 3288429 3232719 3263143 3294341
12511 3294341 3303911 3219554 3101845 3062110 3089206 3106292 3072480 3027311 2948367 2877862 2832252
12500 2832252 2860634 2894550 2861973 2807290 2750548 2769278 2827382 2842728 2732084 2643338 2660596
12489 2660596 2647131 2658887 2618177 2501532 2405082 2361271 2435881 2435106 2387656 2343678 2247928
12478 2247928 2281600 2257596 2193615 2151012 2099668 2111942 2160830 2129078 2151610 2159136 2148984
12467 2148984 2100103 2026173 2009635 2005722 2032409 2034886 2004171 1966869 1905575 1818017 1744306 1788219
12455 1788219 1766375 1803823 1782431 1735314 1687607 1746230 1768617 1740604 1697432 1689856 1679502
12444 1679502 1633492 1547465 1602826 1632274 1620096 1623147 1620593 1629747 1570415 1576423 1665797 1642867
12432 1642867 1603942 1593057 1570758 1584113 1570395 1514984 1490456 1487361 1477855 1452912 1438508 1417692
12420 1417692 1404320 1361575 1333678 1304457 1282512 1314200 1296106 1327335 1315304 1278324 1306088
12409 1306088 1331733 1255241 1250963 1247410 1186836 1086872 1036025 1056460 1113356 1165892 1207114 1175776
12397 1175776 1136189 1143238 1149267 1098643 1130252 1157053 1194899 1171292 1124658 1056509 1032003 980495
12385 980495 1005096 1021240 1005178 1020333 1050934 1054366 1039904 1073928 1091916 1145317 1122480 1103763
12373 1103763 1045605 1007589 1070381 1069481 995347 955136 926565 935673 955989 926219 934257 963902
12361 963902 997411 1006919 948454 894713 883266 911133 877178 911908 883723 862792 893614 865948
12349 865948 839454 838854 810948 779392 750522 748628 714481 672815 748218 786819 758808 775178
12337 775178 717980 613530 557155 647348 726174 774745 838586 753173 703863 710149 757142
12326 757142 720449 686443 710663 767643 743152 744019 726504 668911 692389 726877 730417 706819
12314 706819 714094 803881 840775 837274 845509 867287 766124 718469 768957 781442 774582 740925
12302 740925 722930 749820 763669 691173 617211 602316 600738 546564 565775 549819 519106 555313
12290 555313 651123 690086 714876 677307 657696 643914 652440 620506 655863 647977 639675 642464
12278 642464 664407 595576 481479 420351 468187 431893 442071 437400 440111 465647 492930 516681
12266 516681 528797 584184 650995 657420 507435 480519 526871 535846 526705 545770 572606 533618
12254 533618 508241 499669 528825 577940 566610 511655 464877 477093 475507 458415 415501 403473
12242 403473 414892 442966 477808 451944 441108 459811 445472 471987 531250 556264 528713
12231 528713 499549 527353 517410 498434 542325 542708 610120 634822 568676 560857 563435 440017
12219 440017 460550 511508 559719 594411 567129 489045 445505 435487 423208 437525 423000
12208 423000 402710 360514 467488 523087 440295 405468 379228 386508 349263 419943 427932 392668
12196 392668 369236 333933 332248 365140 415997 439870 448152 370815 354176 309389 316414 356546
12184 356546 367146 411406 388753 336835 409379 425842 339806 306591 275595 295395 296765 347872
12172 347872 332017 276134 256408 264904 242083 224116 217226 287758 293677 340174 283647 342428
12160 342428 338662 316992 320530 297003 289117 262036 279750 308443 330991 312185 248896 291616
12148 291616 286821 277751 324481 341129 360554 342832 286350 294378 267405 310728 340455 352331
12136 352331 344483 358857 338436 371357 331208 273866 227639 185594 197676 235470 255729 271837
12124 271837 260798 296718 285727 290072 325065 394742 361828 301157 262524 227301 170068 175059
12112 175059 201056 258933 277105 273291 247278 230172 235922 295796 298411 282772 292664 335704
12100 335704 355939 280571 195397 228139 273071 279390 284141 261359 262201 274539 255488 300369
12088 300369 343607 290855 253674 282295 246934 303969 380422 286048 223278 250949 232854
12077 232854 220427 185638 177741 172396 227265 256075 247111 239607 159536 157986 157948 102868 134109
12064 134109 151719 95565 99012 130256 190669 180060 160827 202440 211176 154906 137485 132657
12052 132657 138598 135113 193460 230231 264986 321003 319657 346913 396929 359981 305285 195353
12040 195353 188289 187396 176875 205742 203148 200083 216033 214564 219265 204884 260325 297493 264732
12027 264732 260919 223100 246114 269193 200132 191642 221693 218635 174461 161664 232982 311180
12015 311180 358854 322965 220006 106557 129985 191889 197748 125552 153429 169638 155856
12004 155856 160088 223586 192489 206806 249587 251505 169334 183567 286382 316123 277178 266292
11992 266292 199622 133683 118917 181025 306070 295485 224000 177750 228050 264074 295784
11981 295784 210038 192724 235191 222710 224621 168102 109093 161453 141021 147720 132087 29285
11969 29285 29243 100319 153237 270599 266483 169345 106282 138946 164740 233168 200416 111829
11957 111829 91105 50573 35593 45029 124229 248294 291839 288193 286245 252556 226689 182100
11945 182100 124948 177419 159249 83613 148384 255138 195484 154700 94110 121255 133194
11934 133194 189531 246676 238556 208823 221438 222379 214451 220220 179976 84812 126573 176643
11922 176643 147880 174914 195172 229865 251815 268119 244832 211523 197441 142040 164239
11911 164239 187688 232692 227192 201340 193654 140801 110138 120328 132099 103977 118757 41619
11899 41619 43286 80760 140042 199032 188866 160717 144482 159365 220976 192682 155104 180665
11887 180665 119662 82199 28051 19428 54117 65428 50119 95898 47019 34464 109421 190993
11875 190993 237333 203680 243692 234698 148934 31593 34316 88187 139736 118999 165935 162593
11863 162593 136186 137956 130579 64439 50842 70964 83183 64520 17341 39809 29794 29439
11851 29439 95212 104981 38880 2433 -11992 16388 100101 148718 202946 213322 189860 162243
11839 162243 128968 67948 66148 35696 21173 19863 31735 85604 55604 70728 62593 48262
11827 48262 -277 -16660 50327 48920 105722 140303 145739 74636 9830 -5806 60257 26619
11815 26619 39806 99650 123203 111975 111508 30497 412 53723 144589 160247 73376 18327
11803 18327 9374 34192 78207 83458 91947 63179 78523 158161 176479 98496 20887 36106
11791 36106 117635 174018 174799 162738 168874 168048 181063 159536 214388 155311 106724 43743 17662
11778 17662 5494 -34827 -96461 -89286 -45927 -31218 84405 143988 175626 160018 148652 136887
11766 136887 128449 105625 100623 112594 103559 106855 125106 213088 191543 145756 157878 181612
11754 181612 145770 69316 54757 50213 85391 121706 93457 97228 93759 76554 -23032 -35007
11742 -35007 15995 63040 78903 125816 84701 52948 48937 8240 -6279 64541 123817 121633
11730 121633 138665 146283 168395 119308 125919 73455 77362 67724 70693 61560 97847 55209 41096
11717 41096 88296 170623 208509 185876 162941 176682 173331 157962 170395 180462 219709 248994
11705 248994 189445 189921 195247 195008 206535 200283 164738 140698 176301 85870 30142 49078 14551
11692 14551 32845 51923 64634 75734 74306 133074 129859 168688 150298 68810 3382 12546
11680 12546 12801 40574 85815 34178 30005 92500 126567 81676 93957 145388 147959 96995
11668 96995 10527 12269 61257 78711 114728 119303 86164 101161 91667 149206 191200 139668
11656 139668 109532 51709 63516 111765 150218 145240 115723 119156 109166 84128 94618 109688
11644 109688 81080 97916 101288 86697 5212 13369 94087 85374 72099 55094 32806 47510
11632 47510 88907 130040 164712 117528 61343 -12491 31114 101462 82427 50702 -15461 -20425
11620 -20425 -6819 54310 137504 122150 87093 100597 93314 16920 5329 19442 11589 21321
11608 21321 90044 82083 52837 18687 -14816 -10579 77333 99802 107883 87613 67893 52292
11596 52292 91663 136416 156624 126246 137227 147657 95186 56274 116299 131813 116014 89059
11584 89059 25893 26834 -21786 40172 69098 9369 14117 52643 92428 135937 141244 124589
11572 124589 7261 31838 21531 12003 40702 47709 64464 89606 96722 82597 100 58942
11560 58942 107503 160687 88061 3362 -9063 -61207 -101028 -48085 -26117 58585 115201 152704
11548 152704 154091 144121 78717 39514 13400 -10114 38309 32124 45380 14913 -44645 -20942
11536 -20942 -7456 40293 69753 68933 34229 82510 117924 118718 45305 11596 40887 -673
11524 -673 -16051 -2336 -17103 -32287 2417 28469 27346 -18323 -30913 12202 73838 120147
11512 120147 131781 72898 29000 47150 18863 -47352 -75050 -70062 -56491 29987 121059 106306
11500 106306 61522 93047 60210 904 -70140 -54514 -6734 67869 141884 154370 115417
11489 115417 114556 94690 41729 16224 17548 19517 4351 83438 95004 59505 74898 29486
11477 29486 36555 50813 2495 -23138 2717 15329 -13788 -54950 -77659 -89896 -33770 -21954
11465 -21954 -27594 -34915 -26928 34008 66104 -27165 -114915 -102843 -40171 9093 22058 19503
11453 19503 40502 51722 108390 203417 221802 190787 190355 97703 -51750 -83285 -100956 -57272
11441 -57272 68541 76130 64177 27484 13769 45353 111738 135350 108943 27622 -26107 28254
11429 28254 65775 60557 62999 129541 128657 79039 -7202 -14913 -11239 42120 -4141 -55951 4832
11416 4832 28293 38644 143700 199561 202123 152194 132279 60364 36190 30877 91733 111500
11404 111500 141137 95251 69215 19093 -15068 -2848 -2057 18782 89532 121236 68034 84012
11392 84012 151920 142711 118696 58592 31914 78300 49850 -18453 -31807 -26331 -45398 -7991
11380 -7991 -6738 27984 110409 141074 150362 133368 98980 132780 109769 132250 128150 136029 66892
11367 66892 17770 12934 26936 30535 34291 5839 62921 54455 50068 22448 -6647 13299 46261
11354 46261 47767 18029 49695 26588 35085 60736 68111 39121 16672 -18719 -11670 6205
11342 6205 48350 73660 50225 -3932 6082 -8165 -8989 23660 22963 96710 14603 -38228 -126810
11329 -126810 -77543 51892 80419 58588 111450 80841 55617 27917 87387 158545 97777
11318 97777 10854 -16121 14069 -20974 -244 9663 73618 32321 -10927 55858 106759 76325
11306 76325 14180 -3772 24712 29025 49407 59897 4856 -35975 -88941 -48433 29209 54113
11294 54113 -22157 -63493 -62867 -9055 23885 32928 -45331 -137855 -157346 -76317 32805 163872
11282 163872 110177 46511 112944 35489 36898 52652 6453 -7955 589 20315 34932 60455
11270 60455 36557 75143 86088 30456 -28687 -26083 -99068 -143148 -72194 -34552 -95241 -126091
11258 -126091 -65404 -21051 -24772 -23819 1118 -5960 67351 150776 198128 118067 41765 32033
11246 32033 7476 -19128 -1627 14681 21904 39649 95669 77007 32391 77228 94050 13250
11234 13250 -81536 -123840 -88704 -71059 -55683 -723 -6724 -6646 9763 13865 67076 104222 72968
11221 72968 76942 84552 97905 86512 -60718 -58214 8850 102580 184280 93214 26925 1770
11209 1770 -23193 62569 58345 22548 -9798 -72227 -27578 -41501 -122336 -138264 -93504 1145
11197 1145 42653 146 -45278 -10197 -4382 -43989 -34215 -67180 -77027 11016 19669 -42528 -73499
11184 -73499 2323 92338 101970 94895 82093 16981 -65170 -62762 -50616 -17823 71305 86393
11172 86393 69476 54691 16073 8449 23009 55373 108698 127759 104507 162543 188684 166753
11160 166753 106826 19393 17609 38321 49793 52385 71589 22988 -48362 -50988 -76562 -82336
11148 -82336 -7811 60872 167693 180062 139443 115288 48331 51631 44595 50513 30728 43773
11136 43773 66583 73620 48530 26240 -21565 -17782 7431 6606 6413 6122 -31386 -80635 -91988
11123 -91988 -125353 -161510 -106529 -15715 43109 57951 95928 121550 17502 -44363 20096
11112 20096 116762 179995 154773 47250 -58633 -83043 -149129 -235448 -232264 -127988 -4514
11101 -4514 15946 58851 16051 1012 95325 106696 71035 61995 95966 180683 159985 157376
11089 157376 135166 155873 125454 93006 97145 189829 204014 169039 147288 91013 45039 73332
11077 73332 92444 27303 -42841 -8486 -11685 -46233 -25334 -7001 11506 -36480 -13180 76098
11065 76098 106069 56979 47932 126168 163920 129414 145277 149698 127953 32891 -9640 -44335
11053 -44335 -116363 -148256 -69837 -77400 -74899 -31331 -32383 -9513 17353 13757 -34619 -43458 -47176
11040 -47176 32151 102383 50146 15416 19892 -83919 -131236 -101275 -70601 -37288 -60306 -25447
11028 -25447 49487 3743 -89231 -15839 -20266 -71033 -61901 2231 56061 47157 -25429 -31558
11016 -31558 -26278 5749 87765 80282 69051 60277 94628 145133 71677 24961 24607 89956 103235
11003 103235 104211 51499 51167 140226 126658 67021 57064 77138 65051 80265 67957 88784
10991 88784 156790 146096 154341 158467 150040 148675 119212 80782 17636 38126 60465 46491
10979 46491 110442 134289 110717 97432 98204 91914 11533 18371 29382 60626 25247 -54221
10967 -54221 -29477 12739 28347 9866 14817 70129 71109 34190 41546 66279 30010 47129
10955 47129 90748 55615 -71263 -26251 40558 116791 154623 117214 123353 55871 -2282 6417
10943 6417 28911 15049 22675 63427 83005 41730 37669 30831 5618 28141 -17365 -84585
10931 -84585 3985 39165 3834 19734 74586 108061 132349 170865 193387 125295 35122 44242
10919 44242 10510 13163 -38844 -57880 -35567 -10616 65845 85414 94212 146200 119707 144710
10907 144710 205427 176026 172200 121557 147592 170628 168660 157302 202171 255907 331429 394913
10895 394913 571709 887535 1321524 1869368 2429641 2983894 3454223 3793597 3836202 3595299
10885 3595299 3252418 2791380 2387004 1915337 1442183 1037551 776421 593720 405620
10876 405620 369512 389261 341135 265237 267359 241278 185794 197651 181178 208617 154355 129781
10864 129781 181738 230207 175286 100429 9990 9885 68746 76368 52043 52094 -31696 -66132 21773
10851 21773 104732 106068 133849 144338 150869 88168 86849 128920 123720 85966 93681 84870 57594
10838 57594 64552 91927 146197 101658 58921 66122 110430 132857 101637 150853 86372 51112
10826 51112 20516 29985 58804 51626 15077 4760 30225 68265 39544 86932 95509 120580
10814 120580 73640 30695 30720 23079 54725 66521 60411 5108 25368 63252 51240 26801
10802 26801 38288 68214 100365 142205 145105 221928 203446 142247 130376 119720 77313 39685
10790 39685 -9486 -23905 -16135 12773 30174 29962 55947 99917 51977 41026 -49513 -45408
10778 -45408 -44708 -42016 -31668 23715 80112 83570 111241 195781 154539 141969 133463 87096 131949
10765 131949 98018 59660 31832 30987 58958 154401 190021 174014 171315 195508 219687 92293
10753 92293 15401 66522 117538 132241 146845 179060 228394 227618 301760 391134 468822 569385
10741 569385 591075 568976 553034 514231 459377 364900 277702 224440 246755 264564 236607
10730 236607 214349 168766 166931 136547 157834 205724 260960 196836 165908 145006 156036 185194
10718 185194 205141 195545 173497 168769 117197 30244 79166 57632 49993 96144 57466 -1487
10706 -1487 50146 59506 -4561 27575 80805 132199 91424 143427 176931 160310 172872 173965
10694 173965 113105 113300 144562 86278 44597 15468 28847 30787 62228 97123 109740 58828
10682 58828 20830 9241 40951 3120 -12265 58273 72619 78771 50335 71762 128073 187824
10670 187824 197390 175290 207958 213418 178436 170092 180308 174124 190520 206134 199863 260282
10658 260282 274310 232793 185306 123318 87110 196837 243346 210628 162782 121649 87961
10647 87961 74167 34986 -70881 -131996 -139025 -122621 -162253 -222132 -172518 -147647 -90357 3532
10635 3532 53873 115411 162157 232118 220016 229786 365254 446977 476046 534941 644964 746755
10623 746755 991573 1276064 1864704 2723749 3691911 4432881 4825382 5020902 4992297 4661394
10613 4661394 4004591 3125314 2378000 1878100 1491980 1189818 1031235 971591 857232 703373
10603 703373 696025 655861 663988 626003 582626 472808 396149 435897 437434 480498 530070 538273
10591 538273 609532 663666 685909 655972 680037 741281 782650 879562 918202 924758 972992 984280
10579 984280 936842 784012 726257 720034 672077 688227 728998 707170 695025 664534 653821
10568 653821 703623 759859 783514 850657 818893 806809 767811 751615 796436 797721 775429 794709
10556 794709 745071 786343 804233 887653 881324 858803 850775 845580 862040 977745 1031246 1149875
10544 1149875 1179567 1205009 1198907 1231158 1236263 1268949 1339088 1455010 1517747 1558921 1608253
10533 1608253 1672543 1763073 1821211 1896310 1967191 2018113 2095240 2264757 2375465 2490604 2689863
10522 2689863 2914461 3070907 3268404 3585907 3920265 4366889 4905177 5504406 6208666
10513 6208666 6983361 7874677 8919502 10051969 11179142 12417545 13772505 15216534
10505 15216534 16773308 18504974 20520878 23014014 26206112 30321343 35847447 43686109
10497 43686109 55230458 72646185 99716943 141983107 204682982 285760791 370664249
10490 370664249 447473498 518977793 579566429 604176015 582835747 533244009 469279116
10483 469279116 392045456 307464300 228629461 165208717 120281455 90989264 71963365
10476 71963365 59130775 49997315 43112516 37674794 33295913 29822018 26873435 24323590
10468 24323590 22155541 20217965 18420288 16767907 15241567 13801244 12497116 11178405
10460 11178405 10021789 9194606 8554790 8019167 7523275 7112019 6774694 6361713 6037798
10451 6037798 5754345 5448315 5201288 4940225 4719583 4480858 4181419 3946346 3751898
10442 3751898 3533743 3456892 3357380 3215979 3078002 2895515 2791365 2696027 2548402 2469700
10432 2469700 2297070 2210707 2098810 1996131 1917505 1794149 1721298 1598006 1532862 1521281
10422 1521281 1462139 1337525 1309018 1282989 1289325 1292850 1237354 1102819 1069680 964000 846650
10411 846650 799287 751610 694694 676493 678237 667072 683537 744746 754542 766677 733079 727911
10399 727911 736655 663438 656096 657693 691790 685001 678028 628175 505132 530810 586352 557999
10387 557999 505523 451862 430576 463295 486036 507504 524670 501891 468816 435848 433053 459236
10375 459236 432153 432613 435985 459857 473685 452632 469762 491407 513871 447300 395616 384521
10363 384521 431469 450105 423969 429122 430596 469446 476512 484712 471813 479044 433644 422829
10351 422829 437469 422833 323177 276841 332009 303003 272070 286311 316699 405640 484485
10340 484485 547981 505207 572428 685097 673936 636735 644391 674348 626083 602867 581239
10329 581239 537544 472442 367809 304353 242608 244202 237802 266174 277060 246515 225239 236136
10317 236136 214418 160684 166387 205641 180609 212380 268708 345580 353169 346900 297245 296204
10305 296204 255887 232229 244644 291224 277979 277368 322937 384525 463703 397441 334119 296917
10293 296917 281554 251904 200862 163415 117984 73274 115427 221455 173456 127158 56813
10282 56813 15015 73489 127135 182357 179454 185648 244413 269867 244974 217949 212185 257676
10270 257676 242371 146854 154154 227590 253133 276561 243399 175219 142131 131571 71057 95963
10258 95963 101543 141140 150787 118809 147469 148029 143619 114113 131095 156445 111263 42123 16201
10245 16201 77961 156773 144302 161262 198059 212181 144887 149438 88650 39591 31360 54489
10233 54489 39849 80 34744 74291 153667 183500 143366 159531 125169 129550 153454 166095
10221 166095 123545 87829 92275 107368 79970 48086 12983 59897 169426 192552 152801
10210 152801 207060 241231 269486 264104 229591 164386 132986 143631 167616 188662 205308 150982
10198 150982 135209 192584 201438 135653 119402 171513 189500 128785 112212 97700 116890 110712
10186 110712 130481 134207 114849 87095 62188 43556 876 -52584 -47803 -7869 -10774 29573
10174 29573 63746 109049 150508 232663 220806 195605 182610 110323 83910 87641 67786 104227
10162 104227 132431 113966 74665 69692 54472 108770 192009 185054 143889 129794 85752 89221
10150 89221 166646 178408 174324 229635 234298 165897 133731 101399 150772 135020 91836 56689
10138 56689 66554 49156 51437 68891 102794 87155 37065 -50700 -28282 111584 154922 106073
10126 106073 33708 21585 82720 141669 96729 71373 92550 93434 107770 130252 141014 112395
10114 112395 72815 78168 120881 156711 128085 130690 173648 162372 148220 72029 6696 44931
10102 44931 78686 101454 133705 64304 62765 79836 78017 168214 191399 249146 325145 454455
10090 454455 527011 674642 993918 1405866 1916541 2347426 2688313 2981231 3245917 3352332
10080 3352332 3099670 2727559 2361986 1913330 1415194 986461 634197 505582 464669 402268
10070 402268 309255 231546 187658 173438 219965 257036 249971 238671 226810 168859 58277
10059 58277 42693 68213 74944 168581 199108 93294 -49876 -120390 -102710 -28245 -61579
10048 -61579 -26163 -18132 37936 50246 88770 60724 67245 115254 123841 153527 137513 133208
10036 133208 91252 73548 75412 96223 111500 119137 113737 144629 138593 85148 114487 75548
10024 75548 39061 -17353 -42744 -71428 -62425 -3923 64904 51335 47796 166379 227583 200689
10012 200689 140259 44175 17277 52127 28116 77164 75843 36180 52848 69102 68501 45153
10000 45153 52856 79402 67330 14261 69220 98742 41875 11983 -53107 -324 96421 118423
9988 118423 120193 153849 171985 170114 173422 170222 123482 27908 40524 147416 151584 108834
9976 108834 78713 21296 -42084 -8663 39416 54101 38000 115737 108817 73251 97377 86092
9964 86092 91038 67340 54837 93733 87400 149786 133986 123971 114392 95717 19861 -54112
9952 -54112 -26181 66069 111999 113945 116220 105198 116622 76347 46248 48892 66162 15640
9940 15640 -21146 -48845 -7705 25470 100725 149082 123492 82465 16005 4595 9892 -5934
9928 -5934 29127 39190 22743 -29893 -84239 -8021 75976 96475 30696 38242 74554 50409
9916 50409 65214 70077 108292 177963 187183 195315 224578 160930 154413 102372 60938 43652 85719
9903 85719 81289 102012 62675 6887 12667 98912 139131 182397 180064 166340 174893 139888 104072
9890 104072 149803 173400 148175 141191 188249 164670 90548 53971 398 -9502 10883 -18201
9878 -18201 -8597 40669 80876 128754 66135 50200 45204 37316 45800 49166 58596 62930 67664
9865 67664 78347 27826 25647 64020 113627 87749 53895 127333 141334 100137 157729 115922
9853 115922 69943 35244 32541 48659 77132 97125 152477 175208 80317 9978 6484 2252
9841 2252 -4831 20729 40019 34351 -12496 -50680 -61948 -50327 -12559 11153 39235 64772
9829 64772 84809 62081 7695 37558 61840 33499 46051 95556 129550 92369 72942 116369
9817 116369 130947 128021 122360 74192 66592 111361 121156 133108 147910 88903 -26064 -52118
9805 -52118 -1749 -32042 -34664 21330 25700 26393 85422 76164 25333 -8178 24256 58138 48133
9792 48133 34623 69291 72580 57240 80568 92187 27175 57522 81935 82148 82414 50662 24277
9779 24277 50964 75817 109575 135392 123172 116289 94844 46558 11330 41720 16465 15247
9767 15247 36105 14933 -18276 -18907 -25991 10149 81518 57408 50796 23171 -1903 53181 90743
9754 90743 77769 24554 -8435 -74533 -96825 -9779 49880 103242 96696 31215 111730 75336
9742 75336 2656 19402 63377 7210 6464 10582 56554 99608 92472 136689 145693 101173 81031
9729 81031 65281 75183 80994 148400 148200 95498 63301 32834 -3216 -16117 -45761 -52073 -51208
9716 -51208 -71670 -34720 3683 -1275 23122 170 49580 75350 556 -32994 -22946 -6673
9704 -6673 6037 33315 52319 75655 64201 40189 22714 104443 92023 59125 118746 95044
9692 95044 67472 23919 12508 -4495 -64278 -23910 10308 18338 7109 -23320 3722 45865
9680 45865 114144 115051 164665 95394 57980 99898 160089 130001 76040 64449 26798 91176
9668 91176 187697 181475 206582 216165 214177 243632 162040 134170 137637 159735 135165 172882 178921
9655 178921 134566 12995 11390 36581 46122 -7454 -16683 -311 87352 110895 156258 130723
9643 130723 61144 60017 132556 120168 93983 120922 98379 22319 -36849 8833 37979 44923
9631 44923 65311 108389 63786 60610 88438 108133 18760 -4175 78962 98888 70087 59218
9619 59218 100272 135442 55024 3711 80106 67582 101491 34561 72662 38866 57748 -106
9607 -106 -60659 4907 131256 135162 114836 64439 32741 111879 173721 135304 165833 210354
9595 210354 121992 84377 80043 46524 27743 22480 31363 80212 83711 31310 -51537 -95429
9583 -95429 -125319 -101327 -40020 -46147 -98071 -69692 -53102 -8760 57266 48427 -8300 -27639
9571 -27639 2274 23324 43725 46144 106827 92933 29938 43393 42768 51786 -13724 37206 52781
9558 52781 43178 77273 145527 152946 136497 143511 101632 59378 28314 41473 59702 115220
9546 115220 83005 3621 18457 72457 86068 53198 7532 58667 43447 18424 29701 38780
9534 38780 42650 68623 -1799 -24631 -30726 -32151 39260 13740 3410 97106 87542 150118 140833
9521 140833 183875 247844 234732 226783 167507 174887 236586 235232 169232 125023 87777 104723
9509 104723 81118 57399 80395 66540 25010 -11778 -42423 34372 30102 13930 -21647 -2909
9497 -2909 -26431 -25156 -49215 44426 156526 135146 114447 64790 42429 -6600 28057 56056
9485 56056 52303 30284 76335 101713 150436 118248 103281 73833 32298 31074 31249 2805 24181
9472 24181 88133 161545 91811 51234 31063 50105 110663 100396 66758 56903 59573 -16395
9460 -16395 -60460 -21767 84492 115294 36389 22757 -11075 -5539 -13694 -4798 1827 3572 -24891
9447 -24891 -45819 -32640 20460 26922 74018 119134 136899 133765 129313 125170 134612 95940 76076
9434 76076 66979 85615 85796 64708 81254 123792 171809 145965 41101 3657 61159 100352
9422 100352 94054 115386 124393 113932 135612 109581 42673 42072 47581 29640 42953 155937
9410 155937 215720 207398 161899 156023 123886 100794 61495 22981 1747 -19712 -13630 41204
9398 41204 87727 91472 130858 129739 104746 85890 116865 84474 67410 47318 -30593 -6524
9386 -6524 52166 62108 30961 17633 -18575 -74898 -96497 -45293 84331 67319 22618 21654
9374 21654 105903 146751 134538 64068 7846 -2806 -16327 -57824 -9694 27462 46762 -4896
9362 -4896 -10267 87627 117807 78664 96154 136491 163796 201748 199424 93070 -7193 -23979
9350 -23979 -2497 5053 16831 66883 67947 45082 -31666 -21075 45132 53235 6822 -24422
9338 -24422 -41336 15179 49577 17135 22177 27359 58331 48218 46065 43520 52248 56715 159872
9325 159872 181682 108367 42877 21188 90348 33880 63233 63096 73106 79204 41463 28570
9313 28570 78369 120075 53829 -29585 1924 47625 72584 15830 -42705 -52610 -42227 49621
9301 49621 87592 68456 12962 -29355 -14993 96751 144173 178272 188926 150706 180225 248547
9289 248547 227253 159305 182780 168967 90186 72935 106145 139534 168603 212280 187674 199190
9277 199190 182094 155113 137244 124751 95113 75793 103208 141510 83340 29591 37567 79989
9265 79989 56613 107036 91904 47429 14644 48900 45337 19140 67007 97523 124952 121377
9253 121377 47961 -22958 -29435 9708 56374 23846 49610 111806 152049 142877 154809 116050
9241 116050 67133 75309 88590 109089 105640 113012 108356 109256 126847 42028 -2222 -30980 -66801
9228 -66801 -64707 -50662 -3510 -5085 -9120 -45131 -2813 -21508 -42788 7143 77942 6953
9216 6953 61300 124010 116188 143968 100194 81457 77144 47879 15278 78140 158998 217076
9204 217076 152835 54904 81472 137430 130399 46140 -24704 -43861 -31759 -39444 55206 93555
9192 93555 110173 85210 12171 5215 -6018 -46653 -14125 12902 24074 64713 72198 127693
9180 127693 136703 115995 90491 101866 126793 94923 74873 116530 152658 111314 55635 22158
9168 22158 -10030 63982 49120 -24249 -50913 -50989 -32554 40055 28013 15080 64208 82932
9156 82932 42096 16961 63451 15789 -23389 -11133 5003 21604 -20974 -21646 5772 46099
9144 46099 23223 5659 -45626 -29203 -27901 -78505 -82089 -22989 -41724 33238 22586 2560
9132 2560 -19450 -63073 -129457 -73866 -17711 66628 129630 132576 111263 91110 34153 -18929
9120 -18929 45769 25524 -4373 -48494 -43670 -1464 32243 28380 101687 115870 54831 29197
9108 29197 -5394 4533 12240 -46523 -49816 -10382 -15924 -12673 -4928 -6235 22869 50176 68041
9095 68041 71518 124241 150157 136741 72539 22827 14228 38130 32943 64073 72978 86825 25294
9082 25294 -11867 23741 61483 111754 102509 -15927 -17431 -36508 -88952 -87938 -33316 -7618
9070 -7618 10111 -4327 -31305 17529 50188 54258 137054 134405 79803 23838 -18215 -39798
9058 -39798 -5480 -23498 -22768 -72256 -45633 30671 59994 86166 40741 37633 56836 16710
9046 16710 16166 15223 -18133 -14713 20923 65369 93353 60093 72684 47067 8852 -1198 -11183
9033 -11183 -10493 22244 30683 25172 95576 174806 175365 122696 175014 165703 19141 -39907 -67263
9020 -67263 -6608 -9257 8436 11301 -26388 -73207 -65294 -94619 -21953 50743 56361 -34213 -14062
9007 -14062 16436 -2144 -350 68125 52671 9164 38170 133026 195219 161844 164658 87497
8995 87497 8897 42816 37218 -11521 26362 49322 18707 -10525 34834 26460 -17642 11733
8983 11733 23744 61752 124867 222343 177454 125127 115428 106062 83803 144897 129708 134976
8971 134976 149895 99049 116484 135869 56385 10024 45802 97037 94463 102104 95878 56121
8959 56121 36248 8438 8602 16599 27730 42626 40552 -2244 661 19261 73254 84559 86538
8946 86538 40209 53167 3871 74825 97804 44495 11356 26292 100957 108879 84868 28498
8934 28498 11455 46044 -10358 28317 69896 126352 139533 145415 99412 73673 27523 7902
8922 7902 47993 57606 -36120 -129862 -152666 -98407 -92494 -82316 -108245 -51243 -829 14038
8910 14038 8387 22630 -20292 23747 5495 -49047 -30597 20354 -2222 -108007 -168012 -39600
8898 -39600 -39166 -73604 -94147 -59228 4085 1230 -30682 31731 51698 30351 98119 142119
8886 142119 99417 45551 29267 77868 44802 61526 97507 81543 74526 11221 -49054 -10218
8874 -10218 30788 28222 61434 43382 30194 4497 -34131 -7825 39301 78771 64804 117422
8862 117422 145101 52637 66875 76237 64955 22737 -22116 32948 79520 99529 82931 89897
8850 89897 78527 6809 16484 48348 40936 28174 26261 -5392 -27837 -103 55329 58189 104392
8837 104392 85605 46754 34378 7635 -21397 -16601 -8468 -61585 -61270 -37116 35026 80304
8825 80304 58470 -30870 -56819 -18255 32463 22433 48435 119153 194635 165561 95445 103075
8813 103075 60458 -8035 51466 88031 -24242 -83995 -49025 -34832 107 14764 -39461
8802 -39461 -87045 -47876 -35484 -54178 -46874 -70633 -122973 -93755 -85514 -117672 -87502 -26814
8790 -26814 50658 39923 23753 2459 -54465 -47101 33033 41845 27468 12616 37840 21909
8778 21909 21546 -29184 -60119 -45833 -41423 -27861 827 -11798 -26394 31258 31700 42929 9550
8765 9550 48642 15218 -39749 -47097 -33933 26554 99093 68013 105844 112160 37045 48336
8753 48336 103328 67485 -5199 -44778 -94156 -71076 19841 153413 156298 119234 18567 -7820
8741 -7820 40459 8203 -43309 -9471 5596 17844 -3052 11430 18417 39445 38685 5771 29794
8728 29794 60756 17451 -39093 -178046 -265537 -183878 -56147 3308 12539 1405 -57606 -59684
8716 -59684 -13376 -20967 -41047 -21453 2278 -35717 -56704 -87663 -78585 -69220 -46496 -64026
8704 -64026 -21748 -43514 15650 52011 -18198 -35823 10890 61687 74922 63468 45044 50068
8692 50068 8837 -59218 -89646 -81638 -87773 -5778 -26852 -61413 -36816 -33361 34049 85058
8680 85058 81451 43993 25264 -1619 -20535 24087 32284 54191 19516 36623 105393 179569
8668 179569 163837 99852 91588 91208 54208 23215 -5663 -48718 -82308 -94041 -48653 -78823
8656 -78823 -22159 -28585 -25662 756 4465 -18143 -5119 -38544 -48029 -39145 -24602 -29384 -58507
8643 -58507 -69999 -18464 -21595 -38043 -17600 51331 90126 78510 2748 56644 106782 62274
8631 62274 81486 123003 136236 95895 40281 30758 70924 90584 24828 60314 74896 53135
8619 53135 3028 5601 37874 58176 62516 87347 115178 152317 127001 87806 126990 92218
8607 92218 108405 110314 72740 75712 17224 -99130 -143015 -78476 -70414 -46919 -32739 -23047
8595 -23047 -11180 -21814 52575 35957 58179 22125 -42264 -29094 60118 8976 -14927 40222
8583 40222 31079 29524 79049 75396 95215 49355 55360 24808 -35468 -11104 -61980 -116008 -130361
8570 -130361 -97153 -68578 -27402 -40189 -44165 -40854 -26774 -19068 71801 97995 70983 -7262
8558 -7262 80275 112535 49918 33783 -15449 -61026 -84749 -67897 -3675 16163 -41006 11825
8546 11825 46265 36632 -15821 -50248 15461 61528 -5348 -46406 -60123 -95308 -103650 -71799
8534 -71799 -48378 -12735 -9598 -12410 1544 -9409 18365 15759 33787 -2197 7229 -47878 -58600
8521 -58600 -39789 36701 82374 99841 32957 38166 47995 -24626 -90440 -60478 -67810 -36696
8509 -36696 -28952 -26307 -41060 -38847 -53162 -59552 -78701 -58521 17170 -7062 -39272 -34523 -73863
8496 -73863 -33088 -49277 -141800 -91456 32168 24689 -54527 41772 101335 64500 -10170 -61404
8484 -61404 -76046 -63492 -82047 -25045 -31236 -74935 -96745 -78111 54389 74180 78562 64028
8472 64028 49447 63933 78592 116701 128955 103424 101886 67429 102607 32672 -56456 -79814
8460 -79814 -73932 -90014 -61667 4628 6944 -27486 -13892 38370 14525 -18909 539 9565
8448 9565 24024 15807 -14596 41828 63449 42201 22486 -46428 19356 153219 150776 80990
8436 80990 25024 -31361 -81126 -70465 -36024 -42522 -8933 17133 6933 -2225 -45730 -62683
8424 -62683 -49740 -57220 7548 120224 147619 118590 98941 91422 84112 114942 14841 -58669
8412 -58669 -71068 -52330 42520 -2477 1605 3549 -57556 -21532 -11945 -16093 -78664 -14711 55677
8399 55677 -36405 -82388 -186503 -153996 -79424 -96304 -101711 -47880 -36368 6714 -9730 -23266
8387 -23266 -16049 5326 -19975 -26131 7362 -12489 -55608 -116257 -7124 85121 138420 132939
8375 132939 130656 33800 -17481 -38466 -44364 -32318 -20788 5797 79099 95528 87309 67807
8363 67807 31337 -40064 -36213 17827 13834 -45642 14206 35935 78030 104110 121265 99523
8351 99523 132664 135214 110210 55517 18430 13835 -15410 -43420 -58528 -80472 -18336 35446
8339 35446 93830 89269 49122 -58769 -102037 -100572 -67832 -80022 -86302 -139459 -152723 -113328
8327 -113328 -65926 -59125 -61318 7033 9828 26465 48977 51854 -10389 -53415 -38192 15325
8315 15325 17195 44091 68057 40143 -982 2668 -87350 -75841 48484 71474 29681 26835
8303 26835 42010 47724 -2767 965 -42543 -86683 -77915 -20601 -12676 25750 21824 32500 56589
8290 56589 42534 -24643 -63202 -19806 -41864 -13942 32631 1813 -16278 -38564 -28264 -28313
8278 -28313 -16356 24456 137919 131470 91942 113194 147177 187281 138835 102150 56153 23261
8266 23261 -3065 -1242 27559 35671 12317 1541 7534 36769 84409 110802 86679 -3936
8254 -3936 -36169 -45173 -37890 -44698 903 -12006 -36018 -76000 -73934 -70683 -56293 -61579 -127016
8241 -127016 -99274 -115680 -158734 -117575 -33603 -13172 -44719 -89614 -66574 -9552 -56296 -75595
8229 -75595 -21019 -11611 -53571 -77967 -66524 -33737 -82254 -24837 -9583 -74459 -99016 -84733
8217 -84733 -71584 -57170 -74549 -91140 -36428 -67823 -87860 -92385 -108692 -83640 -74481 -13624
8205 -13624 107672 192755 178952 71027 54799 52004 24731 2612 43512 42828 -31282 -85454
8193 -85454 -46740 11077 -32232 -132267 -127812 -64735 -31197 26790 -8219 -32980 14521 36859
8181 36859 24673 -17763 -51092 -38984 -24834 25244 -20369 -26948 10393 -50115 -80354 -88692
8169 -88692 -67762 -5584 -27325 -52187 -123814 -130258 -98693 -79317 -42667 10903 -227 -39562
8157 -39562 -9914 -70839 -104390 -97007 -123662 -147013 -97349 -68039 -112891 -123912 -45517 40413
8145 40413 80976 96979 9925 -25303 -58801 -81714 -45548 2557 62814 19217 -74344 -65338
8133 -65338 30412 58865 69230 100391 93673 54733 7426 -31304 -67842 -116951 -122816 -52936
8121 -52936 5094 -29579 12049 24217 51352 132820 169709 169074 112606 38745 -50235 -62409
8109 -62409 -8549 56120 20437 -71464 -30927 51907 13836 -34392 -43902 -272 91752 116243
8097 116243 18448 -52376 -70879 -78479 -54985 -45625 -52204 11892 63670 34450 1084 29540
8085 29540 68507 53576 -10519 -20097 8945 -12185 14114 13224 -88505 -177540 -138437 -21047
8073 -21047 10023 12234 9710 14306 56501 69867 38655 52480 33476 13381 23598 -62654
8061 -62654 -76408 -60220 -73527 -112199 -70143 76924 85696 67403 40488 -73365 -198484
8050 -198484 -150906 -119154 -36942 -99378 -115634 -128557 -155527 -161410 -83333 -21434 -1543 -44250
8038 -44250 -63269 -8260 640 11593 -32738 20105 2547 -63284 -7632 57802 110037 30142
8026 30142 -7135 -70593 -98541 -85013 -121653 -82225 -43870 -4487 22718 55057 109644 183293
8014 183293 280966 355860 266501 173342 149322 129556 99540 71584 1952 -10835 -19076 -19474
8002 -19474 -13645 13936 54436 -1645 -11652 19328 91388 129578 68010 -2805 -52310 -34365
7990 -34365 29695 44282 22929 -104451 -112324 -65274 -62561 -42451 -48758 -31999 -75451 -66229
7978 -66229 5403 37716 -9047 -34349 1066 40433 47900 -1558 13693 37240 -6891 17009
7966 17009 45267 27216 86936 119184 78572 34118 21636 -6113 -81712 -123203 -115227 -119056
7954 -119056 -62071 -24814 -10822 4517 19454 49083 16922 39542 53726 55955 95601 94517
7942 94517 61909 -33972 -62959 -24458 -1263 -15640 -84943 -89936 -13716 -40386 -28328 29226
7930 29226 -6227 -9933 22653 44847 -1921 -53979 -38393 -83096 -51767 -48395 -4798 28754
7918 28754 -23458 -42439 5148 9191 -30854 -54433 -44553 -43934 -61530 -77329 -81973 -44456 -51081
7905 -51081 -68185 -42933 -44829 -80166 -104684 -72888 -31330 -39524 -67958 -90684 -115496 -149643
7893 -149643 -108495 -120562 -50509 -26331 -64304 -69006 -43450 -8662 -46479 -90597 -93035 -11421
7881 -11421 11236 41295 61073 36918 -19779 -65199 -39859 18740 -50345 -98343 -124018 -80928
7869 -80928 -16418 13833 -30076 -49592 -20509 -25655 -18715 -74099 -161065 -143793 -60957 -83625
7857 -83625 -44790 -228 11784 -1860 28125 6064 24478 13341 -15302 -76408 -68531 -24032
7845 -24032 3513 -48702 -94882 -80876 -87398 -82056 5065 21623 -17269 -35894 -17284 -16751 -8189
7832 -8189 -36070 -7093 39695 44881 -57414 -55357 49961 84181 80885 65727 60698 48851
7820 48851 93891 59662 29279 -20827 -99130 -84923 -98819 -21263 -14906 -63763 -104406 -73028
7808 -73028 -131249 -162835 -118437 -63357 -41954 -22985 45288 81431 51206 -18485 -44543 -66970
7796 -66970 -40002 -29663 8911 1040 -2864 -27167 -71804 -43874 -21835 -95343 -103034 -92292
7784 -92292 -133064 -130616 -108688 -70420 -48028 -79984 -53814 38757 35884 -44666 -58628 -56524
7772 -56524 -98692 -80455 -87678 -70838 -55161 34594 7918 -40518 39582 49896 -17673 42571
7760 42571 99402 40380 -29617 -50159 -59267 -45893 -6977 28925 59956 87304 43547 43526 29945
7747 29945 242 -7809 69841 51924 -36758 -35334 -21914 38530 49388 12644 12411 -14182 17211
7734 17211 48233 71061 80891 37899 22860 4257 -15221 -6845 -6761 1420 -57467 -37237 -1488
7721 -1488 -17595 -40241 -18870 -79225 -67107 2510 50446 58228 33312 -45728 -64787 -160986
7709 -160986 -155689 -97218 -119933 -77099 -20800 -75595 -86318 -21534 24568 24060 31784 71805
7697 71805 77049 15027 28158 78947 72033 7047 8715 -57278 -35947 -49036 -83268 -93065 -51545
7684 -51545 -28294 19116 -4592 20788 20 -31569 -3044 21935 -5098 -22321 -65638 -80664
7672 -80664 -90234 -82140 -73967 -28572 -81104 -137319 -149334 -147086 -152433 -124587 -108560 -79178 -42935
7659 -42935 -59239 -22925 28466 -24977 -64852 -142559 -174903 -143855 -52044 -34432 -36276 -58613
7647 -58613 -105789 -61160 -71625 -94812 -127664 -76205 -11796 -29875 -103291 -137258 -109528 -109649
7635 -109649 -64818 18142 -30183 -128409 -113725 -119746 -63242 42117 88122 151369 158505 102029
7623 102029 98060 26903 19005 34268 36903 28650 424 26883 56158 -25679 -51063 -80754
7611 -80754 -117415 -47428 -14121 31936 22395 -55271 -81448 -98066 -140922 -118647 -110642 -75880
7599 -75880 -72929 -61835 -107491 -29111 12281 -1720 10634 6746 23304 59267 45570 -21766
7587 -21766 -63565 -69216 -67983 -56138 -116989 -66840 -42316 -61062 5454 15380 -26610 14404
7575 14404 32987 61862 44395 27406 7468 -108246 -70046 -59450 -40773 -34542 74868 85490
7563 85490 52108 -35812 -42494 -47641 -142073 -112186 -76244 -84552 -14682 36503 21901 -49864
7551 -49864 -71649 -30861 -15275 -3677 17969 27609 25607 1963 -16838 -9330 34871 79259
7539 79259 81180 42566 5623 13547 37220 -10721 -115298 -160247 -152252 -205919 -183570 -110798
7527 -110798 -26879 61043 74912 65806 20309 -89167 -151138 -121311 -75024 -101408 -137622 -28247
7515 -28247 31983 61135 43527 28838 14080 -81422 -152121 -121137 -109721 -35096 8249 8050
7503 8050 109 18672 -10486 -84906 -121993 -29247 63070 58915 34998 26897 28126 -22036 -37691
7490 -37691 37664 48986 -1620 -50516 -34538 -2749 -38380 -68077 -19598 24060 44322 9257
7478 9257 55298 -5497 92303 56800 42987 52629 18517 49831 42398 8418 -12704 -20337 -64029
7465 -64029 -77513 -63804 -64854 -89583 -25807 18476 -34748 -28941 62879 32420 -46736 -108432
7453 -108432 -94855 -74635 -83234 -39618 -6651 -33723 -33271 -37416 -40739 -73321 -99779 -95692 -100797
7440 -100797 -62954 -44971 -21202 8089 27154 27486 42519 24557 89422 142504 152166 127123
7428 127123 77600 75356 47767 21871 20791 -35060 -29676 -43749 -105066 -66688 -67592 -49287 35921
7415 35921 82422 88799 77468 6813 13474 54178 74463 70749 -29031 -122947 -123865 -122825 -129307
7402 -129307 -115228 -119524 -143224 -167466 -114611 -76723 -86724 -46595 6335 1402 -73787 -68140
7390 -68140 -35142 -26090 -64364 -104186 -132668 -64948 5928 31914 50948 48094 -696 -60939
7378 -60939 -50161 -68186 -36340 -25959 -9661 13251 -40984 -79119 -67232 -42255 2850 -37648
7366 -37648 -45845 -4390 64978 117227 79581 52413 -957 -8839 -52614 -12086 -42996 -64163
7354 -64163 -71877 -52669 -67780 -54586 -29264 -84753 -97754 -20535 -76340 -106959 -101795 -58990
7342 -58990 -42843 -100473 -105021 -73422 -12880 -58951 -88832 -68680 -75458 -117846 -38363 100352
7330 100352 90024 -34698 -94583 -121478 -127082 -152123 -110501 -43320 -24830 -49779 -105784 -139107
7318 -139107 -98989 -34213 -9004 -106611 -119957 -5220 12502 -17201 -3207 11924 -22404
7307 -22404 -25647 -65603 -35187 26483 -14284 -22123 11747 3114 30386 58737 70437 -9226
7295 -9226 35660 38713 -53117 -49523 -72567 -99410 -114672 -61836 -15421 -16187 30681 39379 49714
7282 49714 98512 117364 76879 42555 -32068 -78291 -116210 -114637 -10936 11442 80187 73272
7270 73272 51927 67209 67744 -3057 16396 66091 93420 48302 9178 -64550 -59013 -112575
7258 -112575 -174740 -139575 -118932 -141107 -116963 9885 40727 53520 -22008 -95980 -22559
7247 -22559 45424 20904 15332 12473 7021 18809 43921 42463 22767 35746 28023 12000 -11604
7234 -11604 19626 30058 -12217 -9123 875 -5465 -34686 4808 -25425 -56416 -128154 -146903
7222 -146903 -83347 -58163 -63819 -53216 -49899 -49962 -44118 -12169 68073 59795 -5629 -63071 -86132
7209 -86132 -9453 -42488 -82373 -106384 -46437 -60206 -83299 -58737 -28547 -51710 11697 2759
7197 2759 -62172 -92249 -56607 -54419 -66460 -12115 -10279 5952 -16503 -30242 35537 77230
7185 77230 45254 36172 -22589 -83526 -80244 -64491 -41533 -52439 -80197 -109194 -45031 -38226
7173 -38226 -120952 -147197 -101684 -77680 -77358 -49977 -21906 -21585 -3311 56432 58471 67039 61480
7160 61480 51090 51813 33347 35733 -24081 -41216 -21584 4827 26082 34413 -13525 -74882 -67760
7147 -67760 19122 29133 -26803 -12271 24116 53356 88689 127385 100203 53552 -19404 -42960
7135 -42960 -86598 -71660 -112763 -126577 -77176 -83848 -109669 -42332 -12527 -40753 -1688 -24160
7123 -24160 -22092 -60389 -74680 -105922 -50066 -27967 -34704 -130521 -157133 -103795 -70736 -31906
7111 -31906 9687 -6771 -27445 15441 -2786 -878 -13732 -40164 -55883 -10707 60664 41803
7099 41803 -7632 -41056 -13222 -68708 -130464 -104967 -37676 62913 75491 -416 -13125 -46426
7087 -46426 -56574 -39722 -25783 -41840 -34120 -51017 -32806 -3496 -34237 -95042 -118803 -108600
7075 -108600 -78808 34336 78523 30184 29244 11668 -43507 -70574 -80746 -38218 -37678 -79598
7063 -79598 -85073 -72680 -114821 -65406 -22008 -60387 -97055 -133191 -146777 -160052 -76603 15099
7051 15099 15760 -832 -66628 -91240 -176318 -172560 -94661 -100955 -134144 -77787 -38406 -23790 -52124
7038 -52124 -9319 33555 2665 -40302 -53559 -99931 -57887 24861 46137 -84774 -159603 -88695
7026 -88695 -48627 -49592 -3297 -47381 -111245 -96943 -59796 -50618 -38986 -78229 -151694 -118695
7014 -118695 -90674 -81188 -65881 -63049 9170 -20648 -9606 24446 27458 -17012 -57138 -64976
7002 -64976 -8649 27529 13518 -1910 8301 -10683 -64080 -15587 -1518 -55382 -138216 -113766
6990 -113766 -24467 7591 73130 110320 81975 2721 -68663 -109375 -117158 -63207 -44139 -87484
6978 -87484 -47100 -3600 -16429 -4917 -75165 -64528 -74096 -42575 -75710 -66963 -75564 -98144
6966 -98144 -77968 -52284 -67159 -121583 -68413 -62743 -127053 -159054 -140001 -92521 8340 2081
6954 2081 46115 47734 7725 16457 4543 -9962 -28835 -35974 -60275 -68000 -73434 -27034 -826
6941 -826 18151 495 17459 2575 -76729 -54408 11197 33231 43578 6408 -20883 -22159
6929 -22159 -92281 -123170 -122633 -110187 -161051 -166811 -153592 -139809 -104186 -54068 -4487 -22330
6917 -22330 -29352 -69270 -117733 -101416 -66908 -29619 -46351 -11902 -32410 14800 -3986 -25163
6905 -25163 -46509 5745 -40907 -63334 -36708 -48745 -5754 71105 47030 3515 2597 -39956
6893 -39956 -52572 -60544 -76873 -26709 -12779 -47170 -67912 -115312 -123558 -138370 -132469 -103324
6881 -103324 -109816 -107990 -171196 -122785 -99121 -91659 -32578 -31395 -40740 -80144 -99071 -132094 -104374
6868 -104374 -60668 -47988 -84170 -41297 -44730 -44689 -9440 1255 51822 65804 -18252 8218
6856 8218 40906 39315 231 -27934 -27766 -59120 -30927 -59719 -94848 -125026 -71545 -134847 -112300
6843 -112300 -86852 -149213 -144331 -101057 -24883 5620 -32368 -54330 -57832 -39667 -10526 79620
6831 79620 110684 87343 53045 72427 52535 -19359 -97277 -115254 -89520 -57603 -28740 -14577
6819 -14577 -74754 -136030 -121405 -4221 61848 -31326 -109443 -149935 -174379 -91030 -36911 -69621
6807 -69621 -117554 -188160 -170510 -101810 -26555 6201 -4081 -24324 -59732 -65998 -60477 -98469
6795 -98469 -135278 -70198 -1175 -74902 -68280 -96285 -148416 -155486 -168180 -198660 -110997 -84896
6783 -84896 -99542 -81946 -122750 -117964 -65252 7672 -15069 49082 94380 65023 -7647 -100406
6771 -100406 -120151 -46708 -19469 -9366 14613 75063 58959 -9403 -47472 -25925 65113 67203
6759 67203 19628 44408 11196 10699 -2570 47938 51073 10440 -100180 -125892 -58569 -36677
6747 -36677 34168 50797 48137 29600 -23090 -41714 -18445 -59770 -159140 -111555 -164415 -142403
6735 -142403 -144110 -163203 -158819 -96190 -79236 -28266 25186 -67695 -87031 -58732 -93515 -114981
6723 -114981 -76826 -21407 -47274 397 23063 -50048 -45590 -33323 -52217 -99104 -98090 -109719
6711 -109719 -84595 -59249 -84336 -89387 -74117 -31579 -60920 -61484 -48036 -7689 20331 19691 52481
6698 52481 34734 13048 -21232 14653 -5306 -52391 -68036 -75876 -116276 -59292 -47376 -149593
6686 -149593 -152711 -163611 -142951 -110429 -116437 -70919 16525 28729 -5314 -5557 -15460 -465 -2202
6673 -2202 43415 18099 -5041 -8963 73811 58196 34261 -11522 39858 47850 55579 -1544 -42359
6660 -42359 -22590 27804 -56056 -114781 -94860 -125394 -189659 -140715 -96244 -98752 -116138 -71349
6648 -71349 -44069 -40239 -49621 -70857 -83138 -51953 -531 -27087 -61512 -73784 -129453 -134601
6636 -134601 -113827 -23774 46774 38375 -16272 -41611 -47841 -49767 -89706 -95148 -133136 -89206
6624 -89206 -62917 -43179 -30072 -58996 25889 56538 11672 13055 16571 -14973 -67395 1689
6612 1689 58457 14542 -23698 3950 40762 37268 44233 -6571 -76815 -74064 -103251 -66916 -23572
6599 -23572 9161 -21969 -20238 -46640 -54636 -144729 -241622 -195736 -105894 -120847 -89100 -6005
6587 -6005 -11785 -19429 -34696 -4050 5153 11398 22489 21313 -59163 -65688 -71457 10045 7279 -30614
6573 -30614 -73132 -88155 10621 45838 16083 -19508 -58388 -73314 7368 9797 27958 29940
6561 29940 5756 -41802 -39426 -52579 12420 23396 38183 68824 22234 25030 4230 -15354
6549 -15354 -18685 -70611 -83071 -123401 -133011 -84379 -45716 -60936 -26999 -52500 -79231 -122386
6537 -122386 -136853 -107404 -37613 3317 -46166 -55149 -66309 -31604 -55330 -29248 -15241 -21961
6525 -21961 38799 -29400 -106340 -100706 -112261 -90682 -61511 -44993 -90554 -79313 -66984 -86314
6513 -86314 -51925 -50762 -16729 -32019 -113776 -128078 -190711 -208785 -186337 -156222 -91214 -58425
6501 -58425 1640 5319 -9446 -37844 -51682 -83462 -119875 -133479 -149954 -135330 -111773 -98940
6489 -98940 -15770 24635 -25773 -16521 -73900 -147289 -136185 -94258 -56999 491 19432 41841
6477 41841 29857 -19882 -20822 -6893 -27913 -75728 -54887 -4059 7227 -34850 -98754 -121255
6465 -121255 -49577 13652 -70887 -101972 -99407 -111985 -118155 -60735 -61003 -79514 -106018 -108481 -98344
6452 -98344 -41211 -18511 21636 62708 73381 37894 -7853 61838 108050 93225 29926 6946
6440 6946 -2233 9535 13273 48800 84677 8870 -4082 11174 -11722 -47825 -93024 -124790
6428 -124790 -163398 -95425 -51110 -73197 -100532 -33909 48749 27177 -24944 -43018 -99586 -99021
6416 -99021 -89433 -32816 -14108 -99104 -89165 -22321 9772 -40046 -82502 -120608 -125426 -116774 -100340
6403 -100340 -87540 -83483 -82663 -162342 -159053 -70997 -13724 -2390 -63058 -122421 -171177 -199329
6391 -199329 -252212 -237845 -123890 -22877 -21648 -48020 -21337 -38495 4922 -33280 -35310 -43021
6379 -43021 -49207 -91430 -55314 -2344 53812 40205 -2674 -60807 5588 61850 2367 -110627
6367 -110627 -141959 -27940 59303 30782 22735 -9325 -55564 -25244 4720 -80685 -79030 -60912
6355 -60912 -104125 -121797 455 17879 3773 -1013 15807 11791 49667 2120 -52507 -114705
6343 -114705 -62650 -96 -18105 -100366 -87748 -138892 -157481 -146135 -94495 -45916 -76729 -18296
6331 -18296 58631 73010 124426 118547 89748 22569 -52129 -86810 -147532 -120698 -101812 -60648
6319 -60648 16802 24752 5913 2495 4196 26413 -78950 -114043 -59547 -18773 -4720 -15368
6307 -15368 -25726 -51907 -49048 -39612 8276 -16125 -81095 -66477 -38593 26984 34120 15834
6295 15834 7393 35101 61912 28565 33791 3786 -49551 -11203 1963 34022 76276 92475
6283 92475 62122 21165 -43386 -113507 -54495 -24463 -25193 -15862 -651 22050 32167 40771 22738
6270 22738 16127 20383 39405 17450 26988 48187 -54193 -164593 -101377 -78437 -84546 -75334
6258 -75334 -1010 41502 86702 58442 -6044 24685 89430 73614 -7730 -63649 -96946 -59036
6246 -59036 -19619 22343 13446 -37799 -23340 -36295 -71649 -43393 -54323 -69570 -62438 -34458
6234 -34458 -22968 -22149 -127913 -229545 -154624 -3747 -3594 669 3242 -23058 -60295 -47001
6222 -47001 -30672 -86497 -79349 -50235 -59858 -30731 34967 65875 45555 -17133 -7448 -38437
6210 -38437 -28565 -4691 -37033 -61700 -80044 -92855 -37495 -12769 -2566 48943 84621 123697
6198 123697 147831 144655 114196 68345 15995 -21857 -22422 13628 99957 114547 99509 76119
6186 76119 38268 -31196 -70152 -52363 -15250 43883 31385 45813 51721 24624 15683 20727
6174 20727 -2005 18107 -34455 -62171 -69469 -89647 -37391 -47903 -57918 -63393 -76538 -19403
6162 -19403 1420 -45175 -38677 -22812 -32386 -57151 -68391 -26954 -20043 -73128 -78645 -59066 -58049
6149 -58049 -17659 -6703 -37471 -31067 14118 43007 103191 123070 30091 -45707 -79600 -55494
6137 -55494 -19365 -343 20989 20920 -24530 -31056 -63923 -104404 -162007 -127648 -31015 30749 68702
6124 68702 36451 20695 46895 90490 89293 26610 -63017 -57147 -24888 -60331 -59880 -61474 4532
6111 4532 13264 -9304 -9448 11029 -34085 -12290 29485 -77597 -159410 -146141 -69758 13860
6099 13860 -9242 17069 -7029 -11611 -29269 -42830 -16593 51923 87807 25484 -22756 -88386
6087 -88386 -98153 -70689 -62478 -152726 -173747 -99749 -47480 -19895 28735 54770 20632 65866
6075 65866 35631 19817 20171 -3502 22879 -42707 -57826 -78687 -91498 7315 59230 3625
6063 3625 -607 -12297 35469 65335 44933 54383 86138 13712 -13678 -18489 -853 44469 41686
6050 41686 11961 -19494 60111 4838 -4039 47890 30160 -83389 -127682 -99221 -13847 22021
6038 22021 29910 75872 89771 92221 54084 35813 24835 -1624 -120 -21437 2303 -4917 -19277
6025 -19277 -3598 47839 45816 56050 48977 37461 46413 3094 -33552 -39939 -65410 -25 -16390
6012 -16390 -22358 -47260 -109768 -162319 -190316 -220959 -202707 -77444 9721 67836 26303 -31524
6000 -31524 -65726 78372 140282 127478 117108 45290 -59216 -30909 -71336 -62804 -54045 -3298
5988 -3298 -1931 -9498 -21021 -16279 20780 -16187 -24177 -23573 -9057 -13914 -52047 -14318 14082
5975 14082 -39034 -60451 -91911 -84976 -131669 -170198 -128455 -77281 -45979 -48911 -63046 -66490
5963 -66490 -77487 -83327 -75030 -25195 -26886 -30222 -116049 -102549 -71028 -83611 -58794 -58454 -71864
5950 -71864 -19985 -32523 -90648 -139209 -94981 -101575 -109419 -84682 -43481 -20345 -23624 -33882
5938 -33882 -17172 -43174 -106925 -103399 -29847 35317 88868 85906 32731 -24807 -36539 -29240
5926 -29240 20915 39808 -51311 -46953 -54873 -65413 -77002 1772 44093 54139 17228 4307
5914 4307 23340 47855 69353 106381 119026 63293 49011 66420 43498 -26755 -43566 -59510
5902 -59510 -28224 -65569 -49969 3562 27246 -42957 -74524 -73948 -110024 -168194 -106373 -39740
5890 -39740 -51149 13820 -38340 -57354 -55228 -17006 15439 -41963 -57191 -20371 32953 63108
5878 63108 119223 138836 26460 -7814 31390 27819 -7150 27 -11371 -36386 -102917 -106465
5866 -106465 -62729 -920 22810 -24944 -81474 -76111 -107492 -172562 -118113 -57803 -67133 -79805
5854 -79805 -106704 -86224 -65160 -100548 -57660 -20119 29912 57369 100941 38296 50779 -66751
5842 -66751 -93626 -129043 -147181 -128353 -114289 -80992 -12446 58092 37475 -27690 -83889 -20687
5830 -20687 13295 62270 92413 35506 22976 -2971 -20804 -29130 -104504 -112080 -81895 -98426
5818 -98426 -48996 -48413 -17003 24878 38730 -34377 -55958 -7731 34066 5735 -29344 19333
5806 19333 51529 71780 1635 -35471 -105490 -109347 -32571 -20441 -39377 7285 -2825 -1779
5794 -1779 1425 -29288 -72584 -68263 -55710 -43705 -28166 -37689 2626 28953 -6426 -13169 866
5781 866 -1972 -26935 30460 64439 13548 27165 17037 -64954 -94267 -92386 -122916 -91332 -83078
5768 -83078 -153318 -184503 -85759 -24314 2036 -75645 -150433 -199021 -163813 -122564 -49432 -52972
5756 -52972 9498 62315 84061 47308 523 15915 51670 28237 32586 47651 46865 33552
5744 33552 -20763 -45875 -46712 -12184 -21405 -16894 19949 985 -40516 -30812 -19258 -96615 -75406
5731 -75406 -89019 -73245 34748 73468 3718 -50870 -53859 -3602 29460 -20150 -34160 -34794
5719 -34794 -53083 -95969 -120366 -47527 -66779 -135924 -73079 -80712 -55857 -19019 -12533 -6355
5707 -6355 -22589 -3537 21064 -3089 -51660 -39571 -1488 84780 110442 64203 46830 37068
5695 37068 22900 21329 -3568 13006 -23863 56235 51603 -35274 -42766 -40643 -45507 -23435 -67918
5682 -67918 -49877 -53711 -106334 -131888 -78405 -24047 2879 2926 97988 98787 60953 79243 100970
5669 100970 78648 -40501 -91744 12528 84103 65298 40897 48795 19833 8347 38326
5658 38326 17451 11963 65850 89739 69383 54882 83938 107702 111735 19263 -13890 23929
5646 23929 -6249 2544 27092 8203 -45946 -5283 57679 44154 -25769 -58940 -94616 -85454
5634 -85454 -118472 -85734 -90036 -138216 -72808 -60432 -62460 -43826 -8437 6041 -10583 -3910
5622 -3910 25897 15431 17414 31856 198 30691 80222 59861 -56416 -145637 -44281 -40469
5610 -40469 -90196 -129333 -115485 -113187 -132776 -35662 39059 29010 28049 48918 20874 3019
5598 3019 18443 2108 -30519 -41033 -97290 -135339 -163362 -177298 -164882 -36795 -31477 -78712
5586 -78712 -105039 -87050 1500 17894 62017 42819 125608 102852 72582 7229 -42867 -32288
5574 -32288 66055 86953 78865 40323 42207 38211 77318 98554 63065 -38998 -48680 -143342
5562 -143342 -139448 -94099 -21516 61600 56814 15066 -3219 34998 65174 41789 -21581 -16354
5550 -16354 10987 68999 81691 88691 55653 -35843 -94123 -49870 13975 -31577 -31573 -73303 -87564
5537 -87564 -13254 22088 -21697 -32774 -25225 -25824 -37257 -70863 -52572 -25775 5221 53357
5525 53357 64380 110071 16694 -95972 -200684 -178261 -89032 -53210 -22517 11748 -28876
5514 -28876 23119 56302 45237 58965 55627 -5259 6292 -17378 9071 58245 48164 -1703
5502 -1703 -84409 -107354 -29940 21397 -6730 -98742 -138352 -99697 -53222 -55406 -62942 25166
5490 25166 53177 18546 -47207 -70489 -40539 -403 -57218 -109157 -86284 -63335 -68657 19600
5478 19600 -30429 -30994 -58865 -66184 -54139 -28489 57 58592 -149 -63106 7230 4888 -104758
5465 -104758 6803 61248 31981 37114 45904 17208 -3640 63618 85415 69931 74398 39878
5453 39878 -27615 23432 26281 -20966 21064 -28802 -2953 35468 60768 53901 10835 -99713
5441 -99713 -177003 -163137 -170511 -48942 21816 41735 -30127 -75227 -32310 21864 12025 9446
5429 9446 -2728 -2432 7422 10107 -37184 -100554 -129268 -80416 -86571 -9269 25320 16818 4988
5416 4988 -26372 10607 35462 10076 25371 67314 44242 -61054 -48899 -55479 -9887 -37869
5404 -37869 -51521 -33882 -45005 -49517 -13241 -74806 -170122 -154487 -108921 -88620 -50971 -26176
5392 -26176 -76914 -136756 -213337 -189020 -182686 -128248 -48505 -60813 -66019 -43199 -32331 -28818
5380 -28818 11963 50241 -2684 -4939 10953 -7439 -51506 -61353 -64806 -19009 -84706 -75549 -45975
5367 -45975 -381 77772 113801 152286 110561 62854 80405 112214 116528 73603 81312 29683
5355 29683 -26855 -11890 17929 -2631 -64098 -49066 -22569 -40634 -65705 -54697 4837 -3660
5343 -3660 -56779 -90720 -103850 -106156 -55524 -13667 -26677 -80571 -106191 -105773 -67402 -7147 107169
5330 107169 206702 203135 128115 42259 27941 -10917 -64530 -51695 -49828 -29391 -7705 24731
5318 24731 -79183 -114685 -113211 -47886 -1022 -40030 -45122 -49200 -30459 45 -310 27959 48019
5305 48019 68655 68028 30592 -18173 -41429 -27579 -11699 -49762 -93553 6892 59065 108801
5293 108801 98306 88007 87926 30269 -19053 -21893 -63297 -24588 -37969 -13994 -53059 -140216
5281 -140216 -179485 -114211 -105711 -48229 -26645 73546 22911 1496 38742 29628 -28060 -8048
5269 -8048 10013 135391 165239 105959 44194 36651 61668 20494 30203 73799 117672 68223
5257 68223 -18186 -13640 -29794 -57470 -136239 -64301 -54712 -76849 -76304 -53633 20510 14768 912
5244 912 19860 -68987 -35289 77921 85735 72795 62810 -1708 -69921 -73197 -47370 -21502 21690
5231 21690 103148 139717 138254 105782 154711 200467 76168 60914 63123 57700 115158 174655
5219 174655 125986 83767 39105 49560 -2657 -113970 -97741 -69476 -129904 -99931 -88404
5208 -88404 -66078 -43883 8274 14166 3411 -65076 -167797 -173907 -175692 -165655 -137591 -88726
5196 -88726 -52277 -131031 -221521 -169540 -121450 -12894 28080 -30176 -41294 -46653 -30147 -32813
5184 -32813 -48046 -65447 -75697 -36516 58161 93790 76273 6500 -6785 -8383 26652 60989
5172 60989 61822 -7829 -27477 -4275 41976 7212 -33724 -119740 -100313 -11792 78125 85768
5160 85768 61471 18281 -9401 -28117 -30317 -30392 -48662 -82018 -58021 -43432 -141137 -161265 -108984
5147 -108984 -61306 -73422 -72376 -73028 -52325 3866 20670 -8445 -9744 72283 107651 118745
5135 118745 69006 37731 9765 -30482 -80127 -101987 -73816 -28886 -7691 -31727 -35865 -63888
5123 -63888 -30988 37771 -48859 -101844 -134207 -68271 28303 126102 51532 -42762 -33859 -21768
5111 -21768 -7164 20993 52646 33759 128876 166073 133841 47261 14452 -1088 -38518 -83363
5099 -83363 -94339 -61855 45067 69986 -19417 -50489 -46374 -5464 -18294 -5922 12235 -40952
5087 -40952 19210 41862 77684 74265 44126 -21783 -7548 33600 35241 24064 -9203 -40741
5075 -40741 -40469 -31688 -50678 -2055 15674 107253 73694 -23455 -2342 70548 55684 61875 72331
5062 72331 53417 60928 -39107 -55023 -37449 32255 54669 9961 40457 6618 40523 108121
5050 108121 40551 -5043 16722 38863 59756 -16990 -80689 -94050 -114322 -6522 -44888
5039 -44888 -53296 6218 1850 2578 10318 -2488 -9526 64109 108223 56712 -30591 -2927 12920
5026 12920 -40863 -32483 -9456 18019 21328 -72630 -108267 -122954 -114338 -47525 -14171 -31265
5014 -31265 -102413 -132958 -133289 -76350 -32418 -81505 -78271 -74306 -113038 -116838 -51939 -46350 -45844
5001 -45844 -29432 -31143 -57822 -70513 -62560 -5217 29134 96934 97973 29856 -8832 38300
4989 38300 57657 86365 162748 156880 124723 149599 75054 46960 7843 -4602 11441 51547
4977 51547 87658 144322 125643 70674 -2564 -12199 -16546 -7019 34031 26631 60864 70170 6036
4964 6036 -49220 -20646 -47985 -109257 -64763 -51658 -28619 -11341 -1773 -9619 -74171 -75260 -32148
4951 -32148 -64605 -7239 55098 31250 41350 25335 4394 -1053 17997 -37311 -98546 -28283
4939 -28283 25090 6758 -12814 -2238 45326 94745 40467 -1538 -27091 -28815 40606 85817
4927 85817 133721 125702 22380 -54551 -82230 -138812 -197102 -195886 -58151 -55591 -62416 -41336
4915 -41336 -56991 -45347 -112163 -155046 -208123 -155671 -81847 -26739 -4829 12617 -92819 -80456
4903 -80456 -514 -112982 -143514 -108500 -58094 39518 -8579 -55144 -36867 -64935 -35196 59812
4891 59812 58492 87106 61930 29273 -62345 -53176 -63108 -99622 -78267 44510 144158 61589
4879 61589 -111640 -121516 -89623 -84508 -59578 -30415 -19569 -33090 -68058 -86129 -81274 -94624
4867 -94624 -17530 -41599 -83592 -130442 -162676 -183907 -145243 -107357 -62891 -10841 39849 -50091
4855 -50091 -50681 13716 34161 -1807 10111 -72057 -89700 -114295 -93588 -52276 -17768 -42068
4843 -42068 -31810 -11391 -6031 409 14648 -55601 -63841 -31791 -16198 -2385 26115 36885
4831 36885 5426 29476 62366 37883 31532 28806 112690 107375 69407 56011 60438 -19921 -68222
4818 -68222 -14211 51860 64655 -26183 -90138 -78015 -21121 -30884 -75948 -113581 -141063 -109913
4806 -109913 -33757 -43335 -143958 -118710 -71149 -109746 -98667 -75912 -77081 -50355 -42667 -29019
4794 -29019 -70253 -3600 -10506 -57227 -128202 -127249 -105297 -115693 -80651 -28601 -49327 -1752
4782 -1752 -1885 -23667 -182 -21381 -20637 -36229 -54228 -99071 -98773 -98012 -97569 -85578 -83344 -55015
4768 -55015 -33816 -19090 -11240 -41321 -39248 -18182 74980 87990 104675 134183 137420 69557
4756 69557 15018 -70856 -103025 -54524 -52771 -41876 16249 119854 87621 -15359 -87052 13065
4744 13065 72531 133459 110029 75068 40025 16446 -15310 86493 138437 29931 -38177
4733 -38177 -43458 -26676 -63112 -76355 -53163 -87871 -35596 35273 26961 80371 94965 25887
4721 25887 -32098 -32205 -25131 -49967 -69341 -12069 -39312 -38365 -47872 -47741 8896 3153 13656 4298
4707 4298 -42785 -70956 -41604 22598 72159 136117 139546 73890 44475 -47086 -54942 -51057 -45128
4694 -45128 -6772 2262 78711 74160 29481 5228 -82438 -90062 8691 59354 13634 13791 -8977
4681 -8977 -21656 -71517 -67201 -64442 -117793 -153542 -85028 12705 8560 -13688 -26637 -60207 -42174
4668 -42174 346 95250 89361 -249 -52422 -43545 -14931 27773 -3034 -16536 -72380 -137208
4656 -137208 -142821 -90407 -68395 -26694 -8218 -45629 -128497 -155112 -91616 6480 -6529 -62283
4644 -62283 -122906 -137250 -70081 -46063 3378 93908 83359 11713 -8699 74088 64847 42186
4632 42186 -38282 -130888 -63113 -29523 -34210 -27798 -71533 -83092 -80641 -52638 -68443 -94177
4620 -94177 -84519 -17146 4216 3633 33611 71455 27701 -33940 -18830 66688 152297 98629
4608 98629 89864 81039 91464 15488 -28002 -41241 -24827 -70307 -114338 -59368 -55982 -96677
4596 -96677 -50664 2855 66106 139474 61231 -56152 -90298 -22691 8776 33687 22356 -13717
4584 -13717 -59620 -48689 -27247 -38950 -12758 -42270 -90719 -120883 -159757 -141289 -135828 -69477
4572 -69477 -40482 -14880 59444 89866 66391 7360 -6651 -49781 -38687 -57340 -34622 -14374
4560 -14374 -79853 -65153 -36746 -7054 93827 97931 33842 22850 31430 34881 87428 30641
4548 30641 -61653 -88440 -107028 -80279 -87992 -74601 -78777 -87977 -41679 6269 -5213 -3183 -23480
4535 -23480 -105300 -141436 -120092 -81995 -91964 -107143 -102702 -84071 -140986 -102255 -72801 -176659
4523 -176659 -110813 -37031 -37454 -83198 -99981 -21699 -12553 25871 62336 108629 44635 -17907
4511 -17907 -21792 82243 97524 13835 2946 -19860 -83185 1105 4376 -35443 17342 -6677
4499 -6677 860 26567 -28302 -44382 134 16332 -28567 48313 119918 73939 10471 44
4487 44 -37410 -76124 -104093 -39857 -15509 -60438 -53806 -16603 25711 -3929 -6739 -77182 -109685
4474 -109685 -46050 14683 2906 -83102 -68460 -60593 -71066 -29082 -19523 -85894 -135640 -210464
4462 -210464 -159800 -117965 -92219 -4356 50093 1395 49827 -51159 -2471 -10973 -38060 7718
4450 7718 20942 11245 110256 146000 88359 9646 -1357 21385 23564 -44451 -63594 -68232 -69871
4437 -69871 -62207 -44718 -28656 -36694 331 57790 70611 30062 -33310 -13141 -48804 -68526
4425 -68526 -36496 -22542 -19724 7185 2587 -10817 7849 57198 31690 7602 -14211 -7879
4413 -7879 -12449 55472 120877 106662 102532 98228 114108 98108 46780 3302 44415 13123 52514
4400 52514 32437 5439 -3108 92529 126650 100850 57837 37881 -22373 -35785 -105725 -121072
4388 -121072 -69842 -51659 -96182 -167559 -135300 -91799 -102921 -106660 -153031 -170270 -159643 -127041
4376 -127041 -22266 12255 -30791 -43114 -47503 -51282 -63094 -134582 -95457 -31869 28717 8011
4364 8011 28170 87865 158150 102906 63296 -28904 -24859 -21820 4772 29281 48646 22194
4352 22194 -8090 -47157 -28341 49894 77674 50492 49445 74479 69673 21639 -19943 -49005
4340 -49005 -22846 -30628 -25921 16071 18504 30169 1246 -29919 -63368 -19422 -30150 -83358
4328 -83358 -140000 -175137 -180368 -142158 -110782 -77512 -76696 -106923 -66411 -12980 20690 11420 -15895
4315 -15895 -29560 -45678 -21929 -46322 -44302 -59732 -29608 43945 48401 56548 6758 -82000
4303 -82000 -44418 -33914 17705 14247 11948 46505 -596 -7317 -79259 -107065 -103464 -43014 -38734
4290 -38734 6181 40964 58652 28002 26044 15135 -34238 -76923 -105461 -68127 -66773 -66867 -31298
4277 -31298 54662 106365 94433 66649 19595 -49990 -67848 -14254 15349 61813 109493 46685
4265 46685 11641 66066 40047 -25136 -42694 -41211 -57265 -36187 -38576 -33978 -1031 -38873
4253 -38873 -25906 33164 -11969 -25951 -9437 45670 16985 5882 7624 94100 126311 27443
4241 27443 -35503 -1153 -14092 7646 -5125 -63090 -56124 -17971 67314 127686 80984 49752
4229 49752 69589 90604 28759 8149 -47513 -51296 -26493 -28896 -46129 -7030 18053 58128
4217 58128 54307 16095 -11621 -90895 -130722 -170993 -131184 -34890 -38487 -30777 -68284 -90392
4205 -90392 -108129 -66784 -68030 -59700 -24365 -55071 -68993 -81865 -85673 -45458 16879 101757
4193 101757 70975 51418 1703 -62581 -103710 -17544 61960 39484 40927 21772 8505 1115
4181 1115 -8052 -4544 10972 -20900 41281 85403 84498 82440 64542 105576 109807 124519 105738
4168 105738 63524 76615 14868 -70274 -39639 -104215 -153571 -93626 -56177 -131994 -209333 -274194
4156 -274194 -234003 -133431 -69647 56272 44144 -36971 -65094 -80749 -29414 57664 34999
4145 34999 23413 -18908 26649 68331 40772 34794 63496 61617 115827 166743 136889 58172
4133 58172 13772 -30658 -3594 284 26044 103845 96999 101448 72140 -8479 -3346 9888 62305
4120 62305 -25681 -41665 -13744 24833 -30331 -71622 -91361 -116390 -86299 -5185 25746 -5215
4108 -5215 -25736 -2618 -43496 -41747 17241 2952 -74949 -45805 -23635 32914 155576 166019
4096 166019 138192 123454 165516 123311 45928 -9204 334 -19853 -79234 -108305 -143913 -148245
4084 -148245 -137619 -137382 -140960 -122521 -127783 -30186 60266 10545 -41665 -66563 -85376 -32399
4072 -32399 -3391 12624 -15586 -68195 20707 87786 96681 11408 8794 55905 34708 -12649
4060 -12649 18541 42632 -3048 15251 7872 -78118 -85809 -73690 -120151 -115196 -54221 -58687 -68823
4047 -68823 -9393 11935 -22799 -74542 -95416 -113582 -80524 -87746 -126976 -83143 2276 87558
4035 87558 48880 43636 17763 10359 61182 114406 121523 41417 6846 8149 22278 15833 51941
4022 51941 24433 -18578 -922 -32167 -56239 -78732 -124699 -107496 -111057 -75739 -21486 45488
4010 45488 16200 -54005 -12134 -18804 17874 3793 -29864 -87039 -99862 -9693 47410 18329
3998 18329 -13749 -21053 -20487 17016 73083 126104 116240 72586 55166 32479 10823 -30146 -66292
3985 -66292 13504 26028 6380 43387 50256 -16766 -40374 -108645 -179289 -168635 -105616 13054
3973 13054 3251 -82625 -33184 57228 50175 34377 -67416 -93437 -89298 -34280 11240 25893
3961 25893 25153 28448 25320 -43257 -49017 1344 74307 -13195 -54841 49088 103220 36045 -16476
3948 -16476 7372 3801 -12951 -54707 -67249 -78269 -85417 -136209 -28966 28470 -19488 -12682
3936 -12682 2775 92802 86912 -15735 5332 50604 4626 20868 61519 27977 21610 -48215
3924 -48215 -22428 -1214 -40531 -77095 -49804 -33311 27323 28339 -45932 -24958 31107 15412
3912 15412 -41902 -71086 -58347 1289 28164 31187 19822 -33165 3404 34412 67589 65535
3900 65535 45353 47052 93771 129396 82301 104164 74772 73709 73512 55435 45479 4529 7952
3887 7952 44349 34517 56046 126038 114566 98373 52460 40510 34384 45773 44131 13994 -67580
3874 -67580 -58548 -52477 -64173 -82639 -29742 -38561 -123583 -124269 -92330 -128371 -150476 -167608 -136939
3861 -136939 -87662 -32093 -24906 -22436 -32912 -9904 24276 -9566 19703 14484 12094 12273 17067
3848 17067 47047 53506 45861 56764 16495 -69665 -72269 -83020 -83997 -81951 -60806 -53536 -32640
3835 -32640 -14524 -76720 -113871 -55605 -30247 -53341 -38700 21069 -6156 -109054 -124326 -32924
3823 -32924 -40304 -75467 -20685 20203 -22992 -85322 -116986 -55226 -66539 -44309 -19126 906
3811 906 -14115 -83211 -123643 -91272 -51906 -42566 -103542 -123298 -76926 -64640 -69863 -2245 -35289
3798 -35289 -76697 -71134 -2300 41169 -7798 -16589 2392 69364 78942 64299 91801 98828 127196
3785 127196 59087 -7236 14662 25169 60369 96059 64028 112513 130503 22574 10040
3774 10040 23200 72638 32883 4498 44116 127595 122519 67090 66899 42087 -20799 -48165
3762 -48165 -33158 -10722 -22665 -55062 -77138 -38661 7835 24269 -21326 15926 33385 77364
3750 77364 84592 86532 144202 153500 29449 -21211 -47646 -121281 -132760 -71483 -20397 19957
3738 19957 37639 47952 77147 55544 75116 63906 31342 21211 47143 75988 37482 10365
3726 10365 25149 29882 3872 -36841 -54909 -66620 -34562 40707 8379 8475 24718 70334 68549
3713 68549 38899 30207 41241 17960 30652 23834 18600 -56523 -55735 -37731 56273 97077 122194
3700 122194 133834 119793 78874 -17586 -22580 -3954 -35944 8148 3959 -70637 -85405 -78475
3688 -78475 -15528 7552 -13769 -33349 -36421 -51911 -22137 -38104 -4283 40841 7901 26919
3676 26919 43053 71924 55342 7824 7623 -5579 73368 95714 98160 108635 79221 88515 11428
3663 11428 -19660 29655 44728 -9587 -6665 78117 98394 105609 81284 39856 -44956 -61050
3651 -61050 -56510 -23192 -64278 -106223 -108417 -95902 -79348 -26907 -11412 25015 -76654 -134759
3639 -134759 -52939 8531 -32037 -112703 -105643 -93308 -44644 -4344 -2801 5996 8411 95467
3627 95467 87613 22388 59970 44006 36947 13407 12736 58470 61736 20234 28027 45705 60604
3614 60604 57531 62902 62614 25570 -8383 3378 -21886 -83709 -43159 19317 47973 32863 -30892
3601 -30892 -22705 -10054 812 55710 21261 73169 124530 136335 80418 65993 43607 40376
3589 40376 110596 85333 54366 73936 51083 -17990 31356 98182 68436 27258 -6837 -49419
3577 -49419 -82894 -31399 -40671 -36296 32870 58914 99945 82567 122719 129374 184639 147650
3565 147650 110353 50314 -59690 -103922 -107784 -148680 -149018 -31881 -16705 -32751 -16780 -10940
3553 -10940 13422 26330 9176 -37030 6014 74778 121015 106221 55138 -23195 -37183 -6122
3541 -6122 -4044 -61218 -82514 -77050 -64882 -42184 -68285 -53997 -79321 -57834 -63660 -94546 -93519
3528 -93519 -47352 39544 72205 73807 70984 36737 -8153 -14235 16051 14895 25642 9313 4997
3515 4997 23504 2765 23216 27306 38501 46796 14568 -2734 -7654 -4002 67400 124606 106568
3502 106568 21724 -67146 -96017 -39398 12140 80905 83605 34678 68846 97219 58558 -57955
3490 -57955 -51985 1206 5714 56256 86805 64868 27808 56577 8453 5420 49288 51279 -40252
3477 -40252 -34734 1808 -30145 -25910 -22597 -61396 -32897 -1702 -18062 -48733 -16320 -41347
3465 -41347 -59675 -28351 -65096 19145 34198 42276 10381 -15791 -25322 -22898 -2270 34507
3453 34507 35759 25875 44686 20179 9192 43929 51306 35572 26195 100151 137885 74927 28255
3440 28255 2835 142 -13578 7205 17080 -47369 -19810 -54390 -84850 -93570 -65400 -87591
3428 -87591 -62201 -81346 -34219 -44481 -98403 -129639 -24328 5477 30728 66659 94293 74817
3416 74817 43849 34054 4524 94814 163417 137780 119634 9908 -5762 16612 53568 56522
3404 56522 95530 120789 56646 -2862 26760 -42787 -116689 -120575 -71064 -630 14473 130038
3392 130038 154011 98624 43619 35211 24951 47259 88469 78605 31861 45929 26253 -41123
3380 -41123 66866 35296 87432 66456 37111 34007 13071 17237 47559 47741 -11681 4867
3368 4867 53301 80217 19435 51134 54571 16313 -6034 -50258 -66396 -86665 -107193 -123991
3356 -123991 -137245 -112421 -90782 -69915 34138 59909 -51984 -86911 -29457 72409 105278
3345 105278 59973 -39376 -111471 -58990 20239 39229 106759 105999 59149 -3457 -4658 41211
3333 41211 72819 43347 109225 186276 144211 62303 56325 84708 141967 118283 94694 31079
3321 31079 -43905 11621 92737 77334 79471 61170 -26834 -75641 -28470 39192 78077 104991
3309 104991 40820 10760 5488 -6093 80291 114579 15188 -40430 11440 68800 -40588 -41793
3297 -41793 76842 130427 96739 77078 111394 134236 86431 89031 137901 183549 175197 145242
3285 145242 169472 91265 -21443 -81823 -23861 45459 251 -85563 -115300 -80559 9012
3274 9012 996 3413 33210 15326 -84182 -91799 -76621 -110717 -96040 33277 39184 22791 58761
3261 58761 84162 18692 -93365 -99055 -14639 -7728 51320 67709 91753 90977 36489 63389
3249 63389 94964 74088 32331 -30703 -39931 26420 28227 25294 117499 119451 52636 -26388 -18131
3236 -18131 -40321 -61322 -33158 -27257 3281 57299 77115 64142 -17553 -55522 -15329 -6182
3224 -6182 -52385 -82309 -100279 -94290 -12069 -20500 1380 7212 -38443 -2864 -4399 11995 -42803
3211 -42803 -59603 -18739 -42152 -92213 -120378 -86852 -22079 -29467 -21588 -3159 10691 -28581
3199 -28581 -24181 -2528 -20062 -55869 -72166 -28712 -82735 -35095 -52782 -64023 -55989 10953
3187 10953 83434 57835 -49194 -18215 31443 27664 991 -44148 -102627 -118447 -70754 -81402
3175 -81402 -78551 -52506 -50588 -12134 65697 88413 75774 20832 13205 -21875 -9192 12427
3163 12427 35367 17004 29741 82388 61604 27497 15702 -6242 -56188 -62593 -36856 5034
3151 5034 105784 119177 55681 -94876 -88744 -68653 27983 28200 15106 -23875 440 66819
3139 66819 97992 77530 70233 31937 5027 72445 107657 167682 184549 159212 121040 147845
3127 147845 172924 103889 46341 -14009 -3829 68798 51852 19307 65611 98815 66157 46597
3115 46597 75766 95404 45150 -17533 -13887 35822 43875 -10695 -22693 -42460 -61579 -73532
3103 -73532 -153729 -127577 -50617 27528 46143 53463 37938 81085 39753 -53473 -52096 886
3091 886 67017 87208 144643 132271 57511 9748 -1644 -40969 -28155 -29098 -35938 20966 59742
3078 59742 58090 3728 73383 42926 -32004 -15713 -23301 -12939 -1924 -38958 3033 -21025
3066 -21025 -17542 -4366 -2904 19847 37528 47872 85281 77018 -22636 -53730 -56302 -5548 -42791
3053 -42791 -97295 -58975 -33870 -88396 -113763 -83966 -50126 54358 53123 -4376 -70152 -83623
3041 -83623 -99005 -84010 -62218 -120858 -135526 -101247 -46644 -5835 -31389 -123300 -159515 -153067
3029 -153067 -127294 -102197 -107216 -135808 -133283 -147820 -99448 -109074 -113215 -96442 -102021 -131173 -110409
3016 -110409 -69438 -26243 82544 70099 -30647 -99060 -93197 -4595 14165 -18242 -53758
3005 -53758 28357 79533 84970 105652 147154 98625 40540 37139 23934 40599 32664 -81246
2993 -81246 -88911 -16496 6513 49942 45836 13278 20318 23856 136164 186152 168966 51788
2981 51788 2195 46430 124681 61823 114462 165343 111474 70623 -4105 -41321 -32104 -18274
2969 -18274 -3796 27420 -2048 46719 69491 99752 136161 111122 41869 -35172 -12945 42161
2957 42161 40483 -15486 -73096 -10067 63418 97102 133754 157283 150997 72523 38334 6387
2945 6387 -20960 -23749 -19688 -37768 -8930 28066 -17285 -33570 13085 72216 47167 36785
2933 36785 60002 18214 -82056 -118464 -86092 -69673 -66776 -21664 -19117 -56517 -124916 -106227
2921 -106227 -44811 23066 42141 -35390 -84809 -40408 21787 13601 58937 97610 107769 115245
2909 115245 89564 43973 25854 12448 31412 133256 129892 63244 -5231 -31785 17511 61231
2897 61231 45245 -684 15532 59689 66550 -23149 -94991 -83269 -9039 72950 2963 -115096
2885 -115096 -121032 -43073 -13680 -18320 6971 18004 49643 92005 92903 145215 116864 79571
2873 79571 69830 -25176 -21544 21480 81024 23845 15566 30651 31089 -40389 -9433 2615 -43234
2860 -43234 -12593 43886 84910 41160 -41841 -29046 42256 42267 43170 8006 73930 92943 69285
2847 69285 51299 30123 58222 11580 11136 -3963 -18657 -26182 25198 70295 117091 126400 71739
2834 71739 47446 22127 -11562 45507 92182 81422 113139 144183 150499 159396 111093 104593
2822 104593 59336 37777 3010 -86666 -140720 -86517 -29114 2941 -5641 -14845 10673 107723
2810 107723 130528 78619 42876 47835 140189 111227 80349 103632 -3109 -43786 -76597 -42035
2798 -42035 -35779 -71560 -28712 19804 -10953 78709 106052 89161 12457 1767 34652 22972
2786 22972 -4590 46155 138635 163803 106577 79721 65448 62032 61315 27832 -9150 -74194
2774 -74194 -6526 -34666 -44278 -13 -14082 -8399 26093 57777 44492 56822 23947 7964
2762 7964 -3435 -52023 -75391 -120011 -84269 -49936 2401 6141 24484 70729 47347 33419
2750 33419 42901 32035 6558 -7121 5356 19047 46108 24999 -37496 -77577 -75507 -71491
2738 -71491 -106931 -67437 -29513 -12708 -28477 -52341 -5203 28450 -24324 -31339 -15312 -21026
2726 -21026 -54042 -53383 -1821 47600 55973 33249 56536 86913 53481 -17163 -24502 -32642 -50089
2713 -50089 -74882 -16229 59609 45381 5239 -18667 -38661 -37306 -30825 -31633 27105 49578 78709
2700 78709 45218 83513 76025 78235 92382 54015 9832 -18166 -59233 -48393 -38944 19671
2688 19671 21220 67483 112204 92503 62080 60990 29784 -33420 -54845 -94806 -93410 -93101 -81917
2675 -81917 -101469 -104791 -70812 -24166 -29058 16687 79195 26317 -64049 -69174 -79157 -16760 14553
2662 14553 9243 10165 42123 114301 135578 123083 65501 14865 25169 -13744 -19099 9033 -10484
2649 -10484 21283 7249 -79533 -103488 -103757 -34857 -4797 -24147 -59709 -38366 -58 23335
2637 23335 -7269 -8597 -12651 -84528 -104138 -22548 65844 31153 15894 -43892 -32136 17499
2625 17499 -6969 -31736 -4506 -9843 950 -39929 -70370 -86622 -84469 -18406 33084 26205
2613 26205 37783 69918 68687 101012 59719 -7588 -22562 7956 35771 79573 66063 38385
2601 38385 31276 50919 79823 76785 98002 138519 94988 55347 68339 98218 97303 114076 65240
2588 65240 -23794 13919 54457 100756 83600 64646 32015 61974 77706 126257 160037 148843
2576 148843 99722 -39607 -98213 -25582 31209 49605 64191 78470 14855 -5255 -6908 -5357
2564 -5357 -17477 -39943 -4311 14578 949 -3647 2537 -3490 -28021 -26244 55605 102108 61637
2551 61637 17742 39334 33827 -69547 -146639 -63153 23233 31970 24508 35844 78640 58834
2539 58834 18810 26337 89917 82848 27955 -29369 -40651 -67079 -17193 -24663 24888 119003
2527 119003 188715 165236 98022 28956 -455 -11779 -49020 -84123 -60830 17173 73073 -42552
2515 -42552 -105417 -47677 20588 -19593 -38412 12316 -20690 2337 -8846 -7837 -462 25780
2503 25780 42747 79166 33857 13697 36315 116603 180172 113670 41535 -15830 17059 51655
2491 51655 37217 63877 46247 61670 27287 54157 32441 16658 25122 1802 8131 137
2479 137 56316 46372 40580 26410 92287 160326 110761 82691 49107 5305 -54414 -88235 -124418
2466 -124418 -186814 -214519 -167239 -90463 -80595 -45225 -31953 32362 50172 41822 55738 -205
2454 -205 -17510 -12121 -110890 -146709 -135282 -75532 -3247 52414 38114 4029 -18922 -50570
2442 -50570 -13479 -31880 55982 103817 76532 41721 23832 50449 95552 87002 23899 19399
2430 19399 127910 185014 123262 69877 51427 96841 27084 -94220 -157019 -116837 -43514
2419 -43514 -52794 -50329 9528 -15069 22350 -18398 2677 -33113 -61443 -32375 -43649 -3252
2407 -3252 48849 -76641 -77754 -4216 26795 22980 22987 18210 25746 44768 46989 2441 -91448 -153356
2393 -153356 -84643 -21526 -59771 -21560 34836 67590 -6875 -18574 46791 80235 61918 66937
2381 66937 59514 24397 -92462 -157309 -172964 -132598 -73693 -48489 -27950 67418 35721 -1895
2369 -1895 16878 9541 43343 17657 11275 73937 59429 15138 20193 -16279 -122106 -142433
2357 -142433 -43740 15145 46420 24225 4957 39939 73938 42694 104295 133456 72162 55302
2345 55302 112619 154407 125514 90858 10030 -90050 -88962 -79487 -70539 -90269 -48070 -25420
2333 -25420 -27243 15577 20041 -64921 -77274 -49680 17948 -19313 -8136 6817 -19206 12959
2321 12959 20112 33107 46432 70534 113352 54282 -47152 28430 99258 59599 14887 -11395
2309 -11395 -40683 -37094 -57207 -57591 -31271 -12315 -78337 -85665 -26592 -22326 -93418 -53697 20701
2296 20701 19418 73705 69211 78762 111396 85809 64325 77799 61976 -33345 -57383 -39498
2284 -39498 84373 135616 105556 85495 45270 -8546 935 -6521 -68550 -119049 -200164 -192653
2272 -192653 -167212 -107968 -134741 -59014 -1325 35821 36235 -53218 -40496 -52218 -35729 -48601
2260 -48601 -25643 19047 -2392 -17464 15502 10449 -11288 6193 22118 44127 86059 79472
2248 79472 31966 45968 45803 43527 73069 26116 -6145 -58248 -57580 -26475 -2678 -17248 -92564
2235 -92564 -66753 -55149 -23723 -66009 -67774 -62177 -41159 -19158 54924 5077 -46221 -44068
2223 -44068 -20945 15424 10658 -15535 -17254 38028 73069 68820 -6094 -7790 -20461 -27426 -19869
2210 -19869 7864 -27 -31585 -5359 40757 77157 96953 75772 83791 97722 30755 1566
2198 1566 23716 79089 76315 57610 -16796 695 8809 7447 11473 -20160 -68932 -90874 -92329
2185 -92329 -65117 -28067 1520 2235 16454 29499 -36316 -35019 -22940 -61128 -66818 -25866 -21971
2172 -21971 -54785 -15583 -13184 -39492 -54418 -205 8139 -13979 -45961 -113646 -70820 -22831
2160 -22831 -19230 1358 2122 -25033 -74273 -83237 -30487 2900 26359 -44214 -61812 -62386 -36965
2147 -36965 -9442 31845 58326 39811 50215 15459 21624 64265 10863 15528 36085 9416
2135 9416 -42924 -90291 -58948 -48226 -23991 27316 41649 1025 -3379 47204 58318 7896
2123 7896 -2740 -13870 55099 99286 78224 65074 71696 82637 86362 60620 21868 14717 15079
2110 15079 43894 59573 103323 126295 103478 57066 111851 144812 98750 59192 58174 2614
2098 2614 -82799 -89385 -121545 -152907 -123971 -10990 7932 33095 53257 -7112 -14745 -5193
2086 -5193 -43900 -44363 -132070 -139403 -43858 1070 -5001 16274 20420 53056 119487 69520 -2586
2073 -2586 -21694 -42409 -71673 -73175 -23810 24117 -9422 -57237 -47334 -103774 -64752 -52295
2061 -52295 -25146 -23190 -32834 79584 84358 36130 17145 -44125 -52081 8203 31089 19377
2049 19377 17935 -49201 -61558 36089 20539 -66218 -103803 -70637 5604 -21685 -16252 -51858
2037 -51858 -66725 -89525 -105325 -105651 -80590 -62905 -114995 -119072 -187412 -178379 -200857 -163693 -63986
2024 -63986 8884 -17514 -69137 -14200 -39655 -71387 -18809 27733 -26900 -53999 -71441 -69844
2012 -69844 -49215 16938 -14312 -68122 -128920 -110530 -70090 -84385 -42713 -40455 -77959 -63890
2000 -63890 -64149 -35549 26857 71902 75525 117101 106935 119873 91659 50855 28714 48887
1988 48887 -4703 7960 31442 24175 -26863 -21333 -32584 6025 1657 -46126 -12842 45904
1976 45904 52826 -11480 -47344 -33562 -24742 -83249 -69667 -76269 -43653 94471 135975 80203
1964 80203 41155 30176 53183 90847 94208 34194 104842 88835 -104 -31542 40283 10920
1952 10920 -6173 -19555 1394 17126 1999 -82373 -70155 -57702 -41477 37222 12212 -64606
1940 -64606 -49779 -13720 -27440 -64626 -91753 -55567 19580 13125 24598 63410 73330 18110
1928 18110 57038 78561 61346 49295 61831 -15936 -65485 -56125 -50446 -43879 -54113 -121515
1916 -121515 -85983 -55783 -44725 -54318 -57531 -3262 68745 19979 -34809 17660 70093 24524
1904 24524 17287 -2268 -51338 -19305 34461 119382 90671 63280 37775 -37978 -51005 -32295
1892 -32295 -85228 -88199 -53140 -4923 -35128 -7288 -20240 6632 31537 8724 -18788 -35221
1880 -35221 -30389 9206 7996 41161 70935 27925 -28316 -92628 -115034 -37011 53712 128114
1868 128114 81906 10056 -28202 26433 30944 6685 4285 -3145 88274 143310 122083 130599
1856 130599 141058 68379 -11838 -26815 31498 33156 51378 87238 34475 -13979 -48193 -106702
1844 -106702 -70658 -13810 3384 -15209 -30324 -1141 7481 48687 80933 29569 26246 31149
1832 31149 -14976 -29471 -9375 -19651 -91655 -51272 10898 13454 -27885 -26019 62843 58242
1820 58242 51230 54818 3091 -30541 20608 37268 -24563 -51345 -22199 34404 64221 -29528
1808 -29528 -63180 -38228 -16285 -17755 -44843 -67389 -42280 35645 92723 38321 -36465 -94000
1796 -94000 -73185 39833 69531 125692 100393 3822 -8545 -26759 -32794 -51176 -58489 -36219
1784 -36219 -28423 15564 20871 25324 61247 54401 26321 3808 52947 122755 157909 166138 94036
1771 94036 -3714 -48854 -83629 -159505 -159434 -131657 -121561 -44821 -20325 -37669 -43293 8579 117471
1758 117471 36625 -45950 -58323 -34880 -31203 43337 12581 -63454 -50879 -43425 -21273 1954
1746 1954 41515 30328 35167 23654 18450 -6029 -53704 -35952 38568 124219 74182 68782 53218
1733 53218 19704 59665 104231 49018 3210 -29673 -34957 1562 29303 13768 -5943 -65667
1721 -65667 -77550 -109255 -95774 -79358 -15816 -8972 -74663 -104752 -33708 -25355 -32939 -41420 75838
1708 75838 117210 65547 -15188 -127062 -128067 -58647 -72570 -90370 4758 18409 -19578 -43618
1696 -43618 -44502 -42987 26702 45187 40108 24933 51428 11540 30800 24345 -877 1793 -53448
1683 -53448 -95044 -57339 -42242 -61278 -69527 -59815 11244 27821 -47213 -37712 20962 -14696
1671 -14696 -61792 -101838 -146204 -111028 -46561 -33284 -7189 -8366 -721 30770 43687 -49198
1659 -49198 -36549 -35483 -40602 2398 90786 130272 102558 52178 -1647 -5695 -18637 10675
1647 10675 -8845 61206 84711 105995 101151 72398 8293 -79564 -6152 37669 36148 -53212
1635 -53212 -130196 -152770 -97971 -68241 -50998 -54450 11106 91489 96131 39154 -23786 -39249
1623 -39249 -22487 -11980 -9669 2436 -16400 -15587 23619 5790 -42403 -79692 -59768 22035
1611 22035 21264 -15189 -45212 -62124 -30084 -20173 18500 3665 39323 -9120 -35586 27196
1599 27196 -16680 28767 34879 50854 -11334 -7551 -16842 -40075 -49270 -50886 -68051 -120626 -78004
1586 -78004 -81338 10069 6358 -47187 39861 34042 22071 22918 46020 64265 109428 83258 55575
1573 55575 5710 -26569 -58252 -50784 -20077 -49051 -72353 -32111 -3547 30501 21452 71050
1561 71050 93201 90899 50466 70127 104902 115165 132802 63490 3870 -49716 -126787 -130588
1549 -130588 -116143 -44961 5184 4921 21250 -25412 -2644 25216 8671 984 14789 33420
1537 33420 28398 -71638 -120691 -154526 -103690 -27995 56771 62728 38597 5174 8782 25232
1525 25232 59459 134881 100317 26394 -40353 -92088 -85283 -87437 -43168 -47176 -86059 -128593
1513 -128593 -99254 -156319 -137876 -19949 -10532 -129537 -139204 -116803 -87820 -98941 -102151 18362
1501 18362 116971 150407 120672 28967 8172 79955 87863 111808 82752 55547 76511 44683
1489 44683 10016 36691 20623 93889 77361 39373 17248 41483 50728 63575 70935 71424 93166
1476 93166 132097 88322 66966 287 15053 25670 4627 -4022 -44367 -28627 -14662 -22825
1464 -22825 97283 91564 45764 12315 -10355 10080 113417 120484 17854 -28131 -71405 -39480
1452 -39480 -72555 -49459 14035 13791 -30819 -54571 -21372 10938 46587 22456 39912 78545
1440 78545 44175 -5127 -37847 -20153 3044 45646 61467 43127 43327 59789 34450 10556
1428 10556 6887 48172 79476 39109 1659 -14047 -40485 -66479 9063 110617 81057 -30164
1416 -30164 -65744 8634 59758 75712 -18143 -68499 -35823 645 52951 58752 24601 27009
1404 27009 119008 115668 115404 73930 66855 44073 5003 -9986 24375 66927 44949 36186 56915
1391 56915 109055 116982 118074 107439 10955 -28648 -38703 32592 108326 108761 94968 63114 70288
1378 70288 106382 73533 57089 28260 1353 4777 72533 130939 42530 57765 94681 110156
1366 110156 168704 172363 64408 -17940 -88085 -114947 -190725 -217665 -177126 -101331 -50302 -40720
1354 -40720 -9389 -4012 -21745 -27479 -22227 -30754 -31603 1748 27690 83737 51954 -14622 12390
1341 12390 130951 90260 22504 -53458 -100353 -67117 -76741 -142133 -99755 -12335 -31 15089
1329 15089 44331 122674 145435 98610 94810 78122 41276 64958 66549 79184 21959 -21387
1317 -21387 28251 6435 -19314 38267 4086 -38656 -2639 42574 38047 35503 60257 15688
1305 15688 -59540 29857 115697 109904 118856 91173 32064 54234 48295 49824 18784 58992 106582
1292 106582 47371 48566 4676 1429 32322 -20677 21556 45456 35463 -31028 -22847 -40435
1280 -40435 -68630 -36072 -45435 -43144 -32178 -59958 -72989 -100228 -58226 61737 70610 39024
1268 39024 -248 -39327 -42279 -11420 -35423 -48817 6834 37066 25706 33757 28569 38060 16420
1255 16420 -72376 -27819 12336 69776 60865 72017 61002 64126 39196 16997 -14771 -48038
1243 -48038 -49897 -29495 -49377 -113590 -110399 -96689 -54082 9699 52792 22946 51402 46623
1231 46623 2112 -586 -49462 -60603 -39198 18948 -2143 -44547 -92855 -89625 -58223 -8958
1219 -8958 69318 53529 22281 33444 29028 19775 37269 -31701 -45799 -59191 -23809 -2860
1207 -2860 -50510 -92510 -37437 4269 -740 15207 49047 111429 90661 18434 -17417 4002
1195 4002 -13852 10506 6156 -8761 -20667 -62535 -36332 -67029 -74924 -45824 534 52635
1183 52635 90983 48785 1917 -18840 41498 50603 -1556 22375 12344 57368 72866 23299
1171 23299 -17767 -5683 47963 -37409 -30977 -14870 -11519 14732 52937 53692 66713 34277 10309
1158 10309 15177 46972 6013 -12949 -24919 7500 97537 85399 -2320 22594 46184 31837
1146 31837 -34724 -74078 -72384 -81985 -59698 4076 79371 35527 76137 73411 39753 36865 38844
1133 38844 56288 37978 5251 30817 7988 55200 119555 91503 62236 119268 94123 16001
1121 16001 42209 26369 39091 12425 81995 116221 36177 23253 35168 55448 33094 -5391
1109 -5391 -48368 -52696 -46660 -24904 -2016 -17289 -66326 -48293 -44513 -75972 -44771 15606 -24230
1096 -24230 -82340 -75256 -14501 79324 99974 97170 65915 47690 38571 75968 62947 75189
1084 75189 72982 -28680 -70309 -79357 -30095 -53748 -75878 -13975 46773 57633 46164 76873
1072 76873 29491 5135 10592 23743 -4324 -68985 -95129 -53178 14914 10966 -21420 10246
1060 10246 57010 64728 60800 18707 57252 74498 98263 104008 72667 116593 75185 69855 56541
1047 56541 68345 59596 8199 -28306 -67156 -33753 34107 59713 97685 90992 33088 42942
1035 42942 47878 -26629 -73984 -91618 -40954 29563 -18346 -72364 -82655 -57725 -30077 -31953
1023 -31953 25299 30957 -7162 -7053 -19506 -72218 -45152 -30278 -18473 -9899 15537 125043
1011 125043 145559 94945 54724 9311 -62886 -46142 22441 -12954 -75338 -15524 39183 -13609
999 -13609 -52866 -32862 11107 6868 3396 50522 19136 -1754 -40446 -10193 -33000 -61391
987 -61391 -44282 -11342 25392 24651 5859 -107835 -78434 -17984 -1502 -55879 -122189 -115911
975 -115911 3188 11336 33436 -22703 -46478 -93999 -27576 1080 53231 101259 94540 22157
963 22157 46029 46305 23354 21432 -32086 -44653 41575 22699 -54827 -32481 -3079 16871 57264
950 57264 3700 -16140 2886 11 14109 -17456 -54799 -74647 -115050 -183495 -151644 15433
938 15433 116128 120031 107917 42931 38006 52127 63751 50938 19222 23335 12514 41892
926 41892 -6782 18166 46317 95658 126709 116352 33144 59817 116233 46073 5686 16715
914 16715 19951 73393 84446 16702 -25250 -11014 31475 41637 -4842 -34781 -4574 18609
902 18609 52098 15691 9116 29902 77245 138307 103180 75484 76217 71359 25179 16209 -3682
889 -3682 -23948 19381 48933 37983 -405 -32050 -59072 -44289 71967 186903 189413 144894
877 144894 108894 101114 130217 139628 80472 108991 64246 -17100 -85843 -153383 -170954 -196408
865 -196408 -160250 -36889 -35111 2514 22747 10414 -11128 22404 -8798 -43356 -73108 -7223
853 -7223 28943 70341 52401 21975 71214 92579 109162 141344 110353 36031 93957 93031 44754
840 44754 71030 75240 37460 65564 124132 112961 94631 69428 22634 14613 -32320 -41941 -37400
827 -37400 -44925 9546 9648 -7876 -30767 -99531 -109803 -1732 82041 130774 71716 37970
815 37970 -23082 22623 53319 33047 69326 123823 29155 5146 -11449 -32125 -14143 27198
803 27198 139783 129738 68232 70370 70043 -110 -13764 5592 2997 63002 91783 24825 -51201
790 -51201 -72047 -45916 -45139 -33715 52372 37158 67498 82851 105091 87790 56590 54489 100237
777 100237 5453 -32037 29059 78148 4852 61146 74700 148761 201320 191488 181877 173510
765 173510 31279 7950 67137 83279 36059 32425 119429 120172 64713 59544 33471 67149
753 67149 75670 80612 66006 79333 109549 117970 41520 59604 39480 53365 123574 133172 110978
740 110978 119379 66237 56899 22708 -3326 -15449 -71407 -121715 -72781 -2091 27587 86889
728 86889 23433 -52059 -61221 36922 108402 62218 -32946 5987 71512 108120 46066 40271
716 40271 13493 6612 61826 -12560 -23629 -12948 -32767 -37686 36850 86324 81674 97981 100431
703 100431 90059 94443 82692 98880 137790 137268 116409 141665 187665 129571 80459 63093
691 63093 37356 -13612 -27846 -26042 28184 31637 34912 -16277 -86708 -98995 -54086 28562 -9696
678 -9696 -13865 22635 -32281 -40850 34918 40389 20836 68809 45691 12925 -7587 35345 36606
665 36606 -8127 16685 82276 73801 50665 59812 51091 6264 17899 23171 7911 -7541 34568
652 34568 20634 17378 22050 -1171 59246 140135 121823 125146 140491 102683 57125 74406 54615
639 54615 49045 43817 29267 20442 -1125 -15219 -7012 -29748 22259 36255 4355 35578 -2262
626 -2262 17653 42280 58044 77606 20913 -84743 -82984 -1454 -8920 -34127 9587 -1307
614 -1307 10226 39561 97537 86977 40930 65599 65683 -27147 8316 -23642 -35987 36591 57341
601 57341 63620 55526 46294 77334 55106 51419 2123 -51546 -87538 -796 52425 45293 43768
588 43768 41957 -21124 -11097 -31755 -20550 25769 54595 91563 111970 115262 81845 103937
576 103937 179063 181417 90909 6880 -25144 33898 120026 32358 50131 100609 122774 118658
564 118658 76766 27954 31005 39474 81385 92974 121681 114089 168449 151020 128682 116552
552 116552 28650 -12119 42940 40757 28364 12951 80629 119390 161146 181698 96395 56239
540 56239 103467 178323 173503 173126 128512 83394 39680 11211 -22547 -15057 20677 79513 52773
527 52773 99807 144256 203605 157988 137222 144600 124731 105465 104977 117229 92277 61674 54386
514 54386 6064 -45157 -3700 49764 12090 1709 30678 100096 140071 139028 124440 94472
502 94472 53849 74188 29242 21602 -16576 -39879 -85901 -69738 -32734 -202 -8755 27321
490 27321 76786 101209 66875 41491 -47322 -72308 -28329 17205 84417 115982 130842 101007
478 101007 37878 28111 25173 49584 45057 -7841 -38003 50075 83386 41248 -438 -68203
466 -68203 -13042 105421 139383 94220 76760 63787 51082 44383 62504 87356 80581 73754
454 73754 40877 23694 70011 76332 84051 95057 88367 117344 98476 56452 14884 35958 3274
441 3274 -10085 -18799 46873 184027 185326 135351 133368 160472 89507 64534 66734 62506 103050
428 103050 103255 69106 7353 -17318 -32374 3594 18299 29367 -7188 -26832 -40264 -4903
416 -4903 6045 -8544 72032 110726 144684 80812 -7915 -22797 6344 67515 53708 70987
404 70987 120989 92040 47346 58816 75007 50468 4045 18891 74878 61162 50989 45920
392 45920 24353 63726 83194 37019 16329 -24822 -53912 -24128 20204 55953 85036 52371
380 52371 8702 3366 93903 94542 92518 74786 22465 -13087 -25427 37838 37461 -1853 9969
367 9969 -31775 -18145 28151 39650 53223 120728 101976 -884 -61247 -927 53364 46101
355 46101 69872 83587 122024 149303 159292 130260 112978 93487 35124 60544 88814 70472
343 70472 15364 53434 93984 140066 216456 217214 161933 121320 126234 162976 203136 171011 81520
330 81520 38476 -8477 -75168 -51239 -30025 22218 116063 54928 49492 42485 5477 44865
318 44865 90941 90031 140918 116698 66651 28388 24632 46736 -2720 -7624 -43688 4166 55455
$$ [...]
##END NTUPLES=NMR SPECTRUM
##END=
