##TITLE=Analysis number 328370
Compound Code km 00411
Project Code adrs
Chemist Name fudan
##JCAMPDX= 6.0         $$ Bruker NMR JCAMP-DX V2.0
##DATA TYPE= NMR SPECTRUM
##DATA CLASS= NTUPLES
##ORIGIN= Bruker BioSpin GmbH
##OWNER= nmr
$$ XWIN-NMR		Version 3.5
$$ Wed May 30 12:39:45 2007 GMT Daylight Time (UT+1h)  MAYBRIDGE\nmr@NMR_250MHZ
##.OBSERVE FREQUENCY= 250.131544655141
##.OBSERVE NUCLEUS= ^1H
##.ACQUISITION MODE= SIMULTANEOUS (DQD)
##.ACQUISITION SCHEME= undefined
##.AVERAGES= 16
##.DIGITISER RES= 18
##SPECTROMETER/DATA SYSTEM= dpx250
##.PULSE SEQUENCE= zg30
##.SOLVENT NAME= CDCl3
##.SHIFT REFERENCE= (INTERNAL, CDCl3, 0, 16.522)
##AUDIT TRAIL= $$ (NUMBER, WHEN, WHO, WHERE, WHAT)
$$ ##TITLE= Audit trail, XWIN-NMR		Version 3.5
$$ ##JCAMPDX= 5.01
$$ ##ORIGIN= Bruker BioSpin GmbH
$$ ##OWNER= nmr
$$ C:\u/data/dgb/nmr/ADRS/1690/pdata/1/auditp.txt
$$ ##AUDIT TRAIL=  $$ (NUMBER, WHEN, WHO, WHERE, WHAT)
(   1,<2007-05-30 12:39:06.96 +100>,<MAYBRIDGE\nmr>,<NMR_250MHZ>,
      <created by zg, POWCHK disabled, PULCHK disabled
       configuration hash MD5:
       76 6E 9A 78 1E 09 19 81 EC 84 63 8F B0 6A 59 2D
       data hash MD5: 64K
       06 C8 C3 E7 D6 C0 75 03 47 86 EC F2 8F CA 25 64>)
(   2,<2007-05-30 12:39:25.09 +100>,<MAYBRIDGE\nmr>,<NMR_250MHZ>,
      <Start of raw data processing
       ef LB = 0.3 FT_mod = 6 PKNL = 1 SI = 32K 
       data hash MD5: 32K
       94 66 F0 34 00 18 52 6B 41 5E CB 87 D3 90 DD A2>)
(   3,<2007-05-30 12:39:30.10 +100>,<MAYBRIDGE\nmr>,<NMR_250MHZ>,
      <apk 
       data hash MD5: 32K
       4E 80 27 7F FE A8 22 48 D6 43 DE 8B 98 2C 57 19>)
(   4,<2007-05-30 12:39:31.71 +100>,<MAYBRIDGE\nmr>,<NMR_250MHZ>,
      <abs ABSG = 5 
       data hash MD5: 32K
       E4 4D CD 27 2B 40 CE 3F B1 D9 31 D5 95 2F 2A 3C>)
$$ ##END=
$$ 
$$ hash MD5
$$ B7 D8 8E 8D 97 ED DD E5 B9 06 0D F3 AD 4E 80 53
##$RELAX= 
##$RELAX= 
##$RELAX= 
##$RELAX= 
##$RELAX= 
##$RELAX= 
##$RELAX= 
$$ Bruker specific parameters
$$ --------------------------
##$DU= <C:\u>
##$EXPNO= 1690
##$NAME= <ADRS>
##$PROCNO= 1
##$TYPE= <nmr>
##$USER= <dgb>
##$AMP= (0..31)
100 100 100 100 100 100 100 100 100 100 100 100 100 100 100 100 100 100 
100 100 100 100 100 100 100 100 100 100 100 100 100 100 
##$AQSEQ= 0
##$AQ_mod= 3
##$AUNM= <au_zg>
##$AUTOPOS= <14 >
##$BF1= 250.13
##$BF2= 250.13
##$BF3= 250.13
##$BF4= 250.13
##$BF5= 500.13
##$BF6= 500.13
##$BF7= 500.13
##$BF8= 500.13
##$BYTORDA= 1
##$CFDGTYP= 0
##$CFRGTYP= 5
##$CHEMSTR= <none>
##$CNST= (0..31)
1 1 145 1 1 1 1 1 1 1 1 1 1 1 1 1 1 1 1 1 1 1 1 1 1 1 1 1 1 1 1 1 
##$CPDPRG= <>
##$CPDPRG1= <>
##$CPDPRG2= <>
##$CPDPRG3= <>
##$CPDPRG4= <mlev>
##$CPDPRG5= <mlev>
##$CPDPRG6= <mlev>
##$CPDPRG7= <mlev>
##$CPDPRG8= <mlev>
##$CPDPRGB= <>
##$CPDPRGT= <>
##$D= (0..31)
0 1 0 0 0 0 0 0 0 0.06 0 0 0 0 0 0 0.0002 0 0 0 0 0 0 0 0 0 0 0 0 0 0 
0 
##$DATE= 1180525145
##$DBL= (0..7)
120 120 120 120 120 120 120 120 
##$DBP= (0..7)
150 150 150 150 150 150 150 150 
##$DBP07= 0
##$DBPNAM0= <>
##$DBPNAM1= <>
##$DBPNAM2= <>
$$ [...]
##$SUBNAM7= <"">
##$SUBNAM8= <"">
##$SUBNAM9= <"">
##$SW= 20.6930455092707
##$SWIBOX= (0..15)
0 0 3 0 0 0 0 0 0 0 0 0 0 0 0 0 
##$SW_h= 5175.983436853
##$TD= 65536
##$TD0= 1
##$TE= 683.16
##$TE2= 300
##$TE3= 300
##$TEG= 300
##$TL= (0..7)
0 120 120 120 120 120 120 120 
##$TP= (0..7)
150 150 150 150 150 150 150 150 
##$TP07= 0
##$TPNAME0= <>
##$TPNAME1= <>
##$TPNAME2= <>
##$TPNAME3= <>
##$TPNAME4= <>
##$TPNAME5= <>
##$TPNAME6= <>
##$TPNAME7= <>
##$TPOAL= (0..7)
0.5 0.5 0.5 0.5 0.5 0.5 0.5 0.5 
##$TPOFFS= (0..7)
0 0 0 0 0 0 0 0 
##$TUNHIN= 0
##$TUNHOUT= 0
##$TUNXOUT= 0
##$USERA1= <user>
##$USERA2= <user>
##$USERA3= <user>
##$USERA4= <user>
##$USERA5= <user>
##$V9= 5
##$VALIST= <valist>
##$VCLIST= <CCCCCCCCCCCCCCC>
##$VD= 0
##$VDLIST= <DDDDDDDDDDDDDDD>
##$VPLIST= <PPPPPPPPPPPPPPP>
##$VTLIST= <TTTTTTTTTTTTTTT>
##$WBST= 1024
##$WBSW= 4
##$XGAIN= (0..3)
0 0 0 0 
##$XL= 0
##$YL= 0
##$YMAX_a= 337531
##$YMIN_a= -215451
##$ZGOPTNS= <>
##$ZL1= 120
##$ZL2= 120
##$ZL3= 120
##$ZL4= 120
##$ABSF1= 16.522
##$ABSF2= -4.171173
##$ABSG= 5
##$ABSL= 3
##$ALPHA= 0
##$AQORDER= 0
##$ASSFAC= 0
##$ASSFACI= 0
##$ASSFACX= 0
##$ASSWID= 0
##$AUNMP= <proc_1d>
##$AZFE= 0.1
##$AZFW= 0.1
##$BCFW= 0
##$BC_mod= 0
##$BYTORDP= 0
##$COROFFS= 0
##$CY= 12.5
##$DATMOD= 1
##$DC= 0
##$DFILT= <>
##$DTYPP= 0
##$F1P= 14.0000005364418
##$F2P= -0.99999901652339
##$FCOR= 0.5
##$FTSIZE= 32768
##$FT_mod= 6
##$GAMMA= 0
##$GB= 0
##$INTBC= 1
##$INTSCL= 1
##$ISEN= 128
##$LB= 0.3
##$LEV0= 0
##$LPBIN= 0
##$MAXI= 10000
##$MC2= 0
##$MEAN= 0
##$ME_mod= 0
##$MI= 0
##$NCOEF= 0
##$NC_proc= -6
##$NLEV= 6
##$NOISF1= 0
##$NOISF2= 0
##$NSP= 0
##$NTH_PI= 0
##$NZP= 0
##$OFFSET= 16.522
##$PC= 1
##$PHC0= -44.53353
##$PHC1= -1.656362
##$PH_mod= 1
##$PKNL= yes
##$PPARMOD= 0
##$PSCAL= 4
##$PSIGN= 0
##$REVERSE= no
##$SF= 250.13
##$SI= 32768
##$SIGF1= 0
##$SIGF2= 0
##$SINO= 400
##$SIOLD= 32768
##$SREGLST= <1H.CDCl3>
##$SSB= 0
##$STSI= 32768
##$STSR= 0
##$SW_p= 5175.98343685301
##$SYMM= 0
##$S_DEV= 0
##$TDeff= 65536
##$TDoff= 0
##$TI= <Analysis number 999999
Compound Code 99
Book Reference 9
Project Code 9>
##$TILT= no
##$TM1= 0
##$TM2= 0
##$TOPLEV= 0
##$USERP1= <user>
##$USERP2= <user>
##$USERP3= <user>
##$USERP4= <user>
##$USERP5= <user>
##$WDW= 1
##$XDIM= 32768
##$YMAX_p= 554170725
##$YMIN_p= -1555340
$$ End of Bruker specific parameters
$$ ---------------------------------
##NTUPLES= NMR SPECTRUM
##VAR_NAME=  FREQUENCY,     SPECTRUM/REAL,   SPECTRUM/IMAG
##SYMBOL=    X,             R,               I
##VAR_TYPE=  INDEPENDENT,   DEPENDENT,       DEPENDENT
##VAR_FORM=  AFFN,          ASDF,            ASDF
##VAR_DIM=   32768,         32768,           32768
##UNITS=     HZ,            ARBITRARY UNITS, ARBITRARY UNITS
##FACTOR=    0.157963299565203, 1,           1
##FIRST=     4132.6476996994, 0,             0
##LAST=      -1043.33573715361, 0,           0
##MIN=       -1043.33573715361, -1555340,    0
##MAX=       4132.6476996994, 554170725,     0
$$ Real data points
##PAGE= N=1
##DATA TABLE= (X++(R..R)), XYDATA
$$ [...]
$$ plain form
23238 6570099 6575185 6565404 6583819 6736230 6709858 6543573 6813113 6899431 7025897 7047734 6657374
23227 6657374 6639647 6542995 6729982 7174356 7240079 7089309 6768069 6663081 6643362 6299187
23217 6299187 6451954 6395374 6576051 6772257 6778458 6722393 6988742 7000207 6821185 6675465
23207 6675465 6705943 6787486 6780092 7018482 7424362 7541607 7229424 6986680 6821462 6905432
23197 6905432 6505328 6697701 6633223 6703579 6810456 6700953 7041887 7411760 7233007 7066783
23187 7066783 6937288 7031505 6947614 6726419 6883005 6880985 6747575 6867175 6870560 6687925
23177 6687925 6605873 6485370 6503674 6849391 6991616 7098355 7247853 7193083 7181232 7267808
23167 7267808 7204884 6960923 7094328 7540369 7831264 7767950 7738712 7564814 7506960 7440623
$$ packed form
23238F570099N086r781J8415J52411k6372j66285K69540Q6318J26466K1837l90360
23227F657374j7727r6652J86987M44374O5723j50770l21240j04988j9719l44175
23217F299187J52767n6580J80677J96206O201n6065K66349J1465j79022j45720
23207F675465L0478Q1543p394K38390M05880J17245l12183k42744j65218Q3970
23197F905432m00104J92373o4478P0356J06877j09503L40934L69873j78753j66224
23187G066783j29495R4217q3891k21195J56586k020j33410J19600L385j82635
23177F687925q2052j20503J8304L45717J42225J06739J49498n4770j1851Q6576
23167G267808o2924k43961J33405M46041K90895o3314k9238j73898n7854o6337
$$ plain form
23157 7440623 7264276 7161617 7192713 7253124 7223656 6610643 6502768 6972670 7005976 6845420
23147 6845420 7173057 7339007 7340270 7694972 7437690 6943529 7163603 7356775 7116382 7322052
23137 7322052 7637274 7738857 7703292 7601440 7839605 7765158 7711903 7674295 7788175 7994259
23127 7994259 7897764 7734895 8040256 8152358 7861266 7594869 7388005 7383628 7576241 7861733
23117 7861733 8280670 7983648 7726558 8102218 8443053 8671985 8709328 8650244 8730995 8819579
23107 8819579 8281364 8285805 8304009 8404299 8474547 8438817 8490415 8602408 8387899 8044740
23097 8044740 8038431 8280645 8453882 8888675 8364750 7880853 7883614 8017294 8194080 8336616
23087 8336616 8231473 8283346 8490885 8472127 8632656 8629909 8359182 8186742 8103963 8116716
$$ packed form
23157G440623j76347j02659L1096O0411k9468o13013j07875M69902L3306j60556
23147F845420L27637J65950J263L54702k57282m94161K20074J93172k40393K05670
23137G322052L15222J01583l5565j01852K38165p4447n3255l7608J13880K06084
23127G994259r6495j62869L05361J12102k91092k66397k06864m377J92613K85492
23117G861733M18937k97022k57090L75660L40835K28932L7343n9084Q0751Q8584
23107H819579n38215M441J8204J00290P0248l5730N1598J11993k14509l43159
23097H044740o309K42214J73237M34793n23925m83897K761J33680J76786J42536
23087H336616j05143N1873K07539j8758J60529k747k70727j72440q2779J2753
$$ plain form
23077 8116716 8306972 8208726 8329361 8232077 8086198 7833513 8184706 8463091 8788895 8597299
23067 8597299 8556986 8549869 8725357 8603234 8613176 8625343 8608080 8764174 8892966 8864214 8942949
23056 8942949 9138310 8999441 9244568 9517528 9455688 9685789 9966728 9710322 9451724 9088356
23046 9088356 9040065 9317865 9258810 8930985 9080127 8726593 8598623 8432181 8058201 8114604
23036 8114604 8477829 8567555 8724887 8879938 9071759 9080422 9118865 9010832 9059156 9311275
23026 9311275 9465649 9640785 9487395 8954111 8980140 9138198 9226237 8990775 9214290 9489158
23016 9489158 9584264 9610467 9460945 9500683 9079345 8880350 9011012 9488981 9795479 9782614
23006 9782614 9887015 10079088 9835626 9858851 10002837 10128795 10173520 10064346 9630839 9628366
$$ packed form
23077H116716J90256r8246J20635r7284j45879k52685L51193K78385L25804j91596
23067H597299m0313p117J75488j22123R942J2167j7263J56094J28792k8752P8735
23056H942949J95361j38869K45127K72960o1840K30101K80939k56406k58598l63368
23046I088356m8291K77800n9055l27825J49142l53534j27970j66442l73980N6403
23036H114604L63225Q9726J57332J55051J91821Q663L8443j08033M8324K52119
23026I311275J54374J75136j53390n33284K6029J58058Q8039k35462K23515K74868
23016I489158R5106K6203j49522L9738m21338j98995J30662M77969L06498j2865
23006I782614J04401J92073k43462K3225J43986J25958M4725j09174m33507k473
$$ plain form
22996 9628366 10055241 9745826 9617630 9544549 9594396 9498464 9809572 9844078 9540326 9277153
22986 9277153 9172032 9414161 9311899 9158726 9534127 9924788 10069865 9758471 9229943
22977 9229943 9081907 9049470 9229719 9309772 9610637 9790797 9983894 10569479 10813171 10320638
22967 10320638 9805060 9466566 9609792 9863351 10154532 10192999 10323230 10038682 9989581 10198023
22957 10198023 9912340 9697636 9642927 9754736 9807207 9713690 9816334 9984251 9988285 9993619
22947 9993619 10149271 10231913 9952223 9657587 9846150 10265010 10517037 10167756 9762001 9613120
22937 9613120 9819602 10023131 9793842 9448083 9510299 9721535 9874132 10077958 10384243 10086911
22927 10086911 10007523 10185154 10503861 10283613 10237011 10117720 10338507 10483865 10291037 10036438
$$ packed form
22996I628366M26875l09415j28196p3081M9847r5932L11108L4506l03752k63173
22986I277153j05121K42129j02262j53173L75401L90661J45077l11394n28528
22977I229943j48036l2437J80249Q0053L00865J80160J93097N85585K43692m92533
22967A0320638n15578l38494J43226K53559K91181L8467J30231k84548m9101K08442
22957A0198023k85683k14704n4709J11809N2471r3517J02644J67917M034N334
22947I993619J55652Q2642k79690k94636J88563M18860K52027l49281m05755j48881
22937I613120K06482K03529k29289l45759O2216K11236J52597K03826L06285k97332
22927A0086911p9388J77631L18707k20248m6602j19291K20787J45358j92828k54599
$$ plain form
22917 10036438 10138053 10556884 10555619 10180996 10106775 10129276 9760660 9517382 9686347 9606527
22907 9606527 9535723 9559055 9865410 9921722 9890397 10004327 10262909 10058477 10147357 10426355
22897 10426355 10209635 9803156 9932473 9846640 9837449 9702011 9392027 9807070 10040768 9960850
22887 9960850 9498249 9422247 9433142 9320498 9206367 9212174 9285987 9462679 9508521 9510425 9623686
22876 9623686 9549745 9377309 9395850 8781668 8696663 9246844 9294519 9318236 9549899 9573573
22866 9573573 9163846 9014514 8806072 8535370 8508003 8471614 8566964 8378584 8177900 8098600
22856 8098600 8208379 8178043 8336902 8375400 8359533 8323209 8160001 8118938 8129044 8261469
22846 8261469 8437723 8320386 8544484 8667554 8330857 8031347 7904244 8192799 8526265
$$ packed form
22917A0036438J01615M18831j265l74623p4221K2501l68616k43278J68965p9820
22907I606527p0804K3332L06355N6312l1325J13930K58582k04432Q8880K78998
22897A0426355k16720m06479J29317q5833r191j35438l09984M15043K33698p9918
22887I960850m62601p6002J0895j12644j14131N807P3813J76692M5842J904J13261
22876I623686p3941j72436J8541o14182q5005N50181M7675K3717K31663K3674
22866I573573m09727j49332k08442k70702k7367l6389R5350j88380k00684p9300
22856H098600J09779l0336J58859L8498j5867l6324j63208m1063J0106J32425
22846H261469J76254j17337K24098J23070l36697k99510j27103K88555L33466
$$ plain form
22837 8526265 8824477 9025743 8676055 8340230 8294534 8416098 8299433 8236023 8310013 7957857
22827 7957857 7485192 7669586 8076227 8027527 8046146 7837916 7723347 7925288 7977300 7759525
22817 7759525 7494471 7707223 7854275 7855414 7938300 8075868 7876902 7829460 7984069 7551035
22807 7551035 7066657 6823960 7043047 7241183 7287032 7274492 7110432 7001991 6949561 6933443
22797 6933443 6746791 6839757 7115152 7206570 7336311 7261999 7094831 6729457 6422080 6469323
22787 6469323 6625667 6834423 6596248 6428468 6580121 6615475 6509079 6335434 6443648 6328684
22777 6328684 6455486 6550644 6640564 6717565 6716724 6423691 6684243 6548388 6437320 6260758
22767 6260758 6292917 6251433 6206960 6036449 5634628 5873716 5902436 5400901 5249959 5237002
$$ packed form
22837H526265K98212K01266l49688l35825m5696J21564j16665o3410P3990l52156
22827G957857m72665J84394M06641m8700J8619k08230j14569K01941N2012k17775
22817G759525k65054K12752J47052J139Q2886J37568j98966m7442J54609m33034
22807G551035m84378k42697K19087J98136M5849j2540j64060j08441n2430j6118
22797F933443j86652R2966K75395R1418J29741p4312j67168l65374l07377M7243
22787F469323J56344K08756k38175j67780J51653L5354j06396j73645J08214j14964
22777F328684J26802R5158Q9920P7001q41k93033K60552j35855j11068j76562
22767F260758L2159m1484m4473j70511m01821K39088K8720n01535j50942j2957
$$ plain form
22757 5237002 5139730 5133859 5324371 5444291 5640551 5323610 5374367 5281640 5399997 5457928
22747 5457928 5321777 5225854 5319195 5433787 5358344 5194603 5172052 5101945 5251848 5459016
22737 5459016 5500967 5448399 5556595 5579307 5702727 5399789 5438933 5505163 5162983 5017528
22727 5017528 4904640 4809939 4806422 4764369 4649225 4464109 4449627 4357158 4465261 4601457
22717 4601457 4772274 4585250 4539637 4600030 4668688 4544985 4963951 4893144 4639921 4603822
22707 4603822 4822538 4952320 4961820 5122587 5009891 4815718 4430459 4357244 4429279 4264453
22697 4264453 4222447 4397969 4291203 4021144 4279021 4371652 4226672 4422027 4339288 4039915
22687 4039915 4043186 4231222 4127401 4254705 4203036 4395154 4386901 4612220 4570831 4321928
$$ packed form
22757E237002r7272n871J90512J19920J96260l16941N0757r2727J18357N7931
22747E457928j36151r5923R3341J14592p5443j63741k2551p0107J49903K07168
22737E459016M1951n2568J08196K2712J23420l02938L9144O6230l42180j45455
22727E017528j12888r4701l517m2053j15144j85116j4482r2469J08103J36196
22717D601457J70817j87024m5613O0393O8658j23703M18966p0807k53223l6099
22707D603822K18716J29782R500J60767j12696j94173l85259p3215P2035j64826
22697D264453m2006J75522j06766k70059K57877R2631j44980J95355q2739k99373
22687D039915L271J88036j03821J27304n1669J92118q253K25319m1389k48903
$$ plain form
22677 4321928 4168755 4124139 4007438 3991034 3766336 3877549 3892758 4019104 4025060 4155589
22667 4155589 4249852 4063165 3918246 4405860 4443500 4286141 4076847 4111863 3898299 3405842
22657 3405842 3545615 3684920 3730710 3760978 3714928 3658705 3564134 3752386 4064704 4251033
22647 4251033 4316263 3860137 3828764 4041456 3831775 3805228 3775287 3608496 3488233 3617005
22637 3617005 3931243 3966270 3550571 3593545 3745162 3659008 3517536 3474740 3364692 3123873
22627 3123873 3126569 3047617 2990943 3273197 3296835 3387778 3474905 3463852 3326742 3724095 3907339
22616 3907339 3788806 3874084 3854713 3549108 3467725 3245448 2936413 2771016 2532140 2432876
22606 2432876 2398128 2228200 2288403 2883345 2982702 3358647 3588892 3503650 3136011 2868109
$$ packed form
22677D321928j53173m4616j16701j6404k24698J11213J5209J26346N956J30529
22667D155589R4263j86687j44919M87614L7640j57359k09294L5016k13564m92457
22657C405842J39773J39305M5790L0268m6050n6223r4571J88252L12318J86329
22647D251033O5230m56126l1373K12692k09681k6547k9941j66791j20263J28772
22637C617005L14238L5027m15699M2974J51617q6154j41472m2796j10048k40819
22627C123873K696p8952n6674K82254K3638R0943Q7127j1053j37110L97353J83244
22616C907339j18533Q5278j9371l05605q1383k22277l09035j65397k38876r9264
22606B432876l4748j69928O0203N94942R9357L75945K30245q5242l67639k67902
$$ plain form
22596 2868109 2948741 2708338 2702815 2971271 3206814 3331857 3210163 3234127 3182040 3029354
22586 3029354 3212008 3542339 3374937 2850876 2576970 2368758 2268304 2535130 2770677
22577 2770677 2679276 2551593 2541299 2717215 2650749 2509409 2331079 2502084 2631964 2727084
22567 2727084 2616097 2318417 2243262 2270941 2453420 2793177 2853220 2959745 3122912 2936629
22557 2936629 2864579 2738053 2542877 2429059 2209393 2030739 1950400 1823453 1660108 1941759
22547 1941759 2393713 2254902 2137957 2155394 2150902 2386264 2556353 2619753 2378003 2281316
22537 2281316 2281667 2004871 2075426 2515877 2114987 2021251 1874462 2005629 2202269 2715252
22527 2715252 2595022 1951292 1682831 1551754 1880664 2124452 1753144 2285278 2517898
$$ packed form
22596B868109Q0632k40403n523K68456K35543J25043j21694K3964n2087j52686
22586C029354J82654L30331j67402n24061k73906k08212j00454K66826K35547
22577B770677r1401j27683j0294J75916o6466j41340j78330J71005J29880R5120
22567B727084j10987k97680p5155K7679J82479L39757O0043J06525J63167j86283
22557B936629p2050j26526j95176j13818k19666j78654q0339j26947j63345K81651
22547A941759M51954j38811j16945J7437m492K35362J70089O3400k41750r6687
22537B281316L51k76796P0555M40451m00890r3736j46789J31167J96640N12983
22527B715252j20230o43730k68461j31077L28910K43788l71308N32134K32620
$$ plain form
22518 2517898 2305025 1951840 1634028 1680682 1702198 1716688 1756246 1657849 1741233 1883884
22508 1883884 2210921 2055715 2143930 1987860 1862354 1840218 1607037 1741152 2056834 2174878
22498 2174878 1833587 1851239 2161096 2282955 2099494 1606622 1693273 1673610 1921213 2421151
22488 2421151 2635863 2237951 1736215 1604243 1630286 1604273 1707001 1896291 1958288 1986443
22478 1986443 1794348 1864429 2048421 1690950 1758566 1899815 1997915 1602281 1512575 1707636
22468 1707636 1745443 1668524 1721805 2151212 2397358 2125575 1993853 1957606 1583460 1549031
22458 1549031 1805846 1946679 1742736 1865755 1938605 2000009 2121857 2008476 1609425 1402659
22448 1402659 1451684 1498669 1499955 1685478 1737710 1713730 1983541 1867175 1440516 1355525 1455867
$$ packed form
22518B517898k12873l53185l17812M6654K1516J4490L9558r8397Q3384J42651
22508A883884L27037j55206Q8215j56070j25506k2136k33181J34115L15682J18044
22498B174878l41291J7652L09857J21859j83461m92872Q6651j9663K47603M99938
22488B421151K14712l97912n01736j31972K6043k6013J02728J89290O1997K8155
22478A986443j92095P0081J83992l57471O7616J41249R8100l95634q9706J95061
22468A707636L7807p6919N3281M29407K46146k71783j31722l6247l74146l4429
22458A549031K56815J40833k03943J23019P2850O1404J21848j13381l99051k06766
22448A402659M9025M6985J286J85523N2232k3980K69811j16366m26659q4991J00342
$$ plain form
22437 1455867 1299170 1407031 1628016 1942775 2133262 2111556 2384259 2257530 1810779 1343987
22427 1343987 1330766 1419191 1718915 1947557 1718127 1810882 2038437 2161002 2057540 1946218
22417 1946218 1819240 1955262 1901049 1583734 1315819 1089636 896539 733614 1030038 1242171
22407 1242171 1331579 1496198 1517102 1678286 1801790 1949399 1505774 850995 794658 1056401
22397 1056401 1566440 1596193 1208798 1156099 1402934 1382608 1829418 1972189 1746960 1367434
22387 1367434 1489048 1560574 1718998 1974432 1956477 1769463 1836910 1720196 1876357 2053554
22377 2053554 1759842 1486058 1784239 2016284 2229254 2224891 1957675 1846218 1984880 1838027
22367 1838027 1945724 2078597 1994086 1931343 2018323 1949212 1547144 1463197 1423748 1218641
$$ packed form
22437A455867j56697J07861K20985L14759J90487k1706K72703j26729m46751m66792
22427A343987j3221Q8425K99724K28642k29430R2755K27555J22565j03462j11322
22417A946218j26978J36022n4213l17315k67915k26183j93097j62925K96424K12133
22407A242171Q9408J64619K0904J61184J23504J47609m43625o54779n6337K61743
22397A056401N10039K9753l87395n2699K46835k0326M46810J42771k25229l79526
22387A367434J21614P1526J58424K55434j7955j87014O7447j16714J56161J77197
22377B053554k93712k73784K98181K32045K12970m363k67216j11457J38662j46853
22367A838027J07697J32873q4511o2743Q6980o9111m02068q3947l9449k05107
$$ plain form
22357 1218641 1487876 1375635 998336 1262550 1447426 1614898 1414937 1264486 1128943
22348 1128943 906078 1047455 1230641 1222842 1229214 1236078 940944 950355 849458 454311 847687
22337 847687 1194000 1074374 1211387 1234205 1284323 1515795 1495295 1513328 1416472 1111823
22327 1111823 963025 966943 1294749 1240138 1347303 1588455 1574298 1544577 1431454 1359989
22317 1359989 1238791 1495924 1229863 898511 1149279 1434146 1448422 1529849 1311261 1502252
22307 1502252 1683652 1930884 1498939 1427546 1421305 1073489 402273 370992 539404 570261
22297 570261 705810 813655 1144419 1242540 954413 979517 1016256 948829 985949 1110498
22287 1110498 1139985 1103272 1085043 1186720 1135573 1007714 1008613 704833 785545 1165227 806062
$$ packed form
22357A218641K69235j12241l77299K64214J84876J67472j99961j50451j35543
22348A128943k22865J41377J83186p799O372O864k95134R411j00897l95147L93376
22337H47687L46313j19626J37013K2818N0118K31472k0500J8033r6856l04649
22327A111823j48798L918L27806n4611J07165K41152j4157k9721j13123p1465
22317A359989j21198K57133k66061l31352K50768K84867J4276Q1427k18588J90991
22307A502252J81400K47232m31945p1393o241l47816o71216l1281J68412L0857
22297E70261J35549J07845L30764R8121k88127K5104L6739o7427L7120J24549
22287A110498K9487l6713j8229J01677n1147j27859Q99l03780Q0712L79682l59165
$$ plain form
22276 806062 597497 702465 915903 994315 1152944 1474613 1354710 1019295 817560 674757
22266 674757 781699 1299169 1257316 1207803 674276 496638 649741 831669 1011734 1128172
22256 1128172 1344185 1530582 1163741 1003793 720350 499403 568266 669479 594965 756974
22246 756974 886246 897201 871968 1060744 932219 652726 459578 696401 1055030 1223831
22236 1223831 901929 884110 670842 549648 645801 482991 379379 482124 744025 892432
22226 892432 995333 903197 617012 805811 1175026 889623 864865 978686 948938 885727
22216 885727 515187 723979 1113835 1051787 1122648 1100508 1054609 1004243 1090093 1086427 926423
22205 926423 687574 743274 891685 1106065 1248543 1217103 1159432 950640 584114 702200
$$ packed form
22276H06062k08565J04968K13438P8412J58629L21669j19903l35415k01735j42803
22266F74757J06942N17470m1853m9513n33527j77638J53103J81928J80065J16438
22256A128172K16013J86397l66841j59948k83443k20947O8863J01213p4514J62009
22246G56974J29272J0955k5233J88776j28525k79493j93148K36823L58629J68801
22236A223831l21902j7819k13268j21194R6153j62810j03612J02745K61901J48407
22226H92432J02901r2136k86185J88799L69215k85403k4758J13821k9748o3211
22216H85727l70540K08792L89856o2048P0861k2140m5899n0366Q5850l666j60004
22205I26423k38849N5700J48411K14380J42478l1440n7671k08792l66526J18086
$$ plain form
22195 702200 791393 803870 689740 887648 948758 1128664 1387985 1035606 872279 663862
22185 663862 679951 568039 602157 865417 728504 597677 635873 632323 750707 542914
22175 542914 515238 904632 1140780 1126879 1237377 1215491 1134796 914658 660735 817881
22165 817881 1237270 980834 873463 692400 582185 622900 760106 1197536 1169070 1040419
22155 1040419 806058 710118 598148 351476 530113 926347 952334 658598 386436 475275
22145 475275 697272 938966 832133 1026356 909646 364763 38012 64086 144238 439894
22135 439894 756449 682835 489511 580249 775152 929744 1074739 703951 675667 820848
22125 820848 913052 706348 934060 873269 923032 538712 418694 531623 420070 400025
$$ packed form
22195G02200Q9193J2477j14130J97908O1110J79906K59321l52379j63327k08417
22185F63862J6089j11912L4118K63260j36913j30827L8196l550J18384k07793
22175E42914k7676L89394K36148j3901J10498k1886q0695k20138k53923J57146
22165H17881M19389k56436j07371j81063j10215M0715J37206M37430k8466j28651
22155A040419k34361r5940j11970k46672J78637L96234K5987k93736k72162Q8839
22145D75275K21997K41694j06833J94223j16710n44883l26751K6074Q0152K95656
22135D39894L16555p3614j93324R0738J94903J54592J44995l70788k8284J45181
22125H20848R2204k06704K27712o0791M9763l84320j20018J12929j11553k0045
$$ plain form
22115 400025 767830 795516 393225 381901 697917 821095 934147 901029 1197973 1209760
22105 1209760 1086336 1068549 929639 803575 1130516 1165469 908911 759839 824665 899965
22095 899965 1148982 1483598 1316579 1036863 733722 554553 819205 935471 1258769 1034796
22085 1034796 779471 511870 548246 626937 696645 748869 1133961 918848 925525 1011327 749525
22074 749525 792968 854156 1016234 804851 128811 -60892 12172 158643 400748 84193
22064 84193 -359270 229596 737137 321345 110655 344937 148881 -152353 -438214 -464442
22054 -464442 -180023 125179 431647 777786 742551 1189105 1166884 814025 939202 821118
22044 821118 948539 869792 677487 948473 834505 584178 393060 405409 310605 417158
$$ packed form
22115D00025L67805K7686m02291j1324L16016J23178J13052l3118K96944J1787
22105A209760j23424j7787j38910j26064L26941L4953k56558j49072O4826P5300
22095H99965K49017L34616j67019k79716l03141j79169K64652J16266L23298k23973
22085A034796k55325k67601L6376P8691O9708N2224L85092k15113O677Q5802k61802
22074G49525M3443O1188J62078k11383o76040j89703P3064J46471K42105l16555
22064H4193m43463N88866N07541m15792k10690K34282j96056l01234k85861k6228
22054d64442K84419L05202L06468L46139l5235M46554k2221l52859J25177j18084
22044H21118J27421p8747j92305K70986j13968k50327j91118J2349r4804J06553
$$ plain form
22034 417158 438947 135131 237641 424278 712735 797431 1065283 754453 520483 508151
22024 508151 299717 436667 517703 823258 1203029 970157 1079924 1233401 1283936 1076933
22014 1076933 624704 405485 522930 330816 399708 725960 626519 776376 513049 334662
22004 334662 714269 978970 468105 188299 205997 425167 443737 568104 613969 546189
21994 546189 201682 235411 247080 453647 389833 -72446 -16677 23106 -33170 418754 583736
21983 583736 448359 532703 545007 407243 283926 168804 145891 430657 954243 657610
21973 657610 142560 288987 744446 712285 784700 600994 189413 271182 92317 -275416
21963 -275416 -288706 360347 808372 936655 553543 296418 345094 166053 369634 403729
$$ packed form
22034D17158K1789l03816J02510J86637K88457Q4696K67852l10830k33970j2332
22024E08151k08434J36950Q1036L05555L79771k32872J09767J53477N0535k07003
22014A076933m52229k19219J17445j92114O8892L26252r9441J49857k63327j78387
22004C34662L79607K64701n10865k79806J7698K19170J8570J24367M5865o7780
21994E46189l44507L3729J1669K06567o3814m62279N5769L9783n6276M51924J64982
21983E83736j35377Q4344J2304j37764j23317j15122k2913K84766N23586k96633
21973F57610n15050J46427M55459l2161P2415j83706m11581Q1769j78865l67733
21963b75416j3290O49053M48025J28283l83112k57125M8676j79041K03581L4095
$$ plain form
21953 403729 58271 -16084 406833 398655 249855 131155 397134 715895 605652 59345
21943 59345 144827 221565 22632 133978 218006 371204 386102 618607 636963 691241 446357
21932 446357 160652 260411 377501 693269 624923 101139 67724 349729 336591 332363 607728
21921 607728 701363 303818 430386 827282 943210 936571 666247 542519 521279 729453
21911 729453 984570 1044021 721332 905440 1122527 1049072 1041491 910000 1085932 1425775
21901 1425775 1173374 751838 578279 636165 497585 348171 702598 595358 404664 423091
21891 423091 453089 753676 438136 324233 506724 599990 515452 289482 286321 472858
21881 472858 427274 474439 399225 14810 191148 222635 323331 312186 248145 399525 536913
$$ packed form
21953D03729l45458p4355M22917q178j48800j18700K65979L18761j10243n46307
21943E9345Q5482P6738j98933J11346Q4028J53198J4898K32505J8356N4278k44884
21932D46357k85705R9759J17090L15768o8346n23784l3415K82005j3138m228K75365
21921F07728R3635l97545J26568L96896J15928o639k70324j23728k1240K08174
21911G29453K55117N9451l22689J84108K17087p3455p581j31491J75932L39843
21901A425775k52401m21536j73559N7886j38580j49414L54427j07240j90694J8427
21891D23091K9998L00587l15540j13903J82491R3266q4538k25970l161J86537
21881D72858m5584M7165p5214l84415J76338L1487J00696j1145o4041J51380J37388
$$ plain form
21870 536913 506290 511166 425360 452641 394662 705719 930473 437773 406660 84131 54988
21859 54988 79355 185901 355998 478539 235631 474571 480772 227704 375346 457504
21849 457504 413280 635443 613663 146700 -14147 207152 187964 312705 328338 284316
21839 284316 173692 142878 195457 332180 290081 41200 -130418 189801 209363 34319
21829 34319 -140886 -200763 149701 408223 493564 657974 490940 478796 795612 879832
21819 879832 704828 604319 850998 886401 593902 477492 117990 195862 233043 -16195
21809 -16195 121877 261841 201278 -39732 -49576 -155593 31600 794268 1050336 922121
21799 922121 753280 313982 26778 -141695 35627 147457 -52582 -125990 292403 524084
$$ packed form
21870E36913l0623M876q5806K7281n7979L11057K24754m92700l1113l22529k9143
21859E4988K4367J06546J70097J22541k42908K38940O201k53068J47642Q2158
21849D57504m4224K22163k1780m66963j60847K21299j9188J24741J5633m4022
21839B84316j10624l0814N2579J36723m2099k48881j71618L20219J9562j75044
21829C4319j75205n9877L50464K58522Q5341J64410j67034j2144L16816Q4220
21819H79832j75004j00509K46679L5403k92499j16410l59502P7872L7181k49238
21809a6195J38072J39964o0563k41010r844j06017J87193P62668K56068j28215
21799I22121j68841m39298k87204j68473J77322J11830k00039p3408M18393K31681
$$ plain form
21789 524084 244442 245683 358288 384946 358200 465487 639918 740587 739321 993872 1028533
21778 1028533 1157863 1090852 853436 718265 708783 955723 1039547 402000 304503 665404
21768 665404 487357 556706 133868 -149336 295949 287817 134555 228473 132944 395917
21758 395917 578756 261842 272420 528546 413017 127277 -69150 126876 366960 597305
21748 597305 792373 616145 76125 -76942 63947 218672 82604 -80809 -50643 -278982
21738 -278982 -231450 -76466 259687 526995 320014 299641 293538 174129 205896 396908
21728 396908 348016 55443 -98578 -335934 -170215 83556 393794 387343 -303280 -486291
21718 -486291 -134376 -71179 -216673 -193914 47237 284018 200024 216034 422604 355145
$$ packed form
21789E24084k79642J241J12605K6658k6746J07287J74431J00669j266K54551L4661
21778A028533J29330o7011k37416j35171r482K46940Q3824o37547r7497L60901
21768F65404j78047O9349m22838k83204M45285q132j53262R3918r5529K62973
21758C95917J82839l16914J0578K56126j15529k85740j96427J96026K40084K30345
21748E97305J95068j76228n40020j53067J40889J54725j36068j63413L0166k28339
21738b78982M7532J54984L36153K67308k06981k0373o103j19409L1767J91012
21728C96908m8892k92573j54021k37356J65719K53771L10238o451o90623j83011
21718d86291L51915O3197j45494K2759K41151K36781q3994J6010K06570o7459
$$ plain form
21708 355145 107913 36017 -171229 -210820 -21195 50788 287648 486024 634569 602311
21698 602311 617027 573236 481029 376238 231149 186248 -40160 -508989 -590957 -673663 -733587
21687 -733587 -537813 -243491 39293 205637 83436 -50521 -233007 -238239 -198427 -152862
21677 -152862 -237956 -301467 -788088 -499314 -91187 -1367 82201 -76157 125877 201619
21667 201619 163020 547083 298176 -42906 54859 184017 373459 369341 232188 182552
21657 182552 384526 316053 193707 309017 485051 465756 350232 205978 55215 -100659
21647 -100659 64035 460998 536109 409579 451495 482507 234571 324869 261526 338437 508601
21636 508601 573873 768976 483002 193262 228409 227132 336979 43844 115542 248025
$$ packed form
21708C55145k47232p1896k07246l9591J89625P1983K36860J98376J48545l2258
21698F02311J4716m3791r2207j04791j45089m4901k26408m68829q1968q2706n9924
21687g33587J95774K94322K82784J66344j22201j33957j82486n232L9812M5565
21677a52862q5094o3511m86621K88774M08127Q9820Q3568j58358K02034P5742
21667B01619l8599L84063k48907l41082R7765J29158J89442m118j37153m9636
21657A82552K01974o8473j22346J15310J76034j9295j15524j44254j50763j55874
21647a00659J64694L96963P5111j26530M1916L1012k47936R0298o3343P6911J70164
21636E08601O5272J95103k85974k89740L5147j277J09847k93135P1698J32483
$$ plain form
21626 248025 364858 154237 -16627 119390 188271 462374 154360 63338 49561 -67414
21616 -67414 62808 299339 309221 442350 509659 340097 230841 494827 405043 327776 450015
21605 450015 208468 -224599 -324862 -329357 -156520 -49380 44974 288571 -110250 -231776
21595 -231776 -155985 -290806 -478884 -342070 -218923 -132676 -232590 -115739 198831 283734
21585 283734 359452 188208 -28548 78350 126549 -39904 -371060 -554897 -401816 -317207
21575 -317207 -113215 -252752 -52455 102040 71648 7216 -207637 -411070 -142285 202003
21565 202003 99728 -161360 -335196 -747081 -935430 -371346 138544 272142 431259 230888
21555 230888 -10341 43425 205940 209550 -214743 -318915 -147343 -72369 41152 -66948
$$ packed form
21626B48025J16833k10621j70864J36017O8881K74103l08014r1022j3777j16975
21616f7414J30222K36531R882J33129O7309j69562j09256K63986q9784p7267J22239
21605D50015k41547m33067j00263m495J72837J07140R4354K43597l98821j21526
21595b31776P5791j34821j88078J36814J23147Q6247r9914J16851L14570Q4903
21585B83734P5718j71244k16756J06898M8199j66453l31156j83837J53081Q4609
21575c17207K03992j39537K00297J54495l0392o4432k14853k03433K68785L44288
21565B02003j02275k61088j73836m11885j88349N64084N09890J33598J59117k00371
21555B30888k41229N3766J62515L610m24293j04172J71572P4974J13521j08100
$$ plain form
21545 -66948 -289255 -203053 -253724 -268027 -307905 -323280 159636 268975 89043 10920 314323
21534 314323 346039 621278 671415 687199 667357 357441 146130 -206792 -123900 -576131
21524 -576131 -554854 -289120 -111897 -202767 -32837 189844 546711 470449 164839 90550
21514 90550 142095 235220 336926 153235 159733 361899 251591 107442 320333 420351
21504 420351 318765 109327 216723 29753 -3566 -2521 84132 87803 180559 345877 316690
21493 316690 347269 387301 541715 775108 928276 1025109 701842 469858 558391 834281
21483 834281 610748 410418 381134 134592 -247624 -321483 -432578 -179828 -154116 -82109
21473 -82109 286942 313311 58483 52963 18227 -88850 -114961 -223013 -447363 -350218 -157020
$$ packed form
21545f6948k22307Q6202n0671j4303l9878j5375M82916J09339j79932p8123L03403
21534C14323L1716K75239N0137J5784j9842l09916k11311l52922Q2892m52231
21524e76131K1277K65734J77223r0870J69930K22681L56867p6262l05610p4289
21514I0550N1545R3125J01706j83691O498K02166j10308j44149K12891J00018
21504D20351j01586k09438J07396j86970l3319J045Q6653L671R2756J65318k9187
21493C16690L0579M0032J54414K33393J53168R6833l23267k31984Q8533K75890
21483H34281k23533k00330k9284k46542l82216p3859j11095K52750K5712P2007
21473h2109L69051K6369k54828n520l4736j07077k6111j08052k24350R7145J93198
$$ plain form
21462 -157020 -83992 -149756 -33621 297361 565958 687681 135927 110443 234069 529735
21452 529735 733625 575666 391635 627097 375988 345160 335540 -61095 -73188 3106
21442 3106 -261630 -53639 52697 272290 51219 -196256 -229686 -65900 206177 313486
21432 313486 -96388 -365148 -483135 -423826 -255352 -187770 -68997 -105653 115087 199338
21422 199338 -28397 -40366 -16852 -331802 -525591 -219127 -92775 16624 -275994 -312921
21412 -312921 -407502 -491592 -539880 -587796 -317390 101146 485383 514771 751428 585766
21402 585766 436451 41727 246387 352380 351664 431593 605555 813794 861561 769714 681819
21391 681819 762398 499525 294771 48830 -78642 166410 28503 -135862 -413430 -446924
$$ packed form
21462a57020P3028o5764J16135L30982K68597J21723n51754k5484J23626K95666
21452E29735K03890j57959j84031K35462k51109l0828r620l96635j2093P6294
21442C106k64736K07991J06336K19593k21071k47475l3430J63786K72077J07309
21432C13486m09874k68760j17987N9309J68474O7582J18773l6656K20740Q4251
21422A99338k27735j1969K3514l14950j93789L06464J26352J09399k92618l6927
21412c12921r4581q4090m8288m7916K70406M18536L84237K9388K36657j65662
21402E85766j49315l94724K04660J05993p16P9929J73962K08239M7767r1847q7895
21391F81819Q0579k62873k04754k45941j27472K45052j37907j64365k77568l3494
$$ plain form
21381 -446924 -137322 322975 647498 664748 649777 179385 -250008 -171457 -62112 -55950
21371 -55950 -24352 127240 174168 398562 475207 676252 405957 293183 456822 373771
21361 373771 256840 -17119 -191880 -61718 118693 199393 380360 273878 196889 272485
21351 272485 270301 153235 -160182 -154345 829 -59567 93239 -23124 -250791 33097
21341 33097 -19849 -2900 190897 371480 677585 693565 96729 -222164 -49576 149117
21331 149117 469658 208753 11220 276411 41497 -39845 81588 -17629 -18266 -133592
21321 -133592 -350450 -504576 -587027 -585278 -650999 -161221 311828 74467 289713 487035
21311 487035 379336 435965 399184 236937 -134289 -228288 -127808 -48512 82018 284455
$$ packed form
21381d46924L09602M60297L24523J7250j4971m70392m29393P8551J09345O162
21371e5950L1598J51592M6928K24394P6645K01045k70295j12774J63639q3051
21361C73771j16931k73959j74761J30162J80411Q0700J80967j06482p6989P5596
21351B72485k184j17066l13417N837J55174o0396J52806j16363k27667K83888
21341C3097n2946J6949J93797J80583L06105J5980n96836l18893J72588J98693
21331A49117L20541k60905j97533K65191k34914q1342J21433r9217o37j15326
21321a33592k16858j54126q2451J749o5721M89778M73049k37361K15246J97322
21311D87035j07699N6629l6781j62247l71226r3999J00480P9296J30530K02437
$$ plain form
21301 284455 293779 288443 298182 314513 239347 17968 -142013 -155726 -137319 173387 212226
21290 212226 -299364 -384657 -618670 -654249 -18684 376500 43983 -121788 -90138 -59895
21280 -59895 116103 132354 128243 -19035 -165464 -259740 -244363 -338886 -177966 209597 242795
21269 242795 198875 125522 234480 -43919 -93550 22941 97940 327591 404246 -34250
21259 -34250 -522490 -254825 113376 590375 490789 402511 315424 110170 -231559 -372075
21249 -372075 -673558 -653331 -255793 -146780 34393 -163087 -312493 -376548 57003 232523
21239 232523 548099 409557 38962 -23104 -275 -75477 -68934 -58446 -105995 -152580 -57008
21228 -57008 376983 307626 325087 229123 -42812 -209128 -25872 323262 192887 173683
$$ packed form
21301B84455R324n336R739J6331p5166k21379j59981j3713J8407L10706L8839
21290B12226n11590q5293k34013l5579O35565L95184l32517j65771L1650L0243
21280e9895J75998J6251m111j47278j46429r4276J5377r4523J60920L87563L3198
21269B42795m3920p3353J08958k78399m9631J16491P4999K29651P6655m38496
21259c4250m88240K67665L68201M76999r9586q8278q7087k05254l41729j40516
21249c72075l01483K0227L97538J09013J81173j97480j49406o4055M33551J75520
21239B32523L15576j38542l70595o2066K2829p5202O543J0488m7549m6585R5572
21228e7008M33991o9357J7461r5964k71935j66316J83256L49134j30375j9204
$$ plain form
21218 173683 626800 463748 454317 326897 124242 160562 309981 38913 -218618 -352923
21208 -352923 -102279 -129457 280605 656336 658521 769981 786537 314331 102885 292757
21198 292757 413021 405810 140230 22531 -137391 -177658 25407 449991 431701 120648
21188 120648 126457 4694 -92206 -64941 -332113 -826244 -504749 -133036 154164 221126
21178 221126 70127 130511 -71941 -447432 -381283 -511801 -396171 -283284 -83551 156383
21168 156383 353026 404772 316421 370811 162106 111846 239426 231403 176822 349005 469559
21157 469559 405411 207779 -19531 370783 661688 441878 -79490 -191853 -259395 -323098
21147 -323098 -166683 -349444 -146396 290731 540027 412302 382695 128479 260504 526023
$$ packed form
21218A73683M53117j63052r431j27420k02655L6320J49419k71068k57531j34305
21208c52923K50644k7178M10062L75731K185J11460J6556m72206k11446J89872
21198B92757J20264p211k65580j17699j59922m0267K03065M24584j8290l11053
21188A20648N809j21763r6900K7265k67172m94131L21495L71713K87200O6962
21178B21126j50999O0384k02452l75491O6149j30518J15630J12887J99733K39934
21168A56383J96643N1746q8351N4390k08705n0260J27580q023n4581J72183J20554
21157D69559o4148j97632k27310L90314K90905k19810n21368j12363o7542o3703
21147c23098J56415j82761K03048M37127K49296j27725k9607k54216J32025K65519
$$ plain form
21137 526023 312626 240977 23898 -140592 -108209 -157480 -27645 -212097 -391797 -153562
21127 -153562 -36930 41658 91885 -227378 -198372 -129282 19406 92522 -52464 -98237 -24658
21116 -24658 -26417 -483839 -469581 -237199 -70262 -11982 -331278 -178077 -281584 -246302 -98702
21105 -98702 -13056 -9797 -273124 -512619 -533470 -52129 383878 55137 -238654 -63305
21095 -63305 181746 540224 662929 369642 55809 -187095 -201028 161327 127234 -56027
21085 -56027 -270260 32154 423483 623496 750832 425015 399638 501823 428726 916986
21075 916986 713156 71738 -86783 -67111 -3076 268343 325377 409536 161870 -54284
21065 -54284 -211575 -158660 -183251 -174957 -300691 -712754 -784337 -499902 -264396 -375897 -671030
$$ packed form
21137E26023k13397p1649k17079j64490L2383m9271J29835j84452j79700K38235
21127a53562J16632P8588N0227l19263K9006O9090J48688P3116j44986m5773P3579
21116b4658j759m57422J4258K32382J66937N8280l19296J53201j03507L5282J47600
21105i8702Q5646L259k63327k39495k0851M81341M36007l28741k93791J75349
21095f3305K45051L58478J22705k93287l13833k42904j3933L62355l4093j83261
21085e6027k14233L02414L91329K00013J27336l25817k5377J02185p3097M88260
21075I16986k03830o41418j58521J9672O4035K71419N7034Q4159k47666k16154
21065e4284j57291N2915k4591Q294j25734m12063p1583K84435K35506j11501k95133
$$ plain form
21054 -671030 -699967 -377473 -300794 -390151 -260271 -301434 -290637 -201709 -151721 -190792 -479246
21043 -479246 -585824 -271881 37565 187148 123088 92063 390288 518395 384067 269158
21033 269158 67845 -109327 -4090 -85324 -244648 -41378 152319 253464 313428 544279
21023 544279 121921 -351838 -216141 -212762 -55369 102435 61708 -365522 -341278 -118403
21013 -118403 -5865 -232731 -251906 -119813 301249 326579 298354 372407 495183 633659
21003 633659 385304 188549 189806 17033 -51299 -250325 -410057 -205542 75664 151151
20993 151151 149571 241241 229733 252176 532435 322825 246993 93865 -387468 -230064 -31427
20982 -31427 -300244 -380514 -193734 216338 329935 72258 -150203 -145168 97561 227344
$$ packed form
21054f71030k8937L22494P6679q9357J29880m1163J0797Q8928M9988l9071k88454
21043d79246j06578L13943L09446J49583o4060l1025K98225J28107j34328j14909
21033B69158k01313j77172J05237q1234j59324K03270J93697J01145N9964K30851
21023E44279m22358m73759J35697L379J57393J57804m0727m27230K4244K22875
21013a18403J12538k26866j9175J32093M21062K5330k8225P4053J22776J38476
21003F33659k48355j96755J257j72773o8332j99026j59732K04515K81206P5487
20993A51151j580R1670j1508K2443K80259k09610p5832j53128m81333J57404J98637
20982c1427k68817q0270J86780M10072J13597k57677k22461N035K42729J29783
$$ plain form
20972 227344 -95590 -88406 -175360 140256 514929 324188 193759 -246965 -261650 -100775
20962 -100775 120830 -12058 -305053 -555299 -563903 -426577 -162616 -215777 -190463 -34942
20952 -34942 80529 -75159 -443281 -174101 165017 223445 283230 354837 499004 388547
20942 388547 -39472 -252388 -311455 9188 -141532 -215531 -98392 -243103 -322698 80843
20932 80843 134506 119362 -386759 -773232 -810333 -504590 -132094 -69349 -322445 -732353
20922 -732353 -576401 -202005 -107588 -79068 166317 -60000 106112 343854 238031 80933
20912 80933 16584 -64763 -324292 -167443 13744 104300 -98424 -104363 -379096 -393020 -75732
20901 -75732 -27947 267226 50734 17554 -166338 -164195 -168302 -578610 -612811 -212789 145039
$$ packed form
20972B27344l22934P184q6954L15616L74673j90741j30429m40724j4685J60875
20962a00775K21605j32888k92995k50246q604J37326K63961n3161K5314J55521
20952c4942J15471j55688l68122K69180L39118N8428N9785P1607J44167j10457
20942C88547m28019k12916n9067L20643j50720p3999J17139j44711p9595M03541
20932H0843N3663j5144n06121l86473l7101L05743L72496O2745k53096m09908
20922g32353J55952L74396R4417K8520K45385k26317J66112K37742j05823j57098
20912H0933o4349q1347k59529J56849J81187R0556k02724n939k74733j3924L17288
20901g5732M7785K95173k16492l3180j83892K143m107m10308l4201M00022L57828
$$ plain form
20890 145039 360413 262674 -25967 -155983 -187423 -161233 143288 -83574 -193357 -314328
20880 -314328 -466012 -351602 -104368 -108031 28466 -325895 -649516 -335142 -2694 -276833
20870 -276833 -288852 -101675 -270140 -189807 -430250 -413553 -385801 -190020 -98543 -137165 137131
20859 137131 207965 -138777 -190636 -39716 -247917 -311497 -30952 29539 -210355 -502937
20849 -502937 -467482 -487570 30078 365459 209084 -102694 -119228 -215318 -456146 -290156
20839 -290156 -200189 -276792 -504102 -492493 -444738 -426871 -453415 -310403 -159266 -582234 -519315
20828 -519315 -273940 -420627 -478078 -374329 -154973 -381640 -562787 -419154 22220 -211056
20818 -211056 -430907 -414385 -380132 -69235 -74344 -179898 -368911 -410652 -325362 -411790 -16766
$$ packed form
20890A45039K15374r7739k88641j30016l1440K6190L04521k26862j09783j20971
20880c14328j51684J14410K47234l663J36497l54361l23621L14374L32448k74139
20870b76833j2019J87177j68465Q0333k40443J6697K7752J95781R1477l8622K74296
20859A37131P0834l46742n1859J50920k08201o3580K80545O0491k39894k92582
20849e02937L5455k0088N17648L35381j56375l11778j6534r6090k40828J65990
20839b90156Q9967p6603k27310J1609M7755J7867k6544J43012J51137m22968O2919
20828e19315K45375j46687n7451J03749K19356k26667j81147J43633M41374k33276
20818b11056k19851J6522L4253L10897n109j05554j89013m1741Q5290q6428L95024
$$ plain form
20807 -16766 429027 751356 493551 116388 -9160 315100 676839 391339 -16300 -182036
20797 -182036 -305049 -272482 -246323 -428846 -294553 -7018 -166285 -511649 -506672 -483823
20787 -483823 -390010 -608420 -410634 -97073 -114912 -266171 -320845 -3959 98452 -188294
20777 -188294 -48197 98705 11304 -71569 -22305 124858 371057 378646 595358 379887
20767 379887 203545 -150859 -313719 -348347 27987 -64016 -326085 -434318 -159226 50637
20757 50637 -40660 9190 193160 -16473 12237 -55942 -214358 -224690 -381053 -270516 -459493
20746 -459493 -371795 39260 363795 211970 143856 345386 428039 429885 105600 -274769
20736 -274769 -256624 28453 155970 44847 -74402 140055 266436 458598 305221 17570
$$ packed form
20807a6766M45793L22329k57805l77163j25548L24260L61739k85500m07639j65736
20797a82036j23013L2567K6159j82523J34293K87535j59267l45364M977K2849
20787d83823R3813k18410J97786L13561j7839j51259n4674L16886J02411k86746
20777a88294J40097J46902q7401q2873M9264J47163K46199P589K16712k15471
20767C79887j76342l54404j62860l4628L76334r2003k62069j08233K75092K09863
20757E0637r1297M9850J83970k09633K8710o8179j58416j0332j56363J10537j88977
20746d59493Q7698M11055L24535j51825o8114K01530Q2653J846l24285l80369
20736b74769J8145K85077J27517j11123j19249K14457J26381J92162j53377k87651
$$ plain form
20726 17570 -252218 -246680 -63398 26001 -143117 -206671 -298799 -470440 -531353 -288484 222967
20715 222967 83136 -115023 -163151 -499643 -570375 -390870 -391715 -180625 -119351 -499232 -783599
20704 -783599 -1055519 -1555340 -1266634 -874594 -603770 -437336 -131222 126073 215015 27888
20694 27888 -192377 -313563 -122182 82864 -115271 -177990 261250 350551 389795 325699
20684 325699 84201 -29649 -257123 -246310 133490 56182 54813 191020 299288 154996
20674 154996 77516 -155848 -464204 -485819 -215502 -108893 -507887 -610965 -391567 -333842
20664 -333842 -152240 -311932 -481156 -403775 -423756 -320268 -399941 -389820 -378552 -435166 -406400
20653 -406400 -191015 -285724 -145591 -102303 -354642 -375739 -369500 -88991 -1765 -30010 86093
$$ packed form
20726A7570k69788N538J83282Q9399j69118o3554r2128j71641o0913K42869N11451
20715B22967j39831j98159m8128l36492p0732J79505q45K11090O1274l79881k84367
20704g83599k71920m99821K88706L92040K70824J66434L06114K57295Q8942j87127
20694B7888k20265j21186J91381K05046j98135o2719M39240Q9301L9244o4096
20684C25699k41498j13850k27474J0813L79800p7308j369J36207J08268j44292
20674A54996p7480k33364l08356k1615K70317J06609l98994j03078K19398N7725
20664c33842J81602j59692j69224P7381j9981J03488p9673J0121J1268n6614K8766
20653d06400K15385r4709J40133M3288k52339k1097O239K80509Q7226k8245J16103
$$ plain form
20642 86093 335014 155894 32382 100621 -137848 -386883 -490170 -255293 -79520 135421
20632 135421 286921 208915 105397 120360 313793 487123 265621 -93719 -3269 38464
20622 38464 180627 147967 363029 326807 92684 238180 427821 171964 94624 196818
20612 196818 453195 488416 192428 243340 514461 337943 -41227 -376867 -233902 81380
20602 81380 175225 54276 -103159 -199536 351900 384036 56664 -193492 -320286 -195798
20592 -195798 -112131 281695 397365 292341 382571 437648 345997 160015 137126 -88719
20582 -88719 -237575 4218 -224330 -469092 -456032 -401386 -252541 -25008 107178 94350
20572 94350 -22647 99863 -41560 -219968 -168184 -246578 -280137 -142513 495086 741080
$$ packed form
20642H6093K48921j79120j23512O8239k38469k49035j03287K34877J75773K14941
20632A35421J51500p8006j03518J4963J93433J73330k21502l59340R0450M1733
20622C8464J42163l2660K15062l6222k34123J45496J89641k55857p7340J02194
20612A96818K56377L5221k95988N0912K71121j76518l79170l35640J42965L15282
20602H1380R3845j20949j57435r6377N51436L2136l27372k50156j26794J24488
20592a95798Q3667L93826J15670j05024R0230N5077r1651j85982k2889k25845
20582h8719j48856K41793k28548k44762J3060N4646J48845K27533J32186j2828
20572I4350j16997J22510j41423j78408N1784p8394l3559J37624O37599K45994
$$ plain form
20562 741080 518215 151107 23415 -72150 94165 357600 167122 -210495 -216268 130487
20552 130487 349794 70922 -272743 -207333 -267184 -248974 -290567 -405202 -613856 -614225 -294532
20541 -294532 -562767 -920492 -692252 -367705 -452932 -436713 -459121 -322123 117032 -56796
20531 -56796 -331638 -124997 187728 87995 -37068 -5669 8403 95898 153517 21181 -84242
20520 -84242 -211201 -315865 -171073 -167069 129682 301333 57564 -54187 9545 131051
20510 131051 256845 254015 237186 -197709 -131303 -86389 -96928 120310 313995 590694 750522
20499 750522 715464 458679 337498 27548 -241668 -345697 -508989 -511753 -77148 26572
20489 26572 -191292 -296024 -22332 -44146 -234402 13698 205653 425524 555727 535206
$$ packed form
20562G41080k22865l67108j27692r5565J66315K63435j90478l77617n773L46755
20552A30487K19307k78872l43665O5410n9851J8210m1593j14635k08654l69L19693
20541b94532k68235l57725K28240L24547q5227J6219k2408J36998M39155j73828
20531e6796k74842K06641L12725r9733j25063L1399J4072Q7495N7619j32336j05423
20520h4242j26959j04664J44792M004K96751J71651k43769j11751O3732J21506
20510A31051J25794k830j6829m34895O6406M4914j0539K17238J93685K76699J59828
20499G50522l5058k56785j21181l09950k69216j04029j63292k764M34605J03720
20489B6572k17864j04732K73692k1814j90256K48100J91955K19871J30203k0521
$$ plain form
20479 535206 217423 142243 2460 -169434 -406413 -305415 54345 263477 -50786 -360038
20469 -360038 -305203 -470082 -390662 -53300 249174 6985 -427766 -526715 -472396 -264363
20459 -264363 -111544 41631 114196 -196121 -493953 -589405 -507698 -141310 170374 196287
20449 196287 -39250 -18954 -299692 -382719 -423849 -373199 -275022 -608837 -407179 4500
20439 4500 42698 -146299 -490173 -338283 -114041 -74766 -340163 -221746 -28578 6943
20429 6943 -87980 -204721 -252195 -257976 -183373 238413 404926 348027 202864 -88872 -435469
20418 -435469 -928982 -690979 -750525 -815336 -838718 -586954 -720770 -192531 -60838 -235886
20408 -235886 -249958 -177523 -327840 -261011 -247298 -302637 -388931 -571103 -573336 -250488 -12954
$$ packed form
20479E35206l17783p5180j39783j71894k36979J00998L59760K09132l14263l09252
20469c60038N4835j64879P9420L37362L02474k42189m34751r8949N4319K08033
20459b64363J52819J53175P2565l10317k97832r5452Q1707L66388L11684K5913
20449A96287k35537K0296k80738q3027m1130N0650R8177l33815K01658M11679
20439D500L8198j88997l43874J51890K24242L9275k65397J18417J93168L5521
20429F943r4923j16741m7474n781P4603M21786J66513n6899j45163k91736l46597
20418d35469m93513K38003n9546o4811k3382K51764j33816N28239J31693j75048
20408b35886j4072P2435j50317O6829J3713n5339q6294j82172k233L22848K37534
$$ plain form
20397 -12954 -309845 -423994 -348831 -102787 -261385 -493276 -211927 -280180 -534872 -797605
20387 -797605 -506787 174237 587939 359364 -129236 94629 330301 266761 349769 315331
20377 315331 -3335 -175973 -179398 -80366 391633 203942 -66365 84387 116849 22250
20367 22250 -229503 -381551 -613620 -314954 -10001 -42732 -375104 -372605 149853 307761
20357 307761 253140 54780 82300 161309 -26377 -95020 37277 60744 141389 -120952 -172191
20346 -172191 -296619 -330604 -100691 -457912 -442116 -276594 -22644 208843 -80457 -44570
20336 -44570 -181554 -195028 -261689 -324137 -445518 -565938 -95354 -86763 -314054 -68113 25348
20325 25348 402837 598269 278954 -267325 -507258 -97679 51069 51576 -56262 -130240
$$ packed form
20397a2954k96891j14149P5163K46044j58598k31891K81349o8253k54692k62733
20387g97605K90818O81024M13702k28575m88600K23865K35672o3540Q3008l4438
20377C15331l18666j72638l425R9032M71999j87691k70307J50752L2462r4599
20367B2250k51753j52048k32069K98666L04953l2731l32372K499N22458J57908
20357C07761n4621j98360K7520P9009j87686o8643J32297K3467Q0645k62341n1239
20346a72191j24428l3985K29913l57221J5796J65522K53950K31487k89300L5887
20336d4570j36984j3474o6661o2448j21381j20420M70584Q591k27291K45941R3461
20325B5348L77489J95432l19315n46279k39933M09579J48748N07j07838p3978
$$ plain form
20315 -130240 245924 427660 329861 113696 189900 332034 556594 159781 -325199 -352038
20305 -352038 -455553 -214452 59822 -117969 30374 122832 8480 -46239 63026 78238
20295 78238 -46285 -384711 -298354 128188 33782 -66985 -102999 -113426 4882 -52085 -203613
20284 -203613 -150780 17320 -5557 -159192 -488869 -669745 -667459 -457472 -126469 -128874 -165590
20273 -165590 -355280 -315638 -218246 -246431 30463 275376 -41008 -324534 -318794 110920
20263 110920 226644 -134591 -198214 -416088 -464666 -211584 -140124 -217840 -204093 -227686 -108695
20252 -108695 -101621 -149269 -267481 44020 12950 -120484 -162537 -109760 46950 118911 -199897
20241 -199897 -195672 -101789 -305300 -327724 -290504 -229336 -14731 -218417 -192794 -244400 -339437
$$ packed form
20315a30240L76164J81736r7799k16165P6204J42134K24560l96813m84980k6839
20305c52038j03515K41101K74274j77791J48343R2458j14352n4719J09265J5212
20295G8238j24523l38426Q6357M26542r4406j00767l6014j0427J18308n6967j51528
20284b03613N2833J68100k2877j53635l29677j80876K286K09987L31003k405l6716
20273a65590j89690L9642R7392k8185K76894K44913l16384k83526N740M29714
20263A10920J15724l61235o3623k17874m8578K53082P1460p7716J3747k3593J18991
20252a08695P074m7648j18212L11501l1070j33434m2053N2777J56710P1961l18808
20241a99897M225R3883k03511k2424L7220O1168K14605k03686K5623n1606r5037
$$ plain form
20230 -339437 -156122 -376825 -633166 -846877 -791742 -428584 -639650 -736802 -720406 -699404
20220 -699404 -594909 -845466 -680721 -288506 -472166 -639838 -601967 -266679 -38753 -50066
20210 -50066 -113446 -280782 -367673 -241784 -367360 -202266 113729 -196821 -446834 -227513
20200 -227513 -149759 -428902 -589718 -387875 -284312 -140382 -159864 -459753 -396306 -281019
20190 -281019 -323864 -127092 -186202 -76283 -408886 -536053 -368676 -292811 -338488 28512
20180 28512 331785 347536 -77652 -575405 -841626 -592172 -546056 -479456 -240382 -266596
20170 -266596 -324119 -349994 -149594 -224456 -588030 -584582 -396427 102720 288660 140161
20160 140161 39031 205562 45930 85269 57619 -339793 -140117 -83875 -120206 -74585
$$ packed form
20230c39437J83315k20703k56341k13711N5135L63158k11066r7152J6396K1002
20220f99404J04495k50557J64745L92215j83660j67672L7871L35288K27926j1313
20210e0066o3380j67336q6891J25889j25576J65094L15995l10550k50013K19321
20200b27513P7754k79143j60816K01843J03563J43930j9482k99889O3447J15287
20190b81019m2845J96772n9110J09919l32603j27167J67377P5865m5677L67000
20180B8512L03273J5751m25188m97753k66221K49454M6116O6600K39074k6214
20170b66596n7523k5875K00400p4862l63574L448J88155M99147J85940j48499
20160A40161j01130J66531j59632L9339k7650l97412J99676N6242l6331M5621
$$ plain form
20150 -74585 -148704 -30164 59528 -107931 -347069 -198643 16441 94225 -26932 -236954
20140 -236954 -132713 -218694 -125739 -368826 -382622 -218447 -301311 -653652 -790647 -797725 -520744
20129 -520744 -239453 -119037 -403561 -514782 -361898 -593030 -604844 -166432 373698 442254
20119 442254 442763 76548 -200316 -69196 -293020 -337522 -217561 -227171 -175722 -243186 -611683
20108 -611683 -530358 -252451 -124182 -176247 -173691 -400332 -414217 -604190 -528234 -441464 -415012
20097 -415012 -173541 45007 107019 202173 574713 518504 418653 308454 208440 37705
20087 37705 -280806 -285794 -80173 -372316 -543516 -664703 -120112 -180241 -500676 -312991
20077 -312991 -62345 350998 165318 -161311 -275464 -132175 90317 -15005 1001 -233507
$$ packed form
20150g4585p4119J18540Q9692j67459k39138J48426K15084P7784j21157k10022
20140b36954J04241q5981R2955k43087j3796J64175q2864l52341j36995p078K76981
20129e20744K81291J20416k84524j11221J52884k31132j1814M38412N40130O8556
20119D42254N09l66215k76864J31120k23824m4502J19961r610N1449o7464l68497
20108f11683Q1325K77907J28269n2065K556k26641j3885j89973P5956Q6770K6452
20097d15012K41471K18548O2012R5154L72540n6209r9851j10199j00014j70735
20087C7705l18511m988K05621k92143j71200j21187N44591o0129l20435J87685
20077c12991K50646M13343j85680l26629j14153J43289K22492j05322J6006k34508
$$ plain form
20067 -233507 -166952 -372385 -266453 -348717 -481451 -571832 -598185 -575729 -569184 -533711 -678077
20056 -678077 -533594 -501463 -123852 -269779 -84112 179673 315998 -289166 -481747 -399059
20046 -399059 -518105 -556597 -663729 -579626 -484672 -148556 -146132 -234961 -104255 -38295 44522
20035 44522 5101 22027 -90884 -296537 -303993 -444696 -685579 -662759 -745671 -578277 -270152
20024 -270152 -54220 152669 85332 312516 495373 231999 -34496 -101299 -219630 -320057
20014 -320057 -137161 -68696 -185841 -264859 -19433 102632 -121310 -441124 -534000 -411793
20004 -411793 -182396 -39936 -284389 -150002 200394 -96479 -671594 -382119 -471500 -560569
19994 -560569 -478399 -525478 -657415 -1046056 -920871 -669642 -643621 -913616 -960829 -799225
$$ packed form
20067b33507O6555k05433J05932q2264j32734r0381k6353K2456O545L5473j44366
20056f78077J44483L2131L77611j45927J85667K63785J36325o05164j92581Q2688
20046c99059j19046l8492j07132Q4103R4954L36116K424q8829J30706O5960Q2817
20035D4522l9421J6926j12911k05653p456j40703k40883K2820q2912J67394L08125
20024b70152K15932K06889o7337K27184J82857k63374k66495o6803j18331j00427
20014c20057J82896O8465j17145p9018K45426J22065k23942l19814r2876J22207
20004d11793K29397J42460k44453J34387L50396k96873n75115K89475q9381q9069
19994e60569Q2170m7079j31937l88641J25185K51229K6021k69995m7213J61604
$$ plain form
19984 -799225 -585440 -123555 115886 -9694 54088 -9180 -185373 -45317 193906 241738
19974 241738 2756 -627691 -652235 -495506 -327877 -207663 -116275 -444307 -565267 -638014
19964 -638014 -686140 -554252 -380046 -188347 -93924 -286751 -417105 -573468 -604483 -488686
19954 -488686 -456595 -354905 -163134 -193782 -275122 -156846 -409247 -183183 178490 33626
19944 33626 -151898 71779 299881 318363 -23117 -185926 -271154 -118790 213242 -144869
19934 -144869 -195132 -281199 -234533 -18329 29190 -44201 -115793 -55028 43596 87847 -176918
19923 -176918 -430713 -205568 17408 13495 -20619 -43223 -152810 -144873 -118870 187829 101497
19912 101497 -67666 22010 44094 676 39933 201628 389251 210277 78448 -65880
$$ packed form
19984g99225K13785M61885K39441j25580O3782o3268j76193J40056K39223M7832
19974B41738k38982o30447k4544J56729J67629J20214R1388l28032j20960p2747
19964f38014m8126J31888J74206J91699R4423j92827j30354j56363l1015J15797
19954d88686L2091J01690J91771l0648q1340J18276k52401K26064L61673j44864
19944C3626j85524K23677K28102J8482l41480j62809q5228J52364L32032l58111
19934a44869n0263q6067M6666K16204M7519p3391p1592O0765R8624M4251k64765
19923a76918k53795K25145K22976l913l4114k2604j09587P937K6003L06699q6332
19912A01497j69163Q9676K2084m3418L9257J61695J87623j78974j31829j44328
$$ plain form
19902 -65880 -317799 -492877 -226927 -32862 118592 82308 213147 339830 215920 27100
19892 27100 -339807 -391889 -294921 -523970 -449333 -331629 -509788 -312671 -303649 -177538 -191188
19881 -191188 -154386 46668 201939 106844 17713 41536 324120 434096 206713 -158866
19871 -158866 -111286 128570 391591 28590 -320352 -84037 4543 -159913 -125338 -121099
19861 -121099 -514607 -841039 -511313 -453926 -52583 70553 -305794 -128451 151353 248758
19851 248758 64353 216645 -25320 -282422 -420080 -395452 -454598 -908206 -721034 -451554
19841 -451554 -51496 349906 356016 -27815 -137060 -179907 -173971 5417 168180 -91806
19831 -91806 -153223 -372013 -607732 -408588 -291034 -50609 -102622 -690298 -923073 -409456
$$ packed form
19902f5880k51919j75078K65950J94065J51454l6284J30839J26683j23910j88820
19892B7100l66907n2082R6968k29049P4637J17704j78159J97117R022J26111j3650
19881a91188L6802K01054J55271r5095q9131K3823K82584J09976k27383l65579
19871a58866M7580K39856K63021l63001l48942K36315Q8580j64456L4575M239
19861a21099l93508l26432L29726N7387M01343J23136l76347J77343K79804R7405
19851B48758j84405J52292k41965k57102j37658K4628n9146m53608J87172K69480
19841d51554M00058M01402O110l83831j09245m2847N936J79388J62763k59986
19831i1806o1417k18790k35719J99144J17554K40425n2013n87676k32775N13617
$$ plain form
19821 -409456 -347462 -468410 -252518 -189774 -56242 -232113 -425128 -524849 -601423 -206903
19811 -206903 5261 -248956 -107680 75984 119002 -189522 -238898 -201453 -126863 -193485
19801 -193485 95661 264143 -78615 -190187 95474 499570 505625 378295 434635 393821
19791 393821 277824 286780 2109 -10522 -388989 -520070 -709989 -539861 92360 -48545
19781 -48545 -289085 -266300 -63663 82172 -111125 -176577 31588 65124 47707 234061
19771 234061 164732 -11081 -109285 35236 -254909 -449604 -102134 57902 9166 144243
19761 144243 -2476 -159318 -117144 37974 -54190 -246811 -307037 -278669 -439280 -512158
19751 -512158 -352769 168074 404618 335787 238268 40605 193482 294267 54305 -83321
$$ packed form
19821d09456O1994j20948K15892O2744J33532j75871j93015r9721p6574L94520
19811b06903K12164k54217J41276J83664M3018l08524m9376L7445P4590o6622
19801a93485K89146J68482l42758j11572K85661M04096O055j27330N6340m0814
19791C93821j15997Q956k84671j2631l78467j31081j89919J70128O32221j40905
19781d8545k40540K2785K02637J45835j93297o5452K08165L3536j7417J86354
19771B34061o9329j75813r8204J44521k90145j94695L47470J60036m8736J35077
19761A44243j46719j56842M2174J55118r2164j92621o0226K8368j60611p2878
19751e12158J59389N20843K36544o8831r7519j97663J52877J00785k39962j37626
$$ plain form
19741 -83321 -188499 -133696 -2881 -270024 -366664 -347288 -322974 -294223 23375 174378 -18897
19730 -18897 -272512 -345248 -487902 -408535 -138267 -7788 -81407 -400999 -451960 -426479 -678753
19719 -678753 -557948 -421002 -367810 -656132 -582286 -607621 -503561 -602890 -685641 -313204
19709 -313204 -262315 -549954 -424097 -617638 -830413 -785112 -421757 -278178 -484591 -592663
19699 -592663 -465358 -310942 -180949 -1430 -126464 -359817 -577823 -718729 -470702 -264331
19689 -264331 -248769 -374251 -282622 7783 -306608 -148584 -240418 -256013 -87945 10239
19679 10239 -85192 -349311 -343247 -290164 215413 13533 -375890 -549163 -215785 -506124
19669 -506124 -452907 -214749 -322656 -288668 -132469 252072 196625 515805 410249 -25025
$$ packed form
19741h3321j05178N4803J30815k67143r6640J9376K4314K8751L17598J51003j93275
19730a8897k53615p2736j42654P9367K70268J30479p3619l19592n0961K5481k52274
19719f78753J20805J36946N3192k88322P3846k5335J04060r9329q2751L72437
19709c13204N0889k87639J25857j93541k12775M5301L63355J43579k06413j08072
19699e92663J27305J54416J29993J79519j25034k33353k18006j40906K48027K06371
19689b64331J5562j25482R1629K90405l14391J58024r1834j5595J68068R8184
19679A0239r5431k64119O064N3083N05577k01880l89423j73273L33378k90339
19669e06124N3217K38158j07907L3988J56199L84541n5447L19180j05556m35274
$$ plain form
19659 -25025 -158136 12427 -262031 -548891 -494039 -209962 -337862 -593863 -755322 -656520
19649 -656520 -457462 -419797 -160569 -229114 -106114 -81894 -431177 -663169 -463981 -82231
19639 -82231 101063 176441 -1848 -104853 151092 38553 -214915 114227 262791 467264
19629 467264 330166 115435 -27704 -284702 66579 355872 451188 116232 -53615 -59684
19619 -59684 -208854 -309687 75434 59102 -376719 -357026 -380170 -480555 -357433 -213505
19609 -213505 -297303 -683419 -806995 -319832 -34556 242215 400895 109303 -66559 -279156
19599 -279156 -422979 -413223 -204220 -8418 160982 176616 53267 -86307 -132413 93323
19589 93323 349931 -30258 -331171 -265365 -82761 -312446 -446330 -268938 -176645 -603361
$$ packed form
19659b5025j33111J70563k74458k86860N4852K84077j27900k56001j61459R8802
19649f56520J99058L7665K59228o8545J23000K4220l49283k31992J99188L81750
19639h2231J83294P5378j78289j03005K55945j12539k53468L29142J48564K04473
19629D67264j37098k14731j43139k56998L51281K89293R5316l34956j69847o069
19619e9684j49170j00833L85121j6332m35821J9693k3144j00385J23122J43928
19609b13505q3798l86116j23576M87163K85276K76771J58680k91592j75862k12597
19599b79156j43823R756K09003J95802J69400J5634j23349j39574m6106K25736
19589I3323K56608l80189l00913O5806J82604k29685j33884J77392R2293m26716
$$ plain form
19579 -603361 -137671 171042 274045 81148 143367 405359 323063 445663 358048 358952 202462
19568 202462 -219637 -823762 -775657 -630188 -676242 -616162 -168298 -10422 -316073 -204454
19558 -204454 -432397 -143664 125695 41774 120922 195492 93664 -382260 -774721 -499265
19548 -499265 -221240 -525093 -569521 -131749 108765 -148391 -171590 136895 -14444 -157127
19538 -157127 -187536 -27636 -73139 -276036 -642569 -861845 -903560 -634093 -293562 43331
19528 43331 -225200 -604463 -719412 -603032 -309629 -262997 -413829 -569120 -235262 -341068
19518 -341068 -467564 -612543 -706823 -499596 -107788 159358 126659 -63325 44348 87872
19508 87872 91015 76026 -73629 -32242 140467 -266562 -589289 -217024 -71435 184968
$$ packed form
19579f03361M65690L08713J03003j92897O2219K61992q2296J22600q7615R04j56490
19568B02462m22099o04125M8105J45469m6054O0080M47864J57876l05651J11619
19558b04454k27943K88733K69359q3921P9148P4570j01828m75924l92461K75456
19548d99265K78025l03853m4428M37772K40514k57156k3199L08485j51339j42683
19538a57127l0409J59900m5503k02897l66533k19276m1715K69467L40531L36893
19528D3331k68531l79263j14949J16380K93403M6632j50832j55291L33858j05806
19518c41068j26496j44979r4280K07227L91808K67146l2699j89984J07673M3524
19508H7872L143j4989j49655M1387J72709m07029l22727L72265J45589K56403
$$ plain form
19498 184968 533800 434577 256449 13210 -311142 -274901 -79164 46715 122382 107403
19488 107403 47212 164795 246469 411031 482885 -85717 -204601 -215999 -286894 -227072 -221572
19477 -221572 -183474 -419791 -793809 -782935 -515887 -658468 -833526 -626229 -627023 -848581
19467 -848581 -660762 -550004 -175094 -405118 -770297 -665220 -499669 -283331 -152824 -4178
19457 -4178 -33267 -77765 -106702 -116589 -246542 -392975 -448658 -446348 -168684 -37923 127949
19446 127949 237996 100349 -110813 107677 98517 377262 573651 457097 94883 -76441
19436 -76441 -271233 -140635 -91619 315180 624588 314823 -214902 -394704 -126586 85568
19426 85568 194478 230253 -32677 -418690 -211842 162480 -6692 -159314 -261522 -305298
$$ packed form
19498A84968L48832r9223j78128k43239l24352L6241J95737J25879P5667j4979
19488A07403o0191J17583Q1674J64562P1854n68602j18884j1398p0895N9822N500
19477b21572L8098k36317l74018J0874K67048j42581j75058K07297p94k21558
19467h48581J87819J10758L74910k30024l65179J05077J65551K16338J30507J48646
19457d178k9089m4498k8937r887j29953j46433n5683K310K77664J30761J65872
19446A27949J10047j37647k11162K18490r160K78745J96389j16554l62214j71324
19436g6441j94792J30598M9016M06799L09408l09765n29725j79802K68118K12154
19426H5568J08910L5775k62930l86013K06848L74322j69172j52622j02208m3776
$$ plain form
19416 -305298 -243586 2482 172969 53821 -119938 112275 26038 51050 -11996 -96359
19406 -96359 -58214 47909 -129017 -155809 -192648 -457664 -420336 121876 -40826 -1263 291451
19395 291451 425606 68563 -239787 -245930 -201960 -84815 -74449 82550 84247 -335420 -426549
19384 -426549 -674690 -473509 -2631 211547 -107440 -297963 -118353 -120217 -301358 4185
19374 4185 189656 199095 285830 380100 -86540 -619817 -656145 -296221 -145046 91949 163411
19363 163411 240134 222785 -990 187279 354473 363332 388639 471435 84812 1482 69271
19352 69271 212976 228142 -44447 -348209 -424977 -417054 -273893 -349840 -131640 -132324 -325283
19341 -325283 -496550 -299095 87780 164616 98733 282268 281536 -92385 -391677 -654458
$$ packed form
19416c05298O1712K46068J70487j19148j73759K32213q6237K5012o3046q4363
19406i6359L8145J06123j76926k6792l6839k65016L7328N42212j62702L9563K92714
19395B91451J34155l57043l08350o143M3970J17145J0366J56999J697m19667r1129
19384d26549k48141K01181M70878K14178l18987j90523J79610j864j81141L05543
19374D185J85471R439Q6735R4270m66640n33277l6328L59924J51175K36995P1462
19363A63411P6723j7349k23775J88269J67194Q859K5307Q2796l86623q3330O7789
19352F9271J43705J5166k72589l03762p6768P923J43161p5947K18200o84j92959
19341c25283j71267J97455L86875P6836o5883J83535p32l73921k99292k62781
$$ plain form
19331 -654458 -566613 -192550 252792 251470 75216 -238717 -472821 -574962 -320467 -394201
19321 -394201 -344588 -197022 83348 484999 784434 1040605 970571 759736 407804 113433
19311 113433 -22299 208628 547733 1032035 1326196 1513266 1181863 969634 1065841 846754
19301 846754 566180 426063 671983 1157143 1245192 1331549 1101446 1018025 992063 1239046
19291 1239046 1395810 1252089 686367 491177 685608 864575 839709 955662 951292 438349
19281 438349 403992 1040077 1174045 1123396 1057096 936782 724314 712657 949326 992382
19271 992382 872441 819625 711765 624370 564222 473355 417273 291999 442570 1076751
19261 1076751 1249711 1050184 1209842 1666489 1846000 1783310 1614684 1428910 1346816 1142983
$$ packed form
19331f54458Q7845L74063M45342j322j76254l13933k34104j02141K54495p3734
19321c94201M9613J47566K80370M01651K99435K56171p0034k10835l51932k94371
19311A13433j35732K30927L39105M84302K94161J87070l31403k12229R6207k19087
19301H46754k80574j40117K45920M85160Q8049Q6357k30103q3421k5962K46983
19291A239046J56764j43721n65722j95190J94431J78967k4866J15953m370n12943
19281D38349l4357O36085J33968n0649o6300j20314k12468j1657K36669M3056
19271I92382j19941n2816j07860q7395o0148r0867n6082j25274J50571O34181
19261A076751J72960j99527J59658M56647J79511o2690j68626j85774q2094k03833
$$ plain form
19251 1142983 680373 318739 601248 856417 1118174 1324037 1385729 1440478 1680789 1972879
19241 1972879 1890363 1545562 1354122 1054068 1051971 1112118 847329 719167 378379 323706
19231 323706 683099 527859 213457 97989 -12090 90849 20772 125039 292895 378996
19221 378996 448212 567392 492001 395141 222107 161257 176946 354115 550508 389833
19211 389833 410295 417750 414957 637370 763889 539872 318845 230269 220291 220717 319109 266799
19199 266799 85986 87486 82589 -64720 -5166 93329 546739 496760 371907 317575 387665
19188 387665 97659 62550 -222305 -275149 -416447 -537109 -605299 -659574 -501619 -536309
19178 -536309 -436929 -119338 15873 -66723 -437492 -208917 18881 -145746 104510 231264
$$ packed form
19251A142983m62610l61634K82509K55169K61757K05863O1692N4749K40311K92090
19241A972879q2516l44801j91440l00054k097O0147k64789j28162l40788n4673
19231C23706L59393j55240l14402j15468j10079J02939p0077J04267J67856Q6101
19221C78996O9216J19180p5391r6860j73034o0850J5689J77169J96393j60675
19211C89833K0462P455k793K22413J26519k24017k21027q8576r978M26R8392n2310
19199B66799j80813J500m897j47309N9554R8495M53410m9979j24853n4332P0090
19188C87665k90006l5109k84855n2844j41298j20662o8190n4275J57955l4690
19178e36309R9380L17591J35211q2596l70769K28575K27798j64627K50256J26754
$$ plain form
19168 231264 112121 185170 190065 45687 259631 188669 247124 285409 280578 331052 267565
19157 267565 51446 -227180 314253 660485 950305 617266 365892 -4226 -42551 169285
19147 169285 -150661 -151659 37393 279673 446115 358137 -781 -73659 -62243 -224065 112575
19136 112575 793496 712187 31394 23319 133485 241871 270164 119474 -43235 177394
19126 177394 453580 252982 211924 135142 -120127 -259669 -436055 -504353 -747504 -542370
19116 -542370 -310637 -73642 40263 143094 -67531 -181766 -352664 -465599 -442382 -402579
19106 -402579 -85612 141549 -146339 -306911 -58141 -84080 -392121 -624613 -660220 -256517
19096 -256517 -398351 -353409 -502459 -651419 -49217 35839 52463 -40659 -7516 -148023
$$ packed form
19168B31264j19143P3049M895j44378K13944p0962N8455L8285m831N0474o3487
19157B67565k16119k78626N41433L46232K89820l33039k51374l70118l8325K11836
19147A69285l19946r98J89052K42280J66442q7978l58918p2878J1416j61822L36640
19136A12575O80921q1309o80793q075J10166J08386K8293j50690j62709K20629
19126A77394K76186k00598m1058p6782k55269j39542j76386o8298k43151K05134
19116e42370K31733K36995J13905J02831k10625j14235j70898j12935K3217L9803
19106d02579L16967K27161k87888j60572K48770k5939l08041k32492l5607M03703
19096b56517j41834M4942j49050j48960O02202Q5056J6624r3122L3143j40507
$$ plain form
19086 -148023 -134515 22924 -111066 -151995 -71337 -90014 -235689 -244303 121389 81292 -166779
19075 -166779 -485421 -163847 -135626 -21006 231821 -10971 131572 80079 6828 7163 55273
19064 55273 19745 -120567 -165774 -144055 185147 452972 125666 179126 251514 144223 168072
19053 168072 311803 269708 227050 170109 53208 79537 236442 321395 398149 231330 40912
19042 40912 -12397 60164 127001 241282 235754 41866 14179 75852 200744 194155 62295
19031 62295 -71834 -423508 -341585 41522 84921 142354 -55705 80264 216953 461930
19021 461930 499822 691572 433857 199921 218991 129633 355115 617435 954786 868367
19011 868367 826266 971797 820409 856743 636429 864287 808902 764889 834583 591813
$$ packed form
19086a48023J3508J57439j33990m0929Q0658j8677j45675q614L65692m0097k48071
19075a66779l18642L21574K8221J14620K52827k42792J42543n1493p3251L35M8110
19064E5273l5528j40312m5207K1719L29202K67825l27306N3460P2388j07291K3849
19053A68072J43731m2095m2658n6941j16901K6329J56905Q4953P6754j66819j90418
19042D0912n3309P2561O6837J14281n528j93888k7687O1673J24892o589j31860
19031F2295j34129l51674Q1923L83107M3399N7433j98059J35969J36689K44977
19021D61930L7892J91750k57715k33936J9070q9358K25482K62320L37351q6419
19011H68367m2101J45531j51388L6334k20314K27858n5385m4013O9694k42770
$$ plain form
19001 591813 169497 60259 84525 163798 547689 645104 660020 588968 771677 547163
18991 547163 -62020 -285211 -389927 -257033 -28197 125305 378703 421719 506856 585490
18981 585490 662576 919965 732274 426323 719297 903673 784610 706984 970979 427842
18971 427842 267796 532751 886443 927022 882780 464283 455953 346361 639385 805303
18961 805303 979002 1145044 895582 460724 442205 460116 108776 133979 95215 122257
18951 122257 318512 697408 774241 899451 1006529 1099972 1431805 1304501 1704823 1935667
18941 1935667 2027966 2138683 1781935 1706595 1701279 2065480 2149958 2242069 2654079 2790842
18931 2790842 2689199 2655047 2539203 2658383 2525925 2278547 2099043 2126938 2543408 2869948
$$ packed form
19001E91813m22316j09238K4266P9273L83891R7415J4916p1052J82709k24514
18991E47163o09183k23191j04716J32894K28836J53502K53398M3016Q5137P8634
18981E85490P7086K57389j87691l05951K92974J84376j19063p7626K63995n43137
18971D27842j60046K64955L53692M0579m4242m18497q330j09592K93024J65918
18961H05303J73699J66042k49462m34858j8519J7911l51340K5203l8764K7042
18951A22257J96255L78896P6833J25210J07078R3443L31833j27304M00322K30844
18941A935667R2299J10717l56748p5340n316L64201Q4478R2111M12010J36763
18931B790842j01643l4152j15844J19180j32458k47378j79504K7895M16470L26540
$$ plain form
18921 2869948 2882636 2939883 2835947 2689453 2515500 2381222 2186877 2174652 2601801 2655131
18911 2655131 2382638 2454043 2349554 2228799 2397137 2174999 2127631 2120075 2293460 2188818
18901 2188818 2125995 2238769 2129063 2177926 2432527 2466168 2458593 2343315 2368778 2679545
18891 2679545 2824867 2932950 3117254 3592794 4133314 3963960 3642009 3934348 4038987
18882 4038987 3602585 3497705 4092082 4149629 3886958 3754788 3776897 3967890 4297765 4494684
18872 4494684 4630669 4915411 5001414 4947245 5257083 4826233 4423400 4571366 4535868 4433506
18862 4433506 4341910 4372781 4693038 4700485 4714728 4492654 4755590 4882551 4514227 4717045
18852 4717045 5015650 5166846 5211483 5480746 5580798 5619206 5708806 5973662 6036026 5919250
$$ packed form
18921B869948J2688N7247j03936j46494j73953j34278j94345j2225M27149N3330
18911B655131k72493P1405j04489j20755J68338k22138m7368p556J73385j04642
18901B188818o2823J12774j09706M8863K54601L3641p575j15278K5463L10767
18891B679545J45322J08083J84304M75540N40520j69354l21951K92339J04639
18882D038987m36402j04880N94377N7547k62671j32170K2109J90993L29875J96919
18872D494684J35985K84742Q6003n4169L09838m30850m02833J47966l5498j02362
18862D433506r1596L0871L20257P447J4243k22074K62936J26961l68324K02818
18852D717045K98605J51196M4637K69263J00052L8408Q9600K64856O2364j16776
$$ plain form
18842 5919250 5647160 5606503 5443646 5445624 5572459 5751181 5953608 6310333 6777044 7099767
18832 7099767 7805967 8145628 8238413 8564318 8565523 8640088 8938539 9243890 9580843 10314037
18822 10314037 11107965 11618042 12263312 12880806 13542879 14543746 15342600 16657310 18360048
18813 18360048 19885088 21942374 24861909 28070305 32354921 38084369 45967703 55391392
18805 55391392 65320204 75286317 85811392 98874533 115646022 138249249 168080345
18798 168080345 200259771 225158769 240190249 246697796 241768283 223731928 202527565
18791 202527565 188636959 184633871 188723736 200793216 219547261 239958520 254712819
18784 254712819 261690049 264304722 262656369 252990732 236116809 217931619 201283553
$$ packed form
18842E919250k72090m0657j62857J978J26835J78722K02427L56725M66711L22723
18832G099767P06200L39661R2785L25905J205P4565K98451L05351L36953P33194
18822A0314037P93928N10077O45270O17494O62073J000867P98854J314710J702738
18813A8360048J525040K057286K919535L208396M284616N729448P883334R423689
18805E5391392R928812R966113J0525075J3063141J6771489K2603227K9831096
18798A68080345L2179426K4898998J5031480O507547m929513j8036355k1204363
18791B02527565j3890606m003088M089865J2069480J8754045K0411259J4754299
18784B54712819O977230K614673j648353r665637j6873923j8185190j6648066
$$ plain form
18777 201283553 184140323 165904041 152476890 147018583 146556174 146216510 143758015 139760429
18769 139760429 134027826 125950636 117427825 111732842 109730851 111489368 117298763 127082220
18761 127082220 139276245 151960490 164228859 177178570 189195438 196854652 202152107
18754 202152107 208421111 216385968 225208616 235190466 246814784 262777032 286873378
18747 286873378 317443608 344452561 357553781 358291434 351030478 332257432 303183954
18740 303183954 281566721 280908976 300913330 330371360 351516540 354707551 343599113
18733 343599113 318175537 274049909 221402265 177949894 148098273 127859650 113716003
18726 113716003 103177888 95541526 89767883 85846546 83484918 82734368 82701568 82777523
$$ packed form
18777B01283553j7143230j8236282j3427151n458307m62409l39664k458495l997586
18769A39760429n732603q077190q522811n694983k001991J758517N809395R783457
18761A27082220J2194025J2684245J2268369J2949711J2016868P659214N297455
18754B02152107O269004P964857Q822648R981850J1624318J5962248K4096346
18747B86873378L0570230K7008953J3101220P37653p260956j8773046k9073478
18740C03183954k1617233o57745K0004354K9458030K1145180L191011j1108438
18733C43599113k5423576m4125628n2647644m3452371k9851621k0238623j4143647
18726A13716003j0538115p636362n773643l921337k361628p50550l2800P5955
$$ plain form
18718 82777523 82273263 80224326 76846889 72447823 66639741 60761272 55935718 52032756
18710 52032756 48513755 45701077 43465929 40810393 37835434 34700194 32463266 30248239
18702 30248239 28344946 26677988 25086235 24054602 23267695 22455525 21448871 20160608
18694 20160608 19297711 18564064 17954842 17109524 16635763 15956031 15301619 14916705 14523093
18685 14523093 13987798 13654114 13485086 13511735 13099654 12737066 12081878 11155547 10452970
18676 10452970 9855125 9283247 9101883 9095558 8831364 8371266 7796496 6815994 6410201 6431716
18666 6431716 6393827 6291811 5793704 5472619 4827962 4447080 4694910 4608767 4702079 4555143
18656 4555143 4427067 4536771 4700412 4571029 4450071 4254569 3980076 3739755 3498133
$$ packed form
18718H2777523n04260k048937l377437m399066n808082n878469m825554l902962
18710E2032756l519001k812678k235148k655536k974959l135240k236928k215027
18702C0248239j903293j666958j591753j031633p86907q12170j006654j288263
18694B0160608q62897p33647o09222q45318m73761o79732o54412l84914l93612
18685A4523093n35295l33684j69028K6649m12081l62588o55188r26331p02577
18676A0452970n97845n71878j81364o325k64194m60098n74770r80502m05793K1515
18666F431716l7889j02016m98107l21085o44657l80882K47830q6143R3312j46936
18656D555143j28076J09704J63641j29383j20958j95502k74493k40321k41622
$$ plain form
18647 3498133 3034132 2980243 2944613 3146018 3523541 3525800 3231471 2881295 2609145 2660571
18637 2660571 2619848 2862617 2904491 2645010 2192496 2029325 2577577 2802013 2357209 2383430
18627 2383430 2481538 2554459 2485065 2344362 2319731 2178414 2203007 2432906 2717824 2875314
18617 2875314 2720176 2792976 2940122 2642096 2366758 2418048 2470493 2102744 1993947 2208104
18607 2208104 2429340 2356359 2431139 2420803 2293093 1954095 1537637 1201304 1219686 1294583
18597 1294583 1561494 1576044 1718296 1777048 2099093 2083618 2049403 2199948 2311607 2300586
18587 2300586 2069218 1838385 1792856 2166667 2209489 2580734 2339911 2300451 2595643 2603298
18577 2603298 2399605 2561434 2784653 2530314 2707950 2954854 2838531 2843826 2798115 2469976
$$ packed form
18647C498133m64001n3889l5630K01405L77523K259k94329l50176k72150N1426
18637B660571m0723K42769M1874k59481m52514j63171N48252K24436m44804K6221
18627B383430R8108P2921o9394j40703k4631j41317K4593K29899K84918J57490
18617B875314j55138P2800J47146k98026k75338N1290N2445l67749j08797K14157
18607B208104K21236p2981P4780j0336j27710l38998m16458l36333J8382P4897
18597A294583K66911J4550J42252N8752L22045j5475l4215J50545J11659j1021
18587B300586k31368k30833m5529L73811M2822L71245k40823l9460K95192P655
18577B603298k03693J61829K23219k54339J77636K46904j16323N295m5711l28139
$$ plain form
18567 2469976 2562063 2698239 2784680 2703746 2798415 2772724 3115240 2955308 3031179 3237898
18557 3237898 3049702 3007272 3322765 3323968 2925069 3090920 3426191 3503903 3352265 3301949
18547 3301949 3168316 3296580 3532911 3809031 4258415 4217641 3685358 3178019 3139324 3296020
18537 3296020 3270808 3084170 3076041 3277640 3125503 2954687 3168103 3412131 3517083 3489939
18527 3489939 3895196 4128621 3747806 3549476 3611456 3981463 4561090 4794319 5249191 5326803
18517 5326803 5202213 5470027 5725308 6020455 5881812 5600444 5414234 5568103 5763095
18508 5763095 6145960 6237356 6488368 6616657 6450194 6654796 6852010 7245290 7661759 7801151
18498 7801151 8239963 8984806 10060407 11069692 11913584 12639255 13342586 14703280 16937103
$$ packed form
18567B469976R2087J36176Q6441q0934R4669k5691L42516j59932P5871K06719
18557C237898j88196m2430L15493J203l98899J65851L35271P7712j51638n0316
18547C301949j33633J28264K36331K76120M49384m0774n32283n07339l8695J56696
18537C296020k5212j86638q129K01599j52137j70816K13416K44028J04952k7144
18527C489939M05257K33425l80815j98330O1980L70007N79627K33229M54872P7612
18517E326803j24590K67814K55281K95147j38643k81368j86210J53869J94992
18508E763095L82865R1396K51012J28289j66463K04602J97214L93280M16469J39392
18498G801151M38812P44843J075601J009285Q43892P25671P03331J360694K233823
$$ plain form
18489 16937103 20087614 25209895 33368357 44641262 55021143 61352011 62908230 58527675
18481 58527675 50797496 44137142 40439880 39276431 40978193 45372745 50951488 55049762
18473 55049762 57608244 58579873 59822301 62934285 68316847 75352163 83703698 92322068
18465 92322068 98035925 98214451 92786846 82316844 72152894 66041360 63267384 62983348
18457 62983348 65340052 69807466 74758770 77729564 78136075 76082303 73109155 71337568
18449 71337568 71743527 73824728 75568453 76033355 75288209 73616252 72390386 72906432 74705876
18440 74705876 77363453 81112193 85848014 93390754 105867118 126795493 157554074 193352055
18432 193352055 226921421 253921395 272753178 286666373 298167938 306012013 306277356
$$ packed form
18489A6937103L150511N122281Q158462J1272905J0379881O330868J556219m380555
18481E8527675p730179o660354l697262j163449J701762M394552N578743M098274
18473E5049762K558482R71629J242428L111984N382562P035316Q351535Q618370
18465I2322068N713857J78526n427605j0470002j0163950o111534k773976k84036
18457F2983348K356704M467414M951304K970794M06511k053772k973148j771587
18449G1337568M05959K081201J743725M64902p45146j671957j225866N16046J799444
18440G4705876K657577L748740M735821P542740J2476364K0928375L0758581L5797981
18432A93352055L3569366K6999974J8831783J3913195J1501565P844075K65343
$$ plain form
18425 306277356 293416987 270883155 246121298 224383251 211137307 208516655 214140963
18418 214140963 222158848 226109805 222852290 213662280 201214053 188668463 177600734
18411 177600734 167846501 160495866 156495802 156211591 157470959 157963499 155837037 150282867
18403 150282867 141703339 134514145 130142090 128980580 131439994 137704946 149839779 171749356
18395 171749356 204494228 241966638 272052844 286372060 283977838 270217959 259762683
18388 259762683 261178692 271551585 286730571 307107972 337167921 384313654 447835622
18381 447835622 513127569 554170725 552649926 512863238 448744102 382814808 333764137
18374 333764137 303629720 287178473 281417311 285413597 296224769 305490474 307294483
$$ packed form
18425C06277356j2860369k2533832k4761857k1738047j3245944k620652N624308
18418B14140963Q017885L950957l257515r190010j2448227j2545590j1067729
18411A77600734r754233p350635m000064k84211J259368M92540k126462n554170
18403A50282867q579528p189194m372055j161510K459414O264952J2134833K1909577
18395A71749356L2744872L7472410L0086206J4319216k394222j3759879j0455276
18388B59762683J416009J0372893J5178986K0377401L0059949M7145733O3521968
18381D47835622O5291947M1043156j520799l9786688o4119136o5929294m9050671
18374C33764137l0134417j6451247n761162L996286J0811172R265705J804009
$$ plain form
18367 307294483 298986640 281180646 260882847 244375561 232545188 224547819 217012635
18360 217012635 207778098 196664717 182933877 167702369 154071494 142768088 133677467
18353 133677467 126591429 121441556 117927390 115502803 114104949 114429725 117516767 125064272
18345 125064272 135322346 143257427 145232579 140485895 130694214 121213697 116493838 118505765
18337 118505765 123600788 126467712 125014127 118805982 108827218 98876255 91262155 85435830
18329 85435830 79735384 74482250 69311297 65115628 61494370 58103273 54977444 51535119
18321 51535119 48641070 46092616 43640938 41472514 39476267 37716132 36198743 34685274
18313 34685274 33452569 32541452 32347059 32803336 33456030 34084627 34317352 34310562 34406693 35157267
$$ packed form
18367C07294483q307843j7805994k0297799j6507286j1830373p997369p535184
18360B17012635r234537j1113381j3730840j5231508j3630875j1303406r090621
18353A33677467p086038n149873l514166k424587j397854L24776L087042P547505
18345A25064272J0258074P935081J975152m746684r791681r480517m719859K011927
18337A18505765N095023K866924j453585o208145r978764r950963p614100n826325
18329H5435830n700446n253134n170953m195669l621258l391097l125829l442325
18321E1535119k894049k548454k451678k168424j996247j760135j517389j513469
18313C4685274j232705r11117j94393M56277O52694O28597K32725o790R6131P50574
$$ plain form
18303 35157267 35582849 35184094 33238336 30396554 27991719 27188844 27484259 29326386 32655838
18294 32655838 35766719 37543009 37345890 35073523 31509288 28175982 26085453 25174103
18286 25174103 24855963 25506083 25805385 25319328 24476239 22768126 20572597 19062384 17955752
18277 17955752 16620392 15913293 15277416 14845033 14252310 13896088 13137201 11936959 11109902
18268 11109902 10673951 10203147 9695914 8962279 8568351 8464171 8176780 7642434 7240344
18259 7240344 6751229 6415497 6436329 6211870 5663920 5532868 5413894 5347273 5546491 5572010
18249 5572010 5286665 5114401 5051220 5106667 5073068 5211657 5300242 5027617 5140958 5381113
18239 5381113 5421392 5541461 5935174 6015583 5963026 5587341 5196525 5117563 4894413 4615265
$$ packed form
18303C5157267M25582l98755j945758k841782k404835q02875K95415J842127L329452
18294C2655838L110881J776290j97119k272367l564235l333306k090529r11350
18286B5174103l18140O50120K99302m86057q43089j708113k195529j510213j106632
18277A7955752j335360p07099o35877m32383n92723l56222p58887j200242q27057
18268A1109902m35951m70804n07233p33635l93928j04180k87391n34346m02090
18259G240344m89115l35732K0832k24459n47950j31052j18974o6621J99218K5519
18249E572010k85345j72264o3181N5447l3599J38589Q8585k72625J13341K40155
18239E381113M0279J20069L93713Q0409n2557l75685l90816p8962k23150k79148
$$ plain form
18229 4615265 4650950 4822311 4649480 4232867 4225841 4417508 4232004 4128361 4101432 3873289
18219 3873289 3837272 3970207 4088257 3792080 3870822 3914892 3811058 3631759 3465360 3257391
18209 3257391 3058928 2869400 2949799 2837139 2891734 2774588 2829368 2643548 2328293 2480358
18199 2480358 2649687 2391785 2429431 2536362 2500975 2619294 2663825 2819786 2880065 2986623
18189 2986623 2818719 2879203 3061376 3036786 2996514 2606321 2507215 2613785 2467928 1989843
18179 1989843 1848832 1932985 2278247 2657726 3126645 3189340 2546350 2284429 2329214 2264876
18169 2264876 2336771 2375213 2486161 3074360 3071186 2680487 2792424 3002226 3089362 3154198
18159 3154198 3335383 3582168 3435246 3270724 3289786 3204105 3379245 2883423 2901313 3089227
$$ packed form
18229D615265L5685J71361j72831m16613p026J91667j85504j03643k6929k28143
18219C873289l6017J32935J18050k96177P8742M4070j03834j79299j66399k07969
18209C257391j98463j89528Q0399j12660N4595j17146N4780j85820l15255J52065
18199B480358J69329k57902L7646J06931l5387J18319M4531J55961O0279J06558
18189B986623j67904O0484J82173k4590m0272l90193r9106J06570j45857m78085
18179A989843j41011Q4153L45262L79479M68919O2695o42990k61921M4785o4338
18169B264876P1895L8442J10948N88199l174l90699J11937K09802Q7136O4836
18159C154198J81185K46785j46922j64522J9062q5681J75140m95822J7890J87914
$$ plain form
18149 3089227 3296498 3605321 3497758 3197223 2880040 2790071 2827123 2824630 3064946 3427655
18139 3427655 3690169 3890085 4310075 4622184 4550004 4808227 5312171 5774930 6016414 6226492
18129 6226492 6254353 6812584 7646752 8782816 9674087 10850978 12381819 14290634 16947380
18120 16947380 19972771 23112818 27336319 32706819 40344072 52075535 69841376 99133716
18112 99133716 150883201 244189770 370260148 444094004 458106116 444237025 382601971
18105 382601971 273435969 185441324 134165104 103915684 84234161 70657512 60693280
18098 60693280 52950317 47041260 42465615 39164661 36696069 34456614 32763573 31830524
18090 31830524 30839751 30080862 29085084 27302631 25323118 23314893 21994897 20716919
$$ packed form
18149C089227K07271L08823j07563l00535l17183q9969L7052k493K40316L62709
18139C427655K62514J99916M19990L12109p2180K58223N03944M62759K41484K10078
18129F226492K7861N58231Q34168J136064Q91271J176891J530841J908815K656746
18120A6947380L025391L140047M223501N370500P637253J1731463J7765841K9292340
18112I9133716N1749485R3306569J26070378P3833856J4012112j3869091o1635054
18105C82601971j09166002q7994645n1276220l0249420j9681523j3576649r964232
18098F0693280p742963n909057m575645l300954k468592k239455j693041r33049
18090C1830524r90773p58889r95778j782453j979513k008225j319996j277978
$$ plain form
18082 20716919 19654458 18715571 17926393 17078164 15852635 14837895 14077532 13653588 12605132
18073 12605132 11738793 11485084 10834117 10137638 9643233 9260072 8760719 8023030 7706795
18064 7706795 7282789 7025458 6485357 5941111 5721387 5778125 5527579 5303084 4895605 4458497
18054 4458497 4234034 3994525 3491786 3428349 3439065 3373487 3283941 3078833 2994845 2932846
18044 2932846 2735499 2375134 2189316 2295248 2238750 2240659 2474684 2277926 1790966 1776878
18034 1776878 1868852 1902120 1926482 1748350 1668092 1626963 1747499 1690640 1767642 1775429 1680441
18023 1680441 1289868 1150115 607945 546080 753441 859056 972042 817169 731255 939228
18013 939228 1115126 925009 853178 546053 767799 960471 873145 609959 728694 605373
$$ packed form
18082B0716919j062461r38887p89178q48229j225529j014740p60363m23944j048456
18073A2605132q66339k53709o50967o96479m94405l83161m99353p37689l16235
18064G706795m24006k57331n40101n44246k19724N6738k50546k24495m07479m37108
18054D458497k24463k39509n02739o3437J0716o5578q9546k05108q3988o1999
18044B932846j97347l60365j85818J05932n6498J909K34025j96758m86960j4088
18034A776878R1974L3268K4362j78132q0258m1129J20536n6859P7002P787r4988
18023A680441l90573j39753n42170o1865K07361J05615J12986j54873q5914K07973
18013I39228J75898j90117p1831l07125K21746J92672q7326k63186J18735j23321
$$ plain form
18003 605373 596832 515230 334855 532063 772769 838822 953205 1036182 818516 461176
17993 461176 281332 533887 716393 795014 716423 606502 569212 788024 584778 263340
17983 263340 480776 653978 760334 660329 382608 480336 950353 935760 816159 493941
17973 493941 266067 262157 154727 502419 529384 733210 683183 617811 537707 700102 903817
17962 903817 1109533 1267908 1295916 1245037 1372876 1367689 1473937 1387931 1301657 1045177 952532
17951 952532 1118716 1260329 1351662 959065 1070067 1349516 1802217 1433289 1077640 939889
17941 939889 689828 656008 647063 616079 683793 750436 962302 924494 971048 1018310 1346823
17930 1346823 1109101 1219473 1190900 844698 906457 805489 815703 767994 811213 752984
$$ packed form
18003F05373q541q1602j80375J97208K40706O6053J14383Q2977k17666l57340
17993D61176j79844K52555J82506P8621p8591j09921l7290K18812k03246l21438
17983B63340K17436J73202J06356j00005k77721R7728M70017j4593j19601l22218
17973D93941k27874l910j07430L47692K6965K03826n0027o5372q0104J62395K03715
17962I03817K05716J58375K8008n0879J27839n187J06248q6006q6274k56480r2645
17951I52532J66184J41613R1333l92597J11002K79449M52701l68928l55649j37751
17941I39889k50061l3820q945l0984O7714O6643K11866l7808M6554M7262L28513
17930A346823k37722J10372k8573l46202O1759j00968J0214m7709M3219n8229
$$ plain form
17920 752984 315288 763849 1280455 1412668 1437214 1803982 1827453 1567400 1203649 1096095
17910 1096095 1507586 1780994 1633815 1462213 1518919 1658360 1434195 1427092 1494429 1448312
17900 1448312 1720246 1721986 1587572 1192435 1408896 1902663 1969204 1848658 1820047 1781799
17890 1781799 1956309 2231007 1792728 1389822 1426515 1709154 1587913 1596886 1617361 1457349
17880 1457349 1167536 920382 1026740 1270695 1346901 1435427 1431835 1527961 1379114 933149
17870 933149 1063864 1246831 1049912 995038 982746 1192955 1241453 1286285 948887 737559
17860 737559 869859 1001645 906721 774888 1017252 1156511 978097 710642 863434 982577
17850 982577 883456 918353 1096081 1011369 969708 987344 951622 1204342 1518527 1851378 1791027
$$ packed form
17920G52984m37696M48561N16606J32213K4546L66768K3471k60053l63751j07554
17910A096095M11491K73408j47179j71602N6706J39441k24165p103O7337m6117
17900A448312K71934J740j34414l95137K16461M93767O6541j20546k8611l8248
17890A781799J74510K74698m38279m02906L6693K82639j21241Q973K0475j60012
17880A457349k89813k47154J06358K43955P6206Q8526l592R6126j48847m45965
17870I33149J30715J82967j96919n4874j2292K10209M8498M4832l37398k11328
17860G37559J32300J31786r4924j31833K42364J39259j78414k67455J52792J19143
17850I82577r9121L4897J77728q4712m1661J7636l5722K52720L14185L32851o0351
$$ plain form
17839 1791027 1729584 1838013 1842370 1788907 1536148 1385209 1289806 1174899 927562 1021422
17829 1021422 1285851 1252411 911303 426433 453231 1103823 1075939 757914 597376 509777
17819 509777 499848 242730 271699 83688 276764 487472 888303 1127981 1095468 585887
17809 585887 78112 56979 306992 103199 80115 303896 127866 439565 309642 303394
17799 303394 501447 766169 669363 352024 195781 238518 279888 262604 276518 568719
17789 568719 665895 640649 452470 326063 513084 468547 453303 617364 263884 185546
17779 185546 368084 713163 805720 733167 685362 344162 216850 -67641 180037 342223
17769 342223 340853 520056 901841 777203 355212 391558 -25624 -564427 -354123 -224690
$$ packed form
17839A791027o1443J08429M357n3463k52759j50939r5403j14907k47337R3860
17829A021422K64429l3440l41108m84870K6798O50592k7884l18025j60538q7599
17819E09777r929k57118K8969j88011J93076K10708M00831K39678l2513n09581
17809E85887n07775k1133K50013k03793k3084K23781j76030L11699j29923o248
17799C03394J98053K64722r6806l17339j56243M2737M1370j7284J3914K92201
17789E68719R7176k5246j88179j26407J87021m4537j5244J64061l53480p8338
17779A85546J82538L45079R2557p2553m7805l41200j27312k84491K47678J62186
17769C42223j370J79203L81785j24638m21991L6346m17182n38803K10304J29433
$$ plain form
17759 -224690 -308880 -247246 -218592 -175412 46675 79454 -59413 -55411 130875 512514 466147
17748 466147 235694 60638 36930 389517 429356 595050 503842 499186 408489 253741 176108
17737 176108 57013 2503 240064 634677 725680 408792 174211 43911 -255723 -304516
17727 -304516 -198417 38186 196385 142019 60991 -117250 -4911 33325 265545 599743
17717 599743 700967 258279 10563 193119 289915 -14751 260267 457065 396751 206960
17707 206960 145979 161827 90041 -74111 391869 353594 204329 -112808 -2728 162444
17697 162444 71027 130300 28936 -186512 -108697 29825 231796 -62756 -303333 -545037
17687 -545037 -199819 107221 432550 465877 269913 28424 31247 124291 167920 139692 45218
$$ packed form
17759b24690q4190O1634K8654M3180K22087L2779j38867M002J86286L81639m6367
17748D66147k30453j75056k3708L52587L9839J65694r1208m656r0697j54748p7633
17737A76108j19095n4510K37561L94613R1003l16888k34581j30300k99634m8793
17727c04516J06099K36603J58199n4366q1028j78241J12339L8236K32220L34198
17717E99743J01224m42688k47716J82556R6796l04666K75018J96798o0314j89791
17707B06960o0981J5848p1786j64152M65980l8275j49265l17137J10080J65172
17697A62444r1417N9273j01364k15448P7815J38522K01971k94552k40577k41704
17687e45037L45218L07040L25329L3327j95964k41489K823R3044M3629k8228r4474
$$ plain form
17676 45218 -12568 -137558 -59894 180151 224224 35183 40495 -79504 59863 271854 457329
17665 457329 372501 -20223 -83488 -32507 -114633 -231324 169068 465187 304988 124005
17655 124005 125229 66365 151515 410505 442179 248575 48528 42203 160923 512454 31920
17644 31920 -175339 -302120 -123607 -148879 323987 658618 606617 332068 413364 621214
17634 621214 543847 575541 626725 105749 -67520 111973 -2634 -249562 -43386 152954
17624 152954 68167 19859 -18059 -273416 -75779 219848 250761 241242 151320 283349 321710
17613 321710 294381 194389 -556 -310573 -530553 -182744 -15400 -160707 -228890 89817
17603 89817 136278 23285 -403136 -177966 19060 80808 197859 -211987 -508469 -300822
$$ packed form
17676D5218n7786j24990P7664K40045M4073j89041N312j19999J39367K11991J85475
17665D57329q4828l92724o3265N0981q2126j16691M00392K96119j60199j80983
17655A24005J224n8864Q5150K58990L1674j93604k00047o325J18720L51531m80534
17644C1920k07259j26781J78513k5272M72866L34631n2001k74549Q1296K07850
17634F21214p7367L1694N1184n20976j73269J79493j14607k46928K06176J96340
17624A52954q4787m8308l7918k55357J97637K95627L0913r519q9922J32029L8361
17613C21710k7329r9992j94945l10017k19980L47809J67344j45307o8183L18707
17603H9817M6461j12993m26421K25170J97026O1748J17051m09846k96482K07647
$$ plain form
17593 -300822 -106771 106633 37946 -341644 -601091 -731404 -73000 51504 10147 -170713
17583 -170713 -44542 255639 172366 98585 379428 9350 25379 18942 93010 120652 -299466
17572 -299466 -367095 235034 562994 612781 391564 -27204 -103749 173477 185465 33275
17562 33275 50783 -108707 -131800 -125542 -219341 -30775 -58298 239552 287357 50510 56938
17551 56938 99245 -44087 -173567 -188181 -45008 418049 595435 530893 348895 49893
17541 49893 -180862 -331814 -370358 -119212 -11135 -191939 -313197 38702 -38855 7672
17531 7672 -92822 -422213 -663436 -646414 -625512 -445378 44434 413202 379543 99690
17521 99690 -173465 -378193 -629338 -634072 -586319 36285 -18363 -403296 -492580 -363627 -648194
$$ packed form
17593c00822J94051K13404o8687l79590k59447j30313O58404J24504m1357j80860
17583a70713J26171L00181q3273p3781K80843l70078J6029o437P4068K7642m20118
17572b99466o7629O02129L27960M9787k21217m18768p6545K77226J1988j52190
17562C3275J7508j59490k3093O258r3799J88566k7523K97850M7805k36847O428
17551E6938M2307j43332j29480j4614J43173M63057J77386o4542j81998k99002
17541D9893k30755j50952l8544K51146J08077j80804j21258L51899p7557M6527
17531G672j00494l29391k41223J7022K0902J80134M89812L68768l3659k79853
17521I9690k73155k04728k51145m734M7753O22604n4648l84933q9284J28953k84567
$$ plain form
17510 -648194 -254051 69937 48927 -47087 -387800 -569997 -638537 -625614 -242075 -241548 -174135
17499 -174135 -204192 -153977 -430922 -192937 309292 124698 53991 114472 170283 -174744
17489 -174744 -103797 -322451 -228226 83261 -257585 188509 237806 127795 265623 116482
17479 116482 86956 -148919 -176279 43367 311667 180284 -3747 -251089 -83775 304266
17469 304266 276109 101995 -32543 -58241 -155686 -134764 -53882 124633 61640 43508 -319495
17458 -319495 -344985 -199398 -116170 -212199 -198883 113585 564931 736505 390834 553300
17448 553300 546412 450159 518173 812354 1463442 1846519 2074038 1948527 1751772 1361164
17438 1361164 1074935 998213 898961 815057 471850 284655 651860 695803 414226 -140015
$$ packed form
17510f48194L94143L23988k1010r6014l40713j82197o8540J2923L83539N27O7413
17499a74135l0057N0215k76945K37985N02229j84594p0707O0481N5811l45027
17489a74744P0947k18654R4225L11487l40846M46094M9297j10011J37828j49141
17479A16482k9526k35875k7360K19646K68300j31383j84031k47342J67314L88041
17469C04266k8157j74114j34538k5698r7445K0922Q0882J78515o2993j8132l63003
17458c19495k5490J45587Q3228r6029J3316L12468M51346J71574l45671J62466
17448E53300o888r6253O8014K94181O51088L83077K27519j25511j96755l90608
17438A361164k86229p6722r9252q3904l43207j87195L67205M3943k81577n54241
$$ plain form
17428 -140015 -127964 -8871 -148762 -282327 -69397 359959 365440 196989 318398 591997
17418 591997 698350 361512 78053 -8473 -196080 -374380 -204884 -20502 13360 171758
17408 171758 140502 -31985 -153882 -137197 -41322 -120143 -309533 -183026 -167309 -243855 56914
17397 56914 103137 45970 -136086 -347663 -412510 -181109 -79024 -108725 -288187 4855
17387 4855 197826 61415 148726 158062 29122 -76220 -155927 -456834 -2451 138558 -15797
17376 -15797 -158482 70829 -164145 -78571 48330 105922 458467 513139 138932 13863
17366 13863 50673 159956 501504 570324 355553 184287 41825 147468 171795 -178549
17356 -178549 -145554 131563 244432 -56465 -372841 -463004 -599437 -439890 -362703 -573997
$$ packed form
17428a40015J2051J19093j39891j33565K12930M29356N481j68451J21409K73599
17418E91997J06353l36838k83459q6526j87607j78300J69496J84382L3862J58398
17408A71758l1256j72487j21897J6685R5875p8821j89390J26507J5717p6546L00769
17397E6914M6223n7167j82056k11577o4847K31401J02085k9701j79462K93042
17387D855J92971j36411Q7311R336j28940j05342p9707l00907M54383J41009j54355
17376a5797j42685K29311k34974Q5574J26901N7592L52545N4672l74207j25069
17366A3863L6810J09283L41548O8820k14771j71266j42462J05643K4327l50344
17356a78549L2995K77117J12869l00897l16376r0163j36433J59547P7187k11294
$$ plain form
17346 -573997 -382110 -431241 -444641 -181412 -283892 -143970 308790 249480 123031 210471
17336 210471 103505 -421922 -563542 -458417 -719597 -672660 -535747 -503258 -435666 -514918
17326 -514918 -405959 -5394 106025 171800 263410 451371 164015 144867 257236 243171
17316 243171 269464 199392 9339 -360444 -518944 -624838 -441638 36673 265255 265748
17306 265748 418142 282631 143046 188273 257376 343114 184076 157891 236204 40357
17296 40357 -21813 -132793 -143551 139635 146204 88991 40853 -52821 129750 514512 627969
17285 627969 344127 111918 39071 -333571 -536758 -91240 -189142 -269557 -308810 -195497
17275 -195497 -196784 -299912 -368866 -426696 -684878 -763167 -613884 -325902 -285795 -256284 78222
$$ packed form
17346e73997J91887m9131j3400K63229j02480J39922M52760n9310j26449Q7440
17336B10471j06966n25427j41620J05125k61180M6937J36913L2489O7592p9252
17326e14918J08959M00565J11419O5775R1610J87961k87356j9148J12369j4065
17316B43171K6293p0072j90053l69783j58500j05894J83200M78311K28582M93
17306B65748J52394j35511j39585M5227O9103Q5738j59038k6185P8313j95847
17296D0357o2170j10980j0758K83186O569n7213m8138r3674J82571L84762J13457
17285F27969k83842k32209p2847l72642k03187M45518r7902q0415l9253J13313
17275a95497j287j03128o8954n7830k58182p8289J49283K87982M0107K9511L34506
$$ plain form
17264 78222 343666 -27945 -330575 -336055 -235022 -109240 -269367 -423903 -153288 -28173
17254 -28173 -216350 -2424 184751 -4807 16906 133566 438767 721709 490784 -138730
17244 -138730 -471482 -259157 -80555 -236644 -173969 239793 438591 429733 67344 -142052
17234 -142052 -168677 -114843 296602 -178758 -287694 -396551 -336278 -99339 -89677 -413441
17224 -413441 -379039 -434793 -176244 350140 212565 -251626 -668205 -605274 -542041 -464072
17214 -464072 -426870 -620292 -479431 -292158 -198187 -606399 -524158 -340721 -145902 36332
17204 36332 173275 167162 -23328 -44630 70217 -74062 11541 338665 53263 -25831 359955
17193 359955 606138 304454 86214 -294812 -61100 196961 187839 -13109 -288932 -517868
$$ packed form
17264G8222K65444l71611l02630n480J01033J25782j60127j54536K70615J25115
17254b8173j88177K13926J87175j89558K1713J16660L05201K82942k30925o29514
17244a38730l32752K12325J78602j56089O2675M13762J98798q858l62389k09396
17234a42052k6625N3834M11445m75360j08936j08857O0273K36939R662l23764
17224d13441L4402n5754K58549N26384j37575m64191m16579O2931O3233P7969
17214d64072L7202j93422J40861J87273R3971m08212Q2241J83437J94819J82234
17204C6332J36943o113j90490k1302J14847j44279Q5603L27124k85402p9094L85786
17193C59955K46183l01684k18240l81026K33712K58061r122k00948k75823k28936
$$ plain form
17183 -517868 -344157 -57700 128217 361834 516063 472881 311911 44806 361602 238338
17173 238338 29278 -205410 292733 578476 307982 164632 62895 -90016 -215435 -189097
17163 -189097 -41849 -43319 -26015 -88876 -283559 -68565 25744 -194698 -61289 -65166 -301900
17152 -301900 -293862 -36913 267942 35918 -537388 -504415 -493374 -217146 -144261 154064
17142 154064 -68691 -719545 -638465 -217106 21625 -112434 -74374 181289 366888 372290
17132 372290 153388 98180 87507 185817 59894 -132884 3358 56865 149468 130748 21061
17121 21061 95334 -386187 -826405 -580324 -311562 -238989 -57027 180799 -35396 -228208
17111 -228208 -349782 -108978 -22287 -135800 105755 122749 53238 73926 290817 324664
$$ packed form
17183e17868J73711K86457J85917K33617J54229m3182j60970k67105L16796j23264
17173B38338k09060k34688M98143K85743k70494j43350j01737j52911j25419K6338
17163a89097J47248j470J7304o2861j94683K14994R4309k20442J33409l877k36734
17152c01900Q038K56949L04855k32024n73306L2973J1041K76228P2885K98325
17142A54064k22755o50854Q1080M21359K38731j34059L8060K55663J85599N402
17132C72290k18902n5208j0673R8310j25923j92778J36242N3507R2603j8720j09687
17121B1061P4273m81521m40218K46081K68762P2573J81962K37826k16195j92812
17111b28208j21574K40804Q6691j13513K41555J6994o9511K0688K16891L3847
$$ plain form
17101 324664 545643 612142 526403 397109 314684 33756 34857 454817 705705 502298
17091 502298 511206 537944 392295 123901 -306097 -400904 -136008 -209215 -202048 -178133 -210298
17080 -210298 180284 88060 -153816 -69346 -427742 -776250 -837933 -764287 -785838 -371865
17070 -371865 107928 31836 43763 -203878 -276997 -197378 -83595 -70635 -103586 -116828 -185251
17059 -185251 -83720 91297 219888 159463 -163220 -243096 54657 329345 51947 -130372
17049 -130372 -342795 -169432 127128 54426 85969 30363 -270238 -441767 -402336 -552702
17039 -552702 -795485 -686250 -513979 -801473 -580667 -672907 -675813 -837087 -625536 -493541
17029 -493541 -679461 -873647 -834955 -597325 -223393 -193615 -68249 -312047 -527064 -471495
$$ packed form
17101C24664K20979O6499q5739j29294q2425k80928J101M19960K50888k03407
17091E02298Q908K6738j45649k68394m29998r4807K64896p3207P167K3915l2165
17080b10298L90582r2224k41876Q4470l58396l48508o1683P3646k1551M13973
17070c71865M79793p6092J1927k47641p3119P9619J13783J2960l2951j3242o8423
17059a85251J01531J75017J28591o0425l22683p9876K97753K74688k77398j82319
17049a30372k12423J73363K96560p2702L1543n5606l00601j71529L9431j50366
17039e52702k42783J09235J72271k87494K20806r2240k906j61274K11551J31995
17029d93541j85920j94186L8692K37630L73932K9778J25366k43798k15017N5569
$$ plain form
17019 -471495 -286749 -263706 -140345 -214098 -153982 -43105 -323608 -378737 -391282 -59563
17009 -59563 234228 115162 35623 157553 -44196 -108173 -82192 265181 17850 -431256
16999 -431256 -291169 -106685 -177563 -210105 -303013 -206098 -115410 -374174 -356601 -214839 -127332
16988 -127332 133708 436931 908698 789859 174122 48800 -129662 -244507 -332089 -313204
16978 -313204 49640 7230 -168826 263368 484911 123931 211815 449508 47202 -330532
16968 -330532 -35084 271416 375531 286408 -94159 -178426 -43219 -127989 -160782 219797
16958 219797 211618 183917 50319 -273429 -236645 -391950 -427516 -513304 -510899 -480069 -421141
16947 -421141 -414423 -483179 -163047 75220 44832 -49601 -395332 -555681 -498538 -224829 108175
$$ packed form
17019d71495J84746K3043J23361p3753O0116J10877k80503n5129j2545L31719
17009e9563K93791j19066p9539J21930k01749o3977K5981L47373k47331m49106
16999d31256J40087J84484p0878l2542r2908R6915R0688k58764J7573J41762Q7507
16988a27332K61040L03223M71767j18839o15737j25322j78462j14845q7582J8885
16978c13204L62844m2410j76056M32194K21543l60980Q7884K37693m02306l77734
16968c30532K95448L06500J04115q9123l80567q4267J35207q4770l2793L80579
16958B19797q179k7701j33598l23748L6784j55305l5566q5788K405L0830N8928
16947d21141O718o8756L20132K38267l0388r4433l45731j60349N7143K73709L33004
$$ plain form
16936 108175 496003 428951 184823 24484 -6291 -252893 -232491 -209836 -241515 -295170 -440500
16925 -440500 -436536 -482998 -477415 -804880 -739386 -463800 -182848 14168 -279942 -624001 -653579
16914 -653579 -569090 -699925 -614978 -218089 99565 170424 104061 -21286 10626 -166414
16904 -166414 -514231 -509337 -501174 -343234 -415046 -134643 77025 140525 6143 73076 12405
16893 12405 -34842 -531388 -438753 -336059 -213249 -459722 -367563 -295254 -204009 -375053 -505712
16882 -505712 -507489 -413139 -510817 -792093 -498633 88883 213890 179390 306376 228229 -133130
16871 -133130 -309578 -400748 -511972 -517128 -592987 -473033 -228722 -188140 -262372 -72956 -66732
16860 -66732 115154 91680 35079 -27319 198036 199603 63607 -100911 -260112 -543034 -954990
$$ packed form
16936A08175L87828o7052k44128j60339l0775k46602K0402K2655l1679n3655j45330
16925d40500L964m6462N583l27465O5494K75586K80952J97016k94110l44059k9578
16914f53579Q4489j30835Q4947L96889L17654P0859o6363j25347L1912j77040
16904a66414l47817M894Q163J57940p1812K80403K11668O3500j34382O6933o0671
16893A2405m7247m96546R2635J02694J22810k46473R2159P2309R1245j71044j30659
16882e05712j777R4350r7678k81276K93460N87516J25007l4500J26986p8147l61359
16871a33130j76448r1170j11224n156p5859J19954K44311M0582p4232J89416O224
16860f6732J81886k3474n6601o2398K25355J567j35996j64518j59201k82922m11956
$$ plain form
16849 -954990 -1013391 -922108 -672320 -784817 -788676 -604574 -602414 -756824 -488569 -485730 -603837
16838 -603837 -427675 -523031 -474091 -106612 -477073 -780243 -367370 -84724 231408 64222
16828 64222 -74643 -23057 257592 230441 371107 394822 -104117 -399203 -305852 -469334
16818 -469334 -616532 -476337 -72538 -67079 -209650 -446806 -338580 27263 237644 337189
16808 337189 346959 475248 441530 745209 678823 112771 -156113 -364169 -460069 -326810
16798 -326810 55059 176567 301455 309458 181013 61724 -365628 -469180 -183576 212156
16788 212156 458468 151120 -139686 -243983 -74915 -115426 -37765 -44494 -90560 -391417
16778 -391417 -723849 -559222 -719381 -523369 74384 181458 86929 251492 -429972 -811545
$$ packed form
16849i54990n8401R1283K49788j12497l859J84102K160j54410K68255K839j18107
16838f03837J76162r5356M8940L67479l70461l03170M12873K82646L16132j67186
16828F4222j38865N1586K80649k7151J40666K3715m98939k95086R3351j63482
16818d69334j47198J40195M03799N459j42571k37156J08226L65843K10381R9545
16808C37189R770J28289l3718L03679o6386n66052k68884k08056r5900J33259
16798c26810L81869J21508J24888Q003j28445j19289m27352j03552K85604L95732
16788B12156K46312l07348k90806j04297J69068m0511P7661o729m6066l00857
16778c91417l32432J64627j60159J96012N97753J07074r4529J64563o81464l81573
$$ plain form
16768 -811545 -874838 -858519 -565332 -301883 -220599 -257355 -263516 -559213 -783972 -510569 -434492
16757 -434492 -255388 49137 -36218 -197244 -202572 -317928 -335487 -272433 -92679 -92033 -329555
16746 -329555 -366758 -318001 -400901 -512368 -352517 -286006 -152449 69563 -93127 -3035
16736 -3035 -30901 -281170 -714314 -624424 -345529 -57399 -61095 -15667 -54307 -53883 133513
16725 133513 -56849 -28257 93746 -317495 -304625 16667 11514 -54595 -167770 -35809
16715 -35809 98495 -265903 -423271 -248899 -140097 177294 192604 8539 35632 -11624
16705 -11624 -232665 -117892 516023 703344 31339 -533774 -384440 -507611 -706110 -948080
16695 -948080 -712311 -387341 6248 43277 -79406 -100570 -86374 83185 -144098 -89353
$$ packed form
16768h11545o3293J6319K93187K63449Q1284l6756o161k95697k24759K73403P6077
16757d34492J79104L04525q5355j61026n328j15356j7559O3054J79754O46k37522
16746c29555l7203M8757q2900j11467J59851O6511J33557K22012j62690R0092
16736c035k7866k50269m33144Q9890K78895K88130l696M5428l8640M24J87396
16725A33513j90362K8592J22003m11241J2870L21292n153o6109j13175J31961
16715c5809J34304l64398j57368J74372J08802L17391J5310j84065K7093m7256
16705a1624k21041J14773O33915J87321o72005n65113J49334j23171j98499k41970
16695i48080K35769L24970L93589L7029j22683k1164J4196J69559k27283N4745
$$ plain form
16685 -89353 -452705 -642474 -431835 -6293 340881 339419 141948 -61721 -354884 -720586
16675 -720586 -730452 -536023 -462975 -566382 -461117 -391627 -188122 -93050 -189051 -203398 -443202
16664 -443202 -719547 -601042 -123878 88718 110956 345949 163178 -177297 -124673 -14095
16654 -14095 -260745 -488674 -371080 -404796 -550741 -170728 61132 23034 56427 209274
16644 209274 63555 191465 142748 102060 -200778 -410377 -638441 -821049 -960824 -852382
16634 -852382 -470071 -485124 -299598 -434672 -566685 -409827 -209530 -160979 -85930 -107202
16624 -107202 15517 -52703 -485928 -766292 -609876 -415384 -280215 -150496 140039 -121205
16614 -121205 -370592 -342966 -374808 -222075 -33114 -61692 -368324 -485694 -398554 -641363
$$ packed form
16685h9353l63352j89769K10639M25542L47174j462j97471k03669k93163l65702
16675g20586r866J94429P3048j03407J05265O9490K03505R5072r6001j4347k39804
16664d43202k76345J18505M77164K12596K2238K34993j82771l40475N2624J10578
16654a4095k46650k27929J17594l3716j45945L80013K31860l8098L3393J52847
16644B09274j45719J27910m8717m0688l02838k09599k28064j82608j39775J08442
16634h52382L82311j5053J85526j35074j32013J56858K00297M8551P5049k1272
16624a07202J22719o8220m33225k80364J56416J94492J35169J29719K90535k61244
16614a21205k49387K7626l1842J52733J88961k8578l06632j17370Q7140k42809
$$ plain form
16604 -641363 -671326 -710126 -619074 -371382 -134837 -10809 255390 478458 537035 300621
16594 300621 183800 12338 -182126 -42472 162848 285285 251137 503136 512849 531591
16584 531591 450705 280408 88125 16587 148995 125267 231182 339787 116833 147023
16574 147023 185456 245379 163316 43979 -57048 -165448 -64218 -181173 -388743 -385353
16564 -385353 84748 762261 698812 21420 -231482 -9324 84526 -146739 -126957 95301
16554 95301 184875 -165418 -492531 -181129 338786 210787 271731 180342 -83959 90422
16544 90422 148235 -8776 50499 -332265 -479658 -159263 -538340 -90880 279602 328117
16534 328117 47405 343131 492179 583412 465853 90847 446586 384140 349662 288695
$$ packed form
16604f41363k9963l8800R1052K47692K36545J24028K66199K23068N8577k36414
16594C00621j16821j71462j94464J39654K05320J22437l4148K51999R713J8742
16584E31591q0886j70297j92283p1538J32408k3728J05915J08605k22954L0190
16574A47023L8433N9923q2063j19337j01027j08400J01230j16955k07570L390
16564c85353M70101O77513o3449o77392k52902K22158R3850k31265J9782K22258
16554I5301Q9574l50293l27113L11402N19915j27999O0944r1389k64301J74381
16544I0422N7813j57011N9275l82764j47393L20395l79077M47460L70482M8515
16534C28117k80712K95726J49048R1233j17559l75006L55739o2446l4478o0967
$$ plain form
16524 288695 208713 182363 -7939 -222256 -309320 -386037 -641570 -713590 -403890 -322113 -320792
16513 -320792 -293640 -211999 -47470 -313044 -532441 -143023 -6536 -73953 -254960 -118106
16503 -118106 -39654 -435702 -617383 -531230 -171415 -62902 40627 88952 -57181 -75329
16493 -75329 30563 42177 -24361 -331056 -389973 -430037 -673412 -582812 -232281 110542 85464
16482 85464 -101653 85737 -25287 -30407 31441 36956 -10170 -262327 -444653 -549999 -829627
16471 -829627 -986307 -880401 -780727 -632994 -487493 -212784 -26779 -205590 21601 211962
16461 211962 469477 599416 103557 -141020 16742 286193 81200 -286832 -495387 -432356
16451 -432356 -693353 -729486 -468337 -582353 -509551 -314320 -160587 -8748 -193447 -334018
$$ packed form
16524B88695p9982k6350j90302k14317q7064p6717k55533p2020L09700Q1777J321
16513c20792K7152Q1641J64529k65574k19397L89418J36487o7417j81007J36854
16503a18106P8452l96048j81681Q6153L59815J08513J03529M8325j46133j8148
16493g5329J05892J1614o6538l06695n8917m0064k43375R0600L50531L42823k5078
16482H5464j87117J87390j11024n120O1848N515m7126k52157j82326j05346k79628
16471h29627j56680J05906R9674J47733J45501K74709J86005j78811K27191J90361
16461B11962K57515J29939m95859k44577J57762K69451k04993l68032k08555O3031
16451d32356k60997l6133K61149j14016P2802J95231J53733J51839j84699j40571
$$ plain form
16441 -334018 -344279 -446586 -116060 193588 159492 -76413 -149389 -114450 -2132 -226839
16431 -226839 -575453 -81991 259494 380273 13411 -394424 -535355 -598744 -551455 -269895
16421 -269895 -320889 -173531 -514684 -618176 -788987 -708868 -398368 -131127 15013 111723
16411 111723 117842 465198 261546 -120352 -343769 -702340 -387534 168448 163766 216619
16401 216619 241691 234335 75747 117102 36950 216883 171326 39527 -3172 -179988 -195753
16390 -195753 80314 159548 10794 -170221 -267067 -183002 -296408 -248205 -429390 -653732
16380 -653732 -838258 -740713 -572578 -520448 -443917 -455163 -373685 -93562 158588 46439
16370 46439 -416603 -593638 -533408 -587881 -495533 -431416 -290452 -351756 -439602 -168654 33995
$$ packed form
16441c34018j0261j02307L30526L09648l4096k35905p2976L4939J12318k24707
16431b26839l48614M93462L41485J20779l66862m07835j40931o3389M7289K81560
16421b69895n0994J47358l41153j03492j70811Q0119L10500K67241J46140R6710
16411A11723O119L47356k03652l81898k23417l58571L14806N55982m682N2853
16401B16619K5072p356j58588M1355q0152J79933m5557j31799m2699j76816j5765
16390a95753K76067P9234j48754j81015r6846Q4065j13406M8203j81185k24342
16380f53732j84526R7545J68135N2130P6531j1246Q1478K80123K52150j12149
16370D6439m63042j77035O0230n4473R2348O4117J40964o1304q7846K70948K02649
$$ plain form
16359 33995 -256989 -254724 -365270 -290531 -504132 -656189 -205194 -189941 -686901 -570313
16349 -570313 -489946 -630991 -597600 -464043 -434912 -439950 -206284 95385 -124478 -334024
16339 -334024 -117022 -192339 -228266 -231707 -217466 167698 -67453 147968 67612 -315354 -221881
16328 -221881 -224165 -65985 -30830 -190070 -54283 -233248 -474942 -830255 -918425 -670732
16318 -670732 -355266 -148949 -68916 -375068 -468446 -415814 -270427 -429 113081 -72962
16308 -72962 -228419 -399958 -653791 -538198 -150964 -13625 -235136 -406772 -257820 -272037
16298 -272037 -312092 -269632 -170815 162024 137693 20633 72905 133045 52662 -82385 54976
16287 54976 161213 -39178 -148182 -372774 -154478 53890 242152 312471 306163 95877
$$ packed form
16359C3995k90984K265j10546P4739k13601j52057M50995J5253m96960J16588
16349e70313Q0367j41045L3391J33557K9131n038K33666L01669k19863k09546
16339c34024K17002p5317l5927l441J4241L85164k35151K15421q0356l82966R3473
16328b21881k284J58180L5155j59240J35787j78965k41694l55313q8170K47693
16318f70732L15466K06317Q0033l06152r3378N2632J45387K69998J13510j86043
16308g2962j55457j71539k53833J15593L87234J37339k21511j71636J48952j4217
16298b72037m0055M2460R8817L32839k4331j17060N2272O0140q0383j35047J37361
16287E4976J06237k00391j09004k24592K18296K08368J88262P0319o308k10286
$$ plain form
16277 95877 80656 -78191 -484215 -507812 -598117 -357811 -80078 -334576 -540727 -407197
16267 -407197 -498190 -311812 -457990 -473607 -500761 -465660 -759223 -962561 -1156892 -1005006
16257 -1005006 -591011 -649103 -571959 -470940 -438384 -441582 -542298 -609083 -554728 -416903 -589254
16246 -589254 -660711 -159244 -154981 -141292 -247811 -119387 -241574 -122103 162408 133000
16236 133000 209343 135206 -38418 85850 159937 -270284 -394877 -185801 22932 262686
16226 262686 -200722 -389896 -134996 -157317 -176579 6882 -13745 622 -139304 -315965
16216 -315965 -7744 229201 455579 138141 48924 467452 856048 852930 453995 283780
16206 283780 358324 43276 -62491 -184774 130547 88032 -265972 -361001 -493211 -350910
$$ packed form
16277I5877j5221j58847m06024k3597r0305K40306K77733k54498k06151J33530
16267d07197r0993J86378j46178j5617k7154L5101k93563k03338j94331J51886
16257a005006M13995n8092P7144J01019L2556l198j00716o6785N4355J37825j72351
16246e89254p1457N01467M263J3689j06519J28424j22187J19471K84511k9408
16236A33000P6343p4137j73624J24268P4087m30221j24593K09076K08733K39754
16226B62686m63408j89174K54900k2321j9262J83461k0627J4367j39926j76661
16216c15965L08221K36945K26378l17438q9217M18528L88596l118l98935j70215
16206B83780P4544l15048j05767j22283L15321m2515l54004r5029j32210J42301
$$ plain form
16196 -350910 -157394 -198529 -298378 78337 75157 24886 162576 -31113 -257828 -367971
16186 -367971 -472528 -308140 218860 252073 224260 252468 374690 351471 -107023 -323513
16176 -323513 -151223 -153322 35555 437499 328081 244385 113207 -186383 -448205 -339531
16166 -339531 -431721 -553819 -646795 -780688 -1048043 -614670 -683294 -699558 -418763 -244077
16156 -244077 -171443 -146701 -135419 -63607 71715 54204 -266487 -231451 -349539 -564067 -647600
16145 -647600 -733370 -691902 -174955 -5878 -286635 -631676 -387286 -197374 -95871 -463764
16135 -463764 -435669 -724564 -406407 -184829 12602 29685 -250146 -390322 -493514 -468399
16125 -468399 28627 140187 224351 264214 239040 -150716 -168205 69255 -140657 52685
$$ packed form
16196c50910J93516m1135r9849L76715l180n0271J37690j93689k26715j10143
16186c67971j04557J64388N27000L3213k7813K8208J22222k3219m58494k16490
16176c23513J72290k099J88877M01944j09418q3696j31178k99590k61822J08674
16166c39531r2190j22098r2976j33893k67355M33373o8624j6264K80795J74686
16156b44077P2634K4742J1282P1812J35322j7511l20691L5036j18088k14528q3533
16145f47600q5770M1468N16947J69077k80757l45041K44390J89912J01503l67893
16135d63764K8095k88895L18157K21578J97431J7083k79831j40176j03192K5115
16125d68399M97026J11560Q4164L9863k5174l89756j7489K37460k09912J93342
$$ plain form
16115 52685 329015 300652 85055 -95566 -87402 -259290 -203448 -237421 -294811 -137191 -80156
16104 -80156 85582 38015 -119232 -130458 -71027 -181567 -173656 -77286 -65039 -20819 -60183
16093 -60183 -112570 -211051 41231 446415 533315 158081 -33907 106854 13830 -92391
16083 -92391 -932826 -1057312 -768573 -476162 -264702 -172864 -213740 -32349 110087 -547087
16073 -547087 -827013 -316764 -594526 -749634 -497726 -628879 -596427 -400283 -362337 -510922
16063 -510922 -465565 -374032 -108260 413756 149452 -425198 -453931 -322179 2729 21162
16053 21162 42182 176586 102774 123732 3732 47594 -39385 -174580 -230651 -44524 328496
16042 328496 78549 -419591 -679221 -632093 -272293 580132 885884 370341 -922 31449
$$ packed form
16115E2685K76330k8363k15597j80621Q164j71888N5842l3973n7390J57620N7035
16104h0156J65738m7567j57247j1226N9431j10540P911R6370J2247M4220l9364
16093f0183n2387r8481K52282M05184Q6900l75234j91988J40761r3024j06221
16083i2391q40435j24486K88739K92411K11460R1838m0876J81391J42436o57174
16073e47087k79926N10249k77762j55108K51908j31153L2452J96144L7946j48585
16063e10922M5357R1533K65772N22016k64304n74650k8733J31752L24908J8433
16053B1162K1020J34404p3812K0958j20000M3862q6979j35195n6071J86127L73020
16042C28496k49947m98140k59630M7128L59800Q52425L05752n15543l71263L2371
$$ plain form
16032 31449 215350 524212 302521 -12765 -254109 -524455 -570660 -349558 -428442 -411975
16022 -411975 -4191 -11605 -166022 -357604 -313134 -117300 -249826 -260261 -102579 -125399
16012 -125399 -127668 -91926 -45602 183236 203298 33531 -425064 -615292 -604055 -649842 -870022
16001 -870022 -1171610 -1105321 -737968 -634593 -516372 -631076 -774192 -517543 -606978 -676243
15991 -676243 -526421 -58441 -346408 -600714 -175770 46413 -105942 -335777 -265850 -206193
15981 -206193 -460443 -128898 363189 390081 502143 703834 687980 256266 80154 -67280
15971 -67280 -94680 -190015 -622826 -507746 -379218 -557034 -591754 -400478 -227536 -287086
15961 -287086 -475295 -557546 -283825 -118141 15721 24226 82622 358649 -115776 -264779
$$ packed form
16032C1449J83901L08862k21691l15286k41344k70346m6205K21102p8884J6467
16022d11975M07784p414j54417j91582M4470J95834j32526j0435J57682k2820
16012a25399k269L5742M6324K28838K0062j69767m58595j90228J1237m5787k20180
16001h70022l01588O6289L67353J03375J18221j14704j43116K56649q9435o9265
15991f76243J49822M67980k87967k54306M24944K22183j52355k29835O9927N9657
15981b06193k54250L31545M92087K6892J12062K01691j5854m31714j76112j47434
15971f7280k7400r5335m32811J15080J28528j77816l4720J91276J72942n9550
15961b87086j88209q2251K73721J65684J33862Q505N8396K76027m74425j49003
$$ plain form
15951 -264779 -22316 74614 -74190 -243495 -257650 -293665 -58857 108611 88208 -315598
15941 -315598 -187977 381325 374482 311086 85253 -14665 -10559 46527 168212 230549 126676
15930 126676 -231120 -69985 290349 244473 -299333 -430504 -366510 -495049 -628620 -507596
15920 -507596 -434931 -53614 -140869 -344280 -462898 -149314 177438 68926 66823 4284
15910 4284 143738 205049 -9742 -500675 -629827 -485717 -520320 -287011 -350087 -179054
15900 -179054 -41510 198069 417224 287725 183822 75287 -99526 -425468 -381465 -159413
15890 -159413 -147854 -110990 -58472 -82466 -163601 -517450 -610929 -424450 -355209 -473798 -565765
15879 -565765 -724920 -706555 -504767 -624039 -720317 -388835 -213981 -89340 244361 339642
$$ packed form
15951b64779K42463R6930j48804j69305j4155l6015K34808J67468k0403m03806
15941c15598J27621N69302o843o3396k25833r9918M106N7086J21685O2337j03873
15930A26676l57796J61135L60334m5876n43806j31171O3994j28539j33571J21024
15920e07596P2665L81317q7255k03411j18618L13584L26752j08512k103o2539
15910D284J39454O1311k14791m90933j29152J44110l4603K33309o3076J71033
15900a79054J37544K39579K19155j29499j03903j08535j74813l25942M4003K22052
15890a59413J1559L6864N2518k3994q1135l53849r3479J86479O9241j18589r1967
15879e65765j59155J8365K01788j19272r6278L31482J74854J24641L33701R5281
$$ plain form
15869 339642 192306 292789 162638 208477 349545 89008 -96304 -144802 -253497 -16478
15859 -16478 -60320 68053 -26315 41536 330281 112157 -142856 -226987 -47597 40286 -231661
15848 -231661 -692747 -559584 -287844 -192459 188952 334417 114683 -102478 -45491 -237933
15838 -237933 -395890 -455060 -519890 -272579 -86075 45145 -197812 -420579 -411086 -88266
15828 -88266 213756 102184 -212232 -189066 163943 444811 282233 151783 417621 401260
15818 401260 350142 287280 24119 -125282 -13277 91598 -7452 -337967 -903954 -599532
15808 -599532 30394 -68559 -426786 -407091 -196325 -9889 -226132 -395285 -301757 -508941
15798 -508941 -340688 -311471 -418374 -239436 -113064 -28841 44584 -92423 -312121 -382287
$$ packed form
15869C39642j47336J00483j30151M5839J41068k60537j85312m8498j08695K37019
15859a6478m3842J28373r4368O7851K88745k18124k55013q4131J79390Q7883k71947
15848b31661m61086J33163K71740R5385L81411J45465k19734k17161N6987j92442
15838b37933j57957n9170o4830K47311J86504J31220k42957k22767R493L22820
15828h8266L02022j11572l14416K3166L53009K80868j62578j30450K65838j6361
15818D01260n1118o2862k63161j49401J12005J04875r9050l30515n65987L04422
15808e99532O29926r8953l58227J9695K10766J86436k16243j69153R3528k07184
15798e08941J68253K9217j06903J78938J26372Q4223P3425j37007k19698p0166
$$ plain form
15788 -382287 -110342 -68277 -183866 -530464 -450238 -502896 -266525 217984 517614 369025
15778 369025 470155 462590 109839 176162 67202 -127347 -63907 110606 121876 -55257
15768 -55257 -167662 -95060 -115711 -425174 -408731 -270586 -194194 -192344 -315246 -289979 -686237
15757 -686237 -712960 -384976 -150616 179477 331020 15754 -260165 -28800 -37251 -340068
15747 -340068 -346193 -449580 -595067 -394920 -70246 -343973 -422600 -39819 96619 138980
15737 138980 1455 -335851 -365736 -187337 28699 -42083 94287 41612 156571 470616
15727 470616 295724 -309418 -434145 -293096 -294965 -195066 -9867 161116 203292 96182
15717 96182 -190988 -204282 -518600 -617536 -499868 -298522 136394 355219 435501 313889
$$ packed form
15788c82287K71945M2065j15589l46598Q0226n2658K36371M84509K99630j48589
15778C69025J01130p565l52751O6323j08960j94549O3440J74513J1270j77133
15768e5257j12405P2602k0651l09463J6443J38145P6392J850j22902K5267l96258
15757f86237k6723L27984K34360L30093J51543l15266k75919K31365q451l02817
15747c40068o125j03387j45487K00147L24674k73727p8627L82781J36438M2361
15737A38980j37525l37306k9885J78399K16036p0782J36370n2675J14959L14045
15727D70616j74892o05142j24727J41049j869R9899J85199J70983M2176j07110
15717I6182k87170j3294l14318r8936J17668K01346M34916K18825Q0282j21612
$$ plain form
15707 313889 -223795 -423515 -356843 -315673 -133682 107231 151971 236763 195939 -16485
15697 -16485 251199 557989 543046 283355 204411 1290 80879 361820 611787 440286
15687 440286 355271 363574 473664 632341 382867 -9374 266506 -88700 -391559 -348260
15677 -348260 -21383 253431 27933 -61576 -408682 -82782 -208655 -501158 -470765 -376680
15667 -376680 -182000 -160193 -153267 -110636 -381084 -218345 26180 263509 244181 9661
15657 9661 -32143 93492 208381 207474 329869 431945 128341 38727 -371133 -740418 -748481
15646 -748481 -622483 -313885 146435 283436 261480 -182256 154173 28706 -58500 -77023
15636 -77023 -33840 -82831 -72603 -215339 -332186 -329490 -340681 -369571 -75138 351926 492124
$$ packed form
15707C13889n37684j99720O6672M1170J81991K40913M4740Q4792m0824k12424
15697a6485K67684L06790j4943k59691p8944k03121P9589K80941K49967j71501
15687D40286q5015Q303J10090J58677k49474l92241K75880l55206l02859M3299
15677c48260L26877K74814k25498q9509l47106L25900j25873k92503L0393R4085
15667c76680J94680K1807O926M2631k70448J62739K44525K37329j9328k34520
15657I661m1804J25635J14889r07J22395J02076l03604q9614m09860l69285q063
15646g48481J25998L08598M60320J37001k1956m43736L36429j25467q7206j8523
15636g7023M3183m8991J0228j42736j16847K696j1191k8890K94433M27064J40198
$$ plain form
15625 492124 392759 116484 193238 183074 -153318 167276 193837 99769 -171647 -164225 -66697
15614 -66697 175394 209164 153077 -75295 -201999 -383771 -54140 78458 -88352 -160236
15604 -160236 -173554 -104472 92877 223319 -61535 -240176 -140939 -238189 -206857 -226382 -218762
15593 -218762 -49711 36068 485004 187841 -211072 -423385 60777 357890 80875 15999
15583 15999 82988 62987 -80274 62486 50213 164008 109390 67064 372821 332975 311266
15572 311266 505705 36490 -279514 -274326 -134017 -119881 -117884 -272656 -210131 -53455 -30055
15561 -30055 -52800 22477 -229964 -221767 -137551 -572631 -499282 -398668 -312294 -56275 289676
15550 289676 101983 -34654 -191193 -367993 -394523 -387077 -247467 87604 42125 125271
$$ packed form
15625D92124r9365k76275P6754j0164l36392L20594K6561r4068k71416P422R7528
15614f6697K42091L3770n6087k28372j26704j81772L29631J32598j66810p1884
15604a60236j3318O9082J97349J30442k84854j78641R9237r7250L1332j9525P620
15593b18762J69051Q5779M48936k97163l98913k12313M84162K97113k77015o4876
15583A5999O6989k0001j43261J42760j2273J13795n4618m2326L05757l9846k1709
15572C11266J94439m69215l16004N188J40309J4136J997j54772O2525J56676K3400
15561c0055k2745P5277k52441Q197Q4216m35080P3349J00614Q6374K56019L45951
15550B89676j87693j36637j56539j76800k6530P446J39610L35071m5479Q3146
$$ plain form
15540 125271 127988 332929 407559 374102 153722 86010 80947 17163 44324 344674 319138
15529 319138 166552 178577 285914 387097 177811 229470 257028 593829 379657 102534
15519 102534 -99954 -102338 -284572 -297040 -186615 -132621 -237935 -378496 -425934 -666025
15509 -666025 -659405 -633866 -744496 -686408 -16960 341488 14414 -325080 -336434 -298778 -664562
15498 -664562 -742715 -519106 -439672 -347403 -301680 -101011 -16855 169347 242061 195428 308602
15487 308602 413758 492777 -203230 -326049 76966 110146 343284 606939 441970 531340
15477 531340 236123 76583 84212 59401 171984 204916 219319 31309 -351111 -226137
15467 -226137 -341810 -517587 -577806 -539175 -433593 -296298 -253249 -105130 -142424 -52881
$$ packed form
15540A25271K717K04941P4630l3457k20380o7712n063o3784K7161L00350k5536
15529C19138j52586J2025J07337J01183k09286N1659K7558L36801k14172k77123
15519A02534k02488k384j82234j2468J10425N3994j05314j40561m7438k40091
15509f66025O620K5539j10630N8088O69448L58448l27074l39494j1354L7656l65784
15498f64562p8153K23609P9434R2269M5723K00669Q4156J86202P2714m6633J13174
15487C08602J05156P9019o96007j22819M03015L3180K33138K63655j64969Q9370
15477E31340k95217j59540P629k4811J12583L2932J4403j88010l82420J24974
15467b26137j15673j75777o0219L8631J05582J37295M3049J48119l7294Q9543
$$ plain form
15457 -52881 -24354 -301589 -28777 20012 248485 352149 270684 -41737 186032 129512
15447 129512 131962 191038 189845 143989 80044 427663 796897 332015 -212928 -111068 144218
15436 144218 344862 473795 329947 -63762 254990 366492 301383 151966 89354 -143570
15426 -143570 85552 -147529 -350222 -424726 -571868 -223550 -259392 -140342 40523 132423
15416 132423 -138208 -49354 159011 494508 823661 717110 516671 222676 -359134 -578163
15406 -578163 -483866 -448085 -554939 -196990 89394 -199635 -247255 -131346 -402767 -801799
15396 -801799 -745117 -569157 -456017 -318789 -129459 -173251 -367377 -561119 -460567 -100396
15386 -100396 -242316 -54978 179508 -165890 -658113 -481093 -182837 -30894 -110671 -289034
$$ packed form
15457e2881K8527k77235K72812M8789K28473J03664q1465l12421K27769n6520
15447A29512K450N9076j193m5856o3945L47619L69234m64882n44943J01860K55286
15436A44218K00644J28933j43848l93709L18752J11502o5109j49417o2612k32924
15426a43570K29122k33081k02693p4504j47142L48318l5842J19050J80865R1900
15416A32423k70631Q8854K08365L35497L29153j06551k00439k93995n81810k19029
15406e78163R4297L5781j06854L57949K86384k89029m7620J15909k71421l99032
15396h01799N6682J75960J13140J37228J89330m3792j94126j93742J00552L60171
15386a00396j41920J87338K34486l45398m92223J77020K98256J51943p9777j78363
$$ plain form
15376 -289034 -299048 -195107 107663 394013 -39323 96314 112862 -191635 -151956 184308
15366 184308 58292 -120779 -220484 -402790 -339863 -65486 75635 -16368 -184132 -263813
15356 -263813 -173250 -41875 -73227 8990 212955 162659 -125079 -365877 -188541 -159551
15346 -159551 -107885 -88612 79013 246976 373005 399609 199990 256229 169473 196525 -6656
15335 -6656 52740 334039 351543 161232 270738 342634 94892 131954 222388 -127191 -321556
15324 -321556 -230072 -44263 -76225 -438010 -693198 -951387 -545897 -149650 -140730 284225
15314 284225 566261 497808 139186 -241119 -397707 -491415 -592153 -578178 -681521 -633689
15304 -633689 -573697 -331403 -325446 -308176 -232546 -192931 -30543 -33085 -188004 54031 75218
$$ packed form
15376b89034j0014J03941L02770K86350m33336J35637J6548l04497L9679L36264
15366A84308j26016j79071r9705j82306O2927K74377J41121r2003j67764p9681
15356b63813R0563J31375l1352Q2217K03965n0296k87738k40798J77336K8990
15346a59551N1666J9273J67625J67963J26029K6604j99619N6239q6756K7052k03181
15335f656N9396K81299J7504j90311J09506P1896k47742L7062R0434l49579j94365
15324c21556R1484J85809l1962l61785k55188k58189M05490L96247Q920M24955
15314B84225K82036o8453l58622l80305j56588r3708j00738J3975j03343M7832
15304f33689N9992K42294N957J7270P5630L9615J62388k542j54919K42035K1187
$$ plain form
15293 75218 -359158 -451286 -461188 -220144 -69061 129496 291347 335875 -48589 -154096
15283 -154096 -148718 -72155 -144206 -217827 -107255 113162 311731 -115272 -590946 -673489 -401690
15272 -401690 -261954 -216770 -265579 -136629 -29524 -197806 -170428 -114095 -293817 -192177
15262 -192177 -394717 -339789 -424545 -239189 6662 -116661 -255696 -363033 -416150 -482517
15252 -482517 -518335 -354320 -417246 -367836 -550841 -664986 -415199 -65263 377754 326401
15242 326401 200883 -45139 -172645 -39603 -162874 -81859 -144043 -88784 56266 229776
15232 229776 -7525 -139491 -184022 -291864 -683230 -826430 -696782 -647406 -480649 -307017
15222 -307017 -197299 2202 313063 245146 -259009 -465576 -294273 -15745 -81162 -364787
$$ packed form
15293G5218m34376r2128r902K41044J51083J98557J61851M4528l84464j05507
15283a54096N378P6563p2051p3621J10572K20417J98569m27003m75674q2543K71799
15272d01690J39736M5184m8809J28950J07105j68282K7378N6333j79722J01640
15262a92177k02540N4928q4756J85356K45851j23323j39035j07337n3117o6367
15252d82517l5818J64015o2926M9410j83005j14145K49787L49936M43017n1353
15242C26401j25518k46022j27506J33042j23271Q1015o2184N5259J45050J73510
15232B29776k37301j31966m4531j07842l91366j43200J29648M9376J66757J73632
15222c07017J09718J99501L10861o7917n04155k06567J71303K78528o5417k83625
$$ plain form
15212 -364787 -250907 183748 323420 20399 -325055 -383059 -13570 157529 181151 -108886
15202 -108886 -379262 -516907 -486480 -242908 -316721 -91732 259021 157086 355661 281688
15192 281688 -68357 -99242 -268077 -300838 -231442 -132557 -186546 124341 526820 532837 342239
15181 342239 -104949 -275967 -279615 -50937 -77848 45847 440563 549740 179468 -140038
15171 -140038 -294472 -229881 18611 16215 -70653 -63399 92171 -211335 -248026 -147008 -181585
15160 -181585 74906 107023 131945 -15301 -99961 20103 -202933 -711008 -736802 -563654
15150 -563654 -460072 -355792 -708059 -811544 -481245 -213206 -353299 -254027 -287832 -445633
15140 -445633 -546809 -468176 -41 -121534 -280655 -275228 -403288 -411531 -886994 -808740 -723532
$$ packed form
15212c64787J13880M34655J39672l03021l45454n8004L69489J71099K3622k90037
15202a08886k70376j37645L0427K43572p3813K24989L50753j01935J98575p3973
15192B81688l50045l0885j68835l2761O9396R8885n3989L10887M02479O017j90598
15181C42239m47188j71018l648K28678k6911J23695L94716J09177l70272l19506
15171a40038j54434O4591K48492k396q6868P254J55570l03506l6691J01018l4577
15160a81585K56491L2117K4922j47246q4660J20064k23036n08075k5794J73148
15150e63654J03582J04280l52267j03485L30299K68039j40093R9272l3805j57801
15140d45633j01176P8633M68135j21493j59121N427j28060q243m75463P8254Q5208
$$ plain form
15129 -723532 -475199 -212313 -276826 -281697 -270017 -195923 -229501 -109155 -157004 -260915 -311966
15118 -311966 -485309 -606580 -647150 -493490 -334082 -327518 -349325 -199930 -305877 -217384
15108 -217384 -451412 -768273 -709972 -585302 -3799 508809 450806 201168 -185369 -353324
15098 -353324 -204932 63268 -2127 -62170 46855 -133884 -233447 -97319 -36445 59820
15088 59820 326241 447460 269300 391831 226209 144484 -196968 -171107 -225845 -185834
15078 -185834 -374468 -454261 -607571 -602390 -141423 -137355 -183557 -349405 -468247 -452245 -180563
15067 -180563 -62227 105228 136434 130897 7643 255314 474052 218281 -28880 79453
15057 79453 -156148 -199828 -36529 -50398 -346621 -497885 -193107 -178129 -153305 -347369
$$ packed form
15129g23532K48333K62886o4513m871J1680P4094l3578J20346m7849j03911n1051
15118c11966j73343j21271m0570J53660J59408O564k1807J49395j05947Q8493
15108b17384k34028l16861N8301J24670N81503N12608n8003k49638l86537j67955
15098c53324J48392K68200o5395o0043J09025j80739r9563J36128O0874R6265
15088E9820K66421J21219j78160J22531j65622q1725l41452K5861n4738M0011
15078a85834j88634p9793j53310N181M60967M068m6202j65848j18842J6002K71682
15067a80563J18336J67455L1206n537j23254K47671K18738k55771k47161J08333
15057G9453k35601m3680J63299j3869k96223j51264L04778J4978K4824j94064
$$ plain form
15047 -347369 -350562 -287416 -70001 262938 233558 23842 -32426 61288 133148 45500 206644
15036 206644 351692 185199 -81168 -242747 -148115 -215931 -152525 -529055 -379219 -208478
15026 -208478 -330016 -240099 -132398 -148600 -50029 -200 -75084 -175455 -294902 -162014
15016 -162014 135298 191321 180830 268337 -7683 -220357 -567603 -735315 -449476 -177524
15006 -177524 -111414 -274514 -56838 -77046 188729 211764 239825 255335 -8018 -169444
14996 -169444 -500225 -694498 -652405 -678630 -578717 -191257 148886 199308 128542 -73317
14986 -73317 -27301 9627 183584 248430 -194127 -743043 -990688 -1456228 -1334098 -684997
14976 -684997 -462807 -459402 -208516 221602 722409 533324 263627 -147506 -109995 -81644
$$ packed form
15047c47369l193O3146K17415L32939k9380k09716n6268R3714P1860q7648J61144
15036B06644J45048j66493k66367j61579R4632o7816O3406l76530J49836J70741
15026b08478j21538Q9917J07701j6202R8571M9829p4884j00371j19447J32888
15016a62014K97312N6023j0491Q7507k76020k12674l47246j67712K85839K71952
15006a77524O6110j63100K17676k0208K65775K3035K8061J5510k63353j61426
14996a69444l30781j94273M2093k6225R9913L87460L40143N0422p0766k01859
14986g3317M6016L6928J73957O4846m42557n48916k47645m65540J22130O49101
14976f84997K22190L405K50886M30118N00807j89085k69697m11133L7511K8351
$$ plain form
14966 -81644 124459 -1124 -93867 101340 289373 244338 393525 471185 281391 40291
14956 40291 -35585 463080 431180 240659 151743 -36964 102780 241391 57588 -258608
14946 -258608 -46125 572494 763341 679331 104925 108167 100562 -297743 -189521 13835
14936 13835 424785 333449 209760 176493 -15191 -58972 -165748 -58201 160346 158225 166441
14925 166441 391461 315459 112747 -306821 -476414 -823038 -1155214 -1037807 -753221 -552133
14915 -552133 -335764 -125421 -465010 -538358 -321353 -293350 -11541 -57242 -135821 -98986
14905 -98986 75719 -284171 -117553 176997 -83800 -210048 -201206 -413564 -211838 142934
14895 142934 -44099 107622 115070 75219 -64046 156961 368570 49626 77714 251849
$$ packed form
14966h1644K06103j25583r2743J95207J88033m5035J49187P7660j89794k41100
14956D0291p5876M98665l1900j90521q8916j88707J39744J38611j83803l16196
14946b58608K12483O18619J90847q4010n74406L242p605l98305J08222K03356
14936A3835M10950r1336j23689l3267j91684m3781j06776J07547K18547k121Q216
14925A66441K25020p6002k02712m19568j69593l46624l32176J17407K84586K01088
14915e52133K16369K10343l39589p3348K17005K8003K81809m5701p8579L6835
14905i8986J74705l59890J66618K94550k60797j26248Q842k12358K01726L54772
14895A42934j87033J51721P448l9851j39265K21007K11609l18944K8088J74135
$$ plain form
14885 251849 351468 184866 -311634 -358649 -210973 -137408 -12311 -135569 4548 111665
14875 111665 -190201 -435699 -523136 -539897 -348004 -263527 -46104 112992 10886 -193185
14865 -193185 -485800 -576541 -269621 -46644 -18304 -93965 -337513 -304380 -273618 -67822
14855 -67822 -145470 -72512 -83803 -239279 -466384 -469543 -579091 -777028 -612537 -278347 -182678
14844 -182678 -57770 354125 203895 150645 249193 27772 199669 -93657 -729096 -1018140
14834 -1018140 -621143 -361618 -262868 -292070 -36694 367281 294392 275810 507004 535212
14824 535212 412239 248574 -2807 -38011 231782 95044 -213307 -521126 -323068 -169852
14814 -169852 -207110 -577199 -527187 -630463 -443654 -249471 -514931 -633557 -552106 -460024
$$ packed form
14885B51849R9619j66602m96500m7015J47676P3565J25097j23258J40117J07117
14875A11665l01866k45498q7437j6761J91893Q4477K17423J59096j02106k04071
14865a93185k92615r0741L06920K22977K8340p5661k43548L3133L0762K05796
14855f7822p7648P2958j1291j55476k27105l159j09548j97937J64491L34190R5669
14844a82678J24908M11895j50230n3250R8548k21421J71897k93326o35439k89044
14834a018140L96997K59525R8750k9202K55376M03975p2889j8582K31194K8208
14824E35212j22973j63665k51381l5204K69793j36738l08351l07819J98058J53216
14814a69852l7258l70089N0012j03276J86809J94183k65460j18626Q1451R2082
$$ plain form
14804 -460024 -350270 -46716 177055 215623 8852 -32006 -50220 -130133 -120598 -278942 -397556
14793 -397556 -290574 -55823 -372431 -844217 -832349 -570629 -327976 137959 125409 121756
14783 121756 299210 267909 -117657 -312850 -192637 -404139 -782006 -910315 -545870 -185243
14773 -185243 -40625 281798 278323 90990 37070 -305912 -565354 -358938 -597363 -307963
14763 -307963 -253146 -312512 -189415 -87397 -68045 17082 76170 214134 246167 172832 -94193
14752 -94193 -239572 -252236 -119311 -59275 -22166 -9519 -122413 -393401 -610855 -549765 -340454
14741 -340454 -104405 -282013 1713 196691 101233 385571 92854 -278016 -70971 -375016
14731 -375016 -619794 -639550 -219864 206959 138964 197615 305097 57873 -84655 -135572
$$ packed form
14804d60024J09754L03554K23771L8568k06771m0858j8214p9913R535j58344j18614
14793c97556J06982K34751l16608m71786J1868K61720K42653M65935j2550l653
14783A21756J77454l1301l85566j95193J20213k11502l77867j28309L64445L60627
14773a85243J44618L22423l475j87333n3920l42982k59442K06416k38425K89400
14763c07963N4817n9366J23097J02018J9352Q5127N9088J37964L2033p3335k67025
14752i4193j45379j2664J32925O0036L7109J2647j12894k70988k17454O1090K09311
14741c40454K36049j77608K83726J94978r5458K84338k92717l70870K07045l04045
14731c75016k44778j9756M19686M26823o7995N8651J07482k47224j42528n0917
$$ plain form
14721 -135572 62089 345095 308348 70419 59627 -38485 3569 112384 51151 10439 486377
14710 486377 734909 590672 293135 59885 -239285 -544302 -395546 -146559 58164 316150
14700 316150 372295 395210 227844 97593 372805 691084 226239 176938 138217 -52218
14690 -52218 -164844 -256433 -278892 134515 132916 -8466 -317981 -471520 -484538 -240803 70553
14679 70553 211965 147357 -271763 -394895 61928 -60945 -642878 -376017 11317 357264
14669 357264 352101 231453 -66354 -173705 -131882 33692 265969 288449 187385 208666
14659 208666 231658 547203 236998 -76178 -302698 -294036 -59052 -209622 -384612 -340843
14649 -340843 -74850 -55123 -50052 -7304 -207701 -85480 -31373 -42434 -115795 -241598 -301548
$$ packed form
14721a35572J97661K83006l6747k37929j0792r8112M2054J08815o1233m0712M75938
14710D86377K48532j44237k97537k33250k99170l05017J48756K48987K04723K57986
14700C16150N6145K2915j67366j30251K75212L18279m64845m9301l8721j90435
14690e2218j12626r1589k2459M13407j599j41382l09515j53539j3018K43735L11356
14679G0553J41412o4608m19120j23132M56823j22873n81933K66861L87334L45947
14669C57264n163j20648k97807j07351M1823J65574K32277K2480j01064K1281
14659B08666K2992L15545l10205l13176k26520Q662K34984j50570j74990M3769
14649c40843K65993J9727N071M2748k00397J22221N4107j1061p3361j25803n9950
$$ plain form
14638 -301548 -45942 -153964 -334847 -752691 -184470 265556 393129 539528 228260 -310112
14628 -310112 -96013 265269 -11880 -101314 -260669 -450710 -160197 190713 -101936 -278218
14618 -278218 -74148 169054 341895 538359 474396 569961 554401 251210 325032 333468 168149
14607 168149 357357 351218 55430 -42791 224462 331315 317269 365830 199717 1460
14597 1460 -151323 -108494 -46188 -88812 72656 283911 289899 172176 313786 -41872 5958
14586 5958 -37373 71505 161905 -60175 -137919 -547387 -542832 12871 194979 -90975 -175825
14575 -175825 -470483 -408155 -566975 -381068 -107076 257885 180534 -40939 -285331 -153913
14565 -153913 -13156 351158 530624 543567 446989 139411 -124682 62778 -191287 -588676
$$ packed form
14638c01548K55606j08022j80883m17844N68221M50026J27573J46399l11268n38372
14628c10112K14099L61282k77149q9434j59355j90041K90513L50910k92649j76282
14618b78218K04070K43202J72841J96464o3963R5565j5560l03191P3822Q436j65319
14607A68149J89208o139k95788r8221K67253J06853j4046M8561j66113j98257
14597A460j52783M2829O2306m2624J61468K11255N988j17723J41610l55658M7830
14586E958m3331J08878R0400k22080p7744m09468M555N55703J82108k85954q4850
14575a75825k94658O2328j58820J85907K73992L64961p7351k21473k44392J31418
14565a53913J40757L64314J79466J2943r6578l07578k64093J87460k54065l97389
$$ plain form
14555 -588676 -549186 -256355 -206584 -196480 -279847 -120840 -9532 -995 299030 551490 410961
14544 410961 -16991 -226804 -373333 -392247 -220776 -217511 -39585 108176 531595 466536
14534 466536 431947 534612 300420 236210 340149 408456 396537 343444 378668 299825 -10327
14523 -10327 -533346 -565216 -216073 -37782 81787 185827 352875 532287 482737 440707
14513 440707 346041 327530 295796 324122 523124 99807 -175985 -135240 -242279 -270130 -182353
14502 -182353 -164077 -356782 -467917 -409072 -295385 -139339 7559 80900 -83745 -68927
14492 -68927 -218369 -302076 -426663 -339991 -246334 -142208 66513 192286 192428 -49154 -124060
14481 -124060 -352545 -422987 -498965 -120597 -4667 88191 -7147 332925 744643 847351
$$ packed form
14555e88676L9490K92831M9771J0104q3367J59007J11308Q537L00025K52460j40529
14544D10961m27952k09813j46529j8914J71471L265J77926J47761M23419o5059
14534D66536l4589J02665k34192o4210J03939O8307j1919n3093L5224p8843l10152
14523a0327n23019l1870L49143J78291J19569J04040J67048J79412m9550m2030
14513D40707r4666j8511l1734K8326J99002m23317k75792M0745j07039k7851Q7777
14502a82353J8276j92705j11135N8845J13687J56046J46898P3341j64645J4818
14492f8927j49442q3707j24587Q6672R3657J04126K08721J25773J42k41582p4906
14481a24060k28485p0442p5978L78368J15930R2858r5338L40072M11718J02708
$$ plain form
14471 847351 548220 321607 220693 -2805 -163525 -18814 134675 -207585 -465724 -269355
14461 -269355 27780 327755 358913 180391 -245013 -233121 -316731 -489188 -253099 -139842
14451 -139842 -288697 -69992 328718 384998 146544 -130329 -235141 -76830 -84786 -49400
14441 -49400 -87354 70514 -25244 80547 262196 280122 159292 139604 -69494 -157453 -197330
14430 -197330 -254112 -15405 119603 49358 -23566 -210540 -229671 -181453 222545 293617 281854
14419 281854 309572 482945 199623 4520 -24242 -169629 -269415 -197286 -261688 -351223 -159247
14408 -159247 -38799 45260 -303745 -507669 -176019 28434 340913 494595 487162 378536
14398 378536 131225 166298 50921 -42464 597434 582403 93598 41674 -24433 -198297
$$ packed form
14471H47351k99131k26613j00914k23498j60720J44711J53489l42260k58139J96369
14461b69355K97135K99975L1158j78522m25404J1892q3610j72457K36089J13257
14451a39842j48855K18705L98710N6280k38454k76873j04812J58311p956L5386
14441d9400l7954J57868r5758J05791J81649J7926j20830j9688k09098q7959l9877
14430a97330n6782K38707J35008p0245p2924j86974j9131M8218M03998P1072j1763
14419B81854K7718J73373k83322j95103k8762j45387r9786P2129o4402q9535J91976
14408a59247J20448Q4059l49005k03924L31650K04453L12479J53682p433j08626
14398C78536k47311L5073j15377r3385O39898j5031m88805n1924o6107j73864
$$ plain form
14388 -198297 -416619 -228564 -200150 -554886 -787709 -620463 -154849 -244361 -289667 -151155
14378 -151155 -135729 -400313 -505531 -52245 96537 290130 -21227 -180550 -257107 -111414
14368 -111414 -44971 -66890 2625 32708 146194 207894 73495 7843 30326 -277202 -287446
14357 -287446 -383540 -318412 432410 662688 167247 -83857 -467631 -584689 -412645 -227257
14347 -227257 -237466 -202701 -62766 -430906 12906 335000 123583 -270815 -501318 -606095
14337 -606095 -518460 -716703 -803273 -525778 -678808 -713679 62840 448567 303099 6831
14327 6831 34696 176847 184921 210583 184457 112229 373905 33647 -382280 -461933 -446442
14316 -446442 -282237 -34481 106757 -165218 -188952 -159132 -236690 -363059 -444307 -279444
$$ packed form
14388a98297k18322J88055K8414l54736k32823J67246M65614q9512m5306J38512
14378a51155J5426k64584j05218M53286J48782J93593l11357j59323p6557J45693
14368a11414O6443k1919O9515L0083J13486O1700j34399o5652K2483l07528j0244
14357b87446r6094O5128P50822K30278m95441k51104l83774j17058J72044J85388
14347b27257j0209L4765J39935l68140M43812L22094k11417l94398k30503j04777
14337f06095Q7635j98243q6570K77495j53030l4871P76519L85727j45468k96268
14327F831K7865J42151Q074K5662k6126p2228K61676l40258m15927p9653J5491
14316d46442J64205K47756J41238k71975k3734K9820p7558j26369q1248J64863
$$ plain form
14306 -279444 -109836 66778 221038 213758 -35739 -233149 -253966 -84082 100141 118441
14296 118441 -18870 -152383 -250253 150295 417605 558654 401548 246413 167240 -11898
14286 -11898 -817 164764 338452 184188 141794 81795 195819 572730 735033 628975
14276 628975 362511 155341 184657 312040 246414 170403 56164 420579 569245 281917
14266 281917 -72371 -196941 -236248 -300571 -34195 164549 57832 342044 291611 140849
14256 140849 -135278 -115787 19033 2837 -126515 -103513 -184313 -146205 -296467 -391648 193390
14245 193390 353351 427649 298313 338315 167650 154191 381887 578961 394908 102523
14235 102523 32594 -215422 -516487 -435148 -302711 160479 41964 25898 220425 450951
$$ packed form
14306b79444J69608J76614J54260p280k49497j97410k0817J69884J84223J8300
14296A18441j37311j33513r7870M00548K67310J41049j57106j55135p9173j79138
14286a1898J1081J65581J73688j54264m2394n9999J14024L76911J62303j06058
14276F28975k66464k07170K9316J27383o5626p6011j14239L64415J48666k87328
14266B81917l54288j24570l9307o4323K66376J98744j06717K84212n0433j50762
14256A40849k76127J9491J34820j6196j29352K3002q0800L8108j50262r5181N85038
14245A93390J59961P4298j29336M0002j70665j3459K27696J97074j84053k92385
14235A02523o9929k48016l01065Q1339J32437M63190j18515j6066J94527K30526
$$ plain form
14225 450951 390803 356940 326268 -67923 14891 358618 227292 122279 256778 258818 145371
14214 145371 -18918 -186778 -50732 205340 198515 96973 -28183 -217997 -287989 -351682
14204 -351682 -425191 -371152 -310700 -82815 231696 62738 -207124 -155548 14041 -302683
14194 -302683 -510878 -495427 -683704 -809057 -659949 -518042 -454709 -275548 -311935 -497109
14184 -497109 -459854 -157496 -253310 -392723 -155194 37361 439395 536463 241495 133760
14174 133760 526066 635486 422437 481032 485005 125160 -169475 -104617 -140136 -225123 -609511
14163 -609511 -621238 -529873 -286182 147068 -269335 -596314 -222393 101225 44322 116201
14153 116201 386619 184349 -32795 -424121 -185966 204623 330987 492336 481239 496164
$$ packed form
14225D50951o0148l3863l0672l94191Q2814L43727j31326j05013J34499K040j13447
14214A45371j64289j67860J36046K56072o825j01542j25156j89814o9992o3693
14204c51682p3509N4039O0452K27885L14511j68958k69862N1576J69589l16724
14194c02683k08195J5451j88277j25353J49108J41907O3333J79161l6387j85174
14184d97109L7255L02358r5814j39413K37529J92555M02034R7068k94968j07735
14174A33760L92306J09420k13049N8595L973l59845k94635O4858l5519q4987l84388
14163f09511j1727R1365K43691M33250m16403l26979L73921L23618n6903P1879
14153A16201K70418k02270k17144l91326K38155L90589J26364J61349j1097J4925
$$ plain form
14143 496164 595574 288835 -30465 -309585 -216486 -130293 100210 -76120 -190768 30103
14133 30103 42286 -81633 -12818 331621 481600 244329 315211 190910 -141401 -522501
14123 -522501 -829449 -702928 -602246 -204134 101914 39811 276499 423562 467411 55950
14113 55950 -273586 -201525 -141038 -356246 -373832 -359306 -189449 107634 314696 451063
14103 451063 427180 532787 663139 702002 308476 234835 123430 -265953 -285099 -259783
14093 -259783 -101557 -286253 -391211 -186820 -226769 -107951 -37891 -95138 -22922 502459
14083 502459 662311 687697 509989 206240 20325 40125 189403 -100406 -554050 -723339
14073 -723339 -628765 -333653 106221 309545 534148 538983 272124 430763 526905 723191
$$ packed form
14143D96164R9410l06739l19300k79120R3099Q6193K30503j76330j14648K20871
14133C0103J2183j23919O8815L44439J49979k37271P0882j24301l32311l81100
14123e22501l06948J26521J00682L98112L06048o2103K36688J47063M3849m11461
14113E5950l29536P2061O0487k15208j7586J4526J69857K97083K07062J36367
14103D51063k3883J05607J30352L8863l93526p3641j11405l89383j9146K5316
14093b59783J58226j84696j04958K04391l9949J18818P0060n7247P2216N25381
14083E02459J59852K5386j77708l03749j85915J9800J49278k89809m53644j69289
14073g23339R4574K95112M39874K03324K24603M835k66859J58639R6142J96286
$$ plain form
14063 723191 390238 -55412 -457220 -247490 127398 372622 313788 240051 373518 281282
14053 281282 248372 70223 165080 276841 397705 178878 267433 -109512 -242034 -213455
14043 -213455 -55407 144819 231379 372100 214868 157818 115514 64053 273340 284195
14033 284195 185080 248098 409557 279955 191364 -202143 -222813 -445707 -135980 -106394
14023 -106394 24973 31577 91447 82895 77158 77994 -137053 -364266 -278658 -484001 -454294 -550289
14011 -550289 -470377 -447788 -333875 -250334 -463965 -442839 -318853 -11527 287142 454318
14001 454318 660148 334726 -144664 -140827 -39495 -180239 -253537 -298063 -94728 62489
13991 62489 13604 158127 31793 279636 512423 563280 488361 252820 333401 561822
$$ packed form
14063G23191l32953m45650m01808K09730L74888K45224n8834p3737J33467r2236
14053B81282l2910j78149R4857J11761J20864k18827Q8555l76945j32522K8579
14043b13455J58048K00226Q6560J40721j57232n7050m2304n1461K09287J0855
14033B84195r9115O3018J61459j29602q8591l93507k0670k22894L09727K9586
14023a06394J31367O604N9870q552n737Q36k15047k27213Q5608k05343K9707r5995
14011e50289P9912K2589J13913Q3541k13631K1126J23986L07326K98669J67176
14001D54318K05830l25422m79390L837J01332j40744p3298m4526K03335J57217
13991F2489m8885J44523j26334K47843K32787N0857p4919k35541Q0581K28421
$$ plain form
13981 561822 312464 -53770 -110820 -199664 -471136 -226166 -245429 -105768 -93643 -105279
13971 -105279 -89076 -141315 -306653 -280819 -134270 168577 -213189 -223228 70503 89771
13961 89771 -89463 -104632 -33359 -149638 35237 -16486 407693 461427 618792 626896 516538
13950 516538 459441 212225 27253 -210739 -195337 139234 371743 336869 650486 683616
13940 683616 349396 -62753 -193616 -366294 -319181 -84629 323526 253174 -174297 -75165
13930 -75165 117009 6944 -218984 138534 388672 338698 20155 -85849 -276728 -267636
13920 -267636 -376320 -193707 105619 31760 42536 163317 95135 -254831 -234571 -222101
13910 -222101 -81026 -103442 -8798 -4933 -171011 -345925 -158848 438042 667961 501077
$$ packed form
13981E61822k49358l66234n7050q8844k71472K44970j9263J39661J2125j1636
13971a05279J6203n2239j65338K5834J46549L02847l81766j0039K93731J9268
13961H9771j79234j5169P1273j16279J84875n1723M24179N3734J57365Q104j10358
13950E16538n7097k47216j84972k37992J5402L34571K32509l4874L13617L3130
13940F83616l34220m12149j30863j72678M7113K34552M08155p0352m27471R9132
13930g5165J92174j10065k25928L57518K50138m9974l18543j06004j90879R092
13920b67636j08684J82613K99326p3859J0776J20781o8182l49966K0260J2470
13910b22101J41075k2416R4644L865j66078j74914J87077N96890K29919j66884
$$ plain form
13900 501077 177517 404862 234545 -471676 -159996 188236 209456 202802 267473 -37361
13890 -37361 -116924 45145 -257004 -281344 35855 217338 345742 -96306 -251624 -250650 -1477
13879 -1477 29017 28738 85428 -114300 -354632 -524730 -310880 45608 498432 594099 360005
13868 360005 325700 553516 775586 1034203 1275244 1292145 1039652 798790 925062 816129
13858 816129 677083 653584 266176 -218792 23380 -172990 -516678 -402150 -452521 -165078
13848 -165078 236029 234821 170547 465543 402161 337406 691398 649011 371419 369272 632862
13837 632862 336729 226446 166104 233369 33873 33982 63804 -140005 -305723 -64670 -173245
13826 -173245 -329297 -410507 -361930 -121820 -47080 -7378 172038 19279 -98829 243137
$$ packed form
13900E01077l23560K27345j70317p06221L11680L48232K1220o654O4671l04834
13890c7361p9563J62069l02149k4340L17199J81483J28404m42048j55318R74K49173
13879a477L0494k79N6690j99728k40332j70098K13850L56488M52824R5667k34094
13868C60005l4305K27816K22070K58617K41041J6901k52493k40862J26272j08933
13858H16129j39046k3499l87408m84968K42172j96370l43688J14528n0371K87443
13848a65078M01107j208o4274K94996o3382o4755L53992m2387k77592k147K63590
13837F32862k96133j10283o0342O7265j99496J09K9822k03809j65718K41053j08575
13826a73245j56052q1210M8577K40110P4740L9702J79416j52759j18108L41966
$$ plain form
13816 243137 -67262 -398606 -473888 -460341 -213617 -4855 12915 -68564 -8698 180813
13806 180813 33540 118386 281577 216506 -35580 -110479 -277390 -247498 -38593 -51865
13796 -51865 -282784 -464954 -509237 -474488 -173775 175997 241471 203920 263041 -4112 -270295
13785 -270295 -34294 -115659 -320299 43430 -168072 27819 121613 102357 236902 147795
13775 147795 71954 1822 -89319 -209849 -104114 6766 32683 136248 361164 634681
13765 634681 991313 1001373 660812 470221 594590 750771 834038 636808 230278 -14314
13755 -14314 9278 -241189 -96726 100684 -189089 -350507 -450864 -412314 -357850 -15163
13745 -15163 24026 -7994 66972 159633 20495 -82820 138782 -24377 -261553 -113111
$$ packed form
13816B43137l10399l31344p5282J3547K46724K08762J7770q1479N9866J89511
13806A80813j47273Q4846J63191o5071k52086p4899j66911K9892K08905j3272
13796e1865k30919j82170m4283L4749L00713L49772O5474l7551N9121k67153k66183
13785b70295K36001q1365k04640L63729k11502J95891R3794j9256J34545q9107
13775A47795p5841p0132r1141j20530J05735J10880K5917J03565K24916K73517
13765F34681L56632J0060l40561j90591J24369J56181Q3267j97230m06530k44592
13755a4314K3592k50467J44463J97410k89773j61418j00357L8550N4464L42687
13745a5163L9189l2020P4966R2661j39138j03315K21602j63159k37176J48442
$$ plain form
13735 -113111 -156419 -193088 -45479 -104991 -478186 -635839 -548134 -597206 -653382 -740825 -462594
13724 -462594 -247092 -87011 73075 -125953 -330579 -337977 -420285 -533544 -411070 85231
13714 85231 234682 131693 254084 156392 201620 201923 205228 152540 170817 282839 492838
13703 492838 557403 597343 223117 -23550 90956 42493 337843 377616 428132 405548 331577
13692 331577 97738 -334926 -183933 153435 329088 351491 -30388 -182247 134233 311705
13682 311705 291126 35447 -67903 20281 145517 343541 372696 10997 -30064 -241677
13672 -241677 -122199 316787 154988 -142936 -213590 -440546 -148658 293363 512778 251698
13662 251698 351345 841846 862530 540922 408766 401279 448345 183965 141936 -219482 -202470
$$ packed form
13735a13111m3308l6669J47609n9512l73195j57653Q7705m9072n6176q7443K78231
13724d62594K15502J60081J60086j99028k04626p398q2308j13259J22474M96301
13714H5231J49451j02989J22391r7692M5228L03L305n2688J8277J12022K09999
13703D92838O4565L9940l74226k46667J14506m8463K95350L9773N0516k2584p3971
13692C31577k33839m32664J50993L37368J75653K2403l81879j51859L16480J77472
13682C11705k0579k55679j03350Q8184J25236J98024K9155l61699m1061k11613
13672b41677J19478M38986j61799k97924p0654k26956K91888M42021K19415k61080
13662B51698R9647M90501K0684l21608j32156p487M7066k64380m2029l61418J7012
$$ plain form
13651 -202470 -314161 -214977 -13526 -155172 -51760 -309222 -469039 -137477 153796 -105434
13641 -105434 -250775 -91287 255289 453387 506176 424589 56879 109954 272467 136789
13631 136789 -250119 -418554 2362 -226562 -209939 -123855 60976 120673 50027 -177529
13621 -177529 -70066 5392 55038 45358 344928 440374 230599 -126961 -138589 -130951 -167734
13610 -167734 -73271 -921 88276 -52387 -284111 -327534 -185873 30338 209582 179558
13600 179558 80002 -139211 -73356 245159 160950 358154 730342 916618 518109 48599
13590 48599 5049 -35415 -47460 82744 146357 315317 579107 646898 507340 316556 468111
13579 468111 509383 237666 222080 310957 333580 216555 456658 602542 424448 615500
$$ packed form
13651b02470j11691R9184K01451j41646J03412k57462j59817L31562K91273k59230
13641a05434j45341J59488L46576J98098N2789q1587l67710N3075J62513j35678
13631A36789l86908j68435M20916k28924J6623Q6084J84831N9697p0646k27556
13621a77529J07463P5458M9646r680K99570R5446k09775l57560j1628P638l6783
13610a67734R4463P2350Q9197j40663k31724m3423J41661K16211J79244l0024
13600A79558r9556k19213O5855L18515q4209J97204L72188J86276l98509m69510
13590D8599m3550m0464j2045J30204O3613J68960K63790O7791j39558j90784J51555
13579D68111M1272k71717j5586Q8877K2623j17025K40103J45884j78094J91052
$$ plain form
13569 615500 654410 489399 452341 395935 685085 451448 585960 773086 1178472 1005103
13559 1005103 794968 664232 799362 640177 503719 523312 662914 516401 -214255 -660035
13549 -660035 -532545 -480445 -167341 105751 481684 733911 604146 641642 541734 493485
13539 493485 577606 724703 803007 308378 336531 143484 46605 1208 47678 -274593 -469310
13528 -469310 -229208 237051 734096 721974 460664 302464 127042 173167 416916 557879
13518 557879 247523 181311 341976 550125 391337 209841 185334 345912 314932 533577
13508 533577 559180 701861 942352 969687 549214 104698 -188069 -55672 -98849 -54479
13498 -54479 181358 515373 527568 655940 459220 337886 338770 58616 -120101 -139792 -297448
$$ packed form
13569F15500L8910j65011l7058n6406K89150k33637J34512J87126M05386j73369
13559A005103k10135j30736J35130j59185j36458J9593J39602j46513p30656m45780
13549f60035J27490N2100L13104K73092L75933K52227j29765L7496r9908m8249
13539D93485Q4121J47097P8304m94629K8153j93047r6879m5397M6470l22271j94717
13528d69310K40102M66259M97045j2122k61310j58200j75422M6125K43749J40963
13518E57879l10356o6212J60665K08149j58788j81496k4507J60578l0980K18645
13508E33577K5603J42681K40491K7335m20473m44516k92767J32397m3177M4370
13498e4479K35837L34015J2195J28372j96720j21334Q84k80154j78717j9691j57656
$$ plain form
13487 -297448 -106213 247768 320483 386461 -33491 -187009 -184066 -277207 -257344 -133339 -160889
13476 -160889 118406 96511 227977 321166 357647 161510 117746 126085 -16864 -321914 -504854
13465 -504854 -448623 -214376 122399 403320 557296 381120 179884 297928 549681 642119
13455 642119 775852 807964 532368 702706 944114 1042204 944340 935665 885384 770585 702058
13444 702058 916938 809272 502295 97594 31516 619620 703504 249572 88494 291834
$$ packed form
13487b97448J91235L53981P2715O5978m19952j53518K943r3141J9863J24005k7550
13476a60889K79295k1895J31466R3189L6481j96137m3764Q339j42949l05050j82940
13465e04854N6231K34247L36775K80921J53976j76176k01236J18044K51753R2438
13455F42119J33733L2112k75596J70338K41408R8090r7864q675n0281j14799o8527
13444G02058K14880j07666l06977m04701o6078N88104Q3884m53932j61078K03340
$$ [...]
##END NTUPLES=NMR SPECTRUM
##END=
