##TITLE=Analysis number 328344
Compound Code mo 01169
Project Code adrs
Chemist Name fudan
##JCAMPDX= 6.0         $$ Bruker NMR JCAMP-DX V2.0
##DATA TYPE= NMR SPECTRUM
##DATA CLASS= NTUPLES
##ORIGIN= Bruker BioSpin GmbH
##OWNER= nmr
$$ XWIN-NMR		Version 3.5
$$ Tue May 29 12:07:51 2007 GMT Daylight Time (UT+1h)  MAYBRIDGE\nmr@NMR_250MHZ
##.OBSERVE FREQUENCY= 250.131544655141
##.OBSERVE NUCLEUS= ^1H
##.ACQUISITION MODE= SIMULTANEOUS (DQD)
##.ACQUISITION SCHEME= undefined
##.AVERAGES= 16
##.DIGITISER RES= 18
##SPECTROMETER/DATA SYSTEM= dpx250
##.PULSE SEQUENCE= zg30
##.SOLVENT NAME= CDCl3
##.SHIFT REFERENCE= (INTERNAL, CDCl3, 0, 16.478)
##AUDIT TRAIL= $$ (NUMBER, WHEN, WHO, WHERE, WHAT)
$$ ##TITLE= Audit trail, XWIN-NMR		Version 3.5
$$ ##JCAMPDX= 5.01
$$ ##ORIGIN= Bruker BioSpin GmbH
$$ ##OWNER= nmr
$$ C:\u/data/dgb/nmr/ADRS/1620/pdata/1/auditp.txt
$$ ##AUDIT TRAIL=  $$ (NUMBER, WHEN, WHO, WHERE, WHAT)
(   1,<2007-05-29 12:07:31.04 +100>,<MAYBRIDGE\nmr>,<NMR_250MHZ>,
      <created by zg, POWCHK disabled, PULCHK disabled
       configuration hash MD5:
       76 6E 9A 78 1E 09 19 81 EC 84 63 8F B0 6A 59 2D
       data hash MD5: 64K
       D5 6F AC 2F A2 13 C4 75 2F 38 17 AB 45 EB 26 FA>)
(   2,<2007-05-29 12:07:43.12 +100>,<MAYBRIDGE\nmr>,<NMR_250MHZ>,
      <Start of raw data processing
       ef LB = 0.3 FT_mod = 6 PKNL = 1 SI = 32K 
       data hash MD5: 32K
       51 4E A7 E2 8A 2B 66 18 36 D2 E2 0D 8C DA 76 AE>)
(   3,<2007-05-29 12:07:44.90 +100>,<MAYBRIDGE\nmr>,<NMR_250MHZ>,
      <apk 
       data hash MD5: 32K
       13 E6 D8 BC 79 25 52 69 ED B2 78 C5 FE 3B 53 D6>)
(   4,<2007-05-29 12:07:45.57 +100>,<MAYBRIDGE\nmr>,<NMR_250MHZ>,
      <abs ABSG = 5 
       data hash MD5: 32K
       51 18 5A 8B F7 3E 6E 95 10 CD 13 4E 32 7C B4 76>)
$$ ##END=
$$ 
$$ hash MD5
$$ 82 10 77 2B B6 04 CC EC EF BB 33 A5 AF 1B 27 6D
##$RELAX= 
##$RELAX= 
##$RELAX= 
##$RELAX= 
##$RELAX= 
##$RELAX= 
##$RELAX= 
$$ Bruker specific parameters
$$ --------------------------
##$DU= <C:\u>
##$EXPNO= 1620
##$NAME= <ADRS>
##$PROCNO= 1
##$TYPE= <nmr>
##$USER= <dgb>
##$AMP= (0..31)
100 100 100 100 100 100 100 100 100 100 100 100 100 100 100 100 100 100 
100 100 100 100 100 100 100 100 100 100 100 100 100 100 
##$AQSEQ= 0
##$AQ_mod= 3
##$AUNM= <au_zg>
##$AUTOPOS= <20 >
##$BF1= 250.13
##$BF2= 250.13
##$BF3= 250.13
##$BF4= 250.13
##$BF5= 500.13
##$BF6= 500.13
##$BF7= 500.13
##$BF8= 500.13
##$BYTORDA= 1
##$CFDGTYP= 0
##$CFRGTYP= 5
##$CHEMSTR= <none>
##$CNST= (0..31)
1 1 145 1 1 1 1 1 1 1 1 1 1 1 1 1 1 1 1 1 1 1 1 1 1 1 1 1 1 1 1 1 
##$CPDPRG= <>
##$CPDPRG1= <>
##$CPDPRG2= <>
##$CPDPRG3= <>
##$CPDPRG4= <mlev>
##$CPDPRG5= <mlev>
##$CPDPRG6= <mlev>
##$CPDPRG7= <mlev>
##$CPDPRG8= <mlev>
##$CPDPRGB= <>
##$CPDPRGT= <>
##$D= (0..31)
0 1 0 0 0 0 0 0 0 0.06 0 0 0 0 0 0 0.0002 0 0 0 0 0 0 0 0 0 0 0 0 0 0 
0 
##$DATE= 1180436849
##$DBL= (0..7)
120 120 120 120 120 120 120 120 
##$DBP= (0..7)
150 150 150 150 150 150 150 150 
##$DBP07= 0
##$DBPNAM0= <>
##$DBPNAM1= <>
##$DBPNAM2= <>
$$ [...]
##$SUBNAM8= <"">
##$SUBNAM9= <"">
##$SW= 20.6930455092707
##$SWIBOX= (0..15)
0 0 3 0 0 0 0 0 0 0 0 0 0 0 0 0 
##$SW_h= 5175.983436853
##$TD= 65536
##$TD0= 1
##$TE= 683.16
##$TE2= 300
##$TE3= 300
##$TEG= 300
##$TL= (0..7)
0 120 120 120 120 120 120 120 
##$TP= (0..7)
150 150 150 150 150 150 150 150 
##$TP07= 0
##$TPNAME0= <>
##$TPNAME1= <>
##$TPNAME2= <>
##$TPNAME3= <>
##$TPNAME4= <>
##$TPNAME5= <>
##$TPNAME6= <>
##$TPNAME7= <>
##$TPOAL= (0..7)
0.5 0.5 0.5 0.5 0.5 0.5 0.5 0.5 
##$TPOFFS= (0..7)
0 0 0 0 0 0 0 0 
##$TUNHIN= 0
##$TUNHOUT= 0
##$TUNXOUT= 0
##$USERA1= <user>
##$USERA2= <user>
##$USERA3= <user>
##$USERA4= <user>
##$USERA5= <user>
##$V9= 5
##$VALIST= <valist>
##$VCLIST= <CCCCCCCCCCCCCCC>
##$VD= 0
##$VDLIST= <DDDDDDDDDDDDDDD>
##$VPLIST= <PPPPPPPPPPPPPPP>
##$VTLIST= <TTTTTTTTTTTTTTT>
##$WBST= 1024
##$WBSW= 4
##$XGAIN= (0..3)
0 0 0 0 
##$XL= 0
##$YL= 0
##$YMAX_a= 449797
##$YMIN_a= -590143
##$ZGOPTNS= <>
##$ZL1= 120
##$ZL2= 120
##$ZL3= 120
##$ZL4= 120
##$ABSF1= 16.47798
##$ABSF2= -4.215193
##$ABSG= 5
##$ABSL= 3
##$ALPHA= 0
##$AQORDER= 0
##$ASSFAC= 0
##$ASSFACI= 0
##$ASSFACX= 0
##$ASSWID= 0
##$AUNMP= <proc_1d>
##$AZFE= 0.1
##$AZFW= 0.1
##$BCFW= 0
##$BC_mod= 0
##$BYTORDP= 0
##$COROFFS= 0
##$CY= 12.5
##$DATMOD= 1
##$DC= 0
##$DFILT= <>
##$DTYPP= 0
##$F1P= 14.0000005364418
##$F2P= -0.99999901652339
##$FCOR= 0.5
##$FTSIZE= 32768
##$FT_mod= 6
##$GAMMA= 0
##$GB= 0
##$INTBC= 1
##$INTSCL= 1
##$ISEN= 128
##$LB= 0.3
##$LEV0= 0
##$LPBIN= 0
##$MAXI= 10000
##$MC2= 0
##$MEAN= 0
##$ME_mod= 0
##$MI= 0
##$NCOEF= 0
##$NC_proc= -5
##$NLEV= 6
##$NOISF1= 0
##$NOISF2= 0
##$NSP= 0
##$NTH_PI= 0
##$NZP= 0
##$OFFSET= 16.47798
##$PC= 1
##$PHC0= -47.43933
##$PHC1= -1.070921
##$PH_mod= 1
##$PKNL= yes
##$PPARMOD= 0
##$PSCAL= 4
##$PSIGN= 0
##$REVERSE= no
##$SF= 250.130011009006
##$SI= 32768
##$SIGF1= 0
##$SIGF2= 0
##$SINO= 400
##$SIOLD= 32768
##$SREGLST= <1H.CDCl3>
##$SSB= 0
##$STSI= 32768
##$STSR= 0
##$SW_p= 5175.98343685301
##$SYMM= 0
##$S_DEV= 0
##$TDeff= 65536
##$TDoff= 0
##$TI= <Analysis number 999999
Compound Code 99
Book Reference 9
Project Code 9>
##$TILT= no
##$TM1= 0
##$TM2= 0
##$TOPLEV= 0
##$USERP1= <user>
##$USERP2= <user>
##$USERP3= <user>
##$USERP4= <user>
##$USERP5= <user>
##$WDW= 1
##$XDIM= 32768
##$YMAX_p= 335894731
##$YMIN_p= -258733
$$ End of Bruker specific parameters
$$ ---------------------------------
##NTUPLES= NMR SPECTRUM
##VAR_NAME=  FREQUENCY,     SPECTRUM/REAL,   SPECTRUM/IMAG
##SYMBOL=    X,             R,               I
##VAR_TYPE=  INDEPENDENT,   DEPENDENT,       DEPENDENT
##VAR_FORM=  AFFN,          ASDF,            ASDF
##VAR_DIM=   32768,         32768,           32768
##UNITS=     HZ,            ARBITRARY UNITS, ARBITRARY UNITS
##FACTOR=    0.157963299565203, 1,           1
##FIRST=     4121.63723377053, 0,            0
##LAST=      -1054.34620308248, 0,           0
##MIN=       -1054.34620308248, -258733,     0
##MAX=       4121.63723377053, 335894731,    0
$$ Real data points
##PAGE= N=1
##DATA TABLE= (X++(R..R)), XYDATA
$$ [...]
17811B3583L9376M7368k1521k8777l4256M0603L1614l1740o9220r0729k2733P1782
$$ 23583 62959 110327 88806 60029 25773 66376 97990 66250 -2970 -93699 -116432 -44650
17799d4650P6835L309l855l1804m7946j9139l768J5123M4079k560K1801j5650
$$ -44650 32185 35494 31639 -165 -48111 -67250 -71018 -55895 -11816 -14376 7425 -8225
17787h225j9232L3597p00M8526q14j6771j1002M5075l397k4827k113p7487l7385
$$ -8225 -27457 6140 5440 53966 53152 36381 25379 70454 67057 42230 40117 -37370 -74755
17774g4755K2554O1885L5404m5275L7952J1920l3330J9532K8212K4585n0540j5151
$$ -74755 -52201 9684 45088 -187 37765 49685 16355 35887 64099 88684 38144 22993
17762B2993k5647m1398J9327K3143k36m2216j2232M6881L7747J327m0176m315
$$ 22993 -2654 -44052 -24725 -1582 -1818 -44034 -56266 -9385 28362 29689 -10487 -14802
17750a4802l7038q302p033N0859Q8960k2666j5320K7670q6148j6213L5998m7871
$$ -14802 -51840 -60142 -67175 -16316 72644 49978 34658 62328 -23820 -40033 -4035 -51906
17738e1906o1474K9276J7172P606K7645J7417J8344K8581m9158K4509J8739l3000
$$ -51906 -113380 -84104 -66932 -59326 -31681 -14264 4080 32661 -16497 8012 26751 -6249
17726f249l2209N6794K6843r985l1251j3706o665k0652J014K0913N1263P533j4662
$$ -6249 -38458 18336 45179 35194 3943 -9763 -16428 -37080 -36066 -15153 36110 43643 28981
17713B8981L4422P9461k0766L509J4549O780k577n1413o0811r736O5143m949K2117
$$ 28981 63403 142864 122098 125607 140156 146936 144359 92946 32135 22399 87542 82593 104710
17700A04710l9858o6008J1739l5795N136M7813L0156K2581J9448l2624l1898j4408
$$ 104710 64852 -1156 10583 -25212 -20076 27737 57893 80474 99922 67298 35400 20992
17688B0992P176k4258l4559J9541j5530k083M9076N7025m8781k8580K0445J8957
$$ 20992 28168 3910 -30649 -11108 -26638 -28721 20355 77380 28599 19 20464 39421
17676C9421k0644j9604N247n2362M804j6028K2143K3047m5502l3242J5352J1569
$$ 39421 18777 -827 4420 -47942 -43138 -59166 -37023 -13976 -59478 -92720 -77368 -65799
17664f5799K1353Q453m9722L3663O7830L5084K5512l6539m3463k2230L0504l643
$$ -65799 -44446 -35993 -85715 -52052 15778 50862 76374 39835 -3628 -25858 4646 1003
17652A003L3163M3181K0652n484k2728m051k9511l3791J4906K2580j8674k4597
$$ 1003 34166 77347 97999 92515 69787 65736 36225 2434 17340 39920 21246 -3351
17640c351J7937R47j9219L1201K9973K9774O782o4207m280K8913k0297j2909J7911
$$ -3351 14586 15533 -3686 27515 57488 87262 94044 29837 25557 54470 34173 21264 39175
17627C9175K5339M98M919l2943K3745J0109J0034O2832j8786l528M9698L3399
$$ 39175 64514 65012 69931 36988 60733 70842 80876 143708 124922 121394 171092 204491
17615B04491m2111j00999K032Q469k6104l6570l8199k793K5728l3897M4526O7052
$$ 204491 162380 61381 63413 71882 45778 9208 -28991 -31784 -6056 -39953 4573 71625
17603G1625l9903q4136N0413M8904O477N772m3589J9975L8886j5511k4850L3309
$$ 71625 31722 -52414 -2001 46903 53380 59152 15563 35538 74424 58913 34063 67372
17591F7372j2155m7525J752q180O714l8971k3742M202K4634M715l8335J8311O0450
$$ 67372 55217 7692 9444 1264 7978 -30993 -54735 -50533 -25899 -21184 -59519 -41208 19242
17578A9242N0847l6897l7810k4178N0454k7353p9941J2107N5258M5873J3880m4352
$$ 19242 70089 33192 -4618 -28796 21658 -5695 -85636 -73529 -18271 27602 41482 -2870
17566b870L512J7387L7881P161K7962l4733j4849k617J6391L5028r34j4050l0600
$$ -2870 642 18029 55910 63071 91033 56300 41451 38834 55225 90253 89319 75269 44669
17553D4669j1060L4161l0582J765l3632K1585j9918K1691J8846M219o62k2031
$$ 44669 33609 67770 37188 38953 5321 26906 6988 28679 47525 51744 51082 29051
17541B9051k0729m1634p989N288j0807J0885L0161K6725q271q615M5532l696o862
$$ 29051 8322 -33312 -41301 -36013 -46820 -35935 -5774 20951 12680 4065 49597 45901 39039
17528C9039J0595j6318m3649m5009M1842N3900L628L4383J7251p011m1203o5987
$$ 39039 49634 33316 -10333 -55342 -13500 40400 44028 78411 95662 88651 47448 -18539
17516a8539M399J4990L7753K8475N8462l6707l2626K6094m2729o2499L6163M5507
$$ -18539 -14140 850 38603 67078 125540 88833 56207 82301 39572 -22927 13236 58743
17504E8743p1290l0521M1924k2933K1494k9494p024l8648N6365N5272l2417N0859
$$ 58743 -12547 -43068 -1144 -24077 -2583 -32077 -39101 -77749 -21384 33888 1471 52330
17492E2330q400k2024j9436m1739M140n071l261J4131r94J1801N8712M4581l4216
$$ 52330 43930 21906 2470 -39269 -35129 -40200 -43461 -29330 -30324 -18523 40189 84770 50554
17479E0554l3410K292K2994k1642j4703r639k3784j3085j6873K1687o271K8047
$$ 50554 17144 19436 42430 20788 6085 -3554 -27338 -40423 -57296 -35609 -41880 -13833
17467a3833J8738K4750M5974J0624o2514n3586o84k021P42O6059P479o2397p1387
$$ -13833 4905 29655 75629 86253 23739 -29847 -30531 -32552 -31810 34249 41728 -20669 -92056
17454i2056J8787K7608O4332L1865J8005O10j2512O0761O8479J11348J12552K42718
$$ -92056 -73269 -45661 18671 50536 68541 69151 56639 117400 185879 297227 409779 652497
17442F52497M41080M24878j58083n23557l81228j56895r1448n4120p8150k3658
$$ 652497 1093577 1518455 1360372 836815 455587 298692 207244 153124 74974 51316
17432E1316q85l1442r901k8805l9088K0834K0160K7703K7187L6069M9209n2777
$$ 51316 50431 18989 9088 -19717 -58805 -37971 -17811 9892 37079 73148 122357 69580
17420F9580p0943m3472Q025M960M5154N2236o711K2535j5857k4510l683o2692
$$ 69580 -1363 -44835 -36810 -31850 13304 65540 58829 81364 65507 40997 37314 -25378
17408b5378o4798n747O7308O8442o643m1M8153J5432o118n821p4666j5444j8025
$$ -25378 -90176 -95923 -28615 39827 33184 33143 81296 96728 90610 84789 10123 -5321 -23346
17395b3346j8122k503k1596l285L0820K7554J326j2774K5175k5160l7960K5340
$$ -23346 -41468 -43971 -65567 -68852 -38032 -10478 -9152 -21926 3249 -21911 -59871 -34531
17383c4531N4163q681M847P1497N2035j2452m8441j3460k2608K4162m7016m5584
$$ -34531 19632 10951 15798 87295 139330 126878 78437 64977 42369 66531 19515 -26069
17371b6069K4375j8484j9319M1175M5095L4333J9116q7198r726l1033L9910N3359
$$ -26069 -1694 -20178 -39497 1678 46773 81106 100222 13024 3298 -27735 12175 65534
17359F5534r612q3983k2293L1562N0371j7502j8546k7941M3208l6498M1577m1522
$$ 65534 55922 -28061 -50354 -18792 31579 14077 -4469 -32410 10798 -25700 15877 -25645
17347b5645l2240j1477L0641N5169M5328m3934j1397m4340L0557J8941J5484l9968
$$ -25645 -57885 -69362 -38721 16448 61776 17842 6445 -37895 -7338 11603 27087 -12881
17335a2881l3957K79n407j1587M0124M7013k9486J2807R212j6290O385n8982N006
$$ -12881 -46838 -46559 -51966 -63553 -23429 23584 -5902 6905 16117 -173 6212 -52770 -47764
17322d7764J3964l8868L467p443m5756J8010J2265K1588K4939M4198K1131k9437
$$ -47764 -33800 -72668 -69201 -76644 -122400 -104390 -92125 -70537 -45598 -1400 19731 -9706
17310i706q122j0816K0548M1911J3534j1305o6982j9090N540N510l498N1535L5450
$$ -9706 -17828 -28644 -8096 33815 47349 36044 -30938 -50028 -44488 -38978 -42476 9059 44509
17297D4509O1803j7532p8414K8109N8213m9449p0450k0358P0611L2976m6857o7359
$$ 44509 106312 88780 10366 38475 96688 47239 -23211 -43569 27042 60018 13161 -54198
17285e4198o6556j0546J5979N3749L6861J7769J8370j8608k1675J0420N3875L3723
$$ -54198 -120754 -131300 -115321 -61572 -24711 -6942 11428 -7180 -28855 -18435 35440 69163
17273F9163j8431k5124m9128k9498n59L9716l976j2040K3624k0865J690l4281
$$ 69163 50732 25608 -23520 -53018 -53577 -13861 -17837 -29877 -6253 -27118 -25428 -59709
17261e9709j1701K6348N5028M2190l3503m3221o2646N8612O9620j5481j7400o87
$$ -59709 -71410 -45062 9966 52156 18653 -24568 -87214 -28602 41018 25537 8137 7450
17249G450j4697p393J8032o0247N846N8166p7m9120q650J1735N8877M550n4946
$$ 7450 -7247 -14640 3392 -56855 -51009 7157 7080 -42040 -50690 -38955 19922 24472 -30474
17236c0474J4644K8341j8560l1452Q110k532K2208l1067j3733L0357M0887K163
$$ -30474 -15830 12511 -6049 -37501 -29391 -31923 -9715 -40782 -54515 -24158 16729 18892
17224A8892P4460J0906l7312p1732k5120k2878j3957k2008Q527M8279L6919K0419
$$ 18892 93352 104258 66946 -4786 -29906 -52784 -66741 -88749 -80222 -31943 4976 25395
17212B5395j9392m6978k1943l4357l604L7580L3843j9269M124N85M1399O0858
$$ 25395 6003 -40975 -62918 -97275 -100879 -63299 -29456 -48725 -44601 -44016 -2617 58241
17200E8241J5597K8027l1405n5003m9627j2074k0825m5974j5674j44K8584K3613
$$ 58241 73838 101865 70460 15457 -34170 -46244 -67069 -113043 -128717 -128861 -100277 -76664
17188g6664L6099O2411N9941RP595J0696Q661l1525l3689P720J7704o8996j0233
$$ -76664 -40565 21846 81787 81796 89391 100087 108748 77223 43534 51254 68958 -38 -10271
17175a0271N3613N0364J4400j3760p0880M2796L7868k7720k6363l2027j3853r55
$$ -10271 43342 93706 108106 94346 23466 66262 104130 76410 50047 18020 4167 3212
17163C212j5765n7375M1326Q199m4811j1779o2125K92J8536K2688o23L9828r276
$$ 3212 -12553 -69928 -28602 -20403 -65214 -76993 -139118 -138826 -120290 -97602 -98225 -58397 -67673
17150f7673l9549J3968k9326R112J1870M0344L4662l2860j0691K7680j7680L3326
$$ -67673 -107222 -93254 -122580 -113468 -101598 -61254 -26592 -59452 -70143 -42463 -60143 -26817
17138b6817N8149k7280k4292j8264L4673L0247k8484p831L962j854K8035L3079
$$ -26817 31332 4052 -20240 -38504 -3831 26416 -2068 -9899 -5937 -7791 20244 53323
17126E3323m5923j9730k5223M851k1305l6242K5949M3033N834k5735k1559K2952
$$ 53323 7400 -12330 -37553 -32702 -54007 -90249 -64300 -21267 -15433 -41168 -62727 -39775
17114c9775K8710J7378J2371j1396O556m243Q628m16N990K3539j5005q9921J4152
$$ -39775 -11065 6313 18684 7288 13844 9601 18229 17813 23803 47342 32337 -57584 -43432
17101d3432K6591k0392k1397R815K3841L4660P3041k1068n8736r655K4008K1770
$$ -43432 -16841 -37233 -58630 -48815 -24974 9686 82727 61659 2923 -6732 17276 39046
17089C9046k2757o3237j8770L9532j8246K2605M3689m5395L3727O6063N701l8259
$$ 39046 16289 -46948 -65718 -26186 -44432 -21827 21862 -23533 10194 76257 81958 43699
17077D3699l3693Q224k6671n4948K3631Q936J5671l300j0430j6798J9640m0757
$$ 43699 10006 18230 -8441 -63389 -39758 -30822 -15151 -18451 -28881 -45679 -26039 -66796
17065f6796j2302N7289M0611n4698l7100J7231N5654J1104r5744l2585L1100K6325
$$ -66796 -79098 -21809 18802 -35896 -72996 -55765 -111 10993 -84751 -117336 -86236 -59911
17053e9911N4974q760l8846j0063l5386L093M7443k0072K0547K280J4830j1555
$$ -59911 -4937 -13697 -52543 -62606 -97992 -94899 -47456 -67528 -46981 -44701 -29871 -41426
17041d1426J2556N3407K8473N256m0291J5941p428r085j1227k3267K6783j9151
$$ -41426 -28870 24537 53010 58266 17975 33916 26488 17403 6176 -17091 9692 -9459
17029i459j6778R344l509n2250l9344n7940M7879M3080L3069L4351Q1354K8511
$$ -9459 -26237 -16893 -20402 -72652 -111996 -169936 -122057 -78977 -45908 -11557 69797 98308
17017I8308l2190k3717l1677k1805j2844J1433Q090L8794j3359M3714J4900k3047
$$ 98308 66118 42401 10724 -11081 -23925 -12492 -4402 34392 21033 64747 79647 56600
17005E6600k8493l0494j4572K1474l097L2274O1889k2954q3271p6764N3363K8947
$$ 56600 28107 -2387 -16959 4515 1418 33692 95581 72627 -10644 -87408 -34045 -5098
16993e098J271k1474j7262L6172M9718J2013L1021j979J7412j3797k3640k7254
$$ -5098 -3827 -25301 -42563 -6391 43327 55340 86361 84382 101794 87997 64357 37103
16981C7103m0644l2918j6326m8859l5537Q9227N4703o6817J2861J0016l5589L8361
$$ 37103 -3541 -36459 -52785 -101644 -137181 -47954 6749 -60068 -47207 -37191 -72780 -34419
16969c4419L902n2796J7320N9446M07j8074L4685O5026q104j4420j5485k5702
$$ -34419 -30517 -83313 -65993 -6547 -6140 -24214 10471 75497 67393 52973 37488 11786
16957A1786P090R391p3992q1060O0143L9500j5099n9924o0588k6439N8614M1403
$$ 11786 18876 28267 -45725 -126785 -66642 -27142 -42241 -102165 -162753 -189192 -130578 -89175
16945h9175l781J5137l1619j9372L032J9559O0361K0485k0603l8714k0358M9842
$$ -89175 -92956 -77819 -109438 -128810 -125778 -106219 -45858 -25373 -45976 -84690 -105048 -55206
16933e5206J1011J0449N3j5719J6666M9751j5708P784j9810l9999L0467k2023
$$ -55206 -44195 -33746 -33693 -49412 -32746 17005 1297 9081 -10729 -50728 -20261 -42284
16921d2284p8922N0158K5311J2560k7121k1858L9770l85j5857M5002L2062j8903
$$ -42284 -121206 -71048 -45737 -33177 -60298 -82156 -42386 -42771 -58628 -13626 18436 -467
16909d67l3868m8846J3020M8030N1478N705m0664K772K1799n972J723l5487r4839
$$ -467 -34335 -83181 -70161 -22131 29347 35052 -5612 -2840 18959 12987 14710 -20777 -115616
16896a15616l998J8483J7025O770J1172O6713L0589k1951j5604l2482M0872k4851
$$ -115616 -119614 -101131 -84106 -77336 -66164 549 31138 9187 -6417 -38899 1973 -22878
16884b2878M325N555O4022j2577l1993p7017j0264j0662K5088K1003j1802l1024
$$ -22878 -18553 -12998 51024 38447 6454 -70563 -80827 -91489 -66401 -45398 -57200 -88224
16872h8224l0724M1711J4448k055l9048K9916J335J246M2220l840l230o0448k4671
$$ -88224 -118948 -77237 -62789 -64844 -103892 -73976 -72641 -71395 -29175 -33015 -36245 -96693 -121364
16859a21364L0242P9700L4085p120J1739n624m0788j2527M122K5093o5913o495
$$ -121364 -91122 -11422 22663 15543 27282 21658 -19130 -31657 -27535 -2442 -68355 -74850
16847g4850M2622L035k766q780L5452l0539J840k0292K6614o016n0223L4882L2933
$$ -74850 -32228 -29193 -31959 -40739 -5287 -35826 -33986 -54278 -27664 -33680 -83903 -49021 -16088
16834a6088m21K5301K5396m6212k3621l2169m164j5221J5154L1724l4657M393
$$ -16088 -16509 8792 34188 -12024 -35645 -67814 -71978 -87199 -72045 -40321 -74978 -70585
16822g0585J2859K9153J9717M7440J298J8648K1234j1353j7108j4913O7803O2744
$$ -70585 -57726 -28573 -8856 38584 39882 58530 79764 68411 51303 36390 104193 166937
16810A66937l1974n3618k7630l1428n5528l551j4259m5313L8195O0205k5429J2643
$$ 166937 134963 81345 53715 22287 -33241 -36792 -51051 -96364 -58169 2036 -23393 -10750
16798a0750N527m0546p473P026p548l9929k1645M4729K5833K8889n21k3008K5173
$$ -10750 -5223 -45769 -53242 -46216 -53764 -93693 -115338 -70609 -44776 -15887 -16408 -39416 -14243
16785a4243J4158k0631M9381k6875l6967P0774K6375o0443n4043J7639J4742m261
$$ -14243 -85 -20716 28665 1790 -35177 35597 61972 1529 -52514 -34875 -20133 -24394
16773b4394p239K7765J4871M0568n682j716r743p7598l4891p407r07O7702M8283
$$ -24394 -31633 -3868 11003 51571 45889 44173 34430 -43168 -78059 -85466 -86373 -18671 29612
16760B9612j413k2217J5047M749P748l7777K9131K2341k1973k3538k783m947p900
$$ 29612 28199 5982 21029 25778 33526 -4251 24880 47221 25248 1710 -1073 -6020 -13920
16747a3920M8024M6385m0964m4069l8625J5604L3348l9439N2106o884o3960k9717
$$ -13920 34104 80489 39525 -4544 -43169 -27565 5783 -33656 18450 11566 -52394 -82111
16735h2111L9537M241K77k501N0372m8275m6564N3282L7361m1725m1381M3862
$$ -82111 -42574 -38333 -38056 -40557 9815 -38460 -85024 -31742 5619 -36106 -77487 -33625
16723c3625m193Q817J5507l659J6400L5163k9073l5051L3674m487p566M476k6080
$$ -33625 -37818 -29001 -13494 -17153 -753 34410 5337 -29714 3960 -527 -8093 -3617 -29697
16710b9697M7577P9321l4537n3221L5025L0957j324j7561n9715q9858m3334M1018
$$ -29697 17880 97201 62664 9443 44468 75425 74101 56540 -3175 -93033 -136367 -95349
16698i5349K9115L9407L2101j6853J4379K2667M5464j2957n1043l8824Q8658N2985
$$ -95349 -66234 -26827 5274 -11579 2800 25467 70931 57974 6931 -31893 56765 109750
16686A09750k5165o0659l866J9531k8922l1576m5608k6641L1665O1424L4776L8441
$$ 109750 84585 23926 20060 39591 10669 -20907 -66515 -93156 -61491 -67 34709 73150
16674G3150J9289k6086p134m8357j8049J0337j1062K7621k0898N942Q5456J8033
$$ 73150 92439 66353 59219 10862 -7187 3150 -7912 19709 -1189 4753 90209 108242
16662A08242k6816M968j8205k1431p944l0350K0125L5251J1348j2913l4491o7190
$$ 108242 81426 86394 68189 46758 38814 8464 28589 63840 75188 62275 27784 -39406
16650c9406m9253P409P7445j5792k3670J3839N3507k2744k8918j7540j2237R234
$$ -39406 -88659 -81250 -3805 -19597 -43267 -29428 24079 1335 -27583 -45123 -57360 -48126
16638d8126L6836K3680O111L0799l3102j9006J0018k4122m342j3714M8067k4217
$$ -48126 -11290 12390 18501 49300 16198 -2808 7210 -16912 -21254 -34968 13099 -11118
16626a1118k6986M0596m574R357K5055q673M5344r496k8691n55o3101j6269N9059
$$ -11118 -38104 2492 -2082 7275 32330 23657 69001 59505 30814 30259 -32842 -49111 9948
16613I948K8119j1715M667j357J4565k20m860r786N49l9326k8108J2629l4022
$$ 9948 38067 26352 31019 29662 44227 44007 39147 29361 29910 -9416 -37524 -24895 -58917
16600e8917q1833L3095M7223J4709n352J7836M3604J6348j011k5902R014J0554
$$ -58917 -140750 -107655 -60432 -45723 -51075 -33239 10365 26713 25702 -200 8814 19368
16588A9368J7375j7024k3128k2341n5464k278L0996P8467O0764q8535l6642K6209
$$ 19368 36743 19719 -3409 -25750 -81214 -83492 -52496 25971 86735 -1800 -38442 -12233
16576a2233q478l7580L836J9264J337l4101M728J7712K0723k5970K0438l7304
$$ -12233 -20711 -58291 -54455 -35191 -33854 -67955 -63227 -45515 -24792 -50762 -30324 -67628
16564f7628k5991L4138k7195L8702J0746J7632J0747M7380j547j5210j7699J2716
$$ -67628 -93619 -59481 -86676 -47974 -37228 -19596 -8849 38531 36984 21774 4075 16791
16552A6791o791m9087l8235j6165J5404N356J4005L2611J8988l057P2819J7713
$$ 16791 10000 -39087 -77322 -93487 -78083 -72727 -58722 -26111 -7123 -10180 62639 80352
16540H0352n5599l7448M0758l3595p0491L7194o017m9953K5501M4298N2826P1213
$$ 80352 24753 -12695 28063 -5532 -76023 -38829 -44846 -94799 -69298 -25000 27826 99039
16528I9039k115m754Q745j4247m8044p9188n5377K8916K8998K4771j6888j8636
$$ 99039 96924 92170 100915 86668 38624 -40564 -95941 -67025 -38027 -13256 -30144 -48780
16516d8780J6918k1916n7823m0782L1542J9790L2977p560k1624M5385O5042K6902
$$ -48780 -31862 -53778 -111601 -152383 -120841 -101051 -68074 -75634 -97258 -51873 13169 40071
16504D0071L534j8723n8706n0564p51K8422K357O009J1594K8061R164K5324j0182
$$ 40071 43605 24882 -33824 -84388 -85139 -56717 -54360 -48351 -36757 -8696 468 25792 15610
16491A5610J7336N1556K49n1017l5097J3597k6216l4466N4780N04K544l2445J3878
$$ 15610 32946 84502 84751 33734 -1363 12234 -13982 -48448 6332 6836 9380 -23065 -9187
16478i187N496j3901l7902P746J5848K0194N9343o1090m9354K0342M109K799K8808
$$ -9187 -3691 -17592 -55494 -47748 -31900 -11706 47637 -13453 -62807 -42465 -38356 -35557 -6749
16465f749K2849o1922R779q947m641K2434L2843J9224o3268k3099J693j8743J841
$$ -6749 16100 -45822 -36043 -44990 -49631 -27197 5646 24870 -38398 -61497 -59804 -78547 -76706
16452g6706n7013j7914j4601N6972L1224M8946N2526m530k8176j1613r670j9158
$$ -76706 -133719 -151633 -166234 -109262 -78038 -29092 23434 18904 -9272 -20885 -30555 -49713
16440d9713P066l9869k0500L3823L4989j8195l2857L3494k0530m5304N7496P7261
$$ -49713 -42647 -82516 -103016 -69193 -34204 -52399 -85256 -51762 -72292 -117596 -60100 17161
16428A7161L3817j8682m2556j9473K2443Q943j7574j4129J6931p907m0089o2845
$$ 17161 50978 32296 -10260 -29733 -7290 1653 -15921 -30050 -13119 -21026 -61115 -123960
16416a23960k3419N0530J0280K5615q550M4544l4915p5102L3087N5475K8525j8396
$$ -123960 -147379 -96849 -86569 -60954 -69504 -24960 -59875 -134977 -101890 -46415 -17890 -36286
16404c6286m7688K4242l6904p505J820L9866J4250K612P901J8089K4863J9681
$$ -36286 -83974 -59732 -96636 -104141 -102321 -62455 -48205 -45593 -37692 -19603 5260 24941
16392B4941p397l4415m634l982j6489o7870K9214M6019N3038L2092l6877l1279
$$ 24941 17544 -16871 -21505 -25487 -41976 -109846 -80632 -34613 18425 50517 13640 -17639
16380a7639o681M2300n460j6927j4555q381n2165M055O0132O8988J9643n7000
$$ -17639 -24320 17980 12520 -4407 -18962 -27343 -79508 -75453 -15321 53667 73310 16310
16368A6310n1844k4371J8121q355r893K3893j0140J3317n1427l1186L1950j5289
$$ 16310 -35534 -59905 -41784 -50139 -60032 -36139 -46279 -32962 -84389 -115575 -83625 -98914
16356i8914j5244K3106O725N0582j7236n3667j2221K4861O4731O4812l9644l6136
$$ -98914 -114158 -91052 -84327 -33745 -50981 -104648 -116869 -92008 -27277 37535 -2109 -38245
16344c8245K1119L6168o6389k2871K2414K0422l5421M4153M5097J3140m4161m9712
$$ -38245 -17126 19042 -47347 -70218 -47804 -27382 -62803 -18650 26447 39587 -4574 -54286
16332e4286o4830L1725M3010N467K4312K7675P496k6412P615K7486q596l4610
$$ -54286 -119116 -87391 -44381 -38914 -14602 13073 20569 -5843 1772 29258 20662 -13948
16320a3948k9362P0307J1231l2305k0202j1477J317O3343o380M89L4730m3859
$$ -13948 -43310 26997 38228 5923 -14279 -25756 -24439 38904 32524 33013 67743 23884
16308B3884J0437K1717m199j083l6367k1416j3141j0246L7569L778L590k6246
$$ 23884 34321 56038 51839 50756 14389 -7027 -20168 -30414 7155 10933 14523 -11723
16296a1723l3591j5998k2846J0857L0985j4791J008n3349j2203q906M3707M419
$$ -11723 -45314 -61312 -84158 -73301 -42316 -57107 -56099 -109448 -121651 -130557 -86850 -82431
16284h2431p430R648M2602m421j9048M218o1408m3877L7239N3796L945j1119N2373
$$ -82431 -89861 -80213 -37611 -42032 -61080 -56862 -118270 -162147 -124908 -71112 -67167 -78286 -25913
16271b5913N0762N1465J0941l0260l9340m1108M7117q337m0794J0470J5676k1493
$$ -25913 24849 76314 87255 56995 17655 -23453 23664 15327 -25467 -14997 679 -20814
16259b0814J1294M1346o2324L1447N5980L0729n4416k9893N9231J7823q6423n5701
$$ -20814 -9520 31826 -30498 949 56929 87658 33242 3349 62580 80403 -6020 -61721
16247f1721J9976J4818L3387K9460j7569r812k4027k509k8933k0938j0177P925
$$ -61721 -41745 -26927 6460 35920 18351 8539 -15488 -17997 -46930 -67868 -78045 -70120
16235g0120j1030M2732M3817J0062n198K0352m243n3991J4084J5708j0671N0200
$$ -70120 -81150 -38418 5399 15461 10263 30615 26372 -27619 -13535 2173 -8498 41702
16223D1702M3139J2048p677l2413J3921j881o4192j7220J8884j2293m426j0782
$$ 41702 84841 96889 89212 56799 70720 68839 4647 -12573 6311 -5982 -10408 -21190
16211b1190n4185l0720K4230J1450k0527Q0495J6660J3467k5880m2540K9065Q142
$$ -21190 -75375 -106095 -81865 -70415 -90942 -10447 6213 19680 -6200 -48740 -19675 -11533
16199a1533K2069K9080N435n7705n8864L6839N8746L8745r361P78l0399m1093
$$ -11533 10536 39616 45051 -12654 -71518 -34679 24067 62812 53451 54229 23830 -17263
16187a7263M4399J5468j2004j4688J296p0944o0207q003R553K4958O0501n4160
$$ -17263 27136 42604 30600 15912 17208 -53736 -113943 -121946 -112393 -87435 -26934 -81094
16175h1094l430N326N9796M4266J2977k2289K3842K1352J6538J5055j6441r736
$$ -81094 -84524 -79198 -19402 24864 37841 15552 39394 60746 77284 92339 75898 66162
16163F6162n4663j2709L6827J9060o402m3626k3807k9463j2125l3554K2826j4982
$$ 66162 11499 -1210 35617 54677 48275 4649 -19158 -48621 -60746 -94300 -71474 -86456
16151h6456L6732M3236m532k3192k7429M2645L4105l0758L5909p112J7979O781
$$ -86456 -49724 -6488 -11020 -34212 -61641 -18996 15109 -15649 20260 13148 31127 37908
16139C7908m1516j8235O6475j205n52k1207n2816k9936k9997J3192M9875J6407
$$ 37908 -3608 -21843 44632 43427 42875 21668 -31148 -61084 -91081 -77889 -28014 -11607
16127a1607R217M607j0883M664K698n5857l9172N6457j9360l7430K6540j7707
$$ -11607 -2390 2217 -8666 -4002 -1304 -57161 -96333 -39876 -59236 -96666 -70126 -87833
16115h7833J9458L9347L7754J9599m6763M2671K2186K468M0808r698q1931m2777
$$ -87833 -68375 -29028 8726 28325 -18438 24233 46419 48887 89695 79997 -1934 -44711
16103d4711L991m1922K4238N8449R049O1169k7391m0372n267L0142L3662k8223
$$ -44711 -40720 -82642 -58404 45 9094 70263 42872 2500 -2767 27375 61037 32814
16091C2814j9610m5588k9379p852Q713J7728N045j7025L5891l451j2439P97k8991
$$ 32814 13204 -32384 -61763 -69615 -60902 -43174 -38129 -55154 -19263 -22714 -35153 -34356 -63347
16078f3347K7594l3816J5501M5311J3718J585j4209J5613J6021m0758o126l5759
$$ -63347 -35753 -69569 -54068 -8757 4961 6546 -7663 7950 23971 -16787 -22913 -58672
16066e8672l7385J829O1946K2526k5109L2772p659M427J7690K0214J4743k2931
$$ -58672 -96057 -94228 -32282 -9756 -34865 -2093 -9752 -5325 12365 32579 47322 24391
16054B4391m7103M328J8496j7012L3783J8920n7385p214P2486J0829J9915J415
$$ 24391 -22712 -18384 112 -16900 16883 35803 -21582 -28796 43690 54519 74434 75849
16042G5849j2154k0166K334L7276O804m9572j7781J1772P113N55q844j3212j5935
$$ 75849 63695 43529 45863 83139 89943 40371 22590 34362 41475 42030 33186 19974 4039
16029D039l4653l1554P7210M2776n0615l0915k8300L8643K0080J34m3050k335
$$ 4039 -30614 -62168 15042 57818 7203 -23712 -52012 -13369 6711 6845 -36205 -38540
16017c8540K4506K0295k2913J0678j5446O3133K5185m4180J3856Q518k5322J6621
$$ -38540 -14034 6261 -16652 -5974 -21420 41713 66898 22718 36574 45092 19770 36391
16005C6391l9452l1134L0409o666k1674m2576L8143M0027k2492o608k7667j2034
$$ 36391 -3061 -34195 -3786 -10452 -32126 -74702 -36559 3468 -19024 -25632 -53299 -65333
15993f5333j7138K5015J12366j1592p4133j6902l2389n254K6641K063Q0648J7213
$$ -65333 -82471 -57456 54910 43318 -30815 -47717 -80106 -85360 -58719 -56656 23992 41205
15981D1205J1163q91j1416k6328l3714l0292j3922L3479N7351p3897k8276j3996
$$ 41205 52368 51477 40061 13733 -19981 -50273 -64195 -30716 26635 -47262 -75538 -89534
15969h9534j0032K5754K9639j992L4301M5211R801k3238l2711o3545p9439K4897
$$ -89534 -99566 -73812 -44173 -46165 -11864 33347 43148 19910 -12801 -76346 -155785 -130888
15957a30888M2983L014j9974l1153L5108O8558P254L0490K0664k5789k9270L3730
$$ -130888 -87905 -84891 -104865 -136018 -100910 -32352 -25098 5392 26056 267 -29003 4727
15945D727M2426k0470n7527m6815L6561N1029l6777p1603q47O8615l763l9168
$$ 4727 47153 26683 -30844 -77659 -41098 9931 -26846 -98449 -99296 -30681 -34444 -73612
15933g3612J9903R092k2687J9967L7952j1507K8088j8228m442J6314j6563l6980
$$ -73612 -53709 -44617 -67304 -47337 -9385 -20892 7196 -11032 -15474 840 -15723 -52703
15921e2703K7206l2861n3698j1584M5537L0186M8444M6418k108p3236j8312L22
$$ -52703 -25497 -58358 -112056 -123640 -78103 -47917 527 46945 44837 -28399 -46711 -46389
15909d6389L3856q398j8765J8275L1473k0263p505k152J0960k2758j519K1930
$$ -46389 -12533 -20931 -39696 -21421 10052 -10211 -17716 -19868 -8908 -31666 -33185 -11255
15897a1255L2549k84N1443j8665l6504k9786K3105J9267l0271L1887J2720q30
$$ -11255 21294 21010 72453 53788 17284 -12502 10603 29870 -401 31486 44206 43376
15885D3376l737j2863l8204l3652K4371J7515l1547J7821n342l5892l5280K2019
$$ 43376 39639 26776 -11428 -45080 -20709 -3194 -34741 -16920 -22262 -58154 -93434 -71415
15873g1415J5296P638L3536K5258j6414J5771l0910m4959L8221j8195J5616K7646
$$ -71415 -56119 -48481 -14945 10313 -6101 9670 -21240 -66199 -27978 -46173 -30557 -2911
15861b911j0544L0313J5215O675l3427n2022q983M8453N036k6954Q705k0006J943
$$ -2911 -13455 16858 32073 38748 5321 -46701 -55684 -7231 -2195 -29149 -20444 -40450 -38507
15848c8507J716L0818j3169K6413J894N277j2328l9719m868J7379j9859j1981
$$ -38507 -36791 -5973 -19142 7271 9165 14442 2114 -37605 -42473 -25094 -44953 -56934
15836e6934r534J3689k2958K8573O6282J1575o5823p7996N270P0503N8079J1710
$$ -56934 -66468 -52779 -75737 -47164 19118 30693 -35130 -113126 -107856 -37353 20726 32436
15824C2436j927O5646p4594k6172O62j6650M6843L597k9102l5874m4598j4198
$$ 32436 30509 96155 21561 -4611 -3949 -20599 26244 29841 739 -35135 -79733 -93931
15812i3931l974L3239O0128m8224K3669J4369j8758J4968L1528J5697j7892l9298
$$ -93931 -97905 -64666 -4538 -52762 -29093 -14724 -33482 -18514 13014 28711 10819 -28479
15800b8479L7067J1441j1098m1908K1379P6862m831l7015k7272J2815n0040p0297
$$ -28479 8588 20029 8931 -32977 -11598 65264 60433 23418 -3854 8961 -41079 -111376
15788a11376M93J3219P8949K0745j810o022M872k1257L720j4618n0272K6372K5067
$$ -111376 -110883 -97664 -18715 2030 220 -5802 -930 -22187 -18467 -33085 -83357 -56985 -31918
15775c1918r290l92K2415K3331k7956K5327O490O287J1758k263J0531J5154J735
$$ -31918 -41208 -41600 -19185 4146 -23810 1517 8007 14294 26052 23789 34320 49474 51209
15762E1209k2566k7362j3208J7636j6664P475K6738k859j3074o7508J7124L6725
$$ 51209 28643 1281 -11927 5709 -10955 -3480 23258 20399 7325 -60183 -43059 -6334
15750f334k1674L2220L4905l3830j8543J3886J6907N36j2404J153L0117J5180
$$ -6334 -28008 4212 39117 5287 -13256 630 17537 18073 5669 6822 36939 52119
15738E2119p3806j3528R085K5896N4049k4690o5774r824J8133K8670L778J2273
$$ 52119 -21687 -35215 -26130 -234 53815 29125 -36649 -46473 -28340 330 4108 16381
15726A6381j6076K2047j5395n7510O388K8292K3303M799k6030K6003O89l5903
$$ 16381 305 22352 6957 -50553 -44165 -15873 7430 12229 -13801 12202 12891 -23012
15714b3012J0244L1150M7403j4416q0530K1931L8805L8691n2982r3169l8913n62
$$ -23012 -12768 18382 65785 51369 -29161 -7230 31575 70266 17284 -75885 -114798 -115360
15702a15360O8508N6679m0779m7830r752K4404r675l8575o493K8671M3999L1351
$$ -115360 -46852 9827 -30952 -78782 -88534 -64130 -73805 -112380 -118873 -90202 -46203 -14852
15690a4852K7970k678Q358j8380J5423Q1940Q807j8053j1558l8385n4406m9097
$$ -14852 13118 10440 18798 418 15841 97781 106588 88535 76977 38592 -15814 -64911
15678f4911j0929j4868l316P5216L9587m1148r260O0996p19l166p8199n2144J2043
$$ -64911 -75840 -90708 -94024 -18808 20779 -20369 -29629 31367 30648 27482 -50717 -102861 -90818
15665i0818k2703m9311J8273P9158K3629M546R4977m2066q3121l5918K4672N2353
$$ -90818 -113521 -162832 -144559 -65401 -41772 -37226 57751 15685 -67436 -103354 -78682 -26329
15653b6329O305m1616j851N2780M7506J9454n0491l2170j5038L837J726N731J0108
$$ -26329 -20024 -61640 -63491 -10711 36795 56249 5758 -26412 -41450 -37613 -35887 -30156 -20048
15640b0048j034K1513J3529j0335m8558N9446j1201n3776p7039K1384M6393N119
$$ -20048 -21082 431 13960 3625 -44933 14513 3312 -50464 -127503 -106119 -59726 -54607
15628e4607J8726o042N54K6214M3029l9227k8565N2890j1442j7149K4650j0180
$$ -54607 -35881 -41923 -41369 -15155 27874 -11353 -39918 12972 1530 -15619 9031 -1149
15616a149k5397k3403O086L2322L3846N7547J5170o2488o2154j8431J6573L1795
$$ -1149 -26546 -49949 -43863 -11541 22305 79852 95022 32534 -29620 -48051 -31478 317
15604C17M856l7843j8563J1005K2009O993n0689K0932O2878k7391m5533j1771
$$ 317 5173 -32670 -51233 -40228 -18219 -11226 -61915 -40983 21895 -5496 -51029 -62800
15592f2800N1029K8352J5879m3113j7008J0039J1592j6288J5723J1977Q467j259
$$ -62800 -11771 16581 32460 -10653 -27661 -17622 -6030 -22318 -6595 5382 13849 12590
15580A2590M5486j1703o8780n6206l3739P680M3240M3328j2639M8045r453O401
$$ 12590 58076 46373 -22407 -78613 -112352 -104672 -61432 -18104 -30743 17302 7849 14250
15568A4250L0130N3767N722m2879m5929J8714L0574K13p0808n6712K1729Q5397
$$ 14250 44380 98147 103869 60990 15061 33775 64349 64562 -6246 -62958 -41229 44168
15556D4168J3072o280k1009J4014M2570L7264j4421n7021j6938l5966j9530k9025
$$ 44168 57240 50960 29951 43965 86535 123799 109378 52357 35419 -547 -20077 -49102
15544d9102N0384j4920n1801K757N0302N7570l3408l6623j5098m0647k9927L2768
$$ -49102 1282 -13638 -65439 -62682 -12380 45190 11782 -24841 -39939 -80586 -110513 -77745
15532g7745J4530N1105J1245l2784R209L2859J9776j3387o1201n6523N8487O8528
$$ -77745 -63215 -12110 -865 -33649 -24440 8419 28195 14808 -46393 -102916 -44429 24099
15520B4099J3791l9765o2543L9251K0239n2335l8282O9736N0041J3428q579l150
$$ 24099 37890 -1875 -64418 -25167 -4928 -57263 -95545 -25809 24232 37660 29081 25931
15508B5931l2604K4493q684l7596k4847K2422j1436R218J6216M1623J2108q0208
$$ 25931 -6673 17820 9136 -28460 -53307 -30885 -42321 -33103 -16887 24736 36844 -43364
15496d3364o4211M1337P9286O900j875l0976K1135m722j7886o626O930R51N3813
$$ -43364 -107575 -66238 13048 19948 18073 -12903 8232 3510 -14376 -21002 -14072 -13121 40692
15483D0692J7346k1436j7715R746K9563J4303k9142k1712K1979L8562l7326l9470
$$ 40692 58038 36602 18887 28633 58196 72499 43357 21645 43624 82186 44860 5390
15471E390o3562K631n456J7072n6010N405N47j7281N4129M6817J5319j3307J6409
$$ 5390 -58172 -55541 -60997 -43925 -99935 -94530 -93983 -111264 -57135 -10318 5001 -8306 8103
15458H103k613l1468o968M9298M2118N596n1751m436M0029m2k6267J9505m9803
$$ 8103 5490 -25978 -32946 16352 58470 64066 12315 7879 47908 47866 21599 41104 -8699
15445h699l940o213l5476K3445K8650j9281j7332L608O3852K3143p1091l9299
$$ -8699 -12639 -18852 -54328 -30883 -2233 -21514 -38846 -35238 28614 51757 -19334 -58633
15433e8633l181L0020q82j6547p8807J1343M4012L1829j4375l8990o791J2197
$$ -58633 -61814 -31794 -32676 -49223 -128030 -116687 -72675 -40846 -55221 -94211 -101002 -88805
15421h8805M6911K1581L7688Q582n973j5954l8887j6447o0309l2869K3761K2867
$$ -88805 -41894 -20313 17375 25957 19984 4030 -34857 -51304 -111613 -144482 -120721 -97854
15409i7854j013M7097K3644J5302k8663k2603K7828N1379N976K98l7520k5511
$$ -97854 -98867 -51770 -28126 -12824 -41487 -64090 -36262 15117 21093 21391 -16129 -41640
15397d1640N914j1692J1434M5665j2512j1715l1436K6426L3038M898O78j6286
$$ -41640 -35726 -47418 -35984 9681 -2831 -14546 -45982 -19556 13482 18380 19058 2772
15385B772J224j5299K0367k6692l1008M9864K6024o335n4535J6959N6012L1970
$$ 2772 3996 -11303 9064 -17628 -48636 1228 27252 20917 -33618 -16659 39353 71323
15373G1323q1069p0433L239K3603N8r52N9388J494l0074j5631M7249Q0317k1377
$$ 71323 -9746 -80179 -76940 -53337 -53279 -54231 5157 6651 -23423 -39054 8195 88512 67135
15360F7135o670m5016q3907k087N7490M386o9095l901J6264j5585N9464O640o2361
$$ 67135 60465 15449 -68458 -70545 -13055 -8669 -77764 -81665 -65401 -80986 -21522 -14882 -77243
15347g7243P0579L9804m8754j0479P07j0194o903K7315M4848K1858r0094p2007
$$ -77243 -6664 33140 -15614 -26093 -25386 -35580 -42483 -15168 29680 51538 -38556 -110563
15335a10563j1612R5682M1993j4175r36j0071j1153K5599M5124J8583L74k3160
$$ -110563 -122175 -26493 15500 1325 389 -9682 -20835 4764 49888 68471 68845 45685
15323D5685l3646J9868l249p304k0969k7896M922K7897r676N0284L2703q1244
$$ 45685 12039 31907 28658 21354 385 -27511 -22589 5308 -4368 45916 78619 -2625
15311b625m2032j6196L5581N7202K0194k0539K235K821L001m836L5677M614K3774
$$ -2625 -44657 -60853 -25272 31930 52124 31585 33820 36641 39642 34806 70483 75097 98871
15298I8871l7632l3361K5858M1492R358n3326p9464K0827P2967M1410K0186m7147
$$ 98871 61239 27878 53736 95228 104586 51260 -28204 -7377 65590 107000 127186 80039
15286H0039r6330k5135K0196L7297J4784J0394j6058j3000K8653l1776L8768L1002
$$ 80039 -16291 -41426 -21230 16067 30851 41245 25187 12187 40840 9064 47832 78834
15274G8834l6280l8539j7571l5784K0570J6369j5683J896K5081n5121k0359k5106
$$ 78834 42554 4015 -13556 -49340 -28770 -12401 -28084 -26188 -1107 -56228 -76587 -101693
15262a01693K0371K4854P2745O0973k0102l8287j144K5645J8173j1133k1971j2426
$$ -101693 -81322 -56468 16277 77250 57148 18861 17717 43362 61535 50402 28431 16005
15250A6005n8729k9314N5562k794L0867o831k7229j207P942n0385l3475M3646
$$ 16005 -42724 -72038 -16476 -19270 11597 4766 -22463 -23670 -15728 -66113 -99588 -55942
15238e5942M9609K4487j516K0423K3472p239l2504l0139J4155l5056p8367O1320
$$ -55942 -6333 18154 16638 37061 60533 53294 20790 -9349 4806 -30250 -108617 -47297
15226d7297M3450l3552n2902l911O5536J4977J9450m599R724J6475l5720n7360
$$ -47297 -3847 -37399 -90301 -94212 -28676 -13699 5751 1152 10876 27351 -8369 -65729
15214f5729j0115P6854M6988k0343m2999l4488J8645L229N8783q48m6419o3046
$$ -65729 -75844 1010 47998 27655 -15344 -49832 -31187 -27958 30825 29977 -16442 -79488
15202g9488J2062P9463L8655j9783l5263o132N9031J7470j3008k2430O002j5472
$$ -79488 -67426 12037 50692 30909 -4354 -10486 48545 66015 53007 30577 36579 21107
15190B1107k8745j220p886K38M1057K5389k1955j1876l1691l1935k4476o4185
$$ 21107 -7638 -8858 -16744 -16506 24551 49940 27985 16109 -15582 -47517 -71993 -136178
15178a36178j3624M6911K6991P2436O9450l8343o8251m1772o7565J5838N9017
$$ -136178 -149802 -102891 -75900 -3464 65986 27643 -40608 -82380 -149945 -134107 -75090
15167g5090o299K4486J5331L1747M642j6754j5407O7494J3450q1490o1229j3973
$$ -75090 -81389 -56903 -41572 -9825 -5183 -21937 -37344 30150 43600 -37890 -99119 -113092
15155a13092M2326O8514N1069J7470j2450k8714m3975N087K3465k7287q875L2793
$$ -113092 -70766 -2252 48817 66287 53837 25123 -18852 -13765 9700 -17587 -26462 6331
15143F331K6439n5666j5304M4469k780K3764K8714K9171k3842o5777m0396N898
$$ 6331 32770 -22896 -38200 6269 3489 27253 55967 85138 61296 -4481 -44877 -38979
15131c8979P1M6544J5448N1389j527l4017K1831j2792n4033m4437l1350q090r906
$$ -38979 -38908 7636 23084 74473 72946 38929 60760 47968 -6065 -50502 -81852 -89942 -99848
15118i9848K0922M5507J1784R129J8972j2685k9635K7554o873K1076k5907j4906
$$ -99848 -78926 -33419 -21635 -12506 6466 -6219 -35854 -8300 -15173 5903 -20004 -34910
15106c4910K3546j7262l730J47223L9137n2347o2985m2413j6899P3810M6519k1351
$$ -34910 -11364 -28626 -32356 114867 154004 101657 38672 -3741 -20640 53170 99689 78338
15094G8338L6251o0725m7701J8460K6384N0323o12n7889p479L04N5506L3369o2081
$$ 78338 114589 53864 6163 24623 51007 101330 100718 42829 35350 35654 91160 124529 62448
15081F2448k3461k976p496j5242o093N7929j2294k9095J3531L9730J1319M257
$$ 62448 38987 36011 28515 13273 7180 65109 52815 23720 37251 76981 88300 92557
15069I2557l4713K679o6357M4580M2271J1998n02j2815O717j1691K3799n0284
$$ 92557 57844 60523 -5834 38746 81017 93015 92513 79698 86415 74724 98523 48239
15057D8239j5795Q784K3289q6985m239M8534j1407J1746L3966o3294l1558M8525
$$ 48239 32444 41228 64517 -22468 -26707 21827 10420 22166 56132 -7162 -38720 9805
15045I805o780K3403P508N2655k7857K6782k7131k7100K1428j8915r146J0965
$$ 9805 3025 26428 33936 86591 58734 85516 58385 31285 52713 33798 24652 35617
15033C5617k0506N640l461J2974K1696L2719J2871n2197j6397j2224j818K3061
$$ 35617 15111 20751 17290 30264 51960 84679 97550 45353 28956 16732 14914 37975
15021C7975m1130l7097J9133j3531L0811J7890O9363J1454m0141j2267J8368N5609
$$ 37975 -3155 -40252 -21119 -34650 -3839 14051 83414 94868 54727 42460 60828 116437
15009A16437j4343l2312j8090m9549J1253j790l7826N7609l335j4174M0108o0467
$$ 116437 102094 69782 51692 2143 13396 11606 -26220 31389 28054 13880 53988 -6479
14997f479m0331K1434P422M9222O8851J7392j5938k1089k9193R046M6421m657
$$ -6479 -46810 -25376 -17954 31268 100119 117511 101573 80484 51291 60337 106758 102101
14985A02101j6142j118j2750K6139J9615j9113l0298k2701m6974K817k706n468
$$ 102101 85959 84841 72091 98230 117845 98732 68434 45733 -1241 1576 -1130 -6598
14973f598J9509l8138K7304J2616N9567P60n8770J7758N0783j8302l8044l5926
$$ -6598 12911 -25227 2077 14693 74260 75020 16250 34008 84791 66489 28445 -7481
14961g481O4694r692m4796L717m3600j1610J1160K0892L1632K3593m0524l3770
$$ -7481 57213 47521 2725 6442 -37158 -48768 -37608 -16716 14916 38509 -2015 -35785
14949c5785K4647L0043J0356m4348J1657j9942m0193K1761Q9491l7179m5993l657
$$ -35785 -11138 18905 29261 -15087 -3430 -23372 -63565 -41804 47687 10508 -35485 -39142
14937c9142O1560P7760J1919M968l8390j609r40k7214k5013K3040K9309j9723
$$ -39142 22418 100178 112097 117065 78675 77066 76126 48912 23899 46939 76248 56525
14925E6525j7190J20J2936j9112k0334j2505M247P986K0548k6587K730J3864L1368
$$ 56525 39335 39455 52391 33279 12945 440 4687 12673 33221 6634 9364 23228 54596
14912E4596k2580J3320k3301l5982k5816l047j1473l0507L7908p464k4802L3931
$$ 54596 32016 45336 22035 -13947 -39763 -42810 -54283 -84790 -46882 -54346 -79148 -45217
14900d5217j5395j336M5659p824r215N959j7389K3702J20986Q894q0374r641K0881
$$ -45217 -60612 -61948 -16289 -24113 -33328 -27369 -44758 -21056 99930 108824 28450 18809 39690
14887C9690N363k7413k9534N2840O6865l0199o2539K8521l1689M2240k0099k7301
$$ 39690 45053 17640 -11894 40946 107811 77612 15073 43594 11905 54145 34046 6745
14875F745k5923J4963P27j1875m9322L3107j5739m862K6773m2789L6716J4029
$$ 6745 -19178 -4215 -3488 -15363 -64685 -31578 -47317 -52179 -25406 -68195 -31479 -17450
14863a7450j1966K3195J099p035M2337L3225m1557q0840O593L449J5563L5909
$$ -17450 -29416 -6221 -5122 -12157 30180 63405 21848 -58992 -52399 -48950 -33387 2522
14851B522l4851J3923J05720O274j5141l7531L926M934L376k8136p2739N8266
$$ 2522 -32329 -18406 87314 93588 78447 40916 44842 49776 53152 25016 -47723 10543
14839A0543n393n031K2060J0968n287k7450k8607j5291k6933L2913N4742q35L6567
$$ 10543 5150 119 22179 33147 27860 410 -28197 -43488 -70421 -37508 17234 16399 52966
14826E2966k623k726J9832n8049n7391L9920Q455P6156M7443n5424m0532n756
$$ 52966 50343 47617 67449 9400 -47991 -8071 384 76540 123983 68559 28027 22271
14814B2271K179m2014O0335K5740j5177q2500N860L4978K408k7977l8106k1549
$$ 22271 24450 -17564 42771 68511 53334 -29166 -23306 11672 14080 -13897 -52003 -73552
14802g3552L5447N4280l8429n7763M7827N7950K333j16275k1546K0437P212N4890
$$ -73552 -38105 16175 -22254 -80017 -32190 25760 28093 -88182 -109728 -89291 -82079 -27189
14790b7189Q240L3247M252j1077J1083q476j4527l4580J7202O2796N8412j3613
$$ -27189 -18949 14298 18550 7473 18556 10080 -4447 -39027 -21825 40971 99383 85770
14778H5770O218k3485m145m6495n645q282n2330p68j17J6970O1612O009k4148
$$ 85770 91988 68503 64358 17863 12218 3936 -48394 -49162 -49279 -32309 29303 35312 11164
14765A1164k5518n3918j2647k2720M1762Q8510o863n6658J049p21K7296l7445
$$ 11164 -14354 -68272 -80919 -103639 -61877 26633 19770 -36888 -35839 -36560 -9264 -46709
14753d6709m5327q534P4047L3224J7158j9401n0880j6830J6026r341m109M7645
$$ -46709 -92036 -100570 -26523 6701 23859 4458 -46422 -63252 -47226 -56567 -60676 -13031
14741a3031J5640r272j7114k7172J8703L2178k144m7225k5425K2208O9322k471
$$ -13031 2609 -6663 -23777 -50949 -32246 -68 -2212 -49437 -74862 -52654 16668 14197
14729A4197l4688J8740k6594K3813n8056L4809J5768M9706L2601K2051k5639n0499
$$ 14197 -20491 -1751 -28345 -4532 -62588 -27779 -12011 37695 70296 92347 66708 16209
14717A6209k6452o070m0129j9097J1953k2270q978K4888j85P6842K4880k9254
$$ 16209 -10243 -16313 -56442 -75539 -63586 -85856 -94834 -69946 -70131 6711 31591 2337
14705B337j7477m5011j2154M148l7269L3189j9937J931M9488m1851n344K9398
$$ 2337 -15140 -60151 -72305 -68157 -105426 -72237 -92174 -90243 -40755 -82606 -87950 -58552
14693e8552L5837r540R978K3481j9668R22l6794n2183P8487O9992k5340N2566
$$ -58552 -22715 -32255 -22277 1204 -18464 -17542 -54336 -106519 -28032 41960 16620 69186
14681F9186K4096l5381p5231m6397j3565L4899k6735K9492j0490O0950K8072n5497
$$ 69186 93282 57901 -17330 -63727 -77292 -42393 -69128 -39636 -50126 10824 38896 -16601
14669a6601n5440P0854J7307k2025j7652k4597l6082j258P5622J7105m054K936
$$ -16601 -72041 -1187 16120 -5905 -23557 -48154 -84236 -85494 -9872 7233 3179 6115
14657F115O244l260k05J5973L1261k9512l1304k9539l1631N0022L6669l3076L7815
$$ 6115 12359 9099 8894 24867 56128 26616 -4688 -34227 -65858 -15836 20833 -12243 25572
14644B5572J6117k6915o035p5145p384J4124M517J8357l4299j9457K2080J1293
$$ 25572 41689 14774 8739 -66406 -73790 -59666 -55149 -36792 -71091 -90548 -68468 -57175
14632e7175K4257K5705J7212O8018p6497q725j7459K1840L6308j0839O03L0159
$$ -57175 -32918 -7213 9999 78017 1520 -7205 -24664 -2824 33484 22645 23248 53407
14620E3407N978j1478j5606k0894K1935k1607j4734R382J8811n376n9862K7759
$$ 53407 59385 47907 32301 11407 33342 11735 -2999 6383 25194 19818 -40044 -12285
14608a2285K4208K7845L0559q208k8448J7013J3848q673j9438m5576l1065J150
$$ -12285 11923 39768 70327 62119 33671 50684 64532 55859 36421 -9155 -40220 -39070
14596c9070J3786j1737n584j4978l8382J7846L1826K5638J5133j6383l7111l32
$$ -39070 -25284 -37021 -42605 -57583 -95965 -78119 -46293 -20655 -5522 -21905 -59016 -59348
14584e9348j1671P655j3391k4340j3175J3243L7469L0562k437N608K8695L4817
$$ -59348 -71019 -63364 -76755 -101095 -114270 -101027 -63558 -32996 -35433 -29825 -1130 33687
14572C3687K5127n148p4027k5006L8665K8944j2190m1550j7529k6751k8984N619
$$ 33687 58814 53666 -20361 -45367 -6702 22242 10052 -31498 -49027 -75778 -104762 -99143
14560i9143M5637Q16n8036o0710q7038k59K5970L1633K4409O7975k0466l0406
$$ -99143 -53506 -52690 -110726 -171436 -258474 -258733 -232763 -201130 -176721 -108746 -129212 -159618
14548a59618O1994n140K0980K9835k3781Q9K0133M5727K41j2623j7329q026r718
$$ -159618 -97624 -102764 -81784 -51949 -75730 -75641 -55508 -9781 -9540 -22163 -39492 -47518 -57236
14535e7236J9351k989J8456l2864l0478L898N4756O4117N6596p0172l2307k3507
$$ -57236 -37885 -40874 -22418 -55282 -85760 -81862 -27106 37011 93607 23435 -8872 -32379
14523c2379n7569l9109M0194M9895K1894K5794J9428j3898R151O11m7914j3633
$$ -32379 -89948 -129057 -88863 -38968 -17074 8720 28148 14250 23401 24012 -23902 -37535
14511c7535p67j1806J6418o045K822p238j3984J8263R660l9779j0087N634j2154
$$ -37535 -38302 -50108 -33690 -39735 -36913 -44151 -58135 -39872 -30212 -69991 -80078 -74444 -86598
14498h6598q871M1059K2457J9154L60n3484k5760O7423J5928L138M3645l2873
$$ -86598 -95469 -54410 -31953 -12799 -12439 -65923 -91683 -24260 -8332 -5194 38451 5578
14486E578K7428m6883l202l13l9495l973J4304o681K6175K3961P6055q437m2989
$$ 5578 33006 -13877 -17079 -17392 -56887 -60860 -46556 -53237 -27062 -3101 72954 64517 21528
14473B1528M1063k3554m0444j9400k7220m3318M0558K0979N115k3009p939p13
$$ 21528 62591 39037 -1407 -20807 -48027 -91345 -50787 -29808 -24693 -47702 -55641 -56354
14461e6354P282N2583J4815k1466n270N4102J13n2631n5906Q879j3513J6451L3810
$$ -56354 -49072 3511 18326 -3140 -8410 45692 45805 -6826 -62732 -53853 -67366 -50915 -17105
14448a7105R655q071j1564J722O848O6945j7006P078l3773l7521J1962J7932N2260
$$ -17105 -7450 -15521 -27085 -25363 -18515 48430 31424 38502 4729 -32792 -20830 -2898 49362
14435D9362k889R346l8093L6923J2192O839j2630k809J1333R615n4088n0590k5001
$$ 49362 46473 55819 17726 54649 66841 73680 61050 58241 69574 79189 25101 -25489 -50490
14422e0490N641O3238K1581M6189j8027p1862j2685k4813K3740k508N4702j3558
$$ -50490 -44849 18389 39970 86159 68132 -3730 -16415 -41228 -17488 -19996 34706 21148
14410B1148p3051M504M6147M797j9437K7247O915n2984o402l629J4119N0498M8526
$$ 21148 -51903 -47399 -1252 3545 -15892 11355 18270 -34714 -41116 -44745 -30626 19872 68398
14397F8398j5784j00665k7594l2059M4923K5107m3361l8480O2370N2475M3987
$$ 68398 52614 -48051 -75645 -107704 -62781 -37674 -81035 -119515 -57145 -4670 39317
14386C9317N702K210M1360k0789m5262m2425k8527p770N0746N785r214k071o067
$$ 39317 45019 47229 88589 67800 22538 -19887 -48414 -56184 -5438 347 -8867 -10938 -17005
14373a7005j9087p314M9595M5093P632l8842q658N0997k460m5446m2984K4549
$$ -17005 -36092 -43406 6189 51282 58914 20072 11414 62411 59951 14505 -28479 -3930
14361c930O2396l9807m0400l303o256K8666Q860j5113m4780j0808N6361j2365
$$ -3930 58466 18659 -21741 -25044 -31300 -2634 6226 -8887 -53667 -64475 -8114 -20479
14349b0479N29P2199M3015j4332K5719l31q7635m0145M9175O9k1180l0121N342
$$ -20479 -19950 52249 95264 80932 106651 106320 18685 -21460 27715 27784 6604 -23517 -18175
14336a8175L3765k9410m2002K899L3001K8332j8963j3201K7674k977k4574l5929
$$ -18175 15590 -13820 -55822 -52923 -19922 8410 -10553 -23754 3920 943 -23631 -59560
14324e9560K0768M7345M6066l1095l2783k0020l2719j8496k6437R3367N3084O632
$$ -59560 -38792 8553 54619 23524 -9259 -29279 -61998 -80494 -106931 -13564 39520 46152
14312D6152k1923K4379l6056m8802l2440L5906K1451l5151n460n5929P628L6133
$$ 46152 24229 48608 12552 -36250 -68690 -32784 -11333 -46484 -51944 -107873 -100245 -64112
14300f4112K0052M0335N8246k8472j5664k8719k5208L2701L1983J6550l7508k4167
$$ -64112 -44060 -3725 54521 26049 10385 -18334 -43542 -10841 21142 37692 184 -23983
14288b3983N0824j5029r571j8571k8520j581K7546k5177l5730M5742J08793j2807
$$ -23983 26841 11812 2241 -16330 -44850 -46431 -18885 -44062 -79792 -34050 74743 61936
14276F1936m7955L1672l642l4309M8158m6923l4348K5589m4313K7952O2831k7190
$$ 61936 13981 45653 42011 7702 55860 8937 -25411 178 -44135 -16183 46648 19458
14264A9458m8733M3263J274l3964M859j1742K9938K8135K1840m04n3975j6349
$$ 19458 -29275 13988 15262 -18702 -13843 -25585 4353 32488 54328 53924 -51 -16400
14252a6400Q365J7860o3592o489q849j4916K9742K8161j9943k1973K2746O2825
$$ -16400 -8035 9825 -53767 -60256 -69105 -84021 -54279 -26118 -46061 -68034 -45288 17537
14240A7537M2024K2092J0485m5774l3535L130r130j0762k1120r395K9309L3342
$$ 17537 59561 81653 92138 46364 12829 15959 6829 -3933 -25053 -34448 -5139 28203
14228B8203N500n036r414j7555k3892l8546J3671K9162N111L6415M4217j6418
$$ 28203 33703 28667 19253 1698 -22194 -60740 -47069 -17907 -12796 23619 67836 51418
14216E1418K2276N856m5358m2175L2805N247R350L2600l4281l7828K230n0336
$$ 51418 73694 79550 34192 -7983 24822 30069 39419 72019 37738 -90 2140 -48196
14204d8196J4837N9180L1836k5334n2588q6128K8020L7720r413J8101J7527J262
$$ -48196 -33359 25821 57657 32323 -20265 -106393 -78373 -40653 -50066 -31965 -14438 -13176
14192a3176l2815L788m9192p820O8049K0464o6296k6065N0941J6059k0579k2184
$$ -13176 -45991 -42203 -91395 -99215 -31166 -10702 -76998 -103063 -52122 -36063 -56642 -78826
14180g8826L4523L6182L8435P990k6826k3429K819o8016J9011N3022K5350J4258
$$ -78826 -44303 -8121 30314 38304 11478 -11951 -9132 -77148 -58137 -5115 20235 34493
14168C4493j3620k4799J1162L0088K165l108m6762j0600K8225N6613k6573L827
$$ 34493 20873 -3926 7236 37324 39489 36381 -10381 -20981 7244 63857 37284 41111
14156D1111m3017k9122L3959M7431J9131n1093n1214M9757R868l1825O704k1920
$$ 41111 -1906 -31028 2931 50362 69493 18400 -32814 16943 26811 -5014 1690 -20230
14144b0230k3665P855m0477j9737r186K8942Q288K089J522p005P071K9954p666
$$ -20230 -43895 -36040 -76517 -96254 -105440 -76498 -68210 -66121 -64599 -71604 -64533 -34579 -42245
14131d2245L652L856J4871q6538l9657J6406K0832J0820P590m1303K3356N9219
$$ -42245 -38593 -34737 -19866 -106404 -146061 -129655 -108823 -98003 -90413 -131716 -108360 -49141
14119d9141Q0102L9979J765L828q6104j2818Q413Q1716O087n4927M3180k3291
$$ -49141 30961 70940 72705 76533 -9571 -22389 -13976 67740 73827 18900 62080 38789
14107C8789n5772O3189M8322R470M3662l4376n0221k1259o5515l3787N3803j3405
$$ 38789 -16983 46206 94528 103998 147660 113284 63063 41804 -23711 -57498 -3695 -17100
14095a7100J8442R294K7471M2986j6271r1293l5601L2560Q628n056k6597j2775
$$ -17100 1342 10636 38107 81093 64822 -26471 -62072 -29512 -20884 -25940 -52537 -65312
14083f5312K0430M1589J3473l2534j0399J4494j1568j6988m2627K6394L0413p7344
$$ -65312 -44882 -3293 10180 -22354 -32753 -18259 -29827 -46815 -89442 -63048 -32635 -109979
14071a09979L3409P1125j006J3571k1957p0136l8193J2569J8689R894L2073J6074
$$ -109979 -76570 -5445 -6451 7120 -14837 -84973 -123166 -110597 -91908 -82014 -49941 -33867
14059c3867M059J9174k9081j5637R656k7876k7228L035N1902J1072O057n168r783
$$ -33867 -29808 -10634 -39715 -55352 -45696 -73572 -100800 -97765 -45863 -34791 -28734 -33902 -43685
14046d3685O368l1780K363j6641L2607n2832K472M8838K3391m274k3736M0801
$$ -43685 -37317 -69097 -66734 -83375 -50768 -103600 -101128 -52290 -28899 -33173 -56909 -16108
14034a6108n501n9235j6807j0702J3873K2552l6578J3148J804L198L3495M160
$$ -16108 -21609 -80844 -97651 -108353 -94480 -71928 -108506 -95358 -93554 -90356 -56861 -52701
14022e2701K1512K9258K1454K1001n3861m6335L2169J2645o008M502R3151J2027
$$ -52701 -31189 -1931 19523 40524 -13337 -59672 -27503 -14858 -20866 -16364 76787 88814
14010H8814n5198n5481j1325J4935j7667l432K5773M2448M3173k1148p2110o8997
$$ 88814 33616 -21865 -33190 -18255 -35922 -39354 -13581 28867 72040 50892 -21218 -90215
13998i0215K3787L5075M2457O9499L194J547k9823J3475M4261p706L273J0328
$$ -90215 -66428 -31353 11104 80603 83797 85344 55521 68996 113257 105551 108824 119152
13986A19152l6817o5891L6199k2741n4781J3072l3627J2296J6911K1251L0499
$$ 119152 82335 16444 52643 29902 -24879 -11807 -45434 -33138 -16227 5024 35523
13975C5523N0788j035k2436n0478k1459K4698P1391N284m2534n9528l3591o0422
$$ 35523 86311 85276 62840 12362 -9097 15601 86992 92276 49742 -9786 -43377 -103799
13963a03799l5763J3608M6346L6241K4563M0611l3338J6593M9455K0395l8922
$$ -103799 -139562 -125954 -79608 -43367 -18804 21807 -11531 5062 54517 74912 35990
13952C5990o0471J2857J396k191L0850l4989N13m5357M9205N1027j8038J2796
$$ 35990 -24481 -11624 -10228 -12419 18431 -16558 -16045 -61402 -12197 38830 20792 33588
13940C3588M9247l4528p1996j7042K6675M086p6491p12O8757K5775m0251P508
$$ 33588 82835 48307 -23689 -40731 -14056 -9970 -86461 -87173 -18416 7359 -32892 -25384
13928b5384K7061M6779M2406j936n5069k7686L3250Q610k8272J4030j0817q87
$$ -25384 1677 48456 90862 88926 33857 6171 39421 48031 19759 33789 22972 22085
13916B2085J9984J0476j1307M594J3376P91n127j044p898j0350M866j7980k198
$$ 22085 42069 52545 41238 45832 59208 59999 54872 53828 45930 35580 40446 22466 20268
13903B0268J1548J0710j3473L6504J2267j2012J3415M9619J6330J1663j8629q7296
$$ 20268 31816 42526 29053 65557 77824 65812 79227 128846 145176 156839 138210 50914
13891E0914k2107j6941k7726K2138M84L4875k77m2053K1841n681j7408P568l742
$$ 50914 28807 11866 -15860 6278 6762 41637 41360 -693 21148 15467 -1941 5627 1885
13878A885l7866J6371K6661k1555n978N4239N8553J185j8462j5140K9811l2944
$$ 1885 -35981 -19610 7051 -14504 -20482 33757 92310 93495 75033 59893 89704 56760
13866E6760o6080L0405M4378j3022j8979l541m5033k627l413k7956k876M3124
$$ 56760 -9320 21085 65463 52441 33462 29921 -15112 -17739 -21152 -49108 -51984 -8860
13854h860L3846m0703k8771m6k873J3867k127P2856M4568l6814k8720O0553K0244
$$ -8860 24986 -15717 -44488 -44534 -47407 -33540 -35667 37189 81757 44943 16223 76776 97020
13841I7020l7659K7355Q72p2186m2516J5953L7267j378l1411N766j3625K5266
$$ 97020 59361 86716 87588 15402 -27114 -11161 26106 24728 -6683 -917 -14542 10724
13829A0724N3967O83j8719p2010j504p684m6566j466J7249N8945L3504o940l2321
$$ 10724 64691 65374 46655 -25355 -26859 -34543 -81109 -82575 -65326 -6381 27123 20183 -12138
13816a2138R045l3680K6395O989M4786J3350K77l6395l1829L6811K0046K5767
$$ -12138 -3093 -36773 -10378 -3389 41397 54747 55024 18629 -13200 23611 43657 69424
13804F9424O232j2332l2098j8927r502L5186L4506k9164m5376l24m5386P155L9777
$$ 69424 75656 63324 31226 12299 2797 37983 72489 43325 -2051 -2375 -47761 -40606 -829
13791h29k6468L101k409O164K7757l498k22J3869M131l2733K2689j1837J138J2559
$$ -829 -27297 -24196 -26605 -20441 7316 3818 3596 17465 21596 -11137 11552 -285 853 13412
13777A3412l3151M097K0336k7602l6754J4899k1224r5174O1388L0734N4211J316
$$ 13412 -19739 -15642 4694 -22908 -59662 -44763 -65987 -161161 -99773 -69039 -14828 -13512
13765a3512j7433J4534m858j8857l5598O4335M8756l155k0426k0651j3010J0254
$$ -13512 -30945 -16411 -21269 -40126 -75724 -11389 37367 34212 13786 -6865 -19875 -9621
13753i621l6809K7647K8457L7476J063P444o8260m0176M940j3784k4374M4216
$$ -9621 -46430 -18783 9674 47150 48213 55657 -12603 -52779 -47839 -61623 -85997 -41781
13741d1781M0554K5239n495n015J1918k2292L3927N4409J9125r812l9776k8657
$$ -41781 -1227 24012 18517 13502 25420 3128 37055 91464 110589 100777 61001 32344
13729C2344K675l9271k7840K2150K5978O62m075j2655j2358M9025K9860M253j6556
$$ 32344 35019 -4252 -32092 -9942 16036 16698 12623 -32 -12390 36635 66495 70748 54192
13716E4192l1402o0987m5656l1726l881P8792j7160j1195j3127J529K6619m215
$$ 54192 22790 -38197 -83853 -115579 -119460 -40668 -57828 -69023 -82150 -80621 -54002 -58217
13704e8217n17O5986l7200l7931L6584J8651N9684K3452K4486m687k6155m5459
$$ -58217 -58734 7252 -29948 -67879 -31295 -12644 47040 70492 94978 90291 64136 18677
13692A8677k3995l063L0424k4164n1281j3596j979J8595K6940R967M962m0308
$$ 18677 -5318 -8381 22043 -2121 -53402 -66998 -68977 -50382 -23442 -13475 -8513 -48821
13680d8821Q2434J0250o557K1777j7534J9120Q84m5341n3880j6355L1467M0990
$$ -48821 33613 43863 37306 59083 41549 60669 61553 16212 -37668 -54023 -22556 18434
13668A8434M0287n4912O313J5246q512M9673P793m5435j4966j4076k7277J9329
$$ 18434 58721 3809 10122 25368 16856 66529 74322 28887 13921 -155 -27432 -8103
13656h103J8662L0801k1073m2837l2946j9045J9524M8098K1618p293J0324J4075
$$ -8103 10559 41360 20287 -22550 -55496 -74541 -55017 -6919 14699 7406 17730 31805
13644C1805o5224n1233o0228K7867Q909N2788N5648M788J8351J4641j1333J5133
$$ 31805 -33419 -84652 -144880 -117013 -108104 -55316 332 5120 23471 38112 26779 41912
13632D1912O504k4602k6520n945O1189k8476m6237k9562J6603M6201k171M0495
$$ 41912 48416 23814 -2706 -8651 52538 24062 -22175 -51737 -35134 11067 8896 49391
13620D9391j8575n4178R792j7165J8630J4240K62o866m1434j9785k1749K9600
$$ 49391 30816 -23362 -13570 -30735 -12105 2135 2397 -4469 -45903 -65688 -87437 -57837
13608e7837L1780L2095q278J4377K932n6560P025L4372K277N859l0968j3508l9778
$$ -57837 -26057 6038 -2240 12137 15069 -41491 -34466 -94 2183 8042 -22926 -36434 -76212
13595g6212K0438J3410k9704L7132L2698J7883J4042j206J0803M5831L7851j434
$$ -76212 -55774 -42364 -72068 -34936 -2238 15645 29687 28481 39284 85115 122966 121532
13583A21532l3887M1175J1820R367j5651N254j897m4014o6916k7330K4431j7188
$$ 121532 87645 128820 140640 150007 134356 139610 137713 93699 26783 -547 23884 6696
13571F696k6383k2375o4704J5950M7818L3978L0816R102o793L8752N4313k5379
$$ 6696 -19687 -42062 -106766 -90816 -42998 -9020 21796 30898 24105 62857 117170 91791
13559I1791l1179k3687n226k7854n9756K3027M7796M0931J8048j2763J0849k5510
$$ 91791 60612 36925 31699 3845 -55911 -32884 14912 55843 73891 61128 71977 46467
13547D6467n1976l4933J1538M3358k5104k2701L0463P4103r826j0210r585J8812
$$ 46467 -5509 -40442 -28904 14454 -10650 -33351 -2888 71215 61389 51179 41594 60406
13535F0406q893o1256Q975J5959l2180o4515M9748Q9722o2883K4778M1898j3983
$$ 60406 51513 -9743 -768 15191 -16989 -81504 -31756 57966 -4917 19861 61759 47776
13523D7776L2524R944j4878k6059R308Q9026J9419m7610n3554j7357k8553k6676
$$ 47776 80300 90244 75366 49307 58615 147641 167060 119450 65896 48539 19986 -6690
13511f690O9602P049n3421j6101L3651P3810M1401l6532l5699n524m140k3162
$$ -6690 62912 69961 16540 439 34090 107900 149301 112769 77070 71546 67406 44244
13499D4244k5426K185L6338l0180r54j0129M757J4910K3380m5215l1212j2576
$$ 44244 18818 21003 57341 27161 26207 16078 20835 35745 59125 13910 -17302 -29878
13487b9878n673M597P127m644j8788L726l163L1530j7255l7373k4923M9674K3182
$$ -29878 -35551 -30954 -23827 -28471 -47259 -43533 -46696 -15166 -32421 -69794 -94717 -45043 -21861
13474b1861J8220J0351P1743Q1177n7124r3130k4143L4753r529K3646o661n827
$$ -21861 -3641 6710 78453 159630 102506 9376 -14767 19986 10457 34103 27442 21615
13462B1615k7599P20P417p142j5523k8952j7699J2508J9497K5857K4478R950m206
$$ 21615 -5984 -5264 2153 -4989 -20512 -49464 -67163 -54655 -35158 -9301 15177 25127 20921
13449B0921l9804q1968k0921K0987O9780K2545L851M0362J6935k5778K9883M685
$$ 20921 -18883 -100851 -121772 -100785 -31005 -8460 -4609 35753 52688 26910 56793 61478
13437F1478K3096M1920J6423o231l328m5483m0852q8946k2596L8116N7166j6927
$$ 61478 84574 126494 142917 136686 133358 87875 47023 -41923 -64519 -26403 30763 13836
13425A3836l2157J1429p550j1860R735j4702O7123M2562L1306N4987j00985j16727
$$ 13836 -18321 -6892 -14442 -26302 -16567 -31269 35854 78416 109722 164709 63724 -53003
13413e3003N781L2969N247q165J5618l6984L4625N2430n366M1276j9029o9161
$$ -53003 -47222 -14253 -9006 -17171 -1553 -38537 -3912 48518 43152 84428 65399 -3762
13401c762j1781K6745K1630j3059J2229P892J7886m2258l3417K3822j4189j1740
$$ -3762 -15543 11202 32832 19773 32002 39894 57780 15522 -17895 5927 -8262 -20002
13389b0002j4116K0132P821k4670k6132M3887K7339K2891j9093K151J0110J1833
$$ -20002 -34118 -13986 -6165 -30835 -56967 -13080 14259 37150 18057 20208 30318 42151
13377D2151N956j258q068O153K3070j4433l4502m1803N9668O167L272L7117L3429
$$ 42151 48107 46849 38781 44934 68004 53571 19069 -22734 36934 43101 46373 83490 116919
13364A16919M5500j5143j00752J911N0731m1293l7232P761l28k556L0187M6747
$$ 116919 162419 147276 46524 48435 99166 57873 20641 28402 28074 25518 55705 102452
13352A02452k9912j3752o2169j3188N3005N7833m9322m4355o260n124l9225P1862
$$ 102452 72540 58788 -3381 -16569 36436 94269 44947 592 -5668 -10792 -50017 21845
13340B1845J16530j1162l1030j0461m9655k0297l7019n9937J457M9563L7918L5546
$$ 21845 138375 127213 96183 85722 36067 15770 -21249 -81186 -79729 -30166 7752 43298
13328D3298L1052J5781l727n2366L6702k4065m5125J923n1462J8937L5367K8835
$$ 43298 74350 90131 86404 34038 70740 46675 1550 3473 -47989 -29052 6315 35150
13316C5150J6321L3712j0373k6337r147n2120j3337L6621N6448K3688j7661l5172
$$ 35150 51471 85183 74810 48473 39326 -12794 -26131 10490 66938 90626 72965 37793
13304C7793l5333l6728j6620K5870o259l5586j7236l5866M3558Q7549N443k321
$$ 37793 2460 -34268 -50888 -25018 -31277 -66863 -84099 -119965 -76407 11142 16585 14264
13292A4264L2382P035L2641pp139M1054R197k6803K1295m9393j6921L5573J5762
$$ 14264 46646 53681 86322 86315 79176 120230 129427 102624 123919 74526 57605 93178 108940
13279A08940j5676l7542o0105K162j1958J0678Q843j8953K9352O2706P2050L5273
$$ 108940 93264 55722 -4383 -2221 -14179 -3501 5342 -13611 15741 78447 150497 185770
13267A85770n7487r8969n0740Q0519j7469m44K8537l7977p5469J5929P3892M4737
$$ 185770 128283 29314 -21426 59093 41624 41180 69717 31740 -43729 -27800 46092 90829
13255I0829k312n7349j3425N0289k3328j6308N016k5849j4934j0641j5746M4902
$$ 90829 88517 31168 17743 68032 44704 28396 33412 7563 -7371 -18012 -33758 11144
13243A1144K4737P716j5722l5900J6231L3283j7037P0533J6181l7650q441r422
$$ 11144 35881 43597 27875 -8025 8206 41489 24452 94985 111166 73516 65075 55653
13231E5653q421J8181q8827l3875O3944K1427m5249k688j5284L3200N3226j4655
$$ 55653 47232 65413 -23414 -57289 6655 28082 -17167 -19855 -35139 -1939 51287 36632
13219C6632k1071k2132P5923K9169k6406k6843J1128l4825R814O0915p17l5434
$$ 36632 15561 -6571 69352 98521 72115 45272 56400 21575 31389 92304 91587 56153
13207E6153j2203k3790j029J3702J1827M0865l6620m3593J932J4176o5348L2387
$$ 56153 43950 20160 19131 32833 44660 85525 48905 5312 7244 21420 -43928 -11541
13195a1541j7418j7171N7604M9686L3765M610k80o3802k5750k397J2225J6660
$$ -11541 -28959 -46130 11474 61160 94925 99535 99255 35453 9703 7306 19531 36191
13183C6191O2839K2928k7157j5502j0762j7762J996j023n4266L2151m244j4916
$$ 36191 99030 121958 94801 79299 68537 50775 52771 51748 -2518 29633 25389 10473
13171A0473j7828N3574L6863J4185l6362q0329l4477N8953M6082K0714o9721n159
$$ 10473 -7355 46219 83082 97267 60905 -19424 -53901 5052 51134 71848 2127 -3032
13159c032Q476k6470k2576o539N6958K1901j0010o1939K4171J5022N889M600P743
$$ -3032 5444 -21026 -43602 -50141 6817 28718 18708 -43231 -19060 -4038 1851 6451 14194
13146A4194L4261J7201O947J4388J1221p647n8537n1881l589J5525k5687K2474
$$ 14194 48455 65656 72603 86991 98212 90565 32028 -19853 -23442 -7917 -33604 -11130
13134a1130O9634J1019K0010Q9022M2053q9889m9660K7248M9266l5601l8834j0249
$$ -11130 58504 69523 89533 178555 220608 130719 81059 108307 157573 121972 83138 72889
13122G2889O079q9000j9812J3414L4096M3275k1559k6967j4219J0610r348l1952
$$ 72889 78968 -10032 -29844 -16430 17666 60941 39382 12415 -1804 8806 -542 -32494
13110c2494m9042K6342M4186J5196k3522K1441N9030O5216O464l8303q1125k4775
$$ -32494 -81536 -55194 -11008 4188 -19334 2107 61137 126353 132817 94514 13389 -11386
13098a1386M1274K2290n369O065m9515l1558J7162L8305K5091M7536J8768M951
$$ -11386 29888 52178 46809 52874 3359 -28199 -11037 27268 52359 99895 118663 123614
13086A23614J3782K7852l9225k9729Q176j6280L5587k1989r856K3468K6043k4784
$$ 123614 137396 165248 126023 96294 104470 88190 123777 101788 91932 115400 141443 116659
13074A16659j1088l8167q397p231l5475Q787q924K9779J0576L1611j2803J0062
$$ 116659 105571 67404 59007 51776 16301 25088 16164 45943 56519 88130 75327 85389
13062H5389m2518J2154j9901J7545p559l2864k8062M188L2771O332k0289J8153
$$ 85389 42871 55025 35124 52669 45110 12246 -15816 -11628 21143 27475 7186 25339
13050B5339p308L5690o711j8132j0576r669K0075M7078J0171p4248o9453n7656
$$ 25339 18031 53721 47010 28878 18302 8633 28708 75786 85957 11709 -57744 -115400
13038a15400K5255M9820K0564J2632p495m3667O8592K8205L2386k9483l1292K9774
$$ -115400 -90145 -40325 -19761 -7129 -14624 -58291 10301 38506 70892 41409 10117 39891
13026C9891m295k8511J9226J6019j6249Q456L77L8836p5n9527m4606K4144l2060
$$ 39891 35596 7085 26311 42330 26081 34537 34914 73750 73675 14148 -30458 -6314 -38374
13013c8374N1663M557L622M1906j773O4251N2727k8391n4356j7291J8681J1379
$$ -38374 13289 17846 21468 63374 61601 125852 178579 150188 95832 78541 97222 108601
13001A08601k3763j0778m5407K1950l110M0089K3591l5055M35j1577j4458p488
$$ 108601 84838 74060 28653 50603 47493 87582 111173 76118 76553 64976 50518 43030
12989D3030J2675m4616n9673l936J1306O6957K8929k0363M1747k0653K549J0336
$$ 43030 55705 11089 -48584 -52520 -41214 25743 54672 34309 76056 55403 57952 68288
12977F8288K58k8800l95O7633K3274p9202l295N806j3814k1372k0052j142J393
$$ 68288 68546 39746 39351 106984 130258 51056 47761 53567 39753 18381 -1671 -2813 -1420
12964a420M6700L565m0857j2384O0122K108N098l6285L6925j0776Q15K8099m2034
$$ -1420 45280 48845 7988 -4396 55726 57834 62932 26647 63572 52796 53611 81710 39676
12951C9676L361P913R737N1406k8959m4642L1955L2196J6819k5872l1464P836
$$ 39676 43037 50950 60687 112093 83134 38492 70447 102643 119462 93590 62126 69962
12939F9962K3682J0928p1597k3484j5401K0590M4625k574k6081p281K447M006
$$ 69962 93644 104572 32975 9491 -5910 14680 59305 56731 30650 23369 25816 29822
12927B9822L3859l9123R311k5203k5260K777J3901J0786J8828L0663Q899J0222
$$ 29822 63681 24558 33869 8666 -16594 -13817 84 10870 29698 60361 69260 79482
12915G9482k898o263m766j8849j0550m3936L0482k262J1239J8561l469k6229k8804
$$ 79482 76584 70321 65555 46706 36156 -7780 22702 20440 31679 50240 46771 20542 -8262
12902h262O857K4056M825N003K7054O1349k94j12430p9092N0161L2686l5753N4414
$$ -8262 -1405 22651 27476 32479 59533 120882 120588 8158 -70934 -20773 11913 -23840 30574
12889C0574L6816K3926l2753J0933L8906L6469m4779q6193L7240Q870l7591L4108
$$ 30574 67390 91316 58563 69496 108402 144871 100092 13899 51139 60009 22418 56526
12877E6526Q549M7423l3679P557k9711j416l8184o233O317j0919L397l5152M9744
$$ 56526 65075 112498 78819 86376 56665 55249 17065 10832 17149 6230 9627 -25525 24219
12864B4219L2704n065J9303K1845K1394l8810L2604K7391J0588l9528l7987P153
$$ 24219 56923 51858 71161 93006 114400 75590 108194 135585 146173 106645 68658 75811
12852G5811M1460J8844Q128O338n594l8852k8481k4493k0549K2488n133k1910
$$ 75811 117271 136115 144243 150581 144987 106135 77654 53161 32612 55100 49967 28057
12840B8057l0664j1113K6091L1648K5123j9492o3459j5590N440M0408N2505j2602
$$ 28057 -2607 -13720 12371 44019 69142 49650 -13809 -29399 -23959 16449 68954 56352
12828E6352k0894J6869K9052j2288n223l2680j8605Q021k220r441M0546J5336
$$ 56352 35458 52327 81379 69091 63868 31188 12583 20604 18384 8943 49489 64825
12816F4825J788l5575r238Q188n5391M1545M5918J0394K2854J0604M258m1784
$$ 64825 66613 31038 21800 29988 -25403 16142 62060 72454 95308 105912 110170 68386
12804F8386p88J778l7010l3514J5944R478r758L5897J5597k7592j2743R9399J3322
$$ 68386 67598 69376 32366 -1148 14796 24274 14516 50413 66010 38418 25675 125074 138396
12791A38396j1920m2111L418k9799l2863M2772R2110J00615P7903N67r897o8277
$$ 138396 126476 84365 87783 57984 25121 67893 160003 260618 338521 339088 329191 260914
12779B60914j6749o7365m1220k3010k9207Q256J6121l987k9449j2629o377k0697
$$ 260914 244165 176800 135580 112570 83363 91619 107740 103753 74304 61675 55298 34601
12767C4601j1131j9552N880l9793Q93O6695l907k2607m3390O7220K2537L0926
$$ 34601 23470 3918 9798 -29995 -29102 37593 33686 11079 -32311 34909 57446 88372
12755H8372j0223n4349l3368O8853L141o7386N6048N4800j9494J2995L9033k6565
$$ 88372 78149 23800 -9568 59285 62426 -4960 51088 105888 86394 99389 138422 111857
12743A11857j3664P3585l0527r8897o1553N6532K0605m6087O2432P8413L2623
$$ 111857 98193 171778 141251 42354 -19199 37333 57938 11851 74283 152696 185319
12732A85319p2427o6062l1480j8564k1660K9237N7674K2821j9630K7484M3723
$$ 185319 112892 46830 15350 -3214 -24874 4363 62037 84858 65228 92712 136435
12721A36435O406l5407p641N135l0274m297L0335L3217M164O39m7267j32299m7961
$$ 136435 142841 107434 99793 104928 74654 70357 100692 133909 138073 138712 91445 -40854 -88815
12708h8815M0838O191N5637N9056J8278O312j2990m2458n790K1360J6623k4079
$$ -88815 -47977 -41786 13851 72907 91185 97497 84507 42049 36259 57619 74242 50163
12696E0163Q938J5439Q5806J5423N9709J2315p9214p1400j8594K093p969M0242
$$ 50163 59101 74540 160346 175769 235478 247793 168579 97179 78585 80678 72709 112951
12684A12951l8094n0283L3331J0074j111m189J0399l320J7388Q0834K9518r945
$$ 112951 74857 24574 57905 67979 66868 62679 73078 69758 87146 167980 197498 187553
12672A87553m3489k7043m0638l235L2509O518k660l6569j3531P7795L3533j1087
$$ 187553 144064 117021 76383 73148 105657 112175 109515 72946 59415 137210 170743 159656
12660A59656m1076l9963k1366N625K0732j3179l5192L01j6259K1305L6163k4674
$$ 159656 118580 78617 57251 62876 83608 70429 35237 35538 19279 40584 76747 52073
12648E2073M5677j5289m2175K1397M0820j5312l0161J5056N7108N4259r206m5212
$$ 52073 97750 82461 40286 61683 102503 87191 57030 72086 129194 183453 174247 129035
12636A29035q763K3566j416m435K357j2832o9874L4600N8063k2066k7415L0569
$$ 129035 120272 143838 142422 137987 140344 127512 57638 92238 150301 128235 100820 131389
12624A31389L5863K5821k2228l5185j6523N479O625k1234J0821k2141r512q8309
$$ 131389 167252 193073 170845 135660 119137 124616 131241 110007 120828 98687 89175 866
12612H66K1570N3830k3041l835N3474j989k4686O8493k2935L4195L170k8090j4005
$$ 866 22436 76266 53225 49390 102864 100875 76189 144682 121747 155942 159112 131022 117017
12599A17017j4591j0204k6497N2114L3663q991q807N6686J3829l330j9114q908
$$ 117017 102426 92222 65725 117839 151502 142511 133704 190390 204219 200889 181775 172867
12587A72867l7455k0038O4534R937j4020l4451j0352O7851N8797j8554J1506R247
$$ 172867 135412 115374 179908 189845 175825 141374 131022 198873 257670 239116 250622 259869
12575B59869j303k2358j4050n473J2069J835J4490L08P2675N7812O0137P9255
$$ 259869 258566 236208 222158 216685 228754 230589 245079 245387 318062 375874 436011 515266
12563E15266P8233Q4034M7895R198J6020l0079r7656j998p162j1458o6717Q771
$$ 515266 593499 677533 725428 734626 750646 720567 622911 620913 613751 602293 535576 544347
12551E44347n9086o0293o0367k7517N8729K572r539J8362J4155Q2239N7544k4108
$$ 544347 485261 424968 364601 337084 395813 398385 388846 407208 421363 503602 561146 537038
12539E37038l3265K5461N2528Q0839Q9265J39755J50135K2988l543L5908r048
$$ 537038 503773 529234 581762 662601 751866 891621 1041756 1064744 1061201 1097109 1088061
12528A088061r919l6752L3672M4296P2931J30183J36740P4077J49166R7172R243
$$ 1088061 1078142 1041390 1075062 1119358 1192289 1322472 1459212 1533289 1682455 1779627 1788870
12517A788870o1810j41728j17813j28497j38932j51232j31888j17095n8106p431
$$ 1788870 1727060 1585332 1467519 1339022 1200090 1048858 916970 799875 741769 734338
12507G34338o7177J6712k4212j1799k0866J1122J9299J8717P2030R4136L7156
$$ 734338 667161 683873 659661 647862 626996 638118 657417 676134 748164 842300 879456
12496H79456p955M0427J77471J64961J56456R0732O7191P1058M6524N868q3426
$$ 879456 871501 911928 1089399 1254360 1410816 1501548 1568739 1639797 1686321 1692189 1608763
12485A608763q3205j11182p7416o0600k9558N8649K0779N013N0522M3925n3768
$$ 1608763 1525558 1414376 1336960 1276360 1246802 1305451 1326230 1331243 1381765 1425690 1371922
12474A371922q3541j62407j75513q8351o6919j24714q4307m765n4744j05811j6618
$$ 1371922 1288381 1125974 950461 862110 795191 670477 586170 581405 526661 420850 404232
12463D04232K8290K2805j4912L2660K3265K9892L5307J2758M4500N0248L8876
$$ 404232 432522 455327 440415 473075 496340 526232 561539 574297 618797 669045 707921
12452G07921Q000O9331L4326Q1830P7527M5305M9416L58j3379k1510o5753n7720
$$ 707921 715921 785252 819578 901408 978935 1024240 1073656 1074014 1060635 1039125 973372 915652
12440I15652j06073r0964n1110k765q5782r0873q7430l6956k355j321j7579l1354
$$ 915652 809579 718615 667505 664740 578958 488085 400655 363699 361344 360023 342444 311090
12428C11090O430O476Q552M7071P523p228O627l899L3479l5968j1594k554j09693
$$ 311090 317520 323996 332548 379619 387142 379914 386541 382642 416121 380153 368559 366005 256312
12415B56312k1164q691R767J1544M9835N2168J005m5504l3551k936N7482Q0768
$$ 256312 235148 226457 236224 247768 297603 349771 350776 305272 271721 268785 326267 407035
12403D07035L8966K1853O1692J00750J25328J11593m7982j67168q3676p0920p7116
$$ 407035 446001 467854 529546 630296 755624 867217 819235 652067 568391 497471 420355
12392D20355m0461L9288r569l3676q323o886j5663O3843Q2656L5614M5902P4034
$$ 420355 379894 419182 409613 375937 367614 360728 345065 408908 491564 527178 573080 647114
12380F47114P0678N4766J4590L3857P2196J2959k2086m8538P3442K2934L4176
$$ 647114 717792 772558 787148 821005 893201 906160 884074 835536 908978 931912 966088
12369I66088J7938n4857o1377o03m6072m7267n1177q6114o4228k2048k8565j3390
$$ 966088 984026 929169 867792 867189 821117 773850 722673 636559 572331 550283 521718 508328
12357E08328K7749j0979R043J3226J9221L6504L0849N3912M7368m4041j0530k0920
$$ 508328 536077 525098 534141 547367 566588 603092 633941 687853 735221 691180 680650 659730
12345F59730r2828J6700m8410k40K6422k6707L9660K5628n8672k8562J931L6789
$$ 659730 566902 583602 535192 534952 561374 534667 574327 599955 541283 512721 514652 551441
12333E51441l87n8910K9314Q3792M0259l741l0366k3111k6689k4649k6358q0233
$$ 551441 551054 492144 521458 605250 645509 641768 611402 588291 561602 536953 510595 430362
12321D30362m9198K1817K9848m3717l6299n6618K0024K8036j4751k8383L9026
$$ 430362 381164 402981 432829 389112 352813 296195 316219 344255 329504 301121 340147
12310C40147M1705m4321N2025N8317M733K396j9004j2038L1559k6244m8188m6945
$$ 340147 381852 337531 389556 447873 452606 455002 435998 423960 455519 429275 381087 334142
12298C34142P3910O6221R429m6538j2051R4392K5030M3765L5714o178k8322J6351
$$ 334142 408052 474273 483702 437164 425113 519505 544535 588300 624014 617836 589514 605865
12286F05865j2106j0714k9202k4775P0041L6003J5219j1133o8573n9490K7495
$$ 605865 593759 583045 553843 529068 599109 635112 650331 639198 570625 511135 538630
12275E38630N2925p8474o7096j2878j5442j2330Q542J031K1910N1676M3083K2121
$$ 538630 591555 513081 445985 433107 417665 405335 413877 414908 436818 488494 531577 553698
12263E53698Q802O5905r572n5758l6997M5910N5861J2759n4671K8938M1599M6548
$$ 553698 562500 628405 618833 563075 526078 571988 627849 640608 585937 614875 656474 703022
12251G03022N809o9935K5410Q6892K5040P607P576m152l1115j5385m2738l7669
$$ 703022 708831 638896 664306 751198 776238 783845 791421 787269 756154 740769 698031 660362
12239F60362k574K1069k0300k4730l0877k379J4225l137q1722j083J04174J03901
$$ 660362 657788 678857 658557 633827 602950 600571 614796 611659 529937 528854 633028 736929
12227G36929J4055k2586n49L6153Q2148R1577k9214m3526P150J0818J4031k136
$$ 736929 750984 728398 727849 764002 846150 937727 908513 864987 872137 882955 896986 894850
12215H94850K0938K5466L5319P8843M7076M0426K0654P2258M66k7187J7426j0999
$$ 894850 915788 941254 976573 1055416 1102492 1142918 1163572 1235830 1236296 1209109 1226535 1215536
12203A215536M1808M3659O3717m9713q619k672M543m9515o4189N665R935J0416
$$ 1215536 1257344 1301003 1364720 1315007 1306388 1303716 1308259 1258744 1194555 1200220 1210155 1220571
12191A220571n1995N5795L7189k1713K5546l3031q7872j0421R1596M8695L0376
$$ 1220571 1168576 1224371 1261560 1239847 1265393 1232362 1144490 1134069 1225665 1274360 1304736
12180A304736L86K2481J5859M272K3749P6083M6790Q1828R1163P6931j824L9042
$$ 1304736 1305122 1327603 1343462 1347734 1371483 1447566 1494356 1576184 1667347 1744278 1742454 1781496
12168A781496L5593J00777O2605M3833M2110J23729P4718K8382N4673J23831N4802
$$ 1781496 1817089 1917866 1980471 2024304 2066414 2190143 2264861 2293243 2347916 2471747 2526549
12157B526549K596M9324L9133J5061O6478Q7131Q8620J03716J24759J32884J71724
$$ 2526549 2529145 2578469 2617602 2632663 2699141 2786272 2874892 2978608 3103367 3236251 3407975
12146C407975K53104K44623J58701J53081K39030K50258K58875K97850L73284
$$ 3407975 3661079 3905702 4064403 4217484 4456514 4706772 4965647 5263497 5636781
12137E636781M89165N93692O93437P51643Q82191J166541J377467J673917K013394
$$ 5636781 6125946 6719638 7413075 8164718 9046909 10213450 11590917 13264834 15278228
12128A5278228K422415L031162L801736N026717O862794R237118J2045321J4407740
$$ 15278228 17700643 20731805 24533541 29560258 36423052 45660170 57705491 72113231
12120G2113231J5632344J5428231J3812491J0422494M940302j649682o805474
$$ 72113231 87745575 103173806 116986297 127408791 132349093 130699411 123893937
12113A23893937r825063j1333898j1830153j1479544j0241674q737989p187037
$$ 123893937 114068874 102734976 90904823 79425279 69183605 60445616 53258579
12106E3258579n748336m450307l356957k480446j861369j407845r97870n53522
$$ 53258579 47510243 43059936 39702979 37222533 35361164 33953319 32955449 32401927
12098C2401927J9021O38073J387938K033987K902825L929300N287769P190444
$$ 32401927 32420948 33059021 34446959 36480946 39383771 43313071 48600840 55791284
12090E5791284R782796J2991701J6581288K0335102K3802362K6378375K7102300
$$ 55791284 65574080 78565781 95147069 115482171 139284533 165662908 192765208
12083A92765208K5473818K2127166J8335313J5332798J3991464J4138109J3685010
$$ 192765208 218239026 240366192 258701505 274034303 288025767 302163876 315848886
12076C15848886J0296910K887078o936283j6439757k4573719l0909004l3861223
$$ 315848886 326145796 329032874 322096591 305656834 281083115 250174111 216312888
12069B16312888l3011824k9714233k5380861k0790644j6463093j2723188r598619
$$ 216312888 183301064 153586831 128205970 107415326 90952233 78229045 68630426
12062F8630426p251380n342046l803433k480747j410525m31619O09097J576074
$$ 68630426 61379046 56037000 52233567 49752820 48342295 47910676 48519773 50095847
12054E0095847K526139L609448M936571O598886Q305838J0172509J2385382J5171876
$$ 50095847 52621986 56231434 61168005 67766891 76072729 86245238 98630620 113802496
12046A13802496J8622277K2741061K6818397K9467478K9490141K7021029K3334770
$$ 113802496 132424773 155165834 181984231 211451709 240941850 267962879 291297649
12039B91297649J9340601J4642402Q656737J957342m355557r928383j5151196
$$ 291297649 310638250 325280652 333937389 335894731 331539174 321610791 306459595
12032C06459595k0087916k4948275k9389515l1946232l1540211k8775928k4801452
$$ 306459595 286371679 261423404 232033889 200087657 168547446 139771518 114970066
12025A14970066k0372412j6205918j2594758r611246p158750n379145m054467
$$ 114970066 94597654 78391736 65796978 56185732 49026982 43647837 39593370
12018C9593370l037408k270161j649920j001335l52671K99346R84685J542098
$$ 39593370 36555962 34285801 32635881 31634546 31281875 31581221 32565906 34108004
12010C4108004J984410K473055L038495M039541N334021O702462Q268969R780787
$$ 34108004 36092414 38565469 41603964 45643505 50977526 57679988 65948957 75729744
12002G5729744J1197420J2636953J3663611J3484460J1182544O380833J59472
$$ 75729744 86927164 99564117 113227728 126712188 137894732 144275565 144435037
11995A44435037o100514j1574354j5413577j7182998j6683945j4631144j1985624
$$ 144435037 138334523 126760169 111346592 94163594 77479649 62848505 50862881
11988E0862881r375313p119899n408568m181912l277464k704194k288183j921138
$$ 50862881 41487568 34367669 28959101 24777189 21499725 18795531 16507348 14586210
11980A4586210j602532j344579j144495r46220p77977n90406n13332m87459m41821
$$ 14586210 12983678 11639099 10494604 9548384 8770407 8180001 7666669 7179210 6737389
11971F737389l58044k78428k76899k05104j78373j74440j86267k28882k43019
$$ 6737389 6379345 6100917 5824018 5618914 5440541 5266101 5079834 4850952 4607933
11962D607933k22069j43551j73616j64510j78227j14813j27603j22328r8892o2680
$$ 4607933 4385864 4242313 4068697 3904187 3725960 3611147 3483544 3361216 3262324 3199644
11952C199644l4880n9271j29642j63858o8940q2299r1581o4222p1812o8446j12057
$$ 3199644 3164764 3105493 2975851 2811993 2743053 2660754 2569173 2504951 2433139 2364693 2252636
11941B252636j0542Q959Q771p143l9322N144K3480m3653k7404M1047q833o1774
$$ 2252636 2242094 2251053 2259824 2252681 2213359 2218503 2241983 2198330 2170926 2211973 2203140 2141366
11929B141366o346j000q344j9177l0021l7975o6243n8686n4097j2191l7690n8903
$$ 2141366 2135020 2134020 2125676 2106499 2076478 2038503 1972260 1913574 1859477 1847286 1809596 1750693
11917A750693l2873M6484K5028j6418l8035j3023n8814p2156m1604p7720m9833
$$ 1750693 1717820 1764304 1789332 1772914 1734879 1721856 1663042 1590886 1549282 1471562 1421729
11906A421729m8m2243l8551k6843M5148L1674K8486L585J8241k1625O2296O9807
$$ 1421729 1421681 1379438 1340887 1314044 1359192 1390866 1419352 1422937 1441178 1419553 1481849 1551656
11894A551656P3666L4664j7829K4184j458o8585n8375m7521k5951l6653j05331
$$ 1551656 1625322 1659986 1642157 1666341 1664883 1596298 1537923 1490402 1464451 1427798 1322467
11883A322467q7218j11303m8204l8959k7993j6180l639k3353K5816M9750L0707
$$ 1322467 1235249 1123946 1075742 1036783 1008790 992610 988971 965618 991434 1041184 1071891
11872A071891o119L08N4510J0557r20L7940j6455K0344l2874j489Q186l0226p0801
$$ 1071891 1065772 1066080 1120590 1131147 1130227 1168167 1151712 1172056 1139182 1137693 1145879 1115653 1044852
11859A044852r005P116j7441k4318J7436L597n859J6993J0031M3217l9097r1591
$$ 1044852 1035847 1042963 1025522 1001204 1018640 1022237 1016378 1033371 1043402 1086619 1047522 955931
11847I55931k1409j2432K482L3250o705j7919j841l2684n3230j4339l1962j03551
$$ 955931 934522 922090 924572 957822 951117 933198 931357 898673 845443 831104 799142 695591
11835F95591O6467J39055K2274o2491n2471N9259J3011j4163o7514k7492R769
$$ 695591 762058 901113 923387 860896 808425 867684 880695 866532 799018 771526 781295
11824G81295j9800L0365L0480K8849L7277L7964l4818p9168N330J293J2959j3866
$$ 781295 761495 791860 822340 851189 888466 926430 891612 812444 817774 819067 832026 818160
11812H18160R364l6287j2488J8533L8752Q6987l0742n0476k6276j9706P670k5116
$$ 818160 827524 791237 778749 797282 836034 923021 892279 841803 815527 795821 803491 778375
11800G78375l5971N4493j754J2172J7917o411m2222L6128j4140l3268j5336J4937
$$ 778375 742404 796897 795143 807315 825232 818821 776599 812727 798587 765319 749983 764920
11788G64920J8089J9988j5802k0935m5891m2454N4303K530n1158N269K410j0839
$$ 764920 783009 802997 787195 766260 720369 677915 732218 734748 683590 688859 691269 680430
11776F80430Q952L3783j5566Q58K6906k2883m9075K8710N0974K9361K8987J7136
$$ 680430 689382 723165 707599 708457 735363 712480 663405 692115 743089 772450 801437 818573
11764H18573l7776j4894L0405o264j510l5290j0583J7538L0344M2239L26k0222
$$ 818573 780797 765903 796308 790044 788534 753244 742661 760199 790543 832782 833108 812886
11752H12886J7882j0673k4621K2150K6199J0707J7595l2245O596j3023j2296P191
$$ 812886 830768 820095 795474 817624 843823 854530 872125 839880 846476 833453 821157 828348
11740H28348J2311r875J0085j1546j2742J8118m512L6380K4157M0417K0423k0496
$$ 828348 840659 830784 840869 829323 816581 834699 830187 866567 890724 931141 951564 931068
11728I31068m0334O637L0414J30787O4847L8098j2589k4058K8456j6945k9740
$$ 931068 890734 897371 927785 1058572 1123419 1161517 1148928 1124870 1153326 1136381 1106641
11717A106641Q7484O9768j2450J3508J9688L0426J6692K6391N4484P4857K8965
$$ 1106641 1194125 1263893 1251443 1264951 1284639 1315065 1331757 1358148 1412632 1487489 1516454
11706A516454J8414J8286J9046M0026P5036R3729L3751J7826O024N8002J07337
$$ 1516454 1534868 1553154 1572200 1612226 1687262 1780991 1814742 1832568 1838592 1896594 2003931
11695B003931J39422Q7614J41654J89986J45681J02106J64434J76571J83929J70154
$$ 2003931 2143353 2230967 2372621 2562607 2708288 2810394 2974828 3151399 3335328 3505482
11685C505482K69366J93913K11343K74092L11126K82495L26859M57947M87365
$$ 3505482 3774848 3968761 4180104 4454196 4765322 5047817 5374676 5832623 6319988
11676F319988N10472O26740Q98339J159540J334200J683372K071588K477901K965759
$$ 6319988 6830460 7457200 8355539 9515079 10849279 12532651 14604239 17082140 20047899
11667B0047899L627489M363870N071951N353927N145748M309907L069383J826224
$$ 20047899 23675388 28039258 33111209 38465136 43610884 47920791 50990174 52816398
11659E2816398Q54787J59519m28369j015806j637301k352521k684508k633323
$$ 52816398 53671185 53830704 53402335 52386529 50749228 48396707 45712199 43078876
11651D3078876k140380j283292j22447J282446K766219M357777N837269P202904
$$ 43078876 40938496 39655204 39532757 40815203 43581422 47939199 53776468 60979372
11643F0979372Q526102R520944R934537R498310P910212M750466O38738l082022
$$ 60979372 69505474 79026418 88960955 98459265 106369477 111119943 111758681 108676659
11635A08676659n060477n719027o126982o835144p669702q268193q078728o929207
$$ 108676659 103616182 97897155 91770173 84935029 77265327 68997134 60918406 53989199
11627E3989199n325186l486245j690304j30887J160271K111361K634308K821543
$$ 53989199 48664013 45177768 43487464 43356577 44516848 46628209 49262517 52084060
11619E2084060K542899K132679J645569J202607M49127p26546j963356l168552
$$ 52084060 54626959 56759638 58405207 59607814 60056941 59330395 57367039 54198487
11611E4198487m227147m756393m910542m824613m547815m047066l460614k833827
$$ 54198487 49971340 45214947 40304405 35479792 30931977 26884911 23424297 20590470
11603B0590470k250165j658708j257839q51187n43699l36411j49298J54052M98199
$$ 20590470 18340305 16681597 15423758 14572571 14028872 13692461 13543163 13697215 14195414
11594A4195414P56126J055109J449904J928372K446864L167177M045114M912106
$$ 14195414 14951540 16006649 17456553 19384925 21831789 24998966 29044080 33956186
11586C3956186N568403O095993O157077N734407M852683L599508K298713J057178
$$ 33956186 39524589 45620582 51777659 57512066 62364749 65964257 68262970 69320148
11578F9320148o0877r45299j686236k417706l061609l446342l347990k674674
$$ 69320148 69259271 68313972 66627736 64210030 61148421 57702079 54354089 51679415
11570E1679415j496828J72665K300129M606292O836370Q470545R314787R167112
$$ 51679415 50182587 50355252 52655381 57261673 64098043 72568588 81883375 91050487
11562I1050487Q329511P620515P575191P682861O906353M023675p01923n642266
$$ 91050487 99379998 107000513 114575704 122258565 129164918 133188593 132486670 126844404
11554A26844404r164116j0535708j0573807j0018438r267803q309028o893042
$$ 126844404 117680288 107144580 96570773 86552335 77284532 68975504 62082462
11547F2082462n227747l519609j672982P6702J608988K827034L497721L425740
$$ 62082462 56854715 53335106 51662124 51738826 53347814 56174848 59672569 63098309
11539F3098309K690039J671912Q07008K24504j60064o55485j779213l341818n160125
$$ 63098309 65788348 67460260 68267268 68491772 68331708 67676223 65897010 62555192 57395067
11530E7395067o443910o934521o612655n842334m960999m076639l264833k604711
$$ 57395067 50951157 44016636 37403981 31561647 26600648 22524009 19259176 16654465
11522A6654465k072521j736787j455549j214637j001106p74433o28394n43349
$$ 16654465 14581944 12845157 11389608 10174971 9173865 8399432 7771038 7227689
11514G227689m78843m20554l41984l45428l39464k81045l18725k62860k05201
$$ 7227689 6748846 6328292 5986308 5640880 5301416 5020371 4701646 4438786 4233585
11505D233585k66566k36354j37712k01610j96454j62517j63625j20546n5241j35803
$$ 4233585 3967019 3730665 3592953 3391343 3194889 3032372 2868747 2748201 2692960 2557157
11495B557157j14131q6212p1517k0883j9918q6650j14942j4382j00399j13224
$$ 2557157 2443026 2356814 2285297 2264414 2244496 2157846 2042904 2028522 1928123 1814899
11485A814899m1495n8377K0799m976O37k6848r9354o5264J0276J2366r377L1803
$$ 1814899 1773404 1715027 1735826 1730850 1731487 1704639 1605285 1540021 1550297 1562663 1553286 1585089
11473A585089m0740l6641j0891q423m0051m4365o1708p532j7002k8571j3913K6238
$$ 1585089 1544349 1507708 1496817 1488394 1448343 1403978 1342270 1334738 1317736 1289165 1275252 1301490
11461A301490P616q6749p1064o727P0469j5640L1382K7722l0453M0811N6745j8138
$$ 1301490 1309106 1222357 1151293 1144566 1215035 1199395 1230777 1258499 1228046 1268857 1325602 1307464
11449A307464n8357l481K7532k3000j0240J5411K8963k1707L2092q629k7545n3440
$$ 1307464 1249107 1245626 1273158 1250158 1239918 1255329 1284292 1262585 1294677 1286048 1258503 1205063
11437A205063O370K5978m6778m6803j9054j9173l3107m696J543N923k4692n6156
$$ 1205063 1211433 1237411 1190633 1143830 1124776 1105603 1072496 1067800 1069343 1075266 1050574 994418
11425I94418k8170j2294K2018o5538n4971j3515K6457l6420J0908l3142p3164
$$ 994418 966248 953954 975972 910434 855463 841948 868405 831985 842893 809751 736587
11414G36587j3034M7079N1593o7382q548j5606K2476l6656j3831P324l4291m5257
$$ 736587 723553 770632 822225 754843 746295 730689 753165 716509 702678 710002 675711 630454
11402F30454k7195J5061r736p604K5903O8045L7613L0362n6909Q47K0341O8749
$$ 630454 603259 618320 608584 600980 626883 694928 732541 762903 705994 706841 727182 795931
11390G95931j4908M9163j5652j7537j1989q0563K0142O2185K3887l364m242L5012
$$ 795931 781023 830186 814534 796997 785008 704445 724587 786772 810659 807295 803053 838065
11378H38065m858L0014j4743j4026N1427Q7096J470l0839m7870K718J0906l087
$$ 838065 833207 863221 848478 834452 885879 972975 974445 943606 895736 898454 909360 906273
11366I06273R127p264j5582J6409j5828o102l0712p9356l3995J3953r733l5029
$$ 906273 915400 908136 892554 908963 893135 887033 856321 776965 742970 756923 747190 712161
11354G12161J9061J8977o479q1747m2950K4950K277n2760k4754k9510j2151Q79
$$ 712161 731222 750199 743720 661973 619023 643973 646250 593490 568736 539226 527075 527954
11342E27954J2508m923M403P975n2255m2623l7900q364L6617k7346l8950P201
$$ 527954 540462 535539 539942 547917 495662 453039 415139 406775 443392 416046 377096 384297
11330C84297k0868R226L7242j6571J4644j7428m9351Q133L2850J8813j5137J6543
$$ 384297 363429 372655 409897 393326 407970 390542 341191 349324 382174 400987 385850 402393
11318D02393K4731j1341R995m7339k4523J2821O809N5139J8409j0250l1532j7356
$$ 402393 427124 415783 425778 378439 353916 366737 373546 428685 447094 436844 405312 387956
11306C87956R1609J02914L7244M0278J2591J4877O2980O6533n3380l8416q9027
$$ 387956 479565 582479 619723 660001 672592 687469 750449 816982 763602 725186 636159
11295F36159o5350l0150m2049o085n5572j5720L6184K4961o034J2371k3530l2142
$$ 636159 570809 540659 498610 492525 436953 421233 457417 482378 476344 488715 465185 433043
11283D33043k2858k5992k0865J3217J5260m6111O502L8896K0221J7668q2249k7236
$$ 433043 410185 384193 363328 376545 391805 345694 352196 391092 411313 428981 346732 319496
11271C19496N0378Q3425L9783j9694N14K8466M9849O1985J5699R419O3622P2805
$$ 319496 369874 453299 493082 473388 473902 502368 552217 614202 629901 639320 702942 775747
11259G75747k5056o1800j1255p5070q942L4881J3467K4717P444K7518p59K2156
$$ 775747 750691 688891 677636 602566 593624 628505 641972 666689 674133 701651 700892 723048
11247G23048n5356l2973j5567N2783Q1866n7319p4716P994k8756n7057p6965k9912
$$ 723048 667692 634719 619152 671935 753801 696482 621766 629760 601004 543947 466982 437070
11235D37070K9703P3701J5276K6627m5333j4839K3828J6573N6668O3447M6420
$$ 437070 466773 540474 555750 582377 537044 522205 546033 562606 619274 682721 729141
11224G29141R2702K9202K6364J564K224K1362M7394j5391p404K2454J8765k6874
$$ 729141 821843 851045 877409 878973 881197 902559 949953 934562 927158 949612 968377 941503
11212I41503r9549m6422O3685N0294M6469J4814N3537R9993R0103J0412L3153
$$ 941503 841954 795532 859217 909511 955980 970794 1024331 1124324 1214427 1224839 1257992
11201A257992l6000m0601o0372n3586K1497R895K9832j3919n672n5496l7753j1091
$$ 1257992 1221992 1181391 1121019 1067433 1088930 1098825 1128657 1114738 1109066 1053570 1015817 1004726
11189A004726J4655L6886P1708O6031N9737J15278J94201J82197J55305J41337
$$ 1004726 1019381 1056267 1127975 1194006 1253743 1369021 1563222 1745419 1900724 2042061
11179B042061J5059r6497j54249j55433r9819q0564q9268j24933n6675p8727j06102
$$ 2042061 2057120 1960623 1806374 1650941 1551122 1470558 1381290 1256357 1199682 1120955 1014853
11168A014853r3875R528j4892j14363n1799q072k0488J0941K4535k8612J1819
$$ 1014853 920978 930506 915614 801251 749452 741380 720892 731833 756368 727756 739575
11157G39575n8074j3036o5474n7272n569K9724L3705K9952k3202J0727J6950M8535
$$ 739575 681501 668465 602991 545719 540150 569874 603579 633531 610329 621056 638006 686541
11145F86541j9703K1854Q0106J3892k9294L7487K1044J8424k0971L261K8844m6944
$$ 686541 666838 688692 768798 782690 753396 790883 811927 830351 809380 812641 841485 794541
11133G94541n0351l366j7009M6657R9157Q0148J04693R0499O404l8688j9641M7595
$$ 794541 744190 740824 723815 770472 869629 949777 1054470 1144969 1151373 1112685 1093044 1140639
11121A140639Q933J5550O734j8617m4530l1776l0386K2272j3940j00077q4387
$$ 1140639 1149572 1165122 1171856 1153239 1108709 1076933 1046547 1068819 1054879 954802 870415
11110H70415m7341l073k8667l1251k0507j2835n3797K811L6613m470p6436M1377
$$ 870415 823074 820001 791334 760083 739576 726741 672944 675755 712368 707898 631462 672839
11098F72839O0687m60k647J8688N1710j467m8283J0560R933q3259n5270m4152
$$ 672839 733526 733066 730419 749107 800817 799350 751067 761627 771560 688301 633031 588879
11086E88879l6805l036K6836l3422o6605k0671M296j7895R053J2122O789L3184
$$ 588879 552074 549038 575874 542452 475847 455176 459472 441577 450630 462752 469541 502725
11074E02725K7217K9337j5208j05963m7118j6576J2145K4200N8955J9673L2737
$$ 502725 529942 559279 544071 438108 390990 374414 386559 410759 469714 489387 522124
11063E22124J2343j9780k2363n686l9920K8093K2p958K584P610J4618j386j0688
$$ 522124 534467 514687 492324 486638 446718 474811 474833 466875 469459 477069 491687 490301 479613
11050D79613L163L7335J7443j7370l9680K0063M8730J0839L377j8159M966J6033
$$ 479613 482776 520111 537554 520184 480504 500567 549297 560136 563513 545354 550320 566353
11038E66353k2614l5986J7518J5533O1742L374M9645O906M470n8737o0165q388
$$ 566353 543739 507753 525271 540804 602546 605920 655565 662471 666941 608204 548039 539651
11026E39651K7253L2467L5252M2081o0583l594L5310N1776J6640m6506p612J1921
$$ 539651 566904 599371 634623 676704 616121 612527 647837 699613 716253 669747 662135 674056
11014F74056P215j2578L6415L0298M0007L652r5791j2256j4448J1603l9441n0298
$$ 674056 681271 668693 705108 735406 775413 779065 683274 671018 656570 668173 628732 578434
11002E78434m5909J9730Q1156L906R220N5515L479J2398O8475N9767k0785k0404
$$ 578434 532525 552255 633411 637317 646537 702052 705531 717929 786404 846171 825386 804982
10990H04982q605n3766L0351P374L2068K0286N746p000N7001O1070K1412o6954
$$ 804982 796377 742611 772962 780336 812404 832690 838436 831436 888437 949507 970919 903965
10978I03965k7062n002n81N0713L211J4819k4028n216K3040l3499J1369R1846
$$ 903965 876903 871901 871320 922033 925244 940063 916035 910819 933859 900360 911729 1003575
10966A003575R0388J3016R404n847K9966k0570m2748K3361L4252N6456N4324N176
$$ 1003575 1093963 1106979 1116383 1110536 1140502 1119932 1077184 1100545 1134797 1191253 1245577 1250753
10954A250753J7210q254M1747P0136J29803J05724Q921R3479J37792J03596J63163
$$ 1250753 1267963 1259709 1301456 1371592 1501395 1607119 1616040 1709519 1847311 1950907 2114070
10943B114070J73144J76423L11429L87218M46055L74671L95888M78216M74650
$$ 2114070 2287214 2463637 2775066 3162284 3608339 3983010 4378898 4857114 5331764
10934E331764M05341L45841L45365L31840J94041J4792k60574m54433o15106o21991
$$ 5331764 5737105 6082946 6428311 6760151 6954192 6968984 6708410 6253977 5638871 5016880
10924E016880n08786l85237k52835k89406j82676j38209p8837k4476k2248n633
$$ 5016880 4508094 4122857 3870022 3580616 3397940 3259731 3180894 3156418 3134170 3128537
10914C128537K8896J26746J17201N4092J58747K04919K25612J93818K45155L45533
$$ 3128537 3157433 3284179 3401380 3455472 3614219 3819138 4044750 4238568 4483723 4829256
10904D829256M04971M03633M99019N83150O62717Q87319J115982J375358J782649
$$ 4829256 5234227 5637860 6136879 6720029 7382746 8270065 9386047 10761405 12544054
10895A2544054K342503K981154L666405M603807N692650O993896Q335268R157537
$$ 12544054 14886557 17867711 21534116 26137923 31830573 38824469 47159737 56317274
10887E6317274Q711453O466260K424456k173695n762219p590460p905040p440353
$$ 56317274 65028727 71494987 73919443 71745748 65983529 58393069 50488029 43047676
10879D3047676o648671n724659m694959l702146k930212k339494j806339j377623
$$ 43047676 36399005 30674346 25979387 22277241 19347029 17007535 15201196 13823573
10871A3823573j067047p03851m72562k21918r2778O2734K58305L90948N66552
$$ 13823573 12756526 12052675 11580113 11358195 11265417 11328151 11586456 11977404 12543956
10862A2543956O40142Q41020J029983J366165J774432K274067K912231L661536
$$ 12543956 13184098 14025118 15055101 16421266 18195698 20469765 23381996 27043532
10854B7043532M451548N014569N191956M877895L997344L044233K468134K322457
$$ 27043532 31495080 36509649 41701605 46579500 50576844 53621077 56089211 58411668
10846E8411668K439254K508415K427818J985257J599358J124990O37431o7033
$$ 58411668 60850922 63359337 65787155 67772412 69371770 70496760 71134191 71067158
10838G1067158p98907j648745k490042l013236l013728k571852j924855j397903
$$ 71067158 70268251 68619506 66129464 63116228 60102500 57530648 55605793 54207890
10830E4207890j059503j031566j024020j194626j416066j737785k141655k531339
$$ 54207890 53148387 52116821 51092801 49898175 48482109 46744324 44602669 42071330
10822D2071330k836485l003668k896084k586895k097951j434142o14768J82156
$$ 42071330 39234845 36231177 33335093 30748198 28650247 27216105 26601337 26783493
10814B6783493J045703J914345K934153M024560N180698O207205O890617O981727
$$ 26783493 27829196 29743541 32677694 36702254 41882952 48090157 54980774 61962501
10806F1962501O115206M003562Q78029k432708m729867n446489m697925l007584
$$ 61962501 68077707 72081269 72959298 70526590 65796723 60350234 55652309 52644725
10798E2644725r33805J200864L498357N771066P762952Q721660P862527M913383
$$ 52644725 51710920 52911784 56410141 62181207 69944159 78665819 86528346 91441729
10790I1441729N23637l774593o813370q454932q958496q838878q034115o703409
$$ 91441729 91965366 88190773 81377403 72922471 63963975 55125097 47090982 40387573
10782D0387573n206068l762430k471427j308476l38642O08850J479322K220559
$$ 40387573 35181505 31419075 28947648 27639172 27300530 27909380 29388702 31609261
10774C1609261K736521K955892K800948K247024J393581L91793k78341l68069
$$ 31609261 34345782 37301674 40102622 42349646 43743227 44135020 43856679 43488610
10766D3488610L00985J307645K419377L258626L516762L155417K618581K102451
$$ 43488610 43789595 45097240 47516617 50775243 54292005 57447422 60066003 62168454
10758F2168454J296705j15516k051587m053808n282924n225472m261587k948047
$$ 62168454 63465159 63349643 61298056 57244248 51961324 46735852 42474265 39526218
10750C9526218j713117n89016L20340J087074J276804R29344K25573p48154j635027
$$ 39526218 37813101 37224085 37544425 38631499 39908303 40837647 41063220 40315066 38680039
10741C8680039k237560k599564k779088k900619k917373k721353k434700k113195
$$ 38680039 36442479 33842915 31063827 28163208 25245835 22524482 20089782 17976587
10733A7976587j800654j359710j029936p59175o14528m00235j44511P8858K60909
$$ 17976587 16175933 14816223 13786287 13027112 12412584 12012349 11867838 11946696 12207605
10724A2207605M28963O92563R98122J364713J846895K455293L186076M096015
$$ 12207605 12636568 13329131 14327253 15691966 17538861 19994154 23180230 27276245
10716B7276245N121020O209322P232651P976187P875294O185620K713847j715606
$$ 27276245 32397265 38606587 45839238 53815425 61690719 67876339 70590186 68874580
10708F8874580n625467p889662q444632p821398o702094n634971m584051l646083
$$ 68874580 63249113 55359451 46914819 39093421 32391327 26756356 22172305 18526222
10700A8526222k898049k283887j778188j397422j093729q81908o81406n13742
$$ 18526222 15628173 13344286 11566098 10168676 9074947 8193039 7511633 6997891
10692F997891m29076l53025k73976j73827r3091l0197o0222m9929j05454j49548
$$ 6997891 6568815 6215790 5941814 5767987 5674896 5644699 5584477 5534548 5429094 5279546
10682E279546n3367m0892j38207j78474q7365l8982J9371N1647J61497K62776
$$ 5279546 5226179 5185287 5047080 4868606 4781241 4742259 4761630 4813277 4974774 5237550
10672E237550L58309M29286L95445K96613J44745J9761q0319j79462k37498k57721
$$ 5237550 5595859 6025145 6420590 6717203 6861948 6881709 6801390 6621928 6384430 6126709
10662F126709j51913j39296j03220j9634L9685M82q4622L3Q4276O6777O854K8192
$$ 6126709 5974796 5835500 5732280 5712646 5752331 5752813 5668191 5668224 5752500 5819277 5826131 5854323
10650E854323J25298J81405L44343M99802O89260R89120J323781J620311J860701
$$ 5854323 5979621 6161026 6505369 7005171 7694431 8683551 10007332 11627643 13488344
10641A3488344K047089J864715J245545M31495n23633j362649j826969j962304
$$ 13488344 15535433 17400148 18645693 19077188 18553555 17190906 15363937 13401633
10633A3401633j833680j507153j209846q92357o59684n48868l93479l76170k88683
$$ 13401633 11567953 10060800 8850954 7958597 7298913 6750045 6356566 5980396 5691713
10624E691713k24697j17462j56837j37950j12032o7348M9716J17228L1967R4798
$$ 5691713 5467016 5349554 5192717 5054767 4942735 4875387 4925103 5042331 5074298 5169096
10614E169096J78116K73878L51623M62328N24702P31124R31256J207632J570729
$$ 5169096 5347212 5621090 5972713 6435041 6959743 7690867 8622123 9829755 11400484
10605A1400484K100368K706456L280802L781473L956505L561979K602225J165969
$$ 11400484 13500852 16207308 19488110 23269583 27226088 30788067 33390292 34556261
10597C4556261k55063j284630j811321j779534j523713j038202k76274M88889
$$ 34556261 34301198 33016568 31205247 29425713 27902000 26863798 26587524 27076413
10589B7076413J133756J386220J167562O73431J17782m06132q02811j141301j219698
$$ 27076413 28210169 29596389 30763951 31437382 31555164 31149032 30346221 29204920 27985222
10580B7985222j455969j674199j881177k055096k005361j879528j624612j328638
$$ 27985222 26529253 24855054 22973877 20918781 18913420 17033892 15409280 14080642
10572A4080642r46621n60685j82692J81205M94797P57436Q99743P68626N38517
$$ 14080642 13134021 12573336 12390644 12571849 13066646 13824082 14723825 15492451 16030968
10563A6030968M05279M16396N41164P35109Q96627J039402J276052J579114J984073
$$ 16030968 16436247 16852643 17393807 18128916 19025543 20064945 21340997 22920111 24904184
10554B4904184K502251K887915K945379K543581K135026K120828K642016L495000
$$ 24904184 27406435 30294350 33239729 35783310 37918336 40039164 42681180 46176180
10546D6176180M165063M317273L760484K260366L28953j561854k928320l703365
$$ 46176180 50341243 54658516 58419000 60679366 61008319 59446465 56518145 52814780
10538E2814780m069982m075326m066811m069545l751536l219346k569868k039762
$$ 52814780 48744798 44669472 40602661 36533116 32781580 29562234 26992366 24952604
10530B4952604j562222j134218r27052q24838p04258n76033n81761n28227n74592
$$ 24952604 23390382 22256164 21329112 20504274 19800016 19223983 18642222 18113995 17539403
10521A7539403n41310n62325n22727l56268k44583o495K68919O51305J066457
$$ 17539403 16998093 16435768 15913041 15556773 15312190 15305695 15574614 16225919 17292376
10512A7292376J570733K153446K735733L068213K954971K356786J396491M24741
$$ 17292376 18863109 21016555 23752288 26820501 29775472 32132258 33528749 33953490
10504C3953490k29136m52190j3178P73783J427740J963627K294207K123473J670366
$$ 33953490 33724354 33272164 33258986 34032769 35460509 37424136 39718343 41841816 43512182
10495D3512182P01688o78001k023673l003288l405083l091824k455026j735937
$$ 43512182 44213870 43535869 41512196 38508908 35103825 32012001 29556975 27821038
10487B7821038r47010k85331J57045K32815N4141k87392o91327j204657j574293
$$ 27821038 26874028 26588697 26745742 26978557 27032698 26745306 26053979 24849322 23275029
10478B3275029j740397j643782j523750j211528r56560p43078m67442k70569o3109
$$ 23275029 21534632 19890850 18367100 17155572 16199012 15455934 14988492 14717923 14654814
10469A4654814N8036J54115K61492M40853M77378M32330M07403M79755O20796
$$ 14654814 14712850 14866965 15128457 15569310 16046688 16479018 16886421 17366176 17986972
10460A7986972P36650R73811J170898J405363J631986J821482K138048K568254
$$ 17986972 18723622 19697433 20868331 22273694 23905680 25727162 27865210 30433464
10452C0433464L005664L460826L597198L435470K853409J942775Q98213J09635
$$ 30433464 33439128 36899954 40497152 43932622 46786031 48728806 49627019 49736654
10444D9736654j95317p6537M01736J130549J925978K688137L433566M112600N000184
$$ 49736654 49541337 49464800 49866536 50997085 52923063 55611200 59044766 63157366 68157550
10435F8157550N785142O550895P271200Q178069R003681R615540J0091170J0305269
$$ 68157550 73942692 80493587 87764787 95942856 104946537 114562077 124653247 134958516
10427A34958516J0098979R278703P835176N750596L093116J06543k940980n600113
$$ 134958516 145057495 154336198 162171374 167921970 171015086 171121629 168180649 162580536
10419A62580536p818058r444385j0247085j0528481j0389386r904296r181283
$$ 162580536 154762478 145318093 135071008 124542527 114153141 104248845 95067562
10412I5067562q380973p559624o750983o060949n485370m919883m407371l983240
$$ 95067562 86686589 79126965 72375982 66315033 60829663 55909780 51502409 47519169
10404D7519169l709772l364835k999860k743420k447138k203161j938563j754430
$$ 47519169 43809397 40444562 37444702 34701282 32254144 30050983 28112420 26357990
10396B6357990j620834j381715j305021j173345j026165r56683r93787r04035
$$ 26357990 24737156 23355441 22050420 20877075 19850910 18894227 17900440 16996405
10388A6996405p96478p73525q29908p42940o36921n87744o55621o17650n26653
$$ 16996405 16199927 15426402 14596494 13853554 13216633 12628889 11973268 11355618 10828965
10379A0828965m85078l24342l52425l36139k88417k90245l24403k42905j98495
$$ 10828965 10343887 10019545 9667120 9330981 9042564 8752319 8427916 8185011 7986516
10370G986516k64041k42454k75482k90924k11598k23278j74685q9735j72091k04603
$$ 7986516 7722475 7480021 7204539 6913615 6702017 6478739 6304054 6214319 6042228 5837625
10360E837625j69793k19589j69613j83746r4850r6795j52639j44076j14391p6240
$$ 5837625 5667832 5448243 5278630 5094884 5000034 4903239 4750600 4606524 4492133 4415893
10350D415893j37454j31135j40317r9408o3963k1767L42o0066p1176m6865m3178
$$ 4415893 4278439 4147304 4006987 3907579 3843616 3821849 3822191 3762125 3690949 3644084 3600906
10339C600906p9033j05571j01076k9761q0529m7670o7263m1638l3599l6387k1914
$$ 3600906 3521873 3416302 3315226 3285465 3204936 3157266 3090003 3048365 3014766 2978379 2956465
10328B956465J2842n9283Q585R0120M5683M1091n651j6779q5945j16317j19480
$$ 2956465 2969307 2910024 2918609 3008729 3054412 3095503 3089852 3073073 2987128 2870811 2751331
10317B751331q0402j63198j00371p3479j30182o7359m1255J3254j5987j5135o5583
$$ 2751331 2670929 2507731 2407360 2333881 2203699 2136340 2095085 2108339 2092352 2077217 2011634
10306B011634o8469k5172M295j4119m1045j6300k2567r2020J1685J8098o21O3405
$$ 2011634 1943165 1917993 1922288 1908169 1867124 1850824 1828257 1736237 1747922 1766020 1765399 1828804
10294A828804L0373K5947Q3086K9784k4811K7938j6699r2609m9832k6447k6336
$$ 1828804 1859177 1885124 1968210 1997994 1973183 2001121 1984422 1891813 1841981 1815534 1789198
10283A789198o929L2840M0870k837o5134j21581r4812l8525n5532l7604l2652
$$ 1789198 1782269 1815109 1855979 1853142 1788008 1666427 1571615 1533090 1477558 1439954 1407302
10272A407302K3621N514l7966r655m3388n4777j5629o827n4651j2021J0643J350
$$ 1407302 1430923 1436437 1398471 1388816 1345428 1290651 1275022 1268195 1213544 1201523 1212166 1213516
10260A213516k5255l2638n3947J4536R336M1698K2174K980k8898l239k4501j7028
$$ 1213516 1188261 1155623 1101676 1116212 1125548 1167246 1189420 1192400 1163502 1160263 1135762 1118734
10248A118734O050N2012J1870M5499L1199o727N5607K2298m1455m2628R154k521
$$ 1118734 1124784 1176796 1188666 1234165 1265364 1258637 1314244 1336542 1295087 1252459 1261613 1259092
10236A259092j4696j471m6833m1424O43l7576l8884K0116k7182m3848J7122j3152
$$ 1259092 1244396 1242925 1196092 1154668 1155311 1117735 1078851 1098967 1071785 1027937 1045059 1031907
10224A031907M0468K5052k8472n6646N616P371K2375J0947l8399L498M2270m1527
$$ 1031907 1072375 1097427 1068955 1012309 1017925 1025296 1047671 1058618 1020219 1023717 1065987 1024460
10212A024460m4935j4313j3778K407J0361p272q219J4807k4263K7401m7791j2328
$$ 1024460 979525 965212 951434 953841 964202 956930 948711 963518 939255 966656 918865 906537
10200I06537N5704K6358O7601p463j5665j9816k7645O7962K5614k8513o7488k0479
$$ 906537 962241 988599 1056200 1048737 1033072 1013256 985611 1053573 1079187 1050674 983186 962707
10188I62707L8642N4759J1328j4265J4265l0999J964l6664j6698N3847L7013P0046
$$ 962707 1001349 1056108 1067436 1053171 1067436 1036437 1038401 1001737 985039 1038886 1075899 1145945
10176A145945m612J0903K1964m1889k6380J6436J8335m5346q758K0904K0357R230
$$ 1145945 1141333 1152236 1174200 1132311 1105931 1122367 1140702 1095356 1086598 1107502 1127859 1137089
10164A137089j3096L8747L2353n069q2112l8105q7038Q747L845n8899K4937P8683
$$ 1137089 1123993 1162740 1195093 1190024 1107912 1069807 982769 991516 995361 936462 961399 1040082
10152A040082m7525k7036r871m9942N4301M0565M5068O0165l2562J6782O5269
$$ 1040082 992557 965521 955650 905708 960009 1000574 1045642 1105807 1073245 1090027 1155296
10141A155296j2754m5368p109L1279l3469n411J6908O7773Q6320R2196M0474j2327
$$ 1155296 1142542 1097174 1090065 1121344 1087875 1082464 1099372 1167145 1253465 1345661 1386135 1373808
10129A373808j2420k0182j44913j09247q9955m0723n9333p5642p5534l0618j2860
$$ 1373808 1361388 1341206 1196293 1087046 997091 956368 897035 821393 745859 715241 702381
10118G02381L4205K7395K2664j1722L1895N8346J4102J07m7456j3418J3997Q2323
$$ 702381 736586 763981 786645 774923 806818 865164 879266 879373 831917 818499 832496 914819
10106I14819J11209P2255L1686K7872R6320J76373K44111L45808N04070O85882
$$ 914819 1026028 1098283 1129969 1157841 1254161 1430534 1674645 2020453 2524523 3210405
10096C210405J027370J238419Q41242r1856q88401j050830p77163n03499k86721
$$ 3210405 4237775 5476194 6317436 6225580 5337179 4286349 3509186 3005687 2718966
10087B718966j32355j40022j92791j97473j88170j79404j56932r6908q4226p7949
$$ 2718966 2586611 2446589 2253798 2056325 1868155 1688751 1531819 1434911 1350685 1272736
10077A272736r6221j39054q7330m6829j10J091r2281o5213k2613j5016N96L3219
$$ 1272736 1176515 1037461 950131 903302 903192 904283 812002 746789 724176 709160 709756 742975
10065G42975q156L8630K378J5135k6117Q100k0133l3679N2039L4297k9278R639
$$ 742975 734819 773449 775827 790962 764845 772945 752812 719133 771172 805469 776191 785830
10053G85830M2667J9787P6183J25418M8397J15303Q7093J05650R2981J4694q4254
$$ 785830 828497 848284 924467 1049885 1098282 1213585 1300678 1406328 1499309 1514003 1429749
10042A429749q3982q1846r4235j17278j19622o7202j1388l2427o2367l9304p2841
$$ 1429749 1345767 1263921 1169686 1052408 932786 865584 854196 821769 759402 720098 647257
10031F47257L683m9170j2515J1315L909L1629r037j2546L3303P123k6747l7905
$$ 647257 650940 601770 589255 600570 604479 636108 627071 614525 647828 654951 628204 590299
10019E90299j8050l263J3431J6855J4580M0273O2436O0661N4770n28P273M224
$$ 590299 572249 568986 582417 599272 613852 654125 716561 777222 831992 831464 838737 842961
10007H42961K1346p0319J994P8669J03745O6421j0729n4077j13021k2780j4301
$$ 842961 864307 793988 795982 874651 978396 1044817 1034088 980011 866990 844210 829909
9996H29909o42p2003j06488l2589k2386J7751m438n408p445k2944k942K9612L9578
$$ 829909 829267 757264 650776 618187 595801 613552 609114 603706 596261 573317 570375 599987 639565
9983F39565p394l7024M8056L8445j2431m2513j6922L5234K4072L1127N4622L2542
$$ 639565 632171 595147 643203 681648 669217 626704 609782 645016 669088 700215 754837 787379
9971G87379K7818P4663P2100O2093J3065N1267k2157M141l5822Q080q303N071
$$ 787379 815197 889860 961960 1024053 1037118 1088385 1066228 1070369 1034547 1042627 1034324 1039395
9959A039395K4466k3113k2791p3190l8427o3090p7377p1594l1650M6900L1387
$$ 1039395 1063861 1040748 1017957 944767 906340 843250 765873 694279 662629 709529 740916
9948G40916j2687k0015J7478j0241p8070p850P9519L1245L7031l3158k0658K1372
$$ 740916 728229 708214 725692 715451 637381 629531 709050 740295 777326 744168 723510 744882
9936G44882o1380N0478P6574j357k197K8289P5578K6804M7452L4470O9898R6744
$$ 744882 683502 733980 810554 809197 807000 835289 910867 937671 985123 1019593 1089491 1186235
9924A186235J22416J11323P379n514R567L2733l2999o0723k1549l2131n2095j02908
$$ 1186235 1308651 1419974 1427353 1421839 1431406 1464139 1431140 1370417 1348868 1316737 1264642 1161734
9912A161734j34546j12787k3451n7290o3756J5103M6988J469m2836l6172j7619
$$ 1161734 1027188 914401 890950 833660 769904 785007 831995 833464 790628 754456 736837
9901G36837J0095M3409j3530m8915j8000N3218Q5074J5973M7041L9935L8963O4534
$$ 736837 746932 790341 776811 727896 709896 763114 848188 864161 911202 951137 990100 1054634
9889A054634O3040j3319n4904q100J3851Q0027O1422N0881K6368n2305m2789J7290
$$ 1054634 1117674 1104355 1049451 1041351 1055202 1135229 1196651 1247532 1273900 1221595 1178806 1196096
9877A196096l0658l2442M2980R8124P4885j216p7339n7198r8571o1377r9761q2756
$$ 1196096 1165438 1132996 1175976 1274100 1348985 1347769 1270430 1213232 1114661 1053284 953523 870767
9865H70767l2086o6091j2182J8362n80j3821L9559L9241L05L6704J38098J9665
$$ 870767 838681 772590 760408 778770 778190 764369 803928 843169 843474 880178 1018276 1037941
9853A037941j7755l3585j0833N0626L6275O205k9516j2685J6321K2062J0305R2676
$$ 1037941 1020186 986601 975768 1026394 1062669 1068874 1039358 1026673 1042994 1065056 1075361 1168037
9841A168037J6350j8838r793K6433L2518n3433k0464j846q368k908k789P1899
$$ 1168037 1184387 1165549 1155756 1182189 1214707 1161274 1140810 1138964 1130596 1127688 1124899 1196798
9829A196798k798n5895p923N2638j1756P1281L752l4737l0035j997K6853J061
$$ 1196798 1194000 1138105 1130182 1182820 1171064 1242345 1246097 1211360 1181325 1179328 1206181 1207242
9817A207242P156J8787O5753M6379j672m3245k6460O0669K6532O767N5015P7663
$$ 1207242 1214398 1233185 1298938 1345317 1343645 1300400 1273940 1334609 1361141 1367908 1422923 1500586
9805A500586K910J8339N0776M1742O263m7771Q420N5222K6958L1640r632r418
$$ 1500586 1503496 1521835 1572611 1614353 1620616 1572845 1581265 1636487 1663445 1695085 1685453 1676035
9793A676035M124K7191J6412N4677N1799P0146N7991N1650L7693M9001O0212J10880
$$ 1676035 1680159 1707350 1723762 1778439 1830238 1900384 1958375 2010025 2047718 2096719 2156931 2267811
9781B267811K03061K57169L09802K33703K15462L65372M79286O28189Q41003J095727
$$ 2267811 2470872 2728041 3037843 3271546 3487008 3852380 4331666 4959855 5800858 6896585
9771F896585J501760J978245K445002K543176J966314N81627p30683j154353q25595
$$ 6896585 8398345 10376590 12821592 15364768 17331082 17912709 17182026 16027673 15202078
9762A5202078l22352Q8120M87495R18022J511770J757161J376092M3809j769593
$$ 15202078 14879726 14967846 15455341 16373363 17885133 19642294 21018386 21062195 19292602
9753A9292602k696549k659266k087894j554762j082187o67591m27757k60024j33068
$$ 19292602 16596053 13936787 11848893 10294131 9211944 8544353 8116596 7856572 7723504
9744G723504J8729J28005K01738K48479M40157N74683O71790Q77684J122405J448752
$$ 7723504 7742233 7870238 8071976 8320455 8760612 9335295 10007085 10884769 12007174 13455926
9734A3455926J823837K335793K902529L560647M170366M698014N123621N484341
$$ 13455926 15279763 17615556 20518085 24078732 28249098 32947112 38070733 43555074
9726D3555074N272781M069027K289245J031036P05524J300820J953875K522694
$$ 43555074 48827855 52896882 55186127 56217163 56922687 58223507 60177382 62700076
9718F2700076K766788L195925L575698L539874K921223J414576j914428o392123
$$ 62700076 65466864 68662789 72238487 75778361 78699584 80114160 78199732 71807609
9710G1807609r469530r786683q354694o528349m961937l670252k599471j790198
$$ 71807609 62338079 52551396 44196702 37668353 32706416 29036164 26436693 24646495
9702B4646495j156137n69859r1581K70555N74996Q80460J140599J549825K101316
$$ 24646495 23490358 22920499 22828918 23099473 23674469 24554929 25695528 27245353 29346669
9693B9346669K587333K775088K663162K747492L407415M414113N481730N880680
$$ 29346669 31934002 34709090 37372252 40119744 43527159 47941272 53423002 59303682
9685E9303682N440229N359045O104772O853228O917835O016208N013632M902901
$$ 59303682 64743911 70102956 76207728 83060956 89978791 95994999 101008631 105911532
9677A05911532N954060P817355R428548R453842Q100195N331581k62524q323333
$$ 105911532 111865592 119682947 129111495 138565337 146665532 151997113 151734589 143411256
9669A43411256j4731306j7452609j7456954j5573463j2682943j0015508p766022
$$ 143411256 128679950 111227341 93770387 78196924 65513981 55498473 47732451
9662D7732451n916943m459694l362679k448388j898449j311886p50033k74933
$$ 47732451 41815508 37355814 33993135 31544747 29646298 28334412 27584379 27309446
9654B7309446J25328K76013M21441O27000J074213J755062K458840L179943L510194
$$ 27309446 27434774 27710787 28132228 28759228 29833441 31588503 34047343 37227286 40737480
9645D0737480L206627L005507L614170N279856P559934R990585J1729510J1841900
$$ 40737480 43944107 46949614 50563784 55843640 63403574 73394159 85123669 96965569
9637I6965569R914125O610150L670368K125543J608050O33602j464697l720201
$$ 96965569 106879694 113489844 117160212 119285755 120893805 121527407 120062710 116342509
9629A16342509n073994n964179p129646q749328j0338390j1147246j0599136r262967
$$ 116342509 111268515 105304336 98174690 89425362 79086972 67939726 57340590 48077623
9621D8077623p663543o101459m793702l615286k729564k027653j530962j109788
$$ 48077623 40414080 34312621 29518919 25903633 23174069 21146416 19615454 18505666
9613A8505666p85799m98625k73620K4504L57032P43116J215245J760017K448975
$$ 18505666 17719867 17221242 16947622 16972126 17329158 18072274 19287519 21047536 23496511
9604B3496511L043475L577263L830286L911707M259256M664430M510677L204699
$$ 23496511 26539986 30117249 33947535 37859242 42118498 46782928 51293605 54498304
9596E4498304J068140n38304j017976o61169K65582J275801J558160R62418o220
$$ 54498304 55566444 55028140 54010164 53348995 53614577 54890378 56448538 57410956 57404736
9587E7404736n42232n96862n99952m83750k06529L0615J84033N93389J236223
$$ 57404736 56862504 56265642 55665690 55181940 54975411 55006026 55190059 55783448 57019671
9578E7019671J435481K50653k159803m048593m594225m069564l589463l499798
$$ 57019671 58455152 58705805 56546002 52497409 47903184 43833620 40244157 36744359
9570C6744359l802403l967532l739866l033906k221064j573562j107339o76461
$$ 36744359 32941956 28974424 25234558 22200652 19979588 18406026 17298687 16622226
9562A6622226l80810o6224K11469M54013P05739J068703J534805K122792K770480
$$ 16622226 16241416 16175192 16386661 16840674 17546413 18615116 20149921 22272713 25043193
9553B5043193L677096M928448O592083Q838408J1508646J3879009J4685651J3434274
$$ 25043193 28720289 33648737 40240820 49079228 60587874 74466883 89152534 102586808
9545A02586808J0656792P283865L194323r21935m076088o214297p074228o182895
$$ 102586808 113243600 120527465 123721788 122799853 118723765 112509468 105435240 99252345
9537I9252345l508866l37921J412850P94721k297291o512372r433183j0193438
$$ 99252345 95743479 95405558 96818408 97613129 95315838 88803466 79370283 69176845
9529F9176845r360848p994125o461164n042907l990645l230774k704121k190167
$$ 69176845 59815997 51821872 45360708 40317801 36327156 33096382 30392261 28202094
9521B8202094j579754j081793o77977l11858J18857N75934J081777J620144K344244
$$ 28202094 26622340 25540547 24862570 24550712 24669569 25245503 26327280 27947424 30291668
9512C0291668L227630M448770N840859P178461Q087733Q684962R317728J0072444
$$ 30291668 33519298 37968068 43808927 50987388 59075121 67760083 77077811 87150255
9504H7150255J1031233J1357965R550396O969788N745760N503777L496677j213920
$$ 87150255 98181488 109539453 119089849 126059637 131805397 137309174 140805851 139591931
9496A39591931o190991q494788q200917p698398q117551q840191q924011q235016
$$ 139591931 133400940 124906152 116705235 109006837 100889286 92049095 83125084 74890068
9488G4890068p032031n770885m807745m401974m431809m532278m383752l953066
$$ 74890068 67858037 62087152 57279407 52877433 48445624 43913346 39529594 35576528
9480C5576528l187737k528269k208113k049993j917198j654893j211453p00775
$$ 35576528 32388791 29860522 27652409 25602416 23685218 22030325 20818872 20118097
9472B0118097j76783L03739O61300J146774J696452K244406K993387M129733N572203
$$ 20118097 19941314 20245053 20906353 22053127 23749579 25993985 28987372 33117105 38689308
9463C8689308P042996P894770P420558O165693M942377L602286J984405m41525
$$ 38689308 45732304 53627074 61047632 67213325 72155702 75757988 77742393 77300868
9455G7300868l789204n876741n683752m401117k912598j164049P29334K141213
$$ 77300868 73511664 67634923 61951171 57550054 54637456 53473407 54202741 56343954
9447E6343954K017302k27572l181536m858853m981827m244193l453639k951411
$$ 56343954 58361256 58133684 54952148 50093295 45111468 40867275 37413636 34462225
9439C4462225k968076l185049l222335k891524k584803k142452j732057j400263
$$ 34462225 31494149 28309100 25086765 22195241 19610438 17467986 15735929 14335666
9431A4335666j149290q16535o12889l63127j79537K666K40099N00054Q42538J198966
$$ 14335666 13186376 12369841 11756952 11393825 11214288 11216954 11457053 11957107 12799645 13998611
9421A3998611J752323K512701L193400L722226L526475K048917k20351k048937
$$ 13998611 15750934 18263635 21457035 25179261 28705736 30754653 30534302 28485365
9413B8485365k789615k564567j941975j384308j012827n03070L0395M90963O65048
$$ 28485365 25695750 23131183 21189208 19804900 18792073 18289003 18319398 18810361 19475409
9404A9475409J80304r72503k003786k395271k080786j598586j218532q86057o25162
$$ 19475409 19655713 18683210 16679424 14284153 12203367 10604781 9386249 8500192 7875030
9395G875030m68026m17513l33479k35767r1102o5852k2230j087J6672J05916J94858
$$ 7875030 7407004 6989491 6656012 6420245 6329143 6263291 6241061 6239974 6256646 6362562 6557420
9384F557420J81528K97420L94832L38868L01612K14870J54713O6478L6201R5864
$$ 6557420 6738948 7036368 7431200 7770068 8071680 8286550 8441263 8507741 8543942 8639806
9374H639806L9995J05644K46862L40516M85551O68432R28595J184123J412581
$$ 8639806 8679801 8785445 9032307 9372823 9858374 10526806 11455401 12639524 14052105
9365A4052105J683188K083565K676068L429881M448361N527510O667755P899696
$$ 14052105 15735293 17818858 20494926 23924807 28373168 33900678 40568433 48468129
9357D8468129Q825484Q930618P277935L253083j877267n922938p677483p621463
$$ 48468129 57293613 66224231 73502166 76755249 74877982 68955044 61277561 53656098
9349E3656098o740998n674657m383536l237750k199055j255922m29809L24078
$$ 53656098 46915100 41240443 36856907 33619157 31420102 30164180 29734371 30058449
9341C0058449J126529J950909K780597L855968N055194O564414Q264414R929263
$$ 30058449 31184978 33135887 35916484 39772452 44827646 51392060 59656474 69585737
9333F9585737J1588285J2669266J2063554R187371M318959o52488l963231n285219
$$ 69585737 81174022 93843288 105906842 115094213 119413172 118760684 114797453 109512234
9325A09512234n639928o025925o410471o576279o329605n631931m778398l870820
$$ 109512234 103872306 97846381 91435910 84859631 78530026 72898095 68119697 64248877
9317F4248877k729790j326593K32904J726946L120048M199835M735882M841632
$$ 64248877 61519087 60192494 60425398 62152344 65272392 69472227 74208109 79049741
9309G9049741M811388M882697N130982N050285M615418L937346L538561L966398
$$ 79049741 83861129 88743826 93874808 98925093 103540511 107477857 111016418 114982816
9301A14982816N585957Q563709J3013881J8772364K5328379L0603205L1652814
$$ 114982816 120568773 129132482 142146363 160918727 186247106 216850311 248503125
9294B48503125K6050609J3724560j612715j4256988k1253432k3461969k3034894
$$ 248503125 274553734 288278294 286665579 272408591 251155159 227693190 204658296
9287B04658296k1593911j9587369j6892385j3593814r957464o340287k703783
$$ 204658296 183064385 163477016 146584631 132990817 123033353 116693066 113989283
9280A13989283R59179M778549Q822082J3264179J8005062K2776562K6713245K8483137
$$ 113989283 114948462 119727011 128549093 141813272 159818334 182594896 209308141 237791278
9272B37791278K6396527J8810054N996530r005135k1853903k9645499l1964104
$$ 237791278 264187805 282997859 288994389 279989254 258135351 228489852 196525748
9265A96525748l0453653k6693138k1876796j7141287j2912214r430433o659015
$$ 196525748 166072095 139378957 117502161 100360874 87448660 78018227 71359212
9258G1359212m413310k414061o23205J253035L201889N096888O689215P728320
$$ 71359212 66945902 64531841 63908636 65161671 68363560 73460448 80149663 87877983
9250H7877983P838393P096439N848989M903260M368761M044512L463410K166201
$$ 87877983 95716376 102812815 108661804 113565064 117933825 121978337 125441747 127607948
9242A27607948l61693m122823p763344r785784r881647q551977o571219m492683
$$ 127607948 127246255 123123432 115360088 105574304 95692657 87140680 80569461 76076778
9234G6076778k407001m81243J290927K657593L481339L605325K996999J831693
$$ 76076778 73669777 73188534 74479461 77137054 80618393 84223718 87220717 89052410
9226H9052410N55097n06582p88999l89098M03328J289788J760277J170298q02867
$$ 89052410 89607507 89100925 88311926 87922828 88326156 89615944 91376221 92546519 91743652
9217I1743652l968053p480069j0105163j0847337j0015784q378417o487956m916597
$$ 91743652 87775599 80295530 70190367 59343030 49327246 40948829 34460873 29544276
9209B9544276l691728k785667k189931j831342j587005j463763j378358j323848
$$ 29544276 25852548 23066881 20876950 19045608 17458603 15994840 14616482 13292634
9201A3292634j221397j143885j047548q68490o95500n82244m69799m58987l67301
$$ 13292634 12071237 10927352 9879804 9011314 8315814 7733570 7263771 6804784 6437483
9192F437483k97819j70266j83121j04647o0120l9079j26155j26853j39088j47650
$$ 6437483 6139664 5969398 5786277 5681630 5621510 5582431 5456276 5329423 5190335 5042685
9182E042685k94734k19277k84984k42938k37936j62364j81737j71243r3051p488
$$ 5042685 4747951 4528674 4243690 4000752 3762816 3600452 3418715 3247472 3154421 3146933
9172C146933J2604k3562r125M271L6463K5417J0883L7834N3242R2101M2670L2056
$$ 3146933 3159537 3135975 3126850 3131121 3167584 3193001 3203884 3241718 3294960 3387061 3429731 3461787
9160C461787J7536M4538J20349J05026P3014q2891k08247k96076l07519k42127
$$ 3461787 3479323 3523861 3644210 3749236 3822250 3739359 3531112 3235036 2927517 2685390
9150B685390j43296j39052p5997q9769j2939k3200k9852J5301M8198j7997P1634
$$ 2685390 2542094 2403042 2327045 2237276 2224337 2201137 2171285 2186586 2234784 2216787 2288421
9139B288421J66056J57349J85677K43699K72889K41462J77643O6406j26040k29530
$$ 2288421 2454477 2611826 2797503 3041202 3314091 3555553 3733196 3799602 3673562 3444032
9129C444032l02798k61193j79201r8639r0875r1500j4775n9801j07152j00276
$$ 3444032 3141234 2880041 2700840 2602201 2511326 2419826 2405051 2345250 2238098 2137822
9119B137822j59305k13163j45526j01538j12983j29627j04443n6690K676l1058
$$ 2137822 1978517 1765354 1619828 1518290 1405307 1275680 1171237 1114547 1117223 1086165
9109A086165p8579l6398l5176n076O109k5020m2766j4131M6711J9910J6879m8288
$$ 1086165 1007586 971188 936012 930936 937045 912025 869259 855128 901839 921749 938628 890340
9097H90340l6875K382L6995p133P399K8773k6366k5671L9393M1860O6358J14620
$$ 890340 853465 855847 892842 885709 893108 921881 895515 869844 909237 951097 1017455 1132075
9085A132075N7932P6625J45624Q3067Q2218P5209J4199k5606o1055j43497j47899
$$ 1132075 1190007 1266632 1412256 1495323 1577541 1652750 1666949 1641343 1580288 1436791 1288892
9074A288892j38649j49925r6238l1125n99p037o5216j12512p2082Q70J6506K017
$$ 1288892 1150243 1000318 904080 872955 872356 865319 800103 687591 615509 616379 632885 634902
9062F34902m2531j7742J3484j5721P228L3234m9112m4185K898p7653j2839K805
$$ 634902 592371 574629 588113 572392 579620 612854 563742 519557 522455 444802 431963 434768
9050D34768K0324o437o5394N1789N0489J1117M0Q4895P1947L1984J7840N5249
$$ 434768 455092 448655 383261 435050 485539 496656 496696 581591 653538 685522 703362 758611
9038G58611J17668J69352J1184J5833P627l1997q4935m4930q3733q6159q9327
$$ 758611 876279 1045631 1056815 1072648 1080275 1048278 963343 918413 834680 748521 659194
9027F59194n1399o6189l93n8636l5285M1382O4721K877j8693q6474p2931k2780
$$ 659194 607795 541606 541213 482577 447292 488674 553395 556272 537579 451105 378174 355394
9015C55394k8736Q069O295o5788n9248J4133N2391L7962o301l6484K8039j088
$$ 355394 326658 334727 341022 275234 215986 230119 282510 320472 314171 277687 305726 304638
9003C04638r370k5843r502N1735p404J0066O8908l1786p4840j2536K4920M0909
$$ 304638 295268 269425 259923 311658 304254 314320 383228 351442 276602 264066 288986 329895
8991C29895M8469m6346n3189o843l0916l6882j719o068n9517j2229P6806L8573
$$ 329895 378364 332018 278829 271986 241070 204188 202469 196401 136884 124655 201461 240034
8979B40034k3903m0735j5732J9325j6461l3492j6276j151k9076l7714m78L4791
$$ 240034 216131 175396 159664 178989 162528 129036 112760 111609 82533 44819 44341 79132
8967G9132j6245m5204O6482K4320m1832K1828K821j8741J725M01J6133j1351k3956
$$ 79132 62887 17683 84165 108485 66653 88481 91302 72561 74286 74687 90820 79469 55513
8954E5513l9732L6950L6706M7460n520O7538L2418L539J6865L4726Q7559P5487
$$ 55513 15781 52731 89437 136897 131377 198915 231333 234872 251737 286463 374022 449509
8942D49509O0706q246m2294J1247l2358o0466j8368l8726l0058N5612M6426l8435
$$ 449509 510215 501969 459675 470922 438564 378098 359730 321004 290946 346558 392984 354549
8930C54549m2572J0235k3506p05R3599N7415K0842K2151K8625K3914J07396J13247
$$ 354549 311977 322212 298706 298001 391600 449015 469857 492008 520633 544547 651943 765190
8918G65190M0036o8469o0614n1119L6174j4737o3099k2663k7349m6172o286l924
$$ 765190 805226 736757 676143 625024 661198 646461 583362 560699 533350 487178 480892 476968
8906D76968n59q93j4096m3901j2926j9493L7572P7925K1414j0284P408P1769M1900
$$ 476968 476409 475516 461420 417519 404593 385100 422672 500597 522011 511727 519135 590904 632804
8893F32804K8708M9621L6238N7636N7131J02932R9315J09923J59684J52926N9660
$$ 632804 661512 711133 747371 805007 862138 965070 1064385 1174308 1333992 1486918 1546578
8882A546578l192p5815q4832j13501r4216q9242p7775p4766m9762m4424n1854
$$ 1546578 1543386 1467571 1382739 1269238 1175022 1085780 1008005 933239 883477 839053 787199
8871G87199p8918k6367M3089O5524K4814M2235J14549J11090J12327J26871J30456
$$ 787199 708281 681914 725003 790527 815341 857576 972125 1083215 1195542 1322413 1452869
8860A452869O8243m3859l4902n9595j30123j91894j06680j45452q6265o1523r3620
$$ 1452869 1521112 1477253 1442351 1382756 1252633 1060739 954059 808607 722342 660819 567199
8849E67199j9724k980l4680K3742O7172R8233K5096M024O1784P9759J06528M3476
$$ 567199 547475 544495 509815 533557 600729 698962 724058 728082 789866 869625 976153 1019629
8837A019629J29709K62908L40028M87328N57117K69214l35892n78620n17579l32796
$$ 1019629 1149338 1412246 1752274 2239602 2796719 3065933 2730041 2151421 1633842 1301046
8827A301046k33350j44228j47101j14942l5230J4496L4045M6748j2308m82m1900
$$ 1301046 1067696 923468 776367 661425 626195 640691 674736 721484 709176 708694 666794
8816F66794p9044K7358n4879l8436L5534n992l8685p313J3093Q682j266J721l6072
$$ 666794 587750 615108 560229 521793 557327 551335 512650 505337 518430 527112 525846 527567 491495
8803D91495J2755j7038l8002k6035k31p2874r2046m3210O984l0142o7648L050
$$ 491495 504250 487212 449210 423175 422944 350070 258024 214814 221798 191656 124008 127058
8791A27058L2402j0087j4716j8518L8436j3182o0406l8201k7000l3182p801N9323
$$ 127058 159460 149373 134657 116139 154575 141393 80987 42786 15786 -17396 -25197 34126
8779C4126r994K8730K1492J5448K0233K7958O045J29j5937L8251k3001k9729K714
$$ 34126 24132 52862 74354 89802 110035 137993 144038 144167 128230 166481 143480 113751 116465
8766A16465l2593J0381O37L8969M4093m518j9230k9730p1352O068O9404N0800
$$ 116465 83872 94253 94890 133859 177952 173434 154204 124474 53122 59190 128594 179394
8754A79394k293M929K2758l2057l2590o0073K2145L1586M9653L873J5653M1056
$$ 179394 177101 182030 204788 172731 140141 80068 102213 133799 183452 187325 202978 244034
8742B44034p5560l2904m2242k0498o048p783j2505j0093q872J6930O3603K3157
$$ 244034 168474 135570 93328 72830 66782 58999 46494 36401 27529 44459 108062 131219
8730A31219n8572M5299N7615J4883J206k0314J3775J232k3699k9721k709M1479
$$ 131219 72647 117946 175561 190444 191650 171336 185111 186343 162644 132923 130214 171693
8718A71693m6627K5427K8817k9424k0479J1614k2328j7167j2350K0928K3287k3135
$$ 171693 125066 150493 179310 149886 129407 141021 118693 101526 89176 110104 133391 110256
8706A10256L4823k6827K3235M6874j9O844L1411M6646P714N136L9742M1152k4659
$$ 110256 145079 118252 141487 188361 188342 195186 226597 273243 280957 286093 325835 366987 342328
8693C42328k1939q1376m2549l8519j1666M2071m342M3160J5388K0895k4626J7174
$$ 342328 320389 239013 196464 157945 146279 188350 184008 227168 242556 263451 238825 255999
8681B55999L8422M7829P8860J00751M2435j4542k827n8237o8407p8237o8251l056
$$ 255999 294421 342250 421110 521861 564296 549754 546927 488690 420283 342046 273795 270739
8669B70739k7648k6186l6769M6433L4680L8446j561k4313j8173N210j1885l8154
$$ 270739 243091 216905 180136 226569 261249 299695 298134 273821 255648 260858 248973 210819
8657B10819K1779K0747M3751K5873K6628K0198P170q615l355k8841J0240j3587
$$ 210819 232598 253345 297096 322969 349597 369795 376965 368350 364995 336154 346394 332807
8645C32807k3100L1047j360p0239L0313J1958m2740j6424K3924K4147O2463M3914
$$ 332807 309707 340754 339394 269155 299468 311426 268686 252262 276186 300333 362796 406710
8633D06710j4686m9094K7623k5785K9778L7748r975Q274j8773j4506O0920Q0633
$$ 406710 392024 342930 370553 344768 374546 412294 402319 410593 391820 377314 438234 518867
8621E18867j982k5660p761p317k7903J5266j384q129L1497M5074K0580O0579k4545
$$ 518867 516885 491225 483464 476147 448244 463510 462126 453997 485494 530568 551148 611727 587182
8608E87182M0637O6559Q6261N4653L4927M8904J9485J04527P4752R4217l4809
$$ 587182 627819 694378 780639 835292 870219 919123 938608 1043135 1117887 1212104 1177295
8597A177295j25237j06027n9314L102J5182m0247l4063M8612L9215l6160L0408
$$ 1177295 1052058 946031 886717 889819 905001 864754 830691 879303 918518 882358 912766
8586I12766R5937N1743J1075J0125m6819m7973R8835K1330l722L8304k5766O5442
$$ 912766 1008703 1060446 1071521 1081646 1034827 986854 1085689 1107019 1103297 1141601 1115835 1181277
8574A181277Q6645R6477R7496R7652J00566J01597Q5668O2578J50051K50708J66771
$$ 1181277 1267922 1364399 1461895 1559547 1660113 1761710 1847378 1909956 2060007 2310715 2477486
8563B477486J26585K36385K70326K44687L28343L56937L66017L95749M33157M99441
$$ 2477486 2604071 2840456 3110782 3355469 3683812 4040749 4406766 4802515 5235672 5735113
8553E735113N04357M46021L85899J54428j57633m59314p17958p80372o94255o27947
$$ 5735113 6239470 6685491 7071390 7225818 7068185 6608871 5890913 5110541 4416286 3788339
8543C788339m87325l94909l00830k85467k76739k24874j63674j19814j43273r4531
$$ 3788339 3301014 2906105 2605275 2319808 2043069 1818195 1654521 1534707 1391434 1296903
8533A296903q3681r8351j29411r3920q2985l1519r2330N248k8817l0250J9609
$$ 1296903 1213222 1114871 985460 891540 808555 777036 684706 689954 661137 630887 650496
8522F50496p034J9846r13j9424m4134m2503o8372q3208o1725k5762L6859K7581
$$ 650496 643462 663308 662395 642971 598837 556334 487962 404754 343029 317267 354126 381707
8510C81707J9864O3806M4796j105J3756j2205k7929k2758j4873o2245o5431j5894
$$ 381707 401571 465377 510173 509068 522824 510619 482690 459932 445059 382814 317383 301489
8498C01489M1576K1346n7247L6227o260k2654K4186l1343l0311j2693k4326j3588
$$ 301489 343065 364411 307164 343391 337131 314477 338663 307320 277009 264316 239990 226402
8486B26402K003O710J7756J3610M451k7562k9660K1010K6073O0579N4355j073
$$ 226402 228405 235115 252871 266481 270932 243370 213710 234720 260793 321372 375727 374654
8474C74654L8899q9802p7692l1087L9270j5692J360j2889j4019M0059J2204j9592
$$ 374654 413553 323751 246059 214972 254242 238550 239910 227021 213002 253061 265265 245673
8462B45673Q349p0058J3805O8991J2346J5159o2687p2772p2406M1511L8837m0358
$$ 245673 254022 183964 197769 266760 279106 294265 231578 158806 86400 127911 166748 126390
8450A26390M0209K8569l7420n7267J3148N0256q608k5035J5510k9529J452J717
$$ 126390 166599 195168 157748 100481 113629 163885 155277 130242 145752 116223 117675 119392
8438A19392o2395J1637j7040n1229J4124Q3821q698L614R234m636M8921Q7454
$$ 119392 56997 68634 51594 365 14489 98310 89612 93226 102460 97824 146745 234199
8426B34199Q015k3755l1829k8121L9045K1838l0756m4955p842j8510l4030o8382
$$ 234199 242214 218459 186630 158509 197554 219392 188636 143681 135839 117329 83299 14917
8414A4917N996K9194N2549L5383K0281L95L980J1089O5760N2765R9241J56465
$$ 14917 20913 50107 102656 138039 158320 158715 162695 173784 239544 292309 391550 548015
8402E48015R4712J00747r664j03522j32607j20434r5032r5451k4855L716J1194
$$ 548015 642727 743474 733810 630288 497681 377247 282215 186764 161909 165625 176819
8391A76819k7216p0487N1039M1738l8660o1556k2794J2964j4348n0400q915J02998
$$ 176819 149603 79116 130155 171893 133233 71677 48883 61847 47499 -2901 -11816 91182
8379I1182Q2210J451K1241M4794p5064m5711Q612k0185k169K5442J9646L5113
$$ 91182 173392 174843 196084 240878 165814 120103 128715 108530 106361 131803 151449 186562
8367A86562N997J6069k865m925k3938K5566P9428J30648J36370J54714L11438
$$ 186562 192559 208628 205763 200838 176900 202466 281894 412542 548912 703626 1015064
8356A015064L20540R9400j93947l21215k63851j52680j29285j03999q1237q1261
$$ 1015064 1335604 1435004 1241057 919842 655991 503311 374026 270027 188790 107529
8346A07529O453N5607M9594j507k6366n6745J4096L9530M764O6101n660l0628
$$ 107529 113982 169589 219183 217676 191310 134565 148661 188191 192955 259056 253396 222768
8334B22768j454N028N2765J01085O8580P8347J07332J32742J53015J67311K52877
$$ 222768 221314 226342 279107 380192 448772 527119 634451 767193 920208 1087519 1340396
8323A340396K86481K81962K89667J42047j16279k56190k66355k98351k26044j22389
$$ 1340396 1626877 1908839 2198506 2340553 2224274 1968084 1701729 1403378 1177334 1054945
8313A054945l8943m8854Q2019N2616k7971k10112k00151j04732j16506o6110n997
$$ 1054945 1016002 967148 1049167 1101783 1073812 863700 663549 558817 442311 376201 370204
8302C70204o0517q4287o0487j0943P971J4008L0337n2250k0882j1487K8952n3102
$$ 370204 309687 225400 164913 153970 161941 175949 206286 154036 133154 121667 150619 97517
8290I7517j6957j2800j0355N273R097k134n127L821M4094L3648p944l8698K1464
$$ 97517 80560 67760 57405 62678 71775 69641 64514 68335 112429 146077 138133 99435 120899
8277A20899l6557q330p040l0020J7467M3915O9842N2903p1700n2861j1255J2606
$$ 120899 84342 76012 68972 38952 56419 100334 170176 223079 151379 98518 87263 99869
8265I9869l0610K6102J8328J7095l7304L349J4718m4855l3436J9133J6250K3530
$$ 99869 69259 95361 113689 130784 93480 96829 111547 66692 33256 52389 68639 92169
8253I2169P261Q3267n6081m7860K4440r721N9485o538l9119j9374k0707k569K0879
$$ 92169 99430 182697 126616 78756 103196 93475 152960 146422 107303 87929 67222 64653 85532
8240H5532k1092m4240q42J6085K1736O883J5755n7874j4300l2405J2277M1974
$$ 85532 64440 20200 19358 35443 57179 64062 79817 21943 7643 -24762 -12485 29489
8228B9489L6212L0382J9858k613k6211n287l1038k2571M3766o284L2112L8923
$$ 29489 65701 96083 115941 113328 87117 81830 50792 28221 71987 65703 97815 136738
8216A36738m3435k3373M8571M2644L745n7157o6677l0991J7893J6474R189j0294
$$ 136738 93303 69930 118501 161145 164890 107733 41056 10065 27958 44432 53621 43327
8204D3327l7219J6792N4636J5990o7769j6455l3830J4715P2234K2848L2175k125
$$ 43327 6108 22900 77536 93526 25757 9302 -24528 -9813 62421 85269 117444 115319
8192A15319j8908j2251n334K7787J6760L1875L9784J5389q0936l4738k2568l366
$$ 115319 96411 84160 78826 106613 123373 155248 195032 210421 129485 94747 72179 68813
8180F8813j1005L7495K6048m9288K9861K9010k661n0125l2286j9270Q273o339
$$ 68813 57808 95303 121351 72063 101924 130934 128273 78148 45862 26592 34865 28526
8168B8526k2371p241L3745M3890p792j0617M4161m1193n6559P501N7061j7246
$$ 28526 6155 -1086 32659 76549 68757 58140 102301 61108 4549 12050 69111 51865
8156E1865L281M0674l8157J5619N7670m1347J3830O1369k0452L5075K588J7729
$$ 51865 55146 95820 57663 73282 130952 89605 103435 164804 144352 179427 182015 199744
8144A99744l4346j05433k2378K4363K1772M285R953j6885L602o6349n6322J2276
$$ 199744 165398 59965 37587 61950 83722 88007 97960 81075 84677 18328 -37994 -25718
8132b5718R499m2815j1491P5699N8247L6317p6796k8069K2470P470K7176K6283
$$ -25718 -16219 -59034 -70525 5174 63421 99738 22942 -5127 17343 24813 51989 78272
8120G8272n0561l8451o015L8205k6225l7389k3612M4351M2614j5892l5422O87
$$ 78272 27711 -10740 -16755 21450 -4775 -42164 -65776 -21425 21189 5297 -30125 -29438
8108b9438J4736P397j1334q166k3389M4436k3226j667j2432o9099M6907L7147
$$ -29438 -14702 -7305 -18639 -26805 -50194 -5758 -28984 -30651 -43083 -112182 -65275 -28128
8096b8128j6893M5093M4557Q300k1264k2706j7138l741J7618L5045j640J106M1900
$$ -28128 -45021 72 44629 52929 31665 8959 -8179 -11920 5698 40743 39103 40209 82109
8083H2109J1325O9330O054n9454k4584j0509o884J4400n1945l160l3041J1125
$$ 82109 93434 162764 168818 109364 84780 74271 67387 81787 29842 26682 -6359 4766
8071D766m122K9551m8498n4071j5423M0571Q0068j3073l308L8001k448m2388J1410
$$ 4766 644 30195 -18303 -72374 -87797 -47226 32842 19769 16461 54462 52014 9626 21036
8058B1036J05019L1083o6665j1912m668l8141p1971o7698P1630J9832j2419L0241
$$ 21036 126055 157138 90473 78561 73893 35752 -36219 -103917 -32287 -12455 -24874 5367
8046E367L6442j1886j3683m0777M5683N5970N239J0764L6074o9263l5511K6004
$$ 5367 41809 29923 16240 -24537 21146 77116 82355 93119 129193 59930 24419 50423
8034E0423K9358K749J9819J3082n348J1693k0559o771L7917L8316K8704l7127
$$ 50423 79781 82530 102349 115431 110083 121776 101217 94446 132363 170679 199383 162256
8022A62256j3162l4524K8876N6441j2263k9164j2229O396j9078m3285R839K0419
$$ 162256 149094 114570 143446 199887 187624 158460 146231 152627 133549 90264 100103 120522
8010A20522L6064Q275m5089L4938N7593J9083o126K5709j754j7635j8302r962
$$ 120522 156586 164861 119772 154710 212303 231386 225260 250969 249215 231580 213278 203316
7998B03316J04957K1139j2196N113k9593J146k231r00j176O480k6391l0726N5515
$$ 203316 308273 329412 317216 322329 292736 293882 291651 290751 289575 296055 269664 238938 294453
7985B94453j7126m933l0198M5941K4979k5150q132P214k5141l0265j838K6490
$$ 294453 277327 272394 242196 288137 313116 287966 279834 287048 261907 231642 229804 256294
7973B56294L8962k0337m391O4229M9985O0992P8216N417k9823M3577L3554q707
$$ 256294 295256 274919 270528 334757 384742 445734 523950 529367 499544 543121 576675 567968
7961E67968M6816J11282R1628Q1648K0488r6222r4623m2761r5178j29529j03270
$$ 567968 614784 726066 817694 899342 919830 823608 728985 686224 591046 461517 358247
7950C58247k0699l4250n5121M288O4269M1156p9334m4959L3892O4285l8398l7688
$$ 358247 337548 303298 248177 252465 316734 357890 278556 233597 267489 331774 293376 255688
7938B55688o0917k1869j8361N5463L6302j6200L818R4406Q961l7383K7945J4324
$$ 255688 194771 172902 154541 210004 246306 230106 233924 328330 337291 299908 327853 342177
7926C42177L567M2002J4562n8641j3337J6450L3385j130K8505K7162K5275M3785
$$ 342177 345744 387746 402308 343667 330330 346780 380165 379035 407540 434702 459977 503762
7914E03762j693j2780O255j600m7962K6349J9691r397k0177o5103m5450M806p1124
$$ 503762 502069 489289 495544 493944 445982 472331 492022 482625 462448 397345 351895 356701 285577
7901B85577K9735K3583p145n2316n4467q621L1413p501n4987o4642k1013Q250
$$ 285577 315312 338895 331750 279434 224967 216346 247759 240258 185271 120629 99616 107866
7889A07866J1221l0742K9068L5650L029L6454M8292l6472K6264j2494K7233M9101
$$ 107866 119087 88345 117413 153063 156092 192546 240838 204366 230630 218136 245369 294470
7877B94470k5641J512j7342j8960N749M5740J1433o1068n1701o1184R629L4498
$$ 294470 268829 270341 252999 234039 239788 285528 296961 235893 184192 123008 132637 167135
7865A67135K7334n507r603K0846l720k9279j0442M5547J2909n9752n1268L7565
$$ 167135 194469 188962 179359 200205 196485 167206 156764 202311 215220 155468 104200 141765
7853A41765M6774k3050o8150p3166N905J680O251j110N4970L1769j6273k9793
$$ 141765 188539 165489 97339 24173 30078 31758 38009 36899 91869 123638 107365 77572
7841G7572j2059M3455K6617q157j8212o8584o2418Q828J700M2470p547r774O148
$$ 77572 65513 108968 135585 127428 109216 40632 -21786 -12958 -11258 31212 23665 13891 20039
7828B0039L0718J3419J2416M4908L9395k7724p5864j6804J6015j9870J7469L6689
$$ 20039 50757 64176 76592 121500 160895 133171 57307 40503 56518 36648 54117 90806
7816I0806l0915K689K4977k120j3410L2757K845j6284n6846n575k0393J977O9843
$$ 90806 59891 62580 87557 85437 72027 104784 107629 91345 34499 28924 8531 10508 80351
7803H0351L5649J061k4447o1804n5535K9126j4924k7795j3027J6292K348K0615
$$ 80351 116000 117061 92614 30810 -24725 4401 -10523 -38318 -51345 -35053 -32705 -12090
7791a2090J8054k9922k0003R097L4291L0809K1232l5455m7282k4050k8347K8737
$$ -12090 5964 -23958 -43961 -34864 -573 30236 51468 16013 -31269 -55319 -83666 -54929
7779e4929P322O130k6038L7382L5419N381j216j7776o1151n8980J2543O9017N9367
$$ -54929 -47607 -41477 -67515 -30133 5286 10667 9451 -8325 -69476 -128456 -115913 -46896 12471
7766A2471l1366K4735j7247n8888j0329L6736P5915k0143o7616l0208M5609M7863
$$ 12471 -18895 5840 -11407 -70295 -80624 -43888 32027 11884 -55732 -85940 -40331 7532
7754G532m173K3957K2826q495k2828l8839l7823L6650L2893j5620L7306m1953
$$ 7532 3359 27316 50142 41647 18819 -20020 -57843 -21193 11700 -3920 33386 -8567
7742h567l0626J9802o3L1927L500k5456M4928n9451q8559p0033Q606M0962Q1779
$$ -8567 -39193 -19391 -19454 12473 15973 -9483 35445 -24006 -112565 -182598 -173992 -133030 -51251
7729e1251M9663M1974J7144J8843l7005j420l8383m6539M5194M6358N5057k6146
$$ -51251 -1588 40386 57530 76373 39368 37948 -435 -46974 -1780 44578 99635 73489
7717G3489J241k9292J7603p744n4537l6616K847j861L0841N623l9810j7459P026
$$ 73489 74730 45438 63041 55297 760 -35856 -33009 -34870 -4029 1594 -38216 -55675 -48649
7704d8649k2472J3954p956L3653L0860J4395O571O45r876k6145K3k1943n691L3423
$$ -48649 -71121 -57167 -65123 -31470 -610 13785 20356 21001 11125 -15020 -14997 -36940 -42631 -9208
7690i208K9397J9997J2528K3549k2627n7517j7717m432m927L0182m195L970J0452
$$ -9208 20189 40186 52714 76263 53636 -3881 -21598 -26030 -30957 -775 -4970 -1000 9452
7677I452o314k6679M047k2988j6606J8481k8356J6489J2244l5581k8337L2975
$$ 9452 3138 -23541 -19494 -42482 -59088 -40607 -68963 -52474 -40230 -75811 -104148 -71173
7665g1173K6570m2807r746P4887M4492j6387k7774j5927j5241N427J9955j3500
$$ -71173 -44603 -87410 -97156 -22269 22223 5836 -21938 -37865 -53106 -47679 -27724 -41224
7653d1224M3897L5576L5879J8202K0435P950l6960m3093o5167l3423J6832k9935
$$ -41224 2673 38249 74128 92330 112765 120715 83755 40662 -24505 -57928 -41096 -71031
7641g1031L2335K8835j3506l3247k753K3481J1268r307p042M3645O880m8758j8061
$$ -71031 -38696 -9861 -23367 -56614 -59367 -35886 -24618 -33925 -40967 2678 9558 -39200 -57261
7628e7261L8278k7508j5053N0609j5790n1597j3495L5576L2408R435j3407k6064
$$ -57261 -18983 -46491 -61544 -10935 -26725 -78322 -91817 -56241 -23833 -14398 -27805 -53869
7616e3869K9117L912J399J9079m529K3448Q472p2749k4579N7809N9898J7521l2250
$$ -53869 -24752 -20840 -19441 -362 -4891 18557 27029 -45720 -70299 -12490 47408 64929 32679
7603C2679l8583k5538O6206o12q7610k9523J2905L5381J6560n934K4351N1971
$$ 32679 -5904 -31442 34764 34152 -53458 -82981 -70076 -34695 -18135 -24069 282 52253
7591E2253j5858p6519m2453n2203l3388M7196L7026P3984K6561J1210n0733m2561
$$ 52253 36395 -40124 -82577 -134780 -168168 -120972 -83946 -9962 16599 27809 -22924 -65485
7579f5485o2592O8431M2173n971k1111j2000j5605j9949O918N6350K9746m8339
$$ -65485 -128077 -59646 -17473 -23444 -44555 -56555 -72160 -92109 -85191 -28841 905 -47434
7567d7434j1003J8971J6418L0419M2044N749m7423k9295M1494J3178l1595M0183
$$ -47434 -58437 -39466 -23048 7371 49415 55164 7741 -21554 19940 33118 1523 41706
7555D1706l1756n4727l5803N0470K8951o5817o2918r5N3439M554k5793J8564J6752
$$ 41706 9950 -44777 -80580 -30110 -1159 -66976 -129894 -129989 -76550 -71996 -97789 -79225 -62473
7542f2473m1996j0817L2507n1576l6672K9099P7726L9996L313j1819m755k2618
$$ -62473 -104469 -115286 -82779 -134355 -171027 -141928 -64202 -24206 -20893 -32712 -37467 -60085
7530f0085m3186L8561L650L744j1847j1192O0531O82M6622K657l4543L007o013
$$ -60085 -103271 -64710 -61060 -57316 -69163 -80355 -19824 -19142 27480 30137 -4406 -1399 -7412
7517g412M7985k1886p248l1839l9474l4062k029m084O3482k936j2951L3560l9254
$$ -7412 40573 18687 11439 -20400 -59874 -93936 -95965 -100049 -36567 -39503 -52454 -18894 -58148
7504e8148k7119M129Q276j3626M2064M0298M052k8185j0330P966n214n0221N628
$$ -58148 -85267 -81138 -72862 -86488 -44424 -4126 -74 -28259 -38589 -30623 -35837 -86058 -80430
7491h0430M2558l0583m0601J3005k8901r941P2922L973L072P4433j4330O1610
$$ -80430 -37872 -68455 -109056 -96051 -124952 -134893 -61971 -57998 -54926 19507 5177 66787
7479F6787J7891j1502n1789p8255m3320J6972N2139J4034M6847K8891l3505r853
$$ 66787 84678 73176 21387 -56868 -100188 -83216 -31077 -17043 29804 58695 25190 15337
7467A5337m1945j2936m8611m713J9705K8882O149K0129M8607o570N0648k9010
$$ 15337 -26608 -39544 -88155 -92868 -73163 -44281 -38132 -18003 30604 24034 74682 45672
7455D5672q0783k8468K794L6196L4599O080l5389j9663m9851j3029m800J6617
$$ 45672 -35111 -63579 -60785 -24589 10010 16090 -19299 -38962 -88813 -101842 -106642 -90025
7443i0025j1340J6960J9230K3707j0058J8562M1851Q0948k2207l0089n0134k6068
$$ -90025 -101365 -84405 -65175 -41468 -51526 -32964 8887 89835 67628 37539 -12595 -38663
7431c8663o36n6064r900N7512J9145k6833K0313J6736l845R949K8719M0878l5684
$$ -38663 -39299 -95363 -105263 -47751 -28606 -55439 -35126 -18390 -22235 -12286 16433 57311 21627
7418B1627p4376l7585J4668K7982L2151L259o931q851j9400j6589l6524P1025
$$ 21627 -52749 -90334 -75666 -47684 -15533 -12274 -19205 -28056 -47456 -64045 -100569 -29544
7406b9544K6956l573p3148m1556K9960K3036Q310j2567J5107J9884p086L8008
$$ -29544 -2588 -6161 -79309 -120865 -90905 -67869 -59559 -72126 -57019 -37135 -44221 -6213
7394f213Q834l4414m0114m2710O2144M0466L2075o181l2356k2572m0656J9875
$$ -6213 2621 -31793 -71907 -114617 -52473 -12007 20068 13887 -18469 -41041 -81697 -61822
7382f1822M3312J2895K2251l4624j3293k6810k9188J8916J117K6622M603N336
$$ -61822 -18510 -5615 16636 -17988 -31281 -58091 -87279 -68363 -67246 -40624 -36021 -30685
7370c0685j6100j6125N8819m3142m7984n458J7220L5331l9750K7036l6200P723
$$ -30685 -46785 -62910 -4091 -47233 -95217 -100675 -83455 -48124 -87874 -60838 -97038 -89315
7358h9315J0383j6833k8790K5864M9854Q480J915P571J3306Q753k5767l4599J0566
$$ -89315 -78932 -95765 -124555 -98691 -48837 -40357 -38442 -30871 -17565 -8812 -34579 -69178 -58612
7345e8612J7735J6468R036K3618L4594k1275K0126k9810m5890k3049o865k4324
$$ -58612 -40877 -24409 -15373 8245 42839 21564 41690 11880 -34010 -57059 -63924 -88248
7333h8248M6379J26790J9788j1909l9699o9506J3447k4619k8783K209J8628n415
$$ -88248 -41869 84921 104709 92800 53101 -16405 -2958 -27577 -56360 -54151 -35523 -40938
7321d0938N346l6854k5326j1227J2440K9369r320J9414m3512j57N5775M1934N1509
$$ -40938 -35592 -72446 -97772 -108999 -96559 -67190 -76510 -57096 -100608 -100765 -44990 -3056 48453
7308D8453L3938n3361r8370J2106P2844K2476n1407l9540m4841O8096K7094Q584
$$ 48453 82391 29030 -69340 -57234 15610 38086 -13321 -52861 -97702 -29606 -2512 6072
7296F072L118n728k043j1938j955O021K7610m0086j6847j7928J1760k0153k6141
$$ 6072 9190 3462 1419 -10519 -12474 -6453 21157 -18929 -35776 -53704 -41944 -62097 -88238
7283h8238K9973j1045q317N2208J2734l7548j5421R014M4636k2185n7333k4844
$$ -88238 -58265 -69310 -77627 -25419 -12685 -50233 -65654 -56640 -12004 -34189 -91522 -116366
7271a16366R763L3323O1934M0392o0075o2705k7081P8680L2722M289j492n2400
$$ -116366 -106603 -73280 -11346 29046 -31029 -93734 -120815 -42135 -9413 -5124 -6616 -59016
7259e9016j8459J5766j557k767O656o734J6815l610j4310J3183j7513J2917j0238
$$ -59016 -77475 -61709 -63266 -66033 -59377 -66111 -49296 -52906 -67216 -54033 -71546 -58629 -68867
7246f8867R749R531M4331l7097L705K7768R289K37N317P756J2716k3214k8826
$$ -68867 -59118 -49587 -5256 -42353 -38648 -10880 -1591 -1354 3963 11719 24435 1221 -27605
7233b7605Q433O9649k0818m3590L2122k9072j4915N01n836l2016m5174k4061K0780
$$ -27605 -19172 50477 29659 -13931 18191 -10881 -25796 -25295 -31131 -63147 -108321 -132382 -111602
7220a11602k9842O1157P6647M2997l5718J1618j6176o3332j935N1990K210J0411
$$ -111602 -141444 -80287 -3640 39357 3639 15257 -919 -64251 -66186 -14196 -11986 -1575
7208a575m1247J8774M954J2303j0876l4034J8292J464K8210m739q1365n4235M9164
$$ -1575 -42822 -24048 -19094 -6791 -17667 -51701 -33409 -31945 -3735 -8474 -89839 -144074 -94910
7195i4910L5278O6031M274j1533k9249Q61j9909J1257p103k191P5783N2664L500
$$ -94910 -59632 6399 10673 -860 -30109 -29248 -49157 -37900 -45003 -47194 28589 81253 84753
7182H4753K0293k3109o7267n5550j0229k0571N3194L0751l5775l4260L9705L7389
$$ 84753 105046 81937 14670 -40880 -51109 -71680 -18486 12265 -23510 -57770 -18065 19324
7170A9324L137N5563L0975l0361J3925j3913r1936n9711m355J7829M382M6684
$$ 19324 22461 78024 108999 78638 92563 78650 -13286 -72997 -77352 -59523 -55141 -8457
7158h457J0944J6039L1516m369k9139J0022L292n7340n9935J4651O2138R01o7797
$$ -8457 2487 18526 50042 45673 16534 26556 29848 -27492 -87427 -72776 -10638 -9737 -77534
7145g7534K0166L8828R955J8557M762N715o292m8122k0306M0875N4432M3147J7080
$$ -77534 -57368 -18540 -8585 9972 14734 20449 14157 -33965 -54271 -13396 41036 84183 101263
7132A01263J3224k786k4876l5915o3390n5719K340M5830q867M7784L5576j0076
$$ 101263 114487 111701 86825 50910 -12480 -68199 -65859 -20029 -28896 18888 54464 44388
7120D4388M4323L120m4462p3168o7514l5911M0359j314l257Q049m7452m2016M6266
$$ 44388 88711 91831 47369 -25799 -93313 -129224 -88865 -90179 -93436 -85387 -132839 -174855 -128589
7107a28589j2822R1028K7005m8631m929N9796l756L5692J2216j5751J7372r639
$$ -128589 -141411 -50383 -23378 -72009 -76938 -17142 -20898 14794 27010 11259 28631 18992
7095A8992l0077j8952J4886N142j8035J8206K9711L8981k5909q91l4039k741J0126
$$ 18992 -11085 -30037 -15151 -10009 -28044 -9838 19873 58854 32945 32054 -1985 -4726 5400
7082E400o916p57j3829k4246j9609l0441p213N7975K3835k0475M1338o611K13
$$ 5400 -1516 -2273 -16102 -40348 -59957 -90398 -97611 -39636 -15801 -36276 5062 -1549 -1336
7069a336P86l111O8511J6747l8687l7873l0949k3093m571l5885K4129K0692K9199
$$ -1336 -550 -3661 64850 81597 42910 5037 -25912 -49005 -53576 -89461 -65332 -44640 -15441
7056a5441Q0905J2942N741r74Q538r490P962L31k8641J9680N4823j4577m191o266
$$ -15441 65464 78406 84147 83173 91711 82221 90183 90514 61873 81553 136376 121799 117608 111342
7042A11342k3763o5332j1411o401N8585K3007l2224n9164L129m2392l277L4037
$$ 111342 87579 22247 10836 4435 63020 86027 53803 -5361 -2232 -44624 -47901 -13864
$$ [...]
##END NTUPLES=NMR SPECTRUM
##END=
