##TITLE=Analysis number 328436
Compound Code mo 01189
Project Code adrs
Chemist Name fudan
##JCAMPDX= 6.0         $$ Bruker NMR JCAMP-DX V2.0
##DATA TYPE= NMR SPECTRUM
##DATA CLASS= NTUPLES
##ORIGIN= Bruker BioSpin GmbH
##OWNER= nmr
$$ XWIN-NMR		Version 3.5
$$ Tue Jun  5 12:04:33 2007 GMT Daylight Time (UT+1h)  MAYBRIDGE\nmr@NMR_250MHZ
##.OBSERVE FREQUENCY= 250.131544655141
##.OBSERVE NUCLEUS= ^1H
##.ACQUISITION MODE= SIMULTANEOUS (DQD)
##.ACQUISITION SCHEME= undefined
##.AVERAGES= 16
##.DIGITISER RES= 18
##SPECTROMETER/DATA SYSTEM= dpx250
##.PULSE SEQUENCE= zg30
##.SOLVENT NAME= CDCl3
##.SHIFT REFERENCE= (INTERNAL, CDCl3, 0, 16.3604)
##AUDIT TRAIL= $$ (NUMBER, WHEN, WHO, WHERE, WHAT)
$$ ##TITLE= Audit trail, XWIN-NMR		Version 3.5
$$ ##JCAMPDX= 5.01
$$ ##ORIGIN= Bruker BioSpin GmbH
$$ ##OWNER= nmr
$$ C:\u/data/dgb/nmr/ADRS/270/pdata/1/auditp.txt
$$ ##AUDIT TRAIL=  $$ (NUMBER, WHEN, WHO, WHERE, WHAT)
(   1,<2007-06-05 12:04:14.13 +100>,<MAYBRIDGE\nmr>,<NMR_250MHZ>,
      <created by zg, POWCHK disabled, PULCHK disabled
       configuration hash MD5:
       76 6E 9A 78 1E 09 19 81 EC 84 63 8F B0 6A 59 2D
       data hash MD5: 64K
       98 03 53 E0 60 94 C9 56 23 EF D5 4C 8F 5A 7D 46>)
(   2,<2007-06-05 12:04:25.80 +100>,<MAYBRIDGE\nmr>,<NMR_250MHZ>,
      <Start of raw data processing
       ef LB = 0.3 FT_mod = 6 PKNL = 1 SI = 32K 
       data hash MD5: 32K
       5E F1 09 3C B1 8C FD 55 AA EA F9 FD 09 E4 6A 78>)
(   3,<2007-06-05 12:04:27.93 +100>,<MAYBRIDGE\nmr>,<NMR_250MHZ>,
      <apk 
       data hash MD5: 32K
       EE B7 7B BB 45 9B 75 3A 73 9A 3D 15 7A 39 41 E8>)
(   4,<2007-06-05 12:04:28.61 +100>,<MAYBRIDGE\nmr>,<NMR_250MHZ>,
      <abs ABSG = 5 
       data hash MD5: 32K
       28 55 E9 C4 B7 08 A1 7E 60 AF 68 3C DB 08 DE F4>)
$$ ##END=
$$ 
$$ hash MD5
$$ 15 DE 97 34 1B C3 CE 9D 82 1C E4 F5 08 83 CA B0
##$RELAX= 
##$RELAX= 
##$RELAX= 
##$RELAX= 
##$RELAX= 
##$RELAX= 
##$RELAX= 
$$ Bruker specific parameters
$$ --------------------------
##$DU= <C:\u>
##$EXPNO= 270
##$NAME= <ADRS>
##$PROCNO= 1
##$TYPE= <nmr>
##$USER= <dgb>
##$AMP= (0..31)
100 100 100 100 100 100 100 100 100 100 100 100 100 100 100 100 100 100 
100 100 100 100 100 100 100 100 100 100 100 100 100 100 
##$AQSEQ= 0
##$AQ_mod= 3
##$AUNM= <au_zg>
##$AUTOPOS= <59 >
##$BF1= 250.13
##$BF2= 250.13
##$BF3= 250.13
##$BF4= 250.13
##$BF5= 500.13
##$BF6= 500.13
##$BF7= 500.13
##$BF8= 500.13
##$BYTORDA= 1
##$CFDGTYP= 0
##$CFRGTYP= 5
##$CHEMSTR= <none>
##$CNST= (0..31)
1 1 145 1 1 1 1 1 1 1 1 1 1 1 1 1 1 1 1 1 1 1 1 1 1 1 1 1 1 1 1 1 
##$CPDPRG= <>
##$CPDPRG1= <>
##$CPDPRG2= <>
##$CPDPRG3= <>
##$CPDPRG4= <mlev>
##$CPDPRG5= <mlev>
##$CPDPRG6= <mlev>
##$CPDPRG7= <mlev>
##$CPDPRG8= <mlev>
##$CPDPRGB= <>
##$CPDPRGT= <>
##$D= (0..31)
0 1 0 0 0 0 0 0 0 0.06 0 0 0 0 0 0 0.0002 0 0 0 0 0 0 0 0 0 0 0 0 0 0 
0 
##$DATE= 1181041453
##$DBL= (0..7)
120 120 120 120 120 120 120 120 
##$DBP= (0..7)
150 150 150 150 150 150 150 150 
##$DBP07= 0
##$DBPNAM0= <>
##$DBPNAM1= <>
##$DBPNAM2= <>
##$DBPNAM3= <>
$$ [...]
##$SUBNAM7= <"">
##$SUBNAM8= <"">
##$SUBNAM9= <"">
##$SW= 20.6930455092707
##$SWIBOX= (0..15)
0 0 3 0 0 0 0 0 0 0 0 0 0 0 0 0 
##$SW_h= 5175.983436853
##$TD= 65536
##$TD0= 1
##$TE= 683.16
##$TE2= 300
##$TE3= 300
##$TEG= 300
##$TL= (0..7)
0 120 120 120 120 120 120 120 
##$TP= (0..7)
150 150 150 150 150 150 150 150 
##$TP07= 0
##$TPNAME0= <>
##$TPNAME1= <>
##$TPNAME2= <>
##$TPNAME3= <>
##$TPNAME4= <>
##$TPNAME5= <>
##$TPNAME6= <>
##$TPNAME7= <>
##$TPOAL= (0..7)
0.5 0.5 0.5 0.5 0.5 0.5 0.5 0.5 
##$TPOFFS= (0..7)
0 0 0 0 0 0 0 0 
##$TUNHIN= 0
##$TUNHOUT= 0
##$TUNXOUT= 0
##$USERA1= <user>
##$USERA2= <user>
##$USERA3= <user>
##$USERA4= <user>
##$USERA5= <user>
##$V9= 5
##$VALIST= <valist>
##$VCLIST= <CCCCCCCCCCCCCCC>
##$VD= 0
##$VDLIST= <DDDDDDDDDDDDDDD>
##$VPLIST= <PPPPPPPPPPPPPPP>
##$VTLIST= <TTTTTTTTTTTTTTT>
##$WBST= 1024
##$WBSW= 4
##$XGAIN= (0..3)
0 0 0 0 
##$XL= 0
##$YL= 0
##$YMAX_a= 410742
##$YMIN_a= -330290
##$ZGOPTNS= <>
##$ZL1= 120
##$ZL2= 120
##$ZL3= 120
##$ZL4= 120
##$ABSF1= 16.36036
##$ABSF2= -4.332811
##$ABSG= 5
##$ABSL= 3
##$ALPHA= 0
##$AQORDER= 0
##$ASSFAC= 0
##$ASSFACI= 0
##$ASSFACX= 0
##$ASSWID= 0
##$AUNMP= <proc_1d>
##$AZFE= 0.1
##$AZFW= 0.1
##$BCFW= 0
##$BC_mod= 0
##$BYTORDP= 0
##$COROFFS= 0
##$CY= 12.5
##$DATMOD= 1
##$DC= 0
##$DFILT= <>
##$DTYPP= 0
##$F1P= 14.0000005364418
##$F2P= -0.99999901652339
##$FCOR= 0.5
##$FTSIZE= 32768
##$FT_mod= 6
##$GAMMA= 0
##$GB= 0
##$INTBC= 1
##$INTSCL= 1
##$ISEN= 128
##$LB= 0.3
##$LEV0= 0
##$LPBIN= 0
##$MAXI= 10000
##$MC2= 0
##$MEAN= 0
##$ME_mod= 0
##$MI= 0
##$NCOEF= 0
##$NC_proc= -5
##$NLEV= 6
##$NOISF1= 0
##$NOISF2= 0
##$NSP= 0
##$NTH_PI= 0
##$NZP= 0
##$OFFSET= 16.36036
##$PC= 1
##$PHC0= 171.485
##$PHC1= -23.06391
##$PH_mod= 1
##$PKNL= yes
##$PPARMOD= 0
##$PSCAL= 4
##$PSIGN= 0
##$REVERSE= no
##$SF= 250.130040428464
##$SI= 32768
##$SIGF1= 0
##$SIGF2= 0
##$SINO= 400
##$SIOLD= 32768
##$SREGLST= <1H.CDCl3>
##$SSB= 0
##$STSI= 32768
##$STSR= 0
##$SW_p= 5175.98343685301
##$SYMM= 0
##$S_DEV= 0
##$TDeff= 65536
##$TDoff= 0
##$TI= <Analysis number 999999
Compound Code 99
Book Reference 9
Project Code 9>
##$TILT= no
##$TM1= 0
##$TM2= 0
##$TOPLEV= 0
##$USERP1= <user>
##$USERP2= <user>
##$USERP3= <user>
##$USERP4= <user>
##$USERP5= <user>
##$WDW= 1
##$XDIM= 32768
##$YMAX_p= 487355871
##$YMIN_p= -159472
$$ End of Bruker specific parameters
$$ ---------------------------------
##NTUPLES= NMR SPECTRUM
##VAR_NAME=  FREQUENCY,     SPECTRUM/REAL,   SPECTRUM/IMAG
##SYMBOL=    X,             R,               I
##VAR_TYPE=  INDEPENDENT,   DEPENDENT,       DEPENDENT
##VAR_FORM=  AFFN,          ASDF,            ASDF
##VAR_DIM=   32768,         32768,           32768
##UNITS=     HZ,            ARBITRARY UNITS, ARBITRARY UNITS
##FACTOR=    0.157963299565203, 1,           1
##FIRST=     4092.21730609277, 0,            0
##LAST=      -1083.76613076024, 0,           0
##MIN=       -1083.76613076024, -159472,     0
##MAX=       4092.21730609277, 487355871,    0
$$ Real data points
##PAGE= N=1
##DATA TABLE= (X++(R..R)), XYDATA
$$ [...]
13502F1095M708o704j5421k7932m015P047q573j4544L945R202J5989J138q984
13489A6951N41J7279k312j8856m993o642j8057k1560n960P888K7333p208j9769
13476c5365N356J1242p035n774m495P342R545J9357M989p177l812j1896j2859
13463c0582J36R332J0186L653m175j8980k186J5862l558r765Q058J4092J0592
13450B665J7931J655j9138j5422m272k502L100p218k555k042J1064m960R0q457
13436c0061j6651k094Q786J3263K842o125j6808j16J7917R546Q064K84n006q529
13422b4688o849Q865O14m412J4898R00k3570N2O955q914O824O309O086K755P480
13407f695j946o747o828p149J0861P962q825r112l028J96J812J6236J5007k21
$$ plain form
13502 61095 65803 59099 43678 15746 11731 18778 10205 -4339 -394 8808 24797 25935 16951
13489 16951 17492 34771 32459 13603 8610 1968 -16089 -37649 -43609 -35721 -8388 -15596 -35365
13476 -35365 -30009 -18767 -25802 -31576 -36071 -28729 -19184 173 5162 -2015 -5827 -17723 -30582
13463 -30582 -30446 -21114 -10928 -7275 -11450 -30430 -32616 -16754 -20312 -30077 -22019 -7927 2665
13450 2665 20596 22251 3113 -12309 -16581 -19083 -15983 -23201 -25756 -27798 -16734 -21694 -21604 -30061
13436 -30061 -46712 -48806 -40020 -26757 -23915 -30040 -46848 -46964 -29047 -19501 -11437 -11153 -16159 -24688
13422 -24688 -31537 -22672 -22058 -26470 -11572 -10672 -34242 -34190 -27235 -36149 -29325 -23016 -16930 -14175 -6695
13407 -6695 -8641 -15388 -22216 -29365 -18504 -10542 -19367 -28479 -31507 -31311 -29499 -13263 1744 1523
13393A523r255j2937q702n431m354J8897p86p439j202J9368J9676p455p8r749
13379g924k933k0510M084Q692r689p439p57j3373J2500N852P158p525K20o004
13365c7648r72n950q548O946O670R467K406M318l381j3669j108J0129J2607R332
13351i401L729L237r049j1227O555P167j4111L843r028j343o966P631k055J6646
13337a4372K3708L729l645n476j3008j2164k379l40R749O13j3315j474P776L559
13323a7039p81J4099Q78j6473k325l209J6215O811o757r189q459O76J634j0703
13309c4622j318N165J5571J4362k0187j2909N437J4456J3917j593q975J0935J2894
13296A3133J5703m2641j4655M113l152J5652J190n715L068J7132j8482j4450j4113
$$ plain form
13393 1523 -7732 -20669 -29371 -34802 -39156 -20259 -21045 -28484 -29686 -10318 9358 1903 1825 -7924
13379 -7924 -10857 -31367 -27283 -18591 -28280 -35719 -36476 -49849 -37349 -31497 -24339 -31864 -31644 -37648
13365 -37648 -38620 -44570 -53118 -46172 -39502 -30035 -27629 -23311 -26692 -40361 -41469 -31340 -18733 -9401
13351 -9401 -5672 -2435 -11484 -22711 -16156 -8989 -23100 -19257 -28285 -29628 -36594 -28963 -31018 -14372
13337 -14372 9336 13065 9420 3944 -9064 -21228 -23607 -23947 -14198 -13585 -26900 -28374 -20598 -17039
13323 -17039 -17820 -3721 -2843 -19316 -21641 -24850 -8635 -1824 -8581 -17770 -26229 -25553 -23919 -34622
13309 -34622 -35940 -30775 -15204 -842 -21029 -33938 -28501 -14045 -128 -1721 -10696 239 13133
13296 13133 28836 -13805 -28460 -24347 -27499 -11847 -10657 -16372 -13304 3828 -14654 -29104 -43217
13283d3217P065l638p262q534j464J0178Q111O214M768j413J1633M760n822j277
13269a9898m983n347R092J7398J0605m329j9585j3886q14P342J4020m950r548
13256b4883J050k967J343N239L591L477j2328p475K3546O706J7407J5331j8861
13243A1176j0734J3215l755j3213j0467J92m816n773l67j8253p751L793J2462
13230c4291J1184n76OL941j2739J0350J9328j41L27m552m353j7551O567k914J010
13215b4404k459K561N395J0472j211q600o618r961r215j2227Q648J5410j0560
13202d2769P556K1900J5424o144k336q420R36M271m84j2632M040M749J507K599
13188i803M408m047M622P864P17j0350J466o296o314l361j0325m688k234K725
$$ plain form
13283 -43217 -36152 -39790 -47052 -55586 -57050 -46872 -38761 -32547 -27779 -29192 -17559 -12799 -18621 -19898
13269 -19898 -24881 -30228 -21136 -3738 6867 2538 -17047 -30933 -31747 -24405 -10385 -15335 -24883
13256 -24883 -23833 -26800 -25457 -20218 -16627 -13150 -25478 -32953 -9407 -2701 14706 30037 11176
13243 11176 442 13657 9902 -3311 -13778 -13586 -18402 -24175 -24542 -42795 -50546 -46753 -34291
13230 -34291 -23107 -23683 -23677 -19736 -32475 -22125 -2797 -2938 -2611 -7163 -11516 -29067 -22500 -25414 -24404
13215 -24404 -26863 -24302 -18907 -8435 -9646 -18246 -24864 -34825 -44040 -56267 -47619 -32209 -42769
13202 -42769 -35213 -13313 2111 -4033 -6369 -14789 -13853 -9582 -10066 -22698 -18658 -13909 -12402 -9803
13188 -9803 -5395 -9442 -4820 3044 3761 -6589 -5123 -11419 -17733 -21094 -31419 -36107 -38341 -35616
13174c5616j1498m873o33Q214P700r853M659J7309O147j84M68J605J0363M115
13160b077j2910o903L056L568n998n32j756J1839R93J0038o693Q177J70R977j0859
13145I0l338j0215J514q735j69O265j3285j2711q069J536j923L489J2116O225
13131b7210j781K447J1255j7j8934q278j8796M991J4336P223q981J1429P791j8015
13117d2540N854K9034J3864j1070q100L979K706j2402q288j472j2268L021Q895
13104b8787j6491K129J7559R748n7K713r913j3264n592Q763K0824N579J983N795
13090I89J2438q004j0529j0891j1522j712L541j7162J4424K4681j16M339M943
13077E419r954p496l565J043R334L97j0949n555P924J217j956j340j404K510N49
$$ plain form
13174 -35616 -47114 -51987 -52620 -44406 -36706 -46559 -41900 -24591 -18444 -18628 -18160 -16555 -6192 -2077
13160 -2077 -14987 -21890 -18834 -15266 -21264 -21796 -23552 -11713 -10720 -682 -7375 802 972 10949 90
13145 90 -3248 -13463 -11949 -20684 -20853 -14588 -27873 -40584 -48653 -47117 -49040 -45551 -33435 -27210
13131 -27210 -28991 -26544 -15289 -15306 -34240 -42518 -61314 -56323 -41987 -34764 -43745 -32316 -24525 -42540
13117 -42540 -36686 -7652 6212 -4858 -12958 -8979 -6273 -18675 -26963 -28435 -40703 -37682 -28787
13104 -28787 -45278 -43149 -25590 -15842 -15899 -13186 -23099 -36363 -41955 -33192 -12368 -6789 -4806 989
13090 989 13427 5423 -5106 -15997 -27519 -29231 -25690 -42852 -28428 -3747 -3863 476 5419
13077 5419 -4535 -12031 -15596 -14553 -5219 -4822 -15771 -21326 -13402 -12185 -14141 -15481 -16885 -14375 -13826
13062a3826J0231j647q287j8040L601j526J5466R417q870r199n667J3351J9964
13049D968J316L982j5646M339J275o215O594j4855j1346J208R632q435k622o611
13035c2416j0783M943Q948M385j2741q112R404p078j787M767M478J5704O42j4083
13021c3729m145L609O203L839K535N235j852K150k0180o834L507J5604J2443q36
13007a2451J0824J6302l585j0857j4775r518j1436q549n916k641P269J1975M788
12994b8570O871P537j5023m54R021l618n888Q831L529J4569J8875M607k7549r182
12980a6444j1049q455k518q181M464J0875K529N111j1409j6486R279Q390J4220
12967a9674p080j856N249j2110m192K407p151J0011K508o38q854Q106J6731K1018
$$ plain form
13062 -13826 -3595 -5242 -13529 -31569 -27968 -29494 -14028 -4611 -13481 -22680 -28347 -14996 4968
13049 4968 6284 10266 -5380 -1041 234 -5981 613 -14242 -25588 -24380 -14748 -23183 -25805 -32416
13035 -32416 -43199 -38256 -29308 -24923 -37664 -45776 -36372 -43450 -45237 -40470 -35992 -20288 -19646 -33729
13021 -33729 -37874 -34265 -28062 -24223 -21688 -16453 -18305 -16155 -36335 -43169 -39662 -24058 -11615 -12451
13007 -12451 -1627 14675 11090 233 -14542 -24060 -35496 -44045 -49961 -52602 -45333 -33358 -28570
12994 -28570 -21699 -14162 -29185 -29639 -20618 -24236 -30124 -21293 -17764 -3195 15680 20287 -7262 -16444
12980 -16444 -27493 -35948 -38466 -46647 -42183 -31308 -28779 -23668 -35077 -51563 -42284 -33894 -19674
12967 -19674 -26754 -28610 -23361 -35471 -39663 -37256 -44407 -34396 -31888 -32526 -41380 -33274 -16543 4475
12953D475J4096j0226j0291o640k238r89N39o152j22J3698n532L224Q753N540
12939H135P113o774j8521j2141m89j4500q297q908K6694K1648M298O141O495K150
12925A3044q300k3162n787j2582m504k560J6433L0512j3897j5028J6488J942n902
12912a3303M523o861J076l992p003J325J590O042m562p817J251M069r389N655
12898b7396p098j1857j3273r828J787J6478M621o088q361J0937Q391Q81J3452
12885b7354K055j213L408m957m774n670j9125p262P282K0470p112k526j554K0495
12871b7837m210j0815j3920p873J7277k656j2073N569k42q209q466J285J0831
12858f1339K8547p885o962J404Q033O844K862O558J9267P584j3753j8830L630
$$ plain form
12953 4475 18571 8345 -1946 -8586 -10824 -11813 -11274 -17426 -17548 -3850 -9382 -6158 2595 8135
12939 8135 15248 8474 -10047 -22188 -22677 -37177 -45474 -54382 -27688 -6040 -1742 4399 10894 13044
12925 13044 4744 -18418 -24205 -36787 -41291 -43851 -27418 3094 -10803 -25831 -9343 -7401 -13303
12912 -13303 -8780 -15641 -14565 -18557 -25560 -24235 -22645 -16603 -21165 -28982 -27731 -23662 -33051 -27396
12898 -27396 -34494 -46351 -59624 -69452 -67665 -51187 -46566 -52654 -61015 -50078 -41687 -40806 -27354
12885 -27354 -25299 -26512 -23104 -28061 -32835 -38505 -57630 -64892 -57610 -37140 -44252 -46778 -48332 -27837
12871 -27837 -32047 -42862 -56782 -64655 -47378 -50034 -62107 -56538 -56780 -64989 -73455 -72170 -61339
12858 -61339 -32792 -40677 -47639 -46235 -38202 -31358 -28496 -21938 -2671 4913 -8840 -27670 -24040
12845b4040J1377J5891L715J2308N117k282j0812j4933k4736j3547j5731L4824
12833b2849J3642p917p81k078q78l12j111p842L819K0458N592O003m268r04K5549
12818B6123J5139n718N254L546k2700j4894l522K244j5178m24q055N92O696R225
12804a672n946J856k832J2560m087J1904k058o052j063J0274J4537Q497j00k521
12790C3297N603j737k2994q891j169J773o944j9703j344R101N064J0824j21n260
12776b501j416n682N20j1092k6417k223J0143J2354L0031K892r976J786L001j3553
12762a2133P70J3741L599k216p333p007k654J7685J1459j3585R867l957r935k949
12748d648J2490K9820J6079P602j4267j7029j5009j7313j4552Q496K4487p605
$$ plain form
12845 -24040 -12663 3228 6943 19251 24368 22086 11274 -3659 -28395 -41942 -57673 -22849
12833 -22849 -9207 -17124 -17905 -19983 -20861 -21173 -22284 -30126 -26307 -5849 -257 5746 1478 574 26123
12818 26123 41262 35544 40798 44344 21644 6750 3228 5472 -9706 -10130 -18185 -17593 -10897 -1672
12804 -1672 -7618 -5762 -8594 3966 -121 11783 9725 3673 2610 12884 27421 35918 35818 33297
12790 33297 38900 37163 14169 5278 4109 5882 -1062 -20765 -22109 -13008 -7944 2880 2759 -2501
12776 -2501 -3917 -9599 -9079 -20171 -46588 -48811 -38668 -26314 3717 6609 -3367 -1581 1420 -12133
12762 -12133 -11363 2378 5977 3761 -3572 -10579 -13233 4452 15911 2326 12193 8236 -1699 -4648
12748 -4648 7842 37662 53741 61343 47076 30047 15038 -2275 -16827 -8331 16156 8551
12736H551K559K607N604o280j0668j3790p873o291L606j2009R963J4176J6706
12723F861l771k3753j6572K759m91M088q261p424R569K0477j0898k4230j918J0490
12709d3074J1105J5295J0895m401j3170p750P525M594R469J0019o102j0166P754
12696h007M490O227K9351K0936N072r1q182k432j093j3513j9958j4370j061j209
12682c840j1847r322q973j3775p511K3465J5196m606J2768j1358O496M616j2170
12669b0861J693Q463J433o355k149n766j3587l513l598M138K8346J4790j9114
12656a6080k885J3601O075j4176n035J72Q002K663M929J509O704M618J645q448
12642C294K73J0276J3553l19J622k123j2954j0727k7660q039O567N064J1025P189
$$ plain form
12736 8551 11110 13717 19321 13041 2373 -11417 -19290 -25581 -21975 -33984 -24021 -9845 6861
12723 6861 3090 -20663 -37235 -34476 -34967 -30879 -39140 -46564 -36995 -16518 -27416 -51646 -53564 -43074
12709 -43074 -31969 -16674 -5779 -10180 -23350 -31100 -23575 -18981 -9512 507 -5595 -15761 -8007
12696 -8007 -3517 2710 32061 52997 58069 57978 49796 47364 46271 32758 12800 -1570 -2631 -3840
12682 -3840 -15687 -25009 -33982 -47757 -55268 -31803 -16607 -21213 -8445 -19803 -13307 -8691 -20861
12669 -20861 -19168 -10705 -9272 -15627 -17776 -23542 -37129 -40642 -44240 -40102 -11756 3034 -16080
12656 -16080 -18965 -5364 711 -13465 -18500 -18328 -10326 -7663 -2734 -1225 5479 10097 11742 3294
12642 3294 3567 13843 27396 27077 28699 26576 13622 2895 -24765 -32804 -26237 -21173 -10148 -2959
12628b959O263K8998J5200j5174o277l677n517m193J4906J294o388O2L704K2144
12614D8386r276k6570j3732k77j819M290Q935O228J0157K0149P810l4l1290j4221
12600H736j56m332R560k991P325K4445P639P054j1826j9218j78j6741l0235J0600
12586a0318J3763j2193k1633j2488P104J8991K7218K3861P440l521O627N764n034
12573D5581o249K063J7400J2868j1230k733K3338J3460n63j9790j2488j3589j6888
12560C1180K942l535p979J638r890q226m242m065J7340r726j2494k307Q829R996
12546I461M616J4663K3356J909J1449N112Q610m525o671J2398J3538j2867j3093
12533F7956k2332j8129K272p353j6206J1175j2081j8603J6545R227q187J947P948
$$ plain form
12628 -2959 3304 32302 47502 32328 26051 22374 16857 12664 27570 28864 22476 22538 26242 48386
12614 48386 39110 12540 -1192 -1469 -3288 1002 9937 16165 26322 46471 54281 54247 22957 8736
12600 8736 8580 4248 13808 10817 18142 42587 50226 57280 45454 26236 26058 9317 -20918 -10318
12586 -10318 3445 -8748 -30381 -42869 -35765 -16774 10444 34305 41745 38224 44851 50615 45581
12573 45581 39332 41395 58795 71663 60433 57700 81038 94498 93935 74145 61657 48068 31180
12560 31180 34122 30587 22608 24246 14356 6130 1888 -2177 15163 5437 -7057 -9364 -535 9461
12546 9461 14077 28740 52096 54005 65454 70566 79176 74651 67980 80378 93916 81049 67956
12533 67956 45624 27495 29767 22414 6208 17383 5302 -13301 3244 12471 4284 6231 14179
12520A4179J4408L913j1901j4192j1654M354q990o613J3076J1628K6009K2747
12508E6964P528J0850O151J2454M263j1073k5641k6768j0632o526J902k976j2153
12495D343j4603k293o52O506O535M578J0249R323q200N298k739q142K1033q873
12481B2363O201Q691O449m982L736L663L373k0435j2852q690J179Q87n909K401
12467F075L547j8090J908K6603j408K882P346N093J457j6735r864m187L611k073
12453F165q475M140P800j5505j2638j2906J1443J4636N465k942J286n187r037
12440a5755M307o171j0349o606j085K268K3595J815j224q165K045j922Q181M51
12426h615Q978R261j172j5894Q094J1194n547n798L773j1104k351l87r919J1541
$$ plain form
12520 14179 28587 32500 20599 6407 -5247 -893 -9883 -16496 -3420 8208 34217 56964
12508 56964 64492 75342 81493 93947 98210 87137 61496 34728 24096 17570 19472 16496 4343
12495 4343 -10260 -12553 -13205 -6699 -164 4414 14663 23986 15786 21084 18345 10203 31236 22363
12481 22363 28564 37255 43704 38722 42458 46121 49494 29059 16207 7517 8696 9583 3674 6075
12467 6075 9622 -8468 -6560 20043 18635 21517 28863 33956 35413 18678 8814 4627 8238 6165
12453 6165 -2310 1830 9630 -5875 -18513 -31419 -19976 -5340 125 -2817 -1531 -6718 -15755
12440 -15755 -11448 -17619 -27968 -34574 -35659 -33391 -9796 -7981 -9205 -17370 -15325 -17247 -9066 -8615
12426 -8615 363 9624 8452 -7442 652 11846 6299 501 4274 -6830 -9181 -9568 -19487 -7946
12412g946j2594o088K0459O448k2465k1835j1481j0865Q599K2110K5564p498j3181
12399c0773P795Q099p939j0241K219K0656R098L816Q908k26j3214n548k933M69
12385i814j823K88K798K3282M370Q97J4246j7j2501p077L973k467J3519M091n069
12370B8696L576J0801J764k251J0750K2865M696J9574K7094K2177J6286J5097
12358A81125K3052M0360L2850J4970o2720q2461n0774k9916j7166L05K6505K0118
12346I6248J966j3710j0880j8017m06M231k2081j4588j0498j0536P654R355J0720
12333B9458R147R840k739j8906k8280j1395J1088L8419J5189L190K4780J8802
12321I8593J4120N0192N8634O8814Q3651R2160Q5844O1072M8499Q1212P1053r5331
$$ plain form
12412 -7946 -20540 -26628 -6169 279 -22186 -44021 -55502 -66367 -57768 -35658 -10094 -17592 -30773
12399 -30773 -22978 -14879 -22818 -33059 -30840 -10184 -1086 2730 11638 11412 -1802 -7350 -10283 -9814
12385 -9814 -11637 -11349 -8551 14731 19101 19998 34244 34227 21726 14649 18622 16155 29674 33765 28696
12370 28696 32272 43073 44837 42586 53336 76201 80897 100471 127565 149742 166028 181125
12358 181125 204177 244537 277387 292357 229637 147176 96402 66486 49320 49625 76130 96248
12346 96248 98214 84504 73624 55607 55201 59432 37351 22763 12265 1729 9383 18738 29458
12333 29458 38605 48445 45706 26800 -1480 -12875 -1787 36632 51821 55011 79791 98593
12321 98593 112713 162905 221539 290353 374004 466164 552008 613080 661579 742791 813844 718513
12309G18513k07660j42433j07330p7461m4278k9388O764K0268J3100j3606j0196
12298A26293l2276j4265N343M568n466k8763k5382j0946J6266K4301K0919K0798
12286A01390R096l134p34j391O69J5160K0099K991q903j728L3666L9583N4433
12273B61197R7535J04267J06243R9957M6694O7369R0493j2552j88423k08464j11430
12262C52886l4271l3202l8960k9005m0472l2023K348j0040j6120o981r325P626
12250A12461Q841N601O902n580q920j885r54j0466O100J4824J1040j9325q342
12237A10297K698j3065N669n223N195J6675L5214L3591L2617M4290O6365O1491
12225C95814M0231K8711Q763j9420p3924q6982o2718l6933r930k874k5640j6888
$$ plain form
12309 718513 510853 368420 261090 183629 139351 109963 116727 136995 150095 136489 126293
12298 126293 94017 79752 85095 89663 84197 55434 30052 19106 35372 59673 80592 101390
12286 101390 110486 107352 106618 105227 105896 121056 141155 144146 135243 133515 167181 206764 261197
12273 261197 358732 462999 569242 669199 715893 783262 873755 861203 672780 464316 352886
12262 352886 318615 285413 246453 217448 176976 144953 147301 137261 121141 114160 104835 112461
12250 112461 121302 126903 133805 128225 119305 117420 116466 106000 112100 126924 137964 118639 110297
12237 110297 112995 99930 105599 100376 105571 122246 157460 191051 223668 267958 334323 395814
12225 395814 436045 464756 473519 454099 380175 293193 230475 193542 183612 180738 155098 138210
12213A38210M247L543j3959j4157m435j2100K250l179J512k212j1464K032J6861
12200A07149o662l1833l770K340L672J3977Q228K413l021P038J1408k954K938
12187A10923k678j1861j7555k4677L26J5899M022n227P4O455J3968J98j7603k3822
12173D8442r058n007j3055p003M99J2639l364j7318j5899L992j242j2774J3496
12160e652p258l798k954n599N799J1953J8242L230k946j388o732K216K140j5219
12146g966j3265q313R629Q124J8178K5343K4690l118j3661j2525k561l345j4579
12133F631k1655Q11J3226J79L311J2819J407j28n426q789Q268j433J1331K1211
12119D1763j110j617o117k172l327k507J564j6626j2957r543o854K3067p95j0886
$$ plain form
12213 138210 142457 146000 132041 117884 113449 101349 103599 100420 101932 99720 88256 90288 107149
12200 107149 100487 68654 64884 67224 70896 84873 93101 95514 92493 99531 110939 107985 110923
12187 110923 108245 96384 78829 54152 54478 70377 74399 69172 69246 75701 89669 89867 72264 48442
12173 48442 39384 34377 21322 14319 14818 27457 24093 6775 -9124 -5132 -6374 -19148 -5652
12160 -5652 -12910 -16708 -19662 -25261 -19462 -7509 10733 13963 11017 9629 2897 5113 7253 -7966
12146 -7966 -21231 -29544 -19915 -11791 6387 31730 56420 53302 39641 27116 24555 21210 6631
12133 6631 -15024 -14213 -987 -808 2503 15322 16729 16601 11175 2386 10654 9221 20552 41763
12119 41763 40653 39036 32919 30747 27420 24913 26477 9851 -3106 -12649 -19503 3564 2769 -8117
12105h117n791J6327J0055K362j48l444j4144j4448l329J4288l251j8396j1618
12092c9654o088K068J4353J4027O316j151p761n184j1081R230J8317R562m18P896
12078A0432R177K0484Q588k388J2491r674k3979q659p966n065n274q314j9325
12065b9472n23N148Q251o117M771Q229J6650l678l95L496R491J3079Q269K0992
12051E8191j0015j7931j9801j2953l390k831j6915l534P590Q78l526k782j3151
12038d0170j5433J6747J8352l158K314J1365m631j1241m318k1007O374J3092J3289
12025a8425R377j247L587J376k786j309j2190q257j7814M030n138J1295L797L415
12011c0289J064P188J22M514R80l203N75O791J6921k589j5294l314K883J0363
$$ plain form
12105 -8117 -13908 2419 12474 14836 14688 11244 -2900 -17348 -20677 -6389 -9640 -28036 -39654
12092 -39654 -45742 -43674 -29321 -15294 -8978 -10129 -17890 -23074 -34155 -24925 -6608 2954 2536 10432
12078 10432 19609 40093 48681 46293 58784 49110 25131 16472 8506 3441 -1833 -10147 -29472
12065 -29472 -29995 -24847 -16596 -22713 -17942 -9713 6937 3259 2864 6360 15851 28930 37199 58191
12051 58191 48176 30245 10444 -2509 -5899 -8730 -25645 -29179 -21589 -20711 -24237 -27019 -40170
12038 -40170 -55603 -38856 -20504 -23662 -21348 -9983 -14614 -25855 -30173 -51180 -44806 -31714 -18425
12025 -18425 -9048 -10295 -6708 -5332 -8118 -9427 -21617 -29874 -47688 -43658 -48796 -37501 -33704 -30289
12011 -30289 -29225 -22037 -21915 -17401 -16421 -19624 -19049 -12258 4663 2074 -13220 -16534 -13651 -3288
11997c288J2039Q350k1850k0938p270J0375r35r438j0978R520N494j285R308P975
11983a2921j729p664n745N302j1639L613J6132q739m141O403J1861J896l487j8659
11969b9517k2061o563L344P237o016k841J656J3599J6905N820j917m699K416J0379
11955a2258n40n227J3481J4331k855l3119j8622j2102k992l770k875q386Q876
11942f6058J1277L526R426O815P69r943J22J183J4909N98o810k7590Q60k976O010
11927e7882P093K2667p3r452j710M704l84n974m030l14J414J0172J292j0281J802
11912d0956k025l077q670n81M700K229l425n643m386p349J2378o3K903J1358J2156
11897c0451j4800q098M196o1O315m484Q94k739J2477q892q681K5589J9118m065
$$ plain form
11997 -3288 8751 17101 -4749 -25687 -32957 -22582 -23517 -32955 -43933 -34413 -28919 -30204 -20896 -12921
11983 -12921 -14650 -22314 -28059 -22757 -34396 -30783 -14651 -23390 -27531 -21128 -9267 -7371 -10858 -29517
11969 -29517 -51578 -58141 -54797 -47560 -53576 -56417 -54761 -41162 -24257 -18437 -20354 -25053 -22637 -12258
11955 -12258 -12798 -18025 -4544 9787 6932 -26187 -44809 -56911 -59903 -63673 -66548 -74934 -66058
11942 -66058 -54781 -51255 -41829 -35014 -34245 -44188 -44066 -42883 -27974 -27376 -34186 -61776 -60916 -63892 -57882
11927 -57882 -50789 -28122 -28195 -37647 -39357 -34653 -35037 -41011 -45041 -45355 -43941 -33769 -32477 -42758 -40956
11912 -40956 -42981 -46058 -54728 -55309 -50609 -48380 -51805 -57448 -61834 -69183 -56805 -56868 -53965 -42607 -30451
11897 -30451 -45251 -53349 -49153 -49214 -42899 -47383 -46489 -49228 -36751 -45643 -54324 -28735 -9617 -13682
11883a3682L143m706o541k2809k423J6530j37k2644j2105O099J5748n133j8604
11870f7264j4970k501K9963J7290L144M330J7523q243o450P18j5078J6997J3815
11857a0726q552l276r848m072O54r70j3223K480O779n361j1804M187J235o781
11843e9278l17K389K129m666j108L864m417j0497J9350J8329N101k611j3633L324
11829d2041Q963Q521j0627J69n64J1307J0028j072m917o637m87p991K200J6917
11815a6231J5744K3333O614p927j1088p273j3328L040O811m462o230k0982k0351
11802e2330j4974P482J3126J0394J0690j5111n440m205k088K455Q951n540q419
11789e5009P068Q336j6364M601M134K539K029N782M165l010K359M038J926j5159
$$ plain form
11883 -13682 -10539 -15245 -21786 -44595 -47018 -30488 -30625 -53269 -65374 -59275 -43527 -48660 -67264
11870 -67264 -82234 -84735 -54772 -37482 -34338 -30008 -12485 -20728 -27178 -26460 -41538 -24541 -10726
11857 -10726 -19278 -22554 -32402 -36474 -35820 -36790 -50013 -47533 -40754 -46115 -57919 -53732 -52497 -59278
11843 -59278 -59595 -57206 -55077 -59743 -60851 -56987 -61404 -71901 -52551 -34222 -29121 -31732 -45365 -42041
11829 -42041 -33078 -24557 -35184 -35015 -35579 -24272 -14244 -15316 -20233 -26870 -27357 -35348 -33148 -16231
11815 -16231 -487 22846 29460 21533 10445 3172 -10156 -7116 -305 -4767 -10997 -31979 -52330
11802 -52330 -67304 -59822 -46696 -36302 -25612 -40723 -46163 -50368 -52456 -50001 -41050 -46590 -55009
11789 -55009 -47941 -39605 -55969 -51368 -47234 -44695 -42666 -36884 -32719 -35729 -33370 -29332 -27406 -42565
11775d2565n827k609n57J3655L090j836N964q083N691J5172P807L520l760j4866
11761b5204k0286k0702m57R013J5251J7340J1475j4199P18L952o868Q475K484
11748a9008J2056j218j1980N880L632L151j6274j1338O61j3901l280J0180K836
11735c8603Q29P264l409l051j0346K114l310K098r329j2538l201O038Q062Q849
11721d8533l306j4603J3035O413J3770J294j5597n797j6638l745Q918K922M191
11708e7676q408N980J999Q907P322J973N6N435J4061J438L604n805K916K0600
11694B402Q74r910N843J0201J1727Q767J2972J4537J6073J9035K2540m676Q23
11681A11208l63n482k0629j5350K0883K5930J3512P229K8067J7811J134L3017
$$ plain form
11775 -42565 -48392 -51001 -51558 -37903 -34813 -36649 -30685 -38768 -33077 -17905 -10098 -6578 -10338 -25204
11761 -25204 -45490 -66192 -66649 -57636 -42385 -25045 -13570 -27769 -27051 -23099 -29967 -21492 -19008
11748 -19008 -6952 -8170 -20150 -14270 -10638 -7487 -23761 -35099 -34438 -48339 -51619 -41439 -38603
11735 -38603 -37774 -30510 -33919 -36970 -47316 -45202 -48512 -46414 -55743 -68281 -71482 -65444 -57382 -48533
11721 -48533 -51839 -66442 -53407 -46994 -33224 -31930 -47527 -53324 -69962 -73707 -64789 -61867 -57676
11708 -57676 -66084 -60104 -58105 -49198 -41876 -39903 -39847 -34412 -20351 -18913 -15309 -21114 -18198 2402
11694 2402 3276 -6634 -791 9410 21137 29904 42876 57413 73486 92521 115061 110385 111208
11681 111208 110845 105363 84734 69384 90267 116197 129709 136938 165005 182816 183950 216967
11669B16967K8399L427L0836L1574J3036J4304K4682J4786J3585J6450K1181J3557
11657D42784Q86n179j8430j4072J1870J4922m907J3960J2405l447j6989k518j0720
11644D20565k3776r734j8847j1601k5127l3912j3538Q077p436j7147j079j2351
11632B54094k7161j142P358P552J1796N985K028j2971O676K741j2700P608J1763
11619B63627J1213L644j854j565J2194m222p73J81J2879l373M596N306j862j0076
11605B89915m431l290O27k3349m860K1299J0225J5140O524O254N295L512P912
11592C30773K5434m609j035j956j5567r87K104O423m78J8265n43j5092j67K4811
11578C67376m443k1748j7867k669J6986Q50k8j4614k0496k1393j324p383k0133
$$ plain form
11669 216967 245366 248793 279629 311203 324239 338543 363225 378011 391596 408046 429227 442784
11657 442784 443670 438491 420061 405989 417859 432781 427874 441834 454239 450792 433803 431285 420565
11644 420565 396789 387055 368208 356607 331480 297568 284030 292107 284671 267524 266445 254094
11632 254094 226933 225791 233149 240701 252497 258482 260510 247539 254215 256956 244256 251864 263627
11619 263627 274840 278484 276630 275065 287259 283037 282264 282445 295324 291951 296547 301853 299991 289915
11605 289915 285484 282194 282821 259472 254612 275911 286136 301276 307800 314054 319349 322861 330773
11592 330773 356207 351598 350563 348607 333040 332053 334157 340580 340102 358367 357824 342732 342565 367376
11578 367376 362933 341185 323318 320649 337635 338485 338457 323843 303347 281954 280630 273247 253114
11565B53114l9376j4569k425j6817r290r908N10j8824k1414k6963j1493m404k4119
11552E4022o732j1263k5949K533M67k5821O05P918o503o786J3479J1019j8201
11539a1212q393P445n60J2323j0819k3778m488K298R119j166j0380J5417O148
11526a8046J926n231J245l698j4453p158j994K808j255N784J1638L070k596j930
11512b9890j5934K608l438L867K199o945j243O063J3756Q918M785j2219M836K930
11498a9707J744M959j306j1034N663m447n385J2481R44K411J7336j4729j7366
11485b8436K820L717K2874K0447m399k406j3843r134k144J1739J1101k72p502
11472D562m299J086j7262M455k78O057K755j0718j4826k1180n561P835j876j794
$$ plain form
11565 253114 213738 199169 196744 179927 170637 160729 161239 142415 121001 94038 82545 78141 54022
11552 54022 47290 36027 10078 12611 13078 -12743 -12138 -4220 -10723 -17509 -4030 6989 -11212
11539 -11212 -19605 -12160 -12720 -397 -11216 -34994 -39482 -37184 -28065 -29231 -39611 -24194 -18046
11526 -18046 -16120 -21351 -20106 -23804 -38257 -45415 -47409 -44601 -45856 -40072 -28434 -25364 -27960 -29890
11512 -29890 -45824 -43216 -46654 -42787 -40588 -47533 -48776 -42713 -28957 -20039 -15254 -27473 -22637 -19707
11498 -19707 -17963 -13004 -14310 -25344 -19681 -24128 -29513 -17032 -16088 -13677 3659 -11070 -28436
11485 -28436 -25616 -21899 975 21422 17023 14617 774 -8360 -10504 1235 12336 12064 4562
11472 4562 263 1349 -15913 -11458 -11736 -5679 -2924 -13642 -28468 -49648 -55209 -47374 -49250 -51044
11458e1044k173q733n447J5109K962P483J0397k155M622K3440P246O597O405j315
11444A3394j462L610N754N626q866O207R4J285J6651R304j744R285J2809P426
11430G9373J0113k371K7341K1411j48O079n88n96q612l947J2094l775k607k775
11416A30992L74k890j0136r791j0285o979J7795J5558q044j0830j641K5685o582
11403A23226j5587k7471k1737o675K083l242R09K075k3164k3443j6588k6136j7288
11390e3038J058J1051m752j3640j1608n516p477O136Q308L819Q073M833J3889
11377c8864K3618J0666J1173J0837J5910N044O440J4906K2485K4942K3312M884
11365A35353m717j2666K841O413J7506J4003J027P842K1738J4650K5411K4047
$$ plain form
11458 -51044 -53217 -61950 -67397 -52288 -49326 -41843 -31446 -33601 -28979 -5539 1707 8304 14709 13394
11444 13394 11932 15542 21296 26922 18056 24263 24357 25642 42293 51597 49853 59138 71947 79373
11430 79373 89486 87115 114456 135867 135719 141798 141210 140614 132002 128055 140149 136374 133767 130992
11416 130992 131366 128476 118340 108549 98264 91285 109080 124638 116594 105764 104123 129808 123226
11403 123226 107639 80168 58431 51756 53839 50597 51506 53581 30417 6974 -9614 -35750 -53038
11390 -53038 -51980 -40929 -45681 -59321 -70929 -76445 -83922 -77786 -69478 -65659 -57586 -52753 -38864
11377 -38864 -15246 -4580 6593 17430 33340 38384 44824 59730 82215 107157 130469 135353
11365 135353 130636 117970 120811 127224 144730 158733 159760 167602 189340 203990 229401 253448
11353B53448L1851J4008r234J8438K5667K3420Q036K1728J0108J2987l956n217
11341D01284L49j9652K323r979j7168O931J6889J8243M727M538J8000K538r516
11328D19507l127O852J6832o68j1265M877R18O201M392r023j9073J3572q543j5840
11314D05612m90K470O793Q566k1566q428J9989K3324J5088K0397K0049K5351L8459
11301E55614J8485L0192L5215M4921M1265K5047K7816L9661M5924K7569J9969
11290I11678L9916K5872L4349N5835O3210P6958Q6722R6326J23513J24723J18847
11279A757949J30151J54884J54024J50070J63789J87802K05197K22342K25750
11270C351958K56863K93495L08588L24646M09537N05088O24112Q06048J045307
$$ plain form
11353 253448 285299 299307 290073 308511 334178 357598 365634 387362 397470 410457 406501 401284
11341 401284 401633 381981 384304 374325 357157 364088 380977 399220 403947 408485 426485 429023 419507
11328 419507 416380 423232 440064 439396 428131 433008 433926 440127 444519 435496 416423 429995 421452 405612
11314 405612 405122 407592 414385 422951 401385 392957 412946 436270 451358 471755 491804 517155 555614
11301 555614 574099 604291 639506 684427 725692 750739 778555 818216 864140 891709 911678
11290 911678 951594 977466 1011815 1067650 1130860 1207818 1294540 1390866 1514379 1639102 1757949
11279 1757949 1888100 2042984 2197008 2347078 2510867 2698669 2903866 3126208 3351958
11270 3351958 3608821 3902316 4210904 4535550 4945087 5450175 6074287 6880335 7925642
11261G925642J352784J735437K152865K582310K967438L236889L299917L086601
11253B8339883K574176J859627J054505L99139P0338Q7025L93071P99033J144204
11244C6721001J302630J194421Q63506N15657K97923L27353O26553J147534J800643
11235D4797221K471982L170629L869117M441755M742203M575075L808229K590734
11227G4466945J108490l60981j502348j894907j516396p85606j30103J48885k3883
11218F9510096n13275j109693j570998j797674j832121j823849j806415j824970
11210E7231101j903551k026034k200898k330408k420400k471435k504409k459048
11202C8914918k327090k113377j870210j722579j651402j645053j583434j383957
$$ plain form
11261 7925642 9278426 11013863 13166728 15749038 18716476 21953365 25253282 28339883
11253 28339883 30914059 32773686 33828191 34227330 34297668 34384693 34777764 35576797 36721001
11244 36721001 38023631 39218052 40081558 40597215 40895138 41222491 41849044 42996578 44797221
11235 44797221 47269203 50439832 54308949 58750704 63492907 68067982 71876211 74466945
11227 74466945 75575435 75214454 73712106 71817199 70300803 69515197 69385094 69533979 69510096
11218 69510096 68996821 67887128 66316130 64518456 62686335 60862486 59056071 57231101
11210 57231101 55327550 53301516 51100618 48770210 46349810 43878375 41373966 38914918
11202 38914918 36587828 34474451 32604241 30881662 29230260 27585207 26001773 24617816
11194B4617816j063796o87837l19773L8053M19301P46497J046229J275672J398358
11185B7470520J435965J432814J414920J457015J685959J976330K180498K224809
11177D1278830K045419J716071J359748J119294J068499J151065J274496J432399
11169E2445821J541544J581482J683234J849882K000331K024948J851896J615902
11161F6595040J501589J692000K277742L122364L857504M095007L654546K489925
11153H9285717P58339j044918k424817l204737l565727l653308l510884l194919
11145F9444746k871349k653590k543591k548050k568121k496835k361104k046637
11137D9355469j627162j253549j065447j122552j433876j967130k599647l111787
$$ plain form
11194 24617816 23554020 22866183 22546410 22584463 23003764 23750261 24796490 26072162 27470520
11185 27470520 28906485 30339299 31754219 33211234 34897193 36873523 39054021 41278830
11177 41278830 43324249 45040320 46400068 47519362 48587861 49738926 51013422 52445821
11169 52445821 53987365 55568847 57252081 59101963 61102294 63127242 64979138 66595040
11161 66595040 68096629 69788629 72066371 75188735 79046239 83141246 86795792 89285717
11153 89285717 90044056 88999138 86574321 83369584 79803857 76150549 72639665 69444746
11145 69444746 66573397 63919807 61376216 58828166 56260045 53763210 51402106 49355469
11137 49355469 47728307 46474758 45409311 44286759 42852883 40885753 38286106 35174319
11129C5174319l325919l272834k994570k614770k202013j839197j539889j303783
11121A6081344j120755r83245q66945p60115o69037n96413n46077n12185m73890
11112I552682m45384m45591m15480l91843l83195l35079l32254l39688l18287
11103F145881k68926k73516k62123k55876k21047j97251j84357j74271j81891
11094D126623j53862j40195j38957j42014r8887j10240j16040j15771j12489j03125
11084B895043q6950p5685p8274r1423r0460o2703m9810n6916o4099n3560m4773
11073B140390n1725m4519n1937m9626n0794m2369k3787l2365m1563m8791l6838
11062A666076m8331j9521k7097l0172l6289q634k0606k7835l6638m1320k9917
$$ plain form
11129 35174319 31848400 28575566 25580996 22966226 20764213 18925016 17385127 16081344
11121 16081344 14960589 13977344 13110399 12350284 11681247 11084834 10538757 10026572 9552682
11112 9552682 9107298 8661707 8246227 7854384 7471189 7136110 6803856 6464168 6145881
11103 6145881 5876955 5603439 5341316 5085440 4864393 4667142 4482785 4308514 4126623
11094 4126623 3972761 3832566 3693609 3551595 3452708 3342468 3226428 3110657 2998168 2895043
11084 2895043 2808093 2732408 2654134 2562711 2472251 2409548 2359738 2302822 2238723 2185163 2140390
11073 2140390 2088665 2044146 1992209 1942583 1891789 1849420 1825633 1793268 1751705 1702914 1666076
11062 1666076 1617745 1598224 1571127 1540955 1504666 1496032 1475426 1447591 1410953 1369633 1339716
11051A339716j6425k6313k1754j2417k4988j6990q567j0932j5097p673l374k0070
11039A155116k5300k3760p257o23R166l639L052q428j7387K349M351j0177K086
11026A079549J8022L1337M4017M0845L5959O1718Q0582Q5260R2152P4735O7811
11015A711987M5059K6110o334n1600p6398o6279n2692l2683k8586k5509j980j2091
11003A429004j6825j2061k6823m787J1438m348j978M786l306j5648j3176J6799
10991A363075K1358J2826R874R216K777J0791K6957N6487L7964L3083K3958K7199
10979A635565J0534j0667n1444q0594r3914j01200j15259q1466o8012m1706l0790
10968I71047m4937k5342k2135j1014j6764k1121q202j751k8289j8681j2405q160
$$ plain form
11051 1339716 1323291 1296978 1275224 1262807 1237819 1220829 1212262 1201330 1186233 1178560 1175186 1155116
11039 1155116 1129816 1106056 1098799 1098176 1107342 1103703 1106755 1098327 1080940 1083289 1087640 1077463 1079549
11026 1079549 1097571 1128908 1172925 1213770 1249729 1311447 1392029 1477289 1569441 1644176 1711987
11015 1711987 1757046 1783156 1776822 1725222 1648824 1582545 1529853 1497170 1468584 1443075 1441095 1429004
11003 1429004 1412179 1400118 1373295 1368508 1379946 1375598 1373620 1378406 1375100 1359452 1346276 1363075
10991 1363075 1384433 1397259 1407133 1416349 1419126 1429917 1456874 1513361 1551325 1584408 1608366 1635565
10979 1635565 1646099 1635432 1583988 1503394 1409480 1308280 1193021 1111555 1043543 1001837 971047
10968 971047 926110 900768 878633 867619 850855 829734 821532 819781 791492 772811 760406 752246
10956G52246l1438j8973q602n235o51j4058k2938j1357j0760o776r638l2629j9488
10943E59703M195J2726J5540r447m706m689j316N625J7612j6924o285j1539J088
10930E61583o391p974n902j2240l757j4614j5706J086M678j2932o354J9584l832
10917D97229n507j0770p36J2233l477M10O70q497j2904K422k25j697l438j0676
10903D55037J7315O007k1210M133j2498j7605J956M588J1436N180R987L524j6676
10890D51174r141L693J0728L297j4293O243m470r742r554k0387P462O008j7067
10877D03951j0121J1400J7083n064k89n835q035j1438p062J5433l645n157J2141
10864D03362r71n985k037O187J0784k340J1179P093J0743J4901K4805J7951o710
$$ plain form
10956 752246 720808 701835 693233 687998 687347 673289 650351 638994 628234 621458 611820 579191 559703
10943 559703 563898 576624 592164 582717 578011 573322 572006 577631 595243 578319 572034 560495 561583
10930 561583 555192 547218 541316 529076 525319 510705 494999 496085 500763 487831 481477 501061 497229
10917 497229 491722 480952 480216 492449 488972 489382 490052 481555 468651 471073 470848 469151 465713 455037
10903 455037 472352 478359 457149 461282 448784 431179 433135 437723 449159 454339 464326 467850 451174
10890 451174 442033 445726 456454 459751 445458 451701 447231 437489 427935 407548 415010 421018 403951
10877 403951 393830 405230 422313 417249 416960 411125 403090 391652 384590 400023 396378 391221 403362
10864 403362 402391 396406 394369 400556 411340 409000 420179 427272 438015 452916 477721 495672 488962
10851D88962p186l784j3066K681k1159k0375k3039j9801l655P120l528j775O552
10838C87947Q671J318J2353r990l902j0925j6811m632L1168J4410J5367J392l378
10825D22988j310m066J7643K7622J0208J0077J5305K6316J3362n974N622J9323
10813E57116M501j0149o818p672j763j0818j985q7j2696J815Q65o322q992J591
10799D98586J2100J0137J6739J537J3717J6960J3081J6335K0955P414P920J4769
10787F50250J9487o621J1724p692r278q839r741k2019j1870J3885L94j8067k3514
10774E78099j7430m04O387J5658j1482k6023r487Jl094K0096L2320J2979Q94K7585
10760F26099K3139K2333k220k6578o9135l9245l1198l2727j618r472j2034p175
$$ plain form
10851 488962 481776 477992 464926 467607 446448 426073 403034 383233 379578 386698 383170 381395 387947
10838 387947 396618 397936 410289 400299 396397 385472 368661 364029 395197 409607 424974 426366 422988
10825 422988 421678 417612 435255 462877 473085 483162 498467 524783 538145 532171 537793 557116
10813 557116 561617 551468 544650 536978 535215 524397 522412 522325 509629 511444 512309 505987 496995 498586
10799 498586 510686 520823 537562 539099 552816 569776 582857 599192 620147 627561 635481 650250
10787 650250 669737 663116 674840 667148 657870 649031 639290 617271 605401 619286 619680 601613 578099
10774 578099 560669 560265 566652 582310 570828 544805 535318 535319 532225 552321 584641 597620 598514 626099
10760 626099 649238 671571 669351 642773 573638 534393 503195 470468 468850 459378 447344 440169
10748D40169j378J4451J9580K3183N794K9195K6248P470P504R962K2910L0279
10736F35367R155L1107L5429K4993J7556K9233M7200O0502P6942P0618N7149M3431
10724A138682L8784L4173M8731O8789O2501R3324J24009J35296J50435J19145
10714B013869P9468K3880o1675j50818j79256j57406r9450l9244j0773j3696r817
10703A395082j4444K1120K0948L493p575K422J3161J7690K0089K5137M1760L9801
10691A578684M6405N6023M1475R528n089k6228l4424k1894j4551p799p7N907J5005
10678A642965K8271M1884O1128Q7654J27528J35075J53152J81912J76268J71413
10668B807250J11224O3275l4341j27896j26489r1552o6436m0125l542j0160o411
$$ plain form
10748 440169 438791 453242 472822 496005 501799 530994 557242 564712 572216 582178 605088 635367
10736 635367 644522 675629 711058 736051 753607 782840 830040 890542 967484 1038102 1095251 1138682
10724 1138682 1177466 1211639 1260370 1329159 1391660 1484984 1608993 1744289 1894724 2013869
10714 2013869 2093337 2117217 2055542 1904724 1725468 1568062 1468612 1429368 1418595 1404899 1395082
10703 1395082 1380638 1401758 1422706 1426199 1418624 1421046 1434207 1451897 1471986 1497123 1538883 1578684
10691 1578684 1625089 1681112 1722587 1732115 1727026 1700798 1666374 1644480 1629929 1622130 1622053 1627960 1642965
10678 1642965 1671236 1713120 1774248 1861902 1989430 2124505 2277657 2459569 2635837 2807250
10668 2807250 2918474 2981749 2947408 2819512 2693023 2601471 2535035 2494910 2491368 2481208 2474797
10657B474797J3138j497K00q324j9773r963R039J2141J4368J6286K5027K0265
10645B545704K0487K5480M7630O1515K9540K4574K3635J4655L4582L0063L0171
10634B888036L4701N8076O6779Q6006J20422J23391J51894J91751K27782K63774
10624D212612K76465L13795L35869L48865L82270M73361N92611P42731R29294
10615H607873J134993J383795J638022J913367K220619K614870L165727L956767
10607B6636033N130979O894304R330532J2456481J6036394J9437195K1745465
10600A17667383K1910861J9220611J3608559N429446m092194j2219310j6361165
10593A45164191j6245064j3673732j0570857p854780n779383m311069l338691
$$ plain form
10657 2474797 2487935 2486438 2486638 2478314 2458541 2448578 2457617 2469758 2484126 2500412 2525439 2545704
10645 2545704 2566191 2591671 2639301 2700816 2730356 2754930 2778565 2793220 2827802 2857865 2888036
10634 2888036 2922737 2980813 3047592 3133598 3254020 3377411 3529305 3721056 3948838 4212612
10624 4212612 4489077 4802872 5138741 5487606 5869876 6343237 6935848 7678579 8607873
10615 8607873 9742866 11126661 12764683 14678050 16898669 19513539 22679266 26636033
10607 26636033 31767012 38661316 47991848 60448329 76484723 95921918 117667383
10600 117667383 139578244 158798855 172407414 177836860 173744666 161525356 145164191
10593 145164191 128919127 115245395 104674538 96819758 91040375 86729306 83390615
10586H3390615k656593k051335j389947o95986j6869N75965J105680J487166J777960
10577H1526656J985802K199020K421938K617063K854296L169360L569453M032197
10569A04375785M639335N466903O535491P823970R051491R748660R515478P763491
10561A64920604L951937j787584q483412j4636167j8730984j9976056j8430813
10554H6827525j5119094j1488475q381040o061212m473945l427597k768587k414905
10546C2692670k173989k021604j858875j657723j458787j285574j142643j085084
10538B0008391j052261j027955r78616r20934q64426q46977q34567q16422p93960
10529A1872273p39713o82288o17161n44757m70840m17911l65837l08339k56081
$$ plain form
10586 83390615 80734022 78682687 77292740 76596754 76579885 77155850 78261530 79748696 81526656
10577 81526656 83512458 85711478 88133416 90750479 93604775 96774135 100343588 104375785
10569 104375785 109015120 114482023 121017514 128841484 137892975 147641635 157157113 164920604
10561 164920604 168872541 167084957 158601545 143965378 125234394 105258338 86827525
10554 86827525 71708431 60219956 51838916 45777704 41303759 37876162 35107575 32692670
10546 32692670 30518681 28497077 26638202 24980479 23521692 22236118 21093475 20008391
10538 20008391 18956130 17928175 16949559 16028625 15164199 14317222 13482655 12666233 11872273
10529 11872273 11132560 10450272 9833111 9288354 8817514 8399603 8033766 7725427 7469346
10520G469346k36518k17099j96935j97175j71400j81847j92551j73962j30413
10511E771446j08958j34663j51672j78078j61349j57419j59700j61641j51316
10502D406650j37851j36113j45429j61578j74284j41211j37677j36592j25910
10493C110005j32495j16545r8870r1294j03146q6899q1673p8195n9710o9459n9192
10482B132527n5015m3452k2926k5097j2608J2900J6557K2363k71l427L8371L6647
10470B096569R247o974k5835m1812o6590p2898o3360o1934p7068n2484o1228o2639
10458A512994m1348n0003o3894m8329j9275j0940o256K0295L7852N7442N0068
10447A438606K4895L3690K2317R324j1679m945J4248J9400J7274l072j8786j9053
$$ plain form
10520 7469346 7232828 7015729 6818794 6621619 6450219 6268372 6075821 5901859 5771446
10511 5771446 5662488 5527825 5376153 5198075 5036726 4879307 4719607 4557966 4406650
10502 4406650 4268799 4132686 3987257 3825679 3651395 3510184 3372507 3235915 3110005
10493 3110005 2977510 2860965 2762095 2670801 2567655 2480756 2399083 2320888 2261178 2191719 2132527
10482 2132527 2077512 2034060 2011134 1986037 1973429 1986329 2002886 2025249 2024978 2021551 2059922 2096569
10470 2096569 2105816 2098842 2073007 2031195 1964605 1891707 1828347 1766413 1689345 1636861 1575633 1512994
10458 1512994 1471646 1421643 1357749 1309420 1290145 1279205 1272949 1293244 1331096 1388538 1438606
10447 1438606 1463501 1497191 1519508 1528832 1517153 1512208 1526456 1545856 1563130 1560058 1541272 1522219
10435A522219N47m089L3511P5202Q6241P3231L3953r901k8992l0546m2958m7277
10423A661141l9866k9373l6283l0306l7489k8508k3727p87J2001n034p12J3530
10411A454587J0663J9308M0703M8786L6132J2884J4100o64j7863k3643j2167j2846
10399A569980k1269k5628j0527Q6k2992O255J1353j0607j1665k614o447K7652
10387A503577N5926Q0481J19458J27886R7414M1306J7345O254J2358k682K821
10376B062144R600K4783M7686N9074P5224J03204J16711J50360J50226J88072
10366B987084K48001K93667L17026L63845M00236M81705N67817O55591P89991
10357G104963R99604J370121J896842K585146L657108N115403O803092Q258254
$$ plain form
10435 1522219 1522766 1518677 1552188 1627390 1713631 1786862 1820815 1810914 1781922 1751376 1708418 1661141
10423 1661141 1621275 1591902 1555619 1525313 1487824 1459316 1435589 1434802 1446803 1441769 1441057 1454587
10411 1454587 1465250 1484558 1525261 1574047 1610179 1623063 1637163 1636499 1618636 1594993 1582826 1569980
10399 1569980 1548711 1523083 1512556 1512642 1489650 1495905 1507258 1496651 1484986 1482372 1475925 1503577
10387 1503577 1559503 1639984 1759442 1887328 1984742 2026048 2043393 2049647 2062005 2059323 2062144
10376 2062144 2071744 2096527 2144213 2203287 2278511 2381715 2498426 2648786 2799012 2987084
10366 2987084 3235085 3528752 3845778 4209623 4609859 5091564 5659381 6314972 7104963
10357 7104963 8104567 9474688 11371530 13956676 17613784 22729187 29532279 37790533
10349C7790533Q759680P963324N977675K401637l001193q220806j0408328r224479
10341C2038043o678368m469989l006571k043343j412403j062832r20021p79097
10333A1665419n92237m67702l86047k89936j88628j08891n2668j2323k3625r150
10323I534212Q8958J86166K94248M78006O59655Q27134J039820J244874J463469
10314A5816542J745836K083003K523902L272387M503403O271091Q722338J2147997
10306E7086499J6766034K2161706K6809471K8281511K4598039J6738006N827260
10299A98268526j1212152l0599926l8090326l0778520k0442503j3185293q778743
10292D5181063o015490m186525l000714k220155j731228j451357j292912j132026
$$ plain form
10349 37790533 46550213 54513537 60491212 62892849 59891656 51670850 41262522 32038043
10341 32038043 25359675 20889686 17883115 15839772 14427369 13364537 12444516 11665419
10333 11665419 11073182 10605480 10219433 9929497 9740869 9631978 9579310 9566987 9543362 9534212
10323 9534212 9623170 9809336 10103584 10581590 11241245 12068379 13108199 14353073 15816542
10314 15816542 17562378 19645381 22169283 25441670 29945073 36216164 44938502 57086499
10306 57086499 73852533 96014239 122823710 151105221 175703260 192441266 198268526
10299 198268526 187056374 156456448 118366122 87587602 67145099 53959806 45181063
10292 45181063 39165573 34979048 31978334 29758179 28026951 26575594 25282682 24150656
10284B4150656r87651q48354o51770n11556n49256o55208o50370n85977m25348
10275A8285166k37604j039K54274M85177P38418J006064J282541J622824K020603
10266B5456424K558400L490060M948440O987344R799295J3704770J8816871K4384775
10258A10146379K8564836K8753878K3453761J4385236J613641j7688313l5975659
10251A53253759l9019849k9324909j9096743j2405124q347759n773882m057766
10244C5227727k940599k223669j812269j593254j435892j280473j162745j029291
10236B1749535q41525p42101q16395r67051r86380q94737p99269o73226n36151
10227A4492700l74568k34720j33949k570J23877K56629M42186P02980J118429
$$ plain form
10284 24150656 23163005 22314651 21662881 21151325 20602069 19946861 19296491 18710514 18285166
10275 18285166 18047562 18046523 18300797 18785974 19524392 20530456 21812997 23435821 25456424
10266 25456424 28014824 31504884 36453324 43440668 53239963 66944733 85761604 110146379
10258 110146379 138711215 167465093 190918854 205304090 206917731 189229418 153253759
10251 153253759 114233910 84909001 65812258 53407134 45059375 39285493 35227727
10244 35227727 32287128 30063459 28251190 26657936 25222044 23941571 22778826 21749535
10236 21749535 20908010 20165909 19349514 18382463 17396083 16501346 15702077 15028851 14492700
10227 14492700 14118132 13883412 13749463 13746893 13870770 14127399 14569585 15272565 16390994
10218A6390994J698128K511131L643285N220634P103693Q827129R573429Q871060
10210F3839483O794355L021186k795456r009488j2242032j1397938q554129n855344
10202B3800637l974798k758267j937883j397408j042113q33613p12321o33451
10194A0510783n89478n32123m78286m31621l66529l45075l82068m03649l88011
10185F593943l80775l37532k87410k39811j98132j46164j21660j11297q3808o5198
10175D622156p1617r2297j12813j46301k11114k32079k31179k12355j65523j21959
10165C024919j22189j19785j07791r4627r3939j01278q9428o5730n4701m2579
10155B132872k6050k8365j1119q136j574k6467k070p391J177k007j109J0071K7349
$$ plain form
10218 16390994 18089122 20600253 24243538 29464172 36567865 45394994 54968423 63839483
10210 63839483 70633838 73655024 70859568 61850080 49608048 38210110 29655981 23800637
10202 23800637 19825839 17067572 15129689 13732281 12690168 11856555 11144234 10510783
10194 10510783 9921305 9389182 8910896 8479275 8112746 7767671 7385603 6981954 6593943
10185 6593943 6213168 5875636 5588226 5348415 5150283 5004119 4882459 4771162 4687354 4622156
10175 4622156 4550539 4458242 4345429 4199128 3988014 3755935 3524756 3312401 3146878 3024919
10165 3024919 2902730 2782945 2675154 2580527 2486588 2385310 2295882 2230152 2175451 2132872
10155 2132872 2106822 2078457 2067338 2059202 2057628 2031161 2029091 2021700 2022877 2020870 2019761 2029832 2057181
10142B057181K6235K6264L7862O6344M9520R524J4925j959o3211j08845j30331
10131A983509j39307j34889r1293n2089k6309j3595k0213n0015n7966l5453n2597
10120A309783m3819m4512l1915j9931k7160j1617j3490p733j5678j8659K820J4242
10108A092331l565M105K6247L0771P689K0750K7850q833k7327k9176k3660L476
10096A120658j2077k1841j9040r029K47p505J0136K3925J8136Q295J574L7133
10084A150612O7201P5373J03595J10022Q7610P8592l3713j78637j90973j28181
10074A141501j01584o7844l8611k0686k205j3100k3156j5409q502J4799N796j5114
10062H55885n981N60R563n4J7419L7700J4537j2194j5522o285j2003k5149l1852
$$ plain form
10142 2057181 2083416 2109680 2147542 2213886 2263406 2272930 2287855 2285896 2222685 2113840 1983509
10131 1983509 1844202 1709313 1618020 1565931 1539622 1526027 1505814 1455799 1397833 1362380 1309783
10120 1309783 1265964 1221452 1189537 1169606 1142446 1130829 1117339 1109606 1093928 1075269 1078089 1092331
10108 1092331 1088766 1092871 1119118 1149889 1157578 1178328 1206178 1197345 1170018 1140842 1117182 1120658
10096 1120658 1108581 1086740 1067700 1058671 1058918 1051413 1061549 1085474 1103610 1111905 1113479 1150612
10084 1150612 1217813 1293186 1396781 1506803 1594413 1673005 1639292 1460655 1269682 1141501
10074 1141501 1039917 972073 933462 912776 910571 897471 874315 858906 850404 865203 870999 855885
10062 855885 849904 850464 860027 859973 877392 915092 929629 917435 901913 895628 883625 858476 826624
10049H26624l3540m490k0792j5716j1113Q306L280N56j5845q516o391m200R162
10036G27325q78J0811J2174n593L177j985j8188q449j2520r702j2003k1312m975
10023F57882J578P814Q017o551r577J501j453Q08J7514J4666p583n063n807m906
10009F68840j3505L537j664j6772o560n791q213J8602L936n77k093j6894q703
9996F14143j0122k1879l3253j8294j794J7897p707K5767L6252j563j5746j3551
9984E70150q443R812l370J0043J6300J2419l830J707K582M680L174K406J1614
9971F29244J6618L5755K6673K2351J9961J8520l226j8899n3097m4808k6246p919
9959F14927o48m611n387n880J4138Q107L708P614J8230o512j9776P81J2558K711
$$ plain form
10049 826624 793084 788594 767802 752086 740973 749279 752559 753115 737270 728754 722363 718163 727325
10036 727325 726447 737258 749432 743839 747016 745031 726843 718394 705874 696172 684169 662857 657882
10023 657882 659460 667274 675291 668740 659163 660664 659211 660019 677533 692199 684616 679553 673746 668840
10009 668840 655335 658872 657208 640436 633876 628085 619872 638474 642410 641833 639740 622846 614143
9996 614143 604021 582142 548889 530595 528801 546698 538991 564758 601010 599447 583701 570150
9984 570150 561707 571519 568149 578192 594492 606911 603081 604788 607370 612050 615224 617630 629244
9971 629244 645862 681617 708290 730641 750602 769122 765896 746997 693900 649092 622846 614927
9959 614927 614279 609668 604281 598401 612539 620646 624354 631968 650198 643686 623910 624691 637249 639960
9945F39960P357J6054L4040L5080M3972N0005J5162k6K645m977k3547l8J1751
9932H27438R416L4623N7246N2274M6147J7957l610q811k4558n3120m6799l5793
9920H72410k6247k6725m3601m4645j5114j9489j3922k176j2078p872o984k236
9908F51321R47j3214k681Q654J932l46o512j1643r486N110J586Q748J6326L689
9894F54431J1678J2937N773K4122M2475M3234P8318Q2248Q2114J16654J30936
9883A284920J31004J12209Q1519N80o3231j32774j52503r5681o3208m3915R323
9872A068243J4811J7474J2214L5378J2563J9360l821j6444k2108k8211l6626l5897
9860A036936l5516k0290k2125J869J3433Q777j592L402J2077j320J0491J9912
$$ plain form
9945 639960 647317 663371 697411 732491 776463 826468 841630 841604 844249 839272 815725 815687 827438
9932 827438 836854 871477 928723 980997 1027144 1045101 1041491 1032680 1008122 955002 908203 872410
9920 872410 846163 819438 775837 731192 716078 696589 682667 680491 668413 660541 653557 651321
9908 651321 652268 639054 636373 645027 646959 646613 640101 628458 618972 624082 625668 634416 650742 654431
9894 654431 666109 679046 684819 708941 751416 794650 872968 955216 1037330 1153984 1284920
9883 1284920 1415924 1528133 1609652 1610232 1547001 1414227 1261724 1166043 1102835 1058920 1068243
9872 1068243 1083054 1100528 1112742 1148120 1160683 1180043 1176222 1159778 1137670 1109459 1072833 1036936
9860 1036936 1001420 981130 959005 960874 974307 983084 981492 984894 996971 995651 1006142 1026054
9848A026054m941j784J1699J3853O416N115J5808O2811P1528J01280J36812J24503
9836A569154P7519N2608k0995j11557j95012j89511j34300j10062m4900m3340
9826H49604m2301q820j2617j9077j1939q0j848j0570m378l649r393o680m490L768
9812G17530J1555K3681Q072j781J6551J8290J4361J9157N911R20J0858L8763K1703
9799I05571K6240K3095K5500L3639L1183L7975L4563K5061L7266L0847N48m4294
9787A167194o3897o6996o6230n4110l2008r007q039R47J0665q702j8249k2354
9775H29214k5431l2466k8436k3056M017j7315r299j7016k7758p796j5645j7252
9763F11761N519l277J635o704o056q95m041Q117J4275k563L331j3907j5647k421
$$ plain form
9848 1026054 1021113 1019329 1031028 1044881 1051297 1056412 1072220 1135031 1206559 1307839 1444651 1569154
9836 1569154 1646673 1699281 1678286 1566729 1371717 1182206 1047906 937844 892944 849604
9826 849604 807303 798483 785866 766789 754850 754770 752922 742352 737974 734325 724932 718252 713762 717530
9812 717530 729085 752766 760838 759057 775608 793898 808259 827416 833327 834247 845105 883868 905571
9799 905571 931811 954906 980406 1014045 1045228 1083203 1117766 1142827 1180093 1210940 1211488 1167194
9787 1167194 1103297 1036301 970071 915961 883953 874946 866907 867854 878519 869817 851568 829214
9775 829214 803783 771317 742881 719825 723842 706527 697228 680212 652454 644658 629013 611761
9763 611761 617280 614003 615638 608934 602878 601983 597942 606059 620334 617771 621102 607195 591548 589127
9749E89127j944J5492J0859J329r3P608K718J6414K202N069P498j9964j3940n81
9735F21794J249J1796j441l433J4457R733o591J5096J3878J4502J9409j865l552
9722G05032j020r595k42p36J2622K4494J6793K2250j3460j5994q49J1295r764
9709G40826o410J26J303J1123q700l407N053J1560R310J3613K7535K7526m70K1296
9695H50284J3711L592j5906j7580Q334R355K2605l171R755l840J1105J5420J3736
9682I17400R537N948J3284l347J1028K6322Q846n872R864Q140j8842j9065l155
9669I60088q568o630J5487J3063J6484K3665K4239J143m773j751j737j3670j631
9656A015409P610j0563j8384k0614j4418N608M594K708J9510j4578m827J0882
$$ plain form
9749 589127 587183 602675 613534 614863 614770 622378 625096 641510 643712 648781 656279 636315 622375 621794
9735 621794 623043 634839 633398 629965 644422 654155 647564 662660 676538 691040 710449 708584 705032
9722 705032 704012 694417 694175 693439 706061 730555 747348 769598 756138 740144 739295 750590 740826
9709 740826 734416 734542 735845 746968 738268 734861 739914 751474 760784 774397 801932 829458 828988 850284
9695 850284 863995 867587 851681 834101 842435 851790 874395 871224 880979 877139 888244 903664 917400
9682 917400 926937 932885 946169 942822 953850 980172 989018 983146 993010 1001150 982308 963243 960088
9669 960088 951520 944890 960377 973440 989924 1013589 1037828 1038971 1034198 1032447 1030710 1017040 1015409
9656 1015409 1023019 1012456 994072 973458 959040 964648 969242 971950 991460 976882 972055 982937
9644I82937K7764J5029K456J6844L950j4260L767K5675J3269o491l353M336p54
9631A071169o342j5718q790M273J8912L5194K7499L0161K8030K3196N4249L5910
9619A297743J9109K8431L2427J7372N3610M3693M3885N3872O6383O4123O6823
9608A787471N7837O8147O2506O2534Q6422P9609N7666J9623Q626L2342M7250M2065
9596B412098J8968L0234J0924J228K1038M235J5766L0593L1533J8381L8235N2323
9584B685556N6208P2790Q7596J10643R6680O9399R5120J24217J18266J19861J30201
9573C766537J29833J13587Q7058N2862O1180Q3938R9306J28203J60885J78081
9563D861470K02084K47081L23146L80020M68700N47556O44346P56689Q79964R88701
$$ plain form
9644 982937 1010701 1025730 1028186 1045030 1048980 1034720 1038487 1064162 1077431 1070940 1067587 1071923 1071169
9631 1071169 1064827 1049109 1040319 1044592 1063504 1098698 1126197 1156358 1184388 1207584 1261833 1297743
9619 1297743 1316852 1345283 1377710 1395082 1448692 1492385 1536270 1590142 1656525 1720648 1787471
9608 1787471 1845308 1913455 1975961 2038495 2124917 2204526 2262192 2281815 2290441 2322783 2370033 2412098
9596 2412098 2431066 2461300 2472224 2473452 2494490 2498725 2514491 2545084 2576617 2594998 2633233 2685556
9584 2685556 2741764 2814554 2902150 3012793 3109473 3178872 3273992 3398209 3516475 3636336 3766537
9573 3766537 3896370 4009957 4097015 4149877 4211057 4294995 4394301 4522504 4683389 4861470
9563 4861470 5063554 5310635 5633781 6013801 6482501 7030057 7674403 8431092 9311056 10299757
9553A0299757J122502J254029J382402J505529J676699J873978K113555K340031
9545B3568482K493682K523242K478060K333380J995366J443369Q66529L76707
9537C8078817m5716m13490o39805p09068o18010l92360j07665J91744L93582M09078
9527C6147107J78889j68120m53664o96278r54685j097760j030303q43881o50211
9518C0431094n41340n86527p45142j011264j231023j340429j339161j249251j104987
9509B1281970r35915p97468o34934n06617l75873k70585j68223o7751N3438J57878
9499A7735920K15501K58173K65271K48733K13780J92374K14936K38471L19633
9490A9902792M55443O23189Q36574J084714J368993J639410J947886K316118K669434
$$ plain form
9553 10299757 11422259 12676288 14058690 15564219 17240918 19114896 21228451 23568482
9545 23568482 26062164 28585406 31063466 33396846 35392212 36835581 37702110 38078817
9537 38078817 38033101 37619611 36979806 36270738 35652728 35260368 35152703 35344447 35738029 36147107
9527 36147107 36325996 36157876 35704212 35007934 34053249 32955489 31925186 31081305 30431094
9518 30431094 29889754 29303227 28558085 27546821 26315798 24975369 23636208 22386957 21281970
9509 21281970 20346055 19548587 18913653 18407036 18031163 17760578 17592355 17524604 17578042 17735920
9499 17735920 17951421 18209594 18474865 18723598 18937378 19129752 19344688 19583159 19902792
9490 19902792 20358235 20981424 21817998 22902712 24271705 25911115 27859001 30175119 32844553
9481C2844553L040755L393321L691344L902499L981449L960807L860466L678869
9473F2354063L468790L188267K819594K433026K008614J582265J064821L56429
9465G9275869k72528o64292r50361j244717j401455j365779j252310j173767j117243
9456F9833417r43639p21244o89581r55713j278195j519918j852950k275616k598417
9447E6998144k694889k662837k620626k511023k319705k188709k200780k237065
9439C7562510k214110k024102j707366j353510j072958q55163o47877m43455k87622
9430B6956347j93896j83335k31787l15080m47900n06079m97825m35117k94563
9421B3850765j31983L2303K09038L30796M05902M49465N03943N64799O35821P40278
$$ plain form
9481 32844553 35885308 39278629 42969973 46872472 50853921 54814728 58675194 62354063
9473 62354063 65822853 69011120 71830714 74263740 76272354 77854619 78919440 79275869
9465 79275869 79003341 78339049 77388688 76143971 74742516 73376737 72124427 70950660 69833417
9456 69833417 68889778 68168534 67478953 66523240 65245045 63725127 61872177 59596561 56998144
9447 56998144 54303255 51640418 49019792 46508769 44189064 42000355 39799575 37562510
9439 37562510 35348400 33324298 31616932 30263422 29190464 28335301 27687424 27243969 26956347
9430 26956347 26762451 26579116 26347329 26032249 25584349 25078270 24580445 24145328 23850765
9421 23850765 23718782 23751085 23960123 24290919 24696821 25146286 25650229 26215028 26850849 27591127
9411B7591127Q41010R37622J012782J089849J205782J309101J423929J511189
9403C6922391J530248J484382J354236J143760Q91461O36221M13088J58500j13537
9394D4420750l31159m73655n55621n27887m38224m18459n44025n93077m86692
9385D0051951l83162l91232n00146o24332p72574r66845j268017j563831j810548
9376C1771264j975806k100738k097894j939086j689155j466609j274419j067588
9368A8159969r02879p81976o98251o56052n95001n37751m73327m18798l76215
9359A2719719l80949m10288m36100m27792l84141l37457k65180k20537j62679
9350I694596q6099m3547k5090j3074k3148l2463m1186l3028k8136j7521m9463
$$ plain form
9411 27591127 28432137 29369759 30382541 31472390 32678172 33987273 35411202 36922391
9403 36922391 38452639 39937021 41291257 42435017 43326478 43962699 44375787 44534287 44420750
9394 44420750 44089591 43615936 43060315 42532428 42094204 41675745 41131720 40538643 40051951
9385 40051951 39668789 39277557 38777411 38153079 37380505 36413660 35145643 33581812 31771264
9376 31771264 29795458 27694720 25596826 23657740 21968585 20501976 19227557 18159969
9368 18159969 17257090 16475114 15776863 15120811 14525810 13988059 13514732 13095934 12719719
9359 12719719 12338770 11928482 11492382 11064590 10680449 10342992 10077812 9857275 9694596
9350 9694596 9608497 9564950 9539860 9526786 9503638 9471175 9429989 9396961 9368825 9351304 9301841
9339I301841o7767q9597j32757j57244j64883j54364j13898p1103o7942o9315
9329H212971m4527k6426P385N2290J13116J63565K14623K60878K72938K51463
9319I478276K42891K09554K06348J91756K17807L08891M15935N77600P27928Q36218
9309A3413204R03462R27290R28390R46060R33705R61742J012499J079300J173932
9300B2279584J252785J329355J373732J363254J285530J217095J230952J367247
9292C2699534J528697J639710J682479J657510J525468J404129J310411J308286
9284D4756224J354256J342749J293002J231496J146702J092220J159262J386529
9276E4762440J645905J912287K089483K198138K189105J921622J336522M87885
$$ plain form
9339 9301841 9234074 9144477 9011720 8854476 8689593 8535229 8421331 8350228 8282286 8212971
9329 8212971 8168444 8142018 8149403 8201693 8314809 8478374 8692997 8953875 9226813 9478276
9319 9478276 9721167 9930721 10137069 10328825 10546632 10855523 11271458 11849058 12576986 13413204
9309 13413204 14316666 15243956 16172346 17118406 18052111 19013853 20026352 21105652 22279584
9300 22279584 23532369 24861724 26235456 27598710 28884240 30101335 31332287 32699534
9292 32699534 34228231 35867941 37550420 39207930 40733398 42137527 43447938 44756224
9284 44756224 46110480 47453229 48746231 49977727 51124429 52216649 53375911 54762440
9276 54762440 56408345 58320632 60410115 62608253 64797358 66718980 68055502 68543387
9268F8543387m99529j383839j999964k306414k328654k182519j951781j654369
9260E4236318j282292q95533n89322m06416l71675m18501n31167o66071q26848
9251D8248493r66071j018145j059702j119589j108609r56510o73628l40798p686
9242D0997755K89113N16051O32810O16736M97525L52523K21761J47934J65716
9233D4437924L22207N78853Q68237J034889J084164J006412Q28498P03642O62228
9224E1527054O56461P01635P68720Q46356R36006J054471J126379J154994J184418
9215E9956494J162105J095228R48248O10011J09783m57105r80622j289092j354499
9206E9800551j136600p43364l69505j24786j3340N7804O2379j3036j38785k86509
$$ plain form
9268 68543387 68043858 66660019 64660055 62353641 60024987 57842468 55890687 54236318
9260 54236318 52954026 52058493 51469171 51062755 50691080 50272579 49741412 49075341 48248493
9251 48248493 47282422 46264277 45204575 44084986 42976377 42019867 41346239 41005441 40997755
9242 40997755 41286868 41802919 42435729 43052465 43549990 43902513 44124274 44272208 44437924
9233 44437924 44760131 45338984 46207221 47242110 48326274 49332686 50161184 50864826 51527054
9224 51527054 52183515 52885150 53653870 54500226 55436232 56490703 57617082 58772076 59956494
9215 59956494 61118599 62213827 63162075 63772086 63881869 63424764 62444142 61155050 59800551
9206 59800551 58663951 57920587 57551082 57426296 57412956 57470760 57533139 57520103 57381318 57094809
9196E7094809m85231q49827j394851j975752k379496k529867k388697k090071
9188D3001017j721242j332627r87290p33376o25088o68919q53170j036126j131479
9179C3911700j136694j060715r67308r34338r93916j081310j207131j331047j409038
9170B3790203j441854j408478j395696j352930j248949j107480r71378q45297
9162A4018141p06418n75396m63991l89683l29239k69542k07029j46051j23088
9153A0807704j19939j14645j46700j57531j65847j80912j92696k23293k75851
9144I230290k95983l36746l82318l72655l43056l50162k84179k07191j65380j37603
9134F355017j17635j16181j24381j48639j19680j31181j22263j21888j17929j03477
$$ plain form
9196 57094809 56609578 55759751 54364900 52389148 50009652 47479785 45091088 43001017
9188 43001017 41279775 39947148 38959858 38226482 37601394 36932475 36079305 35043179 33911700
9179 33911700 32775006 31714291 30746983 29812645 28818729 27737419 26530288 25199241 23790203
9170 23790203 22348349 20939871 19544175 18191245 16942296 15834816 14863438 14018141
9162 14018141 13311723 12736327 12272336 11882653 11553414 11283872 11076843 10930792 10807704
9153 10807704 10687765 10573120 10426420 10268889 10103042 9922130 9729434 9506141 9230290
9144 9230290 8934307 8597561 8215243 7842588 7499532 7149370 6865191 6658000 6492620 6355017
9134 6355017 6237382 6121201 5996820 5848181 5728501 5597320 5475057 5353169 5235240 5131763
9124E131763j13558j43737j36281j17750r6432j02990q0858o4934n9711n5498
9114D160014p6847q0659j24548j47357j60690j66510j64021j61052j27478j12224
9104B838628r4491q6250p0448p4831o5024p3100p1209n4804l4039l616o353k6282
9092B178181l0688j5591j4136k8054j6321j9091l8078k6344j3046p311j2914j0306
9080A946301k6444k8988j0657P891J1993L2927K3029n579M826l216p369M09J4264
9067A959387K19n810l924j0925j51N158l4905q954l1061l5940m7482m2416j3298
9054A729898k1310l1340j7474M131L45p332o673j2871q466j2263j8084k0150j6062
9041A562349q689k5932m2135k7594j2810j8611l2193l6521j1805p704m832p646
$$ plain form
9124 5131763 5018205 4874468 4738187 4620437 4524005 4421015 4340157 4275223 4215512 4160014
9114 4160014 4083167 4002508 3877960 3730603 3569913 3403403 3239382 3078330 2950852 2838628
9104 2838628 2744137 2657887 2587439 2512608 2447584 2374484 2303275 2248471 2214432 2210816 2204463 2178181
9092 2178181 2147493 2131902 2117766 2089712 2073391 2054300 2016222 1989878 1976832 1969521 1956607 1946301
9080 1946301 1919857 1890869 1880212 1888103 1900096 1933023 1956052 1950473 1955299 1952083 1944714 1945123 1959387
9067 1959387 1959606 1953796 1949872 1938947 1938796 1943954 1909049 1900095 1869034 1833094 1785612 1743196 1729898
9054 1729898 1708588 1677248 1659774 1663905 1664250 1656918 1650245 1637374 1628908 1616645 1598561 1578411 1562349
9041 1562349 1553660 1527728 1485593 1457999 1445189 1426578 1394385 1357864 1346059 1338355 1333523 1325877
9029A325877j0032j6885j1251l1113J364o730j2999J199K20n091M091Q308r794
9016A237164O854n933k8411j3382o289Q001j1894j1327j1823N425K2073P224R
9003A197691k951o128J1060J0176J562N173n786J9240L2235K4864L3387R661P598
8990A337782P721j751J6437o182j7110k4255k6031j0764j4059m815L152J1420
8978A271545q446j9217p635M970J3878n279k9204n679M360j5015j7946p386r407
8965A169539J2395J135l2887l0143k3253o786r102k3775J7222j310j6797j8429
8953A037809q957j5685j1666j2675q763P292p954J2253J7743J8158O922L921P604
8940A046002j8253j296p11j3095N42j497J862R805l048J32J5278R648L266N57
$$ plain form
9029 1325877 1315845 1298960 1287709 1256596 1257960 1251230 1238231 1239430 1239650 1234559 1238650 1246958 1237164
9016 1237164 1244018 1238085 1209674 1196292 1190003 1198004 1186110 1174783 1162960 1168385 1190458 1197682 1197691
9003 1197691 1194740 1188612 1199672 1209848 1211410 1216583 1210797 1230037 1262272 1287136 1320523 1330184 1337782
8990 1337782 1345503 1343752 1360189 1354007 1336897 1312642 1286611 1275847 1261788 1256973 1260125 1271545
8978 1271545 1263099 1243882 1236247 1241217 1255095 1249816 1220612 1214933 1219293 1204278 1186332 1178946 1169539
8965 1169539 1181934 1183069 1150182 1120039 1096786 1090000 1080898 1057123 1074345 1073035 1056238 1037809
8953 1037809 1028852 1013167 1001501 988826 980063 987355 979401 991654 1009397 1027555 1034477 1038398 1046002
8940 1046002 1027749 1026453 1025742 1012647 1013189 1011692 1013554 1023359 1020311 1020443 1035721 1045369 1048635 1049192
8926A049192R193J8259J2605J6990K1785J5266J5714K2908K6792J9812J4337j2948
8914A229905l674j908n377m874k3174N255o607K0770O877r879J7072K6441R563
8901A260390J2215K7104K3397M0786K5769J7014J8985N802P524l308j1551j6987
8889A407140j3263P362m783k0744k9298p015P541J7906K0155J6314L659o182r174
8876A389618j8665j7444J6900M592p026j489j3575j810m162k1458j4840l625L255
8863A310271l4094k0130L191P083k486j0657n916r061r672j0450n81n652m909
8850A206937L18k179J7125Q613J2622P410J7683L0313L8541J508K219m534R774
8837A346350j0618J1323j7176k2150j9916j0699o52o443r992l61P727J4963J6227
$$ plain form
8926 1049192 1058385 1076644 1089249 1106239 1128024 1143290 1159004 1181912 1208704 1228516 1242853 1229905
8914 1229905 1226231 1224323 1218946 1214072 1190898 1196153 1189546 1210316 1217193 1207314 1224386 1250827 1260390
8901 1260390 1272605 1299709 1323106 1363892 1389661 1406675 1425660 1431462 1438986 1435678 1424127 1407140
8889 1407140 1393877 1401239 1396456 1375712 1346414 1339399 1346940 1364846 1385001 1401315 1404974 1398792 1389618
8876 1389618 1370953 1353509 1370409 1375001 1367975 1366486 1352911 1351101 1346939 1325481 1310641 1307016 1310271
8863 1310271 1276177 1256047 1259238 1266321 1263835 1253178 1247262 1238201 1228529 1218079 1217498 1211846 1206937
8850 1206937 1207255 1205076 1222201 1230814 1243436 1250846 1268529 1298842 1337383 1338891 1341110 1336576 1346350
8837 1346350 1335732 1347055 1329879 1307729 1287813 1277114 1276462 1270019 1260027 1259666 1267393 1282356 1298583
8824A298583J9492K9016M0846L6342M6807M2273L2821K8440J2162k132j2955j5138
8812A556557k8449k7497k0942k361j0933k0932J2482J6403J8217N026J7037L2421
8800A547029J3589M435M191P946j1615j2998j2893k6846k9585j8222j6462n744
8788A442825L25j1846m119o014j2756P354K0023J3629j0412o78j1147j0551k1236
8775A395397j7084k2086j0654j801J2052j6J2040o181J283J0994K1028J4063J932
8762A410967j7370j7107j4930k2422q652o211o913j3019r804q960o413J4345J4634
8749A308145o763P553K4822J4195l228J914J0823n739J4028K815j1257J2864J832
8736A372004k5813l1915J327P05K174M13L789J7035l956P72K342L1120J5437K0354
$$ plain form
8824 1298583 1318075 1347091 1387937 1424279 1471086 1513359 1546180 1574620 1586782 1584650 1571695 1556557
8812 1556557 1528108 1500611 1479669 1477308 1466375 1445443 1457925 1474328 1492545 1497571 1514608 1547029
8800 1547029 1560618 1565053 1569244 1577190 1565575 1552577 1539684 1512838 1483253 1465031 1448569 1442825
8788 1442825 1443150 1431304 1427185 1421171 1408415 1415769 1435792 1449421 1439009 1438331 1427184 1416633 1395397
8775 1395397 1378313 1356227 1345573 1343772 1355824 1355808 1367848 1361667 1362950 1373944 1394972 1409035 1410967
8762 1410967 1393597 1376490 1361560 1339138 1330486 1324275 1317362 1304343 1294539 1285579 1279166 1293511 1308145
8749 1308145 1301382 1308935 1333757 1347952 1344724 1346638 1357461 1351722 1365750 1368565 1357308 1370172 1372004
8736 1372004 1346191 1314276 1315603 1316308 1318482 1318895 1322684 1339719 1335763 1336535 1338877 1369997 1385434 1405788
8722A405788P33K35m205n696M520k851J1195J9703L3111L0379K6853L3633N1542
8709A604940M9602O6460Q8688J26188J53154J77069K14620K72145K90321K58424
8699C301611K18781J30968l8348j68703k76141k76955k13111j53843q6812m6581
8689B390866o445L0964Q0956J23459J43955J64475K01629K24679K05249J64078
8679C723865R3202K7944m5429j15628j65053j74839j50550j01725m7187J1588
8669C056188O3697Q6247J41126K00521K76389L74708M53051M93083M81955M03020
8659F029985K67638O7915j42542k53274k61404k00998j20148n6577k2270l5994
8649E272331p6322j07287l2306P0052J16860J58130K15675K29448K10072J61237
$$ plain form
8722 1405788 1406521 1406756 1402551 1396855 1401375 1398524 1409719 1429422 1462533 1492912 1519765 1553398 1604940
8709 1604940 1654542 1721002 1809690 1935878 2089032 2266101 2480721 2752866 3043187 3301611
8699 3301611 3520392 3651360 3613012 3444309 3168168 2891213 2678102 2524259 2437447 2390866
8689 2390866 2384421 2415385 2496341 2619800 2763755 2928230 3129859 3354538 3559787 3723865
8679 3723865 3817067 3845011 3799582 3683954 3518901 3344062 3193512 3091787 3044600 3056188
8669 3056188 3119885 3206132 3347258 3547779 3824168 4198876 4651927 5145010 5626965 6029985
8659 6029985 6297623 6365538 6222996 5969722 5708318 5507320 5387172 5330595 5308325 5272331
8649 5272331 5196009 5088722 5056416 5126468 5243328 5401458 5617133 5846581 6056653 6217890
8639F217890J21725P3745J6120K5657R2607J72881K71617L73379M74196N16269
8629H356086N31763M78602L64815K17010M6820n0909p9063l3544K4027P0914J14763
8618A0041284J87187K60427L58654M62014N50246O38758O73885O41916N70860
8609A4385231M40020K54329P8936n329j31668l45113n21664n38292m22170k51156
8599A2943124j00212L6709J92446L51962N34874P34217R22379J030651J057591
8590A7703741R65178P33042M40442J77563L9057R5955L07290M89356O61820P76562
8580B2390006P62681O94613O34439N86634N49382M63245L30328L30739M59311
8571B7201378O09165P10295P12785O38578N48043N09476O43223R85162J480972
$$ plain form
8639 6217890 6339615 6413360 6429480 6455137 6547744 6720625 6992242 7365621 7839817 8356086
8629 8356086 8887849 9366451 9731266 9948276 9995096 9944187 9865124 9831580 9855607 9926521 10041284
8618 10041284 10228471 10488898 10847552 11309566 11859812 12498570 13172455 13814371 14385231
8609 14385231 14825251 15079580 15158516 15153187 15021519 14676406 14154742 13616450 13194280 12943124
8599 12943124 12842912 12879621 13072067 13424029 13958903 14693120 15615499 16646150 17703741
8590 17703741 18668919 19401961 19842403 20019966 20059023 20154978 20462268 20951624 21613444 22390006
8580 22390006 23152687 23847300 24481739 25068373 25617755 26081000 26411328 26742067 27201378
8571 27201378 27810543 28520838 29233623 29872201 30420244 30929720 31572943 32558105 34039077
8562C4039077K025959K520709K893035L044925K927689K625582K200996J768161
8554E4046133J456477J256280J153929J073149J003908R21393Q36219Q16635Q64899
8545F3429022R50750J008791J002616R17791O92088L70854J5562l23158n94450
8536F7469866p69279p36010n25658k48594L1954L24507N12485O36720Q55680J258185
8526F8809856J849047K337358K545613K417409J742634O25539n58390j464610
8518G8304456j950434k139015k135974k087964k047936j848838j306160m43781
8510F4344354N96708J661648K647314L452064M008791M254931M188674L829410
8502H8983894L287420K626308J844867Q20082l06700j221942j948183k592496
$$ plain form
8562 34039077 36065036 38585745 41478780 44523705 47451394 50076976 52277972 54046133
8554 54046133 55502610 56758890 57912819 58985968 59989876 60911269 61747488 62564123 63429022
8545 63429022 64379772 65388563 66391179 67308970 68001058 68371912 68387474 68064316 67469866
8536 67469866 66700587 65964577 65438919 65190325 65222279 65546786 66059271 66695991 67551671 68809856
8526 68809856 70658903 72996261 75541874 77959283 79701917 80327456 79769066 78304456
8518 78304456 76354022 74215007 72079033 69991069 67943133 66094295 64788135 64344354
8510 64344354 64941062 66602710 69250024 72702088 76710879 80965810 85154484 88983894
8502 88983894 92271314 94897622 96742489 97562571 97255871 96033929 94085746 91493250
8494I1493250l013218l060033k735304k182279j652794j160842n46872K02968
8486G7344876J005692J739989K263810K449032K197024J594694Q25323J9590q04875
8477H8635155j558484k189090k790876l466573m203067m813114n132143n171990
8469E9309818m928707m444456l844305l210839k615652k101159j744583j507523
8461C4912594j331597j194161j018657r89662j011451r11776p25522n81804m73370
8452B6674594l89031l74054m10577m39232m10998l47638k76050j23675P2976K73391
8442B4249706M12369N55635P22147Q87776J023369J156687J244802J223825J092750
8433C2569066R10100P50577O27018M62016L11204J21318j26508m30205p33486
$$ plain form
8494 91493250 88480032 85419999 82684695 80502416 78849622 77688780 77141908 77344876
8486 77344876 78350568 80090557 82354367 84803399 87000423 88595117 89420440 89440030 88635155
8477 88635155 87076671 84887581 82096705 78630132 74427065 69613951 64481808 59309818
8469 59309818 54381111 49936655 46092350 42881511 40265859 38164700 36420117 34912594
8461 34912594 33580997 32386836 31368179 30378517 29367066 28455290 27729768 27147964 26674594
8452 26674594 26285563 25911509 25500932 25061700 24650702 24303064 24027014 23903339 23976315 24249706
8442 24249706 24662075 25217710 25939857 26827633 27851002 29007689 30252491 31476316 32569066
8433 32569066 33479166 34229743 34856761 35318777 35629981 35751299 35624791 35194586 34461100
8424C4461100j111788j516448j788122j768555j485710j061695o42334k66798
8416B4819650P2404M74351O75522N39190N72220Q52476J022772J043187R93641
8407C1065413R28742P80328N35793J99798k60738p94773j299191j631843j779696
8398B7743833j838021j774706j606794j379841j149172r59786q19612p35384o68312
8389A6812205o07771n58991n00513m68001m53089m56035m20835l81688l47783
8380A2617499k98931k49154j64567o6956M6707J12407J55445J38879R3412N2707
8370A2437448M2379o7952j91728j61350n6496O2144J54249K17340K69597L24253
8360A3029884L51243K89659J96540J22876R7250O0405K8062K6818o123o4203j34680
$$ plain form
8424 34461100 33349312 31832864 30044742 28276187 26790477 25728782 25086448 24819650
8416 24819650 24892054 25366405 26041927 26581117 27153337 28005813 29028585 30071772 31065413
8407 31065413 31994155 32774483 33310276 33510074 33249336 32454563 31155372 29523529 27743833
8398 27743833 25905812 24131106 22524312 21144471 19995299 19035513 18215901 17480517 16812205
8389 16812205 16204434 15645443 15144930 14676929 14223840 13767805 13346970 12965282 12617499
8380 12617499 12318568 12069414 11904847 11837891 11884598 11997005 12152450 12291329 12384741 12437448
8370 12437448 12479827 12411875 12220147 12058797 12002301 12064445 12218694 12436034 12705631 13029884
8360 13029884 13381127 13670786 13867326 13990202 14087452 14147857 14175919 14202737 14196614 14132411 13997731
8349A3997731j50028j34762j20965j04689p3830r312Q3403K26147L14560K93864
8339A4322119K31099K12656K70571L34143L53744L46125L10925K32367J17391
8330A6731140p2859k59142m17112n45198n61812m58117l81668l32848l46608l40370
8320A3015406l04934k36424j45037m4738K8692Q1086R2012R0199Q1228P5826R9370
8309A2832686J52339J71098K01779J90382J94504J87687K03284K35097K60128
8300A4628984K84773L16589L38881L66212M19817M64477M54640M33974M45833
8291A8154180M64530M79580M85868N07337N47505N80944O31178P01390P61103
8282B3313615Q33117R10503R84864J067187J180342J316427J464726J597636J789805
$$ plain form
8349 13997731 13847703 13712941 13591976 13487287 13413457 13404145 13487548 13713695 14028255 14322119
8339 14322119 14553218 14765874 15036445 15370588 15724332 16070457 16381382 16613749 16731140
8330 16731140 16658281 16399139 15982027 15436829 14875017 14416900 14035232 13702384 13355776 13015406
8320 13015406 12710472 12474048 12329011 12284273 12312965 12394051 12486063 12576262 12657490 12733316 12832686
8309 12832686 12985025 13156123 13357902 13548284 13742788 13930475 14133759 14368856 14628984
8300 14628984 14913757 15230346 15569227 15935439 16355256 16819733 17274373 17708347 18154180
8291 18154180 18618710 19098290 19584158 20091495 20639000 21219944 21851122 22552512 23313615
8282 23313615 24146732 25057235 26042099 27109286 28289628 29606055 31070781 32668417 34458222
8273C4458222K018405K243039K529009K932973L450905M172421N216724O772286
8265F3793984Q999531J2134826J6552522K2244790K8202083L1992246L0899469
8258B14819451K5101037J5747971k36964k2278738l7529286l6535820k6396756
8251A32690895j6773858j0368724o457948l952613k265440j144910l46778K58239
8243I1638863O81081R92299J233700J393194J508239J577585J508893J281387
8235A01815241J085582J015796J028352J092837J203254J334741J518022J718236
8227A11812061J928160K210599K590950L161092L969188N190904P164533J0161287
8219A48188774J4559126K1094026L0611593M2964013N5058415N9770583N2828956
$$ plain form
8273 34458222 36476627 38719666 41248675 44181648 47632553 51804974 57021698 63793984
8265 63793984 72793515 84928341 101480863 123725653 151927736 183919982 214819451
8258 214819451 239920488 255668459 255431495 233152757 195623471 159087651 132690895
8251 132690895 115917037 105548313 99090365 95137752 92872312 91727402 91380624 91638863
8243 91638863 92319944 93312243 94545943 95939137 97447376 99024961 100533854 101815241
8235 101815241 102900823 103916619 104944971 106037808 107241062 108575803 110093825 111812061
8227 111812061 113740221 115950820 118541770 121702862 125672050 130862954 138027487 148188774
8219 148188774 162747900 183841926 214453519 257417532 312475947 372246530 425075486
8212D25075486M0719213K1561172j9209824o7228892q4351571o9916591m8236668
8205A98412325l2053696k1991073j5775496j1724171q994577p100400n693566
8198I5079346m644642l893381l351482k952351k630980k281494k103789k301198
8190G0920029k651501k815796k761912k575653k286575j980458j674263j352372
8182E2821499j038835p23068l87028K8395N16098J173157K071108L311610N086457
8173F2859393P553096J1033576J5720071K1218914K5899410K7115421K3568950
8166A94968831J6515940N046922j3398270l1916900l7933934l1271523k1540753
8159H0470313j4287036r770558o934876n095069l851515k991089k372446j930280
$$ plain form
8212 425075486 465794699 487355871 468146047 400917155 316565584 246648993 198412325
8205 198412325 166358629 144367556 128592060 116867889 107873312 100772912 95079346
8198 95079346 90434704 86541323 83189841 80237490 77606510 75325016 73221227 70920029
8190 70920029 68268528 65452732 62690820 60115167 57828592 55848134 54173871 52821499
8182 52821499 51782664 51059596 50672568 50700963 51217061 52390218 54461326 57772936 62859393
8173 62859393 70412489 81446065 97166136 118385050 144284460 171399881 194968831
8166 194968831 211484771 216531693 203133423 171216523 133282589 102011066 80470313
8159 80470313 66183277 56412719 49477843 44382774 40531259 37540170 35167724 33237444
8151C3237444j612679j380523j209005j112246r92364r35443j003494j146582
8143B3845108j218291j215336j168610j096531j000182r07982q22100p57809p12880
8134A4945387o89791o62088o14212n64786n26473m55787m31812l96441l44197
8125A0259800k89555k90644k71695k62721k63905k65250k54760k43171k68245
8116G849854k50765k41335k54814k39043k02149j69976j75680j50951j55534j37136
8106E872471j19096j28426j48567j28502j03047j02929p6686p4314q0882q0582
8096D829440o1109o3546l9031j3626k1189j991m717m9739q5552j03945r8539o3675
8084D222781m1360l6062n9737j08984j36244j23987q5069r0914r6651o6151n7288
$$ plain form
8151 33237444 31624765 30244242 29035237 27922991 26930627 25995184 24991690 23845108
8143 23845108 22626817 21411481 20242871 19146340 18146158 17238176 16416076 15658267 14945387
8134 14945387 14255596 13593508 12979296 12414510 11888037 11432250 11000438 10603997 10259800
8125 10259800 9970245 9679601 9407906 9145185 8881280 8616030 8361270 8118099 7849854
8116 7849854 7599089 7357754 7102940 6863897 6661748 6491772 6316092 6165141 6009607 5872471
8106 5872471 5753375 5624949 5476382 5347880 5244833 5141904 5065218 4990904 4910022 4829440
8096 4829440 4768331 4704785 4665754 4652128 4630939 4628948 4624231 4574492 4488940 4384995 4286456 4222781
8084 4222781 4181421 4145359 4085622 3976638 3840394 3716407 3631338 3540424 3443773 3377622 3320334
8073C320334q2999o9195n7947m8821n0151l5804p000k1330k7909j9481q432K3041
8061B914306J8959J127q47j2290l1247m0795m8526m8177m7555l1132m2641l0306
8049B600876j4420n75J4935N486K5991K7445m040n4977p3226n6327j6932j635
8037B452601J5007l896k6487p1802q2955o3070m9464n3339m4264m0477l6533j0751
8025A984570l50m85N150k111j4657j891Q735L1021K8225K3857J8393L2811j7503
8012B095765k5303k7786m4449m9637o5902p6538q1273p6428o3651n4137l4448
8001A496213k8316r703j0849m579j8316j8689j7374l2974l6737l2678k3107l16
7989A262575m321k2274l6397J370j0633j6410k5347k5861L259L294M924k2859
$$ plain form
8073 3320334 3237335 3168140 3110193 3061372 3011221 2975417 2968417 2947087 2919178 2899697 2891265 2914306
8061 2914306 2933265 2934392 2933545 2921255 2890008 2849213 2800687 2752510 2704955 2673823 2631182 2600876
8049 2600876 2586456 2585881 2600816 2606302 2632293 2659738 2655698 2600721 2527495 2471168 2454236 2452601
8037 2452601 2467608 2463712 2437225 2365423 2282468 2219398 2169934 2116595 2072331 2031854 1995321 1984570
8025 1984570 1984220 1983735 1988885 1986774 1972117 1970226 1978961 2009982 2038207 2062064 2080457 2113268 2095765
8012 2095765 2070462 2042676 1998227 1948590 1882688 1806150 1724877 1648449 1584798 1530661 1496213
8001 1496213 1467897 1458194 1447345 1442766 1424450 1405761 1388387 1355413 1318676 1285998 1262891 1262575
7989 1262575 1258254 1235980 1199583 1200953 1190320 1173910 1148563 1122702 1125961 1129255 1134179 1111320
7977A111320l0852j6528L430K4317K6541J361Q800K4734L9382K7364R886P264
7965A237019k459k9731n3535m7960k5201l8190m1296j4039k3124j7469p351L401
7953I40065O215N897l7071l0525j6690l3143k9312j2277j6928N8Q333K3853K0434
7940H28909J0763k790j6484k2122o443j3299k0206j7862j988k096r133p946k437
7927G16866J0656P181q047p823r349m68P567J8444J1596J1974j2344r826J0874
7914G47301m473j0931L448R363j547k4289j4780j5034j5526k4312m8263l8770
7902E62187l7119j0767J1153Q240j1604k1820O503J3668j556o337j7579o420K5846
7889E14395N554j8828M836r476j185p30K798j4987l322Q652R448k812O605K598
$$ plain form
7977 1111320 1080468 1063940 1067370 1091687 1118228 1119589 1128389 1153123 1192505 1219869 1229755 1237019
7965 1237019 1234560 1204829 1151294 1103334 1078133 1039943 998647 984608 961484 944015 936664 940065
7953 940065 946280 952177 915106 884581 867891 834748 805436 793159 776231 776289 784622 808475 828909
7940 828909 839672 836882 820398 798276 791833 778534 758328 740466 738478 736382 727249 719303 716866
7927 716866 727522 734703 726656 718833 709484 709016 716583 735027 746623 758597 746253 736427 747301
7914 747301 742828 731897 735345 744708 743161 718872 704092 689058 673532 649220 600957 562187
7902 562187 525068 514301 525454 533694 522090 500270 506773 520441 518885 512548 494969 488549 514395
7889 514395 519949 501121 505957 496481 495296 494566 497364 482377 479055 487707 497155 494343 500948 503546
7875E03546k985r540N474J2763K2163M138O614K8287K7304L2340M1872N9486N9001
7862G90463J05153J35215J43977J37907J05247N2533l8519j47676k06221j69095
7852I08984j17714o9797m4916m3781k6063k0225m3039k6025j4330j7517r026J494
7840D78045Q60q113l374k197q464P363K439k0045j4025k782p831m993q92N966
7826D21957J1709L1977P319K9238N3955M5467M9654O5028J37380K01536K36471
7815A291691L03480L39628K92850K10676Q1023j63921l88708m42272l30266k06586
7805I87595j42933j12523r9895o7695l4004j3586k2709j8588j5403k360n680l176
7793D49043n562j5026j5276k5723r920k856j59k750Q190J979J207j3206j1597
$$ plain form
7875 503546 500561 491021 496495 509258 531421 535559 542173 570460 597764 630104 671976 731462 790463
7862 790463 895616 1030831 1174808 1312715 1417962 1470495 1431976 1284300 1078079 908984
7852 908984 791270 721473 676557 632776 606713 586488 543449 517424 503094 485577 476551 478045
7840 478045 478905 470792 467418 465221 456757 464120 466559 446514 432489 429707 421876 416883 415991 421957
7826 421957 433666 465643 472962 502200 556155 601622 651276 716304 853684 1055220 1291691
7815 1291691 1595171 1934799 2227649 2438325 2519348 2355427 1966719 1524447 1194181 987595
7805 987595 844662 732139 632244 564549 530545 516959 494250 475662 460259 457899 452219 449043
7793 449043 443481 428455 413179 387456 377536 374680 374521 371771 379961 381940 383147 369941 358344
7780C58344l412j215l211J4408L7511P680K7425N2604O9558R5547J20707J43393
7768I19339J38540J08021P8517j0960j08888j89393j78235j37241j11188p3984
7758D34528o0627m4021j3715j0622l381j3487j3293j4348J3187N723o502p710
7746B65732j2882j4281j0567L42N194r993j5480q892n329q438q348m480j1067
7733A61511m870l48q648j2416R745J6974j1684j074M831K166j6093j5964J3112
7720A37242O128j4062L100K523k42j5154k197l368p3L527N682J0714J0237k659
7706A41398j1110m595j2756M094J4415k600o867m410N300j4120p718j4620m221
7693H2190r602q74Q301R82K169N204j31j51J6228l957n191p866j0680o941k4524
$$ plain form
7780 358344 354932 353717 350506 364914 402425 410105 437530 490134 559692 655239 775946 919339
7768 919339 1057879 1165900 1244417 1233457 1124569 935176 756941 619700 508512 434528
7758 434528 373901 329880 316165 305543 302162 288675 275382 261034 274221 279944 273442 265732
7746 265732 252850 238569 228002 228344 233538 223545 208065 199173 193844 185406 177058 172578 161511
7733 161511 156641 156293 147645 135229 144974 161948 150264 149190 154021 156187 140094 124130 137242
7720 137242 143370 129308 132408 134931 134689 119535 117338 113970 113897 117424 123106 133820 144057 141398
7706 141398 130288 125693 112937 117031 131446 128846 121979 117569 122869 108749 101031 86411 82190
7693 82190 72588 71714 80015 80997 83166 88370 88239 88088 104316 100359 95168 87302 76622 69681 45157
7678D5157j1952J0505J2203J2746M556J2980J7930q793J0328Q051Q230j330q251
7665A12360m959J795j385r412P24j1012J1420J2319j6320p36k341j0822j3262
7652F8369q837J2259R147j1445m455N480M527m626M73L84P800M394l05m093r485
7637F9587o484j0843J1807J5433j0180j3205m155l624N3K316m922o890R53J4246
7623E4092N684k645J7340o026j816j7292k054N286o239Q207Q150r032k0497j1447
7609B1711j575O082N789j032n05K3138P118J9162J6649j0654j4074k4889p960
7596C8960K760P685n985j8407m727M48Q940R282n102j599Q674q298m045K924j106
7581C0404j1133p363j1283O149J1012m042J2023J5188K5905P036j4206O0q809
$$ plain form
7678 45157 33205 43710 55913 68659 73215 86195 104125 95332 105660 113711 121941 120611 112360
7665 112360 107401 109196 107811 98399 99123 88111 99531 111850 95530 94794 92453 81631 68369
7652 68369 59532 71791 80938 69493 65038 70518 75045 70419 70892 71276 79076 83470 83165 79072 69587
7637 69587 63103 52260 64067 79500 69320 56115 51960 48336 48389 50705 45783 38893 39846 54092
7623 54092 59776 57131 74471 68445 66629 49337 47283 52569 46330 54537 62687 53655 33158 21711
7609 21711 20136 26218 32007 30975 30470 53608 60726 79888 96537 85883 71809 46920 38960
7596 38960 41720 49405 43420 25013 20286 20734 29674 38956 33854 32255 40929 32631 28586 31510 30404
7581 30404 19271 11908 625 6774 17786 13744 25767 40955 66860 73896 59690 59750 50941
7568E0941p471M24k877P061J2952J2702k225j6516k0171J4133l132j7687J0762
7555C8896N077M170j380l259O50o974k0j701k0199J223j1465M728Q176R96L992
7540B2910L046j812j0181J0244M709j9057p241R757R045O810N762Q89L641j3963
7526B4559O702j0501o759P941L159j7774p074j3617p555J4061l601N290J1273
7513F104P873J090k070j273J366m408q933l834J1145Q75P891n024j1055K5j955
7498b183m994J1816J888K758L631o262K853j7289R195R380O820o647J1968J8264
7484D1198k593j4705L654p385j2383O147j0521J0066j331m042R301Q238j0842
7471A4802J537o973p184M70q916J7958R199P513r772p151j0897J1748J2034r20
$$ plain form
7568 50941 43470 43894 41017 48078 61030 73732 71507 54991 34820 48953 45821 28134 38896
7555 38896 43973 48143 46763 43504 44154 37180 37160 35459 15260 16483 5018 9746 17922 18918 22910
7540 22910 25956 24144 13963 24207 28916 9859 2618 12375 21420 28230 33992 34881 38522 24559
7526 24559 31261 20760 14001 21942 25101 7327 253 -13364 -20919 -6858 -10459 -5169 6104
7513 6104 13977 15067 12997 11724 13090 8682 -251 -4085 7060 7935 15826 10802 -253 -228 -2183
7498 -2183 -7177 4639 6527 9285 12916 6654 9507 -7782 1413 10793 17613 10966 22934 41198
7484 41198 38605 23900 27554 20169 7786 13933 3412 13478 12147 8105 17406 25644 14802
7471 14802 16339 9366 2182 2652 -6264 11694 20893 28406 18634 11483 586 12334 24368 23448
7457B3448p058J887L132L197o292n851M099J284r614l470l578j515J3960Q035
7443B1664m817j287N84L736j522J859J8844j653j493j4305q502o105j3828n344
7429a2169N097J1277J2947K490q947N174l170k0849l116r72O879l573L901N420
7415C89K798j0764j6935j072K127l007L873k203O360K816N228N138r587N65J0120
7400d154O082m954m260K851K023j7145m242J4995J1764p727p810o469j516Q002
7386a2560J0413N669J2165l471m694m625O079p920J174r741n106n49O46L966K0481
7371A1927L714j221O954L917p026j7r816j3096M061l70k482L324r71J2909J072
7356A2879p502j6886K323L799J0587P474m140m920J2676R178k0949k8507r13Q84
$$ plain form
7457 23448 16390 18277 21409 24606 18314 12463 16562 17846 8232 4762 1184 -331 13629 21664
7443 21664 16847 15560 16144 19880 18358 20217 39061 37408 35915 21610 13108 7003 -6825 -12169
7429 -12169 -7072 4205 17152 19642 10695 15869 12699 -8150 -11266 -12238 -5359 -8932 -5031 389
7415 389 3187 -7577 -24512 -25584 -23457 -26464 -22591 -24794 -18434 -15618 -10390 -5252 -14839 -14274 -4154
7400 -4154 1928 -3026 -7286 -4435 -2412 -19557 -23799 -8804 2960 -4767 -12577 -19046 -20562 -12560
7386 -12560 -2147 3522 15687 12216 7522 2897 8976 1056 2230 -7511 -12617 -13166 -12520 -8554 11927
7371 11927 15641 14420 21374 25291 18265 18248 8432 -4664 -603 -973 -3455 -131 -1102 11807 12879
7356 12879 5377 -11509 -9186 -5387 5200 12674 8534 3614 16290 25468 4519 -23988 -24901 -24017
7342b4017L73K333j2156l406P769J1807R081J680L037q562j0918l926O397L171
7328a7337J2161L47j7437k0265r008J803J8723P655j676j0235P244r53O445M339
7314a8194J0681J0803O711K512j3636M18Q439j1514j3241J121K236J9399J0204
7301A5939r900M882j2588q842m79k952R84J787l093Q996L547K876P045J6607o410
7286A8399o971o399j0534k358J2340R406j6279k0457q589p272J0361J3909J5117
7273F73r692P584J385l320j9935j7637J0886J1157k587j199j8546q185K1581J5897
7259a1938o436j1293m088J7712Q639n149l2599k801N142J3915R521Q032J293j221
7245a1271Q905J4J568m524j878J3166J5192l734k5033j1304J4481Q163M66N337
$$ plain form
7342 -24017 -23644 -21311 -33467 -36873 -29104 -17297 -8216 -6536 -3499 -12061 -22979 -26905 -20508 -17337
7328 -17337 -5176 -4829 -22266 -42531 -51539 -49736 -31013 -23358 -25034 -35269 -28025 -28978 -22533 -18194
7314 -18194 -7513 3290 10001 12513 -1123 -705 7734 -3780 -17021 -15900 -13664 5735 15939
7301 15939 6039 10921 -1667 -10509 -10988 -13940 -12956 -11169 -14262 -5266 -1719 1157 8202 24809 18399
7286 18399 11428 5029 -5505 -7863 4477 13883 -2396 -22853 -31442 -38714 -28353 -14444 673
7273 673 -9019 -1435 -50 -3370 -23305 -40942 -30056 -18899 -21486 -22685 -41231 -49416 -27835 -11938
7259 -11938 -18374 -29667 -33755 -16043 -7404 -12553 -45152 -47953 -42811 -28896 -19375 -11343 -10050 -11271
7245 -11271 -2366 -2352 -784 -5308 -7186 5980 21172 17438 -7595 -18899 -4418 3745 4211 9548
7231I548N965j3883J160j2740m763J1108l069q357l77K804K4543L431j8615j2672
7217a5917J3974p547p07m77j3166n377j165J0342l554l882M921J6951O970J550
7203B916j0523K448l355O908O01m145k514o42n239r847j157J2519M073M202P894
7188D139m784p925k189m564P58J72l876K3596R431j2606j1197J7580Q452P625
7174B4612r106m340J1703r493k663j0356J1833o363K333J969p221j8193j6821
7161c2106J2638R352J281J1911O985o59j3192m266J2320n321k1937q810J0590
7148b1214P343M121j2635l0997l668P873K026L930J119O987J4593m046O815Q077
7134i676O57M9J444Q03j2355Q384m278j0624n664J0291L17j7146M701N224j630
$$ plain form
7231 9548 15513 1630 2790 -9950 -14713 -3605 -6674 -15031 -15408 -12604 11939 15370 -3245 -15917
7217 -15917 -1943 -9490 -10197 -10674 -23840 -29217 -30382 -20040 -23594 -27476 -22555 -5604 1366 2916
7203 2916 -7607 -5159 -8514 -1606 -1005 -5150 -7664 -8306 -13545 -23392 -24549 -12030 -7957 -3755 4139
7188 4139 -645 -8570 -10759 -15323 -14565 -14393 -18269 5327 14758 2152 -9045 8535 16987 24612
7174 24612 15506 11166 22869 13376 10713 357 12190 5827 8160 10129 2908 -15285 -32106
7161 -32106 -19468 -10116 -8835 3076 10061 9402 -3790 -8056 4264 -1057 -22994 -31804 -21214
7148 -21214 -13871 -9750 -22385 -53382 -57050 -49177 -47151 -43221 -42102 -35115 -20522 -24568 -17753 -9676
7134 -9676 -9019 -8970 -7526 -6723 -19078 -10694 -14972 -25596 -31260 -20969 -20652 -37798 -33097 -27873 -29503
7119b9503J101M421J888J131K968M814l264o20J0393k657j3161j111J4081L123
7105f396M909j4477r91N456k3334j4355P960J4732l817M58Q371K242N587q834
7091b2489J9593J0446N017l417q386O499m201m068k3624j0199J737J9922O496
7078f674m010n417p071M317Q260j697J1223J865k0192l973j5836m342J2428k876
7064c3995L1460J5726k821j5174k2828q031j1557q197J6742k971J3617L051J1726
7051a3252q31N217K1635j0620j5099q796o162J4773L095r004p237Q36P220P977
7037a0248K429j4553p195M791L479R778J2614L785r555k2030n295R311N352k57
7023a7594O327J3699P187j5626n605j1103j9475J665Q350m310l32J2571J1099
$$ plain form
7119 -29503 -28402 -23981 -22093 -20962 -17994 -13180 -16444 -17064 -6671 -9328 -22489 -23600 -9519 -6396
7105 -6396 -1487 -15964 -16955 -11499 -34833 -49188 -41228 -26496 -30313 -29855 -21484 -19242 -13655 -22489
7091 -22489 -2896 7550 12567 9150 764 7263 3062 -1006 -24630 -34829 -33092 -13170 -6674
7078 -6674 -10684 -16101 -23172 -18855 -10595 -12292 -1069 796 -19396 -23369 -39205 -43547 -31119 -33995
7064 -33995 -2535 13191 10370 -4804 -27632 -35663 -47220 -55417 -38675 -41646 -28029 -24978 -13252
7051 -13252 -14083 -8866 12769 2149 -12950 -21746 -27908 -13135 -10040 -19044 -26281 -25445 -18225 -10248
7037 -10248 -7819 -22372 -29567 -24776 -21297 -11519 1095 4880 -4675 -26705 -32000 -22689 -17337 -17594
7023 -17594 -11267 2432 9619 -6007 -11612 -22715 -42190 -40525 -32175 -36485 -36817 -24246 -13147
7010a3147N466j0043o020n519j2277j0451n550J6726K2860J1244P310N606P880
6997A4085r419n065j4160J578P57o306j0556K154k52P178j3863J2392J2035j029
6983a0471R138n3Q295O188L007k647o921j0684L836L852j2292q611j3667P700
6969b3330O829N566j0860Q87N990N252p001l005k784N926k908J3848L490J5106
6955A3006O34j7904k0870j2997K1825j752L718J5038L76n555K45K497l27l770
6941e836q758L192J7225k60L88j1461l944Q420R219o879j8031L205j3978k192
6927b9690K5424K091j5558j0024J1917o93J1678J1845q320r457J4591M246J843
6914I893J5888j4367j1122m917l12j6328N669J8700j159N126k909j5023j1328
$$ plain form
7010 -13147 -7681 -17724 -23744 -29263 -41540 -51991 -57541 -40815 -17955 -6711 599 6205 14085
6997 14085 4666 -399 -14559 -12981 -12224 -18530 -29086 -26932 -27184 -20006 -33869 -21477 -9442 -10471
6983 -10471 -1333 -1386 6909 13097 16104 13457 6536 -4148 -312 3540 -8752 -17363 -31030 -23330
6969 -23330 -16501 -10935 -21795 -20908 -14918 -9666 -16667 -19672 -22456 -16530 -19438 -5590 -2100 13006
6955 13006 13640 -4264 -25134 -38131 -16306 -18058 -14340 698 1074 -4481 -4236 -1739 -2066 -5836
6941 -5836 -14594 -11402 5823 5563 5951 -5510 -9454 -1034 8185 1306 -16725 -13520 -27498 -29690
6927 -29690 -4266 -2175 -17733 -27757 -15840 -16533 -4855 6990 -1330 -10787 3804 8050 9893
6914 9893 25781 11414 292 -4625 -4937 -21265 -15596 3104 1945 7071 4162 -10861 -22189
6901b2189K892J5870L492N136j342N037K508N52p11O048j739m836Q43N572J479
6886A8612r67p971j6180j3396o283N086J4370N366o01o181J1241n968j1667j0157
6872b4696p951K445L170n547Q935J7271n665k8443M34m362l838o979R513K7084
6858a8629J1845j4153l420K068J7557L431k883L93p699q158l371N415l358L621
6844a7341P417J1313L396j1280M492j1961j1755J0815O163j3333J5953N999j0468
6831a0590p214L024K690k390p449J0320J4986J184k3851r417o268J3021R818j1691
6817b3827j1375j255j878j294k500m009J8128L0535L575q014r738j4716R179J1828
6803e361J0044j4126j0502J872M613J7472J1391O24j3961j074j182J2789m906
$$ plain form
6901 -22189 -19297 -3427 65 5201 3859 8896 11404 11956 11245 17293 15554 10718 11561 17133 18612
6886 18612 17645 9674 -6506 -19902 -26185 -21099 -6729 -1363 -1964 -8145 3096 -2872 -14539 -24696
6872 -24696 -32647 -30202 -27032 -32579 -23644 -6373 -12038 -40481 -40047 -44409 -48247 -55226 -45713 -18629
6858 -18629 -6784 -20937 -24357 -22289 -4732 -1301 -4184 -3791 -11490 -19648 -23019 -17604 -20962 -17341
6844 -17341 -9924 1389 4785 -6495 -2003 -13964 -25719 -14904 -8741 -22074 -6121 -122 -10590
6831 -10590 -17804 -14780 -12090 -14480 -21929 -11609 3377 4561 -19290 -28707 -34975 -21954 -12136 -23827
6817 -23827 -35202 -36457 -38335 -39629 -42129 -46138 -28010 2525 6100 -1914 -11652 -26368 -17189 -5361
6803 -5361 4683 -9443 -19945 -18073 -13460 4012 15403 16027 2066 992 -190 12599 7693
6790G693q291O693N44j4902n144M661k884r598O860k173l575K143j192j5990O221
6775b8934M260L393R232j4366J946J6555N865m697P686J5542n930L075r52j6774
6761d099l132O80q82l984n042m337J3789K435j6190j3505L61L913P635l677j0526
6746c6561J1765J3069J2139j3041j137k372j446o664J9809Q611J8627j1347j2999
6733a547p101J6247k227j866R44m938q201q760L143K659J0601l205l065M555M586
6718A825O441J0020J1514j2213j5481J300J2058j2082j7008J243J4547J0797j35
6705A2826n461k427j4989m154L344Q822o727J13J588q639J9293J0193j830L880
6691A5832k529k1415j4796J7684J2695J823m94K938J999K0478J1326K4627K0285
$$ plain form
6790 7693 -598 6095 6639 -8263 -13407 -8746 -11630 -21228 -14368 -16541 -20116 -17973 -19165 -35155 -28934
6775 -28934 -24674 -21281 -12049 -26415 -24469 -7914 -2049 -6746 940 16482 10552 13627 12675 -4099
6761 -4099 -7231 -6551 -7433 -11417 -16459 -20796 -7007 -4572 -20762 -34267 -33906 -29993 -22358 -26035 -36561
6746 -36561 -24796 -11727 412 -12629 -13766 -16138 -17584 -24248 -4439 4172 22799 11452 -1547
6733 -1547 -8648 7599 5372 3506 4450 -488 -8689 -17449 -14306 -11647 -1046 -4251 -7316 -2761 1825
6718 1825 8266 18286 29800 17587 2106 3406 15464 3382 -13626 -12383 2164 12961 12826
6705 12826 7365 4938 -10051 -14205 -10861 -2039 -8766 -8653 -7065 -15704 3589 13782 11952 15832
6691 15832 13303 -8112 -22908 -5224 7471 9294 8800 11738 13737 34215 45541 70168 90453
6678I0453R233K6189K1185p093k7227l6746j1072N697j192j9549j9737J302l227
6665B8216O723o202k1182O817J3555P33O27j0928j3114P667J1532k837R922J0421
6651D1950N887j4192Q843o876j3360p452j0855M64O896J1967J1494J7739m747
6638D7758o806m011J124O074J359p982q217m031J211J5292O35j1474j2074j684
6624A7174J8726j867O724k576K92J1222k456J8102J5939L0489L4085M1783N9486
6611B47123Q2468J17934J20113J10033J00979O6297K8346p1404j80523j86095
6601D35271j37589r5003m9327m6098k4436k5826O366M819J0128j9931j4649J1968
6589E5693K0597m940j2310j391k4013o191N763J4222J3674M232j1965j7759j4977
$$ plain form
6678 90453 99686 125875 147060 139967 112740 75994 64922 70619 69427 49878 30141 31443 28216
6665 28216 34939 28737 7555 14372 27927 28660 29287 18359 5245 12912 24444 21607 31529 41950
6651 41950 47837 33645 42488 35612 22252 14800 3945 4409 11305 23272 34766 52505 47758
6638 47758 40952 36941 38065 44139 45498 37516 29299 25268 26479 41771 42406 30932 18858 17174
6624 17174 35900 34033 40757 38181 38473 49695 47239 65341 81280 111769 145854 187637 247123
6611 247123 329591 447525 567638 677671 778650 844947 873293 801889 621366 435271
6601 435271 297682 202679 153352 107254 82818 56992 63358 68177 78305 58374 43725 55693
6589 55693 76290 71350 59040 57649 33636 27445 33208 47430 61104 65336 53371 35612 20635
6576B0635p445o125P239J0390P121j440j6796J358k36J4932k559o472J757L492
6562B5851r100Q738K379j814n086j4313p001O847M453O471q723j4909l961r740
6548a9908J724R931l400K0419J5279o765r630J4561k177j9635k5228P807L4809
6535A7787K487O423j0291o295K502L968l936N652P799o457q595l551N45Q484J1204
6520B7726O241l306j2538k263K062k2623o19j3401O070o240j5275o097J2346J2583
6506a5334R732j811J6987J6802j2766p742j8806J937k159p47P918J0157k106k182
6492a20n123n631n978q296o471J8532J3696R8N406k438j0580p1J3313l860N864
6477H341R896O81n06j64j981o26o077q631L916O141m636N153L401m097J3385J8347
$$ plain form
6576 20635 13190 7065 14304 24694 31815 30375 13579 14937 14701 29633 27074 20602 22359 25851
6562 25851 16751 25489 27868 26054 20968 6655 -346 6501 10954 17425 8702 -6207 -10168 -19908
6548 -19908 -18184 -8253 -11653 8766 24045 17280 7650 22211 20034 399 -24829 -17022 17787
6535 17787 20274 26697 16406 10111 12613 16581 12645 18297 26096 19639 11044 7493 8038 16522 27726
6520 27726 33967 30661 18123 15860 17922 -4701 -5320 -18721 -12651 -18891 -34166 -40263 -27917 -15334
6506 -15334 -5602 -7413 9574 26376 13610 5868 -12938 -11001 -13160 -13907 -5989 4168 2062 -120
6492 -120 -5243 -10874 -16852 -25148 -31619 -13087 609 707 6113 3675 -6905 -6976 6337 2477 8341
6477 8341 18237 18918 18412 18248 16267 15641 9564 933 4849 10990 6354 11507 14908 10811 24196 42543
6461D2543j6167k4760P982M398Q742j4031j1047K1369M660j097j4921J9527j846
6448B5352k0212k3880m227L79m832L699l336L252K8672O497k4096J891J0571j892
6434b162j1745j1317O614m573P816m5O82p504n155j5164O197K347L569n715J1427
6419b4728K0407k131k2203r390P95J6970J2345K18O782J8299p886p164k602j9048
6405a9336j2404k438M534J7913J0507o263j319p759m182J1772J1220j047j1913
6392a0715k598L302R114m010p335r891Q502J4335q92m11o628p459J4670q74n449
6377f339n817m326L474q268p145M189R942K306K827J3453K7371j1055j0165J3776
6363B4223r690L366k416n391j3583n633L447J8741J1043O449j244j8079l2730
$$ plain form
6461 42543 26376 1616 9598 13996 22738 8707 -2340 19029 23689 22592 7671 27198 25352
6448 25352 5140 -18740 -22967 -22588 -27420 -23721 -27057 -23805 4867 11364 -12732 -10841 -270 -2162
6434 -2162 -13907 -25224 -18610 -23183 -15367 -15412 -14730 -22234 -27389 -42553 -36356 -34009 -30440 -36155 -24728
6419 -24728 -4321 -6452 -28655 -38045 -37250 -20280 -7935 -7717 -935 17364 9478 2314 -288 -19336
6405 -19336 -31740 -34178 -29644 -11731 -1224 -7487 -8806 -16565 -20747 -8975 2245 1198 -10715
6392 -10715 -13313 -10011 -897 -4907 -12242 -22133 -13631 704 -188 -599 -7227 -14686 -16 -890 -6339
6377 -6339 -12156 -16482 -13008 -21276 -28421 -24232 -14290 -11984 -9157 4296 31667 20612 10447 24223
6363 24223 14533 17899 15483 10092 -3491 -9124 -5677 13064 24107 30556 29312 11233 -21497
6350b1497r374j667J3826K3090K053j2340m783j1057m947J6225J1318j546m011
6337d710j0652r452o483J4473Q869N595O07q932j1912k159n32K723m51R521J6714
6322C219j030n150o079N432n215n832N445j824J5564K8242l077k5242p399K152
6308g94j2349k356K452j1499j6448r033J2449J3542J796J3180K2002N281j1683
6295F540J820m142M562O440j6718p77Q484r151n368L071M926j6865J2486N047
6281C55n03J1841o447n550j5185P592J24n820M688J7047P976K15K6508J0960n972
6266D7829j2415j7951l7928j5104J0261O919O11N342k058R618m06j687O590n147
6252e526k041O425p052N398j521j5017j3392j941r138J242J4209o07J3525J7236
$$ plain form
6350 -21497 -30871 -32538 -18712 4378 6431 -5909 -10692 -21749 -26696 -10471 847 -699 -4710
6337 -4710 -15362 -24814 -31297 -16824 -7955 -2360 -1753 -10685 -22597 -24756 -25288 -22565 -23016 -13495 3219
6322 3219 2189 -2961 -9040 -3608 -8823 -14655 -9210 -11034 4530 32772 29695 4453 -2946 -794
6308 -794 -13143 -15499 -13047 -24546 -40994 -50027 -37578 -24036 -22240 -9060 12942 18223 6540
6295 6540 8360 4218 8780 15220 -1498 -2275 6209 -2942 -8310 -5239 -313 -17178 -4692 355
6281 355 -148 11693 5246 -304 -15489 -7897 -7773 -13593 -8905 8142 16118 16333 42841 53801 47829
6266 47829 35414 17463 -20465 -35569 -25308 -18389 -17778 -12436 -14494 -4876 -5282 -6969 -379 -5526
6252 -5526 -7567 -1142 -8194 -2796 -4317 -19334 -32726 -34667 -43805 -42563 -28354 -28961 -15436 1800
6238A800N924l4590q511K3523J5281q222j1394k958R816M06n674J170J4077k892
6224b244j9231m83l227r979K421K2528K2670K5475J1595L024o836j1039j7147
6211A7527m489j0485r900n177o544m707j1581k565o30K0649P579n490N529j793
6197a2077J543M406j513j4315Q328J0118k093j242l411Q18N600k645r933j0822
6183b7238r08J5226P696j0185r198l0919l572J4757K0238L9263M8865L3295K4165
6170A21485N904r84j405q990j8179k3350m7183m9207l6686k1316p248m348J7882
6157g3625L0394K4701N605r301M071J8974l879k7708n937J2188m668q526J0997
6144b6714J5119l882l148K2317Q47j1232q67L4605L261j8058k6101k6236K052
$$ plain form
6238 1800 7724 -26866 -35377 -11854 3427 -4795 -16189 -19147 -9331 -8925 -14599 -13429 648 -2244
6224 -2244 -21475 -21958 -25185 -35164 -32743 -10215 12455 37930 49525 52549 45713 34674 17527
6211 17527 13038 2553 -7347 -12524 -19068 -23775 -35356 -37921 -38551 -17902 -10323 -15813 -10284 -12077
6197 -12077 -10534 -6128 -7641 -21956 -13628 -3510 -5603 -6845 -10256 -9438 -3838 -6483 -16416 -27238
6183 -27238 -28146 -12920 -5224 -15409 -24607 -55526 -59098 -44341 -24103 15160 64025 97320 121485
6170 121485 127389 126405 125000 116010 97831 74481 27298 -21909 -58595 -79911 -87159 -91507 -73625
6157 -73625 -43231 -18530 -12925 -22226 -18155 819 -3060 -30768 -36705 -24517 -29185 -37711 -26714
6144 -26714 -11595 -15477 -18625 3692 4539 -6693 -7560 27045 30306 12248 -13853 -40089 -38037
6131c8037n576q399K7432M5934M5618K5006L0110J809r899r018K74Q90k0863l5923
6117D9358m9632m7278k8503M470L84J0571Q238J1631P612M713J4392K773L17M237
6103f717j2073k95O467L668j1132j9072k173K40m107R224J3729j2981r615J8106
6089b6731K6954Q651O202k1039l0000o066j1187K7028K3562K1649Q39J036p695
6076A3203J1840M640j598j6348j1257k195k0176p882J0326J7751N661J4004q892
6063I077q441j6773L518N760p428k3882j2489J2814R089o443j4512O609J5907
6050b7194J1553P390J786J276l951M903N856j507j1877J9622R145j2684j0132
6037e814k0713o994K3047K3577M670j3760m962M505j8575k4533l496K2419J5764
$$ plain form
6131 -38037 -43613 -52012 -24580 21354 66972 91978 122088 123897 113998 104980 105254 106144 85281 49358
6117 49358 -274 -47552 -76055 -71585 -71201 -60630 -52392 -40761 -33149 -28436 -14044 -11271 -10954 -6717
6103 -6717 -18790 -19085 -12618 -8950 -20082 -39154 -41327 -41087 -45194 -35970 -22241 -35222 -44837 -26731
6089 -26731 223 8874 15076 -5963 -35963 -42029 -53216 -26188 -2626 19023 19862 20898 13203
6076 13203 25043 29683 28085 11737 480 -1715 -21891 -29773 -19447 -1696 3965 17969 9077
6063 9077 636 -16137 -12619 -6859 -14287 -38169 -50658 -37844 -28755 -35198 -49710 -43101 -27194
6050 -27194 -15641 -8251 -6465 -5189 -9140 -4237 1619 112 -11765 7857 17002 4318 -5814
6037 -5814 -26527 -33521 -10474 13103 17773 4013 -949 3556 -15019 -39552 -43048 -20629 -4865
6024d865J2451L666l79o863J4779j5540k3568p447L082P914Q471M287J1187M020
6010A1195O62m825q831n454K200O540m912r182j1590n43j1913J1056J1478j816
5996a5935K047N141k043O789O428K888j9025j3082N468j0194J1986R368J0571
5983D07l536j223J9627L045o776j3343j0735q785p39pK7898k315l939M445j0743
5968f719j3660m072O807Q553k753n860R644p793j150M089K383O14k566J3729J0126
5953A1372l427r865r245j7673j4339J2078J6189Q689k33N538J2531q505o101j3866
5939a6857k644M099O663o851j5593J039J4849M358j3004L443J4224K0427R506
5926B3659o271j4597j7793k5742o840rR472J4630K0543l499j4332L937Q716M994
$$ plain form
6024 -4865 7586 11252 10873 4010 18789 3249 -20319 -27766 -24684 -16770 -8299 -4012 7175 11195
6010 11195 11857 7032 -1799 -7253 -5053 1487 -3425 -12607 -24197 -24740 -36653 -25597 -14119 -15935
5996 -15935 -13888 -8747 -10790 -4001 2427 5315 -13710 -26792 -21324 -31518 -19532 -10164 407
5983 407 -3129 -4352 15275 18320 11544 -1799 -12534 -21319 -22058 -22065 5833 3518 -421 4024 -6719
5968 -6719 -20379 -24451 -17644 -9091 -11844 -17704 -8060 -15853 -17003 -12914 -10531 -9917 -12483 1246 11372
5953 11372 7945 -1920 -11165 -28838 -43177 -31099 -14910 -6221 -6454 -916 11615 3110 -2991 -16857
5939 -16857 -19501 -15402 -8739 -15590 -31183 -30144 -15295 -10937 -23941 -20498 -6274 14153 23659
5926 23659 17388 2791 -15002 -40744 -47584 -47593 -38121 -23491 -2948 -6447 -20779 -16842 -8126 -3132
5912c132q941P346J9485k058j724J3877q561j9648j0402j744l038m819J262O776
5898a5321R427R706O572k905q953j259m758r988J8938K0064J8112P369j9263j0569
5884A7172J0718j3750j1801k1736p492J7506J0617M888J352o424J4233O014o650
5871A4647p883M869j111P644R690L558q357l020O661L178j566J8881J612j0361
5857C8442j1698k4415o56Q70p423j050Q246j1492Q433M439J07q485k191J8828
5843A1955R633o815l082j1445r179N696N13P686J2818O030J2684M447n741M019
5829C9219O517k826j7510J3501j101m315K107l427r275r655o572k0749j3578j2785
5815d0449M87K2435Q715j5536j850K108O028L785L1715K33l9946k7324p307l377
$$ plain form
5912 -3132 -12073 -4727 14758 12700 10976 24853 16292 -3356 -13758 -15502 -18540 -23359 -22097 -15321
5898 -15321 -5894 3812 10384 7479 -1474 -2733 -7491 -17479 1459 21523 39635 47004 27741 17172
5884 17172 27890 14140 2339 -19397 -26889 -9383 1234 6122 7474 1050 15283 21297 14647
5871 14647 6764 11633 10522 18166 27856 31414 23057 20037 26698 29876 28310 47191 48803 38442
5857 38442 26744 2329 1673 2543 -4880 -5930 2316 -9176 -743 3696 3803 -4682 -6873 11955
5843 11955 21588 14773 11691 246 -8933 -3237 -2724 4962 17780 23810 36494 40941 35200 39219
5829 39219 45736 42910 25400 38901 37800 33485 35592 32165 22890 13235 6663 -14086 -27664 -40449
5815 -40449 -39962 -17527 -8812 -24348 -26198 -24090 -18062 -14277 17438 17671 -22275 -49599 -56906 -60283
5801f0283l96j110m064J0038J4260J3738J3653k39M846o742k766J0911j6319k5218
5787d9691J135J2956K1909J2658N994J0392J3668r616q519n073O657n271j934
5774E265N920j7887Q882q41j2332m750N338n699K893q516M919K0884N357N40q777
5759A196Q659J078p550k810K707Q067J4786j1528j4496j701o900o161J2397P589
5745E333k589J4757j3523m4K555j2738K37j2439n061L361j1305j937N021J2571
5731a5801J9903J686N054L179M672J620n417K482K0886j2977j6183o660n954M604
5717A094J0618k887j9776j7127M894M350J1334n209N815J2752J1001Q737k3035
5704B561o020L550N532k3n318j2237r433R396O029p14R347K337K686k732l946
$$ plain form
5801 -60283 -60679 -61789 -65853 -55815 -41555 -27817 -14164 -14403 -9557 -16299 -19065 -8154 -24473 -49691
5787 -49691 -48556 -35600 -13691 -1033 4961 15353 29021 19405 10886 5813 12470 7199 5265
5774 5265 11185 -6702 2180 1339 -10993 -15743 -10405 -16104 -13211 -21727 -16808 4076 9433 9973 1196
5759 1196 9855 10933 3383 573 3280 11347 26133 14605 109 -1592 -8492 -14653 -2256 5333
5745 5333 2744 17501 3978 3934 6489 -6249 -6012 -18451 -23512 -20151 -31456 -33393 -28372 -15801
5731 -15801 4102 5788 10842 14021 18693 20313 14896 17378 38264 25287 9104 2444 -3510 1094
5717 1094 11712 8825 -10951 -28078 -23184 -18834 -7500 -12709 -6894 5858 16859 25596 2561
5704 2561 -3459 91 5623 5600 282 -11955 -21388 -11992 -5963 -6677 2670 5007 7693 4961 1015
5689A015Q312J5065j8574j0030L947K6782Q038k681r561l0670k963J2132J6291
5676A7103m929M756L12l794r611N548K0088R607n658q424j1824l147J4975k973
5662B2029j671j5065j744J3745K782k886J4239n467j6042j225O571l709j0459
5649A098Q390J621q790p438M647L674K2480L029j2315l072o153n120M066q207
5635b090k784L308q186Q77J8883Q348j4854J243j2952j271L464r541o61P937k309
5620a0588K774J4501N97j9627J601P060L305P589r101j4311L591P072O961Q413
5606I837l772j2399P77O809O4k335J339l788J7086J7645O352j0954m023j3134
5592I504j3841k099K426q172J0159K153k268L888j0128R81R472K878n792M681
$$ plain form
5689 1015 9327 24392 5818 -4212 -265 26517 34555 31874 22313 -8357 -11320 812 17103
5676 17103 12174 16930 17242 13448 3837 9385 29473 39080 33422 24998 13174 10027 25002 22029
5662 22029 20358 5293 3549 17294 20076 17190 31429 25962 9920 8695 15266 11557 1098
5649 1098 9488 11109 2319 -5119 -472 3202 25682 28711 16396 13324 7171 2051 6117 -2090
5635 -2090 -4874 -1566 -9752 -8875 10008 18356 3502 4745 -8207 -9478 -6014 -15555 -16216 -8279 -10588
5620 -10588 -7814 6687 7284 -12343 -10742 -3682 -377 7212 -1889 -16200 -12609 -5537 1424 9837
5606 9837 6065 -6334 -5557 1252 1316 -1019 320 -3468 13618 31263 37615 26661 22638 9504
5592 9504 -4337 -6436 -4010 -12182 -2023 130 -2138 1750 -8378 -7397 2075 4953 -839 3842
5578C842Q326K4787J448j3516j8831j5491L011k669j7570j2378N996O847n169
5565c1367J5592o753j1616O989o87K294J3747Q361j1018M522J8194J2971j9069
5552B160n893j323Q151Q881j442q498O867M769q216p50L341j43R758q737L157
5537A2082J9118N097k0126j2775o283L343P573j5848j5524Q197J0169R358K520
5524F901j9320j1258k627n712K778L54J2498J8350J3195l623O52j0795M877J4977
5510B1247L329j4636O865P475r778P752j859k0303r287K645k651m016r902J1252
5496a1867M100M420J168j5378j2038J233O178Q880J7593J26q58m918J6455K2173
5482C7267p183j0811n319J6205R998j471n743r003N460O748j6227r881M953K862
$$ plain form
5578 3842 12168 36955 38403 24887 6056 -9435 -6424 -9093 -26663 -39041 -33045 -26198 -31367
5565 -31367 -15775 -22528 -34144 -27155 -27842 -25548 -11801 -3440 -14458 -9936 8258 21229 2160
5552 2160 -3733 -5056 3095 11976 10534 2036 8903 13672 5456 4706 8047 7904 17662 8925 12082
5537 12082 31200 36297 16171 3396 -2887 456 8029 -7819 -23343 -15146 -4977 4381 6901
5524 6901 -12419 -23677 -26304 -32016 -29238 -28884 -16386 1964 15159 11536 12188 1393 6270 21247
5510 21247 24576 9940 16805 24280 14502 22254 20395 92 -9195 -6550 -9201 -13217 -23119 -11867
5496 -11867 -7767 -3347 -2179 -17557 -29595 -28362 -22184 -13304 4289 4415 3557 -1361 15094 37267
5482 37267 30084 19273 13954 30159 40157 38686 32943 23940 29400 36148 19921 10040 14993 17855
5468A7855Q142O503j376k2325m309L034r577k810O707k066j6615j729J0710K797
5454e059r87p766K605L776J5830l47j8370k5076N530J4325J3270j1926N083J3937
5440D825r693J05J896Q05n736n094M323l618P515J3771m657m899o984k425J6235
5425F369k2490j1857J5383K678j5245J4151P982L415M73j0807j3448K877J2842
5412g677k23p242J2491J3028o707p714J1516l631j4026j1465k449q256Q519N016
5398a8820j519l226O999Q121J681J0245K2138p35j9670j2138k0441l284N558J0006
5384a5085L820K246n602j542n843j2527J9877K2721j5245j5044J0322K2620J5996
5371B6714p205m476l31k214l961K41l126J2904M20r292j1983r640O531l120J20
$$ plain form
5468 17855 25997 32500 31124 8799 4490 7524 -2053 -4863 1844 -222 -16837 -18566 -7856 -5059
5454 -5059 -6046 -13812 -11207 -7431 8399 8052 -10318 -35394 -29864 -15539 -2269 -14195 -9112 4825
5440 4825 -4868 -4763 -2867 -2062 -7798 -12892 -8569 -12187 -4672 9099 4442 -457 -7441 -9866 6369
5425 6369 -16121 -27978 -12595 -9917 -25162 -11011 -3029 386 859 -9948 -23396 -20519 -7677
5412 -7677 -7900 -15142 -2651 10377 3670 -4044 7472 3841 -10185 -21650 -24099 -32355 -23836 -18820
5398 -18820 -20339 -23565 -16566 -8445 -6764 3481 25619 24884 5214 -6924 -27365 -30649 -25091 -15085
5384 -15085 -11265 -9019 -14621 -16163 -22006 -34533 -14656 8065 -7180 -22224 -11902 10718 26714
5371 26714 19509 15033 14702 12488 8527 8768 5642 18546 18966 9674 -2309 -11949 -5418 -8538 -8418
5356h418o418k891q55p280M930J0617J0732Q281J0898K64j2804q207J5318o201
5342G966j6534R271r856N455R151l298q190L418L384J073r15J784p18R969P303
5327A9263j0826R986J1653j1688q154Q894o996n195n748J3487j4688k80o122N062
5313a352j0203m863m842N31l874n501J7730J9550O287j1027P195q58j531J3105
5299B0347J2884j6568k545j2327L231J8090j414O549j055j1879j6088j302K091
5286A4j0318R842q723o909r829j2903J3945K5046J0307J131J2695n4k776L310
5272B4778l362L524n489N559J517P278K233j2931j8165q535K581O747J0484k32
5258A5987j0980N468l791J192J0266R608k914j0790J3315M692j0775n564o799
$$ plain form
5356 -8418 -14836 -17727 -18582 -25862 -20932 -10315 417 8698 19596 19860 7056 -1151 14167 7966
5342 7966 -8568 703 -9153 -3698 5453 2155 -6035 -2617 767 1840 925 2709 1991 11960 19263
5327 19263 8437 18423 30076 18388 10234 19128 12132 6937 1189 14676 -12 -292 -6414 -1352
5313 -1352 -11555 -16418 -21260 -20729 -24603 -30104 -12374 7176 13463 2436 9631 8773 7242 20347
5299 20347 33231 16663 14118 1791 5022 23112 21698 28247 27192 15313 -775 -2077 14
5286 14 -10304 -462 -9185 -16094 -25923 -38826 -24881 165 10472 11603 24298 24244 21468 24778
5272 24778 21416 24940 19451 25010 26527 33805 36038 23107 4942 -3593 -1012 5735 16219 15987
5258 15987 5007 10475 6684 7876 18142 27750 24836 14046 27361 32053 21278 15714 8915
5245H915m512P418J0686q339l997J029r19j2386Q24L43J539J1521n622q304J4288
5230A2484M596p793m531j066L340o895O59o675M541J6207q848j8322J691J2027
5216A415n76R174j713r062l032J0077q222q924O329J9120K1153K047k0823j442
5202A5521l565j8930m433K3481Q770N253o757k1276r334J6631J163n49J473j3097
5188e649q853O181q144K760n510N113j1431q233O913R75M188Q974Q360Q20n065
5173h601J226J1979K841R873J5166r288j6944j4889R043O116o240o649n220J7411
5159E824k801J804J6863j872j2744J4913q09j5262j4755m962J8229r493j458o64
5145g187m995j7790j2248K312J5542j759N480K5510K596m784n698j3382M532J3053
$$ plain form
5245 8915 4403 11821 22507 14168 10171 11200 10281 -2105 -1281 -938 601 12122 6500 -1804 12484
5230 12484 17080 9287 4756 3690 7030 135 794 -5881 -1340 14867 6019 -12303 -10612 1415
5216 1415 839 10013 8300 -762 -3794 6283 -1939 -10863 -4534 14586 35739 37786 16963 15521
5202 15521 11956 -6974 -11407 12074 20844 26097 19340 -1936 -11270 5361 6524 5975 7448 -5649
5188 -5649 -14502 -8321 -16465 -13705 -19215 -14102 -25533 -33766 -26853 -25878 -21690 -12716 -4356 -3536 -8601
5173 -8601 -7375 4604 7445 17318 32484 23196 6252 -8637 406 6522 282 -6367 -11587 5824
5159 5824 3023 4827 21690 19818 7074 21987 21178 5916 -8839 -13801 4428 -5065 -6523 -7187
5145 -7187 -12182 -29972 -42220 -39908 -24366 -26125 -20645 4865 7461 2677 -3021 -16403 -11871 1182
5131A182J5390p169j086J6513O156m831j4945L155k766n784Q412P907k877l388
5117A5869j4469p845p707P617K9666J1959k2594j5172P502K076j3831J823R631
5104D525k597q110o804L220r65Q06K16M112J2295p908p718J3733K17o688n175
5089f841m489J4039M206j4577L286J3811P448j2890l132k691j9274J2987R333
5076A216L747M684j4899k868l71O996l624K892K423o957Q741M138j6171j3760
5062b3813P333J0159L911Q652n245O092o102k704O192N201L040j3675n300K266
5048c993o040J7754M991j0420j060J995q508n976m319J8623J6722o498j3772Q70
5034C69L467k607j2420J4213K6443q679j8969r373J5996j3972m748O879K2008
$$ plain form
5131 1182 16572 9403 8317 24830 30986 26155 11210 14365 11599 5815 14227 22134 19257 15869
5117 15869 1400 -6445 -14152 -6535 23131 35090 12496 -2676 4826 6902 -6929 -5106 4525
5104 4525 1928 -6182 -12986 -9766 -10731 -9925 -9709 -5597 6698 -1210 -8928 4805 5022 -1666 -6841
5089 -6841 -11330 2709 6915 -7662 -4376 9435 16883 3993 861 -1830 -21104 -8117 1216
5076 1216 4963 9647 -5252 -8120 -8491 -1495 -5119 -2227 196 -6761 1980 6118 -10053 -23813
5062 -23813 -16480 -6321 -2410 6242 997 7089 987 -1717 4475 9676 12716 -959 -6259 -3993
5048 -3993 -10033 7721 12712 2292 1232 3227 -5281 -11257 -15576 3047 19769 13271 -501 369
5034 369 3836 1229 -11191 3022 29465 20786 1817 -7556 8440 -5532 -10280 -3401 18607
5021A8607J0048l313J0466n867j7473j5627j2891J0430O233p963k4357j2446O542
5008c7611R151m624K704K606r34o182k839Q521O142J0681L675J4334L350j9751
4994a0777j9296J1363J2140j3164M397Q411J40j2414K763J1189n138l088l131
4981a6605J561o298p275M651O117p705K284J8660J0161l985j1138r096P888J5815
4967E035J9560r481l598m454p73J351P061M71p920l037O391l190M93k055r755
4952c901j053j0847m369R342Q561l470o610j0023P831J9971J0078j5667P99J1626
4938A2268N295J147q150j0528o356j3311j0310j988J2612J9870R712k757N839
4925A3343p80k196K250K410k588n968j1371k1713K3558J4593m68Q410j0919j3199
$$ plain form
5021 18607 28655 25342 35808 29941 12468 -3159 -16050 -5620 613 -7350 -31707 -44153 -37611
5008 -37611 -28460 -33084 -30380 -27774 -28708 -34890 -37729 -29208 -23066 -12385 -8710 5624 8974 -10777
4994 -10777 -30073 -18710 -6570 -19734 -15337 -6926 -6786 -19200 -16437 -5248 -10386 -13474 -16605
4981 -16605 -15044 -21342 -28617 -23966 -17849 -25554 -23270 -4610 5551 1566 -9572 -18668 -10780 5035
4967 5035 24595 15114 11516 7062 6289 7640 14701 15172 7252 4215 10606 7416 7909 5854 -3901
4952 -3901 -4954 -15801 -20170 -10828 -2267 -5737 -12347 -22370 -14539 5432 15510 -157 642 12268
4938 12268 17563 18710 10560 32 -6324 -19635 -29945 -31933 -19321 549 10261 7504 13343
4925 13343 12563 10367 12617 15027 12439 6471 -4900 -26613 -3055 11538 11070 19480 8561 -4638
4911d638j536J3143o021L79J3967J4259J156j5075M4q537k1366n360K2101M840
4897G356K703J4656Q771l917l845K128j0305O148J9900L478n994n864j7601k308
4883A5306m195M966Q865j257j0650m2j0750Q933L079O707K091N791M102r784m729
4868A8433l327Q368k0789m841Q35J0919K5889j0852j2494o037j1093l668L979
4855d678J2727J526k185p614L415m274N930K477Q021J0937m031r613l04J1627
4841B3961j630Q082j7060q771o474J710o826J0937m41L710J755k657j5605r318
4827a8627N816r693k024N084J5817L396K2712r098k549o726k8203K699J3043J7405
4813I052p367n44m559J18K23k260k522j1534R616O208J7108m855j4066q314L776
$$ plain form
4911 -4638 -6174 6969 948 1327 15294 29553 30709 15634 15678 7141 -14225 -19585 2516 7356
4897 7356 10059 24715 33486 29569 25724 27852 17547 23695 43595 47073 41079 35215 17614 15306
4883 15306 11111 16077 24942 23685 13035 12993 2243 11176 14255 20962 23053 28844 32946 23162 18433
4868 18433 15106 23474 2685 -2156 -1321 9598 35487 24635 12141 6104 -4989 -8657 -4678
4855 -4678 8049 9575 7390 -224 3191 -1083 4847 7324 15345 26282 22251 12638 12334 23961
4841 23961 22331 30413 13353 4582 -1892 -182 -7008 3929 3488 7198 8953 6296 -9309 -18627
4827 -18627 -12811 -22504 -24528 -19444 -3627 -231 22481 13383 10834 4108 -24095 -21396 -8353 9052
4813 9052 1685 1141 -3418 -3300 -3077 -5337 -7859 -19393 -9777 -3569 13539 8684 -5382 -13696 -9920
4798i920J0257K667P14o945k1M280j7609k919M051Q079R101K914j13o985P665
4783E216M655P648o998L330J1988r799o472m26N372Q806p192j5300N475J5758
4769B2061j251n450q847o371j949J0558J0474j4251q066M544J83m51o396N569
4755C57R322k815J568O313l448j3209J3475M582l869j1710O578K672K297J6426
4741B8539K425q681M861J351Q787l695j9234r105O63r586l539J450J1489J0656
4727A6381p237j2403P30O081j998l66j7310l013R841K3694J2150R727l115j6315
4713A6847J689j2380o65p205k588o534L887O984Q252o240q079M739P944n251K608
4698D008K0888k495j4076N764J9528M092n172j0730o352k248q215P722r581j1865
$$ plain form
4798 -9920 337 3004 3718 -3227 -3248 1032 -16577 -19496 -15445 -7366 1735 4649 4536 -2449 5216
4783 5216 9871 17519 10521 13851 25839 16040 9568 9142 14514 23320 16128 828 6303 22061
4769 22061 20810 15360 6513 142 -1807 8751 19225 4974 -3092 1452 1635 1184 -5212 357
4755 357 9679 6864 8432 14745 11297 -1912 11563 16145 12276 566 7144 9816 12113 28539
4741 28539 30964 22283 27144 28495 37282 33587 14353 5248 5911 -3675 -7214 -5764 5725 16381
4727 16381 9144 -3259 -2529 3552 1554 1188 -16122 -19135 -9294 14400 26550 36277 33162 16847
4713 16847 18536 6156 5491 -1714 -4302 -10836 -6949 35 8287 2047 -6032 -1293 6651 1400 4008
4698 4008 24896 22401 8325 14089 33617 37709 32537 21807 15455 13207 4992 12714 3133 -8732
4684h732J4798L215j363o362Q392K420j2309p666Q996J3261K33j539j7888M581
4670C7j8071N37K1775J4535p161j1386l165J530j747j326J2055j2582J246O990
4656C267L700j8145p455J2060J97k528L548L951J9084p490j6401n950j0817o575
4642b9554L092J1251r04L766P83K026R741o5l714j0379j0706j2164L971O355J4888
4627a1613M410q442k344K492K2248L101J0556p88j0960l815j1296p03J9165J0862
4613B2873j5269k2807R148Q48j992j2838J0624P949K559L242R023J7457P998j3483
4599B5332K324p493l922N40J0001J3989l942n995n087r529r638n264Q406k749
4585F973j239p580o578q44K145J1790k0913k8138N039M840K6428K6273q245j1810
$$ plain form
4684 -8732 6066 9281 7918 1556 9948 12368 59 -7607 1389 14650 14883 13344 -4544 37
4670 37 -18034 -17497 4278 18813 11652 266 -2899 -1369 -3116 -4442 7613 -4969 -3723 3267
4656 3267 6967 -11178 -18633 -6573 -6376 -8904 -5356 -1405 17679 10189 -6212 -12162 -22979 -29554
4642 -29554 -26462 -15211 -16115 -12349 -11566 -9540 201 136 -3578 -13957 -24663 -36827 -32856 -26501 -11613
4627 -11613 -7203 -15645 -17989 -15497 6751 9852 20408 19620 8660 4845 -6451 -7154 12011 22873
4613 22873 7604 -15203 -6055 -5207 -7199 -20037 -9413 -1464 1095 4337 13360 30817 38815 25332
4599 25332 27656 20163 16241 16781 26782 40771 36829 30834 25747 16218 6580 1316 9722 6973
4585 6973 5734 -1846 -8424 -9268 -7123 4667 -16246 -44384 -39345 -34505 -8077 18196 9951 -1859
4571a859P831J0522L342q551O054M712r495M38m315K541j1079J466K308j496j5435
4556a3016O364J1538m163m095r95j6180j1801J703j142k743L184K2958J3493o082
4542i77o307Q203P041j7736o434O812l025j5367J3902J1394O847K348L63K040
4528I104l621m936r714j0531Q914L0330J6921j8053k0243m587P905M266j274l879
4514F02J570j984r690J5012O692j2083q229M799l249J394J5728j136j7476o737
4500a4787K6J3933R594L754j5027l898L373j8995k4119J2737P893J0753R080Q463
4486B780Q232p818j2734q039q631Q009L988r057p333m432Q068o02Q718P990n77
4471a1438J2802M11J1364J0617J93j3456k3911J0425L635l447L41n195k659o747
$$ plain form
4571 -1859 5972 16494 19836 11285 17339 22051 12556 12994 8679 11220 141 1607 3915 2419 -13016
4556 -13016 -6652 4886 723 -3372 -4367 -20547 -32348 -30645 -31787 -34530 -31346 -8388 5105 -977
4542 -977 -7284 919 7960 -9776 -16210 -9398 -12423 -27790 -13888 -2494 4353 6701 7064 9104
4528 9104 5483 547 -9167 -19698 -10784 19546 36467 18414 -1829 -6416 1489 5755 4481 602
4514 602 2172 188 -9502 5510 12202 119 -8110 -3311 -6560 -5166 10562 9426 -8050 -14787
4500 -14787 -14761 -828 8766 12520 -2507 -6405 -3032 -22027 -46146 -33409 -25516 -14763 -5683 2780
4486 2780 11012 3194 -9540 -17579 -26210 -18201 -14213 -23270 -30603 -35035 -26967 -27569 -18851 -10861 -11438
4471 -11438 1364 1775 13139 23756 23949 10493 -13418 -2993 642 -2805 -2464 -7659 -10318 -17065
4457a7065l559K841o618J2930N053L181P011n838J0835P498N352J379Q599J623
4443C3222j2969m279J049j6723j2332j342j164N903J4918K870j2816r110K0515
4430G742J1658n391k86j75Q539J518L027j8886o432l051j9028q562J5692l212
4416a6847J5650J8894r23r773j8789M736q138n386J2742J6196J6436r326j4779
4403F93l014p758L170R235L158n47l184p470J0846M740j1132L929l37p385K511
4388b545O257L616j0478K192j1775P813J000p301l004Q89N317R162K4518O445
4374C2106j2846j1976j0853k3913K069J715J1224L614k755j868k052J8917J8165
4361B1547q72j3339J008j2560p812M339N22M636j1877R207j6632j9161J851L529
$$ plain form
4457 -17065 -20624 -17783 -24401 -11471 -6418 -3237 3774 -2064 8771 16269 21621 23000 31599 33222
4443 33222 20253 15974 17023 300 -12032 -13374 -14538 -8635 6283 9153 -3663 -12773 7742
4430 7742 19400 14009 13723 13548 22087 23605 26632 7746 1314 -1737 -20765 -29327 -13635 -16847
4416 -16847 -1197 17697 16774 7001 -11788 -7052 -15190 -20576 -7834 8362 24798 15472 693
4403 693 -2321 -10079 -6909 2326 5484 4937 1753 -5717 5129 9869 -1263 2666 2329 -5056 -2545
4388 -2545 3712 7328 -3150 -958 -12733 -4920 -3920 -11221 -14225 -13336 -8019 1143 25661 32106
4374 32106 19260 7284 -3569 -27482 -25413 -23698 -12474 -8860 -11615 -13483 -15535 3382 21547
4361 21547 20675 7336 8344 -4216 -12028 -7689 -7167 -2531 -14408 -5201 -21833 -40994 -39143 -35614
4347c5614R497M830R407J8225K362M393j5579m645Q420J5048Q426O267K955K616
4333C6608j6009l122p190j4407L236K1522M96o228N312q866r657P158J3343J1151
4319C3347j4033J588k9Q633N876n580l1637M937M129j3629p162J1102M295Q318
4305A0155j4524j9148R497K2161J800o997J11n684J5419L169P916P16j8314j7712
4291a1435r946j6736J29O516R566L716j798O997Q143K0783o43k2672P225K2021
4277B1866q80r85J4233n118k1780J027K357j690L873L465J556M501L259m347j697
4262A9640r098M396M402m601l584M470J625j337j2516O288q554J190R639O958
4248A8918M571m246L601Q970j6946j1846k464J0646j1620j0405l670J1127O307
$$ plain form
4347 -35614 -26117 -21287 -11880 6345 8707 13100 -2479 -7124 1296 16344 24770 31037 33992 36608
4333 36608 20599 17477 10287 -4120 -884 20638 21134 14906 20218 11352 1695 8853 22196 33347
4319 33347 19314 20902 20873 29506 35382 29802 -1835 3102 7231 -6398 -13560 -2458 1837 10155
4305 10155 -4369 -23517 -14020 8141 9941 2944 3055 -2629 12790 15959 23875 24591 6277 -11435
4291 -11435 -21381 -38117 -37988 -31472 -21906 -18190 -19988 -12991 -4848 15935 15292 -7380 -155 21866
4277 21866 20986 20001 34234 29116 7336 8363 10720 9030 12903 16368 17924 22425 25684 21337 19640
4262 19640 10542 14938 19340 14739 11155 15625 17250 15913 3397 9685 1131 2321 11960 18918
4248 18918 23489 19243 22844 31814 14868 3022 558 11204 -416 -10821 -14491 -3364 2943
4235B943L497J4091l537m673o41q042j2580r874L356P05M199k027K660Q713O158
4220D948R519k579J364J2830L126q076p513j1925p40J0753p410N337Q120j2208
4206E546k1124k287k626Q887R896J0171L777J331j8371o826L161L551q22K766
4192b970K992K527J6127O829R662l60r883o872n801k4598j6245J6096J1294J3424
4178A2222j0562N726n816j2228L431p46K43l162P871J0480L376J708L115K283
4164A7941L046k220j4251k1021k1102J5020J8591r979m148m46Q20J0968J2523
4151E742j3286j2577K2331J3179P826J764M774r834J190J909L057j3833j4671
4138b429j831q047N058L0616Q697j3705j7613j8526K022l15m314M246l145J2774
$$ plain form
4235 2943 6440 20531 16994 12321 11680 3638 -8942 -18816 -15460 -14755 -10556 -12583 -9923 -1210 4948
4220 4948 14467 11888 13252 26082 29208 21132 13619 1694 954 11707 4297 9634 17754 5546
4206 5546 -15578 -17865 -20491 -11604 -1708 8463 12240 13571 -4800 -11626 -8465 -4914 -5736 -2970
4192 -2970 22 2549 18676 25505 35167 34807 24924 18052 12251 -12347 -28592 -12496 -1202 12222
4178 12222 1660 7386 1570 -10658 -7227 -7973 -7730 -10892 -3021 7459 10835 12543 15658 17941
4164 17941 20987 18767 4516 -16505 -37607 -22587 -3996 -13975 -18123 -18569 -17749 -6781 5742
4151 5742 -7544 -20121 2210 15389 23215 24979 29753 19919 21109 23018 26075 12242 -2429
4138 -2429 -4260 -12307 -7249 23367 32064 18359 746 -17780 -15758 -16073 -20387 -16141 -19286 -6512
4124f512j0308j930K451j565J3845K4825K0154j559L786o730m518R850q490j1471
4110B1828M969O5K775j4792j3298R112l662P498M253O475m540k296k438j1720
4096D229j0349j3057l043O331N145K0526J5421N153j1175l507q727j8640j8423
4083c0116j1070J427L365N901L19K139R564J828j1938Q018J8681K3258J1096J3347
4069D5819j4540j5738j7099j6271l779O276K2532J597K948O664K208q567l621
4056H429J730L595l737J4181J3247j2543j5391P036J8085n223Q753P417J2710
4043E8289R898j3143k3935j5781j5176j0073Q856j0522o695Q516r01q438p765
4030b6870K4J52M69R054J3969q44J1463q606n534l1o872l934J1582K5888J9904
$$ plain form
4124 -6512 -16820 -18750 -16299 -17864 -4019 20806 40960 39401 43187 36457 31939 41789 33299 21828
4110 21828 26797 26862 29637 14845 1547 10659 6997 14495 18748 25223 20683 18387 15949 4229
4096 4229 -6120 -19177 -22220 -15889 -10744 9782 25203 30356 19181 15674 6947 -11693 -30116
4083 -30116 -41186 -39759 -36394 -30493 -30174 -28035 -18471 -16643 -28581 -20563 -1882 21376 32472 45819
4069 45819 31279 15541 -1558 -17829 -21608 -15332 7200 8797 11745 18409 20617 12050 8429
4056 8429 10159 13754 10017 24198 37445 24902 9511 16547 34632 29409 38162 45579 58289
4043 58289 68187 55044 31109 15328 152 -9921 -1065 -11587 -18282 -9766 -10667 -19105 -26870
4030 -26870 -26846 -26694 -26225 -17171 -3202 -4046 7417 -1189 -6723 -6754 -13626 -17560 -5978 19910 39814
4015C9814j3189j2869q838m734O095q17j1902J9807R386K581M409l359j6737P389
4001A7036K520k2834L487K51J3388N447q151O393M743j4163k0204o639p948J2133
3987a4541K0296K991M690l421O374J28Q324p906l7268Q579Q331m601K494n877
3973a1407l536J7791Q935R40n283L387q562k424N203J0677J5811J860j3094j107
3959A9191L780K144j1398o572O013j6386k1646L642K830O227J9291J9209P057
3946C3382r249j8930o167K146L27r094o714r304M640N631q417q747J603M730O513
3931a7650L725K04J3746K54R67l369j2665m035n376N201R942n473j4885R67L4179
3916E732J7083J2605j4600r486P321J5752j2276o931J5151k423o465o976j3904
$$ plain form
4015 39814 26625 13756 4918 184 6279 5462 -6440 13367 22753 25334 29743 26384 9647 17036
4001 17036 19556 -3278 209 460 13848 19295 11144 17537 22280 8117 -12087 -18726 -26674 -14541
3987 -14541 5755 8746 13436 10015 16389 16517 24841 16935 -20333 -11754 -3423 -8024 -5530 -11407
3973 -11407 -14943 2848 11783 12723 7440 10827 2265 -159 5044 15721 31532 33392 20298 19191
3959 19191 22971 25115 13717 7145 13158 -3228 -24874 -21232 -18402 -12175 7116 26325 33382
3946 33382 24133 5203 -964 1182 1509 -7585 -14299 -23603 -18963 -13332 -21749 -30496 -28893 -24163 -17650
3931 -17650 -13925 -13721 25 279 1246 -2123 -14788 -18823 -24199 -18998 -9056 -14529 -29414 -28447 5732
3916 5732 22815 35420 20820 11334 18655 34407 22131 15200 30351 27928 21463 14487 583
3903E83l628P516j5631J476j050j172N181k846K357l197O354J0489o826o395J1205
3888D416j348l220N156R099m315K181q126m589M414N792L411r07p22j4693r270
3873a2721M433N015m916R031J2240l889L012o335q53J7204L355J022M065J221
3859C1884p502O404l830j1834l132R126J6986l386q543k246k668Q219k828M11
3845B7061O485P422O964j608k2216l812o66P324M786J2427j0277k6518k0653j1899
3831b5180L01Q214K167j4095J593M369N956r59J1606j1081r242N212N673o181
3817b1647k967J235Q349J3952P453M77m18P043M549l830j1019q33M455O91Q79
3802H369k054j607j2261j1944R600J3126O440Kl817J2363L788n44l401m497j8523
$$ plain form
3903 583 -3045 4471 -11160 -9684 -10734 -11906 -6725 -9571 -7214 -10411 -4057 6432 -394 -6789 4416
3888 4416 3068 -152 5004 14103 9788 11969 3843 -746 3668 9460 12871 11964 11242 -3451 -12721
3873 -12721 -8288 -3273 -8189 842 13082 9193 12205 5870 5017 22221 25576 26598 30663 31884
3859 31884 24382 30786 26956 15122 11990 21116 38102 34716 26173 23927 21259 29478 26650 27061
3845 27061 33546 40968 47932 46324 24108 20296 19630 26954 31740 44167 33890 7372 -13281 -25180
3831 -25180 -24879 -16665 -14498 -28593 -27000 -22631 -16675 -17634 -6028 -17109 -26351 -21139 -15466 -21647
3817 -21647 -24614 -23379 -15030 -1078 6375 6852 6434 13477 18026 14196 3177 2344 6799 7490 8369
3802 8369 6315 4708 -7553 -19497 -9897 3229 9669 9671 5854 18217 22005 21461 18060 13563 -4960
3787d960j942k064o778J4170R728q646L430k4053k618j702M400l570o884P246
3773b4243Q121n393k330Q49R190k739R587J6068p197J1549N898k947M490J6314
3759C7217l090j4189m42n089J1366o742q717J343J3690j3296j0721m192N983n011
3745a890J5773k437j9182j3286J8641J5148L392J1340o408j3218k286J032K994
3732I613m262p055j7561O280j0J0706K6245J1524O005j5845k0474k700K6128Q383
3718C6977k0217M16N521J3038o616j7155j2302J0241J3978j635J15k43M555r630
3704A7043j4054m219J0368K5725J0974j3551k0831J0177J4021n758j9968j1503
3692a576R669J5383j1954L273J674r931j098j380o698j8888L688K0688J3344n653
$$ plain form
3787 -4960 -6902 -8966 -15744 -1574 8154 -492 2938 -21115 -23733 -25435 -21035 -24605 -31489 -24243
3773 -24243 -16122 -21515 -23845 -22996 -13806 -16545 -6958 9110 1913 13462 19360 16413 20903 37217
3759 37217 34127 19938 19496 14407 25773 19031 10314 11657 25347 12051 1330 -2862 3121 -1890
3745 -1890 13883 11446 -7736 -21022 -2381 12767 16159 27499 21091 7873 5587 6619 9613
3732 9613 5351 -1704 -19265 -12985 -12995 -2289 23956 35480 41485 25640 5166 2466 28594 36977
3718 36977 16760 17176 22697 35735 29119 11964 -338 9903 23881 22246 22361 22118 26673 17043
3704 17043 2989 -1230 9138 34863 45837 32286 11455 21632 35653 29895 9927 -1576
3692 -1576 8093 23476 11522 14795 16469 6538 5440 4060 -2638 -21526 -17838 2850 16194 10541
3678A0541p344L831j0466p136L866m288m170J5842k864M208N804j792j3641j6949
3664b4558j667M480K0646l143K495J727Q001M859J2479r926j5598R035K842j0723
3650I49n402M427J5717l342j8150j7052J474K3061J9075j627k422j2929L547L192
3636A0518l085j6637J1986J1264J854p102M296L918j2852n35M163L890J671j920
3622A1429n134m447P573m094p392J1123J0737L339N590k23K714m634q186n676
3608A2719j2106k248j198N86O037N239J3700L4j897J1444k379j6906j3230J5227
3594A5022L036k1390j4152n236n212J5814O419R037k434j8832l774J1040L341
3581g321j366l075M204K758O969m691Q020n95p091j254j1606j3441L522L093J3005
$$ plain form
3678 10541 3197 7028 -3438 -10574 -6708 -10996 -15166 676 -2188 2020 7824 6032 -7609 -24558
3664 -24558 -26225 -21745 -1099 -4242 -1747 -20 7981 12840 25319 15393 -205 8830 11672 949
3650 949 -4453 -26 15691 12349 -5801 -22853 -21379 1682 20757 19130 16708 3779 7326 10518
3636 10518 7433 -9204 2782 14046 15900 8798 13094 17012 4160 3625 7788 11678 13349 11429
3622 11429 6295 1848 9421 5327 -2065 9058 19795 23134 28724 28501 31215 26581 18395 12719
3608 12719 613 -1635 -2833 -2247 3790 9029 22729 22763 20866 32310 29931 13025 -205 15022
3594 15022 18058 -3332 -17484 -22720 -27932 -12118 -5699 3338 904 -17928 -21702 -10662 -7321
3581 -7321 -8687 -11762 -7558 -4800 2169 -2522 5498 4903 -2188 -3442 -15048 -28489 -24967 -21874 -8869
3566h869J1011K050J0824Q579m092k1955j5763m447M546J5969J6533M958r737
3553I607j7375l862J0489J6209O162n446j1330k450K671l418m524L955l547r176
3539a2035n918J0174J2374J6965J133j6171p076k654K52O357J138J0682j380o172
3525G669k677j4403r631n600J2908N771r574M041J6682P697N434r393n107j116
3511B701J2718P59K121m936j0106L692J275j5030P212L362J2692j290J3088n219
3497B3039r021J4207M031k567r884L362k489r757j6142K653J5336j908q939j1159
3483i238J1660O34J299M705Q17J829m040p896J1621n109O80J0860m487j3822K416
3468A929l872k949q67R266q445j901J59K8081N920j3946o833q919K082Q345j5315
$$ plain form
3566 -8869 2142 4192 15016 23595 19503 -2452 -18215 -22662 -18116 -2147 14386 19344 9607
3553 9607 -7768 -11630 -1141 15068 21230 15784 4454 2004 4675 1257 -3267 688 -2859 -12035
3539 -12035 -17953 -7779 4595 21560 22693 6522 -554 -3208 -2956 3401 4539 15221 13841 7669
3525 7669 4992 -9411 -19042 -24642 -11734 -5963 -15537 -11496 5186 12883 18317 8924 3817 2701
3511 2701 15419 16178 18299 13363 3257 6949 8224 -6806 406 3768 16460 15170 28258 23039
3497 23039 14018 28225 32256 29689 19805 23167 20678 10921 -5221 -2568 12768 10860 1921 -9238
3483 -9238 2422 3056 4355 9060 9877 11706 7666 -230 11391 6282 6962 17822 13335 -487 1929
3468 1929 -1943 -4892 -5759 3507 -4938 -6839 -6680 21401 27321 13375 6542 -2377 -295 8050 -7265
3453g265k0833N916J1404J1322m95O930J1415P190p334k4067r625K6169J560k1970
3439i683k131J0990J1756j748Q885J3580j4006j3898Q480Q678J363q017j0708
3426C541j658J8204K0889j9040k6318O624N968K347M60m119J7926L893k159j0120
3412A6438J477m814o063r16k128l067j0764q542m231J1706J7264J089j1774j02
3398d427m511M523P55L137Q953N770R723J2642r80j5641l137k1636O582K188K3
3383C964l432m100K083J0754J6244P762j6035j0869J3082R600j5075k0693L55
3370f360J3323L913o169k523M457K854j401q742l796J5627m687n819J1568p70
3356A1475M438K356o354n873m318K583J1180N269K28j6626m801K937O068K618
$$ plain form
3453 -7265 -28098 -22182 -10778 544 49 6979 18394 25584 18250 -5817 -15442 10727 12287 -9683
3439 -9683 -11814 -824 10932 9184 18069 31649 17643 3745 12225 20903 22266 14249 3541
3426 3541 1883 20087 40976 21936 -4382 2242 8210 10557 11017 6898 24824 28717 26558 16438
3412 16438 17915 13101 7038 6122 3994 927 -9837 -18379 -22610 -10904 6360 7449 -4325 -4427
3398 -4427 -8938 -4415 -3660 -523 8430 14200 23923 36565 35585 19944 16807 -4829 1753 3941 3964
3383 3964 532 -3568 -1485 9269 25513 33275 17240 6371 19453 29053 13978 -6715 -6360
3370 -6360 6963 10876 4707 2184 6641 9495 8094 -648 -4444 11183 6496 677 12245 11475
3356 11475 15913 18269 11915 6042 1724 4307 15487 20756 20984 4358 -443 2494 8562 11180
3342A1180j4411p042J6143O906J477j7346n051P238o43J975J540j523O228o611
3328F0j2237o962J0225N362J2300M997j709j7333m089l352N748k93N580J8437
3314A6734l926m719K170j184k6416l310J5421J7574J2974R365k505N489j2898
3301B4769j4016o274P461M894j3005k3070j2738J6725m139K395J4989m654Q177
3288A514N436p264Q203J5596N289M85O744j6833k2904J1014M944j5936k994J3221
3274F515j84j2605j5162j7523J0005J7595J7807J1654j191p141J327r576k767
3261a246j428K103n119O669L1197M693m571L469R80j2234M657l783l947O500O765
3246C4705O902P076n295j0459j9818p914N903J3128l616o700J076l180p809j570
$$ plain form
3342 11180 -3231 -10273 5870 12776 14253 -3093 -8144 -906 -1549 426 1966 443 6671 60
3328 60 -12177 -19139 -8914 -3552 8748 13745 12036 -5297 -9386 -12738 -6990 -7283 -1703 16734
3314 16734 12808 8089 10259 9075 -17341 -20651 -5230 12344 25318 34683 32178 37667 24769
3301 24769 10753 4479 11940 16834 3829 -19241 -31979 -15254 -19393 -16998 -2009 -6663 1514
3288 1514 6950 -314 7889 23485 28774 29259 36003 19170 -3734 7280 12224 -3712 -6706 6515
3274 6515 6331 -6274 -21436 -38959 -28954 -11359 6448 18102 16911 9770 11097 1521 -1246
3261 -1246 -2674 -571 -5690 979 32176 36869 32298 35767 36747 24513 29170 25387 21440 27940 34705
3246 34705 41607 48683 43388 32929 13111 5197 11100 24228 20612 13912 14988 11808 3999 2429
3232B429N500K339L726j686j4100j0933j3603q344J0030J3564J4756j764o218
3219d304o01k923r749l209j054K192k803J4871J9593o69j3103J456o931K428J9935
3204A5129P651l671p512j553n826P198j7431r460j1018j9341L671o706o82J9187
3190c0364J3365J1270R91l000j0305K0111J3468M56J0391j74j8628Q627J6579
3177C2787J3556P476p090j8417r226k6165r889J4179O517l366J0403o234n014
3164d83J4567j827l431Q981J0672o88j3215r635Q425r16J585R916O352o910k29
3149B3164O99J7609M750p164j0059m767J5939l94j1500r72j3066l834J1412q875
3135A2942p195j8932q48q393Q135R159n879k961P993J1154j871n510O400L039
$$ plain form
3232 2429 7929 10268 13994 12308 -1792 -12725 -26328 -34672 -24642 -11078 3678 1914 -4304
3219 -4304 -4905 -7828 -17577 -20786 -21840 -19648 -22451 -7580 12013 11344 -1759 -303 -7234 -4806 15129
3204 15129 22780 19109 11597 10044 4218 11416 -6015 -15475 -26493 -45834 -42163 -48869 -49551 -30364
3190 -30364 -16999 -5729 -4738 -7738 -18043 2068 15536 15992 26383 26209 7581 16208 32787
3177 32787 46343 53819 46729 28312 19086 -7079 -16968 -2789 3728 362 10765 4531 -483
3164 -483 14084 12257 8826 17807 28479 27791 14576 4941 13366 12450 14035 23951 30303 23393 23164
3149 23164 23863 41472 46222 39058 28999 24232 40171 39777 28277 27305 14239 10405 21817 12942
3135 12942 5747 -13185 -14033 -22426 -14291 -5132 -11011 -13972 -5979 5175 3304 -2206 4194 7233
3121G233q739k228J1572K1909J338j0013k251k945k0573q192J0789K4775n340
3108A7335j2846m66O617J0934J183l711R308K090K987p754j7351K88J0488l02
3094A8800j222j2733j3702R036J7286P42o336r836k5196j692J2870O473k193N93
3080g110R799r249n007m154l946l929J1852J0088M247P654P563r284l765N136
3066I895o457q919M429k903L404m758m636M4N248P713K756j4760J094J8569K233
3051A2952k917M083O621j1312M416J4845P958J623m898l0566j141O885j516o77
3037F356p513j0225M218j52j3311n535K2824J4416J3283o907k5578J167J6205
3024I248P252n562o84J2733l04N305k938j1125k313M466j2821p91p045k47N861
$$ plain form
3121 7233 -1506 -3734 7838 29747 31085 21072 18821 15876 -4697 -12889 -2100 22675 17335
3108 17335 4489 4023 10640 21574 22757 19046 28354 30444 33431 25677 8326 8614 19102 18800
3094 18800 17578 4845 -8857 179 17465 18207 11871 2035 -23161 -24853 -11983 -5510 -7703 -7110
3080 -7110 2689 -6560 -11567 -15721 -19667 -23596 -11744 -1656 2591 10245 17808 8524 4759 9895
3066 9895 3438 -5481 -1052 -3955 -551 -5309 -9945 -9901 -4653 3060 5816 -8944 -7850 10719 12952
3051 12952 10035 14118 20739 9427 13843 28688 36646 38269 33371 2805 1664 8549 7033 6356
3037 6356 -1157 -11382 -7164 -7316 -20627 -26162 -3338 11078 24361 17454 -8124 -6957 9248
3024 9248 16500 10938 10254 22987 22683 27988 25050 13925 11612 16078 3257 2466 -4579 -4826 1035
3009A035K197o503l739m045L142j114q109j503O965J2164R164n302q992p79J2694
2994G275M523K02P590J626n961l116J786j4804J779r623j052p957p504N255K150
2979a7831J1002K258j0955R325K2268J0663j4541r639R052N117k035k581P123
2966A9226M243K814m57R678J0717j2059o701o7J1856M92j8264j0996r299J4179
2952A5362N269k424J108n415K100j602j7695j059K0316L085j8336j4313j2112
2939b5716k098K3912J9841O789Q543j2993m504r649p764j1986J3813J5509m238
2926I459l385j3337q789P164K944J2511j1004l132J5722K765n19O27L227j6255
2912b002l006O61J0487k775k338L128k882p987M754O063r462l377O866K13L389
$$ plain form
3009 1035 3232 -3271 -7010 -11055 -7913 -9027 -17136 -18639 -11674 490 9654 4352 -4640 -5419 7275
2994 7275 11798 12000 19590 21216 15255 12139 13925 -879 900 -8723 -9775 -17732 -25236 -19981 -17831
2979 -17831 -6829 -4571 -15526 -6201 16067 26730 12189 2550 11602 16719 14684 12103 19226
2966 19226 23469 26283 25826 35504 46221 34162 27461 27394 39250 39742 21478 10482 1183 15362
2952 15362 20631 18207 19315 13900 16000 14398 -3297 -4356 15960 19045 709 -13604 -25716
2939 -25716 -27814 -3902 15939 22728 31271 18278 13774 4125 -3639 -15625 -1812 13697 9459
2926 9459 6074 -7263 -16052 -8888 -5944 6567 -4437 -7569 8153 10918 10399 11026 14253 -2002
2912 -2002 -5008 -4347 6140 3365 1027 4155 1273 -6714 -1960 4103 -5359 -8736 -1870 -1657 1732
2897A732l153r73l076j3046K727J4009K5041J1366j5015j766o145j8352L868P346
2883D563l459r399m894j2710J4899J2581j932k553J8Q885o143j0328m236m280
2869a8988J3784M749J0835K721m395k3897K968J6319p619N272K472J391n458j389
2855a235l299q699L381L676J875J109L717N888j0185P788M391M257p873m696p13
2840f18K654m138k5210j0446J5714P232K1842P935j1657j516q130r989L571j224
2826a3980J995Q276L810k863L01O512j0695j4288P218K335L011N797j697O058
2812A790P78j2186q047J4133O344k893K076R297q615r156n198J597N492q65k083
2797g536M581J536Q442L408j943j0018J1950J833k1709J1860J905l1444L802L3285
$$ plain form
2897 1732 -1421 -2394 -5470 -18516 -15789 -1780 23261 34627 19612 17846 11701 -6651 -2783 4563
2883 4563 1104 -8295 -13189 -25899 -11000 1581 -351 -2904 -2886 5999 -144 -10472 -14708 -18988
2869 -18988 -5204 -455 10380 13101 8706 -15191 -12223 4096 -3523 1749 4221 5612 154 -1235
2855 -1235 -4534 -13233 -9852 -6176 -4301 -3192 525 6413 -3772 4016 8407 12664 4791 95 -618
2840 -618 2036 -2102 -27312 -37758 -22044 -14812 7030 14965 3308 1792 -6338 -16327 -12756 -13980
2826 -13980 -11985 -3709 101 -2762 -2461 4051 -6644 -20932 -13714 -11379 -8368 -2571 -4268 1790
2812 1790 2568 -9618 -17665 -3532 2812 -81 1995 11292 2677 -6479 -11677 -10080 -4588 -5453 -7536
2797 -7536 -2955 -1419 7023 10431 8488 -1530 10420 12253 -9456 2404 4309 -27135 -23333 9952
2783I952P962K88j4953o242N22L347R701m016M985L695O872j0773j3111J4690
2769A2919J7643j194j7590j0723p423k755j0603J8m324N112J4798Q093j9533J7231
2755A669J2274j1387k3909L548P725J0018j0651K510m479l245N767O393K3720
2742A9953j27j4187j607L870O515q173j0581l897O469Q626R187l165k5654r772
2728b2543l833J2871J8701Q839j0066j0309K6403K775k3155n015Q822L445q561
2715a626r03j5567p899P502r67k234O136M118j6445m772Q124m09J8508R0k85P249
2699F20R070N720O193j5694j3951J4186R235m943N756q559k796N291J3248k086
2685B1290j2269L749o680J2264k160n858j3100p625J2699J5502N033L890j3338
$$ plain form
2783 9952 17914 18202 3249 -2993 -2471 876 10577 6561 11546 15241 22113 11340 -1771 12919
2769 12919 30562 29368 11778 1055 -6368 -9123 -19726 -19708 -24032 -18920 -4122 3971 -15562 1669
2755 1669 13943 2556 -21353 -17805 -10080 -62 -10713 -8203 -12682 -15927 -10160 -3767 19953
2742 19953 19826 5639 4032 7902 14417 6244 -4337 -8234 -1765 6861 16048 12883 -12771 -22543
2728 -22543 -26376 -13505 5196 14035 3969 -6340 20063 22838 -317 -5332 3490 6935 -1626
2715 -1626 -2529 -18096 -25995 -18493 -19460 -21694 -15558 -11440 -27885 -32657 -24533 -24942 -6434 -6344 -6629 620
2699 620 9690 15410 21603 5909 -8042 6144 15379 10436 16192 7633 4837 10128 23376 21290
2685 21290 9021 12770 6090 18354 16194 10336 -2764 -10389 2310 17812 22845 26735 13397
2672A3397n768J0553M161r25N047j2958j1035j092K2198J472j0519j9549k66J6286
2658A1002L809j1756n658o171m309J3882j609P970j6200l285L804j0819N553J4287
2644E00J5523O441j9874j5058N115j6220K2336J7484k4547N806o597q166j3779
2631c1036J4467K512K384J1021J0535q218o409k316n421J2636M586J179J2806
2618A8726J7664Q412m596j4663J13j5553j5648K925l714J0414Q978J3450j0872
2605A5636j6387q702L333R992M416J2960m754j1844m283N303K335r394O757P36
2591F104M979l699k827j923j0042q045J4761J4106P4r303M587M844m641R052k392
2576A5635o734q038l0j6626m36J7512O373R404j595j2183j2244p422J817j954
$$ plain form
2672 13397 7629 18182 22343 21418 26465 13507 2472 1380 23578 25050 14531 -5018 -5284 11002
2658 11002 14811 3055 -2603 -8774 -13083 799 -810 7160 -9040 -12325 -8521 -19340 -13787 500
2644 500 16023 22464 2590 -12468 -7353 -23573 -1237 16247 -8300 -2494 -9091 -17257 -31036
2631 -31036 -16569 -14057 -11673 -652 9883 1665 -4744 -7060 -12481 155 4741 5920 18726
2618 18726 36390 44802 40206 25543 25656 10103 -5545 -2620 -6334 4080 13058 26508 15636
2605 15636 -751 -9453 -6120 3872 8288 21248 16494 4650 367 5670 8005 -1389 5368 6104
2591 6104 11083 7384 4557 2634 -7408 -15453 -692 13414 13488 4185 8772 13616 8975 18027 15635
2576 15635 8901 863 833 -15793 -16229 1283 7656 17060 15465 3282 -8962 -16384 -14567 -16521
2562a6521R227Q290L056K397M72k537j95Q171J8797j3661o433K415k4263p083
2548a7868Q587j197n735M089o497R28l282J2486J5584k2710j4044M613L0316J4768
2534B0038L242o940k0636j6673p3L852J5333j902k4633j814K7758J6580o548r721
2520b137o569Q578J2020O160K656k534r681o382Q428J4181k7006n819l517M430
2506g192K71P465M67L596N993L063K595p601K602j2062n109L885j0916J0491J5900
2491A3448Q180Q286j2661J683k272j0990j0278j8189J1123J1037j595P863m71
2478E164j3541j0430R320J0522M273Q812j0229j138l463p919r16J4550P747R97
2464A3749j1024q982m652J7281K1954p757j915p850K934J1436P215r525j094J168
$$ plain form
2562 -16521 -7294 996 4052 6449 6921 4384 4189 12360 31157 17496 11063 13478 -10785 -17868
2548 -17868 -9281 -10478 -16213 -12124 -18621 -17693 -20975 -8489 7095 -15615 -29659 -25046 5270 20038
2534 20038 23280 16340 -4296 -20969 -21042 -17190 -1857 -3759 -28392 -30206 -2448 14132 7584 -2137
2520 -2137 -8706 -128 11892 18052 20708 18174 8493 2111 10539 24720 -2286 -8105 -11622 -7192
2506 -7192 -6921 544 1011 4607 10600 13663 16258 8657 11259 -803 -5912 -2027 -12943 -2452 13448
2491 13448 21628 29914 17253 18936 16664 5674 -4604 -22793 -11670 -633 -2228 5635 5164
2478 5164 -8377 -18807 -9487 1035 5308 14120 3891 2753 -710 -8629 -9545 5005 12752 13749
2464 13749 2725 -6257 -10909 6372 28326 20569 18654 10804 13738 25174 32389 22864 21770 22938
2450B2938k224m613j0522j870J1739K339j4335N96P107Q539o394j1002j8520J835
2436a4387J2229O431M215q191j2952j633J9164K849m362J1470P884O193m201P206
2422C1915p603k7606q418L122M468J9171r162J340L229j1181k0085k640J0643
2409a2807P717J6056L827j3411K656N555J304N225P931o286j9430j767J8971l329
2395A2212j2930J886n985O918K078M874J966o577k504M231n889k669J953p567
2381h003k0465J40O507M575R0o150j5672j4903J5835J4451N56J890R236J3644
2367A731n56j9376j3820Q305O857j1106J6014P700m730Q251J5364k686r24N517
2353A6541n321o891j0064J695R447O625Q445j1040q04L749K879J8149k773j700
$$ plain form
2450 22938 20714 16101 5579 3709 15448 17787 3452 4048 11155 19694 13300 2298 -16222 -14387
2436 -14387 -2158 4273 8488 297 -12655 -14288 4876 7725 3363 14833 22717 28910 24709 31915
2422 31915 24312 -3294 -11712 -8590 -4122 15049 5887 7227 10456 -725 -20810 -23450 -12807
2409 -12807 -5090 10966 14793 1382 4038 9593 10897 16122 24053 17767 -1663 -3430 15541 12212
2395 12212 -718 1168 -4817 2101 4179 9053 11019 4442 1938 6169 280 -2389 -436 -8003
2381 -8003 -28468 -28328 -21821 -17246 -17156 -23306 -38978 -53881 -38046 -23595 -23039 -21149 -11913 1731
2367 1731 1175 -18201 -32021 -23716 -16859 -27965 -11951 -4251 -8981 -730 14634 11948 11024 16541
2353 16541 11220 4329 -5735 -4040 5407 12032 20477 9437 8633 12382 15261 33410 30637 28937
2339B8937J2863R53k3471j4119j1644q865p509N309J1727P758n473j877N025J4749
2325A4363L829m314j4881m859J1242L053j3786L432o45J4989J4071j0246m346
2312A1902p238j6880j2413m880j926J1781M693j0430p87n133j204J1497J1614
2299i404J924k476K02J857J8257o792k1250j3047P772J4363Q505J1207L147P46
2285A5011n651m151m911n357j4716j669N240J3360Q556n43n762R593O894n220
2271A0674r480j710n631n980n738O616N000J3476R050m824n955n197J0130j1089
2257f58l007J2611J014o777Q56k775j1917k93K682m878Q611L77o621O184m137
2242h728l82J3057J0403N23p31K078j3279o212n97n702k213M468j5767K0884J4015
$$ plain form
2339 28937 41800 42753 19282 5163 -6481 -15346 -22855 -17546 -5819 1939 -3534 -5411 -386 14363
2325 14363 18192 13878 -1003 -5862 5380 8433 -5353 -1921 -2566 12423 26494 16248 11902
2312 11902 4664 -12216 -24629 -29509 -31435 -19654 -14961 -25391 -26178 -31311 -32515 -21018 -9404
2299 -9404 -7480 -9956 -9754 -7897 10360 3568 -17682 -30729 -22957 -8594 -89 11118 14265 15011
2285 15011 9360 5209 298 -5059 -19775 -21444 -16204 -2844 5712 5169 -593 9000 15894 10674
2271 10674 1194 -516 -6147 -12127 -17865 -11249 -6249 7227 16277 11453 5498 301 10431 -658
2257 -658 -3665 8946 9960 3183 4039 1264 -10653 -10946 -8264 -13142 -4531 -4154 -10775 -4591 -8728
2242 -8728 -9110 3947 14350 14873 14142 16220 2941 -3271 -3868 -9570 -11783 -7315 -23082 -2198 11817
2227A1817j927l427l984k884j323m978l751l715J4836K078k943K630l396K275
2213A308P413J620J2387J7368r874k1755m558l678m249l907j114J3309Q130l643
2199H757m844Q540J686O03j0301q515K507J5332l830n015J0614R371O738r811
2185B1832n949K868r951o697J3509P306j4219j935Q36M362J2537m581j6325l494
2171I9J1890J7774L192R599k8646k8387J4613J4158q317M681J2862k251r249p675
2157D343n057K098j818r102m173N823R671P118k4488k977J9270J6985j7102K771
2143C362R514P903j1599r773m741J5629O699k772k3108K653J1036N276j0096K518
2129B501o385M121J7106J0082n902j5438j9558j4892N790P591J084O50P666j1135
$$ plain form
2227 11817 9890 6463 2479 -405 -1728 -6706 -10457 -14172 664 2742 -201 2429 -967 1308
2213 1308 8721 10341 22728 40096 30222 8467 3909 231 -4018 -7925 -9039 4270 12400 8757
2199 8757 3913 12453 14139 14742 4441 -4074 -1567 13765 9935 4920 15534 24905 31643 21832
2185 21832 15883 18751 8800 2103 15612 22918 8699 6764 7600 11962 24499 19918 3593 99
2171 99 11989 29763 32955 42554 13908 -14479 134 14292 5975 10656 23518 21267 12018 4343
2157 4343 -714 1384 -434 -9536 -13709 -7886 1785 8903 -15585 -18562 708 17693 591 3362
2143 3362 12876 20779 9180 -593 -5334 10295 16994 14222 -8886 -6233 4803 10079 -17 2501
2129 2501 -3884 237 17343 27425 21523 6085 -13473 -28365 -22575 -14984 -13900 -13250 -5584 -16719
2115a6719K607J1126J2718r661q335M5J0176J829j526J867k531l276O14n55O42
2100i79o008j6977k486J2594K3268J0256K839Q816j0366k2179j4775K179J2170
2087a648J7564O536J476p566J794L650j0196O357p45J918L328K605j2684k6034
2073a3645j1044L606M133K2430l564j7789L295M249J0219K1338l718j3993L384
2060H901j859n116N152n121k3724p376O500p132l369J8600J5889J0880m257q267
2046b99p507j142j165N682J6130K4314L341j6378j6799j2159L130J1217m134l892
2032C39k895Q541Q305m861r231p123k363L543K732L42Q552J1717k7810j0667J7702
2017c177Q204k23N554l230p775l430K424N693j4071q742l395k005r84L144J3217
$$ plain form
2115 -16719 -14112 -2986 9732 71 -8264 -8219 1957 3786 2260 4127 1596 -1680 -1066 -1621 -979
2100 -979 -6987 -23964 -26450 -13856 9412 19668 22507 31323 20957 -1222 -15997 -13818 -1648
2087 -1648 15916 22452 23928 16362 18156 21806 11610 17967 17222 19140 22468 25073 12389 -13645
2073 -13645 -24689 -21083 -16950 5480 1916 -15873 -12578 -8329 1890 23228 19510 5517 8901
2060 8901 7042 1926 7078 1957 -21767 -29143 -22643 -29775 -33144 -14544 1345 12225 7968 -299
2046 -299 -7806 -8948 -10113 -4431 11699 36013 39354 22976 6177 -5982 -2852 8365 4231 339
2032 339 -2556 5985 14290 9429 198 -6925 -9288 -5745 -3013 -2671 5881 17598 -10212 -20879 -3177
2017 -3177 5027 4804 10358 7128 -647 -4077 -1653 4040 -10031 -18773 -22168 -24173 -25157 -22013 -8796
2002h796K265j4927k343J1629R563Q681K1909M369J376M842j710k206k6045r12
1988G695l294r464J4625N353k1315j7315M512k495j148P559J344j3624J5047J1651
1974h69j6395K026K555j8175N150j782j1263J8343R108N977K53j459l854q938
1960a9323j1451J0736Q037J3741J616m551j3215P144L574N982K6115r294k629
1947A6482k596k3903k0359J1685J5450Q501J3899P938j4467j1190N211Q006N651
1934B0308o479k459l605n401K548J4305j4807j4282K455j1299N59K8990q055k0161
1920a7383P7J0194M200K46r136P432j765m992J2910J2282J0451j4810J063o97
1906A0072j2566o140Q118J1762M504m647r796p168r774J3261p950p040m59N537
$$ plain form
2002 -8796 -6531 -21458 -23801 -12172 -2609 6072 27981 32350 33726 38568 36858 34652 8607 7695
1988 7695 4401 -5063 9562 14915 -6400 -23715 -19203 -21698 -22846 -15287 -13943 -27567 -12520 -869
1974 -869 -17264 -15238 -12683 -30858 -25708 -27490 -38753 -20410 -11302 -5325 -5072 -6531 -10385 -19323
1960 -19323 -30774 -20038 -12001 1740 3356 -1195 -14410 -7266 -3692 2290 28405 19111 16482
1947 16482 13886 -10017 -30376 -18691 -3241 5260 19159 27097 12630 1440 6651 14657 20308
1934 20308 13829 11370 7765 2364 4912 19217 4410 -9872 -7417 -18716 -18157 10833 2778 -17383
1920 -17383 -17306 -7112 -2912 -2666 -11802 -4370 -6135 -11127 1783 14065 24516 9706 10769 10072
1906 10072 -2494 -8634 -516 11246 15750 11103 1307 -5861 -15635 -2374 -10324 -17364 -17823 -12286
1892a2286J1626n307j6938p768n366J9838J2411j2134q351j493K4795N895o066
1879a144o553O092J3536q425j1635j2347J5054M537o151L216j9294j3551J2578
$$ plain form
1892 -12286 -660 -5967 -22905 -30673 -36039 -16201 -3790 -15924 -24275 -25768 -973 4922 -1144
1879 -1144 -7697 -1605 11931 3506 -8129 -20476 -5422 -885 -7036 -3820 -23114 -36665 -24087
$$ [...]
##END NTUPLES=NMR SPECTRUM
##END=
