##TITLE=Analysis number 328510
Compound Code sb 00731
Book Reference 3
Project Code adrs
Chemist Name stores
##JCAMPDX= 6.0         $$ Bruker NMR JCAMP-DX V2.0
##DATA TYPE= NMR SPECTRUM
##DATA CLASS= NTUPLES
##ORIGIN= Bruker BioSpin GmbH
##OWNER= nmr
$$ XWIN-NMR		Version 3.5
$$ Mon Jun 11 14:24:11 2007 GMT Daylight Time (UT+1h)  MAYBRIDGE\nmr@NMR_250MHZ
##.OBSERVE FREQUENCY= 250.131544655141
##.OBSERVE NUCLEUS= ^1H
##.ACQUISITION MODE= SIMULTANEOUS (DQD)
##.ACQUISITION SCHEME= undefined
##.AVERAGES= 16
##.DIGITISER RES= 18
##SPECTROMETER/DATA SYSTEM= dpx250
##.PULSE SEQUENCE= zg30
##.SOLVENT NAME= CDCl3
##.SHIFT REFERENCE= (INTERNAL, CDCl3, 0, 16.3815)
##AUDIT TRAIL= $$ (NUMBER, WHEN, WHO, WHERE, WHAT)
$$ ##TITLE= Audit trail, XWIN-NMR		Version 3.5
$$ ##JCAMPDX= 5.01
$$ ##ORIGIN= Bruker BioSpin GmbH
$$ ##OWNER= nmr
$$ C:\u/data/dgb/nmr/ADRS/710/pdata/1/auditp.txt
$$ ##AUDIT TRAIL=  $$ (NUMBER, WHEN, WHO, WHERE, WHAT)
(   1,<2007-06-11 14:23:41.04 +100>,<MAYBRIDGE\nmr>,<NMR_250MHZ>,
      <created by zg, POWCHK disabled, PULCHK disabled
       configuration hash MD5:
       76 6E 9A 78 1E 09 19 81 EC 84 63 8F B0 6A 59 2D
       data hash MD5: 64K
       A7 28 F8 D2 DC 42 78 D3 06 61 4E 68 FD 3D 30 8F>)
(   2,<2007-06-11 14:23:54.81 +100>,<MAYBRIDGE\nmr>,<NMR_250MHZ>,
      <Start of raw data processing
       ef LB = 0.3 FT_mod = 6 PKNL = 1 SI = 32K 
       data hash MD5: 32K
       A5 35 0F C6 63 F3 8B E4 7D 24 65 EE 09 5A A4 D5>)
(   3,<2007-06-11 14:23:56.73 +100>,<MAYBRIDGE\nmr>,<NMR_250MHZ>,
      <apk 
       data hash MD5: 32K
       A1 6E 64 E0 51 B3 76 6D 63 7B C4 E3 F8 1B A0 3B>)
(   4,<2007-06-11 14:23:57.46 +100>,<MAYBRIDGE\nmr>,<NMR_250MHZ>,
      <abs ABSG = 5 
       data hash MD5: 32K
       15 77 3E F3 3C 1C D8 CD 8A 99 AC 9A 2C 8F 5C EC>)
$$ ##END=
$$ 
$$ hash MD5
$$ C0 E2 A8 53 4D F1 B9 0F E8 0F BF 19 71 0A 2A 1F
##$RELAX= 
##$RELAX= 
##$RELAX= 
##$RELAX= 
##$RELAX= 
##$RELAX= 
##$RELAX= 
$$ Bruker specific parameters
$$ --------------------------
##$DU= <C:\u>
##$EXPNO= 710
##$NAME= <ADRS>
##$PROCNO= 1
##$TYPE= <nmr>
##$USER= <dgb>
##$AMP= (0..31)
100 100 100 100 100 100 100 100 100 100 100 100 100 100 100 100 100 100 
100 100 100 100 100 100 100 100 100 100 100 100 100 100 
##$AQSEQ= 0
##$AQ_mod= 3
##$AUNM= <au_zg>
##$AUTOPOS= <22 >
##$BF1= 250.13
##$BF2= 250.13
##$BF3= 250.13
##$BF4= 250.13
##$BF5= 500.13
##$BF6= 500.13
##$BF7= 500.13
##$BF8= 500.13
##$BYTORDA= 1
##$CFDGTYP= 0
##$CFRGTYP= 5
##$CHEMSTR= <none>
##$CNST= (0..31)
1 1 145 1 1 1 1 1 1 1 1 1 1 1 1 1 1 1 1 1 1 1 1 1 1 1 1 1 1 1 1 1 
##$CPDPRG= <>
##$CPDPRG1= <>
##$CPDPRG2= <>
##$CPDPRG3= <>
##$CPDPRG4= <mlev>
##$CPDPRG5= <mlev>
##$CPDPRG6= <mlev>
##$CPDPRG7= <mlev>
##$CPDPRG8= <mlev>
##$CPDPRGB= <>
##$CPDPRGT= <>
##$D= (0..31)
0 1 0 0 0 0 0 0 0 0.06 0 0 0 0 0 0 0.0002 0 0 0 0 0 0 0 0 0 0 0 0 0 0 
0 
##$DATE= 1181568220
##$DBL= (0..7)
120 120 120 120 120 120 120 120 
##$DBP= (0..7)
150 150 150 150 150 150 150 150 
##$DBP07= 0
##$DBPNAM0= <>
##$DBPNAM1= <>
$$ [...]
##$SUBNAM7= <"">
##$SUBNAM8= <"">
##$SUBNAM9= <"">
##$SW= 20.6930455092707
##$SWIBOX= (0..15)
0 0 3 0 0 0 0 0 0 0 0 0 0 0 0 0 
##$SW_h= 5175.983436853
##$TD= 65536
##$TD0= 1
##$TE= 297.16
##$TE2= 300
##$TE3= 300
##$TEG= 300
##$TL= (0..7)
0 120 120 120 120 120 120 120 
##$TP= (0..7)
150 150 150 150 150 150 150 150 
##$TP07= 0
##$TPNAME0= <>
##$TPNAME1= <>
##$TPNAME2= <>
##$TPNAME3= <>
##$TPNAME4= <>
##$TPNAME5= <>
##$TPNAME6= <>
##$TPNAME7= <>
##$TPOAL= (0..7)
0.5 0.5 0.5 0.5 0.5 0.5 0.5 0.5 
##$TPOFFS= (0..7)
0 0 0 0 0 0 0 0 
##$TUNHIN= 0
##$TUNHOUT= 0
##$TUNXOUT= 0
##$USERA1= <user>
##$USERA2= <user>
##$USERA3= <user>
##$USERA4= <user>
##$USERA5= <user>
##$V9= 5
##$VALIST= <valist>
##$VCLIST= <CCCCCCCCCCCCCCC>
##$VD= 0
##$VDLIST= <DDDDDDDDDDDDDDD>
##$VPLIST= <PPPPPPPPPPPPPPP>
##$VTLIST= <TTTTTTTTTTTTTTT>
##$WBST= 1024
##$WBSW= 4
##$XGAIN= (0..3)
0 0 0 0 
##$XL= 0
##$YL= 0
##$YMAX_a= 460989
##$YMIN_a= -368000
##$ZGOPTNS= <>
##$ZL1= 120
##$ZL2= 120
##$ZL3= 120
##$ZL4= 120
##$ABSF1= 16.38147
##$ABSF2= -4.311701
##$ABSG= 5
##$ABSL= 3
##$ALPHA= 0
##$AQORDER= 0
##$ASSFAC= 0
##$ASSFACI= 0
##$ASSFACX= 0
##$ASSWID= 0
##$AUNMP= <proc_1d>
##$AZFE= 0.1
##$AZFW= 0.1
##$BCFW= 0
##$BC_mod= 0
##$BYTORDP= 0
##$COROFFS= 0
##$CY= 12.5
##$DATMOD= 1
##$DC= 0
##$DFILT= <>
##$DTYPP= 0
##$F1P= 14.0000005364418
##$F2P= -0.99999901652339
##$FCOR= 0.5
##$FTSIZE= 32768
##$FT_mod= 6
##$GAMMA= 0
##$GB= 0
##$INTBC= 1
##$INTSCL= 1
##$ISEN= 128
##$LB= 0.3
##$LEV0= 0
##$LPBIN= 0
##$MAXI= 10000
##$MC2= 0
##$MEAN= 0
##$ME_mod= 0
##$MI= 0
##$NCOEF= 0
##$NC_proc= -5
##$NLEV= 6
##$NOISF1= 0
##$NOISF2= 0
##$NSP= 0
##$NTH_PI= 0
##$NZP= 0
##$OFFSET= 16.38147
##$PC= 1
##$PHC0= 150.9902
##$PHC1= 9.195631
##$PH_mod= 1
##$PKNL= yes
##$PPARMOD= 0
##$PSCAL= 4
##$PSIGN= 0
##$REVERSE= no
##$SF= 250.130035148887
##$SI= 32768
##$SIGF1= 0
##$SIGF2= 0
##$SINO= 400
##$SIOLD= 32768
##$SREGLST= <1H.CDCl3>
##$SSB= 0
##$STSI= 32768
##$STSR= 0
##$SW_p= 5175.98343685301
##$SYMM= 0
##$S_DEV= 0
##$TDeff= 65536
##$TDoff= 0
##$TI= <Analysis number 999999
Compound Code 99
Book Reference 9
Project Code 9>
##$TILT= no
##$TM1= 0
##$TM2= 0
##$TOPLEV= 0
##$USERP1= <user>
##$USERP2= <user>
##$USERP3= <user>
##$USERP4= <user>
##$USERP5= <user>
##$WDW= 1
##$XDIM= 32768
##$YMAX_p= 385990764
##$YMIN_p= -479167
$$ End of Bruker specific parameters
$$ ---------------------------------
##NTUPLES= NMR SPECTRUM
##VAR_NAME=  FREQUENCY,     SPECTRUM/REAL,   SPECTRUM/IMAG
##SYMBOL=    X,             R,               I
##VAR_TYPE=  INDEPENDENT,   DEPENDENT,       DEPENDENT
##VAR_FORM=  AFFN,          ASDF,            ASDF
##VAR_DIM=   32768,         32768,           32768
##UNITS=     HZ,            ARBITRARY UNITS, ARBITRARY UNITS
##FACTOR=    0.157963299565203, 1,           1
##FIRST=     4097.49759849551, 0,            0
##LAST=      -1078.4858383575, 0,            0
##MIN=       -1078.4858383575, -479167,      0
##MAX=       4097.49759849551, 385990764,    0
$$ Real data points
##PAGE= N=1
##DATA TABLE= (X++(R..R)), XYDATA
$$ [...]
16169 45899 26369 723 -6434 -13967 -14780 -2164 -2623 -10444 2375 12368 -20896 -35451 -21863
16156 -21863 -6912 13852 30341 26026 14362 25816 25897 12239 -11685 -6143 11556 7812 3542
16143 3542 9208 13434 11854 23067 34876 49100 33990 12273 7982 14495 9940 2161 656
16130 656 18221 18339 8745 12574 14816 14122 24427 14038 9483 5870 14105 34016 29850 35845
16116 35845 52313 62025 67433 52967 27571 22771 11918 8132 2823 -3537 -4287 11156 26101
16103 26101 19233 -5971 486 8449 -699 -6299 -16534 -1081 5827 11821 14246 8820 -1429
16090 -1429 -10165 -10292 -6639 3816 14822 -2749 -1896 12661 17473 7735 -2023 -9256 2276 10202
16076 10202 16737 16024 14454 10893 14385 6223 7777 21120 23275 20383 16618 15169 14034 11174
16062 11174 7388 11484 4780 -14525 -14119 -20682 -21857 -27709 -29714 -32981 -35763 -31908 -23815 -13660
16048 -13660 -19447 -34769 -49067 -46499 -41809 -38363 -13090 -6996 -7630 1242 -11162 -11650 -16703 -16314
16034 -16314 -20317 -15588 -22062 -11879 -2282 -4046 -6325 -1141 15506 14863 4059 -7871 -23559
16021 -23559 -28137 -4197 135 -3229 -11971 -24441 -24830 -13412 -17783 -15502 -19296 -15775 -13642 -18217
16007 -18217 -23385 -14066 -5831 -16781 -21012 5362 20557 24383 13273 -7157 -10979 -24047 -37132
15994 -37132 -30555 -31885 -8863 12528 -5480 -27587 -31904 -31702 -21146 -7238 -5421 -3596 10133
15981 10133 14955 33 -18094 -13911 -10953 -14147 -15624 -13612 -9335 -8063 -4811 -3698 -4115 2582
15967 2582 10399 -2797 -19567 -19730 -18559 -20755 -27538 -14474 -4874 -11957 -18525 -9302 -9146 -12007
15953 -12007 -12841 -18782 -10766 1399 -2790 -12468 -18091 -12507 -3020 -5921 -27680 -19584 -49 1223
15939 1223 698 -408 -6024 -4274 -7629 1844 2899 -20479 -22560 -3850 6065 5412 11902 9504 58
15924 58 -2074 1872 5780 10315 31993 18252 732 7571 12223 -16072 -25908 -23000 -10435 2965
15910 2965 3912 -1632 -17849 -28809 -18054 -24884 -18150 -25264 -19741 -305 21156 13743 -214
15897 -214 2593 13006 21922 16723 5768 -5693 -3602 -8798 -15721 -18600 -14994 -16933 -18683 8810
15883 8810 21031 10231 -4684 979 2198 761 -16749 -35941 -40731 -44603 -27039 -5377 6673
15870 6673 17849 8531 -16648 -17465 3899 31763 43473 27711 13795 -1085 -27155 -20600 -15592
15857 -15592 -9286 -11639 409 4654 -5559 -5278 -5310 -19597 -15114 -14973 -23335 -29157 -24263 -16213 -3955
15842 -3955 -4095 -3729 -17197 3169 -7050 -31554 -29015 -17632 -5687 -8833 -12952 -7086 -9175 -3748
15828 -3748 -13035 -30067 -15999 6096 1732 -16061 -32139 -31532 -18577 -14622 -17500 -17341 -4365
15815 -4365 10895 4396 2678 -17664 -19875 -22436 -21678 -19558 -16661 -18183 -17703 -14222 4175 18029
15801 18029 8188 -10903 -39003 -28427 -17315 -7230 708 13362 7893 479 -394 -2843 -3572
15788 -3572 -1670 -16052 -24773 -38075 -33795 -16042 -25111 -33401 -31742 -28998 -32721 -24284 -14491 -29421
15774 -29421 -29593 -27374 -16907 -6365 8527 -2709 -11462 -2794 5050 2346 -5609 -1293 -4569 -410
15760 -410 6122 5980 -10812 -21309 -22833 -14168 4488 1634 13750 16742 4727 -3769 -7227 -4635
15746 -4635 -14963 -39285 -33501 -23636 -13614 3201 -3306 -11996 -12766 -7892 -4297 1106 1990 -747
15732 -747 4603 20110 26745 29744 27187 26804 40401 32019 37493 48531 48064 51071 74069 77336
15718 77336 72869 94019 115331 112558 102023 105661 107981 118407 130323 110479 106923 113353 117557
15705 117557 110115 98433 109064 103158 112888 117426 113083 99191 108445 97412 99515 115658 113772
15692 113772 108357 103956 110766 99107 69775 60492 55252 45363 38526 36116 36327 38544 23353 9851
15678 9851 -641 -9907 -17760 -7427 12852 1657 -15196 -16301 11518 23039 27953 36623 43919
15665 43919 45342 46396 44596 40033 37881 23418 6086 -3865 -5122 -4012 -2151 1544 -5340 11146
15651 11146 6348 -4334 -4069 -17674 -10661 -15679 -28179 -26434 1539 8560 5438 10258 7350 -3705
15637 -3705 -2010 906 10749 20816 30320 25190 23692 21950 21123 13539 852 -2071 -20099 -34155
15623 -34155 -23535 -12359 3927 11885 35156 26645 -4984 -14582 -16480 -12048 -16080 -21668 -26204
15610 -26204 -32662 -32625 -24622 -24158 -29892 -15398 -21406 -7010 6722 20563 29938 27279 18798 18465
15596 18465 19942 14040 -1170 -5273 -7450 1514 10049 28261 27246 18814 18647 11203 12076 19775
15582 19775 6408 -14505 -12592 -18563 -22957 -30446 -30626 -27153 -24492 -29357 -27997 -17803 796 7725
15568 7725 16596 15548 16520 3139 2235 -9356 -18101 -20010 -11151 1968 9268 9837 9478 -11409 -18760
15553 -18760 6599 14867 15772 10603 1947 7870 6399 -1297 -11629 -6002 -7681 -2520 15743 34254
15539 34254 28845 25523 52212 57206 58243 53955 51412 37036 8175 -5736 10330 15852 949
15526 949 -7015 6489 33408 38145 41610 53788 40440 30270 24151 14418 21982 29104 36830 45238
15512 45238 44336 24550 23621 39322 37521 43188 52001 49626 45950 33769 7514 -21177 -23754 -19606
15498 -19606 -8532 -5888 1683 40518 47229 50200 59268 55568 57042 49335 49839 51592 49313 43013
15484 43013 45413 37640 14164 -11378 -6734 6899 -724 -4735 11691 32295 40899 56139 42932
15471 42932 25937 23959 21298 7183 2134 6772 3808 557 15956 21519 17106 13438 17088 15002
15457 15002 20156 19470 12769 3413 -361 551 -4407 5663 1394 -7960 -8620 -31403 -31347 -22012 -21299
15442 -21299 -13519 -5885 -6839 -25329 -33186 -24054 -13473 -9153 -17714 -10460 -4593 26494 38825 28282
15428 28282 14935 16190 5828 9400 117 -15826 -10390 107 7422 10265 20180 23929 8779
15415 8779 2508 2138 -3817 -36 8457 4622 -4430 2852 -7257 -19168 -11405 -15657 -3670 5270
15401 5270 35313 47492 38090 23333 11450 6277 9469 13194 12994 1208 482 11637 3177 6822
15387 6822 -1615 -10423 -8429 -29299 -40077 -28879 -10112 3853 -238 -7691 -5307 -2148 -15093
15374 -15093 -16945 -7374 -378 -8032 -17066 -15635 -17775 -30428 -36671 -35490 -18541 -32107 -51491
15361 -51491 -48022 -50906 -59509 -44003 -26134 -17200 -27793 -33077 -33753 -57982 -48216 -41008 -31270 -19152
15347 -19152 -15971 -35743 -39554 -50128 -37539 -31957 -15849 -790 -2150 -15324 -28772 -18586
15335 -18586 -4815 6019 -4842 -11824 -9719 -22269 -37105 -34993 -7867 -2926 -2997 -8517 -3648
15322 -3648 -4208 -16493 -27975 -29165 -16188 -14966 -8673 -10593 -14044 -24480 -38198 -37794 -27035 -17647
15308 -17647 -11149 -9428 -14680 760 8920 -7501 -13685 -18691 -23565 -33460 -35333 -43051 -44326 -38068
15294 -38068 -36470 -24868 -17022 -10050 -1209 -21306 -31282 -9341 -3777 -2958 -12952 -30307 -19817
15281 -19817 -20403 -13283 -10127 -5270 -5587 -6302 -6644 -4714 -9057 -12216 -17537 -35178 -37472 -33601 -30591
15266 -30591 -11510 -5999 -4318 -108 -12758 -12036 3127 337 -7235 -21236 -25933 -18638 -9042 3486
15252 3486 9439 11106 11122 6840 9169 2916 -4697 -16423 -6691 -3855 -9173 -23508 -30654 -39712 -28669
15237 -28669 -25656 -31937 -48970 -50546 -38665 -32267 -19129 -11300 -12206 -20180 -17992 -18848 -26914 -17148
15223 -17148 -19654 -22211 -24280 -14117 -23791 -23061 -20268 -18571 -13636 5475 20200 9361 -6716
15210 -6716 -7071 -2399 7679 9069 -10546 -20061 -29208 -13847 -5140 1024 -3248 -16836 -14855 -8718
15196 -8718 -11610 -14601 -28049 -21609 -6845 5699 14550 22584 21189 -1470 -3922 -17588 -19478
15183 -19478 -2568 1988 5008 8009 12634 7260 774 -1051 -8028 -4550 8253 -4857 -23973
15170 -23973 -22972 -17926 -7244 -8995 -16416 -20491 -16667 -7309 -12417 -18486 -8490 -1916 -6582 -7762
15156 -7762 -12611 -11993 -29075 -25925 -25691 -33365 -44509 -29770 -5621 18319 18640 282 -4919 2921
15142 2921 -3191 -9879 -15058 -8263 535 9158 3317 -17733 -34528 -28650 -34288 -33031 -27878 -20622
15128 -20622 417 944 -6482 7341 12999 1818 -14877 -34370 -34625 -21032 -8924 1147 -2261
15115 -2261 210 -1998 -4718 -2220 -6059 5421 16343 18166 11395 5055 -4464 -7582 -5587 -7556
15101 -7556 -14130 -25441 -46995 -63378 -55425 -23990 -14472 -29745 -16147 -11320 -4384 -1035 5471
15088 5471 12854 -97 -12750 -1903 3990 9569 5395 -2729 -2208 -4098 -14091 -15071 -13994 -15586
15074 -15586 -12163 -16196 -12837 -8067 -8484 -10479 -26415 -26928 -10725 -6303 -15457 -28466 -33041 -13715
15060 -13715 -28495 -29350 -18658 -14504 -13180 -26530 -29902 -38039 -45106 -32933 -28336 -22564 -24289 -18015
15046 -18015 -9924 -2896 -7892 -26058 -46447 -57683 -49886 -42627 -49077 -53069 -46306 -35516 -30116
15033 -30116 -23417 -21615 -8231 -6420 38 -16588 -19843 -11943 -8002 -11746 -11705 -2458 -9832 -9163 -4418
15018 -4418 9790 2107 -14665 -13325 -10703 -18385 -7415 7736 13248 20904 24212 27690 10682
15005 10682 7759 11333 4781 -9345 -5115 -13052 -22087 -11651 -16067 -17029 10013 11821 12944 1672
14991 1672 -7161 -9248 -8839 -7703 16422 14874 8606 -5905 -24098 -35248 -20003 -22274 -20380 -13994
14977 -13994 -15722 -13092 -14966 -19623 -19842 -13342 -22060 -36777 -37470 -36480 -26400 -18135 -20214 -33143
14963 -33143 -35980 -43273 -33336 -13881 -10317 -16827 -19823 -1918 -8643 -10211 -13374 -18366 -24159 -16313
14949 -16313 -14026 -173 -17367 -25117 -40199 -38450 -40205 -42439 -33602 -23117 -25475 -37883 -24470
14936 -24470 -27579 -47747 -38412 -27080 -22046 -18960 -21044 -11432 -9007 -14115 -21481 -10577 -4210 -20335
14922 -20335 -37218 -42588 -43011 -35513 -29458 -32050 -35311 -30727 -36787 -51763 -44383 -24586 -23479 -20221
14908 -20221 -6940 -2232 929 5892 5727 4449 -1307 -2939 3253 2237 11908 21191 12177 2443
14894 2443 -3855 -16087 -9399 -12095 -8435 -18521 -30575 -35329 -25990 -26214 -38124 -31503 -31994 -40636
14880 -40636 -33996 -25427 -11100 -8189 -27707 -52753 -63924 -51532 -30810 -20506 -21104 -15603 -16129
14867 -16129 -19704 -20487 -18376 -21699 -12857 -17751 -22034 -18161 -25218 -28444 -31756 -19126 -7327 -11611
14853 -11611 -21415 -18927 -14041 -20082 -19611 -17434 -22269 -20495 -29609 -26671 -28693 -35126 -33914 -33257 -35920
14838 -35920 -26142 -33747 -33787 -51325 -52013 -55232 -45891 -38063 -32232 -44004 -48908 -34582 -25628 -22546
14824 -22546 -13617 -1340 -17130 -21274 -27676 -14925 -995 -13546 -9032 2995 -11514 -14904 -17845
14811 -17845 -29373 -37243 -32989 -11844 4839 -1424 -6197 -12747 -1158 -8269 -31301 -39106 -30246
14798 -30246 -31183 -19697 -11294 17622 26603 17228 15689 17492 6224 -10895 -14246 -20870 -32468
14785 -32468 -27560 -12007 4098 16540 10462 10437 5054 -4589 -31671 -19686 -4566 -2729 352
14772 352 7510 -4860 -13973 -22186 -22740 -23744 -35247 -38244 -43414 -31646 -24230 -4962 -11468 -22943
14758 -22943 -15831 -13097 -714 8632 16696 6302 -17391 -17686 -9464 -8910 -7358 -16536 -19971 -12690
14744 -12690 -7807 -25471 -34651 -43038 -25704 -12179 -31646 -47754 -46856 -40377 -32850 -34520 -43112
14731 -43112 -35475 -12942 -8661 -23249 -32769 -33964 -46733 -37370 -18444 -8128 5543 -6818 -8604
14718 -8604 -5099 -9975 -9777 -3293 -3070 -5940 -288 5523 -15452 -14514 -7210 -11831 821 -6011 2629
14703 2629 2456 -16649 -18923 -2929 -520 1412 -4202 -3593 -6646 -24094 -31193 -21028 -7253 12483
14689 12483 12071 11512 14759 4220 6158 4057 4167 -16793 -38748 -37279 -53140 -47233 -12107 -2296
14675 -2296 -10539 -21861 -14659 -1541 -14806 -17913 137 5079 6219 20039 7139 -20189 -23041
14662 -23041 -34201 -31119 -25562 -14626 -10124 -8680 6714 19909 24701 16423 888 -15482 -11729
14649 -11729 -18949 -18049 -9006 -4278 -4381 -7622 4441 -497 -14580 -23576 -16270 -13448 -16500 -28463
14635 -28463 -33868 -16221 -17121 -27723 -32367 -28386 -15886 -6442 -12882 -13728 -15427 -17190 -17407 -7698
14621 -7698 5640 17028 18095 19956 15072 10316 12589 39951 54248 60494 48320 52317 76196
14608 76196 80758 72836 66186 50768 47925 34795 31803 60488 69216 66705 49290 45072 34694
14595 34694 24147 25661 21658 15099 9758 3108 -7365 -24295 -26844 -17447 -14585 -17395 -20395 -10188
14581 -10188 -15004 7525 16672 48365 69049 65056 87347 88533 87976 77708 76744 92470 96082
14568 96082 73230 50155 56172 60414 55568 56244 63604 51632 52627 44202 31024 38677 30187 3471
14554 3471 -4274 -17662 -4976 27919 10995 -8675 -25637 -18238 -22749 -22157 -7976 -18187 -16394
14541 -16394 -17185 -6793 -6781 -94 -17923 -38885 -52992 -50846 -32700 -33025 -43026 -36687 -29081 -23184
14527 -23184 -30807 -43106 -36041 -31460 -26209 -17594 -18628 -11330 -9629 -16173 -5279 3087 9044 5891
14513 5891 1986 6353 23818 38964 57712 90850 129303 155259 187523 217989 200757 191179
14501 191179 205719 220457 214595 215180 203697 179853 157108 142649 103449 73925 55155 46739
14489 46739 31800 19738 16611 15267 6613 -3807 -11060 -15197 -8930 -31777 -51643 -55784 -44598
14476 -44598 -41547 -49344 -39115 -23443 -12883 -3269 12100 15851 12057 17381 13447 7789 8653 4441
14462 4441 -7529 -14352 -18054 -22899 -18048 -12489 -25546 -26865 -28078 -43788 -28370 -25699 -34651 -26678
14448 -26678 -8838 -29917 -28350 -16502 -11798 -15418 -13370 -13021 -11325 -14840 -19983 -13098 -13058 -18751
14434 -18751 -21044 -33026 -43553 -34619 -35728 -33819 -41302 -42378 -27876 -23376 -28604 -31016 -42339
14421 -42339 -37428 -27840 -39759 -30546 -26847 -17538 -18347 -29937 -41544 -25931 -33046 -33337 -41863 -47244
14407 -47244 -47926 -43605 -27754 -22912 -20652 -12932 -8407 -10851 -33390 -46787 -37011 -28290 -10920 -27037
14393 -27037 -21403 -26976 -27392 -12386 -20992 -27511 -27023 -16086 -16278 -12965 -13680 -13738 -21871 -19900 -29057
14378 -29057 -46804 -46209 -32719 -14252 -8741 -13528 -36069 -47055 -40432 -32892 -26621 -26617 -36620 -39022
14364 -39022 -39707 -51729 -66171 -60570 -38915 -25099 -21719 -41416 -45743 -28939 -31761 -27529 -39671
14351 -39671 -50445 -66272 -64855 -46006 -36528 -36494 -20533 -20388 -24062 -20554 -5434 -18138 -24995 -21467
14337 -21467 -31345 -28111 -12722 0 -22865 -42434 -40102 -34114 -9124 13462 19827 3711 8818
14324 8818 -1430 -14977 -25761 -32876 -28600 -27185 -21283 -26790 -48404 -48931 -37881 -26041 -34779
14311 -34779 -38218 -39941 -47919 -50682 -46695 -55171 -50708 -38221 -35040 -30634 -24703 -8681 -20144 -23757
14297 -23757 -10226 -5210 2302 -17441 -42900 -42793 -43815 -44676 -34068 -14468 -6617 341 -4208 -23040
14283 -23040 -29196 -10139 11665 1943 -13942 -25420 -21081 -20522 -18623 -22895 -19212 -16256 -15118 -27917
14269 -27917 -41848 -51531 -45497 -27470 -16070 -33090 -32847 -20525 -27121 -38933 -39955 -25510 -30005
14256 -30005 -40778 -34290 -34443 -28694 -35981 -42412 -34150 -13253 -11626 -15588 -19358 -35115 -34532 -30122
14242 -30122 -17819 -7743 -4730 -8155 -8145 -7188 -10819 -13591 -20335 -27867 -4013 14995 -4448 -28466
14228 -28466 -44717 -60064 -63226 -68349 -51736 -42305 -39537 -33146 -35958 -16083 -1344 -12331 -17765
14215 -17765 -23270 -27112 -9327 -10867 -11247 -8712 -16234 -12854 -20940 -35444 -29381 -31665 -31983 -18927
14201 -18927 -20031 -29503 -24427 -15104 -17456 -13607 -18371 -26871 -31675 -36422 -37516 -33179 -34407 -30456
14187 -30456 -10007 -7067 -13018 -7040 -39 -1540 -4515 -989 17447 15408 -12168 -24596 -34987
14174 -34987 -34935 -30305 -33356 -32062 -35774 -31442 -23821 -11392 835 -2948 3339 -12923 -17867 -28688
14160 -28688 -29794 -33054 -34122 -37897 -20092 -20479 -18883 -25214 -29515 -35441 -38279 -27018 -30251 -25273
14146 -25273 -29000 -33435 -34173 -39991 -48464 -34506 -20468 -20993 -27336 -35445 -33087 -26342 -1332 12666
14132 12666 166 8031 2624 -9511 -35876 -48370 -32722 -13644 -19058 -24563 -28500 -34862 -25830
14119 -25830 -21544 -25591 -19452 -17418 -29161 -34919 -31804 -30813 -34603 -32257 -15728 -7313 -11383 -12792
14105 -12792 -5296 -8617 -10997 -5306 -14509 -20708 -20415 -15938 -27360 -21437 -27909 -36409 -30625 -39573
14091 -39573 -34304 -18365 -8836 -7737 -1502 -1002 -3876 -5844 4210 15108 5050 -3043 -15295
14078 -15295 -26271 -34164 -777 25547 33694 18619 3357 -12486 -28805 -24794 -28205 -24777 -20240
14065 -20240 -20006 -9581 -26731 -46807 -41655 -45180 -40483 -26399 -22623 -13547 -16309 -25321 -25065 -24885
14051 -24885 -31266 -24848 -20223 -34629 -47192 -57380 -41160 -24315 -23706 -13223 -3577 -13666 -26556
14038 -26556 -13432 166 3357 10346 11567 -7748 -11989 -19270 -15488 -21959 -22707 -22174 -22856 -35367
14024 -35367 -32530 -45478 -39025 -33278 -30077 -17728 -8662 -31931 -44410 -48113 -41912 -35776 -43406
14011 -43406 -43427 -36770 -37150 -26675 -20858 -15062 -15104 -17225 4135 23185 17551 4956 2452 -8681
13997 -8681 -25864 -26949 -24406 -19397 -13015 -4096 -11246 -5069 1878 -6351 -6049 12731 22574 23465 16630
13982 16630 7327 8657 -8809 -21930 -27653 -33953 -35525 -29541 -32339 -38615 -37457 -33212 -30765 -32358
13968 -32358 -35169 -39032 -28194 -22894 -27641 -31730 -21205 -11956 -23215 -35047 -22843 -2572 3751
13955 3751 -21247 -34330 -38215 -20273 -22267 -18475 -11990 -6874 -453 4898 -2252 -22519 -6260
13942 -6260 -8299 -21962 -18175 -12188 -22789 -28719 -29146 -28898 -20357 -18464 -43942 -47302 -32117 -18931
13928 -18931 -15634 -10186 1526 6445 -12802 -32034 -49419 -50055 -43931 -32551 -16206 -2074 2836
13915 2836 9465 17026 4338 -17006 -24249 -35082 -43759 -36662 -27880 -33808 -28000 -8379 -17889 -11910
13901 -11910 -2585 6727 863 -7367 -1709 -5896 -12205 -13267 -22322 -25798 -23104 -27354 -18765 -11159
13887 -11159 -9768 -5649 4403 10674 -2693 -26037 -29069 -27110 -26067 -41283 -37176 -28776 -30792
13874 -30792 -41058 -30294 -12475 -12094 -6858 -6918 -1525 -4233 -21579 -36223 -46726 -47045 -54203 -45674
13860 -45674 -29913 -49257 -66012 -57346 -43192 -37316 -42192 -31138 -24352 -26480 -12820 -17522 -28410
13847 -28410 -22158 -13811 -15062 -4097 -17259 -32415 -28622 -18311 -32188 -39397 -34355 -36540 -48261
13834 -48261 -58406 -55046 -47257 -46270 -60795 -73269 -63895 -38809 -39513 -48424 -59600 -70741 -64478
13821 -64478 -51523 -28363 -21116 -28380 -24201 -25690 -27378 -20952 -22572 -25985 -20085 -24824 -37122 -37537
13807 -37537 -30232 -18199 -22726 -28076 -11316 -4077 -26671 -38330 -39498 -24257 -19620 -26999 -39948
13794 -39948 -44276 -35747 -27893 -14190 -7632 -1390 -18447 -25608 -26921 -38495 -36332 -23117 -26966
13781 -26966 -20628 -16244 -24439 -29240 -35173 -38885 -33538 -32527 -27078 -16840 -20397 -39260 -34869 -20980
13767 -20980 -33108 -28578 -26797 -13130 -15121 -15184 -16680 -15900 -36367 -51211 -45457 -34182 -32697 -33255
13753 -33255 -32623 -25787 -38010 -34249 -20899 -24476 -41494 -51404 -52997 -37294 -37529 -42478 -52397 -40582
13739 -40582 -23895 -32707 -34561 -27524 -22483 -33416 -50638 -37485 -34458 -23951 -26715 -32117 -38789
13726 -38789 -45530 -31273 -26416 -12150 -12591 -17485 -17695 -29356 -23892 -28390 -43108 -47638 -48198 -47087
13712 -47087 -54190 -52717 -46755 -37861 -27661 -16966 -6378 -23532 -26636 -23979 -28021 -35440 -39723
13699 -39723 -48269 -38503 -24825 -27815 -28891 -21801 -31400 -35882 -40508 -60643 -62906 -60046 -68031 -67759
13685 -67759 -50899 -37852 -38745 -41676 -43036 -59027 -75493 -58464 -64277 -68274 -65297 -82170 -94529
13672 -94529 -85582 -60253 -48173 -53292 -44417 -54977 -57871 -63513 -61367 -49006 -28706 -28229 -41217
13659 -41217 -28678 -27030 -19595 3549 12914 -11628 -36526 -43452 -45326 -42073 -57996 -59888 -70463
13646 -70463 -79262 -73958 -72569 -58609 -55952 -62925 -60169 -55303 -62404 -65717 -54039 -43242 -39289 -45128
13632 -45128 -36948 -23745 -21318 -45148 -47576 -42303 -61090 -58603 -55984 -56377 -47611 -40039 -39862 -43272
13618 -43272 -38001 -34785 -25063 -32207 -29743 -13587 -3536 -28589 -41197 -64081 -66860 -55318 -45441
13605 -45441 -46086 -36192 -21872 -29695 -34636 -11928 3970 419 -11092 -16889 -35322 -49342 -49277 -37547
13591 -37547 -35810 -50408 -56699 -62647 -54497 -48799 -40345 -34341 -32576 -22575 -16294 -7834 -19744 -22066
13577 -22066 -34836 -47945 -40005 -42975 -46058 -39000 -47688 -59318 -45718 -34461 -35551 -40236 -43404
13564 -43404 -41720 -51042 -44047 -31676 -31272 -50492 -38712 -11786 -10239 -34424 -55191 -74415 -75928
13551 -75928 -77414 -70284 -69173 -78555 -67422 -67894 -66602 -48576 -49654 -37302 -27376 -30194 -49284 -53205
13537 -53205 -45949 -34607 -24744 -36781 -44598 -50997 -44205 -48017 -58534 -49812 -36422 -26918 -20225
13524 -20225 -29092 -23458 -26042 -25486 -29198 -25782 -13741 -358 -23533 -46237 -55148 -44284 -34052
13511 -34052 -29960 -34905 -52709 -43648 -28799 -25154 -21210 -29022 -42609 -42180 -35989 -30504 -38187 -33053
13497 -33053 -36959 -43449 -46205 -46927 -30805 -33830 -32552 -28575 -27632 -45223 -54237 -57662 -62853 -57315
13483 -57315 -51312 -42785 -39924 -39316 -29248 -34134 -28466 -18424 -13643 -13871 -9743 -42034 -40996 -46527
13469 -46527 -46250 -44542 -50196 -63181 -82325 -73117 -66969 -63162 -68110 -65457 -45496 -30004 -29489 -36350
13455 -36350 -55429 -67906 -72922 -61559 -52932 -56646 -59972 -66411 -52211 -43580 -32633 -31333 -37789
13442 -37789 -47077 -45460 -47349 -36533 -29648 -33668 -37111 -39430 -35404 -37932 -36406 -33988 -32615 -32767
13428 -32767 -50014 -39869 -29100 -32089 -30478 -35588 -42324 -32999 -43144 -39056 -25267 -24062 -29757
13415 -29757 -31435 -30307 -48162 -66638 -66887 -55284 -62561 -75003 -80209 -55166 -39443 -42192 -46876
13402 -46876 -47869 -46832 -44779 -38881 -44135 -44626 -36251 -32255 -41839 -51828 -43773 -32674 -31106 -32771 -39626
13387 -39626 -54200 -48856 -51851 -52613 -44223 -43314 -33932 -12250 -54 -938 -8910 -24977 -50537 -58425
13373 -58425 -57008 -54215 -55132 -53922 -49622 -44314 -36636 -37477 -61699 -67664 -66053 -51318 -26459 -11181
13359 -11181 -22106 -45160 -58640 -62611 -57062 -45261 -50480 -40359 -44023 -47927 -53473 -45474 -49066
13346 -49066 -46415 -36119 -54571 -72509 -63312 -62731 -49583 -50397 -43609 -26808 -21680 -24020 -31398 -27339
13332 -27339 -26222 -24824 -20244 -20162 -39775 -41615 -29234 -41056 -43414 -40987 -64200 -66043 -60796 -57076
13318 -57076 -54413 -45713 -34521 -22573 -40150 -55163 -51922 -47461 -56699 -64536 -60643 -60334 -65132 -54054
13304 -54054 -66971 -53370 -41290 -36222 -28547 -46553 -53539 -57784 -56648 -50642 -36499 -34018 -42346
13291 -42346 -41266 -52612 -63752 -63309 -50887 -32635 -17932 -19811 -24159 -27372 -37388 -50636 -60032
13278 -60032 -51753 -45889 -30191 -19728 -29655 -38154 -37648 -32006 -30982 -27274 -20773 -29750 -35786 -35411
13264 -35411 -53408 -47706 -37384 -31079 -35298 -38485 -49159 -61563 -55799 -39813 -35291 -47368 -45628
13251 -45628 -13616 -1749 -14896 -35770 -34943 -39344 -38677 -32945 -4468 -22585 -42211 -60651 -49613
13238 -49613 -53256 -67468 -64465 -67699 -57920 -45107 -40443 -38774 -42508 -35123 -36739 -30206 -30451 -44292
13224 -44292 -44246 -51223 -70011 -76448 -65383 -49206 -26817 -15959 -21767 -39951 -51204 -53937 -49481
13211 -49481 -44130 -37168 -41731 -40411 -39792 -48489 -68504 -63058 -51911 -39171 -41689 -56661 -57155 -55680
13197 -55680 -53521 -39929 -43230 -47329 -28727 -17315 -28080 -37415 -39918 -48062 -50704 -54860 -48159
13184 -48159 -55552 -51892 -25997 -29305 -40479 -44389 -50219 -45251 -22861 -9457 -7197 -24902 -24058
13171 -24058 -16639 -19996 -12077 -18924 -21986 -21616 -7635 -11830 -3060 -4086 -26662 -29653 -32038 -37969
13157 -37969 -32888 -27495 -20487 -27200 -28108 -39967 -53280 -44994 -42947 -37033 -44263 -48773 -50966 -45152
13143 -45152 -27792 -24171 -37456 -53763 -43877 -39006 -51808 -60764 -53956 -46437 -36890 -40203 -38689
13130 -38689 -47709 -45014 -32647 -34660 -37066 -39995 -39519 -34557 -17612 -6186 -6987 -18000 -34042 -49360
13116 -49360 -67843 -82375 -79256 -70507 -68709 -52371 -29967 -24429 -36217 -50578 -59925 -58183 -68712
13103 -68712 -60778 -45954 -36510 -25997 -16899 -5361 -10022 -26057 -30940 -37653 -34927 -31914 -40421
13090 -40421 -63683 -73611 -54164 -37679 -27849 -31307 -36410 -43925 -47932 -39837 -30564 -24309 -32498 -38332
13076 -38332 -37262 -39221 -51223 -57774 -45440 -35487 -23175 -19341 -32224 -30788 -35264 -47709 -47271
13063 -47271 -42517 -42470 -45261 -61473 -71628 -74329 -58251 -41457 -34267 -47333 -49684 -34685 -24061
13050 -24061 -19912 -12578 -29519 -35886 -31019 -40141 -33555 -37535 -46488 -61592 -47280 -58215 -69801
13037 -69801 -65390 -50313 -32595 -29918 -45304 -61481 -64032 -62521 -49378 -44389 -47317 -50403 -53916
13024 -53916 -54318 -32984 -33266 -35350 -38628 -42664 -51032 -47375 -51730 -48207 -47437 -54716 -58449 -44913 -45534
13009 -45534 -47902 -47183 -39743 -41930 -31668 -19206 -13672 -16104 -332 -13741 -21879 -32750 -51248
12996 -51248 -60784 -58150 -44093 -33900 -32413 -27077 -28913 -34022 -62554 -80523 -82976 -79498 -78160
12983 -78160 -69136 -48347 -40000 -28242 -6375 -9234 -27244 -37058 -28224 -30959 -30580 -28648 -24714 -22336
12969 -22336 -26702 -28532 -28196 -38047 -41968 -28502 -11993 -7862 -3158 -5501 1836 1937 -5274 -3577
12955 -3577 -6337 -8580 9709 28004 33741 26288 9934 5321 14267 25835 36966 33092 14273
12942 14273 -8073 -12621 -15085 -27581 -37432 -45025 -53382 -49325 -38577 -60632 -65951 -59100 -45423
12929 -45423 -24939 -8999 -4871 -737 3609 13293 19885 24631 27495 21539 8918 24566 32231
12916 32231 25288 13237 -7544 -17912 -29672 -43687 -54845 -55356 -58346 -69426 -42874 -27558
12904 -27558 -17808 -15441 -25403 -40187 -54676 -62694 -62602 -56421 -39779 -50547 -68572 -80285 -75270
12891 -75270 -52320 -55960 -51671 -60636 -55191 -36318 -41808 -41178 -39159 -46084 -49356 -62313 -63920 -60110
12877 -60110 -67783 -83172 -83054 -61821 -51228 -51563 -41898 -46978 -36420 -48476 -71532 -70104 -60695
12864 -60695 -46754 -33040 -30514 -30102 -58631 -65430 -69628 -71192 -71252 -74413 -62700 -63197 -63980 -55486 -61858
12849 -61858 -67249 -71906 -65948 -41265 -28146 -33387 -14697 -5890 -14419 -18539 -26795 -29010 -29225 -35525
12835 -35525 -36852 -42331 -54729 -71586 -77487 -65704 -53484 -43768 -48122 -57016 -61507 -68898 -59184
12822 -59184 -55149 -49753 -43880 -44998 -57949 -60351 -56199 -51617 -60132 -78460 -87732 -82746 -67292 -64989
12808 -64989 -82575 -93440 -87621 -93239 -78403 -62252 -72001 -83230 -85462 -76952 -65531 -54259 -39122
12795 -39122 -32562 -45195 -47107 -57962 -57886 -56132 -48434 -51958 -58276 -60086 -68870 -63284 -54310 -41093
12781 -41093 -34862 -38632 -40441 -49479 -69376 -59102 -44378 -57980 -57928 -56332 -48946 -25746 -8474
12768 -8474 -21835 -45482 -56048 -57482 -66402 -57907 -65787 -63276 -54187 -53480 -49205 -68459 -68093 -67669
12754 -67669 -63077 -56581 -50648 -64784 -66695 -57368 -52303 -46280 -32099 -30935 -45506 -37953 -46020 -54033
12740 -54033 -46009 -58790 -81316 -86551 -90245 -83342 -67675 -71050 -67783 -62944 -68594 -56394 -57741
12727 -57741 -64031 -72045 -72920 -81549 -92264 -84493 -75378 -71402 -71778 -73492 -67218 -66547 -64228 -65182 -68875
12712 -68875 -63852 -72715 -81279 -72612 -48811 -45844 -53385 -59117 -73716 -69745 -56921 -58831 -66735 -70559
12698 -70559 -67090 -55341 -51624 -48784 -49395 -40129 -24571 -20675 -45233 -41942 -55144 -52738 -36804
12685 -36804 -35509 -46246 -57861 -66378 -57257 -51159 -56411 -66985 -58156 -56406 -53734 -44510 -50226 -46020
12671 -46020 -55914 -60487 -38422 -19625 -25220 -58495 -59261 -41944 -59556 -76216 -79315 -64840 -68705
12658 -68705 -69216 -59426 -56470 -66509 -67080 -52518 -41555 -36457 -34068 -41844 -50608 -48770 -60473 -51019
12644 -51019 -43212 -46233 -46980 -62162 -81563 -72242 -54082 -46022 -48497 -59968 -67322 -68194 -70822 -72336
12630 -72336 -64536 -64633 -69344 -61241 -59321 -64820 -70479 -82056 -59526 -49970 -47948 -44078 -51443 -59178
12616 -59178 -47872 -51923 -68464 -55365 -52765 -51714 -46599 -57801 -58660 -71689 -91990 -87279 -65690
12603 -65690 -52764 -51810 -63151 -65371 -69547 -70912 -68883 -53752 -56817 -71351 -83655 -69523 -55833
12590 -55833 -52950 -61409 -80425 -75108 -60644 -56517 -61036 -55515 -43928 -36801 -51264 -62389 -52289
12577 -52289 -53792 -45616 -45615 -49853 -50495 -51483 -67023 -62394 -43102 -55990 -49350 -25073 -28418 -40204
12563 -40204 -60618 -74735 -62406 -52141 -56425 -78094 -92234 -96819 -102632 -96568 -87309 -88508 -102427
12550 -102427 -107063 -89641 -76887 -57090 -50057 -56867 -59756 -61716 -74429 -72709 -57641 -50667 -48716
12537 -48716 -51555 -54642 -59168 -62946 -59828 -48768 -32449 -15426 -15367 -34768 -36560 -26467 -29084 -22403
12523 -22403 -19460 -2400 -2783 -15792 -18463 -26265 -36180 -40792 -59733 -62860 -82562 -99718 -95976
12510 -95976 -82182 -52740 -47259 -54611 -73033 -71068 -45496 -31459 -20452 -17202 -16487 -29182 -29167
12497 -29167 -26944 -34187 -30824 -34692 -15152 -10965 -17407 -24602 -23327 -13113 -14087 -19355 -10322 12736
12483 12736 19476 -182 -13414 -17471 -20082 -12199 8008 16908 13830 11200 8707 -13645 -33686
12470 -33686 -29431 -19224 -12500 1928 14071 13821 27889 31160 41222 76713 102325 124625 132792
12457 132792 159900 188802 213955 217728 220590 231629 257308 287519 315658 349243 412012 484894
12445 484894 575960 685047 821230 988372 1137578 1255139 1347395 1404580 1401781 1351727 1263264
12434 1263264 1166140 1057830 957309 854794 787653 738906 687803 651307 633108 607654 579769
12423 579769 557909 541884 543328 561235 584254 618100 655470 705955 756902 804364 872143 958649
12411 958649 1045953 1135716 1249350 1377366 1510692 1642627 1766976 1850697 1892843 1893519 1872109
12400 1872109 1827761 1791846 1801474 1822403 1859686 1883412 1891933 1866080 1793752 1668426 1514101
12389 1514101 1342162 1203041 1092758 1007655 941730 900022 858595 816661 792523 760160 757134
12378 757134 755895 747914 740618 728653 718625 723444 738714 761015 795494 857213 928848 1006455
12366 1006455 1084434 1170080 1287582 1404523 1508389 1587910 1617948 1613914 1552276 1435392 1276338
12355 1276338 1111203 957634 810458 697440 600575 509327 434712 392314 354859 331514
12345 331514 324562 315345 300090 294226 308587 306677 297362 305283 301087 293362 271562 247686 221079
12332 221079 199112 182715 164686 149175 145153 152178 140179 120033 121230 115061 114781 121566 132051
12319 132051 135629 108685 72142 67014 62160 58556 63525 64520 69995 54755 41972 35741 17903
12306 17903 8124 8001 10106 -11328 -19403 -2100 20337 16089 24892 41804 62123 77109 78966
12293 78966 69388 77845 96748 104549 109122 97108 86102 89917 94422 85665 74826 75219 64920
12280 64920 54520 45068 46542 45615 47506 47136 50074 42781 38668 23624 12705 10226 13826 22423
12266 22423 31321 22925 23391 22736 34400 24425 19630 24473 35815 59312 80104 88691 104240 112490
12252 112490 126430 161775 173328 193402 210842 245963 276191 290462 292027 276635 266277 249965
12240 249965 224959 205830 190590 167761 139110 119960 109164 92662 88395 91677 104208 94895
12228 94895 80035 91109 89100 100873 89668 83713 90444 91477 104291 125571 168538 200257
12216 200257 222701 219257 224447 260854 281373 280607 296160 309548 321571 331918 332301 342317 355550
12203 355550 350283 337930 346486 336104 318453 287699 262424 236801 215710 201424 196934 172592
12191 172592 153154 155668 155172 146523 149378 148196 151008 163183 190624 198593 201446 202142 195781 192685
12177 192685 211225 223378 220389 221939 236957 273178 298937 329863 367094 385534 399399 415037
12165 415037 404397 391340 389036 381611 380243 367237 363029 365971 369894 391482 402036 404383 383258
12152 383258 358087 341403 317735 280341 242229 189485 144024 107807 80950 47867 37044
12141 37044 23098 778 15508 63939 98145 115098 134715 156697 166115 166707 183431 199997
12129 199997 208565 228768 252819 255075 278189 322321 350897 359727 359372 360659 361847 368374 371380
12116 371380 336031 295494 266403 228598 184878 156030 138948 149419 161299 163731 143239 102605
12104 102605 56470 12897 -15227 -40829 -57150 -71208 -72072 -63734 -59606 -49141 -26653 -4012
12092 -4012 15236 21631 27889 47924 79206 109295 154130 185414 218076 243487 274177 286252
12080 286252 301453 310520 333645 365264 390848 398906 415952 407731 380113 333601 289420 234722
12068 234722 174282 138072 113923 91810 86196 92113 127382 178916 226701 259566 274858 308649
12056 308649 356992 412422 485765 556475 621252 670981 697336 734040 778091 822465 861230
12045 861230 913431 961433 997870 1043671 1099934 1144649 1213924 1292917 1395422 1506780 1612700
12034 1612700 1738277 1842887 1959260 2097016 2281739 2472514 2673793 2912453 3159270
12025 3159270 3422123 3705739 4007684 4334068 4699978 5125835 5588304 6115484 6735605
12016 6735605 7450539 8292084 9305546 10486768 11911836 13633295 15719512 18247378
12008 18247378 21315584 25068092 29687911 35403877 42559307 51664063 63422468 78594296
12000 78594296 97860369 121367626 148364992 176988307 204320478 227040536 242248514
11993 242248514 248163721 244594164 232918010 215684329 195771475 175686515 157129486
11986 157129486 140949213 127373137 116205470 107150652 99854414 94002933 89395367
11979 89395367 85918469 83436662 81937616 81418838 81902439 83434162 86074622 89925946
11971 89925946 95189801 102049042 110896186 122249856 136699019 154842386 176970405
11964 176970405 202686650 230570451 258240255 282674677 301019512 311525211 314241036
11957 314241036 311098862 305475185 301102281 300757472 305206180 312955358 320832029 325185829
11949 325185829 323140696 313302226 296118198 273537234 248209204 222711335 198955538
11942 198955538 178004989 160148980 145236905 132880997 122678716 114269545 107393026
11935 107393026 101837376 97464587 94204741 91987830 90823183 90738053 91773470 93987244
11927 93987244 97450863 102373842 109102047 118052153 129772719 144873205 163700929 185963883
11919 185963883 210495998 234981222 256287688 271102287 276818572 272214983 257857915
11912 257857915 235895683 209458753 181820363 155627315 132483602 112940496 96870129
11905 96870129 83776168 73065880 64218984 56828842 50584163 45252166 40670129 36735675
11897 36735675 33324828 30372041 27794024 25550985 23574568 21843774 20323609 18966688
11889 18966688 17735932 16640114 15667636 14798920 14027559 13324255 12689783 12095763 11547640
11880 11547640 11045367 10583229 10142392 9717629 9322339 8949336 8611902 8291320 8002049
11871 8002049 7721942 7458035 7220501 6989382 6769285 6564267 6353413 6151907 5938771
11862 5938771 5739507 5555452 5380692 5209981 5070431 4935830 4804732 4700653 4608958 4514597
11852 4514597 4429590 4343505 4270013 4198721 4122304 4040247 3956512 3883777 3815207 3741323 3633993
11841 3633993 3515293 3413757 3303196 3193367 3100573 3011951 2941348 2901805 2847264 2763229
11831 2763229 2707003 2658440 2628372 2600696 2542288 2495162 2471222 2469863 2466159 2445738 2422762 2399170
11819 2399170 2352963 2313343 2278581 2249797 2209658 2186482 2148724 2115519 2097275 2077604 2027066
11808 2027066 1964043 1904691 1843499 1774705 1721877 1685513 1642394 1602390 1581813 1555937 1514789
11797 1514789 1457081 1407277 1362712 1324684 1282159 1246482 1211518 1203266 1173392 1150960 1119292
11786 1119292 1104008 1068185 1042997 1026830 1014818 982470 967092 953734 952763 935020 924716 919486
11774 919486 917951 906627 916041 935950 941724 946047 959679 950571 922000 895252 882566 864107
11762 864107 811549 725295 648821 580280 532349 494684 453548 427954 406439 390609 390842 381895
11750 381895 389712 402110 414710 408501 414744 413219 410662 403045 384722 404115 422095 440946 460618
11737 460618 474588 471303 462053 452946 439981 423207 423694 420828 404215 389791 389388 386628 387355 394765
11723 394765 380744 371375 381225 397688 392003 381249 378001 375110 360484 362446 347313 309283 293530
11710 293530 292110 299918 313980 313207 298392 298602 309409 308035 301870 306362 317269 315311 331435
11697 331435 353684 358581 368374 362283 359497 367174 366570 352292 342500 330666 310189 307045 310253
11684 310253 305515 302784 311329 304350 290681 276696 270567 283238 270728 267438 261212 275165 281914
11671 281914 264877 251934 226105 206325 192197 185852 204045 224998 220718 209788 213802 227153
11659 227153 227434 227658 234829 224449 231983 240961 233181 232631 248770 249016 244121 238902 236435 220615
11645 220615 218156 211948 197936 206316 222484 221656 217607 231006 217400 202817 189563 173442 168768
11632 168768 171415 188232 205385 199485 190041 198483 211862 224246 225614 221280 214054 192705 178364
11619 178364 172445 177357 180415 177839 180873 178642 178203 175682 167971 158100 159818 149193 169425 177382
11605 177382 176603 181308 187140 187381 186418 176945 159435 158805 156957 168537 174089 180892 159304 133438
11591 133438 125765 135369 134608 132398 121683 127418 140393 140920 143374 131060 131737 136985 108697 111295
11577 111295 125844 124891 127117 145727 158467 152078 146917 149530 155014 177164 178584 179563 187048 181217
11563 181217 167632 152010 146037 146806 168125 182113 193026 222473 249379 279711 307868 331357
11551 331357 364380 415069 475969 561220 679300 837635 989451 1145508 1286178 1377649
11541 1377649 1407413 1403099 1354883 1262524 1151430 1046509 952021 859845 769036 707820 667651
11530 667651 619461 579013 557126 535040 523703 516094 505957 485201 482946 516445 543826 583061
11518 583061 623631 665362 717347 777927 870780 1003001 1154072 1305532 1453610 1603648
11508 1603648 1724769 1800235 1820949 1805938 1778171 1746115 1738886 1759242 1797206 1824491 1844752
11497 1844752 1832498 1807508 1716333 1590169 1446232 1299194 1160456 1037268 936079 832755
11487 832755 775765 713477 655068 625349 594835 567036 546761 538898 531188 530660 527561 547156
11475 547156 582456 617489 650509 701903 786244 877235 994144 1118659 1262813 1400123 1514753
11464 1514753 1598062 1641271 1614723 1544864 1430949 1256114 1101986 962553 816314 711186
11454 711186 634104 559431 493613 439558 388694 339425 301903 266521 238815 208293 199231 189972
11442 189972 181071 170894 157493 148609 165697 174605 178751 180887 193355 171357 157160 150062 123477
11429 123477 97623 94701 89663 100195 110866 106088 111050 103278 96269 99851 87545 69652 71247
11416 71247 89844 109179 108310 95245 91231 97929 113281 112178 103370 99238 102395 97224 71092
11403 71092 50519 41944 50310 39298 26813 26938 20315 21600 24693 18110 23544 30061 29991 18100
11389 18100 18518 28905 43415 58962 60624 42296 43828 60965 63958 46550 30749 25677 25501
11376 25501 44720 44497 45605 45917 38815 19470 15008 27560 37231 18313 5512 18099 28395
11363 28395 27232 13697 10321 2877 16931 47385 55254 50030 45201 42359 36687 43142 38126 39088
11349 39088 32847 24302 8122 12478 27058 40917 33582 23091 29148 21745 24959 26394 25575 23048
11335 23048 11336 1533 14763 9460 16371 17336 22582 31827 32002 38690 33276 39536 44911 37607
11321 37607 33337 18396 29879 41349 38924 50669 52317 54659 52982 57007 47805 43040 47080
11308 47080 49319 45495 35589 33346 28021 39104 38587 34841 49132 49025 44048 40403 44152 50524
11294 50524 47044 48870 65259 66885 57011 50158 51214 58122 45580 53906 79035 70053 56665
11281 56665 64714 78833 77248 98958 82849 76919 76752 74727 82302 76001 61087 47216 42410
11268 42410 46901 51478 40382 42964 36052 36992 40552 39666 46447 45550 33489 25214 29883 45484
11254 45484 51022 48339 38087 10986 16422 15813 14705 25130 16979 16614 16396 25751 48492 58312
11240 58312 64024 71371 62715 47713 45807 57536 65528 56027 39145 39733 39706 31542 35445 50715
11226 50715 72205 72727 69319 72559 63965 41927 38372 45248 60349 72370 76377 79197 92322
11213 92322 95408 90404 79135 68499 76696 81353 84163 73294 73681 87945 91053 109380 119074
11200 119074 133088 138261 121387 116121 104767 92038 91327 104205 100015 77263 64579 72100 58433
11187 58433 40765 53005 51664 50822 55551 47728 37231 43197 37495 37079 25096 6052 6803 27409
11173 27409 45591 41103 28908 26472 36453 15071 17414 22921 8081 -4160 7067 29231 29776
11160 29776 19690 22342 32754 31041 31735 24211 12363 22202 33021 25125 22046 20668 31345
11147 31345 38963 43426 43408 15178 12939 43103 54718 56967 62615 72546 80938 95707 113933 104977
11133 104977 91335 93164 103578 105054 91407 76009 65427 56576 48869 35659 46785 40698
11121 40698 41579 38193 49802 50822 54838 50215 59000 49386 27611 41027 53229 52598 46797 41907
11107 41907 40942 35407 33866 23278 13811 15466 2940 -13130 -13052 -8099 -14301 -12840 -18196 -17334 -13722
11092 -13722 -18636 -44115 -51379 -44665 -48885 -33947 -22679 -24788 -22162 -32000 -28839 -30337 -29474 -33720
11078 -33720 -23208 -10605 -1922 1584 14183 19037 19307 5385 -1947 -10787 -14677 -18845 -12712 -17039
11064 -17039 -31553 -30080 -21049 -16192 -15229 -16033 -7540 434 6220 3254 12103 15031 13858 19023 38819
11049 38819 36631 33937 32644 19346 19794 36296 51084 44446 44721 38810 39284 26155 19020 21454
11035 21454 23790 9613 10075 18488 22036 21989 12638 -5674 -5856 -15135 -22042 -28908 -35410 -41586 -39680
11020 -39680 -39035 -36719 -48179 -43433 -30529 -35812 -51899 -43999 -25870 -21376 -14289 -16758 -18844 -31624
11006 -31624 -45338 -54631 -50686 -27019 -18373 -41948 -66232 -54831 -33192 -30553 -29425 -28373 -28111
10993 -28111 -33549 -35279 -23040 -13390 -5694 -14244 -14631 -16061 -16017 -6001 7031 12146 -2604 -13099
10979 -13099 -5070 -17428 -24964 -27066 -30120 -18331 -27637 -22890 -18014 -1803 4779 14439 6301 -4608
10965 -4608 -10506 -10369 -12293 -2561 -952 -1634 461 -9862 -29395 -48636 -63205 -77201 -68968 -63318
10951 -63318 -59493 -56764 -60707 -63621 -46891 -17242 -27994 -21847 -18868 -18957 -17500 -17002 -1750 3566
10937 3566 -13255 -19100 -25445 -26110 -9660 -5268 -9752 -19182 -17651 -10178 -19915 -23072 -26503 -33545
10923 -33545 -39049 -45934 -49678 -45385 -41451 -25862 -22188 -32441 -34517 -13503 5365 14562 12630
10910 12630 5985 -8613 -5506 4964 1654 -11808 -17431 -38011 -32079 -26858 -14303 2616 8763
10897 8763 17315 4993 -16033 -16141 -9034 -10961 -24922 -18688 -32562 -54987 -41879 -29920 -27926
10884 -27926 -18520 -8105 -14949 -22852 -19601 -13887 -6086 -15357 -30618 -43336 -44174 -33043 -23249 -41534
10870 -41534 -57616 -70121 -75658 -66388 -60048 -49374 -40656 -34241 -40220 -31450 -29968 -23488 -19887 -25708
10856 -25708 -34107 -39973 -39109 -48795 -37564 -39244 -46503 -52982 -47839 -45248 -42246 -43372 -53965 -64451
10842 -64451 -55426 -49282 -39087 -36197 -33055 -60020 -71558 -52356 -44141 -58354 -45510 -39682 -41073
10829 -41073 -34471 -24071 -24503 -30501 -35282 -43536 -51099 -45749 -48055 -49049 -64651 -76117 -73572 -68812
10815 -68812 -65391 -67219 -77650 -75723 -75727 -56856 -40753 -34283 -49470 -56195 -48114 -37724 -35388 -36836
10801 -36836 -32683 -36815 -46731 -72974 -87230 -71214 -54797 -51592 -43208 -56077 -69851 -82874 -83191
10788 -83191 -69592 -82729 -91996 -90876 -101388 -107414 -99040 -103751 -95322 -88173 -77489 -81287 -64406
10775 -64406 -57608 -56364 -51545 -37546 -36901 -41551 -35946 -34531 -27497 -28248 -26638 -23371 -32855 -47609
10761 -47609 -50729 -58600 -54427 -56022 -50048 -42136 -61131 -80738 -76226 -69959 -55034 -51398 -52089 -46551
10747 -46551 -50254 -69321 -68943 -55523 -56643 -46515 -29368 -37422 -35081 -31328 -42638 -30545 -22124
10734 -22124 -26468 -38117 -42164 -39484 -30084 -28922 -23355 -26908 -23332 -16032 -179 36454 60195
10721 60195 71011 70982 57436 54164 51481 51883 57723 55365 63067 76944 65971 76505 78871 39450
10707 39450 16531 19148 18187 17766 8351 -2464 -6547 -8761 -2326 -118 13734 22459 32478 46925
10693 46925 42217 37710 54742 71291 100599 122179 136891 135767 129955 154848 188755 177889
10681 177889 156460 149102 144548 130726 111908 92311 68662 67561 65201 52686 47972 34531
10669 34531 22746 26273 27282 17750 947 -10448 2681 12145 14588 24910 41565 48304 46740
10656 46740 48152 49965 44723 50787 48102 58783 54405 55146 70297 77774 74903 79719 80378 87323
10642 87323 99972 106816 103110 103910 120811 123431 103040 105683 101338 103970 105957 113563 110326 119662
10628 119662 140456 143998 132232 132975 128939 116039 115562 102914 83984 63270 49401 44418 33275
10615 33275 16683 13734 17893 16998 31147 42121 50874 58110 55132 50618 62349 62871 60214 86771
10601 86771 109607 129134 145399 148295 164123 213007 241599 260911 269580 282930 290789 287609
10589 287609 264312 236033 197093 156205 124998 100596 77459 57016 48766 67124 83800 107793
10577 107793 111311 98981 101323 114990 136467 165702 204401 243527 272369 299214 331138 365881
10565 365881 390941 417608 455491 490429 523544 547288 575702 602046 647613 695073 752851
10554 752851 805743 862607 924801 998671 1069427 1131118 1214536 1291152 1401173 1515195 1620172
10543 1620172 1747112 1874044 2010917 2166146 2362373 2584599 2835157 3129686 3463609
10534 3463609 3855244 4290072 4789423 5357208 5991293 6716253 7520506 8439091 9484539
10525 9484539 10622618 11838602 13122604 14451823 15753759 16971954 18043713 18891269
10517 18891269 19488711 19795168 19818375 19593699 19159712 18567347 17849269 17086512 16301804
10508 16301804 15530082 14782277 14074429 13408513 12825967 12307985 11847676 11465321 11146615
10499 11146615 10879935 10668806 10516094 10411326 10341734 10321974 10349791 10433166 10591497 10835241
10489 10835241 11133648 11528783 12023667 12628128 13363457 14266313 15379490 16705096 18282228
10480 18282228 20236771 22645019 25585617 29206158 33691345 39193358 45944590 54111231
10472 54111231 63719936 74520510 85826937 96632085 105721887 111971350 114712971 113846359
10464 113846359 109851553 103644090 96337478 88891092 81910282 75674190 70267954 65652398
10456 65652398 61736289 58455215 55773570 53645681 52044119 50985570 50465721 50482488
10448 50482488 51061773 52240383 54120589 56809726 60445813 65247690 71518908 79661642
10440 79661642 90174287 103681460 120869942 142252756 167631183 195420401 222316290
10433 222316290 244056346 257039654 259261309 250587084 232880349 209718310 185200232
10426 185200232 162369735 142677460 126333823 112915648 101808470 92479762 84579917
10419 84579917 77891740 72228425 67482503 63607864 60505726 58082596 56309924 55144357
10411 55144357 54551741 54538328 55114095 56322318 58255012 60958544 64548054 69110457 74725141
10402 74725141 81339249 88689223 96208066 103028571 108137265 110607459 109899011 105957015
10394 105957015 99264778 90742950 81454541 72322930 63949543 56588060 50246240 44816581
10386 44816581 40147090 36105755 32582414 29503265 26819673 24484009 22419299 20604535
10378 20604535 19026335 17632106 16414890 15314006 14335506 13443495 12636888 11944508 11302260
10369 11302260 10681928 10109422 9582793 9119356 8675839 8254654 7870282 7503239 7184781
10360 7184781 6889054 6613708 6346883 6097018 5856574 5627289 5398316 5182401 4984192
10351 4984192 4788221 4595108 4428651 4286312 4146582 4016480 3875505 3755875 3636751
10342 3636751 3515988 3412006 3318606 3243826 3161250 3080002 3008964 2933898 2864687 2789115 2716382
10331 2716382 2631938 2577798 2522054 2463963 2408131 2355765 2307703 2257400 2216401 2183771 2138323
10320 2138323 2095042 2050506 2008944 1971309 1943749 1906655 1866159 1809201 1759765 1718890 1673148
10309 1673148 1629258 1607158 1592610 1572113 1548271 1520480 1498898 1462962 1426269 1403938 1372969
10298 1372969 1350683 1328312 1301957 1291588 1271782 1233284 1208181 1189320 1170852 1166024 1165446 1163615
10286 1163615 1172062 1152177 1149682 1146761 1129362 1100472 1084970 1043834 991522 917696 852331 796415
10274 796415 742067 711111 680882 661645 647792 620941 592299 579882 576638 574907 579877 584561
10262 584561 583027 581268 580442 563608 552605 566272 559134 551473 554672 561301 553525 550541 548321 548473
10248 548473 531828 514352 485460 452275 430908 406124 389198 362882 341815 327070 324913 326127
10236 326127 316899 313711 313374 300281 305111 309109 289923 282469 285005 265215 258686 261322 259863 265062
10222 265062 263796 255838 256391 256966 237706 221531 219529 222733 226039 236167 251551 252025 246684 247023
10208 247023 265155 271299 284407 284120 281687 276370 276458 270284 267183 258094 251075 259616 263757 262481
10194 262481 256626 254551 248867 229587 219538 208624 209320 220971 234762 225568 204089 197482 192278
10181 192278 203099 209036 214006 218640 219128 205249 192575 200135 205580 198411 203779 207994 202663 220520
10167 220520 236753 226120 213882 207466 211234 208106 213840 220011 222739 207153 196087 184674 187269
10154 187269 175932 162724 166598 171242 181173 193904 205878 218047 239776 259108 265273 278840
10142 278840 298798 328524 368538 405234 423921 422948 422455 397546 382379 357917 322810 296429
10130 296429 291792 283433 278399 269767 272209 278957 272996 269101 250205 253107 251388 267604 275752 291065
10116 291065 291420 310609 356042 372223 393004 412039 441302 444511 452406 436995 402508 363000
10104 363000 356733 347684 330631 310451 299196 290197 291307 274295 229064 214268 209299 204006 205149
10091 205149 203852 187969 175296 163267 156820 148547 127783 127611 124719 128613 142321 132293 136119
10078 136119 155399 144192 126064 129591 131565 141768 133875 123993 118496 122242 126833 114530 109830
10065 109830 107792 121874 144598 145609 129101 120264 121096 111436 98636 103855 113486 107392 104608
10052 104608 101626 99575 91900 78401 70440 77796 78128 73591 82440 87742 84832 85200 73321 78271
10038 78271 89252 84346 68748 66954 54483 54569 39159 27667 21366 23707 28215 47515 62328
10025 62328 55179 33057 26513 16615 8999 -398 -8680 337 13922 16989 35103 49054 58166
10012 58166 57786 43212 24248 31066 43774 51578 50600 43060 50383 55846 42368 32149 31596 28615
9998 28615 26622 17236 20429 28312 17552 18497 22456 28793 36744 41408 57491 66180 71867 76034
9984 76034 55054 55540 61933 62599 48268 48743 52849 64607 66362 79394 95514 94541 112445 106716
9970 106716 98762 69030 43208 23084 15238 11753 -11757 -1497 13505 13222 -2041 -3748 14921
9957 14921 25673 30504 30383 45352 56670 59618 56683 54822 54487 60649 61260 58383 53843 49535 49903
9942 49903 43858 37736 34146 44891 49655 61828 56197 50627 57258 55142 47777 51149 50974 46449
9928 46449 50672 40569 33209 33534 20889 14959 11788 1335 -94 680 1776 11437 18240 7542
9914 7542 -20843 -37558 -24928 -12865 -13278 -16737 -11434 -2136 28113 35013 30636 33840 53551 60720
9900 60720 73895 69874 60023 61368 54132 43682 52061 55952 39335 17411 13730 12017 13039 -3385
9886 -3385 6885 24932 32617 40302 27854 23666 17428 6546 15277 17297 11601 20467 35606 44121
9872 44121 37197 41628 46713 46496 55819 62828 55543 54422 47134 34271 24912 17646 13148 15468 22095
9857 22095 24625 22073 13358 9407 12139 -1559 -3327 -1768 -4591 -3459 9217 14106 16691 3765
9843 3765 -3814 11804 8886 -6346 -6453 11769 5645 5318 12158 13864 6593 1148 -8754 -20997
9829 -20997 -28034 -18492 -15636 -9189 315 -6273 -11248 -4717 8390 3197 2397 10065 12160 10398 1355
9814 1355 -21167 -31045 -26906 -8937 3695 6334 6931 21384 35436 43622 34633 20475 14166 23767
9800 23767 33957 39823 33419 17197 5580 1201 2815 8591 -278 -18735 -23240 -5603 75
9787 75 -8070 -14400 -20632 -38974 -44674 -35449 -33930 -20399 -26170 -31915 -20098 -2271 7447 -2063
9773 -2063 -20998 -41740 -35315 -15106 -12747 -22210 -41587 -40723 -32286 -44027 -49397 -56897 -56429 -43625
9759 -43625 -43274 -29537 -32512 -28565 -21391 -25543 -39693 -38458 -42992 -44658 -45102 -32506 -19671 -23112
9745 -23112 -9836 -11636 -3545 -11723 -29995 -20144 -20213 -30134 -24572 -27471 -21563 -12375 -6248 -3193 -1298
9730 -1298 -2560 -9663 -13150 -21491 -22297 -20698 -18446 -27763 -50720 -58533 -40617 -44022 -60799 -60036 -53658
9715 -53658 -53772 -42112 -29036 -15568 -12506 -35563 -45727 -43509 -39293 -55928 -73473 -78151 -77926
9702 -77926 -74981 -78460 -78245 -71245 -46888 -36644 -38891 -42581 -34611 -46488 -35233 -24504 -22745 -32617
9688 -32617 -33370 -28148 -24504 -18405 -24305 -38867 -46622 -44886 -27409 -12257 -14087 -24041 -38538 -33611
9674 -33611 -24998 -38723 -40069 -27226 -33265 -50956 -57159 -64030 -50955 -28524 -31067 -39027 -36359
9661 -36359 -42391 -49625 -64855 -79156 -75115 -60937 -59751 -66068 -72334 -74883 -74552 -76102 -66944 -59953
9647 -59953 -45976 -36362 -14937 -8272 -23210 -48931 -55421 -47422 -51987 -57910 -67156 -57134 -66503
9634 -66503 -72357 -64245 -76846 -69050 -39292 -31845 -41597 -54003 -58151 -59701 -56649 -56831 -43323 -42984
9620 -42984 -49395 -48820 -54153 -62429 -68587 -65770 -61320 -56393 -62526 -73932 -74352 -63371 -39214 -39645 -41544
9605 -41544 -49112 -56184 -50634 -36344 -49729 -59322 -69928 -79768 -92111 -86094 -80919 -81757 -80153 -84766
9591 -84766 -65889 -49132 -35022 -50158 -54543 -57267 -44295 -55229 -60192 -47752 -41504 -52558 -46592
9578 -46592 -39731 -25759 -32943 -62517 -72374 -63377 -62449 -40088 -37877 -49071 -42230 -49365 -56341 -63108
9564 -63108 -75220 -62422 -46137 -63184 -78255 -88441 -86374 -76689 -59509 -52485 -54473 -58154 -63447
9551 -63447 -73191 -70413 -63490 -63217 -63168 -63470 -75236 -97032 -115879 -101780 -83481 -75217 -75379 -65755 -63320
9536 -63320 -65586 -78763 -73815 -65112 -63631 -63734 -57475 -55370 -59566 -77854 -91419 -74602 -60282 -64619
9522 -64619 -53063 -56393 -58661 -71725 -72475 -64987 -39319 -25565 -36166 -51749 -58854 -71316 -75381
9509 -75381 -72312 -74539 -82411 -101954 -96791 -98229 -90913 -77976 -74950 -80134 -70639 -66112 -68419 -70801
9495 -70801 -71623 -71860 -72356 -70602 -64498 -63602 -67017 -66588 -61571 -58512 -41019 -36683 -39509 -41782 -40153 -39938
9479 -39938 -45224 -46029 -56038 -58372 -52065 -51095 -61016 -81543 -94939 -92358 -103080 -101917 -92110 -79203
9465 -79203 -74477 -67065 -62308 -70455 -70069 -65817 -61881 -49148 -59780 -72013 -64859 -51353 -60779 -53278
9451 -53278 -59255 -64034 -69383 -69373 -76570 -75189 -73101 -76065 -80006 -87682 -91667 -83115 -81909 -87460 -100007
9436 -100007 -89735 -79145 -60203 -51802 -56545 -52538 -59615 -64149 -58590 -65856 -74018 -77083 -84978 -85082
9422 -85082 -67403 -70606 -71371 -67087 -61797 -57879 -64785 -65892 -57839 -53163 -46797 -53459 -92082 -106753
9408 -106753 -105388 -87853 -87158 -103167 -107261 -99545 -91406 -83114 -89115 -73707 -75990 -93967 -108862
9395 -108862 -106781 -97094 -98852 -97780 -112070 -117906 -107574 -87062 -76016 -83942 -92531 -85664 -72503
9382 -72503 -59725 -61215 -75394 -94997 -113702 -114006 -107088 -119986 -113456 -107154 -98584 -89158 -84315 -85868
9368 -85868 -89092 -87940 -83558 -74272 -80899 -85074 -87564 -88995 -103639 -121105 -115524 -123374 -120391 -96050
9354 -96050 -98622 -116549 -115741 -106509 -80506 -87330 -80707 -76512 -69048 -55869 -58371 -67569 -87535 -91861
9340 -91861 -68948 -53450 -50097 -52743 -52393 -69519 -107959 -108031 -90297 -93256 -98173 -104766 -104543 -90349
9326 -90349 -71291 -57375 -63679 -68026 -62241 -61351 -67868 -64462 -53758 -68925 -68146 -66081 -50565 -35491
9312 -35491 -39920 -56008 -49230 -45506 -47410 -67625 -70014 -77337 -88853 -78578 -64354 -59848 -57689
9299 -57689 -63632 -67208 -62729 -41181 -39626 -32929 -39226 -44896 -19742 -14421 -14078 -17165 -12256 -5896
9285 -5896 -23844 -34397 -31606 -26924 -25335 -20612 -25744 -36056 -42770 -30392 -28656 -37394 -43056 -52292
9271 -52292 -54707 -48059 -34270 -13272 -4235 -21652 -47725 -45194 -28146 -25835 -18881 -24803 -33717
9258 -33717 -36252 -35601 -48831 -48546 -50245 -48586 -47585 -42994 -27694 -23855 -5166 10349 20983 27333
9244 27333 17268 7143 11844 40718 74980 85292 95653 102115 73051 49446 26595 17861
9232 17861 13030 13289 13562 13966 -3746 -20853 -32895 -53710 -59558 -45734 -38389 -46763 -48080 -38596
9218 -38596 -25128 -11372 3634 -5413 6785 19347 10520 9313 3986 21398 31682 44988 47642
9205 47642 34481 15263 -19049 -27088 -25765 -26182 -18722 1483 14166 8470 -279 -5036 -23873
9192 -23873 -39975 -62611 -63448 -56955 -86453 -91872 -80773 -77730 -74595 -82910 -84447 -76750 -68760 -70717
9178 -70717 -61537 -45322 -51240 -49365 -63471 -48108 -39818 -50532 -69389 -81794 -104657 -114015 -100355
9165 -100355 -87429 -85991 -85584 -91187 -96494 -97314 -98195 -91048 -80524 -67323 -76018 -72944 -89275 -105276
9151 -105276 -105354 -83605 -75892 -88952 -92515 -84222 -83790 -84724 -96801 -101115 -96860 -109706 -119161 -112453
9137 -112453 -112138 -116342 -116918 -114177 -110927 -114855 -112431 -92870 -77776 -78707 -96686 -102313 -106277 -107522
9123 -107522 -100186 -100778 -101054 -107665 -111180 -102983 -107437 -85669 -84053 -108943 -113418 -89331 -74532 -85811
9109 -85811 -81455 -81820 -94813 -105123 -108920 -103766 -96886 -94593 -99196 -105524 -99772 -104146 -98625 -105345
9095 -105345 -126106 -144829 -145719 -128890 -118530 -119407 -113791 -118462 -130078 -114062 -103118 -88024 -101531
9082 -101531 -120297 -117746 -116583 -99598 -96485 -98457 -102950 -117991 -133500 -138711 -126128 -109604 -115076
9069 -115076 -115834 -108452 -95295 -72173 -66880 -78207 -90337 -93846 -98026 -91682 -100344 -100317 -104988 -118097
9055 -118097 -121119 -99083 -84953 -94193 -111597 -111425 -100992 -87901 -74465 -80523 -91038 -79041 -77988
9042 -77988 -88937 -99544 -106065 -114127 -111646 -115196 -101156 -100879 -90509 -90055 -95595 -106043 -109741 -92950
9028 -92950 -70135 -63860 -56363 -60457 -64934 -53112 -50640 -65278 -60386 -52086 -46772 -44333 -56467 -78051
9014 -78051 -96416 -102531 -103881 -103469 -114593 -98783 -102285 -91273 -70732 -74289 -79220 -68675 -64258
9001 -64258 -67236 -62475 -63706 -90072 -83319 -71326 -74273 -70937 -72926 -64645 -44806 -36456 -22906 -15383
8987 -15383 -12369 -24806 -35466 -32528 -8608 -3583 -20940 -33925 -35741 -40048 -41870 -55545 -56188
8974 -56188 -55707 -32226 -29493 -24661 -22335 -30292 -32750 -39153 -36844 -25972 -11674 -13569 -9724 -5600
8960 -5600 5200 12464 -7894 -21962 -24726 -24966 -25214 -35658 -42820 -58607 -56365 -48235 -39137 -36775
8946 -36775 -45923 -45788 -44634 -43309 -48202 -47497 -41673 -23270 -7969 10496 25717 43003 61401 62528
8932 62528 50164 43121 35752 13889 18908 21352 17086 8250 -5273 8362 32302 46207 60679
8919 60679 57277 31088 39576 59440 61524 79257 97993 100320 113012 114475 104931 104336 94472 68288
8905 68288 51488 38250 30455 31512 31649 35134 38514 43319 41061 34296 43072 47484 47668 59929
8891 59929 90844 128361 145089 163648 173410 163476 141254 88458 36917 34690 45669 34952
8879 34952 23737 16594 40262 72116 89931 99824 105109 124681 149501 181070 201829 215667
8867 215667 229309 227981 205295 203793 198123 202251 208279 203027 173657 138992 107348 94075 99508
8854 99508 114368 144423 178989 191735 195512 210532 228836 250183 280874 294842 300768 307371
8842 307371 272411 223347 203023 165131 116465 87045 96866 84131 76927 92523 98019 91392
8830 91392 121424 162963 186888 204094 220827 230464 240783 257473 240627 238803 243579 243691 232964
8817 232964 211815 180926 155978 155108 144759 138179 100054 82327 115469 147626 189957 241269
8805 241269 272784 287182 336366 376722 384747 379652 384743 387252 388092 392844 397838 391959 385936 366062
8791 366062 311810 251716 204764 186620 164416 157204 165322 167297 176038 196401 221431 261687
8779 261687 300859 288783 261135 234831 247033 249892 252360 282971 304153 302497 283735 245497
8767 245497 220153 203723 184118 178631 173665 177052 180166 194053 197254 212142 241856 259735 265759
8754 265759 290553 335717 402755 480487 546035 584742 594407 545267 465524 404144 350970 296672
8742 296672 261189 229700 209720 179874 159467 164856 158040 168187 182661 181293 196974 196457 193599
8729 193599 198635 197325 207272 191197 172731 180412 207286 229750 273848 305891 324089 325037 294432
8716 294432 242100 199473 168786 127341 120897 114214 118479 118611 120475 158019 206380 236558 258102
8703 258102 280890 286020 290578 300839 300824 295223 269720 212322 132294 63359 1258 -29904 -38284
8690 -38284 -33054 -32121 -15350 -3149 3098 14524 22708 19747 6852 -3135 -4441 985 9805 55084
8676 55084 88263 105172 118903 128109 127011 116606 109519 106731 100298 96750 57733 8593 -21682
8663 -21682 -35218 -47820 -41999 -45769 -44763 -36731 -29867 3463 28056 44553 39346 4434 -27946
8650 -27946 -40610 -72019 -96360 -106613 -126933 -144037 -125879 -103380 -109234 -122227 -129240 -123168
8638 -123168 -118504 -145634 -164904 -155010 -143392 -117568 -108659 -103608 -92624 -84218 -87856 -89723 -67223
8625 -67223 -43482 -41743 -52277 -52596 -49133 -58278 -83434 -94643 -97114 -97182 -128862 -136232 -133891 -143783
8611 -143783 -143625 -147873 -142210 -144699 -159615 -169508 -168125 -160644 -141953 -145142 -155998 -164366 -177298 -179764
8597 -179764 -157810 -137137 -141748 -149637 -171615 -166923 -152053 -149592 -135748 -110093 -113994 -138045 -157913
8584 -157913 -153398 -130084 -132644 -135443 -112768 -109319 -120495 -126398 -136436 -137909 -133809 -132119 -132629 -141942
8570 -141942 -142889 -153364 -161202 -167327 -166105 -158864 -146580 -141914 -138067 -136743 -129027 -132797 -159072 -174948
8556 -174948 -178986 -169546 -161754 -161556 -149341 -137827 -120626 -91890 -84381 -83718 -88226 -85302 -79065 -78685
8542 -78685 -88787 -96575 -94727 -106241 -104679 -111551 -111398 -104303 -94827 -99969 -92200 -86971 -77411 -77239 -79733
8527 -79733 -80915 -91874 -89661 -97172 -89777 -79075 -78726 -74959 -64026 -59617 -59812 -22788 22485 97684
8513 97684 229830 376188 452697 495867 532181 484085 331840 182676 105536 71847 36415
8502 36415 20290 27447 35418 17845 18981 25243 33857 25489 11823 -6915 -17534 -34273 -60390
8489 -60390 -63974 -53724 -66976 -84170 -85422 -72856 -64488 -58789 -60680 -43485 -48292 -61713 -66678
8476 -66678 -58451 -41831 -43296 -55484 -40047 7755 106290 288645 588996 820546 933431
8465 933431 1004251 989317 764285 491097 322097 226520 156580 98146 64310 56585 53205
8454 53205 41761 40385 36379 33065 -5499 -41581 -51759 -66436 -67662 -58237 -68795 -81361 -106733
8441 -106733 -126283 -127071 -147576 -141903 -128060 -126761 -121276 -102727 -90093 -77349 -59954 -69763 -96017
8428 -96017 -92545 -68053 -41308 1754 132202 287645 389084 449707 473213 405519 274264
8417 274264 170638 103448 66233 69580 78612 93286 141999 240705 436266 829693 1352537
8406 1352537 1723506 1882274 1947039 1825117 1388706 941042 657142 465459 301326 178803
8396 178803 96675 53036 14340 -6762 -14890 -20217 -12145 1152 29116 41012 67295 102333
8384 102333 146022 205896 247224 317546 416295 545952 717549 987300 1409722 2105030 3311550
8373 3311550 5356120 8218165 10722433 12140111 12981881 13130606 11528462 9097788 7262868
8364 7262868 5947186 4695126 3584993 2813879 2330617 2010625 1784790 1616614 1489801
8355 1489801 1414331 1390893 1388082 1417582 1487946 1595288 1749181 2012681 2405129 3031111 4049103
8344 4049103 5774426 8775281 13596934 19424640 23730757 25761609 26320275 24677666
8336 24677666 20063774 15191537 12040304 10298823 9495123 9601639 10936002 14079066
8328 14079066 19233090 24471605 27901681 30274630 32183429 32340701 31394739 31474659 32911636
8319 32911636 33787407 32405970 29409318 26025568 21743672 17837679 15744154 15554802
8311 15554802 16985898 18813743 19712324 19929393 19610517 17831748 15030621 13060863 12234569
8302 12234569 12318052 13375289 15894763 20856440 29501723 41128198 51367250 57897729
8294 57897729 62533802 65360899 64857312 64528241 67084564 69867254 70301513 67404520 61150085
8285 61150085 52929581 45692331 41204798 38814821 37971299 39097718 42118386 46194187
8277 46194187 51171635 57277933 62327252 63082463 60174393 56816007 52694321 48286539
8269 48286539 45448003 45241113 47641900 49897008 49601553 48783797 48767363 47970845 45469861
8260 45469861 43811518 44404227 45932298 45691136 43921630 42952406 43006044 44102049 46875821
8251 46875821 50237492 54830660 61978873 71821089 84673509 100077570 113402338 120944054
8243 120944054 121073040 114220588 102702952 91303370 81769073 74202488 68450004 63332027
8235 63332027 56878145 50866446 47610431 46866560 47565735 47548409 46414916 46470644 48689504
8226 48689504 51002814 52084425 52813206 53973247 53478548 49748436 46455866 46155192 48642707
8217 48642707 52033292 55689610 60899355 66882970 68981596 66224174 62862187 59629887
8209 59629887 54606594 49648019 46506730 45336189 45298760 46318323 50370442 57296185
8201 57296185 64442038 69724158 72349733 73282123 74411689 78369784 82646562 83680354
8193 83680354 82290738 78307478 67855601 52992271 40908236 32958341 27630931 23919779
8185 23919779 21599187 20769759 21588358 23659584 25307841 25859171 25866238 25009796 22513894
8176 22513894 20095126 19383773 20554164 23174773 26184720 29429826 33299776 36288201
8168 36288201 37013742 37849852 40855834 44300418 45588547 45158305 44053387 41027939 34198096
8159 34198096 26891700 21834184 18738175 16887830 16105555 16708318 19290676 24318069
8151 24318069 30335895 34276488 35729427 35499530 32374270 25887927 19679967 15502691
8143 15502691 12718567 10637672 9046639 7876666 6989802 6292060 5758128 5356816 5013040
8134 5013040 4709503 4474426 4275307 4117944 4017339 3967401 3984243 4081417 4306345 4728118
8124 4728118 5473503 6798150 9133920 12552238 15714592 17341493 17899141 17501120 15103528
8115 15103528 11576105 8870355 7120314 5892176 4930422 4202367 3666611 3284156 2973274
8106 2973274 2716609 2511389 2342609 2189693 2044977 1956257 1879801 1801310 1723685 1669320
8096 1669320 1609112 1554288 1507680 1453954 1397768 1335421 1270946 1212538 1158122 1116074 1080850
8085 1080850 1038540 1004835 978357 940812 916024 893887 885486 876606 843375 810854 796150 807193
8073 807193 826465 824142 805834 797488 791328 769575 744930 719246 697910 693134 680817 665224
8061 665224 628460 590654 555423 538674 531614 517715 501953 510617 520487 534068 528438 524617 522942
8048 522942 531218 539345 541783 547030 553354 555082 576687 579521 574576 584733 605055 632553 687660
8035 687660 775305 897192 1020240 1131501 1224822 1245485 1192621 1112719 987389 824552 712109
8024 712109 607509 525368 478495 451628 444268 419750 404862 382256 353908 325989 299297 284344
8012 284344 255790 221741 211454 203129 213014 217843 200984 208748 219004 244384 254276 251361 254803
7999 254803 257948 280627 317004 364395 409748 461327 505526 545889 577312 613717 695849 837786
7987 837786 1089231 1384164 1712137 1963941 2083167 2033028 1818200 1503024 1186470 931305
7977 931305 746402 615299 540112 486609 456870 434010 435889 423879 383730 349901 352508 328437
7965 328437 271602 225322 198783 182246 183540 188034 168719 157826 145816 138115 137488 152212 161021
7952 161021 196253 226550 239146 253235 256833 269427 282149 328737 359050 372659 420262 477707
7940 477707 557206 673626 798882 900413 987939 1061261 1135603 1145983 1083707 993533 899034
7929 899034 768777 609593 506599 450717 424729 418815 437459 439604 420228 402809 389564
7918 389564 367089 383384 414949 486116 587646 677920 727025 708670 667137 581946 477373
7907 477373 379225 300818 255113 219937 188018 148377 130250 131529 134646 136386 134719 136087 121341
7894 121341 111694 120750 126606 153482 221283 349804 527492 775167 1031046 1244288 1410462
7883 1410462 1482725 1415968 1283270 1141866 1051219 1026047 1030009 1021878 960736 884944 790371
7872 790371 675392 588123 568690 594312 664113 772642 909838 1050850 1163423 1217925 1211875
7861 1211875 1147124 1048437 901098 732432 555933 433140 343140 293041 292798 332466 422352
7850 422352 538366 672710 802263 870672 892378 866263 821655 769696 729217 688445 668839
7839 668839 629027 564534 517370 523664 575072 659173 730416 785597 806430 783991 751424 755575
7827 755575 796081 840278 859182 852532 817020 730558 650360 611823 583872 564703 577110 585184
7815 585184 560156 552548 569316 598136 645380 703442 747958 786565 808370 800019 817024 860183
7803 860183 892046 901119 892209 871113 842785 805210 775982 747085 669610 562629 440307 340755
7791 340755 279137 257270 242427 243273 267528 280560 306435 332487 313215 279005 283525 291608
7779 291608 289907 257267 215711 182601 174917 176923 177366 178728 189641 215421 221350 224791 223883 237307
7765 237307 246404 262185 273609 297649 340374 372141 409858 478291 542914 581635 592202 563896
7753 563896 463178 358819 272973 225537 195496 167837 163094 163286 181603 206397 213017 230702
7741 230702 271926 287816 316109 358696 418180 445452 469962 479605 453488 409745 383824 363431
7729 363431 322019 286331 248625 203861 155644 112544 79832 61131 34837 32723 64210 101119
7717 101119 139715 149495 141802 170559 176214 166232 165020 144425 124402 123903 121623 106744 86149
7704 86149 92894 101633 110223 141907 165787 160425 136346 116046 103227 86638 90064 120024 147925
7691 147925 159780 189638 210078 249461 299309 323533 314028 294560 265086 201243 106114 37355
7679 37355 7854 -70 -10135 -33208 -45956 -61627 -60375 -53267 -32210 -33819 -25559 -17198 -20025
7666 -20025 -9022 -3869 -15967 -30045 -34413 -27327 -8694 19317 56167 123661 177974 205429
7654 205429 207529 175145 122598 70789 27046 -9755 -31731 -50799 -59681 -47824 -44001 -16797
7642 -16797 10778 29443 35163 -2497 -43809 -77085 -102103 -115536 -122163 -135591 -120327 -93835
7630 -93835 -68176 -25589 17977 50247 53050 51404 55398 55716 34648 23943 33176 59441 64930
7617 64930 75909 97030 114096 162603 183130 184135 165392 154999 130066 82515 49785 20718
7605 20718 -13200 -30896 -52816 -89174 -112923 -138857 -148524 -152869 -139808 -138422 -163672 -157724 -147192
7592 -147192 -142456 -138563 -125893 -104748 -91098 -79344 -67264 -84813 -89028 -96308 -104787 -98530 -93671
7579 -93671 -89541 -66798 -35139 -3373 13491 33176 47845 47701 51329 82242 105086 123447 125107
7566 125107 122447 122899 133998 159632 163633 174903 157332 138250 104619 61239 14172 -48998
7554 -48998 -93380 -121446 -143822 -159867 -160945 -152785 -154176 -154591 -139687 -135729 -128870 -104878 -80065
7541 -80065 -58204 -25702 -1307 24750 36855 42960 46779 62413 76134 78518 97086 77661
7529 77661 31113 -8916 -47517 -99899 -140456 -156789 -170243 -178772 -175053 -182740 -196608 -249619
7517 -249619 -286135 -320106 -377357 -419158 -426714 -413381 -399282 -397073 -380103 -355829 -333101 -312189
7505 -312189 -277414 -251250 -223762 -179582 -145039 -80831 22636 147608 327212 601349 1059721
7494 1059721 1819387 2834613 3769055 4374281 4595183 4418414 3733237 2754985 1928460
7485 1928460 1394295 1068559 850191 696173 595815 515287 445673 360139 256668 150127
7475 150127 42652 -46141 -104599 -164683 -192091 -229452 -247934 -256421 -285805 -328619 -373894 -410939
7463 -410939 -441958 -469989 -479167 -452506 -423806 -392283 -350982 -305449 -259926 -216542 -193290 -163170
7451 -163170 -128837 -95524 -62938 -40832 21065 129148 268470 458420 771697 1283286 2108724
7440 2108724 3039745 3818324 4295951 4477367 4260389 3642571 2933775 2417316 2178382 2029741
7430 2029741 1883954 1770486 1662158 1514830 1366401 1264861 1225662 1263156 1366565 1535254
7420 1535254 1730651 1948147 2202659 2469701 2768497 3130080 3578246 4118356 4842635 5829845
7410 5829845 7222494 9257813 12519043 18158148 27790933 41629600 56977668 71977432
7402 71977432 86308773 96246070 96683451 89607336 79291462 66298736 51652977 39125135
7394 39125135 30630924 25241239 21667007 19313224 17891280 17200697 17192684 17888243 19166094
7385 19166094 20957618 23457936 26961770 31948764 39629142 52293374 73392321 105666757
7377 105666757 147107860 190919322 230371648 260089546 277917862 283763012 276881454
7370 276881454 260540761 245164494 237954390 241691407 260164597 286410209 307443760
7363 307443760 317785056 316307393 299175728 270787033 243832077 225124109 211313124
7356 211313124 197876990 182108835 165840586 154351649 150201632 150127576 147503930 138543956
7348 138543956 125120290 109145750 92175205 77707155 68231331 63734771 64067485 70476367
7340 70476367 83486643 100388326 117576006 134141333 147181624 150057586 141906076
7333 141906076 129324692 115100371 98959488 85776370 80597851 84838818 99977194
7326 99977194 127843515 167750888 215970888 265427216 302160007 316130985 309848087
7319 309848087 290179236 262695865 240605686 232900573 237468389 250817952 266676665
7312 266676665 274946957 274584747 271206949 262253990 242108736 214538970 185185992 153801907
7304 153801907 122952705 98287042 81014916 68765178 59618640 52691726 47350336
7297 47350336 43143125 39976836 37810690 36516191 36267601 37680699 41906170 50779486
7289 50779486 65434464 84031412 102964814 119420796 129162984 127776243 116509628
7282 116509628 100105694 81171283 62886426 49292498 40353812 34220036 29676823
7275 29676823 26203524 23472590 21246985 19356357 17762466 16384176 15166524 14103736
7267 14103736 13186890 12383060 11665256 11060936 10511868 9998382 9539005 9142551 8785198
7258 8785198 8459438 8168891 7962754 7818458 7729600 7660551 7609950 7580612 7588329 7678571 7941243
7247 7941243 8592920 9926887 12125664 14774337 16922385 18045981 18170872 17112965 14805006
7238 14805006 12116091 10006545 8594013 7609998 6868539 6279545 5829034 5482005 5196356
7229 5196356 4940012 4723097 4550427 4412757 4317808 4249816 4186874 4098113 3971004 3828152
7219 3828152 3666303 3513105 3366126 3234855 3147887 3097221 3068680 3052665 3048936 3005408 2927211
7208 2927211 2825415 2749431 2728050 2736376 2774463 2829507 2919905 3068628 3329937 3827227 4753925
7197 4753925 6397243 8853496 11519081 13438580 14349524 14317688 13025283 10596917 8130518
7188 8130518 6397535 5311473 4584204 4019093 3604530 3286870 3020078 2796621 2589000
7179 2589000 2391650 2214926 2087926 1999536 1944364 1921091 1911233 1902210 1869705 1827394 1763600
7168 1763600 1670042 1582650 1498597 1421895 1377670 1353599 1346026 1339862 1322480 1297821 1239029 1165804
7156 1165804 1091828 1019194 938262 896738 867023 831043 827235 851553 886128 917291 910349 897085
7144 897085 891629 887195 878372 872367 872500 868890 872035 867259 848437 844745 837966 817471 780427 729882
7130 729882 679054 648154 618187 608595 607260 618949 635676 667193 707541 758868 791767 798562
7118 798562 794818 800176 802795 806822 801886 806463 814520 803608 798542 778496 761949 728785 667619
7105 667619 610559 571802 545171 514935 486951 473176 471060 468259 475029 495344 506051 521956
7093 521956 542703 557162 577275 605115 605245 611824 618551 613259 625438 629941 631115 641096 674559
7080 674559 677651 662363 629141 582785 537272 483668 442527 406162 394643 379224 361191 356077
7068 356077 361635 337525 328678 335537 338479 341827 327455 325921 344329 375862 395247 410708 428823
7055 428823 448033 475953 501291 508766 494104 473311 452604 430631 395874 368702 341950 317280
7043 317280 325426 327392 315853 301834 293788 307278 314893 330894 364709 397203 412280 441314
7031 441314 478127 498542 513887 537390 556120 562190 547574 519407 479746 424910 377247 319806
7019 319806 286584 266984 271661 243569 199916 171751 129677 73073 28289 6345 -22098 -30315
7007 -30315 5260 51756 102650 170981 261995 374358 478021 579081 705057 865123 1069538
6996 1069538 1367399 1872914 2779728 4169534 5937857 7993648 9999148 11352258 11675917
6987 11675917 11168809 9808994 7937262 6019936 4390515 3226658 2441652 1874501 1469226
6978 1469226 1170603 948901 795295 712197 663337 623107 601972 602460 612699 620383 626038 640413
6966 640413 663431 725789 849755 1086622 1489457 2168504 3310941 4943816 6930977 9108236
6956 9108236 10922997 11879248 11788419 10849688 9107591 7108534 5285918 3950582 3053464
6947 3053464 2417903 1953442 1598928 1347778 1184779 1093060 1050045 1018865 1002706 1012343 1019476
6936 1019476 1001416 960177 902752 877864 887494 921524 938968 959698 987561 991380 993850 1026383
6924 1026383 1078467 1138671 1216627 1281774 1340756 1421970 1550832 1740184 2006222 2323497 2634980
6913 2634980 2937649 3202445 3438946 3696495 4013126 4436853 5001865 5797236 6923255
6904 6923255 8454907 10623656 13946303 19496435 29032882 43868977 63121181 83380140
6896 83380140 102547428 117220833 122362640 116593381 104316631 87864698 69915718
6889 69915718 54610536 43434146 36412385 32124266 29509976 28053285 27586368 28042552
6881 28042552 29515436 32450252 37724094 46708909 60930635 80361353 103882085 129396040
6873 129396040 156148819 185427487 218264003 254087349 291114019 323963791 345825937
6866 345825937 357078220 356760366 348214348 339226064 337269069 340327392 347446703 353037736
6858 353037736 351155158 340069835 319752216 289758272 252843399 214729431 177238195
6851 177238195 145620944 121953661 106927582 99728077 100047189 107824068 121879060 140605067
6843 140605067 161173244 183000584 205460283 228595128 250668677 270899808 286511999
6836 286511999 294018955 294965838 293140238 295214820 303849263 323753817 349546953 373423820
6828 373423820 385990764 383726091 364945129 331703566 287601451 242300576 198674164
6821 198674164 160183721 129222882 106087817 89477806 77279432 67986597 60700773
6814 60700773 54897153 50254595 46515023 43491127 41098411 39342856 38338136 38453386
6806 38453386 40511382 45295289 52591654 61636238 70736873 79197536 85565019 89023696
6798 89023696 89168900 86845043 81396926 73467698 64669644 54576886 44950157 36930542
6790 36930542 31285563 27387985 24524979 22299340 20495351 18956415 17626105 16447927
6782 16447927 15389702 14455060 13654051 12950527 12326805 11783370 11309207 10926071 10619064
6773 10619064 10317331 9998271 9664951 9351254 9036453 8724509 8423807 8205866 8042392
6764 8042392 7907646 7752397 7569776 7330382 7037826 6770284 6528618 6305340 6099976 5914674
6754 5914674 5756890 5636012 5526696 5422453 5324254 5265315 5247357 5277153 5361365 5565041
6744 5565041 5935353 6508613 7199019 7887346 8411315 8664755 8579641 8148862 7488282 6813654
6734 6813654 6176463 5660603 5244721 4911141 4669330 4494835 4361050 4230524 4124064 4043527
6724 4043527 3982768 3935776 3911283 3928686 3981176 4080938 4230667 4526059 5030771 5669271 6364689
6713 6364689 6947916 7291339 7314575 6995129 6354954 5609562 4913072 4301876 3849382 3523473
6703 3523473 3266968 3081866 2936320 2813646 2693566 2578063 2492091 2431141 2395336 2368746
6693 2368746 2345097 2338541 2335514 2319296 2277274 2233722 2195392 2162226 2124589 2078845 2015871 1974196
6681 1974196 1930480 1885894 1848216 1803039 1767900 1739798 1687051 1602030 1500616 1417294 1325137
6670 1325137 1237039 1178641 1156136 1153894 1151056 1157847 1153566 1157465 1179369 1187494 1172398 1161522 1161352
6657 1161352 1169394 1165320 1158675 1154975 1151964 1149519 1152802 1147929 1128537 1118146 1120675 1101771 1077833
6644 1077833 1059269 1036621 1010607 1000638 1010879 1011544 1018028 1026908 1021382 1016492 1011057 1001234 998192
6631 998192 998995 985637 982966 992310 1000881 988303 978515 947019 914170 892494 895751 891743 869190
6618 869190 863012 862458 847642 850873 867704 880943 894842 910192 909633 897453 882003 900406 908420
6605 908420 917142 922034 928267 922923 914758 914901 909177 885420 849843 825177 829146 823868 812420 798064
6591 798064 782244 768525 740473 733280 730531 731221 720929 710906 695952 686148 688482 689286 670228
6578 670228 660956 679567 694547 707003 721607 719614 716755 697010 687100 681587 684938 679364 686773
6565 686773 691137 684992 685490 691837 679219 665163 665728 660946 661914 647442 640867 631323 617260 592748
6551 592748 591570 600118 614750 626045 632616 635832 642655 659261 651181 626808 616653 622461 635075
6538 635075 616152 607098 614808 632506 629096 618213 629966 621576 613218 621310 594692 596249 608244
6525 608244 584997 557423 564121 586124 592619 605893 607139 610950 612927 605597 611725 620646 621439 614937
6511 614937 627534 646396 636373 620799 597967 585669 578947 584376 588585 581554 581417 570729 568369
6498 568369 575251 567944 557576 558612 547374 536600 535574 535179 530810 524712 530451 527807 521981 529641
6484 529641 542625 542556 542679 551521 534869 537167 534821 522119 515207 527521 544439 559972 552221 536362
6470 536362 543675 550689 532954 511835 494620 484753 466363 446720 435197 437761 433635 421073 425974
6457 425974 415382 401215 408543 420192 442130 457894 450953 445247 441154 448752 460993 447418 440042
6444 440042 443374 445610 457599 448871 444289 453497 477404 486647 512925 568864 634876 720858 814239
6431 814239 851347 851758 809050 739701 673291 601730 567697 537014 509222 496756 487717 484745
6419 484745 492540 492561 478312 491666 512561 514724 508522 496552 488786 478825 471651 456774 463196 460887
6405 460887 461591 492856 543650 587132 641881 742201 811296 856758 878220 883279 869566 843688
6393 843688 830463 857547 933248 1068560 1234171 1351760 1376546 1344840 1250523 1123593 973327
6382 973327 851033 771734 737258 752203 783936 836893 904504 984180 1020762 1013111 993051 926133
6370 926133 840561 771849 723111 706275 724487 737739 773787 867534 1013210 1190408 1415716
6359 1415716 1634546 1828489 1959256 2006486 1980653 1900931 1815172 1730437 1655275 1610228 1567934
6348 1567934 1541101 1553440 1557297 1515799 1450907 1374007 1289422 1197825 1099580 1027278 955003 858384
6336 858384 790515 747665 711407 710619 742015 794347 870817 982284 1089337 1185813 1299987
6325 1299987 1438470 1556432 1654337 1731338 1768921 1731451 1638254 1495412 1341372 1178549
6315 1178549 1051663 959422 877798 782248 709586 660688 615193 579565 573901 559822 569324 592737
6303 592737 650857 734646 809209 865160 895443 898190 872508 810201 778207 800253 853447 916084
6291 916084 991722 1057785 1097812 1071260 1010073 940477 848366 741695 658922 596396 561013
6280 561013 518353 480054 466882 456716 453569 458783 457516 453772 467827 497754 544865 594665
6268 594665 671610 742532 780485 810160 790518 742818 676484 601598 534367 495511 461283 432736
6256 432736 419746 405476 391282 383506 373332 361150 361179 356011 343410 316560 303326 323912 333925
6243 333925 332353 333273 324651 326227 314217 315515 310866 310696 307440 293836 303423 322586 329144 321114
6229 321114 307620 284357 283141 273400 281761 307958 320339 313739 308203 294698 274708 272126 277365
6216 277365 298956 304318 295334 290775 291753 287196 287788 280075 273977 285350 292093 283809 275237 276507
6202 276507 275085 257898 258273 280508 289939 294994 293499 283155 255897 249323 252924 254274 243959
6189 243959 232326 237974 241360 239296 247197 242336 241831 245796 249569 261764 254351 242548 242722 232408
6175 232408 236748 235721 224187 221120 229001 245775 248271 259990 259785 258674 264151 240289 252038
6162 252038 266448 269498 247728 237098 237499 252356 256240 244938 255052 253976 250084 240189 233422
6149 233422 237329 234912 236150 238389 233436 234041 237708 253657 254719 255698 237289 219975 217174 226765
6135 226765 230411 220606 216564 220838 228748 219316 221631 206285 186947 187118 206881 223926 214499 216531
6121 216531 225245 236201 234983 224409 213326 210222 204340 214433 218491 216983 215375 208086 202796
6108 202796 200023 192460 183790 186591 197874 214737 208437 218835 218527 209111 203398 211711 220334 202225
6094 202225 205523 187988 179844 184291 183241 198022 203484 203991 215030 219527 216429 197520 197300 205812
6080 205812 209868 202223 199524 192809 173907 181487 188652 205348 199693 183034 181467 183121 167808
6067 167808 169579 161931 164468 171918 183632 197915 211729 219425 228788 242343 226709 201179 214348
6054 214348 233867 253210 243275 216370 209667 209206 212869 207326 197055 211751 221611 232144 225532
6041 225532 220428 209828 201461 189038 180400 184515 194228 212075 215911 211334 194449 194755 204229 217108
6027 217108 206456 194980 189344 210161 208831 207191 219354 205091 184088 170342 177481 191730
6015 191730 215264 209743 209923 225742 233675 214264 196589 198180 202128 201051 217038 211452 206558
6002 206558 189519 191007 200271 195328 180122 169719 156614 161755 160464 151188 163759 167028 176500
5989 176500 176122 176801 176141 177571 197258 209947 202440 184311 158802 155434 164840 167988 175039 182789
5975 182789 175915 164000 158723 155857 137346 123135 125107 134886 136936 144433 152964 152681 163823 172303
5961 172303 172688 164743 165837 167848 153294 143046 169343 193385 190525 187275 182658 164802 157688
5948 157688 161240 155858 160569 166879 172855 166274 157460 174191 192403 196267 187090 181601 168891 175770
5934 175770 166172 163076 154739 154333 168192 161567 151946 147328 141170 150488 153766 146206 146096 142543 136133
5919 136133 148356 164692 170731 176671 178924 175464 168073 168446 178205 172929 165743 152380 150134 148155
5905 148155 148985 159940 151013 157005 157937 156611 153689 145819 140226 145467 166479 192471 192926 173818
5891 173818 166267 170757 165697 153022 156895 160659 175529 177386 188032 179958 167250 148590 134543
5878 134543 139429 141770 154947 168927 164657 150680 160726 165407 157447 143736 143249 129773 125321
5865 125321 125358 123880 129442 147477 156177 168802 174362 178623 180355 178989 167492 159986 152597 137478
5851 137478 130350 121313 116947 109058 120789 133760 153416 154448 151435 137873 137811 131819 126229 138582
5837 138582 160734 175067 189103 186933 163273 147001 144615 117150 105497 92633 85969 84649
5825 84649 103997 112491 116772 134318 140324 141310 142578 131507 112105 104713 121810 119967 110208 114483
5811 114483 115437 101095 106272 108026 126855 137198 153444 164550 160218 142066 154472 177282 172292
5798 172292 168676 165723 152190 144541 145679 147781 143104 126671 120181 112745 114134 113227 124560 129759
5784 129759 127202 120701 111489 119893 117386 125155 143841 161709 165516 149452 136210 127130 129438
5771 129438 124108 115165 115155 133889 128731 114861 109144 124058 123185 125650 136980 148341 152290 146901
5757 146901 157887 148613 149428 139441 128577 130843 128754 123145 136171 136306 113653 121566 125363 122697
5743 122697 134723 148327 140318 122210 122468 134984 130012 132282 122394 117204 114883 122076 133158
5730 133158 139303 136349 133699 128819 143515 157200 149371 143985 144198 140830 130098 117966 114339 114402
5716 114402 124247 122876 116189 111324 97831 109651 130405 150700 141435 126473 118107 124842 131783
5703 131783 142658 149919 155165 156484 131892 113263 111108 120066 117161 114902 114779 108786 101333 104347
5689 104347 110459 114376 130337 144059 140862 140519 130088 113298 128196 136017 138975 142675 153587
5676 153587 148314 145007 140542 143787 146773 150385 148489 148268 148950 151090 132465 107849 106747 87724
5662 87724 76122 81422 89896 103801 120029 130211 128485 121326 114978 96906 101206 113797 126493
5649 126493 116832 118703 125202 122156 128379 122698 120715 119554 119633 124306 129531 111648 113022 108285 99216
5634 99216 103682 107117 101653 109101 121942 130536 119223 121015 118314 112227 110419 105858 100308 101739
5620 101739 89915 91712 107843 112941 100734 85125 105534 105444 112041 110680 113212 111582 106809 106167
5606 106167 111011 103217 99409 98908 91896 82167 83830 95345 88977 102258 100164 85740 83689 82855
5592 82855 97574 104999 113331 103406 92345 102964 118388 102430 71852 65553 70380 81640 85098
5579 85098 89236 76643 72693 81798 79406 73506 70897 65047 73365 91567 104390 104756 106107 101068
5565 101068 82339 87286 97172 111467 112459 114014 105350 85551 84908 97670 103303 103914 92113 81351
5551 81351 80635 84809 74921 90715 100289 94687 90590 100412 101547 102174 95522 102709 114938 127477
5537 127477 126727 127811 121973 130811 110959 105686 123312 112515 104716 98186 96755 83232 78842 89607
5523 89607 102472 105998 107863 120026 109933 96025 92497 90401 82666 89764 105267 99421 92711
5510 92711 85673 91673 76770 79684 88959 107530 116798 114176 108591 93937 82810 87493 71161
5497 71161 72228 78665 75456 89586 99212 122182 130394 118459 113184 119153 134571 114891 97861
5484 97861 91697 83937 81667 86771 105408 110199 108693 92088 91858 97822 103351 98111 103376 100487
5470 100487 93881 89250 89979 69971 65585 71911 75528 83262 86339 78099 70177 74176 73204 72476 72490
5455 72490 79699 84626 61846 59952 82676 86024 76242 81678 95063 95390 90108 78239 79281 85064
5441 85064 85863 88032 101156 96329 81291 71198 66098 62049 60591 64965 57339 65404 73808 79864
5427 79864 92936 99170 93107 93520 66063 58777 64207 49602 48287 57109 59111 77547 90445 89959
5413 89959 94960 95303 91673 90943 86332 75036 80132 81735 79241 74636 69138 67933 60032 61170 44629
5398 44629 31717 44191 48336 54891 69580 66528 71829 77123 81838 85898 69577 53145 75708
5385 75708 86226 80488 65431 67379 80700 86277 72716 52318 61980 73004 73785 89048 82548
5372 82548 79499 88246 77063 79080 67874 61867 73267 86107 83515 89664 75357 80198 82854
5359 82854 83425 97568 111763 102726 93359 89336 95904 103737 109658 109523 111050 111841 91392 89619 99502
5344 99502 95340 98166 105244 104765 104146 94973 92048 89508 86524 73364 74718 75388 67381 53805 65437
5329 65437 71226 68701 66776 57922 29872 41079 63396 71642 68977 61470 67440 65569 69885 58631
5315 58631 45363 57821 85802 88336 85269 87898 92992 93273 91198 80586 86862 89266 79761 73897
5301 73897 93222 109082 108690 93868 87269 84122 75198 70925 67986 74945 66264 58752 50212 56447
5287 56447 55033 55228 56105 43085 43229 56720 63420 55421 61594 75191 68037 64661 58500 45658
5273 45658 48924 54439 54053 52482 54479 60656 62956 59992 64430 61269 61159 72892 59841 57091 53003
5258 53003 51625 43371 39994 61087 70639 66794 71699 49693 47734 54141 48526 54194 55182 77416
5244 77416 77653 65003 59745 60085 49009 45102 59068 60049 71122 64097 69048 78302 72473 70567
5230 70567 71559 73278 65039 65450 78539 68662 66501 67470 59579 44571 54155 58635 60744 64555 69049
5215 69049 58203 51471 54084 52675 54810 65539 79559 70596 68228 65167 55172 48929 53541 56048
5201 56048 55523 58190 56950 59528 50775 44582 41664 48541 51125 45345 36190 38915 52350 55132 48694
5186 48694 46165 63593 61696 55456 58316 57477 55498 50815 50872 43355 36019 23963 22469 35557 51271
5171 51271 62208 60303 62955 55030 41594 30080 17877 29693 34646 33024 33941 40732 38299 52107
5157 52107 65407 60992 42763 45186 51573 58715 57361 68040 66927 71943 53986 41932 39541
5144 39541 40509 55474 63408 71582 82995 82624 69931 62900 64194 52522 50171 50299 50942 56658 67103
5129 67103 65004 67431 76002 83551 70253 51049 46681 40297 21183 46782 59619 49212 57511
5116 57511 59023 60794 58215 52892 52653 43021 50134 50239 50114 68919 71771 67013 71320 62969 62498
5101 62498 65594 67351 68665 48200 50518 66132 57839 59538 77810 75331 55687 45161 43016
5088 43016 51170 45566 41350 37890 40273 50100 46088 46324 57768 69175 52970 39049 53733 56472
5074 56472 46979 46280 55068 60204 50095 48895 39045 38331 57756 74053 81018 64653 47779 44906
5060 44906 39402 50297 51604 33231 35863 42160 41432 30587 22559 29974 37846 43386 47043 55409
5046 55409 54136 51218 56496 61890 65025 63202 53015 46525 36742 26528 33836 39780 42323 47113
5032 47113 55786 79290 66072 38801 37155 33221 44737 50259 59303 62125 57726 51158 46814 59585
5018 59585 67977 69078 77930 66367 52204 46432 35244 26582 27616 26674 11394 1129 3995 13286
5004 13286 24183 10657 11389 28467 38742 43620 49183 39351 41061 46045 51530 62822 63978 69104
4990 69104 71684 66946 54165 49766 59930 56395 53600 60714 60771 49523 63676 77258 79723 79264
4976 79264 84661 89356 89198 89776 68293 42373 37949 40713 39076 46207 57492 66946 79293 83581
4962 83581 64157 48789 28051 15381 16823 22060 27042 23357 27689 44808 46842 34902 32957
4949 32957 35027 33772 26859 24569 24847 39943 55746 52487 47774 57111 60322 47118 62699 58228
4935 58228 52672 48828 43360 36168 28041 26095 24791 34158 34758 38263 43087 37029 26887 21218 33477
4920 33477 42756 32676 22865 29486 47914 39785 29166 37800 36992 35174 34371 45332 38737 39289
4906 39289 40187 54024 67499 79790 71979 55454 38168 29329 26895 26047 38804 54382 47523
4893 47523 38133 37007 40453 38680 34922 33414 18724 30096 47227 58199 66569 60041 53976 47055
4879 47055 48964 63473 67071 64233 67117 73321 66400 46971 48058 61740 41406 24463 39138
4866 39138 51551 39319 25424 26027 32114 31715 10909 19327 32195 33951 23065 13685 11841 4482
4852 4482 -603 20556 15228 2628 14059 23810 5186 -1220 11948 12615 54 6102 28194
4839 28194 35209 40734 46840 48490 44882 34884 30347 19365 20504 19512 28464 27994 23678 21172 21043
4824 21043 25049 34135 43693 50635 53321 38238 17919 17327 12545 4338 4095 -2024 10820 17793
4810 17793 34651 42027 34708 28176 29369 33618 26990 20169 37220 53769 56291 40698 36092 39809
4796 39809 32370 26232 35598 34977 21355 14506 24776 39079 57804 54781 43897 31350 26855
4783 26855 42752 48881 32203 40103 25309 19240 23805 32268 47329 50244 32564 13624 -10591
4770 -10591 11140 21914 39040 42946 15275 18995 18943 18650 27521 31464 32012 19178 9011 7146
4756 7146 9703 26916 54304 59959 50872 45927 52040 51924 41739 65547 70697 66700 48505 29657
4742 29657 35503 43127 41739 46262 31020 35251 39692 43896 50743 50481 31463 25592 36829 40366
4728 40366 40480 31115 25327 11506 7847 10175 113 -498 2406 15695 38768 48381 61730 55303
4714 55303 34808 28834 27355 27773 30763 35105 18761 7426 11416 9317 16900 33728 28976 41219
4700 41219 46817 34860 29237 26157 26833 21420 9164 15669 21459 22253 18951 32687 51997 59705
4686 59705 59633 51436 42730 33620 45875 39466 24726 26305 33080 39519 31782 15119 19051 16861
4672 16861 7917 -3740 -996 6329 26258 37912 38042 40585 51867 51944 41458 38320 43856 28709
4658 28709 34623 25141 21485 20755 29193 41353 38785 50354 63316 60378 37815 25602 35108 66233
4644 66233 64001 58893 45012 38688 28951 21093 18143 34840 44265 19179 -8621 -1997 19119
4631 19119 38981 51182 47197 44064 19874 12899 9278 9271 24779 32133 35153 46387 48140 63734
4617 63734 53814 42831 41033 37863 40999 34235 28760 32283 29790 24628 22765 16124 24215 17855
4603 17855 12688 18002 6241 13282 24953 51754 56873 32122 5622 994 6215 -5441 8178
4590 8178 26110 35861 26774 27762 27252 25755 25177 19863 14352 5413 924 9227 7265 17409 28075
4575 28075 34437 33545 41951 42288 53028 52128 38422 24194 14805 18805 33153 18181 2501 5657
4561 5657 17120 20171 7818 5279 19692 25549 33857 19008 18317 10914 -9748 -11551 16821 19484
4547 19484 10932 14368 15972 8168 18736 20684 16629 14021 26112 24260 8064 -3237 926 -5519
4533 -5519 -4714 632 7736 8830 19389 41088 48349 47826 42758 36678 33007 24240 21366 18640 12142
4518 12142 11754 18855 25456 21689 24463 41065 33418 30355 39605 40000 33421 28515 10167 5187 14649
4503 14649 29726 15324 -1448 14481 17348 26557 31972 21506 17043 26599 35613 46049 44056
4490 44056 25199 23132 39826 52591 41794 38777 44711 28021 12453 -1457 4483 4021 20427
4477 20427 45762 46586 20830 10057 13788 6378 -4348 -362 1896 5214 16789 18056 20576 22984
4463 22984 30598 17009 12401 -1126 -4914 -60 9723 18330 11983 13634 9041 4810 8337 10496
4449 10496 13683 19606 26411 32305 17223 20596 27153 39389 40232 22478 12952 1684 -22523 -38880
4435 -38880 -26318 -17829 -20095 -21043 -12717 -6206 10082 5985 -4097 -5043 -11315 -11914 -13483 -2727
4421 -2727 5005 6215 20388 25629 15751 12207 7863 7703 1158 9979 24969 22538 9297 14364
4407 14364 28927 9492 -8469 -1103 2170 6989 9394 5240 -4938 5766 34448 27539 9506
4394 9506 17850 26412 18784 16313 8087 3813 15130 39224 24044 1440 5200 14887 30838 22560
4380 22560 24694 22618 24941 35418 24086 24005 10351 1617 10928 350 6593 27089 35401 32112
4366 32112 17527 22908 26052 25005 32848 25060 7727 4212 8408 4521 8687 5681 2702 8667
4352 8667 10321 11096 15360 2071 -12440 -7743 -7938 -1802 18206 29137 26241 14666 10490 4994
4338 4994 -9839 8664 20307 15516 17569 5411 -10799 -16036 -11301 12683 41365 43496 38141
4325 38141 38763 29755 23512 21403 12607 19086 25817 29118 30658 30793 36781 36621 34913 32756 35051
4310 35051 37509 30240 32924 24223 24045 28021 41845 53311 58097 62901 48770 34966 20138 18472
4296 18472 12940 8096 11665 -3074 -2151 -921 3559 -14875 5820 29580 27600 12717 -5383
4283 -5383 -9491 -25423 -33999 -12702 15023 16557 7143 -3992 1584 -16191 -16765 -15580 -9768 -15155
4269 -15155 -8577 11975 29692 33429 29050 31488 39137 28382 21081 23240 4468 -7352 2308
4256 2308 -146 6538 11253 12323 9152 18550 22699 4250 -24147 -23363 -13786 1088 20008 31099
4242 31099 22923 20506 20247 19694 11885 1689 1587 17773 21444 20415 13831 17720 24024 40940 32256
4227 32256 13453 11338 12692 11567 4428 -13516 -14530 -18557 -30710 -8300 5834 3617 6568
4214 6568 8696 2496 -14171 -14247 -16386 -18209 -6651 2700 5402 734 -4074 266 4989 528 -9047
4199 -9047 -9256 -2120 -7692 2012 6169 -747 5768 4323 -20587 -21375 4560 14376 -3614 -10758 -11748
4184 -11748 4185 -7289 -19662 -2705 6007 5181 483 464 8872 9964 15260 17704 23463 17430
4170 17430 11750 14862 17576 15189 4129 9647 6956 22352 27946 23398 24424 2290 -2231 2603
4156 2603 11895 18136 18989 21692 16980 13993 4257 -7450 -8126 -21773 -12998 -4699 -21104 -39551
4142 -39551 -44642 -35994 -10973 -9332 -609 13301 -7000 -20162 -15343 -7048 -9577 -17727 -7797 -385
4128 -385 -1775 -6896 -20115 -11376 4645 9433 12795 15914 27309 19932 1656 3755 11486 3841
4114 3841 1319 -8753 -22554 -6827 -4671 -13144 -17041 -18877 -26845 -12452 1640 -7641 -19642
4101 -19642 -3064 13225 19726 9961 -2568 -10312 -3015 16596 15552 12895 11550 -6718 -20688
4088 -20688 8172 14293 13101 20237 21676 14975 7259 -5384 -12751 5710 10930 14162 -3968 -13921
4074 -13921 -15183 -12533 1156 803 18873 46437 35192 12985 20762 23245 5437 -6334 -16809
4061 -16809 -20553 -33997 -36409 -20096 -7307 -14131 -11211 -8381 9946 22337 35919 28983 12990
4048 12990 67 -21129 -8352 12020 10206 3131 -10875 -9166 -6739 1947 -16761 -26750 -12913
4035 -12913 -6038 8319 16122 2226 -11804 405 6147 6120 5009 9306 11174 11811 -7204 -26057
4021 -26057 -18526 -9501 -5092 -11291 -19293 -10215 3562 -7160 -17518 -13336 -11418 -771 -7938 -7525
4007 -7525 -8479 -15057 -10817 -26496 -29570 -17045 -21151 -18639 -21401 -18962 -17774 -15667 -11736 -8089 -16490
3992 -16490 -26201 -17811 -6650 543 -2859 -21113 -31182 -10894 6586 -3401 212 2332 -9733
3979 -9733 995 17094 15829 -3546 -6065 26194 34930 8242 -2885 -2153 3245 5379 -2933 -18674
3965 -18674 -21741 -31717 -28717 -11927 -104 480 190 -3465 9115 2794 6158 7939 -2026 1737
3951 1737 10621 9969 21478 22102 4590 -11437 -11852 -972 10605 17943 4286 -3034 -3422 -1643
3937 -1643 -6707 7432 10061 2711 1943 -6491 793 -6523 -1628 12596 13248 6109 12339 231 -5332
3922 -5332 -7464 6847 25752 34101 36245 37828 27068 11994 12146 3322 -1156 2201 3724 12614
3908 12614 -4517 -4941 11277 7656 2924 5268 4055 -700 -5080 7585 13464 -9906 -28081 -5790
3894 -5790 -16743 -34010 -24223 -11226 8295 9590 8251 4182 -5641 4055 28979 48380 49877
3881 49877 32746 10007 2551 -304 11012 13592 14259 1039 -11823 -20740 -31454 -36370 -18572
3868 -18572 -27358 -26661 -10678 -9254 -6332 -2205 -551 9935 16996 15974 20652 18316 10962 4117
3854 4117 -7573 -23795 -18403 -9924 -13403 -7436 -8047 -23835 -31759 -19720 -26836 -28962 -23811 -5983
3840 -5983 -19031 -29530 -31902 -30439 -25558 -19125 -12196 -18674 -17168 -4480 -4855 -9175 -22904 -25903
3826 -25903 -17254 -11435 9115 18041 19017 9855 4235 -1094 -11783 -798 -6149 -27400 -36385 -20347
3812 -20347 -15247 -11990 685 -4138 -1385 -5339 -23571 -38257 -29795 -11441 2909 17929 832
3799 832 17404 27321 32158 39513 21710 12450 2654 -12992 -12013 -3180 1951 9443 11137 -251
3785 -251 -13465 -15743 -27474 -21959 -15285 -17469 -23625 -27510 -29125 -13093 -6983 -14465 -4035 6521
3771 6521 14397 22478 22491 18554 5925 -2636 -17067 -19200 -14006 -8648 -13429 -27145 -27118 -36805 -23847
3756 -23847 -16805 -17068 1325 -5431 -17351 -15678 4426 20352 27563 29999 32676 19458 7164
3743 7164 -7774 -18110 -11538 -1268 3905 1001 -13615 -26749 -32262 -47473 -47208 -38530 -28220
3730 -28220 -38960 -28562 -13558 -2256 -11160 -9666 -2408 4424 12218 12486 16069 28894 42071
3717 42071 44812 46776 50310 30492 29907 24823 6573 1150 3280 -13435 -23019 -18955 -24837 -33524
3703 -33524 -12941 -6642 -13899 -12676 -4030 10798 -2680 -11600 -7376 -15030 -16004 -16093 -16965 -14448 -24583
3688 -24583 -18642 -28072 -11389 1674 -8689 -5115 7382 2420 -11890 -14172 -22832 -38066 -52237
3675 -52237 -41517 -38051 -45520 -39642 -27599 197 21277 12296 5789 -5731 -8593 -2878 4295
3662 4295 1644 3509 792 202 -3148 -5243 -2702 -4622 -6177 5866 -1831 515 5028 8011 18498
3647 18498 18947 15557 18032 8758 -4046 -7345 -7713 -5248 7959 4680 -2338 70 20430 20311 -12056
3632 -12056 -21186 -20583 -21309 -31329 -37465 -22732 -14275 187 997 -13472 7134 16775 -2145 -8416
3618 -8416 -9926 4399 13024 9834 6452 -12456 -9276 -6692 384 -6961 -423 -1209 -6968 2243 2812
3603 2812 -19675 -28339 -23703 -23929 -27194 -32589 -35433 -37711 -23260 -25637 -29953 -19462 -16039 -33190
3589 -33190 -51433 -39865 -28276 -28342 -38811 -40629 -46526 -41625 -27420 -18728 -22551 -24388 -26718 -30574
3575 -30574 -30265 -19495 -9627 -2854 10402 15589 14436 13832 15348 10789 2417 -2239 -12543 -8786
3561 -8786 -6244 6121 -2546 3448 20758 8204 -12591 -11082 -10931 3349 9474 1614 -9216 4003
3547 4003 9015 8262 18126 29674 12322 315 -7019 795 -3396 -7638 -19578 -34179 -37913 -34498
3533 -34498 -36851 -43097 -29614 -24402 -25189 -34845 -45458 -47552 -54036 -52028 -30776 -18441 -17517 -3539
3519 -3539 -2334 -18393 -29063 -34941 -28195 -10750 -12349 -14846 -22982 -8422 -3658 -17084 -27018 -40734
3505 -40734 -40253 -51170 -43893 -43552 -37539 -29834 -15741 -16981 -17568 -18080 -7382 -12616 -9639 -11903 -5294
3490 -5294 10932 16777 11897 10034 -8358 -14148 -14743 -19003 -22791 -22581 -6224 3391 -14094 -24149
3476 -24149 -21159 -11610 1044 821 -1102 3205 -5582 8319 18034 13185 11465 -1022 -5971 -10297
3462 -10297 559 2355 3110 2486 -15276 -21623 1632 14509 6041 -752 -13530 -19342 -18766 -3841
3448 -3841 693 -13871 -17610 -5727 -15420 -24261 -20177 -7832 -2657 -1110 -8020 -15559 -9810 -1589
3434 -1589 -24052 -56025 -63754 -56617 -44151 -19399 -13475 -14141 -12165 -21899 -26146 -31763 -49710 -41518
3420 -41518 -15260 -16489 -4307 -10746 -14616 -12809 1362 6963 6972 -7988 -22584 -14121 -14582 -12049
3406 -12049 -10666 -16143 -10874 5897 736 6471 5481 14749 17301 9020 13544 17999 14282 -6595
3392 -6595 -15599 -6116 7826 8629 -3133 -19391 -16308 4497 7855 -10109 -34301 -31624 -18357
3379 -18357 -4373 -874 -461 -5295 -10409 -5238 -7302 -15315 -19823 -12410 -277 -5829 -7919 -150
3365 -150 -5686 -13124 -15583 8264 14439 -3168 -8184 -5042 8332 -3138 -3009 15668 38485 30240
3351 30240 8270 -20141 -31081 -33138 -30082 -31528 -37295 -19870 -8777 -21595 -23781 -22824 -18145
3338 -18145 -20554 -5080 -2352 -7611 11793 6710 -5399 -24919 -30839 -31725 -28838 -26234 -32042 -8345
3324 -8345 4275 3577 -3248 -14494 -15221 -20000 -25044 -20132 -12125 -11121 -13579 -21294 -18705 -32817 -31820
3309 -31820 -26988 -33460 -33805 -20522 -822 -5181 -24473 -37175 -39972 -47026 -40114 -35379 -23630 -6916
3295 -6916 5544 13833 23786 37647 38802 20778 7783 11928 15810 7570 -10650 -22115 -16375
3282 -16375 -6060 -13305 -17945 -25695 -5958 -7856 -2556 5085 -2003 -2875 2432 -1344 -12956 -2813
3268 -2813 11936 16084 1176 3427 11057 9877 15073 22570 28815 24489 23798 6625 9937 15432
3254 15432 12329 15228 21997 11778 9312 729 -16671 -37150 -34351 -37313 -19896 6590 10336
3241 10336 8040 6327 23072 24111 9522 5462 11663 3474 866 -15518 -18507 -15236 -19613 -21704
3227 -21704 -12637 -28538 -45721 -58345 -74706 -68782 -61739 -52739 -45376 -38999 -33132 -19945 -14980
3214 -14980 -25768 -30878 -21460 -28983 -33526 -30276 -38623 -41835 -51634 -51919 -41399 -17877 -18388 -15318
3200 -15318 2753 -1579 -15311 -23336 -25316 -12653 -3305 13254 9936 -2905 -8460 -1249 -6867
3187 -6867 -11378 -27007 -23783 -18613 -29819 -34977 -51273 -55588 -52804 -30166 -27806 -21347 -24236 -25684
3173 -25684 -19685 -15544 -5110 -9859 -19705 -22632 -11148 -4325 14508 27973 23450 9580 10370 6894
3159 6894 -12162 -24336 -17383 -19629 -16452 -19624 -39761 -61017 -63232 -52151 -50900 -42152 -18374
3146 -18374 -26327 -24758 -8708 -4368 -5602 5612 12295 -6468 -17750 -18692 -21823 -50814 -44167 -22415
3132 -22415 -1785 -1932 -6372 -5018 -21645 -34180 -44220 -41990 -20078 -14383 -15822 -20385 -22492 -22065
3118 -22065 -35210 -33113 -50858 -57062 -39727 -25281 -25402 -31010 -24063 -21270 -37129 -37412 -22198 -6073
3104 -6073 12322 10050 6095 -13728 -30960 -28004 -24814 -24552 -17295 -12806 -26064 -14436 4351 5130
3090 5130 -2179 -8887 -20146 -18950 -19901 -35955 -32100 -29836 -35367 -33032 -9302 2123 760 -2968
3076 -2968 -6232 -1650 -6166 -4283 -11545 -16822 -31709 -27429 -1419 1033 -19358 -23190 -17200 -31323
3062 -31323 -35276 -27885 -5542 -907 -3259 5935 -2187 -12764 -21495 -35127 -30611 -35112 -40287 -26207
3048 -26207 -26932 -27841 -24781 -14920 -423 5000 -4872 -28273 -35743 -38739 -37996 -28011 -25048 -28019 -33263
3033 -33263 -32257 -19161 -12777 -8052 499 -6083 -10319 -9748 -10689 -10859 -10972 -11367 -25387 -30704 -40546
3018 -40546 -45910 -40539 -42664 -45572 -41905 -36723 -29399 -8186 -516 -5790 -449 -16163 -24163 -9483
3004 -9483 -14521 -17015 -16858 -31957 -37262 -20366 -7764 -7491 -8765 -6435 2501 -10252 -20116 -10022
2990 -10022 -8169 -20714 -28230 -10664 10060 13445 9448 -380 -18303 -29850 -25777 -15873 -9705
2977 -9705 -3856 -15636 -24755 -17441 -8392 -7109 -23082 -40486 -30371 -17245 -22119 -22929 -14705 -18711
2963 -18711 -25258 -51392 -53352 -38605 -34788 -23300 -8819 -19493 -7840 -9701 -8269 -22999 -10375
2950 -10375 -985 -21950 -34131 -38009 -35321 -23396 -12448 -12276 -15478 -21056 -24674 -9279 -10917 -22692
2936 -22692 -36931 -50215 -52288 -49304 -39456 -31340 -34511 -28512 -280 22785 20251 10550 -9006
2923 -9006 -20048 -26641 -20336 -14344 -16269 -27506 -25744 -31301 -35726 -25883 -26414 -21448 -10385 -10980 -20319
2908 -20319 -33541 -35149 -18414 -15554 -13083 -16597 -16403 -6732 -24096 -44627 -30464 -22877 -23043 -16926
2894 -16926 194 7580 625 -18729 -26126 -15728 1925 -4178 -6513 -3243 2393 -5456 -25703
2881 -25703 -29780 -26744 -35311 -43755 -47097 -47811 -35264 -27708 -30257 -40786 -32090 -16849 -27375 -36409
2867 -36409 -33460 -27860 -30776 -22320 -36311 -49317 -51713 -54622 -44436 -30967 -33446 -28462 -12280
2854 -12280 -13128 -17484 -30286 -41799 -25516 -8768 -4599 -13477 -16330 -9393 -14190 -19772 -38900 -40231
2840 -40231 -38468 -40520 -26841 -15293 5375 8644 -5714 -13004 -10092 -25706 -19343 -16930 -12855
2827 -12855 -8669 -5242 4147 13329 10038 14017 20727 27274 20870 16766 15649 13110 3539 -14770
2813 -14770 -18513 -8370 -251 -2358 -18246 -30447 -31777 -32739 -41526 -50034 -39037 -33188 -25577 -37644
2799 -37644 -37495 -40418 -34549 -17704 -17216 -11263 -11982 -14397 -20658 -24820 -24880 -25312 -23132 -9687 810
2784 810 5710 15369 7213 -16228 -32489 -19844 9347 30577 36355 44923 46244 41602 40148 20781
2770 20781 5524 16111 28538 26266 19744 11067 -11047 -24189 -13644 -9868 -17877 -18195 -18802 -23174
2756 -23174 -41360 -55601 -62531 -60807 -50631 -43464 -33578 -33441 -17881 -4586 -2343 -14323 -31451
2743 -31451 -23750 -8014 -6833 -14204 -4010 3087 -4817 -12076 -6449 7536 588 3529 -16756 -32464
2729 -32464 -24373 -4923 4999 3737 9424 4675 6757 -2047 -9782 -18211 -11841 3361 -2642 -14329
2715 -14329 2821 11124 -4238 -11263 -24424 -48438 -60223 -44115 -31037 -36139 -47613 -31996
2703 -31996 -28199 -41207 -51353 -39805 -15178 -4240 4607 5246 4830 6365 894 -13476 -6368 5331
2689 5331 -1416 -5774 -9141 -14581 -7782 -14569 -16431 -8638 2855 -7301 -12498 -6970 9175 10489
2675 10489 11427 -4613 -5344 -14783 -33344 -17243 -13115 -6745 -6994 -23384 -37669 -37097 -33878 -42624
2661 -42624 -42509 -36578 -44712 -50083 -41288 -29493 -33765 -26000 -13777 -15779 -23851 -21851 -15679 -9368
2647 -9368 -7845 -9986 -19923 -18461 -13913 -37849 -38422 -38899 -42506 -37315 -29343 -25109 -7550 3409 -4458
2632 -4458 -13615 -10156 -30378 -31088 -10298 3690 11176 8068 11213 -1363 -12890 -17931 -23335 -24767
2618 -24767 -16702 -3725 -13092 -11101 -15341 -27654 -31364 -11001 -8454 -14542 -18001 -30302 -29334 -13262
2604 -13262 -10025 -11725 -12626 -13622 -8407 -15661 -14815 -13314 -11830 -15051 -21922 -34622 -28748 -27293 -17192
2589 -17192 -3312 -6032 -6713 9596 11592 12027 12985 17508 13390 -385 -4563 -30270 -34144 -26465
2575 -26465 -25098 -26503 -43991 -36985 -23098 -21100 -13433 -3579 -18531 -14151 -4244 5758 11969 -1870
2561 -1870 -11201 -14902 -6663 -9377 -27359 -23875 -16417 -4350 7819 -9938 -6995 -11391 -8251 -17460
2547 -17460 -27068 -22482 -15881 1301 1742 6121 1540 -2866 -96 7147 -462 -18621 -18445 -23956 -10927
2532 -10927 -15192 -17918 -14845 -14511 -23895 -37009 -31197 -16051 -15102 -10117 -11203 -13104 -10468 -11509 -10442
2517 -10442 -9479 8008 9373 6250 -9109 -18385 -3166 11534 231 -12745 -24091 -36402 -47331
2504 -47331 -41373 -11938 -666 -9034 -12346 -18413 1607 -9526 -3436 6136 2624 -5243 -13592 -9881
2490 -9881 -14773 -5086 -16116 -26551 -22371 -12138 -6695 -5765 -18248 -12158 -6504 -18455 -14337 -28086
2476 -28086 -25062 -21475 -33374 -30326 -28366 -25495 -25293 -25444 -26633 -40788 -29079 -5226 -16687 -30812
2462 -30812 -24332 -24279 -21960 -24340 -11889 -17914 -21933 -19334 -13122 -2836 4439 -3820 -8193 -14136 -14796
2447 -14796 -19281 -21083 -33390 -27862 82 4041 -10047 -20687 -14883 -20165 -12325 -11726 -5363 -16623
2433 -16623 -13165 -11380 -3401 -951 -14567 -19459 -18143 -11591 799 -4216 1930 -8866 -24111 -20572
2419 -20572 -11846 -8586 -9898 -27707 -27014 -19112 -22556 -10024 7270 9512 16034 17266 -1937 -12620
2405 -12620 -2231 1156 -4933 -11257 -6237 -405 790 -6523 1155 -895 -1570 1027 8543 9699 5543
2390 5543 -1076 13013 8778 1034 2828 -3459 -10906 -7527 -13650 -13407 -8266 3960 5729 1952 -10587
2375 -10587 -9225 -5991 -4059 5377 10043 -3971 -3966 -1414 -7779 -7688 -14542 -10739 -13561 -27026 -37319
2360 -37319 -53094 -49313 -31255 -14065 -6675 -14181 -20983 -24018 -17413 -16496 -17265 -12829 -24637 -28184
2346 -28184 -28564 -31823 -30217 -22247 -8883 -11183 -18079 -18996 -17798 -13272 -19428 -23267 2661 -973 -1766
2331 -1766 -16908 -34790 -34716 -13696 -13990 -23053 -26635 -22231 -13732 -16759 -11536 -6594 -3525 -7361 -9540
2316 -9540 -9936 -8757 6171 5591 -40 -22955 -23962 -26930 -31112 -29634 -25659 -2671 -14550 -18193
2302 -18193 -20979 -23711 -19752 -23485 -38188 -31108 -27526 -28485 -29887 -45837 -53918 -41047 -23217 -12720
2288 -12720 -10959 -2051 13846 9848 -1219 -1486 10149 27672 25898 9619 -365 9629 13373 11267
2274 11267 8403 18743 25431 23098 20054 7872 -6659 -20289 -21121 -12447 -19469 -18924 -12932 -7185
2260 -7185 3564 -8928 -26430 -34786 -35509 -36770 -28850 -21718 -14107 -19113 -21362 -16866 -12965 -19807
2246 -19807 -5055 6746 8355 14597 23104 13243 2952 -772 -2675 5413 19587 15341 24213 44159
2232 44159 55060 39663 35039 31161 14041 -4450 -16331 -791 -14141 -15149 -14792 -22215 -5830
2219 -5830 7357 8057 -12851 -20664 -5084 -3480 -18419 -27244 -29066 -29289 -20779 -19825 -257 16059
2205 16059 11314 -363 -3419 867 9926 -5303 -7845 -6332 -6757 -12110 -23746 -36927 -40496 -21273
2191 -21273 -3711 -1136 8801 18226 22262 17854 18352 9291 11201 19870 6908 -17484 -18409 -27452
2177 -27452 -32784 -31298 -24979 -23431 -31816 -34009 -32077 -22653 -10674 -22604 -40705 -42801 -48453 -48917
2163 -48917 -25064 -11110 -18647 -23167 -21046 -23863 -15511 -6519 -4377 -919 -18283 -18006 9871 15704
2149 15704 11143 18035 214 -6078 1318 -1545 -13501 -9479 -3931 327 -18377 -34056 -36562 -27914
2135 -27914 -21612 -30149 -36441 -27849 -16651 -1131 5545 -2090 -12978 -2492 -1293 -14384 -7913
2122 -7913 -2983 -11068 -27255 -38820 -31553 -13773 -9719 -21421 -24282 -25891 -30997 -26613 -29781 -38921
2108 -38921 -35454 -33481 -28204 -22623 -11776 -16099 -24027 -27611 -9142 14117 20711 18964 8945 4397
2094 4397 -9512 -14576 -15178 -26843 -39694 -49060 -54307 -51392 -24096 -10216 -13792 -10566 -18601 -14060
2080 -14060 -7633 4483 7684 4241 11697 -2426 -4892 -7928 -22153 -32305 -24589 -27594 -34464 -29464
2066 -29464 -20814 -17844 -32974 -24732 -17349 -22935 -27036 -3257 6351 5089 9166 -5982 -14329 -5522
2052 -5522 -16352 -9895 -12585 -26247 -46758 -38470 -23438 -6328 -14367 -9479 -8075 -19604 -15641
2039 -15641 -2529 -17187 1912 -6031 -1098 5276 5941 -9274 -14079 -16305 -2035 -4770 -13505 -11870
2025 -11870 -11396 -3261 -18422 -15706 7362 8650 2727 -11895 -35651 -40294 -33159 -17702 -8842 -14413
2011 -14413 -14474 -6940 -18030 -20056 -19554 -38834 -41007 -37555 -26623 -32083 -30385 -39516 -39528 -25347 -22337
1996 -22337 -21100 -17934 -9131 -6282 -2492 165 -15212 -29680 -38650 -37265 -31144 -31489 -33529 -19468
1982 -19468 -29213 -39410 -41195 -39592 -35865 -36774 -27477 -18342 5768 22130 16117 3084 3269 -6019
1968 -6019 -24055 -17609 -14190 -26087 -38928 -38712 -37543 -23574 -6951 5870 5882 7058 1081 -12616
1954 -12616 -30316 -34920 -18232 -1340 2662 -1899 -1168 -70 4326 -5562 -3643 -9073 -14214 -17975
1940 -17975 -1324 444 -590 11696 5846 -11057 -1201 -2698 -12737 -19479 -18628 4380 23311
1927 23311 29416 8677 -608 5768 -15637 -23244 -17147 -11728 -4254 5093 6281 17502 8936 -5850
1913 -5850 -6325 -16588 -17232 -21771 -4468 8368 3383 -4215 -19074 -47540 -59000 -44833 -16057
1900 -16057 -4274 1432 -8187 528 -4431 -1588 -6696 -6843 -13923 -22098 -11942 -2452 -1007 -8634
1886 -8634 -18081 -10771 -5537 -15206 -4397 -8013 -7950 -1827 9642 17633 23091 4650 -7984 -15075
1872 -15075 -16910 -1592 6386 9546 15710 11979 -11617 -17185 -7732 -25253 -34889 -15184 -4442
1859 -4442 -16300 -7565 -11644 -20924 -7918 -2675 9109 5649 -19208 -21576 -9908 4380 -2109
1846 -2109 -10571 -14867 -26954 -18217 -15704 -30472 -17880 -14034 -6866 -10910 -9582 -5722 -150 3131
1832 3131 2749 -14507 -29930 -42287 -39464 -24008 -17412 -21812 -18068 -9887 302 -15929 -30535
1819 -30535 -36994 -25685 -28043 -30044 -27057 -21244 -21753 -23411 -9549 8706 4498 5162 -13711 -8342
1805 -8342 -20087 -29962 -41096 -46282 -34720 -28887 -26241 -18928 -26978 -19924 -21793 -37128 -35907 -27404
1791 -27404 -28548 -37646 -44100 -36730 -28968 -35528 -48657 -32846 -32249 -32268 -16346 2323 4994 15611
1777 15611 36633 25947 7927 372 15686 7641 5740 17390 15635 19299 5633 3207 9430
1764 9430 5942 -9220 -29519 -24605 -26947 -24371 -22795 -26452 -16999 -16712 -17755 6654 7218 -7869
1750 -7869 -13268 -8591 4736 -419 14082 13886 1383 14920 22415 38862 34853 44720 42389 40111
1736 40111 40428 33186 22308 19176 16214 2292 -5624 -5913 -16925 -22797 -17602 -19578 -58725 -50888
1722 -50888 -34040 -13704 -1965 1875 -12007 -32515 -44673 -38997 -37838 -42903 -18112 -11995 -18766
1709 -18766 -6127 3213 10274 22678 30610 30434 17580 -159 -3381 -12036 -22056 -38336 -39350
1696 -39350 -33095 -22788 -15615 -12756 -15481 -18593 -24042 -42992 -61187 -62727 -39780 -30202 -33837 -29833
1682 -29833 -17913 -3620 -14546 -32599 -18608 7439 12447 -7112 2558 -154 -6191 2639 921
1669 921 2933 -7800 -18868 -3116 6171 9642 16364 17747 -1508 -26721 -31489 -19162 -14023 -10925
1655 -10925 4830 5362 -4277 248 -593 -4321 3565 14658 17288 -8356 -25952 -23781 -27056 -974
1641 -974 11691 13259 10324 6839 4349 3519 6984 -6263 -13215 -4417 6391 14462 18843 14779 792
1626 792 -20795 -34823 -33619 -41905 -24501 -5319 -14773 -22394 -33997 -39279 -22089 -7925 -15712
1613 -15712 -16579 4289 15384 10906 3695 10854 -3603 -34670 -31687 -11869 -1221 1992 5280
1600 5280 4155 -1864 -15954 -15684 -20414 -16852 -5564 -1119 -14461 -16368 -27080 -20246 -4796 12147
1586 12147 21148 25277 12211 -14073 -22198 -16218 -33458 -42396 -32107 -20507 -11872 -20119 -17537
1573 -17537 -10401 -6585 -7559 -23026 -34572 -25014 -9166 -13227 -27506 -25905 -11475 -1046 6033
1560 6033 506 2055 -10709 -11922 14701 23550 15597 16667 10814 -18221 -26252 -9847 -14163 -7041
1546 -7041 -4111 -2680 7824 11709 11485 -2237 -21374 -14212 -6954 -10159 -10525 -14911 -16442 -9600 -2527
1531 -2527 14019 10608 5784 6628 3101 14918 12431 7646 2415 -6867 204 -3912 -16995 6771
1517 6771 13118 12747 663 -3828 2320 12028 18312 5543 1064 -1509 8522 7870 -12344 -18732
1503 -18732 -26401 -7850 -6646 -18574 -12427 -11243 -16753 -32103 -23530 -8994 -10529 6065 5136 -3552
1489 -3552 -2577 -2184 -14251 -10413 -4923 -12973 -24610 -25583 -15551 -15640 -12028 -19937 -21956 5265 10787
1474 10787 8064 425 -2200 -731 -10602 -14375 -7743 6885 19371 10344 14531 810 -3974 -3172
1460 -3172 2571 6317 -6958 -875 7423 5263 -7495 -15228 -43 9521 -1927 -9012 -11174 -6516
1446 -6516 -5517 -615 7513 7251 179 -4389 -17012 -16688 -8070 -13914 -4723 15129 15785 1368 4460
1431 4460 -702 3418 3423 22297 18151 8673 -421 -445 3038 17627 14651 7084 7636 6264 -2512 -2951
1415 -2951 -1074 2521 10388 18742 24851 13320 -4551 -2350 -561 143 1682 8030 12966 21225 15594
1400 15594 9150 14350 18101 20071 21295 11215 17087 30390 43109 39678 20555 2836 -2028
1387 -2028 -3826 1433 21197 17816 407 2612 9904 8096 5945 13945 24020 19834 10437 -1655
1373 -1655 -313 11388 20943 20140 11761 3368 -13149 -10705 -22982 -31534 -17096 12136 21934 1616
1359 1616 -7505 -9251 -14156 -3673 5080 18701 4449 -4013 1796 -10548 -1426 23422 34668
1346 34668 32442 31524 15534 10133 20041 9441 -5264 4283 25298 23385 26014 18213 14246 16732
1332 16732 10741 -2684 -11385 -15893 -10182 -5024 -17561 -28743 -27163 -5186 24376 20757 15661
1319 15661 17854 17241 7193 -702 3996 5799 2431 4765 6476 16937 1240 -6274 -13478 -16169
1305 -16169 -11390 -12336 -6539 810 33274 29475 26277 24462 18390 13356 105 4083 18555 14589
1291 14589 10580 19665 22415 18108 21024 10563 8810 7119 4231 -14159 -7507 18603 16133 30107
1277 30107 35022 38192 37111 25861 28782 25107 11584 12559 16179 17427 19356 16362 12089 12538 8484
1262 8484 -3629 6597 22296 13448 1896 1986 1369 1670 -7333 -11361 -13699 -22219 -23281 -24215 -17697
1247 -17697 -7896 -11131 -17983 -26175 -35508 -19139 -14130 -19456 -35657 -26798 -7313 20163 34307
1234 34307 26477 24633 20048 17037 12330 12159 27199 21122 35264 23527 17632 17761 16538 15712 -2095
1219 -2095 8280 28406 41890 31742 16901 8253 -972 3360 13125 14056 32675 38642 41469 37671
1205 37671 26819 22597 925 5029 9258 567 -12206 -8611 -3976 12467 11144 -6095 -24410
1192 -24410 -13411 17286 37690 40409 31745 20538 17988 16103 14330 3597 -7031 -10249 15638
1179 15638 22058 27700 39761 39390 31212 21602 14218 10726 6042 16433 12866 242 -11625 -13224
1165 -13224 -1441 6026 -2949 -11261 -12512 2524 17984 8483 -5955 -12800 -9048 12379 23516
1152 23516 11016 9800 18034 12361 1780 900 -3722 13656 30345 25680 32518 32949 16887 3953
1138 3953 11874 15132 -979 -8044 12574 10279 -1436 6565 19771 11709 12801 16955 11633 24609
1124 24609 33561 28188 23553 23891 21573 11177 12460 39467 31316 27940 24767 9624 3283 2513
1110 2513 5564 10744 -6108 -26903 -22147 -20220 -23899 444 9733 15200 13374 18045 9792 4558
1096 4558 5936 15185 27630 34525 34170 24429 28089 17216 4780 13756 17565 33813 51665 57707
1082 57707 46689 27890 17803 23689 32027 21036 31030 33997 32044 26199 29891 20651 9655
1069 9655 2888 22504 34720 26238 10559 2985 6901 7017 2543 -770 -2812 17320 3025 -4601
1055 -4601 1728 -8244 -16383 -2250 5000 18712 31259 25778 11162 -3925 -3639 -6410 -6115 8372
1041 8372 15388 14657 23966 33962 27500 26524 40028 43306 33172 31695 18665 4380 5027 12663 32343
1026 32343 54930 53855 36234 22456 4143 -22 15326 14378 16153 23303 17637 3480 2985 7841
1012 7841 -1857 -2801 5507 852 2881 9552 15012 13601 4924 3232 11507 27934 28513 21004 5760
997 5760 3497 4505 4012 7330 19159 27566 26516 30690 22223 13217 6737 6566 10080 13518 14879
982 14879 28127 20721 25304 30942 32096 38160 42288 28466 11424 14493 21293 12563 18361 18380 15964
967 15964 15216 24675 19784 14119 19552 34583 37123 54145 32836 22598 33916 45204 47071 48900
953 48900 49729 46578 30307 4343 13894 29643 36639 29344 19742 25770 18902 29709 28295 19913
939 19913 18097 17817 26393 34107 34037 36249 31516 21721 18666 12652 -1531 1969 10155 11955 18181
924 18181 23091 1728 -2315 8231 19321 23678 13929 6700 31391 38721 33043 15521 -2650
911 -2650 -15317 -15677 1300 630 13031 26938 35837 33735 15751 9392 4599 18051 12552 16665
897 16665 23062 19354 26717 26788 24793 18487 11064 13495 14793 25902 9979 18887 30914 23552 18002
882 18002 9009 7697 29039 42174 62514 67594 54585 51875 46450 21511 8865 720 -427
869 -427 -2785 756 19487 31292 40775 35736 34258 14314 -4344 12003 11247 -14077 -18870 -11947
855 -11947 2341 11107 13262 20288 24164 27166 41105 25949 32319 39818 23344 12926 25217
842 25217 27065 20818 36979 35824 17821 20000 31797 39918 44332 41412 37351 18712 4210 16829
828 16829 37710 35268 37299 46815 46016 52613 37832 31963 34746 34638 43447 40865 45881 51869 49047
813 49047 41219 32145 30549 34489 43888 27462 34823 39691 31447 34684 31617 37225 26816 27796 33473
798 33473 25979 36440 34351 28653 25465 28238 24782 28307 31070 25467 21804 23593 22921 17517 20065
783 20065 24296 34369 27044 28595 37346 22525 10588 3781 10866 37005 37346 33390 33798 44537
769 44537 55893 45266 36065 46243 43350 31882 30381 38822 40691 32183 28980 35953 40275 27020
755 27020 15390 16617 31033 33677 29400 31900 33917 48433 53965 46985 39434 40875 31821 40651
741 40651 55096 54452 34377 41888 39135 21229 15769 22023 18452 16470 23003 38564 46149 50290
727 50290 47258 42778 46999 48061 28000 16862 27271 29911 28091 16810 25218 40188 45767 43907
713 43907 42572 35077 32637 21969 2254 -47 27442 40826 40660 38808 31953 25223 14024 21398
699 21398 25747 35825 30357 31411 41996 59531 46206 44612 38744 48711 64263 59479 45940
686 45940 43054 25813 29094 44729 39761 44408 54394 47657 38376 42767 44989 36096 27646 14587
672 14587 27620 24655 23603 33885 26649 41961 48035 37378 21219 23911 26270 14836 9186
659 9186 15070 27383 32096 45379 48329 24527 27532 37696 50487 55174 43154 32796 35365
646 35365 57588 58755 33381 26108 37343 28909 25476 26251 36935 34156 37574 35649 58178 46960
632 46960 29072 22186 39767 38719 25945 33756 33816 34122 34470 35532 33314 28442 36126 41034 42709
617 42709 49969 44824 37226 31180 38590 37512 39793 63881 65489 69666 55569 52541 56783 56329 36882
602 36882 38655 42351 46504 50781 50724 47572 53357 62495 66444 59801 56016 33529 40813 48134 27006
587 27006 26203 40557 55534 53445 43535 47035 57490 62748 59992 62652 53380 30496 19222 27122
573 27122 23804 27014 17701 11498 24091 44050 47139 42794 51310 48854 49336 43025 33953 35549 36722
558 36722 49666 42500 25056 35156 48283 48412 43139 49763 43190 29730 23087 30655 41157 47123
544 47123 52701 44283 39045 35945 28977 19896 28278 22125 21021 20293 21207 21347 20728 35525 51942
529 51942 50576 52076 54193 60630 56472 44212 30605 13133 13602 17689 12311 15409 38384 37490
515 37490 33753 45538 45686 34544 37117 26724 23643 29742 55870 63608 53058 52209 59175 49933
501 49933 37023 38435 33862 13376 8794 10351 26113 38694 35627 25709 29792 34186 47198 47408
487 47408 60145 66222 64428 62477 73533 68955 46560 42386 39736 46924 61804 58089 60220 69355
473 69355 74893 67670 47777 52333 53352 63885 58419 32446 40877 62156 67453 53633 35350
460 35350 34143 42972 44624 43819 38223 32335 34507 42019 37174 43847 53451 62234 64095 42401 21886
445 21886 19614 21553 24000 26542 37170 36753 39653 36471 30700 43033 38745 35218 35379 33458 40187
430 40187 43429 39483 22545 24403 28992 45778 41526 48471 56023 44312 42261 32895 23577 48403
416 48403 75148 84105 75217 53098 45928 38973 33524 18657 19183 22251 33158 27022 19072 28178
402 28178 50114 51952 44189 56675 52504 41351 30747 37801 47593 43236 43843 21572 20601 30673
388 30673 46415 54930 55006 58346 59539 60213 65120 53641 39532 26322 39291 57853 56461 53149
374 53149 50516 47241 46495 39967 38545 50270 55955 62547 84583 110689 113587 88531 69787 52570
360 52570 49903 59720 70077 58985 54988 57774 42664 39756 47836 51512 63281 64091 49747 52164
346 52164 51630 45500 44520 45476 46572 41117 44633 51682 68821 73600 80609 75567 53964 45836 60222
331 60222 62983 53407 36625 25290 26053 31857 40941 49547 36079 18662 11011 15844 29106 50483
317 50483 63792 55383 44050 38361 43102 44227 39943 37467 45343 44660 43318 39375 32955 35560 54515
302 54515 57460 59963 50163 36302 37719 50024 48676 53301 51064 43165 47311 56007 65027 55542
288 55542 48003 34935 39898 47344 52967 52947 44663 45818 52404 47613 42558 45534 48861 46358 42745
273 42745 48549 56473 54113 47264 36545 42195 45918 49147 47981 47052 45212 53820 43357 45475 50403
258 50403 49779 52473 49419 47492 53283 57543 41422 23679 39477 55329 67239 64482 52105 45830
244 45830 44916 45262 45892 42551 44309 36429 32436 41689 47332 40207 28653 24313 39022 49285 59691
229 59691 62838 68740 69398 59551 59009 56305 56196 55562 53312 46597 52490 52745 56772 58067 61074 53347
213 53347 50858 59032 49262 51862 56006 58952 54326 32373 25457 29112 44596 39343 36620 26807
199 26807 31014 52806 68858 63751 65647 69852 67974 77871 85720 83817 77638 73808 66136 68867
185 68867 60264 40048 41033 51610 38801 32025 44701 55266 45146 31001 19508 25516 41818
172 41818 51782 59428 65496 50314 52790 57547 60214 59966 63903 72435 78428 78506 68405 62157 58299
157 58299 64895 72181 76938 77779 83331 72623 58076 57434 59138 52107 50875 42659 49075 52602 60585
142 60585 61235 55226 48873 41839 41649 50470 61005 72369 62173 43101 45957 48637 42417 42486 54267
127 54267 59257 54273 52294 49623 42671 46979 53141 47093 41082 34154 39507 41572 49742 51347 23239
112 23239 26521 40803 41448 34264 36958 35426 34283 36969 41452 51900 61847 56611 53226 55794 48811
97 48811 49791 57971 61059 63310 69116 60087 53462 61841 66945 55441 44014 49561 60457 53677 49300
82 49300 54092 54355 50938 51071 61479 64962 61196 60909 64470 53574 44033 47491 49170 50131 52137 61351
66 61351 69612 72033 70472 66833 64109 60889 72675 85272 61855 53200 57326 62244 68896 65908
52 65908 59230 49773 44977 34242 42369 51192 63458 57171 52962 46897 57030 75836 72007 65004
38 65004 68844 63540 55895 44734 47319 59287 72865 74666 80772 83847 71943 58615 54144 59579
24 59579 52009 47956 48598 48826 47289 48519 56398 60949 55977 52723 59788 62680 54086 54550 62942 68178
8 68178 53452 44521 43531 37911 53473 56796 51245 57982
0 57982
$$ Imaginary data points
##PAGE= N=2
##DATA TABLE= (X++(I..I)), XYDATA
32767 17517 31414 41098 54415 54595 54816 54042 51914 56958 54108 67220 78629 90074 72913 70015
32753 70015 69698 76719 90050 97968 112725 116943 122123 117793 118527 121682 111694 110965 115858 123750 126516
32738 126516 131791 144373 158006 155882 156777 170334 176100 173533 169675 167081 159794 157405 154420 160823
32724 160823 173062 180218 187888 207162 205747 195718 193141 193425 204239 218193 228537 223337 229090
32711 229090 236066 240502 232450 232008 233895 236447 232020 224466 231179 242016 249334 258264 263085 268138
32697 268138 267499 269310 269666 267697 270693 275182 278564 292372 305708 318663 318033 306284 303968 303895
32683 303895 315933 328247 330960 324415 328921 332988 332119 311411 314370 326178 335170 341927 354485
32670 354485 352386 354934 361323 361637 354348 346705 353643 366087 368065 366199 357794 365798 375482 373765
32656 373765 374062 392503 390391 387480 384441 397889 398867 394600 414401 410823 394749 399114 411547
32643 411547 422218 426246 426861 425157 430737 434337 440710 435851 442992 454588 461015 468761 469796 463031
32629 463031 465358 476425 482767 492683 492399 496986 503286 506335 513439 523513 519436 514392 507912 520457
32615 520457 519566 522010 526494 519924 511914 514336 523531 530262 517363 512605 532518 552449 561987 557675
32601 557675 544266 540767 549813 546862 542714 552757 562335 570944 575867 572083 567881 576530 595801
32588 595801 606798 606008 597411 590328 596098 625558 627577 617635 623967 628039 622006 620484 622366 621916
32574 621916 616484 629148 650809 654098 648812 647357 663895 669139 661252 653346 656762 647095 658342
32561 658342 661266 668850 677857 668463 664797 661501 662012 673700 678472 679056 687013 691416 684372 686410
32547 686410 689288 687989 697675 696971 699109 706696 703405 705238 696211 706830 718482 715973 714232 715631
32533 715631 716751 719262 734090 742773 736850 729169 734490 738557 736284 732166 741460 747259 747319 741067
32519 741067 748812 756636 759532 778085 785981 783388 772791 770815 780008 790819 796236 788304 763607
32506 763607 770970 790517 798488 787952 784104 787713 798676 807643 813943 822124 817878 810006 807843
32493 807843 796305 800688 802363 812627 820279 818867 817381 827193 829864 837928 840408 833271 830399 823758
32479 823758 820130 832475 827456 820612 824714 829474 842198 840590 823037 827878 843901 849609 857799
32466 857799 859535 847747 842824 856309 873650 880674 876291 871982 881938 874880 869804 871245 884696
32453 884696 885718 884345 887663 875499 868997 886692 877474 874997 875860 880051 873376 873466 881402 891460
32439 891460 891974 885816 900009 902319 885512 889941 912255 905612 902531 923713 925658 904772 896978
32426 896978 913005 923035 915647 922282 927192 923460 910838 918325 929673 922662 923090 924611 927350
32413 927350 930119 933700 928816 919772 922932 934874 942314 937841 939840 941872 929765 926459 928772 922934
32399 922934 952552 968956 985371 985099 975280 984981 978614 955108 949061 957405 977398 991350 991476
32386 991476 970015 947284 958026 966566 969237 974683 979503 980282 981524 985370 977225 973584 977689 979654
32372 979654 977721 974780 981033 997775 1008588 1020228 1015554 1001520 996215 994321 1003337 1002167 1010564
32359 1010564 1008422 1008274 1002842 1004959 998054 990640 992665 1000911 994741 982850 994447 1008661 1015051
32346 1015051 1015799 1012543 1017338 1023728 1035520 1045365 1033104 1022270 1026488 1024318 1020100 1019153 1017711 1013078
32332 1013078 1021997 1017530 1018820 1022490 1024651 1028699 1010665 1011659 1019938 1011776 1017601 1011327 1019396 1036567
32318 1036567 1029833 1022372 1002953 1013391 1039701 1039128 1036153 1038791 1027536 1022790 1038539 1038361 1028647
32305 1028647 1026188 1049562 1035183 1027739 1032470 1045714 1056364 1035520 1042708 1048805 1043312 1037823 1028053
32292 1028053 1029730 1031365 1039723 1037002 1040039 1040334 1030024 1025030 1026147 1053290 1069066 1050911 1052852
32279 1052852 1069471 1076622 1088894 1082626 1062765 1060455 1074634 1086837 1073948 1056356 1061118 1068652
32267 1068652 1079982 1079740 1070357 1066049 1075032 1076017 1072368 1056780 1060797 1059261 1053479 1051508 1064476 1072440
32253 1072440 1084558 1086301 1071406 1073881 1065794 1065617 1074283 1086659 1063497 1054859 1061627 1066291 1065840
32240 1065840 1063909 1067296 1066273 1061996 1066026 1074419 1073684 1088775 1094694 1087073 1082399 1072410 1070514 1061976
32226 1061976 1059076 1070854 1074415 1065392 1068548 1076922 1085923 1074203 1072964 1078080 1080118 1076166 1075057
32213 1075057 1062308 1061588 1078051 1092345 1100999 1093119 1084705 1104085 1115250 1102096 1090934 1078127
32201 1078127 1073674 1084495 1092261 1102983 1112096 1115155 1106734 1107592 1109825 1109746 1120011 1118180 1101841 1107868
32187 1107868 1116860 1105604 1103287 1106890 1104715 1100096 1093006 1090608 1091624 1082147 1092461 1112896 1120132
32174 1120132 1123935 1110393 1112742 1105842 1092970 1095550 1100710 1109355 1116541 1127688 1130137 1128145 1116172
32161 1116172 1106541 1106264 1098556 1085238 1084148 1104065 1113679 1110423 1106025 1104520 1092247 1093718 1120738
32148 1120738 1119513 1115710 1122862 1114635 1110347 1110282 1101657 1086215 1081180 1081150 1083158 1083566 1073930 1056627 1070506
32133 1070506 1074335 1077132 1073770 1085684 1091330 1086323 1098054 1109940 1108536 1095226 1109829 1124401
32121 1124401 1127590 1119897 1106918 1110335 1110922 1116851 1104453 1092427 1075303 1070954 1083091 1106127 1092025
32108 1092025 1102789 1108810 1108841 1115133 1094776 1096061 1103068 1099737 1099725 1097450 1102870 1101013 1098287 1094328
32094 1094328 1101118 1109354 1097736 1094367 1089179 1111518 1114877 1109125 1113347 1113882 1111864 1105335 1093295
32081 1093295 1098700 1113990 1129947 1133281 1134141 1132703 1138256 1128478 1131331 1134020 1137455 1133598 1117347
32068 1117347 1104372 1110930 1114044 1101009 1095063 1089252 1082628 1088027 1094676 1092665 1097778 1102806 1113172
32055 1113172 1117668 1127989 1136781 1121892 1105406 1107135 1108669 1109870 1103778 1110590 1105486 1103696 1104249
32042 1104249 1115630 1116946 1120582 1127601 1116391 1093824 1099813 1107651 1119098 1106863 1115475 1129970
32030 1129970 1130030 1130116 1117558 1109012 1127121 1137826 1129532 1118432 1111387 1113368 1114170 1114407 1118655 1124691
32016 1124691 1129620 1125984 1120388 1121656 1121699 1119253 1122982 1124573 1115739 1113812 1116295 1110321 1106177 1086943
32002 1086943 1094155 1114738 1119088 1119210 1131237 1137267 1121531 1119882 1116436 1102483 1111422 1112583 1127902
31989 1127902 1132628 1137196 1130764 1107534 1103585 1107049 1104886 1117743 1129611 1127267 1119857 1118552 1107728
31976 1107728 1091658 1087800 1101094 1099938 1097997 1112332 1121025 1110622 1099637 1096459 1095737 1119890 1135753
31963 1135753 1136295 1124905 1099773 1095185 1110695 1110153 1118426 1126765 1118996 1127333 1128532 1121234 1130195 1141080
31949 1141080 1134356 1135261 1124768 1116641 1113315 1117539 1131245 1139611 1118222 1102532 1118251 1128179 1135074
31936 1135074 1142565 1150252 1132099 1119369 1120239 1120338 1109310 1109163 1122967 1119964 1103856 1119460 1126219
31923 1126219 1123304 1129143 1118124 1121468 1123655 1117789 1132867 1149242 1148658 1131590 1121123 1137410 1141668
31910 1141668 1131047 1117934 1107945 1095577 1079482 1086355 1108847 1125770 1128024 1130440 1125946 1125122 1129168
31897 1129168 1130566 1134167 1135289 1118735 1107741 1096520 1093871 1100354 1101977 1102782 1126502 1120154 1120757
31884 1120757 1116155 1109396 1103126 1107221 1093017 1110158 1116600 1107916 1114830 1114516 1109123 1096974 1093561
31871 1093561 1099340 1098499 1113683 1115361 1115593 1106144 1098558 1120337 1136581 1123886 1114673 1098176 1120321
31858 1120321 1125905 1113327 1103372 1108791 1122708 1120555 1120976 1126627 1127783 1137251 1137906 1123692 1123676 1139297
31844 1139297 1130813 1118861 1130504 1139635 1134428 1137106 1123822 1116258 1104732 1128054 1135370 1137516 1127846
31831 1127846 1113529 1117108 1110452 1105168 1102077 1101408 1112902 1109637 1109993 1113479 1119683 1125015 1121473 1131405
31817 1131405 1139843 1136516 1132703 1136312 1129488 1124282 1118332 1116885 1126649 1133624 1134668 1133498 1131826 1146043
31803 1146043 1164325 1163772 1157277 1137844 1140496 1155740 1147581 1137786 1138814 1130071 1120084 1119112 1138975
31790 1138975 1129480 1115376 1105417 1084991 1107598 1139613 1159749 1135262 1126186 1120386 1121187 1113733 1102683
31777 1102683 1090867 1095831 1115088 1121767 1129990 1137093 1141912 1138718 1132979 1138575 1152285 1169314 1179876
31764 1179876 1172935 1150078 1134941 1125327 1127573 1133784 1129401 1134220 1124572 1119812 1146541 1130061 1118176
31751 1118176 1116808 1114750 1108248 1100832 1098705 1119663 1132478 1128812 1128155 1132202 1127781 1133310 1134998 1140189
31737 1140189 1140377 1133306 1123560 1111950 1114302 1106992 1118426 1116366 1099621 1096009 1112888 1120358 1135333
31724 1135333 1138082 1133515 1137805 1124028 1100059 1095980 1103316 1112478 1106386 1109941 1121233 1133338 1132192
31711 1132192 1134279 1132209 1135417 1152659 1158664 1139870 1134111 1122421 1121817 1117391 1128799 1138003 1142693
31698 1142693 1153303 1159792 1140225 1133660 1130493 1138259 1132329 1128542 1126356 1119515 1093474 1092722 1114900
31685 1114900 1128915 1132501 1137282 1131663 1144360 1151840 1143688 1118884 1102235 1100351 1125272 1124913 1112617
31672 1112617 1122359 1127498 1125282 1110967 1099557 1096859 1105424 1118147 1123364 1125418 1137229 1146001 1140866
31659 1140866 1122209 1130058 1115249 1104982 1121119 1129962 1117665 1113831 1130870 1152890 1164441 1154544
31647 1154544 1137203 1139723 1146759 1120576 1113553 1114908 1124861 1144091 1148239 1134208 1123101 1118080 1121938
31634 1121938 1112815 1113728 1114415 1115810 1125137 1138645 1127964 1121740 1127547 1134390 1120157 1125154 1126438 1125263
31620 1125263 1131078 1136485 1144996 1143180 1134986 1127372 1144801 1137625 1129011 1127360 1111136 1099731 1114943
31607 1114943 1136084 1135648 1116943 1118027 1131621 1153539 1163891 1149099 1141635 1134355 1129801 1128024 1129362
31594 1129362 1121450 1144442 1156394 1145764 1142668 1133082 1130415 1123166 1131936 1149459 1148897 1146203 1143177
31581 1143177 1141304 1134511 1130268 1129084 1131893 1130111 1128367 1130936 1125728 1127669 1132313 1135721 1141677 1141010
31567 1141010 1146478 1151813 1161785 1171845 1161846 1144829 1138182 1132021 1131583 1132425 1124874 1123732 1131524 1147626
31553 1147626 1140682 1138745 1154731 1158914 1155204 1152321 1148611 1138149 1140140 1139327 1151131 1158115 1161977
31540 1161977 1143214 1125919 1118237 1127597 1130367 1131755 1152095 1158199 1146971 1152761 1161213 1166926 1163002
31527 1163002 1153471 1126326 1109930 1115755 1124923 1137951 1130643 1116332 1128946 1132171 1136071 1137978 1137095
31514 1137095 1131549 1127190 1125501 1120126 1111801 1121388 1135612 1151113 1161101 1152371 1156449 1158924 1153729
31501 1153729 1142763 1137054 1145508 1148568 1146628 1148893 1147118 1146182 1145929 1144648 1142195 1155969 1158816 1146081
31487 1146081 1133288 1156824 1157696 1136210 1117226 1115600 1144521 1170400 1161975 1150781 1119759 1115043
31475 1115043 1122903 1118446 1129607 1146593 1157711 1149144 1148097 1140372 1135165 1133088 1143337 1152060 1157813
31462 1157813 1154720 1147539 1138591 1139884 1154220 1154894 1161496 1156095 1142225 1131904 1141321 1152418 1157452
31449 1157452 1156559 1161975 1147047 1137580 1132617 1139023 1142014 1135995 1131752 1116479 1112349 1125414 1128179
31436 1128179 1145218 1157472 1173029 1169070 1156413 1153032 1155084 1152715 1139638 1144518 1158714 1166052
31424 1166052 1163012 1163715 1154000 1135658 1144153 1148458 1140097 1151515 1148955 1132085 1144718 1157168 1144560
31411 1144560 1135244 1143584 1164199 1147584 1128223 1128043 1137329 1141269 1147552 1160299 1159129 1143452 1135540
31398 1135540 1142140 1154750 1148725 1158673 1159987 1156556 1142543 1142473 1174724 1178262 1162066 1145760 1140300
31385 1140300 1138516 1150286 1161249 1149491 1144013 1139748 1126582 1127472 1132602 1134610 1147217 1150102 1149599
31372 1149599 1141574 1138037 1118633 1127189 1134539 1133861 1135802 1134728 1136897 1130302 1135302 1133501 1130255 1134212
31358 1134212 1142743 1134671 1112607 1098020 1106145 1124213 1150011 1142299 1147927 1155747 1171079 1177995 1162121
31345 1162121 1145708 1137871 1151319 1164265 1171590 1156648 1149221 1155251 1153957 1135630 1136682 1144881 1133596
31332 1133596 1124171 1140571 1139986 1135979 1151892 1145579 1138631 1136510 1143222 1142060 1130449 1131734 1128202
31319 1128202 1140676 1150031 1155348 1165672 1168188 1156318 1135903 1134409 1138287 1151292 1164029 1162137
31307 1162137 1145314 1137140 1147986 1150692 1140463 1119082 1123476 1128415 1131674 1145246 1146201 1151792 1164389
31294 1164389 1163714 1147878 1157054 1153822 1155807 1159706 1157640 1164819 1164938 1173339 1164723 1150885 1150189 1151607
31280 1151607 1137601 1134066 1125500 1132619 1135987 1136302 1134964 1139573 1152855 1143843 1156947 1173680 1167607
31267 1167607 1144059 1154366 1149516 1131086 1130155 1137344 1152075 1154132 1156669 1151806 1167416 1162189 1142570
31254 1142570 1147025 1140141 1140819 1139968 1138393 1131982 1140245 1135420 1138982 1142538 1142137 1160872 1170885 1162456
31240 1162456 1148337 1154842 1139827 1141588 1153709 1145863 1136328 1140005 1137096 1130264 1137047 1153706 1147612
31227 1147612 1137866 1132070 1144132 1157297 1143839 1142322 1147971 1147340 1139398 1143506 1145759 1147775 1152725
31214 1152725 1145592 1145296 1153862 1176388 1190705 1188462 1177422 1158525 1151158 1172170 1168640 1145703 1134422
31201 1134422 1133383 1144859 1151686 1152027 1158881 1158535 1156720 1159158 1161289 1160732 1163421 1165691 1161322 1172088
31187 1172088 1171106 1167081 1165787 1164186 1155177 1147598 1148227 1157997 1166757 1169230 1181970 1178444 1162142 1166506
31173 1166506 1169168 1176011 1162164 1161203 1167711 1149226 1149000 1154951 1156571 1163777 1170797 1170685 1164207 1170445
31159 1170445 1159617 1154561 1162388 1168188 1155304 1151213 1143312 1150703 1145153 1126418 1131429 1138539 1154798
31146 1154798 1162849 1145243 1126750 1127961 1133093 1137874 1153982 1169629 1170256 1161069 1139477 1148694 1161701
31133 1161701 1163659 1159394 1168087 1146831 1130927 1138825 1149354 1145250 1137470 1146241 1163021 1166408 1150742
31120 1150742 1142041 1142279 1144753 1156830 1163389 1162377 1173080 1184280 1182011 1174697 1160584 1165238 1171599
31107 1171599 1172422 1179425 1186514 1189814 1182915 1163791 1167393 1171784 1172493 1175964 1179851 1175504 1175364 1164239
31093 1164239 1170393 1169813 1159698 1155132 1159163 1166253 1176844 1184879 1184712 1178217 1164082 1162576 1170461 1173818
31079 1173818 1152497 1147114 1159291 1166813 1158412 1156524 1173663 1165563 1162015 1164953 1158354 1158830 1161931
31066 1161931 1173329 1174719 1169472 1150372 1152140 1148388 1137323 1138961 1143941 1158647 1172450 1156563
31054 1156563 1144012 1148397 1138796 1132709 1132897 1154621 1162411 1158752 1148778 1148766 1161113 1167723 1152846 1150197
31040 1150197 1156969 1162606 1162024 1151766 1150447 1154288 1152162 1154352 1151394 1146594 1144378 1145151 1156470 1150187
31026 1150187 1162776 1157338 1153420 1154237 1143442 1140432 1149848 1149315 1146791 1141903 1144030 1150984 1164369 1169828
31012 1169828 1149875 1138848 1142949 1148474 1147926 1161215 1158865 1141118 1146684 1165128 1168043 1162852 1164533
30999 1164533 1164099 1150140 1149116 1173876 1190727 1197871 1185136 1163795 1166328 1174633 1180404 1178672 1177514
30986 1177514 1159256 1176355 1181798 1158456 1147069 1147874 1164409 1175289 1165144 1152985 1151867 1160035
30974 1160035 1170130 1169329 1156508 1146239 1160153 1171341 1162032 1163363 1168316 1181151 1167053 1150817
30962 1150817 1150902 1154889 1155241 1169165 1169613 1165132 1155618 1159749 1168517 1168188 1172716 1175927 1186616 1182437 1167379
30947 1167379 1161023 1177036 1159520 1151872 1162700 1186503 1191131 1180934 1163197 1159587 1164717 1172654
30935 1172654 1173701 1159743 1168079 1188995 1196817 1197802 1196427 1186960 1168556 1146504 1138621 1146254 1170162
30922 1170162 1202204 1209542 1191782 1188458 1177919 1178463 1192119 1188888 1182810 1181624 1171479 1173213 1176218
30909 1176218 1184377 1182352 1175244 1163791 1152978 1149021 1156887 1167082 1170229 1164802 1152696 1156618 1181869
30896 1181869 1198858 1190493 1189492 1191395 1182458 1174338 1173457 1174642 1183387 1173352 1167916 1163175 1179840
30883 1179840 1194752 1195373 1188662 1186423 1181677 1177379 1177959 1177886 1181773 1186875 1184840 1180286 1171643 1170360 1171369
30868 1171369 1169752 1158832 1161370 1164907 1179019 1164808 1175010 1202141 1203902 1187416 1180896 1180100 1176443
30855 1176443 1176518 1167412 1166176 1176810 1178688 1168271 1164901 1170407 1177968 1185830 1178816 1174274 1179560 1194995
30841 1194995 1200159 1206952 1194685 1186783 1183667 1176418 1168145 1169451 1175383 1171990 1185182 1189579 1176908
30828 1176908 1172533 1190160 1189030 1169182 1149985 1143679 1145723 1151572 1154427 1163947 1171812 1175627 1185288
30815 1185288 1188466 1171461 1177673 1196192 1184063 1184389 1168688 1174593 1176001 1166840 1180020 1195214 1190126
30802 1190126 1196603 1195742 1187169 1194400 1195935 1192712 1186111 1191682 1188387 1177123 1164548 1172611 1176657 1163223
30788 1163223 1165783 1178363 1183888 1193733 1201966 1210360 1192573 1173035 1170941 1167151 1169421 1157302 1161249
30775 1161249 1151412 1147066 1163916 1186777 1197190 1190496 1174968 1158930 1156051 1172275 1183102 1191692
30763 1191692 1181905 1167763 1175487 1164000 1150577 1148976 1145283 1132286 1139597 1149383 1164397 1162216 1175097
30750 1175097 1173971 1173492 1184383 1183429 1172964 1165317 1158275 1149923 1154999 1145571 1135768 1161365 1176592
30737 1176592 1190721 1197933 1193325 1171058 1161158 1166133 1168174 1167625 1174041 1174720 1178473 1184670 1181543 1185380
30723 1185380 1174846 1168538 1169768 1181813 1178819 1165187 1166883 1171076 1176099 1182307 1163505 1161190 1181548
30710 1181548 1189614 1176729 1163188 1173828 1182987 1183904 1187196 1207992 1208934 1198044 1205973 1207942 1202533
30697 1202533 1199470 1192096 1178932 1181015 1188232 1184221 1189061 1196260 1191369 1196964 1209109 1202569 1198212
30684 1198212 1182182 1175208 1171604 1175673 1182567 1180568 1168298 1158471 1179750 1192776 1195759 1195986 1192665
30671 1192665 1184750 1176097 1186369 1198768 1196528 1193621 1180988 1190427 1203327 1199010 1207550 1206666 1194412
30658 1194412 1188933 1187583 1179083 1177919 1175638 1185066 1199193 1196153 1189402 1192625 1193795 1189020 1183489 1164161
30644 1164161 1164434 1180107 1185867 1187973 1193605 1199082 1206824 1199326 1190889 1197673 1202192 1209883 1198045 1190142
30630 1190142 1198630 1193114 1184086 1173249 1189033 1201600 1189422 1202800 1210500 1204138 1201238 1208056 1199543
30617 1199543 1200618 1198782 1194324 1186695 1178639 1183147 1179604 1172320 1187795 1195662 1185641 1181467 1177300
30604 1177300 1174191 1170697 1169661 1176768 1174274 1184597 1191665 1194839 1187537 1178361 1180888 1189172 1193623 1197477
30590 1197477 1196365 1191848 1197656 1183865 1184932 1184530 1177428 1198071 1201874 1197367 1196923 1179393 1169730 1177791
30576 1177791 1187119 1180326 1180834 1190935 1205124 1186638 1185904 1175516 1173443 1174149 1177185 1169388 1166962 1191952
30562 1191952 1207902 1213555 1201502 1193221 1197390 1197258 1205096 1199323 1203523 1208147 1210525 1216462 1212214 1201411
30548 1201411 1200330 1208420 1201023 1187409 1190929 1200894 1205046 1214460 1212030 1212654 1211736 1213341 1208507 1199049
30534 1199049 1204912 1219654 1213270 1210559 1206784 1196125 1188306 1188427 1187906 1180624 1197393 1206233 1196476 1188803
30520 1188803 1206090 1216640 1223635 1227846 1203240 1178761 1175509 1191467 1201082 1200195 1186989 1183210 1191230
30507 1191230 1188132 1185843 1199354 1197587 1189341 1183321 1172788 1169630 1174067 1178826 1180172 1170093 1186843
30494 1186843 1199146 1205117 1207946 1211004 1200728 1189831 1189303 1190108 1179884 1177252 1185728 1180216 1183001
30481 1183001 1176155 1174234 1183584 1202527 1186889 1166478 1175764 1168747 1157611 1146976 1154823 1171610
30469 1171610 1171420 1184110 1193444 1194671 1183418 1176957 1169878 1174163 1181359 1184280 1187646 1184942 1187374 1205038
30455 1205038 1216204 1206694 1185850 1179105 1188002 1190652 1193423 1201292 1209964 1215627 1222169 1208492 1208169
30442 1208169 1217805 1205980 1193858 1181681 1197961 1200996 1208530 1211671 1200023 1198662 1205571 1205464 1200383
30429 1200383 1204631 1202263 1201368 1205763 1217439 1212954 1189144 1183044 1188225 1189424 1200033 1205933 1192702
30416 1192702 1188218 1174936 1183978 1193041 1192356 1189115 1202842 1219118 1216068 1199981 1190011 1192071 1201508
30403 1201508 1209703 1206846 1185936 1196473 1197508 1201459 1203290 1203186 1211640 1217934 1224876 1233551 1235030 1224396
30389 1224396 1222887 1221989 1204565 1198736 1197552 1196582 1204684 1201154 1193035 1183606 1190280 1194510 1208224 1203541
30375 1203541 1203851 1200259 1212950 1215202 1216984 1230064 1225560 1205815 1217278 1226171 1223144 1229481 1240059
30362 1240059 1238503 1236361 1214581 1197318 1185522 1191158 1195254 1199012 1211604 1226545 1228765 1224247 1225189
30349 1225189 1211011 1187234 1187196 1189495 1199019 1207409 1200847 1180497 1180735 1187246 1196725 1211678 1219324 1216927
30335 1216927 1218408 1210260 1201719 1190669 1178641 1179736 1190693 1207247 1208143 1184244 1201817 1211432 1198721
30322 1198721 1196444 1205939 1204079 1207345 1215591 1225591 1240723 1240543 1229858 1226503 1207045 1202845 1186805
30309 1186805 1184894 1195967 1216873 1216358 1208221 1201780 1197689 1192628 1198785 1210810 1204121 1197883 1182929
30296 1182929 1180611 1187390 1179814 1181881 1185685 1178375 1175689 1177437 1186708 1183352 1191516 1200512 1199638 1210727
30282 1210727 1221069 1221566 1200176 1204045 1213893 1215322 1215500 1202829 1201901 1187228 1178738 1191145 1213791
30269 1213791 1214582 1203060 1205290 1212179 1217979 1220578 1207514 1201109 1212823 1193868 1186087 1201115 1200884
30256 1200884 1196437 1213636 1218911 1220704 1225792 1222511 1213475 1211125 1220443 1231850 1232076 1231224 1225576 1209343
30242 1209343 1210189 1212098 1204186 1215953 1217958 1217801 1212650 1202969 1201755 1201134 1194823 1200735 1192615 1190691
30228 1190691 1197112 1182416 1181097 1190918 1196881 1211149 1202571 1193244 1200704 1207812 1213830 1216097 1208452
30215 1208452 1215439 1208594 1204518 1218865 1226122 1224865 1229885 1230975 1232055 1237988 1227458 1219233 1240187
30202 1240187 1236216 1229336 1219901 1215853 1207326 1197850 1192539 1210591 1222337 1232716 1233325 1238854 1241170
30189 1241170 1240799 1235153 1232440 1237566 1235573 1222083 1216585 1201728 1189159 1198492 1182829 1192084 1190156
30176 1190156 1203222 1214203 1198586 1187482 1190341 1209069 1221860 1223055 1224045 1230365 1230671 1226714 1222913
30163 1222913 1230486 1210746 1217718 1233907 1233761 1222468 1218452 1213666 1209678 1206962 1202155 1194649 1210757
30150 1210757 1226884 1221800 1208241 1208503 1214711 1224868 1229126 1214567 1202212 1201803 1199239 1203985 1205365
30137 1205365 1202974 1200785 1199075 1192096 1192606 1204707 1216831 1226943 1222988 1224843 1233056 1229907 1208399
30124 1208399 1193894 1204797 1205962 1205953 1205240 1192814 1181210 1200116 1218566 1223410 1220679 1218787 1220932
30111 1220932 1223720 1220278 1225487 1253303 1253691 1239285 1222914 1214880 1202707 1210121 1224735 1233524 1235532
30098 1235532 1238224 1241587 1232585 1223793 1216346 1230219 1249781 1241167 1228929 1236957 1238183 1222170 1224448
30085 1224448 1228010 1207211 1197064 1200036 1203191 1214879 1218927 1219054 1215490 1220188 1222105 1203410 1215997
30072 1215997 1228215 1227548 1226129 1216993 1222929 1224872 1224328 1237177 1229722 1229707 1252160 1260500 1261357 1253387
30058 1253387 1246162 1223310 1207832 1225349 1235076 1220257 1204064 1203629 1187473 1181573 1179430 1192001
30046 1192001 1199398 1199084 1208928 1217820 1211201 1205567 1216136 1230795 1228360 1211692 1193163 1191793 1200851
30033 1200851 1215717 1211040 1210117 1228791 1228894 1213682 1209634 1201802 1187612 1188854 1181623 1177173 1196529
30020 1196529 1206151 1228779 1251523 1233210 1224526 1238448 1233632 1239070 1240248 1242414 1241236 1226953 1214801
30007 1214801 1212758 1210351 1208574 1214319 1227476 1232404 1239589 1246781 1255115 1238679 1209012 1210066 1219835
29994 1219835 1230881 1234190 1225995 1222390 1237666 1254464 1252064 1247054 1235375 1206684 1189930 1207983
29982 1207983 1223904 1224391 1226160 1225866 1217746 1212832 1211896 1209704 1200258 1200814 1190433 1198452 1216697 1215002
29968 1215002 1202887 1195868 1210439 1234585 1233338 1234147 1220217 1209267 1206323 1214426 1205919 1207204 1205481
29955 1205481 1216668 1224644 1226932 1216106 1209846 1213418 1213881 1216325 1222932 1218972 1216861 1229524 1218295
29942 1218295 1193521 1188842 1186646 1196728 1218591 1231152 1222983 1222680 1224119 1230479 1207895 1190092 1190773
29929 1190773 1200011 1211452 1210366 1194307 1203273 1211443 1209730 1212381 1229884 1240883 1233987 1228061 1226035
29916 1226035 1210691 1199714 1203483 1211439 1224220 1240828 1254324 1249235 1242842 1245444 1235357 1228281
29904 1228281 1230398 1232760 1240029 1251211 1244155 1238973 1235340 1224415 1225702 1228621 1236280 1217653 1206747
29891 1206747 1206192 1220483 1232884 1218145 1209692 1210265 1214961 1220469 1222815 1233426 1246297 1241228 1221913
29878 1221913 1218812 1238501 1233811 1225858 1220476 1225068 1220733 1238390 1231990 1229105 1240488 1234529 1233179
29865 1233179 1245734 1222642 1223442 1222774 1206641 1193165 1203306 1227038 1234800 1230049 1230967 1233065 1234732
29852 1234732 1234668 1230179 1218498 1221172 1238150 1267242 1262406 1257386 1246419 1242895 1237120 1229632 1227323
29839 1227323 1225939 1226536 1222456 1218379 1217185 1206405 1210263 1220374 1225490 1225156 1231092 1233595 1223621 1218596
29825 1218596 1218242 1215138 1219081 1229062 1243171 1251846 1245628 1238657 1236437 1226086 1226709 1240291 1232223 1232109
29811 1232109 1228122 1233580 1239569 1238736 1219162 1217226 1219472 1231501 1234249 1230570 1225044 1222052 1223731 1234219
29797 1234219 1231807 1227747 1219352 1212249 1213662 1217619 1227600 1233636 1224040 1214946 1227078 1248943 1256032
29784 1256032 1246395 1237363 1234227 1230742 1246266 1250585 1244834 1244379 1244587 1237442 1245169 1243535 1254365 1258916
29770 1258916 1258623 1250654 1236417 1225717 1234852 1248854 1259989 1258137 1253003 1251478 1254175 1258866 1241021
29757 1241021 1219980 1216715 1229943 1250732 1260550 1227804 1207559 1198555 1211420 1229342 1245018 1234557
29745 1234557 1237556 1249724 1238502 1233466 1223411 1222568 1228788 1231887 1239856 1249655 1256524 1273226 1281183
29732 1281183 1260394 1254838 1258539 1247224 1244721 1240251 1238800 1241305 1242938 1237619 1243828 1247184 1250543
29719 1250543 1252241 1240178 1223513 1210958 1210406 1218007 1217319 1223040 1244451 1233886 1219271 1230486 1235215
29706 1235215 1236330 1230168 1225630 1214861 1218903 1220267 1220116 1220855 1228205 1232704 1244487 1261973 1250719
29693 1250719 1232954 1224329 1237921 1231790 1218848 1230113 1233546 1226411 1233607 1259184 1248570 1245788
29681 1245788 1258647 1241630 1228852 1233704 1240426 1244535 1244197 1258786 1272337 1257955 1237783 1227115
29669 1227115 1233644 1217860 1213399 1224082 1233508 1237003 1222592 1209482 1219577 1231520 1255180 1259763
29657 1259763 1241384 1234995 1232958 1237310 1228533 1229990 1238982 1236946 1225668 1223074 1232150 1249024 1261527
29644 1261527 1239773 1236596 1249181 1251567 1253750 1245310 1247734 1253911 1246393 1250877 1248157 1242691 1245065
29631 1245065 1255710 1276684 1275355 1281861 1280854 1268531 1258411 1238578 1237000 1233462 1222641 1236107
29619 1236107 1262968 1259175 1253498 1249825 1252252 1256641 1247670 1252509 1260138 1264808 1265834 1257654 1244717
29606 1244717 1241550 1236170 1227754 1244044 1258147 1269869 1276675 1278235 1271360 1244308 1235060 1232054 1239496
29593 1239496 1237274 1242247 1243591 1235665 1227581 1224591 1229009 1222652 1228868 1247877 1249264 1245013 1230660
29580 1230660 1229272 1233804 1245180 1245162 1256052 1242621 1237493 1241451 1243296 1241236 1248515 1244654 1250347 1255985
29566 1255985 1240039 1232477 1248369 1255309 1241145 1238096 1241474 1249282 1255591 1266469 1267394 1270334 1267872
29553 1267872 1260333 1242866 1243049 1238212 1241607 1233865 1224625 1239210 1251319 1250148 1245306 1245752 1248829 1243613
29539 1243613 1246952 1242692 1238067 1253756 1261722 1272852 1273431 1251656 1236863 1239620 1236030 1237169 1240996
29526 1240996 1245578 1248385 1251899 1252885 1247138 1231883 1238581 1249299 1256415 1257431 1259360 1262774 1260787 1246465
29512 1246465 1244089 1253078 1242105 1233279 1233922 1218493 1216241 1228092 1227456 1228793 1238893 1251171 1256604
29499 1256604 1251253 1253102 1250978 1237648 1247638 1249707 1239391 1255201 1265860 1256274 1251196 1244162 1235270
29486 1235270 1240480 1248330 1242053 1234248 1225473 1242066 1252354 1258665 1259684 1262928 1261858 1267243 1259128
29473 1259128 1244546 1233515 1236412 1243951 1238924 1228813 1243913 1266469 1282175 1263483 1239449 1243990
29461 1243990 1243771 1233803 1225516 1236317 1254228 1261302 1258241 1240475 1244664 1253704 1251734 1256872 1256914 1248589
29447 1248589 1244202 1241845 1250795 1266216 1272862 1262595 1251772 1238059 1236015 1234100 1206456 1218025
29435 1218025 1231877 1231302 1227477 1225609 1258344 1273721 1275557 1273776 1266226 1261888 1271417 1283025 1280582
29422 1280582 1257651 1243078 1249445 1254308 1259377 1256002 1251808 1269427 1270781 1264649 1262979 1259640 1256140
29409 1256140 1247254 1246115 1246763 1248935 1249732 1246012 1250480 1259950 1277548 1276982 1267492 1266827 1263025 1259843 1260220
$$ [...]
##END NTUPLES=NMR SPECTRUM
##END=
