##TITLE=Analysis number 328175
Compound Code sb 01192
Project Code adrs
Chemist Name stores
##JCAMPDX= 6.0         $$ Bruker NMR JCAMP-DX V2.0
##DATA TYPE= NMR SPECTRUM
##DATA CLASS= NTUPLES
##ORIGIN= Bruker BioSpin GmbH
##OWNER= nmr
$$ XWIN-NMR		Version 3.5
$$ Thu May 10 11:07:35 2007 GMT Daylight Time (UT+1h)  MAYBRIDGE\nmr@NMR_250MHZ
##.OBSERVE FREQUENCY= 250.131544655141
##.OBSERVE NUCLEUS= ^1H
##.ACQUISITION MODE= SIMULTANEOUS (DQD)
##.ACQUISITION SCHEME= undefined
##.AVERAGES= 16
##.DIGITISER RES= 18
##SPECTROMETER/DATA SYSTEM= dpx250
##.PULSE SEQUENCE= zg30
##.SOLVENT NAME= DMSO
##.SHIFT REFERENCE= (INTERNAL, DMSO, 0, 16.522)
##AUDIT TRAIL= $$ (NUMBER, WHEN, WHO, WHERE, WHAT)
$$ ##TITLE= Audit trail, XWIN-NMR		Version 3.5
$$ ##JCAMPDX= 5.01
$$ ##ORIGIN= Bruker BioSpin GmbH
$$ ##OWNER= nmr
$$ C:\u/data/dgb/nmr/ADRS/730/pdata/1/auditp.txt
$$ ##AUDIT TRAIL=  $$ (NUMBER, WHEN, WHO, WHERE, WHAT)
(   1,<2007-05-10 11:07:13.16 +100>,<MAYBRIDGE\nmr>,<NMR_250MHZ>,
      <created by zg, POWCHK disabled, PULCHK disabled
       configuration hash MD5:
       76 6E 9A 78 1E 09 19 81 EC 84 63 8F B0 6A 59 2D
       data hash MD5: 64K
       B5 AE 66 42 65 38 8A 7B 26 83 05 54 A2 F9 98 8A>)
(   2,<2007-05-10 11:07:25.69 +100>,<MAYBRIDGE\nmr>,<NMR_250MHZ>,
      <Start of raw data processing
       ef LB = 0.3 FT_mod = 6 PKNL = 1 SI = 32K 
       data hash MD5: 32K
       46 C9 12 FA A6 A1 77 7E 75 D0 01 07 4F F9 64 8E>)
(   3,<2007-05-10 11:07:27.74 +100>,<MAYBRIDGE\nmr>,<NMR_250MHZ>,
      <apk 
       data hash MD5: 32K
       9D 08 15 28 4A 73 A9 31 48 13 6F DF 0C 17 E8 2F>)
(   4,<2007-05-10 11:07:28.42 +100>,<MAYBRIDGE\nmr>,<NMR_250MHZ>,
      <abs ABSG = 5 
       data hash MD5: 32K
       92 8E 61 5F 38 96 9E 40 E7 17 BF BE F6 88 9E BA>)
$$ ##END=
$$ 
$$ hash MD5
$$ 45 EC 82 BD 7F B4 84 4D F9 FD 9F 01 87 B5 38 2D
##$RELAX= 
##$RELAX= 
##$RELAX= 
##$RELAX= 
##$RELAX= 
##$RELAX= 
##$RELAX= 
$$ Bruker specific parameters
$$ --------------------------
##$DU= <C:\u>
##$EXPNO= 730
##$NAME= <ADRS>
##$PROCNO= 1
##$TYPE= <nmr>
##$USER= <dgb>
##$AMP= (0..31)
100 100 100 100 100 100 100 100 100 100 100 100 100 100 100 100 100 100 
100 100 100 100 100 100 100 100 100 100 100 100 100 100 
##$AQSEQ= 0
##$AQ_mod= 3
##$AUNM= <au_zg>
##$AUTOPOS= <11 >
##$BF1= 250.13
##$BF2= 250.13
##$BF3= 250.13
##$BF4= 250.13
##$BF5= 500.13
##$BF6= 500.13
##$BF7= 500.13
##$BF8= 500.13
##$BYTORDA= 1
##$CFDGTYP= 0
##$CFRGTYP= 5
##$CHEMSTR= <none>
##$CNST= (0..31)
1 1 145 1 1 1 1 1 1 1 1 1 1 1 1 1 1 1 1 1 1 1 1 1 1 1 1 1 1 1 1 1 
##$CPDPRG= <>
##$CPDPRG1= <>
##$CPDPRG2= <>
##$CPDPRG3= <>
##$CPDPRG4= <mlev>
##$CPDPRG5= <mlev>
##$CPDPRG6= <mlev>
##$CPDPRG7= <mlev>
##$CPDPRG8= <mlev>
##$CPDPRGB= <>
##$CPDPRGT= <>
##$D= (0..31)
0 1 0 0 0 0 0 0 0 0.06 0 0 0 0 0 0 0.0002 0 0 0 0 0 0 0 0 0 0 0 0 0 0 
0 
##$DATE= 1178791631
##$DBL= (0..7)
120 120 120 120 120 120 120 120 
##$DBP= (0..7)
150 150 150 150 150 150 150 150 
##$DBP07= 0
##$DBPNAM0= <>
##$DBPNAM1= <>
##$DBPNAM2= <>
##$DBPNAM3= <>
$$ [...]
##$SUBNAM7= <"">
##$SUBNAM8= <"">
##$SUBNAM9= <"">
##$SW= 20.6930455092707
##$SWIBOX= (0..15)
0 0 3 0 0 0 0 0 0 0 0 0 0 0 0 0 
##$SW_h= 5175.983436853
##$TD= 65536
##$TD0= 1
##$TE= 683.16
##$TE2= 300
##$TE3= 300
##$TEG= 300
##$TL= (0..7)
0 120 120 120 120 120 120 120 
##$TP= (0..7)
150 150 150 150 150 150 150 150 
##$TP07= 0
##$TPNAME0= <>
##$TPNAME1= <>
##$TPNAME2= <>
##$TPNAME3= <>
##$TPNAME4= <>
##$TPNAME5= <>
##$TPNAME6= <>
##$TPNAME7= <>
##$TPOAL= (0..7)
0.5 0.5 0.5 0.5 0.5 0.5 0.5 0.5 
##$TPOFFS= (0..7)
0 0 0 0 0 0 0 0 
##$TUNHIN= 0
##$TUNHOUT= 0
##$TUNXOUT= 0
##$USERA1= <user>
##$USERA2= <user>
##$USERA3= <user>
##$USERA4= <user>
##$USERA5= <user>
##$V9= 5
##$VALIST= <valist>
##$VCLIST= <CCCCCCCCCCCCCCC>
##$VD= 0
##$VDLIST= <DDDDDDDDDDDDDDD>
##$VPLIST= <PPPPPPPPPPPPPPP>
##$VTLIST= <TTTTTTTTTTTTTTT>
##$WBST= 1024
##$WBSW= 4
##$XGAIN= (0..3)
0 0 0 0 
##$XL= 0
##$YL= 0
##$YMAX_a= 190085
##$YMIN_a= -220487
##$ZGOPTNS= <>
##$ZL1= 120
##$ZL2= 120
##$ZL3= 120
##$ZL4= 120
##$ABSF1= 16.522
##$ABSF2= -4.171173
##$ABSG= 5
##$ABSL= 3
##$ALPHA= 0
##$AQORDER= 0
##$ASSFAC= 0
##$ASSFACI= 0
##$ASSFACX= 0
##$ASSWID= 0
##$AUNMP= <proc_1d>
##$AZFE= 0.1
##$AZFW= 0.1
##$BCFW= 0
##$BC_mod= 0
##$BYTORDP= 0
##$COROFFS= 0
##$CY= 12.5
##$DATMOD= 1
##$DC= 0
##$DFILT= <>
##$DTYPP= 0
##$F1P= 14.0000005364418
##$F2P= -0.99999901652339
##$FCOR= 0.5
##$FTSIZE= 32768
##$FT_mod= 6
##$GAMMA= 0
##$GB= 0
##$INTBC= 1
##$INTSCL= 1
##$ISEN= 128
##$LB= 0.3
##$LEV0= 0
##$LPBIN= 0
##$MAXI= 10000
##$MC2= 0
##$MEAN= 0
##$ME_mod= 0
##$MI= 0
##$NCOEF= 0
##$NC_proc= -6
##$NLEV= 6
##$NOISF1= 0
##$NOISF2= 0
##$NSP= 0
##$NTH_PI= 0
##$NZP= 0
##$OFFSET= 16.522
##$PC= 1
##$PHC0= -73.50091
##$PHC1= 30.89113
##$PH_mod= 1
##$PKNL= yes
##$PPARMOD= 0
##$PSCAL= 4
##$PSIGN= 0
##$REVERSE= no
##$SF= 250.13
##$SI= 32768
##$SIGF1= 0
##$SIGF2= 0
##$SINO= 400
##$SIOLD= 32768
##$SREGLST= <1H.DMSO>
##$SSB= 0
##$STSI= 32768
##$STSR= 0
##$SW_p= 5175.98343685301
##$SYMM= 0
##$S_DEV= 0
##$TDeff= 65536
##$TDoff= 0
##$TI= <Analysis number 999999
Compound Code 99
Book Reference 9
Project Code 9>
##$TILT= no
##$TM1= 0
##$TM2= 0
##$TOPLEV= 0
##$USERP1= <user>
##$USERP2= <user>
##$USERP3= <user>
##$USERP4= <user>
##$USERP5= <user>
##$WDW= 1
##$XDIM= 32768
##$YMAX_p= 468464937
##$YMIN_p= -3515155
$$ End of Bruker specific parameters
$$ ---------------------------------
##NTUPLES= NMR SPECTRUM
##VAR_NAME=  FREQUENCY,     SPECTRUM/REAL,   SPECTRUM/IMAG
##SYMBOL=    X,             R,               I
##VAR_TYPE=  INDEPENDENT,   DEPENDENT,       DEPENDENT
##VAR_FORM=  AFFN,          ASDF,            ASDF
##VAR_DIM=   32768,         32768,           32768
##UNITS=     HZ,            ARBITRARY UNITS, ARBITRARY UNITS
##FACTOR=    0.157963299565203, 1,           1
##FIRST=     4132.6476996994, 0,             0
##LAST=      -1043.33573715361, 0,           0
##MIN=       -1043.33573715361, -3515155,    0
##MAX=       4132.6476996994, 468464937,     0
$$ Real data points
##PAGE= N=1
##DATA TABLE= (X++(R..R)), XYDATA
$$ [...]
$$ plain form
15441 -401402 -468339 -118136 -162543 -26448 -113476 -283679 -135952 -264441 -261153 25574
15431 25574 125136 -528186 -927962 -634567 -380521 -208685 -446318 -286419 -447093 -550572
15421 -550572 -456840 -687533 -514940 -5165 219300 215137 244762 -253179 -489109 -419006
15411 -419006 -561154 -328443 -55056 -322326 -674847 -411515 -235856 -142174 -114074 -139802
15401 -139802 -177282 -212840 -379247 -730227 -568136 -465584 -213858 -289770 -381943 -472449
15391 -472449 -421375 -473130 -607737 -597892 -497904 -402618 -338890 -328497 -73802 227735 348995
15380 348995 440888 275266 -94082 -131395 -334152 126772 704058 471191 263531 166875
15370 166875 -97713 -56536 -160769 -73416 7090 -23876 29892 144482 -231543 -45716
$$ packed form
15441d01402o6937L50203m4407J36095q7028j70203J47727j28489L288K86727
15431B5574R9562o53322l99776K93395K54046J71836k37633J59899j60674j03479
15421e50572R3732k30693J72593N09775K24465m163K9625m97941k35930P0103
15411d19006j42148K32711K73387k67270l52521K63332J75659R3682K8100k5728
15401a39802l7480l5558j66407l50980J62091J02552K51726p5912r2173r0506
15391d72449N1074n1755j34607R845R9988R5286O3728J0393K54695L01537J21260
15380C48995R1893j65622l69348l7313k02757M60924N77286k32867k07660r6656
15370A66875k64588M1177j04233Q7353Q0506l0966N3768J14590l76025J85827
$$ plain form
15360 -45716 46959 -121375 -87883 -186004 -513753 -656153 -336673 154774 484900 236261
15350 236261 36626 -341165 -283806 236731 342117 153099 165726 -71385 -459558 -546308
15340 -546308 -800952 -708504 -516448 -394448 -256455 -91026 39886 10322 -233148 -342712
15330 -342712 -705362 -846683 -644114 -616268 -266360 -161199 -383531 -454003 -800815 -537026
15320 -537026 36821 63927 62012 92500 137377 -71230 -247840 -43987 -22048 -478336 -793698
15309 -793698 -610819 -384238 -491647 -422516 -281406 -256611 -154350 -91640 -211444 -435473
15299 -435473 -800990 -712532 -567219 -595634 -465712 -331713 -259283 -204657 -139315 -281157
15289 -281157 -282548 -241350 -246397 -198060 -110705 122308 -22871 -68015 -357064 -681836 -407686
$$ packed form
15360d5716R2675j68334L3492r8121l27749j42400L19480M91447L30126k48639
15350B36261j99635l77791N7359N20537J05386j89018J2627k37111l88173q6750
15340e46308k54644R2448J92056J22000J37993J65429J30912k9564k43470j09564
15330c42712l62650j41321K02569K7846L49908J05161k22332p0472l46812K63789
15320e37026N73847K7106j915L0488M4877k08607j76610K03853K1939m56288l15362
15309g93698J82879K26581j07409O9131J41110K4795J02261O2710j19804k24029
15299d35473l65517Q8458J45313k8415J29922J33999P2430N4626O5342j41842
15289b81157j391M1198n047M8337Q7355K33013j45179m5144k89049l24772K74150
$$ plain form
15278 -407686 -202548 -94117 -216770 -244809 -347602 -379387 -536087 -380596 -281315 -136206
15268 -136206 -53673 -285972 -427979 -104534 168989 47150 -28665 -178152 80370 171548
15258 171548 7456 -45493 -347032 -339854 -287523 -166919 -82490 -318878 -409053 -153125 -197563
15247 -197563 278596 426708 305932 221748 -63954 96855 266287 135068 -212097 -411748
15237 -411748 -326451 24414 178030 261317 142381 489218 566035 352052 478400 163731
15227 163731 27562 286360 201926 31009 -141162 -577245 -668336 -370710 99016 211836
15217 211836 106444 -49656 -75457 -10221 -132980 -187146 98733 -235458 -439983 -162041
15207 -162041 68235 -71279 -126908 130203 171812 187081 -282192 -230065 -23706 -280366
$$ packed form
15278d07686K05138J08431j22653k8039j02793l1785j56700J55491R9281J45109
15268a36206Q2533k32299j42007L23445K73523j21839p5815j49487K58522R1178
15258A71548j64092n2949l01539P178N2331J20604Q4429k36388r0175K55928m4438
15247a97563M76159J48112j20776q4184k85702J60809J69432j31219l47165j99651
15237d11748Q5297L50865J53616Q3287j18936L46837P6817k13983J26348l14669
15227A63731j36169K58798q4434j70917j72171m36083r1091K97626M69726J12820
15217B11836j05392j56100k5801O5236j22759n4166K85879l34191k04525K77942
15207a62041K30276j39514n5629K57111M1609J5269m69273N2127K06359k56660
$$ plain form
15197 -280366 -619311 -1177976 -1121249 -755296 -484757 -339484 -107948 -162109 -356581 -287295
15187 -287295 -160910 -263785 -851687 -1066032 -761665 -420921 44010 427418 394984 -1047
15177 -1047 -358323 -177576 -3888 -282362 -536105 -530245 -147671 -157476 37903 530622 480847
15166 480847 258725 243334 27459 -121595 -114355 -154675 103737 -163571 58722 -165857
15156 -165857 -315335 -119224 -229943 -161052 28509 261957 140686 -215537 -539203 -253116
15146 -253116 -122747 -473849 -449936 -252735 -258570 -46721 307356 51026 -61896 15632
15136 15632 -482065 -677135 -376253 9014 383664 137522 -22078 205015 130934 60536
15126 60536 -74515 -300485 -262864 -664746 -489455 -60493 84578 15629 -103182 3111
$$ packed form
15197b80366l38945n58665N6727L65953K70539J45273K31536n4161j94472O9286
15187b87295J26385j02875n87902k14345L04367L40744M64931L83408l2434l96031
15177a047l57276J80747J73688k78474k53743N860L82574r805J95379M92719m9775
15166D80847k22122j5391k15875j49054P240m0320K58412k67308K22293k24579
15156a65857j49478J96111j10719O8891J89561K33448j21271l56223l23666K86087
15146b53116J30369l51102K3913J97201n835K11849L54077k56330j12922P7528
15136A5632m97697j95070L00882L85267L74650k46142j59600K27093p4081p0398
15126F0536j35051k25970L7621m01882J75291M28962J45071o8949j18811J06293
$$ plain form
15116 3111 -26225 271405 212742 -6811 -39320 52626 172544 -165734 -22276 138629 -30383
15105 -30383 -203383 39551 -211511 -118907 -129091 60419 -165288 -231672 -40277 156185
15095 156185 141390 130128 -80564 -258519 -508984 -610068 -409341 -164654 -113147 -286849
15085 -286849 -431181 -543016 -283277 167104 467145 190802 -128529 -236886 -344576 129052
15075 129052 106226 -385757 -612109 -517497 -188535 -424331 -643949 -509920 -241099 -284825
15065 -284825 -455764 -439407 -376721 -248609 -290745 -411572 -456269 -288659 -294329 191901 342646
15054 342646 122001 366552 454637 369849 81108 197095 494206 394043 54339 37233
15044 37233 46246 -33589 39973 132232 -29145 -59209 -266755 -544033 -460445 -127965 50114
$$ packed form
15116C111k9336K97630n8663k19553l2509R1946J19918l38278J43458J60905j69012
15105c0383j73000K42934k51062R2604j0184J89510k25707o6384J91395J96462
15095A56185j4795j1262k10692j77955k50465j01084K00727K44687N1507j73702
15085b86849j44332j11835K59739M50381L00041k76343l19331j08357j07690M73628
15075A29052k2826m91983k26352R4612L28962k35796k19618J34029K68821m3726
15065b84825j70939J6357O2686J28112m2136j20827m4697J67610n670M86230J50745
15054C42646k20645K44551Q8085q4788k88741J15987K97111j00163l39704j7106
15044C7233R013p9835P3562R2259j61377l0064k07546k77278Q3588L32480J78079
$$ plain form
15033 50114 254068 297564 414706 -116293 -244968 -226328 -148188 -223720 -291620 -431406 -657164
15022 -657164 -563484 -567916 -689629 -545221 -305262 -140829 23418 80895 -138448 -159205
15012 -159205 -80177 -181563 -446753 -418216 -501755 -347629 -309482 -339223 -300019 -69919 -103313
15001 -103313 -718670 -858807 -596911 -454789 -187790 -120642 163841 76852 -226694 231097
14991 231097 215504 352748 499887 228454 -2318 13052 -174652 -323055 -572150 -757733
14981 -757733 -524622 -368090 -394497 -115140 32130 -217881 -234240 -57533 -130436 -199208
14971 -199208 -216171 -352989 -288199 -317076 -123634 -109539 266696 433581 162769 -194391
14961 -194391 -195171 53995 114612 -232855 -306778 -252746 -234733 -152604 -205131 -139420 256779
$$ packed form
15033E0114K03954M3496J17142n30999j28675J8640P8140p5532o7900j39786k25758
15022f57164R3680m432j21713J44408K39959J64433J64247N7477k19343k0757
15012a59205P9028j01386k65190K8537q3539J54126L8147k9741L9204K30100l3394
15001a03313o15357j40137K61896J42122K66999O7148K84483q6989l03546M57791
14991B31097j5593J37244J47139k71433k30772J5370j87704j48403k49095j85583
14981g57733K33111J56532k6407K79357J47270k50011j6359J76707p2903o8772
14971a99208j6963j36818O4790k8877J93442J4095L76235J66885k70812l57160
14961a94391p80K49166O0617l47467p3923N4032J8013Q2129n2527O5711L96199
$$ plain form
14950 256779 170208 48278 -114875 -77660 -181373 -433744 -284650 -478760 -674646 -682417
14940 -682417 -553555 -694465 -827974 -696479 -445227 -83757 375872 432625 -345128 -172846
14930 -172846 -397731 -67053 6145 128660 -41379 22850 -39278 398 289893 270595
14920 270595 -274291 -249793 -58726 113477 124370 -175302 -83160 159931 18549 -281535
14910 -281535 -193582 -302928 -144508 256897 202025 -213941 -435795 -329920 -98737 -108846
14900 -108846 -329932 -386964 -51898 308404 225138 -13925 -491531 -714577 -689076 -757183
14890 -757183 -631737 -349866 -311137 -295195 -203390 -195961 -381453 -77586 -8006 308975 160282
14879 160282 -381704 -443918 -116091 -87818 -39213 165796 412506 279444 42676 -475874
$$ packed form
14950B56779q6571j21930j63153L7215j03713k52371J49094j94110j95886p771
14940f82417J28862j40910j33509J31495K51252L61470M59629N6753p77753J72282
14930a72846k24885L30678P3198J22515j70039O4229o2128L9676K89495j9298
14920B70595n44886K4498J91067J72203J0893k99672R2142K43091j41382l00084
14910b81535Q7953j09346J58420M01405n4872m15966k21854J05875K31183j0109
14900a08846k21086n7032L35066L60302q3266k39063m77606k23046K5501o8107
14890g57183J25446K81871L8729J5942R1805P429j85492L03867O9580L16981j48693
14879A60282n41986o2214L27827K8273M8605K05009K46710j33062k36768n18550
$$ plain form
14869 -475874 -362986 -228808 -190305 414022 132115 51273 114794 164674 15195 -69538
14859 -69538 -285152 -558992 -577999 -256936 -164946 141176 440418 513185 61565 -380486
14849 -380486 -600130 -417662 -359810 -384647 -383784 -246826 -329259 -190815 56413 -106525 71833
14838 71833 317428 -19516 -268678 -613411 -831187 -584235 -271761 -61338 -50183 -42773
14828 -42773 -231499 -212167 223482 470100 198334 38019 258774 299927 342341 62320
14818 62320 -140624 26693 32414 -27073 83474 -180183 -393223 -577049 -420941 -276949
14808 -276949 94185 209530 11715 -279498 -405638 -166957 179396 387850 451119 575869
14798 575869 509759 318700 37234 113992 128405 211937 163383 178784 388164 474723 231313
$$ packed form
14869d75874J12888J34178L8503O04327k81907q0842O3521M9880j49479q4733
14859f9538k15614k73840j9007L21063R1990L06122K99242P2767m51620m42051
14849c80486k19644J82468N7852k4837Q63J36958q2433J38444K47228j62938J78358
14838G1833K45595l36944k49162l44733k17776K46952L12474K10423J1155P410
14828d2773j88726J9332M35649K46618k71766j60315K20755M1153M2414k80021
14818F2320k02944J67317N721n9487J10547k63657k13040j83826J56108J43992
14808b76949L71134J15345j97815k91213j26140K38681L46353K08454O3269J24750
14798E75869o6110j91059k81466P6758J4413Q3532m8554J5401K09380Q6559k43410
$$ plain form
14787 231313 -66240 -317063 -386306 -449340 -266364 -217260 -308245 -333045 -198488 116448
14777 116448 245320 196694 72438 5967 -139811 -107743 -250463 -145272 -72403 -88683
14767 -88683 -357648 -52912 -74492 -424697 -348541 105498 -17002 -113595 -70336 -165957 -329060
14756 -329060 -589814 -765823 -743779 -547665 -206739 -262330 -227442 -411807 -498962 -309206
14746 -309206 -218579 -439709 -763385 -847644 -645197 -172095 206430 25677 28795 69512
14736 69512 -16419 -126703 -93022 237641 155090 -154183 -237365 65948 20396 -308860 -568958
14725 -568958 -507199 -481283 -395997 19700 -36345 -308932 -457710 -454491 -173475 -238202 -208325
14714 -208325 91443 120269 -70109 -154418 -468610 -420954 -215221 -310537 -252334 -442865
$$ packed form
14787B31313k97553k50823o9243o3034J82976M9104r0985k4800J34557L14936
14777A16448J28872m8626j24256o6471j45778L2068j42720J05191P2869j6280
14767h8683k68965L04736k1580l50205P6156M54039j22500r6593M3259r5621j63103
14756c29060k60754j76009K2044J96114L40926n5591L4888j84365q7155J89756
14746c09206R0627k21130l23676q4259K02447M73102L78525j80753L118M0717
14736F9512q5931j10284L3681L30663q2551l09273q3182L03313m5552l29256k60098
14725e68958O1759K5916Q5286M15697n6045k72587j48778L219K81016o4727K9877
14714b08325K99768K8826j90378q4309l14192M7656K05733r5316N8203j90531
$$ plain form
14704 -442865 -448738 -749822 -848841 -636530 -316126 382913 285000 -222846 -138162 75970
14694 75970 21875 -316609 -495291 -518752 -452550 -21298 86410 -21134 -89130 -215022
14684 -215022 -102584 -361156 -791667 -586617 -217534 -43224 -20767 -325410 -543319 -336806
14674 -336806 -317189 -113614 -128375 -256450 -116108 86602 -83376 -116702 -196630 -333936
14664 -333936 45532 138945 -201949 -296141 -441715 -554602 -476222 -330153 104018 221768
14654 221768 197439 -76265 -367902 -208760 -277386 -190376 -115871 -168908 -9360 140047
14644 140047 34385 -158745 -111829 55972 100015 -29433 -125317 33006 319780 297319
14634 297319 62161 166498 400509 186082 -329234 -469712 -414989 -183961 -468397 -450336
$$ packed form
14704d42865n873l01084r9019K12311L20404O99039r7913n07846Q4684K14132
14694G5970n4095l38484j78682k3461O6202M31252J07708j07544o7996j25892
14684b15022J12438k58572m30511K05050L69083J74310K2457l04643k17909K06513
14674c36806J9617K03575j4761j28075J40342K02710j69978l3326p9928j37306
14664c33936L79468R3413l40894r4192j45574j12887P8380J46069M34171J17750
14654B21768k4329k73704k91637J59142o8626Q7010P4505n3037J59548J49407
14644A40047j05662j93130M6916J67801M4043j29448r5884J58323K86774k2461
14634B97319k35158J04337K34011k14427n15316j40478N4723K31028k84436J8061
$$ plain form
14624 -450336 -327010 16270 40062 -172175 41 224324 26499 230874 -14492 -241198
14614 -241198 -71952 -429580 -518111 -364694 -146404 -72059 -122994 -167441 -74696 -81305 -220843
14603 -220843 -27495 -47732 48379 -43443 -458224 -607058 -267071 208190 64902 66683
14593 66683 -110447 -28061 -189130 -6016 -183457 -70659 44569 -24122 -234912 -205311
14583 -205311 -222192 -206168 -166926 40670 -5077 35133 100490 124229 -134522 -505983 -302014
14572 -302014 -211790 49115 253008 344458 318979 -20691 -29067 375878 310189 -35108 -13994
14561 -13994 -1596 -11572 383954 410118 -5008 -60858 -116464 153320 -231068 -646256 -596472
14550 -596472 -479291 -271290 -384943 -345911 83772 -46139 -401779 -845535 -641049 -450520
$$ packed form
14624d50336J23326L43280K3792k12237J72216K24283j97825K04375k45366k26706
14614b41198J69246l57628q8531J53417K18290P4345n0935m4447R2745o609j39538
14603b20843J93348k0237R6111r1822m14781j48834L39987M75261j43288J781
14593F6683j77130Q2386j61069J83114j77441J12798J15228o8691k10790K9601
14583b05311j6881J6024L9242K07596m5747M0210O5357K3739k58751l71461K03969
14572c02014R0224K60905K03893R1450k5479l39670q376M04945o5689l45297K1114
14561a3994J2398r976L95526K6164m15126n5850n5606K69784l84388m15188M9784
14550e96472J17181K08001j13653L9032M29683j29911l55640m43756K04486J90529
$$ plain form
14540 -450520 -318706 42725 -263933 -540708 -567470 -401850 -349268 -389650 -152520 90347
14530 90347 -168951 -429922 -478402 -367609 -126037 35548 -100056 117329 -31671 -242369
14520 -242369 -431876 -482083 -106757 135446 -80411 -236130 -121074 125800 -14832 -316892
14510 -316892 -253090 -187865 -410309 -412819 -284323 -454226 -299548 -183530 48741 11425
14500 11425 -99779 -199136 -565215 -595868 -471286 -254705 -386785 -129190 58383 -166979
14490 -166979 -80988 154243 193060 324653 117924 -33858 -89505 11636 -96494 -344930
14480 -344930 -295476 -238962 -330818 -139826 121214 262634 255360 80102 -178832 -159405 -95810
14469 -95810 -179958 138836 188300 119845 278596 131223 -103418 17160 218025 292365
$$ packed form
14540d50520J31814L61431l06658k76775k6762J65620N2582m0382K37130K42867
14530I0347k59298k60971m8480J10793K41572J61585j35604K17385j49000k10698
14520b42369j89507n0207L75326K42203k15857j55719J15056K46874j40632l02060
14510c16892O3802O5225k22444k510J28496j69903J54678J16018K32271l7316
14500A1425j11204r9357l66079l0653J24582K16581j32080K57595J87573k25362
14490a66979Q5991K35231L8817J31593k06729j51782n5647J01141j08130k48436
14480c44930M9454N6514r1856J90992K61040J41420p274j75258k58934J9427O3595
14469i5810q4148L18794M9464o8455J58751j47373k34641J20578K00865P4340
$$ plain form
14459 292365 429736 450984 208557 -73313 -421845 -734234 -775086 -529398 -360371 -254412
14449 -254412 -222527 -101309 10964 57777 -117014 -366259 -234704 228332 248899 160325
14439 160325 -58961 -148393 -45813 -6583 -136659 -161399 -187303 -314524 -92875 72604
14429 72604 115359 -71849 -373718 -316706 -510851 -548947 -809303 -1225878 -1073985 -436311
14419 -436311 -179852 -226258 -83095 -23563 -27721 -52527 173158 226639 162302 26885 -7928
14408 -7928 101281 266139 -90403 -226585 -194858 30508 92302 340033 508108 213550
14398 213550 -128138 -311056 -460973 -437619 -267723 -127034 -189074 -203144 -93716 104496
14388 104496 -222650 -296624 -285724 -438199 -339701 -418062 -117640 110350 -117056 -248629
$$ packed form
14459B92365J37371K1248k42427k81870l48532l12389m0852K45688J69027J05959
14449b54412L1885J21218J12273M6813j74791k49245J31555M63036K0567q8574
14439A60325k19286q9432J02580L9230j30076k4740k5904j27221K21649J65479
14429G2604M2755j87208l01869N7012j94145l8096k60356m16575J51893O37674
14419d36311K56459m6406J43163N9532m158k4806K25685N3481o4337j35417l4813
14408g928J09209J64858l56542j36182L1727K25366O1794K47731J68075k94558
14398B13550l41688j82918j49917K3354J69896J40689o2040j4070J09428J98212
14388A04496l27146p3974J0900j52475R8498p8361L00422K27990k27406j31573
$$ plain form
14378 -248629 -492154 -521948 -74795 89901 50605 -97507 -95782 21542 -66383 -114537 -413093
14367 -413093 -481562 -413335 -576198 -554574 -437457 -295923 -209684 -232502 -63067 -283167
14357 -283167 -636349 -842586 -502461 -196061 -78374 70253 372109 66316 -83678 -96139
14347 -96139 4436 152262 -117410 -101036 177749 71966 1928 143268 -72396 -248456
14337 -248456 -303489 -240715 -231613 -75443 -164556 -258538 -130647 -279585 -164406 -278135 -379935
14326 -379935 -713663 -762524 -596779 -311083 192478 372007 341459 87731 -101490 33156
14316 33156 10134 -251201 -415089 -238747 75341 -53687 191323 452994 45521 -335681
14306 -335681 -243949 -321286 -543048 -81374 171176 -129075 28920 115226 -64395 -90177
$$ packed form
14378b48629k43525k9794M47153J64696l9296j48112J725J17324q7925m8154k98556
14367d13093o8469O8227j62863K1624J17117J41534Q6239k2818J69435k20100
14357b83167l53182k06237L40125L06400J17687J48627L01856l05793j49994j2461
14347i6139J00575J47826k69672J6374K78785j05783p0038J41340k15664j76060
14337b48456n5033O2774R102J56170q9113r3982J27891j48938J15179j13729j01800
14326c79935l33728m8861J65745K85696N03561J79529l0548k53728j89221J34646
14316C3156k3022k61335j63888J76342L14088j29028K45010K61671m07473l81202
14306c35681R1732p7337k21762M61674K52550l00251J57995Q6306j79621k5782
$$ plain form
14296 -90177 242824 248167 -345896 -411504 -137287 -80340 -278987 -176992 -85904 123008 270623
14285 270623 50999 -100450 -220217 -285925 -34600 227398 410229 677033 496211 477502
14275 477502 -3657 -552138 -603384 -254868 -140127 -219765 291552 373714 307173 64822
14265 64822 -124424 -76670 -134437 -124181 -153560 -146398 233796 432095 308571 327717 323047
14254 323047 237497 404479 568971 322943 -302876 -371665 -432888 -554675 -492314 -38798
14244 -38798 186788 91587 -250373 -318100 276952 -251712 -589384 -402481 -245739 -240041
14234 -240041 -473253 -353151 -243258 -380223 -244966 -115950 -456347 -324798 -399377 -69293
14224 -69293 -129146 -325728 -156303 -520966 -662309 -384444 -304669 -540097 -429295 -289197
$$ packed form
14296i0177L33001N343n94063o5608K74217N6947j98647J01995R1088K08912J47615
14285B70623k19624j51449j19767o5708K51325K61998J82831K66804j80822j8709
14275D77502m81159n48481n1246L48516J14741p9638N11317Q2162o6541k42351
14265F4822j89246M7754n7767J0256k9379P162L80194J98299j23524J9146m670
14254C23047q5550J66982J64492k46028o25819o8789o1223j21787O2361M53516
14244c8798K25586r5201l41960o7727N95052n28664l37672J86903J56742N698
14234b40041k33212J20102J09893j36965J35257J29016l40397J31549p4579L30084
14224f9293n9853j96582J69425l64663j41343K77865P9775k35428J10802J40098
$$ plain form
14214 -289197 -444534 -390680 -374997 -452664 -761578 -834010 -528218 -116430 -27381 -52566 -329462
14203 -329462 -309291 -42854 307754 629085 148301 -144602 -250140 -272954 -210267 -248428
14193 -248428 24879 214943 392499 246279 179140 90675 36096 -142745 -393963 -392138
14183 -392138 -478064 -655972 -684582 -786273 -333466 -245574 -68593 -88183 -256735 -255479 -110634
14172 -110634 160625 270274 96569 -234865 -427614 -452924 61535 348018 188573 -145161
14162 -145161 -209426 -165118 -311401 -490661 -489376 -481176 -297028 32325 198033 -159785 -80796
14151 -80796 217984 317519 162511 -28523 223013 254517 174307 -111161 194632 520705
14141 520705 416580 183738 -85760 -232858 67431 202087 -37774 -118244 -215028 -257867
$$ packed form
14214b89197j55337N3854J5683p7667l08914p2432L05792M11788Q9049k5185k76896
14203c29462K0171K66437L50608L21331m80784k92903j05538k2814O2687l8161
14193b48428K73307J90064J77556j46220o7139q8465n4579j78841k51218J825
14183c92138q5926j77908k8610j01691M52807Q7892J76981j9590j68552J256J44845
14172a10634K71259J09649j73705l31434j92749k5310N14459K86483j59445l33734
14162a45161o4265M4308j46283j79260J285Q200J84148L29353J65708l57818P8989
14151h0796K98780R9535j55008j91034K51536L1504q0210k85468L05793L26073
14141E20705j04125k32842k69498j47098L00289J34656k39861q0470r6784m2839
$$ plain form
14131 -257867 -301811 68578 361108 306680 277865 280230 134479 98339 640834 801361 442410
14120 442410 -166089 -411564 -164301 -70868 -329176 -832414 -586992 -471062 -611806 -519906
14110 -519906 -39415 -47444 -102029 -292926 -340677 69269 56823 -27192 -8831 -11358 -322216
14099 -322216 -387553 -239738 102066 316596 135041 2328 -187799 -208679 -320855 -336305
14089 -336305 -53412 -18149 -128505 -37902 60307 4599 50960 -136710 56695 411238
14079 411238 403427 466044 569994 443587 314275 237245 434985 702188 674257 389822
14069 389822 307230 83018 -190577 -271534 -327101 131319 343419 159092 108011 -15267
14059 -15267 -259551 -147358 -136815 171057 435733 411140 269805 266871 353544 423124 158407
$$ packed form
14131b57867m3944L70389K92530n4428k8815K365j45751l6140N42495J60527l58951
14120D42410o08499k45475K47263R3433k58308n03238K45422J15930j40744R1900
14110e19906M80491q029n4585j90897m7751M09946j2446q4015J8361k527l10858
14099c22216o5337J47815L41804K14530j81555j32713j90127k0880j12176j5450
14089c36305K82893L5263j10356R0603R8209n5708M6361j87670J93405L54543
14079D11238p811O2617J03950j26407j29312p7030J97740K67203k7931k84435
14069C89822q2592k24212k73595q0957n5567M58420K12100j84327n1081j23278
14059a5267k44284J12193J0543L07872K64676k4593j41335k934Q6673O9580k64717
$$ plain form
14048 158407 -96417 28028 69001 -126830 -303333 12125 346561 81129 -191244 224168
14038 224168 98362 -5036 83340 25016 236508 461541 485795 370010 255946 114506
14028 114506 55115 19641 -22504 -217084 -406130 -508089 -267821 36777 -110890 -555968
14018 -555968 -661180 -568116 -627284 -791642 -708977 -348829 129030 36670 59589 445972
14008 445972 704724 233653 211814 251624 66811 -102174 -448139 -494822 -233541 -65863
13998 -65863 -394306 -450760 -201294 -163044 -130294 -356098 -555951 -321990 38364 -117861
13988 -117861 -22495 -32888 -155216 142515 416353 504061 398581 65080 -57232 -144439
13978 -144439 -48656 -148065 6425 47724 -332324 -434410 -413962 -319014 -251404 52042 -18440
$$ packed form
14048A58407k54824J24445M0973j95831j76503L15458L34436k65432k72373M15412
14038B24168j25806j03398Q8376n8324K11492K25033K4254j15785j14064j41440
14028A14506n9391l5474m2145j94580j89046j01959K40268L04598j47667m45078
14018e55968j05212R3064n9168j64358Q2665L60148M77859r2360K2919L86383
14008D45972K58752m71071k1839L9810j84813j68985l45965m6683K61281J67678
13998f5863l28443n6454K49466L8250L2750k25804j99853K33961L60354j56225
13988a17861R5366j0393j22328K97731K73838Q7708j05480l33501j22312q7207
13978a44439R5783r9409J54490M1299l80048j02086K0448R4948O7610L03446p0482
$$ plain form
13967 -18440 -5708 206 280514 599227 551991 471701 514625 433715 -36566 -730486 -929456
13956 -929456 -771866 -710704 -587706 -504055 -545702 -721939 -904795 -476566 -206184 75743
13946 75743 388096 270649 487746 482178 486163 64625 -177207 -141884 157863 -1937 -232380
13935 -232380 -104221 -91081 159429 356258 581379 404314 332420 110152 79166 -304470
13925 -304470 -803249 -741174 -681391 -800539 -706996 -478555 -397310 -303161 -682750 -657932 -307344
13914 -307344 -372656 -402900 -349152 38551 339895 -78046 -215736 -155934 -448092 -416609
13904 -416609 -215411 -283701 -403770 -345309 59499 253265 222599 127229 217023 205846 1105
13893 1105 -187583 -165438 -11330 -151945 -129337 -20851 -267945 -508355 -372001 -295747
$$ packed form
13967a8440J2732N914K80308L18713m7236q0290M2924q0910m70281o93920j98970
13956i29456J57590O1162J22998Q3651m1647j76237j82856M28229K70382K81927
13946G5743L12353j17447K17097n568L985m21538k41832L5323K99747j59800k30443
13935b32380J28159J3140K50510J96829K25121j77065p1894k22268l0986l83636
13925c04470m98779O2075N9783j19148R3543K28441Q1245R4149l79589K4818L50588
13914c07344o5312l0244N3748L87703L01344m17941j37690N9802k92158L1483
13904d16609K01198o8290j20069N8461M04808J93766l0666r5370Q9794j1177k04741
13893A105j88688K2145J54108j40615K2608J08486k47094k40410J36354P6254
$$ plain form
13883 -295747 -158253 -38730 1300 137956 246474 -74048 -200714 -291139 -203234 -799
13873 -799 287183 342917 401280 475884 69215 -103975 -231146 -326450 -72440 103208 -207640
13862 -207640 -158893 149507 -7988 -334339 -322888 -46721 -185838 -13672 200961 452489
13852 452489 742024 312882 70212 295948 295039 -38523 -354001 -532922 -304415 53946
13842 53946 49029 79408 24058 157213 347370 160299 -40807 -93950 -17116 20166 -266009
13831 -266009 -468867 5737 -60699 -424677 -289777 75162 265348 323401 63504 -227105
13821 -227105 -392741 -266401 2673 38310 437607 391856 387442 380965 172531 -47229 -184037
13810 -184037 136293 434823 201029 22287 -2525 -16076 -102404 -60102 -112990 -98333 -83877
$$ packed form
13883b95747J37494J19523M0030J36656J08518l20522j26666r0425Q7905K02435
13873g99K87982N5734N8363P4604m06669j73190j27171r5304K54010J75648l10848
13862b07640M8747L08400j57495l26351J1451K76167j39117J72166K14633K51528
13852D52489K89535m29142k42670K25736r09l33562l15478j78921K28507L58361
13842E3946m917L0379n5350J33155J90157j87071k01106n3143P6834L7282k86175
13831b66009k02858M74604o6436l63978J34900L64939J90186N8053k59897k90609
13821b27105j65636J26340K69074L5637L99297m5751m414o477k08434k19760j36808
13810a84037L20330K98530k33794j78742k4812j3551q6328M2302n2888J4657J4456
$$ plain form
13799 -83877 -365012 -632241 -807531 -520313 -185261 5814 -333670 -313676 -338711 -617981
13789 -617981 -453670 -69286 265647 277149 157453 26467 -234445 -426719 -47042 167705
13779 167705 300587 250065 243141 292099 75285 -283378 -287657 -97247 261747 121417 76889
13768 76889 87364 181900 117392 -198800 -450851 -311986 -208616 -82052 486470 485596 219140
13757 219140 190428 -60162 -279325 -323949 -231997 141698 -82284 -335001 -147858 -3134
13747 -3134 -108515 -146943 -292048 -509478 -401596 -207889 -230395 -414100 -381500 -108293
13737 -108293 -231824 -456074 -363059 1116 397606 322173 222285 -167691 -253195 -254563 -71427
13726 -71427 294294 470426 510721 802943 717327 520429 415466 598331 250557 -105856
$$ packed form
13799h3877k81135k67229j75290K87218L35052J91075l39484J9994k5035k79270
13789f17981J64311L84384L34933J1502j19696j30986k60912j92274L79677K14747
13779A67705J32882n0522o924M8958k16814l58663m279J90410L58994j40330m4528
13768G6889J0475R4536o4508l16192k52051J38865J03370J26564N68522q74k66456
13757B19140k8712k50590k19163m4624R1952L73695k23982k52717J87143J44724
13747c134j05381l8428j45105k17430J07882J93707k2506j83705L2600K73207
13737a08293j23531k24250R3015L64175L96490p5433r9888l89976q5504j368J83136
13726g1427L65721J76132M0295K92222q5616j96898j04963J82865l47774l56413
$$ plain form
13716 -105856 -89232 97058 140396 170291 -359524 -219083 -297333 -156762 -191655 -262872 -113750
13705 -113750 189970 290270 445486 497770 14064 329694 904874 1035871 630336 351484
13695 351484 38240 -154007 13681 203011 435724 310916 202370 20975 -309491 -495432
13685 -495432 -519460 -565874 -809332 -503926 -117045 189058 -17243 -121002 11693 65764
13675 65764 218325 339045 380648 147325 156211 135292 496556 726212 387433 404245 552651
13664 552651 366215 480065 500607 722044 987583 900130 702923 601256 415755 387971
13654 387971 603686 637343 612321 353737 202245 19702 43996 194208 -3259 24839
13644 24839 -132556 -85730 -67830 49349 182538 344159 254478 289903 133142 86012 316460
$$ packed form
13716a05856J6624J86290M3338K9895n29815J40441p8250J40571l4893p1217J49122
13705a13750L03720J00300J55216N2284m83706L15630N75180J30997m05535k78852
13695C51484l13244j92247J67688J89330K32713j24808j08546j81395l30466j85941
13685d95432k4028m6414k43458L05406L86881L06103k06301j03759J32695N4071
13675F5764J52561J20720M1603k33323Q886k0919L61264K29656l38779J6812J48406
13664E52651j86436J13850K0542K21437K65539q7453j97207j01667j85501k7784
13654C87971K15715L3657k5022k58584j51492j82543K4294J50212j97467K8098
13644B4839j57395M6826J7900J17179J33189J61621q9681L5425j56761m7130K30448
$$ plain form
13633 316460 474298 618893 510376 769114 707217 409312 193384 308087 320014 109453
13623 109453 48485 -4113 -97859 82457 252702 63491 -188881 -33069 390213 293480
13613 293480 400984 653701 395673 114339 112668 22217 211264 198029 177240 195509 315065
13602 315065 112048 -30904 -3227 88376 296191 364228 157817 -40061 13901 60901
13592 60901 12154 -44611 -682 68290 -215257 240224 423520 344716 415700 500968 497759
13581 497759 223717 -23262 221267 355374 313823 264616 231751 22066 -50078 -120261
13571 -120261 809 77041 323204 -41676 38477 203622 124166 -39199 -98276 -89270 -148899
13560 -148899 31019 -159921 -181002 -173713 27672 -13754 139274 84256 -170596 -230822 -331719
$$ packed form
13633C16460J57838J44595j08517K58738o1897k97905k15928J14703J1927k10561
13623A09453o0968n2598r3746J80316J70245j89211k52372J55812M23282r6733
13613B93480J07504K52717k58028k81334j671r0451J89047j3235k0789J8269J19556
13602C15065k03017j42952K7677R1603K07815O8037k06411j97878N3962M7000
13592F0901m8747n6765M3929O8972k83547M55481J83296p8804P0984Q5268l209
13581D97759k74042k46979K44529J34107m1551m9207l2865k09685p2144p0183
13571a20261J21070P6232K46163l64880Q0153J65145p9456j63365n9077R006n9629
13560a48899J79918j90940k1081P289K01385m1426J53028n5018k54852o0226j00897
$$ plain form
13549 -331719 -487088 -65156 -81142 -315888 -520139 -731972 -312057 136912 155080 217709
13539 217709 31227 158280 230407 202757 362252 455183 75782 5071 201075 57849
13529 57849 -45584 -212875 -556494 -662377 -384393 -153245 -246635 -235704 -126814 -108450
13519 -108450 -250059 -219886 90223 363708 371735 90095 -170309 -115586 138507 184510
13509 184510 -119604 -99352 -256058 -511820 -207822 1392 -217571 -681529 -762236 -747176
13499 -747176 -633214 -72731 165636 171430 1590 85245 300050 153755 -185948 188851
13489 188851 265697 254517 140419 24603 137367 114295 -13344 18904 528259 452338
13479 452338 173827 -54997 1412 -120877 -143349 107743 245995 3601 -96687 -207217
$$ packed form
13549c31719j55369M21932j5986k34746k04251k11833M19915M48969J8168O2629
13539B17709j86482J27053P2127k7650J59495R2931l79401p0711J96004j43226
13529E7849j03433j67291l43619j05883K77984K31148r3390J0931J08890J8364
13519a08450j41609L0173L10109K73485Q027k81640k60404N4723K54093M6003
13509A84510l04114K0252j56706k55762L03998K09214k18963m63958q0707J5060
13499g47176J13962N60483K38367N794j69840Q3655K14805j46295l39703L74799
13489A88851P6846j1180j14098j15816J12764k3072j27639L2248N09355p5921
13479D52338k78511k28824N6409j22289k2472K51092J38252k42394j00288j10530
$$ plain form
13469 -207217 -150940 -172602 -182006 -172456 -314767 -288381 -202339 -263694 -105740 56306 231707
13458 231707 250198 340372 227920 20504 -168031 -102799 198287 295474 238500 118850
13448 118850 55673 6623 152629 159519 223634 316733 245096 329103 561373 548482 354132
13437 354132 289905 227487 186132 306841 325059 180166 -3212 67761 -42184 -35975 92404
13426 92404 54852 -141490 312616 430416 450329 354300 87021 -274230 -239948 -67006
13416 -67006 12866 -27623 -26658 -78084 -69041 90929 391374 269411 120751 315096 650881
13405 650881 364972 439752 303885 29422 52677 68050 40345 -98244 94507 116807
13395 116807 153893 405602 759102 615623 79364 -263683 -319991 -73088 118867 172882
$$ packed form
13469b07217N6277k1662r404R550j42311K6386Q6042o1355J57954J62046J75401
13458B31707J8491R0174j12452k07416j88535O5232L01086R7187n6974j19650
13448A18850o3177m9050J46006O890O4115R3099p1637Q4007K32270j2891j94350
13437C54132o4227o2418m1355J20709J8218j44893j83378P0973j09945O209J28379
13426I2404l7552j96342M54106J17800J9913r6029k67279l61251L4282J72942
13416f7006P9872m0489R65n1426R043J59970L00445j21963j48660J94345L35785
13405F50881k85909P4780j35867k74463K3255J5373k7705j38589J92751K2300
13395A16807L7086K51709L53500j43479n36259l43047n6308K46903J91955N4015
$$ plain form
13385 172882 -228019 -44658 278256 -158916 -454374 -581466 -765199 -404041 -28713 211435
13375 211435 434451 288705 259440 338206 605791 486959 464409 155515 -275058 -362313
13365 -362313 -60871 -293846 -252726 219101 409461 644674 500764 333038 233582 188292
13355 188292 14065 73910 88759 271709 533731 470764 274730 376285 145994 -777
13345 -777 73764 40053 -65081 -296186 -399565 -328792 -179055 122297 123675 -14317 -170058
13334 -170058 171793 516868 433709 82358 325139 596268 617322 500552 425393 381030
13324 381030 363852 187438 290330 539603 566761 513120 388987 501137 486876 439968
13314 439968 435246 409053 448373 366646 139550 39940 360496 850867 762093 294369 15059
$$ packed form
13385A72882m00901J83361L22914m37172k95458j27092j83733L61158L75328K40148
13375B11435K23016j45746k9265P8766K67585j18832k2550l08894m30573q7255
13365c62313L01442k32975M1120M71827J90360K35213j43910j67726r9456m5290
13355A88292j74227N9845J4849J82950K62022o2967j96034J01555k30291j46771
13345g77P4541l3711j05134k31105j03379P0773J49737L01352J378j37992j55741
13334a70058L41851L45075q3159l51351K42781K71129K1054j16770p5159m4363
13324C81030j7178j76414J02892K49273K7158n3641j24133J12150j4261m6908
13314D39968m722k6193L9320q1727k27096r9610L20556M90371q8774m67724k79310
$$ plain form
13303 15059 6544 27523 15853 -58043 200638 326315 29388 -139168 -2823 170563 250812
13292 250812 382472 496609 668072 495658 145962 503215 388783 -25753 200038 673765
13282 673765 476113 498272 388968 134714 140643 131339 391360 527048 456479 146932 262017
13271 262017 310884 244212 551623 508571 370546 419265 272720 409481 502136 575887 769522
13260 769522 680887 472021 231039 90303 -46841 -5509 4009 -97021 209192 299755
13250 299755 260363 107508 -112808 -51553 -132581 -73301 358880 521475 368366 229040
13240 229040 420711 525294 640766 529010 536950 609749 584011 452622 258421 262915 20654
13229 20654 319501 686491 350103 240086 397008 71033 255302 682668 819138 1048091
$$ packed form
13303A5059q515K0979j1670p3896K58681J25677k96927j68556J36345J73386Q0249
13292B50812J31660J14137J71463j72414l49696L57253j14432m14536K25791M73727
13282F73765j97652K2159j09304k54254N929r304K60021J35688p0569l09547J15085
13271B62017M8867o6672L07411m3052j38025M8719j46545J36761R2655P3751J93635
13260G69522q8635k08866k40982j40736j37144M1332R518j01030L06213R0563
13250B99755l9392j52855k20316O1255q1028N9280M32181J62595j53109j39326
13240B29040J91671J04583J15472j11756P940P2799k5738j31389j94201M494k42261
13229B0654K98847L66990l36388j10017J56922l25975J84269M27366J36470K28953
$$ plain form
13219 1048091 997864 807284 479107 236276 400473 165958 67929 210694 388681 417241
13209 417241 252354 296700 423290 549663 413597 244096 89104 258443 231894 335988
13199 335988 486459 465455 411917 -15123 46300 -18114 -47930 124634 34904 -47962 70803
13188 70803 -172041 -403780 -258816 -196176 -232999 -230998 133783 178046 23853 111086 38148
13177 38148 79152 71627 -350645 -250106 -113469 118707 133544 159897 222843 171670 422264
13166 422264 772679 859832 626638 583032 543720 638925 921325 1232776 953473 704679
13156 704679 1024737 660943 566136 373383 400971 644801 617670 539162 263882 269234 74086
13145 74086 120708 163444 164298 399707 568808 578291 376546 31573 76692 144654 200089
$$ packed form
13219A048091n0227j90580l28177k42831J64197k34515r8029J42765J77987K8560
13209D17241j64887M4346J26590J26373j36066j69501j54992J69339k6549J04094
13199C35988J50471k1004n3538m27040O1423o4414k9816J72564q9730q2866J18765
13188G0803k42844k31739J44964O2640l6823K001L64781M4263j54193Q7233p2938
13177C8148M1004p525m22272J00539J36637K32176J4837K6353O2946n1173K50594
13166D22264L50415Q7153k33194m3606l9312R5205K82400L11451k79303k48794
13156G04679L20058l63794r4807j92753K7588K43830k7131p8508k75280N352j95148
13145G4086M6622M2736Q54K35409J69101R483k01745l44973M5119O7962N5435
$$ plain form
13134 200089 408363 552098 641682 558906 279264 45576 55616 217444 425479 394282
13124 394282 374228 390305 328429 339322 332665 577172 673271 572728 666975 671931 1009197
13113 1009197 1047264 1186114 1109621 870669 610322 526957 420413 320574 455378 502604
13103 502604 469875 606589 750500 456332 381301 458084 548781 153788 -158502 -27479
13093 -27479 280158 439669 626000 548095 618252 920516 1097709 864324 996896 1068364
13083 1068364 726847 615058 982304 764296 604195 395972 148036 371810 188879
13074 188879 287693 565757 1102448 1191549 1129773 823274 692200 736440 699619 426611
13064 426611 347247 567200 667820 543605 323862 439061 369237 305882 396423 704655
$$ packed form
13134B00089K08274J43735Q9584q2776k79642k33688J0040J61828K08035l1197
13124C94282k0054J6077o1876J0893o657K44507R6099j00543R4247M956L37266
13113A009197L8067J38850p6493k38952k60347q3365j06544r9839J34804M7226
13103E02604l2729J36714J43911k94168p5031P6783R0697l94993l12290J31023
13093b7479L07637J59511J86331p7905P0157L02264J77193k33385J32572P1468
13083A068364l41517j11789L67246k18008j60101k08223k47936K23774j82931
13074A88879R8814K78064N36691Q9101o1776l06499j31074M4240l6821k73008
13064D26611p9364K19953J00620j24215k19743J15199o9824o3355R0541L08232
$$ plain form
13054 704655 557856 253346 560090 956369 1065803 798113 569262 779209 811579 1011043
13044 1011043 817176 557882 453964 90472 -91864 60827 610126 986965 1416751
13035 1416751 1007065 640120 729336 486163 206856 -156952 -28703 83805 42267 213912
13025 213912 857969 1235861 1260963 1294682 1394154 1125288 1045524 1022679 1236707 1297902 1185476
13014 1185476 783547 639047 631021 400472 512820 528628 498332 520363 439086 664558
13004 664558 886302 740535 994851 1073173 993673 935272 800908 711354 570081 345102
12994 345102 75814 289044 527437 311797 471722 764213 913295 937733 1100448 1222171
12984 1222171 1045998 685531 741184 719127 287180 182208 306893 591545 469180 714033
$$ packed form
13054G04655j46799l04510L06744L96279J09434k67690k28851K09947L2370J99464
13044A011043j93867k59294j03918l63492j82336J52691N49299L76839M29786
13035A416751m09686l66945Q9216k43173k79307l63808J28249J12508m1538J71645
13025B13912O44057L77892K5102L3719R9472k68866p9764k2845K14028O1195j12426
13014A185476m01929j44500q026k30549J12348J5808l0296K2031q1277K25472
13004F64558K21744j45767K54316P8322p9500n8401j34364q9554j41273k24979
12994C45102k69288K13230K38393k15640J59925K92491J49082K4438J62715J21723
12984A222171j76173l60467N5653k2057m31947j04972J24685K84652j22365K44853
$$ plain form
12974 714033 924136 898947 1047796 826500 513539 702692 829235 687644 537152 615139
12964 615139 555147 768294 831268 530275 474190 700049 828859 864337 856736 670776 735463
12953 735463 707486 974725 1208747 1132730 1115107 1233173 1175935 995395 834944 670729
12943 670729 721813 880352 1016603 1034931 1019114 1142810 1129873 1353008 1639385 1633031 1172580
12932 1172580 707018 681327 793134 530953 495869 458604 649876 822188 655151 718670
12922 718670 1028792 1240030 1095482 1546219 1385785 1042591 921384 769450 1164703 1495318
12912 1495318 1330247 1064082 834775 673929 479345 398456 227148 714739 785629 629205
12902 629205 475352 737466 681627 549668 555224 446169 560342 750453 714818 416294
$$ packed form
12974G14033K10103k5189J48849k21296l12961J89153J26543j41591j50492P7987
12964F15139n9992K13147O2974l00993n6085K25859J28810L5478p601j85960O4687
12953G35463k7977K67239K34022p6017j7623J18066n7238j80540j60451j64215
12943F70729N1084J58539J36251J8328j5817J23696j2937K23135K86377o354m60451
12932A172580m65562k5691J11807k62181l5084l7265J91272J72312j67037O3519
12922G18670L10122K11238j44548M50737j60434l43194j21207j51934L95253L30615
12912A495318j65071k66165k29307j60846j94584q0889j71308M87591P0890j56424
12902F29205j53853K62114n5839j31959N556j09055J14173J90111l5635k98524
$$ plain form
12892 416294 295946 618400 873559 857901 892535 744262 401634 179218 194128 397023
12882 397023 708971 772271 731314 735209 927123 779459 523555 313727 347434 560960
12872 560960 635721 904530 1166727 963957 1004576 753580 940006 1255761 1315712 1291024
12862 1291024 1182370 1363828 1652335 1585996 1624607 1676579 1440087 1255582 1250411 798744
12852 798744 482809 753364 1185609 1130737 1173949 1047089 898953 521905 385000 451195
12842 451195 773878 959403 1026588 758293 679546 1006948 1161357 839831 733894 645621
12832 645621 733055 1085662 1435846 1026726 700817 1157035 1262059 993897 936869 846502
12822 846502 852413 944960 1162600 1234872 1232589 1287950 1338780 1437713 1465693 1392692 1457455 1648166
$$ packed form
12892D16294j20348L22454K55159j5658L4634j48273l42628k22416J4910K02895
12882C97023L11948O3300m0957L895J91914j47664k55904k09828L3707K13526
12872E60960P4761K68809K62197k02770M0619k50996J86426L15755N9951k4688
12862A291024j08654J81458K88507o6339L8611N1972k36492j84505n171m51667
12852G98744l15935K70555M32245n4872M3212j26860j48136l77048j36905O6195
12842D51195L22683J85525O7185k68295p8747L27402J54409l21526j05937q8273
12832F45621Q7434L52607L50184m09120l25909M56218J05024k68162n7028r0367
12822H46502N911R2547K17640P2272k283N5361N0830R8933K7980p3001O4763J90711
$$ plain form
12810 1648166 1845158 1485248 1280601 1263112 1338627 1168935 811510 687186 587302 561020
12800 561020 524339 655692 874624 848612 731846 880251 853010 671658 659989 1288636
12790 1288636 1353216 1118254 1024747 1021706 1157157 1311381 1070398 1018828 962202 1007723 1111894
12779 1111894 1090106 1308332 1248122 716203 652353 754320 788797 999384 1126575 965978
12769 965978 1337383 1334912 929796 792371 827554 989917 1111596 1453726 1551677 1556906 1892730
12758 1892730 1959349 1557024 1500819 1484152 1665052 1529101 1346653 1243517 1175933 1045511
12748 1045511 996596 1140972 1238045 1018047 805014 823307 1225246 1288223 1199901 1083616
12738 1083616 936239 936950 1030313 824281 734391 717853 1006929 979247 1021884 1430872 1688171
$$ packed form
12810A648166J96992l59910k04647j7489P5515j69692l57425j24324r9884k6282
12800E61020l6681J31353K18932k6012j16766J48405k7241j81352j1669O28647
12790A288636O4580k34962r3507l041J35451J54224k40983n1570n6626M5521J04171
12779A111894k1788K18226o0210n31919o3850J01967L4477K10587J27191j60597
12769I65978L71405k471m05116j37425L5183J62363J21679L42130R7951N229L35824
12758A892730O6619m02325n6205j6667J80900j35951j82448j03136o7584j30422
12748A045511m8915J44376R7073k19998k13033J8293M01939O2977q8322j16285
12738A083616j47377P11R3363k06032q9890j6538K89076k7682M2637M08988K57299
$$ plain form
12727 1688171 1615368 1294203 957166 1136477 1328136 1422994 1541287 1713322 1829297 1420893
12717 1420893 1149685 1024853 1341302 1457343 1211353 866320 728631 989430 1200620
12708 1200620 1553950 1824419 1763308 1745847 1860922 1871005 1456616 1307682 1364700 1395514
12698 1395514 1391282 1109192 1270298 1304815 1499812 1769639 1934681 2076631 1992368 1913145
12688 1913145 1797965 1896637 1629380 1536746 1546303 1922759 2010509 1610808 1577125 1749777
12678 1749777 1760446 1601587 1733756 1916466 1810144 1510185 1698486 1714912 1427550 1226385
12668 1226385 1056132 1107887 1613511 1664121 1433250 1333647 1469532 1375654 1580166 1672759
12658 1672759 1745227 1796618 1816791 1598967 1882118 1991241 1566539 1735481 1702317 1517334
$$ packed form
12727A688171p2803l21165l37037J79311J91659R4858J18293J72035J15975m08404
12717A420893k71208j24832L16449J16041k45990l45033j37689K60799K11190
12708A200620L53330K70469o1111j7461J15075J0083m14389j48934N7018L0814
12698A395514m232k82090J61106L4517J94997K69827J65042J41950q4263p9223
12688A913145j15180R8672k67257r2634R557L76456Q7750l99701l3683J72652
12678A749777J0669j58859J32169J82710j06322k99959J88301J6426k87362k01165
12668A226385j70253N1755N05624N0610k30871r9603J35885r3878K04512R2593
12658A672759P2468N1391K0173k17824K83151J09123m24702J68942l3164j84983
$$ plain form
12648 1517334 1442969 1893954 1948106 1539843 1609780 1891482 2281937 2211072 1767499 1848385
12638 1848385 1887591 1865716 2053101 2127831 2025280 2178593 2094949 1917446 2111528 2395929
12628 2395929 2554952 2360783 2290434 2088465 1945405 1976346 2138398 2163522 2239350 2417438
12618 2417438 2231676 2037950 2007214 1783609 2040974 2133134 1771515 1482982 1545196 1954957
12608 1954957 2550074 2608488 2224275 2095708 2087576 2245829 2470438 2294207 2150933 2026015
12598 2026015 1934792 2083438 2297310 2063314 2006130 1872605 1949310 2226770 2277587 2461608
12588 2461608 2201210 1753667 1983558 1812276 1434460 1607368 2155303 2119709 1898625 1779266
12578 1779266 1854872 1822936 2142688 2451859 2264356 1967425 1951966 2079406 2366182 2794751
$$ packed form
12648A517334p4365M50985N4152m08263O9937K81702L90455p0865m43573Q0886
12638A848385L9206k1875J87385P4730j02551J53313q3644j77503J94082K84401
12628B395929J59023j94169p0349k01969j43060L0941J62052K5124P5828J78088
12618B417438j85762j93726l0736k23605K57365R2160l61619k88533O2214M09761
12608A954957N95117N8414l84213j28567q132J58253K24609j76231j43274j24918
12598B026015r1223J48646K13872k33996n7184j33525P6705K77460N0817J84021
12588B461608k60398m47543K29891j71282l77816J72908N47935l5594k21084j19359
12578A779266P5606l1936L19752L09171j87503k96931j5459J27440K86776M28569
$$ plain form
12568 2794751 2850375 2949801 3087820 2661276 2265240 2152935 2248178 2478707 2685505 2599320
12558 2599320 2677841 2823865 2637368 2375884 2605975 2860130 2836852 2740506 2675596 2815217
12548 2815217 2590241 2328698 2293754 2410990 2321687 2229062 2397311 2522102 1992405 2095977
12538 2095977 2240159 2254966 2463444 2717581 2794705 3194868 3329233 3187635 3453683 3781809
12528 3781809 3782245 3343039 2983113 2924379 2723533 2729824 2551504 2654322 2669035 2798390 2988836
12517 2988836 2733755 2646069 2478966 2442679 2745891 2610855 2849441 2954125 2972450 2985948
12507 2985948 2746029 2813710 2873630 3233594 3069090 2990729 3103920 3206771 3194152 3374185
12497 3374185 3514920 3346833 3301467 3202036 3030641 3467138 3796449 3623674 3307845 3272233
$$ packed form
12568B794751N5624R9426J38019m26544l96036j12305R5243K30529K06798q6185
12558B599320P8521J46024j86497k61484K30091K54155k3278r6346o4910J39621
12548B815217k24976k61543l4944J17236q9303r2625J68249J24791n29697J03572
12538B095977J44182J4807K08478K54137P7124M00163J34365j41598K66048L28126
12528C781809M36m39206l59926n8734k00846O291j78320J02818J4713J29355J90446
12517B988836k55081q7686j67103l6287L03212j35036K38586J04684J8325J3498
12507B985948k39919O7681N9920L59964j64504p8361J13191J02851j2619J80033
12497C374185J40735j68087m5366r9431j71395M36497L29311j72775l15829l5612
$$ plain form
12487 3272233 3312054 3036389 3303939 3672739 3629982 3450905 3395315 3376963 3532013 3663524
12477 3663524 3333969 3464261 3788814 3824916 3524014 3263923 3393685 3496875 3567585 3527068
12467 3527068 3642930 3787210 3701398 3470697 3352696 3410183 3419650 3643343 3762184 3951277
12457 3951277 3836570 3736811 3838370 3891666 3799987 3522626 3755830 3965854 4153883 3796708
12447 3796708 3456719 3679340 3804490 3592398 3541919 3632848 3738837 4061549 4226838 4087969
12437 4087969 3942812 3696704 3970040 4163934 4060905 4033403 4277560 4297614 4049929 4200595
12427 4200595 4133314 3944634 4217015 4258127 4101443 4494081 4433405 4469453 4443031 4341000
12417 4341000 4324061 4288756 4118831 4122925 4607438 4572829 4424931 4305703 4533159 4950795
$$ packed form
12487C272233L9821k75665K67550L68800m2757j79077n5590j8352J55050J31511
12477C663524l29555J30292L24553L6102l00902k60091J29762J03190P0710m0517
12467C527068J15862J44280q5812k30701j18001N7487R467K23693J18841J89093
12457C951277j14707r9759J01559N3296r1679k77361K33204K10024J88029l57175
12447C796708l39989K22621J25150k12092n0479R0929J05989L22712J65289j38869
12437D087969j45157k46108K73336J93894j03029k7502K44157K0054k47685J50666
12427D200595o7281j88680K72381M1112j56684L92638o0676L6048k6422j02031
12417D341000j6939l5305j69925M094M84513l4609j47898j19228K27456M17636
$$ plain form
12407 4950795 4948359 4942739 4931351 4725261 4577393 4654658 4690099 4427524 4390229 4493904 4918113
12396 4918113 4973014 5039685 5226184 5496540 5635974 5354728 5317390 5208938 5359921 5810729
12386 5810729 5661364 5295752 5037642 4960428 5026537 5168646 5071975 5109631 4808254 4464957
12376 4464957 4522685 4700278 4902872 5259351 5524905 5635255 5484615 5321204 5364353 5195756
12366 5195756 5179231 5358833 5660882 5638601 5659992 5428623 5412295 5697827 6005706 6204914
12356 6204914 5952688 5554417 5569377 5684042 5512397 5229611 5431055 5768712 6011900 5873624
12346 5873624 5883965 6066999 6217135 6178792 5981069 6089078 6308443 6542282 6605266 6650352
12336 6650352 6592402 6597910 6233018 6053791 6137921 6333608 6647580 6726828 6589776 6711075
$$ packed form
12407D950795k436n620j1388k06090j47868P7265L5441k62575l7295J03675M24209
12396D918113N4901O6671J86499K70356J39434k81246l7338j08452J50983M50808
12386E810729j49365l65612k58110p7214O6109J42109r6671L7656l01377l43297
12376D464957N7728J77593K02594L56479K65554J10350j50640j63411M3149j68597
12366E195756j6525J79602L02049k2281K1391k31369j6328K85532L07879J99208
12356F204914k52226l98271J4960J14665j71645k82786K01444L37657K43188j38276
12346E873624J0341J83034J50136l8343j97723J08009K19365K33839O2984M5086
12336F650352n7950N508l64892j79227Q4130J95687L13972P9248j37052J21299
$$ plain form
12326 6711075 6471417 6318087 6425297 6650285 6749790 6679752 6566268 6696975 6508575 6749094
12316 6749094 7039693 7129238 7185471 7341379 7442474 7706410 7280610 6802550 6590669 6353374
12306 6353374 6338237 6804580 7113113 6856073 6960256 7022474 7027665 7016160 6715230 6702944
12296 6702944 7056079 6860630 6760445 7058689 7273520 7189411 7239833 7247318 7356353 7274666
12286 7274666 7464087 7969541 8070421 8134470 8152011 8202481 8006298 7789470 7659157 7878339
12276 7878339 7762627 7884869 7698728 7634919 7669268 8034517 8475550 8333428 8163423 8309532
12266 8309532 8533703 8662826 8309663 8140977 8459844 8618211 8579231 8361166 8168458 8638908
12256 8638908 8983105 9110676 9128197 8946942 9148976 9193399 8720864 8416061 8543513 9018483
$$ packed form
12326F711075k39658j53330J07210K24988R9505p0038j13484J30707j88400K40519
12316F749094K90599Q9545N6233J55908J01095K63936m25800m78060k11881k37295
12306F353374j5137M66343L08533k57040J04183O2218N191j1505l00930j2286
12296F702944L53135j95449j00185K98244K14831q4109N0422P485J09035q1687
12286G274666J89421N05454J00880O4049J7541N0470j96183k16828j30313K19182
12276G878339j15712J22242j86141o3809L4349L65249M41033j42122j70005J46109
12266H309532K24171J29123l53163j68686L18867J58367l8980k18065j92708M70450
12256H638908L44197J27571J7521j81255K02034M4423m72535l04803J27452M74970
$$ plain form
12246 9018483 9332166 9257976 9488056 9493467 9303673 9419588 9586085 9236883 9104280 9327530
12236 9327530 9666200 10230340 10340542 10078804 9884340 9773561 10116403 10097851 10007038 10003263
12226 10003263 9989863 10426982 10567283 10276313 10249331 10119622 10006490 10214664 10092529 9856216
12216 9856216 10343389 10990163 11169808 11034534 10711641 10818054 10855491 11079490 11474052 11397726
12206 11397726 11410901 11263253 11352974 11654534 11316172 11106196 11482097 11779339 11958972 12221439
12196 12221439 12379771 12457635 12570533 12515834 12249085 12104045 12217813 12437001 12397904 12512538
12186 12512538 12501455 12263045 12603955 12778167 12901975 13180835 13311155 13564792 13598645 13856325
12176 13856325 13595529 13519544 13493129 13692558 13976092 14344242 14489363 14653173 14776513 15048591
$$ packed form
12246I018483L13683p4190K30080N411j89794J15915J66497l49202j32603K23250
12236I327530L38670N64140J10202k61738j94464j10779L42842j8552r0813l775
12226A0003263j3400M37119J40301k90970k6982j29709j13132K08174j22135k36313
12216I856216M87173O46774J79645j35274l22893J06413L7437K23999L94562p6326
12206A1397726J3175j47648Q9721L01560l38362k09976L75901K97242J79633K62467
12196A2221439J58332P7864J12898n4699k66749j45040J13768K19188l9097J14634
12186A2512538j1083k38410L40910J74212J23808K78860J30320K53637L3853K57680
12176A3856325k60796p5985k6415J99429K83534L68150J45121J63810J23340K72078
$$ plain form
12166 15048591 14781863 14640054 14181544 13880372 14065052 14817575 15308458 14864090 14518070
12157 14518070 14564461 15111340 15345297 15376135 15158552 15299405 15319264 15592564 15726755 15477686
12147 15477686 15538628 15701441 15983974 16248678 16079291 16219495 16617705 16467837 16357945
12138 16357945 16296804 16471905 16923796 17135486 17182969 17305446 17575556 17406419 17446198 17755044
12128 17755044 18145848 18334697 18139682 17950443 18064042 18262198 18623096 18719019 18565090
12119 18565090 18422105 18652881 18975703 18947801 19347141 19432271 19644224 19835517 19774373 19808549
12109 19808549 20127893 20043687 19969159 20354607 20874137 20770225 20586514 20470966 20745062 21095751
12099 21095751 21139648 21165840 21445987 21681364 21865084 21860545 21719239 21613304 21854104 22217872
$$ packed form
12166A5048591k66728j41809m58510l01172J84680P52523M90883m44368l46020
12157A4518070M6391N46879K33957L0838k17583J40853J9859K73300J34191k49069
12147A5477686O0942J62813K82533K64704j69387J40204L98210j49868j09892
12138A6357945o1141J75101M51891K11690M7483J22477K70110j69137L9779L08846
12128A7755044L90804J88849j95015j89239J13599J98156L60898R5923j53929
12119A8565090j42985K30776L22822k7902L99340Q5130K11953J91293o1144L4176
12109A9808549L19344q4206p4528L85448N19530j03912j83711j15548K74096L50689
12099B1095751M3897K6192K80147K35377J83720m539j41306j05935K40800L63768
$$ plain form
12089 22217872 22508662 22634901 22602866 22600920 22884526 23070421 23106606 23428564 23870496 24051101
12079 24051101 23975253 24010685 24096795 24273544 24913737 25006439 24865553 24926056 24932445 25225722
12069 25225722 25300270 25701703 26203593 26468289 26243158 26513578 26635042 26892367 27057375
12060 27057375 27001031 26999238 27513710 27954624 28373716 28739407 29078279 29514418 29930805 30432766
12050 30432766 31051705 31395935 32029910 32875249 34106116 34966638 35966980 37382297 39106814
12041 39106814 40864151 42871735 45680264 49215464 53172366 57466751 62371865 68212834
12033 68212834 74249199 79586719 83763104 85861157 84895002 81639053 76238770 70427620
12025 70427620 64939969 60453553 57345485 54940699 53019745 51822691 51540692 51523826
$$ packed form
12089B2217872K90790J26239l2035j946K83606J85895L6185L21958M41932J80605
12079B4051101p5848L5432Q6110J76749O40193R2702j40886O0503O389K93277
12069B5225722P4548M01433N01890K64696k25131K70420J21464K57325J65008
12060B7057375n6344j793N14472M40914M19092L65691L38872M36139M16387N01961
12050C0432766O18939L44230O33975Q45339J230867Q60522J000342J415317J724517
12041C9106814J757337K007584K808529L535200L956902M294385M905114N840969
12033F8212834O036365N337520M176385K098053r66155l255949n400283n811150
12025G0427620n487651m486416l108068k404786j920954j197054k81999j6866
$$ plain form
12017 51523826 51487525 52339316 54231274 56828922 59781817 62802576 66918688 72343055
12009 72343055 78232699 84656169 91334614 97435594 101280481 101463881 97379731 90295349
12001 90295349 81742509 73810747 67222825 62173016 58360044 55608429 53483578 52272372
11993 52272372 51592547 50951885 50559164 50698865 51208006 52014674 52772737 53732010 55087529
11984 55087529 57069786 59409306 62699157 66702248 71651821 77165119 83661117 91320030
11976 91320030 99015389 105792574 110530719 110921672 105979748 97233232 87677995 79160930
11968 79160930 72432145 67864284 64930332 63087542 61807398 61280773 61391702 61776918
11960 61776918 62802618 64316399 66245007 68708175 71761505 75223838 79726581 84969397
$$ packed form
12017E1523826l6301Q51791J891958K597648K952895L020759M116112N424367
12009G2343055N889644O423470O678445O100980L844887J83400m084150p084382
12001I0295349q552840p931762o587922n049809l812972k751615k124851j211206
11993E2272372o79825o40662l92721J39701N09141Q06668P58063R59273J355519
11984E5087529J982257K339520L289851M003091M949573N513298O495998P658913
11976I1320030P695359O777185M738145L90953m941924q746516r555237q517065
11968G9160930o728785m567861k933952j842790j280144n26625J10929L85216
11960F1776918J025700J513781J928608K463168L053330L462333M502743N242816
$$ plain form
11952 84969397 90448486 95715930 100491785 103910951 104866266 102730418 97347611 89863012
11944 89863012 81783199 74859970 69212423 64648226 61204721 58202035 56003234 54798207
11936 54798207 53594245 52292258 51577956 51269706 50426460 49747063 48981944 48276790 48167235
11927 48167235 47870295 47509363 47376443 46809659 46425342 46419404 46144812 45692513 45475435 45439347
11917 45439347 45523745 45459138 45503635 45656609 45374817 44943407 44865410 44841917 44964150 45065857
11907 45065857 44454757 44196189 44007916 43653883 43434933 43331452 43366200 43234212 42955629
11898 42955629 43169718 43048265 43013313 42985934 42710535 42454455 42657222 42478791 42190471 42242751
11888 42242751 42068171 42016505 41904996 41615429 41247891 41063747 41219138 41174577 40920554 40747409
$$ packed form
11952H4969397N479089N267444M775855L419166R55315k135848n382807p484599
11944H9863012q079813o923229n647547m564197l443505l002686k198801j205027
11936E4798207j203962j301987p14302l08250q43246o79397p65119p05154j09555
11927D8167235k96940l60932j32920n66784l84317n938k74592m52299k17078l6088
11917D5439347Q4398o4607M4497J52974k81792m31410p7997k3493J22233J01707
11907D5065857o11100k58568j88273l54033k18950j03481L4748j31988k78583
11898D2955629K14089j21453l4952k7379k75399k56080K02767j78431k88320N2280
11888D2242751j74580n1666j11509k89567l67538j84144J55391m4561k54023j73145
$$ plain form
11878 40747409 40653543 40571847 40373459 40225267 40113496 40180177 40127878 39867105 39896354 39572566
11868 39572566 39376991 39125653 38870650 38444418 38454369 38403520 38423073 38357153 38224450 38018500
11858 38018500 37679612 37426070 37315228 37115663 36667433 36601123 36651652 36550657 36584425 36268074
11848 36268074 36151054 36210576 35949645 35969853 35758867 35373625 35046575 34916550 34686422 34397040
11838 34397040 34103288 34174427 34322136 34279700 33761161 33287296 32974720 33137351 33141147 33113694
11828 33113694 32822337 32651441 32692925 32737920 32655432 32087662 31710390 31742842 31816798 31718735
11818 31718735 31361514 30860117 30911927 30833630 30973182 31228897 31117745 30534522 30202190 30109406
11808 30109406 29802853 29374307 29491232 29240867 28962808 28777254 28586474 28354576 28261805
$$ packed form
11878D0747409r3866q1696j98388j48192j11771O6681n2299k60773K9249l23788
11868C9572566j95575k51338k55003m26232R951n0849J9553o5920j32703k05950
11858C8018500l38888k53542j10842j99565m48230o6310N0529j00995L3768l16351
11848C6268074j17020N9522k60931K0208k10986l85242l27050j30025k30128k89382
11838C4397040k93752P1139J47709m2436n18539m73865l12576J62631L796k7453
11828C3113694k91357j70896M1484M4995q2488n67770l77272L2452P3956r8063
11818C1718735l57221n01397N1810p8297J39552K55715j11152n83223l32332r2784
11808C0109406l06553m28546J16925k50365k78059j85554j90780k31898r2771
$$ plain form
11799 28261805 28090357 28139303 27699286 26941221 26920155 26916395 27216047 27649729 27200368 26689341
11789 26689341 26326073 26069756 26266648 26316678 26265828 25786316 25476662 25397026 25396658 25191796
11779 25191796 24987805 24733868 24658160 24535749 24390957 24587845 24454847 24218645 24158078 24027611
11769 24027611 23876290 23745302 23449618 23212936 23134767 22810797 22735192 22636362 22542960 22324070
11759 22324070 22416925 22199713 21702587 21486146 21373648 21336153 21401646 21241726 20834471 20715363
11749 20715363 20747361 21041087 20859542 20824756 20648545 20125561 19770096 19897427 20073479 20060263
11739 20060263 19837367 19517602 19373705 19336986 19058917 19004248 19051749 19164823 18915336 18553968
11729 18553968 18513512 18319087 17974220 17768946 17731421 17821121 17952805 17978751 17739719 17698863
$$ packed form
11799B8261805j71448M8946m40017p58065k1066l760K99652M33682m49361n11027
11789B6689341l63268k56317J96892N0030n0850m79512l09654p9636l68k04862
11779B5191796k03991k53937p5708j22411j44792J96888j32998k36202o0567j30467
11769B4027611j51321j30988k95684k36682p8169l23970p5605r8830r3402k18890
11759B2324070R2855k17212m97126k16441j12498l7495O5493j59920m07255j19108
11749B0715363L1998K93726j81545l4786j76211n22984l55465J27331J76052j3216
11739B0060263k22896l19765j43897l6719k78069n4669M7501J13074k49487l61368
11729A8553968m0456j94425l44867k05274l7525Q9700J31684K5946k39032m0856
$$ plain form
11719 17698863 17789059 17273491 17358366 17349961 17121827 17073061 17109534 17084200 16626710 16259815
11709 16259815 16272842 16258709 15983125 15821497 15434707 15615660 15813574 15824534 15870537 15741120
11699 15741120 15966845 15931030 15764414 15634574 15351296 14981243 14712652 14488497 14449573 14624139
11689 14624139 14602382 14844277 14809105 14794862 14627704 14332801 14091449 13920712 13818584 14055685
11679 14055685 13666779 13612846 13646746 13462534 13754846 13908378 13921426 14081988 14121964 14185142
11669 14185142 14125382 13827694 13684274 13259264 12884879 12663561 12482582 12319115 12407532 12560094
11659 12560094 12560246 12409854 12361798 12230344 12011265 11737576 11658159 11697449 11885009 12170064
11649 12170064 12023138 11989763 11920780 11567720 11439051 11599098 11529567 11879405 11807589 11694764
$$ packed form
11719A7698863R0196n15568Q4875q405k28134m8766L6473k5334m57490l66895
11709A6259815J3027j4133k75584j61628l86790J80953J97914J0960M6003j29417
11699A5741120K25725l5815j66616j29840k83278l70053k68591k24155l8924J74566
11689A4624139k1757K41895l5172j4243j67158k94903k41352j70737j02128K37101
11679A4055685l88906n3933L3900j84212K92312J53532J3048J60562L9976O3178
11669A4185142n9760k97688j43420m25010l74385k21318j80979j63467Q8417J52562
11659A2560094J52j50392m8056j31454k19079k73689p9417L9290J87560K85055
11649A2170064j46926l3375o8983l53060j28669J60047o9531L49838p1816j12825
$$ plain form
11639 11694764 11253140 11128344 11032981 10779053 10518813 10552227 10515439 10443170 10357074 10581635
11629 10581635 10776398 10804140 10605484 10249323 10013153 9898506 9887380 9955718 10145018 10072700
11619 10072700 9729171 9738715 10175795 9942826 9304183 9259672 9594984 9191210 9047091 9210228
11609 9210228 9518413 9568776 9613215 9718459 9618105 9600623 9466465 9324515 9454274 9101833
11599 9101833 9454493 9709582 9620442 9129555 8838852 8493757 8882356 9256645 9317953 9105232
11589 9105232 9064017 8960582 9102014 9131496 8833583 8604896 8782373 8860683 8355735 8258925
11579 8258925 7979970 8166921 8348648 8287942 7918201 7950779 8233050 8127019 7978730 7652208
11569 7652208 7566748 7626517 7867534 8030590 8047248 7862803 7472261 7400844 7635471 7746447
$$ packed form
11639A1694764m41624j24796r5363k53928k60240L3414l6788p2269q6096K24561
11629A0581635J94763K7742j98656l56161k36170j14647j1126O8338J89300p2318
11619A0072700l43529R544M37080k32969o38643m4511L35312m03774j44119J63137
11609I210228L08185N0363M4439J05244j00354j7482j34158j41950J29759l52441
11599I101833L52660K55089q9140m90887k90703l45095L88599L74289O1308k12721
11589I105232m1215j03435J41432K9482k97913k28687J77477P8310n04948r6810
11579H258925k78955J86951J81727o0706l69741L2578K82271j06031j48289l26522
11569G652208q5460N9769K41017J63056J6658j84445l90542p1417K34627J10976
$$ plain form
11559 7746447 7534242 7640984 7746400 7817463 7614362 7232673 7176738 7185727 7211234 7187149
11549 7187149 7053121 6939869 7293557 7254083 6863315 6823406 7067326 6749341 6932979 7180002
11539 7180002 7232905 6882556 6650083 6508183 6453014 6534085 6741282 6514713 6219102 5975388
11529 5975388 6261596 6436627 6446218 6501206 6293675 6451855 6673591 6887762 6765958 6652354
11519 6652354 6456058 6597885 6556952 6479600 6878160 6975961 6716959 6544237 6564946 6587000
11509 6587000 6097018 5825849 5834658 5874220 6158533 6120728 5736022 5308248 5356052 5215926
11499 5215926 5050658 5080636 5222422 5705595 5875820 5851332 5811723 5593944 5309134 4998510
11489 4998510 5116774 5451365 5702455 5519813 5381732 5451199 5477859 5353983 5079616 4835346
$$ packed form
11559G746447k12205J06742J05416P1063k03101l81689n5935Q989K5507k4085
11549G187149j34028j13252L53688l9474l90768l9909K43920l17985J83638K47023
11539G180002N2903l50349k32473j41900n5169Q1071K07197k26569k95611k43714
11529E975388K86208J75031R591N4988k07531J58180K21736K14171j21804j13604
11519F652354j96296J41827m0933p7352L98560R7801k59002j72722K0709K2054
11509F587000m89982k71169Q809L9562K84313l7805l84706m27774M7804j40126
11499E215926j65268K9978J41786M83173J70225k4488l9609k17779k84810l10624
11489D998510J18264L34591K51090j82642j38081O9467K6660j23876k74367k44270
$$ plain form
11479 4835346 4711887 4670536 4527000 4687208 4702431 4771178 4725498 4597637 4979870 5086351
11469 5086351 4883234 4642766 4634734 4947714 4857193 4602483 4394352 4357920 4155280 4265283
11459 4265283 4701602 4871825 5111233 4630947 4447236 4430609 4085735 4006887 4034433 4255552
11449 4255552 4628081 4757731 4632875 4501751 4313287 4299276 4293719 3918775 3734918 3921627
11439 3921627 4296016 4366226 4406122 4304320 4187457 4396003 4355441 4443293 4460834 4640553
11429 4640553 4581514 4006099 3769446 3556941 3782400 3868439 3646004 3943013 4429695 4280338
11419 4280338 3737740 3642672 3761115 4020211 3685972 3703849 3569466 3517663 3772289 3925541
11409 3925541 3882898 3655689 3719931 3482694 3212817 3526533 3853453 4022195 3911589 4031825
$$ packed form
11479D835346j23459m1351j43536J60208J5223O8747m5680j27861L82233J06481
11469E086351k03117k40468q032L12980r0521k54710k08131l6432k02640J10003
11459D265283M36319J70223K39408m80286j83711j6627l44874p8848K7546K21119
11449D255552L72529J29650j24856j31124j88464j4011n557l74944j83857J86709
11439C921627L74389P0210L9896j01802j16863K08546m0562Q7852J7541J79719
11429D640553n9039n75415k36653k12505K25459Q6039k22435K97009M86682j49357
11419D280338n42598r5068J18443K59096l34239J7877j34383n1803K54626J53252
11409C925541m2643k27209O4242k37237k69877L13716L26920J68742j10606J20236
$$ plain form
11399 4031825 4041314 4048164 3845322 3636612 3847447 3915734 4092645 3988534 3876977 3811775
11389 3811775 3569335 3279215 3217445 3443635 3559854 3735057 3708498 3753979 3660676 3443337
11379 3443337 3383909 3539622 3633674 3572628 3594128 3632583 3474843 2898620 2719460 2764904
11369 2764904 2910695 2956322 3253040 3650231 3379241 2981556 2832005 2955371 2934368 2755610
11359 2755610 2935763 3062351 2574211 2437946 2626342 2993215 3195715 3133134 3103553 3006590
11349 3006590 2909614 3138456 3131577 2901226 3090213 3399422 3530416 3458733 3171263 2986046
11339 2986046 2905809 3262191 3357205 3246030 3030215 2943399 2605856 2706458 2957102 3122412
11329 3122412 2999374 2826833 2897993 2857779 2473417 2408906 2659683 3081408 3265280 3172090
$$ packed form
11399D031825R489O850k02842k08710K10835O8287J76911j04111j11557o5202
11389C811775k42440k90120o1770K26190J16219J75203k6559M5481r3303k17339
11379C443337n9428J55713R4052o1046K1500L8455j57740n76223j79160M5444
11369B764904J45791M5627K96718L97191k70990l97685j49551J23366k1003j78758
11359B755610J80153J26588m88140j36265J88396L66873K02500o2581k9581r6963
11349C006590r6976K28842o879k30351J88987L09209J30994p1683k87470j85217
11339B986046q0237L56382R5014j11175k15815q6816l37543J00602K50644J65310
11329C122412j23038j72541P1160m0214l84362o4511K50777M21725J83872r3190
$$ plain form
11319 3172090 2905162 2376390 2023250 2149074 2168494 2366782 2318388 2317869 2774285 2857661
11309 2857661 2729382 2660520 2546535 2541658 2485777 2508029 2199530 2044260 2337701 2475368
11299 2475368 2634745 2722501 2541728 2425345 2636718 2902086 3044868 2903268 2514709 2361632
11289 2361632 2326038 2270283 2271778 2434373 2677019 2796165 2746512 2571875 2501221 2666444
11279 2666444 2534313 2480206 2378739 2282565 2138439 2155227 2099981 1984296 2246315 2382080
11269 2382080 2299310 2297879 2042902 2104396 1871593 1816884 1462059 1166968 1406313 1449806
11259 1449806 1671049 1823658 1865482 1767660 1711210 1933316 1957396 2014210 2061955 2216629
11249 2216629 2619903 2406265 2250966 2088521 2448959 2386456 2085153 2089086 2027988 2065607
$$ packed form
11319C172090k66928n28772l53140J25824J9420J98288m8394n19M56416Q3376
11309B857661j28279o8862j13985m877n5881K2252l08499j55270K93441J37667
11299B475368J59377Q7756j80773j16383K11373K65368J42782j41600l88559j53077
11289B361632l5594n5755J495J62595K42646J19146m9653j74637p0654J65223
11279B666444j32131n4107j01467r6174j44126J6788n5246j15685K62019J35765
11269B382080q2770j431k54977O1494k32803n4709l54825k95091K39345M3493
11259A449806K21243J52609M1824r7822n6450K22106K4080N6814M7745J54674
11249B216629M03274k13638j55299j62445L60438o2503l01303L933o1098L7619
$$ plain form
11239 2065607 2395551 2438565 1931044 1575026 1529444 1630913 1442264 1304969 1234421 1412138
11229 1412138 1497515 1527412 1690772 1832092 2101525 2145033 1701482 1741106 1843557 1678631
11219 1678631 2009931 1821448 1310981 1088878 1092316 1042259 1016342 1178671 1406569 1561527
11209 1561527 1283714 1035048 1042674 1125876 881901 1218208 1517593 1440563 1338185 1678482
11199 1678482 1549736 1024313 820044 882943 1089830 1344201 1336098 1394761 1511239 1528375
11189 1528375 1413169 1122910 882481 651913 470710 718694 766827 744802 1126380 1013947
11179 1013947 778954 589921 522331 747145 1049415 1330955 1283470 878097 687966 645154
11169 645154 609844 929228 685300 778635 820404 708819 807879 1139054 1137247 1116773 1064514
$$ packed form
11239B065607L29944M3014n07521l56018m5582J01469j88649j37295p0548J77717
11229A412138Q5377K9897J63360J41320K69433M3508m43551L9624J02451j64926
11219A678631L31300j88483n10467k22103L438n0057k5917J62329K27898J54958
11209A561527k77813k48666P626Q3202k43975L36307K99385p7030j02378L40297
11199A678482j28746n25423k04269O2899K06887K54371q103N8663J16478J7136
11189A528375j15206k90259k40429k30568j81203K47984M8133k2025L81578j12433
11179A013947k34993j89033o7590K24814L02270K81540m7485m05373j90131m2812
11169F45154l5310L19384k43928R3335M1769j11585R9060L31175j807k0474n2259
$$ plain form
11158 1064514 1012104 1006823 1167281 1089970 1002973 1214635 1287035 1467097 1261439 1217064 1120117
11147 1120117 820012 794979 882913 1195170 1086806 924577 813676 852419 722054 764543
11137 764543 908466 1137395 1260854 1348116 1484291 1150136 879777 953601 1117120 850323
11127 850323 764661 676522 654431 677241 532491 370217 433694 521461 810812 1041080 1204293
11116 1204293 1352048 1010767 760558 653991 1011581 951098 1013669 1171546 1222684 933355
11106 933355 926139 795417 682156 967841 855408 678878 810749 954129 944224 904899
11096 904899 696955 662811 403666 220800 319585 406340 847778 1415895 1162246 764046
11086 764046 670956 659104 438067 642891 847272 509661 336907 462056 563491 376930
$$ packed form
11158A064514n2410n281J60458p7311q6997K11662P2400J80062k05658m4375r6947
11147A120117l00105k5033Q7934L12257j08364j62229j10901L8743j30365M2489
11137G64543J43923K28929J23459Q7262J36175l34155k70359P3824J63519k66797
11127H50323q5662q8139k2091K2810j44750j62274O3477Q7767K89351K30268J63213
11116A204293J47755l41281k50209j06567L57590o0483O2571J57877N1138k89329
11106I33355p216j30722j13261K85685j12433j76530J31871J43380r905l9325
11096I04899k07944l4144k59145j82866R8785Q6755M41438N68117k53649l98200
11086G64046r3090j1852k21037K04824K04381l37611j72754J25149J01435j86561
$$ plain form
11076 376930 241189 404130 397439 617889 504322 520620 396829 561526 679993 580679
11066 580679 752119 629844 500700 368573 419404 612949 715822 580701 722829 686341
11056 686341 522691 127455 151041 -35926 344965 877924 1031183 1017259 1000259 1433955
11046 1433955 1768809 1651944 1733849 1674027 1603000 1787996 1975479 1857352 2261085 2635391
11036 2635391 2975828 3420266 4034449 4555614 4856095 4638962 4579901 4728176 5130111 5672826
11026 5672826 6258056 6932628 8212551 9835099 12138876 14516075 17627997 21423666
11018 21423666 25678874 30930260 36716532 42888069 49052086 54486566 57121143 56008469
11010 56008469 51000572 44437902 37624332 31280682 26258872 22761039 20258694 18318231
$$ packed form
11076C76930j35741J62941o691K20450j13567J6298j23791J64697J18467r9314
11066E80679J71440j22275j29144j32127N0831J93545J02873j35121J42128l6488
11056F86341j63650l95236K3586j86967L80891N32959J53259j3924j7000M33696
11046A433955L34854j16865Q1905n9822p1027J84996J87483j18127M03733L74306
11036B635391L40437M44438O14183N21165L00481k17133n9061J48275M01935N42715
11026E672826N85230O74572J279923J622548K303777K377199L111922L795669
11018B1423666M255208N251386N786272O171537O164017N434480K634577j112674
11010E6008469n007897o562670o813570o343650n021810l497833k502345j940463
$$ plain form
11002 18318231 17124817 16038730 15403445 15095930 15283872 15864081 17140818 19137246 21653842
10993 21653842 25057614 29283335 34283821 40105582 46522809 52321284 56417132 56892202
10985 56892202 53004395 45953484 37850304 30074901 24225946 19987523 16722146 13846162
10977 13846162 12039034 10625374 9582418 8482015 7494536 6615965 5794429 5460128 5193057
10968 5193057 4926606 4591308 4402881 3954225 3985567 3468531 3052265 3391869 3405976 3010026
10958 3010026 2671192 2596838 2695282 2680743 2612696 2813503 2546420 2414176 2225512 2135352
10948 2135352 1822402 1740264 1624854 1521336 1748431 2026715 2010655 2047221 1813682 1537023
10938 1537023 1565377 1219482 1366351 1908067 2013175 1779979 2197599 2752742 3231341 3101466
$$ packed form
11002A8318231j193414j086087o35285l07515J87942N80209J276737J996428K516596
10993B1653842L403772M225721N000486N821761O417227N798475M095848M75070
10985E6892202l887807p050911q103180p775403n848955m238423l265377k875984
10977A3846162j807128j413660j042956j100403r87479q78571q21536l34301k67071
10968E193057k66451l35298j88427m48656L1342n17036m16266L39604J4107l95950
10958C010026l38834p4354R8444j4539o8047K00807k67083j32244j88664r0160
10948B135352l12950q2138j15410j03518K27095K78284j6060L6566k33539k76659
10938A537023K8354l45895J46869N41716J05108k33196M17620N55143M78599j29875
$$ plain form
10928 3101466 3161713 3555489 4206355 4975065 5583762 6147879 6559695 7233932 8444310
10919 8444310 10098959 12496116 15483770 18796955 22776748 28049553 34445566 42151137
10911 42151137 50793424 59933288 68566991 74980591 77356574 74223297 66537234 56743717
10903 56743717 47106075 39095981 32986069 28536642 25216226 22560727 21343729 20781061
10895 20781061 20534962 20663864 21146853 22289370 24381162 27156352 31336571 36491551
10887 36491551 42509344 49006351 56002965 62433440 67870679 71009898 70064764 64770673
10879 64770673 56749782 47321151 38902307 31834069 26388609 22169994 18867338 16458337
10871 16458337 14563675 12751097 11422200 10758644 9982024 8681170 7772991 7235705 6628154
$$ packed form
10928C101466O0247L93776O50866P68710O08697N64117M11816O74237J210378
10919H444310J654649K397157K987654L313185L979793N272805O396013P705571
10911D2151137Q642287R139864Q633703O413600K375983l133277p686063r793517
10903E6743717r637642q010094o109912m449427l320416k655499j216998n62668
10895B0781061k46099J28902M82989J142517K091792K775190M180219N154980
10887C6491551O017793O497007O996614O430475N437239L139219r45134n294091
10879F4770673q020891r428631q418844p068238n445460m218615l302656k409001
10871A6458337j894662j812578j328897o63556p76620j300854r08179n37286o07551
$$ plain form
10862 6628154 6227983 5665163 5045526 4540184 4121845 3701284 3765077 3400814 3168322 3347945
10852 3347945 3101911 2625415 2232989 2333083 2225068 2180818 2405363 2634659 2350018 2072785
10842 2072785 2101831 1983567 1657693 1589506 1667739 1296736 1498890 1562408 1740382 1768018
10832 1768018 1856322 1608930 1588149 1649076 1748168 1517791 1524655 1611990 1711825 1728273 1850515
10821 1850515 1740390 1125166 812440 627369 738016 1077532 1120333 1079964 928363 889514
10811 889514 798124 774169 951014 1018811 667777 647730 893895 805312 779222 983405 962727
10800 962727 738729 615977 630081 503620 401564 953471 1208532 1075296 721797 287189
10790 287189 68038 -198439 -220760 -41588 -183270 -30133 152522 321918 186259 -112143
$$ packed form
10862F628154m00171n62820o19637n05342m18339m20561O3793l64263k32492J79623
10852C347945k46034m76496l92426J00094j08015m4250K24545K29296k84641k77233
10842B072785K9046j18264l25874o8187P8233l71003K02154O3518J77974K7636
10832A768018Q8304k47392k0781O0927R9092k30377O864Q7335R9835J6448J22242
10821A850515j10125o15224l12726j85071J10647L39516M2801m0369j51601l8849
10811H89514r1390k3955J76845O7797l51034k0047K46165q8583k6090K04183k0678
10800I62727k23998j22752J4104j26461j02056N51907K55061j33236l53499m34608
10790B87189k19151k66477k2321J79172j41682J53137J82655J69396j35659k98402
$$ plain form
10780 -112143 -34561 -213715 -231176 -158302 -198194 -386799 -402172 -321653 -47444 221741 148089
10769 148089 38170 -184895 -75606 -26287 329791 188660 123650 247051 -63687 -441905
10759 -441905 -414778 -89740 -231379 -398104 -532726 -459832 -359912 -93799 333860 12152
10749 12152 -460548 -676627 -691897 -721371 -756691 -391017 -321023 -344677 -133571 -341576 -535898
10738 -535898 -386508 -345717 -263371 -12036 242555 -39372 -180018 -87312 -59008 -199901
10728 -199901 -433392 -442849 -265117 -453741 -742769 -712387 -481344 -469828 -590379 -516674
10718 -516674 -375174 -272765 -646182 -994061 -1025528 -855419 -857395 -658626 -514178 -620477
10708 -620477 -769149 -623555 -651724 -1069883 -1541089 -1719059 -1758332 -1495263 -1028456 -1141786
$$ packed form
10780a12143P7582j79154j7461P2874l9892j88605j5373Q0519K74209K69185p3652
10769A48089j09919k23065J09289M9319L56078j41131o5010J23401l10738l78218
10759d41905K7127L25038j41639j66725j34622P2894R9920K66113M27659l21708
10749A2152m72700k16079j5270k9474l5320L65674O9994k3654K11106k08005j94322
10738e35898J49390M0791Q2346K51335K54591k81927j40646R2706K8304j40893
10728a99901k33491r457J77732j88624k89028L0382K31043J1516j20551P3705
10718e16674J41500J02409l73417l47879l1467J70109j976J98769J44448j06299
10708f20477j48672J45594k8169m18159m71206j77970l9273K63069M66807j13330
$$ plain form
10698 -1141786 -1222480 -1324851 -1257114 -1270670 -1561758 -1593804 -1541694 -1502427 -1353503 -1500442
10688 -1500442 -1718407 -1649020 -1636872 -1764643 -1812988 -2096266 -2247376 -2218118 -2328088 -2313068
10678 -2313068 -2457297 -2509595 -2385474 -2235258 -2231631 -2246684 -2056523 -2552927 -2653451 -2429261
10668 -2429261 -2420315 -2476866 -2549542 -2513296 -2435510 -2569362 -2660459 -2628161 -2717054 -2794164 -3002170
10657 -3002170 -3057108 -2999970 -3055114 -3100200 -2730149 -2395530 -2577009 -2631799 -3057619 -3304690
10647 -3304690 -2931396 -2957221 -3066596 -3055061 -3342436 -3515155 -3282548 -3139703 -3184341 -3046819
10637 -3046819 -2658575 -2603241 -2443801 -2164208 -1803492 -1356149 -738323 -325223 526719 1115734
10627 1115734 2337052 3633751 5501523 8099075 11511797 15959160 22579007 31573831
$$ packed form
10698a141786q0694j02371O7737j3556k91088l2046N2110L9267J48924j46939
10688a500442k17965O9387J2148j27771m8345k83278j51110K9258j09970J5020
10678b313068j44229n2298J24121J50216L627j5053J90161m96404j00524K24190
10668b429261Q946n6551p2676L6246P7786j33852r1097L2298q8893p7110k08006
10657c002170n4938N7138n5144m5086L70051L34619j81479n4790m25820k47071
10647c304690L73294k5825j09375J1535k87375j72719K32607J42845m4638J37522
10637c046819L88244N5334J59440K79593L60716M47343O17826M13100Q51942N89015
10627A115734J221318J296699J867772K597552L412722M447363O619847Q994824
$$ plain form
10619 31573831 43020775 56773792 73228108 91628241 110881910 128871574 142000646
10612 142000646 146869644 144387458 139971870 139737114 147150020 161527978 182850430 210331724
10604 210331724 243399367 279537958 312713686 331969165 329150579 308383625 284164204
10597 284164204 268875777 268067573 280852402 305330542 339161497 380182611 422915640
10590 422915640 457396773 468464937 446068396 398288115 346061863 305939875 282939221
10583 282939221 275206526 279412414 291910781 310157095 329592931 342515244 338274529
10576 338274529 311914953 270303597 227912409 194974860 173998945 162621266 158590625
10569 158590625 159070749 162003869 164658206 163400359 155008251 138495684 116744297 94228189
$$ packed form
10619C1573831J1446944J3753017J6454316J8400133J9253669J7989664J3129072
10612A42000646M868998k482186m415588k34756P412906J4377958K1322452K7481294
10604B10331724L3067643L6138591L3175728J9255479k818586k0766954k4219421
10597B84164204j5288427q08204J2784829K4478140L3830955M1021114M2733029
10590D22915640L4481133J1068164k2396541m7780281n2226252m0121988k3000654
10583B82939221p732695M205888J2498367J8246314J9435836J2922313m240715
10576C38274529k6359576m1611356m2391188l2937549k0975915j1377679m030641
10569A58590625M80124K933120K654337j257847q392108j6512567k1751387k2516108
$$ plain form
10561 94228189 75582068 61702605 51170952 43328111 37417294 33145565 29618790 26845503
10553 26845503 24574427 22763217 21234967 19775807 18412252 17580021 16580493 15446314
10545 15446314 14324550 13542389 12850727 12651198 12613975 12221121 11797717 11294145 10760370
10536 10760370 10238833 9492708 9486800 9507546 9015047 8727930 8556441 8199633 8023704 7857805
10526 7857805 8111266 8299530 8035108 7566348 7394418 7380970 7258350 7169255 7002743 6842390
10516 6842390 7021303 7035577 7165427 7101913 6915951 6610505 6404331 5808087 5470941 5574550
10506 5574550 5629168 5516821 5506376 5464042 5658438 5577025 5125469 5197735 5337017 5311478
10496 5311478 5223506 5127325 5088499 4892992 4568294 4269123 4232214 4628734 4973787 4809282
$$ packed form
10561I4228189j8646121j3879463j0531653p842841n910817m271729l526775k773287
10553B6845503k271076j811210j528250j459160j363555q32231r99528j134179
10545A5446314j121764p82161o91662j99529l7223l92854m23404n03572n33775
10536A0760370n21537p46125n908K0746m92499k87117j71489l56808j75929j65899
10526G857805K53461J88264k64422m68760j71930j3448j22620q9095j66512j60353
10516F842390J78913J4274J29850o3514j85962l05446k06174n96244l37146J03609
10506E574550N4618j12347j0445m2334J94396q1413m51556P2266J39282k5539
10496E311478q7972r6181l8826j95507l24698k99171l6909L96520L45053j64505
$$ plain form
10486 4809282 4767486 4860194 4817077 4733905 4655383 4650702 4442403 4358913 4412300 4519199 4290363
10475 4290363 4091887 3962095 4026513 3981080 4003028 4288825 4630292 4383772 3862866 3665342
10465 3665342 3745264 3463127 3224973 3240198 3316294 3536482 3560408 3311584 3427206 3565841
10455 3565841 3569726 3511789 3177307 3007726 2968353 2938353 2780829 2689463 2696816 3159792 3210145
10444 3210145 2638953 2688101 2895823 2658261 2513240 2558095 2564233 2759936 2636197 2602033
10434 2602033 3173038 3325830 3252154 2943186 2870712 2959464 2656740 2945070 3355035 3383391
10424 3383391 3335790 3288593 3381762 3649369 3625274 3699818 4096245 4396768 4921648 5764703
10414 5764703 5962668 6207790 6367166 7123856 7910686 8656078 9508045 10562352 12144758
$$ packed form
10486D809282m1796R2708m3117q3172p8522m681k08299q3490N3387J06899k28836
10475D290363j98476j29792O4418m5433K1948K85797L41467k46520n20906j97524
10465C665342P9922k82137k38154J5225P6096K20188K3926k48824J15622J38635
10455C565841L885n7937l34482j69581l9373l0000j57524r1366P353M62976N0353
10444C210145n71192M9148K07722k37562j45021M4855O138J95703j23739l4164
10434B602033N71005J52792p3676l08968p2474Q8752l02724K88330M09965K8356
10424C383391m7601m7197R3169K67607k4095P4544L96427L00523N24880Q43055
10414E764703J97965K45122J59376P56690P86830P45392Q51967J054307J582406
$$ plain form
10405 12144758 13963310 16622480 19996744 23950038 28698533 34183814 40374730 47420413
10397 47420413 55215639 62703319 68718159 72482798 72227185 67741245 60125927 51031222
10389 51031222 42266803 35115338 29473386 24837494 21180469 18582430 16376832 14685658
10381 14685658 13367753 12174811 11340902 10736816 9825590 9203858 8632948 8179896 7735135
10372 7735135 7077839 6679991 6423763 6530926 6115143 5615409 5948934 5927878 5864540 5562276
10362 5562276 5628782 5911445 5746754 5675751 6093422 6803767 7626804 8052747 8711562 9134639
10352 9134639 9670774 11057603 12529200 13834851 15976924 18626913 21657716 25412726
10344 25412726 30016832 35692485 42244024 49092303 55857858 62126502 66621854 68002830
$$ packed form
10405A2144758J818552K659170L374264L953294M748495N485281O190916P045683
10397D7420413P795226P487680O014840L764639k55613m485940p615318r094705
10389E1031222q764419p151465n641952m635892l657025k598039k205598j691174
10381A4685658j317905j192942q33909o04086r11226o21732n70910m53052m44761
10372G735135o57296l97848k56228J07163m15783m99734L33525k1056o3338l02264
10362E562276O6506K82663j64691p1003M17671P10345Q23037M25943O58815M23077
10352I134639N36135J386829J471597J305651K142073K649989L030803L755010
10344B5412726M604106N675653O551539O848279O765555O268644M495352J380976
$$ plain form
10336 68002830 65881897 60154516 51949115 43379796 36019757 29875295 24766833 21002609
10328 21002609 18246796 15879298 13838600 12700771 12044864 10949592 9977534 9322105
10320 9322105 9026487 8527602 7701458 7082813 7052058 6941721 6881831 6887824 6989123 7065835
10310 7065835 6956082 7042544 7442621 7398288 7718493 8517196 8915383 9451438 10566235 11956234
10300 11956234 13611714 15341701 17476498 19965072 23413382 27844318 32571677 37504264
10292 37504264 42789043 48563760 53521977 55577169 54452591 50130198 43330887 36111247
10284 36111247 29930319 25073653 20945987 17597671 15258028 13667271 12593462 11291882
10276 11291882 10335990 9329402 8756387 8523729 7943573 7353109 6849371 6602448 6324005
$$ packed form
10336F8002830k120933n727381q205401q569319p360039o144462n108462l764224
10328B1002609k755813k367498k040698j137829o55907j095272r72058o55429
10320I322105k95618m98885q26144o18645l0755j10337n9890N993J01299P6712
10310G065835j09753Q6462M00077m4333L20205P98703L98187N36055J114797J389999
10300A1956234J655480J729987K134797K488574L448310M430936M727359M932587
10292C7504264N284779N774717M958217K055192j124578m322393o799311p219640
10284C6111247o180928m856666m127666l348316k339643j590757j073809j301580
10276A1291882r55892j006588n73015k32658n80156n90464n03738k46923k78443
$$ plain form
10267 6324005 6120271 5655520 5205948 5208138 4951029 4982119 5291480 5393293 5205557 5314288
10257 5314288 5290158 5308901 5190397 5299002 5657373 5954914 6330619 6601810 6836678 7402250
10247 7402250 8042416 8940029 9721601 10928370 12509660 14849538 17542192 20275102 23902194
10238 23902194 28222467 32918525 37984668 43335663 48198474 51326451 51459629 48469786
10230 48469786 43100328 36441210 30297898 24742984 20395868 17339447 14724865 12448039
10222 12448039 10889667 9690956 8960359 8271973 7610381 7126076 6779475 6499908 6015252
10213 6015252 5405772 5116984 5113819 4895186 4720467 4632529 4311066 3838685 3597822 3607305
10203 3607305 3472249 3402672 3393852 3304734 3157262 2935745 2843724 3218868 3197072 3036721
$$ packed form
10267F324005k03734m64751m49572K190k57109L1090L09361J01813j87736J08731
10257E314288k4130J8743j18504J08605L58371K97541L75705K71191K34868N65572
10247G402250O40166Q97613P81572J206769J581290K339878K692654K732910L627092
10238B3902194M320273M696058N066143N350995M862811L127977J33178k989843
10230D8469786n369458o659118o143312n554914m347116l056421k614582k276826
10222A2448039j558372j198711p30597o88386o61592m84305l46601k79567m84656
10213F015252o09480k88788l165k18633j74719q7938l21463m72381k40863R483
10203C607305j35056o9577q820q9118j47472k21517r2021L75144k1796j60351
$$ plain form
10193 3036721 3014141 3276384 3430556 3435802 3048772 2756379 2747921 2873853 2589617 2265170
10183 2265170 2189060 2394542 2468707 2559097 2804002 3003302 3313223 3129940 3161303 3436768
10173 3436768 3377302 3288638 3419277 3608084 3750117 3826925 3586331 3633162 3831909 3714728
10163 3714728 3792466 3925311 4167137 3912226 3770619 3805254 4279945 4487562 4943590 5105441
10153 5105441 4915938 4677537 4729631 4638241 4052523 3618131 3353806 2922847 3271921 3639336
10143 3639336 3593421 3760823 3951574 3733591 3326183 3495422 3358587 2972567 3198263 3193665
10133 3193665 3438344 3196957 2837161 2870340 2659318 2715412 2680993 2492485 2057075 1892113
10123 1892113 1945967 1827566 1626899 1434746 1531505 1343722 1266790 1329278 1193749 1430961
$$ packed form
10193C036721k2580K62243J54172N246l87030k92393q458J25932k84236l24447
10183B265170p6110K05482P4165R0390K44905J99300L09921j83283L1363K75465
10173C436768n9466q8664J30639J88807J42033P6808k40594M6831J98747j17181
10163C714728P7738J32845K41826k54911j41607L4635M74691K07617M56028J61851
10153E105441j89503k38401N2094r1390n85718m34392k64325m30959L49074L67415
10143C639336m5915J67402J90751k17983m07408J69239j36835l86020K25696m598
10133C193665K44679k41387l59796L3179k11022N6094l4419j88508m35410j64962
10123A892113N3854j18401k00667j92153R6759j87783p6932O2488j35529K37212
$$ plain form
10113 1430961 1704327 1743042 1669756 1564701 1483032 1564966 1751460 1847848 1865145 1407198
10103 1407198 1484875 1705673 1859201 2013674 1720107 1511605 1397465 1411194 1400840 1398978
10093 1398978 1688380 1764285 1623739 1590104 1619563 1301719 1164814 1280140 1596972 1620320
10083 1620320 1593474 1510997 1600199 1421317 1085282 1137715 1231543 1290040 1476801 1672595
10073 1672595 1460146 1563177 1290863 1097224 1133925 1102887 1027852 1182356 1222620 1431971
10063 1431971 1717604 1775385 1540989 1732531 1531314 1473525 1534080 1420650 1341287 1332056
10053 1332056 1376003 1607170 1966495 1567899 1655435 1803932 1648066 1701875 1760360 1658989
10043 1658989 1638839 1571679 1673441 1311730 1084764 1375196 1592595 1335946 978936 754899
$$ packed form
10113A430961K73366L8715p3286j05055q1669Q1934J86494R6388J7297m57947
10103A407198P7677K20798J53528J54473k93567k08502j14140J3729j0354j862
10093A398978K89402P5905j40546l3635K9459l17844j36905J15326L16832K3348
10083A620320k6846q2477Q9202j78882l36035N2433R3828N8497J86761J95794
10073A672595k12449J03031k72314j93639L6701l1038p5035J54504M0264K09351
10063A431971K85633N7781k34396J91542k01217n7789O0555j13430p9363r231
10053A332056M3947K31167L59325l98596Q7536J48497j55866N3809N8485j01371
10043A658989k0150o7160J01762l61711k26966K90432K17399k56649l57010k24037
$$ plain form
10033 754899 696536 839841 1147961 1269320 1213429 1296858 1364422 1251498 1275023 970754
10023 970754 876867 1054822 1215661 1174294 1353347 1215898 1054411 1337334 1459074 1243347
10013 1243347 1287236 1459816 1351179 1421037 1338915 1100707 711548 827717 1038208 1136971
10003 1136971 1156040 1257534 1011549 1009697 1352304 1690576 1676485 1403347 1074786 891165
9993 891165 705429 1027634 1550381 1674541 1441568 1569827 1462322 1533904 1695045 1510862
9983 1510862 1344580 1342384 1351008 1296174 1338650 1310851 1195100 1047059 1110553 1380151 1624698
9972 1624698 1457284 1354763 994987 968352 1063300 972959 1258608 1382213 1398135 1084024
9962 1084024 1151980 1479890 1265003 780628 735040 575750 671114 828314 1303854 1414600
$$ packed form
10033G54899n8363J43305L08120J21359n5891Q3429O7564j12924K3525l04269
10023I70754r3887J77955J60839m1367J79053j37449j61487K82923J21740k15727
10013A243347M3889J72580j08637O9858q2122k38208l89159J16169K10491R8763
10003A136971J9069J01494k45985j852L42607L38272j4091k73138l28561j83621
9993H91165j85736L22205N22747J24160k32973J28259j07505P1582J61141j84183
9983A510862j66282k196Q624n4834M2476k7799j15751j48041O3494K69598K44547
9972A624698j67414j02521l59776k6635R4948r0341K85649J23605J5922l14111
9962A084024O7956L27910k14887m84375m5588j59290R5364J57200M75540J10746
$$ plain form
9952 1414600 1486691 1399985 1112744 1194692 1163114 1149666 1073238 1129013 1271814 1008788 677768
9941 677768 850929 973010 967592 869196 1197951 993098 630203 447120 284745 345900
9931 345900 871093 1349110 1468975 1264272 1213917 1328164 1196248 1586181 1670813 1306549
9921 1306549 797481 785146 1141279 1070937 872354 875756 1217473 1128177 686286 645140 781698
9910 781698 1046854 1365595 1768929 1520817 1349778 1197577 985487 890418 1079223 1358473
9900 1358473 1413824 1390878 1137534 879900 801851 965103 616613 629438 500192 273832
9890 273832 460824 637346 782435 1020542 1128393 925639 564383 831798 948150 1119689
9880 1119689 1433814 1489495 1363716 1583929 1636020 1396926 1258065 1063031 1061037 1295860
$$ packed form
9952A414600P2091q6706k87241Q1948l1578j3448p6428N5775J42801k63026l31020
9941F77768J73161J22081n418r8396L28755k04853l62895j83083j62375O1155
9931C45900N25193M78017J19865k04703n0355J14247j31916L89933Q4632l64264
9921A306549n09068j2335L56133p0342j98583L402L41717q9296m41891m1146J36558
9910G81698K65156L18741M03334k48112j71039j52201k12090r5069J88805K79250
9900A358473N5351k2946k53344k57634p8049J63252l48490J2825j29246k26360
9890B73832J86992J76522J45089K38107J07851k02754l61256K67415J16352J71539
9880A119689L14125N5681j25779K20213N2091k39094j38861j95034j994K34823
$$ plain form
9870 1295860 1422878 1304765 1064887 1006928 1329165 1297802 1490936 1529911 1450719 1191883
9860 1191883 955372 509459 300518 621998 1005184 1003997 957383 890590 898412 703875 632074
9849 632074 543422 606555 708964 841563 1063368 1045217 997720 693799 801668 923436
9839 923436 1110827 1131063 807490 389389 228255 503860 294585 244005 715475 682423
9829 682423 772441 852769 925232 893391 954557 1300713 1208288 796796 497251 431692 434426
9818 434426 739963 863961 917955 1006443 1153183 1143875 696741 640924 1012084 931908 619411
9807 619411 739364 949961 1129307 1168761 648828 440299 888018 955293 1119570 1211678
9797 1211678 911114 798797 948523 1148663 941920 831774 906102 698079 565352 624102
$$ packed form
9870A295860J27018j18113k39878n7959L22237l1363J93134L8975p9192k58836
9860A191883k36511m45913k08941L21480L83186j187m6614o6793P822j94537p1801
9849F32074q8652O3133J02409J32599K21805j8151m7497l03921J07869J21768
9839I23436J87391K0236l23573m18101j61134K75605k09275n0580M71470l3052
9829F82423R0018Q0328P2463l1841O1166L46156r2425m11492k99545o5559K734
9818D34426L05537J23998N3994Q8488J46740r308m47134n5817L71160q0176l12497
9807F19411J19953K10597J79346L9454n19933k08529M47719O7275J64277R2108
9797A211678l00564j12317J49726K00140k06743j10146P4328k08023j32727N8750
$$ plain form
9787 624102 732732 894086 742075 1018892 1057994 966723 1052564 928967 483682 266364
9777 266364 443658 245829 354642 275680 356482 445973 421749 666716 1230578 1320282 1027315
9766 1027315 900477 1088922 808756 659320 652714 1080433 988957 792291 850236 566792
9756 566792 718754 900646 692198 581879 497940 326963 433234 524125 630873 767618
9746 767618 938253 1129697 1309874 1157666 1239999 1055285 903274 920231 619919 353787
9736 353787 401538 697659 1191623 990645 1198382 1587035 1614202 1173345 775425 842057
9726 842057 979671 1033622 906660 680313 492278 580542 520459 847364 909258 540263
9716 540263 377913 546447 792267 1032334 1078935 1134270 797856 478087 330126 612212
$$ packed form
9787F24102J08630J61354j52011K76817L9102r1271Q5841j23597m45285k17318
9777B66364J77294j97829J08813p8962Q0802Q9491k4224K44967N63862Q9704k92967
9766A027315j26838J88445k80166j49436o606M27719r1476j96666N7945k83444
9756E66792J51962J81892k08448j10319q3939j70977J06271R0891J06748J36745
9746G67618J70635J91444J80177j52208Q2333j84714j52011J6957l00312k66132
9736C53787M7751K96121M93964k00978K07737L88653K7167m40857l97920O6632
9726H42057J37614N3951j26962k26347j88035Q8264o0083L26905O1894l68995
9716E40263j62350J68534K45820K40067M6601N5335l36414l19769j47961K82086
$$ plain form
9706 612212 811876 784338 870632 671636 584541 599434 393124 172399 50820 36106 211971
9695 211971 414818 452419 497145 832483 1056624 886225 895678 632682 579904 596626 615813
9684 615813 770330 938373 1118895 1126229 1083264 869667 783937 573644 650638 677727 839716
9673 839716 977626 421783 211041 35978 -153443 162830 184354 214131 516055 814132
9663 814132 952458 965090 663066 653155 595906 210812 137935 216021 404668 716356 897565
9652 897565 857911 1074241 1328637 1680222 1670310 1986518 2021518 1383587 662170 429662
9642 429662 598668 677713 367954 385778 583427 639988 469256 146453 -11534 103142
9632 103142 379471 981702 1076782 895813 571189 374852 347036 263359 257925 156042 173629
$$ packed form
9706F12212J99664k7538Q6294j98996q7095J4893k06310k20725j21579j4714J75865
9695B11971K02847L7601M4726L35338K24141j70399R453k62996n2778J6722J9187
9684F15813J54517J68043J80522P334m2965k13597q5730k10293P6994K7089J61989
9673H39716J37910n55843k10742j75063j89421L16273K1524K9777L01924K98077
9663H14132J38326J2632l02024r911n7249l85094p2877P8086J88647L11688J81209
9652H97565l9654K16330K54396L51585r912L16208L5000o37931p21417k32508
9642D29662J69006P9045l09759J7824J97649N6561j70732l22803j57987J14676
9632A03142K76329O02231R5080j80969l24624j96337k7816q3677n434j01883J7587
$$ plain form
9621 173629 222769 27236 -291107 -83246 -207466 -171620 196787 71734 260348 389483
9611 389483 243965 288984 447629 429361 104871 205600 442338 725927 766043 467516
9601 467516 101990 222621 461437 755920 896584 736989 687577 814149 604607 497241
9591 497241 663548 773293 743992 760851 547878 178779 266101 405578 866039 801865
9581 801865 756726 255075 346384 366635 551316 857966 568002 215493 562723 737998
9571 737998 987042 1182696 770659 377936 407730 941058 1162754 1048441 920983 1116105
9561 1116105 936395 758924 787347 686223 888718 666561 670648 788513 878832 713587
9551 713587 559321 459048 741123 847906 908952 891855 598140 661230 651301 406481 164950
$$ packed form
9621A73629M9140j95533l18343K07861j24220L5846L68407j25053J88614J29135
9611C89483j45518M5019J58645j8268l24490J00729K36738K83589M0116k98527
9601D67516l65526J20631K38816K94483J40664j59595m9412J26572k09542j07366
9591D97241J66307J09745k9301J6859k12973l69099Q7322J39477M60461o4174
9581H01865m5139n01651R1309K0251J84681L06650k89964l52509L47230J75275
9571G37998K49044J95654m12037l92723K9794N33328K21696j14313j27458J95122
9561A116105j79710j77471K8423j01124K02495k22157M087J17865R0319j65245
9551G13587j54266j00273K82075J06783O1046j7097k93715O3090r929k44820k41531
$$ plain form
9540 164950 163362 174822 352344 777183 969481 524484 431421 573614 535509 447552 363595
9529 363595 191723 222332 551497 664337 581254 729383 692738 548700 505693 258241
9519 258241 115643 437798 937211 970540 850873 322067 46839 -114424 150039 65191
9509 65191 207657 424264 405432 339951 307245 515059 864489 674769 593857 779209 805534
9498 805534 643989 233305 63889 304129 168988 135190 340163 635329 542507 294771
9488 294771 275583 177343 -160870 -118109 92058 171470 -447948 -658327 -541114 -125223
9478 -125223 300007 396040 525221 284227 240591 -31832 71996 523244 768329 507370
9468 507370 241800 254220 426234 718796 636864 419589 356601 727761 1074910 1049977
$$ packed form
9540A64950j588J1460J77522M24839J92298m44997r3063J42193l8105q7957q3957
9529C63595j71872L0609L29165J12840q3083J48129l6645j44038m3007k47452
9519B58241j42598L22155M99413L3329j19667n28806k75228j61263K64463q4848
9509F5191J42466K16607j8832o5481l2706K07814L49430j89720q0912J85352K6325
9498H05534j61545m10684j69416K40240j35141l3798K04973K95166r2822k47736
9488B94771j9188r8240l38213M2761K10167P9412o19418k10379J17213M15891
9478a25223M25230R6033J29181k40994m3636k72423J03828M51248K45085k60959
9468E07370k65570J2420J72014K92562q1932k17275o2988L71160L47149k4933
$$ plain form
9458 1049977 1192560 1034777 793454 718481 212570 -83966 100883 554105 766605 707091
9448 707091 561341 383137 415109 786130 560854 363388 392193 264174 -198231 -28842
9438 -28842 334628 593722 838607 515355 161299 -136087 -167928 149816 390580 486409
9428 486409 508069 273733 517226 496775 547362 505633 561632 569637 223617 412609 672902
9417 672902 734968 523174 245472 115173 174123 215393 428453 424640 239893 185172 108484
9406 108484 -48124 180687 175319 412176 325924 486356 630929 565329 603679 460336 118007
9395 118007 -56983 -99140 -42325 158306 229608 382640 517289 300239 258714 183543 106298
9384 106298 362006 940223 765402 566299 459076 336383 167921 -118113 -169516 135808
$$ packed form
9458A049977J42583j57783k41323p4973n05911k96536J84849M53222K12500n9514
9448G07091j45750j78204L1972L71021k25276j97466K8805j28019m62405J69389
9438b8842L63470K59094K44885l23252l54056k97386l1841L17744K40764R5829
9428D86409K1660k34336K43493k0451N0587m1729N5999Q005l46020J88992K60293
9417F72902O2066k11794k77702j30299N8950M1270K13060l813j84747n4721p6688
9406A08484j56608K28811n368K36857q6252J60432J44573o5600L8350j43343l42329
9395A18007j74990m2157N6815K00631P1302J53032J34649k17050m1525p5171p7245
9384A06298K55708N78217j74821j99103j07223j22693j68462k86034n1403L05324
$$ plain form
9374 135808 371535 305058 228422 514690 478447 501138 472733 606526 528902 184797 37253
9363 37253 -150506 48212 148894 238385 75026 -90848 -11868 293179 267421 257012 468001
9352 468001 580616 507987 606839 756322 726205 738611 597517 452942 308344 229261 367290
9341 367290 434878 532411 265910 324415 523604 375734 57011 -37743 85351 535055
9331 535055 736047 817740 804541 410464 310842 147726 -251474 -125368 141351 62596
9321 62596 -2675 196854 123726 167076 154916 395393 450376 421351 249561 262789 355501
9310 355501 457279 262094 -122261 -153324 -160664 -69511 61370 170219 450193 687511
9300 687511 630749 336226 165100 306523 554919 874239 827724 691932 559619 550251
$$ packed form
9374A35808K35727o6477p6636K86268l6243K2691k8405J33793p7624l44105j47544
9363C7253j87759J98718J00682Q9491j63359j65874P8980L05047k5758j0409K10989
9352D68001J12615p2629R8852J49483l0117J2406j41094j44575j44598p9083J38029
9341C67290O7588R7533k66501N8505J99189j47870l18723r4754J23094M49704
9331E35055K00992Q1693j3199l94077r9622j63116l99200J26106K66719p8755
9321F2596o5271J99529p3128M3350j2160K40477N4983k9025j71790J3228R2712
9310C55501J01778j95185l84355l1063p340R1153J30881J08849K79974K37318
9300F87511n6762k94523j71126J41423K48396L19320m6515j35792j32313r368
$$ plain form
9290 550251 462125 275708 68625 253484 502427 928400 1364486 1307204 1011073 981831
9280 981831 831202 503141 266006 96579 541363 616632 623488 555396 340790 405287 597463
9269 597463 481524 416105 420762 321702 94756 13496 116536 142312 190770 288372 97043
9258 97043 192625 398141 553462 325996 135235 82804 112221 376530 609888 430036
9248 430036 579091 377511 366598 664612 384076 203104 95897 -101214 -107836 82676
9238 82676 274449 217603 -72967 -482613 -239130 48883 -2695 96483 -64574 18940 37592
9227 37592 124734 367597 400041 279231 142060 181718 -147256 -239627 123235 13250 -15509
9216 -15509 149379 411460 507089 304544 -19429 88253 259998 317855 579611 660195
$$ packed form
9290E50251q8126j86417k07083J84859K48943M25973M36086n7282k96131k9242
9280I81831j50629l28061k37135j69427M44784P5269O856o8092k14606O4497J92176
9269E97463j15939o5419M657r9060k26946q1260J03040K5776M8458R7602j91329
9258I7043R5582K05516J55321k27466j90761n2431K9417K64309K33358j79852
9248D30036J49055k01580j0913K98014k80536j80972j07207j97111o622J90512
9238H2676J91773n6846k90570m09646K43483K88013n1578R9178j61057Q3514J8652
9227C7592Q7142K42863L2444j20810j37171L9658l28974r2371L62862j09985k8759
9216a5509J64888K62081R5629k02545l23973J07682J71745N7857K61756Q0584
$$ plain form
9206 660195 443033 463680 267649 294662 516919 299192 253314 221281 193403 15948 52328
9195 52328 83508 184254 249206 242378 289515 154030 75005 85011 -55427 129397 392845
9184 392845 403433 454952 224256 194673 221934 245930 335612 217830 134297 62979 506051
9173 506051 443533 458462 361487 101457 108147 394935 345844 184947 648660 862021 920633
9162 920633 948298 683870 788154 1056678 926884 469185 -129328 -168828 -21551 65450
9152 65450 -122214 -70798 152301 374095 449593 375089 494384 205613 263534 548194 528457
9141 528457 655497 795346 547677 573925 403169 204796 232641 459653 372130 265515
9131 265515 408931 360142 331383 421266 438543 111784 50841 66332 385526 856355 901193
$$ packed form
9206F60195k17162K0647j96031K7013K22257k17727m5878l2033k7878j77455L6380
9195E2328L1180J00746O4952o828M7137j35485p9025J0006j40438J84824K63448
9184C92845J0588N1519k30696k9583K7261K3996Q9682j17782q3533p1318M43072
9173E06051o2518J4929r6975k60030O690K86788m9091j60897M63713K13361N8612
9162I20633K7665k64428J04284K68524j29794m57699n98513l9500J47277Q7001
9152F5450j87664N1416K23099K21794P5498p4504J19295k88771N7921K84660j9737
9141E28457J27040J39849k47669K6248j70756j98373K7845K27012q7523j06615
9131B65515J43416m8789k8759Q9883J7277l26759o0943J5491L19194M70829M4838
$$ plain form
9120 901193 723887 340042 271600 410985 383360 497955 508958 670690 649615 365584
9110 365584 325566 602226 767168 480190 248403 311668 466158 686224 654595 209579
9100 209579 67159 -84901 79068 326239 416027 327628 589487 614158 183234 58707
9090 58707 15316 52852 300827 266667 386213 338807 381641 599544 283018 -368708 -243416
9079 -243416 -180313 -277945 93399 297115 275710 583609 652900 519322 206639 214931 68417
9068 68417 217231 327352 678644 355969 35872 -317699 -411642 5110 43967 -43183
9058 -43183 103267 342594 401806 248371 84627 -139982 -178382 11544 35638 58295 347237
9047 347237 216520 247770 182830 392405 403898 58147 -14575 166547 465882 637203
$$ packed form
9120I01193j77306l83845o8442J39385k7625J14595J1003J61732k1075k84031
9110C65584m0018K76660J64942k86978k31787O3265J54490K20066l1629m45016
9100B09579j42420j52060J63969K47171Q9788q8399K61859K4671m30924j24527
9090E8707m3391L7536K47975l4160J19546m7406M2834K17903l16526o51726J25292
9079b43416O3103r7632L71344K03716k1405L07899O9291j33578l12683Q292j46514
9068F8417J48814J10121L51292l22675l20097l53571r3943M16752L8857q7150
9058d3183J46450K39327N9212j53435j63744k24609l8400J89926K4094K2657K88942
9047C47237j30717L1250o4940K09575J1493l45751p2722J81122K99335J71321
$$ plain form
9037 637203 184044 73713 102418 255971 213633 266960 121809 159211 232771 187810 196765
9026 196765 276757 516036 484487 417281 433438 323975 423059 217339 -407090 -367884 -180088
9015 -180088 6860 152032 403105 183484 -123471 -12476 -65810 164610 -11134 408096
9005 408096 552634 331735 442435 320906 441042 309237 457198 422047 378394 -100774
8995 -100774 25628 509633 541926 251317 176667 521656 301960 93948 38490 57719
8985 57719 117607 206894 428246 212949 44837 320054 384855 509390 391067 434707 551471
8974 551471 658108 743713 569661 557036 243198 -67657 144779 -245967 -611118 -778149
8964 -778149 -718233 -458225 -486716 -551533 -446095 -310432 -122899 -107253 -131400 110735 224815
$$ packed form
9037F37203m53159j10331K8705J53553m2338N3327j45151L7402P3560m4961Q955
9026A96765P9992K39279l1549o7206J6157j09463R9084k05720o24429L9206J87796
9015a80088J86948J45172K51073k19621l06955J10995n3334K30420j75744M19230
9005D08096J44538k20899J10700j21529J20136j31805J47961l5151m3653m79168
8995a00774J26402M84005L2293k90609p4650L44989k19696k08012n5458J9229
8985E7719N9888Q9287K21352k15297j68112K75217O4801J24535j18323M3640J16764
8974E51471J06637Q5605j74052j2625l13838l10855K12436l90746l65151j67031
8964g78149N9916K60008k8491o4817J05438J35663J87533J5646k4147K42135J14080
$$ plain form
8953 224815 369261 326748 152494 -161369 -170374 -40713 94394 -178335 -278098 10810
8943 10810 -147728 -149216 24062 -206126 -342324 -145681 -80068 101002 503937 504748 716949
8932 716949 699284 556340 313625 368837 250971 548036 620013 654705 597534 473270 581609
8921 581609 805670 482246 83223 292152 591981 382573 207474 85227 70628 126632
8911 126632 162762 -59608 -95487 -171738 -36172 -75977 93315 -3618 -331081 -335252 -34520
8900 -34520 412565 153328 50076 -25703 -83773 106593 352797 735090 433641 -20144
8890 -20144 -25928 274135 222587 90079 182637 66400 -163349 124360 451909 507337 448892
8879 448892 289819 492868 681701 378763 382084 712506 758171 508864 312053 197786
$$ packed form
8953B24815J44446m2513j74254l13863r005J29661J35107k72729r9763K88908
8943A0810j58538j488J73278k30188j36198J96643O5613J81070M02935Q11K12201
8932G16949j7665j42944k42715N5212j17866K97065P1977L4692n7171j24264J08339
8921E81609K24061l23424l99023K08929K99829k09408j75099j22247j4599N6004
8911A26632L6130k22370l5879p6251J35566l9805J69292r6933l27463m171L00732
8900c4520M47085k59237j03252p5779n8070J90366K46204L82293l01449m53785
8890b0144n784L00063n1548j32508R2558j16237k29749K87709L27549N5428n8445
8879D48892j59073K03049J88833l02938L321L30422M5665k49307j96811j14267
$$ plain form
8869 197786 158461 262678 217972 518238 857050 1101651 853663 720198 961422 587451
8859 587451 579184 839553 828242 605585 572760 803980 602965 451072 416369 233900 279340
8848 279340 338723 329743 437446 583940 731817 562323 606875 582972 385739 345970 179749
8837 179749 290321 267922 107822 312936 252985 112269 262695 369720 100988 331000
8827 331000 203418 150281 248243 646404 640038 433884 430238 282779 258743 302104 -78815
8816 -78815 -143548 -380071 -456080 -4631 42297 23175 312137 371041 2683 101252 -335422
8805 -335422 -694404 -526412 -577345 -313474 -99508 463051 304090 -262584 -413781 -289822
8795 -289822 -47680 83230 107624 170754 -79863 -225797 -11461 -151971 -246351 -259633
$$ packed form
8869A97786l9325J04217m4706L00266L38812K44601k47988j33465K41224l73971
8859E87451q267K60369j1311k22657l2825K31220k01015j51893l4703j82469M5440
8848B79340N9383q980J07703J46494J47877j69494M4552k3903j97233l9769j66221
8837A79749J10572k2399j60100K05114n9951j40716J50426J07025k68732K30012
8827C31000j27582n3137R7962L98161o366k06154l646j47459k4036M3361l80919
8816g8815o4733k36523p6009M51449M6928j9122K88962N8904l68358R8569m36674
8805c35422l58982J67992n0933K63871K13966N62559j58961n66674j51197J23959
8795b89822K42142J30910K4394O3130k50617j45934K14336j40510r4380j3282
$$ plain form
8785 -259633 -106013 -108496 -211992 -277190 -711485 -493929 -12322 62646 93762 572622 242062
8774 242062 -86218 65742 -33639 141126 231496 62568 -11985 257325 384560 61880
8764 61880 -122678 173232 330799 332161 128667 249963 290822 344371 281714 122674 -4065
8753 -4065 -133602 218504 112209 8432 -137171 -222298 -163300 106924 367364 268010 445987
8742 445987 344377 100948 130778 -29015 -144051 -180273 -126554 -46257 -21533 -34298 28482
8731 28482 -16582 -98636 45218 350331 406945 545159 503488 250595 261872 162814 202440
8720 202440 61771 -47220 -28509 -168615 -342715 1392 -76259 -239865 -91061 -17795
8710 -17795 -162045 -124895 57805 -45387 84813 91604 344348 223455 -8284 35247 -201287
$$ packed form
8785b59633J53620k483j03496o5198m34295K17556M81607P4968L1116M78860l30560
8774B42062l28280J51960r9381J74765R0370j68928p4553K69310J27235l22680
8764F1880j84558K95910J57567J362k03494J21296M0859N3549o2657j59040j26739
8753d065j29537L52106j06295j03777j45603q5127N8998K70224K60440r9354J77977
8742D45987j01610k43429K9830j59793j15036l6222N3719Q0297K4724j2765O2780
8731B8482m5064q2054J43854L05113N6614J38214m1671k52893J1277r9058L9626
8720B02440j40669j08991J8711j40106j74100L44107p7651j63606J48804P3266
8710a7795j44250L7150J82700j03192J30200O791K52744j20893k31739M3531k36534
$$ plain form
8699 -201287 235764 332287 359614 194060 103168 -200454 -224948 -77195 293853 761795
8689 761795 1088625 939245 617793 376215 210114 369962 46241 20272 -85026 47609
8679 47609 277081 536750 573089 312008 384647 679260 598508 247447 -1841 170998
8669 170998 372789 227803 -1257 -102490 24000 108601 222961 365883 -20570 211255
8659 211255 205046 -9096 -119626 -247040 -290212 51470 262042 369989 234001 -212875
8649 -212875 -547736 -266864 -148049 -468911 -413193 -516507 -420191 -483761 -387355 -306076 -326517
8638 -326517 -754376 -943069 -584559 -224217 -102452 -13288 182785 48471 198373 302803
8628 302803 267604 512149 278644 116772 6050 35747 205572 -56025 182725 185579
$$ packed form
8699b01287M37051R6523K7327j65554r0892l03622k4494J47753L71048M67942
8689G61795L26830j49380l21452k41578j66101J59848l23721k5969j05298J32635
8679D7609K29472K59669L6339k61081P2639K94613q0752l51061k49288J72839
8669A70998K01791j44986k29060j01233J26490Q4601J14360J42922l86453K31825
8659B11255o209k14142j10530j27414m3172L41682K10572J07947j35988m46876
8649b12875l34861K80872J18815l20862N5718j03314R6316o3570R6406Q1279k0441
8638c26517m27859j88693L58510L60342J21765Q9164J96073j34314J49902J04430
8628C02803l5199K44545k33505j61872j10722K9697J69825k61597K38750K854
$$ plain form
8618 185579 29682 95735 29848 -230220 -3222 267621 143631 371520 280278 413529
8608 413529 579347 474194 364303 115771 -385071 -400590 -61880 277652 398127 143106
8598 143106 173482 418277 543787 328840 -37447 -324493 -356052 -262940 -148628 104102
8588 104102 283349 190286 302889 560852 586878 655295 302735 262932 41684 1734 301218
8577 301218 388193 419347 473241 236235 7412 67756 -246261 -206758 -29097 198749 27020
8566 27020 -27858 274582 471658 775343 537075 170138 -144333 -9353 109639 -37332
8556 -37332 49833 145288 -178972 -613466 -606854 -375957 -267720 -1686 503004 746651 340120
8545 340120 -193697 -721120 -797649 -304231 -116818 -159854 -66632 220209 190119 176175 307465
$$ packed form
8618A85579j55897O6053o5887k60068K26998K70843j23990K27889r1242J33251
8608D13529J65818j05153j09891k48532n00842j5519L38710L39532J20475k55021
8598A43106L0376K44795J25510k14947l66287k87046l1559R3112J14312K52730
8588A04102J79247r3063J12603K57963K6026O8417l52560l9803k21248l9950K99484
8577C01218Q6975L1154N3894k37006k28823O0344l14017L9503J77661K27846j71729
8566B7020n4878L02440J97076L03685k38268l66937l14471J34980J18992j46971
8556c7332Q7165R5455l24260m34494O612K30897J08237K66034N04690K43647m06531
8545C40120n33817n27423p6529M93418J87413m3036R3222K86841l0090j3944J31290
$$ plain form
8534 307465 422233 387101 176163 446932 723861 563089 330232 -96019 -355037 8953
8524 8953 312245 580032 553940 725892 933368 726953 789765 619254 457384 452368 409026
8513 409026 586001 470021 298625 32392 -159103 -44257 -31611 99202 529127 641577
8503 641577 546284 763570 388103 402988 257460 159607 390841 533337 267323 82486
8493 82486 24102 296695 633509 237659 12591 134576 54300 -248623 -323662 -62605
8483 -62605 200309 606735 670082 111394 -161757 106178 202596 2508 51900 57540 -78691
8472 -78691 50491 158272 -53095 50546 300424 96940 -97510 -52768 275426 243044
8462 243044 434239 517100 270621 436012 286627 96596 165854 148904 -90664 122331
$$ packed form
8534C07465J14768l5132k10938K70769K76929j60772k32857m26251k59018L63990
8524H953L03292K67787k6092J71952K07476k06415O2812j70511j61870n016m3342
8513D09026J76975j15980j71396k66233j91495J14846J2646J30813M29925J12450
8503F41577r5293K17286l75467J4885j45528r7853K31234J42496k66014j84837
8493H2486n8384K72593L36814l95850k25068J21985q0276l02923p5039K61057
8483f2605K62914M06426O3347n58688k73151K67935R6418k00088M9392N640j36231
8472g8691J29182J07781k11367J03641K49878k03484j94450M4742L28194l2382
8462B43044J91195Q2861k46479J65391j49385j90031O9258j6950k39568K12995
$$ plain form
8452 122331 223921 191604 377472 198582 152857 379990 235546 143057 -156540 -239642
8442 -239642 -71445 23337 205356 374106 416632 636848 558008 446848 501885 164232
8432 164232 140106 343998 383480 131702 131335 248650 72858 119730 398306 607758 862646
8421 862646 861827 658709 359285 440210 617566 460769 243062 127484 523988 362886
8411 362886 279306 220653 134085 -127852 -101130 49144 206612 310228 116290 121021 -283270
8400 -283270 -609891 -284718 72200 188066 114274 209221 -93094 -275843 -91042 307046
8390 307046 284448 -34617 -294196 -433086 -344673 -77384 -151920 -174792 85686 290758
8380 290758 84734 -37440 198457 114099 185825 334726 320043 46439 -480590 -443692
$$ packed form
8452A22331J01590l2317J85868j78890m5725K27133j44444r2489k99597q3102
8442b39642J68197R4782J82019J68750M2526K20216p8840j11160N5037l37653
8432A64232k4126K03892L9482k51778l67J17315j75792M6872K78576K09452K54888
8421H62646q19k03118k99424Q0925J77356j56797k17707j15578L96504j61102
8411C62886q3580n8653q6568k61937K6722J50274J57468J03616j93938M731m04291
8400b83270l26621L25173L56918J15866p3792R4947l02315j82749J84801L98088
8390C07046k2598l19065k59579j38890Q8413K67289p4536k2872K60478K05072
8380B90758k06024j22174K35897q4358P1726J48901j4683k73604n27029L6898
$$ plain form
8370 -443692 -57831 187307 412542 407110 -52992 46018 150461 307099 113255 43628
8360 43628 163235 423059 465283 625991 544254 566101 605064 480645 398236 339927 243649
8349 243649 34972 153213 470235 -19022 129885 489626 464995 333058 287980 -396431
8339 -396431 -583155 -480170 -95048 234064 99876 -358566 -407440 5892 377699 573461
8329 573461 567345 263610 -219652 -311105 -296422 85089 223360 324040 278398 295566 360337
8318 360337 314890 461917 614013 329118 166564 449059 736042 464899 119269 -65989
8308 -65989 -78216 -42633 -204446 -248921 -253884 -131565 11539 -28357 -21529 59070 -148468
8297 -148468 -281526 -136474 322043 409724 -91729 -608676 -523594 -100844 -54068 -20667
$$ packed form
8370d43692L85861K45138K25235n432m60102R9010J04443J56638j93844o9627
8360D3628J19607K59824M2224J60708q1737K1847L8963j24419q2409n8309r6278
8349B43649k08677J18241L17022m89257J48907L59741k4631j31937m5078o84411
8339c96431j86724J02985L85122L29112j34188m58442m8874M13332L71807J95762
8329E73461o116l03735m83262r1453J4683L81511J38271J00680m5642J7168O4771
8318C60337m5447J47027J52096k84895j62554K82495K86983k71143l45630j85258
8308f5989j2227L5583j61813m4475m963J22319J43104l9896O828Q0599k07538
8297a48468j33058J45052M58517Q7681n01453n16947Q5082M22750M6776L3401
$$ plain form
8287 -20667 -264441 -138557 141551 -5990 -59245 -8059 42724 459916 496121 262598 233247
8276 233247 121929 91476 256532 111255 -239142 182086 140578 151 -200829 -74105
8266 -74105 -61379 -368265 -93773 210428 292755 176803 36826 100110 156216 159657 -16018
8255 -16018 -204865 403030 451157 152171 -178229 -5916 230211 401369 468244 664131
8245 664131 1057803 913668 537165 753217 860913 854661 583929 556148 714768 460280
8235 460280 45419 -128459 -83855 -259406 -134114 127024 369880 792379 667507 555688
8225 555688 570338 452501 641670 456755 389501 374889 375898 128214 227852 176951 -208414
8214 -208414 -384823 -396073 -224748 -2962 -78597 -281299 -318022 -323057 -179997 -77901 -123432
$$ packed form
8287b0667k43774J25884K80108j47541n3255N1186N0783M17192L6205k33523k9351
8276B33247j11318l0453J65056j45277l50397M21228m1508j40427k00980J26724
8266g4105J2726l06886K74492L04201Q2327j15952j39977O3284N6106L441j75675
8255a6018j88847O07895M8127k98986l30400J72313K36127J71158O6875J95887
8245F64131L93672j44135l76503K16052J07696o252k70732k7781J58620k54488
8235D60280m14861j73878M4604j75551J25292K61138K42856M22499j24872j11819
8225E55688J4650j17837J89169j84915o7254j4612J009k47684R9638n0901l85365
8214b08414j76409j1250J71325K21786p5635k02702l6723n035J43060J02096m5531
$$ plain form
8203 -123432 -289309 -100502 117943 323943 234772 -153618 -160032 122458 332489 638405
8193 638405 584299 305092 195061 72008 -473294 -283678 2390 193008 189960 295900
8183 295900 183500 34933 34093 -50471 -434433 -425755 -201736 -171048 -152816 -281623 -321454
8172 -321454 -200245 9826 146038 440683 331272 354392 32571 -26011 -17271 16634 95102
8161 95102 243407 297356 132745 -47075 214559 171412 141921 277061 131911 -258659
8151 -258659 -249852 164807 321078 184133 263394 372457 224556 -43670 -178351 33468
8141 33468 53784 -272862 -465937 -757068 -770872 -529921 -232925 -100472 -165021 -254509 -6469
8130 -6469 127647 192124 244777 304884 -35227 -348951 -366205 65315 288516 195264 141733
$$ packed form
8203a23432j65877J88807K18445K06000q9171l88390o414K82490K10031L05916
8193F38405n4106k79207j10031j23053n45302J89616K86068J90618l048J05940
8183B95900j12400j48567q40q4564l83962Q678K24019L0688J8232j28807l9831
8172c21454J21209K10071J36212K94645j09411K3120l21821n8582Q740L3905P8468
8161I5102J48305N3949j64611j79820K61634m3147k9491J35140j45150l90570
8151b58659Q807M14659J56271j36945P9261J09063j47901k68226j34681K11819
8141C3468K0316l26646j93075k91131j3804K40951K96996J32453o4549q9488K48040
8130f469J34116O4477N2653O0107l40111l13724j7254M31520K23201r3252n3531
$$ plain form
8119 141733 652277 750648 449864 205488 116086 264092 380203 615221 765147 1026894
8109 1026894 597201 323233 142441 187897 -38520 238425 535756 585805 503462 438344
8099 438344 235935 -110655 -156968 45564 -46930 -118508 -75281 -86447 -157643 -281978 -62076
8088 -62076 -51145 -23795 -292148 -79219 -333119 -546945 -420713 -161000 -148948 -367890
8078 -367890 -200158 -103437 -133738 40412 225920 190054 233598 -109199 -413832 -240798
8068 -240798 -162984 -152940 46191 309889 196590 -61534 -12349 393952 249656 -86190
8058 -86190 -78882 241241 588386 380496 351320 411360 246946 -23127 -279893 18025 112865
8047 112865 -142736 -292565 -499694 -391262 -10873 -79694 -441935 -333200 -1394 120746
$$ packed form
8119A41733N10544R8371l00784k44376q9402J48006J16111K35018J49926K61747
8109A026894m29693k73968j80792M5456k26417K76945K97331N0049q2343o5118
8099D38344k02409l46590m6313K02532r2494p1578M3227j1166p1196j24335K19902
8088f2076J0931K7350k68353K12929k53900k13826J26232K59713J2052k18942
8078c67890J67732R6721l0301J74150J85508l5866M3544l42797l04633J73034
8068b40798P7814J0044J99131K63698j13299k58124M9185M06301j44296l35846
8058h6190P308L20123L47145k07890k9176O0040j64414k70073k56766K97918R4840
8047A12865k55601j49829k07129J08432L80389o8821l62241J08735L31806J22140
$$ plain form
8037 120746 151491 167500 -40246 -334203 -373855 -12571 351758 88702 -477086 -563758
8027 -563758 -573841 -240059 240507 476208 609060 587015 396126 266622 177830 555669
8017 555669 482248 389234 156579 56353 160090 222974 22253 -143202 -34217 227205
8007 227205 113999 -72602 -180658 -24728 -164093 -198937 -319650 -209633 -28589 92106
7997 92106 499475 467989 345105 569766 457418 206969 398680 625262 450403 324667
7987 324667 216258 230513 263051 308246 230890 -60297 -83279 8404 -50827 57141 210675
7976 210675 189124 -35260 -83676 -12122 -6773 -70280 23252 -107440 -6505 194264 308157
7965 308157 116833 -2850 -69600 348546 559384 269604 191041 235829 74857 239291
$$ packed form
8037A20746L0745J6009k07746k93957l9652L61284L64329k63056n65788q6672
8027e63758j0083L33782M80566K35701J32852k2045j90889j29504q8792L77839
8017E55669p3421r3014k32655j00226J03737O2884k00721j65455J08985K61422
8007B27205j13206j86601j08056J55930j39365l4844j20713J10017J81044J20695
7997I2106M07369l1486j22884K24661j12348k50449J91711K26582j74859j25736
7987C24667j08409J4255L2538M5195p7356k91187k2982R1683n9231J07968J53534
7976B10675k1551k24384m8416P1554N349o3507R3532j30692J00935K00769J13893
7965C08157j91324j19683o6750M18146K10838k89780p8563M4788j60972J64434
$$ plain form
7955 239291 369556 82762 95811 327245 241886 100774 48349 58866 98846 75340 222099
7944 222099 687990 746852 464801 344914 105509 -201293 -497501 -632186 -486854 -34255
7934 -34255 179818 449583 294901 -112297 -10437 55472 121463 35984 -160665 -54664
7924 -54664 -193990 -287256 -694738 -278223 -338580 -470848 -410262 -200574 31412 -104040
7914 -104040 -677844 -446378 -64540 40188 -12484 -86074 -134321 -160362 -288963 -400373
7904 -400373 -312440 -582243 -362591 -180074 -384726 -678286 -613577 -449810 -231039 -16017
7894 -16017 245458 190249 126063 300184 107333 -289238 -271611 66563 -29626 -399305 -338897
7883 -338897 131956 110239 207861 142732 187482 115012 8400 -161812 -269588 -343024 -527390
$$ packed form
7955B39291J30265k86794J3049K31434q5359j41112n2425J0517L9980k3506J46759
7944B22099M65891N8862k82051j19887k39405l06802k96208j34685J45332M52599
7934c4255K14073K69765j54682m07198J01860O5909O5991q5479j96649J06001
7924e4664j39326r3266m07482M16515o0357j32268O0586K09688K31986j35452
7914a04040n73804K31466L81838J04728n2672p3590m8247k6041j28601j11410
7904d00373Q7933k69803K19652J82517k04652k93560O4709J63767K18771K15022
7894a6017K61475n5209o4186J74121j92851l96571J7627L38174r6189l69679O0408
7883c38897M70853k1717R7622o5129M4750p2470j06612j70212j07776p3436j84366
$$ plain form
7872 -527390 -744074 -273824 41528 239456 182299 430701 491994 528846 32419 -514439
7862 -514439 -580398 -556179 -551173 -447776 -59589 97056 187377 72587 -43779 103685 -27596
7851 -27596 -330256 -306088 60199 435305 437230 499625 -70723 -263751 -253735 120812 193949
7840 193949 90779 218184 398185 94791 -118841 -306409 -268057 -263053 -457920 -154974
7830 -154974 -321625 -625636 -654263 -393223 -377889 -83099 57450 193549 409598 446894
7820 446894 286430 104148 71063 115884 56540 121838 264413 78313 76836 443501 658027
7809 658027 593890 526744 115272 -79420 -248582 -69832 -200199 -100958 203119 -172776
7799 -172776 -175579 -154454 -55104 85682 8379 -218728 -401678 -305621 -479643 -135357 535134
$$ packed form
7872e27390k16684M70250L15352J97928n7157K48402O1293L6852m96427n46858
7862e14439o5959K4219N006J03397L88187J56645R0321j14790j16366J47464j31281
7851b7596l02660K4168L66287L75106J925O2395n70348j93028J0016L74547P3137
7840A93949j03170J27405J80001l03394k13632j87568L8352N004j94867L02946
7830a54974j66651l04011k8627K61040J5334K94790J40549J36099K16049L7296
7820D46894j60464j82282l3085M4821n9344O5298J42575j86100j477L66665K14526
7809F58027o4137o7146m11472j94692j69162J78750j30367R9241L04077l75895
7799a72776k803K1125R9350J40786p7303k27107j82950R6057j74022L44286O70491
$$ plain form
7788 535134 472030 311733 81643 -64073 -18692 4302 277596 276710 -241002 -510042 -463942
7777 -463942 -61998 -41543 94983 351836 407384 192809 -24355 -134914 -48628 424853
7767 424853 187020 -41585 406788 549224 281496 121205 226536 169762 -84942 -293273
7757 -293273 -385604 -121572 -135867 -555065 -516628 -251403 -88537 84903 132106 237705
7747 237705 221079 -33336 17356 -270984 -142408 -13265 219374 137895 96599 157077 95004
7736 95004 -33854 -39120 21716 -175847 63235 378255 490079 170798 201123 111674 48057
7725 48057 -147360 -215913 -247971 -124905 69760 190492 124760 -150476 -434631 -709462
7715 -709462 -641919 -470775 -321914 -371954 -547743 -298154 -99041 -332112 -300874 -375074
$$ packed form
7788E35134o3104j60297k30090j45716M5381K2994K73294q86n17712k69040M6100
7777d63942M01944K0455J36526K56853N5548k14575k17164j10559Q6286M73481
7767D24853k37833k28605M48373J42436k67728j60291J05331n6774k54704k08331
7757b93273r2331K64032j4295m19198L8437K65225J62866J73440M7203J05599
7747B37705j6626k54415N0692k88340J28576J29143K32639q1479m1296O0478o2073
7736I5004j28858n266O0836j97563K39082L15020J11824l19281L0325q9449o3617
7725D8057j95417o8553l2058J23066J94665J20732o5732k75236k84155k74831
7715g09462O7543J71144J48861n0040j75789K49589J99113k33071L1238p4200
$$ plain form
7705 -375074 -497559 -315022 -57607 -196194 -196094 -48858 -41962 -128588 -240935 -638895 -647095
7694 -647095 -381175 -319794 -342542 -193959 -29254 356466 473565 254577 -238156 -282952
7684 -282952 -247713 -398708 -280754 -429383 -596880 -246851 -509852 -301105 -45565 153895
7674 153895 400464 86106 -135092 174675 393840 329262 242381 22926 -143036 -303713
7664 -303713 -199480 -428750 -559504 -566880 -313019 -400407 -553926 -572031 -519497 -625773 -384390
7653 -384390 -359706 -306824 -383133 -263113 4961 40349 106708 415015 205340 -150152 -334252
7642 -334252 158011 608517 675323 367710 63344 11815 58614 100878 -39768 -35694 149964
7631 149964 78415 83566 -25902 18337 132643 358420 436996 295619 199025 -224745 -362974
$$ packed form
7705c75074j22485J82537K57415j38587J00J47236O896q6626j12347l97960q200
7694f47095K65920O1381k2748J48583J64705L85720J17099k18988m92733m4796
7684b82952L5239j50995J17954j48629j67497L50029k63001K08747K55540J99460
7674A53895K46569l14358k21198L09767K19165o4578q6881k19455j65962j60677
7664c03713J04233k29270j30754p376K53861q7388j53519j8105N2534j06276K41383
7653c84390K4684N2882p6309J20020K68074L5388O6359L08307k09675l55492j84100
7642c34252M92263M50506O6806l07613l04366n1529M6799M2264j40646M074J85658
7631A49964p1549N151j09468M4239J14306K25777P8576j41377r6594m23770j38229
$$ plain form
7620 -362974 -379161 -287843 -329577 -165841 -216457 -144389 236327 283561 157101 -66046 -223471
7609 -223471 -364294 -235024 -301102 -274257 -71481 -14131 -7965 65079 -130623 -409814 -320373
7598 -320373 -323231 -392498 -186214 -197350 -167595 33418 -19046 -62461 88782 41238 105525
7587 105525 94264 244400 667391 461238 -14658 -263739 -278305 32363 100707 -221509
7577 -221509 -166042 -204805 -260338 -254937 9548 19073 -69105 -6198 -134147 -193394 -158806 -163683
7565 -163683 116429 474592 599029 464624 49164 -56686 -143645 -297068 -465758 -319000
7555 -319000 15953 180481 186766 369898 14966 -285760 -144349 -33642 -91858 82803
7545 82803 280009 296904 -23458 -306810 -287850 10254 129872 372266 310366 27361
$$ packed form
7620c62974j6187R1318m1734J63736n0616P2068L80716M7234j26460k23147j57425
7609b23471j40823J29270o6078K6845K02776N7350O166P3044j95702k79191Q9441
7598c20373k858o9267K06284j1136K9755K01013n2464m3415J51243m7544O4287
7587A05525j1261J50136M22991k06153m75896k49081j4566L10668O8344l22216
7577b21509N5467l8763n5533N401K64485R525q8178O2907j27949n9247L4588m877
7565a63683K80112L58163J24437j34405m15460j05850q6959j53423j68690J46758
7555c19000L34953J64528O285J83132l54932l00726J41411J10707n8216J74661
7545H2803J97206J6895l20362k83352J8960K98104J19618K42394o1900k83005
$$ plain form
7535 27361 -132204 37720 270478 217547 224909 59177 -52561 -268676 -242059 -195688 -16547
7524 -16547 -150892 -148988 -8464 75866 229300 478426 353601 390385 119049 -8284 -26013
7513 -26013 -67916 -152848 164166 283372 272013 -31302 -79544 -230989 -250283 12482 223246
7502 223246 316321 118538 -59621 -520358 -776082 -375340 -190389 -491057 -346735 -64003
7492 -64003 141141 -4709 218492 326795 215531 54768 140315 340925 440159 419411
7482 419411 302728 224137 329232 327118 253370 185139 212843 738636 784353 327751 64237
7471 64237 -24721 142652 267235 327295 320582 89417 -210626 -290591 -247962 -167553 -385628
7460 -385628 -221858 -264142 -18678 415367 499343 361082 141555 -17584 -52343 -37791
$$ packed form
7535B7361j59565J69924K32758n2931P362j65732j11738k16115K6617M6371J79141
7524a6547j34345J904J40524Q4330J53434K49126j24825L6784k71336j27333j7729
7513b6013m1903q4932L17014J19206j1359l03315m8242j51445j9294K62765K10764
7502B23246R3075j97783j78159m60737k55724M00742J84951l00668J44322K82732
7492f4003K05144j45850K23201J08303j11264j60763Q5547K00610R9234k0748
7482D19411j16683p8591J05095k114p3748o8231K7704N25793M5717m56602k63514
7471F4237q8958J67373J24583O0060o713k31165l00043p9965M2629Q0409k18075
7460c85628J63770m2284K45464M34045Q3976j38261k19527j59139l4759J4552
$$ plain form
7450 -37791 -145257 -77959 44316 294027 130318 132846 -56347 -498271 -119599 135398
7440 135398 154754 210281 312016 146296 -51416 -162390 -211652 -392198 -411205 -268327
7430 -268327 -331894 -107559 -34247 -367214 -309870 -11272 76355 -127968 -216971 74214 177535
7419 177535 202305 428706 248594 173841 135218 -82410 160377 105475 71688 274801 395386
7408 395386 324691 357220 289950 84598 -32232 -27801 66539 63312 -83395 -163150 -346562
7397 -346562 -143675 -130551 -236081 -373497 -207375 -370874 -518294 -361897 -144294 -262485
7387 -262485 -376926 -94035 -222274 -218140 -302220 -458761 -390171 -324271 -526144 -467649 -291885
7376 -291885 -328787 -73524 -25015 187928 345516 175962 -121372 46009 -91759 -339646
$$ packed form
7450c7791j07466O7298J22275K49711j63709K528j89193m41924L78672K54997
7440A35398J9356N5527J01735j65720j97712j10974m9262j80546j9007J42878
7430b68327o3567K24335P3312l32967N7344K98598Q7627k04323q9003K91185J03321
7419A77535K4770K26401j80112p4753l8623k17628K42787n4902l3787K03113J20585
7408C95386p0695L2529o7270k05352j16830M431R4340l227j46707p9755j83412
7397c46562K02887J3124j05530j37416J66122j63499j47420J56397K17603j18191
7387b62485j14441K82891j28239M134q4080j56541O8590O5900k01873N8495J75764
7376b91885l6902K55263M8509K12943J57588j69554k97334J67381j37768k47887
$$ plain form
7366 -339646 -141736 119399 238872 -321486 -506385 -159717 -256277 6360 75242 29141
7356 29141 -115791 -172932 -69738 -293171 -35745 57666 99226 360857 456036 424211 244239
7345 244239 353346 169188 166244 148114 239743 318847 225761 -81856 -67360 -81464 -97817
7334 -97817 -94715 110048 346815 244750 -152385 -327743 -370577 -170935 -73578 33580 -33647
7323 -33647 -51051 100740 99682 202301 89002 137471 238181 524878 240735 4136 -56457
7312 -56457 -173011 -438958 -786486 -691738 -720944 -499728 -202142 179408 194418 -59847
7302 -59847 -155327 -236263 -427737 130513 471980 380627 106994 6393 78088 78659 -229816
7291 -229816 -300099 -99089 17541 63016 -466896 -895016 -828488 -501205 -170157 34081
$$ packed form
7366c39646J97910K61135J19473n60358j84899L46668r6560K62637O8882m6101
7356B9141j44932n7141J03194k23433K57426R3411M1560K61631R5179l1825j79972
7345B44239J09107j84158k944j8130R1629P9104r3086l07617J4496j4104j6353
7334i7817L102K04763K36767j02065l97135j75358m2834J99642R7357J07158o7227
7323c3647j7404J51791j058J02619j13299M8469J00710K86697k84143k36599o0593
7312e6457j16554k65947l47528R4748k9206K21216K97586L81550J5010k54265
7302e9847r5480q0936j91474N58250L41467r1353k73633j00601P1695N71l08475
7291b29816p0283K01010J16630M5475n29912m28120O6528L27283L31048K04238
$$ plain form
7281 34081 359723 650675 338362 -89328 -211457 -249833 -82575 -166586 -213371 -297167 -741875
7270 -741875 -649890 -335769 -178535 -238993 -432992 -809303 -977820 -725167 -365464 -504031
7260 -504031 -315608 164866 88664 77425 52297 -196148 -347825 -271323 -385102 -238915
7250 -238915 -298692 -372468 -7099 282075 270146 71237 -42631 220758 528179 548000
7240 548000 391825 468764 389541 -159837 -222165 -290314 -295018 -135123 -27539 20228 75040
7229 75040 53812 345312 566937 394678 474811 688084 406337 179137 30087 10486
7219 10486 126647 308616 404664 306119 73864 273102 81540 55009 -79377 -429501
7209 -429501 -476859 -120827 198665 217390 71763 120117 -3111 -404582 -358725 -343126 -397335
$$ packed form
7281C4081L25642K90952l12313m27690j22129l8376J67258q4011m6785q3796m44708
7270g41875R1985L14121J57234o0458j93999l76311j68517K52653L59703j38567
7260e04031J88423M80474p6202j1239k5128k48445j51677P6502j13779J46187
7250b38915n9777p3776L65369K89174j1929j98909j13868K63389L07421J9821
7240E48000j56175P6939p9223n49378o2328o8149m704J59895J07584M7767N4812
7229G5040k1228K91500K21625j72259Q0133K13273k81747k27200j49050j9601
7219A0486J16161J81969R6048r8545k32255J99238j91562k6531j34386l50124
7209d29501m7358L56032L19492J8725j45627M8354j23228m01471M5857J5599n4209
$$ plain form
7198 -397335 -482885 -451445 -271981 66007 235510 283047 242528 229935 287386 240249 225489
7187 225489 252255 -111745 -411834 -350786 -526563 -252670 -101303 -49605 49913 357740
7177 357740 273943 -80357 -189608 -21482 -48924 -133602 103941 175122 116934 -64971 -70665
7166 -70665 -249361 -238316 -320549 -349156 -27663 -61970 -427105 -623694 -504091 35316 272433
7155 272433 473233 188603 302758 445570 329657 302664 265329 76533 -282287 -80111
7145 -80111 158155 66790 -125808 118190 191615 14608 3772 -214157 -368699 -356962 -144545
7134 -144545 -263321 -342597 116779 430124 171282 34802 -197596 -498708 -661762 -614050
7124 -614050 -393893 -342225 -326494 -291088 -540591 -651958 -396589 -65336 389664 229131
$$ packed form
7198c97335q5550L1440J79464L37988J69503M7537m0519j2593N7451m7137j4760
7187B25489K6766l64000l00089O1048j75777K73893J51367N1698R9518L07827
7177C57740q3797l54300j09251J68126k7442q4678K37543P1181n8188j81905n694
7166g0665j78696J1045q2233k8607L21493l4307l65135j96589J19603N39407K37117
7155B72433K00800k84630J14155J42812j15913k6993l7335j88796l58820K02176
7145h0111K38266r1365j92598K43998P3425j77007j0836k17929j54542J1737K12417
7134a44545j18776p9276M59376L13345k58842j36480k32398l01112j63054M7712
7124f14050K20157N1668J5731L5406k49503j11367K55369L31253M55000j60533
$$ plain form
7114 229131 96628 10448 -109732 -372510 -132634 117856 -33769 -131712 -97889 -310813
7104 -310813 -255451 -293219 -501061 -467388 -256200 212702 472988 365968 36881 -119320
7094 -119320 -89331 -256467 -361581 -475286 -497016 -355242 -188966 -335320 -68289 112523
7084 112523 190277 192388 -99026 -59117 -227740 -286361 63692 -290025 -483080 -307750 -415831
7073 -415831 -352432 -247409 -336424 -10844 232792 357023 331326 112899 -201451 -33489
7063 -33489 -227470 -268273 -144638 -302472 -6132 123678 396846 165107 -211841 -403989
7053 -403989 -401224 -132234 24475 54880 173066 -113326 1508 228721 107722 133802
7043 133802 -137393 -325480 -77479 195466 121799 294165 286948 267462 455755 288703
$$ packed form
7114B29131j32503q6180j20180k62778K39876K50490j51625r7943L3823k12924
7104c10813N5362l7768k07842L3673K11188M68902K60286j07020l29087j56201
7094a19320K9989j67136j05114j13705k1730J41774J66276j46354K67031J80812
7084A12523P7754K111k91414L9909j68623n8621L50053l53717j93055J75330j08081
7073d15831O3399J05023q9015L25580K43636J24231k5697k18427l14350J67962
7063c3489j93981m0803J23635j57834K96340J29810K73168k31739l76948j92148
7053d03989K765K68990J56709L0405J18186k86392J14834K27213j20999K6080
7043A33802k71195j88087K48001K72945p3667J72366p217j9486J88293j67052
$$ plain form
7033 288703 -106320 -230562 -544554 -407423 -567647 -704878 -526013 -188282 -22743 239890
7023 239890 142566 -231715 -445789 -186275 -149470 -346017 -686312 -740280 -760467 -409618
7013 -409618 -94636 4273 -205087 -108201 277980 162199 235304 248631 -189393 -222112 86423
7002 86423 163121 40547 76902 655 1566 -82066 -320692 -295309 -464254 -437391 -344417 -386848
6990 -386848 -700554 -418821 -231587 -166810 -77234 45252 348509 445642 307792 168926
6980 168926 -156964 -408308 -145260 -912 -67273 214614 193622 174682 284284 332422
6970 332422 324290 219514 87152 -191791 -471538 -521113 -298963 -365214 -349778 -36557 111409
6959 111409 141024 416810 342501 114272 -3250 28983 84024 -39059 -211595 -177054 -77668
$$ packed form
7033B88703l95023j24242l13992J37131j60224j37231J78865L37731J65539K62633
7023B39890r7324l74281k14074K59514L6805j96547l40295n3968k0187L50849
7013d09618L14982R8909k09360R6886L86181j15781P3105J3327m38024l2719L08535
7002H6423P6698j22574L6355p6247R11q3632k38626K5383j68945K6863R2974m2431
6990c86848l13706K81733J87234O4777Q9576J22486L03257R7133j37850j38866
6980A68926l25890k51344K63048J44348o6361K81887k0992j8940J09602M8138
6970C32422q132j04776j32362k78943k79747m9575K22150o6251J5436L13221J47966
6959A11409K9615K75786p4309k28229j17522L2233N5041j23083j72536L4541R9386
$$ plain form
6948 -77668 -234584 -148333 53502 7298 148297 72566 206291 282083 136533 318330 110898
6937 110898 152555 402386 318196 40165 -304903 -686773 -461856 -158208 -75449 -287331
6927 -287331 -229020 26060 132769 -246037 -49916 55100 389940 345556 2200 226480
6917 226480 225656 -15200 -22244 -151221 49401 383635 286778 249973 9178 -303357 -110932
6906 -110932 -16252 -97301 111465 245780 451667 393613 71221 15972 137623 129032 -79924
6895 -79924 -260211 -163181 206574 15240 -54430 -270173 -399239 -379921 -277258 -59522
6885 -59522 -122887 -19776 10071 -139858 -569524 -376613 -204308 -151219 651 -164119
6875 -164119 69458 -22652 110900 95771 -41426 -261587 -510830 -502814 -182047 -135559 -223454
$$ packed form
6948g7668j56916Q6251K01835m6204J40999p5731J33725P5792j45550J81797k07432
6937A10898M1657K49831q4190k78031l45068l81870K24917L03648Q2759k11882
6927b87331N8311K55080J06709l78806J96121J05016L34840m4384l43356K24280
6917B26480q24k40856p044j28977K00622L34234r6857l6805k40795l12535J92425
6906a10932R4680q1049K08766J34315K05887n8054l22392n5249J21651q591k08956
6895g9924j80287R7030L69755j91334o9670k15743j29066J9318J02663K17736
6885e9522o3365J03111K9847j49929m29666J92911J72305N3089J51870j64770
6875a64119K33577r2110J33552j5129j37197k20161k49243Q016L20767M6488q7895
$$ plain form
6864 -223454 -332308 -92393 -28812 -18324 -107369 -163975 -82694 -67386 -117353 -220852 -191689
6853 -191689 -84144 49280 -82284 -153253 -394009 -783787 -678902 -331937 197959 -18953
6843 -18953 -480227 -692398 -573056 -292760 76952 23983 -322538 -237506 289580 450942
6833 450942 218102 42627 -26843 -83165 -40580 -48282 58281 446964 547067 59003 -178870
6822 -178870 -34263 -4723 99787 -4357 -114279 -32094 370412 364950 378398 286053 -103517
6811 -103517 -361458 -725956 -467734 -220460 -279811 -80657 49670 -152465 -295027 -315873
6801 -315873 -499601 -413875 -36279 91103 295223 717876 333404 -28790 -348774 -363341
6791 -363341 -720314 -926514 -879784 -758795 -860319 -927119 -679245 -605152 -391311 -245310
$$ packed form
6864b23454j08854K39915O3581J0488q9045n6606Q1281J5308m9967j03499K9163
6853a91689J07545J33424j31564p0969k40756l89778J04885L46965N29896k16912
6843a8953m61274k12171J19342K80296L69712n2969l46521Q5032N27086J61362
6833D50942k32840j75475o9470n6322M2585p702J06563L88683J00103m88064k37873
6822a78870J44607K9540J04510j04144j09922Q2185M02506n462J3448r2345l89570
6811a03517k57941l64498K58222K47274n9351J99154J30327k02135j42562k0846
6801c15873j83728Q5726L77596J27382K04120M22653l84472l62194l19984j4567
6791c63341l56973k06200M6730J20989j01524o6800K47874P4093K13841J46001
$$ plain form
6781 -245310 -462790 -380916 -112916 27787 197920 88103 -26681 -84283 -138261 -300932
6771 -300932 -500098 -450558 -326421 -316505 -289548 -97467 -169483 157622 404979 310126 75884
6760 75884 -162314 -234021 -1989 16535 219615 143660 1750 -149116 -437329 -486693 -339401
6749 -339401 -71388 152255 -73557 -82042 -446152 -638213 -696414 -336838 -308905 -200587
6739 -200587 131692 194256 259247 511276 93412 -59612 -53380 17093 388466 389743 263740
6728 263740 54927 180324 -131559 -546304 -511391 -331934 -149302 35822 134911 252213
6718 252213 145422 -291252 -308473 -29722 402720 537046 386688 158436 228404 -71471
6708 -71471 100253 150222 58994 449476 831400 715845 444086 418577 300857 132124
$$ packed form
6781b45310k17480Q1874K68000J40703J70133j09817j14784n7602n3978j62671
6771c00932j99166M9540J24137R916K6957J92081p2016L27105K47357r4853k34242
6760G5884k38198p1707K32032J8524K03080p5955j41910j50866k88213m9364J47292
6749c39401K68013K23643k25812q485l64110j92061n8201L59576K7933J08318
6739b00587L32279O2564O4991K52029m17864j53024O232P0473L71373J277j26003
6728B63740k08813J25397l11883m14745L4913J79457J82632J85124R9089J17302
6718B52213j06791m36674j7221K78751M32442J34326j50358k28252O9968k99875
6708g1471J71724M9969r1228L90482L81924j15555k71759k5509j17720j68733
$$ plain form
6698 132124 114007 -38166 -130994 -81342 -313141 -527590 -638532 -573004 -461811 -276788
6688 -276788 112921 74731 117934 -16462 -81173 -286174 -410233 -277339 -263292 -136571
6678 -136571 35635 81145 18592 142274 -120608 -468752 -175379 -22174 -233157 195570
6668 195570 402540 90997 -23713 183051 128236 -221408 -632665 -550766 -212358 -39454
6658 -39454 -145105 -604849 -710966 -687362 -307675 5115 47782 -2521 47178 98431 247248
6647 247248 266404 120798 172598 188975 442063 273498 252566 228962 333874 69028 -170783
6636 -170783 -263947 -296141 -108396 111622 257145 550 -42203 162459 206978 419402
6626 419402 207732 -3376 -64561 176212 431121 302005 132697 -55172 -34433 -79336
$$ packed form
6698A32124j8117j52173r2828M9652k31799k14449j10942O5528J11193J85023
6688b76788L89709l8190M3203j34396o4711k05001j24059J32894J4047J26721
6678a36571J72206M5510o2553J23682k62882l48144K93373J53205k10983M28727
6668A95570K06970l11543j14710K06764n4815l49644m11257Q1899L38408J72904
6658c9454j05651m59744j06117K3604L79687L12790M2667n0303M9699N1253J48817
6647B47248J9156j45606N1800J6377K53088j68565k0932k3604J04912k64846k39811
6636a70783r3164l2194J87745K20018J45523k56595m2753K04662M4519K12424
6626D19402k11670k11108o1185K40773K54909j29116j69308j87869K0739m4903
$$ plain form
6616 -79336 -97375 -226858 -98136 54056 344080 485927 94462 -293555 -342311 -153618
6606 -153618 152158 -242204 -552379 -371152 44653 21552 343787 143393 45160 254404
6596 254404 227583 179295 86745 29211 -55514 -407314 -291138 -29110 215268 -77807 -263839
6585 -263839 -471841 -630525 -489358 -398267 -234808 -163145 -268746 -638723 -933832 -839649
6575 -839649 -834584 -840210 -726214 -471072 1277 -99170 -256430 -237169 -209648 -277403 -927088
6564 -927088 -785249 -526910 -186525 -178949 -58855 30523 -189772 -82722 68863 -66206
6554 -66206 -411398 -671999 -454927 -212536 -119654 -175648 -116312 8114 18521 -63677 -70759
6543 -70759 -114365 -220485 126812 320142 540886 376480 263881 198581 250700 129126
$$ packed form
6616g9336j8039j29483J28722J52192K90024J41847l91465l88017m8756J88693
6606a53618L05776l94362l10175J81227M15805k3101L22235k00394r8233K09244
6596B54404k6821m8288r2550n7534q4725l51800J16176K62028K44378k93075j86032
6585b63839k08002j58684J41167R1091J63459P1663j05601l69977k95109R4183
6575h39649N065n626J13996K55142M72349j00447j57260J9261K7521o7755o49685
6564i27088J41839K58339L40385P576J20094Q9378k20295J07050J51585j35069
6554f6206l45192k60601K17072K42391R2882n5994N9336J24426J0407q2198p082
6543g0759m3606j06120L47297J93330K20744j64406j12599o5300N2119j21574
$$ plain form
6533 129126 380335 123796 -127219 -155839 -160841 -494103 -667477 -443327 -435124 -529379 -152990
6522 -152990 202977 241560 -143231 -89175 195162 436407 397410 455604 293863 242391 417007
6511 417007 227846 261953 316650 384307 267847 392072 615100 419115 586771 677716
6501 677716 627636 508565 -84155 -115698 -25760 -35394 528 -355417 -411228 -547165 -499567
6490 -499567 -268003 -374302 -142073 -115551 -324713 -442971 -501615 -603122 -599345 -201309
6480 -201309 31434 72511 89680 60857 -226876 -244471 -112199 -30456 114557 -25672 68937
6469 68937 -119150 -20307 -8029 -186456 -220179 -105756 -265233 -496068 -280834 32610
6459 32610 -101147 -363271 -255598 -440907 -114261 197665 152482 234421 302506 73067
$$ packed form
6533A29126K51209k56539k51015k8620n002l33262j73374K24150Q203r4255L76389
6522a52990L55967L8583l84791N4056K84337K41245l8997N8194j61741n1472J74616
6511D17007j89161L4107N4697O7657j16460J24225K23028j95985J67656R0945
6501F77716n0080j19071n92720l1543Q9938r634L5922l55945n5811j35937M7598
6490d99567K31564j06299K32229K6522k09162j18258n8644j01507L777L98036
6480b01309K32743M1077J7169k8823k87733j7595J32272Q1743J45013j40229R4609
6469F8937j88087R8843J2278j78427l3723J14423j59477k30835K15234L13444
6459C2610j33757k62124J07673j85309L26646L11926m5183Q1939O8085k29439
$$ plain form
6449 73067 -38884 -178864 -313170 -359866 -425159 -318392 -213727 -88802 -339517 -394074
6439 -394074 -166305 5638 -186782 303751 246047 -96447 -532203 -635493 -380210 -325901
6429 -325901 -239429 -344374 -245444 -113914 -18092 140930 111847 -36568 -227824 128397
6419 128397 595413 389809 185165 148827 23211 91877 -224640 -73021 222854 290268
6409 290268 514582 434165 465070 575141 415861 359785 206304 65260 163058 352644
6399 352644 506837 268131 481334 860346 872294 625620 594834 587833 174163 -367483
6389 -367483 -564443 -410696 -495793 -621463 -503926 -355916 -673727 -851920 -892262 -696661
6379 -696661 -539591 -352316 -427378 -337088 -162863 -74329 -323553 -658379 -596563 -665222 -433674
$$ packed form
6449G3067j11951j39980j34306m6696o5293J06767J04665J24925k50715n4557
6439c94074K27769J71943j92420M90533n7704l42494m35756j03290K55283N4309
6429c25901Q6472j04945R8930J31530R5822J59022k9083j48415j91256L56221
6419A28397M67016k05604k04644l6338j25616O8666l16517J51619K95875O7414
6409B90268K24314q0417L0905J10071j59280n6076j53481j41044R7798J89586
6399C52644J54193k38706K13203L79012J1948k46674l0786p001m13670n41646
6389c67483j96960J53747q5097j25670J17537J48010l17811j78193m0342J95601
6379f96661J57070J87275p5062R0290J74225Q8534k49224l34826O1816o8659K31548
$$ plain form
6368 -433674 -207701 -337059 -434712 -135287 521185 472970 175921 -131255 -239054 -262643
6358 -262643 62321 -107 -366725 -380198 295589 645538 174423 22917 -313637 -66003
6348 -66003 49700 18864 -201378 -267439 -296021 -8804 35948 18716 -156205 -53561 110086
6337 110086 24050 -340147 -396375 -500432 -573072 -415032 -279994 -279735 -317372 -324681 -444159
6326 -444159 -710659 -361669 -73936 -104795 -306192 -282580 12654 34207 87819 5237 145968
6315 145968 222003 196910 47798 226061 301591 160967 161551 -298489 -426919 -398330 -208099
6304 -208099 -282550 -214897 -33368 15294 -199443 -316988 -73272 126860 -50482 104054
6294 104054 -240744 -299998 -336128 -409251 -484728 -683296 -527573 -258724 -243339 -240244 16923
$$ packed form
6368d33674K25973j29358r7653K99425O56472m8215k97049l07176j07799k3589
6358b62643L24964o2428l66618j3473O75787L49949m71115j51506l36554K47634
6348f6003J15703l0836k20242o6061k8582K87217M4752j7232j74921J02644J63647
6337A10086q6036l64197n6228j04057p2640J58040J35038K59l7637p309j19478
6326d44159k66500L48990K87733l0859k01397K3612K95234K1553N3612q2582J40731
6315A45968P6035k5093j49112J78263P5530j40624N84m60040j28430K8589J90231
6304b08099p4451O7653J81529M8662k14737j17545K43716K00132j77342J54536
6294A04054l44798n9254l6130p3123p5477j98568J55723K68849J5385L095K57167
$$ plain form
6283 16923 290019 556126 309951 294803 118127 -235801 -469805 -433214 -466325 -323588
6273 -323588 -38470 80865 -19029 124390 277126 -44455 -383924 -256040 -65982 -67032
6263 -67032 -145765 -393525 -411910 -276430 -30337 -51875 -156130 -19244 138539 21214
6253 21214 -27321 -72846 167907 9424 -299708 -216227 -314831 -273790 -100906 275579 342211
6242 342211 198859 81793 193771 -202726 -373554 -40490 94809 -302147 -416983 -88986
6232 -88986 -299142 -418899 -356749 -20035 227233 135270 -90771 89212 -7979 188390
6222 188390 395955 338970 286322 423004 444290 85597 -406809 -645575 -532455 -462614
6212 -462614 -518508 -349141 -259812 -249819 -308023 -180203 237638 596765 312025 76205 -96519
$$ packed form
6283A6923K73096K66107k46175j5148j76676l53928k34004L6591l3111J42737
6273c23588K85118J19335r9894J43419J52736l21581l39469J27884J90058j050
6263f7032p8733k47760j8385J35480K46093k1538j04255J36886J57783j17325
6253B1214m8535m5525K40753j58483l09132Q3481r8604M1041J72884L76485O6632
6242C42211j43352j17066J11978l96497j70828L33064J35299l96956j14836L27997
6232h8986k10156j19757O2150L36714K47268r1963k26041J79983r7191J96369
6222A88390K07565n6985n2648J36682K1286l58693m92406k38766J13120O9841
6212d62614n5894J69367Q9329R993n8204J27820M17841L59127k84740k35820j72724
$$ plain form
6201 -96519 -386629 -263911 -131109 -391706 -484543 -541187 -217430 99131 523161 544923
6191 544923 371639 87028 60733 111479 104536 -190805 -208093 -210647 -391806 -590002 -560140
6180 -560140 -703692 -673486 -546909 -259593 -40157 56333 61696 -64497 -2521 276937 253586
6169 253586 283821 308994 301119 264411 277354 30427 -89468 54479 238177 226492 194866
6158 194866 -35861 12659 184730 406580 190365 -65315 1752 -25 -100892 98452
6148 98452 207569 322959 131706 49494 161235 -8828 137703 122454 138742 386750
6138 386750 158659 -8816 194430 224293 172712 -82932 197422 179373 341443 587835
6128 587835 505310 56433 -85796 -58648 -341509 -210473 -152777 -210954 134377 403033
$$ packed form
6201i6519k90110J22718J32802k60597r2837n6644L23757L16561M24030K1762
6191E44923j73284k84611k6295N0746o943k95341j7288k554j81159j98196K9862
6180e60140j43552L0206J26577K87316K19436R6490N363j26193O1976K79458k3351
6169B53586L0235K5173p875l6708J2943k46927j19895J43947J83698j1685l1626
6158A94866k30727M8520J72071K21850k16215k55680O7067j777j00867J99344
6148I8452J09117J15390j91253q2212J11741j70063J46531j5249J6288K48008
6138C86750k28091j67475K03246K9863n1581k55644K80354j8049J62070K46392
6128E87835q2525m48877j42229K7148k82861J31036N7696n8177L45331K68656
$$ plain form
6118 403033 507377 590235 190137 -118355 -384951 -133511 -139367 -65770 213055 175913 249117
6107 249117 138702 -147810 -237583 -61881 12584 320999 371518 289704 116354 -177858
6097 -177858 -159397 6353 13798 72927 46546 -216947 -627426 -698160 -353316 -474699 -408202
6086 -408202 -340554 -391851 -135783 -70589 -143660 -148985 -282461 -113019 7621 -118937 -365272
6075 -365272 66677 237311 -132575 -199106 -38369 -89974 -37310 -249997 -502747 -384264
6065 -384264 -237790 -154615 -76302 -195250 -95233 247243 329874 222870 14560 32875
6055 32875 -114703 -199200 -73788 177287 509574 440902 -42495 37573 -2649 22007 186249
6044 186249 221556 145865 -59294 -410661 -744217 -794192 -199363 -380588 -521262 -423642
$$ packed form
6118D03033J04344Q2858m00098l08492k66596K51440n856P3597K78825l7142P3204
6107B49117j10415k86512q9773J75702P4465L08415N0519q1814j73350k94212
6097a77858J8461J65750P445N9129k6381k63493m10479p0734L44844j21383O6497
6086d08202O7648n1297K56068O5194p3071n325j33476J69442J20640j26558k46335
6075c65272M31949J70634l69886o6531J60737n1605N2664k12687k52750J18483
6065c84264J46474Q3175P8313j18948J00017L42476Q2631j07004k08310J8315
6055C2875j47578q4497J25412K51075L32287o8672m83397Q0068m0222K4656J64242
6044A86249L5307p5691k05159l51367l33556m9975N94829j81225j40674R7620
$$ plain form
6034 -423642 -442318 -693744 -834387 -629902 -422984 -329273 -80494 -54147 -89296 -75492 -108698
6023 -108698 -421176 -324439 -340515 -440775 -265103 91764 322584 423705 427325 111685
6013 111685 -14357 110171 93829 219451 82929 -89557 59351 -47588 -32596 -264196
6003 -264196 -247457 -32320 -60602 -278069 -428998 -378965 189028 345370 339416 51026 53757
5992 53757 280289 134247 -139177 -261149 11903 -174878 -764773 -920647 -645617 -514346
5982 -514346 -242040 -126747 -199932 -85231 40823 -47720 -163782 -81114 9425 -156840
5972 -156840 -556560 -503043 -258073 -359568 -441554 -264522 -281894 -544963 -721248 -300427
5962 -300427 -184324 26475 56734 -133149 -327501 -352400 -295499 -239006 -69241 6871 -226548
$$ packed form
6034d23642j8676k51426j40643K04485K06918R3711K48779K6347l5149J3804l3206
6023a08698l12478R6737j6076j00260J75672L56867K30820J01121L620l15640
6013A11685j26042J24528j6342J25622j36522j72486J48908j06939J4992k31600
6003b64196J6739K15137k8282k17467j50929N0033N67993J56342n954k88390K731
5992E3757K26532j46042k73424j21972K73052j86781n89895j55874K75030J31271
5982e14346K72306J15293p3185J14701J26054q8543j16062Q2668R0539j66265
5972a56840l99720N3517K44970j01495q1986J77032j7372k63069j76285M20821
5962c00427J16103K10799L0259j89883j94352k4899N6901N6493J69765P6112k33419
$$ plain form
5951 -226548 -233810 147196 249649 325708 530034 664975 597628 532044 427079 374696 575063
5940 575063 421161 170037 67430 -84079 7456 -146195 -280365 -391236 -263161 58940
5930 58940 229995 266273 110590 131861 89977 16548 -67066 -101907 -241206 -320286 -415281
5919 -415281 -536387 -624679 -701288 -606263 -211132 -115916 -321645 -238872 -353822 -181551 186521
5908 186521 23297 70174 176774 106664 -146930 -234214 -131287 122327 105644 -99401
5898 -99401 -320688 -251710 -97179 -335862 -339161 -516786 -360604 -124690 -73035 -151123 -343146
5887 -343146 -379016 -249392 -454195 -500966 -272495 -213862 -276186 -72920 18937 163783 212282
5876 212282 -5329 -115716 51947 -82531 -185493 -381567 -360854 62408 237592 126694
$$ packed form
5951b26548p262L81006J02453P6059K04326J34941o7347o5584j04965n2383K00367
5940E75063j53902k51124j02607j51509R1535j53651j34170j10871J28075L22101
5930E8940J71055L6278j55683K1271m1884p3429q3614l4841j39299p9080r4995
5919d15281j21106q8292p6609R5025L95131R5216k05729Q2773j14950J72271L68072
5908A86521j63224M6877J06600p0110k53594q7284J02927K53614j6683k05045
5898i9401k21287O8978J54531k38683l299j77625J56182K35914N1655p8088j92023
5887c43146l5870J29624k04803m6771K28471N8633o2324K03266R1857J44846M8499
5876B12282k17611j10387J67663j34478j02962j96074K0713M23262J75184j10898
$$ plain form
5866 126694 -149248 -480389 -450745 -33959 494754 439868 26129 -377630 -152728 517197
5856 517197 353232 -96644 -475807 -234964 16863 321405 270417 43819 -475 193810
5846 193810 84717 -177435 -60116 -37129 12599 -10277 -301185 -259494 -334380 -216182 -252051
5835 -252051 -87257 -5780 -54915 -92461 -160015 -137322 64042 273516 373689 380487 66433
5824 66433 44777 -87675 -219224 -13330 56872 261824 85625 -118429 18491 191484
5814 191484 138172 -79329 -6609 -265446 -398935 -457338 -282867 136502 320775 373513
5804 373513 253617 409086 378379 328823 128343 118539 85811 64597 -118410 -273217 -270183
5793 -270183 -76794 51683 -6942 -251659 -514698 -488660 -365216 -219776 9391 -65134
$$ packed form
5866A26694k75942l31141K9644M16786N28713n4886m13739m03759K24902O69925
5856E17197j63965m49876l79163K40843K51827L04542n0988k26598m4294J94285
5846A93810j09093k62152J17319K2987M9728k2876k90908M1691p4886J18198l5869
5835b52051J64794Q1477m9135l7546o7554K2693K01364K09474J00173O798l14054
5824F6433k1656j32452j31549K05894P0202K04952j76199k04054J36920J72993
5814A91484n3312k17501P2720k58837j33489n8403J74471M19369J84273N2738
5804C73513j19896J55469l0707m9556k00480r804l2728k1214j83007j54807L034
5793b70183J93389J28477n8625k44717k63039K6038J23444J45440K29167p4525
$$ plain form
5783 -65134 149452 71848 -268811 -582027 -669405 -396855 -437657 -866156 -989248 -841377
5773 -841377 -662670 -609125 -614917 -446693 -230800 -289577 -435350 -237253 -166442 -28698 -36579
5762 -36579 -81943 -56754 -73181 -110527 -233088 -215558 -176120 -14376 244239 441010 314465
5751 314465 249419 96170 136269 274414 253428 255233 244241 569679 865764 1171642 884343
5740 884343 606321 680104 502873 165060 -320773 -431577 -445372 -504310 -393656 -434151
5730 -434151 -673095 -718104 -639071 -480934 -196966 -82414 -261076 -406148 -1529 175343
5720 175343 127093 107871 159867 38796 52629 476547 413576 122287 -3135 62090 441927
5709 441927 344188 86142 -264738 -400522 -413050 -587698 -561221 -292273 -214267 -193692 -234162
$$ packed form
5783f5134K14586p7604l40659l13216q7378K72550m0802m28499j23092J47871
5773h41377J78707N3545n792J68224K15893n8777j45773J98097P0811J37744p881
5762c6579m5364K5189j6427l7346j22561J7530L9438J61744K58615J96771j26545
5751C14465o5046j53249M0099J38145k0986J805j0992L25438K96085L05878k87299
5740H84343k78022P3783j77231l37813m85833j10804j3795n8938J10654m0495
5730d34151k38944m5009P9033J58137K83968J14552j78662j45072M04619J76872
5720A75343m8250j9222N1996j21071J3833M23918o2971k91289j25422O5225L79837
5709D41927r7739k58046l50880j35784j2528j74648K6477K68948P8006K0575m0470
$$ plain form
5698 -234162 -38219 -193918 37433 58401 -369732 -637004 -435460 -104243 -50317 277694
5688 277694 170735 -89935 -202268 -293968 -477953 -374855 -395130 -223326 164614 308988
5678 308988 252185 66824 45434 -29469 -182285 -25960 -116821 -77369 157508 281526 274727
5667 274727 167099 48477 -102158 -192839 119650 212425 289805 -35493 -295067 -95028
5657 -95028 55487 -23256 -53486 208606 -24271 -375816 -745080 -940841 -754147 -597374
5647 -597374 -390401 -283481 -161856 88220 152005 183771 80051 68905 -326356 -462437
5637 -462437 -201724 -144503 -364845 -273962 -92144 -215097 -385730 -673861 -671325 -236621
5627 -236621 182230 338399 365334 54711 -41060 111795 357906 -44807 -539362 -692482
$$ packed form
5698b34162J95943j55699K31351K0968m28133k67272K01544L31217N3926L28011
5688B77694j06959k60670j12333r1700j83985J03098k0275J71804L87940J44374
5678C08988n6803j85361k1390p4903j52816J56325r0861L9452K34877J24018o799
5667B74727j07628j18622j50635r0681L12489R2775P7380l25298k59574K00039
5657i5028J50515p8743l0230K62092k32877l51545l69264j95761J86694J56773
5647e97374K06973J06920J21625K50076O3785L1766j03720j1146l95261j36081
5637d62437K60713N7221k20342R0883J81818j22953j70633k88131K536M34704
5627b36621M18851J56169K6935l10623r5771J52855K46111m02713m94555j53120
$$ plain form
5617 -692482 -287111 -45723 -196273 -145188 -311732 -210649 -14248 -227403 -368995 -460632
$$ packed form
5617f92482M05371K41388j50550N1085j66544J01083J96401k13155j41592r1637
$$ [...]
##END NTUPLES=NMR SPECTRUM
##END=
