##TITLE=Analysis number 325083
Compound Code sb 01132
Project Code adrs
Chemist Name ians
##JCAMPDX= 6.0         $$ Bruker NMR JCAMP-DX V2.0
##DATA TYPE= NMR SPECTRUM
##DATA CLASS= NTUPLES
##ORIGIN= Bruker BioSpin GmbH
##OWNER= nmr
$$ XWIN-NMR		Version 3.5
$$ Mon Dec 11 09:16:30 2006 GMT Standard Time (UT+0h)  MAYBRIDGE\nmr@NMR_250MHZ
##.OBSERVE FREQUENCY= 250.131544655141
##.OBSERVE NUCLEUS= ^1H
##.ACQUISITION MODE= SIMULTANEOUS (DQD)
##.ACQUISITION SCHEME= undefined
##.AVERAGES= 16
##.DIGITISER RES= 18
##SPECTROMETER/DATA SYSTEM= dpx250
##.PULSE SEQUENCE= zg30
##.SOLVENT NAME= CDCl3
##.SHIFT REFERENCE= (INTERNAL, CDCl3, 0, 16.522)
##AUDIT TRAIL= $$ (NUMBER, WHEN, WHO, WHERE, WHAT)
$$ ##TITLE= Audit trail, XWIN-NMR		Version 3.5
$$ ##JCAMPDX= 5.01
$$ ##ORIGIN= Bruker BioSpin GmbH
$$ ##OWNER= nmr
$$ C:\u/data/dgb/nmr/ADRS/590/pdata/1/auditp.txt
$$ ##AUDIT TRAIL=  $$ (NUMBER, WHEN, WHO, WHERE, WHAT)
(   1,<2006-12-11 09:15:59.62 +000>,<MAYBRIDGE\nmr>,<NMR_250MHZ>,
      <created by zg, POWCHK disabled, PULCHK disabled
       configuration hash MD5:
       49 4B E0 1D 92 C2 6B 37 9F E6 65 BC 52 41 86 1D
       data hash MD5: 64K
       92 87 78 03 6F 32 D7 CF 6F 93 CB 5A BC 46 83 F6>)
(   2,<2006-12-11 09:16:22.10 +000>,<MAYBRIDGE\nmr>,<NMR_250MHZ>,
      <Start of raw data processing
       ef LB = 0.3 FT_mod = 6 PKNL = 1 SI = 32K 
       data hash MD5: 32K
       9C 52 42 CA 40 7D 60 EC 81 1F DC B5 10 64 22 DC>)
(   3,<2006-12-11 09:16:24.00 +000>,<MAYBRIDGE\nmr>,<NMR_250MHZ>,
      <apk 
       data hash MD5: 32K
       2E D5 76 44 2B 97 94 B9 A6 C0 06 E8 4A 9F CB 79>)
(   4,<2006-12-11 09:16:24.76 +000>,<MAYBRIDGE\nmr>,<NMR_250MHZ>,
      <abs ABSG = 5 
       data hash MD5: 32K
       F6 98 94 AA 04 11 B8 27 4C 8E E3 C2 DB 07 5D FD>)
$$ ##END=
$$ 
$$ hash MD5
$$ 85 CB FD 62 99 2F E4 45 E8 37 E5 C4 38 9D 57 31
##$RELAX= 
##$RELAX= 
##$RELAX= 
##$RELAX= 
##$RELAX= 
##$RELAX= 
##$RELAX= 
$$ Bruker specific parameters
$$ --------------------------
##$DU= <C:\u>
##$EXPNO= 590
##$NAME= <ADRS>
##$PROCNO= 1
##$TYPE= <nmr>
##$USER= <dgb>
##$AMP= (0..31)
100 100 100 100 100 100 100 100 100 100 100 100 100 100 100 100 100 100 
100 100 100 100 100 100 100 100 100 100 100 100 100 100 
##$AQSEQ= 0
##$AQ_mod= 3
##$AUNM= <au_zg>
##$AUTOPOS= <34 >
##$BF1= 250.13
##$BF2= 250.13
##$BF3= 250.13
##$BF4= 250.13
##$BF5= 500.13
##$BF6= 500.13
##$BF7= 500.13
##$BF8= 500.13
##$BYTORDA= 1
##$CFDGTYP= 0
##$CFRGTYP= 5
##$CHEMSTR= <none>
##$CNST= (0..31)
1 1 145 1 1 1 1 1 1 1 1 1 1 1 1 1 1 1 1 1 1 1 1 1 1 1 1 1 1 1 1 1 
##$CPDPRG= <>
##$CPDPRG1= <>
##$CPDPRG2= <>
##$CPDPRG3= <>
##$CPDPRG4= <mlev>
##$CPDPRG5= <mlev>
##$CPDPRG6= <mlev>
##$CPDPRG7= <mlev>
##$CPDPRG8= <mlev>
##$CPDPRGB= <>
##$CPDPRGT= <>
##$D= (0..31)
0 1 0 0 0 0 0 0 0 0.06 0 0 0 0 0 0 0.0002 0 0 0 0 0 0 0 0 0 0 0 0 0 0 
0 
##$DATE= 1165828558
##$DBL= (0..7)
120 120 120 120 120 120 120 120 
##$DBP= (0..7)
150 150 150 150 150 150 150 150 
##$DBP07= 0
##$DBPNAM0= <>
##$DBPNAM1= <>
##$DBPNAM2= <>
##$DBPNAM3= <>
$$ [...]
##$SUBNAM7= <"">
##$SUBNAM8= <"">
##$SUBNAM9= <"">
##$SW= 20.6930455092707
##$SWIBOX= (0..15)
0 0 3 0 0 0 0 0 0 0 0 0 0 0 0 0 
##$SW_h= 5175.983436853
##$TD= 65536
##$TD0= 1
##$TE= 295.16
##$TE2= 300
##$TE3= 300
##$TEG= 300
##$TL= (0..7)
0 120 120 120 120 120 120 120 
##$TP= (0..7)
150 150 150 150 150 150 150 150 
##$TP07= 0
##$TPNAME0= <>
##$TPNAME1= <>
##$TPNAME2= <>
##$TPNAME3= <>
##$TPNAME4= <>
##$TPNAME5= <>
##$TPNAME6= <>
##$TPNAME7= <>
##$TPOAL= (0..7)
0.5 0.5 0.5 0.5 0.5 0.5 0.5 0.5 
##$TPOFFS= (0..7)
0 0 0 0 0 0 0 0 
##$TUNHIN= 0
##$TUNHOUT= 0
##$TUNXOUT= 0
##$USERA1= <user>
##$USERA2= <user>
##$USERA3= <user>
##$USERA4= <user>
##$USERA5= <user>
##$V9= 5
##$VALIST= <valist>
##$VCLIST= <CCCCCCCCCCCCCCC>
##$VD= 0
##$VDLIST= <DDDDDDDDDDDDDDD>
##$VPLIST= <PPPPPPPPPPPPPPP>
##$VTLIST= <TTTTTTTTTTTTTTT>
##$WBST= 1024
##$WBSW= 4
##$XGAIN= (0..3)
0 0 0 0 
##$XL= 0
##$YL= 0
##$YMAX_a= 426853
##$YMIN_a= -482381
##$ZGOPTNS= <>
##$ZL1= 120
##$ZL2= 120
##$ZL3= 120
##$ZL4= 120
##$ABSF1= 16.522
##$ABSF2= -4.171173
##$ABSG= 5
##$ABSL= 3
##$ALPHA= 0
##$AQORDER= 0
##$ASSFAC= 0
##$ASSFACI= 0
##$ASSFACX= 0
##$ASSWID= 0
##$AUNMP= <proc_1d>
##$AZFE= 0.1
##$AZFW= 0.1
##$BCFW= 0
##$BC_mod= 0
##$BYTORDP= 0
##$COROFFS= 0
##$CY= 12.5
##$DATMOD= 1
##$DC= 0
##$DFILT= <>
##$DTYPP= 0
##$F1P= 14.0000005364418
##$F2P= -0.99999901652339
##$FCOR= 0.5
##$FTSIZE= 32768
##$FT_mod= 6
##$GAMMA= 0
##$GB= 0
##$INTBC= 1
##$INTSCL= 1
##$ISEN= 128
##$LB= 0.3
##$LEV0= 0
##$LPBIN= 0
##$MAXI= 10000
##$MC2= 0
##$MEAN= 0
##$ME_mod= 0
##$MI= 0
##$NCOEF= 0
##$NC_proc= -3
##$NLEV= 6
##$NOISF1= 0
##$NOISF2= 0
##$NSP= 0
##$NTH_PI= 0
##$NZP= 0
##$OFFSET= 16.522
##$PC= 1
##$PHC0= 223.8586
##$PHC1= 6.552662
##$PH_mod= 1
##$PKNL= yes
##$PPARMOD= 0
##$PSCAL= 4
##$PSIGN= 0
##$REVERSE= no
##$SF= 250.13
##$SI= 32768
##$SIGF1= 0
##$SIGF2= 0
##$SINO= 400
##$SIOLD= 32768
##$SREGLST= <1H.CDCl3>
##$SSB= 0
##$STSI= 32768
##$STSR= 0
##$SW_p= 5175.98343685301
##$SYMM= 0
##$S_DEV= 0
##$TDeff= 65536
##$TDoff= 0
##$TI= <Analysis number 999999
Compound Code 99
Book Reference 9
Project Code 9>
##$TILT= no
##$TM1= 0
##$TM2= 0
##$TOPLEV= 0
##$USERP1= <user>
##$USERP2= <user>
##$USERP3= <user>
##$USERP4= <user>
##$USERP5= <user>
##$WDW= 1
##$XDIM= 32768
##$YMAX_p= 350968251
##$YMIN_p= -121370
$$ End of Bruker specific parameters
$$ ---------------------------------
##NTUPLES= NMR SPECTRUM
##VAR_NAME=  FREQUENCY,     SPECTRUM/REAL,   SPECTRUM/IMAG
##SYMBOL=    X,             R,               I
##VAR_TYPE=  INDEPENDENT,   DEPENDENT,       DEPENDENT
##VAR_FORM=  AFFN,          ASDF,            ASDF
##VAR_DIM=   32768,         32768,           32768
##UNITS=     HZ,            ARBITRARY UNITS, ARBITRARY UNITS
##FACTOR=    0.157963299565203, 1,           1
##FIRST=     4132.6476996994, 0,             0
##LAST=      -1043.33573715361, 0,           0
##MIN=       -1043.33573715361, -121370,     0
##MAX=       4132.6476996994, 350968251,     0
$$ Real data points
##PAGE= N=1
##DATA TABLE= (X++(R..R)), XYDATA
$$ [...]
24805a3277L394M601J4367L690j2496K230j282j304J09j9899k335L3071L311j5406
24791a226J380r756j059K5849j0675J4595J0659k3299m1269k1704L5587N18l746
24778b4146P265J396k0328J6155k499j4704K7047k9507j2650O030K2954J6329
24766f658J7352P850l874j4948j0613j7625m304L718K146J4890n809n052K9946
24753G019L9269K094j8717j0656K4252j2433k6840k1645k1657L9872L1279j1463
24741B0374p001k5978l0426L5438K8378j7455J1991j9518r459m32R867p012l2467
24728d3700J7200L597r086K1464J8605J1456j2352j0111K0607J3893K0897K925
24716E5395l1086l4554l1914Q145K5963L3906J830M925m0710k7458K8746L6203
$$ plain form
24805 -13277 -9883 -5282 9085 12775 279 2509 1227 -77 32 -19867 -22202 10869 14180 -1226
24791 -1226 154 -9602 -10661 15188 4513 19108 29767 6468 -34801 -56505 -20918 -20400 -24146
24778 -24146 -16881 -15485 -35813 -19658 -22157 -36861 -9814 -39321 -51971 -45941 -22987 -6658
24766 -6658 10694 18544 14670 -278 -10891 -28516 -32820 -29102 -26956 -12066 -17875 -22927 7019
24753 7019 46288 48382 29665 19009 43261 30828 3988 -17657 -39314 558 31837 20374
24741 20374 13373 -12605 -43031 -7593 20785 3330 15321 -4197 -13656 -14088 -4221 -11233 -43700
24728 -43700 -26500 -22903 -31989 -10525 8080 19536 7184 -2927 17680 31573 52470 55395
24716 55395 24309 -10245 -42159 -34014 -8051 25855 27685 32610 -8100 -35558 -6812 29391
24704B9391k6075k6064k8115m317J1991J0916L612J030K9141K1142o025j645j4973
24691IJ0320K2527J1017j4361j0186j1949J1000j03J027k5851k8720K810M4013
24678A1553J1597k0969k5391k066l0016k773K6406P030J0972j0907L663J1870
24666i031L052j2799J720J7958P464l858m5312k1799k481P891J4286J9983j0546
24653c3472R305L0258j6349l323j7634Q451O999J6622J3325J2396k649p346J9364
24640C5947K0443j4183j4853J4228K5631l4918n490L5471J5878r783k5931m809
24628C7631n5046k2671n092L192K4098n980o817K0379j7681O459L4950n181o911
24615A330j7490J6103J5286m674N823K729J0312Q745j0603k6788k4984K8877p581
$$ plain form
24704 29391 3316 -22748 -50863 -55180 -43189 -32273 -28661 -27631 1510 22652 16627 14982 9
24691 9 10329 32856 43873 29512 19326 7377 18377 18274 19301 -6550 -35270 -32460 11553
24678 11553 23150 2181 -23210 -25276 -55292 -58065 -31659 -24629 -13657 -24564 -20901 -9031
24666 -9031 -5979 -18778 -17058 900 8364 4506 -40806 -62605 -65086 -57195 -42909 -22926 -33472
24653 -33472 -24167 6091 -10258 -13581 -31215 -22764 -15765 857 14182 26578 23929 16583 35947
24640 35947 56390 42207 27354 41582 67213 32295 26805 62276 78154 68371 42440 37631
24628 37631 -17415 -40086 -45178 -41986 -17888 -23868 -30685 -10306 -27987 -21528 13422 8241 1330
24615 1330 -16160 -57 15229 10555 16378 19107 29419 38164 27561 773 -24211 4666 -2915
24602b915N158J3157p326k8125k1136J7022n790J7436J7104q206j7020j529J153
24589b1017O396r747J4375j0200M812K002l5046J3166k257K2745J5137j1097L778
24576f953o154J4117k7606j93M0867r786j8903L0469j7326k2590N241k7255j9718
24563f5790K6877M4674K4345r496Q223k6942q626k178k969R295J0950p254k0795
24550a9686M274K2373J1225k4663j5293J2306J876p432o23P283J0157n832j0036
24537a4071O075J9299J4949p432j6245N475N621l588j2754J2650j2875J0661L004
24524A0769j060J2883n108q168j0037m000J1460Q170K4808j7894l1364P137K144
24511b60j4920J7216K0559J1874j1962k3030L785J6885J2579k8113j3833L786
$$ plain form
24602 -2915 2243 15400 8074 -20051 -41187 -24165 -29955 -12519 4585 -3621 -20641 -22170 -21017
24589 -21017 -14621 -24368 -9993 -20193 -15381 -13379 -48425 -35259 -37516 -14771 366 -10731 -6953
24576 -6953 -13107 1010 -26596 -26789 14078 4292 -14611 15858 -1468 -24058 -18817 -46072 -65790
24563 -65790 -38913 5761 30106 20610 28833 1891 -6735 -8913 -11882 -2587 8363 1109 -19686
24550 -19686 -15412 6961 18186 -6477 -21770 -9464 -7588 -15020 -15643 -8360 1797 -4035 -14071
24537 -14071 -7996 11303 26252 18820 2575 8050 13671 10083 -2671 9979 -2896 7765 10769
24524 10769 9709 22592 17484 9316 -721 -4721 6739 14909 39717 21823 -9541 -2404 -260
24511 -260 -15180 2036 22595 34469 22507 -523 3262 20147 32726 4613 -9220 -5434
24499e434O412K7881K893k1450p776O200J5109L573R991K5281j3885l8515L561
24486A3841L1643Q528m3791n0221j6736J2611J6479K452P815j1910M4165L1166
24474D6042l311l5706p21Q395k0898l2143J8895K482k071n11j587J7337J6973
24461A3176k4578l386J756J9977j0749j5341J8272o990j579j8671r695J0615M0762
24448A3569P083K0935L076j0551k3289J9207q431l1065k5848R27j2671J6445J4784
24435a5829m357l3491J5740J9951K3685j7619P853O0948K1128j2837L737j1113
24423E7796m8111k117K2225J4418J3422l6288k0632k2952o252J9094K1815K2939
24411C5357k5855j4274m934J9379q787j6080J1365K6029J1963j0734J1001l7540
$$ plain form
24499 -5434 978 28859 31752 10302 2526 8726 23835 27408 37399 62680 48795 10280 13841
24486 13841 45484 54012 10221 -40000 -56736 -44125 -27646 -25194 -17379 -29289 14876 46042
24474 46042 42731 7025 6304 14699 -6199 -38342 -19447 -16965 -19036 -19547 -21134 -3797 13176
24461 13176 -11402 -14788 -13032 6945 -3804 -19145 -873 -7863 -9442 -28113 -37808 -27193 13569
24448 13569 20652 41587 44663 34112 10823 30030 21599 -9466 -35314 -34387 -47058 -30613 -15829
24435 -15829 -20186 -53677 -37937 -17986 5699 -11920 -4067 56881 78009 65172 68909 57796
24423 57796 9685 7568 29793 44211 57633 21345 713 -22239 -28491 -9397 12418 35357
24411 35357 9502 -4772 -9706 9673 886 -15194 -3829 22200 34163 23429 34430 -3110
24399c110m2922J3112J3323J7064K0701k5193k241J2330o060n525j3991O915J9973
24386D376l636K763J15m229J0301K733l3579k742K2144K337k7884k6051J1942
24373d1410j416K642N887J8788P619k805k913M1337J6120m409l127m94m949j1038
24359A9832l542K2238j7347j0471j070m36J9l0734l9027o763L4054M4923L3071
24346D4747M40q852k803j2011N016r258j0759j6705O031L140J3968K3549j7793
24333A8710N237J8020l4513k3515Q088p55M246m606j8703R02Q450j5041k4687
24320e8167J9635M8099o172m400K5248Q475K930k7643k2261j4865M4067J0163
24308B5109j1617k9309l0400J6663J7797J8916j2572j4978K2700L313r417O680
$$ plain form
24399 -3110 -46032 -32920 -19597 -2533 18168 -7025 -9266 3064 -2996 -8521 -22512 -15597 4376
24386 4376 740 3503 3618 -611 9690 12423 -21156 -23898 -1754 583 -27301 -53352 -41410
24373 -41410 -42826 -40184 -34297 -15509 -7890 -10695 -13608 27729 43849 39440 36313 35819 30870 19832
24359 19832 16290 38528 21181 10710 9640 9204 9223 -21511 -60538 -67301 -33247 11676 44747
24346 44747 45187 36335 33532 21521 26537 17279 6520 -10185 -4154 -1014 12954 36503 18710
24333 18710 23947 41967 7454 -16061 -7973 -8728 -4482 -9088 -27791 -26889 -18439 -33480 -58167
24320 -58167 -38532 9567 3395 -1005 24243 32718 35648 8005 -14256 -29121 14946 25109
24308 25109 13492 -15817 -46217 -29554 -11757 7159 -5413 -20391 2309 5622 -3795 2885
24296B885J071J8336K1999k868j0215j1812p519j3418j3434J3049K0319J0108
24284B8501j824L298q591J9964k6555j3889j4988K2505J9752m1584m463K162j0211
24271b5923j0941K3992K1965K003Q63q043R544l852J0470J9407k8933l1874J2548
24258h774Q441p428M483m857j8186k0770K6072K8639J8913K691j7001Q488j650
24245A9061k1676j6554J051O275j6942P981l73K1249K251m618k0259k2889M058
24232d1385J2794j3335J0952L9575R397J247p703j686n02p337j0741Q107j3882
24219a4499N132R580J5624m7303n561J758J1280J2840j707m92J249J7431j9945
24206a4613n113J9945k87J9752k977L344j6942k5755K580J3179M24l7971K4184
$$ plain form
24296 2885 3956 22292 44291 41423 31208 19396 11877 -1541 -14975 -1926 18393 28501
24284 28501 26677 29975 21384 41348 14793 904 -14084 8421 28173 -13411 -17874 -15712 -25923
24271 -25923 -36864 -12872 9093 11096 11959 3916 13460 9608 20078 39485 10552 -21322 -8774
24258 -8774 -333 -7761 -3278 -8135 -26321 -47091 -21019 7620 26533 29224 12223 20711 19061
24245 19061 -2615 -19169 -18118 -11843 -28785 -20804 -21177 72 2323 -2295 -22554 -45443 -41385
24232 -41385 -28591 -41926 -30974 8601 17998 19245 11542 9856 9354 2017 -8724 -617 -14499
24219 -14499 -9367 213 15837 -31466 -37027 -35269 -23989 -11149 -12856 -13348 -12099 5332 -14613
24206 -14613 -19726 219 -68 19684 16707 20051 3109 -22646 -20066 -6887 -6463 -44434 -20250
24193b0250K1146J1107l365K0142j3710j1155r803j2082l8621K3103L0725K614
24181a49J052K4661J5913p429j0040l6178P936j2623l070K5562J5662o258J2713
24168B7752j646m2877j6615J8588J5610j741N878M391K2616r313j6019Q458J9823
24155C4905q056j0065j932n610P556j5880m1919k491M5049N600k2094M562J981
24142h394k9534j8808L5658N539J5669J0260N243j9842k1310J2022k2169J050
24130c4616L602L3470J1041j3458j4725O067J9119J4041j832l5391N901K6397
24118A9616j0023r166j2662k871L5228J4154J8224j3171o364l0708m6784l419
24106d7946K8884M0651j9971o161O5569J6339K2801l2490m4172j7525J0180J3180
$$ plain form
24193 -20250 896 12003 8638 28780 15070 3915 -5888 -17970 -56591 -33488 -2763 -149
24181 -149 903 25564 41477 34048 24008 -12170 -4234 -16857 -19927 5635 21297 15039 27752
24168 27752 26106 -16771 -33386 -14798 812 -929 4949 9340 31956 22643 6624 15082 34905
24155 34905 26849 16784 14852 9242 16798 918 -41001 -43492 1557 7157 -14937 -10375 -8394
24142 -8394 -37928 -56736 -21078 -15539 130 10390 15633 -4209 -25519 -13497 -35666 -34616
24130 -34616 -31014 2456 13497 39 -14686 -8619 10500 24541 22709 -12682 -6781 19616
24118 19616 9593 427 -12235 -15106 20122 34276 52500 39329 32965 2257 -44527 -47946
24106 -47946 -19062 21589 1618 -4543 61026 77365 100166 67676 23504 5979 16159 29339
24094B9339M654Q62K7491k1021l7099l2097r614L8354L0897j6140k4004l7576
24082d5954k899L9126m249j7709J1278L4783L350j8225j6823K1276M1902j3314
24070C2542k0801R981q344j9483k2760p237P286K2914O94j6010j3061j4934J8070
24057c1143O155j4157J3667K3548j6786k6042j4124J1174l586N313L1844J2045
24045b092J4240R039k36j9144k022J0098J7475J496O927Q95k0414j9119R906r346
24031b297K5743J6309K4196J2727j8067l4717l7424l512J6955O369K4470l1160
24019d08o729o56J3561r953P880P883q842J589L1501J0317r478P230j0852l0448
24005B595J7441J0582k586k4268K650J4091j0612k1683k55J8215L997M83k4387
$$ plain form
24094 29339 33993 34855 62346 41325 4226 -27871 -37485 869 31766 15626 -8378 -45954
24082 -45954 -48853 -9727 -13976 -31685 -20407 14376 17726 -499 -17322 3954 45856 32542
24070 32542 11741 21722 13378 -6105 -28865 -36102 -28816 -5902 -5208 -21218 -34279 -49213 -31143
24057 -31143 -24988 -39145 -25478 -1930 -18716 -44758 -58882 -47708 -51294 -45981 -14137 -2092
24045 -2092 12148 21187 20951 1807 -215 9883 27358 28854 35781 36676 16262 -2857 7049 -2297
24031 -2297 23446 39755 63951 76678 58611 23894 -13530 -17042 -87 6282 30752 -408
24019 -408 -7137 -7793 5768 -4185 3695 11578 2736 4325 35826 46143 36665 43895 33043 2595
24005 2595 20036 30618 28032 3764 6414 20505 9893 -11790 -12045 6170 10167 10650 -13737
23992a3737j4483l1237j4588N203L3243M210K8940J9498Q234j4174j3980j4962
23980a7833L0890M5022k1841k5326R375n626j8081J1762J4002M202k5509j129
23968i2m023j7544n058J187p327o313Q147J1474l4680Q952J4935q45J5322o997
23954b2862m441J6048K868O579j041L2461L451j315k7593j9077K712K0217j2181
23941d174j7494M666k1014N537K4088J3433j4003m499L9264K4680K135j8721n42
23928C3356j391J283m0182J2494q337m101K8729K1958m466p273K0922j0450k2442
23915B0100P766L2665k0918j6399k8528k3492K5056K9809J3096K9911k639j9446
23903D6981R603M673Q685p89r48p725l2316q873R566j228K5536Q767k5799j0354
$$ plain form
23992 -13737 -28220 -59457 -74045 -68842 -35599 -31389 -2449 17049 25283 11109 -2871 -17833
23980 -17833 13057 58079 36238 10912 20287 14661 -3420 8342 22344 26546 1037 -92
23968 -92 -4115 -21659 -26717 -25530 -32857 -39170 -31023 -19549 -54229 -45277 -30342 -31187 -15865 -22862
23954 -22862 -27303 -11255 -8387 -1808 -2849 29612 33063 31748 4155 -14922 -12210 8007 -4174
23941 -4174 -21668 -17002 -38016 -32479 -8391 5042 -8961 -13460 25804 50484 52619 33898 33356
23928 33356 31965 33248 -6934 5560 -2777 -6878 21851 43809 39343 32070 52992 42542 20100
23915 20100 27866 60531 39613 23214 -5314 -28806 -3750 26059 39155 69066 66427 46981
23903 46981 56584 61257 69942 69153 68205 60480 28164 19291 28857 27629 53165 61932 36133 25779
23889B5779n368J5782j9062o248j4791L558J1728j0410J6645r778j9620J0959
23877h26P276j3411K2714M123l2430K002L0428j1147k2783L719L223J8804K0713
23864C2405j4713k943L276j6728l204k6157j4378K2644J4826q298M611J5043O408
23851A2792l1137j7870P44k752o33L935m2047l914M6226M2910N105j4842K2201
23838B0718L2958p922J2873L348j1917l1665P018J6113k5043l5176R88j1464o244
23825c5415Q559J0067J5979J6703j2748j469k911n555K690K5424p951r428J9498
23812B3443j9600k4734k7060J5145J3874p950r256J7947j1246r980J180J6088
23800b2149J7330K2732j2381j5960k0882m1559J3409M0589K8395J8179k8082r588
$$ plain form
23889 25779 20411 36193 17131 10883 -3908 -350 11378 968 17613 7835 -11785 -826
23877 -826 6450 -6961 15753 19876 -12554 -10552 19876 8729 -14054 -10335 -7112 11692 32405
23864 32405 17692 14749 18025 1297 -1907 -28064 -42442 -19798 -4972 -13270 -8659 6384 12792
23851 12792 -18345 -36215 -35471 -38223 -38856 -34921 -76968 -80882 -34656 8254 13359 -1483 20718
23838 20718 53676 45754 58627 61975 50058 18393 25411 41524 16481 -18695 -17707 -29171 -35415
23825 -35415 -26856 -16789 -810 15893 3145 1676 -1235 -6790 -4100 21324 13373 3945 23443
23812 23443 3843 -20891 -47951 -32806 -18932 -26882 -36138 -18191 -29437 -39417 -38237 -22149
23800 -22149 -4819 17913 5532 -10428 -31310 -72869 -59460 -18871 9524 27703 -379 -9967
23788i967L0110P368m546j1154j1090m2058L109L4918j285Q226J598j0831J3269
23775G667j8669J0639o356R464N162p593M664j3428p212Q422L0744J5370r194
23762B9680n324J2070j1264j7517M637o079l1844J2094j54L2483K4137k7267l1583
23749a5931k0459j4084L3671K8324k096o533K6119O138j1442N752q463p549P330
23736B0777l1706r233J5863K158J2320Q912J6395O895k8813j9938J367N821J4068
23723A4886K7632ol7733j6024j6985k9469J8917J5586r872K5848K9302j8047O833
23710A0868l123J3500j4057j7354j5436N240J4647k5611m981J9041K8908p38J2957
23697B3861P522j9233J67j8610n313j8395J9092N8101L026l8003M154P601k3351
$$ plain form
23788 -9967 20143 27511 22965 11811 721 -41337 -38228 -3310 -4595 3631 5229 -5602 7667
23775 7667 -11002 -363 -6719 2745 7907 314 4978 -8450 -15662 -7240 23504 38874 29680
23762 29680 24356 36426 25162 7645 12282 6203 -25641 -13547 -13701 18782 42919 15652 -15931
23749 -15931 -36390 -50474 -16803 11521 9425 2892 29011 35149 23707 29459 20996 13447 20777
23736 20777 -10929 -20162 -4299 -2141 10179 19091 35486 42381 13568 -6370 -5003 818 14886
23723 14886 42518 42512 4779 -11245 -28230 -57699 -38782 -23196 -33068 -7220 22082 4035 10868
23710 10868 7745 21245 7188 -10166 -25602 -20362 -5715 -31326 -36307 -17266 11642 10904 23861
23697 23861 31383 12150 12317 -6293 -11606 -30001 -10909 47192 50218 12215 16369 23970 619
23684F19j7129N414K3744Q325l631k7548j1608J3255K3537O253k0566r109J5070
23671F626Q590Q567j9114k181N896l3137k443K1878J2671K3312j2975k3664n615
23658a1589o331j1885K6805K2597J5615k7417l1312j2881J2925O276Q178o88N733
23645c974l7989j2051L1497K3593K9976r11l1320l133K7782k0712k9046J3348
23633a2940P655l6549P556L0093J6592L789q824j1404J5671o992k364J5093l882
23620A3494O973M653m2230O361J8979J1891j6338J810K870k8097j7722q339j9377
23607f5072J5075L1668L4421J9857O827l5633j3814q492k2720K644K3852K7054
23595A5667k647j4262j8393j2789N661L916M3338K3551l9153k8025m847Q344Q122
$$ plain form
23684 619 -16510 -11096 12648 20973 17342 -10206 -21814 -8559 14978 21231 665 -8444 6626
23671 6626 15216 23783 4669 2488 8384 -24753 -27196 -5318 7353 30665 17690 -5974 -11589
23658 -11589 -17920 -29805 -3000 19597 35212 7795 -23517 -36398 -23473 -17197 -9019 -9707 -3974
23645 -3974 -41963 -54014 -22517 1076 31052 30141 -1179 -4312 23470 2758 -26288 -12940
23633 -12940 -5285 -41834 -34278 -4185 12407 16196 7372 -4032 11639 4647 2283 17376 13494
23620 13494 20467 25120 -17110 -10749 8230 20121 3783 5593 8463 -19634 -37356 -45695 -65072
23607 -65072 -49997 -18329 16092 35949 42776 7143 -6671 -15163 -37883 -35239 -11387 15667
23595 15667 13020 -1242 -19635 -32424 -26763 -22847 20491 44042 4889 -23136 -27983 -19639 -11517
23582a1517j941J552m863N293J6379k559K0057J2500J925j2124J4568j4643l9994
23569a5367k756o313j8057l986L5598J0105j8953J0442k2559l1053J5394L4367
23557a3138J5997n290r079J0441L04l888k6845j0920K0518K93n022k574q136k1818
23543e9157N239P330R463L0657J9721L2292j326k8182j714K6628j4409k3408L2166
23530C5300J0351M399l2014l0085j066o417K017L7717K6114l179l2804K1342J4984
23517D6659O024k9866R334j5788j4768k2264j8808L6808m802kO892j3265j7610
23504c1456K4564j556q462j0003r036J3280L8551L281j1662l299j157R020K434
23491A4499m739j8422j2300j7450J3290p606M594p075j515O460j677j5885J2827
$$ plain form
23582 -11517 -13458 -11906 -16769 -11476 4903 2344 22401 34901 36826 24702 39270 24627 -15367
23569 -15367 -18123 -24436 -42493 -46479 -10881 -776 -19729 -9287 -31846 -62899 -47505 -13138
23557 -13138 2859 -2431 -11510 -1069 -765 -4653 -31498 -42418 -21900 -21607 -26629 -29203 -37339 -59157
23543 -59157 -53918 -46588 -37125 -6468 13253 45545 44219 16037 14323 40951 26542 3134 35300
23530 35300 45651 50050 18036 -12049 -13115 -19532 -17515 20202 46316 43137 10333 31675 46659
23517 46659 52683 22817 32151 16363 1595 -20669 -39477 -2669 -7471 -7473 -581 -13846 -31456
23504 -31456 -6892 -8448 -16910 -26913 -35949 -22669 15882 19163 7501 4202 3045 12065 14499
23491 14499 9760 -8662 -20962 -38412 -25122 -32728 -28134 -35209 -36724 -30264 -31941 -47826 -34999
23478c4999J4860O577j8096j3696J5169J3290K2901J2342j3376J0157M063k492
23466A6700Q93N764K7276L3234J60l1315j9514J6344l624k6377m8165o21K1203
23453h042J971J2567j0043l314N710p732l8344n06K941o166J2713K0367J0702
23440g176Q051J6813J2011O290p016k5151J9071P278k4545l2436p553L3081K0020
23427A8738o123J7429k5715k9950K8613J3843K521j5359j3414K777m069J0993
23415B84J1502p091K6165M124j0972k2632K0979j0252J0359k268K2641R074K505
23402E4418k631k6072o021L255R911j8731l6581j4754n253K1253J3576k8063J874
23389c3819L7247P800l2997J5225L0172P043J1132n236K873P292k9534J5796P973
$$ plain form
23478 -34999 -20139 -13562 -31658 -45354 -30185 -16895 6006 18348 4972 15129 19192 16700
23466 16700 17593 23357 50633 83867 84027 52712 33198 49542 45918 19541 -28624 -29245 -8042
23453 -8042 -6071 6496 -3547 -6861 -1151 -8883 -47227 -47733 -44792 -50958 -38245 -17878 -7176
23440 -7176 875 17688 29699 35989 28973 3822 22893 30171 5626 -26810 -34363 -1282 18738
23427 18738 12615 30044 4329 -25621 2992 16835 19356 3997 -9417 -6640 -10709 284
23415 284 11786 4695 30860 34984 24012 1380 22359 12107 22466 20198 42839 51913 54418
23402 54418 51787 25715 19694 22949 32860 14129 -22452 -37206 -42459 -21206 -7630 -35693 -33819
23389 -33819 3428 11228 -21769 -6544 23628 30671 41803 36567 39440 46732 17198 32994 40967
23376D0967l3633m269R296J492J5932q834j3816J7644j1196j1076j5026K0759
23364H240K5221q402O19J1645M489j08K2633k1777l8390j7983k895K1868M2983
23351D8143l0288k3985J9126L3695R45l777j7593R144m504q969k5789o598K4460
23338A4010J1078L4651K478n468l7703k456K1180P530p373p229p687j2237J96
23325A0970K6271r844k7471m330M371r764R269K0973J6596j1178K090J144J6895
23312D5992L424j7758k9140R842m472k6471K2910J0003m506q024Q305k9702l017
23299b2614J7695J3971J9832J258j0843r924P841k9569o615L0310J4577m887k9040
23286h008q065p265K7289J7538n32m668Q854k2551k4832j954K3168n719n644q532
$$ plain form
23376 40967 7334 3065 12361 13853 29785 20951 7135 24779 13583 2507 -12519 8240
23364 8240 33461 25059 25678 37323 41812 41704 64337 42560 4170 -13813 -16708 5160 48143
23351 48143 17855 -6130 12996 46691 47636 43859 26266 35410 30906 21937 -3852 -10450 14010
23338 14010 25088 59739 62217 56749 19046 16590 37770 45300 37927 30698 23011 10774 10970
23325 10970 37241 27397 -74 -4404 -33 -9797 -528 20445 37041 25863 27953 29097 45992
23312 45992 49416 31658 2518 12360 7888 -18583 4327 14330 9824 1800 10105 -19597 -22614
23299 -22614 -4919 9052 28884 30142 19299 9375 17216 -12353 -18968 11342 25919 21032 -8008
23286 -8008 -16073 -23338 3951 21489 20957 16289 25143 2592 -22240 -24194 -1026 -6745 -12389 -20921
23272b0921K7495o818L4993K1071l1658r659K737l7529k5338R165L1150J9257
23260A3945J2440j4008k0032j85M463J0550J486j2784J7482J5293q186q751R175
23247B0888R075k326J836o473L0480J9220K746K8118j537l8705l3233l813J1007
23234C7283j476k3614j2929P668J6919K6368o925l4477r495k678r022K0766R256
23221A7644j5774k6981r542P082K9816O529R122J1549P042l4961j0748J1759K411
23208D948J588j4737j1673j1762J2390M1316J1645J1559j8429k2794j2521K555
23196e915L2045J3213P606P25k1775n516n643m888Q341J9747l3046R490J2242
23183B6626L955O633N371p244P629q539q204l3113l3974p367R533Q373L3947K2307
$$ plain form
23272 -20921 6574 -244 34749 55820 24162 14503 17240 -20289 -45627 -36462 -5312 13945
23260 13945 26385 12377 -7655 -7840 -3377 7173 8659 -4125 13357 28650 20464 11713 20888
23247 20888 29963 27637 29473 23000 53480 72700 75446 103564 102027 63322 30089 26276 37283
23234 37283 35807 12193 -736 6932 23851 50219 43294 8817 -678 -3356 -12378 8388 17644
23221 17644 1870 -25111 -34653 -27571 2245 8774 17896 29445 36487 1526 -9222 2537 4948
23208 4948 6536 -8201 -19874 -31636 -19246 22070 33715 45274 26845 4051 -8470 -5915
23196 -5915 26130 39343 46949 47674 25899 20383 14740 9852 18193 37940 4894 14384 26626
23183 26626 30581 37214 42585 35341 42970 34431 26227 -6886 -40860 -48227 -38694 -30321 3626 25933
23169B5933l0989k9289k2726M6309K9492j5388k556J3344m615j3716J3943K9080
23157C8822l307k3818K1629J4206L164J9117k5047k7027J6388m531P23l1528k7310
23144b8519L0133K2366J172k5225r402o223J1232R221j7479J4338J0903k6149
23132a3632j6917P105J512k4947J2872O138K1165K6453K2050J4361J6054Q727
23120H0941j7814j8247j6742l1522j0981N602L2446L0225j3976l1952k0497N630
23108f887J482J3573N0981j0722l0406j3984m778R65P72J3554J7687K471J2122
23095D6830p089j8057m6140j2710K8409L014K9834j5527j6806Q94J1082j7052
23083a3318J2404K9159j924j4597J3675K3989j4789k0410j4806N474p552J492
$$ plain form
23169 25933 -5056 -34345 -57071 -10762 18730 3342 786 14130 9515 -4201 9742 38822
23157 38822 35515 11697 33326 47532 50696 69813 44766 17739 34127 29596 30319 -1209 -28519
23144 -28519 1614 23980 25152 -73 -9475 -15698 -4466 4755 -12724 1614 12517 -13632
23132 -13632 -30549 -23444 -21932 -46879 -34007 -27869 -6704 19749 41799 56160 72214 80941
23120 80941 63127 44880 28138 -3384 -14365 -8763 23683 53908 39932 7980 -12517 -6887
23108 -6887 -5405 8168 59149 48427 18021 4037 -741 224 996 14550 32237 34708 46830
23095 46830 39741 21684 -24456 -37166 -8757 -5743 24091 8564 -8242 -7348 3734 -13318
23083 -13318 -914 28245 26321 11724 25399 49388 34599 14189 -617 4857 -2695 -1203
23071a203p30p369r384j6816k0209J8578J5988r44P953K946J8690O765J3151L5543
23057F2959J223l7166l7132N778L029j7476p503p570R985K1961K558j2960j2900
23044b5214L2537J0224N058L055P816j0131k5914L0717J0669O343J070L6850J6333
23031I9413k4828l330J055N197k890J4367L807J2279l5649k9025J4507J2211j7834
23018D9280k5188j2219M561J710K5705P045J07K835r584l0497K805M453R439L5966
23004F6418q067l711K5228K844q325l717j2324N903j9842J2980j8810K554L093
22991D4224j3775k1157P694M571R66K2195J7312q436J7637N72k6227j1805j3434
22978B0337J2858o03O311K3065R679q67j7454P479P338J6613O9737O9437R3326
$$ plain form
23071 -1203 -1933 -9302 -18686 -35502 -55711 -37133 -21145 -22089 -14136 -11190 7500 14265 27416 62959
23057 62959 64182 27016 -10116 -4338 -1309 -18785 -26288 -33858 -23873 -1912 646 -12314 -25214
23044 -25214 7323 17547 22605 25660 33476 23345 -2569 28148 38817 45160 46230 83080 99413
23031 99413 74585 71255 72310 77507 74617 88984 92791 105070 69421 40396 54903 67114 49280
23018 49280 24092 11873 16434 18144 43849 50894 51001 53836 44252 13755 16560 21013 30452 66418
23004 66418 58351 54640 79868 82712 74387 70670 58346 64249 44407 57387 38577 41131 44224
22991 44224 30449 9292 16986 21557 22523 44718 62030 53594 71231 71803 45576 33771 20337
22978 20337 33195 32592 38903 61968 71647 70780 53326 60805 68143 84756 154493 223930 317256
22965C17256J04472J44501K62161L05571K40957J96163R852j05750k38230k83263
22955I53690k49505k11079j35210j00247m4441m5243j2505k9283j8982J754q177
22944A00772j8550k1j0678j9064P975J8982L2558J8910l7771k1893k1935j7858
22932C1427J9919K6237j5243J2599L423j9910k1745l7852K2032L806J9055J4182
22920E7930k1215p888j4338R791K7532J5869M785k1269k5074K1453j787k3171
22908B2618J3784r453k8380K4770j0684k096P595J4722M0829j3011k9669k4328
22896F697r288L739M3592K0563l6887j795K1987M835r842K5545L1750l1821k9885
22883C9190k1787l1187l5474J3551J3899O149M0117O72j0794K86K0502P110J741
$$ plain form
22965 317256 421728 566229 828390 1133961 1374918 1571081 1580933 1475183 1236953 953690
22955 953690 704185 493106 357896 257649 213208 167965 155460 126177 107195 108949 100772
22944 100772 82222 82201 71523 52459 60434 79416 111974 130884 93113 71220 49285 31427
22932 31427 51346 77583 62340 74939 78362 58452 36707 -1145 20887 24693 43748 57930
22920 57930 36715 28827 14489 24280 51812 67681 72466 51197 26123 47576 45789 22618
22908 22618 36402 26949 -1431 23339 12655 10559 18154 32876 73705 60694 31025 6697
22896 6697 -2591 1148 44740 65303 28416 26621 48608 53443 43601 69146 100896 69075 39190
22883 39190 17403 -13784 -49258 -35707 -21808 -15659 24458 25130 14336 14622 35124 42234 43975
22870D3975j563j0135n426o034k5970k685j1425q243O592K8462q425j9357k575
22857b2809n06J2909L1400J6650L660l1700j1300k6995q962L3040j4647K1412
22845B152N255j4111j3950K0660J9381p125k1763K6489L4542K1214j1875k2386
22833C8483J5068k366k4082l6612O947L1443L4794j0732n2013K4057Q696J1931
22821D5614M0305k4638l2448m521J4089J5926J2762l611K008M282l623k1624j4236
22808C0285k8123j8397K3007k0238r184j0789K3372K7243Q633o394K0957K5811
22796F6183j1019j4086J528l0650k1237O784K4391J9654m57J3637o128j0651r484
22783B8465N27j3003j2905j381J3390p533M1254M2178o378j6705l0619k6026n618
$$ plain form
22870 43975 42412 32277 26851 20817 -5153 -7838 -19263 -27506 -20914 7548 -877 -20234 -22809
22857 -22809 -23315 -10406 20994 37644 41304 9604 -1696 -28691 -37653 -4613 -19260 2152
22845 2152 7407 -6704 -20654 6 19387 12262 -9501 16988 51530 72744 60869 38483
22833 38483 53551 51185 27103 -9509 -2562 28881 63675 52943 930 24987 33683 45614
22821 45614 85919 61281 28833 24312 38401 54327 67089 63478 65486 69768 66145 44521 30285
22808 30285 2162 -16235 6772 -13466 -22650 -33439 -10067 17176 25809 19415 40372 66183
22796 66183 55164 41078 42606 11956 -9281 -2497 21894 41548 41091 54728 48600 37949 28465
22783 28465 28992 15989 3084 1703 15093 7560 48814 90992 84614 67909 37290 11264 5646
22770E646K8273K6292j8698R966N763k43j8593J0930R987r542P830O483m300o682
22756E3112k5195j1525k0945J8801Q282n772n545r784n611p254n602J7502J5538
22743A6002K7784J9286r624n829Q710J5647o010J6577o653J1677K231r145M731
22730H5384J5986k5008K206J3597k6715k6143m972R315N512K8724J6688P952j327
22717A01199l260K929J4331J4595l4492l7197m7530j5792J0810J7038J7751r381
22705C1001J2965J6644J2747J0246j3691r413Q620K9264n788j2837J4339j0420
22693H3677k5667m153j0145n97o749N038J4497K6240k483j280L058J5939K2969
22680A20344k18J1751l3097m1759j6705j1995J4579J0424J7833l734n829j2544
$$ plain form
22770 5646 33919 60211 41513 51479 57242 56999 38406 49336 59323 49781 57611 64094 59794 53112
22756 53112 27917 16392 -4553 14248 22530 16758 11213 1429 -4182 -11436 -17038 464 16002
22743 16002 43786 63072 53448 47619 56329 71976 65966 82543 75890 87567 89798 80653 85384
22730 85384 101370 76362 78568 92165 65450 39307 34335 43650 49162 77886 94574 102526 101199
22717 101199 97939 100868 115199 129794 95302 58105 10575 -5217 5593 22631 40382 31001
22705 31001 43966 60610 73357 83603 69912 60499 69119 98383 92595 79758 94097 83677
22693 83677 58010 53857 43712 43115 36366 41404 55901 82141 79658 78378 81436 97375 120344
22680 120344 120126 131877 98780 57021 40316 28321 42900 53324 71157 67423 61594 49050
22668D9050j3126K9924M0948L2319K7795K0715N419k0939k6638P563J5538k7387
22656A41181K4333j3065N48j9335l4895R470R028l3780l7300k1174k0823L418
22644G606L4163Q552J3119J2700J2393j5362l8454j8806m806K496L1395J5341
22632F0337M602O376J6671l62l1213n831j4827k3079K7490q766r986o831J7004
22619C1585R099l6144P312J946K3348J5352P849K4765j482m6048k203k525K1060
22606E3914M17n150K0129R491j8345l042J1690j053J0324N4853J1392n592k2243
22593A16785l3557l4791N562K4376O72m997j5576k2431N037J2018m683k728m875
22580D0812j1433J2036o618k794J6045J2323J3804J3295K014J6167J4547j127
$$ plain form
22668 49050 35924 65848 106796 139115 166910 187625 193044 172105 145467 153030 168568 141181
22656 141181 165514 152449 152997 133662 98767 108237 117265 83485 46185 25011 4188 7606
22644 7606 41769 50321 63440 76140 88533 73171 34717 15911 11105 13601 44996 60337
22632 60337 64939 71315 87986 87624 56411 50580 35753 12674 40164 31398 21412 14581 31585
22619 31585 40684 4540 11852 13798 37146 52498 60347 85112 83630 37582 35379 32854 53914
22606 53914 54331 49181 69310 78801 60456 57414 69104 68051 78375 133228 144620 139028 116785
22593 116785 83228 48437 53999 78375 79047 74050 58474 36043 41080 53098 48415 45687 40812
22580 40812 29379 41415 34797 32003 48048 60371 74175 87470 89484 105651 120198 119071
22568A19071J0854N370j0856m717j3470q200k0696P131L283Q090j239j7811q538
22555F8272l510Q661L5823K4781J5384l4613j1779o570l6596p057J8708R047j8405
22542F2146j9990k4811J0247L4928N898j7788j0066q212k8649l6073j4701M5681
22530a390N7317L1707L3567N2462K5494L1426L92k0770J3779K7206K500J785J1264
22517B66739k496P529J4034J470j8165k1419j1168J401R166r654J2790K3158k5680
22504B47705l161K3842j6182j0484K4706J5278m018L2777M1132L6195L1853P3753
22492D93396O0912N7600J44265K41035L24514K92248K70000J7024j20844k28161
22482A551989l07426k61272j92199j26920m9682j7911j3193l2118k6198j6035
$$ plain form
22568 119071 129925 135295 124439 119722 106252 98052 77356 84487 87770 95860 94621 76810 68272
22555 68272 64762 73423 109246 134027 149411 114798 103019 96449 59853 52796 71504 80551 62146
22542 62146 42156 17345 27592 62520 68418 50630 40564 32352 3703 -32370 -47071 -1390
22530 -1390 55927 87634 121201 173663 199157 230583 230975 210205 223984 251190 253690 255475 266739
22517 266739 264243 271772 285806 287276 269111 247692 236524 237925 247091 237437 250227 273385 247705
22504 247705 244544 268386 252204 241720 266426 281704 277686 310463 351595 387790 419643 493396
22492 493396 554308 611908 756173 997208 1321722 1613970 1883970 1900994 1780150 1551989
22482 1551989 1244563 983291 791092 664172 614490 596579 583386 551268 525070 509035
22472E09035O333J6079K9345K3696L7155L0785M1783O6396K2193j7383j1323K815
22460G56909K63k3406j4841j0323N2457L6682K7209K6562O4678L8172M9981O1764
22448A066107O4998Q4735P4400R8262R8465R9022Q8351J09673J17968J06556J03932
22437B112469J72173K03247J91243K28289K12468K04329K40456K89381L45659
22428D199714M06573M81306N54751P19683R03898J082863J388158J771662K394831
22419A3903439L170718M110583N676093Q204093J2187518J9840648L4411741N1583812
22411A53088645N0479755N2098144L7028612o396494k2636402m6357591n6941627
22404A60363042m7456105l6580992k3204907j3674253q638659o136082m503133
$$ plain form
22472 509035 515368 531447 560792 584488 621643 652428 694211 760607 782800 765417 754094 756909
22460 756909 757172 733766 718925 708602 761059 797741 824950 851512 916190 954362 1004343 1066107
22448 1066107 1131105 1215840 1290240 1388502 1486967 1585989 1674340 1784013 1901981 2008537 2112469
22437 2112469 2284642 2487889 2679132 2907421 3119889 3324218 3564674 3854055 4199714
22428 4199714 4606287 5087593 5642344 6362027 7265925 8348788 9736946 11508608 13903439
22419 13903439 17074157 21184740 26860833 35064926 47252444 67093092 101504833 153088645
22411 153088645 203568400 255666544 292695156 286298662 263662260 217304669 160363042
22404 160363042 112906937 76325945 53121038 39446785 30808126 24672044 20168911
22397B0168911l405851k636631k006423j584743j268711j057452q91222p59592
22389F558286o79688o03238n57402n20737m27647l73028l08116l01361k80803
22380B506266k15480j88913j81749j19121r8803j48959q6968n8379n6727m8622
22370A302545n8865r0519o9141n0724n6253n9317k2076l2665m8332m5054o3053
22359G06546n1142m3927l1748j6712O946j0712k3107j1667m1095o8837n1221j2954
22347C50370M450Q140j3038j568J9025L4218j8334q553K596L8418O3223P9367
22335E58314J43214K34531L10400K65134K50705J3748j25731j93411k81620k95872
22325H79412k15054j39891r1900n5122k3853p1444n3675j0919M350K733k5222
$$ plain form
22397 20168911 16763060 14126429 12120006 10535263 9266552 8209100 7317878 6558286
22389 6558286 5878598 5275360 4717958 4197221 3769574 3396546 3088430 2787069 2506266
22380 2506266 2290786 2101873 1920124 1801003 1702200 1553241 1466273 1407894 1351167 1302545
22370 1302545 1243680 1153161 1084020 1033296 977043 917726 895650 862985 814653 769599 706546
22359 706546 655404 611477 579729 563017 569963 559251 536144 524477 483382 414545 363324 350370
22347 350370 354820 362960 349922 348354 367379 401597 383263 374710 377306 415724 478947 558314
22335 558314 701528 936059 1246459 1511593 1762298 1776046 1650315 1456904 1175284 879412
22325 879412 664358 524467 432567 377445 353592 282148 228473 217554 221904 224637 199415
22314A99415L130l2714l8149l2037p883J702J1379J874K6353k9181j3342k4414
22302F6133j6855k1902j1330j602k465k322j0198j332J864K0728K5871M0225K1984
22289A08799M2214Q1979P3365N1999L0520N986k4691m6947j6678J4540K1656p360
22277C35382k9258o369k4083k8767k3150m5128k3237n6327j3030K2862j2022m2924
22265E3949p179k2050k0466L3662M4324k9590j5012M823K7215j6643j5370l8588
22253i25j2881O641n480L6959J9128k2531l6397l8321J5327O9006M6955L858j8907
22240F2432M3737M357O22k0706k6335j2189q476l572q194l2092J2684O265L6940
22227E5473j488p111j7521q794L3648N763k8595o857K0446R413j0706k3919m3551
$$ plain form
22314 199415 202545 169831 131682 99645 91762 93464 104843 106717 133070 103889 90547 66133
22302 66133 49278 27376 16046 14444 11979 9657 -541 -1873 -9 20719 46590 86815 108799
22289 108799 151013 232992 306357 358356 388876 394862 370171 323224 306546 321086 342742 335382
22277 335382 306124 299755 275672 246905 223755 178627 155390 99063 86033 108895 96873 53949
22265 53949 46770 24720 4254 37916 82240 52650 37638 42461 69676 53033 37663 -925
22253 -925 -13806 -7165 -12645 24314 43442 20911 -15486 -53807 -38480 30526 77481 81339 62432
22240 62432 106169 110526 111148 90442 64107 51918 43442 39870 31676 -416 12268 18533 55473
22227 55473 53985 46874 29353 20559 54207 59970 31375 24518 44964 54377 43671 19752 -23799
22214b3799J3367K268j0733J1407Q05l0835L4069M3177K8901j6290q751K3846
22202F7432J1034j2274k8762J303J886J3538L149j91l496k4101k6413J74j2045
22189h766J235k3505j3808k970M3728L0858M7448o144r869p759J4074M188j716
22176F6994K737j0608j7744m5497o796P667M3686J6019j7836j1056N986K83J3401
22163D7236J3746j691j693J3751l6375j1375J4149r640r657J5731m841K104j6421
22150A5024J3362j0840N265R049N633j609J674j5783k3131J6571L667k5980R586
22137B488N264R5L457n439M374m587j4023m4163J9237K7382J8026L9963k0746
22124C1328k8457M989J5989M336j2118k2175J7726J3363n420J7230J3681J0450
$$ plain form
22214 -23799 -10432 -8164 -18897 -7490 -6685 -37520 -3451 39726 68627 52337 43586 67432
22202 67432 78466 66192 37430 38733 40619 54157 57306 57115 53619 29518 3105 3279 -8766
22189 -8766 -7531 -31036 -44844 -47814 -4086 26772 74220 68076 58207 50448 64522 68710 66994
22176 66994 69731 59123 41379 -4118 -10914 -3247 40439 56458 38622 27566 33552 33835 47236
22163 47236 60982 59291 57598 71349 34974 23599 37748 28108 18451 34182 29341 31445 15024
22150 15024 28386 17546 22811 31860 37493 35884 37558 21775 -1356 15215 18882 -7098 2488
22137 2488 7752 7847 11304 5865 10239 5652 -8371 -52534 -33297 -5915 12111 52074 31328
22124 31328 2871 7860 23849 28185 16067 -6108 11618 24981 19561 36791 50472 60922
22112F0922k5501k1945J8668K9916k459j8452j8467l4761k9906l6619o256M555
22100h0305j2572k2905K3860L9995N5588K8224k4380J2051j8781k0385o136J6968
22088h778K3264j1318P081J1265j7173O48m922j4090J7776K0299j6419l7618K2195
22075g790L4003j8906l306j8412j8903J2914j6156N057o213j7676O966M7220L034
22062A832k226L9646n279j6725N721L868L407P578k302k3692j4149J6466l135
22049A1010j7129k1969R173j1515n043K5905L1796l1311o9998J8473J0515Q715
22037d1378J6070k889N195K132j9910L2020L5147L9974N688j8167k3606k9981
22025B95k8526j0978J4779Q613L0831J2688k7172k6804K1388K3604j3221j1970
$$ plain form
22112 60922 35421 13476 32144 62060 59601 41149 22682 -12079 -41985 -78604 -84860 -80305
22100 -80305 -92877 -115782 -91922 -51927 3661 31885 7505 19556 775 -19610 -25746 -8778
22088 -8778 14486 3168 10249 21514 4341 4989 67 -14023 3753 24052 7633 -29985 -7790
22075 -7790 26213 7307 4001 -14411 -33314 -20400 -36556 -31499 -37712 -55388 -48422 -1202 1832
22062 1832 -394 39252 33973 17248 22969 26837 30244 37822 35520 11828 -2321 14145 11010
22049 11010 -6119 -28088 -18915 -30430 -35473 -9568 22228 -9083 -79081 -60608 -50093 -41378
22037 -41378 -25308 -28197 -23002 -20870 -40780 -8760 26387 66361 72049 53882 30276 295
22025 295 -28231 -39209 -24430 -15817 15014 27702 530 -26274 -4886 18718 5497 -6473
22013f473Q984k36J3063Q953j5289k657K0742K1332m2835m2238j0690j3334R278
22000e1400k846q24J0982K1442q81m799p991l0706j7456L2195J5118j6109J4269
21987c9006L8734J7334j6242L600K4778j494k7355j4022O560j2950j7773N800
21975c2036J8153J2769j1912j2718k712M622K4840J27R22M6497O238n2863o687
21962d760k489J7282J0739J8942l966o857R471p235j0666J9432J118j4453l9380
21949a2822k2946R853J2400n909j2346J5594J941k0720j5907m616J7128p15m373
21936d3438M529J0190q794P86j3489l0955J335R491J7758M5731m741o346K9142
21923A1199K2377M531j2501k1784P09k7976p951J9235J010j7867j8433N243K7787
$$ plain form
22013 -6473 2511 2275 15338 24291 9002 6345 27087 48419 5584 -36654 -47344 -60678 -51400
22000 -51400 -54246 -55070 -44088 -22646 -23527 -28326 -36317 -67023 -84479 -52284 -37166 -53275 -39006
21987 -39006 -272 17062 820 4420 29198 27704 349 -13673 -7113 -20063 -37836 -32036
21975 -32036 -13883 -1114 -13026 -25744 -28456 -23834 1006 1133 2055 48552 54790 1927 -4760
21962 -4760 -7249 10033 20772 39714 35748 28891 38362 31127 20461 39893 41011 26558 -12822
21949 -12822 -35768 -25915 -13515 -19424 -31770 -16176 -14235 -34955 -50862 -55478 -38350 -39065 -43438
21936 -43438 -38909 -28719 -37513 -36727 -50216 -81171 -79836 -70345 -52587 -6856 -11597 -17943 11199
21923 11199 33576 38107 25606 3822 4531 -23445 -31396 -12161 -11151 -29018 -47451 -42208 -14421
21910a4421J4365r370J5207j7568k4368j2317j2902j3956K8619J9257L1572J2662
21898A6780O392J3084p874Q122j7637l0263L1480N9698p062l5340j4899k5822
21886c341k0567P820J0325j4129K3293j70N760k2048m439R208l327J4m818K155
21872a4264K4665j4353j8558N366K37l014K0245L4425j3513j5346M21K0724K594
21859B9629R245K8908j311M8336P5476J00802J68471K53742K87381K89026K57728
21848A547433j6178r9183k01441k89935k78039k14996j32105r5996o5603l1129
21838A22828j3432P568l7447j9179k4135l200j811j5729N191L347j7187M699K9346
21825D0859q502q738J2988J0291L627j2788k5199J406K2714j5981k9572j9478
$$ plain form
21910 -14421 -56 -9426 5781 -11787 -36155 -48472 -61374 -75330 -46711 -27454 4118 16780
21898 16780 23172 36256 28382 36504 18867 -11396 20084 79782 72720 37380 22481 -3341
21886 -3341 -23908 -16088 -5763 -19892 3401 3231 8991 -13057 -17496 -8288 -11615 -11601 -16419 -14264
21872 -14264 10401 -3952 -22510 -17144 -16907 -19921 324 34749 21236 5890 6311 27035 29629
21859 29629 38874 67782 66471 114807 190283 291085 459556 713298 1000679 1289705 1547433
21848 1547433 1531255 1432072 1230631 940696 662657 447661 315556 219560 153957 122828
21838 122828 109396 116964 79517 60338 36203 33003 31192 15463 20654 24001 6814 11513 40859
21825 40859 32357 23619 36607 46898 50525 37737 12538 13944 36658 20677 -8895 -28373
21813b8373l39J4103J2075j7354l0624K024J0345j3784k842L1221O989J1959J3144
21800H544p89k5251J3324N913k2485j6925J1500L5989j661j9912j0701J4878L2190
21787B4614K4092k5663m1446j3790K4343K3657L2713J0600r40P0j1581o694k2340
21774A7635Q239J5513q565k4311j2011j8223m780r52K3626J9954j4542k1411M3970
21761B4142l126J8285P600l6705K277M1573J0660l5506l4927k3193R055J3914
21749e951j5467J4931J1662j4742k4382J4294j0162l050n717o919K0612J1023
21737a3868l72J0733J8445q372Q321R577K259K532O366J1559j3306N644l3432
21724F086l2125L12Q904p451J7687J4362K3846J5193J0158j4311k5655k5857r367
$$ plain form
21813 -28373 -28712 -14609 -2534 -19888 -50512 -48488 -38143 -51927 -54769 -23548 -16559 -4600 8544
21800 8544 7755 -17496 -4172 1741 -20744 -37669 -26169 9820 8159 -11753 -22454 -7576 24614
21787 24614 48706 23043 -18403 -32193 -7850 15807 48520 59120 58180 58250 46669 39975 17635
21774 17635 25874 41387 32822 8511 -3500 -21723 -26503 -27455 -3829 16125 1583 -19828 24142
21761 24142 21016 39301 46901 10196 12473 54046 64706 29200 -5727 -28920 -19865 -5951
21749 -5951 -21418 -6487 5175 -9567 -33949 -19655 -29817 -32867 -38584 -45503 -24891 -13868
21737 -13868 -14240 -3507 14938 6566 14887 24464 26723 29255 35621 47180 33874 39518 6086
21724 6086 -26039 -25727 -16823 -24274 -6587 7775 31621 46814 56972 42661 17006 -8851 -18218
21711a8218K598n17Q259N532K7004n294j0478J5766q910k1066k2408j0630J3411
21698b4951j0205j0673L8622M129J046j9311m943J2210k445J5081j7127k1416
21686c9983L4111L3654l6113P105l5r105j1690J459J1745j6119n768J2477M246
21673a4016K0693L67k1693j9889o540Q419N145J4590m275K4887j6148m9778n501
21660f3739M2228L0657J2248j7844j5516J2889J800l062k4324k1334L253L430
21648c9314K7370K9854j6665k8959k8872J8573P5959n582j4104l3729o479j1152
21636c3100J3324J0792J7564M458o480J4338k2449k5078P911o026p148L001K6502
21623b391J9784p985k7253j4207r927K7029M1775q389j1198J7881k9367o535j9209
$$ plain form
21711 -18218 -15620 -16137 -7878 -2346 24658 19364 8886 24652 15742 -5324 -27732 -38362 -24951
21698 -24951 -35156 -45829 -7207 -3078 -2032 -21343 -26286 -14076 -16521 -1440 -18567 -39983
21686 -39983 -5872 27782 -8331 -1226 -1261 -10366 -22056 -20597 -8852 -24971 -30739 -18262 -14016
21673 -14016 6677 7044 -14649 -34538 -41078 -32659 -27514 -12924 -17199 7688 -8460 -58238 -63739
21660 -63739 -21511 9146 21394 3550 -11966 923 2723 -339 -24663 -45997 -42744 -39314
21648 -39314 -11944 17910 1245 -27714 -56586 -38013 37946 32364 18260 -15469 -21948 -33100
21636 -33100 -19776 -8984 8580 13038 6558 20896 -1553 -26631 -18720 -24746 -31894 -28893 -2391
21623 -2391 17393 9408 -17845 -32052 -41979 -14950 26825 18436 7238 25119 -4248 -10783 -29992
21610b9992k845J323q576L0825k2551j434J7185K507p367J2223J8671l701J3053
21597A9321j8965k7242P44J1412K8128k273k7651k1105l0302j1178L2800K4988
21585b1323O764J4343j7622j5681J0093K980j519O489J3913k0098j4549J0799
21573b5411K918K4113L6953q111r796J7422M127o792q76j7856r717m918j1058
21560i002R359n951o738j3314k267j4007J825Q121P846J8222l036k9024M31o697
21546d4232K1810l751M384k0501K4571K0715k1069j048j4283j8928O607L2277
21534a3448K491j3331j8347j1589K708R185J6657L4945L7071J6122L48j9806k6032
21521A6974J4124M28N481J153j2023n842k1817J2259N752j308P008k753l0195
$$ plain form
21610 -29992 -32837 -31514 -40090 -9265 -31816 -33250 -16065 -13558 -20925 -8702 9969 6268 19321
21597 19321 356 -26886 -26142 -14730 13398 11125 -16526 -37631 -67933 -79111 -46311 -21323
21585 -21323 -14559 -216 -17838 -33519 -23426 -20446 -21965 -15476 -1563 -21661 -36210 -25411
21573 -25411 -22493 1620 38573 30462 20666 38088 42215 35423 34547 16691 6974 2056 -9002
21560 -9002 357 -5594 -12332 -25646 -27913 -41920 -40095 -31974 -24128 -5906 -8942 -37966 -37535 -44232
21546 -44232 -22422 -26173 -21789 -42290 -17719 2996 -18073 -19121 -33404 -52332 -45725 -13448
21534 -13448 -10957 -24288 -42635 -54224 -51516 -42331 -25674 9271 46342 62464 62812 43006 16974
21521 16974 31098 31526 37007 38160 26137 20295 -1522 10737 16489 15181 22189 19436 -10759
21508a0759j4298k0949O147J0030P874j381j7992l405K9751J3140k8692j5127
21496d5661J791P334k568J6513K8064k022j3441M44k986k483K3274R311J1810
21483B9380o701P92k1497k0453q401j8561Q602J4225k131J2553K2801m460O121
21470A2270k717m1045m273M9026j6152N575j5820l321k3844K065J6625N058J6594
21457D1p680J0843p450j513j5610k171k2243n894k607K1054Q962K6403n754J212
21443b407p617k1256K0490j2906k0126p975j2141j1597N1327J5131N075M2046
21431C8044L0438r879m5610r77k3282j62N733M632J246J358J001m550j533k4937
21417b8478l0685J6562J4806L565p347K0614j1721j5650m297L0539K5704k8764
$$ plain form
21508 -10759 -25057 -46006 -39859 -29829 -21955 -23336 -41328 -44733 -14982 -1842 -30534 -45661
21496 -45661 -43870 -36536 -39104 -22591 5473 3451 -9990 -9546 -12532 -15015 8259 17570 29380
21483 29380 22679 23471 1974 -18479 -26880 -45441 -36839 -22614 -24745 -12192 10609 6149 12270
21470 12270 9553 -31492 -35765 13261 -2891 2684 -13136 -16457 -40301 -38236 -21611 -16553 41
21457 41 -7639 3204 -4246 -5759 -21369 -23540 -45783 -51677 -54284 -33230 -24268 2135 -3619 -2407
21443 -2407 -10024 -31280 -10790 -23696 -43822 -51797 -63938 -75535 -24208 -9077 -4002 38044
21431 38044 68482 58603 12993 12016 -11266 -11428 -5695 -1063 183 1541 2542 -2008 -3541 -28478
21417 -28478 -59163 -42601 -27795 -24230 -31577 -10963 -22684 -38334 -42631 -12092 13612 -15152
21405a5152j3887q020J3412k8186q456L6487J9133k862m733Q123k996J5153J5131
21392B3147m2118k1088K2793K1574L259J581k5646L866K0354J3542j245q217m144
21379G658j2619L3930j7253k2160j7199j5869m636K2706L558L5642r919j6204
21367a2365K3245N125k524k8421k0942L5355O003j4442Q372q088L9122K4004j6439
21354C8005n6504j3756m228o021L4233j1111j9190K3806k021r309j21K1199j3103
21341a8121j7774R952J6528n640k219q292L6718J9515j0214j3915N797K4933j365
21328C5903k3615K5191J903k4447K7431j200M091J0879J5600j3042k3606O302
21316D1390k3439j5608k3695J4082K9913K0330J4715j6547o9558j3833L5414k101
$$ plain form
21405 -15152 -29039 -37059 -23647 -51833 -60289 -23802 -4669 -7531 -12264 -4141 -7137 8016 23147
21392 23147 -18971 -40059 -17266 4308 7567 9148 -16498 -12632 7722 21264 20019 11802 7658
21379 7658 -4961 28969 11716 -10444 -27643 -43512 -48148 -25442 -21884 13758 3839 -12365
21367 -12365 10880 16005 13481 -14940 -35882 -527 5476 -8966 -594 -8682 30440 54444 38005
21354 38005 -18499 -32255 -36483 -42504 -8271 -19382 -38572 -14766 -16787 -26096 -26217 -5018 -18121
21341 -18121 -35895 -25943 -9415 -15055 -17274 -25566 11152 30667 20453 6538 12335 37268 35903
21328 35903 12288 37479 39382 14935 42366 41166 45257 56136 71736 58694 35088 41390
21316 41390 17951 2343 -21352 -7270 22643 42973 57688 41141 -28417 -42250 -6836 -8937
21304h937n665k839J6212J7110J5914k9025l3017J5262K6412P198k0676k3576
21292b5627J0457M909J830j3838p079N523r224o078K2878L6600J4392M029j5128
21279B3644l1605K65O529k310k7762O402l193L665l968j9946O151J0897J3356
21266a7875J5622L9599j1869p626J2388j4816k4462j1327J1289j8332K6443j3849
21254a4815j8169J0151J1710q326k0703J8597O54k1141J8710J083N266p876k3828
21241d8687r423J6591R428k010L7862M6909J4704n3899k0847J3681K3422j3263
21229A4468p674k39j5159j4071N821J0750M4739P920l6709k0244k7611P338L4177
21216C506j38k5008K9559K7155j3145k57p683j0376k4126l2813j2017R808J6103
$$ plain form
21304 -8937 -14602 -17441 -1229 15881 31795 2770 -30247 -14985 11427 18625 -2051 -25627
21292 -25627 -15170 -10261 -8431 -22269 -29348 -23825 -33049 -39127 -16249 20351 34743 38772 23644
21279 23644 -7961 -7696 -1167 -3477 -31239 -24837 -28030 -24365 -28333 -48279 -42128 -31231 -17875
21266 -17875 -2253 37346 25477 17851 30239 15423 -9039 -20366 -9077 -27409 -966 -14815
21254 -14815 -32984 -22833 -11123 -19449 -40152 -21555 -20901 -42042 -23332 -22249 -16983 -24859 -48687
21241 -48687 -58110 -41519 -32091 -34101 3761 50670 65374 11475 -9372 4309 27731 14468
21229 14468 6794 6555 -8604 -22675 -16854 -6104 38635 46555 9846 -10398 -38009 -30671 3506
21216 3506 3368 -21640 7919 35074 21929 21672 13989 3613 -20513 -53326 -65343 -55535 -39432
21203c9432K9158J0415M920K1523k826J70j4630K3675M419k0074j2219j7344n685
21190a7930K5068r029l0178j2760K4113K3331j4486k5430l8366J5501K6725N404
21178b8037k0825p175k2622J7838N529J2301P903p354J3088Q644J1567J1631r389
21165f901j5876J9742J0688j3239L235o339k1410J2663J0672j4312j2363K4706
21153h734J9060K8153j9145l7816O129R069k7143M3499M7770M466j3943j4575
21141C6790J553l2285l8367j9362j2057L1709K1195p384N428K896q538J6853J1746
21128A0177J9685j463j7943K0000l1580q034J193j8496R095J4494m948j0713L265
21115a5268L769j3575o941J2522K2863R08l0488p783j0874O95K3959k622n126
$$ plain form
21203 -39432 -10274 141 5061 26584 23758 23928 9298 32973 37392 17318 5099 -12245 -17930
21190 -17930 7138 -1891 -32069 -44829 -20716 2615 -11871 -37301 -75667 -60166 -33441 -28037
21178 -28037 -48862 -56037 -78659 -60821 -55292 -42991 -35088 -42442 -29354 -20710 -9143 2488 -6901
21165 -6901 -22777 -3035 7653 -5586 -2351 -8690 -30100 -17437 -6765 -21077 -33440 -8734
21153 -8734 10326 38479 19334 -18482 -12353 -3284 -30427 13072 60842 65308 51365 36790
21141 36790 38343 6058 -32309 -51671 -63728 -32019 -10824 -18208 -12780 -9884 -18422 -1569 10177
21128 10177 29862 28399 10456 30456 -1124 -9158 -7965 -26461 -17366 -2872 -7820 -18533 -15268
21115 -15268 -11499 -25074 -32015 -19493 3370 4278 -26210 -33993 -44867 -44172 -20213 -22835 -27961
21102b7961j4851k394J2134K8096J4799K6025K063k7427l1080m380J0761J915
21090a2300k5936j8640K8111L5525J9135n624k7242m4452Q749J221J6553J3976
21078a0924J6707l5176k3037j003L8270K9898J9744m2315j9000K523j4664k714
21066d1691j0364j3046J4111K9163L0008k0215r160N261K7741l513j6072k557
21054a0334J3847l4j3549J1395p088q545L8432n041j4366j394n750m4351m2185
21041h8963J1022q62N435L6029j0744P438m719m433L5919K7321R074j3396k441
21028F680l311l5462L867J4513k6574N845J4984k2470k2238K4153K9085l1771
21016d2699o69K2704j3684J0010J4283J1033O902j0207j0688l918o721j5425L180
$$ plain form
21102 -27961 -42812 -45206 -33072 -4976 9823 35848 37911 10484 -20596 -24976 -14215 -12300
21090 -12300 -38236 -56876 -28765 6760 25895 20271 -6971 -51423 -42674 -41453 -24900 -10924
21078 -10924 5783 -29393 -52430 -53433 -15163 14735 34479 -7836 -26836 -24313 -38977 -41691
21066 -41691 -52055 -65101 -50990 -21827 8181 -12034 -21194 -15933 11808 8295 -7777 -10334
21054 -10334 3513 3479 -10070 1325 -5763 -14308 24124 19083 4717 3323 -2427 -46778 -88963
21041 -88963 -77941 -78803 -73368 -37339 -48083 -40645 -45364 -49797 -13878 13443 22517 9121 6680
21028 6680 3369 -32093 -28226 -13713 -40287 -34442 -19458 -41928 -64166 -40013 -10928 -42699
21016 -42699 -43368 -20664 -34348 -24338 -10055 978 7880 -2327 -13015 -16933 -23654 -39079 -35899
21003c5899J8313L1566K5559Q546k0250j1105L926J7418l601L080j9003K973j6052
20990E471L536o189l9914k8316P786Q635k2120M964P058M0415J674j491J5414
20977c077L743K0240j1854j1229j9913J6398K2917p311n449j7526j5474o516m972
20964d0023J9693J6526j756k60N92J1437J4925o25j0416J1391j2875K883m824
20951F668k1992k582L21P686K4412j1066j7311R302K2037K7219k0185k5027k0897
20938b1415j5535m063J0465j7948L6900L0715J2471j714q006O680m8j3244j9455
20925d197k1002J7972J8512o617l9300J1224K6650L7650P574k0800l3390r320
20913a5044p118p26J6686O979j4249j4118J0194J5412j1505q190l486p370J4959
$$ plain form
21003 -35899 -17586 13980 39539 48085 27835 16730 20656 38074 34473 37553 18550 21523 5471
20990 5471 9007 2818 -37096 -65412 -57626 -48991 -71111 -66147 -59089 -18674 -17000 -18491 -3077
20977 -3077 666 20906 9052 -2177 -22090 -5692 17225 9914 4465 -13061 -28535 -35051 -40023
20964 -40023 -20330 -3804 -5560 -5820 -5228 6209 21134 20509 10093 21484 8609 11492 6668
20951 6668 -15324 -17906 -17585 -9899 14513 3447 -13864 -4562 17475 44694 24509 -518 -21415
20938 -21415 -36950 -41013 -30548 -48496 -11596 19119 31590 29876 21870 28550 28502 15258 -4197
20925 -4197 -25199 -7227 11285 4668 -34632 -23408 3242 40892 48466 27666 -5724 -15044
20913 -15044 -22162 -22888 -6202 777 -13472 -27590 -17396 -1984 -13489 -21679 -25165 -32535 -17576
20900a7576K2202k589n969J3811J584k5490j1669N959j7044j5358N953K7674O581
20887a1931k1310r221K3365L2223J0777Q159j4339j8550j3556J2027k1115L711
20875a9760M3305K4005j2592p188m5539l0282K5461L7389Q707r535k2347l1629
20863d0005J4255N4947K9373j5985j2384k876J0437j3261m720J3199p512R997
20851C5465j3525k6303k140J4893J6584l6355k4823K6982J2231K1953o306j6616
20839B040m4604k5952J5860R763L2549J9692m093L6948L356l1015k2478K0441
20827A2507j3158k0654j1211M2148M2728p419q059K5768k2228k4493k238K6861
20815D0552J6800M326p684O421l6545k1436o740J39Q791l1497m414J1353l5326
$$ plain form
20900 -17576 4626 2037 -3932 9879 11463 -14027 -25696 -19737 -36781 -52139 -46186 -18512 -11931
20887 -11931 -33241 -42462 -19097 13126 23903 32062 17723 -827 -14383 -2356 -23471 -19760
20875 -19760 23545 47550 34958 27770 -17769 -48051 -22590 14799 23506 13971 -8376 -40005
20863 -40005 -25750 29197 58570 42585 30201 27325 37762 24501 19781 32980 25468 35465
20851 35465 21940 -4363 -6503 8390 24974 -11381 -36204 -9222 3009 24962 18656 2040
20839 2040 -42564 -68516 -52656 -42893 -10344 9348 5255 42203 45559 14544 -7934 12507
20827 12507 -651 -21305 -32516 9632 52360 44941 36882 62650 40422 15929 13691 40552
20815 40552 57352 61678 53994 60415 23870 2434 -4306 -4167 4624 -26873 -31287 -19934 -55260
20802e5260P324K7606J9546J309Q274J619J1371l5132m1780M360J5909J7348j7221
20789c4727k6062J8041J8910J7128J1040j4397q506n761k0576j8585J7356M7281
20777A142L0294N674l1132l843P246l2264l8673J5203O6340N049k873k1783q006
20764g626K4503p473K0697L0238k2646m4118m91j348j4096q433L2779K7841J4705
20751D4532r303k7499j5646K2436J8752j3051j32j518k549K6849J0686j0311j4948
20738B8298J7132J6646K071j0144m3772j1260L6287O799m380r793O723k598l913
20725B8096k3848m592l3875O635L1363j8569j7588J7583J2499R994P282J3746
20713B8726m654r865K69r100l161L78j6930P17N606o271P361K695N43j0996r069
$$ plain form
20802 -55260 -47936 -20330 -784 525 8799 10418 21789 -13343 -55123 -50763 -34854 -17506 -34727
20789 -34727 -60789 -42748 -23838 -6710 4330 -10067 -18573 -24334 -44910 -63495 -46139 1142
20777 1142 31436 37110 5978 2135 9381 -22883 -61556 -46353 19987 25036 22163 380 -7626
20764 -7626 16877 9404 30101 60339 37693 -6425 -6916 -8264 -22360 -30793 1986 29827 44532
20751 44532 35229 7730 -7916 14520 33272 20221 20089 18571 16022 42871 53557 43246 28298
20738 28298 45430 62076 64147 54003 10231 -1029 35258 42057 37677 27884 34607 32009 28096
20725 28096 4248 -344 -34219 -27584 3779 -14790 -32378 -14795 -2296 7698 14980 28726
20713 28726 24072 14207 14476 5376 2215 2593 -14337 -13620 -8014 -14285 -6924 -4229 -3686 -14682 -23751
20698b3751o288r648N570J0364o052q356N373N3397L520l2412k3725K6906R566
20685D464Q683k0314P747m3621j8504J4803J9650j0151k594J1197K5767J6358
20673A3485l492l955k4148J7237Q114J8062L0523J9479n7476k9104k3414J8466
20661a6223K6475k557j3342l4777O253O256O012K0166j6208l0736m855J1993K0250
20648b1293J3221j5827J1414J5798K1153K392k3580K123p966j7384j6507L4849
20636a607Q877l4708k1547Q824p001J875M267J9328N1691L337l5000j1688R827
20623c525L493q568j4522r173O027K3451J7581j6170l6287k4816j5400J3008J270
20610f3631O185K7834J3652l444j4203j4384J1170j0454J6291J9775j1018r796
$$ plain form
20698 -23751 -30039 -39687 -34117 -23753 -29805 -38161 -32788 20609 24129 -8283 -32008 -5102 4464
20685 4464 13147 -7167 580 -43041 -61545 -46742 -27092 -37243 -39837 -28640 -2873 13485
20673 13485 9993 6038 -18110 -873 7241 25303 55826 75305 17829 -11275 -34689 -16223
20661 -16223 10252 7695 -5647 -40424 -34171 -27915 -21903 -1737 -17945 -48681 -53536 -41543 -21293
20648 -21293 -8072 -23899 -12485 3313 24466 26858 3278 5401 -2565 -19949 -36456 -1607
20636 -1607 7270 -27438 -48985 -40161 -47162 -45287 -41020 -21692 29999 33336 -1664 -13352 -3525
20623 -3525 -32 -8600 -23122 -32295 -26268 -2817 14764 -1406 -37693 -62509 -77909 -64901 -63631
20610 -63631 -57446 -29612 -15960 -19404 -33607 -47991 -36821 -47275 -30984 -11209 -22227 -32023
20598c2023J5814J7577J0354O794N024j1522m003j0786j7799J2362J3752j230
20586D314k7938j6256L7095J5433l322o692p399L0373K4124o515k5656l8111j6540
20573c7090j1756K985J8408j5726R044J4881L107q314m2943K158P6657N0384j7239
20560D4556j4355j5725l3013N793J0727N153j1771r210P46K0085J3482O828m994
20547A8302J4469j1842Q024q860k0252R360L933j2694M57J1679l5663K448J5633
20534e006j87q016j4236j6712M8581K9782M815k7041k2913j2770K4118m235P524
20521C704k786J1955p281j3354r906L1822j3652M758J7522J1080k0411l5211k8059
20508d9819N325M204K2602J8193k928m082J7276K2657j1539m3601K2454J8144
$$ plain form
20598 -32023 -16209 1368 11722 18516 23540 12018 8015 -2771 -20570 -8208 5544 4314
20586 4314 -23624 -39880 -2785 12648 9326 2634 -4765 25608 49732 43217 17561 -20550 -37090
20573 -37090 -48846 -45861 -27453 -43179 -34135 -19254 -16147 -24461 -67404 -65246 11411 61795 44556
20560 44556 30201 14476 -18537 -12744 -2017 3136 -8635 -17845 -17099 2986 16468 23296 18302
20547 18302 32771 20929 28953 20093 -159 9201 13134 440 897 12576 -23087 -20639 -5006
20534 -5006 -5193 -13209 -27445 -44157 4424 34206 39021 11980 -10933 -23703 415 -3820 3704
20521 3704 918 12873 5592 -7762 -17668 14154 502 5260 22782 33862 13451 -21760 -49819
20508 -49819 -44494 -40290 -17688 505 -2423 -6505 10771 33428 21889 -21712 742 18886
20496A8886L64J0564J2418L029j2059j7300q356k613J4701j6981J770O581J0327
20483B1331K7895n59J4550j3007k4136j6286l3441j8464R456J7348K8621j0606
20471B702l265n662p597L918J9885J9878p380P173j2179K501J7449j7148k4208
20458c933k493k7974o295m61J2801K8699K0397K6078j2673k5567l240n083J0706
20445A0962K8341j3801j8258j5896j7678J0285j6990J282L1334J4318j5970m020
20433f091k56j4664k4146J6999K0719L0007L2260l6385k1122K7174k1540k8791
20421b5836j6840O738R401R74n312j07m27K4818R250J0097L6296L5065P505k1439
20407G0183l779q301k1055j34o478j0728o725q040k8283k1416K5482K51k191J577
$$ plain form
20496 18886 19250 29814 42232 45261 33202 15902 7546 4933 19634 2653 4423 11004 21331
20483 21331 49226 48667 63217 50210 26074 9788 -23653 -42117 -32661 -15313 13308 2702
20471 2702 -563 -6225 -13822 -9904 9981 29859 22479 29652 17473 19974 37423 20275 -3933
20458 -3933 -6426 -34400 -40695 -41156 -28355 344 20741 46819 34146 8579 5339 256 10962
20445 10962 39303 25502 7244 -8652 -26330 -16045 -33035 -31753 -419 13899 -2071 -6091
20433 -6091 -6347 -21011 -45157 -28158 -7439 22568 54828 18443 -2679 24495 2955 -25836
20421 -25836 -42676 -35938 -26537 -25563 -30875 -30982 -31409 -6591 2659 12756 49052 84117 91622 70183
20407 70183 66404 58103 37048 36914 30436 19708 12983 4943 -23340 -44756 -19274 -19023 -21214 -19637
20393a9637j5789k469K4570J7562K8245J2375J3197l202m5896m0707J7245M440
20381a0066o030J3296J2239k1985K1664K722l190j331l230R257J010m702j6020
20368f366l322J3851k1295M599q696R284J3917m04J7724K968J1694p712J282K4050
20354E1574m0886r454O364o626J2812o518j4078p889l401J1965j78K3648J1209
20341B8542j9405J0625N179P512k9787M480P532k2751l2773K3430L1774r057j1275
20328e974k3228Q055K5195K0156O057J6437q206o114j6671m015M905O773N692
20315B9062k6475r470L1247j1452J2201j1427K2870n752j7696j9457j1673q563
20303b6585K6447Q139m919m797j076L7407J3017k9518k908J76o25j4278J3132
$$ plain form
20393 -19637 -35426 -37895 -13325 4237 32482 44857 58054 54852 8956 -31751 -14506 -10066
20381 -10066 -16096 -2800 9439 -12546 9118 11840 8650 7319 4089 13346 14356 9654 -6366
20368 -6366 -9688 4163 -17132 -12533 -21229 -11945 1972 1568 19292 22260 33954 26242 27524 51574
20354 51574 10688 1234 7598 972 13784 7266 -6812 -14701 -18102 -6137 -6315 17333 28542
20341 28542 9137 19762 24941 32453 2666 7146 14678 -8073 -40846 -17416 14358 5301 -5974
20328 -5974 -29202 -21147 4048 24204 30261 46698 38492 32378 15707 11692 16597 23370 29062
20315 29062 2587 -6883 24364 12912 25113 13686 36556 30804 13108 -6349 -18022 -26585
20303 -26585 -138 8001 3082 -1715 -2791 34616 47633 18115 15207 15383 14758 480 13612
20290A3612m947j4548K4128L6767R801Q438R18J3609l6557k1398J6630J4934R89
20277F2376m2478l5132J6076N267l201O49k318J6392N417M877O121J1841J2600
20264E8487N192j0994k0400k6555j5942Q542p857K2039j5534j4060P346O273J7583
20251A4120j303q056K7447K650k2874k7179j7291K0926P436M480J2483L0057K3295
20238F6191n125k0274k7420l223m976K941J2301J3906R130j2958k9577j1234J0105
20225b13j4749O475M6907l325j5224J2190j287q926l0742l3590J1764J5912k916
20212a7724J2328j8195j0303N478L0359L3747J6403q565L068k071k270n177K6370
20199F3448l896k7577j2961m469r754j3489k1618J5263J660J1243M0209R067M428
$$ plain form
20290 13612 8665 -5883 18245 55012 64813 73251 74169 87778 51221 29823 46453 61387 62376
20277 62376 19898 -15234 842 6109 2908 3557 1239 17631 23048 27925 34046 45887 58487
20264 58487 63679 52685 32285 5730 -10212 -1670 -9527 12512 -3022 -17082 -9736 -3463 14120
20251 14120 12817 4761 32208 34858 11984 -15195 -32486 -11560 -4124 356 12839 42896 66191
20238 66191 61066 40792 13372 10149 5173 8114 20415 34321 43451 30493 916 -10318 -213
20225 -213 -14962 -8487 38420 35095 19871 32061 30774 21848 -8894 -42484 -30720 -14808 -17724
20212 -17724 -5396 -23591 -33894 -28416 1943 35690 52093 43528 46596 44525 42255 37078 63448
20199 63448 59552 31975 19014 14545 4791 -8698 -30316 -15053 -13393 -2150 38059 47126 51554
20186E1554j6748p741j400O213J9029j0344n654l4822k9263J2666K9865K2134
20174C5489q58j0654j0196r132J7137r163j6058j1368j9740K0861K4362j2971
20162b291l366J7648r989O320Q474j7959l2836J8921J3072P208J4976j2292k4963
20149a7077J5915q37K16K7349K1559r124j747O819n420j9457J4440j0822P523
20136B9337p187j9544N006J2183p241k55j4940j4746J882K4064K2511O09q414
20123B3265J260R533J467J6745P703j4636j2514o342k1353n556j7318N256K0600
20110H110L5873K2864k0728j6606K080L5677j7567j2067J641J8048o083k3234
20098B8008j9327M2596K4017r982J556L156k2828j4138j3349j8499J3462J1881
$$ plain form
20186 51554 34806 27065 25665 31878 50907 40563 34909 87 -29176 -16510 13355 35489
20174 35489 34631 23977 13781 4649 21786 12623 -3435 -14803 -34543 -13682 10680 -2291
20162 -2291 -5657 11991 2002 8322 16796 -1163 -33999 -15078 -2006 5202 20178 7886 -17077
20149 -17077 -1162 -1999 -1783 25566 47125 38001 36254 43073 37653 18196 32636 21814 29337
20136 29337 22150 2606 7612 19795 12554 12299 -2641 -17387 -15505 8559 31070 31679 23265
20123 23265 24525 34058 35525 52270 59973 45337 32823 26481 5128 -428 -17746 -12490 8110
20110 8110 43983 66847 46119 29513 31593 67270 49703 37636 39277 57325 51242 28008
20098 28008 8681 51277 75294 65312 66868 70024 47196 33058 19709 1210 14672 26553
20086B6553J6771J887j0662l2001L978J3374j3983K663J4287R218l94k6195j5385
20073i889P064K453k5280k6380j603J1978K7255J7244j130j5465o458K3146j2404
20060i469k6820O875P766J9514J3057o177R721L9585L9268p258k4230K034J6513
20047H0379k3559k9120p516r101O359O509n928r783R862N240l0618K5501Q043
20034B6268j6834j952R345J2662o089M967J6617k5970k4681j3505j6396k3775
20022e9343K2203M0010J7628o389K4836K3390j1687L792K1487o609l744j0877
20010E4697j5362j1658p712P296J9462J8963o041m2992k1959L761j1504r503k007
19997b4559j3735Q612J5914J5108j9400J2022Q974n894j9284P362J0823J2663
$$ plain form
20086 26553 43324 45211 34549 2548 6526 19900 5917 8580 22867 32085 31691 5496 -9889
20073 -9889 -2825 -372 -25652 -52032 -53635 -41657 -14402 2842 1712 -13753 -20211 2935 -9469
20060 -9469 -36289 -29414 -21648 -2134 10923 4746 14467 54052 93320 86062 61832 63866 80379
20047 80379 56820 27700 20184 11083 17442 23951 18023 8240 18102 23342 -7276 18225 26268
20034 26268 9434 7482 16827 29489 23400 28367 44984 19014 -5667 -19172 -35568 -59343
20022 -59343 -37140 2870 20498 14109 38945 62335 50648 54440 75927 69318 65574 54697
20010 54697 39335 27677 19965 27261 46723 65686 59645 16653 -5306 -1545 -13049 -22552 -24559
19997 -24559 -38294 -29682 -13768 1340 -18060 -6038 2936 -2958 -22242 -14880 -4057 8606
19985H606j3410L900R143J065J7673L0245j0893k3491q50l144j7864J2265J2897
19972B6142o942j7701p756j862K3463J6356L4480j5578k8172m20R933j1723j2869
19959G351J2595K7074k398l5134l3352K3900L203K1800J1217j9745l6692k2870
19947d3051p505K4253K6469J9704J9250j3625l5284J5373M1075J2240j0961K0828
19935F8766R140m815l446j2187m0023J9964J2938q993J0014q807m581k7878l8723
19922b8631K4953J8852q645J5087m612J0513J7223J4320j260k8922j0903j1944
19910F031J6437K6079l1587k8773O271K1223n567J8122J5052j2449k3082k3603
19898a5846J8228K858K0687O807q847k4945K9975L1096k3572J0421J1767j4210
$$ plain form
19985 8606 -4804 -904 8239 9304 26977 57222 46329 22838 21988 18844 980 13245 26142
19972 26142 19200 1499 -6257 -8119 15344 31700 66180 50602 22430 22010 31943 20220 7351
19959 7351 19946 47020 44622 9488 -23864 36 3239 25039 36256 16511 -20181 -43051
19947 -43051 -50556 -26303 166 19870 39120 25495 -9789 5584 46659 58899 47938 68766
19935 68766 77906 73091 69645 57458 17435 37399 50337 41344 51358 42551 37970 10092 -28631
19922 -28631 -3678 15174 6529 21616 17004 27517 44740 59060 57800 28878 17975 6031
19910 6031 22468 48547 16960 -11813 -5542 15681 10114 28236 43288 30839 7757 -15846
19898 -15846 2382 5240 25927 32734 23887 -1058 28917 60013 36441 46862 58629 44419
19886D4419k3376j5061J1920J3869k6598J3846k1696O922J3534P852l9365j1777
19874b5511L3657L6000l5828K077n298j3691m93k8745N978K1076J1180K1145M789
19861B6336M712j3437n948N435j7805N234K7895k7920k3655k822K1909M383m583
19848b66K2056o190K349J3473q707l3239p721L2073K2356K3324l0763M182m636
19835B8291j2127L5918J2807k4077l2796k8676K2666K5851k0286r316m624j0108
19823a6477p116L3079L4663q367R52Q36o579p861L681L4714l073j1469j6437K218
19809C2764q371m0278Q926K4442P862p8j985j2908J1076O382M352K4105L240k1633
19795C7896k331K4970O09j8327k5135j6771k0432Q029J5388L3219k187P44J4081
$$ plain form
19886 44419 21043 5982 17902 31771 5173 19019 -2677 4245 17779 25631 -13734 -25511
19874 -25511 8146 44146 8318 10395 5097 -8594 -9087 -37832 -31854 -10778 402 21547 26336
19861 26336 31048 17611 11663 17098 -707 4527 32422 4502 -19153 -21975 -66 4317 -266
19848 -266 21790 15600 17949 31422 22715 -10524 -18245 13828 36184 59508 28745 32927 28291
19835 28291 16164 52082 64889 40812 8016 -20660 2006 27857 7571 -1745 -6369 -16477
19823 -16477 -23593 9486 44149 35782 36734 37570 30991 23130 26811 61525 58452 46983 30546 32764
19809 32764 24393 -15885 -6959 17483 25345 25267 23282 10374 21450 27832 32184 56289 59529 37896
19795 37896 35565 60535 61144 42817 17682 911 -19521 -11492 3896 37115 34928 35672 49753
19782D9753j7774L1715J9317q561r286p528l9643k4645R757K6800j144k209K6482
19769E3034Q664q918j625K2378k8289j5065J500o325M1430J0915o623m5721j0165
19756A5190j3249l1429q430K4201j1194m261J074j041L2967M635Q144K2152O484
19743D5243j0905K979J0999R668k7471Q328O097M912k4297J6315L2861J8245j4786
19730G8188k1833L802J6697j4566j8814q499M36J2179N78M085r712k752j7739
19717B2050j2322J9565K4810N402M435J8399r834j6433j1543j5596m978K3270
19705D7225p81j569r389j8854Q0J4699J8587n75Q10k3516M491J0644K3113K7814
19691I2779o047j3055J1937q062j469o114j6250j5803j5100j7426L5576K3472
$$ plain form
19782 49753 31979 63694 83011 74450 65164 57636 17993 -6652 3105 29905 28761 26552 53034
19769 53034 61698 52780 51155 73533 45244 30179 31679 25354 66784 77699 71076 25355 15190
19756 15190 1941 -29488 -37918 -13717 -24911 -29172 -28098 -29139 3828 8463 16607 38759 45243
19743 45243 34338 37317 48316 57984 30513 38841 44938 49850 25553 41868 74729 92974 78188
19730 78188 56355 60157 76854 62288 43474 34975 35411 47590 48168 52253 42541 39789 22050
19717 22050 9728 29293 54103 59505 63940 82339 72505 56072 44529 28933 23955 47225
19705 47225 46444 44875 35486 16632 16712 31411 49998 49423 50233 26717 31208 41852 64965 92779
19691 92779 86732 73677 85614 77552 76083 69969 53719 37916 22816 5390 40966 64438
19679F4438j8578M257J5430J256P960j6057l0258k8506K9118O962k2012l1937
19667a7927J3478L1636K9280M2875l3345k2275j0190k2058P526K4735k1279k5975
19655c519j2744J8851L1948j1398j7943J5205L8693K1019n0770j7106M7572J8685
19643G8493l7554l7112k281l741K948K8507K3865j2372k2309L8741L4441K811
19631I4437j4556L335j1719k6986R805O411j9438J6141j7884o603k2153J0277
19619B1067J951N051l499M966j16j4970L837J2665L046J2519j597k271o541l440
19605C2668K3836L5073k8529j3525M1579K2334l3307j6475j8299o830N310K6846
19593G0681J996k5188l0026K4938L6511j7689k8319L6996K6911J2052m125p203
$$ plain form
19679 64438 45860 50117 65547 66803 74763 58706 28448 -58 29060 36022 14010 -17927
19667 -17927 -4449 27187 56467 99342 65997 43722 33532 11474 19000 43735 22456 -3519
19655 -3519 -16263 2588 34536 23138 5195 20400 59093 80112 29342 12236 59808 78493
19643 78493 40939 3827 1546 -2195 753 29260 53125 40753 18444 57185 91626 94437
19631 94437 79881 83216 71497 44511 54316 60727 41289 57430 39546 32943 10790 21067
19619 21067 23018 28069 24570 29536 29420 14450 18287 30952 33998 46517 44920 42649 36108 32668
19605 32668 56504 91577 63048 49523 91102 113436 80129 63654 45355 38525 43835 70681
19593 70681 72677 47489 17463 42401 78912 61223 32904 69900 96811 108863 104738 97535
19581I7535j9743r889O584j2937J2022l3810p644o635j338J5082J0850L3741J7126
19568A00944m586j0206k6160l4991k149J3633J8164j8256p868J9495j8798m838
19556B4384p136K5429k481k1948R836J1381l534L194k308L05J006O432q482o193
19542B9885J7176k401J0691K4994O758l3624o897L760P020j218q711J800P431
19529E6664R356o223k1225j347J5458J4326j7073J7180r61o5318M692R103j3464
19516A168L5507L4314R071K4696r773k0932j6830R844q634N782k5042k1875r679
19503G617J4015Q494l458j4430K4847J2127k453q167K3K3952J2659k0390J0576
19490F5412M4247Q734j5318j0211J7387j8137j4831k4148J0985J6850j647j9243
$$ plain form
19581 97535 77792 67903 74487 61550 73572 39762 32118 25483 24145 39227 50077 83818 100944
19568 100944 96358 86152 59992 25001 22852 36485 54649 36393 28525 48020 29222 24384
19556 24384 17248 42677 40196 18248 28084 39465 35931 39125 36817 37122 38128 44560 36078 29885
19542 29885 47061 44660 55351 80345 87103 53479 46582 50342 57362 56144 47433 49233 56664
19529 56664 66020 59797 38572 37225 52683 67009 49936 67116 66155 837 5529 14632 1168
19516 1168 36675 70989 80060 104756 94983 74051 57221 67065 58431 64213 39171 17296 7617
19503 7617 21632 30126 26668 12238 37085 49212 46759 38592 38615 62567 75226 54836 65412
19490 65412 109659 118393 103075 92864 110251 92114 77283 53135 64120 80970 79323 60080
19478F0080k155J4680j024R740L3692k1916L928j3968j565J6735J1735n948j4223
19465H9791j9412P441L0833r780r904M400K460P396J779l301l797P873R095l5342
19451G9532p018j3794j557J8626K8645k375k244J1723J3214m634k0448l6644k273
19438F0753K1441K9059L6234J2059M964N5734R8955J18600J90458J51928j694
19427G78491p8367j14897j04277q8251n2998l3497j3785k8644L7154P2930J46736
19416E20595J79356Q8494l2966q4347m6654J309K8849j4537q5442j02260j11818
19405C40579p4144p6793k0806N476j9968j1013n420M872L1385J2496j0121k5220
19393A51323j5660J0697K8965N9222L9757J0515L2956k030k1269l1906l8682K1240
$$ plain form
19478 60080 57925 72605 71581 81321 115013 93097 97025 83057 81492 98227 109962 104014 89791
19465 89791 70379 77820 108653 98873 88969 93369 95829 103225 105004 101703 97906 105779 114874 79532
19451 79532 72514 58720 57163 75789 104434 102059 99815 111538 124752 120118 99670 63026 60753
19438 60753 82194 111253 147487 159546 164510 220244 319199 437799 628257 780185 778491
19427 778491 700124 585227 480950 392699 339701 306204 292419 263775 300929 373859 520595
19416 520595 699951 788445 755479 671132 624478 625787 654636 640099 554657 452397 340579
19405 340579 266435 189642 168836 174312 154344 143331 137911 142783 174168 186664 176543 151323
19393 151323 135663 146360 175325 234547 274304 284819 317775 315745 294476 262570 223888 245128
19381B45128r872q079K4886L5036O8840Q9584J21312J67399J62902P1753q6044
19370H82845j53393j27164k5577O1884J03267L3947o8652n2677R779N5834O3696
19359G83789k8203j06761r3247o3344m6091l370L1781Q7567N9775o467J5086n5055
19347E75460l3932l8031K2313P3045N9738R4845R0105L2069m3227p9339o3585
19336F89461r3548j24485q0174m4419l2078M211o710J5240L2926j0866M03j2925
19324C37036k1579m5208r873k2860k0250l5929j1951P11j0651k7259J162k2111
19312A11238k373J0651J7304J5014K8204N3564M0579L7263P6489R2785M9752J8426
19300E48896N300j7768K5740M3384J41117R7758J8319L2622p7512j13701j12723
$$ plain form
19381 245128 235256 227177 252063 287099 355939 445523 566835 734234 897136 968889 882845
19370 882845 729452 602288 576711 638595 741862 775809 707157 654480 664259 720093 783789
19359 783789 755586 648825 555578 492234 446143 442773 474554 562121 621896 615429 630515 575460
19347 575460 541528 503497 525810 598855 658593 753438 843543 875612 832385 753046 689461
19336 689461 595913 471428 391254 346835 314757 318968 312258 327498 360424 349558 349961 337036
19324 337036 315457 270249 260376 237516 217266 181337 169386 170097 159446 132187 133349 111238
19312 111238 108865 119516 136820 151834 180038 233602 274181 311444 387933 480718 530470 548896
19300 548896 554196 536428 562168 605552 746669 844427 862746 895368 817856 704155 591432
19289E91432o6635j6608O330L334N4099P9645J06935Q1931K402p7230j07090j28078
19277E30467j10243q9760n8679k8191k1164j6419k8851Q309j639j5525k82J5896
19265A83919o875k3535m349j8731j4589J9342j7748k297j1676J3953Q319o861
19253A18872j4107l6681q320L1600J3422m115j756j5076l193J7639P492K3670
19241A29447J5102L0703k5692n7503k9932M512j933J6395K1922q970K7407M359
19229A25817j0752K4113J3080J0792J1820o964j5049K9229R784k3704J9201q600
19217A78767j8240k4317j8082j0425K4684K073J0566R864J5731M7173K7519K0450
19205B65763k8334m5231m236j6401j9782n039k6487r68R636J6642K4261R478L0259
$$ plain form
19289 591432 524797 508189 514519 517853 571952 651597 758532 840463 842865 765635 658545 530467
19277 530467 420224 330464 271785 243594 222430 206011 177160 185469 183830 168305 168023 183919
19265 183919 177044 153509 149160 130429 115840 135182 117434 115137 103461 117414 125733 118872
19253 118872 104765 68084 59764 91364 104786 100671 98915 83839 80646 98285 105777 129447
19241 129447 144549 175252 149560 92057 62125 66637 64704 81099 103021 94051 121458 125817
19229 125817 115065 139178 152258 163050 174870 167906 152857 182086 191870 168166 187367 178767
19217 178767 160527 136210 118128 107703 132387 134460 145026 154890 170621 217794 245313 265763
19205 265763 237429 192198 187962 171561 151779 146740 120253 119285 128921 145563 169824 179302 209561
19192B09561L758q077k4666l5374j827J1238j7831j8354r34K227K569L6841L9926
19179A99057l5713j1608L4985J0042j3839J8778R095j0518J7027J2092L5213N4197
19167C18808K7236J2672p234j1995k5901n8695j5738m39J5521q805k147K6219
19155B69502K4180L4210K1880j7243l36k4524j3379l6930l5593m8879P265L3354
19143B13507q126l7813m1874n305J8152L3073J6353M08P376J0396J3536L090N713
19130B28486o79j8111j0091p665r52R996K1936J8576R204j9594N702M8899M9600
19117C35307K8527M0305K0265j5928k1366K619L1872j9673k4678J068k0861l0887
19105C26570k5787m1121j8974j7160r970K4054k229L1112J4224J9715J3920J3297
$$ plain form
19192 209561 213319 205242 180576 145202 143375 154613 136782 118428 117494 119721 122290 159131 199057
19179 199057 163344 151736 186721 196763 182924 201702 210797 200279 217306 229398 264611 318808
19167 318808 346044 358716 351482 339487 313586 254891 239153 238714 254235 245430 243283 269502
19155 269502 293682 327892 349772 332529 332193 307669 294290 257360 221767 172888 180153 213507
19143 213507 205381 167568 125694 120389 138541 171614 187967 188375 195751 206147 219683 222773 228486
19130 228486 227807 209696 199605 191940 190988 200984 222920 241496 250700 231106 236808 285707 335307
19117 335307 363834 404139 424404 408476 387110 389729 421601 401928 377250 378318 357457 326570
19105 326570 300783 259662 240688 223528 213558 237612 235383 266495 280719 300434 314354 327651
19093C27651j3277l4441l6329j7960J6992J313k2455J761q734j7270M044K3932
19081B25227m731j2467J1565J6207K3918L3334L2665K2557O604j1196l3901k8947
19069B80835l0810J1018N861j678K3233J7891L3948L8387M5202J1898K578k0501
19057D17862J0249j2633m1424j348K4459l5135n6278k8522k4796j1214m387J086
19045B37919K7513R903N521J1673P278k8890l1781j3338j2162K0882K3126P787
19033B65431j4026p690O236L7405J9120J3539K5757L6363J4768R086J8491K3685
19021D48165J337m159R333j1129j9795j4479J0128J1408K8467J2328O627K2416
19009E00647j3252m3709k7146L6473J5095J2386J3082O419q227k9513j3045k4399
$$ plain form
19093 327651 314374 279933 243604 225644 242636 243949 221494 223255 214521 197251 201295 225227
19081 225227 220496 208029 219594 235801 259719 293053 325718 348275 354879 343683 309782 280835
19069 280835 250025 261043 266904 265226 288459 306350 340298 378685 423887 435785 438363 417862
19057 417862 428111 415478 374054 372706 397165 362030 305752 277230 252434 241220 236833 237919
19045 237919 265432 275335 280856 292529 299807 270917 239136 225798 213636 234518 257644 265431
19033 265431 251405 243715 249951 287356 306476 320015 345772 382135 396903 405989 424480 448165
19021 448165 449502 445343 454676 443547 423752 409273 419401 430809 459276 471604 478231 500647
19009 500647 487395 443686 416540 453013 468108 480494 493576 499995 491768 462255 449210 424811
18997D24811j6486l6826j5908l0215l1082N221L0420K6443Q0245O1250J1396m8602
18985D60667o1024k4148p150j573L4349P8693R8603L6243J8775K8539J030Q495
18973F71499K9500M3615M4410M8749M6349O2419L2618m873P742N251J764m09J4433
18960A003067q483K8256N0956K7748K5112N3736K3919K3170M9254J04627J35282
18949A516644J73644K44961K30802J22126M4127N0010L5748O9802O9095N744j5098
18938B547605L1933J58370K40105L04068K95768K81056L42983M85228Q23568J147990
18928F658674J328564J946579L183990L629467J431369m78357j029366m88768
18920A6182152J171458L286051O112089J0813156J9631285L2152478K2137991
$$ plain form
18997 424811 408325 371499 355591 325376 294294 299515 329935 356378 436623 497873 509269 460667
18985 460667 399643 375495 368345 366772 401121 479814 578417 614660 633435 661974 663004 671499
18973 671499 700999 744614 789024 837773 884122 946541 979159 974286 982028 987279 989043 988634 1003067
18960 1003067 994584 1022840 1073796 1101544 1126656 1180392 1204311 1227481 1276735 1381362 1516644
18949 1516644 1690288 1935249 2166051 2288177 2332304 2382314 2418062 2487864 2556959 2562703 2547605
18938 2547605 2579538 2737908 2978013 3282081 3577849 3858905 4201888 4687116 5510684 6658674
18928 6658674 7987238 9933817 13117807 16747274 18178643 17700286 16670920 16182152
18920 16182152 17353610 20639661 26751750 37564906 57196191 89348669 111486660
18913A11486660l539324r194874q554513o389220j1019265j4072741j4178706
18906D4538017j0323745m977968p55129L255369P964383R374576P42596o738348
18898D3079751r568842q938038n575617k999047j764981j068457p44538p67016
18890A1653215p27537n39806j90657O1821J54998Q0169J13899K44690N26931R00453
18880A2278176J399274K056811L063801M711274P396528J1934313J8154234J6296139
18872G7290550J059746q259392j1813220r442625l650705J416617O101892J1729835
18864F4432698K0255906L5008503N7386614P2762725O5511478L5610327k416146
18857C48552105m4536446o9967517o4956928n0167698l0224263j4966661m460545
$$ plain form
18913 111486660 107947336 98752462 90197949 83808729 72789464 58716723 44538017
18906 44538017 34214272 29236304 28481175 31736544 39700927 49075503 49818099 43079751
18898 43079751 33510909 24572871 18997254 15998207 14233226 13164769 12420231 11653215
18890 11653215 10925678 10385872 10195215 10257036 10412034 10492203 10606102 10850792 11377723 12278176
18880 12278176 13677450 15734261 18798062 23509336 30905864 42840177 60994411 77290550
18872 77290550 78350296 70090904 58277684 48835059 45184354 46600971 52702863 64432698
18864 64432698 84688604 119697107 177083721 249846446 315357924 350968251 348552105
18857 348552105 304015659 234048142 169091214 118923516 88699253 73732592 69272047
18850F9272047N154959O315219o422028j2080723j4029955j1455950p264327m813289
18842B4675953l647506k789305k094246j586927j193581q89246o07187l78503
18834A1489452q9809K08943L46445L94545N46574N46599M72704M36853K82922
18825A4635228J16421J12554L94456P40351J291758K206747L605374N884879R701990
18816C8689758J2813299R693839Q014058L512041l57185L197341J0282657K3331531
18808A09177339M1168005N0451848N2490505M7496993K0422125q041059l5991792
18801B77173964n0658544n5916955m6539597l3476135k0831123j1120820m947281
18794E3683509j24457M876270P700968L931810J099467m915721j1297761j1657741
$$ plain form
18850 69272047 74427006 80742225 74320197 62239474 48209519 36753569 29489242 24675953
18842 24675953 21028447 18239142 16144896 14557969 13364388 12475142 11867955 11489452
18834 11489452 11399643 11608586 11955031 12349576 12896150 13442749 13915453 14352306 14635228
18825 14635228 14751649 14864203 15258659 15999010 17290768 19497515 23102889 28987768 38689758
18816 38689758 51503057 61196896 69210954 72722995 72365810 75563151 85845808 109177339
18808 109177339 150345344 200797192 253287697 300784690 321206815 313165756 277173964
18801 277173964 226515420 170598465 124058868 90582733 69751610 58630790 53683509
18794 53683509 53559052 58435322 66136290 70068100 71167567 66251846 54954085 43296344
18786D3296344j0285368p097084m293808k843031k129501j820311j583080j293792
18778A1950369j029085p81307m80877l51231k31015k4513K10029M84453P62322
18769A0509145J199234J799697K827331M649467P244581P364133M289424L117629
18761D3000641j506250m696664m169525k245043J900606P317278J1303658J0392712
18753F1297413J0759480J1944368J2366096L960681j325698n129593j8218679
18746G5654068j8297151j6656476j1766631o218426k897442p52925j32430p09631
18738A8222956p32459j812654k584429k396333k064972j442655r32146o47538
18730E609770m85180l74874l20546k86177m16670m56155m08313l41127k49302
$$ plain form
18786 43296344 33010976 25913892 21620084 18777053 16647552 14827241 13244161 11950369
18778 11950369 10921284 10139977 9659100 9307869 9076854 9052341 9262370 9746823 10509145
18769 10509145 11708379 13508076 16335407 20984874 28229455 35593588 39883012 43000641
18761 43000641 41494391 36797727 32628202 30383159 32283765 39601043 50904701 61297413
18753 61297413 72056893 84001261 96367357 100328038 99002340 93872747 75654068
18746 75654068 57356917 40700441 28933810 22715384 19817942 19065017 18932587 18222956
18738 18222956 17490497 15677843 13093414 10697081 8632109 7189454 6257308 5609770
18730 5609770 5124590 4749716 4429170 4142993 3726323 3270168 2861855 2520728 2271426
18721B271426j85062j66523j36407j18152r7785q1784o4032m4511n2430o7674
18711A257066j07074j16253p7237l9934k4794j8794L515K671k4357k4835l9288
18700G90686n9782n6827m8380k5210l0468j5781o107j7278N989O803K5111J5053
18688E83809J7282L343K5870M7100L9279J01552Q2174L1283J0562l1908n4668
18677H55678m9709o3665p9726K425K8228P559l0577k7091l6702l4023l2803n7149
18665D82445m5178l1463k9063m754Q61J9097j4857l2550q338k3830l276j4454
18653B94640l841Q02K2126k3760k1176N4341j3188l2915k8078l2751k5828q263
18641A82109J2665K6063L7125M5292K1075j3379M98K1212J9560N0333M2546K9766
$$ plain form
18721 2271426 2086364 1919841 1783434 1665282 1567497 1485713 1421681 1377170 1324740 1257066
18711 1257066 1149992 1033739 956502 916568 891774 872980 876495 879166 854809 829974 790686
18700 790686 730904 674077 625697 600487 570019 554238 548131 530853 536842 543645 568756 583809
18688 583809 601091 604434 630304 677404 716683 818235 900409 931692 942254 910346 855678
18677 855678 805969 742304 662578 665003 693231 700790 670213 643122 606420 572397 539594 482445
18665 482445 437267 405804 376741 371987 372848 391945 377088 344538 336200 312370 309094 294640
18653 294640 290799 291601 313727 289967 268791 323132 309944 277029 248951 216200 190372 182109
18641 182109 194774 220837 257962 303254 324329 310950 311448 332660 352220 402553 445099 474865
18629D74865K7272K590m837k436j8044Q91o2372n4255j9767j9738k552j6764k450
18616C02403n78L5228L3358l0500m0928l9627l5760k8211q786k4734J2579J6091
18604A90535K750K1478j424J2534p655j2147k7569J1381l421p737O442j7339k6277
18591A41551r260l061j0273j2402M6618R519J6647J3577j1601K0943M2983J5560
18579B60801k77K939k3860j912P205L091n0013n5144l4571k2528N781P020j8118
18566H0414k2656L8498M6817J0211J7672k874J2296Q692r134M408l5878n2088
18554I6378k2028l0860j9400k3784J4940L3520N4308O3895K0091J9060o541k1787
18542A77792j1492n953j5592o583j2622J5220j7338q147J0046M719L862n367l3053
$$ plain form
18629 474865 502137 504727 499890 497454 479410 480301 417929 363674 343907 324169 321617 304853 302403
18616 302403 301825 337053 370411 339911 298983 259356 223596 195385 186599 161865 174444 190535
18604 190535 193285 214763 213339 225873 218218 206071 178502 189883 186462 178725 185167 167828 141551
18591 141551 132291 129230 118957 106555 153173 162692 179339 192916 181315 202258 245241 260801
18579 260801 260524 263463 239603 237691 244896 247987 197974 142830 108259 85731 91512 98532 80414
18566 80414 57758 96256 143073 153284 170956 168082 180378 189070 179936 184344 148466 96378
18554 96378 74350 43490 24090 306 15246 48766 103074 166969 187060 206120 199579 177792
18542 177792 166300 160347 144755 138172 125550 140770 123432 115285 125331 130050 133912 128545 95492
18529I5492j9091j4639l471j1670K7180M0273L3677L990k1537n175K559M776j8349
18516A14015j1734l505J119L1708L3917l693j3083k463N490k4634m678M2060L1645
18503A96164k0106r31n805n0702l1032k26l6230J7552L7077K9852K2658J9609
18491A77880p551k940J5492k0849J698K5109k6316k5349K4512O0810J11887P3615
18479D07998N8779J5974R39k3018m3725n2584n8900o6207j6051j5731k4853k746
18467A79875J3076P02J2746K09j9082j4915j2676K4173N243j3677j4577j7114
18455A43983K0484K2239l0952l5529j805J2980L2972J0902J1442j1274l2110j1111
18443A32221j1288K5365J66J2279R724q852L1945N1959K3559K0570K1839Q698
$$ plain form
18529 95492 76401 61762 58291 46621 73801 114074 147751 151741 130204 125029 127588 132364 114015
18516 114015 102281 98776 99895 131603 165520 161827 148744 146281 151771 127137 122459 164519 196164
18503 196164 176058 175127 169322 118620 87588 87362 51132 68684 105761 135613 158271 177880
18491 177880 170329 167389 182881 162032 163730 188839 162523 137174 161686 222496 334383 407998
18479 407998 466777 482751 483690 460672 416947 364363 305463 239256 223205 207474 182621 179875
18467 179875 192951 193653 206399 206608 187526 172611 159935 184108 189351 175674 161097 143983
18455 143983 164467 186706 155754 120225 118420 131400 164372 175274 186716 175442 143332 132221
18443 132221 120933 146298 146464 158743 168467 159615 191560 243519 267078 287648 309487 318185
18431C18185J5396J9924R470K9953N3340N4767Q1391K6666m0294n3222l5251j1020
18419D69305n0818l7400l4117m8637m9288l7624q247j3915O748J4565J8583M235
18407B33390L229k8693J1452J908N879J5756J0030k0031K0517J7259J9222Q3193
18395C73111R3459J41414J91374R5895m6384j37511j87042j25168k2316K075M3279
18384D22186P5771O6684R0816J75101J32608o7594j21512j17269j34765p6828
18374D45198J7671N2168Q38p0279q7798j07850n5568k1429j0743k6954m075J8832
18362A50011l0427J3685K1336k1785o9905j0623J0758J4548L1854J3169k4151
18351I8470J626K1773O4020N4503N7455j0727m8697l5475m4566n2549L8947M1788
$$ plain form
18431 318185 333581 353505 362975 392928 446268 501035 582426 609092 568798 515576 480325 469305
18419 469305 418487 381087 346970 298333 249045 211421 203174 189259 196007 210572 229155 233390
18407 233390 236619 207926 219378 221286 227165 242921 252951 232920 253437 270696 289918 373111
18395 373111 466570 607984 799358 895253 848869 711358 524316 399148 376832 378907 422186
18384 422186 497957 564641 655457 830558 963166 895572 774060 656791 522026 445198
18374 445198 462869 515037 515875 445596 357798 249948 194380 172951 162208 135254 131179 150011
18362 150011 119584 133269 154605 132820 62915 52292 63050 77598 109452 122621 98470
18351 98470 100096 121869 185889 240392 297847 287120 238423 202948 158382 105833 144780 186568
18339A86568N4613Q3620J20113J39134P2180j3720n6532l0766n38n0988o9485
18328D34199q4215p4835j2053Q0995J15282J7755l4773l3527m9120n3359m9675
18317B56674k1757j9175k8944l2725p815m3204j2116K9560K1921j8333k7725j3277
18305H3084M865K483k7689l5745n561J9345J1711J4907K7176P54R344K072n025
18292A01721L9108K986J3408j4740m8134q326N097M079Q7611J03223J05782R3673
18280D85488J03173O5360P485j5093P300l240Q773m7903o304J04480J02591M6443
18268H58553L9399l3313j29569j82934j35348r6717o6526p5047l6659J1449m52
18257A52836l0802m242O541K1155L5289M5849q277m517l443N199k4276l3912l3016
$$ plain form
18339 186568 241181 324801 444914 584048 656228 642508 585976 555210 554672 503684 434199
18328 434199 349984 275149 263096 344091 459373 477128 442355 408828 359708 306349 256674
18317 256674 234917 215742 186798 154073 146258 103054 90938 120498 142419 124086 96361 83084
18305 83084 87949 90432 62743 26998 21437 40782 52493 67400 94576 95330 104674 106746 101721
18292 101721 140829 143815 157223 142483 94349 86023 91120 95199 182810 286033 391815 485488
18280 485488 588661 654021 661506 646413 653713 650473 659246 611343 605039 709519 812110 858553
18268 858553 897952 864639 735070 552136 416788 320071 253545 178498 141839 153288 152836
18257 152836 122034 117792 124333 145488 180777 226626 218349 213832 210389 215588 191312 157400 124384
18244A24384l4432j3818o533j1931R763K3429j139p142J2187N5782P5980J10535
18232C37065J13052O7376L9140L9934J3593J5925j6693l5975n796m0022p3354
18221D54245o6612j05051p5119M5263O6609M4237P2214J09845R1208N3183j1990
18210F78032r8895j33704j24835j12862o8281l6386o217n146k214j4711j2602
18199F2179j7982j0833n230P061J8627L60k767M081J6098l1254j7465k166J7944
18186C8653J0248j1770o309Q788O767l852j6071K339K0374J5513n68o409o279
18173E1424J5898K0575l884J7939L6381j0476q85j153j5650k0223K2885k4986
18161H7845L880L782m429R761K3691J1733J6769m7810j8479J1578K9758j406k783
$$ plain form
18244 124384 89952 76134 69601 57670 67433 90862 89723 82581 94768 150550 226530 337065
18232 337065 450117 517493 556633 596567 610160 626085 609392 573417 567621 527599 454245
18221 454245 387633 282582 207463 252726 319335 363572 435786 545631 636839 690022 678032
18210 678032 579137 445433 320598 207736 139455 103069 96852 91706 89492 74781 62179
18199 62179 44197 33364 28134 35195 53822 54182 51415 55496 71594 40340 22875 20709 38653
18186 38653 48901 37131 30822 39610 46377 42525 26454 28793 49167 64680 64112 57703 51424
18173 51424 67322 87897 84013 101952 138333 127857 126972 125819 110169 89946 112831 87845
18161 87845 91725 95507 91078 100839 124530 136263 153032 105222 86743 98321 128079 126673 123890
18148A23890l670m460L2073M7771L0841O772K2630K2320J3448K3222o505J7200
18136C25532M4774K4006q409L3716O1686L7731L0257N0756M8528N2027N5236J12497
18124H68337J06055R7843J60899K04797K39505K84176L80835N69980P95374J121126
18114D828927J732282K900179M842675Q769124J6749732J6150895m100126j0545620
18106D1328068j4262711j0963082n672929k969403j804789j203756q52051o12295
18098B987052m33698l64520k98069k55309j72844j42472j36736j09463j23347
18089I50594j22789q2707o4508l3883n7897p9232o5476j1100K5634k4879m0172
18078C93585l1846l7520L915J1190J6364j44k0863l8988M418J3357K15l927l3907
$$ plain form
18148 123890 120220 115760 147833 195604 226445 233217 255847 278167 291615 314837 308332 325532
18136 325532 370306 394312 385903 419619 481305 519036 549293 600049 648577 700604 755840 868337
18124 868337 974392 1072235 1233134 1437931 1677436 1961612 2342447 2912427 3707801 4828927
18114 4828927 6561209 9461388 14304063 23073187 39822919 55973814 51873688 41328068
18106 41328068 27065357 16102275 10429346 7459943 5655154 4451398 3599347 2987052
18098 2987052 2553354 2188834 1890765 1635456 1462612 1320140 1183404 1073941 950594
18089 950594 827805 745098 680590 646707 588810 509578 444102 433002 458636 433757 393585
18078 393585 361739 324219 328134 339324 355688 355544 334681 295693 300111 313468 313683 309756 275849
18065B75849k2703L873j7826J5807q407K429n270j264J8677J9551K097K0445M3399
18052C46657Q89l2479o7760m8449j2261j6825l3661p868r170r392L0651r83l8089
18039A01260m0833n289N877M975q38K962l373J0720j2109J5880p702j6620J0974
18026F5884p569J1683K4516K4967m855q016K446J38n752J8649J7772j1994p099
18013A20770m0459k5357n686m244k93k2429o578K4677R044O563O239R539J040
18000G2826j9796j1244j224j223N487J3217L0162K5791k7116k5955p142n066o26
17987D8091J1168M992m20R897L923o638l3406j6180J1064n305k4399j0144j1448
17974a8805R036J7188j2802j314J6444O539K0560L3336r413j5237J924N144j4314
$$ plain form
18065 275849 253146 257019 239193 255000 246593 249022 243752 242488 261165 280716 282813 303258 346657
18052 346657 347546 315067 247307 198858 186597 169772 136111 128243 119073 109681 140332 139349 101260
18039 101260 60427 55138 61015 65990 65152 68114 64741 75461 63352 79232 71530 54910 65884
18026 65884 58315 69998 94514 119481 114626 106610 109056 109194 103442 122091 139863 127869 120770
18013 120770 80311 54954 49268 45024 44731 22302 15724 40401 49445 56008 62247 71786 72826
18000 72826 53030 41786 40562 39339 44826 58043 88205 113996 86880 60925 53783 48717 48091
17987 48091 59259 64251 63831 73728 77651 71013 37607 21427 32491 27186 2787 -7357 -18805
17974 -18805 -9769 7419 -5383 -6697 9747 16286 36846 70182 60769 45532 47456 52600 38286
17961C8286r523K989j6316j6776j4574M2595K8675K9299K470j3254j016k5330
17949D7525l9648n107K5141L4245J7806J5456k8996k6513O049Q901l0644l5381
17937a1166j1460K9090L4967L4307k2220k3255m250l3916M829J6670j6383j2584
17925a5371P840j8762j6227l3355J3084J4084O424O77K6932J5442n964j4095J7339
17912a952P941k4360j617j207l4961j7964R821J5734j038j348J7684R027k8630
17899e2870K7816J0108j1880K9806J1798k6025m261l791m33j1565n90j1596K3689
17886a9794K0575r09j2579l531o667l6957J878K1893p404J856J5818K5416J7357
17873A6952J3403o692j9871m1888j200K0812j0880J2186J2173j9138j2162j2894
$$ plain form
17961 38286 28763 31752 15436 -1340 -15914 26681 55356 84655 87125 73871 72855 47525
17949 47525 7877 2770 27911 62156 79962 95418 66422 39909 45958 54859 24215 -11166
17937 -11166 -22626 6464 41431 75738 53518 30263 26013 -7903 -3074 13596 -2787 -15371
17925 -15371 -7531 -26293 -42520 -75875 -62791 -48707 -42283 -41606 -14674 768 -5196 -19291 -1952
17912 -1952 5989 -18371 -19988 -21195 -56156 -74120 -64299 -48565 -49603 -50951 -33267 -24240 -52870
17899 -52870 -25054 -14946 -26826 2980 14778 -11247 -15508 -19299 -19732 -31297 -31887 -43483 -19794
17886 -19794 781 -128 -12707 -16238 -22905 -59862 -57984 -36091 -43495 -41639 -25821 -405 16952
17873 16952 30355 23663 3792 -38096 -39296 -18484 -29364 -17178 -5005 -24143 -36305 -49199
17861d9199j5709J4491K6364J7274j3588o821L866j8730o993N646J4769j4816
17849d3446n677N815J0934K1409K2433j5670K776R685j1629q102k2263O08o040
17836c9167N238J7566o895j819M7062Q983k1157l1612m370J2397J896q269j409
17823b1556r466K1279r628j198K4052k2333j0565j2185o77J5094J6698J197p140
17810a6428K6584k029k1318J014k266K0388O923r826k207L8740j0195J1667M435
17797D5482j4523j5167K369o534l456k6426k3154K62J0966Q059J0951K2740P248
17784A8817N78k4189J1333j0552O982J3257k7932j5389j8269n796j040K9290J1273
17771a1637j3654K3624P925j1459r548L5374K9894m090l8332j4052j744p747l1303
$$ plain form
17861 -49199 -64908 -50417 -24053 -6779 -20367 -27188 -23322 -42052 -49045 -43399 -28630 -43446
17849 -43446 -49123 -43308 -32374 -10965 11468 -4202 -1426 8259 -3370 -11472 -33735 -33127 -39167
17836 -39167 -33929 -16363 -23258 -25077 21985 30968 9811 -21801 -26171 -13774 -11878 -20147 -21556
17823 -21556 -31022 -9743 -19371 -20569 3483 -18850 -29415 -41600 -42277 -27183 -10485 -9288 -16428
17810 -16428 10156 8127 -13191 -12177 -14443 5945 12868 3042 835 39575 29380 41047 45482
17797 45482 30959 15792 18161 11627 8171 -18255 -41409 -41147 -30181 -22122 -11171 11569 18817
17784 18817 19395 -4794 6539 -4013 2969 16226 -11706 -27095 -45364 -51160 -52200 -22910 -11637
17771 -11637 -25291 -1667 6258 -5201 -14749 20625 50519 46429 8097 -5955 -7699 -15446 -46749
17758d6749K2694L5124M746j738n989r950m1030j2365m8K0651R230l173l703R756
17744b2544J1107j191q700J5673j1242J765j1367O046M557J5118K3580q00J102
17731B3104M520k183k2518J8589o495n6956k8729L820J1179l619K3194k692j4493
17718e3279j886K3857P820m809R791K4111k4508j136J2438K9196j6140j891j8401
17705a4837n1857j9616J7355L1371K7496n361j8171m01l215J4142n438r52k5951
17692e5435j6516L5010J4514K6102j002k493L798j5311r604k487J0109k0914Q707
17679b5522l919l536J5900J212M192kL199j6083q32L0154J029k1534J6688M939
17665E885r401j2036o568M681N429J3903m72l8181k4874J1434J4643K8989O414
$$ plain form
17758 -46749 -24055 11069 15815 14077 8088 -1862 -42892 -55257 -55305 -34654 -25424 -28597 -32300 -22544
17744 -22544 -11437 -12628 -21328 -5655 -16897 -15132 -26499 -20453 -15896 -778 22802 22002 23104
17731 23104 27624 25441 2923 21512 15017 -41939 -70668 -66848 -55669 -59288 -36094 -38786 -53279
17718 -53279 -55165 -31308 -23488 -28297 -18506 5605 -18903 -20039 -7601 21595 5455 3564 -14837
17705 -14837 -66694 -86310 -68955 -37584 -10088 -15449 -33620 -34021 -37236 -23094 -28532 -29484 -55435
17692 -55435 -71951 -36941 -22427 3675 2673 180 3978 -11333 -20937 -23424 -13315 -34229 -25522
17679 -25522 -29441 -32977 -17077 -15865 -11673 -11675 -8476 -24559 -25391 4763 5792 -15742 946 5885
17665 5885 -3516 -15552 -22120 -17439 -12010 1893 1421 -36760 -61634 -50200 -35557 -6568 -154
17652a54r459o848j4724j1219J2361J0735n528j5288K0476K6002R230k2371l8120
17639d4907K1526K3671J200l259o095j5573k2775k4803l9691K5010M0524M9462
17627D290J9319m305l2266M662k140K653n968J918J1579j599K462j5531j6392
17614c1318J4211J3918J1015m13K4456M451l2792k8103N761J0111J8626l4120
17602b4197l5266O739K759q978J3362L390J6874J9405j6098j0508K42L1679J7726
17589A7129j4280k4981j8684J7873J1754J71K0339p600l6537J3579K2079j9994
17577a9152k33J6814J695J8540L0993k638k5337m5464k7405J3945N5183K1391
17565C8332K018m587n1149l424L4713O231j8363K0513j1585o407P872J9081k223
$$ plain form
17652 -154 -9613 -16461 -31185 -42404 -30043 -19308 -24836 -40124 -19648 6354 15584 -6787 -44907
17639 -44907 -23381 290 1490 -1769 -7864 -23437 -46212 -71015 -110706 -85696 -45172 4290
17627 4290 23609 19304 -12962 -8300 -10440 -7787 -13755 -11837 -258 -1857 605 -14926 -31318
17614 -31318 -17107 -3189 7826 7413 31869 36320 3528 -24575 -18814 -8703 9923 -24197
17602 -24197 -59463 -52724 -49965 -58943 -45581 -42191 -25317 -5912 -22010 -32518 -32276 -597 17129
17589 17129 2849 -22132 -40816 -22943 -11189 -11018 9321 1721 -34816 -21237 842 -19152
17577 -19152 -19385 -2571 -876 17664 48657 46019 20682 -24782 -52187 -38242 16941 38332
17565 38332 40350 35763 -15386 -18810 15903 22134 3771 24284 12699 6292 14164 33245 31022
17552C1022k6983p342j8539m616Q350o074J332O157O987L0532J7840k7791j9320
17539h445k5098k5533J6923K3447J9399J993j1376j4207p347J0726j388J8167
17527b739r462j2858M325j5597j7129K713j7213J3726J2114J8666J4793l1331
17515c9992j9035R899N512J2589o760m010N643J4306n63K1419J2778j9346j9814
17502b7374M517K2031r117J1273J7222O931J1209L252l1256j9642o311R565O189
17489a511O009j8251j1154J658J1802J9922j0394j3803J4147j859j1252K4896
17477A0210L483M710q617n765k9192k860K4853m102k3349K2984L2855Q972K067
17464C6249k6001k5091L5774M4355j2068k601n1728k6849J5665m0399j1707K7115
$$ plain form
17552 31022 4039 -3303 -21842 -26458 -18108 -24182 -22850 -16693 -9706 20826 38666 10875 -8445
17539 -8445 -33543 -59076 -42153 -18706 693 2686 -8690 -22897 -30244 -19518 -20906 -2739
17527 -2739 -12201 -25059 -20734 -36331 -53460 -50747 -67960 -54234 -42120 -23454 -8661 -39992
17515 -39992 -59027 -49128 -43616 -31027 -37787 -41797 -36154 -21848 -22411 -992 11786 -7560 -27374
17502 -27374 -22857 -826 -9943 1330 18552 25483 36692 39944 8688 -10954 -17265 -7700 -1511
17489 -1511 4498 -13753 -24907 -23249 -11447 8475 -1919 -15722 -1575 -3434 -14686 10210
17477 10210 13693 18403 9786 4021 -25171 -28031 -3178 -7280 -30629 -7645 25210 34182 36249
17464 36249 10248 -14843 20931 65286 53218 50617 -1111 -27960 -12295 -52694 -64401 -37286
17452c7286l097q258J8450J4366N836l395J9012L7888J08369J34930K3200n8472
17440B51543j17281p4953j8086r982n768L308K8797J8303p151l5931j4651J789
17428A9937m190k273m684o100j2660r877K1182J2012k1057j2785j3245J627l91
17415c2504j1126J7999L5579j1781j7788j7651J0351J2653j2094k7959J5326K210
17403c6785M0369K5134R535K7487n299l1996l6774J1974l099j5335l967O307j5558
17390b8007k1335J5416r603j0716J7513p338j3488l2438L568L0349K3331J3970
17378a8778P664Q507J3344j8255l88L402k886k7358K7932K7529j627L268k2895
17365e41r494l21O318m83k8640j3526J4666j5714j3012j6304K4710K570j1170
$$ plain form
17452 -37286 -40383 -48641 -30191 -15825 -9989 -13384 5628 43516 151885 286815 310015 251543
17440 251543 134262 59309 41223 31241 25473 28781 57578 75881 68730 32799 18148 19937
17428 19937 15747 13474 8790 2690 -9970 -19847 1335 13347 -7710 -20495 -33740 -32113 -32504
17415 -32504 -43630 -25631 9948 -1833 -19621 -37272 -26921 -14268 -26362 -54321 -38995 -36785
17403 -36785 3584 28718 38253 65740 60441 28445 -8329 3645 546 -14789 -18756 -12449 -28007
17390 -28007 -49342 -33926 -43529 -54245 -36732 -44070 -57558 -89996 -86428 -56079 -32748 -18778
17378 -18778 -11114 -2607 10737 -7518 -7906 -4504 -7390 -34748 -6816 20713 19086 22354 -541
17365 -541 -10035 -10356 -4038 -4521 -33161 -46687 -32021 -47735 -60747 -77051 -52341 -49771 -60941
17352f0941K4774m64M217K4115K6841J7283j4934J315R85N44K292j3116k4086
17339a1175j314J8706K6582J9358n243k6466k9386j6945L887J5475k343R569j2638
17326a1933Q264k106J6411J3125m950j6483N696K034k2926n074k9229K1042J3403
17313a2726K249P300K2164K2751l039l299k4372L917J5090k8093m5752J73M5344
17300A707L5722j278l624k1150J698j4995j0964P154k5618L2272j0801j5789K3154
17287b512K5515M219K545k4554j8424J0952J2405l2136j5780K9653j3609K211
17275a9515J6040K653K9491k4131k2554K726j0157j2241l028L2554J8054k1850
17263a1958j4624M900n276L325L2205L9518N858j6228O186j643k0529j8239j3128
$$ plain form
17352 -60941 -36167 -36631 -32414 -8299 18542 35825 20891 22206 23191 23735 26027 12911 -11175
17339 -11175 -12489 6217 32799 52157 46914 20448 -8938 -25883 -21996 -6521 -8864 705 -11933
17326 -11933 -3669 -5775 10636 23761 18811 2328 8024 10058 -12868 -17942 -47171 -26129 -12726
17313 -12726 -10477 -3177 18987 41738 38699 35400 11028 14945 30035 1942 -43810 -43637 1707
17300 1707 37429 36151 32527 11377 13075 -1920 -12884 -5730 -31348 924 -9877 -25666 -2512
17287 -2512 23003 27222 29767 5213 -13211 -2259 10146 -21990 -37770 -8117 -21726 -19515
17275 -19515 -3475 -822 28669 4538 -18016 -15290 -25447 -37688 -40716 -8162 9892 -11958
17263 -11958 -26582 -21682 -26958 -23633 8572 48090 53948 37720 43906 42263 21734 3495 -9633
17250i633j6988M855Q169K9422J7308k3799k3445M432k011P672J3450k7790m5031
17237f3389K1461K1912k460q89P21J4007J7480J3826J8284k8033l3782O558J4450
17224A46j5452K824o263q816J4248M003J4863J9880l42p896J1628m836K3289K5679
17210G2955k6020k4892m84o032J216K9280n124l0397k5609n24J4905o271j1439
17197a8436J8091J6139l1448o421L4279J6448O582K5072j3723j5821l05j0011
17185B0446j1841n095L471j0792l212j3837l96K0635j5031j4352N936K1566J5872
17172A3370r71k7938j0691N83j8167R605O431Q708P350M1606J7446j566o048j7734
17158B1984k6827k9889r608L3570L553l772j4215n844L4748o793m392l716P411
$$ plain form
17250 -9633 -26621 -21766 -13597 15825 33133 9334 -14111 -9679 -11690 -4018 9432 -18358 -63389
17237 -63389 -41928 -20016 -22476 -23365 -22644 -8637 8843 22669 40953 12920 -20862 -14304 146
17224 146 -15306 -12482 -18745 -27561 -13313 -9310 5553 25433 25091 17195 28823 23987 47276 72955
17210 72955 46935 22043 21559 15527 16743 46023 40899 10502 -15107 -15631 -726 -6997 -18436
17197 -18436 -345 15794 -15654 -22075 12204 28652 35234 60306 46583 30762 30457 20446
17185 20446 8605 3510 6981 -3811 -7023 -20860 -21256 -621 -15652 -30004 -24068 -2502 13370
17172 13370 12399 -15539 -26230 -25647 -43814 -34209 -27778 -19070 -11720 29886 47332 45766 39718 21984
17158 21984 -4843 -34732 -44340 -10770 -7217 -10989 -25204 -31048 3700 -3093 -7485 -11201 -3790
17145c790k992j0467k2576J941L6762j5787k4656J0558K5335J5460j5641J91L1454
17132B5792j5363k4453K057J4897J8177o987k9423j7191J6244J8842L0588j0058
17120B3122l1911P468m954k4092J757P593p509N360n957M58J1800L7861n486J248
17106A6758N842l5092n094j9108J3937m411K2454r402k5663J6450R816J940J6266
17093D693l367p289j5049K319M955l945J840j5104k1076J053n66K0880J3773R903
17079f980k3729j7125k2074j069j3256K1855K4611K3838j7957n55l140j4138k791
17066e2510j5854k5489K5083K7543K7359l395K5857Q475l2898m966j4200l2028
17054f7023K5690K1915J8646q750n791R862J368o76m155J5078K668p665k4521
$$ plain form
17145 -3790 -6782 -17249 -39825 -37884 -1122 -16909 -41565 -31007 -5672 9788 -5853 -5662 25792
17132 25792 10429 -14024 -11967 2930 21107 14120 -15303 -32494 -16250 2592 33180 23122
17120 23122 -8789 -1321 -6275 -30367 -28610 -21017 -28526 -23166 -29123 -28665 -16865 20996 15510 16758
17106 16758 22600 -12492 -17586 -36694 -22757 -27168 -4714 -14116 -39779 -23329 -13513 -11573 4693
17093 4693 1326 -5963 -21012 -18693 -13738 -17683 -15843 -30947 -52023 -50970 -51536 -30656 -16883 -6980
17079 -6980 -30709 -47834 -69908 -70977 -84233 -62378 -37767 -13929 -31886 -32441 -35581 -49719 -52510
17066 -52510 -68364 -93853 -68770 -41227 -13868 -17263 8594 17069 -15829 -20795 -34995 -67023
17054 -67023 -41333 -19418 -772 -9522 -15313 -5451 -4083 -4759 -8914 6164 8832 1167 -23354
17041b3354N977j7127j4360K4191J8451m534L908j9183J4045N969j5492j8270
17029c9779p596M4005l34j1173o095k9309k0468k6765K7292O6632M6790l1465
17017A1735k3398l9746k4159K0400J7400J9201K1728J5785J9635R507k0340R931
17005C7679J8578j3719l2394k8053k5128J3522N648K2803M0J4403o259o585J0344
16992A0879L8601P930k4615j4156j0992N918p240j2414N405L002j5395Q808K7463
16979B3194O60j4080j1269j2495J0457J1449r860k3420j27n873N2013J6000k6103
16966A0546R733k7753K111k102J4215l7104p8451K0937O1309J9513P079j4166
16954a4133j4661J5212j2405p302L6102K0491j6571k2054n819N210m677j3808
$$ plain form
17041 -23354 -17377 -34504 -48864 -24673 -6222 -10756 -6848 -26031 -11986 -6017 -21509 -39779
17029 -39779 -47375 -3370 -3704 -14877 -20972 -50281 -70749 -97514 -70222 -3590 43200 11735
17017 11735 -11663 -51409 -75568 -55168 -37768 -18567 3161 18946 38581 48088 27748 37679
17005 37679 56257 42538 10144 -17909 -43037 -29515 -23867 -1064 -1024 13379 7120 535 10879
16992 10879 49480 57410 32795 18639 7647 13565 6325 -6089 -684 2318 -13077 -4269 23194
16979 23194 23854 9774 -1495 -13990 -3533 7916 -1944 -25364 -25491 -31364 20649 36649 10546
16966 10546 20279 -7474 -5363 -7465 6750 -30354 -108805 -87868 -26559 -7046 33 -14133
16954 -14133 -28794 -13582 -25987 -33289 2813 23304 6733 -15321 -21140 -15930 -20607 -34415
16942c4415J8173L0867J5666j597j2414k6625m1524l5776L6533j163m2587j2263
16930a07125L1954L4100K4750L5483k4754m6803P541R538j1069j3258j4430J2095
16918f1978K5657M456K221p143M639J4481n014p96J2412J1251k3017N095K4793
16905G057N656r413j1749L258k2254l356J8673R964r594j4975K6503K470j9536
16892a7296k0898M376J3042J2327j1992r244P873o082k4138k9756K1087N5146
16880e555J6322l528L871J1594l1458k7926J5422L1387j8612R794j099j1450j5385
16867b6623q48m485k5132P523J5553K876O382L674J8655J7468j3628o703k2876
16854b8164J1220K7513J5120Q001k4462j2091n829k405k2308j6628Q632L9555
$$ plain form
16942 -34415 -16242 14625 30291 28694 16280 -10345 -51869 -87645 -51112 -52275 -94862 -107125
16930 -107125 -75171 -41071 -16321 19162 -5592 -52395 -44854 -35316 -46385 -59643 -74073 -61978
16918 -61978 -36321 -31865 -29644 -36787 -32148 -17667 -22681 -23477 -11065 186 -22831 -17736 7057
16905 7057 12713 3300 -8449 -5191 -27445 -30801 -12128 -2164 -11758 -26733 -230 2240 -17296
16892 -17296 -38194 -33818 -20776 -8449 -20441 -29685 -21812 -27894 -52032 -81788 -60701 -5555
16880 -5555 10767 7239 11110 22704 -8754 -36680 -21258 10129 -8483 1311 212 -11238 -26623
16867 -26623 -27471 -31956 -57088 -49565 -34012 -31136 -24754 -21080 -2425 15043 1415 -5288 -28164
16854 -28164 -16944 10569 25689 33690 9228 -2863 -8692 -11097 -33405 -50033 -41401 -1846
16842a846j5140k7339Q679J0811J7219o482j4506N881K4923j9616N162J3804K6638
16829B8188j0668j4066j1494j4429p719P060Q799j5207L83j1333J4681R681j0848
16816b6972J5798M135l3001O569l2798q185K8297K7744J7402p2j2766k4585M5798
16803G364O511k1188k2600j9431M740J4480Q418j4065l652L215J6373P958j7391
16790b9268Q758J4563Q740J0813l390L45J4023M160j4538J881k902j8726R877
16777D336N070K204p135J4800R031l925k2126j2624n654K312l097r129R460o558
16763b3035K1822n011m134J4838k9124l658K424M301J1595K2288Q569r748j3652
16750b525k2304J499m384q578J7130K5595j4513P799J027j796l685m558k968k7106
$$ plain form
16842 -1846 -16986 -44325 -35646 -24835 -7616 -14098 -28604 -22723 2200 -17416 -12254 1550 28188
16829 28188 17520 3454 -8040 -22469 -30188 -23128 -14329 -29536 -29153 -40486 -25805 -16124 -26972
16816 -26972 -11174 -7039 -40040 -33471 -66269 -74454 -46157 -18413 -1011 -1083 -13849 -38434 7364
16803 7364 13875 -7313 -29913 -49344 -44604 -30124 -21706 -35771 -39423 -36208 -19835 -11877 -29268
16790 -29268 -20510 -5947 2793 13606 10216 10561 24584 28744 14206 16087 13185 -5541 4336
16777 4336 9406 11610 4475 19275 28306 24381 2255 -10369 -16023 -13711 -16808 -25937 -16477 -23035
16763 -23035 -1213 -6224 -10358 4480 -24644 -28302 -25878 -21577 -9982 12306 20875 11127 -2525
16750 -2525 -24829 -23330 -27714 -36292 -19162 6433 -8080 -281 746 -1050 -4735 -9293 -12261 -39367
16736c9367j208L5238r076N45O478r564k2571J952j4061j0817q032Q53K5381L070
16722d1179k404K2210J3050J3170o399n493j3132j0830o935K009j6951j0142K8583
16709c4443l162j1287P411r94K7483P935k0622k8524l649K3818J8943M376N701
16696g014k17K792J1995j1990k3159k0535K0114L7961n744k4293l9250J1369O049
16683d1922r32j9216J9359K2674J2687L4189K3413j1203p283p493j5605k0513
16671a1845n060K2184p409M20J4557R13L472J90k1844k0878o375j0595N04j2849
16657e4615M097J4368R749J3217J0030J2948k6906o64K4524M2177j7168R459k6498
16644A4718j7860K5462j8912j9228J6319L1507j2418P470k315k131P794j6837
$$ plain form
16736 -39367 -40575 -5337 -14413 -13868 -7390 -16954 -39525 -37573 -51634 -62451 -70483 -69630 -44249 -41179
16722 -41179 -43583 -21373 -8323 4847 -1552 -7045 -20177 -31007 -37942 -35933 -52884 -63026 -34443
16709 -34443 -37605 -48892 -41481 -42475 -14992 -7057 -27679 -56203 -59852 -36034 -17091 -12715 -7014
16696 -7014 -7231 -4439 7556 -4434 -27593 -48128 -28014 9947 4203 -20090 -59340 -47971 -41922
16683 -41922 -42854 -62070 -42711 -20037 -7350 26839 50252 39049 31766 24273 8668 -11845
16671 -11845 -16905 5279 -2130 -1710 12847 13760 17232 17422 -4422 -25300 -31675 -42270 -41766 -54615
16657 -54615 -50518 -36150 -26401 -13184 -3154 9794 -17112 -17776 6748 48925 31757 41216 14718
16644 14718 -3142 22320 3408 -15820 499 32006 19588 27058 24743 22612 30406 13569
16632A3569R957j4279k5155J3001P057l0223L758j5149j5899j0343k924J7185
16620d9445M046L377L932J7467K1869L0655J4391j3816k2335l9399q329j4994
16608e2581L7507K4342J8348K0940m1639k2991J9419j5131J3221k4828r939j3842
16596d7174M350J7299J3350Q166k2334j1370M046J1670R794K7715J8248k2745
16584A1015M897J282k6286m390n231j0058O643L3443r741j4043l5162j1081M1088
16571a7624K056q272L237J4081j837M396m190j003j173m873M3722K5774j183j9497
16557C3614l3259k3103J0665K6287K373P829r260k8667j3292K1767L0023j5280
16545I697L396o202j1246k784R911q844l6249N337N3409P250L7539P10l3993k687
$$ plain form
16632 13569 23526 9247 -15908 -2907 4150 -26073 -22315 -37464 -53363 -63706 -66630 -49445
16620 -49445 -45399 -42022 -38090 -20623 1246 31901 46292 32476 10141 -29258 -37587 -52581
16608 -52581 -15074 9268 27616 48556 6917 -16074 3345 -11786 1435 -23393 -33332 -47174
16596 -47174 -42824 -25525 -12175 -4009 -26343 -37713 -33667 -21997 -12203 15512 33760 11015
16584 11015 15912 17194 -9092 -13482 -18713 -28771 -22128 11315 1574 -12469 -47631 -58712 -17624
16571 -17624 -15568 -23840 -20603 -6522 -8359 -3963 -8153 -9156 -10329 -15202 28520 54294 53111 33614
16557 33614 355 -22748 -12083 14204 16577 24406 15146 -13521 -26813 -5046 24977 9697
16545 9697 13093 6891 -4355 -7139 2772 -6072 -42321 -36984 16425 23675 61214 61924 27931 25244
16531B5244k493j2568N730J6469n833k2216O11O436q016J1116J0229o736k3106
16518e133n443K8096j1378j7925k3488J8153J4409O369j9592j8999K917j0350
16506d2364K820L770p303J9254Q878K3797j1406j9217K861Q659J081r22P337n198
16492g953j0776J198M520Q706j0174R112L927K257j9749j7140L0587k088n323
16479a2896k3185J810N752j902r475N29L5079K0795K312J0530j5174J0230N300
16466B9705P840m9414k6568N5624J3267l0474j1385j5172j914j1887K4203j1138
16454b7313J1826J7814K2714J1507j3457m7719j219L7869j1058o209L1940L28
16442B7023n709j9169R030k3542p059Q207k3117j774J3075k559j1089O412K9303
$$ plain form
16531 25244 22751 10183 15913 32382 26549 4333 4944 11380 3364 14480 24709 17973 -5133
16518 -5133 -10576 17520 6142 -11783 -35271 -17118 -2709 3660 -15932 -34931 -32014 -42364
16506 -42364 -39544 -35774 -43077 -23823 -14945 8852 -2554 -21771 -18910 -10251 -9170 -10092 -2755 -7953
16492 -7953 -18729 -17531 -13011 -4305 -14479 -5367 -1440 817 -18932 -36072 -5485 -7573 -12896
16479 -12896 -36081 -34271 -28519 -30421 -39896 -39367 -4288 16507 18819 29349 14175 24405 29705
16466 29705 37545 -11869 -38437 17187 30454 -20 -11405 -26577 -28491 -40378 -16175 -27313
16454 -27313 -15487 2327 25041 36548 23091 -24628 -25847 12022 964 -5245 26695 27023
16442 27023 21314 2145 11175 -12367 -19426 -11219 -34336 -36110 -23035 -25594 -36683 -30271 -968
16429i68o201O45R548j8048r618J4992J0Q84j8742k8489m701k7502r359L0338
16415f7211N505L306Q625k2983L497J2402M2897J0408k955p600K6808R722k0299
16402B122q548O494j4855j3143Q23K7077L4671M0l8540j7847J3021O433j3292
16389a5544P299L8545R509q72l8495j0204o401Q949J6961J3069N4j5641K489j1004
16375a286K135J1783l389k54J3606j407k1240L918P269P725K7442J4568j3991
16362D6879k9148J7686P657j3654N993l3820j8816N05K3036l049q037k6296J342
16349b9722k4125K1759J4525P249J1433j2204J4768r751J9216K9214o397k7500
16337H465r899j9495l3558j8355J115J345J6312J9732j3651M605j523J8095R385
$$ plain form
16429 -968 -7169 -6524 3024 -15024 -24642 -9650 -9640 -8756 -27498 -55987 -60688 -88190 -97549 -67211
16415 -67211 -61706 -58400 -49775 -72758 -69261 -56859 -13962 -3554 -6509 -14109 12699 22421 2122
16402 2122 -6426 68 -14787 -27930 -27107 -30 34641 34681 -3859 -21706 -8685 -2252 -15544
16389 -15544 -8245 30300 39809 38937 442 -9762 -16163 -7214 9747 22816 22870 7229 9718 -1286
16375 -1286 849 12632 9243 8989 22595 21188 -52 3866 11135 18860 46302 60870 46879
16362 46879 17731 35417 43074 29420 35413 1593 -17223 -16718 6318 3269 -4768 -31064 -29722
16349 -29722 -53847 -32088 -17563 -10314 1119 -11085 3683 -6068 13148 42362 35965 8465
16337 8465 -1434 -20929 -54487 -72842 -71727 -70382 -54070 -34338 -47989 -43384 -44907 -26812 -17427
16324a7427j2915j4163M978q6k1695l992K4462K0297J8327L999j1646K919j9776
16311b6718q737J7361j3973p316R822K205m755k696k412j364J9808J508M892m487
16297a6862p183J7295K6058J6798M142K335n751j873J202n026j2105K8815k5335
16284B2510m4175J3486J3072m1347m35J1026j1585j2800J9807K9802o116k399
16272i154k2368k0448K1728J6402J6976J339j9167K3139L0217J1720k3621m5295
16260a8532q588l679K4368j995j0945n498k111L5139J0944r599p891J782k2515
16247a9120j597J1527K9424M875J885l026l0817j6145J7466J9681j5350j5574
16235a6771K5004j3884J2207l896k336O640q631n127K2136p96l2830o501K502
$$ plain form
16324 -17427 -30342 -44505 -39527 -39613 -61308 -65300 -40838 -20541 -2214 1785 -9861 -6942 -26718
16311 -26718 -35455 -18094 -32067 -39383 -29561 -27356 -32111 -34807 -37219 -38583 -18775 -17267 -12375 -16862
16297 -16862 -24045 -6750 19308 36106 40248 42583 36832 34959 36161 31135 19030 47845 22510
16284 22510 -21665 -8179 4893 -36454 -36889 -25863 -37448 -50248 -30441 -639 -6755 -9154
16272 -9154 -31522 -51970 -30242 -13840 3136 4475 -14692 8447 38664 50384 26763 -18532
16260 -18532 -27120 -30799 -6431 -8426 -19371 -24869 -26980 8159 19103 9504 1613 3395 -19120
16247 -19120 -20717 -9190 20234 25109 26994 23968 -6849 -22994 -5528 14153 -1197 -16771
16235 -16771 8233 -5651 6556 2660 324 6964 -1667 -6794 15342 14546 -18284 -24785 -22283
16222b2283k454Q674p399Q904J747K2243j9167r67O656l100m337K021m592J2466
16208a588R662j2630L2098L198k1916N98K0381K0251M805k2571N882j6315j8037
16195C818J559k1426r47k9754J7517l03J2417R397L3762O824M109o729P165k012
16181C5397j4525l3136P68k090K4451J1413q599q499o100R622M865j6699k4850
16168b7982K3458L2773j2953j3133o584j4995P925K90j6412K6K0255k8920k2426
16155e8678N393J1697O673J9677J809Q53l11p746K3839m432j1783Q278P519n211
16141b423k0544O2J2956l618K0467J6508O235J1699k6557l1420j0975n605L3824
16128F09P966J3569K304j0070J6809Q418n0323l5371P954J2458k715j1419m882
$$ plain form
16222 -22283 -24737 -16063 -23462 -14558 -12811 9432 -9735 -10702 -4046 -7146 -11483 -9462 -14054 -1588
16208 -1588 8074 -4556 27542 30740 8824 9422 29803 50054 54859 32288 38170 21855 3818
16195 3818 5377 -16049 -16996 -46750 -29233 -29536 -17119 -7722 26040 32864 36973 30244 37409 35397
16181 35397 20872 -12264 -11496 -13586 10865 22278 13679 5180 -920 8702 13567 -3132 -27982
16168 -27982 -4524 28249 15296 2163 -4421 -19416 -11491 -11201 -27613 -27587 -7332 -36252 -58678
16155 -58678 -53285 -41588 -34915 -15238 -13429 -12576 -12887 -20633 3206 -1226 -13009 -4731 2788 -2423
16141 -2423 -22967 -22905 -9949 -13567 6900 23408 29643 41342 14785 -16635 -27610 -33215 609
16128 609 8575 22144 24448 14378 31187 39605 -10718 -46089 -38135 -25677 -28392 -39811 -44693
16115d4693K8939O72m1558k4260J7926L4284K8738J8752r333o855o773L630Q606
16102H075K577J1198m39Q252n017Q410k873p335l4021j0543J2042K7204r659l0367
16088b2496j9764N567q89Q126p686K375K2952m659Q756J1621O601O916J3481R152
16074D0053j5698k8994j8512J6608J6289p95L613j451o207r247k6376J5663J2661
16061b393O602j0368m0051p866J3620M930K0773J6083N983m2714j6904J8101J1672
16048b2532p320l829j447j9320k9283K284L6364j893J6017J1308l623O208j232
16035a8298j5561p105K545j3036L679J3734q478K1581M1170j2339k5941q086L4597
16022H462O194k0946r432Q288j3171j740O24j2459P894L562j3215k018J553r49
$$ plain form
16115 -44693 -15754 -15082 -56640 -80900 -62974 -28690 48 18800 9467 2612 -4161 -531 8075
16102 8075 10652 21850 21411 29663 24646 33056 30183 22848 -11173 -21716 -9674 17530 7871 -22496
16088 -22496 -42260 -36693 -37582 -29456 -37142 -34767 -11815 -16474 -7718 3903 10504 17420 30901 40053
16074 40053 24355 -4639 -23151 -6543 9746 8951 12564 11113 4906 -4341 -30717 -15054 -2393
16061 -2393 4209 -6159 -46210 -54076 -40456 -35526 -14753 1330 7313 -35401 -52305 -34204 -22532
16048 -22532 -29852 -33681 -35128 -54448 -83731 -81447 -45083 -46976 -30959 -19651 -23274 -17066 -18298
16035 -18298 -33859 -40964 -38419 -51455 -47776 -34042 -42520 -20939 20231 7892 -18049 -26135 8462
16022 8462 14656 -6290 -15722 -7434 -20605 -22345 -21721 -34180 -26286 -22724 -35939 -37957 -36404 -37353
16008c7353K7561J5953N2212K4663k5010o8504m2789l006Q426j0597K7105O796
15996b4543j2310j2024J1026P524R441K419p931p303m491K555q274j7203L024
15983e8090J4374J5272q499J2797O473L084O56l2498k5931L0707K1360L3M247
15970a6015p583J4270j0970J7566M4445K4391j4774l7897K4825J7979P205m1969
15958B1473j7751j9061L164j7461J4121J2393j7938k9526j2117P183O957K5841
15946b2722J6797j4375k5459l569J4845R805J7746K5099j2418n964j3485J9740
15934F040J352m3998j9033L0729J8710l662J1067J6630J812N628l1512N671K8340
15921B7774J1149J0522l1918m5153j4267L692J9921M475J1622J6656p304l3571
$$ plain form
16008 -37353 -9792 6161 58373 83036 58026 -10478 -53267 -56273 -47847 -58444 -31339 -24543
15996 -24543 -36853 -48877 -37851 -30327 -20886 -18467 -26398 -33701 -38192 -35637 -43911 -61114 -58090
15983 -58090 -43716 -28444 -36943 -24146 -17673 -14589 -13933 -46431 -72362 -41655 -20295 -20262 -16015
15970 -16015 -23598 -9328 -20298 -2732 41713 66104 51330 13433 38258 56237 63442 21473
15958 21473 3722 -15339 -12175 -29636 -15515 -3122 -21060 -50586 -62703 -55520 -48563 -22722
15946 -22722 -5925 -20300 -45759 -49328 -34483 -24678 -6932 18167 5749 -215 -13700 6040
15934 6040 7392 -36606 -55639 -24910 -6200 -9862 1205 17835 19647 25275 -6237 -566 27774
15921 27774 38923 49445 17527 -27626 -41893 -38201 -18280 -13805 -2183 14473 7169 -26402
15909b6402l743J0299K176j368q562N775j72J9279J2273l1747k838L9326m757
15896I539p166j3396k5654J3020J8309Q374J8136j1036j6261O104P100J3234L835
15883B4138O797J782j6241J9138J9687k0683p335j118K8401J5510j8151j1540
15871D0385l1951J802q988j5892N251K187L314J4447J7835J4344k4615j3850p547
15858c278l8402p057m541K0228K913K7454L703j1766M429K2858K9399j0035m6241
15845a0336J2694n506Q457L3009j1212k954Q938r383J7904j3257m6089K4285J7548
15832B4098k9535k092j4612j8604n026P200j52O911J8770R860K4854j788J85R251
15818B9320j7709p600o756l461K9157p985j5028l192N415J3083K9646N397j2979
$$ plain form
15909 -26402 -30145 -19846 -17670 -19038 -27600 -21825 -21997 -2718 9555 -22192 -25030 14296 9539
15896 9539 2373 -11023 -36677 -23657 -5348 3026 21162 10126 -6135 -31 7069 20303 24138
15883 24138 30935 32717 16476 35614 55301 34618 27283 26165 54566 70076 51925 40385
15871 40385 8434 10236 1248 -14644 -9393 -7206 -3892 10555 28390 42734 18119 4269 -3278
15858 -3278 -41680 -48737 -53278 -33050 -30137 -2683 1020 -10746 -6317 16541 45940 35905 -10336
15845 -10336 2358 -3148 5309 38318 27106 24152 33090 23707 41611 28354 -17735 6550 24098
15832 24098 -5437 -7529 -22141 -40745 -45771 -38571 -38723 -31812 -13042 -3182 21672 19884 20069 29320
15818 29320 11611 4011 -2745 -6206 22951 14966 -62 -3254 2161 15244 44890 50287 37308
15805C7308o740J406o194j1032j6044j9881L682M514K76j332j5869n363j190J0678
15791b5781J9100k613L1611J0511k9790p458m422J2564K0973M489k9963n332q796
15778a4907K2346K9026j5574j4513j6629r921J2591L1728j2442m1219L551M703
15766b1260J402p146J0197Q35q390P791J8465J5029k6166j9306O355O635p566
15753b3125r661j3777M441K7882J896q626p649o761K5095K9514n955j7892k0084
15740b4702k922K823K129J3845r611n807K1504J9624j987k5319L4896K2089m975
15727D1587k3418j6719J34N077L638P502Q660m044j8179l097O056J278K756q133
15713C098l52L344p004L34p946m440K1460k8288k9357M8649L5882L04j3328K3925
$$ plain form
15805 37308 30568 31974 25780 14748 -1296 -21177 -17495 -12981 -12705 -14037 -29906 -35269 -36459 -25781
15791 -25781 -6681 -9294 22317 32828 3038 -4420 -8842 3722 24695 29184 -779 -6111 -14907
15778 -14907 7439 36465 20891 6378 -10251 -20172 -7581 24147 11705 -29514 -25963 -21260
15766 -21260 -19858 -27004 -16807 -15972 -24362 -16571 1894 16923 -9243 -28549 -22194 -15559 -23125
15753 -23125 -32786 -46563 -42122 -14240 -12344 -20970 -28619 -35380 -10285 19229 13274 -4618 -24702
15740 -24702 -27624 -24801 -22672 -8827 -18438 -24245 -2741 16883 14896 -10423 24473 46562 41587
15727 41587 18169 1450 1584 6661 10299 17801 26461 22417 4238 1141 7197 8475 11231 3098
15713 3098 2746 6090 -914 -580 -8526 -12966 8494 -19794 -49151 -502 35380 35684 22356 46281
15699D6281j895R992j1419j6794q380j4884p739q22q92J308K72P045L4414r479
15685B7008l0967N4807j91k9097j5045P656Q833n949k1597m349j4504N205L0984
15672A2794J4124l1462k0554K533R668n232q943L849P549J9298o584j3612q497
15659b5069r007R983K6626J7041k7604o779j1595j8120K003m380R777m966P965
15646c4125L3788J5880r976N1R283K0548K6727l0519j3212o836k8587O302K4724
15633A4048k5559J3475M7628K0041j5221j7444P371k1633k7698L736j8933j1177
15621c1366J5895P979m28P509L846k0297Q69K7019K1763n749J1458J4692L766
15608E6956j5497k1447q188J8481M220k8548n134O361K3048J3845N561k8050k1346
$$ plain form
15699 46281 44386 54378 42959 26165 17785 2901 -4838 -5660 -6552 -5244 -4972 2073 36487 27008
15685 27008 -3959 50848 50657 21560 6515 14171 23004 17055 -4542 -8891 -23395 -18190 12794
15672 12794 26918 -4544 -25098 -22565 -12897 -18129 -27072 -23223 -15674 3624 -2960 -16572 -25069
15659 -25069 -34076 -24093 2533 19574 -8030 -14809 -26404 -44524 -42521 -46901 -37124 -42090 -34125
15646 -34125 -337 15543 5567 5618 14901 35449 62176 31657 18445 11609 -16978 -10676 14048
15633 14048 -11511 1964 49592 69633 54412 36968 44339 22706 -4992 -1256 -20189 -31366
15621 -31366 -15471 -7492 -7920 -411 3435 -16862 -15993 11026 32789 27040 38498 53190 56956
15608 56956 41459 20012 11824 30305 34525 5977 843 7204 30252 44097 49658 21608 262
15595B62j140j9664m746J2772j7074L0013M95N761l4338m046J4002n29K7892K0749
15581C0409o944q53j4986n712R78l2842K6622R305l5340J1016J4630P568n467
15568a616k5966O422P556K75k5439k237m409N47K557k079J8599M5474M1468K4120
15554H5272m0384n0816l5354p293L6515n690k368j8848l016J805q446J2851R544
15541b6228J3551J0369k1281l6292k815M3087J8749K2429m104L123K2459r362
15529C3685k9494J5231O859K0077r252r937k138K7425l190p681J0807J1183l3683
15516B9892k3860q714Q947K5103K0262q405k285k021J4879j939k8148l0185j7450
15503b3924l2250J642J3487J2609l331J5345K9753p379j4322K9560K5775k7922
$$ plain form
15595 262 -878 -20542 -25288 -12516 -29590 423 918 6679 -27659 -31705 -17703 -18232 9660 30409
15581 30409 23465 22612 7626 1914 2892 -29950 -3328 5977 -29363 -18347 -3717 3851 -1616
15568 -1616 -27582 -21160 -13604 -13329 -38768 -41005 -45414 -44867 -42310 -44389 -25790 19684 61152 85272
15554 85272 44888 -5928 -41282 -48575 -12060 -17750 -20118 -38966 -41982 -40177 -48623 -35772 -26228
15541 -26228 -12677 -2308 -23589 -59881 -62696 -19609 -860 21569 17465 20588 43047 33685
15529 33685 4191 19422 26281 46358 37106 27169 25031 52456 49266 41585 52392 63575 29892
15516 29892 6032 -2682 6265 31368 51630 43225 40940 38919 53798 51859 23711 -6474 -23924
15503 -23924 -56174 -54532 -41045 -28436 -31767 -16422 13331 5952 -8370 21190 46965 19043
15491A9043k6621k7361Q713N095k1305P006L3975J7888k589j5178P470J9770j1435
15478A4471P805K925m010J7383j2479N450l4115j8157J7462k1j5960J751j5000
15465c2495L66J5854n603l0000n304M2424K5760P278k8619L182J9690j5337l6166
15452c8970j923M4921o571q590j88M9050K2523k2577n2553j4164k1936M289N2956
15439F267K829n9994O808O4520j554j9228P435J9419K601j7416J0576J2990m965
15426C0288l9678j5762M075J3764M400J4110k3759L010p350m709L84O625J3561
15413a041J5805p164M884J2529J4888o621k5044m3793J1589J0294J723J4624K0014
15400B2687k4005J215P808j234j95q968j8222J6573M3885O986j124j9667l8894
$$ plain form
15491 19043 -7578 -34939 -26226 -21131 -42436 -35430 -1455 16433 13844 -1334 6136 25906 14471
15478 14471 22276 25201 21191 38574 26095 31545 -2570 -20727 -3265 -3286 -19246 -17495 -32495
15465 -32495 -32129 -16275 -21878 -51878 -57182 -14758 11002 18280 -10339 -7157 12533 -2804 -38970
15452 -38970 -40893 4028 -2543 -11133 -11321 37729 60252 37675 -14878 -29042 -50978 -46689 6267
15439 6267 9096 -50898 -44090 20430 18876 -352 7083 26502 29103 11687 22263 35253 30288
15426 30288 -9390 -25152 -21077 -7313 -2913 11197 -12562 -9552 -16902 -21611 -21227 -14602 -1041
15413 -1041 14764 7600 12484 25013 39901 33280 8236 -35557 -23968 -13674 -11951 2673 22687
15400 22687 -1318 -103 7705 6471 6276 -2692 -20914 -4341 39544 46530 45406 25739 -13155
15387a3155j6840q594j6708L8087L1086m128j7736J0928K018j2123r107J3214
15375c058n186j0146J6951j7984j0004J6529o270P205o847k4397K2632K0800n97
15362c72j5038j3111k453j0938n542N731J4816K3932J7968n60M786o709j031n276
15348F203q178p214J6195L0307L292j1186l218J3261l1068l55J5534J7667k0623
15335B0617j5906P887J771N26j9447L089J80J5500P56r719M864r831j8584K1304
15321C007L1256j9058k8739P246K5412P310P26J8935j1579k4268k0045J371K846
15308e580J8452L181l4112l2525K7322M3273M593r434j8602K505J2802j8628k7514
15295c4267n132L849O711J5974K2568Q800O508K4943K4099p833l8364k7278l3678
$$ plain form
15387 -13155 -29995 -38589 -55297 -17210 13876 9748 -7988 2940 4958 -7165 -16272 -3058
15375 -3058 -8244 -18390 -1439 -19423 -29427 -12898 -19168 -11963 -18810 -43207 -20575 225 -372
15362 -372 -15410 -28521 -30974 -41912 -47454 -41723 -26907 -2975 14993 14433 19219 12510 11479 6203
15348 6203 -1975 -9189 7006 37313 40605 29419 26201 39462 8394 8039 23573 41240 20617
15335 20617 4711 12598 14369 14895 -4552 -1463 -1283 14217 14973 5254 10118 287 -18297 3007
15321 3007 34263 15205 -13534 -6288 19124 26434 27160 46095 34516 10248 -9797 -8426 -5580
15308 -5580 12872 16053 -18059 -50584 -23262 20011 24604 15170 -3432 -927 11875 -6753 -34267
15295 -34267 -39399 -35550 -28839 -12865 9703 18503 25011 49954 74053 66220 27856 578 -33100
15282c3100r951J8518J8107j4939J1348J7089k2962l6574K4107M292J9634K9278
15270B4847j1749k2163j1451J8753J2938j5028M4369K2346M121j4552k7763k4539
15258A29j5964L56J7341M9000J8327k7412l2867j4137j0606k1187M516J0438K2070
15245Dj8124q884J5781n485j7740J009J5160J399O112P963L678K1448M540L194
15231C0055r762o056K1924n030j8979J3289J8734j7205l4828N577K5576l1082
15219g787m5615k2489J3225K2119K1461N78Q202K677J133K6731J8311k2633j3966
15206A947Q368j3015j9967K1853J9930L2092P044l874J0240K5451j4988j3259
15194F1822n530k7060J888p887n723j8478J1309K2820k9807k8203Q235K2440K880
$$ plain form
15282 -33100 -43051 -24533 -6426 -21365 -10017 7072 -15890 -52464 -28357 -24065 -4431 24847
15270 24847 13098 -9065 -20516 -1763 11175 -3853 40516 62862 66983 52431 24668 129
15258 129 -15835 -15479 1862 50862 69189 41777 8910 -5227 -15833 -37020 -32504 -22066 4
15245 4 -18120 -27004 -11223 -16708 -34448 -33439 -18279 -16880 -10768 -2805 873 22321 26861 30055
15231 30055 20293 14237 36161 31131 12152 25441 44175 26970 -7858 -2281 23295 -7787
15219 -7787 -53402 -75891 -62666 -40547 -19086 -18508 -10306 -7629 -6496 20235 38546 15913 1947
15206 1947 10315 -2700 -22667 -814 19116 51208 58252 54378 64618 90069 75081 61822
15194 61822 56292 29232 31120 23233 17510 -968 10341 33161 3354 -24849 -16614 5826 8706
15181H706o694j7988j0017n366J7372J3864l1763k7536J3346K7113L3939R02j6671
15168g93K2644k299l2886j2654j840k0424R75K0789J9248j4787k2115K2620L0989
15155I467K8193J1096q883k3652o452J1077j2191j2905L596J5082L120K8778K6244
15142G2570j3401r962n7193j1996L5260J4995o6382k4660j2213J83P443J1464
15130e3892J5266L2922J9373j0010N42K4298M16n259k6595k3295J8344J6592m177
15117D525j8327J1377R001J1115j3543Q630l97k1821K5433J2406k626p456k6061
15104g744j6093P894J1498j2984L541Q762K6349k3722k167q051j0080K5j409M1669
15090A7488J0584l480J9849J6561m0077K2423K4715l2944j9474n444k1473j5956
$$ plain form
15181 8706 2012 -15976 -25993 -31359 -13987 -123 -31886 -59422 -46076 -18963 14976 15878 -793
15168 -793 21851 19552 -13334 -25988 -27828 -48252 -47277 -26488 -7240 -22027 -44142 -21522 9467
15155 9467 37660 48756 39873 16221 9769 20846 8655 -4250 -654 14428 17548 46326 72570
15142 72570 59169 49207 -7986 -19982 15278 30273 -36109 -60769 -72982 -72799 -65356 -53892
15130 -53892 -38626 -5704 13669 3659 4201 28499 28915 23656 -2939 -26234 -7890 8702 4525
15117 4525 -13802 -2425 6576 17691 4148 12778 12381 -9440 15993 28399 25773 18317 -7744
15104 -7744 -23837 -15943 -4445 -17429 -13888 -5126 21223 -2499 -4666 -12717 -22797 -22772 -24181 17488
15090 17488 28072 24592 44441 61002 20925 43348 68063 35119 15645 10201 -11272 -27228
15078b7228j9656m21J701M0729N555J558K238j719Q363p43K4124J2176O086j5473
15064C7290m7539M54K1965Q177p745m948l341P414J1506J291K432j0010l2167
15051a5221o250O17p316K455K4498L0397J2838M610p544j573Q052J5772n701L0036
15037H5670j2512j4293l5020j9800j3489p95J7457J5930J8957l290j7398J6922
15025C8339j0694l3711J1820J504k2566M898J2375O339n635O289J6879l2554j0767
15012a7484K2058j756O760o098J226p984n024J3581L120j0353j5009J183p926
14999b3706o381o549Q669l153J8404L0644J5949O309K0790n996k8727R559P193
14986D3005J068k4609j3877L5474J2472j6148j3105j7093L5835k7394k6384m062
$$ plain form
15078 -27228 -46884 -47305 -45604 -4875 680 2238 4476 2757 11120 10377 34501 46677 52763 37290
15064 37290 -10249 -9795 12170 20347 12602 7654 4313 11727 23233 24524 26956 16946 -15221
15051 -15221 -21471 -20854 -28170 -25715 -1217 29180 42018 46628 39084 37511 45563 61335 55634 85670
15037 85670 73158 58865 23845 4045 -9444 -10239 7218 23148 42105 38815 21417 38339
15025 38339 27645 -6066 5754 7258 -15308 -10410 1965 8304 2669 8958 25837 -6717 -17484
15012 -17484 4574 2818 9578 3480 4706 -3278 -8302 5279 8399 -1954 -16963 -15780 -23706
14999 -23706 -30087 -36636 -27967 -31120 -12716 17928 33877 40186 60976 54980 26253 35812 43005
14986 43005 44073 19464 5587 41061 53533 37385 24280 7187 43022 15628 -10756 -14818
14974a4818J9572J7256j5069o0834k9045K966L3805q338O187P194J3890J8870
14962h364o714J129k1033n594j5078Q387o439M322J7352L574J9063o81j9158j4243
14948d3477K58J3362K209J4865J9177m08N383k557O662o290j3105M267L868Q9
14934D303k321K489O699o911m675q07l670j3290j6303L2534J6763K666K091j9191
14920C77l1063K623K8572L664p163K917l628L989L91O484Q492K6M1068j5220l2336
14905I193J7509p6k3031k5401K4794J3806J6976J2260n508j6277j1250J849J755
14892A6599k1153l136j740K6761L377j2717r886l667N216K0792L3519r743k5031
14879A9191l3943l988n758j349n403J250P289K2038K6142L2488K4603j0890m9660
$$ plain form
14974 -14818 4754 22010 6941 -53893 -82938 -79972 -46167 -54505 -48318 -41124 -27234 -8364
14962 -8364 -15078 -13949 -34982 -40576 -55654 -47267 -53706 -49384 -32032 -28458 -9395 -10076 -29234 -43477
14948 -43477 -43219 -29857 -27648 -12783 6394 5986 11369 8812 15474 9184 -3921 346 4214 4303
14934 4303 1982 4471 11170 4259 -416 -1223 -4893 -18183 -34486 -1952 14811 17477 19568 377
14920 377 -30686 -28063 509 4173 -2990 -73 -3701 288 679 7163 15655 15681 56749 41529 9193
14905 9193 26702 26626 3595 -21806 2988 16794 33770 46030 40522 24245 12995 14844 16599
14892 16599 -4554 -7690 -9430 17331 20708 7991 -1895 -5562 -346 20446 53965 44222 19191
14879 19191 -14752 -18740 -24498 -25847 -31250 -30000 -22711 -673 25469 57957 82560 71670 22010
14866B2010k8336J5468J0717p52k0709J2789P552M551J2758j6054r541K6020L463
14853C9936k9201l6255k658M573Q829r542j251O70Q944j8022j9011J1518N3270
14840A1800J5577k8139j3670R483n086n064j2277Q25K6951K4564k2389l2743q934
14827c9102J9650K2571K4402k108L6998P020k1137j3202j3980r892J9204k5498
14815D926N347l226K6876Q77j097M19l578n836m1763m3424k1891K5757M2318O806
14801g489j2248n229l325M947J4622J2501J0300j246L520K2106k5991k4085q890
14788b0507K197J8383l1821O996l513L3394M718k5609O693j1113p456K457K3651
14775a530K1389j2023k7697k1500J1400M2738l831k8896k1699L0167J6217n102
$$ plain form
14866 22010 -6326 9142 19859 19107 -1602 11187 18739 23290 36048 19994 10453 36473 39936
14853 39936 10735 -25520 -28178 -23605 -14776 -24318 -25569 -24899 -15955 -33977 -52988 -41470 11800
14840 11800 27377 -762 -14432 -4949 -10035 -15099 -27376 -26551 400 24964 2575 -30168 -39102
14827 -39102 -19452 3119 27521 25413 62411 69431 48294 35092 21112 11220 30424 4926
14815 4926 10273 7047 33923 34800 33703 34122 30544 24708 -17055 -60479 -82370 -56613 -14295 -7489
14801 -7489 -19737 -24966 -28291 -23344 -8722 3779 14079 12833 16353 38459 12468 -11617 -20507
14788 -20507 -18310 73 -31748 -24752 -28265 5129 9847 -15762 -9069 -20182 -27638 -25181 -1530
14775 -1530 19859 7836 -19861 -41361 -29961 12777 8946 -19950 -41649 -11482 4735 -367
14763c67k4415m640j0646J3948J0415j8717J2708p243Q455P622o710J8145J1128
14750I683r180j0362k159k1044M4065M1502k941m4056j2992J9641q36m8901N222
14737c2358j489j801J2676J9663Q016J3808R777k0305L533P435k9640P348J3878
14724A0541j1383L2458J5069J0866M436j7720k6704J541j6535J4113m1k351k2460
14711h170Q705m9j7440K9562K2620j5633j1367l654J8144R200p521K521K9277
14698E6195l5461n3465L2907M1013l1573m562n95l975Q421k9652P078L68j1272
14685b4573m049j6170N690J855Q348J5916k1326l490J8015J7738l529j1664j7025
14672c4264K7471R734j3947p841m23J7708n450o964j0267j0233J842Q640K7266
$$ plain form
14763 -367 -24782 -29422 -40068 -26120 -15705 -34422 -21714 -28957 -20502 -12880 -19590 -1445 9683
14750 9683 503 -9859 -12018 -33062 11003 52505 49564 5508 -7484 12157 11321 -37580 -32358
14737 -32358 -33847 -35648 -22972 -3309 4707 18515 28292 7987 11520 18955 -10685 -3337 10541
14724 10541 -842 31616 46685 57551 61987 44267 17563 19104 2569 16682 16641 14290 -8170
14711 -8170 535 486 -16954 12608 35228 19595 8228 4574 22718 31918 24397 26918 56195
14698 56195 20734 -32731 176 41189 9616 5054 4459 484 8905 -20747 -13669 -13301 -24573
14685 -24573 -28622 -44792 -39102 -37247 -28899 -12983 -34309 -37799 -19784 -2046 -5575 -17239 -34264
14672 -34264 -6793 2941 -11006 -18847 -19270 -1562 -7012 -13976 -24243 -34476 -32634 -23994 3272
14659C272l502O872n472J3104J5965k1355k1948j1368k4400O025J9905J7703K2879
14646A7680N2507J5646j4465j4108m9247m667L3430L2691m08j8330j1744R543
14634D8528k1129l7772P275n007j2881R813N977j1853k852Q201j0238o085j0371
14621c8394J5322N585J1411Q43j4850k5044l2566R353L8090L3908J8093p540l3620
14608a9409j3846m45J7068K0881Q264j2270n073J302p660K5427j113n2934n183
14595d4991K9700L0455k678m0341l0258j4233j2663J2566M879M5211L0400k4850
14583a6803j465J4668J1887l0195L696N612j843j2614J2262J5658O752J4210J611
14570B3436j6537j2876K7602J277k36J2059L94k6493j6303j8254J4315J6371j7978
$$ plain form
14659 3272 -230 6642 1170 14274 30239 8884 -13064 -24432 -48832 -42807 -22902 -5199 17680
14646 17680 70187 85833 71368 57260 8013 3346 36776 69467 69059 50729 38985 48528
14634 48528 27399 -10373 -3098 -8105 -20986 -11173 -5196 -17049 -19901 -11700 -21938 -28023 -38394
14621 -38394 -23072 -17487 -6076 -5233 -20083 -45127 -77693 -68340 -30250 3658 21751 14211 -19409
14608 -19409 -33255 -33700 -16632 4249 12513 243 -4830 -3528 -11188 14239 13126 -39808 -44991
14595 -44991 -15291 15164 12486 -27855 -58113 -72346 -85009 -72443 -67564 -22353 8047 -16803
14583 -16803 -18268 -3600 8287 -21908 -18212 -12600 -14443 -27057 -14795 863 7615 21825 23436
14570 23436 6899 -5977 21625 22902 22666 34725 35119 8626 -7677 -25931 -11616 4755 -13223
14557a3223k1494l253K30J0307N103K9900K8033R94N855K0769l259N288r494j6537
14543C9219k2179J4709k7597K1194J3721k2390k4086j1840J8445o555J1560n427
14531a226k6157j6518J391J8321L0153K2810j8694K694M311k2983L9593K4852
14519E8547l3153m325J3595J4887J5364k4094l9725k0931o984q246K9885J8643
14507A3463R394j0534n651J9265N2403j7621j0001j2065j3021l415K142r038M74
14494A5795K474J0043K5607K6861k0991m0280k4128l0576j0724j5352j3042L4146
14482d0167R646Q335K1886P387R481J5895L851j9603k4787K3336r16M071J3378
14469C1793K0277R505j4736l1931k3273J7532q279J3881m695o424K0765N89k5159
$$ plain form
14557 -13223 -34717 -37970 -37740 -27433 -22330 7570 35603 36597 42452 63221 59962 65250 55756 39219
14543 39219 17040 31749 4152 25346 39067 16677 -7409 -19249 -804 -7359 4201 -1226
14531 -1226 -27383 -43901 -42510 -24189 5964 28774 10080 12774 17085 -5898 33695 58547
14519 58547 25394 21069 34664 49551 64915 40821 1096 -19835 -26819 -35065 -5180 13463
14507 13463 22857 12323 6672 25937 78340 60719 50718 38653 25632 22217 24359 15321 15795
14494 15795 18269 28312 53919 80780 59789 19509 -4619 -35195 -45919 -61271 -74313 -40167
14482 -40167 -30521 -22186 -300 7087 16568 32463 36314 16711 -8076 15260 14344 18415 31793
14469 31793 52070 61575 46839 14908 -8365 9167 888 14769 10074 3650 24415 25004 -155
14456a55L171k987K655J1171P520l1437k855o885j3385L460L0308l348k2516p580
14442c2863J6555O092j7989J4082L4843k1594k0597J6676L5091J5433m934l4421
14430F374O951j1827r047j466J4201n459q346o503k6005P665J2160K3181J2976
14417A4855j2929M872j6845l754K2385j0794q019j9532L217K7708J5061J6288
14405C2513J5485p854M638q457n5995J41L0384J0333r385k2117p944K2064K6569
14392C0375L16k6164j6165P919j3165n569J6977J3453j5295j2773O487J0070Q824
14379E290L909j0951k2341l441K0996j9786M117J850k1114k075L4528J1453J8342
14366B0777k82o070j1803j7688J3158J1981j3428K3182j384J0580j6486l6700
$$ plain form
14456 -155 3016 29 2684 13855 21375 -10062 -12917 -19802 -33187 -29727 581 -2767 -25283 -32863
14442 -32863 -16308 -10216 -28205 -14123 20720 -874 -21471 -4795 30296 45729 40795 6374
14430 6374 13325 1498 -7549 -9015 5186 -273 -8619 -15122 -41127 -33462 -21302 1879 14855
14417 14855 1926 6798 -10047 -13801 8584 -2210 -10229 -29761 -26544 1164 16225 32513
14405 32513 47998 40144 44782 36325 -19670 -19529 10855 21188 11803 -10314 -18258 3806 30375
14392 30375 30691 4527 -11638 -3719 -16884 -22453 -5476 7977 -7318 -20091 -13604 -3534 5290
14379 5290 9199 -1752 -24093 -27534 -6538 -26324 -22207 -20357 -41471 -43546 -9018 2435 20777
14366 20777 20495 14425 2622 -15066 -1908 10073 -3355 19827 18443 29023 12537 -24163
14354b4163m092j413j6329L260J6312M515J9166J5413J3419P408k529l1052J232
14341A147J947j9086p92K6450Q444m7806p330M3224J9842k2962N402n579n138
14328b237J0783Q988j4274j3582j0348L2414j59r706j8130j030j2194j4929N30
14315d3874M5779J0101m930J3348q777j1486L760m974k6450J7539K478j2651j969
14302b2106L0133L856j0790j5175r32k0532O05K2857P00k4838J0761P766K2601
14289D906O571r175K1651J2890K1923j570j4417J1564L585m657o060r741J4090
14276E1560J3999j1512k9380j131j3505N679Q180K5359l6614j1951M2956j3954
14264B9686j5493k3541K460j117p702K7270o186r74j2825m295j653l111l059N573
$$ plain form
14354 -24163 -28255 -29668 -45997 -42737 -26425 -21910 -2744 12669 26088 33496 30967 -85 1147
14341 1147 3094 -15992 -16784 9666 18110 -29696 -37026 6198 26040 3078 8480 2901 -2237
14328 -2237 8546 17534 3260 -10322 -20670 11744 11585 1879 -16251 -17281 -29475 -44404 -43874
14315 -43874 1905 12006 7076 20424 11647 161 3921 -1053 -27503 -9964 -7486 -20137 -22106
14302 -22106 8027 11883 1093 -14082 -15014 -35546 -34941 -12084 -11384 -36222 -25461 -17695 4906
14289 4906 11477 2302 23953 36843 58766 57196 42779 54343 57928 53271 47211 37470 51560
14276 51560 65559 54047 24667 23536 10031 15710 23890 49249 12635 684 43640 29686
14264 29686 14193 -9348 -6888 -8005 -15707 11563 5377 4403 -8422 -12717 -14370 -17481 -20540 -14967
14250a4967O827m841j1835J8076K8281l0494J8168K1199M0564q509j2155k6741
14238B3573J3604J5552j5107k4456j821J7428J6314M13K963M981K196P40j9805
14225C6575j8317J3209j852l526P714k1544k513J2049k8823J4913L5906j0274
14213C3517l675J6749p448k1829J6946K1643r256l2678k7989J0507Q76M52r935
14200a2120N736P814j7213M747L3704m035l5546j6871p15M2722J4919k1622j614
14187i4K0655m574N786R597l179j1292J5889p998j8405o710j1811j8531o90P765
14173b3592R671J2702J8354q9J6484R606j3310k073j4154J8863J742o773m739
14160B2692R795K3265j1238j0639R043m0788l304R41O452J694P783N1775m3473
$$ plain form
14250 -14967 -8140 -12981 -24816 -6740 21541 -8953 9215 30414 70978 62469 50314 23573
14238 23573 37177 52729 37622 13166 11345 28773 45087 45500 48463 53444 55640 56380 36575
14225 36575 18258 31467 29615 26089 33803 12259 9746 21795 -7028 7885 43791 33517
14213 33517 29842 46591 39143 17314 34260 55903 46647 13969 -14020 -3513 -2637 -2185 -12120
14200 -12120 -6384 1430 -15783 -11036 22668 18633 -16913 -33784 -34499 8223 23142 1520 -94
14187 -94 20561 15987 21773 31370 28191 16899 32788 24790 6385 -325 -12136 -30667 -31357 -23592
14173 -23592 -13921 -1219 17135 17046 33530 43136 29826 27753 13599 32462 34204 27431 22692
14160 22692 32487 55752 44514 33875 42918 2130 -1174 -233 6219 7913 15696 67471 23998
14147B3998j0802j0136j3718K6632J852j4549J1084J5703j5453o605m751N633
14135H888J9432L625j7567l0840l9762O1336K0123k3100J9440j4600k0348K0819
14123G446K8830k2355p970K6230N358k8172k2815j6480Q757M440k3495N197J8680
14110a6349J7430q27Q64J6255K6190p152n1500J776J8220J8888l139l7581R09
14097a6016N2244L032l3311k3863j2857q827J708J112J6825L7373J3058j3339
14085A7139j4617J1565P824n290j8016K2387K6093j4871k1560J7908L1583p080
14073E3065n765l778J8815j0j15M509r891k5207k809J6734j0508j7713m0666J3626
14059i713K5924j534P546J24m8060K534J5510J3558J0637K2628q023k0467p944
$$ plain form
14147 23998 13196 3060 -10658 15974 17826 3277 14361 30064 14611 8006 3255 8888
14135 8888 28320 31945 14378 -16462 -56224 5112 25235 2135 21575 6975 -13373 7446
14123 7446 36276 13921 5951 32181 37539 9367 -13448 -29928 -21171 -16731 -40226 -35029 -16349
14110 -16349 1081 254 1118 17373 43563 36411 -15089 -13313 4907 23795 20656 -16925 -16016
14097 -16016 36228 39260 5949 -17914 -30771 -39598 -37890 -36778 -19953 17420 30478 17139
14085 17139 2522 14087 21911 16621 -1395 20992 47085 32214 10654 28562 60145 53065
14073 53065 47300 43522 62337 62327 62212 66721 56830 31623 28814 45548 35040 17327 -23339 -9713
14059 -9713 16211 14677 22223 22347 -25713 -23179 -7669 5889 16526 39154 31131 10664 2720
14046B720K7412L113K008r662N156j8006P543K5285k1411l5983j9590K1497J9104
14033I186k967K490R775O074Q514k564J2519O265q117j0383J3679j0821J6965
14020E0615J4787J2581j9348p214M530p540R992K9941L8892L0490p864p037j2965
14007A29860k2039K8983K0793O881J5433P472K6872J2737l9P453O412J4951L0510
13994B86279l5052l0880J2954J3363O582j2647M133P923k1357J2172k1920l0756
13982A90794P939M384j7032Q986K0735j4808k6989n403O812k7544k1827J4769
13970A40816p531o003l1101j1865l684l8697K593O715p916K5396j0387n3105n053
13957A78J5621N678L714J5548L0795k1925j4241R146L23p942k274O752k5483j4112
$$ plain form
14046 2720 30132 33245 35253 25591 30747 12741 20284 45569 24158 -11825 -31415 -9918 9186
14033 9186 6219 8709 18484 24558 33072 30508 43027 49292 41175 30792 44471 33650 50615
14020 50615 65402 77983 58635 51421 55951 48411 58403 88344 127236 157726 149862 142825 129860
14007 129860 107821 136804 157597 164478 179911 187383 214255 226992 226953 234406 240818 255769 286279
13994 286279 251227 220347 233301 246664 253246 240599 244732 252655 231298 243470 221550 190794
13982 190794 198733 203117 186085 195071 215806 200998 174009 168606 175418 147874 126047 140816
13970 140816 133285 127282 96181 84316 80632 41935 44528 51243 43327 68723 58336 5231 178
13957 178 15799 21477 25191 40739 71534 49609 35368 44514 44837 36895 34621 41373 15890 1778
13943A778K7340j2163j3467j8754J906L0310M602J6938n724N3M061k0695p016
13930I169j3251l1790r690J7006J59J9541J3863P299j3273L686J0408m496j364
13917G267l0478K1374O3612J7987k0358l1748j9572j889J8014K893L2160J472
13905F0734j5223k3354p847j794j713L2701L291j1052O766j3768j5428J0290p589
13892A6014N710J2250k1983k1100m911O879K0228N771M19J3328J3132k0838n1502
13879b6603j8655J8973N4000K5567k5413k5830J6313K1453l6763j430p098O998
13867A512r82J9941K2322j0395l2215J7266L286M817J1810N606M668j0449m074
13854C3113k978Q009N642Q892m649k7722J1351n884J5192j2335k8169r892j2445
$$ plain form
13943 1778 29118 16955 3488 -15266 -13360 16950 21552 38490 32766 32819 36880 16185 9169
13930 9169 -4082 -35872 -45562 -28556 -28397 -8856 5007 12306 -967 2719 13127 8631 7267
13917 7267 -23211 -1837 61775 79762 59404 27656 8084 6195 24209 27102 59262 60734
13905 60734 45511 22157 14310 12516 10803 43504 46795 35743 42509 28741 13313 23603 16014
13892 16014 21724 33974 11991 -9109 -14020 -7141 13087 18858 19277 32605 45737 24899 -26603
13879 -26603 -45258 -26285 27715 53282 27869 2039 18352 39805 3042 1612 -5486 1512
13867 1512 530 20471 42793 32398 183 17449 20735 25552 37362 42968 47636 37187 33113
13854 33113 30135 38144 43786 52678 48029 20307 31658 25774 40966 28631 462 -9430 -21875
13841b1875K0038J1737K030o662o031j6775n652j8526P052O158k813J5255J7119
13828A055J9852j4934Q088O398L984J9289j061l2238j1738K6092n35L559M766
13815C2577n433K6078J7431l194r38j1363R998n499P872Q970j5359j4874J8842
13802F5108j3016R172K2420P785j9091k3718M575J1154k560o562J3819J6326L7308
13789A22720l143j9424k8965j4081k4089j9016J2879r722J7238p502j0096J4914
13777C1713q169n117k6021j5818L1876J2950K0809j427R025j97L047J4645j2410
13764E4906J644R084J1084j8089m1489N042J4282K1164j1551K5511J2468j5146
13752F8910n2558J6184L9030J2727j130l1015k8689K2369J2129K8197j5966j0743
$$ plain form
13841 -21875 -1837 9900 11930 5268 -763 -17538 -23190 -41716 -34664 -28506 -31319 -16064 1055
13828 1055 20907 5973 14061 20459 24443 43732 42671 10433 -1305 24787 24252 27811 32577
13815 32577 27144 53222 70653 67459 66521 55158 65156 59657 67529 76499 61140 46266 65108
13802 65108 52092 61264 83684 91469 72378 48660 53235 64389 61829 55267 69086 85412 122720
13789 122720 119577 100153 71188 57107 33018 14002 26881 17159 34397 26895 16799 31713
13777 31713 23544 18427 -7594 -23412 8464 21414 42223 40796 49821 49624 52671 67316 54906
13764 54906 56550 65634 76718 58629 17140 22182 36464 57628 46077 71588 84056 68910
13752 68910 16352 32536 71566 84293 83163 52148 23459 45828 57957 86154 70188 59445
13740E9445J1260K241R993k035q81K2625k3861J1059K8465K0652k1589j1215J195
13727A07354K0301K9162M558J8729J45O532O799L3414K0069L0732K4904O039J4395
13714C23133k0482k7485m8377l2828k3645k9794l4183j9532l5007j3102J6826
13703E5524K071j7743k069J204Q004p012J231K3583k1848j9039P473k9376k5713
13690b3710l905R900K4573J7406O13K027l3907L111J3735j7956J4674J1659L524
13677B1744K3272J7092n679R848j1563P813J1809j5123o4328k4742L794J3673
13665a2390K2930J5957L00J2277j2579O014J4323m850m4724j151Q798J1707q428
13652H184N810L304p509k3915J2121K9725J281o681J0011j6640j283J4850j0278
$$ plain form
13740 59445 70705 72946 82939 80904 80023 102648 78787 89846 118311 138963 117374 106159 107354
13727 107354 127655 156817 161375 180104 180249 186781 193580 226994 247063 277795 302699 308738 323133
13714 323133 302651 275166 226789 193961 170316 140522 106339 86807 51800 38698 55524
13703 55524 57595 39852 37783 38987 46991 39979 41210 64793 42945 23906 31379 2003 -23710
13690 -23710 -27615 -17715 6858 24264 24877 26904 -7003 -3892 9843 -8113 6561 18220 21744
13677 21744 45016 62108 56429 66277 54714 62527 74336 59213 -5115 -29857 -26063 -12390
13665 -12390 10540 26497 26797 39074 26495 32509 46832 41982 -2742 -3893 4905 16612 8184
13652 8184 13994 17298 9789 -14126 -2005 27720 29001 22320 32331 15691 14408 29258 18980
13639A8980o580r03L815p396K9051K7651o6k882O090M3360J4028j2344l3127l4769
13625D4908K780j5970p407K4938k520r765j8137j4538j4019j6389L1762L6435
13613D2078n742L955L444j0203p061n938J9866m015k1834j7140o21P852m914k1268
13599b1541J2360O183n063k0445n242K6913j0928m5588K4933J2664K0447M4404
13587C9097j9075q95Q44L2560m00j3652p467l8063k2533J4187L721L1252O875
13574B6451j7576P133o103n017k1389j1106j1389L1030J8739R184L5452J2965
13562F8374j7911l831j9960j2532K4041q48q501j3731j4240Q725j1971L006L9439
13549D0060J5994k9088l4915l182q704r803O84J4549j2086J3269N5524K6973k462
$$ plain form
13639 18980 12400 11497 15312 7916 36967 64618 64552 61670 67760 111120 125148 112804 79677 44908
13625 44908 47688 31718 24311 49249 46729 36964 18827 4289 -9730 -26119 5643 42078
13613 42078 36336 40291 43735 33532 26471 20533 40399 36384 14550 -2590 -3211 4641 -273 -21541
13599 -21541 -9181 -2998 -8061 -28506 -33748 -6835 -17763 -63351 -38418 -25754 -5307 39097
13587 39097 20022 19127 19971 52531 52131 38479 31012 -7051 -29584 -15397 -11676 19576 26451
13574 26451 8875 16008 9905 4888 -16501 -27607 -38996 -7966 10773 19957 55409 68374
13562 68374 50463 46632 26672 14140 38181 37333 28832 15101 861 9586 -2385 621 40060
13549 40060 56054 26966 -7949 -11131 -19835 -29638 -28954 -14405 -26491 -13222 42302 69275 66813
13536F6813J1129r512l2766k5736j0750N428M924q397j7791j0006J8847K9192
13524B1375q356r244j1332p490J2555p472j8639J6170L0749L3148P366P452j3711
13511E2571k6061k7192k6759k616L3674J5195j3504k5772m809o404J4042n107
13499b2742J6371j1199j754J3666J6440P487j1949J8090K60j5012k524k4519Q667
13486h718o717m466J0367q655J0140j3793l0177J5423J7991L130R18l097J1916
13473e738n431j1015j4891k4635j2888K674K3669K9303j4965o131K2640j2049
13461b9457J7449J8665m893J5855M967l087n208k873p440k3047j1492p384J7979
13448a9966L7647r731j4882J6061J5760o781m797q245l5737L769J919M001K7792
$$ plain form
13536 66813 77942 68430 35664 9928 -822 4606 9530 1133 -16658 -26664 -7817 21375
13524 21375 13019 3775 -7557 -15047 -2492 -9964 -28603 -12433 18316 51464 58830 66282 52571
13511 52571 26510 -682 -27441 -30057 3617 18812 5308 -20464 -25273 -31677 -17635 -22742
13499 -22742 -6371 -17570 -19324 -5658 10782 18269 6320 24410 24670 9658 7134 -17385 -8718
13486 -8718 -15435 -19901 -9534 -18189 -8049 -21842 -52019 -36596 -18605 -15475 -14557 -17654 -5738
13473 -5738 -11169 -22184 -37075 -61710 -74598 -71924 -48255 -18952 -33917 -40048 -17408 -29457
13461 -29457 -12008 6657 1764 17619 22586 19499 14291 11418 3978 -19069 -30561 -37945 -19966
13448 -19966 17681 7950 -6932 9129 24889 18108 13311 5066 -30671 -26902 -24983 -20982 6810
13435F810K9527m674j451J1666O226k2551k1443l0391l491K2124j2899J1699M6780
13422C7932J8348k3574m1383M499N613j7936k17L286K2988j222l689j9195j5069
13409b9619m702P438J9248J323r079J2257K9702J4125l1034l3340Q233Q000O102
13396a346J9610L0185M852J3117j6152j0694q813k4340m2346j3835l880J3967
13384c9675K2176K0343j0660M613L9606P533J7620n523k2025K5397j9119j796
13372C8490L916k7429J5391K9442j4202j6548k6139n982J6124K2385k3350l1288
13360a9190J3163K1560L619j9961k1659n132L5808n690m2598o948J0523J5694
13348b0811J2170K0016o773N863O035J8643K467J0996m0879m1925K843N4796J1754
$$ plain form
13435 6810 36337 31663 30212 41878 48104 25553 4110 -26281 -29772 -7648 -20547 -8848 37932
13422 37932 56280 32706 -8677 -4178 1435 -16501 -16718 -13432 9556 8334 4645 -14550 -29619
13409 -29619 -34321 -26883 -7635 -6312 -15391 -3134 26568 40693 9659 -23681 -15448 -7448 -1346
13396 -1346 18264 48449 53301 66418 50266 39572 30759 6419 -35927 -49762 -53642 -39675
13384 -39675 -17499 2844 -7816 -3203 36403 43936 61556 56033 34008 59405 40286 38490
13372 38490 42406 14977 30368 59810 45608 29060 2921 -3061 13063 35448 12098 -19190
13360 -19190 -6027 15533 19152 -809 -22468 -27600 8208 2518 -40080 -47028 -36505 -20811
13348 -20811 -8641 11375 4602 10465 16500 35143 37610 48606 7727 -34198 -31355 23441 35195
13335C5195k2906q084P992k5611j2742K7793K0615m652j765Q307l6199J5118K1421
13322B4482J5791J7646r65p861m1965k1537K7977K4572l5433o583O0476L3277
13310H9877m780l5287k6026j3556r198l38m101Q051p06J9531Q59K1200j1688j8478
13296A5360k3778K2J2303l0851k652L5745K597l1125j2170K9241N0940j101m275
13283D0256k5907l6662J7099J7481q559l5487j6389J8620K2943J3463j8046m477
13271a5665p991j852K110l468m360j2526J0805k4058j0960M8653J8893k4353J0114
13258a4658P276J424P008K7709L6j1542j1498k6036k1206J3545J8513m144l8818
13245e2391q143N0280L6O538k0137J4927K389j3558j595K292q840K22K8221M2644
$$ plain form
13335 35195 12289 4205 12197 -13414 -26156 1637 22252 17600 15835 24142 -12057 3061 24482
13322 24482 40273 57919 56954 49093 7128 -14409 13568 38140 2707 -3876 56600 89877
13310 89877 85097 49810 23784 10228 1030 692 -3409 4642 3936 23467 24326 45526 33838 15360
13296 15360 -8418 -8396 3907 -26944 -29596 6149 8746 -22379 -34549 -5308 45632 44531 40256
13283 40256 14349 -22313 -5214 12267 3708 -31779 -48168 -29548 -6605 6858 -11188 -15665
13271 -15665 -23656 -25508 -23398 -26866 -31226 -43752 -32947 -57005 -67965 -19312 -419 -24772 -14658
13258 -14658 -7382 -5958 1050 28759 28795 17253 5755 -20281 -41487 -27942 -9429 -13573 -52391
13245 -52391 -60534 -10254 -10218 -3680 -23817 -8890 -6501 -20059 -21654 -19362 -28202 -27980 241 42885
13231D2885R793j5291N136k6340k8650J6297K3363r640r69J245R00R667J3389
13218D1785l537J0884j1400k9522J3369m0467r392P436q415M621K1564k1973m7455
13205g2502M4110O246n334J8738K8503Q651k2248N27j7553J0970J9869j8360L82
13192A999O13J9718k8245l877K2982N449R645R20M899J3m209J6646j6965l8652
13178i064j9090l5085k6941R513L7406L7485R960P502N251j2072M996k125J1462
13165A9198K08l9009L098J332J4190J4390K3337j864j8554K688K619r62J1196
13152C1867j1636l4368k2301j2275j298k603J0836M119q794J6066j1661J087K1252
13139a9709K296N913J4337P159R733J2904q161k0898l1417j0179J0435j328O023
$$ plain form
13231 42885 52678 37387 42523 16183 -12467 3830 27193 17553 16584 17829 18729 28396 41785
13218 41785 38248 49132 37732 8210 21579 -18888 -28280 -20844 -29259 -24638 -3074 -25047 -72502
13205 -72502 -28392 -22146 -27480 -8742 19761 28412 6164 6691 -10862 108 19977 1617 1999
13192 1999 2612 22330 -5915 -9792 13190 18639 28284 29204 34103 34116 29907 46553 29588 -9064
13178 -9064 -28154 -63239 -90180 -80667 -43261 -5776 4184 11686 16937 4865 9861 7736 19198
13165 19198 19406 -19603 -16505 -15173 -983 13407 36744 34880 16326 19014 21633 20671 31867
13152 31867 20231 -14137 -36438 -48713 -50011 -52614 -41778 -37659 -46453 -30387 -42048 -40961 -19709
13139 -19709 -17413 -11500 2837 9996 19729 32633 24472 3574 -27843 -38022 -27587 -28915 -22892
13126b2892J9051K546K973k4591n899j636k783j6225N397M5773K7519R541n0173
13113a1399K6140O7974J7932l5246l7107j4639L215J2115r529R0J4970n028k616
13100B6872J2159O792K2156o155l506j0766m8988j4273J6820L6660p506l0767
13088e02M742l246j847l500J564R764M663J3813r188j7962J5845P937j139J7777
13074C8721l644l2145j3408j3707l232K4891O062J0200j470m610j6860k597J0178
13061a621J2942j8152k6503p453M2585K6274J5336k0188j7743l6546n239J5448
13049b0860j3243J0931K012J3975q852k2700j7101J3253K9369j3487l102K69K0568
13036h968M099Q981q226k5327n258K8714N7405Q682j6372p19N356Q308j6308k3986
$$ plain form
13126 -22892 -3841 -1295 1678 -22913 -28812 -30448 -33231 -49456 -44059 1714 29233 38774 -11399
13113 -11399 14741 82715 100647 65401 28294 13655 16870 28985 19456 19546 34516 29488 26872
13100 26872 39031 45823 67979 61824 58318 47552 -1436 -15709 1111 37771 30265 -502
13088 -502 4240 994 -853 -4353 -2789 6975 11638 25451 16263 -1699 14146 22083 20944 38721
13074 38721 35077 2932 -10476 -24183 -27415 -2524 3538 13738 12268 7658 -9202 -11799 -1621
13061 -1621 11321 -6831 -33334 -40787 1798 28072 43408 23220 5477 -31069 -36308 -20860
13049 -20860 -34103 -23172 -21160 -7185 -16037 -38737 -55838 -42585 -13216 -26703 -29805 -29536 -8968
13036 -8968 -4869 4112 -4114 -29441 -34699 -5985 51420 60102 43730 43011 48367 56675 40367 16381
13022A6381j7440N687J7103N041l95L203m722l718J0741j1937J5457m925j8721
13009A1755j4571O163m951J4562K6440l72n391J89j5502j0617n931J0339R869
12996B1982J30k8280l9226J6792l79J6682J093K3073l972j9412o154J5579K691
12983E99k0072j1214o233K6702K4965l4023l3044K1287M674j297L6664N811k6956
12970a2137k4188q559N340k529R86Q551J9961m157j1397J2580P342J6176o181
12957A788j1893j6545k0520J4113M673j6807L6120N5082L762j9796k4384Q429
12945A4022N680j5035l1860q829O451J5769J0509J1487R833k3351m2720K0684
12933b7360J8987R266J9724j0462N313j241j4325N047K7100k2501R69j3077M382
$$ plain form
13022 16381 -1059 4628 21731 26772 26377 29580 24858 21140 31881 19944 35401 30476 11755
13009 11755 -2816 3347 -1604 12958 39398 39026 33635 33824 18322 7705 1774 12113 21982
12996 21982 22112 -6168 -45394 -28602 -28981 -12299 -11206 11867 7895 -11517 -17671 -2092 599
12983 599 -19473 -30687 -36920 -10218 14747 -19276 -52320 -31033 -26359 -27656 9008 14819 -12137
12970 -12137 -36325 -44884 -39544 -42073 -41087 -32536 -12575 -16732 -28129 -15549 -8207 7969 1788
12957 1788 -10105 -26650 -47170 -33057 -28384 -45191 -9071 46011 49773 29977 5593 14022
12945 14022 19702 4667 -27193 -36022 -29571 -13802 -3293 8194 18027 -5324 -48044 -27360
12933 -27360 -8373 893 20617 10155 15468 14227 -98 4949 32049 9548 10517 -2560 1822
12920A822J2201O180L2838J5609n0843j5504J2462j773k997m549K6835k946j1547
12907A7788K0842L469k7608J8009J3387O116m382N070q587J407j883m0165k7285
12894b3822M1642K5635j1795o801J7307j410r032k965j9409m232p170J3950J1359
12881B3257P130J3367q390j5828j2011K0382j7567k5261J0353L513K0078o369
12869A2654j5061J1047l915J312j8411J564k773j600L3546M832k523j6012m0619
12856c5959l6508L4875R898J3299K0730J0619j4475K981R385P331P447j2522P048
12843B4149K954j4376n205j3526j2193P06J7800j0088o883j5461K0864O582j394
$$ plain form
12920 1822 14023 20203 53041 68650 17807 2303 14765 12992 9995 5446 32281 29335 17788
12907 17788 38630 42099 14491 32500 45887 52003 47621 52691 44104 45511 43628 3463 -23822
12894 -23822 17820 43455 31660 24859 42166 40756 31724 28759 9350 5118 -2052 11898 23257
12881 23257 30387 43754 35364 19536 7525 27907 10340 -14921 -4568 -1055 19023 12654
12869 12654 -2407 8640 4725 6037 -12374 -10810 -13583 -15183 18363 23195 20672 4660 -35959
12856 -35959 -72467 -37592 -27694 -14395 6335 16954 2479 5460 14845 22176 29623 17101 24149
12843 24149 27103 12727 7522 -6004 -18197 -17491 309 -9779 -16662 -32123 -11259 -4677 -6071
$$ [...]
##END NTUPLES=NMR SPECTRUM
##END=
