##TITLE=Analysis number 325070
Compound Code sew 01928
Project Code adrs
Chemist Name ians
##JCAMPDX= 6.0         $$ Bruker NMR JCAMP-DX V2.0
##DATA TYPE= NMR SPECTRUM
##DATA CLASS= NTUPLES
##ORIGIN= Bruker BioSpin GmbH
##OWNER= nmr
$$ XWIN-NMR		Version 3.5
$$ Fri Dec  8 13:17:48 2006 GMT Standard Time (UT+0h)  MAYBRIDGE\nmr@NMR_250MHZ
##.OBSERVE FREQUENCY= 250.131544655141
##.OBSERVE NUCLEUS= ^1H
##.ACQUISITION MODE= SIMULTANEOUS (DQD)
##.ACQUISITION SCHEME= undefined
##.AVERAGES= 16
##.DIGITISER RES= 18
##SPECTROMETER/DATA SYSTEM= dpx250
##.PULSE SEQUENCE= zg30
##.SOLVENT NAME= CDCl3
##.SHIFT REFERENCE= (INTERNAL, CDCl3, 0, 16.522)
##AUDIT TRAIL= $$ (NUMBER, WHEN, WHO, WHERE, WHAT)
$$ ##TITLE= Audit trail, XWIN-NMR		Version 3.5
$$ ##JCAMPDX= 5.01
$$ ##ORIGIN= Bruker BioSpin GmbH
$$ ##OWNER= nmr
$$ C:\u/data/dgb/nmr/ADRS/550/pdata/1/auditp.txt
$$ ##AUDIT TRAIL=  $$ (NUMBER, WHEN, WHO, WHERE, WHAT)
(   1,<2006-12-08 13:17:17.67 +000>,<MAYBRIDGE\nmr>,<NMR_250MHZ>,
      <created by zg, POWCHK disabled, PULCHK disabled
       configuration hash MD5:
       49 4B E0 1D 92 C2 6B 37 9F E6 65 BC 52 41 86 1D
       data hash MD5: 64K
       64 4D 96 25 2F 49 DB 92 33 6F B7 55 C4 64 F7 3B>)
(   2,<2006-12-08 13:17:31.59 +000>,<MAYBRIDGE\nmr>,<NMR_250MHZ>,
      <Start of raw data processing
       ef LB = 0.3 FT_mod = 6 PKNL = 1 SI = 32K 
       data hash MD5: 32K
       44 04 11 76 40 B2 FA BB 23 E7 86 BB 3A C3 66 DF>)
(   3,<2006-12-08 13:17:33.53 +000>,<MAYBRIDGE\nmr>,<NMR_250MHZ>,
      <apk 
       data hash MD5: 32K
       5B 64 01 9B C8 EF B2 E3 C6 DC 3E 66 51 91 E1 2E>)
(   4,<2006-12-08 13:17:34.39 +000>,<MAYBRIDGE\nmr>,<NMR_250MHZ>,
      <abs ABSG = 5 
       data hash MD5: 32K
       9A B6 F8 C6 3A 07 8F C3 F1 C7 98 82 C7 9B 8F 66>)
$$ ##END=
$$ 
$$ hash MD5
$$ 71 9D 87 2F D3 03 53 62 80 4C 70 18 F2 0E 76 97
##$RELAX= 
##$RELAX= 
##$RELAX= 
##$RELAX= 
##$RELAX= 
##$RELAX= 
##$RELAX= 
$$ Bruker specific parameters
$$ --------------------------
##$DU= <C:\u>
##$EXPNO= 550
##$NAME= <ADRS>
##$PROCNO= 1
##$TYPE= <nmr>
##$USER= <dgb>
##$AMP= (0..31)
100 100 100 100 100 100 100 100 100 100 100 100 100 100 100 100 100 100 
100 100 100 100 100 100 100 100 100 100 100 100 100 100 
##$AQSEQ= 0
##$AQ_mod= 3
##$AUNM= <au_zg>
##$AUTOPOS= <31 >
##$BF1= 250.13
##$BF2= 250.13
##$BF3= 250.13
##$BF4= 250.13
##$BF5= 500.13
##$BF6= 500.13
##$BF7= 500.13
##$BF8= 500.13
##$BYTORDA= 1
##$CFDGTYP= 0
##$CFRGTYP= 5
##$CHEMSTR= <none>
##$CNST= (0..31)
1 1 145 1 1 1 1 1 1 1 1 1 1 1 1 1 1 1 1 1 1 1 1 1 1 1 1 1 1 1 1 1 
##$CPDPRG= <>
##$CPDPRG1= <>
##$CPDPRG2= <>
##$CPDPRG3= <>
##$CPDPRG4= <mlev>
##$CPDPRG5= <mlev>
##$CPDPRG6= <mlev>
##$CPDPRG7= <mlev>
##$CPDPRG8= <mlev>
##$CPDPRGB= <>
##$CPDPRGT= <>
##$D= (0..31)
0 1 0 0 0 0 0 0 0 0.06 0 0 0 0 0 0 0.0002 0 0 0 0 0 0 0 0 0 0 0 0 0 0 
0 
##$DATE= 1165583836
##$DBL= (0..7)
120 120 120 120 120 120 120 120 
##$DBP= (0..7)
150 150 150 150 150 150 150 150 
##$DBP07= 0
##$DBPNAM0= <>
##$DBPNAM1= <>
##$DBPNAM2= <>
##$DBPNAM3= <>
$$ [...]
##$SUBNAM7= <"">
##$SUBNAM8= <"">
##$SUBNAM9= <"">
##$SW= 20.6930455092707
##$SWIBOX= (0..15)
0 0 3 0 0 0 0 0 0 0 0 0 0 0 0 0 
##$SW_h= 5175.983436853
##$TD= 65536
##$TD0= 1
##$TE= 295.16
##$TE2= 300
##$TE3= 300
##$TEG= 300
##$TL= (0..7)
0 120 120 120 120 120 120 120 
##$TP= (0..7)
150 150 150 150 150 150 150 150 
##$TP07= 0
##$TPNAME0= <>
##$TPNAME1= <>
##$TPNAME2= <>
##$TPNAME3= <>
##$TPNAME4= <>
##$TPNAME5= <>
##$TPNAME6= <>
##$TPNAME7= <>
##$TPOAL= (0..7)
0.5 0.5 0.5 0.5 0.5 0.5 0.5 0.5 
##$TPOFFS= (0..7)
0 0 0 0 0 0 0 0 
##$TUNHIN= 0
##$TUNHOUT= 0
##$TUNXOUT= 0
##$USERA1= <user>
##$USERA2= <user>
##$USERA3= <user>
##$USERA4= <user>
##$USERA5= <user>
##$V9= 5
##$VALIST= <valist>
##$VCLIST= <CCCCCCCCCCCCCCC>
##$VD= 0
##$VDLIST= <DDDDDDDDDDDDDDD>
##$VPLIST= <PPPPPPPPPPPPPPP>
##$VTLIST= <TTTTTTTTTTTTTTT>
##$WBST= 1024
##$WBSW= 4
##$XGAIN= (0..3)
0 0 0 0 
##$XL= 0
##$YL= 0
##$YMAX_a= 293598
##$YMIN_a= -372836
##$ZGOPTNS= <>
##$ZL1= 120
##$ZL2= 120
##$ZL3= 120
##$ZL4= 120
##$ABSF1= 16.522
##$ABSF2= -4.171173
##$ABSG= 5
##$ABSL= 3
##$ALPHA= 0
##$AQORDER= 0
##$ASSFAC= 0
##$ASSFACI= 0
##$ASSFACX= 0
##$ASSWID= 0
##$AUNMP= <proc_1d>
##$AZFE= 0.1
##$AZFW= 0.1
##$BCFW= 0
##$BC_mod= 0
##$BYTORDP= 0
##$COROFFS= 0
##$CY= 12.5
##$DATMOD= 1
##$DC= 0
##$DFILT= <>
##$DTYPP= 0
##$F1P= 14.0000005364418
##$F2P= -0.99999901652339
##$FCOR= 0.5
##$FTSIZE= 32768
##$FT_mod= 6
##$GAMMA= 0
##$GB= 0
##$INTBC= 1
##$INTSCL= 1
##$ISEN= 128
##$LB= 0.3
##$LEV0= 0
##$LPBIN= 0
##$MAXI= 10000
##$MC2= 0
##$MEAN= 0
##$ME_mod= 0
##$MI= 0
##$NCOEF= 0
##$NC_proc= -3
##$NLEV= 6
##$NOISF1= 0
##$NOISF2= 0
##$NSP= 0
##$NTH_PI= 0
##$NZP= 0
##$OFFSET= 16.522
##$PC= 1
##$PHC0= 225.482
##$PHC1= 4.332317
##$PH_mod= 1
##$PKNL= yes
##$PPARMOD= 0
##$PSCAL= 4
##$PSIGN= 0
##$REVERSE= no
##$SF= 250.13
##$SI= 32768
##$SIGF1= 0
##$SIGF2= 0
##$SINO= 400
##$SIOLD= 32768
##$SREGLST= <1H.CDCl3>
##$SSB= 0
##$STSI= 32768
##$STSR= 0
##$SW_p= 5175.98343685301
##$SYMM= 0
##$S_DEV= 0
##$TDeff= 65536
##$TDoff= 0
##$TI= <Analysis number 999999
Compound Code 99
Book Reference 9
Project Code 9>
##$TILT= no
##$TM1= 0
##$TM2= 0
##$TOPLEV= 0
##$USERP1= <user>
##$USERP2= <user>
##$USERP3= <user>
##$USERP4= <user>
##$USERP5= <user>
##$WDW= 1
##$XDIM= 32768
##$YMAX_p= 300028606
##$YMIN_p= -113911
$$ End of Bruker specific parameters
$$ ---------------------------------
##NTUPLES= NMR SPECTRUM
##VAR_NAME=  FREQUENCY,     SPECTRUM/REAL,   SPECTRUM/IMAG
##SYMBOL=    X,             R,               I
##VAR_TYPE=  INDEPENDENT,   DEPENDENT,       DEPENDENT
##VAR_FORM=  AFFN,          ASDF,            ASDF
##VAR_DIM=   32768,         32768,           32768
##UNITS=     HZ,            ARBITRARY UNITS, ARBITRARY UNITS
##FACTOR=    0.157963299565203, 1,           1
##FIRST=     4132.6476996994, 0,             0
##LAST=      -1043.33573715361, 0,           0
##MIN=       -1043.33573715361, -113911,     0
##MAX=       4132.6476996994, 300028606,     0
$$ Real data points
##PAGE= N=1
##DATA TABLE= (X++(R..R)), XYDATA
$$ [...]
28483c1544o254M0462j909P912J3878j0915j2464r383m828k5084l1327L5588M3170
28470G302P619k0514q291O66J4559J4441k9025j5703K6626k24r35J3394J1742
28457B1657j7475j6497J8349L3613l6797M634K7011L257J09k5951j7525K0099
28445A4484R141n612n766r014j6269m1214p134K6528J4790J9560J6027o180j2740
28432c399k5281k5862K9844J8788p536R195o449j2038J980L413N534r056N044
28419a5823J6901k343k7237K7407J4466J003j2845j296j1402j5829k4748L0385
28407b1361K3343J2219j727k1286n958o141j207q877M269M1553K6560K3099L528
28394F8014k4728m4384k6294j4223K3540L2958Q186N618J0812o63l5688k9929
$$ y = [-31544, -37798, 2664, 755, 8667, 22545, 11630, -834, -10217, -15045, -40129, -71456, -35868, 7302, 14921, -5593, -13884, -13218, 1341, 15782, -13243, -28946, -2320, -2544, -3479, 9915, 21657, 4182, -12315, 6034, 39647, 2850, 7484, 34495, 37752, 37861, 11910, -5615, 14484, 23625, 18013, 12247, 3233, -13036, -54250, -61384, -34856, -20066, -506, 15521, 9341, -3399, -28680, -54542, -24698, -5910, -13446, -4251, -10700, -22738, -20758, -17345, -11811, -20867, -15823, 1078, -1265, -28502, -1095, 13371, 14374, 1529, 233, -11169, -26998, -51746, -21361, 1982, 14201, 12474, -8812, -14770, -20911, -22118, -30995, -26726, 14827, 41387, 64486, 68014, 43286, -1098, -27392, -41615, -18075, 14883, 23069, 28687, 39499, 38836, 3148, -26781]
28382b6781K010J0568M0655r78k8944j6647R22L9702K3141l0528l3338j72o294
28369b6684N699P908K1771q989J403P85l0462K1253J3399j772j1136J400J0658
28356E233o955K5084N111k4768j446M844n333M929K4499Q053j0203L984p335j3348
28342A2349L220M504n916j5415j0161k396l196j7083K47L3700M0922j1808o67
28329B8300o530o329j0745l8619J7587J4328O903j665j4601j844J5917K3758L081
28316B9541j4477L0916K0535k3947j4586j285J4930Q787j3394O791M427j9658
28304B8580j0437k1391k887j8213l1954J5748K6035P254j9042j3769j4725j3819
28292f8620K6123M296J3445r20K1629J6908j9809n323M739k7577M735R64K5976
$$ y = [-26781, -24771, -14203, 26452, 25474, -3470, -20117, -19195, 20507, 43648, 13120, -20218, -20390, -26684, -20985, -13077, 8694, -295, 1108, 1893, -28569, -7316, 6083, 4311, -6825, -5425, 5233, -1722, 23362, 28473, 3705, 2259, 7103, 1770, 6699, 31198, 39251, 29048, 33032, 25697, 12349, 15569, 20073, 14157, -1258, -11419, -13815, -17011, -34094, -33847, -147, 40775, 28967, 28300, 21770, 15441, 4696, -33923, -16336, -2008, 4895, 3230, -11371, -13215, 2702, 26460, 29541, 15064, 45980, 66515, 42568, 27982, 26697, 41627, 50414, 37020, 43811, 48238, 28580, 18143, -3248, -6135, -24348, -56302, -40554, -14519, -7265, -26307, -40076, -54801, -68620, -42497, -38201, -24756, -25676, -4047, 12861, -6948, -12271, -7532, -35109, -30374, -29410, -3434]
28279c434K4743K3245j1344k5779k4284k1403l983L0516K5767n142j2519J4947
28267A1330K1106j5533j7742K7823k9806k5441r633j4294J4698K0370p310J5750
28255h682K6198r71k189k349m4639j6016P075K7102P771p576j8743j5143J8564
28242b9598M2747J0487k0928o23j1807j48J0302k685P267K72M879N909K939O086
28228B5099P106M940J3866j2103j8485j1035n030N680J0816K9352j741j0912j4668
28215B2885k9609k8657O617M496J0405O855K5461j4062k4476j4986J2147K9543
28203F619k4071N345K2189l2635j9317o46K9350J3154J4488j6357l1571J360Q972
28190b3120J3272j6638j4040k2613m203M084O460J5478O978J4440L3989M629j1536
$$ y = [-3434, 21309, 44554, 33210, 7431, -16853, -38256, -42239, -11723, 14044, 8902, -3617, 11330, 32436, 16903, -839, 26984, -2822, -28263, -37896, -52190, -37492, -17122, -24432, -8682, 17516, 16545, 14356, 12007, -32632, -48648, -41573, -14471, -6700, -14276, -33019, -48162, -29598, 13149, 23636, 2708, 2085, -9722, -9870, 432, -2253, 5014, 5286, 10165, 16074, 19013, 25099, 32205, 37145, 51011, 38908, 20423, 9388, 4358, 10038, 20854, 50206, 48465, 37553, 22885, -6724, -35381, -28764, -24268, -13863, -7008, 18453, 4391, -20085, -35071, -22924, 6619, -17452, -12107, 10082, -22553, -41870, -42516, -13166, -12, 14476, -1881, -33452, -32092, -23120, -9848, -26486, -40526, -63139, -67342, -63258, -56798, -41320, -34342, -19902, 14087, 18716, 7180]
28177G180n634K3639N864L11J5813l2610j6436j8608j4288J0690L2926n651j7999
28164a4803J6320m75m2436M572L7135l1320l9882O908K6862J1441P565N211k160
28151a5062J1761M841M588J4759K9169l822m7493J9516J5252k7267k4094l5399
28139e3251Q077N137o27J3787O0939O864m6956P321J944p421J9045N553J2326
28126C2738k1725k151K4370K0294Q438j5336l3220q914k178J6549J9613o641J4726
28113D6563j8201k0206p817m172q251P639J1747j2939J376L8002J5039n568k3953
28100A9259J3579l195k862O353l4399k1580J5149m52J328K7248Q261k3234l022
28087B433q596L1266L715r686l0680n868J1183j2751k0064q888p455K3882J5471
$$ y = [7180, 1546, 25185, 31049, 31360, 47173, 14563, -1873, -20481, -34769, -24079, 8847, 3196, -14803, 1517, 1042, -41394, -36822, 313, -31007, -70889, -63981, -37119, -25678, -18113, -12902, -15062, -3301, 1540, 6128, 20887, 50056, 46234, -1259, 18257, 33509, 6242, -17852, -53251, -45174, -40037, -40664, -26877, 34062, 40926, -6030, 1291, 3235, -4186, 14859, 20412, 32738, 11013, 8862, 33232, 53526, 61964, 46628, 13408, 4494, 2316, 18865, 38478, 31837, 46563, 28362, 8156, 339, -3833, -12084, -4445, 7302, -5637, -4261, 33741, 48780, 43212, 19259, 32838, 29643, 26781, 33134, -1265, -22845, -7696, -8148, -6820, 20428, 28689, 5455, 2433, -6163, 25103, 28818, 19132, -11548, -17416, -6233, -18984, -39048, -47936, -55391, -31509, -16038]
28074a6038l511j419j9698j961J3429L1493N22J9402r732l4206j4888K2671L0753
28061A6817J2963P694Q897L392m918j1773m919M578J3708O679k948j9126j9903
28048A1141r606m695j7985j8083J6545L3332R665k9340q436L345k1865j5711O324
28035d5369K3749M0405K680k1K3411o383r930m0292m501K1341j458J5652K1870
28022D1154k833J1593J8235j059l1986k3713J838n888k223n531Q548N167r329
28009C973j8153O865k3875K5995O489k715j8745K1532O03K042J706o116K6495
27996B6096L9639m0970m1915q470M1372P104j6575n683r88J1749k928k6021j7518
27983c5108P426N292k836J3285K4505J8184n40k2629k3137J4299p073L195N272
$$ y = [-16038, -19549, -20968, -40666, -42627, -29198, 2295, 2817, 22219, 12487, -21719, -36607, -13936, 16817, 29780, 37474, 46371, 49763, 44845, 33072, 28153, 32731, 46439, 53118, 50170, 31044, 11141, 1535, -3160, -21145, -39228, -22683, 10649, 20314, -9026, -17462, -14117, -35982, -51693, -45369, -21620, 18785, 21465, 21444, 44855, 38472, 28542, -11750, -16251, 5090, 3632, 19284, 41154, 38321, 49914, 68149, 67090, 35104, 11391, 13229, 7341, 5118, -413, 8135, 13302, 3973, -14180, -7315, -31190, -5195, 1294, -1421, -20166, 1366, 1969, 4011, 5717, -399, 26096, 65735, 24765, -17150, -25620, 15752, 22856, 6281, 598, -390, 11359, 8431, -17590, -35108, -27682, -22390, -25226, -11941, 12564, 30748, 30208, 7579, -15558, -1259, -8332, -5137, 135]
27970A35j2207o300J6390j184J3592K807p964J2855j324p010O041K7356J3656
27957E6843l1345j9972j4906l9283j6504L0062M1619j839j1615j8621j0754K2765
27945a3550k3923L22P406j2475j602M1575K5143M360j6220j7334j2835o948k232
27932b8313J6260M5297j4375m7204O732j6862n235L3640K2606p681j2493J9358
27920A1730J7210k0790j9823o239K8827K1952j3916j1035J4344J2266l854O778
27908C7450N860k5815Q489L463m980j0326R232j4351j5456O023j2444j4302J6348
27895a0809K0970r548L479j0500o360r211k177K0111n602k1511k0505k768J2710
27882d1721M3646J1294l4925L040K0752J0492N467L386j4156k3566m137j4578
$$ y = [135, -12072, -18372, -1982, -3166, 10426, 13233, 5269, 18124, 16800, 9790, 15831, 43187, 56843, 25498, 5526, -9380, -48663, -65167, -35105, 6514, 4675, -6940, -25561, -36315, -13550, -37473, -37151, -29745, -42220, -43822, -2247, 22896, 27256, 11036, -6298, -19133, -26081, -28313, -12053, 33244, 18869, -28335, -21603, -38465, -43700, -10060, 12546, 4865, -7628, 11730, 28940, 8150, -11673, -17912, 10915, 32867, 18951, 7916, 22260, 34526, 30672, 37450, 43310, 17495, 25984, 29447, 24467, 14141, 23373, 9022, -6434, -411, -12855, -27157, -10809, 10161, 613, 4092, -6408, -12768, -21979, -24156, -4045, -9647, -31158, -51663, -54431, -41721, 1925, 13219, -21706, -18666, 2086, 12578, 18045, 21431, 7275, -16291, -20428, -35006]
27870c5006K1937K258o008n596Q241k7260j4653K1613m719J8884J6952k0676J4706
27857i327L6648J0204J853J1766l8964o95M50K0234O776k1099j8921j1594p790
27844b0459l500K8813M7960J2314j5812k9982m9225Q42O749J4182o681K4809j4400
27831d390k2495k8873j3349K7884M6751K3021Q182l3855l985N738L897K5379K262
27818C6167m4654L968L512K7554j4960k4387O746k958k2902j2005M954K0042J4943
27805c980l030k3978k778J1217J8114K0668K8093P343o545r288j9058k7946q587
27792a9755K4447R180j5133k650K7874N962o495p044m784R191M453j661j4265
27779I320r919J3674k4012l7147K7027K2210j8395j2431J8554Q737j6951K4041
$$ y = [-35006, -13069, -10811, -16819, -22415, -14174, -41434, -56087, -34474, -39193, -20309, -3357, -24033, -9327, 27321, 37525, 39378, 51144, 12180, 11485, 11935, 32169, 38945, 17846, -1075, -12669, -20459, -23959, 4854, 52814, 65128, 49316, 19334, -29891, -29049, -22300, -8118, -14799, 10010, -4390, -26885, -55758, -69107, -41223, 5528, 28549, 36731, 2876, -1109, 4629, 8526, 33905, 36167, -8487, -4519, -1007, 26547, 11587, -12800, -6054, -9012, -31914, -43919, -38965, -18923, -3980, -7010, -30988, -33766, -22549, -4435, 16233, 44326, 51669, 45124, 35836, 16778, -11168, -19755, 4692, 13872, -1261, -3911, 23963, 29925, 23430, 16386, 11602, 20793, 25246, 23585, 9320, -599, 13075, -10937, -48084, -21057, 1153, -17242, -29673, -11119, -2382, -19333, 4708]
27767D708L2130j2743k0932k0512k4361p709L2214M9292J1617K0454L1997n280
27755I0875l9798k4556J7151K604o174K770k7721n594L1738K0127j5116k9831
27743A6475n856p112j7941J1977j244l320q595j478M4361O984j3201O031l205
27730B3876r273l3191N304K0591J9536k653l1590l6438l915R651K2028K8766j052
27717A1640k4408l322j361q79k444M765P843j7435l6942j2675J9694K5325J0490
27704a9709K5665N862j8378k4466K0392K5648k3794n6432r28J7357p646k614M4412
27691a4631L1169M2679J7105K9666l6733n2854n6387k0983L3087m792j9512J0645
27679d1541n89J8336L262k5380n749J7143J1684K3100k4355k3986K6069J4678
$$ y = [4708, 36838, 24095, 3163, -17349, -41710, -49419, -17205, 32087, 43704, 64158, 96155, 90875, 51077, 26521, 43672, 46276, 40102, 42872, 15151, 9557, 41295, 61422, 46306, 16475, 10619, 3507, -14434, -2457, -3701, -7021, -15616, -17094, 27267, 34251, 21050, 27081, 23876, 14603, -18588, -13284, 7307, 26843, 24190, -7400, -43838, -47753, -38102, -16074, 12692, 11640, -12768, -16090, -17451, -18330, -20774, -16009, -8166, -25601, -62543, -75218, -55524, -30199, -19709, 5956, 11818, -6560, -31026, -10634, 15014, -8780, -65212, -66140, -48783, -56429, -59043, -14631, 16538, 59217, 76322, 105988, 69255, 16401, -39986, -60969, -27882, -32674, -52186, -41541, -42130, -23794, -20532, -45912, -51661, -34518, -22834, 266, -24089, -48075, -22006, -7328]
27667g328J7846M8772O50j3744k3169m7287M515K9451N272j9436k1953J0229K4699
27654H517q124k74j836P711N094o549k4793k6347J7599K2477k1550j1522l349
27641d2946J1890N5844j1874l3686R192p110n03p311j528L940r732L9908J1862
27628A7946L8160K739j9787j4263l2781O290n010K5885j352k4554J2566k1178
27616a5339j2065M934K5702r098J4421p524j3821R857J5474J7378K0322j3407
27604C6834j0595j7958l1102J7054J4913j0982r476l5171J9473L9276l312k2042
27592a3088n683K398J5586J1372j7170o533R093J9760R869l862J3671L47j9247
27579A6513j6522p907N769q48j1909K1904K1333j9675j2062P714j3411j9046J5042
$$ y = [-7328, 10518, 59290, 59940, 46196, 23027, -24260, -19745, 9706, 14978, -4458, -26411, -16182, 8517, 393, 119, -1717, 5994, 11088, 4539, -20254, -46601, -29002, -6525, -28075, -39597, -42946, -31056, 24788, 12914, -20772, -11580, -18690, -19193, -26504, -28032, -24092, -33824, 6084, 17946, 56106, 58845, 39058, 24795, -7986, -1696, -6706, 19179, 17827, -6727, 5839, -15339, -27404, -22470, 3232, -5866, 8555, 1031, -12790, -2933, 12541, 29919, 50241, 36834, 26239, 8281, -22821, -5767, 9146, -1836, -11312, -46483, -27010, 12266, 8954, -13088, -18771, -16373, -787, 10585, -6585, -13118, -4025, 15735, 25604, 21742, 35413, 35760, 16513, -9, -7916, -2147, -2995, -14904, 7000, 28333, 8658, -3404, 4310, -9101, -28147, -13105]
27566a3105m09J5625q099j5728R685K3329M510p265l7034j0440J5438J7797j6536
27553b2232j2685j9768J3990L2393L4470Q340l6031M827L1630o811J9005K3142
27541G0270o085k6811m3097j9728N585L9244J8348m779o96K008j258n925J36l7070
27527i858j8468L5034O26P487K2651l205j2622n677J5373j4934k4850l7346k0109
27514f5898K8145L0289m105j4805l076j6144J8514J6635J5421j1028q799o045
27502b0896R126j1016L413K7381j5037q873J3344J3944o605k8093j9413J8802
27490b3923J2056L0118j34P918J2516k5079l4817K1431p70J008R864j2398j5464
27477a7674K0048K5778K4704k8281k2051q001j1545p297m1272Q482J9910J9901
$$ y = [-13105, -13514, 2111, -5988, -21716, -12031, 11298, 15808, 8543, -28491, -38931, -23493, -5696, -22232, -34917, -54685, -40695, -8302, 26168, 34508, -1523, 3304, 34934, 28123, 47128, 70270, 64185, 37374, -5723, -25451, -19866, 19378, 37726, 32947, 32251, 34259, 33001, 27076, 27212, -9858, -28326, 6708, 7334, 14821, 37472, 34267, 21645, 15968, 31341, 16407, -8443, -45789, -65898, -37753, -7464, -11569, -26374, -29450, -45594, -27080, -10445, 4976, -6052, -14851, -20896, -11770, -22786, -19373, 8008, -7029, -15902, -2558, 11386, 4781, -23312, -42725, -23923, -11867, 18251, 18117, 26035, 38551, 13472, -21345, 86, -684, 324, 10188, -2210, -17674, 2374, 28152, 52856, 24575, 2524, -5477, -17022, -24319, -65591, -57109, -37199, -17298]
27465a7298P431l7965L665J8970k430R788L104q714j6653L0552J035o553J469
27452a3599p725N996l530n492J2268M680Q133l055K6025J2568R387m5622q865
27439h831J006Q131L3506k6915k1692R436N791j5797m572N746L0258L642k3565
27426c856K9681J2323K3271j2445j0649j609j8327j5180K3106M9111P328l0642
27414E2112j9785m7656j5358L2994j4610n918R210K2467P556k9816L119J0900
27402E215K2947K6945k3710j3826O830j6038j7243k6948K1238j2984J5658N7980
27390D6064J2584j7775k9605m5056J5461J3241L179j0551P775L7822L5925l5785
27378C3279j1066P927j4731m0074r137J6981q685p58j8825J0241K7094J0085l197
$$ y = [-17298, -9867, -47832, -44167, -25197, -27627, -17839, -14735, -23449, -40102, -9550, -8515, -15068, -13599, -21324, -15328, -18858, -24350, -12082, -7402, 731, -2324, 23701, 36269, 45656, 34, -8831, -7825, 306, 33812, 6897, -14795, -5359, 432, -15365, -19937, -14191, 16067, 19709, -3856, 25825, 38148, 61419, 48974, 38325, 36716, 18389, 3209, 26315, 75426, 82754, 52112, 32327, -15329, -30687, 2307, -12303, -18221, -9011, 13456, 21012, -8804, -5685, 5215, 28162, 55107, 31397, 17571, 24401, 8363, -8880, -35828, -14590, -27574, -11916, 46064, 58648, 40873, 11268, -33788, -18327, -5086, -1907, -12458, -4683, 33139, 69064, 33279, 22213, 30140, 15409, -24665, -33802, -16821, -25506, -26264, -45089, -34848, -7754, 2331, -866]
27365h66J604J7652k611K5720R335l4343j8682M747J1389j7068l2679l67K3725
27352a2444K7151n190j6410K468j6933j1832r347J2649J6080R794R664N297N669
27339A6616n554l904N897m061m5195k2493j1651k596P973J6831Q770J4247j0115
27326c5235j7963J7509R654J4005O178L634j4565M683m054N100K5474K1160l480
27313C2100r286l900j0650k6002l6942K3666L9609K2979n721j0516j8013N029
27301B353J7109M014J523m0307r053K4119J767j4364J3687j3446n212J9249J1383
27288A2822j2435k4321k4389l1330K2486K3123O621J4590K1618m062R215M3209
27276E7147j6625j5847n328L1183j3240M77j8333n752q842J0817P211J39K839
$$ y = [-866, 738, 18390, 15779, 41499, 50834, 16491, -2191, 2556, 13945, -3123, -35802, -36169, -12444, 14707, 9517, -6893, -4425, -21358, -33190, -42537, -29888, -13808, -4014, 5650, 10947, 16616, 11062, 7158, 13055, 8994, -36201, -58694, -70345, -72941, -64968, -48137, -39367, -25120, -35235, -53198, -35689, -26035, -12030, -5852, -2218, -16783, -12100, -16154, -11054, 14420, 35580, 32100, 22814, 18914, 8264, -17738, -54680, -31014, 8595, 31574, 25853, 15337, -2676, 2353, 19462, 23476, 24999, -15308, -24361, -242, 1525, -12839, 848, -12598, -17810, 1439, 12822, 387, -23934, -48323, -79653, -57167, -34044, -27423, -12833, 8785, 4723, 13938, 57147, 40522, 24675, 19347, 50530, 37290, 37767, 19434, 13682, 4840, 15657, 22868, 23007, 25846]
27263B5846J9689n489m0326j8964P16M128M0724L8245k1750p990l0899o458o799
27250i327J3635O322K481j3684k2342j4227j034K2573n596j7342J2823l629K7694
27237a653K6355m4j8102k5091j6964L5519L0398l413k7470K7l3162k0629L1635
27224b2594r39J2530J0689J7678Q888K216k3275j1608j3364K237M953J8830q795
27211b554l8127J7648R921N409J2237j1667Q782K5680k6294j2068J292J4965n08
27198D716q176j0779J9914o427k7715J7133J4936J1105K1423J0581K268k8947
27186B0032k0662k3549J7752o332J6947P298L224j8601j9665o609J7573J4624
27174B032J4999k923j0702J0101P433q854q278J1067J1880p12J620k1216q425
$$ y = [25846, 45535, 40046, -280, -19244, -18528, -14400, 26324, 64569, 42819, 34829, 3930, -2528, -9327, 4308, 10630, 13111, -573, -22915, -37142, -38176, -15603, -21199, -38541, -25718, -29347, -1653, 24702, 24658, 6556, -18535, -35499, 20, 30418, 27005, -465, -438, -33600, -54229, -22594, -23533, -11003, -314, 17364, 26252, 28468, 5193, -6415, -19779, -17542, -12589, 6241, -2554, -40681, -23033, -13112, -7703, 4534, -7133, 1649, 27329, 1035, -11033, -9741, 5224, 4716, -3460, -14239, 5675, -752, -28467, -11334, 3602, 14707, 36130, 46711, 48979, 20032, -630, -24179, -6427, -12759, 4188, 11486, 14710, -3891, -23556, -30165, -12592, 2032, 17031, 14108, 3406, 13507, 20940, 12086, 3808, 14875, 26755, 26043, 27663, 6447, -1978]
27161a978J3616J4327K8100j9243m0626m9162k5629K8914K1145Q307J5903K7533
27149B1207j1916l9010L291K415K1701Q211j0542j3062k6404J8445j768J6661
27137a0771L7772K1713Q938P322k7326n3136q616R193J8737K6428O52r721l638
27124A7547k2208K4873J7618K0106L12l9657k9269J730k0722k5088N780M0321
27112h657J8400j0777j7039J0841k3602k6234J3530j0636K523J1972J7130J2966
27100i583K7089M81q690l0854K0788J7798r318q874k5818j1157J2475J1894j5386
27087b9155j6617L2875R899q290J0661K1952K295M480l713l4591J588J6372K1396
27074B9152N632l458N1572J4578j6871k5448q710j1737o0445m4508j6842L8394
$$ y = [-1978, 11638, 25965, 54065, 34822, -5804, -54966, -80595, -51681, -30536, -22229, -6326, 21207, 9291, -29719, -26428, -24013, -2312, 5899, -4643, -17705, -44109, -25664, -27432, -10771, 27001, 48714, 57652, 64974, 37648, -15488, -24104, -14911, 3826, 30254, 30906, 21185, 17547, -4661, 20212, 37830, 57936, 58248, 18591, -10678, -8948, -29670, -54758, -48978, -8657, 9743, -1034, -18073, -7232, -30834, -57068, -43538, -54174, -51651, -39679, -22549, -9583, 17506, 17987, 9297, -21557, -769, 17029, 7711, -1163, -26981, -38138, -25663, -13769, -29155, -45772, -12897, -2998, -11288, -627, 21325, 23620, 28100, 24387, -10204, -8616, 7756, 29152, 34784, 31326, 82898, 97476, 80605, 55157, 46447, 34710, -25735, -70243, -87085, -48691]
27062d8691J4947L2407L3584r044O316m8195k7691M13J5815n552K605L0363K1987
27049A9264n796J5195j1467k7465m664P814J1679P064j3339l3174l4616J9069
27037e0436L2520J4589m606j676J4390J7484r482k7391o510J923j620Q11l9072
27024e9076j23M1992k157M520L4982K2927L791n051j5488Lj3649q398J9506L9822
27010F3601O0593k0385l6070l1308k8874J4587M0892j7472m8053q787K271J8326
26998I321K3850q450k227j7134k8200j4127j7990K154M1688M3333M3j5736j2866
26985C659j1059o383j8020J6383J682M8388L1242m1110m0320O108K8330q609k1434
26972a1143M2r47J858m362j6267l996k4595k0079L7792M0537J8875J6914m857
$$ y = [-48691, -33744, -1337, 32247, 23203, 29519, -18676, -46367, -45954, -30139, -35691, -33086, -2723, 19264, 13468, 28663, 17196, -10269, -14933, -7119, 4560, 11624, -1715, -34889, -69505, -50436, -17916, -3327, -7933, -9609, 4781, 22265, 12783, -14608, -21118, -19195, -20815, -20004, -59076, -59199, -17207, -19364, -14844, 20138, 43065, 46856, 41805, 26317, 26320, 12671, 4273, 23779, 63601, 124194, 103809, 67739, 36431, 7557, 22144, 63036, 45564, -2489, -11276, -9005, 9321, 33171, 24721, 22494, 5360, -22840, -36967, -54957, -52803, -11115, 32218, 32261, 16525, 3659, -7400, -13783, -31803, -15420, -13738, 34650, 65892, 24782, -15538, -9430, 18900, 10291, -11143, -11101, -12048, -10190, -14552, -30819, -34815, -59410, -79489, -41697, -1160, 17715, 34629, 29772]
26959B9772n949j6379j1774J0598R911k9327j1391R101l258k8854o492M435L7990
26946a1617K9922J6887k438K779N203q175l707J859O848P274j0934j0326k5434
26933a859J7241P0406Q577j8295k5616j4672R603o928J3729j7996j6782p290R638
26920A9756N478Q652N352O086j3351o949k2258J055L8350k1378j7778L4408J4830
26907E2253l7819l6015j2166J2593J6515l784j4067K8786O911J198J5215R371
26895C8991k8999l0448L892k083k1591j8733J7922J3184q87J8755L2785J9458
26883D2246j0361l6461J6113O962Q302k0501j9301k43J6533k8918j3725O880L1012
26870a462L5731j4852m2238O955P520J0870j2125m351K9293J2230Q943k3951K712
$$ y = [29772, 23823, 7444, -4330, 6268, 16179, -13148, -24539, -15438, -18696, -47550, -54042, -49607, -11617, 18305, 35192, 32754, 35533, 40736, 32561, 28854, 30713, 37561, 44835, 33901, 23575, -1859, 15382, 85788, 94365, 76070, 50454, 35782, 45385, 38457, 52186, 34190, 17408, 10118, 19756, 25234, 33886, 39238, 45324, 31973, 25024, 2766, 3821, 42171, 20793, 3015, 37423, 52253, 14434, -21581, -33747, -21154, -4639, -8423, -22490, 6296, 13207, 14405, 29620, 38991, 9992, -20456, -16564, -18647, -40238, -58971, -41049, -27865, -28752, -9997, 22788, 42246, 31885, -4576, 11537, 18499, 26801, 6300, -13001, -13244, 3289, -25629, -39354, -32474, -1462, 34269, 19417, -22821, -15866, -8346, 2524, -9601, -13952, 15341, 27571, 36514, 12563, 15275]
26857A5275J1119j5845o434n741k7745k9305k3940J3330K2104M8701L0474k6985
26845E008l2162n129K6720L0829K9847p023k0780k7883q624l216n26J2064J6522
26832A5647q919m5522j2038J7547Q380J3771K8938J4049K2229j8739k4439j4797
26820c893P32K431K2545J4510r226K869j0756L1277P283k0156j1889k1368j5878
26807a1519P323M471J0144J7630J1278Q562j5833l1216m14m420J9270N12j7445
26794a657l3988J7632n62K1868O352J0133J9703J4177q913k0317k0270l283j7534
26781a6659m113L0965J9306M935k4816l5627q156J404j5343M938k5407j3632K3424
26768e8781K1841J6269P544p466K893L8322N2361o921j4259K6148K499k0828j0232
$$ y = [15275, 26394, 10549, 4115, -1626, -29371, -58676, -82616, -69286, -47182, 1519, 31993, 5008, -27154, -32283, -5563, 25266, 55113, 48090, 27310, -573, -9197, -12413, -12939, -875, 15647, 6728, -38794, -50832, -33285, -24905, -11134, 17804, 31853, 54082, 35343, 10904, -3893, -3161, -730, 21815, 36325, 27099, 29968, 19212, 50489, 57772, 37616, 25727, 4359, -11519, -4196, 275, 10419, 28049, 39327, 47889, 32056, 840, 426, -3994, 15276, 15788, -1657, -35645, -18013, -18575, 3293, 9645, 19778, 39481, 53658, 44745, 24428, 4158, 875, -16659, -20772, 10193, 29499, 34434, 9618, -26009, -34165, -32761, -48104, -43166, -68573, -82205, -58781, -36940, -20671, -13127, -20593, -17700, 20622, 72983, 66062, 51803, 77951, 80450, 59622, 49390]
26755D9390j0437k0063R414j1887j2764j2802j443K6443q89k9470j2287J6388
26743a0407K1423L4384J99k6386P236K8901J2455j0949m959j1329j8365j6355
26731E848n016n870K7478L412J3557J2644m469m8891l8514Q950L1878L368n455
26718a080K9466J6842j2754k5320k6291N71J5029J3563P88j5039J4660Q338j2307
26705F466K0706J1216k362p11j2890k1275N387K992J1004j2819j8213M011N785
26692g03K8191K2939l1987k8008K3655J245j1157q365k0034m564J4436L2712K3719
26679D2079j2797j8829k9612M645J1453L1865J0281k0240k0536k1770J9420M0429
26667C6388r041l9293n096j528q621j2706K4475K4300k0112l5681j7474j2121
$$ y = [49390, 38953, 18890, 28304, 16417, 3653, -9149, -10592, 15851, 14962, -14508, -26795, -10407, 11016, 45400, 45599, 19213, 26449, 55350, 67805, 56856, 51897, 40568, 22203, 5848, 832, -5038, 22440, 25852, 39409, 52053, 47584, -1307, -39821, -30871, 1007, 4375, -1080, 28386, 45228, 32474, 7154, -19137, -18566, -3537, 10026, 10814, -4225, 10435, 18773, 6466, 27172, 38388, 36026, 35315, 22425, 1150, 6537, 9529, 20533, 7714, -10499, -6488, -703, 27488, 50427, 18440, -9568, 14087, 15332, 4175, -4190, -24224, -28788, -14352, 18360, 42079, 29282, 10453, -19159, -14514, -3061, 28804, 39085, 18845, -1691, -23461, -4041, 36388, 27347, -11946, -17042, -18570, -27191, -39897, -15422, 8878, -11234, -46915, -64389, -76510]
26655g6510K2437j6245j612L7468O279k735R703q408m2078K608L1898J2475R694
26642a5026J55K951j0169r039J5193J1862j081N73j8638M977J2908l707n338J8995
26628D616J1562J4028K208K2626J6598n4900l5872q131J3095K3513J5966j6395
26616H914r546L756K261J8695K0392J1662j0231k6388o793l3801j3758J7716J8826
26603A705m299k3196Q006o255n782L581N943P705L9527j4220l2998R447M0661
26590B9825L449j252j3752l922J5349j529q595p898K248k0250j4108r364J558
26577b8241K1792J571M7453L1734l0075j6272J3539J9288l4820k4476j5313J2364
26565a456Q988j1433j4104o478p643K7936M5275L44k6315m4350l0787J0950K2038
$$ y = [-76510, -54073, -70318, -71930, -34462, -28183, -30918, -21215, -29623, -71701, -69093, -37195, -24720, -15026, -14871, -11920, -22089, -31128, -15935, -4073, -5154, -4581, -23219, -18242, -5334, -9041, -14379, 4616, 16178, 30206, 32414, 55040, 71638, 16738, -19134, -27265, -14170, 9343, 25309, 8914, -632, 3124, 5385, 24080, 44472, 56134, 45903, 19515, 12722, -21079, -34837, -17121, 1705, -2594, -25790, -17784, -24039, -29821, -26240, -20297, -12592, 26935, 12715, -20283, -10836, 29825, 33274, 32022, 18270, 14348, 29697, 28168, 19573, 11675, 13923, -6327, -20435, -29799, -28241, -6449, -4878, 42575, 74309, 44234, 27962, 41501, 60789, 25969, 1493, -13820, -1456, 7532, -3901, -18005, -24483, -32126, -4190, 41085, 41429, 15114, -29236, -60023, -49073, -27035]
26552b7035J3340J5369J0228J5580j0480n313l233J7623J1354m400n7880k9615
26540e4462J7607o731N174J2522o042j6801J0775k593M856j0997k4258Q160K9018
26527c3772J8899M3409J8603l5551l7331k1420K9593K424n267J1889J2211K2461
26515B6148o173j6858j692M071M696M606j445Q443P446J9072k2688k2189K18J3870
26501A7525R247p28k563k4270k5112j3090L4786P451l019N502j3378p880j8068
26488c3597J6507J3342k686L985j528J6866j4854m4137j204J2568J7494k6008
26476d3252j2268K0341K1732J2960L4250k7300l6107j0937J8177N677J159j6596
26464c2164k0856L3500L7188J9060R647p230k3977r475L7040J8846j7437k1506
$$ y = [-27035, -13695, 1674, 11902, 27482, 17002, 11689, 8456, 26079, 37433, 33033, -24847, -54462, -36855, -43586, -38412, -25890, -31932, -48733, -37958, -40551, -35695, -46692, -70950, -62790, -33772, -14873, 28536, 47139, 11588, -25743, -47163, -17570, -15146, -20413, -8524, 3687, 26148, 19975, 3117, 1425, 5496, 10192, 14798, 13353, 21796, 29242, 48314, 25626, 3437, 3655, 17525, 26772, 26044, 23481, -789, -25901, -38991, -4205, 3246, 227, 5729, -7649, -15529, -33597, -17090, -3748, -6434, -2449, -3977, 12889, -1965, -46102, -47306, -34738, -17244, -43252, -55520, -35179, -13447, -487, 33763, 6463, -29644, -40581, -22404, -16727, -15568, -32164, -53020, -19520, 17668, 36728, 46375, 39145, 15168, 5693, 42733, 61579, 44142, 22636]
26452B2636l6174J872J3850l0197j5728l276J1660n222L559K8660m362J9705J1956
26439A8939P730k0313l0610p258N623J2124J6629L18K3660J0997r249n321L745
26426B7014j1237j5828K071R81J72m69l5002j6665K2743O667l8479p448J3889
26413e1591K3649k4620K105K4659k355K8927J4358o532j195p792P095j608K645
26400G745J2571K2766r166k1573j3566K2855r214l8442k2639P648J8642J2753
26388i620K0990K1026k9081o323N891L88r873q525K1164J4292k1413k7612j9488
26375d8184J3548J9937L5640J5231n782j8389m109l475J1846n821K0936j2661
26363A8717J2943l7166j4674Q183m321M412J7904J7793J7348r62j5869n681j7904
$$ y = [22636, -13538, -11666, 2184, -28013, -43741, -47017, -35357, -40579, -37020, -8360, -12722, 6983, 18939, 26669, 6356, -24254, -31512, -25889, -13765, 2864, 3182, 26842, 37839, 28590, 23269, 27014, 15777, -51, 2020, 3001, 3173, 2704, -32298, -48963, -26220, -19553, -58032, -65480, -51591, -27942, -52562, -50457, -25798, -28153, 774, 15132, 8600, 7405, -387, 6708, 5100, 7745, 20316, 43082, 33916, 12343, -1223, 21632, 12418, -26024, -48663, -41015, -22373, -9620, 11370, 32396, 3315, -3008, 2883, 3271, -6602, -15127, 6037, 20329, -1084, -28696, -48184, -34636, -14699, 20941, 36172, 30390, 12001, 7892, 4417, 16263, 10442, 31378, 18717, 31660, -5506, -20180, -11997, -16318, -11906, 5998, 23791, 41139, 40177, 24308, 18627, 723]
26350G23j3595q125K7731K2602j5795k4006M1973j3349n3298j6935L006o177J3401
26337d1844L1951j3252o04r694O761K1156j234j4452r262L0794J7807n952J7785
26324B9960l661o849L825k7179k6358R581M0037J6314j0543j5967K6739P396j4964
26311B8331M405K6970j8876r384k6244j9550K9533J6409k9037j2898r003k2810
26299d2154K0055P412r51p735j0314J3600J9708K9059r99k5673p120l399l0293
26286c8804R001L6148N1861m384M258R691N409q04n5715j8882R520j7603M429
26273e875J2469r092O597L0368R40m3454j0286N957l334L9213K6269j538l7477
26260A0757j9964j5222o70k216m209j9569M29J9073L0481L9114n067p25J5114
$$ y = [723, -12872, -20997, 6734, 29336, 13541, -10465, 31508, 18159, -35139, -52074, -49068, -55245, -41844, -9893, -23145, -23749, -33443, -26682, -5526, -6760, -21212, -30474, 320, 18127, 12175, 29960, 26299, 19450, 23275, -3904, -30262, -20681, 19356, 35670, 25127, 9160, 35899, 43295, 28331, 32736, 59706, 40830, 31446, 5202, -14348, 15185, 31594, 2557, -10341, -19344, -42154, -22099, -14687, -15638, -23373, -33687, -20087, -379, 28680, 27681, 2008, -5112, -8511, -38804, -29803, 6345, 58206, 53822, 58080, 67771, 73180, 72376, 16661, -2221, 7299, -10304, -5875, 6594, -2498, 4099, 34467, 35407, -8047, -18333, -12376, -15710, 23503, 49772, 48234, 10757, -9207, -24429, -25099, -27315, -31524, -51093, -50664, -31591, -1110, 38004, 32937, 32212, 47326]
26247D7326m2857k7705M3938J5345j0311k5187j6843j3091m009K9622L7242q298
26235B5172K5661M972k3190L668k065q992R882K692J774k412L969j1985l056r055
26221A7035K167J2976L361K852Q158r900k9852j81q777q162Q267k2244J8955j7425
26207b2770k3627n242M8456K7149q766L682r805k2208j4510m866R676M5396j1173
26194A1392j0269j4751m39M8744J7851K2412J5015l1867r314l195l061l1831J3234
26181B3921l752l592n5446j5069K6068O3007K7753J810l3353q807m786N792M362
26168B7908k072K081o934k9048j6564K5680j6772k7391j400R385j4453l563J1692
26155d1451M1075l173r339l3691J336P784J4150k606K1172P098M28j9331J275
$$ y = [47326, 4469, -23236, 20702, 36047, 25736, 549, -16294, -29385, -33394, -3772, 33470, 25172, 50833, 55805, 32615, 36283, 34218, 25226, 35108, 37800, 39574, 37162, 41131, 29146, 26090, 17035, 19202, 32178, 35539, 38391, 46549, 36649, 6797, 6616, -2161, -10323, -2056, -24300, -5345, -22770, -46397, -51639, -3183, 23966, 15200, 18882, 9077, -13131, -27641, -32507, -22831, 22565, 11392, 1123, -13628, -14067, 34677, 52528, 74940, 89955, 58088, 48774, 45579, 42518, 10687, 23921, 20169, 16577, -38869, -53938, -27870, 35137, 62890, 64700, 31347, 22540, 17754, 23546, 27908, 25836, 27917, 20983, -8065, -24629, 1051, -15721, -43112, -44512, -35127, -49580, -53143, -41451, -376, -3549, -12888, -46579, -45243, -37459, -23309, -25915, -4743, 2355, 2783, -16548, -15273]
26142a5273P001k41q408R686M730j972P060j9369j743M0130K4842l0094j9367
26129c018R123L4395J3210j4871j5271j9045q064j2886j9926J1576R775J2592
26117b410Q841j1099K3127o995j9502N730j6655O945J5458r719l8588L255L0886
26104a0726N020p156K6218R386l938m61L226k5646q583J4357N788J104K3354Q791
26090D0734r689M075L3256M728k4769k3974j9041K2008M674k4872O390K9784m399
26077C8905l7088M98J4554Q927P093P42R968j9879m214j9813J582k192j8532k3978
26063d3427M4225M5389N765o557n8163q466J7013R986o535R593m911j1603j0168
26050a7859k160j760P242J7996m335L268j2581K7543o854j5800M557n808N826
$$ y = [-15273, -8272, -8513, -16921, -7235, -2505, -4477, 2583, -16786, -18529, 21601, 46443, 16349, -3018, 6105, 40500, 53710, 38839, 23568, 4523, -3541, -16427, -36353, -24777, -15002, -2410, 6431, -4668, 18459, 11464, -8038, -2308, -18963, -12018, 3440, -6279, -44867, -41612, -10726, -5706, -12862, 13356, 22742, 18804, 18343, 21569, -4077, -12660, 1697, 7485, 8589, 31943, 40734, 31045, 35120, 68376, 73104, 48335, 24361, 5320, 27328, 32002, 7130, 13520, 43304, 38905, 1817, 2315, 16869, 25796, 32889, 33631, 43599, 23720, 19506, -307, 1275, -917, -19449, -43427, 798, 46187, 51952, 45395, -12768, -21234, -4221, 5765, -770, 8823, 3912, -7691, -17859, -20019, -21779, -14537, 3459, -876, 2392, -10189, 17354, 10500, -5300, -743, -6551, -725]
26037g25K3559j0475L1220K2234l4199j9597P418r043L916P14q537j2351j0491
26024a6357k5032M952L9416N56k3249o098Q133k998j9894J0314L5855K6544j4772
26011A7370m638N799p42l796n203k3217r867K4100j0473j6773L1168j5837r720
25998b1829K1304n218k2577P5J2905L1891K1728J5557k0147m0816k8650q963K1561
25985b3179L021q910R040L4955j2529l1482J1255K0175j7569K9680m898q294L2051
25972C3316L816q562l3897j7512j1114K6477K9958R330J7090j3428k6751q241
25960D82l242M041J8434Q4l2428j9384K0729L7205J1405r770l7258J2104O895
25947I297m657R410j5094m336n979r790K5520m192j3152K28n257l599L087N618
$$ y = [-725, 22834, 12359, 43579, 65813, 31614, 12017, 19435, 10392, 14308, 15022, 6485, -5866, -16357, -41389, -36437, 2979, 3535, -19714, -25812, -17679, -20677, -40571, -30257, 5598, 32142, 17370, 12732, 18531, 17789, 13993, 8790, -14427, -24294, -194, -10667, -27440, 3728, -12109, -21829, -525, -5743, -28320, -28245, -15340, 16551, 38279, 53836, 33689, -7127, -35777, -44740, -23179, -20158, -29068, -20028, 14927, 2398, -29084, -17829, 2346, -15223, 14457, 9559, 1265, 33316, 37132, 28570, -5327, -22839, -33953, -7476, 22482, 31812, 48902, 35474, 8723, 482, -2760, 1281, 19715, 19799, -12629, -32013, -11284, 25921, 37326, 27556, -9702, 2402, 9297, 4640, 14050, -1044, -5380, -11359, -21149, 4371, 179, -12973, -12745, -18002, -21601, -18514, -12896]
25933a2896J4507L9755J6203j0636k0340l5203k0145l0126l733L8018K1697J8598
25921A5699K8205Q269r205k7469l0820k0795j4269M8771L1404n136m4419l3225
25909e2990n942p69N187K5853K8953j0153M600j7063j9608j4976K1540K1517k6181
25896d0032k3086J1624L2190l693N825j9237Q23K700L0866K0418j4793J1901K7044
25883D2550k2450K06m806m4260l2332R744L2438Q213k118J0176K1746l133j648
25870A4326J276m532m988j209J693l846R085O875R338J0767j6539j2630p469l3505
25856c1358J4473L085L1498J7064j3468J1611q87r835j055p772o607k4034P361
25843i924j2930M233J246K5109R804J83r917m584j339J371M317N963k746j3154
$$ y = [-12896, 1611, 41366, 57569, 46933, 26593, -8610, -28755, -58881, -62614, -24596, -2899, 15699, 43904, 52173, 42968, 15499, -15321, -36116, -50385, -1614, 29790, 24654, -19765, -52990, -58932, -59701, -54514, -28661, 292, -9861, -5261, -22324, -41932, -56908, -35368, -13851, -40032, -63118, -51494, -19304, -22997, -17172, -36409, -35586, -32886, -2020, 18398, 3605, 15506, 42550, 20100, 20306, 15500, -28760, -61092, -51348, -18910, -10697, -12815, -2639, 19107, 15974, 14326, 15602, 11070, 6082, 4873, 6566, 2720, 11805, 18680, 28018, 38785, 22246, 9616, 2147, -31358, -16885, -13800, 17698, 34762, 21294, 32905, 32018, 22183, 21128, 13356, 6749, -17285, -9924, -22854, -18621, -17375, 7734, 17538, 17721, 7804, 3220, 1881, 3252, 7569, 13532, 10786, -2368]
25829b368P995J6466K0552K544j3202j9741L230L683J5372j2043l1967j1579R915
25816a1143L098j9008Q352K1156J5358l057l782K285J9233k373k3833O927P620
25803B0833k3315j0029K281K2639q962J2352p71O99k1705n0228P67M047L2344
25790a9048K7795Q90k703j8265L4350R652l2916j1509j401K1180j7031q177k760
25777a9943j1157J0320K3255K693J784O135j4397q216P750K9375m565l1455j2397
25764b0818J13k2182n332j0198L804m882R906K3984J2043j5203j2807R685j368
25751c3255K5690L9585Q719k3317j2887K0277P091j9982j3123j3322j1470k619
25739b8613J5370p713k97j0785l179J3286m086k8612j1388K2014J8242o706j8531
$$ y = [-2368, 5627, 22093, 42645, 45189, 31987, 12246, 15476, 19159, 34531, 22488, -9479, -21058, -11143, -8045, -27053, -18701, 2455, 17813, 14756, 10974, 13259, 32492, 30119, 6286, 13213, 20833, -2482, -12511, -10230, 12409, 3447, 15799, 15028, 15727, -5978, -56206, -55439, -51392, -19048, 8747, 9637, 6934, -11331, 23019, 32671, -245, -11754, -13155, 8025, -9006, -17183, -19943, -31100, -20780, 2475, 5168, 6952, 13087, -1310, -9526, -1776, 27599, 23034, -8421, -20818, -20705, -42887, -48219, -58417, -54613, -59495, -49589, -25605, -13562, -28765, -41572, -31887, -33255, -7565, 32020, 40739, 17422, 4535, 24812, 31903, 11921, -1202, -14524, -25994, -28613, -13243, -20956, -21253, -32038, -35217, -21931, -26017, -54629, -66017, -44003, -25761, -32467, -50998]
25726e0998j0652j9104J7475J4943P492O429J4332k870J0126L5743Q740n464M187
25713C0379K3389j132n0113k7549L8129J9883k519k5177J1582K1772J9937P369
25701F5950P41J155l6597k1051O319R06l192j4052M040K3010O197J246J9127j6882
25687C6917n09p958j3057o036l0515l5783j5203L473L5971K6726K6993R209k1862
25674H366j7152j771J6607q741L4711j5543k9710k1629k0066L4183K8655L733
25662A1643M6314K4219k7324j2322k029l3060k0292l418m561L0253R488M257Q479
25649C1647J4642j5715k7849L741K4785J9241J1956k439j3859k8268J9067j0820
25637B6129k7810j1248O407J5125q730L384J0423N267r008m5794l5791R462N0695
$$ y = [-50998, -61650, -80754, -63279, -48336, -40844, -34415, -20083, -22953, -12827, 22916, 31656, 26192, 30379, 53768, 52636, 2523, -25026, 13103, 32986, 30467, 5290, 16872, 38644, 58581, 65950, 66691, 67846, 31249, 10198, 16517, 17423, 14231, 179, 4219, 27229, 33426, 34672, 53799, 36917, 36408, 28450, 15393, 9357, -21158, -56941, -72144, -68671, -32700, -5974, 21019, 30228, 8366, -8786, -10557, 6050, -2691, 32020, 16477, -13233, -34862, -54928, -20745, 7910, 11643, 57957, 82176, 54852, 42530, 40501, 7441, -12851, -16269, -20830, 9423, 18911, 23168, 31647, 46289, 30574, 2725, 6466, 31251, 50492, 62448, 60009, 46150, 17882, 36949, 26129, -1681, -12929, -6522, 8603, -127, 3257, 13680, 18947, 9939, -35855, -71646, -62184, -11489]
25624a1489K6233l742j381K5746l746P611R251j3551K870j4798j392J7792R485
25611D8889p396P917r258N822j8252k2532q135K988O906l7663p320J5160K5399
25598B525q173j3163J3909K4807j077J6132J2929q346l7166j3358l600K6324r957
25585A786R434k4079p403J9627J8736k4205k9723q804K2596L1702K955m851p725
25572D6P018j3973J0873K6654n358j3424k8469l6261m873J0822Q736m984n624
25559d8817J4099J0846o648M386n601j6362k52R861j0999O01O142P107O877K5179
25545c581j2478q541J4899k0100J6835k1123l9764L6369M0104k004k2539j9898
25533d1821K3646K2791q40m698J6897J052j0888j4058M032j4655J1991M7955J1392
$$ y = [-11489, 14744, 11002, 9621, 35367, 31621, 39232, 48483, 34932, 37802, 23004, 21612, 39404, 48889, 41493, 49410, 40152, 45974, 27722, 5190, -2945, 43, 6949, -30714, -38034, -22874, 2525, -5648, -18811, -4902, 19905, 18828, 34960, 47889, 39543, 2377, -10981, -14581, 11743, 1786, 11220, -12859, -20262, -635, 18101, -6104, -35827, -44631, -22035, 9667, 12622, 7771, 46, 7064, -6909, 3964, 30618, 25260, 11836, -16633, -52894, -57767, -46945, -38209, -43193, -48817, -34718, -23872, -30520, -26134, -31735, -48097, -48349, -38488, -49487, -48886, -42744, -35637, -28760, -3581, -16059, -24600, -9701, -29801, -12966, -34089, -73853, -37484, 2620, 616, -21923, -41821, -18175, 4616, 3776, -922, 15975, 17027, 6139, -7919, -3887, -18542, -6551, 41404, 52796]
25520E2796j5130N020r789l6706j8002K801o887n035L1611L3583P349m2793r927
25507a1109k991r190j4543K9958J5053N343K0413L655J118j3472q705l284J0541
25494B2787k4355N43J1033k3847Q628L7646J6662j3708J4151P472k9788l0528
25482c304p172J156l1674j7617l568M2978j2942j2717p982L2540M1508J0424l4015
25469b385Q519J6666j1180r847L191l548N691j2840N007p762M858J1153J171J0200
25455A8894p735Q329l341j8536k16p25O792Q594k7660j3441m902J3649M269j7884
25441c3913j6958P955K2444M4487l5k1733l7100L983J622j5565Q18J441l828R969
25427c6413j9863o519L7121L8857K3490M3j3948p031J3072j669N646K6o274j7268
$$ y = [52796, 37666, 42686, 32897, -3809, -21811, -19010, -25897, -30932, 679, 34262, 41611, -1182, -11109, -14100, -23290, -37833, -7875, 7178, 12521, 32934, 36589, 37707, 24235, 15530, 12246, 22787, -1568, -1025, 10008, -13839, -5211, 32435, 49097, 35389, 49540, 57012, 27224, -3304, -10476, -9320, -40994, -58611, -62179, -19201, -32143, -44860, -52842, -20302, 21206, 31630, -2385, 6134, 22800, 11620, 1773, 4964, 1416, 7107, -5733, -726, -8488, -3630, 7523, 8694, 18894, 11159, 19488, 16147, -2389, -2605, -3330, 3462, 12056, -15604, -29045, -33947, -20298, -16029, -33913, -50871, -42916, -20472, 24015, 23980, 2247, -34853, -30870, -29248, -44813, -43995, -42554, -46382, -36413, -56276, -62795, -25674, 13183, 36673, 36716, 22768, 15737, 28809, 27140, 32786, 32812, 26538, 9270]
25413I270j2728o290O771j2188l850J4315K5716k5007j9462K783j6579M14N815
25400c1020K6820j2061k6583j4027K3411J063j2537N252o939R291L1646L1199
25388B5515Q591p673l0434K083O708M315J1116J709J975k0157M049K5947K6363
25375F0107N690o834k0857j1823k4618k1168L449K0017j0344j0685j8190j4324
25363d9580P115K4911J1584L4582k3767n86J5441K9010k5780k1428k8366k2824
25351d9688L996J6385J8642J0762p649k4483L9510P332k7315j339J8898j755j8505
25338a5209j8400J6870j3904O230J6468K0794n913k2054O274k9145Q329J8950
25326a0710j9315k1022K386Q269K5105L1834q27j8347j5439k3483l56J4738j7519
$$ y = [9270, -3458, -9748, -2977, -15165, -19015, -4700, 21016, -3991, -23453, -20670, -37249, -36835, -31020, -4200, -16261, -42844, -56871, -33460, -32397, -44934, -39682, -46621, -37330, -5684, 25515, 34106, 26433, -4001, -1918, 4790, 9105, 20221, 21930, 23905, 3748, 7797, 33744, 60107, 65797, 58963, 38106, 26283, 1665, -19503, -16054, 3963, -6381, -17066, -35256, -49580, -42465, -17554, -5970, 28612, 4845, 4259, 19700, 48710, 22930, 1502, -26864, -49688, -45692, -29307, -10665, 97, -7552, -32035, 7475, 14807, -12508, -13847, 5051, 3296, -15209, -33609, -16739, -30643, -24413, -7945, 12849, 6936, -15118, -8844, -37989, -29660, -10710, -30025, -51047, -48661, -40392, -15287, 16547, 15720, -2627, -18066, -41549, -41905, -27167, -44686]
25313d4686j4996J215R039K2850R838n572K482m1753l7545J9678K5581L0360M53
25300b3056J0641K3558j1049k0453k6226j5181k038K3737M3213N916O840L720
25288A9622j8536J7K9993m702R440r881j6273J8941k1523j6325J6671K3935p653
25275B3726l4132N260O080q922J1735m79j173j2583K026J8832K1072J6755j4868
25262C3329j9272R932K0232J6957O59m5773k5633J792K995j863M5334K4849n8923
25249D615l6356n864J2736Q26K995L3430J6675o060N41j7006Q855k5757k937J4790
25235A483Q941K0751o938j7312K1921L8511k5649M305j4999l5041J4737M0970
25223E1680p200m2866m058K9542K8958q787k8349j7939J9400n968j3787m621m63
$$ y = [-44686, -59682, -58467, -49428, -26578, -16740, -22312, -19830, -61583, -99128, -79450, -53869, -23509, -23056, -12415, 11143, 94, -20359, -46585, -61766, -63804, -40067, 3146, 9062, 15902, 19622, 1086, 1103, 31096, 26394, 35834, 25953, 9680, 28621, 7098, -9227, 7444, 31379, 23726, -10406, -5146, 934, -7988, 3747, 3268, 2095, -10488, -8462, 10370, 31442, 48197, 33329, 14057, 23989, 44221, 61178, 61837, 16064, -9569, -7777, -4782, -6645, 38689, 63538, 4615, -31741, -37605, -24869, -24043, -21048, 12382, 29057, 22997, 23538, 6532, 15387, -10370, -13307, 1483, 10424, 31175, 24237, 6925, 28846, 67357, 41708, 46013, 31014, -4027, 10710, 51680, 44480, 1614, -2444, 27098, 56056, 47269, 18920, 981, 20381, 14413, 626, -3995, -4458]
25210d458M651j3196r511K347J0330J8162L846l0461q410J9214j4321l3566m606
25197e9979K7645n895L3751J0521l230J6759J6283l832n3141k2139K8350L0941
25185A6034j8499J2212N538j4417M590k0120r916J9725K127j8117L1052J9619
25173B9828r241k2905j8776J716n410j8410m383k5595K900L4822n081K5325J4079
25160a131M235L213j0211K4677K3899L2641m937n6141n2748R653J9573J8675j2002
25147f04J3778l474J5309K6739j885j7016l944k0085j1407j2141N161m921l831
25134a8321J0394J0062j7991m4461r634K7491M4662j4334r680J4497l6388p048
25122e0751L2793L8717L681m582o655j7899o114J1880j313M948j4484N991J3396
$$ y = [-4458, 193, -13003, -22514, -20167, -9837, 8325, 12171, -18290, -26700, -7486, -21807, -55373, -59979, -32334, -38229, -4478, 6043, 2813, 19572, 35855, 32023, -21118, -43257, -14907, 16034, -2465, 9747, 15285, 868, 5458, -14662, -24578, -4853, -2726, -20843, 10209, 29828, 20587, -2318, -21094, -19378, -24788, -43198, -47581, -73176, -70276, -35454, -40535, -15210, -1131, 3104, 6317, -3894, 20783, 44682, 77323, 72386, 16245, -36503, -26850, -7277, 11398, -604, 13174, 9700, 25009, 51748, 49863, 32847, 28903, 8818, -2589, -14730, -9569, -14490, -18321, -7927, 2135, -15856, -60317, -69951, -42460, 2202, -12132, -21812, -7315, -43703, -50751, -17958, 20759, 24440, 19858, 13203, -4696, -10810, 1070, -243, 4705, -9779, -3788, 9608]
25109I608J832K0599J8200k649j8843l3950k9485k181M4919L8724k4843j4741
25097G190K7260K3371J9154k5161o0408j6895O717k4406J0351Q667K9445L0696
25085C5981l450k6931j3667m1779k3823M127K2660N1391k1307J8492L7131J1533
25073E0358l5355m6555j4958K3105M5722m479j9430P391j2798J746o766L6450
25061B4431O706m6802j4953L4647o965r105L2208J7888k1764k0212J2340J9005
25049B7424j7582n169k222r945j1018J0029k033j3347k3078K5164Q961J3929L9435
25036D0548L51q382J4524r424m7048k6645K6809l981J4938L4720Q309j404j1534
25023C1781k6387o285R800p918J6081K7898j2256l2610M014K177k3857j6947o162
$$ y = [9608, 11440, 32039, 50239, 47590, 28747, -5203, -34688, -36869, 8050, 46774, 21931, 7190, 34450, 57821, 76975, 51814, -8594, -25489, -18772, -43178, -32827, -24160, 5285, 35981, 32531, 5600, -8067, -49846, -73669, -69542, -46882, 4509, -16798, 1694, 38825, 50358, 15003, -31552, -46510, -23405, 22317, 17838, -1592, 5799, -6999, -5253, -12019, 24431, 31137, -15665, -30618, 4029, -2936, -12041, 20167, 38055, 16291, -3921, 8419, 27424, 9842, 4673, 2451, -7494, -18512, -8483, -10516, -23863, -46941, -21777, -12816, 1113, 40548, 40899, 32517, 47041, 37617, -9431, -36076, -9267, -13248, 1690, 36410, 44719, 43315, 31781, 5394, -891, 8909, 991, 17072, 44970, 32714, 104, 4118, 6295, -17562, -34509, -40671]
25010d0671K2525j468n992O095j7186p389L0667P599p075k9149J7046J6189R054
24997B45j1007J0242K1559J3264p930l2876n332J9865k915K6810K756J7406K875
24984E4962k1731n052j8837k6693l1806O298K2393Q131N184K1641J4417l414k7396
24971a903j3691j7023L663k1792j4095J4318J9672K7752R905j4760K9178M1936
24959F3160k7149m7919p121K6933J6873P755K5272j8395N99j518j1264j9070j2661
24946d505k313k4933O840J5831j1697k6038J2871J4591J5460K469j7628O545K3482
24933A0975K0987k7329m2547k5407J2948J7148L3217J7122k457k4253k8257J1709
24921b6144J9560Q907j1180j0539J4097K3572r133l6898N017J6983R492o187J0443
$$ y = [-40671, -18146, -19614, -25606, -19511, -36697, -44086, -13419, -5820, -12895, -42044, -24998, -8809, 245, -10762, -520, 21039, 34303, 26373, -6503, -11835, 8030, 5115, 31925, 34681, 52087, 54962, 33231, 28179, 9342, -17351, -49157, -42859, -20466, -12335, -7151, 14490, 28907, 25493, -1903, -15594, -32617, -28954, -50746, -64841, -50523, -30851, -3099, 6806, -7954, 21224, 63160, 36011, -11908, -19029, 7904, 24777, 32532, 57804, 39409, 40008, 38490, 27226, 8156, -4505, -6818, -31751, -24911, -9080, -20777, -46815, -33944, -19353, -3893, -1424, -19052, -12507, 10975, 31962, 4633, -37914, -63321, -50373, -33225, -8, 17114, 14657, -9596, -37853, -26144, -6584, 2323, -8857, -19396, -5299, 18273, 9140, -27758, -22741, -5758, 3734, -2453, 7990]
24908G990K0925J2343l6747j8277P834m52K1872J6190j6061k5474M569j8333l3576
24895e7197k2955K949K7529J8740Q627j6182J9699J9509R593L4310j9743P387
24883C2266j656k5219q383P796q87l972j3966m51j9198M979J8546r807k2326R86
24869d1292K7366M186j475q323K7145K7790K8572M208m6505n5644j149M010L818
24856b7293K3428K245N370K7549j174q808J1938J3950l870l8138k5956j7340q67
24843c8966J6433J8157J9266r926O957j8264r301O696Q165q194J1920K1033K0867
24830D4843k4899k4112L671J84j5265j9196L95J3346r223O180R178j3195K4851
24817c242K1578k0970j7288J774M4362L671J0928P597O569j3334j6092k4071n6199
$$ y = [7990, 28915, 41258, 4511, -13766, -5932, -6384, 15488, 31678, 15617, -9857, -5288, -23621, -57197, -80152, -77203, -49674, -30934, -22307, -38489, -18790, 719, 10312, 44622, 24879, 32266, 30610, 5391, -2992, 4804, 3917, -55, -14021, -14472, -33670, -28691, -10145, -19952, -42278, -41292, -13926, -9740, -11215, -19538, 7607, 35397, 63969, 68177, 21672, -33972, -35121, -31111, -27293, -3865, -1620, 3750, 31299, 30125, 21317, 33255, 47205, 43335, 5197, -20759, -38099, -38966, -22533, -4376, 14890, 4964, 11921, -6343, -15644, -8948, -783, -8977, 2943, 23976, 44843, 19944, -4168, -497, -313, -15578, -34774, -34379, -21033, -30256, -24076, -14898, -28093, -3242, 18336, -2634, -19922, -18148, 26214, 29885, 40813, 48410, 54979, 41645, 25553, 1482, -54717]
24804e4717m91O14Q410L098J1930o499J34J8021K3207K996n582J2545j473j3528
24790a335P481L2279j9400o784j3766j8362R60K0659L492P537k651j5177R775
24777D708J9229L686j7467p972o699m999j5250l974J837r15k0244k0034m370K0743
24763e1721Q109K3711R440L492k1846J2443J3697Q409k1352l121O606K3259k443
24750H683o772n534j0577o96j4566j7641m0370j1973L5365R547Q251J5423j1139
24737d1999N997K4617K7016P668l3321j0907K3611j2401j0361M437j403J0763
24725f283L364m694m4173j9104r479J1911L9490J2618j8058n521K0025K4043K3746
24712B7885K0984k9480l580J5343J2142l21M136o104l0568l5461j2173K5442L473
$$ y = [-54717, -55208, -54594, -46184, -43086, -31156, -37655, -37521, -19500, 3707, 6703, 1121, 13666, 12193, -1335, 6146, 38425, 19025, 12241, -1525, -19887, -18927, 1732, 5224, 12761, 10110, -5067, 4708, 23937, 27623, 10156, 2184, -4515, -9514, -24764, -28738, -26901, -27816, -48060, -68094, -72464, -51721, -43612, -19901, -10461, -6969, -28815, -16372, -2675, 5734, -15618, -18739, -12133, 11126, 8683, 1911, -3623, -14200, -14896, -29462, -47103, -87473, -99446, -64081, -54534, -46283, -30860, -41999, -36002, -11385, 15631, 23299, -10022, -20929, 2682, -9719, -20080, -15643, -17046, -6283, -2919, -7613, -51786, -70890, -80369, -68458, -28968, -16350, -34408, -39929, -19904, 4139, 27885, 48869, 19389, 15809, 31152, 43294, 42973, 47109, 41005, 10437, -25024, -37197, -11755, -8282]
24699h282L371J2669J4745K9412p773k7404m7746o918K5792J8940k095L166l589
24686D288j8520n37j5533l041R086L3872j8401r609J0158l5097J8722K2467L028
24673H83K1841j2002l4475j4490J1272K9706m317m59J4790r990j1705j8416o828
24660c4190r536R893M3886K9691k2746r086j4958J6208J5804O884k4377r016J9247
24647A7704j0714O39J9442J1945j7729l2573j0695n406m118Q53M463j6219J5325
24634b7083L280o795r871R817N761l27j804L6156J798j873K9220j9354j3645j343
24620C937j6221l1575J891L2708K7686J1287j2780J696j3472l9766j7668L1969
24608b0308K1001j2691r568J3484L0258m630j9373j4398M635l82K853R60j2246
$$ y = [-8282, -4911, 7758, 22503, 51915, 44142, 16738, -31008, -37926, -12134, 6806, 4711, 7877, 4288, -14232, -14769, -30302, -33343, -24257, 9615, -8786, -18395, -8237, -43334, -24612, -2145, 883, 22724, 10722, -23753, -38243, -26971, 2735, -1582, -2041, 12749, 2759, -8946, -27362, -34190, -43726, -33833, 10053, 39744, 16998, 7912, -7046, 9162, 24966, 31850, 7473, -1543, 17704, 6990, 7629, 27071, 39016, 21287, -11286, -21981, -27387, -31505, -30652, -26189, -42408, -27083, -23803, -30598, -40469, -30652, -24891, -25218, -27022, 9134, 10932, 9059, 38279, 18925, 5280, 3937, -12284, -43859, -41968, -9260, 18426, 29713, 16933, 18629, 5157, -34609, -52277, -20308, 693, -11998, -21566, -8082, 22176, 17546, -1827, -16225, -11590, -11972, -9119, -8159, -20405]
24595b0405j5360K5041J4396K6453j7659k1488j3799K1091J2395j2373n881j3061
24583b0650j7405j096O243J1475M752P413Q350j4022L393M450n563k4749J6526
24570b0883L959Q091K4778J5610J0549o7n662n4534J1420k559L2146J9546k9521
24557A2873k8205J5635J4073n953j8884j9949J3336K3589p016q597R540k005j0125
24544a1688J5351P804M63N685J5381q174q162N674j0331j9644N565k6857j7142
24531d6075K7510M1879J0830J044j2090j6838j1762j1197m895j950p151J1648
24519a9047p266j1556K7594K43K792J2614Q730j4395n860K1079n282l0049J4280
24506f123K3441j4599R532K3382m610k1800J0632J050P077K6880Q147k329r741
$$ y = [-20405, -35765, -10724, 3672, 30125, 12466, -9022, -22821, -1730, 10665, -1708, -7589, -20650, -38055, -39151, -32908, -21433, -16681, -9268, -918, -14940, -11547, -7097, -12660, -37409, -20883, -16924, -8833, 15945, 31555, 42104, 42037, 36375, -18159, -6739, -9298, 22848, 42394, 12873, -15332, 303, 14376, 8423, -10461, -30410, -17074, 6515, -501, -9098, 442, -1563, -11688, 3663, 11467, 11930, 17615, 32996, 24822, 16660, 22334, 12003, -7641, -2076, -28933, -46075, -18565, 23314, 34144, 35188, 23098, 6260, -5502, -16699, -21594, -23544, -30695, -19047, -26313, -37869, -10275, -10032, -7240, 5374, 14104, -291, -6151, 14928, 9646, -20403, -6123, 17318, 2719, 12251, 35633, 31023, 9223, 19855, 20905, 27982, 54862, 63009, 60680, 50939]
24493E0939j293j8878j0027j9997j0567j2883J1906K7235O911o324l4476L075
24481a4379j7201N103K1191J8561j4636n819O074J7594K7231K9796k3581O678
24469E6612k3500k5229j5325J2024j1613j5800j666m989K507K2066o800k2670
24457c4383Q594K8474L1430J0124K2826K0808n657k6960j7882j7218j4619j6802
24445a1265j50O235k1192n809l8364M061J9947n529J4649L0949j2063j1029q157
24432c7717P523k0491r470J2688K1236J9165p2K9476M142O470j3201j648K275
24419B0376l3066j7602J4218q701N7489l461m2722J5323K9696J6808l1460o834
24407A0064P316K5979k7588j3830L3759M2989l60j1773j3672k4346j4870J9719
$$ y = [50939, 49646, 30768, 20741, 744, -9823, -22706, -10800, 16435, 23346, 17022, -17454, -14379, -31580, -26477, -5286, 13275, -1361, -7180, -1106, 16488, 43719, 73515, 49934, 56612, 33112, 7883, -7442, 4582, -7031, -22831, -24497, -29486, -26979, -4913, -11713, -34383, -25789, 2685, 34115, 44239, 67065, 87873, 82216, 55256, 37374, 20156, 5537, -11265, -11415, -5180, -26372, -32181, -70545, -66484, -46537, -52066, -37417, -6468, -18531, -29560, -37717, -30194, -50685, -60155, -47467, -26231, -7066, -7138, 22338, 26480, 32950, 19749, 18101, 20376, -12690, -30292, -16074, -24775, 32714, 29253, -13469, 1854, 31550, 48358, 16898, 10064, 17380, 43359, 15771, 1941, 35700, 78689, 78329, 66556, 52884, 28538, 13668, 33387]
24395C3387K6726k843j2530l9497k1908l6140o431K7864N667J6878j177K604L596
24382c804J658r061p351o995J1646J2818j2818p335k3734j0358J2802L6729m678
24369a0481r337J3380J1105j0698j2572n813L6765J818j9162R663j773J943j9672
24356a4834L7764n783L088j6997N11P807K9439K9041k6566j2608j20j0556j6713
24343C473J0743j43j3045J2648J1894l2063l6807M7735L9730J2382O450j0163
24331E2834k0793j0428K7833M93l0052k1638n61o415j8373J906j0073M5696J1873
24318B2302J781Q266q800j416K1991l1437o474K4975l67m135J4595J9921p223
24305E3979n090j5888k3805r777K4671o272P272K117J2077K464k7231p799J0706
$$ y = [33387, 60113, 57270, 44740, 5243, -16665, -52805, -59236, -31372, -25705, -8827, -10004, -7400, -3804, -2146, -11207, -18558, -25553, -13907, -1089, -13907, -21242, -44976, -55334, -42532, -5803, -10481, -19818, -6438, 4667, -6031, -18603, -24416, 12349, 14167, -4995, 4668, 2895, 4838, -14834, 22930, 17147, 20235, 3238, 3749, 11556, 40995, 70036, 43470, 30862, 30742, 20186, 3473, 14216, 14073, 1028, 13676, 25570, -6493, -43300, 4435, 44165, 56547, 62997, 52834, 32041, 21613, 49446, 49939, 19887, -1751, -2312, -8727, -27100, -25194, -35267, 10429, 22302, 24083, 32349, 23549, 22133, 44124, 12687, 6213, 31188, 30821, 26686, 41281, 61202, 53979, 48889, 33001, 9196, -581, 24090, 17818, 25090, 27207, 39284, 41748, 14517, 6718, 17424]
24292A7424k3680k8716M873M7058K678K4862J7336j9539j1199P660m0383j9620
24280b1246J3684k9638k761K2659K3741J923k9033k8670M44j3701N3911M3580
24268C4893k1569q747k0366L2655N077M263q97k6303j8063m347k3324j6100O312
24255e6516J7291J2333K2333J4164j5072m626J876l7461o071K5948L5473K3360
24243C3032O45j1715j9177J0298J2165k5380l012l2729J5874K1591J2418j3974
24231C6K41j4986j6530M110m809K496k812r901j3561M5955J0109j2564j4322j3729
24217d0267j0328m467J2943L2543p402k1333J1738J6017k5030J7723J0134k7315
24205c5044k728J8501O323P621R828j4775j7931J5357k886j0750l8527j3189J2672
$$ y = [17424, -6256, -34972, -30099, 16959, 19637, 44499, 61835, 42296, 31097, 38757, -1626, -21246, -7562, -37200, -39961, -17302, 6439, 8362, -20671, -49341, -48897, -62598, -8687, 34893, 13324, 4577, -15789, 16866, 21943, 26206, 25309, -994, -19057, -23404, -46728, -62828, -56516, -39225, -26892, -4559, 9605, -5467, -10093, -8217, -45678, -51749, -25801, 9672, 33032, 33677, 21962, 2785, 13083, 25248, -132, -3144, -35873, -19999, 1592, 14010, 36, 277, -14709, -31239, -27129, -31938, -29442, -32254, -42155, -55716, -9761, 348, -12216, -26538, -40267, -50595, -55062, -42119, -9576, -16978, -38311, -26573, -10556, -35586, -17863, -7729, -35044, -37772, -19271, -12948, -5327, 4501, -10274, -28205, -12848, -15734, -26484, -65011, -78200, -65528]
24192f5528K1740K1345J2628P974L0857j7423l2524j8945J1357K0437j4543P954
24180a4671J1538j6640j845J9924o951J693J585M105J8205n628k6331Q191K0566
24167A3741k4249k8463L5392J8140M821M858l4349k7094J0966j532N701K580J4576
24154d912J1223q528J8177j0037J0411M337j5821K3536J2926j8736k2155K546
24142B967j0935Q23k365q190K2206M92M2942p326n2728P963m017K3194q25r280
24128D921l12j0171k5734j0378k869K5492M173M348L0497L037J27M401J8182j4932
24114C0782l0724q134q637k83n603k8565o747R372K6770L062L3756K8758m199
24101C9608k4440j5187J0896L0912k8907k1452J2835O22k281l470R41m3174J1418
$$ y = [-65528, -43788, -22443, -9815, -1841, 29016, 11593, -20931, -39876, -28519, -8082, -22625, -14671, -3133, -19773, -21618, -1694, -8645, -6952, -5367, -1262, 16943, 11315, -15016, -6825, 13741, -10508, -38971, -3579, 14561, 19382, 24240, -10109, -37203, -26237, -27769, -22068, -19488, -4912, 6311, -2217, 15960, 5923, 16334, 20671, 4850, 28386, 41312, 22576, 421, 2967, -7968, -7145, -9510, -17700, 4506, 4998, 47940, 40614, -12114, -4151, -8168, 15026, 14201, 4921, 4609, -5562, -31296, -41674, -44543, -19051, -14878, -10530, 19967, 23004, 23131, 27532, 45714, 30782, 58, -8076, -16713, -16996, -22599, -51164, -57911, -48539, -21769, -18707, 15049, 43807, 39608, 15168, -19, 10877, 41789, 12882, -8570, 4265, 4887, 2606, -864, 77, -43097, -31679]
24088c1679n981M858J1580K0859K4572m619p547O288J519o662k5247j9046L0112
24075i93N65k647j0387m2785M903L2458K1622K3718j9321k413L308q979j2790
24062a3741q910M266K9647M587m919O759J166J0940k9810j1268N877l429J6864
24049H029J1743J688J220j0300m2796p364M6246J2174o552N230j4734l903K6538
24036B7219L6531k2322o139k7423o21R208j0874j3195K977j5631o660J0144k485
24023a9271p551j9033m803j3593J4848N4058p076j3590j4086k820K5391L1760
24011B4234j1281p056j3763l9909r286M914J5271j909k924j2231L306Q800J0975
23998c0859K3259R871L772j4157P119J682J3076L2742k4625n5198p475n976P95
$$ y = [-31679, -37660, -32802, -21222, -363, 24209, 19590, 12043, 18331, 19850, 13188, -12059, -31105, -993, -428, -3075, -13462, -56247, -51344, -18886, 2736, 26454, 7133, 4720, 8028, -951, -13741, -22651, -18385, 11262, 15849, 10930, 17689, 18855, 29795, -15, -11283, -5406, -8835, 8029, 19772, 21460, 22680, 12380, -30416, -37780, 8466, 20640, 14088, 19318, 4584, 681, 27219, 63750, 41428, 35289, 7866, 7245, 16453, 5579, -7616, -4639, -20270, -26930, -16786, -19271, -26822, -45855, -50658, -64251, -49403, 4655, -2421, -16011, -30097, -32917, -7526, 24234, 12953, 5897, -7866, -47775, -57061, -52147, -36876, -38785, -41709, -53940, -50634, -41834, -30859, -7600, 2271, 6043, -8114, -995, 687, 13763, 46505, 21880, -33318, -40793, -46769, -45974]
23985d5974l727j1885J0530K5140K3689j6055l0517n014M2439N0897J1948q809
23973D2662k984k4835m3230J0761L3748k4465k317L4934R497k9255k5042J7104
23961c422Q283j7160J1003P480R401J5905l626k1924r945j0356j6743k0909O338
23948d5675J2915M594j9543K197K5626J9567j6644p201j2714j2138L4144M0616
23936B5744K5241l986k3932k1836p37j2753M363k323P109l601k454Q021K3121
23923B1977n347k0713j3806o21n085K0347J3226K5044K3047j8373n222n133k704
23910B6637k7809j5511m148K1176j00J9656K722m310J2378o740j1007m2274n08
23897b9838L2115m823j5763J3870J6899J307K3052o013n2341l634O304l952J3329
$$ y = [-45974, -49701, -61586, -51056, -25916, -2227, -18282, -48799, -53813, -11374, 39523, 51471, 42662, 39678, 14843, -28387, -17626, 16122, -8343, -10660, 24274, 33771, 4516, -20526, -3422, 4861, -12299, -1296, 6184, 15585, 31490, 27864, 5940, -4005, -14361, -31104, -52013, -45675, -32760, -28166, -47709, -45512, -19886, -319, -16963, -24164, -36878, -49016, -14872, 25744, 50985, 46999, 23067, 1231, 494, -12259, -7896, -10219, -3110, -6711, -9165, -1144, 21977, 16630, -4083, -17889, -18510, -23595, -3248, 9978, 35022, 58069, 39696, 34474, 29341, 26637, -1172, -16683, -20831, 345, 245, 19901, 22623, 18313, 30691, 23951, 12944, -29330, -29838, 2277, -2546, -18309, -4439, 12460, 13767, 36819, 30806, -21535, -25169, -18865, -22817, -9488]
23884i488l321K1425K6282k0298p576O77k5375k8453K6207O967J0093J1671j314
23871G497N258K0922K5380J5302m355j4635j3509k1565l349l3535O125K9815o879
23858A2472R856J3450j1144j8114J0377Q226J379k3159m288r613K0820j266J183
23845A0179K975k3101o123J4585O312l0586l2912J6387L0099o9k5210k6599M9049
23832a5014L028q701R209j4900j7411j4690L316j7511K192J1680m700R990K7459
23819b6053l391J0507L362k15K4176j4479q001M853r145N7842R474l0335p086
23806A1509J1855K2384j0013l0043k1783j9995K900k223L2518J4349o049l8701
23794c3292K2907K3816q416R936J0512k9624l9986N432J8113J687k2963j6916
$$ y = [-9488, -12809, 8616, 34898, 14600, 7024, 7701, -17674, -46127, -19920, -12953, -2860, 8811, 7497, 12755, 33677, 59057, 74359, 70004, 55369, 41860, 20295, 16946, -16589, -10464, 19351, 12472, 22328, 35778, 24634, 6520, 16897, 25123, 26502, 3343, -945, -10558, 10262, 8996, 10179, 13154, -9947, -16070, -1485, 4827, -25759, -58671, -42284, -12185, -12254, -37464, -64063, -15014, -11986, -20687, -11478, -26378, -43789, -58479, -55163, -72674, -70482, -58802, -63502, -53512, -26053, -29444, -18937, -15575, -15790, 8386, -6093, -14094, -9241, -18386, 39456, 48930, 18595, 11509, 23364, 45748, 35735, 5692, -16091, -36086, -33186, -35409, -2891, 11458, 5409, -33292, -10385, 13431, 5015, 14951, 25463, -4161, -44147, -38715, -20602, -18915, -41878, -58794]
23782e8794J9982J4567O27L860k9237Q823R159R15l533j9898J1538K7963K7954
23769A3926J5894K5045r99l2045j6841n893J0235R759k505k008J0317K2808J2451
23756F0144j5194l4382J9941J1509J112j3403l1290j9107j590k600O657n199L409
23743a9993j8418p676J170o980K3221J4597J0932K7290j2046l057k1065M748R418
23730B141M090J6707k515j5488K3267J6394l2921l1818p722J2938J8048J4625
23718A7746j0670k855K5156k4885k8593K0475J1828m201K420K9470J6067O527
23706E8485k0579k5944j0411J9484J1165M660m740J1513j5724j8808N354o082
23694H373j7321M615k2972j7437O80N0140J196L901l791L2923K7801k5716k6959
$$ y = [-58794, -38812, -24245, -23618, -19758, -48995, -40172, -31013, -30098, -33631, -53529, -41991, -14028, 13926, 29820, 54865, 53866, 21821, 4980, -913, 9322, 19081, 16576, 14568, 24885, 47693, 60144, 44950, 10568, 30509, 42018, 43130, 29727, -1563, -20670, -22260, -24860, -18203, -23402, -19993, -38411, -46087, -44917, -51897, -28676, -14079, -3147, 24143, 12097, 9040, -12025, -7277, 2141, 6231, 22938, 20423, 4935, 28202, 44596, 11675, -20143, -27865, -14927, 3121, 17746, 7076, 4221, 29377, 4492, -24101, -3626, 8202, 4001, 6421, 35891, 51958, 58485, 37906, 11962, 1551, 21035, 32200, 36860, 32120, 43633, 27909, 9101, 14455, 8373, -8948, -4333, -27305, -44742, -44062, 6078, 7274, 11175, 7384, 40307, 68108, 42392, 15433]
23681A5433q595j0980k3216P438J5634o43N338j4683r09L479K3160P536J3468
23668C2460J9306P612J302J844n203k368j2693k8252j2618l893n897k8563j08
23655c7071l474m290K0732K9712J7841K9349J3162k2010k5991j075R300N595j2509
23642A9271J0709m095q349J2425M402n165j2609j3994j9405j4388j5031k5750
23630g1979L4355J7755J0212N050L1512j1884l3044p058J8372o294K320l383k1464
23617c5530l5065J2569L8234M812K4519j4184k3328J4079K0994J3645R559k0851
23605I453k3595P72j1153N652p98J0791M632M368r965p731q068P751Q035J3639
23591C783l1599l6717K5697L6700M597j1939K881j5080o746p521n645J6778O804
$$ y = [15433, 6838, -4142, -27358, -19920, -4286, -4929, 409, -14274, -15183, -11704, 11456, 18992, 32460, 51766, 59378, 60680, 62524, 57321, 54953, 42260, 14008, 1390, -2503, -8400, -36963, -37071, -40545, -44835, -24103, 5609, 23450, 52799, 65961, 43951, 17960, 16885, 26185, 31780, 19271, 29980, 25885, 17536, 29961, 34363, 29198, 16589, 2595, -16810, -31198, -46229, -71979, -37624, -19869, -9657, -4607, 26905, 15021, -18023, -25081, -6709, -13003, -10683, -14066, -35530, -70595, -58026, -19792, -14980, 9539, -4645, -27973, -13894, 7100, 20745, 30304, 9453, -14142, -13370, -24523, -18871, -19669, -8878, -4246, 122, -9843, -17574, -25642, -17891, -9856, 3783, -27816, -64533, -38836, -2136, 2461, -9478, -6597, -21677, -28423, -35944, -41589, -24811, -18007]
23578a8007j1792K502R100K7841K3861K3831o144k9308j62K1897j1934l756j3253
23565A4676j4837N441P334L170Q738p838l0855K1967J6701j0223l8669k7804J795
23552e0404J900J5036J9207p417j7368q111J6692K8177N018l834Q807K7635J8965
23539E4303l910k8124j7461j5946J4699J8730p315j3602j843k0888j1100j1066
23527d3523J2420Q968j2558K844j5119n970N0599M3844n245l3363j8612j3230
23515b8945J4038J5640Q887j4960k1792j7137N972j8195J6993K6817L9646N581
23503C2545k7341k5065N846L6937O318j9050k772m048j4491J0017r097J2050k4025
23490b2176j9211L3417J3511K4244p15P097P07n7312k5657M175L2220K752J4558
$$ y = [-18007, -29799, -27297, -18197, 9644, 33505, 57336, 51192, 21884, 21722, 43619, 31685, 27929, 14676, -161, 5280, 12614, 15784, 24522, 16684, -14171, 7796, 24497, 14274, -24395, -52199, -50404, -48504, -33468, -14261, -21678, -39046, -47157, -30465, -2288, 2730, -1104, 7703, 35338, 54303, 50393, 22269, 4808, -11138, 3561, 22291, 14976, 1374, -469, -21357, -32457, -43523, -31103, -22135, -34693, -31849, -46968, -52938, -2339, 41505, 36260, 2897, -15715, -28945, -14907, 733, 9620, -5340, -27132, -44269, -38297, -56492, -39499, -12682, 26964, 32545, 5204, -19861, -14015, 22922, 29240, 10190, 7418, 3370, -11121, -1104, -10201, 1849, -22176, -41387, -7970, 5541, 29785, 29070, 36167, 36874, -20438, -46095, -41920, -9700, -6948, 7610]
23477G610L2045l4k8797k897J594j2563J9082K9066J4366j4584o286J1469k5328
23464B4743o065r86l0853R784K0749J3170Q247k2853k0877j0K2529n875J765k7331
23450a3863j0783j7788r549J1925L550J6799K1052K8621q622l5474k9427j1306
23438e4865J7670J5503L2825j1102j3546m9096j0905J8131L5762L1731j744k79
23426A0085r25j553m289J2311k6461j8583P540L5914K9275l6683j6008J863L029
23413d485M792N062P657J6565J5266l137m4205m6391o613K9577K8761J598P832
23400A2279P578J7893j9980k3753j378l445j5827r760J9564L0931j8785k2939
23388b7622J5549R027j7731m630L8518Q361P243J672L723j4431J680n904p324
$$ y = [7610, 39655, 39621, 10824, 7927, 9521, -3042, 16040, 45106, 59472, 44888, 38602, 50071, 24743, 18678, 17692, -13161, -3377, 17372, 30542, 38789, 15936, -4941, -4951, 17578, 11703, 13468, -13863, -24646, -42434, -51983, -40058, -36508, -19709, 1343, 29964, 21342, -14132, -43559, -54865, -37195, -21692, 11133, 31, -13515, -62611, -73516, -55385, -19623, 12108, 10364, 10085, 9160, 7607, 3318, 15629, -10832, -29415, -21875, 14039, 43314, 6631, -9377, -7514, -4485, 307, 5369, 13026, 29591, 44857, 41720, -2485, -48876, -55489, -25912, 2849, 4447, 12279, 19857, 37750, 17770, -5983, -7361, -10806, -26633, -36393, -16829, 14102, -4683, -27622, -12073, -3046, -20777, -25407, 13111, 21472, 28715, 30387, 34110, 19679, 21359, 15455, 8131]
23375H131M3226O277q234k9906m690l681O279L907J190j8641j75j1932k3047j0361
23361d1657k6134J8129L8708O927J3010J7678K2381J6655l6348l0349R900R986
23349A8886J1492l855K2884K5641K627O954l3296p787j3139j2435k2207r995j550
23336a5780J2009J771n1195M442J7351J7010J880k9068O803L4489M1538l3821
23324G429q038j1700K777n545j5486J9319J6732k1915M696J7299Q557K9944L5776
23311G9845j2934m6840k0176J5128J0228p444J508J0709J724o385J2779j5158
23299B2984J426J2841K5546l3554k4187l97k4745k8918L802K5399K7440J2150
23287A9787n555J3640N537l6976l4539R004K1444M6798J54k9465j6865R331j769
$$ y = [8131, 51357, 57634, 49400, 19494, 14804, 11123, 17402, 21309, 22499, 3858, 3683, -8249, -31296, -41657, -67791, -49662, -10954, -4027, 8983, 26661, 49042, 65697, 29349, -1000, 8900, 18886, 30378, 26523, 49407, 75048, 77675, 84629, 51333, 43546, 30407, 17972, -4235, -14230, -15780, -3771, -2000, -53195, -48753, -31402, -14392, -12512, -41580, -34777, -288, 41250, 7429, -609, -12309, -9532, -15077, -30563, -11244, 5488, -16427, -11731, 5568, 14125, 44069, 79845, 66911, 20071, -105, 15023, 25251, 17807, 19315, 30024, 31748, 25363, 38142, 22984, 24410, 37251, 62797, 29243, 5056, 4659, -20086, -49004, -45202, -19803, 7637, 19787, 14232, 27872, 33409, -3567, -38106, -29102, -7658, 39140, 39294, 9829, -7036, 2295, 526]
23274E26j5255M711l5976j5876R050J5931M013J0897J1871K5497J605j9585o600
23261i191L300k96J1079J7683Q996j5234k5799j474J6959k1832j3809n232j697
23248c6547r613J4159K7015J9856J6570j5326J5154j7129j8064n495J9129L966
23236A3675o098j2386M377j0507k9915q799J3579k5986o5J4091N1169n390k6396
23223b8651J1776j2499N828L4904J7519k9153R180j2414j7924J5531q954j0993
23211b5850j1071J2507Q871j4038L2335J4381O105L2620l4599m4156J6825M3059
23199C6989K535l4429Q798j7962r740p447m257K811N724k827M970J2407K880j7603
23185a7151l2139N667o412k206M5553J7365j4942j418J5183n309r109J2290p625
$$ y = [526, -14729, -10018, -45994, -61870, -52820, -36889, -32876, -21979, -10108, 15389, 16994, -2591, -9191, -5891, -6187, 4892, 22575, 31571, 16337, -9462, -10936, 6023, -15809, -29618, -34850, -36547, -46160, -32001, -4986, 14870, 31440, 16114, 31268, 14139, -3925, -9420, 9709, 13675, 7577, -4809, -432, -10939, -40854, -49653, -36074, -62060, -62125, -48034, 3135, -2255, -28651, -16875, -29374, -23546, 11358, 28877, -276, 8904, -3510, -21434, -5903, -14857, -25850, -36921, -24414, -15543, -29581, 2754, 17135, 23240, 55860, 21261, -22895, -6070, 36989, 39524, 5095, 13893, -4069, -13809, -21256, -25513, -22702, -16978, -19805, -14835, -2428, 452, -17151, -49290, -43623, -50035, -52241, -6688, 10677, -4265, -5683, 9500, 4191, -4918, 7372, -253]
23172b53K2097N142j6984j5444J5275L66l1808k2734N57J9228j784K5454J6991
23159A6103J223j1681l7965p329J2972J9434j0223R011K5881n257k9765n836k556
23146b5988J6564J4941j998K6788L586P263n351k3953l3957l5679j5853K0607
23134e3030r54L0619N2401m998J545j1337j4840n065j2486K9034J3536m3698k1222
23121d0495J2844J837o973K5525K5591k4064N636P12n353n586K6789l001p980
23108E482K1548k1862p186Q181N658o04M0686j515l3739J1558o199k8448m2401
23095d8841K606K2096L801k866J1046j6052P356R415O042j1041J7240J9416L800
23082B4018K902j5158j6299k2583n348J2813r80j0531J8162J8654K9968P788k3398
$$ y = [-253, 21844, 26986, 10002, -5442, 9833, 10199, -21609, -44343, -43786, -24558, -26342, -888, 16103, 17326, 5645, -32320, -39649, -26677, -7243, -17466, -8455, 17426, 12169, -17596, -23432, -25988, -9424, 5517, 3519, 30307, 33893, 41156, 35805, 11852, -22105, -57784, -73637, -53030, -53984, -23365, 29036, 24038, 25583, 14246, -594, -5659, -18145, 10889, 24425, -19273, -40495, -27651, -25814, -32787, -7262, 18329, -5735, -99, 613, -4740, -10326, 16463, 13462, 5482, 27030, 5168, -2018, 6163, 11821, 11217, 51903, 50388, 16649, 28207, 22008, -6440, -48841, -46235, -24139, -20338, -23204, -12158, -28210, -20854, -11439, -5397, -16438, 802, 20218, 24018, 26920, 11762, -4537, -27120, -32468, -19655, -20635, -31166, -13004, 5650, 35618, 43406, 20008]
23069B0008o519j9991n551j3815R607L1512L5026k3178l2638m774J6780j253j6345
23056a1131m366p435M5829R11l0852k9786k3691M709K1328L3729K0679L26K188
23043B2438k842J2100J8574J717J9936J271k3470R507J4237j8907l4001Q019L013
23030C1592k8509k109Q308J027L4242J9805l4087l1566p667P694n055j0191l86
23017a6902r198K714K9465J9651k209K936j6623j9535K6034K0496J829K5256k400
23004F1514P874J2906L0707O8442P4815J51199K77700M29055M16194n4654m25715
22993A050037l31711j47572j5875J31811L14014M08905K17965l12625n17823l11151
22983D85975j22485j13774q7123l5271p214l507l2166j9279j7618K687k1927j0320
$$ y = [20008, 13489, -6502, -12053, -25868, -16261, 15251, 50277, 27099, -5539, -10313, 6467, 5214, -11131, -15497, -22932, 22897, 23808, -7044, -36830, -60521, -55812, -34484, -755, 19924, 20250, 22438, 19596, 31696, 50270, 51987, 71923, 73194, 49724, 59231, 73468, 54561, 20560, 28579, 31592, 3083, 974, 9282, 10309, 44551, 64356, 30269, -1297, -8964, -1270, -6325, -16516, -16902, -26100, -23386, 6079, 25730, 23521, 26457, 9834, -9701, 16333, 36829, 38658, 63914, 61514, 69388, 82294, 113001, 181443, 256258, 407457, 685157, 1114212, 1530406, 1475752, 1050037, 718326, 570754, 554879, 686690, 1000704, 1409609, 1627574, 1314949, 797126, 485975, 363490, 249716, 162593, 127322, 120108, 116601, 84435, 65156, 47538, 50225, 28298, 17978]
22971A7978J8747J5860k97j6888j2419l3252j1743j627j773J468J0342J2277O471
22958E144Q773K7205J548p362n1525r244N806q086k8066J9462L2994K4905K5913
22945D7467L748j4407j2389k5935N305R798k2133J1408m329j1038j4214J6032
22933a0687J586j663Q208J9546O663l3039j8724p3J6876K5431j6208J1891K6318
22920C6125j8579K6774l6643m4375K7931j5008L279j2072m386L9072J5922n348
22908A2692j8501p856k3725J2597j0716L7649N8586j417j7647r431M828J0156
22896D7215J2934K4084K1641j1618j1071j8583k0752q996K60J3530l0562q729
22884I353J9789o903m98L4550K1993m5974j2873K3930j9933k7203L3383K5985
$$ y = [17978, 36725, 52585, 52288, 35400, 22981, -10271, -22014, -23641, -25414, -23946, -13604, -1327, 5144, 13917, 41122, 42670, 35308, -16217, -25461, -19655, -27741, -55807, -36345, -3351, 21554, 47467, 51215, 36808, 24419, -1516, 3789, 13587, -8546, 2862, -1467, -12505, -26719, -10687, -9101, -10764, -2556, 16990, 23653, -9386, -28110, -28183, -11307, 14124, -2084, 9807, 36125, 17546, 44320, 7677, -36698, -8767, -23775, -20496, -32568, -36954, 2118, 18040, 12692, -5809, -13665, -37390, -24793, -35509, 2140, 60726, 59309, 41662, 32231, 37059, 47215, 60149, 84233, 105874, 94256, 83185, 64602, 43850, 34854, 35114, 48644, 18082, 9353, 29142, 22239, 21741, 56291, 78284, 32310, 19437, 43367, 23434, -3769, 29614, 55599]
22872E5599m607k7943j4806o22K071J4407P791k5974M304k135l5871J0329J9956
22859B499J5917K1380j3674k6918Q2N134P908J8998J4330l855j4677j6714j6767
22846f357M4291L1936k8066R404l3650k4327M493R413L6280j2840l4728q4k3014
22833b7249m491o164R758P671J8072J6037R148J3547r436l3853l487o611k4707
22820d1765m146M4225K8048O265J0178J0259p974j2411k7727L997j4212O118j2031
22807a1176l2866j1594J9944K594K2577L443k1405p898J6500K6788J0157K728
22795A9792r383O301J2959O787k0790k2848J9518M973n17K6343j0018L874o82
22782C6309k3335m2276j2469K5943J4755j2247k2474J004R873J2051J1673o175
$$ y = [55599, 50992, 23049, 8243, 7621, 9692, 24099, 31890, 5916, 10220, 8085, -27786, -17457, 2499, 18416, 39796, 26122, -796, -714, 4420, 12328, 31326, 45656, 41801, 27124, 10410, -6357, 37934, 69870, 41804, 51208, 17558, -6769, -2276, 7137, 43417, 30577, -4151, -4235, -27249, -31740, -37904, -28146, -20475, -2403, 13634, 22782, 36329, 26893, -6960, -10447, -17058, -41765, -45911, -1686, 26362, 32627, 42805, 53064, 45090, 32679, 4952, 8949, -5263, 855, -11176, -44042, -55636, -35692, -33098, -10521, -7078, -28483, -36381, -19881, 6907, 17064, 19792, 10409, 16710, 29669, 36456, 15666, -7182, 12336, 17309, 16792, 43135, 33117, 36991, 36309, 12974, -29302, -41771, -15828, -1073, -13320, -35794, -34790, -24917, -12866, -1193, -7368]
22770g368n63J4196J6651j1248r749k401j111J4315j7890j0966J4565J2785L957
22757A5173p459l855J6744l3310k1244P163L5857J8457j1513L1332K4577j493
22745G0429j0753k0409l5227j6187J7462J826j2400M817J3445P239J5397K2165
22733E7804J5518J4757k2089l792R871L794j1214j7862O561M13k2982p171J8652
22720D2260j3590j0575k2481k4189J2761K5852j004l1470l2534r332K439J0601
22708e1262M5892L0356m509m789Q699L7955J5490j0444j4991n065j1657k5661
22696A0014K376P89N010O736J6127p068r538J8590K7961j7244l0623o793K1684
22683C8021J0151K0512L604j0770l7045p917m879J9709K4468O8724P2034O2558
$$ y = [-7368, -7931, 6265, 22916, 11668, 1919, -482, -1593, 12722, -5168, -16134, -1569, 11216, 15173, 7714, 3859, 20603, -12707, -33951, -26788, 9069, 27526, 16013, 47345, 71922, 70429, 59676, 39267, 4040, -12147, 5315, 7141, -5259, -442, 13003, 20242, 35639, 57804, 73322, 88079, 65990, 62198, 72069, 75863, 64649, 46787, 53348, 53761, 30779, 23608, 42260, 28670, 18095, -4386, -28575, -15814, 10038, 9034, -22436, -54970, -64302, -61863, -51262, -5370, 24986, 20477, 15688, 24387, 62342, 77832, 67388, 52397, 47332, 35675, 10014, 12390, 13179, 18189, 24925, 41052, 33984, 24446, 43036, 70997, 53753, 23130, 16337, 38021, 48172, 68684, 72288, 61518, 24473, 16556, 11677, 31386, 55854, 124578, 196612, 259170]
22671B59170k4593q1049n2360K326J7799L2417K5126M9494p925r9010o7398L04
22659E4301J080J828l735k2861K696j337j3090j0487J0180K2173o780j4488k2314
22646b834j2547J6025L0546k3853M697p133r980J4563J1639K691K3387P123j4979
22633C9345m421q793r284R003K9800J0502J7630Q427p150k9690m6335k9503q254
22620b8723N0434M4980m566j4423J2222o101j1811n027J990J0835M6456l314M910
22607I7862n307N70J4700J5666l976p993R872P542R453M054l8781m6467l813j8185
22593C5197j3979K0575j5273m089J1087j4913J3583j8898k4929J5419J5723K9717
22581D9220J8595m779j7714Q531J9937k0j471Q619J5412k0319r541K3046J740
$$ y = [259170, 234577, 153528, 101168, 103494, 121293, 153710, 178836, 228330, 220405, 121395, 53997, 54301, 55381, 57209, 53474, 30613, 33309, 31972, 18882, 8395, 18575, 40748, 33968, 19480, -2834, -15381, 644, 31190, 7337, 12034, 4901, -5079, 9484, 21123, 23814, 47201, 54324, 39345, 34924, 26131, 16847, 25850, 55650, 66152, 83782, 92209, 85059, 55369, 9034, -20469, -28723, 21711, 66691, 62125, 47702, 59924, 53823, 42012, 36985, 38975, 49810, 96266, 92952, 97862, 92555, 93125, 107825, 123491, 119515, 111522, 121394, 128936, 138389, 142443, 103662, 57195, 53382, 35197, 21218, 41793, 26520, 22431, 33518, 18605, 32188, 13290, -11639, 3780, 19503, 49220, 67815, 63036, 45322, 53853, 73790, 73770, 72299, 80918, 96330, 76011, 66470, 89516, 91256]
22568I1256R975r063k1098K3365L8689P641j8799j6072P715o348M6214R7095J54154
22555D04724K05649K08233m8695k66518j83156j14263k1503J0039N3960Q383O223
22544B63076K8536p96o7561m6748M464M8416Q2058j8904L7443L0720m7090l5711
22532B77903j5155M045j938K339K3007L5308M9245O5230J64872K74324M42720
22521A321900M61247l4703m97821l58887j68597k568J55876K58499L99307K80660
22511A814913k96042n17150l09740j64395q6789m3181l0632l9179m345j5014k0329
22500B88117j9842R371r88n2m564K0334K3112R291P021k1913k6753j0373K4734
22487B97495J0515K5819J1163L2638N1206m696k2125J947L7536N2962J8259q374
$$ y = [91256, 101231, 92168, 71070, 94435, 133124, 140765, 121966, 105894, 113609, 107261, 153475, 250570, 404724, 610373, 818606, 769911, 503393, 320237, 205974, 184471, 194510, 248470, 256853, 263076, 291612, 290816, 223255, 176507, 180971, 229387, 311445, 292541, 329984, 360704, 313614, 277903, 262748, 266793, 264855, 267194, 290201, 325509, 374754, 439984, 604856, 879180, 1321900, 1783147, 1748444, 1250623, 891736, 723139, 720571, 876447, 1134946, 1534253, 1814913, 1518871, 1001721, 691981, 527586, 440797, 397616, 366984, 327805, 323460, 308446, 288117, 268275, 277646, 276658, 276606, 272042, 292376, 315488, 324779, 331800, 309887, 283134, 272761, 297495, 308010, 333829, 344992, 377630, 428836, 424140, 402015, 403962, 441498, 494460, 512719, 504345]
22475E04345P439k3096M498k0388P778J0926J286L7689J5036K9364M670j8220
22463E61327J5344K2634J9549L5668M2590O7455Q1706N6527O2752N1989J4518
22452A032059M7214O5429K858J8524P7255J46109J62073P1898K7539R6442Q6791
22441A834191Q2910J74080K99974M01631L72050L20152L83661M24174N56275P69701
22431E618799J039364J464775J815340K201045K952678M327300O684922J1143502
22423C7247725J9559810L5174448O0206257Q5878663O1961703m4903803q8482883
22416A66641920n2418811j7454024O883034L1606803O1481755Q0182120K2619460
22409B99542257q1141146q8687951m9731678k5544864j4544054r302787o276727
$$ y = [504345, 511784, 488688, 493186, 472798, 480576, 491502, 492788, 530477, 545513, 574877, 579547, 561327, 576671, 599305, 618854, 654522, 697112, 764567, 846273, 902800, 965552, 1017541, 1032059, 1079273, 1144702, 1147560, 1166084, 1243339, 1389448, 1551521, 1623419, 1650958, 1747400, 1834191, 1917101, 2091181, 2391155, 2792786, 3164836, 3484988, 3868649, 4292823, 4849098, 5618799, 6658163, 8122938, 9938278, 12139323, 15092001, 19419301, 26104223, 37247725, 56807535, 91981983, 152188240, 238066903, 300028606, 255124803, 166641920, 114223109, 96769085, 103652119, 135258922, 196740677, 276922797, 299542257, 218401111, 129713160, 79981482, 54436618, 39892564, 30589777, 24313050]
22402B4313050m432975l209205k337945j654086j340525j456422j418538j161676
22394G301678r38486p33287n66383l65218k63077k84562l59886l56092l17888
22385C116799l16631k97697j43261q1421j66555j54028j05311r8819j08641j64805
22375A479630j53716j12093m9061m4215m5798j1652j2631l2749m5671p4916n4307
22364H42821j5095M212n6825o8082j4496K4089o702l3137l2565l8672k6375j0699
22352E68474p494j2522L9339M5453M1203P6599J56941K86104N26011O77738M97298
22341B895144K03126J36195r0999m6083J59085p0649k65703m79779o79103m75415
22331A285819k73806k16890j51251j32493p3944q675r759j0590r473N1401N8626
$$ y = [24313050, 19880075, 16670870, 14332925, 12678839, 11338314, 9881892, 8463354, 7301678, 6363192, 5629905, 5063522, 4698304, 4435227, 4150665, 3790779, 3434687, 3116799, 2800168, 2502471, 2359210, 2277789, 2111234, 1957206, 1851895, 1753076, 1644435, 1479630, 1325914, 1213821, 1164760, 1120545, 1074747, 1063095, 1050464, 1017715, 972044, 897128, 842821, 827726, 831938, 775113, 707031, 692535, 716624, 709922, 676785, 644220, 605548, 579173, 568474, 560980, 548458, 587797, 633250, 674453, 751052, 907993, 1194097, 1720108, 2397846, 2895144, 3098270, 3234465, 3143466, 3097383, 3256468, 3185819, 2920116, 2440337, 1761234, 1285819, 1012013, 795123, 643872, 511379, 437435, 428760, 419001, 408411, 398938, 450339, 508965]
22320E08965Q8295J86339L68198M85117K20065l62733m59203k26719o8681R6299
22310H35942J80911L62442M08187k0665n13572m63134k58543j23754n8840n9931
22300B89043n4216n8924l5156j721j2677K1164j0745K9426N2126O553k1773j5444
22288A87656j8518O305l666M107N0920L0243M334L6375J4278k8983k2135L8k0537
22275B40417n6673l1368l183J5960j2648n4096K805J9167J4390l2991n3192l884
22263D4704J6683J1004K9382L4389L7298J7837J4128J8501O354N9403Q9250J15902
22251D94835J84741L67271N99920O73977J24330n82573o02581k61164j2312K09428
22241A195872M71856O01829K45978m99071p38117m56176k42536j81006j22745
$$ y = [508965, 597260, 783599, 1151797, 1636914, 1856979, 1494246, 1035043, 808324, 739643, 835942, 1016853, 1379295, 1787482, 1766817, 1253245, 790111, 531568, 407814, 348974, 289043, 234827, 175903, 140747, 139026, 126349, 147513, 136768, 166194, 218320, 224873, 203100, 187656, 169138, 175443, 171777, 175884, 226804, 257047, 261381, 297756, 312034, 283051, 260916, 260954, 240417, 183744, 152376, 149193, 165153, 152505, 98409, 101214, 120381, 134771, 101780, 48588, 44704, 61387, 72391, 101773, 136162, 173460, 191297, 205425, 223926, 230280, 289683, 378933, 494835, 679576, 1046847, 1646767, 2320744, 2445074, 1862501, 1259920, 998756, 986444, 1195872, 1667728, 2269557, 2515535, 2016464, 1278347, 822171, 579635, 398629, 275884]
22232B75884q0542k6207m2719k9639K1364K1738j4674o2910k899J7626l7045n296
22220C4681L5591j1508K4374K2883r234q108J4731M962j4105k1267n300P133J2854
22207H7687n98j8057l8154j987J456J2817M4246L8599j5543j9984l2723q033k0644
22194B9082k8946K4102L6823J0764K3825l3509k9507K7216R124J1153J1693o322
22182H5498J177o869J7366M402j918k955K6297k1048k4420j3958q222Q71j7550
22169C8671p920q816J3309K6967K7312j1880m305P50m90j980J40J1043P636J9163
22155A09600j1366k0738j6099Q325R080j3693J0881p55l9106k735k5964K0699
22143B8129K1773j1757O961j3253j3468k0819p331J1704j4293K8819J9458l097
$$ y = [275884, 195342, 169135, 126416, 96777, 118141, 139879, 125205, 62295, 59396, 77022, 39977, 34681, 70272, 58764, 83138, 106021, 96787, 88679, 103410, 108372, 94267, 73000, 67700, 74833, 87687, 87089, 69032, 30878, 28891, 30347, 43164, 87410, 126009, 110466, 90482, 57759, 49726, 29082, 136, 24238, 61061, 71825, 95650, 62141, 32634, 59850, 68974, 80127, 91820, 85498, 86675, 79806, 97172, 101574, 99656, 96701, 122998, 101950, 77530, 63572, 55350, 56221, 38671, 30751, 21935, 35244, 62211, 89523, 77643, 73338, 74088, 73598, 71618, 71758, 82801, 90437, 109600, 98234, 77496, 61397, 69722, 78802, 65109, 75990, 75235, 36129, 33394, 7430, 28129, 49902, 38145, 45106, 31853, 18385, -2434, -9765, 1939, -12354, 16465, 35923, 32826]
22131C2826r615L656j1154R358M499K1867J7214q238m001j9698k2449O016K9076
22118D9357l3826j3084j6747O508k0705J3096N7229J0156R755K6230o247N435
22106H7157N037j6185l8475o522n10K8226l382J4475K8314K8799K4670O6456J10939
22093C28999J74318L33620M03788J65510k45180m30143k81142j48202j19809p3481
22083A08278j3131L291l4886k1381J1111j2200K062l4593L130K0694r057K359
22071B5677j192j8682L912K6562j0177O087j5168J6860Q947N000j3640j3917k015
22058A8254Q041J0284m951j5632J8487n013j8597J6453k182j1161R016Q579P443
22045C9021r180m080k4695k5446N046N5522L0711k6933m056n654k4966j0380k812
$$ y = [32826, 23211, 26867, 15713, 25071, 29570, 51437, 68651, 60413, 56412, 36714, 14265, 20281, 49357, 15531, 2447, -14300, -7792, -28497, -15401, 41828, 51984, 61739, 87969, 81722, 87157, 92194, 76009, 37534, 31012, 30502, 58728, 55346, 69821, 98135, 126934, 151604, 218060, 328999, 503317, 836937, 1240725, 1406235, 1161055, 730912, 449770, 301568, 181759, 108278, 95147, 98438, 63552, 42171, 53282, 41082, 43144, 8551, 11681, 32375, 23318, 25677, 24485, 5803, 9715, 36277, 26100, 32187, 17019, 33879, 42826, 47826, 34186, 20269, 18254, 26295, 36579, 31628, 15996, 34483, 29470, 10873, 27326, 25144, 13983, 22999, 31578, 39021, 29841, 25761, 1066, -24380, -19334, 36188, 66899, 39966, 35910, 30256, 5290, -5090, -7902]
22032g902Q395J8071n968l6811M27O778r03J0046j1737J6646n71p650k41K1075
22018I655O059j177J1740M647m856J0665j6602o731j0947K4994J0178j5930R183
22005C0878K8129m356n2331n048K200J2274K6695j5897j6204R780O19j235j6109
21992f05J4236K3479K984j5280j832l679q109L3055r414l0301J1754M354M739
21979B5381j6508j7525K7265J4101m983J821k820p717k4509j1822K2824N505K1196
21966C2209n246J2336k0978l588M728M000k1960r061m625J4912L1400j4911m7006
21953b7790M795L523L6851K2788r495m4696j5222P528J7836n249j438m954j1041
21940b6564j9220L0401J6790P778j147M333K4879K1680Q903m355l9288j5063K517
$$ y = [-7902, 493, 18564, 12596, -24215, -23788, -17010, -17913, -7867, -19604, -2958, -3529, -11179, -11420, 9655, 15714, 14537, 26277, 30924, 26068, 36733, 20131, 13400, 2453, 27447, 37625, 21695, 30878, 59007, 54651, 2320, -2728, -528, 11746, 38441, 22544, 6340, 16120, 16739, 15504, -605, 13631, 37110, 40094, 24814, 22982, 19303, 11194, 44249, 34835, 4534, 16288, 20642, 25381, 8873, -8652, 18613, 32714, 27731, 29552, 26732, 19015, -5494, -17316, 5508, 11013, 32209, 26963, 39299, 18321, 14733, 19461, 23461, 1501, -7560, -12185, 2727, 34127, 19216, -27790, -22995, -19472, 17379, 40167, 30672, -14024, -29246, -21718, -3882, -9131, -10569, -15523, -26564, -45784, -15383, 1407, 9185, 8038, 12371, 37250, 58930, 67833, 63478, 24190, 9127, 11644]
21927A1644K3360P949l0600o345k5181O667K0282R729J1813k6418K222k0636k4640
21914d0154n011K6312L2033K0024P714Q793n165j6340n3217k2833j4696L1479
21902c1061K339k2370m895L2942M2072J9586j7091j4382M9847l263n4122j5708
21890a6106J8519q60j8527J899n95J4972K6363l26m379J6633N641l1231q883K1893
21876B5013K2447m06j207j8460k702J6045n334L52J5903j4451J0508O397l7945
21863A6160P867K228j8049J9672K750o763O216o900L658K868j0963r202J4763
21850B4305K3831k3301k6310K3903J3343J1198k8493p988l80N026K5214M1765
21838H2113J17001J50283K02914L13246M79595L04758k86199m57275k67274n9956
$$ y = [11644, 35004, 42953, 12353, 6008, -19173, -12506, 7776, 17505, 29318, 2900, 5122, -15514, -40154, -45165, -18853, 13180, 33204, 40918, 49711, 44546, 28206, -25011, -47844, -62540, -31061, -28722, -51092, -55987, -23045, 19027, 38613, 21522, 7140, 56987, 53724, -398, -16106, 2413, 1553, -16974, -15075, -15670, -698, 25665, 25339, 20960, 37593, 43234, 12003, 3120, 25013, 47460, 47054, 45847, 27387, 24685, 40730, 35396, 35748, 51651, 37200, 47708, 54105, 16160, 24027, 26255, 8206, 27878, 30628, 23865, 30081, 23181, 26839, 29707, 18744, 9542, 24305, 48136, 24835, -1475, 22428, 35771, 46969, 18476, 10488, 10108, 15134, 40348, 82113, 199114, 349397, 552311, 865557, 1345152, 1649910, 1363711, 906436, 639162, 579206]
21828E79206N1731J82685L18125M04124M4874m53447m54118k76922j41593m9856
21818B04809k4368j6147m7991l1756j6418K770r971q844j3680l0570l977j0922
21806g065j5326N819L9314K1845j5298n830k0403P253L1494k1600R273j7397q660
21793C419J1314j749k138J0968O12m172k6547l0832j2201K2558L3672k945K37
21780B196k4602k0603K0550N5202K335k0254q582k1736j6934j8955r261K5447
21768c5197K0699n645p970l8374q178K4203J9778J4254J4413L2828j3892k4731
21756g812m940R86j4401l017j7695J1882j9956j0590J439J2232K0953N070K376
21743b3473K0718L0481j1373j2969J7040O38k1057l223R662J8079k281q960j0491
$$ y = [579206, 630937, 813622, 1131747, 1535871, 1580745, 1127298, 673180, 396258, 254665, 204809, 180441, 164294, 116303, 84547, 68129, 70899, 60928, 52084, 38404, 7834, 3857, -7065, -22391, -16572, 22742, 44587, 29289, 23459, 3056, 10309, 41803, 20203, 29476, 12079, 3419, 14733, 12984, 10846, 21814, 22426, 18254, -8293, -39125, -51326, -28768, 4904, 1959, 2196, -22406, -43009, -22459, 32743, 35078, 14824, 6242, -15494, -32428, -51383, -60644, -35197, -14498, -20143, -28113, -66487, -74665, -50462, -30684, -16430, -2017, 30811, 16919, -7812, -12752, -11766, -26167, -29184, -46879, -34997, -54953, -65543, -64104, -51872, -30919, -25849, -23473, -2755, 27726, 16353, 3384, 20424, 21062, 5, -3218, 6444, 24523, 22242, 13282, 2791]
21730B791R804K6527J1350j4563O282l8215k210j5930M179J6535L1435k0060j6445
21717A480j1009j257O583m382M1134k8516m3722o258j4837N999L1342k515j6425
21704d2383K2321K4882p779k3030J5495j0986n707J8740p668M790l078K750K6860
21691A5207k93K449k1274k7920R813N435K0098K5862L6583j749o316J033l1636
21678B7292o584P60k825Q43j7274J3420J9299o134k4265l539K8401k381k4520
21665B493k0852l466j413j051j018l587J6129K842K2500j85L16q478n423j2525
21651a3718j979k2045J9589J8047P894j1516k3390j0805M412m730p244J5707M4971
21638A5193J9994j4105j6070J6488k1633R595J9472j2679j2841k2168m144m509
$$ y = [2791, 12595, 39122, 50472, 35909, 42191, 3976, 1766, -14164, -9985, 6550, 37985, 17925, 1480, -9529, -10786, -4203, -8585, 32549, 4033, -39689, -45947, -60784, -54785, -23443, -25958, -42383, -20062, 4820, -2959, -25989, -10494, -21480, -27187, -8447, -16115, -11325, -14403, -11653, 15207, 14914, 17363, -3911, -31831, -22018, -16583, 3515, 29377, 65960, 64211, 57895, 58928, 27292, 20708, 21468, 18643, 19486, 2212, 15632, 34931, 28797, 4532, 993, 29394, 27013, 2493, -18359, -21825, -23238, -24289, -25307, -28894, -12765, -9923, 12577, 12392, 12708, 4230, -1193, -13718, -15697, -37742, -18153, -106, 7788, -3728, -27118, -37923, -33511, -38241, -45485, -29778, 15193, 35187, 21082, 5012, 21500, -133, 9462, 28934, 16255, 3414, -18754, -22898, -27407]
21626b7407j7344j6092L4757L9053J7835q168r038k4465M548K4014O410k0138
21614C965j9868M124L4094j4383j9414M926K499J8650k6195j9893K9409K9441
21602B7355o312l7870j1126j3685n786J2762K409J2314j0280O540K0757J3968
21590A1046J7758j0356j4530m5293O271K7442k9276m0864J8444O1192N5374l325
21578E3883j6149K764O090O691J387k8683l050k5712j9159j1426k2458L3273L0060
21565G511o97k3547j5116j1237J7444j570K4488k145J3854J1072j3343k5148j1883
21552c0317k691J7819n038j5121R686R796J8735k4666j6302J5805K3111k6671
21540b5854k9876k2142J3023J6387O344N556L124J2163J3407j5342l255L0326
$$ y = [-27407, -44751, -60843, -26086, 12967, 30802, 22634, 13596, -10869, -6321, 17693, 24103, 3965, -15903, -11779, 22315, 7932, -11482, -6556, -4057, 14593, -11602, -31495, -2086, 27355, 21043, -16827, -27953, -41638, -47424, -34662, -32253, -19939, -30219, -23679, -2922, 11046, 28804, 18448, 3918, -41375, -35104, -7662, -36938, -77802, -59358, 1834, 57208, 53883, 37734, 40498, 46588, 53279, 54666, 25983, 22933, -2779, -21938, -33364, -55822, -22549, 7511, 6814, -16733, -31849, -43086, -25642, -27212, -2724, -4869, 8985, 20057, 6714, -18434, -30317, -33008, -15189, -20227, -35348, -25662, -15866, 2869, -21797, -38099, -22294, 817, -25854, -55730, -77872, -64849, -48462, -42118, -36562, -33438, -21275, -7868, -23210, -26465, 3861]
21528C861L464J6359o606m2237j4092J3712L0465j862J4878L0304J8528j897l4907
21515B9970n1351j251J4944K6429q7q337l9556l7139k1271M3897J0523J1179q202
21502c0252n118J1330L882K0787Q172k179J763J432m028R376J3122R137j4743
21489B2681k3368j3083k359J0029r035l3761J2279K816k982J2957p35L1328M2881
21476D9648k0602j9036Q042j1015l2015q136J7531J2371M254k3693k6931j3336
21464f2918j4297K5575L8288N1735j2347J1333k210n8644k1320J5249k3563j9459
21452g2578L2988M6397K3801j8144L644Q007J1642k3858O088J2015l946r492J0021
21439B6585j5948n3542k459L3763L5630J196O720j52j7455P767k1669K669Q768
$$ y = [3861, 7325, 23684, 17078, -25159, -39251, -25539, 4926, 3064, 17942, 48246, 66774, 64877, 29970, -21381, -22632, -7688, 18741, 18654, 10317, -29239, -66378, -87649, -43752, -33229, -22050, -30252, -35370, -24040, -20158, 629, 8801, 6622, 8385, 9817, 5789, 15165, 28287, 37424, 22681, -687, -13770, -16129, -6100, -15135, -48896, -36617, -33801, -36783, -23826, -24561, 6767, 49648, 29046, 10010, 18052, 7037, -24978, -33114, -15583, -3212, 1042, -22651, -49582, -62918, -77215, -51640, -13352, 38383, 26036, 37369, 35159, -23485, -44805, -29556, -53119, -72578, -39590, 6807, 30608, 12464, 16108, 24115, 35757, 11899, 17987, 30002, 26056, 16564, 26585, 10637, -42905, -45364, -11601, 24029, 25225, 31945, 31793, 14338, 22105, 436, 3105, 11873]
21426A1873j2773j4644p450K109j0744k4452L5615M2971J7797r001j8616K6374
21414C9059K2348k8558l3073o95J6234k4393j991r654m187K2604k823j5528p673
21401b8330J9079Q904J3941l1091J854J3617k2847N310P411M853J0691k4806K9176
21388G762M0172r8j007j7015k9083k4195J6614J2212O974k0235j7499R50L3300
21375H852P355k1911J0675j3233l0834k2619J7151L5591n2o728r519K080p653
21362c0845K1550L5879j2724k9360j0501n702J2186K2982p438k6696J467Q989
21350b0213k1568R654M6746K5485k0644n3708Q409k7343Q176N8826K3374j5984
21338B1210j4433p555J3495j4824j0869j9202K052J2892k0958o394l045j6074
$$ y = [11873, -900, -15544, -22994, -20885, -31629, -56081, -20466, 22505, 40302, 31301, 12685, 39059, 61407, 32849, -224, -919, 15315, -9078, -11069, -20723, -24910, -2306, -5129, -20657, -28330, -9251, -347, 13594, -17497, -15643, -2026, -24873, -19563, -12152, -7299, 3392, -21414, 7762, 47934, 47836, 46829, 29814, 731, -23464, -6850, 5362, 12336, -7899, -25398, -24448, 8852, 16207, -5704, 4971, -8262, -39096, -61715, -44564, -8973, -9025, -15753, -25272, -23192, -30845, -9295, 26584, 13860, -15500, -26001, -31703, -19517, 3465, -3973, -30669, -29202, -20213, -41781, -32127, 14619, 40104, 19460, -34248, -25839, -53182, -45006, 13820, 37194, 21210, 6777, -778, 12717, -2107, -12976, -32178, -30126, -17234, -38192, -44586, -47631, -63705]
21326f3705j332K6005L3962R739o501O067k4379l2661J0241J8105k814J408J1470
21313a4395J1600R463J6702k6550l2281N894o297m5177O017M9721N2155l845j8279
21300D728q248j8760J961J1859k494m13M2036J6633J6312O773j2432k2540j7504
21287A7911m367K7422K5992j8188k5085q532n631l5824k4380n92L783K5300L9150
21274A6959J0106J4004p088j0224P742l0298l163L275l7326j0702K7604L3798
21262A4687M919J178j1218O538J363j2316q104K0973M497j8125J7155M8549j3299
21249E6797l5699J1903j8710k4578q118P914M525L152M391j410k2680J05L9543
21236A7135N172j8719m556J2740m5732m7389O2578J2513k5216O917K852J0053
$$ y = [-63705, -65037, -39032, -5070, 4669, -1832, 4235, -20144, -52805, -42564, -24459, -27273, -25865, -14395, -2795, 6668, 23370, -3180, -35461, -29567, -35864, -81041, -75024, -25303, 26852, 23007, 4728, -3520, -22280, -20319, -8460, -10954, -11367, 30669, 47302, 63614, 70387, 57955, 35415, 17911, 13544, 40966, 66958, 48770, 23685, 15153, 9522, -26302, -50682, -51274, -47491, -22191, 16959, 27065, 41069, 33981, 23757, 31499, 1201, -1962, 1313, -36013, -46715, -19111, 14687, 19606, 20784, 9566, 16104, 17467, 5151, -2953, 18020, 22517, 4392, 21547, 70096, 56797, 21098, 33001, 14291, -10287, -18405, -10491, -5966, -2814, 1577, 167, -22513, -22408, 17135, 22307, 3588, -968, 11772, -33960, -81349, -18771, -6258, -31474, -24557, -21705, -11652]
21224a1652j9983J7579K8404K3735q897m077k0924L365k4043N108M580j4634q357
21211b9796j8096n195k794K1219j9193l2634O66K3606M611J720K508q679k2405
21198h4462J9791M5048M3303N560k6830J7868J797L991l433l9004j0236K541J3350
21185a0716J4406k4883k516J1908m122k524J0178j9482J4778L666L2285r303R550
21172B3225J2059k5350l5129l5212K5448L4758p185j7711J4486P266k6914k6018
21160e6277J4315K9436k291j3535P41L38J1673j206L1985Q94p746m3572j3989
21147d9234M1473Q935q341J8238p68k5906k411K2144j0817k8396j5994J7140O485
21134b7452K1697K1424r427j952l0294l0277J2315J9164K1377K5436j1075j2982
$$ y = [-11652, -31635, -14056, 14348, 38083, 29186, 25109, 4185, 7550, -16493, -11385, -6805, -21439, -29796, -47892, -53087, -55881, -34662, -53855, -86489, -85823, -62217, -57606, -55886, -53378, -62057, -84462, -64671, -19623, 23680, 29240, 2410, 20278, 22075, 26066, 22633, -16371, -26607, -24066, -10716, 3690, -21193, -23709, -11801, -15923, -18447, -8269, -27751, -12973, -9307, 22978, 13675, 23225, 35284, 9934, -25195, -60407, -34959, -201, -7386, -25097, -10611, -3345, -30259, -56277, -41962, -12526, -14817, -28352, -27611, -27273, -15600, -16806, 15179, 16073, 8327, -35245, -49234, -7761, 1174, -7167, 11071, 10303, -15603, -18014, 4130, -6687, -35083, -51077, -33937, -27452, -5755, 15669, 6242, 4290, -26004, -56281, -43966, -24802, -3425, 22011, 10936, -2046]
21122b046r641l454N242k9037J2813R276p863j0911J9468J0355j709J0414O404
21109I311J3455M251k1599k9251n400J829L750J3334j0667j9234J0196J1406J326
21096a7293k4676J0521J4437J7100j7105J2252M239j991J3300P960j9144k2074
21084b2474l15J2749L521j4470j1799m5761j8442M4311L0580K0145j105j1687
21072a4747P28Q920R435m412k8319L229J0641J1085p26M869k5959L7911J2051
21059B4706k0015l84K3172Q58m129L969J055j6560K0857J8691M469l4555n1351
21046b9217j7444L4227k35j1705j8864P857K4389N732p733j308r0K025K966j0999
21032b0399j0654l9166l0751K8739K2902Q964J9390P827l3004k4696J3761Q814
$$ y = [-2046, -11687, -15141, -9899, -38936, -26123, -16847, -24710, -35621, -16153, -5798, -7507, 2907, 9311, 22766, 27017, 5418, -23833, -29233, -27404, -23654, -10320, -20987, -40221, -30025, -18619, -17293, -41969, -31448, -17011, 89, -17016, -4764, -525, -2516, 10784, 18744, -400, -22474, -22789, -10040, -6519, -20989, -32788, -78549, -96991, -52680, -22100, -1955, -3060, -14747, -14019, -5099, 4336, -76, -28395, -25166, -14525, -3440, -4166, 703, -25256, 12655, 24706, 4691, 4307, 27479, 28337, 24208, 28177, 29232, 12672, 33529, 52220, 56689, 22134, -29217, -46661, -12434, -12669, -24374, -43238, -35381, -10992, -5260, -12993, -14301, -14391, -12366, -9400, -20399, -31053, -70219, -100970, -72231, -49329, -40365, -20975, -13148, -46152, -70848, -57087, -48273]
21020d8273L3538J0946j6359j4479k6371J9675J3325L4038K8103l86k4153k1354
21008a1750J1716J6209j887J964n436r40l089J5658J3774j2503k6460l1112R115
20995b4741J9187J1015j4295o329k99J661k436j6353J0285O302r460N898o42P470
20981a2737L7404J38k6093K2380j6624M020K7412L004J7475l8064k5189j5823
20969b2697K6117j1863j5626l210j9605P475J2272J5300n134q527m518L3643j9861
20956a6234j4946o522m265J1093P981j6820K7786M0388R995j0815l806K730o8483
20943d1918j5616L9193O220q007k8173L4117K6016M5831k6096k9355J8311J1015
20931C1538k2011Q889J0378Q603K268l7556l97K890k6825j3207J4256K4184l96
$$ y = [-48273, -14735, -3789, -20148, -34627, -60998, -41323, -27998, 6040, 34143, 33757, 9604, -11750, -34, 16175, 14288, 16252, 10816, 9876, 6787, 22445, 36219, 23716, -2744, -33856, -24741, -5554, 5461, -8834, -15163, -15462, -13801, -16237, -32590, -22305, -16003, -25463, -19565, -20207, -12737, 24667, 24805, -1288, 21092, 4468, 8488, 35900, 38904, 56379, 18315, -6874, -22697, 3420, -8443, -24069, -27279, -46884, -39409, -27137, -11837, -16971, -25498, -30016, 3627, -16234, -31180, -37702, -41967, -30874, -22893, -39713, -11927, 28461, 38456, 27641, 23835, 26565, -41918, -57534, -18341, -12121, -20128, -48301, -14184, 11832, 57663, 31567, 2212, 20523, 31538, 9527, 18416, 28794, 37397, 39665, 2109, 1712, 4602, -22223, -35430, -21174, 3010, 2614]
20918B614m1701L789K889J1306K0389J1177J3296L506j0272n662k1503k1147J2899
20905a8420Q68k630K386L1247O349L657J973j177L25k839q8K0257k973j2326K124
20890B8733J4047k6382p507n438j1979M006p952j801J4426P406J225j8612O522
20877c306K627J1035m317J1570J5361k166l2090l653O797o301r951K1370j704
20864E272P875K4989j116k5238J4160j4713k8538k4866l0787J8565J3334L4987
20852f076L1537K2762L594j9026o031j7276k1750N817j4631j7681k185P987K6023
20839f936q997L3367r145j1771k1627R004K3941K3766q841m3880r853o503p287
20826d4762J8784j072J9206j445O401o214j604m9594j5604R66q653Q997Q812o028
$$ y = [2614, -39087, -35298, -32409, -21103, -714, 10463, 23759, 27265, 16993, 11331, -10172, -31319, -18420, -17552, -20182, -17796, 13451, 19800, 23457, 25430, 24253, 24578, 21739, 21651, 41908, 38935, 26609, 28733, 42780, 16398, 8891, 3453, -8526, -4520, -12472, -14273, 153, 7559, 8784, -9828, -3306, -679, 10356, 6039, 17609, 32970, 30804, -1286, -4939, 1858, -4443, -14394, 6976, 5272, 13147, 38136, 37020, 11782, 25942, 11229, -17309, -42175, -72962, -54397, -41063, -6076, 25461, 48223, 51817, 32791, 26760, 9484, -12266, -6449, -21080, -38761, -40946, -32959, -6936, -15933, 17434, 8289, -3482, -25109, -16105, 7836, 31602, 22761, -21119, -30972, -37475, -44762, -25978, -27050, -7844, -9289, -2888, -9102, -10706, -60300, -75904, -74938, -83591, -74594, -65782, -71810]
20812g1810L0283J6822L13k892j6815m005j527J476L6260M2563L8057l8412k0036
20799A0277J691j404j168k7901j8488L1085J2297k176J9812O544n872k9393j3618
20786a8314k1956J7745O3219J3841n1979k2093N0269K5729l8741j0732j1871L978
20774i05k1573j3358M1778j3639k3530m64J9903J9368k1201L0254j0137k0190
20762a3694K062Q530K245K0472j6530m1906m0513n211L8281L2787J3025M8387
20750D7935J4393j6447k6443j2105r138n930J944m262p963j0664j720j7890J1015
20737c7275K6713M5678J3626l4629j9998j7519J5219n9p711P856J520j5571q086
20724c0236N579J239k496m249L2937L1967j3855k9530k5128M772m678p934K867
$$ y = [-71810, -41527, -24705, -24392, -27284, -44099, -48104, -49631, -48155, -11895, 30668, 68725, 30313, 10277, 11968, 10564, 9396, -18505, -36993, -5908, 6389, 4213, 24025, 30569, 24697, -4696, -18314, -40270, -22525, 40694, 54535, 2556, -19537, 30732, 56461, 17720, 6988, -4883, -905, -22478, -35836, 5942, -7697, -31227, -31691, -11788, 7580, -13621, 16633, 6496, -13694, -11632, -3102, -857, 19615, 3085, -38821, -79334, -84545, -46264, -13477, -452, 47935, 62328, 45881, 19438, 7333, -1805, -7735, -5791, -10053, -18016, -28680, -30400, -48290, -37275, -10562, 35116, 48742, 14113, -5885, -23404, -8185, -8244, -15955, -8099, -6579, -22150, -30236, -24657, -23418, -25914, -30163, 2774, 34741, 20886, -8644, -33772, -29000, -33678, -41612, -38745]
20711c8745r358j7262N621O094J4292K7609q710l5863j3092p810K7892J3045M455
20698c1832j0196J3992O564J1754k0952J4279K006l4624J0867K2770m927j2918
20686c3217j2672j843K0722K1141J7704k1564m472J5088L3724q049l3328m2438
20674d9204L468L712k5703j8526L57M2498N1246k4133q096J2628Q972m5140l4048
20661h1969M2308O525K4160k9310k3741L4678K7902K2161k2491J027l220M920
20649B950k4892J399J3862J1183q465L2817J4128l0197p427L4213m162j5877m776
20636A4756M347j3980p949J3057L7941m2060k5890J2892k336k6306j0188K5895
20624a9821m235l696L7665K3240M3168j1285l2253l2604k3410Q651L3641K1393
$$ y = [-38745, -48103, -65365, -59744, -53650, -39358, -11749, -20459, -56322, -69414, -77224, -49332, -36287, -31832, -42028, -28036, -21472, -9718, -30670, -16391, -14385, -49009, -38142, -15372, -20299, -33217, -45889, -47732, -27010, -5869, 11835, -9729, -14201, 887, 34611, 26562, -6766, -49204, -45736, -42024, -67727, -86253, -85896, -43398, 7848, -16285, -24381, -11753, -2781, -47921, -81969, -39661, -33136, -8976, -38286, -62027, -27349, 553, 22714, 223, 1250, -1970, 2950, -21942, -20543, -6681, 4502, -3963, 28854, 42982, 12785, 5358, 39571, 35409, 19532, 14756, 19103, 5123, -2826, 10231, 48172, 6112, -19778, -6886, -9222, -35528, -45716, -19821, -24056, -27752, 9913, 33153, 76321, 65036, 32783, 179, -23231, -14580, 19061, 40454]
20612D0454l258N3O02J303j2291m4904l366k8584k3459K4434J8753n615J2369
20599b3509m114J3331j1987Q948P967k1768o393j475Q182K2613j1334j2454k3388
20586e5381Q813K2074q459K795K3626J2698k1336k6147j9707J4888Q677j2905
20574e0364L765L7319J7804J2672J712l2255L709j5524j6592K6353J0043k323
20562c681j0443K9773r714L572l2519j2894J3217M00j7709m670R595j574P234
20549b9413L6714j3734N625K6860K9268j5036k7671k4323K2445J0438L141r501
20537A4813R404j4023p216Q64j4235J3102L79L7243j3418k5612J8801J1582j1648
20524B0036q992j1002j1001J1779O339n69n562k3892o603j4327k497P350Q712
$$ y = [40454, 37196, 37249, 37851, 39154, 26863, -18041, -21407, -49991, -73450, -49016, -30263, -35878, -23509, -27623, -14292, -26279, -17331, -9364, -31132, -37525, -39000, -30818, -8205, -19539, -31993, -55381, -46568, -24494, -32953, -30158, -6532, 6166, -15170, -41317, -61024, -46136, -37459, -50364, -46599, -9280, 8524, 21196, 22908, -9347, -5638, -21162, -37754, -11401, -1358, -3681, -14124, 15649, 5935, 9507, -23012, -35906, -22689, -22289, -39998, -44668, -35073, -36647, -29413, 7301, -6433, -808, 26052, 55320, 40284, 12613, -11710, 10735, 21173, 24314, 14813, 24217, 10194, 2978, 3842, -10393, 2709, 3088, 40331, 26913, 1301, 20102, 31684, 20036, 11044, 42, -10959, 820, 7159, 6590, 1028, -22864, -29467, -43794, -46291, -38941, -30229]
20511c0229O005L1231K2419J7067j9299l897o927L886k9374l7854K3489N0185
20499B6702j482j6751k355j3301K930O199j9601k3603k8185K4648L7411K0667
20487A3279L4254k7757l4526K022P44m2912J6668K1878q793m071j3498j2274J6642
20474c8344j1309j6325J8503J5300K6473K773J4999J3490k20n038J2980j7881
20462A5401M064n99l0636j6661K5240Q535j3922o508r079n083L0471L8929K8076
20449F8228p604j9013m4404l7700J059K6763L9968j854j0912j1883k017n654L308
20436a715O776P814n74p606Q173n261j0160Q290L7988j6370m3646Q248J7705j0958
20422a296K896P691o699M21k821k2901j240L3513L6460K858p075n471k4115k111
$$ y = [-30229, -24224, 7007, 29426, 46493, 27194, 23297, 16370, 20256, -9118, -46972, -23483, 26702, 25220, 8469, 6114, -7187, -4257, 1942, -17659, -41262, -69447, -44799, -7388, 13279, 47533, 19776, -14750, -12728, -11984, -54896, -38228, -16350, -25143, -29214, -42712, -54986, -38344, -49653, -65978, -47475, -32175, -5702, -2929, 12070, 25560, 25340, 20302, 33282, 15401, 19465, 18866, -11770, -28431, -3191, 5344, -8578, -15086, -24165, -29248, 1223, 40152, 68228, 60624, 41611, -2793, -40493, -39434, -12671, 27297, 25443, 14531, 2648, 631, -5023, -1715, 5061, 12875, 12301, 4695, 12868, 7607, -2553, 5737, 43725, 27355, -16291, -8043, 9662, -1296, 1600, 9291, 2592, 3013, 192, -22709, -23949, 9564, 46024, 48882, 41807, 36336, 12221, 10110]
20408A0110J5454k4834j7225K9314J0756l7177k1569N61Q335o707j8680J4313
20396c7349K6699n897k7504j0968J9000J5420k0906j4604M383j461O233J589N70
20383d4795L0613K579k4644J6961Q961l819K26P743q432j6923K0288M200k8190
20370c5232k976N109k546J2657M9567K3505k1711j1615K045J0252J4773J4370
20358E8198J0010k8539k3850j3043k3769m5938j191J2798P652r879l3442o610
20346i7603M8348M5206o113j6099K3609J1521q424k819q057p160J7511k6025l1029
20333e7134Q457Q579K6021J0109K4197j7399k7820m112K8380K1490j2225l8947
20321c0404k3320L222K4458J1426R947j0988Q212Q562J6996L106J2306n624p495
$$ y = [10110, 25564, 730, -16495, 12819, 23575, -13602, -35171, -34610, -26275, -32982, -51662, -37349, -10650, -16547, -44051, -55019, -36019, -20599, -41505, -56109, -51726, -53187, -46954, -45365, -44795, -14182, -11603, -36247, -19286, -10325, -14144, -13918, -6175, -14607, -31530, -11242, -7042, -35232, -38208, -33099, -35645, -22988, 26579, 50084, 28373, 16758, 18803, 29055, 43828, 58198, 68208, 39669, 15819, 2776, -20993, -66931, -68122, -55324, -47672, -57551, -90993, -97603, -49255, -4049, -10162, -26261, -2652, 8869, 445, -2374, -10431, -17591, -80, -26105, -57134, -48677, -40098, -14077, -3968, 20229, 2830, -24990, -29102, -722, 20768, 8543, -30404, -53724, -50502, -26044, -14618, -4671, -15659, -7447, 1115, 18111, 21217, 33523, 27899, 20404]
20308B0404Q48R874r828l5917k3714Q352j0569j1382L1381L1703k0612J3884L615
20295H039j530M559Q279K4469m874k6616k5415j1718N262O334L125P012R104M944
20281A0974o246j2231P507J2647j106J7132k3610k6136O279k2388j9818K7345
20269b9651J6396J0271J1722K404k3173l188M0730j0744j7434j3597k3455P799
20257c1920R674N878k623k8250k7522l66K2083K3427J1973Q323J5410j5297k1120
20244c0330r907N042K4014J16l1844j5777p152k551J8723L2259M399p507R425
20231a1090J5405Q652j347j1976J032l5967N457Q997j510l430J3387O267j1712
20218a7835J5826K1706k269k1451l359k73r857j1369q923N008J8765k4469l2613
$$ y = [20404, 21252, 31126, 21298, -14619, -38333, -29981, -40550, -51932, -20551, 11152, -9460, 4424, 8039, 6509, 11068, 19347, 43816, 38942, 12326, -13089, -24807, -19545, -13211, -10086, -3074, 6030, 10974, 4728, -7503, 4, 12651, 11545, 28677, 5067, -21069, -14790, -37178, -56996, -29651, -13255, -2984, 8738, 11142, -12031, -15219, 25511, 14767, -2667, -16264, -39719, -31920, -22246, -16368, -18991, -47241, -74763, -75129, -53046, -29619, -17646, -9323, 6087, -9210, -30330, -40237, -35195, -11181, -11065, -42909, -58686, -65838, -68389, -49666, -17407, -13008, -20515, -11090, 4315, 12967, 11620, -356, 676, -35291, -29834, -20837, -22347, -25777, -12390, -6123, -17835, -2009, 19697, 17428, -4023, -7382, -7655, -17512, -28881, -37804, -32796, -14031, -38500, -71113]
20205g1113J3051N359j6K1325k1419m142L4211J529j636J2221o55l0435Q527O245
20191b6948m461K2586J1925m947j451P765J1569k8510K3253J0646L365j0426o494
20178G872K3489M06j2457J4697K078p052o009L549l325k3950k1281j5995J4893
20165b3085j5052L0968Q507j7961k1418J3443N517K6439J4828p00J7963j0434
20153B9015j0562J6695n053k3231o912j4701j1268J0915J6312R987m121J26P065
20140A4267l067J9848M817J5603l1391l3538r477j5822K870j24J3212L8287J3952
20127B9437r828j0064k7040p520m639l929O529K1170K2363j1907q442K245n939
20114g564J2447q34O649K3735K7379p328l3241l9086j5092k2450R32NM0593K1094
$$ y = [-71113, -58062, -52703, -52719, -31394, -52813, -56955, -22744, -21215, -22851, -10630, -11285, -41720, -33193, -26948, -31409, -8823, 3102, -1845, -3296, 4469, 16038, -12472, 10781, 21427, 24792, 14366, 7872, 31361, 31767, 19310, 34007, 36085, 29033, 23024, 26573, 23248, -702, -21983, -37978, -23085, -38137, -7169, 1338, -16623, -38041, -24598, -19081, 7358, 22186, 21486, 39449, 29015, 18453, 35148, 30095, 6864, -48, -14749, -26017, -15102, 1210, 11197, 7076, 7202, 14267, 11200, 31048, 35865, 51468, 20077, -13461, -22938, -38760, -35890, -36014, -22802, 15485, 29437, 19609, 9545, -17495, -25015, -29654, -33583, -27054, -5884, 16479, 4572, -3870, -1625, -7564, 4883, 4049, 10698, 34433, 61812, 54484, 21243, -17843, -32935, -55385, -54453, -54448, -13855, 7239]
20100G239J1803J9282m046k8010j8540O375N478k5994l8330J6033M0048Q900k9518
20087b9280m8978P088L6774j0931Q924M3824P811j3837M403N610k7687j1794Q893
20074a9180J2412k4206k507K2523j041J264K0535J3895j5373k5571J5601N906
20062D258M543J4792r49J1500r488j2024j4223j208l1025j7771j1695K7411L5834
20049d5m238N562J9748p981k1972m1969n521K714J4870m746P654J3682j6567O122
20035c2687j33k2409r949K1369J2976J167j48N352k455Q447J1178J7176P906j0157
20021G633j4921L1132J1745l2496l3518J4028K9169N612j921J7016j5847K830
20009B0462J1530r2j8047k8499j8689j1100l302M73P15L9249J9679l1213M412
$$ y = [7239, 19042, 38324, 34278, 6268, -12272, -5897, -419, -26413, -64743, -48710, -8662, 238, -29280, -78258, -71170, -34396, -45327, -36403, 7421, 15232, 1395, 5798, 11408, -16279, -28073, -19180, -6768, -30974, -33481, -10958, -11999, -10735, 9800, 23695, 8322, -17249, -1648, 4258, 8801, 23593, 22644, 34144, 24656, 12632, -1591, -2799, -33824, -51595, -63290, -35879, -45, -4283, 1279, 21027, 13046, -8926, -50895, -56416, -53702, -38832, -43578, -35924, -22242, -38809, -32687, -32820, -55229, -65178, -43809, -30833, -29666, -29814, -24462, -26917, -18470, -7292, 9884, 17790, 7633, -7288, 23844, 35589, 3093, -30425, -16397, 12772, 18384, 16463, 33479, 17632, 20462, 31992, 31900, 13853, -14646, -33335, -44435, -47737, -47264, -46549, -7300, 12379, -18834, -14422]
19996a4422R192O029j0382j0832K4051M455k2693q423L9981l889p631j0182M103
19983f43K2848P235j5847l3976j7245J1065K7851J3589l2745J8871M790o799N500
19970D494p612j6495J0477O401K5534K9210k8783j8728r803L025J9561K166j5364
19957D083J6497J6203j7670l5015l5449Q452L687J8481J7155L943O681j8393J1206
19944a39k907k1314n081L60K1450K5039J5771l5761j2295n520l602N846J5466
19931b687J8582M049j3494j0748L4675k0713j329k148j4377K659k376n796n92
19918a4295n195P683J3056q530J7311J5899j4724m4384J1403J5413N596m13R534
19905H354K2428p674p63k863l1695k7078J5079O362M016j1770k0468J1693L0945
$$ y = [-14422, -5230, 799, -9583, -20415, 3636, 8091, -14602, -23025, 16956, 13067, 5436, -4746, -643, 22205, 29440, 13593, -20383, -37628, -26563, 1288, 14877, -17868, 1003, 5793, -1006, 4494, -3118, -19613, -9136, -2735, 22799, 52009, 23226, 4498, -5305, -2280, 17281, 19447, 4083, 20580, 36783, 19113, -15902, -51351, -42899, -39212, -20731, -3576, 367, 7048, -11345, -139, -3046, -24360, -29441, -29081, -7631, 17408, 33179, -2582, -14877, -20397, -23999, -18153, -2687, 15895, 19944, 6450, -4298, 30377, 9664, 8335, 6187, -8190, -5531, -7907, -13703, -14295, -19490, -11807, 1249, -7281, 10030, 25929, 11205, -33179, -21776, -6363, -767, -1180, 8354, 30782, 23108, 22345, 19482, -12213, -39291, -24212, -17850, -13834, -25604, -46072, -34379, -3434]
19892c434j5319k4906N207J7539K1298n673j898P269N491k6772n201N191q859
19879c0067r34j5496l838j100J6098J6461J6864k2072J5684j8068n252J3090R385
19866i245K295O112r958R05j8315L2584J1478j5565J963L4660Q23j9743k3494
19853e500k4946J377q448R730K8580J2019M496l57K2925r3j0197R641j1040p196
19839B0991K517k3225J7496K2251j529P804j4685P594j8394N623m9j651r882K4164
19825C9025r812l3139k923K4669j0270K0183K1589L80m3274k8065J3063K6876
19813A8302L745j8350m7883J1907N1446K4951q030j6264k284N347j1238J3203
19801B4852R60K6807R673m206j7745l7371l2103p839J158r455J6553K8811J0310
$$ y = [-3434, -18753, -43659, -38452, -20913, 385, -5288, -7186, 83, 5574, -21198, -26399, -21208, -30067, -31001, -46497, -50335, -51435, -35337, -18876, -2012, -24084, -8400, -26468, -31720, -18630, -9245, -6950, -838, -10796, -9891, -28206, 4378, 15856, 291, 2254, 36914, 37737, 17994, -5500, -30446, -29069, -37517, -27787, 793, 12812, 17308, 16951, 39876, 39783, 29586, 39227, 28187, 20991, 23508, 283, 17779, 40030, 38501, 46305, 31620, 39214, 20820, 26443, 26394, 24743, 14861, 39025, 29213, -3926, -6849, 17820, 7550, 27733, 49322, 49702, 6428, -21637, -8574, 18302, 22047, 3697, -44186, -32279, 19167, 44118, 36088, 19824, 17540, 22887, 11649, 24852, 25812, 52619, 62292, 58086, 40341, 2970, -29133, -36972, -35814, -45269, -28716, 95, 10405]
19788A0405q162l7276K218p474o306J0910L4528R728j4784m094J3058J0125k4711
19775a1835j2722J7187K0215j8106j8686l0063N062J5127n591J9174K9490J3810
19763B3062L1128n506k8404j6138j4820M0256J9068P072j8753m1207o781M566
19751f457K9632J1065l0825n948K6736J4667L582l0329J6278j4746k0804j6236
19739b3385R455L7532J2560L911J7844J9009n4318n8302K2184J6500J1343N78
19727A4911k6349J713K957L0028P917l501J8935M055j3982j5601n195j3477R065
19714A1476r679Q645q6J849J6251M2774M3550j1623n5531j1815Q661j111r92k4571
19700A7798j3383J158m901k4073k0378J657K3557R869J224r341l539K393P680
$$ y = [10405, 2243, -35033, -32815, -40289, -46595, -35685, -1157, 8571, -6213, -10307, 2751, 12876, -11835, -24557, -7370, 12845, -5261, -23947, -54010, -48948, -33821, -39412, -20238, 9252, 23062, 54190, 48684, 20280, 4142, -10678, 29578, 48646, 55718, 36965, -4242, -11023, -6457, 23175, 34240, 3415, -2533, 24203, 38870, 42452, 12123, 28401, 13655, -7149, -23385, -13930, 23602, 36162, 40073, 57917, 76926, 22608, -35694, -13510, 2990, 14333, 14911, -11438, -9725, -6768, 23260, 31177, 27676, 46611, 50666, 36684, 21083, 15888, 2411, 11476, 1797, 10442, 10356, 12205, 28456, 71230, 114780, 103157, 47626, 35811, 44472, 43361, 42369, 17798, 4415, 5573, 672, -23401, -43779, -42122, -18565, -8696, -7472, -16813, -20352, -17959, -10279]
19687a0279P716K494r022K8767J4818M800k5415j8834k152K4844J6465J1557J0334
19674E6093m313j2064k0131j8970j8307j306L2559J4127l4375J2166K2729J7086
19662D5294k52l5343j7121m1847k896M399m306J1730J658K9961K9716j3670j4607
19649g284j4572J0345m589J833j9002m319O195l696J8410j4721r409L3040K0717
19636A2948j020K201j7798k6729J8650K0152o874j3222l6145J241K7865J6255
19624b476p372k8238N647K7492l4649P379J8212R823L456q497j748k446p45j9730
19610c3892j2373Q109J3583j0635Q459P233K9920J6343J9549o69q068k0671q128
19597H760P570M2j3417k210K377m806j6840j6390j2352L1506K1299j5936J4504
$$ y = [-10279, -2563, -69, -9091, 19676, 34494, 39294, 13879, -4955, -7107, 17737, 34202, 45759, 56093, 51780, 39716, 19585, 615, -17692, -18998, 13561, 27688, -6687, 5479, 28208, 45294, 45042, 9699, -7422, -49269, -52165, -47766, -52072, -40342, -38684, -8723, 20993, 7323, -7284, -21856, -11511, -16100, -14267, -33269, -37588, -31393, -35089, -16679, -31400, -40809, -7769, 12948, 11928, 14129, -3669, -30398, -11748, 8404, 1530, -11692, -47837, -46596, -18731, -2476, -9848, -38086, -32439, -4947, -39596, -32217, -14005, -4182, -726, -9223, -10971, -13417, -14162, -33892, -46265, -38156, -24573, -35208, -26749, -19516, 10404, 26747, 46296, 45627, 37559, 16888, 8760, 16330, 16372, 2955, 745, 3122, -1684, -18524, -34914, -47266, -15760, 5539, -10397, 4107]
19584D107j759l633j3635n098j3166j8410K2193J8341O920k515K440J1180P088
19571A4053J676L3770K3273J9179R94j9221l2399j389J8058p228j4134L96k4286
19558A2742k4036r553L7144J9220j1319m005k139K5659q776l3186p01J6822K7851
19545D5723k254J8555l804j3589j806k3635j8540q485m831o301j1166J8641K2079
19532A0587K2845k5102j145K803p906L0954l193l1672q5O924K532J3116N296j5487
19518A0467L290P939o430Q642J0855j4125k0360J4779J5354N835n357J2539k6696
19505A6732j9271o084J8617p638K3663L5121R546J2137M3797J9038L5786N8708
19493B40152R4051J96555L08197M10988K85338j71080l76260k26149m2613J30254
$$ y = [4107, 2348, -1285, -14920, -20018, -33184, -51594, -29401, -11060, -4140, -6655, -4215, 6965, 14053, 15729, 49499, 72772, 91951, 92945, 73724, 41325, 39936, 57994, 50766, 36632, 37028, 12742, -11294, -20847, 16297, 35517, 24198, 20193, 18054, 43713, 34937, 1751, 1050, 17872, 45723, 43469, 62024, 58220, 44631, 42825, 19190, 650, -7835, -12666, -18967, -30133, -11492, 10587, 33432, 8330, 7185, 9988, 2082, 33036, 29843, -1829, -1914, 5010, 7542, 20658, 25954, 10467, 13757, 21696, 15266, 23908, 34763, 20638, 278, 15057, 30411, 36246, 30889, 43428, 16732, -2539, -8623, 9994, 2356, 26019, 61140, 70686, 82823, 126620, 145658, 181444, 240152, 334203, 530758, 838955, 1249943, 1535281, 1364201, 987941, 761792, 719179, 849433]
19483H49433L13666L68495N6416l74613m15337k35327r6120m759M2805J10082
19473F14741K69886M17886L49923j03936m07707l07635o1975Q9423K47002L82812
19463A490420J58234l42502m66826k87452j42379j10505l9660k8342o0728j5188
19453A55072J3420J5308L3510j0590k9296m1281k4113K8174N0710L5433O4037
19442B90384J12671K04192K31561N2137j94643j95769o3604l9815l222Q7597J81947
19431F63436J60767m4474k31367j75830q8088m9439l0736k6989m144l7405r500
19420A26231j0605l108j0814j0742K2702L3824L0425j1113q335M9008Q5337J74615
19408D67425K28354J59398p2154k16197j64088q4635R934Q4794J29001J65274
$$ y = [849433, 1163099, 1531594, 1588010, 1213397, 798060, 562733, 466613, 461854, 504659, 614741, 884627, 1302513, 1652436, 1548500, 1140793, 833158, 771183, 860606, 1107608, 1490420, 1648654, 1306152, 839326, 551874, 409495, 298990, 259330, 230988, 170260, 155072, 168492, 183800, 217310, 206720, 177424, 136143, 112030, 140204, 190914, 226347, 290384, 403055, 607247, 838808, 890945, 696302, 500533, 436929, 397114, 393892, 481489, 663436, 824203, 779729, 548362, 372532, 284444, 235005, 204269, 177280, 173136, 135731, 126231, 115626, 112518, 101704, 90962, 113664, 147488, 177913, 166800, 158465, 207473, 292810, 467425, 695779, 855177, 783023, 566826, 402738, 318103, 328037, 412831, 541832, 707106]
19398G07106O9641j58632k00312j33959q2333o0891k1638O442o892p468J1067
19387A22131j556j2316m123J0543k6060K4188M019m0262l8068N2171K2240k1191
19375I1716Q09q156q941P001J2665j1663k8152m450L0342J7566n333l9348j9182
19362C4874k712l228N182K4512L0152j065q74j3274l0880o077n61J7976o347j2572
19348C5106j2134L1315J0389K6873o745O574k830j8944l1304K0005J6563M014
19336G8882j9360j6984M567J7222m019K7775j786j4419J2425J2996L7047K2648
19324A56994o120j9036P516k3588J6275K4191M76J4010j0329K3160M4132L7577
19312B65258L3559K3574L6225K8169O556M4312P0954Q2435R4713N2889K9806K7484
$$ y = [707106, 776747, 618115, 417803, 283844, 201511, 140620, 118982, 125424, 118532, 111064, 122131, 120575, 108259, 104136, 114679, 88619, 112807, 116826, 76564, 38496, 90667, 112907, 91716, 92525, 84369, 75428, 82429, 95094, 83431, 55279, 50829, 81171, 98737, 93404, 54056, 34874, 32162, 28934, 34116, 58628, 88780, 87715, 86841, 73567, 42687, 36610, 36049, 54025, 47678, 35106, 22972, 54287, 64676, 91549, 84804, 91378, 88548, 69604, 38300, 58305, 74868, 78882, 59522, 42538, 47105, 64327, 60308, 88083, 86297, 71878, 84303, 97299, 134346, 156994, 150874, 131838, 139354, 115766, 132041, 156232, 156708, 170718, 160389, 183549, 227681, 265258, 298817, 322391, 358616, 386785, 393341, 437653, 508607, 591042, 685755, 738644, 768450, 795934]
19300G95934K9689L4403M6652L916n0656n6257l1742k4141n7199l7382m4603p3588
19288E35026o7724m0332p7784l4054k5995k3487k9703q893j0813q950l6852l3890
19276A36549p808j8350k6006J4595k7114m384J9707J1270J2335R796k0423l3431
19264F6736q845Q396m224k4418k4983m681m116m385j6614K7974K5506O627m3921
19251i48k5739K7673M8166L2017j7533m4232j9368K6087j6553j5841O57j3027
19239a8641k120N540R837K8045J2246R572j9368l5178L799L0734K4435j6794k5751
19226F356Q827j3585J3716J2665k1q527K6440j4583j6574J5094q652J5314p482
19213B8988k9119r905r076K3633j9362j8427r787K7355R88k19L1418j6392j8179
$$ y = [795934, 825623, 860026, 906678, 910594, 859938, 803681, 771939, 747798, 690599, 653217, 608614, 535026, 467302, 426970, 349186, 315132, 289137, 265650, 235947, 227054, 216241, 207291, 170439, 136549, 128741, 110391, 84385, 98980, 71866, 67482, 87189, 98459, 110794, 120590, 100167, 66736, 57891, 66287, 62063, 37645, 12662, 7981, 3865, -520, -17134, 10840, 36346, 42973, -948, -26687, 986, 49152, 81169, 63636, 19404, 36, 26123, 9570, -6271, -5614, -18641, -20761, -15221, -5384, 22661, 34907, 44479, 25111, -10067, -6268, 24466, 48901, 32107, 6356, 15183, 1598, 15314, 27979, 27958, 19431, 45871, 31288, 14714, 29808, 21156, 36470, 28988, -131, -10036, -19112, 4521, -14841, -33268, -43055, -15700, -14712, -14931, 16487, 95, -18084]
19200a8084k0612L297K4689K2687k890J5045K5417M39p024l7666k3653o209J6194
19187h370K6154m532K508k2644o836J5370K0565o170k5603P075J9286K5927m903
19174C7827k8467J196k192q397J2286K416r838J8354K7409N970J3468k8627j8917
19161B2488J0817j7343m702K3082K3230J2776J988r888K114o371k5237k082K0592
19148E1464j8533P29j191Q049j3263K3726K3272m608r026j0534P773L4121J815
19135I3794p595r492R703k0262k3107j7491m730J4775K096k1777p382J9048Q82
19122B8462j4956J44K0109J6716k2293j6206r849r848J1354M1344J8490R93m3884
19109B0576m1958J0452K0788J1655K7796K5051o396K2938L0077j6434j8315l7999
$$ y = [-18084, -38696, -35399, -10710, 11977, 9087, 24132, 49549, 49988, 42964, 5298, -18355, -24564, -8370, 17784, 13252, 15760, -6884, -13720, 1650, 22215, 16045, -9558, -2483, 16803, 42730, 37827, 9360, 10556, 8364, -33, 12253, 14669, 4831, 23185, 50594, 56564, 70032, 41405, 22488, 33305, 15962, 11260, 34342, 57572, 70348, 72336, 62448, 64562, 58191, 32954, 30872, 51464, 32931, 33660, 32469, 40518, 27255, 50981, 74253, 69645, 60619, 50085, 57858, 91979, 93794, 86199, 76707, 86410, 66148, 43041, 25550, 20820, 35595, 37691, 15914, 8532, 27580, 28462, 13506, 13650, 33759, 50475, 28182, 11976, 2127, -7721, 3633, 44977, 63467, 64460, 20576, -21382, -10930, 9858, 21513, 49309, 74360, 67964, 90902, 120979, 104545, 86230, 48231]
19097D8231j696l435K9141J5323r326J7151k337N174j4260R935j4264j763J4592
19084I2466J816j4505k3059j6138j8944k373J1487P098l268k726L9446J1595O021
19071H8916J733K9164O5946K1706n5079o7686j8885K1996j7660k0701K2335J9240
19059I1025n589K1207K813k2605K2645j2450j3136r189j9693k0216k2405m0597
19047b8190K898L9512J7027J8736P732M522j0185k327J8908n530q116J9361M2575
19034A16923L9708j6383m2465k0020k2051j4290J8138M4603K7j5913L759n821
19022H6215l509l461q645n965k7145l581J5351j133L254k3679j0003N010J5955
19009C8664j3375k0288R301M4565M3522j0757p988J5673m204m735K1258J192j9604
$$ y = [48231, 46535, 43100, 72241, 87564, 78238, 95389, 93052, 98226, 83966, 93901, 79637, 77874, 92466, 94282, 79777, 56718, 40580, 21636, 19263, 30750, 37848, 34580, 31854, 71300, 82895, 88916, 90649, 119813, 185759, 207465, 152386, 84700, 65815, 87811, 70151, 49450, 71785, 91025, 85436, 106643, 109456, 86851, 109496, 97046, 83910, 74721, 55028, 34812, 12407, -28190, -25292, 14220, 31247, 49983, 57715, 62237, 52052, 49725, 68633, 63103, 54987, 74348, 116923, 156631, 140248, 97783, 77763, 55712, 41422, 59560, 104163, 104190, 88277, 92036, 86215, 82706, 79245, 70600, 64635, 37490, 33909, 49260, 48127, 51381, 27702, 17699, 22709, 38664, 25289, 5001, 14302, 58867, 102389, 91632, 83644, 99317, 95113, 90378, 111636, 112828, 93224]
18996I3224r34J5040j2541p362k3023P213O664r737j0438K7446q10j7221J8835
18983H6356k3326p952J7641p871K223O62L9284P5453K3304r954Q341j8924l2149
18970A53088L1837j2447k9778P078J4845K4620K3646k0643k8702J0382J0763J7921
18958B02610j7755j2946O327J7385R003p445q520K711j4073k6412k1958N758J086
18945A35771J6364N6585L4754k4026r451J0161j1180k8097M913L0084K1886O0044
18933B97808J7707L8785J8893k9733n4062k196K3183J0031K0214k1328k0546J3428
18921C12184Q016J3417l0387l4005j1375K2133L1300J8465J4629L1866N8957P9652
18909E14852Q0624J54829K41212J94893j1336k12429k04452j05626p2552l4432
$$ y = [93224, 92290, 107330, 94789, 87427, 64404, 71617, 78281, 68544, 58106, 85552, 84742, 67521, 86356, 63030, 55078, 72719, 64848, 67071, 67733, 107017, 182470, 205774, 195820, 204161, 185237, 153088, 184925, 172478, 142700, 149778, 164623, 189243, 212889, 192246, 163544, 173926, 184689, 202610, 184855, 171909, 178236, 195621, 204624, 197179, 188659, 191370, 177297, 150885, 128927, 134685, 135771, 152135, 208720, 243474, 219448, 209997, 220158, 208978, 180881, 185794, 215878, 237764, 297808, 315515, 354300, 373193, 343460, 289398, 287202, 310385, 320416, 340630, 319302, 298756, 312184, 320200, 333617, 303230, 269225, 257850, 279983, 311283, 329748, 344377, 376243, 435200, 514852, 595476, 750305, 991517, 1186410, 1175074, 962645, 758193, 652567, 580015, 545583]
18899E45583J1022J945j8425J918L0808L4814M3152M5764Q9191J67915K41555
18888A195242J43187p2202j81926p4878R778M0391R4539J68341K36654L8538j98957
18877A398707j66282m1266N2286L0929L6029K6046L7406M1916R1016J25080K59692
18866A891559L19418L06785M03167N36673N38774L98894L94216M92920P81374
18857F063780J156900J623740K147056L017985M621022P657538J3150763K2815330
18849F2254114L5459617L7050911j217500l8434125l1108548j3084926p17721
18842E0201822R663375K2314501L4445408K4912825k1713312m3361089k8761069
18835D7702461j4697389p854939m690257l222944k389540j619282j053476o33731
$$ y = [545583, 556605, 558550, 540125, 542043, 572851, 607665, 650817, 696581, 785772, 953687, 1195242, 1338429, 1266227, 1084301, 1009423, 1019201, 1059592, 1154131, 1322472, 1559126, 1597664, 1398707, 1232425, 1191159, 1243445, 1274374, 1310403, 1336449, 1373855, 1415771, 1506787, 1631867, 1891559, 2210977, 2517762, 2920929, 3457602, 3996376, 4395270, 4789486, 5282406, 6063780, 7220680, 8844420, 10991476, 14009461, 18630483, 26288021, 39438784, 62254114, 97713731, 134764642, 133547142, 95113017, 64004469, 50919543, 50201822, 59865197, 82179698, 116625106, 141537931, 119824619, 76463530, 47702461, 33005072, 25150133, 20459876, 17236932, 14847392, 13228110, 12174634, 11540903]
18827A1540903k75340P0962N88520J030606J276012J985834L550618O069930J0530085
18818C6368130J8356279L0769391M1814796K4377459k6800797m1623133k3228165
18811F0033960o836216M630405J6771747L1195271L7108932L727429m2022148
18804A04609380m0992150k2666208j1695165o713157m325495l297760k786201
18797A2133244k217704j552659j025584o99134m23215k34137m45164q35906q08210
18788C891531m89779k79576k19437k11874j95725j51650m0111J166K15252M92433
18778C012230N29737K9357m18652l57280l42722k47949j7907K88429O11235P51763
18768C838241K00458n06068o88732p20516n50971l05831j92724j29674j02553
$$ y = [11540903, 11265563, 11336525, 11925045, 12955651, 14231663, 16217497, 19768115, 25838045, 36368130, 54724409, 85493800, 127308596, 151686055, 124885258, 83262125, 60033960, 53197744, 57828149, 74599896, 105795167, 142904099, 146631528, 104609380, 63617230, 40951022, 29255857, 22542700, 18217205, 14919445, 12133244, 9915540, 8362881, 7337297, 6638163, 6214948, 5980811, 5535647, 4699741, 3891531, 3401752, 3122176, 2902739, 2690865, 2495140, 2343490, 2303379, 2304545, 2519797, 3012230, 3541967, 3571324, 3152672, 2795392, 2452670, 2204721, 2186814, 2475243, 3086478, 3838241, 4038699, 3532631, 2843899, 2123383, 1572412, 1266581, 1073857, 944183, 841630]
18759H41630p1977p2934m5144m8935m6703o7667n3190l6403k7713K8882J5799
18748D15645j3332k4460k2566l2226k1640k2148j2933K8756j5214j0441K0417
18737B89858L3742R60j233q011K094K2624L0733K0208K2083J14695J88723L03087
18725A019563M05880J78257k72891l48798j34966J5204J46645L40531N41624N28948
18715B419997p7757o17480n23602k82235j01467J720Q9674K20822J54368j89686
18705A094354l36442k39044j38214q3300k3792m5883l6804k5431j4864j4768J790
18694A37602j7370k2971j4977q523M5352M9284j0901J147K5018J4486K7680q079
18682B17748l2423J955L2457n200J1461K096m3455j1380n925m4770O61J1540J8246
$$ y = [841630, 769653, 696719, 651575, 602640, 555937, 488270, 435080, 398677, 370964, 399846, 415645, 402313, 377853, 355287, 323061, 301421, 279273, 266340, 295096, 279882, 269441, 289858, 323600, 324560, 323327, 315316, 317410, 340034, 370767, 390975, 413058, 527753, 716476, 1019563, 1425443, 1603700, 1330809, 982011, 847045, 862249, 1008894, 1349425, 1891049, 2419997, 2342240, 1724760, 1201158, 918923, 817456, 819176, 908850, 1129672, 1284040, 1094354, 757912, 518868, 380654, 297354, 273562, 227679, 190875, 165444, 150580, 135812, 137602, 120232, 97261, 82284, 73761, 119113, 168397, 157496, 158643, 183661, 198147, 225827, 217748, 185325, 187280, 219737, 214537, 225998, 228094, 184639, 173259, 167334, 122564, 123225, 134765, 153011]
18669A53011j4879j2776L687j1876o319o27l1580l2322j9191K0842K9876J474
18657G9320N058l507Q294k8999n727l4111R917K7821j4294k395J0075j1211J8157
18644E8398l253j1637J74J5134P809r104K952L7482N181O424Q959m484k9667k5909
18630E8459N466J483O854j4323L677r442Q878R048k0704k2272q098j4307J7255
18617B1974L9564K5129K2462N789k1179k207J4232o767o996k0361J4119M4029
18605A29788n789j2822j2847L869k3163M028J0907L0150K7811K018j8681j2306
18593A22963p097j908L1279K8531K5917L1942K683L9193O3538Q5200J30251K06535
18581G59027K75101J50137J4900m8940j83635j44878K0087J65949J67605M1573
$$ y = [153011, 138132, 125356, 129043, 117167, 110848, 110221, 78641, 46319, 27128, 47970, 77846, 79320, 84378, 80871, 89165, 60166, 54439, 20328, 30245, 58066, 43772, 41377, 51452, 40241, 58398, 55145, 43508, 43682, 58816, 66625, 57521, 60473, 97955, 103136, 109560, 118519, 114035, 84368, 58459, 63925, 65408, 72262, 57939, 61616, 52174, 61052, 70100, 49396, 27124, 19026, 4719, 21974, 61538, 86667, 109129, 114918, 93739, 91532, 105764, 98997, 92001, 71640, 85759, 129788, 123999, 111177, 98330, 102199, 79036, 83064, 93971, 124121, 151932, 153950, 135269, 122963, 115866, 113958, 145237, 173768, 199685, 231627, 234310, 273503, 337041, 422241, 552492, 759027, 1034128, 1184265, 1199165, 1150225, 966590, 821712, 841799, 1007748, 1175353, 1216926]
18571A216926o9983j55128k77696j93623j55029r7009l2308m120n2303j7612p610
18560A54505J1505K7675K4008K7516J6867K6411K9932K3535J09060J78990K49197
18549H79201L18470K72153P5280j5177k03380k55089m8940J47428K67991J25341
18539A563278o8258j46257k96179k60167r1046Q5862J31684k3719k09129j99503
18529D86566j15009r1377l9594j3821k4503j4740q195j7387j1206j156j4231L2087
18517A67434o838J6465M0063K6757R94J8488N6589J18501J91296K73851J50440
18506A054040m2174K7325K69297L77425k71m40214m80546k58549j70154q7298
18496B48881o6333l7478k090m812J414p11J1289p19k301l9521k5538p551J4312
$$ y = [1216926, 1146943, 991815, 714119, 520496, 365467, 268458, 236150, 232030, 179727, 162115, 154505, 166010, 193685, 217693, 245209, 262076, 288487, 318419, 341954, 451014, 630004, 879201, 1197671, 1469824, 1545104, 1529927, 1326547, 1071458, 1022518, 1169946, 1437937, 1563278, 1495020, 1348763, 1052584, 792417, 701371, 787233, 918917, 895198, 686069, 486566, 371557, 280180, 240586, 226765, 202262, 187522, 179327, 161940, 150734, 149578, 135347, 167434, 160596, 177061, 217124, 243881, 244875, 263363, 319952, 438453, 629749, 903600, 1054040, 1011866, 1039191, 1308488, 1685913, 1685642, 1245428, 764882, 506333, 336179, 248881, 182548, 145070, 142980, 138168, 139582, 138871, 150160, 149441, 147140, 107619, 82081, 74530, 88842]
18483H8842K0056K0998K3754K1435L279L655j6205J450L8606J01373J71417K83896
18471G62556L93268K50527j79369m15896k94013j25917q9792o6487j5128m3971
18461A75778l3909o949L0741j7798k7052j9949k4676r122L951k4259j0146K0986
18449E7596L4611J8000k3238P81J4291j5250R446J3364q301o1177j6145K4415
18437D8393j1414k2315K2925K2361K2816J0257l987Q452q784l161R420j3073J845
18424H3735J4109k648j3291K7792N118L8536l904o201j4705K16m662l987r660
18411A10448j0687J0193m207O283K556k3780j5528j6225j5356J567L1429J7400
18399I4093n52j8678j8110N16l098R41j1191Q265J6260j442j1586N823J0402L1909
$$ y = [88842, 108898, 129896, 153650, 175085, 178364, 182019, 165814, 167264, 205870, 307243, 478660, 762556, 1155824, 1406351, 1226982, 811086, 517073, 391156, 301364, 234877, 219749, 175778, 141869, 134920, 165661, 147863, 120811, 100862, 76186, 67064, 71015, 46756, 36610, 57596, 92207, 110207, 86969, 87750, 102041, 86791, 96237, 109601, 101300, 40123, 23978, 48393, 36979, 14664, 37589, 59950, 82766, 93023, 89036, 97488, 88704, 85543, 94963, 81890, 83735, 97844, 95196, 81905, 109697, 114815, 153351, 149447, 143246, 128541, 128757, 124095, 120108, 110448, 99761, 109954, 105747, 112030, 114586, 90806, 75278, 59053, 43697, 45264, 76693, 94093, 93541, 74863, 56753, 57269, 54171, 55112, 43921, 52186, 68446, 67004, 55418, 61241, 71643, 103552]
18385A03552N698l6087j5401N703J7538Q015l0503k0343j1042j1891K9471M6283
18373I0993J2072k7854j2382R861K2848j4384J0201p598k3613j3474J208L4271
18361H2149l313m3272j8763K8093J5668k4722Q88Q524Q882J5500j8503l1675Q99
18348B0355P545j8442k148k2111P352n271j3608J149L5329L0028K469j976l2875
18335G796R889J9011L6447J4296o728p287L1748N2116N2536J07470K06545K58709
18323G82548J89055m1668j80414n3961J18076J51352l5734k47933k21936j26351
18313C33034p8531k7399m253J2021L0968R0107J45274K18371K28239K0842j51483
18302H17190j02546M0871J54270N7241j65234k37415j30046l5178M6230O8507
$$ y = [103552, 109250, 73163, 57762, 63465, 81003, 89018, 58515, 38172, 27130, 15239, 44710, 90993, 103065, 75211, 62829, 72690, 95538, 81154, 91355, 83757, 60144, 46670, 47878, 82149, 78836, 35564, 16801, 44894, 60562, 35840, 36728, 45252, 54134, 69634, 51131, 19456, 20355, 27900, 9458, 7310, -14801, -7449, -12720, -26328, -25179, 10150, 40178, 42647, 40671, 7796, 17685, 36696, 73143, 87439, 80711, 73424, 105172, 157288, 209824, 317294, 523839, 782548, 971603, 929935, 749521, 695560, 813636, 964988, 929254, 681321, 459385, 333034, 254503, 227104, 222851, 234872, 265840, 355947, 501221, 719592, 947831, 968673, 817190, 714644, 755515, 909785, 967026, 801792, 564377, 434331, 399153, 445383, 513890]
18292E13890J26928J60239N8343j23646q0477M1879Q0055L3479j78801k23205
18282D08684r5926m7115M424j3187k3499J5902L6228R6605J64249J95040Q5255
18271H26660j11836j24044m098O5798J22908q8237j96865j54374r4857n0828R711
18260A99938O880q806q456L141j1631P862K4903K1158L0141O3651J44886J72665
18248F46332J09479r0594j94712j41872P22N1100O9357J71679J93680N9293k06150
18237F68314j99040p3745m7267m7640o2441m40o105R951j5609k5578l5397j5M8926
18224B13914J7154K6331L0901N7396N6620P5747J75664K09967K19876k2293k22876
18213H38401k39933j21049n0442L2536J60534K25523J62833j04552k42480j52171
$$ y = [513890, 640818, 801057, 859400, 735754, 655277, 697156, 777211, 810690, 631889, 408684, 312758, 265643, 270067, 256880, 233381, 249283, 285511, 382116, 546365, 741405, 826660, 714824, 590780, 586682, 652480, 775388, 687151, 490286, 335912, 241055, 190227, 199938, 206818, 198012, 189556, 192697, 181066, 188928, 213831, 234989, 265130, 328781, 473667, 646332, 755811, 665217, 470505, 328633, 329355, 380455, 449812, 621491, 815171, 874464, 668314, 469274, 395529, 348262, 300622, 238181, 237741, 231636, 241587, 225978, 200400, 165003, 164988, 213914, 231068, 257399, 288300, 345696, 402316, 478063, 653727, 863694, 1083570, 1061277, 838401, 598468, 477419, 426977, 459513, 620047, 845570, 1008403, 903851, 661371, 509200]
18203E09200r4601l1813J1431P3120O7531o3093o2069o5835j0809m9446n7975
18192B25641l6227m880j3563K1510J0751J7386K4690p133l8097o377m402j5096
18180A74203j3025L290Q00N454L924J6781Q118j0515L1592K9239k134L8622O7919
18167C54268O8643K6929n756k4805p7223m2844r624q152J7445k138k9036p437
18155B60270k3433j2118l224K4353Q530o715m629J9520J930J9001k1512r936L6497
18142B88534L6846K3013k2469l3367k1783L9065P0218L8187L6815M7550P3996
18131E76605Q9702N2554M8755J14156K22189L70050M72936L70907j35121l95122
18121A787611j93146M0272J73364K50433L55289N90068R25501J509555K567826
$$ y = [509200, 414599, 382786, 394217, 467337, 534868, 471775, 409706, 343871, 333062, 283616, 225641, 189414, 184534, 170971, 192481, 203232, 220618, 245308, 238175, 200078, 193701, 189299, 174203, 161178, 164468, 165268, 170722, 174646, 191427, 199545, 189030, 220622, 249861, 247727, 286349, 354268, 422911, 449840, 444084, 419279, 342056, 299212, 289588, 281436, 298881, 296743, 267707, 260270, 236837, 224719, 221495, 245848, 254378, 247663, 243034, 262554, 264484, 283485, 261973, 252037, 288534, 325380, 348393, 325924, 292557, 270774, 309839, 380057, 418244, 455059, 502609, 576605, 666307, 718861, 767616, 881772, 1103961, 1474011, 1946947, 2317854, 2182733, 1787611, 1594465, 1634737, 1808101, 2058534, 2413823, 3003891, 3929392, 5438947, 8006773]
18112H006773M597549Q310742J3803395J7659033O053969j5876991j7919179r919385
18104A4715906m943448k701091j652959j093779p25925n13302m91347l68226k69348
18095A956481j50423j3569J02147K88071L37094o1800n18798n35474l27742j99923
18085H76064r8159q2098p1246o2383k4088N22k5862J490k6263n6190K0375J02852
18073E55014O3873M5116K3354o4915o3653k0961K118L1129O7382L8148k6682j10799
18061E39124j01274n7457j3213m969p938k5922p165J7951J3304K9688J3712k4711
18049C71130k0583l820K8887p269J384N3414J5031K7916M8614l812J1960l9949
18037D82903m2754k0510o941n367j7609l5220l5761j7369K1026N246j7489J0999
$$ y = [8006773, 12604322, 20915064, 34718459, 52377492, 58431461, 42554470, 24635291, 14715906, 9772458, 7071367, 5418408, 4324629, 3598704, 3085402, 2594055, 2225829, 1956481, 1806058, 1792489, 1894636, 2182707, 2519801, 2458001, 1939203, 1403729, 1075987, 876064, 777905, 695807, 624561, 562178, 538090, 538612, 512750, 514240, 487977, 431787, 452162, 555014, 618887, 664003, 687357, 622442, 558789, 537828, 539946, 571075, 638457, 676605, 649923, 539124, 437850, 380393, 367180, 362211, 354273, 328351, 321186, 339137, 352441, 382129, 395841, 371130, 350547, 346727, 375614, 368345, 369729, 423143, 438174, 466090, 514704, 510892, 522852, 482903, 440149, 419639, 412698, 407331, 389722, 354502, 318741, 301372, 322398, 327644, 310155, 321154]
18025C21154j5597j3177L5386J6167O898p306q321N996r910L1938O0425K7382
18013D51035K0363M1918J14671J85187K30020Q6251j30875j90227j26917m6342
18003F35084k0762k5453J939m8574m6096j3328J4230N7704K121j1592P149L8004
17991E90426M0900p979L7465O3502J18558J90591K44761K59738J58250l1571j61653
17980A502988j31143m5387P667m9883j170O4209J37661K17504K39845K70057M25963
17969B638311O20425O06381J11125J10142M42654J51260k33384q5661J97537L87335
17959D946125N97326Q50680J302530J726171K277935L226617M729760O903501
17951B6560645J0884859J9319762L4902732N9196509Q4336105O0308844m8568649
$$ y = [321154, 305557, 292380, 327766, 343933, 350831, 343525, 335204, 341200, 331290, 363228, 423653, 451035, 471398, 513316, 627987, 813174, 1043194, 1129445, 998570, 808343, 681426, 635084, 614322, 588869, 590808, 542234, 496138, 482810, 497040, 554744, 556865, 545273, 552422, 590426, 631326, 623347, 660812, 724314, 842872, 1033463, 1278224, 1537962, 1696212, 1664641, 1502988, 1371845, 1326458, 1334125, 1284242, 1283072, 1347281, 1484942, 1702446, 1942291, 2212348, 2638311, 3258736, 3865117, 3976242, 4086384, 4529038, 4680298, 4446914, 4361253, 4558790, 4946125, 5543451, 6394131, 7696661, 9422832, 11700767, 14927384, 19657144, 26560645, 37445504, 56765266, 91667998, 150864507, 235200612, 295509456, 246940807]
17944B46940807r5463043o1467065l1373535j6901561r968582o163313m056650
17937B1547058l096987k372266j907391j549700r17863o89872r86414q45764m34744
17928H746057k2062M88803J119816J751503J860547J141329J169455K617291M706985
17919B3579724P532864J3128406K3911589M2390091O7655789P8510637R606296
17912B66315396q1819648p7058993m1406254k1344777j2079125p461520m829285
17905B0315794l588534l086114k406359j762936j352566j115374r19096p00387
17897E384428n33111l82457j66634J44339M94336N74140r8785j001595j051873
17888C362788o99822m02725k11880j68130j52836j67704j46472j47442j09708
$$ y = [246940807, 151477764, 90010699, 58637164, 41735603, 31767021, 25603708, 21547058, 18450071, 16077805, 14170414, 12620714, 11702851, 11012979, 10026565, 9180801, 8746057, 8723995, 9212798, 10332614, 12084117, 13944664, 15085993, 16255448, 18872739, 23579724, 31112588, 44240994, 68152583, 110542674, 178198463, 256709100, 266315396, 184495748, 107436755, 66030501, 44685724, 32606599, 25145079, 20315794, 16727260, 13641146, 11234787, 9471851, 8119285, 7003911, 6084815, 5384428, 4851317, 4468860, 4302226, 4446565, 4940901, 5515041, 5416256, 4414661, 3362788, 2662966, 2260241, 2048361, 1880231, 1727395, 1559691, 1413219, 1265777, 1156069]
17879A156069j18698j24592q8613k4054j1349q531L909Q400q160j725O5576K3335
17867H71567m709M337o1659q9285o7836l4086k3569l5657n9517m7131k3537j7480
17855D11438k9607j7772j7995n914k0040l2197n676J4637J1176o871k628p509
17843B91042k3056n004p271L3410L1437L157J5927J416Q679j5505L1776M3203
17831D09211k0055l6476j9485m9967m7085j1122j3348J133k56o19J993P668L8320
17818B59912R586k1428k5052N576k3550l6361o088n252L340K3476J9457O752J7093
17805B27461N894k2313k2815J0443Q304j4640l4957k5116l8178l2145j9463J6893
17793E9368j1034k4112Q029k5655K9572O2732M7943L1734K2016k0420P449k6104
$$ y = [1156069, 1037371, 912779, 824166, 800112, 788763, 780232, 784141, 792541, 784381, 782656, 848232, 871567, 866858, 871195, 809536, 720251, 652415, 618329, 594760, 559103, 499586, 452455, 428918, 411438, 381831, 364059, 346064, 340150, 320110, 287913, 282237, 296874, 308050, 301179, 298551, 291042, 267986, 262982, 255711, 289121, 320558, 323715, 339642, 341058, 349737, 334232, 366008, 409211, 389156, 352680, 333195, 283228, 236143, 225021, 211673, 212806, 212550, 211931, 213924, 221592, 259912, 269498, 248070, 223018, 228594, 205044, 168683, 162595, 157343, 160683, 184159, 203616, 210368, 227461, 233355, 211042, 188227, 198670, 206974, 192334, 157377, 132261, 94083, 61938, 42475, 59368, 48334, 24222, 32251, 6596, 36168, 98900, 146843, 178577, 200593, 180173, 187622, 161518]
17781A61518l3241j0652k5794l9718R500J4640J4158N0994J521R19m2020r471
17769I2354M241O55j6723j9941N273j814n403J4697m6487l1987J738k0271j9140
17756d2808l517N6911L9095p030j7053J4487M6048L4023R071l2446n0624k311
17744D3846J5017J218K1812J0321O1275P3009J8734k0101m3900m7844l0642k2412
17732H0333J1165K6357Q354m002j5641k3542J3733p923j5137q478M458q310j1743
17719D9624j9955K624J2502L8362K1005J7492k3987k5053J4727P004L1577M0486
17707A66408L3239K1588K596K531l7864l7354l9608J4621K2621K4290l586j8923
17695A50559j0464m5108j1751P683j2193P39J6032N862q210j2946M158k2480p357
$$ y = [161518, 128277, 117625, 91831, 52113, 61613, 76253, 90411, 141405, 142926, 143845, 101825, 92354, 96595, 97250, 80527, 60586, 65859, 64045, 58642, 73339, 26852, -5135, -3397, -23668, -42808, -46325, 10586, 49681, 42651, 25598, 40085, 86133, 120156, 129227, 96781, 46157, 43846, 58863, 60081, 81893, 92214, 153489, 226498, 245232, 225131, 181231, 133387, 102745, 80333, 91498, 117855, 126209, 122207, 106566, 83024, 96757, 88834, 73697, 65219, 69677, 61367, 49624, 29669, 32293, 44795, 83157, 104162, 121654, 97667, 72614, 87341, 94345, 125922, 166408, 199647, 221235, 223831, 226362, 188498, 151144, 111536, 126157, 148778, 173068, 169482, 150559, 140095, 94987, 83236, 90919, 78726, 79465, 95497, 101359, 93149, 80203, 84361, 61881, 54524]
17682E4524J5248r632p381l588k177m978j0512N639M0371K1562j9752k8301m0285
17669A0738k1231K7014J7758o083J9478N4645n816l8687J2998L9105J3850Q574
17657A32343J3030o384J9674M013K357j0600J01K193k3188l2043k1461O580J7443
17644A04058J7535M7295L6015M2444P5245J34178K48547L01130L05621J88271
17634A500339j06289l37772l55284k33379j25594o8601l4264k4006j78l6050k4182
17623A54740j3348j6894p862J3939p997k2044l2757J0310J5331J3950l89J24k855
17610A04248J3867M5635N3128O3210O9566J59722K45784K87436K14123L2277j87457
17599A101539k86279k85831j75408j04616m8108l2796k3176Q522j7662j6512k1686
$$ y = [54524, 69772, 60140, 52759, 49171, 46994, 42016, 31504, 37143, 77514, 99076, 79324, 51023, 10738, -10493, 16521, 34279, 28196, 47674, 102319, 96503, 57816, 70814, 109919, 123769, 132343, 145373, 138989, 158663, 162676, 165033, 154433, 154534, 156727, 133539, 101496, 80035, 86615, 104058, 121593, 168888, 204903, 247347, 322592, 456770, 705317, 1006447, 1312068, 1500339, 1394050, 1056278, 700994, 467615, 342021, 273420, 239156, 215150, 214972, 178922, 154740, 141392, 124498, 116636, 130575, 122578, 100534, 67777, 78087, 93418, 107368, 106979, 107103, 104248, 118115, 163750, 216878, 280088, 349654, 509376, 755160, 1042596, 1256719, 1288996, 1101539, 815260, 529429, 354021, 249405, 201297, 168501, 145325, 153847, 136185, 119673, 97987]
17588I7987k5361k0045J981m082n398J0653K0279j9569p604n944N104P688j079
17575E4610J8047J3526k94j7345l8664l2644P823j1579J2576J540J5302M066N266
17562C2230N51L5293J8900k9037k2411l5148j9429j0533J5001J83L285K5971J0255
17549B5111l2398K4024q501m022J5844L116J3508m300j9097J5255O379p836m298
17536B2785J6513J6197J5663N4292M1576K8655j137n7527m8167k7415m161J8685
17524G5959j5968m2835j2429L0157K9469J2579j8455k1498m19k457J835j1170
17512B4768n481J830j5672l5704J2740J1135J1380L0844k4650Q507L1924l604
17500D8017j696M8869K1385j1391k7002l8942k5059j4394l0687q823P900J5864
$$ y = [97987, 72626, 52581, 54562, 50480, 45082, 55735, 76014, 56445, 48841, 42897, 48001, 55689, 54610, 72657, 86183, 85889, 68544, 29880, -2764, 5059, -6520, 6056, 7596, 22898, 26964, 32230, 32781, 68074, 86974, 57937, 35526, 378, -19051, -29584, -14583, -14400, -11115, 14856, 25111, -7287, 16737, 8236, 4214, 20058, 23174, 36682, 32382, 13285, 28540, 34919, 27083, 22785, 39298, 55495, 71158, 125450, 167026, 195681, 194544, 137017, 88850, 61435, 57274, 75959, 59991, 17156, 4727, 34884, 64353, 76932, 58477, 36979, 36560, 34103, 35938, 24768, 19287, 21117, 5445, -30259, -17519, -6384, 4996, 35840, 11190, 19697, 51621, 48017, 46321, 95190, 116575, 105184, 78182, 39240, 14181, -213, -30900, -39723, -31823, -15959]
17488a5959j657J4795j3818j5476O168N474J0632P278m8370n170J124M284J37
17475e0558J0056K9357K1837k656J3314O409l0128k5275k2997K2781J751N571
17463b0538K5991J8653J0707o549m0535k6747r103J7365j1241J9628N109J7658
17451C98k842M245j1775K0617m2K206L5803L5942Q4322J00114m173p1327q6807
17438A06681o7852m2660q513K5013J3769q382k828j086j0107K88J2116j4041L3561
17425C5959k925k1680l249M98k3957q078J7389K294k261j6317N185q200R799k672
17411a8215j1249r089J56k6638m055Q666K4046K3503j4338k6945K1539K5251L0992
17398B3624Q035J706J5140j579k2262Q798p45r045N1645K6260L1295Q5023K04718
$$ y = [-15959, -17616, -2821, -16639, -32115, -25947, -20473, -9841, -2563, -50933, -56103, -54979, -50695, -50558, -40502, -11145, 10692, 8036, 21350, 27759, -2369, -27644, -50641, -27860, -26109, -20538, 5453, 24106, 34813, 28264, -12271, -39018, -48121, -30756, -41997, -22369, -17260, 398, -2444, 1801, -9974, 10643, 10601, 12807, 48610, 84552, 168874, 268988, 264815, 193488, 106681, 38829, -3831, -12344, 12669, 26438, 18056, 15228, 14142, 4035, 4323, 16439, 2398, 35959, 33034, 11354, 8105, 8603, -15354, -23432, -6043, -3749, -6010, -22327, -17142, -25342, -15543, -18215, -29464, -38553, -38397, -65035, -69090, -60424, -36378, -12875, -27213, -54158, -32619, -7368, 23624, 31659, 33365, 48505, 46926, 24664, 33462, 32717, 23672, 75317, 101577, 132872, 217895, 422613]
17385D22613K56750L84724M31242R830m14817l99335k92296j29088m9153n0986
17375A69484k5805k9536l8053k7574k8142J4483j1073l4289n709R846L3035N318
17363C1985K2870L0523j1662K5945K6715M691j901J8008N6593Q9182J59526L09560
17351G62035L94482K62724k26079m33995k84839j70309j02705n0776l9491n1580
17341E9467l8380M747p968j2644Q024M511o815k1179k1277K5335K0440J7367N768
17328C7396N018m5254k6112r779J7363L1549K598k1945j0570q90J7060j7057N118
17315a5505J5996J8534m870j4360j111K9736K995k2081p043j3473K5426K4079
17303C8323K5441j1180l7686j0525J4574J2436r321k3364J2235j072j4765Q453
$$ y = [422613, 679363, 1064087, 1495329, 1505159, 1090342, 691007, 398711, 269623, 220470, 169484, 143679, 114143, 76090, 48516, 20374, 34857, 23784, -10505, -16214, -6368, 26667, 31985, 54855, 85378, 73716, 99661, 126376, 131067, 129166, 147174, 203767, 292949, 452475, 762035, 1156517, 1419241, 1193162, 759167, 474328, 304019, 201314, 150538, 111047, 59467, 21087, 25834, 17866, 5222, 13246, 17757, 10942, -10237, -31514, -6179, 14261, 31628, 37396, 42414, -2840, -28952, -38731, -21368, 10181, 12779, -9166, -19736, -20626, -3566, -20623, -15505, 491, 19025, 14155, -205, -1316, 28420, 31415, 9334, 2291, -11182, 14244, 38323, 63764, 52584, 14898, 4373, 18947, 31383, 22062, -1302, 10933, 9861, -4904, 3549]
17291C549K1160r570l336j308j764j5821j2013P761P57J325o684j4597J7214J2986
17277c41M497l677r111L512p26O53o544J4728l4669r451J5906q074j0508J4663
17263b9142j1479j536J3478J2074j7455O700n896L2666Q122k2777j6465p411l136
17250d2257j4285L2633O689j4296j9524J2431n641L046k3460J4963O7673M3124
17238F1096J4857k3531k6863k4961j4341j491L546l4793m4785L651R530K6358
17226e1727K0868j5425J924K6268r814q263K3584K1077j1746k3704O646l138J1609
17213a1841J3339j8603P773J5299K3981j1547N716P194k6039l8625R179J0519
17201a3655J5049J2097n251N97r671K121j8811k326j2522K9264L9601j6435j5233
$$ y = [3549, 24709, 15139, 11803, 10495, 8731, -7090, -19103, -11342, -10585, -9260, -15944, -30541, -13327, -341, 4156, 479, -8632, -5120, -5846, -5193, -11737, 2991, -31678, -41129, -25223, -33297, -43805, -29142, -40621, -42157, -28679, -16605, -34060, -27360, -33256, -590, 7532, -15245, -31710, -39121, -42257, -56542, -23909, -17220, -31516, -51040, -38609, -44250, -41204, -64664, -49701, 17972, 61096, 75953, 52422, 25559, 598, -13743, -15234, -11688, -46481, -91266, -87615, -78085, -51727, -30859, -46284, -44360, -18092, -27906, -36169, -12585, 8492, -3254, -26958, -20312, -23450, -11841, 1498, -17105, -9332, 5967, 29948, 18401, 24117, 31311, 5272, -33353, -24174, -13655, 1394, 13491, 8240, 8837, -834, 1287, -17524, -19850, -32372, -3108, 36493, 20058, 4825]
17188D825Q09r770M584j9877R185P654k9095r3p191l0800O258M5201K3063j3575
17174h822j6923j2443J0696J2534J771j290j6289j1263M650J7403K9633M022J299
17161A4978j3138j4844l629j7423m273L076K7855J075J101k3829p29j4420j571
17148d5771J9449K3915r220k807k3153o666l839O46K7920R014j3678M744J5292
17135d154J0971j0315o534N564K067k341L5542p704k3204j2368p743Q135m778
17122a6862J196k5152J3788j2008P843R824r327J7218j0454P256J6401J0397O034
17109A6154j7520l597K3178q369j7334M952p19p42o143K921L5226m033l6395m093
17095a6514o703j2115J9984L7528Q830j3627M039m2m370j9854j6602k2022j6742
$$ y = [4825, 5634, -4136, 448, -19429, -10244, -2590, -31685, -31778, -38969, -69769, -63511, -18310, 4753, -8822, -25745, -38188, -27492, -14958, -13187, -14477, -30766, -42029, -37379, -19976, 9657, 13679, 14978, 1840, -13004, -16633, -34056, -38329, -35253, -7398, -6323, -5222, -29051, -29780, -44200, -45771, -26322, -2407, -11627, -14434, -37587, -44253, -48092, -47446, -19526, -10512, -24190, -19446, -4154, 6817, -3498, -10032, -4468, -2401, -4742, 30800, 23096, -108, -12476, -20219, -12084, -16862, -15666, -40818, -27030, -39038, -31195, -21371, -30698, -13480, -23934, -16678, -277, 10120, 16154, -1366, -4963, 18215, 9846, -7488, -2536, -3255, -3997, -10140, -7219, 28007, 23974, -12421, -16514, -23217, -35332, -15348, 22180, 31010, 17383, 21422, 21380, 17010, -2844, -19446, -41468, -58210]
17082e8210M0357J6334k4791J9821p929K475M894R073k910k6221l590K2501J7401
17069I205k3335J0715n953k6752q948L260N549N416l6906J643j014Q346M0261
17056a8513Q762l73K3375J4313m0003l9591L3035K8589j8000Q212J6258l0550
17044a4486N132J1947Q209j4296k3241k1819k5378n682L267L4682J9058j6043
17032c8650k43J2396J2594k2005n321R834K0662L2509o163q209r477J616l3929
17019c4386j0645K6741J8512L523j9157N497N824n623j2487k7687J1757J2526
17007b5605L4425n753k4206q778Q700P553j9082R629J434j8995J5937K7760m661
16994a642J8490K6376K0770q618l3051l2712l8917P389n145k6535P253L9534q124
$$ y = [-58210, -17853, -1519, -26310, -6489, -14418, -11943, -7049, 2024, -886, -27107, -30697, -8196, 9205, -14130, -3415, -9368, -36120, -45068, -41808, -36259, -30843, -67749, -66106, -67120, -58774, -18513, -9751, -10124, 13251, 27564, -12439, -52030, -18995, 9594, -8406, -194, 16064, -14486, -9354, 2593, 10802, -3494, -26735, -48554, -73932, -79614, -76347, -41665, -22607, -38650, -38893, -26497, -13903, -35908, -41229, -31395, -10733, 21776, 15613, 7404, -2073, -457, -34386, -45031, -18290, 222, 3745, -15412, -9915, -4091, -9714, -22201, -49888, -38131, -25605, 8820, 3067, -21139, -29917, -21217, -13664, -32746, -23117, -21683, -40678, -24741, 3019, -1642, 16848, 43224, 63994, 55376, 22325, -10387, -49304, -41915, -47060, -73595, -66342, -26808, -34932]
16981c4932p175K0877j9025j1691J2259J3176L6701K4267k4079j1551R233J7974
16969B6034J1580k5721m0345n994K2647m089Q958m722m521N299q183N239K0804
16956F986L414p101O276j053j3519L064J3251k9294N304J0459q826r23M871L685
16942c406j3675q501J0009J3768o266L0j3009q432K9789P50k982k0773N705J2296
16928d697l4631O229J7249J3607J1071R359j2782l099J3570O215j5367K407q528
16915F03J931j0314k3426L4854O27p999P223K074N884k2284l1065L6089J749j1160
16901a5214N538k368j9327n341m0996p916K1361M216m1267Q577M7549K5980j9850
16888c9058M310L366K9434O690k0762j1743P095J1749p406r996k3948K3447R989
$$ y = [-34932, -42107, -21230, -40255, -51946, -39687, -26511, 10190, 34457, 10378, -1173, 8060, 26034, 37614, 11893, -28452, -34446, -11799, -15888, -6930, -11652, -16173, -10874, -19057, -13818, 6986, 10400, 3299, 9575, 8522, -4997, -1933, 11318, -17976, -12672, -2213, -11039, -11962, -7091, -3406, -17081, -25582, -15573, -1805, -8071, -8041, -21050, -29482, 307, 1057, -1925, -22698, -16993, -4697, -39328, -33099, -15850, -2243, 8828, 18187, 5405, 2306, 15876, 22091, 6724, 9131, 603, 2534, -7780, -31206, 3648, 4275, -3724, 3499, 5573, 11457, -10827, -41892, -5803, -4054, -15214, -9676, -12044, -31371, -36712, -77708, -85624, -64263, -60047, -101314, -92737, -45188, -19208, -39058, -34748, -31382, -1948, 4742, -16020, -27763, -20668, -8919, -16325, -26321, -50269, -26822, -16833]
16875a6833j5949q614J006J4456J6368J6884p485j1726j7381o192J6805J1073
16863g588J4016O288j2241k0656J5473J685j7586K2844j2557j788R369J9646j7542
16850f37j0219J1384l10k544p90q587k9378q754J7006J198K6646J7381M859J9967
16836C7222k9554l7903J6657k2000l5860M973K3407K6821R685l871j2402j9684
16824d2509j0470k0285n599L0503M3935j5593r583j5598K913p15j3666J0418J9909
16811b6340P663P706R01k0083J4326J7958J3411J1967R654k0072Q694J3464J514
16798D0763K5928K235l7679l8548j6269J7383k0195m38l5249j9594L3337k251
16786e0577L116L9137L4145j2635r671K5869l017K568p092m155j7937J3424J9813
$$ y = [-16833, -32782, -41396, -40390, -25934, -9566, 7318, -167, -11893, -29274, -35466, -18661, -7588, 6428, 12716, 475, -20181, -4708, -3023, -20609, 2235, -10322, -12110, -2741, 16905, -637, -10856, 528, 218, -2326, -3116, -11703, -41081, -49835, -32829, -31631, -4985, 12396, 17255, 37222, 7668, -30235, -13578, -35578, -71438, -66465, -43058, -16237, -6552, -10423, -22825, -42509, -52979, -73264, -78863, -48360, -4425, -20018, -29601, -45199, -42286, -43001, -56667, -46249, -26340, -18677, -10971, -10070, -30153, -15827, 2131, 15542, 27509, 37163, 17091, 25785, 39249, 40763, 66691, 68926, 31247, -7301, -23570, -6187, -26382, -26820, -62069, -81663, -48326, -50577, -47461, -8324, 25821, 13186, 3515, 29384, 26367, 28935, 21843, 17688, -249, 13175, 32988]
16773C2988q175j6511l1787m674J0130J47R210j067l0602k4686n894k013L703
16760f9231M3065L4440j2530j1391r421m4356q643J6058R454J6295J7185j6015
16748c5090n476j5780L0335M202K2241J8490j9319j4291k8150J714N202J0399
16736b5523J7137j9039N931N094j2980P408J2331r73k8693j3595L2998O128k4804
16723c8580j6455n572K2062N236R74N673J0499o215K0691p998l4302k391K9292
16710a7086Q430L503K488J1169j0398k1097Q01O491M101L1015p41M746J2968l1844
16696D546j7364J4356j2230j5662J0371L167O04K6104j7859M079J3516m062j0708
16683a142J1042k19n024j0472j60J9907k430j9176J2826o555J3886J1666J7532
$$ y = [32988, 24813, 8302, -23485, -28159, -18029, -17882, -8672, -9739, -40341, -65027, -70921, -72934, -69231, -26166, 8274, -4256, -15647, -25068, -69424, -78067, -62009, -52555, -36260, -19075, -35090, -40566, -56346, -26011, -21809, 432, 18922, -397, -14688, -42838, -41124, -35922, -25523, -8386, -27425, -21494, -16400, -29380, -21972, -9641, -10614, -39307, -52902, -19904, -13776, -38580, -55035, -60607, -38545, -33309, -32335, -26662, -16163, -22378, -1687, -9685, -43987, -46378, -17086, -8656, -5153, -2665, 8504, -1894, -22991, -22190, -15699, -11598, 19417, 18676, 23422, 36390, 4546, -12818, 1538, -10692, -26354, -15983, -12816, -12212, 13892, -3967, 112, 13628, 9566, -1142, 9900, 9681, 4657, -5815, -5975, 13932, 11502, -7674, 5152, -1403, 12483, 24149, 41681]
16670D1681m69k3118j698J2444q179k4013j1101j0305j5147J1609J8523K4293
16658A4520J3451l004j9127R225n913N545k6159K5943J3118j6602m4495R412K4869
16645G83q030n033j9416m42L279J8906r058l1040J1398L2899K9782j0984l6997
16632b3953j0919J1625j4235l7351J6155M2556K1904k1823o643J8829J6048k1109
16620h916n68j7989J3907Q667N436k0668J5860J0830K017J0154O427k376j6293
16607F488k7236l875j9577k624L149P035J3213J1722j6063J3285k1107j4616K3864
16594b6342k6202l7312N0858K7205K5904k1568k285k8428L002m152o258K797K1649
$$ y = [41681, 41212, 18094, 16396, 28840, 20661, -3352, -14453, -24758, -39905, -28296, -9773, 14520, 27971, 24967, 5840, 15065, 9152, 14697, -11462, 14481, 27599, 10997, -33498, -24086, 783, -7247, -12280, -31696, -32138, -28859, -9953, -19011, -50051, -38653, -5754, 24028, 13044, -23953, -34872, -23247, -37482, -74833, -58678, -16122, 5782, -16041, -22684, -3855, 12193, -8916, -9484, -27473, -13566, -4899, 537, -20131, -4271, 6559, 8576, 18730, 25157, 22781, 6488, -20748, -24623, -44200, -46824, -43675, -36640, -23427, -11705, -27768, -14483, -35590, -50206, -26342, -52544, -89856, -38998, -11793, 14111, -7457, -9742, -38170, -35168, -39320, -45578, -42781, -21132]
$$ [...]
##END NTUPLES=NMR SPECTRUM
##END=
