##TITLE=Analysis number 325268
Compound Code sew 02690
Project Code adrs
Chemist Name aci
##JCAMPDX= 6.0         $$ Bruker NMR JCAMP-DX V2.0
##DATA TYPE= NMR SPECTRUM
##DATA CLASS= NTUPLES
##ORIGIN= Bruker BioSpin GmbH
##OWNER= nmr
$$ XWIN-NMR		Version 3.5
$$ Mon Dec 18 10:37:58 2006 GMT Standard Time (UT+0h)  MAYBRIDGE\nmr@NMR_250MHZ
##.OBSERVE FREQUENCY= 250.131544655141
##.OBSERVE NUCLEUS= ^1H
##.ACQUISITION MODE= SIMULTANEOUS (DQD)
##.ACQUISITION SCHEME= undefined
##.AVERAGES= 16
##.DIGITISER RES= 18
##SPECTROMETER/DATA SYSTEM= dpx250
##.PULSE SEQUENCE= zg30
##.SOLVENT NAME= DMSO
##.SHIFT REFERENCE= (INTERNAL, DMSO, 0, 16.522)
##AUDIT TRAIL= $$ (NUMBER, WHEN, WHO, WHERE, WHAT)
$$ ##TITLE= Audit trail, XWIN-NMR		Version 3.5
$$ ##JCAMPDX= 5.01
$$ ##ORIGIN= Bruker BioSpin GmbH
$$ ##OWNER= nmr
$$ C:\u/data/dgb/nmr/ADRS/1770/pdata/1/auditp.txt
$$ ##AUDIT TRAIL=  $$ (NUMBER, WHEN, WHO, WHERE, WHAT)
(   1,<2006-12-18 10:37:38.55 +000>,<MAYBRIDGE\nmr>,<NMR_250MHZ>,
      <created by zg, POWCHK disabled, PULCHK disabled
       configuration hash MD5:
       49 4B E0 1D 92 C2 6B 37 9F E6 65 BC 52 41 86 1D
       data hash MD5: 64K
       35 3F 2D 63 E5 FC 04 16 32 EF 3E C0 6D F4 C7 81>)
(   2,<2006-12-18 10:37:51.49 +000>,<MAYBRIDGE\nmr>,<NMR_250MHZ>,
      <Start of raw data processing
       ef LB = 0.3 FT_mod = 6 PKNL = 1 SI = 32K 
       data hash MD5: 32K
       5C 4E 47 39 90 61 26 B1 ED 45 BC B2 B5 10 74 23>)
(   3,<2006-12-18 10:37:53.07 +000>,<MAYBRIDGE\nmr>,<NMR_250MHZ>,
      <apk 
       data hash MD5: 32K
       6E 3C B8 18 1B DC 14 82 54 C6 CC B7 53 C2 AD 8C>)
(   4,<2006-12-18 10:37:53.72 +000>,<MAYBRIDGE\nmr>,<NMR_250MHZ>,
      <abs ABSG = 5 
       data hash MD5: 32K
       37 AB 1F C5 76 13 DB 85 9C 34 24 7E BD DB EB 2A>)
$$ ##END=
$$ 
$$ hash MD5
$$ 83 9E C8 BF FA E8 5F D1 50 AD 7F 8F 5E B6 C6 36
##$RELAX= 
##$RELAX= 
##$RELAX= 
##$RELAX= 
##$RELAX= 
##$RELAX= 
##$RELAX= 
$$ Bruker specific parameters
$$ --------------------------
##$DU= <C:\u>
##$EXPNO= 1770
##$NAME= <ADRS>
##$PROCNO= 1
##$TYPE= <nmr>
##$USER= <dgb>
##$AMP= (0..31)
100 100 100 100 100 100 100 100 100 100 100 100 100 100 100 100 100 100 
100 100 100 100 100 100 100 100 100 100 100 100 100 100 
##$AQSEQ= 0
##$AQ_mod= 3
##$AUNM= <au_zg>
##$AUTOPOS= <5 >
##$BF1= 250.13
##$BF2= 250.13
##$BF3= 250.13
##$BF4= 250.13
##$BF5= 500.13
##$BF6= 500.13
##$BF7= 500.13
##$BF8= 500.13
##$BYTORDA= 1
##$CFDGTYP= 0
##$CFRGTYP= 5
##$CHEMSTR= <none>
##$CNST= (0..31)
1 1 145 1 1 1 1 1 1 1 1 1 1 1 1 1 1 1 1 1 1 1 1 1 1 1 1 1 1 1 1 1 
##$CPDPRG= <>
##$CPDPRG1= <>
##$CPDPRG2= <>
##$CPDPRG3= <>
##$CPDPRG4= <mlev>
##$CPDPRG5= <mlev>
##$CPDPRG6= <mlev>
##$CPDPRG7= <mlev>
##$CPDPRG8= <mlev>
##$CPDPRGB= <>
##$CPDPRGT= <>
##$D= (0..31)
0 1 0 0 0 0 0 0 0 0.06 0 0 0 0 0 0 0.0002 0 0 0 0 0 0 0 0 0 0 0 0 0 0 
0 
##$DATE= 1166438257
##$DBL= (0..7)
120 120 120 120 120 120 120 120 
##$DBP= (0..7)
150 150 150 150 150 150 150 150 
##$DBP07= 0
##$DBPNAM0= <>
##$DBPNAM1= <>
##$DBPNAM2= <>
##$DBPNAM3= <>
$$ [...]
##$SUBNAM7= <"">
##$SUBNAM8= <"">
##$SUBNAM9= <"">
##$SW= 20.6930455092707
##$SWIBOX= (0..15)
0 0 3 0 0 0 0 0 0 0 0 0 0 0 0 0 
##$SW_h= 5175.983436853
##$TD= 65536
##$TD0= 1
##$TE= 295.16
##$TE2= 300
##$TE3= 300
##$TEG= 300
##$TL= (0..7)
0 120 120 120 120 120 120 120 
##$TP= (0..7)
150 150 150 150 150 150 150 150 
##$TP07= 0
##$TPNAME0= <>
##$TPNAME1= <>
##$TPNAME2= <>
##$TPNAME3= <>
##$TPNAME4= <>
##$TPNAME5= <>
##$TPNAME6= <>
##$TPNAME7= <>
##$TPOAL= (0..7)
0.5 0.5 0.5 0.5 0.5 0.5 0.5 0.5 
##$TPOFFS= (0..7)
0 0 0 0 0 0 0 0 
##$TUNHIN= 0
##$TUNHOUT= 0
##$TUNXOUT= 0
##$USERA1= <user>
##$USERA2= <user>
##$USERA3= <user>
##$USERA4= <user>
##$USERA5= <user>
##$V9= 5
##$VALIST= <valist>
##$VCLIST= <CCCCCCCCCCCCCCC>
##$VD= 0
##$VDLIST= <DDDDDDDDDDDDDDD>
##$VPLIST= <PPPPPPPPPPPPPPP>
##$VTLIST= <TTTTTTTTTTTTTTT>
##$WBST= 1024
##$WBSW= 4
##$XGAIN= (0..3)
0 0 0 0 
##$XL= 0
##$YL= 0
##$YMAX_a= 267939
##$YMIN_a= -347989
##$ZGOPTNS= <>
##$ZL1= 120
##$ZL2= 120
##$ZL3= 120
##$ZL4= 120
##$ABSF1= 16.522
##$ABSF2= -4.171173
##$ABSG= 5
##$ABSL= 3
##$ALPHA= 0
##$AQORDER= 0
##$ASSFAC= 0
##$ASSFACI= 0
##$ASSFACX= 0
##$ASSWID= 0
##$AUNMP= <proc_1d>
##$AZFE= 0.1
##$AZFW= 0.1
##$BCFW= 0
##$BC_mod= 0
##$BYTORDP= 0
##$COROFFS= 0
##$CY= 12.5
##$DATMOD= 1
##$DC= 0
##$DFILT= <>
##$DTYPP= 0
##$F1P= 14.0000005364418
##$F2P= -0.99999901652339
##$FCOR= 0.5
##$FTSIZE= 32768
##$FT_mod= 6
##$GAMMA= 0
##$GB= 0
##$INTBC= 1
##$INTSCL= 1
##$ISEN= 128
##$LB= 0.3
##$LEV0= 0
##$LPBIN= 0
##$MAXI= 10000
##$MC2= 0
##$MEAN= 0
##$ME_mod= 0
##$MI= 0
##$NCOEF= 0
##$NC_proc= -4
##$NLEV= 6
##$NOISF1= 0
##$NOISF2= 0
##$NSP= 0
##$NTH_PI= 0
##$NZP= 0
##$OFFSET= 16.522
##$PC= 1
##$PHC0= 213.8984
##$PHC1= 8.221718
##$PH_mod= 1
##$PKNL= yes
##$PPARMOD= 0
##$PSCAL= 4
##$PSIGN= 0
##$REVERSE= no
##$SF= 250.13
##$SI= 32768
##$SIGF1= 0
##$SIGF2= 0
##$SINO= 400
##$SIOLD= 32768
##$SREGLST= <1H.DMSO>
##$SSB= 0
##$STSI= 32768
##$STSR= 0
##$SW_p= 5175.98343685301
##$SYMM= 0
##$S_DEV= 0
##$TDeff= 65536
##$TDoff= 0
##$TI= <Analysis number 999999
Compound Code 99
Book Reference 9
Project Code 9>
##$TILT= no
##$TM1= 0
##$TM2= 0
##$TOPLEV= 0
##$USERP1= <user>
##$USERP2= <user>
##$USERP3= <user>
##$USERP4= <user>
##$USERP5= <user>
##$WDW= 1
##$XDIM= 32768
##$YMAX_p= 422238374
##$YMIN_p= -251519
$$ End of Bruker specific parameters
$$ ---------------------------------
##NTUPLES= NMR SPECTRUM
##VAR_NAME=  FREQUENCY,     SPECTRUM/REAL,   SPECTRUM/IMAG
##SYMBOL=    X,             R,               I
##VAR_TYPE=  INDEPENDENT,   DEPENDENT,       DEPENDENT
##VAR_FORM=  AFFN,          ASDF,            ASDF
##VAR_DIM=   32768,         32768,           32768
##UNITS=     HZ,            ARBITRARY UNITS, ARBITRARY UNITS
##FACTOR=    0.157963299565203, 1,           1
##FIRST=     4132.6476996994, 0,             0
##LAST=      -1043.33573715361, 0,           0
##MIN=       -1043.33573715361, -251519,     0
##MAX=       4132.6476996994, 422238374,     0
$$ Real data points
##PAGE= N=1
##DATA TABLE= (X++(R..R)), XYDATA
$$ [...]
##PAGE= N=2
##DATA TABLE= (X++(I..I)), XYDATA
30895 711277 753791 777956 824594 842121 800494 779695 744960 760826 769105 713044 645033 628781
30883 628781 622657 653887 685166 656359 660743 676169 677563 657080 624363 649936 687652 719600
30871 719600 666239 663021 698497 704687 679550 699587 730164 715560 705576 707218 717881 761141
30859 761141 739970 699730 723573 790582 843831 778312 700647 689908 730507 777232 726942
30848 726942 722684 734864 738688 741380 732087 681486 661829 725297 745425 719244 719515 745853 683742
30835 683742 657766 641922 619436 631728 619324 605934 612280 639223 694376 755424 740969 816033
30823 816033 893988 844313 752612 708165 660484 700892 715603 703011 673068 651918 610936
30812 610936 608605 661820 703588 716736 688183 726695 816064 868403 851352 865842 865158 831803
30800 831803 778654 743876 802609 815205 734558 712121 690737 692424 702642 737269 744150 752938
30788 752938 739397 775860 861692 849087 795475 746962 742187 741445 702723 664848 658715 655301
30776 655301 702778 701555 653788 657990 691332 660877 645598 660247 603827 612737 601376 590046
30764 590046 675991 687749 700760 779711 798826 766768 819846 871034 845923 827219 814610
30753 814610 753694 740329 696045 695720 721989 757161 752692 726914 711395 733150 710447 745928
30741 745928 810098 782102 799252 871394 835786 805798 829854 808451 801681 763028 713761 750216
30729 750216 744777 639112 629755 653703 682336 670748 636665 652559 656450 652598 639613 727791
30717 727791 716780 713198 670602 664827 669123 659882 715862 780440 834984 816646 711409 683598
30705 683598 717290 714698 714584 702145 660506 674971 671096 658403 651904 722867 774253 768988 804533
30692 804533 797549 711645 675154 678006 692484 733005 793809 768997 664960 624993 693132 747794
30680 747794 781653 730492 672801 649498 674966 708809 710742 729365 735334 736528 708843 656220
30668 656220 619992 623079 655443 635669 671165 740228 820720 764258 678449 704247 771169 731568
30656 731568 662891 678514 728243 760851 713317 669999 703717 693231 684260 683088 673207 628030
30644 628030 620856 670001 731404 744710 730830 755862 835863 929517 947402 893662 806580 772166
30632 772166 733664 651490 701169 782573 774234 755430 783653 760745 750959 738645 689897 699829
30620 699829 763610 800634 807636 746559 677889 692353 673272 682963 675641 733992 734093 670753
30608 670753 727734 764252 735235 737427 728676 706996 632407 650566 738399 772400 755431 802189
30596 802189 828593 755620 648225 651115 745148 727988 766358 796655 742488 726255 780558
30585 780558 852180 882436 824138 719461 710064 715324 747531 759660 709530 648018 645928 669094
30573 669094 694773 709731 703633 692384 672991 724371 799242 749030 711548 664445 574738 631088
30561 631088 746699 735061 646820 614708 696854 684764 632185 659903 736840 789347 809767
30550 809767 748891 764807 861626 809488 796917 800978 827009 783630 714962 721242 723105 741313
30538 741313 788294 752063 720630 710619 737445 761202 747601 708152 712418 753515 750598 747371
30526 747371 726115 748278 715010 717470 716244 675295 647652 699116 765528 787402 760886 706764
30514 706764 679727 732458 791741 855103 829277 769002 784814 817320 858839 863606 803338 772831
30502 772831 788629 801704 828395 837497 771394 731902 800138 803985 752441 695355 787297 834637
30490 834637 844424 743047 750595 789243 758267 742374 742945 762207 707163 665327 723438 708554
30478 708554 692598 713006 677733 713614 744510 795160 844434 862587 842694 824380 771109
30467 771109 768418 804210 744476 687209 738766 790390 783530 750587 809037 762742 749392 758821
30455 758821 728875 663203 658528 701758 764466 819851 762584 776659 824685 784140 733986 729237
30443 729237 628981 643371 645771 636308 645483 675548 681439 735451 726095 760329 789805 727473
30431 727473 740697 825799 842263 787047 752475 730862 724252 748187 778974 724015 665637 686487
30419 686487 745646 765843 722459 728254 710069 682042 725274 657383 611058 638528 647965 609421
30407 609421 613208 701214 803633 835079 855876 901533 881552 784419 728086 700655 705582 755190
30395 755190 745910 729609 725396 724888 704271 687281 704199 716074 696647 756053 803868 824607
30383 824607 842216 871215 798635 813585 762608 754180 808667 753296 777526 749359 740619 770342
30371 770342 822020 791848 762379 732989 707732 734335 690277 677833 715614 775321 774387 759441
30359 759441 729065 733313 784572 756552 747041 774780 779192 773783 801212 764110 808847 856598
30347 856598 808222 771729 713445 689124 636667 629438 602925 623574 682474 632972 628075 688269
30335 688269 735581 743427 732986 776475 749009 745927 759048 740605 702026 708004 780604 888326
30323 888326 928184 949751 943578 864117 713587 653466 656424 716543 744060 781008 782058 773233
30311 773233 740037 727152 690981 693591 656552 657314 701165 726962 753993 799891 783854 790281
30299 790281 770669 778569 808097 783010 766506 658227 646086 711037 767532 749976 755163 759489
30287 759489 731339 746087 811634 812115 781587 772034 702975 674069 720562 717866 720545 784534
30275 784534 887953 870168 802598 761052 741341 787283 804964 768030 709875 750876 766373
30264 766373 736246 740254 756212 785074 742536 737823 748210 789251 749505 726371 723005 711643
30252 711643 709757 643397 617955 640287 683617 717019 730014 765838 730911 670334 688852 734790
30240 734790 733768 712667 769319 749532 775566 727869 718837 728331 694830 734016 764723 778176
30228 778176 688713 654427 594121 604535 615692 613786 670226 686582 698539 744959 764161 772451
30216 772451 710887 661180 645411 684363 699645 667586 642569 651980 672769 716102 759342 734482
30204 734482 754370 741033 744771 818525 816196 812848 767122 777311 825813 854294 784744 726275
30192 726275 742279 730579 751672 762258 767639 782332 734167 704424 724026 769920 770724 722183
30180 722183 715897 785754 800195 772392 769400 736485 714256 717280 717486 710485 783014 747703 720876
30167 720876 773845 771638 711428 679493 710510 713724 741820 762890 793190 796259 793195 842227
30155 842227 841674 859838 873816 812499 779649 779124 760871 724820 691746 694570 728897 701372
30143 701372 694529 687556 691907 779560 767044 813522 856583 802737 754283 798232 831667 818475
30131 818475 755847 773027 776035 704591 682287 725948 694541 702162 707737 690264 708042 783908
30119 783908 786105 741520 683298 727418 736520 764669 793979 759721 685734 621734 600268 645074
30107 645074 644530 604328 622031 682634 810151 890184 904137 860699 833985 780294 805481 855826
30095 855826 840756 797143 820212 865740 834156 810476 790243 718426 734145 753496 747895 748728
30083 748728 770164 786017 765478 684818 640573 658773 684308 679732 751272 844352 809081 833954
30071 833954 872591 857576 796029 704744 695675 766226 798051 749597 708222 732753 720759 756759
30059 756759 749708 751123 741934 728425 788631 839867 849157 705781 582644 598449 691811 773601
30047 773601 722961 741830 771218 715598 692878 739973 766845 751822 827001 742797 676940
30036 676940 707949 717947 701469 695056 692742 695426 727680 769303 737157 794524 876322 837716
30024 837716 744485 735171 815946 839259 842837 864478 840503 782546 770465 797984 794699 809796
30012 809796 807052 820938 809691 785240 776965 811305 871303 889059 883050 823835 744265 739658
30000 739658 721218 661498 687276 743431 769626 746390 696110 685790 717778 773200 747934
29989 747934 709992 712924 751749 772389 707188 682626 722179 783590 809543 766271 727976 747351
29977 747351 792347 829149 817497 832369 837799 826063 810417 836406 835329 762271 726208 750241
29965 750241 760987 741830 736456 728746 723492 714070 675907 694964 758699 799320 828560 858415
29953 858415 826462 779763 752001 772767 758654 747835 751158 786110 841094 834276 749138 759657
29941 759657 790427 798794 796751 752803 684139 721741 713039 682393 717175 696153 720112 711847
29929 711847 658772 729581 756449 768973 769974 775659 777212 740042 674164 612975 627105 691824
29917 691824 773893 754933 731715 714327 680830 694216 699866 733532 799187 815959 793735 762661
29905 762661 773508 814590 823716 887238 884989 791373 823872 798832 746118 757322 759659 738381
29893 738381 724785 733953 746556 695673 672255 680936 629007 674245 690919 726330 734555 757874
29881 757874 773710 761493 725750 732683 770687 703245 699289 718277 734120 713819 739132 792667
29869 792667 810212 868499 865557 870640 872910 837217 740217 667541 650567 682837 742068 781270
29857 781270 785528 790156 825074 773012 808888 843550 839514 801179 775824 844675 926388 931612
29845 931612 896247 874339 856011 848530 756001 646345 688313 788885 881192 966144 936257
29834 936257 849472 818726 809889 822993 830858 753959 773726 766072 738901 707748 674628 748644
29822 748644 793933 761304 781419 790435 820874 863679 857766 841546 859850 778959 777537 781727
29810 781727 755277 776699 813645 803305 797894 786788 792835 795620 736127 700019 745549 771173
29798 771173 754631 728373 741693 709147 677062 609101 695255 737135 819930 815137 774379 782834
29786 782834 781338 784475 782100 756338 737718 771660 772118 710682 678619 721033 747702 829316
29774 829316 890004 938936 937749 902973 804448 719184 700067 788702 790022 813055 808298 793557
29762 793557 718277 656392 678783 690992 718388 701895 674321 640961 681781 765464 771852 773068
29750 773068 725764 778734 848227 807351 751349 821162 847749 791525 768866 728021 763080
29739 763080 779524 759937 751504 717818 725785 740016 790560 799495 767754 814932 804823 789122
29727 789122 798251 834477 807619 796506 812895 834381 862805 803763 771723 806212 873277 840064
29715 840064 802154 727718 771582 854856 852580 839368 805383 811496 848276 832455 806143 872689
29703 872689 888031 910341 846604 795627 771237 785093 791042 819461 873444 896936 854384 822834
29691 822834 798263 841172 901108 942212 916381 865309 823165 814527 800037 798019 855645 836874
29679 836874 787027 752202 801622 743971 721388 739913 778288 769748 765863 721825 696660 678281
29667 678281 663433 693585 710642 699905 653986 639810 714642 717162 784925 839054 778677 784352
29655 784352 777481 778014 807366 764298 739355 652095 624736 748181 799831 794920 794526 740879
29643 740879 768109 772909 777549 736194 742227 791707 807365 789946 812131 777164 698765 644750
29631 644750 683999 752449 731258 732954 778858 766797 777641 792848 793723 769962 776260 741579
29619 741579 696542 723098 771981 828317 832142 821694 796652 791568 743250 740549 777396 749993
29607 749993 763745 803192 782769 744515 751561 773094 808365 862082 834977 772826 740583 726583
29595 726583 733713 797532 793990 760144 758055 736223 755986 750731 723391 749645 752853 752609 730999
29582 730999 762621 877340 843916 765542 772107 809030 823540 838167 826090 817650 854575 875984
29570 875984 850677 796252 782615 792853 801511 819477 765218 780786 765008 804732 810714 820903
29558 820903 810447 786062 787882 825587 799852 774531 787563 827313 846157 886288 894620 746538
29546 746538 701443 676848 677825 700854 693121 705127 738349 795317 814065 813513 782333 800303
29534 800303 850778 831954 782561 747006 748100 770898 696202 700358 783957 797973 732257 719946
29522 719946 711767 661829 759182 768713 724512 740477 768800 730226 748516 675289 650665 674283
29510 674283 651335 655980 694269 763093 720330 778595 774080 730005 744454 782993 706840 685652
29498 685652 703863 737442 715433 721293 723473 774654 802575 790253 768608 765755 862370 892676
29486 892676 791614 766918 764335 782470 828320 839201 824417 833228 849308 846604 792310 710965
29474 710965 732824 751094 735779 772586 747496 792775 789505 798202 834032 823024 813253 781435
29462 781435 695068 701487 720665 685740 689662 714000 654695 660617 706130 741061 756791 698676
29450 698676 711729 769729 816802 746039 728571 755643 788679 880828 945184 872697 738022
29439 738022 686069 738270 814771 799134 748198 743577 737681 692189 696923 718893 774933 741623
29427 741623 749636 778879 729071 710514 745156 744075 767288 812609 941173 981184 886172 885954
29415 885954 919055 934870 913892 844875 805641 832663 857419 818402 822516 783176 751799 719134
29403 719134 733989 748613 722997 696551 775877 793323 736014 751975 747227 779226 740088 701122
29391 701122 656505 670776 717298 760912 780322 810039 820817 792157 799143 774580 778957 850977
29379 850977 874834 786197 804053 859953 842114 881213 914433 840312 819401 892761 937210
29368 937210 945829 888805 816958 803965 743929 742001 761443 789281 793667 761994 792133 828901
29356 828901 873044 862005 841437 770688 753533 796537 859984 884034 830318 805263 846589
29345 846589 852200 876863 847136 787493 764751 721722 735753 803364 847721 844319 778961 730707
29333 730707 736599 779347 775096 793442 708386 637812 676200 693389 708667 734808 690530 661020
29321 661020 739402 816856 827774 817759 750612 730848 756113 817210 854199 828983 822273 807256
29309 807256 793335 795286 813424 763609 726845 749245 827400 907577 915462 861739 800568 797880
29297 797880 830721 796474 878122 918934 947402 930346 880451 830955 732618 655987 696378
29286 696378 779179 810808 813591 779038 810525 796497 807406 878608 883005 880571 870226 812193
29274 812193 807872 834266 874684 850886 818731 858394 852790 821518 745729 710386 747121 683011
29262 683011 710331 770415 757580 811782 830910 806785 792187 780755 798338 797188 808884 829605
29250 829605 826423 882673 904561 944906 958273 925663 902390 871765 885213 907549 850666 838833
29238 838833 856424 811586 785186 859767 895759 888743 851915 813563 813687 861420 923685 903109
29226 903109 840284 790575 801738 850005 872732 862624 848346 914155 869793 790764 834056
29215 834056 862696 896870 901498 924688 902993 905726 901675 903959 844118 770999 797713 814197
29203 814197 822192 804106 856068 883255 894355 858000 893617 895293 918513 916599 894274 863514
29191 863514 869490 879469 804229 789125 805703 804166 795469 781360 792871 822559 828140 798075
29179 798075 797262 747242 781669 803034 790847 761546 744591 773165 797818 791042 831325 862315
29167 862315 878711 821521 791058 794207 774667 809467 834858 900358 916411 897470 903727 918007
29155 918007 911036 888166 917130 908588 903247 920105 910266 917973 924639 920673 853075 772223 800729
29142 800729 843795 879460 909325 898740 870397 851122 847607 884944 887104 910831 898599 887870
29130 887870 866573 896464 916354 880599 879932 846423 823413 839651 888185 837582 777752 721899
29118 721899 708095 665077 686561 787558 842606 891855 869780 848529 857674 797822 805557 827396
29106 827396 751837 628108 689422 735002 812084 858013 841740 801935 777846 752454 828137
29095 828137 844638 873002 910143 921841 898958 848593 891269 874396 814881 782617 761310
29084 761310 791696 781270 788710 749949 659377 693872 748224 777476 799702 802626 828661 834084
29072 834084 818991 859297 914160 902192 873960 877315 871986 852145 861910 873581 797110 788124
29060 788124 781810 777139 783738 808482 810291 868581 833135 808787 783415 782606 884781 910698
29048 910698 884359 934990 899658 870342 862321 826671 833514 871698 962906 987388 958358 933514
29036 933514 938035 872133 853040 856806 846979 820156 829983 743356 763185 764315 790153 778174
29024 778174 770357 814151 854994 859281 805151 785644 814324 794150 786811 792551 749257 723548
29012 723548 742359 757630 789328 850601 862779 842143 866285 852174 853006 881186 840608 784348
29000 784348 810898 897185 881405 787349 721386 737980 780271 855025 889060 889585 871845 855703
28988 855703 866114 877732 890349 849508 803406 784464 829632 865697 881517 904672 861003
28977 861003 798200 733965 729551 767048 853120 878048 833930 783780 823988 802738 732880 706726
28965 706726 706938 708931 742208 806696 846320 831788 824685 779075 746799 787992 817166 829619
28953 829619 843376 908005 894125 897160 912158 869944 793406 714213 710659 780700 873329 793790
28941 793790 787444 847452 834315 823308 762513 780660 792949 820399 838873 849684 867603 798192
28929 798192 793782 824153 835332 850738 893696 871143 846505 834759 826044 803458 754848 738782
28917 738782 766591 790132 784156 811938 894324 926243 910104 866247 825195 790048 820464 908616
28905 908616 957203 897692 829709 886102 810535 795133 823301 857699 929376 948916 931926
28894 931926 890508 800297 811742 814494 841711 817070 850138 890749 861297 833186 849141 807435
28882 807435 744161 822772 851669 806468 799984 866966 859537 796209 810323 797334 844550 916248
28870 916248 942660 890988 903303 930688 897007 838428 876161 957422 954846 924846 894166 897584
28858 897584 920132 916697 875580 866831 810489 780366 762438 718583 669914 678757 706694 749093
28846 749093 796450 801895 840402 833719 829571 798662 725039 689062 739271 753521 791317 794351
28834 794351 807475 872134 946244 937601 881222 789271 796719 878996 894642 870834 847365 829751
28822 829751 805006 845121 858473 909227 879575 773018 748961 838002 862465 818663 786454
28811 786454 791574 794000 772296 705083 715637 759599 778158 771514 749074 739251 734361 732616 718867
28798 718867 706428 792275 843579 808843 781772 829101 824053 786255 803552 847469 892330 814744
28786 814744 832424 867391 847457 865856 910415 861718 820155 841154 883387 885572 844264 808646
28774 808646 758821 736786 786591 838556 771729 739646 767927 775893 770480 760075 757403 751045
28762 751045 730780 770914 758122 748677 775376 772309 693117 736075 811467 839945 834854 784858
28750 784858 767529 715529 752097 824415 883815 890717 845493 820440 852545 862271 868168 859309
28738 859309 825548 791955 904201 953334 981648 897083 836925 803910 802794 828837 834857 798795
28726 798795 839873 859556 957662 1020328 977457 929782 892067 865223 836257 822465 862539
28715 862539 912678 854010 875244 877711 901505 886826 890074 866747 852441 883425 824543 755394
28703 755394 798348 901517 938715 962439 977882 982603 966176 894135 806329 810057 817328 806999
28691 806999 782722 782292 722217 726306 784112 821112 807155 786344 798387 774204 732148 718581
28679 718581 769479 843278 853472 795455 743099 754463 803930 811219 780276 733902 708172 785429
28667 785429 848107 865900 889406 913613 913525 888919 848783 860453 860053 887961 941381 913508
28655 913508 911072 922885 947351 915107 843910 840096 849750 868330 887305 799228 816029 818483
28643 818483 845519 858574 835174 844234 877816 909864 841225 818085 851971 891363 886927 839445
28631 839445 838432 856652 923869 889690 850299 827658 865307 915668 896535 934844 956922 984878
28619 984878 1008682 971316 951304 925034 886822 876448 858397 882512 846615 824867 816219 816505
28607 816505 837980 838722 814352 786644 794713 827221 832035 838481 826103 721495 648941 662897
28595 662897 750320 819593 846005 890143 854350 850566 954297 965604 998796 928988 935209 939836
28583 939836 871479 806041 825707 910101 956968 994820 991364 968443 899631 866607 795267 845879
28571 845879 886251 912385 871664 820730 767759 799445 787321 786219 840377 894948 894578 925908
28559 925908 921603 846552 797763 811332 824367 816778 822011 849660 827585 828562 918164 919829 886891
28546 886891 884577 880756 833026 825955 876585 904607 844215 824317 872912 914957 913757 930747
28534 930747 892052 898341 905259 875452 940022 949671 920795 976484 1016190 969600 869945 825637
28522 825637 853342 913922 873759 790695 829221 817600 832385 808692 792451 790651 791072 773865
28510 773865 749021 804517 890231 879984 915972 909111 890565 825096 801040 811325 824313 845304
28498 845304 865249 810910 805413 808719 847227 815872 805072 824057 849725 857234 903789 903445
28486 903445 908832 971775 1002779 1000445 1012008 999485 962098 982077 900766 890869 914191 904771
28474 904771 903144 973872 973861 905476 960833 993349 912392 856670 912132 915586 906822 856890 805702
28461 805702 801447 802847 861565 851515 950859 1006666 904506 836428 780218 893948 956214
28450 956214 955925 893486 866066 828766 882785 862539 830200 857115 883568 878634 883653 955310
28438 955310 960010 884852 916221 925087 898031 879637 905032 898315 848773 813769 849034 850629
28426 850629 818225 802327 815273 835380 768407 801919 814052 828256 759427 742764 765875
28415 765875 788227 751113 799609 836139 834189 813113 794358 789194 800246 869963 872761 869222
28403 869222 901419 945434 936172 996509 976045 953248 947835 903941 896390 857432 770326 818785
28391 818785 861153 903358 903136 909603 878795 866297 872109 906429 919390 881089 859656 828427
28379 828427 760665 795766 853850 874992 860205 837998 818254 840585 908689 926980 888716
28368 888716 818700 821088 868833 865988 874160 858234 812524 855550 906426 902716 865828 836302
28356 836302 818035 748335 753363 792741 809926 843007 885676 858526 807444 835047 831591 763316
28344 763316 720062 741997 771798 785524 806816 859693 887382 893979 960298 950106 934170 944721
28332 944721 896951 893090 868369 863956 829396 853132 857127 864492 928466 914333 920586 882935
28320 882935 848032 876260 911009 872154 809916 834816 834232 896470 854823 815567 815970 796153
28308 796153 792143 914091 978303 950079 933098 905149 852506 821732 811153 808050 843871 861596
28296 861596 895815 937405 979069 972038 954807 901412 813120 833766 843758 875644 896077 885214
28284 885214 848867 821506 828239 844299 816710 893307 970826 996026 973877 940709 939144 889684
28272 889684 859643 875650 906366 915391 870447 837091 855169 901935 851863 829049 847805 827694
28260 827694 839041 866885 886686 840472 841592 892124 911012 857981 825581 813063 893277 933532
28248 933532 951904 943754 895368 893828 920131 917084 915460 900890 924692 1000183 1024129 1008417
28236 1008417 929760 881741 872564 878683 911614 829603 769042 761096 765510 747683 813398 862319
28224 862319 800829 741853 769872 811668 890129 906661 842499 894042 894353 879354 878239 874930
28212 874930 813750 763372 832640 789472 774831 803505 784368 785119 804987 813399 763537 735014
28200 735014 725726 836719 846666 817501 767632 779035 812676 850533 858637 791589 810101 840064
28188 840064 872405 920910 878527 780203 793438 746264 758710 836065 864285 865312 873241 869875
28176 869875 894710 932705 918495 941646 954095 953762 864163 858372 863908 898157 942658 1024623
28164 1024623 1026956 983050 929222 947095 926575 881373 890337 879679 888804 976155 987927 841879
28152 841879 769487 835102 868244 871945 916163 885900 868183 902613 925166 932555 938212 910449
28140 910449 828632 797809 769662 797483 794872 790348 757210 838044 867649 876765 944424 957529
28128 957529 983630 991575 986892 945816 903644 901788 866133 880793 873066 828300 838722 866463
28116 866463 839635 831266 882813 907232 940383 974269 924831 890194 929000 955454 898445 848086
28104 848086 799630 753940 732112 728457 770206 866544 970712 932693 928856 931355 916424 825724
28092 825724 774799 789481 821979 799546 840431 868425 815113 762357 762131 788833 811553 846885
28080 846885 881953 937701 986441 878900 799529 841707 917737 961817 945998 917375 939353
28069 939353 936472 891297 911820 932975 939838 925528 958356 948060 955745 956224 977525 1014336
28057 1014336 966512 923566 915678 952989 936802 898875 956468 943788 904549 918442 959844
28046 959844 977539 1035654 1079942 1072462 1116571 1075474 960855 908321 902720 952206 959677 954915
28034 954915 937993 933533 917003 945994 917881 854083 835019 807561 839645 896602 885779 885070
28022 885070 828007 831294 841423 797218 822708 847118 842561 849594 874934 939748 962665 910410
28010 910410 834204 848981 900455 948562 966990 957919 963802 928925 886299 969938 989538 879078
27998 879078 814205 822212 954848 965069 887427 878996 889244 881040 914184 901879 920332 918121
27986 918121 948071 942173 935780 950535 946660 898397 925114 957632 994500 965879 904226 909123
27974 909123 956465 966169 935160 906242 906292 940406 933076 907690 876798 819862 794165 759312
27962 759312 769902 767394 808910 834451 863088 889485 931424 904420 835340 825425 823051 844998
27950 844998 877040 920451 947516 898677 885626 886082 887062 923353 877786 893089 908271 956624
27938 956624 950411 967027 894132 853924 914545 1010534 1053608 988464 877496 927197 1014837
27927 1014837 1014701 1023538 977050 965490 956936 936147 957357 986645 990798 923766 890162 930252
27915 930252 975237 961747 894843 915718 903813 920674 909714 920189 924731 872945 848827 851036
27903 851036 849390 848540 857325 871736 902607 912336 941408 907469 861923 839043 836891 819740 847341
27890 847341 906316 917133 876841 842249 834657 853072 879794 900903 963561 952717 908683 930479
27878 930479 935052 922053 953858 858505 913639 960849 961205 913577 859244 871176 911418 937404
27866 937404 934995 857975 891574 878638 838331 798767 816411 898963 938035 939647 1035951 1057528
27854 1057528 1006910 1013784 991641 936198 867231 878134 915008 915947 860238 837377 847835 860322
27842 860322 881223 908518 841689 768740 811020 858793 856717 908257 950749 940879 924311 881847
27830 881847 781806 807147 793739 854599 920903 965426 929913 853202 854722 925566 937625
27819 937625 933369 950405 916456 872919 853443 866835 846162 790682 784670 863965 969750 1026416
27807 1026416 1000098 992655 949988 855216 816761 843606 875231 892512 901961 889873 903020 886925
27795 886925 857528 874403 873508 903670 910196 903529 926925 1002644 994750 939317 920741 860845
27783 860845 850879 930019 881456 862819 896972 912943 909887 924879 921778 933701 921122 965986
27771 965986 944501 907234 888294 884382 897271 934728 967276 995396 993005 889017 930366 964869
27759 964869 933687 964350 971929 931968 879630 871194 901084 966148 1005192 1007154 1005501 963899
27747 963899 858307 902466 949727 896930 912235 912370 846393 825145 812139 874760 937206 962248
27735 962248 968462 1011668 989467 916827 905626 936321 923473 913234 977304 1021448 1031898 995125
27723 995125 977152 972851 867654 877958 910458 909858 911082 869956 955123 981144 958352 915321
27711 915321 899147 928431 889845 882157 957708 964812 966371 961921 953339 989220 996474 896258
27699 896258 845927 751092 784285 812584 791630 817323 890814 877387 885524 915124 936732 956638
27687 956638 988226 996129 991572 886505 841672 932776 985241 897711 880866 893913 987239 1106760
27675 1106760 1058204 1001204 938217 918975 910815 879213 916046 919404 894660 904830 883544 896279
27663 896279 898473 861164 888221 910288 922578 902247 897677 865200 865662 889717 947137 917866
27651 917866 922081 910809 896723 828324 896604 946269 945291 852081 821120 890911 921704 906488
27639 906488 892379 938326 928198 851269 804041 816748 871756 873322 885221 939625 989658 947579
27627 947579 932325 950676 985897 956666 914502 854632 884406 950015 1049562 1071971 1110586
27616 1110586 1071055 1089451 1099417 1027383 988560 1005943 987685 1011788 1014551 972725 946103 904292
27604 904292 933118 987307 966006 989352 1008517 989534 881062 863389 843651 907506 945990
27593 945990 1029181 1029770 1000449 1042730 1112076 1099668 1050210 987110 953025 938429 962357 984497
27581 984497 971483 967827 964664 953509 989521 973640 922784 955677 1001539 1061253 1022350 940533
27569 940533 842695 806838 878560 900665 925651 979500 1018262 1030269 1005812 947914 946812 978239
27557 978239 992592 948309 955324 935466 908085 926642 906758 871823 884827 870967 885211 884270
27545 884270 888339 842807 811575 854195 899634 961697 1005426 1010544 986565 990087 971966 960611
27533 960611 976046 989555 980545 940643 963940 1003607 1022614 1092216 1084202 996863 913493 895239
27521 895239 924446 950815 957219 948522 931807 866726 863830 885479 864466 852741 869361 942595
27509 942595 906322 880682 869435 887456 897735 940150 978314 932771 880502 860470 921199
27498 921199 945996 910774 842197 912237 962509 950404 935213 898865 901592 867772 809039 854839
27486 854839 925450 948328 936975 944432 940248 977287 1056198 1059392 1029941 1028913 1000443 943795
27474 943795 954964 953470 997662 1026803 1051027 1029193 904045 813736 821112 839457 932112 987123
27462 987123 958269 969514 977575 962535 963881 957565 928670 963988 988191 970064 1003116 984640
27450 984640 941503 939099 995936 1042873 1045676 1026295 946535 953034 888057 910730 964023 951445
27438 951445 979566 962985 931151 930157 940244 964673 935511 916736 869068 848344 868400 916894
27426 916894 927839 977185 965129 938581 967781 1029904 1049220 1016488 954575 910044 949110
27415 949110 928681 895662 930709 928419 935913 937875 955091 1056704 1089384 1065192 1048679 1073198
27403 1073198 1089967 1052632 1044237 1081349 1021371 940065 923317 921684 926150 884373 886491 880976
27391 880976 912707 998548 1038262 1000047 1002451 1004302 1049137 1070469 1104329 1126825 1081946 1055792
27379 1055792 1038397 1058718 1042618 994155 1089965 1084891 1054205 1065866 1069321 1044927 1084647 1071535
27367 1071535 1022025 1001453 958545 969585 1036985 1014094 1017410 1019061 1031735 1008664 935860 1004746
27355 1004746 1023157 922925 898113 867951 825234 866621 924025 993968 1068364 1044058 1033721
27344 1033721 1055793 988420 1033591 1057488 1012759 974115 922275 878354 850750 899527 923301
27333 923301 896532 922727 984650 957062 954787 974988 926987 950978 896451 911376 946293 1006563
27321 1006563 1059157 1031764 1028954 1024454 1014291 1047787 1005531 935377 914607 951526 957596 1017743
27309 1017743 1059015 1021398 981038 961858 950288 963777 1045133 1096779 1122155 1158446 1131905
27298 1131905 1043125 1049683 1038781 992154 949447 952669 921912 940543 963643 953269 954377 980930
27286 980930 1013370 974267 949322 1030547 1111703 1086927 977154 994835 1050146 986762 972920
27275 972920 905775 929740 929536 944521 977168 924696 942419 967491 970019 966365 973757 1048122
27263 1048122 1134251 1140345 1135434 1175576 1109295 1048619 1042968 1013321 999850 958400 911448 894029
27251 894029 914371 918181 956631 946630 889529 924318 899860 948085 1008128 1039105 1035009 1004613
27239 1004613 993415 932301 1009681 1060212 992743 957662 901406 911466 887880 865911 911054
27228 911054 961041 1076432 1128612 1047566 1003695 1051506 1041509 1053214 1037055 1020153 991897
27217 991897 992670 1026172 987355 945821 978448 991151 1009792 1010925 1019103 1057241 1057837 1046133 1013631
27204 1013631 1008235 1031591 990720 960205 970344 891235 904276 927887 939450 953109 983651
27193 983651 983123 934927 894596 867918 828901 849396 911964 926498 947537 1013657 1032992 1051573
27181 1051573 1040478 1016027 1053727 1041763 1021981 994921 962533 932644 996107 1022134 1047309
27170 1047309 1053453 1014170 1049039 1055208 1012711 952486 944376 972129 970680 1004741 973295 978329
27158 978329 987427 1024187 1032519 979493 967813 961983 934848 930213 910591 908435 904658 1011670
27146 1011670 1005935 1046866 1050260 1031825 952033 954880 993319 1025526 1025569 980588 974310 999508 1017271
27133 1017271 1008806 1005724 1040699 1001234 991631 1060233 1127007 1101738 1002848 962079 959570 947438
27121 947438 990749 1034442 1041590 1062764 1123584 1079302 1026708 1123385 1160957 1105177 1021314 1005884
27109 1005884 1019340 998659 955052 948281 970167 1009576 995316 1021668 994472 966089 978245
27098 978245 964142 928545 934160 949513 957421 1018414 1053187 1046261 1095094 1102697 1048094 1078531
27086 1078531 1063289 1010073 1035822 1025762 945623 905675 907447 957293 985533 1008276 1013376 1011939
27074 1011939 984162 967362 995228 1008725 976956 937918 885014 856960 858290 877391 888122
27063 888122 939267 948553 994210 1023835 1060030 1106791 1058808 960454 957266 943786 949447 952624
27051 952624 984108 973124 1000928 1030463 1035215 1046190 1065063 1081982 1109532 1126837 1049831 1000129
27039 1000129 1082142 1061325 997960 940647 946582 976462 1017620 976203 962127 946260 975221
27028 975221 1004262 976515 895056 868817 846117 864344 964998 1006061 1077675 1062696 979234
27017 979234 972424 966419 1022973 1104507 1132699 1143771 1157548 1180973 1120626 1096212 1081011 1084434
27005 1084434 1064547 999391 972689 1004363 1055915 1117850 1052693 1024946 992159 1010182 967963
26994 967963 1016908 1057570 1075253 1044833 981691 967330 989510 960442 913146 909941 929363 936006
26982 936006 968104 1012566 1000857 1006172 1057315 1095531 1103886 1052613 1051338 1047061 1010422 1012595
26970 1012595 988363 929833 1002277 1050676 1018676 1039361 1013789 928192 977678 1069459 1033686
26959 1033686 996182 969006 950811 995189 1047998 1058153 1058516 1080351 1138266 1180174 1145223 1041340
26947 1041340 1026724 1045680 1102288 1140704 1140088 1156969 1133075 1105769 1041185 1021262 1073158 1095337
26935 1095337 1082655 1033385 979997 985611 1007430 997845 1045349 1052058 1019095 961197 916479 947482
26923 947482 1017209 1115426 1159839 1098029 988658 928607 958062 1020640 1032950 998721 1069914
26912 1069914 1086997 1055704 1029058 1058527 1062119 1046232 1020893 970301 1044143 1007914 947159
26901 947159 974386 1002304 919879 947611 1042138 1064887 1027876 955620 990481 1033499 992400
26890 992400 965131 980221 1031835 1035298 1007073 1021410 1017725 1030459 986737 962417 985434 1077891
26878 1077891 1117955 1062747 1081290 1112061 1046363 996829 950359 1001235 1086956 1116952 1072106
26867 1072106 1031009 1040193 1076334 1096701 1143610 1101597 1140688 1160872 1101136 1064531 1068590 1115542
26855 1115542 1146454 1092902 1135634 1119302 1080353 1104392 1213086 1271703 1238496 1218182 1197718
26844 1197718 1130796 1053866 1029876 1035961 1007445 966866 928985 945962 930080 922236 1018069 1028818
26832 1028818 1023105 1048907 1100147 1119931 1120995 1079589 1029133 1054191 1124827 1148215 1083362 1026937
26820 1026937 1010909 1008193 1000795 1026787 1041773 1019106 1005690 1003095 1041110 1080539 1080951 1038244
26808 1038244 1065475 1079675 1055467 1045695 1064029 969852 910213 902261 908032 927574 953511 932925
26796 932925 903425 952134 1003110 1055583 1079609 1061473 1099211 1050781 954675 958019 980121 934773
26784 934773 970140 1071939 1093455 1074070 1091248 1031940 931095 927972 975927 1032903 1005571
26773 1005571 997638 1009483 957071 1013793 1064262 1064410 1047006 1036276 1013408 1002285 1039176 1105231
26761 1105231 1118693 1096191 1055744 1068456 1057516 1064320 1035515 1063790 1059854 1079423 1055362 1036170
26749 1036170 1027319 1074855 1036003 991391 941684 958925 1015209 1057829 1054644 1048725 1016887 996523
26737 996523 1001858 1031238 984539 900313 884731 957461 1030226 1029933 999035 981474 962892 990773
26725 990773 1045731 1038215 979782 1009350 1020306 1010903 1032223 1064718 993188 977880 986928 950154
26713 950154 960591 1041379 1049352 1067656 1047480 1009610 1014223 1102329 1097845 1097980 1086335 1082573 1088355
26700 1088355 1081480 1078607 1109564 1063735 988702 1019659 1081560 1045902 1047635 1049766 1068581 1070258
26688 1070258 1112409 1154481 1172962 1119133 1052679 1044627 996767 982821 1022135 1017885 1020535 1015681
26676 1015681 988568 967269 950310 1010000 1052148 1032692 1102238 1108073 1086206 1069024 1041093
26665 1041093 1049622 1008544 994597 1027302 1041691 1058029 1058809 1090480 1096655 1118207 1126126 1082039
26653 1082039 986257 889287 933104 1007973 982971 1004653 972011 982315 1008765 1024439 1034784
26642 1034784 998987 1031200 1001227 962472 985811 969203 977819 948537 942730 927547 953750 1000633
26630 1000633 974417 980706 983303 1028452 1043026 1020849 983132 988068 1008176 1027306 1037238 1081333
26618 1081333 1097965 1103549 1046465 996446 978423 990755 1032580 1042835 1072538 1083076 1087947 1023777
26606 1023777 1008366 1048831 1036489 1021854 1002555 1036722 1055501 1039806 1047674 1048223 1032674 995755
26594 995755 978881 1029009 1055821 1087348 1141314 1142247 1061615 974711 952627 972866 992426 1043793
26582 1043793 1104129 1092405 1029162 1093305 1165147 1129708 1101251 1092130 1086039 1065168 1064033 1046172
26570 1046172 1052848 1030715 1012393 1033375 1138194 1121120 1020723 995292 978984 975089 997603
26559 997603 996231 1018880 1001568 972326 989132 1020122 1033794 1058271 1056123 1051200 1037168 1057560
26547 1057560 1105509 1105336 1133349 1159696 1109837 1099957 1143154 1189521 1183098 1152964 1016989 971454
26535 971454 952595 976790 1040244 1076462 1111104 1074183 1070909 1151157 1122538 1074246 1037201 965529
26523 965529 983000 1038362 1009522 1016838 1036367 1099757 1117609 1091967 1079655 1105160 1094676 1030378
26511 1030378 960218 1027346 1042791 948490 883083 921727 1017596 1012328 1014295 1116613 1209183
26500 1209183 1164410 1138910 1112857 1097110 1025723 1073327 1081382 1094436 1096326 1095284 1136434 1166190
26488 1166190 1211157 1195927 1153962 1139440 1106321 1136693 1082580 1056005 1127724 1154847 1134667
26477 1134667 1153620 1134325 1123051 1084556 1053346 1065508 1119170 1090610 1076024 1057030 1060069
26466 1060069 1039830 1110121 1162217 1140618 1059487 1088540 1082933 1101447 1101773 1069607 1064563 1039278
26454 1039278 1033761 1048373 1046456 1005809 1040371 1095264 1134639 1146801 1119565 1049885 1125473 1162433
26442 1162433 1197819 1250506 1229437 1164493 1145852 1140220 1189469 1188200 1182008 1173370 1059938 1100888
26430 1100888 1149128 1094414 1000657 995600 985462 1015900 1053934 1078572 1147093 1183557 1095649
26419 1095649 1012656 1004624 996952 1003231 1026443 1050983 1084955 1103894 1084093 1066491 991413 938790
26407 938790 1025407 1042505 1014267 1021261 1010993 1115042 1178339 1191284 1216655 1266684 1196198
26396 1196198 1112264 1071800 1010890 1015020 1046506 1059556 1018882 1009133 1061243 1160936 1149832 1146727
26384 1146727 1136369 1168841 1139142 1097910 1101235 1095208 1116059 1148541 1101418 1086626 1137442 1087012
26372 1087012 1014788 1020486 1022204 985206 1001161 1029375 1010612 1065735 1108316 1096038 1051764 1041696
26360 1041696 1067241 1091273 1068709 1074821 1028850 948557 995689 1077292 1073650 1089831 1086422 1032369
26348 1032369 1006690 1005809 1002559 1023707 1024666 1003857 999579 1021955 989016 1009013 1071620 1085012
26336 1085012 1093672 1077440 1099303 1097386 1062532 1012410 1048741 1099317 1183372 1112640 1042001 1043345
26324 1043345 1074938 1042569 1071250 1098058 1114847 1109042 1062546 1046304 1064331 1135771 1176150
26313 1176150 1129442 1081981 1069864 1086107 1060618 1016709 1012217 1011902 1066298 1030151 1028619 1033218
26301 1033218 1099189 1102381 1075753 1049717 1093963 1117640 1094233 1086286 1161357 1163974 1134774 1113090
26289 1113090 1034313 1068053 1088679 1047353 993439 958870 971440 1063795 1094014 1064392 1037326
26278 1037326 1126667 1173782 1118919 1037286 1026826 1080796 1122690 1109666 1110107 1139984 1178705 1154552
26266 1154552 1141282 1151937 1162180 1122425 1144847 1129896 1097641 1114197 1138263 1126787 1186788
26255 1186788 1150119 1064407 1071132 1134380 1127673 1134657 1154482 1110893 1133226 1088504 1015935 978897
26243 978897 1048891 1093828 1176969 1149220 1053833 1038753 1113307 1139687 1219111 1243695 1246600 1224601
26231 1224601 1164831 1150041 1160189 1120367 1131324 1143172 1154688 1201391 1194661 1120109 1126417 1104913
26219 1104913 1052607 1060069 1079312 1117783 1116054 1129921 1185000 1147881 1050906 1006631 1024838 1040678
26207 1040678 1047885 1020568 1109442 1173738 1227700 1200545 1181393 1185721 1199461 1152530 1175013 1234466
26195 1234466 1247138 1192717 1137130 1130165 1157144 1146233 1155400 1138450 1099867 1045624 1049704 1061755
26183 1061755 1074862 1077835 1089141 1109851 1107727 1078423 1044495 1084258 1121037 1122209 1116853 1135316
26171 1135316 1154140 1178133 1115827 1059372 1105686 1151577 1206879 1205319 1171088 1145666 1165513
26160 1165513 1162734 1148275 1078555 1061364 1200573 1214265 1183068 1212446 1238336 1246428 1254977 1243044
26148 1243044 1229466 1228524 1192026 1159228 1103727 1052662 1049314 1110932 1130721 1052749 1017264 1056571
26136 1056571 1114470 1095269 1092543 1139886 1141364 1165955 1164609 1148854 1146355 1122208 1116728 1103306
26124 1103306 1140216 1131785 1138636 1181997 1117854 1096615 1115137 1161915 1198684 1211441 1199597 1226688
26112 1226688 1205366 1158069 1112944 1137042 1217475 1238749 1191162 1158801 1093462 1090881 1137693
26101 1137693 1107843 1069527 1017795 960929 957858 1015616 1078590 1146516 1200261 1219076 1173675
26090 1173675 1120487 1111637 1102779 1060916 1107008 1100093 1005238 999239 1035556 1020472 1043771 1086228
26078 1086228 1165964 1214299 1213846 1171842 1147759 1171161 1187554 1140910 1131558 1120044 1120910 1131897
26066 1131897 1119507 1126105 1132070 1123475 1100881 1121647 1132351 1139055 1064071 1050721 1033620 1002017
26054 1002017 999668 1019381 1024182 1022344 1095264 1085436 1111851 1126910 1087436 1048268 1103735 1193389
26042 1193389 1159831 1069388 1118814 1173900 1175011 1171483 1167151 1112105 1105654 1118500 1089192 1099515
26030 1099515 1081341 1065848 1112830 1089047 1115339 1141169 1113006 1043542 1033321 1071951 1081687
26019 1081687 1097184 1154871 1112858 1102967 1093228 1087196 1128582 1158479 1201770 1146843 1104525 1032120
26007 1032120 1001487 1034862 1089978 1139556 1168559 1113603 1106206 1098374 1024562 1038737 1089896 1051543
25995 1051543 1056891 1093561 1121531 1136071 1156948 1136131 1117222 1132564 1141467 1103508 1098665 1150354
25983 1150354 1126394 1080675 1111148 1116629 1142021 1133542 1098761 1056226 1086275 1106613 1117918 1114111
25971 1114111 1092362 1068165 1066818 1057969 1107654 1165223 1161289 1143751 1167356 1207449 1227282 1180226
25959 1180226 1114925 1116913 1115997 1096710 1111047 1161366 1152035 1135299 1138339 1229183 1227018 1177189
25947 1177189 1112837 1104082 1073279 1071488 1126913 1091187 1111179 1135571 1187879 1210219 1169294 1107293
25935 1107293 1064175 1066274 1129743 1175706 1125221 1150210 1131996 1141669 1177848 1200270 1265466 1259047
25923 1259047 1264040 1261754 1182347 1113314 1097896 1211119 1326303 1309822 1226279 1173313 1147956
25912 1147956 1134276 1126102 1058656 1108120 1141983 1088191 1063413 1092016 1115401 1149086 1127826
25901 1127826 1157267 1206365 1187749 1147982 1157669 1246364 1277505 1264151 1227840 1213506 1211603 1222095
25889 1222095 1213217 1203284 1178837 1161331 1145429 1095301 1088354 1170802 1158041 1194010 1239548 1287241
25877 1287241 1304233 1290430 1273273 1324467 1272641 1252449 1210380 1182890 1143849 1134808 1170775
25866 1170775 1243461 1204667 1189372 1211703 1193642 1155682 1145224 1144474 1138098 1170122 1146510 1200224
25854 1200224 1161134 1133072 1122459 1166425 1150980 1149844 1180372 1208742 1187923 1151367 1126940
25843 1126940 1200743 1260876 1264781 1349481 1311673 1206067 1152521 1104512 1070034 1065780 1123618
25832 1123618 1106860 1101567 1142393 1154470 1108074 1109231 1092236 1134232 1189476 1154624 1130476 1169476
25820 1169476 1238627 1231292 1205496 1183022 1195851 1234590 1223177 1225928 1197500 1152771 1145428 1107201
25808 1107201 1100556 1152950 1215633 1232997 1266913 1260446 1213723 1202351 1183345 1146804 1137266 1213066
25796 1213066 1226487 1206258 1214106 1205299 1157926 1136280 1098259 1120080 1108337 1039884 1095395 1219507
25784 1219507 1238779 1257000 1261273 1282866 1275946 1288726 1187965 1122138 1166650 1242453 1316040
25773 1316040 1263285 1215790 1192104 1208979 1255665 1225675 1211886 1247126 1272493 1232893 1252491
25762 1252491 1274608 1266904 1213817 1262761 1263570 1210030 1166939 1158950 1133069 1186483 1236082 1187162
25750 1187162 1178922 1184296 1209668 1185581 1199758 1220615 1167278 1154620 1115730 1158120 1187945 1236382
25738 1236382 1246391 1246311 1205821 1164606 1149294 1099520 1137814 1199057 1258505 1250857 1264883 1256871
25726 1256871 1227955 1198730 1182256 1173509 1101746 1111740 1146600 1154040 1140768 1153578 1164279 1154084
25714 1154084 1137008 1094731 1171024 1250759 1276890 1292369 1287009 1254603 1229228 1168896 1138118
25703 1138118 1200506 1172350 1078037 1103320 1151641 1181463 1160213 1141613 1127382 1168015 1186047
25692 1186047 1215289 1207271 1187432 1106622 1118552 1120477 1158734 1231760 1187697 1147865 1129575 1199932
25680 1199932 1209438 1182237 1237241 1251463 1251883 1228476 1216488 1243866 1251400 1213103 1169987 1163385
25668 1163385 1190552 1233969 1254932 1256149 1157250 1130627 1103790 1125119 1197578 1286328 1341963
25657 1341963 1299825 1289577 1332616 1342669 1309337 1216572 1204126 1243328 1199551 1160710 1250370
25646 1250370 1321027 1306584 1232633 1184785 1159869 1156348 1197530 1273486 1304655 1303583 1233661 1190181
25634 1190181 1255721 1337538 1254837 1188211 1197028 1202688 1226630 1223612 1248696 1303177 1235282 1183052
25622 1183052 1204436 1242783 1233768 1231180 1226746 1241377 1228942 1218960 1254758 1205741 1157742 1156373
25610 1156373 1231758 1210499 1209696 1262401 1228036 1184836 1180670 1251037 1215550 1190155 1224446 1270622
25598 1270622 1293414 1280458 1231255 1111275 1125510 1204945 1193985 1218749 1232306 1163194 1190574
25587 1190574 1296351 1274946 1212216 1225286 1318137 1325411 1265804 1206267 1165248 1189639 1243576
25576 1243576 1271468 1296111 1289192 1286432 1276860 1245588 1309656 1339744 1280420 1209238 1167551 1189212
25564 1189212 1207300 1225585 1227244 1208188 1188794 1144479 1185310 1229574 1182625 1149934 1158563 1163628
25552 1163628 1193212 1120136 1154978 1220856 1256318 1352761 1286025 1280322 1282228 1303508 1310417 1232334
25540 1232334 1215762 1185868 1207863 1227233 1269010 1292082 1248798 1245906 1262556 1262044 1270692 1242780
25528 1242780 1193056 1145800 1157873 1198174 1194209 1193524 1174885 1227571 1217766 1164404 1178736 1168270
25516 1168270 1179055 1229201 1250828 1235134 1189219 1174081 1243575 1324291 1277068 1291526 1266363
25505 1266363 1249849 1172217 1192304 1227720 1265170 1214260 1225866 1312439 1363387 1389714 1414586
25494 1414586 1375850 1269888 1282246 1322445 1309266 1275568 1306994 1303181 1236603 1282244 1348896
25483 1348896 1282349 1258874 1258058 1260933 1287287 1288967 1263436 1311995 1307425 1294200 1275447 1257501
25471 1257501 1279538 1321178 1274788 1251464 1262099 1270079 1208847 1116821 1047349 1043185 1053677 1062078
25459 1062078 1072933 1056968 1174055 1250184 1283302 1303770 1302587 1229712 1187252 1119790 1159596
25448 1159596 1239857 1184482 1178788 1216549 1288335 1298548 1278325 1261148 1205954 1222961 1309771
25437 1309771 1338598 1326312 1241429 1263018 1237338 1239452 1267138 1252883 1236398 1220079 1195829
25426 1195829 1232784 1239988 1280401 1227714 1197280 1285997 1317513 1296288 1230127 1193800 1200376 1245499
25414 1245499 1227679 1251059 1277586 1284163 1271588 1283780 1268675 1312381 1327698 1344507 1392333
25403 1392333 1369645 1291975 1244116 1267388 1232509 1216047 1235019 1285344 1328818 1290412 1328249
25392 1328249 1319919 1234255 1237827 1261801 1228245 1209931 1290716 1294180 1316410 1305146 1295956 1317360
25380 1317360 1359287 1323018 1297917 1273644 1205199 1204193 1172212 1163477 1195940 1175039 1201123 1231867
25368 1231867 1263500 1317789 1344063 1321308 1250655 1167314 1111458 1185675 1205296 1190756 1180151
25357 1180151 1155354 1170493 1229927 1256004 1238067 1167786 1224993 1281822 1292575 1323376 1310124
25346 1310124 1281240 1289729 1234866 1217001 1233427 1184301 1172559 1246266 1204577 1175539 1210692
25335 1210692 1227729 1257859 1263338 1323823 1262123 1265543 1259878 1229247 1251550 1284070 1295993 1261909
25323 1261909 1246301 1299409 1304362 1350805 1379175 1371498 1373138 1331573 1288329 1248494 1167495 1190275
25311 1190275 1235078 1279195 1275927 1301909 1321314 1246607 1268362 1265435 1344359 1343205 1297094 1291548
25299 1291548 1269978 1287832 1340058 1310511 1281455 1261517 1325178 1412235 1402732 1389240 1340951
25288 1340951 1314932 1296391 1285423 1210235 1209349 1227183 1213097 1181496 1219931 1190992 1202307 1244729
25276 1244729 1235635 1238026 1246149 1230283 1290288 1268999 1235919 1234483 1209898 1247952 1297643 1274444
25264 1274444 1220331 1243942 1301111 1344945 1317686 1282284 1281069 1319882 1349904 1287962 1313220
25253 1313220 1373538 1355292 1362369 1342650 1333345 1293756 1306478 1302930 1278102 1195535 1210371 1226816
25241 1226816 1263157 1321651 1333136 1282483 1258070 1289584 1328337 1327275 1280936 1339332 1362471
25230 1362471 1385750 1379757 1382659 1300972 1289695 1299928 1333614 1322473 1292893 1245077 1283048 1288046
25218 1288046 1291424 1346623 1372452 1350003 1356557 1318359 1226978 1227779 1293714 1220035 1201681 1332669
25206 1332669 1409640 1389707 1340206 1328107 1320758 1365319 1409682 1381747 1361903 1423317 1398730
25195 1398730 1316780 1269647 1225898 1180272 1259510 1345723 1368777 1354225 1382552 1387631 1369073
25184 1369073 1341541 1349006 1322641 1353409 1357892 1317286 1268209 1283017 1299055 1362667 1410120 1494936
25172 1494936 1487334 1437925 1403794 1315620 1373745 1422167 1365630 1333123 1336841 1319383 1344270 1327501
25160 1327501 1293886 1273606 1257856 1300992 1334241 1419136 1488216 1477792 1448631 1379754 1355514
25149 1355514 1311269 1315357 1306969 1343036 1378554 1326205 1248573 1158460 1240121 1309595 1304849 1274249
25137 1274249 1302697 1301515 1277792 1320926 1356011 1339256 1333081 1291036 1298424 1336559 1373927 1329612
25125 1329612 1329355 1348640 1426703 1407735 1371750 1397552 1403070 1396966 1370285 1348933 1345827 1281707
25113 1281707 1318520 1359128 1368574 1366304 1355508 1356346 1337398 1416561 1409688 1399925 1400044 1431657 1420236
25100 1420236 1476107 1491429 1445544 1395562 1391142 1361809 1326625 1275544 1245941 1252830 1273934 1283426
25088 1283426 1337599 1345369 1378229 1430488 1393445 1360798 1349884 1368868 1382665 1406718 1441193
25077 1441193 1421842 1380709 1393142 1406779 1363281 1388923 1412889 1372076 1346408 1375059 1375721 1307443
25065 1307443 1286943 1343185 1373928 1455763 1444646 1402223 1407765 1371531 1361914 1379027 1385510 1438533
25053 1438533 1366494 1372963 1349015 1376033 1340493 1310660 1332309 1350505 1304561 1316728 1334483
25042 1334483 1262985 1219417 1269310 1322165 1274819 1285670 1312185 1264639 1299741 1263592 1296682
25031 1296682 1386358 1370374 1418534 1350277 1325176 1345151 1401909 1431666 1402105 1371836 1297319
25020 1297319 1278380 1273931 1271783 1314129 1344071 1383263 1401861 1390365 1412005 1438057 1414720 1413895
25008 1413895 1491538 1515424 1454899 1406081 1391113 1379206 1425115 1411330 1385276 1432392 1422470
24997 1422470 1294864 1262415 1256732 1310436 1378096 1394849 1385103 1360532 1376659 1399219 1422392
24986 1422392 1499540 1485694 1406238 1368284 1352471 1387488 1486083 1435365 1307035 1245427 1307306
24975 1307306 1417678 1408546 1353862 1333660 1336704 1390049 1463270 1510946 1423287 1346232 1366641
24964 1366641 1313027 1311166 1358557 1408127 1463508 1422181 1375686 1394000 1440168 1413007 1402459
24953 1402459 1474598 1455649 1415288 1368548 1393402 1435228 1381846 1373122 1342485 1316548 1370613
24942 1370613 1423086 1381032 1373087 1381427 1332957 1375019 1384543 1433198 1462664 1510843 1494228 1434099
24930 1434099 1479811 1526664 1496164 1442781 1392584 1405305 1422088 1417491 1357661 1291649 1298777 1280032
24918 1280032 1304264 1337382 1330154 1385185 1461606 1442581 1455290 1481794 1468628 1416258 1415793 1418462
24906 1418462 1356267 1334401 1359611 1376436 1407213 1381193 1375392 1457650 1512778 1501987 1482043
24895 1482043 1472302 1451723 1430035 1460627 1413736 1384642 1367597 1349821 1367443 1408744 1417521 1441175
24883 1441175 1502735 1505109 1474569 1477647 1479565 1390668 1384385 1381330 1340348 1379315 1391047 1402595
24871 1402595 1401608 1419185 1371744 1294012 1285199 1264411 1302821 1412470 1461187 1431867 1356838 1323279
24859 1323279 1354151 1415800 1443811 1479558 1490143 1448789 1499903 1481628 1447378 1445259 1393564
24848 1393564 1441972 1511037 1490366 1416363 1399280 1401110 1458915 1478575 1493716 1435507 1389304
24837 1389304 1439163 1414331 1392729 1432214 1415527 1399577 1460329 1508635 1491512 1451573 1444332
24826 1444332 1479683 1528590 1435653 1421236 1444140 1501944 1483860 1460434 1498141 1458311 1422323
24815 1422323 1379035 1304295 1288718 1292004 1338881 1370202 1369884 1335372 1350913 1383471 1331637 1354653
24803 1354653 1331919 1288284 1277484 1343305 1403193 1382054 1414298 1368543 1324769 1330846 1321377 1340233
24791 1340233 1374271 1395190 1354985 1356102 1378819 1433772 1474652 1452516 1370224 1376530 1403896 1421633
24779 1421633 1475815 1480780 1441845 1452953 1475404 1433061 1428671 1416386 1381316 1447390 1400750 1372997
24767 1372997 1356464 1370962 1397321 1414227 1453445 1482997 1468504 1391372 1391472 1400523 1360959 1384568
24755 1384568 1427895 1404462 1398083 1459743 1464543 1448489 1457131 1425506 1409266 1437069 1492547 1451576
24743 1451576 1431017 1397298 1395094 1368168 1284327 1243388 1272742 1372005 1414621 1443445 1428737
24732 1428737 1399188 1433529 1458429 1417425 1442846 1415795 1349299 1353840 1398328 1415326 1430588
24721 1430588 1456358 1458214 1470155 1435782 1388459 1373552 1363362 1381127 1391859 1384894 1391609 1412684
24709 1412684 1429781 1524756 1602407 1550290 1473269 1443502 1448995 1485794 1474287 1445918 1460972
24698 1460972 1484972 1439110 1400367 1397057 1398435 1478814 1509671 1498073 1490356 1461568 1478025 1504384
24686 1504384 1465974 1463349 1478843 1476785 1497361 1478922 1408201 1375830 1489171 1556038 1505144
24675 1505144 1475887 1452290 1483238 1507676 1505264 1484916 1413947 1400674 1409555 1464261 1504045 1496732
24663 1496732 1497170 1473607 1445621 1475816 1498636 1524196 1503810 1459354 1425190 1425900 1486394 1471450
24651 1471450 1494299 1509647 1491309 1517039 1538463 1533869 1490123 1462590 1475221 1516366 1526125 1504946
24639 1504946 1494446 1523449 1557123 1502393 1464549 1413412 1391113 1358431 1382619 1428417 1467378
24628 1467378 1476992 1465830 1433517 1409611 1399153 1425060 1440451 1443248 1384996 1443290 1447919 1440627
24616 1440627 1471694 1550815 1580085 1524788 1417555 1412693 1438227 1482574 1506709 1465700 1399851
24605 1399851 1489222 1516750 1474933 1446953 1462440 1497632 1520248 1490702 1459616 1448067 1451321
24594 1451321 1438587 1488884 1543005 1491892 1501671 1461334 1411363 1474356 1538772 1561810 1644856
24583 1644856 1663268 1597450 1568742 1506423 1517424 1535041 1555479 1563584 1578440 1529674 1534639 1577907
24571 1577907 1583210 1553529 1527576 1528846 1516748 1610825 1640721 1621396 1660677 1627910 1635989 1579184
24559 1579184 1529779 1524911 1523553 1484689 1513272 1491480 1453426 1439045 1470970 1505520 1533603 1532192
24547 1532192 1476035 1438630 1431518 1423318 1419332 1479660 1496376 1519218 1523251 1506527 1487814 1486618
24535 1486618 1526618 1543532 1542502 1507725 1416164 1392477 1336830 1279460 1288769 1353896 1345792 1406195
24523 1406195 1507641 1521780 1511269 1493603 1454485 1436962 1474147 1467598 1504153 1505032 1474194 1432983
24511 1432983 1454495 1457036 1445099 1499299 1499302 1468855 1372899 1420599 1468819 1491254 1507906 1485095
24499 1485095 1502021 1547409 1533310 1536745 1538147 1530549 1509037 1465998 1414946 1365282 1385447 1471532
24487 1471532 1487247 1477146 1506214 1570032 1522569 1490180 1522794 1481324 1506363 1547510 1550987
24476 1550987 1563713 1493657 1492328 1562056 1553668 1554787 1592786 1578270 1545167 1538662 1549767 1546437
24464 1546437 1524439 1498038 1457759 1426026 1433831 1466016 1513227 1528653 1564577 1596400 1549532
24453 1549532 1520889 1518634 1491411 1508184 1541852 1503449 1455291 1422212 1440735 1431384 1526005 1555955
24441 1555955 1502194 1448345 1455914 1427901 1458288 1537582 1491777 1440933 1423522 1428890 1420077 1469351
24429 1469351 1473613 1477863 1480696 1459544 1487283 1498849 1508846 1551791 1538531 1558384 1507404 1488093
24417 1488093 1513148 1456533 1434537 1458890 1484437 1486833 1455121 1449671 1462111 1463931 1489495 1563266
24405 1563266 1570691 1511366 1450877 1458797 1489633 1526697 1544579 1505979 1548570 1603911 1539176 1540429
24393 1540429 1569842 1569937 1541992 1483978 1438317 1535162 1575935 1530191 1529898 1535175 1505410 1509082 1467747
24380 1467747 1443965 1478344 1521718 1611957 1648671 1640924 1646031 1646281 1702056 1733116 1677642 1633615
24368 1633615 1632068 1657401 1674512 1646625 1632646 1642603 1603472 1621269 1555733 1500322 1467304 1478818
24356 1478818 1508987 1509800 1512966 1550802 1614810 1620469 1599631 1630859 1694291 1733005 1681461 1636768
24344 1636768 1610980 1598975 1654156 1637997 1638487 1589638 1614287 1636596 1641030 1607524 1557357 1533480
24332 1533480 1591573 1622030 1591752 1609421 1590388 1553264 1572353 1591658 1671433 1643985 1601662
24321 1601662 1545083 1568536 1614930 1597779 1578583 1534276 1616558 1655264 1615356 1532730 1526173
24310 1526173 1572602 1540077 1499332 1506878 1592111 1641064 1632472 1735369 1740534 1647824 1579542 1593181
24298 1593181 1615566 1609787 1668498 1649238 1612099 1657748 1717406 1686241 1613041 1512120 1492061
24287 1492061 1510297 1635597 1645003 1567138 1557983 1597690 1579188 1534309 1544867 1536329 1533473 1636903
24275 1636903 1678745 1652244 1543389 1488830 1532580 1547541 1648220 1650338 1619724 1587560 1612931
24264 1612931 1699955 1730505 1679096 1628341 1695911 1679389 1624021 1602620 1567044 1590840 1546859
24253 1546859 1517651 1550608 1543827 1551135 1611901 1636166 1605363 1524903 1550121 1547745 1498886 1530269
24241 1530269 1624125 1654868 1576199 1539914 1526790 1615793 1636611 1652084 1676694 1644541 1581641
24230 1581641 1604144 1748014 1814105 1772738 1728126 1767530 1720676 1696458 1645100 1575817 1571022
24219 1571022 1594435 1684644 1700645 1660021 1669013 1687186 1676153 1664367 1649873 1685157 1708407
24208 1708407 1680410 1639801 1618911 1642495 1716905 1732326 1673716 1640945 1625624 1607902 1672326
24197 1672326 1678820 1569705 1572921 1616432 1701719 1721817 1714638 1701210 1719629 1700541 1676052 1591358
24185 1591358 1573404 1579519 1592225 1625412 1608392 1664249 1668391 1646254 1690465 1738104 1743167 1653971
24173 1653971 1596130 1552687 1586680 1632432 1595221 1607046 1613247 1652527 1715884 1665391 1616923
24162 1616923 1573240 1595920 1667372 1671013 1614349 1624963 1730574 1786788 1701867 1615842 1644561
24151 1644561 1708369 1656944 1646552 1613200 1575747 1550489 1596805 1619009 1593010 1674682 1753993
24140 1753993 1729274 1688726 1657017 1628042 1592438 1525520 1641476 1725803 1681796 1572807 1560280
24129 1560280 1626404 1633571 1603631 1614557 1686860 1649851 1588216 1605685 1662588 1691914 1662286
24118 1662286 1659220 1672327 1632367 1703235 1757241 1748836 1779097 1811827 1829692 1832470 1837951 1812957
24106 1812957 1759942 1719300 1723710 1718980 1686623 1734280 1677832 1653981 1665091 1662884 1645595 1654978
24094 1654978 1679373 1683733 1717614 1718431 1758068 1786942 1728609 1680096 1679418 1606101 1597598 1602311 1683202
24081 1683202 1689849 1686146 1678958 1669927 1647557 1669713 1693675 1698375 1671318 1695318 1682476 1637915
24069 1637915 1623917 1669353 1775612 1782770 1689752 1647711 1666680 1680591 1682579 1651237 1665731
24058 1665731 1664042 1672535 1695324 1662519 1732855 1817813 1781835 1786391 1771945 1745503 1708822 1661204
24046 1661204 1672065 1706571 1767767 1749755 1651188 1640521 1663350 1715229 1781183 1844035 1806404
24035 1806404 1738963 1746815 1780313 1758917 1717994 1666689 1660537 1645518 1736517 1772622 1780645 1783725
24023 1783725 1768013 1721118 1659086 1678109 1721043 1702333 1691692 1692905 1743481 1713099 1713718 1732231
24011 1732231 1733566 1723407 1721506 1722139 1677482 1635741 1667229 1688964 1675766 1686653 1636829 1644224
23999 1644224 1686093 1736472 1783478 1848244 1840970 1799009 1792057 1730761 1708359 1746126 1828242 1868311
23987 1868311 1868910 1805216 1741321 1733364 1762218 1781962 1786047 1772301 1800482 1850909 1867804 1819191
23975 1819191 1790691 1722477 1699388 1733399 1825397 1817632 1815924 1820316 1734745 1726382 1657507 1597604
23963 1597604 1577032 1641641 1716659 1724229 1706691 1733924 1716902 1696767 1675080 1721162 1769734
23952 1769734 1760011 1798456 1726746 1693642 1764970 1725281 1714651 1773378 1779999 1759580 1729386 1694255
23940 1694255 1695778 1723407 1687856 1726871 1741725 1762394 1763234 1711685 1694707 1716988 1747550 1737871
23928 1737871 1706995 1648067 1643600 1728882 1766285 1745656 1717465 1772326 1713253 1683832 1692455 1753763
23916 1753763 1803926 1750464 1710435 1756436 1764502 1726514 1740771 1760151 1821047 1842151 1851592 1773136
23904 1773136 1776406 1725498 1693451 1757502 1854582 1951486 1971675 1974712 1926160 1890509 1864460 1887239
23892 1887239 1902748 1900835 1834978 1794629 1773240 1705128 1679431 1742255 1766983 1826618 1883475
23881 1883475 1880569 1854980 1817975 1749933 1728262 1754133 1828231 1873929 1876434 1833917 1795286 1775838
23869 1775838 1814657 1800238 1775798 1763133 1771333 1820005 1783379 1739468 1811496 1823334 1779157
23858 1779157 1745440 1768968 1797520 1816397 1777326 1725075 1756975 1784450 1766679 1792832 1767759
23847 1767759 1752767 1785820 1807077 1824869 1815910 1776051 1761239 1781624 1726909 1678769 1731982
23836 1731982 1771510 1755014 1785606 1842346 1843317 1826764 1821090 1816781 1835493 1793713 1757509 1822080
23824 1822080 1820546 1758923 1735284 1764429 1771787 1810976 1819476 1852399 1818527 1778984 1778533 1730367
23812 1730367 1726824 1756256 1799697 1819205 1816056 1764649 1751842 1767781 1816365 1856676 1832374 1769113
23800 1769113 1741276 1712697 1743278 1823925 1907554 1951197 1970358 2005585 1963773 1856270 1818065
23789 1818065 1889402 1901290 1896482 1892120 1862742 1873594 1848082 1818058 1818317 1826579 1810517 1783256
23777 1783256 1793919 1839667 1834980 1833787 1831527 1819065 1875440 1910283 1925290 1890550 1908367 1840695
23765 1840695 1760842 1670805 1719934 1820552 1890737 1885317 1886041 1839681 1840576 1860861 1794790 1780176
23753 1780176 1755238 1793423 1809822 1847496 1886339 1900406 1901671 1852716 1840509 1847972 1880980 1902921
23741 1902921 1840193 1787383 1813605 1819404 1876467 1958317 1969472 1951850 1908021 1963400 1994340
23730 1994340 1976002 1966082 1916422 1864160 1870050 1897714 1948801 1920947 1860152 1902182 1940315 1943812
23718 1943812 1910468 1861803 1834626 1805491 1853831 1921412 1899201 1927688 1934883 1892948 1868821
23707 1868821 1866559 1902092 1941776 1973192 1992880 2040516 1990254 1914257 1949242 2011771 2069170
23696 2069170 2073740 2018036 2029560 2036206 2068297 2061064 2057138 2008833 1957893 1918177 1947284 1979256
23684 1979256 1990366 1960968 1927521 1910033 1880240 1947583 1992768 1952538 1924466 1928782 1892261
23673 1892261 1934275 1940047 1852972 1785632 1751293 1794433 1860091 1849331 1795795 1808816 1854267
23662 1854267 1852830 1866730 1880212 1846372 1856153 1930972 1937539 1969604 1959441 1955072 1982637 1954064
23650 1954064 1878192 1878440 1931804 1935729 1901287 1935100 1890169 1941705 1947106 1905294 1847507 1874775
23638 1874775 1875735 1897758 1906887 1871838 1856180 1889144 1947749 2012610 2043720 2052344 2014337 1968880
23626 1968880 1972853 1996411 1974615 1985097 1963519 2012063 1997742 1960604 2012693 2037132 1993724
23615 1993724 2012061 1950439 1928297 1942649 1895836 1897695 1941982 1973149 1929572 1906838 1936963
23604 1936963 1983226 2037485 2009579 2014895 1937567 1904287 1962738 1967410 1990787 1931215 1905847 1898504
23592 1898504 1901185 1884344 1887193 1921533 1977428 1990558 2012049 2031193 2018956 2044698 2069879 2058237
23580 2058237 1976757 1970750 1957338 2053816 2095674 2038969 1949868 1925893 1964602 2036485 2048068
23569 2048068 2058489 2068463 2040032 2037333 2067652 2048521 2087846 2047182 2041047 2065929 2057593 1998910
23557 1998910 2011742 2077116 2139422 2139263 2090231 2020527 1968319 1919561 1975255 1971065 1979130 1939041
23545 1939041 1955628 1997552 1969171 1888667 1990065 2064728 2094013 2121330 2030755 1989580 2008763
23534 2008763 2018301 1974968 1953403 1973357 1980837 2001538 2089005 2139332 2094245 2130047 2154998 2139238
23522 2139238 2175493 2171651 2144685 2075369 2034040 2032181 2039565 2063202 2065898 2110288 2070794 2027291
23510 2027291 2031957 2070224 2095250 2064268 2052596 2100096 2124203 2065382 1983739 2033574 2106427
23499 2106427 2124211 2079750 2084891 2077064 2076797 2086588 2107840 2069004 2064057 2060374 2062320 2088491 2053400
23486 2053400 2061933 2060831 2006388 2006572 2077006 2068817 2078591 2064789 1988081 2007572 2058621 2047357
23474 2047357 2063676 2058900 2116286 2125545 2109995 2130791 2189012 2208399 2161773 2137355 2069897 1982608
23462 1982608 1951554 2047867 2048355 2070004 2083326 2095810 2087918 2006326 1926890 2027393 2066612 2038891
23450 2038891 2030041 2056210 2143217 2162227 2164388 2174480 2186569 2113883 2078061 2026235 2038274 2151848
23438 2151848 2151378 2125809 2105799 2106437 2081089 2042974 2076983 2100882 2130526 2158910 2157886 2180964
23426 2180964 2199570 2164219 2158825 2166129 2067835 2059884 2046669 2065217 2031667 2074101 2119358 2126499
23414 2126499 2147533 2157060 2163830 2216263 2272013 2215784 2206753 2183466 2213279 2224906 2124963 2103854
23402 2103854 2108578 2151725 2107085 2163019 2221148 2188404 2150323 2140887 2158148 2165927 2212259 2214036
23390 2214036 2255085 2253272 2227635 2165013 2167810 2154730 2139062 2182397 2226447 2266727 2339569 2316603
23378 2316603 2223819 2179573 2136367 2145917 2133775 2146340 2184337 2177850 2176035 2197434 2154246 2134333
23366 2134333 2195321 2180911 2179127 2200084 2181604 2222562 2252274 2209017 2197226 2179483 2175202 2217239
23354 2217239 2223431 2229700 2211418 2194289 2190504 2201168 2183312 2179357 2187411 2173221 2201565 2165158
23342 2165158 2120471 2040472 2102696 2157766 2194338 2231181 2229994 2215439 2241779 2259999 2240063
23331 2240063 2207801 2197777 2227187 2227165 2229695 2233206 2242621 2211194 2231818 2273409 2239947 2220677
23319 2220677 2293195 2299733 2243666 2223494 2192875 2187798 2205032 2313322 2345565 2293911 2260775
23308 2260775 2285017 2276028 2232937 2155904 2110872 2173528 2208710 2191108 2195246 2240601 2232695 2247981
23296 2247981 2277602 2247419 2267046 2290743 2327296 2333462 2330722 2272814 2257209 2326265 2381478 2356654
23284 2356654 2257443 2244252 2245806 2244246 2282557 2282038 2273228 2286774 2311722 2314744 2258494 2284115
23272 2284115 2319999 2345393 2349512 2277418 2199918 2205497 2276367 2289038 2248594 2207584 2207310 2222867
23260 2222867 2230203 2221290 2272693 2302298 2269367 2227749 2183792 2225911 2237324 2249358 2315791 2408467
23248 2408467 2417930 2388414 2400406 2326212 2380608 2372514 2291957 2243939 2345767 2386015 2347207
23237 2347207 2348449 2435086 2450010 2384414 2314713 2282023 2286939 2318932 2336547 2401680 2383366 2333177
23225 2333177 2296708 2306427 2347997 2350163 2333908 2377373 2437018 2425096 2353208 2277987 2312884 2320496
23213 2320496 2318237 2374939 2396526 2371854 2342429 2353340 2316130 2319184 2359886 2423290 2388568 2384760
23201 2384760 2402020 2432332 2432710 2393195 2377484 2367148 2302282 2281849 2366495 2401695 2386623 2408253
23189 2408253 2411120 2352538 2336068 2356451 2353469 2360886 2372702 2395656 2390920 2408280 2437359 2480640
23177 2480640 2520537 2440793 2371620 2361945 2367296 2345346 2367089 2340585 2315030 2301757 2362821 2373200
23165 2373200 2331052 2335031 2348800 2358890 2465080 2455078 2396233 2359907 2359283 2417453 2488608 2502196
23153 2502196 2516845 2461386 2479875 2538432 2566933 2498747 2431264 2422493 2416686 2439117 2470488 2470392
23141 2470392 2539758 2505272 2515154 2519081 2508813 2480566 2419704 2409236 2418554 2429402 2519975 2577388
23129 2577388 2632142 2608756 2552779 2523215 2447879 2436621 2449661 2517730 2555051 2601972 2612961
23118 2612961 2575562 2560292 2499844 2564654 2540157 2512637 2459206 2451895 2563489 2631442 2601809
23107 2601809 2559015 2606251 2632976 2550355 2597363 2636189 2647090 2656395 2642949 2608188 2570345
23096 2570345 2527151 2556282 2573290 2498489 2420024 2416927 2489013 2548005 2550559 2442600 2456239
23085 2456239 2493189 2496279 2503058 2511695 2529479 2592631 2564273 2541065 2557028 2503824 2454790 2566168
23073 2566168 2612883 2599254 2555855 2510622 2541351 2599113 2629943 2632344 2678142 2695815 2629673
23062 2629673 2603437 2609274 2627446 2625957 2602386 2524879 2519900 2630286 2683833 2696836 2663818 2596675
23050 2596675 2561648 2588640 2575271 2618217 2665484 2661885 2636001 2571561 2606186 2653652 2660442 2643591
23038 2643591 2603840 2632851 2686957 2673417 2725572 2786179 2826290 2780531 2710822 2723928 2736028
23027 2736028 2691714 2660633 2643452 2652875 2651079 2707785 2733087 2737276 2789748 2741280 2721624 2713358
23015 2713358 2758050 2769063 2807898 2764075 2693233 2712599 2755770 2714827 2659663 2685572 2799064
23004 2799064 2817651 2776612 2766674 2790460 2757276 2709322 2744500 2806251 2862230 2880408 2946252
22993 2946252 2911339 2819097 2718512 2744774 2759134 2702181 2756694 2805645 2883912 2885913 2817519
22982 2817519 2829756 2826979 2831118 2821425 2830014 2887281 2885080 2859894 2858821 2839243 2820316 2817701 2757240
22969 2757240 2764939 2758555 2775876 2852279 2883798 2800249 2750190 2768682 2808450 2842591 2865304 2798319
22957 2798319 2784568 2790829 2829816 2792261 2758061 2803825 2873432 2860200 2840971 2841754 2839297 2874394
22945 2874394 2924828 2873859 2817075 2880867 2914430 2922665 2970189 2934863 2932076 2992459 3021159 2977009
22933 2977009 3001528 3019385 3043252 3023273 3020500 3038995 3099357 3034651 3036658 3000137 2947053 2950812
22921 2950812 2964536 2921701 2966389 3044193 3081414 3147200 3142278 3074919 3033321 2995314 2967940
22910 2967940 2964998 2993552 2993952 3018054 2980819 2900493 2948985 2978454 2921901 2900116 2932356 2913856
22898 2913856 2928561 2957252 3027096 3043988 3069265 3070498 3104173 3097817 3072719 3104554 3122703 3112510
22886 3112510 3044993 3027154 3041526 3054078 3063895 3147440 3084704 3031465 3094237 3162715 3122380
22875 3122380 3136875 3152811 3170904 3163109 3109796 3095291 3106472 3092023 3092720 3114456 3137193 3165357
22863 3165357 3134114 3200476 3198341 3194763 3175808 3149860 3173355 3196440 3174200 3190419 3089453
22852 3089453 3051790 3126591 3178880 3202562 3243917 3300537 3255995 3228878 3184755 3180921 3182261 3284618
22840 3284618 3299056 3248668 3207886 3210819 3193709 3223063 3247504 3271084 3299201 3297453 3280510 3294095
22828 3294095 3290732 3338971 3327228 3260694 3200344 3225665 3269574 3228392 3233498 3292064 3314599 3312938
22816 3312938 3238734 3160669 3179075 3224597 3319706 3356641 3380227 3371117 3311285 3385867 3462670
22805 3462670 3481735 3462990 3403817 3409356 3464947 3521357 3529183 3490517 3467825 3447673 3389993 3368675
22793 3368675 3354479 3349425 3341646 3417401 3479010 3514495 3473355 3395560 3384475 3434360 3347752 3355905
22781 3355905 3425102 3446754 3360273 3338886 3386737 3397467 3489042 3538971 3440603 3393335 3404452
22770 3404452 3458953 3474803 3501964 3443076 3388289 3420383 3448842 3454603 3554968 3562772 3544524
22759 3544524 3527460 3532565 3556644 3587866 3589547 3653870 3694550 3650293 3634161 3613123 3594788 3621705
22747 3621705 3594169 3588656 3622309 3714624 3675820 3614350 3632221 3615954 3628582 3652320 3697524
22736 3697524 3672827 3667859 3629924 3676873 3727767 3721688 3731747 3735718 3723490 3768079 3785613 3861412
22724 3861412 3878204 3814426 3767381 3764247 3831792 3932926 3955639 3933926 3902293 3901740 3955779 3930546
22712 3930546 3913657 3892122 3836716 3859457 3859712 3825351 3848485 3889970 3816620 3804866 3861211 3895505
22700 3895505 3957144 3978218 3992148 3958884 3924686 3916974 3937274 3952196 3984503 3991879 3989829 3964236
22688 3964236 3963215 3972815 3980912 3943408 3940448 3961276 4001964 4022461 4081448 4153660 4232323 4252536
22676 4252536 4140106 4130028 4148193 4171627 4189632 4140836 4066286 4141110 4206931 4242076 4259304
22665 4259304 4218631 4204963 4248766 4242744 4242730 4285348 4274374 4274900 4262487 4275738 4297526 4402270
22653 4402270 4449785 4404103 4357192 4367765 4379033 4458638 4440662 4437851 4445660 4385942 4347890 4281121
22641 4281121 4244136 4231920 4253780 4381182 4453575 4456678 4471719 4444238 4490025 4527347 4499905
22630 4499905 4465018 4480066 4526338 4502584 4537514 4553926 4545785 4539606 4574147 4553358 4637250 4679382
22618 4679382 4672197 4603255 4650910 4669874 4690889 4682016 4670716 4697260 4758743 4785965 4772224 4786064
22606 4786064 4794388 4810091 4872550 4927397 4989430 4860909 4848645 4891016 4967546 5017307 5039235
22595 5039235 4967029 4946525 4945658 4997181 5004828 4968197 4941073 4811557 4751241 4872277 4857835
22584 4857835 4886809 4984327 5014295 5080267 4999554 5049555 5008677 5027324 5001638 5007968 5041227
22573 5041227 5103813 5064679 5073938 5134084 5161586 5245903 5250798 5248792 5300029 5347510 5372125 5348000
22561 5348000 5372994 5387603 5411363 5386871 5415925 5484697 5513807 5486099 5452896 5480998 5516213
22550 5516213 5635512 5654651 5652041 5687492 5772373 5822806 5831587 5790612 5806013 5873874 5872940 5921730
22538 5921730 5989262 5994459 5968313 5849102 5823992 5929898 5957720 5970287 6035705 6083362 6056660
22527 6056660 6039377 6103591 6220960 6332365 6362472 6358812 6384227 6426866 6389502 6321880 6296369
22516 6296369 6343302 6420292 6464498 6501926 6522688 6556663 6583517 6603067 6557541 6587690 6705780
22505 6705780 6758293 6818468 6877609 6870125 6833247 6769845 6843199 6950223 6951752 6969032 6961878 6941304
22493 6941304 6986490 7038015 7072464 7099415 7164048 7164554 7216913 7254045 7274739 7296517 7394589 7519995
22481 7519995 7559527 7637492 7725870 7787155 7830965 7894968 7935792 7986442 8002523 7978361 8046749
22470 8046749 8154783 8249272 8327317 8405734 8483000 8540270 8506411 8419150 8386313 8402990 8331827
22459 8331827 8350194 8439968 8512684 8636588 8669552 8681528 8770080 8880888 8973385 9093415 9198374
22448 9198374 9257019 9272260 9260361 9359619 9483541 9564691 9666649 9775832 9845238 9921688 9979487
22437 9979487 10118171 10167826 10211929 10280192 10346895 10425271 10576922 10752032 10859572 10964184
22427 10964184 11052812 11174648 11247518 11285885 11353701 11476121 11647664 11768396 11894815 12029551
22417 12029551 12211527 12409424 12538681 12664373 12758638 12826527 13008733 13160286 13301052 13470394
22407 13470394 13616767 13845219 14062974 14229975 14443382 14644499 14851303 15028522 15223454
22398 15223454 15442006 15651643 15883649 16094688 16320789 16600968 16919756 17183984 17482064
22389 17482064 17761065 18115072 18438561 18754691 19100284 19445853 19825916 20225496 20678422
22380 20678422 21147201 21543195 21894411 22321500 22827122 23347972 23932834 24543706 25182719
22371 25182719 25882102 26592203 27366095 28175507 28996223 29816376 30729179 31725121 32823384
22362 32823384 34072579 35384957 36835522 38428567 40180997 42014848 43839583 45532952
22354 45532952 47014082 48796440 51528707 54913841 58903547 63426130 68488795 74321665
22346 74321665 81224144 89615882 99971941 112985637 129513025 150615923 176160304
22339 176160304 201378088 211893702 187298985 114321420 -48132151 -208322856 -230628127
22332 -230628127 -197355045 -164493599 -139183287 -120346030 -106039370 -94870424 -85809599
22325 -85809599 -78030231 -71431596 -65857557 -61033283 -56815027 -53188656 -49938553 -47017693
22317 -47017693 -44298330 -41824268 -39537102 -37698309 -36242024 -35247204 -34714014 -33765081
22309 -33765081 -32430003 -31118481 -29866745 -28683856 -27617018 -26590901 -25684849 -24914386
22301 -24914386 -24162839 -23403617 -22662584 -21964963 -21247776 -20571259 -20021300 -19597632 -19099727
22292 -19099727 -18635104 -18077235 -17614090 -17223044 -16820203 -16380156 -15992762 -15644722 -15298407
22283 -15298407 -14930283 -14579880 -14291075 -14041158 -13818286 -13597241 -13305873 -13001681 -12708095
22274 -12708095 -12462466 -12188090 -11960964 -11695718 -11461344 -11262379 -11074661 -10889735 -10761354
22265 -10761354 -10635954 -10500684 -10260221 -10076907 -9849808 -9705064 -9561827 -9498458 -9359037
22256 -9359037 -9187426 -9017784 -8879929 -8751770 -8600751 -8477095 -8368175 -8277379 -8164517 -8072698
22246 -8072698 -7941189 -7758483 -7696897 -7603421 -7513776 -7471159 -7376139 -7263677 -7180746 -7040888
22236 -7040888 -6960093 -6980548 -6977901 -6866322 -6755519 -6638989 -6540822 -6433484 -6338406 -6200357
22226 -6200357 -6121621 -6066652 -5965450 -5930790 -5851195 -5868579 -5923572 -5910218 -5735263 -5648469 -5573198
22215 -5573198 -5507551 -5439507 -5400470 -5334256 -5322105 -5323780 -5147741 -4954330 -4953979 -4998796 -4974876
22204 -4974876 -4887268 -4769187 -4659872 -4601817 -4593260 -4545709 -4540646 -4544937 -4498585 -4553380 -4496683
22193 -4496683 -4405530 -4341789 -4223890 -4112499 -4111754 -4135376 -4139993 -4103833 -4060890 -3965971 -3860861
22182 -3860861 -3802528 -3814670 -3839593 -3825645 -3735293 -3701321 -3636662 -3596402 -3539853 -3509927 -3560069
22171 -3560069 -3639545 -3574195 -3467424 -3315677 -3280432 -3232842 -3195864 -3207018 -3258967 -3251051 -3238761
22160 -3238761 -3168069 -3113512 -3097624 -3064485 -3041952 -3032651 -3037083 -2949965 -2871303 -2769722 -2765459 -2785896
22148 -2785896 -2801059 -2760001 -2745479 -2768060 -2753893 -2699326 -2725048 -2700975 -2632209 -2626722 -2616163
22137 -2616163 -2591686 -2550196 -2489455 -2448192 -2470907 -2441646 -2458827 -2488627 -2424119 -2407166 -2420345
22126 -2420345 -2404759 -2335807 -2247919 -2277740 -2305101 -2258818 -2178850 -2122424 -2109830 -2095499 -1998090
22115 -1998090 -1938619 -1971896 -1976687 -2045882 -2056973 -2062871 -2106429 -2047716 -1954737 -1890151 -1841469 -1790754
22103 -1790754 -1817742 -1835778 -1884259 -1933585 -1925897 -1843316 -1729658 -1698063 -1698036 -1703440 -1804095 -1843586
22091 -1843586 -1830844 -1764997 -1719025 -1703677 -1693805 -1641161 -1675842 -1681988 -1666501 -1643602 -1610482 -1503540
22079 -1503540 -1439906 -1468545 -1559706 -1515461 -1523853 -1553257 -1523779 -1502123 -1442096 -1383634 -1393182 -1351361
22067 -1351361 -1351997 -1357395 -1373600 -1339666 -1320075 -1367666 -1402899 -1429386 -1456845 -1443174 -1391576 -1354693
22055 -1354693 -1334170 -1315115 -1248460 -1191936 -1152021 -1126699 -1161465 -1181439 -1161715 -1078268 -1046836
22044 -1046836 -1066069 -1051666 -1025695 -990408 -1034176 -1027527 -943459 -868933 -885841 -1007029 -1109223
22033 -1109223 -1144412 -1133453 -1127130 -1059641 -1001414 -965452 -915667 -970980 -1015239 -952076 -945653 -896235
22021 -896235 -815060 -876264 -873806 -875860 -884635 -829511 -795514 -840938 -868419 -832712 -795129 -738318
22009 -738318 -740441 -795758 -783922 -744394 -758464 -692036 -662135 -722893 -699142 -687720 -652812 -620813
21997 -620813 -643236 -673708 -621782 -544614 -539513 -569045 -639605 -661008 -688025 -621119 -534759 -551270
21985 -551270 -620813 -617874 -573455 -526731 -500082 -509009 -482923 -547004 -505498 -439417 -400544 -441856
21973 -441856 -526096 -585410 -494451 -477354 -407723 -331742 -408709 -432526 -427184 -447731 -445639 -441085
21961 -441085 -429274 -430923 -419363 -351001 -403497 -395576 -357227 -287117 -386475 -411491 -413464 -433128
21949 -433128 -443267 -406220 -346982 -318364 -332643 -351989 -433528 -373731 -298450 -227734 -248035
21938 -248035 -286114 -300913 -303435 -269782 -298499 -325278 -341719 -284288 -230599 -165147 -159881 -176186
21926 -176186 -201284 -176884 -129800 -80096 -42245 -81119 -104468 -146604 -110517 -67004 -96764
21915 -96764 -77273 -46207 -58808 -78887 -85120 -129737 -173601 -202553 -223675 -130629 -48477 39968
21903 39968 57221 16948 -8748 -11763 40534 7263 -29878 13307 56244 36616 41130 53320
21891 53320 3235 1094 20852 132285 168780 152117 132782 56318 -11782 -13346 -1917 30868
21879 30868 37508 44724 67295 75099 79201 85177 129418 102884 82041 77875 80047 -11542 1045
21866 1045 81596 152103 171711 108027 57104 70722 130703 184487 158747 175695 203108 230078
21854 230078 180730 179344 213167 223520 199577 198889 207253 208600 237000 210439 173725 266041
21842 266041 261852 224629 235119 263648 223304 162541 86890 77128 144626 210745 220128 224174
21830 224174 285681 295222 298258 299983 391899 384758 372762 345397 308605 362740 391916 300176
21818 300176 229213 232143 270180 294621 332679 400860 339764 336511 362096 406139 444529 476574
21806 476574 487171 446251 486150 533385 530916 490512 428631 378172 345251 342900 447454 543363
21794 543363 568093 549005 431266 386518 444913 553458 516329 514268 501354 525091 499378
21783 499378 419501 470462 487943 469832 467241 496347 478447 503166 518217 479896 446857 404671
21771 404671 373208 403958 413400 430064 457906 435845 391729 416592 483731 425769 421618 520607
21759 520607 484665 544920 544701 498713 486643 425121 440475 490369 481182 518612 513755 539015
21747 539015 558357 529913 508642 552525 613882 596015 612778 626358 613516 611265 620925 673867
21735 673867 707517 712336 671204 653085 729122 755140 731389 702023 673841 613125 608909 534130
21723 534130 573480 674873 672240 648239 686448 759513 778908 728596 736261 781796 779516 718086
21711 718086 710470 781834 776943 704182 666224 683362 738204 749445 815882 864066 863227 817822
21699 817822 754162 717709 702048 691320 669601 711797 696238 688559 677528 642600 670386 689305
21687 689305 679845 647168 707698 761692 736396 721454 728518 783629 835312 839869 833896 841150
21675 841150 764730 764200 807023 846278 815499 812980 848263 799844 752116 784395 764683 752951
21663 752951 785611 839365 889460 900908 808029 807578 807487 825744 897625 866053 831879 788064
21651 788064 723900 716945 736714 761129 802744 816391 865444 833656 786938 858034 907298 888620
21639 888620 859533 823802 945426 1003503 929589 963768 982882 927959 902177 919388 905491
21628 905491 890795 926149 953899 995891 1055545 1054027 1102965 1105320 1005976 910531 898375 894885
21616 894885 890010 878792 896669 940397 932719 921907 909114 888481 883362 954731 1016118 983122
21604 983122 976280 995109 1018125 1052654 1020752 979754 1007401 1004589 1040586 1055129 1065692 1074997
21592 1074997 1051693 1026683 1086918 1057514 1004415 1023312 1074504 1094184 1042831 1045123 1038964 1055597
21580 1055597 1058485 1029560 1034636 1061764 1036914 1015282 1011491 1056095 1120188 1153731 1215933 1232662
21568 1232662 1197884 1119431 1058375 1032513 1040536 1076630 1063682 1034159 1054154 1098662 1100976 1105923
21556 1105923 1077917 1030502 980508 1031643 1133279 1174673 1193391 1147197 1132203 1141110 1144707
21545 1144707 1129222 1132478 1177696 1166561 1104104 1085080 1116607 1106147 1045891 1021334 1083082
21534 1083082 1139864 1170877 1200805 1210824 1191550 1226572 1199528 1178821 1177372 1216159 1237452
21523 1237452 1219397 1251124 1280400 1276871 1247383 1175603 1145823 1188699 1154226 1141107 1203557
21512 1203557 1200580 1214126 1241660 1248635 1185032 1152109 1147365 1154668 1160302 1128799 1152495 1159141
21500 1159141 1113756 1081388 1098286 1085362 1039410 1117576 1190009 1218593 1285792 1287274 1303438
21489 1303438 1322582 1221948 1170196 1157854 1239275 1281896 1306461 1284141 1241838 1289834 1303642
21478 1303642 1287424 1273308 1283339 1339943 1325011 1322703 1322270 1326296 1304471 1290403 1256400 1307378
21466 1307378 1333883 1320304 1354730 1358480 1292182 1306537 1356476 1372844 1385447 1359507 1332820
21455 1332820 1329502 1290125 1255334 1300250 1290152 1279707 1314798 1321852 1278927 1281488 1297414 1295933
21443 1295933 1412361 1377336 1350564 1255345 1241718 1278444 1273310 1309666 1342612 1370053 1390535
21432 1390535 1410060 1359270 1337009 1391030 1408182 1392295 1390693 1407989 1404710 1379222 1375638 1421220
21420 1421220 1445404 1433777 1483745 1462164 1443313 1515191 1511486 1445494 1421370 1406481 1401106 1466691
21408 1466691 1499483 1449365 1385187 1328421 1357474 1412871 1440952 1416753 1376000 1372913 1399492
21397 1399492 1435059 1468289 1490254 1436341 1408859 1390557 1464899 1493709 1474884 1443669 1452392
21386 1452392 1504790 1483028 1492752 1455928 1426077 1407840 1454531 1505052 1577490 1550757 1480599
21375 1480599 1424940 1393797 1417654 1472600 1474782 1490883 1464400 1518105 1518292 1411075 1391194 1391402
21363 1391402 1464798 1532296 1596612 1571670 1512341 1499221 1535237 1567344 1559953 1529434 1508995
21352 1508995 1505905 1475226 1488921 1498315 1474282 1445983 1450185 1489910 1508863 1520226 1546116 1557523
21340 1557523 1575859 1604916 1617306 1623083 1663035 1689568 1641137 1541567 1520599 1548213 1544395 1507407
21328 1507407 1469111 1442979 1467343 1509206 1566353 1619250 1621771 1604653 1617323 1625515 1609937 1585069
21316 1585069 1563799 1536076 1553910 1588460 1711586 1766366 1702662 1680318 1654749 1663201 1630562
21305 1630562 1562697 1494556 1563449 1677730 1736689 1766614 1717762 1674512 1682280 1674025 1642493
21294 1642493 1667093 1713519 1781681 1745481 1669697 1666430 1677526 1649692 1591374 1631989 1598314
21283 1598314 1507673 1465659 1497696 1596759 1648943 1688094 1647079 1670607 1654960 1625848 1629322
21272 1629322 1572742 1608227 1646844 1659156 1678539 1671882 1651772 1669846 1685540 1681884 1655410 1715512
21260 1715512 1766780 1759720 1694875 1737291 1779942 1768291 1761019 1721648 1686349 1676246 1732870 1734788
21248 1734788 1585843 1556669 1582838 1622598 1723014 1787245 1763329 1709490 1722104 1793608 1776698
21237 1776698 1745018 1763844 1718800 1628989 1664886 1737593 1717915 1794130 1820994 1782434 1805260
21226 1805260 1845801 1804865 1793190 1814141 1846482 1873308 1795833 1729036 1739071 1824481 1876007
21215 1876007 1917670 1850342 1846671 1874453 1800186 1817565 1815836 1777207 1734518 1719385 1751701 1790801
21203 1790801 1808772 1780049 1859172 1912968 1898725 1888429 1886635 1886423 1811674 1766609 1791824 1830769
21191 1830769 1857512 1901390 1932476 1902728 1862581 1863664 1898370 1941053 1944365 1944325 1947382 1919974
21179 1919974 1895046 1914556 1928455 1901292 1870999 1918398 1970806 1940180 1912831 1940775 2032100
21168 2032100 2053889 1996241 1898738 1846966 1848265 1823201 1815319 1855017 2000089 1974507 1886844
21157 1886844 1840998 1852328 1901198 1935980 1962688 1939572 1954423 1950511 1985411 1990768 1944087 1927966
21145 1927966 1952373 1929448 1925378 1977750 2049582 2045620 1972574 1997647 1971445 1947116 1986573 2000959
21133 2000959 1971415 1964654 1955770 1890357 1955994 1958222 1973923 1980312 1994900 1972608 1960261 1986859
21121 1986859 1954797 1941350 1919540 1966658 2038823 2025609 2043187 2002628 2001735 1986546 2000179 1978157
21109 1978157 2022866 2074608 2059076 1980784 1995192 2047924 2051994 1987938 1999684 2067517 2098230
21098 2098230 2071617 2017606 2008524 2029358 2048308 2108722 2116954 2099249 2130594 2110393 2106573 2074871
21086 2074871 2091441 2109147 2112098 2074211 2055901 2162345 2202406 2098875 2102799 2098036 2108453
21075 2108453 2069587 2123469 2170888 2173641 2149582 2078954 2034183 2037126 2013897 2001398 2020465 2054324
21063 2054324 2130845 2177486 2160016 2173507 2211911 2235697 2210553 2163648 2198706 2222496 2201717
21052 2201717 2241698 2261295 2203770 2136099 2177618 2159708 2088703 2095387 2149916 2209995 2228730
21041 2228730 2172936 2135731 2179284 2211349 2228812 2196887 2192750 2188850 2206458 2173601 2186326 2162020
21029 2162020 2173962 2227430 2242241 2273297 2299607 2242946 2230631 2137194 2091099 2124501 2196203
21018 2196203 2249543 2276870 2293684 2287077 2286831 2246463 2235351 2303825 2311920 2354655 2334320 2255951
21006 2255951 2256862 2269102 2303101 2270171 2272382 2305896 2269830 2297455 2360733 2360223 2309268 2266154
20994 2266154 2290252 2320981 2321147 2299482 2314314 2347592 2394903 2373900 2299793 2297183 2342967 2364948
20982 2364948 2397994 2401967 2393265 2451002 2446628 2420210 2332805 2292745 2276821 2299593 2304570 2300136
20970 2300136 2302292 2307152 2344556 2355151 2365640 2368584 2345388 2304866 2284339 2352268 2338551 2378095
20958 2378095 2403702 2417029 2411188 2441632 2388221 2364127 2368503 2398645 2404488 2445066 2458121 2451118
20946 2451118 2436105 2480171 2482650 2462906 2489411 2475459 2474452 2504588 2476215 2379621 2366519 2397764
20934 2397764 2481713 2454079 2368243 2358490 2439462 2510871 2541267 2498628 2475306 2519972 2519736 2507282
20922 2507282 2556342 2580054 2595860 2541253 2458285 2376775 2381259 2438572 2509339 2527149 2573485
20911 2573485 2567528 2518780 2484288 2434772 2515518 2539391 2565206 2576882 2595777 2617942 2552936
20900 2552936 2501651 2487502 2531451 2529773 2598210 2621770 2505845 2465121 2457568 2463225 2540100 2650670
20888 2650670 2720249 2717939 2672193 2670275 2692625 2702873 2724240 2717164 2705518 2758001 2726076 2683798
20876 2683798 2633671 2674037 2717211 2674541 2699816 2759266 2707579 2618201 2643140 2635460 2589240
20865 2589240 2584232 2657257 2696268 2694834 2702281 2714876 2746090 2667943 2726468 2730003 2744198 2751183
20853 2751183 2801397 2780367 2744905 2797322 2809825 2819257 2818677 2787742 2781195 2761039 2750945 2810029
20841 2810029 2852232 2791531 2746869 2750885 2782806 2753217 2773496 2766361 2758268 2722927 2740112 2718637
20829 2718637 2730627 2775379 2822932 2726133 2655488 2689042 2765327 2758617 2707099 2766003 2806805
20818 2806805 2808238 2837526 2883145 2876480 2874984 2822650 2804843 2837377 2774817 2738525 2727928 2751449
20806 2751449 2852431 2921580 2901850 2921112 2852427 2747636 2765466 2782270 2768503 2822645 2893858
20795 2893858 2947080 2931244 2949850 3023057 3094652 3092754 3087626 3015969 3016855 2991619 3096794 3187182
20783 3187182 3234329 3243458 3227299 3261253 3246228 3233332 3207127 3251394 3300373 3323209 3234805
20772 3234805 3202531 3227951 3214509 3243087 3244135 3281357 3263954 3217284 3173875 3106224 3100234 3094536
20760 3094536 3087809 3034236 3037161 3070487 3063400 3057854 3012256 2921241 2876181 2829730 2849902 2900243
20748 2900243 2995853 3029907 3020988 3053887 3100486 3161985 3203166 3155762 3108820 3084006 3008441
20737 3008441 3008878 3076339 3150072 3129584 3047365 3020088 3005369 2938383 2904052 2894724 2981007 3033031
20725 3033031 2984004 2899328 2899335 2910148 2934794 2878745 2870621 2833729 2890401 2927493 2952690 2960706
20713 2960706 2971431 2945637 2959596 3022340 3101307 3098266 3079839 3080999 3134490 3180590 3220202 3256123
20701 3256123 3256136 3249576 3194538 3122359 3132626 3151301 3114843 3188366 3267900 3284209 3282660 3211253
20689 3211253 3188532 3170169 3165716 3285201 3411056 3382733 3309319 3286586 3371351 3357734 3282840
20678 3282840 3349779 3381381 3341914 3374795 3377370 3350461 3295886 3263570 3330811 3388960 3332732
20667 3332732 3276980 3268175 3292112 3367758 3426964 3379958 3324276 3352368 3380766 3303052 3269336
20656 3269336 3334501 3347177 3368127 3381777 3432739 3425489 3391414 3394270 3441546 3489731 3504159 3504766
20644 3504766 3525582 3574217 3529437 3487313 3511336 3488225 3522951 3520067 3491601 3436592 3434647 3421053
20632 3421053 3477625 3578771 3585941 3589075 3579380 3586303 3560682 3560999 3568874 3559362 3610058 3627605 3627223
20619 3627223 3655235 3670700 3688752 3677002 3681941 3605825 3550771 3552933 3579678 3644376 3667637 3715667
20607 3715667 3728588 3747903 3764037 3724852 3776713 3762428 3724878 3685317 3681877 3697962 3672964
20596 3672964 3749030 3792326 3751573 3735025 3722773 3735864 3806135 3824250 3879949 3920402 3898359
20585 3898359 3874411 3871035 3856052 3814006 3808400 3792045 3864779 3887869 3891274 3819850 3831028 3857100
20573 3857100 3867229 3889259 3913795 3970927 3983854 3898853 3884469 3898733 3981232 4039906 4047174
20562 4047174 4047511 4053679 4070886 4100450 4106365 4128654 4153594 4206426 4217045 4125335 4092884 4083706
20550 4083706 4079043 4090436 4065949 4102872 4167376 4201619 4166303 4172109 4191877 4226584 4263701 4255140
20538 4255140 4247564 4269344 4248360 4280696 4306930 4296650 4297047 4267514 4236860 4215235 4221184 4221747
20526 4221747 4235898 4228268 4199741 4253380 4326983 4345586 4298041 4307833 4322229 4393820 4412002 4466068
20514 4466068 4475720 4446314 4396459 4409661 4422060 4439443 4410445 4400953 4446367 4470479 4530622 4553169
20502 4553169 4469800 4424606 4504909 4579156 4609199 4568716 4599877 4665638 4672019 4644809 4582734
20491 4582734 4587388 4583460 4588137 4669625 4638949 4632806 4696363 4689581 4617497 4645784 4728117 4696097
20479 4696097 4624821 4707567 4792057 4825434 4787784 4738075 4758199 4820066 4868487 4914515 4948225
20468 4948225 5003647 5028715 5024603 5000597 4938560 4906354 4931124 5006411 5003549 5028417 5080535 5085101
20456 5085101 5106728 5096734 5037231 4994379 5006398 5115069 5205785 5254475 5260190 5297342 5339552
20445 5339552 5299095 5238571 5218585 5209214 5212917 5210158 5235021 5247404 5277684 5296228 5280424 5330781
20433 5330781 5425708 5489664 5480103 5435186 5430365 5494752 5496881 5468898 5491062 5538691 5527979 5484825
20421 5484825 5521103 5569813 5629027 5678111 5617603 5655656 5707925 5751118 5680150 5674175 5700544
20410 5700544 5711077 5729491 5759683 5794589 5844040 5859821 5844598 5774261 5801787 5915072 6023384
20399 6023384 6035373 6013748 6003922 6079957 6145085 6185876 6241056 6166641 6135146 6153275 6176060
20388 6176060 6214553 6304433 6340427 6286937 6299544 6305069 6337165 6364458 6395125 6478315 6526917
20377 6526917 6549082 6601349 6627282 6626309 6620654 6673045 6714534 6802033 6865123 6868083 6868210 6867161 6850246
20364 6850246 6890919 6872760 6797867 6806312 6907666 6953798 7009840 7128218 7142954 7117185 7118053
20353 7118053 7186286 7208329 7225571 7274927 7264661 7305886 7388741 7389546 7435510 7537367 7616048
20342 7616048 7597242 7599919 7636365 7686746 7682648 7679253 7722166 7741135 7800511 7798939 7840767 7979078
20330 7979078 8108844 8193696 8198722 8195605 8225673 8229074 8243457 8322052 8362959 8346418 8378704 8450388
20318 8450388 8541442 8636669 8682805 8718068 8791966 8794832 8859554 8870999 8936915 9054845 9143656
20307 9143656 9160390 9203231 9241577 9274817 9401914 9491455 9563912 9680219 9737693 9796160 9889973
20296 9889973 9962645 10018578 10004781 10033586 10161896 10309449 10447949 10513763 10545933 10598886 10680335
20285 10680335 10709508 10754083 10895607 11036875 11197824 11352931 11483153 11653935 11719322 11804779
20275 11804779 11920051 12027680 12106889 12188846 12272478 12417992 12589725 12808338 12999063 13118118
20265 13118118 13268015 13468643 13641184 13731855 13851358 13917007 14023211 14243200 14521233 14795928
20255 14795928 15008518 15203019 15423458 15613048 15896010 16177301 16430128 16739647 17084551
20246 17084551 17378976 17685271 17985326 18283038 18594953 18893997 19151547 19452034 19897040
20237 19897040 20366852 20820833 21261741 21695805 21991704 22372379 22804267 23371947 23997792
20228 23997792 24703707 25399021 26133556 26943982 27740612 28603118 29649007 30889208 32248460
20219 32248460 33844538 35599683 37602264 40022671 42797359 46162205 50029353 54010788
20211 54010788 57176289 57956010 55036630 46518826 34793527 30892670 35347924 41545141
20203 41545141 45274807 44372148 35674185 21281507 13387059 9389022 484054 -8556266
20195 -8556266 -7325615 -548886 4933741 6174257 1558980 -10604132 -21783440 -21797540
20187 -21797540 -16077132 -9551299 -3384274 2480861 8308352 14297260 20172210 24875816
20179 24875816 26793599 24553323 15787656 3703885 713647 6112355 12124670 14433219
20171 14433219 10853051 -1763421 -13872095 -15717973 -16353749 -23265741 -33919097 -36388631
20163 -36388631 -31519424 -26948617 -26616226 -32307718 -45207128 -56433440 -57149404 -52720076
20155 -52720076 -47914330 -43736207 -40315932 -37428397 -34996163 -32899955 -31047864 -29372888
20147 -29372888 -27865961 -26533147 -25343567 -24372298 -23470282 -22658402 -21845566 -21086643 -20409686
20138 -20409686 -19815950 -19199173 -18617840 -18130870 -17670358 -17180686 -16760236 -16317085 -15977293
20129 -15977293 -15595406 -15181490 -14767673 -14412824 -14147678 -13898433 -13566974 -13192502 -12835975
20120 -12835975 -12549738 -12242194 -11990158 -11723068 -11466130 -11248378 -11060176 -10837818 -10593958
20111 -10593958 -10324553 -10119836 -9960544 -9802449 -9544231 -9334850 -9218571 -9063237 -8854006
20102 -8854006 -8665709 -8548391 -8422307 -8199270 -8013786 -7929808 -7868842 -7701283 -7568049 -7482361
20092 -7482361 -7381158 -7252141 -7068997 -6924128 -6869679 -6760382 -6676368 -6621916 -6505587 -6372953
20082 -6372953 -6272182 -6208722 -6129924 -6046465 -5936560 -5835387 -5736521 -5643684 -5558294 -5561329 -5531114
20071 -5531114 -5397769 -5269974 -5159656 -5037544 -4926215 -4913546 -4889316 -4812932 -4754604 -4728737
20061 -4728737 -4665964 -4608174 -4516313 -4444777 -4427537 -4392513 -4312164 -4250375 -4177942 -4140842 -4011630
20050 -4011630 -3895719 -3842308 -3808085 -3746803 -3753991 -3702917 -3694729 -3655337 -3607882 -3502952 -3470630
20039 -3470630 -3484724 -3451264 -3430992 -3374864 -3316545 -3296426 -3215131 -3125298 -3076363 -3145755 -3136473
20028 -3136473 -3067989 -3007360 -2854473 -2723009 -2689597 -2606535 -2597145 -2609685 -2592108 -2593837 -2599658
20017 -2599658 -2519320 -2518618 -2573780 -2535708 -2433292 -2355238 -2333143 -2407749 -2430156 -2388410 -2276843
20006 -2276843 -2259177 -2154003 -2072871 -2067042 -2079321 -2059346 -1955402 -1938788 -1941654 -1852310 -1826130
19995 -1826130 -1840620 -1851301 -1845113 -1754833 -1684562 -1716476 -1686471 -1614439 -1621326 -1635504 -1591021 -1520764
19983 -1520764 -1481168 -1513260 -1508863 -1456733 -1453312 -1431619 -1339447 -1304020 -1306806 -1325671 -1353556 -1377480
19971 -1377480 -1295652 -1207155 -1215108 -1206681 -1181736 -1123897 -1033646 -997950 -1051645 -1070843 -1094775 -1047028
19959 -1047028 -957068 -941195 -916065 -945852 -942823 -932325 -953129 -955925 -955419 -849274 -787254 -778491
19947 -778491 -770938 -796965 -781494 -765070 -710254 -675524 -673559 -657280 -709565 -727740 -681792 -654682
19935 -654682 -589759 -569933 -528166 -490626 -506358 -539467 -527474 -462188 -392028 -304042 -274469
19924 -274469 -257596 -242550 -300795 -353277 -378799 -333103 -288912 -256824 -275581 -294459 -312472
19913 -312472 -309573 -312267 -276104 -245124 -160517 -137278 -141050 -122306 -112568 -163780 -226301 -211562
19901 -211562 -123593 -61667 24509 92818 58652 60632 56645 53511 26043 61744 109028 82850
19889 82850 128980 188618 222443 245366 143186 113385 191999 202201 220896 204439 219301
19878 219301 291606 270792 317350 296051 271663 270755 278285 255072 245897 335127 338491 382645
19866 382645 426742 446092 389934 436906 487874 525390 541163 495744 519475 520407 506719 504167
19854 504167 517924 470268 435457 432143 456826 480747 592367 644373 600955 577423 621259
19843 621259 616360 623213 681693 698445 694986 709921 731892 799981 748468 729305 775558 774404
19831 774404 729183 695257 734160 738835 779548 782905 730416 722948 762671 828192 837596 825343
19819 825343 841128 807050 829002 833921 874278 930303 901661 946364 973811 922684 887037 935706
19807 935706 1008583 1040783 1070158 1115537 1138453 1091742 1105752 1127787 1136535 1197694 1137060 1173253
19795 1173253 1140652 1162372 1190626 1213183 1141995 1182145 1217532 1252214 1257303 1266359 1327928 1372866
19783 1372866 1401237 1413702 1459954 1472622 1483710 1442920 1346827 1329333 1357099 1324288 1285619
19772 1285619 1333282 1427493 1472729 1467363 1462988 1467190 1423682 1438839 1412311 1423252 1410442 1405289
19760 1405289 1448323 1535814 1565010 1531424 1579135 1568221 1533054 1566291 1611140 1651730 1671893
19749 1671893 1658408 1613523 1592107 1595207 1611681 1658028 1679889 1711389 1705735 1696565 1728326 1739585
19737 1739585 1784526 1794212 1743663 1715335 1731885 1726124 1830555 1857655 1835445 1792328 1753565
19726 1753565 1745596 1794318 1853210 1818748 1780909 1791505 1855249 1899535 1878201 1854511 1912558
19715 1912558 1958972 1961510 1962729 1938536 1966802 2005478 2048367 2051422 2081748 2106420 2102713 2077703
19703 2077703 2059423 2075614 2143875 2207502 2166649 2102788 2100927 2106535 2078979 2040618 2127299 2190025
19691 2190025 2210685 2227421 2264929 2295305 2278068 2295448 2333328 2325643 2306436 2324398 2314311
19680 2314311 2335019 2342280 2268719 2259710 2277335 2322125 2282698 2306787 2268656 2216335 2265131 2357444
19668 2357444 2410438 2456004 2443830 2462408 2462894 2472013 2463682 2458965 2455900 2491717 2480853 2503639
19656 2503639 2496966 2528471 2560959 2553844 2610827 2556255 2585413 2567837 2574111 2645423 2692883 2705131
19644 2705131 2729800 2793316 2880780 2885823 2935269 2919093 2827752 2765640 2783670 2789276 2774897 2749811
19632 2749811 2775134 2789026 2812362 2800068 2798506 2854360 2883766 2852312 2867028 2837227 2770048
19621 2770048 2760375 2805418 2830130 2907370 2837240 2736282 2656370 2613160 2670377 2684798 2689955
19610 2689955 2740404 2771383 2752400 2717442 2622610 2600308 2714734 2777423 2846745 2913979 2880784
19599 2880784 2866297 2859826 2838564 2752342 2728715 2798092 2869756 2903008 2771177 2700809 2705492
19588 2705492 2717841 2682477 2698924 2704793 2709145 2787412 2879173 2886846 2953473 2938140 2953385 3048596
19576 3048596 3103581 3141705 3197062 3162761 3138097 3154440 3144464 3218719 3274708 3297666 3217791
19565 3217791 3224687 3162535 3013326 2949852 2910480 2850077 2836191 2835477 2854219 2910844 2938071 2976367
19553 2976367 3000766 2993994 2999592 3014868 3001379 2989401 3020724 3012394 3020566 2993787 3000912 3010944
19541 3010944 3073117 3090100 3130374 3229568 3236712 3204396 3270689 3334889 3416267 3440456 3384027
19530 3384027 3393074 3374090 3351402 3425647 3440308 3464407 3445262 3460635 3486804 3521274 3527962 3605477
19518 3605477 3635330 3599923 3573288 3571651 3632231 3651518 3658456 3563672 3512765 3461223 3369209 3398853
19506 3398853 3406896 3445513 3604608 3670582 3599890 3618149 3660326 3599155 3506932 3437419 3400927
19495 3400927 3449834 3490181 3455421 3502058 3609687 3631124 3632717 3650687 3676347 3686232 3730261
19484 3730261 3699668 3674961 3724662 3806561 3857251 3830568 3814649 3804953 3852904 3916683 3961423
19473 3961423 3996493 4051378 4039057 3960183 3996344 4109632 4180075 4168602 4169481 4219199 4183819
19462 4183819 4156482 4090621 4071857 4032779 4059365 4089859 4186267 4288004 4254399 4225890 4181970
19451 4181970 4157631 4157353 4132751 4141996 4167576 4210729 4242289 4250921 4273528 4321259 4310382 4280831
19439 4280831 4234067 4248154 4199202 4299369 4384264 4366558 4384596 4438834 4433007 4444754 4500087
19428 4500087 4530197 4577192 4645565 4633952 4589956 4618842 4601983 4573983 4591297 4567224 4595312
19417 4595312 4692530 4719665 4700719 4696487 4683271 4744474 4796613 4799817 4786204 4801969 4807762 4875081
19405 4875081 4980484 4948018 4891355 4855161 4805198 4920171 5021511 5058895 5102084 5167313 5156829
19394 5156829 5145369 5108979 5079046 5070918 5062819 5152305 5184612 5129027 5156297 5141509 5205064 5304312
19382 5304312 5234542 5180584 5277247 5370153 5414761 5365638 5316968 5367873 5386147 5370290 5421698
19371 5421698 5453659 5457904 5467510 5488268 5490605 5531764 5517405 5618301 5653117 5731669 5724247 5715850
19359 5715850 5737183 5750473 5709294 5662823 5668557 5731500 5672253 5720781 5782349 5781453 5726024 5766082
19347 5766082 5838353 5901000 5960775 5977697 5975538 6019879 6080419 6056974 6059620 6101351 6091364 6082000
19335 6082000 6130518 6139760 6230146 6272390 6304620 6301553 6351676 6360180 6354651 6384163 6402085 6429143
19323 6429143 6476526 6490133 6572034 6633356 6715212 6768652 6779845 6791818 6776341 6787124 6754347
19312 6754347 6734738 6819888 6853278 6878920 6903734 6933314 6962658 6937074 6892153 6945748 6929452
19301 6929452 6953998 6990911 7030207 7109431 7110284 7102416 7197352 7252349 7176236 7177242 7205370 7309657
19289 7309657 7405599 7449907 7486665 7442781 7385376 7399095 7465657 7524602 7582074 7618504 7634280
19278 7634280 7613718 7636452 7670273 7712544 7705157 7776128 7851926 7860713 7931166 7985648 8001843 8052490
19266 8052490 8180795 8229441 8277966 8311574 8311462 8357439 8373926 8371426 8371153 8403737 8433586 8504717
19254 8504717 8556581 8579896 8643738 8673616 8654917 8745340 8834563 8862609 8919647 8954126 8984011
19243 8984011 9089205 9135904 9100747 9124586 9154647 9183492 9245154 9296088 9344479 9400821 9432368
19232 9432368 9509865 9574723 9634878 9723259 9735245 9777953 9794516 9844702 9896699 9958675 9956735
19221 9956735 9980015 10024452 10081846 10132203 10186863 10283674 10389977 10454024 10523838 10611953 10713737
19210 10713737 10816059 10853503 10911578 10978516 11070759 11099443 11103087 11187519 11243286 11354011 11438880
19199 11438880 11468083 11492368 11522863 11594113 11727693 11879375 11967722 12080644 12200590 12250465
19189 12250465 12307989 12282857 12392079 12544815 12702310 12833494 12893778 12978046 12994807 13060489
19179 13060489 13120072 13202803 13322558 13481812 13548265 13652693 13696344 13825888 13963691 14075079
19169 14075079 14200013 14320970 14478283 14597302 14729242 14829130 14948102 15055742 15203292
19160 15203292 15345101 15482592 15602620 15667513 15820583 16049044 16226098 16474083 16688846
19151 16688846 16866576 17004601 17175249 17373382 17627450 17848419 18040242 18262927 18459621
19142 18459621 18655950 18874850 19158295 19356057 19533548 19773486 20029716 20286396 20545465
19133 20545465 20949683 21349723 21680061 22028832 22496973 22902910 23223218 23596833 24104617
19124 24104617 24598520 25151128 25756048 26431897 27144998 27834213 28620416 29508094 30491248
19115 30491248 31705327 33027061 34655097 36429038 38136428 39263544 39094473 37050287
19107 37050287 32805420 30398929 31990835 35007280 37522896 38588367 37359626 33363198
19099 33363198 30429676 29579706 26963996 19791216 14558424 16204574 19710968 21608021
19091 21608021 20481539 15050074 6751024 3600370 5757324 9023572 11868438 14343541
19083 14343541 16546898 18505700 20435325 22257374 23953850 25679034 27401141 29052055
19075 29052055 30716616 32507140 34409156 36425380 38570747 40844006 43370532 46148498
19067 46148498 49230295 52748842 56766997 61496267 67004771 73460800 80511334 86888217
19059 86888217 89914320 86780625 74001325 51076437 38034613 43226661 54048995
19052 54048995 61796852 62481573 51907505 28998942 15011019 13555236 8366211 -7177664
19044 -7177664 -16623789 -10513585 -137322 6164482 5044206 -6497665 -22933552 -25936949
19036 -25936949 -17601598 -10216320 -9980883 -20617939 -42318358 -55750803 -52323328 -42627337
19028 -42627337 -32308033 -22438494 -13655649 -7574966 -6736522 -13537178 -31657393 -56067236
19020 -56067236 -65632018 -61613482 -54750344 -48472485 -43148993 -38698229 -34900373 -31581679
19012 -31581679 -28736727 -26206679 -23788946 -21509247 -19181437 -16878212 -14595705 -12355337
19004 -12355337 -10129227 -7916760 -5729709 -3467164 -1188692 1327359 4221360 7648040
18996 7648040 11676372 16428260 21880932 27654071 32203674 32804470 26727299 10196173
18988 10196173 -16574932 -31323191 -28162724 -19649767 -11607825 -5195642 -1384459 -1525263
18980 -1525263 -3985390 -9748426 -24163369 -47207640 -60494608 -58596766 -52285883 -47158099
18972 -47158099 -44502859 -45340959 -48264653 -47736182 -44680145 -41474702 -38783644 -36397979
18964 -36397979 -34161957 -32237482 -30546012 -28988430 -27577218 -26214566 -25063911 -23968768
18956 -23968768 -22976636 -22033138 -21005987 -19917357 -18785145 -17679872 -16652042 -15585617
18948 -15585617 -14464264 -13154177 -11764529 -10160813 -8192917 -5910250 -3537846 -1728655
18940 -1728655 -1542503 -3993040 -10740784 -21576218 -26887770 -25337751 -22077387 -18791980
18932 -18791980 -15578598 -12664095 -10491292 -10137109 -12606424 -19396452 -30254163 -35899398
18924 -35899398 -34897642 -32315740 -29963991 -28056419 -26540444 -25258719 -24150621 -23196962
18916 -23196962 -22438893 -21820462 -21149756 -20519858 -20048064 -19544316 -19140863 -18807014 -18429427
18907 -18429427 -17945361 -17489455 -17196195 -16989312 -16735341 -16428364 -16177692 -15999749 -15769541
18898 -15769541 -15552288 -15389253 -15179399 -14929207 -14736924 -14488694 -14211998 -13928039 -13762076
18889 -13762076 -13598489 -13384341 -13190027 -13049723 -12904823 -12725942 -12582659 -12388747 -12317146
18880 -12317146 -12269069 -12144512 -11946441 -11812097 -11735906 -11619151 -11486803 -11306260 -11183900 -11091527
18870 -11091527 -10996515 -10903497 -10858017 -10802320 -10739334 -10680040 -10543749 -10415323 -10316889 -10195370
18860 -10195370 -10087708 -9914964 -9798034 -9729620 -9657064 -9581626 -9475931 -9372295 -9259252 -9092820
18850 -9092820 -9004201 -8958441 -8908715 -8849296 -8822604 -8755594 -8644136 -8601875 -8539465 -8468806 -8389153
18839 -8389153 -8267533 -8213244 -8226428 -8172267 -8116740 -8055316 -8007700 -7894460 -7822259 -7767086 -7689329
18828 -7689329 -7593588 -7529691 -7553747 -7515323 -7421450 -7448932 -7404179 -7278722 -7184474 -7141074 -7035822
18817 -7035822 -6991939 -6964346 -6925319 -6891703 -6780947 -6770091 -6768324 -6707215 -6647840 -6626592 -6577550
18806 -6577550 -6530737 -6505913 -6440289 -6377403 -6262516 -6198927 -6198258 -6180387 -6114630 -6020767 -5962033
18795 -5962033 -5955207 -5934795 -5917451 -5888710 -5845311 -5831520 -5747825 -5670036 -5606330 -5572143 -5468161
18784 -5468161 -5434263 -5352644 -5267822 -5258148 -5250985 -5227949 -5206151 -5182072 -5132127 -5100760 -5101866 -5132105
18772 -5132105 -5072861 -4947992 -4926150 -4914314 -4846255 -4861945 -4786843 -4689120 -4654421 -4629357 -4587636
18761 -4587636 -4533493 -4457125 -4428115 -4414969 -4368700 -4415731 -4348076 -4240535 -4179183 -4185610 -4178132
18750 -4178132 -4173886 -4147069 -4122317 -4088026 -4120922 -4067941 -4040029 -4027767 -4024808 -3989146 -3935686 -3957542
18738 -3957542 -3886320 -3800111 -3801866 -3819419 -3802195 -3779740 -3750015 -3722898 -3710027 -3680464 -3589524
18727 -3589524 -3588845 -3551067 -3587299 -3590567 -3522877 -3415026 -3407973 -3365577 -3338344 -3339552 -3326552 -3279965
18715 -3279965 -3228227 -3221860 -3232931 -3190714 -3128952 -3037406 -2972732 -2946931 -2943231 -2948693 -2941317 -2926288
18703 -2926288 -2910187 -2858010 -2817116 -2824395 -2770365 -2764216 -2697252 -2661587 -2687049 -2584949 -2548470
18692 -2548470 -2556280 -2555400 -2485756 -2441016 -2481912 -2525565 -2510709 -2477545 -2403452 -2309344 -2289125 -2297793
18680 -2297793 -2286377 -2271320 -2306531 -2294351 -2276756 -2232778 -2200433 -2158582 -2059166 -2071594 -2077286
18669 -2077286 -2057495 -2030809 -1927931 -1875458 -1848096 -1845769 -1799396 -1779298 -1737890 -1711417 -1705826
18658 -1705826 -1742808 -1741466 -1721471 -1708450 -1689934 -1614700 -1510411 -1466025 -1464671 -1510723 -1581525
18647 -1581525 -1553975 -1471360 -1505595 -1551689 -1535758 -1432292 -1351978 -1285706 -1304788 -1345626 -1352031
18636 -1352031 -1280797 -1241682 -1167492 -1077411 -1081199 -1066977 -996106 -947784 -912172 -903837 -935517 -919977
18624 -919977 -913858 -897862 -837364 -699062 -671278 -728606 -747429 -781597 -753494 -667538 -652894
18613 -652894 -602666 -550370 -504073 -491674 -480865 -440328 -416090 -390995 -354238 -403977 -428234
18602 -428234 -412448 -370125 -368514 -334048 -286881 -235959 -238672 -183768 -137372 -114214 -104410 -82984
18590 -82984 -35863 13544 53388 135344 148356 167811 206544 217732 264693 318983 408058 474551
18578 474551 457597 442797 505508 581786 530748 478701 568750 700407 838652 898708 954762
18567 954762 897327 775335 817910 880072 919890 910568 847646 805978 730406 717440 797973
18556 797973 811204 874551 879709 879335 826875 853393 830205 892206 954714 1001220 1073354 1126265
18544 1126265 1214256 1316861 1339303 1327577 1392582 1401596 1471664 1552473 1616027 1620591 1642504
18533 1642504 1773967 1912107 1947980 1965566 2031458 2076738 2113986 2169107 2247468 2246812 2288831
18522 2288831 2272036 2278186 2342005 2385198 2417379 2516074 2542341 2524667 2590316 2714932 2810303
18511 2810303 2829281 2740030 2581710 2509010 2553308 2607421 2651347 2723131 2806405 2851750 2933191
18500 2933191 2959958 2993054 3065470 3158986 3189528 3298721 3363083 3386055 3460483 3539179 3638612
18489 3638612 3696515 3739916 3829865 3958952 4021323 4154141 4289103 4362959 4498692 4595379
18479 4595379 4650174 4731415 4783317 4804927 4795689 4756483 4783877 4897729 4971631 5134542 5265264
18468 5265264 5423924 5534740 5590710 5710266 5851267 6017267 6167383 6151366 6143856 5996633
18458 5996633 5688313 5611550 5712453 5898201 6075146 6294908 6529327 6775919 6987575 7126029
18448 7126029 7189834 7385831 7536260 7647513 7766032 7990036 8250334 8493465 8661668 8871391
18438 8871391 9079619 9335576 9577903 9817893 9987938 10142691 10153435 10122344 10221670 10506314
18428 10506314 10875315 11171936 11482683 11756161 11987494 12319861 12747020 13198758 13579170
18419 13579170 13950511 14449642 14926106 15454661 15957715 16488171 17092756 17709133 18362960
18410 18362960 19182422 20112935 21072849 22179592 23457345 25021625 26787938 28875037
18402 28875037 31373774 34367770 37886015 41591719 44282176 43856046 38447932 25005053
18394 25005053 5368170 -3591520 -928490 4686536 10465109 16091008 21493201 25812701
18386 25812701 26867403 22788331 10498233 -10745856 -21261825 -18417880 -12949239 -8110917
18378 -8110917 -4120227 -802840 2265755 5230243 8086957 11056373 14146677 17580168
18370 17580168 21437072 25690695 29934305 32975102 32935992 28162144 16247676 88739
18362 88739 -6289355 -2763951 3768659 11099507 18675593 25984338 31908100 33926841
18354 33926841 29212247 12113180 -11935986 -28704965 -41453397 -43601888 -37535691
18347 -37535691 -30016625 -22928309 -16362422 -10637589 -6531129 -5640373 -9288292 -19605420
18339 -19605420 -34403182 -40725561 -38464466 -34178381 -30030779 -26335790 -23080593 -20185306
18331 -20185306 -17547043 -15036711 -12485617 -9827741 -7027874 -3890354 -310302 3508537
18323 3508537 6692236 7413891 4044441 -5524760 -21916803 -31491680 -30051343 -25061035
18315 -25061035 -19753916 -14689259 -10216607 -7154978 -7219178 -11769874 -23646081 -40187552
18307 -40187552 -46659362 -44331228 -40477295 -37088056 -34276088 -32001242 -30168157 -28560826
18299 -28560826 -27215020 -26118533 -25150091 -24337804 -23557691 -22833702 -22171490 -21433633 -20810005
18290 -20810005 -20290475 -19764504 -19251416 -18806000 -18385668 -17995090 -17664075 -17228947 -16893700
18281 -16893700 -16551506 -16206787 -15882749 -15620240 -15484354 -15381471 -15343355 -15172610 -14898780
18272 -14898780 -14616022 -14394774 -14192140 -13924516 -13731752 -13492775 -13286880 -13026938 -12843528
18263 -12843528 -12775241 -12720513 -12555427 -12359776 -12264215 -12170114 -11946759 -11711795 -11619777 -11591691
18253 -11591691 -11493815 -11278866 -11069063 -10909592 -10758366 -10679529 -10533610 -10385113 -10279845 -10205970
18243 -10205970 -10221687 -10252265 -10202238 -10260741 -10282288 -10226862 -10166910 -10043365 -9877454 -9838702 -9777354
18232 -9777354 -9715950 -9630700 -9557176 -9503302 -9396394 -9303305 -9193290 -9074632 -8996345 -8963489 -8935704
18221 -8935704 -8864032 -8809466 -8796942 -8733080 -8629882 -8552664 -8537891 -8369870 -8229542 -8214411 -8154804
18210 -8154804 -8127612 -8144915 -8086630 -8069084 -7997005 -7930446 -7916104 -7844932 -7801027 -7726442 -7622718
18199 -7622718 -7588720 -7599977 -7545902 -7454222 -7360128 -7371473 -7369112 -7361227 -7388100 -7311581 -7237800 -7179701
18187 -7179701 -7143158 -7131168 -7108948 -7051759 -7004069 -6955285 -6940819 -6866302 -6809204 -6702655 -6712794
18176 -6712794 -6714378 -6785878 -6776546 -6690159 -6536087 -6458150 -6496993 -6457710 -6370088 -6362588 -6353817 -6308042
18164 -6308042 -6347075 -6316792 -6220573 -6105050 -6141253 -6192615 -6165576 -6156774 -6152999 -6069541 -5935325
18153 -5935325 -5872755 -5938496 -5990949 -5949369 -5887337 -5863390 -5838050 -5859571 -5902275 -5884906 -5770880
18142 -5770880 -5723063 -5729892 -5744211 -5739189 -5728043 -5755718 -5700687 -5640270 -5579796 -5593136 -5671820 -5638790
18130 -5638790 -5573919 -5503593 -5364748 -5278037 -5277379 -5314214 -5306822 -5285577 -5299916 -5262370 -5239757 -5257804
18118 -5257804 -5228851 -5217731 -5180822 -5118695 -5071543 -5092878 -5121036 -5162469 -5189378 -5106365 -5025477
18107 -5025477 -4966715 -4925649 -4901542 -4942040 -4947202 -4927490 -4909963 -4950136 -4967360 -4950030 -4976857
18096 -4976857 -4984157 -4950795 -4952765 -4896945 -4885813 -4879510 -4869039 -4828675 -4818359 -4795113 -4759951 -4680753
18084 -4680753 -4639279 -4639184 -4639613 -4592982 -4590378 -4584787 -4544298 -4501242 -4455977 -4463331 -4461024 -4469419 -4437999
18071 -4437999 -4416114 -4437714 -4412405 -4418013 -4452760 -4459522 -4420470 -4378122 -4324434 -4361225 -4388899 -4377492
18059 -4377492 -4266338 -4213362 -4226974 -4240730 -4286904 -4332596 -4271909 -4239823 -4229511 -4290508 -4260144
18048 -4260144 -4208310 -4198518 -4187761 -4214798 -4237984 -4122406 -4056723 -4051708 -4070826 -4092058 -4095517 -4055178
18036 -4055178 -4032395 -4056399 -4060886 -4079675 -4073039 -4030562 -3965333 -3926560 -3952389 -3947213 -3986074 -3940925
18024 -3940925 -3932051 -3973488 -3988297 -3935394 -3930263 -3920181 -3916459 -3935577 -3901938 -3855732 -3873156 -3841791
18012 -3841791 -3847119 -3834539 -3795966 -3782134 -3719955 -3671474 -3705522 -3717774 -3629676 -3572666 -3596438
18001 -3596438 -3634924 -3574252 -3512384 -3461776 -3518018 -3605378 -3606383 -3577681 -3576767 -3590167 -3540792 -3543479
17989 -3543479 -3528042 -3488767 -3530039 -3525811 -3441809 -3356213 -3413412 -3415298 -3426225 -3437546 -3434931 -3384157
17977 -3384157 -3349865 -3350028 -3447951 -3495403 -3514394 -3548246 -3518880 -3433033 -3466831 -3435688 -3339366 -3369555
17965 -3369555 -3354729 -3339423 -3273056 -3251379 -3282636 -3264497 -3264174 -3252969 -3241201 -3212777 -3210129 -3189036
17953 -3189036 -3146628 -3071815 -3078387 -3103887 -3088830 -3082599 -3126387 -3164852 -3109364 -3068730 -3108605 -3057784
17941 -3057784 -3030013 -3029772 -3092946 -3173526 -3137924 -3126395 -3055489 -3001719 -3036194 -2994775 -3007360 -3034850
17929 -3034850 -3018577 -2973321 -3016804 -3080954 -3087870 -3027671 -2993390 -3015276 -2893223 -2798061 -2837630
17918 -2837630 -2878686 -2910733 -2890766 -2903589 -2876212 -2898751 -2888360 -2854548 -2760730 -2708669 -2761154
17907 -2761154 -2825255 -2885101 -2871617 -2850870 -2877115 -2888428 -2857867 -2811780 -2744766 -2767050 -2718263
17896 -2718263 -2639696 -2599386 -2670589 -2718610 -2676709 -2670089 -2722368 -2731395 -2777642 -2760260 -2789872 -2740891
17884 -2740891 -2676475 -2712800 -2708564 -2687917 -2658616 -2613827 -2586412 -2581720 -2572678 -2626940 -2631239 -2600155
17872 -2600155 -2529977 -2504095 -2513535 -2511952 -2478675 -2454478 -2439292 -2468646 -2468832 -2483370 -2572055 -2536688
17860 -2536688 -2450802 -2430984 -2518433 -2634635 -2623945 -2547368 -2520833 -2583933 -2610659 -2603638 -2591231
17849 -2591231 -2567334 -2547582 -2522090 -2518716 -2471122 -2395434 -2330148 -2327524 -2407792 -2448300 -2519188 -2556241
17837 -2556241 -2551249 -2480910 -2423001 -2420130 -2405892 -2420251 -2408050 -2370249 -2368752 -2400320 -2527119 -2642868
17825 -2642868 -2693720 -2679576 -2657253 -2625263 -2649715 -2679890 -2690315 -2655386 -2579013 -2567030 -2583294
17814 -2583294 -2541172 -2449650 -2470671 -2517924 -2541400 -2588088 -2526921 -2508272 -2428662 -2411581 -2430352
17803 -2430352 -2370681 -2354464 -2281619 -2272861 -2321726 -2341904 -2342183 -2341242 -2390595 -2429765 -2418962 -2427308
17791 -2427308 -2436822 -2424436 -2356524 -2362395 -2320190 -2244761 -2229541 -2283999 -2316982 -2370525 -2393445 -2412933
17779 -2412933 -2400602 -2367782 -2386863 -2435793 -2440576 -2415853 -2377718 -2390870 -2384941 -2383616 -2240700 -2187995
17767 -2187995 -2247593 -2269017 -2314113 -2312792 -2295097 -2261011 -2236427 -2223727 -2210992 -2234096 -2258393
17756 -2258393 -2236195 -2298005 -2291777 -2244297 -2203704 -2167937 -2084081 -2058329 -2121371 -2164466 -2165539 -2114461
17744 -2114461 -2146951 -2141621 -2084942 -2020628 -2012987 -2028071 -2007874 -2024930 -2058438 -2066391 -2041431 -2080005
17732 -2080005 -2089658 -2027367 -2005374 -1987540 -1984355 -2019211 -1985443 -1980817 -2051803 -2077911 -2045093 -2059490
17720 -2059490 -2034638 -2084124 -2127846 -2076852 -1985368 -1976610 -1966369 -1982631 -1967966 -1970308 -1947578 -1910521
17708 -1910521 -1861483 -1873464 -1863807 -1881849 -1902204 -1901985 -1891052 -1856589 -1834865 -1821186 -1795305 -1815320
17696 -1815320 -1893873 -1991404 -1941583 -1872129 -1831250 -1860397 -1889247 -1917278 -1898845 -1936264 -1892952
17685 -1892952 -1890329 -1879755 -1853987 -1863901 -1883575 -1805995 -1786250 -1817775 -1859540 -1858144 -1874869 -1822705
17673 -1822705 -1777857 -1790941 -1837467 -1826442 -1749340 -1772881 -1777498 -1735797 -1718342 -1800633 -1858775
17662 -1858775 -1805507 -1777468 -1831118 -1796866 -1819246 -1800508 -1744353 -1746667 -1814110 -1818713 -1788961 -1835521
17650 -1835521 -1828133 -1800728 -1776156 -1784442 -1746422 -1759003 -1698312 -1651685 -1657618 -1660668 -1628313 -1633398
17638 -1633398 -1643870 -1624795 -1626881 -1623431 -1645753 -1693380 -1672482 -1649196 -1716624 -1754982 -1772973 -1714509
17626 -1714509 -1669171 -1692130 -1736811 -1742170 -1720003 -1666271 -1650322 -1690308 -1701487 -1702070 -1619780 -1640826
17614 -1640826 -1611292 -1606966 -1664657 -1711427 -1712598 -1701157 -1685309 -1689203 -1687277 -1571280 -1555119 -1576312
17602 -1576312 -1580767 -1620261 -1594550 -1544850 -1502850 -1570372 -1603789 -1604148 -1555835 -1512586 -1540804 -1559337
17590 -1559337 -1578549 -1521288 -1494517 -1498882 -1529322 -1505778 -1494191 -1523356 -1531453 -1515332 -1481471 -1461639
17578 -1461639 -1441757 -1462939 -1499667 -1511611 -1472478 -1405676 -1468898 -1489797 -1473576 -1431541 -1408967
17567 -1408967 -1463105 -1481563 -1444508 -1483085 -1476936 -1498095 -1462176 -1438367 -1456629 -1470583 -1467598 -1452693
17555 -1452693 -1426687 -1410018 -1411145 -1426372 -1436041 -1428042 -1415150 -1415196 -1369639 -1372546 -1442510 -1461031 -1401231
17542 -1401231 -1381701 -1385047 -1400027 -1355867 -1277763 -1297005 -1300132 -1257469 -1254928 -1295399 -1317056 -1344160
17530 -1344160 -1375893 -1374709 -1335365 -1268188 -1270365 -1283845 -1342043 -1326167 -1389265 -1430851 -1374469 -1325404
17518 -1325404 -1369315 -1349113 -1392716 -1386253 -1360223 -1372183 -1388261 -1315133 -1210146 -1200370 -1246432
17507 -1246432 -1251038 -1263581 -1253201 -1219911 -1190065 -1149785 -1224144 -1292763 -1281040 -1260562 -1226389
17496 -1226389 -1155647 -1094023 -1128914 -1245030 -1319854 -1273672 -1221337 -1167633 -1111824 -1095812 -1148296
17485 -1148296 -1185739 -1247868 -1228511 -1217189 -1112296 -1147118 -1204691 -1141112 -1076899 -1059509 -1077437
17474 -1077437 -1071877 -1123640 -1184667 -1152860 -1156255 -1143217 -1161469 -1161483 -1164844 -1111456 -1136351 -1167802
17462 -1167802 -1154851 -1139086 -1125154 -1141831 -1150837 -1164728 -1125933 -1112190 -1084961 -1091038 -1080115 -1096705
17450 -1096705 -1111642 -1085314 -1067245 -1080865 -1040191 -1002230 -991160 -1014540 -1075104 -1076805 -1077419 -1020792
17438 -1020792 -1021246 -1060628 -1038955 -996304 -967854 -994409 -1032613 -1032796 -1085043 -1109604 -1113176 -1048332
17426 -1048332 -1060861 -1080207 -1102284 -1093179 -1095246 -1104995 -1044890 -991698 -979164 -982462 -996025 -1061293
17414 -1061293 -1078776 -1021018 -984165 -984906 -992801 -947605 -926908 -900222 -874991 -888260 -903724 -983388
17402 -983388 -1020536 -993470 -981924 -967896 -956216 -960391 -957221 -955018 -887771 -871379 -853984 -934428
17390 -934428 -981357 -951500 -973470 -947206 -884327 -914292 -964644 -965459 -897431 -914664 -898394 -899730
17378 -899730 -982264 -973363 -879067 -896514 -851873 -825616 -868413 -879883 -848894 -848982 -857089 -863891 -852041
17365 -852041 -843063 -842870 -796003 -834644 -933097 -954570 -900338 -893170 -938683 -945527 -946004 -950617 -862620
17352 -862620 -837630 -898939 -924931 -878290 -818643 -844060 -875922 -872723 -891203 -874674 -778518 -719479
17340 -719479 -759088 -733273 -712812 -756433 -832309 -868008 -839849 -870776 -895744 -867229 -817830
17329 -817830 -695072 -695647 -751237 -814453 -781874 -745186 -762563 -820446 -800012 -739905 -678719 -670198
17317 -670198 -655097 -700957 -771160 -766922 -747389 -684089 -680519 -768592 -798731 -746917 -682534 -684707
17305 -684707 -690581 -695688 -656487 -631295 -660315 -657537 -651708 -626149 -651669 -703843 -753844 -760784
17293 -760784 -726066 -676960 -735459 -717822 -634202 -636445 -679398 -674288 -664786 -717979 -641993 -543193
17281 -543193 -537488 -531770 -512142 -538861 -621473 -647650 -668997 -615239 -630843 -545350 -566581 -627939
17269 -627939 -707020 -705896 -692199 -657358 -619025 -549316 -542888 -625211 -708268 -693146 -621799 -578944
17257 -578944 -593717 -636316 -631558 -615055 -572221 -559816 -591811 -583471 -621034 -643561 -602403 -579058
17245 -579058 -599177 -631394 -554986 -599410 -652782 -628716 -697807 -692553 -609843 -551714 -548565 -530209
17233 -530209 -536172 -603847 -659060 -666512 -636751 -574256 -590185 -588946 -573224 -475494 -408222 -403757
17221 -403757 -392949 -387314 -410454 -408542 -442444 -447944 -506941 -535927 -519001 -576562 -539758 -496579
17209 -496579 -526964 -557322 -540189 -419699 -405556 -426688 -482860 -514605 -481795 -481164 -443644 -404182
17197 -404182 -425895 -473408 -500373 -452815 -414992 -397587 -347420 -373160 -439059 -412587 -425722
17186 -425722 -404104 -436635 -406549 -425308 -465870 -487545 -437824 -409557 -350250 -400675 -356344
17175 -356344 -365053 -364177 -334795 -332426 -363389 -382269 -364786 -363432 -352326 -365222 -331608 -278249
17163 -278249 -298308 -374908 -419841 -511292 -526922 -486784 -492352 -539573 -569605 -527853 -497927 -493564
17151 -493564 -418461 -394179 -355090 -416875 -362509 -311648 -317100 -337270 -396725 -458441 -458953 -405805
17139 -405805 -336314 -253897 -195818 -183109 -252862 -320029 -335393 -379031 -422387 -450205 -404644
17128 -404644 -333499 -312346 -355909 -387972 -362786 -381484 -354595 -293839 -277232 -276566 -259483 -273926
17116 -273926 -320501 -419997 -407105 -321204 -296154 -306865 -263953 -257619 -253030 -236284 -236820 -237117 -224227
17103 -224227 -231847 -257542 -225673 -263584 -260155 -239466 -267682 -273114 -225812 -207709 -241370 -281816
17091 -281816 -336752 -318316 -302585 -272813 -224999 -232667 -158655 -118394 -172825 -169767 -130600 -96984
17079 -96984 -95594 -132736 -148617 -158177 -151212 -108371 -129172 -145543 -115315 -63042 -76879 -48284
17067 -48284 -73651 -136455 -224043 -282335 -262425 -189307 -145662 -110010 -111884 -52547 -18157 -77002
17055 -77002 -166457 -109041 -54295 -48069 -82345 -96391 -117734 -105206 -72730 -105761 -92982 -55591
17043 -55591 -75094 -128817 -209169 -128853 -121555 -126998 -76726 -39631 -26226 -13305 3482 43052
17031 43052 24497 -13635 -20167 11529 7692 -31967 -103597 -113464 -111393 -64972 -57600 -88437 -92785
17018 -92785 -97297 -66382 -60580 -39776 -16314 3044 -36757 -34879 76713 108944 51622 80971
17006 80971 76617 106527 100262 93618 136537 158854 129480 99947 76448 34544 -15787 -36479
16994 -36479 6112 30538 45342 49249 -29642 -20950 43956 77633 77721 77266 68235 30395 70158
16981 70158 81197 13515 35233 54150 87899 81691 35654 42870 5804 -19304 7678 24424
16969 24424 37913 83150 153867 214660 226025 235395 255538 278252 328420 367343 300623 258834
16957 258834 196686 157271 185886 232104 211405 175086 218920 264141 286225 227792 249060
16946 249060 300300 302407 259016 196667 179147 206351 150118 184297 258163 171430 135298 135522
16934 135522 139234 221845 240346 194463 231164 215522 231692 234979 160770 128910 98774 70940
16922 70940 48605 109007 146729 218796 285687 320776 326187 306831 330234 348111 327657 320478
16910 320478 276749 241711 251165 303181 323522 325144 249118 296826 347591 348558 353751 339220
16898 339220 326827 395150 405631 371558 359650 295440 211120 190858 207796 273151 321964
16887 321964 334246 347615 350344 343903 368625 325743 319576 349544 386722 422362 389746 365148
16875 365148 358345 351250 346089 322413 322759 306657 311458 260632 259530 327028 412069 415872 426778
16862 426778 408012 394165 435453 445070 430665 411560 384357 461193 417145 356758 434839 437236
16850 437236 415091 401124 464333 518259 481559 446131 416295 412294 403529 359714 340019 356653
16838 356653 408327 441448 503598 493201 491694 494876 533584 527786 509682 542673 504095 408580
16826 408580 463256 534005 562647 531154 529428 583811 635799 629039 574490 588262 569475 564950
16814 564950 527743 528274 559257 557975 538431 494957 452607 522666 538739 581466 595284 551042
16802 551042 504549 497241 508669 600676 653858 639890 609437 585197 594239 545458 565405 594379
16790 594379 589038 584714 596482 646091 677700 679709 660569 603409 601377 603613 637237 635112 741950
16777 741950 762920 729855 661735 668393 734415 747986 719732 698394 656783 635860 646964 661103
16765 661103 720201 713956 682810 688263 669623 674764 661513 671660 646110 628375 699410 769220
16753 769220 721062 661272 658025 723229 725895 771467 748734 743501 774817 803077 804598 864825
16741 864825 832112 782705 748806 740683 693548 690511 699432 694026 660762 646951 688212 759503
16729 759503 801817 845125 855293 843065 828081 835117 761698 749294 713784 747119 722691 733787
16717 733787 752309 707857 732032 770331 849893 902774 865390 871212 934814 922549 933478 1023445
16705 1023445 988618 923979 913004 926990 841588 838863 912464 900500 926838 970611 954283
16694 954283 923723 902601 855320 873967 888914 911989 953815 980190 1040237 1028660 926073
16683 926073 828016 777021 811840 898282 1006915 1022532 1000169 969910 910821 912163 898443
16672 898443 900510 936292 1010054 1040871 951453 869524 841478 832050 847121 875850 989287 1054938
16660 1054938 1070748 1036255 983937 1019872 1032449 1025481 1052288 1031855 1076835 1035043 1017495
16649 1017495 1101465 1078712 1033702 1068162 1108669 1124676 1124172 1110114 1108442 1138420 1122094 1100555
16637 1100555 1069080 1042964 1097455 1116692 1128737 1203810 1251094 1312427 1367576 1236606 1197941
16626 1197941 1159660 1138181 1211203 1291265 1316786 1288517 1267341 1306301 1298365 1301408 1258364 1209037
16614 1209037 1198481 1190752 1299737 1306683 1219572 1230011 1255146 1263479 1239126 1211183 1182066 1189569
16602 1189569 1263943 1282084 1246908 1222403 1256508 1337166 1358062 1332310 1281636 1279897 1319713
16591 1319713 1401731 1395365 1368525 1303194 1239702 1245620 1256485 1307186 1300751 1309354 1306843 1339191
16579 1339191 1362385 1390422 1373532 1388472 1376926 1361280 1403834 1406824 1369427 1394822 1384244
16568 1384244 1369052 1373453 1386076 1439154 1399887 1355715 1358622 1359639 1410907 1448380 1481809 1529200
16556 1529200 1462395 1394679 1427349 1447281 1471851 1488205 1457495 1405650 1406600 1506967 1592362
16545 1592362 1601028 1523415 1465065 1442838 1419963 1367437 1438074 1497061 1495014 1531243 1616251 1618900
16533 1618900 1608462 1629063 1623385 1519231 1549911 1637283 1639822 1633565 1693865 1655203 1642853 1680978
16521 1680978 1714640 1629805 1574900 1530388 1572773 1653953 1660124 1641117 1613908 1641450 1673902
16510 1673902 1633932 1644723 1636437 1648993 1705929 1697716 1667784 1669214 1715746 1738007 1736502 1746828
16498 1746828 1708701 1727282 1734727 1712906 1702038 1700935 1762416 1719802 1704079 1711955 1753861 1828819
16486 1828819 1826983 1829658 1810603 1798246 1832859 1893725 1903073 1882118 1869143 1884837 1853856 1824321
16474 1824321 1790106 1776376 1848053 1830833 1793629 1856035 1907504 1903386 1933942 2011014 2004422 1941797
16462 1941797 1930670 1973637 1977396 1935326 1959108 1977837 1995671 2013479 1987966 1939732 1929930 2001386
16450 2001386 2072443 2152048 2193584 2191098 2187943 2156762 2077386 2087548 2125309 2091812 2094489 2044490
16438 2044490 2090938 2185133 2199747 2184173 2158172 2124794 2155223 2181085 2206911 2226406 2248307
16427 2248307 2288658 2284886 2251240 2270669 2295831 2214304 2156242 2182064 2244769 2256726 2266566 2268793
16415 2268793 2244824 2138228 2080818 2172945 2259841 2271977 2340214 2364492 2385535 2390523 2366572
16404 2366572 2321300 2313323 2409252 2343289 2268825 2317157 2423291 2461072 2480332 2494999 2427693
16393 2427693 2403476 2399940 2419304 2418203 2499322 2530114 2451610 2432634 2514429 2510067 2421716 2470328
16381 2470328 2533941 2520772 2514343 2525554 2495977 2468215 2434515 2477884 2589286 2635988 2677953
16370 2677953 2699082 2668409 2595995 2553480 2508499 2551624 2589855 2535561 2531023 2528636 2572162 2672442
16358 2672442 2710527 2726870 2729845 2708208 2669204 2693233 2737348 2742491 2756271 2751073 2706424 2757603
16346 2757603 2771353 2762639 2774467 2778396 2734107 2799068 2789731 2789628 2844933 2870384 2842719 2903955
16334 2903955 2947813 2908856 2905285 2950953 2999341 3065378 3035874 3009094 2952982 2941629 3044938
16323 3044938 3062539 2995304 3002744 3051921 3101380 3115419 3077088 3015607 3039650 3064264 3111374
16312 3111374 3117163 3095423 3084831 3147669 3186954 3219184 3221905 3179723 3196705 3203190 3209343 3187968
16300 3187968 3221184 3283016 3314570 3298926 3220703 3282322 3296802 3244958 3225907 3351263 3372208
16289 3372208 3363759 3404837 3420728 3413003 3401031 3418058 3525433 3574571 3527082 3458307 3452094 3484931
16277 3484931 3513862 3481057 3448554 3441520 3543959 3583261 3619436 3687648 3707693 3700532 3681599
16266 3681599 3715089 3678167 3682749 3720864 3751919 3814241 3804036 3784861 3791293 3802452 3815365 3788289
16254 3788289 3775522 3799389 3836992 3844603 3844369 3907452 3928170 3971959 3931882 3888545 3930171 3999463
16242 3999463 4049082 4110418 4110342 4093919 4106566 4166745 4176753 4173680 4160109 4169833 4169045 4182396 4225471
16229 4225471 4230297 4273968 4281971 4323613 4294708 4258028 4290181 4323589 4376869 4412023 4381550 4326723
16217 4326723 4334290 4358071 4388217 4452429 4482927 4471186 4522840 4522343 4510703 4484523 4511711 4597018
16205 4597018 4593024 4632175 4632972 4569231 4667182 4712321 4706350 4745625 4791087 4768361 4750886 4733213
16193 4733213 4772906 4812407 4853012 4961506 5035183 5045641 5017059 5038649 5073872 5126979 5149268
16182 5149268 5117207 5103838 5154490 5201845 5266069 5289946 5290088 5345081 5373969 5355094 5426458 5489948
16170 5489948 5469645 5477001 5534136 5581210 5582535 5563654 5551134 5507822 5463703 5407150 5335420 5359261
16158 5359261 5327703 5293681 5281991 5281534 5326034 5370953 5431344 5456910 5498651 5531195 5554038 5549401
16146 5549401 5601572 5673499 5692383 5667817 5634932 5639483 5732725 5746934 5763668 5805932 5874749
16135 5874749 5942569 5950030 5929946 5976551 6012235 6067913 6114111 6168515 6187464 6258187 6305144
16124 6305144 6214763 6200347 6289829 6346907 6417775 6439598 6456709 6436994 6503074 6616988 6654815
16113 6654815 6691202 6716564 6680644 6699916 6697292 6736302 6796148 6829594 6873189 6877216 6922276 7030897
16101 7030897 7059616 7025692 7006321 7083197 7148418 7190879 7222749 7307777 7341867 7395899 7384711
16090 7384711 7410972 7488543 7536496 7622007 7801704 7852296 7805576 7749730 7742343 7867805 7955552
16079 7955552 7975342 7944804 7957898 8024125 8148395 8165700 8183338 8197895 8286484 8368236 8419425
16068 8419425 8521527 8575513 8616171 8677005 8692151 8637245 8680661 8759958 8867159 8922258 8945016
16057 8945016 9047836 9169527 9229038 9272862 9316971 9337853 9342420 9443244 9615084 9690912 9636041
16046 9636041 9672272 9808424 9963832 9967252 10011846 10051417 10066421 10070268 10141110 10255162 10349349
16035 10349349 10429333 10534811 10615134 10733436 10856551 10922049 10988046 11019833 11090602 11177792
16025 11177792 11295238 11352676 11381233 11437694 11599487 11731358 11717016 11791106 11932272 12050738
16015 12050738 12189234 12289001 12274105 12342693 12428398 12518371 12626073 12721989 12854748 12950627
16005 12950627 13031900 13126748 13261688 13398066 13511666 13628593 13788888 13959728 14082393 14167678
15995 14167678 14238924 14372984 14445631 14571244 14738792 14888624 15016167 15083324 15222057 15378655
15985 15378655 15558488 15737046 15919136 16048239 16174952 16371923 16554288 16719681 16823154
15976 16823154 16961846 17165752 17326613 17489023 17670907 17905638 18096161 18314464 18563539
15967 18563539 18763557 18972225 19170962 19320933 19522292 19753639 19939002 20171219 20463639
15958 20463639 20742975 20998867 21208154 21443598 21732997 22046016 22371415 22611041 22866196
15949 22866196 23150333 23391814 23692916 24073179 24454494 24832134 25219507 25567402 25890500
15940 25890500 26232175 26614819 26985083 27388560 27771733 28031859 28359663 28875781 29370983
15931 29370983 29857543 30309163 30750709 31215902 31657670 32111406 32618635 33156500 33667231
15922 33667231 34184538 34741277 35264790 35799076 36256517 36749780 37306204 37808325 38350571
15913 38350571 38940374 39617031 40213942 40703518 41062500 41429386 41791991 42177724 42481527
15904 42481527 42715897 42811972 42820292 42921510 42932274 42642381 42219165 41584458 40820834 39871096
15894 39871096 38662063 37169365 35428580 33414355 31104976 28482384 25592749 22420787
15886 22420787 19053514 15383669 11460860 7450836 3329496 -824320 -4994096 -9055559
15878 -9055559 -13002693 -16725086 -20312590 -23606430 -26621228 -29364460 -31890155 -34125831
15870 -34125831 -36012955 -37688283 -39084509 -40227990 -41213551 -42044837 -42641038 -43023144 -43221841
15861 -43221841 -43335516 -43409901 -43389270 -43256849 -43087599 -42836830 -42538898 -42118811 -41696303 -41249674
15851 -41249674 -40724323 -40267294 -39952256 -39542122 -38979057 -38457545 -37978769 -37420162 -36899713
15842 -36899713 -36426444 -35953604 -35503777 -35007031 -34505870 -33939750 -33385895 -32983653 -32608115
15833 -32608115 -32138914 -31709638 -31267687 -30763844 -30298371 -29833336 -29415973 -29055791 -28766274
15824 -28766274 -28427915 -28003091 -27591507 -27263182 -26956152 -26633179 -26268568 -25938631 -25674177
15815 -25674177 -25340285 -24997236 -24721132 -24464611 -24130734 -23866220 -23644577 -23414537 -23117001
15806 -23117001 -22864585 -22594581 -22277852 -22034400 -21845014 -21655324 -21462059 -21225159 -20981145
15797 -20981145 -20791455 -20578683 -20343692 -20178625 -19910405 -19677753 -19495787 -19358118 -19261531
15788 -19261531 -19097499 -18889212 -18718809 -18506571 -18371293 -18243724 -18075102 -17894099 -17740241
15779 -17740241 -17596482 -17463844 -17296280 -17178720 -17048188 -16906309 -16772693 -16615496 -16469892
15770 -16469892 -16307922 -16161379 -16062676 -15924587 -15821941 -15683045 -15510353 -15355723 -15266962 -15179260
15760 -15179260 -15127683 -15004233 -14918410 -14823512 -14712763 -14546892 -14455347 -14399329 -14261918 -14174412
15750 -14174412 -14103083 -13996829 -13869907 -13767710 -13734806 -13666520 -13496989 -13353188 -13234431 -13162307
15740 -13162307 -13065949 -12989046 -12936873 -12875348 -12773068 -12723748 -12668527 -12564564 -12439067 -12351565
15730 -12351565 -12307961 -12230125 -12161135 -12086066 -11985171 -11986018 -11970531 -11911898 -11828883 -11778441 -11600820
15719 -11600820 -11511536 -11449601 -11399511 -11379893 -11246085 -11117301 -11026998 -10973209 -10899677 -10872862 -10876262
15708 -10876262 -10792019 -10730728 -10673449 -10680523 -10582885 -10465456 -10462262 -10482312 -10411913 -10305378 -10296485
15697 -10296485 -10239161 -10130011 -10138263 -10094941 -9987023 -9926132 -9859963 -9798324 -9781269 -9732314 -9748962
15686 -9748962 -9729383 -9683254 -9631109 -9592716 -9530621 -9562862 -9452669 -9332722 -9296718 -9260759 -9215206
15675 -9215206 -9144795 -9088203 -9055046 -9006571 -8985564 -8953581 -8918692 -8875502 -8891094 -8904194 -8897619
15664 -8897619 -8843040 -8831601 -8796834 -8735742 -8725414 -8703423 -8682536 -8596973 -8485801 -8366155 -8305623
15653 -8305623 -8273907 -8360359 -8396708 -8413382 -8325665 -8278333 -8214997 -8239012 -8199496 -8113401 -8086349
15642 -8086349 -8043149 -8010161 -7925047 -7883240 -7892928 -7822830 -7797858 -7814754 -7809402 -7817232 -7842263 -7762541
15630 -7762541 -7691543 -7648203 -7657209 -7608624 -7528939 -7589735 -7557420 -7517433 -7535210 -7492793 -7439426
15619 -7439426 -7399517 -7343524 -7328004 -7266127 -7218237 -7179357 -7091543 -7036318 -7029550 -7004976 -7010362 -7053212
15607 -7053212 -7032312 -6963127 -6889361 -6912116 -6953513 -6941335 -6983749 -6975380 -6981814 -7018466 -7134782
15596 -7134782 -7184270 -7136131 -7155193 -7097903 -7041136 -7001809 -6982593 -6993951 -6998918 -6969748 -6941498
15585 -6941498 -6947515 -6908471 -6820845 -6717736 -6688862 -6666021 -6704266 -6689653 -6695739 -6707327 -6627497
15574 -6627497 -6557365 -6590156 -6529066 -6452113 -6483317 -6463763 -6476373 -6466080 -6449917 -6478715 -6375514
15563 -6375514 -6292403 -6310144 -6361269 -6351068 -6252449 -6194168 -6201504 -6221275 -6203591 -6164402 -6185469
15552 -6185469 -6135599 -6055737 -6090023 -6152025 -6191517 -6141677 -6116525 -6135911 -6151865 -6091388 -6040271
15541 -6040271 -6028256 -5907882 -5845190 -5856075 -5821729 -5845898 -5808757 -5820850 -5759315 -5721428 -5737011
15530 -5737011 -5756267 -5762663 -5685251 -5750292 -5797688 -5726478 -5674489 -5681706 -5648548 -5643093 -5599920 -5520415
15518 -5520415 -5468442 -5470367 -5448750 -5459089 -5491669 -5450380 -5466267 -5508531 -5542024 -5538374 -5501002 -5453347
15506 -5453347 -5441630 -5441557 -5460893 -5452617 -5386623 -5341275 -5291925 -5231572 -5267775 -5252298 -5214562 -5177094
15494 -5177094 -5218302 -5244061 -5278652 -5255106 -5219647 -5217822 -5183579 -5140675 -5168829 -5241387 -5270637
15483 -5270637 -5243451 -5122304 -5089737 -5096901 -5081648 -5047065 -4984795 -5016616 -5058938 -5020212 -5007061
15472 -5007061 -5020411 -5066529 -5057231 -5062176 -5089842 -5047322 -4967963 -4995470 -4977040 -4943237 -4920731 -4898365
15460 -4898365 -4863951 -4820897 -4813822 -4882204 -4932699 -4889781 -4938409 -4936941 -4841885 -4793332 -4805460 -4775769
15448 -4775769 -4716941 -4716058 -4794643 -4821632 -4773550 -4689779 -4644528 -4615252 -4597686 -4613725 -4651647 -4650498
15436 -4650498 -4620330 -4594548 -4537673 -4526614 -4485797 -4542652 -4620851 -4610595 -4552154 -4505711 -4481155
15425 -4481155 -4530530 -4506911 -4533360 -4479326 -4417828 -4432942 -4449022 -4405445 -4435588 -4428741 -4363851
15414 -4363851 -4364242 -4332176 -4359718 -4367097 -4380612 -4424371 -4457001 -4439682 -4432835 -4424119 -4415516 -4403812
15402 -4403812 -4378626 -4432661 -4445206 -4453110 -4382478 -4340838 -4371752 -4410111 -4353386 -4319330 -4309627 -4274529
15390 -4274529 -4292725 -4340407 -4303151 -4322033 -4327080 -4279717 -4230028 -4180496 -4133944 -4166792 -4199779
15379 -4199779 -4178294 -4208493 -4238750 -4211005 -4121265 -4110015 -4132422 -4137874 -4154627 -4160917 -4111697 -4003689
15367 -4003689 -3961108 -3992391 -4022545 -4012758 -4005128 -3997063 -4028261 -4054383 -4063297 -4065282 -4071189 -4084840
15355 -4084840 -4038780 -3987570 -4001065 -3996704 -3979008 -3926873 -3895245 -3931043 -3970447 -3943685 -3947264 -3986809
15343 -3986809 -4052279 -3987726 -3937122 -3901535 -3896711 -3890958 -3910563 -3898053 -3866373 -3801199 -3855676 -3912957
15331 -3912957 -3898359 -3887321 -3847355 -3840865 -3859463 -3869265 -3870334 -3823623 -3883940 -3865643 -3830788 -3750869
15319 -3750869 -3725672 -3704483 -3720064 -3732976 -3743799 -3738042 -3783282 -3787075 -3726336 -3705875 -3734309 -3701301
15307 -3701301 -3655503 -3611013 -3600195 -3560806 -3600807 -3642134 -3641372 -3631914 -3665477 -3671501 -3618435 -3610446
15295 -3610446 -3595494 -3554787 -3538489 -3558405 -3544194 -3471777 -3464455 -3507912 -3530458 -3585948 -3553503
15284 -3553503 -3500353 -3531859 -3567046 -3562123 -3524275 -3503739 -3442547 -3446685 -3443093 -3426827 -3384179 -3416703
15272 -3416703 -3452235 -3549894 -3628910 -3573595 -3504628 -3475090 -3499528 -3478170 -3431535 -3465047 -3495013
15261 -3495013 -3411693 -3407987 -3480690 -3434491 -3386729 -3367404 -3371617 -3475431 -3467939 -3419974 -3394628 -3322792
15249 -3322792 -3250331 -3233088 -3258183 -3284086 -3285839 -3341398 -3365488 -3346996 -3346294 -3338139 -3336063 -3335278 -3370276
15236 -3370276 -3312929 -3300623 -3287346 -3293030 -3293431 -3356867 -3330550 -3274820 -3231480 -3277318 -3287040 -3293060
15224 -3293060 -3288140 -3232100 -3220115 -3205185 -3236053 -3242241 -3272165 -3248670 -3122887 -3075670 -3132468
15213 -3132468 -3202746 -3191567 -3199508 -3244903 -3232912 -3165624 -3159880 -3142192 -3139496 -3162886 -3135542 -3142777
15201 -3142777 -3163545 -3118037 -3106127 -3121364 -3157084 -3203821 -3201200 -3199968 -3233491 -3182212 -3156303 -3132774
15189 -3132774 -3117616 -3120404 -3156501 -3122750 -3158389 -3181170 -3145348 -3114477 -3094144 -3047281 -3042846 -3008629
15177 -3008629 -2962427 -2956472 -2948157 -2969529 -2977439 -2961306 -2918282 -2860099 -2935993 -3005527 -2945405 -2952618
15165 -2952618 -2957356 -3061894 -3074968 -3093491 -3075838 -3033453 -2972703 -2930068 -2958594 -3013651 -2983182
15154 -2983182 -2940577 -2942559 -2939522 -2906211 -2902701 -2937156 -2921018 -2854624 -2872109 -2880665 -2869022 -2899368
15142 -2899368 -2952856 -2955331 -2923634 -2911376 -2915566 -2916870 -2894823 -2877029 -2859970 -2831169 -2839296 -2868424
15130 -2868424 -2890503 -2900932 -2885839 -2890524 -2887414 -2921999 -2907850 -2858143 -2825623 -2843257 -2766424 -2691304
15118 -2691304 -2719424 -2802186 -2895394 -2930415 -2873449 -2825075 -2852909 -2919571 -2858744 -2834676 -2760302
15107 -2760302 -2777815 -2677074 -2623965 -2670527 -2721866 -2763796 -2851618 -2879793 -2881260 -2866228 -2824813
15096 -2824813 -2763568 -2757221 -2771236 -2767485 -2731005 -2736418 -2753713 -2761106 -2768526 -2823070 -2814897 -2781541
15084 -2781541 -2843231 -2855059 -2780308 -2762422 -2684905 -2642485 -2650738 -2575998 -2575457 -2660344 -2670501 -2659667
15072 -2659667 -2632112 -2673166 -2682823 -2689799 -2699242 -2681733 -2608085 -2544510 -2582959 -2606386 -2612376 -2627413
15060 -2627413 -2653191 -2692545 -2654770 -2630244 -2610350 -2614416 -2636006 -2588915 -2562887 -2592457 -2707497
15049 -2707497 -2741740 -2723108 -2696210 -2651737 -2690067 -2706467 -2707621 -2723396 -2649046 -2585001 -2537945
15038 -2537945 -2563979 -2527191 -2517772 -2550155 -2555573 -2573090 -2608335 -2602792 -2542799 -2578740 -2549948 -2494657
15026 -2494657 -2537785 -2594382 -2662102 -2654223 -2589565 -2548390 -2529876 -2553633 -2583676 -2609161 -2594624
15015 -2594624 -2533557 -2464257 -2498183 -2558845 -2595012 -2601443 -2591438 -2563291 -2508565 -2479709 -2528416
15004 -2528416 -2503472 -2459200 -2451732 -2415100 -2425652 -2485417 -2476479 -2477276 -2516524 -2479863 -2467760 -2475280
14992 -2475280 -2494350 -2428648 -2377984 -2357475 -2369855 -2410471 -2450480 -2408828 -2405312 -2385835 -2356177
14981 -2356177 -2401285 -2489477 -2496972 -2488007 -2493915 -2440697 -2459232 -2415227 -2352533 -2318667 -2409797 -2461747
14969 -2461747 -2401658 -2446241 -2500489 -2488127 -2477403 -2458345 -2478086 -2405544 -2365085 -2352195 -2323924
14958 -2323924 -2298812 -2268814 -2261510 -2326934 -2327157 -2305556 -2339963 -2339105 -2365194 -2370153 -2302279 -2284599
14946 -2284599 -2321977 -2372400 -2396036 -2450038 -2417309 -2401690 -2339480 -2391046 -2466270 -2450670 -2409083
14935 -2409083 -2329438 -2265413 -2290267 -2351284 -2323493 -2308417 -2248622 -2255856 -2268474 -2313337 -2310570 -2304054
14923 -2304054 -2300840 -2324226 -2326167 -2356232 -2375910 -2328866 -2333832 -2362604 -2343584 -2390722 -2415195 -2355381
14911 -2355381 -2344521 -2388822 -2384159 -2344850 -2290627 -2171148 -2164310 -2190576 -2201478 -2216753 -2229226
14900 -2229226 -2209535 -2208827 -2209922 -2193952 -2231546 -2273767 -2241471 -2218790 -2171590 -2178184 -2155464 -2130578
14888 -2130578 -2156696 -2134400 -2158895 -2183295 -2155749 -2147338 -2167027 -2193496 -2165530 -2169171 -2183798 -2170709
14876 -2170709 -2156489 -2200644 -2226080 -2263860 -2237930 -2212781 -2185210 -2168074 -2120491 -2139137 -2153346
14865 -2153346 -2140237 -2175640 -2082413 -2109881 -2119554 -2133336 -2116484 -2100903 -2104043 -2087115 -2118483 -2178911
14853 -2178911 -2150326 -2073563 -2115537 -2140386 -2232518 -2214436 -2120503 -2064374 -2102168 -2174798 -2167603
14842 -2167603 -2151458 -2120880 -2108294 -2124869 -2037144 -1981576 -1987835 -1960727 -2011672 -2001894 -2041962 -2108063
14830 -2108063 -2169936 -2165799 -2138007 -2135698 -2135999 -2128851 -2079082 -2043371 -2029113 -2014680 -2015736 -2062373
14818 -2062373 -2000819 -2004346 -2050850 -2101184 -2139474 -2112222 -2109692 -2064717 -2015681 -2004697 -2057470 -2046822
14806 -2046822 -2009145 -1982183 -1992759 -2007176 -2064278 -2022480 -2026154 -2038718 -1992060 -2016060 -2075664
14795 -2075664 -2191491 -2161080 -2176318 -2145346 -2095539 -2072331 -2044430 -2039652 -2083528 -2062345 -1984703
14784 -1984703 -1961220 -2006471 -2023535 -1993815 -2039077 -2037412 -2021582 -2071847 -2102997 -2093721 -2047868 -2023021
14772 -2023021 -2005576 -2003706 -1996626 -1977570 -1902641 -1891950 -1902509 -1939687 -1958053 -1966725 -1952544 -1940769
14760 -1940769 -1941303 -1992364 -2007002 -2038089 -2044750 -2001351 -1968682 -1992989 -1991255 -1967764 -2030870 -2007368
14748 -2007368 -1958905 -1919352 -1924477 -1995036 -2007559 -2008203 -1995440 -1967695 -1909523 -1906331 -1929002 -1954802
14736 -1954802 -1936881 -1940581 -1971583 -1998933 -1939879 -1900740 -1924837 -1998630 -1980809 -1961717 -1995036
14725 -1995036 -1960206 -1935938 -2015830 -2060441 -2039598 -2044785 -2020969 -1972244 -1949880 -1966128 -1977256
14714 -1977256 -2002446 -1988634 -1979224 -2026766 -1968808 -1900952 -1877830 -1877124 -1866186 -1857424 -1866655 -1833898
14702 -1833898 -1826665 -1858141 -1862919 -1877559 -1843012 -1821629 -1874621 -1922673 -1899020 -1849688 -1844336 -1861765
14690 -1861765 -1871467 -1873738 -1887960 -1884020 -1844135 -1832391 -1823755 -1797885 -1706864 -1741817 -1783197 -1806407
14678 -1806407 -1824949 -1859222 -1893579 -1787805 -1735881 -1874032 -1888785 -1841253 -1827955 -1820668 -1793614
14667 -1793614 -1801578 -1852792 -1839067 -1846240 -1862119 -1831702 -1822602 -1834323 -1825316 -1766629 -1738564 -1762474
14655 -1762474 -1774619 -1851450 -1906572 -1855494 -1837578 -1811585 -1759604 -1744490 -1771001 -1703141 -1653377
14644 -1653377 -1662258 -1745927 -1769802 -1740095 -1773889 -1755656 -1771246 -1775823 -1714028 -1643100 -1666321 -1758620
14632 -1758620 -1819817 -1845845 -1848112 -1768387 -1732507 -1710784 -1720522 -1701848 -1697501 -1667532 -1640297 -1603927
14620 -1603927 -1611226 -1650840 -1697988 -1699659 -1691564 -1731908 -1765458 -1774128 -1659917 -1601697 -1694850 -1724734
14608 -1724734 -1790084 -1805264 -1744101 -1691343 -1727049 -1724529 -1646426 -1636065 -1648117 -1597405 -1606359 -1647144
14596 -1647144 -1676707 -1598530 -1637055 -1692684 -1710805 -1719840 -1702303 -1719768 -1739827 -1699503 -1668331
14585 -1668331 -1708554 -1683870 -1674933 -1657961 -1627874 -1700869 -1697084 -1589248 -1584901 -1614726 -1662220 -1665333
14573 -1665333 -1679732 -1675659 -1689103 -1715439 -1736925 -1659806 -1673125 -1731593 -1687656 -1650453 -1610677
14562 -1610677 -1613136 -1607276 -1651544 -1599950 -1537062 -1622519 -1719833 -1700552 -1713678 -1741613 -1760996 -1725998
14550 -1725998 -1678991 -1683666 -1642240 -1628778 -1626807 -1568665 -1613427 -1673975 -1680382 -1671847 -1639160 -1648894
14538 -1648894 -1593328 -1523508 -1573910 -1634636 -1683063 -1719427 -1718787 -1631791 -1608920 -1628349 -1641924 -1663232
14526 -1663232 -1656437 -1649672 -1635584 -1628864 -1637292 -1677180 -1731936 -1731208 -1701937 -1651965 -1577734 -1641368
14514 -1641368 -1656059 -1635874 -1641364 -1624839 -1601786 -1615639 -1615123 -1576476 -1562309 -1507283 -1446587 -1451904
14502 -1451904 -1534604 -1550472 -1567953 -1562996 -1609435 -1568390 -1495484 -1505695 -1527038 -1523877 -1493352 -1485944
14490 -1485944 -1491850 -1551552 -1536970 -1544936 -1581139 -1590930 -1576632 -1524053 -1537791 -1555642 -1564279 -1611850
14478 -1611850 -1682808 -1678186 -1590591 -1575283 -1653609 -1705234 -1664127 -1508475 -1458530 -1536555 -1540235
14467 -1540235 -1510905 -1530788 -1484341 -1441064 -1461096 -1469442 -1493616 -1476884 -1440010 -1459788 -1511524
14456 -1511524 -1526823 -1496255 -1483329 -1525811 -1585232 -1583967 -1494270 -1494298 -1591814 -1590813 -1541805 -1531700
14444 -1531700 -1563123 -1595371 -1612062 -1548130 -1562630 -1531169 -1514910 -1536412 -1522834 -1556270 -1479961
14433 -1479961 -1474986 -1585517 -1615278 -1528705 -1441383 -1484721 -1497779 -1532762 -1550524 -1568804 -1560945
14422 -1560945 -1526877 -1503362 -1505323 -1509736 -1455306 -1495504 -1503592 -1486690 -1439004 -1441369 -1431145 -1457644
14410 -1457644 -1491904 -1491358 -1419485 -1365076 -1337370 -1311606 -1409297 -1475330 -1449286 -1474679 -1484962 -1454575
14398 -1454575 -1426737 -1392034 -1369636 -1412940 -1433859 -1368652 -1332493 -1425421 -1390071 -1342736 -1351616
14387 -1351616 -1383996 -1413683 -1418609 -1452830 -1466674 -1431933 -1470796 -1498806 -1534788 -1485279 -1496497
14376 -1496497 -1504345 -1485606 -1471623 -1462721 -1456494 -1467539 -1506539 -1477097 -1488509 -1520443 -1526702 -1484578
14364 -1484578 -1447650 -1438815 -1443730 -1497273 -1529749 -1589863 -1585174 -1517443 -1474123 -1399202 -1337747 -1366647
14352 -1366647 -1310872 -1272975 -1292782 -1292118 -1285108 -1297455 -1363997 -1393841 -1388182 -1433723 -1407381 -1416498
14340 -1416498 -1419562 -1469396 -1494892 -1376179 -1283166 -1323638 -1405212 -1426626 -1402028 -1401808 -1422077 -1433556
14328 -1433556 -1388565 -1341887 -1327265 -1303651 -1289341 -1340247 -1342852 -1301441 -1285269 -1362660 -1380807
14317 -1380807 -1428894 -1393379 -1370130 -1445019 -1460194 -1408277 -1361205 -1380469 -1380615 -1412912 -1404488 -1377260
14305 -1377260 -1355815 -1340956 -1357174 -1470645 -1505462 -1449561 -1385044 -1315679 -1220367 -1260009 -1270691
14294 -1270691 -1277140 -1236712 -1194276 -1254994 -1301272 -1250702 -1191887 -1216596 -1235826 -1320332 -1392653
14283 -1392653 -1350242 -1276183 -1323039 -1323170 -1326322 -1363104 -1376611 -1356889 -1333453 -1340558 -1363729 -1339744
14271 -1339744 -1280417 -1284975 -1288443 -1355694 -1409601 -1370585 -1335978 -1323931 -1303196 -1297633 -1290050 -1253595
14259 -1253595 -1249950 -1310049 -1266893 -1253077 -1266324 -1283929 -1279492 -1293646 -1341950 -1416029 -1361226 -1271502
14247 -1271502 -1261259 -1295361 -1308952 -1324891 -1272671 -1246911 -1232093 -1247739 -1268203 -1266808 -1296056
14236 -1296056 -1288844 -1326721 -1306108 -1279300 -1296153 -1365580 -1390784 -1411549 -1390258 -1341604 -1325736
14225 -1325736 -1287917 -1251728 -1180504 -1214353 -1236013 -1248769 -1290456 -1282224 -1293251 -1287540 -1190144 -1183678
$$ [...]
##END NTUPLES=NMR SPECTRUM
##END=
