##TITLE=Analysis number 321775
Compound Code cc 07901
Project Code adrs
Chemist Name endeavour
##JCAMPDX= 6.0         $$ Bruker NMR JCAMP-DX V2.0
##DATA TYPE= NMR SPECTRUM
##DATA CLASS= NTUPLES
##ORIGIN= Bruker BioSpin GmbH
##OWNER= nmr
$$ XWIN-NMR		Version 3.5
$$ Fri Aug 25 11:26:12 2006 GMT Daylight Time (UT+1h)  MAYBRIDGE\nmr@NMR_250MHZ
##.OBSERVE FREQUENCY= 250.131544655141
##.OBSERVE NUCLEUS= ^1H
##.ACQUISITION MODE= SIMULTANEOUS (DQD)
##.ACQUISITION SCHEME= undefined
##.AVERAGES= 16
##.DIGITISER RES= 18
##SPECTROMETER/DATA SYSTEM= dpx250
##.PULSE SEQUENCE= zg30
##.SOLVENT NAME= DMSO
##.SHIFT REFERENCE= (INTERNAL, DMSO, 0, 16.522)
##AUDIT TRAIL= $$ (NUMBER, WHEN, WHO, WHERE, WHAT)
$$ ##TITLE= Audit trail, XWIN-NMR		Version 3.5
$$ ##JCAMPDX= 5.01
$$ ##ORIGIN= Bruker BioSpin GmbH
$$ ##OWNER= nmr
$$ C:\u/data/dgb/nmr/ADRS/1670/pdata/1/auditp.txt
$$ ##AUDIT TRAIL=  $$ (NUMBER, WHEN, WHO, WHERE, WHAT)
(   1,<2006-08-25 11:25:51.95 +100>,<MAYBRIDGE\nmr>,<NMR_250MHZ>,
      <created by zg, POWCHK disabled, PULCHK disabled
       configuration hash MD5:
       E2 DF 36 D8 04 B2 41 60 5A D7 A3 38 5A 4B D0 FE
       data hash MD5: 64K
       7E E2 3E A7 F9 1F C8 80 34 02 B6 88 11 97 98 72>)
(   2,<2006-08-25 11:26:03.68 +100>,<MAYBRIDGE\nmr>,<NMR_250MHZ>,
      <Start of raw data processing
       ef LB = 0.3 FT_mod = 6 PKNL = 1 SI = 32K 
       data hash MD5: 32K
       3B BF 20 EC ED 51 A6 7C EE 97 C0 8E F6 29 CD 93>)
(   3,<2006-08-25 11:26:06.28 +100>,<MAYBRIDGE\nmr>,<NMR_250MHZ>,
      <apk 
       data hash MD5: 32K
       23 36 A0 28 44 4C EF 2C DE 9D 64 51 1A 38 F0 FB>)
(   4,<2006-08-25 11:26:07.11 +100>,<MAYBRIDGE\nmr>,<NMR_250MHZ>,
      <abs ABSG = 5 
       data hash MD5: 32K
       53 1F 43 FE C1 B3 A5 B6 CC 48 66 C6 21 A1 1D 6E>)
$$ ##END=
$$ 
$$ hash MD5
$$ A4 9B 98 76 07 24 2E 5B 7A C2 47 FF B6 91 1B 36
##$RELAX= 
##$RELAX= 
##$RELAX= 
##$RELAX= 
##$RELAX= 
##$RELAX= 
##$RELAX= 
$$ Bruker specific parameters
$$ --------------------------
##$DU= <C:\u>
##$EXPNO= 1670
##$NAME= <ADRS>
##$PROCNO= 1
##$TYPE= <nmr>
##$USER= <dgb>
##$AMP= (0..31)
100 100 100 100 100 100 100 100 100 100 100 100 100 100 100 100 100 100 
100 100 100 100 100 100 100 100 100 100 100 100 100 100 
##$AQSEQ= 0
##$AQ_mod= 3
##$AUNM= <au_zg>
##$AUTOPOS= <14 >
##$BF1= 250.13
##$BF2= 250.13
##$BF3= 250.13
##$BF4= 250.13
##$BF5= 500.13
##$BF6= 500.13
##$BF7= 500.13
##$BF8= 500.13
##$BYTORDA= 1
##$CFDGTYP= 0
##$CFRGTYP= 5
##$CHEMSTR= <none>
##$CNST= (0..31)
1 1 145 1 1 1 1 1 1 1 1 1 1 1 1 1 1 1 1 1 1 1 1 1 1 1 1 1 1 1 1 1 
##$CPDPRG= <>
##$CPDPRG1= <>
##$CPDPRG2= <>
##$CPDPRG3= <>
##$CPDPRG4= <mlev>
##$CPDPRG5= <mlev>
##$CPDPRG6= <mlev>
##$CPDPRG7= <mlev>
##$CPDPRG8= <mlev>
##$CPDPRGB= <>
##$CPDPRGT= <>
##$D= (0..31)
0 1 0 0 0 0 0 0 0 0.06 0 0 0 0 0 0 0.0002 0 0 0 0 0 0 0 0 0 0 0 0 0 0 
0 
##$DATE= 1156501550
##$DBL= (0..7)
120 120 120 120 120 120 120 120 
##$DBP= (0..7)
150 150 150 150 150 150 150 150 
##$DBP07= 0
##$DBPNAM0= <>
##$DBPNAM1= <>
##$DBPNAM2= <>
$$ [...]
##$SUBNAM7= <"">
##$SUBNAM8= <"">
##$SUBNAM9= <"">
##$SW= 20.6930455092707
##$SWIBOX= (0..15)
0 0 3 0 0 0 0 0 0 0 0 0 0 0 0 0 
##$SW_h= 5175.983436853
##$TD= 65536
##$TD0= 1
##$TE= 295.16
##$TE2= 300
##$TE3= 300
##$TEG= 300
##$TL= (0..7)
0 120 120 120 120 120 120 120 
##$TP= (0..7)
150 150 150 150 150 150 150 150 
##$TP07= 0
##$TPNAME0= <>
##$TPNAME1= <>
##$TPNAME2= <>
##$TPNAME3= <>
##$TPNAME4= <>
##$TPNAME5= <>
##$TPNAME6= <>
##$TPNAME7= <>
##$TPOAL= (0..7)
0.5 0.5 0.5 0.5 0.5 0.5 0.5 0.5 
##$TPOFFS= (0..7)
0 0 0 0 0 0 0 0 
##$TUNHIN= 0
##$TUNHOUT= 0
##$TUNXOUT= 0
##$USERA1= <user>
##$USERA2= <user>
##$USERA3= <user>
##$USERA4= <user>
##$USERA5= <user>
##$V9= 5
##$VALIST= <valist>
##$VCLIST= <CCCCCCCCCCCCCCC>
##$VD= 0
##$VDLIST= <DDDDDDDDDDDDDDD>
##$VPLIST= <PPPPPPPPPPPPPPP>
##$VTLIST= <TTTTTTTTTTTTTTT>
##$WBST= 1024
##$WBSW= 4
##$XGAIN= (0..3)
0 0 0 0 
##$XL= 0
##$YL= 0
##$YMAX_a= 208610
##$YMIN_a= -252029
##$ZGOPTNS= <>
##$ZL1= 120
##$ZL2= 120
##$ZL3= 120
##$ZL4= 120
##$ABSF1= 16.522
##$ABSF2= -4.171173
##$ABSG= 5
##$ABSL= 3
##$ALPHA= 0
##$AQORDER= 0
##$ASSFAC= 0
##$ASSFACI= 0
##$ASSFACX= 0
##$ASSWID= 0
##$AUNMP= <proc_1d>
##$AZFE= 0.1
##$AZFW= 0.1
##$BCFW= 0
##$BC_mod= 0
##$BYTORDP= 0
##$COROFFS= 0
##$CY= 12.5
##$DATMOD= 1
##$DC= 0
##$DFILT= <>
##$DTYPP= 0
##$F1P= 14.0000005364418
##$F2P= -0.99999901652339
##$FCOR= 0.5
##$FTSIZE= 32768
##$FT_mod= 6
##$GAMMA= 0
##$GB= 0
##$INTBC= 1
##$INTSCL= 1
##$ISEN= 128
##$LB= 0.3
##$LEV0= 0
##$LPBIN= 0
##$MAXI= 10000
##$MC2= 0
##$MEAN= 0
##$ME_mod= 0
##$MI= 0
##$NCOEF= 0
##$NC_proc= -4
##$NLEV= 6
##$NOISF1= 0
##$NOISF2= 0
##$NSP= 0
##$NTH_PI= 0
##$NZP= 0
##$OFFSET= 16.522
##$PC= 1
##$PHC0= 136.5323
##$PHC1= 30.15265
##$PH_mod= 1
##$PKNL= yes
##$PPARMOD= 0
##$PSCAL= 4
##$PSIGN= 0
##$REVERSE= no
##$SF= 250.13
##$SI= 32768
##$SIGF1= 0
##$SIGF2= 0
##$SINO= 400
##$SIOLD= 32768
##$SREGLST= <1H.DMSO>
##$SSB= 0
##$STSI= 32768
##$STSR= 0
##$SW_p= 5175.98343685301
##$SYMM= 0
##$S_DEV= 0
##$TDeff= 65536
##$TDoff= 0
##$TI= <Analysis number 999999
Compound Code 99
Book Reference 9
Project Code 9>
##$TILT= no
##$TM1= 0
##$TM2= 0
##$TOPLEV= 0
##$USERP1= <user>
##$USERP2= <user>
##$USERP3= <user>
##$USERP4= <user>
##$USERP5= <user>
##$WDW= 1
##$XDIM= 32768
##$YMAX_p= 553506469
##$YMIN_p= -3807819
$$ End of Bruker specific parameters
$$ ---------------------------------
##NTUPLES= NMR SPECTRUM
##VAR_NAME=  FREQUENCY,     SPECTRUM/REAL,   SPECTRUM/IMAG
##SYMBOL=    X,             R,               I
##VAR_TYPE=  INDEPENDENT,   DEPENDENT,       DEPENDENT
##VAR_FORM=  AFFN,          ASDF,            ASDF
##VAR_DIM=   32768,         32768,           32768
##UNITS=     HZ,            ARBITRARY UNITS, ARBITRARY UNITS
##FACTOR=    0.157963299565203, 1,           1
##FIRST=     4132.6476996994, 0,             0
##LAST=      -1043.33573715361, 0,           0
##MIN=       -1043.33573715361, -3807819,    0
##MAX=       4132.6476996994, 553506469,     0
$$ Real data points
##PAGE= N=1
##DATA TABLE= (X++(R..R)), XYDATA
$$ [...]
26808c5905M9071N8913m8378n7369O5864j1672K3031o3578l7318k1421N7198J17027
26796I5463o6597q8683M6323M375j14521J6904J418k9976J2753J56542m5411q6551
26784i7961k1898O349O32j3333Q675J1147m6851k4697O281Q6407J0347J9421n4523
26771a10004L5273P6126p6813K7732J28200M7386l3139j98061k7232j8192j3716
26760a62440J20175l8207m5591L7174J08671n1379n9472M1141J68823M5330N4511
26749B18736J31851p0325k03733j27025O5401l0226p7802n2583J50398L5312m5113
26738e109L7036J38518J3330q2231p0483L2361j05029n2709J08443K1535J7565
26727E3227Q7490m549m9422j36957j16053l9468q583J40063J68298n9930p5295
$$ y = [-35905, 13166, 72079, 23701, -33668, 32196, 20524, 43555, -20023, -57341, -78762, -21564, 95463, 28866, -59817, -13494, -9119, -123640, -106736, -105318, -135294, -122541, 34001, -11410, -97961, -119859, -113510, -112878, -126211, -117536, -106389, -153240, -177937, -171656, -85249, -74902, -55481, -110004, -74731, 1395, -75418, -47686, 80514, 127900, 94761, -103300, -130532, -148724, -162440, -42265, -80472, -126063, -88889, 19782, -31597, -91069, -49928, 118895, 164225, 218736, 350587, 280262, 76529, -50496, 14905, -15321, -93123, -145706, 4692, 40004, -5109, 31927, 170445, 183775, 101544, 31061, 63422, -41607, -94316, 14127, 35662, 53227, 140717, 136168, 86746, -50211, -166264, -205732, -214315, -74252, 94046, 34116, -41179]
26716d1179q3265o1563R7543K4144O0088J916o313k6783l3980k4225J31069J71893
26704B09345Q466o0351m3594k2159j16076j40168M416J51509J33625K8508j30580
26693B2941j32972n7082M4755J07924O511r255P6138j9064j8392J74262M8738
26682B44504M1712O0663r9538j37698r84M0873J20649m6535n6900K6624k1995
26671A71375n3542l9227J8454M224l3585j6012L092K4502M8541J54562r2585o5434
26659A24365m237r0439j01594j00054j4357k441K06284k6116m7045q77M9861K1330
26647A4680j23152o2078J39200R3169j0601l5542l5732n7797J24490R802r601
26636D6838l685L3869m7614o1150M1213K2176j7921N5508K0620q706j36092O5117
$$ y = [-41179, -124444, -186007, -88464, -64320, -4232, -2316, -8629, -35412, -69392, -93617, 37452, 209345, 217811, 157460, 113866, 91707, -24369, -164537, -160121, -8612, 125013, 153521, 22941, -110031, -167113, -122358, -14434, -7923, -17178, 58960, 39896, 21504, 195766, 244504, 286216, 346879, 247341, 109643, 108659, 149532, 270181, 223646, 166746, 193370, 171375, 117833, 78606, 97060, 101284, 67699, 51687, 54779, 79281, 127822, 282384, 189799, 124365, 120128, 29689, -71905, -171959, -186316, -188757, 17527, -8589, -55634, -56511, -6650, 14680, -108472, -170550, -31350, 61819, 51218, 15676, -20056, -77853, 46637, 56439, 46838, 43153, 77022, 29408, -31742, 9471, 31647, 13726, 69234, 89854, 81148, -54944, 10173]
26624A0173P8184Q249j27850l3099k9070j06674L3832K9257N6712n8528M8516
26613i0298L141M9630O0117L5351K7001p3907o3752J2826r8000M9036l1264P3680
26601d6439R639M4380K3657o5160n1387M8826N326L4457n3530n2059J92863q7754
26589B819p1354J5677m5422N7434k3500L3400m2949K8829n4619O5669L210r2537
26577a23343P1745Q4109o0808o1881P5856N1331n1649j35395j3063K9484Q4802
26566d8812l6619L6173n0336J25218j4359N08M0661Q0304J0862K5456K5362o0226
26554A34192k1865j4152r895P941M4730m7513j98020P055Q0912J7900L2473J53155
26542A86913q7575q3434R1234O2110k7541k7659N4478j03561J21819M9625j3347
$$ y = [10173, 88357, 96606, -31244, -64343, -93413, -200087, -166255, -136998, -80286, -138814, -90298, -87157, -37527, 22590, 57941, 84942, 11035, -52717, -39891, -137891, -88855, -120119, -46439, -36800, 7580, 31237, -33923, -85310, -36484, -31158, 3299, -50231, -102290, 90573, 2819, -68535, -52858, -98280, -40846, -64346, -30946, -73895, -45066, -99685, -34016, -30806, -123343, -51598, 32511, -28297, -90178, -14322, 37009, -14640, -150035, -163098, -133614, -48812, -85431, -49258, -99594, 25624, 11265, 11773, 52434, 132738, 143600, 169056, 194418, 134192, 112327, 98175, 88280, 96221, 140951, 93438, -104582, -97527, -16615, 1285, 33758, 186913, 99338, 15904, 107138, 169248, 141707, 114048, 168526, 64965, 186784, 236409, 223062]
26531B23062r384j1562j05247n7564l5119q115l9494p3031J32924J12828m2090
26520H7208o1602O18m1828j0800l3025q282M9150P6703k6525K6635P2368J07716
26508B38336N308j99400j38514k0952m2642p3982j6341J09397j2921L736M2951
26497a05024R3190L806r135k3116J61384M8517q1690j28277j89120j5683J39432
26486a05716K0767k1880l3054M3780J80871K2233N3964L5535j19381j14798N167
26475c2512l7398r584K0150l7796N6232O4234o4244K2546k6503m5800n2699N1692
26463i1682K3750j7591n9988M7267O1561j6338p1979O3111J10076Q8310p0207
26452F6290K1762m8550p1662l543N2226J794m7477n980O8791K5292M696o7327
$$ y = [223062, 213678, 202116, 96869, 39305, 4186, -3929, -43423, -116454, 16470, 129298, 87208, 25606, 26224, -15604, -26404, -59429, -67711, -18561, 58142, 31617, 58252, 130620, 238336, 243644, 44244, -94270, -115222, -157864, -231846, -248187, -138790, -151711, -147975, -105024, -11834, -8028, -17163, -40279, 121105, 169622, 87932, -40345, -229465, -245148, -105716, -84949, -106829, -139883, -96103, 84768, 107001, 160965, 196500, 77119, -37679, -32512, -69910, -79494, -59344, -97140, -40908, 23326, -40918, -18372, -44875, -90675, -143374, -91682, -67932, -85523, -145511, -98244, -36683, -53021, -125000, -61889, 48187, 136497, 66290, 88052, 39502, -32160, -35703, 16523, 18317, -29160, -35140, 33651, 58943, 63639, -3688]
26440c688k9463q8845J18735P1435M3592r400l7292q9549l6428k0950p1219j2810
26428a65882j7807L3624k7173P1298J09190J47766J07800l3674j27445j1428j0951
26417G5318p8974k1533P5038L1399L6154O3155o3916N6406J12037m2271p4612
26406A68201j09734J5730j586q076p5986r9263m7505J03431M6905n0382o6817
26395a25082l1612K3816Q9957L9067m5391j05514j8776L7924J52584K8514j32931
26384h7444n5080l9643L3884R3524O9619j7926k7176j4709q720N5934R4989n027
26372I2225j7335m4367M3751j09026n423J11155j00316q8947N6539q3011N0014
26361i4741P808O5962P0802k881k2990J9372J6077m8922K602J60457j6842p2667
$$ y = [-3688, -33151, -121996, -3261, 68174, 111766, 102366, 65074, -24475, -60903, -81853, -153072, -165882, -183689, -150065, -177238, -105940, 3250, 151016, 258816, 225142, 97697, 86269, 75318, -3656, -25189, 49849, 81248, 117402, 180557, 116641, 173047, 285084, 242813, 168201, 58467, 74197, 72611, 64535, -11451, -110714, -158219, -54788, -7883, -58265, -125082, -156694, -132878, -42921, -3854, -49245, -154759, -173535, -135611, 16973, 45487, -87444, -142524, -182167, -148283, -54759, 14860, -3066, -30242, -44951, -53671, 2263, 97252, 92225, 74890, 30523, 74274, -34752, -40175, 70980, -29336, -118283, -61744, -144755, -94741, -86933, -20971, 49831, 46950, 23960, 43332, 59409, 10487, 13089, 173546, 156704, 84037]
26349H4037N5187L2893p6523p8289L7853J2011k503o4285k9886r4099q3925K1009
26337a86520K8908J02061k7367R120O100J53390N5809n5690l1886l9114n0638
26326c5827j5570k6146P1180p9594p7429P7212N2617m639j475J49805j33912q2033
26314a05811J01820J20548q0050m8426l001p9507n8233P6415P4949O826L6923
26303D2453K8362r9650k3046O59L404n063k0744L6642O5926J0622m1390o9047
26291g0872N3752O517O2014K28411k6394p8036m4079j19658j3520J48777j9428
26280A27484r4871N1246M4518n4532k8448P1941J0714n3074j50254j43211L216
26269b15271M188J55911l053O936l1673J29680J11205j31552r1132p4065m0515
$$ y = [84037, 139224, 172117, 95594, 17305, 55158, 67169, 64666, 381, -29505, -123604, -207529, -186520, -157612, -55551, -82918, -73798, -67698, 85692, 141501, 85811, 53925, 14811, -35827, -51397, -77543, -6363, -85957, -163386, -86174, -33557, -38196, -39671, 110134, -23778, -105811, -3991, 116557, 36507, -11919, -14920, -94427, -152660, -76245, -1296, 5530, 42453, 70815, -28835, -51881, -51222, -47818, -52881, -73625, -36983, 28943, 39565, -1825, -70872, -17120, -10603, 51411, 279822, 253428, 175392, 131313, 11655, -1865, 146912, 127484, 32613, 83859, 128377, 73845, 45397, 117338, 128052, 74978, -75276, -218487, -215271, -211083, -55172, -58225, -51289, -82962, 46718, 157923, 26371, -64761, -138826, -179341]
26258a79341J21033R9067J353j6645L6j34913j15570J7040N4328J05338R6119
26247D7845j1213P55J11376o099j5890J6749j56367j17646J4970K8730j3942J28967
26235B8235M8658o2738j35073M142M9648M7239l874J3552J23535p7337n2880K3991
26223G098q2965n23n5882o6202N4281q193J20238O6299J0724n7839j51340M8148
26211a16156P0876K1179j18194m8325K9993J09430J29007p700p6617o1483N4055
26200a3935n3712k7337n7336J648j26304L730L4882N4178M0388L3734O845q8884
26188a92103L1934J16455m310j4020n5307J3459J20355L5943Q3931l0164m0053
26177F6120K7708j62145O1038J12422J6962m9890K9025O6087k2063p3888N3867
$$ y = [-179341, -58308, 40759, 42112, 25467, 25503, -109410, -224980, -207940, -153612, -48274, 47845, 36632, 37387, 148763, 142664, 126774, 143523, -12844, -130490, -115520, -86790, -100732, 28235, 76893, 14155, -120918, -116776, -67128, -19889, -23763, -10211, 113324, 35987, -16893, 7098, -75867, -76390, -132272, -198474, -144193, -152386, -32148, 34151, 44875, -12964, -164304, -116156, -45280, -24101, -142295, -190620, -160627, -51197, 77810, 70110, -6507, -67990, -13935, -67647, -94984, -152320, -150672, -276976, -273246, -238364, -184186, -143798, -110064, -103219, -192103, -160169, -43714, -48024, -62044, -117351, -103892, 16463, 52406, 136337, 106173, 66120, 93828, -68317, -7279, 105143, 122105, 72215, 101240, 167327, 145264, 71376, 125243]
26166A25243P4013o4660l5053n8491n201K324o1228m2973O5732l5096j93221k150
26154b30761K6351J0957J03660Q7589M9926N401R235R6125n8177R7498m6543l7115
26142A14146n3151o3044J9227j29508M96K24193L7638l7647o2083m8066K7361
26131B9562j8249J1633O1892N4308j47674k4193j19140O0188l5910o3556l611
26120a94750J27251K2234p7952Q4129O3222L3248j8787J05275j2896j38646m4533
26109e2205K0567J4415L2611m239L0874j23815n5523J00848J02008P7240j9033
26098A23748p6099j63470l1084N9308l2931m2192N607O1644l6694m2103m9661
26087b23927K2224M4416O7391N8822q2517j13257J38199Q463m5996L1480O0081
$$ y = [125243, 199256, 134596, 99543, 41052, 35851, 38175, -23053, -66026, -294, -35390, -228611, -230761, -204410, -193453, -89793, -2204, 47722, 53123, 62358, 158483, 100306, 197804, 151261, 114146, 60995, -2049, 17178, -112330, -111834, 112359, 149997, 112350, 50267, 2201, 29562, 11313, 22946, 84838, 139146, -8528, -32721, -151861, -91673, -127583, -191139, -194750, -67499, -45265, -123217, -39088, 24134, 57382, 38595, 143870, 130974, -7672, -52205, -31638, -17223, 15388, 11149, 42023, -81792, -137315, -36467, 65541, 142781, 123748, 47649, -115821, -146905, -87597, -120528, -162720, -157113, -95469, -132163, -174266, -223927, -201703, -157287, -89896, -31074, -113591, -226848, -88649, -80186, -126182, -94702, -34621]
26076c4621j1604q4892q992l1695P9611L8473k9595J9135j7679P0751O1240K6836
26064G6968k2581l0723o6891k0807o8525L0786j06879k5997P3523m0053j89914
26053c91093L3608J42308r724N0015J05658N2776n4396j10233m1674L1299M4861
26042a46595J2386n3158k993M6656j0948Q5652K4992m7851p529j01094K5224J57533
26030a7725k301o475K5609m8470l1192J5120K4167O076J1443r3753k6323K8435
26018a15389J44384K3976j00554P5704o2911j08903p4897J25752J00067R432l422
26007A3239p8915n4184j5843R2941K3674M8188L4670M9371R4525j16680j26788
25996c5802l9897j22084j76662O4343J59018N6815K0380l3147q088p0386o2K9664
$$ y = [-34621, -46225, -131117, -140109, -171804, -92193, -53720, -83315, -64180, -81859, -11108, 50132, 76968, 54387, 23664, -43227, -64034, -132559, -101773, -208652, -234649, -161126, -201179, -391093, -357485, -215177, -224901, -174886, -69228, -16452, -70848, -181081, -222755, -191456, -146595, -134209, -187367, -190360, -143704, -154652, -69000, -44008, -91859, -99388, -200482, -175258, -17725, -20026, -26501, -892, -49362, -80554, -65434, -41267, -35191, -23748, -117501, -143824, -115389, 28995, 52971, -47583, 28121, -34790, -143693, -218590, -92838, 7229, 16661, 13239, -65676, -119860, -135703, -42762, -19088, 29100, 63770, 113141, 207666, 90986, -35802, -75699, -197783, -374445, -310102, -151084, -94269, -73889, -107036, -115124, -185510, -185572, -155908]
25984a55908M0738l1908P8723J00639l4911m0237K0259L9945P2002J05582r7418
25973I7506j44155j68640N9107K0830J1935M1722L3071q0085j7483J5554m6936
25962a77574P5620N6273K3172K4934K4175O9090p0814j42497n8052L2878O0486
25951h2309O6772m0373l6188q2576o8143O442k0598M2561M5670j21368m6851P0719
25939b66242P5700P438j7206L2088Q0566j1011J9988r991l3783l3763J12288J20158
25927G6230j4097m1881J3298p4369J0424O3256L7467m2801j7394M3808q0977r3526
25915a20562N7265M0740O925l0859J01563K7607q8810n286K5938m7310l2568p4350
25903a39707o7002J9408J02879J20350M7929m5726l6214n3731n0127M1120k2359
$$ y = [-155908, -115170, -147078, -68355, 32284, -2627, -42864, -22605, 17340, 89342, 194924, 97506, -46649, -215289, -156182, -135352, -123417, -81695, -48624, -128709, -146192, -130638, -177574, -101954, -45681, -22509, 2425, 26600, 95690, 24876, -117621, -175673, -142795, -82309, -15537, -55910, -92098, -174674, -242817, -236375, -256973, -214412, -168742, -290110, -336961, -266242, -190542, -183104, -200310, -168222, -87656, -98667, -78679, -88670, -122453, -156216, -43928, 76230, 62133, 20252, 33550, -40819, -30395, 32861, 70328, 27527, 10133, 53941, -27036, -120562, -63297, -22557, -15632, -46491, 55072, 82679, -6131, -11417, 14521, -32789, -65357, -139707, -206709, -187301, -84422, 35928, 83857, 38131, 1917, -51814, -101941, -60821, -83180]
25892h3180q0599N504J12512N5362j818N6394J46862l6062k36307j31307j10542
25881c03181m8334R9169O6961O7002P7353O7041R2939J01843l7909m5295l8246
25870I9343l7940M7972J6017p5985j69303j55384J9410R5600O2616k2948o5814
25859a86416Q2263J11084N4612L386O6151l455j37474j4920l6391j44373l5896
25848b41429J21824Q8989O2948P6381N3421r160j01087n4615M6097O8904k018
25837A10255K40n1908q0434l4868J01527M2966p7152o0971j21036j4869J63886
25826b2364K9444K0781N492N9719M0127j13079k0582k4798l3668j60004l4427
25815b53359J33705O484q0668L7308Q8954N8497m557m2958q6839m6801j2963l9431
$$ y = [-83180, -163779, -158275, -45763, 9599, 7781, 64175, 211037, 174975, -61332, -192639, -303181, -351515, -252346, -185385, -118383, -41030, 26011, 118950, 220793, 182884, 137589, 99343, 61403, 109375, 125392, 49407, -119896, -275280, -255870, -160270, -97654, -120602, -186416, -104153, 6931, 61543, 64929, 131080, 127625, -9849, -24769, -61160, -205533, -241429, -119605, -30616, 32332, 108713, 162134, 152974, 51887, -2728, 43369, 112273, 110255, 110495, 58587, -21847, -56715, 44812, 87778, 10626, -50345, -171381, -186250, -22364, 7080, 27861, 33353, 93072, 133199, 20120, -462, -25260, -58928, -218932, -253359, -119654, -113170, -193838, -156530, -67576, -9079, -13636, -56594, -143433, -190234, -203197, -242628]
25803b42628o0404m9897M7929O8204l8916Q7604J59010O6101m4499j72940K1087
25792a59349J12582j2408P3538L6864k9035j37392L0435M8257m129j6582m6000
25781a03219p1367Q9886J01039j6900j48967j51431n421M6606M0387J5796J29464
25770g4127o1938j8414Q4255M7834l8700j39336j1599m2643j5841P1079R7419
25759a02011n7281J1514P3264J1951M3196r5041j53151j6760K6034J38032R01
25748a19352l4815O5633J51146M9924L5965j8793M2727o2969r9548o9378K5639
25737c3821J12343P5819j21917o9761L17q5884q5237N2068Q3226J45963k1160
25726E1956o7851L8661K1949q9695r3057L2290O0093j08782j2522J33687J15551
$$ y = [-242628, -303032, -352929, -305000, -236796, -275712, -188108, -29098, 37003, -7496, -180436, -159349, -46767, -59175, 14363, 51227, 22192, -115200, -84765, -36508, -40637, -57219, -103219, -174586, -84700, 16339, -561, -149528, -300959, -306380, -259774, -219387, -203591, -74127, -136065, -154479, -70224, -22390, -61090, -200426, -212025, -254668, -270509, -199430, -102011, -159292, -147778, -74514, -62563, -19367, -114408, -267559, -284319, -258285, -120253, -119352, -154167, -88534, 62612, 112536, 148501, 129708, 172435, 109466, 9918, -59460, -33821, 78522, 154341, 32424, -37337, -37020, -122904, -208141, -156073, -72847, 73116, 51956, -15895, 22766, 44715, -44980, -138037, -105747, -45654, -154436, -166958, -33271, 82280]
25715H2280q022M1850j15763k320Q5300q0335j01028n6261L5919J5587j62727
25704b65520n0733P7945J34776J03934o400r3924r7746n7674J0004J19049P8349
25693d7940p822m7690L0309j2071o8674j6302K9448P7901j23390R4823J19164
25682B7756K788l963k0860j06352J6418j03178J3916Q7191j8102N4903K8710J1758
25670i015q683k2595l7342q1947P3127M3736j3751k2544m2298j4257N676P7753
25658e2140l2325K7963J05631Q9361j1982j3770M1129O9600j01735k47528j37220
25647b63016M3829K3266J53815K07376o0200j10476j2754P087J6412N3814m4543
25636A4610o8880n0387M6477M5004j10272P9114L2703j9681O6R6517R327n5292
$$ y = [82280, 74258, 116108, 345, -1975, 83325, 2990, -98038, -154299, -118380, -102793, -265520, -316253, -238308, -103532, 402, -5998, -99922, -197668, -255342, -245338, -126289, -47940, -55762, -103452, -73143, -85214, -153888, -170190, -140742, -62841, -186231, -91408, 27756, 30544, 26581, 5721, -100631, -84213, -187391, -173475, -86284, -104386, -49483, -20773, -9015, -17698, -40293, -77635, -159582, -86455, -42719, -56470, -79014, -121312, -135569, -129893, -52140, -84465, -56502, 49129, 138490, 126508, 112738, 153867, 223467, 121732, -125796, -263016, -219187, -195921, -42106, 165270, 105070, -5406, -18160, -11073, 5339, 59153, 14610, -54270, -104657, -58180, -13176, -123448, -44334, -11631, -31312, -31246, 65271, 74598, 19306]
25624A9306K2080N742o9733j6164r8284P8711P6806k9685r3173M3361o0722j36593
25612b58348l9714Q1956J86441J29906l0421n4089J06797M8457n5653j15440j32066
25601a32174q3425J8149O6463r775P8269l6786M2616M2995l6628M213o5907J077
25589a10913J03265Q6473j29592j00978j3164p1706j7426L6181J17100O9443p5326
25578a06643j0330K8450O7576J2520j10892o6658o3354R8413M6270m8745j55831
25567c09224j7919l3486k3061J46145J15639q7223J3506R8799O8126r4682q669
25556a32049Q0542J16606L9432q5414j26104o4522L6608O9030J26875J7825R894
25545H8723j23204j99747n1706l0965R1054P0229J1276J09096J42139l474l6587
$$ y = [19306, 41386, 47128, -22605, -38769, -137053, -58342, 18464, -11221, -104394, -61033, -121755, -258348, -298062, -216106, -29665, 100241, 69820, 15731, 122528, 170985, 115332, -108, -132174, -215599, -197450, -130987, -140762, -62493, -99279, -56663, -13668, -50296, -46083, -111990, -110913, -7648, 78825, -50767, -151745, -164909, -236615, -254041, -217860, -100760, -31317, -106643, -116973, -88523, -20947, -8427, -119319, -185977, -249331, -150918, -104648, -153393, -309224, -327143, -360629, -383690, -237545, -121906, -209129, -195623, -96824, -28698, -123380, -132049, -51507, 65099, 104531, 19117, -106987, -171509, -134901, -65871, 61004, 78829, 88723, -34481, -234228, -285934, -316899, -225845, -155616, -144340, -35244, 106895, 103421, 66834]
25534F6834p1708j23276K4115O1509O2460J2694j7438J7460l8706M3432k2074
25523A5302j33847j57439n2927J26495P6729O2867L0974P409l7861m7036M7831
25512f1503O4015J14846l1811l6860Q6229m7289o6358n720p9975n2079j40060
25501b56565l92N1992P3999J29950j358j7798N7364J5101o60K8769j22575J9910
25489b2263n3530j01606k1498n6612Q083O4961J14129N3513M4297L9036M2753
25478A11263o9582r3504k1094p4076j1007M6361l4022o0678J9320L4281q7266
25467b40004L6610J41146j736l6714J08328Q7576n1742k106j18027o9102P1170
25456g4601P9138M4001n8572M7411J11119l5056q3443r0041j6621L799J6815r140
$$ y = [66834, -4874, -128150, -104035, -42526, 19934, 32628, 15190, 32650, -6056, 37376, 15302, -118545, -275984, -328911, -202416, -125687, -62820, -31846, -24437, -62298, -109334, -61503, 2512, 117358, 85547, 48687, 134916, 87627, 21269, 15549, -64426, -116505, -256565, -256957, -204965, -130966, -1016, -2374, -20172, 37192, 52293, 51633, 80402, -42173, -22263, -75793, -177399, -198897, -255509, -247426, -182465, -68336, -14823, 29474, 68510, 111263, 41681, -51823, -72917, -146993, -158000, -111639, -145661, -206339, -187019, -152738, -240004, -203394, -62248, -63984, -100698, 7630, 95206, 43464, 41358, -76669, -145771, -74601, 4537, 48538, -10034, 37377, 148496, 113440, 29997, -60044, -76665, -72866, -56051, -65191]
25444f5191j29966l4067J50467J7921m274O1819P5809j39586j62051j54527J13646
25433b70000J17580N9333j8R0041p0907q1252J1974L162Q5530m7723r0090k6599
25421b18969q903J14046r9439N3683P2622m100K3981l349q9841P586Q5956n9560
25409a26287K0132J01071j15464J2400J55225l0567p6995l0025J4797n349J7156
25398f3906n516n1618K7184K5188L1205L9857r83J8208k0455L8093o5800n6349
25386h4892n4548r7771K0174L1022J49939j3029j23663M895p3451j9321O0125
25375b00520J11639O1143k4067J5298K4298k2179k9965L2580o5402k5178J65277
25364D2924M2608p6107o092J2599J9591N8796M8722j00062j50353o7579O622L2874
$$ y = [-65191, -195157, -229224, -78757, -60836, -65110, -3291, 72518, -67068, -229119, -383646, -270000, -152420, -93087, -93105, -3064, -73971, -155223, -143249, -140087, -54557, -102280, -192370, -218969, -227872, -113826, -213265, -159582, -86960, -91060, -67079, -70428, -160269, -152683, -66727, -126287, -106155, -5084, -120548, -108148, 47077, 16510, -60485, -90510, -75713, -81062, -63906, -69422, -121040, -93856, -68668, -37463, 2394, 1411, 19619, -836, 37257, -28543, -84892, -139440, -237211, -217037, -186015, -36076, -49105, -172768, -167873, -241324, -260645, -200520, -88881, -27738, -51805, -36507, -12209, -34388, -64353, -31773, -97175, -122353, 42924, 85532, 9425, 3333, 15932, 35523, 94319, 143041, 42979, -107374, -174953, -168331, -135457]
25352a35457R7416N1079k4593Q8739j40612j8631J52081k1486j66425o318l2927
25341a57134n1097O0074O8570O5438J1056P9583n6815p2077o7196J9300K6507
25330g3791k024l3467K1948j8028m7237J7329O0817J0302j4677O753L5681R8689
25318F2295R8549j21780j58899r3133j9640m3475L6128O8163k1682n2808L6561
25307b09721J13235K524O7208L3815M240R612q9005q883r9435k0841M1561j00866
25295b56556j11124K0677M8710J13753L0990N8927k9058n2327q6791J19044J77108
25284C3353q0498l1691L0861Q9848r298j7433P7572r410j9815j08747j04918q5397
25272b35573L497P7738O3019O0794N5095m9095j33844Q3882L0298p6114j12912
$$ y = [-135457, -38041, 13038, -11555, 77184, -63428, -82059, 70022, 48536, -117889, -124207, -157134, -208231, -148157, -79587, -14149, -3093, 76490, 19675, -52402, -119598, -100298, -73791, -75815, -109282, -87334, -105362, -152599, -135270, -74453, -64151, -78828, -72075, -36394, 62295, 160844, 39064, -119835, -212968, -232608, -276083, -239955, -171792, -193474, -246282, -209721, -96486, -93962, -26754, 7061, 11301, 20913, -68092, -76975, -176410, -197251, -155690, -256556, -367680, -347003, -298293, -184540, -153550, -94623, -123681, -176008, -262799, -143755, 33353, -47145, -78836, -47975, 41873, 32575, 15142, 92714, 83304, 63489, -45258, -150176, -235573, -232076, -154338, -91319, -30525, 24570, -24525, -158369, -74487, -44189, -120303, -233215]
25261b33215L6503J22717J78135p0528n8786N3833J15612O4049j03398q9578L3958
25250D9302N9140L27P1181j23649k1074j03365k4827N2563N1039m0795J9792k87
25238a0653l6085j63199N3282J6689O8290L9892r4121k9748n5820o49J18829P5355
25226a7938m5225j08549j4020O4368O4277l9028Q486n3419J04990M2678l6673
25215c0053r9217m9315j870N8153J11648k5170R123L6847O0740o4992j05265j45312
25203b44683L3520o8136J0028Q3448m7067M6521R1657M6910n9046j3250N4762
25192f5336J03080J00068n514j66518m5728l9983K0435j8916o5285J7455k4453
25181a90695o620K0403P249Q7853M2263K6644l2228q0699k0762J44135J45940
$$ y = [-233215, -196712, -73995, 104140, 33612, -25174, 28659, 144271, 208320, 104922, 15344, 49302, 108442, 108769, 179950, 56301, 35227, -68138, -92965, -40402, 10637, -30158, -10366, -10653, -46738, -209937, -156655, -139966, -71676, -31784, -125905, -155653, -211473, -212122, -93293, -17938, -63163, -171712, -185732, -121364, -57087, -96115, -87629, -141048, -36058, 6620, -30053, -129270, -178585, -180455, -122302, -10654, -35824, -26701, 10146, 70886, 5894, -99371, -244683, -211163, -279299, -269271, -185823, -232890, -186369, -94712, -47802, -106848, -120098, -65336, 37744, 137812, 132298, -34220, -79948, -119931, -99496, -118412, -183697, -166242, -190695, -197315, -176912, -169663, -81810, -39547, -12903, -45131, -125830, -146592, -2457, 143483]
25170A43483r047l4209m9741J4304j40339j14441j0990L5686J7624N4910P6387
25159a6373k9555o5551R984J4938R353j51j5060M3522R3550k7387J1956l486n0401
25146b4661p0362J16670M8112p3176q3485l4237j04668k0240K08943R1248O2697
25135A16841j32841j48760j907K843P5758k7233j9378L5980O716P3941p6842j43955
25123b38837K2683K9831m7568M0320O7598J9452L6014m3049k2563n0278j6072
25112b02469r0671L6617j7898n8245J2611N9264J16741R2192N2859N3853j22479
25101f7625j03455K1310o1130j08586L816K7858p4131O6508J47605Q3973N733
25090e8124L1343J8507P799O7493j46062o0129J9835l1003M1035L4263M7970k1617
$$ y = [143483, 134436, 100227, 50486, 64790, -75549, -189990, -200980, -165294, -147670, -92760, -16373, -45928, -111479, -101495, -86557, -77204, -77355, -92415, -48893, 44657, 17270, 29226, 25740, -24661, -95023, 21647, 69759, -3417, -86902, -121139, -225807, -246047, -37104, 54144, 116841, -16000, -164760, -166667, -163824, -88066, -115299, -134677, -98697, -91981, -18040, -94882, -238837, -216154, -186323, -233891, -193571, -125973, -106521, -70507, -113556, -136119, -186397, -202469, -293140, -256523, -274421, -332666, -320055, -260791, -144050, -51858, 1001, 54854, -67625, -171080, -149770, -210900, -319486, -315670, -287812, -361943, -295435, -147830, -63857, -58124, -26781, -8274, -475, 67018, -79044, -139173, -119338, -150341, -109306, -75043, -27073, -48690]
25078d8690J5017o5815m93R2516l5338j80511n5887O2412J05374L9373j16283
25067a88325r1604n940r2147L8585J05141J23255O612J7623N2682L9702N9914
25056F5498r493r884k6376n8111k127r9813n3688p4231n5721m0432L2595J33387
25044a98396J1887P8174J6463o3358l8260P2452L8042K7938r5861l454K2786K8079
25032a03508l7047l1974K0556j03937k178J96451Q5246K6285q3189q2414r087
25021a24796j6608J45187J77354r1989l2579m5530M9845J815M461q7492Q3152
25010F2820k9267j645J1528j4866J0194L0711n287j26350m8097R9924N1903n5414
24998a3846m7182j00562K2794L951P9327R8282N0901k0434J9110N4713n5635l0689
$$ y = [-48690, -33673, -99488, -99981, -7465, -42803, -223314, -279201, -216789, -111415, -72042, -188325, -279929, -285869, -378016, -339431, -234290, -111035, -104423, -86800, -34118, 5584, 65498, 56005, 46121, 19745, -38366, -40493, -140306, -193994, -268225, -323946, -364378, -331783, -198396, -186509, -108335, -91872, -155230, -193490, -121038, -82996, -55058, -150919, -154373, -131587, -103508, -140555, -172529, -151973, -255910, -258088, -61637, 23609, 49894, -33295, -115709, -124796, -141404, 3783, 181137, 89148, 56569, 11039, 60884, 62699, 67160, -20332, 62820, 33553, 31908, 43436, 28570, 38764, 69475, 64188, -62162, -110259, -10335, 41568, -13846, -61028, -161590, -138796, -134845, -55518, 42764, 93665, 73231, 92341, 147054, 91419, 60730]
24986F0730J12211o4329j40476j92775J09685m886j8174m3100O168p655J04856
24975g7745M7034J4946M6642o4202j42141j37906J37318J34785l5615k2329J2541
24964h6672J19950N6269r0905o6941N513O2174m0865o0731l7319o1695m5296q6410
24952c32928k6136J16618Q0671o0393L3621Q6909N991o6100k9033o7398k7099
24941b85277K8960Q0575j3627L4125O5970O8451L2013o7251l3560r7526o8185
24930b55332l6920j8116R0788j9807m9966K3313M6573R7019m6048m545J8541L3500
24918a21000M1913Q6907m0421j97344m6122J8908K9028J05396O5882o9072n951
24907a31876M8978j30339j04972Q9197j6912q676P8209J19428L6810q5908r9525
$$ y = [60730, 172941, 108612, -31864, -224639, -114954, -119840, -138014, -181114, -174946, -182601, -77745, -30711, -15765, 30877, -33325, -175466, -313372, -176054, -41269, -76884, -99213, -86672, 33278, 89547, -1358, -68299, -62786, -612, -41477, -102208, -139527, -201222, -246518, -332928, -359064, -242446, -161775, -222168, -188547, -101638, -95647, -161747, -190780, -258178, -285277, -256317, -175742, -189369, -155244, -89274, -20823, 11190, -56061, -89621, -187147, -255332, -292252, -310368, -219580, -239387, -289353, -266040, -219467, -122448, -168496, -173041, -154500, -121000, -79087, 7820, -32601, -229945, -276067, -257159, -228131, -122735, -56853, -125925, -131876, -82898, -213237, -318209, -229012, -245924, -254600, -176391, -56963, -20153, -106061, -205586]
24896b05586l2588n0829l8898O5865Q7309j2158K7388m0892J0663o4337J11327
24885a42736J7309j06819j6039l0358J90119K06480J2181j31253Q0755K6000q9403
24874A6236o7857p2422K4928N4569K4468M8909q9539j11920L216O35k6551j03155
24862b98483K6696P3553l1341L1851M704P6678R3758L6592l149N059m9884j7173
24850e1139n2576R845Q422l6430l2597Q7882Q2709n6703J14812m1731j19909L1241
24838e6174J9356l7564k9414l9502j2872P1136M9877N3874n8828N017M0113O6627
24826G1646Q702k8370l5316j45438r5636R1734O6726M025r2794K3586J7816j3518
24814a26837n7173l7831L3096N8002o3971l3643J20317Q7797j54900m6639M8409
$$ y = [-205586, -238174, -289003, -327901, -262036, -174727, -186885, -159497, -200389, -189726, -254063, -142736, -125427, -232246, -248285, -278643, -88524, 117956, 130137, -1116, 79639, 105639, 16236, -51621, -124043, -99115, -44546, -20078, 28831, -60708, -172628, -169412, -168777, -195328, -298483, -271787, -198234, -229575, -197724, -193020, -116342, -22584, 14008, 10859, 15918, -33966, -51139, -103715, -93870, -85448, -121878, -154475, -66593, 16116, -40587, 74225, 32494, -87415, -56174, -36818, -74382, -103796, -143298, -156170, -85034, -35157, 18717, -40111, -35094, 5019, 71646, 80348, 51978, 16662, -128776, -224412, -132678, -65952, -61927, -154721, -131135, -113319, -126837, -184010, -221841, -188745, -130743, -194714, -228357, -108040, -20243, -175143, -221782, -173373]
24803a73373m7047p683K090K182P4896J83302N9816n0346l429J7425K4298N0849
24791A32980j39863j57112k4384o7900L6001R8597N713m7501j0545l505P7176
24780a00343Q3194n5567K0077m0890m4963k3448r266J3670O451k444k8550K6686
24768a55393M382J2786j0823k6104m1662R6876J25507M1030q3222j06964P2061
24757g1526p051j54219j22676l8138L5124m2354K753K30898N4712K4233j692m3148
24745a33084q7835n7985P7715J27890K3861r8770K5665k0891Q1639p476q5999
24734a55270K5308L452R976j168l6401j00058L5058N4069n6745R399J88615L7525
24722A3760o4267L6543J0290m2893k9342j5786N8580J25325k8713j82512l4172
$$ y = [-173373, -220420, -228103, -226013, -223831, -148935, 34367, 94183, 43837, 40408, 57833, 82131, 132980, -6883, -163995, -188379, -256279, -220278, -121681, -115968, -163469, -174014, -177519, -100343, -17149, -72716, -52639, -93529, -138492, -161940, -171206, -157536, -151085, -153529, -182079, -155393, -151011, -138225, -149048, -175152, -216814, -119938, 5569, 46599, -36623, -143587, -71526, -78577, -232796, -355472, -393610, -358486, -400840, -398087, -167189, -112477, -88244, -89936, -133084, -220919, -278904, -201189, -73299, -49438, -148208, -122543, -143434, -61795, -69271, -155270, -129962, -126510, -116534, -117702, -154103, -254161, -219103, -165034, -221779, -212380, -23765, 13760, -50507, -13964, -3674, -46567, -75909, -91695, -33115, 92210, 63497, -119015, -153187]
24711a53187J22137J00890K6369j18626M7224k8804M2772p0226r4560J02008p3686
24700i7689j16540L1299O9052l5740L083r0435j11415R0103M4413p418J8645O0537
24688a42105O2435p2680q790M0250N8593N0715J40075P6375p1902j15414n8134
24677d0582p6383l6521j1274K33712O7491j13603j67847p8371J04199O8390L8437
24666a2352M1914q4649J4485m3730r9343o3075R979R9497l3393k1971L0288J14312
24654d8038L6558j5609m4063o9197r3460j28967M0106P9719m9724Q129J63302
24643a21244R0117k7832L7317M9030M2148K200o676p2890L2400o0397p4618J51127
24631D0682J28983N422r2609j10485K5306n8004j7076l2692K8051o537O4107J57241
$$ y = [-153187, -31050, 69840, 96209, -22417, 24807, -3997, 38775, -31451, -126011, -24003, -97689, -214229, -182930, -113878, -149618, -146535, -236970, -348385, -258282, -213869, -221287, -202642, -142105, -79670, -152350, -161140, -120890, -62297, -11582, 128493, 204868, 132966, 17552, -40582, -116965, -153486, -164760, 68952, 136443, 22840, -145007, -223378, -119179, -50789, -12352, 29562, -55087, -40602, -84332, -183675, -246750, -236771, -137274, -170667, -192638, -162350, -48038, -11480, -27089, -71152, -140349, -233809, -362776, -322670, -242951, -292675, -284546, -121244, -31127, -58959, -21642, 27388, 69536, 71736, 65060, -7830, 24570, -35827, -110445, 40682, 169665, 175087, 82478, -28007, -2701, -60705, -77781, -110473, -82422, -88959, -24852, 132389]
24619A32389j8833r6621Q568N0699L047n2448L1684K9605j4856l4539K8172j31973
24607f5106n3025P1002K219k9268O3303M702j49189j04381j5472L8043P4452P2311
24595i0409p8193o3057o3445J4157Q2356m5341K4383Q5826Q2335O3413M8071k0466
24583C9630k070j57580l2041L3507J46891R9533q4499J7555j0244j57360j04245
24572b10923j1482j1218N3628J09234m2539j28J6847o4020J05846J02607q5438
24561c7586o3460j3761j38074n5167J11778R6650J9176m7724p6617r9845O7275
24550b37355J08509N1316m8416K6690J6319M3763P064j8022J10508M6051j19558
24539a3131o9221p8528L5177O9629K2616k0415l0694K7212j50017O127r8287J19728
$$ y = [132389, 113556, 16935, 25503, 76202, 79249, 26801, 58485, 88090, 73234, 38695, 66867, -65106, -118131, -47129, -44910, -74178, -10875, -6173, -155362, -259743, -275215, -237172, -162720, -90409, -168602, -231659, -295104, -280947, -198591, -243932, -219549, -133723, -51388, 12025, 60096, 39630, 37560, -120020, -152061, -118554, 28337, 127870, 43371, 60926, 50682, -106678, -210923, -222405, -233623, -179995, -70761, -113300, -113428, -96581, -160601, -54755, 47852, -37586, -101046, -114807, -252881, -308048, -196270, -99620, -80444, -128168, -204785, -304630, -237355, -128846, -77530, -125946, -99256, -82937, -39174, -32110, -50132, 60376, 106427, -13131, -82352, -160880, -125703, -56074, -33458, -53873, -84567, -57355, -207372, -201245, -299532, -179804]
24527a79804n6725o8465R2409R9054J29677M3266Q8647K2075j52523j05253J42245
24516E4603R3884m1269j04338q3948K8665J4786l9615j23239J60850J09657r7698
24505b7662o3832N1590m2949r1597l280M1786L7876P1412L1416l8304P4241M9692
24493I0389p5358K2995m9512q4583r6243q7263L1881R2339L0552J40997l1529
24482a5335q6663L0063j7319j04092o250N9545L7937N587J11975J3253j2011j20948
24470a04258q164P7532n3875P7732k0544j29920j2574P6652M0223p3198Q6015
24459d4379L1844n1844n5525n9753j3229O1383m1500k8985p9084l8665N3679R2845
24447a73213J07223M399o8488j02383J1913K4173M200Q7657n650j04416p9827
$$ y = [-179804, -236529, -304994, -212585, -113531, 16146, 59412, 148059, 170134, 17611, -87642, 54603, 148487, 107218, 2880, -81068, -52403, -37617, -77232, -200471, -39621, 70036, -27662, -91494, -39904, -82853, -174450, -177730, -135944, -98068, -26656, 4760, -33544, 40697, 90389, 15031, 38026, -11486, -96069, -192312, -279575, -247694, -155355, -124803, 16194, -15335, -101998, -71935, -89254, -193346, -199596, -140051, -102114, -96527, 15448, 28701, 16690, -104258, -112422, -34890, -88765, -11033, -31577, -161497, -174071, -97419, -57196, -130394, -44379, -12535, -64379, -119904, -179657, -192886, -131503, -173003, -201988, -281072, -319737, -266058, -173213, -65990, -61591, -130079, -232462, -220549, -196376, -192176, -104519, -110169, -214585, -294412]
24436b94412R1014O2872K8284l2409l8655L8769j0774L5909k6854O2436p7485
24425a61305k6714j8462j18309j7087J76985J23827J0757m486P482L8674q4365
24414g3003j10946k4584J31889J14178q4110j97455K6294J85608p0847O488m6819
24403a43307J5761R674M9964J1726J51292k3238j90023j3604j9831P1664O2026
24392a7896p6442j4835M7871K8809M4750p0097k7637N8455M5319n2235j2628p2678
24380a19244r6402Q2488L8753P0385l0735l1437L1552J7249N295L2795J3030p3448
24368e9719r5648L1966o4169M5452q2934k6718M4625O2045l2088J4811j411m6728
24356b10516P0526K20111R486p1827l1416q5835l9571J6783j8829o0704k5715
$$ y = [-294412, -203398, -140526, -112242, -144651, -183306, -144537, -155311, -119402, -146256, -83820, -161305, -188019, -206481, -324790, -341877, -164892, -41065, -30308, -34794, -27312, 11362, -73003, -183949, -208533, -76644, 37534, -46576, -244031, -217737, -32129, -102976, -96488, -143307, -127546, -117872, -67908, -56182, 95110, 71872, -118151, -131755, -151586, -79922, -17896, -94338, -109173, -61302, -32493, 12257, -57840, -85477, -27022, 18297, -33938, -46566, -119244, -215646, -133158, -94405, -24020, -54755, -86192, -54640, -37391, -32096, 699, 13729, -59719, -155367, -123401, -187570, -142118, -225052, -251770, -207145, -145100, -177188, -162377, -163788, -210516, -139990, 80121, 89607, 17780, -13636, -99471, -139042, -122259, -141088, -201792, -227507]
24345b27507J10620K8261M8355j8356r3344j10784L5675j11886q5761J73259O6489
24334a84979L5517R242N7031L5576l2002m6527Q2549K5932l2915l0K4787j01052
24322a26871L1110Q8536p2108K9028J54601k1304q5764j37156m6911n5228j07958
24311c50025J00868J60092N804j8497j5813n3239p2500R232l4831L3912R5538
24300a39459O9483m2838L1443M8192J14180K7638o2541J5914l9001j7306n3293
24289d7588n4386M8761o39l881P8346m5111o5571m2930O2869O1368j48558O3825
24277i3495O8582O1239o940l840j02350q448J05806M0531P7202m3535k0160l2142
24265D2450J7352m8268l1185O1771k1286M0219L2079q1014j03795l9960N470k2334
$$ y = [-227507, -116887, -88626, -40271, -58627, -151971, -262755, -227080, -338966, -424727, -251468, -184979, -149462, -140220, -83189, -47613, -79615, -126142, -43593, -17661, -50576, -50606, -25819, -126871, -95761, -7225, -79333, -50305, 104296, 82992, -2772, -139928, -186839, -242067, -350025, -249157, -89065, -83261, -101758, -117571, -170810, -243310, -234078, -268909, -234997, -139459, -69976, -112814, -81371, -33179, 81001, 108639, 46098, 62012, 23011, 5705, -47588, -101974, -53213, -53852, -57733, 20613, -24498, -90069, -132999, -70130, -8762, -157320, -93495, -24913, 36326, 29386, 25546, -76804, -85252, 20554, 61085, 138287, 94752, 74592, 42450, 59802, 11534, -19651, 42120, 20834, 61053, 93132, 12118, -91677, -131637, -126167, -148501]
24253a48501k4927J5575o2037m2096N5512j4933k1199M6939J76675Q1416o5519
24242c095l0006p6806j03298l1157J28757n882K9316J8583K3139l6511q8579p21
24230a76260q3866J1056J9739q4901L5168K24259K4322j82479K0288J77398j8234
24219c3510p0513M317j00807N0720J62058m3496P927M2240L9539q543M368j60838
24207a06538L2221j5373k7722K7994K6314r0302L3758K5531p3197k5029l4557
24196b26900L4282J08082J5393P0998r9183J5376P5338O2951k2981o0117l5465
24185f2226k7178Q9921j13311o6103R3114p954o264K950j58705q1827J05302K8527
24173b03754J1242K7794m1801K0842J46604J29938k5305j01147m1798n3272k2231
$$ y = [-148501, -173428, -157853, -219890, -261986, -206474, -221407, -242606, -195667, -18992, 62424, -3095, -33101, -109907, -213205, -244362, -115605, -121487, -92171, -73588, -50449, -86960, -175539, -176260, -260126, -249070, -229331, -314232, -279064, -54805, -30483, -212962, -192674, -15276, -33510, -104023, -99706, -200513, -149793, 12265, -31231, -23304, 18936, 58475, 49932, 54300, -106538, -74317, -89690, -117412, -89418, -63104, -153406, -119648, -94117, -167314, -192343, -226900, -192618, -84536, -69143, 1855, -97328, -81952, -6614, 56337, 33356, -26761, -62226, -89404, 517, -112794, -178897, -85783, -93737, -100001, -97051, -255756, -337583, -232281, -203754, -192512, -164718, -206519, -185677, -39073, 90865, 65560, -35587, -77385, -130657, -152888]
24162a52888K5423M5226J31678l9410l9340l1957N5578L5585j09889j60785J31003
24151a09776J72969n616m230l3747j09422n5257M4553K5320o7429L4923q0086
24140a87798L8337L1781M407J40036M4461Q8795L3540j14109n7064q5126j41263
24129b04003j02040Q3972L5428R831Q9485M5355o8057q6838o0884l6823K8560
24118b66014K7476K2075N9998N9653K601L5434r6402J2283q4932k9153M5661N9731
24106a51589k4634K7472J29723O3174j31045r5276o0278L7223Q7142n5681R9292
24095g4477Q6002k5023L281O5056L2191j50q2867m4019n6608m601J1528P9572
24083a0115j35557r5125L9569R4738j0209j02379M004R3790m5210R3325J29243
$$ y = [-152888, -127465, -82239, 49439, 10029, -29311, -61268, -5690, 29895, -79994, -240779, -109776, 63193, 57577, 53347, 19600, -89822, -145079, -100526, -75206, -142635, -107712, -187798, -149461, -117680, -113273, 26763, 71224, 160019, 193559, 79450, 22386, -62740, -204003, -306043, -222071, -186643, -176812, -87327, -41972, -110029, -196867, -257751, -294574, -266014, -238538, -216463, -156465, -96812, -94211, -58777, -155179, -142896, -227828, -256981, -211320, -151589, -176223, -148751, -19028, 44146, -86899, -182175, -242453, -205230, -118088, -173769, -74477, 11525, -13498, -10217, 54839, 87030, 86880, 4013, -40006, -96614, -101215, -89687, -10115, -145672, -240797, -201228, -106490, -116699, -219078, -215074, -121284, -166494, -73169, 56074]
24072E6074j03171p2152j0529n2283o7456M1047J05908R0738M9471L7776q690
24061F6733q673L195o1562j9286Q893m0601J3578j17891j316R1065k8393J32737
24049C8479P3132m2043j2837r3043k06308m9115q307o971O2341J52555R9334Q1765
24037H8982M5329K6945j37352L2271m9777j2158j11681J87674K3820j52922N0227
24026h642o3528M3168L974q9420K496O3285J38029q6781n7445K88P680j0452O1816
24013D468m9756k4276K2586P0206j10312q2694k5319r0248n4951J32909J09593
24002i7794J11601L1867j17769k3601J31215j0122j30524R1169K4094j09328n7140
23991a56332j6309m7528L0711K2439k0115m3034J38187J00962J12950k6394r4997
$$ y = [56074, -47097, -119249, -129778, -182061, -249517, -208470, -102562, -11824, 37647, 75423, 66733, 58060, 61255, -307, -19593, -10700, -51301, -37723, -155614, -156930, -65865, -94258, 38479, 111611, 69568, 56731, -36312, -242620, -291735, -300042, -307013, -244672, -92117, 7217, 88982, 134311, 161256, 23904, 56175, 6398, -5760, -117441, 70233, 94053, -58869, -8642, -72170, -29002, -25028, -114448, -111952, -48667, 89362, 2581, -54864, -54576, -46896, -57348, 4468, -45288, -69564, -46978, 23228, -87084, -169778, -195097, -285345, -340296, -207387, -97794, 13807, 45674, -72095, -95696, 35519, 25397, -105127, -13958, 10136, -99192, -156332, -172641, -220169, -189458, -167019, -187134, -230168, -91981, 8981, 121931, 95537, 540]
23980E40p3994o3017J5047J3441K5945o5022n9281P2095J36757O5801M625J7107
23968I0044o0724j10434k5519l6619M5125L4337M668j8585j72960O448R6928J6901
23956a30390m8293q0187l024O1520R6877L9384l1179j5652M646j8008k9473M6692
23944a07087Q2372R256j7086l271n2489Q984J2559K6040m4670p579j7312j05841
23932b16124n9031O1P4784O3777m0482L9120O2567R0010p0614J11917L3595J9064
23920A08644m3162k9887r4213l0338j8868m6032m3110j1157q749L7976J09444
23909f9452o052j20069r6091P6186k6250P8030J32599J691K04K0695r5837j59021
23897b63367n0845O3868K8390q346o0238J12926K4888L2673l3656o584o0549M3716
$$ y = [540, -73454, -136471, -121424, -107983, -82038, -147060, -206341, -134246, 2511, 68312, 72937, 90044, 29320, -81114, -106633, -143252, -98127, -63790, -59122, -77707, -250667, -244219, -147291, -130390, -178683, -258870, -261894, -200374, -103497, -64113, -95292, -110944, -106298, -124306, -153779, -107087, -24715, -15459, -32545, -35816, -88305, -79321, -66762, -40722, -85392, -92971, -110283, -216124, -275155, -275094, -200310, -136533, -177015, -137895, -75328, 14682, -55932, 55985, 89580, 108644, 65482, 35595, -58618, -88956, -107824, -153856, -196966, -208123, -216872, -178896, -69452, -75504, -195573, -291664, -215478, -241728, -163698, -31099, -29408, -29204, -8509, -104346, -263367, -314212, -250344, -221954, -230300, -290538, -177612, -152724, -120051, -153707, -160291, -220840, -177124]
23885a77124o4902j42170p7515J52934P0020k9128R4837J150l0637l8036R1236
23874a49335m5708r6791N3967Q8251L465p550n8268J4918k071O6868n1426j98843
23862c82523q659J26193R0439M7637M4424O8604n2831l6614j2287l9571J00614
23851e4574L9440l4673j28842N2621K5832p9190p0703L8669O7856M7411m3276
23840a39429J6964J14435m4939j38613P9247R2111Q8048N8245R31J06590j36506
23829I7084j33038J787M670J4829m5162l1937n9078j8483Q2128J02144j1794r2324
23817h9174M4390p8461m5557J3431J06931J14904K3032j9993O4037o2003p5795
23806d258m0702l6464q2199n3545o9701K4517J39530j3143m3435r081N5732O6293
$$ y = [-177124, -242026, -384196, -461711, -308777, -238757, -267885, -173048, -171898, -202535, -240571, -149335, -195043, -291834, -237867, -149616, -146151, -153701, -211969, -197051, -199122, -132254, -183680, -382523, -391182, -264989, -174550, -126913, -82489, -13885, -66716, -103330, -115617, -155188, -54574, -15134, -49807, -178649, -126028, -100196, -179386, -250089, -211420, -143564, -96153, -139429, -122465, -8030, -52969, -191582, -112335, -20224, 67824, 126069, 127000, 233590, 97084, -35954, -34167, -29497, -14668, -59830, -91767, -150845, -169328, -87200, 14944, 3150, -89174, -44784, -123245, -168802, -155371, -48440, 66464, 89496, 69503, 133540, 71537, -4258, -44960, -81424, -163623, -217168, -286869, -262352, -122822, -135965, -179400, -188481, -132749, -66456]
23794f6456O8774J6362p8796N1119j3098m2767r7273o8597Q1042J74839L5762
23783F0911O788L1164j00972k9589R4042j27798j06225m056O6384J16192N8553
23772F5394P42r6930J2537P228q783j6120N8324N562k7108O463o2106M6645k0179
23759b8331j26327p9971R7200q191q028J30944j24801j18476K0853P0413J21967
23748e2748k9492j05778k3518L5262O7193J6545n5950j0331k8347K353O093P4623
23736a04095L5831k2702P5909k852N6155j08143l3257j20454M293J33919J33945
23725D8549m8434j10302o3747P4578J30166p2338q4982Q8864N693J01719n0299
23714A9467n0257l4285N4431j4525o445k2255n8358k1882j05536o7646J25247
$$ y = [-66456, 2318, 18680, -60116, -8997, -22095, -64862, -162135, -230732, -149690, 25149, 60911, 67699, 98863, -2109, -31698, 62344, -65454, -171679, -175735, -109351, 6841, 65394, 66136, -30794, -18257, -11029, -19812, -35932, 22392, 27954, 846, 7309, -54797, -8152, -28331, -154658, -234629, -137429, -145620, -153648, -22704, -147505, -265981, -245128, -174715, -52748, -82240, -188018, -211536, -176274, -109081, -92536, -148486, -158817, -187164, -184811, -178718, -104095, -68264, -90966, -15057, -17909, 38246, -69897, -103154, -223608, -219315, -85396, 48549, 115, -110187, -173934, -99356, 30810, -41528, -126510, -37646, -31953, 69766, 19467, -30790, -65075, -10644, -25169, -31614, -53869, -112227, -134109, -239645, -307291, -182044]
23703a82044K8293J5287p8715j9959J04036p514o7545n7267K3113J5638M4514
23692a82163j9600N344m738o3844j30230O4669k517J7308L4312P921J6887q697
23680b65348q132K09144P9891q4016J2441m6911l5051j9256n6946l8170J2219
23669b40135K4513J01609R0752P2318J02556J13482q9167j10550j18109j09854
23659a62585J5753J62236k1970o2107K3877q5623m0118M5459J64338L5127r3568
23648a9181K9438q0084j65784r3139J4420R3561J11559P7813K9840m6295m3646
23637i1498l2311L1517R164k7684J4782J5866Q706n485J26686l5485k3309L0864
23625B1813j42339q4349J15223r925m0742l6722L2747l4709l2326J51835j6849
$$ y = [-182044, -153751, -138464, -217179, -237138, -133102, -140616, -208161, -265428, -242315, -226677, -182163, -201763, -196419, -201157, -265001, -395231, -330562, -333079, -315771, -281459, -273538, -256651, -265348, -273480, -64336, 15555, -68461, -56020, -102931, -137982, -157238, -214184, -252354, -240135, -215622, -114013, -23261, 49057, 151613, 265095, 175928, 65378, -52731, -162585, -146832, 15404, -6566, -68673, -44796, -130419, -170537, -125078, 39260, 74387, -19181, 10257, -69827, -235611, -328750, -314330, -220769, -109210, -31397, -1557, -47852, -91498, -123809, -92292, -83128, -110812, -96030, -80164, -71458, -76943, 49743, 14258, -9051, 21813, -120526, -204875, -89652, -99577, -140319, -177041, -144294, -179003, -211329, -59494, -76343]
23614g6343l7164j854O4243r9219j36912N5261L4164M6000M6483J8965k1459p8241
23602a86076k0251K4619O1062M733k9738O4380N2847L7114j20828j83594l1728
23591c27460N2418K22910k2136j855O3155M7400j01067O024P02n992L2298K8970
23579d633n1162j4763N8750j15114J74285K5771n581N1774j82186n4119Q8063
23568b8915J429j13015R0125l6905K0751J12350j8874p5467O7475k9711k0178
23557c0935R7406l8090k8221j8592k752q0162j87668m486J01840J05625M8530
23546c7505L0598k8608k0505p5283m580Q0054K7282m1850m3888J3095O7181n154
23534c9163p2009M4760J45305K9816M7817R5374j9516j46302k19481j3320r753
$$ y = [-76343, -113507, -115361, -51118, -150337, -287249, -231988, -197824, -151824, -105341, -86376, -107835, -186076, -206327, -181708, -120646, -115913, -145651, -81271, -28424, 8690, -112138, -295732, -327460, -275042, -52132, -74268, -76123, -12968, 34432, -66635, -60611, -59909, -65901, -33603, -4633, -55795, -70558, -11808, -126922, 47363, 73134, 67553, 119327, -62859, -116978, -28915, -27486, -140501, -50376, -87281, -66530, 45820, 26946, -48521, 18954, -10757, -30935, 66471, 28381, 160, -18432, -21184, -101346, -289014, -293500, -191660, -86035, -37505, -6907, -35515, -56020, -131303, -135883, -55829, -28547, -70397, -114285, -101190, -34009, -39163, -111172, -66412, 78893, 108709, 156526, 251900, 232384, 86082, -133399, -146719, -156472]
23523a56472M2575m4728J5189M5651l3444o6726j4032M0434M4904n115J01051
23512c0713K7090r0176p5049m1994O1212p0282o5496N8726j4704k7341J23028
23501a45699O1689j0784J18231P3226o4677k3151J3367j806j05094j00029O3732
23490a20995J8650R3808K9149J23304o1365M5482l9106q0244N012l7185k0186
23479d3676r0255k8631j9287K5032J00547m2064r4592L0409P5616J47124R9180
23468A59403j53079L2090k6878j34085Q8293P4059R6417J9772n9863n1307j14998
23457g0176K126J9371q2517l7132J5355L1965J4117M1253k4407j12940m5075M1237
23445b06823O7688J7443M9279J8797N8309j8390j22824J647j03033M6538k3094
$$ y = [-156472, -113897, -158625, -143436, -97785, -131229, -197955, -211987, -171553, -126649, -131764, -30713, -3623, -93799, -168848, -210842, -149630, -219912, -285408, -226682, -241386, -268727, -145699, -84010, -94794, 23437, 96663, 31986, 8835, 22202, 20396, -84698, -184727, -120995, -102345, -8537, 20612, 143916, 82551, 128033, 88927, 8683, 13695, -23490, -43676, -133931, -162562, -181849, -156817, -56270, -98334, -192926, -162517, -86901, 60223, 159403, 6324, 38414, 11536, -122549, -34256, 39803, 136220, 155992, 96129, 44822, -70176, -68050, -48679, -131196, -168328, -152973, -121008, -106891, -65638, -90045, -202985, -248060, -206823, -139135, -121692, -72413, -53616, 4693, -13697, -136521, -134874, -237907, -191369, -214463]
23434b14463Q7571J2902k00535N5035J27435l558j30943n5225P8403L2893J768
23423b08717J70734N0167J6813j51074j67586M583P8641L837p0386N2004J52674
23412f8310J4002q0071K4492P1931k9533j28439N473Q1685J0913n0821K6325O1597
23400f0756Q3491r6950j17783K6068k0395q122j2465N4315K2696M9664M0808R368
23388c0061j9815L440m9720K5179J51897o8108k17570M6713J18966l3674J05571
23377C2818K5015j23257q4191k097N1783n013o0723n049K089M3448P3312m125
23365e5990M9310j19866R448O7342M0928j33428m9647J22819J8351j27845j16595
23354b95173j03035K3312K27242J03784R233O5197m5925j7570k5068J6857o2598
$$ y = [-214463, -126892, -113990, -314525, -259490, -132055, -135613, -266556, -321781, -243378, -210485, -208717, -37983, 12184, 28997, -122077, -289663, -285080, -206439, -202602, -272988, -220984, -68310, -54308, -134379, -109887, -37956, -67489, -195928, -190455, -108770, -97857, -148678, -122353, -60756, 22735, -74215, -191998, -165930, -186325, -194447, -206912, -152597, -129901, -80237, -39429, -30061, -49876, -46436, -96156, -70977, 80920, 12812, -204758, -158045, -39079, -72753, 32818, 57833, -65424, -149615, -151712, -99929, -104942, -165665, -170714, -168625, -125177, -51865, -55990, -6680, -126546, -117098, -49756, -8828, -142256, -191903, -69084, -50733, -178578, -295173, -398208, -374896, -147654, -43870, -34637, 30560, -15365, -32935, -58003, -41146, -103744]
23343a03744n3625n6503K5571J80176P2181j9995k7247J9949r2964j09872J4668
23332a51405k2320M6410J1801K3117p0895o6114M8421J37444L8591j28411o5657
23321a99018J18771O4237o0828L2129N3555l6898J1292M6226m4629j87315Q378
23310a94100J04762l4680Q7994J06011j27532j06388q2338q5346J6564P7140J7146
23299b20767L8652K4809R7014J40051p2527j58176K1236O3722J80065J6370n9140
23288G1309K437j9777l8960O9818P3807m200p1305r0141j21349r6259N1030R3300
23276h0290N9280o8897K1591L3117J3686p5120k2668n1564l4089J8195m3789m5686
23264b76234O1502L4930n0126j11144O3936O9424O3153n3228j13991l0736N5728
$$ y = [-103744, -157369, -213872, -188301, -8125, 64056, 44061, 16814, 36763, -56201, -166073, -151405, -173725, -127315, -115514, -92397, -163292, -229406, -180985, -43541, -4950, -133361, -199018, -80247, -16010, -76838, -44709, 8846, -28052, -16760, 29466, -15163, -202478, -194100, -89338, -124018, -36024, 69987, -57545, -163933, -246271, -331617, -315053, -237913, -220767, -182115, -157306, -60292, 79759, 7232, -150944, -129708, -65986, 114079, 130449, 71309, 73746, 53969, 15009, 84827, 158634, 154434, 83129, -7012, -128361, -224620, -173590, -80290, -21010, -89907, -68316, -35199, -21513, -96633, -119301, -170865, -204954, -186759, -230548, -276234, -214732, -179802, -229928, -341072, -277136, -207712, -144559, -197787, -311778, -342514, -286786]
23253b86786O6373O8168J7904j7805p6028N0115P3752M6276k3798n4038q3250
23242b19117p4881J5368O2299J75734j6637n1216M6013L4695M6172Q121j00767
23231g4216q3469k6935J00066m4831r7944M2507L5314k1040Q6591J12410O1818
23220I0271n7518m1258p8643n3222n625L0842K9114L2463Q5042k9691n7208p6141
23208a31574J8618l6229m257J01053j13364r9488J3096O4190n2607j08680O6538
23197b82704J00481J13946p155j0425K3733J7881K0185l2138k5631l4700j7664
23186a34191J83306k1267K395j4539j5967o408j17087n5636O3699K7241O9197
23175a9257j4804l5252M2361O7565K3862Q411q7890j24230o3528J64003O9914
$$ y = [-286786, -220413, -152245, -134341, -152146, -228174, -178059, -104307, -58031, -81829, -135867, -219117, -293998, -278630, -216331, -40597, -57234, -108450, -62437, -27742, 18430, 26551, -74216, -157685, -184620, -84554, -129385, -227329, -184822, -149508, -170548, -83957, 28453, 90271, 32753, -8505, -87148, -140370, -145995, -115153, -86039, -53576, 31466, 1775, -55433, -131574, -112956, -149185, -153442, -52389, -165753, -265241, -252145, -187955, -240562, -349242, -282704, -182223, -68277, -75432, -85857, -62124, -44243, -24058, -56196, -81827, -116527, -134191, 49115, 27848, 30243, 15704, -263, -6671, -123758, -179394, -115695, -88454, -19257, -34061, -69313, -26952, 40613, 64475, 72886, -15004, -139234, -202762, -38759, 31155]
23164C1155j3247j3960n7467m3610k9963l8223q7043J35609J07286J506m719l9746
23152e2422J17977K2463o5263j14067O6418m4613l2205o1879j2430L3245m9553
23141a92329q7416K5943L0952R5354R0692p4400o9920J00375L7622p1415K5254
23130h9288K7679J1430l5719O1436Q961L0793J57379n5400j03713j09807r5744
23119a91993L027J16597n3999o0965J4423l2890J36665Q5097O2379j08301j26600
23108a56560k8042L0071K3707Q3367l2111p3970N7697J35381k7690P1225j44192
23097f1117j6814L9707L6983j50048n0222M2865p2159N4342P7321J7176k7577
23086a09543O0379m7657q5784L8693Q3967o9580J4200M4838O4311O6618r3327
$$ y = [31155, 17908, 3948, -53519, -97129, -127092, -165315, -252358, -116749, -9463, -7957, -12676, -52422, 65555, 88018, 22755, -91312, -24894, -69507, -101712, -163591, -176021, -142776, -192329, -279745, -253802, -222850, -127496, -36804, -111204, -181124, -80749, -43127, -114542, -89288, -61609, -50179, -85898, -24462, -15501, 15292, 172671, 117271, 13558, -96249, -191993, -188966, -72369, -126368, -187333, -172910, -205800, -69135, 15962, 78341, -29960, -156560, -184602, -154531, -130824, -47457, -79568, -153538, -95841, 39540, 11850, 83075, -61117, -77931, -38224, -1241, -151289, -201511, -158646, -230805, -176463, -99142, -81966, -109543, -49164, -96821, -182605, -143912, -59945, -129525, -115325, -70487, -6176, 60442, -32885]
23075c2885l9668M4218j4536j2253p4752j9668j041M0707l2064Q7856L927r4630
23063a44789J59J7354J40257K8531o8586m3354j16272Q4739M1125Q0133J19273
23052A38570l9416j64976k8693l9005J6862k5258k545M8116P9494m13J005j9336
23040c5595l4093r1452P4237P788n5934q1546J8833J57696J57278r8281j36757
23029a17826r8017P244K4829j03193p2179J41341N3090J7050k1447k8904R9638
23018i8374J6227r8326q6089m522J42195J24820l4449M7765L7170n0002L2657
23007B9072o8686k7415M1267n1931r8521J3128J2609J0354j2792p7679R6501K7726
22995a06367M2071j5722k0215k9621j4126L1673J62242J32948l822m5821j66407
$$ y = [-32885, -72553, -28335, -42871, -55124, -129876, -149544, -150585, -109878, -141942, -54086, -50159, -144789, -144630, -127276, 12981, 41512, -27074, -70428, -186700, -101961, -60836, 19297, 138570, 99154, -65822, -94515, -133520, -116658, -141916, -144461, -96345, -16851, -17264, -16259, -35595, -69688, -161140, -86903, -79115, -135049, -216595, -197762, -40066, 117212, 18931, -117826, -215843, -208599, -183770, -286963, -359142, -217801, -164711, -147661, -169108, -198012, -98374, -82147, -180473, -266562, -271084, -128889, -4069, -38518, 9247, 46417, -3585, 29072, -39614, -67029, -25762, -77693, -176214, -163086, -150477, -140123, -152915, -230594, -134093, -106367, -64296, -80018, -100233, -129854, -143980, -112307, 49935, 182883, 179061, 133240, -33167]
22984c3167o9540L6454r5835j30737o9953R3680P5798J03824J9234j2463Q4537
22973A832O8378K1573m6820O646j1963J9572l6575j35204q2540O7332P6036R8697
22961D6964P8576j7310m0307l2851m4913q5583N6771Q9742J3475j12414n8113
22950a05963k2135r2694L0096j0685l8843k2131J04915J16068J111n7438M315
22939i3384K9861J08843Q4537J5722L3128m8735l3588k5343o6753O3235L3799
22928A01322k08662r6661L1815k2861l9825r743l8547J17087J82624R6975L746
22917A17270q1128j42038K517r0584o7135m0520M772O2709n3180o9810J37322
22906b19805J68287J10070N4182k0937J261r6817j01034q4053n2889J07392J14469
$$ y = [-33167, -102707, -66253, -162088, -292825, -362778, -269098, -193300, -89476, -70242, -82705, 1832, 70210, 91783, 44963, 51609, 39646, 59218, 22643, -112561, -195101, -127769, -51733, 46964, 125540, 108230, 67923, 35072, -9841, -95424, -38653, 51089, 64564, -47850, -105963, -128098, -220792, -190696, -201381, -240224, -262355, -157440, -41372, -40261, -97699, -93384, -63523, 45320, 129857, 145579, 178707, 129972, 96384, 71041, 4288, 67523, 101322, -107340, -204001, -172186, -195047, -234872, -244615, -283162, -166075, 16549, 113524, 117270, 36142, -105896, -103379, -193963, -261098, -301618, -296846, -234137, -287317, -357127, -219805, -51518, 58552, 112734, 91797, 93058, -3759, -104793, -188846, -241735, -134343, -19874]
22895a9874P8015M1366N5717j5281l2619q507j5077j45040p1899J3461J3265q0897
22883a87370q8095R0561J21889O328k0090L7169P9936J8469J2242L1793K8714
22872A31546n8714k9741L090l8698n0925J9402J37256k2786m733n932j19069n6654
22860i5958N4122J32326L9594l6035L1428k2179n7140r9739p0723m3473o6735
22849b34512j3695L7347O5283O2724J02743r3112p2326M9896J84393n857j994
22838H0890m0464K074o5951p1704L4185R0500n6634r6599q6252M3046K8314Q6796
22826e1799L8947j02952j02670J0747O1849J37846R1553p0001l8835o4811o4086
22815a54212J03006L428k270L9815J09480P6329O7163k2231j38721j25055k998
$$ y = [-19874, 58141, 99507, 155224, 139943, 107324, 98817, 83740, -61300, -133199, -119738, -106473, -187370, -275465, -184904, -63015, -56687, -76777, -39608, 40328, 58797, 71039, 102832, 131546, 72832, 43091, 46181, 7483, -43442, -24040, 113216, 90430, 85697, 79765, -39304, -95958, -41836, 90490, 130084, 94049, 125477, 103298, 46158, -53581, -124304, -167777, -234512, -248207, -210860, -145577, -82853, 19890, -73222, -145548, -95652, 88741, 82884, 80890, 40426, 42500, -23451, -95155, -60970, 29530, -27104, -123703, -209955, -166909, -138595, -51799, -12852, -115804, -218474, -207727, -145878, -8032, 83521, 13520, -25315, -90126, -154212, -51206, -47778, -50048, -10233, 99247, 175576, 242739, 220508, 81787, -43268, -46266]
22804d6266K0657k0074l6229q0646M219j9113O0973N1077p0133k8543j9287l524
22792a86889N8424J61927L9669j7503k3748j2441o6467m3516N8918R538n020n7071
22780h4179P9992N1310P3167o324L7938j14782j07783q0810P8708k4948k1836
22769a19547j4957O9890Q5297m1336P0664K0506j07780K1879Q4702K5069L638
22758I8025j08338k7164R641q67j31168J8972m4423k2462O8907M3740n8046K6210
22746a26973K4929p821m6166J7362J81819j3464n7150J03595o3867j45871k8574
22735a62181l6001n3313J18325L1100J11097K8774L764o8795o2095J86657J46809
22724B44141l3604k2385r9661j14847o0573j01601J5366R0137L3659j46627l0402
$$ y = [-46266, -25609, -45683, -81912, -162558, -158339, -177452, -116479, -65402, -135535, -164078, -183365, -186889, -128465, 33462, 73131, 55628, 31880, 19439, -47028, -90544, -31626, -22088, -27108, -84179, -4187, 47123, 120290, 113966, 151904, 37122, -70661, -151471, -72763, -97711, -119547, -134504, -64614, 20683, -20653, 50011, 70517, -37263, -15384, 69318, 94387, 98025, -10313, -37477, -27836, -28703, -159871, -140899, -185322, -207784, -138877, -95137, -153183, -126973, -102044, -109865, -156031, -138669, 43150, 29686, -27464, 76131, 12264, -133607, -162181, -198182, -251495, -133170, -102070, 9027, 37801, 41565, -27230, -89325, 97332, 244141, 210537, 188152, 88491, -26356, -86929, -188530, -173164, -83027, -49368, -195995, -226397]
22713b26397Q6614l0203J42266R1997n4236r0944p945P368K9897M7774L20j653
22701e142l7742o9095j03303J19467j1966p3128M0946M6902m286j10360j14842
22690c22549L4190N4548m32m7263J60698O388n4819o8514J9013R369J01469Q4864
22678b3038p8031P831R4756Q4472k7219p7484J03751R9330p1686j41270m8784
22667g7372L0503l0301k4880O7608j00797j14522M4408J20711L0081N0807J33947
22656A30193o559k7247k0489j76676M961J16822n5051r4999j00749l8907j8693
22645b87394J41428J02679M8194l3058N3035J24875J02205p3593j48122K0949
22635E1198p9350j49054l2713J3560q0866P7647O8340J67510q172p5466j0105
$$ y = [-226397, -139783, -169986, -27720, 64277, 10041, -80903, -88848, -81480, -51583, -3809, -3489, -5142, -42884, -111979, -215282, -95815, -107781, -180909, -139963, -93061, -97347, -207707, -322549, -288359, -233811, -234243, -281506, -120808, -114420, -169239, -237753, -218740, -209371, -107902, -23038, -101069, -93238, 1518, 85990, 58771, -18713, 85038, 184368, 112682, -28588, -77372, -46869, -77170, -102050, -34442, -135239, -249761, -205353, -84642, -54561, -3754, 130193, 123634, 96387, 75898, -100778, -95817, 21005, -34046, -129045, -229794, -268701, -287394, -145966, -43287, 4907, -28151, 24884, 149759, 251964, 178371, 30249, 51198, -28152, -177206, -209919, -196359, -277225, -199578, -131238, 36272, 28100, -47366, -57471]
22624e7471m5427j00223J96107K2867o4575J15272K3690j37178r8779P2949N0362
22613b2406L8202L6455o2273L0379o242o7481L4653O9636q8606k4522L162J07897
22601D8854J18453q9571l9072N9583m5758j10060K5057L2477q8757K2323N4O7464
22589A047j7564j00549L3159J50153r2788j465J16908o8536N4454o787l751j03316
22577c9035P2212l8986j10395M9904P5335O0000k9501P21J61888J30655j90602
22566A42196j58572P2603m008n156J8195j39330l6159Q1818Q9260N2078p4654
22555C8271q9528p03N035L8763j1237P7017O8759O1666l0275m5163p9728j9260
22543A3617N7254l8580r5114J513M4118p4718r0208o3613q874O7087P7109M2065
$$ y = [-57471, -102898, -203121, -7014, 15853, -48722, 66550, 90240, -46938, -145717, -72768, -22406, 15796, 52251, -10022, 20357, 14115, -53366, -18713, 50923, -37683, -62205, -59043, 48854, 167307, 77736, 38664, 98247, 52489, -57571, -32514, -37, -88794, -66471, -66417, 1047, -16517, -117066, -83907, 66246, -26542, -28007, 88901, 20365, 74819, 68032, 64281, -39035, 33177, -5809, -116204, -66300, 9035, 69035, 39534, 40255, 202143, 332798, 142196, -16376, 56227, 52219, 47063, 65258, -74072, -110231, -28413, 60847, 112925, 38271, -51257, -51960, -46925, -8162, -19399, 57618, 126377, 188043, 157768, 112605, 32877, 13617, 70871, 32291, -62823, -61310, -17192, -91910, -182118, -245731, -254605, -187518, -110409, -68344]
22531f8344k9323r6363p8496O6677J13610N7895q2694r0629j09558O7387J33029
22520a16809P2039q0181j33011R1630J26758L6922j2547M08r8643j27824P7175
22509a64083O7795o1497O9789J73119n6443j05384p1567K5631J77609L5656j60734
22498g0109l8749K7575m923M6887n0308k027R4444Q2545p6307j16678N0341J62569
22486A05260O711K1918o3884k23694L8784K13970Q8980j70300j17982j5004m5586
22475a60827R625m8595l7349j1720J7180L9878p5039Q6206O9861J7655R3849J6208
22463A6932k4886L3239j3600m1051O3213J9348l4113l9685J7119j24987r075P5114
22451f2432L4581p8081l7912N2803J3489Q3442K7552J4124k2598M4706o0092j2105
$$ y = [-68344, -97667, -194030, -272526, -205849, -92239, -34344, -117038, -207667, -317225, -249838, -116809, -44770, -124951, -257962, -166332, -39574, -2652, -15199, -14791, -113434, -241258, -164083, -96288, -157785, -87996, 85123, 28680, -76704, -148271, -122640, 54969, 90625, -70109, -108858, -81283, -86206, -39319, -89627, -91654, 2790, 85335, 9028, -107650, -57309, 105260, 111971, 133889, 70005, -153689, -114905, 99065, 188045, 17745, -100237, -115241, -160827, -151202, -199797, -237146, -248866, -231686, -191808, -266847, -180641, -110780, -93125, 724, 16932, -7954, 25285, 11685, -29366, 33847, 53195, 19082, -20603, -3484, -128471, -137546, -62432, -27851, -105932, -143844, -91041, -77552, 5890, 33442, 47566, 24968, 69674, 9582, -2523]
22439b523K9106q6054N2092L9767k334k1523M187J56328j23022m6654M8823p4321
22427b6128Q3880L2684r5235m8652J9722M2859j3010M5359j12272j69927j4163
22416b54883J85193J19068M8987j13424m1888p0845q4666J05079J34255J13668
22406A40544L1821j36209r0801J7422P1091R5564q891j27103l7783k7972l9475
22395a11792j06216j1265J376J9688L1498J5219K4665M1329l1557Q2451M5640
22384A036n7174j8031J4745j10555j5171r5348J05911N1639o5045N9973l8334
22373a66354M2352J08428K4709M0631j84j18514j5168k241n4066K6233j4867M0885
22361h8156O2434M2758L0121N4405p5447J9905L2452N7692m3115l1723l4318J26674
$$ y = [-2523, 26583, -59471, -7379, 32388, 30054, 8531, 12718, 169046, 46024, -630, 48193, -26128, 57752, 90436, -4799, -53451, -33729, 9130, -3880, 41479, -70793, -240720, -254883, -69690, 49378, 98365, -15059, -56947, -127792, -212458, -107379, 26876, 140544, 172365, 36156, -54645, -37223, 33868, 129432, 120541, -6562, -44345, -72317, -111792, -218008, -229273, -227897, -208209, -176711, -161492, -136827, -95498, -127055, -44604, 1036, -56138, -74169, -59424, -169979, -185150, -280498, -174587, -122948, -187993, -128020, -166354, -124002, -15574, 9135, 49766, 49582, -68932, -84100, -86341, -140407, -114174, -129041, -88156, -25722, 17036, 47157, 101562, 26115, 46020, 78472, 136164, 93049, 61326, 27008, 153682]
22349A53682K0195l5720K7101q0360k815o0388N5583M5961m4347j27260O8375
22338B0007J24267R7334l4401n5239p9431r5223j5867J0256L9562L7462L6991
22327H5718l7390O6228J5552l3608q7745n1389q2601j4214M2796L9559j7538n5259
22315a29891J6421O9371q8921l556k4471Q020P4024K1743L7801K710r2848q818
22303a18415M3726R2399M803p8170k8455K9476J53232m4761o3634M2464P3673
22292A06338L6221J719l8424P05N5768k4926M9718r267J3927O0452m1358l8555
22280A72318J7419j3032m2179o0943k0743m349k9043M0166Q4194j32089M1720
22269E3439J30743N3159j42442j20826J3949M4065J7209J06759J7608L0301j1416
$$ y = [153682, 173877, 138157, 165258, 84898, 82083, 21695, 77278, 123239, 78892, -48368, 20007, 144274, 241608, 207207, 151968, 72537, -22686, -38553, -28297, 11265, 48727, 85718, 48328, 114556, 130108, 96500, 8755, -42634, -125235, -139449, -96653, -57094, -74632, -129891, -113470, -44099, -133020, -136576, -161047, -153027, -79003, -57260, -19459, -16749, -109597, -118415, -74689, 17710, 22513, -55657, -84112, -54636, 98596, 53835, -9799, 32665, 106338, 142559, 144278, 105854, 106559, 162327, 137401, 187119, 177852, 191779, 252231, 210873, 172318, 189737, 176705, 134526, 73583, 52840, 48491, 19448, 59614, 143808, 11719, 53439, 184182, 237341, 94899, -25927, -11978, 32087, 49296, 156055, 173663, 203964, 192548]
22258A92548r5592J2819R0648K1873L0395o7405j47851k8420M3814p3725j48972
22247a69868P0321K84996O2993j4427n4450p5035q0889q9190k684O7803J4971
22236A4541L4291o2922K9613j1299k4929L5466j4197L1582n6700l8448M4933K9674
22224A1605j46274j32339K7846O3435k9889N8548J68469J1786Q6120j758L4075
22213A51624R5636M4572j08961j04272M2622o7614j52611p5154Q5959J33171O2144
22202A07116o5194k7787M3702O1325r133p186k18613q9927R045J27451J21139
22191E1938K9184q1896r8049Q6150M5772Q2184O1968j7821K3793J00497J2164
22180B95884p5843M4247j04266j91847n7797M5365J8541m2682M5817N340j3993
$$ y = [192548, 96956, 109775, 200423, 222296, 252691, 185286, 37435, 9015, 52829, -20896, -169868, -99547, 185449, 248442, 234015, 179565, 104530, 23641, -65549, -68233, -430, 14541, 48832, -14090, 15523, 4224, -20705, 14761, 564, 32146, -24554, -63002, -18069, 11605, -134669, -267008, -239162, -175727, -205616, -147068, 21401, 33187, 119307, 117549, 151624, 247260, 291832, 182871, 78599, 121221, 53607, -99004, -174158, -88199, 44972, 107116, 41922, 14135, 57837, 119162, 110029, 102843, -115770, -205697, -196652, -69201, 51938, 81122, -774, -98823, -12673, 33099, 115283, 177251, 159430, 183223, 283720, 295884, 220041, 264288, 160022, -31825, -89622, -44257, -25716, -68398, -22581, -17241, -31234]
22169c1234R053L1462N2477N8656N1887r5623k40148L5569j5272j47293J5086
22158b75380L8994K4652J54529O9033m8614m5856j00282p4203K3661J47632J9685
22147f6149n7430o0303J51582K8453L7590P1236M9940o895j6460l7082j12953
22136a8471O6992J75479L0960j37781M3138R7731n6738j10324Q4554Q9127p5505
22125A89162j243N6917K0786r3575o1811K0091j2329l1521P6425J64418q187p5289
22113B43844q5009j14189n5996O4448N320P2978O3828j18640q3831M997k2660
22102b4910N5930L8872p3014o2999J07918Q0444J2265J42608P4886q7167j28206
22091A36627l8997J19616P9009J52055R9219J15449L11797M10173M87418O11890
$$ y = [-31234, -22181, 9281, 61758, 120414, 172301, 76678, -163470, -127901, -143173, -290466, -275380, -236386, -211734, -57205, 11828, -36786, -82642, -182924, -257127, -233466, -85834, -66149, -123579, -183882, -32300, -3847, 33743, 104979, 154919, 148024, 131564, 94482, -18471, 48521, 224000, 254960, 117179, 160317, 258048, 201310, 90986, 175540, 264667, 189162, 187919, 244836, 265622, 172047, 110236, 130327, 117998, 86477, 162902, 327320, 319133, 243844, 158835, 44646, -11350, 53098, 58418, 131396, 195224, 76584, -7247, -2250, -24910, 31020, 69892, -3122, -66121, 41797, 122241, 134506, 277114, 352000, 264833, 136627, 97630, 217246, 296255, 448310, 547529, 662978, 974775, 1384948, 1872366, 2484256]
22081B484256M80939R5044n6485R1020P4026l67992n07462l73753l05826k74052
22071A339715l13706j41181r9579j84701n0986m936j16970P7906M5147O4137K8203
22060F43049r0234q8218J5373n5864o6947k4941p2813n279O09m8865m2826K0267
22048A83311J21p0195P4335j2366O166P887K2423P2894Q2508j25866p6430n3500
22036A11288q2850l9624N2816P5874k8358O055l0252J6800m8608j29455j48085
22025b44399n2365J79193K35723L856k3828j8547n2797k0873k0398L4485P8175
22014I8225M7231P715j45019J5694J18719j092j11420j07985M6727J09574p1999
22003F370o9110L5227M7900K7889q4892n6889P9440J55865K7571r0078j57639
$$ y = [2484256, 2965195, 3060239, 3003754, 3094774, 3168800, 2800808, 2293346, 1919593, 1613767, 1339715, 1026009, 884828, 785249, 600548, 549562, 544626, 427656, 505562, 550709, 614846, 643049, 552815, 464597, 479970, 424106, 357159, 332218, 259405, 254126, 254735, 205870, 163044, 183311, 183432, 113237, 187572, 175206, 181372, 189259, 211682, 284576, 367084, 241218, 164788, 111288, 28438, -11186, 41630, 117504, 89146, 95201, 64949, 81749, 33141, -96314, -244399, -296764, -117571, 118152, 122008, 98180, 79633, 26836, 5963, -14435, 20050, 98225, 145456, 153171, 8152, 23846, 142565, 141473, 30053, -77932, -31205, 78369, 6370, -62740, -27513, 20387, 48276, -36616, -93505, -14065, 141800, 169371, 79293, -78346]
21992g8346m495j4041J42234M3181M15Q8298o5172n7710N7294j50583l783m7406
21980i0114n816K1908O6319k2006N8593R6293J8877L917p4483k5167Q6896K8066
21968A63283q2392Q546K6726L5760q6506n214Q7766Q6073j2035l3631k4734n4448
21956A09194o3054j28021m626Q1595P7397M0472j5861K295O5668K4401j05468
21945H3992j04404K6710R2574p568K6330j6747n3859q0659J07542R1760j16311
21934D9360m6219M0026p5788m4324O8141J18494R3010O2100m6998j28799o1234
21923B7769Q8767K5692m2212j4912j734j6496q1017l0317O9492K8208J37327K4147
21911B14714n4716m4435k7857n396M0406K3692k4883p9611j19263O1587K6331
$$ y = [-78346, -82841, -96882, 45352, 88533, 88948, 177246, 112074, 54364, 111658, -38925, -42708, -90114, -95930, -74022, -7703, -29709, 28884, 125177, 144054, 147971, 73488, 48321, 135217, 163283, 80891, 89437, 116163, 151923, 65417, 60203, 147969, 234042, 222007, 188376, 163642, 109194, 46140, -81881, -86507, -4912, 72485, 112957, 97096, 99391, 165059, 189460, 83992, -20412, 6298, 98872, 91304, 117634, 100887, 47028, -33631, 73911, 165671, 49360, 3141, 43167, -32621, -76945, -8804, 109690, 202700, 264800, 217802, 89003, 27769, 116536, 142228, 100016, 85104, 83370, 66874, -14143, -44460, 25032, 53240, 190567, 214714, 159998, 115563, 87706, 82310, 122716, 146408, 121525, 41914, -77349, -15762, 10569]
21900A0569M4963N1648N9234L4228P5973k13291j52242o457J75694J51789L6220
21889B68328Q304j6772o7368K5536L2573j03051R35j0275n9311m0625j4486j7977
21877E811l6541J8939k6725r7467Q6015l495k1708J15931J51759M6251j24198
21866A14572j12473n4410q025o5633L3022R5405P2800N6692q5532L862N6195M375
21854A10850K408R9875O2741o5382o6407J2473j5964r5959k7679M8648j1725m7327
21842F552m9215m8582r2838q0231L4957Q5454J33316N4163n0281l1545J4538R0982
21830F7270K49991J5051r2282l3840n2644L3151O5907q3279N5942Q4847j8575
21819B91539k1461p6474k7239K3436K7631o1585o3367O9168L5934K2632l0652
$$ y = [10569, 55532, 107180, 166414, 200642, 276615, 63324, -88918, -95375, 80319, 232108, 268328, 276632, 259860, 192492, 218028, 250601, 147550, 148485, 138210, 78899, 38274, 23788, 5811, -30730, -11791, -38516, -135983, -49968, -53463, -75171, 40760, 192519, 238770, 114572, 2099, -52311, -60336, -125969, -92947, 2458, 75258, 131950, 46418, 50280, 106475, 110850, 113258, 213133, 275874, 210492, 144085, 156558, 140594, 44635, 16956, 65604, 53879, 6552, -42663, -91245, -184083, -264314, -229357, -143903, -10587, 43576, -6705, -38250, -23712, 67270, 317261, 332312, 240030, 206190, 153546, 186697, 252604, 169325, 225267, 310114, 291539, 270078, 193604, 166365, 189801, 217432, 155847, 92480, 161648, 197582, 220214, 189562]
21808A89562J20675k8211o9032r2697l2526J508l1260K1434Q7618k5211j01175
21797D0685m4065j680k0002J06944K8648L5486j0355M6552Q4624k5284n0436J6592
21785B07709j7750L8187j7048j2840o4543m6435q2172j811k7119q182J42335Q2802
21773A93133k6775O6062J954j5989m1029l483R4943N2955p6808l1502K393p1149
21761A44705p2464j29110m6827J02870J86180J8464j75029n8908k2810J07846
21751E4917K1100j09564l876J27496L8394N8040J6133j41557o7200l1476K0254
21740a7339q5801k7399M124J41262p0123J30295R1682M9598k9937j2437Q8374
21729B62299j03639n0189L0327o4865n2339J60161N3297l48l1451l4670J5327
$$ y = [189562, 310237, 282026, 212994, 120297, 87771, 89279, 58019, 79453, 167071, 141860, 40685, -3380, -5060, -25062, 81882, 110530, 146016, 135661, 182213, 266837, 241553, 191117, 207709, 189959, 228146, 211098, 198258, 133715, 87280, 5108, 3297, -23822, -32004, 110331, 193133, 166358, 232420, 234374, 218385, 177356, 173873, 268816, 321771, 244963, 213461, 215854, 144705, 72241, -56869, -103696, -826, 185354, 203818, 28789, -30119, -52929, 54917, 76017, -33547, -37423, 90073, 128467, 186507, 202640, 61083, -6117, -37593, -17339, -103140, -130539, -126415, 14847, -55276, 75019, 166701, 216299, 186362, 173925, 262299, 158660, 108471, 138798, 73933, 21594, 181755, 235052, 234704, 203253, 168583, 183910]
21718A83910P2571P8411j13209l4245K0747n57K8364l5357J24080J21053p2839
21707C72929j07267p5733J02939Q6035p0560n9857k1515M9975J48536J80159J07768
21696G13409o5618r699o1972n6396P1105J48972M9697J4621o890j91212j36206
21685D69811j05344n2922k0105O610r9946M087l7788J1336L3106J13698J10830
21674D33373P274L0115K759j56344n6784O1370o206j45195K5727L5864m268J21411
21662C49096M8605P221O6331j9691o2673J19152j1208O5648q4841n9188l5468
21651C82984n271M7591l6883p6088K1632j6870R8853p2062o6431o5792N1593M6915
21639C10171n3615K0450p5706n0017L9570O4911J2781l655J26887L1359j12406
$$ y = [183910, 256481, 334892, 221683, 187438, 208185, 207628, 235992, 200635, 324715, 445768, 372929, 265662, 189929, 292868, 378903, 308343, 248486, 226971, 276946, 425482, 605641, 713409, 647791, 638092, 576120, 519724, 590829, 739801, 789498, 804119, 797229, 606017, 469811, 364467, 311545, 291440, 298050, 198104, 202191, 164403, 175739, 208845, 322543, 433373, 440647, 470762, 473521, 317177, 260393, 321763, 315557, 170362, 196089, 231953, 227685, 349096, 397701, 404922, 471253, 451562, 388889, 508041, 496833, 562481, 477640, 418452, 382984, 377713, 425304, 388421, 312333, 333965, 317095, 415948, 343886, 277455, 211663, 263256, 310171, 256556, 277006, 201300, 151283, 190853, 255764, 268545, 264890, 391777, 423136, 310730]
21628C10730k9503k2971n0462k0314J05090P3540q0421o1882m4023M0963j03665
21617A17082O7204N9989M6801k581Q5884Q3335P0052m0556k9270n947r8666j3460
21605C39867K7951r1897k8761r1736J26045O2783M0988n4856p161J00160m754
21594D18629Q5006M0124q0194m9073J7246o3605M327m8085l7825Q0439M9612k7431
21582C89170L2069m8072J5934J9046M82M7900j7501m9414P2594n5297M1679J86297
21570F34887L33856J22183N6220q149j69997k1310K26811J76925l11893m64811
21560E74722j78105R4312L6638n110r541J11083K3459q307L9158L9047J4608Q5789
21548H17753J01074J7281L0116Q4517M1352p4088k1558j5206J0632J2305j30273
$$ y = [310730, 281227, 258256, 207794, 187480, 292570, 366110, 285689, 223807, 179784, 220747, 117082, 184286, 244275, 291076, 288495, 374379, 457714, 527766, 487210, 457940, 451993, 353327, 339867, 367818, 275921, 247160, 155424, 281469, 344252, 385240, 330384, 323223, 423383, 418629, 503635, 543759, 463565, 414492, 431738, 368133, 372460, 324375, 286550, 366989, 416601, 389170, 421239, 373167, 389101, 408147, 408629, 456529, 439028, 389614, 462208, 406911, 448590, 634887, 968743, 1090926, 1147146, 1138997, 969000, 947690, 1174501, 1351426, 1039533, 574722, 396617, 490929, 527567, 522457, 512916, 623999, 647458, 639151, 678309, 717356, 731964, 817753, 918827, 936108, 966224, 1050741, 1092093, 1018005, 996447, 981241, 991873, 1004178, 873905]
21537H73905m4232j20191m8797N3994J290Q8750j4745K1115j8564o3066J32885
21526H62344J86549P8068M0239j13692o8074n4342j17323J25509P6170J15679
21516A131127j2383n9535r7973j7995J31247J51052k0934J9451K8948n9080k2652
21505A171273J92705M1038j24137m7591M2115j48599O8873J95809O0188m0673
21495A411001N2271l0236K7644J52557J30178J09263J47372J12272j26585J9056
21485B004793J18207J54479K10963K99257L49998K55374J67616J86479L03797
21476D050963M15292L98181O03687Q15097N51280J53621R3113K89082K06616j28591
21466G448341j58858j94903m7063J41019L15759L87441N41704P30058Q07623J095285
$$ y = [873905, 829673, 709482, 660685, 714679, 715969, 804719, 789974, 811089, 792525, 729459, 862344, 1048893, 1126961, 1167200, 1053508, 985434, 931092, 813769, 939278, 1015448, 1131127, 1118744, 1059209, 961236, 943241, 1074488, 1225540, 1204606, 1224057, 1253005, 1193925, 1171273, 1363978, 1405016, 1280879, 1233288, 1275403, 1126804, 1195677, 1391486, 1451674, 1411001, 1463272, 1433036, 1460680, 1613237, 1743415, 1852678, 2000050, 2112322, 1985737, 2004793, 2123000, 2277479, 2488442, 2787699, 3137697, 3393071, 3560687, 3747166, 4050963, 4466255, 4864436, 5468123, 6283220, 6834500, 6988121, 7081234, 7370316, 7576932, 7448341, 7289483, 7094580, 7047517, 7188536, 7504295, 7891736, 8433440, 9163498, 9971121, 11066406]
21456A1066406J155781J228412J486691J829149K254834K586850L154862L966596
21448B8729581N110695O968283R956016J4225182K1515531L5384763O1962806
21441A83852857J05106842J31267271P5950027M892075L884697K8944376J9608324
21434E53506469o3073598j00036649q3552078n7165576m5812015l7205741k8424068
21427A38236744k1227025j6149681j2505032r915667p770976o383787n692692
21420E8591884m848799m180695l460022k765239k449747k245959k121783k027963
21412C4491677j893275j802653j602065j424323r63657o79358k26249k57768p83615
21403B4858714q73056p22470n56322p97224r86011j053972j011474q20254o09299
$$ y = [11066406, 12222187, 13450599, 14937290, 16766439, 19021273, 21608123, 24762985, 28729581, 33840276, 40808559, 50764575, 64989757, 86505288, 121890051, 183852857, 288959699, 420226970, 496176997, 501069072, 504953769, 533898145, 553506469, 490432871, 390396222, 306844144, 249678568, 203866553, 166660812, 138236744, 117009719, 100860038, 88355006, 78439339, 70668363, 64284576, 58591884, 53743085, 49562390, 46102368, 43337129, 40887382, 38641423, 36519640, 34491677, 32598402, 30795749, 29193684, 27769361, 26805704, 26126346, 25900097, 25642329, 24858714, 23985658, 23263188, 22706866, 21909642, 20923631, 19869659, 18858185, 18037931, 17428632]
21394A7428632m88123o54790p30080m98516m61138o79337n96666n26391l58088
21385A2435503m07382k53951k70851m27618l99898m28171j99494l51347k78023
21376I418768k77235l54188k64315l32874k56053k23476k20076j67987j94555
21367G128009k90231k50560k96327k15375r7466r5181j25786j53006j42819j61641
21357E299617j23901j80353q3064j54242j17883j00059k89205j54726j38942j06535
21347C850707j42840k36778p8586L8632j8646l566m4504O37j34514k43484j84359
21336B802699j96843o5958r0368J2033K3695j57820k4350L6948m1942j17718M326
21325B184702p4939k39823j10839j5081Q4835J37930p508k8853P9844J86567m7528
$$ y = [17428632, 16940509, 16285719, 15555639, 15057123, 14595985, 13916648, 13319982, 12793591, 12435503, 12028121, 11774170, 11503319, 11075701, 10675803, 10247632, 10048138, 9696791, 9418768, 9141533, 8787345, 8523030, 8190156, 7934103, 7710627, 7490551, 7322564, 7128009, 6837778, 6587218, 6290891, 6075516, 5978050, 5882869, 5757083, 5604077, 5461258, 5299617, 5175716, 4995363, 4912299, 4758057, 4640174, 4540115, 4250910, 4096184, 3957242, 3850707, 3707867, 3471089, 3392503, 3431135, 3412489, 3408923, 3364419, 3365056, 3230542, 2987058, 2802699, 2605856, 2539898, 2449530, 2461563, 2485258, 2327438, 2303088, 2340036, 2298094, 2180376, 2184702, 2109763, 1869940, 1759101, 1744020, 1828855, 1966785, 1959277, 1930424, 2010268, 2196835, 2149307]
21314B149307k18995l3404j35001j65840j23366k22442j65516m4501P8785J7436
21304A136463J6745p5178k11577o8180q2153j41909j06262L135J22613M7516Q8388
21293G29601N2992l0973j48181j43653k1813j42491l1786Q4042J9343q1543O7087
21282C52625o4934q0988K3374k6065J10692k3861n1028n7267l1316R1401M2419
21271B85052L1735o2371p4122O7181O112P1932P2498j08899o3364J2221P1022
21260C08997R4439L8566Q4723q9703j82584l9928K2192L6285J6712Q7905l3223
21249C44381O9140J8123j14175j83133q4763Q5043o6002p3828L1070O0762j15873
21238b9255q311J01394O5281M362o4451l8658N716K9404p128m0176M6881N7175
$$ y = [2149307, 1930312, 1896908, 1761907, 1596067, 1472701, 1250259, 1084743, 1040242, 1119027, 1136463, 1153208, 1078030, 866453, 798273, 716120, 574211, 467949, 471084, 593697, 641213, 729601, 782593, 751620, 603439, 459786, 437973, 295482, 263696, 347738, 367081, 285538, 352625, 287691, 206703, 230077, 204012, 314704, 290843, 239815, 182548, 151232, 242633, 285052, 316787, 254416, 180294, 247475, 253587, 325519, 398017, 289118, 225754, 237975, 308997, 403436, 442002, 526725, 437022, 254438, 214510, 236702, 272987, 289699, 377604, 344381, 413521, 431644, 317469, 134336, 49573, 134616, 68614, -5214, 25856, 86618, -29255, -37566, 63828, 129109, 133471, 69020, 30362, 36078, 65482, 58354, 18178, 65059, 122234]
21226A22234j1838n3313p9666J1946L6895k6505K2536P461L0985K3709j997N758
21214H8205j5482m0548J2475O6478L0905Q9494J7717n7668r8919O7537K06441
21203C66635j49617j58133j2999nK9908m0532p778q1300q8869M8946P9905J5583
21191A744L4488O2161L2526j12386o8302Q8492n6740N2164J11129p510q3619k9505
21179B4642K1330K0778k7529n5599M7051J0098p0639m3780K7986q0041J04251
21168b1452J12001M7914M5368p069l0057j05003n0617J20956N4883K1058j16099
21157G1883o7379O6276j0962p9455l0346n3627n9151j7614L9067J61902J10057
21146A30651j11615j76565j6912l3647r356L362O1549J22198R2006R0396r2829
$$ y = [122234, 110396, 57083, -22583, -10637, 26258, -247, 22289, 29750, 60735, 84444, 82447, 88205, 72723, 32175, 44650, 111128, 142033, 231527, 249244, 191576, 92657, 160194, 366635, 217018, 58885, 45886, 45881, 75789, 35257, 27479, -53821, -142690, -93744, -13839, 1744, 36232, 98393, 130919, 18533, -49769, 38723, -18017, 34147, 145276, 137766, 54147, 24642, 45972, 66750, 39221, -16378, 30673, 40771, -29868, -73648, -45662, -125703, -21452, 90549, 138463, 183831, 176762, 146705, 41702, -8915, 112041, 166924, 187982, 71883, 4504, 70780, 59818, -19637, -49983, -103610, -162761, -180375, -141308, 20594, 130651, 19036, -157529, -174441, -208088, -217444, -214082, -152533, -30335, 61671, 152067, 59238]
21135E9238r5963p804j7758m0760P6818L7952j22673k8931k0065n5704n3698j2083
21123b81431Q8815P6350n7477m2956r7615M7372P0061K16119O3927n3795q1723
21112e2353o5150k8262O2139K9393j14518l7053M5333n8969l5612K5489k0536
21101b50099Q278K0049L2904J10536M1605k7131m5971r7361m6452L6958N6934
21090a59750P5833K25935K3418k29437j91726j09142M3300P0329K4802Q3237N721
21079a37480r3542o5737J9598L9371k8286K9981M2551j9284Q1640P1453P9151
21068A9416j06016j2754P4J1103R4431K2310L9013L8857M3307J34359o2371j25768
21056I5961j69471l2419P7234l204l6552J8135m6626L0349j8483R8760Q5400m6987
$$ y = [59238, -36725, -44529, -62287, -103047, -26229, 11723, -110950, -139881, -159946, -215650, -269348, -281431, -192616, -116266, -173743, -216699, -314314, -266942, -196881, 19238, 83165, 29370, -52353, -117503, -145765, -83626, -54233, -168751, -205804, -160471, -219440, -255052, -229563, -250099, -241821, -221772, -188868, -78332, -36727, -63858, -109829, -207190, -253642, -216684, -159750, -83917, 142018, 165436, -64001, -255727, -364869, -321569, -251240, -226438, -143201, -137480, -231022, -296759, -277161, -237790, -266076, -236095, -193544, -212828, -131188, -59735, 19416, -86600, -99354, -99280, -88177, 6254, 28564, 67577, 106434, 149741, 284100, 221729, 95961, -73510, -105929, -28695, -31899, -68451, -50316, -96942, -66593, -85076, 13684, 99084, 52097]
21044E2097M4572Q3467m8534P15l2689j53042r8604L7456L6846m3366R7369P4426
21032E0713l4534n3436q673M6632j3457j13345r1069O0357n2N5225J8515M1390
21020d1734k5547O8854K8116L3694P1404o6105p3712m6116L5183j0585m0646m6800
21008a13994J17434m1232j15401P5540P1792L3478K2441j1546j39538r7112n5619
20997b53757m5256k2169Q4755Q3479l1922l8053M6158J7570M2229J09479O8879
20986F1392L9912o8036n7263M9210j03739p2638m0606o1958R52K9182k0788J68757
20974g5623J1098o4012k6350o5634n3914O1785N9576l7974P9462R0095J43082
20963A21591P2636k4237r4608O3231n1390o3638j23213k06652l8362J10090K83464
$$ y = [52097, 96669, 180136, 131602, 132317, 99628, -53414, -152018, -114562, -77716, -121082, -23713, 50713, 16179, -37257, -45930, 702, -12755, -126100, -217169, -156812, -156864, -101639, -83124, -41734, -67281, 1573, 29689, 63383, 134787, 68682, -5030, -51146, -15963, -26548, -67194, -113994, 3440, -37792, -153193, -77653, -5861, 27617, 50058, 38512, -101026, -198138, -253757, -299013, -321182, -236427, -152948, -184870, -222923, -176765, -159195, -116966, -7487, 61392, 101304, 33268, -23995, 25215, -78524, -151162, -191768, -253726, -252774, -223592, -244380, -75623, -64525, -128537, -154887, -220521, -274435, -212650, -153074, -191048, -111586, -21491, 121591, 194227, 169990, 75382, 138613, 87223, 23585, -99628, -306280, -344642, -234552, 48912]
20952D8912O0689o7002L3228k7517k1412j15485j32256N6157m7942l8241M7493
20941b03376N03M8392M8832k6351L5716p0711J2423m5380m2168J2232j29868l4899
20929c94655Q10k56J49777L5888j4731m3930m58J30105L919n6098L3397J02660
20917e3572L3887r7629r3488J753P1263J59271L3873j12776j11662N7196j4915
20906a26799K7632K1550m4954q7357q1539j1063J47539J11214L3368P3063k096
20895F0558o7103r5248l8545q532j69919o340L0655k2000L1156K5780J71908o8814
20883a56444o7360o1660P5160Q9799m017L7487p9401J366Q5568O9646j4680j5028
20871c9564k2884o9045j5092r711Q6306j0702p4112R4370K6609p1153Q925j05865
$$ y = [48912, 109601, 42599, 75827, 48310, 26898, -88587, -220843, -164686, -212628, -250869, -203376, -202873, -154481, -105649, -132000, -96284, -166995, -154572, -199952, -242120, -229888, -359756, -394655, -393845, -394101, -244324, -208436, -223167, -267097, -267555, -137450, -133531, -189629, -156232, -53572, -19685, -117314, -210802, -209049, -137786, 21485, 55358, -57418, -169080, -111884, -126799, -99167, -77617, -122571, -209928, -291467, -302530, -154991, -43777, -10409, 62654, 60558, -6545, -101793, -140338, -148870, -318789, -325129, -294474, -316474, -285318, -259538, -87630, -156444, -223804, -285464, -210304, -120505, -124522, -87035, -166436, -165070, -79502, -9856, -24536, -39564, -62448, -131493, -146585, -156296, -69990, -80692, -154804, -60434, -33825, -104978, -96053, -201918]
20859b01918j41228Q8481K17692O7577n0667r6202N8929M6577l6718j5513N1763
20848a1227J3203N4026R7966j12729j51494M11j1275q1810m2208M875K5842j7117
20836b31537O6402R7250l3698k0960L2935k8956M5444L5592L7189k1175K1282
20825b32O6768j29044q4916J1911M3498R0284J10874Q4082J4409n6991K7820q5240
20813I3223j22668Q6294o987q5772m2740M7993J08118o5142o167M9195l9065j0802
20801E480k116J10179J28273l3559l5168J6335N0676Q6864J13906J68025K83282
20790H92177N71766O16945M82343K41538o929J19399M9551j52265m45782n57183
20780A811560m18639l28084k43886m3537J2584j91219j68371q5859k7322j22920
$$ y = [-201918, -343146, -254665, -36973, 30604, -20063, -116265, -57336, -10759, -47477, -62990, -11227, 1976, 56002, 153968, 41239, -110255, -109844, -121119, -202929, -245137, -240262, -214420, -231537, -165135, -67885, -101583, -122543, -89608, -118564, -73120, -37528, -339, -21514, -232, 66536, -62508, -147424, -135513, -92015, -1731, 109143, 193225, 207634, 150643, 178463, 93223, -29445, 56849, 49862, -35910, -78650, -30657, 77461, 12319, 6152, 55347, 16282, 5480, 3364, 113543, 241816, 208257, 173089, 189424, 240100, 326964, 440870, 608895, 892177, 1463943, 2080888, 2563231, 2804769, 2797840, 2917239, 2966790, 2814525, 2368743, 1811560, 1392921, 1064837, 820951, 777414, 789998, 598779, 430408, 344549, 317227, 194307]
20770A94307m9892P5677j16820M2803L5711j80039K8108R3322N3075P2986K890
20759B52128j721k3418l9144k8105O2771o8023l0264j4256j11006J1243M3111
20748E3316j1440n9546r5511J9891J0025O4196n8367q2937R1224R5832J4336j1609
20736B9410P8915L9973l1304n0197P611Q9399Q7603l3004m3550o5116M199j16904
20724b965l8098p811K82k2237o6110m8403m718J46408L2596l7710p0276J07118
20712a1924O3445O7715J457q2404j52728m7949j6696O6897j7593q6168J9116N0895
20700a45937P9920J63558q915m0676k6756j42500n7943Q7928Q9632N2007j0825
20689C9493j19532m7958L3200J17243J4598r8545m7879k5902P2275k9551j11299
$$ y = [194307, 144415, 220092, 103272, 146075, 181786, 1747, 29855, 123177, 176252, 249238, 252128, 250407, 226989, 187845, 159740, 222511, 154488, 124224, 109968, -1038, 10205, 53316, 41876, -17670, -113181, -93290, -83265, -19069, -77436, -160373, -69149, 26683, 41019, 29410, 108325, 148298, 116994, 66797, 74408, 163807, 251410, 218406, 174856, 109740, 113939, -2965, -41063, -48874, -48592, -70829, -136939, -185342, -190060, -43652, -11056, -48766, -119042, -11924, 51521, 119236, 120693, 38289, -114439, -162388, -179084, -112187, -129780, -215948, -196832, -145937, -66017, 97541, 88626, 47950, 21194, -121306, -179249, -91321, -1689, 50318, 39493, -80039, -127997, -94797, 22446, 37044, -61501, -109380, -135282, -63007, -92558, -203857]
20678b03857J9437N1449M6626k737Q1123l0092M8726J19533m7288j78208o0393
20667a55681J008J12039j6857j34296M5586P2182m5069n0934o1690P657J5811
20656b10244J92716J55655R1315o866r5242j65137L2638J55034l3195j50048M4038
20645A0664m2484R816j16893r3901m2102K3645J11457N3163k7309l2898o0403
20634b07245N8936J53401o3866j41235l0082r124J12244P3419N0308J17061J7734
20623A31551j86268j31616Q2614o822l6912n6740J2935N3905J7409L279q3795
20612b00460m9714K9520J23800J7827n140l6739R9337J07783L5570j2657j09184
20601e7M19R1747n8541m2963P7354m9497p172n8265r324j9780L9219m6647L5926
$$ y = [-203857, -184420, -132971, -86345, -89082, -7959, -38051, 10675, 130208, 82920, -95288, -155681, -154673, -42634, -59491, -193787, -148201, -76019, -121088, -172022, -233712, -226055, -210244, -17528, 138127, 229442, 222576, 127334, -37803, -5165, 149869, 116674, -33374, 10664, -31820, -22004, -138897, -232798, -274900, -251255, -139798, -86635, -113944, -146842, -207245, -148309, 5092, -58774, -200009, -230091, -239215, -126971, -53552, -3244, 113817, 131551, -54717, -186333, -103719, -110541, -147453, -204193, -191258, -137353, -119944, -116665, -200460, -250174, -220654, -96854, -79027, -84167, -120906, -21569, 86214, 121784, 109127, -57, 362, 92109, 33568, -9395, 67959, 18462, 11290, -46975, -56299, -76079, -36860, -83507, -47581]
20588d7581P788K2452p5241o2205k3306j9394K1213j9804J7414M1658K5358P7319
20576c4329j5064K1689j5063n1410O7599L4169k452m7601k0732Q2141o0228Q921
20564c2360k182J8403n3400r977r4695P8770J06466O6312r5168k0419p454J9841
20552b5863o2999K31J24591N7815j11242Q718N3938r207m3353n2505q6322q8739
20540b34937L0563L7339J14184R8725q9704j13387J01536o1481j29973Q6210M0278
20529a20647l5928n4854r078n7205J5946J17778P4933M131o8355j0075L7841J19333
20517A3820O4744Q6105m1723j78999K2765k3801j7410K4529N9331n5575p6307
20506a22521O6722J17073k7640m2795j07641J9873O6023L7055j7082j4514R6889
$$ y = [-47581, -39793, -17341, -92582, -154787, -178093, -197487, -176274, -196078, -178664, -137006, -111648, -34329, -49393, -27704, -42767, -94177, -26578, 7591, 5139, -42462, -63194, 18947, -41281, -32360, -34542, -16139, -69539, -79516, -174211, -95441, 11025, 77337, -17831, -38250, -45704, -25863, -88862, -88631, 35960, 93775, -17467, -8749, 45189, 35982, -7371, -59876, -146198, -234937, -204374, -167035, -52851, 45874, -43830, -157217, -55681, -117162, -247135, -160925, -120647, -156575, -211429, -220507, -277712, -261766, -143988, -69055, -64924, -133279, -143354, -105513, 13820, 78564, 164669, 122946, -56053, -33288, -57089, -74499, -49970, 9361, -46214, -122521, -55799, 61274, 33634, -9161, -116802, -96929, -30906, 6149, -10933, -25447, 71442]
20495G1442k2511J15092o4605j12270l1455r3358n5001P4146k4700j8307r018
20484a70545j8794J121R7182J6770Q3347J0266j91519L4004N0148J84326n8327
20473C7979j35206P3314J63516m6459r2506q294j13884j41094M9025K1997M0432
20462a51180J17183j4697p4399o3260l9741l3533l6596l3373J2970J65831o6019
20451b16814J0265P3355R808N2262K140l1130J11037L0504n3868p2680q6472k4229
20439a95822R748N630O3934O1420r531o0674p1158N2238N6749J00833N818n7031
20427c7846Q6101J2772o2897j41763q6092J71630J31761j37330n2206O7708r8281
20416a46443l2900Q4777N2541r3699n2233Q3888O3512r509m8803j38484j33601
$$ y = [71442, 48931, 164023, 99418, -12852, -44307, -137665, -192666, -118520, -143220, -161527, -170545, -189339, -188218, -91036, -74266, 9081, 19347, -172172, -138168, -88020, 96306, 37979, -97227, -23913, 139603, 93144, 638, -7656, -121540, -262634, -213609, -191612, -151180, -33997, -48694, -123093, -186353, -226094, -259627, -296223, -329596, -316626, -150795, -216814, -206549, -133194, -123386, -71124, -68984, -100114, 10923, 41427, -12441, -85121, -171593, -195822, -186074, -180444, -116510, -55090, -64621, -125295, -196453, -144215, -87466, 13367, 19185, -37846, 48255, 61027, -1870, -143633, -229725, -58095, 73666, -63664, -115870, -48162, -146443, -179343, -94566, -42025, -135724, -187957, -104069, -40557, -50066, -98869, -237353, -370954]
20405c70954K2164N4461Q7864J17089J4857P515M0080j11639n7296P4193O4580
20394e7086l9215J17774Q4596o9232N175j9578r8242j4975l2421K4179N7403K4274
20382a7348k0331n4829l1466m3049J23877k0346k0795O5134O1758M851n0367J8040
20370A5129L7921K7325n2088m7353j3474J6094j07384q8351M3462J3998N2291
20359a02430J48580j3165r8878j040L6446m9801o9468L0237k5225M028m7691M4459
20347a43948p8270q1004l7187K2980L4663N9246M9757J7929J51381J0794j28572
20336a22231j35866k6597J09462R574N3777m535Q3866R8344l9718k6501j16599
20325a17024j24484j3692P8172O3568J6118N1445J080j35377j02483K6722j809
$$ y = [-370954, -348790, -294329, -206465, -89376, -74519, -67004, -26924, -138563, -195859, -121666, -57086, -96301, 21473, 106069, 36837, 42012, 22434, -75808, -90783, -123204, -99025, -41622, -17348, -37679, -92508, -123974, -167023, -43146, -63492, -84287, -19153, 42605, 47456, -2911, 15129, 53050, 80375, 28287, -19066, -32540, -16446, -123830, -212181, -168719, -154721, -102430, 46150, 32985, -65893, -66933, -30487, -80288, -149756, -119519, -144744, -140716, -188407, -143948, -222218, -303222, -340409, -317429, -282766, -223520, -173763, -155834, -4453, 6341, -122231, -258097, -284694, -175232, -165658, -111881, -116416, -32550, 65794, 26076, -425, -117024, -241508, -255200, -177028, -113460, -97342, -45897, -44817, -180194, -282677, -255955, -257764]
20314b57764O7415O4687J6573J16360O7745J42929K5973j21297j93933M4187K3200
20303c925j36301j5724N5353j8397R3734M5858j38024n4520l0720J4162P6601
20292a11903J5733j8889P8154R2236N0536M2693k9419n3704r295r5296j43134
20281a82288M4301R0974j24762l141J10509N4704m878p2585P711n1130j22925
20270b53510j7152Q7111J55248K178q4380j64238O1676M6182N5324Q5160K5428
20259i73M0941K5200q4053n4870l4424k8745K6775M5026Q0642m7981N5156r893
20247A2801k5114O4413M9998J0118K3621r9712j61228q8580q1061P7898k3565
20236b40411M1222N0953j0660L0116J37784J40204j3124l3163j44201j99775M4026
$$ y = [-257764, -190349, -125662, -109089, 7271, 75016, 217945, 243918, 122621, -71312, -27125, -3925, -140226, -155950, -100597, -118994, -25260, 20598, -117426, -171946, -202666, -188504, -111903, -96170, -115059, -36905, 55331, 105867, 148560, 119141, 65437, 56142, -39154, -182288, -137987, -47013, -171775, -174916, -64407, -9703, -14581, -87166, -79455, -130585, -253510, -270662, -183551, -28303, -26125, -110505, -274743, -213067, -166885, -111561, -26401, -973, 39968, 65168, -18885, -73755, -108179, -136924, -110149, -65123, 15519, -32462, 22694, 12801, -12313, 52100, 102098, 112216, 135837, 36125, -125103, -213683, -294744, -216846, -240411, -199189, -148236, -158896, -128780, 9004, 149208, 136084, 102921, -41280, -241055, -197029]
20225a97029J25328k3223n2866M626Q9977p6055j35919N3899J01209M5921m9669
20214a13801o6644k6604J28491P5347o7345q9955j45325j2458J46883n280r0749
20203b67440M3236N1262O5225M3293p4775P9221J78835l2942O6600M570p7663
20192G9422k17494K1204r13o8512P0234N5486Q316r6052m3070J35540k6697j0242
20180i2778j02427O3192L1115O8862O267P3594J19830J4588m6744j50870k830
20169a8201K2097q7235r8887q2406P1702J6955K2514M3929K0896l1581L7856p3719
20157a56080m1650J06155M0892j0047o4134m904K6199M1948m3698Q582K3702l2974
20145a06009o4481R7187J8020J08666O0253j01466j15052l4387J00248L233l8984
$$ y = [-197029, -71701, -94924, -147790, -143164, -53187, -129242, -265161, -211262, -110053, -64132, -113801, -180445, -207049, -78558, -3211, -70556, -160511, -305836, -318294, -171411, -176691, -267440, -224204, -172942, -107717, -64424, -139199, -59978, 118857, 85915, 152515, 157085, 79422, -138072, -116868, -117781, -186293, -116059, -60573, -52257, -148309, -191379, -55839, -82536, -92778, -195205, -132013, -100898, -32036, -25769, 47825, 167655, 182243, 135499, -15371, -18201, 3896, -83339, -182226, -264632, -192930, -175975, -153461, -109532, -88636, -120217, -82361, -156080, -197730, -91575, -50683, -60730, -124864, -129768, -103569, -61621, -105319, -96737, -73035, -106009, -170490, -73303, -55283, 53383, 113636, 12170, -102882, -137269, -37021, -33788, -72772]
20134g2772o4778L597R019q1954m3458J1163m7760L5154J37454P1758j05440m3640
20122a91657J51209K7114J9868L4575k0985o6008P8738L9178j16549j08794P8537
20111g4774N9100r7983r3899N2990R8159J39024J27516q6197k07819j69957N4117
20100a99723K24942M7040j15258N32k4232k4182m4612j9632m7100R275J69620
20089b3330K3176n8208N4223P5093J6262J9704o0517j02506N0185R0639k5855
20078E8866j30896J27758P5716N761k2166o9311m9960j45770K4338J33991j108
20067G219p1380j0050k9279K6937Q5459m6337L626j26743K5709P3651p0721j9737
20055a51646M8117J28735M034j0009n3626M1250k7871J3174K653K7802j50565
$$ y = [-72772, -137550, -133953, -124934, -206888, -250346, -239183, -286943, -251789, -114335, -42577, -148017, -191657, -40448, -13334, 6534, 41109, 20124, -45884, 32854, 72032, -44517, -153311, -74774, -15674, -113657, -207556, -154566, -56407, 82617, 210133, 123936, -83883, -253840, -199723, 25219, 72259, -42999, -42467, -66699, -90881, -135493, -155125, -202225, -192950, -23330, -154, -58362, -4139, 70954, 87216, 106920, 46403, -56103, -5918, 84721, 58866, -72030, 55728, 131444, 137205, 115039, 45728, -4232, -150002, -125664, 8327, 7219, -64161, -74211, -103490, -76553, 8906, -37431, -33805, -160548, -134839, -61188, -131909, -151646, -103529, 25206, 29240, 19231, -34395, 6855, -21016, -7842, -5189, 22613, -127952]
20044a27952j60675P6419n890K6910Q6900m0830n848M1921L2627k4718M5042J68707
20032A12613J06884r4041j5358p7852M506O180L935k6200L77j4958r6558j64202
20020b54674J7775N1827l9691J04887J28969M8016M0910N0234j2158p3535n9128
20009C432j00251P4802P034l432N8072n3605O57j4534J061p6837o9922Q1289p525
19996i9759O0538K5362J4490j8374j74227m3735O6989P2483j7413p45M1358R4674
19984B1641k654j6788L5412L8432o9706r4880k6385j832J16791J36671o7954r0157
19972b1409l2677Q2824Q7691n0740m9818N6816O6221l1782k26842p5049O6595
19961a28170l892L9086L0939J4116J22460m4028m266j16868l6038J30870j0589
$$ y = [-127952, -288627, -212208, -218098, -191188, -104288, -145118, -150966, -109045, -76418, -101136, -56094, 112613, 219497, 125456, 110098, 32246, 36752, 42932, 46867, 20667, 21044, 6086, -90472, -254674, -236899, -185072, -224763, -119876, 9093, 57109, 98019, 148253, 136095, 62560, 3432, -96819, -22017, -14983, -18415, 39657, -13948, -13291, -27825, -26764, -103601, -173523, -92234, -99759, -39221, -13859, 631, -17743, -191970, -235705, -168716, -96233, -113646, -114391, -73033, 21641, 18987, 2199, 37611, 76043, 6337, -88543, -114928, -116760, 31, 136702, 68748, -21409, -54086, 28738, 116429, 65689, 15871, 72687, 138908, 107126, -119716, -194765, -128170, -132062, -92976, -62037, -47921, 74539, 30511, 26245, -90623, -126661, 4209, -6380]
19950f380j09771k475L5664O913o3082K2619j1924n4998M6643J16613m7617j3549
19938h1344L0220q7283o4010J77216J94481K5423K7027j83654l2587J30228j21940
19927A3777j30988N00J5463l2187J09597P6564j64114m1355l8263M968O0245K7006
19915i8787o6096K8474L4092n2122L7054M7134M7736R1630J5474p9701J2723j38249
19903a20638L0714Q3440q8388j54387k7291n1639Q4364q1426P9843O5978R0571
19892h8859k1233L3663J02599P1873N4374J4531L8448M4096K0402o5994k35045
19881c1145j07020j4063n6288N3920P6861m942j10789J3328P5248p4337K2564
19870a56663J6881J39463j3029r8079M3595J19443l8118l2795P3984N0530L1902
$$ y = [-6380, -116151, -118626, -82962, -76049, -139131, -116512, -128436, -183434, -136791, -20178, -67795, -81344, -51124, -138407, -202417, -25201, 169280, 194703, 221730, 38076, 5489, 135717, 13777, -117211, -116711, -101248, -133435, -23838, 52726, -111388, -152743, -191006, -186038, -125793, -98787, -164883, -136409, -102317, -154439, -117385, -70251, -22515, 69115, 84589, 4888, 17611, -120638, -89924, -6484, -94872, -249259, -276550, -328189, -243825, -325251, -245408, -179430, -88859, -110092, -76429, 26170, 98043, 152417, 166948, 205396, 249492, 269894, 203900, -31145, -138165, -152228, -208516, -154596, -77735, -82677, -193466, -180138, -104890, -179227, -156663, -139782, -319, -13348, -111427, -67832, 51611, 13493, -19302, 54682, 105212, 137114]
19859A37114o5418k2014R6299p3253q0376r649p8647o0393J2673J54212l5038
19848b4490j71911j41582k57J14496N2358J22212J4991L7548l6158n9869k1091
19837a13753o3565L6231J03111o7775n9469l2824M413R8254n1910L0795J9197
19826i7295K2289j02395N4674R2481j1382n5246l2210P1110J09407o2401q5594
19815i6562j9024j7846O3238K0470N4405o9348j12188J80137R8992l60j53355
19804e1441l9562p8598p6416l9717N4795J01322Q6170n1905q6580l744O8752J8787
19792i8137J10429k3047m2634q6046L0343m1376q2975Q134J55768J2634m5512
19781a02419r4202p0695P6091K5769N8277N1514M4736k9510p659N285J57647N5776
$$ y = [137114, 71696, 49682, 145981, 72728, -7648, -17297, -95944, -156337, -143664, 10548, -24490, -196401, -337983, -338240, -223744, -171386, -49174, -34183, 3365, -32793, -92662, -113753, -177318, -141087, -37976, -105751, -165220, -198044, -193631, -95377, -147287, -116492, -97295, -75006, -177401, -122727, -30246, -41628, -96874, -129084, -57974, 51433, -10968, -96562, -115586, -133432, -70194, -49724, 4681, -64667, -176855, 3282, 102274, 101914, -51441, -91003, -169601, -246017, -285734, -230939, -129617, -43447, -95352, -181932, -185676, -116924, -98137, 12292, -10755, -53389, -139435, -109092, -150468, -233443, -225309, -69541, -56907, -102419, -196621, -267316, -191225, -165456, -107179, -55665, -10929, -40439, -48098, -42813, 114834, 170610]
19769A70610r3953j26737j12271N7017Q8029O7055m5213p952J24065K3008j47118
19758c460n154J03880J5373M5155O221r6968r1889l5140O8429K7915j1672j05280
19746h2590m358P0196J65732O0542j18683r4981k3236L1037N3675n0602k7567
19735b0835p7613j05963m0792N7373J52858q225Q9691k3416K2750N3868L9726
19724A39422r9194r9645J04828J0759J3795j06314K5813o9140j19316J0465P4389
19713a14138Q0391k10M0591J17337J9429o5944j31589R8110n8317M2496Q5207
19702A13363l9653l0229O2434J0898n6477j13141q3279o5115p0273N9637O4032
19691a47803K0916r224L2187J00326N3643J3057R2873N907K1799o0109q8532R8408
$$ y = [170610, 76657, -50080, -162351, -105334, -17305, 49750, 4537, -3415, 120650, 143658, -3460, -8614, 95266, 110639, 155794, 162015, 65047, -26842, -61982, 6447, 34362, 22690, -82590, -86948, -16752, 148980, 209522, 90839, -4142, -27378, 3659, 57334, 6732, -20835, -98448, -204411, -245203, -187830, -34972, -43197, 46494, 23078, 45828, 99696, 139422, 40228, -59417, 45411, 56170, 69965, -36349, -10536, -79676, -198992, -188527, -114138, -33747, -33957, 6634, 123971, 143400, 77456, -54133, 43977, -14340, 28156, 113363, 73710, 43481, 105915, 116813, 60336, -52805, -136084, -201199, -271472, -211835, -147803, -126887, -136111, -103924, -3598, 50045, 63102, 155975, 161882, 183681, 123572, 35040, 133448]
19679A33448l4017k2j8773K7537P9591r9533r7216k6536n4292l8530P3897l1056
19667h5502m9673m0890l5993O8273J13172M4884L6596K4448k0968J7671j38859
19656f6841J7840k9419J4138o8062p0144o0024j3004O4972Q4459o4108Q2046k9571
19644a37718n6843l4120N297R1784O1734j52701n86M3662j75304M2996R9811N5392
19632a56596R3246M5385O381p459J1346p8532l7331r655o5041K6939M9972O4368
19620e6977n8024K316J1396R749N4312L1187Q5207O3643n8038L7635n2910r9789
19608c0293j31750O8562O122j60936o8738J37500J21580N1791j2266L6987P5249
19597I3808k4771m8376K2567r0993j23766J26095l01O1794k4799q0771L1363P0789
$$ y = [133448, 99431, 99409, 80636, 108173, 187764, 88231, -8985, -35521, -89813, -128343, -54446, -85502, -135175, -176065, -212058, -143785, -30613, 14271, 50867, 75315, 54347, 72018, -66841, -49001, -78420, -64282, -132344, -202488, -262512, -275516, -210544, -126085, -190193, -108147, -137718, -194561, -228681, -223384, -131600, -69866, -222567, -223153, -179491, -354795, -311799, -211988, -156596, -63350, -17965, -11584, -19043, -7697, -86229, -123560, -133215, -198256, -171317, -121345, -56977, -115001, -112685, -101289, -91540, -37228, -6041, 79166, 142809, 84771, 122406, 69496, -30293, -162043, -93481, -87359, -248295, -317033, -179533, -57953, -6162, -18428, 18559, 93808, 69037, 20661, 43228, -47765, -171531, -45436, -45737, 16057, -8742, -89513, -58150, 12639]
19585A2639q295j87686M6493N3844r8345k8908l4549O8453J4372N3039Q0442N880
19573b2621O149K7878M0568K7008r0000P5625J15754m9627j168j63388k1644l3668
19561h9134o2706m0405P7059K4960m9607o3149p1810M4505J36590R0671r5160
19550i8186l8083q0367N3330J9688J4043P608n1198J77844O4323j73693j57129
19539b61820L034J52581J67450q4232j33427J01849k2314j35230P1750M4299k0114
19528a16174p0137N783J0814k243J9016j04396K5992R3626J9073q7765P3144P5465
19516e7802k5907N1131P4515j33576p0274L2283M2957J0880j16822J08835Q3739
19505d1j9708M287K3781r2496q8332J56912J66734J53728m668j30854K7355M3349
$$ y = [12639, 4344, -183342, -136849, -83005, -181350, -210258, -244807, -176354, -161982, -108943, -28501, -22621, -16472, 11406, 51974, 78982, -11018, 64607, 180361, 130734, 129566, -33822, -55466, -89134, -151840, -192245, -115186, -90226, -139833, -202982, -274792, -230287, -93697, -3026, -98186, -136269, -216636, -163306, -143618, -129575, -121967, -173165, 4679, 69002, -104691, -261820, -258786, -106205, 61245, -22987, -156414, -54565, -76879, -212109, -140359, -96060, -116174, -186311, -180528, -169714, -171957, -152941, -257337, -231345, -137719, -118646, -206411, -133267, -57802, -83709, -32578, 41937, -91639, -161913, -129630, -86673, -75793, -192615, -83780, -41, -19749, -15462, 8319, -84177, -172509, -15597, 151137, 304865, 300197, 169343, 196698, 240047]
19493B40047r2030q4356K2959n7179q9109J27438J18191p1370j68508j81040j07581
19482c42538J31152J67280j6354j2090J9659N5209J11608L9177j54515j09603
19472a11015l4812L7129Q3522k2068k9221J1501n826K0813M3563k1437J4207p3972
19460h7616O6830J42417O2860k0625o278N4778o2156j23174j06759l6865J18947
19449B359O1189m5883n0342L1157j3243Q633m5660r4362J1754l8990r26N6336
19437a17978J38789J52K843L6742k1233q8538k6545J3712N1334j7230P7096J64599
19425B13743k0319j31353q3743j8495N6873J4653N0754J23415p7207j45622m0098
19414e7399M0089J3373j44116N9206P9412k3613Q0525j22878o4946M8171N8609
$$ y = [240047, 148017, 63661, 86620, 29441, -59668, 67770, 185961, 114591, -53917, -234957, -342538, -211386, -44106, -60460, -72550, -52891, 2318, 113926, 153103, -1412, -111015, -145827, -108698, -25176, -47244, -76465, -64964, -70790, -49977, -6414, -27851, -13644, -87616, -20786, 121631, 184491, 163866, 157588, 212366, 150210, 27036, -79723, -116588, 2359, 63548, 17665, -32677, -1520, -14763, -6130, -51790, -146152, -134398, -173388, -174314, -117978, 20811, 20963, 23806, 60548, 39315, -49223, -75768, -62056, -10722, -27952, 49144, 213743, 193424, 62071, -21672, -40167, 16706, 31359, 82113, 205528, 128321, -17301, -57399, -17310, -3937, -148053, -88847, -9435, -33048, 47477, -75401, -140347, -92176, -33567]
19403c3567r461L2192j1172j00610l2793J1965J02819K6533r0778m6483m8078
19392a99433J1012K5266N4493n6618l9001j6733K3627L6847K1671r5570K7802
19381b06637K5402K3420O806P6987O1433p7146j0782l8519Q9227P4938L5789n902
19369E5016j5401q0182O834P4636r842k5104o036o2949N3626j43191n6831L1276
19357a78148n364m4266N6422J41067q048j30992M3297J7690O5391j0442M936k8234
19345g6691j1216Q172J02007P2285r757m3195m4926n6403M3855K5611r7042j62098
19333b49398J4109K0969j7372Q3007J51808O2972m9130p6387K6304p7082O3437
19322d6763J30794Q3673n0880n9822M9428k5515M9027j05705m9337J1967j26682
$$ y = [-33567, -43028, -10836, -22008, -122618, -155411, -143446, -40627, -14094, -104872, -151355, -199433, -188421, -163155, -108662, -165280, -204281, -221014, -197387, -160540, -138869, -234439, -206637, -181235, -157815, -151009, -74022, -12589, -89735, -100517, -139036, -49809, 25129, 60918, 55016, 39615, -40567, -33733, 40903, 31061, 5957, -79, -63028, -9402, -152593, -209424, -178148, -183512, -227778, -171356, -30289, -38337, -169329, -126032, -108342, -42951, -53393, -48457, -76691, -87907, -79735, 22272, 94557, 84800, 41605, -3321, -59724, -15869, 9742, -87300, -249398, -235289, -214320, -231692, -148685, 3123, 66095, 16965, -59422, -33118, -110200, -46763, 84031, 167704, 116824, 57002, 106430, 80915, 129942, 24237, -25100, -13133, -139815]
19311a39815Q3196j9012O0967P5535M4504O216M0001r5539Q6320p3511o7812p1604
19299g0554J9321J28245K0900j10634L3299P5004k2901j07551J28938J43081m9195
19288A87953j39739p1137j57837p0182n5865P3243P7996N0736N4510o2255l1732
19277a44309r629N2840J08551O2636q4500j8231O4310o8343l5734J5165q2397
19266a39641q5565K4631J2353m0842P6953J76588P7876n5814N252J729p7603j43942
19254a68025l0496J48296N1489l6818k8944J0532N5968N8430J91284k07732j32081
19243h8097m4216Q63M0179J27104P2867k5527L697L3884m8192j17575n4260j26589
19231b25862j23014M7359M541l7406O4294M8918J40078j06215M7893N2699o5291
$$ y = [-139815, -56619, -75631, -14664, 60871, 105375, 111591, 151592, 56053, 142373, 68862, 1050, -70554, -51233, 77012, 97912, -12722, 20577, 95581, 72680, -34871, 94067, 237148, 187953, 48214, -22923, -180760, -250942, -306807, -233564, -155568, -104832, -50322, -112577, -144309, -153938, -101098, 7453, 70089, -14411, -32642, 31668, -36675, -72409, -57244, -139641, -225206, -200575, -188222, -229064, -152111, 24477, 102353, 46539, 51791, 53520, -24083, -168025, -198521, -50225, 1264, -35554, -64498, -53966, 2002, 60432, 251716, 43984, -88097, -132313, -131450, -91271, 35833, 108700, 83173, 86870, 120754, 72562, -45013, -99273, -225862, -348876, -301517, -296976, -334382, -270088, -221170, -81092, -187307, -139414, -86715, -152006]
19220a52006m802L1232Q5427K9288j83729j21084O8457J00920J41551m1973J9780
19209b6939P9985k2552Q187p7818o0861P1447n6802k5740q1081j4969l4768R3413
19197a48498J7308J24379J61792q2467L133M4452j976Q4687m8689j22323p4390
19186d2592l7187P360Q7631R5079k2582j19132k0138M707J9753m4709n8310L6261
19174i3859R1588O1622J1538m0227r185o3747p3265n9170J1527J0873J11640N9024
19162A8359r463L5450L8319m2398p9548r3885k8416J9459L0315R849o771Q8739
19150a9991L9295n6950J02073O0138p1126k11657l6945J16911M362N7118q3935
19139a00707k7753Q8813K8518k1806k1000l9983O7760M3444M5883l2152J8050
$$ y = [-152006, -156808, -125576, -40149, -10861, -194590, -315674, -247217, -146297, -4746, -46719, -26939, 53046, 30494, 38681, -39137, -99998, -28551, -85353, -111093, -192174, -207143, -241911, -148498, -131190, -6811, 154981, 72514, 75647, 120099, 118123, 202810, 154121, 31798, -42592, -79779, -72419, 15212, 110291, 87709, -31423, -51561, -46854, -27101, -71810, -130120, -93859, -2271, 59351, 70889, 30662, 21477, -42270, -115535, -174705, -163178, -152305, -40665, 18359, 8896, 44346, 82665, 40267, -39281, -133166, -161582, -142123, -111808, -101959, -108730, -19991, 19304, -37646, 64427, 124565, 53439, -158218, -195163, -78252, -73890, -16772, -100707, -128460, -39647, -11129, -32935, -53935, -93918, -26158, 17286, 63169, 31017, 49067]
19128D9067j5285q838J4371m1034l9660O3916R483K000k4602n7469l0907L7786
19116d1172O1470k1158r9314N808N2273l1716j23765n8130J19974R2480q0128
19105a23378q6500L3514J4034J19918Q6911j4750l6030O3079j13217r1191Q2315
19094f5295Q3880J13865M6268j84260r0012n2829n1801Q4563O4146P878q1973
19083a25570j09200J07316M7791O0541r7J7877M8590M1744n5106n6454j3313J8965
19071a6916Q2985j14104L7835L4529k0836r1043p589K5321N102L6230K6928P225
19059E667M4756j3230m3178R9681R5175m2307j22382O7134q6154m4612k0661j2136
19047g2247o5587J8279M8978m9205j44384Q1904J18175m1274L3733N8207R2749
$$ y = [49067, 33782, 24944, 39315, -1719, -41379, 22537, 32020, 34020, 9418, -48051, -78958, -41172, 20298, -860, -100174, -94366, -42093, -73809, -197574, -255704, -135730, -43250, -123378, -209878, -176364, -162330, -42412, 44499, 29749, -6281, 56798, -56419, -147610, -65295, 18585, 132450, 178718, -5542, -95554, -148383, -200184, -115621, -51475, -43597, -125570, -234770, -127454, -79663, -19122, -19219, -1342, 47248, 88992, 33886, -22568, -35881, -16916, 66069, -48035, -10200, 24329, 3493, -87550, -95139, -69818, -64716, -28486, -1558, 5667, 50423, 37193, -5985, 93696, 188871, 146564, 24182, 91316, 5162, -39450, -60111, -72247, -137834, -119555, -70577, -119782, -264166, -182262, -64087, -105361, -71628, -13421, 79328]
19036G9328j14184q4183L8735K29566R9367j90991j00653O5080L4967m3364j337
19025A2331J5535O0245O5854m4905j02764j7416p1509L1678K9345J6321J24647
19014A19362k2522j23816p144O3201j6022O741M4415O3799o6748n4565k6200n2772
19002g2271p5977N8229J8900K1563M2012k9325n3831O7810L1860M8186M4887j4421
18990H7622j14825o0806L2816P1457J53705O043j77985j33405k3118l5955J57055
18979c7396O7598K3477l4190L1652k0792J267R41K670l7735j66358J22790K7122
18967a8954J3191K2410K1448k1866j29482O2272J12475Q5084o8539q444j09279
18956c9684m4011j2724n6013J20170J30236j2541j913r4288o3063k058L3813o8644
$$ y = [79328, -34856, -119039, -80304, 149262, 248629, 57638, -43015, 22065, 57032, 13668, 12331, 27866, 88111, 153965, 109060, 6296, -11120, -82629, -50951, -21606, -5285, 119362, 96840, -26976, -34120, 29081, 13059, 19800, 64215, 128014, 61266, 6701, -19499, -72271, -148248, -90019, -71119, -49556, -7544, -36869, -90700, -22890, 8970, 57156, 102043, 87622, -27203, -88009, -55193, 16264, 169969, 176012, -1973, -135378, -158496, -194451, -37396, 30202, 53679, 19489, 51141, 30349, 31616, 32557, 35227, -2508, -168866, -46076, -18954, -5763, 16647, 38095, 16229, -113253, -50981, 61494, 146578, 78039, 69595, -39684, -83695, -96419, -152432, -32262, 97974, 85433, 83520, -10768, -73831, -75889, -42076, -110720]
18944a10720M9471J03488p0078R9516R5943o2925j41187j26695m7172k9242l111
18933b42712L9986M3702O843P9112M5847J05742Q380j82913j16681M1784j8528
18922a89438R0674N4896O398M6244J22948l1081q1053r8290j25632o7671O5860
18911b06145J70905O5447n6018m328M1789M4579O240J6206O9174J93p6325j36435
18899f4718K8260M0780J4914j7124j24856l5506k1709p7872L8242K1648J25806
18888g2135N4867r3901r8080N5712J38499O7322o3831n9579k455o3990j00160
18877b37731n8950R8863j5029O1114P3681J57061K4993L5011m9072K2305j01434
18866A0812j17557K7075O7674J3099m3K2561K9320J01927k1212p1322j2718n7121
$$ y = [-110720, -61249, 42239, -27839, 71677, 167620, 104695, -36492, -163187, -210359, -239601, -242712, -202726, -159024, -152181, -73069, -27222, 78520, 86900, -96013, -212694, -170910, -189438, -98764, -43868, -37470, 8774, 131722, 100641, 19588, -78702, -204334, -272005, -206145, -35240, 30207, -25811, -30139, 11650, 56229, 62469, 78675, 147849, 148042, 71717, -64718, -36458, 4322, 19236, 2112, -122744, -158250, -179959, -257831, -219589, -197941, -72135, -17268, -111169, -209249, -153537, -15038, 52284, -11547, -71126, -73581, -137571, -237731, -296681, -197818, -212847, -151733, -78052, 79009, 104002, 139013, 89941, 112246, 10812, -106745, -79670, -11996, 1103, 1060, 23621, 52941, 154868, 133656, 62334, 49616, -7505]
18854g505o7835N5344M2812L4296L6229n8450j43296J2543M3723K3332K5430K6063
18842B2686L058m7996N2565j8701n6058l5279R2288L2106j05293O637P199k643
18830d9431l381J3585L4588J29693N0384n6882q1619m3667J616O6932K3821j9305
18818F6334j32801m2464l1835L9187R9965q507J0750m6732L8356m394J701N3792
18806D3352p7103j52260m8266M6032P7217N7453l4808m1736K172J2738J3648J63433
18794F1872k6213o8908j62394R7922J14097K0957l9159k6028m6305k4377j6963
18783a15499R3534q0812o6794K7149K6715J14557O3634o0201M7160j7434j15309
18772h3300n754K7724j0416j568J0335k1714j46635P6929J53102R6762K1396k11923
$$ y = [-7505, -75340, -19996, 22816, 57112, 93341, 34891, -108405, -95862, -52139, -28807, -3377, 22686, 25744, -22252, 30313, 11612, -44446, -79725, 12563, 44669, -60624, -53987, -46788, -49431, -52812, -39227, -4639, 125054, 175438, 118556, 36937, -6730, -5114, 61818, 85639, 66334, -66467, -108931, -140766, -101579, -1614, -10121, 629, -46103, -7747, -12141, -10440, 43352, -33751, -186011, -234277, -188245, -111028, -53575, -88383, -130119, -127947, -115209, -101561, 61872, 35659, -33249, -195643, -97721, 16376, 37333, -1826, -27854, -74159, -98536, -115499, -21965, -102777, -169571, -142422, -115707, -1150, 62484, 2283, 49443, 32009, -83300, -89054, -61330, -71746, -73314, -62979, -84693, -231328, -154399, -1297, 95465, 116861, -95062]
18760i5062j30173J00908R3200k7189P0921p8971M4208Q9356l3715J7713p1966
18749b0770o7572L0790P4430Q7864m9212o7896N036O2177L5037k1372j01764N0976
18737A7724l1973j7492k5533j13394M8815j7010L0080Q3613j8689N0256k0636
18726a4239N5739M140o4576k3586Q8165r6426n176J10171j3547j3757M445o254
18714B5099l0613j04116J6133J84204o7137k8586O5828j16109J4961K5913M8565
18703C4142L2638n8036l8398N3851L7778j4397O2563m8577p7361m2022q0027O7951
18691f9895K23227r3243r339j8710l1202K6349Q9725J41239R021j37212j5665
18680A14295n9656k7685P0033P854r8841o3578N5829n3361m2086n4461j15390
$$ y = [-95062, -225235, -124327, -31127, -58316, 12605, -66366, -22158, 67198, 33483, 51196, -20770, -88342, -57552, 16878, 104742, 55530, -12366, -7330, 54847, 89884, 68512, -33252, 17724, -14249, -31741, -57274, -170668, -121853, -138863, -108783, -25170, -43859, 6397, -14239, 41500, 45640, -18936, -42522, 45643, -50783, -55959, 54212, 40665, 26908, 31353, 25099, -5514, -109630, -93497, 90707, 23570, -5016, 60812, -55297, -40336, -14423, 34142, 66780, 8744, -29654, 24197, 61975, 47578, 110141, 61564, -15797, -57819, -137846, -69895, 153332, 60089, 50750, 32040, 838, 27187, 116912, 258151, 267172, 129960, 114295, 54639, 26954, 96987, 104841, 6000, -57578, -1749, -55110, -97196, -151657, -267047]
18669b67047m4985J43809N5895m2006K1458N5036q0827R855N8153K4668Q9542
18658B3551K1863J7928J3315j15281o1101J7634M0897R372O36l9302p2986K4156
18646a19318N9607j57342j06343J21212J14414m708m0159K0086N6675O1027O8063
18635G3214n2873o2955r20K0939L9202N1484p4934j30475o7963L8666N9166N7460
18623d9989k473K8156m4032k073O6593J3135j83783N2174L6205k9649l6582M8743
18611a03575k122J3504O4726j3000j26208k1492O5606l392l4822J56417L1521
18600B7163J5110L495k5459k9035P350l3823K8655J0721m962j09621q4173N9926
18588a34653K37N4159N4423K2861k5275P5094P108n2358J5578l0500R759Q7408
$$ y = [-267047, -312032, -168223, -112328, -154334, -132876, -77840, -158667, -148812, -90659, -65991, 23551, 45414, 63342, 76657, -38624, -99725, -82091, -41194, -31822, -31186, -70488, -143474, -119318, -59711, -217053, -323396, -202184, -87770, -92478, -132637, -112551, -55876, 5151, 73214, 20341, -42614, -43534, -22595, 16607, 68091, -6843, -137318, -205281, -166615, -107449, -49989, -52462, -24306, -68338, -70411, -3818, 9317, -174466, -122292, -86087, -115736, -152318, -103575, -105697, -92193, -27467, -40467, -166675, -188167, -122561, -125953, -160775, -4358, 27163, 42273, 45768, 20309, -8726, -1376, -35199, -6544, 4177, -785, -110406, -194579, -134653, -134416, -80257, -25834, -2973, -28248, 46846, 53954, 1596, 17174, -13326, -3567, 83841]
18576H3841k3339n5181O954J51048J0367q4740N8714p891M1723l1279j25262j12062
18564h7107O8211K738n2875o2213j6705p9758N0122J9742k947Q4482M1228m5639
18552h0721J3161m0600j04403J00613m115O9577o893J8519P358M4475n6622q5228
18540a24879J16613P7079o631J5807l9243J4819l1771R6683k2717l1685K2499
18529H6574R505j21829j08371o9985Q3630l49j21828n6671J11379n2745Q493J68358
18517f3839R0281j25257m732l7861P0138J20646k1977j398j0333j81283P6088
18506h9527N8880J761R7345m0626K5569K4824N0040k3232j28510L0517O668n727
18494G982j09498o6311J25920P0143n1926j617p6886q8271M0265O2883O7092J40963
$$ y = [83841, 60502, 5321, 12275, 163323, 173690, 88950, 147664, 139773, 181496, 150217, 24955, -87107, -18896, -16158, -69033, -131246, -147951, -227709, -177587, -157845, -160792, -76310, -35082, -80721, -67560, -108160, -212563, -111950, -116065, -46488, -53381, -34862, -27504, 16971, -39651, -124879, -8266, 68813, 62182, 77989, 38746, 53565, 21794, 118477, 95760, 64075, 86574, 96079, -25750, -134121, -204106, -120476, -120825, -242653, -299324, -187945, -240690, -232197, -63839, 26442, -98815, -103547, -141408, -71270, 49376, 27399, 26001, 15668, -165615, -89527, -30647, -28886, 68459, 27833, 53402, 78226, 128266, 105034, -23476, 7041, 13709, 7982, -101516, -167827, -41907, 28236, -23690, -25307, -102193, -190464, -150199, -87316, -20224, 120739]
18482A20739q2783N6638k0479j37527Q310P1279N6398j14143k4799Q5850M4960
18471F4443k0329r6562J9509N909N7545O3551k7737Q2112L1798R502Q8318Q323
18459B86382m9650j74555r6298O3493K3895n2341k9850J4901m156j0121J03793
18448G5493J08127p86j12450j14412n8461N398l2715j2572m5710M9484K8048l2131
18436a42687M2166Q8338N8235J641j23018J2822N2877K7648O9600n7942j44668
18425a14988N0176J0962j42296N1915R7447N6303L882m8655L1592j336o9308K2014
18413e2292N7663N2904j5053j76022N4540M9351Q2848k1029j30921N40L3193R7058
18401C2780K4782r1864K0963J8629L5756j01935j2960Q7980l2629L1419K9066
$$ y = [120739, 37956, 94594, 74115, -63412, -55102, 16177, 72575, -41568, -66367, 19483, 64443, 44114, -52448, -32939, -27030, 30515, 94066, 66329, 148441, 180239, 189741, 278059, 286382, 236732, 62177, -34121, 29372, 53267, 926, -28924, -14023, -18179, -28300, 75493, 183620, 182834, 70384, -44028, -102489, -97091, -129806, -142378, -188088, -138604, -110556, -142687, -100521, -12183, 46052, 47693, -75325, -62503, -9626, 18022, 87622, 29680, -114988, -64812, -53850, -196146, -144231, -46784, 9519, 13401, -35254, -3662, -4998, -74306, -52292, 5371, 58275, 43222, -132800, -78260, -28909, 53939, 32910, -98011, -97471, -64278, 32780, 57562, -34302, -13339, 5290, 41046, -60889, -73849, 14131, -18498, 12921, 41987]
18390D1987n7913O529q180M1067j1826l0340n7751n8873R8782O3952J2585o9853
18378b9834M1366O7919l7778n6280L6510l5473j8698l3622N4069J1724K4253J21189
18366A45345J2660R4721j6799j37485j84004k0991Q8053J09940Q1272n1182m6849
18355G4681K7258l7550l0775m3642k0104l3322q1486O9084R8805K8876N9435M0136
18343A51396j61588j3381J05427L8571K0494M7510R905n8289q7327P669J27382
18332A87769R8007M5585n4487r4442K5612j2543j27398q9400k4665j7536M9033
18321a4465O7282k3919m4774O8621p1020l1865p615l632L8566P4180L0165N370
18309H6894R0840L1022L2302p0549j06375n2554j85325l2205P1601R6316J23155
$$ y = [41987, -15926, -9397, -17577, 23490, 11664, -18676, -76427, -135300, -36518, 27434, 40019, -29834, 11532, 79451, 41673, -14607, 21903, -13570, -32268, -65890, -11821, -97, 24156, 145345, 158005, 252726, 235927, 98442, -85562, -106553, -18500, 91440, 172712, 121530, 74681, 101939, 64389, 33614, -10028, -30132, -63454, -144940, -75856, 22949, 51825, 111260, 151396, -10192, -23573, 81854, 120425, 140919, 188429, 198334, 140045, 52718, 60387, 187769, 285776, 331361, 276874, 182432, 208044, 195501, 68103, -21297, -45962, -63498, -14465, 52817, 28898, -15876, 52745, -18275, -50140, -57755, -61387, -22821, 51359, 81524, 86894, 177734, 208756, 241058, 170509, 64134, 11580, -173745, -205950, -134349, -38033, 85122]
18298H5122l0321o6806J7576L5190m7982R3302K6516J2529m1410Q2069O1072k5154
18286B01703k3884k8719k4137k3089J7006l3657j09999R1299O0171K2902j2795
18275A36801O0058l6024l3225r191J6450n7671p4675k9418Q8083Q121j16514j73808
18263b21013l6808J45643J53331L8352q0109j70246L4863r3677J16680J17982
18253D998o555o7313L6678M7096l9804j4542K4962L2571Q2105K6521O5936o1396
18241A31257j85420n4367Q1969J54932n8548m3112r9229o3750J10546N9227q4161
18230e0656j9999k5188P1658P5333m968k1525m5317m104n8953M6647j5205j7507
18218f9784J7369n2655l7674J63553j5448j34972J42507N9883o5570L6520J2508
$$ y = [85122, 54801, -12005, 5571, 40761, -7221, 86081, 112597, 125126, 83716, 165785, 226857, 201703, 177819, 149100, 124963, 101874, 118880, 85223, -24776, 66523, 126694, 149596, 136801, 196859, 160835, 127610, 118419, 134869, 77198, 2523, -26895, 61188, 69309, -47205, -221013, -257821, -112178, 41153, 79505, -604, -170850, -135987, -229664, -112984, 4998, -1557, -68870, -32192, 14904, -24900, -39442, -14480, 18091, 100196, 126717, 192653, 131257, -54163, -108530, -26561, 128371, 69823, 26711, -72518, -136268, -25722, 33505, -50656, -70655, -95843, -24185, 51148, 46180, 24655, -20662, -24766, -83719, -37072, -52277, -69784, -52415, -105070, -142744, 20809, 5361, -129611, 12896, 72779, 7209, 43729, 56237]
18207E6237m393j37759Q774K3816k0194N3920r662M6771P408r1820q0792q1536
18195b29230K097N4747L1665l0299j7798l6840Q6209N5895L7789p9218k1489n6149
18183b02621L6886J03599K6636k6772k0016q4104O4623N8237L0762j7001M970
18172b4801r4465K0513L5138O2501N6689j40031K3501Q2534j78p294L3491J9014
18160F6612n3188k2978M3116M3028M6947P9153Q5516j15160k00908K9074l497
18149b285K5755M5142q9426Q4570N0578K8105Q4420q2933j2056m1665m7909J5110
18137E7406j8189m3097k8027L2766m745O2764k0960q9279r6356K212L6533O6397
18125d2575Q7471K4691J66994j2108l5956j44900k1098m0754q1058o6431n5351
$$ y = [56237, 51844, -85915, -77141, -53325, -73519, -19599, -29261, 17510, 24918, -66902, -147694, -229230, -227133, -172386, -140721, -171020, -188818, -225658, -139449, -83554, -45765, -124983, -146472, -202621, -165735, -62136, -35500, -62272, -82288, -166392, -101769, -43532, -12770, -29771, -24801, -119266, -98753, -63615, -1114, 55575, -84456, -60955, 21579, 21401, 14107, 47598, 66612, 13424, -9554, 33562, 76590, 123537, 202690, 288206, 173046, -27862, 1212, -2285, 23470, 68612, -20814, 63756, 114334, 142439, 226859, 143926, 131870, 90205, 42296, 57406, 39217, -3880, -31907, 859, -3886, 58878, 37918, -51361, -147717, -145505, -108972, -42575, 44896, 69587, 236581, 224473, 188517, 43617, 22519, -18235, -99293, -165724, -221075]
18114b21075M3682J64829L4384L7847m5563l9426Q6599q3476J9286K24338O0849
18103B82274P8513K9143K5476N6871q6629n6544p9029M7492Q7834n1220j2058
18092C22123r3246Q3784o057J6669Q5812P2519r2368R767J0076j08236p0340J32315
18080C62818p2144j07670m0180j1196O8223k4296k4629j40723j33736P9436j6778
18069f0875M6206K0290o1394M2063L9506M5927J3310j7565l0835j240J32432J44653
18057C12478L0190J0033P959j6555n3994J0136N3924J5359K1841R2132J2862j54981
18045C41384q8769j14340q5624K3594K1662K9871j45379j34401N2701O5102j3247
18034d7446j3588j0300J9492J7356L2938k18624r2116Q6131O5261M4188N9451
$$ y = [-221075, -177393, -12564, 21820, 59667, 14104, -25322, 61277, -22199, -2913, 221425, 282274, 360787, 389930, 415406, 472277, 385648, 329104, 250075, 297567, 385401, 334181, 322123, 228877, 312661, 306604, 323273, 409085, 481604, 389236, 399003, 409079, 300843, 230503, 362818, 290674, 183004, 142824, 131628, 199851, 175555, 150926, 10203, -123533, -44097, -60875, -14669, 5621, -55773, -13710, 25796, 71723, 85033, 67468, 36633, 35393, 167825, 312478, 342668, 352701, 360660, 344105, 290111, 300247, 354171, 369530, 391371, 483503, 496365, 341384, 252615, 138275, 52651, 76245, 97907, 127778, -17601, -152002, -99301, -34199, -47446, -61034, -71334, -51842, -34486, -1548, -220172, -312288, -226157, -160896, -116708, -57257]
18023e7257N4961M3000K3015N0893o3060j7963j46420J9774N1952j7179l6567
18012i4851Q6605K3132j16935j0122P4611R2593J02993N8934o8454N1369J11015
18001C10890n6821j7013J15397O9777P3504n1099K6157J89869L9022o9710p0326
17990E59647n4188n3937o9300j12878r000J07939J08863q666k8906j04950r8465
17979B36159M6983m2402j228k2483K3964J5348K5202k2881j65649m5510Q5439
17968A32942k349Q2991m2350j8503p4366J2589m9024K9767R9557R7008K4651L621
17956B96534J7912P7262M0126q3984j3469M300r4571K450P2925O1505o5026J3866
17944C29830k6105M080k607O1096P5766j38993j18704p712k4377l0643Q1361k3247
$$ y = [-57257, -2296, 40704, 63719, 114612, 51552, 33589, -112831, -93057, -41105, -58284, -94851, -8246, 14886, -102049, -112171, -37560, 55033, 158026, 216960, 148506, 199875, 310890, 254069, 237056, 352453, 422230, 495734, 444635, 470792, 660661, 699683, 629973, 559647, 505459, 451522, 382222, 269344, 260344, 368283, 477146, 468480, 439574, 334624, 236159, 283142, 240740, 239512, 217029, 240993, 256341, 281543, 258662, 93013, 47503, 132942, 130593, 213584, 171234, 152731, 78365, 90954, 41930, 71697, 171254, 268262, 292913, 296534, 314446, 391708, 431834, 347850, 334381, 338681, 244110, 246560, 319485, 380990, 315964, 329830, 303725, 307805, 305198, 366294, 442060, 303067, 184363, 176651, 152274, 121631, 202992, 179745]
17932A79745n3043J3218l7535k7182p332O610Q0319O3369M787Q0587m0168r1097
17920A72278n4789K5014n8939M9987Q929q7561m1617O2503M9162o0984M7332r2671
17908A8644j42152J30758O4998l9499J31993L414j09653m9390o4733o3040M9061
17897f9599L7800M4244Q9906O3222n5461j4542L4075j03836l1367J81870n6403
17886A19909j7583P6769L0074n5337j6143n7659K7173O3645j9700j16238K9988
17875F4898Q7945p2146j63902j5990O4360j6098P2319L2726k9800R686M0653k5775
17863D8876j78955O0537m3749J3411K3318J6175m9524M595M7431O1243J43652
17852A47010r7252l3654M3254m542m5633L0652J26902M7464l156j03307k4560
$$ y = [179745, 126702, 139920, 102385, 75203, 67871, 74481, 154800, 218169, 222956, 303543, 263375, 172278, 117489, 142503, 83564, 133551, 142480, 54919, 13302, 75805, 124967, 63983, 111315, 18644, -123508, 7250, 72248, 32749, 164742, 168156, 58503, 9113, -55620, -118660, -69599, -31799, 12445, 102351, 165573, 110112, 95570, 129645, 25809, -5558, 176312, 119909, 102326, 179095, 209169, 153832, 137689, 80030, 107203, 170848, 151148, 34910, 64898, 152843, 80697, -83205, -99195, -34835, -50933, 21386, 54112, 24312, 33998, 74651, 48876, -130079, -69542, -113291, -99880, -76562, -60387, -109911, -105316, -57885, 3358, 147010, 49758, 16104, 59358, 54816, 9183, 39835, 166737, 214201, 211045, 107738, 83178]
17841H3178p152L4703J379R459q2926j13722M525J14469o613l3744m2378L0970
17829g852P8968L9232n6643m0692N7343J49769r6990l906j4124j14763n6162j02531
17817a68351n6452J48503N9659m0001N922L2353N3921M2025l6890r5105n4843
17806a09259p3191J15511J26170m5445K7114m510k974L1253Q964j1224J937n9582
17794D764j06634j28275L4043J07972M233J2061J34946K1568j7238J13705o8096
17783A13049j12960J9316k1582j10231m4425k5755J12648P8652j6072l422r6707
17772a07489L7503J6466P1656J29377j14974j20142M3875Q4960n8038o7520R4054
17761I728J8413J7747j38720m1753k1827o9630O5388R1814j7776O6173n9617k8102
$$ y = [83178, 76026, 110729, 112108, 121567, 38641, -75081, -70556, 43913, 37300, 3556, -38822, -7852, 71116, 110348, 53705, 13013, 70356, 220125, 123135, 119229, 105105, -9658, -65820, -168351, -224803, -76300, -16641, -56642, -50720, -18367, 35554, 77579, 40689, -54416, -109259, -182450, -66939, 59231, 13786, 40900, 36390, 33416, 64669, 73633, 62409, 64346, 4764, -101870, -230145, -196102, -88130, -83897, -71836, 63110, 84678, 67440, 181145, 113049, 89, 19405, -2177, -112408, -156833, -182588, -69940, 8712, -7360, -10782, -107489, -69986, -53520, 18136, 147513, 32539, -87603, -43728, 41232, -16806, -84326, 9728, 28141, 45888, -92832, -134585, -156412, -226042, -160654, -68840, -86616, -20443, -80060, -108162]
17749a08162L5307L9863K4152N7336j9888N405n3938q16O0147m6325j4048J18356
17737I7389L0084j07405o2220j14183k9171J0861K6622m0068l5397L6456J07070
17726g9962M6235n3703P6598R9111m0427R751p7243l2233P858M424j34044q7011
17714b60646Q0272m5443n9191P4853J0740p9773J11009J68670J52182J7167q0991
17703H8849j70926p6533O353J9333J19620J00710k8391j26806n7829M5266J06247
17692B5893O036q1730k2157J3895m4513J5023O3333J03283p5099j09420P458M0536
17680e7462n7326k8324K2592L1499M3827K5220j05285j1423P3811O625N7425m1513
17668d0334J13842J14716n8353J0769q4281L4251R3239r9574r6316K4958J11888
$$ y = [-108162, -72855, -32992, -8840, 48496, 28608, 34013, -19925, -20741, 39406, -6919, -20967, 97389, 127473, 20068, -42152, -156335, -185506, -174645, -148023, -188091, -223488, -187032, -79962, -33727, -87430, -10832, 88279, 47852, 57603, -19640, -51873, -44015, -39591, -173635, -260646, -180374, -225817, -285008, -210155, -199415, -279188, -168179, 491, 152673, 169840, 88849, -82077, -158610, -152257, -132924, -13304, 87406, 59015, -67791, -125620, -80354, 25893, 31929, -49801, -71958, -58063, -102576, -87553, -24220, 79063, 3964, -105456, -97998, -57462, -114788, -143112, -120520, -89021, -45194, -19974, -125259, -136682, -62871, -56246, 1179, -40334, 73508, 188224, 129871, 140640, 56359, 90610, 183849, 84275, -12041, 12917, 124805]
17657A24805j970j18201N959N4789M2147N2111l901j0420l3628o6082N2007K086
17645I9702o2926J1685o0025N7123J40881k8501m8374n2829j5168K16211k2034
17634B35745k07016r6559o516R6790l4326J0069n8310O0713O2173L1248L813K1800
17622A19624J5382m53r2842j13744N8365J4805o264j06421r8772o5239P0973M0985
17610a63601K906Q7639K3391N4501R9967K4764j00250j10659M6338L9411P1106
17599G5513K0334k0593o0090M2936J46390j10769j37404L1291J26698l9808r3273
17588a8775p9505j5850R959q249J40331p2637j25614J7097J51540J49692P8481
17577B26470p5371j82010O0636J08380k7608m5955M5805q6492J1461K0334N1844
$$ y = [124805, 122835, 4634, 10593, 65382, 107529, 159640, 155739, 145319, 111691, 45609, 97616, 99702, 36776, 48461, -11564, 45559, 186440, 157939, 109565, 56736, 41568, 257779, 235745, 28729, -67830, -74346, 22444, -11882, -1813, -60123, 590, 62763, 94011, 97824, 119624, 135006, 134553, 41711, -72033, -13668, 1137, -5127, -111548, -210320, -275559, -204586, -163601, -160695, -73056, -49665, 4836, 104803, 129567, 29317, -81342, -35004, 4407, 75513, 95847, 75254, 15164, 58100, 204490, 93721, -43683, -12392, 114306, 74498, -18775, -98280, -114130, -104171, -112420, 27911, -44726, -170340, -153243, -1703, 147989, 226470, 151099, -30911, 29725, 138105, 110497, 64542, 110347, 23855, 35316, 55650, 107494]
17566A07494o3190m4812p0110m0708J52319P0015M9324r7501r7924P6713L4535
17555G6155j20779j70085P574J1269o7421O3472R4507j4718R6295N7686J5815
17544D9770J4279N590q3774l6930K2255r4083P9598J86749L4405j5667q4996m5700
17532C1496n264K0812N9287J6519r3699m2539j9374k9247n2416N3117j8929k3805
17520a04042m5374M4134K4809Q7261l2507o2068k3746K6567L9690j4742N0706
17509i312J3124J85946m8230q9788N621n7287j15267M1153l6299N4087J66675
17498A10423R3576m8080o8260r5278j1587j7089p6717J09515M8673J40310M5991
17487B31477q7229o2811J9556J18340R197q8257O9737r361l5465k5955J3584k3939
$$ y = [107494, 44304, -508, -70618, -111326, 40993, 111008, 160332, 62831, -35093, 41620, 76155, -44624, -214709, -207135, -195866, -263287, -199815, -105308, -120026, -23731, 33955, 49770, 64049, 69639, -14135, -51065, -28810, -122893, -43295, 143454, 177859, 162192, 77196, 31496, 26232, 47044, 106331, 122850, 29151, -13388, -32762, -62009, -114425, -61308, -80237, -104042, -149416, -105282, -80473, 6788, -25719, -87787, -111533, -84966, -45276, -60018, -9312, 3812, 189758, 141528, 51740, 57361, 74, -115193, -74040, -110339, -56252, 110423, 203999, 155919, 87659, -7619, -19206, -36295, -113012, -3497, 45176, 185486, 231477, 144248, 81437, 100993, 219333, 228530, 140273, 210010, 200649, 165184, 139229, 152813, 128874]
17475A28874k5109M9622L3036k8652q920j09674p4930K9076M0479R623Q125k9797
17463B1753l4449N3200M0128j05404J0882J16656Q765m3982o8634K3037k1770
17452A82m3016J26733K7804k3086j3776m9516K7174O1706J7272k7807k6097M8511
17440A26084q4579k1896M8148J5258p248K4520j522m9623M1871j82123o5720n0285
17428b07115n0316K17055J58032M0243p1427o3260o1634K1884L5798r522k7888
17417a8150J4349L4403k954k4233J350k6187j6942n8725j5965k403J01755Q1992
17405F8290k9685P6219P0134j50422J42793L9488n0229o8956k1194r2264o4619
17394h0445j835m0142j1153P2807K7887l6435R6528J06402K6833p1775j30090
$$ y = [128874, 103765, 153387, 186423, 157771, 148851, 39177, -35753, -6677, 33802, 43425, 51550, 21753, -12696, 40504, 80632, -24772, -13890, 102766, 111531, 67549, -1085, 21952, 182, -42834, 83899, 111703, 88617, 74841, 25325, 52499, 114205, 131477, 103670, 77573, 126084, 41505, 19609, 67757, 83015, 75767, 100287, 98765, 49142, 91013, -91110, -156830, -207115, -257431, -40376, 117656, 157899, 86472, 23212, -38422, -16538, 19260, 9738, -18150, -3801, 30602, 27648, 3415, 4765, -21422, -38364, -97089, -113054, -115457, -13702, 68290, 38605, 114824, 184958, 34536, 177329, 216817, 166588, 97632, 76438, -15826, -80445, -82280, -122422, -133575, -60768, -32881, -69316, 27212, 133614, 160447, 88672, -41418]
17383d1418j02758o0584l7644n1737J00521O2237J8593n8937J1737r671M3336
17372a26325J34987L2699j28725k5214M1053O6722J38636K2281m9579j988q9628
17361A4919L8334K2797k6225N0175J1454j11941o336J4850n5372K6939L1805K4416
17349C5815j8262j829n2410r568m7367k7143R2585j0874M0121n6278l3237R9200
17337A0753K2805J8537k3281L7823j9486o013L3888l3086K3201m9748j9822K0007
17325A5578K4213n705J17105m8777j17384O6026j9199n9780k4302P1921p3170
17314e3474j9649R8188K1141m6014N853J3789m312K5595L8103j9190K541l8480
17302B4091j1506N1808L7979P3441L5540l4175j27801q2107o5180j0347J9131
$$ y = [-41418, -144176, -204760, -242404, -294141, -193620, -131383, -112790, -171727, -159990, -169661, -126325, 8662, 41361, -87364, -112578, -71525, -4803, 133833, 156114, 106535, 104547, 14919, 53253, 76050, 49825, 100000, 111454, -487, -6823, 8027, -47345, -20406, 11399, 35815, 17553, 15724, -36686, -46254, -93621, -120764, -28179, -39053, 1068, -55210, -88447, 10753, 33558, 52095, 28814, 66637, 47151, 41138, 75026, 41940, 65141, 15393, -4429, 15578, 39791, 34086, 151191, 102414, -14970, 51056, 31857, -27923, -52225, 19696, -53474, -73123, 25065, 46206, 192, 6045, 19834, 15522, 41117, 79220, 60030, 62571, 24091, 12585, 64393, 102372, 175813, 211353, 177178, 49377, -32730, -97910, -108257, -89126]
17291h9126k0408N2477q4799n891L9733O1070N8066j18170l2695j6520J88972
17280C2709J21524p2949l0421q9756p3571p353j2273L2422p6693J20150J43432
17269H7221l7198j19184K7973R2266K4704R0049q13j13594P6662L707j41507o0741
17257g0455l5846O7490J70300L1674M5825l0288j39j19087j55954J6697O4458
17246a5325J3093p5862J38647P720Q2181K6295n3378r0961k8037j2277l1526Q738
17234c0692k5809j4296P7695K8289o5219J9265R5486M4186k7018Q0858o7012J5478
17222A31211j1382n8622q6936j853n4889J3970L2382j1843J375O9646J41607M5867
17210B10533p7044k8805l8935l3822N5898p5192M660N8394J16944k1065n3775
$$ y = [-89126, -109534, -57057, -141856, -147747, -108014, -46944, 11122, -107048, -139743, -156263, 32709, 154233, 81284, 50863, -38893, -112464, -119817, -132090, -99668, -176361, -56211, 87221, 50023, -69161, -41188, 51078, 75782, 165831, 165018, 51424, 128086, 131793, -9714, -70455, -106301, -38811, 131489, 163163, 208988, 178700, 178561, 59474, -96480, -79783, -15325, -2232, -78094, 60553, 68273, 150454, 176749, 123371, 32410, 4373, -7904, -39430, -30692, -56501, -70797, 6898, 35187, -30032, -10767, 84719, 128905, 101887, 182745, 115733, 131211, 119829, 61207, -25729, -27582, -82471, -68501, -36119, -47962, -46587, 23059, 164666, 210533, 133489, 104684, 65749, 31927, 87825, 12633, 17293, 75687, 192631, 171566, 117791]
17199A17791P497o208j12218n0677N2624R7156j9071r7521K6813N5931L9771j46180
17187c4292k7805k5265n1021n1572K5886p2946o6976j01127J34948J82934J33800
17176D6564m692j07122j32140Q5578J40634P1456m9669m2708J8753N9381p1138
17165A4897l0516Q3772J3549p4562o8741J5060N9392l9026q8961p9408k077J88127
17153h494n2240O726L2651L2661M5892K3771q0535l608R5745p5136j56162K8742
17141a09987L7037K1130L8358l5811o2356M4747K8275R5178P6760M9294K9426
17130B12051o3731J9419j16634O1373j4526p0308n5144N3434P9669k7916p2273
17119E414r7401m7388J55305J16418j50046n0261Q8483J02421j1961q8816J1315
$$ y = [117791, 125288, 119080, 6862, -43815, 8809, 105965, 86894, -10627, 16186, 72117, 111888, -34292, -62097, -87362, -138383, -189955, -164069, -237015, -303991, -405118, -270170, -87236, 46564, 41872, -65250, -197390, -111812, 28822, 100278, 50609, 7901, 26654, 86035, 14897, -15619, 68153, 81702, 7140, -61601, -46541, 12851, -26175, -115136, -194544, -196621, -8494, -60734, -54008, -21357, 11304, 57196, 80967, 432, -3176, 92569, 17433, -138729, -109987, -72950, -51820, -13462, -49273, -111629, -66882, -38607, 56571, 133331, 182625, 212051, 148320, 167739, 51105, 112478, 97952, 27644, -27500, 25934, 105603, 77687, 5414, -91987, -139375, 15930, 132348, -17698, -67959, 20524, 122945, 110984, 22168, 33483]
17108C3483m3035N1884l2149N9807J14722P1716k0117m9502M0203j4260n8587
17097A54165n6658k5322K3299m2155K701L4502j6460j9199J1382o2086q1386o8757
17085a45974Q1089K4470J09600N991j17030L6227l197p4475k3591P0845j6197
17074e2242L1689r5128K0222Q8922Q5860k1737M6255M7961k7246r9280o4251p4485
17062a13460q441R6143N736j09586p775N0080J20309M1332l6471j7679o7633r3248
17050a40693Q6095J11264o959p178l3124k3940P4600p4171l5331L2683L8060j9909
17038A397r161L2331l0953j0202l7272j09083O7828J14229l9547J9148J5979j8441
17026c747M1737O1642J9774j78500k8817k2206J16778J42352P562M53j71523o4526
$$ y = [33483, -9552, 42332, 10183, 69990, 184712, 256428, 236311, 186809, 227012, 212752, 154165, 97507, 72185, 95484, 53329, 56030, 90532, 74072, 54873, 66255, 4169, -77217, -145974, -64885, -40415, 69185, 75176, -41854, -5627, -8824, -83299, -106890, -36045, -52242, -20553, -115681, -95459, -6537, 79323, 57586, 103841, 151802, 124556, 25276, -38975, -113460, -121901, -25758, -20022, -129608, -137383, -87303, 33006, 74338, 37867, 20188, -47445, -140693, -54598, 56666, 49707, 42529, 9405, -14535, 60065, -14106, -49437, -16754, 21306, 1397, -7764, 24567, -6386, -16588, -53860, -162943, -95115, 19114, -20433, -1285, 14694, -3747, 37990, 99632, 119406, -59094, -87911, -110117, 6661, 149013, 156575, 157028, -14495, -79021]
17014g9021o5579l3618M5692O019n2785J1104O6845L8797J5968p6183K483Q6605
17002c3673J8103j1898K487m6954m9789j4143L7571J46168J33348j9824j53076
16991H320n7785q4742j8718j128Q4903k6220l2107J48985k3179n3310o180m228
16979f5389O3140k3344l8092K4283J25018L0532n2396j07562l3380L4499L7643
16968e048O358k5561j34209n7176O9907R0254L3265O2259K5512M3654j5445j68015
16956g4245m6647J05791M3011k1015l6264p9778n4184j17916L696M553K9033K8924
16944b15041K8735N6658P8626P3245M3228K7051l5437m6056J8623p5404Q267P0023
16932C2518n8321L1211N3055k8818l010j2250J5347J053n5824P6416J04469M3753
$$ y = [-79021, -144600, -178218, -132526, -126507, -179292, -168188, -101343, -62546, -46578, -122761, -120278, -33673, -15570, -27468, -24981, -71935, -121724, -135867, -98296, 47872, 181220, 161396, 8320, -49465, -134207, -152925, -154053, -69150, -95370, -127477, 21508, -1671, -54981, -61161, -65389, -2249, -25593, -63685, -39402, 85616, 116148, 63752, -43810, -77190, -42691, -5048, 1310, -24251, -158460, -215636, -145729, -55475, -22210, 40049, 65561, 109215, 93770, -74245, -120892, -15101, 27910, 6895, -29369, -109147, -163331, -281247, -277551, -272998, -243965, -215041, -186306, -129648, -51022, 22223, 65451, 92502, 57065, 11009, 29632, -45772, -37505, 32518, -25803, 5408, 58463, 29645, 26635, 14385, 29732, 30785, -25039, 51377, 155846, 199599]
16920A99599j0298m5182r8244k3870R2433M8266j8460J0717j6385m411p0437M3132
16908A06860O2412q3827o7855k4161O1784J11802K169j45734j18097K8947j05969
16897a71669N9733Q3615M7815J360J5541K2558l9896L5828M4953j4718o1188j4778
16885I154k449j95N801K155q4742O4588J02703j9061j2883n0760K7591L5960p0813
16872G049M5666m3053q9780o2477M5457J06397k9510K3091M2417k8706k242k1300
16860f991J0301R6239q5185n5013k5497J3971N7126K5367J21808M6292j18649
16849G9769r268q9146K6640Q3917l106r3082j33175j51871p1829N2222M6499n058
16837b67488J1675P3240L0173K1639O4399R8575J23562P9443p1350j14745o6341
$$ y = [199599, 189301, 144119, 45875, 22005, 114438, 162704, 144244, 154961, 138576, 134165, 63728, 106860, 169272, 85445, 17590, -6571, 55213, 167015, 169184, 23450, -94647, -65700, -171669, -111936, -28321, 19494, 20854, 36395, 58953, 19057, 54885, 99838, 85120, 23932, 9154, 6705, 6510, 12311, 14466, -70276, -5688, 97015, 77954, 65071, 14311, 41902, 77862, 7049, 52715, 9662, -80118, -142595, -97138, 9259, -20251, 2840, 45257, 16551, 14309, -6991, 3310, 99549, 14364, -40649, -66146, -52175, 4951, 30318, 152126, 198418, 79769, 70501, -18645, 7995, 91912, 88806, -4276, -137451, -289322, -361151, -308929, -262430, -267488, -255813, -182573, -152400, -130761, -66362, 32213, 155775, 235218, 163868, 49123, -17218]
16826a7218j11474r3730l4774Q4065R8099P9885J0697o1614R2491L2182q100J0968
16814H1477n2373l1978J7632l1757j8109m1040j04578R290P9445J45413Q2589
16803A36011Q4463N0216K4673k14713j85369M8626J08668O1928j1577j60604N6774
16792i04Q9555O5710j47413j32322j3309L3464M8619J69085J9928q016l0371q529
16780H5497p8803j52820Q7801J48827J4300l5150k9042P1153L8312m3002n3179
16769E3894L3925O0536k5926j03618l7472o6153n5837L890K037J77338Q3150j30719
16757d955k4449J67525Q6211n7396k3097l3418m2188J4041j02449n7098P8590
16746A317j3098m0041j7484P9614M8647M6314M5352M5267j635k4446j02907l8458
$$ y = [-17218, -128692, -222422, -257196, -173131, -75032, 4853, 15550, -46064, 46427, 78609, 70509, 81477, 29104, -2874, 14758, -16999, -35108, -76148, -180726, -171436, -91991, 53422, 136011, 220474, 270690, 295363, 80650, -104719, -56093, 52575, 114503, 102926, -57678, -904, 88651, 154361, 6948, -125374, -138683, -105219, -56600, 112485, 132413, 124397, 94026, 85497, 6694, -146126, -58325, 90502, 104802, 69652, 40610, 111763, 150075, 107073, 53894, 87819, 148355, 122429, 18811, -18661, -84814, -140651, -136761, -134724, 42614, 125764, -4955, -29404, 138121, 224332, 166936, 143839, 110421, 68233, 82274, -20175, -77273, 1317, -11781, -51822, -69306, 10308, 58955, 105269, 150621, 195888, 194253, 169807, 66900, 28442]
16734B8442M8031m5100p1773n3880p1724r2980k8925P0802m4516M5706J37110
16723g8807q4673j5391R7139j028N0134L9123k7565J5618O1916j13115N1159q004
16711a3494M2756N665j6798q519N6445P1677o2633r777q5878j1407O4052J23744
16699A55833m53q4899k4878j3555j20421r0664R8350L9340o8011P7349j19315
16688a51324q3231M6927J07647J00319q3417L2458J01433o462m9023n6094M4857
16677D090j05611L4041R2316M7989L5788J37040n1067j17709l055o3278l1417
16666b0873Q1734k1948j43275m6834O1839J21126J50593K8540j00926j25454k3406
16655c8884J07250J04709j05689j13623J07740j0254o5221Q0460J6420m5843M6238
$$ y = [28442, 76473, 31373, -40400, -94280, -166004, -258984, -287909, -217107, -261623, -215917, -78807, -163480, -178871, -81732, -82760, -32626, 6497, -21068, -5450, 56466, -56649, -5490, -13494, 29262, 34927, 18129, 9610, 66055, 137732, 75099, 65322, -20556, -31963, 32089, 155833, 155380, 70481, 45603, 32048, -88373, -179037, -80687, -41347, -109358, -32009, -151324, -234555, -187628, -79981, 20338, -63079, -30621, 70812, 64350, 15327, -40767, 4090, -101521, -67480, 24836, 72825, 108613, 245653, 194586, 76877, 73822, 10544, -20873, 60861, 38913, -104362, -151196, -89357, 31769, 182362, 210902, 109976, -15478, -38884, 68366, 173075, 67386, -46237, 61503, 51249, -13972, 66488, 82908, 37065, 83303]
16644H3303N066m589N4926J8110q3507p0074P608k7056M67N5228K6553M9817R8364
16631B14216K5662m3892j4939M6558m0961o8530J13959k427p7707j85411j17920
16620a51392J60433J19537n5667n7298K6654L3900o616j24020L0365L4726N0617
16609F1239J1888M8993q0079j09402K47J71318J06755j8930r5083j30555k4113
16598e7722L5855J5378p4450J09633J01873Q1255R420l6470q9238m8831r2964
16587d6261r7854M9307j090k6941L6540k0839J28171N1537P7436n4560O349j5835
16575H5960K1795J3669r5297p6725j4668J85866L6657o5311j08063j441p4102
16564i1660N0401R8841j17089m4397N7895L6400J05655M7847J4066m4452R7165
$$ y = [83303, 88369, 83780, 138706, 156816, 73309, 3235, 10843, -16213, -15746, 39482, 66035, 115852, 214216, 239878, 195986, 181047, 227605, 186644, 118114, 232073, 229646, 151939, -33472, -151392, 9041, 128578, 72911, 15613, 42267, 76167, 69551, -54469, -24104, 10622, 61239, 73127, 122120, 42041, -67361, -67114, 104204, 210959, 192029, 96946, -33609, -57722, -21867, -6489, -80939, 28694, 130567, 211822, 221242, 184772, 95534, 46703, -46261, -144115, -94808, -95898, -122839, -86299, -107138, 21033, 72570, 150006, 95446, 101795, 85960, 107755, 121424, 26127, -50598, -65266, 120600, 157257, 91946, -16117, -17558, -91660, -41259, 57582, -59507, -103904, -46009, -9609, 96046, 143893, 157959, 113507, 210672]
16553B10672j57297j39552m395N2345l3494O3146N9196p4431j13583n9231N1602
16542a45022L3082m4385K4420n5888j4085P9198J17323k8966j0590N4446j8112
16531h579l0465L7387N265K8129j01145j51107j40917k2499K38774N4176m9871
16520a40852N763o1773o1188J49460O0988M3164n8255K192K2633r7331o54q2340
16508b18193O845O4286O1095J6403M2924j6236n6214j2738J5880n7105J0228J26047
16496a6778O6885J8011L9022K4308Q7507K1170L0758j59344o2729l8310Q3066
16485I3566M5536L3151o0157j44368j46214M5899J10355l6909o0082n4176N2881
16474a20518L5031N2918Q5832j2392k0138j9300K8362K3872p234J2350J11789
$$ y = [210672, 53375, -86177, -90572, -38227, -71721, -8575, 50621, -23810, -137393, -196624, -145022, -111940, -156325, -131905, -187793, -201878, -122680, -5357, -34323, -44913, 9533, -8579, -39044, -1657, 3608, 31737, -69408, -220515, -361432, -383931, -145157, -90981, -140852, -135089, -196862, -258050, -108590, -47602, -4438, -62693, -60501, -37868, -135199, -135853, -218193, -211348, -147062, -85967, -69564, -26640, -42876, -99090, -111828, -95948, -153053, -142825, -16778, 50107, 68118, 107140, 131448, 218955, 240125, 270883, 111539, 48810, 10500, 93566, 139102, 172253, 112096, -32272, -178486, -132587, -22232, -59141, -119223, -173399, -120518, -85487, -32569, 53263, 40871, 20733, 1433, 29795, 53667, 46433, 58783, 170572]
16463A70572l7338n5870j00300l9361n7812K8563J42928L0613m3308r876N6842
16452H5653K2659k11210j15035J8347L0032J2791O1601J01012R682p4765q6041
16441a45274Q976R8792R2336O0590o039q4937j30304j09169R6513L8926J19853
16430D0263M1202r2072j775m6731M338J771J2802m3342K3274J33243l585o0766
16418H622q6398Q6711Q8197r314j9272k8467k7356K3764j26297j52200j6921J92745
16406f6186O0945Q603P2495K9167j09548J4222K3800o7444n6430Q9483K2343P7030
16394I8480J01798M3156l3022N0175J3320k05263k01549m5920j1188J17595R3567
16383B1149M0396L672q2953L5127m599j29921k07J07288N0736J4525p0993P376
$$ y = [170572, 133234, 77364, -22936, -62297, -120109, -91546, 51382, 81995, 38687, 28811, 85653, 108312, -102898, -217933, -199586, -169554, -156763, -95162, 5850, 15532, -59233, -145274, -136298, -37506, 54830, 115420, 109381, 24444, -105860, -215029, -118516, -79590, 40263, 81465, -10607, -12382, -59113, -54775, -53004, -40202, -83544, -60270, 72973, 69388, 8622, -77776, 8935, 97132, 87818, 68546, 40079, 12723, 36487, -89810, -242010, -258931, -66186, -5241, 3362, 75857, 105024, -4524, 9698, 33498, -33946, -90376, -893, 21450, 98480, 200278, 243434, 210412, 260587, 273907, 68644, -132905, -178825, -190013, -72418, 21149, 61545, 65217, -17736, 17391, 12792, -117129, -117336, -10048, 40688, 55213, -15780, -8404]
16371h404l5614L0964j17661j16314M6204J06677R7621k4766k105P7432N0218
16360A04252j23907m56J43052O6349k0581j49121O3035K073j16250k3890n7100
16349a12544J21497Q629j28789N8862L3433N630m6911P4108q0983M8714R3755
16338G5401N9137M2091m1609p3598n6281K323j00554m7757K6167L3523J04142
16327B2985K452p4556n8400n2841J6032o2457L5291k2771j0297L7870L3262J92880
16315E9450J10057n3967q2980p7526M7976k7318o5399j6303P154J6456n2943m7377
16303a82720n3754N2834J39136R8555L5341j6358o9956k0928N3906J3323p4002
16292b4623n7661R7646O7211P126K2709l1884K965n7564J4324k2947Q5695p2590
$$ y = [-8404, -44018, -13054, -130715, -247029, -200825, -94148, 3473, -21293, -23398, 54034, 104252, -19655, -20111, 122941, 189290, 168709, 19588, 82623, 84696, -31554, -55444, -112544, 8953, 17582, -111207, -52345, -18912, -13282, -60193, 13915, -67068, -18354, 75401, 134538, 176629, 135020, 61422, 5141, 7464, -93090, -140847, -114680, -81157, 22985, 25437, -49119, -107519, -160360, -144328, -206785, -171494, -194265, -204562, -166692, -133430, 59450, 169507, 115540, 32560, -44966, 3010, -24308, -89707, -106010, -98856, -82400, -135343, -182720, -236474, -183640, -44504, 54051, 89392, 73034, 3078, -17850, 36056, 49379, -24623, -82284, 15362, 82573, 89699, 112408, 80524, 83489, 25925, 40249, 17302, 102997, 30407]
16280C0407o8954l6769j3462R311J35172P0298l2824j42017o6207l4393P544O4225
16268g7669M2588q89l4360M6279J54989R5092r5722j40788n0293K7519J04327
16257G1073J433l2827j62953j3239J42312L8455l4479n237K8977r0908o9193m062
16245a30648Q905P7990J50278P4359q41k7567j16414O8279K3067P0931L6700R0565
16233C25604L5076j39979j98076m8766o3759J8185N3948j2720m855Q6721J07116
16222A58495M8798N4345L4579o0347j36779j10521L7286L0544l5288j9034J68961
16211A71039J02543j23216k00207n510J11723J54912l0539j27894k5272k7184
16201C95m7215J44788n8834R748L0381j40570L1165J71908r5722p1259n394J10612
$$ y = [30407, -38547, -75316, -88778, -79467, 55705, 126003, 93179, -48838, -115045, -149438, -141894, -77669, -35081, -35970, -70330, -24051, 130938, 226030, 130308, -10480, -60773, -33254, 71073, 72506, 39679, -123274, -136513, 5799, 44254, 9775, 4538, 33515, -57393, -126586, -130648, -121743, -43753, 106525, 180884, 180043, 152476, 36062, 104341, 127408, 198339, 235039, 325604, 360680, 220701, 22625, -26141, -89900, -71715, -17767, -30487, -35342, 51379, 158495, 207293, 261638, 296217, 235870, 99091, -11430, 25856, 56400, 21112, 2078, 171039, 273582, 150366, -49841, -55351, 56372, 211284, 180745, 52851, 27579, 395, -46820, 97968, 39134, 48882, 79263, -61307, -30142, 141766, 46044, -25215, -30609, 80003]
16189H0003J17705o8675j178l1518o3666p8358m6093P0809Q0261n5262l9421K3912
16177a1481J93762L9705J9081k0035j9155n0972j24356r0491K2631q212j4496
16166f4019l6977M6234J65210L4802J8833m8848r9707j788k6562k6459J21416
16155H2135M5196q171J3834J9518K7158o515m9788n8897n8983Q3555J15964O208
16143B11214r7603k3236q7440n0309N2187J19822Q7168j77954j8826Q488M8283
16132G1794o980J5019r848o7443j903K4421J47277L5794j2835p2664p3693P232
16120E6171j11380q5028Q5886J6656O110O3959Q7000R14n9493m2233k3129L3005
16108B8438o1796Q6483L3246r2678q0902P5973N2446n7969j15396K5750R4366
$$ y = [80003, 197708, 129033, 127855, 96337, 32671, -45687, -91780, -20971, 59290, 4028, -35393, -11481, 182281, 221986, 241067, 221032, 201877, 150905, 26549, -63942, -41311, -49523, -64019, -100996, -54762, 110448, 145250, 164083, 115235, 15528, 13740, -12822, -39281, 82135, 127331, 119160, 132994, 152512, 179670, 173155, 123367, 64470, 5487, 89042, 205006, 211214, 113611, 90375, 2935, -47374, 4813, 124635, 211803, 33849, 15023, 23511, 71794, 64814, 79833, 69985, 2542, 639, 25060, 172337, 208131, 195296, 122632, 48939, 56171, -55209, -140237, -54351, -37695, -31585, 32374, 119374, 120288, 60795, 18562, -4567, 28438, -33358, 53125, 86371, -6307, -87209, -11236, 41210, -16759, -132155, -106405, -12039]
16097a2039l5052q5699m0104Q8696J16453J73379k1028k2101q7669K6687J01935
16086B03458M2125K6948r218n7107q1465k0267j6935M2053m1572J42536R331q8247
16074A51640q3072j19058P5636q4292p4891J32435L8040k1297l6476k2003n9321
16063a02659K1244O8532m503P2998n8961j39362p4605O9256J04761J49725O3783
16052A70209o1544k7803K9543j229r7921m0561K9075J00763O598l3215k4453j05681
16040e6219j2400J55415j18803Q813L0265l3225j3940R8217P1518k997k4732Q0226
16028A82138o7769l7332j6554k2423q2825q9651O0261J43098J013o6226j21919
16017a18189K7514P0328o2923M6750O6926N981k7177n8977J9697Q2344N0517j855
$$ y = [-12039, -47091, -132790, -172894, -84198, 32255, 205634, 184606, 162505, 74836, 101523, 203458, 245583, 272531, 263313, 206206, 124741, 104474, 87539, 129592, 88020, 230556, 239887, 151640, 68568, -50490, 25146, -59146, -134037, -1602, 36438, 15141, -21335, -43338, -102659, -81415, -12883, -17386, 55612, -3349, -142711, -217316, -148060, -43299, 106426, 170209, 108665, 80862, 110405, 109176, 11255, -29306, -231, 100532, 107130, 73915, 49462, -56219, -68619, 86796, -32007, -23194, 7071, -26154, -40094, 58123, 129641, 126644, 101912, 182138, 114369, 77037, 60483, 38060, -44765, -134416, -74155, 68943, 69956, 3730, -118189, -90675, -20347, -83270, -36520, 30406, 36387, 9210, -49767, -30070, 52274, 102791, 100936]
$$ [...]
##END NTUPLES=NMR SPECTRUM
##END=
