##TITLE=Analysis number 321290
Compound Code cc 10002
Project Code adrs
Chemist Name endeavour
##JCAMPDX= 6.0         $$ Bruker NMR JCAMP-DX V2.0
##DATA TYPE= NMR SPECTRUM
##DATA CLASS= NTUPLES
##ORIGIN= Bruker BioSpin GmbH
##OWNER= nmr
$$ XWIN-NMR		Version 3.5
$$ Thu Aug  3 09:11:49 2006 GMT Daylight Time (UT+1h)  MAYBRIDGE\nmr@NMR_250MHZ
##.OBSERVE FREQUENCY= 250.131544655141
##.OBSERVE NUCLEUS= ^1H
##.ACQUISITION MODE= SIMULTANEOUS (DQD)
##.ACQUISITION SCHEME= undefined
##.AVERAGES= 16
##.DIGITISER RES= 18
##SPECTROMETER/DATA SYSTEM= dpx250
##.PULSE SEQUENCE= zg30
##.SOLVENT NAME= CDCl3
##.SHIFT REFERENCE= (INTERNAL, CDCl3, 0, 16.4481)
##AUDIT TRAIL= $$ (NUMBER, WHEN, WHO, WHERE, WHAT)
$$ ##TITLE= Audit trail, XWIN-NMR		Version 3.5
$$ ##JCAMPDX= 5.01
$$ ##ORIGIN= Bruker BioSpin GmbH
$$ ##OWNER= nmr
$$ C:\u/data/dgb/nmr/ADRS/100/pdata/1/auditp.txt
$$ ##AUDIT TRAIL=  $$ (NUMBER, WHEN, WHO, WHERE, WHAT)
(   1,<2006-08-03 09:11:29.33 +100>,<MAYBRIDGE\nmr>,<NMR_250MHZ>,
      <created by zg, POWCHK disabled, PULCHK disabled
       configuration hash MD5:
       E2 DF 36 D8 04 B2 41 60 5A D7 A3 38 5A 4B D0 FE
       data hash MD5: 64K
       C4 B0 D0 77 ED B4 47 B7 57 9C 03 35 E9 84 4A 63>)
(   2,<2006-08-03 09:11:40.61 +100>,<MAYBRIDGE\nmr>,<NMR_250MHZ>,
      <Start of raw data processing
       ef LB = 0.3 FT_mod = 6 PKNL = 1 SI = 32K 
       data hash MD5: 32K
       B3 99 17 22 11 8F ED 31 EE 8A 47 58 5D A9 36 96>)
(   3,<2006-08-03 09:11:42.21 +100>,<MAYBRIDGE\nmr>,<NMR_250MHZ>,
      <apk 
       data hash MD5: 32K
       97 96 83 A1 C8 7F 23 F8 EB 8F 19 9D 77 6F CE 1E>)
(   4,<2006-08-03 09:11:42.93 +100>,<MAYBRIDGE\nmr>,<NMR_250MHZ>,
      <abs ABSG = 5 
       data hash MD5: 32K
       75 85 8B 15 ED 06 C3 CA 6D E0 7D C4 9F 11 62 B1>)
$$ ##END=
$$ 
$$ hash MD5
$$ 6E BA 12 6E F4 F1 E7 BB 85 6F DA 45 56 35 4B 66
##$RELAX= 
##$RELAX= 
##$RELAX= 
##$RELAX= 
##$RELAX= 
##$RELAX= 
##$RELAX= 
$$ Bruker specific parameters
$$ --------------------------
##$DU= <C:\u>
##$EXPNO= 100
##$NAME= <ADRS>
##$PROCNO= 1
##$TYPE= <nmr>
##$USER= <dgb>
##$AMP= (0..31)
100 100 100 100 100 100 100 100 100 100 100 100 100 100 100 100 100 100 
100 100 100 100 100 100 100 100 100 100 100 100 100 100 
##$AQSEQ= 0
##$AQ_mod= 3
##$AUNM= <au_zg>
##$AUTOPOS= <4 >
##$BF1= 250.13
##$BF2= 250.13
##$BF3= 250.13
##$BF4= 250.13
##$BF5= 500.13
##$BF6= 500.13
##$BF7= 500.13
##$BF8= 500.13
##$BYTORDA= 1
##$CFDGTYP= 0
##$CFRGTYP= 5
##$CHEMSTR= <none>
##$CNST= (0..31)
1 1 145 1 1 1 1 1 1 1 1 1 1 1 1 1 1 1 1 1 1 1 1 1 1 1 1 1 1 1 1 1 
##$CPDPRG= <>
##$CPDPRG1= <>
##$CPDPRG2= <>
##$CPDPRG3= <>
##$CPDPRG4= <mlev>
##$CPDPRG5= <mlev>
##$CPDPRG6= <mlev>
##$CPDPRG7= <mlev>
##$CPDPRG8= <mlev>
##$CPDPRGB= <>
##$CPDPRGT= <>
##$D= (0..31)
0 1 0 0 0 0 0 0 0 0.06 0 0 0 0 0 0 0.0002 0 0 0 0 0 0 0 0 0 0 0 0 0 0 
0 
##$DATE= 1154592688
##$DBL= (0..7)
120 120 120 120 120 120 120 120 
##$DBP= (0..7)
150 150 150 150 150 150 150 150 
##$DBP07= 0
##$DBPNAM0= <>
##$DBPNAM1= <>
##$DBPNAM2= <>
$$ [...]
##$SUBNAM7= <"">
##$SUBNAM8= <"">
##$SUBNAM9= <"">
##$SW= 20.6930455092707
##$SWIBOX= (0..15)
0 0 3 0 0 0 0 0 0 0 0 0 0 0 0 0 
##$SW_h= 5175.983436853
##$TD= 65536
##$TD0= 1
##$TE= 295.16
##$TE2= 300
##$TE3= 300
##$TEG= 300
##$TL= (0..7)
0 120 120 120 120 120 120 120 
##$TP= (0..7)
150 150 150 150 150 150 150 150 
##$TP07= 0
##$TPNAME0= <>
##$TPNAME1= <>
##$TPNAME2= <>
##$TPNAME3= <>
##$TPNAME4= <>
##$TPNAME5= <>
##$TPNAME6= <>
##$TPNAME7= <>
##$TPOAL= (0..7)
0.5 0.5 0.5 0.5 0.5 0.5 0.5 0.5 
##$TPOFFS= (0..7)
0 0 0 0 0 0 0 0 
##$TUNHIN= 0
##$TUNHOUT= 0
##$TUNXOUT= 0
##$USERA1= <user>
##$USERA2= <user>
##$USERA3= <user>
##$USERA4= <user>
##$USERA5= <user>
##$V9= 5
##$VALIST= <valist>
##$VCLIST= <CCCCCCCCCCCCCCC>
##$VD= 0
##$VDLIST= <DDDDDDDDDDDDDDD>
##$VPLIST= <PPPPPPPPPPPPPPP>
##$VTLIST= <TTTTTTTTTTTTTTT>
##$WBST= 1024
##$WBSW= 4
##$XGAIN= (0..3)
0 0 0 0 
##$XL= 0
##$YL= 0
##$YMAX_a= 550846
##$YMIN_a= -618854
##$ZGOPTNS= <>
##$ZL1= 120
##$ZL2= 120
##$ZL3= 120
##$ZL4= 120
##$ABSF1= 16.44808
##$ABSF2= -4.245092
##$ABSG= 5
##$ABSL= 3
##$ALPHA= 0
##$AQORDER= 0
##$ASSFAC= 0
##$ASSFACI= 0
##$ASSFACX= 0
##$ASSWID= 0
##$AUNMP= <proc_1d>
##$AZFE= 0.1
##$AZFW= 0.1
##$BCFW= 0
##$BC_mod= 0
##$BYTORDP= 0
##$COROFFS= 0
##$CY= 12.5
##$DATMOD= 1
##$DC= 0
##$DFILT= <>
##$DTYPP= 0
##$F1P= 14.0000005364418
##$F2P= -0.99999901652339
##$FCOR= 0.5
##$FTSIZE= 32768
##$FT_mod= 6
##$GAMMA= 0
##$GB= 0
##$INTBC= 1
##$INTSCL= 1
##$ISEN= 128
##$LB= 0.3
##$LEV0= 0
##$LPBIN= 0
##$MAXI= 10000
##$MC2= 0
##$MEAN= 0
##$ME_mod= 0
##$MI= 0
##$NCOEF= 0
##$NC_proc= -2
##$NLEV= 6
##$NOISF1= 0
##$NOISF2= 0
##$NSP= 0
##$NTH_PI= 0
##$NZP= 0
##$OFFSET= 16.44808
##$PC= 1
##$PHC0= 141.088
##$PHC1= 5.402362
##$PH_mod= 1
##$PKNL= yes
##$PPARMOD= 0
##$PSCAL= 4
##$PSIGN= 0
##$REVERSE= no
##$SF= 250.130018488279
##$SI= 32768
##$SIGF1= 0
##$SIGF2= 0
##$SINO= 400
##$SIOLD= 32768
##$SREGLST= <1H.CDCl3>
##$SSB= 0
##$STSI= 32768
##$STSR= 0
##$SW_p= 5175.98343685301
##$SYMM= 0
##$S_DEV= 0
##$TDeff= 65536
##$TDoff= 0
##$TI= <Analysis number 999999
Compound Code 99
Book Reference 9
Project Code 9>
##$TILT= no
##$TM1= 0
##$TM2= 0
##$TOPLEV= 0
##$USERP1= <user>
##$USERP2= <user>
##$USERP3= <user>
##$USERP4= <user>
##$USERP5= <user>
##$WDW= 1
##$XDIM= 32768
##$YMAX_p= 505235101
##$YMIN_p= -42167
$$ End of Bruker specific parameters
$$ ---------------------------------
##NTUPLES= NMR SPECTRUM
##VAR_NAME=  FREQUENCY,     SPECTRUM/REAL,   SPECTRUM/IMAG
##SYMBOL=    X,             R,               I
##VAR_TYPE=  INDEPENDENT,   DEPENDENT,       DEPENDENT
##VAR_FORM=  AFFN,          ASDF,            ASDF
##VAR_DIM=   32768,         32768,           32768
##UNITS=     HZ,            ARBITRARY UNITS, ARBITRARY UNITS
##FACTOR=    0.157963299565203, 1,           1
##FIRST=     4114.15857022142, 0,            0
##LAST=      -1061.82486663159, 0,           0
##MIN=       -1061.82486663159, -42167,      0
##MAX=       4114.15857022142, 505235101,    0
$$ Real data points
##PAGE= N=1
##DATA TABLE= (X++(R..R)), XYDATA
$$ [...]
21807 -10533 -21481 -16151 -2393 1100 -4630 -6112 919 3935 -10804 -6787 2705 -256 -1642 -7064
21793 -7064 -14018 -12640 -4854 -323 440 8285 4363 3150 4677 4141 4537 3281 -2236 -7429 -2605
21778 -2605 -2262 -9769 -471 5720 1363 -6239 -1298 -13029 -15957 -19719 -25482 -17915 -15334 -12644 -373
21763 -373 6249 -1166 5316 10426 16726 6968 -7120 -12491 -6576 -2702 9772 5990 4608 911
21749 911 -16424 -24962 -31496 -29709 -18723 694 5486 4306 -11692 -12749 -17539 -14393 -3818 -6932
21735 -6932 -10219 -16665 -18084 -9902 -8132 -9521 -16437 -12380 -19763 -17248 -1259 4313 -1326 -10383
21721 -10383 -16901 -10957 -12586 -15057 -13339 -6951 -3570 4569 6350 -2007 -14519 -17513 -12066 -20743
21707 -20743 -31926 -33504 -20771 -13563 -1987 -102 2767 11587 7217 -4876 -5725 10372 3125
21694 3125 118 2437 8242 -4852 -18574 -9332 2976 -975 -1163 5496 12971 10111 -5024 -1263
21680 -1263 8682 16513 16315 4575 3116 620 4910 2869 -3341 3535 -2168 -10813 -12986 -8871 -10477
21665 -10477 -11023 -11781 -3271 -6088 -17721 -28233 -20864 -21291 -25465 -27829 -25099 -27899 -26884 -26929 -33386
21650 -33386 -29513 -17830 -12898 -19051 -8243 -8450 -13929 -11054 -18324 -32107 -24954 -6621 -614 4790
21636 4790 -2398 -8133 -7068 -12619 -12899 -3361 9567 -1970 -13741 -1736 3516 -5694 -11814 -10769
21622 -10769 -10822 -12813 -5241 -2057 4226 20327 27862 23008 13183 7423 2535 -561 10365 5106
21608 5106 -7819 -7079 -12486 -22562 -15657 -15515 -7250 434 4519 6683 -1891 -3620 -5554 6870
21594 6870 11738 7874 12206 15756 6578 8289 -1837 -9887 -293 12555 9397 1956 -5311 -5465
21580 -5465 -381 1554 -2232 -8834 -15006 -13725 -8149 -3859 -4513 -926 6792 5230 6560 -1278 -2361
21565 -2361 -2392 -4280 1241 -878 1361 10741 8630 12249 8633 8685 7902 11889 7743 -3760 -12908 -7675
21549 -7675 -20326 -28254 -20276 -11087 469 3317 14824 16596 18576 16871 13877 18649 13686 8275
21535 8275 838 7676 78 -4614 2724 3314 -5569 -9162 -2867 -3628 -4 7395 4853 5539 -186
21520 -186 1965 3154 6126 8726 14178 4281 -1249 6554 13733 2400 -4647 12015 10264 14520
21506 14520 3712 -10165 -20298 -14041 -4867 -10773 -21679 -16558 -15480 -25901 -4244 -3628 -10555
21493 -10555 -17566 -20875 -15641 -8036 3293 7526 -4340 -618 -1584 -2391 1798 -6621 -15675 -17521
21479 -17521 -2432 2881 -1068 9595 6429 5935 4302 11467 14925 1439 -6199 -12061 -21002 -18954
21465 -18954 -11789 -11863 -10061 -12018 -10280 -3225 -6366 -6798 5700 8736 6473 2451 5693 10002 -9052
21450 -9052 -13004 -6144 -11317 -14653 -11456 -5674 6367 -1992 4428 5744 3380 8692 -105 3994
21436 3994 2694 -6176 -16073 -16135 -14353 -2238 13947 12130 -3906 -11319 -16357 -11863 -10479 -8168
21422 -8168 -16825 -25650 -25800 -27156 -25130 -31787 -22012 -17422 -17597 -15175 -21901 -23311 -9964 -7732 -12347
21407 -12347 -15231 -14079 -10503 -3776 9649 6315 1928 1481 -5116 -11611 -8720 5521 6179 -3511
21393 -3511 -11752 -2364 2668 5392 11329 -3235 -12520 257 6439 -305 -10720 -17470 -23949 -20162
21379 -20162 -8364 4568 1002 -1674 6077 1108 5545 8849 14549 12500 6040 360 -3852 -4099
21365 -4099 -4319 -7888 1875 9208 4285 1007 5943 1983 -9585 -9691 -13157 -17580 -13390 -9763 2125
21350 2125 5593 -7372 -25649 -28569 -17710 -10740 -9563 -10517 -15961 -16579 -1775 4502 16518 18653
21336 18653 14145 -1022 -1939 2794 10519 4304 -5137 -12522 -9843 -7790 -14411 -22736 -25101 -27000
21322 -27000 -8190 460 -3754 -12709 -20152 -14309 -5855 -5052 39 -4642 -14940 -18177 -13959 -3286
21308 -3286 -2064 4537 3404 -48 7944 7133 -5559 -5670 6747 3618 -12383 -9229 -9736 -12308 -8695
21293 -8695 -1038 7839 3940 2027 278 -440 -4716 -12604 -20900 -17296 -10730 -282 1875 438 -13298
21278 -13298 2860 18790 22956 8061 -6239 -22201 -20105 -1423 -139 -1338 -3873 -3230 -259
21265 -259 -28 2686 -11303 -7953 -786 6288 -3612 -8195 -4335 -9373 -20258 -25541 -26316 -23667 -12109
21250 -12109 -2861 6449 14494 4970 -345 -5027 -21845 -26790 -18879 -13787 -9888 3645 -1730 -14652
21236 -14652 -17294 -5378 8252 -3139 -7069 -14960 -22495 -24388 -29321 -27789 -11326 -1829 -7091
21223 -7091 -11842 -21751 -20275 -11209 -16201 -18809 -10349 -1391 2276 -1272 5416 4399 5472 1665 5066
21208 5066 3926 4053 -2033 2731 3028 -8455 -6708 5582 6888 10711 12096 -8547 -22437 -28614
21194 -28614 -21244 -12852 -1382 5561 7160 288 -4684 -6359 35 5469 6002 -5909 -10266 -7077
21180 -7077 -7881 -14183 -4513 -6518 -29128 -29901 -16391 -9366 -2314 2486 133 5473 11415 9884 4069
21165 4069 1836 -5691 -3049 -8686 -10687 -13013 -8388 -10610 -11872 -9407 -12716 -12738 -10213 6 -7477
21150 -7477 -11385 3285 -2351 -5381 -9774 -9857 -758 -3134 -9409 -3031 9173 8431 1431 -7638 -2754
21135 -2754 -6476 -10264 -10642 -14460 -18986 -3734 -198 -456 -859 -3477 -9851 -20257 -3691 2891 -3549
21120 -3549 -10355 -11623 -20815 -14490 -8162 550 3795 1202 -2628 -6553 -3874 -1922 -16747 -17149 -16572
21105 -16572 -20552 -15591 -6309 -11889 -10054 -14345 1912 -1690 -3095 7044 12085 16994 15540 20814
21091 20814 13545 10640 6217 -8043 -3905 2931 -1847 -3065 10541 17750 21250 18385 11979 6258
21077 6258 4081 -5005 -6705 -3548 -15605 -18501 -13292 -3194 1781 8698 14633 15932 23113 27218
21063 27218 38070 39703 29820 31125 29112 13872 -4949 -15123 -6889 4741 4793 -998 10212
21050 10212 17042 16342 17580 7309 -8207 -11349 7681 8754 14299 6943 4337 3408 -7895 -5706
21036 -5706 4408 8556 16048 13995 687 -8130 -9338 1838 5631 2613 -914 -4528 -5489 -972
21022 -972 9189 9977 10607 5247 -10196 -13928 -6574 2842 3648 -3272 9413 8105 14324 14998 20471
21007 20471 9829 12781 6966 1564 922 9707 17385 19262 6666 -6828 -8930 -4932 -1649 8601
20993 8601 3328 465 3334 4289 -6333 -14677 -1982 14339 812 -9180 -10274 -13413 -7407 1427
20979 1427 -3201 -4514 -9194 -2024 -3565 -9752 -18251 -22867 -21676 -11897 -7482 887 -5055 -7597 -6502
20964 -6502 1246 8898 14132 13826 12715 24312 23299 27038 21263 1323 2144 3538 6059 12843 8757
20949 8757 -1086 -7413 -2560 -11036 -4458 2687 -9629 -5549 -2268 -1814 2517 7258 9607 8546 1146
20934 1146 -2520 -5922 -12975 -20874 -15689 -19614 -25270 -18542 -18136 -27363 -19611 -19260 -20914 -10716 -13029
20919 -13029 -10060 -12615 -278 15719 4806 -3750 -11726 -6298 1983 -2031 -3007 -2357 4414 4297
20905 4297 8929 4617 702 4328 -1482 -3153 3506 -788 -4628 -7011 1016 8012 1291 3270 5425
20890 5425 -1868 -11828 -9678 -11419 -24702 -32723 -30686 -23957 -7217 -11705 -22147 -15634 -10864 -14507
20876 -14507 -3775 4215 623 -3136 2555 11744 4440 1654 4401 5978 -819 5360 -1639 -10980
20862 -10980 -8209 -4194 -10748 -13216 -15580 -6467 -5276 -19119 -11550 -10144 -12034 -18393 -1418 -2292
20848 -2292 -7108 -13197 -14433 -12469 -8309 481 84 -8944 -11844 -12020 -16694 -17034 -21631 -34830 -26705
20833 -26705 -14530 -8797 94 3568 -1949 -5204 -8911 -21434 -25965 -25580 -14898 -15633 -4576 2463
20819 2463 3589 2709 294 3213 10829 -3383 -6182 -14584 -19786 -18420 -21645 -17038 -13245 -16784 -13999
20804 -13999 -9971 -9224 -10229 -13450 -14615 -13296 -2621 -1684 4474 5785 -10252 -15567 -9158 -1970
20790 -1970 -4811 -7226 -5578 -4642 -15818 -23039 -18410 -13682 -1463 231 -6318 -7292 -6922 -765 -2936
20775 -2936 -9832 -14015 -16397 233 9485 -2783 -6024 3179 8245 5746 -4194 -2884 1638 10067
20761 10067 12389 -2897 -5097 -1792 -3376 -6551 -5518 -6670 -1161 52 -715 -4021 5830 5517 4547
20746 4547 7626 -5046 -362 11211 9105 -2756 -14098 -13755 -3725 -1269 -4587 -12656 -10138 904
20732 904 1317 -7342 -3203 -2821 -11609 -14061 -8991 -7682 -1071 7898 2113 -7778 -16462 -19851 -11238
20717 -11238 1206 9709 6506 1499 -7756 -16277 -5522 -438 42 3687 -3841 1727 9853 6471
20703 6471 1793 -5519 -16723 -18007 -10717 -2839 230 -2863 -10844 -12167 -7690 -17459 -14323 -6188
20689 -6188 -5126 4711 18169 20672 8337 121 4231 9451 9603 12531 15283 16665 13266 9806
20675 9806 5623 -1555 -5295 -8963 -1007 13668 18754 12128 2281 -8159 -8625 -21621 -27875 -11943
20661 -11943 -2466 -5568 -12993 -21129 -20745 -26956 -34769 -21488 4261 8951 10683 11261 5155 5068 5765
20646 5765 -5923 -12644 -10582 -4744 -5760 -13440 -10731 -11179 -5695 7493 11367 11008 8220 2707 2749
20631 2749 4922 7728 16144 16467 5985 10857 3708 2584 -2384 2177 6423 -79 -10060 -7833 -4256
20616 -4256 -5950 1409 10158 9677 4105 -3663 -7737 -8610 -16084 -12477 -6948 3571 3180 12699 13333
20601 13333 9788 -4668 -19222 -17406 -2387 -92 -11085 -14872 -4583 -7228 -8590 -6663 -9314
20588 -9314 -3065 1977 4640 -1906 -6701 -12004 -10486 -350 -2279 -5955 -1453 434 1089 -1549 -7965
20573 -7965 -7984 -5301 3752 -7205 1354 9866 -3356 -11143 210 4380 9200 10364 -7525 -27391
20559 -27391 -26771 -14118 -12202 -4061 -8753 -10961 -10594 -21662 -25811 -13736 4568 5231 -571 -5112
20545 -5112 -5751 -5302 -9689 -15128 -9354 344 -691 5135 5712 13149 5570 -5277 -3330 3946 7845
20530 7845 16667 5935 1963 8151 -478 -1872 7165 884 1575 4754 7903 1083 -6535 -9657 -2022
20515 -2022 9759 10950 12253 7175 -1052 -4544 -23866 -22477 -13643 -10679 -1250 10540 18462 15026
20501 15026 11661 16763 14013 11502 15210 4284 805 3508 2746 1770 2924 4425 -979 -2541 -1467
20486 -1467 -8591 -3348 7848 -3876 -3868 11065 22465 21254 13618 18717 18603 13179 4091 655 -972
20471 -972 -768 2267 308 6009 294 -588 -4900 -595 -3756 -3075 -1710 3878 -4983 -8765 -10094 -7196
20455 -7196 -6918 -6239 -9303 -9041 -11676 -15909 -18756 -17215 -15082 -8679 -4485 -2118 -1382 -6403 47 11033
20439 11033 8665 736 -918 -3885 -13413 -16321 -9679 -12587 -17792 -23424 -21226 -15448 -12874 -5974
20425 -5974 5651 4328 1156 1584 -7800 -13877 -12190 -4125 -629 -2192 -9874 -11724 -4664 659 11023
20410 11023 23426 19562 22528 20075 27361 27676 21243 19238 7543 9805 13703 2976 780 -1178
20396 -1178 1476 -9991 -11744 -7703 -9351 -7409 -16668 -14750 -4794 -4237 -10500 -5166 607 -3129 -11346
20381 -11346 -13171 -10309 6643 12954 15693 14514 16882 13994 5067 8728 10526 12941 22799 19925
20367 19925 -3331 -11958 -7140 -5516 11108 7985 3952 2341 1552 -2518 -4011 -2625 11068 20821
20353 20821 14848 10812 -4128 -6365 -3080 3081 5820 11844 23569 32755 33177 23743 15047 7267
20339 7267 11180 21693 23890 18836 509 415 8938 802 -6146 -8232 -9974 -3421 -8104 -10414 1847
20324 1847 6344 7614 15820 3948 -13994 -22504 -17269 -14606 -10210 -14361 -8683 4525 6157 8428
20310 8428 17907 10759 587 -475 -9539 -18236 -18493 -19002 -16683 -7931 -435 8393 18639 15278 -2120
20295 -2120 -7033 3442 6783 4272 -1611 -10342 -2021 16128 11447 5065 956 2608 3562 6586
20281 6586 9542 15128 19849 21392 14583 9627 5114 125 3827 9174 14727 7022 1317 2719 9609
20266 9609 119 -1774 -1525 -4908 -5005 -2068 5765 4139 -1672 -6579 -5669 -6930 -10383 -12720 -6759 -4343
20250 -4343 -1750 7485 20452 17905 2133 1327 10974 14467 7712 18093 21234 9613 750 -12084
20236 -12084 -7281 -7241 -1291 -7704 -8742 -13932 -531 -4243 -18884 -8922 -1350 -4052 -6346 5491
20222 5491 1375 1322 -1358 -4160 -3576 -8284 -7501 10350 13957 11768 11090 6579 6069 10873 3885 -7503
20206 -7503 -8261 -14815 -11778 -2470 3903 649 4437 -1366 -9473 -2220 -2305 -13729 -8495 -8538 -13008 -10960
20190 -10960 -9041 1246 3797 16078 26619 29734 23987 21401 17847 19863 20795 17059 15636 11044
20176 11044 -2830 -2858 -4159 -4938 -8077 5150 13644 10837 -2627 -1866 9039 13923 14951 18954
20162 18954 12057 6179 -4151 -11989 -36784 -39737 -38935 -29255 -15581 -4159 -5200 -7644 431 3927
20148 3927 9619 18272 9045 5782 4638 -5475 -11847 656 4692 4797 12122 14300 10838 11856
20134 11856 7426 -2185 -10187 -8481 -10212 -17189 -19857 -24709 -17230 -9391 -12824 -15339 -3919 8150
20120 8150 6308 13221 22285 31029 29867 10015 7669 16276 18999 12266 5305 4953 7759 787 -607
20105 -607 -4250 3737 5476 -1818 -14397 -16800 -5731 -7368 -3773 2079 13465 -384 -2743 3648
20091 3648 14795 610 -9431 872 3823 2154 -3121 -10207 -219 1317 2659 -1089 -7293 8597
20077 8597 8665 5977 9388 -8132 -20699 -13637 -2820 4958 2732 -4272 -10181 -9811 -6331 -2754 -1847
20062 -1847 6291 12666 8999 1126 4543 5200 14794 20896 26014 28168 17787 13883 17518 23688 18413
20047 18413 16328 13240 14341 24614 26576 20106 16383 15129 6945 6116 18515 17365 9229 12203
20033 12203 17211 21595 25380 36296 30491 27437 24331 25800 24755 26508 22408 14398 2232 -4214
20019 -4214 3751 4177 12648 16290 24266 23566 33105 25379 24152 31612 22676 27449 47040 63257 74861
20004 74861 62851 83450 111358 124201 138609 176218 232230 296590 365812 441580 509936 575821
19992 575821 643187 687181 704601 708237 686177 647728 595880 530703 468949 392449 330138 268763
19980 268763 212979 177574 157413 144189 126544 120396 118625 112326 102114 102640 104726 96149 92334
19967 92334 81557 77310 80912 81427 79159 73479 64046 57101 52830 46467 45774 58057 52720 46485
19953 46485 38824 31539 26618 35367 43983 45374 39355 25947 24184 35100 40561 44555 48553 49695
19939 49695 40303 27101 32995 28254 17670 11834 17918 26537 14396 6451 16762 25170 29154
19926 29154 31369 30406 35923 43519 38474 36767 32035 26330 24735 33674 35687 25877 16743 17107 23484
19911 23484 34555 33487 30083 27740 19978 21150 25912 12688 12317 23047 28652 32460 33241 28530
19897 28530 28604 29624 26229 22593 14905 9041 298 2724 435 1347 6299 7574 5140 10955 5485
19882 5485 13102 22488 23506 25458 11210 6220 13547 18706 21671 17055 18403 23753 28675 31794
19868 31794 16114 9616 18306 25708 16698 13932 5179 7882 27231 29235 25515 32110 28986 14787
19854 14787 7913 10818 26040 27359 13710 3111 4694 4565 6792 21984 25818 23599 24639 24276
19840 24276 20636 21351 15437 4829 -2550 311 11178 4475 8004 13231 15417 12579 21881 34224
19826 34224 31154 17633 19699 12562 16482 26861 32981 21580 22142 38247 48256 43582 36946
19813 36946 18526 13795 7882 -1050 457 8533 13305 17180 12036 14774 28998 25408 15173 11695
19799 11695 12828 6576 5617 5048 7186 -2693 -1394 -130 8836 8947 7511 5827 7500 8726 157
19784 157 5338 7835 5498 7176 8201 16480 17152 9308 5966 14400 22107 16309 18585 17673 37133
19769 37133 42093 32113 30144 33295 28690 26802 24275 20075 20297 21748 18124 20539 16955 18784 6829
19754 6829 -2032 -321 2345 26019 42252 38462 35211 25781 20078 15753 10819 15056 20743 18926
19740 18926 10200 5080 16960 18755 20161 28869 19647 26631 29865 32851 31788 28302 29417 20934
19726 20934 16984 20245 23064 28041 18291 20078 30547 39561 56722 61051 47530 37470 38521
19713 38521 31625 21581 15461 26460 34851 35689 37333 33892 26326 19169 18633 20865 19229 21648
19699 21648 13541 22359 29401 27786 26986 32248 39648 36426 27354 20457 11246 14762 29483 28008
19685 28008 28527 20875 11509 19452 28270 20377 20436 30114 39718 41216 47943 37703 25793 17526 18792
19670 18792 19602 15925 16240 24736 27695 27225 35452 37343 39498 31416 29763 33142 37041 36561 46212
19655 46212 44407 34111 26850 21434 23854 18863 23625 19909 16605 29620 31520 25760 18739 19140
19641 19140 28618 27147 33570 39542 42991 46338 43356 36067 23021 23132 30498 40923 37688 28421
19627 28421 29411 29236 39886 44162 35467 35125 38738 49758 57898 62243 74048 78823 58362 40682
19613 40682 34181 40532 40245 35623 37425 44405 46501 49072 51067 50051 53468 56014 54634 60814 59804
19598 59804 41783 28330 27996 33610 37150 34075 45135 54095 43108 43303 41357 39994 39453 42312
19584 42312 49828 67284 84887 102633 103305 104356 98122 96098 101137 96745 77308 51632 43238
19571 43238 38640 31629 31261 40297 42868 39833 40845 42420 45458 37491 30460 28818 25129 28909 36921
19556 36921 38356 46702 38915 46355 59948 54509 48269 49617 41578 39696 39915 43565 46143 55488
19542 55488 44586 46706 51610 46960 56836 55381 53066 55384 64023 67203 72691 81807 89309 95413
19528 95413 95271 97733 86270 85506 84366 87122 94717 98401 100885 102765 99826 106033 107499 116873 128468
19513 128468 129795 129770 119927 106416 100478 97644 95370 92042 79894 78345 87030 91601 84414 82529
19499 82529 73928 62990 72675 83985 84986 80618 77362 75823 88521 95526 82341 93864 102289
19486 102289 98200 77451 64020 69791 87551 85927 67049 62856 60653 51451 52963 59638 73132
19473 73132 78169 69642 67286 63606 63550 56408 48085 43550 48687 41979 36981 40759 57120 61081 59679
19458 59679 61335 67463 61184 69669 74690 73580 73436 73139 71746 71692 72619 78279 73714 55956 44029
19443 44029 59395 86376 93115 104196 105118 98530 95285 100167 106104 102732 100479 108935 112609 96919
19429 96919 90622 93081 88752 89696 80959 81803 82773 89199 90170 94698 101953 101045 100517 105602 124906 134668
19413 134668 128088 119731 120806 131695 139393 149108 138247 126319 135596 134276 133436 126839 125295 135538
19399 135538 155496 166635 186055 195811 201200 215243 236896 266368 300849 323371 349494 377043
19387 377043 389878 397250 406453 411730 399913 383787 372751 348817 331648 315761 310918 311774 301964
19374 301964 290135 289881 297161 302261 310551 324137 342213 349239 361703 373030 377128 379067 384013
19361 384013 393685 389005 391564 391699 396490 400489 399141 400069 406787 398539 406804 422756 436711 426660
19347 426660 431739 435380 423604 417156 420586 433298 446280 453269 451748 450950 463300 472921 498510
19334 498510 525348 526075 522151 520398 531815 545840 554130 551863 547432 561736 574814 582541 597420
19321 597420 608857 618758 620638 636015 659243 700161 734465 758017 799043 824076 862173 897584
19309 897584 935833 961496 997790 1065222 1139176 1208495 1273585 1347836 1427154 1505211 1576624
19298 1576624 1661713 1748072 1822212 1926184 2045884 2172323 2331258 2516319 2703231 2906111
19288 2906111 3131304 3369545 3611515 3866875 4136441 4413194 4744810 5152334 5627782
19279 5627782 6191802 6868136 7681694 8663885 9873283 11387280 13308005 15790877 19111475
19270 19111475 23636975 29745255 37560220 46969627 58085921 70888805 84251036 96771761
19262 96771761 107931237 117021878 122962674 125400611 123794663 117548638 108422318 98293627
19254 98293627 86644139 73594278 61425657 51243851 42582152 35318749 29695274
19247 29695274 25566223 22525609 20248937 18482906 17065177 15890344 14901377 14051301
19239 14051301 13306580 12639628 12034729 11480186 10947180 10435493 9946220 9472633 9011302
19230 9011302 8565044 8131878 7719408 7324514 6970634 6650595 6366908 6117817 5895039
19221 5895039 5690361 5497087 5310144 5129204 4959033 4779335 4590719 4387288 4191029
19212 4191029 4019481 3839758 3666403 3509099 3364984 3244196 3129309 3007783 2891357
19203 2891357 2788657 2696052 2633718 2560934 2481163 2409269 2332062 2255661 2179166 2112001 2042166
19192 2042166 1980031 1920863 1860519 1799990 1730942 1682901 1635427 1584376 1542663 1493063 1444217
19181 1444217 1408149 1382162 1354481 1317546 1276077 1229098 1174805 1121396 1065499 1012912 955678
19170 955678 900023 844291 788517 741159 700458 661420 615518 576969 545155 523601 489341
19159 489341 447610 423868 411522 403485 392976 380232 383290 382846 382156 388208 400940 417818 440330
19146 440330 444698 434004 429468 418189 409222 386255 351627 315649 272894 255003 233073 202273
19134 202273 182989 167218 154859 153387 150066 157031 172835 174796 176241 193345 211001 215741 217835
19121 217835 214334 216644 212032 211070 211850 213674 221472 204285 185670 181550 183700 186707 184215 174908
19107 174908 173039 186724 189174 180929 184012 190040 186433 196386 195415 196310 215871 211092 215271 224961
19093 224961 221000 218590 217496 215336 211926 206984 195298 176382 173059 172057 172345 175861 176228 174605
19079 174605 179358 196821 220176 223134 231128 230538 230888 223688 220336 226104 234195 229733 218708 211810
19065 211810 200957 192477 194764 187408 181870 169166 174738 174628 178973 174545 173097 166019 164966 151239
19051 151239 145200 148700 135593 130044 135060 131548 122818 122288 122693 137755 142367 131236 117685 118826
19037 118826 110310 103773 107699 110876 115544 121988 123029 119997 105077 107107 109321 108614 121866 120943
19023 120943 117065 110680 100326 98793 90224 85110 75864 74234 81399 68265 61469 62875 66007 63110
19009 63110 50554 48704 49085 46966 43817 47170 44555 51313 46932 37544 29510 21698 9505 11971
18995 11971 22797 19175 25764 39288 38259 25288 32147 29999 10599 -111 2851 15206 18441
18982 18441 11386 14956 13079 28092 34227 27497 24800 25844 27355 17964 3495 -582 9868 11034
18968 11034 22536 25100 23358 22258 25111 18086 11573 18471 29670 36693 42136 47495 51063 47913
18954 47913 48721 41824 30070 33346 29028 21106 24415 36865 49346 46170 46716 50334 54822 61453
18940 61453 67909 64919 52031 48789 41953 34758 23366 19198 19685 14684 15356 15536 10860 9559 7968
18925 7968 -3386 -3471 1625 8059 26943 43210 38750 28244 22508 13251 13433 19576 26076 21756
18911 21756 21478 33930 29088 6816 -4076 -5695 -1468 7384 10929 24765 22438 30570 30905 16369
18897 16369 12124 19863 25254 25800 11016 -6702 -11163 -5870 -1511 2565 3885 12148 19981 14529
18883 14529 15704 9194 3075 2530 11829 12823 6720 2341 10201 14130 13054 19164 15281 8098 2756
18868 2756 10926 13144 7669 5757 7802 6101 4590 1969 1864 -1866 22 1607 2627 -1505 -6189
18853 -6189 -4825 -14335 -25609 -23228 -26681 -15586 103 3036 6439 14393 11879 19049 20775 12503
18839 12503 15268 18196 6926 -4939 -8405 -17517 -15520 376 1331 -18452 -19514 -11685 3455
18826 3455 9179 12858 4317 -11137 -27135 -22117 -25592 -23127 -9741 -9299 -12816 -14211 -21786 -25156
18812 -25156 -25012 -13858 -11930 -11333 -14046 -11313 -20804 -19197 -15720 155 13963 11938 12120 -11304
18798 -11304 -12917 -1805 -2409 -3962 -7676 1787 8333 11060 4570 13518 8271 5081 3975 23260
18784 23260 25605 8870 1080 780 -2742 -10478 -9093 -8985 -5857 -6369 -7237 894 10735 5534 2023
18769 2023 -3453 -409 13464 37027 55960 61440 69208 71542 65934 65484 51426 34598 12037
18756 12037 4216 1826 7827 5387 15532 23624 18043 24417 29115 13035 5572 16049 18807 15652
18742 15652 153 -336 215 16515 11791 5673 5223 8557 18670 13254 8639 3896 5661 13255
18728 13255 14226 26437 17066 6002 3456 8795 17511 13820 10892 6700 9965 22688 22300 10461
18714 10461 -9576 -11288 -15353 -9259 -3888 2376 2366 -10084 -6124 -1753 7107 16876 16218 3719
18700 3719 3362 -5669 1008 4897 8457 13133 9421 8677 13253 19379 17593 18951 -123 -5755 -7206
18685 -7206 -12291 -15690 -9487 8396 18457 8007 16742 18928 16984 10806 9746 8435 5 -11101
18671 -11101 -10870 2219 1765 -3840 6739 8686 1591 -3092 -2499 5545 8096 11690 10121 16393 21897
18656 21897 18832 12754 17869 15590 13038 8875 -4134 -1398 2970 -494 -15551 -19910 -15127 -11106
18642 -11106 2072 17697 3111 -3968 2722 9549 10206 15606 18134 25009 19435 33784 23996 11534
18628 11534 14827 11124 1661 -8305 -4410 -9370 -3835 -15098 -24704 -22911 -20102 -13055 -7075 2887
18614 2887 203 -10603 -4414 10766 9708 -9460 -16365 -4341 -441 9336 7300 2728 5492 9411
18600 9411 23324 30500 18351 4961 -155 2544 -6441 -4308 -8305 -8990 13676 11802 10830 5468
18586 5468 -667 1576 1452 -2009 -7505 -3250 1518 12608 19685 5340 1732 4343 2873 -4378
18572 -4378 5355 20614 18297 26637 17111 26976 32390 24518 12265 24200 32151 38523 31184 21491
18558 21491 10891 3928 -3919 1772 6488 5557 6682 12499 15641 19152 24357 28243 23300 18102
18544 18102 20136 22135 20432 17397 27687 37810 41801 38305 35230 57194 79958 101433 121529
18531 121529 148970 180073 218295 267965 320841 385333 450682 520189 591024 627799 669495
18520 669495 692370 688052 677917 639240 586400 519287 448991 385902 325936 266986 227361 185493
18508 185493 153583 142880 133655 126959 115704 96878 93392 83915 79970 86142 71878 54029 50256
18495 50256 49601 50948 52041 52545 45943 39718 38583 31748 26555 16477 17058 16701 18506 13371 8625
18480 8625 13978 7819 15320 21239 15304 12304 17188 22794 35283 39863 32143 31898 29353 20594 24165
18465 24165 21460 26594 14429 8793 -4297 -3873 12311 6652 11213 24676 14957 13121 16960 12510
18451 12510 9323 18039 27430 24107 13772 8140 4071 1461 2121 8591 6028 -4241 -2795 -948
18437 -948 -1584 -9794 -9306 -6628 7108 12787 19175 23591 14147 10531 16777 12169 6560 -693 -2757
18422 -2757 2640 16815 9916 4443 -9116 -13770 -20207 -13859 -395 3369 1484 -49 2574 -820
18408 -820 -6402 -15450 -21044 -16745 -6881 -8944 -12346 -2454 -845 -649 5902 2504 2827 -4562 6687
18393 6687 6464 -5682 -18422 -6551 899 -636 6892 7631 5075 8370 4636 1197 -6967 -18663
18379 -18663 -17421 899 14368 10877 6571 12921 4164 -8789 -10627 -18591 -19140 -11298 -7815 -345
18365 -345 9198 191 -2821 -3644 -625 10420 19584 19935 13607 3390 -15908 -11183 4382 7711
18351 7711 -1037 5815 6432 4676 -621 546 7080 8773 6410 1268 -2991 -2769 5558 10377 6751
18336 6751 10009 17509 12662 -1846 5326 763 -6901 -7176 -14644 -14061 -6725 3726 5539 1809 -3828
18321 -3828 -6825 -5302 -4326 3013 -7414 -10189 -10888 -10930 -9635 -20355 -33804 -23260 -18856 -33216
18307 -33216 -33695 -32010 -22592 -16929 -18222 -6104 -10161 -9360 6059 21346 29033 22661 12207 5072
18293 5072 11137 10956 9210 15850 25266 20583 17116 13482 8557 6422 3527 -13847 985 -713
18279 -713 -708 9485 9041 -1973 -9000 -6833 -14462 -14673 -8987 1852 10039 12147 12225 19154 19462 17179
18263 17179 19463 25602 31468 22398 10803 15847 25269 26744 15476 12934 19002 28487 17993 18647
18249 18647 24100 24266 23617 15710 16948 11313 13996 18431 20393 7457 -1750 -5833 5821 9268
18235 9268 24140 35190 31848 30834 40433 40784 38763 33770 36336 38112 21598 9559 4916 3839
18221 3839 18400 22967 14165 25118 18830 7876 4601 4795 1963 783 5297 13121 10767 17125
18207 17125 39495 42585 34569 33578 33967 35785 31980 25259 23329 20973 18104 27644 29812 25179 25310
18192 25310 32686 34035 40608 50444 42085 40021 37368 30775 32921 31907 28525 27867 21301 23502 18786
18177 18786 11101 17392 19794 24921 27696 23405 17429 12123 15908 19708 23855 11543 3933 1901
18163 1901 -5306 7255 15258 11669 20314 45749 45395 42544 49195 47688 43499 36326 36987 37181 35273
18148 35273 36762 33801 28022 28672 33321 41493 46614 51123 48784 45625 56490 65342 73803 87686
18134 87686 91054 100242 101806 106993 116458 121882 134015 139182 151369 164855 180202 196662 232383
18121 232383 274023 316513 354915 396861 466874 560580 684635 824280 1009479 1283807 1721365
18110 1721365 2447906 3702937 5858518 8750985 10762093 11470583 11433668 11110103 11152091
18101 11152091 11233661 9676567 6425373 4090498 2865072 2203760 1809673 1537957 1343439
18092 1343439 1205099 1105001 1001255 924205 862790 817075 781341 756203 722181 697770 676382
18081 676382 641754 605914 574873 546872 528442 512918 499682 466924 433593 409436 393670
18070 393670 375394 360008 344664 341341 351586 344508 338665 339541 334258 334018 324710 315251 303092
18057 303092 298038 277231 258916 247773 236527 240193 238064 220553 216085 216456 201878 195018 195620
18044 195620 182923 159497 149978 139213 135283 140020 139465 127855 113644 104227 98865 110344 117678
18031 117678 113459 105660 106130 107219 99605 91850 88238 93739 93482 94671 107176 113155 110439 108023
18017 108023 120776 119477 115024 108372 116872 128901 132718 129225 122801 108756 95818 86189 87863
18004 87863 84698 82688 72738 62112 58332 48772 52456 58726 65403 55392 46450 25898 11456
17991 11456 20727 23521 20448 13768 6759 -3036 -6139 2928 5997 12969 22008 27165 23557 13077
17977 13077 7341 4961 2624 4956 7867 5042 16940 19382 12965 16487 17909 19952 19806 16802
17963 16802 27451 39500 48600 60748 62039 62558 75701 82511 86525 109737 125440 130084 124515
17950 124515 136024 144888 148203 153398 169517 165229 167576 163936 151239 151882 147893 132854 117568
17937 117568 110076 102122 94276 89903 77011 76829 75863 73155 61090 58202 49015 58306 53580 54901
17923 54901 46843 30119 34352 46141 52577 50174 42243 42462 39641 39748 47081 54289 55142 54981 47734
17908 47734 52233 54884 59675 55524 59690 69658 63377 79610 81836 81447 78928 68185 70382 77959
17894 77959 76556 75872 79054 74288 76808 75160 63683 57617 57035 61026 58143 57903 44187 40624 43905
17879 43905 33295 34244 31936 31356 27766 33491 38216 39240 35070 20504 9848 12563 10618 2168
17865 2168 -43 2453 15172 26185 29578 13893 11513 9433 9858 8237 3830 621 19553 40109
17851 40109 30551 17676 2483 -9300 2878 15004 24662 25017 21070 18023 8481 1385 -847
17838 -847 2193 11497 6849 -1766 -3589 -2881 -8204 -4704 -4791 -5682 -6999 -3049 4191 11580 2001 -9818
17822 -9818 -8497 -6241 3054 7493 3621 1332 2003 -3318 7823 9866 4923 -5987 -431 6557
17808 6557 14753 10523 6607 6973 8409 7299 3420 -3564 -5242 -6737 -4484 -6785 -12021 -3860 560
17793 560 6673 4024 4440 -4473 -16898 -3706 3734 1178 15093 16180 14905 14179 9120 12388 3316
17778 3316 1351 -3854 -2319 -9987 -11596 -7347 -11509 -12878 -9727 1415 1495 1214 5849 1575 1457
17763 1457 4083 -4081 -11337 -10592 -12689 -1891 10759 18454 13258 7916 9372 13057 8220 7105
17749 7105 12013 17664 23602 28444 28534 25312 25401 19069 10318 3154 13523 -284 -14557 -5325 4667
17734 4667 1183 -523 -8641 -5790 -3123 5298 -3453 -12053 -9215 -10711 -7294 1419 4849 -3971 717
17719 717 7703 14562 8947 -12949 -22034 -15082 805 3615 1893 14533 27496 39165 39858 23682
17705 23682 11725 970 425 10493 9618 7709 4632 7054 18117 6911 -6602 -5963 359 -1608
17691 -1608 2078 1193 -5515 -3017 763 -4042 -2937 8170 12310 9228 14706 16498 11919 8701 13276
17676 13276 -59 -5850 -261 9522 9180 10651 11093 20900 19655 27234 19609 23420 27897 14978
17662 14978 23789 25250 23229 21387 20616 10809 13758 18558 16754 20248 33620 31465 14967 13067
17648 13067 9351 8189 16944 16874 21666 26488 32625 36177 33931 36134 25192 17124 25598 21001 20878
17633 20878 23341 23179 11253 10615 12498 8883 11039 19498 22170 19008 30268 34991 29515 18118
17619 18118 14118 4069 13198 21052 33655 26568 19781 6224 5714 11939 11572 21489 16885 974
17605 974 10822 10747 15116 11670 7803 5765 14906 17187 19741 17944 20462 17991 11706 381 14715
17590 14715 25972 25556 15088 12607 18909 26044 12333 -3428 -10989 -954 788 7771 16044
17577 16044 13540 -4347 -8220 -9259 -918 1516 -1567 -5099 1627 3772 -1672 -7872 -5724 -6131
17563 -6131 -11740 -6669 6378 -3837 -8978 -4768 -12795 -6524 4081 13847 25408 22492 19102 7099
17549 7099 -3675 -11155 -1769 -6621 -8663 -7802 -8192 1171 8498 1961 95 -5272 -5801 -1093 -7460
17534 -7460 -15619 -20209 -18287 -12985 -19488 -4808 3164 3901 8461 1954 -4169 -8105 -4918 7047
17520 7047 4744 -8485 -2889 -5676 6253 10799 20521 16434 13149 8550 5798 11337 15057 15608
17506 15608 -2973 -10583 -5216 9685 15086 20716 24419 22520 17185 11731 6945 10174 59 -2249
17492 -2249 614 4813 10767 3051 -9164 -9207 -12715 -23801 -27862 -35378 -30656 -17632 -349 5421
17478 5421 -561 -13182 -21626 -12780 -5153 -14540 -21994 -23947 -13691 -5502 10638 3554 -3148 -5985
17464 -5985 -8572 -19013 -21324 -11248 -8387 -17833 -23805 -12669 -10247 -12100 -9451 -12813 -5253 -4222
17450 -4222 3098 8799 -5185 -14330 -18224 -19168 -11351 -5655 20722 42184 59133 58655 62226 72595
17436 72595 69036 60031 52685 32242 15543 -8520 -11326 5299 11186 10488 102 -2658 -11618
17423 -11618 -10216 -11987 -20706 -13860 -5106 -3628 -4577 -3116 -7447 -10433 -4468 -8188 -25123 -24610 -23723
17408 -23723 -22680 -13746 311 9267 -2131 -14293 -16177 -2497 3203 3868 12488 20925 21131 17521
17394 17521 21200 11096 2099 5134 -2770 -10647 -13388 -17366 -4322 -1768 1664 19604 12076 2018
17380 2018 -2556 -14426 -17565 -6569 6709 3638 1105 2191 6769 -2285 -11322 -13704 -11436 -10379
17366 -10379 -12681 -21886 -19056 -9921 4461 1875 -6220 -15185 -17940 -12789 -11035 -5521 -283 4633
17352 4633 -1542 -5143 4013 5165 14163 20140 21378 13706 -216 1388 1666 3352 4443 4510 -3974
17337 -3974 4921 1706 -8194 -11792 -5358 -9732 -9791 3841 18246 13481 -8092 -20287 -21486 -19650
17323 -19650 -14226 -13337 -6699 281 -8642 -23929 -23363 -20093 -11390 -8731 -9350 -6748 -10014 -24074 -30948
17308 -30948 -16150 -9578 -6900 -17477 -30910 -11862 -1285 8554 14374 13159 14507 14263 12965
17295 12965 8225 1224 -3257 -1682 -826 -5906 -12022 -6147 668 3136 4959 2847 -2977 -7618 -10210
17280 -10210 -9320 -4712 -8958 -1517 8999 18975 10527 266 -8031 -11129 -4769 -1756 -8266 -20185
17266 -20185 -16632 1985 8295 9561 -1128 -1145 1069 4704 -14792 -25811 -21708 -10534 -1589 -5681
17252 -5681 -3857 3486 1618 8566 -145 -5906 -10175 -16010 -7292 6151 7458 147 -8561 -10585
17238 -10585 -10928 -13534 690 11594 1382 -12089 -14387 -10422 -11886 -7745 214 11684 3484
17225 3484 1660 2507 -2207 -4106 -11969 -28544 -24274 -13013 -9375 -9243 -12832 -18347 -15457 -15742 -12925
17210 -12925 908 6531 7093 1081 -429 -179 3640 7590 2829 -10161 -19386 -21914 -21978 -15700 -1920
17195 -1920 1054 4958 4715 13789 11019 2674 2551 -5987 -6389 -7505 -4506 -3262 -7804 -4720 5427
17180 5427 7662 5958 -134 450 262 -1101 -12911 -22179 -27021 -20146 -12514 -15348 -2538 2580 4690
17165 4690 -4980 -4474 -5034 -7149 -6055 -9004 -20018 -21858 -17448 -12952 -21745 -16614 -19241 -14744 -1337
17150 -1337 -3113 -7502 -14937 -24172 -25207 -3143 -82 -7620 -4405 6324 9068 5472 590 14833
17136 14833 21553 20585 1078 181 2414 9681 6271 -6490 -11978 -21625 -22854 -16869 -8036 -7540 -10529
17121 -10529 -8826 -10360 -13189 -7869 2877 3314 4623 8221 7460 15198 4264 -4020 543 -2737
17107 -2737 -3033 -5988 -514 1374 4030 1044 -2450 -3684 -20101 -27710 -18257 -18760 -13054 -19280 -21159
17092 -21159 -22784 -32052 -31542 -19474 2851 -1986 -10551 -12579 -18200 -9966 -7023 -15063 -23694 -30130
17078 -30130 -18730 -17311 -24711 -28437 -26176 -18098 -19123 -18235 -12805 -5974 1761 1433 -6326 -9193 -17170
17063 -17170 -32907 -27864 -16725 -16442 -5227 -6309 -5547 213 7784 8764 -807 -1658 -2011 -720 3181
17048 3181 14333 22421 17351 -3191 1694 1937 -265 -2256 2001 6500 904 -1510 2833 14599
17034 14599 9257 3975 6961 -3493 -8838 -6850 -9745 -15305 -377 -4549 -10563 6862 16182 11897
17020 11897 1396 861 -4809 -7808 -9615 -7320 -7469 -14321 -16676 -11413 -4077 -7108 -13873 -9328 3875
17005 3875 4111 7285 12273 20928 18164 -7319 -14283 -21342 -23681 -28357 -32651 -29069 -17009 -5606
16991 -5606 6951 22761 10902 70 -3911 -4678 -3693 2327 10428 16344 22164 15263 12701 15214
16977 15214 17725 16370 3121 287 756 2843 2625 2830 2362 -14139 -14513 -3720 1669 10482 6049
16962 6049 -245 5364 10079 5221 7920 13476 14129 7066 2847 -6593 -7518 2190 1721 -12461 -10383
16947 -10383 -6376 -12263 -9676 -10755 -8976 -11830 -13552 -3912 -7867 -9738 -930 20451 28914 37928
16933 37928 30416 20002 25655 25720 10273 -1684 -8005 -6198 -2425 2944 9947 4603 2252 -297
16919 -297 -7583 -23766 -28749 -27740 -25461 -23472 -15985 -10889 -13269 -28093 -30339 -28629 -18880 -13007
16905 -13007 -15045 -15770 -19522 -21124 -22141 -12233 3909 1943 -4723 -5859 -2410 -6478 -20818 -23369
16891 -23369 -15928 -18047 -19742 -23745 -18251 -7470 -1577 -1603 -12377 -12702 1017 2947 10470 14426
16877 14426 15138 7791 -3975 -15708 -16472 -15367 -9714 -8094 -7453 -9053 -10087 -5840 -8437 -7737 -8477
16862 -8477 -17276 -17496 -14363 -5513 6799 3057 3687 10980 10244 12630 9844 12938 11254 -3725 -19292
16847 -19292 -15797 -2145 14318 8850 626 -12114 -14001 -898 6806 385 -6775 -3539 -130
16834 -130 -2982 -6583 -5119 -8288 -12264 -4167 -8608 -16681 -12509 -4769 -1329 -5982 -16085 -20579 -5971
16819 -5971 -1469 -2298 276 2034 -20374 -27282 -12988 -5024 -13780 -28076 -29664 -20782 -14230 -10780
16805 -10780 -5654 7015 13223 748 1358 2612 -2302 -8094 5411 10130 4461 8628 10676 7467
16791 7467 4825 477 10941 13831 9742 1423 7032 4563 7923 3290 -11348 -1083 2288 3683
16777 3683 2782 5236 15942 20965 21066 12682 7601 3303 -5119 -10227 -8774 -9482 -5262 -8551 -7886
16762 -7886 -7575 -14929 -10804 -4011 4150 4335 83 4652 -1451 -779 -3578 -14048 -7437 6838 4084
16747 4084 4923 27 -3581 4460 2442 -7251 -6345 7251 3619 -4758 -9017 -11926 -8229 -4703 4957
16732 4957 14784 13762 -322 -6675 -5586 1814 -5076 -18612 -14299 -10822 -21350 -13116 -6446 -15002
16718 -15002 -21012 -19412 -18504 -12134 -6058 -3074 -2475 -8354 -3973 4861 7613 -2105 -10679 -13198 -10703
16703 -10703 -8773 -11813 -22621 -15937 -9296 -10145 -13652 -9891 -5656 -4419 -2350 -10490 -17637 -23912
16689 -23912 -10902 -603 1977 -1623 -7953 -13797 -7127 -2515 -4577 3833 -794 -1187 2017 6522
16675 6522 7216 2797 623 1145 -4239 -5266 -7514 -4365 2126 7983 5252 -6102 -11911 -16215 -20039
16660 -20039 -10230 6914 -3682 -15617 -11987 -13186 -3269 5151 -8777 -28728 -22712 -10538 -12646
16647 -12646 -8397 -10067 -7019 -7863 -13612 -20970 -28030 -22839 -13399 -9617 -10140 -10543 -17696 -17077 -4262
16632 -4262 -4408 -9459 -11695 -15583 -9584 -7201 -261 7090 4362 -972 -14896 -19293 -6293 -1043
16618 -1043 -4470 -7039 -3600 3640 16227 16756 9814 13434 8200 783 -7496 -13461 -15277 -14019 -12914
16603 -12914 -8870 -12759 -13429 -11708 -10993 -11206 -11070 -7616 -3537 -5454 -7320 -14000 -10479 -10904 -16407 -9273
16587 -9273 762 -5361 -5021 3527 9886 7888 -2105 -12286 -17620 -14651 -14859 -21726 -10343 -5700
16573 -5700 -8131 -1622 3920 5642 -335 -8752 -4170 -1109 -4057 2577 -6945 -18945 -15794 -22492
16559 -22492 -19885 -11883 -19559 -30436 -32584 -23243 -4208 6576 -2771 -12574 -10046 -5642 -358 3127
16545 3127 6597 12183 8954 10311 1363 -528 -6703 -6640 -3254 9392 15296 17748 17103 11480 17968
16530 17968 18581 13840 18869 7887 -3985 -12758 -15344 -16328 -12322 -3669 -13672 -13721 -4507 -7448 -8194
16515 -8194 -4344 -11928 -24023 -18667 -14363 -16080 -7938 -5599 -6136 -16479 -10444 -3917 -10908 -5454
16501 -5454 2762 -1565 -8878 5275 19160 18984 19111 18184 6354 -6272 -7730 -2908 -5063 -1792
16487 -1792 2215 -15353 -15829 -15022 -1695 12654 7086 -916 -2385 -2112 -6555 -16067 -4148 -5
16473 -5 -14816 -15078 2194 -4916 -11833 -6830 -2467 -220 864 4082 86 -5252 -5579 -17979 -9629
16458 -9629 707 -6676 -5316 11502 15492 12397 10257 9683 3042 349 -5588 -14299 -18506 -18875 -13809
16443 -13809 -9710 -10361 -18202 -13460 -76 -132 -1267 -7859 -5713 -4561 -15819 -22224 -19968 -21905 -16720
16428 -16720 -2919 6432 -5493 1145 1683 586 -7042 2164 -3349 -13587 -13911 -9205 -7000 -12317
16414 -12317 -18409 -16167 -10957 -10015 -13150 -9552 -123 -3583 -12416 -10538 -5035 -3909 7976 18241
16400 18241 13469 4570 3572 -6601 -10304 -12525 -12104 -5363 1666 9535 13995 19237 8316 779
16386 779 5774 5801 1970 -3701 -2940 6608 2077 -373 5369 8896 9760 7212 6546 -1105 -12204 -22463
16370 -22463 -26015 -22783 -12456 -10748 -16857 -13983 -13170 -17321 -27573 -15889 -7544 2036 206 -4376
16356 -4376 -7208 -2402 -23488 -29284 -21622 -19775 -17841 -11256 -9951 -14359 -13687 -20335 -15633 -321
16342 -321 1274 1941 -11130 -23150 -18620 -7807 -945 -2052 -9254 -11162 -3921 -1522 -392 -2628
16328 -2628 -10236 -12938 -3455 -1653 -5640 5855 7523 7264 -12836 -12955 1845 11609 12191 9074 7636
16313 7636 880 9095 17437 22245 24728 19278 20765 24702 31017 24308 14103 6603 15120 12662
16299 12662 3498 560 6545 4968 2757 -1132 3658 10547 14789 9857 6356 -2351 -9740 -12362
16285 -12362 -21422 -13497 -7780 -8199 -2646 1565 -1576 -8263 -10344 -1605 8470 5965 944 -11405
16271 -11405 -13100 2409 16272 13682 -4367 -3906 6889 9804 3912 -7841 -6743 -11957 -18483
16258 -18483 -29478 -27371 -24407 -23975 -16064 -11656 -5103 7439 1844 -10842 -5684 -6310 -12667 -14980
16244 -14980 -11908 -4973 1309 -5897 -9684 -5583 -6905 -1718 6518 -1143 -6833 -11280 -7196 10232
16230 10232 13285 -4879 -7996 1096 3096 -7420 -6181 -15461 -13955 -13549 -2410 -4817 6644 -3376
16216 -3376 -8033 -6993 2403 11853 3774 -13238 -8159 -1179 -1251 -10199 -9930 -975 3327 2060 -2026
16201 -2026 -4840 -7002 -6039 -97 3011 -3060 -5568 -10226 1286 -1463 -1463 14608 16102 2838 -7841
16186 -7841 -16071 -12457 -7181 1922 136 -3962 -7194 6264 9302 -2401 -9414 -3970 9985 16646
16172 16646 -1060 -7476 -5127 -2583 -11887 -11306 2836 2303 6556 125 -2533 -1395 -220 -3354
16158 -3354 -3996 755 -2602 2680 17247 16226 7909 4857 -4056 2456 3454 2147 -1985 -2557 6794
16143 6794 -2293 -13516 -16901 -11514 -13676 -11862 -4609 2404 8169 11154 4390 5691 6618 793 -6924
16128 -6924 -8436 -4272 -1507 8478 11103 8596 3752 -6612 3021 3507 -5647 -10657 -11716 -2239 2345
16113 2345 -5361 -2298 1411 -4809 -12183 -7058 -5196 -8179 -9021 -14958 -8156 -6757 -11927 -3116 6251
16098 6251 4642 13564 15416 10807 -9147 -25077 -26100 -23623 -14918 8023 25092 6895 6173 15257
16084 15257 6265 -3438 -2802 -5836 -18964 -25466 -21604 -30230 -33641 -37899 -35809 -35225 -23789 -16214
16070 -16214 -11561 -4092 -7244 -9971 -12122 1536 -2414 -14775 -27350 -42167 -38037 -27043 -25551
16057 -25551 -4928 -8761 -12059 -13894 -21097 -25787 -10073 -2616 -13177 -15236 -10618 -13611 -16854 -7979
16043 -7979 -6511 -3382 -2112 -1635 -8382 -14956 -15339 -6464 8247 17438 12361 -7081 -6114 -1221 -3518
16028 -3518 -11271 -4350 -9295 -3705 -4020 -1637 -2380 1896 14235 21507 12490 8017 4081 -5156 -12551
16013 -12551 -13481 -8017 -2738 2626 1693 7536 14389 8071 2129 -11307 -9273 -7905 -10074 435
15999 435 10745 15226 -1346 -7315 -11111 -7413 -8346 -12158 -10023 -9582 -8420 3591 7489 9709 8885
15984 8885 14594 18966 6656 444 -11412 -5495 5746 13618 10280 1989 3966 650 2922 5250
15970 5250 10175 8852 -9226 -17763 -14385 -10981 -8965 4266 4154 -1988 -5574 -14930 -14364 -9200 -6933
15955 -6933 -10947 -10425 -16409 -11650 -5098 5626 11003 14282 16224 19166 13999 1991 -3634 -3885 3822
15940 3822 -513 5170 14851 -1393 -3075 -2736 -10919 -5586 -642 8226 24312 27005 15370 14073
15926 14073 12328 8639 3182 5554 3080 -12620 -25406 -25945 -23544 -12652 2411 7204 4021 9759
15912 9759 8573 2579 3720 9452 3956 -11853 -21486 -11551 -2509 -3481 -836 -11401 -19699 -13531
15898 -13531 1368 2777 4532 2163 -8077 -9223 4849 3007 11745 6195 3791 7926 7258 -1835
15884 -1835 -15014 -10220 -4495 -1817 -1431 -5552 -7356 -4941 7085 5545 12134 10961 1647 -6224
15870 -6224 -11487 878 5625 5270 2347 5539 968 -7652 -11594 -7753 -1353 -10649 -11419 -3919 5411
15855 5411 11028 11322 5386 -364 -1969 -28780 -36727 -20477 -2671 5111 383 -2897 -9403 -15171
15841 -15171 -9257 9776 5590 -7104 -9832 -15700 -23844 -22657 -21017 -23989 -10967 -3723 -7210 -20530
15827 -20530 -18608 -16938 -16681 -4054 -3141 -14627 -14010 -15222 -14571 -20366 -21331 -19021 -11506 -1731 -16292
15812 -16292 -20145 -21370 -14440 -10610 -7275 -3795 5591 3771 -7053 -16243 -28837 -27134 -27449 -28284
15798 -28284 -24188 -14841 -27447 -14847 -16267 -18363 -12942 -17062 -955 3899 2993 -1101 -4652 -3067
15784 -3067 -1546 3380 -5723 -19030 -16478 -9927 -4538 1565 7480 -5040 -11879 -8086 -899 8818
15770 8818 1916 -17198 -22388 -25272 -20329 -9741 747 7752 1556 -6919 -4633 -7361 2027 7234
15756 7234 161 -9595 -5770 -7582 -3791 -10045 -21498 -23736 -26993 -15831 -6004 -7715 -5168 -6585
15742 -6585 -16532 -14519 -3739 4467 -1110 -3935 -16917 -20664 -24965 -27532 -13215 -3310 -1179 -4878
15728 -4878 -1196 -3292 -9105 -13240 -3632 5360 -7028 -15247 -13965 -16951 -18004 -17307 -16502 -14272 -18620
15713 -18620 -25694 -15235 -5191 -3978 -2688 10061 7759 -1737 -17376 -21874 -20680 -22554 -23232 -16771
15699 -16771 -9659 -4719 -1508 1526 575 -3789 -15406 -23377 -10638 -6041 -1798 4766 5895 84
15685 84 -9048 -5389 -5571 -8178 -5091 -5590 -4327 -9311 -10447 -2916 954 -5852 -16304 -22897 -13570
15670 -13570 -5738 -4405 5625 3048 7859 11444 14089 9420 12992 5572 -11394 -3160 407 -118
15656 -118 6227 7138 -12 10609 3690 -4269 -8057 -11301 -18461 -21188 -16131 -13011 -10170 -3161 -4209
15641 -4209 -1659 -9278 -22906 -19580 -9016 11394 14180 -1092 -28984 -30903 -23535 -19081 -19214 -17940
15627 -17940 -15702 -16446 -9491 -4572 -8917 -2883 10970 2128 -5090 -149 1884 291 -3207 -3534 -2528
15612 -2528 -6829 -3556 3952 1411 -1978 5481 -9609 -16048 -9028 -6866 4174 6105 -1601 -7651
15598 -7651 -5278 100 4622 8935 6608 -1356 -8862 -19731 -19073 -24351 -22791 -19990 -28972 -25773 -23885
15583 -23885 -17215 -14278 -22174 -17793 -8364 -7136 -15108 -18585 -18100 -6725 -9144 -2663 10764 5559
15569 5559 5778 1351 -798 -10203 -9584 10896 18387 14773 2191 1051 -96 345 -4628 -13010 -20475
15554 -20475 -5396 12505 25535 21412 20847 15403 5859 17198 26139 9339 -145 9768 23007
15541 23007 16403 7944 5894 4331 10614 19352 17240 19111 13260 -4724 -9045 -14375 -8044 -4108
15527 -4108 -15628 -26180 -8038 -4267 -5694 2637 11655 12960 19483 13204 5280 3827 5702 5317
15513 5317 249 1809 9460 7637 -6811 -14854 -14513 -11550 -6710 9693 5446 2918 1048 -2309
15499 -2309 -6104 -17944 -31047 -29645 -15528 -5214 431 -2424 -7653 -293 6739 -6208 -22621
15486 -22621 -21121 -7741 -11274 -26411 -32988 -24442 -18767 -13099 -17637 -13154 -5577 -3398 -6424 1516
15472 1516 -159 4877 16188 15465 20431 16557 5294 1453 -3072 -12114 -6966 5197 2246 -7272
15458 -7272 -2060 -8687 -5613 -5884 -23147 -11440 3536 5502 11734 16165 8648 -414 -6599 -6694 -4429
15443 -4429 -1444 7568 -5076 -1313 -5549 -4873 -2715 -10536 -11824 -3711 5127 11858 4932 1706 8559
15428 8559 11871 15307 5439 -465 4750 -5825 -7770 -24 -1431 -9996 -12159 -10949 -15501 -19773
15414 -19773 -4952 366 4142 79 -3715 -8614 -6527 5145 4097 -1921 -7254 -6656 -2531 -493
15400 -493 2663 -2948 3379 10352 13453 13625 8810 7432 6566 16409 17685 10463 7735 8675 7872 5987
15384 5987 7799 -311 -386 -3632 -23075 -20405 -8086 6904 22882 20647 6901 6448 4582 2364
15370 2364 1077 -2017 4990 352 -11688 -16727 -12244 1644 -7148 -5669 6237 1803 -3474 -9634
15356 -9634 791 6589 1255 4472 -111 -8917 -9649 -2513 7595 -11344 -7577 2152 -7506 -15608
15342 -15608 -2893 5114 -1632 -7239 -6567 -4762 -15895 -12504 -16389 -14856 -24110 -27920 -17610 -11274
15328 -11274 -25415 -29929 -19068 -4157 -11159 -16728 -17914 -3683 -2587 -10983 -3187 3157 11069
15315 11069 5414 -8470 -2153 904 -5068 -3026 2104 7377 6751 -1290 -7046 -2338 388 1123 -5004
15300 -5004 -6683 3898 1292 -5079 -6621 -10308 -24324 -21829 -11263 -775 4279 -4452 -10768 -6720
15286 -6720 4033 2531 5485 10098 12388 5873 932 -6642 -13016 -1676 6345 3719 -6081 -2128
15272 -2128 -3126 -11706 -17675 -10727 -7840 -6278 -4388 -53 -5970 -9592 -2257 -12606 -17964 -13900 -13456
15257 -13456 -9982 -7501 -4283 -15801 -17488 -13601 -5896 -3632 -8417 -6992 -1492 -3073 -12391 -11429
15243 -11429 -5747 781 -7156 5650 17195 5455 6933 379 -1560 -2596 758 -1830 -9803 -3945
15229 -3945 8509 17632 1527 -8907 -11158 -8041 -12371 -13995 -8081 8457 15718 9194 -2031
15216 -2031 -9619 -6801 -1775 -7969 -6684 -5405 -6518 -15509 -12898 -6917 -10447 -12718 -22012 -19830 -16851
15201 -16851 -15657 -3671 4991 4134 -208 -6535 -4018 -12891 -14493 -16709 -2090 12090 4202 -7117
15187 -7117 4783 21641 14788 11237 10558 14537 14848 19264 20295 22611 6161 -3224 -5527 -14111
15173 -14111 -19753 -16729 -13348 -16275 -21606 -16365 -12808 -16148 -22450 -28175 -9484 3010 6685 13208
15159 13208 19906 21760 13886 -5813 -12521 -15000 -9374 -7337 -21804 -15866 -18378 -17527 -9245 -11248
15145 -11248 -8576 1876 14626 15168 5531 5047 1116 -14650 -2371 4339 9176 7571 -520 -2852
15131 -2852 -5657 -13745 -12792 -15959 -16138 -9002 1388 7428 11617 1134 -7320 -18663 -23145 -22895 -23630
15116 -23630 -20328 -10575 -7837 -1397 14375 14352 4131 1531 -979 3123 9240 12995 721 -10696
15102 -10696 -7064 5394 5475 3952 10912 9522 -501 -4942 -12264 -25723 -14272 -15879 -1404 8592
15088 8592 16438 8950 4056 5772 3295 5702 8864 -2570 -13177 -12220 -1206 1635 -11955 -23258
15074 -23258 -18104 -5851 -6128 -6604 -877 -7063 -16186 -11115 -10245 -14297 -16163 -13864 -19881 -17312 -5083
15059 -5083 -2571 -13082 -12750 -8344 -12579 -30373 -25499 -3314 -1989 -10673 -12127 -11425 -2241 8745
15045 8745 3213 -5834 -9542 -5697 -4021 -5806 -17055 -14718 -2211 19110 23249 6631 -5377
15032 -5377 -2028 -351 4187 12637 19992 15617 7012 3356 -4204 -9418 -12509 -9564 -23844 -18794
15018 -18794 -8010 -18269 -26231 -27111 -15795 -13093 -1205 4809 3342 6623 -2711 -3792 2750 9496
15004 9496 9997 10231 2433 -2187 -1851 14434 19993 29310 26482 3651 3240 3634 -4260 6954 19922
14989 19922 23297 11999 2088 7053 6751 10469 9308 2125 11514 -2185 -19610 -22223 -12714 -9175
14975 -9175 -2056 -367 1434 5544 -4708 -17560 -14751 7385 18282 16747 2512 626 7809
14962 7809 16118 13640 4635 6284 7236 4528 -27 472 -4905 -6310 2163 -233 -2930 -8717 -13120
14947 -13120 -15164 -8150 -235 -2334 -11348 -6874 -15826 -9498 7158 10717 10119 9886 -730 -2780
14933 -2780 -11806 -27898 -24798 -15453 -3503 -13694 -8414 -6273 -386 -957 4190 18330 9888 -3832
14919 -3832 -1060 552 1176 1664 -7117 -20867 -18710 -13372 -16054 -6938 -6083 -11570 -3855 3221 -1814
14904 -1814 -5680 -3205 3847 13229 13034 5230 2546 -3538 -8686 759 9294 -2921 -10903 -13676 -11338
14889 -11338 -8940 -15604 -23181 -10170 -7747 -5279 -3001 6491 6604 -1933 -9956 -6831 -12993 -4871
14875 -4871 3288 8151 14905 19630 15840 6227 3576 4033 -4757 -15648 -12706 -9703 -12133 -9111 -10784
14860 -10784 -9612 -1185 2310 10844 7575 -3644 -4785 9623 5728 4103 7046 14454 8825 3640
14846 3640 -5858 -19509 -9363 324 9624 15872 8540 3884 -6652 -6961 -9267 -4616 2669 12330
14832 12330 10884 -275 -4735 -1459 -1563 7019 5785 6551 7189 9734 -5221 -11027 -4700 -3915 1323
14817 1323 10432 12358 7227 1218 -6416 414 11114 -736 -19236 -15676 -17850 -21572 -18634 -18468
14803 -18468 -5119 4278 12195 7461 3851 228 781 -3648 -14207 -5694 12137 14100 -907 -2755
14789 -2755 630 249 -7959 -10321 -2912 -843 4333 -3621 -9021 1060 13834 13832 14302 6576 1631
14774 1631 4490 1958 6349 -7585 -20369 -13280 -14113 -8619 -10880 3074 17305 9662 5423 4223
14760 4223 -917 4434 7072 5187 -2585 -5462 -504 -7099 -9329 -9461 -1082 4609 -3903 -2472 4354
14745 4354 11821 11323 3827 -5608 1820 -517 -1529 -12082 -8849 -19714 -18141 -5713 1999 4155
14731 4155 8855 -5763 -263 4175 -1681 -9819 -4101 -10228 -14880 -16884 -16467 -18465 4048 5606
14717 5606 -567 -5625 437 12207 15543 11652 -3398 -10327 4625 -7926 -6283 -9745 -13717 -28444
14703 -28444 -29664 -16456 -11145 -10520 -9592 -12537 -10711 -14420 -17832 -13488 -21713 -31025 -17666 -6089
14689 -6089 -3426 -9028 -16663 -10208 -1657 13296 24288 26989 13193 3980 6134 15606 18140 9416
14675 9416 36 205 6276 14049 14933 -90 -5073 -5604 -9679 -6043 -5980 2414 -9574 -11284 -15351
14660 -15351 -7562 -5046 -10471 -1133 2356 4859 8168 3220 -3107 932 -1156 -2391 -363 -4622
14646 -4622 -1242 2383 4858 8997 1972 -11334 -23361 -26828 -5002 -3042 -1232 1463 -7747 -8740
14632 -8740 -15674 -7556 6328 13829 3623 -12654 -4187 -553 -10541 -11413 1779 -2141 -993 11354
14618 11354 6403 -1871 2494 9280 10261 21207 22972 15542 14356 10805 -4759 -1639 -1805 13757
14604 13757 11348 6020 13003 10449 2450 6511 11321 10384 -2583 -2945 3846 5885 9392 288 2163
14589 2163 7181 6212 -672 -10987 -7128 2211 8219 9166 12363 5787 4958 11565 9351 13692 17936
14574 17936 16661 8654 3287 5775 7910 -302 -10563 -8518 -6546 -22658 -12078 -4797 -119 9902
14560 9902 3605 -7394 -3238 -1783 -1267 13842 21704 18740 2353 -6535 -4376 -11904 -15341 -4467
14546 -4467 14474 14706 12121 9804 4765 -8227 -10890 -14332 -18670 -17215 -17825 -3100 2782 -5663
14532 -5663 8745 11328 9483 5312 -4588 -6386 -7652 -2616 -2551 -1468 -3356 488 13631 25254
14518 25254 19182 5081 1092 4006 -251 -6 195 -6189 -12283 -9509 -16145 -14927 -4722 874
14504 874 9053 15844 28965 19177 -92 -5174 -1701 9484 8686 3585 5083 4437 -2071 9643
14490 9643 14362 12657 2432 -2604 -10732 -13431 -8262 3097 -6873 -6821 1459 327 -2009 3316 -3923
14475 -3923 -2935 10683 11839 12303 -1606 -10214 -12605 -11605 -8793 -12076 -9961 -848 0 -8332 -4830
14460 -4830 -6055 -955 -10121 -16187 -226 8930 4700 2614 -8262 -21729 -22378 -11666 -12667 -22854
14446 -22854 -21006 -25162 -14480 -6199 -15420 -10820 -3743 221 7761 4392 -640 2141 5932 8268
14432 8268 6355 4153 -3328 -3418 -6059 -1916 -4333 -13089 -450 631 -3310 -11597 -17577 -16779 -73
14417 -73 7717 3678 -1327 -1007 -8557 -8579 -9567 -20167 -23680 -17287 -5249 3737 -4839 -8069 -460 -16704
14401 -16704 -14105 -3673 -2547 -9776 -21502 -17765 -5954 -10636 -19182 -19951 -19157 -22915 -26452 -8631
14387 -8631 -2419 -5357 3202 -557 -8226 -1334 -3185 -7678 -18477 -27644 -17646 -5485 -2557 -5686
14373 -5686 -3924 -11321 -9275 645 9163 12718 16264 3419 -6352 -11985 -6745 -5906 -1982 9355
14359 9355 9859 5060 -4509 -6805 -2685 -4283 -18150 -24173 -8696 4560 13912 11866 1430 1329
14345 1329 4835 6931 12154 6492 8641 8509 -1591 1591 7583 10345 -822 -3781 -1679 12210
14331 12210 18751 14696 13694 12161 12848 12045 10126 1868 3498 7146 1068 4672 3292 9115 11368
14316 11368 468 -3684 -3388 369 -1660 6286 -1262 -8643 -17352 -21881 -16852 -17853 -21454 -13451
14302 -13451 -4103 3596 10586 -1280 -8714 -4753 764 4997 6761 -2487 -6265 -7190 -2397 -15264
14288 -15264 -30793 -38651 -17142 -13045 -21347 -16502 -8439 -7121 -7511 -11116 -8868 -14618 -23705 -30318
14274 -30318 -20512 -20675 -24126 -11975 2451 9375 5881 2879 -1124 2079 -7100 -19113 -24278 -24713
14260 -24713 -20633 -14652 -5570 -4128 -1623 2205 -4625 -6950 -172 3255 -769 -3243 -4247 -7875
14246 -7875 -18199 -27393 -19021 -13894 -12102 -5048 -8805 -16834 -15504 -23195 -21412 -24814 -34483 -29196
14232 -29196 -7972 816 1428 -4844 -12149 -11685 -5277 819 -1393 -9977 -5085 -944 -3668 -9404 1589
14217 1589 -10213 -22498 -25763 -27918 -23847 -144 4036 3398 -1468 -16916 -24859 -21196 -12671 -12928
14203 -12928 -17014 -14978 -4487 -9423 -15915 -15704 -21661 -21040 -22368 -10858 2925 11467 10660 206
14189 206 -5581 -9244 -8567 -11186 -9295 -18019 -23479 -10754 -6639 -7222 -15385 -19195 -4320 6855 6243
14174 6243 10587 15241 8730 2976 -5377 -6599 -8358 -4774 -1319 -8554 -25659 -24915 -12118 -9706
14160 -9706 -13263 -18175 -11427 3870 3082 2745 -7137 -7041 -8224 -9878 -8203 3458 11690 17067 10438
14145 10438 911 -4366 -8154 -5329 3221 7715 2224 555 -3499 -3948 -5610 -11699 -15355 -7743 -1696
14130 -1696 1489 -9421 -2994 3664 6813 15505 6479 -4857 -3592 -8195 -5162 1137 2399 -2318
14116 -2318 9826 13646 255 2796 -6274 -11425 -9098 -15390 -13394 -12474 2160 7847 -184 -6770
14102 -6770 -18200 -23073 -15089 -9128 5188 17499 13514 10608 12465 17344 8471 5485 4630 -6272
14088 -6272 -10045 -12513 -15338 -7721 -10115 -110 479 706 -2415 -3770 -4135 -7233 -10143 1700 11819
14073 11819 5588 4342 -811 4508 2224 -6325 -4729 9396 19432 16380 6307 -1177 -1598 12161
14059 12161 6262 -9263 -12300 -2409 -10342 -20252 -9254 -491 7488 4938 -2520 5367 4715 -9611
14045 -9611 1200 5043 9459 6730 268 -7675 5449 10459 6417 4617 602 7152 2388 -86
14031 -86 12090 4958 -4993 -6394 -9066 -16943 -19902 3611 12319 3484 -11171 -20391 -20677 -8169
14017 -8169 5397 2812 -8253 -13490 -13686 -5487 -7071 -2960 551 -756 -10809 -9846 1470 13342
14003 13342 4650 -3369 718 2217 6324 15869 18995 4189 6040 2783 1083 10339 13174 9903
13989 9903 11760 16382 3003 154 5854 7023 15580 22670 20661 20813 21507 20817 9150 4669 2843
13974 2843 -6485 -8651 -10466 -10827 -3983 -7493 -6831 4672 -4247 -5129 -3786 10453 423 -19524
13960 -19524 -26555 -8370 -192 -19914 -14076 -19839 -24184 -14137 1468 -3697 -3248 -3547 -5193 -2741
13946 -2741 7900 6919 7048 -3626 -19691 -26130 -32182 -24765 -18711 -11538 -12125 -12859 -18860 -13635 -6029
13931 -6029 1357 -808 12231 16064 12694 17577 15478 12931 18766 9334 -5584 -6292 6974 6826
13917 6826 -1023 -6473 -6880 -1956 -998 -5631 -6994 946 -3910 11921 24860 26556 20469 9839
13903 9839 6521 20759 21852 13273 5111 -701 4893 2300 12707 26917 24183 15770 18492 13422
13889 13422 -3701 -4106 -3169 4102 20107 21273 11486 2172 893 -9452 -12507 -10678 -16191 -18417
13875 -18417 -13263 -2738 925 -1738 2469 15710 12850 1492 4160 5664 15246 15361 3523 580
13861 580 1434 4596 3946 10407 8356 12043 14459 22242 32094 25087 22266 18111 13522 19124 9114
13846 9114 -59 -9314 -4897 9976 14281 4311 -962 8987 5851 -948 3093 3258 4977 -244 10177
13831 10177 18910 18730 -1598 -15987 -7832 361 4582 -3328 -13392 -8262 3287 5471 3881 10851
13817 10851 13246 5777 11837 19496 11596 1456 1605 9411 21490 12035 -8824 -6137 -6747 2321
13803 2321 -2570 8970 4787 -3624 -12353 -7401 -2992 738 3104 4530 -12654 -19591 -11430 -11834
13789 -11834 8663 3356 -10214 -20178 -10305 10285 28052 16570 1787 -18149 -16963 -429
13777 -429 4348 15026 8642 7987 -4523 -6434 -2501 -7422 -4798 2481 8084 5161 4849 1652 11565
13762 11565 23440 25292 10057 4744 5769 8199 15711 2363 -10843 -7659 4869 6470 14624
13749 14624 16530 16722 12863 3323 -187 4929 8685 2183 -10201 -10573 1303 2725 12293 12748 7314
13734 7314 -6608 -11504 -9586 -1635 7056 11843 15651 13076 -2129 -19628 -28608 -14259 5681
13721 5681 5760 1 -1921 -5618 3393 6554 -5354 -9083 -4777 -6387 4141 7041 1467 6712 24981
13706 24981 19032 9520 2676 676 -5899 1379 -5701 -9693 -5264 4132 14262 4943 12473 14325
13692 14325 19209 11366 1350 4668 6859 6807 8720 -3017 -9194 -371 4285 11705 4222 5971
13678 5971 10116 1030 -4499 6994 11563 1940 8087 23387 22763 13689 11556 12641 20366 18132
13664 18132 13773 21951 23398 9378 6685 10686 1367 -2367 -1515 6568 3419 4811 3049 2101 6789
13649 6789 4344 -7360 -10829 -8747 -12933 -17409 -12266 1823 13560 20483 7466 -3052 -15229
13636 -15229 -8155 -4565 -17049 -10275 -8061 3162 552 -2636 -10102 -9323 -11343 -7740 -1544 9859
13622 9859 906 7090 18094 18065 5467 -2446 -8499 -3465 -6484 -11359 -4887 8254 -966 1616
13608 1616 16656 34968 24908 -1013 11720 27694 22328 4842 -13873 -30861 -30412 -31501 -12298
13595 -12298 18295 33716 29322 32109 36536 34097 26978 17103 8998 -5018 -25341 -9799 -1242
13582 -1242 -13190 -23911 -17344 -12073 -9520 3598 16018 7906 -4241 3202 785 -938 -280 2478
13568 2478 8486 5765 -2818 -15435 -18753 -25438 -25158 -10659 -12688 -7959 1311 -3218 380 4849
13554 4849 5929 2680 493 2737 -807 -7955 -1870 10764 8690 14416 17864 21474 20083 12841
13540 12841 -7229 -18378 -15035 -18668 -13007 -748 1295 -6532 -2569 2406 6351 8418 1871 -861
13526 -861 1327 9622 13332 9380 6913 -11206 -15294 -24129 -13594 -2105 -6206 -3544 -6765 -2840
13512 -2840 1657 -6115 -9900 -4582 -1699 -3293 -20130 -16314 -12761 -13804 -11149 10823 14976 13868
13498 13868 8510 622 -4825 7132 9176 -1861 -5052 -2773 -14197 -14887 -9027 -9988 -4932 6433
13484 6433 -1145 3 12822 15611 -1156 -11994 -730 -5488 -3283 2213 -3156 -7278 -5663 -12329
13470 -12329 -13682 -3280 6420 3512 -845 3046 5575 1236 -143 -6456 -13403 -8951 -3628 -3511
13456 -3511 2156 9062 6003 14443 16659 11807 17617 34596 54815 59148 54031 60972 57163 61800
13442 61800 71016 61175 38608 22201 17191 20644 13249 15007 14484 6785 15337 19482 5611 2699
13428 2699 10108 15945 20880 9157 -8467 -6061 1766 64 -5255 -9696 -15342 -18784 -11613 2111
13414 2111 -882 -13118 -18395 -13347 -11614 -4360 -10840 -12734 -5127 7874 6732 1479 712 12891
13400 12891 20909 12319 4637 5560 13320 4724 2387 1082 -1086 11898 25731 21353 9587 3572
13386 3572 6554 483 6653 15484 24505 21162 9512 42 -2667 -1258 -5192 96 -1012 -10044
13372 -10044 -4618 5666 27411 29488 17943 16075 22103 28292 41657 33732 16924 18218 1833
13359 1833 -8534 -19842 -7925 5554 2021 -3933 -13011 -4894 6376 12917 -2734 -7338 -10582
13346 -10582 -12320 -8834 -9352 -4218 -8471 -8842 -7980 -5576 -5272 7588 12805 12077 16780 17129 9853 -2914
13330 -2914 -6253 -5717 -2357 -4699 -323 -8207 -12525 -15352 -19371 -18932 -14197 -17747 -14583 -7568 -13195
13315 -13195 -12982 -10661 -811 1163 4749 3057 -6872 -7975 -11089 -13869 -9398 -4484 -2753 -294 11607
13300 11607 10446 2847 -192 1399 2779 3184 2115 3054 5177 3602 -4780 -6683 -10826 -7760 -1128
13285 -1128 -4056 -10109 -12733 -6776 -4724 -9030 -8485 -15452 -19878 -21313 -15883 -9578 -1916 -1529 -1392
13270 -1392 1677 390 -3946 9568 18066 13932 9369 12800 17775 22373 14161 10106 7856 3453
13256 3453 18929 14612 3201 -10039 -11881 -3055 -5749 -145 16689 15598 11871 23078 6752
13243 6752 696 6580 2138 7150 6616 19581 22084 17448 421 -6296 -11254 -4634 963 5361
13229 5361 7605 1405 -8118 -8832 -8141 1375 2682 1009 -6411 -7265 -9412 -13545 -10647 -21800 -10927
13214 -10927 5396 14251 16459 13160 15598 18191 10413 3987 -3209 -12968 -10867 -12266 1451 14826
13200 14826 18173 15536 14380 20696 11634 -6743 -2490 5761 6094 8055 3850 -372 1652 -1753
13186 -1753 -6984 698 7893 7644 6034 -6016 -11555 -8271 -9764 -852 -3804 -10949 -8443 -3736 3043
13171 3043 2941 5971 7394 7676 10869 7362 15679 15740 3901 11126 11701 10985 36 -11540 -3943
13156 -3943 5950 -87 -10412 -12992 -5442 -12671 -16024 -12728 -778 -5586 -15158 -3660 -2142 -1379
13142 -1379 -6372 -15875 -18757 -4741 168 -13559 -10293 -6513 926 3347 -5107 -17152 -2226 6210
13128 6210 8038 9925 -19 -7315 2117 -2422 292 5364 20895 20129 10331 10366 11542 6127 7717
13113 7717 669 1830 4478 3263 3737 222 -11025 -13333 -13059 -4116 -1333 -1655 -7346 -17497 -21273
13098 -21273 -19557 -18142 -14679 -7686 2686 8620 10590 12525 15172 -3731 -20018 -12487 -16556 -9301
13084 -9301 -14732 -16730 -16484 -21221 -13297 -12790 -5442 1575 -376 -959 -2445 -6755 -4935 -4402 -5997 -5545
13068 -5545 -1104 -1654 -4691 1629 4608 -4332 -11246 -22227 -34267 -31336 -12154 -5084 3583 8829
13054 8829 2067 -12436 -7477 1548 -3989 -1923 1081 17918 16408 19871 18019 13153 2585 4829
13040 4829 -1982 4884 11676 6252 3908 2919 8220 6220 693 -6529 -6029 -5176 -4319 -15313 -17886
13025 -17886 -16148 -15746 -21034 -12715 -8324 -2338 1180 6806 -1047 -2478 4582 5162 9421 7435 -1443
13010 -1443 -11240 -11208 -11294 -2344 1502 -6909 974 -148 -7705 -17260 -19925 -15612 -5515 -12946 -9448
12995 -9448 -3870 -12843 -4872 16850 24873 17475 12605 -8183 -9719 -7682 -9891 -4179 -2856 -1067
12981 -1067 -9764 -9183 -6295 -42 4916 -4705 -8469 -3127 -5633 -10851 -1749 1277 -8376 -5886 -61
12966 -61 1311 -3439 -3718 -8814 -11466 -15311 -16981 -7479 765 10934 9351 -2897 -7247 2899 10016
12951 10016 6933 12393 15789 15783 20045 26049 33243 30498 26256 15332 5447 4438 17772 17900 18066
12936 18066 5253 -510 -3536 -13418 -12903 1374 15459 11391 7523 11319 18420 -2138 -2771 3683
12922 3683 -1448 -8677 -11225 -4451 -1693 -3242 784 -3975 -12856 -18592 -11868 -11373 -12448 -6053 -7646
12907 -7646 -2319 3117 11721 13106 4223 -8510 -9372 -3512 -2401 -8817 -12605 -6013 10963 17228
12893 17228 13252 477 2550 8412 5519 2389 3821 1171 -321 3609 3962 -2768 1151 -2222
12879 -2222 439 9750 9476 2232 -4053 -2650 -5698 -2170 -237 3777 10417 -9397 -17469 -14244 -2233
12864 -2233 -5943 4921 1746 -11642 -3989 6788 9646 695 1209 -4851 3251 7435 6874 13764
12850 13764 11404 6929 17116 7840 10003 12279 6657 2901 3712 1746 -6678 -6438 862 3688 7530
12835 7530 -311 -8889 -3997 5579 11734 11963 19454 16291 2226 -4965 -1356 -2774 -4645 -6523 1944
12820 1944 -3100 4084 5383 6545 -3279 -17443 -16318 -13659 -4941 -836 8595 7734 23398 31664
12806 31664 27303 15308 6132 7901 18653 18401 15977 11678 14182 23705 24468 2404 -546 -1702
12792 -1702 -8159 -5724 -297 3052 7840 -3310 -13295 -12292 -2315 13426 2272 10690 17994 13401
12778 13401 5478 8232 12202 11298 12087 17317 19521 7438 11744 12394 6734 11005 16170 12661 11795
12763 11795 -3326 2473 5489 4616 5571 -1326 -9561 933 5893 -2121 -1959 1132 5565 4595 8820
12748 8820 3540 5166 7286 16137 19233 11765 13486 6307 -1648 18668 21113 5247 -205 3369
12734 3369 3828 -8572 -8163 -8822 -9947 2092 10311 6992 -5962 -4821 5563 6820 11077 10797 13742
12719 13742 11064 14423 10871 297 1369 3763 7267 2706 15938 14866 8181 3100 1860 -1560
12705 -1560 -5540 -5263 -4099 -13004 -13885 -22599 -35764 -23555 -14794 -4234 -5538 -6222 4715 1039
12691 1039 5462 3398 3598 -6041 -5990 3872 4518 172 4214 4217 1520 -5496 -13137 -7895 -156 8530
12675 8530 1751 -504 1379 -956 941 15190 19485 9191 -16259 -16488 2513 1475 -302 -4663
12661 -4663 -9611 -14729 -19327 -5537 -413 -10290 -5591 -3200 -7288 -4922 -4826 534 11487 16237 11682
12646 11682 1604 3612 4960 6674 -8545 -13068 -17856 -5424 9686 13417 5975 2921 2480 -8602
12632 -8602 -7622 3024 11666 -225 -8497 -4524 5202 8171 9898 14057 -3849 -9256 -2627 4288
12618 4288 -717 -6748 -14273 -5055 -2966 -13020 -12639 -5702 3388 16269 19467 12272 5544 1384
12604 1384 791 3496 2871 5668 8750 6328 1784 -3352 2073 10202 -1959 -12621 -15362 -11185 -10065
12589 -10065 -6082 662 6790 7215 4892 7063 5791 9646 16920 16310 9016 10533 6337 10524 1890
12574 1890 2409 4275 10340 2204 2494 -435 389 -7149 -12788 -12211 1883 5589 12220 15426 18458
12559 18458 20227 21026 23158 10373 1006 3003 4736 8727 10491 15304 14069 14771 13441 16453 19539
12544 19539 15621 7903 767 -834 -212 -2066 8545 9666 6825 -6954 -19912 -16019 -5276 -206
12530 -206 -5497 1606 13114 17225 16827 15192 17485 20472 12413 12752 -2030 9109 -1367 -10321
12516 -10321 -21486 -9819 -2945 -4470 3751 11394 341 -5801 -6459 1339 10933 17776 22003 13413
12502 13413 6018 17207 12150 9896 5462 10557 14221 10463 22680 34763 29287 16351 7223
12489 7223 19416 21668 14725 -698 -8930 4926 13476 21218 34174 24871 19403 16437 21067 23431
12475 23431 25286 18397 16054 8214 10037 5107 -8776 -7324 2280 -2707 -8310 -6996 -1679 -4124
12461 -4124 -8056 -5943 -8819 -6720 3964 2863 5585 147 -1207 -11095 -15331 -10073 -1403 -2773
12447 -2773 2534 3071 940 4725 10764 3461 3733 6585 13244 6918 10186 20662 2559 -2984 1196
12432 1196 -4601 -8362 -4080 1748 13171 12815 -436 -5212 4343 9100 -912 -9706 2779 8964
12418 8964 2566 -861 -2495 3586 -2448 1475 3423 -232 -6069 3656 5305 8547 6099 -2103 1813
12403 1813 8814 12115 5049 -11998 -12743 -9962 -4208 5485 2864 -24 -1026 3123 -1059 -6872 -4953
12388 -4953 -3579 -341 -1958 -8628 -7677 8611 16092 8761 4873 -9900 -11845 -14686 -15669 -7215 -3439
12373 -3439 -11166 -11006 -4049 -1470 -2023 -8413 -4403 1804 6470 14463 16224 17708 1824 -11861 -5859
12358 -5859 -6000 4611 7678 2178 4477 3451 -3268 10000 20697 2951 -1677 -3175 -9327 -6314
12344 -6314 6001 5943 -3992 -7116 -5519 -2524 2422 158 -5333 4182 477 -13577 -26 11881
12330 11881 7632 7146 3200 3815 13047 11700 12685 3926 -8475 -5639 -2555 -2420 5528 6938 17225
12315 17225 14011 15217 14079 11555 9611 10227 19490 9713 -5870 -10234 -9936 990 13233 3700
12301 3700 -6326 8605 9590 6319 6712 -4553 -16736 -18642 -13638 1490 7506 3701 2961 2806
12287 2806 9359 12435 8784 -8910 -31 3131 11102 27608 30048 13527 7050 9716 5677 -2550
12273 -2550 -11098 -5809 -1728 -7209 -4864 7540 18182 17918 24150 23735 11241 7808 2483 -844
12259 -844 -1509 1435 14927 18248 11451 16089 14202 12288 18234 8138 -5432 -8198 2020 7497
12245 7497 4321 16564 12205 1524 3197 7841 10698 17907 14712 16168 5124 -366 10777 6010
12231 6010 11135 14218 8385 7926 14765 25952 31562 23673 22483 22880 15268 11024 8794 4921 18103
12216 18103 21534 18167 6614 1612 11226 12241 26333 25930 24528 24154 19120 6753 3660 12776
12202 12776 17631 11838 7479 6371 12046 3560 -7863 -8149 4704 -1792 -3851 -4958 -4737 8328
12188 8328 10759 -4241 -3759 11303 6062 5662 6477 12344 14739 8239 954 -8577 -10533 -970 4446
12173 4446 8906 11596 10028 17427 18103 21230 19743 18595 24403 19201 24773 19934 11330 11983 14954
12158 14954 -620 -9168 -15611 -2383 962 8874 6120 5811 4084 2919 9217 12873 6903 2217
12144 2217 13918 15074 10054 16018 21408 7206 1058 -10848 -16159 -13349 -4484 7798 14269 9472
12130 9472 7839 -145 -20198 -31440 -20591 -16370 -8709 -2756 -536 -1721 -2323 319 7548 11071
12116 11071 20780 22402 18439 20398 19179 5656 -11252 1585 6229 1589 2665 -2435 8437
12103 8437 20274 21851 21941 17494 25519 11368 4324 9699 7129 -1866 783 -3561 -9987 1582
12089 1582 12129 5517 8642 15432 3739 16463 26590 19552 8877 -4767 -14649 -11513 -10868
12076 -10868 -8337 -259 7281 -4623 -13132 -7508 723 12055 10023 8787 9251 6824 -6775 -13021
12062 -13021 -10129 4898 7636 2978 6364 -1342 -5600 6371 7730 5820 4208 3293 -2577 1370
12048 1370 842 -5735 2069 4214 11038 5534 -8438 -4896 3427 3814 4123 4086 6945 16872 25676 29043
12032 29043 30390 28235 18388 11420 8024 14175 16309 21487 17647 15058 21785 30667 34604 25157
12018 25157 19692 15725 15713 3548 -2734 12153 12373 2326 3499 -2588 -198 3722 5387 2259
12004 2259 3539 8031 7916 9258 15430 7135 4940 -4658 1633 -929 -3503 1949 6803 21135 22330
11989 22330 22149 25031 27899 32797 25987 25412 12429 3048 -1227 4807 11323 11485 8277 3260 7385
11974 7385 1782 -350 -8398 -7569 1593 18329 20070 18465 30965 39102 24083 13987 17933 12365
11960 12365 6240 11664 2314 -9309 568 9149 9111 5287 17349 25204 23812 21415 14287 13772 15770
11945 15770 1389 -3432 -4427 -15463 -15497 -16713 -30927 -16060 -453 -205 2537 7888 10510 11382
11931 11382 11923 5471 6335 2188 -867 -406 -7221 -4964 4581 3140 890 19865 19573 1962 -6980
11916 -6980 -6953 -1157 -617 2450 7663 13549 13091 14989 16848 19614 24689 32493 18184 4762 13609
11901 13609 15021 5422 2334 471 -4842 -2803 3783 11346 10049 5861 7752 9641 10719 18565
11887 18565 26737 23936 30598 41684 31993 22984 24378 19845 10937 11033 19151 27230 38491 37339
11873 37339 27693 8659 381 -1034 -3182 3715 4048 13056 14013 9679 5288 -293 -6878 -15090 -10148
11858 -10148 771 9015 16131 16509 10630 19375 22725 21758 16224 6137 8310 22984 30660 17869
11844 17869 14335 16032 9637 2338 559 16978 23445 7281 -7024 -7179 -11786 -6712 -6099 3558
11830 3558 11377 3858 2054 2188 -438 -2062 -1975 9682 4175 4036 6221 2954 6353 11706 14458
11815 14458 16570 21429 18239 11144 3367 5837 7622 7104 7866 141 10057 12640 11560 11181 15232
11800 15232 21430 37709 46673 42784 35856 14367 12927 15930 20233 20704 24100 27586 19474 5801
11786 5801 3073 7557 14470 19058 28213 31338 26621 8153 5282 12699 19260 18399 13370 17231 22687
11771 22687 10572 2849 7829 14205 12793 1024 5260 3423 -3381 6143 19032 11430 3416 3596
11757 3596 5314 16006 20534 11409 4005 5186 1742 341 13961 12584 12746 16993 19653 20766
11743 20766 25318 24332 14715 7192 2917 1879 -280 -422 -9763 -13908 -8873 -4379 11058 18932 15756
11728 15756 11259 4973 12294 11288 11325 12806 12660 13261 13822 12079 15142 21676 29288 28720 30886 30412
11712 30412 31244 27602 5114 789 3211 12336 15871 18990 16688 15362 16441 12655 20287 15524
11698 15524 13568 9376 9296 13013 14308 12874 9855 589 2556 14654 20119 26088 24815 21865 12628
11683 12628 17549 18657 11975 10298 8823 15724 23182 27088 24017 13450 27531 25389 26888 29079
11669 29079 38990 43208 33006 29016 35417 41216 51127 50333 46146 42912 34798 17956 6259 2990
11655 2990 8759 20827 28521 31606 26839 18692 25142 28560 27446 22892 24407 20720 12062 18887
11641 18887 20453 10206 8711 16664 23455 13476 10704 6051 2277 6581 10974 15923 7301 660
11627 660 2854 3997 12662 24794 33967 27815 24623 23305 14440 13831 12997 7834 13512 9111 -425
11612 -425 1311 15062 18895 12380 7210 18720 22757 23364 15711 15395 22058 29636 22082 27858 30556
11597 30556 18213 16466 13077 13908 9442 -1843 -7289 3343 17153 19488 13972 21311 25004 20988
11583 20988 691 1437 5540 21465 35827 32965 34630 30382 32181 39244 31793 25322 25676 30241
11569 30241 31808 34812 29947 29480 32083 26946 17239 13438 11181 5805 16000 29702 32708 18810
11555 18810 21996 15312 15869 20298 20003 27197 28495 25505 16075 20742 23439 23362 29629 25796 24514
11540 24514 34360 18896 5933 6246 13496 23421 34684 31534 18429 10863 12972 17267 31887
11527 31887 18858 6307 10081 11235 13381 18823 22267 26134 9450 -757 -2109 3595 22689
11514 22689 28125 26867 21525 8438 15152 28878 35941 36089 32379 25998 24709 23828 16971 16649 27113
11499 27113 26481 20971 25179 24041 25860 15601 19515 27548 36242 41927 35667 27796 18809 22473
11485 22473 40820 36903 37202 38417 25718 29954 31475 37471 47079 37858 22315 1531 -2851 3517
11471 3517 7258 8578 18103 17558 16884 10813 7048 8921 16295 8761 12339 14724 20887 19670 19895
11456 19895 15092 17596 17174 21571 21088 17966 7964 15080 32510 37885 36701 40423 32996 23417
11442 23417 12323 11088 25973 32646 34299 26363 11172 608 15192 35157 34205 19878 10136
11429 10136 9467 13366 18981 24094 27248 37547 44182 29310 30376 42284 34791 31671 40217 34721
11415 34721 36049 35475 32811 38696 47696 52764 51900 50643 55617 46206 27864 17973 23759 32755 32417
11400 32417 39009 47950 45707 47365 50659 49433 40118 34249 36566 41547 27547 21157 24757 46933
11386 46933 39509 37405 33216 23639 31634 46433 55824 48142 53390 57725 60550 67940 73405 65472
11372 65472 64909 56915 37584 40062 54254 55994 55047 56422 58100 60369 55221 57494 51714 51486 51967
11357 51967 52073 64506 64124 71126 60090 55176 59861 51893 36773 36700 31361 41604 42520 43819 34060
11342 34060 28079 35468 34515 39966 47998 43670 46587 40294 32162 36291 41943 45180 56729 75048
11328 75048 80275 84478 80481 73477 64733 53411 38469 27883 36166 47050 44831 43999 52612 44049
11314 44049 58327 71890 73697 79797 78977 74357 74357 65985 63919 72413 73545 76241 67275 59431 66874
11299 66874 66432 58582 57297 54696 59172 71882 75274 88500 85812 82292 93355 84982 72949 66854
11285 66854 51646 45443 47588 45539 41376 48029 49864 44394 42958 46994 48663 47389 41722 36043
11271 36043 44080 56593 61841 58338 52265 35855 29931 44845 52332 64609 67798 63110 52769
11258 52769 44455 48967 51376 54681 53392 50956 50272 66919 73307 73787 66978 66187 76029 80239 74625
11243 74625 66789 64994 64734 62080 62435 69395 77558 68903 55330 61198 60894 65186 70487 71953 64867
11228 64867 62507 61074 54799 64757 67917 68584 67127 62763 59331 50947 42282 49267 51654 59851 75698
11213 75698 77978 81249 89646 81655 77955 74032 78423 81443 76350 76099 76325 81810 85348 76431 69371
11198 69371 69400 58171 46785 41633 51173 53138 48242 58655 61938 77069 86023 91226 70674 58141
11184 58141 73662 84431 85515 92687 88085 90012 94200 90469 78041 78830 74754 68853 64220 74767
11170 74767 72043 72825 77239 71188 66955 68378 69839 67093 79266 88610 79140 74482 73511 66628 61012
11155 61012 55361 55790 69594 78513 87697 91678 92573 87051 101019 109504 108107 111434 122288 129175
11141 129175 139598 140786 157858 156484 177610 192738 189930 189498 174201 161243 154974 136902 115536
11128 115536 117233 130386 121314 109663 105360 104734 110099 103162 109527 110918 102002 103728 98489 102145
11114 102145 97497 90746 94831 106115 100306 104337 109496 96496 95163 97599 97471 90185 77417 68398
11100 68398 66592 54024 49246 45416 54819 68558 81742 101888 122546 141024 145192 158736 166813
11087 166813 171916 157848 146473 158036 160918 161112 181476 192465 201431 205186 209091 206848 204061
11074 204061 195497 177802 166875 172118 167274 166485 158991 144881 144134 161638 172718 182698 192100
11061 192100 194751 203052 210113 220581 232586 243470 244236 258766 278389 311306 359716 396288
11049 396288 443990 534895 686057 914405 1262620 1654175 1969112 2274223 2585083 2815024
11039 2815024 2925252 2898468 2594836 2228784 1985288 1706027 1282160 940003 740959 625660
11029 625660 557020 495844 476906 450456 426516 394452 376977 370170 354690 340515 330867 312308
11017 312308 301030 307723 307741 297535 281398 278363 274390 252173 246513 255722 249838 234127 225099
11004 225099 222413 226739 229858 232825 236565 230330 225707 234413 234504 223239 211416 213933 220640 232746
10990 232746 247924 253003 257955 267090 277525 279597 277096 261987 235242 225563 227791 216672 209293
10977 209293 198222 196043 202041 205840 206273 200088 177172 177122 191026 199150 185821 183820 207719 219465
10963 219465 216590 195653 175756 163684 160184 169167 175650 187387 198367 196994 188248 180590 176888
10950 176888 177121 180168 180008 191452 214976 216437 211573 214939 221064 218388 201213 192825 186221 175134
10936 175134 164077 152608 147061 138193 144496 165622 170433 181067 184156 177350 177365 184140 190105 197609
10922 197609 205174 209186 209647 221971 247764 238417 236758 249843 247309 248441 250152 247899 249120 266752
10908 266752 281066 281412 284032 291227 308045 320736 334579 332030 323053 325719 325669 331643 328019 346513
10894 346513 366930 384408 382534 394515 437635 454479 487813 539147 558870 569022 594631 593049
10882 593049 578543 566015 528613 500991 472359 421067 386558 374893 384499 384493 362751 359222 363768
10869 363768 343046 339238 339467 332669 337524 345852 343756 337216 329731 319406 329192 353866 356924 357464
10855 357464 363218 367089 380011 392172 392035 388053 394119 391107 391477 399133 398899 389686 380819 371314
10841 371314 365684 356877 362476 371695 374611 370827 382676 401548 412586 414882 428100 441402 468509
10828 468509 499245 533858 559686 563271 554858 548015 542973 541684 536432 500765 477965 469054 472251
10815 472251 475836 474481 487115 502393 519060 522067 532289 529323 523100 518663 502703 511961 515564
10802 515564 505177 499592 501552 507951 497866 491822 491195 498185 497310 494940 504084 521303 539583 563749
10788 563749 587684 610890 638324 675158 691442 689198 691497 717695 722209 704534 689145 687103
10776 687103 686136 693728 708991 726161 753405 799395 845214 907171 1028795 1220086 1442013
10765 1442013 1605707 1743002 1867300 1986811 2148605 2297896 2262260 2133816 2079928 2020720
10755 2020720 1921173 1837240 1754339 1651935 1564111 1490903 1446036 1400569 1391244 1402555 1399532
10744 1399532 1399917 1419832 1440568 1467109 1480938 1477624 1499535 1515066 1528457 1543107 1544694 1558125
10732 1558125 1570181 1573474 1586377 1613792 1638424 1656230 1655656 1643432 1629301 1611151 1586980 1559993
10720 1559993 1548762 1545327 1547360 1549618 1558390 1567869 1575499 1597454 1620375 1636277 1664610 1678345
10708 1678345 1704491 1744341 1785195 1811982 1813092 1811423 1829123 1854066 1871215 1865901 1872257 1887396
10696 1887396 1900736 1898546 1896729 1907108 1905911 1899476 1935877 1957903 1982572 2027279 2080491 2129370
10684 2129370 2173620 2248016 2339118 2430275 2477199 2532535 2582287 2611146 2634941 2645057 2660206
10673 2660206 2693194 2777870 2902036 3024954 3189660 3419957 3662498 3941888 4246609 4548134
10663 4548134 4868047 5244038 5653977 6112195 6727539 7489169 8250692 9011219 9876962
10654 9876962 10807683 11722782 12632300 13491419 14412381 15719315 17460309 19403741 21647394
10645 21647394 24632033 28524659 33311535 39239438 46938219 57424380 72654077 95934255
10637 95934255 132753821 190465692 264559057 327807297 379836582 433365867 478014038
10630 478014038 501031921 505235101 468607376 402856894 355247019 314409413 244523130
10623 244523130 172731956 127450187 100942224 84201856 72958689 64994329 58861564
10616 58861564 53934437 49901513 46561988 43912221 41800736 39945771 38325749 36859794
10608 36859794 35442798 34071425 32720290 31347456 29877857 28231403 26648455 25244053
10600 25244053 23839085 22375082 21093328 20039428 19147685 18405319 17784462 17249369 16774127
10591 16774127 16362073 15914430 15396566 14866445 14363148 13797273 13153262 12502762 11879512
10582 11879512 11259190 10686988 10197781 9770820 9406345 9085716 8788831 8505633 8249013
10573 8249013 8019417 7795789 7558514 7325559 7102971 6879285 6661211 6445747 6233247
10564 6233247 6034308 5845594 5651361 5465554 5280089 5110744 4957067 4815855 4691031
10555 4691031 4577244 4503227 4445060 4397052 4335736 4272098 4192936 4106178 4020171 3908653 3742152
10544 3742152 3587981 3455046 3339130 3297405 3396710 3610211 3955455 4382570 4792727 5089341
10534 5089341 5200706 5172291 5018600 4754134 4325899 3758757 3122157 2522726 2049996 1730921
10524 1730921 1507597 1354329 1228734 1140010 1065132 1003337 956706 928043 914827 892296 859779
10513 859779 827631 778921 725259 676070 623067 570570 514941 481668 447937 432312 416361
10502 416361 407963 404550 412827 449142 469881 486479 509145 541149 560418 561703 555699 556286 557778
10489 557778 553081 549795 534110 539068 539559 539631 535203 539478 525080 507188 498110 494152 494607 496872
10475 496872 501097 518783 533674 550200 557458 569398 591015 608018 617564 619931 610946 596735
10463 596735 591050 588688 564647 545490 538672 529581 501153 468974 456052 449230 444912 435416 414870
10450 414870 401211 407930 404806 410374 412957 426132 428257 440067 443525 448226 441405 447695 456960
10437 456960 450290 437707 430318 429189 423936 429072 423734 416781 413456 411619 421029 403962 393145
10424 393145 399104 386093 370989 364498 366613 362325 368529 381924 382900 370822 346349 328397 333513
10411 333513 326620 314888 313612 307061 301704 303583 298273 287340 288395 279396 266649 262041 252500
10398 252500 235398 236754 219861 187034 167569 160843 166835 162322 159553 157368 153167 144036 137842
10385 137842 131423 115309 115255 115181 123489 135921 139801 143553 142543 133977 118358 100108 109239 116325
10371 116325 116850 106524 91242 88317 81360 64380 42872 30879 28111 18770 13273 21388 16419
10358 16419 10988 9106 6851 5857 16567 29040 24144 21974 25699 29728 27140 29813 33788 38566
10344 38566 36070 31940 38645 34622 36019 30859 14748 5003 24379 40785 43406 57638 78813
10331 78813 81908 80117 73175 68879 74151 79393 77550 73499 57835 58219 59433 55502 48889 40577
10317 40577 40192 38392 38164 40099 53515 70744 82421 93791 98341 105771 116876 147415 185598
10304 185598 228239 274447 310664 347833 373092 388214 392137 383538 363780 350424 331189 299971
10292 299971 267395 242885 204136 165770 143881 131398 116139 108504 103658 91501 83476 74055
10280 74055 75066 81117 81570 70461 58646 52410 60628 73554 71329 66661 61308 54708 47390 55447
10266 55447 52366 44131 30459 42908 59271 57489 56267 57518 50628 49408 49765 57568 72469 64421
10252 64421 72150 80496 87179 89735 91727 98300 94413 91180 102675 114731 116090 119011 128053 137813
10238 137813 137669 150088 149927 159107 163319 161521 167832 177045 194450 211021 226321 264072 291753
10225 291753 347406 433682 553772 747031 1052586 1450691 1814560 2132496 2435170 2696101
10215 2696101 2841525 2868884 2660207 2280196 1997506 1749235 1351279 968634 727211 587971
10205 587971 496477 435657 391778 365065 334065 299956 297861 280664 263533 244066 234358 239176
10193 239176 244190 236354 224743 219983 214057 206345 200610 200595 198184 204029 205711 192811 172065 162367
10179 162367 152613 144494 132219 123947 120039 107920 91146 84107 77197 67360 71228 87313 106056
10166 106056 109847 121971 127541 131922 130992 135489 135146 130550 124492 119699 114566 99824 96640 97288
10152 97288 94965 102662 113313 115755 102760 95850 93029 86977 81746 88632 93226 87788 81547 72762
10138 72762 61603 56196 61941 55266 56062 65764 59616 59759 69023 76937 87937 77942 78163 84343 95210
10123 95210 109460 112975 105859 103622 103035 93820 91703 85181 73109 70200 54884 50481 51335 46658
10109 46658 50133 62866 71140 72451 69247 59547 65087 63188 63009 60943 58656 71375 79138 82725
10095 82725 80450 68451 58073 54093 72239 72590 60261 51283 47220 52978 59254 66298 62404 52805
10081 52805 46088 46043 44487 25815 12520 18561 20567 11550 19216 27295 43481 48703 43037 39394
10067 39394 49619 56848 52240 38466 29381 23182 26551 27361 23004 24089 27126 31810 24384 29462
10053 29462 24226 9703 15664 32536 41579 42332 33509 44194 64709 76257 96961 105956 94420
10040 94420 89059 92363 86772 67084 52427 49643 50591 44832 31958 26550 21972 35447 30163 27276
10026 27276 17457 17455 16790 24009 23053 13990 18723 8584 1455 -2270 -2308 1635 10779 17399 21019 16959
10010 16959 15406 29977 39974 45228 42954 37510 31748 26532 19861 15848 1180 -2980 -2604 -1876
9996 -1876 -3794 -9491 -505 17277 15229 17226 8982 6083 10783 13183 18597 26803 29142 23179 3689
9981 3689 -7947 -7739 -3197 648 -14523 -25277 -22535 -8773 1998 9594 7945 4678 -4690 -6212
9967 -6212 -7787 -5060 -10079 -17011 -8459 -739 1247 -5439 1373 6840 2725 -2716 -7083 -9908 -8083
9952 -8083 -5516 -1639 -464 3262 3406 5815 11240 24421 31014 23084 10003 12947 24267 32428
9938 32428 27834 29642 31670 22003 17629 35647 35004 34162 61838 75135 81885 60368 45284 47251
9924 47251 43682 36978 23154 25828 19661 4854 10228 14639 3612 -2154 2189 -2576 -1226 4270
9910 4270 14789 15626 14144 24324 20305 12496 4191 2061 -867 -6790 -10385 -17078 -18499 -9708 -9699
9895 -9699 -4537 -3918 -5983 5148 15467 26645 33877 38516 57065 57078 59444 68471 76093 70213 56339
9880 56339 53276 35974 30885 18780 7966 2473 -1990 -12164 -17036 -15799 -24559 -31440 -35304 -32844
9866 -32844 -9903 4960 7799 4832 8479 -3587 704 12289 19527 12822 17316 15497 11859 1327
9852 1327 930 3597 -1628 4268 8694 22623 16810 -4256 -16477 -12189 -6462 -9481 -8688 -11596 -789
9837 -789 7357 7579 10720 14283 21431 20562 13074 8978 8908 12757 11383 13931 13867 8820 6950 387 -10976
9820 -10976 -11479 -7463 14607 22070 18892 16552 25353 29269 17446 5172 7927 6589 -2414 -8853
9806 -8853 -6926 3052 -4515 -18568 -19384 -16791 -15328 -9928 -1306 -6069 -5336 -2910 221 2473 -2427
9791 -2427 -259 1248 -1603 2115 2074 1900 -9837 -14771 -18180 -10616 2023 8277 2446 3247 13280
9776 13280 13830 2801 -4018 8701 23285 24030 24785 13746 10764 17990 7369 4751 11817 24980
9762 24980 9979 -1613 -13702 -13105 -23751 -27342 -20187 -11267 -13859 -7775 677 10228 4460 -11331
9748 -11331 -23443 -13916 -13226 -22706 -21829 -19272 -15584 -10799 -17136 -24159 -22698 -13759 -3746 -5524 -4985
9733 -4985 -2382 2102 6969 18179 19301 17166 6508 -3484 3415 -3108 -5154 3338 9436 11274
9719 11274 5121 795 10322 9566 2135 2076 9734 7308 12935 6321 -8121 -12653 -23292 -26109 -23025
9704 -23025 -23200 -18316 -14357 -1361 9434 7661 7216 -795 -8368 -9191 -13501 -14304 -4134 -4454 -12114
9689 -12114 -23531 -26204 -12949 -1476 1171 999 -6556 -9185 1314 -836 -4620 5825 -12781
9676 -12781 -18456 -11919 2893 14598 12213 10158 3319 -4889 -5273 -9081 -7347 5563 17329 20940
9662 20940 9900 -747 448 -3124 -3580 -2061 -5388 -6776 -11557 -165 51 -12856 -10849 -3447
9648 -3447 -11200 -22323 -9041 -3050 -875 -3404 -7228 -9797 -7827 -1290 -8289 -13421 -6445 -1047
9634 -1047 926 2365 -1936 -6255 -10830 -9014 1505 11431 4307 38 -987 -12650 2252 15988
9620 15988 26903 23163 8678 -551 7764 16654 18860 5312 -3676 -2574 -6992 -3162 984 2164
9606 2164 -2296 8207 7934 16620 8943 446 57 9248 3803 -4168 -6487 999 -13844 -16181 -10452
9591 -10452 -512 -3541 -5049 2765 -3027 -18315 -25402 -25612 -10513 -1482 -9423 -15743 -21001 -10460
9577 -10460 -9969 -7530 -11902 -18967 -25429 -26752 -22841 -23995 -34460 -37743 -36845 -39732 -34566 -19416 -5127
9562 -5127 -4001 -14117 -10591 -11154 -7954 -10338 -14018 -7255 -1850 -493 -7870 -7037 2107 7948 8824
9547 8824 9607 6282 -1864 -3159 2218 5575 -7382 -15664 -19267 -19134 -13229 -18223 -25324 -20505 -20240
9532 -20240 -26327 -34959 -40826 -35194 -36144 -17697 4547 -10660 -14084 -6517 5923 -47 2728 7683
9518 7683 8273 12233 14416 16369 15792 -4148 -24519 -26544 -10043 -3558 -5020 -17338 -18479 -11767
9504 -11767 -10396 915 1509 -6293 -3718 -10856 -13869 -11637 -5406 -18786 -23510 -14276 -7404 -7627 3823
9489 3823 11934 15560 7552 3320 1659 -3986 -7817 -11118 -12352 -16057 -15391 -9056 -8647 -17494 -15261
9474 -15261 -4787 -8127 -16148 -11852 -7832 -14313 -21352 -23513 -29835 -22116 -6515 -9500 -10186 -1747
9460 -1747 -3335 -12500 -25435 -21151 -11133 -11018 -1487 -1556 2021 9944 -1554 -3564 -6587 -14956 -19378
9445 -19378 -21695 -23265 -19196 -12345 -2286 2851 3766 -1556 -5106 -8194 -761 9132 14843 9086 -3171
9430 -3171 -8182 -10882 -13340 -17262 -13548 -8419 -8448 8222 11834 10055 5785 3374 2735 -4251 -8375
9415 -8375 -10470 -8624 -7226 -2622 2543 5958 13808 11119 2231 897 -4161 1235 2493 -2164 -4282
9400 -4282 -14305 -16645 -4946 10243 16213 19771 12339 15009 -918 -17027 -20499 -24889 -27831 -18489
9386 -18489 -1804 12635 12897 13110 5337 10717 18258 5514 -5050 2901 -4592 -5232 10280 19744
9372 19744 18262 15225 18350 25868 25435 15132 13119 10955 14545 12651 18462 33633 30834 30193 27199
9357 27199 27662 30173 26207 25714 31097 31704 24974 17706 10348 18193 14448 3441 9440 12931 3106
9342 3106 -11398 -15526 -13923 -5798 12942 6520 6845 11054 8746 -428 -9634 -3986 -14778 -22310
9328 -22310 -17262 -12674 694 3912 2293 7403 13772 8021 7709 6408 -6880 -10500 -7394 -7739 -6641
9313 -6641 539 16595 15722 8343 9857 10814 11210 12179 22595 26522 18562 20198 22187 13468 3331
9298 3331 -5079 -4236 4452 2252 10765 -1667 -4294 -4711 -2141 3451 5319 1057 -4543 -4948 129
9283 129 -231 -4460 -13722 -2685 12467 14695 5887 -1153 -3618 -2590 -6487 -823 8566 8387 4498
9268 4498 11168 26223 21812 20146 27540 17497 7099 4089 12820 29071 33247 21975 17525 9010
9254 9010 3029 -3050 -5906 -4191 3925 1386 -349 -2807 -3813 -2240 -1182 5086 -4521 -11354 -10127
9239 -10127 7340 18992 12981 3395 6669 3966 -6136 -16384 -24486 -18160 -9548 -16241 -21545 -8929
9225 -8929 6866 6354 -806 -16311 -21569 -23202 -17876 -9013 -12436 -17623 -12640 -15163 -10831 -6419 -4712
9210 -4712 -16225 -22796 -10694 395 8074 13792 1635 -2865 -2102 2801 7222 12215 1704 167
9196 167 11543 10075 4134 -3766 -6981 7708 15536 15086 12751 3254 300 -5147 8914 14603 3326
9181 3326 -7396 -10739 -8627 -286 -2518 4171 10815 21450 19895 11796 7806 1743 4868 13425
9167 13425 1645 -19399 -10654 -4677 -12925 -11023 -12301 -1341 -1209 -3137 -2154 -3618 8952 15275
9153 15275 13724 4849 7800 6323 1635 12678 23473 16151 8158 25 675 543 4284 7126 7650
9138 7650 9813 741 -8319 -8825 -17528 -14894 1324 7458 5127 -7159 -2678 2919 3922 -848 -122
9123 -122 4078 -4109 -9155 -1600 10281 13812 15261 17140 13814 1507 -3697 12400 21436 19927
9109 19927 19820 15328 15477 22979 31074 36714 37806 34886 38489 30337 16280 20789 10324 7124 10839
9094 10839 9476 9527 7135 15815 20872 20161 10266 5283 6146 2694 7343 14691 16139 12536 -3439
9079 -3439 -8752 425 7369 5608 -7694 -7009 3522 11414 27120 30102 29202 18071 18980 22137 36961
9064 36961 28747 11158 451 16672 23088 11712 8805 13130 12271 15590 21357 21982 31440 36664
9050 36664 42804 32052 7731 5327 6987 1969 -3466 -8442 -13400 -14687 -9825 -5130 -5453 2204
9036 2204 11950 6413 12041 14494 6722 -962 1618 12296 9217 11915 5422 -6 -1411 5287 16410
9021 16410 2076 -96 -2487 -6008 -5258 -7706 -5703 -1834 699 8003 1345 4641 11718 22178
9007 22178 19829 32500 20539 -1797 -12019 -3842 -4109 -12876 -8297 -7336 -12815 -10550 -13561 -6477
8993 -6477 -3644 4872 10957 6557 2024 16201 2585 -3646 -9853 -20212 -7878 7982 -4999
8980 -4999 -12584 -17170 -22057 -16196 -8409 -9191 -11573 -9020 2904 7492 4863 -4427 -8230 -13539 -17837
8965 -17837 -22938 -13480 -1252 -12423 -7134 -4394 -451 -3015 688 1249 -4561 -9458 -110 -3929
8951 -3929 -5464 -578 5164 5684 7468 -4142 -15100 -12425 -4456 7361 10500 7363 4275 -5877
8937 -5877 -2711 -3090 -5177 2208 8252 10959 5596 3385 5576 10953 16835 -5472 -3777 -2786 -3671
8922 -3671 2048 -346 -7905 -3951 4996 -7214 -18231 -8356 -3740 370 5673 6639 3881 -68 -3797
8907 -3797 -159 967 4667 7675 10910 15166 7043 -1923 4497 12656 16078 15320 13646 1288 -11435
8892 -11435 -5780 -1077 2790 9395 14435 6539 4375 11602 16680 7113 2592 -10066 -12320 -10760
8878 -10760 -10895 -15264 -8494 -11545 -4105 -1895 4085 7408 4269 183 4667 8133 11644 13587 3060
8863 3060 -1774 -788 -4680 3001 2354 -16343 -28561 -23060 -22479 -12649 5181 20223 19602 16932 14947
8848 14947 6572 8175 1432 -5671 -13717 -10569 -10943 -22530 -30602 -27329 -16107 -7701 -4801 -3404
8834 -3404 7987 9707 607 -7077 -13246 -6026 4349 8714 -1079 -8549 -17619 -15199 -11172 -11714 -9345
8819 -9345 2176 2468 482 -6490 -4437 -6728 1301 13654 6198 14953 13242 1713 1151 -7351 -7214
8804 -7214 2307 11398 5487 -3331 4803 15652 3709 -11212 -15063 -13517 -8296 6533 6390 13800
8790 13800 15192 12446 16807 20316 8483 2215 -2729 -17610 -19653 -18559 -21362 -24041 -27095 -36880
8776 -36880 -27884 -15486 -22480 -26298 -21087 -15307 -16517 -21952 -18791 -20534 -15453 -15330 -15766 -20294 -28665
8761 -28665 -17593 -10913 1971 6236 1972 8543 7430 4381 410 3542 -2581 377 -491 793
8747 793 -2317 -19910 -10008 2769 -1766 -7764 -5271 -13445 -897 3247 7612 29980 23269 -1760
8733 -1760 -7373 3659 10382 12314 8872 4592 -3618 -904 -1865 1540 207 4849 11128 15061 6595
8718 6595 6957 10831 4965 2121 -623 7080 10561 10301 525 -65 -2003 -2523 -9669 -1483 8034 18257
8702 18257 28133 24050 20563 2746 -3174 2718 12592 14332 18280 23492 32352 35689 39016 33342
8688 33342 15871 19545 18830 13199 20586 42626 39439 23696 21209 17015 1218 -9858 -14874 -2511
8674 -2511 1431 3786 13121 5903 8692 5336 1305 -5556 4483 9176 16066 28371 38530 43333
8660 43333 22333 13570 6173 5179 14242 25796 25479 13016 3696 -3526 1915 9087 651 -1279
8646 -1279 7272 7846 -1193 -8199 13398 23163 17036 16246 19782 21019 16383 14652 18523 28866 37696
8631 37696 35939 20564 15764 11553 7221 16707 23973 31642 38142 38134 35122 28281 27870 27753 29119 39178
8615 39178 43353 40986 40952 29995 31741 35498 43511 38007 37512 28324 29669 20229 24921 33075 29603
8600 29603 34063 42480 40328 28535 28264 30196 28531 29656 31039 31046 32959 32693 36583 36390 40630 44781
8584 44781 51407 53170 41117 43950 44614 34945 45160 43087 29051 37450 47927 47125 52507 59629
8570 59629 66423 72170 76803 67004 56647 58502 60371 70311 77919 81829 87087 95266 100226 93813
8556 93813 82325 69468 66623 68954 63583 50693 43437 49821 56913 48874 37260 40546 32852 31122
8542 31122 26218 22100 34769 31831 44011 48516 47511 40185 39911 43004 31396 26840 22624 14933
8528 14933 8839 14205 14676 25890 37068 23292 19689 24707 15384 7503 11397 7397 8347 12034
8514 12034 15282 3487 -2834 2980 12652 25683 29684 30720 25628 16176 7518 8370 15768 20729
8500 20729 24176 15879 26800 34418 38810 36975 32222 33437 37301 36836 36339 29524 19008 24046 18090
8485 18090 16083 22225 22657 19614 14440 7465 17252 21145 -779 -17701 -2956 -766 -15036 -5597
8471 -5597 -1503 -4534 -3761 -7138 -4843 643 10244 12356 9544 10948 21687 25301 34571 33397 21983
8456 21983 17767 10310 2964 2820 9739 23930 18055 4240 5136 4522 13720 24435 30576 28238 17962
8441 17962 14025 18572 15992 10126 16965 18597 14385 12584 9355 -3637 -6340 -774 5910 9488
8427 9488 16192 19588 12191 -4520 -10735 -21750 -17265 -818 11533 12140 7003 -332 9648 24990
8413 24990 27162 32401 30192 31431 28124 28336 19053 13023 7791 14145 26039 18071 4567 -1339
8399 -1339 3044 22018 23927 14281 9313 5664 -5202 -660 1862 -716 -1597 -11406 -7310 -1311 9436
8384 9436 14567 16305 14092 9883 11930 -856 -8583 -9346 -24145 -18584 -12603 -4152 -5252 -13107 -10904
8369 -10904 -11497 -12551 -14725 -8368 -2974 -5483 -2941 -4891 4676 5962 4862 -1710 -793 6868 3240
8354 3240 -5072 -7343 884 16083 23960 15754 10943 3335 -389 -1082 5804 8842 8669 6988 7306
8339 7306 3585 -3423 -5121 -4433 -8435 -16633 -2207 -5073 -17628 -9782 -3027 5476 -2158 2651 9339
8324 9339 11997 8931 6007 -3739 -8154 -3020 5089 9530 9012 7449 -2467 -11621 -12151 -6324 -12779
8309 -12779 -14848 -15778 -6545 -859 -210 -9140 -1241 12151 11005 17614 16038 5023 3652 1258 469
8294 469 2118 -1747 -2293 5104 1803 8367 12767 13928 6639 10000 18216 6116 -35 -455 10872
8279 10872 3231 8630 3232 -9139 -12107 -4159 -1638 5949 6960 11629 10208 -4 -10738 -16632
8265 -16632 -14554 -12472 -3365 1598 -7394 -7960 -7472 -10128 -14076 -11166 9938 14837 10410 4378 1482
8250 1482 4532 4546 2074 -4976 -10179 -15180 -7132 -13770 -24083 -25496 -13862 -12155 -6518 -16249 -12030
8235 -12030 -2391 -1765 -7951 -14068 -13557 -11865 -19099 -18336 -8447 7050 18015 14939 18598 10642 -3243
8220 -3243 6120 12373 15313 7767 7893 -1977 5487 3157 -2380 8771 8132 8857 11137 3060 4997
8205 4997 11051 2403 -6287 -1057 2279 6645 4276 -4201 -8917 -16800 -19239 -17870 -6457 3335 7993
8190 7993 9666 11061 13178 14258 15122 10095 18270 26167 24602 19987 14792 555 -2050 -3640 -5058
8175 -5058 -1416 3637 6252 5161 7503 5530 7968 11588 3535 -8026 -9457 -8724 685 -2836 8190
8160 8190 28767 16995 5075 -3019 842 -4304 -12658 -12269 -3317 -4182 -5964 -4819 -7814 -14219 -18060
8145 -18060 -10895 -3522 -2610 -2996 1843 -473 -10122 -8219 -6078 -2612 -4570 -1949 -4403 -8015 -694
8130 -694 -14928 -25447 -16575 -12514 -14461 -5597 6884 14531 20630 30509 25551 14987 18770 24236
8116 24236 12363 16853 9567 5453 11543 8935 5494 11435 12873 19114 16002 9693 10695 9325
8102 9325 -912 6393 10940 9545 -5294 4894 16773 4554 -3760 7147 8047 6177 5498 17287
8088 17287 17561 7260 13815 10036 3519 -6047 -6432 7497 4561 -1838 -1442 6359 20207 26142 35503
8073 35503 40364 20325 9455 13224 9705 -2795 -1319 374 3741 2023 3034 313 4281 421
8059 421 835 14427 30864 29489 17029 10975 8520 3788 -1036 -2994 -7735 -4728 -1138 3836 14407
8044 14407 21402 20993 18586 28939 32286 26815 18847 21344 7733 2467 391 -4146 9318 19401
8030 19401 2241 -2140 -3138 -7537 -8812 -11390 -11512 -10181 -5984 -5718 6248 31895 34493 32694 28740
8015 28740 29030 10862 423 8934 4897 -6194 -11522 -7571 -4115 1851 -7218 -2580 7213 15598
8001 15598 13738 20432 14031 3378 1679 3838 -1730 3316 1553 5208 8629 10624 6182 4691
7987 4691 16107 17252 13872 16831 17985 16658 35741 37696 21592 4985 -9897 -6416 9108
7974 9108 14571 20499 29493 23601 20118 28747 24664 20270 27702 30165 36020 37765 41942 44182 36747
7959 36747 39901 35996 34193 26767 26082 19057 2473 -7831 -4853 -7043 893 7392 19957 27829
7945 27829 23153 19327 27843 26369 12319 16110 12142 12829 22467 10220 -3599 5096 12781 9442
7931 9442 15046 20601 19032 15203 24758 26638 13191 8180 12615 18286 11536 18267 26807 19780 19579
7916 19579 34155 32283 21847 2691 13891 19397 6763 9196 15231 15616 6801 7755 6898 8340
7902 8340 4844 -8682 -10783 -4131 5176 9648 8912 6268 12382 12212 25450 30861 19500 26885 30543
7887 30543 29496 26725 25263 26855 27118 27774 34695 40441 35267 31461 30041 17416 7324 7183 7548
7872 7548 9138 9011 16248 21304 10927 2136 -1237 -2617 2068 -2246 1566 11643 18311 12010 11663
7857 11663 21301 26115 21715 12255 14072 13564 7832 15066 17718 19351 19366 24333 14477 7151 8722
7842 8722 -2002 -11868 -4748 -7159 -2563 10154 16776 15918 11227 12253 13349 4786 10522 18680 18986
7827 18986 19233 6471 6789 23302 22437 11060 1845 4678 8449 -6578 -4127 1632 13296 9477
7813 9477 9274 90 2691 10891 17139 9885 21581 25359 20908 16900 7939 5339 14741 15426 18810
7798 18810 6132 285 7623 11175 8353 4066 4314 12698 14916 2027 -2528 7201 9337 477
7784 477 5849 -4581 -12692 -12046 -12075 -8900 -11819 -2844 -6079 -12235 -22407 -24768 -16084 -5361 -4175
7769 -4175 7987 16488 17613 10739 -9381 -13178 -4556 6658 5660 10863 6253 -3639 1119 9061
7755 9061 15166 14231 7202 14308 13679 13831 3428 -7949 -10287 -16514 -21305 -18241 -24527 -22724 -14148
7740 -14148 -8983 153 3150 5841 8576 14652 14054 13369 5869 -10877 -23748 -25036 -6356 8106
7726 8106 10182 16272 8933 -1996 -5970 -2929 92 -10893 -18265 -17674 -13066 -2275 1133 12551
7712 12551 13228 5805 -7021 -25256 -23818 -9526 -1909 8049 5835 6425 15467 6864 274 10589
7698 10589 2761 -10727 -21504 -21320 -16829 -15022 -18565 -3073 11898 9765 -2946 -3980 2236 -388
7684 -388 -10388 -6075 -2865 -1913 2066 5795 189 -7229 -11006 -1638 -2474 -6577 -7852 -11155 -12999
7669 -12999 -15125 -14990 -8875 2941 16180 4361 -7819 -14906 -27219 -26737 -10900 -11820 -10155 -2734
7655 -2734 9398 9373 9084 6685 -1754 -4759 -7744 -4920 -3691 879 -3313 -14998 -8271 -754 3895
7640 3895 -426 381 10622 12090 7031 3518 15119 15186 3388 -2611 -1848 -10832 -26824 -20868 -7451
7625 -7451 -8791 -23395 -27394 -24415 -31684 -26505 -32664 -30828 -24440 -14909 -5324 -6752 628 -4504 -5311
7610 -5311 -7268 -701 9673 6208 2454 692 -6687 -11545 -9889 -9502 -1110 6634 -12090 -11705 1733
7595 1733 4686 18869 5313 -3771 -8356 403 15708 21472 5506 -2255 -3607 -6585 -5131 -7469
7581 -7469 -5984 -9461 -2661 3435 -2340 -7877 -8832 -14610 -9879 -9858 -5456 -5989 -9933 -15387 -13959 2128
7565 2128 11774 15703 8448 4770 6897 -1256 -14917 -12133 -14561 -18105 -18375 -25315 -32516 -30122 -16555
7550 -16555 -7351 -7059 -8760 -8022 -6564 -538 -3888 -7733 -9648 -8460 -9218 -4119 10311 1129 -8677
7535 -8677 -8104 -9905 -22412 -24050 -22838 -11006 -3108 -12758 -8619 -13047 -11612 -5437 -812 -7477 -20474
7520 -20474 -23453 -21555 -14210 -6228 -5470 875 8933 8275 -1232 3902 -197 14849 16606 14964 4205
7505 4205 584 -7035 -19333 -6498 -1801 -8648 1570 7152 14746 10778 7794 11819 3804 -851
7491 -851 -5939 -17495 -23160 -14533 -5226 -10416 -992 2912 4879 -7617 -16468 -17695 -12097 -10542 -12651
7476 -12651 -17189 -24640 -31182 -20504 -14047 -4601 -9727 -12393 -12690 -9545 -5260 136 2170 6835 9691
7461 9691 11982 17288 21599 22099 9156 2347 3465 4537 5320 5142 -9732 -1687 1944 -12184 -6988
7446 -6988 -5501 -5215 -4013 -8892 -17320 -14904 -13731 -7802 -2711 185 -7305 -9539 -6203 -9419 -8768
7431 -8768 2236 9239 -2145 -13974 -18506 -19938 -14727 -13669 -5706 -11867 -16722 -8873 -12366 -18919
7417 -18919 -18953 -28772 -36276 -36003 -32779 -26852 -16278 -10650 -11522 -3117 3039 3527 -4347 683 -137 -8455
7401 -8455 1102 -516 -12412 -12320 -8759 -14486 -15134 -15693 -10723 -2350 -520 -14906 -19805 -16273 -9974
7386 -9974 -5058 3827 14874 7667 -4730 -1304 12869 10505 1959 10392 7026 -1367 -4276 -8177
7372 -8177 -10418 -6002 -3861 -2135 5024 12145 15306 9688 20416 19983 13456 4066 8344 17510 15297
7357 15297 11417 7904 6144 -415 -3317 -10313 -8925 -2533 -9266 -13037 -17027 -16800 -6643 -10314 -19987
7342 -19987 -16987 2782 6964 2110 -49 3011 2821 972 217 9450 14246 13966 21295 27822 17921
7327 17921 17485 25878 36703 51931 49926 59305 81128 130687 206825 244602 269408 281401 276105
7314 276105 279344 275077 249859 182431 127779 85978 63666 57081 59996 57695 45774 43444 36763
7301 36763 35415 25025 16679 17497 15548 27013 27725 23518 34960 43525 49521 64834 64433 38146
7287 38146 29774 31822 24291 22487 10135 3346 2018 5480 8413 5842 -181 -1402 -661 -1246 -1223
7272 -1223 4852 8360 11040 8487 -224 -2886 610 2491 3039 4014 17978 8398 -11854 -6849 1550
7257 1550 3097 8236 5766 5774 -1447 -4156 -9213 -8788 -17518 -14155 -3547 327 -8953 -10332 -17637 -18703
7241 -18703 -21016 -20289 -21699 -14894 -4977 -3410 1583 7583 1390 -522 -5332 4055 12269 5148 5269
7226 5269 8108 3096 7797 11766 18692 22831 10708 -6366 -15823 -19117 -12151 -7361 -21052 -23022
7212 -23022 -20893 -13627 -9937 -3164 -510 -4459 -13439 -12827 -9232 -16526 -18386 -13499 -11832 -8833 -8584
7197 -8584 -2150 3975 3501 12 125 340 1379 -932 1889 2710 -12731 -18377 -10540 -1479 -3354 -1881
7181 -1881 -5722 5109 -124 -5369 -11597 -18577 -12684 -8261 -2423 221 -3090 -3191 -9869 -11386 -26453
7166 -26453 -17819 1326 4904 9681 9552 -1247 -7799 -7716 -4374 714 3808 7853 -3516 -2211 -1134
7151 -1134 -999 -3240 -342 -3013 1215 -740 -7520 -5189 -3703 -7759 -327 7528 8490 7523 10826 15266
7135 15266 17187 15276 13119 25464 20548 17514 7312 -14843 -23349 -21293 -21615 -14980 -11295 -10762
7121 -10762 -13546 -9643 -13024 -7640 -8219 -1238 3555 6491 11941 13161 17385 2920 2452 3830 -551
7106 -551 -9024 -3050 -4452 -2922 -1125 1694 7186 14056 15927 15630 21131 23715 15417 20969 23447
7091 23447 13972 5165 1500 6085 -768 4512 10490 19224 18873 7058 -4452 -4726 754 681 7329
7076 7329 10323 4163 575 -6522 -6500 -13543 -6937 -8699 -8667 -5462 -8444 -16340 -10126 -1479 -1032 56
7060 56 2874 3252 3295 6053 9669 5971 -12428 -10890 -13329 -16790 -24826 -25461 -17856 2086 6349 -206
7044 -206 -922 3914 -28 -11182 -9914 -4900 -1710 5935 11650 14500 19660 15877 5909 -1417 -2437
7029 -2437 -1379 5809 9722 -4847 339 2054 1052 -5715 -13479 -16734 -8407 -1447 -3072 -3799 -8310
7014 -8310 -3384 -631 3849 183 -3185 -10380 -18752 -21856 -28163 -22922 -16440 -13553 -14279 -11574 -9642
6999 -9642 -16274 -9840 -8198 -7396 -7849 -1194 -4016 -8145 -5326 4218 -22 -2830 -1549 6844 -6160
6984 -6160 -17322 -12892 -15237 -10320 -6510 -7283 -3632 -6970 -5451 -3618 -11572 -6717 161 11244 6888
6969 6888 -6380 -14788 -18341 -15601 -14682 -19970 -21489 -13593 -10543 -14367 -5218 -2826 -7861 -7908 -6712
6954 -6712 -10556 -14882 -17782 -5177 -5546 -4423 -11294 -15326 -20385 -26085 -16300 -7624 -4038 -6942 -4922
6939 -4922 2757 -2723 -5021 1036 -790 -8876 -12854 -9998 -3385 -2063 3693 7044 -3916 -5893 -7925
6924 -7925 -1703 9088 7489 7324 -5749 -13520 -8460 -10859 -14841 -9077 3113 10432 11181 7838 4005
6909 4005 -699 -8291 -10156 -9897 -14448 -12537 -16290 -19618 -14603 783 -3432 -8310 -19414 -13509 -4513
6894 -4513 2918 -1646 2112 6986 -3575 -11240 -13150 -2014 4009 10971 12341 8451 4060 9273
6880 9273 8339 -1830 -104 8237 23489 30229 23810 8417 18828 22888 28742 25349 41835 74449
6866 74449 94886 117636 138000 157771 163812 150410 155287 144383 98430 53870 39994 39334 37446
6853 37446 42665 44426 47826 61282 88625 116362 155265 189820 208510 204377 192683 190489 178616
6840 178616 141435 100496 62275 39312 35704 33797 31532 34847 34674 31299 24033 16681 14737 21166
6826 21166 32388 36875 29422 32787 38486 47707 45106 44871 49852 46698 40269 23521 10469 10332
6812 10332 14344 16128 25307 26385 32769 33549 32068 31744 40888 43963 41304 32125 16141 6700 11196
6797 11196 16470 7146 8584 11990 11956 11498 10682 1485 -604 -17 13776 33450 37549 29400 25492
6782 25492 30786 22080 14324 13124 14205 8581 22617 30801 25831 31353 26597 23120 17954 9586
6768 9586 8864 -5964 -7165 -3892 -11779 -11923 -13782 -6738 4530 9137 8614 6217 3986 -2099 -1913
6753 -1913 6732 12629 11188 11275 13711 11945 10053 9952 24162 18242 13348 13311 18434 18663 9477 9971
6737 9971 18247 28054 40086 37710 34673 27727 29199 25591 44953 75996 124992 202552 296609
6724 296609 356569 375542 380814 369773 375300 378881 335944 239556 157898 123454 94455 70759
6712 70759 69221 71756 72559 68712 67041 58270 57074 67762 87477 117555 147684 174244 203261
6699 203261 234462 250307 258706 259224 244252 200553 156994 136968 124007 105752 85018 69271
6687 69271 54670 47526 54276 45984 31037 27520 34840 33231 35253 36858 39857 35961 31302 29966
6673 29966 23922 20464 21821 21525 20225 22843 22908 13616 7349 -1199 5064 9813 4166 6735 21092
6658 21092 18114 10863 12891 18705 15899 2060 -14804 -8680 -3309 125 2896 -4585 -11975 5045
6644 5045 14479 17887 27257 32460 18365 8625 2594 6703 3786 432 4730 -3051 -6916 -14421 -5480
6629 -5480 -5111 -8158 3388 -2815 -11310 -18419 -16578 -4112 4876 5959 5343 4985 8638 10871 3208
6614 3208 -1970 7572 12364 2028 -5706 1571 8322 5770 6445 9100 8023 12489 4740 6670 8076
6599 8076 3821 6320 530 3796 5332 3514 11075 7043 8239 8837 -1508 8386 8948 7346 10622
6584 10622 21690 23914 11243 -5529 -7986 -11607 -13976 -12274 -23884 -29781 -20209 -19811 -7862 3518
6570 3518 15861 11485 1575 1676 -3093 6892 6326 10933 2539 101 4298 8598 8873 -1584 -13556
6555 -13556 -9861 -3460 -2312 -2544 -7307 -9132 3064 4483 -7207 -8487 -6055 -4689 -5326 -11712 -9993
6540 -9993 -2799 7821 6333 -4638 -1533 8466 7635 9402 19600 21389 17805 10678 11061 6827 9644
6525 9644 -275 -769 9673 6862 -134 -12840 -14422 -9332 -2106 -555 2164 5340 1242 -4545 -14160
6510 -14160 -13366 -7842 -6903 -9058 3900 20848 27728 25742 23789 12575 5505 3024 6285 8004
6496 8004 11378 18861 10786 9061 -2159 -9017 -10033 -3237 -9183 -6089 -13726 -13202 -15065 -24875 -29027
6481 -29027 -27086 -21101 -12142 -13001 -9165 -7789 -16205 -15900 -12989 -10120 -2721 814 -9657 -7821 -3854
6466 -3854 -12113 -3623 -3191 -5074 -4966 -1507 -1112 5816 1752 -3440 -468 8151 14264 6074 -583 -1751
6450 -1751 5858 7239 7901 5486 3093 410 6057 10674 20026 13104 8662 8650 9207 11127 11176 13731
6434 13731 4993 3119 16246 14696 12161 2933 -7570 -6102 2227 -6217 -19910 -23754 -17839 -14828
6420 -14828 -4796 3292 -635 2308 902 181 -2714 -1643 -1594 -841 -8718 -7417 -338 15827 16016
6405 16016 13379 4503 10205 14945 14768 14248 9302 7059 -903 4603 4693 -4763 -9309 -4722 -7687 -4311
6389 -4311 -1179 985 7982 10449 729 -8806 -6356 6284 3415 -8701 -8278 -4334 -9226 3665
6375 3665 3667 3109 -2246 -13698 -9937 -4521 5714 1805 2721 -6222 -11119 -14128 -11135 2912 7992
6360 7992 -1238 -8225 -6280 -2126 7135 17644 9820 -2799 -10995 -5732 -2667 700 13982 3529
6346 3529 -13996 -22480 -21773 -11436 -10097 -9456 -8267 1095 9080 13854 24084 13713 6872 3157
6332 3157 1241 443 788 13913 13316 2661 -4676 -7700 -14039 -14270 -8851 -5891 1708 -6339 -7601
6317 -7601 -7460 -6085 -5395 -653 266 -305 2958 13243 13264 12936 21157 13299 14539 8614 7389 6698 3294
6300 3294 56 2718 3791 5356 11106 13158 5799 -2698 -10312 3088 7579 -3736 -11361 -8984
6286 -8984 -2840 -356 1022 -3341 -2894 -2167 5857 15254 7539 -2820 -20658 -22032 -10242 1111
6272 1111 2782 8410 7403 -835 170 -7264 -10163 -7675 -10074 -6657 265 10832 9951 -5323 -4916
6257 -4916 -6317 -3577 3731 9445 4139 3952 -11883 -19741 -2774 -2713 -7327 -10671 -422 11157 6372
6242 6372 8821 8365 7349 10372 13574 15331 27218 25015 8939 1639 5640 15687 10592 9040
6228 9040 12077 7436 -4630 -9250 -19206 -17388 -10444 -7094 -1065 9709 10784 3046 -8274 -12851
6214 -12851 -1498 1393 1322 5892 -281 4793 -3229 -6262 6043 4822 -3967 -15954 -10696 -15498
6200 -15498 -22913 -10199 -11006 -11521 -1702 6617 19886 5529 -6747 -12598 -7078 -10369 -11188 -10404 -5826
6185 -5826 -11161 -1898 2387 -5698 -5466 -4504 2070 6691 4391 5828 8553 12521 3406 8425 4705
6170 4705 12668 20290 29182 26633 10892 15223 22453 17825 9690 814 -3335 -16784 -12458 -13368 -5869
6155 -5869 4438 4009 9072 14401 11801 3593 8027 15110 15170 330 -17079 -26517 -23993 -21353 -19370
6140 -19370 -10263 -11717 -10919 -9860 -5736 -12614 -15710 -1239 4717 2933 286 -5264 -14858 -24568 -25207
6125 -25207 -12770 -12444 -10425 -6271 -5682 225 -1946 442 -12178 -11913 1677 -4635 -9020 1883
6111 1883 -349 -8661 -8149 -3574 -8465 -11692 -13335 -5251 5913 -517 -3566 -1057 -9887 -11585 -8770
6096 -8770 -14206 -22502 -27381 -25326 -23836 -14404 -1009 -2473 -6726 -3160 -135 3832 -15344 -25241
6082 -25241 -22418 -26161 -21531 -20300 -17422 -6453 -4830 -3201 -1092 -4537 -15051 -18744 -7861 -5047
6068 -5047 5672 25627 14569 -2260 -6612 4732 8358 3557 -3226 -3275 5726 5230 -1113 -688 951
6053 951 8066 10103 10779 3969 4525 11525 8464 1818 -11242 -7444 -6709 -18817 -13778 -13640 -16165 -19037
6037 -19037 -21613 -19389 -10678 -14006 -8586 1899 4434 9195 15448 16789 14321 1218 5014 -968
6023 -968 -8396 -19213 -24214 -25814 -26093 -24086 -26518 -23066 -23866 -9878 4854 1895 -8925 -21160
6009 -21160 -12258 -2205 9067 13251 11768 -4248 -3633 -1582 -394 2019 -3867 -11871 -13983 -16640
5995 -16640 -9763 -16327 -18610 -13358 -11512 -4725 -13731 -22494 -21653 -11571 -2984 330 -6888 -12907 -13934
5980 -13934 -2916 -2194 -5737 -4044 -9356 -3062 5413 902 -5248 -13520 -19468 -9089 -9250 -11288 -7049
5965 -7049 3757 2252 -4681 -139 -428 -8147 -10756 -3914 12802 2588 5416 8563 4944 -574
5951 -574 849 15755 -868 -14441 -15124 -2038 11046 17447 10073 3326 -3795 -8861 -7446 -6866
5937 -6866 -12207 -12908 -12638 -12744 -11820 -9984 -9469 -11968 -8542 1513 1016 -4873 -15075 -18227 -13063 -14595
5921 -14595 -14916 -17781 -9184 -7302 -6770 -16379 -14561 -15155 -18698 -11861 -12582 -10473 -2018 9201 15864
5906 15864 8631 -2055 -9330 -7474 1134 3422 -11572 -13937 -10371 -2971 992 7442 -5613 -9290
5892 -9290 -478 5466 6926 7627 16257 13802 6176 2470 -4541 12098 11644 3494 -1571 -7237 -13077
5877 -13077 -23138 -7858 -6080 -7415 -729 11551 17751 11089 -5060 -3207 4876 2676 -3105 -1775
5863 -1775 -1292 -9918 -10683 -15921 -16250 -5610 4452 7288 8771 -5062 -1914 6141 4982 -2809 -3061
5848 -3061 -2903 -5962 -6219 -9215 -7593 -5638 5305 3798 -4153 -4674 -7504 -1826 11121 16629 17131
5833 17131 4984 -9246 -8988 -14375 -2422 15681 22850 21146 14529 -1276 -6918 -5435 7814
5820 7814 26360 23468 14947 13398 4633 -1968 -1221 -2755 2652 -13861 -27673 -22272 -14723 -8210
5806 -8210 -585 -2874 -3498 -3777 -551 1428 762 -2623 -4271 -5755 -7986 -8441 -5430 -5952 -6956 3898
5790 3898 12397 9088 22980 31879 21806 6377 266 6832 13675 12517 8585 3916 -879 4038
5776 4038 6417 4439 -6294 -7835 1947 -1148 -4020 5099 8074 2316 -1981 -4403 -1609 -3687 1136
5761 1136 21463 12978 -4688 -12782 -17836 -25688 -25759 -18777 -2524 -6620 -3642 3706 21827 19282
5747 19282 3802 -273 474 5277 9784 7170 5484 -4313 -7392 -4981 2449 -1179 -19032 -19663 -28890
5732 -28890 -25284 -27838 -30214 -12939 -6503 -6770 -13948 -28294 -8431 5118 -11400 -18362 -22604 -19496
5718 -19496 5517 3628 -1892 -4513 -6174 -23066 -35659 -36549 -29370 -23529 -18295 -21832 -25679 -28438
5704 -28438 -26682 -24659 -11454 -5623 -4992 -3442 -3443 -3154 2328 -2304 -9969 -3297 -1645 -5588 -5793 6333
5688 6333 5228 -2388 -6882 -1313 8379 12639 6820 -1496 -2449 -3370 -7967 -7615 -1576 -9880 -14190 -8029
5672 -8029 -12517 -9417 -5186 5798 3211 3531 2944 -10324 -20843 -12823 -2069 -7081 -6089 6241
5658 6241 5275 12432 -3068 -15866 -14383 -4476 424 15195 21092 21132 28348 23139 15324 10183 11902
5643 11902 2572 1762 15599 16301 8739 -7683 -12995 -7931 6201 248 -6541 -9674 -11336 1475
5629 1475 6486 8258 7001 5769 -9339 -16188 -13978 -7981 -7070 -5517 5276 16500 5033 -3491
5615 -3491 -4411 -4345 -8835 208 2841 73 617 1615 4359 4004 273 -1049 -1089 2482 -2783 -5238 1647
5598 1647 2253 4796 6051 9861 11512 -512 -4623 -6603 -9702 -10751 -5475 1336 -3449 -12661 -4672
5583 -4672 -2775 -8532 -7971 -4963 -10866 -26451 -23062 -5644 5178 3310 1654 7919 4890 -170
5569 -170 2156 6455 1235 -1910 -8267 -17652 -16084 -17925 -6392 12420 10794 -12 3114 -2273
5555 -2273 -4750 -11868 -7201 -12304 -20284 -16591 -1413 -282 7473 1969 -13611 -14513 -15270 -16751 -8225
5540 -8225 -4187 -9037 -2246 4168 2490 -2045 -8789 -1991 2069 9660 12154 15527 14159 17856 10099
5525 10099 -4742 -3321 -1885 -6425 -14105 -18087 2777 10517 -3803 -7081 -4841 3408 -9104 -13955
5511 -13955 -7882 -5814 -8267 -3506 5371 487 -13569 -17962 -132 9895 594 -5861 -5588 4585
5497 4585 11637 13080 10706 5692 29 -4020 -9629 1251 -602 1769 10218 7211 2870 1978 7198
5482 7198 12403 4176 1559 -5736 -6506 -1541 -7494 -2887 -7326 -1033 9047 2828 5343 1774 5149
5467 5149 15302 7397 1060 4256 2479 8236 6184 -1058 9483 10332 4519 1834 3600 14571
5453 14571 9525 2591 -602 -6901 -15934 -19925 -18847 -16742 -16087 -3430 2442 -1964 -5160 3402 6192
5438 6192 3883 9421 -1112 -4516 -3852 -7204 -12586 -21678 -13333 -13962 -7350 -4158 -6386 4240 8176
5423 8176 9208 3928 -5220 3657 11680 6583 -11246 -24925 -21453 -12052 -1345 2890 11905 13361
5409 13361 11040 19367 16704 17925 6776 4772 -428 610 1418 -10085 -13699 -7403 -9 -4800
5395 -4800 5367 7441 1569 1030 673 -11620 -12915 -4233 -8907 -9484 -9818 -981 3637 7585 7706 -1784
5379 -1784 -12718 -17202 -10078 11270 20995 3746 -1813 7048 131 -3395 1787 6833 7367 6033
5365 6033 -10233 -18987 -11316 -6222 -6638 4702 9400 16482 12999 1665 -5460 -239 6679 10766
5351 10766 10931 7636 5683 -2486 -4976 -2103 3528 6068 7763 11343 7891 -975 -7945 -13950 -15657
5336 -15657 -10123 4509 9072 4714 3998 2828 5337 3809 4291 -5947 -16115 -14095 -14307 -10474 -1046
5321 -1046 -4336 -11323 3374 9722 4901 -9135 -24580 -27203 -19948 -8765 122 12625 10464 9835
5307 9835 -2601 -7440 1604 14803 17936 24804 22098 12754 4468 -8587 -18951 -11899 -6734 -228
5293 -228 9050 1290 -10786 -10102 -3832 1187 -1302 -5566 969 6642 -6386 -14687 -13003 9084 24395
5278 24395 16793 5180 -4296 1586 3749 3782 7160 8816 8524 8911 11710 14373 15210 23559 21486 16944
5262 16944 12601 -5426 -7858 376 8182 12123 8722 3818 5717 2893 8061 7611 -5895 -10359
5248 -10359 -5820 2147 31 -3356 -6324 -10171 -17079 -25050 -25240 -19260 -20033 -3735 3313 9006 9661
5233 9661 5800 1745 -3945 -7773 462 4214 4118 628 -14866 -14063 -7464 -18170 -16693 -12735 -18286
5218 -18286 -12473 -7815 -2297 -4663 2969 7145 12503 7116 8638 8646 7750 9143 11730 3669 -1302 4088
5202 4088 7820 15299 14938 -2243 -14902 -4594 1617 4537 -3675 -10705 -6588 -3015 6139 2206
5188 2206 -19235 -20116 -15257 -6193 5766 -3963 -3163 -16 10221 11594 -4737 -11433 -6096 -16230
5174 -16230 -11064 748 -5124 -5212 -10703 -10527 -9280 -4660 111 401 -4092 -5596 -10823 -1592 4790
5159 4790 4719 7380 -1779 -16131 -24591 -14646 -12883 -20970 -17832 -5310 921 -6855 -4403 -6075 -2994
5144 -2994 -2214 2833 7385 9008 1751 16092 20673 12340 2508 1101 8715 16778 20436 24565 21313
5129 21313 3379 -4116 -649 3858 907 -4232 -5908 344 6086 12242 23007 28003 20290 23777
5115 23777 27499 20087 -954 -16887 -28336 -24442 -10876 -15559 -3714 -5380 -25728 -26583 -19206
5102 -19206 -3796 -994 1496 11360 6533 -13544 -12624 -958 9178 6048 13864 12215 5021 3042
5088 3042 -5950 -3782 -1728 47 -2187 -10490 -18454 -10524 -8331 -10198 -13317 -19142 -3503 1 3822
5073 3822 10422 11404 -5683 -17020 -8857 0 3264 -3634 -8736 -15926 -8738 4695 1489 -3677
5059 -3677 -10247 -3838 -8008 -24211 -26626 -13616 -4665 -1314 10472 21182 17236 10597 8165 10207
5045 10207 8469 9167 9309 6296 1397 -3033 8896 4389 -7610 124 8994 11694 8002 507 -679
5030 -679 -4559 -7557 -1191 5567 4598 19029 10181 8584 -3117 -2827 11934 14058 4913 -4920 -7054
5015 -7054 -4789 2316 2200 -8518 -6465 -1793 -8880 -27395 -16713 -7132 -5538 -11285 -20095 -19111 -10164
5000 -10164 2711 6742 -3835 -1674 -14385 -16383 -16943 -2828 1399 -1324 -11329 -7143 -1097 6803
4986 6803 10843 17354 18907 22261 17210 5050 7904 8228 -4663 -21718 -36555 -22567 -23360 -23191
4972 -23191 -12723 -20759 -22682 -24810 -16191 -4775 1771 10347 6307 -1959 -2449 9017 18023 19728
4958 19728 15252 -1157 1647 3651 5246 -1811 -1059 10440 9672 4269 5550 3659 -5213 -11308 -125
4943 -125 6155 -1046 -7052 1821 -4161 -7269 1673 1888 5762 13356 14157 6791 6385 6207 3340 -11948
4927 -11948 -14266 -9499 -11654 -13974 -10012 -3725 -1907 -2333 -308 963 1662 2128 -3242 133 -2272
4912 -2272 200 -1448 -2251 -5273 -7058 -6215 -1382 5625 8845 14719 3822 -11632 -22042 -28841 -29834
4897 -29834 -30629 -25455 -32440 -36464 -31292 -11412 -11634 -16248 -11644 -11559 -17505 -19071 -8017 6401 -2791
4882 -2791 -7719 -7947 -3939 -2601 10868 969 -8185 3028 743 -8875 -17404 -22007 -10779 -5784
4868 -5784 -18238 -24021 -18384 -17091 -8763 11591 17161 9158 3360 -568 4692 1523 -6153 -4219
4854 -4219 7062 7650 15720 10468 7055 5702 15080 7862 -7585 -4897 -7423 -1530 -88 2396 -4237
4839 -4237 -9189 -15249 -14204 -8390 -7419 -11254 -3708 1566 8570 14792 6005 3806 -4993 -17876 -2137
4824 -2137 2790 3598 654 3560 3140 -1496 -10558 -4889 -9937 -19646 -13803 -13764 -917 3473 6688 18166
4808 18166 29328 25236 17585 5407 -4092 7840 11702 10000 16113 6627 694 -3401 -9731 -20724
4794 -20724 -25745 -15658 -11710 -16718 -19686 -15949 -11162 -549 5659 2798 4575 3344 -4875 -7827
4780 -7827 -642 6845 9633 -5584 -14354 -9946 -5544 2364 -4747 -8100 -2899 -3931 -3549 -8382 -3917
4765 -3917 -8146 -7713 -6934 -13590 -9040 -10559 -16689 -13170 -10814 -15260 -11041 -5656 -10070 259 17588
4750 17588 10169 -2062 4519 9510 7700 71 -2 6317 16531 19774 10646 13317 21904 15148 16502
4735 16502 20381 8876 5915 5427 -5225 -3838 -601 -116 -7330 -3964 -13016 -25318 -21157 -29100
4721 -29100 -29432 -9591 10284 7701 2353 3518 -10245 -7648 -472 -2335 -330 16872 31095 11666
4707 11666 -8576 -9147 -6811 -14949 -15540 -2660 -1239 -5846 2546 7833 15079 1833 -7373 5651
4693 5651 5652 -2249 5486 -5929 -13869 -8501 2948 4012 5971 126 935 7739 10210 8540 12229
4678 12229 3219 -9177 -8173 -2300 -4276 -3721 -3890 -4745 9783 13397 5788 514 -6945 -11026 -9304
4663 -9304 -4810 6330 -1467 -9421 -4972 2586 640 -11238 -23397 -22130 -14257 -7516 106 3915
4649 3915 3224 5739 4222 1157 -8316 -19809 -23541 -7554 21588 22530 16315 12533 7375 -1005 825
4634 825 2472 1715 -2031 774 170 -4565 -5455 -4977 5884 17250 19142 11701 2650 940 3443 11896
4618 11896 11671 10989 10392 10582 8179 3301 2693 -2616 -11991 -15502 -14845 -9803 -12160 -7133 -20210 -31495
4602 -31495 -29269 -8673 12730 11258 13205 9278 -5038 -21274 -11195 1783 -9468 -14176 -4678
4589 -4678 3015 4427 3831 10819 6628 3371 2385 -3753 -12845 -18715 -15510 -18400 -12697 -3144 -497
4574 -497 2811 -2783 -10643 -18013 -19186 -2105 -2403 -6932 -6986 -5149 4294 1431 4911 164 -3444 -4814
4558 -4814 3033 5534 1237 -8873 -4024 177 2594 956 3945 -5636 -5501 -5310 -13061 -18446 -14293
4543 -14293 -3520 775 -2817 -13787 -7376 -6099 -15774 -12625 -9174 -11351 -7364 -2035 2350 -5699
4529 -5699 -1741 -97 7337 4597 -6366 -6714 3252 -6253 -21179 -17776 -8357 -11241 -5246 5534
4515 5534 618 -11697 -23087 -25430 -16969 -16203 -11384 -15201 -15 2524 7473 2156 11991 12188 11552
4500 11552 12932 -597 -6684 -6560 5783 9094 5743 9270 10868 5758 -3674 -7051 -13904 -12408
4486 -12408 -8098 -21476 -18304 -22386 -17059 -11613 -16672 -26352 -27346 -22366 -17915 -19048 -5952 14667
4472 14667 19887 7241 8462 3768 3433 1025 -587 906 4111 2505 -7620 -5848 6953 5828
4458 5828 7282 11825 7464 -2743 -4716 -8124 -11663 -11153 -2356 3412 7604 18062 24246 23156 19081
4443 19081 13704 5842 7107 7249 8199 13610 3970 -16448 -6816 -1939 -1835 -11598 -19183 -5101 2800
4428 2800 2290 12262 19003 19445 26636 15307 704 3311 3375 -1903 -4090 -689 -9503 -14935 -8675
4413 -8675 -8123 -6225 1748 174 -1 5033 10928 1977 -5255 -7508 -2024 9482 25967 25221 10777
4398 10777 5042 1535 3012 2077 -463 -8263 -8534 -3409 14252 19359 3509 -6048 -20548 -21835
4384 -21835 -4006 4730 9677 6843 8378 7001 1773 3397 5920 2457 -10146 4441 5643 1160
4370 1160 -5022 -10199 -6380 766 -4707 -13604 -9059 -4439 2877 858 -1872 20644 19289 17016 16504
4355 16504 7011 11245 15968 11995 4531 -3920 -4725 -6365 -4583 5440 6579 5800 12310 19223 16314
4340 16314 5513 4384 2085 -6321 -13377 -18792 -5746 -3747 -15155 -14390 -2276 825 5152 5123
4326 5123 3923 182 -3264 -1244 -3119 -8231 -16170 -18758 -18540 -24197 -11419 -1464 -3929 -5532 -12392
4311 -12392 -16230 -17041 -2917 -2268 5182 11719 21327 30258 22010 4340 -8132 1471 7080 -1456
4297 -1456 -6161 -10669 1649 4830 -2078 -703 -5701 -1518 9177 15857 11180 5442 4271 -1497
4283 -1497 592 1183 11539 11299 992 7466 12291 22476 7548 -17724 -15742 178 -2573 -11182
4269 -11182 -7216 -3054 -1609 -3470 2123 2576 18513 6219 -3281 -2190 -8134 -21599 -28660 -25511
4255 -25511 -26774 -23094 -18889 -13004 -1942 1347 11842 8677 3841 -5379 -2546 3757 10073 9817
4241 9817 -4779 -19571 -17009 -12351 -4389 9882 20101 11773 447 5409 -3808 -6799 -5884 8365
4227 8365 14822 9279 10163 8447 -2015 -5410 -8428 -5142 -12292 -7450 -2951 12238 15600 13995 7997
4212 7997 1609 -10641 -8996 -11583 -3500 895 -6229 -963 2353 -2007 -1131 -1295 -7950 -8812 -15072
4197 -15072 -16111 -12933 -22634 -25581 -17976 -21343 -21944 -10651 -8306 -4118 4372 -2965 -13197 -18374
4183 -18374 -14918 -12955 -5304 -1329 -1065 -3218 -6409 -2652 -2488 -5844 -12718 -16949 -18351 -3613 2760
4168 2760 -1888 -8279 -10237 -10883 -13907 -14205 -16757 -10634 -4625 6716 -2240 7476 12509 -358 363
4153 363 -4459 -2656 10476 12322 10632 5446 6323 -365 -12020 -5016 -7034 -8952 -4411 -9151 -11195
4138 -11195 -5760 5780 14015 16587 19909 16300 8337 12320 1590 -8136 -18338 -21983 -26361 -22727
4124 -22727 -18614 -20556 -12888 -6540 5379 10548 17595 23271 16222 10931 4317 1605 5482 3354
4110 3354 -3828 1739 -7182 -13591 -11154 1002 1332 -8643 -12646 -14012 -20929 -15346 -1949 13095
4096 13095 15007 2381 -2218 -6257 -8886 -8798 6345 25407 14081 7207 11418 17452 15826 12347
4082 12347 2982 -9331 -20683 -17710 -6583 -250 2096 5003 804 -537 6936 3176 -4421 -2193
4068 -2193 6258 14010 11569 16891 10414 5737 -2481 -19184 -22223 -9065 -13612 -6235 -10145 -20379
4054 -20379 -27588 -20128 -15036 -12102 -12127 -21748 -17533 -15519 -6549 -3347 -801 -8113 -9816 -11790 -19278
4039 -19278 -23625 -16379 7125 26993 32141 7221 -11128 -18971 -17847 -1169 9221 -422 -10909
4026 -10909 -10122 -7149 -1288 -5347 -4319 -1966 -5260 -10772 -6469 -1486 -5952 -2825 3896 213 1153
4011 1153 -1059 1525 2420 -1570 6864 15293 15732 15919 5383 -5114 806 2408 4476 -3107 -11712
3996 -11712 -7267 -2861 2418 5926 10690 3827 555 1869 13096 15569 17052 8610 6950 9285
3982 9285 768 2466 4563 -7029 -10509 2136 4445 -4357 1164 8157 13093 9955 -6190 -14418
3968 -14418 -9798 -3946 5845 12705 -2494 3151 2150 -11221 -4262 9280 7045 7006 6342 -6008
3954 -6008 -24806 -26340 -24338 -10928 1052 3939 6730 298 7009 13419 11607 -3025 -12179 -10096
3940 -10096 -6381 1262 -3054 5294 13730 13436 6232 3561 -951 -8900 -11069 -1292 2499 -3010 5640
3925 5640 14267 19271 7514 -11299 -19303 -8451 -9424 -21564 -15126 -10089 -15909 -14639 -10208 -10118 -3517
3910 -3517 -11849 -14124 -7502 -7103 -5734 -3124 -330 -11098 -14148 -9206 -12069 2766 14215 5133
3896 5133 7923 12245 14256 24683 26621 22009 13694 9438 3516 -2567 2246 4184 -1849 -10821 -10692
3881 -10692 -5159 -9866 -8616 -7023 -1088 11389 16782 11075 6353 7350 -2783 -12689 -12150 -8709 -3733
3866 -3733 -2663 -16844 -20168 -8411 -2159 -4478 -17023 -10338 -7844 -1628 -494 -5474 -6235 -8536
3852 -8536 -4565 -16514 -24231 -17362 -1750 107 -1221 2705 3156 8137 15754 12515 14675 5509 -10521
3837 -10521 -13676 -9181 -9392 -5852 3032 11772 45 -12420 -5721 -1385 -1040 813 17882 16515
3823 16515 16931 12992 8725 5339 1474 -7984 -1597 -2299 -11100 -11613 -7395 2766 5027 -6420 -15186
3808 -15186 -13327 -14894 -18117 -15980 -3928 7136 21703 25179 25244 32186 18052 -9807 -11118 -3429
3794 -3429 -6558 -7575 -12632 -12917 -5852 -3288 -2069 -9637 -4819 1043 -10358 -15116 4072 5638 4838
3779 4838 9659 8600 9695 16876 13414 3396 -5441 -21041 -23489 -13280 -4698 748 -6339 -17962
3765 -17962 1839 6353 3130 -28 -6529 -11407 -7359 -13753 -2674 634 7211 2793 1364 13004
3751 13004 16644 6625 4350 5469 5019 4245 -2897 -4673 -9782 -16907 -16082 -11930 -11941 -17589 -16917 -9387
3735 -9387 -12971 -12221 -16261 -6805 -9877 -16951 -10663 -32 -262 1801 -5146 -20277 -20733 -691 6159
3720 6159 3642 -4594 -3027 6896 8608 -1048 -8320 -14259 -20030 -10773 -6846 1488 14543 26166
3706 26166 27301 26624 8748 5266 4953 1795 5780 -6313 -7785 1902 -4216 -18560 -21546 -12198
3692 -12198 -5650 -428 -3670 -3763 1045 7464 14863 17045 17551 17397 11722 1697 7954 16280 13488
3677 13488 18279 3347 -3936 -8201 -3698 3108 -1024 3368 9517 -2923 -13093 -378 6485 23012
3663 23012 13773 6312 2088 -7497 -9590 -1660 2922 10984 14856 2388 2414 9844 18194 1756 -10596
3648 -10596 -11155 -12931 -18333 -8450 4923 -1732 -21201 -19908 -16351 -18934 -17906 -7016 -7695 -3344
3634 -3344 -5543 -4271 -7375 -11378 -26232 -20781 -10271 -12754 -7865 6772 11233 2500 -10186 -12951
3620 -12951 -1014 -3513 -11891 -12594 -10884 402 10806 10629 19100 26074 25949 21686 21074 11263 15300
3605 15300 16586 3914 1894 -5387 -11874 -17323 -17783 -11959 -4732 30 -322 2419 5797 20307 28871
3590 28871 11609 -1093 -939 -5193 -9526 -4130 175 -5764 -5567 5214 501 -3058 -11516 -9940
3576 -9940 -5383 6760 -930 -22350 -33355 -23329 -1676 -4558 -14870 -17768 -7805 -849 1822
3563 1822 -3610 -3975 5662 1515 714 12793 13187 801 -8918 -6366 -852 -4157 -4603 -2939 -7330
3548 -7330 -11295 -1207 -333 -1069 -15920 -18420 -4502 9276 4851 -2119 867 2306 2243 1130 -13735
3533 -13735 -16868 -5128 -608 4181 6188 7644 10326 10199 10117 19139 24165 20706 13754 14858 13010
3518 13010 10975 11408 7125 9125 7404 7865 9817 4207 -9023 -4948 -10404 -17685 -15548 -12310 -15519
3503 -15519 -21695 -29755 -28481 -17269 -3519 5497 1172 -10406 -24513 -31383 -18241 4934 11853
3490 11853 17392 16566 2459 -14059 -17603 -8604 -2657 -13671 -22759 -12424 -3965 -5993 -11857 -13423
3476 -13423 -9672 -9121 -12716 -15129 -11590 -8291 -12309 326 14110 16480 25277 22538 5901 -2305
3462 -2305 3580 1531 1282 -3437 -2532 -760 -1144 -2067 210 -9317 -17893 -11303 -5939 7076 9881 -121
3446 -121 8065 -680 -10026 -12035 -15257 -9597 744 16680 13470 8085 -5169 -21249 -13044 503
3432 503 4799 3040 -6259 -8352 -11809 -6936 -1659 5689 -1771 -8154 -3102 -2755 -5255 -7971 -6926
3417 -6926 -3793 3170 2463 3498 -743 -3372 3154 313 3020 11441 2903 2178 6404 15134 -97
3402 -97 -4715 -2496 -6660 -4597 9295 8025 1224 -8200 -5976 166 1888 -4882 -4620 -3368 1425
3387 1425 3654 3752 -3231 -1678 -6546 729 4579 9542 7119 -3767 -2703 2881 -6316 -12252 -13921
3372 -13921 -8888 -5178 -1205 -6020 -6857 2845 7331 9612 5204 924 -2439 2552 7870 6525 4337
3357 4337 253 -1592 -5460 -3265 6249 6835 536 -8868 -6701 -4304 -13246 -8206 -3984 4186 4797
3342 4797 11349 15846 -3867 -16710 -10922 -6162 6044 7094 -2999 77 5325 3819 -200 17100
3328 17100 16311 5490 10361 14314 18997 15572 10136 5365 5877 13601 -3785 -7001 -3192 -6704 -4955
3313 -4955 -3402 9785 10479 6887 20045 10304 -3963 -14704 -13877 -12209 -1317 -1918 4231 15059
3299 15059 13867 8797 12725 12411 18182 20086 19500 14837 6528 7083 -859 -4693 4949 9281 116
3284 116 1629 5939 4326 19751 24888 12355 17133 12234 13837 23738 11038 7673 8803 5845
3270 5845 -2761 -14138 -14914 -11144 -5927 -13520 -4135 -6392 -15576 -12587 -1368 1126 2035 3551 5232
3255 5232 11276 4307 400 -2801 -3613 -5457 -11307 -13849 -18254 -14621 -11768 -8892 -9405 -13034 -7183
3240 -7183 -2976 492 5332 2549 3113 1193 4629 7669 10645 17909 22313 10600 8798 4258 -101
3225 -101 5210 -895 -7860 -15905 -21761 -14786 -11063 -5853 -12804 -23556 -25072 -14124 -9826 -5491 -3191
3210 -3191 3147 3958 -669 -4226 -15536 -7628 -5246 -5612 -3452 -4503 -2838 -6037 -19468 -23208 -9193
3195 -9193 -3759 7348 8472 -10153 -8493 -4398 -2407 -1170 -5004 2813 8060 -5094 -5467 8338
3181 8338 189 -257 -5952 9185 12876 -6024 -19594 -15681 -4283 -2105 -1061 4877 -4460 -8916
3167 -8916 -10240 -12667 -6998 -4392 2962 405 -4805 755 720 -995 6957 -2879 -7683 805 -3189
3152 -3189 -3397 -3087 29 -2035 -6915 -9559 -6936 -3137 9249 24621 19366 9899 8240 -4769 -8882
3137 -8882 -14015 6391 9949 2009 -653 6038 11072 11994 5912 9465 3934 -1357 5009 4587 4253
3122 4253 16081 21178 25745 12743 6066 2898 1065 2410 636 3600 2123 2431 13448 9588
3108 9588 4280 4348 -1465 -14051 -18232 -10124 1113 -13072 -8437 5479 2942 2547 884 -1932 8868
3093 8868 16240 11682 4225 10566 -154 -12280 -8819 8335 12238 9608 15565 10140 -8264 -6660
3079 -6660 -8821 -12125 -21673 -23368 -8266 -11947 -15602 -7684 -2378 -12493 -12066 -17511 -20481 -22311 -15378
3064 -15378 -7787 3322 -8442 -22371 -18208 -6589 -8874 -13862 -23365 -6772 4811 5505 10432
3051 10432 8397 6475 -1868 -10902 -19540 -9275 4045 2023 2742 -2845 -2539 -7854 -6497 742 7819
3036 7819 8271 4653 -4261 -11954 -15052 -18855 -13584 -7548 -9394 -5281 -2416 -6677 -5629 700 1387
3021 1387 -7191 -7918 4718 3716 3832 14106 11565 -5978 -9769 -9669 -9505 -12023 -11565 -2474 -2619 -7293
3005 -7293 -11316 -2439 4029 2751 -4067 -8883 -6208 -8637 -17432 -24156 -28858 -28655 -10888 9512 8862
2990 8862 15114 -4116 -15947 -14083 -11824 -7386 5376 490 4369 2757 -10794 -10417 -11754 768
2976 768 5061 -1996 -2902 -6665 -9096 -12785 -17003 -4239 -5823 -1734 -527 4446 10604 6525 -8219
2961 -8219 -14268 -10435 2249 10031 14352 11802 9265 11041 6769 13809 23619 18877 15436 3691
2947 3691 -4527 10816 14060 1330 -6122 -2090 3586 4767 2067 -10257 1673 7684 8271 817
2933 817 -4622 -4794 -8160 5811 24165 18047 14377 6920 -10167 -10141 -1265 4210 -8006 -2933 4797
2918 4797 4156 2763 16037 28578 20501 4431 -6707 -3510 9370 13913 12497 4048 -195 -8601
2904 -8601 -3194 4633 13883 16532 15807 18814 7967 -6247 3573 6604 11414 14635 15943 24338 21808
2889 21808 21030 17533 8454 722 587 7268 6602 -4179 -3270 -893 -7380 252 -3152 -2344 -5179 -6043
2873 -6043 -3799 -9698 -6728 -9038 2402 4680 677 2513 -1289 -2464 -13411 -7574 9405 14392
2859 14392 17686 13218 6634 -2869 -10621 -18116 -16961 -22115 -19902 -22076 -20400 -17021 -14560 -15070 -2309
2844 -2309 -417 -1663 -3771 2678 -336 -6673 -9952 -11401 -10651 -3184 11722 9462 3084 4187 -3050
2829 -3050 -1454 -5996 -4732 -1566 1794 13974 19803 18544 20028 18425 19470 10631 6307 -871 -6704
2814 -6704 -8656 -7394 -9457 -10330 -11224 -13914 -8002 -2467 -7401 -3718 -2897 11458 15710 25499 16299
2799 16299 11720 7783 -3812 -7063 -3984 -5349 -27663 -36793 -36885 -24022 -18270 -10756 -6595 -11647
2785 -11647 -13661 -22185 -23699 -6698 6806 71 -2318 4954 9226 10288 19615 7724 3611 6475
2771 6475 9711 10907 -8275 -10579 -11492 -12059 -9274 -5495 2323 3333 3367 7805 4288 -2185 -11151 -17629
2755 -17629 -14396 -4982 3372 4915 5634 6935 -803 810 -7188 -13378 -18715 -616 10625 474
2741 474 -4357 -1936 -6634 -1719 6012 254 6513 9324 1809 -14278 -14593 -5885 -1823 -3723 -17063
2726 -17063 -23727 -23248 -20436 -6216 10873 5333 -12541 -31269 -31663 -18445 -6689 3501 3094 1257
2712 1257 -1190 4567 -6246 -10344 -7767 140 -6955 -9110 -19795 -14886 -3631 11392 4200 -7109
2698 -7109 -568 1871 5003 3660 -4019 -12787 -7822 -639 7542 13926 15081 5143 5774 1877 12446
2683 12446 14117 11438 6303 -4911 -4806 9988 12442 8632 2028 -3703 1427 3165 8186 4900
2669 4900 2344 2242 -966 -3577 -3961 -4459 -2686 7413 9704 10903 12849 1411 -10932 -22513 -13556
2654 -13556 -5632 -9201 -10731 -11764 -13601 -21008 -18172 -1212 8464 12425 28002 19442 15700 2458
2640 2458 6384 7757 10142 6574 8815 11162 7735 3808 5320 8993 3067 2301 -2849 -13465 -10735
2625 -10735 -2743 7236 7655 6339 3706 -324 9271 16445 31341 21136 19949 22880 18228 16262
2611 16262 7926 399 7923 6820 -10741 -12846 -3412 8546 16880 11489 8654 3507 8087 16089
2597 16089 25496 23913 5298 -1173 2069 6891 5078 5166 -2014 -11884 -14585 -11101 -4991 8250 12512
2582 12512 10624 9383 -1269 -10407 -18126 -12329 -14070 -20585 -9431 1109 -431 2832 -5553 -11452
2568 -11452 -13404 -19484 -11493 6967 20586 20011 17122 10252 2424 3611 2202 -6974 3686 10747
2554 10747 1368 -5260 7818 18268 16999 10378 2777 2450 9750 16368 16672 11287 5526 -5038
2540 -5038 -1970 4510 -1667 8781 21398 19910 17104 16446 16063 18183 18042 9059 5162 6462 2298
2525 2298 -9061 -11676 -11679 -11641 -592 2954 -5567 -10480 -8431 -7681 -4322 -4747 -8397 -2381 -4866 -15325
2509 -15325 -30625 -33404 -22659 -5833 9615 15939 8674 11873 7311 8550 10738 7881 21988
2496 21988 29408 28443 16573 6820 -11243 -12810 -6747 -8454 -25400 -37383 -34856 -31378 -22848 -7053
2482 -7053 1211 7585 20946 14277 970 -4284 -7806 2283 7124 2373 -4593 -9085 -15419 -12104
2468 -12104 -8686 -9591 -3486 11204 7284 -2345 -2897 -9634 -9727 -9765 -9712 -11005 -16100 -7482 2458 3995
2452 3995 -2505 -9728 -1593 5663 13662 11044 -2967 -18175 -9674 -7684 -13227 -18194 -21476 -19329
2438 -19329 -12403 -12896 -22985 -22315 -22156 -19004 -20836 -20049 -253 3774 -10606 -18562 -19999 -14743 -16583
2423 -16583 -23888 -19910 -5039 -5789 -5429 -12125 -10860 -4006 3557 16677 4853 -423 8521 2920
2409 2920 -8301 -12229 -9507 827 6033 -7751 -3355 3979 9793 6247 11762 12511 12270 2916 1458
2394 1458 8686 2085 1485 2999 4729 -2963 -573 2582 -245 1753 -4252 -12029 -15789 -23497 -22504
2379 -22504 -9318 -1469 -3457 -8420 -14203 -11795 -2928 -3452 -5849 -2098 8509 20228 32939 25766
2365 25766 14671 818 4647 3391 4649 3893 1337 -3192 -13327 -23569 -9241 -6085 725 9052
2351 9052 10788 18466 21966 13893 11675 13768 9217 4542 7030 2170 -1926 -7651 1671 13533 4335
2336 4335 -3837 -10681 -12603 882 3450 -10200 563 920 -10669 -1139 -7482 -14103 -9099 -16986
2322 -16986 -12419 -6043 1004 -2980 -871 835 -1015 149 9605 -413 -9363 -4428 2373 6487
2308 6487 3085 4767 -8452 -12934 -9702 -448 -1546 865 -7570 -6143 -55 13396 12216 6043
2294 6043 -394 -6012 -9637 -1689 -2122 -11352 -19775 -19369 -8502 -11089 -7413 2730 1895 8318 20601
2279 20601 13026 8030 -6154 -4089 6525 1828 1899 15310 19803 14910 13521 11471 12126 10461 15279
2264 15279 20356 20617 26431 19370 -3752 -21190 -17133 -17365 -18090 -9297 7176 17050 1535 4431
2250 4431 4495 1255 6639 5733 8641 -5902 -12053 -12059 -7657 5047 7746 6935 8211 6106 2380 1136
2234 1136 679 7662 6909 -1778 470 -464 -5700 -1915 -3075 -3538 -2872 3505 2563 247 907 -5011 -9975
2217 -9975 -10776 2033 8761 -95 -14488 -17876 -19058 -12166 -1775 -3396 -16836 -18047 -9879 -7599
2203 -7599 -326 -1562 1735 -3970 -17022 -19760 6663 16687 11539 8490 15085 14396 3665 5667
2189 5667 3711 7206 9720 3696 984 -3534 3019 9678 6410 2213 -1116 -7641 -11401 -13853 -4816
2174 -4816 -9433 -5445 847 -10402 -13099 -7062 -3433 -4627 -3030 2407 69 -1037 11049 11993 8625
2159 8625 3752 1070 -5740 -18959 -27705 -16692 -12996 -372 5685 18129 36666 29360 16556
2146 16556 11285 13782 5312 -4237 11239 19172 11751 1080 -8615 1547 7211 8002 9041 -76
2132 -76 -10731 -17426 -17946 -1018 9463 3164 -1852 -5757 -1278 7661 14766 16227 20443 15672 14868
2117 14868 12103 14427 5036 2063 -4208 -8115 -6161 4402 15567 21686 11749 6573 6486 -8203
2103 -8203 -9352 6571 17037 12419 12997 3938 1673 -3858 -10369 -5524 -3287 3657 7910 6594 11353
2088 11353 -4259 -7214 -5004 -3214 3863 3193 -4910 -5876 9420 7287 5032 -289 -5372 6575
2074 6575 19730 17320 7530 8044 3399 7512 15327 15524 6955 -3446 -1965 -237 -6104 -6373 7843
2059 7843 6323 5368 5051 -431 -6303 -17146 -14647 -15992 -15455 -7298 -8598 -20390 -15375 -4984 -2425
2044 -2425 -16582 -4716 -2722 3717 3104 4249 932 -1749 -6447 -7285 -15478 -15105 -9981 -12590 -7773
2029 -7773 2422 -6301 -13408 -7186 -9457 7124 10878 5500 11321 2596 -7728 -2833 9147 -4952
2015 -4952 -11339 -5670 3775 8849 6438 12496 3859 -8956 3058 15243 18840 24977 20225 20510
2001 20510 7480 2711 2962 5879 9461 11655 10815 -2427 -58 8532 6816 3723 -1246 11079
1987 11079 3178 3442 3940 -2769 -12891 -16893 4799 6641 -1489 -4940 -2227 -3509 -8691 -6112 -8481
1972 -8481 -10231 -3273 10565 23400 13732 101 -11975 -14042 -8675 -8884 -22711 -34422 -25725 -19735
1958 -19735 -15346 -8672 8345 4503 -11383 -15968 -18243 -18522 -19960 -23743 -22586 -30208 -34264 -12523
1944 -12523 -5048 -13931 -7881 -7180 -3068 -1869 -5968 -2637 4919 -778 -10816 -24189 -18371 26
1930 26 -3714 -6199 5166 8665 2802 1739 2237 -3801 -11299 -25442 -17761 -11676 -7013 14196 16389
1915 16389 7840 4991 14065 439 -11392 -2549 15094 15959 10663 6953 2260 4314 6278 13243
1901 13243 5360 -6975 -20604 -16042 -11935 -3788 5849 4268 -8348 -16073 -13673 -6029 -10917 -1916
1887 -1916 -5730 -4886 -3739 3288 9967 3505 3204 1486 8115 12105 -1893 -4072 -5674 -16746 -16501
1872 -16501 -4090 4864 6375 8920 22098 29447 11843 4045 14486 19226 16110 12941 14766 11583
1858 11583 10531 -1803 -6095 735 13698 15320 9188 7363 4863 7240 4085 15420 12324 -1232
1844 -1232 -6761 -11742 -16392 -18700 -17017 -18705 -5396 20285 27441 18393 22847 24557 18907 2475
1830 2475 890 2961 7063 18102 20523 16881 18310 -3312 -11263 -778 10433 24466 20172 21503
1816 21503 20871 22363 23038 23557 12065 10015 1933 -6266 -9410 -4671 -7201 -5974 2847 11123 10664
1801 10664 16251 12780 6020 8456 12887 8676 350 124 3005 -119 -2384 -9892 -3436 7801 4655
1786 4655 3736 -2738 2732 17411 22505 23760 6926 -1385 989 -267 -4645 -1926 4667 10533 11532
1771 11532 -1463 -6527 -9224 -1797 -1508 -4977 -6366 -7025 -8676 -618 -4853 -14373 -9440 -3721 -14726
1756 -14726 -14452 -9605 -10085 -2179 11846 11438 10188 1918 67 -5444 -13923 -6504 -1000 -7784 -2686
1741 -2686 3857 -3505 -13803 -3870 7844 16760 25241 24810 32699 26018 14424 1848 -3148 -17252
1727 -17252 -16593 -6976 -2929 -1371 -814 -1818 -15327 -13732 -2179 6451 13295 5551 3125 13290
1713 13290 17470 22718 16943 7864 -12484 -13871 638 -1180 -8053 -10324 -8715 -4880 -6857 -11463
1699 -11463 -10286 -1001 8873 6870 7221 -28 1234 3723 3386 -1417 1986 -6053 -23545 -15542 -16168
1684 -16168 -14728 -3767 -5238 -16084 -12031 2110 -675 -1050 3833 8505 5442 884 2368 393
1670 393 -7862 -8930 74 10139 6923 -4234 -11190 -9189 3938 1026 -6204 -17777 -21422 -16584
1656 -16584 -3110 8260 -1504 -8922 -1306 -2353 -8249 -16528 -11644 -5477 -4958 2475 2498 13349 9522
1641 9522 11520 -1344 -87 11407 15968 11304 8897 16379 17616 24156 25957 24640 17822 25187
1627 25187 20887 6167 -1981 4990 9964 12822 16556 19721 11953 7875 152 -10425 -9304 3949
1613 3949 7120 -2067 -2985 -3658 7581 7576 3846 17596 23692 19669 18528 26673 28156 14758 14319 21859
1597 21859 12791 3340 -5754 -6732 -7723 -4534 -4663 11372 10563 -182 207 14598 16547 1379 -4787
1582 -4787 -12095 3686 18007 15407 4297 -1962 418 -7619 -6877 -617 -2232 -9861 -4206 6355
1568 6355 5598 8120 10003 12951 7567 696 -7640 -13143 -7631 752 9256 9134 1863 -11621 -17026
1553 -17026 1307 4126 4595 8395 11018 13829 1887 -8569 -10245 -6588 3691 4256 -797 -136
1539 -136 7062 11426 4174 -1398 -1690 -60 -1271 833 -4197 -14443 -4354 -1195 -2275 2002 228
1524 228 -2489 -3465 -2460 2117 8631 11651 2645 3325 12178 26339 35877 29576 7369 -7901 -13077
1509 -13077 -7889 -4729 -12452 -6534 -385 -3415 1779 222 -1296 5065 15292 17406 8564 -24
1495 -24 1368 4741 3827 4885 -5490 -9687 -8516 -10614 -18256 -7751 -3759 -14138 -5392 -1 4232
1480 4232 -5663 -1940 5285 10233 3922 -7473 -12207 -10303 -76 12608 8414 1317 -2735 3509
1466 3509 6830 8768 15212 23489 12844 154 -669 -5053 6896 16562 3284 -7560 -937 -1075
1452 -1075 -1105 -980 -4612 3283 11681 7765 14671 16626 14234 9896 3997 -7462 -2456 -14256 -15117
1437 -15117 -10271 -9995 796 7924 5881 3164 -2138 -13 -2786 -827 -459 10827 15256 9059 6872
1422 6872 12798 13520 15504 18735 11024 -474 2778 13737 17074 17983 14603 2911 2058 -6123 -2513
1407 -2513 5381 4188 2922 13187 3499 -2246 6273 4316 -4864 -17011 -9892 6157 11753 11927
1393 11927 12283 13707 19249 6230 3508 8936 5117 -15614 -22232 -14695 -12106 -2669 12085 15335
1379 15335 -2290 6401 11445 10370 11362 6980 8184 6465 -1199 -315 1910 7745 15193 4360 630
1364 630 -5968 -8904 -544 10268 11728 6690 994 -2120 9526 9409 1787 6853 8855 -3278 825
1349 825 8182 5965 -8202 -14044 -14874 -23188 -11899 8210 12396 11787 16625 21977 27632 32231 21844
1334 21844 9863 430 -5910 5894 17503 29974 25958 22989 19324 13893 7915 2519 -3786 5329
1320 5329 7095 3598 8587 18275 13499 1076 -7888 -4040 10068 12636 10164 7359 11182 6635
1306 6635 6461 9887 13804 -58 -1874 -6391 -7115 -10719 -1194 6450 12899 14460 10749 10276 14009
1291 14009 13012 1544 1345 1828 11620 9575 21065 25142 14089 16335 20868 24191 22696 9429
1277 9429 2984 2948 1710 5521 7069 3188 2971 9288 11121 -650 -4255 6148 11499 8364 14550
1262 14550 7154 13881 8022 3826 3107 5703 4930 -4489 -11682 2548 10760 13693 12750 4657 3534
1247 3534 7818 3888 5846 7850 5257 -608 -1567 -5724 -10702 -11760 -6637 -4470 -2682 -867 2598
1232 2598 3906 10478 1466 3904 8400 8535 15855 11474 10111 10699 5587 7155 13965 6935 10475
1217 10475 25511 12806 -2927 -13590 -11514 -7918 -3503 -2870 -7553 -4521 -7380 -10935 -6394 -14473
1203 -14473 -14999 -11558 -11585 -17146 -19058 -9767 -1086 9774 7173 3720 -9026 -16537 -10610 -15222 -17947
1188 -17947 -11990 9208 16818 12245 7013 6663 5245 10984 2789 -6395 -4301 8480 3918 10856
1174 10856 17957 6292 -1503 -418 8649 6130 10832 18510 6791 -3790 5253 -1750 543 4559
1160 4559 5108 -80 -2133 1993 2301 14755 31860 17207 7082 -7713 -33544 -26362 -11879 -10270
1146 -10270 1958 3379 -969 -5897 -1809 -3381 -3236 -7789 -10775 -6340 -9841 -4439 2854 849 8381
1131 8381 2190 -19 -2834 -3148 10311 10865 22153 24726 12510 5459 6175 9708 6334 3742 11805
1116 11805 15386 11917 12826 3527 4837 3656 3190 -4243 204 9340 3602 17091 18770 33754 44140
1101 44140 39598 23290 15113 18133 16220 4375 5463 -564 8581 5296 381 -7522 -11650 -11372
1087 -11372 -3224 155 3809 8491 2885 2711 -4428 -1822 -3058 -5613 -7110 -243 -893 -15224 -13412
1072 -13412 -7192 -1889 13172 25826 21167 11952 -13504 -22638 -13824 3224 8393 -3241 -550
1059 -550 155 -2262 -1055 2578 9115 12011 4723 7620 9071 -2690 -1079 16451 12988 -2398 3801
1044 3801 12763 18700 19010 7227 -17199 -23579 -26673 -31912 -28179 -20287 -15199 -9593 -9761 -10792 319
1029 319 -2988 -12229 -17557 -10156 -4129 -2457 -8911 -10172 -5905 -205 -1859 5892 14881 13019 2241
1014 2241 8463 19348 22558 20443 22491 14507 4999 9802 19692 19131 16769 7143 19364 19250 1792
999 1792 -669 -7558 -10775 -5400 2962 9879 12472 5605 -6331 1292 6533 2622 -4348 -4219 -5224
984 -5224 -138 -129 -8156 2058 12105 6132 -2869 478 3805 5340 3660 1245 -10687 -3329 -939
969 -939 -4698 -10654 -13000 -10000 -13889 -5708 3791 -3862 -2328 -4582 1445 250 -1204 -5441 -4221
954 -4221 -2792 5003 10902 20790 33448 33947 38471 29490 10271 12634 23786 17660 4484 3753 12710
939 12710 12640 7808 3645 3271 -8957 -14747 -6698 4143 -4738 -6344 -10915 -19756 -21890 -19837 -10297
924 -10297 -2229 -7053 4260 22816 24302 12610 2045 757 -2300 -2865 -8393 -11970 -1349 -1339
910 -1339 -1612 -7079 703 5497 4357 -2239 -11198 -9942 -5756 -14701 -5077 7449 11672 4686 -4596
895 -4596 797 9924 718 -5230 3648 -861 -9528 2910 15213 8686 2307 11676 7881 1787 14554
880 14554 22484 28469 19422 5632 8996 3965 10046 -1790 -8331 -2414 -8792 -16154 -23560 -14820
866 -14820 -6195 -13096 -3143 -3661 -6326 -3849 -2251 -545 6679 5015 4000 -5555 -1811 5364 5681
851 5681 2110 5775 12157 -2275 -6625 -13403 -8621 -3129 9296 3241 -1282 -10062 -20070 -14257
837 -14257 -16082 -12542 -7627 -12344 -12515 -19854 -17900 -11032 -12742 -18502 -12907 2293 -4694 -11824 -8049
822 -8049 -9808 -4269 -7031 -2449 14160 16880 7329 11647 13343 7618 4624 6934 9970 -201 -12974
807 -12974 -8540 1733 9952 12212 18470 17379 12095 -470 8551 18847 10664 5003 21740 16647
793 16647 12953 6176 2480 9531 -3177 -15577 -7877 -5271 -14288 -9594 -3416 -6979 -13115 -11317
779 -11317 -5925 6362 18103 18279 8399 9475 13586 12402 7182 5327 8167 25347 36939 29880
765 29880 7781 -9448 -18034 -18182 -12581 -85 -906 -13955 -8124 592 8766 21881 11153 -6098
751 -6098 6153 12113 8780 3077 -2618 -5136 3096 5722 -8236 -10545 -6909 -12282 -13941 -3192
737 -3192 4285 3958 5060 2615 8889 14167 9995 11707 2627 3705 14337 17606 18853 16177 11374
722 11374 1103 -9707 -7338 -1042 -3480 -6955 -11720 -5168 -2604 -3512 -11134 -15329 -7110 2720 18013
707 18013 19322 3238 -8951 -612 6038 2106 -1429 3642 -1817 11008 3996 -530 17371 25049
693 25049 13534 -1565 -13544 -10989 -4681 -3823 -1971 4431 -2816 -9596 -10046 3469 10295 15061
679 15061 11054 13851 11862 19422 27039 22970 4303 10253 11148 -2630 14885 31215 27392 18896
665 18896 20074 19612 18251 8280 -3329 -6499 3369 17622 18754 15420 7440 5951 11474 12652 8461
650 8461 17843 12278 19500 5010 -7226 -9106 -15236 -2632 6203 5829 2517 -89 2786 -1376 7523
635 7523 10901 -1817 -4371 -6777 -7725 -8484 -4035 -3065 -6497 -14535 -12834 -7159 -2472 1273 8022 14904
619 14904 17222 9157 10940 12274 14983 15961 9871 8145 -9254 -13028 -8193 -4067 -2723 3049 1528
604 1528 -4347 -2869 -4375 -4317 -11789 -10914 -4439 -4449 -8435 -15096 -2054 -5002 -5961 -1308 5030 10561
588 10561 19195 31077 29640 21152 21098 24213 29173 21445 11139 10907 2229 -4760 7289 8106 3291
573 3291 10771 8045 -3577 -4715 14114 15985 18202 22269 20734 20754 14928 8367 -6088 10405 24960
558 24960 13995 -3425 -11927 -19768 -14536 -15820 -12902 -14084 -9103 -7535 -13369 -13230 -4492 3009 -2432
543 -2432 -8397 -6152 -5242 -11302 -10023 54 -2594 647 9690 15843 11543 7777 13522 8560 -3750
528 -3750 -12857 -18187 -17241 -11394 -10533 -14529 -12419 -10469 -4496 -2927 -1795 -11136 -2273 3010 -16401
513 -16401 -18870 235 10500 17586 23346 15977 3981 4949 -1592 1422 1548 5667 9519 8216 3572
498 3572 -4401 -5982 -12806 -13819 -13523 -14376 -3384 1127 -14385 -16970 -9098 -4068 -2192 -12558 -15284
483 -15284 -14077 1051 3970 12417 14049 8677 1759 13470 24232 30154 16175 7107 9472 18086
469 18086 17191 15178 21465 26363 26787 18816 21589 22031 21710 14213 12942 10848 10444 8326 6342 3188
453 3188 -4783 -12626 -11195 -6718 -5724 5742 8817 10671 9498 8559 10522 14266 17507 4211 -4076
438 -4076 -6282 -2396 3326 10211 10370 14973 11682 635 -5303 -11450 -15170 -5646 4574 9426 12853
423 12853 7676 4067 10484 4850 6151 9807 6620 11309 12087 11695 11733 6043 4086 -8769 -9109 -7897
407 -7897 -7346 -9300 -6518 -4607 -5337 -5019 -3801 -7445 -10000 -5165 4689 -3956 -6931 1859 4368 1280
391 1280 4260 10111 9752 8795 9439 14790 19400 16170 7957 4501 -7762 -10301 -687 960 -1316 -2347
375 -2347 -2871 -3517 -2360 -2518 -3479 -1126 -1052 4469 7608 -2349 -1005 2737 7426 4797 7123 2523 -685
358 -685 -2364 2198 -6090 -17253 -15710 -10784 -10185 -7953 -2426 4991 -4482 451 -2487 2324 1768 -10410
342 -10410 -2919 1622 5596 21768 22455 17903 19588 11977 887 6089 26560 24787 15113 5060
328 5060 -7486 -7818 -4610 8048 10738 6559 10638 8947 4415 -3108 -16523 -20471 -15992 -4790
314 -4790 5608 7330 -3526 -13912 -14777 -8517 -9340 1413 8092 16413 10866 7332 3407 -2758 -11019
299 -11019 -9177 5567 5554 -920 -14726 -21925 -17921 -7234 -4351 -14194 -13050 -10547 -7040 -1915 -2143
284 -2143 -8255 -4265 3612 15237 7273 12245 21114 8975 4175 1112 -3668 -7652 -3667 5098 4126
269 4126 -11755 -15559 -8403 601 -4162 -9628 -11046 -17261 -12944 -608 -8282 -6029 10008 1264
255 1264 -4440 -6110 -2592 -200 6280 171 -2396 2650 7191 767 1746 1745 -5031 607 2269 1617
239 1617 -5123 -15899 -11052 -6486 -10144 -16255 -12548 -17741 -10193 -6548 -4288 -2122 1855 -3296 -4727
224 -4727 -145 4989 8403 6122 8898 11544 10073 6664 -770 -7710 -4835 261 -3551 -5089 -6730
209 -6730 -1061 2804 2107 4813 14298 15491 15826 12032 9509 4739 5830 2046 2841 4952 1444 -3407
193 -3407 -2989 -4525 -5974 -8191 -5173 -8894 -9304 -10013 -6853 234 -2272 1482 -909 -7753 -2406 3666
177 3666 6835 3886 4775 10545 15318 17534 13565 14864 3814 -3157 -11157 -8198 -3807 -6746 -9614
162 -9614 -5356 2672 5390 10611 3480 11727 24502 16807 10881 14560 14107 12465 10730 15033 20149
147 20149 16739 5766 4573 2982 7497 14349 20443 11634 2101 -5391 -19377 -19832 -14823 -5676 7776
132 7776 10780 -4006 -9882 -13343 -16915 -13066 -11598 -5498 2728 5486 -2100 -11010 -16121 -22941 -18700
117 -18700 -10426 3490 13381 12031 8865 7515 15816 13821 8502 7419 421 -6457 -3740 -467 1393
102 1393 2781 1882 6771 5148 6002 5451 -5307 -8080 -12489 -8418 -8701 6385 15196 10113 2991 -3660
86 -3660 -7807 -2485 4970 5565 2445 -6148 2682 5675 2121 1063 -3761 -10210 -16223 -17871 -7031
71 -7031 -6210 1207 -6630 -13196 -13783 -12962 -9449 -4634 -5503 -4071 163 6363 2581 -6411 -1996 649
55 649 -2970 -7214 -6186 -3653 4121 3736 -7915 -12550 -5386 -3116 5253 7408 6557 5871 8038 11830
39 11830 294 -8596 -9159 -4537 -11194 -16852 -10400 2775 4195 -2034 -6366 -12855 -13170 -7505 1569
24 1569 4334 7316 -2206 -10014 -10507 -7231 -12124 -9016 5353 12983 10430 -4696 -4212 -3596 -1447 -1398
8 -1398 -4378 -1104 -4286 -1416 4850 8874 12144 14853
0 14853
$$ Imaginary data points
##PAGE= N=2
##DATA TABLE= (X++(I..I)), XYDATA
32767 26637 24333 30141 46741 50592 54344 52645 46663 42624 43431 50299 53432 51147 38478 34556
32753 34556 34299 30926 33621 31467 32609 36304 36632 41680 45353 48569 37614 31246 35360 36536 45923
32738 45923 46561 46422 45043 49763 49784 48183 48984 52456 53362 59560 57733 68789 65942 53932 51225
32723 51225 54811 63976 58134 57411 61630 66197 68458 62733 66062 68578 67509 67963 73236 72084 68829
32708 68829 69271 75387 72018 64753 66774 72979 71671 64484 68316 64633 64892 65923 74086 77638 68543
32693 68543 73640 84240 89500 77635 76971 79401 82441 83401 83343 82326 86042 87465 87391 84794 84809 92138
32677 92138 103212 99391 96322 98341 101952 99013 102046 99858 100951 92275 91545 87523 86918 81787 74302
32662 74302 69235 79225 94286 102847 92171 87905 94041 98768 105845 100207 97956 90384 88337 91719
32648 91719 96957 97873 102585 111920 111945 108692 107177 99944 110103 121666 119078 112922 109008 105072 111784
32633 111784 117851 115029 106130 92937 91683 87336 90325 106888 107310 94913 88248 96631 96107 95380
32619 95380 97901 101819 110503 106063 105488 109119 116750 114937 110658 110173 105592 108486 113916 111287 109829
32604 109829 115143 117039 122479 119542 124139 123218 114492 110367 114476 113364 107998 106200 110856 121590
32590 121590 123928 118950 114974 111370 108973 113229 116573 116569 114397 116704 125369 135872 141484 140564 130133
32575 130133 122768 116023 124061 117518 123638 122961 132533 131070 129699 127110 125422 140188 143904 148440
32561 148440 160749 154443 141998 136870 131922 127634 130487 129982 130283 133931 126910 126118 124007 130227
32547 130227 133630 140651 139959 129023 124371 127289 131824 136814 134559 136814 137512 131429 131894 142130
32533 142130 149495 138190 139389 149722 137802 129138 129617 142785 151752 146152 140622 132732 134666
32520 134666 144820 145799 146867 137584 116668 124160 130295 132484 141808 143688 148567 159378 160642 159398
32506 159398 163957 172573 166361 156508 156333 147499 146878 155020 158461 159724 158390 147921 140093 137159
32492 137159 141641 148484 157338 168856 180193 172899 158592 151618 150748 150826 158273 162077 165488 161243
32478 161243 158215 172472 170848 157920 157989 151211 166057 175886 171309 162537 155782 164059 166755 156807
32464 156807 150774 148680 156229 159680 165519 163659 160966 159663 157858 166992 174306 176074 177045 177573 172687
32449 172687 171553 158070 152842 150679 147772 156407 159415 161332 167005 169492 165445 154596 155339 156041
32435 156041 151682 145776 155964 166090 171207 173083 176565 176103 173018 162465 163579 158990 149701 156342
32421 156342 158490 155341 155328 163781 176007 179893 179852 179576 190034 191278 177792 174507 185097 182562
32407 182562 188270 195550 198614 190405 179684 178484 187138 195447 193292 187624 188404 196102 190079 180950
32393 180950 182141 186445 190125 200667 199838 184725 173278 167995 172243 189187 187986 174471 168624
32380 168624 168144 170727 177413 181742 184264 180231 190525 189678 189162 182741 174472 178381 182165 174316 172611
32365 172611 184506 180270 178884 177583 169132 162545 168733 181659 185674 184898 184540 182335 174285 171705
32351 171705 186056 185649 180409 188990 196575 200872 202939 201180 195696 183887 183442 181158 177654 182105
32337 182105 198848 202522 204756 203096 206986 196751 191126 193857 183819 175926 176249 182286 185469 188727
32323 188727 193599 188676 186372 181389 182742 192637 202029 201666 193178 183832 179249 170036 172035 180966
32309 180966 180668 179096 189273 194996 198971 204722 196860 203201 207427 203488 192517 180663 185092 191314
32295 191314 190450 193002 200420 201558 198430 189547 189425 192134 199322 207792 214600 213375 206204 195407
32281 195407 187495 195679 201709 198448 194914 204272 216663 212716 196248 196760 204961 201526 195252 188683
32267 188683 185113 192914 199865 198580 199664 202796 193945 197075 198799 202793 197648 201588 205182 208550
32253 208550 202914 199718 186737 184370 199640 201896 194250 183064 186125 202056 200713 191249 197534
32240 197534 198506 197934 209779 205433 198557 185214 181638 197788 199699 196927 202231 202612 207525 200245
32226 200245 194681 189793 180580 179707 182411 185918 192861 184291 169769 180834 185492 188286 195200 191158
32212 191158 189932 178068 174198 184824 193168 185469 188793 192237 184388 188304 195213 207375 214054
32199 214054 209132 194777 192602 196682 198404 206467 200786 197147 202027 194223 186644 197144 195704 205086
32185 205086 200973 207392 214402 215149 215000 206017 197926 197799 187905 191858 194220 197990 199454 191941 194635
32170 194635 196610 199839 214054 206389 187882 180836 178885 186607 194458 186146 193535 209542 204377
32157 204377 190602 188844 179136 173041 183280 194355 194396 191454 192218 197557 211859 220991 216996 208844
32143 208844 200616 196347 200064 207192 193172 186562 191459 203808 194074 186469 188010 200550 203596
32130 203596 199724 204456 205146 211823 211218 203584 196068 191367 197698 202748 208474 205392 194935 188114
32116 188114 182248 190413 196168 191933 182693 186118 203765 207830 201977 207690 205664 205293 198116 198064 203813
32101 203813 213077 202362 195415 188841 194127 187777 176518 174242 179092 185792 192388 195983 198387 193602
32087 193602 191607 208300 217489 221520 207750 197419 196480 193885 187204 189043 192412 204577 199301
32074 199301 200320 194745 192835 198008 201695 209297 213316 211794 211340 201280 193507 185328 194730 200085
32060 200085 193241 190437 183479 187389 187961 189162 187927 194238 206172 208649 214399 213043 209117 198178
32046 198178 197965 195705 191781 194391 198033 199246 199921 208559 212534 212932 214274 214258 214381 210932 202183 195709
32030 195709 193285 202103 206565 202445 201617 204050 195808 186416 188985 195261 202034 211843 214236 210605
32016 210605 200688 199952 212794 223126 229348 217336 212348 211041 201951 202819 206590 218015 211710 209413
32002 209413 196299 200567 208269 209715 207555 214744 212049 208837 204478 205738 209777 205390 206122 199841
31988 199841 195350 207293 213843 220357 219427 218642 231060 243007 228650 219496 219430 223279 218452 212834
31974 212834 218449 217431 215018 203857 206374 207841 206431 198218 197417 196108 197965 207084 206523 206539 206075
31959 206075 215961 211470 214693 215888 212838 208386 213476 225905 223172 206937 209149 218361 216609 200870
31945 200870 193587 192373 189261 188339 191129 200452 208777 206693 209723 204474 200374 211471 223579 210442
$$ [...]
##END NTUPLES=NMR SPECTRUM
##END=
