##TITLE=Analysis number 321293
Compound Code cc 33801
Project Code adrs
Chemist Name ugmt
##JCAMPDX= 6.0         $$ Bruker NMR JCAMP-DX V2.0
##DATA TYPE= NMR SPECTRUM
##DATA CLASS= NTUPLES
##ORIGIN= Bruker BioSpin GmbH
##OWNER= nmr
$$ XWIN-NMR		Version 3.5
$$ Thu Aug  3 09:33:35 2006 GMT Daylight Time (UT+1h)  MAYBRIDGE\nmr@NMR_250MHZ
##.OBSERVE FREQUENCY= 250.131544655141
##.OBSERVE NUCLEUS= ^1H
##.ACQUISITION MODE= SIMULTANEOUS (DQD)
##.ACQUISITION SCHEME= undefined
##.AVERAGES= 16
##.DIGITISER RES= 18
##SPECTROMETER/DATA SYSTEM= dpx250
##.PULSE SEQUENCE= zg30
##.SOLVENT NAME= DMSO
##.SHIFT REFERENCE= (INTERNAL, DMSO, 0, 16.522)
##AUDIT TRAIL= $$ (NUMBER, WHEN, WHO, WHERE, WHAT)
$$ ##TITLE= Audit trail, XWIN-NMR		Version 3.5
$$ ##JCAMPDX= 5.01
$$ ##ORIGIN= Bruker BioSpin GmbH
$$ ##OWNER= nmr
$$ C:\u/data/dgb/nmr/ADRS/130/pdata/1/auditp.txt
$$ ##AUDIT TRAIL=  $$ (NUMBER, WHEN, WHO, WHERE, WHAT)
(   1,<2006-08-03 09:33:14.66 +100>,<MAYBRIDGE\nmr>,<NMR_250MHZ>,
      <created by zg, POWCHK disabled, PULCHK disabled
       configuration hash MD5:
       E2 DF 36 D8 04 B2 41 60 5A D7 A3 38 5A 4B D0 FE
       data hash MD5: 64K
       9C E5 6E D9 E5 61 ED 66 A0 4B 88 45 40 2C 32 E7>)
(   2,<2006-08-03 09:33:27.39 +100>,<MAYBRIDGE\nmr>,<NMR_250MHZ>,
      <Start of raw data processing
       ef LB = 0.3 FT_mod = 6 PKNL = 1 SI = 32K 
       data hash MD5: 32K
       3B 18 99 BD C6 B5 6A 77 2F A2 72 BC 4A 37 14 75>)
(   3,<2006-08-03 09:33:29.00 +100>,<MAYBRIDGE\nmr>,<NMR_250MHZ>,
      <apk 
       data hash MD5: 32K
       80 FC 82 90 15 6B A8 27 CA 40 B2 E6 83 E5 F0 83>)
(   4,<2006-08-03 09:33:29.77 +100>,<MAYBRIDGE\nmr>,<NMR_250MHZ>,
      <abs ABSG = 5 
       data hash MD5: 32K
       43 3F B1 D6 E0 04 05 4F A7 6D A5 FE D8 8F D6 81>)
$$ ##END=
$$ 
$$ hash MD5
$$ 4D 9C B9 15 2D 4B EE CA E6 A4 7C 23 C8 A1 48 66
##$RELAX= 
##$RELAX= 
##$RELAX= 
##$RELAX= 
##$RELAX= 
##$RELAX= 
##$RELAX= 
$$ Bruker specific parameters
$$ --------------------------
##$DU= <C:\u>
##$EXPNO= 130
##$NAME= <ADRS>
##$PROCNO= 1
##$TYPE= <nmr>
##$USER= <dgb>
##$AMP= (0..31)
100 100 100 100 100 100 100 100 100 100 100 100 100 100 100 100 100 100 
100 100 100 100 100 100 100 100 100 100 100 100 100 100 
##$AQSEQ= 0
##$AQ_mod= 3
##$AUNM= <au_zg>
##$AUTOPOS= <7 >
##$BF1= 250.13
##$BF2= 250.13
##$BF3= 250.13
##$BF4= 250.13
##$BF5= 500.13
##$BF6= 500.13
##$BF7= 500.13
##$BF8= 500.13
##$BYTORDA= 1
##$CFDGTYP= 0
##$CFRGTYP= 5
##$CHEMSTR= <none>
##$CNST= (0..31)
1 1 145 1 1 1 1 1 1 1 1 1 1 1 1 1 1 1 1 1 1 1 1 1 1 1 1 1 1 1 1 1 
##$CPDPRG= <>
##$CPDPRG1= <>
##$CPDPRG2= <>
##$CPDPRG3= <>
##$CPDPRG4= <mlev>
##$CPDPRG5= <mlev>
##$CPDPRG6= <mlev>
##$CPDPRG7= <mlev>
##$CPDPRG8= <mlev>
##$CPDPRGB= <>
##$CPDPRGT= <>
##$D= (0..31)
0 1 0 0 0 0 0 0 0 0.06 0 0 0 0 0 0 0.0002 0 0 0 0 0 0 0 0 0 0 0 0 0 0 
0 
##$DATE= 1154593993
##$DBL= (0..7)
120 120 120 120 120 120 120 120 
##$DBP= (0..7)
150 150 150 150 150 150 150 150 
##$DBP07= 0
##$DBPNAM0= <>
##$DBPNAM1= <>
##$DBPNAM2= <>
##$DBPNAM3= <>
$$ [...]
##$SUBNAM6= <"">
##$SUBNAM7= <"">
##$SUBNAM8= <"">
##$SUBNAM9= <"">
##$SW= 20.6930455092707
##$SWIBOX= (0..15)
0 0 3 0 0 0 0 0 0 0 0 0 0 0 0 0 
##$SW_h= 5175.983436853
##$TD= 65536
##$TD0= 1
##$TE= 295.16
##$TE2= 300
##$TE3= 300
##$TEG= 300
##$TL= (0..7)
0 120 120 120 120 120 120 120 
##$TP= (0..7)
150 150 150 150 150 150 150 150 
##$TP07= 0
##$TPNAME0= <>
##$TPNAME1= <>
##$TPNAME2= <>
##$TPNAME3= <>
##$TPNAME4= <>
##$TPNAME5= <>
##$TPNAME6= <>
##$TPNAME7= <>
##$TPOAL= (0..7)
0.5 0.5 0.5 0.5 0.5 0.5 0.5 0.5 
##$TPOFFS= (0..7)
0 0 0 0 0 0 0 0 
##$TUNHIN= 0
##$TUNHOUT= 0
##$TUNXOUT= 0
##$USERA1= <user>
##$USERA2= <user>
##$USERA3= <user>
##$USERA4= <user>
##$USERA5= <user>
##$V9= 5
##$VALIST= <valist>
##$VCLIST= <CCCCCCCCCCCCCCC>
##$VD= 0
##$VDLIST= <DDDDDDDDDDDDDDD>
##$VPLIST= <PPPPPPPPPPPPPPP>
##$VTLIST= <TTTTTTTTTTTTTTT>
##$WBST= 1024
##$WBSW= 4
##$XGAIN= (0..3)
0 0 0 0 
##$XL= 0
##$YL= 0
##$YMAX_a= 263197
##$YMIN_a= -354110
##$ZGOPTNS= <>
##$ZL1= 120
##$ZL2= 120
##$ZL3= 120
##$ZL4= 120
##$ABSF1= 16.522
##$ABSF2= -4.171173
##$ABSG= 5
##$ABSL= 3
##$ALPHA= 0
##$AQORDER= 0
##$ASSFAC= 0
##$ASSFACI= 0
##$ASSFACX= 0
##$ASSWID= 0
##$AUNMP= <proc_1d>
##$AZFE= 0.1
##$AZFW= 0.1
##$BCFW= 0
##$BC_mod= 0
##$BYTORDP= 0
##$COROFFS= 0
##$CY= 12.5
##$DATMOD= 1
##$DC= 0
##$DFILT= <>
##$DTYPP= 0
##$F1P= 14.0000005364418
##$F2P= -0.99999901652339
##$FCOR= 0.5
##$FTSIZE= 32768
##$FT_mod= 6
##$GAMMA= 0
##$GB= 0
##$INTBC= 1
##$INTSCL= 1
##$ISEN= 128
##$LB= 0.3
##$LEV0= 0
##$LPBIN= 0
##$MAXI= 10000
##$MC2= 0
##$MEAN= 0
##$ME_mod= 0
##$MI= 0
##$NCOEF= 0
##$NC_proc= -6
##$NLEV= 6
##$NOISF1= 0
##$NOISF2= 0
##$NSP= 0
##$NTH_PI= 0
##$NZP= 0
##$OFFSET= 16.522
##$PC= 1
##$PHC0= 132.205
##$PHC1= 4.55116
##$PH_mod= 1
##$PKNL= yes
##$PPARMOD= 0
##$PSCAL= 4
##$PSIGN= 0
##$REVERSE= no
##$SF= 250.13
##$SI= 32768
##$SIGF1= 0
##$SIGF2= 0
##$SINO= 400
##$SIOLD= 32768
##$SREGLST= <1H.DMSO>
##$SSB= 0
##$STSI= 32768
##$STSR= 0
##$SW_p= 5175.98343685301
##$SYMM= 0
##$S_DEV= 0
##$TDeff= 65536
##$TDoff= 0
##$TI= <Analysis number 999999
Compound Code 99
Book Reference 9
Project Code 9>
##$TILT= no
##$TM1= 0
##$TM2= 0
##$TOPLEV= 0
##$USERP1= <user>
##$USERP2= <user>
##$USERP3= <user>
##$USERP4= <user>
##$USERP5= <user>
##$WDW= 1
##$XDIM= 32768
##$YMAX_p= 470040099
##$YMIN_p= -1179112
$$ End of Bruker specific parameters
$$ ---------------------------------
##NTUPLES= NMR SPECTRUM
##VAR_NAME=  FREQUENCY,     SPECTRUM/REAL,   SPECTRUM/IMAG
##SYMBOL=    X,             R,               I
##VAR_TYPE=  INDEPENDENT,   DEPENDENT,       DEPENDENT
##VAR_FORM=  AFFN,          ASDF,            ASDF
##VAR_DIM=   32768,         32768,           32768
##UNITS=     HZ,            ARBITRARY UNITS, ARBITRARY UNITS
##FACTOR=    0.157963299565203, 1,           1
##FIRST=     4132.6476996994, 0,             0
##LAST=      -1043.33573715361, 0,           0
##MIN=       -1043.33573715361, -1179112,    0
##MAX=       4132.6476996994, 470040099,     0
$$ Real data points
##PAGE= N=1
##DATA TABLE= (X++(R..R)), XYDATA
$$ [...]
17555B32085J97916o6619j11443l04836j69577P5832j40585J20539L78457J90271
17545D02040J22710l75837j76016l1472K37587K40855j22217Q0786l09736j62371
17535i3671l2573K37728J86337K75428r2310J31887q6680j05249L637j81004q9260
17524A54270J15073J07618J68379j15913N9020O3908l96448n6800j59749j55306
17514b15948m110J95465k7640j10351K95253k4338K21596P0740M2766K54438J59957
17503H57828k8305l87250M7043o3707j25232J53657L46895J97753j60544l11053
17493E27085k72966P2924k30210k40722l7097J91017J54766M1835K6110J08332
17483C41074P3848K5331J20176P7797m0805q7613k15314r5306j28966k22209m9507
$$ plain form
17555 232085 430001 363382 251939 -52897 -222474 -146642 -287227 -166688 211769 402040
17545 402040 524750 148913 -27103 -58575 179012 419867 297650 378436 68700 -93671
17535 -93671 -126244 111484 297821 573249 480939 612826 526146 420897 424534 243530 154270
17524 154270 269343 376961 545340 429427 488447 552355 155907 99107 -60642 -215948
17514 -215948 -220058 -24593 -52233 -162584 132669 108331 329927 400667 443433 697871 857828
17503 857828 829523 442273 489316 425609 300377 454034 800929 998682 838138 527085
17493 527085 254119 327043 96833 -143889 -180986 10031 164797 206632 232742 341074
17483 341074 414922 440253 560429 638226 597421 509808 294494 199188 70222 -151987 -201494
17472b01494k05752l0708R4938K15737Q2681j22600j94515o085J26491K01869
17462c9438k7242j37715N0717J6986J73423j20483k71485L31215J92419L0337
17452A98734j95805O7383N0250O9260j67311o9531M6475j04636l08193P0231L36804
17441f339J36042q7762k09052O9896J64052K54461j90039k75814p0617J7805R3770
17430a03597K0096l6644l42019k54529J31207N0725K66573r8367o4106j13238
17420e43899J03636K22939k132k12680J77669J31958l53907M8368M2051J19449
17410b66548K34127K76891J71162k41698k11537k16378k39803k13713K6188K20897
17400d60412L13638J90705m5363j26915j73612J18500K4329j86224N3056J48465
$$ plain form
17472 -201494 -407246 -437954 -343016 -127279 -44598 -167198 -361713 -367798 -241307 -39438
17462 -39438 -66680 -204395 -153678 -136692 36731 -83752 -355237 -24022 168397 198734
17452 198734 2929 70312 120562 189822 22511 -47020 -545 -105181 -413374 -343143 -6339
17441 -6339 129703 41941 -167111 -97215 66837 321298 131259 -144555 -215172 -197367 -103597
17430 -103597 -83501 -120145 -462164 -716693 -585486 -534761 -268188 -366555 -430661 -543899
17420 -543899 -440263 -217324 -219456 -432136 -254467 -122509 -476416 -428048 -385997 -266548
17410 -266548 -32421 244470 415632 173934 -37603 -253981 -493784 -707497 -681309 -460412
17400 -460412 -146774 43931 -1432 -128347 -301959 -183459 -159130 -345354 -292298 -143833
17390a43833K55081K80160J0266k06941j73645k38918j13166q106p529p9051j52680
17379e78362L12086L13966J48010l74829L1903J47823q3083l59137o6711K95622
17369b12712r1697J49781K85668j08552j1907N2256J719Q5990o9015j08232j54851
17358a81552J50319J07439o1873k43014k3094N8993K20758q3650j44722l5526
17348b35922J00083J67669m0397j21671N9755n7858j58239k460m2570j28264r0038
17337e49912r3489o3638L20944L26721L9766K88656p50n40883k16133J4418L03577
17326a70723L89479l38006k80201q2251K68073J66695n5823j02657M398K0902
17316a80114L2400L07789K84736l9649k9605k26155p0923p8880L1095k4135n7293
$$ plain form
17390 -143833 111248 391408 401674 194733 21088 -217830 -330996 -339102 -346631 -425682 -578362
17379 -578362 -266276 47690 195700 -179129 -147226 597 -82486 -441623 -508334 -212712
17369 -212712 -304409 -154628 131040 22488 10581 62837 64556 150546 81531 -26701 -181552
17358 -181552 -31233 76206 14333 -228681 -251775 -192782 27976 -55674 -200396 -235922
17348 -235922 -135839 31830 -8567 -130238 -70483 -128341 -286580 -289040 -331610 -459874 -549912
17337 -549912 -643401 -707039 -386095 -59374 -19608 269048 268298 -272585 -488718 -474300 -170723
17326 -170723 218756 -119250 -399451 -481702 -213629 -46934 -102757 -205414 -201016 -180114
17316 -180114 -147714 160075 444811 405162 375557 149402 78479 -401 30694 6559 -50734
17305e0734o2060l01540r7997J57423L01738p2226J24485J29433l4309l62812
17295b68599R4365J43488j21667l21959k16633L31055o935j2121M37164J42629
17285B00787P0273p9769o2149K4045J44402j27718m1163J05285j04849r7354j22850
17274i1060J8933K5373j16070o06J18558j14860R3052L70189j98897j72197j07890
17263a75475r8859K1150j02141j39137J11684J57475Q9994j07198J4381L15545
17253H7419J38700k34784j868l7305J65919k40425j3665J24109O6918k03982k55039
17242d04003o7611Q1022K5764o0814J28455J59885O6645K23095n090M4399p406
17231A84341p2166k33912r970L4139J23722J7599j77832r3361j08705J19648J78073
$$ plain form
17305 -50734 -112794 -414334 -512331 -354908 -53170 -125396 -911 128522 94213 -268599
17295 -268599 -174234 -30746 -152413 -474372 -691005 -359950 -366885 -379006 58158 200787
17285 200787 271060 191291 129142 153187 297589 169871 128708 233993 129144 31790 -91060
17274 -91060 -72127 -46754 -162824 -163430 -44872 -159732 -66680 303509 104612 -67585 -175475
17263 -175475 -274334 -253184 -355325 -494462 -382778 -225303 -135309 -242507 -228126 87419
17253 87419 226119 -8665 -10533 -47838 118081 -122344 -136009 -11900 55018 -148964 -404003
17242 -404003 -471614 -390592 -364828 -425642 -297187 -137302 -70657 152438 147348 191747 184341
17231 184341 112175 -121737 -131707 -97568 26154 43753 -134079 -227440 -336145 -216497 -38424
17220c8424M07363J78350m27177j21405l02563p3969O9373K38154K08991k61592
17210a22899k75253q2710J77278K96906p6397k28769j8736n3760k16480J28206
17200d72614K13012K59648J90229k0243j2560r941j73699O3293j49994l8905K09105
17189E7331L0061J51145K8653O9728L5696j30208k85653J09012o7533p2852k40653
17178c15273K73121M3583J70574p5935j57385k47428l25344o4270J39795K73160
17168b85402J52708J01994K49580k2954k57285k65666p0133Q6885l4554M4837
17158b99990J30371o9839J22203J00728n8651J61514J11241O0176o3914M8139
17148B41978j10945k28979k4271K48894K26956r5521l75293l2363J96182K38808
$$ plain form
17220 -38424 368939 547289 120112 -1293 -303856 -377825 -308452 -70298 138693 -122899
17210 -122899 -398152 -480862 -303584 -6678 -83075 -311844 -330580 -384340 -600820 -472614
17200 -472614 -259602 46 190275 170032 157472 147531 -26168 37125 -112869 -151774 57331
17189 57331 87392 238537 267190 336918 372614 242406 -43247 65765 -1768 -74620 -315273
17178 -315273 -42152 1431 172005 96070 -61315 -308743 -634087 -698357 -558562 -285402
17168 -285402 -132694 -30700 218880 195926 -61359 -327025 -397158 -310273 -344827 -299990
17158 -299990 -169619 -239458 -117255 -16527 -75178 86336 197577 257753 193839 241978
17148 241978 131033 -97946 -122217 126677 353633 258112 -117181 -149544 46638 285446
17138B85446j18377j13066j10104l77067j21382k18838Q3960J05026l02584J42126
17128g44860O2745L62763J34134p5060K86261J08783p2163J01378n2755k64550
17118a53324o0885M2509j48320J48621J06901k1690M5606M3248l7650j76283q1141
17107b92408J40595K08129o0453L5819R303J50231k29546j53244J49138J29071
17097H6635l4194J23198k56836j33326J86847j1508p4241P2310K67055M1888j97147
17086G0681j01579J91232n681J1872J28133j2079j92881M147k60158j32709J2744
17075b86278j29816l01965J68114M90215R9532j99840k6391L04473p0982m98190
17065d51128j17928K17183K40682p340J5264j46537k1363J66726K17207m5637
$$ plain form
17138 285446 167069 54003 -56101 -433168 -554550 -773388 -689428 -584402 -886986 -744860
17128 -744860 -682115 -319352 -185218 -260278 25983 134766 62603 163981 111226 -153324
17118 -153324 -214209 -171700 -320020 -171399 -64498 -86188 -40582 2666 -34984 -211267 -292408
17107 -292408 -151813 56316 -4137 31682 40985 191216 -38330 -191574 -42436 86635
17097 86635 52441 175639 -81197 -214523 -27676 -39184 -113425 -41115 225940 267828 70681
17086 70681 -30898 160334 154653 166525 294658 282579 89698 93845 -166313 -299022 -286278
17075 -286278 -416094 -718059 -549945 -59730 39802 -160038 -186429 118044 47062 -451128
17065 -451128 -569056 -351873 -111191 -118531 -103267 -249804 -271167 -104441 112766 67129
17055F7129k28223l3233q0107k2458k53270L26047L66966k20921M1805M4402Q2796
17044I0933M1403k11713q5222m3083J0147m5567j57392P4225k0282m2412L30165
17033e8798L14560n4234k60370n8684J30722j6577j20303r6061J05464n8331K11498
17022C8886q533N4847k7081n28283j7987J32546p0996l6939j79001q4383R7653
17011f29271L74923K92398K34934q9993J6716j7705K2687l06673M8393m876j93068
17000b51535j54597j01063J03911J05973l6615k57334k2395O0464Q2736M3987
16990d26468K9876j47548j97193J76187N81053K26058j18381O5521k62763q6792
16980a60450p0896J28104O3928k07142k1568j48323j4081K6948m5554J92076K80049
$$ plain form
17055 67129 -161094 -194327 -274434 -296892 -550162 -224115 142851 -78070 -36265 8137 90933
17044 90933 132336 -79377 -164599 -207682 -197535 -243102 -400494 -326269 -346551 -388963 -58798
17033 -58798 255762 201528 -58842 -117526 13196 -3381 -123684 -219745 -114281 -172612 38886
17022 38886 30353 85200 58119 -470164 -488151 -355605 -426601 -463540 -642541 -726924 -629271
17011 -629271 -254348 38050 272984 182991 199707 182002 204689 -101984 -53591 -58467 -251535
17000 -251535 -406132 -507195 -403284 -297311 -333926 -591260 -613655 -553191 -470455 -426468
16990 -426468 -396592 -544140 -741333 -565146 15907 241965 123584 189105 -73658 -160450
16980 -160450 -231346 -103242 -39314 -246456 -268024 -416347 -430428 -403480 -449034 -256958 23091
16969B3091j931J09851K992R1136r5535J297K8999L5423O5249k62427j33821N7201
16957g8475j17982l42319O9700L13896J42783l1304k87280J28393L08857n0221
16947E6048J7623P2774q2547j09889k1714j56882j93066p7250j11761K25613M03362
16936B2311J08327K3472l2726j19399k13665j37731Q6145J80667K20649j03102
16926C4948j63918j98771j5021K05959J95816j97224k19138J08041K10405K36138
16916A97235O8033l2117P8111K4372j05773l25130j0168J1755K47603J00490p4139
16905A80272k35222J71550J53965M5441j0700p7638k15667k46460r2448k3400
16895c50307L36754J02111j58555K28405J07960N272p2467j68382l10615k06102
$$ plain form
16969 23091 21160 131011 134003 225139 129604 130901 159900 195323 260572 -1855 -135676 -78475
16957 -78475 -196457 -538776 -469076 -155180 -12397 -43701 -330981 -202588 106269 56048
16947 56048 73671 146445 63898 -45991 -67705 -224587 -417653 -494903 -606664 -381051 22311
16936 22311 130638 154110 121384 1985 -211680 -349411 -263266 -82599 138050 34948
16926 34948 -128970 -327741 -342762 -136803 59013 -138211 -357349 -249308 -38903 197235
16916 197235 265268 233151 311262 335634 229861 -95269 -105437 -93682 153921 254411 180272
16905 180272 -54950 116600 270565 316006 305306 227668 12001 -234459 -326907 -350307
16895 -350307 -13553 88558 -69997 158408 266368 271640 199173 30791 -279824 -485926
16885d85926k18216J0996K24359J93510O832M0164j85955J78696O8212o6405K63603
16874B9870J36765q6584j58980n3688j65853j98183L4020K00010M6409r6437j42624
16863d55275O9407J82594Q2194r8971K94922J05812n529Q723j46286j76089j35141
16852b73639m3279J08116K7318J58108L5219M2358j86674j8610L97139O5091j79630
16841A31517k18494m4807j42543J85712L24781J58841j92353k56802k29833o832
16831b90813L43419J06385K15515o2985M514J4061k6646o5111N8008m24631l31055
16820d59339M1682K38753K671N6741m8742m9472R8629n0225J63618K00421k12267
16809a7530j48374l8736J42775J18641Q6519k72420J32142J28927j99338o0390
$$ plain form
16885 -485926 -704142 -693146 -468787 -275277 -268445 -228281 -414236 -235540 -167328 -233733 29870
16874 29870 166635 80051 -78929 -132617 -298470 -496653 -462633 -262623 -216214 -312651 -455275
16863 -455275 -385868 -203274 -121080 -220051 74871 180683 175154 183877 37591 -138498 -273639
16852 -273639 -316918 -208802 -181484 -23376 11843 54201 -132473 -151083 246056 311147 131517
16841 131517 -86977 -131784 -274327 -88615 236166 395007 202654 -54148 -283981 -290813
16831 -290813 52606 158991 374506 311521 316035 330096 303450 238339 296347 -128284 -459339
16820 -459339 -417657 -178904 -176233 -119492 -168234 -217706 -119077 -169302 -5684 194737 -17530
16809 -17530 -165904 -204640 -61865 56776 143295 -129125 3017 131944 -67394 -127784
16799a27784J61105J11449j87071j08287l9552J4456N933J275N9012j99606J3334
16788b95736o804j13657N6897M13226J96094j83725j43371j11203O1547m5346
16778a72078l586R4201o2583p5224r5853J49215J12907J78588K73q4018J33948
16767A75790K76023k28308j59570J02394J79534j70810l97415Q4173K08921k19255
16757a48523l637K64205J07419N7774l0403j94243n61p6822k00774K5311N4012
16746a46242N8162m9019J24580J06209j13137k5294J13361k14870J6244K80728
16736A50722r4189j21747m046j23031m1590k3110J66431o280J47173j13502k3793
16725h6962J59946l1405j28711k0997j26403j46025O2042K73273L15642J50815
$$ plain form
16799 -127784 33321 144770 -42301 -150588 -190140 -175684 -169751 -168476 -109464 -309070 -295736
16788 -295736 -302540 -416197 -359300 53926 250020 66295 -77076 -188279 -126732 -172078
16778 -172078 -175664 -81463 -144046 -219270 -315123 -165908 -53001 125587 125860 41842 175790
16767 175790 451813 223505 63935 166329 345863 175053 -222362 -138189 70732 -148523
16757 -148523 -152160 112045 219464 277238 246835 52592 52031 -24791 -225565 -200254 -146242
16746 -146242 -88080 -137099 -12519 93690 -19447 -44741 68620 -146250 -130006 150722
16736 150722 56533 -65214 -69260 -192291 -233881 -256991 -90560 -96840 50333 -63169 -86962
16725 -86962 72984 41579 -87132 -108129 -234532 -380557 -318515 -45242 270400 421215
16715D21215p2792k04134N9549k04396j01773j20k8654q6837K6145J32600k1809
16704h1006o3618j78481l7252J87740L29196J49388J83939J9726R0781k79923
16694C20490q7752o0688r9268j31540j12428J26993J69391k88458p5j04735J16551
16683a51519J26405M22769R3978l67697m20113J36083Q474K9500K3872K0030J28112
16672D9894K32212o2412k95450m5464j84816n7673l8453P3677J51609K32417q5670
16661c0129p5799K24513l1264j52660q9450K8680l5692J65049Q2047o5772l61780
16650c42257Q1094o3230j52779M9179Q7150K26005K42856J49691l7120k63109
16640b2520j84421J55535Q4138k4349K5650Q2201R1140j86939q6270k57985m6678
$$ plain form
16715 421215 348423 144289 203838 -558 -102331 -102451 -131105 -217942 -191797 -59197 -81006
16704 -81006 -144624 -323105 -360357 -172617 156579 305967 489906 509632 600413 320490
16694 320490 232738 172050 72782 -58758 -171186 -44193 125198 -163260 -163335 -268070 -151519
16683 -151519 -25114 397655 491633 123936 -296177 -160094 -151620 -122120 -98248 -78218 49894
16672 49894 282106 219694 -75756 -121220 -306036 -363709 -402162 -328485 -176876 55541 -30129
16661 -30129 -105928 118585 87321 -65339 -154789 -126109 -161801 3248 85295 19523 -342257
16650 -342257 -261163 -324393 -477172 -427993 -340843 -114838 128018 277709 240589 -22520
16640 -22520 -206941 -51406 32732 8383 34033 116234 207374 20435 -65835 -323820 -370498
16629c70498K84145J6997o3432k12745q8776L16376O3066l80420j84039K93157
16619c26169L37253J44186J22095j9751j61271k95274l4606L51339j9407l57205
16609b58810L7335j09067J41859J51755J91513N9531R422k44208l35776j54620
16599e11066j13517M23879K0729K94743l0597q898r5285j42936l5162J5757J1820
16588a70533q8823j27895k42756j62335R0101K04948j03634K03644q4013m5594
16578e26890n7769n3267M5649P4208J57379K45223J01493J357o139r4249L9763
16567g3242r8775K1601O9828n0549R1184k20842M2324J85168j11824k04872K44838
16556a05161j44444n2776j75426J43969J46338J0074K16835L73799q9046j70390
$$ plain form
16629 -370498 -86353 -69356 -132788 -345533 -434309 -117933 -54867 -435287 -619326 -326169
16619 -326169 11084 155270 277365 257614 96343 -198931 -233537 117802 98395 -258810
16609 -258810 -221475 -330542 -188683 -36928 154585 214116 223538 -20670 -356446 -511066
16599 -511066 -624583 -200704 -179975 114768 84171 75273 -20012 -162948 -198110 -182353 -170533
16588 -170533 -259356 -387251 -630007 -792342 -702241 -497293 -600927 -397283 -481296 -526890
16578 -526890 -584659 -637926 -592277 -518069 -360690 -115467 -13974 -12617 -18756 -113005 -73242
16567 -73242 -172017 -150416 -80588 -131137 -39953 -260795 -218471 -33303 -145127 -349999 -105161
16556 -105161 -249605 -302381 -477807 -333838 -187500 -177426 39409 413208 324162 153772
16546A53772N8598l40186k77902K41720K70614p6588j94275j50144j90892J66228
16536c39055K29066J60160Q1131K2339o0198j94571j40724J23611j95399O4815
16526b48825O8876Q1235J91307K43814K13166j15429l79964j90936M6440K80113
16516A89797M6136j96342j89870n2850L17131n5621k1674j03127j54561K15437
16506e544j517p8972K17140O808K07662k9635k78207n56196j79442K19751K67235
16495b10917J38238j35784O4069K25003K21964j74201k09393j11295j72189j1052
16485c75557K67024L30442N8273O3593M2922l25289K7808o299k27879j7625L16183
16474A53596P734k7082J51080J06930j70539M3806P1332k08867j86494j77412
$$ plain form
16546 153772 212370 -127816 -405718 -163998 106616 30028 -164247 -314391 -505283 -339055
16536 -339055 -109989 50171 131302 153641 93443 -101128 -241852 -118241 -313640 -248825
16526 -248825 -179949 -98714 92593 336407 549573 434144 54180 -136756 -90316 189797
16516 189797 235933 39591 -150279 -203129 114002 58381 36707 -66420 -220981 -5544
16506 -5544 -7061 -86033 131107 137915 345577 315942 37735 -518461 -697903 -478152 -210917
16495 -210917 -72679 -208463 -144394 80609 302573 128372 -81021 -192316 -364505 -375557
16485 -375557 -108533 221909 280182 343775 386697 61408 89216 82917 -144962 -162587 153596
16474 153596 161330 134248 285328 392258 221719 265525 336857 127990 -58504 -235916
16464b35916J16770m7654Q6991L7527j40830J63547N2417m04773J49253K02551
16454b0117j60375k3733l0499j15959j5682J35794N3693q4644J87118J31373J6201
16443G3170P9601m6784J57959P4323n8070k80627j87139R2384R3283k45726K66053
16432A8427M52054K1922k52863j25633r3510M837Q5693k4896K5555J47889l83767
16421a24292l12704n8402P0194o6487J2144N916N06575J09136n5033J27347j45135
16410F9259m8082K31546K20457j64015k10507n9397l7935l1779K2494J3961k11788
16399b05786o9407j0564K21156L00214m8428k7307N2012O1817j08174K6450k684
16388A89299o2559j3275j88065j13493p2604J27844n9794J4395J50165K01566
$$ plain form
16464 -235916 -119146 -166800 -79809 -42282 -183112 -19565 32852 -371921 -222668 -20117
16454 -20117 -180492 -204225 -234724 -350683 -366365 -230571 -176878 -261522 -74404 56969 73170
16443 73170 152771 105987 263946 338269 280199 -428 -187567 -95183 -1900 -247626 18427
16432 18427 470481 492403 239540 113907 20397 25234 110927 86031 111586 259475 -124292
16421 -124292 -436996 -495398 -425204 -491691 -479547 -473631 32944 142080 87047 214394 69259
16410 69259 21177 252723 473180 309165 98658 39261 1326 -30453 -7959 6002 -205786
16399 -205786 -275193 -285757 -64601 235613 187185 159878 211890 273707 165533 191983 189299
16388 189299 126740 113465 -74600 -188093 -260697 -132853 -192647 -178252 -28087 173479
16378A73479j79414m09085L8929J78136J27594J00422j690R9690L72884l8016
16368D62929k56495L4075O514L5119j35133r0689K7514K10777k0078j79185n0534
16357D4814j63962O0506J43275J2630k44170L31823J61929k26106n5271R3222
16347A58690o3111j32440R4755P5330M4902Q5559k11312L137L0608j51937l386
16336f9205k62123k36837j9209N389n2846R9481O6047K19301J70168P84M9321
16325b9729K52390L4245p7642l56149K1076j54605q9514K73587M9548j85415j96795
16314d59003K15087J62674o1810K01690J13585M9570J31605j52647j36062k21948
16304a57259L7532J8267K0497K01865k3366J33507P7427R5864j04838P3537L34320
$$ plain form
16378 173479 -5935 -415020 -376091 -197955 -70361 30061 28371 128061 500945 462929
16368 462929 206434 240509 247023 282142 147009 56320 83834 294611 274533 95348 44814
16357 44814 -119148 -58642 84633 97263 -146907 184916 346845 120739 65468 158690
16347 158690 95579 -36861 57894 133224 178126 263685 52373 55510 86118 -65819 -69205
16336 -69205 -331328 -568165 -587374 -581985 -634831 -535350 -469303 -250002 -79834 -79050 -29729
16325 -29729 222661 256906 179264 -176885 -155809 -310414 -399928 -126341 -76793 -262208 -459003
16314 -459003 -243916 -81242 -143052 58638 172223 221793 353398 200751 64689 -157259
16304 -157259 -119727 -101460 -80963 120902 97536 231043 308470 404334 299496 373033 707353
16293G07353p1027m16154P6708K5912p3959k80192o9928J32699k0978j40829m8339
16282a78734j13635P9145m7846Q0328Q1246K40522J35018r8734l75492j85735
16272c83917L02789M6644k08970j24144P1786R6892n0125M9104J54895L4067L25008
16261C14029J28711j75226K4950m6051J4182j1700k08202J98646j28098L5991
16251A47232K02058k85686j56870m01834j7666j3431m51918P1215M48655L09204
16241a49041n8746N5977n1541m6725Q2627J1336j31081J63534J29226k56728J67068
16230h4094J67011k50093l1075j05506L7832k11354J65133R4767M3327J76438
16220B386R3210k0701j41869j36737m2885j3245k49858J16942k1897K3378k8436
$$ plain form
16293 707353 636326 220172 296880 322792 248833 -31359 -101287 31412 10434 -130395 -178734
16282 -178734 -292369 -213224 -261070 -180742 -99496 141026 276044 177310 -198182 -383917
16272 -383917 -81128 -34484 -243454 -367598 -295812 -198920 -249045 -199941 -45046 -10979 314029
16261 314029 442740 267514 292464 246413 260595 248895 40693 239339 111241 147232
16251 147232 349290 63604 -93266 -495100 -512766 -526197 -978115 -906900 -458245 -149041
16241 -149041 -207787 -151810 -203351 -250076 -167449 -156113 -287194 -123660 5566 -251162 -84094
16230 -84094 82917 -167176 -198251 -303757 -265925 -477279 -312146 -217379 -174052 2386
16220 2386 95596 74895 -66974 -203711 -246596 -259841 -509699 -392757 -414654 -391276 -419712
16209d19712J518O0980K22130R8777L6073P1821p200J31412J05422k2627j26333
16198A52261L932O4295l12307J5204J70535L989r5456J6628J3524P1795L18655
16187D23055J77580k26581K6023L4307j27100j13794k04730q7748m7707j735j1229
16176a59659j10769q7555J5125K37681J62254Q3468K1620k82913j18064R0545
16166a48267J91957J13523j55298p0637M0698j59512j73957K00043j68155o9256
16156c98861L02573l1296j24790j14797j20951P9060O2859J4690j99223O5789
16146d64947J52498j64066J57003J88105L378Q8450j40997K33912K13690J86756
16136D53782q6028q3327l8653j28623m36448J7501j78K39316J79484K3352j9919
$$ plain form
16209 -419712 -418194 -357214 -135084 -36307 -234 71587 64387 195799 301221 278594 152261
16198 152261 156193 220488 -91819 -76615 93920 97909 2453 19081 32605 104400 423055
16187 423055 600635 374054 400077 434384 307284 193490 -11240 -98988 -146695 -148430 -159659
16176 -159659 -270428 -357983 -342858 -105177 57077 140545 162165 -120748 -238812 -148267
16166 -148267 43690 157213 1915 -68722 -28024 -187536 -361493 -161450 -329605 -398861
16156 -398861 -96288 -127584 -252374 -367171 -488122 -409062 -346203 -331513 -530736 -464947
16146 -464947 -312449 -476515 -319512 -131407 -128029 -39579 -180576 53336 267026 453782
16136 453782 367754 284427 245774 117151 -319297 -301796 -301974 -62658 116826 140178 120259
16125A20259M7438j59832R813j4442N185k55389L83950N78674n2032l59318j90151
16114A14155n4222k69992J97613L22086J87829r2685j46960j98130j22110K7829
16104c4587m39494M9691J00521q7467J82327K21167K69512J2984j55524l59051
16094b39921p1148R2980k415k2696L74524L95436N3192r9835p9500l92475j10233
16083a02091J05380K57985O6579j57538J09895J99032k33042j95043M5541K80444
16073C77142l9439n6409q4429N6519m19867k51927j52705J16728L63306j7798
16063a08879j1251P2300j68085k00995K66174j14361J45322l3315j42022q1085
16053c76197J01484K17k29162p2074K29391K39514L49269M6280L0052j48285j6864
$$ plain form
16125 120259 167697 7865 17678 3236 8421 -246968 136982 715656 663624 304306 114155
16114 114155 59933 -210059 -12446 309640 497469 404784 257824 59694 -62416 -34587
16104 -34587 -474081 -424390 -323869 -411336 -229009 -7842 261670 274654 119130 -239921
16094 -239921 -311069 -218089 -220504 -243200 131324 526760 579952 480117 400617 8142 -102091
16083 -102091 3289 261274 327853 170315 280210 479242 246200 51157 96698 377142
16073 377142 337703 281294 196865 253384 -166483 -418410 -571115 -454387 -91081 -108879
16063 -108879 -120130 -47830 -215915 -416910 -150736 -265097 -119775 -153090 -295112 -376197
16053 -376197 -274713 -274496 -503658 -575732 -346341 -106827 242442 288722 318774 170489 153625
16042A53625O2972R6423J51942J25796j34212k13514j90373j57399j09481K28039
16032A3818J30636o5834q1223P9960k43698J615L88346L68566N479l85576k7611
16021A84478J25461k71834k46760k37460R7519k74724m145L99801L05511J0011
16011H7858q7318J63102K10394r1930j26793O8848J85627j70883Q0595K5781N2386
16000C97667l679N0164q4588l55190j69743J26685j02640O1213J51209J94910
15990B66008n1949J0330j31307p3191K8896J1667n3275j85644k6725k30950J14185
15979c21955L76066J10405r7785p8365k16358j08615L38315J38010J15631m9345
15969B06004j60437l3731j23769n0917j02780J12180J53203N034k49244J16273
$$ plain form
16042 153625 216597 313020 464962 590758 456546 243032 52659 -104740 -214221 13818
16032 13818 144454 78620 -2603 77357 -166341 -164726 223620 592186 597665 212089 184478
16021 184478 309939 38105 -208655 -446115 -348596 -623320 -627465 -227664 77847 87858
16011 87858 540 163642 374036 282106 155313 224161 409788 238905 319500 345281 397667
16000 397667 393988 444152 359564 4374 -165369 -38684 -141324 -80111 71098 266008
15990 266008 214059 224389 93082 19891 48787 60454 7179 -178465 -205190 -436140 -321955
15979 -321955 54111 164516 66731 -11634 -227992 -336607 1708 139718 255349 206004
15969 206004 45567 11836 -111933 -162850 -265630 -153450 -247 4787 -244457 -128184
15959a28184J88162j44588j35619K76852O208J11942j22037p7802l7667K4972
15949c7761o9896l36627J03185J4510j25960J06802K1948m609o1330J95700P0043
15938a23995J99907Q1249o7069K1881J66276k606k84032o2063k58833j00716L37528
15927i2473J21776L9373K18485K57714k6828k48483l41085k04882j29517k6259
15917d32179K07929J35442j25553p4514k2P5565k6471r5115o2001N4388q9998
15906d32529R5051K21027K51252K51790j52812l3331k44687m9772j754o5697L3350
15895a28112J85853j72547m3534N4853k3488n9723K06196P1008r5502K2097j11279
15884i4178r3832L41033K79255o7056l63987k83415o2288m7649L0322j20956l89243
$$ plain form
15959 -128184 59978 -84610 -220229 56623 62831 174773 52736 -25066 -62733 -37761
15949 -37761 -107657 -444284 -341099 -326589 -452549 -345747 -323799 -328408 -389738 -194038 -123995
15938 -123995 75912 157161 90092 111973 278249 275643 -8389 -70452 -329285 -430001 -92473
15927 -92473 29303 68676 287161 544875 518047 269564 -71521 -276403 -405920 -432179
15917 -432179 -224250 -88808 -214361 -288875 -288897 -213332 -239803 -334918 -396919 -342531 -432529
15906 -432529 -337478 -116451 134801 386591 233779 200448 -44239 -94011 -95765 -161462 -128112
15895 -128112 57741 -114806 -158340 -103487 -126975 -186698 19498 90506 -4996 17101 -94178
15884 -94178 -188010 153023 432278 365222 1235 -282180 -344468 -392117 -361795 -482751 -871994
15873h71994J26834M51075L89742k84987k39462r8355p549J12248J77491j3392
15863b58349p1877J12043O2134M2502L3986Q9124K55113N217J49083j57884r1020
15852A70072O160o6806N2542K49358k1754k21465k12065p1087J8729j79069J46695
15841a28690K80709j06420k70127n297J34914K20248K0763j83810M09098J02748
15831D74136l85987k44795J66590p6912P3545J70270o4054J95611N4838k35980
15821A27262l33231j05086j3619n2969J00349L33204L08482J34105j13066j54292
15811B31139M2518j95139q026j15119n806M4246J29774j05913p339p049o0081
15800e6795J19675P1156R3894R7873R1530k87257l5776L9126n8411k3634k1605
$$ plain form
15873 -871994 -745160 -294085 95657 -189330 -428792 -527147 -534696 -422448 -244957 -258349
15863 -258349 -330226 -218183 -156049 -113547 -79561 9563 264676 269893 418976 261092 170072
15852 170072 176232 109426 161968 411326 389572 168107 -43958 -115045 -96316 -275385 -128690
15841 -128690 152019 45599 -224528 -229825 -94911 125337 146100 -37710 371388 474136
15831 474136 88149 -156646 9944 -66968 6577 176847 112793 308404 363242 127262
15821 127262 -205969 -311055 -324674 -377643 -277294 55910 364392 498497 385431 231139
15811 231139 273657 78518 70492 -44627 -50433 -6187 123587 17674 10335 3286 -56795
15800 -56795 62880 134036 227930 325803 417333 130076 94300 133426 75015 51381 29776
15789B9776o2747L20964M68078O7043j50001p0925P057l07166j50742j74802l9709
15778f3174p2541p2602J91360J21583M1308J85648P0329o5265j67892J63534m8968
15767B83320j04667L8074n1995p7778l8306l92886J95836J83121j22876k75053
15757c63210j81652L31608m4937l911P5073J71368J76387K84766k83234l42085
15747a79827K9067J59610j47174J44798j37782l8318J89541j74259j19442K04248
15737f9538N7806P8m5767J34276J77222o6453l20841q7220O2171J01020J30978
15726G3732q3388j24657P8620J2789L9496j10267m2045K02274l7389J62603K0770
15715A92538j43949P3883l9636k99779P1645l0450M9339j14693j70415O3441J35113
$$ plain form
15789 29776 -32971 287993 756071 823114 673113 602188 609245 302079 151337 -23465 -63174
15778 -63174 -135715 -208317 -16957 104626 145934 331582 401911 336646 168754 332288 283320
15767 283320 178653 216727 164732 86954 48648 -344238 -148402 34719 -88157 -363210
15757 -363210 -544862 -213254 -258191 -262102 -187029 -15661 160726 445492 162258 -179827
15747 -179827 -150760 8850 -138324 6474 -131308 -169626 19915 -154344 -273786 -69538
15737 -69538 -11732 -11654 -57421 76855 254077 187624 -133217 -220437 -158266 -57246 73732
15726 73732 -9656 -134313 -55693 -42904 -3408 -113675 -155720 46554 9165 171768 192538
15715 192538 48589 122472 82836 -216943 -145298 -175748 -126409 -241102 -411517 -348076 -212963
15704b12963J61626J28965O2960j51947O2257M05123J29713j13170l31571m2347
15694I8646j4555j7876J08246k09860j32244P7743j11224L4424J15810k8330p7408
15683a56628j04004K7492J76941K29342N3371k46600j0080J49850J253n7891l38273
15672b75227j62921J63601K45523K59035k895o3445j70150j6053j9333j44342
15662a86207J15710j71779j93488R6460r175M5255j69460K13228M8882j0988l21524
15651e43086q3852K73648L61610K82376r8890J793R4407o7203M4121r4788q7921
15640H2215k2567n7991J41893K6103j4310r6046l8020Q2948J12135p6199j27297
15629A2864j36152l6028J28331J03732l92854l50907k2217P687N02368K78169
$$ plain form
15704 -212963 -51337 77628 140588 -11359 50898 456021 585734 472564 140993 98646
15694 98646 84091 66215 174461 -35399 -167643 -89900 -201124 -166700 -50890 -79220 -156628
15683 -156628 -260632 -233140 -56199 173143 226514 -20086 -30166 119684 120937 63046 -275227
15672 -275227 -438148 -274547 -29024 230011 227116 163671 -6479 -22532 -41865 -186207
15662 -186207 -70497 -242276 -435764 -339304 -348479 -303224 -472684 -259456 -210574 -221562 -543086
15651 -543086 -626938 -353290 8320 290696 191806 193599 288006 220803 264924 170136 82215
15640 82215 59648 1657 143550 169653 155343 59297 21277 104225 216360 140161 12864
15629 12864 -123288 -159316 -30985 72747 -320107 -671014 -693231 -685544 -183176 94993
15619I4993J74142j0864m33582J2327J84196L4202N4478J16514M521j28163p5191
15608B7573n2890J27618J63520J96743p3620k18232j14977J9902R9315j96400
15598b1448m7527P7371j14968Q4516K34433J7347k2569k1284M8718k64844l9080
15587f9335J98011R0001j94498m1111L55485J65512l27130K13336K72132k43583
15577D18820j80273k49088n9016o854J24602r7960j05692K01126n4980j07522
15567a16837K0912O1867N3027K2262j71598J15636K7391N1169j19343n0225K1259
15556h4480K62238Q3510J41122j15652j01776q9336K58525j99347j9618K25329
15546C60515R4979o6410m7346O0497o4152r5586j24700j49016R1692j13188n0358
$$ plain form
15619 94993 269135 258271 -175311 -162984 21212 55414 109892 226406 230927 102764 27573
15608 27573 -25317 102301 265821 462564 388944 170712 55735 75637 174952 -21448
15598 -21448 -68975 8396 -106572 -22056 212377 229724 207155 185871 234589 -30255 -69335
15587 -69335 128676 218677 24179 -16932 338553 504065 176935 390271 662403 418820
15577 418820 238547 -10541 -69557 -76411 48191 -49769 -155461 45665 -9315 -116837
15567 -116837 -95925 -34058 18969 41231 -130367 -14731 12660 63829 -55514 -105739 -84480
15556 -84480 177758 261268 402390 286738 184962 95626 354151 154804 135186 360515
15546 360515 455494 389084 341738 402235 338083 242497 117797 -31219 60473 -52715 -103073
15535a03073K28145L8167J34792J6340j10068M6825J60785k93780k75186J62518
15525E465J13467L9850O6394K44658p4771l09981n1983R268K85444j01279j01669
15514A24863o1844j01986n9023J3858M6400K61383J43641J5410j06819O693J12750
15503C95326k3832L6195j93508j76397K57998J8592k2789o4697j14089j3816j59213
15492f0230J23684J23443q0618P0603J27870l8174j19699k64297N8220K3849K85878
15481B50529L11862k39698J10894N2301M4078k84856k64065J37488k01209k57993
15471c40669l2951O0270J07907j9121P521M3814r5705p5309O3753N5795N358L8920
15459a80417N3038R4597J21396r5883p3240K5874L5638J40392L04520j06153l79545
$$ plain form
15535 -103073 125072 163239 298031 314371 204303 251128 411913 118133 -157053 5465
15525 5465 118932 158782 225176 469834 395063 85082 33099 42367 327811 226532 124863
15514 124863 63019 -38967 -97990 -84132 -37732 223651 367292 382702 275883 282576 395326
15503 395326 371494 407689 214181 37784 295782 314374 291585 226888 112799 98983 -60230
15492 -60230 63454 186897 106279 176882 304752 266578 146879 -117418 -59198 -35349 250529
15481 250529 562391 322693 433587 485888 529966 245110 -18955 118533 -82676 -340669
15471 -340669 -373620 -313350 -205443 -224564 -217043 -173229 -268934 -344243 -280490 -224695 -219337 -180417
15459 -180417 -127379 -32782 88614 -7269 -80509 -54635 -18997 121395 425915 319762 -59783
15448e9783q23j30839j76166J2690R4297O0109J07670k66664k59867J23263L31240
15437a64873J71419j86752k42179p5515j2319J56096J00284P0568j10844N9476
15427b34639J50041K30638l29303k46103k45980P7110m7998K61670L84861K53258
15417B53555J202k01887j67405j67983L25606l7153L35J36299J68224k35492K15443
15406B90744M3546q678j12264m01078J43336K35024n2795j12993K10124j2819
15396B22147j81174R5699L3055L7904j37455Q9118j37530J8322K18974K3414k34751
15385D7723j51191j65660l9546K95103K86326q7527j80288M2271K6114j28522
15375e5197J06453J94805R9645j47719j40855K9750j51183p0501Q0928J30657
$$ plain form
15448 -59783 -60606 -191445 -367611 -354921 -260624 -200515 -92845 -359509 -619376 -496113 -164873
15437 -164873 6546 -180206 -422385 -497900 -510219 -354123 -253839 -183271 -294115 -234639
15427 -234639 -84598 146040 -183263 -429366 -675346 -598236 -646234 -384564 297 253555
15417 253555 254757 52870 -114535 -282518 43088 5935 6270 142569 310793 75301 290744
15406 290744 334290 325612 213348 -187730 -44394 190630 137835 24842 234966 222147
15396 222147 40973 136672 169727 207631 70176 159294 21764 40086 259060 282474 47723
15385 47723 -103468 -269128 -308674 -13571 272755 185228 4940 47211 73325 -55197
15375 -55197 51256 246061 345706 197987 57132 86882 -64301 -134802 -53874 76783
15365G6783R3092k9142J85539J21161j81232p9918M421j24454J11074l0782o5580
15354H0962M55189m3917k36191J78978J40231r426j71327l50050l5356K28234
15344B37327j3598j40846k95135K52728L44144J66531l47531r3054J3592J27268
15334B51426K13810k23371O4178j1933k65287o6741J584K9909J07375Q6219J67410
15323C54579J2718j75199j52780o5660L4670r5764l64138m3711J24496Q0364l1032
15312c21457k5122r624R4091J97743J01633L6561R0771j3900N593K2284J51686
15301C30259N753j35367k76884J18431K29242K12795J0223r7980J77525l4688
15291E39309M5508m8601j86866n01072J61635K97185K465K19335L9802j77763
$$ plain form
15365 76783 169875 140733 326272 447433 266201 186283 190704 66250 177324 146542 80962
15354 80962 536151 492234 256043 435021 575252 565826 394499 44449 9093 237327
15344 237327 223729 82883 -212252 40476 384620 551151 203620 110566 124158 251426
15334 251426 465236 241865 306043 294110 28823 -37918 -36334 -6425 100950 187169 354579
15323 354579 367297 192098 39318 -26342 8328 -87436 -451574 -495285 -370789 -290425 -321457
15312 -321457 -346579 -356203 -262112 -64369 37264 73825 164596 150696 156289 178573 330259
15301 330259 336012 200645 -76239 42192 271434 484229 494452 396472 573997 539309
15291 539309 584817 536216 349350 -151722 9913 307098 309563 528898 568700 390937
15281C90937j02998o7839m15557Q2486K63070k8855j08913J80272K95660j5680
15271D72583k41092r0849m9004k77433O0048K77064J01595k64447O8271J86519
15261B43255o7818r9669J89259p7543j33252j13769J44717L65984J27433O632
15251E85229N7246J58593n4376m14396j65871k24196K33143K18233n201p3732
15241C14672j02840J22797L04868K36367Q8713n3518j59095n53630l09530L65438
15231B54242K39767j19027j09959K824L4977j9519o5320j22385k14851j77652
15221b96903L35814K07703K42524q8762j68262J35160q5175k31313R686j33362
15211g2890q9678K4248J98872Q7680o2596p0580J06616j0824P8227J82860J84608
$$ plain form
15281 390937 287939 220100 -195457 -112971 150099 121244 12331 192603 488263 472583
15271 472583 231491 140642 91638 -185795 -125747 151317 252912 -11535 56736 243255
15261 243255 175437 75768 265027 187484 54232 -59537 85180 451164 578597 585229
15251 585229 642475 801068 746692 332296 166425 -57771 175372 393605 388404 314672
15241 314672 211832 334629 639497 875864 964577 911059 751964 198334 -111196 254242
15231 254242 494009 374982 265023 267847 302824 283305 217985 95600 -119251 -296903
15221 -296903 38911 246614 489138 400376 232114 367274 282099 50786 60472 -72890
15211 -72890 -162568 -138320 60552 148232 85636 15056 121672 110848 189075 371935 556543
15200E56543J98922j39552j44585m6044K0759J0188j52136k83533l1678R7589
15190H6473N9906P6812m1938j6129n0362p1077J01272r7905J04162k5959j04335
15179B0920L3018j46788j72317J03595J00324j21503K49085l27920m33682J60586
15169e34682M25254K93774R0059K7063l0645m0248j27790j18618K33739K20789
15159D38695n1418o2822J4006K48630J02512l44356k67025j16129J65129R7123
15149B24345Q3722m011j01383k35042R9906N2377l29464J77946M14685l874j83500
15138A95707n6856m5427k4532k231J21072J63571l75996k16447K18023K91422
15128B68306J40329k95376k4330r5879M8061J585j30617J08009K59464L3581j61901
$$ plain form
15200 556543 755465 615913 471328 425284 446043 456231 304095 20562 -11116 86473
15190 86473 146379 223191 181253 165124 114762 43685 144957 47052 151214 125255 20920
15179 20920 53938 -92850 -265167 -161572 -61248 -182751 66334 -261586 -695268 -534682
15169 -534682 -109428 184346 274405 301468 270823 230575 102785 -15833 217906 438695
15159 438695 387277 324455 338461 587091 689603 345247 78222 -37907 127222 224345
15149 224345 308067 304056 202673 -32369 67537 119914 -209550 -31604 383081 379207 195707
15138 195707 138851 93424 68892 66661 187733 351304 -24692 -241139 -23116 268306
15128 268306 408635 113259 88929 -6950 41111 42696 -87921 20088 279552 313133 151232
15117A51232J25012q2633j37316j94780J01611J48106o3597n666j55086K49688
15107A36571q8830l26011r8094K29650K67701J84837J21492R0460K26753q5830
15097F58699k68244j18442k29123n057J87425r550k35735k932k1691K2996O7354
15086D5700K95369M7820l80543k17219K96123J72045O6424N0926k17347M0845
15076B00143j12930j19572Q6576J81024j48839r3355J51282m7887j49629Q091
15066d5096k11247m7640O2550J48410J48413r4297O7336Q6483J6908j2620j11855
15055G345J18863J22640K19436r3332n45162j48327L1038m3481J80449M6971J02436
15044a124n3645j44156l4548K02613M21193j1665l36736J89050k4645j69128J46099
$$ plain form
15117 151232 276244 193611 56295 -138485 -36874 111232 47635 41969 -113117 136571
15107 136571 47741 -278270 -376364 -146714 120987 305824 427316 517776 744529 658699
15097 658699 390455 272013 42890 37833 225258 215708 -20027 -22959 -44650 -21654 45700
15086 45700 341069 388889 8346 -208873 87250 259295 325719 376645 159298 200143
15076 200143 87213 -32359 54217 235241 86402 -6953 144329 96442 -53187 -45096
15066 -45096 -256343 -303983 -241433 -93023 55390 -38907 28429 114912 131820 119200 7345
15055 7345 126208 248848 468284 374952 -170210 -318537 -287499 -330980 -150531 -103560 -1124
15044 -1124 -54769 -198925 -233473 -30860 390333 378668 41932 230982 206337 37209 183308
15033A83308J66484J1815r7616Q0675L4823k78587j01464q6263J48233J40640
15023B02048J57661q2125k77377n195M8903K06369j84467k52377k36544J62833
15013b60271K23389P7639k3953J42920J4850k52462R7602J2657L3964j54856J770
15002h6751N568p1623J68926J82903M40446J7893k56915m42128j71975J90808
14992b2848j37850R1381J8845N038J14091K73529J99366j1241j05128j46793j13606
14981A64784j11804o0963p3008m2882L65163N6935k56175o577m2135Q4828q1164
14970b998p2207l4175P8341Q2512K02984l06238o3498L70186P013m04664k61483
14959d04227L36294K38371j33191n7314k5672J07355o275k34518J51166L87391
$$ plain form
15033 183308 349792 361607 263991 344666 379489 100902 -562 -86825 61408 202048
15023 202048 359709 277584 207 -4988 43915 250284 65817 -186560 -423104 -260271
15013 -260271 -36882 40757 16804 159724 174574 -77888 19714 32371 66335 -88521 -86751
15002 -86751 -81183 -152806 16120 199023 639469 657362 400447 -41681 -213656 -22848
14992 -22848 -160698 -69317 -50472 -45434 68657 342186 541552 530311 425183 278390 164784
14981 164784 52980 -7983 -80991 -123873 241290 298225 42050 35473 -6662 78166 -2998
14970 -2998 -75205 -109380 -31039 51473 254457 -51781 -115279 254907 261920 -142744 -404227
14959 -404227 -67933 170438 37247 -20067 -45739 61616 55341 -179177 -28011 359380
14949C59380J36287p0370r7586j50089n9701P405J48027j17846O0000R6213J30475
14938D42195j63015n0493j72606k64305K06326J69628Q4680J95965k19495j56877
14928G2003j61137K97142J42297K0625K22933m80444r9181K08906K28277K7135
14918D78556k3181p2427j92755k95097m4752N0719K76009K46053j98856q0322
14908A43947N6607P7511P0024P2539J09133m658k06191k39866J4101K5262l4662
14897H3747Q2185N3549m3523R3387j5796j48112k58907j10294J44929K66062R4206
14886B41433J8745m681n5639n3883j0186J07694p7142j27268j69795K6967q3904
14875a87659M9396j9344J90166J32222r4102K68664j38219k75434J00400J6479
$$ plain form
14949 359380 495667 425297 327711 177622 117921 125326 273353 155507 215507 311720 442195
14938 442195 279180 228687 56081 -208224 -1898 167730 252410 448375 228880 72003
14928 72003 -89134 208008 350305 370930 593863 113419 14238 223144 451421 478556
14918 478556 455375 382948 190193 -104904 -149656 -98937 177072 423125 224269 143947
14908 143947 200554 278065 348089 420628 529761 525103 318912 79046 93147 118409 83747
14897 83747 165932 219481 175958 269345 253549 105437 -153470 -263764 -118835 147227 241433
14886 241433 260178 255497 199858 145975 135789 243483 166341 39073 -130722 -103755 -187659
14875 -187659 -138263 -157607 32559 164781 70679 339343 201124 -74310 26090 42569
14865D2569J15927L62179M2846j57616R6098M08J5138l5690k16851L048q1620
14854A86436j27088j29543L37622J50810K07489K48851j12889k54399o4698L4598
14844D77189j03906k69814J12292j45152r1567J10896j17903P6509K55193k10321
14834I3416l08427J92637L0589K94387K31180k2231j09749q3334k02683P9842
14824A95627O8007o4361j73245J6291K43684R3325r2752l33531j56047n4095L0175
14813b26922j6729j47932J29252L46165M01407J43623l11143Q2698J02815k68281
14803B34953R7240O6005n9415j89085K06530O9702N8119P3921r4049j98131j73927
14792I1863j57088l0902J26622K71030O4039j06898O2433n0793j5804J86144Q8444
$$ plain form
14865 42569 158496 520675 563521 405905 502003 502411 517549 481859 265008 268056 186436
14854 186436 59348 -70195 267427 418237 625726 874577 761688 507289 442591 477189
14844 477189 373283 103469 215761 70609 -20958 89938 -27965 48544 303737 93416
14834 93416 -215011 -22374 8215 302602 533782 511551 401802 318468 115785 195627
14824 195627 263634 199273 26028 42319 286003 379328 286576 -46955 -203002 -257097 -226922
14813 -226922 -243651 -391583 -262331 83834 485241 628864 317721 400419 503234 234953
14803 234953 332193 398198 338783 149698 356228 425930 484049 557970 463921 265790 91863
14792 91863 -65225 -96127 30495 301525 365564 258666 321099 270306 254502 440646 529090
14781E29090l06329k01874N9074k57057Q8808k5798q3759J56624J47614j17556
14771a1163q2358J64315J50545j86411j11742J5069O7990k30M5063R3154J36282
14760B80514o9828N0165k04684j01263R3334R9454o1622J40776O6487R686m8077
14749B54942J77149J84837r0089j65913k645K62344O5103k76420L5281K8558j44991
14738C28156q231J60830o2968p2949j03309j98345p1436J56009N2859l45467o6891
14727b31742J86205J13732j4565O918L205l1813K46208J66223O7910k28359j91096
14716I2826J57421K36420j6248j29880n024P1378n5323J33308J04723j33457J02200
14705E58344J02395k17091k58315n4315J07817P6731L0976m1921K30826J34865
$$ plain form
14781 529090 222761 20887 79961 -177096 -88288 -114086 -197845 -41221 106393 -11163
14771 -11163 -93521 70794 221339 34928 -76814 -61745 6245 6015 51078 144232 280514
14760 280514 210686 260851 56167 -45096 48238 147692 86070 226846 293333 303019 254942
14749 254942 432091 616928 526839 360926 358281 620625 685728 409308 444589 473147 328156
14738 328156 319925 480755 417787 344838 241529 43184 -28252 127757 180616 -164851 -231742
14727 -231742 -45537 68195 53630 60548 63753 31940 278148 444371 512281 283922 92826
14716 92826 250247 486667 470419 340539 335515 406893 351570 484878 589601 456144 558344
14705 558344 660739 443648 185333 131018 238835 315566 346542 304621 535447 670312
14695F70312p3713l42131j03930R689M6678k00841l3715R4812k23716J56267M8165
14684D7877M5815J10460J80130P2290k5756l31211M2151L5678N020K7814r7481
14673A12787Q9544l9032m8425k7972n4680m3617j41353M804J49564J17579j17901
14662A298K22615K3324k66224J86982M83197k11032j70097j21105l1062Q7083
14652B04979k43405l5070J99962K74363m847j6336L21393l79575j67718N1079
14642B04825J70910L6873l9106k089K17008j07221q1555q1395P9559K4539N6996
14631D79344j02356J69998l6505k53953P2749j03851p3348J94670J28265l8597
14621D36416o2803J30339j0613L5220j30103R0780J60802k7875J16937o5031k60874
$$ plain form
14695 670312 596599 254468 150538 160227 206905 6064 -27651 67161 -156555 -288 47877
14684 47877 93692 204152 384282 456572 430816 99605 141756 177434 182454 210268 112787
14673 112787 202331 163299 114874 86902 32222 -11395 -152748 -147944 1620 119199 1298
14662 1298 223913 247237 -18987 167995 651192 440160 270063 148958 117896 204979
14652 204979 -38426 -73496 126466 400829 395982 379646 701039 321464 153746 204825
14642 204825 375735 412608 373502 371413 588421 481200 399645 318250 397809 422348 479344
14631 479344 376988 546986 510481 256528 329277 225426 152078 346748 475013 436416
14621 436416 373613 503952 493339 528559 398456 489236 650038 622163 739100 674069 413195
14610D13195k03302P8599j7614J2457J75420j21894k85873k5141K61477M7537
14600C34861j87615P9224L5592R6666M56067k32491l14049p3615K00756k5829
14590C69567k63957o8031O8781M826N5957P1570L2769k37845l0596L8707N9482
14579A01230J32586N4931K10753j05785j99674j0798j69585k31033L59040J66665
14569C08330L23493Q6338j13290k43405l24482k18333J10067K27552J72097R1949
14559D20316k6112k41102O3750K26288N320K42855J86583k79366j45178j65939
14549B87415j76334K2434J18456L2596J35691L922m7727J52295l06547l41391
14539a19190j39179K84386J68097r6622k5797k22518j00074l0140j03356J04133
$$ plain form
14610 413195 209893 288492 270878 283335 458755 336861 50988 25847 287324 334861
14600 334861 147246 226470 262062 358728 814795 582304 268255 194640 395396 369567
14590 369567 105610 37579 106360 111186 167143 238713 271482 33637 3041 41748 101230
14579 101230 233816 288747 499500 393715 194041 183243 13658 -217375 141665 308330
14569 308330 631823 718161 604871 361466 36984 -181349 -71282 156270 328367 420316
14559 420316 394204 153102 216852 443140 448460 691315 877898 598532 453354 287415
14549 287415 111081 133515 251971 284567 420258 424180 376453 528748 222201 -119190
14539 -119190 -258369 26017 194114 97492 71695 -150823 -250897 -281037 -384393 -280260
14529b80260R686Q1976K21118j08835O6185J50627J53435l1049J98992j25480
14519C36395l86215J73814N24709k4257j33230l4305n4593L0948j1348j48953
14509B72965k90448o4544K45781J90576l7349P4801L00910K9810r8438O9636J28164
14498H21864j54328j69581q0233J63491J75577m45890k38462J18823J22002L1388
14488C44651K04198m6339j18972m3672M6683P7685j74967o241j0325J4134L6655
14477C23490j85768N0244K50378J41934O5625L0943j55651m9653M8835j01515
14467D18862j11745L659q5939k457j05769j41189R4815N1241k1004j92338K71282
14456A79418J09672j01639p3715J59118M27831L2355j47137j13133k04404j80065
$$ plain form
14529 -280260 -270574 -188598 32520 -76315 -10130 140497 293932 262883 461875 336395
14519 336395 -49820 123994 648703 624446 491216 456911 402318 433266 421918 272965
14509 272965 -17483 -82027 163754 354330 316981 391782 692692 722502 624064 693700 821864
14498 821864 667536 497955 417722 581213 756790 310900 72438 191261 313263 344651
14488 344651 548849 502510 383538 339866 386549 464234 289267 283026 272701 286835 323490
14477 323490 137722 187966 438344 580278 645903 676846 521195 471542 520377 418862
14467 418862 307117 310776 224837 222380 116611 -24578 70237 121478 100474 -91864 179418
14456 179418 289090 187451 113736 272854 700685 733040 585903 472770 268366 88301
14446H8301l18306K34735L44792K1224k0709o0131j76178j37589J99686N2745
14436B28570j44060j29782K19856L43554Q3481k94786k43935K3251R672P5241
14426A71062m7120M0058j3146J61251o6790j26595N2162j7543k37918J75394L925
14415I4740J80061K60914k9411k03028j40901J05359N7134m2834R8402j1449j18707
14404B50280k16692o443j06156J24752K01468L97235J11315l70014l06317J62263
14394B41691J98226J89867J07084k84329k17011k56174J01632K08469P7409R5894
14384D62758J73195j02536j98937K8905K4562k47150k07495J71375n2714o3394
14374a1431J95340o6998K06089J24253l71591j16923j1523J28651J87104Q5772
$$ plain form
14446 88301 -230005 4730 349522 370746 350037 289906 113728 -23861 175825 228570
14436 228570 84510 -45272 174584 518138 601619 306833 62898 86149 95821 171062
14426 171062 123942 164000 150854 312105 245315 118720 170882 153339 -84579 90815 94740
14415 94740 274801 535715 506304 303276 162375 267734 324868 282034 380436 368987 250280
14404 250280 33588 27145 -79011 45741 247209 644444 755759 385745 79428 241691
14394 241691 439917 629784 736868 452539 235528 -20646 80986 289455 366864 462758
14384 462758 635953 533417 334480 363385 387947 140797 -66698 104677 51963 -11431
14374 -11431 183909 116911 323000 447253 75662 -41261 -52784 75867 262971 348743
14364C48743J54437k4745P4468L8112j05261j09053p3888k8332R4114P8525J82494
14353F29614p4920R534m2027j06877M1083j72863n1240O5858M57641K42366j92200
14342H05969l05787j69174K47300Q6983p0274j25297M787M179J4345n7758r7105
14331C38168k0616j24402j91316O0946J4714j50206P0416K10301P8579L51100
14321F37684k7702l8998l4467j77547N0243J16067r9907j54997M8429P6701j08907
14310B86599m8115J28810j03118J66804J46490K69321J52572m03237j76078P0749
14300D90797R5015L45597l18966r8999J29005p561J03845j64548J88177L4906
14290G97268j93154j85741L557P282j15348K67465K73916j11434j12273L4213
$$ plain form
14364 348743 503180 478435 552903 591015 485754 376701 302813 274481 368595 447120 629614
14353 629614 554694 564228 522201 415324 456407 283544 232304 298162 755803 998169 805969
14342 805969 500182 331008 578308 665291 595017 469720 474507 478686 493031 435273 338168
14331 338168 317552 193150 1834 62780 77494 -72712 -2296 208005 286584 637684
14321 637684 609982 570984 536517 358970 409213 525280 425373 270376 318805 395506 286599
14310 286599 238484 367294 264176 430980 577470 846791 999363 596126 420048 490797
14300 490797 585812 931409 612443 513444 642449 634888 738733 574185 762362 797268
14290 797268 604114 418373 421930 429212 313864 581329 855245 743811 631538 665751
14280F65751l58l3802k0102Q1717j06364l69923n2607Q4636q6875J01162J02877
14269C66112k34530M5464M41847J96749k30683J37888o1263J77846o0768l82223
14259C96439k26551L16983L6009J04106K4940J76039J69564j23004K2581N3131
14249I50237k6926l20420m16148J30379Q9543j87923L53379M50782j91437j38263
14239F93203p1917j50000j88302J79346J08398j92462n4944j35803o4826l904
14229A18789J82318j85992j28300k05112O0638M30066K96578r137j34592P650
14219D32906q7822N1907q9352k10905K32605J44079J9322k12464O3653R5096M7500
14208D86525P7896K29627l11934l72232k71478j6458L56016J86025j19401J27454
$$ plain form
14280 665751 665393 631591 611489 693206 586842 216919 164312 248948 162073 263235 366112
14269 366112 131582 177046 618893 815642 584959 722847 661584 839430 778662 396439
14259 396439 169888 486871 522880 626986 651926 827965 997529 874525 897106 950237
14249 950237 923311 602891 186743 317122 406665 218742 572121 1022903 831466 693203
14239 693203 621286 471286 282984 462330 570728 378266 323322 187519 122693 118789
14229 118789 301107 115115 -13185 -218297 -157659 272407 568985 559848 425256 432906
14219 432906 345084 396991 307639 96734 329339 473418 492740 280276 343929 439025 486525
14208 486525 564421 794048 482114 109882 -161596 -178054 177962 363987 244586 372040
14198C72040K2940K7813P9886r5361o9834j08522k80871q8651K24197J47040J17950
14187C48627J05938J11527R1825K44009M8897J7061K55510j59521k80322j96751
14177E86800L9546m1135j4017k8596L845k39008K35K03150p3785r231K57822j82587
14165E03039J08876K92688j63847j89508m7124r7021J54695L58805K0289j77138
14155G63754N1982J14658j71054j18323j27958k35629L5789J25728l8046k71579
14145A29322L21607p3270o5935n0707J17140K64088R8641k22428l6228J40777
14135F23007J37595K20611k3297m44711O1175k1231m6653J91782p8676P873j44426
14124D83049k15701k2081j54944J93602J86789r6487p3499Q7239K88143K92955
$$ plain form
14198 372040 394980 422793 502679 407318 337484 228962 -51909 -140560 83637 230677 348627
14187 348627 454565 566092 657917 901926 950823 967884 1223394 1063873 783551 586800
14177 586800 626346 585211 571194 542598 546443 307435 307670 510820 437035 427804 685626 503039
14165 503039 611915 904603 740756 551248 504124 407103 561798 920603 940892 763754
14155 763754 815736 930394 759340 641017 513059 277430 313219 438947 400901 129322
14145 129322 450929 377659 311724 261017 378157 642245 740886 518458 482230 623007
14135 623007 760602 981213 957916 513205 574380 553149 506496 698278 619602 627475 483049
14124 483049 267348 245267 90323 283925 470714 374227 300728 387967 676110 969065
14114I69065m3003l04989q6075k6700p4329k15656J75873m3416K48008j4817j76813
14103D07148N0319J32519K0856J91761P1582j82944j23347n8037K35429J3247
14093G58533j32626N7261J9146p1587j58198k70071P0553O8504R706K74839l33938
14082B92122o125J07965p3259K4893l462J34381L54657J11565j99990Q7740k41192
14071E89295p2047N5660j18286j15640J46408j9532j26572K67607k2087k57079
14061C27727R1970L38463O0522q5476j31234j34090l19053K4764K96584N9706
14051E29883j0770j35051k4583k9187k18137o5391N9246K32310Q9116j2361J3799
14040D28874J86992K672O1541p4762K350P7762l2094O3702R098J43505K57637
$$ plain form
14114 969065 926062 621073 534998 508298 433969 218313 394186 350770 598778 583961 407148
14103 407148 457467 589986 610842 802603 874185 691241 567894 509857 745286 758533
14093 758533 625907 683168 702314 630727 472529 202458 273011 341515 351221 626060 292122
14082 292122 285997 393962 320703 345596 342134 476515 831172 942737 742747 830487 589295
14071 589295 517248 572908 454622 338982 485390 465858 339286 606893 584806 327727
14061 327727 419697 758160 818682 733206 601972 467882 148829 173593 470177 529883
14051 529883 519113 384062 359479 330292 112155 46764 106010 338320 427436 415075 428874
14040 428874 615866 618538 680079 605317 607667 685429 653335 717037 726135 869640 1127277
14029A127277k30306j52439J51593j15379j94876j6723p9170m2515M8264Q3315
14019E79041L0010L20766K58996K18942q8101m37908k37796r4678R9679l8073
14009F10878J3111j77097M8668j32427j79507O8613J75847k0043O3576R1775N5666
13998F19060O6803L54043L9877k74199l00299q2210K87044j14932j30068Q5474
13988E50593j32254Q33J01282k23329R1841q7763o7749M80902J94906J41567j6181
13977A034648m09896k115K39927j10746j02736k52765M7498K68898J86842k41811
13967F57744j82512N5595m2477K1305m1532o776K96747O8143J49082K7061o0105
13956I42275k53889j43566j7877k25981N1748L57017k50K3822k0816O911J92630
$$ plain form
14029 1127277 896971 744532 896125 780746 585870 569147 489977 447462 495726 579041
14019 579041 609051 929817 1188813 1407755 1319654 881746 643950 549272 648951 610878
14009 610878 623989 446892 495560 363133 183626 252239 428086 408043 471619 563394 619060
13998 619060 685863 1039906 1079783 805584 505285 423075 710119 595187 465119 550593
13988 550593 418339 419172 520454 297125 388966 301203 233454 714356 909262 1050829 1034648
13977 1034648 624752 622637 862564 751818 649082 396317 443815 712713 899555 657744
13967 657744 475232 530827 488350 509655 468123 461347 758094 826237 975319 1002380 942275
13956 942275 688386 544820 526943 300962 352710 709727 709477 733299 712483 719394 912024
13945I12024k12887k70623K24336k5127Q1056J69596J24852j62096j84480j64633
13935D92018j6261J28200J05865J59662j51910o9320K30138l70774r6576m0688
13925C70354J36702o3707k540o3124J10316l20844J44253J88333O6977J84558
13915G51278j48038o8409R7701l02282n3795q9785j5320J26619m0967R1983K86087
13904F35072J14011p3065r0346p972J26052K49067J44028l90506r4366p3148J9869
13893E58696P2114j1266m9467k22181j78649J34990K33387L0763k36453O9254
13883D01188J12289j91207L10153R5758j12349r6153P8529k6642k3921r4526j49060
13872C04059m4548K89975N5124N3622L0354M2640j25249j25046N5412K36288P1339
$$ plain form
13945 912024 699137 428514 652850 627723 708779 878375 1003227 841131 656651 492018
13935 492018 475757 603957 709822 869484 717574 648254 878392 507618 411042 370354
13925 370354 507056 443349 440809 377685 488001 167157 311410 499743 566720 751278
13915 751278 603240 534831 632532 330250 276455 186670 171350 297969 257002 348985 635072
13904 635072 749083 676018 585672 577700 703752 952819 1096847 706341 611975 538827 558696
13893 558696 630810 619544 570077 347896 169247 304237 537624 568387 331934 401188
13883 401188 513477 322270 632423 728181 615832 519679 598208 571566 547645 453119 304059
13872 304059 259511 549486 604610 658232 688586 731226 605977 480931 536343 772631 843970
13861H43970L5850J72685j12418Q1675n1764j22573J22918j28690J10567l7159
13851I15061R3820J18758O9198k9713n7520r3273l32876p695Q092j46711p3416
13840D63725q0410K21815n1477j05626J11530M47017l4514l35929p7786J42764
13830G01109L16297P8489j58487l3715j52013j75068j68796K7904N7778J88036
13820F81534r0678j15557P5325j15524R3454K68502J45892N0373k56j44588Q0961
13809I29438k8281k61410r543k48501N4809M05054J97190L2003j35988k48132
13799F86639j40847L14321K20405q7563l4464j03732k09841J60312P1962l0370
13789H46822j14761J92123K31733O8167j556r1974k9381q3537j64388j68475j79355
$$ plain form
13861 843970 879820 1052505 940087 1021762 969998 847425 970343 841653 952220 915061
13851 915061 1008881 1127639 1196837 1167124 1109604 1016331 683455 675760 683852 537141 463725
13840 463725 383315 605130 553653 448027 559557 1006574 972060 636131 558345 701109
13830 701109 1017406 1095895 937408 903693 751680 576612 407816 435720 493498 681534
13820 681534 590856 475299 550624 435100 528554 797056 942948 993321 993065 848477 929438
13809 929438 901157 639747 630204 381703 436512 841566 1038756 1070759 934771 686639
13799 686639 545792 860113 1080518 992955 958491 854759 644918 805230 877192 846822
13789 846822 732061 924184 1155917 1224084 1222528 1130554 1101173 1017636 853248 684773 505418
13778E05418p6371O5270R6888K93450K22176j81612M3240j58840j68178j96015
13768D45426Q1175K23103q7718j55560Q1273K21652J67924o4277q6665j91537
13758F34796k652J62543M9032J1401j65346M4245P0322k51731j08379K0014q1964
13747C82281K42584K04734j57809l7851J50945n7041K17347J39653l01329k08773
13737E74741j21351K65225M628l59534j45850L60390R038j42120o1701j00576
13727B82890K24863J23113p9554k5842m5404O5645J71904j21578j17229J16097
13717E94905o959o0063j83487K16991J86576j24833R1991j13124k44377k8514
13707C29106J05117J38018K33472J822o4651j31360J19452k8981j4207J55422
$$ plain form
13778 505418 429047 494317 591205 884655 1106831 925219 968459 809619 641441 445426
13768 445426 526601 749704 661986 506426 587699 809351 977275 912998 826333 634796
13758 634796 632144 794687 843719 855120 689774 734019 804341 552610 444231 464245 382281
13747 382281 624865 829599 671790 633939 784884 727843 945190 1084843 783514 574741
13737 574741 453390 718615 723243 363709 217859 578249 587287 445167 383466 282890
13727 282890 507753 630866 551312 525470 480066 545711 717615 596037 478808 594905
13717 594905 587946 527883 344396 561387 747963 623130 715121 601997 357620 329106
13707 329106 434223 572241 805713 807535 742884 611524 730976 701995 687788 843210
13697H43210j625O303j28988K3071P740J13648J74333l02394j02721J4935Q2960
13686G30472q2840l6383N6508r7429k03807L9279J52553J33880R394J12843O2719
13675H77189j8342J29408M50O1708P5924j6392j71369j30452k1903Q2201j28208
13664G40214o4045p7767o2831P2001k94865J66384K34316o881J47696j66832j68508
13653E18882J38380J64668j3967j46218J36680L9091j36682k93834n9513Q8168
13643D35655L1792n1847j0105M1276O4255K11674k2044p8816J33743q6643L9064
13632G08004Q2466j06306K17172J9024k08281K449R1174j44233j26076N812J09267
13621F50472J73444k3560k23947O7294K39758J04459J86415J78944o1970J67668
$$ plain form
13697 843210 841585 847888 718900 741971 749711 863359 1037692 735298 632577 647512 730472
13686 730472 647632 611249 667757 570328 366521 405800 558353 692233 701627 814470 877189
13675 877189 858847 988255 988705 1050413 1126337 1109945 938576 808124 786221 868422 740214
13664 740214 676169 598402 535571 607572 312707 479091 713407 706526 854222 687390 518882
13653 518882 657262 821930 807963 661745 798425 837516 700834 407000 347487 435655
13643 435655 467447 415600 405495 446771 511026 722700 700656 621840 755583 668940 708004
13632 708004 790470 684164 901336 920360 712079 714528 805702 661469 535393 541205 650472
13621 650472 823916 800356 576409 643703 883461 987920 1174335 1353279 1291309 1458977
13611A458977j57449r3462j37892l7795q9136k03728j41982l39706j84365K83556
13601C57018M1579j63152P1407J02093J51312p5189J19703O4393J15989o5935
13591G19218N9867J97995K9316O5664M3419J40162m7732k68818k25900L022K20978
13580I37191R9704p9509j31420r4183O1200L3314j4152N0029Q0416l584q5099
13569H53907j6394L5544K2145j68575r9340q342m9576J21850J79717m1147r3253
13558G36536J43767J99406n5569K03353N1431k78329m5081J32692l9746j15881
13548I32579k02658k28J58607K10755n8502n2030J76243J88060k34261M7424R9643
13537A265632n0072j86367L5964K09547K02048q1530k97348j32930J00869j20238
$$ plain form
13611 1458977 1301528 1208066 1070174 1032379 943243 739515 597533 257827 73462 357018
13601 357018 398597 235445 306852 408945 560257 485068 604771 669164 785153 719218
13591 719218 779085 977080 1006396 1072060 1115479 1255641 1207909 939091 713191 716213 937191
13580 937191 1036895 957386 825966 731783 792983 826297 812145 862174 942590 939006 853907
13569 853907 837513 873057 895202 726627 627287 618945 569369 691219 870936 829789 736536
13558 736536 880303 1079709 1024140 1227493 1278924 1000595 955514 1088206 1048460 932579
13548 932579 729921 729693 888300 1099055 1040553 988523 1164766 1352826 1118565 1165989 1265632
13537 1265632 1215560 1029193 1065157 1274704 1476752 1395222 1097874 964944 1065813 945575
13527I45575l91630J65952N4992m6341M39007L24653j28082l33403k96593J19518
13517H53648K77912r9710R6468J57771j71646O6618k31099K41763J00498K28224
13507A520447o6890l07999j47393K70466J45075j73734k30490K10306l9623k3473
13497A156692J04755j1980m26352j61505J73626J06398j70128j28228M54122K57432
13487A354832l69109n01067K86279J20683J95180r436m8752J7150j31066K4707
13477I39401J82438N1830O2252j46551j02620m4504r9024j08679j74671k5842
13467E34030L26639J46627L4606J3145o934j36620j4944N4003l1040n4275k26830
13456F38407l2752R8924O5621m8809P7960J76455k16337M8899k8303R2681k15178
$$ plain form
13527 945575 553945 719897 774889 728548 1167555 1492208 1364126 1030723 734130 853648
13517 853648 1131560 1031850 1128318 1286089 1114443 1181061 949962 1191725 1292223 1520447
13507 1520447 1453557 1145558 998165 1268631 1413706 1239972 1009482 1219788 1180165 1156692
13497 1156692 1261447 1249467 823115 661610 835236 941634 771506 643278 1097400 1354832
13487 1354832 985723 484656 770935 891618 1086798 1077362 1028610 1045760 914694 939401
13477 939401 1121839 1173669 1235921 1089370 986750 942246 843222 734543 559872 534030
13467 534030 860669 1007296 1041902 1055047 1048113 911493 896549 950552 919512 865237 638407
13456 638407 605655 704579 770200 721391 799351 975806 759469 808368 780065 872746 657568
13445F57568L3118M17006j17320k36998K02260L34912j16508m39990J29013M0725
13435I03786J63898j8403J42795n4840k46100n9930O1289J03120M5005K6297j99447
13424H67470j0628R6255M9743K68524K42760R2387k80780k87387k74988J40665
13414I04021J66089j05029j28561K5549J78742r307J28533q1771l59702k6352
13404F92212M52512L20274J64788j74326J20349J76071N297j45813L787J1804
13394A626955l69635k45377J51970N0605k48175J71467q5505m7712K7611K4261
13384A056465p6586O4534o4404N2474m947o4486o424K46367k5254Q2856R8535
13373A359130l20288o4330J30383K3356k7052Q7891k7589l6420R7487k23203k42532
$$ plain form
13445 657568 690686 1107692 990372 753374 955634 1290546 1174038 734048 863061 903786
13435 903786 1067684 1049281 1192076 1137236 891136 831206 892495 995615 1040620 1066917 867470
13424 867470 856842 953097 1002840 1271364 1514124 1606511 1325731 1038344 763356 904021
13414 904021 1070110 965081 836520 862069 1040811 1031504 1160037 1078266 718564 692212
13404 692212 1144724 1464998 1629786 1455460 1575809 1751880 1757177 1611364 1615151 1626955
13394 1626955 1257320 1011943 1163913 1214518 966343 1137810 1052305 1004593 1032204 1056465
13384 1056465 979879 1044413 980009 1032483 1027536 963050 956626 1202993 1177739 1260595 1359130
13373 1359130 1038842 974512 1104895 1128251 1101199 1189090 1161501 1125081 1222568 999365 756833
13362G56833j536R0933j17103q8147K07195O3210k2349j45045P897K83596J23716
13351A159200J48134j47747r9013M8292J46668j38191l44359j50229J00391J76081
13341H99227J3163k59816M3892R7431J35918J05675N4475J28029K75594M6344
13331A539932k34182k37159M5806J8836j91271p8543J85146r963j05084q0837
13321H52681r9686j61976R401n4345K36017M04930M17374l17145l97029L3014
13311I23236K53715K19798K24728p4859j69625k5111j75830k08476J58294J53820
13301A279690J83632j69331j78702P3310N7872n02469K0877R9299K257K88297
13291A154732j65151L6360K08472P2747J8954q0114N7348J08416r9276N7100k9982
$$ plain form
13362 756833 755297 846230 729127 640980 848175 911385 889036 743991 751888 1035484 1159200
13351 1159200 1307334 1159587 1060574 1108866 1255534 1117343 772984 622755 723146 899227
13341 899227 912390 652574 696466 793897 929815 1035490 1089965 1217994 1493588 1539932
13331 1539932 1305750 1068591 1114397 1133233 941962 863419 1048565 1038602 933518 852681
13321 852681 752995 591019 600420 546075 782092 1187022 1604396 1287251 890222 923236
13311 923236 1176951 1396749 1621477 1546618 1376993 1351882 1176052 967576 1125870 1279690
13301 1279690 1463322 1293991 1115289 1188599 1246471 744002 764879 864178 866435 1154732
13291 1154732 989581 1025941 1234413 1307160 1326114 1246000 1303348 1411764 1312488 1369588 1339606
13280A339606P8373J76693n0184o4745n0757j27179M6624k17128J1514j35863
13270A006954j97772J40126L35623K66432p1038j80260k1698l6739O7695J23268
13260A432591K44855K3097P8492R9678m407p7786n8155m4247J401j44525j39196
13249A411798m501J47979J16048J39180O5695L00167l32589l83480j81864j67290
13239A111143K05378J32634M0768k8719p3965j27665Q0707J90447J62950j43234
13229A550444j29585q8878M4327o6782J40302J56410K38517n8428m16379j28826
13219A241122r0667J73340J40589k27235K78371K89038j74456L3738J46426j5184
13209A795082k82207j20953K39228j13245p2361o4125J27800M9386P8143m31572
$$ plain form
13280 1339606 1417979 1594672 1544488 1479743 1428986 1301807 1348431 1131303 1142817 1006954
13270 1006954 809182 949308 1284931 1551363 1480325 1300065 1278367 1241628 1309323 1432591
13260 1432591 1677446 1700543 1779035 1878713 1874306 1796520 1738365 1694118 1695519 1550994 1411798
13249 1411798 1407297 1555276 1671324 1810504 1876199 2176366 1843777 1460297 1278433 1111143
13239 1111143 1316521 1449155 1489923 1461204 1387239 1259574 1340281 1530728 1693678 1550444
13229 1550444 1420859 1331981 1376308 1309526 1449828 1606238 1844755 1786327 1369948 1241122
13219 1241122 1150455 1323795 1464384 1237149 1515520 1804558 1630102 1663840 1810266 1795082
13209 1795082 1512875 1391922 1631150 1517905 1445544 1381419 1509219 1558605 1636748 1205176
13199A205176k6041K02881L11252L34922j14811r6050k38278J757R8789j50797
13189A528800k12762K9060R7874k3755n3126P4429J74484j64683M0883K17387
13179A708591P2515K05888q8968p6711j7410n3161O6414j45983k58319j11630
13169A301226j27541J13921j1544L76729J40839K04629L01644q2676k01902k37800
13159A777525j04078N7640m7317N684Q1116r7805K93021j1302p1431R4264l0930
13148A946387k779j4113j61932k84084o3100j6275J49281M3541j57320L57223
13138A796829M78821J35157O1060l07131l717Q0974L805k83493p7886P9799K09291
13127B173509k22767J8123o696m0365j12924J82601K63264r4058p3617K60480
$$ plain form
13199 1205176 1179135 1382016 1693268 2028190 1913379 1817329 1579051 1580808 1679597 1528800
13189 1528800 1316038 1345098 1442972 1419217 1366091 1440520 1615004 1450321 1491204 1708591
13179 1708591 1781106 1986994 1898026 1821315 1803905 1750744 1817158 1671175 1412856 1301226
13169 1301226 1173685 1287606 1276062 1652791 1793630 1998259 2299903 2217227 2015325 1777525
13159 1777525 1673447 1731087 1683770 1689454 1770570 1672765 1965786 1954484 1883053 1977317 1946387
13148 1946387 1943608 1929495 1767563 1483479 1420379 1404104 1553385 1596926 1439606 1796829
13138 1796829 2275650 2410807 2471867 2164736 2161019 2241993 2245798 1962305 1884419 1964218 2173509
13127 2173509 1950742 1968865 1962169 1921804 1808880 1991481 2254745 2160687 2087070 2347550
13117B347550J61689j20458j80369l38526l5158k17380n0901P7623J31466J34882
13107A910418P1163k13998J53677L36927j4921m53037r7459K20098J43943o8267
13097A988544k20855O853k8369j83153J00397L3123k62687j42773J66515N28913
13087A986508K71564m7552j36788r1157P0607K11467J0160L4105J32122J8026
13077B459062k88895k42842j82643M18491O39407J94857K63702K57556N17400
13068D036095N16605M21702K69324K1946P7542R1077k06035m53500l89181l08556
13058D077019l75024l94276m6691k5244m9784j03582q9017j5925l37417r6777
13048B543282j35507R9325j2978k00869K71051J66856P3103J74686K71977J54945
$$ plain form
13117 2347550 2509239 2388781 2208412 1869886 1834728 1617348 1566447 1644070 1775536 1910418
13107 1910418 1981581 1767583 1921260 2258187 2243266 1790229 1692770 1912868 2056811 1988544
13097 1988544 1767689 1774542 1746173 1563020 1663417 1696540 1433853 1291080 1457595 1986508
13087 1986508 2258072 2210520 2073732 1982575 2053182 2264649 2274809 2308914 2441036 2459062
13077 2459062 2170167 1927325 1744682 2163173 2802580 2997437 3261139 3518695 4036095
13068 4036095 4552700 4974402 5243726 5265672 5343214 5434291 5228256 4774756 4385575 4077019
13058 4077019 3701995 3307719 3261028 3235784 3186000 3082418 2993401 2977476 2640059 2543282
13048 2543282 2407775 2507100 2494122 2293253 2564304 2731160 2804263 2978949 3250926 3405871
13038C405871k65220j04135L07262L03496Q2650L02625K82878K18377L76077K61315
13028E171196L46740O58770P29429J137505J510812J509376J247586Q98692L95234
13019A3605340O52655J29513o45484j311935k119933k110553j561881o49878n88157
13010E399687n05280N7034J17102J96108J55779j17136m1460k132j38915j67208
13000D953579K02839j16051m2868J54056l2690l45728r2843J43235L3187j29193
12990D727523j07047J19044L1544J16125L27816N7641j73916O9032N58138R13102
12980F639002J005912J643166J836503J570760J311929N07739M31032J41341o11344
12971A4476040j577662k124165j695121j577009r99952k50064k89806l59220l72997
$$ plain form
13038 3405871 3140651 3036516 3343778 3647274 3729924 4032549 4315427 4533804 4909881 5171196
13028 5171196 5517936 6176706 6906135 8043640 9554452 11063828 12311414 13210106 13605340
13019 13605340 14257995 14387508 13742024 12430089 10310156 8199603 6637722 5987844 5399687
13010 5399687 4894407 4951441 5068543 5264651 5420430 5303294 5261834 5259702 5120787 4953579
13000 4953579 5156418 5040367 4997499 5151555 5118865 4773137 4680294 4823529 4856716 4727523
12990 4727523 4620476 4739520 4771064 4887189 5215005 5272646 5098730 5167762 5725900 6639002
12980 6639002 7644914 9288080 11124583 12695343 14007272 14515011 14946043 15087384 14476040
12971 14476040 12898378 10774213 9079092 7502083 6502131 6252067 5962261 5603041 5230044
12962E230044k30247k28415j78332j52801q3445r9587k28655j74922j54174j41864
12952C557602k34225J56111J0559j15181j40001K52780J95426K3410O9875j42157
12942C634199j56617K5456k02803o3784L9467K58500L79688K87522P27800N93186
12932E522614K90966J29702J04594L50861l9392m00635m73373p85493n36242j26625
12922D036977k16805o20560m34859J94051Q6664k870j96161l5466K83315O6116
12912C160402j96976j07016q7099j82958L29679O0749k73872j40393L5814J4129
12902B612459j28840J70294j7530l3517P551L915n8985j1461J07245m5805L11586
12891B916912L95812O6611k00786j80935j42603j4399M2440J04225o4649J0994
$$ plain form
12962 5230044 4999797 4771382 4593050 4440249 4356804 4257217 4028562 3853640 3699466 3557602
12952 3557602 3323377 3479488 3490047 3374866 3234865 3487645 3683071 3706481 3776356 3634199
12942 3634199 3477582 3503038 3300235 3236451 3275918 3534418 3914106 4201628 4929428 5522614
12932 5522614 5813580 5943282 6047876 6398737 6359345 5958710 5485337 4699844 4163602 4036977
12922 4036977 3820172 3199612 2764753 2958804 3045468 3042598 2846437 2810971 3094286 3160402
12912 3160402 2963426 2856410 2769311 2586353 2916032 2976781 2702909 2562516 2598330 2612459
12902 2612459 2483619 2653913 2636383 2602866 2610417 2614332 2555347 2543886 2651131 2605326 2916912
12891 2916912 3312724 3379335 3178549 2997614 2855011 2840612 2883052 2987277 2922628 2933622
12881B933622k36073n9992k86323j182K71215K65736J66020J57301J39829j29444
12871C220709k45049Q7649K34128k71951m16140j09947M61054L81478j49187l62042
12861B830702l53410J316p3665k04208Q3419M05262J33007R6862j3305k1100M2302
12850B927182J9541j42233j23188k313O8264J52036J75928k52114J08087Q6246
12840C017436O0893j48702L3578N3020l17096j24576N3528j08980J28099J85390
12830B832590N0644J89496m7666q3034K52454K3387j22899j35361L71264r5290
12820C235585j689N4521r3076J61368K67421j98767l8167j36420k21593r3643
12810B935540J27382L14419l6634r7729K18602p7496k40409J34350J20782J5630
$$ plain form
12881 2933622 2697549 2637557 2351234 2350052 2621267 2887003 3053023 3210324 3350153 3220709
12871 3220709 2975660 3063309 3297437 3025486 2609346 2499399 2960453 3341931 3192744 2830702
12861 2830702 2477292 2478608 2404943 2200735 2284154 2689416 2822423 2919285 2905980 2884880 2927182
12850 2927182 2946723 2804490 2681302 2678989 2747253 2899289 3075217 2823103 2931190 3017436
12840 3017436 3078329 2929627 2963205 3016225 2699129 2574553 2628081 2519101 2647200 2832590
12830 2832590 2883234 3072730 3025064 2942030 3194484 3217871 3094972 2959611 3330875 3235585
12820 3235585 3233896 3288417 3195341 3356709 3624130 3425363 3387196 3250776 3029183 2935540
12810 2935540 3062922 3377341 3340707 3242978 3461580 3384084 3143675 3278025 3398807 3414437
12800C414437M5944O6904j61988k02328Q6187K79784O3114K46896m1077M1618
12790C839491p4422O8388J0782J53489j6568m70083k84610K93163k00512l39972
12780B979146Q7084L12871q022L37080K73256J62375k54066k51256J01249O1601
12770C801318M26512k06511j70124J75804M3423j91858r0378J91664j41401k66999
12760C571450R9014K3435J22310k42761L8999K8861j09205J60828L01251j32k30044
12749C764006l5840R1149l62271j87699J43222J24784m3715L592J70757n1717
12739C616268l2438m453p0478O4900L62501K30331p9357k32971j34980j05841
12729C613482n261Q2812K7792q3662N0355L633J30859J15017J03150p336J14606
$$ plain form
12800 3414437 3460381 3527285 3365297 3162969 3249156 3528940 3592054 3838950 3797873 3839491
12790 3839491 3765069 3833457 3844239 3997728 3981160 3511077 3226467 3519630 3319118 2979146
12780 2979146 3066230 3379101 3371079 3708159 3981415 4143790 3889724 3638468 3739717 3801318
12770 3801318 4227830 4021319 3851195 4026999 4070422 3878564 3788186 3979850 3838449 3571450
12760 3571450 3670464 3693899 3816209 3573448 3612447 3641308 3532103 3692931 3994182 3994050 3764006
12749 3764006 3728166 3819315 3457044 3269345 3412567 3537351 3493636 3497228 3667985 3616268
12739 3616268 3583830 3579377 3508899 3573799 3936300 4166631 4087274 3854303 3719323 3613482
12729 3613482 3608221 3691033 3718825 3635163 3685518 3689151 3820010 3935027 4038177 4030841 4145447
12718D145447K16320K63434N8194n6899J70407J96156n9593l7430l5948j38335
12708D721753R7851K73800J90935k8577j60309K92977J95634N705R2826p6554
12698E606041J23608N2487J63260r6692j08512J95523K59570K28933p9632j66142
12688F178444k77518k31964L71416K72744J6104J92068L57484j28838k61443j79369
12678F309128K11337K66424O0062o7757j12231O6687M12620J42965k676j81627
12668G104932K1074q7676M3229K72843K4786r0761R1834J84702J12874N27359
12658H205196L8876j98401k19191J07552K4018K40751J84273Q4121J64200N0240
12648H681635J8216p941J5054P8638J42618J3050L09868P4264j83122J08963K09531
$$ plain form
12718 4145447 4361767 4625201 4683395 4626496 4796903 4993059 4933466 4896036 4860088 4721753
12708 4721753 4819604 5093404 5284339 5255762 5095453 5388430 5584064 5589769 5682595 5606041
12698 5606041 5729649 5782136 5945396 5848704 5740192 5935715 6195285 6424218 6344586 6178444
12688 6178444 5900926 5668962 6040378 6313122 6329226 6521294 6878778 6749940 6488497 6309128
12678 6309128 6520465 6786889 6846951 6779194 6666963 6733650 7146270 7289235 7286559 7104932
12668 7104932 7126006 7038330 7081559 7354402 7379188 7288427 7380261 7564963 7677837 8205196
12658 8205196 8244072 8045671 7826480 7934032 7958050 8198801 8383074 8467195 8631395 8681635
12648 8681635 8699851 8691910 8706964 8785602 8928220 8941270 9251138 9325402 9142280 9251243 9460774
12637I460774L11467j0678l2553J60585K02274o5697L23395L20297K86945M72114
12627A1428923L30487P0199J84134K69207K76325K93271K70172M18537N31094
12618A4072349P47465L94241M30651M13952N76345M12441K96136N69059R49640
12609A8862279J014796R04416J024170J223901J345300J228695J534345J949949
12601B9087851J685534K341376K633777K911091L372624L903897M283869N384900
12593E5604919O599888P521603Q870181J0806381J3390676J6631260K0121641
12586A39546549K3974403K7095867K9110763K9913020K8453886K4550152J8615661
12579C21260301J1768635M499069l727172j1508546j7800630k0613004k0295363
$$ plain form
12637 9460774 9772241 9761563 9729010 9889595 10091869 10026172 10349567 10669864 10956809 11428923
12627 11428923 11759410 11829609 12013743 12282950 12559275 12852546 13122718 13541255 14072349
12618 14072349 14819814 15214055 15644706 16058658 16635003 17047444 17343580 17912639 18862279
12609 18862279 19877075 20781491 21805661 23029562 24374862 25603557 27137902 29087851
12601 29087851 30773385 33114761 35748538 38659629 42032253 45936150 50220019 55604919
12593 55604919 62204807 69726410 78596591 89402972 102793648 119424908 139546549
12586 139546549 163520952 190616819 219727582 249640602 278094488 302644640 321260301
12579 321260301 333028936 337528005 333800833 322292287 304491657 283878653 263583290
12572B63583290j7954743j4187547r373357m696768l03526L986622Q058785J1483146
12564B40595902J3807894J6448653J7741925J7933371J7682213J7416493J6405380
12557C58031831J5343597J4905549J4675439J4040000J3560422J2150579R878119
12550D52585536O744737K937422r46465n516458r423155j2100099j3681613j3164818
12542D07435087j1552492r639249p761908o724828o637096p677853r339477j0826706
12534C37275478j2366626j3367942j3312840j2258302r725228o845706k530021
12527B66868813K919597Q192292J3146181J8152675K1602556K3165456K2508311
12520C76555881J9649651J3882432O369686k246960j1599800k0609569k8278187
$$ plain form
12572 263583290 245628547 231441000 222067643 217370875 217067349 221053971 229112756 240595902
12564 240595902 254403796 270852449 288594374 306527745 324209958 341626451 358031831
12557 358031831 373375428 388280977 402956416 416996416 430556838 442707417 452585536
12550 452585536 459330273 462267695 461321230 455804772 446381617 434281518 420599905 407435087
12542 407435087 395882595 386243346 378481438 371756610 365119514 357441661 348102184 337275478
12534 337275478 324908852 311540910 298228070 285969768 276244540 269398834 266868813
12527 266868813 269788410 277980702 291126883 309279558 330882114 354047570 376555881
12520 376555881 396205532 410087964 416457650 414210690 402610890 382001321 353723134
12513C53723134l3548956l5206511l3376370k9734673k5788267k1712764j7996344
12506A56359249j4682480j1882409j0142393q495955p529214o568762n815568
12499I1242468n171762m596534m233966l760467l458585l190657k756973k786369
12491F1287155k664924k386050j872806k122130k058511j896349j661285k009460
12483D4615640j601131j244346j488695j365663j502340j363467r72262r18644
12475C4159092j023337j139608j033645q66751r48410q28260r10576n64185p94442
12466B6049878p37845o39959p85634o55029p10279o26348n40524o19981l85469
12457B0348810k41060n99160q00544o21540k45548k21851n45159m18647k45407
$$ plain form
12513 353723134 320174178 284967667 251591297 221856624 196068357 174355593 156359249
12506 156359249 141676769 129794360 119651967 111156012 103626798 97058036 91242468
12499 91242468 86070706 81474172 77240206 73479739 70021154 66830497 64073524 61287155
12491 61287155 58622231 56236181 54363375 52241245 50182734 48286385 46625100 44615640
12483 44615640 43014509 41770163 40281468 38915805 37413465 36049998 35077736 34159092
12475 34159092 33135755 31996147 30962502 30095751 29147341 28319081 27408505 26844320 26049878
12466 26049878 25312033 24672074 23886440 23231411 22521132 21894784 21354260 20734279 20348810
12457 20348810 20107750 19508590 18708046 18086506 17840958 17619107 17073948 16655301 16409894
12448A6409894p65461p25835j56133L7270j46754k50698q2270j83715m42072n51655
12438A3142571k29293j81136m42817j44475j35260k12447j97269k26721m89909
12429A0883244l41915J4518n2289j27536j08709k46120m47186j3562K68517j46484
12419I682478r9131q9758O8213j0290k88896l95888l71326l59746k50765O4876
12409G949767j17110J29224R0774j6739k172J58342J02535k9559j17589R1887
12399H239360M44297K17513j12459q0827j72551l62042k79019k04614o0580l85696
12389G243382q7469j40545j92565q6666n3934j90133p9600m2934P4122J10699
12379F554357Q7304o6899k67255r5784o0695j47127J3070j45336j08456R1341
$$ plain form
12448 16409894 15644433 14918598 14762465 14799735 14652981 14402283 14320013 14136298 13694226 13142571
12438 13142571 12913278 12732142 12289325 12144850 12009590 11797143 11599874 11373153 10883244
12429 10883244 10541329 10555847 10503558 10376022 10267313 10021193 9574007 9560445 9828962 9682478
12419 9682478 9583347 9493589 9561802 9551512 9262616 8866728 8495402 8135656 7884891 7949767
12409 7949767 7832657 7961881 8052655 8035916 8033744 8192086 8294621 8265062 8147473 8239360
12399 8239360 8683657 8901170 8788711 8707884 8535333 8173291 7894272 7689658 7629078 7243382
12389 7243382 7155913 7015368 6822803 6736137 6682203 6492070 6412470 6369536 6443658 6554357
12379 6554357 6641661 6574762 6307507 6211723 6151028 6003901 6016971 5871635 5763179 5854520
12369E854520j22676q4211J63441P7786p200J86898L47423L8229j9099r6573j79045
12358F159493L8346P6317J1611j57826k61562l9606J44911k5558j09431J44623
12348E981318J23152q1389q5375N1238m5742j09637r3741o9425J78989n302K5
12337E844111R6853K1892R7300k3793j35160r211J65566o4256m5680j22486J86093
12326F011229q1268k51864k914j644j40013J28305J01454l6002l79719L9214L1765
12315E418543o5282J50803J42057p8736q9023n8329J61195j2908k1930j03521
12305E442869J36126K2079p3713L5121m806j76665k2105k0896n2141M3435q2244
12294E247060k03080J35176M12908J22506j96488m9192k75722j04932M5261N07105
$$ plain form
12369 5854520 5731844 5647633 5811074 5888860 5881660 6068558 6415981 6454210 6435111 6338538 6159493
12358 6159493 6197839 6274156 6285767 6127941 5866379 5826773 5971684 5946126 5836695 5981318
12348 5981318 6104470 6023081 5937706 5988944 5943202 5833565 5739824 5670399 5849388 5844086 5844111
12337 5844111 5940964 5962856 6060156 6036363 5901203 5891992 6057558 5993302 5947622 5825136 6011229
12326 6011229 5929961 5678097 5675183 5673539 5533526 5661831 5763285 5727283 5347564 5386778 5418543
12315 5418543 5353261 5504064 5646121 5567385 5478362 5420033 5581228 5568320 5546390 5442869
12305 5442869 5578995 5601074 5527361 5562482 5557676 5381011 5358906 5338010 5285869 5329304 5247060
12294 5247060 5043980 5179156 5592064 5714570 5518082 5468890 5193168 5088236 5133497 5640602
12284E640602K06956k75604k31772J28598P3313o8185L5121R4806p566n9199p6210
12273E460860o7832N847q0594j58010M6351J83207J95477Q3748Q4552n6570J69222
12262E866258L4501J2930k04339k82819j19422l7440j35685J84088k73115k33646
12252D811311P5974J96489K97766J45441j9826M5446n6856k0838Q2998j9526J33277
12241E671656J19795m03108J0958m7271k3473l1755j06316K32651o2302j02919
12231E257916p7308j60796n4536j507l4257L49696K10874J48488J366k52316j27999
12220E259621J6061L3455J04500J36923J0983j93915j4916J13068L04946p4319
12210E696407o2802l19126M2290J18082N3267j38694J14772K43143k82700l10862
$$ plain form
12284 5640602 5847558 5571954 5340182 5468780 5542093 5473908 5509029 5603835 5596269 5537070 5460860
12273 5460860 5393028 5398875 5318281 5160271 5206622 5389829 5585306 5669054 5753606 5697036 5866258
12262 5866258 5900759 5913689 5709350 5426531 5307109 5269669 5133984 5318072 5044957 4811311
12252 4811311 4887285 5083774 5381540 5526981 5507155 5552601 5495745 5474907 5557905 5538379 5671656
12241 5671656 5791451 5388343 5399301 5352030 5328557 5296802 5190486 5423137 5360835 5257916
12231 5257916 5180608 5019812 4965276 4963769 4929512 5279208 5490082 5638570 5639936 5387620 5259621
12220 5259621 5275682 5309137 5413637 5550560 5561543 5367628 5352712 5465780 5770726 5696407
12210 5696407 5633605 5314479 5356769 5474851 5528118 5389424 5504196 5747339 5464639 5153777
12200E153777L4544L88768n4285Q7551j46144j33593R7252q6226M2976J32131
12190E516751J6421R2076K911l40287k41565J13617K43028K66432K531P8013k20412
12179E529516l28196k52181K98523K68967K82161J80064j56538M5555J47058j73038
12169E841891j30499p0147J31587K63742J80975k429l11504K5226j5648l06265
12159E606929q2452o554K8681k1665j73882k53096J27687M18178J96397j44729
12149E695494K05324L82961J26455k1485k52527L3039K4203j19134J01231p2448
12139F103113n5340J94347R2304L07253l315J33784L4573K23700M6295l23554
12129F753160p4691L88644K86801L743L3748J41937J66223K38411K1133k20522
$$ plain form
12200 5153777 5188321 5577089 5522804 5610355 5464211 5330618 5427870 5341644 5384620 5516751
12190 5516751 5533172 5625248 5628159 5287872 5046307 5159924 5402952 5669384 5671915 5749928 5529516
12179 5529516 5201320 4949139 5247662 5516629 5798790 5978854 5822316 5867871 6014929 5841891
12169 5841891 5711392 5641245 5772832 6036574 6217549 6215120 5903616 5928842 5913194 5606929
12159 5606929 5524477 5517923 5546604 5524939 5351057 5097961 5225648 5643826 5840223 5695494
12149 5695494 5900818 6283779 6410234 6388749 6136222 6169261 6193464 6074330 6175561 6103113
12139 6103113 6047773 6242120 6334424 6641677 6638362 6772146 6806719 7030419 7076714 6753160
12129 6753160 6678469 7067113 7353914 7357657 7391405 7533342 7699565 7937976 7959109 7738587
12119G738587m9589j67071n4112j76995q6123Q2676N7715J58446J5788j06120
12109G413202k39167j62959J62336N83614K91932J6432o431N9017J01367j74564
12099H044779k57911J81925K13885r9574j9389R3582Q1620j13244J93203J77615
12089H496491K43567k4397l14818Q4709J9166n1997k45762j04137j4549J20502
12079H208775N9944l01294k57800k83482J71540K34764q0738j14351n2248l8867
12069G546243J29092J52060J21884J92996J51880r6549J71269Q4761J50615J90308
12059H794559j13832k98594J95524j51803k89683k08959K2193l1525J23052Q250
12049H049182P6164m5953n2343K85928J2788J6472P3497j0005j18663n1460J02810
$$ plain form
12119 7738587 7688998 7521927 7467815 7290820 7204697 7287373 7345088 7503534 7519322 7413202
12109 7413202 7174035 7011076 7173412 7757026 8048958 8065390 8058959 8117976 8219343 8044779
12099 8044779 7786868 7968793 8182678 8083104 8063715 8157297 8238917 8125673 8318876 8496491
12089 8496491 8740058 8715661 8400843 8485552 8504718 8452721 8206959 8102822 8088273 8208775
12079 8208775 8268719 7967425 7709625 7426143 7597683 7832447 7751709 7637358 7585110 7546243
12069 7546243 7675335 7827395 7949279 8142275 8294155 8197606 8368875 8453636 8604251 8794559
12059 8794559 8680727 8382133 8577657 8425854 8136171 7927212 7949405 7917880 8040932 8049182
12049 8049182 8125346 8079393 8027050 8312978 8325766 8342238 8415735 8405730 8287067 8235607 8338417
12038H338417L52249L2796m87699r9072k82268m63836o6878L11006K26971o4857
12028G796829M5908J61074j22543k84147R2559K45236k8239n883J59324o1840
12018G998278p0679l0177Q904K19064J22121J60739J65908p4050k7637j37308
12008H335163j97517m8288K07813K44438j13378j11502l91142m37111m2262K18362
11998G664576j06098Q9462J76028J06750n6941k33126n7701N2555P9275j3378
11988G701402p7315j05535K3017l6675J88153K46602P8332J15530P4452r1346
11978H116617j96068j21712j45026j06889j81048j38468J20231O7939j57275O8868
11968G327169n3993l7899o8676k66345j27825M83461K46044k90678j67665k54325
$$ plain form
12038 8338417 8690666 8723462 8235763 8136691 7854423 7390587 7323709 7634715 7861686 7796829
12028 7796829 7842737 8003811 7881268 7597121 7689680 7934916 7906677 7900794 8060118 7998278
12018 7998278 7927599 7897422 7906326 8125390 8247511 8408250 8574158 8500108 8472471 8335163
12008 8335163 8137646 8089358 8297171 8541609 8428231 8316729 7925587 7488476 7446214 7664576
11998 7664576 7558478 7647940 7823968 7930718 7873777 7640651 7582950 7635505 7714780 7701402
11988 7701402 7624087 7518552 7541569 7504894 7693047 7939649 8017981 8133511 8207963 8116617
11978 8116617 7920549 7798837 7653811 7546922 7365874 7227406 7347637 7415576 7258301 7327169
11968 7327169 7273176 7235277 7166601 6900256 6772431 7255892 7501936 7211258 7043593 6789268
11958F789268j37382Q7177K9885j32202j03847J61236J65763j78286R8476n4072
11948F726016K68667o7215k12063j70015L4679j639n180K24519j54133j56008
11938F487628j44066P7737k01363N5347k8954q272J85745J16962M0423Q8698j78082
11927F491803j34086O35J47203l26925p2767O19851J70292m8185k37253j77311
11917F433257j68609r1000r0927Q0982Q5536j52189K73678L59502k37184j13861
11907F379185k9631J42609L11936J40112L1360j96822Q9029J49372j8917O8705
11897G066938l06358k60476l7165P0949J26200J12824j12568o9143N087J26514
11887F722802l29328M5988K57630R3128q4846j71358j253j99641k8631L18178
$$ plain form
11958 6789268 6651886 6739063 6768948 6636746 6532899 6694135 6859898 6681612 6780088 6726016
11948 6726016 6994683 6927468 6715405 6545390 6580069 6578430 6573250 6797769 6643636 6487628
11938 6487628 6343562 6421299 6219936 6275283 6246329 6238057 6423802 6540764 6581187 6669885 6491803
11927 6491803 6357717 6358352 6505555 6178630 6105863 6725714 6896006 6847821 6610568 6433257
11917 6433257 6264648 6173648 6082721 6163703 6249239 6097050 6370728 6730230 6493046 6379185
11907 6379185 6349554 6492163 6804099 6944211 6975571 6778749 6867778 7017150 6998233 7066938
11897 7066938 6760580 6500104 6462939 6533888 6660088 6772912 6660344 6591201 6596288 6722802
11887 6722802 6393474 6439462 6697092 6790220 6705374 6534016 6532763 6333122 6304491 6622669
11877F622669J35742J10029m7526j7575J11805j24549K4739O6612J11054q7219
11867F905781l4565L93089m7311j23248k36530k11412J91236L6944J59431n2907
11857F980508P121K1673J51582j14372l04503j22563J5390k8988R6168K27037
11847F929053R5050l8853j91991k1772J68997J9097j6243J47246j97520k07576
11837F685488M9062J64900l885J73287j00515k64719j71073j97327P4395K34332
11827F643945J06161M2767J55599m2721o7962k3673L3350L1853q8155j36955j37265
11816F516944q9045K8899L84619M47053o6806l28268N5338j47798j93495J04376
11806F711817j32561j36258L77015J01089M6084k64519j33901J60886K72246K2573
$$ plain form
11877 6622669 6758411 6868440 6820914 6803339 6915144 6790595 6815334 6881946 6993000 6905781
11867 6905781 6871216 7264305 7216994 7093746 6857216 6645804 6837040 6873984 7033415 6980508
11857 6980508 6987629 7009302 7160884 7046512 6742009 6619446 6634836 6605848 6702016 6929053
11847 6929053 7024103 6985250 6793259 6771487 6940484 6959581 6943338 7090584 6893064 6685488
11837 6685488 6734550 6899450 6895565 7068852 6968337 6703618 6532545 6335218 6409613 6643945
11827 6643945 6750106 6792873 6948472 6905751 6837789 6814116 6847466 6879319 6791164 6654209 6516944
11816 6516944 6427899 6456798 6841417 7288470 7221664 6893396 6948734 6800936 6607441 6711817
11806 6711817 6579256 6442998 6820013 6921102 6967186 6702667 6568766 6729652 7001898 7024471
11796G024471j61445j77774j22310r594o4140j1831O2873J69388K7597j21048
11786F616187k4100P8533J07111k26206J88103J2559j84089O2513K13065J79153
11776G022829o9903j27192p122p7585j42616j21736K7709L80334J87025j01876
11766F969867L6088J64405K5105l54792k00038K2272l8996J83045M57976J93357
11756G458289k05355j47360K58967P9962O1687J42973Q7924j06852Q8711J50671
11746G869617K90664J16059J2440k53242k3760K88862K11090K41526M8707M1041
11736H843004J16443L5903n2984J25634j3747k99889k39778j27363J92339J02099
11726H681661M828L99K00021M3513k2910j85365J17434L85889K00966l9347k97629
$$ plain form
11796 7024471 6863026 6685252 6562942 6553348 6489208 6477377 6540250 6709638 6737235 6616187
11786 6616187 6592087 6670620 6777731 6551525 6739628 6752187 6568098 6630611 6843676 7022829
11776 7022829 6952926 6825734 6818612 6741027 6598411 6476675 6504384 6884718 7071743 6969867
11766 6969867 7005955 7170360 7195465 6840673 6640635 6662907 6623911 6806956 7264932 7458289
11756 7458289 7252934 7105574 7364541 7444503 7506190 7649163 7737087 7630235 7718946 7869617
11746 7869617 8160281 8276340 8288780 8035538 8011778 8300640 8511730 8753256 8801963 8843004
11736 8843004 8959447 8995350 8942366 9068000 9054253 8754364 8514586 8387223 8579562 8681661
11726 8681661 8686489 8686888 8886909 8930422 8907512 8722147 8839581 9225470 9426436 9387089 9089460
11715I089460k80890P2723n3537P8720L04787M28438L52480K9310k64943m91353
11705I265195o7025J98333L0970J83006L34879M2703n266M3003k48841J53691
11695I930648J75093j40451r0518J60681M56949J82605j09769J05283K05818P9649
11685A0955988K99130N3190j47167K48726J52744K75439K36196l1677m0041J19154
11675A2121682l05328J7716J43609M75274N24606Q8049K52540k7527J8158J03260
11665A3412039l3181K25312N16040M99052K73720O27453M41539K10017J04417
11656A6276408M63174L53223N98422O16417P67303R36141M11813P25762J015407
11647B2164070J235938R98940R04802J180523J460639J696141J760653K134949
$$ plain form
11715 9089460 8808570 8881293 8827756 8906476 9211263 9639701 9992181 10021491 9756548 9265195
11705 9265195 9198170 9396503 9427473 9610479 9945358 9988061 9982795 10025798 9776957 9930648
11695 9930648 10105741 9965290 9874772 10035453 10492402 10675007 10565238 10670521 10876339 10955988
11685 10955988 11255118 11308308 11161141 11409867 11562611 11838050 12074246 12042569 12002528 12121682
11675 12121682 11816354 11834070 11977679 12452953 12977559 13065608 13318148 13290621 13308779 13412039
11665 13412039 13378858 13604170 14120210 14619262 14892982 15520435 15961974 16171991 16276408
11656 16276408 16739582 17092805 17691227 18307644 19074947 20011088 20422901 21148663 22164070
11647 22164070 23400008 24398948 25303750 26484273 27944912 29641053 31401706 33536655
11639C3536655K472848K388275K944973L365010L920074M510707N399930O421020
11631F4959492P774998Q829762J1173079J3621440J6084869J9069861K2600476
11624A64113977K6313222K9240543L1895725L2552948L0121819K6064936K0123826
11617C60426996J2291555L712247n252921j3506623j9266432k2675583k2732509
11610B92996730j9912434j5568244j0247582n041547l5050M452206P964049J0793014
11602B65401142J3032847J3587676J3682880J2750023J1484846R609480Q513642
11595C48062536Q298121Q854120J0444254J2216911J4182924J5615774J5924297
11588D33598937J4666327J1823770P577568K373497k468722p738562j1583625
$$ plain form
11639 33536655 36009503 38397778 41342751 44707761 48627835 53138542 58538472 64959492
11631 64959492 72734490 81564252 92737331 106358771 122443640 141513501 164113977
11624 164113977 190427199 219667742 251563467 284116415 314238234 340303170 360426996
11617 360426996 372718551 376430798 371177877 357671254 338404822 315729239 292996730
11610 292996730 273084296 257516052 247268470 242226923 242191873 246644079 254608128 265401142
11602 265401142 278433989 292021665 305704545 318454568 329939414 339548894 348062536
11595 348062536 356360657 365214777 375659031 387875942 402058866 417674640 433598937
11588 433598937 448265264 460089034 467666602 470040099 467571377 459832815 448249190
11581D48249190j3911427j4580293j4050483j3251892j2318616j2109850j2902208
11574C55124421j3987579j5013986j5771918j5590159j4788703j3080051j0677188
11567B56214837p049210l241102J332948N771437R969166J3875278J6904136J8993244
11559C12770734J8894246J6358562J1763057N849205q88898q120353j5830959
11552C40795594k2199680k6820195k9077112k8657637k6309155k2935695j9809202
11545A64986918j6514452j3996584j1558554r732781q290105p065377o090604
11538I1738461n505779m810935m048141l999259l752955l411362k876245k633379
11530F0700406k527646k363303k089928k036475j868205k051643j560064j670422
$$ plain form
11581 448249190 434337763 419757470 405706987 392455095 380136479 368026629 355124421
11574 355124421 341136842 326122856 310350938 294760779 279972076 266892025 256214837
11567 256214837 249165627 245924525 247257473 253028910 262998076 276873354 293777490 312770734
11559 312770734 331664980 348023542 359786599 365635804 364746906 356626553 340795594
11552 340795594 318595914 291775719 262698607 234040970 207731815 184796120 164986918
11545 164986918 148472466 134475882 122917328 113184547 104894442 97829065 91738461
11538 91738461 86232682 81421747 77373606 73374347 69621392 66210030 63333785 60700406
11530 60700406 58172760 55809457 53719529 51683054 49814849 47763206 46203142 44532720
11522D4532720j762757j586941j409963j308650j410933j208595o99803j051164
11514C4093914j160003j029545j111579q61494p94202j011213r50051p14609r86200
11505B5475018p96374n91127o11565l75630o04090o36608n60407l68806m20652
11496B0509759p34117m34857k37800m77916n89812m86277m53673n73930n15706
11487A6005671l96889m03830k89939k00042n53587m28758l71161k55215j91926
11478A2914324k50161n0284l29755o47437m11127n2864L7264p0490l96633m74967
11468A0267870l88786l815J44211j4778l08723m21218l47615k66129k58386j18828
11458H283803M820j41019Q6867j36713j14478j09068J12999l17168k99259o4286
$$ plain form
11522 44532720 42769963 41183022 39773059 38464409 37053476 35844881 35145078 34093914
11514 34093914 32933911 31904366 30792787 29931293 29137091 28125878 27175827 26461218 25475018
11505 25475018 24678644 24087517 23475952 23100322 22496232 21859624 21299217 20930411 20509759
11496 20509759 19775642 19340785 19102985 18625069 18035257 17548980 17095307 16521377 16005671
11487 16005671 15608782 15204952 14915013 14714971 14161384 13732626 13361465 13106250 12914324
11478 12914324 12664163 12613879 12284124 11636687 11225560 11172696 11209960 11139470 10742837 10267870
11468 10267870 9879084 9875269 10019480 10004702 9695979 9274761 8927146 8661017 8402631 8283803
11458 8283803 8288623 8147604 8234471 8097758 7983280 7874212 7987211 7670043 7370784 7306498
11448G306498k05305r859J7833j87742m4005o5329j8110n0091M0246K34975k92114
11437F726997j32258O4626N2690q7303P5171o2193k71898k70578k82756k07885
11427E604613l11725l7831j70135K2120J33162k4243J82290J3666j5199j15829
11417E280889o3354p0387M6893j29776j0896k01006j25216p3641j7846o0676N5809
11406D630793K88426J76513R8209L7776K23024k095j94179l17546j07691j078
11396D832152K4639J40319J6432j53400k52521n9333j98836j76494K43660R98
11386D417616k05124j6510K44686J15916N7376r8619l51907j18069q0901J69345
11376D133809K19320l72612j32627K1074n9653j34061K41247N5552K75896Q4963
$$ plain form
11448 7306498 7101193 7091334 7109167 6921425 6877420 6812091 6793981 6743890 6784136 7019111 6726997
11437 6726997 6594739 6659365 6712055 6624752 6699923 6637730 6365832 6095254 5812498 5604613
11427 5604613 5292888 5255057 5084922 5107042 5240204 5215961 5398251 5411917 5396718 5280889
11417 5280889 5217535 5147148 5194041 5064265 5053369 4852363 4727147 4653506 4635660 4574984 4630793
11406 4630793 4919219 5095732 5193941 5231717 5454741 5452646 5258467 4940921 4833230 4832152
11396 4832152 4856791 4997110 5013542 4860142 4607621 4548288 4349452 4172958 4416618 4417616
11386 4417616 4212492 4195982 4440668 4556584 4613960 4515341 4163434 4045365 3964464 4133809
11376 4133809 4353129 3980517 3847890 3868964 3809311 3675250 3916497 3972049 4247945 4332908
11366D332908j15859l5676l2164o7433j20358j01570p7249O0503O029o7850l8989
11355C742292j92405k0741P4786j25479K31362l7436l00234j6099J14709Q4509
11345C555264p3149l29919j66367J70273n3910m1358m1274k1107L5503Q2683J19319
11334C235958M6425J1357J55015P4194J02141N5045l10874m3460j69823N8429
11324C214407k2086J38794L1578j21271r9087l0274r7779j37735P2649P3510k54472
11313B768234l6655K25264J03805k97219j71838m9713n9669j56095K0417J38502
11303B485033J63374k1343N0700J86669J47469p7492k61118j13778k7448m6323
11293B485743J02440M3628j86042l02615K25996M3420k39944L3761J58523P1907
$$ plain form
11366 4332908 4217049 4181373 4149209 4081776 3961418 3859848 3782599 3843102 3849131 3781281 3742292
11355 3742292 3549887 3529146 3603932 3478453 3709815 3672379 3372145 3356046 3470755 3555264
11345 3555264 3482115 3152196 2985829 3156102 3102192 3060834 3019560 2998453 3033956 3116639 3235958
11334 3235958 3282383 3293740 3448755 3522949 3625090 3680135 3369261 3325801 3155978 3214407
11324 3214407 3192321 3331115 3362693 3241422 3142335 3112061 3014282 2876547 2949196 3022706 2768234
11313 2768234 2731579 2956843 3060648 2763429 2591591 2541878 2482209 2326114 2346531 2485033
11303 2485033 2648407 2627064 2677764 2864433 3011902 2934410 2673292 2559514 2532066 2485743
11293 2485743 2588183 2631811 2445769 2143154 2369150 2412570 2172626 2206387 2364910 2436817
11283B436817O3442q702P5690K70209R8781J47306k51502j95331k6351J57506
11273B767865r7562l65634r1156p842K3678M2621o2425R5182J14948j87418R434
11262B241691K18582J02853j13250q3101k64857o617L30188L6302j55914J31977
11252B437854m0888k64375j46004J96843J40423n5776j81002M861K02718j39738
11242B154916k65376j28424o6971J95469M001J34954r1570j23325o0204K98937
11232B052407J81340j23377j28813Q6200j30322Q0890j70640J3774N6450J82973
11222B100882Q6677k43463Q3891J68730o9689j23062K10726L25960j86138k99224
11212B055290K7904L089j17806R5002j3950P1061k59519k8584J52519Q0876J30465
$$ plain form
11283 2436817 2500259 2491557 2567247 2837456 2936237 3083543 2832041 2636710 2610359 2767865
11273 2767865 2670303 2304669 2213513 2205671 2229349 2271970 2209545 2304727 2419675 2232257 2241691
11262 2241691 2460273 2563126 2449876 2366775 2101918 2095301 2425489 2461791 2305877 2437854
11252 2437854 2396966 2132591 1986587 2183430 2323853 2268077 2087075 2091936 2294654 2154916
11242 2154916 1889540 1761116 1694145 1889614 1893615 2028569 1936999 1813674 1753470 2052407
11232 2052407 2233747 2110370 1981557 2067757 1937435 2018325 1847685 1861459 1917909 2100882
11222 2100882 2187559 1944096 2027987 2196717 2127028 2003966 2214692 2540652 2354514 2055290
11212 2055290 2083194 2086283 1968477 2063479 2049529 2120590 1861071 1832487 1985006 2065882 2196347
11201B196347J3955O1845J76001r3197j57393K34385K40977P9791K9201q8973
11191B692939J62432J59661R3890M4989K23954L62327J47074L0097k79544q3044
11181C554775j24423j37093R2172R451J44910k69866j71522n8851l98312m5507
11171B595734K36584K33860M14629L13710j41921o8504J82842K03992J97672L7629
11161D206227r4132Q2020j52627J0197K40603M31638J31774m02121k87883o3179
11151D102517l858M62235O7775l44081j10282j19499p7922j00669m7439O7494
11141C896271Q054k95223l39462k97675j07962L96358K14541j78535M2166K9120
11131C367653k55445j18841r6964J48939J77991k06656j9467L00854J33285j96417
$$ plain form
11201 2196347 2210302 2272147 2448148 2354951 2197558 2431943 2672920 2752711 2781912 2692939
11191 2692939 2855371 3015032 3108922 3153911 3377865 3740192 3887266 3917363 3637819 3554775
11181 3554775 3430352 3293259 3385431 3394882 3539792 3269926 3098404 3039553 2641241 2595734
11171 2595734 2832318 3066178 3480807 3794517 3652596 3584092 3766934 3970926 4168598 4206227
11161 4206227 4112095 4194115 4041488 4051685 4292288 4723926 4855700 4453579 4165696 4102517
11151 4102517 4098659 4560894 4628669 4284588 4174306 4054807 3976885 3876216 3828777 3896271
11141 3896271 3904325 3609102 3269640 2971965 2864003 3260361 3474902 3296367 3338533 3367653
11131 3367653 3112208 2993367 2896403 3045342 3223333 3016677 2997210 3298064 3431349 3234932
11121C234932j50028K30510J10780k19592j64276l30185k27503j22845j87270
11112B174523k65868J6972P0991j03084p3870j3226J87456Q3029j83842J59001
11102B052082K08482j83587j07591r6683j8929j08581J44409J88235j21890j38850
11092A817097M7019J70627Q0191j33484k73910l42347j5100R2442J47113J42932
11082A732580Q8747l6472K7089L1901j77216m50109r4189K34821L08617j7791
11072A647978p8985J92111J49792k30061m74222J09418K07142r6741j75632O5830
11062A316630J06085o0367J17316J95451j15182O2962J0257j50051k73549j48716
11052A060836K73220L59001N5446k51659k32457J18670L04567M7871j43195J30832
$$ plain form
11121 3234932 3084904 3315414 3426194 3206602 3042326 2712141 2484638 2361793 2174523
11112 2174523 1908655 1925627 1996618 1893534 1819664 1806438 1993894 2076923 1893081 2052082
11102 2052082 2260564 2076977 1969386 1872703 1853774 1745193 1889602 2077837 1955947 1817097
11092 1817097 1864116 2034743 2114934 1981450 1707540 1365193 1350093 1442535 1589648 1732580
11082 1732580 1821327 1784855 1811944 1843845 1666629 1216520 1122331 1357152 1665769 1647978
11072 1647978 1568993 1761104 1910896 1680835 1206613 1316031 1523173 1426432 1250800 1316630
11062 1316630 1422715 1362348 1479664 1675115 1559933 1622895 1633152 1483101 1209552 1060836
11052 1060836 1334056 1693057 1748503 1496844 1264387 1383057 1687624 1735495 1592300 1723132
11042A723132J97984O5138n2912R6348j16519R1994J79097J44155l1451m02509
11032A894457j04219J85166Q6073j45410n9293J07596k802L04246M90540O6602
11022B822956k96096j89166J1074j42341J09983M13604J49386P9597L5434q6392
11012B908039l7456j57399P2871j14182j77735J55271j44202J10451P6361m11330
11002B280689k12336Q1499N6602J50089p6033l83856l18246p9825J31302N8833
10992A688718K7265J81997K23583q152k08663k86338k64539Q4187K45791L6967
10982A720816J05058q9586K34287J63197k31267j87464J15261Q9521l43971j69259
10972A406593M1100k26958o7628J46218Q5923k23827j6568j25833J80109j77699
$$ plain form
11042 1723132 1921116 1986254 1933342 2029690 1913171 2005165 2184262 2328417 2296966 1894457
11032 1894457 1790238 1975404 2061477 1916067 1856774 1964370 1961568 2265814 2756354 2822956
11022 2822956 2526860 2337694 2348768 2206427 2316410 2730014 2879400 2958997 2994431 2908039
11012 2908039 2870583 2713184 2786055 2671873 2494138 2649409 2505207 2615658 2692019 2280689
11002 2280689 2068353 2149852 2206454 2356543 2280510 1896654 1578408 1498583 1629885 1688718
10992 1688718 1715983 1897980 2121563 2113411 1904748 1618410 1353871 1438058 1683849 1720816
10982 1720816 1825874 1736288 1970575 2133772 1902505 1715041 1830302 1919823 1575852 1406593
10972 1406593 1447693 1220735 1153107 1299325 1385248 1161421 1144853 1019020 1199129 1021430
10962A021430o0394J54542J39207L9499J0214j24156M9353J78228j94225k407
10952A211291J5594K75736k1096j5351j57119J90459J01974j9375N4598Q7584
10942A724295p5754k22796N9131M37574p394j47119j00397n0984L1635j75105
10932A473086k99188k05160m851j89430R9358j82704N6574Q4993p7697J57640
10922I12621K40408J97163J8141J51178R192l65997j66851o8419J99099R9740
10912A226275N0541j15369j60778O0056J56935j78799j47147M4723J73225R7543
10902A207205J53731K897j04394j83515j26452J6501k9395J398P3793J78181n5258
10891A134692k64948r245J52559R3533j79691j97247j82556J22830J93898k4251
$$ plain form
10962 1021430 961036 1115578 1254785 1294284 1304498 1180342 1229695 1407923 1213698 1211291
10952 1211291 1226885 1502621 1481525 1466174 1309055 1499514 1601488 1582113 1636711 1724295
10942 1724295 1648541 1425745 1484876 1922450 1915056 1767937 1667540 1616556 1648191 1473086
10932 1473086 1173898 968738 963887 774457 873815 691111 747685 832678 754981 912621
10922 912621 1153029 1350192 1368333 1519511 1528703 1162706 995855 927436 1126535 1226275
10912 1226275 1276816 1161447 1000669 1060725 1217660 1038861 891714 936437 1109662 1207205
10902 1207205 1360936 1363833 1259439 1075924 949472 965973 936578 937976 1011769 1189950 1134692
10891 1134692 869744 860499 1013058 1106591 926900 729653 547097 669927 863825 839574
10881H39574L9651R7710M15178J54315q3193k74348J5279L0929J77691K54102
10871A666888l8997j02777n2729k01833K24180N0168O6349j19347q8514P5911
10861A479299m6732j39772o630j04967J22483k05192J8177m9080j89358o6223
10851H12005J27820J82898K57476J07806j0922j77615j01590R3140K26193k13408
10841A303803m20706M4985L34464K32995J85521j39040j37744j56333r8636j47514
10831A001795k389K020j7801K29517l4733N2737J37122J14394k81442j64490P8362
10820A115092J8951j29927j03597K03006K33888o4510l98655k95736k0608K84957
10810H42861L07892J77487k9901l25919k4955M3546M5807j42252n0540j1540J16458
$$ plain form
10881 839574 879225 976935 1392113 1546428 1463235 1188887 1204166 1235095 1412786 1666888
10871 1666888 1627891 1525114 1472385 1270552 1494732 1544900 1611249 1491902 1403388 1479299
10861 1479299 1432567 1292795 1286165 1181198 1303681 1098489 1116666 1067586 878228 812005
10851 812005 939825 1122723 1380199 1488005 1477083 1299468 1197878 1291018 1517211 1303803
10841 1303803 883097 928082 1262546 1495541 1681062 1542022 1404278 1247945 1149309 1001795
10831 1001795 999406 1001426 983625 1213142 1178409 1231146 1368268 1482662 1201220 1036730 1115092
10820 1115092 1134043 1004116 900519 1103525 1337413 1272903 874248 578512 557904 842861
10810 842861 1150753 1328240 1298339 972420 947465 991011 1036818 894566 844026 832486 948944
10799I48944m8832Q2469j35114j35593m4794R7847J02181J88152J34348m2728
10789A146880l7843J07921j81127j0175Q8842j05661k04617j17763J66397j38694
10779G14160p395J61123P0348k15624L9226K06420o8217J03587M9129k4456J59105
10768A187406J75280J7620L0121j40831m80557j28526L74166m2550P3197J72746
10758A238072n6065N4292j07961j718n2054J46283J87986j53795o1196J05631
10748A299475J65601j2614k87257j4591R761J11309J61243J17476j58383j52505
10738A239515n23252R6354J34723k03173l46908N27913P13355K50319o6301o8244
10728A754301j08260p4389J37364J94265N608J5117l7114p8333J55272J95529
$$ plain form
10799 948944 900112 982581 847467 711874 667080 764927 867108 1055260 1189608 1146880
10789 1146880 1109037 1216958 1035831 1025656 1114498 1008837 804220 686457 852854 714160
10779 714160 706765 867888 938236 722612 761838 968258 900041 1003628 1052757 1028301 1187406
10768 1187406 1362686 1380306 1410427 1269596 789039 660513 1034679 992129 1065326 1238072
10758 1238072 1182007 1236299 1128338 1126620 1074566 1220849 1408835 1255040 1193844 1299475
10748 1299475 1465076 1452462 1165205 1150614 1160375 1271684 1432927 1550403 1392020 1239515
10738 1239515 716263 812617 947340 744167 397259 925172 1638527 1888846 1822545 1754301
10728 1754301 1646041 1571652 1709016 1903281 1908889 1924006 1886892 1808559 1963831 2159360
10718B159360j9485l01621J9992J34895r7684m1199j16619j65212N4903R8129
10708A725459K96024J01440J00571k949m78330k10518O0609P820M765Q0985O5887
10697A751763Q0200R4850M2933N6403J12036k1960J49099j95436p5741J86822
10687B180969k26426j8388J09511m6351N8068j58864K1222L0382M3726P85k37874
10676A756760L5203k049q5423O8879J26767j71143j64821L41895L01380k6643
10666B180805K2752J30692k4979J00478Q9451M1738j64469l8719K18135M2253
10656B598137J6414l0963K2044P9029P3873J922J32448J27954J12623K84153M77804
10645C895438r4898k52302K38974j01374r1834p546J09372J31871N3926l4189
$$ plain form
10718 2159360 2139875 1838254 1858246 1993141 1895457 1854258 1737639 1572427 1627330 1725459
10708 1725459 2021483 2122923 2223494 2220545 1742215 1531697 1592306 1600126 1604891 1685876 1751763
10697 1751763 1831963 1926813 1969746 2026149 2138185 2116225 2265324 2069888 1994147 2180969
10687 2180969 1954543 1936155 2045666 1999315 2057383 1898519 1919741 1950123 1993849 1994634 1756760
10676 1756760 1791963 1789914 1704491 1773370 1900137 1728994 1564173 1906068 2207448 2180805
10666 2180805 2203557 2334249 2309270 2409748 2499199 2540937 2376468 2337749 2555884 2598137
10656 2598137 2614551 2583588 2605632 2684661 2758534 2760456 2892904 3020858 3133481 3417634 3895438
10645 3895438 3800540 3548238 3787212 3685838 3594004 3586458 3695830 3827701 3881627 3847438
10635C847438J84583L48613J39377K68275N66330P59122M09420L15587L59696
10626G198441O03129O33577O41778O40300R10528J055774J227430J229819J509422
10617A5650198K095974K969510L656410M862725O269605P817922R503068J0558832
10609F3384244J0306129Q829835P329374O449075N516621M254424L032029L013238
10601A12114969O060763J0608462J4821085J6944031J5878649J3042883J0029330
10594A99500172Q217421N643665Q14054l730383m452946M93667Q743878J5397664
10586B30627192J8173320J6190799J1550980O815299L045976k235801j0374364
10579B73793401j8245213k0027470j4808558o720611M56442L853159L375394R63444
$$ plain form
10635 3847438 4032021 4380634 4520011 4788286 5354616 6113738 6523158 6838745 7198441
10626 7198441 7801570 8435147 9076925 9717225 10627753 11683527 12910957 14140776 15650198
10617 15650198 17746172 20715682 24372092 29234817 35504422 43322344 52825412 63384244
10609 63384244 73690373 82520208 89849582 96298657 101815278 106069702 109101731 112114969
10601 112114969 118175732 128784194 143605279 160549310 176427959 189470842 199500172
10594 199500172 207717593 213361258 214175312 210444929 205991983 206485650 215229528 230627192
10586 230627192 248800512 264991311 276542291 283357590 286403566 284167765 273793401
10579 273793401 255548188 235520718 220712160 213991549 214447991 218301150 221676544 222639988
10571B22639988j482051l839565p381705j2990555j7830265j8433806j4790609
10564A45891432r441913n001007l030090k596652l208828m128695n448272p232078
10556A05803897r196158j1232688j1543949r952121p796725o110484m913527l761182
10548D1297063l112571k287934k218372j821097j746555j486276j282057j361256
10540B5980945j393373j184140q05522q15907o19350o21000q89256p92975q56791
10531A8002631q76831r44047l49284o75220n55292l92784j84118m30844n51232
10522A3042979o81851n75669n6835j94292n29243m51351k05925k81161m0294k44034
10512I782324m38804l58749l12769l15106l47880J7321J69362k82426m22351n43079
$$ plain form
10571 222639988 221157937 217318372 209936667 196946112 179115847 160682041 145891432
10564 145891432 136449519 131448512 128418422 125821770 122612942 118484247 113035975 105803897
10556 105803897 96607739 85375051 73831102 63878981 56082256 49971772 45058245 41297063
10548 41297063 38184492 35896558 33678186 31857089 30110534 28624258 27342201 25980945
10540 25980945 24587572 23403432 22597910 21782003 21162653 20541653 19652397 18859422 18002631
10531 18002631 17125800 16181753 15832469 15157249 14601957 14209173 14025055 13594211 13042979
10522 13042979 12361128 11785459 11728624 11534332 11005089 10553738 10347813 10066652 10026358 9782324
10512 9782324 9343520 8984771 8672002 8356896 8009016 8026337 8195699 7913273 7490922 6947843
10502F947843o12531l62247j80102L2145j07658j20777l5653j31632j71957j66408
10492E091023l981j45333r5079j2470P848k28491k79616k88238P301j50731n2377
10481C849856N2267j47520m5310q5252k20351j56265Q3569r1459k40202j95017
10471B804316o3323p8762P1129J81872l3906k47769m5684l4052k22643j37681
10461B193497l39840k16813j40953q9942m8025N127L2502l5857k01836K5304j50272
10450A032892p2817J86396J91452N4993J19438O1191K5915j39690k39267k08376
10440A012127o2481j42177l0246P5671j60764K67426M23337k69581j80726m8387
10430H84199m8872N9971L02012p2352k90404j73363J29546J1288J15677m8848
$$ plain form
10502 6947843 6335312 5973065 5792963 5825108 5717450 5596673 5561020 5429388 5257431 5091023
10492 5091023 5087042 4941709 4846630 4834160 4842008 4613517 4333901 4045663 4052964 3902233 3849856
10481 3849856 3902123 3754603 3709293 3624041 3403690 3247425 3330994 3239535 2999333 2804316
10471 2804316 2740993 2662231 2733360 2915232 2881326 2633557 2587873 2553821 2331178 2193497
10461 2193497 1853657 1636844 1495891 1405949 1357924 1363051 1395553 1359696 1157860 1183164 1032892
10450 1032892 960075 1146471 1337923 1392916 1512354 1573545 1599460 1459770 1220503 1012127
10440 1012127 949646 807469 777223 852894 692130 959556 1382893 1113312 932586 884199
10430 884199 835327 895298 1197310 1124958 834554 661191 790737 802025 917702 868854
10420H68854K12552J43860l82067k17686q2224N9214L5529K51281R59j39776R4264
10409H44760j37244O2507j8281j48871j9599J91154J9109Q9023j305r0156R9387
10398H90484O4540j04585N0858J68760p5088l1669Q6659j98463j34524k4536O2332
10387G54768J03403k46070J4961R2785N6024J40861J18535k011k39010k54792
10377E39454n3764O7936R6662J67884q9706j80389J45522L0367K4347o7460r1036
10366E89817J51344J55185n8081q7664k5639q7957j5894k65555j99531Q5463J83247
10355D24735K01895K15712p6467r9698J97530K29021k38083m19619J30381r6285
10345D69122r6425J72085l7094j14439J61935J34203J10201O5779j85000J81979
$$ plain form
10420 868854 1081406 1225266 843199 625513 543289 602503 638032 889313 890272 750496 844760
10409 844760 707516 770023 751742 602871 583272 774426 793535 882558 881253 791097 890484
10398 890484 955024 850439 901297 1070057 994969 963300 1049959 851496 716972 692436 754768
10387 754768 858171 612101 627062 719847 775871 916732 1035267 1033256 794246 539454
10377 539454 485690 553626 650288 818172 728466 548077 693599 723966 748313 680853 589817
10366 589817 741161 896346 838265 750601 724962 637005 621111 355556 156025 241488 424735
10355 424735 626630 842342 765875 666177 863707 1092728 854645 435026 565407 469122
10345 469122 372697 544782 507688 393249 555184 689387 799588 865367 680367 862346
10335H62346q098j93343J57914k456J6250o3776k01575j01086j86028m3995K90101
10324E26254J4954k36091J3449R7351m822R4617k03002o0984Q4638O4686K03018
10313E94068k06169k27599j73375J09762J11295K51247J01493r0699l1947j89028
10303B49048j01126J07303l2998J20885L07441k5779j81090k24099p2591J07645
10293B54639P3469O9506l2781J1856r3941j43387l5597J61901j64022J23133P6248
10282C01024m00128R1226K64233J16515k30570k76352j08288M1890L46520J63377
10272C09447j30197n6584P1353j59331j02152J66874L3468K56952J84649L3482
10262F07961k26853j5958j29361r1787o9299k8776R2129K97835l3052j60081l5491
$$ plain form
10335 862346 854248 660905 818819 816363 832613 768837 567262 466176 280148 236153 526254
10324 526254 541208 305117 318566 415917 411095 505712 302710 241726 326364 391050 594068
10313 594068 387899 160300 -13075 96687 207982 459229 560722 470023 438076 249048
10303 249048 147922 255225 222227 343112 650553 624774 443684 219585 146994 254639
10293 254639 328108 397614 364833 376689 282748 139361 103764 265665 101643 224776 301024
10282 301024 -99104 -7878 256355 372870 142300 -134052 -242340 -200450 146070 309447
10272 309447 179250 122666 194019 34688 -67464 99410 132878 389830 574479 607961
10262 607961 381108 365150 235789 144002 74703 45927 138056 435891 402839 242758 207267
10251B07267P9222k46583j9926j18239m9233K70948L21244j00822n9124j03200
10241A81554P7661J28470K1302j05j21987L21656J84433k37148j32039p7332r6273
10230B50192Q7622R8545Q877j54769J5680O2832j16775l9607J29525K6792j53504
10219B15410j20956k32745k2315L42999J20294j41199Q8152j8588k22193p3403
10209f4544P612j91705o0300L16514K26522K4595L90801m9774n6467L2453j4570
10198E61137P2632r4983R5739l5998n9508j38283L7587n4233J54495J00923l12713
10187C26795m13548J8778M31839J4177J21075J91070O1447K1990J0366K74013
10177A058002J55330j36440l55954J62581J21457O4356p5844q8541m3942J70002
$$ plain form
10251 207267 286489 39906 19980 -98259 -147492 123456 444700 343878 284754 181554
10241 181554 259215 387685 408987 408882 286895 608551 792984 555836 423797 346465 250192
10230 250192 337814 436359 445236 290467 306147 368979 252204 212597 342122 368914 215410
10219 215410 94454 -138291 -160606 182393 302687 161488 249640 231052 8859 -64544
10209 -64544 -56932 -248637 -308937 7577 234099 258694 649495 599721 543254 575707 561137
10198 561137 633769 538786 634525 598527 539019 400736 438323 384090 538585 639508 326795
10187 326795 -86753 -67975 363864 378041 499116 690186 751633 773623 783989 1058002
10177 1058002 1213332 1076892 720938 883519 1004976 1069332 993488 904947 861005 1031007
10167A031007o4602m07119n7931K15325J80250L84639K00250n5457R8491q0459
10157A444394Q8953J05865j47615k11408j20039J32378M7720K68481K72738k1920
10147A859547K69627O6767m8647j84692m04504k01081j43909r7864j74112L7163
10137I78295M58670N9359K39453k2411k97483k10834k24817m4578r8433O2460
10127H99681J76944o5110Q8221J55363r3931k78782l64811j5950m2336j53056
10117C06233J16029n8251M2243j33781r5567L2942K44138K164k6590J22964k08115
10106C44409l99107j90328Q1022J35790j32047J38737J489R9267j66577r3948
10096a81293K85325L11827j77183M6812l622J58820J38129j17226j88002k97864
$$ plain form
10167 1031007 966405 559286 501355 716680 896930 1281569 1481819 1426362 1524853 1444394
10157 1444394 1533347 1639212 1491597 1280189 1160150 1292528 1340248 1608729 1881467 1859547
10147 1859547 2129174 2195941 2147294 1962602 1558098 1357017 1213108 1115244 941132 978295
10137 978295 1436965 1496324 1735777 1713366 1415883 1205049 980232 935654 837221 899681
10127 899681 1076625 1011515 1099736 1255099 1161168 882386 517575 501625 459289 306233
10117 306233 422262 364011 406254 272473 176906 209848 453986 456150 429560 552524 344409
10106 344409 -54698 -245026 -164004 -28214 -160261 -21524 -20035 79232 -87345 -181293
10096 -181293 104032 415859 238676 285488 281866 440686 578815 461589 273587 -24277
10086b4277J03415J99822O6262k43774k82360Q2008O4696m4124J43379K15584
10076B80631k4049k15597K60505m1382k10283R4768k60148R5994K46807J31800
10066C59046L125K810r8068m25881j49030J07497m8167j0375N5488K85243M5290
10055A26978M10926J01712j33317j93906k04077n3473j3074m2094l506j493N0822
10044D5498Q9243r0681k42758J94115j6567J19206J45205K21619L43750p8002
10034G30628k48703k92928m06268l3504M12070L25667j65678J63753m5717j90042
10024B49278j68117j48109M286M822P3913K91817J2439j38012j28176o5806M818
10013f847M9152J12040K57833J15606l15793k84242O4224Q0936j08121K75129
$$ plain form
10086 -24277 79138 278960 345222 101448 -180912 -98904 -34208 -78332 65047 280631
10076 280631 256582 40985 301490 260108 49825 144593 -115555 -19561 227246 359046
10066 359046 362171 364981 266913 -158968 -307998 -200501 -248668 -259043 -203555 81688 126978
10055 126978 537904 639616 506299 312393 108316 54843 41769 -325 -3831 -5324 45498
10044 45498 134741 44060 -198698 -4583 -21150 98056 243261 464880 808630 730628
10034 730628 481925 188997 -217271 -250775 161295 486962 321284 485037 439320 249278
10024 249278 81161 -66948 -62662 -57840 16073 307890 320329 182317 54141 -11665 -6847
10013 -6847 42305 154345 412178 527784 211991 -72251 -8027 72909 -35212 239917
10003B39917r5413K06785K65233M3097j70431l47711k00263n6714j67019K21062
9993f1457J01486r3533R6523J78562m2095k37960j76267q2878K88860M6628q760
9982I109K30468J39096P0523l23104k9431M2309J2204O8210J02940r5385m7214
9971A79725l103j75920j74512n925L02467o1890j10364m0286k17717k4490k24656
9960e56671J79560K91249O8070P6935J00877j38016l52281j41925R7906K85991
9950h8305M6928Q3765Q8421J85076k6023k81883j31481K9586K48514o7543J0146
9939I7201j93093J42148M29216j56726n43069l18852K64136J18364K17240J40277
9929A96842J75327J60982l26201l73146j49366K34129Q8572q2922J18805Q0280
$$ plain form
10003 239917 144504 351289 616522 659619 489188 141477 -58786 -115500 -282519 -61457
9993 -61457 40029 -53504 43019 221581 179486 -58474 -234741 -317619 -28759 17869 9109
9982 9109 239577 378673 449196 126092 96661 138970 151174 219384 322324 226939 179725
9971 179725 176622 702 -173810 -179735 122732 60842 -49522 -89808 -307525 -332015 -556671
9960 -556671 -377111 -85862 -17792 59143 160020 22004 -330277 -472202 -374296 -88305
9950 -88305 -41377 42388 130809 315885 289862 7979 -123502 -93916 154598 87055 97201
9939 97201 -95892 46256 475472 318746 -224323 -543175 -279039 -160675 56565 196842
9929 196842 372169 533151 206950 -166196 -315562 -81433 7139 -75783 43022 123302
9919A23302J18927J55635L694P8030m2776L394L4175O0226j08840L3593j98560
9908B60800l62616J2113r047O4420N5878j2722J26714J31121L2893l20074J0660
9897i860j85739J12553L02565K23548j40004k69976m8375J70381K51523O3537
9887D70153k374k93860l76296K4p4807J53374l2521K88667n4433j15666q4578
9876a22317P1432j28609K45482K18813q4823l66626k4879K42840k2989J58741
9866A87065P3375q8598j14403J78170J78048Q5086k16490k40780j56282M9409
9856f5400J13287K38288n6373j85598j20770J24745N3005p1400J02746j52585
9846b0055K02357J17831j05655m58119k24011J17003J46268O8835o7151K53705
$$ plain form
9919 123302 242229 397864 401558 479588 436812 440206 474381 534607 425767 459360 260800
9908 260800 -101816 -89703 -98750 -34330 21548 8826 135540 266661 299554 -20520 -9860
9897 -9860 -195599 -83046 219519 443067 303063 33087 -15288 155093 406616 470153
9887 470153 467779 173919 -202377 -202353 -277160 -123786 -156307 132360 77927 -37739 -122317
9876 -122317 -50885 -179494 65988 284801 199978 -166648 -191527 51313 28324 187065
9866 187065 260440 171842 57439 235609 413657 498743 282253 41473 -114809 -65400
9856 -65400 47887 286175 229802 44204 -76566 48179 101184 29784 132530 -20055
9846 -20055 182302 300133 194478 -263641 -487652 -370649 -224381 -155546 -222697 31008
9836C1008M9702r082L9895k00792J32491K4630q3089M909J00262M28810K10986
9825G29730K6246R0490l69649k24705J59570J02600j70011j03038j10989J01552
9815B31796K27679O7864J6289N1959l11057j3175j98607r8192K02176L41337k5068
9804D93001P274O2835N6234j75038k05058m3915K61901J66504K50823j27576n8419
9793F88566K78734J94658l05905n1443m8949K69524L26345k1893n5132J59846
9783A434351N95430M53489O38021M15529M32802J142589J799513K883499M305422
9774A4100645O595976P954130P127096M760578K254967J461256J492971l26777
9766D5420842n606924r947889r601634o382735l755148j965611j460572j356743
$$ plain form
9836 31008 80710 71628 111523 -89269 43222 67852 -15237 -10328 89934 518744 729730
9825 729730 755976 846466 476817 252112 411682 514282 344271 241233 130244 231796
9815 231796 459475 527339 543628 595587 284530 271355 72748 -25444 176732 518069 493001
9804 493001 500275 563110 619344 444306 239248 195333 457234 623738 874561 746985 688566
9793 688566 967300 1161958 856053 804610 755661 1025185 1351530 1329637 1274505 1434351
9783 1434351 2029781 2483270 3121291 3536820 3969622 5112211 6911724 9795223 14100645
9774 14100645 20696621 28650751 35777847 40538425 42793392 44254648 45747619 45420842
9766 45420842 39813918 29866029 20264395 13881660 10126512 8160901 6700329 5343586
9758E343586p26138m02839m4140j20614m58893l90583r0080J69721m8531k89828
9748B941661k61806j85219k17142p762j42390l33666k14809R3424L7573N8756
9738A768620n9223L033L019r788l2231l71421k96513K3088Q7599M906l31147K20192
9726A010134J71076q4989l6957K76013P394k00108n48O7894o3595l15218j77073
9715F54023j59360J18793K0802N2946r7693q1153O338k5434K0964j28221j64198
9704B17807K23434n4956k2444J44653j3365j23423j03718J45621p0852k97466
9694D5291O8673M1130j01440L54779J67886n1105j04323k18013P3497J48375r7238
9683C27512j45928J69017K51460J69445J6238l77167N9071K75988j0434p7317
$$ plain form
9758 5343586 4617448 4214609 4170469 4049855 3590962 3200379 3110299 3280020 3231489 2941661
9748 2941661 2679855 2494636 2277494 2269732 2127342 1793676 1578867 1672291 1709864 1768620
9738 1768620 1709397 1712430 1715449 1705661 1673430 1302009 1005496 1028584 1116183 1121089 789942 1010134
9726 1010134 1181210 1096221 1059264 1335277 1342671 1142563 1142015 1209909 1146314 831096 654023
9715 654023 494663 613456 634258 687204 589511 508358 514696 489262 510226 382005 217807
9704 217807 441241 386285 363841 508494 495129 371706 267988 413609 342757 45291
9694 45291 113964 155094 53654 408433 576319 525214 420891 202878 276375 424750 327512
9683 327512 181584 350601 602061 771506 787744 410577 469648 745636 735202 657885
9673F57885m61067L0773J34480O1218O5168m5622O695j7043n5483r4861L4409
9662C16552K38499L1312j18925j64123m9496P7499j3538J96130L24780N61563
9652A400253N16193L84981Q07683J152425K034114K356178J360554P37307L31450
9643A1081138N36251M35468l17843k153429k995758k297920j405446p29793l33093
9634A819575k15700j77466m24729k78159J76070k66744n5978M78020r9620k61992
9624F93277k92448n1861K5092J41746M724j71813J1920p9937J02382K70532k6887
9613F26727l59380p5933J16110l0081L73247P989l90973k53281P0615Q2106p2844
9602I4302P4461j12285r0510K00938O6230m7182q0912r2206J29004m1340M0419
$$ plain form
9673 657885 196818 227591 362071 423289 488457 442835 449530 432487 377004 282143 316552
9662 316552 555051 586363 467438 303315 253819 331318 317780 513910 838690 1400253
9652 1400253 1916446 2301427 3109110 4261535 6295649 8651827 10012381 10749688 11081138
9643 11081138 11617389 12052857 11735014 9581585 6585827 4287907 2882461 2152668 1819575
9634 1819575 1603875 1426409 1001680 723521 899591 632847 576869 1054889 955269 693277
9624 693277 400829 348968 374060 515806 520530 348717 360637 280700 383082 653614 626727
9613 626727 267347 191414 307524 277443 650690 658679 267706 14425 85040 167146 94302
9602 94302 168763 56478 -34032 166906 233136 185954 105042 12836 141840 100500 140919
9591A40919r5989l47820J37021M78657L36880J6270l92597j82598J93564m1018
9581B43289k22033j86595L5867l800J71753L11322K40528J33612j18029l28125
9571B77789n4177J11995l37971q6803L52317K11268j89429j5987k24259K49529
9561B94272J61720o6553j79936N5977l21516k93701K02961J46820N0229r4773
9551d4500j48426j68024p3074N8762R1141Q1090N2137J2555n2483l24848k74898
9540g90568M1893K75199M18569J72423J32450J81679J44178k47759j97251o5314
9530F5499k15682R1639K15039k01754k42599r6477L31683R8253j30159L11699
9520B27141K6072k64661k50363o2349K05456K04872j7086N556j02362j7M529r0101
$$ plain form
9591 140919 44930 -302890 -165869 312788 649668 665938 273341 90743 284307 243289
9581 243289 21256 -165339 -129472 -133272 38481 349803 590331 723943 605914 277789
9571 277789 223612 335607 -2364 -89167 263150 474418 284989 269002 44743 294272
9561 294272 455992 389439 209503 265480 -56036 -349737 -146776 44 50273 -44500
9551 -44500 -192926 -360950 -434024 -375262 -284121 -203031 -150894 -138339 -190822 -515670 -790568
9540 -790568 -748675 -473476 -54907 117516 249966 431645 575823 328064 130813 65499
9530 65499 -150183 -58544 156495 -45259 -287858 -384335 -52652 45601 -84558 227141
9520 227141 253213 -11448 -261811 -324160 -118704 86168 69082 74638 -27724 -27741 -23212 -113313
9508a13313l16565n6511K46921L9626m7461j69193R4762m8382Q1066J36922J2809
9497a39319n408K3033L11670o2345k75059K0341K38563J89404K66218P2044l48013
9486B91129l25116m2604o4029O1508J85502k78870j22527m9533P0868R6448J95307
9475A8083j90748l54736J22453K87769J73576n6111o5392n314K1139J33370j02820
9464a8731j23547L5739R9796J32033J3922l2043q2924p160J91946J54793j79258
9453A84566j45468O4128J7100K7011N3413r863j53301N0567l60838j46115P1669
9442c47131K44848K66007J82800k23466k89928p0220j38996M300K1210J74505
9432a76071K68981o4809j96886p0875j1784N5035K35774m7978L2456J83558l2422
$$ plain form
9508 -113313 -429878 -486389 -239468 -199842 -247303 -416496 -321734 -370116 -289050 -152128 -139319
9497 -139319 -144727 -121694 189976 127631 -147428 -127087 111476 300880 567098 639142 291129
9486 291129 -33987 -76591 -140620 -79112 106390 -172480 -295007 -344540 -273672 -177224 18083
9475 18083 -172665 -527401 -404948 -117179 56397 286 -65106 -70420 -49281 84089 -18731
9464 -18731 -142278 -106539 -6743 125290 139212 107169 24245 17085 209031 363824 184566
9453 184566 39098 103226 120326 147337 200750 190887 37586 88153 -272685 -418800 -347131
9442 -347131 -102283 163724 346524 123058 -166870 -237090 -376086 -371786 -350576 -176071
9432 -176071 92910 28101 -168785 -239660 -251444 -196409 39365 -8613 23843 207401 174979
9421A74979j52816l6974K24332Q8863l20841j57978o0577K02284Q0225k48890
9411b07393k0412j71996K18393q7480n0622N9747J05527K1972Q1650l5401J47737
9400F1722L2605M5233Q9104l8367j33580n9417J41215l6660K6807q6109j56691
9389a14138J63004M9760j69102k39696m7771J18820K28667K31417j62595L8479
9379I6845k7690j26283L46513q342j2871K38619p4760j60869m27359j08724K10150
9368e4771l5168K6150j0928j97260J49767K12720K37535J52809J87034k7246l63811
9357B76831j45623J9222j36321J53710N1854K24508J35246r1992p1642Q681l22841
9346A01633j60987P0671P4300J80507k44110k78860q931j86043Q5411J85966j60271
$$ plain form
9421 174979 22163 -14811 209521 298384 -22457 -180435 -241012 -38728 41497 -207393
9411 -207393 -227805 -399801 -181408 -268888 -319510 -259763 -154236 -132264 -50614 -86015 61722
9400 61722 94327 139560 228664 190297 56717 -2700 138515 101855 128662 42553 -114138
9389 -114138 48866 98626 -70476 -310172 -357943 -239123 -10456 220961 58366 96845
9379 96845 69155 -57128 289385 281043 268172 506791 432031 271162 -156197 -264921 -54771
9368 -54771 -89939 -63789 -74717 -271977 -122210 90510 328045 480854 667888 640642 276831
9357 276831 131208 150430 14109 167819 219673 444181 579427 487435 415793 424474 101633
9346 101633 -59354 11317 85617 266124 22014 -256846 -265777 -451820 -366409 -180443 -340714
9335c40714m9345K43623J66355r8708l0905K7414K23557m8408k38694O7203J27190
9324D8568M4483L4675J4486k0929Q1521O3825R0753K4963J8228l40473P9500J9138
9312A58738o4721K8006K4850j45755J68356L01015J54963j94624k49606M3372
9302B24594o4125k20847j63894J97038J11486j00617M4753j49955j34770J37885
9292a18452J40181j41389P8806J10801j27368k23144q7477j70026K85159J28976
9282a23933J13922P6503J59255m62950k07698J32933L32555L32250J30098j84056
9272B98879k92978k54469o3091p5837j2002K42477J57122j86308Q4897J85473
9262H4163r552q4629L18247j91858R4383k2912l0425k48667L4517K11439J45655
$$ plain form
9335 -340714 -390059 -146436 19919 -78789 -109694 -82280 141277 92869 -145825 -78622 48568
9324 48568 93051 127726 142212 121283 202804 266629 357382 382345 400573 60100 139600 158738
9312 158738 94017 122023 146873 1118 169474 470489 625452 430828 181222 224594
9302 224594 160469 -60378 -224272 -27234 84252 -16365 28388 -121567 -256337 -118452
9292 -118452 21729 -119660 -40854 69947 -57421 -280565 -368042 -538068 -252909 -123933
9282 -123933 -10011 66492 225747 -237203 -444901 -311968 20587 352837 482935 298879
9272 298879 5901 -248568 -311659 -387496 -399498 -157021 101 -186207 -101310 84163
9262 84163 74611 -10018 308229 116371 210754 187842 157417 -91250 -56733 154706 300361
9251C00361l3861j75172k6028J20387J02439N3449j64908l94377K59993J76000
9241B18283J9270J10152n513k59063j01774K10523J11911p8378n0073L77166J63289
9230G15793k91680l54711k12461J49716K00891k06299j37250Q4609n928j13854
9220a71174K8560j38472J0434N5568L5418P084J00784J24947J03216j5592o3971
9209G6802l5934K2823q1925j72556j11351m2276J39691j08136k9594R7750O0373
9198a84333N2604K60954P9932p1481j74728j59864m1005r4262Q4153K52604L03216
9187C07790J7688m0884k91652m5526m1794j26159j7623J71215j17103m5025j97341
9176d26414l83112J38200K71715J57946m458j41964J75023L1772O5267J20719
$$ plain form
9251 300361 266500 91328 65300 185687 288126 341575 176667 -217710 42283 218283
9241 218283 237553 347705 342192 83129 -18645 191878 303789 225411 175338 552504 715793
9230 715793 424113 69402 -143059 6657 207548 1249 -136001 -51392 -57320 -171174
9220 -171174 -142614 -281086 -270652 -215084 -179666 -172582 -71798 53149 156365 140773 76802
9209 76802 40868 63691 -18234 -190790 -302141 -344417 -204726 -312862 -342456 -244706 -184333
9198 -184333 -131729 129225 209157 137676 -37052 -196916 -237921 -332183 -248030 4574 307790
9187 307790 325478 284594 -7058 -52584 -94378 -220537 -238160 -66945 -184048 -229073 -426414
9176 -426414 -809526 -671326 -399611 -241665 -246123 -388087 -213064 -181292 -116025 4694
9166D694J47437m2981j6462j58276j56430k7525O1828R9994J53831m127J20772
9155A82755K12008k2802l94248j96930j02302J49408Q6877k85104q1260j35962
9145e87560Q4802J91106M16132J61061j26693K339K74o0029n0457J54795K17154
9134D02924j7416J66108j63968k07772l23449k66182K61686M2179R8946j20929
9124a27873K24091J58599q5238M3908j37642k92792r1182Q2881M5895j16090K0281
9113b75162J32565J45145J70882L4153l92311k54789K73765K68089J61868j16147
9103A48058k54933m9982J09700Q2957k71555j3612K6640j81720q1586L68755K31304
9092A14026K50467P9257m19178k13797j02576J07062K36497J59381q8306k439
$$ plain form
9166 4694 152131 109150 92688 -65588 -222018 -249543 -187715 -87721 66110 61983 182755
9155 182755 394763 371961 -22287 -219217 -321519 -172111 -85234 -370338 -451598 -587560
9145 -587560 -502758 -311652 104480 265541 138848 141187 141461 81432 30975 185770 402924
9134 402924 385508 551616 387648 179876 -143573 -409755 -148069 -105890 -6944 -127873
9124 -127873 96218 254817 169579 213487 75845 -216947 -308129 -225248 -179353 -295443 -275162
9113 -275162 -142597 2548 173430 207583 -184728 -439517 -165752 102337 264205 148058
9103 148058 -106875 -156857 -47157 35800 -235755 -249367 -222727 -404447 -486033 -117278 114026
9092 114026 364493 443750 24572 -189225 -291801 -184739 51758 211139 122833 120394
9082A20394O6137j25327O0540p1673k68214k88060N1380K03920J57525K17220
9072A23842j7814r0189n9397k17730n5967j99642J85737K23021j365n1480m9948
9061b10932j7568m9551j04861J07550J7436j54516P4652K91306L8408j13241K63811
9050A42494L0921J42780j85180r9189K41971L39662j55167l51456n9801j66348
9040a19313J71694j43899k23278K25303p0638j64848j44361K38474R8793J50001
9030A7928j18869N7136J70192q3951J09798p4933l2589m2491k0188p3244l52536
9019d43747J57410K49173K17546K11675m13480m13883J66249K53523l525q3612
9009a02671p0714j15433L8314O5406R4020K6022J22806J58976j15740r7399n2815
$$ plain form
9082 120394 186531 61204 121744 50071 -218143 -506203 -454823 -250903 -93378 123842
9072 123842 106028 15839 -43558 -261288 -317255 -516897 -331160 -108139 -109504 -160984 -210932
9061 -210932 -228500 -278051 -382912 -275362 -257926 -412442 -337790 -46484 -8076 -121317 142494
9050 142494 173415 316195 131015 31826 273797 613459 458292 106836 47035 -119313
9040 -119313 52381 -91518 -314796 -89493 -160131 -324979 -469340 -230866 -132073 17928
9030 17928 -100941 -43805 126387 42436 152234 77301 44712 2221 -17967 -91211 -443747
9019 -443747 -286337 -37164 180382 392057 -21423 -435306 -269057 -15534 -19059 -102671
9009 -102671 -173385 -288818 -250504 -185098 -91078 -65056 57750 216726 100986 3587 -49228
8998d9228p7569J51062J34980j52836J35448J04104N8455J07417l67660J1731
8988E5904Q1119J03693N1029l11190j2123J6966o5992n7395J72905L3250m29227
8977c61061n6655J07543P5564L5689j06845J08399K0425J60840J66565r8067q4698
8966c2301j24184k07556L02664K34999K18632M4753k74511j50686J49468k61708
8956a00430o6185J34974n7316L690k31491J65829O3494j05943j29750j83787K5774
8945d81141j5597Q7022J87308j143J34972K64823j82968j02310J19477m0340j83014
8934b12911k95109m1505M59573M62102j42234j11653j42649Q9920Q8303j44028
8924I809k53135K99737n1233l70913l008L75953m6741k52128J345K17023J40818
$$ plain form
8998 -49228 -126797 24265 159245 6409 141857 245961 304416 411833 44173 55904
8988 55904 137023 240716 291745 -19445 -31568 -14602 -80594 -137989 34916 68166 -361061
8977 -361061 -417716 -310173 -234609 -198920 -305765 -197366 -176941 -16101 150464 52397 -32301
8966 -32301 -156485 -364041 -61377 173622 392254 437007 162496 11810 161278 -100430
8956 -100430 -166615 -31641 -88957 -85267 -316758 -150929 -87435 -193378 -323128 -506915 -481141
8945 -481141 -496738 -409716 -222408 -223551 -88579 176244 -6724 -109034 10443 -29897 -212911
8934 -212911 -508020 -549525 -89952 372150 229916 118263 -24386 65534 153837 9809
8924 9809 -243326 56411 5178 -365735 -368743 7210 -39531 -291659 -290314 -73291 67527
8913F7527K56905j31405k96525J58097J32709k52039J10100m3260j08976J27061
8903B0194J37814l00820j69370L7701k60421o9904M23627K92676J97217J42765
8893D51479l12455k58772r3669N5422K12538J76262j77015J55608k6144J81362
8883C64616N3866m19215n41706j62061J90557P6335L4778J28020j5159l3421p5343
8872c98733j61071K2226J27056J91511K40897K8220n083p8461l04875o6138J67538
8861b36913O6218K6718K04150J89817l6289k43821j31387r4223P1493n8443M4074
8850a98606r951m0281j87140J9115J77297Q2782J32919J69441J06723j77625k18814
8839a44140j8523K52080J80873J40619J36289j89166j23476L19842J09929k93467
$$ plain form
8913 67527 324432 193027 -103498 54599 187308 -64731 45369 2109 -106867 20194
8903 20194 158008 -142812 -312182 -274481 -534902 -604806 -181179 111497 308714 451479
8893 451479 139024 -119748 -213417 -157995 54543 230805 53790 209398 183254 364616
8883 364616 418482 -733 -542439 -704500 -513943 -437608 -402830 -274810 -289969 -323390 -398733
8872 -398733 -559804 -537578 -410522 -219011 21886 50106 45023 -33438 -338313 -404451 -236913
8861 -236913 -170695 -143977 60173 249990 213701 -30120 -161507 -255730 -184237 -242680 -198606
8850 -198606 -208557 -248838 -435978 -416863 -239566 -156784 -23865 145576 252299 74674 -144140
8839 -144140 -162663 89417 270290 410909 547198 358032 234556 554398 664327 370860
8829C70860q9158j62953j89770J03814r73J44023r4208k0009j79520k18185j23280
8818d59359K28388j93657j34030j60997J90401K63357j82850o2583J97484K32993
8808h0853J50723P5851k9808l5661j61157J67069N2007J93237K46766k9670k98037
8797B50467j04502l0655M3685J15880N7629o0206o774j62213m7305R6353O2721
8786B15080o8041l59215k45383k82577J191K65137L86966P2732j79836J9803N6417
8775a17726j2300Q1515J01642J95494j2457L5414J49937j74367l81597R5097K00645
8764A61297p4596j40478n4589M3354R2572j0904N6271j05247j33284r5627r196
8753b70427J95028K51393j77162J85136R8137n8552J76759j28642m50780q3750
$$ plain form
8829 370860 281702 118749 -71021 32793 31820 175843 81635 61626 -117894 -336079 -459359
8818 -459359 -230971 -424628 -558658 -719655 -529254 -265897 -448747 -511330 -313846 -80853
8808 -80853 69870 145721 115913 80252 -80905 86164 138171 331408 578174 548504 250467
8797 250467 145965 115310 158995 274875 332504 272298 265524 103311 56006 152359 215080
8786 215080 147039 -212176 -457559 -740136 -738945 -473808 -86842 -14110 -193946 -174143 -117726
8775 -117726 -130026 -48511 53131 248625 236168 271582 421519 247152 -134445 -39348 161297
8764 161297 86701 -53777 -108366 -65012 27560 16656 72927 -32320 -165604 -261231 -270427
8753 -270427 -75399 175994 -1168 183968 282105 223553 400312 271670 -179110 -262860
8743b62860K06222q7372N62r419m864J50134J3371J9147K31264K12237l0555K29491
8731F67358k08134m80324k45252r169J17173n7173l42708K1022L06916J7574J03943
8720a08774K586n9406J54900J37757K9452J30987j25621m0112j25846j74033k56875
8709d34985m9J54084M0019K37757K75812J90732l96879l52408O6405j15100J33413
8698b01199k4314J97186j7136J29957Q3033J9580k374o4869n7101k08831M8686
8687i7382J65173M4218J73250K27298M4878k80418m4987j19903j51179l5533M0894
8676c3691J2668J46753J3170l5636r3341l4185j48938o2306L77151J38621Q966
8665B89232p0701j54001K5103J10477r4249J64731K76985m2701m52684k02745
$$ plain form
8743 -262860 -56638 -144010 -143448 -152867 -157731 -7597 5774 24921 256185 468422 437867 667358
8731 667358 459224 -21100 -266352 -275521 -158348 -215521 -558229 -537207 -230291 -212717 -108774
8720 -108774 -106188 -165594 -10694 127063 156515 287502 161881 121769 -4077 -178110 -434985
8709 -434985 -435034 -280950 -240931 -3174 272638 463370 66491 -285917 -219512 -334612 -201199
8698 -201199 -225513 -28327 -45463 84494 167527 187107 184733 119864 62763 -146068 -97382
8687 -97382 67791 112009 285259 512557 557435 277017 232030 112127 -39052 -74585 -33691
8676 -33691 -21023 125730 138900 103264 9923 -24262 -173200 -235506 141645 280266 289232
8665 289232 218531 64530 89633 200110 105861 270592 547577 504876 52192 -150553
8655a50553J38556Q2572K9796q441J25435L3951j74215k10563j588p6046K10885
8644b11p6715K224J13758m2071p2612R2685l3472j63145o0857J27859j50286l27304
8632e90147L2037L41737P5088J31012J32613n9027L0835q7340M7873j13020l00096
8621c58435J4024K55706N6443Q4209j55784N5975J4254l15003l34276p5038J35456
8610f22469R1696R0781P0333J4942K67761J10900j69995k15671M96347K51867
8600C86492r1418J11921K02330m08886l61590p1643K02862n1082j57682k59875
8590d98571l1154L35282K96536K75853J15048j96838k23711j70415J37103J33136
8580A72269K12547J59833O8122l532N1458O9300j54412l90133k61708r4163m6880
$$ plain form
8655 -150553 -11997 70575 100371 91930 217365 251316 77101 -133462 -135050 -211096 -211
8644 -211 -76926 -74702 39056 -3015 -75627 17058 -16414 -179559 -240416 -112557 -262843 -590147
8632 -590147 -558110 -216373 -141285 -10273 122340 63313 94148 6808 54681 -58339 -358435
8621 -358435 -344411 -88705 -32262 51947 -103837 -47862 -33608 -348611 -682887 -757925 -622469
8610 -622469 -530773 -439992 -369659 -354717 -86956 23944 -146051 -361722 134625 386492
8600 386492 295074 406995 609325 200439 -161151 -232794 -29932 -81014 -238696 -498571
8590 -498571 -529725 -194443 102093 377946 492994 296156 72445 -97970 39133 172269
8580 172269 384816 544649 612771 609239 660697 729997 575585 185452 -76256 -170419 -217299
8569b17299J31000K0231J7276J12567N843l6899r9817J9913n4606m6069O41K25962
8557G8743L22175j03872M9935j6590J3455n2087q058J29483K53138r9899P731
8546E74154q9220k6023k12702K3736r8870j51079j62588J07735L80267J24939
8536D70349J4386J97262M20027K33667P6187O2786O55996O26846Q45491J846742
8526E449739K381081J842968R91490L37202K63416N49661k76297j597702k559690
8517G381868k204876j348248r50925m49581j69072n46733j05496J8604j33540
8508A492001J20793k08188J8227M0407j77312j92984l6107j66609N2929j1609
8498I31548L36242N46780J34330l42030p9842P1857J68809J24106Q218K20807
$$ plain form
8569 -217299 -86299 -66068 -48792 63775 69618 32719 -67098 -47185 -101791 -147860 -147219 78743
8557 78743 400918 297046 346981 330391 343846 291759 283701 413184 666322 566423 574154
8546 574154 484934 458911 246209 269945 171075 19996 -142592 -34857 345410 470349
8536 470349 484735 681997 1102024 1335691 1411878 1474664 2130660 2757506 3602997 5449739
8526 5449739 7830820 9673788 10665278 11002480 11265896 11815557 11539260 9941558 7381868
8517 7381868 5176992 3828744 2877819 2428238 2259166 1712433 1606937 1625541 1492001
8508 1492001 1612794 1404606 1422833 1463240 1285928 1092944 1056837 890228 943157 931548
8498 931548 1267790 1814570 1948900 1606870 1527028 1598885 1767694 1891800 1900018 2120825
8488B120825K57216K85742N05889P79228J406488K014207L473514M413764L803583
8479A9060456K001783M19983N85382J204422K82082l428415n629806m977339k915286
8470F603262j581020p55665n52667m09843q6050m27888l84773j18754j7245j72588
8460B096769J5803n2858j84302J24276k64849j46066J031j03437r4732K65490
8450A657125k2478l9008P7312l0794L1033J92086Q581J21006J23204J96670M48350
8439B763087L60153Q91829J828044K175679J693960J017091M02600J89739M78268
8430A1800450K8148j872338k655652k139618j637564p60506k41946m17198l64995
8421A738781j70272J36579L3664k8386j83564k47785k39151J50476J36866m430
$$ plain form
8488 2120825 2378041 2663783 3169672 3948900 5355388 7369595 10843109 15256873 19060456
8479 19060456 21062239 21482222 22067604 23272026 23554108 20125693 14495887 9518548 6603262
8470 6603262 5022242 4266577 3713910 3304067 3218017 2790129 2405356 2286602 2269357 2096769
8460 2096769 2112572 2059714 1875412 1999688 1734839 1588773 1589804 1486367 1391635 1657125
8450 1657125 1634647 1595639 1672951 1642157 1673190 1865276 1873857 1994863 2118067 2314737 2763087
8439 2763087 3123240 4015069 5843113 8018792 9712752 10729843 11132443 11322182 11800450
8430 11800450 11828598 9956260 7300608 5160990 3523426 2762920 2520974 2103776 1738781
8421 1738781 1568509 1705088 1738752 1710366 1526802 1279017 1039866 1190342 1327208 1322778
8411A322778j74139r1126j59455r7082J25653J63431k98310r1938P9853j92819
8401E86846O3945j60452j02131j50913o5700N5333J71966J60974q291j32137Q6446
8390E05886k38491m1314j41748P940Q7728o7731K7402j81841j96824J97561N1066
8379I634m8068j46683k94798j01349J95014L35062K98017l3119k00707J87823
8369B00826P1510j22171j2753j62581k23615Q8527p9788L0152l1888k43208K52275
8358b32714K74778P6780P563j26623j86337K06426K59963Q1445j37550m25456
8348b01725J49309K6316m4205j71982J57819J68411J95570j28325l65510n5413
8338b69735J59414j51307K19998O8828k06097J1054L83527J02589k48905j34524
$$ plain form
8411 1322778 1148639 1057513 898058 800976 926629 1090060 791750 699812 779665 586846
8401 586846 650791 490339 388208 237295 171595 226928 398894 559868 551577 419440 505886
8390 505886 267395 226081 84333 92273 180001 112270 139672 -42169 -238993 -41432 9634
8379 9634 -38434 -185117 -479915 -581264 -386250 -51188 246829 213710 13003 200826
8369 200826 272336 150165 137412 -25169 -248784 -160257 -240045 -209893 -241781 -484989 -232714
8358 -232714 42064 118844 126407 -216 -186553 19873 279836 361281 223731 -201725
8348 -201725 -52416 -26100 -70305 -242287 -84468 83943 279513 151188 -214322 -269735
8338 -269735 -110321 -261628 -41630 27198 -178899 -167845 215682 318271 69366 -65158
8328f5158J90626K87081R5304k81059m18801l2093K49270M1178j68990P4332J38212
8317A09902j78217j93994N3967J55312K98413J95166M2951N9741k76204M811p6328
8306A95520j5435q1563j11582l7399m5625k21000K52168J38110J45733K02614
8296D21541j17126l2599O736K10753k853k84349l9462k09775J38808R8891M0622
8285B31187k11992l05452N7928O5134K65012r8756k4824q8712j28482J93795j36639
8274a81801j57297j02186K83008M62895N2808j69365j36147k07J46369j08907
8264H9170m8945O4479O6189l0792p0680j99907R9155J25789j20577j80188K7799
8253a78508n8407o3732q5239L706L69710L49917j87387j61708M8488K01270P5159
$$ plain form
8328 -65158 125468 412549 507853 226794 -192007 -224100 25170 66348 -102642 -28310 109902
8317 109902 -68315 -262309 -208342 -53030 245383 440549 483500 543241 267037 271848 195520
8306 195520 180085 98522 -13060 -50459 -96084 -317084 -64916 73194 218927 421541
8296 421541 304415 271816 278552 489305 486452 202103 162641 -47134 91674 190565 231187
8285 231187 19195 -286257 -228329 -163195 101817 3061 -21763 -110475 -238957 -45162 -181801
8274 -181801 -339098 -441284 -158276 304619 357427 188062 51915 51708 198077 89170
8264 89170 40225 104704 170893 140101 69421 -130486 -31331 94458 -26119 -206307 -178508
8253 -178508 -236915 -300647 -385886 -382180 -12470 337447 150060 -11648 36840 238110 313269
8242C13269N5814n7052k17292m7698J03019p6026k82465j78748j01586J10493
8232c78272L77096p1015O0369K31329M105j66081l3684J22086k83959m6831J65872
8221a8985J74417j31225l44567L619M3611K0646O7844l0066J25521L02499J43853
8210C57167k44857J25899J10674l27373j69344M9963q5005J60908J67591j04461
8200D1162r0093J02810q0434R7439J597k23981j94349M2266Q8687o4674j1345
8189b90915J9112k16236k76435K42921K82662M3054J2533J73081j479K53097M72683
8178G14078n3781l35687k12712N9426O8854k79636o7502O2880j2252J3179J23574
8167H0421j17826k37170J27853P2112j96977k81819J26602K40766J91790N9482
$$ plain form
8242 313269 369083 312031 94739 47041 150060 74034 -208431 -387179 -488765 -378272
8232 -378272 -1176 -72191 -11822 219507 223612 57531 23847 145933 -138026 -184857 -18985
8221 -18985 155432 24207 -320360 -316741 -273130 -252484 -184640 -214706 -89185 213314 357167
8210 357167 112310 238209 348883 21510 -147834 -97871 -182876 -21968 145623 41162
8200 41162 -48931 53879 -26555 70884 72481 -151500 -345849 -303583 -214896 -279570 -290915
8189 -290915 -271803 -488039 -764474 -521553 -238891 -195837 -183304 -10223 -11702 241395 714078
8178 714078 660297 324610 111898 171324 240178 -39458 -106960 -44080 -56332 -43153 80421
8167 80421 -37405 -274575 -146722 -74610 -271587 -553406 -426804 -186038 5752 65234
8157F5234k83148j55603r8244n2821J6914L0750j16284M1494l8348R6256K84210
8146b09590O9190M2256n4493k2407n63j39883J14209J60153j8015q6151K0309
8135a24985K26449M9344J23050j11119j76770O6397Q2094j06109j44554K5075
8125i1128J34138L3655j73984k54014Q2004r2159M1859K03968J55402q2147K0538
8114b1868M0875J7819J40628L6655K380l8650J56845j33019k31857J91574l0878
8103A30504k1966J29634j91467Q4111m4900k8222N2786K4618R7021J04809K8529
8092C65457l98590m8226K69943R3461K18690j39611m10125k30283k05821J66456
8082c18649K25843P1913k22034j16986J29462K00834j00485P0719K27812j57849
$$ plain form
8157 65234 -217914 -373517 -471761 -524582 -507668 -476918 -593202 -551708 -590056 -493800 -209590
8146 -209590 -140400 -98144 -152637 -175044 -175607 -315490 -201281 -41128 -59143 -145294 -124985
8135 -124985 101464 150808 273858 162739 -14031 52366 134460 28351 -116203 -91128
8125 -91128 43010 76665 -97319 -351333 -269329 -361488 -319629 -115661 39741 -42406 -21868
8114 -21868 19007 36826 177454 214109 216489 177839 334684 201665 -30192 161382 130504
8103 130504 108538 238172 46705 130816 85916 57694 110480 135098 232119 336928 365457
8092 365457 -33133 -81359 188584 282045 500735 361124 -49001 -279284 -485105 -318649
8082 -318649 -92806 -20893 -242927 -359913 -230451 -29617 -130102 -59383 168429 10580
8072A0580j31677J81790K0959j57024N3816J8129l25486n1951n1118L00090J73402
8061D1510l84276K60037J72276k58515j95097K16644j4913N5338K29778J98250
8051C21032k35191m5063R9296j48325k50338J31728M43782m3382j81065K69444
8041C61918R7498O2999l2750m02474j14265J49444k07330l3438j68285l5017J4923
8030c06777J0460j08621J55504q8805K83469n111J5159k41118q9120J37154k62105
8019d99911j64918p9691m5526J37397L4330p6045J15190p220K36792Q6783k41503
8008e04322L133J51372R0216M874R7565K1079j00846K07683q8264k87336O413
7997c98433j42659l5299L06621k19677K4410K29387j53830N3441N93597K29806
$$ plain form
8072 10580 -121097 60693 81652 -75372 -21556 -3427 -328913 -380864 -431982 -131892 41510
8061 41510 -342766 -82729 89547 -168968 -364065 -147421 -162334 -106996 122782 321032
8051 321032 85841 40778 140074 -8251 -258589 -126861 316921 273539 92474 361918
8041 361918 459416 522415 489665 87191 -27074 122370 -84960 -118398 -286683 -321700 -306777
8030 -306777 -296317 -404938 -249434 -338239 -54770 -59881 -44722 -285840 -374960 -237806 -499911
8019 -499911 -664829 -744520 -790046 -652649 -618319 -694364 -579174 -586394 -349602 -262819 -504322
8008 -504322 -501189 -349817 -259601 -254727 -157162 -136083 -236929 -29246 -117510 -404846 -398433
7997 -398433 -541092 -576391 -269770 -489447 -465037 -235650 -389480 -336039 257558 487364
7987D87364k40990j39262r951K5694q8133K1834j39566M8605N0135J89823j45723
7976E9830l91519l0023l9370K60330j17152k51827J74115J57069J12069J02398
7966C5920J99532J09189j73926o3787N7077j50802R7522J13208j69m3574r4730
7955H5460J12300j09803l02632j64769J08706K28649j48122q7716q9069J23477
7945b43519J2960L9477K11414O1918J27336j9500k41203m4970j6935R6874j81505
7934a97653j32072J51345J28195q489k1423j12162R056K7868r1058j63165l761
7923d13319J39736J51901k6084l8493j69773K67591J62182R288J36642j00631
7913A19040J24884O628j55167l22158R3771J68711n9169q3635l77j1949J2260
$$ plain form
7987 487364 246374 107112 97161 122855 34722 56556 -83010 -34405 15730 205553 59830
7976 59830 -331689 -361712 -401082 -140752 -257904 -509731 -335616 -178547 -66478 35920
7966 35920 235452 344641 170715 106928 164005 13203 110725 223933 223764 180190 85460
7955 85460 197760 87957 -214675 -379444 -270738 -42089 -190211 -277927 -366996 -243519
7945 -243519 -230559 -191082 20332 82250 209586 190086 -51117 -96087 -113022 -16148 -197653
7934 -197653 -329725 -178380 -50185 -58674 -80097 -192259 -183203 -155335 -246393 -409558 -413319
7923 -413319 -273583 -121682 -147766 -186259 -356032 -88441 73741 83029 219671 119040
7913 119040 243924 250552 95385 -226773 -133002 35709 -23460 -107095 -107472 -119421 -107161
7902a07161j68836L8507L57426R0869j29243Q7124J45512k40547j80461k35736
7892c42546L7446Q5410R1923N4625K68164l22614k67161m1617K82658L24740O6078
7881B37106K75253k48155j94838k08200k84409K27173J07710P7456J55618m7732
7871I6982l88704j71491O8930K46387o8090P4902p4053m4923R0438P2898M1040
7860e5684J4755j41272J3668R9632J09223j91629J14997j21467J05467J51136
7850I8826M1285l54863k11289p8586q5833J0002o3848J14921J4510Q5116J76484
7839b53275J13838J11080k3271K4882k16723P5198M8039j6157K3624J40915o9974
7828d1824o4859l72294j71119R9971L2602o826K19388L4723k11963r1223L19542
$$ plain form
7902 -107161 -275997 -237490 119936 210805 81562 168686 314198 73651 -106810 -342546
7892 -342546 -305100 -219690 -127767 -73142 195022 -127592 -394753 -436370 -153712 171028 237106
7881 237106 512359 264204 69366 -138834 -423243 -196070 -88360 -10904 144714 96982
7871 96982 -291722 -463213 -394283 -147896 -215986 -141084 -215137 -260060 -169622 -96724 -55684
7860 -55684 -40929 -182201 -168533 -68901 40322 -151307 -36310 -157777 -52310 98826
7850 98826 140111 -214752 -426041 -504627 -590460 -580458 -644306 -529385 -514875 -429759 -253275
7839 -253275 -139437 -28357 -51628 -26746 -243469 -168271 -120232 -136389 -112765 28150 -41824
7828 -41824 -106683 -478977 -650096 -550125 -517523 -524349 -304961 -270238 -482201 -573424 -253882
7817b53882M7231l50458k41313K71788L15661M0552R9522p0882P8343k03443j63730
7806d30611J57565J37373p2324j92655K36456L25881l7303j09784j91527K31915
7796E4986K13499P1233N5969j91078m69211j18073J33613P8563o5899J93975K95733
7785B53310k2880m01442k66686r3259L47384L18045j61798l40058l60918n8773
7775g87075J49073P2029P5229j74614k49025m1570M4646M95066L16726p7309j41603
7764c18427j69794K40844K92991k30894J0087O0173M480J31789j51229m5779K70335
7753I4576J6178k7831p0370j82882p8319l4439P8073j20044K5031K94548K19866
7742B14387j01067Q149j12635j27566J7383J17568j09597J33020j2447n2667k56195
$$ plain form
7817 -253882 -206651 -557109 -798422 -526634 -210973 -170421 -70899 -141781 -63438 -266881 -430611
7806 -430611 -273046 -135673 -207997 -400652 -164196 161685 124382 14598 -176929 54986
7796 54986 268485 339718 395687 204609 -264602 -382675 -249062 -170499 -236398 -42423 253310
7785 253310 230430 -171012 -437698 -530957 -183573 134472 -27326 -367384 -728302 -787075
7775 -787075 -638002 -565973 -490744 -665358 -914383 -955953 -911307 -416241 -99515 -176824 -318427
7764 -318427 -488221 -247377 45614 -185280 -175193 -115020 -110540 21249 -129980 -175759 94576
7753 94576 110754 82923 12553 -170329 -248648 -283087 -205014 -325058 -300027 -5479 214387
7742 214387 113320 121469 8834 -118732 -101349 16219 -93378 39642 27195 -25472 -281667
7731b81667o7709J39535k5084q085l4861K71647q0742R0587j67058k10526Q1370
7720b92593n8580m3468J35675K09374J4839J76403p9622r5051k05284j59626J3270
7709c84663j0980J04409R392K89251K2339q5565J44927L144k84728k2746k80935
7698d96155j79805K16626J04494L4408K00765m7645k53897R6024L72850j42135
7688i4470j56660L81165J17424k6806j79129J20680N1353O3934k49331O9310n9937
7677C7533o8286J20225O8180j68634j45515J68962k7713K3480L0525K11874r5762
7666A54869j99586J1526J17153J34702k5386k48942q4528N5921j84160r878K35709
7655d2600K44014O5825k9379j8563j35376k42759q6474k55220J21573k6491k4263
$$ plain form
7731 -281667 -349376 -209841 -234925 -243010 -277871 -6224 -86966 3621 -163437 -373963 -292593
7720 -292593 -351173 -394641 -258966 -49592 -34753 141650 62028 -33023 -238307 -397933 -384663
7709 -384663 -395643 -291234 -281842 7409 29748 -55817 89110 92254 -192474 -215220 -496155
7698 -496155 -675960 -459334 -354840 -320432 -119667 -167312 -421209 -325185 47665 -94470
7688 -94470 -251130 130035 247459 220653 41524 162204 213557 277491 28160 97470 37533
7677 37533 -30753 89472 157652 -10982 -156497 12465 -15248 8232 38757 250631 154869
7666 154869 -44717 -33191 83962 218664 193278 -55664 -140192 -84271 -268431 -278309 -42600
7655 -42600 201414 267239 237860 219297 83921 -158838 -245312 -500532 -378959 -405450 -429713
$$ [...]
##END NTUPLES=NMR SPECTRUM
##END=
