##TITLE=Analysis number 321407
Compound Code cc 33901
Project Code adrs
Chemist Name zy-chem
##JCAMPDX= 6.0         $$ Bruker NMR JCAMP-DX V2.0
##DATA TYPE= NMR SPECTRUM
##DATA CLASS= NTUPLES
##ORIGIN= Bruker BioSpin GmbH
##OWNER= nmr
$$ XWIN-NMR		Version 3.5
$$ Wed Aug  9 11:40:35 2006 GMT Daylight Time (UT+1h)  MAYBRIDGE\nmr@NMR_250MHZ
##.OBSERVE FREQUENCY= 250.131544655141
##.OBSERVE NUCLEUS= ^1H
##.ACQUISITION MODE= SIMULTANEOUS (DQD)
##.ACQUISITION SCHEME= undefined
##.AVERAGES= 16
##.DIGITISER RES= 18
##SPECTROMETER/DATA SYSTEM= dpx250
##.PULSE SEQUENCE= zg30
##.SOLVENT NAME= DMSO
##.SHIFT REFERENCE= (INTERNAL, DMSO, 0, 16.522)
##AUDIT TRAIL= $$ (NUMBER, WHEN, WHO, WHERE, WHAT)
$$ ##TITLE= Audit trail, XWIN-NMR		Version 3.5
$$ ##JCAMPDX= 5.01
$$ ##ORIGIN= Bruker BioSpin GmbH
$$ ##OWNER= nmr
$$ C:\u/data/dgb/nmr/ADRS/490/pdata/1/auditp.txt
$$ ##AUDIT TRAIL=  $$ (NUMBER, WHEN, WHO, WHERE, WHAT)
(   1,<2006-08-09 11:39:52.94 +100>,<MAYBRIDGE\nmr>,<NMR_250MHZ>,
      <created by zg, POWCHK disabled, PULCHK disabled
       configuration hash MD5:
       E2 DF 36 D8 04 B2 41 60 5A D7 A3 38 5A 4B D0 FE
       data hash MD5: 64K
       7A 61 45 7E 06 5A 7D 4C E4 94 0E A5 8D 56 21 B9>)
(   2,<2006-08-09 11:40:12.77 +100>,<MAYBRIDGE\nmr>,<NMR_250MHZ>,
      <Start of raw data processing
       ef LB = 0.3 FT_mod = 6 PKNL = 1 SI = 32K 
       data hash MD5: 32K
       CD FC 1C BB 76 23 71 8F EC 65 B3 5A DE 1E B0 D2>)
(   3,<2006-08-09 11:40:17.30 +100>,<MAYBRIDGE\nmr>,<NMR_250MHZ>,
      <apk 
       data hash MD5: 32K
       1C 62 D4 BE D4 39 61 88 7C 0D 3E 72 3B 6A 40 23>)
(   4,<2006-08-09 11:40:19.02 +100>,<MAYBRIDGE\nmr>,<NMR_250MHZ>,
      <abs ABSG = 5 
       data hash MD5: 32K
       22 B9 00 39 31 8A B6 32 0E 02 F3 5A F5 AF EC EF>)
$$ ##END=
$$ 
$$ hash MD5
$$ 80 29 C4 AF 92 27 7E EB EE 88 CF 4C 63 CA CE 29
##$RELAX= 
##$RELAX= 
##$RELAX= 
##$RELAX= 
##$RELAX= 
##$RELAX= 
##$RELAX= 
$$ Bruker specific parameters
$$ --------------------------
##$DU= <C:\u>
##$EXPNO= 490
##$NAME= <ADRS>
##$PROCNO= 1
##$TYPE= <nmr>
##$USER= <dgb>
##$AMP= (0..31)
100 100 100 100 100 100 100 100 100 100 100 100 100 100 100 100 100 100 
100 100 100 100 100 100 100 100 100 100 100 100 100 100 
##$AQSEQ= 0
##$AQ_mod= 3
##$AUNM= <au_zg>
##$AUTOPOS= <20 >
##$BF1= 250.13
##$BF2= 250.13
##$BF3= 250.13
##$BF4= 250.13
##$BF5= 500.13
##$BF6= 500.13
##$BF7= 500.13
##$BF8= 500.13
##$BYTORDA= 1
##$CFDGTYP= 0
##$CFRGTYP= 5
##$CHEMSTR= <none>
##$CNST= (0..31)
1 1 145 1 1 1 1 1 1 1 1 1 1 1 1 1 1 1 1 1 1 1 1 1 1 1 1 1 1 1 1 1 
##$CPDPRG= <>
##$CPDPRG1= <>
##$CPDPRG2= <>
##$CPDPRG3= <>
##$CPDPRG4= <mlev>
##$CPDPRG5= <mlev>
##$CPDPRG6= <mlev>
##$CPDPRG7= <mlev>
##$CPDPRG8= <mlev>
##$CPDPRGB= <>
##$CPDPRGT= <>
##$D= (0..31)
0 1 0 0 0 0 0 0 0 0.06 0 0 0 0 0 0 0.0002 0 0 0 0 0 0 0 0 0 0 0 0 0 0 
0 
##$DATE= 1155119991
##$DBL= (0..7)
120 120 120 120 120 120 120 120 
##$DBP= (0..7)
150 150 150 150 150 150 150 150 
##$DBP07= 0
##$DBPNAM0= <>
##$DBPNAM1= <>
##$DBPNAM2= <>
##$DBPNAM3= <>
$$ [...]
##$SUBNAM7= <"">
##$SUBNAM8= <"">
##$SUBNAM9= <"">
##$SW= 20.6930455092707
##$SWIBOX= (0..15)
0 0 3 0 0 0 0 0 0 0 0 0 0 0 0 0 
##$SW_h= 5175.983436853
##$TD= 65536
##$TD0= 1
##$TE= 295.16
##$TE2= 300
##$TE3= 300
##$TEG= 300
##$TL= (0..7)
0 120 120 120 120 120 120 120 
##$TP= (0..7)
150 150 150 150 150 150 150 150 
##$TP07= 0
##$TPNAME0= <>
##$TPNAME1= <>
##$TPNAME2= <>
##$TPNAME3= <>
##$TPNAME4= <>
##$TPNAME5= <>
##$TPNAME6= <>
##$TPNAME7= <>
##$TPOAL= (0..7)
0.5 0.5 0.5 0.5 0.5 0.5 0.5 0.5 
##$TPOFFS= (0..7)
0 0 0 0 0 0 0 0 
##$TUNHIN= 0
##$TUNHOUT= 0
##$TUNXOUT= 0
##$USERA1= <user>
##$USERA2= <user>
##$USERA3= <user>
##$USERA4= <user>
##$USERA5= <user>
##$V9= 5
##$VALIST= <valist>
##$VCLIST= <CCCCCCCCCCCCCCC>
##$VD= 0
##$VDLIST= <DDDDDDDDDDDDDDD>
##$VPLIST= <PPPPPPPPPPPPPPP>
##$VTLIST= <TTTTTTTTTTTTTTT>
##$WBST= 1024
##$WBSW= 4
##$XGAIN= (0..3)
0 0 0 0 
##$XL= 0
##$YL= 0
##$YMAX_a= 438056
##$YMIN_a= -372411
##$ZGOPTNS= <>
##$ZL1= 120
##$ZL2= 120
##$ZL3= 120
##$ZL4= 120
##$ABSF1= 16.522
##$ABSF2= -4.171173
##$ABSG= 5
##$ABSL= 3
##$ALPHA= 0
##$AQORDER= 0
##$ASSFAC= 0
##$ASSFACI= 0
##$ASSFACX= 0
##$ASSWID= 0
##$AUNMP= <proc_1d>
##$AZFE= 0.1
##$AZFW= 0.1
##$BCFW= 0
##$BC_mod= 0
##$BYTORDP= 0
##$COROFFS= 0
##$CY= 12.5
##$DATMOD= 1
##$DC= 0
##$DFILT= <>
##$DTYPP= 0
##$F1P= 14.0000005364418
##$F2P= -0.99999901652339
##$FCOR= 0.5
##$FTSIZE= 32768
##$FT_mod= 6
##$GAMMA= 0
##$GB= 0
##$INTBC= 1
##$INTSCL= 1
##$ISEN= 128
##$LB= 0.3
##$LEV0= 0
##$LPBIN= 0
##$MAXI= 10000
##$MC2= 0
##$MEAN= 0
##$ME_mod= 0
##$MI= 0
##$NCOEF= 0
##$NC_proc= -5
##$NLEV= 6
##$NOISF1= 0
##$NOISF2= 0
##$NSP= 0
##$NTH_PI= 0
##$NZP= 0
##$OFFSET= 16.522
##$PC= 1
##$PHC0= 144.5671
##$PHC1= 6.196951
##$PH_mod= 1
##$PKNL= yes
##$PPARMOD= 0
##$PSCAL= 4
##$PSIGN= 0
##$REVERSE= no
##$SF= 250.13
##$SI= 32768
##$SIGF1= 0
##$SIGF2= 0
##$SINO= 400
##$SIOLD= 32768
##$SREGLST= <1H.DMSO>
##$SSB= 0
##$STSI= 32768
##$STSR= 0
##$SW_p= 5175.98343685301
##$SYMM= 0
##$S_DEV= 0
##$TDeff= 65536
##$TDoff= 0
##$TI= <Analysis number 999999
Compound Code 99
Book Reference 9
Project Code 9>
##$TILT= no
##$TM1= 0
##$TM2= 0
##$TOPLEV= 0
##$USERP1= <user>
##$USERP2= <user>
##$USERP3= <user>
##$USERP4= <user>
##$USERP5= <user>
##$WDW= 1
##$XDIM= 32768
##$YMAX_p= 327687784
##$YMIN_p= -736264
$$ End of Bruker specific parameters
$$ ---------------------------------
##NTUPLES= NMR SPECTRUM
##VAR_NAME=  FREQUENCY,     SPECTRUM/REAL,   SPECTRUM/IMAG
##SYMBOL=    X,             R,               I
##VAR_TYPE=  INDEPENDENT,   DEPENDENT,       DEPENDENT
##VAR_FORM=  AFFN,          ASDF,            ASDF
##VAR_DIM=   32768,         32768,           32768
##UNITS=     HZ,            ARBITRARY UNITS, ARBITRARY UNITS
##FACTOR=    0.157963299565203, 1,           1
##FIRST=     4132.6476996994, 0,             0
##LAST=      -1043.33573715361, 0,           0
##MIN=       -1043.33573715361, -736264,     0
##MAX=       4132.6476996994, 327687784,     0
$$ Real data points
##PAGE= N=1
##DATA TABLE= (X++(R..R)), XYDATA
$$ [...]
$$ plain form
14212 -146145 -154978 -205364 -174382 -48079 -11432 23878 -27640 5268 148 -22841 119557
14201 119557 66422 57944 -7224 -104926 -47947 -156244 -201131 -67710 -197828 -352202 -332782
14190 -332782 -219095 -207752 -251548 -143677 -189100 -200069 -130820 -73671 -203660 -180333 -142018
14179 -142018 -193481 -270137 -319925 -254217 -383079 -343471 -270478 -293661 -297050 -61388 -62714
14168 -62714 -187053 -351233 -349414 -272925 -144037 -35167 -290363 -295181 -114368 -64120 -136020
14157 -136020 -68119 -26264 -85056 35183 87290 77275 -45477 -236906 -205101 -144154 -56679
14146 -56679 -38944 -26026 15175 -6450 -129025 -114535 -69694 35535 183989 129946 -62072
14135 -62072 -69733 -46645 80771 239134 299885 194094 -952 -27086 150889 116471 -74007
$$ packed form
14212a46145q833n0386L0982J26303L6647L5310n1518L2908n120k2989J42398
14201A19557n3135q478o5168r7702N6979j08297m4887J33421j30118j54374J9420
14190c32782J13687J1343m3796J07871m5423j0969O9249N7149j29989K3327L8315
14179a42018n1463p6656m9788O5708j28862L9608P2993k3183l389K35662j326
14168f2714j24339j64180J819P6489J28888J08870k55196m818J80813N0248p1900
14157a36020O7901M1855n8792J20239N2107j0015j22752j91429L1805O0947Q7475
14146e6679J7735J2918M1201k1625j22575J4490M4841J05229J48454n4043j92018
14135f2072p661K3088J27416J58363O0751j05791j95046k6134J77975l4418j90478
$$ plain form
14124 -74007 -75474 7233 -11849 57928 160655 261934 291002 299610 239747 115712 -102565
14113 -102565 -296012 -363202 -341233 -240381 -23642 232352 165210 97707 86264 111324 46711
14102 46711 17775 41309 94504 5686 -111254 52508 8455 -99493 -76840 -224615 -323499
14091 -323499 -392132 -277193 -95248 41919 -26338 -27578 50030 -50466 -112931 -88238 -61217
14080 -61217 -72519 -171460 -301173 -199997 -150050 -63670 -135658 -310620 -364625 -273207 -44467
14069 -44467 85713 -103307 -176129 -39519 24065 67804 236863 161571 -6677 -64945 -80675
14058 -80675 -69445 137482 157682 120462 47409 -147373 -167281 34991 -65038 -16638 143824
14047 143824 -50283 -63173 36184 119394 31820 -284940 -332544 -289658 -146861 -49267 -71710
$$ packed form
14124g4007j467Q2707j9082O9777J02727J01279K9068Q608n9863j24035k18277
14113a02565j93447o7190K1969J00852K16739K55994o7142o7503j1443K5060o4613
14102D6711k8936K3534N3195q8818j16940J63762m4053j07948K2653j47775r8884
14091c23499o8633J14939J81945J37167o8257j240P7608j00496o2465K4693K7021
14080f1217j1302r8941j29713J01176M9947Q6380p1988j74962n4005R1418K28740
14069d4467J30180j89020p2822J36610O3584M3739J69059p5292j68248n8268j5730
14058h0675J1230K06927K0200l7220p3053j94782j9908K02272j00029M8400J60462
14047A43824j94107j2890R9357Q3210q7574l16760m7604M2886J42797R7594k2443
$$ plain form
14036 -71710 -85659 -159115 -304626 -428626 -324608 -143861 -66224 -121030 -200104 -178305 -44283
14025 -44283 -115425 -225946 -68069 -49628 -146089 -227108 -97425 -76050 -70771 38248 143555
14014 143555 166824 214370 89138 -4571 -81159 -189222 -138754 -124863 -190510 -177016 -36348
14003 -36348 -84737 -113084 -196083 -24585 18466 118417 155176 13947 4101 87215 318183
13992 318183 302784 260863 295067 216303 67382 40927 69535 -84859 -143781 -84550 -4427
13981 -4427 -42641 -112291 -65186 56643 -14754 -199506 -140015 -203848 -297799 -187292 25856
13970 25856 108951 -14764 -47917 -7492 12387 -19499 83884 92827 -6549 -155586 -76624
13959 -76624 -62446 -87281 -67049 -289987 -390575 -225569 -220905 -20690 104942 154497 139934
$$ packed form
14036g1710j3949p3456j45511j24000J04018J80747P7637n4806p9074K1799J34022
14025d4283p1142j10521J57877J8441r6461q1019J29683K1375N279J09019J05307
14014A43555K3269M7546j25232r3709p6588j08063N0468J3891o5647J3494J40668
14003c6348m8389k8347q2999J71498M3051R9951L6759j41229r846Q3114K30968
13992C18183j5399m1921L4204p8764j48921k6455K8608j54394n8922N9231Q0123
13981d427l8214o9650M7105J21829p1397j84752N9491o3833r3951J10507K13148
13970B5856Q3095j23715l3153M0425J9879l1886J03383Q943r9376j49037P8962
13959g6624J4178k4835K0232k22938j00588J65006M664K00215J25632M9555j4563
$$ plain form
13948 139934 -25563 -137518 -37020 112448 92952 80768 95931 77056 49108 -52501
13938 -52501 -193365 -195732 101990 102441 78643 -6962 -48314 -49796 174062 31173 -52138 -103516
13926 -103516 -48370 -130349 -220714 -275524 -171431 22914 -40392 -6879 108564 42977 -17508
13915 -17508 51936 56313 -111337 -186232 -72867 56856 127088 11732 -18026 22482 -162092
13904 -162092 -183426 -37539 -12836 149431 194907 172207 298628 385737 362700 348853 279604
13893 279604 237827 313242 371728 271968 155093 46829 -14859 -123623 61777 127593 9351
13882 9351 -2756 -51306 -159494 -197634 -182346 -178448 19255 -56186 -127535 -40008 -69590 -13891
13870 -13891 -15789 35779 106043 70012 142828 123789 52442 78223 98143 128001 235832 157255
$$ packed form
13948A39934j65497j11955J00498J49468j9496j2184J5163j8875k7948j01609
13938e2501j40864k367K97722M51k3798q5605m1352j482K23858j42889q3311n1378
13926a03516N5146q1979r0365n4810J04093J94345o3306L3513J15443o5587o0485
13915a7508O9444M377j67650p4895J13365J29723P0232j15356k9758M0508j84574
13904a62092k1334J45887K4703J62267M5476k2700J26421Q7109k3037j3847o9249
13893B79604m1777P5415N8486r9760j16875j08264o1688j08764J85400O5816j18242
13882I351j2107m8550j08188l8140J5288L898J97703p5441p1349Q7527k9582N5699
13870a3891j898N1568P0264l6031P2816j9039p1347K5781J9920K9858J07831p8577
$$ plain form
13858 157255 107639 76816 148058 -16773 -123109 9394 16761 17567 73828 -79600 -135309
13847 -135309 -27388 38529 67916 44048 102554 61135 76288 225944 423196 363274 365776
13836 365776 399021 358608 221566 322145 258556 92149 109003 191617 235758 167439 124995
13825 124995 210229 221421 255213 168528 152937 -49479 -142684 -164553 -287443 -309506 -256915
13814 -256915 -215258 -259843 -317198 -148697 -94380 -235760 -187759 -159142 -61140 -10911 97425
13803 97425 68449 -17928 -99142 84683 133714 -51145 -82771 64074 87146 151352 258138
13792 258138 250952 145234 -8602 49970 103767 103165 190284 218599 101059 124903 61281
13781 61281 -27632 135612 99206 16696 11441 30660 -42347 -25486 -20520 144113 124911 -2070
$$ packed form
13858A57255m9616l0823P1242j64831j06336J32503P367Q06N6261j53428n5709
13847a35309J07921O5917K9387k3868N8506m1419J5153J49656J97252n9922K502
13836C65776L3245m0413j37042J00579o3589j66407J6854Q2614M4141o8319m2444
13825A24995Q5234J1192L3792q6685j5591k02416r3205k1869j22890k2063N2591
13814b56915M1657m4585n7355J68501N4317j41380M8001K8617R8002N0229J08336
13803I7425k8976q6377q1214J83825M9031j84859l1626J46845K3072O4206J06786
13792B58138p186j05718j53836N8572N3797o02Q7119K8315j17540K3844o3622
13781F1281q8913J63244l6406q2510n255J9219p3007J6861M966J64633j9202j26981
$$ plain form
13769 -2070 26750 -31169 -45403 -73275 -114466 -83863 -197868 -371743 -229197 -135730 -140466
13758 -140466 -161301 -214543 -321747 -324439 -200449 -159004 87564 134076 89404 -92935 -211596
13747 -211596 -36821 -132150 -142441 -46864 -57020 -34532 260 80881 127591 77595 68537
13736 68537 4922 117856 -15010 -110245 -49527 -58155 36049 -21731 -110859 -121548 11081
13725 11081 37469 -12500 44894 98547 11206 -77448 206004 292479 174724 3946 9713
13714 9713 -28717 -103494 -58889 20570 95874 -38903 28049 143229 21389 -636 141778
13703 141778 255202 210065 150348 112864 160048 252672 105701 188350 222974 43962 39022
13692 39022 167995 75386 -8816 48248 80791 -17089 -134722 -24489 76017 179007 124744
$$ packed form
13769b070K8820n7919j4234k7872m1191L0603j14005j73875J42546R3467m736
13758a40466k0835n3242j07204k692J23990M1445K46568M6512m4672j82339j18661
13747b11596J74775r5329j0291R5577j0156K2488L4792Q0621M6710m9996r058
13736F8537o3615J12934j32866r5235O0718q628R4204n7780q9128j0689J32629
13725A1081K6388m9969N7394N3653q7341q8654K83452Q6475j17755j70778N767
13714I713l8430p4777M4605P9459P5304j34777O6952J15180j21840k2025J42414
13703A41778J13424m5137n9717l7484M7184R2624j46971Q2649L4624j79012m940
13692C9022J28973r2609q4202N7064L2543r7880j17633J10233J00506J02990n4263
$$ plain form
13681 124744 -3358 134308 162069 -29187 -147538 -146691 -139852 -184466 -271090 -263534 -313287
13670 -313287 -189486 -257723 -279744 -185301 -100101 -344276 -351082 -238165 -251676 -173117 -27842
13659 -27842 23342 97217 -45702 -50590 103444 61050 -162164 -256414 -229929 -53570 12079
13648 12079 -10456 58647 39519 63131 113837 184234 262456 152430 97883 110415 1509
13637 1509 24597 41228 -8428 -27227 -109952 -43907 174872 244193 255804 310060 286348 292106
13625 292106 444434 456929 448734 304671 326345 140966 -40001 7638 112338 203113 154749
13614 154749 101257 39434 14166 -158962 -130431 -12431 -256605 -269634 -53338 232975
13604 232975 259359 184674 291571 242305 96456 9102 72981 9127 -56637 -14841 -104839
$$ packed form
13681A24744j28102J37666K7761j91256j18351Q47O839m4614q6624P556m9753
13670c13287J23801o8237k2021R4443Q5200k44175o806J12917j3511P8559J45275
13659b7842N1184P3875j42919m888J54034m2394k23214r4250K6485J76359O5649
13648A2079k2535O9103j9128K3612N0706P0397P8222j10026n4547J2532j08906
13637A509K3088J6631m9656j8799q2725O6045K18779O9321J1611N4256k3712N758
13625B92106J52328J2495q195j44063K1674j85379j80967M7639J04700R0775m8364
13614A54749n3492o1823k5268j73128K8531J18000k44174j3029K16296K86313
13604B32975K6384p4685J06897m9266j45849q7354O3879o3854o5764M1796q9998
$$ plain form
13593 -104839 -192057 6534 127702 56702 113191 219271 63156 -33830 -17377 85456
13583 85456 117175 9616 -52178 -239403 -282471 -124092 -170216 -335244 -170520 -158837 -57951
13572 -57951 70844 70761 -99431 -121464 46613 272219 257535 342750 361379 358290 226080
13561 226080 41042 97363 206849 148736 146646 198167 103863 -36324 87400 57400 -57083
13550 -57083 -117428 -261034 -221854 -193408 -93455 -63113 -10274 42695 -46003 -179382 -319028
13539 -319028 -190474 -44291 31114 128317 215522 115799 -17013 153262 223106 100212
13529 100212 9814 -41776 -61758 -84519 74895 1687 -14977 -128769 -121741 -22370 -46397
13518 -46397 -119773 -110977 -23463 33203 23884 68302 208374 181035 97432 -30675 -67349 -108705
$$ packed form
13593a04839q7218J98591J21168p1000N6489J06080j56115r6986J6453J02833
13583H5456L1719j07559o1794j87225m3068J58379m6124j65028J64724J1683J00886
13572e7951J28795q3j70192k2033J68077K25606j4684Q5215J8629l089j32210
13561B26080j85038N6321J09486n8113k090N1521r4304j40187J23724l0000j14483
13550e7083o0345j43606L9180K8446R9953L0342N2839N2969q8698j33379j39646
13539c19028J28554J46183P5405R7203Q7205r9723j32812J70275O9844j22894
13529A00212r0398n1590j9982k2761J59414p3208j6664j13792P028R9371k4027
13518d6397p3376Q796Q7514N6666r319M4418J40072k7339q3603j28107l6674m1356
$$ plain form
13506 -108705 -120438 -120564 -211683 -206437 -169312 -167276 -49256 16935 -107876 -214785 -140920 -93116
13494 -93116 -6922 36488 -69933 -133286 -74971 108995 4235 -133659 -137832 -258973 -190215
13483 -190215 -72231 -101434 -244250 -162435 -80729 -180529 33460 123964 92580 295158 223339
13472 223339 -58802 -138501 -79241 -99090 -132379 22397 -2786 60344 26872 -9990 -61203
13461 -61203 22771 -40368 -41188 -107715 -126253 -85144 -28373 326 -7280 -118169 30228 1926
13449 1926 -1358 106610 65543 -68916 -48343 81521 121125 24845 -142715 -10880 158325
13438 158325 221623 183987 142454 211061 133461 6230 -169507 -205757 -215994 -298835 -404365
13427 -404365 -198023 -141776 -144793 -237581 -278796 -249237 -226280 -180471 -143440 -28683 -72237
$$ packed form
13506a08705j1733j26r1119N246L7125K036J18020O6191j24811j06909P3865M7804
13494i3116Q6194M3410j06421o3353N8315J83966j04760j37894m173j21141O8758
13483a90215J17984k9203j42816Q1815Q1706r9800K13989R0504l1384K02578p1819
13472B23339k82141p9699N9260j9849l3289J54776k5183O3130l3472l6862n1213
13461f1203Q3974o3139q20o6527j8538M1109N6771K8699p606j10889J48397k8302
13449A926l284J07968m1067j34459K0573J29864L9604r6280j67560J31835J69205
13438A58325O3298l7636m1533O8607p7600j27231j75737l6250j0237q2841j05530
13427d04365K06342N6247l017r2788m1215K9559K2957M5809L7031J14757m3554
$$ plain form
13416 -72237 -182939 -152457 -156241 -249301 -168161 -75088 42929 76206 113182 99297 99652 -151315
13404 -151315 -275014 -128186 -99906 -115125 -120561 -178781 -207585 -142095 38211 158235 49073
13393 49073 -13011 -13875 -20459 -48247 91965 251257 -8487 -138919 -98152 65024 204566
13382 204566 228035 262784 205133 -4955 -37666 -110630 -186778 -333335 -286075 -100485 -144314
13371 -144314 -388213 -492417 -412228 -191760 -133915 -164726 -17907 143548 251040 120378
13361 120378 -54154 -134872 -113048 -214851 -265228 -217050 -58078 66011 24308 -155955
13351 -155955 -207680 23842 96771 248522 256169 125827 48711 227072 482895 408832 263866
13340 263866 370268 321279 240147 203274 282896 243022 20821 -121628 -124425 -35655 -7814
$$ packed form
13416g2237j10702L0482l784r3060Q1140R3073J18017L3277L6976j3885L55k50967
13404a51315j23699J46828K8280j5219n436n8220k8804O5490J80306J20024j09162
13393D9073o2084q64o584k7788J40212J59292k59744j30432M0767J63176J39542
13382B04566K3469L4749n7651k10088l2711p2964p6148j46557M7260J85590m3829
13371a44314k43899j04204Q0189K20468N7845l0811J46819J61455J07492j30662
13361A20378j74532q0718K1824j01803n0377M8178J58972J24089m1703j80263
13351a55955n1725K31522P2929J51751P647j30342p7116J78361K55823p4063j44966
13340B63866J06402m8989q1132l6873P9622l9874k22201j42449k797Q8770K7841
$$ plain form
13329 -7814 -90121 -1551 -76083 -85932 -95920 -4466 100870 188548 217610 188805 128643 45889
13317 45889 92179 158875 94122 -50465 -82484 -127996 -72395 7550 54624 85514 154184
13306 154184 124032 12192 29266 112734 111512 94590 226728 295271 236710 271810 224542
13295 224542 209384 -50183 -152797 -24395 89316 62120 253259 466713 333721 397302
13285 397302 465973 407165 332467 290143 312389 191842 166222 172369 277626 193036 -30645
13274 -30645 -136338 -198090 -165147 -150593 -34528 -46942 -41844 57631 254179 278959 89927
13263 89927 -21815 32143 5439 84917 124433 -24665 -32060 57023 223286 163022 -19453
13252 -19453 -210759 -293232 -231582 -82265 115080 111080 -40789 -58632 21850 99988 202329
$$ packed form
13329g814q2307Q8570p4532r849r988R1454J05336Q7678K9062k8805o0162q2754
13317D5889M6290O6696o4753j44587l2019m5512N5601P9945M7074L0890O8670
13306A54184l0152j11840J7074Q3468j222j6922J32138O8543n8561L5100m7268
13295B24542j5158k59567j02614J28402J13711k7196J91139K13454j32992O3581
13285C97302O8671n8808p4698m2324K2246j20547k5620O147J05257q4590k23681
13274c0645j05693o1752L2943J4554J16065j2414N098R9475J96548K4780j89032
13263H9927j11742N3958k6704P9478L9516j49098p395Q9083J66263o0264j82475
13252a9453j91306q2473O1650J49317J97345m000j51869j7843Q0482P8138J02341
$$ plain form
13241 202329 163394 59545 52972 110608 189908 372500 508212 443211 413155 277979 33343
13230 33343 -11938 -14703 106530 331009 479844 438929 250715 136098 51192 60936 45190
13219 45190 -95060 -66745 -48045 -97012 -84821 100906 114450 78278 81173 51968 26564
13208 26564 -110286 82512 222484 168332 237906 214344 268122 405469 350445 97121 -63399
13197 -63399 -222657 -180869 -106209 -62704 -50691 -189521 -161159 -51392 -156360 -24533 74458
13186 74458 139063 191830 99575 -26071 -3629 45963 -103905 -194623 -154583 -126369 -168394
13175 -168394 -223665 -95542 -33298 18286 -137610 -259500 -271589 -326441 -236746 -40608 57731
13164 57731 75304 109744 53286 -95072 -178276 -115691 -882 62693 -45198 -138443 -86440
$$ packed form
13241B02329l8935j03849o573N7636P9300J82592J35712o5001l0056j35176k44636
13230C3343m5281k765J21233K24479J48835m0915j88214j14617q4906R744j5746
13219D5190j40250K8315J8700m8967J2191J85727J3544l6172K895k9205k5404
13208B6564j36850J92798J39972n4152O9574k3562N3778J37347n5024k53324j60520
13197f3399j59258M1788P4660M3505J2013j38830K8362J09767j04968J31827R8991
13186G4458O4605N2767r2255j25646K2442M9592j49868r0718M0040K8214m2025
13175a68394n5271J28123O2244N1584j55896j21890j2089n4852Q9695J96138R8339
13164E7731J7573L4440n6458j48358q3204O2585J14809O3575j07891r3245N2003
$$ plain form
13153 -86440 -30251 190074 389022 238172 83625 174 -109558 -93309 -1568 -39364 -29592
13142 -29592 -229439 -183669 32144 66462 100201 2360 -195459 -163003 -196600 -148365 91526
13131 91526 77562 35440 18031 35189 1649 4283 82258 70428 80905 208557 162563 -47320
13119 -47320 -152929 -145819 -26638 5162 -93720 -184508 -148385 -136616 -128968 -54050 -4869 -192552
13107 -192552 -206773 -88732 -23648 -41797 31652 -12406 19756 95423 -29641 -38906 10735
13096 10735 53961 165138 40487 89142 292118 293532 168306 64880 14251 -7721 88821
13085 88821 91960 23317 -96698 -53539 5098 -63093 -126821 -171643 -98677 27751 37204 -15523
13073 -15523 146325 239969 101101 -57916 -2471 1222 -25128 -10565 -107768 56 79554
$$ packed form
13153h6440N6189K20325J98948j50850j54547q3451j09732J6249R1741l7796R772
13142b9592j99847M5770K15813L4318L3739r7841j97819L2456l3597M8235K39891
13131I1526j3964m2122j7409J7158l3540K634P7975j1830J0477J27652m5994k09883
13119d7320j05609P110J19181L1800r8882r0788L6123J1769P648P4918M9181j87683
13107a92552j4221J18041O5084j8149P3449m4058L2162P5667j25064r265M9641
13096A0735M3226J11177j24651M8655K02976J414j25226j03426n0629k1972R6542
13085H8821L139o8643j20015M3159N8637o8191o3728m4822P2966J26428R453n2727
13073a5523J61848R3644j38868j59017N5445L693k6350J4563r7203J07824P9498
$$ plain form
13062 79554 72334 -91224 -151432 -32606 149370 40477 -108851 57137 164223 147648
13052 147648 306875 112694 37607 67749 84402 90099 45412 -14931 -41018 -59585 15348
13041 15348 83758 164592 305377 216967 190565 247747 106717 95519 73047 150433 163062
13030 163062 108451 99845 7600 -41958 -29580 -12193 -108278 -107664 -126127 -26012 109338 152382
13018 152382 206469 283909 58181 48109 200786 125788 52203 158246 202919 118173 289742
13007 289742 258910 54333 -122744 -164333 74271 165963 -28549 -93309 -61984 167289
12997 167289 146800 68019 37785 -8491 22018 46604 49126 24749 88207 245231 307635
12986 307635 303906 278509 289886 156835 158320 299030 261626 259635 182023 47281 124453
$$ packed form
13062G9554p220j63558o0208J18826J81976j08893j49328J65988J07086j6575
13052A47648J59227j94181p5087L0142J6653N697m4687o0343k6087j8567P4933
13041A5348O8410Q0834J40785q8410k6402N7182j41030j1198k2472P7386J2629
13030A63062n4611q606r2245m9558J2378J7387r6085O14j8463J00115J35350M3044
13018A52382N4087P7440k25728j0072J52677p4998p3585J06043M4673q4746J71569
13007B89742l0832k04577j77077m1589K38604R1692j94512o4760L1325K29273
12997A67289k0489p8781l0234m6276L0509K4586K522k4377O3458J57024O2404
12986C07635l729k5397J1377j33051J485J40710l7404j991p7612j34742P7172
$$ plain form
12975 124453 323672 242580 195568 235940 236997 31061 -65947 -101195 -135282 17223 269258
12964 269258 339744 331642 304523 136199 84063 204724 257663 179026 56569 141396 310150
12953 310150 320667 153544 89993 51834 -76665 94397 115981 120551 19606 -52694 -28884
12942 -28884 168485 374275 436233 359339 512370 523188 190687 58792 46284 46032 96293
12931 96293 163104 126872 131504 144837 210222 158391 48158 108378 146833 113048 66189 42771
12919 42771 224622 406610 493443 403385 275177 219043 188116 228701 225699 264347 132219
12908 132219 19767 -60024 -113118 5376 37529 132388 102169 123659 108374 -14702 -134912
12897 -134912 8273 -46905 -144229 -219714 -219750 -194492 -116171 46796 124927 184235 265607 214295
$$ packed form
12975A24453J99219q1092m7012M0372J057k05936r7008l5248l4087J52505K52035
12964B69258P0486q102k7119j68324n2136J20661N2939p8637j22457Q4827J68754
12953C10150J0517j67123o3551l8159j28499J71062K1584M570j00945p2300K3810
12942b8884J97369K05790O1958p6894J53031J0818l32501j31895j2508k52N0261
12931I6293O6811l6232M632J3333O5385n1831j10233O0220L8455l3785m6859k3418
12919D2771J81851J81988Q6833r0058j28208n6134l0927M0585l002L8648j32128
12908A32219j12452p9791n3094J18494L2153R4859l0219K1490j5285j23076j20210
12897a34912J43185n5178r7324p5485l6K5258P8321J62967P8131N9308Q1372n1312
$$ plain form
12885 214295 150515 395879 536700 432297 212440 -9332 -198037 -186403 -47070 61341
12875 61341 147842 138486 314273 270588 228201 333545 388609 284604 77511 -21859 24459
12864 24459 -45774 5711 -17838 40279 176910 188661 134684 46283 -31129 78775 197098
12853 197098 219422 236457 161499 111623 72762 78238 52996 157650 118803 144812 238210
12842 238210 244582 295570 261166 281381 162996 195765 251055 136314 23144 -159541 -73550
12831 -73550 -57823 -40055 -83132 23984 105435 133751 297389 388832 502847 445905 334995
12820 334995 278610 248503 82862 8019 10493 -37227 -205799 -205664 -247133 -194944 -93634
12809 -93634 13712 104727 90301 83507 204540 158874 157151 67049 -154456 -192304 56683
$$ packed form
12885B14295o3780K45364J40821j04403k19857k21772j88705J1634J39333J08411
12875F1341Q6501r356J75787m3685m2387J05344N5064j04005k07093r9370M6318
12864B4459p0233N1485k3549N8117J36631J1751n3977q8401p7412J09904J18323
12853A97098K2324J7035p4958m9876l8861N476k5242J04654l8847K6009R3398
12842B38210O372N0988l4404K0215j18385L2769N5290j14741j13170j82685Q5991
12831g3550J5727J7768m3077J07116Q1451K8316J63638R1443J14015n6942j10910
12820C34995n6385l0107j65641p4843K474m7720j68572J35m1469N2189J01310
12809i3634J07346R1015j4426o794J21033m5666j723r0102k21505l7848K48987
$$ plain form
12798 56683 189502 204002 124194 -12204 -59079 -220259 -111284 15183 -34861 55269 139125
12787 139125 249008 340446 361358 276791 148209 161417 155478 182221 75221 -65333 -44655
12776 -44655 -53611 -156084 -23962 234583 341887 273596 152165 200132 242829 181417 -19217
12765 -19217 -160470 37156 94245 96247 147865 129656 17540 71468 -7834 -124566 -20009
12754 -20009 73261 185364 93311 57669 220177 189610 145987 72199 -31909 -120679 -81472
12743 -81472 95778 -5387 139652 298983 302799 173927 135520 85757 163916 87031 81763
12732 81763 293576 481325 233956 97199 125054 112256 213462 259247 230173 182310 143617
12721 143617 19352 30363 132126 144376 182371 203330 258783 176122 161476 153339 73070
$$ packed form
12798E6683J32819J4500p9808j36398m6875j61180J08975J26467n0044R0130Q3856
12787A39125J09883R1438K0912q4567j28582J3208n939K6743j07000j40554K0678
12776d4655q956j02473J32122K58545J07304o8291j21431M7967M2697o1412k00634
12765a9217j41253J97626N7089K002N1618j8209j12116N3928p9302j16732J04557
12754b0009R3270J12103r2053l5642J62508l0567m3623p3788j04108q8770L9207
12743h1472J77250j01165J45039J59331L816j28872l8407m9763P8159p6885n268
12732H1763K11813J87749k47369j36757K7855j2798J01206M5785k9074m7863l8693
12721A43617j24265J1011J01763J2250L7995K0959N5453q2661j4646q137q0269
$$ plain form
12710 73070 239930 184843 245674 388176 196043 198705 306371 210719 2427 -55196 160766
12699 160766 459922 325779 278656 295058 316308 184405 116736 36206 -22345 22127 210410
12688 210410 259187 257045 289255 331458 188433 152364 295244 280243 164696 156636 277912
12677 277912 323131 423497 425896 188669 68421 147816 89652 -13772 130292 180175 206954
12666 206954 143773 225359 133345 11168 65810 149926 225957 247351 92882 32984 122928
12655 122928 190966 306680 236922 177531 110446 153044 319787 251934 276339 128178 63026
12644 63026 67791 44595 54510 41723 -126837 -229432 62840 344440 436781 396963 304956
12633 304956 272076 357557 304780 326892 421449 485371 506669 442077 435721 343345 294843 304516
$$ packed form
12710G3070J66860n5087O0831J42502j92133K662J07666r5652k08292n7623K15962
12699A60766K99156j34143m7123J6402K1250j31903o7669q0530n8551M4472J88283
12688B10410M8777k142L2210M2203j43025l6069J42880j5001j15547q060J21276
12677B77912M5219J00366K399k37227j20248P9395n8164j03424J44064M9883K6779
12666B06954o3181Q1586r2014j22177N4642Q4116P6031K1394j54469n9898Q9944
12655A22928O8038J15714o9758n9391o7085M2598J66743o7853K4405j48161o5152
12644F3026M765k3196R915j2787j68560j02595K92272K81600R2341l9818r2007
12633C04956l2880Q5481n2777K2112R4557O3922K1298o4592o356r2376m8502R673
$$ plain form
12621 304516 321981 459665 428336 310689 193057 168987 230306 342508 193058 156261
12611 156261 284625 361127 293474 204772 87114 204726 315297 383910 336392 360554 503503
12600 503503 498738 336427 116138 163258 208224 116822 157251 144751 185493 281482 337823
12589 337823 421157 293815 220044 199153 197957 161506 112667 108905 18224 32195 92711 160896
12577 160896 86908 76927 250893 278212 250023 237887 216377 222433 161981 178992 232602 174655
12565 174655 257524 124399 219906 318549 418612 440088 257359 269935 268821 174908 257481
12554 257481 192475 73616 -39871 16035 105964 36146 178103 256025 479927 574621 621791
12543 621791 652174 756035 735333 727075 622153 326786 112184 208160 225120 116878 145924
$$ packed form
12621C04516J7465J37684l1329j17647j17632k4070O1319J12202j49450l6797
12611A56261J28364P6502o7653q8702j17658J17612J10571O8613m7518K4162J42949
12600E03503m765j62311k20289M7120M4966r1402M0429j2500M0742R5989N6341
12589C37823Q3334j27342p3771k0891j196l6451m8839l762r0681J3971O0516O8185
12577A60896p3988r981J73966K7319k8189j2136k1510O056o0452J7011N3610n7947
12565A74655Q2869j33125R5507R8643J00063K1476j82729J2576j114r3913Q2573
12554B57481o5006j18859j13487N5906Q9929o9818J41957P7922K23902R4694M7170
12543F21791L0383J03861k0702q258j04922k95367k14602R5976J6960j08242K9046
$$ plain form
12532 145924 184226 215128 244411 430496 388524 335883 281698 211638 49505 206730 440067
12521 440067 435119 374545 238338 198946 247700 417768 538916 536557 424226 358077 301861
12510 301861 287525 231230 261096 306056 98698 77114 120726 168717 249434 287077 240107
12499 240107 244469 287261 329818 367720 334831 369717 463660 363522 248381 276825 381057
12488 381057 487431 473956 429664 474980 479661 624042 637441 427756 431025 561003 461476
12477 461476 384966 464278 499910 385919 224723 291122 398698 342739 372730 472785 394380
12466 394380 302882 295169 427512 465450 418379 388564 386395 341041 553221 724484 710590
12455 710590 695473 485887 196512 322746 401754 304710 261863 345362 254900 163690 201134
$$ packed form
12532A45924L8302L0902K9283J86085m1972n2641n4185p0060j62133J57225K33337
12521D40067m948o0574j36207l9392M8754J70068J21148k359j12331o6149n6216
12510C01861j4336n6295K9866M4960k07358k1584M3612M7991Q0717L7643m6970
12499B40107M362M2792M2557L7902l2889L4886R3943j00138j15141K8444J04232
12488C81057J06374j3475m4292M5316M681J44381J3399k09685L269J29978r9527
12477D61476p6510P9312L5632j13991j61196O6399J07576n5959K9991J00055p8405
12466C94380r1498p713J32343L7938m7071k9815k169m5354K12180J71263j3894
12455G10590j5117k09586k89375J26234P9008r7044m2847Q3499r0462r1210L7444
$$ plain form
12444 201134 310573 495150 509583 433669 412236 489410 556323 470399 359692 424782 436398
12433 436398 303931 340362 303120 153992 143034 167432 266919 368854 555871 528765 378627
12422 378627 556110 622183 482108 516512 576299 548031 639372 502410 620012 659211 561991
12411 561991 454630 396935 533324 530626 615074 570882 591770 605767 607973 602956 486438
12400 486438 530265 579386 746852 697451 645616 605156 691529 725629 706159 645984 629350
12389 629350 625030 434931 452411 440122 516738 623068 618833 663788 640549 713864 593204
12378 593204 617753 692800 624659 587502 496992 429592 476196 575726 510471 458142 399980
12367 399980 425252 527064 588888 443090 497549 545141 572492 687986 863292 794307 610487
$$ packed form
12444B01134J09439J84577J4433p5914k1433P7174O6913q5924j10707O5090J1616
12433D36398j32467L6431l7242j49128j0958K4398R9487J01935J87017k7106j50138
12422C78627J77483O6073j40075L4404N9787k8268R1341j36962J17602L9199r7220
12411E61991j07361n7695J36389k698Q4448m4192K0888J3997K206n017j16518
12400D86438M3827M9121J67466m9401n1835m0460Q6373L4100j9470o0175j6634
12389F29350m320j90099J7480j2289P6616J06330m235M4955k3239P3315j20660
12378E93204K4549P5047o8141l7157r0510o7400M6604R9530o5255n2329n8162
12367C99980K5272J01812O1824j45798N4459M7592K7351J15494J75306o8985j83820
$$ plain form
12356 610487 618623 531079 607925 602929 567168 554597 585509 406695 387039 396555 399402 560397
12344 560397 771365 958936 1104188 1182572 1260651 1127017 888881 897324 1077000 1119771
12334 1119771 1110631 1124694 1083654 972959 986402 1169799 1316940 1350711 1555161 1563514 1486160
12323 1486160 1426664 1369213 1243879 1258241 1402063 1356703 1220806 1130417 1070806 1251930
12313 1251930 1336417 1155064 1256123 1439452 1474842 1457337 1517719 1572706 1556862 1463945 1502140
12302 1502140 1562018 1712010 1892981 1745938 1414924 1280436 1465987 1660722 1732717 1695898
12292 1695898 1653309 1616749 1708503 1604373 1547447 1539095 1550696 1550731 1406640 1310052 1483302
12281 1483302 1573877 1537699 1465456 1379840 1259628 1382275 1726182 1726068 1495096 1509200 1288712
$$ packed form
12356F10487Q136q7544P6846m996l5761j2571L0912j78814j9656R516K847J60995
12344E60397K10968J87571J45252P8384P8079j33634k38136Q443J79676M2771
12334A119771r140J4063m1040j10695J3443J83397J47141L3771K04450Q353p7354
12323A486160n9496n7451j25334J4362J43822m5360j35897r0389n9611J81124
12313A251930Q4487j81353J01059J83329L5390j7505O0382N4987j5844r2917L8195
12302A502140N9878J49992J80971j47043l31014j34488J85551J94735P1995l6819
12292A695898m2589l6560R1754j04130n6926q352J1601L5j44091r6588J73250
12281A483302R0575l6178p2243q5616j20212J22647L43907j14k30972J4104k20488
$$ plain form
12270 1288712 1171892 1174340 1114478 1084084 1063262 1100558 1164954 1230526 1341010 1243045 1119363
12259 1119363 1131518 939338 833112 928726 945830 962866 1006203 1086953 942551 879343 971472
12248 971472 1019426 1063576 1063683 1121146 1226004 1273918 1315016 1211110 1153809 1166580 1105543
12237 1105543 984986 902892 994751 937327 997843 1075733 1110075 1140566 1348968 1363644 1267078
12226 1267078 1164072 1179001 1294742 1193895 1154693 1353569 1544069 1658507 1516308 1457332
12216 1457332 1626096 1578070 1610881 1606647 1500405 1414604 1281165 1123896 1033105 1226806
12206 1226806 1361258 1373427 1473896 1389713 1329417 1320959 1189336 1278678 1383279 1356225 1224824
12195 1224824 1222396 1214781 1211625 1261117 1297957 1296833 1196631 1350284 1418517 1320662 1253276 1297686
$$ packed form
12270A288712j16820K448n9862l0394k0822L7296O4396O5572J10484r7965j23682
12259A119363J2155j92180j06226R5614J7104J7036M3337Q0750j44402o3208R2129
12248I71472M7954M4150J07N7463J04858M7914M1098j03906n7301J2771o1037
12237A105543j20557q2094R1859n7424O0516P7890L4342L0491K08402J4676r6566
12226A267078j03006J4929J15741j00847l9202J98876J90500J14438j42199n8976
12216A457332J68764m8026L2811m234j06242q5801j33439j57269r0791J93701
12206A226806J34452J2169J00469q4183o0296q458j31623Q9342J04601k7054j31401
12195A224824k428p615l156M9492L6840j124j00202J53653O8233r7855o7386M4410
$$ plain form
12183 1297686 1434791 1516846 1564470 1628078 1441637 1338927 1349630 1347167 1386860 1388123 1423586
12172 1423586 1390907 1352691 1473623 1578186 1598947 1669543 1844478 1965600 2006232 1715960
12162 1715960 1707922 1614813 1665779 1730243 1919838 2021874 2129996 2201847 2245627 2215729 2326423
12151 2326423 2117669 1794902 1765744 1717503 1832483 1965355 1979676 2028221 2071851 2085637
12141 2085637 2141002 2067455 2085931 2294560 2412280 2269911 2312267 2370861 2330131 2273514 2434054
12130 2434054 2451829 2329879 2299749 2297221 2137273 2222129 2319783 2369745 2547096 2750369 2628051
12119 2628051 2493027 2636387 2738546 2767734 2628069 2663150 2676971 2594162 2563399 2607346
12109 2607346 2622503 2614003 2611919 2654603 2780145 2800178 2829085 2724714 2642534 2671312 2734090
$$ packed form
12183A297686J37105Q2055M7624O3608j86441j02710J0703k463L9693J263L5463
12172A423586l2679l8216J20932J04563K0761P0596J74935J21122M0632k90272
12162A715960q038r3109N0966O4464J89595J02036J08122P1851M3780k9898J10694
12151B326423k08754l22767k9158m8241J14980J32872J4321M8545M3630J3786
12141B085637N5365p3547J8476K08629J17720j42369M2356N8594m0730n6617J60540
12130B434054J7775j21950l0130k528j59948Q4856R7654M9962J77351K03273j22318
12119B628051j35024J43360J02159K9188j39665L5081J3821q2809l0763M3947
12109B607346J5157q500k084M2684J25542K0033K8907j04371q2180K8778O2778
$$ plain form
12098 2734090 2670879 2789489 2951611 2899102 2962156 3018225 2880547 2821750 2936819 3106680
12088 3106680 3237923 3348967 3432008 3471955 3367010 3308245 3364817 3443689 3482642 3408531 3338063
12077 3338063 3159568 3089646 3150335 3288464 3335994 3580712 3763578 3848784 3994381 4020926
12067 4020926 4121222 4269768 4397320 4569848 4644635 4584448 4521027 4631937 4605528 4596681
12057 4596681 4739480 4968353 4956160 4906810 4909157 4909990 5102605 5292893 5392130 5413551 5515253
12046 5515253 5709296 5858978 5647731 5751453 5665710 5706162 5979617 5945489 5946408 6021358 6280348
12035 6280348 6451695 6583847 6874761 7027312 7085541 7021611 7149854 7162568 7215019 7247713
12025 7247713 7152903 7218758 7416073 7596821 7704414 7749307 7862305 7981015 8395175 8746600
$$ packed form
12098B734090o3211J18610J62122n2509O3054N6069j37678n8797J15069J69861
12088C106680J31243J11044Q3041L9947j04945n8765N6572P8872L8953p4111p0468
12077C338063j78495o9922O0689J38129M7530K44718J82866Q5206J45597K6545
12067D020926J00296J48546J27552J72528P4787o0187o3421J10910k6409q847
12057D596681J42799K28873j2193m9350K347Q33J92615J90288R9237K1421J01702
12046E515253J94043J49682k11247J03722q5743M0452K73455l4128R19P4950K58990
12035F280348J71347J32152K90914J52551N8229o3930J28243J2714N2451L2694
12025G247713r4810O5855J97315J80748J07593M4893J12998J18710M14160L51425
$$ plain form
12015 8746600 8755356 8797865 9009207 9040646 9106145 9241560 9241282 9363212 9667608 9914154 10181154
12004 10181154 10228349 10344132 10556837 10861729 11264778 11506499 11647554 11831813 12164458
11995 12164458 12321141 12490610 12778988 13236629 13535742 13694964 13996609 14247191 14573151
11986 14573151 14897425 15198010 15573164 15884256 16121158 16333455 16715629 17257365 17717318
11977 17717318 18299561 18874396 19347522 20033102 20578635 20897095 21293249 21928813 22705817
11968 22705817 23534787 24176652 24768291 25269203 25942441 26831989 27687000 28578118 29481101
11959 29481101 30551158 31295348 32246552 33347743 34508979 35567556 36689123 37880335
11951 37880335 39296963 40905171 42391072 43852947 45395970 47006576 48736968 50628163
$$ packed form
12015H746600Q756M2509K11342L1439O5499J35415k78J21930L04396K46546K67000
12004A0181154M7195J15783K12705L04892M03049K41721J41055J84259L32645
11995A2164458J56683J69469K88378M57641K99113J59222L01645K50582L25960
11986A4573151L24274L00585L75154L11092K36902K12297L82174N41736M59953
11977A7717318N82243N74835M73126O85580N45533L18460L96154O35564P77004
11968B2705817Q28970O41865N91639N00912O73238Q89548Q55011Q91118R02983
11959B9481101J070057P44190R51204J101191J161236J058577J121567J191212
11951C7880335J416628J608208J485901J461875J543023J610606J730392J891195
$$ plain form
11943 50628163 52634159 54824207 57026739 59453365 61972064 64316668 66853517 69675394
11935 69675394 72765949 75857685 78878604 82084614 85541946 89030708 92590903 96304429
11927 96304429 100222129 104234624 108262529 112340161 116417741 120718438 125323807 129877890
11919 129877890 134378496 139087696 144227072 149545149 154768212 160025109 165335012 170528442
11911 170528442 175533247 180120185 184233595 187462826 189621742 190927108 191596898 191604358
11903 191604358 191262586 190612344 189706933 188783553 187920058 187278895 186584600 185952417 185598238
11894 185598238 185323661 185408689 185703363 186029748 186642299 187227307 187931650 188774162 189808714
11885 189808714 190929143 192112355 193528638 195181784 196858163 198630737 200457835 202492462
$$ packed form
11943E0628163K005996K190048K202532K426626K518699K344604K536849K821877
11935F9675394L090555L091736L020919L206010L457332L488762L560195L713526
11927I6304429L917700M012495M027905M077632M077580M300697M605369M554083
11919A29877890M500606M709200N139376N318077N223063N256897N309903N193430
11911A70528442N004805M586938M113410L229231K158916J305366O69790P460
11903A91604358l41772o50242r05411r23380q63495o41163o94295o32183l54179
11894A85598238k74577Q5028K94674L26385O12551N85008P04343Q42512J034552
11885A89808714J120429J183212J416283J653146J676379J772574J827098K034627
$$ plain form
11877 202492462 204269432 205561574 206420520 206720124 206506124 205405661 203425217 201012094
11869 201012094 198147341 194687201 190934458 187140246 183132423 179295464 175431759 171642011
11861 171642011 168174347 164868406 161725036 159063843 156562530 154069154 151562268 149181261
11853 149181261 146826097 144513155 142061102 139215196 136468618 133677945 130549420 127501372
11845 127501372 124269990 120874740 117471480 113886024 110096432 106118619 102030529 97797116
11837 97797116 93733846 89648303 85805112 82216261 78564947 75167998 72279560 69586605
11829 69586605 66832320 64283944 61982862 59786793 57703055 55570929 53597953 51561626
11821 51561626 49616036 47917302 46325621 44734967 43316575 41853359 40268954 39003044
$$ packed form
11877B02492462J776970J292142Q58946K99604k14000j100463j980444k413123
11869B01012094k864753l460140l752743l794212m007823l836959l863705l789748
11861A71642011l467664l305941l143370k661193k501313k493376k506886k381007
11853A49181261k355164k312942k452053k845906k746578k790673l128525l048048
11845A27501372l231382l395250l403260l585456l789592l977813m088090m233413
11837I7797116m063270m085543l843191l588851l651314l396949k888438k692955
11829F9586605k754285k548376k301082k196069k083738k132126j972976k036327
11821E1561626j945590j698734j591681j590654j418392j463216j584405j265910
$$ plain form
11813 39003044 37790823 36621459 35613644 34675681 33806676 32927644 32081138 31118546 30283893
11804 30283893 29525012 28752804 28152366 27511950 26919521 26265412 25410738 24766717 24197732
11795 24197732 23585155 23135029 22549620 21944809 21557666 21132846 20598334 20102009 19545826
11786 19545826 19110244 18752664 18288924 17812217 17390102 17181032 16878201 16626776 16254167
11777 16254167 15863102 15481037 15142246 14840801 14533489 14160796 13825955 13509908 13429274
11768 13429274 13230395 12927622 12625323 12272130 12105469 11890018 11637425 11459252 11165088
11759 11165088 10978348 10884419 10805181 10410294 10158904 10024034 9865150 9590828 9405692 9352499
11749 9352499 9220362 8883556 8596379 8583650 8527785 8331921 8117218 8019469 7890652 7655554
$$ packed form
11813C9003044j212221j169364j007815r37963q69005q79032q46506r62592q34653
11804C0283893p58881p72208o00438o40416n92429o54109q54674o44021n68985
11795B4197732o12577m50126n85409o04811l87143m24820n34512m96325n56183
11786A9545826m35582l57580m63740m76707m22115k09070l02831k51425l72609
11777A6254167l91065l82065l38791l01445l07312l72693l34841l16047q0634
11768A3429274j98879l02773l02299l53193j66661k15451k52593j78173k94164
11759A1165088j86740r3929p9238l94887k51390j34870j58884k74322j85136n3193
11749I352499j32137l36806k87177j2729n5865j95864k14703r7749j28817k35098
$$ plain form
11739 7655554 7399596 7222288 7203976 7151982 6986287 6932444 6811173 6852159 6958873 6995543
11729 6995543 6737991 6360591 6104440 6048137 6055213 6024804 5965899 5961197 5922616 5902251 5768719
11718 5768719 5738425 5544425 5454622 5347007 5153612 5059471 5062674 5026339 4936304 4842240 4675118
11707 4675118 4621070 4454991 4321691 4169257 4141064 4106614 4113024 4149725 4218508 4144834 4007911
11696 4007911 3944951 3993843 3928823 3653832 3654853 3712610 3646498 3595846 3497098 3493054 3336541
11685 3336541 3217322 3188912 3145839 3097203 3197281 3242993 3098653 3215244 3226437 3331167
11675 3331167 3277936 3016876 2932892 3047809 3095318 2848470 2596677 2442511 2353283 2433076
11665 2433076 2477565 2379366 2436946 2355201 2347224 2264293 2447388 2487723 2470116 2442321 2466086
$$ packed form
11739G655554k55958j77308j8312n1994j65695n3843j21271M0986J06714L6670
11729F995543k57552l77400k56151n6303P076l0409n8905m702l8581k0365j33532
11718E768719l0294j94000q9803j07615j93395r4141L203l6335r0035r4064j67122
11707D675118n4048j66079j33300j52434k8193l4450O410L6701O8783p3674j36923
11696D007911o2960M8892o5020k74991J021N7757o6112n0652r8748m044j56513
11685C336541j19219k8410m3073m8636J00078M5712j44340J16591J1193J04730
11675C331167n3231k61060q3984J14917M7509k46848k51793j54166q9228P9793
11665B433076M4489r8199N7580q1745p977q2931J83095M0335j7607k7795K3765
$$ plain form
11654 2466086 2623697 2546122 2459173 2218421 2129621 2164556 2165135 2175538 2237425 2276911 2213969
11643 2213969 2279274 2291070 2111440 1991422 2036703 2110036 2157122 2015472 1938185 1771877
11633 1771877 1628345 1543515 1342276 1399283 1693662 1608798 1396485 1462964 1624512 1448439
11623 1448439 1347386 1435401 1492452 1346652 1294064 1238413 1246741 1401924 1540017 1508880 1548036
11612 1548036 1407893 1314679 1358041 1513361 1353205 1292870 1360660 1232701 1260680 1428554
11602 1428554 1448733 1457898 1320236 1207803 1304939 1315433 1419930 1559402 1549188 1543823 1381774
11591 1381774 1332449 1410010 1520907 1558236 1550133 1457594 1361651 1345659 1438140 1497732 1371159
11580 1371159 1233477 1192082 1221165 1194687 1146006 1087987 1092184 1071245 1184984 1148198 1111361
$$ packed form
11654B466086J57611p7575q6949k40752q8800L4935N79J0403O1887L9486o2942
11643B213969O5305J1796j79630j20018M5281P3333M7086j41650p7287j66308
11633A771877j43532q4830k01239N7007K94379q4864k12313O6479J61548j76073
11623A448439j01053Q8015N7051j45800n2588n5651Q328J55183J38093l1137L9156
11612A548036j40143r3214M3362J55320j60156o0335O7790j27959K7979J67874
11602A428554K0179R165j37662j12433R7136J0494J04497J39472j0214n365j62049
11591A381774m9325P7561J10897L7329q103r2539r5943j5992R2481N9592j26573
11580A371159j37682m1395K9083k6478m8681n8019M197k0939J13739l6786l6837
$$ plain form
11569 1111361 1138642 1201685 1134319 1028088 948428 1026333 1075000 1079969 1034289 984065 923363
11558 923363 888352 886974 878883 949863 914780 977091 1018907 999122 933141 767149 620069
11547 620069 622170 637077 744411 620250 704889 889796 1035207 1045255 883624 842122 726208
11536 726208 684938 712086 741431 823778 711570 711211 545455 444708 522775 562593 681573
11525 681573 677970 636558 561490 377859 442278 580011 562885 546302 568421 601361 654037
11514 654037 686413 547768 634411 683457 531135 483415 403166 393437 460233 545476 678489
11503 678489 773657 558522 357473 273459 214428 453076 745165 645704 446523 535074
11493 535074 647897 692727 609451 564862 594386 463651 439556 483652 605478 817631 953513
$$ packed form
11569A111361K7281O3043o7366j06231p9660P7905M8667M969m5680n0224o0702
11558I23363l5011j378q091P0980l5083O2311M1816j9785o5981j65992j47080
11547F20069K101J4907J07334j24161Q4639J84907J45411J0048j61631m1502j15914
11536G26208m1270K7148K9345Q2347j12208l59j65756j00747P8067L9818J18980
11525F81573l603m1412p5068j83631O4419J37733j7126j6583K2119L2940N2676
11514F54037L2376j38645Q6643M9046j52322m7720q0249r729O6796Q5243J33013
11503F78489R5168k15135k01049q4014n9031K38648K92089r9461j99181Q8551
11493E35074J12823M4830q3276m4589K9524j30735k4095M4096J21826K12153J35882
$$ plain form
11482 953513 936283 878988 811008 757821 686793 776767 835175 847908 912613 883354 852966
11471 852966 872195 881603 908392 803270 707722 807056 896838 992985 957345 937508 942565 923257
11459 923257 1008739 1009218 944296 936758 1072626 1198008 1116810 1090766 1130479 1163726 1267441
11448 1267441 1448098 1342303 1244373 1235607 1263675 1415938 1477365 1505519 1504779 1601917 1436534
11437 1436534 1187943 1055418 1160437 1229865 1171280 1118587 1230191 1231504 1151094 884582
11427 884582 751188 719993 809904 941305 1042900 1106602 1002471 1084020 1118714 1149602 1195639
11416 1195639 1126685 1039375 979420 941846 765729 737855 872128 1021916 935392 858989 838813
11405 838813 868943 911440 829998 762732 741524 722280 701563 713487 743943 613484 546397
$$ packed form
11482I53513j7230n7295o7980n3187p1028Q9974N8408J2733O4705k9259l0388
11471H52966J9229R408K6789j05122r5548R9334Q9782R6147l5640j9837N057j9308
11459I23257Q5482M79o4922p538J35868J25382q1198k6044L9713L3247J03715
11448A267441J80657j05795r7930q766K8068J52263O1427K8154p40R7138j65383
11437A436534k48591j32525J05019O9428n8585n2693J11604J313q0410k66512
11427H84582j33394l1195Q9911J31401J01595O3702j04131Q1549L4694L0888M6037
11416A195639o8954q7310n9955l7574j76117k7874J34273J49788q6524p6403k0176
11405H38813L0130M2497q1442o7266k1208j9244k0717J1924L0456j30459o7087
$$ plain form
11394 546397 680601 540004 540385 652888 659672 472888 315437 368546 360354 440869 392570
11383 392570 459814 492410 288377 334073 478393 510566 554182 451401 341273 400352 760339
11372 760339 696167 537431 486316 504828 457944 332841 224389 150251 238031 401313 423963
11361 423963 417407 259790 282952 387683 442404 620531 685726 519922 416239 557935
11351 557935 468444 208958 316794 334679 379374 371887 357352 443505 563937 514527 529978
11340 529978 425522 340295 377040 410554 490901 707033 746408 658253 398926 396264 272275
11329 272275 214322 265868 271904 295725 291280 250757 270759 285524 365738 490831 529041 472180
11317 472180 117699 212451 220751 194089 252246 246416 279639 230498 176488 199814 147340 363496
$$ packed form
11394E46397J34204j40597L81J12503O784j86784j57451N3109q192Q0515m8299
11383C92570O7244L2596k04033M5696J44320L2173M3616j02781j10128N9079L59987
11372G60339o4172j58736n1115J8512m6884j25103j08452p4138Q7780J63282K2650
11361D23963o556j57617K3162J04731N4721J78127O5195j65804j03683J41696
11351E57935q9491k59486J07836J7885M4695p487j4535Q6153J20432m9410J5451
11340E29978j04456q5227L6745L3514Q0347K16132L9375q8155k59327k662j23989
11329B72275n7953N1546O036K3821m445m0523K0002J4765Q0214J25093L8210n6861
11317D72180l54481R4752Q300k6662N8157n830L3223m9141n4010K3326n2474K16156
$$ plain form
11305 363496 281706 374442 516613 443824 368445 458350 701137 629614 331424 239918 355330
11294 355330 394186 460267 567189 437899 351698 71486 138744 206926 223579 263620 318204
11283 318204 330900 301536 250937 221109 237255 261943 351306 332346 291781 350728 225064
11272 225064 180285 103217 48178 9486 99714 188143 257872 140088 207782 338712 505705
11261 505705 545316 338737 167305 159236 148183 212152 205631 165068 200185 59886 42838
11250 42838 335721 546970 618961 370838 222088 255315 201608 121401 80360 164823 171649
11239 171649 -3014 -52798 -6207 128999 64563 -46616 7501 13566 68560 162126 192323
11228 192323 218566 238147 107515 75280 -45033 -126919 39428 258829 274343 328285 320355
$$ packed form
11305C63496q1790R2736J42171p2789p5379Q9905K42787p1523k98190r1506J15412
11294C55330L8856O6081J06922j29290q6201k80212O7258O8182J6653M0041N4584
11283C18204J2696k9364n0599k9828J6146K4688Q9363j8960m0565N8947j25664
11272B25064m4779p7068n5039l8692R0228Q8429O9729j17784O7694J30930J66993
11261E05705L9611k06579j71432q069j1053O3969o521m0563L5117j40299j7048
11250D2838K92883K11249P1991k48123j48750L3227n3707q0207m1041Q4463O826
11239A71649j74663m9784M6591J35206o4436j11179N4117O065N4994R3566L0197
11228A92323K6243J9581j30632l2235j20313q1886J66347K19401J5514N3942p930
$$ plain form
11217 320355 180128 29097 60813 143715 71371 48366 86161 89598 171384 335374 368476
11206 368476 324131 257869 156320 175381 144825 121897 -143944 -278425 -396910 -490180 -498132
11195 -498132 -340573 27080 299262 273100 332932 304326 195941 205129 232803 236513 165967
11184 165967 -10496 -28285 204152 282497 265787 264160 199248 167238 161640 277499 199798
11173 199798 119066 -3402 -73338 -113067 -51901 -42699 -4696 23796 61488 240448 335758
11162 335758 244240 224903 95897 14890 76515 28498 49266 302570 345923 163150 -119926
11151 -119926 53786 243112 334630 209308 148516 167470 222136 258569 248360 261840 114006
11140 114006 14312 -43788 13834 110933 121401 74197 -16736 31798 48729 162148 119491
$$ packed form
11217C20355j40227j51031L1716Q2902p2344k3005L7795L437Q1786J63990L3102
11206C68476m4345o6262j01549J9061l0556k2928k65841j34481j18485r3270p952
11195d98132J57559L67653K72182k6162N9832k8606j08385R188K7674L710p0546
11184A65967j76463j7789K32437P8345j6710j627o4912l2010n598J15859p7701
11173A99798q0732j22468o9936l9729O1166R202L8003K8492L7692J78960R5310
11162C35758r1518j9337j29006q1007O1625m8017K0768K53304M3353j82773k83076
11151a19926J73712J89326R1518j25322o0792J8954N4666L6433j0209J3480j47834
11140A14006r9694n8100N7622R7099J0468m7204r0933M8534J6931J13419m2657
$$ plain form
11129 119491 355543 529732 429792 170430 152252 325080 379384 331924 318925 521095
11119 521095 596003 384595 244686 240623 141195 45866 9091 -68851 -56825 -82052 -22351
11108 -22351 55928 61138 45853 397 -29095 153534 89312 32885 159572 177381 205182
11097 205182 216214 140618 55158 -85994 -39635 159076 204986 178017 350940 358886 352925
11086 352925 384604 458225 543346 492924 553012 417915 275940 173257 216257 224328 157368
11075 157368 226383 223923 230251 399204 299936 102424 239702 321433 309715 287118 160120
11064 160120 78100 124571 165676 168960 188669 29765 -125970 -153989 24065 -7396 96206
11053 96206 213333 199317 174481 304844 346796 423406 502952 375216 357128 436685 399868
$$ packed form
11129A19491K36052J74189r9940k59362j8178J72828N4304m7460j2999K02170
11119E21095P4908k11408j39909m063r9428r5329l6775p7942J2026k5227N9701
11108b2351P8279N210j5285m5456k9492J82629o4222n6427J26687J7809K7801
11097B05182J1032p5596q5460j41152M6359J98711M5910k6969J72923P946n961
11086C52925L1679P3621Q5121n0422O0088j35097j41975j02683M3000Q071o6960
11075A57368O9015k460O328J68953r9268j97512J37278Q1731j1718k2597j26998
11064A60120q2020M6471M1105L284J9709j58904j55735k8019J78054l1461J03602
11053I6206J17127j4016k4836J30363M1952P6610P9546j27736j8088P9557l6817
$$ plain form
11042 399868 401991 510683 610069 614975 681146 590879 644138 743326 809072 733186 625308
11031 625308 653697 784574 929876 840761 858128 970522 994092 913613 840013 1020292 1035753
11020 1035753 1074520 1280410 1318859 1283787 1368557 1517342 1623208 1775579 1744363 1499363
11010 1499363 1312474 1208856 1156906 1267188 1194405 1051050 1145200 1185190 1262885 1353138
11000 1353138 1217140 1268067 1204920 1112842 942017 965791 940760 893176 869846 815899 819440
10989 819440 805515 900609 863820 800927 680680 559088 449163 380754 259728 319122 305793
10978 305793 290930 142608 157696 716 742 99012 257624 383604 454672 266395 211096
10967 211096 302016 371262 349510 394745 324065 276618 317085 303521 249511 181185 213599
$$ packed form
11042C99868K123J08692R9386M906O6171r0267N3259R9188O5746p5886j07878
11031F25308K8389J30877J45302q9115J7367J12394K3570q0479p3600J80279J5461
11020A035753L8767K05890L8449l5072Q4770J48785J05866J52371l1216k45000
11010A499363j86889j03618n1950J10282p2783j43355R4150L9990P7695R0253
11000A353138j35998N0927o3147r2078j70825K3774k5031m7584k3330n3947L541
10989H19440j3925R5094l6789o2893j20247j21592j09925o8409j21026N9394j3329
10978C05793j4863j48322J5088j56980K6R8270J58612J25980P1068j88277n5299
10967B11096R0920O9246k1752M5235p0680m7447M0467j3564n4010o8326L2414
$$ plain form
10956 213599 296969 155935 77451 35327 107637 226371 164514 145016 102380 10656 45154
10945 45154 98133 27548 -57968 67509 142287 162636 21670 9435 -82610 192439 172623
10934 172623 21650 -45188 112883 242473 81596 -72390 40931 201178 282481 351844
10924 351844 268103 94290 134584 238037 302084 269121 169584 238158 105986 64233 -61172
10913 -61172 -175007 -23649 -64863 -42070 -13493 89092 51796 -29410 6987 -150730 -375493
10902 -375493 -260832 -230976 -98620 67686 173388 185474 165633 211494 300593 130629
10892 130629 226806 208152 323901 302657 241337 280704 186646 162054 246453 212511 239043
10881 239043 258845 127080 -33889 214244 471571 254224 205071 304965 306368 167330
$$ packed form
10956B13599Q3370j41034p8484m2124P2310J18734o1857j9498m2636r1724L4498
10945D5154N2979p0585q5516J25477P4778K0349j40966j2235r2045K75049j9816
10934A72623j50973o6838J58071J29590j60877j53986J13321J60247Q1303O9363
10924C51844q3741j73813M0294J03453O4047l2963r9537O8574j32172m1753j25405
10913f1172j13835J51358m1214K2793K8577J02585l7296q1206L6397j57717k24763
10902c75493J14661K9856J32356J66306J05702J2086j9841M5861Q9099j69964
10892A30629R6177j8654J15749k1244o1320L9367r4058k4592Q4399l3942K6532
10881B39043J9802j31765j60969K48133K57327k17347m9153R9894J403j39038
$$ plain form
10871 167330 109212 48337 -13380 69641 206914 176914 182808 253349 224822 91879 211366
10860 211366 306630 279428 220630 205560 233512 280287 218324 186151 63037 -4669 79811
10849 79811 262103 328705 409288 404533 406281 358202 317160 273717 481437 659717 724601
10838 724601 705131 776160 591945 423151 453957 333044 419676 683852 740829 722645 638382
10827 638382 499393 442062 492157 334960 344448 318213 212379 183735 319935 361387 554747
10816 554747 560759 476053 245348 276537 255144 199682 362597 448043 416062 393621 430488
10805 430488 510662 403059 377527 330205 321895 375667 371228 410043 519048 524798 410844
10794 410844 325538 205274 381560 507722 493357 357432 205824 222914 256944 144909
$$ packed form
10871A67330n8118o0875o1717Q3021J37273l0000N894P0541k8527j32943J19487
10860B11366R5264k7202n8798j5070K7952M6775o1963l2173j23114o7706Q4480
10849G9811J82292O6602Q0583m755J748m8079m1042m3443K07720J78280O4884
10838G24601j9470P1029j84215j68794L0806j20913Q6632K64176N6977j8184q4263
10827F38382j38989n7331N0095j57197R488k6235j05834k8644J36200M1452J93360
10816E54747O012q4706k30705L1189k1393n5462J62915Q5446l1981k2441L6867
10805D30488Q0174j07603k5532m7322q310N3772m439L8815J09005N750j13954
10794D10844q5306j20264J76286J26162j4365j35925j51608J7090L4030j12035
$$ plain form
10784 144909 156124 153243 111202 150016 307862 301102 311064 338547 343806 316778 287586 259685
10772 259685 244136 332015 355857 425427 354211 291814 499298 355682 273948 397527 440157
10761 440157 543381 570840 396709 273910 346063 496288 452114 530446 656349 579274
10751 579274 463578 480705 527085 536465 619008 647836 483849 443824 357336 429868 316579
10740 316579 210899 348574 476723 593483 663053 811948 709756 567049 605725 501571
10730 501571 650627 803793 805551 763412 710135 752582 814250 992443 1138170 1066788 975297
10719 975297 796952 641210 664113 819851 1026979 1116649 1301280 1151929 970979 746387
10709 746387 722293 927294 1084171 1081510 1079214 1009465 957337 1137409 1171443 1217884 1348593
$$ packed form
10784A44909J1215k881m2041L8814J57846o760R962K7483N259k7028k9192k7901
10772B59685j5549Q7879K3842O9570p1216o2397K07484j43616q1734J23579M2630
10761D40157J03224K7459j74131j22799P2153J50225m4174P8332J25903p7075
10751E79274j15696J7127M6380R380Q2543K8828j63987m0025q6488P2532j13289
10740C16579j05680J37675J28149J16760O9570J48895j02192j42707L8676j04154
10730E01571J49056J53166J758m2139n3277M2447O1668J78193J45727p1382r1491
10719I75297j78345j55742K2903J55738K07128Q9670J84631j49351j80950k24592
10709G46387k4094K05001J56877k661k296o9749n2128J80072L4034M6441J30709
$$ plain form
10698 1348593 1226994 1032263 1108176 1322010 1426302 1401777 1386458 1261926 1077284 1123687
10688 1123687 1336558 1576271 1478005 1428662 1350073 1515038 1399109 1288174 1312171 1408053
10678 1408053 1587893 1613780 1573750 1602628 1566261 1612857 1692065 1566259 1410010 1448109 1541666
10667 1541666 1602611 1763203 1767169 1815194 1777011 1765243 1607321 1543375 1773659 1849693 1871833
10656 1871833 1848586 1899018 2079973 2272176 2352532 2381282 2431033 2445702 2575028 2738557
10646 2738557 3010898 2932733 2786809 3019965 3224206 3491366 3697696 3705955 3593385 3460936
10636 3460936 3638927 3873680 3990263 4267078 4665358 5005176 5371313 5767836 6500635
10627 6500635 7193609 7899103 8606303 9416297 10348522 11127592 11971636 12717755 13592980
$$ packed form
10698A348593j21599j94731P5913K13834J04292k4525j5319j24532j84642M6403
10688A123687K12871K39713r8266m9343p8589J64965j15929j10935K3997R5882
10678A408053J79840K5887m0030K8878l6367M6596P9208j25806j56249L8099R3557
10667A541666O0945J60592L966M8025l8183j1768j57922o3946K30284P6034K2140
10656A871833k3247N0432J80955J92203Q0356K8750M9751J4669J29326J63529
10646B738557K72341p8165j45924K33156K04241K67160K06330Q259j12570j32449
10636C460936J77991K34753J16583K76815L98280L39818L66137L96523P32799
10627F500635O92974P05494P07200Q09994R32225P79070Q44044P46119Q75225
$$ plain form
10618 13592980 14925825 16812860 19332613 22831709 26965167 32240416 38987141 47233806
10610 47233806 55828488 64181615 72077806 79223873 84644449 87215638 87537689 88086383
10602 88086383 90435110 96096045 105834803 119224723 134208671 148659069 161800209
10595 161800209 172913299 178889552 177244457 169796626 162246512 159143444 162435865 172427400
10587 172427400 187608211 204740915 220742183 234114422 243064998 243491514 232283613
10580 232283613 212630094 192857286 178760653 171931640 171232687 175322632 181248952 186612174
10572 186612174 190410744 191084504 185704011 172515004 154592460 137495223 124628593
10565 124628593 116602898 112274014 110262322 109619558 108688702 107108789 103940174 98112172
$$ packed form
10618A3592980J332845J887035K519753L499096M133458N275249O746725Q246665
10610D7233806Q594682Q353127P896191P146067N420576K571189L22051N48694
10602H8086383K348727N660935R738758J3389920J4983948J4450398J3141140
10595A61800209J1113090N976253j645095p447831p550114l103068L292421R991535
10587A72427400J5180811J7132704J6001268J3372239Q950576M26516j1207901
10580B32283613j9653519j9772808j4096633o829013o98953M089945N926320N363222
10572A86612174L798570O73760n380493j3189007j7922544j7097237j2866630
10565A24628593q025695m328884k011692o42764r30856j579913l168615n828002
$$ plain form
10557 98112172 89606333 79458334 69619399 61394551 55004736 49851364 45441169 41954790
10549 41954790 39272875 37022695 35033301 33334427 31709163 30218719 28960809 27893524
10541 27893524 26806761 25682817 24752722 23956125 23045348 22352210 21562363 20822263 20282238
10532 20282238 19681527 19141651 18661029 18150026 17519993 16848853 16351055 16112716 15711567
10523 15711567 15214314 14784044 14412877 13927415 13460531 13102514 12783061 12601245 12579567
10514 12579567 12458125 12067225 11592791 11261388 10866892 10712034 10404959 10085324 9747822
10505 9747822 9440457 9324111 9150669 8774701 8569047 8296192 8182463 7999744 7883516
10496 7883516 7744637 7462803 7362976 7178363 6879809 6595532 6465245 6403016 6138338 5978540
$$ packed form
10557I8112172q505839j0147999r838935q224848o389815n153372m410195l486379
10549D1954790k681915k250180j989394j698874j625264j490444j257910j067285
10541B7893524j086763j123944r30095p96597r10777o93138p89847p40100n40025
10532B0282238o00711n39876m80622n11003o30033o71140m97798k38339m01149
10523A5711567m97253m30270l71167m85462m66884l58017l19453j81816k1678
10514A2579567j21442l90900m74434l31403l94496j54858l07075l19635l37502
10505I747822l07365j16346j73442l75968k05654k72855j13729j82719j16228
10496G883516j38879k81834r9827j84613k98554k84277j30287o2229k64678j59798
$$ plain form
10486 5978540 5965921 5874444 5747515 5653778 5505661 5345971 5221826 4972444 4936277 4865771
10476 4865771 4806888 4654825 4489623 4422322 4443973 4386203 4179018 4094927 3973490 3920514
10466 3920514 3854359 3620190 3521513 3326864 3307950 3297929 3303753 3267574 3217361 3042473 2967985
10455 2967985 3002758 2976325 2892122 2788094 2713841 2883248 2778353 2733027 2613855 2454966
10445 2454966 2451221 2423068 2328550 2419451 2428281 2271559 2332419 2328377 2364413 2214557 2058441
10434 2058441 2071504 2066717 2117172 2166283 2037645 1834846 1769132 1841235 1891988 1840457 1738595
10423 1738595 1562927 1602326 1533200 1672853 1571263 1496400 1576882 1491089 1476839 1529402 1445559
10412 1445559 1320700 1363330 1388209 1611790 1739562 1734186 1617856 1539168 1265846 1179819
$$ packed form
10486E978540j2619r1477j26929r3737j48117j59690j24145k49382l6167p0506
10476D865771n8883j52063j65202o7301K1651n7770k07185q4091j21437n2976
10466C920514o6155k34169r8677j94649j8914j0021N824l6179n0213j74888p4488
10455B967985L4773k6433q4203j04028p4253J69407j04895m5326j19172j58889
10445B454966l745k8153r4518R0901Q830j56722O0860m042L6036j49856j56116
10434B058441J3063m787N0455M9111j28638k02799o5714P2103N0753n1531j01862
10423A738595j75668L9399o9126J39653j01590p4863Q0482q5793j4250N2563q3843
10412A445559j24859M2630K4879K23581J27772n376j16330p8688k73322q6027
$$ plain form
10402 1179819 1138858 1166224 1150773 1206656 1192571 997977 856261 990409 1073943 933303
10392 933303 910454 1038154 1074006 980792 921739 832337 735713 599491 659446 915871 951749
10381 951749 796950 738013 866812 853259 863224 885831 897693 726456 662891 651691 754408
10370 754408 868122 859296 781076 762343 656150 376814 266935 283056 185673 138529 173804
10359 173804 218300 235258 188022 307534 388124 544243 524665 345864 187183 199805 260632
10348 260632 203045 206585 251838 280923 122133 40915 63675 117675 198413 203643 281849 331439
10336 331439 298425 344768 399136 444721 455860 261882 154038 207689 340451 302599 200552
10325 200552 178650 232935 318423 318487 379908 435273 443738 536271 585738 566367 511494 337497
$$ packed form
10402A179819m0961K7366j5451N5883j4085j94594j41716J34148Q3534j40640
10392I33303k2849J27700L5852r3214n9053q9402r6624j36222N9955K56425L5878
10381I51749j54799n8937J28799j3553R965K2607J1862j71237o3565j1200J02717
10370G54408J13714q826p8220j8733j06193k79336j09879J6121r7383m7144L5275
10359A73804M4496J6958m7236J19512Q0590J56119j9578j78801j58681J2622O0827
10348B60632n7587L540M5253K9085j58790q1218K2760N4000Q0738N230P8206M9590
10336C31439l3014M6343N4368M5585J1139j93978j07844N3651J32762l7852j02047
10325B00552k1902N4285Q5488O4O1421N5365Q465R2533M9467j9371n4873j73997
$$ plain form
10313 337497 267614 215079 36691 -70417 126115 211888 414931 479174 382911 299508 120756
10302 120756 66250 83279 223382 164336 -1758 -173930 -115500 -54412 34801 146271 164458
10291 164458 173005 332145 474703 537750 504687 274689 59608 33447 20650 112745 127815
10280 127815 207235 268655 310177 227745 185986 123728 163268 -19661 -43326 71973 112045
10269 112045 185662 114170 70057 136713 317654 414032 349943 230870 256150 389319 258307
10258 258307 232844 231389 243978 250136 120683 46020 51239 181992 248710 307834 87272
10247 87272 -226429 -243130 -182672 19357 311921 410543 316535 200737 104862 81658 -154417
10236 -154417 -34274 87157 215159 250673 103160 66441 189378 162173 28517 128207
$$ packed form
10313C37497o9883n2535j78388j07108J96532Q5773K03043O4243r6263q3403j78752
10302A20756n4506J7029J40103n9046j66094j72172N8430O1088Q9213J11470J8187
10291A64458Q547J59140J42558O3047l3063k29998k15081k6161j2797R2095J5070
10280A27815P9420O1420M1522q2432m1759o2258L9540j82929k3665J15299M0072
10269A12045P3617p1492m4113O6656J80941R6378o4089j19073K5280J33169j31012
10258B58307k5463j455J2589O158j29453p4663N219J30753O6718N9124k20562
10247H7272l13701j6701O0458K02029K92564R8622r4008j15798r5875k3204k36075
10236a54417J20143J21431J28002L5514j47513l6719J22937k7205j33656R9690
$$ plain form
10226 128207 255920 246299 196749 59182 -19588 2704 -1677 -36824 24985 -24075 119024
10215 119024 277258 304712 264812 280381 341180 383830 300890 212119 98951 107008 301213
10204 301213 305116 211645 189131 -17243 2790 68238 142972 299012 271006 141985 216906
10193 216906 254516 135739 261458 452598 418053 193877 -23873 -72211 154214 223840
10183 223840 92610 -63896 -144147 -97297 -116435 76874 150233 131027 355381 439902 485287
10172 485287 404270 298108 330291 442082 493612 352866 311786 208204 159881 418885
10162 418885 621677 750426 717679 760201 801948 908440 945077 957599 761697 766381 776663
10151 776663 858530 1113914 1355630 1442152 1352981 1358856 1273103 1109047 988244 900311 878261
$$ packed form
10226A28207J27713r621m9550j37567p8770K2292m381l5147O1809m9060J43099
10215A19024J58234K7454l9900J5569O0799M2650q2940q8771j13168Q057J94205
10204C01213L903r3471k2514k06374K0033O5448P4734J56040k8006j29021P4921
10193B16906L7610j18777J25719J91140l4545k24176k17750m8338K26425O9626
10183B23840j31230j56506q0251M6850j9138J93309P3359j9206K24354Q4521M5385
10172D85287q1017j06162L2183J11791N1530j40746m1080j03582m8323K59004
10162D18885K02792J28749l2747M2522M1747J06492L6637J2522j95902M684J0282
10151G76663Q1867K55384K41716Q6522q9171N875q5753j64056j20803q7933k2050
$$ plain form
10140 878261 1027991 1226707 1379612 1464950 1231252 1179509 1160294 1154467 1056414 1004497 865873
10129 865873 746103 634735 408046 311906 420079 590223 560955 335514 310328 396430
10119 396430 430994 480607 447712 418494 387887 367778 299116 351291 399665 197111 79709
10108 79709 65337 48811 69810 144150 195409 235229 124522 -5054 37535 137071 123546
10097 123546 -55196 5935 149594 240393 188463 -36962 -150591 -191141 -20914 168008
10087 168008 183279 -714 -197308 -177373 -191743 -84162 34066 -57238 54906 69707
10077 69707 -47447 -33941 52671 -51246 -93027 164156 178936 140772 213853 292072 411272
10066 411272 253199 193725 176079 191455 207825 261363 192819 -59334 100689 294657 280226
$$ packed form
10140H78261J49730J98716J52905Q5338k33698n1743j9215n827r8053n1917j38624
10129H65873j19770j11368k26689r6140J08173J70144k9268k25441k5186Q6102
10119C96430L4564M9613l2895k9218l0607k0109o8662N2175M8374k02554j17402
10108G9709j4372j6526K0999P4340N1259L9820j10707j29576M2589R9536j3525
10097A23546j78742O1131J43659R0799n1930k25425j13629m0550J70227J88922
10087A68008J5271j83993j96594J9935j4370J07581J18228r1304J12144J4801
10077F9707j17154J3506Q6612j03917m1781K57183J4780l8164P3081P8219J19200
10066D11272j58073n9474j7646J5376J6370N3538o8544k52153J60023J93968j4431
$$ plain form
10055 280226 272532 328400 369552 388609 496256 674642 590894 387529 248655 220017 107743
10044 107743 101365 126744 160119 -439 -64771 25551 71457 -15655 -84481 -44578 20034
10033 20034 -41913 -116062 -136937 -31802 93600 100347 -35092 -8413 113390 117227 83547
10022 83547 60505 109210 217951 238027 186310 195768 106003 95218 -120646 -167834 -92328
10011 -92328 107713 233815 205928 169817 89168 143076 241608 236026 140062 21888 1755
10000 1755 96974 310236 321577 241573 254907 279683 271747 321925 235457 183405 82433 -24655
9988 -24655 -181314 -81740 17759 -6253 99606 120765 67237 43592 -47907 -21907 157029
9977 157029 304492 206293 203331 281769 215506 354900 485490 371221 220012 189683 41317
$$ packed form
10055B80226p694N5868M1152J9057J07647J78386q3748k03365j38874k8638j12274
10044A07743o378K5379L3375j60558o4332R0322M5906q7112o8826L9903O4612
10033B0034o1947p4149k0875J05135J25402O747j35439K6679J21803L837l3680
10022H3547k3042M8705J08741K0076n1717R458q9765j0785k15864m7188P5506
10011i2328K00041J26102k7887l6111q0649N3908R8532n582r5964j18174k0133
10000A755R5219K13262J1341q0004J3334K4776p936N0178q6468n2052j00972j07088
9988b4655j56659R9574R9499k4012J05859K1159n3528k3645r1499K6000J78936
9977A57029J47463r8199k962P8438o6263J39394J30590j14269j51209l0329j48366
$$ plain form
9966 41317 -32265 103827 172952 255213 196580 -70195 -6377 101683 73411 146727 -52702
9955 -52702 -51225 -1619 533 148820 135461 52237 206298 415320 411654 187201 108548 87409
9943 87409 95490 132829 86348 180187 336809 483555 647022 653807 654661 694245 912647 1258594
9931 1258594 1567119 2162979 3085068 4437783 6719435 9136043 10332629 11752728 13754114
9922 13754114 15047208 12252108 7917918 5289374 3902058 3152499 2629890 2195377 1943530
9913 1943530 1865879 1563445 1234397 1100015 993903 1162603 1211438 1287354 1257627 1271509
9903 1271509 1204332 1115942 964203 909799 908489 921290 667994 690716 698557 605990 542283
9892 542283 409884 405863 460237 438939 551637 481731 402210 334184 213036 391791 510135
$$ packed form
9966D1317p3582J36092O9125Q2261n8633k66775O3818J08060k8272P3316j99429
9955e2702J477M9606K152J48287j3359q3224J54061K09022l666k24453p8653k1139
9943H7409Q081L7339m6481R3839J56622J46746J63467O785Q54L9584K18402L45947
9931A258594L08525N95860R22089J352715K281652K416608J196586J420099K001386
9922A3754114J293094k795100m334190k628544j387316p49559n22609m34513k51847
9913A943530p7651l02434l29048j34382j06112J68700M8835P5916k9727J3882
9903A271509o7177q8390j51739n4404j310J2801k53296K2722P841r2567o3707
9892E42283j32399m021N4374k1298J12698o9906p9521o8026j21148J78755J18344
$$ plain form
9881 510135 470867 443006 454685 303507 264069 422932 452614 540468 529702 406614 323815
9870 323815 197921 208527 306299 246718 400049 576009 520904 635667 461643 389262 362955
9859 362955 367784 469119 339952 121392 186745 264690 210509 62561 146149 147708 76878
9848 76878 124061 252778 572667 698215 550526 308822 230372 69905 -102864 -151966
9838 -151966 -116723 -53227 -1321 54443 235512 245152 349840 247811 98495 -21028 -27694
9827 -27694 72211 96445 -87514 -83238 -69564 -35888 151849 196236 174081 212120 295145 375564
9815 375564 344173 417157 348405 181147 894 33551 -21336 -61980 70266 -5352 -137357
9804 -137357 -158567 -86533 191341 153320 -84955 -55908 25733 -150356 -289263 -396841 -358989
$$ packed form
9881E10135l9268k7861J1679j51178l9438J58863K9682Q7854j0766j23088q2799
9870C23815j25894J0606R7772n9581J53331J75960n5105J14763j74024p2381k6307
9859C62955M829J01335j29167k18560O5353P7945n4181j47948Q3588J559p0830
9848G6878M7183J28717L19889J25548j47689k41704p8450j60467j72769m9102
9838a51966L5243O3496N1906N5764J81069R640J04688j02029j49316j19523o666
9827b7694R9905K4234j83959M276J3674L3676J87737M4387k2155L8039Q3025Q0419
9815C75564l1391P2984o8752j67258j80253L2657n4887m0644J32246p5618j32005
9804a37357k1210P2034K77874l8021k38275K9047Q1641j76089j38907j07578L7852
$$ plain form
9793 -358989 -35714 -35093 26562 92654 -81112 24524 17503 -78831 -56075 108600 54808
9782 54808 -86113 -113604 -199351 -168576 47007 115420 112442 252319 263355 219856 10598
9771 10598 -167416 -204408 -129961 -202163 -225775 -243234 25438 200993 273800 186220 212566
9760 212566 194312 113513 62440 31578 42772 49846 66426 142825 93784 38231 -44948 -15736
9748 -15736 185727 176747 210269 101673 -7360 46833 1696 -30270 99272 100789 185827
9737 185827 138613 337197 425578 350061 221953 210167 251853 262208 358126 243767 210696
9726 210696 244860 177239 143745 172151 188184 200814 242007 152613 147404 290301 148407
9715 148407 113401 93532 51077 56005 98116 251369 174753 51956 221524 255030 77476
$$ packed form
9793c58989L23275O21O1655O6092j73766J05636p021r6334K2756J64675n3792
9782E4808j40921k7491q5747L0775K15583O8413k978J39877J1036m3499k09258
9771A0598j78014l6992P4447p2202k3612j7459K68672J75555P2807q7580K6346
9760B12566j8254q0799n1073l0862J1194P074J6580P6399m9041n5553q3179K9212
9748a5736K01463q980L3522j08596j09033N4193m5137l1966J29542J517Q5038
9737A85827m7214J98584Q8381p5517j28108j1786M1686J0355R5918j14359l3071
9726B10696L4164o7621l3494K8406J6033J2630M1193q9394n209J42897j41894
9715A48407l5006j9869m2455M928M2111J53253p6616j22797J69568L3506j77554
$$ plain form
9704 77476 -77267 -68222 169358 280405 266497 121947 105928 115935 -42204 -9812 107238
9693 107238 130840 106213 218894 255179 256833 171633 40281 -14247 -354 125505 -16094
9682 -16094 -70454 116378 229700 292862 113148 153242 306147 249703 10754 -86830 -82057
9671 -82057 -101781 -75285 -4692 -12111 32248 -43272 -209059 -25629 123560 138477 168859
9660 168859 146051 239967 169891 257875 125790 66751 66167 64093 71500 14164 28752 35356
9648 35356 178463 199696 171173 150777 -71218 -258833 4457 183443 164751 3231 -25429
9637 -25429 7881 81873 100803 270415 305067 211566 10248 -73896 -42027 -37804 38785 19798
9625 19798 130846 235604 249515 237107 185852 272496 256740 231502 336838 478832 557429
$$ packed form
9704G7476j54743R045K37580J11047j3908j44550j6019J0007j58139L2392J17050
9693A07238K3602k4627J12681L6285J654q5200j31352n4528J3893J25859j41599
9682a6094n4360J86832J13322O3162j79714M0094J52905n6444k38949r7584M773
9671h2057j9724K6496P0593p419M4359p5520j65787J83430J49189J4917L0382
9660A68859k2808R3916p0076Q7984j32085n9039n84k074P407n7336J4588O604
9648C5356J43107K1233k8523k0396k21995j87615K63290J78986j8692j61520k8660
9637b5429L3310P3992J8930J69612L4652r3501k01318q4144L1869M223P6589j8987
9625A9798J11048J04758J3911j2408n1255Q6644j5756k5238J05336J41994P8597
$$ plain form
9614 557429 367626 346324 244877 179861 222905 197157 135876 220047 356607 269883 121032
9603 121032 101623 319985 433086 310762 406031 279889 185636 313314 179055 146729
9593 146729 165661 209186 336729 340430 288239 355877 525304 408333 486120 525129 347587
9582 347587 208534 176797 167530 201280 279236 391257 505075 602666 415477 313220 362963
9571 362963 500887 553374 451030 466501 383388 291713 326250 588155 708847 771607 761654
9560 761654 578494 490414 566148 495231 401641 405116 357842 374823 448574 596951 731376
9549 731376 743006 634818 583755 730091 958172 1036702 864944 864542 884387 899844 946394
9538 946394 1090014 1140580 1189483 1296106 1100170 936887 863704 801061 848501 979877 886127
$$ packed form
9614E57429j89803k1302j01447o5016M3044k5748o1281Q4171J36560q6724j48851
9603A21032j9409K18362J13101j22324R5269j26142r4253J27678j34259l2326
9593A46729J8932M3525J27543L701n2191O7638J69427j16971P7787L9009j77542
9582C47587j39053l1737r267L3750P7956J12021J13818R7591j87189j02257M9743
9571C62963J37924N2487j02344J5471q3113r1675L4537K61905J20692O2760r953
9560G61654j83160q8080P5734p0917r3590L475m7274J6981P3751J48377J34425
9549G31376J1630j08188n1063J46336K28081P8530j71758m02J9845J5457M6550
9538I46394J43620N0566M8903J06623j95936j63283p3183o2643M7440J31376r3750
$$ plain form
9527 886127 831638 826946 873089 977199 999902 908058 1056894 1029009 964611 1065502 1245522
9516 1245522 1163210 1191937 1284851 1144524 919521 903476 1082703 1004894 897279 986950 1050391
9505 1050391 1108084 1005094 919396 1067676 1100780 1165924 1191934 1252725 1244742 1268675 1199853
9494 1199853 1151413 1207176 976857 665084 909759 1052342 1153425 1108294 1068367 913101
9484 913101 941451 929156 900272 889727 1013137 906447 916946 981298 768167 771772 934534
9473 934534 1079684 1080160 979847 928463 889351 910993 910104 628640 596308 654440 562939 532457
9461 532457 631723 762139 856684 802817 871402 925025 865632 891448 825629 672841 607544
9450 607544 624808 604704 548912 430302 381969 272302 155999 267330 376672 556642
$$ packed form
9527H86127n4489m692M6143J04110K2703r1844J48836k7885o4398J00891J80020
9516A245522q2312K8727R2914j40327k25003j6045J79227p7809j07615Q9671O3441
9505A050391N7693j02990q5698J48280L3104O5144K6010O0791p983K3933o8822
9494A199853m8440N5763k30319l11773K44675J42583J01083m5131l9927j55266
9484I13101K8350j2295k8884j0545J23410j06690J0499O4352k13131L605J62762
9473I34534J45150M76j00313n1384l9112K1642q89k81464l2332N8132r1501l0482
9461E32457R9266J30416R4545n3867O8585N3623n9393K5816o5819j52788o5297
9450F07544J7264k0104n5792j18610m8333j09667j16303J11331J09342J79970
$$ plain form
9440 556642 645441 512887 381794 456697 559812 603718 499681 286622 201676 70772
9430 70772 126915 201549 331361 371957 333642 321803 377198 391333 470984 567071 558785 466318
9418 466318 460891 462385 462115 441984 391694 437459 436154 556282 783335 918449 832894 707789
9406 707789 742102 840724 734312 679441 688329 608373 522944 420180 464265 495184 421432
9395 421432 439370 423557 453920 452793 398074 245990 298210 361004 396768 506847 504889 501603
9383 501603 533119 538425 395770 367639 410493 486006 355225 542714 725527 803065 633708
9372 633708 661152 651329 511802 461524 380113 393657 662985 721380 739823 781260 732533
9361 732533 664677 491373 432279 540600 466033 426177 482768 475361 576963 584575 720938
$$ packed form
9440E56642Q8799j32554j31093P4903J03115M3906j04037k13059q4946j30904
9430G0772N6143P4634J29812M0596l8315j1839N5395J4135P9651R6087q286r2467
9418D66318n427J494k70k0131n0290M5765j305J20128K27053J35114q5555j25105
9406G07789L4313R8622j06412n4871Q888p9956q5429j02764M4085L0919p3752
9395D21432J7938j5813L0363j127n4719j52084N2220O2794L5764J10079j958l286
9383E01603L1516N306j42655k8131M2854P5513j30781J87489J82813P7538j69357
9372F33708K7444r823j39527n0278q1411J3544K69328N8395J8443M1437m8727
9361G32533o7856j73304n9094J08321p4567l9856N6591p407J01602P612J36363
$$ plain form
9350 720938 775568 912109 1055454 928965 740833 714144 635140 735069 744432 774784 819415
9339 819415 818826 683866 727756 684517 639277 740473 863551 1019973 903137 930264 880454
9328 880454 647038 664900 724309 635020 551298 653642 599891 595330 741826 789158 812243
9317 812243 718333 617972 616156 708301 854600 837494 797900 614594 544380 800093 1009660
9306 1009660 909893 764494 675713 567982 522485 564627 596424 705216 768653 912589 896804
9295 896804 961639 1094950 1054940 1138701 955056 985057 1052189 1124774 1143430 940576 1160754
9284 1160754 1222528 1156671 1242025 1313979 1306266 1218695 1185911 1125921 1093774 1119951 1162639 1269884
9272 1269884 1376535 1214933 1349418 1487089 1442059 1424907 1463618 1470790 1484780 1373523 1264796
$$ packed form
9350G20938N4630J36541J43345j26489j88132k6689p9004R9929R363L0352M4631
9339H19415n89j34960M3890m3239m5240J01196J23078J56422j16836K7127m9810
9328H80454k33416J7862N9409q9289q3722J02344n3751m561J46496M7332K3085
9317H12243r3910j00361j816R2145J46299j7106l9594j83306p0214K55713K09567
9306A009660r9767j45399q8781j07731m5497M2142L1797J08792O3437J43936j5785
9295H96804O4835J33311m0010Q3761j83645L0001O7132P2585J8656k02854K20178
9284A160754O1774o5857Q5354P1954p713q7571l2784n9990l2147K6177M2688J07245
9272A269884J06651j61602J34485J37671m5030j7152L8711P172J3990j11257j08727
$$ plain form
9261 1264796 1331032 1378689 1510018 1647578 1757901 1991946 2076675 2023963 1979488 2000108 1973890
9250 1973890 2074115 2190009 2155698 2279488 2464385 2531243 2539510 2584705 2510339 2578986 2586361
9239 2586361 2744072 2760080 2705913 2811023 2720345 2590161 2710277 2746677 2675144 2605809 2739899
9228 2739899 2901594 2865011 2897223 3006417 3022232 3406635 3557873 3307241 3337630 3509624
9218 3509624 3760505 3757998 3649286 3799599 3961636 3878798 3982043 4282606 4352471 4206370
9208 4206370 4383106 4443194 4303576 4506122 4643898 4681994 4897085 5174261 5451193 5523727
9198 5523727 5609699 5815731 6008348 6204245 6417307 6572736 6767727 6934947 7179421 7392474
9188 7392474 7712260 7753736 8163253 8417595 8694901 9214446 9690857 10073861 10459245 10871142
$$ packed form
9261A264796O6236M7657J31329J37560J10323K34045Q4729n2712m4475K0620k6218
9250A973890J00225J15894l4311J23790J84897O6858Q267M5195p4366O8647P375
9239B586361J57711J6008n4167J05110r0678j30184J20116L6400p1533o9335J34090
9228B739899J61695l6583L2212J09194J5815L84403J51238k50632L0389J71994
9218C509624K50881k507j08712J50313J62037q2838J03245L00563O9865j46101
9208D206370J76736O0088j39618K02546J37776L8096K15091K77176K76932P2534
9198E523727Q5972K06032J92617J95897K13062J55429J94991J67220K44474K13053
9188G392474L19786M1476M09517K54342K77306N19545M76411L83004L85384M11897
$$ plain form
9178 10871142 11656237 12448610 13088866 13716185 14586108 15305995 16088388 16834449 17641824
9169 17641824 18657361 19782339 20837377 21873030 23071565 24278347 25541636 26908014
9161 26908014 28431042 30020777 31555700 33238304 35071913 37042508 39179325 41469967
9153 41469967 44162439 47166117 50483406 54318812 58663481 63540284 69100946 75195830
9145 75195830 81976407 89177287 96759110 104591827 112821462 121264889 129900920 138987135
9137 138987135 148020710 156657076 165111559 173631367 181850108 189978246 198381535 206786333
9129 206786333 215334688 224156671 233130310 242241568 251648080 261263408 270933380 280854688
9121 280854688 290641924 300214515 309245624 316952132 322925025 326745428 327687784 325689037
$$ packed form
9178A0871142P85095P92373O40256O27319Q69923P19887P82393P46061Q07375
9169A7641824J015537J124978J055038J035653J198535J206782J263289J366378
9161B6908014J523028J589735J534923J682604J833609J970595K136817K290642
9153D1469967K692472L003678L317289L835406M344669M876803N560662O094884
9145G5195830O780577P200880P581823P832717Q229635Q443427Q636031R086215
9137A38987135R033575Q636366Q454483Q519808Q218741Q128138Q403289Q404798
9129B06786333Q548355Q821983Q973639R111258R406512R615328R669972R921308
9121B80854688R787236R572591R031109P706508N972893L820403R42356j998747
$$ plain form
9113 325689037 321001642 314050219 305552700 295923978 285633909 275154577 264691396 254228284
9105 254228284 244084957 234449009 225115845 216000984 207673433 200032921 193061826 186850539
9097 186850539 181203845 175820566 170444530 164977029 159469288 153822819 147981103 142005068
9089 142005068 135871662 129871532 124061072 118735692 114026278 109631716 105846386 102534726
9081 102534726 99543265 96704903 94220051 91985465 89449585 86890467 84007339 81009425
9073 81009425 78014197 74870512 71748084 68728601 65983279 63305927 60824831 58468165
9065 58468165 56103351 53915056 51843674 50108763 48511663 46805970 45073601 43564255
9057 43564255 42169872 40852296 39489756 38294809 37151023 35777111 34527074 33537799
$$ packed form
9113C25689037m687395o951423q497519r628722j0290069j0479332j0463181j0463112
9105B54228284j0143327r635948r333164r114861q327551p640512o971095o211287
9097A86850539n646694n383279n376036n467501n507741n646469n841716n976035
9089A42005068o133406o000130n810460n325380m709414m394562l785330l311660
9081A02534726k991461k838362k484852k234586k535880k559118k883128k997914
9073H1009425k995228l143685l122428l019483k745322k677352k481096k356666
9065E8468165k364814k188295k071382j734911j597100j705693j732369j509346
9057D3564255j394383j317576j362540j194947j143786j373912j250037r89275
$$ plain form
9049 33537799 32699208 31944098 31001053 30044177 29253105 28567043 27730421 26678011 26014304
9040 26014304 25399079 24749375 23952695 23127947 22445025 21799349 21351766 20671334 19854501
9031 19854501 19356100 18970393 18527849 18118068 17663574 17062216 16451542 15860771 15442675
9022 15442675 15053599 14706831 14396561 14099492 13527742 13115588 12839841 12493211 12072778
9013 12072778 11689420 11414954 11307416 11074574 10840678 10736305 10653610 10389446 10064313 9916019
9003 9916019 9699943 9566272 9181609 8857548 8456781 8268600 8178342 7910928 7833174 7839782
8993 7839782 7533190 7138459 7088163 7118698 7020373 6733430 6515550 6381082 6363421 6185382
8983 6185382 6117177 5986260 5644425 5422758 5248667 5080435 5000427 4883127 4791961 4515552
$$ packed form
9049C3537799q38591p55110r43045r56876p91072o86062q36622j052410o63707
9040B6014304o15225o49704p96680q24748o82922o45676m47583o80432q16833
9031A9854501m98401l85707m42544m09781m54494o01358o10674n90771m18096
9022A5442675l89076l46768l10270k97069n71750m12154k75747l46630m20433
9013A2072778l83358k74466j07538k32842k33896j04373q2695k64164l25133j48294
9003I916019k16076j33671l84663l24061m00767j88181r0258k67414p7754O608
8993G839782l06592l94731n0296L0535r8325k86943k17880j34468j7661j78039
8983F185382o8205j30917l41835k21667j74091j68232q0008j17300r1166k76409
$$ plain form
8973 4515552 4324703 4405561 4376303 4400957 4489849 4377221 4234270 4016919 3863712 3837198
8963 3837198 3656415 3622916 3616362 3471298 3541128 3539468 3445447 3347480 3315680 3417622 3484699
8952 3484699 3324783 3142051 2983199 2821468 2780134 2895583 2961878 2884315 2730206 2674222
8942 2674222 2664123 2589890 2494333 2435764 2479172 2490137 2588250 2731028 2631904 2482600 2381449
8931 2381449 2396182 2316911 2265148 2153981 2140727 1959619 1937433 2076591 2047659 1907677 1884263
8920 1884263 1756737 1647014 1673622 1757160 1740398 1759140 1878169 1958396 1890621 1680278 1447529
8909 1447529 1569856 1802997 1807559 1403735 1330036 1363443 1454026 1385150 1258577 1214434 1242756
8898 1242756 1383897 1368662 1237983 1075819 1136122 1252322 1140489 1063227 1063428 886160 803335
$$ packed form
8973D515552j90849Q0858k9258K4654Q8892j12628j42951k17351j53207k6514
8963C837198j80783l3499o554j45064O9830j660r4021r7967l1800J01942O7077
8952C484699j59916j82732j58852j61731m1334J15449O6295p7563j54109n5984
8942B674222j0099p4233r5557n8569M3408J0965R8113J42778r9124j49304j01151
8931B381449J4733p9271n1763j11167j3254j81108k2186J39158k8932j39982k3414
8920A884263j27526j09723K6608Q3538j6762J8742J19029Q0227o7775k10343k32749
8909A447529J22327K33141M562m03824p3699L3407R0583o8876j26573m4143K8322
8898A242756J41141j5235j30679j62164O0303J16200j11833p7262K01j77268q2825
$$ plain form
8887 803335 892319 950746 798297 838794 871011 859585 951859 856591 830401 672627 622972
8876 622972 617722 544041 636428 725190 811566 900664 881877 867570 867063 750403 740098 712766
8864 712766 602779 683048 692715 700777 614657 558563 557623 509847 573018 652611 669278 524854
8852 524854 567431 522446 466586 471234 344318 341593 466195 514941 464742 404261 588095
8841 588095 506712 490878 513284 358969 294570 528528 490528 494089 628745 735975 715500
8830 715500 677694 624725 529113 516273 311038 243751 186612 167795 119695 310948 477992
8819 477992 399272 499083 491163 604002 619606 445177 373378 423288 423154 467576 364391 261165
8807 261165 322582 534012 478674 499701 645321 599278 488842 587450 680060 745137 726277
$$ packed form
8887H03335Q8984N8427j52449M0497L2217j1426R2274r5268k6190j57774m9655
8876F22972n250p3681R2387Q8762Q6376Q9098j8787j4307n07j16660j0305k7332
8864G12766j09987Q0269R667Q062q6120n6094r40m7776O3171P9593J6667j44424
8852E24854M2577m4985n5860M648j26916k725J24602M8746n0199o0481J83834
8841E88095q1383j5834K2406j54315o4399K33958l8000L561J34656J07230k0475
8830G15500l7806n2969r5612j2840k05235o7287n7139j8817m8100J91253J67044
8819D77992p8720R9811p920J12839J5604j74429p1799M9910j34M4422j03185j03226
8807B61165O1417K11430n5338K1027J45620m6043j10436R8608R2610O5077j8860
$$ plain form
8796 726277 719323 564777 513435 542182 501732 543676 583999 531204 490403 496502 606140 598721
8784 598721 475242 439084 532635 626777 558975 518832 669311 559054 428555 513492 580999
8773 580999 626758 684795 734487 786264 723515 737599 769399 733977 598172 615651 690652
8762 690652 731644 683420 584140 650223 643972 435718 351350 384846 529416 546531 574050
8751 574050 463917 492985 574574 458117 521683 676483 705717 549126 593273 767096 980127
8740 980127 1061063 973409 971712 1081924 1029378 967896 1003442 1060728 994043 771950 700450
8729 700450 677097 752874 836381 698198 654611 657357 709881 932097 1027245 1060944 1130444
8718 1130444 1030683 1089476 1047279 1041727 1059818 1198356 1267235 1099505 947820 896658 1088281
$$ packed form
8796G26277o954j54546n1342K8747m0450M1944M0323n2795m0801O099J09638p419
8784E98721j23479l6158R3551R4142o7802m0143J50479j10257j30499Q4937O7507
8773E80999M5759N8037M9692N1777o2749J4084L1800l5422j35805J7479P5001
8762F90652M0992m8224r9280O6083o251k08254q4368L3496J44570J7115K7519
8751E74050j10133K9068Q1589j16457O3566J54800K9234j56591M4147J73823K13031
8740I80127Q0936q7654j697J10212n2546o1482L5546N7286o6685k22093p1500
8729G00450k3353P5777Q3507j38183m3587K746N2524K22216R5148L3699O9500
8718A130444r9761N8793m2197n552J8091J38538O8879j67730j51685n1162J91623
$$ plain form
8707 1088281 1181063 1071387 928347 931858 985264 994919 1116906 1111594 1026352 1161135 1067225
8696 1067225 854320 708240 604928 669884 844676 968949 967316 988028 930399 788848
8686 788848 874059 993991 1066918 930874 863872 771313 782085 866738 818405 904065 913382
8675 913382 902473 1021048 1025518 981242 1027346 779959 575315 515586 472221 611427 740571
8664 740571 646298 640246 646912 483802 399893 430801 411195 434123 459930 451774 670913 744162
8652 744162 569036 495819 606763 565705 322034 174729 163605 274870 203908 109699 216881
8641 216881 161600 191171 332508 399465 300963 311135 145406 234 25924 113811 242391
8630 242391 354686 361265 405986 364706 243213 157226 171762 50809 -66458 52829 205510
$$ packed form
8707A088281R2782j09676j43040L511N3406R655J21987n312q5242J34783r3910
8696A067225k12905j46080j03312O4956J74792J24273j633K0712n7629j41551
8686G88848Q5211J19932P2927j36044o7002r2559J0772Q4653m8333Q5660R317
8675I13382j0909J18575M470m4276M6104k47387k04644n9729m3365J39206J29144
8664G40571r4273o052O666j63110q3909L0908j9606K2928K5807q156K19139P3249
8652G44162j75126p3217J10944m1058k43671j47305j1124J11265p0962r4209J07182
8641B16881n5281K9571J41337O6957r8502J0172j65729j45172K5690Q7887J28580
8630B42391J12295O579M4721m1280j21493q5987J4536j20953j17267J19287J52681
$$ plain form
8619 205510 18795 -54439 58186 115409 241001 222770 153845 38830 -147735 -48665 152416
8608 152416 140377 12437 -201581 -289635 -321222 -94279 418 52613 37070 -75787 -105520
8597 -105520 -5951 8034 109749 150838 175984 194436 173233 233186 312017 211723 68121
8586 68121 -24851 -94307 -44010 67799 112035 215967 132466 127538 220188 183105 315058
8575 315058 289821 148924 -35306 -22678 87515 91439 78508 -115243 14194 173941 97914
8564 97914 103306 68855 138674 72549 50802 50590 172132 172916 245014 181473 186800 206341 304529
8551 304529 255554 116521 62247 56556 -36507 -73966 115361 105318 171689 271607 201969
8540 201969 62759 29213 76085 107114 55216 63586 -11669 -88521 -122100 -229434 -367169
$$ packed form
8619B05510j86715p3234J12625N7223J25592j8231o8925j15015j86565R9070K01081
8608A52416j2039j27940k14018q8054l1587K26943R4697N2195j5543j12857k9733
8597a05520R9569J3985J01715M1089K5146J8452k1203N9953P8831j00294j43602
8586F8121r2972o9456N0297J11809M4236J03932q3501m928R2650l7083J31953
8575C15058k5237j40897j84230J2628J10193L924j2931j93751J29437J59747p6027
8564I7914N392l4451O9819o6125k1747k12J21542P84P2098o3541N327J9541R8188
8551C04529m8975j39033n4274n691r3063l7459J89327j0043O6371R9918o9638
8540B01969j39210l3546M6872L1029n1898Q370p5255p6852l3579j07334j37735
$$ plain form
8529 -367169 -169453 -18434 4558 17815 -3737 -5820 835 145426 198087 -73285 -57564
8518 -57564 -26904 -35609 -115486 -18627 76004 102216 8539 124053 236572 243757 151358 -13084
8506 -13084 -122207 49097 131458 -43008 -38570 49823 37440 49226 56387 -99035 -87504
8495 -87504 -127174 -162606 -187467 -197091 -283086 -161413 89577 117998 153638 117553 89008 -56395
8483 -56395 -52437 54864 283168 291569 308729 367734 317369 181469 76017 8761 -562 9764
8471 9764 84722 122809 12561 -28135 -357 200529 110197 30618 -128937 -150419 55416
8460 55416 289661 430176 283190 159358 38277 130144 155250 292404 201872 41896
8450 41896 -8284 -28393 -111768 -159691 -64883 -85551 3056 241229 360457 395888 110955
$$ packed form
8529c67169J97716J51019K2992J3257k1552k083O655J44591N2661k71372J5721
8518e7564L0660q705p9877R6859R4631K6212r3677J15514J12519P185r2399j64442
8506a3084j09123J71304Q2361j74466M438Q8393j2383J1786P161j55422J1531
8495h7504l9670l5432k4861r624q5995J21673K50990K8421L5640l6085k8545j45403
8483e6395L958J07301K28304Q401J7160N9005n0365j35900j05452o7256r323J0326
8471I764P4958L8087j10248m0696K7778K00886r0332p9579j59555k1482K05835
8460E5416K34245J40515j46986j23832j21081R1867K5106J37154r0532j59976
8450D1896n0180k0109q3375m7923R4808k0668Q8607K38173J19228L5431k84933
$$ plain form
8439 110955 -81712 76290 20448 -111033 -107366 -253445 -314179 -161473 -84274 -26798 55339
8428 55339 200003 54113 -7409 5272 -13761 -144420 -235871 -340741 -219539 -105082 76201
8417 76201 113546 262829 156499 68754 170062 216445 210679 156727 106046 27626 -43928
8406 -43928 -114752 -90838 -120266 -248474 -223719 -145271 97248 365809 178729 -38571 -127140
8395 -127140 -101772 -164182 -328949 -295001 -191243 112614 393993 250948 28458 -24086
8385 -24086 68832 -3845 -72146 -41272 -121404 -3610 239675 116253 -22970 29166 163058
8374 163058 216277 29132 3509 -24309 -98251 -186062 -271260 -288756 -222583 -127942 -107124
8363 -107124 -239348 -223747 -142044 -106283 -139258 41537 181107 182615 133527 144027 5333
$$ packed form
8439A10955j92667J58002n5842j31481L667j46079o0734J52706P7199N7476Q2137
8428E5339J44664j45890o1522J2681j9033j30659r1451j04870J21202J14457J81283
8417G6201L7345J49283j06330q7745J01308M6383n766n3952n0681p8420p1554
8406d3928p0824K3914k9428j28208K4755P8448K42519K68561j87080k17300q8569
8395a27140K5368o2410j64767L3948J03758L03857K81379j43045k22490n2544
8385b4086R2918p2677o8301L0874q0132J17794K43285j23422j39223N2136J33892
8374A63058N3219j87145k5623k7818p3942q7811q5198j7496O6173R4641K0818
8363a07124j32224J5601Q1703L5761l2975J80795J39570J508m9088J0500j38694
$$ plain form
8352 5333 -72840 5386 -98498 -181200 -403771 -489757 -293396 -360104 -456738 -311494 -242472
8341 -242472 -8166 151392 326673 269632 113212 -47728 -96004 -98212 -99895 -70001 -78814
8330 -78814 -10785 -174587 -198102 -160947 -105516 -29453 22216 -50576 -64362 103573 221872
8319 221872 132424 61581 141117 -5698 -169622 -132687 25973 54347 260281 315957 421198
8308 421198 232306 58382 40293 69640 64361 59546 -74619 -233100 -108782 57472 66060
8297 66060 41369 35 -101760 111239 125989 4352 40947 67238 115987 192978 144381
8286 144381 274542 310108 78223 136917 81833 40683 -144925 -245356 -147294 63878 106271
8275 106271 821 -140773 -267775 -231726 -108131 -145433 -185536 -67675 -275107 -317537
$$ packed form
8352E333p8173P8226j03884q2702k22571q5986J96361o6708r6634J45244O9022
8341b42472K34306J59558J75281n7041j56420j60940m8276k208j683K9894q813
8330g8814O8029j63802k3515L7155N5431P6063N1669p2792j3786J67935J18299
8319B21872q9448p0843P9536j46815j63924L6935J58660K8374K05934N5676J05241
8308D21198j88892j73924j8089K9347n279m815j34165j58481J24318J66254Q588
8297F6060k4691m1334j01795K12999J4750j21637L6595K6291M8749P6991m8597
8286A44381J30161L5566k31885N8694n5084m1150j85608j00431R8062K11172M2393
8275A06271j05450j41594j27002L6049J23595l7302m0103J17861k07432m2430
$$ plain form
8265 -317537 -308569 -332074 -332963 -159213 517 -59617 -107315 -68194 29975 31216 123639 196925
8253 196925 218924 123245 21143 -78726 8418 -33116 -91385 20883 95741 13868 -151096
8242 -151096 -66352 -108894 -243731 -429222 -288295 -102234 -131518 -34266 -17166 -44669 -17770
8231 -17770 31898 -30857 -117839 -210670 -311744 -202399 -181954 -296419 -296944 -321166 -266712 -147075
8219 -147075 -71030 -6761 -19162 -61440 -128664 -203444 -165572 -74236 -92614 -132738 -74540 -38372
8207 -38372 -60021 -169042 -235717 -168985 -84503 -101615 -79397 37817 70784 77862 1165 -12295
8195 -12295 121198 -6253 -244925 -139766 11498 177290 37356 19913 74063 109516
8185 109516 -123914 -226413 -225948 -140987 -144208 -227233 -178653 -107808 -80979 -53744 47253 -14088
$$ packed form
8265c17537Q968k3505q89J73750J59730o0134m7698L9121R8169J241R2423P3286
8253A96925K1999r5679j02102r9869Q7144m1534n8269J12268P4858q1873j64964
8242a51096Q4744m2542j34837j85491J40927J86061k9284R7252J7100k7503K6899
8231a7770M9668o2755q6982r2831j01074J09345K0445j14465n25k4222N4454J19637
8219a47075P6045O4269j2401m2278o7224p4780L7872R1336j8378m0124N8198L6168
8207c8372k1649j09021o6675O6732Q4482j7112K2218J17214L2967P078p6697j3460
8195a2295J33493j27451k38672J05159J51264J65792j39934j7443N4150L5453
8185A09516k33430j02499M65Q4961l221q3025M8580P0845K6829K7235J00997o1341
$$ plain form
8173 -14088 -72041 -99586 -111236 -24005 919 -108754 -188512 -66730 -17552 -207109 -21193
8162 -21193 177375 227214 201736 40415 62738 140251 85743 47374 18524 -140899 -249726
8151 -249726 -123779 -163341 -55581 135807 13754 -152184 -24224 25299 86382 21314
8141 21314 -154662 -294208 -266892 -93050 -220141 -255915 -226611 -162717 -324552 -261879 -200376
8130 -200376 22845 17919 -146584 -38433 41895 77341 -96406 -78545 -82545 -30542 62670
8119 62670 136294 28711 -166620 -132809 -37867 267484 123549 103227 174982 22132 -78521
8108 -78521 -35743 55251 91969 -8620 -4115 71537 -110969 -148036 -104391 -28001 -179088
8097 -179088 -133904 -110126 -115917 -252720 -187998 -95881 -57958 -87668 -67746 -20162 144418
$$ packed form
8173a4088n7953k7545j1650Q7231K4924j09673p9758J21782M9178j89557J85916
8162b1193J98568M9839k5478j61321K2323P7513n4508l8369k8850j59423j08827
8151b49726J25947l9562J07760J91388j22053j65938J27960M9523O1083o5068
8141B1314j75976j39546K7316J73842j27091l5774K9304O3894j61835O2673O1503
8130b00376K23221m926j64503J08151Q0328L5446j73747J7861m000N2003R3212
8119F2670P3624j07583j95331L3811R4942L05351j43935k0322P1755j52850j00653
8108g8521M2778R0994L6718j00589M505P5652j82506l7067M3645P6390j51087
8097a79088M5184K3778n791j36803O4722R2117L7923k9710J9922M7584J64580
$$ plain form
8086 144418 234226 92958 -121588 -112467 -49226 -97099 -91184 -46712 -194213 -350743 -194537
8075 -194537 12017 91160 198195 230203 33238 -87221 3541 4036 3825 -164231 -130181
8064 -130181 -193878 -377321 -312036 -200560 -1006 9467 111093 262990 188516 54734
8054 54734 87920 3130 -47362 -153732 -193962 44549 75247 188030 123737 -183775 -213635
8043 -213635 -158308 -194384 -169768 -248306 -232946 -180138 -237778 -324480 -354398 -265746 -13178
8032 -13178 19640 -75393 -211546 -327059 -251034 -193670 77489 229910 -22286 -96272 -104468
8021 -104468 -181591 -205441 -67364 -30572 -88102 -63592 28398 -17759 -74695 37144 8858
8010 8858 -59417 -6137 104203 195973 367447 258729 -131959 -177975 -155767 -92488 -164102
$$ packed form
8086A44418Q9808j41268k14546R121O3241m7873N915M4472j47501j56530J56206
8075a94537K06554P9143J07035L2008j96965j20459R0762M95k11j68056L4050
8064a30181o3697j83443O5285J11476J99554J0473J01626J51897p4474j33782
8054E4734L3186q4790n0492j06370m0230K38511L0698J12783o4293l07512k9860
8043b13635N5327l6076K4616p8538J5360N2808n7640q6702k9918Q8652K52568
8032a3178L2818r5033j36153j15513P6025N7364K71159J52421k52196p3986q196
8021a04468p7123k3850J38077L6792n7530K4510R1990m6157n6936J11839k8286
8010H858o8275N3280J10340R1770J71474j08718l90688m6016K2208O3279p1614
$$ plain form
7999 -164102 -127711 -113066 -8749 -39222 75572 76197 -79434 -9105 53517 -201638 -437443
7988 -437443 -254997 -63632 -113939 -9182 -14463 -25743 -10233 -1791 80773 19766 -98079
7977 -98079 -37069 266510 392749 221706 288709 251569 -27696 -184681 -65317 29258 -10941
7966 -10941 80110 198829 113573 -19585 -1278 -85746 -129014 -130499 -181453 -42716 -28128
7955 -28128 -128418 -144037 -198118 -49597 134495 22770 -26157 136578 284457 121364
7945 121364 -56368 -238933 -377106 -408059 -374409 -172605 100359 54296 -7062 1373 -93251
7934 -93251 -246189 -118714 57248 19313 53409 -5881 -50442 52342 96448 227567 133577
7923 133577 92831 180010 255126 7893 -127080 -131458 -56135 -36644 118128 179008 61702
$$ packed form
7999a64102L6391J4645J04317l0473J14794O25j55631P0329O2622k55155k35805
7988d37443J82446J91365n0307J04757n281j1280J5510Q442Q2564o1007j17845
7977i8079O1010L03579J26239j71043O7003l7140k79265j56985J19364R4575m0199
7966a0941R1051J18719q5256j33158J8307q4468m3268j485n0954J38737J4588
7955b8128j00290j5619n4081J48521J84092j11725m8927J62735J47879j63093
7945A21364j77732j82565j38173l0953L3650K01804K72964m6063o1358Q435r4624
7934i3251j52938J27475J75962l7935L4096n9290m4561J02784M4106J31119r3990
7923A33577m0746Q7179P5116k47233j34973m378P5323J9491J54772O0880j17306
$$ plain form
7912 61702 -70801 -117203 -178884 -200836 -119117 -217234 -179096 -32386 -13648 -146226 -216505
7901 -216505 -234664 -173583 73558 195256 25591 26369 119347 74302 -47969 -24078 3777
7890 3777 26576 -14927 -21112 17201 69341 230 56131 76250 94070 202594 227667 179472
7878 179472 73219 220590 360777 101090 -68370 71511 90093 879 -89190 -301122
7868 -301122 -387289 -298401 -199085 -235739 -296321 -343331 -267270 -270589 -257485 -241570 -159841 -204510
7856 -204510 -174986 8133 152677 150261 -16328 -33230 43143 81376 192341 43208 -165028
7845 -165028 -82953 37274 106771 33715 58596 163419 275191 257265 151662 -23767 -155605
7834 -155605 -157417 -175833 -87726 -11576 -129003 -258871 -308178 73203 23801 -6002 -66971
$$ packed form
7912F1702j32503m6402o1681k1952Q1719r8117L8138J46710J8738j32578p0279
7901b16505j8159O1081K47141J21698j69665P78R2978m5045j22271K3891K7855
7890C777K2799m1503o185L8313N2140o9111N5901K0119J7820J08524K5073m8195
7878A79472j06253J47371J40187k59687j69460J39881J8582q9214r0069k11932
7868c01122q6167Q8888R9316l6654o0582m7010P6061l319J3104J5915Q1729m4669
7856b04510K9524J83119J44544k416j66589j6902P6373L8233J10965j49133k08236
7845a65028Q2075J20227O9497p3056K4881J04823J11772j7926j05603j75429j31838
7834a55605j812j8416Q8107P6150j17427j29868m9307L81381m9402k9803o0969
$$ plain form
7823 -66971 -246866 -97356 -8117 -99582 4825 42835 17375 60968 40604 -30299 -173983
7812 -173983 -140552 -67457 113344 124618 17325 -156011 -130113 10635 139212 158360 176776
7801 176776 103893 39706 195918 248037 219446 198909 240020 362980 347120 353606 253811
7790 253811 -90391 -291484 -147830 117941 296079 227029 161870 54436 570 -50803
7780 -50803 -511 66369 117215 82779 137689 116834 37523 42928 133183 125647 127652 290811
7768 290811 348955 359020 292275 272259 191894 -39332 -124297 -141312 -160366 -81692 -73180 84585
7756 84585 92427 112488 157764 180571 261782 183050 46196 -261520 -235756 3031 94688
7745 94688 -40127 -161591 -82641 49095 137901 58551 -8201 -4513 -40399 32019 -988
$$ packed form
7823f6971j79895J49510Q9239r1465J04407L8010k5460M3593k0364p0903j43684
7812a73983L3431P3095J80801J1274j07293j73336K5898J40748J28577J9148J8416
7801A76776p2883o4187J56212N2119k8591k0537M1111J22960j5860O486r9795
7790B53811l44202k01093J43654K65771J78138o9050o5159j07434n3866n1373
7780e0803N0292O6880N0846l4436N4910k0855p9311N405R0255p536K005J63159
7768B90811N8144J0065o6745k0016q0365k31226q4965j7015j9054P8674Q512J57765
7756H4585P842K0061M5276K2807Q1211p8732j36854l07716K5764K38787R1657
7745I4688j34815j21464P8950J31736Q8806p9350o6752L688l5886P2418l3007
$$ plain form
7734 -988 -4619 97226 206070 10520 -178809 -143660 4 -52379 -49510 1847 103304
7723 103304 102322 69230 27632 -10732 -138820 -51503 -34776 -41561 -42655 -59539 -96667 18157
7711 18157 82767 1178 -2374 -70650 -23999 21926 16949 81710 83577 91928 19117 -425 -92008
7698 -92008 -100232 -15709 -65775 -160836 -100250 29582 -27099 -147868 -196385 -108381 -34832 -42082
7686 -42082 -205351 -157245 69928 84154 5490 -81398 -34311 -70564 -135042 -124412 -257995
7675 -257995 -261052 -237431 -309872 -276630 -395920 -475304 -461874 -390899 -301085 -289322 -236376 -192874
7663 -192874 -380513 -473506 -130101 -29385 22909 -84667 -65485 -50761 13692 61625 124597
7652 124597 150625 310982 296850 332987 431501 460823 188364 -32356 -149861 -278401 -237434
$$ packed form
7734i88l631J01845J08844j95550j89329L5149J43664n2383K869N1357J01457
7723A03304r82l3092m1598l8364j28088Q7317J6727o785j094j6884l7128J14824
7711A8157O4610q1589l552o8276M6651M5925m977O4761J867Q351p2811j9542r1583
7698i2008q224Q4523n0066r5061O0586J29832n6681j20769m8517Q8004P3549p250
7686d2082j63269M8106K27173J4226p8664q6888M7087l6253o4478J0630j33583
7675b57995l057K3621p2441L3242j19290p9384J3430P0975Q9814J1763N2946M3502
7663a92874j87639r2993L43405J00716N2294j07576J9182J4724O4453M7933O2972
7652A24597K6028J60357j4132L6137R8514K9322k72459k20720j17505j28540M0967
$$ plain form
7641 -237434 -179429 -155302 -48490 -20186 50827 148375 350961 296270 -45439 -13782 31422
7630 31422 -51019 45598 174774 95950 93713 106208 145630 234755 139896 -26245 -83635 -6727
7618 -6727 112803 78539 -40866 -173283 -165086 -215812 -189498 -167598 -129281 -91325 -69923 -180733
7606 -180733 -77319 -30204 -107643 -276027 -344725 -271583 -332726 -432683 -507719 -402472 -249295
7595 -249295 -172466 25412 -42783 -174311 -306475 -363064 -191463 99206 -15682 -121951
7585 -121951 -161818 -197376 -118179 -50891 -75321 -27999 46971 151120 285688 300005 281730
7574 281730 240147 221467 101067 92157 40087 -71928 -229948 -219632 -195707 -176370 -246119
7563 -246119 -301083 -347427 -210405 -97357 -174453 -173575 39649 179965 -30996 -71571 -103853
$$ packed form
7641b37434N8005K4127J06812K8304P1013R7548K02586n4691l41709L1657M5204
7630C1422q2441R6617J29176p8824k237J2495L9422Q9125r4859j66141n7390P6908
7618f727J19530l4264j19405j32417Q197n0726K6314K1900L8317L7956K1402j10810
7606a80733J03414M7115p7439j68384o8698P3142o1143r9957p5036J05247J53177
7595b49295P6829J97878o8195j31528j32164n6589J71601K90669j14888j06269
7585a21951l9867l5558P9197O7288k4430M7322P4970J04149J34568J4317j8275
7574B81730m1583j8680j20400q910n2070j12015j58020J0316K3925J9337o9749
7563b46119n4964m6344J37022J13048p7096Q78K13224J40316k10961m0575l2282
$$ plain form
7552 -103853 -195239 -350934 -292414 -217428 -88936 42636 69978 85751 64605 -85524 -120235
7541 -120235 28177 4117 -23564 -45026 143585 146775 65186 31952 -36529 -205670 -168382
7530 -168382 65306 114940 94825 3235 105021 -53228 -46554 -8964 139641 184763 217510
7519 217510 33849 -230313 -271187 -173695 -59140 -201454 -193040 -75447 41998 50380 23474
7508 23474 97267 65114 -2097 30375 61197 188335 200501 326260 90343 3905 79966
7497 79966 16196 -117954 95933 160752 34411 6266 75598 -30458 -78993 12460 118223
7486 118223 92065 15169 -108161 -90556 -88221 34071 54849 -100951 -143931 -142317 -150285 -153106
7474 -153106 -143630 -5870 34875 81243 36549 50468 -17746 -228979 -280299 -198802 -129723
$$ packed form
7552a03853r1386j55695N8520P4986J28492J31572K7342J5773k1146j50129l4711
7541a20235J48412k4060k7681k1462J88611L190q1589l3234o8481j69141L7288
7530a68382K33688M9634k0115r1590J01786j58249O674L7590J48605M5122L2747
7519B17510j83661k64162m0874R7492J14555j42314Q414J17593J17445Q382k6906
7508B3474P3793l2153o7211L2472L0822J27138J2166J25759k35917q6438P6061
7497G9966o3770j34150K13887O4819j26341k8145O9332j06056m8535R1453J05763
7486A18223k6158p6896j23330J7605K335J22292K0778j55800m2980J614p968k821
7474a53106R476J37760M0745M6368m4694J3919o8214k11233n1320Q1497O9079
$$ plain form
7463 -129723 -126009 -81279 51157 82598 -39266 -95248 62809 273419 193355 65889 17242
7452 17242 -51624 -5287 56118 -46092 -317333 -179462 -104405 -140510 -177873 -90080 -125952
7441 -125952 23147 32158 -65809 -81625 -93786 -18097 -117211 -55293 -28169 -89910 69261
7430 69261 87716 10081 -59329 6588 -42207 -101702 -127271 -185533 -216389 -336953 -368345 -267667
7418 -267667 -118903 -78025 -7752 -74154 3858 96247 -13820 -124241 -196463 -126220 31253
7407 31253 -122935 -246148 -123900 -108511 -166519 -51668 28232 -182443 -386294 -264029
7397 -264029 -56074 -21897 -134319 -148403 -128242 -203933 -213296 -256480 -321222 -333330 -368459
7386 -368459 -298347 -81132 -165115 -204336 -130997 -9908 -35298 32977 -138294 -69541 43821
$$ packed form
7463a29723L714M4730J32436L1441j21864n5982J58057K10610q0064j27466m8647
7452A7242o8866M6337O1405j02210k71241J37871P5057l6105l7363Q7793l5872
7441a25952J49099R011r7967j5816j2161P5689r9114O1918K7124o1741J59171
7430F9261J8455p7635o9410O5917m8795n9495k5569n8262l0856j20564l1392J00678
7418b67667J48764M0878P0273o6402P8012R2389j10067j10421p2222P0243J57473
7407C1253j54188j23213J22248J5389n8008J14851P9900k10675k03851J22265
7397b64029K07955L4177j12422j4084K0161p5691r363m3184o4742j2108l5129
7386c68459P0112K17215q3983l9221P3339J21089k5390O8275j71271O8753J13362
$$ plain form
7375 43821 -198301 -290438 -232392 -213186 -161195 -63308 36984 90892 51337 94571 162770
7364 162770 153715 -11739 -115649 -79829 -3495 -113886 -343259 -162519 -23315 -92529 39439
7353 39439 70137 138598 202352 86488 12548 1889 -252737 -264456 -178844 -151039 -11714
7342 -11714 -47450 -218480 -113708 -38856 97250 115859 66757 18456 -72869 -97582 -104522
7331 -104522 -63328 6493 83294 269471 194451 -54276 -211118 -81174 146476 207702 210448
7320 210448 2194 30242 -132938 -88809 57673 48991 -51995 -19433 -12172 -10155 162598
7309 162598 164594 -64043 -157107 61175 207777 233264 93755 -27579 -162129 -76536 126198
7298 126198 -65393 -150391 54202 60115 -96533 -195385 -225089 -180711 32385 168822 272918
$$ packed form
7375D3821k42122r2137N8046J9206N1991R7887J00292N3908l9555M3234O8199
7364A62770r055j65454j03910L5820P6334j10391k29373J80740J39204o9214J31968
7353C9439L0698O8461O3754j15864p3940j0659k54626j1719Q5612K7805J39325
7342a1714l5736j71030J04772P4852J36106J8609m9102m8301r1325k4713o940
7331a04522M1194O9821P6801J86177p5020k48727j56842J29944K27650O1226K746
7320B10448k08254K8048j63180M4129J46482q682j00986L2562P261K017J72753
7309A62598J996k28637r3064K18282J46602K5487j39509j21334j34550Q5593K02734
7298A26198j91591q4998K04593N913j56648r8852k9704M4378K13096J36437J04096
$$ plain form
7287 272918 292375 142249 6675 -205456 -389918 -337668 -168210 -26398 128320 99314
7277 99314 89097 216396 128823 66377 54243 -14967 87497 99029 -43361 22805 72558
7266 72558 -26634 -168475 -163058 -82563 -40006 113402 312277 339991 138995 2077 24072
7255 24072 -197024 -136666 -74204 -215754 -88329 -135851 -61842 -5103 -7576 -134486 -169917
7244 -169917 -88068 19918 3552 -55924 -70467 -179000 -105269 -58277 -87272 4538 89040
7233 89040 -56092 -111534 -227660 -224315 -157607 -207879 -183963 -95059 -152089 -232445 -243132 -267507
7221 -267507 -305517 -317322 -278703 -290144 -429558 -291709 -215796 -161535 -187434 -76958 -183594
7210 -183594 -98169 -105913 -295386 -361604 -201688 -204822 -169210 -28234 58654 -24039 2818
$$ packed form
7287B72918J9457j50126j35574k12131j84462N2250J69458J41812J54718k9006
7277I9314j0217J27299q7573o2446j2134o9210J02464J1532j42390O6166M9753
7266G2558r9192j41841N417Q0495M2557J53408J98875K7714k00996j36918K1995
7255B4072k21096O0358O2462j41550J27425m7522P4009N6739k473j26910l5431
7244a69917Q1849J07986j6366n9476j4543j08533P3731M6992k8995R1810Q4502
7233H9040j45132n5442j16126L345O6708n0272K3916Q8904n7030q0356j0687k4375
7221b67507l8010j1805L8619j1441j39414J37849P5913N4261k5899J10476j06636
7210a83594Q5425p744j89473o6218J59916l134L5612J40976Q6888q2693K6857
$$ plain form
7199 2818 83681 11315 -76307 -140081 -44281 -7709 -34748 40572 129618 294337 282286 137789
7187 137789 93274 31816 16421 62203 -23687 -72309 66493 172104 12177 -55104 12434
7176 12434 17794 9197 45757 -51096 13187 238840 364442 312460 95690 -27349 -44677
7165 -44677 -217869 -121229 105929 81634 -94262 -143799 -73233 60215 200447 63894 -37140
7154 -37140 114454 2546 -115134 -221496 -91380 3530 -106384 -193301 -246564 -167102 -174563
7143 -174563 -189013 -52998 -8702 33433 -33679 -123432 25319 75409 -1170 -59772 -147977
7132 -147977 -133867 -4442 -78715 -71836 -113601 -74511 -76053 -112409 -160950 -161253 -83 85185
7120 85185 24379 -165705 -207198 -178214 -148279 -127971 -175428 -122796 -4721 25104 90798
$$ packed form
7199B818Q0863p2366q7622o3774R5800L6572k7039P5320Q9046J64719j2051j44497
7187A37789m4515o1458j5395M5782q5890m8622J38802J05611j59927o7281O7538
7176A2434N360q597L6560r6853O4283K25653J25602n1982k16770j23039j7328
7165d4677j73192R6640K27158k4295j75896m9537P0566J33448J40232j36553j01034
7154c7140J51594j11908j17680j06362J30116R4910j09914q6917n3263P9462p461
7143a74563j4450J36015M4296M2135o7112q9753J48751N0090p6579n8602q8205
7132a47977J4110J29425p4273O879m1765L9090j542l6356m8541l03J61170Q5268
7120H5185o0806j90084m1493K8984K9935K0308m7457N2632J18075K9825O5694
$$ plain form
7109 90798 19535 77309 37851 8041 58521 36579 59293 62363 -4024 63238 -53890 -94114
7097 -94114 -22608 -664 69177 51255 -43955 -20278 -9276 -81502 -66162 31362 -99682 -15215
7085 -15215 87077 54566 -4580 -194036 -126817 -38636 13795 45274 8668 50827 58000 -32133
7073 -32133 -141695 -136332 36800 87218 99877 -48963 -56978 52339 92719 104619 92297
7062 92297 207544 258800 390392 442130 405386 361658 130989 -69052 -51164 -57732 -1361
7051 -1361 56622 99582 98871 70211 25957 65474 -1798 4586 60528 -107666 -138099 -123743
7039 -123743 -52844 -17548 38956 25041 -28179 -23489 -83994 -8846 -8558 -9007 48434 124549 241054
7026 241054 106990 -20342 25251 -60948 -98563 -147878 -295562 -351480 -278103 -230401 -233210
$$ packed form
7109I0798p1263N7774l9458k9810N0480k1942K2714L070o6387O7262j17128m0224
7097i4114P1506K1944O9841j7922r5210K3677J1002p2226J5340R7524j31044Q4467
7085a5215J02292l2511n9146j89456O7219Q8181N2431L1479l6606M2159P173r0133
7073c2133j09562N363J73132N0418J2659j48840q015J09317M0380J1900j2322
7062I2297J15247N1256J31592N1738l6744m3728k30669k00041J7888o568N6371
7051a361N7983M2960p11k8660m4254L9517o7272O384N5942j68194l0433J4356
7039a23743P0899L5296N6504j3915n3220M690o0505P5148K88m49N7441P6115J16505
7026B41054j34064j27332M5593q6199l7615m9315j47684n5918P3377M7702k809
$$ plain form
7015 -233210 -139293 -305053 -285306 -163344 -206000 -82699 -61583 -111091 -103600 -32925 -60113
7004 -60113 -47856 -169450 -316249 -379412 -260836 -368155 -324036 -351741 -314037 -193545 -116092
6993 -116092 28477 199996 129818 79612 -215661 -296067 -73210 8043 62072 74428 296341
6982 296341 351363 193903 85196 202918 178452 42745 123499 159666 315237 235698 171597
6971 171597 149810 56395 -22424 91638 198116 98408 54051 95208 102772 3708 151158
6960 151158 196202 187210 155147 -157667 -140016 123304 170282 39269 -241839 -267033 -115674
6949 -115674 -23731 -38383 -85786 -75826 -326453 -460467 -522256 -440671 -234399 -85943 -197486
6938 -197486 -309410 -324626 -315348 -222936 -23952 81696 -31547 -226120 -234713 -295424 -276172
$$ packed form
7015b33210R3917j65760J9747J21962m2656J23301K1116m9508P491P0675k7188
7004f0113J2257j21594j46799o3163J18576j07319M4119k7705L7704J20492P7453
6993a16092J44569J71519p0178n0206k95273q0406K22857Q1253N4029J2356K21913
6982B96341N5022j57460j08707J17722k4466j35707Q0754L6167J55571p9539o4101
6971A71597k1787r3415p8819J14062J06478r9708m4357M1157P564r9064J47450
6960A51158M5044q992l2063l12814J7651K63320M6978j31013k81108k5194J51359
6949a15674R1943j4652m7403R960k50627j34014o1789Q1585K06272J48456j11543
6938a97486j11924j5216R278R2412J98984J05648j13243j94573q593o0711J9252
$$ plain form
6927 -276172 -203496 -450639 -378793 -173122 -41619 -178646 -118902 -148245 -122903 71863 151761
6916 151761 107822 16442 -122921 -107147 -184217 -193887 -139609 27778 -98294 -218341 -137817
6905 -137817 -162425 -198644 -297164 -292568 -20569 25705 58331 101425 63221 139169 115705 100351
6893 100351 188046 159787 17386 -85068 -175622 -139581 -131243 -156279 -101437 -165495 -257033
6882 -257033 -212619 -131365 -68867 12939 -9377 -156338 -102954 -142805 -129913 -229118 -213034
6871 -213034 -190476 -146769 -65404 -115819 -41517 -192024 -261238 -99453 -64659 -150495 -128641
6860 -128641 42594 264949 79590 -190088 -269834 -280542 -252335 -202687 -161907 -175363 -179555
6849 -179555 -180756 -123544 -179678 -54791 16972 -72473 -242606 -391858 -299536 -229021 -246844
$$ packed form
6927b76172P2676k47143P1846K05671J31503j37027N9744k9343K5342J94766P9898
6916A51761m3939r1380j39363J5774p7070r670N4278J67387j26072j20047Q0524
6905a37817k4608l6219r8520M596K71999M6274L2626M3094l8204P5948k3464j5354
6893A00351Q7695k8259j42401j02454r0554L6041Q338k5036N4842o4058r1538
6882b57033M4414Q1254O2498Q1806k2316j46961N3384l9851J2892r9205J6084
6871b13034K2558M3707Q1365n0415P4302j50507o9214J61785L4794q5836K1854
6860a28641J71235K22355j85359k69678p9746j0708K8207M9648M0780j3456m192
6849a79555j201N7212n6134J24887P1763q9445j70133j49252R2322P0515j7823
$$ plain form
6838 -246844 -261624 -127000 89252 117190 109881 177675 214286 346594 364859 233075 204990
6827 204990 84286 70625 -55231 -115501 -161609 -109130 -49752 -145068 -358251 -354535 -214503
6816 -214503 -171049 -258521 -286500 -360990 -330966 -214468 -303310 -378416 -364350 -168951 44774
6805 44774 115453 87151 -6700 -63989 -50465 46952 176147 332939 358671 422053 290821
6794 290821 63163 29616 33016 88469 31116 -13996 -152269 -215342 -234855 -91060 6031
6783 6031 40562 24117 -116699 -299573 -308329 -168475 40931 132481 77742 -223438 -272661
6772 -272661 -231317 -313024 -295921 -13942 81104 -17300 -156764 -240534 -267269 -44326 -108520
6761 -108520 -33241 144054 257485 108298 12817 -35767 -131075 -120372 -105888 -32274 87986
$$ packed form
6838b46844j4780J34624K16252K7938p309O7794L6611J32308J8265j31784k8085
6827B04990j20704j3661j25856o0270m6108N2479N9378r5316k13183L716J40032
6816b14503M3454q7472k7979p4490L0024J16498q8842p5106J4066J95399K13725
6805D4774P0679k8302r3851n7289J3524R7417J29195J56792K5732O3382j31232
6794B90821k27658l3547L400N5453n7353m5112j38273o3073j9513J43795R7091
6783F031L4531j6445j40816j82874q756J39854K09406R1550n4739l01180m9223
6772b72661M1344q1707J7103K81979R5046r8404j39464q3770k6735K22943o4194
6761a08520P5279J77295J13431j49187r5481m8584r5308J0703J4484P3614J20260
$$ plain form
6750 87986 163924 64615 -20651 -150767 -96229 -53816 -14233 -130209 -263289 -167421 20768
6739 20768 46120 -109814 27535 69938 -60240 -142696 -243077 -212369 -108177 -134444 4805
6728 4805 180248 227895 67792 -44874 -85510 -41524 -47228 -69273 -59118 52289 184334
6717 184334 -6839 -65218 -76542 -103865 -244253 -77125 -29252 -56385 -40737 13749 -72340
6706 -72340 -136851 -197915 -372083 -322012 -205327 -281012 -194614 17585 257846 305033 163500
6695 163500 73640 82529 35645 -57228 117368 76035 -115969 -91589 -75582 -92176 -66224
6684 -66224 -90221 -24320 -46889 -48857 -32583 -73665 -15023 19527 36049 -108880 -142060 -70678
6672 -70678 70869 -6535 64120 162302 -107607 -113375 -133947 16891 33814 -32675 2438
$$ packed form
6750H7986P5938r9309q5266j30116N4538M2413L9583j15976j33080R5868J88189
6739B0768K5352j55934J37349M2403j30178q2456j00381L0708J04192k6267J39249
6728D805J75443M7647j60103j12666m0636M3986n704k2045J0155J11407J32045
6717A84334j91173n8379j1324k7323j40388J67128M7873k7133J5648N4486q6089
6706g2340o4511o1064j74168N0071J16685p5685Q6398K12199K40261M7187j41533
6695A63500q9860Q889m6884r2873J74596m1333j92004K4380J6007j6594K5952
6684f6224k3997O5901k2569j968J6274m1082N8642L4550J6522j44929l3180P1382
6672g0678J41547p7404P0655R8182k69909n768k0572J50838J6923o6489L5113
$$ plain form
6661 2438 22231 55188 -82550 -260470 -325210 -147568 -74728 -78800 172957 268498 152651
6650 152651 84079 -112197 -176250 -167421 -133011 -128227 -218772 -216483 -258713 -324514 -109861 -34408
6638 -34408 -36814 -68441 -55457 -31482 -36903 28455 46663 12742 -29952 -100544 -87510 -7904
6626 -7904 10499 32207 74558 140221 188933 181258 124693 -42112 182354 314790 197986
6615 197986 155831 302927 182603 31143 -6063 -44057 -75891 -167505 -185313 -325147 -399925
6604 -399925 -301183 -104262 -127623 -180070 -174315 -83659 -146075 -98435 -20579 163923 108573
6593 108573 70472 236813 219649 24966 35326 -57472 -304035 -315218 -174039 -251242 -171342
6582 -171342 147308 168774 100822 125666 74727 -25918 -18515 -75863 -37959 -122389 -184402
$$ packed form
6661B438J9793L2957j37738j77920o4740J77642P2840m072K51757R5541j15847
6650A52651o8572j96276o4053Q829L4410M784r0545K289m2230o5801K14653P5453
6638c4408k406l1627J2984K3975n421O5358J8208l3921m2694p0592J3034P9606
6626g904J8403K1708M2351O5663M8712p675n6565j66805K24466J32436j16804
6615A97986m2155J47096j20324j51460l7206l7994l1834r1614j7808j39834p4778
6604c99925R8742J96921k3361n2447N755R0656o2416M7640P7856J84502n5350
6593A08573l8101J66341j7164j94683J0360r2798k46563j1183J41179p7203P9900
6582a71342L18650K1466o7952K4844n0939j00645P403n7348L7904q4430o2013
$$ plain form
6571 -184402 -350773 -276947 -113421 -170768 -317764 -258857 -106012 -78174 -10413 44139 277146
6560 277146 214228 40594 -13308 28311 5892 41619 49059 -176092 -322778 -217784 1366
6549 1366 -11052 -83565 -171517 -149884 -16681 -105303 -174859 79977 -48515 39096 260015
6538 260015 108608 -36636 -85184 -84890 -80773 18962 156187 103405 -47972 -112333 -79964
6527 -79964 -44767 1315 -39969 28486 99838 207094 290997 175202 112923 -41189 -128569
6516 -128569 -118165 -42785 -22425 -37489 -12157 -15499 151814 254577 123826 96176 257576
6505 257576 131210 3739 -27442 25193 87995 1244 -211832 -223218 -158156 -166797 -187408
6494 -187408 -111155 -83075 -148192 -282841 -312605 -361495 -442775 -276103 -101008 -198876 -177924
$$ packed form
6571a84402j66371P3826J63526n7347j46996N8907J52845K7838O7761N4552K33007
6560B77146o2918j73634n3902M1619k2419L5727P440k25151j46686J04994K19150
6549A366j2418p2513q7952K1633J33203q8622o9556K54836j28492Q7611K20919
6538B60015j51407j45244m8548K94M117R9735J37225n2782j51377o4361L2369
6527g9964L5197M6082m1284O8455P1352J07256Q3903j15795o2279j54112q7380
6516a28569J0404P5380K0360j5064K5332l342J67313J02763j30751k7650J61400
6505B57576j26366j27471l1181N2635O2802q6751k13076j1386O5062q641k0611
6494a87408P6253K8080o5117j34649k9764m8890q1280J66672J75095r7868K0952
$$ plain form
6483 -177924 -167307 -164397 -155424 -51942 -46881 -168295 -79350 -57852 -90439 -11857 44440 89976
6471 89976 245822 303730 96610 140503 162449 144881 106362 46213 6121 26905 -42490
6460 -42490 -118832 -77685 -193059 -227032 -256975 -243171 -98740 -48265 -17466 4761 116358
6449 116358 191424 140710 -9838 -87188 -218936 -291351 -252534 -238516 -200782 -183463 -71745
6438 -71745 101731 199746 194069 -21705 -69886 -46746 29217 -16010 -22500 -40481 -4396 -54019
6426 -54019 -230744 -451284 -379585 -253040 -122098 -238150 -335314 -317786 -195587 -254771 -217265
6415 -217265 70283 -6347 -153665 -187831 -89487 -13812 141722 119657 111726 -5501 -24846
6404 -24846 -138221 -188159 -250328 -207942 -114964 -15075 -47551 -9775 36201 -276167 -429419
$$ packed form
6483a77924J0617K910Q973J03482N061j21414Q8945K1498l2587P8582N6297M5536
6471H9976J55846N7908k07120M3893K1946j7568l8519o0149m0092K0784o9395
6460d2490p6342M1147j15374l3973k9943J3804J44431N0475L0799K2227J11597
6449A16358P5066n0714j50548p7350j31748p2415L8817J4018L7734J7319J11718
6438g1745J73476R8015n677k15774m8181K3140P5963m5227o490j7981L6085m9623
6426e4019j76725k20540P1699J26545J30942j16052r7164J7528J22199n9184L7506
6415b17265K87548p6630j47318l4166R8344P5675J55534k2065p931j17227j9345
6404b4846j13375m9938o2169M2386R2978R9889l2476L7776M5976l12368j53252
$$ plain form
6393 -429419 -362935 -203216 -175573 -134526 -164452 -200147 -222631 -63584 78576 93355 102359
6382 102359 3555 3148 -25222 -71189 -125807 -160394 -158176 -86147 52750 102747 142646 129869
6370 129869 14583 79199 157464 -620 -46709 -90010 -38001 -59618 37328 -143126 -292183
6359 -292183 -265727 -117950 33113 -131296 -194556 -109035 19911 -53298 -238428 -201959 -70564
6348 -70564 -29716 97623 162827 94740 -149936 -155171 -101192 -91152 -90996 8074 176696 228557
6336 228557 175564 5298 -265953 -150713 234846 316690 144313 -63409 -110268 686
6326 686 23600 -120448 -289242 -413967 -287563 -133607 -33743 18728 81564 60354 168355
6315 168355 30010 -79735 -53000 -109316 -198198 -129362 36518 103786 57559 -72365 -56059
$$ packed form
6393d29419O6484J59719K7643M1047k9926l5695k2484J59047J42160J4779R004
6382A02359r8804m07k8370m5967n4618l4587K218P2029J38897M9997L9899j2777
6370A29869j15286O4616P8265j58084m6089m3301N2009k1617R6946j80454j49057
6359b92183K6456J47777J51063j64409o3260Q5521J28946p3209j85130L6469J31395
6348g0564M0848J27339O5204o8087k44676n235N3979J0040J56R9070J68622N1861
6336B28557n2993j70266k71251J15240L85559Q1844j72377k07722m6859J10954
6326F86K2914j44048j68794j24725J26404J53956R9864N2471O2836k1210J08001
6315A68355j38345j09745K6735n6316q8882O8836J65880O7268m6227j29924J6306
$$ plain form
6304 -56059 -5449 111619 137965 169537 22476 -68658 -59582 -113341 -170082 -2996 -54933
6293 -54933 -68754 78925 286880 403900 318381 240472 342604 273474 -42771 -219586 -235538
6282 -235538 -130800 -43404 -18050 -165629 67781 207594 26342 -99835 -17120 54857
6272 54857 -34487 -81750 -243736 -397743 -378326 -413127 -188484 4357 220938 388556 164007
6261 164007 71143 101848 116064 206732 187558 132493 -1947 -104053 -103769 -117704 -295071
6250 -295071 -250182 -306644 -278921 -252439 -319423 -250012 -119203 15851 107982 112728 94858
6239 94858 186024 -10918 -30756 -16466 109075 246969 197268 153777 -17183 -162491 -39206
6228 -39206 15718 52110 46225 135571 151282 209183 104578 37687 -211983 -231226 -104475
$$ packed form
6304e6059N0610J17068K6346L1572j47061r1134R076n3759n6741J67086n1937
6293e4933j3821J47679K07955J17020q5519p7909J02132o9130l16245j76815j5952
6282b35538J04738Q7396K5354j47579K33410J39813j81252j26177Q2715P1977
6272E4857q9344m7263j61986j54007J9417l4801K24643J92841K16581J67618k24549
6261A64007r2864L0705J4216R0668j9174n5065j34440j02106K84j3935j77367
6250b95071M4889n6462K7723K6482o6984O9411J30809J35054R2131M746j7870
6239I4858R1166j96942j9838J4290J25541J37894m9701m3491j70960j45308J23285
6228c9206N4924L6392n885Q9346J5711N7901j04605o6891k49670j9243J26751
$$ plain form
6217 -104475 2183 253619 263703 246558 311046 162112 78238 16793 91458 135312 110920
6206 110920 -85485 -155289 32643 128252 171248 193204 77316 267717 403474 299471
6196 299471 24093 -13972 3716 41969 35423 -95851 -100233 9682 22004 -28302 31957
6185 31957 -29421 -49192 -98655 -135200 -119984 -43244 -108458 -273350 -287528 -219666 -229853 -212162
6173 -212162 21252 39439 3174 -124150 -184253 -119381 -145494 -110449 -229402 -265170 21859
6162 21859 108303 -11714 -24202 169807 331051 276701 102360 25176 192608 170430 -24150
6151 -24150 -139159 -304815 -299069 -248350 -130236 -75521 -177498 -177654 -209207 -70679 -133674
6140 -133674 -214523 -257749 -177648 -11014 76797 114942 66090 32587 -28246 -133999 -100990
$$ packed form
6217a04475J06658K51436J0084j7145O4488j48934q3874o1445P4665M3854k4392
6206A10920j96405o9804J87932R5609M2996K1956j15888J90401J35757j04003
6196B99471k75378l8065J7688L8253o546j31274m382J09915J2322n0306O0259
6185C1957o1378j9771m9463l6545J5216P6740o5214j64892j4178O7862j0187J7691
6173b12162K33414J8187l6265j27324o0103O4872k6113L5045j18953l5768K87029
6162B1859Q6444j20017j2488J94009J61244n4350j74341p7184J67432k2178j94580
6151b4150j15009j65656N746N0719J18114N4715j01977j56l1553J38528o2995
6140a33674q0849m3226Q0101J66634Q7811L8145m8852l3503o0833j05753L3009
$$ plain form
6129 -100990 783 -8037 -45297 -97323 -212663 -142026 -59876 -140143 -128110 -120449 -110588 -86589
6117 -86589 -109863 52703 155340 204962 112445 -54400 -173921 -207030 -261740 -147261 -147277
6106 -147277 -67105 -69036 -238085 -343429 -246302 -273467 -299827 -334075 -306831 -186734 -192547
6095 -192547 -154339 33980 -41143 -207533 -322468 -365870 -354463 -286980 -41544 -1131 70567
6084 70567 41890 -30180 -118140 -78014 -73871 -281644 -350599 -300345 -250414 -175113 -122670 -44391
6072 -44391 59267 94283 115752 117425 8469 -140128 -370959 -341529 -87945 5068 -19268
6061 -19268 72774 161698 4481 28283 110978 84514 -99363 -134588 -74820 4289 -50149
6050 -50149 -111211 -64060 -69268 -215528 -270278 -133787 -50040 8363 3865 93846 104145 73984
$$ packed form
6129a00990J01773q820l7260n2026j15340P0637Q2150q0267J2033P661R861K3999
6117h6589k3274J62566J02637M9622r2517j66845j19521l3109n4710J14479j6
6106a47277Q0172j931j69049j05344R7127k7165k6360l4248K7244J20097n813
6095a92547L8208J88319p5123j66390j14935m3402J1407O7483K45436M0413P1698
6084G0567k8677p2070q7960M0126M143k07773o8955N0254M9931P5301N2443P8279
6072d4391J03658L5016K1469J673j08956j48597k30831K9430K53584R3013k4336
6061a9268R2042Q8924j57217K3802Q2695k6464j83877l5225N9768P9109n4438
6050e0149o1062M7151n208j46260n4750J36491Q3747N8403m498Q9981J0299l0161
$$ plain form
6038 73984 147457 202326 298863 275706 354775 222235 215188 92872 48327 168727 287179
6027 287179 174512 165966 70895 17977 -78975 17972 25604 -97933 -120465 1372 140353
6016 140353 60002 43240 46963 -4343 -61256 -35929 -61745 -129867 -209008 -40244 10042 125145
6004 125145 142711 185485 129899 -80154 -330053 -470801 -448759 -371660 -394279 -392606 -333126
5993 -333126 -420977 -518298 -325849 -76598 46892 66709 104452 223548 185720 162641 132624
5982 132624 -60842 -4693 -13013 -61362 -50264 -108984 -182269 -79285 -41425 -52303 163879
5971 163879 285251 336577 352428 398957 172312 148797 241552 160327 172509 190267 188360
5960 188360 167931 24770 33575 177295 65161 -104843 -21291 178548 101061 34779 182905
$$ packed form
6038G3984P3473N4869R6537k3157P9069j32540p047j22316m4545J20400J18452
6027B87179j12667q546r5071n2918r6952R6947P632j23537k2532J21837J38981
6016A40353q0351j6762L723n1306n6913K5327k5816o8122p9141J68764N0286J15103
6004A25145J7566M2774n5586k10053k49899j40748K2042P7099k2619J673N9480
5993c33126q7851r7321J92449K49251J23490J9817L7743J19096l7828k3079l0017
5982A32624j93466N6149q320m8349J1098n8720p3285J02984L7860j0878K16182
5971A63879J21372N1326J5851M6529k26645k3515R2755q1225J2182J7758j907
5960A88360k0429j43161Q805J43720j12134j70004Q3552J99839p7487o6282J48126
$$ plain form
5949 182905 208946 156682 113970 -19883 -188768 -271166 -103271 -5393 123686 283663 292295
5938 292295 139710 -30234 60358 101515 79678 34144 108192 149571 93983 -16810 -35166
5927 -35166 -7195 122436 169604 163931 77854 -58643 -76084 -36919 -15728 -88489 -35789 -60483
5915 -60483 -204538 -217718 -239070 -240109 -40054 100966 51109 -181986 -49794 117538 -2688
5904 -2688 -140223 -88328 40181 -21393 -149907 -205794 54539 249010 346866 362564 145215
5893 145215 142658 124418 -1973 -21541 -175878 -169463 -83512 -100594 37853 261044 164821
5882 164821 70499 -15180 -106182 -121005 -58723 -109480 -218626 -134568 61453 93741 34749
5871 34749 -12294 -263298 -369718 -156120 120167 64554 127469 146391 75112 163413 65910
$$ packed form
5949A82905K6041n2264m2712j33853j68885q2398J67895R7878J29079J59977Q632
5938B92295j52585j69944R0592M1157k1837m5534P4048M1379n5588j10793j8356
5927c5166K7971J29631M7168n673q6077j36497j7441L9165K1191p2761N2700k4694
5915f0483j44055j3180k1352j039K00055J41020m9857k33095J32192J67332j20226
5904b688j37535N1895J28509o1574j28514n5887K60333J94471R7856J5698k17349
5893A45215k557j8240j26391j9568j54337O415Q5951j7082J38447K23191r6223
5882A64821r4322q5679r1002j4823O2282n0757j09146Q4058J96021L2288n8992
5871C4749m7043k51004j06420K13598K76287n5613O2915J8922p1279Q8301r7503
$$ plain form
5860 65910 47324 102885 17098 -125888 -231786 -243059 -259884 -256451 -68317 -90754 -6621
5849 -6621 55181 14242 -17563 -7487 48330 95727 195709 238352 234289 111181 -140871 -71260
5837 -71260 -73051 -41188 -74343 -207212 -357249 -165768 -97561 -137016 -328350 -271358 -178758
5826 -178758 -142409 -112715 -32610 15495 50972 60393 145430 124475 50552 -24337 -144157 -112180
5814 -112180 -173802 -202165 -193462 -47175 30462 -5382 -18575 103871 134995 177777 225721
5803 225721 98010 29255 -53716 -51699 157214 242579 239918 182393 178480 169383 155714 210274
5791 210274 263854 135429 141628 4438 -183020 -229406 -268630 -163178 -68393 36291 45200
5780 45200 19080 25505 48714 97482 52187 47323 -84145 -129934 -179221 -173341 -131551 -186651
$$ packed form
5860F5910j8586N5561q5787j42986j05898j1273j6825L433J88134k2437Q4133
5849f621O1802m0939l1805J0076N5817M7397R9982M2643m063j23108k52052O9611
5837g1260j791L1863l3155j32869j50037J91481O8207l9455j91334N6992R2600
5826a78758L6349K9694Q0105M8105L5477R421Q5037k0955p3923p4889j19820L1977
5814a12180o1622k8363Q703J46287P7637l5844j3193J22446L1124M2782M7944
5803B25721j27711o8755q2971K017K08913Q5365k661n7525l913r097j3669N4560
5791B10274N3580j28425O199j37190j87458m6386l9224J05452R4785J04684Q909
5780D5200k6120O425K3209M8768m5295m864j31468m5789m9287N880M1790n5100
$$ plain form
5768 -186651 -253346 -119705 37378 90856 161679 166502 212963 135084 176546 216933 179976
5757 179976 141824 146087 71972 90731 208731 63408 99512 98530 61451 -33346 -111458 -198448
5745 -198448 -183175 -168186 -151618 -60381 -122904 -130079 -42224 81799 97632 170545 40232
5734 40232 -159411 2485 136665 46251 -173293 -215554 -223324 -211531 -319609 -424953 -353619
5723 -353619 -306566 -242257 -43282 99331 98709 29482 -132203 -253287 -187473 -260008 12208
5712 12208 176324 35830 151699 50860 3448 46429 -757 39111 161346 248384 -215
5701 -215 -305803 -136644 127436 99216 -79874 -89953 68581 92992 95682 -93101 -196236
5690 -196236 -69950 124361 125633 17139 7956 -28799 -86978 -279242 -409263 -316998 -200994
$$ packed form
5768a86651o6695J33641J57083N3478P0823M823M6461p7879M1462M0387l6957
5757A79976l8152M263p4115J8759J18000j45323L6104r82l7079r4797p8112q6990
5745a98448J5273J4989J6568R1237o2523p175Q7855J24023J5833P2913j30313
5734D0232j99643J61896J34180r0414k19544m2261p770J1793j08078j05344P1334
5723c53619M7053O4309J98975J42613o22o9227j61685j21084O5814p2535K72216
5712A2208J64116j40494J15869j00839m7412M2981m7186L9868J22235Q7038k48599
5701b15l05588J69159K64080k8220j79090j0079J58534K4411K690j88783j03135
5690a96236J26286J94311J272j08494r183l6755n8179j92264j30021R2265J16004
$$ plain form
5679 -200994 -128219 -40026 4633 -58006 -106032 -206805 -236417 -120039 58365 96148 89308
5668 89308 -24278 -152496 -155670 -255834 -276235 -262970 -309697 -298455 -305351 -155684 -238783
5657 -238783 -367461 -326718 -308264 -310651 -108565 -62935 -34964 35267 -74547 -328652 -429874
5646 -429874 -221374 -20405 82495 157717 201621 230086 237975 212884 104019 18525 -128804
5635 -128804 -43518 118438 75956 -45247 78453 -73308 -269498 -128904 42166 124157
5625 124157 -82842 -263095 -169104 -41829 30937 -62252 -90211 66852 50569 -126533 -179590
5614 -179590 -173575 -186202 -206011 -83876 -92099 -199345 -276327 -171435 -82260 -11934 15494
5603 15494 -85250 -139698 109032 154188 113648 68211 39146 108377 128659 -97208 -78875
$$ packed form
5679b00994P2775Q8193M4659o2639m8026j00773k9612J16378J78404L7783o840
5668H9308j13586j28218l174j00164k0401J3265m6727J1242o896J49667q3099
5657b38783j28678M0743J8454k387K02086M5630K7971P0231j09814k54105j01222
5646d29874K08500K00969J02900P5222M3904K8465P889k5091j08865q5494j47329
5635a28804Q5286J61956m2482j21203J23700j51761j96190J40594J71070Q1991
5625A24157k06999j80253R3991J27275P2766r3189k7959J57063j6283j77102n3057
5614a79590O015j2627j9809J22135q223j07246p6982J04892Q9175P0326K7428
5603A5494j00744n4448K48730M5156m0540m5437k9065O9231K0282k25867J8333
$$ plain form
5592 -78875 -277823 -315972 -88828 -2213 -52578 -47910 -34514 38393 131123 121821 101381 282030
5580 282030 224186 5728 -39287 34412 -109397 -10382 -127478 -111311 -15146 -33711 -48538
5569 -48538 -154509 -205512 -217774 -143220 -228173 -362448 -358902 -413334 -481687 -256510 -107892
5558 -107892 -14393 -50973 -118681 -45763 41890 -39812 -52888 -88140 -162917 -140842 -178020 -256662
5546 -256662 -253759 -398478 -291837 -106500 -33037 -60273 13036 94000 143734 -79694 -160784
5535 -160784 61486 156778 249952 81882 250009 150294 137154 7454 -128849 -127337 -91408
5524 -91408 -12286 -11697 -174573 -106978 -81673 -176827 -132359 -117795 -27286 62057 98116 46797
5512 46797 -41360 -34852 -181437 -334768 -287443 -82972 7451 -109620 -142189 -139303 -136514 -135137
$$ packed form
5592g8875j98948l8149K27144Q6615n0365M668J3396P2907R2730r302k0440J80649
5580B82030n7844k18458m5015P3699j43809R9015j17096J6167R6165j8565j4827
5569d8538j05971n1003j2262P4554q4953j34275L546n4432o8353K25177J48618
5558a07892R3499l6580o7708P2918Q7653q1702j3076l5252p4777K2075l7178p8642
5546b56662K903j44719J06641J85337P3463k7236P3309Q0964M9734k23428q1090
5535a60784K22270R5292R3174j68070J68127r9715j3140j29700j36303J512L5929
5524i1408P9122N89j62876O7595K5305r5154M4468J4564R0509Q9343L6059n1319
5512D6797q8157O508j46585j53331M7325K04471R0423j17071l2569K886K789J377
$$ plain form
5500 -135137 -75433 -59332 121925 164638 73676 -67203 -11326 177454 258702 179269 48147
5489 48147 -95528 -202578 -278225 -144187 -98397 30030 182286 105419 143921 185109 181580
5478 181580 80625 -8106 131657 119691 -29777 -8118 46955 -102274 -220592 -294843 -144954
5467 -144954 -45229 139373 217794 29405 -78500 -506 -2207 214308 89705 -50916 -176121
5456 -176121 -195634 47129 306927 365395 187535 66924 -1826 -22185 125227 180279 118318
5445 118318 61708 -49410 -93266 -227551 -137513 182163 193123 -91550 -114512 -50865 -3355
5434 -3355 92628 135992 173840 106581 20350 -5710 99059 138997 219974 51827 -20935 -155265
5422 -155265 -107952 -99692 -210785 -210714 -179413 -79028 79545 36155 -46099 -141691 -170460 -283331
$$ packed form
5500a35137N9704J6101J81257M2713r0962j40879N5877J88780Q1248p9433j31122
5489D8147j43675j07050p5647J34038M5790J28427J52256p6867L8502M1188l529
5478A81580j00955q8731J39763j1966j49468K1659N5073j49229j18318p4251J49889
5467a44954R9725J84602P8421j88389j07905P7994j701K16515j24603j40621j25205
5456a76121j9513K42763K59798N8468j77860j20611o8750k0359J47412N5052o1961
5445A18318n6610j11118m3856j34285R0038L19676J0960k84673k2962O3647M7510
5434c355R5983M3364L7848o7259q6231k6060J04769L9938Q0977j68147p2762j34330
5422a55265M7313Q260j11093P1L1301J00385J58573m3390q2254r5592k8769j12871
$$ plain form
5410 -283331 -392966 -323146 45557 120540 130493 35127 -43282 -98678 -14536 33219 -63029
5399 -63029 -133609 -144862 -174306 -120160 -240659 -240626 -242313 -224511 -117137 -245215 -319817 -204079
5387 -204079 -69979 -89520 3797 -109049 -186270 -248118 -184986 178842 384748 332631 383414
5376 383414 145553 95334 140449 80661 27421 -66891 -88512 138720 149207 48021 -3281
5365 -3281 -2949 161181 194534 20051 -39242 -115996 61030 -11322 -94636 -54736 -23760 -76926
5353 -76926 -97880 -24381 19449 27610 33994 -17021 -22120 63619 195651 87655 -41322 -24796
5341 -24796 63649 -59818 -197032 -86343 106516 82287 -10714 -35415 54120 79969 189995
5330 189995 192840 118953 66517 2866 -15086 -23513 -31333 139921 119555 32516 -123814 -226095
$$ packed form
5410b83331j09635O9820L68703P4983R953r5366p8409n5396Q4142M7755r6248
5399f3029p0580j1253k9444N4146j20499L3j687J7802J07374j28078p4602J15738
5387b04079J34100j9541R3317j12846p7221o1848O3132L63828K05906n2117N0783
5376C83414k37861n0219M5115n9788n3240r4312k1621K27232J0487j01186n1302
5365c281L32J64130L3353j74483n9293p6754J77026p2352q3314L9900L0976n3166
5353g6926k0954P3499M3830Q161O384n1015n099Q5739J32032j07996j28977J6526
5341b4796Q8445j23467j37214J10689J92859k4229r3001k4701Q9535K5849J10026
5330A89995K845p3887n2436o3651j7952q427p820J71254k0366q7039j56330j02281
$$ plain form
5318 -226095 -164045 -103939 -139170 -6928 -104469 -114124 58760 117597 166054 98340 132044
5307 132044 89965 97729 -30564 -79271 -17520 111180 -15565 -91253 -128591 -228279 -173059
5296 -173059 32303 106798 69740 78717 -41816 14235 141268 178440 295423 215862 -31851
5285 -31851 -142112 -84767 -142271 -247590 -199855 -230955 -133390 -116585 134048 147741 34933
5274 34933 -108519 -65169 60063 96885 97954 146857 -34416 -204391 -104697 -125985 -108070
5263 -108070 -40871 69104 133622 136850 57659 -75248 -110503 -85533 -157155 -250675 -165372
5252 -165372 1610 205913 288823 224063 121402 -75563 -88961 39564 81936 27014 79910
5241 79910 26570 -24182 90245 179999 167403 94034 -115804 -40835 44199 5882 41007
$$ packed form
5318b26095O2050O0106l5231J32242r7541r655J72884N8837M8457o7714L3704
5307A32044m2079P764j28293m8707O1751J28700j26745p5688l7338r9688N5220
5296a73059K05362P4495l7058Q977j20533N6051J27033L7172J16983p9561k47713
5285c1851j10261N7345n7504j05319M7735l1100R7565J6805K50633J3693j12808
5274C4933j43452M3350J25232L6822J069M8903j81273j69975R9694k1288J7915
5263a08070O7199J09975O4518L228p9191j32907l5255K4970p1622r3520Q5303
5252a65372J66982K04303Q2910o4760j02661j96965j3398J28525M2372n4922N2896
5241G9910n3340n0752J14427Q9754j2596p3369k09838P4969Q5034l8317L5125
$$ plain form
5230 41007 92185 -33480 -73992 57425 177380 93262 4212 -97503 -121790 38559 48238
5219 48238 71261 183532 65893 123474 183035 174984 142254 126280 50785 74220 95947 14311
5207 14311 -53816 -193963 -194906 -98832 -33949 -22097 -32830 -163507 -210765 -273822 -319212 -287349
5195 -287349 -188068 -89771 73270 83082 196148 43086 -49427 39763 33778 -172295 -294037
5184 -294037 -339038 -196547 -89294 -109819 -67705 -70955 -135586 -255939 -167433 -16722 -55348
5173 -55348 108967 207181 186565 232198 179300 72710 35739 65924 85855 81573 13938 -77251
5161 -77251 -94273 75254 51444 -109769 101809 93669 64847 98005 -15448 -232416 -41705
5150 -41705 -78599 -201200 -200217 -269240 -227112 -97377 -117985 -149323 -130975 -114613 -79196 26473
$$ packed form
5230D1007N1178j25665m0512J31417J19955q4118q9050j01715k4287J60349R679
5219D8238K3023J12271j17639N7581N9561q051l2730j5974p5495K3435K1727q1636
5207A4311o8127j40147r43R6074O4883J1852j0733j30677m7258o3057m5390L1863
5195b87349R9281R8297J63041R812J13066j53062r2513Q9190n985k06073j21742
5184b94037m5001J42491J07253k0525M2114l250o4631j20353Q8506J50711l8626
5173e5348J64315R8214k0616M5633n2898j06590l6971L0185J9931m282o7635r1189
5161g7251j7022J69527k3810j61213K11578q140k8822L3158j13453k16968J90711
5150d1705l6894j22601R83o9023M2128J29735k0608l1338J8348J6362L5417J05669
$$ plain form
5138 26473 -92875 -198225 -258690 -311581 -126937 91737 231909 174604 102333 -6408 -4728
5127 -4728 100520 -34777 -160224 -182020 -110499 -128056 -97577 75336 108821 103132 -1851
5116 -1851 -24584 -180489 -105329 19429 237402 139790 -38718 -118432 -68482 -77284 -72996 -29854
5104 -29854 90497 50925 -149817 -168920 -115287 -205646 -94780 14487 97190 61789 101317
5093 101317 184618 246101 117901 178823 25233 -107892 46193 52141 154566 94781 -26390
5082 -26390 -112047 -10507 74112 -37160 -190670 -243568 -119395 1369 -122014 -239001
5072 -239001 -147269 18689 85608 28783 -32507 -106963 -51657 -96932 -68782 14951 7772 -173330
5060 -173330 -105201 33187 -150820 -80871 8850 -1295 -124451 -122675 -168854 -249782 -281612
$$ packed form
5138B6473j19348j05350o0465n2891J84644K18674J40172n7305p2271j08741J680
5127d728J05248j35297j25447k1796P1521j7557L0479J72913L3485n689j04983
5116a851k2733j55905P5160J24758K17973r7612j78508p9714M9950q802M288M3142
5104b9854J20351l9572k00742j9103N3633r0359J10866J09267Q2703l5401L9528
5093A01317Q3301O1483j28200O0922j53590j33125J54085N948J02425n9785j21171
5082b6390q5657J01540Q4619j11272j53510n2898J24173J20764j23383j16987
5072b39001R1732J65958O6919n6825o1290p4456N5306m5275K8150Q3733p179j81102
5060a73330O8129J38388j84007O9949Q9721j0145j23156J776m6179q0928l1830
$$ plain form
5049 -281612 -225017 -213325 -127350 -169537 -322855 -281566 -208158 -175266 -37901 -16390 -13236
5038 -13236 16614 102701 -41524 -168515 -247906 -269635 -169403 -29445 -32184 -33852 -40847 -38544
5026 -38544 97041 17827 -126765 -220326 -255569 -290167 -247654 -201496 -231720 -258508 -291739
5015 -291739 -317682 -319448 -339326 -134865 -29270 92181 160887 42307 -129693 -83740 45673
5004 45673 31863 864 72826 -11534 9162 51505 97324 199986 114342 15291 101145 250339
4992 250339 314686 161962 57506 28981 185982 210759 112615 -112063 -185303 -185812 -48319
4981 -48319 -243665 -298325 -190024 -88231 -140197 -116873 -9252 -11505 -14827 -84155 -162013
4970 -162013 -176129 -25936 107782 92719 22227 33701 36271 -28551 -108739 -328077 -499221
$$ packed form
5049b81612N6595J1692Q5975m2187j53318M1289P3408L2892J37365K1511L154
5038a3236K9850Q6087j44225j26991p9391k1729J00232J39958k739j668o995K303
5026c8544J35585p9214j44592r3561l5243l4598M2513M6158l0224k6788l3231
5015b91739k5943j766j9878K04461J05595J21451O8706j18580j72000M5953J29413
5004D5673j3810l0999P1962q4360K0696M2343M5819J02662q5644r9051Q5854J49194
4992B50339O4347j52724j04456k8525J57001K4777r8144k24678p3240n09J37493
4981d8319j95346n4660J08301J01793n1966K3324J07621k253l322o9328p7858
4970a62013j4116J50193J33718j5063p0492J1474K570o4822q0188k19338j71144
$$ plain form
4959 -499221 -287585 -91762 49301 66933 2243 -41235 -314317 -343413 -186682 18842
4949 18842 43691 -34215 -92501 -201170 -154813 -73128 17260 241384 264444 283890 152353
4938 152353 127243 79200 84176 172054 141157 155888 241334 148529 65426 153124 146745 138354
4926 138354 244498 357164 347766 281261 276855 238044 391301 312949 127015 -65268 -88378
4915 -88378 20795 53552 -469 43261 94129 121651 132467 80882 40595 -105739 -223086
4904 -223086 -220047 -195597 -197768 -169644 -113365 -134184 -115862 -88588 -1410 126285 196537 171870
4892 171870 15227 -4217 24053 190381 115916 -96287 -84426 -32470 108882 22866 -227292
4881 -227292 -367966 -132361 -6877 73504 58695 48740 103782 57944 -118586 -162019 -340284
$$ packed form
4959d99221K11636J95823J41063J7632o4690m3478k73082k9096J56731K05524
4949A8842K4849p7906n8286j08669M6357Q1685R0388K24124K3060J9446j31537
4938A52353k5110m8043M976Q7878l0897J4731Q5446r2805q3103Q7698o379q391
4926A38354J06144J12666r398o6505m406l8811J53257p8352j85934j92283k3110
4915h8378J09173L2757n4021M3730N0868K7522J0816n1585m0287j46334j17347
4904b23086L039K4450k171K8124N6279k0819J8322K7274Q7178J27695P0252k4667
4892A71870j56643j9444K8270J66328p4465k12203J1861N1956J41352q6016k50158
4881b27292j40674K35605J25484Q0381j4809r955N5042m5838j76530m3433j78265
$$ plain form
4870 -340284 -447859 -498009 -433175 -419657 -235142 -252591 -210307 -163708 -178624 -174067 -277633
4859 -277633 -327989 -316844 -231494 -77082 -40214 -142566 -9320 -23122 -40199 -152480 -156517
4848 -156517 -287026 -243801 61557 57230 19363 -6420 -161414 -341653 -361464 -314090 -188702
4837 -188702 -96968 -6186 -38805 -125301 -58664 -31064 -10856 -32921 44486 75615 -33600
4826 -33600 -10274 50287 -55708 -14212 68659 304492 278996 150483 157750 137276 -34153
4815 -34153 -128270 -185156 -97816 77952 157636 150521 72503 -294667 -383528 -245516 -38129
4804 -38129 -14021 -114939 -156598 -67971 109929 274142 275295 175093 75023 127398 62922
4793 62922 -121741 -306568 -295125 -177344 -114717 75197 136166 114705 132173 78981 103033
$$ packed form
4870c40284j07575n0150O4834J3518J84515j7449M2284M6599j4916M557j03566
4859b77633n0356J1145Q5350J54412L6868j02352J33246j3802j7077j12281m037
4848a56517j30509M3225L05358m327l7867k5783j54994j80239j9811M7374J25388
4837a88702R1734R0782l2619q6496O6637K7600K0208k2065P7407L1129j09215
4826c3600K3326O0561j05995M1496Q2871K35833k5496j28513P267k0474j71429
4815c4153r4117n6886Q7340J75768P9684p115p8018l67170q8861J38012K07387
4804c8129K4108j00918m1659Q8627J77900J64213J153j00202j00070N2375o4476
4793F2922j84663j84827J1443J17781O2627J89914O0969k1461J7468n3192K4052
$$ plain form
4782 103033 22367 -74814 -289929 16743 202003 151991 22618 -29434 -9245 -37244 -196269
4771 -196269 -382902 -316071 -76834 -187508 -283677 -238709 -401874 -394446 -235882 -60069 -126415
4760 -126415 -88120 -38316 44922 -16008 -123978 16033 27959 -149417 -171371 -193802 -177066
4749 -177066 -55204 -20625 49547 152128 123746 48506 115586 190638 223306 118340 31359
4738 31359 69167 134038 143003 233283 175684 143162 111341 -131064 -241825 -194459 -184360 -214459
4726 -214459 -219476 -236446 -147791 114495 213231 230865 143044 109671 62927 50993 126364 146536
4714 146536 278802 225191 213135 251947 90360 24275 -47570 -121285 -197930 -101711 -152603
4703 -152603 -70481 -85931 -164641 -89156 -11663 -43884 58957 12519 -35360 106270 281140
$$ packed form
4782A03033q0666r7181k15115L06672J85260n0012j29373n2052K0189k7999j59025
4771a96269j86633O6831K39237j10674r6169M4968j63165P428J58564J75813o6346
4760a26415L8295M9804Q3238o0930j07970J40011J1926j77376k1954k2431J6736
4749a77066J21862L4579P0172J02581k8382p5240O7080P5052L2668j04966q6981
4738C1359L7808O4871Q965R0280n7599l2522l1821k42405j10761M7366J0099l0099
4726b14459n017j6970Q8655K62286R8736J7634q7821l3373m6744j1934P5371K0172
4714A46536J32266n3611j2056L8812j61587o6085p1845p3715p6645R6219n0892
4703a52603Q2122j5450p8710P5485P7493l2221J02841m6438m7879J41630J74870
$$ plain form
4692 281140 419066 244520 134694 152757 28095 -2711 2697 -36866 -54717 136486 227709
4681 227709 33601 31687 55779 -9457 -77282 -150292 9044 139260 99584 -29364 14501
4670 14501 85116 34631 67694 98290 137560 6991 6823 128638 252887 35155 -115472
4659 -115472 -3652 20066 112723 195622 159732 -22975 40092 17579 -11941 -166957 -158261
4648 -158261 -167589 -268599 -245984 -186069 -22548 47321 99054 46600 -33865 -6391 110699
4637 110699 63123 113812 29075 -30875 -76626 15400 133023 68585 32355 -20142 -96532
4626 -96532 -147089 -26633 111417 66846 -15778 -57744 163500 102940 -75573 -238813 -186002
4615 -186002 -81386 70746 136415 90830 -20204 -104009 -197523 -90139 58311 23527 -68717
$$ packed form
4692B81140J37926j74546j09826J8063j24662l0806N408l9563j7851J91203R1223
4681B27709j94108j914K4092o5236o7825p3010J59336J30216l9676j28948M3865
4670A4501P0615n0485L3063L0596L9270j30569j68J21815J24249k17732j50627
4659a15472J11820K3718R2657Q2899l5890j82707O3067k2513k9520j55016Q696
4648a58261r328j01010K2615N9915J63521O9869N1733n2454q0465K7474J17090
4637A10699m7576N0689q4737n9950m5751R2026J17623o4438l6230n2497p6390
4626i6532n0557J20456J38050m4571q2624m1966K21244o0560j78513j63240N2811
4615a86002J04616J52132O5669m5585j11034q3805r3514J07384J48450l4784r2244
$$ plain form
4604 -68717 -14135 24931 -101972 -239153 -156843 -69682 -82899 -5375 -13548 66139 121596 57479
4592 57479 21090 141251 168042 123929 -17353 -25326 -47960 31838 46501 105068 88279 -44879
4580 -44879 -70068 36199 114441 73006 -20326 61769 -75216 -150250 -15299 178627 139189
4569 139189 23333 -34172 183548 323521 250548 176890 116346 -34616 -179268 10328
4559 10328 115944 195898 128491 81360 -3662 -48304 29653 89879 -70616 -78642 -46948 -41745
4547 -41745 -168334 34801 224474 242197 203733 200130 143457 118708 25622 216126 161180
4536 161180 54822 143437 55428 -21469 -15046 101545 17033 -16612 23516 -79198 -97579
4525 -97579 -85747 -159288 -271018 -199283 -153348 -105127 -139160 -98386 -44493 -57596 -141587 -110595
$$ packed form
4604f8717N4582L9066j26903j37181Q2310Q7161j3217P7524q173P9687N5457o4117
4592E7479l6389J20161K6791m4113j41282p973k2634P9798J4663N8567j6789j33158
4580d4879k5189J06267P8242m1435r3332Q2095j36985p5034J34951J93926l9438
4569A39189j15856n7505K17720J39973p2973p3658o0544j50962j44652J89596
4559A0328J05616P9954o7407m7131q5022m4642P7957O0226j60495q026L1694N203
4547d1745j26589K03135J89673J7723l8464l603n6673k4749r3086J90504n4946
4536A61180j06358Q8615q8009p6897O423J16591q4512l3645M0128j02714j8381
4525i7579J1832p3541j11730P1735M5935M8221l4033M0774N3893j3103q3991L0992
$$ plain form
4513 -110595 -183675 -327090 -295770 -87131 -29872 47901 68319 206391 180324 127147 127898
4502 127898 -16457 -113709 -173685 -120403 -146618 -119676 7490 58835 41504 -14580 -38812
4491 -38812 -158296 -237007 -191348 79615 217864 78920 -9753 -178470 -192206 -119670 -117334
4480 -117334 -230178 -113569 -70861 -68298 10909 70609 -54814 -78966 -90612 4473 240139
4469 240139 298250 235978 -21818 -85577 -55238 -40367 38756 77359 -100733 -76952 -125834
4458 -125834 -183119 -213127 -425668 -375705 -127923 3018 106552 204408 227598 182248 94684
4447 94684 72485 57483 110312 7407 -74858 -122224 -99540 -151294 -108831 609 52310
4436 52310 128634 33488 -47842 -260674 -303784 -210087 71034 137845 26280 3191 63146
$$ packed form
4513a10595p3080j43415L1320K08639N7259P7773K0418J38072k6067n3177P51
4502A27898j44355r7252n9976N3282k6215K6942J27166N1345j7331n6084k4232
4491c8812j19484p8711M5659K70963J38249j38944q8673j68717j3736P2536K336
4480a17334j12844J16609M2708K563P9207N9700j25423k4152j1646R5085K35666
4469B40139N8111o2272k57796o3759L0339J4871P9123L8603j78092K3781m8882
4458a25834n7285l0008k12541M9963K47782J30941J03534R7856K3190m5350q7564
4447I4684k2199j5002N2829j02905q2265m7366K2684n1754M2463J09440N1701
4436E2310P6324r5146q1330k12832m3110R3697K81121O6811j11565k3089N9955
$$ plain form
4425 63146 70467 -8340 -42114 -61168 -122221 -97562 53407 173481 -2532 -185634 -181672
4414 -181672 -149538 -93265 -132938 55913 112256 187464 38047 -198896 -153506 -68612 71329
4403 71329 183419 218074 241455 236994 72277 143871 158812 2486 37996 -7413 -47982
4392 -47982 -261218 -325988 -190950 -245214 -105274 -38904 -56980 -88750 -58778 -39868 -8095
4381 -8095 76428 192977 286463 266273 307448 332095 272312 180012 193394 136938 99602 -9970
4369 -9970 -127525 -105296 -94177 -31991 -36615 -77804 17108 116840 24181 19308 -79745 -67608
4357 -67608 69136 120573 153763 62748 -121070 -210155 -177561 -147415 -119879 -64583 -39923
4346 -39923 29557 11263 -8166 -86091 -59035 211503 123191 166435 224653 186426 173035 195176
$$ packed form
4425F3146P321p8807l3774j9054o1053K4659J50969J20074j76013j83102L962
4414a81672L2134N6273l9673J88851N6343P5208j49417k36943M5390Q4894J39941
4403G1329J12090L4655K3381m461j64717P1594J4941j56326L5510m5409m0569
4392d7982k13236o4770J35038n4264J39940O6370j8076l1770K9972J8910L1773
4381h095Q4523J16549R3486k0190M1175K4647n9783r2300J3382n6456l7336j09572
4369i970j17555K2229J1119O2186m624m1189R4912R9732r2659m873r9053J2137
4357f7608J36744N1437L3190r1015j83818q9085L2594L0146K7536N5296K4660
4346c9923O9480j8294j9429p7925K7056K70538q8312M3244N8218l8227j3391K2141
$$ plain form
4334 195176 161642 165543 198406 126464 -44819 -180299 -154189 -120617 24760 -99095 -114186
4323 -114186 -77141 -112297 -140767 -119793 -69385 -101985 -119313 -101810 -68742 -95768 36139
4312 36139 150177 120686 -55558 -127001 -49578 -95918 2538 -19558 -112738 -91266 60996
4301 60996 -4624 -128478 -41122 -115088 -79286 -10279 -124457 -206912 -173220 -147386 -43432
4290 -43432 -33776 -134172 -231763 49199 191418 99183 128016 193566 133492 31459 -171105
4279 -171105 -242936 -12562 150136 214203 18493 -36854 -140266 -194953 -127589 -153957 25465
4268 25465 174816 96171 57880 45976 -56878 -87485 -28836 177395 152172 -55349 -172716
4257 -172716 -60441 15747 28359 186144 155071 -99620 -291442 -229295 -210466 -81503 114012
$$ packed form
4334A95176l3534L901L2863p1942j71283j35480K6110L3572J45377j23855j5091
4323a14186L7045l5156k8470K0974N0408l2600j7328J7503L3068k7026J31907
4312C6139J14038k9491j76244p1443P7423m6340R8456k2096r3180K1472J52262
4301F0996o5620j23854Q7356p3966L5802O9007j14178q2455L3692K5834J03954
4290d3432R656j00396r7591K80962J42219r2235K8833O5550o0074j02033k02564
4279a71105p1831K30374J62698O4067j95710n5347j03412n4687O7364k6368J79422
4268B5465J49351p8645l8291j1904j02854l0607N8649K06231k5223k07521j17367
4257a72716J12275P6188J2612J57785l1073k54691j91822O2147J8829J28963J95515
$$ plain form
4246 114012 170626 10028 -127780 -92826 -52059 -109383 -271953 -348578 -262647 -55652 9947
4235 9947 -36703 12379 55166 12156 80855 39932 7771 7553 47805 50720 -35851 -39522 55943
4222 55943 94297 -18407 -27664 -457 62698 76368 16462 92233 62270 -109802 -262791
4211 -262791 -344267 -380584 -273291 -316057 -180725 -57137 137504 219817 135077 -57974 -219765
4200 -219765 -64079 113871 28530 -34727 -103797 -159666 -235281 -313986 -442690 -366682 -268090
4189 -268090 -197694 -225195 -103614 -106776 -42430 -41390 -185149 -256226 31821 209313 78921
4178 78921 75618 125707 190117 218003 187394 228713 87852 -197720 -380557 -299515 -193662
4167 -193662 -122336 -88485 -146264 -233734 -174431 -175537 -260389 -248897 -27934 -25761 -129210 -66737
$$ packed form
4246A14012N6614j60598j37808L4954M0767n7324j62570p6625Q5931K06995O5599
4235I947m6650M9082M2787m3010O8699m0923l2161k18M0252K915q6571l671R5465
4222E5943L8354j12704r257K7207O3155J3670n9906P5771k9963j72072j52989
4211b62791q1476l6317J07293m2766J35332J23588J94641Q2313q4740j93051j61791
4200b19765J55686J77950q5341o3257o9070n5869p5615p8705j28704P6008R8592
4189b68090P0396k7501J21581l162O4346J040j43759p1077K88047J77492j30392
4178G8921l303N0089O4410K7886l0609M1319j40861k85572j82837Q1042J05853
4167a93662P1326L3851n7779q7470N9303j106q4852J1492K20963K173j03449O2473
$$ plain form
4155 -66737 -98594 -100997 6959 192024 164950 69733 -113864 -41857 198239 360564 374459
4144 374459 403954 227890 209805 243172 160629 125184 158154 8367 -11438 -135033 -191755
4133 -191755 -98962 -56355 35366 58560 51659 77498 38099 39122 12838 250225 283652 15040
4121 15040 88777 229980 271249 226968 225291 162514 135590 115165 -52962 -116019 56002
4110 56002 92347 158690 75334 -79669 2234 75876 135142 207198 318356 218312 67072
4099 67072 29137 22971 -85478 -224444 -176056 -110336 -68744 -34467 21622 4198 64542 157232
4087 157232 189191 98395 73829 77085 19063 58542 98453 148644 103621 -53195 -81184 -128160
4075 -128160 -128862 -246735 -177205 -234809 -111245 51119 69016 97549 114351 52032 107705
$$ packed form
4155f6737l1857k403J07956J85065k7074r5217j83597P2007K40096J62325J3895
4144C74459K9495j76064j8085L3367q2543l5445L2970j49787j9805j23595n6722
4133a91755R2793M2607R1721K3194o901K5839l9399J023k6284K37387L3427k68612
4121A5040P3737J41203M1269m4281j677o2777k6924k0425j68127o3057J72021
4110E6002L6345O6343q3356j55003Q1903P3642N9266P2056J11158j00044j51240
4099F7072l7935o166j08449j38966M8388O5720M1592L4277N6089j7424O0344R2690
4087A57232L1959r0796k4566L256n8022L9479L9911N0191m5023j56816k7989m6976
4075a28160p02j17873O9530n7604J23564J62364J7897K8533J6802o2319N5673
$$ plain form
4064 107705 39928 115188 174577 300730 316282 199334 122972 -7270 30429 40961 -5715
4053 -5715 47457 113317 -31718 26463 96651 191791 289187 287358 227293 133386 5221 -112103
4041 -112103 -116925 -162455 -115397 -248338 -209581 -161935 -291741 -199997 -98726 -92483 -50205
4030 -50205 -41947 20933 90687 331599 317494 284416 275668 229431 155141 130420 -14192 80130
4018 80130 472985 458200 416802 430763 333437 197493 103539 35195 32372 154675 218839
4007 218839 75947 1878 -107789 -49004 -14159 15143 88953 118384 166376 172027 252202
3996 252202 304565 236428 306047 154085 31294 84317 73370 -16469 -223581 -440371 -402951
3985 -402951 -269762 -107292 126970 158382 57813 -1541 -113920 -275658 -347461 -152698
$$ packed form
4064A07705o7777P5260N9389J26153J5552j16948p6362j30242L7699J0532m6676
4053e715N3172O5860j45035N8181P0188R5140R7396j829o0065r3907j28165j17324
4041a12103m822m5530M7058j32941L8757M7646j29806R1744J01271O243M2278
4030e0205Q258O2880O9754K40912j4105l3078q748m6237p4290k4721j44612R4322
4018H0130L92855j4785m1398J3961r7326j35944r3954o8344k823J22303O4164
4007B18839j42892p4069j09667N8785L4845K9302P3810K9431M7992N651Q0175
3996B52202N2363o8137O9619j51962j22791N3023j0947q9839k07112k16790L7420
3985d02951J33189J62470K34262L1412j00569n9354j12379j61738p1803J94763
$$ plain form
3975 -152698 105368 62099 -118236 -199504 -196964 -150877 -53499 -122288 -149705 -166819 -110236
3964 -110236 -115931 -27264 -2955 -30364 25793 171664 118412 166243 153066 240508 113946
3953 113946 55044 71805 116340 -9109 16462 57016 141492 151957 39611 160143 148543
3942 148543 135259 111346 100434 -63219 -282278 -332745 -274538 -317005 -275296 -189125 -19080
3931 -19080 7724 36846 185009 151040 243869 398933 381216 316922 264131 148698 56713
3920 56713 36529 -100185 -284194 -280663 -404565 -395074 -236303 -194027 -121794 -81555 -265689
3909 -265689 -267285 -288364 -77304 54452 163511 134460 -2697 -16103 95130 129503 37727
3898 37727 6243 -60361 -117630 -84854 -91281 -202081 -168799 -6034 -60461 -138005 -130389 -170986
$$ packed form
3975a52698K58066m3269j80335q1268K540M6087R7378o8789k7417j7114N6583
3964a10236n695Q8667K4309k7409N6157J45871n3252M7831j3177Q7442j26562
3953A13946n8902J6761M4535j25449K5571M0554Q4476J0465j12346J20532j1600
3942A48543j3284k3913j0912j63653k19059n0467N8207m2467M1709Q6171J70045
3931a9080K6804K9122J48163l3969R2829J55064j7717o4294n2791j15433r1985
3920E6713k0184j36714j84009L531j23902R491J58771M2276P2233M0239j84134
3909b65689j596k1079K11060J31756J09059k9051j37157j3406J11233L4373r1776
3898C7727l1484o6604n7269L2776o427j10800L3282J62765n4427p7544P616m0597
$$ plain form
3886 -170986 -332983 -300816 -161555 70335 188102 65392 139517 89303 78134 109202 -6303
3875 -6303 52624 -33188 -161867 -81160 -44362 67581 93320 9992 -135208 -186998 -129993
3864 -129993 -121115 -134146 -120410 30446 -16534 -19124 -46607 -3482 40636 97010 1126 5805
3852 5805 17825 -41993 -144350 -90817 -87207 40699 125242 45029 -26440 -129017 -19422
3841 -19422 167991 153557 39267 3920 -115246 -174868 797 61368 14927 -83036 -58560
3830 -58560 18263 -64745 -120920 -205330 -208369 -37706 101007 129805 81676 19042 13713 75213
3818 75213 48624 -17797 116467 213075 60814 69553 152916 156893 103987 85292 57761 172381
3806 172381 172271 3305 -119376 -54782 -115035 -191718 -166735 -152781 -163156 4133 102631
$$ packed form
3886a70986j61997L2167J39261K31890J17767j22710P4125n0214j1169L1068j15505
3875f303N8927q5812j28679Q0707L6798J11943K5739q3328j45200n1790N7005
3864a29993Q878j3031J3736J50856m6980k590k7483M3125M4118N6374r5884M679
3852E805J2020n9818j02357N3533L610J27906Q4543q0213p1469j02577J09595
3841a9422J87413j4434j14290l5347j19166n9622J75665O0571m6441r7963K4476
3830e8560P6823q3008n6175q4410l039J70663J38713K8798m8129o2634n329O1500
3818G5213k6589o6421J34264R6608j52261Q739Q3363L977n2906j8695k7531J14620
3806A72381j10j68966j22681O4594o0253p6683K4983J3954j0375J67289R8498
$$ plain form
3795 102631 167193 196336 -50473 -144118 1517 -49887 -150720 -17288 121293 -28933
3785 -28933 -167738 -177851 -136484 -105104 -106915 -147346 -224235 -269957 -131568 -106052 38655
$$ packed form
3795A02631O4562K9143k46809r3645J45635n1404j00833J33432J38581j50226
3785b8933j38805j0113M1367L1380j811m0431p6889m5722J38389K5516J44707
$$ [...]
##END NTUPLES=NMR SPECTRUM
##END=
