##TITLE=Analysis number 321522
Compound Code cc 40804
Book Reference 468/143
Project Code adrs
Chemist Name colinb
##JCAMPDX= 6.0         $$ Bruker NMR JCAMP-DX V2.0
##DATA TYPE= NMR SPECTRUM
##DATA CLASS= NTUPLES
##ORIGIN= Bruker BioSpin GmbH
##OWNER= nmr
$$ XWIN-NMR		Version 3.5
$$ Mon Aug 14 15:06:29 2006 GMT Daylight Time (UT+1h)  MAYBRIDGE\nmr@NMR_250MHZ
##.OBSERVE FREQUENCY= 250.131544655141
##.OBSERVE NUCLEUS= ^1H
##.ACQUISITION MODE= SIMULTANEOUS (DQD)
##.ACQUISITION SCHEME= undefined
##.AVERAGES= 16
##.DIGITISER RES= 18
##SPECTROMETER/DATA SYSTEM= dpx250
##.PULSE SEQUENCE= zg30
##.SOLVENT NAME= CDCl3
##.SHIFT REFERENCE= (INTERNAL, CDCl3, 0, 16.522)
##AUDIT TRAIL= $$ (NUMBER, WHEN, WHO, WHERE, WHAT)
$$ ##TITLE= Audit trail, XWIN-NMR		Version 3.5
$$ ##JCAMPDX= 5.01
$$ ##ORIGIN= Bruker BioSpin GmbH
$$ ##OWNER= nmr
$$ C:\u/data/dgb/nmr/ADRS/850/pdata/1/auditp.txt
$$ ##AUDIT TRAIL=  $$ (NUMBER, WHEN, WHO, WHERE, WHAT)
(   1,<2006-08-14 15:06:06.56 +100>,<MAYBRIDGE\nmr>,<NMR_250MHZ>,
      <created by zg, POWCHK disabled, PULCHK disabled
       configuration hash MD5:
       E2 DF 36 D8 04 B2 41 60 5A D7 A3 38 5A 4B D0 FE
       data hash MD5: 64K
       62 C9 26 19 77 E9 32 45 94 36 DE F5 49 61 E8 E0>)
(   2,<2006-08-14 15:06:20.31 +100>,<MAYBRIDGE\nmr>,<NMR_250MHZ>,
      <Start of raw data processing
       ef LB = 0.3 FT_mod = 6 PKNL = 1 SI = 32K 
       data hash MD5: 32K
       97 AC 79 52 7D A5 63 93 9B E2 84 21 16 FB CA 39>)
(   3,<2006-08-14 15:06:22.01 +100>,<MAYBRIDGE\nmr>,<NMR_250MHZ>,
      <apk 
       data hash MD5: 32K
       1D 48 AB 9A 71 9A 26 38 A0 3B EB 45 C8 CC A5 FD>)
(   4,<2006-08-14 15:06:23.09 +100>,<MAYBRIDGE\nmr>,<NMR_250MHZ>,
      <abs ABSG = 5 
       data hash MD5: 32K
       C5 6B 83 C3 6F BA 92 93 0C 5D 66 5B 6F 15 67 75>)
$$ ##END=
$$ 
$$ hash MD5
$$ 48 43 A7 CD D5 09 DF 4F 34 4A 60 EC F1 BB 2F 56
##$RELAX= 
##$RELAX= 
##$RELAX= 
##$RELAX= 
##$RELAX= 
##$RELAX= 
##$RELAX= 
$$ Bruker specific parameters
$$ --------------------------
##$DU= <C:\u>
##$EXPNO= 850
##$NAME= <ADRS>
##$PROCNO= 1
##$TYPE= <nmr>
##$USER= <dgb>
##$AMP= (0..31)
100 100 100 100 100 100 100 100 100 100 100 100 100 100 100 100 100 100 
100 100 100 100 100 100 100 100 100 100 100 100 100 100 
##$AQSEQ= 0
##$AQ_mod= 3
##$AUNM= <au_zg>
##$AUTOPOS= <24 >
##$BF1= 250.13
##$BF2= 250.13
##$BF3= 250.13
##$BF4= 250.13
##$BF5= 500.13
##$BF6= 500.13
##$BF7= 500.13
##$BF8= 500.13
##$BYTORDA= 1
##$CFDGTYP= 0
##$CFRGTYP= 5
##$CHEMSTR= <none>
##$CNST= (0..31)
1 1 145 1 1 1 1 1 1 1 1 1 1 1 1 1 1 1 1 1 1 1 1 1 1 1 1 1 1 1 1 1 
##$CPDPRG= <>
##$CPDPRG1= <>
##$CPDPRG2= <>
##$CPDPRG3= <>
##$CPDPRG4= <mlev>
##$CPDPRG5= <mlev>
##$CPDPRG6= <mlev>
##$CPDPRG7= <mlev>
##$CPDPRG8= <mlev>
##$CPDPRGB= <>
##$CPDPRGT= <>
##$D= (0..31)
0 1 0 0 0 0 0 0 0 0.06 0 0 0 0 0 0 0.0002 0 0 0 0 0 0 0 0 0 0 0 0 0 0 
0 
##$DATE= 1155564365
##$DBL= (0..7)
120 120 120 120 120 120 120 120 
##$DBP= (0..7)
150 150 150 150 150 150 150 150 
##$DBP07= 0
##$DBPNAM0= <>
##$DBPNAM1= <>
$$ [...]
##$SUBNAM7= <"">
##$SUBNAM8= <"">
##$SUBNAM9= <"">
##$SW= 20.6930455092707
##$SWIBOX= (0..15)
0 0 3 0 0 0 0 0 0 0 0 0 0 0 0 0 
##$SW_h= 5175.983436853
##$TD= 65536
##$TD0= 1
##$TE= 295.16
##$TE2= 300
##$TE3= 300
##$TEG= 300
##$TL= (0..7)
0 120 120 120 120 120 120 120 
##$TP= (0..7)
150 150 150 150 150 150 150 150 
##$TP07= 0
##$TPNAME0= <>
##$TPNAME1= <>
##$TPNAME2= <>
##$TPNAME3= <>
##$TPNAME4= <>
##$TPNAME5= <>
##$TPNAME6= <>
##$TPNAME7= <>
##$TPOAL= (0..7)
0.5 0.5 0.5 0.5 0.5 0.5 0.5 0.5 
##$TPOFFS= (0..7)
0 0 0 0 0 0 0 0 
##$TUNHIN= 0
##$TUNHOUT= 0
##$TUNXOUT= 0
##$USERA1= <user>
##$USERA2= <user>
##$USERA3= <user>
##$USERA4= <user>
##$USERA5= <user>
##$V9= 5
##$VALIST= <valist>
##$VCLIST= <CCCCCCCCCCCCCCC>
##$VD= 0
##$VDLIST= <DDDDDDDDDDDDDDD>
##$VPLIST= <PPPPPPPPPPPPPPP>
##$VTLIST= <TTTTTTTTTTTTTTT>
##$WBST= 1024
##$WBSW= 4
##$XGAIN= (0..3)
0 0 0 0 
##$XL= 0
##$YL= 0
##$YMAX_a= 412933
##$YMIN_a= -535614
##$ZGOPTNS= <>
##$ZL1= 120
##$ZL2= 120
##$ZL3= 120
##$ZL4= 120
##$ABSF1= 16.522
##$ABSF2= -4.171173
##$ABSG= 5
##$ABSL= 3
##$ALPHA= 0
##$AQORDER= 0
##$ASSFAC= 0
##$ASSFACI= 0
##$ASSFACX= 0
##$ASSWID= 0
##$AUNMP= <proc_1d>
##$AZFE= 0.1
##$AZFW= 0.1
##$BCFW= 0
##$BC_mod= 0
##$BYTORDP= 0
##$COROFFS= 0
##$CY= 12.5
##$DATMOD= 1
##$DC= 0
##$DFILT= <>
##$DTYPP= 0
##$F1P= 14.0000005364418
##$F2P= -0.99999901652339
##$FCOR= 0.5
##$FTSIZE= 32768
##$FT_mod= 6
##$GAMMA= 0
##$GB= 0
##$INTBC= 1
##$INTSCL= 1
##$ISEN= 128
##$LB= 0.3
##$LEV0= 0
##$LPBIN= 0
##$MAXI= 10000
##$MC2= 0
##$MEAN= 0
##$ME_mod= 0
##$MI= 0
##$NCOEF= 0
##$NC_proc= -4
##$NLEV= 6
##$NOISF1= 0
##$NOISF2= 0
##$NSP= 0
##$NTH_PI= 0
##$NZP= 0
##$OFFSET= 16.522
##$PC= 1
##$PHC0= 143.7779
##$PHC1= 10.09996
##$PH_mod= 1
##$PKNL= yes
##$PPARMOD= 0
##$PSCAL= 4
##$PSIGN= 0
##$REVERSE= no
##$SF= 250.13
##$SI= 32768
##$SIGF1= 0
##$SIGF2= 0
##$SINO= 400
##$SIOLD= 32768
##$SREGLST= <1H.CDCl3>
##$SSB= 0
##$STSI= 32768
##$STSR= 0
##$SW_p= 5175.98343685301
##$SYMM= 0
##$S_DEV= 0
##$TDeff= 65536
##$TDoff= 0
##$TI= <Analysis number 999999
Compound Code 99
Book Reference 9
Project Code 9>
##$TILT= no
##$TM1= 0
##$TM2= 0
##$TOPLEV= 0
##$USERP1= <user>
##$USERP2= <user>
##$USERP3= <user>
##$USERP4= <user>
##$USERP5= <user>
##$WDW= 1
##$XDIM= 32768
##$YMAX_p= 257807245
##$YMIN_p= -369898
$$ End of Bruker specific parameters
$$ ---------------------------------
##NTUPLES= NMR SPECTRUM
##VAR_NAME=  FREQUENCY,     SPECTRUM/REAL,   SPECTRUM/IMAG
##SYMBOL=    X,             R,               I
##VAR_TYPE=  INDEPENDENT,   DEPENDENT,       DEPENDENT
##VAR_FORM=  AFFN,          ASDF,            ASDF
##VAR_DIM=   32768,         32768,           32768
##UNITS=     HZ,            ARBITRARY UNITS, ARBITRARY UNITS
##FACTOR=    0.157963299565203, 1,           1
##FIRST=     4132.6476996994, 0,             0
##LAST=      -1043.33573715361, 0,           0
##MIN=       -1043.33573715361, -369898,     0
##MAX=       4132.6476996994, 257807245,     0
$$ Real data points
##PAGE= N=1
##DATA TABLE= (X++(R..R)), XYDATA
$$ [...]
18314C968918o9869q2544r3010o7696n9948J8837Q2247J02111J10357M8264L798
18303C961465q627n911O9815J39555K12769L32153M91819O97608R67270J417527
18293H275443K238689L671659N356965N943019N475877L410224k40579k505016
18285C1626281l154720k267509k9926J362698J488330J059654J044869J548103
18277C2677780J372417o01761l196630n032142n184823l762041k268514j375274
18269A2629012q91091o29706n07100m33026l47432k34974j70830r8520n2057m5604
18259I218672j9359O866P8596J31901K41218L81004N68383Q57655J206067J714109
18249A4385112K462886L771655O125573R808872J3286872J3996403J2458280N949932
$$ plain form
18314 3968918 3899049 3816505 3723495 3655799 3595851 3614688 3696935 3799046 3909403 3957667 3961465
18303 3961465 3952838 3946927 4016742 4156297 4369066 4701219 5193038 5890646 6857916 8275443
18293 8275443 10514132 14185791 19542756 25485775 30961652 34371876 34131297 31626281
18285 31626281 28471561 26204052 26174126 27536824 29025154 30084808 31129677 32677780
18277 32677780 34050197 33448436 30251806 25219664 20034841 16272800 14004286 12629012
18269 12629012 11737921 11108215 10601115 10168089 9820657 9585683 9414853 9316333 9264276 9218672
18259 9218672 9199313 9206179 9284775 9416676 9657894 10038898 10607281 11464936 12671003 14385112
18249 14385112 16847998 20619653 26745226 36554098 49840970 63837373 76295653 82245585
18241H2245585k339415p252213r823254q495108l165419K554874O542980P752580
18233F8020610O756927J570732l965748o357260p580058o639908m529463m449591
18225D2826241m845358m978969m733139l556422k333369j533810j062184q04586
18217A8978404p16469o55312o26044n43573m83929l78574k82316k23799j85934
18208A4882454j70117j53626r0210J0613J70783M19439P21102J100288J639618
18199A8530344K346391L566965N847373R158164J1356634J1114079Q070813O66876
18191G0657639n940670r306912j0016254p100706k740101R56384M407822P259234
18183D8176436Q034285P247507L357648k030016m929376n680104l384842K817330
$$ plain form
18241 82245585 79906170 72653957 62830703 54335595 51170176 53725050 60268030 68020610
18233 68020610 74777537 76348269 72382521 66025261 58445203 51805295 47275832 42826241
18225 42826241 37980883 33001914 28268775 24712353 22378984 20845174 19782990 18978404
18217 18978404 18261935 17606623 16980579 16437006 15953077 15574503 15292187 15068388 14882454
18208 14882454 14712337 14558711 14468501 14479114 14649897 15069336 15790438 16890726 18530344
18199 18530344 20876735 24443700 30291073 39449237 50805871 61919950 69990763 70657639
18191 70657639 64716969 55410057 45393803 38293097 35552996 36509380 40917202 48176436
18183 48176436 56210721 63458228 66815876 64785860 59856484 54176380 50791538 53608868
18175E3608868J0733099J5651965J2118796M203107o850745j5271750j3158888
18168F1034452n417584K165920J0072621J5287263J1852714L302636q367241j8019397
18160G1911384j7588809j1323644o722493m138037k592630j711457j245307r93094
18152B5595913q32008p70683p77941q58562q81813q05000p13576n56876m12497
18143A8986957k96840j42431m6182m1190K1655Q3902J78110L45200O02773J049029
18133B0740983J633014K484229L897883O398544J0271184J3688075J5306783J3673754
18125H8094449N288298k980192q711446j0971163o338992K002663R162033J0555169
18117H6100819N776221k499733j2670533j7114368j3140591p695749m251436k040545
$$ plain form
18175 53608868 64341967 79993932 92112728 96315835 89465090 74193340 61034452
18168 61034452 55616868 57782788 67855409 83142672 94995386 98298022 89930781 71911384
18160 71911384 54322575 42998931 36276438 32138401 29545771 27834314 26589007 25595913
18152 25595913 24763905 23993222 23215281 22356719 21474906 20669906 19956330 19399454 18986957
18143 18986957 18690117 18547686 18501504 18460314 18481969 18565871 18743981 19089181 19691954 20740983
18133 20740983 22373997 24858226 28756109 35154653 45425837 59113912 74420695 88094449
18125 88094449 93382747 90402555 81691109 70719946 64380954 66383617 75545650 86100819
18117 86100819 91877040 89377307 76706774 59592406 46451815 38756066 34504630 32464085
18109C2464085k59621J712592M801259P807799O105997K045783l788113r330826
18101D1558955r072291n375044k966489j782149j098098p55759o46248n77193
18093A9285684m76880l41942l06758k43084j85130j66359O218L16675Q16258J714764
18083B0419446L018050L990876L665178K186675L16324j217806j505255o36396
18075C0237092J91904J447214K842420K154743J00226l129441n988538n702138
18067B2153482l629077k234987j431610r53782o89367n93117n19091m65725m25467
18058A1211259l79032l83941l54245k88963k39701k25800k16284k43997k57830
18049H621466k29824j76354j15918j19894j80881k15171k53621k34832j75605
$$ plain form
18109 32464085 32204464 33917056 38718315 46526114 52632111 54677894 50889781 41558955
18101 41558955 32486664 27111620 24145131 22362982 21264884 20509125 19862877 19285684
18093 19285684 18808804 18466862 18160104 17917020 17731890 17565531 17571749 17888424 18704682 20419446
18083 20419446 23437496 27428372 31093550 33280225 33596549 32378743 30873488 30237092
18075 30237092 30428996 31876210 34718630 36873373 36973599 33844158 27855620 22153482
18067 22153482 18524405 16289418 14857808 13904026 13214659 12621542 12102451 11636726 11211259
18058 11211259 10832227 10448286 10094041 9805078 9565377 9339577 9123293 8879296 8621466
18049 8621466 8391642 8215288 8099370 7979476 7798595 7583424 7329803 7094971 6919366
18040F919366j35187p4467q3743j21278j62102k05241k19165j79790r7211r9514
18030E541668p7489o6055r0323j18025j34867j07290p1620k9955j3457j4727k1655
18019D796205m4412q6598o9133n8589q4477o6950r4095j18950o3341k6698m6251
18008D036711r7774l7471o2754j04433q3716m8735m7328k0086K6311J7352m5106
17997C532971o9003n3876o8567p0123k9022l164O71L0992P010n2880p3513o4475
17985C087021j0006k5348m1562p9061r9690p1665j2863p663j4010n3445n2329
17974B619379j7142m5248m8739K7864M1049k2706q0589q6095p3858n3801j9484
17963B240630m1464r970k3656l3545k5173o2377Q313j3157l2348m6363q8082n3761
$$ plain form
18040 6919366 6784179 6709712 6625969 6504691 6342589 6137348 5918183 5738393 5641182 5541668
18030 5541668 5464179 5398124 5307801 5189776 5054909 4947619 4875999 4846044 4832587 4817860 4796205
18019 4796205 4751793 4665195 4596062 4537473 4452996 4386046 4291951 4173001 4109660 4082962 4036711
18008 4036711 3938937 3901466 3838712 3734279 3650563 3601828 3554500 3534414 3560725 3578077 3532971
17997 3532971 3463968 3410092 3341525 3271402 3242380 3239216 3239887 3270879 3277889 3225009 3151496 3087021
17985 3087021 3077015 3051667 3010105 2931044 2831354 2759689 2746826 2739163 2725153 2671708 2619379
17974 2619379 2602237 2556989 2508250 2536114 2577163 2554457 2473868 2387773 2313915 2260114 2240630
17963 2240630 2199166 2189196 2165540 2131995 2106822 2044445 2052758 2039601 2007253 1960890 1872808 1819047
17951A819047m2402n6974l4909r748P394R502j9300k3879L8176L1117L0936L4098
17939A783058k5683p4528q9224n0095l2511l5775Q403K1128K8137M2194N7424
17928A632528O0126n821m1368l9949j7171k4427l7578p5055p0438j9004k1194
17917A340649l3831l2524o2083l8150l0379k2611j1292J5484j3959P17n627j0591
17905A095803k9202n230q935N738P899J3659K5915J0199j1657n8515j9837l786
17893A022051M754k9693j5410j5743j0154J9027m416J803O843J4582M95j794O946
17880I99291M7525M6367J0003m864K463j3595j8233k6627k026k7557n8919p5461
17868H78367n1867j3497j2746l6023j1429L049j7374k6936J0937j2419Q129J7315
$$ plain form
17951 1819047 1776645 1719671 1684762 1675014 1682408 1691910 1672610 1648731 1686907 1718024 1748960 1783058
17939 1783058 1757375 1682847 1593623 1543528 1511017 1475242 1483645 1504773 1532910 1575104 1632528
17928 1632528 1692654 1686833 1645465 1605516 1588345 1563918 1526340 1451285 1380847 1361843 1340649
17917 1340649 1306818 1274294 1212211 1174061 1143682 1121071 1109779 1125263 1111304 1112021 1106394 1095803
17905 1095803 1066601 1061371 1052436 1058174 1066073 1079732 1105647 1115846 1104189 1045674 1025837 1022051
17893 1022051 1026805 997112 981702 965959 955805 974832 970416 972219 979062 993644 994139 992345 999291
17880 999291 1046816 1093183 1103186 1098322 1100785 1087190 1068957 1042330 1040304 1012747 953828 878367
17868 878367 826500 813003 800257 764234 752805 755854 738480 711544 722481 710062 718191 735506
17856G35506K7833J7694M7239M4099J7135O094K8809J0399j6318k8525m3125n265
17844H41575R247k4473k9602j4970k9296m1989n53J4431M3269K1046L2432K6683
17832H47800k946j1754k0164l9090l4389l4946P468J5793Q184r412k6502m8595
17820F51447p2827n7201o5562k4980L4126J8217j92J1479j8100o702J3957N568
17808D89230l309K1436K0449K541j2069j4701j0558J5007J5154j709j479k8154
17796D91838l1962j3589L9202o148M72J7430K1672j5807k1766J0955M1892L7515
17784E71704J1877m391K381l548k2288J1833J7067J3366L8336M3840M4896O6574
17772G91647M0157N371j5971o3974q0113l0610L6994O0919M9979j0461m9211l5998
$$ plain form
17856 735506 763339 781033 828272 872371 889506 895600 924409 934808 918490 889965 846840 841575
17844 841575 850822 826349 796747 781777 752481 710492 709939 724370 767639 788685 821117 847800
17832 847800 844854 833100 812936 773846 739457 704511 711979 727772 735956 726544 700042 651447
17820 651447 578620 521419 455857 430877 465003 483220 483028 494507 476407 469705 483662 489230
17808 489230 485921 507357 527806 530347 518278 503577 493019 508026 523180 521471 519992 491838
17796 491838 459876 446287 485489 479341 479813 497243 518915 503108 481342 492297 534189 571704
17784 571704 583581 579190 581571 578023 555735 567568 584635 598001 636337 680177 725073 791647
17772 791647 831804 837175 821204 757230 677117 646507 683501 744420 794399 783938 734727 698729
17760F98729l8192n5824j6099o122j034m4996l0224Q693J0162L306j0443j5752
17748E02204j9912n630j4926l7262k2102J035Q034K001K0368M8123J0205j1975
17736D80163J0157J5338K1778n03M8537O330M0188M0386M9198L8263L3675K5612
17724H09122K2954M7467L3578L0809R1628N5176K0658j8393r3727q8081l8467
17713H72724l8884k8332N258l7355n5256p7136n0662k5005j6111m3327o877l6107
17701D62930l0639l5179L964L3455R239N27L6006L1917k0758p349J2851R712m907
17688E01769J676M849k7294j1385J3998J9660P957N351J0823J6839J1297L9255
17676E94795O8208P2255L5262L4447K1834j681L7989P6563P2779K1135R924P584
$$ plain form
17760 698729 660537 604713 588614 582492 581458 536462 506238 514931 525093 528399 517956 502204
17748 502204 482292 476662 461736 424474 402372 403407 411441 413442 433810 481933 492138 480163
17736 480163 490320 505658 527436 526933 575470 581800 621988 662374 711572 749835 783510 809122
17724 809122 832076 879543 913121 943930 1035558 1090734 1111392 1092999 999272 911191 872724
17713 872724 833840 805508 810766 773411 718155 641019 590357 565352 549241 505914 499037 462930
17701 462930 432291 397112 401076 434531 443770 444297 480303 512220 491462 484113 496964 506676 501769
17688 501769 503445 508294 481000 469615 483613 503273 511230 516581 527404 544243 555540 594795
17676 594795 663003 735258 770520 804967 826801 825120 863109 939672 1012451 1033586 1043510 1051094
17664A051094P25K1335J9257m9937p5929j14726q3698l0784j1999n1211n1755
17653F22372o1141l437k369P86p672n346k1826k0734l920K82j3447R394k5214
17640D67728p88r045k234j1415K350O661j6171J0524l103J7789L25l8108J1477
17627D35990N3546L1259N0995P7068O5765O8670N1780M4316M3866L8491k750q747
17615I50249m573p606p857j4523J97m1658o3130o9524n2340k5841l5127J7772
17603F46039J7761m2450k5892l738n825r293m337N030p873J126P91j6058m4868
17590E10413j4976K04M200o646K35j5171l3131l6863r427j1569J4600l93J336
17577D02812L8340M1664M5418K2816L9669K4614K649l3944j5074L554J5957N930
$$ plain form
17664 1051094 1051819 1073154 1092411 1042474 966545 851819 768121 737337 725338 674127 622372
17653 622372 561231 557794 555425 556211 548539 543193 521367 500633 496713 496995 483548 492942 467728
17640 467728 466940 457895 455661 444246 446596 453257 437086 447610 444507 462296 462621 424513 435990
17627 435990 489536 520795 571790 648858 714623 783293 835073 879389 923255 961746 958996 950249
17615 950249 945676 938070 930213 915690 915887 874229 811099 741575 689235 663394 628267 646039
17603 646039 663800 621350 595458 591720 585895 576602 572265 577295 569422 570548 571339 555281 510413
17590 510413 495437 495641 499841 493195 493430 478259 445128 408265 398838 387269 401869 401476 402812
17577 402812 441152 482816 528234 551050 590719 615333 617982 584038 568964 572518 588475 594405
17565E94405m1166j8305n4512l4267l922J0054M659k1348L418l633M521J837l1174
17552D10567j062q579N871K5658L4691L5724J9320J3125J8149M8276J5555K3448
17540F40743J7792l9871o1485k9150l5392o405K894k1371m8968l6180l368k6357
17528C52882n572k1991r635K6461K0649L0324m41M6305q488k6689k6876j1240
17516C65689K2500k0718k149k0357k5373l964M988k0902N839K9264j8440j8550
17504B97827r675N575j2782Q353R597J3009J8896K2449L1155J4232j8883J2414
17492C92167J3615P304j1457q322K591l384K9005J854j3630j9470m538q990Q300
17479C85045r39L284K0139R365J1450j5512k4907J3475L1795L660n998j8514l2234
$$ plain form
17565 594405 553239 534934 480422 446155 442233 452287 456946 435598 439016 435383 439904 441741 410567
17552 410567 409505 400926 406797 432455 467146 502870 522190 535315 553464 601740 617295 640743
17540 640743 658535 618664 557179 528029 492637 486232 489126 467755 418787 382607 379239 352882
17528 352882 347310 325319 315684 342145 362794 393118 392677 438982 430494 403805 376929 365689
17516 365689 388189 367471 365322 344965 319592 315628 320616 299714 305553 334817 316377 297827
17504 297827 288152 293727 280945 289298 298895 311904 330800 353249 384404 398636 379753 392167
17492 392167 405782 413086 401629 393307 395898 392514 421519 423373 409743 390273 385735 376745 385045
17479 385045 384106 387390 407529 416894 428344 412832 387925 401400 433195 436855 430857 412343 380109
17466C80109j8059J7816K5506K4929J5052j92k1613m3550l4510n7563k3874j3084
17454B50967k1137j4467P006K1883K2325L2643J4498P95j0028k4056k4154j8952
17442B37323N250M0132L0852K9601L1767r544l8767n4280k5319p7L0278K400k3619
17429B55997n0660J1715L6745k6409l6920K7382l210O178J6647k7035k8718j3043
17417A68669l015l0960m184J6886j1063l7423j3247n993J1873L850L504k625m474
17404I1798J3396j8824j8527O349p93J366P892Q380p948J6712k3683l6792P25
17391D0051J4479L230n367j4323K758J9063J6944m285r462l3722j0830l126o04
17378A4806j7704j2715J0553j7034n352J5029J5460q809j0999j5563K1658J754
$$ plain form
17466 380109 362050 379866 405372 430301 445353 445161 423548 379998 345488 287925 264051 250967
17454 250967 229830 215363 222369 244252 266577 299220 313718 314513 304485 280429 256275 237323
17442 237323 242573 282705 313557 343158 374925 365381 326614 272334 247015 246938 277216 279616 255997
17429 255997 205337 217052 253797 227388 190468 217850 214640 220818 237465 210430 181712 168669
17417 168669 165654 134694 130510 147396 136333 98910 85663 79670 91543 95393 98897 96272 91798
17404 91798 105194 86370 67843 74192 73399 74765 82657 91037 83089 99801 76118 39326 40051
17391 40051 54530 57760 52393 38070 40828 59891 76835 72550 63088 29366 18536 15410 14806
17378 14806 -2898 -15613 -5060 -22094 -27446 -12417 3043 -5766 -16765 -32328 -10670 -8916
17366h916K2479R753j4248j439N169k8219M723p934N571L6309J8000K768k219
17353D1797j6446l1747J0701j2668k1253J9142R090k573K5686l773P163k6638
17341a519L4341J2091j4282k4924j5034Q547P461p75l5786l8310k2792L1599K8649
17328c0734j1482m774k263Q633J9688J3857J2125j3241m543l327J7799Q062l294
17315F506k6957l1824O203J9425O711k277R745K1467j301J8408J1007l767j9133
17302A4213j3896K3977R814q907j4241j7696j5638O443j2151L1801p413j1131
17290a4825j1934k9110q791P89Q198J9906M770M355m775l3257j9252K6374N0264
17277g288K2475k1979m1715j7330J0706Q179J6738L716k0972J041L090r00k6144
$$ plain form
17366 -8916 13563 23316 9068 7629 12798 -15421 -10698 -18632 -13061 23248 41248 44016 41797
17353 41797 25351 -6396 4305 -8363 -29616 -10474 -1384 -3957 21729 17956 25119 -1519
17341 -1519 32822 44913 30631 5707 -9327 -780 6681 5906 -29880 -68190 -90982 -59383 -30734
17328 -30734 -42216 -46990 -49253 -40620 -20932 -7075 5050 -8191 -12734 -16061 1738 9800 6506
17315 6506 -20451 -52275 -46072 -26647 -19936 -22213 -12468 8999 7698 26106 37113 33346 14213
17302 14213 317 24294 34108 25201 10960 -6736 -22374 -15931 -28082 3719 -3694 -14825
17290 -14825 -26759 -55869 -64660 -63871 -55673 -35767 -30997 -26642 -31417 -64674 -83926 -57552 -7288
17277 -7288 15187 -6792 -48507 -65837 -55131 -46952 -30214 -26498 -47470 -46429 -43339 -44239 -70383
17264g0383m9695r109K9931j977J1755K9127R874J2967J0350l4977l812n832J3004
17251e8777L5181K0955Q393J2005r018r419k2863j4600k699M261K3469R210j6278
17238b0180l8419J1868k8863j7976K7078R590j923K5468K6216R450L031k6569
17226b1229r909o698l2048J0438L207O725K5738K8268O409j5570k356K720o675
17213a0980r0K1777j862j1077L268N087K2283L418k4834P10J2783J8854J912Q647
17199D9896n276N855l482j5593K5398M2993M565l4906k0817Q655J2954l449r586
17186E7207m978M953l9206j9590P988o147O178K8475J0682J1023O009K770Q999
17173G4363L24k698m481j2174j0214J8033J6833K1597L5361J8585J0726l8123
$$ plain form
17264 -70383 -120078 -129187 -99256 -101233 -89478 -60351 -50477 -37510 -27160 -62137 -65949 -71781 -58777
17251 -58777 -23596 -2641 5752 17757 8739 -680 -23543 -38143 -40842 -36581 -13112 -3902 -20180
17238 -20180 -58599 -46731 -75594 -93570 -66492 -56902 -58825 -33357 -7141 2309 5340 -21229
17226 -21229 -31138 -37836 -69884 -59446 -56239 -49514 -23776 4492 10901 -4669 -7025 -4305 -10980
17213 -10980 -11070 10707 8845 -2232 1036 6123 28406 31824 6990 7700 20483 39337 41249 49896
17199 49896 44620 50475 46993 31400 56798 99791 104356 69450 48633 57288 70242 66793 57207
17186 57207 52229 57182 17976 -1614 6374 227 6405 34880 45562 56585 62594 65364 74363
17173 74363 74687 71989 67508 55334 45120 63153 79986 101583 136944 155529 166255 128132
17161A28132l1844l0096q070N5597N8823O051l6390k3551J5973j322j3130p283
17149A12890k4451o214l229L2276J370R000k0912k1802r129L526r884n276j9048
17136C9117m5398r502j2835J9539J3523k548j3769j3389K1143p760O053L37q178
17123a3667K8458r780j4024J7593L8601l3395o3908j6156j4872J8973J3927j374
17111d9624K536M999j9716k1591K0489j6062k1016r146O37M0072L4465J654k3539
17098e5842r272k839j2001j7914l043K0486M600q737k955K9910J4524p872J5775
17085c5180n486j8221q294J4420j4397j7678K3551N824J7085K5426n429m0523
17073e8902j0647j7785j4278J2613j9077n37j3532K9908J8515Q689O820r752L1046
$$ plain form
17161 128132 96288 66192 58122 113719 172542 178593 142203 118652 134625 133303 120173 112890
17149 112890 88439 82225 78996 111272 112642 121642 100730 78928 69799 73325 63441 58165 39117
17136 39117 -6281 -15783 -28618 -9079 4444 1896 -11873 -25262 -4119 -11879 -5826 -5489 -13667
17123 -13667 14791 5011 -9013 8580 47181 13786 -50122 -66278 -81150 -62177 -48250 -49624
17111 -49624 -47088 -42089 -61805 -83396 -62907 -78969 -99985 -109131 -108494 -68422 -33957 -32303 -55842
17098 -55842 -65114 -67953 -79954 -97868 -100911 -80425 -75825 -84562 -87517 -57607 -43083 -50955 -35180
17085 -35180 -40666 -58887 -67181 -52761 -67158 -84836 -61285 -55461 -38376 -12950 -18379 -58902
17073 -58902 -69549 -87334 -101612 -88999 -108076 -108613 -122145 -92237 -73722 -65033 -58213 -67965 -36919
17060c6919L631j2644l717k6848j276j3175k3866J9747M2438L016l4419m272j2911
17047a01215M744J5626L1666Q208j2374K877k5354K239J6180j0718K23p28N406
17034f3220J1341l419m258j0675J6601l423J0487M660l4916j5839N468J5632P898
17021f3663j307J7527P709m2356P450J9686J6515J5107r327k335r196p929l630
17008e5749j1243K4997L5613k004M343j5325k8400j2397J5350L0071J5436K215
16996B907k7908o221k567N243o723k954k0128Q42p305j8946J0158J8161O754K3321
16982b5366l3162k2609K1006N136P80o329J3111L0785O474l6511k5739L4164J3697
16969b4563o751k1284Q012o712n97J0455m944q809J764j7598p964J1224L0277
$$ plain form
17060 -36919 -33288 -45932 -49649 -76497 -77773 -90948 -114814 -95067 -52629 -49613 -84032 -88304 -101215
17047 -101215 -96471 -80845 -49179 -40971 -53345 -50468 -75822 -73583 -57403 -68121 -67898 -68626 -63220
17034 -63220 -51879 -55298 -59556 -70231 -53630 -57053 -46566 -41906 -76822 -92661 -87193 -71561 -63663
17021 -63663 -64970 -47443 -39734 -82090 -74640 -54954 -38439 -23332 -32659 -34994 -44190 -52119 -55749
17008 -55749 -66992 -41995 -6382 -8386 -4043 -19368 -47768 -60165 -44815 -14744 692 2907
16996 2907 -25001 -31222 -33789 -28546 -35269 -38223 -58351 -57509 -64814 -83760 -73602 -55441 -48687 -25366
16982 -25366 -58528 -81137 -60131 -54995 -54215 -60544 -47433 -16648 -10174 -46685 -72424 -38260 -24563
16969 -24563 -31314 -52598 -44586 -51298 -51895 -41440 -46384 -55193 -53429 -71027 -78991 -67767 -37490
16956c7490J3109m635p738J8835J6432K6954L0530J4136n482L9497L1734k3318
16944A12564k3285L816j5767l7083m7010k932J4384K4320K1601J5741L2305n192
16932I3462j5044l8038n9891J48J112J667J7093o966j3890j2378J6671L16j2876
16919b8614m061K0295k782j3446m722J1337r50Q715j2151l023J2131K7708M7759
16906E8196L9844J8345L5597L4550N644k0822m0464o7185k0719q61K2398J0886
16894G5409l002L8220J9827J9843j740k2260n7628m2915k3007P265j2947o693
16882i628l418k5825j7074L0775N0196o974k0871l4877q639k8227j146Q401j0316
16869g7623j4368J195L0367j0870J5626n861j5425J9965K146j7315K8497J733
$$ plain form
16956 -37490 -24381 -29016 -36754 -17919 -1487 25467 55997 70133 64651 104148 135882 112564
16944 112564 89279 93095 77328 40245 -6765 -9697 4687 29007 50608 66349 98654 93462
16932 93462 78418 40380 -19511 -19363 -18251 -16584 509 -6457 -20347 -32725 -16054 -15738 -28614
16919 -28614 -32675 -12380 -15162 -28608 -33330 -21993 -22943 -14228 -26379 -29402 -17271 10437 58196
16906 58196 98040 116385 151982 186532 192176 171354 130890 63705 42986 42125 64523 75409
16894 75409 72407 110627 130454 150297 148557 126297 68669 25754 2747 10012 -2935 -9628
16882 -9628 -13046 -38871 -55945 -25170 25026 18052 -2819 -37696 -46335 -74562 -75708 -67307 -77623
16869 -77623 -91991 -90796 -60429 -71299 -55673 -61534 -76959 -56994 -54848 -72163 -43666 -41933
16857d1933k3750K148p215r916K6718K5414N08k5997j0870L1641L4041M3617L079
16844D7485k745l0301j0828k926l012j5697j1597Q037P272J9380Q216J6376K8536
16831E8196Q48q782k1347j4670J6937K1933k3710l4220Q773P053k7664j1883N469
16818b3067J4987r30J2587j0630k973k5260l4031k8654j6714K5594M8873L898
16806c6320j2717N426k512J6190L5015L332r68K3400O395j4765j1164J2739j7305
16793F746P353k007j0831J2098K4194K774P558m618j0391l4432l8372k0582k478
16780f2988J639R754j001J4807K7581p561J574k972p376K0105j2441k2808O9K975
16766c8643J3464M854k7908k0788k4988j3598R581L1158j4389r58j2826K06n927
$$ plain form
16857 -41933 -65683 -63535 -70750 -80666 -53948 -28534 -28026 -54023 -64893 -33252 789 44406 47485
16844 47485 44740 14439 3611 685 -2327 -18024 -29621 -21584 -14312 5068 13284 29660 58196
16831 58196 59044 50262 28915 14245 31182 53115 29405 -4815 3958 11011 -16653 -28536 -23067
16818 -23067 -8080 -9010 3577 -7053 -10026 -35286 -69317 -97971 -114685 -89091 -40218 -36320
16806 -36320 -49037 -43611 -46123 -29933 5082 8414 7446 30846 37241 22476 11312 24051 6746
16793 6746 14099 12092 1261 13359 37553 40327 47885 43267 32876 -1556 -39928 -60510 -62988
16780 -62988 -61349 -51595 -52596 -37789 -10208 -17769 -16195 -19167 -26543 -6438 -18879 -41687 -41618 -38643
16766 -38643 -25179 -20325 -48233 -69021 -94009 -107607 -98026 -66868 -81257 -82215 -95041 -94835 -100762
16753a00762Q803L1503M4017k6108l2706l2010K1988k553q942L0845J4072p558
16741e9411N857J6793K7241J4077J4497j3838k4095j9657k0065N70J0307M156
16729d3568J1536M977j9929j3580l4702k208J9471Q670K3967l1665K088L8323
16717c6620j047K6448J9201k136l170k0652n501n387j1674J5192J8715J1191J3842
16704A8402K7818M9353N3205O0357P5843O7673J0263k4665m8378m5006p4360r5552
16692G4953l5914J1286j9010k7793M642q701O300k0521k155J0406K9545Q691k0891
16679A0838l4493q259J3835n516J2241J7527J5965J8709j6100l8627q064k440
16667b4384o561J5512o909j3987K7374j8273l5351k1368J9151J6556R136K1463
$$ plain form
16753 -100762 -91959 -60456 -16439 -42547 -75253 -107263 -85275 -87828 -96770 -65925 -51853 -59411
16741 -59411 -53554 -36761 -9520 4557 19054 5216 -18879 -38536 -58601 -58031 -47724 -43568
16729 -43568 -32032 -27055 -46984 -60564 -95266 -97474 -78003 -69333 -45366 -77031 -74943 -36620
16717 -36620 -37667 -11219 7982 5846 2676 -17976 -23477 -28864 -40538 -25346 -6631 4560 18402
16704 18402 46220 95573 148778 209135 284978 352651 362914 338249 289871 244865 170505 74953
16692 74953 39039 50325 31315 3522 8164 -537 5763 -14758 -16913 -6507 23038 31729 10838
16679 10838 -23655 -31914 -18079 -23595 -11354 6173 22138 40847 24747 -13880 -21944 -24384
16667 -24384 -30945 -15433 -22342 -36329 -8955 -27228 -62579 -83947 -64796 -48240 -39104 -17641
16655a7641j9569k8940k0786J5406L63l634N917K2565J2164o319L1834j7287l5084
16642f1011L3181j4864K045m101m100P986K407k139J022j2184j9016j1384L063
16629g9095L585J2676j1764L9802Q389j6706m15L4041J7591j8498q013K8781K1422
16616C1796L1735J2965J7047k5118k9139j3687J7153n831L896L4915M3553K1540
16604A40825N446J5644M492j4372j8216m5626m6291J0055L7376L5083R688L8942
16592A73046L0090L4507k0588o2332j5221j2546r901j0227m8821j5426L582j7346
16580B8817q744K408j2994j6946j2241j8583K4583J7059O76p134q522m539J7345
16567A185L2645l021j4576o787k8427k2067j841j1569K1661L8647J8053j8055
$$ plain form
16655 -17641 -37210 -66150 -86936 -71530 -71167 -74801 -68884 -46319 -34155 -40474 -8640 -25927 -61011
16642 -61011 -27830 -42694 -40649 -44750 -48850 -40864 -38457 -40596 -39574 -51758 -70774 -82158 -79095
16629 -79095 -75510 -62834 -74598 -34796 -26407 -43113 -43528 -9487 8104 -10394 -18407 10374 31796
16616 31796 63531 76496 93543 68425 39286 25599 42752 36921 40817 75732 119285 140825
16604 140825 146271 161915 166407 152035 133819 88193 41902 51957 89333 124416 134104 173046
16592 173046 203136 237643 217055 154723 139502 126956 117055 106828 58007 42581 46163 28817
16580 28817 20073 22481 9487 -7459 -19700 -38283 -13700 3359 4035 -3099 -11621 -16160 1185
16567 1185 33830 30809 16233 9446 -18981 -41048 -42889 -54458 -32797 5850 23903 5848
16555E848n629R16l980K1706K0303l104m0231r086J3984K0332k191M487q500J1169
16541B6024j3838J2395L428O469l038k1734k206j601m210j7704k3809k3911k7143
16528i0878L647Q884J906k3969K386K4944j1255K4457L6488K9490k514j4407O263
16515d558P038j0038k6710j7630j9599K7297J2966P714k8281J6362K7087j7764
16503b6116q793j3106J103P792P018p20P456l600n691J6934J7846N241j970j2037
16489h643J2034J1001P143r582k0563p110n84R51M790J6599p211j5064J194K7048
16475A2003K1193n272o598J4478R615j9504j2540j6318j3236k7402j0221m287
16463e8089L084O059J1383K6962J6862n227n616j205k58j2494k1358J1076o151
$$ plain form
16555 5848 219 1135 -2845 18861 39164 36060 -4171 -13257 727 21059 18868 23355 14855 26024
16541 26024 12186 24581 28009 34478 31440 9706 7500 5899 1689 -16015 -39824 -63735 -90878
16528 -90878 -87231 -78347 -76441 -100410 -98024 -73080 -84335 -59878 -23390 6100 3586 -10821 -4558
16515 -4558 2480 -7558 -34268 -51898 -71497 -44200 -31234 -23520 -51801 -35439 -8352 -26116
16503 -26116 -34909 -48015 -46912 -39120 -32102 -32822 -25366 -28966 -34657 -17723 123 5364 3394 -8643
16489 -8643 3391 14392 21535 11953 -8610 -15720 -16304 -15353 -10563 6036 -1175 -16239 -15045 12003
16475 12003 33196 27924 21326 35804 45419 25915 13375 -2943 -16179 -43581 -53802 -58089
16463 -58089 -55005 -48946 -37563 -10601 6261 1034 -4582 -5787 -6045 -18539 -39897 -28821 -34972
16450c4972l0389l3968j4197K9294M3937K0466J1596k4563j691M481j6982l4611
16438h1599R486J1335j3488N019M5102J0273K2492j2532l9008j3157P63J5360
16426c9954O620Q708J957J552j2306j9388l5017J0263K0122l979k570L228K0735
16413d0029K0877Q501M436J1874j6595j381O210j76j5754m217m802l53l159L961
16399c0607O383K3747J3621k281j1370j6595J1180K3196P879m6703k9061R940
16387d0671K0176j1935K7193j5662P252j8072j1263o586P989k5041l410J3551
16375e6479L7808J0111k2412p469o727J1407J0959n614k075J454J0526M443k7519
16362d1587j1100J4076K0024L117p350m868P613k1798k0640K4625J4673K3039
$$ plain form
16450 -34972 -65361 -99329 -113526 -84232 -40295 -19829 -8233 -32796 -34487 -30006 -46988 -81599
16438 -81599 -72113 -60778 -74266 -69247 -24145 -13872 8620 -3912 -42920 -56077 -55314 -39954
16426 -39954 -33334 -24626 -22669 -21117 -33423 -52811 -87828 -77565 -57443 -61422 -63992 -60764 -40029
16413 -40029 -19152 -10651 -6215 5659 -10936 -12317 -6107 -6283 -22037 -26254 -31056 -31409 -34568 -30607
16399 -30607 -24224 -477 13144 10863 -507 -17102 -5922 17274 25153 -21550 -50611 -40671
16387 -40671 -20495 -32430 -5237 -20899 -13647 -31719 -42982 -49568 -41579 -66620 -70030 -56479
16375 -56479 -18671 -8560 -30972 -38441 -45168 -33761 -22802 -28416 -30491 -29037 -18511 -14068 -41587
16362 -41587 -52687 -38611 -18587 -15470 -22820 -27688 -20075 -41873 -62513 -37888 -23215 -176
16350a76L2006K6873M6065l967l8194m5167l570q931L82l70j1204j6734j1548
16337c4535n038j6370M8049K6184k0674p106M220j6032j6109j6449K8057j488
16325b7291R87J4984p179r438K6705K1427j26k625k2836k9305J242K4053J7362
16312G960k9185j0821l0795m532k860J8870N071R831M506j2409j5419o514n581
16299g1878pJ2778M85K0391L6161J3709M683j353j3054l3826m274K7963P871q209
16285h560j1568J2616L885J3326j3692k9776k0123r440K1163k2260R992K4230
16273c0207L2198k65j7761k3872L258L6562j1724k2642n91J2184j96j2671r80
16260c6707O086j1616J2716O115J0548j5762l968j453L91k6691L76K992m580O263
$$ plain form
16350 -176 31830 58703 104768 100801 62607 17440 13870 4939 5321 4951 -6253 -22987 -34535
16337 -34535 -39573 -55943 -7894 18290 -2384 -9490 -5270 -21302 -37411 -53860 -25803 -27291
16325 -27291 -26304 -11320 -18499 -27937 -1232 20195 20069 17444 -5392 -34697 -33455 -9402 7960
16312 7960 -21225 -32046 -62841 -67373 -70233 -51363 -46292 -36461 -31955 -44364 -59783 -66297 -71878
16299 -71878 -71885 -59107 -58622 -38231 -2070 11639 16322 14969 1915 -31911 -36185 -8222 -351 -8560
16285 -8560 -20128 -7512 -3627 9699 -3993 -33769 -53892 -63332 -42169 -64429 -54437 -30207
16273 -30207 1991 1726 -16035 -39907 -36649 -87 -11811 -34453 -35044 -22860 -23056 -35727 -36707
16260 -36707 -30621 -42237 -29521 -23406 -12858 -28620 -32588 -34041 -33650 -60341 -59965 -56973 -61553 -55290
16246e5290j6622j2110J3417R069p991l064L1676j3044j2871L6314L2638k9290
16234b7168j9646K1491M079k0523m598n087P432J8219L40j741O724K871j363k6361
16220d5331l3035P546M21L253N251J3657j4808l141L3918N631j4625J0467J3243
16207a7553K2373J2620k5383m3610j1825P840L690q57l2371l326N388K3045J2179
16194d7790k750L9716K3209J0149m340j7746m913j641J8163q860k2060K4554K987
16181H678r937r557j163J7783O4736j765J624k9107l1105K2269K0674k654P37
16168E1213p43j5525k5881l2117L992K513n3222j2117J6823j6730J2287R588k6361
16155h6280K7106K6006k997o066j4988Q253P418j4622j2110N702J3719J9540J3255
$$ plain form
16246 -55290 -71912 -84022 -70605 -61536 -69527 -72591 -40915 -53959 -66830 -30516 2122 -27168
16234 -27168 -46814 -25323 -21244 -41767 -46365 -51452 -44020 -25801 -25461 -27202 -20478 -17607 -18970 -45331
16220 -45331 -78366 -70820 -70399 -67146 -61895 -48238 -63046 -66187 -32269 -26638 -41263 -30796 -17553
16207 -17553 4820 17440 -7943 -51553 -63378 -55538 -51848 -52705 -85076 -88402 -83014 -59969 -47790
16194 -47790 -50540 -10824 12385 22534 18194 448 -4465 -6106 12057 3197 -18863 5691 8678
16181 8678 -1259 -10816 -11979 5804 70540 68775 70399 41292 10187 32456 53130 50476 51213
16168 51213 50470 34945 9064 -23053 -19061 -16548 -69770 -81887 -65064 -81794 -69507 -59919 -86280
16155 -86280 -59174 -33168 -36165 -42231 -57219 -48966 -41548 -56170 -68280 -62578 -48859 -29319 -16064
16142a6064N795p118l808J3146j5252j0178j0186L218N789J1531k2381r371M028
16129e0851r206q557j303j5436J2149l112O419J085k876Q908J2580K677k3539
16116g1062R057q387j410M1123K3691k0312o557o551o65r240J3091L941l3244
16103f6525j522k2350L1480r196k2218J5975N0366K0029n2682k4170j3372J4706
16091g9479J9903P025l709J6006L6614n156k3370n999K3568k6160k263K681K8330
16078a2009L2640j6289j5229j2304R215l355k137q385k0179J4937j4939j3626
16066f1660J0289K8578k8040M088P334R890J2484k7571J0516J1970l762M798Q399
16053a2687j9010N937K2430j407k0044L076r191k050P522j1993j1382l417q719
$$ plain form
16142 -16064 -10269 -17387 -21195 -8049 -23301 -33479 -43665 -40447 -34658 -23127 -45508 -54879 -50851
16129 -50851 -60057 -68614 -69917 -85353 -73204 -76316 -69897 -68812 -71688 -62780 -50200 -47523 -71062
16116 -71062 -62005 -70392 -71802 -30679 -6988 -27300 -33857 -40408 -41073 -50313 -37222 -33281 -66525
16103 -66525 -68047 -90397 -58917 -68113 -90331 -74356 -23990 -3961 -56643 -80813 -94185 -79479
16091 -79479 -59576 -52551 -56260 -40254 -3640 -8796 -32166 -38165 -14597 -40757 -43020 -40339 -12009
16078 -12009 20631 4342 -10887 -23191 -13976 -17331 -19468 -27853 -48032 -33095 -48034 -61660
16066 -61660 -51371 -22793 -50833 -46745 -39411 -29521 -17037 -44608 -34092 -22122 -25884 -21086 -12687
16053 -12687 -31697 -25760 -3330 -4737 -24781 -21705 -30896 -32946 -25424 -37417 -48799 -52216 -60935
16040f0935K584K7088p15j9935Q960M0780J727j5658j3472N56j1143k689P345
16027c5507N735J2750j598n305k2056l3240J6748K8235k0525j4996K8895K5507
16015a5357J7609J1818r447k4693J332K6387j3031j5964K6403O073k8091l7644
16003e4605J551j2163m908J2333j486N981J0623Q054P79j4479m27r477k5525J6967
15989f6782L6599J7914l18k0235j4418L0278J5767k8743O584k601J958m3q898
15976c2938k6127o51J6605J808j8612m558K0127L1652K6827m405j2729k1813j3944
15963c8758J5146o09j3407j2607J8228R590J728N620j6412k0820J3450N062j2969
15950d6758J962K0269J5663J7469J7925O620j2982j3694j133L7754K1711j2855
$$ plain form
16040 -60935 -58351 -31263 -31978 -51913 -42953 -2173 -446 -16104 -29576 -29020 -40163 -42852 -35507
16027 -35507 -29772 -17022 -18620 -23925 -45981 -79221 -62473 -34238 -54763 -69759 -40864 -15357
16015 -15357 2252 14070 4623 -20070 -18738 7649 -5382 -21346 5057 11130 -16961 -54605
16003 -54605 -53054 -65217 -70125 -57792 -59278 -53297 -42674 -34620 -33841 -48320 -48747 -58224 -83749 -66782
15989 -66782 -30183 -12269 -12587 -32822 -47240 -16962 -1195 -29938 -23354 -25955 -23997 -24040 -32938
15976 -32938 -59065 -59716 -43111 -41303 -59915 -64473 -44346 -12694 14133 9728 -3001 -24814 -38758
15963 -38758 -23612 -24221 -37628 -50235 -32007 -22417 -20689 -15069 -31481 -52301 -38851 -33789 -46758
15950 -46758 -44796 -24527 -8864 8605 26530 33150 20168 6474 5341 43095 64806 51951
15938E1951J0160k5432j8260K5450K7485j2477n2023l6202J0227L3291J3676j6320
15926A1526k5720k0915N049R980J3064J8189J821r479N9M1168J8182O753k808
15913F6869N109l288j8450k1033l5835P659n012k619j2064r048j2416P725R981
15900b2422Q789r669N949L0848K0361k0870k5498P784J2629q040j0693k6347J1715
15887b5464N47J6920J0475j3433J5061j9127o840J5276k046K3637K9427m902j3412
15874B6119q118k4030J1418l395P883J5793L5547o356k9563l327M143Q718l3252
15861A580j8218J2890O140P80K1162N544j851j9314J057l2899J71J6430j2893
15848a9421J5902J4787L9574K1902l8688p303L0053J5479R12m745J2700o426n566
$$ plain form
15938 51951 62111 36679 18419 43869 71354 58877 6854 -29348 -19121 14170 27846 11526
15926 11526 -14194 -35109 -30060 -20080 -7016 11173 12994 3515 3574 44742 62924 69677 66869
15913 66869 71978 68690 50240 29207 -6628 1031 -3981 -6600 -18664 -27712 -40128 -32403 -22422
15900 -22422 -13633 -23302 -17353 13495 33856 12986 -12512 -4728 7901 -139 -10832 -37179 -25464
15887 -25464 -24917 -7997 2478 -10955 4106 -15021 -21861 -6585 -8631 15006 44433 39531 26119
15874 26119 18001 -6029 5389 1994 9877 25670 61217 54861 25298 21971 26114 34832 1580
15861 1580 -16638 -3748 2392 3172 24334 29878 28027 8713 9770 -23129 -22958 -6528 -19421
15848 -19421 -3519 11268 50842 72744 34056 26753 56806 72285 73197 68452 81152 74726 69160
15835F9160j6341l147L995j2211J1096K5315K5626j2787n653q750k6307r890l6888
15822C218K174j8495P40K8573J3748k0115M63J0359q413O248N747k9684J1075
15809E638J1859j2007j7342J4071q551J4408K0357K626N941J457k400J2623k178
15796D6502M470p67l2195k644J3577l2307k3157k4668J2402K8028K79j8223L101
15783b5602j4248j0566J0331L062J0842M1130K5425r31r500j9077J3800j7241
15771G425k5698K3996L4296K2076k1100k3936n798M38m364N125K1673K6183k4144
15758C6172k3903j6957r315J28Q349L1879J5445l1084m542L853J2130J4165j15
15745C6205Q711R586K15m5594j6025J0453M323j3340L6802L1737k52p494J7963
$$ plain form
15835 69160 52819 49672 53667 41456 52552 77867 103493 90706 85053 76303 49996 40106 3218
15822 3218 5392 -13103 -12363 16210 29958 9843 10306 20665 12252 18500 24247 -5437 5638
15809 5638 17497 5490 -11852 2219 -6332 8076 28433 31059 37000 38457 36057 48680 46502
15796 46502 50972 50205 18010 15366 28943 -3364 -26521 -51189 -38787 -10759 -10480 -28703 -25602
15783 -25602 -39850 -50416 -40085 -37023 -26181 14949 40374 39443 29943 10866 24666 7425
15771 7425 -18273 5723 40019 62095 40995 17059 11261 11699 7335 12460 34133 60316 36172
15758 36172 12269 -4688 -14003 -13875 -5526 26353 41798 10714 6172 10025 22155 36320 36205
15745 36205 44916 54502 54717 9123 -6902 3551 7874 -5466 31336 63073 62821 55327 73290
15732G3290P585q442N018l691Q611K417k1360j586m787J5119L2905k3907k4572
15719E6600j4749j7510j0329l906J1721P52Q052j539M755L7640o077j7503O290
15706E4197l81J921Q592Q590J9677q89j6142M533P587m954l7015j9102O048K2799
15692E5461m04j7735N026N4713L7598j0483j4544q852m362J8686J3875L938j856
15679A31061j7300k4694n490R205R943J4265L21r490l7879N759J0084j0328k6113
15666D9344j7759J3223J6452L2784K2261K6691J7794L3477L4173K7589J0073o322
15654B59780k7088l2084k7766l496l242k9035r495J2820J0508p581L130j4647
15642A31804k0224j8574j5588N5832L2589j8280o516j9750j270L0300J0052r460
$$ plain form
15732 73290 80875 72433 77451 73760 82371 84788 63428 61842 57055 72174 105079 81172 56600
15719 56600 41851 24341 14012 10106 21827 22579 30631 29092 33847 71487 65410 47907 54197
15706 54197 53816 55737 64329 72919 92596 91707 75565 80098 87685 82731 45716 26614 32662 55461
15692 55461 55057 37322 42348 97061 134659 124176 109632 100780 96418 115104 128979 132917 131061
15679 131061 113761 89067 83577 92782 102725 116990 117311 107821 69942 75701 85785 75457 49344
15666 49344 31585 44808 61260 94044 116305 142996 160790 194267 228440 256029 266102 259780
15654 259780 232692 200608 172842 169346 166104 137069 127574 140394 150902 143321 146451 131804
15642 131804 111580 93006 77418 133250 165839 147559 141043 121293 120023 150323 160375 150915
15630A50915K0668J3485L4593L7110N3123K0887J6706k9839m1414k1550l6544
15619B18140l0843n5057k9138J8921J3823l2313o348j8334r485L862L7935K1570
15607A32733j2123j1722j5893k7268l601J5329l325l037m071j1981Q268O420M417
15594G4146J1689K617K6199r356K837O808j406l6110K7413k9815k9753P475K1923
15581G4667N301q523j4864n688m871K6735N079l0908r775K0652p636j5838j4618
15568A9713l1896j1726L0412L5022L189l036Q756R67L979j7120l538r033k0227
15555E462L3652N3536j550m5505J1615J7701J4152L4511k6943k1705J9029J5397
15543A09352K2371j2520j4597L248J5582p517j5081J3777K4477O771n536J0527
$$ plain form
15630 150915 171583 185068 219661 256771 309894 330781 347487 317648 276234 254684 218140
15619 218140 187297 132240 103102 122023 135846 103533 97185 78851 69366 73228 111163 132733
15607 132733 120610 108888 92995 65727 62126 77455 74130 71093 67022 55041 63309 69729 74146
15594 74146 85835 88452 114651 105295 108132 114940 113534 77424 104837 75022 45269 52744 74667
15581 74667 79968 71445 56581 50893 46022 72757 77836 46928 37153 57805 50169 34331 19713
15568 19713 -12183 -23909 6503 41525 44714 41678 50434 51401 55380 38260 34722 25689 5462
15555 5462 39114 92650 91100 45595 57210 74911 89063 123574 96631 74926 93955 109352
15543 109352 131723 119203 104606 107854 123436 115919 100838 114615 139092 145863 140327 150854
15531A50854j4869r087k8254J2240Q577P940j2181P969J7921n162p799J2495j19
15518A40525n451J1356L2123J735k026J809j7520Q718K735J0862J7215k2920j3669
15505A65492k735J3880p478m2369k2596l50j187J5000O114J2619j1314r996j546
15492A13534P329J7094n765k7141k1741J7298n754m524J0237j914J0027J7330
15480A26010l393k8279l6467j2748L0772m330p692L935o351l554o3K1978J925
15467H1743R740J5608l067M395K1501p098O301l365k3258j088j540k1355k3334
15454E5183j3031J5421K3544J5072Q345M991J844q569N349J48j1755J3943k036
15441A08449n74L5983N948j0711N472L2169j0247l5766r346k6998k9376n998L1090
$$ plain form
15531 150854 135985 126898 98644 110884 119461 127401 115220 123189 141110 135948 128149 140644 140525
15518 140525 135074 146430 178553 180288 178262 180071 162551 171269 174004 184866 202081 179161 165492
15505 165492 162757 176637 169159 126790 104194 103844 102657 117657 123771 136390 125076 115080 113534
15492 113534 120863 137957 132192 105051 83310 100608 94854 90330 100567 98653 108680 126010
15480 126010 122617 94338 57871 45123 75895 71565 63873 67808 61457 57903 57840 79818 81743
15467 81743 91483 107091 104024 108419 129920 122822 129123 125758 102500 101412 99872 78517 55183
15454 55183 42152 57573 81117 96189 104534 109525 111369 102800 108149 108297 96542 110485 108449
15441 108449 107875 143858 149806 139095 144567 176736 166489 130723 121377 94379 65003 59005 90095
15428I0095Q186l362q146l5066J2548k992R364L985q820q219K3876J2068Q063
15415A01580j607M912P401J5398J202j404N41L764N589j9105n623J7463j1713
15402A18398j2371k6342j2655L1525K7070K764P643K2148P414J8480K2279k7748
15390A78605l340J8413R454k7472l0354j3740k4263k550j643J4798J3579L3689
15378A65176J5915J168J1425q268m2937m812P696J603J372k7607l5913J0722Q50
15365I6390j2645j2485j1307K799J7009p10J5777K5583l0589j0207o36J7116N51
15352I6646m73k5351q343k436J043Q735K1308R482N339K751J2276L205o988j4622
15338A02572k683K5461j2291q329J3449K7998j0985p119L5878q624j3262j8253
$$ plain form
15428 90095 98281 94919 86773 51707 64255 61263 70627 74612 65792 57573 81449 93517 101580
15415 101580 99973 104885 112286 127684 128886 127482 128023 131787 137376 118271 112648 130111 118398
15402 118398 106027 79685 67030 98555 125625 128389 136032 158180 165594 184074 206353 178605
15390 178605 175265 193678 203132 175660 145306 131566 107303 104753 103110 117908 131487 165176
15378 165176 181091 182259 193684 185416 142479 137667 145363 146966 148338 120731 84818 95540 96390
15365 96390 83745 71260 59953 62752 79761 79051 94828 120411 89822 79615 78979 96095 96646
15352 96646 96173 70822 62479 60043 61086 69821 91129 100611 105950 108701 120977 124182 117194 102572
15338 102572 99889 125350 113059 104730 118179 146177 135192 128073 163951 155327 142065 123812
15326A23812o129N674l617l5891m842J3658J1588O512k0246j7857Q409O137K025
15313H9233k648j2193M540j6732L147L732l309O891L4552K1731m24j3880M505
15300A19145L3794J8346l2608j7892L684K3639K1262j4678j7753J3024N322l630
15288A51655j6045l2148n178N192J5038K2987Q817K3674J6328O406j1906P108
15276A91928K2332o471r084J906J3341J5221j0763o413J8334r879O52j7931K1836
15263B25009M7858J292J3600j5680J2354J8720J897L527j5342J8578k8822k3426
15251B59565R865k0285k2718l812P791p087j1229J2277J4569K3524K7990P835
15239B98285n701k3741j9297K1634O187r405j820R617M165K0139k1752o785J9560
$$ plain form
15326 123812 117683 123357 119740 83849 79007 92665 104253 110765 90519 72662 81071 87208 89233
15313 89233 86585 74392 78932 62200 65347 69079 65770 72661 107213 128944 128520 114640 119145
15300 119145 152939 171285 138677 120785 124469 148108 169370 154692 136939 149963 155285 151655
15288 151655 135610 103462 98284 103476 118514 141501 150318 173992 190320 196726 184820 191928
15276 191928 214260 207789 198705 200611 213952 229173 218410 211997 230331 220452 221104 203173 225009
15263 225009 272867 274159 287759 272079 284433 303153 305050 308577 293235 311813 282991 259565
15251 259565 269430 249145 226427 222615 230406 223319 212090 224367 238936 262460 290450 298285
15239 298285 292584 268843 249546 271180 277367 267962 266142 275759 279924 300063 278311 271526 291086
15226B91086J3639M621j9746l2070l6564n663J4456j4510o494L242P666q895L21
15213B11089J4002L824k5033j3868j0017P2443L7587R253j4683n404m839k4515
15201B49839j0756o94k3593n058K2984j215m916o101K2640m258j5581J2107J3899
15188B49297O930J6205j2738j5727j615j5638L7796P546k3819k379J4630J1560
15176B72048j3317O263o50k843j4396L648J0772j4583j8714j350j6970p41R78
15163B10145Q872r919k1735k3363N380J8455N698r494j8045r758r551J268L249
15150A51202r313J551K835l459L5214L208j10K2947k1368k2507J4975k174O215
15137A79216K574K5050M5K45J0862n798j1415M633m44J3406r314K927r47q2q127
$$ plain form
15226 291086 304725 309346 289600 257530 220966 215303 229759 215249 208755 211997 219663 210768 211089
15213 211089 225091 228915 203882 190014 179997 252440 290027 299280 284597 279193 274354 249839
15201 249839 239083 238389 214796 209738 232722 231507 226591 220490 243130 238872 223291 235398 249297
15188 249297 256227 272432 259694 243967 242352 226714 264510 272056 248237 245858 260488 272048
15176 272048 258731 264994 264344 261501 247105 250753 261525 246942 228228 226878 209908 209167 210145
15163 210145 219017 209098 187363 164000 169380 187835 193533 184039 165994 156236 146685 147953 151202
15150 151202 141889 143440 146275 142816 178030 181238 181128 204075 182707 160200 175175 173001 179216
15137 179216 181790 206840 206885 207130 217992 212194 200779 205412 204968 218374 209060 211987 211040 210958 202831
15122B02831j078j5244l1211j2013K0152K998P747K7324L4459m005m4906k0696
15110A66358L3330J9523j5125L694K8348r713j1895N034K7599j7105k0675J2091
15098B21464J1924m814j5351m894j733q529m1738j042M2391J9737L782M184n405
15085B19976m195j6627k9931l6221j9918K2931K8232J965j9796K182R105j8758
15073A38945o193K9436L6134j5662p151J7456j6483L095k892J3991L341j564J7788
15060B10241K7158J7345j3299k6001m4911P844J2385j8322N741j2406J4475j1169
15048A69081j6837J7424k500J2120O264N948P341q459n706n40J4819J3707j1645
15035B01017M35K2775L0221J8284j8649l17j3978k2877j8860j3530o175j1037
$$ plain form
15122 202831 201753 186509 155298 143285 163437 166435 174182 201506 235965 231960 187054 166358
15110 166358 199688 219211 204086 207780 236128 226415 214520 219554 247153 230048 209373 221464
15098 221464 233388 228574 213223 208329 206596 198067 156329 155287 197678 217415 221197 225381 219976
15085 219976 215781 199154 169223 133002 113084 136015 164247 166212 146416 148598 157703 138945
15073 138945 132752 162188 198322 182660 175509 192965 176482 179577 176685 190676 194017 192453 210241
15060 210241 237399 254744 241445 215444 170533 178377 190762 172440 178181 165775 180250 169081
15048 169081 152244 169668 167168 179288 185552 191500 198841 190382 184676 184136 198955 212662 201017
15035 201017 201452 224227 254448 272732 254083 253766 239788 216911 198051 184521 178346 167309
15023A67309j5527Q157J9762P260j4845N985Q727J2991m429j7770j9305J5894
15011A74209J7702p73K0672o057j8833l7536o299K8984J1097N803m394l1202p315
14998A46058J3902j2255J3426K0487O626K5864J9130j5873n425r860N8J5107j3893
14985B03352k1797j643L4276q498k3183K195K0823J0045j6514p782p186j737r960
14972A72391j8985J3869K8745J7014k645l0254r667R921K1520l859k8058j3348
14960A56644J4584M4824K0174O716K802k3881j2105p24R555K284q846O676N373
14947B24076q180k11r264m2435k4622J8901K1929j0291P658J6894l616k6864k992
14934A60983K1628j4086j7408O245M1042n375K7304J4484k838l6528o941L659
$$ plain form
15023 167309 151782 159939 179701 186961 172116 178101 186828 199819 195390 177620 158315 174209
15011 174209 191911 191138 211810 205753 186920 149384 143085 172069 183166 188969 184575 153373 146058
14998 146058 159960 147705 161131 181618 188244 214108 233238 217365 211940 202080 202138 217245 203352
14985 203352 181555 179912 214188 205690 182507 184702 205525 215570 199056 191274 184088 182351 172391
14972 172391 153406 167275 196020 213034 210389 180135 170468 180389 201909 198050 169992 156644
14960 156644 171228 216052 236226 242942 245744 221863 209758 209034 218589 220873 212027 218703 224076
14947 224076 215896 215685 206421 163986 139364 158265 180194 169903 177561 194455 190839 163975 160983
14934 160983 182611 168525 151117 157362 198404 193029 220333 234817 231979 195451 188510 192169
14922A92169Q343K4429K8677R002m481q325j5844j9904k5688M734J3248p874l1877
14909A66609K6157M2953J4284k8566k0803K898n149Q467K122k5902m1110J3782
14897A55742L9466j8823J1140n342j9981N806K2332N578K4217J74k0176k2871
14885A77262k016K755P75N752k618J7073J9016L105k684p983l2310J997m043R077
14871A85158j6097j9359N24K6519o661p109k40j6770j0991L691L902M946j984
14858A45529M843j2202L2009J179J2604J0769j9226n154j158j803o901j1694P914
14845A56709j0252l489p793q730J1516K4519M518L931J0974J1252j2889l1337
14833A48929n656L796Q040j5154j2591j8883L071k1252Q682K7006n325J058R525
$$ plain form
14922 192169 200512 224941 253618 262620 258139 249814 233970 214066 188378 193112 206360 198486 166609
14909 166609 192766 235719 250003 221437 200634 203532 198383 206850 208972 183070 141960 155742
14897 155742 195208 176385 187525 182183 162202 168008 190340 195918 220135 220309 200133 177262
14885 177262 175246 178001 178776 184528 181910 198983 217999 221104 218420 210437 178127 180124 176081 185158
14871 185158 169061 149702 150226 176745 170084 162975 162735 145965 134974 138665 142567 147513 145529
14858 145529 150372 138170 170179 171358 183962 194731 175505 170351 169193 167390 160489 148795 156709
14845 156709 146457 142968 135175 126445 137961 162480 166998 170929 181903 193155 180266 148929
14833 148929 143273 147069 155109 139955 127364 108481 111552 90300 98982 125988 120663 121721 131246
14820A31246J8957K2504J2089m198J1568L691O464k682k2872k860J6118j6016
14808A74009k148n081k5425o529j5527J3176J4279J0131L7665L2735Q040J4895
14796B50220K5601M4636J09040J42451J79514K11032K16288J02349M122K2009
14786A307262K9966k2589j16570j54381j63457j76925j34158j00705o7130O20
14776D01933m793j5448j8025n5612n0172k1231j9439k106K075P110J3508M676
14764B42476j6707j2071l459n451m266l1562l191P510n433K3434n572n34L721
14751A88895J0970j3149r554k175K164L952k1269j0999J1452q752k5762L226n145
14738A23854K3338K4298L365l354j1272M79j0454l588l54L416M613n509l467J9574
$$ plain form
14820 131246 150203 172707 184796 180598 192166 195857 202321 199639 176767 173907 190025 174009
14808 174009 171861 166780 141355 134826 119299 132475 146754 156885 194550 227285 235325 250220
14796 250220 275821 320457 429497 571948 751462 962494 1178782 1281131 1285253 1307262
14786 1307262 1337228 1314639 1198069 1043688 880231 703306 569148 468443 401313 401933
14776 401933 397140 381692 363667 308055 257883 236652 217213 215107 217182 224292 237800 242476
14764 242476 225769 213698 210239 204788 200522 168960 165769 173279 167846 191280 185708 185174 188895
14751 188895 199865 186716 177162 174987 177151 181103 159834 148835 160287 151535 125773 128999 123854
14738 123854 147192 171490 174855 171501 160229 160708 150254 146666 146312 149728 154341 148832 145365 164939
14724A64939M5775L7175k8982l4534j570o704l746J2493M856J5130N16j2990K2523
14711B14881J1063N220K0745K5760L6977l906l5964j6549K8895j5851k4759j9918
14699B26594k4479p547j0088k4344l0377J2430J5007q228M880O33L129Q960p03
14686A65867P078P543M289K0630k0237k2444J112l586k1687o542J2838O597J6871
14673A68329K7815O798m652k8120j6909j9243j891q757j4480J0508L4294L4139
14661A87831K3999k3336l6300k6363P339L388J1167M404j9435j2324p47j2103
14649A07520K8980J9697J3650R84j4477K5225J6949j7198n861p351p784l1475
14637A28859P709L5847Q253m0455k0332J7924K0206l740k2857N375J3553J2279
$$ plain form
14724 164939 210714 247889 218907 184373 182803 176099 172353 184846 189702 204832 205348 192358 214881
14711 214881 225944 231164 251909 277669 314646 310740 274776 258227 287122 271271 246512 226594
14699 226594 202115 194568 184480 160136 129759 142189 157196 148968 153848 154481 157610 166570 165867
14686 165867 172945 180488 184777 205407 185170 162726 163838 160252 138565 132023 144861 151458 168329
14673 168329 196144 202942 198290 170170 153261 134018 132127 123370 108890 119398 153692 187831
14661 187831 211830 188494 152194 125831 133170 136558 147725 152129 132694 120370 119623 107520
14649 107520 136500 156197 169847 170831 156354 181579 198528 181330 175469 168118 160334 128859
14637 128859 136568 172415 180668 140213 119881 137805 158011 154271 131414 136789 150342 162621
14625A62621n502k2501k8279p921K5277L2868K8106k3819k1786J3350J697k927
14613A51184j8133j7493j4928k2005j3313K3327J1790L0867J5818J0074l0075
14602A27113l8561K2364K6332P990N696J297J7307o854j7743L797Q046O6k3327
14589A33523p361N863Q596r309j2081l4338n310n145j794Q311Q68J6460M6079
14576A44362L0135j9152k5895m358K4194n623l2906J3968L9976J1220J8579L5029
14564B29529K7994L2138K8973j0785J5493J0483j905l151k0951k8160k6336k0668
14552B32654k9636l5847K5225K9186l2705l7818l49J998n630l4025m44Q716L630
14539A24955N347k1058L137k473n622N600K4137k7526l5239j6290j8705j7793
$$ plain form
14625 162621 157119 134618 106339 98418 123695 156563 184669 160850 139064 152414 154111 151184
14613 151184 133051 115558 100630 78625 65312 88639 100429 131296 147114 157188 127113
14602 127113 88552 110916 137248 145238 150934 152231 169538 162684 144941 148738 156784 156850 133523
14589 133523 126162 132025 140621 131312 119231 84893 79583 74438 72644 80955 81823 98283 144362
14576 144362 174497 155345 129450 125092 149286 143663 110757 124725 164701 175921 194500 229529
14564 229529 257523 289661 318634 307849 323342 333825 331920 328769 307818 279658 253322 232654
14552 232654 203018 167171 192396 221582 188877 151059 150710 152708 147078 113053 112609 121325 124955
14539 124955 130302 109244 112381 109908 104286 109886 134023 106497 71258 54968 36263 18470
14527A8470J2915K7986M718P188N859J1524M580l923l0506j4087P597M523r331
14514D7513j0145P398j312K3186J3813j7207O390j0232q973l996J9112j9372J8319
14501F4494J6853J6174k3079R75M392j7818j0614J6389N407K8159J0964j0305
14489A01991l3021K362J0467J7616k203O523L0125j2420j7105K5333r896k8262
14477I1510k3955J1123K5801N612K0088r213l1897Q124J5925l439O062J6792p226
14464A25307m044K901m4802j7543J0940p750M310L1970K082j7346j6424L796J9532
14451I2929j4225k1070l1396M12R165n023Q823J8777R630J0791j8793j7383m019
14438C8618J6717m832L0013K6043q588J719o06p805q253m6328k5847L404k232
$$ plain form
14527 18470 31385 59371 64089 71277 77136 88660 93240 89317 58811 44724 52321 56844 47513
14514 47513 37368 44766 43454 66640 80453 63246 69636 59404 50431 46435 65547 46175 64494
14501 64494 81347 97521 74442 75417 79809 61991 51377 67766 73173 101332 112296 101991
14489 101991 68970 71332 81799 99415 97212 103735 133860 121440 104335 129668 119772 91510
14477 91510 67555 78678 104479 110091 130179 120966 89069 97193 113118 109679 115741 132533 125307
14464 125307 121263 124164 79362 61819 72759 65009 69319 101289 103371 86025 69601 73397 92929
14451 92929 78704 57634 26238 26650 35815 30792 39615 58392 68022 78813 60020 42637 38618
14438 38618 55335 50503 80516 106559 97971 99690 99084 91279 83026 36698 10851 14255 12023
14425A2023K4599R564j1223o698j9728P206L8250J6255j5337J0108R139L676j5373
14412F2461j930J7872J5122M338k8652k7336K1376J9177k2874l620o773j5494
14400C3667Q053K9038j8709j8050K4603J754M266L7223J5674l4395m0303j0560
14388C2261R843J1265L483K5138L833K820n088j5249j4448l601j6881n755M83
14375B8104j0541J3030r407R137n006k320J0322M1851J5632M577k0803J133j687
14362G4022J9853P78l0172j9833l3257k5206K0200L2755p783o005L29p704K991
14349B0968L110J3813m390j110K673l110J6008J4824m061l83j9480K2905J7918
14336G9685k0790l0064J1970j150J1381n415j1754r436R380j0191L692k8830K5637
$$ plain form
14425 12023 36622 46186 34963 28265 8537 15743 53993 70248 54911 65019 74158 77834 62461
14412 62461 60531 78403 93525 97863 69211 41875 63251 82428 59554 55934 49161 33667
14400 33667 41720 70758 52049 33999 58602 60356 64622 101845 117519 83124 42821 32261
14388 32261 42104 53369 56852 81990 85823 88643 83555 68306 53858 50257 33376 27621 28104
14375 28104 17563 30593 21186 30323 25317 22997 33319 75170 90802 95379 74576 75709 74022
14362 74022 93875 94653 64481 44648 11391 -13815 6385 39140 31357 25352 25681 17977 20968
14349 20968 24078 37891 33501 32391 35064 31954 47962 62786 58725 58342 38862 61767 79685
14336 79685 58895 28831 40801 39651 51032 45617 33863 24427 33807 23616 27308 -1522 24115
14323B4115K2505j345p599m0880J207J9120n955J4396L1463P911j1854K964L399
14310E9447L521n845l5582j5651K3017J938P261L6985R626L071j3305K4131M511
14297A03125j5236o668Q305K2480K921R372J8804k298q342k4729K194J6874P141
14284A33943m682j3745k6981k8568J9679L67k9016j7401o09O025J1841J6126j8775
14271D8204k3348q083J3224n099k2468K20r065J003J5283J2386J0110J0093l1256
14258A1204J2010O052k2969J5889K1319J0466l1766M513Q423L5796j3092l2555
14246B5290L313j5505p187p363n234J4099r660j412l803J2241k880J468J6109
14233A9476R877J449J9091J2147J0473k092k3774q834K275j9453k2127j030L0484
$$ plain form
14323 24115 46620 45275 37676 -3204 -1997 17123 11168 25564 57027 64938 53084 56048 59447
14310 59447 62968 57123 21541 5890 28907 30845 38106 75091 84717 87788 74483 98614 103125
14297 103125 87889 81221 89526 112006 114927 124299 143103 140805 132463 107734 109928 126802 133943
14284 133943 129261 115516 88535 59967 79646 80013 50997 33596 32987 39012 50853 66979 48204
14271 48204 24856 16773 29997 24898 2430 2650 -6415 -5412 9871 22257 32367 42460 11204
14258 11204 23214 29266 6297 22186 43505 53971 22205 26718 35141 70937 57845 25290
14246 25290 28603 13098 5911 -1452 -6686 7413 -2247 -3659 -7462 4779 1899 3367 19476
14233 19476 29353 30802 49893 62040 72513 70421 46647 37813 40088 20635 -1492 -2522 27962
14220B7962L8911K1424J0294k130k4252l6048l2326O968L6698Q437L921p57O238
14207F5340K4540j6311l1019P026n674j2179L991J0859P632J4159o165j0267m414
14194D7518k146n533N721k5694J2783Q397O368J4670J5690j3697k1801M493K3039
14181F9808O118j6283j9274R765n801k6399j3599J9615M0549M577j9472O005P508
14168F3117m6498l1443l952J5194L3144K1016L13N405q035j0964n129k6r038j594
14154B1510j7416j4939m894K8391K1767n048q963l0259j0962k4433K1005K8102
14142C861J5796q87K5226K0599j6321J628j0766r203Q137K5102M206k3638l3485
14129A0255J2293L524m779L0145o254m663p754L677j0619J1730K232k7513o892
$$ plain form
14220 27962 66873 88297 98591 96461 72209 36161 3835 10803 47501 55938 59859 59102 65340
14207 65340 89880 73569 42550 49576 43902 31723 35714 46573 54205 68364 62199 51932 47518
14194 47518 45372 39839 45560 19866 32649 41046 47414 62084 77774 64077 42276 46769 69808
14181 69808 75926 59643 40369 50134 44333 17934 4335 23950 64499 69076 49604 55609 63117
14168 63117 16619 -14824 -18776 -3582 29562 50578 50891 56296 48261 37297 32168 32142 23104 21510
14154 21510 4094 -10845 -15739 12652 34419 29371 20408 -9851 -20813 -45246 -24241 3861
14142 3861 19657 18770 43996 64595 48274 49902 39136 29933 38070 63172 67378 43740 10255
14129 10255 22548 26072 21293 51438 45184 40521 32767 36444 25825 37555 39787 12274 5382
14116E382N60O130K0646k7686m5107k9571Q883K6498L0035j8563l991K1865J3534
14103H615j6819O548k5888r234K0360J7476q514J7188k849q645O205R466L7060
14090E0969Q841k5036j9051j6258J7997J8043k585J5665K775j0771m16M2329J8996
14077A01498N921m8365N166q728j1583o91K507Q725j212k2602j9464J5486k364
14064B4294k720J979l299k7826p556L8744J2737l1197k0928J9704K5497p822j1585
14051A0022L151j4379K159R815R398J4542m045j2056l1635j2662K8715K1632O354
14038C1011k4527o121O987Q212P350j4947l586P90K4681P834Q696o389j4515K2546
14024D8022q323k8960j0232M42K481N200o974l319K5675j0510m6469l1090l511
$$ plain form
14116 5382 5942 12072 32718 5032 -40075 -69646 -60763 -34265 -4230 -22793 -26784 -4919 8615
14103 8615 -8204 -1656 -27544 -36778 -16418 1058 -7456 9732 6883 -1762 4443 13909 50969
14090 50969 59810 34774 15723 -535 17462 35505 32920 48585 51360 40589 40173 82502 101498
14077 101498 107419 59054 64220 55492 43909 43218 45725 54450 53238 30636 11172 26658 24294
14064 24294 21574 23553 20254 -7572 -15128 23616 36353 5156 -15772 3932 29429 21607 10022
14051 10022 13173 -1206 953 10768 20166 34708 30663 18607 -13028 -25690 3025 24657 31011
14038 31011 6484 363 7350 15562 22912 7965 4379 5169 29850 37684 46380 39991 25476 48022
14024 48022 39699 10739 507 949 3430 8630 1656 -1663 24012 13502 -32967 -64057 -67568
14011f7568J5105J2122K095J9690K6764J6k543K0037l208k4962n30Q660j180R810
13997A4308k4873j7751l834q458k606p385r088K9103J8026n619K0719J4463k5404
13984h399l8209k953M888k6780P455J465J0708Q473K4672J6532K45o025k7102
13971c5030l882j1137K8425K1100m7190r039L5695O449k362N855K3615K0561j4986
13958A8074j8407L746j2492r428J5540K3044J3579j1987k7287J8872j1635j9061
13946a7442k486q488j3466l766J0333J6220j3823P535K0711k3743j2406L244L2122
13933e455K8852j6195r428m739K2247L1680o332j5962J658k3949j2823k9442M002
13920c5886M392O434J198K7746o767O088K5332q81K281K2371N038k3141l547p427
$$ plain form
14011 -67568 -52463 -40341 -38246 -18556 8208 8224 5681 25718 22510 -2452 -2982 5678 4498 14308
13997 14308 -10565 -28316 -32150 -40608 -43214 -50599 -59687 -30584 -12558 -18177 2542 17005 -8399
13984 -8399 -46608 -49561 -44673 -71453 -63998 -62533 -51825 -43352 -18680 -2148 -1903 -7928 -35030
13971 -35030 -38912 -50049 -21624 -524 -47714 -56753 -21058 -14609 -16971 -11116 12499 33060 18074
13958 18074 -333 3413 -9079 -18507 -2967 20077 33656 21669 -5618 13254 1619 -17442
13946 -17442 -19928 -28416 -41882 -45648 -35315 -19095 -32918 -25383 -4672 -28415 -40821 -37577 -5455
13933 -5455 23397 7202 -2226 -6965 15282 46962 40630 24668 26326 2377 -10446 -39888 -35886
13920 -35886 -31494 -25060 -23862 3884 -2883 3205 28537 27656 29937 52308 57346 34205 30658 23231
13906B3231l109O979k8931k9925j3665L1928K7833l854P769j9580n659Q674j729
13893c8o192K1903K1218j2376j6652q813j984L689L344j2926j653k1565m810L9810
13879B955R614j1401K3064j5358k0817R355L4511j3902o181j1342j620j1478n045
13866a7645L0722R197k4017o673k8480k586J4387R503K927l2215k0705J5013j2501
13853f3073P242M2298J3458k5210k0017j345K025j7263J9015L3377n245p143L3829
13840A1948J74l925R89K0266J1869R235l5757k8216k9921m814J7416J0560k3399
13827d3575r652l081K3119J6221k1863q362M089Q754q035j1708N20J0916M0885
13814a772J5422n337o829j0407r902j2862k097J9687J5997l6158k4020O428K7289
$$ plain form
13906 23231 20122 27101 -1830 -31755 -45420 -13492 14341 10487 18256 -1324 -6983 1691 -38
13893 -38 -6230 15673 36891 24515 7863 -950 -2934 755 4099 -8827 -10480 -32045 -36855 2955
13879 2955 12569 1168 24232 8874 -11943 -2588 31923 18021 11840 498 -1122 -12600 -17645
13866 -17645 13077 22274 -1743 -8416 -36896 -39482 -25095 -15592 -12665 -44880 -65585 -50572 -63073
13853 -63073 -55831 -13533 -75 -25285 -45302 -46647 -44622 -61885 -42870 -9493 -14738 -21881 11948
13840 11948 12122 8197 9186 29452 41321 50556 14799 -13417 -43338 -48152 -30736 -20176 -43575
13827 -43575 -53227 -56308 -33189 -16968 -38831 -47193 -43104 -34350 -42385 -54093 -53573 -42657 -1772
13814 -1772 13650 8313 1484 -8923 -18825 -31687 -33784 -14097 1900 -34258 -58278 -51850 -24561
13801b4561Q754k1247m202M0049m074k8699j4817J2935M738J4824O888K1894p179
13788E303k4471j0786r081L562K3221r559J614n029O014j112M695k0353R662J3402
13774a2918J3640K473J2090j8416j0245O988j0476o716j5120l490J1875J3653
13762a6662Q370j0088P771K6648J2899q569r081r39L042j6050J6658K4669J4559
13749E3227j3287j9424p527J932j7164j8875k9170k3133J4128J4067m901K1370
13737b8757K1438J7796l750j5401J7017J0710K4591l080j7211r969j9080l2712
13725c8408L943j6925N781Q474M692L959J805j6757O592j320J7031j162k3409
13712d5704r55K0477K750j1758K6060J3583k68r086J146J358J8634p547J6885
$$ plain form
13801 -24561 -15807 -37054 -41256 -1207 -5281 -33980 -48797 -35862 -31124 -16300 -9412 12482 5303
13788 5303 -19168 -29954 -39035 -35473 -12252 -21811 -20197 -25226 -19212 -20324 -15629 -35982 -26320 -12918
13774 -12918 722 3195 15285 -3131 -13376 -6388 -16864 -23580 -38700 -42190 -30315 -16662
13762 -16662 -8292 -18380 -10609 16039 28938 20369 11288 10349 13391 -2659 13999 38668 53227
13749 53227 39940 20516 12989 14921 -2243 -21118 -50288 -73421 -59293 -45226 -50127 -28757
13737 -28757 -7319 10477 6727 -8674 8343 19053 43644 40564 23353 13384 -5696 -38408
13725 -38408 -34465 -51390 -45609 -37135 -32443 -28484 -26679 -43436 -36844 -38164 -21133 -22295 -45704
13712 -45704 -46659 -26182 -23432 -35190 -9130 4453 4185 -4901 -3755 -2397 16237 8690 25575
13699B5575k3822l8567j7734P10l1817J825R828L1747K0369L43K2001L084R723
13686A3265M1254j3676L385R825p168j0059J4300p327m715j1417j1844m091p784
13673C948j6183J3497j846J302J5317k3854J650j1616o292Q146M8367J7401k1925
13660B7912k3692k3593j589q779R59k1913J866j006J8003M560j3599Q082J2417
13647b0372K0352p670K86J9135J3754m506o441j8768n807K168o93L0439R877r00
13633C0854l125K432k5768k5015O139J0122j3279l719J2996J0088j8632j0834
13621b7741J1130L3498m779J0908j5048q715N677K6825N204j3863j6913j2092
13609e909O221j8041l522Q912j2469j7526J2623J8780J3322k075K007r892Q192
$$ plain form
13699 25575 1753 -36814 -54548 -53838 -85655 -83830 -74002 -42255 -21886 -21543 458 3542 13265
13686 13265 54519 40843 44228 54053 46885 36826 51126 43799 39084 27667 15823 11732 3948
13673 3948 -12235 1262 -584 718 16035 -7819 -6169 -17785 -24077 -15931 32436 49837 27912
13660 27912 4220 -19373 -20962 -29741 -28782 -50695 -48829 -49835 -31832 -27272 -40871 -32789 -20372
13647 -20372 -20 -7690 -7404 11731 25485 20979 14538 -4230 -10037 -7869 -8562 21877 31754 30854
13633 30854 27729 30161 4393 -20622 -14483 -4361 -17640 -21359 -8363 1725 -16907 -27741
13621 -27741 -16611 16887 12108 23016 7968 -747 4930 31755 36959 23096 6183 -5909
13609 -5909 312 -17729 -21251 -12339 -24808 -42334 -29711 -10931 2391 316 2323 -7569 623
13596F23k6894K3568M8153J3018J289k7749k8726m126j736k847j957L6236J646
13583C0498l519j1394L7211J4638j6062L334P697J6776M22k5362P768n088J0194
13570F7113J9407m254J8637K6244L4398m260o758l0899j6413M941o326M44l2587
13557F9687K368m675j0769J4184K48J8693O18r849l588J4312k7226P684k5366
13544D6321j2582q018q499K5063J2295j6222r823L192J6132j2291l0961L180L3243
13531D1030K5933P279K0367k8949j1886L9700L4791O3009N1673M5971P499m4933
13519B51484m3513l5198l6492m002J2873k776k2008l3007Q075J2428j4637j6003
13507G7224j6662r203O378J126k9077j3925P070J4616K0757J1962j2348j9638
$$ plain form
13596 623 -26271 -2703 45450 58468 59757 32008 3282 -844 -2580 -5427 -7384 28852 30498
13583 30498 26979 15585 52796 67434 51372 54706 62403 79179 79601 54239 62007 56919 67113
13570 67113 86520 82266 100903 127147 161545 157285 150527 119628 103215 108156 101830 102274 69687
13557 69687 72055 67380 56611 70795 71043 89736 90354 80505 76917 91229 64003 71687 46321
13544 46321 33739 25721 17222 42285 54580 38358 28535 31727 47859 35568 4607 7787 41030
13531 41030 66963 74242 94609 65660 53774 93474 128265 191274 242947 288918 296417 251484
13519 251484 207971 172773 136281 132279 145152 142376 120368 87361 95436 107864 93227 77224
13507 77224 60562 51359 57737 58863 29786 15861 22931 37547 58304 70266 57918 38280
13495C8280J8834j5731k194J2641o110j0515N151J0052P814p244J8677j0544j8256
13482D0855p810L0704M3060K1267l394Q364J761j2884l5533k9271j9876j8451
13470A8792J3239K337j5950J5617J972O427O06j7674M355l355j9332j6302K6885
13457A7617J5967L7916L144j8076j8185n565m457j074M057k7346m37J5047m472
13444A4136j8000M991M248K388o624k2193k6214J2460L9637J463m147o824L5450
13431C0771K8635J9371k758j1591m856l84j8244j6209p023j4122l135L1156M417
13418C6028l670J0744J3295p703J4973J4939k6465Q612l0462o23j8936n540M174
13405I366j4500k0378J9145K8741L7597k855j7863p702J7369J4274k8192j8652
$$ plain form
13495 38280 57114 41383 39189 51830 45720 35205 40356 50408 58222 50978 69655 59111 40855
13482 40855 33045 63749 106809 128076 124682 133046 134807 121923 86390 57119 37243 18792
13470 18792 32031 34368 18418 34035 36007 42434 43040 25366 29721 26366 7034 -9268 17617
13457 17617 33584 71500 74644 56568 38383 32818 28361 27287 31344 3998 3561 18608 14136
13444 14136 -3864 1127 5375 7763 1139 -21054 -47268 -34808 4829 6292 2145 -4679 30771
13431 30771 59406 78777 76019 64428 59572 59188 40944 24735 17712 3590 455 31611 36028
13418 36028 32358 43102 56397 48694 63667 78606 52141 60753 30291 29668 10732 5192 9366
13405 9366 -5134 -25512 -6367 22374 59971 57116 39253 31551 48920 63194 35002 16350
13393A6350K0435J6483K056j9427R419j4650l1136L88j0788j382M030J2368J6453
13380B0599k1702n291j061Q473K6991j2900k9970K3105L9187K0695j644j3008
13368E3474J3536j7138j454k283j4918J0124L0229J2899j9003J4652J67r016L3099
13355A04368J1714j4368k6504k2547Q565K051M550n886p506n493j4430k333j0499
13342B1682j2948m167K1986j7526M8816M0364j1237k8541p980m305l150k651J9624
13329E9967K4724j7892j2405l8016j7559K5437L490P531j0915j8264k1587j8096
13317c3585N828M883N799J1071O999j9560n329k2987J9417K2305M342j0652j1930
13304b3399n834N874L3901L3346K8591J4439j7727k8691k0939j6213j5244l5301
$$ plain form
13393 16350 36785 53268 55324 35897 45316 30666 -470 -82 -10870 -12252 -8222 4146 20599
13380 20599 -1103 -6394 -7455 1018 28009 15109 -14861 8244 47431 68126 66482 53474
13368 53474 67010 49872 48418 46135 31217 41341 71570 84469 65466 80118 80285 71269 104368
13355 104368 116082 101714 75210 52663 61228 63279 67829 61943 54437 48944 34514 32181 21682
13342 21682 8734 4567 26553 9027 57843 98207 86970 58429 50449 46144 42994 40343 59967
13329 59967 84691 66799 54394 16378 -1181 24256 27746 35277 24362 6098 -15489 -33585
13317 -33585 -27757 -22874 -17075 -6004 995 -18565 -23894 -46881 -27464 -5159 -817 -11469 -23399
13304 -23399 -29233 -23359 10542 43888 72479 86918 69191 40500 19561 3348 -11896 -47197
13292d7197J4575L6509K501R581J6496j6480J2830K8449j8609j2641J858k6464
13280A408K135J216p160R113j892j5535k2432R423J9446j3685K907K1186o855
13267g25J0924J5766l413j718k6407j7019o66J2647J8434o669j6174j0774N601
13254b0193K0770M092l346N773k697o838J1668j1599M750O791m886j5652J813
13241i554L402o841L4502j4368N752J7960l776k7217j8340l537j4910K0748J6445
13228B66J4119K2724p282j6210l726r179j6176O699l419k2806j2420K1608J3973
13215a1829m988k1804J5059J6067l93J2988N1419K1460j2092j6057O537j1759
13203D4608k5434K1704R115p70j0599O288K565P850l5407j5465P030Q319J1392
$$ plain form
13292 -47197 -32622 3887 6388 15969 32465 15985 28815 57264 38655 26014 27872 1408
13280 1408 3543 4759 -2401 6712 4820 -10715 -33147 -23724 -4278 -17963 -15056 6130 -725
13267 -725 10199 25965 22552 20834 -5573 -22592 -23258 -10611 7823 1154 -15020 -25794 -20193
13254 -20193 577 4669 1323 7096 4399 -2439 9229 -2370 2380 9171 4285 -11367 -9554
13241 -9554 -6152 -12993 21509 7141 12893 30853 27077 -140 -18480 -22017 -36927 -16179 266
13228 266 14385 37109 29827 13617 9891 712 -15464 -8765 -12184 -34990 -47410 -25802 -11829
13215 -11829 -16817 -38621 -23562 -7495 -7888 5100 56519 77979 65887 49830 56367 44608
13203 44608 19174 40878 49993 49223 38624 44912 47477 55327 19920 4455 11485 19804 31196
13190C1196J8695J4450p638j4625j9278j0646J4891l2746J6339J4977J3620J5129
13178E4364q098n68j5776k244J4679k881l3215l700R038j2708N131M4448L447
13165E1917m6646L044J5034J3211K6492J9697M13j3144l8826p358O555L7615J7747
13152H5751j9358m502Q366K6696J7765j4526l7725K234O953j2696j3980R208O86
13139E4872j7817l230o875K6622m212p082N215Q388l4783k4379J7205K2898J3962
13126E0784k7169r252J6159J3455R803j5414J2590L565K0502j9669l4658R778
13114C0474J7517l273J0924n140P167p579j6931J828J5976K9380j2703l261k4506
13101C9873j0297K2272L93j1124j5619J1898J720j7368q382M811M542l635J9455
$$ plain form
13190 31196 49891 64341 56703 42078 22800 12154 27045 -5701 10638 25615 39235 54364
13178 54364 46266 45698 29922 27678 42357 39476 6261 2561 11599 -1109 4022 48470 51917
13165 51917 5271 8315 23349 36560 63052 82749 83162 70018 31192 23834 30389 68004 85751
13152 85751 66393 61891 70257 96953 114718 100192 62467 64701 71654 58958 44978 54186 54872
13139 54872 37055 33825 26950 53572 49360 42278 47493 55881 21098 -3281 13924 36822 50784
13126 50784 23615 14363 30522 43977 53780 38366 50956 54521 75023 55354 20696 30474
13114 30474 47991 44718 55642 50502 57669 50090 33159 34987 50963 80343 67640 64379 39873
13101 39873 29576 51848 52241 41117 25498 37396 39116 21748 13366 18177 22719 19084 38539
13088C8539J0546J6225j843o890J3246K1932k7703l4224J540L415k1924J2123
13076B4982J7280n003J7280j7758j8485J3494J0233j4095K151J6029R464J659
13064E7231m980o316L8475Q886k7244L836j3139J820j5730J6055K2132l4016k2305
13051B4705n283o105k1670K3157K2236K5468J318r023k468J5936o263k0297l669
13038C8042n058P796j8545l1130q045N559j0010k40J7014J6054p149K0573J5J738
13024B6614k5068L479J9521J1469R958j3402j1215L066p31K9994J4716J9167L8655
13011A26223J0393l7499k8541L2154M7600M7544L3744P9043O7710J28581K11282
13000G18234K42956J48578L7284j03011j34072k7243J29637J66707R7825L010
$$ plain form
13088 38539 49085 65310 63467 56577 69823 91755 64052 29828 31368 34783 12859 24982
13076 24982 42262 37259 54539 36781 18296 31790 42023 27928 30079 46108 55572 57231
13064 57231 52251 45935 84410 93296 66052 69888 56749 58569 42839 58894 81026 47010 24705
13051 24705 19422 13317 -8353 14804 37040 62508 63826 54803 52335 68271 62008 41711 38042
13038 38042 32984 40780 22235 -8895 -16940 -11381 -21391 -21631 -4617 11437 4288 24861 24876 26614
13024 26614 1546 5025 24546 36015 45973 32571 21356 24422 23691 53685 68401 87568 126223
13011 126223 136616 99117 70576 102730 150330 197874 231618 310661 378371 506952 718234
13000 718234 961190 1109768 1147052 1044041 909969 882726 1012363 1179070 1276895 1279905
12990A279905j04485o2614R7981J37618N9722n6292j39625j02869N499R9799R2107
12979A306746J4053j12863k42498k31706j33168j07789q0757j2024l1920l1338
12969C36736k0829k7515j9619j7465r233L6214m505J304P234j7505r852o250m147
12956B44568j5562k2660J9094k651k7516j2188j7022j1403k9735L315K256L1082
12944A61578l118l4609j6844l3221J1119J9010J471j6339O55K223j1008p709J8197
12931I1405J0839L9689J7254p876k4370j2397J5090k5395k4585K9603K1940J4297
12919A45494R486J1429P415l0096l542K8844l578k967q64j9825M409J0986J556
12906A58747K5310j8790k3032j3884l66J7238J3396n122n060n534R120k680k9234
$$ plain form
12990 1279905 1175420 1112806 1210787 1348405 1408127 1351835 1212210 1109341 1114840 1214639 1306746
12979 1306746 1320799 1207936 965438 733732 600564 492775 412018 399994 368074 336736
12969 336736 315907 288392 268773 251308 242075 278289 273784 275088 282322 264817 254965 248715 244568
12956 244568 229006 206346 225440 222789 195273 183085 166063 154660 124925 128240 130496 161578
12944 161578 158460 123851 107007 73786 84905 103915 105386 89047 89702 91925 80917 73208 91405
12931 91405 102244 141933 159187 151311 126941 114544 129634 104239 79654 109257 131197 145494
12919 145494 154980 166409 173824 143728 140186 169030 165452 162485 161621 141796 146205 157191 158747
12906 158747 184057 165267 142235 128351 127985 145223 158619 153497 148437 142903 152023 149343 120109
12893A20109j4086K30l170r828M7645K5179l2775k4569j2202K790l222l1438k4270
12880D0393M515m062J1491J5880j6644J2619K1252q059l435K9820N435j5961k2930
12867G0314j761J6982J6626j2456q623k0998J3927P890L407Q016K4179J2295o781
12854A23017J0160N52K124M2171O6892P584M328L2436K0644J1347n077j7858l691
12841B94629r408m718J0963K558K7624k5127J8244J3259k3926j4859K1307k1385
12829B89161K4291K7868k1657o8171m4458J6350J1558J0400J3668r921j6338k3724
12817B09027j9115j6625O173J3378K6525k8676k0853N971j2427J161J0198k9132
12805A45605p681J1255o969k5524k1141J3087J7323q495R590j3764k9940k8245
$$ plain form
12893 120109 106023 106253 103083 93255 140900 166079 133304 108735 96533 99323 96101 64663 40393
12880 40393 44908 40846 52337 68217 51573 64192 85444 77385 73950 103770 109205 93244 70314
12867 70314 68553 85535 102161 89705 81082 60084 74011 81901 85308 93324 117503 129798 123017
12854 123017 133177 133729 135853 178024 244916 252500 256828 289264 309908 321255 316178 298320 294629
12841 294629 285221 280503 291466 294024 321648 296521 314765 328024 304098 289239 310546 289161
12829 289161 313452 341320 319663 251492 207034 223384 234942 245342 259010 249089 232751 209027
12817 209027 189912 173287 179460 192838 219363 190687 169834 175805 163378 164539 174737 145605
12805 145605 137924 149179 142210 116686 95545 108632 125955 117460 127050 113286 83346 55101
12793E5101J8045M252j1980j3007Q99J9654J9138K5o609N316J7370J0600j8966
12780I9838j428m299j8983J7390J5654q145K3444M3053J5158k1286K1521K3838
12768B05755m676k7576K4740L7972K5261k1048m4308L960O935K271q300l8285
12756A62701o584L2860J3030j1312j4745j0023J0523L1096M1504J7483J5768J3558
12744B95859j347j1650k288O312J2151r793j5241p130J0588O663J9578p472j3610
12731B82620j928N7183L7120K7094J1164m942k4039r7205j08065j02816n4837
12720B1349j1944N331j2406m6350m5529q3110n1174M2280l9776m1943j4763m6930
12708c24965l6131N4217O4044J3368l0390o5776m4265K1591O5979O5288P1292
$$ plain form
12793 55101 73146 77398 65418 52411 53310 72964 92102 92127 85518 90834 108204 118804 99838
12780 99838 98410 94111 75128 92518 108172 100027 123471 166524 181682 160396 181917 205755
12768 205755 201079 173503 198243 236215 261476 240428 196120 200080 207015 209286 200986 162701
12756 162701 156117 188977 202007 190695 175950 165927 176450 207546 249050 266533 282301 295859
12744 295859 294512 282862 280574 286886 299037 289244 274003 266873 277461 284124 303702 296230 282620
12731 282620 280692 337875 374995 402089 413253 408311 384272 287067 179002 76186 21349
12720 21349 9405 14736 2330 -44020 -89549 -172659 -223833 -181553 -221329 -263272 -278035 -324965
12708 -324965 -361096 -306879 -242835 -229467 -259857 -325633 -369898 -348307 -282328 -217040 -145748
12697a45748Q1549N6310N4521K9334L7383K8557L7489K1750K133j75k62J5147
12685B17988N4955N7327L2193l347m6035J2024K1529J5223J048K6931M8808O206
12673D44850k3088p478Q560K3492K4501P495M164r56k9966J1190M6537K4837j4533
12660E19605r302P97K8977L1747M7272K4382K4143L9844n244j204N063K5086M6646
12647G77812O6970O7724M1209L6587P6715R2462L8528L8055Q3809Q3366P1646
12636A474883O8518P0144P6057Q8281Q8516N3057N3487Q7170J25039J71730J66060
12625B522942K06957K09314K37562K65368L60578N10676P05519Q73944Q18471
12616F711331O72079M66869L64806N58396R08346J135314J317261J316629J238906
$$ plain form
12697 -145748 -64199 -7889 46632 75966 113349 141906 179395 201145 203278 203103 202841 217988
12685 217988 272943 330270 362463 359116 313081 325105 346634 361857 362905 389836 438644 444850
12673 444850 421762 414284 422844 446336 470837 478332 482496 481540 451574 462764 509301 534138 519605
12660 519605 510303 511100 540077 571824 619096 643478 667621 707465 702221 701017 706080 731166 777812
12647 777812 844782 912506 953715 990302 1067017 1159479 1198007 1236062 1319871 1403237 1474883
12636 1474883 1543401 1613545 1689602 1777883 1866399 1919456 1972943 2060113 2185152 2356882 2522942
12625 2522942 2729899 2939213 3176775 3442143 3802721 4313397 5018916 5892860 6711331
12616 6711331 7383410 7850279 8215085 8773481 9681827 10817141 12134402 13451031 14689937
12607A4689937J458780K020376K611704L447302M439001N802886Q547286J3900226
12599E6917498K4065622L9566945M7930714L5433850J4553544j2524319k7713724
12592A78230130j0531924K0336525L3029612K2711642M155822j8341679k0393839
12585B09196289O723511K4584041J7303404p89845k4986767l1485110p514575
12578A93030948K0599681K4860321R983349j4353587m1470914m7592851l2502023
12571A12554924j9035200j1701715p508020n226541m331647l691168l143252k875088
12563E5042293k670942k544805k680210k669654k396656k137216j838308j487109
12555C6617393j337099j420730j452970j497412j559429j429101j152423r83865
$$ plain form
12607 14689937 16148717 18169093 20780797 24228099 28667100 34469986 43017272 56917498
12599 56917498 80983120 120550065 168480779 203914629 218468173 205943854 178230130
12592 178230130 167698206 188034731 221064343 243775985 247931807 229590128 209196289
12585 209196289 215919800 240503841 257807245 257017400 232030633 200545523 193030948
12578 193030948 213630629 238490950 248474299 234120712 192649798 145056947 112554924
12571 112554924 93519724 81818009 74309989 69083448 64751801 61060633 57917381 55042293
12563 55042293 52371351 49826546 47146336 44476682 42080026 39942810 38104502 36617393
12555 36617393 35280294 33859564 32406594 30909182 29349753 27920652 26768229 25784364
12547B5784364q70466p94579p51484p15336o79732o73488o39717o39934o12062
12538A9407566o01416n37413n07518m65757m47554m26930m30472m17403l93576
12529A5179527l73598l62292m04291m15740l71306m00386l94157l55142l50317
12520A1752298l37779l02100l19471l09323k69582k66034k77417k60428k51291
12511I158873k55173k10362j98559k12038k46044k06918k01724k14822k03714
12502G209519k06691j86100j86719j76147j26634j39567j51561j51055j64510
12493E720535j60673j52042j55096j09587r4515j10921j38660j21245r4109j15496
12483D468191j21421r9368q4555o2564p6308j08881q4696n5231k7399k1280q635
$$ plain form
12547 25784364 24913898 24119319 23367835 22652499 21972767 21299279 20659562 20019628 19407566
12538 19407566 18806150 18268737 17761219 17295462 16847908 16420978 15990506 15573103 15179527
12529 15179527 14805929 14443637 14039346 13623606 13252300 12851914 12457757 12102615 11752298
12520 11752298 11414519 11112419 10792948 10483625 10214043 9948009 9670592 9410164 9158873
12511 9158873 8903700 8693338 8494779 8282741 8036697 7829779 7628055 7413233 7209519
12502 7209519 7002828 6816728 6630009 6453862 6327228 6187661 6036100 5885045 5720535
12493 5720535 5559862 5407820 5252724 5143137 5048622 4937701 4799041 4677796 4583687 4468191
12483 4468191 4346770 4247402 4162847 4100283 4023975 3915094 3830398 3775167 3747768 3726488 3717853
12472C717853K5990L0580K0115R963k3942n5980q4165n9017k5742m5318m6166
12461C464171l8207p2756o5943l5389n9607n1523r7582j37879r8805l2848k4935
12450B748697o3219j20682j13182j64318j77391j34348j37034r7346r1916j06024
12440A543237r1695n9541m4565m9144l2196l0052n8917n3234l0951l6985o4371
12429I91586m6717l3756l5385k6520j8644j3288l7812l1210o022l2335j2331N496
12417G03062j3332Q639k1527k3610L162R455j1339j0180m6749K4486K5218k5384
12405F21901l9314k8027L527N6301M2975k5028l5481J1487K6039P169k398k2900
12393F16251k0517M3526J7302j6507j5490r382j6191K588k8223j9576R66K6975
$$ plain form
12472 3717853 3743843 3774423 3794538 3804501 3780559 3724579 3640414 3581397 3555655 3510337 3464171
12461 3464171 3425964 3353208 3287265 3251876 3192269 3140746 3043164 2905285 2806480 2773632 2748697
12450 2748697 2685478 2564796 2451614 2287296 2109905 1975557 1838523 1741177 1649261 1543237
12440 1543237 1451542 1392001 1347436 1298292 1266096 1236044 1177127 1123893 1092942 1055957 991586
12429 991586 944869 911113 875728 849208 830564 817276 779464 748254 742232 709897 697566 703062
12417 703062 689730 698369 676842 653232 656394 665849 654510 644330 597581 622067 647285 621901
12405 621901 582587 554560 558087 614388 657363 632335 596854 608341 634380 641549 639151 616251
12393 616251 595734 639260 656562 640055 624565 615183 598992 601580 573357 553781 554747 581722
12381E81722M2637k9250k7470j388j5586k4512j9347K61L5473j1952o599J131
12369E25120j8812k0618l8642J950n971k3209J0737j0230M223n492j7278J4521
12357D16299j4866k8973o551n999j5962j1531L355J0957P989J4942J7006K2741
12345D09407j0454M752j8956P215k7201k3718J6029L4563l352m1890j0896N589
12333C41088R737j38M705J5865j5200M586Q661K8564l28k0730o761J6371p877
12320C78543m3339n484R315P277K37l4903n165K3756J967k099J2732l3702k9248
12307B79887l0268k1592K4122J9785m666j6948r4r068r842p757k0492M908j2018
12294A95957j8213K762K4019L886J920O105k3574j8910k7922j3003j387J1255
$$ plain form
12381 581722 624359 595109 567639 566251 550665 526153 506806 507067 542540 530588 523989 525120
12369 525120 506308 485690 447048 448998 443027 419818 430555 420325 424548 419056 401778 416299
12357 416299 401433 372460 365909 359910 343948 332417 335772 346729 354718 369660 386666 409407
12345 409407 398953 403705 384749 391964 364763 341045 357074 391637 388285 346395 335499 341088
12333 341088 350825 350687 355392 371257 356057 360643 369304 397868 397540 376810 370049 386420 378543
12320 378543 335204 329720 339035 346312 346549 311646 306481 330237 332204 330105 342837 309135 279887
12307 279887 249619 228027 252149 271934 267268 250320 250226 241158 231316 223559 203067 207975 195957
12294 195957 177744 180506 204525 208411 210331 216436 192862 173952 146030 133027 131640 142895
12282A42895j0664J0339J775k8308j302j0033j9667N832K348m811J0145J0875
12270A09424j678q473l4909k9862j2771L5489J9702j2617l4380j9458Q451K5184
12258D4102J0865J4904O327Q429L119m9P362N170k2346o336J8910J831n157J0217
12244I7348k1532j7134P422j283M2557J2447k7166P655j4353N479M381p149l391
12231H5281n79K5959n633l4330o956J9675k8022k2906L0611J6574J9058L2038
12219A30770j1959j2609j3656l2929J3357M5150J2421K570L3070L9726N922m7429
12207A64404l667K7190p02j4252L575J246j9477p995K3972P842M4427P447N198
12194B39208M9587M3521M5651R1782J35848K35382K55387J09132j4088q7297q0604
$$ plain form
12282 142895 132231 142570 144345 116037 114735 104702 85035 90867 93215 88404 98549 109424
12270 109424 107746 99273 64364 34502 21731 57220 76922 64305 29925 10467 18918 44102
12258 44102 54967 69871 76198 84627 87746 87697 95059 100229 77883 71547 90457 92288 87131 97348
12244 97348 75816 58682 66104 64821 107378 119825 92659 100314 85961 91440 95821 88672 85281
12231 85281 84702 110661 105028 70698 63742 83417 55395 32489 63100 79674 98732 130770
12219 130770 118811 106202 92546 59617 72974 118124 130545 133115 166185 205911 211833 164404
12207 164404 160737 187927 187225 172973 176548 177794 158317 150322 174294 182136 226563 234010 239208
12194 239208 288795 332316 377967 469749 605597 840979 1096366 1205498 1191410 1104113 1023509
12183A023509L1498J54296J48743O6711j4225j24402n3468P4772J14914P1057
12173A493405q3470j63577q8304L3818J35989J00047j7133j49200k46903k19177
12163G95495j50051j03708m0337k9604o879l6j1588o327k4917m8008l5671r798
12151C28571l5328j5639p673m254j947l1779m439J8737R134j0759j0666K79j0589
12138B23648k4139k7557L5049K9486l2806k7416n193O993O206k2437q734K7951
12126A81051M538l1028l5859k244K6741K3067J9418q419L445K5540j0196j0084
12114A85970q500P30N756k1940l6386L5705L1247R21k5009k3262J8190J9631K1866
12101B04919j0171j8632j9076j0524J950K5004R37K992J0130j853o519q312p016
$$ plain form
12183 1023509 1055007 1209303 1358046 1424757 1410532 1286130 1232662 1307434 1422348 1493405
12173 1493405 1409935 1246358 1158054 1191872 1327861 1427908 1410775 1261575 1014672 795495
12163 795495 645444 541736 501399 471795 464916 464880 453292 446965 422048 374040 338369 328571
12151 328571 293243 277604 269931 265677 263730 231951 227512 246249 255383 244624 233958 234237 223648
12138 223648 199509 171952 207001 236487 203681 176265 171072 178065 184271 161834 153100 181051
12126 181051 185589 154561 118702 116458 143199 166266 185684 177265 180710 206250 196054 185970
12114 185970 177470 178200 183956 162016 125630 161335 192582 193503 168494 145232 163422 183053 204919
12101 204919 194748 176116 157040 146516 148466 173470 174407 177399 187529 185676 179157 170845 163829
12088A63829l636k635j9416k4178q4L01j2436q486K9923L7211k1365k8521M62
12075A10969O31l5551K0723J1357q448r112Q420j005K1681M746K2163J7134j0024
12062A53684k3950O425J9358O520O582j1872k7351J4018J179P257L284k8161k3097
12049A03876K4837J8303j4678j4014l189j1020j3722J1378J4508J6113J7582p707
12037A42267r722k2743k3933N884K0484o165Q073k520m40J0778j1187J3058K3752
12024A47586j1501k7139J3884L0749p237J4723j4047k7496J8580J3371j1466J1041
12012A51048l01n345m798J5187J2225k0568k3184J9051L1978J7520L6348k9559
12000A99602j1828j3940k9334N783p211k8445L5754M8288L2773q037k8884k5282
$$ plain form
12088 163829 160193 157558 138142 113964 113880 114181 101745 93259 123182 160393 139028 110507 110969
12075 110969 111600 76049 96772 108129 99681 90569 98989 97984 119665 124411 146574 163708 153684
12062 153684 129734 136159 155517 162037 168619 156747 129396 143414 144593 151850 155134 126973 103876
12049 103876 128713 147016 132338 118324 115135 104115 90393 101771 116279 132392 149974 142267
12037 142267 132545 109802 85869 91753 112237 106072 114145 111625 111185 121963 110776 123834 147586
12024 147586 136085 108946 122830 153579 146342 161065 147018 119522 138102 151473 140007 151048
12012 151048 150747 145402 140604 155791 168016 147448 124264 143315 175293 192813 229161 199602
12000 199602 187774 173834 144500 150283 143072 114627 150381 198669 231442 223405 194521 169239
11988A69239j7568P806J8398q062Q86N247j1593K2103j9602l4092K169K3143M4699
11975B02773J4776J0112K5747n576k2748m685O272j9743j9471j6472k0463m33
11963A50089J2748L3568K3871J1988o020j2253J8212J5930k5510k1139m6620j1124
11951A43740L4314L4086M405J25k6380j9956j6707M897j795r585j5127J267o245
11938A27039l2903R897q644j7487O229R083K6570J2555J2444j4584n684o468j6511
11925A01536j6304J7272J7160R680n422k9056M318K286K144k761L400j0719J0377
11912A03911L1072J9943k2447k559J5705J8067m941j9687m195k0901R429K3812
11900A47209K4054N948N49m3263j7333N417j533n823j3002j0061L4016l775q583
$$ plain form
11988 169239 151671 159477 177875 169813 170699 175946 164353 186456 166854 132762 134931 158074 202773
11975 202773 217549 227661 253408 247832 225084 220399 226671 206928 187457 170985 150522 150089
11963 150089 162837 196405 220276 232264 226244 213991 232203 248133 222623 201484 154864 143740
11951 143740 178054 212140 216545 216670 190290 170334 153627 158524 156729 147144 132017 133284 127039
11938 127039 94136 104033 95389 77902 84131 93214 119784 132339 144783 130199 124515 118047 101536
11925 101536 85232 102504 119664 129344 123922 94866 99184 101470 103614 100853 104253 93534 103911
11912 103911 134983 154926 132479 129920 145625 163692 158751 139064 134869 113968 123397 147209
11900 147209 171263 177211 177760 134497 117164 122581 121048 115225 102223 92162 126178 122403 113820
11887A13820k576j2733k3691j5067P298p225j6249o600J0667M202N407K4244L7514
11874A19011l31J6646R366k0083K5565K0683R860j1381l7570k4162r725J8199
11862A16078N514J5455j139k2445q30J065K9448J9291K0044J1679J8876j6007
11850A97029l2768k1685j8344m579J8663K5416R599m4940l6960k3653j360N852
11838G2270K955L1224R082k2409l2683K1491M3549n055j0525j019j2344O82J5659
11825A12877j6473j5656P783k8387j2848J9611K726q576O600L8112q338j4558
11813H2873j9244K4130K255n623p383J5120P656K4996k748l4150k2404k4177K305
11800D3606J7128k566o552J2348N367o8J8809j068o265j3138j6312j5811m357
$$ plain form
11887 113820 111244 98511 74820 59753 67051 59826 43577 36977 47644 51846 57253 81497 119011
11874 119011 118680 135326 144692 124609 150174 170857 180717 169336 131766 107604 97879 116078
11862 116078 121592 137047 135908 113463 112633 113698 143146 162437 182481 194160 213036 197029
11850 197029 164261 142576 124232 119653 138316 163732 173331 128391 91431 67778 66418 72270
11838 72270 75225 106449 115531 93122 60439 81930 125479 120424 109899 108880 96536 97218 112877
11825 112877 96404 80748 88531 60144 47296 66907 69633 61057 67657 105769 97431 82873
11813 82873 63629 87759 90014 84391 77008 92128 99784 124780 122032 87882 65478 41301 43606
11800 43606 60734 58168 51616 63964 69331 69263 88072 87004 80739 67601 51289 35478 31121
11787C1121P111j6551n691K9375R346j9869L8759J4995j8739M989Q692J0627K4269
11774A18434J4582K2904J2664o999l5305k3788K4968L7755L7979J1060k6059l0740
11762A57455j9026k0365j2886k2956j4693K6357K0984J2895Q392L7718K412m3751
11750A32536K269j228j3047j2426O903J2285L4882M2390L5261k6742k2380m0913
11738A49790k9957K2397O918q897l2l159k9038j9264R129K1210Q620J2917J6135
11725A56769K4077q165Q62j335j0967J5159J9526N02o902j9859j2923J3021K484
11712A72249j8363k0153j0319r305M540L6042J5834j3504J2017p94j7598J3952
11700A64598k9066L06J9052r907r243k5345M841L3658j0144K7197n175k1784R728
$$ plain form
11787 31121 38232 21681 15990 45365 54711 34842 73601 88596 69857 74846 83538 94165 118434
11774 118434 133016 155920 168584 161585 126280 102492 127460 165215 203194 214254 188195 157455
11762 157455 138429 118064 105178 82222 67529 93886 114870 127765 136157 173875 176287 132536
11750 132536 134805 133577 120530 108104 115007 127292 162174 204564 239825 213083 190703 149790
11738 149790 119833 142230 149148 140251 140219 137060 108022 88758 97887 119097 127717 140634 156769
11725 156769 180846 172681 173543 172208 161241 176400 195926 196428 189526 169667 156744 169765 172249
11712 172249 153886 133733 123414 114109 118649 154691 170525 157021 169038 168244 150646 164598
11700 164598 135532 135838 154890 144983 135740 110395 115236 148894 138750 165947 160772 138988 148716
11687A48716Q338k2556k5807m593K5651j2186n997L6637l158j493O615n15m666
11674A44986l858K1125M506j0460l3182J302L2824j705L5431J531j984l403l3422
11661A53691q75L3067J8953j4143l5151R78k524N329K9709O989j4497J989J0766
11648A94281J3243k1978J7563L3488J1885j2338k5663k3669J617K1687K1665M3004
11636B74785j4069k5792j7053l6176j6885j5242K3695K1573K5041J0396J5354
11625B45627k779k98l2536J0665K1428p847rO559P637P212j5202J1637J4139K377
11611B68610P043K8622J7989k4493k0994Q073k5421j9024q076j5372L136J3983
11599B34076O233P099L1554M0842P088r628J9049K2977J2196n703m0N242m318
$$ plain form
11687 148716 157054 134498 108691 104098 129749 117563 111566 148203 145045 143552 150167 149652 144986
11674 144986 141128 162253 166759 156299 123117 124419 157243 155538 190969 192500 190516 187113 153691
11661 153691 152816 185883 204836 190693 155542 156520 153996 159325 189034 196023 181526 183515 194281
11648 194281 207524 185546 203109 236597 248482 236144 210481 186812 188429 210116 231781 274785
11636 274785 260716 234924 217871 181695 164810 149568 173263 194836 219877 230273 245627
11625 245627 242848 242550 210014 220679 242107 234260 234251 240810 248447 255659 240457 252094 266233 268610
11611 268610 275653 304275 322264 297771 276777 284850 259429 240405 232329 216957 220093 234076
11599 234076 240309 247408 278962 319804 326892 317264 336313 359290 371486 365783 365743 370985 366667
11586C66667k9736l5764J449j2923q922J3734K9145K0866J7722n67J9112J4312
11574C95095m2263l0691J9646K1062m0489j1545j746K6759M3955L3134j7394n430
11562C90093P859L244m540k1483N360k3277k2075J4406j3263n248J8790J9339
11550C69205J311j614L824j1085J5068J9466K2071K3284J8838K939m581L250N7758
11537E19734K5108K2181j3939J3518K230K5286K3994j1910l6314j7851q491j6013
11525E27533j0137K8979N9283R817J630J3775n215m865J5152J9547k709k4909
11513F27881m130N0607J6188r397P353J9810Q948l6238j4467R003o647j4885k5337
11500F28689J2838M1711j1858j0754k0278j1660k4099j038p112J1838K2896K4867
$$ plain form
11586 366667 336931 301167 302616 289693 280771 294505 323650 344516 362238 361671 380783 395095
11574 395095 352832 322141 341787 362849 322360 310815 309069 335828 379783 412917 395523 390093
11562 390093 397952 401196 396656 375173 380533 357256 335181 349587 336324 331076 349866 369205
11550 369205 370516 368902 372726 361641 376709 396175 418246 441530 460368 463307 458726 461976 519734
11537 519734 544842 567023 553084 566602 568832 594118 618112 606202 569888 552037 543546 527533
11525 527533 517396 546375 605658 615475 617105 630880 625665 620800 635952 655499 652790 627881
11513 627881 623751 674358 690546 681149 688502 708312 717260 681022 666555 675558 668911 654026 628689
11500 628689 641527 683238 671380 660626 640348 628688 604589 603551 596439 608277 631173 656040
11488F56040q629k3357k3749j2099l115n691o13J5738J9780q948j4158k8233m3199
11475E19767j1049K5243K0409J8386K6299M790j6808j55K0234L783j9113K6913
11463F18699L9530N54k9169N730Q664J1800j2763l1665m1305N148J4767J5290
11451F05280K6716J6020J7874L3287L0420j9856j786J1023j2274k0175k1192J8907
11439F84244J7415j2099N001K1240L076j0514k3389l5984j4485J3507J2497K1862
11427F82371M5667J3534j4999J4906J1626q330l7919m0610n1686l0916m315K1467
11415F00796p068l585K1321L5064J6041J4288M5966K0235K6059M1102M6647Q2652
11403I39518Q1696N9449L2843L8978j7728l7561k6263n316j759j4216l5341j5108
$$ plain form
11488 656040 647411 624054 600305 588206 585091 579400 578787 594525 614305 605357 591199 562966 519767
11475 519767 508718 533961 554370 572756 599055 603845 587037 586882 607116 610899 591786 618699
11463 618699 658229 658783 629614 635344 644008 655808 643045 611380 570075 575223 589990 605280
11451 605280 631996 648016 665890 699177 729597 709741 707955 718978 706704 686529 665337 684244
11439 684244 701659 689560 694561 715801 718877 708363 684974 648990 634505 648012 660509 682371
11427 682371 728038 741572 726573 741479 753105 744775 706856 666246 614560 583644 579329 600796
11415 600796 593728 590143 611464 646528 662569 676857 722823 743058 769117 810219 856866 939518
11403 939518 1021214 1080663 1113506 1152484 1134756 1097195 1070932 1065616 1063857 1049641 1014300 999192
11391I99192l639K4341J303k6340k9695k3647J9377L737l018J7791j8021M388
11379I65769k1798k4276k2425K4216K2306m073o80k720N92J9148n089m1647k5062
11366H84261j6693k0102p482J3980M4305L0669M1510L5841J4454j4839J1260L6547
11354A053711N1344M4851O695L405k1869o8390n5252l3555m2880l1352l7435k0724
11342H48549m329p2l3846O112J0185n716q507J5547K6849L8782J3070l1413k7125
11329H48086m717J4696M238m611K4445R574m9018j2500j4820K5163R623P863k656
11316H55366J1634M3890M0296M1544J5690L766J8917M5159J8463K4526J7734j9749
11304A117236k6828k7457j4570j644J3693j0250n0304l6322r610j5580j7194k4616
$$ plain form
11391 999192 995553 1019894 1021197 994857 965162 941515 960892 964629 961611 979402 961381 965769
11379 965769 943971 919695 897270 921486 943792 939719 939039 936319 936911 956059 950970 909323 884261
11366 884261 867568 847466 839984 853964 898269 928938 970448 1006289 1020743 1005904 1017164 1053711
11354 1053711 1105055 1149906 1156601 1160006 1138137 1069747 1014495 980940 938060 906708 869273 848549
11342 848549 844220 844148 810302 816414 826599 820883 812376 827923 854772 893554 906624 875211 848086
11329 848086 843369 858065 862303 857692 882137 891711 842693 830193 815373 840536 850159 858022 855366
11316 855366 867000 910890 951186 992730 1008420 1012186 1031103 1076262 1094725 1119251 1136985 1117236
11304 1117236 1090408 1062951 1048381 1046737 1060430 1050180 999876 963554 953944 938364 921170 896554
11292H96554q065l4108k8391j0055J6889J2606j9038K3262K1167O733J3248M6690
11280I37492L5321j8595k1741r309M2184K4422L1161J4384j5129n6519n7567j3298
11268H92806k318L0110j0611m5133q143k1427l6070j1647J504J0748n472j4894
11256G79453K041j692j4863J5002j4223m6937j4756j3897K3468K7854L231n3208
11244F91473k4244j1357O47q698m6217j5999j8356L700K6775J8508J3584j8088
11232F11728k1612j7825k0716K774K087J7429n245K0487n5241k1738R378Q108
11220E29614K7748L9489R650j1032Q276k8786l1075k463o274J2962K8563j1190
11208E65482L99J4973k1352K5897J3226j6770p931K1313K3631k7869M593K2481
$$ plain form
11292 896554 888489 854381 825990 815935 832824 845430 826392 849654 870821 877554 890802 937492
11280 937492 972813 954218 932477 923168 965352 989774 1020935 1035319 1020190 963671 906104 892806
11268 892806 890488 920598 909987 864854 856711 835284 799214 787567 789071 799819 794347 779453
11256 779453 781494 779802 764939 779941 765718 718781 704025 690128 713596 741450 744681 691473
11244 691473 667229 655872 656519 647821 601604 585605 567249 570949 597724 616232 629816 611728
11232 611728 590116 572291 551575 554349 556436 573865 568620 589107 533866 512128 521506 529614
11220 529614 557362 596851 606501 595469 603745 574959 543884 541421 535147 548109 576672 565482
11208 565482 565881 580854 559502 585399 598625 581855 573924 595237 618868 590999 595592 618073
11196F18073k1708j5164q623j8210l7213J0321j3051k6555p129j6280k3095J5355
11184D56721J4161K000k5633R959L4660n661J1887J3752j6270j5547N333q627
11172D76735l272j4499J8993J8960K362L9807K0068l6057k6897R399J7380R679
11160E32658k8959j0774K3956Q29o402j1090q716n56j8479k4067l261K5308l0474
11147D39973j7979N155J6502K5861k4132j0893j5082r408m91k247J4750k097j1207
11134D08705k3370M572J67J854o73J5354O102K4917Q226M769J9060j836O96L8788
11120E07331M7298L9464K9297J9139R079R631j6225j7943j4543r082k0953k6505
11108E55988l9493j8714l801m17j475j2218k8564j6602m922K2690L825j0665p391
$$ plain form
11196 618073 596365 581201 572578 554368 517155 527476 514425 487870 480741 464461 441366 456721
11184 456721 470882 472882 447249 457208 491868 486207 498094 511846 495576 480029 485362 476735
11172 476735 473463 458964 477957 496917 499279 539086 559154 523097 496200 505599 522979 532658
11160 532658 503699 492925 516881 517710 511308 500218 491502 490946 472467 448400 445139 470447 439973
11147 439973 421994 427149 443651 469512 445380 434487 419405 409997 409506 407259 422009 419912 408705
11134 408705 385335 389907 390074 391928 391255 406609 412711 437628 445854 450623 469683 467847 468543 507331
11120 507331 554629 594093 623390 642529 651608 661239 645014 627071 612528 603446 582493 555988
11108 555988 516495 497781 493980 493563 492088 479870 451306 434704 429782 452472 456297 445632 438241
11095D38241m453j607Q636o372Q73J9433J2455j9191p939Q320K5315N696l5321
11082D44086m534J1629J2781J932M320J6499j5621m5257q418j1064K0967l85L523
11069D30458l149K929p020J87j0938j2963l7114J5977L1921Q925j5338r700J2699
11056D06874j1041n503K7153K5875K3513p030Q292J015j4045k092o818m6590l6615
11043C62988k268L170j0523j1162P467K7157J6944q447l0022J3434J3002l924
11031C77816J471j1597P151J1655l7137n379J4513l4105Q61J8402J9373J712k937
11018C61799L203l307j2093l399K4773q042j2379K6339M1922j7716J1906P051
11006D20057j8700j0791O68p329j2573n030J3548L831o548J2082K6314J3100P16
$$ plain form
11095 438241 433788 432181 440817 434445 435318 454751 467206 448015 440076 448396 473711 479407 444086
11082 444086 439552 451181 463962 465894 470214 486713 471092 425835 417417 406353 427320 426935 430458
11069 430458 427309 430238 423218 423405 412467 399504 362390 378367 410288 419213 403875 394175 406874
11056 406874 395833 390330 417483 443358 466871 459841 468133 469148 455103 453011 446193 399603 362988
11043 362988 360720 363890 353367 342205 349672 376829 393773 385326 355304 368738 381740 377816
11031 377816 379287 367690 374841 386496 349359 343980 358493 324388 325249 343651 363024 364736 361799
11018 361799 365002 361695 349602 346203 370976 362934 350555 376894 418816 401100 413006 420057
11006 420057 401357 390566 391234 383905 371332 366302 379850 383681 377133 389215 415529 428629 429345
10993D29345K341K680L363l9324k2523R614n80K609j964j7943K005J6078J037
10980C86738k0786K489n070l973P599K332R669P388L388L812n416K376j5463Q805
10966C83888J2323Q949j4580J0137j5334j8644M1818j7768l8611j8641P223J5594
10954C56354J7920j0142j4663j3407j9908j485Q098M031r025J3839n512k856J8592
10941C41836n421M333K5204k1924l930p870P90k798K384J1296n956o007q307o029
10927C17601M951J2230K933j0939q719j0184K4566P367r96j3595k4456j5117K4121
10914C09763K4825O444j7207K3688N4071m3P485q707J0371M3146J0373K8079R943
10901E02231N658j5300l048l6627m8379j7576J974n128j705K364l91J5337N785
$$ plain form
10993 429345 431686 434366 437729 398405 375882 385496 384916 387525 385561 367618 369623 385701 386738
10980 386738 365952 368441 363371 359398 366997 369329 378998 386386 389774 393586 388170 390546 375083 383888
10966 383888 396211 405160 390580 400717 385383 366739 408557 390789 352178 333537 340760 356354
10954 356354 374274 364132 349469 336062 316154 314669 322767 326798 317773 331612 326100 323244 341836
10941 341836 336415 340748 365952 344028 340098 332228 333018 330220 332604 343900 337944 331937 323630 317601
10927 317601 322552 334782 337715 326776 318057 307873 332439 339806 338810 325215 300759 285642 309763
10914 309763 334588 341032 323825 347513 401584 401541 409026 400319 410690 453836 464209 492288 502231
10901 502231 507889 492589 489541 452914 404535 386959 388933 383805 382100 384464 384073 399410 405195
10888D05195m16m243k222j5947K4906N5080M4521L7577L123N80P423R460l313
10875E61724m7774n2352l3024j0493j9104k1193J9672J2323o363K4247L582j9152
10863D12093j8883o668J6406L6166M833j7152k3619M569l687j2338K5235k2701
10851C94254j2851n641k0936K641P971q951l4059l6612R644K4922K9512L609l851
10838C49652J5382j3674R01K1038j404M552M7897J0146q000K0815L5584K6117
10826E09006M173L822k5389q221r882m3159l6261j4374k4753o572R787J8534j5980
10813C60731J4613n888j118j8349k1210j0033L2524J1448k543l7178J2297j0473
10801C24821P387j4478l7531p142L014K1335r01j9800j6003J0016K1928M0164
$$ plain form
10888 405195 404779 400536 398314 382367 407273 462353 506874 544451 547574 548154 555577 565037 561724
10875 561724 513950 461598 428574 418081 398977 377784 397456 409779 403416 427663 431245 412093
10863 412093 393210 386542 402948 439114 443947 426795 403176 407745 404058 391720 416955 394254
10851 394254 381403 375762 354826 357467 365438 356487 322428 285816 295460 320382 349894 353503 349652
10838 349652 365034 351360 352261 373299 371895 376447 424344 434490 426490 447305 482889 509006
10826 509006 513179 517001 491612 483391 473509 430350 394089 379715 354962 348390 358177 376711 360731
10813 360731 375344 369456 368338 349989 328779 318746 351270 362718 360175 322997 335294 324821
10801 324821 332208 317730 280199 273057 276071 297406 296505 276705 260702 270718 292646 332810
10789C32810K1147j0565j709L602J6196J6635K0731j4709k4266J8295n647j4632
10777C57888N720N243M075J5083L4799k8347k6996o256j9099m215j325j2972o209
10764C17389k9849l6820r687R877K9028o952k0044L506l695Q442J3263p170K2700
10751B89988L1327K513l411k093l3496q411j4233N558Q801L1564L2247r449M043
10738C34948l867J1754M115j5196j3100k2532j7428k7628j2087M582r490P345
10726B41416J6925j2087l0334J432K0148k920m242q952l3917J8448J4186j3692
10714B06411N506P336j8933P949J9860K8928K0766j2815l1935N3N562K5766l429
10701B61025N624k7271k3519K074Q073k3874J6753m93j5158j26Q485k7370k8590
$$ plain form
10789 332810 353957 343392 341683 345285 361481 378116 398847 384138 359872 378167 372520 357888
10777 357888 363608 368851 372926 388009 422808 394461 367465 361209 342110 337895 336570 323598 317389
10764 317389 287540 250720 241033 250910 279938 272986 252942 256448 252753 261195 274458 267288 289988
10751 289988 321315 323828 320417 318324 284828 276417 262184 267742 276543 308107 340354 330905 334948
10738 334948 331081 342835 346950 331754 318654 296122 278694 251066 238979 243561 234071 241416
10726 241416 258341 246254 215920 217352 237500 234580 230338 221386 187469 205917 220103 206411
10714 206411 211917 219253 200320 208269 228129 257057 277823 265008 233073 233126 238688 264454 261025
10701 261025 266649 239378 215859 217933 226006 202132 218885 218392 203234 203108 211593 184223 155633
10688A55633J5667k635K7683J1070j7429L8818l34k2920n734l312K4710p854j9148
10675A94215L3860L5899K1550Q469J379J778J070K9206K2476j6644p979k504n147
10662C17628M455o178j6199k9066p093m0537m3290M131K5367J8196L839K3088
10650B54341K3817q579r770l720J5119l673J4519l038k9009M508L0306J6078O095
10637C06994k5855m3661j8791j028r758Q116N061J6797K5082j6908k6377k107
10625B17565P882n496j7785k054k1741o772k092N945L555L3833J5500j8294P131
10612B17177k0909r54L7409J1822O276j8795l0186j1543l0121o153K0902K763
10600A77688L23j0758k4042j5783M887K854O996K3506K9759j1810L713k336j7785
$$ plain form
10688 155633 171300 168665 196348 207418 189989 228807 228473 205553 199819 196507 221217 213363 194215
10675 194215 228075 263974 285524 293993 295372 297150 298220 327426 349902 333258 325279 322775 317628
10662 317628 322083 315905 299706 270640 263547 223010 179720 183851 209218 227414 231253 254341
10650 254341 278158 269579 259809 256089 271208 267535 282054 279016 250007 254515 284821 300899 306994
10637 306994 281139 237478 218687 217659 207901 216017 221078 237875 262957 246049 219672 217565
10625 217565 225447 219951 202166 200112 178371 171599 169507 175452 179007 212840 228340 210046 217177
10612 217177 196268 195314 232723 244545 250821 232026 201840 190297 160176 154023 174925 177688
10600 177688 178011 167253 143211 127428 132315 135169 142165 165671 195430 183620 187333 184997 167212
10587A67212j8434j9425M8624K4854J1776l2696j0790o500q156K4605k300l583
10575A75187n284K6515N490J0903J608N717q977j7288l093R070l9160k1076O407
10562A46019r82N741K4995J9224k060k1538J1539L1415j6165q982J8841L3089
10550B41136J7379o571j0983k2876l9187l2927l030K469M510j6086j6422q073
10538A09339Q17P497Q757J5771o238L958J3587L1397J2752K1612j3586m1426l374
10525A60863k168l2409P451K7867j1125P353r829R033J5578N033p33L0638M8604
10512B56156M9099Q5845J17568M6729j9665r0188j03384q5273m4757l8530l0139
10501A43461L439J0111R723Q53m197k0913K891j551j7645k669o824m283Q093Q269
$$ plain form
10587 167212 148778 129353 177977 202831 214607 181911 171121 164621 156465 181070 178770 175187
10575 175187 169903 196418 201908 212811 214419 220136 211159 193871 190778 199848 160688 139612 146019
10562 146019 145037 150778 175773 194997 192937 171399 182938 214353 198188 189206 208047 241136
10550 241136 258515 251944 240961 218085 178898 145971 142941 145410 149920 133834 117412 109339
10538 109339 110156 117653 126410 142181 135943 139901 153488 184885 197637 219249 205663 164237 160863
10525 160863 158695 126286 133737 161604 150479 157832 148003 157036 172614 177647 176914 207552 256156
10512 256156 305255 391100 508668 555397 535732 445544 342160 256887 212130 173600 143461
10501 143461 146900 157011 166734 167587 163390 142477 145368 143817 126172 123503 116679 112396 120489 128758
10487A28758K5110N251m6184j5964n210L5325k619k9010J3015P851j3357L20M3502
10474A46788m630j3420J1606p702n8099k1517j07M849J855K4422M632J737J5947
10461A06361l26J3901j053K0523K2604k9138l6400K551k860R047L56J8780K6130
10448A50476r994j6802M783l5134k1399O039M0054R883k3299m6903l1163K7647
10436E4188L2127j74m0730p205J22K437j2270l108O708K591K3136l3016k4313
10423D93J1476n388N594L5442J2497k1534j0462Q801j6426R433J0112J2063j4003
10410C8098j75J958o31J6158R032j3180j0654o009o62p79P307M651l622L2968
10396G4460O767O847r674k2250J455j2904j7415Q890R606N962o732J004j1834
$$ plain form
10487 128758 153868 159119 112935 96971 91761 127086 124467 95457 108472 116323 102966 103286 146788
10474 146788 142158 128738 140344 132642 74543 53026 52919 57768 59623 84045 88677 90414 106361
10461 106361 106035 119936 118883 139406 162010 132872 96472 99023 96163 105210 105566 124346 150476
10448 150476 140482 123680 128463 93329 71930 77969 118023 127906 104607 57704 26541 54188
10436 54188 86315 86141 45411 38206 38328 40765 28495 25387 32095 34686 57822 24806 493
10423 493 11969 6581 12175 47617 60114 38580 28118 36919 20493 29926 40038 52101 38098
10410 38098 37923 39881 39250 55408 64440 51260 40606 34597 33935 33156 40463 45114 41492 74460
10396 74460 81227 88074 78400 56150 57605 44701 27286 36176 45782 51744 45012 46016 34182
10383C4182J3281O669R833o181o531j6971j0767n566j6877J3973J1839p102J0819
10370C0601J3486j5205K189j0094j1444o427J2487P509J3996J049J417o03L432
10357D2393n947K3543K0696J0888q395j9092o30j327l4419m4178j4249K3933R270
10344B486K5806K4135O489N778J6792p248k6074l3652O511J8833K6648J7056R914
10331I3474j537q293m1519l4600j6174K3175N4951O395j0579Q672p82K16J3399
10318H6798l0363l7374r334k92J4915L0086n141j4989j5516r526j5779J1413L4642
10305C9540K5737J9691j6796j5835n990N66J8519k605l7838k0750J6046K6423
10293D6708K1165o056J4222o059J4843O323m736J2440P311k0590k9674k0013K7290
$$ plain form
10383 34182 47463 54132 63965 57784 51253 34282 23515 17949 1072 15045 26884 19782 30601
10370 30601 44087 28882 31071 20977 9533 3106 15593 23102 37098 38147 39564 38961 42393
10357 42393 36446 59989 80685 91573 83178 64086 63456 62129 27710 -16468 -30717 -6784 2486
10344 2486 28292 52427 58916 64694 81486 74238 48164 14512 21023 39856 66504 83560 93474
10331 93474 91937 83644 42125 7525 -8649 14526 69477 75872 65293 73965 73183 73399 86798
10318 86798 56435 19061 9727 9435 24350 54436 49295 34306 18790 9264 -6515 4898 39540
10305 39540 65277 84968 68172 52337 46347 46913 65432 62827 24989 4239 20285 46708
10293 46708 67873 61817 76039 69980 84823 91146 86410 98850 106161 85571 55897 35884 63174
10280F3174Q618l090k0594L558J6200J6092M2616L1245r736l1219m6686j2006
10268E8172J9552K1979J8245K4678q873o387J013J5915j5872k8968j403R141j8815
10255H8377J2776k1352m5624r967L3196l941o04J8318j4091N443K1198J3797L7197
10242A34723k8053j5866J1806j1531j6499J2792J6680n766n05J5562p183n920
10230A00240j1537k8635K977j915O869J8574Q972r206j6265N97n001n269K6926
10217H7327J7899k2092j8960m986L1242J1758p142k3540J2170Q067l647L0835
10205A18931L7543O0228P3629J34010J54769J13978K4757q9844j41937j16035
10195C70029p5231j7383l9120j2926j2929k7172l0904Q646J0815j9552j6804O028
$$ plain form
10280 63174 71792 68702 48108 51666 67866 83958 126574 157819 148083 116864 70178 58172
10268 58172 77724 99703 117948 142626 133753 127366 128379 144294 128422 99454 98051 107192 88377
10255 88377 101153 79801 34177 24210 57406 53465 52861 71179 57088 62531 83729 97526 134723
10242 134723 106670 90804 102610 91079 74580 87372 104052 98286 97781 113343 106160 100240
10230 100240 88703 60068 63045 61130 67999 86573 95545 86339 70074 70671 65670 60401 87327
10217 87327 105226 83134 64174 59188 90430 102188 95046 71506 83676 91743 88096 118931
10205 118931 156474 216702 290331 424341 579110 693088 717845 628001 486064 370029
10195 370029 294798 277415 238295 225369 212440 185268 154364 163010 173825 154273 137469 143497
10183A43497j7719O595N084o267k2262J020K5500j8768K621J0657j3754j9964
10171I6240K6053J2893k3275m1125P995J6567p561m764q655Q28j1102J401p100
10158E8395P906J6960N7254N3214L2540J3716m2458n7201k1453m762j6046l1659
10146F6406p168L689L0042l893l259O277j658K4694M5082j3110N165K8952N9311
10133B40530Q5479J41538J01004L4321p4196j33304j27717o3128k6766l3197j5580
10122A28984p052j894J3757K009K237k4626q29J9305j7080p817k396J3034o713
10109A10919j7023K167r589j8756J1935n083j5682r243j1410L0662P427J335M9349
10096A27008L3463K7236J5649l1694o1075k9761k3252L90Q116J646m24r020l1069
$$ plain form
10183 143497 125778 132373 137457 131190 108928 109948 135448 116680 119301 129958 116204 96240
10171 96240 122293 135186 111911 70786 78781 95348 87787 83023 74368 75196 64094 65495 58395
10158 58395 66301 83261 140515 193729 226269 239985 197527 140326 118873 114111 98065 66406
10146 66406 59238 62927 92969 89076 85817 92094 90436 115130 160212 147102 152267 181219 240530
10133 240530 326009 467547 568551 602872 528676 395372 267655 204527 177761 144564 128984
10122 128984 121932 120038 133795 135804 138041 113415 112586 131891 114811 106994 104598 117632 110919
10109 110919 93896 96063 86474 67718 79653 74570 58888 49645 38235 68897 76324 77659 127008
10096 127008 160471 187707 203356 171662 110587 80826 57574 57964 66080 67726 67302 58282 27213
10083B7213r58K4613K7322o796Q001j6296r766K8335P696k9252J5699k5734k6254
10070B3823k3237j983K9810J3097K4739l156L750j2057k1290L436j9479m297J5849
10057B9005j9155k7008j5410M191K359J5477J7690J1751j5658J1981J3557Q263
10045C7043j0326M933M975k2112n507j652J3805J4127J25J4256j1036p370r125
10032B2136J2780N134k574j5316R36K6483j52k0809j1871J372j1741k686L3684
10019C7376q954N909J1430k4908p902K0077j5274P345L3140J9775J8381R093R829
10006A15317j7956l7145o304k5967o509k602j836Q243q129M996J9015J7522k5357
9993C3288j8181L5754L6380j0125J2241K2167j329j3700l9522J3523l754l3216
$$ plain form
10083 27213 26255 50868 78190 71394 79395 63099 53333 81668 89364 60112 75811 50077 23823
10070 23823 586 -1397 28413 41510 66249 63093 66843 54786 33496 36932 17453 13156 29005
10057 29005 9850 -17158 -32568 -28377 -26018 -10541 7149 18900 3242 15223 28780 37043
10045 37043 26717 31650 36625 14513 9006 7354 21159 35286 35411 49667 38631 31261 22136
10032 22136 34916 40050 37476 22160 23096 49579 49427 28618 16747 18119 6378 3692 37376
10019 37376 28422 34331 45761 20853 12951 33028 17754 25099 58239 78014 96395 105488 115317
10006 115317 97361 60216 53912 27945 21436 18834 16998 25241 17112 22108 41123 58645 33288
9993 33288 15107 50861 87241 77116 89357 111524 110195 96495 56973 70496 66742 33526
9981C3526m60J3693k484k0024j3068Q739J3631J4187J5051L1438J6742k561j3048
9968I5362k4500R931k9505k0888J8875J8053j281j5996k6915J855K4466J3594
9956F3051L4704J2301J0889L9361K4636l5223l4356j2866L6983N3584K4403K0755
9944B38222M90l0774N351Q305P737J6393K0465N084L5794P0663Q2511R0538J24260
9931F75039J86451L10942N19702R23945J638719K009987J392860M52318r86454
9922G123509k072571j739395r83529n43775k99977j63339r7682n4527m6387o7429
9912A054898k2906J4209O235K5105J11276J65253J44797J67366J70083J60541
9902A996857J56241P3832j49907l40177l42092k63704j67194j01579k1076n1216
$$ plain form
9981 33526 33066 46759 44275 24251 11183 19922 33553 47740 62791 94229 110971 108410 95362
9968 95362 70862 80793 51288 30400 49275 67328 66047 50051 23136 24991 49457 63051
9956 63051 97755 110056 120945 160306 184942 149719 115363 102497 139480 193064 217467 238222
9944 238222 238712 207938 213289 221594 229331 245724 266189 271273 307067 377730 460241 550779 675039
9931 675039 861490 1172432 1692134 2616079 4254798 6264785 7657645 8109963 7123509
9922 7123509 5050938 3311543 2328014 1784239 1484262 1320923 1223241 1168714 1122327 1054898
9912 1054898 1031992 1046201 1052436 1077541 1188817 1354070 1498867 1666233 1836316 1996857
9902 1996857 2153098 2226930 2077023 1736846 1394754 1131050 963856 862277 841201 789985
9892G89985j5831K135O501J3575j2447M011O9912O8318Q1809J06979O7283R9651
9880A281881J32507J84354K07920J20774p847j33278k11510k48535k07866j66469
9870I51931r6947n7391k6907N023N2709J04059O8464K6895l7993j09688j21449
9859G58706o9987q5054p2080k0349j5364k3876l8537k22J4303j2754k7768m4472
9847C62546k3613j4932K2418J0998k167r817o040M486j2459k7139p97j4004j6659
9834B72821M910J4518j2127R652j8002k5101q718j689j1562J8310L3799j0366
9822B66445k8078j352J1753M816K105Q988k1112j3008j2455K1451j5398l5358
9810A88797k2474Q125j69J4587j6787O332Q644j7940k1318p832O164J3248K078
$$ plain form
9892 789985 774154 776289 782790 796365 783918 787929 857841 926159 1007968 1114947 1182230 1281881
9880 1281881 1414388 1598742 1806662 1927436 1919589 1786311 1574801 1326266 1118400 951931
9870 951931 854984 797593 770686 775709 828418 932477 1000941 1027836 989843 880155 758706
9859 758706 688719 603665 531585 511236 495872 471996 433459 433237 447540 434786 407018 362546
9847 362546 338933 324001 346419 357417 355250 345433 339393 343879 331420 304281 303484 289480 272821
9834 272821 277731 292249 280122 289774 271772 246671 237953 236264 224702 243012 276811 266445
9822 266445 238367 237015 248768 253584 255689 264677 243565 230557 218102 239553 224155 188797
9810 188797 166323 174448 174279 188866 172079 178411 187055 169115 147797 139965 146129 159377 161455
9797A61455K004K7853O5912K1081M495J2067j6313m9020m6772j4184j6330n123
9785A47125k0812l8778J617k749N021p059M509J1097O316K1094M1884J0674r862
9772A70077L1526L0819R58r469l8470o1329j5486r273m5729K4J8356J4705k6426
9759F0283j4523R261K9328P981j4633J2959L361L1692j3797M436M776J4762L3987
9746A69873K621J2994K8768L3923K8915j6306o1815l0443m0516j9212j0501J1157
9734A09458K1298j3091k9685j9650k5132q97J8552K4719j1180q542J1239k0004
9722E7085k080r098Q536k320L17J8397m28j9948J861J6889J1171k2508l0112m1466
9708a3704M694L4002o386J2353j4978k6650j9637L8696L2273O677O385K468L8750
$$ plain form
9797 161455 163459 191312 257224 278305 282800 294867 278554 229534 182762 168578 152248 147125
9785 147125 126313 87535 89152 86403 91424 84365 88874 99971 106287 127381 169265 179939 170077
9772 170077 201603 232422 233380 223911 185441 124112 108626 99353 53624 53648 72004 86709 60283
9759 60283 45760 55021 84349 92330 77697 90656 94017 125709 111912 116348 121124 135886 169873
9746 169873 172494 185488 214256 248179 277094 260788 198973 168530 128014 108802 98301 109458
9734 109458 130756 117665 87980 68330 43198 42301 60853 85572 74392 65850 77089 57085
9722 57085 55005 45907 54443 52123 52440 70837 70409 50461 52322 69211 80382 57874 27762 -13704
9708 -13704 -9010 24992 18606 30959 15981 -10669 -30306 8390 40663 47340 53725 56193 94943
9695I4943j0262L094j5608k842k7369j5918j6556L705J3436K1294k8k761m962
9682D0166j4665j4026l521l793l508j4420K2629M3182m057j1252p32l65J5523
9669E1161k5566j0648M054k2625K0547L1199L429L5066p397l7099k7044k80J8016
9656C2813K983J4774K0871k658J3914J4763j1025j7944K413j3281N032P491j0927
9643E9219j2014n214J3130J0755J1347j5943k4606J4822n571j6212j377l2680
9631d344j7829K7544K0503k2333q737K8536n254P04J0316l13o468k4724p163O331
9617c231l008K020m673k0225J5907L3964j4958q390J1346K668j5301q658J4727
9604B188k4735M191N8671J4879j662l1662j2508L396M431l577o687r566J8416
$$ plain form
9695 94943 84681 87775 72167 69325 41956 26038 9482 13187 26623 47917 47889 45128 40166
9682 40166 25501 11475 7954 4161 653 -13767 8862 52044 47987 36735 36003 35638 51161
9669 51161 25595 14947 19001 -3624 16923 48122 51551 86617 79220 42121 15077 14797 32813
9656 32813 35796 50570 71441 68783 82697 97460 86435 68491 70904 57623 62655 70146 59219
9643 59219 47205 41991 55121 65876 77223 61280 36674 51496 45925 29713 28336 -4344
9631 -4344 -22173 5371 25874 3541 -5196 23340 18086 18790 29106 28793 22325 -2399 -9562 -3231
9617 -3231 -6239 -4219 -8892 -29117 -13210 20754 5796 -2594 8752 11420 -3881 -12539 2188
9604 2188 -22547 -18356 40315 55194 53532 21870 9362 12758 17189 13612 6925 -2641 15775
9591A5775J3616j1804P24L5213Q100k9062k3672j342K0539L292k1955j307J2012
9578B0129J2264q747m490j0813K6151K9774r037n044l1338j7915K525L5502N064
9565D4025l1107k3720j2333M542P491J9143J9254J2626L1735J6372n2117k8036
9553G875J3904K664m081J2440N693J1015K5116L3382q243l8705j3880k0594l2802
9540f216O935k1303n440J5331Q250J2407k348Q158k6499J3158M1271O078l929
9527D5853r097K349l158M443P30j2890L149L212R243R862j9868M017J9802n337
9513E2310K308P770n351P936l9514k6519r275j5919K9841K6623j3700K120J3016
9500C1646m077j1999J4879R881j1978J7476M0123l457N853q39L9585O8029L8032
$$ plain form
9591 15775 29391 17587 18311 53524 61624 32562 8890 7548 28087 31379 9424 8117 20129
9578 20129 32393 23646 19156 8343 34494 64268 55231 50187 18849 934 3459 38961 44025
9565 44025 12918 -10802 -23135 -18593 -11102 8041 27295 39921 71656 88028 35911 7875
9553 7875 21779 24443 20362 32802 38495 49510 74626 108008 99765 61060 47180 26586 -6216
9540 -6216 719 -20584 -26024 -10693 -2443 9964 7616 15774 -10725 2433 43704 49782 45853
9527 45853 36756 39105 35947 40390 41120 28230 31379 34591 43834 53696 33828 37845 57647 52310
9513 52310 54618 62388 57037 64973 25459 -1060 -10335 -26254 3587 30210 16510 18630 31646
9500 31646 27569 15570 30449 40330 28352 45828 85951 82494 88347 87508 127093 195122 233154
9487B33154l889j9043n5728n9344j8092j41K3362O533k6371k34K6919N611j5998
9474I6739k0350j3196l4514n609m98O616J087K4250J943L777o728J0526R601J0062
9460H3706j8332j2242l938j2383J1764O267K954R888k1118o490N831O294J268
9447E3469k4629J8141j0096k3626Q867j05p586J9243J2155p656j8337n117J3436
9434B8159O366k2994k3234N365K4732K3464r389J841J207k2477J9985K1237J5605
9421F9867J1073j239j1367r314q069r990K484K2125K0104j4257j4062P757L9581
9408A04693j2511J065k900o766K967O612K992k861m470k0068J1882K6755l635
9395A03755j6535J649K180k3634m439J1820K816o370K0903J2773K5330j0015l3990
$$ plain form
9487 233154 229265 210222 154494 95150 77058 76917 100279 106812 80441 80207 107126 112737 96739
9474 96739 76389 63193 28679 23070 22572 29188 30275 54525 56468 60245 53517 64043 73644 83706
9460 83706 65374 53132 49194 36811 48575 54842 57796 67684 46566 40076 45907 52201 53469
9447 53469 28840 46981 36885 13259 22126 22021 14435 33678 45833 38177 19840 14723 28159
9434 28159 34525 11531 -11703 -6338 18394 41858 32469 34310 35517 13040 33025 54262 69867
9421 69867 80940 79701 68334 59020 50951 40961 43445 65570 85674 71417 57355 65112 104693
9408 104693 92182 93247 90347 83581 86548 93160 96152 93291 88821 68753 80635 107390 103755
9395 103755 87220 88869 91049 67415 62976 74796 77612 71242 92145 104918 130248 120233 86243
9382H6243l783R551k6602p293J516N756l0212j9414J3740L6817K2337R448Q432
9369A06536j1021J0735M99J2145L194P771l2403k6479k347N333o102J4312Q729
9356I0902K801m068L4673Q806j3708k0780q37J0392K3401K585j8866P780L5260
9343A58341J6564R294j3524J065n985l0469N369q637J906P751J0230p252l2565
9330A12088M832J7682m349M72P765J8408j2503k2864n970o466J8061J2717L0946
9317A70819K2130J8623p617l5468q943J0072j212m341L8631N948j0343n499O687
9304A99487M876N923R752K7063J5535R7l1166r743R541L0139r857j1504j654J5104
9290B53593J2823M496J0372J3789K3513J6626r917j1129j1280j7456K6753K9002
$$ plain form
9382 86243 82460 92011 65409 58116 59632 65388 35176 15762 29502 66319 88656 98104 106536
9369 106536 95515 106250 106749 118894 122088 129859 97456 70977 68630 73963 67861 82173 90902
9356 90902 93703 89635 124308 133114 119406 98626 97789 108181 131582 134167 115301 123081 158341
9343 158341 174905 184199 170675 171740 165755 135286 140655 132018 133924 141675 151905 144653 112088
9330 112088 116920 134602 130253 130725 138490 156898 144395 121531 115561 109095 127156 139873 170819
9317 170819 192949 211572 203955 168487 159544 169616 168404 164063 202694 208642 198299 192800 199487
9304 199487 204363 210286 220038 247101 262636 262733 231567 221824 231365 261504 251647 240143 238489 253593
9290 253593 266416 270912 281284 295073 318586 335212 325295 314166 302886 285430 312183 341185
9278C41185j0323M304q316P114k631J7205J5941j2088p289J1454J3515K2649J7174
9265D09894J3426J8579L1975k5585J9632K4459Q664k3226n6320J3116L3428M3937
9253E11979K7534K947J25L2361M237j4358k3241O057M7522L605N277l428l073
9240E97544L8872L2248K1870K3033L4494K4102J0131j8009K6280K2951J6901M697
9228H35114L5546K8476L1523L3980P238k1204K6706R213k23K9356K4740J1409
9216A051874J3105L0988O1263M2932R388K4707J6802k329Q21J2538L4419J6076
9204A312584K5576O755K6974M1106J5368K0482M805O181N319J8496R196J8752
9192A511594K1206K276j7605j4053R712J5890K0648J780j8404o461m129R690j747
$$ plain form
9278 341185 330862 335166 326850 333964 331333 348538 364479 352391 345102 356556 370071 392720 409894
9265 409894 423320 441899 473874 448289 467921 492380 501044 477818 421498 434614 468042 511979
9253 511979 539513 542460 542585 574946 579183 564825 541584 547641 595163 598768 604045 600617 597544
9240 597544 636416 668664 690534 713567 748061 772163 782294 764285 790565 813516 830417 835114
9228 835114 870660 899136 930659 964639 971877 950673 977379 986592 986369 1015725 1040465 1051874
9216 1051874 1064979 1095967 1157230 1200162 1209550 1234257 1251059 1248730 1249551 1262089 1296508 1312584
9204 1312584 1338160 1344915 1371889 1412995 1428363 1448845 1453650 1459831 1465150 1483646 1492842 1511594
9192 1511594 1532800 1535076 1517471 1503418 1513130 1529020 1549668 1551448 1533044 1526583 1522454 1532144 1530397
9179A530397j8244k2342j3699k631J3665K0222j6468k4759j3614p50p790k1272
9167A422715j5854N62j1433k7846k9864j987O731k4184l0325j0561j6877j2588
9155A248489j3413l0140n847k4203m3996l1152N851k4455k0058l1750j175p230
9143A020921j3549k5354j0368l820o875l8877r523j8839R55p346l4434k7423j3958
9130H11510j2264k0444m8947l0343j603j2998K234j7710J2373R261L740J7085
9118G11894j6280m5878L865R630q590m9296l4104k2937k1405j9605J6736J7409
9106E41439J4763k9167p633j6148j618k1213K789L26Q981R702j1970j6740p254
9093D66257m021j2394l9909m474p100k1133o074m284m151J5757j5014j2310N189
$$ plain form
9179 1530397 1512153 1489811 1476112 1473481 1487146 1507368 1490900 1466141 1452527 1451777 1443987 1422715
9167 1422715 1406861 1407423 1395990 1368144 1338280 1336293 1343024 1318840 1288515 1277954 1261077 1248489
9155 1248489 1235076 1204936 1199089 1174886 1130890 1099738 1105589 1081134 1061076 1029326 1028151 1020921
9143 1020921 1007372 982018 971650 967830 960955 922078 912555 893716 894671 887325 852891 825468 811510
9130 811510 799246 778802 729855 699512 697909 684911 687145 669435 681808 691069 694809 711894
9118 711894 695614 649736 653601 663231 654641 605345 571241 548304 526899 507294 524030 541439
9106 541439 556202 527035 519402 503254 501636 480423 483212 483538 492519 502221 490251 473511 466257
9093 466257 462236 449842 409933 405459 398359 377226 371152 366868 362717 378474 363460 351150 356339
9080C56339K0742j8195n2793l7921Q924Q351l931m193L1583K8318k1115O218J7198
9067C39525j2891k3859l6566k4125K967Q885L1931Q597j2896j4484l7818N68J9102
9054B48936N61j2961J7815J00J8895J288j4203k8376N452O534q583n124L155l1807
9040B01682K450M7735m0505n2230j8298J5905K2720K5588J9478j4776k3052K910
9028A89607L979j2353k1391K97J3920j7275m246j6168J4976k3571o846M3648J3740
9015A78317j1067r453o147j4981J5512K0343R332k7968l6662j0023K8486l390
9003A32299J115j2898k1393p411K4432l957R669n752j3251r562j7242j9183j085
8990E5781J341J6790O707j8650k2231Q243J4352j0098k0655o267K9715K6992J2750
$$ plain form
9080 356339 377081 358886 306093 268172 277096 285447 281516 277323 308906 337224 316109 322327 339525
9067 339525 326634 302775 266209 242084 245051 253936 285867 294464 281568 267084 229266 229834 248936
9054 248936 249497 236536 254351 254451 273346 274634 260431 232055 237507 244041 235458 230334 233489 201682
9040 201682 204132 251867 211362 159132 140834 156739 179459 205047 224525 209749 186697 189607
9028 189607 193586 181233 159842 160139 174059 156784 152538 136370 151346 127775 120929 164577 178317
9015 178317 167250 157797 151650 136669 152181 172524 181856 153888 117226 107203 135689 132299
9003 132299 133414 120516 99123 91712 116144 112187 121856 116104 102853 93291 76049 56866 55781
8990 55781 57122 73912 80619 61969 39738 47981 62333 52235 31580 25313 55028 82020 94770
8977I4770j6751k4831J3023K498j2493l531J0042j7871R022j4569j2730o26M28
8964B6381J6281M4916K6979n152k195j040j7348l9275l517R231M416o653J4173
8951F7197N088L748K0974J4416O736J360j1453l1520l6196K0217R966O552n673
8938G1412O825J8867J769j5383j9605R369n314o758M2576P818k9851q649k287
8925G0789O579m7260k5920J0168j34L7610M0654k014l5163j5359J1729k4559n141
8912B1979J1873J3507J1928j2830k4892o807l235J2196O397N877j43J2816K9461
8899G8127j0390j050J1k0889P392J2217J78k4850k5918M830j6837M139L1001K2376
8885F0337r367j9949o517r604K7896P949m9407j0934J0208j9132K21J5617L1130
$$ plain form
8977 94770 78019 53188 66211 68709 56216 52685 62727 44856 53878 39309 26579 25953 26381
8964 26381 42662 87578 114557 109405 107210 106170 88822 49547 46030 55261 59677 53024 67197
8951 67197 72285 76033 97007 111423 118159 119519 108066 76546 40350 60567 70533 77085 71412
8938 71412 78237 97104 98873 83490 63885 73254 67940 61182 103758 111576 81725 73076 70789
8925 70789 77368 30108 4188 14356 14222 51832 92486 90472 55309 39950 51679 27120 21979
8912 21979 33852 47359 59287 46457 21565 14758 11523 23719 30116 35993 35850 48666 78127
8899 78127 67737 66687 66698 45809 53201 65418 65596 40746 14828 19658 2821 6960 37961 60337
8885 60337 50970 31021 24504 14900 42796 50745 1338 -9596 612 -18520 -18299 -2682 28448
8872B8448N983k4656m2551k180L0221J7412O827J4454K8339l086m2232j5274Q594
8859A0299O674J2300L2585q446m0649j8804P176L5906K0677j0423m5381j8088
8847a6174O831O771J3057J1052j0464M254j1068K8242r62k6552m236J4149J7442
8834C2342j5195J2559P717K288j2001N327p85J1470l0618j1015k970M350K3622
8821B7091j1330N547O299k2040J5892N959J5867j024j428j1560k0596J0824J4095
8808C3596L795O850K149k7817l6967j2376J6313K6595K7575K574l0531l4225J2868
8795i601N505j2956P293n661J011k192p543N109O205J0943K1090K724j1939j2545
8781b557P981L522j4280R393J8068m6477k6652J840K4033K7268j0844M107J4579
$$ plain form
8872 28448 34431 9775 -32776 -34956 -4735 12677 19504 33958 62297 59211 16979 1705 10299
8859 10299 16973 29273 61858 53412 12763 -6041 1135 37041 57718 47295 1914 -16174
8847 -16174 -9343 -2572 10485 21537 11073 15327 4259 32501 31539 4987 751 14900 32342
8834 32342 17147 29706 37423 39711 27710 33037 32252 43722 13104 2089 -881 3469 27091
8821 27091 15761 21308 27607 5567 21459 27418 43285 42261 40833 29273 8677 19501 33596
8808 33596 37391 44241 46390 18573 -18394 -30770 -14457 12138 39713 42287 11756 -22469 -9601
8795 -9601 -4096 -17052 -9759 -15420 -14409 -16601 -24144 -19035 -12830 -1887 19203 21927 9988 -2557
8781 -2557 5424 8946 -5334 4059 22127 -24350 -51002 -49162 -25129 2139 -8705 -4598 9981
8768I981J2577K891M734j5658p489m911J8940K9520j9038j8693l787k8828M187
8755a5574K692k390J9341K108K479P073n378J1272P26J5971k9652j1304J752L782
8741B898k6628K138k122P278O206L026J4831J7204N429j7877j1748L094r180l6063
8727d1514K8527J0967N146J5455p109k7066N487K3385j0756J2076L35j2575R138
8714A1496K8538Q388O584K4755j019J8013q293M109J797P725J7516J1217j6308
8701A14518P925Q899J993r469L5750L4613M7661P7317P7208P3586M3709n9447
8689D54263j07653j01196n6235l1612l0909l0935m79j2176k0287K2800J2233K306
8677A00120n928j5296j5052J3289p179N510j194q429l613Q128K9491K3910p269
$$ plain form
8768 9981 22558 25449 30183 14525 7036 2125 21065 50585 31547 12854 9067 -19761 -15574
8755 -15574 -12882 -15272 4069 6177 8656 15729 10351 21623 22349 38320 8668 -2636 -884 2898
8741 2898 -23730 -21592 -23714 -16436 -10230 -7204 7627 24831 30260 12383 635 3729 -5451 -41514
8727 -41514 -12987 -2020 3126 18581 11472 -15594 -10107 13278 2522 14598 14933 2358 11496
8714 11496 40034 48422 55006 79761 78742 96755 88462 92571 94368 102093 119609 130826 114518
8701 114518 122443 131342 133335 123866 159616 194229 241890 319207 396415 470001 513710 454263
8689 454263 346610 245414 189179 157567 126658 95723 95244 83068 62781 85581 97814 100120
8677 100120 94192 78896 63844 77133 69954 75464 74270 65841 62228 70356 99847 123757 116488
8664A16488l8453l345N639j6946J1519l302n576L204K3585K5696j0434Q41k608
8651A06308j3138K266J7973K380k3793O490J0910n248m010j1600L846k0818J887
8638G3453K4069K7805N1683O681l3346j524k613j1869J2447L1087J3297L2606
8626B23776j104r600L5135J0793J6031L1826K2328K1168N660l5243P566l187k0070
8613C05079l4579m4396k413L7017k4424j1859j0569n496k0809J8634k1679l7606
8601A46900l3669r223K834n960p697Q875N436j828K2273M191k3794l297j0205
8588I4836J8318J0827m177j605n670J076l8448l0080l9039r566J2967J1352L145
8575B3936L403r25j0068M1838K4177K9467p483l0843m3055j1550J4927L7315J661
$$ plain form
8664 116488 78035 74690 80329 63383 74902 71600 66024 69228 92813 118509 108075 108916 106308
8651 106308 93170 95436 113409 115789 91996 98486 109396 104148 100138 88538 92384 71566 73453
8638 73453 97522 125327 177010 183691 150345 148821 146208 134339 146786 177873 191170 223776
8626 223776 222672 213072 248207 259000 275031 306857 329185 350353 356013 320770 328336 325149 305079
8613 305079 270500 226104 223691 260708 236284 224425 213856 208360 187551 206185 184506 146900
8601 146900 113231 104008 106842 100882 93185 102060 107496 105668 127941 132132 108338 105041 94836
8588 94836 113154 123981 119804 118199 112529 113605 75157 45077 6038 -3528 9439 20791 23936
8575 23936 27339 26414 16346 58184 82361 111828 104345 73502 30447 18897 33824 71139 72800
8562G2800m4866r923j8986k0544N926J4511J6993k977j2622m41r34M651k8851
8549b5263j237L8275L1183p165k5592j3584K180K529N73j8267Q003L9520J2015
8536D3170K7329L444l2218l7529l651M665J5995l936j9241j0138O370J5400K1732
8523C1392P09k869j1707n745K5627K0511l576n230L722J0815k025j4585J2628
8510E9667j5710p91k186L438j3757j5341M812O542L540l0666k854J367j1370p942
8496b1251L1567k260l5628j5265K8595K2358P351r58k2469n649N413K0157J1024
8483B2985l2122k0240l445J137J0632l225J5670P440j6614N253L727j0599K8575
8470I174J5420J4914k0800k3212j512Q864J6650K914k4416j2932J4010P476j9606
$$ plain form
8562 72800 27934 18011 -975 -21519 -15593 -1082 15911 12934 312 -129 -1063 3588 -25263
8549 -25263 -26500 11775 42958 35793 10201 -3383 -1203 1326 1899 -16368 -8365 31155 43170
8536 43170 70499 73943 41725 4196 545 5210 21205 17269 -1972 -12110 -5740 9660 31392
8523 31392 32101 29232 17525 11780 37407 57918 54342 49112 52834 63649 61624 47039 59667
8510 59667 43957 43166 40980 44418 30661 15320 20132 26674 30214 -452 -3306 -1939 -13309 -21251
8496 -21251 10316 8056 -27572 -42837 -14242 8116 15467 14509 -7960 -13609 -8196 11961 22985
8483 22985 -9137 -29377 -32822 -31685 -21053 -24278 -8608 -1168 -17782 -12529 -8802 -19401 9174
8470 9174 24594 39508 18708 -4504 -6016 2848 19498 22412 -2004 -14936 -926 6550 -13056
8457a3056J7669J922j1876J312K3331j7366J3740K6632j1552l3022m0219K1901
8445b0584L2279J3740N379q34l0393O29L420J0608n167M74l2943k7524K0270k18
8431c0864J4521P239K6134J830k0575n669L1758k2229k5328N629j1053j238k1090
8418e0935j7376J0466K2271k600K7868J7327J870M22j229m847K3107J3964k4067
8405A6241l4894j2802j5654J7027K0844m166r644J7988J0810K0695K1246j9518
8393B8173k9682j3746n080K2037j3869k0831j4950P337l209k0290q007O635J7792
8380d7690K4956N5361o220l18m416k9928L6903Q194K193K862m418J126L2945k0613
8366E0937j9398R625q482j3363J6474k5336l3756o00R260L27P874J1951o229P027
$$ plain form
8457 -13056 4613 6535 -5341 -4029 19302 1936 15676 42308 30756 -2266 -42485 -20584
8445 -20584 11695 25435 30814 29980 -413 216 3636 14244 9077 9551 -23392 -50916 -30646 -30864
8431 -30864 -16343 -9104 17030 18860 -1715 -7384 24374 2145 -23183 -17554 -28607 -29845 -50935
8418 -50935 -68311 -57845 -35574 -38174 -10306 7021 8891 9313 8084 3237 26344 40308 16241
8405 16241 -18653 -31455 -47109 -30082 -9238 -13404 -23048 -5060 5750 26445 47691 28173
8393 28173 -1509 -15255 -20335 1702 -12167 -32998 -47948 -40611 -43820 -64110 -72117 -65482 -47690
8380 -47690 -22734 32627 26407 26089 21673 -8255 28648 36842 39035 41897 37479 38605 71550 50937
8366 50937 31539 41164 32682 19319 35793 10457 -23299 -23899 -14639 -14312 -6438 5513 -716 6311
8352F311J8953m416j3106l4886l853K4289K2579M2403l350k9999m671J3061L421
8339C6736k1898l9523j4373M177K4087J6705J1935Q531p81o127J3261O932J0474
8326E0136N561L966l855n557q181k9622P707K3320R61k8195k2205N612q554M991
8312c915Q839K661M14J80N37k3792j9796J297J4195M166J0665m382j5486K3279
8298a138j7867J8454K9465l5j7476r069j0144k9317l4130j1736L7519J6052K3134
8285f288J2453j1679j0157K6220K6181K71l7030j0972P909o955R611j212j2666
8272a4314J5143M2467K5787k0803R32M1902k3087j4751N210j2877k4286J6123
8260C7446r446j5933l120N45o328k5295N211K7235M0820N776l0898j5358l729
$$ plain form
8352 6311 25264 20848 7742 -27144 -30997 -6708 15871 58274 54924 24925 20254 33315 36736
8339 36736 14838 -24685 -39058 -34881 -10794 5911 17846 26377 25596 19469 32730 39662 50136
8326 50136 55697 59663 55808 50251 42070 12448 20155 43475 44436 16241 -5964 -352 -8906 -3915
8312 -3915 4924 7585 7999 8179 8716 -15076 -34872 -33575 -19380 -15214 -4549 -8931 -24417 -1138
8298 -1138 -19005 -551 28914 28879 11403 2334 -7810 -37127 -71257 -82993 -45474 -29422 -6288
8285 -6288 6165 -5514 -15671 10549 36730 37001 -29 -11001 -3092 -10047 -436 -1648 -14314
8272 -14314 829 43296 69083 48280 49212 91114 68027 53276 58486 45609 21323 37446
8260 37446 28000 12067 8947 9492 3164 -22131 -16920 10315 51135 56911 26013 10655 6926
8247F926K2143J5464j0916k3207j2972K6860J7128j1443l5400o329J3892p119
8235d973L0674J07l235L824K7766j9114j5566q10j016k2122j2661O312L9797r018
8221A9965p838J9516j892o413L1641j0161l3442j5029l6786j8765K3293N0914
8209A5003K4406j3971k3292R659j6425j3932L1363p864k2293k290N963k944j6502
8196c3119j5212m86j8774J5629J5596M100K2279r35J5712k4219l660J4746j4812
8183b3155O556L4719J7763k9702k8994o73L945M641j502L610N476j1647j7249
8170c6212K5599R756J9422R469l087q681j7512K2264J0268L443j9083p850r654
8157a858j4290J2497n793j2806J9609M2149L276j3014k6575J9381J2093p891m375
$$ plain form
8247 6926 29069 44533 33617 10410 -2562 24298 41426 29983 -5417 -11746 2146 -4973
8235 -4973 25701 25808 22573 26397 54163 35049 19483 18673 17657 -4465 -17126 -10814 28983 19965
8221 19965 12127 31643 29751 23338 54979 44818 11376 -3653 -40439 -59204 -35911 15003
8209 15003 39409 25438 2146 11805 -4620 -18552 12811 4947 -17346 -19636 -13673 -16617 -33119
8196 -33119 -48331 -48817 -67591 -51962 -36366 -32266 -9987 -10922 4790 -19429 -23089 -8343 -23155
8183 -23155 -16599 18120 35883 6181 -22813 -23486 -19541 -14900 -16402 -12792 -7316 -18963 -36212
8170 -36212 -10613 -857 18565 28034 24947 16266 -1246 21018 31286 34729 15646 7796 -1858
8157 -1858 -16148 -3651 -9444 -22250 -2641 39508 42784 29770 3195 22576 34669 26778 22403
8144B2403j4431p787j8351l4943P936L0314K9890J0497m863q485J761J5989K2068
8131E1998P263J9472K943l2955r842O438K237k6961k0440r967K314J6034n40m150
8117C844O850j5158j8461J1868K867j6083J1909L5874J8015k3805j2734R520j4357
8104A49m420J0210o376J779j0141j9488j0594M888J4265J730m360J9466L2872
8091B9980N696k2013k5080J3813J0223J5064k0531j8539K6532l862o443j231J8162
8078B1771k255J8355j2229o951J2831J3626L304L657q880j0277P946j1825p027
8065B2046p278j6255K5001n61r76K1949m372J1J7856K3881j3117j5819l3266j5295
8051C805K1977J1220K2746K6765J6545l8670m2130j2971K9444l5929r031N960
$$ plain form
8144 22403 7972 185 -18166 -53109 -45173 -14859 15031 25528 20665 12180 13941 29930 51998
8131 51998 59261 78733 81676 48721 38879 45317 47554 20593 153 -9814 -7500 8534 7994 3844
8117 3844 10694 -4464 -22925 -11057 -8190 -24273 -12364 23510 41525 17720 4986 14506 149
8104 149 -4271 5939 -437 1342 -8799 -28287 -38881 -33993 -19728 -17998 -22358 -2892 29980
8091 29980 35676 13663 -11417 2396 12619 27683 7152 -11387 15145 11283 4840 3609 21771
8078 21771 19516 37871 25642 18691 31522 45148 48452 52109 43229 32952 40898 29073 22046
8065 22046 14768 -1487 23514 22953 21977 43926 39554 39565 57421 81302 68185 52366 19100 3805
8051 3805 25782 37002 59748 86513 103058 64388 22258 9287 38731 2802 -6229 -269
8039b69K2140J6788J3495J5750R184P422k8787j968o885M086q164J9385K9980
8026I2157P654o88q872J9168J4813k9128j2377q847m1542j0164P820L0198j682
8013E8510j4523j3819J016m986J865K9878j3200k109O930L6j3574J4050P497K6738
7999H4309J7748j8226J1708J1059M023p727k5249M130J5368K336J794k3117j4163
7986F3993N557J927p394L2160L8208k367j9493n304q442k4270j5505K2583M1875
7973A23528j4415j3375M061r042j3733j6504j3095O682J4515j1336j8633K3623
7961F2276K2515O193q673j3217j8588k4600j5464R495L979q014L9098M8682O0
7948A03742j1352o400N807l249o510n028J9531K7646k1561Q062m973m4580j8177
$$ plain form
8039 -269 21871 38659 52154 67904 77088 84510 55723 53755 46870 50956 42792 62177 92157
8026 92157 99811 99123 90251 109419 124232 95104 82727 73880 32338 22174 29994 60192 58510
8013 58510 43987 30168 31184 26198 28063 57941 44741 42632 49562 49598 36024 50074 57571 84309
7999 84309 102057 83831 95539 106598 110621 102894 77645 81775 97143 99479 101273 78156 63993
7986 63993 69550 71477 64083 96243 134451 132084 112591 107287 98845 74575 59070 81653 123528
7973 123528 109113 95738 99799 90757 77024 60520 47425 54107 68622 57286 38653 62276
7961 62276 84791 90984 82311 69094 50506 25906 10442 19937 23916 15902 55000 103682 103742
7948 103742 92390 85990 91797 88548 82038 77010 96541 124187 102626 110688 105715 61135 42958
7935D2958n722k4541L461K2199K5161k4530j7699j1958K7052M976j2229l098K5376
7922E1406m112J0890k0463k6560k3097J7456j593N745L167J8659Q008m486j0335
7909B4685K498j7852j0921L8317Q625K029N818j5639K297J7929L921J0956j0541
7896F2122k3918l1208n204R726J99j3633Q840j3579K7710J2317L5432O889k8871
7883D6822l5775J0944J7289n058j36j569j9668n292P467R101l28L120K6072J5144
7869F8133p416k6435l2763k302J0608j0548Q621K2607j2033l1154Q879J5594j6407
7856d616J3526J6508L677j3061J1394J9454l072m655m308j3439m3107k8197m094
7843e3990k0401n172L7578N7578L7336j7628j6809J1025o895L2754l19k4530o2338
$$ plain form
7935 42958 37236 12695 16156 38355 63516 38986 21287 9329 36381 41357 29128 26030 51406
7922 51406 47294 58184 37721 11161 -11936 5520 3927 9672 12839 31498 39506 35020 24685
7909 24685 27183 9331 -1590 36727 45352 47381 53199 37560 39857 57786 61707 72663 62122
7896 62122 38204 6996 1792 11518 11717 -1916 6924 -6655 21055 33372 68804 75693 46822
7883 46822 11047 21991 39280 34222 34086 32517 12849 7557 15024 24125 23797 26917 52989 68133
7869 68133 60717 34282 1519 -783 9825 -723 7898 30505 18472 -12682 -3803 11791 -4616
7856 -4616 8910 25418 29095 16034 27428 46882 43810 39155 34847 21408 -21699 -49896 -53990
7843 -53990 -74391 -79563 -41985 15593 52929 35301 18492 29517 22622 55376 55057 30527 -31811
7830c1811J2269Q484J2736L0315J807k6584j1405j6690J48J0426O810K118j329
7817b706k4157j0372N649k548k2715K1628J8483N869J1603P292K9916O888m1752
7804C078l6452J3834L272l941Q042L0354M0600P380m5909m6397m627J4336j2836
7791b9266j3954k480J5424J3133r376R92O844Pn797Q889Q058q298O780K0317p380
7776C893j5675O407m6726j2860J6793J0523j739j29J1497J8683k510J4546j8632
7763a5929j3650q783J1889Q048J4928L786J3620j3238k9130O253l493j6236M748
7750c7187j5906K3234J6862L8967N618k9080p342J9571J3167j5572j0018K3820
7738B6134o863M542N129k4300R354J0985k8914j1773j0976q870P668K0708J2693
$$ plain form
7830 -31811 -19542 -11058 1678 31993 33800 7216 -4189 -20879 -20731 -10305 -3495 -1377 -2706
7817 -2706 -26863 -37235 -31586 -34134 -56849 -35221 -16738 -10869 734 8026 37942 44830 3078
7804 3078 -33374 -19540 -16268 -20209 -12167 18187 58787 66167 20258 -26139 -30766 -16430 -29266
7791 -29266 -43220 -45700 -30276 -17143 -26519 -25527 -18683 -18676 -24473 -15584 -7526 -15824 -9044 11273 3893
7776 3893 -11782 -5375 -52101 -64961 -48168 -37645 -39384 -39513 -28016 -9333 -11843 2703 -15929
7763 -15929 -29579 -38362 -26473 -18425 -3497 289 13909 671 -28459 -22206 -25699 -41935 -37187
7750 -37187 -53093 -29859 -12997 25970 31588 2508 -4834 14737 27904 12332 2314 26134
7738 26134 19271 23813 28942 4642 13996 24981 -3933 -15706 -26682 -35552 -27884 -7176 5517
7725E517Q98o421j0333j3982J818O941J0824j7603J43n288K0150R062K3796r963
7711A5559k5942L993j3665k742j8653j5854j7584N864K7732K8170j4271j7920
7699d5313j47P235J3363j7660n725J7969m034K3866Q006j8395m792J4178N891
7686e558o924k4469k018L0253M717j9232j4399k5093N071Q076J9118r491J3815
7673b6134N464q57r689J5794m720L007J0484k5285j4464j3700O388K1028K0531
7660a2153L714k6548k5200J7045L020l488P040P555l745l1213Q616K3441kJ4389
7646a7529q578O42J7969K5126J0140q500l319j3012l619L2567j5634j722j2657
7633A874m3540O065K2461L280o775j8871o257J1747O683L2439R525o162j743j0023
$$ plain form
7725 5517 6415 -6 -10339 -24321 -22503 -15562 -4738 -22341 -22198 -27486 -7336 1726 25522 15559
7711 15559 -10383 -6390 -20055 -22797 -41450 -57304 -74888 -69024 -41292 -13122 -27393 -45313
7699 -45313 -45460 -38225 -24862 -42522 -48247 -30278 -34312 -10446 -2440 -20835 -25627 -11449 -5558
7686 -5558 -12482 -36951 -38969 -8716 -3999 -23231 -37630 -62723 -57652 -49576 -30458 -39949 -26134
7673 -26134 -20670 -21527 -31216 -15422 -20142 -17135 -6651 -31936 -46400 -60100 -53712 -32684 -12153
7660 -12153 -8439 -34987 -60187 -43142 -40122 -43610 -36570 -29015 -32760 -63973 -55357 -31916 -31918 -17529
7646 -17529 -26107 -25465 -7496 17630 27770 19270 15951 2939 -680 31887 16253 14531 1874
7633 1874 -41666 -35601 -13140 -9860 -16635 -35506 -41763 -30016 -23333 9106 18631 12469 10726 703
7619G03J5063l6811j8826K870O809j4499J9253J6216K6467O261k9908k9330l6851
7606g2583n087J4685J2853n549J3983q558K7427K0417l122j4624o232R837J6227
7593c26p204j2917j146m296J2181K3251n267k3009k3346j7785p585J7648J1388
7580c8413L1561P911j1241k4547J9515k011J2139J8899j3504M592J1339j43J3038
7567B9135j9426l3128j3978J2004n425k7563j9348j876K684p765J1155L5314J1170
7554b7047P429k8159r094J8242J7934P370N977m439K5863k289j1433P802j3691
7541e535J801K6537j1570m671k9311k7101L2732J7874R972j1157j1882l444j5296
7528c1051J337j903J8042M673k2350o14Q409k802K8474J2456j0034N558M311l9180
$$ plain form
7619 703 15766 -21045 -39871 -37001 -30192 -44691 -25438 -9222 17245 23506 -6402 -35732 -72583
7606 -72583 -77670 -62985 -50132 -55681 -41698 -50256 -22829 -2412 -5534 -20158 -26390 -16553 -326
7593 -326 -7530 -20447 -21593 -25889 -13708 9543 4276 -18733 -42079 -59864 -67449 -49801 -38413
7580 -38413 -6852 1059 -10182 -34729 -15214 -17225 -5086 13813 309 4901 16240 16097 29135
7567 29135 9709 -23419 -37397 -25393 -30818 -58381 -77729 -79605 -76921 -84686 -73531 -38217 -27047
7554 -27047 -19618 -47777 -56871 -38629 -20695 -13325 -7348 -11787 14076 11787 354 8156 -5535
7541 -5535 -3734 22803 11233 6562 -22749 -49850 -17118 756 10728 -429 -12311 -15755 -31051
7528 -31051 -29714 -31617 -13575 -8902 -31252 -31866 -23457 -26259 2215 14671 4637 10195 14506 -24674
7514b4674r239R001K8621L68j6104j1561j9643j2311K37j3431J1140K504j283
7501e6375J4681L5292m365J78r997j5918K6827J9676j1337M602J5317l5327j0572
7488b7318n632r816p158N530N640J834J8189L2926k593j7665j486j0851r208j1218
7474c8826l340K2034J1423n885m902K7065j35k8298j2384J2683k176Q910m3203
7461e7034M710K9752j7938m862J7210K1189J3980j477j923J1575j99l2762J5603
7448b176M997M996J0768P98q586j5053O48l4317J6063Q460j4907j2632p742J2593
7434c6090q810j879Q960R473J1694k0929k4297J6524L7245o645j3919o120j1124
7421d5917k4370k0132K6287Q262j5581k5139P926K3161L2782j719J2062j3575
$$ plain form
7514 -24674 -33913 -24912 3709 4077 -12027 -23588 -43231 -55542 -55305 -68736 -57596 -55092 -56375
7501 -56375 -41694 -6402 -10767 -10589 -20586 -36504 -9677 9999 -1338 3264 18581 -16746 -27318
7488 -27318 -32950 -42766 -49924 -44394 -38754 -36920 -18731 14195 11602 -6063 -7549 -18400 -27608 -38826
7474 -38826 -42166 -20132 -8709 -14594 -19496 7569 7434 -20864 -33248 -20565 -22741 -13831 -57034
7461 -57034 -52324 -22572 -40510 -45372 -28162 -6973 7007 5530 3607 15182 14983 -17779 -2176
7448 -2176 2821 7817 18585 19383 10797 -4256 -3608 -37925 -21862 -13402 -28309 -40941 -48683 -36090
7434 -36090 -44900 -46779 -37819 -28346 -16652 -37581 -61878 -45354 -8109 -14754 -28673 -34793 -45917
7421 -45917 -70287 -90419 -64132 -55870 -71451 -96590 -88664 -65503 -32721 -34440 -22378 -35953
7409c5953n861n533R913J3074j8875N448j443K652j1974K0976L812j8166r435
7396e1365P35M941L2979J0013m449J1020k2385j9054q865q377k784J3607K2238
7383b1746P048o095O081J206l423J3095q377k6596j5534m763K0995m436K314N08
7369c9723M073R23Q776P482j9825M317q450K3052J5380J26J083J644Q937P42k3266
7354a4729q718J4838k5169p962J8165P092j5717j2112K3879L5980J9973j4112
7342B1408n344J1177j9221j2806k0752J0528r965N673K2711L373O694q968k2128
7329a7620L172J6914o048j1175j0022j6331j1217q781J3907J7801j1560j6411
7317e7371m147j9146K474K398R927k1137K8548N3817L2901q042j7457l3627p900
$$ plain form
7409 -35953 -41814 -47347 -37434 -24360 -43235 -37787 -39230 -36578 -48552 -27576 -23764 -41930 -51365
7396 -51365 -50630 -45689 -12710 -2697 -7146 3874 -18511 -37565 -46430 -54807 -57591 -43984 -21746
7383 -21746 -14698 -20793 -14712 -13506 -16929 -3834 -12211 -38807 -54341 -59104 -38109 -42545 -40231 -39723
7369 -39723 -35650 -34727 -25951 -18469 -38294 -33977 -42427 -19375 -3995 -3869 -2786 -1142 7795 8537 -14729
7354 -14729 -23447 -8609 -33778 -41740 -23575 -16483 -32200 -44312 -20433 15547 35520 21408
7342 21408 16064 27241 8020 -4786 -25538 -15010 -24975 -19302 3409 6782 13476 4508 -17620
7329 -17620 -14448 2466 -3582 -14757 -24779 -41110 -52327 -61108 -47201 -29400 -40960 -57371
7317 -57371 -61518 -80664 -78190 -75792 -65865 -87002 -58454 -4637 28264 20222 2765 -30862 -38762
7304c8762J971j8264r525P250M6137R006J3739j3224j9719J2939j0670j3930K0220
7291a2832J0794K926n655j7334k022o730j5474p716j1027J5371J3488K0170J3323
7278b718j4206M626k702p091J7376K0530o079m137j9984o14J7622J6951j8600
7265I74J2138J2546r936l2936l4406o31M816J7336J0034P155j659J4766j6232
7252a6035r651J0994m770j2489L590J1512q789j3269p908K404P032j4249k9309
7239h0937K6486J3611J9678L2879L224j4278k0747k6543K46j0827j1361k971K7869
7226d3671K3089Q299j3163K4065k3900j2012O894k3025j3635K2111K8088K7988
7214A1128R294J5540j964j8674j5688k8386k5052j9005K5931K509o004J6574L619
$$ plain form
7304 -38762 -36791 -55055 -64580 -57330 -11193 -2187 11552 -1672 -21391 -8452 -19122 -33052 -12832
7291 -12832 -2038 888 -4767 -22101 -24123 -30853 -46327 -54043 -65070 -49699 -36211 -16041 -2718
7278 -2718 -16924 -12298 -15000 -22091 -4715 15815 9736 5599 -14385 -14999 2623 19574 974
7265 974 13112 25658 15722 -17214 -51620 -52251 -47435 -30099 -20065 -12910 -14569 197 -16035
7252 -16035 -25686 -14692 -19462 -31951 -28361 -16849 -25638 -38907 -46815 -44411 -37379 -51628 -80937
7239 -80937 -54451 -40840 -21162 11717 14941 663 -20084 -46627 -46381 -57208 -68569 -71540 -43671
7226 -43671 -20582 -12283 -25446 -1381 -25281 -37293 -30399 -53424 -67059 -44948 -16860 11128
7214 11128 20422 35962 33998 15324 -364 -28750 -53802 -72807 -46876 -44367 -50371 -33797 -30178
7201c0178l455j5780J8138K450q448K8300J2290o694J435J3868k2909m0734O941
7188d4776J6409j37L666J3111k558M873l564J4174J8827K5627j5940j4315O588
7175B1985N488l513K262j7155m7167j0194j126j9194M763P630j3644p369J7178
7162f0056o801N60J6373L8253R327l276k1259M17M0446r105j3984O046k192j4533
7148a9784j2234O272p84j1511R033l272j4358Q123k457J0254J743j2114n463J3072
7134c3480M022q999N19o517K4454K486L574j4968j0911O236J348J0837J5400j7712
7120b3711l9071J9254N267p983N446K3033N197p028l038l1101J9218j0903J547
7107d3873M3888P951J1370j8465k6014k0758L488L5446j8788q293M618j8403J9449
$$ plain form
7201 -30178 -33633 -49413 -31275 -28825 -37273 -8973 3317 -3377 -1942 11926 -10983 -51717 -44776
7188 -44776 -28367 -28504 -24838 -11727 -14285 -9412 -12976 1198 20025 45652 29712 15397 21985
7175 21985 27473 23960 26222 9067 -38100 -48294 -49420 -68614 -63851 -56221 -69865 -77234 -60056
7162 -60056 -66857 -66297 -49924 -11671 -2344 -5620 -26879 -26462 13984 4879 -9105 -3059 -5251 -19784
7148 -19784 -32018 -25746 -26530 -38041 -29008 -32280 -46638 -38515 -40972 -30718 -28975 -41089 -46552 -33480
7134 -33480 -29458 -38457 -37938 -44455 -20001 -17515 -13941 -28909 -39820 -33584 -32236 -21399 -5999 -23711
7120 -23711 -62782 -43528 -38261 -46244 -40798 -17765 -12568 -19596 -22634 -53735 -34517 -45420 -43873
7107 -43873 15 7966 19336 871 -25143 -45901 -42413 -6967 -25755 -34048 -29430 -47833 -28384
7094b8384K346l67K4913j6226m0464K262M186J2570L731j4859K709N032k5010
7081f7561r01K0699M992q137j5458M2215N6224J1581k4633l4972j1980K1287j8754
7068b5398M980L189K2175K9377l136j5962j6537m726n624m936n121K2951O949
7055H181k2305j4155M43J3031q070m411R949J4544R586j5895j4502J2890R470
7042a244k2428J5472k505k6770m710P904p135j5493r39k650q974K8712J1852Q43
7028b8065J8865o40J0959K3136J5933l1547m8764L552J3162K0248R137p436o451
7015g911m232J1522m038J0686j1494o096j0871J4282m552J0394l1845j7872Q919
7002d3108K5320L1273L4092Q930l885J4202l7319m592r723l2613J667j7684L193
$$ plain form
7094 -28384 -26038 -26405 -1492 -17718 -58182 -55920 -51734 -39164 -35433 -50292 -47583 -42551 -67561
7081 -67561 -68462 -47763 -42771 -50908 -66366 -24151 32073 43654 19021 -15951 -27931 -6644 -25398
7068 -25398 -20418 -17229 4946 34323 31187 15225 -1312 -6038 -11662 -16598 -21719 1232 8181
7055 8181 -14124 -28279 -27836 -14805 -22875 -27286 -17337 -2793 6793 -9102 -23604 -10714 -1244
7042 -1244 -23672 -8200 -10705 -37475 -42185 -34281 -41416 -56909 -57848 -60498 -69472 -40760 -28908 -28065
7028 -28065 -9200 -9840 1119 24255 40188 8641 -40123 -36571 -23409 -3161 5976 -1460 -7911
7015 -7911 -12143 -621 -4659 6027 -5467 -11563 -22434 -8152 -12704 -2310 -34155 -52027 -43108
7002 -43108 -17788 13485 47577 56507 52622 66824 29505 24913 15190 -17423 -15756 -33440 -30247
6989c0247j3210k7103r924J6493L7388K8011N534K689k98l39j4759J338j1498
6976a5925N285L088K2614K1896l867m197m057k9188k6701m364R312L7922k608
6963I210o546j2876k5520J0951J974k3037K2977p079j6988L6695J8326O434j634
6950A2887j8298j6022p801J6069L120L0498P252J4582M448K383j0170k5079N889
6937A9758q513J1392k7914j6495J9805m249j2408J5776P448K5807O026J2508l583
6924D5358k9904j8440k1132j4906l348j4105K0663n119o674j4010L076n694j806
6911f6041L4488K0283o70J7921J1479o14j1701p515J8957J2548r899r917j9023
6898i704K567j2426k7347j4036k496M0590J7124J0744k4504k4460J3918M187k1134
$$ plain form
6989 -30247 -43457 -70560 -80484 -63991 -26603 1408 6942 9631 9333 8994 -5765 -4427 -15925
6976 -15925 -10640 -7552 15062 36958 33091 28894 24837 -4351 -31052 -35416 -26104 11818 9210
6963 9210 2664 -10212 -35732 -24781 -22807 -45844 -22867 -29946 -46934 -10239 8087 14521 12887
6950 12887 -5411 -21433 -29234 -13165 -10045 20453 27705 42287 46735 49118 38948 13869 19758
6937 19758 11245 22637 -5277 -21772 -1967 -6216 -18624 -2848 4600 30407 36433 48941 45358
6924 45358 15454 -2986 -24118 -39024 -42372 -56477 -35814 -40933 -47607 -61617 -58541 -64235 -66041
6911 -66041 -31553 -11270 -11940 5981 17460 16846 5145 -2370 16587 29135 19236 9319 -9704
6898 -9704 -7137 -19563 -46910 -60946 -63442 -22852 -5728 5016 -19488 -43948 -30030 -25843 -46977
6885d6977o346J121K0448J5534m404k0330L748J3237q070L889m180k4468J8866
6872c7932r43k946R466N222K2536K0948k6371O019K6664J3594l0538l4965J931
6859b7315K451N715K6046J3518l3770l6219K588p298j932R376k462k3780K4841
6846d8241J5045j3355K540l981J0835Q136n411q714J3191j3055N622R824J6332
6833a1232P138l503o191K5561O325k7876m597o570k697k3189q67K1253j1394Q193
6819b9646R266q556k2953p360K8681M112r735K5165J3942P252o945j6766K2190
6806H647Pk6199K364r403K911J2939J4701K545q054J6672j8057l0552j522j7582
6792e0583K069L1630j1138p227j9772J9476L3032K2649n806j0108j8652k1076
$$ plain form
6885 -46977 -53323 -52202 -31754 -16220 -20624 -40954 -37206 -23969 -32039 -28150 -32330 -56798 -37932
6872 -37932 -38875 -41821 -32355 -27133 -4597 16351 -10020 -4001 22663 36257 5719 -29246 -27315
6859 -27315 -24864 -19149 6897 20415 -13355 -49574 -46986 -54284 -56216 -46840 -49302 -73082 -48241
6846 -48241 -33196 -46551 -44011 -47992 -37157 -29021 -34432 -43146 -29955 -43010 -37388 -27564 -11232
6833 -11232 -4094 -7597 -13788 11773 18098 -9778 -14375 -20945 -23642 -46831 -47698 -26445 -37839 -29646
6819 -29646 -20380 -28936 -51889 -59249 -30568 -26456 -36191 -11026 2916 10168 3223 -13543 8647
6806 8647 8654 -17545 -15181 -24584 -21673 -8734 5967 8512 458 17130 -927 -31479 -33001 -50583
6792 -50583 -48514 -16884 -28022 -35249 -55021 -35545 -2513 20136 14330 4222 -14430 -35506
6780c5506o702K5170J0276j3616L350l1897j8212K4311J8627M785j635m51J6149
6767e351J8944n225O882k2593l1344K1324J7225k779j4184k4709J0864L4141k2062
6754a8867k797L1693j0572L325K5060K3203j1129l1204m3509p955L3175P578p303
6741i302k853O555K0669r519J1976j3411q194K7566K4861J706j6560k6947l6445
6728b9898j6905o527J679L5996L32l892N91j5055j6425r68L5902O036L750j4075
6714a9459m040J4533j4318j8375M5851J5292j0314r73j1142j1051Q336J3279j3221
6701e602O702J1457l187m4632j8726J4031K1854k4064o264J4408J1381K1159J2476
6688A0993r873l529K0040p186k5336j1049L1147q391k1845J3646N405l005Q553
$$ plain form
6780 -35506 -42208 -17038 -6762 -20378 -17028 -48925 -67137 -42826 -24199 -19414 -21049 -21500 -5351
6767 -5351 13593 8368 15250 -7343 -38687 -17363 -138 -2917 -17101 -41810 -30946 3195 -18867
6754 -18867 -21664 10029 -543 2782 27842 51045 39916 8712 -34797 -42752 -9577 -1999 -9302
6741 -9302 -12155 -5600 15069 5550 17526 4115 -4079 23487 48348 50054 33494 6547 -29898
6728 -29898 -46803 -53330 -51651 -15655 -15323 -19215 -18624 -33679 -50104 -51072 -15170 -9134 -5384 -19459
6714 -19459 -23499 -8966 -23284 -41659 4192 19484 9170 8197 -2945 -13996 -5660 7619 -5602
6701 -5602 1100 12557 9370 -35262 -53988 -39957 -18103 -42167 -48431 -34023 -22642 -1483 10993
6688 10993 1120 -2409 17631 10445 -14891 -25940 5207 -3184 -25029 -11383 -5978 -8983 -430
$$ [...]
##END NTUPLES=NMR SPECTRUM
##END=
