##TITLE=Analysis number 321408
Compound Code km 00154
Project Code adrs
Chemist Name zy-chem
##JCAMPDX= 6.0         $$ Bruker NMR JCAMP-DX V2.0
##DATA TYPE= NMR SPECTRUM
##DATA CLASS= NTUPLES
##ORIGIN= Bruker BioSpin GmbH
##OWNER= nmr
$$ XWIN-NMR		Version 3.5
$$ Wed Aug  9 11:48:28 2006 GMT Daylight Time (UT+1h)  MAYBRIDGE\nmr@NMR_250MHZ
##.OBSERVE FREQUENCY= 250.131544655141
##.OBSERVE NUCLEUS= ^1H
##.ACQUISITION MODE= SIMULTANEOUS (DQD)
##.ACQUISITION SCHEME= undefined
##.AVERAGES= 16
##.DIGITISER RES= 18
##SPECTROMETER/DATA SYSTEM= dpx250
##.PULSE SEQUENCE= zg30
##.SOLVENT NAME= CDCl3
##.SHIFT REFERENCE= (INTERNAL, CDCl3, 0, 16.522)
##AUDIT TRAIL= $$ (NUMBER, WHEN, WHO, WHERE, WHAT)
$$ ##TITLE= Audit trail, XWIN-NMR		Version 3.5
$$ ##JCAMPDX= 5.01
$$ ##ORIGIN= Bruker BioSpin GmbH
$$ ##OWNER= nmr
$$ C:\u/data/dgb/nmr/ADRS/500/pdata/1/auditp.txt
$$ ##AUDIT TRAIL=  $$ (NUMBER, WHEN, WHO, WHERE, WHAT)
(   1,<2006-08-09 11:47:59.68 +100>,<MAYBRIDGE\nmr>,<NMR_250MHZ>,
      <created by zg, POWCHK disabled, PULCHK disabled
       configuration hash MD5:
       E2 DF 36 D8 04 B2 41 60 5A D7 A3 38 5A 4B D0 FE
       data hash MD5: 64K
       C4 CF 19 06 20 4C 25 18 18 9A 2B 0D 9C AF 5E 19>)
(   2,<2006-08-09 11:48:16.66 +100>,<MAYBRIDGE\nmr>,<NMR_250MHZ>,
      <Start of raw data processing
       ef LB = 0.3 FT_mod = 6 PKNL = 1 SI = 32K 
       data hash MD5: 32K
       A3 D4 22 E2 81 C8 A3 5F 5E E6 C6 45 75 50 63 E1>)
(   3,<2006-08-09 11:48:18.51 +100>,<MAYBRIDGE\nmr>,<NMR_250MHZ>,
      <apk 
       data hash MD5: 32K
       B0 35 F4 4B 7A B2 AA F6 5B 28 D6 B7 A8 37 DD 6B>)
(   4,<2006-08-09 11:48:19.41 +100>,<MAYBRIDGE\nmr>,<NMR_250MHZ>,
      <abs ABSG = 5 
       data hash MD5: 32K
       4B 54 84 B8 8C 1E CD D0 4E 5F 78 A0 3A AF 3C 06>)
$$ ##END=
$$ 
$$ hash MD5
$$ 6A FC E1 EC CC 34 10 0D 14 D0 BF EF 0D 5E E4 95
##$RELAX= 
##$RELAX= 
##$RELAX= 
##$RELAX= 
##$RELAX= 
##$RELAX= 
##$RELAX= 
$$ Bruker specific parameters
$$ --------------------------
##$DU= <C:\u>
##$EXPNO= 500
##$NAME= <ADRS>
##$PROCNO= 1
##$TYPE= <nmr>
##$USER= <dgb>
##$AMP= (0..31)
100 100 100 100 100 100 100 100 100 100 100 100 100 100 100 100 100 100 
100 100 100 100 100 100 100 100 100 100 100 100 100 100 
##$AQSEQ= 0
##$AQ_mod= 3
##$AUNM= <au_zg>
##$AUTOPOS= <21 >
##$BF1= 250.13
##$BF2= 250.13
##$BF3= 250.13
##$BF4= 250.13
##$BF5= 500.13
##$BF6= 500.13
##$BF7= 500.13
##$BF8= 500.13
##$BYTORDA= 1
##$CFDGTYP= 0
##$CFRGTYP= 5
##$CHEMSTR= <none>
##$CNST= (0..31)
1 1 145 1 1 1 1 1 1 1 1 1 1 1 1 1 1 1 1 1 1 1 1 1 1 1 1 1 1 1 1 1 
##$CPDPRG= <>
##$CPDPRG1= <>
##$CPDPRG2= <>
##$CPDPRG3= <>
##$CPDPRG4= <mlev>
##$CPDPRG5= <mlev>
##$CPDPRG6= <mlev>
##$CPDPRG7= <mlev>
##$CPDPRG8= <mlev>
##$CPDPRGB= <>
##$CPDPRGT= <>
##$D= (0..31)
0 1 0 0 0 0 0 0 0 0.06 0 0 0 0 0 0 0.0002 0 0 0 0 0 0 0 0 0 0 0 0 0 0 
0 
##$DATE= 1155120478
##$DBL= (0..7)
120 120 120 120 120 120 120 120 
##$DBP= (0..7)
150 150 150 150 150 150 150 150 
##$DBP07= 0
##$DBPNAM0= <>
##$DBPNAM1= <>
##$DBPNAM2= <>
$$ [...]
##$SUBNAM7= <"">
##$SUBNAM8= <"">
##$SUBNAM9= <"">
##$SW= 20.6930455092707
##$SWIBOX= (0..15)
0 0 3 0 0 0 0 0 0 0 0 0 0 0 0 0 
##$SW_h= 5175.983436853
##$TD= 65536
##$TD0= 1
##$TE= 295.16
##$TE2= 300
##$TE3= 300
##$TEG= 300
##$TL= (0..7)
0 120 120 120 120 120 120 120 
##$TP= (0..7)
150 150 150 150 150 150 150 150 
##$TP07= 0
##$TPNAME0= <>
##$TPNAME1= <>
##$TPNAME2= <>
##$TPNAME3= <>
##$TPNAME4= <>
##$TPNAME5= <>
##$TPNAME6= <>
##$TPNAME7= <>
##$TPOAL= (0..7)
0.5 0.5 0.5 0.5 0.5 0.5 0.5 0.5 
##$TPOFFS= (0..7)
0 0 0 0 0 0 0 0 
##$TUNHIN= 0
##$TUNHOUT= 0
##$TUNXOUT= 0
##$USERA1= <user>
##$USERA2= <user>
##$USERA3= <user>
##$USERA4= <user>
##$USERA5= <user>
##$V9= 5
##$VALIST= <valist>
##$VCLIST= <CCCCCCCCCCCCCCC>
##$VD= 0
##$VDLIST= <DDDDDDDDDDDDDDD>
##$VPLIST= <PPPPPPPPPPPPPPP>
##$VTLIST= <TTTTTTTTTTTTTTT>
##$WBST= 1024
##$WBSW= 4
##$XGAIN= (0..3)
0 0 0 0 
##$XL= 0
##$YL= 0
##$YMAX_a= 434578
##$YMIN_a= -554389
##$ZGOPTNS= <>
##$ZL1= 120
##$ZL2= 120
##$ZL3= 120
##$ZL4= 120
##$ABSF1= 16.522
##$ABSF2= -4.171173
##$ABSG= 5
##$ABSL= 3
##$ALPHA= 0
##$AQORDER= 0
##$ASSFAC= 0
##$ASSFACI= 0
##$ASSFACX= 0
##$ASSWID= 0
##$AUNMP= <proc_1d>
##$AZFE= 0.1
##$AZFW= 0.1
##$BCFW= 0
##$BC_mod= 0
##$BYTORDP= 0
##$COROFFS= 0
##$CY= 12.5
##$DATMOD= 1
##$DC= 0
##$DFILT= <>
##$DTYPP= 0
##$F1P= 14.0000005364418
##$F2P= -0.99999901652339
##$FCOR= 0.5
##$FTSIZE= 32768
##$FT_mod= 6
##$GAMMA= 0
##$GB= 0
##$INTBC= 1
##$INTSCL= 1
##$ISEN= 128
##$LB= 0.3
##$LEV0= 0
##$LPBIN= 0
##$MAXI= 10000
##$MC2= 0
##$MEAN= 0
##$ME_mod= 0
##$MI= 0
##$NCOEF= 0
##$NC_proc= -5
##$NLEV= 6
##$NOISF1= 0
##$NOISF2= 0
##$NSP= 0
##$NTH_PI= 0
##$NZP= 0
##$OFFSET= 16.522
##$PC= 1
##$PHC0= 149.314
##$PHC1= 4.747291
##$PH_mod= 1
##$PKNL= yes
##$PPARMOD= 0
##$PSCAL= 4
##$PSIGN= 0
##$REVERSE= no
##$SF= 250.13
##$SI= 32768
##$SIGF1= 0
##$SIGF2= 0
##$SINO= 400
##$SIOLD= 32768
##$SREGLST= <1H.CDCl3>
##$SSB= 0
##$STSI= 32768
##$STSR= 0
##$SW_p= 5175.98343685301
##$SYMM= 0
##$S_DEV= 0
##$TDeff= 65536
##$TDoff= 0
##$TI= <Analysis number 999999
Compound Code 99
Book Reference 9
Project Code 9>
##$TILT= no
##$TM1= 0
##$TM2= 0
##$TOPLEV= 0
##$USERP1= <user>
##$USERP2= <user>
##$USERP3= <user>
##$USERP4= <user>
##$USERP5= <user>
##$WDW= 1
##$XDIM= 32768
##$YMAX_p= 403471753
##$YMIN_p= -501759
$$ End of Bruker specific parameters
$$ ---------------------------------
##NTUPLES= NMR SPECTRUM
##VAR_NAME=  FREQUENCY,     SPECTRUM/REAL,   SPECTRUM/IMAG
##SYMBOL=    X,             R,               I
##VAR_TYPE=  INDEPENDENT,   DEPENDENT,       DEPENDENT
##VAR_FORM=  AFFN,          ASDF,            ASDF
##VAR_DIM=   32768,         32768,           32768
##UNITS=     HZ,            ARBITRARY UNITS, ARBITRARY UNITS
##FACTOR=    0.157963299565203, 1,           1
##FIRST=     4132.6476996994, 0,             0
##LAST=      -1043.33573715361, 0,           0
##MIN=       -1043.33573715361, -501759,     0
##MAX=       4132.6476996994, 403471753,     0
$$ Real data points
##PAGE= N=1
##DATA TABLE= (X++(R..R)), XYDATA
$$ [...]
21115a49924R2860J35192J1872m1682m6594p0676o8501M7174p23q8652m3978Q1463
21103a42169P4276J18232Q6124m7600p6873M2683J23674k785j4368l5775r3583
21092C1836q2479K2842K2330n5865m5283J7446R6609Q3506j56028p8335J14913
21081b8508Q1252J5670j58n5655j43089M4028O9668l1953j43258L8470O5477L1858
21069e6198J00667O0542j5519j19225n59L6234K9686K9775M0952k7942k3762j3649
21057D1002J0624M3711L4884j9090j26760j40081M8429J08529J08237j4914o1308
21046C3263j19569K6592L129K4560J08398N3931j07717o1550L3262p5318j5164
21035i6183J20990M1158M2871m243K8738Q7873j01052r283j7820J9281P5967J9445
$$ plain form
21115 -149924 -57064 78128 90000 48318 1724 -68952 -137453 -90279 -91002 -179654 -223632 -142169
21103 -142169 -67893 50339 136463 88863 11990 54673 178347 175562 161194 125419 31836
21092 31836 -50643 -27801 -5471 -61336 -106619 -89173 7436 90942 -65086 -143421 -28508
21081 -28508 52744 68414 68256 12601 -130488 -86460 -16792 -48745 -192003 -153533 -88056 -56198
21069 -56198 44469 105011 89492 -29733 -30292 5942 35628 65403 106355 78413 54651 41002
21057 41002 51626 95337 130221 111131 -15629 -155710 -107281 1248 109485 94571 33263
21046 33263 -86306 -59714 -56585 -32025 76373 130304 22587 -38963 -5701 -81019 -96183
21035 -96183 24807 65965 108836 104593 133331 221204 120152 110869 93049 112330 188297 207742
21023B07742r4122j61641k0379l011p028K7963J1045j19329j72M1655L5449o7394
21011a49222O8389J60932L3696j64318M9378j5849r3642Q609O39J15348J59655
21000A73615k1545o4452K4469O8878j13167q877M7663l5802n5218n3288j1592
20989d9316m4014M2895n1342N2542K6391k5954o2472n9358m7075R7991l1228q881
20977a59821l620Q8193M4964k891k8521O7777K1400n5696K3389k0417l9775m1084
20965a06102J79051R9614o1046j24335j00985M3652K4245p312l5677k8974M0415
20954g7454j0311j45135J6214J56306M3652N7730k936j2147M2597J68839P6430
20943C13785l511j09935r3896L535m6008j23406o8043J5034N6340l2843N1188
$$ plain form
21023 207742 113620 -48021 -68400 -71411 -78439 -50476 -39431 -158760 -158932 -117277 -81828 -149222
21011 -149222 -80833 80099 113795 -50523 -1145 -16994 -110636 -102027 -101388 13960 173615
21000 173615 152070 87618 112087 180965 67798 58921 106584 70782 15564 -37724 -49316
20989 -49316 -93330 -50435 -101777 -49235 -22844 -48798 -111270 -170628 -217703 -119712 -150940 -159821
20977 -159821 -163441 -75248 -30284 -33175 -61696 6081 27481 -28215 -4826 -25243 -65018 -106102
20965 -106102 72949 172563 111517 -12818 -113803 -70151 -45906 -53218 -88895 -117869 -77454
20954 -77454 -87765 -232900 -216686 -60380 -16728 41002 38066 25919 68516 237355 313785
20943 313785 310274 200339 106443 109978 63970 -59436 -127479 -112445 -56105 -88948 -37760
20932c7760q0988J26017J20428K770l7115k266o8641p5004j05169J17211J28034
20921H7517n4036N409R1044Q0098n3302l7087r4046r2859O5754K6237k3633Q6103
20909H7199K4972q7876l7328j6149N1456j04524l9282M478L8410n3021j0757R1864
20897e0558O6705P6484o049m9042Q222k1162k6855r0475j13309N5926P6138N9767
20885a4208J2531J867J107M5277l0497J73512L9646q677l3114K3155j17428r421
20873H3750J33471k8491o0842n1551J3095K0173o6460m9997l3246k0845n0866
20862a11809J4022R4716K19318J00976O2106j89718j95688l8587k8982Q6166J1168
20851B3688Q9436J26015P4616j19211j06383L8323j55101j06075K4607M9957O3932
$$ plain form
20932 -37760 -118748 7269 127697 130467 93352 91086 22445 -52559 -157728 -40517 87517
20921 87517 33481 38890 129934 210032 156730 119643 25597 -67262 -1508 24729 1096 87199
20909 87199 112171 24295 -13033 -29182 22274 -82250 -121532 -117054 -78644 -131665 -142422 -50558
20897 -50558 16147 92631 86582 37540 45762 24600 -2255 -92730 -206039 -150113 -73975 -14208
20885 -14208 -1677 190 1297 46574 16077 189589 229235 220558 187444 210599 93171 83750
20873 83750 217221 188730 127888 76337 89432 109605 43145 -6852 -40098 -60943 -111809
20862 -111809 -97787 -3071 216247 317223 379329 189611 -6077 -44664 -73646 12520 23688
20851 23688 113124 239139 313755 194544 88161 126484 -28617 -134692 -110085 -60128 3804
20840C804O0607j634O0344q1951r402J0701P9972l6124l0694L482q9489L2483
20828B099m854r3756j19399j50656J7744J03148P3759M337R6161L8930K4821R238
20816A572N0318L0168J4602k2765j06049o1839R4080J86437K9908r0828j0673
20805A14931p6989k0301J3740j38635K3014J1059l1548P1246Q7746M0490o8413
20794B6340j52655o9611M1696J08746P1511n4021p6655K08074R352O6728L2944
20783B12449n2148o1465L8185k7449k7894k07P5621M5119j00036q6774M0924K1491
20771G7816L5385P134q6796k23950O7781J87897p3082m7980R8103Q7511n8088
20760G1731n2015l9779N4540m019k0137M2297M0J22715r8233p0519P516K4095
$$ plain form
20840 3804 64411 62777 123121 41170 31768 42469 122441 86317 55623 59105 -30384 2099
20828 2099 -2755 -96511 -215910 -366566 -348822 -245674 -171915 -167578 -71417 -32487 -7666 1572
20816 1572 51890 82058 96660 73895 -32154 -93993 87 186524 216432 125604 114931
20805 114931 37942 17641 31381 -107254 -84240 -73181 -104729 -33483 54263 94753 26340
20794 26340 -126315 -195926 -154230 -45484 26027 -27994 -104649 103425 112777 179505 212449
20783 212449 160301 98836 137021 109572 81678 81471 157092 202211 102175 15401 56325 77816
20771 77816 113201 120335 33539 -190411 -122630 65267 -7815 -55795 42308 129819 71731
20760 71731 19716 -20063 34477 30458 10321 52618 52658 175373 77140 6621 14137 38232
20748C8232Q0517n4790O0726O2364l60l2176J6653l2969j36350o6565R5018k5574
20736D726M5226L7170L451J34979M9354l3302j49095j23153j6761P8959Q5213
20725A16767p2407j71438j34643j5790J29692k6675K0214k9763K7423O2156J4864
20714g9600K3204K327J3139l8821N3490n337n6402p6432J9239R6324o684m2790
20702i8343J666l7699J72330O0119j69577n7315Q7351J9218L0797P5950k5468
20691E9029J83569J21795J836j96966j65085O7965k7971K7060N4994Q7780k9683
20680A84323j03646j57062l3002J05981P7664r5620j51424M3460N9607n4889M8558
20669g6050J43259N2400O0679l7923j41502O1627J01617J2698j73033K6924j5112
$$ plain form
20748 38232 118749 63959 124685 187049 186689 154513 171166 138197 1847 -64718 30300 4726
20736 4726 49952 87122 90573 225552 274906 241604 92509 -30644 -47405 31554 116767
20725 116767 44360 -127078 -261721 -277511 -147819 -174494 -154280 -184043 -156620 -94464 -79600
20714 -79600 -56396 -54069 -40930 -79751 -26261 -31598 -88000 -164432 -145193 -48869 -55553 -98343
20702 -98343 -96677 -134376 37954 98073 -71504 -128819 -41468 -22250 8547 84497 59029
20691 59029 242598 364393 366229 169263 4178 72143 44172 71232 126226 214006 184323
20680 184323 80677 -76385 -109387 -3406 74258 -21362 -172786 -129326 -69719 -124608 -76050
20669 -76050 67209 119609 180288 142365 863 62490 164107 176805 3772 30696 15584
20658A5584o098J07035l1216j4662M5483J7476M110R004j35262p0368R0601J43238
20646A74925J7676k4624p3483o5286r979q8874j72728J30496L2775q843k97l6561
20634a24803M1131M2743Q3272O5005m4476j60032o0051k7758N0224n1857M6223
20623a40379R9971M8133j3570k9354K0435K4599M8665j8107M6839J17911M1025
20612B46168M20j06075n8006j20572m1632M5688Q2528J07949m754o1613P0241
20601A60342m7977k463j02604J7356j9570l9668K08206M6785j13167m7312m6566
20590A3362K0585P8198p9052m3782P6693k0080K8300J3371J45778l1087p4304
20579A27982j8377p7802J982r184O5332l6757J426l2502Q433l5329r7209m9566
$$ plain form
20658 15584 9486 116521 85305 70643 116126 133602 137712 146716 11454 -58914 31687 174925
20646 174925 192601 167977 94494 29208 19229 -69645 -242373 -111877 -79102 -87945 -88242 -124803
20634 -124803 -83672 -40929 42343 107348 62872 -97160 -157211 -184969 -134745 -186602 -140379
20623 -140379 -40408 7725 -5845 -35199 -14764 9835 58500 40393 87232 205143 246168
20612 246168 246588 140513 82507 -38065 -79697 -34009 48519 156468 151714 90101 160342
20601 160342 112365 109902 7298 24654 5084 -34584 173622 220407 107240 59928 13362
20590 13362 33947 112145 33093 -10689 66004 45924 74224 87595 233373 202286 127982
20579 127982 109605 31803 33785 24601 89933 53176 54602 22100 30533 -4796 -102005 -151571
20567a51571J65963J17608k6753l5561N1867K0324O958j09811k542n3520M2692
20556B5654m434K3772l456k3919m4745O0280k1914M8803J05151K6201l0243k14153
20544e3003n96k0371K4093O9842P5797m7590k0036o5590l7473O6302J81877R0179
20532B63431j54548n5653O2631J2729J9027j48923j57309l2437M0720j10687K9801
20521b31218L764N4258R855K10121J7127n4584j91392j34345N9720K8247R1831
20510a36616k6012R9764J49355r667M0178n5382J7467O0058j10196m5743K4636
20499G842j0294m5066P6686j1677j01737K966R0828J69626m4767k3591O3307J13396
20487B87519j6678j22563n0439J4498j5824n6633q1053M7844J9543R2172R252
$$ plain form
20567 -151571 14392 132000 105247 69686 121553 141877 148835 39024 36482 -17038 25654
20556 25654 21220 44992 41536 17617 -27128 33152 11238 60041 165192 191393 161150 -53003
20544 -53003 -53599 -73970 -49877 19965 95762 48172 28136 -37454 -74927 -8625 173252 263431
20532 263431 108883 53230 115861 128590 147617 -1306 -158615 -191052 -150332 -261019 -231218
20521 -231218 -227454 -173196 -163341 46780 63907 9323 -182069 -316414 -256694 -228447 -136616
20510 -136616 -162628 -62864 86491 76824 117002 61620 79087 139145 28949 -16794 7842
20499 7842 -2452 -47518 29168 17491 -84246 -81280 9548 179174 134407 110816 174123 287519
20487 287519 270841 148278 97839 112337 96513 39880 -41173 6671 26214 118386 127638
20476A27638k4168j22593j3388m2954K5498q2395P4155M4411o1295j4244J69837
20465H0502k9387j48493K9283J75044q6448j00372o1891j5280K15L2293J78312
20454E3778r426p3410j07931O3002J19586J800l357K1874l1967R2096M3583r8101
20442G1527n8082N0705P3489j58206R8558J08979j35979p975k4086j7271j3141
20431a1482R6543k5014p2587p5702N9569J2306K1513L1065J4138j34969N5971
20420b8649M2038P0624J11145q857j42732j35535o7944R1927O6143j12362j6649
20409a30851L7615K881L4156L9595j13008m1612M7296m066n3977J42589L6797
20398b585O6800J15107n4951n8872q4953p2974M80J7032Q3522Q7081j23669j37371
$$ plain form
20476 127638 103470 -19123 -32511 -75465 -49967 -132362 -58207 -13796 -75091 -89335 80502
20465 80502 51115 -97378 -68095 106949 20501 -79871 -141762 -157042 -156827 -124534 53778
20454 53778 44352 -29058 -136989 -73987 45599 47399 44042 65916 33949 126045 169628 71527
20442 71527 13445 64150 137639 -20567 77991 186970 50991 43016 18930 1659 -11482
20431 -11482 85061 60047 -12540 -88242 -28673 -16367 5146 36211 50349 -84620 -28649
20420 -28649 13389 84013 195158 186301 43569 -91966 -159910 -67983 -1840 -114202 -130851
20409 -130851 -93236 -90355 -56199 -16604 -129612 -171224 -123928 -127994 -181971 -39382 -2585
20398 -2585 64215 179322 124371 65499 -19454 -92428 -91948 -74916 8606 95687 -27982 -165353
20386a65353L72m4367Q9248J38257q694k7711k7077k1818R186J38205p9771J8110
20374A8587p047L7113n3871j80269J3269R6199O6108k33783N6977J13420Q3202
20363I905j24581j91959J0673K17798N6311j1353J9969J1632M9882M7554k6999
20352F8832n2535j18265j25237P5539Q4222J03032J32403j1872r6596k78112j09959
20341c28548J30947Q8295J09886l4254p1813q4464K9777J47421J44503r215M2142
20330A64677o5394p6515J71342L4669o6647j24173R2269p415l7267p1047m863
20319I636k6971m8J19471J00304o706j20690q0961k5920O508R7416R2374K1633
20307A86046k7835r763o6062O2779j5029j16690j02274L6081M1811k7342p6006
$$ plain form
20386 -165353 -164981 -209348 -120100 18157 9463 -18248 -45325 -67143 -57957 80248 477 18587
20374 18587 11540 48653 -5218 -185487 -172218 -76019 -9911 -243694 -186717 -73297 9905
20363 9905 -114676 -306635 -295962 -78164 -21853 -33206 -13237 -1605 48277 95831 68832
20352 68832 16297 -101968 -227205 -151666 -67444 35588 167991 156119 59523 -218589 -328548
20341 -328548 -197601 -109306 580 -33674 -105487 -189951 -160174 -12753 131750 122535 164677
20330 164677 99283 22768 194110 228779 162132 37959 130228 122813 85546 14499 9636
20319 9636 -17335 -17383 102088 202392 195686 74996 -5965 -31885 -25377 72039 164413 186046
20307 186046 158211 148448 82386 145165 130136 13446 -88828 -52747 -10936 -38278 -114284
20296a14284L1359j7480R9657J7260m9394J182M6056j5499P9045J0104J25778
20285B13784J9368j0744O5001r3549m0627m873O9514j15262K365J48192n2144
20274B01025j69028r1883J419n075Q8010O9751n2678o1164j2795Q0957K07937
20263B56476k6425J7418L0745l0186j42592j66893N2644J00259R9865J7244m4709
20252A63846q5578j7988j61570q4132J29079L7663P5350q6909P7039R6327M7552
20241A90679j02095q7352O6734l2158j72956N2471J70918J28232k7246p6695p0067
20230D0465P4116N0235j51803r9048r511J42736k2118m9404k0917O4246R4613
20219A13610j5143K2322J03636J8426n3542m351p9851j41563O4641J26933J06573
$$ plain form
20296 -114284 -82925 -100405 -748 16512 -32882 -31700 14356 -1143 77902 88006 213784
20285 213784 233152 222408 287409 193860 153233 148360 217874 102612 104977 253169 201025
20274 201025 31997 -59886 -58467 -63542 24468 94219 41541 -19623 -32418 48539 256476
20263 256476 230051 247469 278214 248028 105436 -61457 -8813 91446 191311 208555 163846
20252 163846 78268 60280 -101290 -185422 -56343 -18680 56670 -30239 46800 143127 190679
20241 190679 88584 1232 67966 35808 -137148 -84677 86241 214473 187227 110532 40465
20230 40465 114581 164816 13013 -86035 -95546 47190 25072 -24332 -45249 18997 113610
20219 113610 98467 120789 224425 242851 189309 184958 105107 -36456 28185 155118 261691
20208B61691l1501N7797n9554p3823O8737O7764L943j55209j50681m471R3046
20197G7739n1109L1939R7831J3107l5117p2387m5916L2316n4143L8266P2975Q2653
20185A88154l1124p5660J1406O6804K9719j2447k1575J81j17161p51J01127J62046
20173C00719p9978p2271k9920j01084n429Q2269j00342J1574R6735k1226P0144
20162A51191L7052K6314p8434L2762p873p5810k6271p1580J7849N6390n9008j8584
20150a6002O8067l6117j5396q546n0597J5359J7033P7830Q9259O6579o664k1237
20138A79568l0698J2195P409m9626J264j9828J6909M9838J2524P734n0844L389
20126A39834M4481L8824K6371J5708j31580j18144n8896O92Q5030J16458K8729
$$ plain form
20208 261691 230190 287987 228433 154610 223347 291111 295054 139845 -10836 -15307 77739
20197 77739 26630 58569 156400 169507 134390 62003 16087 48403 -5740 32526 105501 188154
20185 188154 157030 81370 92776 159580 189299 176852 155277 155458 38297 37546 138673 300719
20173 300719 220741 148470 118550 17466 12037 94306 -6036 5538 102273 81047 151191
20162 151191 188243 214557 136123 168885 161012 85202 58931 -12649 5200 61590 2582 -16002
20150 -16002 52065 15948 552 -7994 -58591 -43232 -26199 51631 140890 207469 200805 179568
20138 179568 148870 161065 168474 118848 120112 100284 117193 167031 179555 187289 136445 139834
20126 139834 184315 223139 249510 265218 133638 15494 -43402 -42710 42320 158778 187507
20115A87507j27466q0299J6348J45881m4897k9195m00o4512J2436m2787N9281
20104C1897J26685j0147m4800r3919N2084j74914r9033j2162j5657M2784P877
20093a89305K5581R5649N3250R718m3004P1688j4045Q636J35653J23042l1708
20082B45155q6343r3009n6381P0734N3552l9577M6414n3353L6578M261j10945
20071A7086j18759j1656j5301J41257J26119l1792j8017K2021j9027k7558p7251
20060a2878m0684l1262n9763J46842J00790l7142m4585n347Q15P4201k1815j1103
20048E8069n6003R0949j7398r0351k3247j0165M8912J04389n3375j04955J34510
20037H1335J22959M0555p1557l2406j5665J3122m4525k2466N3646O9976n1165
$$ plain form
20115 187507 60041 -20258 -3910 141971 97074 67879 67479 2967 15403 -27384 31897
20104 31897 158582 148435 103635 9716 61800 -113114 -212147 -224309 -239966 -197182 -189305
20093 -189305 -163724 -68075 -14825 -5107 -48111 23577 9532 18168 153821 276863 245155
20082 245155 158812 65803 9422 80156 133708 94131 140545 87192 123770 128031 17086
20071 17086 -101673 -113329 -128630 12627 138746 106954 88937 110958 91931 64373 -12878
20060 -12878 -53562 -84824 -144587 2255 103045 65903 21318 15971 16786 90987 69172 58069
20048 58069 2066 93015 75617 -14734 -37981 -48146 766 105155 51780 -53175 81335
20037 81335 204294 244849 173292 140886 125221 138343 93818 71352 124998 194974 143809
20026A43809k8920j08144L4214O5190P2727j1045Q258K1715L4577R2087l9548
20015B84920m6526l1951r5573K0840J2352R8303O7183m9334k29494j43057k4849
20004a37186n9947n4628O9657p4288J09410J80272J23066O8730n130j37143r5641
19993a2828q6672N8823M0222J02962J5833p9346R9664J1778P5918m8357m1915
19982A36082n9827P9216R2447j26812o5288M5035q1603j27930l7161P0021l1196
19971a07016o895O0085J27269J4597J98045M2050P129j01602K1056L2630j04777
19960A82571j14574o7292K5793L3106O1997P83n0484p0374M4825l9165J20035
19949A27221J11970p2979j63482k8730Q6936N3286k4359K9615K6062J02934M6767
$$ plain form
20026 143809 114889 6745 40959 106149 178876 167831 176089 197804 232381 324468 284920
20015 284920 238394 206443 110870 131710 144062 242365 309548 260214 30720 -112337 -137186
20004 -137186 -197133 -251761 -182104 -256392 -146982 33290 156356 225086 219956 82813 -12828
19993 -12828 -99500 -40677 -455 102507 118340 38994 138658 150436 226354 177997 136082
19982 136082 76255 155471 247918 121106 55818 100853 19250 -108680 -145841 -75820 -107016
19971 -107016 -113911 -53826 73443 88040 286085 328135 335264 233662 254718 287348 182571
19960 182571 67997 705 26498 59604 121601 122384 71900 1526 46351 7186 127221
19949 127221 239191 166212 2730 -26000 60936 114222 89863 119478 145540 248474 295241
19938B95241K9222j31573j12375j01141l8030j83062J27273K16483J6328P3461
19928A91827j3299j00231P7983k3500l3878n3153K6484J06005n0861j02796J347
19917B5928r3269J9301O6836o5486m1700M4680N7985J25018M4961K7750k2127
19906A89877j98665k4849R0297J42547j09279j46016M0743J15226Q7867p7949
19896A09799n2442P588j5481p854O8069l8699k1289P9558M5986o0118m7925p6721
19884i529l1623N9626k6990p4679Q205N9462L0639J4991Q7325Q7669j0990q2715
19872A11391N5065J56168l4990j16276L5707l9967j21718J36808J08568o5362
19862B25394m0697K9681M5705j00895q3848p772J31826k4125p1192M6949N7847
$$ plain form
19938 295241 324463 192890 80515 -20626 -58656 -241718 -114445 102038 118366 191827
19928 191827 178528 78297 156280 132780 98902 45749 72233 178238 127377 24581 25928
19917 25928 -67341 -48040 18796 -46690 -88390 -43710 14275 139293 184254 212004 189877
19906 189877 -8788 -33637 56660 199207 89928 -56088 -15345 99881 187748 109799
19896 109799 57357 64945 49464 41610 109679 70980 49691 129249 175235 115117 67192 -9529
19884 -9529 -41152 18474 -8516 -83195 -74990 -15528 15111 30102 117427 205096 194106 111391
19872 111391 166456 322624 287634 171358 207065 167098 45380 182188 290756 225394
19862 225394 184697 214378 260083 159188 75340 67568 199394 175269 104077 151026 208873
19851B08873R9019M4665J8337m4210j73208j69410R3131J36889P7736j29948j5213
19840A46661m8776m7679n8807L8658K4790r4653J23816J7310l5593q4682l5147
19829e4102K9861N4123l7629O431J1225j10937o0527O3636J41325M3212k6746
19818E9872j6632o0747j75430j02658N8293J68118J43683P4774P6371r2723l0512
19807A02409J0265j48776R4450l1109J0725j4897j9777M4500J18777j7215N9104
19796B08456J00298j7833q119N1159K335j46015j00272r5335j13569M9865j7978
19785h7008K3115k6384N5207J49090r926R1431O9403m9288n9575k6877p382J01550
19773B23356j4758r4572k506p9517r903Q4526N7728K3264L3624j46247j21715
$$ plain form
19851 208873 307892 352557 370894 326684 153476 -15934 77197 214086 291822 161874 146661
19840 146661 97885 50206 -8601 30057 54847 -39806 84010 101320 65727 -18955 -54102
19829 -54102 -24241 29882 -7747 -1316 9909 -101028 -161555 -97919 43406 86618 59872
19818 59872 43240 -17507 -192937 -295595 -237302 -69184 74499 149273 225644 132921 102409
19807 102409 112674 -36102 58348 27239 37964 23067 3290 47790 166567 149352 208456
19796 208456 308754 290921 282802 333961 336296 190281 90009 -5326 -118895 -69030 -87008
19785 -87008 -63893 -90277 -35070 114020 104094 195525 264928 215640 156065 129188 121806 223356
19773 223356 208598 114026 111520 32003 22100 106626 164354 187618 221242 74995 -46720
19762d6720J6541R9812q3059Q5235J10599m5384J219N3384L4436O0283r0208j15053
19750H1085K8383K5184R312l0842j51981K5214J00883l4145q4006j8210R6606
19739D7483O9542P1044n8090k1292K5552P113Q8225k8048N5296k3506o9864r134
19727A54321p1432L8693q0734m8322j06792m8430L2223l3196M4398J91718k458
19716F9989q3879n0822l6721N262p1941K8366P7325K1908J05706J07810J16608
19705B89611l7890j99621J7191j5678k7216R240q292L1858R3784R4561o6552j29516
19693E1480k998M0070m0241O8945O7205n253k6016k5040J9379M5672K6540j513
19681B18230J10797M8888L0576R7198l8411j42356r0964J32896r8785r2675k5401
$$ plain form
19762 -46720 -30179 69633 -13426 71809 182408 137024 138243 191627 226063 286346 196138 81085
19750 81085 109468 134652 143964 113122 -38859 -13645 87238 53093 -30913 -49123 47483
19739 47483 117025 188069 129979 108687 134239 141352 229577 201529 256825 233319 163455 154321
19727 154321 82889 121582 40848 -7474 -114266 -162696 -130473 -163669 -119271 72447 69989
19716 69989 -13890 -64712 -101433 -96171 -168112 -139746 -62421 -40513 65193 173003 289611
19705 289611 251721 52100 69291 53613 26397 35637 27345 59203 152987 247548 180996 51480
19693 51480 48482 88552 48311 117256 184461 179208 153192 128152 147531 193203 219743 218230
19681 218230 329027 377915 408491 505689 467278 324922 233958 366854 268069 175394 149993
19670A49993p4050J3431M1105n972L7236J11948J56213k1666j02479j18822p134
19659A79803N6731q6532j4019R1905O7116K2316j06041J3057j0097m6327K3773
19648A91685l3048k9544P0851p280j56566q0205J25585J19174J11k1982J30483
19637C09264o981r547j2348o5583q5869n4370q6871L6666R0789P3695l5179k03430
19625d9764k2059J13061J9235o2529P5161J53426L8464K6589p7144j13929J03228
19614B03739J00319L2350M1665K7813j420j22059j55639m5574J5574J52384J83622
19603D32774k9240j19252n7518j9142j4340K7616J7816O6229L4321J7760k561
19592C54463J3077n9212m5962j9092k7532l7538l1778M8556j6319J4167m9917
$$ plain form
19670 149993 75943 89374 130479 124507 161743 273691 429904 408238 305759 186937 179803
19659 179803 236534 150002 135983 227888 295004 317320 211279 224336 214239 167912 191685
19648 191685 158637 129093 199944 192664 36098 -44107 81478 200652 200763 178781 309264
19637 309264 302283 292736 280388 214805 128936 74566 -12305 24361 115150 188845 153666 -49764
19625 -49764 -71823 41238 60473 -2056 73105 226531 264995 291584 214440 100511 203739
19614 203739 304058 336408 378073 405886 404466 282407 126768 81194 96768 249152 432774
19603 432774 403534 284282 226764 207622 193282 220898 238714 304943 339264 357024 354463
19592 354463 367540 308328 262366 243274 215742 178204 146426 194982 178663 192830 142913
19581A42913l1725L5268J03354n2351j4200k8198m778o3426q2198J03694R6130
19570B04483m6551q805j8420K9844P2540J08308O3292j28016m4223p8196j20938
19559C3318j12777K23476R1438K0005L7290n4662k6848p453k5729o6987K0085
19548A31156K4886k5210q555M2766J76259Q8007K8390N7863M725R2446P8347l7775
19536F53305J03577Q4271J41447O1262o4714n0081m4046n4405J04965L4226K8153
19525I97960J6027N0671L7844j95361n2932J01059m1727l3831k2977l7505O5319
19514H84547m784k4389q4351l770J8365j00787n3145j55269m3643Q4917J19968
19503F37659l3367j73654j06759m221n2753j2560R3062N7190J39110J07448q9294
$$ plain form
19581 142913 111188 146456 249810 197459 183259 155061 150283 86857 4659 108353 204483
19570 204483 157932 149127 130707 160551 233091 341399 404691 276675 232452 154256 33318
19559 33318 -79459 144017 235455 255460 292750 238088 211240 203787 178058 111071 131156
19548 131156 156042 130832 122277 165043 341302 429309 457699 515562 520287 612733 691080 653305
19536 653305 756882 841153 982600 1043862 979148 929067 885021 830616 935581 969807 997960
19525 997960 1013987 1064658 1102502 907141 854209 955268 913541 879710 856733 819228 884547
19514 884547 879763 855374 771023 767253 785618 684831 631686 476417 432774 517691 637659
19503 637659 604292 430638 323879 319658 266905 254345 347407 404597 543707 651155 561861
19492E61861R8917K4027N9462J7950L2988Q4848j9045k960R3807Q1308J924j06195
19480I28892p634M3553J06387J13509L6197K1248Q7144K270k4165l7041j38889
19469A131471j85531j18159n5982L9429L5830L0965r3450j7533j50276j15261
19459E01503j38254N0767k1927N8652M1000q9415J14452O9532O3691q1892m8078
19448E20031j01049j32164O4517p5886M2708J02904j3422r1453m5497O0550j1443
19437C19796q0549q6477M4749P2542J42017J14035J1549k2733m6963m1988J1993
19426D37971Q9526j9349j00374p4314K7920O2365K4783l0686M651j914j13691
19415C06888j34212j6261L4115R5576P7750O5332O7430R1363K6120n9457o9438
$$ plain form
19492 561861 660778 684805 744267 762217 795205 880053 861008 858048 951855 1033163 1035087 928892
19480 928892 921258 964811 1071198 1184707 1220904 1242152 1329296 1331566 1307401 1270360 1131471
19469 1131471 945940 827781 771799 811228 847058 878023 784573 767040 616764 501503
19459 501503 363249 414016 392089 450741 491741 402326 516778 586310 650001 568109 520031
19448 520031 418982 286818 351335 275449 318157 421061 407639 316186 270689 331239 319796
19437 319796 239247 152770 197519 270061 412078 526113 537662 514929 467966 425978 437971
19426 437971 527497 508148 407774 333460 361380 423745 448528 417842 422493 420579 306888
19415 306888 172676 156415 190530 286106 363856 429188 496618 587981 614101 554644 485206
19404D85206o8662q5238K8480P305J0541q1362L7067Q3580K7271J0801j6409k9746
19392D08834L7437L1415J5309k0924j17237P5600J06415o313L4811n9608J940
19381E07679J4309Q810q2951m08L0536L995L1956k1162q0213M0367M6315O0690
19369E59923Q2502R7741p2550l2545r9843l5444O4689J54639J28831l757Q3433
19358I27619L9321j1831J01835j0690L8460J12832J9495Q4090j95342n3971l8299
19347A013519j61617l6522j2446M7546K7379r5949j06867M1932K9403k552L9021
19336G82847n2861o7462j39698J4980Q5509k3009N2688m332L1954l8012Q316m1517
19324F09403j28356o2692M4245J26051K01724N6340m9687r7005R4175J42184o2979
$$ plain form
19404 485206 416544 331306 359786 367091 377632 296270 333337 416917 444188 454989 438580 408834
19392 408834 446271 477686 492995 472071 354834 430434 536849 530536 565347 505739 507679
19381 507679 521988 530798 447847 447439 477975 481970 513926 492764 412551 452918 499233 559923
19369 559923 642425 740166 667616 635071 535228 499784 564473 719112 847943 844186 927619
19358 927619 966940 955109 1056944 1046254 1084714 1197546 1217041 1301131 1105789 1051818 1013519
19347 1013519 851902 815380 802934 850480 877859 781910 675043 716975 746378 743826 782847
19336 782847 729986 662524 522826 537806 623315 600306 652994 648662 680616 642604 650920 609403
19324 609403 481047 418355 462600 588651 790375 846715 797028 700023 794198 936382 873403
19313H73403j10857Q1584J53375J35730Q9539R9702P1306o1739n1106p0710q4939
19302A125288N41j8176l3893N2865M3069k7244o41J578l7993N8539q7135j18112
19290I58686j18590r6222r7773J18626m4874K087R6285O8271q2783L0899M8133
19279H82745q9132j06205O6701K0991r140j5698j9035O3249J8027r9444O7280
19268G80339R1835l5694k0345L2521K2776K34921k050J0832J21701j5348L1419
19257A252907l5739m4424J01799J06784j55222m7251R107j10428P7729Q3086o008
19246A232340j17942m0388J013p406k2812J24021J86125M6914m9960o6464o1671
19235A223770q5134j2494J80056l7332r1118k9297o5394p9509l2801K4980J16240
$$ plain form
19313 873403 762546 844130 997505 1133235 1222774 1322476 1393782 1332043 1280937 1210227 1125288
19302 1125288 1125829 1107653 1073760 1126625 1169694 1142450 1141809 1143387 1105394 1163933 1076798 958686
19290 958686 840096 743874 646101 764727 719853 721940 818225 886496 803713 834612 882745
19279 882745 793613 687408 754109 775100 765960 750262 731227 794476 812503 713059 780339
19268 780339 872174 836480 816135 848656 871432 1106353 1104303 1115135 1236836 1221488 1252907
19257 1252907 1217168 1172744 1274543 1381327 1226105 1178854 1187961 1077533 1155262 1238348 1232340
19246 1232340 1114398 1074010 1075023 1067617 1044805 1168826 1354951 1401865 1351905 1285441 1223770
19235 1223770 1138636 1126142 1306198 1268866 1177748 1148451 1083057 1003548 970747 995727 1111967
19224A111967K285J8093J5012P668k9641m0989Q5985K4955l9729j4286n5596n6354
19212A029370J9996P5123M8726O0494O9237j8213o0034O1970L8296P7845K12675
19201A615485L677m5854J37648J27961l1431j02214k6335K3831m9469j13626k20596
19190A319077p5157R4327n3030l4227L3872N2043j02651o2566j12967q6869o9133
19179I02719O5407L6036l4096R5047j05482p6689P0451M0479m7398R80p5304N429
19167H77579J0879M5383K0487Q499M2730J3063j43952N0637q238O0512N5607N152
19155A038338q620j3426j9968n1471Q1014O3395m5316J5556n0419l7627l3661
19144I37795K3166j5820J00300J12053k1388o8822j2536P0410l4729m4439J0430
$$ plain form
19224 1111967 1114252 1132345 1147357 1155025 1125384 1084395 1170380 1195335 1155606 1141320 1085724 1029370
19212 1029370 1049366 1124489 1173215 1233709 1302946 1284733 1224699 1286669 1324965 1402810 1615485
19201 1615485 1619162 1573308 1710956 1838917 1807486 1705272 1678937 1702768 1653299 1539673 1319077
19190 1319077 1243920 1338247 1285217 1250990 1284862 1336905 1234254 1171688 1058721 971852 902719
19179 902719 968126 1004162 970066 1065113 959631 882942 953393 993872 946474 947454 872150 877579
19167 877579 888458 933841 954328 962827 1005557 1018620 874668 925305 917067 977579 1033186 1038338
19155 1038338 1029718 1016292 996324 944853 1025867 1089262 1043946 1059502 1009083 971456 937795
19144 937795 960961 945141 1045441 1157494 1136106 1067284 1054748 1125158 1090429 1045990 1056420
19133A056420J38966K8080r3900Q615M0622J2493J292J6213j0668J2034n0813
19122A159354p0504q8196N4057Q9673L7502j674M9028J81729Q0639r1543o3166
19111A336899q85J47216N980P760K7279M1651q4457J9711r441L2422O9675K7327
19099A621137M985k2082N6186Q4954q3849j9358R5225R5420R2168n8674k3082
19088A843030M3375k3822j05108M5660K60017J14052n5732r5758j3932M0693Q4151
19077B136626J83662K1974k0181J20493M8355J31480P4539J22417L38675J34374
19067C292414p5122N2686O2044Q1184K13624J34024K15097Q0148J66984M17343
19057D640426M56757L48724M00977L21718L49732M23065M36597M16641O01035
$$ plain form
19133 1056420 1195386 1223466 1129566 1138181 1178803 1191296 1192588 1208801 1198133 1210167 1159354
19122 1159354 1088850 1000654 1054711 1144384 1181886 1180212 1229240 1410969 1491608 1400065 1336899
19111 1336899 1336014 1483230 1489210 1496970 1524249 1565900 1481443 1501154 1491713 1524135 1593810 1621137
19099 1621137 1626122 1604040 1660226 1745180 1661331 1641973 1737198 1832618 1924786 1866112 1843030
19088 1843030 1886405 1862583 1757475 1803135 2063152 2177204 2121472 2025714 2011782 2052475 2136626
19077 2136626 2320288 2342262 2322081 2442574 2490929 2622409 2696948 2819365 3158040 3292414
19067 3292414 3217292 3269978 3332022 3413206 3626830 3760854 3975951 4056099 4223083 4640426
19057 4640426 5097183 5445907 5846884 6168602 6518334 6941399 7377996 7794637 8395672
19048H395672N99776P07946Q40397J023064J256115J421968J625029K460140L748233
19039B2078340N691024Q257813J1515970J5156253J7959153K1027111K1789008
19032A23474672J2817734L696612K655380o521570j9025268j2430363J702252
19025A06369449J4833591K4634199K5927367J9524502J3464164L585663j7652688
19018A90686247l2925014k9450221j8555228j2221428j2081862j0516136n311647
19011F9624711m79248J813514J440487O63672k99727m050072q366619q007669
19003E2339049n757336l815113k578936j741815q59590k17708L25153Q60822J680773
18994D0235299L093246N222409Q607669J2655809J3710684J1142657J0709150
$$ plain form
19048 8395672 8995448 9703394 10543791 11566855 12822970 14244938 15869967 18330107 22078340
19039 22078340 27769364 36027177 47543147 62699400 80658553 101685664 123474672
19032 123474672 136292406 139989018 142644398 136122828 117097560 104667197 106369449
19025 106369449 121203040 145837239 171764606 191289108 204753272 208338935 190686247
19018 190686247 157761233 128311012 109755784 97534356 85452494 74936358 69624711
19011 69624711 69145463 70958977 72399464 73063136 72763409 68713337 60346718 52339049
19003 52339049 46581713 42766600 40187664 38445849 37586259 37368551 37693704 38554526 40235299
18994 40235299 43328545 48550954 57158623 69814432 83525116 94667773 105376923
18987A05376923J0388207K961686l741900j036381O177266J4331482K1017493
18980A55474776K1328677J5539653J8969832J9737338n953181k3841897j2795304
18973A88459894m718407L04690L468269K71149j669955q447866k8061492l4311869
18965A15294413k4122499j5163965j0021923p122274m945429l085483j637691
18958D9195149l58331O3964l06335n57474j086706l138069m404210l800255k864808
18949C2742925k159313j750947j536840j295959j091531r99877r05689q28569
18941B2174200p72836q49379r11716q29463p58150o94112n98554n26230n98760
18932A5635000o04031n43983l85455m34640n60311n82414m86963l17251m12576
$$ plain form
18987 105376923 115765130 118726816 114984916 113948535 120125801 134457283 155474776
18980 155474776 176803453 192343106 211312938 231050276 225097095 201255198 188459894
18973 188459894 183741487 184046177 187514446 187785595 186115640 177667774 149606282 115294413
18965 115294413 91171914 76007949 65986026 58863752 53918323 50832840 49195149
18958 49195149 48836818 48900782 48594447 48036973 46950267 43812198 39407988 35607733 32742925
18949 32742925 30583612 28832665 27295825 25999866 24908335 23908458 23002769 22174200
18941 22174200 21401364 20551985 19640269 18810806 18052656 17358544 16759990 16233760 15635000
18932 15635000 15030969 14486986 14101531 13666891 13106580 12524166 12037203 11719952 11307376
18923A1307376l48414l51717m17140k99945k60070k70725j97747j46819k24728
18914H790071k60225l44143m03372l67733j19416j06235j14366k82040k64969
18905F527572k14765p5990m8017j76893l55995k32276j61933j33810j47691j36135
18895D844067j35R3331r0229j64214j50046k06801k12680J663K9355q0791l4716
18884D028804n5715r5996j50944j37022m0721m6928j41376q0685M7828J4952L3032
18873C375229l0386l875j14428l5526O0695O8076J8253p0922j87420p6979j29325
18862B873392p1037M412j11377j18429m896P8351Q6683m454p5143l9392m995m9892
18850B563223q5239L0830K3544k07143o6140m4003j33394j21537N6018J09804
$$ plain form
18923 11307376 10958962 10607245 10190105 9890160 9630090 9359365 9161618 9014799 8790071
18914 8790071 8529846 8185703 7782331 7414598 7295182 7188947 7074581 6792541 6527572
18905 6527572 6312807 6236817 6188800 6011907 5655912 5423636 5261703 5127893 4980202 4844067
18895 4844067 4843932 4937263 4847034 4682820 4532774 4325973 4113293 4114956 4144311 4063520 4028804
18884 4028804 3973089 3877093 3726149 3589127 3548406 3501478 3360102 3279417 3327245 3342197 3375229
18873 3375229 3344843 3340968 3226540 3191014 3251709 3319785 3338038 3267116 3079696 3002717 2873392
18862 2873392 2802355 2806767 2695390 2576961 2572065 2650416 2737099 2732645 2657502 2618110 2613115 2563223
18850 2563223 2477984 2508814 2532358 2325215 2259075 2215072 2081678 1960141 2016159 2125963
18840B125963P0795R4226Q4703p4857k9426P533j59306q1407R1379n2610M6025
18829B123018r6176m3195M4918L7368K21372Q5531Q2552K3048J36754P1415R9870
18818B786475O3430m713k5792J01400J07237M5001P2235J47363R4344L2017K0553
18807C439550p3484n6089N5452M9986M533m4777j9087j43077r5782r7279K182
18796C022128L3819J00713K1506M8313R2002L4576O2398J14273Q5105J19996M368
18785C739197p1005j51290O1850J02641J1672J35702Q0684N8531J18124K32724
18775D318830J92895J66262K98772L25672L98377L48935M30863M87645L51791
18766G320042N39153N49047N64394O54875P39166P42543J110711J665653K633207
$$ plain form
18840 2125963 2196758 2290984 2375687 2300830 2271404 2278937 2119631 2038224 2129603 2076993 2123018
18829 2123018 2026842 1983647 2028565 2065933 2287305 2372836 2455388 2478436 2615190 2686605 2786475
18818 2786475 2849905 2845192 2819400 2920800 3028037 3073038 3145273 3292636 3386980 3418997 3439550
18807 3439550 3366066 3309977 3365429 3415415 3419948 3375171 3356084 3213007 3117225 3019946 3022128
18796 3022128 3055947 3156660 3178166 3226479 3318481 3353057 3415455 3529728 3614833 3734829 3739197
18785 3739197 3668192 3516902 3578752 3681393 3693065 3828767 3909451 3967982 4086106 4318830
18775 4318830 4511725 4677987 4976759 5302431 5700808 6049743 6480606 6968251 7320042
18766 7320042 7859195 8408242 8972636 9627511 10366677 11109220 12219931 13885584 16518791
18757A6518791M019351N342015N367268N130914O295393O548187O551200J0529430
18749F6302549J5217998J4261500J0582802Q621226K101594j0658047j1674831
18742I4754791j40830J2878537K0137876J8534047J8692488J8443285R56925j9692407
18734A64564712k1202599k0249905k2421286j9103989j1846592o399864k274793
18727F1065684Q08328J568627Q06868M82513j213062n817778q188693o471245
18719D3041242m063018k667264j791912j237666o63475l55280q8491K84738P85371
18710C3244245J824777L281607N407510Q250747R586324R207552J0804514J3204109
18702I4811385J0811627O741269O872971P699280N154399K168097M436284J3160832
$$ plain form
18757 16518791 20538142 25880157 31247425 36378339 42673732 49221919 55773119 66302549
18749 66302549 81520547 95782047 106364849 114986075 117087669 106429622 94754791
18742 94754791 94613961 107492498 127630374 146164421 164856909 183300194 184257119 164564712
18734 164564712 143362113 123112208 100690922 81586933 69740341 63340477 61065684
18727 61065684 61874012 63442639 64249507 64732020 63518958 57701180 49512487 43041242
18719 43041242 38978224 36310960 34519048 33281382 32617907 32262627 32174136 32458874 33244245
18710 33244245 35069022 38350629 43758139 52008886 61595210 70802762 81607276 94811385
18702 94811385 105623012 112364281 119237252 126936532 132090931 134259028 138695312 151856144
18694A51856144J9127294J7638648K1561890K2468037N448280o263182L42197
18687B32179308R102881J0928035l234068j4229418j5706506k7879529l9990358
18680A51170345l3683188k1979539j4305348r867776o913742m724956k954700
18673E6741096j492587k44304j72831o83830o04512j306539m279920n600740m418422
18664C7937411l004232k259443j799784j420382j298854j270618j359344j285500
18656B4239254j093633j004912p83998p15061o28680o93964o54116n57040n98097
18647A7509753m45538m68219l84069l96414o14891n01959m59857m66931n13152
18638A3258723m53335m68786n34118m17806j96108k28707m52731l60142l25328
$$ plain form
18694 151856144 170983438 188622086 210183976 232652013 238100293 231837111 232179308
18687 232179308 241282189 252210224 248976156 234746738 219040232 191160703 151170345
18680 151170345 117487157 95507618 81202270 71334494 64420752 59695796 56741096
18673 56741096 55248509 55004205 54831374 54147544 53543032 52236493 47956573 42355833 37937411
18664 37937411 34933179 32673736 30873952 29453570 28154716 26884098 25524754 24239254
18656 24239254 23145621 22140709 21356711 20641650 20012970 19319006 18664890 18107850 17509753
18647 17509753 17064215 16595996 16211927 15815513 15200622 14698663 14238806 13771875 13258723
18638 13258723 12805388 12336602 11802484 11384678 11188570 10959863 10507132 10146990 9821662
18629I821662k94171k78463j93025k83742l03073k33757j46573j92375k18222
18620G678261k20586k07150k76947k59409j22447j14373j37197j3559j4590p816
18610F304187n8688j44331p6745j04597r7131j722p1658j49460j68258p6652l9379
18599E315566q6942j65080N377R800j84706k9622K3128l5993J8677o9930j31283
18588D668992j25464j36402j70721k5396J9397m3185m0803l7483j16672j81313
18578C810950r5064J13643O4267J27777l5561M2646J30004P6423J79423J21704
18568D536212J48777K32451K10761J62764k1583J46656J60808J53312K66483K37185
18558F233826L30841L33709L97582L62847O12412R03952J094127J722948K640651
$$ plain form
18629 9821662 9527491 9249028 9056003 8772261 8469188 8235431 8088858 7896483 7678261
18620 7678261 7457675 7250525 6973578 6714169 6591722 6477349 6340152 6326593 6312003 6304187
18610 6304187 6245499 6101168 6024423 5919826 5822695 5820973 5749315 5599855 5431597 5354945 5315566
18599 5315566 5228624 5063544 5068921 5078721 4894015 4864393 4887521 4851528 4870205 4800275 4668992
18588 4668992 4543528 4407126 4236405 4211009 4230406 4187221 4146418 4108935 3992263 3810950
18578 3810950 3715886 3829529 3893796 4021573 3986012 4028658 4158662 4235085 4414508 4536212
18568 4536212 4684989 4917440 5128201 5290965 5269382 5416038 5576846 5730158 5996641 6233826
18558 6233826 6564667 6898376 7295958 7658805 8271217 9175169 10269296 11992244 14632895
18549A4632895M025043M578132L792264L769073M303884L022939K408138O223918
18541D6756286R997801R710962J0176106J3442783J1726373N818911N935148O649436
18533A20213806L904622k540552j1758645j8391311j8807776j3605140q071621
18526E0943383m222229r56112J542537L041880K314681J323187J032674k539846
18518E2480155p209050o991968m798723l034375k105966j515240r50591n05823
18510B5368419j00485J31758P82159J577352K730732M107785M337490L567703
18502D2502913L881686L972576J914208J325598L695073N969572R466619J4141762
18494H6870007J7087528J6711248J8615981K6272487K9691046J9188881J1156995
$$ plain form
18549 14632895 18657938 23236070 27028334 30797407 35101291 38124230 40532368 46756286
18541 46756286 56754087 66465049 76641155 90083938 101810311 107629222 113564370 120213806
18533 120213806 124118428 121577876 109819231 91427920 72620144 59015004 50943383
18526 50943383 46721154 45765042 47307579 50349459 52664140 53987327 55020001 52480155
18518 52480155 45271105 38279137 33480414 30446039 28340073 26824833 25874242 25368419
18510 25368419 25267934 25399692 26181851 27759203 30489935 34597720 38935210 42502913
18502 42502913 46384599 50357175 52271383 53596981 57292054 63261626 72728245 86870007
18494 86870007 103957535 120668783 139284764 165557251 195248297 214437178 225594173
18487B25594173J1403931M486857j4354471k7918604k9415363k5756052j6042101
18480A27998370m428237J154625J065361J284991q04168j0642747j7635222j5477784
18472H2515189j0801560p400134n292926n183670n266115m374704l175031k317686
18464C8703363j874723j482755j126050p89786p03691o40704m30896j76385j52175
18455C1326198K66427Q74321J934227L449534N537682P829764P650223N682401
18447F4550777N406881L875433j228917k353654K176492N886783J0037164J5761810
18439A04112769J5408163Q388611Q813368R896227l163278j5001882j2853976
18432A15600002j3670355j9668233j7192686j1361880p138183m612205k912643
$$ plain form
18487 225594173 236998104 241484961 227130490 199211886 169796523 144040471 127998370
18480 127998370 123570133 124724758 125790119 127075110 126270942 115628195 97992973 82515189
18472 82515189 71713629 64313495 59020569 53836899 48570784 44196080 41021049 38703363
18464 38703363 36828640 35345885 34219835 33430049 32726358 32085654 31654758 31478373 31326198
18455 31326198 31592625 32466946 34401173 37850707 43388389 51218153 58868376 64550777
18447 64550777 69957658 73833091 72604174 70250520 72427012 78313795 88350959 104112769
18439 104112769 119520932 127909543 136722911 146619138 143455860 128453978 115600002
18432 115600002 101929647 82261414 65068728 53706848 46568665 41956460 39043817
18425C9043817j403669m01676n56583p90342o71487j719455l313330l267333k385486
18416B4534456j765798j211223q25106p70070p19022m98845m64020p16487o15268
18407A6948617n48305o09741m68529l38950l51887l38332l44856l87679j54683
18398A3405655J0298j59694j38259k32318j14452o5277n5604p6831j20351r4435
18388A2358732R0706J55148K27514J68878K39512N3578P1619L54434O84587J127871
18378A5532579J728022K790169M403637N769202O779451Q455304P836831L626544
18370E6921739J424063M34548m169745o037280j656565M150245R386821J1232466
18362G1686292J0902886Q882724L732457m291940j0714945j5256683j2301923
$$ plain form
18425 39043817 37640148 37238472 36681889 35891547 35220060 33500605 30187275 26919942 24534456
18416 24534456 22768658 21557435 20732329 19962259 19243237 18744392 18280372 17563885 16948617
18407 16948617 16400312 15790571 15322042 14983092 14631205 14292873 13948017 13560338 13405655
18398 13405655 13415953 13256259 13118000 12885682 12771230 12705953 12650349 12573518 12453167 12358732
18388 12358732 12449438 12604586 12832100 13000978 13240490 13294068 13365687 13720121 14404708 15532579
18378 15532579 17260601 20050770 24454407 30223609 37003060 45458364 53295195 56921739
18370 56921739 58345802 58780350 54610605 48573325 46916760 51067005 60453826 71686292
18362 71686292 82589178 91471902 95204359 90912419 80197474 64940791 52638868
18355E2638868p309057l464888k26584K011550K427088J411977J068992l36378
18347D8221568m245064n882575m372450k740071j707989j065873l55325L8253
18339B7890474M20259Q74275J599021K497137L884222N786160P205769Q680697
18331E8838014J1731263J3618232R954973P047405R272912Q395524N341056J2668004
18323A36867383K3849591L1260886L4929282L5005327L1266016J8065189o028012
18316C05215662j4966136j2912235k5379125l6696597k8847604j4518897l315685
18309A68579383k450221o298208k761607k825206r170909j1025172j2064059j7384566
18301A04599435j6692851j1596741p719262n353333l797214k706421k123998j536964
$$ plain form
18355 52638868 45329811 41864923 41638339 43649889 46076977 47488954 48557946 48221568
18347 48221568 43976504 38093929 33721479 30981408 29273419 28207546 27852221 27890474
18339 27890474 28310733 29185008 30784029 33281166 37165388 42951548 50157317 58838014
18331 58838014 70569277 84187509 94142482 101189887 110462799 118858323 124199379 136867383
18323 136867383 160716974 191977860 226907142 261912469 293178485 311243674 305215662
18316 305215662 290249526 277337291 251958166 215261569 186413965 171895068 168579383
18309 168579383 166129162 159830954 157069347 154244141 145073232 134048060 121984001 104599435
18301 104599435 87906584 76309843 68590581 63237248 59440034 56733613 54609615 53072651
18293E3072651j007272k56701Q34877K556177M530233N216443M116823M294209
18285G3357440M660022J394560L20484N238367J1013307J3823103J6108413J9279951
18277A45195647J7513506J2876819J5579209J9910779K0033583J9028311J4617004
18270B64754858P668893j304300j6269780k5173164k7607384k0960082j3658532
18263A67450509j6747232k1729591j6588815j0546066o727644l495870l493952
18256H8121339o533281o752052m807850m464920n812161n459359m049990l074854
18248D7166872k185475j688923j377713j182127r75185p32074l63637l7698L80199
18239C9004239J405287K778185M437558N428650O160677Q511547J0373922P488398
$$ plain form
18293 53072651 52065379 51808678 52643555 55199732 59729965 64946408 69063231 73357440
18285 73357440 78017462 79412022 79732506 84970873 95984180 109807283 125915696 145195647
18277 145195647 162709153 175585972 191165181 211075960 231109543 250137854 264754858
18270 264754858 272423751 271119451 254849671 229676507 202069123 181109041 167450509
18263 167450509 150703277 128973686 112384871 101838805 95111161 91615291 88121339
18256 88121339 81588058 74836006 70028156 65563236 59751075 54291716 50241726 47166872
18248 47166872 44981397 43292474 41914761 40732634 39757449 39025375 38661738 38624040 39004239
18239 39004239 40409526 43187711 47625269 53053919 59214596 67726143 78100065 85588463
18231H5588463M456618O435908O990967M67792l344471J117797O352147P668937
18223A15734158Q897868P756181O878687P286950l382589j9146527j8895925j2366221
18215I2762582o847675r41759Q65330j58178K59461k397754j0725247j3252517
18207E9564243r665572o376005m323968l045938k273538j596328r60102o96828
18199C0625964n69489j3212Q78715K057860L595774M413409L021226K199593J967595
18190D8177435j090104n379997n082789l044102j105233L20690J854373L815249
18182C8465522O864944R812323J1695743J4819064J7324062J3396248N222647
18175A17600553J827189k829323j4081992j9068995j4373489j0079184r146945
$$ plain form
18231 85588463 90045081 96480989 103471956 103939748 100595277 101713074 108065221 115734158
18223 115734158 124632026 132388207 139266894 146553844 143171255 124024728 105128803 92762582
18215 92762582 85914907 84973148 85838478 85680300 85939761 83542007 72816760 59564243
18207 59564243 49898671 43522666 39198698 36152760 33879222 32282894 31322792 30625964
18199 30625964 30056475 30043263 30921978 32979838 36575612 40989021 44010247 46209840 48177435
18190 48177435 47087331 41707334 36624545 33580443 32475210 32795900 34650273 38465522
18182 38465522 45330466 55142789 66838532 81657596 98981658 112377906 117600553
18175 117600553 119427742 116598419 102516427 83447432 69073943 58994759 49847814
18168D9847814p771995n604628l789570k669341k133320j379153r01496O6525
18160B5664836J000991J804830J655687J050325O24036n23863l019249l781712
18152B4475881k868233k120291j425956j137244p21979m53463l29801O4486K65672
18143A5749072P29554J582072K508699K339252J610481J627794J104804j221870
18135B6029858k039492n45205J596623L507695L265232J908456J977898M27736
18127C6128801m290525n356082k933619q72608L35409J95685K33556M22437o32186
18118B3230868k467092k172841j063002l20962N60776J477725K804068M820625
18110B6870165Q402334J5974043K8352297L1583491J5363356J3927309J7924655
$$ plain form
18168 49847814 42075819 36471191 32681621 30012280 27878960 26499807 25598311 25664836
18160 25664836 26665827 28470657 30126344 31176669 31800705 31276842 28257593 24475881
18152 24475881 21607648 19487357 18061401 16924157 16202178 15748715 15418914 15483400 15749072
18143 15749072 16478626 18060698 20569397 22908649 24519130 26146924 27251728 26029858
18135 26029858 23990366 23445161 25041784 28549479 31814711 33723167 35701065 36128801
18127 36128801 31838276 26482194 23548575 22675967 23011376 23207061 23440617 23863054 23230868
18118 23230868 20763776 18590935 17527933 17206971 17767747 19245472 22049540 26870165
18110 26870165 35272499 51246542 79598839 111182330 126545686 140472995 158397650
18103A58397650j6898206m6908789l0692792j6161765r858675o554489m542777
18096B6780157l184790k382470j940017j528973j252220j000536p85921o68781
18088A4036449m75981m98253n92883n53575n29583m19911l51482k73643l61006
18079I980132n58738l78584m27838m62040l80366k84310k87887k70726j64412
18070F765231k05056k67942k03172k02945j15063k23870k68967j56568j39690
18061D981958p0731k03155k67247j60184o7358j61737k15621p8974j94511j42445
18051C419995r9348n4683j03978m6451p4765n9849J33752k6703k02018j04399
18041B781553J58344J48529n4936j58234j8013J03282J9727j1539j01758k21421
$$ plain form
18103 158397650 141499444 94590655 63897863 47736098 37877423 31322934 26780157
18096 26780157 23595367 21212897 19272880 17743907 16491687 15491151 14705230 14036449
18088 14036449 13560468 13062215 12469332 11915757 11386174 10966263 10614781 10341138 9980132
18079 9980132 9421394 9042810 8614972 8152932 7772566 7488256 7200369 6929643 6765231
18070 6765231 6560175 6292233 6089061 5886116 5771053 5547183 5278216 5121648 4981958
18061 4981958 4911227 4708072 4440825 4280641 4213283 4051546 3835925 3756951 3562440 3419995
18051 3419995 3320647 3265964 3161986 3115535 3040770 2980921 3114673 3087970 2885952 2781553
18041 2781553 2939897 3088426 3033490 2875256 2857243 2960525 2980252 2968713 2866955 2645534
18031B645534j54223m7004j16204j21172j10644j3889O6558R1782n4508k2071
18021B164159P7924Q2983l027q0628l761j67281j95722p4487m9635o9730q2081
18010A598714q8983k7333o3870k16318r3701J00316P653j185q09N9280L9360n662
17998A307462q1329j57975j11426q2391l3097m3912q4260q1021N0375l4125o7860
17987E80441J9455O4794M1106J9675L4573K5883J4618O9327J23161J89573J38038
17976A320644j14086k4922P9251J01907R427O1487m7427j24395n6352m8726j39693
17965A017115O4864L7339l2411j05322p5217J08308j8602n9082j49288j31283
17955F56421N9983k2019J17429p2770l2511j10648M5120P7671r2332m5295K2068
$$ plain form
18031 2645534 2491311 2444307 2328103 2206931 2096287 2082398 2148956 2240738 2186230 2164159
18021 2164159 2242083 2325066 2322039 2241411 2237650 2070369 1874647 1800160 1750525 1680795 1598714
18010 1598714 1509731 1482398 1418528 1202210 1108509 1208825 1216478 1215293 1214484 1273764 1313124 1307462
17998 1307462 1226133 1068158 956732 874341 841244 797332 713072 632051 682426 648301 580441
17987 580441 599896 664690 705796 725471 760044 785927 800545 869872 993033 1182606 1320644
17976 1320644 1206558 1181636 1260887 1362794 1372221 1433708 1386281 1261886 1205534 1156808 1017115
17965 1017115 1081979 1119318 1086907 981585 906368 1014676 996074 936992 787704 656421
17955 656421 716404 694385 811814 739044 706533 595885 641005 718676 626344 581049 603117
17944F03117q7988l0273m3023Q6475L0147J6882K5103o2018j13521q0329k9535
17933C15037Q3974N4340K2809J64964L4344M2307J13101k4059j22748j73736j47862
17922C62471j57386R103k8374o5020L6375j2230Q0422J42587O3598J23110j865
17911E52791j57490l1289O537q3239K5926k219j6013n4631J14289Q5828J0847
17900D51337l0277L1166l4268j13486K3126l5563m7624m262j2405M6278j30705
17889A43317j60775k856P3905M5792N1397J2567K127r4453n5249j8829Q1517N7589
17877A36049N3407p4261J10905N4863j94594J7677J27125O8607l4663j06189n7035
17866A01891n4278l7176J28729J27513J94394R8156J5522q6199Q2513J00367K557
$$ plain form
17944 603117 515129 484856 441833 528308 558455 575337 600440 538422 424901 344572 315037
17933 315037 399011 453351 476160 641124 675468 717775 830876 806817 684069 510333 362471
17922 362471 205085 214188 185814 120794 157169 144939 225361 367948 431546 554656 552791
17911 552791 395301 364012 370549 287310 313236 311017 295004 240373 354662 440490 451337
17900 451337 421060 452226 417958 304472 327598 292035 244411 240149 227744 274022 143317
17889 143317 -17458 -20314 53591 99383 150780 163347 165474 71021 15772 -3057 78460 136049
17877 136049 189456 115195 226100 280963 86369 104046 231171 299778 265115 158926 101891
17866 101891 47613 10437 139166 266679 461073 559229 574751 488552 571065 671432 673989
17855F73989n1937J3977M704P9724P0360j34385m3349K2225j5221K3224j22649
17844E20662p9191L9176r5780r1592l0386j11628j70718r1634K6689K7703N5190
17833a509O0297k58M1839j5794J34367L7018p3946n4307m8082N1571J37193K0195
17821B88584r3286m7282M5065R0361J04596k5997J11359J69059J82606J27155
17811I52220K01371N4747j01199j52687M8437O4410L9571n178l289J6278j09089
17800A005592j62167l6124r142k0652n3184l8564m211o8111p3579r3200m5426
17789D01232M1583k8844j08562j85909J04055Q881j92311j1757k3115N357J43364
17778A53974M5111n214M6902L4758J4469O2443N8513O1363r257R618N604l1098
$$ plain form
17855 673989 622052 636029 640733 720457 790817 656432 613083 635308 620087 643311 520662
17844 520662 441471 480647 384867 293275 262889 151261 -19457 -111091 -84402 -56699 -1509
17833 -1509 58788 58530 100369 84575 218942 255960 182014 127707 79625 131196 268389 288584
17821 288584 195298 148016 193081 283442 388038 362041 473400 642459 825065 952220
17811 952220 1153591 1208338 1107139 954452 1002889 1067299 1106870 1101692 1098403 1114681 1005592
17800 1005592 843425 807301 798159 777507 724323 685759 681548 613437 539858 446658 401232
17789 401232 442815 413971 305409 119500 223555 232436 40125 28368 5253 10610 153974
17778 153974 199085 193871 240773 275531 290000 352443 410956 472319 463062 472680 478284 447186
17766D47186P0850J68686N0443N9858J5146p124k6189L8665n1271j11147l1427
17755F23676n3842p4738l6324N8729J28087Q012p5193O784j18326j27137k7913
17744C11815l549m411n8243L7032m464N167L5637r6935j25167m656j25911p9351
17732a13036r16Q4500Q1492J42046O6128J3404O0665j6715r7673Q3533K19775
17721E23203K1252o2426Q8783p6813j69898k3734r2760l6811O7331q0280n5933
17710A01914Q6653m3523k830p804m4446J24738P0796j92504j155J52869r1291
17699A53417q4079O6469m1220j73052n526J98368L1294j07444j62949n672J1611
17688a18783o536N9289K8294J03032P1810Q8197M5550N6961L8383O9360l6173
$$ plain form
17766 447186 518036 686722 737165 797023 812169 805045 778856 817521 766250 655103 623676
17755 623676 569834 495096 458772 517501 645588 653600 578407 585191 466865 339728 311815
17744 311815 308266 303855 245612 282644 278180 283347 318984 222049 96882 92226 -33685 -113036
17732 -113036 -113952 -29452 52040 194086 260214 273618 334283 317568 219895 303428 523203
17721 523203 544455 482029 570812 493999 324101 300367 207607 170796 238127 157847 101914
17710 101914 188567 145044 142214 134410 89964 214702 285498 92994 91839 244708 153417
17699 153417 69338 135807 94587 -78465 -83991 114377 145671 38227 -124722 -130394 -118783
17688 -118783 -125319 -66030 -37736 65296 137106 225303 270853 327814 366197 435557 399384
17677C99384m3314k0320P8028J50422L3849Q1022J2743o7587j31837l3706Q399
17666D67083p2956j9131q7115o4254j61487m2932k1282M0867m4699m3737o3895
17655a13538k3877m9944K1566J39320q048P5144o7618l3172O0422N2748n4859
17644a856l759L461J1450R4717n6319Q315Q3476J33939k8566M672r016J15150
17632C55664j15285j70403k2678M3947J13632m2702k05620L2190P8844J10304
17622A77893n0985j12309k7273P9748O2445n6621r8172n8812Q5276n4293m5643
17611i8746R6890J7100j50640k2387n5967q6690m3063J12905R7080K7008q1483
17600a87993j0888P6377N0853r941J1207M4896M3485n9328p0485p7399M6063k507
$$ plain form
17677 399384 356070 335750 413778 564200 598049 679071 691814 624227 492390 458684 467083
17666 467083 394127 374996 287881 223627 62140 19208 -2074 38793 -5906 -49643 -113538
17655 -113538 -137415 -187359 -165793 -26473 -34521 40623 -26995 -60167 255 53003 -1856
17644 -1856 -5615 -2154 9296 104013 47694 56009 139485 273424 244858 249530 240514 355664
17632 355664 240379 69976 47298 91245 204877 162175 -43445 -11255 67589 177893
17622 177893 126908 14599 -12674 67074 129519 72898 -25274 -84086 1190 -53103 -98746
17611 -98746 -1856 15244 -135396 -157783 -213750 -300440 -343503 -230598 -133518 -106510 -187993
17600 -187993 -198881 -122504 -71651 -81592 -70385 -25489 17996 -41332 -111817 -189216 -143153 -145660
17588a45660j5103M4722J2089j8301k572m8491n7203M2396J36184J03825m5089
17577F797M3028k4888j5063J59941J818j28487j34313q4407Q2335K1343j43240
17566b15136j06278J18214J35928n3309m2274k5842N6153J25144j656Q0694j9907
17555E1731o7167r3036j49908j67642J34169J74748o8452r0037N324N5324K782
17544b12164l4294l7929L7162N9166l567Q7969k003P8172Q8151j17500p1753l1468
17532a60058R2725J17856Q4783L8184j23309j06993P7900q0636k8411k0860r2480
17521b01299J8279Q9129J01191N880L4520k6465J8913k0657j84223k13459o6829
17510d45020O1317M6092K5252J41754j3910J8476K1463j511L4663k8743m1019
$$ plain form
17588 -145660 -160763 -116041 -103952 -122253 -124825 -173316 -230519 -188123 -51939 51886 6797
17577 6797 49825 24937 9874 169815 171633 43146 -91167 -175574 -93239 -71896 -215136
17566 -215136 -321414 -203200 -67272 -120581 -162855 -188697 -132544 -7400 -9056 71638 51731
17555 51731 -15436 -108472 -258380 -426022 -291853 -117105 -185557 -275594 -270270 -214946 -212164
17544 -212164 -246458 -284387 -247225 -188059 -191626 -103657 -105660 -27488 60663 -56837 -128590 -160058
17532 -160058 -67333 50523 135306 173490 50181 -56812 21088 -59548 -87959 -108819 -201299
17521 -201299 -183020 -93891 7300 13180 47700 21235 40148 19491 -164732 -378191 -445020
17510 -445020 -383703 -337611 -312359 -170605 -184515 -166039 -144576 -146087 -111424 -140167 -181186
17499a81186P9512l8881l4524j8869J5783L5547N6609R409N1595L6410j51568
17488a40163P1684K3432p2596o5155m4916M5474p567m764Q4665J5893L783M202
17476h6028L5770P7162M7699j05373p140M6979L0038O1056M7039P7835O7328L2318
17464C24683l321R1020L9131n6513o492j25855l3701m5192j2854J6896l2411O6299
17452B21690J24412N9941L2674P7539K0968K7422N0479J25664K00331J51412J38938
17441A231470K16024J12043k9046j0402L2114j82185j85580m4197q9484k62583
17431G88174j22463J3874P1107k7303j23023m4973K6593K5816J05561P2533N689
17420G91585K7172J07984O6792j00326k08558j52997n909j62475j64424r4364
$$ plain form
17499 -181186 -101674 -140555 -175079 -193948 -178165 -142618 -86009 -76600 -25005 11405 -140163
17488 -140163 -68479 -45047 -117643 -182798 -227714 -182240 -189807 -194571 -109906 -94013 -90230 -86028
17476 -86028 -50258 26904 74603 -30770 -37910 9069 39107 100163 147202 225037 292365 324683
17464 324683 321362 412382 451513 395000 388508 262653 228952 183760 170906 187802 155391 221690
17452 221690 346102 406043 438717 516256 537224 564646 615125 740789 941120 1092532 1231470
17441 1231470 1447494 1559537 1530491 1520089 1552203 1370018 1184438 1140241 1050757 788174
17431 788174 665711 679585 750692 723389 600366 555393 581986 607802 713363 785896 791585
17420 791585 818757 926741 993533 893207 684649 531652 525743 363268 198844 104480
17410A04480k2322J888L6068J73734n8746O2076P6762p780P5911p764l152j13333
17398C17822m337N2846L243N36k0712L3250O5377P2565J15463P5829K9965L8383
17386G80230K999q7234N8812Q7462J21949P1610n1461k13659j81424q2773m8403
17375D58108k7027P2128l1293k3324l2754n2952j28611n488R7278K8643j52554
17364B02154j50387J5777M5388M6432J6688O9356k5687m8590J5319j3551r6353
17353G6546j24336j2040O8838N4756M5313N9240J286p9665k1541q4784j09591
17342a25978r297j41996M9578J04886j5826P2117J65145M9443j01637k3202R7625
17331A20858j4877j85647j15464j9669Q8737j386J1702L9316L9868K6777M1297
$$ plain form
17410 104480 82158 84046 120114 293848 235102 297178 373940 366160 442071 434307 431155 317822
17398 317822 313485 366331 369574 370110 349398 382648 448025 520590 636053 711882 741847 780230
17386 780230 783229 695995 754807 842269 964218 1035828 984367 770708 589284 506511 458108
17375 458108 431081 503209 471916 448592 415838 362886 234275 228787 326065 354708 202154
17364 202154 51767 67544 112932 159364 176052 245408 219721 171131 186450 172899 76546
17353 76546 -47790 -59830 9008 63764 109077 168317 169603 89938 68397 -16387 -125978
17342 -125978 -135275 -277271 -227693 -122807 -138633 -66516 98629 148072 46435 23233 120858
17331 120858 105981 -79666 -195130 -214799 -126062 -127448 -115746 -76430 -36562 -9785 31512
17320C1512Q612n108J3655N796k8198k4188K1720k2722R2103J17867N390p9662
17308A36777J864n0907p0456k2586j4328q3202l3420O8269N9521M4066l9841n2275
17296e6518n3863O0547K2380J6371K8959Q1422k6290j36786q6835L6831j2019
17285a25801J81084m2937L8281O2821r0086r6352j06369k6558Q881j3493Q864
17274b01665J41907Q1009k2649k4614n4714M634K7555J12021p7913p9339L508
17263i0260K2320k0472l9704J17747J71307l1338r3233j15132L7666j08136j02977
17252b52212M8096O1564J14361L2163j4101L3488J87318r3393j72440j34241k0232
17241b09629R6891J24950p7455k0414j21960k6989J92859J24539n7415K8333m4786
$$ plain form
17320 31512 40124 35016 48671 54467 26269 2081 23801 1079 93182 211049 216439 136777
17308 136777 138641 87734 17278 -5308 -19636 -102838 -136258 -67989 -8468 35598 -4243 -56518
17296 -56518 -110381 -49834 -27454 -11083 17876 99298 73008 -63778 -150613 -113782 -125801
17285 -125801 55283 12346 50627 113448 23362 -72990 -179359 -205917 -197036 -210529 -201665
17274 -201665 -59758 21251 -1398 -26012 -80726 -76092 -48537 63484 -14429 -93768 -90260
17263 -90260 -67940 -88412 -128116 -10369 160938 129600 36367 -78765 -41099 -149235 -252212
17252 -252212 -204116 -142552 -28191 3972 -10129 23359 210677 117284 -55156 -189397 -209629
17241 -209629 -112738 12212 -65243 -85657 -207617 -234606 -41747 82792 25377 53710 8924
17230H924Q5428J10237Q3228j79976k6335N9745q4717m5265L3006J18466O340
17219A69081l4995J2019m8823j3422j1800j01021L2161L8759R2818Q8070j93904
17208B8943j35865p901j7073J1625r0051j152O6003J41820p7911k6768P0871R9754
17196F2295q440j44455j83893R553O0260J17836j8595J97580m8819J750J6349
17185F1421n8923K7997o0490j77348O2402O0531j2152M88J11295J39245j9951
17174A34515L7577j8796N925R8708r682j53886l8245j9396r7218m1572J40799
17163C8729Q7081m8439l5651l4548J9731K2612P0949m0414j28112j17072J55457
17152i677R3658j04169J74500R7875j00000j24363M4154M938j4553k8713J8745
$$ plain form
17230 8924 94352 204589 287817 107841 81506 141251 56534 11269 44275 162741 169081
17219 169081 134086 146105 97282 83860 72060 -28961 3200 41959 134777 222847 28943
17208 28943 -106922 -114823 -131896 -120271 -210322 -211474 -145471 -3651 -81562 -108330 -37459 62295
17196 62295 53855 -90600 -274493 -264940 -204680 -86844 -105439 92141 43322 45072 61421
17185 61421 2498 30495 -29995 -207343 -144941 -84410 -96562 -96074 15221 154466 134515
17174 134515 172092 153296 159221 257929 248247 94361 56116 36720 -60498 -102070 38729
17163 38729 125810 77371 41720 7172 26903 49515 120464 80050 -48062 -165134 -9677
17152 -9677 83981 -20188 154312 252187 152187 27824 71978 76916 62363 33650 52395
17141E2395o8542n6899l3948m5722N4928l7914j7869O8417J0888O257j4223p4560
17129a56792o5740p7943m1611N8989J00346R9262Q877J14581P9659m404k4466
17118I0758K8452p4332j05928l0021J47182K5828n0236j44138r3284K1841P9142
17107a04736Q3457n0380K5165k2946q0162j72284m740J74680J91060p0514p8451
17096a09851o9667K6148N2691j0236m5766o3951n4357l6359Q3056J79022o092
17085e5362n5201l7766n1264j0361j2966L1869L5095R6292o4402N4574N7160n5494
17073f7826m3039M5762K1584m2057k7728j06814P0351P1121J0672R3826R293l8910
17061c765m1875n9948o114r086J0722R9099k6214j8989m4445j18381L7077J23591
$$ plain form
17141 52395 -16147 -73046 -106994 -152716 -97788 -135702 -153571 -85154 -74266 -68009 -82232 -156792
17129 -156792 -222532 -300475 -342086 -283097 -182751 -83489 -74612 39969 119628 115224 90758
17118 90758 119210 44878 -61050 -91071 56111 81939 31703 -112435 -205719 -183878 -104736
17107 -104736 -21279 -71659 -46494 -69440 -149602 -321886 -326626 -151946 39114 -31400 -109851
17096 -109851 -179518 -153370 -100679 -110915 -156681 -220632 -274989 -311348 -228292 -49270 -55362
17085 -55362 -110563 -148329 -199593 -209954 -222920 -191051 -155956 -59664 -124066 -69492 -12332 -67826
17073 -67826 -110865 -65103 -43519 -85576 -113304 -220118 -149767 -78646 -67974 25852 35145 -3765
17061 -3765 -45640 -105588 -111702 -120788 -110066 -10967 -37181 -56170 -100615 -218996 -181919 -58328
17049e8328O3586M0868q3525n9731J41388O2511j08986R073N5774q6639O7147
17038D3138M346m3932j43077J8878L584m9264R244L8431n7368j1017l3943L8573
17026a82407M618J3177P177o191l6935J22056L5414l6517j32992j41448J9500
17015c34548N3329p935N7342M7428o1513J5071K1148M437o1106L6489O8335J3859
17003a47664N7842P8657J1302O6512N6667O258L2873k8060r6138q412m6336r4619
16991a11118j7894J66922N4480j25506j29078p439M0544J35460p7694r019O5730
16980a4612p738K4240n7390j35593R55n7539k9177Q8849L2171M0610N0420J7660
16968d7144p6470k5983N8344L9804j4752j8495l3245O2611K1404o4476k9263m0641
$$ plain form
17049 -58328 5258 46126 -37399 -97130 44258 106769 -2217 6856 62630 -24009 43138
17038 43138 47484 3552 -139525 -120647 -117063 -166327 -157083 -118652 -176020 -187037 -220980 -182407
17026 -182407 -177789 -164612 -157435 -163626 -200561 -78505 -43091 -79608 -212600 -354048 -334548
17015 -334548 -281219 -289154 -231812 -184384 -245897 -230826 -209678 -205241 -266347 -229858 -161523 -147664
17003 -147664 -89822 -11165 137 66649 123316 129574 162447 134387 38249 29837 -16499 -111118
16991 -111118 -129012 37910 92390 -33116 -162194 -169633 -129089 6371 -71323 -80342 -14612
16980 -14612 -22350 1890 -55500 -191093 -190138 -247677 -276854 -188005 -155834 -115224 -64804 -47144
16968 -47144 -123614 -149597 -91253 -51449 -66201 -84696 -117941 -55330 -33926 -98402 -127665 -168306
16956a68306p685j2408n4122M3022J8336l3102n7863O5617M4028m4147j3844J3137
16944b07337J02169P4788k5910n3539P7301M5851N3561j35236o5544M4271k5948
16933a15573l8413R88L5840k4437O871J1569P4738l4055k2225L9930R2818n6575
16921b8524K8566L0196J2824j38179j49039m4627J0876m401j9621k1932R6755
16910b27106O1737P2861K6604j2910J892J34206k3736o5601K2465q9668m5741
16899a44997j04621J28432J28670j02853m9766J20868K828n7927j43668P7878
16889a45156L5324j31197j82520n661J62697K34839J11600q2078n416L6063p5958
16878d7463p292J8701q3538J3056M7721R4806n5505q2354j7516J07110M7711K3292
$$ plain form
16956 -168306 -175991 -188399 -242521 -199499 -181163 -214265 -272128 -206511 -162483 -206630 -220474 -207337
16944 -207337 -105168 -30380 -56290 -109829 -32528 13323 66884 -68352 -133896 -89625 -115573
16933 -115573 -153986 -152998 -117158 -141595 -134724 -123155 -48417 -82472 -104697 -64767 28051 -28524
16921 -28524 42 30238 43062 -95117 -244156 -288783 -277907 -282308 -301929 -323861 -227106
16910 -227106 -165369 -92508 -65904 -78814 -76922 57284 33548 -32053 -9588 -99256 -144997
16899 -144997 -249618 -121186 7484 -95369 -145135 -24267 -21439 -79366 -223034 -145156
16889 -145156 -109832 -241029 -423549 -429210 -266513 -31674 79926 -2152 -7568 28495 -47463
16878 -47463 -54755 -36054 -119592 -106536 -58815 35991 -19514 -101868 -119384 -12274 35437 58729
16866E8729M0241j43007p7280J38736j4223j9479J52779O8326q0558k1879j50463
16855d8078j4853r7553q8231R0550M2894P6251o790p5473J11297O0991J5984l271
16843F3718o4558k1061n5628q9181m176J508J04314M9672M9045q2323j46973l6413
16831b32056j5850Q2237K6638M9419L3520j30290k8743r08Q0791n4338L2456P2353
16819h4771P9784L6536l5761n0295r2319m9201M487o3892N409J11712R501p3021
16807b01831P6751N8620J8107J6825J5968p5489n1183k5704J26945m1151L5222
16796d6920L2651O8285j1542p2092n0100p0033Q5811L5716j45491n5861J07878
16785a21698P8261M676p2363j3597m2096r4669J06996M6957k7214K7379J7099
$$ plain form
16866 58729 98970 -44037 -121317 17419 3196 -16283 136496 204822 124264 102385 -48078
16855 -48078 -62931 -160484 -248715 -158165 -115271 -39020 -45810 -121283 -9986 51005 66989 63718
16843 63718 -840 -21901 -77529 -166710 -170886 -169378 -65064 -15392 33653 -48670 -195643 -232056
16831 -232056 -247906 -165669 -139031 -89612 -56092 -186382 -215125 -216033 -135242 -189580 -157124 -84771
16819 -84771 -4987 31549 -4212 -54507 -146826 -196027 -191540 -255432 -250023 -138311 -128810 -201831
16807 -201831 -125080 -66460 -48353 -31528 -15560 -91049 -142232 -167936 -40991 -82142 -46920
16796 -46920 -14269 54016 42474 -29618 -79718 -149751 -63940 -28224 -173715 -229576 -121698
16785 -121698 -43437 -38761 -111124 -124721 -166817 -261486 -154490 -107533 -134747 -107368 -90269
16774i0269M3770J49517K9315m9917L1350r2211J6998m683k0763p5710M0958J07822
16762H6177q9794K8634J11548L5687j11792n7261q668k7190n7904j9915q3016
16751a93494n0746Q1634J13065O8773Q1750r5059n1166j6772j6288J6661M3783
16740a7859P0841K6007p408N799q3761l4074L399J6711L2615R3432k0383k20880
16728a35561p4226O8037R262R933J54549M0175j9707R651q6572k2753m0786J1305
16716g6693J14914p4160l4007O592k672k4550J03870N1105p4506j08430l6432
16705a54969o818J19769n127m383n7368j1366J12310Q8619K9869q0790k9588m578
16693d420m2570q0523n9202k0343n5522o0668R3748J27412R2383J3572O8530k3558
$$ plain form
16774 -90269 -46499 103018 132333 82416 113766 21555 38553 33870 13107 -62603 -21645 86177
16762 86177 -3617 25017 136565 172252 60460 3199 -5469 -32659 -90563 -110478 -193494
16751 -193494 -244240 -162606 -49541 19232 100982 5923 -45243 -62015 -78303 -61642 -17859
16740 -17859 52982 78989 71581 77380 -6381 -40455 -37056 -20345 12270 105702 85319 -135561
16728 -135561 -209787 -141750 -132488 -122555 31994 72169 52462 62113 -24459 -47212 -87998 -76693
16716 -76693 38221 -35939 -69946 -63354 -66026 -90576 13294 64399 -10107 -118537 -154969
16705 -154969 -161787 -42018 -47145 -51528 -108896 -120262 -7952 80667 110536 29746 158 -4420
16693 -4420 -46990 -127513 -186715 -207058 -262580 -323248 -229500 -102088 -9705 3867 72397 48839
16681D8839k6643j21029L9689J17832m1747k8511j3511p5033R3410k7162k6224
16670f0090L4932n5308j4903N367J06493M9614r6477j24020P9942J55630j07305
16659b6125M3674N9595j11068j24098K0463R9539j6688M1958k6706K1250O9243
16648E1037k892p9813m2678J56185M1374j4548N0075k0015r6908r6013m2022k5151
16636a21369j5237N0947J59270P6196J0323M7078q7687l9417m6443q3651m8897
16625i8887J12149R1541M4240P308p7358j7538J36481J54080J73357K22686J66581
16614I14640L44388L45485K49128K21679J5977j16523l77944l21390k71486k65283
16604G38671j64696p3506j33257l7973j21196j12083O3153J0251J2537j34015
$$ plain form
16681 48839 22196 -98833 -59144 58688 16941 -11570 -25081 -100114 -6704 -33866 -60090
16670 -60090 -25158 -80466 -95369 -90002 16491 66105 -30372 -154392 -74450 81180 -26125
16659 -26125 17549 77144 -33924 -158022 -137559 -38020 -54708 -12750 -39456 -18206 51037
16648 51037 48145 -31668 -74346 81839 123213 108665 158740 138725 41817 -54196 -96218 -121369
16636 -121369 -136606 -85659 73611 149807 160130 207208 119521 80104 33661 -49990 -98887
16625 -98887 13262 104803 149043 156351 78993 61455 197936 352016 525373 748059 914640
16614 914640 1259028 1604513 1853641 2075320 2091297 1974774 1596830 1275440 1003954 738671
16604 738671 573975 500469 367212 329239 208043 95960 159113 169364 181901 47886
16594D7886p1799K2978J28353o4426N9430L2727j80081j38928Q5510M7459M4873
16583A3982J07643q7914j34538j9480P5751J88216q7147n9043K6670K8555L623
16572E6318J26742J2343j96392j33531R7733M9102Q84K7912m2210p1400R9973
16561B7474J0636l7754J4130o801N2660J14312q366j65597n1759K7005k4268M1257
16549g071J3919R2411q7072m5319N4641j08400j6327l3483j7160J48598M8185
16538D2922J9945k8508O7142J07528o0314o4887M8512o6733L7159K2963K2197
16527A47926q0668q7606m4620l923L9253J1465j05971n5503n6688J29384O6350
16516d0601l3907l7380k372k6351j802k2423l2672L3195M8771J23525L4542M7
$$ plain form
16594 47886 -23913 -935 127418 62992 122422 155149 -24932 -163860 -78350 -30891 13982
16583 13982 121625 33711 -100827 -120307 -44556 143660 56513 -2530 24140 52695 56318
16572 56318 183060 195403 -989 -134520 -36787 12315 13199 41111 -1099 -72499 27474
16561 27474 38110 356 14486 7685 60345 174657 166291 694 -51065 -24060 -48328 -7071
16549 -7071 6848 99259 12187 -33132 21509 -86891 -103218 -136701 -153861 -5263 42922
16538 42922 62867 34359 101501 209029 148715 83828 132340 65607 102766 125729 147926
16527 147926 67258 -20348 -64968 -68891 -29638 -18173 -124144 -179647 -236335 -106951 -40601
16516 -40601 -74508 -111888 -114260 -140611 -142413 -164836 -197508 -164313 -115542 7983 42525 42572
16504D2572J8022L1247N5285r1818j18166O7440P7426l6404j32451j2157M2967
16493e6037J7331l2887j6844J06826M132J6630J1948k1292n580p2001J41576J71351
16481B65153J04j68055p0623Q6931N3562J39029l3395p8734q4765l9231m9198
16470B0778K0438p627j4639R8313n8357n8852M3056M5965R5396q7573l2657L2561
16458I6802n2400K5712q2196j01960K5298P3399J3210N4975r5963m732L7271K43
16446a0341O3888m0864j10974r455O1917l4441l0415M6055j1770L9667n6514L858
16434h9389j8673L7320J06527L6245p7577Q625J07240j3303K0955O287k8624J538
16422I7171o128m9780K1132Q3855q4067k676J11351m5003m106l2865o5925O4317
$$ plain form
16504 42572 60594 91841 147126 55308 -62858 4582 82008 45604 -86847 -99004 -56037
16493 -56037 -38706 -71593 -88437 18389 22521 39151 51099 29807 24227 -47774 93802 265153
16481 265153 265257 97202 26579 113510 167072 306101 272706 193972 109207 69976 20778
16470 20778 41216 33589 18950 117263 58906 54 43110 89075 184471 96898 64241 96802
16458 96802 44402 70114 -12082 -114042 -88744 -15345 -2135 52840 -43123 -47855 -10584 -10341
16446 -10341 53547 12683 -98291 -107746 -45829 -80270 -110685 -64630 -76400 -36733 -93247 -89389
16434 -89389 -108062 -70742 35785 72030 -5547 3078 110318 97015 117970 124257 95633 97171
16422 97171 91043 41263 62395 146250 62183 59507 170858 125855 121749 88884 22959 87276
16410H7276O58O5098K8627p9123o6685n7287k2192O2217o4535n6262o3985O9926
16398i6267N5209q201o358J00682J17775o0328j34789j56555r3848J44556J08122
16387c0002p2064m518N3261P9999K6200P5451J35802M3731p3679r9921O3866L7898
16375B36024j50983j57332p8699P7342P1906k5472N5462j3961l3193J32338J3221
16364A26653j07360J6937J49639L0328o4795j61893q0992j24318j3122L8023N9569
16353a31331J16688j43419O1103L1700J5029K23764j18496k9206O4584O4523o054
16342A48885p7374j45288p390M0035J27774M3596R3919l154O624m0990O885j21060
16330G2462P3792Q6779j60374j93205J02232q547K1317P8377N9845L2191n6850
$$ plain form
16410 87276 87934 153032 181659 102536 35851 -21436 -43628 18589 -45946 -102208 -166193 -96267
16398 -96267 -41058 -49259 -55617 45065 162840 102512 -32277 -188832 -282680 -138124 -30002
16387 -30002 -102066 -106584 -53323 26676 52876 128327 264129 307860 234181 134260 198126 236024
16375 236024 85041 -72291 -150990 -73648 -1742 -27214 28248 14287 -18906 113432 126653
16364 126653 19293 36230 185869 216197 151402 -10491 -91483 -215801 -228923 -190900 -131331
16353 -131331 -14643 -158062 -96959 -65259 -50230 173534 55038 25832 90416 154939 148885
16342 148885 71511 -73777 -81167 -41132 86642 130238 224157 221003 227627 186637 193522 72462
16330 72462 146254 233033 72659 -120546 -18314 -26861 -5544 72833 132678 164869 108019
16319A08019L6070N8275q1051n3535r2091p2037n65K7960J60645l6523Q3613J14085
16307B52865j14539j27318q71j278K2894J46113K1155J2649O4928o0852j46465
16296F9281n5075m1768N96J3590o9800M8754J1779K4332Q8955K2553m0875m0387
16284C1935j5208k7338L8068j1918o457O5651R6007M8268m1931j08438L6862Q001
16272A13502j8473K2186j3136R975K5924Q5610J10775p4409j95905o1972o9304
16261f5227m0705N3800R6372J01725j04186M4023m0578L5750J36520k0437j60784
16250C6273M8356J08419l524o9510Q997l4868M3823L6024J3063n9984O049j0263
16238A22855j8780m003L2513Q0807M0162o9928L1972J52766R8224q1646r5003
$$ plain form
16319 108019 144089 202364 121313 67778 -24313 -96350 -96915 -68955 91690 55167 138780 252865
16307 252865 138326 11008 10137 8859 31753 177866 199021 211670 276598 215746 69281
16296 69281 14206 -27562 -26966 -13376 -83176 -34422 -22643 1689 90644 113197 72322 31935
16284 31935 16727 -10611 27457 15539 9082 74733 170740 219008 177077 68639 105501 113502
16272 113502 95029 117215 104079 114054 139978 225588 336363 261954 66049 4077 -65227
16261 -65227 -105932 -52132 44240 145965 41779 85802 45224 80974 217494 197057 36273
16250 36273 84629 193048 189524 120014 129011 94143 137966 173990 187053 127069 133118 122855
16238 122855 104075 100072 132585 213392 253554 183626 215598 368364 466588 384942 289939
16227B89939m6963j28830n9447o0347M6947J21219N51o3437l4335Q2507J37758
16216B85562n3716M1045M6000J4805l6005j25570r893J05615L7174j42738k63944
16205a01665p7970K35042Q4092L7094l6715M396j01601m6914J6613N431O609M1060
16193F5472K7370L9263P4694L2320P2882R0924J7247J17180K68733j8266j22434
16182F65385r5498j01914o9505j0325j35247K457n378j9706O1193L3867n0845
16171B74484j2872O4435n5221R5972R4996N6447j03648O1895Q9412P9016j40196
16160E04720n823M8372R2745M1662n8806L5076O0373l7229J18668o1674j06970
16149F31114k2187o8452Q27m8310R8190N3557J24166o3101q9132M4378J10471
$$ plain form
16227 289939 242976 114146 54699 -5648 41299 162518 163069 99632 65297 147804 285562
16216 285562 231846 272891 318891 333696 297691 172121 162228 267843 305017 162279 -101665
16205 -101665 -179635 55407 139499 176593 139878 144274 42673 -4241 12372 17803 24412 65472
16193 65472 92842 132105 206799 239119 312001 402925 420172 537352 806085 787819 665385
16182 665385 569887 467973 398468 388143 252896 255353 249975 230269 291462 325329 274484
16171 274484 261612 326047 270826 366798 461794 518241 414593 476488 565900 644916 504720
16160 504720 498897 547269 640014 681676 622870 657946 718319 681090 799758 738084 631114
16149 631114 608927 540475 541302 492992 591182 644739 768905 705804 616672 661050 771521
16138G71521P1032R1687L8185n8139m4158j05986K1458n2054K4133K1150N5917
16127H34746J15181k4048J40495o8274j6526j48651l9062O8858J90394J79746
16117A232859J58741J39960P4074J39J26086K5590q2323j1395p585K3942l6198
16106A643890q1662M9353J79508J63143J20468J5095J10837K07060J07713J84359
16096B699764K86824J84725J91586J76476J31194R2633J36373K97388L72969M60638
16086E030570O85575R56772R79408Q82772R91790R21360P59270Q76131J118808
16077A3202456J642769K087445K452427L244465M128528N235171P406512J1055621
16069E0455394J7414051K7231139M1846228O0054717P1536228O2571873M4276295
$$ plain form
16138 771521 842553 934240 972425 914286 870128 764142 785600 733546 757679 778829 834746
16127 834746 949927 925879 1066374 998100 981574 832923 793861 862719 1053113 1232859
16117 1232859 1391600 1531560 1605634 1605773 1731859 1757449 1675126 1663731 1656146 1680088 1643890
16106 1643890 1562228 1611581 1791089 1954232 2074700 2089795 2200632 2407692 2515405 2699764
16096 2699764 2986588 3171313 3362899 3539375 3670569 3763202 3899575 4196963 4569932 5030570
16086 5030570 5716145 6672917 7652325 8535097 9526887 10448247 11207517 12083648 13202456
16077 13202456 14845225 16932670 19385097 22629562 26758090 31993261 39399773 50455394
16069 50455394 67869445 95100584 136946812 197001529 268537757 331109630 375385925
16062C75385925K8085828q366085o1863947q1687778o5938679m5228324l0584650
16055A09802290k0971481j4425451j0326812p649102n876473m556819l759459
16048D2236693k958406k521400k297447k200048j774215j454598j192196r66761
16040B6871622r61418q10637r04863j151410j375331j362304j211698j064331
16032A8029630r58679q25521o48312o34413m21739l67921l91773l55277l12142
16023A3113853m34600m72041m83014n99128l61316k98800l19942l15648l94284
16014I435080m68799m10799k08281l36618l37258k57460q3170k90836l82338j39243
16004F520278j80628r4961r7190o6332j03942j87523j11888k26321l79092k26419
$$ plain form
16062 375385925 403471753 395105668 333241721 251553943 185615264 140386940 109802290
16055 109802290 88830809 74405358 64078546 56429444 50552971 45996152 42236693
16048 42236693 39278287 36756887 34459440 32259392 30485177 29030579 27838383 26871622
16040 26871622 25910204 25099567 24194704 23043294 21667963 20305659 19093961 18029630
16032 18029630 17070951 16245430 15597118 14962705 14540966 14173045 13781272 13425995 13113853
16023 13113853 12679253 12207212 11724198 11125070 10763754 10464954 10145012 9829364 9435080
16014 9435080 8966281 8555482 8347201 8010583 7673325 7415865 7332695 7041859 6659521 6520278
16004 6520278 6339650 6244689 6147499 6081167 5977225 5789702 5677814 5451493 5072401 4845982
15994D845982j03625k39512k16721r0870j20442j37854j57077j50785j68206n9546
15984C401344l9412j42667p5187k5505q8958j20346j06709j77305K694l8657l0555
15973B558737j06384n7635q2193l9372n3930m5736j7530q5143o0335r6742J9580
15962A933317j6424p2612L865R2153r1624j96634k19058j06787n995N753o7843
15951A258111j83079j38522j8305j63999l7839n7999j05642m0679l8191r8039
15941C75817p8984N6899J2678m8258P7602J59282J11827j20804q8785j5851M526
15930D45949j26566m5914m9751j7718M230k6225Q3752o516L9145J05225N757M3732
15918D55100n885k5782p9605k2021n1222l5361m2349J402l7477j20342K9542Q8315
$$ plain form
15994 4845982 4742357 4502845 4286124 4195254 4074812 3936958 3779881 3629096 3460890 3401344
15984 3401344 3361932 3219265 3144078 3118573 3029615 2909269 2802560 2625255 2627949 2589292 2558737
15973 2558737 2452353 2394718 2312525 2273153 2219223 2173487 2155957 2070814 2010479 1913737 1933317
15962 1933317 1916893 1844281 1848146 1940299 1848675 1652041 1432983 1326196 1320201 1325954 1258111
15951 1258111 1075032 936510 918205 754206 716367 658368 552726 512047 473856 375817
15941 375817 296833 353732 366410 318152 395754 555036 666863 546059 457274 441423 445949
15930 445949 319383 273469 223718 206000 210230 184005 267757 261241 300386 405611 411368 455100
15918 455100 449215 423433 343828 321807 270585 235224 192875 194277 156800 36458 66000 154315
15906A54315K9310l4565J1792m0327m2213J3222J03302J30088j5112P4217J07375
15895D91404r5192r9230j20000M6980j20097p8875J25709j0065O8495k637j1248
15884A95244L9265J2289k1442n104m0417Q1247O2672j3396q7422j16610o3658
15873D2668j06707J12221O0755l3107j3325l8324j06846R8488Q6711k3322j16224
15862c7012Q2866J2707N867R6567o6424p1219P1859M843l8443j152M6001M0413
15850A46873l7355j18752L8515O1210P0738o648k3133n961j34400o9770L114r0102
15838a65671o8208j8553M7277M1841J7364K1130j3182N4894P9137R3580m2188
15827D7421j03045k0967n8313M7320Q6760k6187j6814R2026L4428L9867R8616
$$ plain form
15906 154315 183625 149060 160852 120525 78312 91534 194836 324924 309812 384029 491404
15895 491404 396212 296982 176982 223962 103865 24990 150699 140634 209129 206492 195244
15884 195244 234509 246798 225356 220252 179835 261082 323754 310358 222936 106326 42668
15873 42668 -64039 48182 108937 75830 62505 24181 -82665 15823 102534 79212 -37012
15862 -37012 45854 58561 64428 160995 94571 23352 95211 100054 61611 60459 106460 146873
15850 146873 109518 -9234 29281 90491 161229 154581 131448 125487 -8913 -78683 -75569 -165671
15838 -165671 -233879 -252432 -205155 -163314 -145950 -124820 -138002 -83108 -3971 89609 47421
15827 47421 -55624 -76591 -134904 -87584 -824 -27011 -43825 48201 82629 122496 221112
15816B21112J09465N781j27213j14228P069k1437j6938K8551N5481J7171l9962
15805A24852N3485m1576p5594O3687p5853k6541k6557j6339n2931k0107J11930
15794A8456K5491Q2563Q71j44337n5996l3514J3075J7260L1391m4329P896Q1601
15782D28Q8698p1945j35474M3068Q9306l3266j13381l9239P8489P3614P227M9060
15770C6585J0523J40880p5267r9640r0983o1372J17228N1793J4100j0686o1019
15759b7858o5093J26780Q3446l4781o3286J08550R7376j10209n5956P9390P7565
15748B15924j13226q5747j08458k03729K0535J26580N7455N2399J32972l8861
15738E5844l8033n2027j22764k6982J06201J6385l4864O465p4916l7910j53111
$$ plain form
15816 221112 330577 336358 209145 94917 101986 80549 63611 92162 147643 164814 124852
15805 124852 178337 136761 61167 124854 49001 22460 -4097 -20436 -73367 -93474 18456
15794 18456 43947 126510 127381 -16956 -72952 -106466 -93391 -76131 -44740 -89069 -81173 428
15782 428 89126 17181 -118293 -75225 14081 -19185 -132566 -171805 -93316 -19702 -12475 36585
15770 36585 47108 187988 112721 13081 -77902 -139274 -22046 29747 43847 33161 -27858
15759 -27858 -92951 33829 117275 82494 19208 127758 225134 114925 58969 138359 215924
15748 215924 102698 16951 -91507 -295236 -274701 -148121 -90666 -38267 94705 55844
15738 55844 17811 -34216 -156980 -183962 -77761 -61376 -96240 -89775 -164691 -202601 -355712
15727c55712k9106k2312J17400M6830R8798r0029o5919J04123J40310l3050j21728
15716b10395K9067O7692J8533q1094j16294K3993J70236J82696k4014o6893j18663
15705a25136M0292K6190J8152N5950J620l8252n3827j86578O7272Q5105P8133
15694c1079N4266p0979k829k3783J8404M1886o2145j12890l4622J43126l6821
15683a17466q6616O7249J2283p0567R1065J7702n5100l6298k5874J29059L0437
15672d4126M9251N670j1761l2351j21855J7282J09586m3564J1140P406n9793L470
15660a09645q569K1008k6670m9390N0428l2549M9676M1538R510L839M2343p4383
15648h2864q558N8088O7225J33991j10417r9428K4459q8405m0458L1535o4536
$$ plain form
15727 -355712 -384818 -407130 -289730 -242900 -144102 -234131 -300050 -195927 -55617 -88667 -210395
15716 -210395 -181328 -113636 -95103 -176197 -292491 -268498 -98262 84434 60420 -6473 -125136
15705 -125136 -84844 -58654 -40502 15448 17068 -21184 -75011 -261589 -194317 -109212 -31079
15694 -31079 23187 -47792 -50621 -74404 -56000 -14114 -76259 -189149 -223771 -80645 -117466
15683 -117466 -204082 -136833 -124550 -195117 -104052 -86350 -141450 -177748 -203622 -74563 -44126
15672 -44126 5125 10795 -966 -33317 -155172 -137890 -28304 -71868 -60728 -53322 -113115 -109645
15660 -109645 -118214 -97206 -123876 -173266 -122838 -155387 -105711 -64173 -54663 -50824 -8481 -82864
15648 -82864 -91422 -33334 33891 167882 57465 -41963 -17504 -105909 -146367 -114832 -179368
15637a79368k3705O8091J9956j8218o217R5285O2305k489P5177p5402j08002j1541
15625a04128K9131K2871J5768o9317j19564k078O4232m9134P5313J09358o1847
15614h9395K7756l9713l3030K5845j0817m874o1725j8486O7459k2793k0222N3303
15602a26692L0109O0241J58582N9940q5554j1171k02839k00532k416n3110l7431
15591d10873J00688Q8256M3318l7206o5409N5087R395Q1084j5876n7443N1502
15580a57477L1571N5557J3294O257k9902r2374j39798O7173l1590K6355J52952
15569i7982n518j18099Q2736R2530R2636p888j14455k3648J0319K7362R686L251
15557d9070j01233J6128j4571r8844N6139P2694m673r7716O1838j4545n6337R3716
$$ plain form
15637 -179368 -203073 -134982 -115026 -133244 -139461 -44176 18129 15640 90817 15415 -92587 -104128
15625 -104128 -74997 -52126 -36358 -105675 -225239 -227317 -163085 -212219 -136906 -27548 -89395
15614 -89395 -61639 -101352 -134382 -108537 -119354 -124228 -185953 -204439 -136980 -159773 -179995 -126692
15602 -126692 -96583 -36342 122240 182180 96626 85455 -117384 -317916 -320332 -373442 -410873
15591 -410873 -310185 -221929 -178611 -215817 -281226 -226139 -216744 -135660 -151536 -208979 -157477
15580 -157477 -125906 -70349 -57055 -50798 -80700 -173074 -312872 -245699 -277289 -250934 -97982
15569 -97982 -103500 -221599 -138863 -46333 46303 38415 -76040 -99688 -89369 -62007 -52321 -49070
15557 -49070 -150303 -134175 -148746 -247590 -191451 -118757 -123430 -221146 -159308 -173853 -230190 -136474
15545a36474K01531K880l1406k9328j07251l7963J07200R2379q5355j09285j1113
15534a44185N3413K8030K542J37578K8798n248j02808l4629J0287j40388o3251
15523b29861M6237Q0396L168j9887P2852L6132R9328J62491P431J8378K63816
15512E40481K88043L15233L35695K41236J02277r4549k66033l60839k95053k34518
15502E71973j12545o9101j44541j3880P9580o5150k5836M4574n7227k9401K226
15491A80672j06868m0428K1085M4203K0486o6763J3918Q6425J62627r3761j23768
15480I7828n152p770o132k7131k1871o5875O8174R535j00991Q440J919j2039o8880
15467a29945l8976J5651N4662J38697k829Q9448j8836j6632o5836l7403R7159
$$ plain form
15545 -136474 65057 67937 36531 7203 -100048 -138011 -30811 61568 -23787 -133072 -144185
15534 -144185 -90772 -62742 -60200 77378 106176 100928 -1880 -36509 -26222 -166610 -229861
15523 -229861 -183624 -103228 -100060 -119947 -47095 -10963 88365 250856 258287 276665 540481
15512 540481 828524 1143757 1479452 1720688 1822965 1728416 1462383 1101544 806491 571973
15502 571973 459428 390327 245786 231906 311486 246336 220500 265074 207847 178446 180672
15491 180672 73804 33376 54461 98664 119150 52387 66305 152730 315357 221596 97828
15480 97828 92676 84906 78774 51643 29772 -36103 32071 41606 -59385 -50945 -49026 -61065 -129945
15467 -129945 -168921 -153270 -98608 40089 37260 126708 107872 91240 25404 -11999 85160
15456H5160M0773q9j03316r2685l5497K00183J23181r1458j00967m9756N3722
15445B9251P3306j05146J06466P0050n0498j08226q497J2065n6311k7002J07781
15434D3239p55j51671q6459P0754R6561r0431K845o508J5813L9272J30271J1731
15422G4662o6514j01305M1629j101L8861k353k6063L5824N6729n0801k4321k5694
15410e0447k3916J5848l7247L9710J14059K2778n0559M861L1669o6966j58189
15399a58399j27794Q913R2943Q4586J02883o4816j83273n3351N4230Q6836m7138
15388b04380P07k7187M5872J53313L480j21159J19388P265r1236J0611m2954l840
15376a50120O7821j7685J06550j4407j85581j12493m192L5216J23153M6507M3372
$$ plain form
15456 85160 125933 125844 22528 -70157 -105654 94529 217710 126252 25285 -24471 29251
15445 29251 102557 -2589 103877 173927 123429 15203 6706 18771 -37540 -64542 43239
15434 43239 42484 -109187 -195646 -124892 -28331 -118762 -115917 -122425 -106612 -67340 62931 74662
15422 74662 8148 -93157 -51528 -52629 -13768 -16121 -42184 -6360 50369 -432 -24753 -50447
15410 -50447 -74363 -58515 -95762 -56052 58007 80785 30226 35087 66756 -210 -158399
15399 -158399 -286193 -277280 -184337 -99751 3132 -61684 -244957 -298308 -244078 -157242 -204380
15388 -204380 -203673 -230860 -184988 -31675 -28195 -149354 -29966 -22701 -113937 -103326 -146280 -150120
15376 -150120 -82299 -99984 6566 -7841 -193422 -305915 -310107 -274891 -151738 -105231 -61859
15365f1859K0361j24626o6533P9036P0555J00932K3992k3440N8694n6029n7702
15354c6619j02943n4655J43783P2253r7103l3639j12120N897R3079L5124M387
15343h2556k2048N3015J70827l1432k6682N4435m9157j28654K3005J2538r2001
15332a18710m4559J51804N1024J589o652r710K67o8660j4012l0301n5709M9076
15320i4553l2264L0621J5488q6097j0603R4487L6983P9191Q3273n6863j35307
15309g5644j63605k0235J12766O4116N2699p452n3730j660k2571j8699O6962M9306
15297a7747J9367p6348Q3162j5251R0961J64505j46448j55818m2817K9294m0899
15286a08039j22079K6829J03079L8429n8955q1214M3827M4229k9384l197K3361
$$ plain form
15365 -61859 -41498 -166124 -232657 -153621 -83066 17866 41858 18418 77112 21083 -36619
15354 -36619 -139562 -194217 -50434 21819 -75284 -108923 -221043 -215146 -122067 -86943 -82556
15343 -82556 -104604 -51589 119238 87806 61124 115559 66402 -62252 -39247 -26709 -118710
15332 -118710 -163269 -11465 39559 41148 34496 24786 25053 -43607 -57619 -87920 -143629 -94553
15320 -94553 -126817 -96196 -80708 -166805 -177408 -82921 -45938 33253 116526 59663 -75644
15309 -75644 -239249 -259484 -146718 -82602 -29903 -37355 -91085 -92745 -115316 -134015 -67053 -17747
15297 -17747 1620 -74728 8434 -6817 84144 248649 102201 -53617 -96434 -67140 -108039
15286 -108039 -230118 -203289 -100210 -61781 -120736 -201950 -158123 -113894 -143278 -146475 -123114
15275a23114k1116O0939M4916K7210J00851M9773j23207j04374m6238k5928K8062
15264a32226J8348L971J6617k386J27907K4084m3444j05658n1267N4881M5636
15253d3537P0696J65001l9842j02178P4920M6572j5699o4697p1315m8214r616
15242c7909K3720p5542j2260m5838M7425Q8258q440p0885K307j2136m247J30231
15230B4684J66973J39653l0734j64071m9317p0649j4438l7554K4848k6016J7234
15219a9387j4790m819k9708o8214j16266P8842m8719O4856Q4204P2787J30610
15208A29396J08390m1311J8058p59l9586j80369j25041J428m1600M0498J17499
15197a3397j3746K9428P958o9977R0330l210r7154M9583L5635M486r2099o9618
$$ plain form
15275 -123114 -144230 -83291 -38375 -11165 89686 139459 16252 -88122 -134360 -160288 -132226
15264 -132226 -113878 -109907 -93290 -95676 32231 56315 12871 -92787 -144054 -89173 -43537
15253 -43537 27159 192160 152318 50140 125060 171632 155933 91236 19921 -28293 -37909
15242 -37909 -14189 -89731 -101991 -147829 -100404 -12146 -20586 -91471 -89164 -101300 -105547 24684
15230 24684 191657 331310 300576 136505 87188 16539 2101 -35453 -10605 -36621 -19387
15219 -19387 -34177 -38996 -68704 -136918 -253184 -174342 -223061 -158205 -74001 -1214 129396
15208 129396 237786 196475 214533 213774 174188 -6181 -131222 -129794 -171394 -130896 -13397
15197 -13397 -27143 2285 10243 -59734 30596 27386 -69768 -20185 15450 19936 -72163 -141781
15185a41781n0929P3863m2164j34843p2048N2157K26570l2609N964J5492l4768
15174a35096l9949k0029m01L7706Q2204k4285K1060L6669l6326Q5851r1918J8079
15162f6435J02196M9682n5975n6364r6250j63146k6874J00624M0517l4928N2104
15151a54849J0674O851J09319J07117J5691L9275j2569K4404L4533m9653j25040
15140E753j21922n0728O6700R3032O8421L3588j8882j46215j22028o142L5582
15129a62841J24279L9822M3912O714j53724k3597Q583K9747o0228r0964J24979
15118a13318Q1389p6491j18234k5192Q1134O4456O3826r2961n0689R9013R2353
15107E286L6197j22450r5117o344Q7698O8896m0675M1143J7282r7112k8256K3223
$$ plain form
15185 -141781 -192710 -118847 -161011 -295854 -367902 -315745 -89175 -121784 -115820 -100328 -135096
15174 -135096 -175045 -195074 -195475 -157769 -75565 -99850 -78790 -42121 -78447 7404 -84514 -66435
15162 -66435 35761 85443 29468 -26896 -123146 -286292 -313166 -212542 -172025 -206953 -154849
15151 -154849 -144175 -137324 -28005 79112 94803 134078 121509 145913 180446 130793 5753
15140 5753 -116169 -166897 -100197 -7165 61256 94844 75962 -70253 -192281 -198423 -162841
15129 -162841 -38562 1260 45172 51886 -101838 -125435 -116852 -87105 -147333 -238297 -113318
15118 -113318 -31929 -108420 -226654 -251846 -170712 -106256 -42430 -135391 -186080 -87067 5286
15107 5286 41483 -80967 -176084 -182428 -94730 -25834 -66509 -25366 -8084 -105196 -133452 -110229
15095a10229N705N4L9951M0754K645n7129q175j5341N356P970m2088q0205l0844
15082b41576J14016O3407P548J9966l1528p5503n1260p9183Q9080j4893Q232j7525
15070b09219L2201J0930l3125j9818L3760N3384J05794N6524J4165N2753m957
15059I2392r8135o5061Q7251J00554n8205j64037L6505J28279j962q7736k9350
15048e9505q2380P2160J98268P459j3995j72750j33345J03148K3838n674N0851
15037a1925o2320o3190L5635k2323N2333J75053Q1348l0112j55003r2000j9005
15026a11509M7717K7908O141j08576L5087Q9427n0822J9413R3920n5197p5628
15015h2119j588k3807p479j17230J07316J68312J032m1977L120J00681j46762
$$ plain form
15095 -110229 -104524 -104470 -64519 -23765 -21120 -78249 -86424 -101765 -96409 -88439 -130527 -210732 -241576
15082 -241576 -127560 -64153 -56605 -36639 -68167 -143670 -194930 -274113 -185033 -199926 -191694 -209219
15070 -209219 -177018 -166088 -199213 -219031 -185271 -131887 -26093 30431 44596 97349 92392
15059 92392 -5743 -70804 16447 117001 58796 -105241 -68736 59543 57581 -30155 -59505
15048 -59505 -141885 -69725 128543 136002 122007 -50743 -184088 -80940 -57102 -62776 -11925
15037 -11925 -74245 -137435 -101800 -124123 -71790 103263 184611 154499 -504 -92504 -111509
15026 -111509 -63792 -35884 -29743 -138319 -103232 -13805 -64627 -45214 48706 -6491 -82119
15015 -82119 -83707 -107514 -114993 -232223 -124907 43405 44437 2460 5580 106261 -40501
15004d0501m9372q0638N3558J12414j09271j9188l0452m9018K1508L5689K0257
14993a35014P8746J34648j1933j77988p0530N4471R3431M6816j6376K8675o6222
14982d1276j4272k0706L8685Q6511O461K6894r6637j52976j2906m5806O3162J57164
14970e702J95382m1207o9694L8978j30725J4576J3200l5118L0351j5753J0748
14959E036M0789R2390P55q6403p1273Q085p7900N8164L9108r2323L1622K1088
14947c0862M2905o3563j84569J31074O1838Q774p8792J4035Q0618O3284j0388
14936C4354L9099l7825o8501q0665K4487J3434j3753q7075M6052L5947J08149
14925A3703J11052P6757r2014r7457O82l8225o3341m9814J41710n37O694k2683
$$ plain form
15004 -40501 -89873 -170511 -116953 -4539 -113810 -132998 -163450 -212468 -190960 -155271 -135014
14993 -135014 -56268 78380 66447 -111541 -182071 -127600 -34169 12647 -3729 24946 -41276
14982 -41276 -55548 -76254 -37569 48942 55403 82297 -14340 -167316 -180222 -226028 -162866 -5702
14970 -5702 189680 148473 78779 117757 -12968 1608 14808 -20310 10041 -5712 5036
14959 5036 45825 138215 138970 52567 -18706 -10621 -88521 -30357 8751 -83572 -51950 -30862
14947 -30862 12043 -51520 -236089 -105015 -43177 -34403 -113195 -99160 -18542 44742 34354
14936 34354 73453 35628 -32873 -113538 -89051 -75617 -89370 -176445 -130393 -94446 13703
14925 13703 124755 201512 109498 12041 12723 -25502 -88843 -138657 3053 2516 9210 -13473
14913a3473j221J0108o0340k5448M8875k1923J8361K27l4073r0958O5620P8544
14901b5701j20102k5163J17688j879n1712q9653m4361Q9015N3699L1995P4210
14890H036K6651O376L4603k2236K6187j20402Q8099N4321J8580J826k3874l8401
14878E9766n8721r1885j9511J49345M8893o5721o3518j65215K8012m987J09493
14867g4049j7387M5141p5639j2103l5112L0914N1357J2094n3009J0804p861O8014
14855e6836K6618n5L436M8643n9177j20347R2424m2388j14641M082M1428R8927
14843g7886r0561r4325P397K4516L10122N1462j20843k9865r8639k3429P9592
14832f2459N1112m3311N406O4259m9853k7564J18615j5347o0821L2729l1154j9095
$$ plain form
14913 -13473 -14694 -4586 -64926 -90374 -41499 -63422 -45061 -44834 -78907 -169865 -104245 -25701
14901 -25701 -145803 -170966 -53278 -55157 -106869 -196522 -240883 -151868 -98169 -66174 8036
14890 8036 34687 41063 75666 53430 79617 -40785 47314 101635 120215 122041 98167 59766
14878 59766 1045 -90840 -110351 38994 87887 22166 -41352 -206567 -178555 -183542 -74049
14867 -74049 -91436 -46295 -121934 -134037 -169149 -138235 -86878 -74784 -127793 -116989 -124850 -56836
14855 -56836 -30218 -30273 -26837 21806 -37371 -157718 -65294 -107682 -222323 -218241 -176813 -77886
14843 -77886 -168447 -262772 -255375 -230859 79263 130725 9882 -19983 -118622 -142051 -62459
14832 -62459 -11347 -54658 -49252 15007 -34846 -62410 56205 40858 -19963 12766 -18388 -37483
14820c7483J03914Q7650j16692r2263l409l6933L7564R5881p5914j19981m0572
14809a98238K8955L8088J3256J28021m7243q6764o3108l7366J31680J29069J2001
14798D8351p6454L8175l939N2377O3943p6646q9356n4384O5457k654L7425L7521
14786C9816p6870K8442N907m2061l4207q5423q401Q8288Q1943j24066j57508k8149
14774c12289n995P6307L8248K6420O532J55613J02639O0699m8527l5375N0221
14763A14493l1318N03k7390m6230M1677O759q5535q7764n0400r6785J2850K14474
14751c4666L4908o1922l5442N1518K2044r7340j53655k8267O1349j2473J57333
14740i6613R0529l0711J7197k3964j12673L6027m9483p3175l4872M5178J25114
$$ plain form
14820 -37483 66431 154081 37389 -54874 -58283 -95216 -57652 38229 -37685 -157666 -198238
14809 -198238 -169283 -131195 -117939 10082 -37161 -123925 -187033 -224399 -92719 36350 48351
14798 48351 -28103 10072 6133 58510 122453 45807 -43549 -97933 -32476 -35130 2295 39816
14786 39816 -37054 -8612 -2705 -44766 -78973 -164396 -172797 -84509 -2566 -126632 -284140 -312289
14774 -312289 -318284 -241977 -203729 -177309 -170777 -15164 87475 148174 99647 64272 114493
14763 114493 83175 83678 56288 10058 51735 58494 -27041 -114805 -165205 -261990 -249140 -34666
14751 -34666 242 -61680 -97122 -45604 -23560 -120900 -274555 -302822 -241473 -253946 -96613
14740 -96613 -6084 -36795 -19598 -43562 -156235 -120208 -169691 -242866 -277738 -232560 -107446
14729a07446m8386l0395N9831m2636n2239J47978J00617J320m7299m7737j5442
14718h1834Q1940M951q8211K4489K8901j2592J22020R1773K5930l43j30790m218
14706F2016J08323r8771j58217q1358k8209j5083O8484m643o992J11001P4479
14695C1030j05765k0883l3454p712M9216J35611J6004j0080m6321l637m0305N4076
14683A7780k0149m9007L2217N5011M645M1852n365O6663k0313q9377J227N0397
14671H5581Q565l0087n8896J26381M4490j31333o1039k1993q2024q8303N2485
14660a56173J3957J1124J8905k2291j6161M3489n4329o0267l0154j9698J22759
14649a48839Q3271j9995M3279k4832N3738p1793j0958O1625j3579J2719j8403
$$ plain form
14729 -107446 -155832 -186227 -126396 -169032 -221271 -73293 27324 28644 -18655 -66392 -81834
14718 -81834 106 5057 -83154 -58665 -29764 -42356 79664 171437 197367 197024 66234 62016
14706 62016 170339 71568 -86649 -168007 -196216 -211299 -142815 -147458 -154450 -43449 31030
14695 31030 -74735 -95618 -129072 -136784 -87568 48043 64047 53967 7646 4009 -36296 17780
14683 17780 -2369 -51376 -19159 35852 40497 82349 76984 143647 123334 33957 35184 85581
14671 85581 94146 64059 5163 131544 176034 44701 -16338 -38331 -120355 -208658 -156173
14660 -156173 -142216 -131092 -112187 -134478 -150639 -107150 -161479 -221746 -251900 -271598 -148839
14649 -148839 -65568 -85563 -42284 -67116 -13378 -85171 -96129 -34504 -48083 -35364 -53767
14638e3767K6540j77396l0702J88770M2381K8630L9779L8654j47471m9273K5123
14627f8732l7563K8100O367O1052m939j6505O5819m4636j3458J278o6526L5504
14615e4239N0490M3051R0520M063K7358o924j1242l507j8620q5967j94237K6653
14603a32601O4910N3019J04010M4341N5093M5494r1388p2686j21197j10629J0457
14592a51177O2747O1683J1499l9838L2030J6262K5704J01277Q2413L6182n5008
14581A83774N8920j56943k3437o184q081L2239K1705n5025o8577L0947o0881J8293
14569c3250K3277o0196M4173j6585Q7242L423J6817J8194l1856k6803n8016j61796
14557a95376p6121O5900J07527j4137J5220M5463n7579L6486L5765R2593L6997
$$ plain form
14638 -53767 -27227 -204623 -235325 -46555 -4174 24456 64235 102889 -44582 -93855 -68732
14627 -68732 -106295 -78195 -71828 -10776 -15715 -32220 33599 -11037 -24495 -23217 -89743 -54239
14615 -54239 -3749 39302 129822 133885 161243 154319 143077 139570 120950 34983 -159254 -132601
14603 -132601 -67691 -14672 89338 133679 188772 234266 142878 70192 -51005 -161634 -151177
14592 -151177 -88430 -26747 -15248 -55086 -23056 -6794 18910 120187 202600 238782 183774
14581 183774 242694 85751 62314 56130 48049 80288 101993 46968 -21609 9338 -51543 -33250
14569 -33250 -9973 -70169 -25996 -42581 44661 48084 64901 83095 51239 24436 -33580 -195376
14557 -195376 -271497 -205597 -98070 -112207 -96987 -51524 -109103 -72617 -36852 55741 92738
14546I2738m2409j1491j3999l6669k3898Q4830n0028K461Q9084p7456q6287n0360
14534a23484r487j4621O1939J3618M755K1666K6389J5132N1796j7642l7172M8047
14522D0936l5639l137O5462Q7160m0291j37249N3751J1935m2065q6124J13227
14511B7966K2121j71760j50333P7181R6182O3766K485k1501k5445j3062Q7699
14500d701l6173m3018p0567P6575J70437J39038j52176j22006J9359R9638o128
14489G0278n9041o967M7275K0108J1832N0154m2140j01652Q9962Q0803j189R816
14477A69239l954j13097M7959k8445j26128O8101j2351j29992Q0435K6868o2145
14466h3510Q560L3950J6208P180p6847O2888N114l9345K0578O7171M8707j60573
$$ plain form
14546 92738 50329 38838 24839 -11830 -35728 49102 -926 1535 90619 13163 -73124 -123484
14534 -123484 -132971 -147592 -85653 -72035 -67280 -45614 -19225 -4093 47703 30061 -7111 40936
14522 40936 5297 2160 67622 154782 114491 -22758 30993 42928 863 -85261 27966
14511 27966 50087 -121673 -272006 -194825 -98643 -34877 -32392 -53893 -79338 -92400 -4701
14500 -4701 -40874 -83892 -154459 -77884 92553 231591 79415 -42591 -23232 76406 70278
14489 70278 11237 4270 51545 71653 83485 133639 91499 -10153 79809 160612 159423 169239
14477 169239 165285 52188 100147 71702 -54426 13675 1324 -128668 -48233 -21365 -83510
14466 -83510 -74950 -41000 -24792 -17612 -94459 -31571 -26457 -65802 -45224 21947 70654 -89919
14454h9919L3843K01694O6657n9275k22868k39784m9007J14128J29519M5120K2047
14443d7845q560j04992O654M2953J59430J46368R4848J914j09666j15977l5469
14432B9658j41452j0373O7247K8334J13351L1820K4009K3544K315M3283k398o5358
14420A43980j24907n5984P1204Q7630R0835k7934m9878k1489M0324J8008l4763
14409A37026j00648j23927J5825k1391K7693K1548J06622L5373J6066k172j11019
14398I96j43434j4672Q8562M9957L4249J10767K2473K0691q4943l1765p7671l487
14386b8277Q2654R8526n3065j22406o6526J60634R7825k0637j60327m0040M8636
14375c003n3822k6956N6856P0373M7730J17712N5347l70k8780o4174o1024L6546
$$ plain form
14454 -89919 -56076 145618 212275 153000 -69868 -309652 -358659 -244531 -115012 -69892 -47845
14443 -47845 -56405 -161397 -154743 -111790 47640 194008 288856 290770 181104 65127 29658
14432 29658 -111794 -122167 -54920 -26586 86765 118585 142594 166138 168453 211736 209338 143980
14420 143980 19073 -36911 34293 121923 212758 184824 134946 113457 153781 171789 137026
14409 137026 36378 -87549 -71724 -93115 -65422 -43874 62748 98121 114187 112015 996
14398 996 -142438 -157110 -68548 -18591 15658 126425 148898 169589 84646 52881 -24790 -28277
14386 -28277 54377 152903 99838 -22568 -89094 71540 169365 148728 -11599 -51639 -3003
14375 -3003 -56825 -83781 -26925 43448 91178 208890 264237 263867 235087 170913 109889 146435
14363A46435L2403K4170j8416j05955j41541l4868L8026M9691m7419q540L9255
14352b6759N4473R8384L9598n5311k3184m344M072o3538p8090L7590J7871O1419
14340F2181L2896J6003j6911o7073r1096J42151J42331j36731j15651J6626P3223
14329E7949O9978j2099J1750k8944j16286J2734n9555J7105J51449O583R8410
14318B09074N2787m742L3265k9133q7364o5332j808J7818k8219p8169k32401q4586
14306b98810K3380J45038P7850L7507m1765q8912r396J280k0717N9140j337J0403
14294a06339l244q7308N6611N4745J6582J29219P5827J5430M1695k4954l4942
14283A33322j08605j54146q9690j732j2819J30783j8142J9881j969M6145k881
$$ plain form
14363 146435 178838 203008 184592 78637 -62904 -97772 -59746 -10055 -57474 -66014 -26759
14352 -26759 27714 126098 165696 110385 87201 82857 86929 23391 -54699 -17109 762 62181
14340 62181 95077 111080 94169 27096 -64000 78151 220482 83751 -31900 -15274 57949
14329 57949 127927 115828 127578 98634 -17652 -4918 -64473 -47368 104081 110664 209074
14318 209074 261861 257119 290384 261251 173887 108555 106747 124565 96346 18177 -214224 -298810
14306 -298810 -275430 -130392 -52542 -15035 -56800 -145712 -155108 -153828 -174545 -115405 -116742 -106339
14294 -106339 -109583 -196891 -140280 -85535 -68953 60266 136093 151523 193218 168264 133322
14283 133322 24717 -129429 -219119 -220851 -233670 -102887 -121029 -101148 -103117 -56972 -59853
14272e9853j9712j8850j7296l9486P2511Q7564Q6310o4280o7538M2187J17826
14261A19383q493m7064r8289j55523J34355J57792J06830J52102m6280n0818p7267
14250A86728k91805o9325P9951J18899P2267M1567m6601j3397p5715j50599P0001
14239g8029Q5232J03632L0720o8826k1458O6522n5224r8954k7464k4747J18046
14228B9450j0790j07908l6779k0995J43722R8555J600j57854p2020L7041Q590
14217h7388p198k2331p3526p4600R8050K2116l868Q5212Q5541L6368m5121j29240
14205a15985K0488L8718J6358J06898P3203p4164j0899J4125p7122r636P1377
14194E3361K4420m7254O2096o5354j21121N0629M8161P1644j5030k7871k3L3170
$$ plain form
14272 -59853 -79565 -98415 -115711 -155197 -82686 4878 91188 26908 -40630 1557 119383
14261 119383 110890 63826 -34463 -189986 -55631 102161 208991 361093 314813 263995 186728
14250 186728 -105077 -174402 -94451 24448 96715 138282 91681 78284 2569 -148030 -78029
14239 -78029 7203 110835 141555 72729 51271 117793 62569 -36385 -63849 -88596 29450
14228 29450 18660 -89248 -126027 -147022 -3300 95255 96855 -60999 -133019 -95978 -87388
14217 -87388 -94586 -116917 -190443 -265043 -166993 -144877 -148745 -63533 22008 58376 13255 -115985
14205 -115985 -95497 -56779 -40421 66477 139680 65516 54617 68742 -8380 -18016 53361
14194 53361 77781 30527 92623 27269 -93852 -43223 4938 76582 61552 33681 33658 66828
14182F6828p2790J04397J8401r4805j08455J4034J66777m9343j31435j7310R1030
14171a2671m7461n5484J2425j2463O7705r8549j499J49222k2262r1739R7888m145
14159a9033k015O1671J52747L1572k9733k3380L7169M0001n6507j51286j77829
14148a36623m3273l1825O2503N6044o5348k8330M7912P827R316R5114R3275j2227
14136E4365o6924k5002K2908l3002l8409J3437Q9833O1417l1065M8844j8369k5241
14124E2792o4302J4221M5361J35723l882j34701o8735O8322M286K4907O0851O8037
14112B02880J01760m0514q5510j24511m1299L848j7343m1407L6533K9683J07616
14101A31736J07971l4902j61674j06665k0887N8602l6025l9070K5517L8361P7216
$$ plain form
14182 66828 -5962 98435 116836 22031 -86424 -72390 94387 45044 -86391 -103701 -12671
14171 -12671 -60132 -115616 -103191 -115654 -47949 -146498 -147997 1225 -21037 -112776 -14888 -19033
14159 -19033 -21048 40623 193370 224942 195209 171829 208998 248999 192492 41206 -136623
14148 -136623 -179896 -211721 -149218 -93174 -158522 -186852 -138940 -131113 -121797 -26683 66592 54365
14136 54365 -12559 -37561 -14653 -47655 -86064 -72627 17206 78623 47558 96402 78033 52792
14124 52792 -11510 2711 48072 183795 179913 45212 -23523 44799 49085 73992 134843 202880
14112 202880 304640 264126 178616 54105 12806 16654 -689 -42096 -5563 24120 131736
14101 131736 239707 204805 43131 -63534 -84421 -25819 -61844 -100914 -75397 -37036 40180
14090D0180O5029L2351n2205p3387M6453n4936j16301r8308Q2191N8245J1662
14079e9026L055l8762L8123J92J413j2699Q3875Q1820p9293j29828r510j0248
14067a30888J13769j2448k7457j7968l8097J8507J9538l96o6763R2770J04022
14056E4589k6547m0423q1457q6621M7162J31161J35137k8612K2581K3004K6571
14045A76545J882L8496l3456j59572j4764P7684n2275m7481m0346N2016J19389
14034A18118K7554M7311q8171j0863k6404O0144K4306n0737k8900p8445j15334
14023a21421j6916J51292J13841l310q2492O8268J35176q9078j32719j25203p9047
14012a81609R496O3608J32224k0180j2962K854K6125o1184q7892J46317P0555
$$ plain form
14090 40180 105209 137560 85355 11968 58421 3485 -112816 -211124 -128933 -70688 -59026
14079 -59026 -55971 -94733 -56610 -56418 -55005 -67704 16171 97991 18698 -111130 -120640 -130888
14067 -130888 -17119 -29567 -57024 -74992 -113089 -94582 -75044 -75440 -142203 -49433 54589
14056 54589 28042 -12381 -93838 -180459 -133297 -2136 133001 104389 126970 149974 176545
14045 176545 178427 216923 183467 23895 9131 86815 34540 -12941 -53287 -1271 118118
14034 118118 145672 192983 104812 93949 67545 127689 151995 101258 72358 -6087 -121421
14023 -121421 -138337 12955 126796 123486 40994 109262 244438 155360 22641 -102562 -181609
14012 -181609 -172113 -108505 23719 3539 -9423 -6569 19556 -41628 -129520 16797 87352
14001H7352m165N232L5259j1137j7983o954N5245r1779J2780J38582L734o3861
13989A42305p4170n3031p2285M5243M2015k0091k8163n1084M1113n0525p965M0725
13977d5913K8045j7491o6101L633J15858k5577L5478N8824n5393J2016j2240l784
13965B7355m6718r3863j25936M0096J1046j2392R4621J03856P1099K2031l5386
13954E5809n5338N11M3230m2673L7439j5679k7786J4982N3814q7480l1264k3597
13942g8032O7524Q9P4939q3409J26973j3692M6986J1051q5164q8676o9364J11307
13930B0532j37426m0653j726J5614M4609q884L8411l2616P0464Q4662J36536L0581
13918B20104n1399l9570j27264j13197o7403j05635P4843J43111J13646P8773
$$ plain form
14001 87352 83187 88419 123678 112541 94558 87604 142849 51070 63850 202432 206166 142305
13989 142305 68135 15104 -57181 -11938 30077 9986 -18177 -69261 -28148 -78673 -86638 -45913
13977 -45913 -17868 -35359 -101460 -97827 18031 -7546 27932 86756 31363 43379 31139 27355
13965 27355 -19363 -113226 -239162 -199066 -188020 -200412 -105791 -1935 69164 91195 55809
13954 55809 471 982 44212 1539 38978 23299 -4487 10495 64309 -23171 -54435 -78032
13942 -78032 -10508 -10419 64520 -18889 108084 94392 141378 152429 67265 -21411 -90775 20532
13930 20532 -116894 -157547 -159273 -143659 -99050 -107934 -69523 -102139 -31675 52987 189523 220104
13918 220104 168705 129135 1871 -111326 -178729 -284364 -209521 -66410 47236 126009
13908A26009n4771o2655o7382R0030L4049o382K0281j8516q906q457L569J4407
13896F1276j03102J22149J82342L0484k1792n0351o0894j27165R0630N7077M2960
13885B23614J5520J6100o3834n1986j8485J03351Q472l5866j17620n0237l8345
13874i316o0081Q894J00546m9973j18911J01474J75327R316m3688o9596l4834
13863I158J06874M9077j22388j58679O4660M8200m852M7519Q083J4954m4851m8235
13851c0480q8070N3028K361k0113m0418J66144O9412J7406K15p6061k628K2155
13839G2951k9530j91763p3899R5422O4103J21078J92692j6229o1184n9245Q0766
13828A95162m908j38485J7355o1634K4666O965n6747O8253k1661k9569Q5269k1429
$$ plain form
13908 126009 71238 8583 -58799 31231 65280 58898 79179 60663 51757 43300 46869 61276
13896 61276 -41826 80323 262665 293149 271357 221006 160112 32947 123577 180654 223614
13885 223614 239134 255234 191400 139414 120929 224280 232752 196886 79266 29029 -9316
13874 -9316 -69397 -60503 40043 -9930 -128841 -27367 147960 157276 113588 43992 9158
13863 9158 116032 165109 42721 -115958 -51298 -3098 -7950 39569 47652 62606 17755 -30480
13851 -30480 -118550 -65522 -63161 -83274 -123692 42452 111864 129270 129485 53424 50796 72951
13839 72951 43421 -148342 -222241 -126819 -62716 58362 251054 234825 173641 114396 195162
13828 195162 190254 51769 69124 7490 32156 39121 -17626 50627 28966 -603 84666 63237
13816F3237j5106J7203R8181P3238Q0031j09496j04710j5679K3635J0980l5150
13805H6364L014L5704j01673l4779q2746K06585L5830k0777N486P0639q9953l9682
13793G4012J07446n869j18163m6756m9967Q6538K6883r9269r7242J1142L9447
13782g1798q320R7476N2096j9334L5817L4083m8793p1004l7472J04850J00631
13771A68232L6444o2207q1273j2370l2240J30712J02175j15031N036l4985J00527
13760B05020r1971j71442j6517m0371K4460j0864l3517K073j0159L6005J82204
13749G4921J02200L7946j9119q8405J2120j67577n2338K4448p3102p5104J14449
13738a09561J22987J00765N9259q0455r6636K3404m3776J5428k0229K1587J21983
$$ plain form
13816 63237 48131 65334 163515 236753 316784 207288 102578 86899 110534 121514 86364
13805 86364 89378 125082 23409 -11370 -94116 112469 148299 127522 133008 203647 113694 74012
13793 74012 181458 175589 57426 10670 -39297 47241 74124 -25145 -122387 -111245 -71798
13782 -71798 -80118 17358 69454 50120 85937 120020 71227 223 -37249 67601 168232
13771 168232 204676 142469 61196 48826 16586 147298 249473 134442 139478 104493 205020
13760 205020 113049 -58393 -74910 -115281 -90821 -101685 -135202 -133129 -143288 -107283 74921
13749 74921 177121 215067 195948 107543 119663 -47914 -100252 -75804 -148906 -224010 -109561
13738 -109561 13426 114191 173450 92995 -3641 19763 -24013 -8585 -28814 -7227 114756
13727A14756O8398O3849l7534m8248P8043o385k1958j6649m8221p1986o9741O816
13715A1140l9271l2658J09239J03207l3590j13858j06798l5326Q3596J00994P100
13704E3775l6789L6346P5114L4391Q2419M2362k2050J7130J30749o0625j36134
13693B16688K1128n0645M7225n4515q9683o9658L4321R258l6833L4676R5651l9016
13681A18597q187n9269L0686Q3328J11341j62367M2510J21153m6760r6324j9957
13670A14751Q2735O3959J492r5530k4926o4957k1273M7585J63827J8351M9810
13659C35824r4015q3864R919l7197j25649j41398n8528O0671J23221O9662L3180
13648I1826K2549K1810J33173K4632j19754j44317K8469k2567j2721K5957J29113
$$ plain form
13727 114756 183154 247003 209469 161221 239264 232879 210921 194272 146051 74065 4324 11140
13715 11140 -28131 -60789 48450 151657 118067 4209 -102589 -137915 -54319 46675 53775
13704 53775 16986 53332 128446 162837 245256 287618 265568 282698 413447 352822 216688
13693 216688 237816 187171 234396 179881 90198 20540 54861 64119 27286 61962 157613 118597
13681 118597 110410 51141 81827 165155 276496 114129 156639 277792 231032 134708 114751
13670 114751 197486 261445 262937 167407 142481 77524 56251 103836 267663 286014 335824
13659 335824 241809 157945 167864 130667 5018 -136380 -194908 -134237 -11016 58646 91826
13648 91826 114375 136185 269358 293990 174236 29919 58388 35821 23100 49057 178170
13637A78170J2363O3130K1130k9910o9851P446J8456j1852J2328J5779O8852R589
13625B95630p5441p2844K7021k6040J890q2321o8427k3457N0789M9579P8815l0879
13613A24315L3208P3563o7904l5927j2485j7173n9915j16656o9798K2991P6048
13602d9733o6931k037q0130J82715J85314M421j8686q5516j43834l3437J01422
13591f432O5768j2745k7391K8618J02063L5956j6306O8448N555N2743j4410n4395
13579B27472q0742j20728N7357J66795O6637K7363K6579N9359m0096k07730m2775
13568A39491n4064L1587j3358O118m333o1801J9478L4885J4008N1568Q1285q9395
13556A55469n1279O9281L2000M6299L4009N4305p1091n4628K3924n4845q8950
$$ plain form
13637 178170 190533 253663 274793 244883 175032 182478 200934 189082 201410 217189 286041 295630
13625 295630 220189 147345 174366 148326 150216 67895 -532 -23989 26800 76379 155194 124315
13613 124315 157523 231086 163182 127255 114770 97597 37682 -78974 -148772 -125781 -49733
13602 -49733 -116664 -118701 -198831 -16116 169198 173619 154933 69417 -74417 -107854 -6432
13591 -6432 59336 46591 19200 47818 149881 185837 169531 237979 243534 296277 281867 227472
13579 227472 146730 26002 83359 250154 316791 344154 370733 430092 389996 182266 139491
13568 139491 85427 117014 103656 109774 105441 43640 63118 98003 112011 163579 244864 155469
13556 155469 104190 173471 205471 251770 285779 340084 268993 214365 238289 183444 94494
13545I4494m1309l8850J2861L6841J7040P2064l9304Q9329l2514j4896O5489q3528
13533A37717j04554m042J671m406l8048j769J84794J53813N6001j3293k07187
13522A60697n0394L1083R8998R9457o6675j53371o2220L4959J06520q9882j9498
13511H9674m6939j40697K3173O3420O4909J19764O1384o10n6383j12120p545K3172
13499H1202O1212M3134N5537j0684J53418L4516j53246n2284M0285k5596j26209
13488A01285r6160K6693k1871j1964k6026p6412n5346K4130J07026P3946L8348
13477H3649p0530P5575O7592N6837m9752l3958l4177J12118N7397m9136M501P0231
13465B90347K7757L5539o820k7441J5721n4968J2608m4964q6569m5847J6827P4642
$$ plain form
13545 94494 53185 14335 27196 64037 81077 153141 113837 203166 170652 155756 221245 137717
13533 137717 33163 29121 30792 26386 -11662 -13431 171363 325176 381177 367884 160697
13522 160697 110303 141386 240384 339841 273166 119795 57575 92534 199054 109172 89674
13511 89674 42735 -97962 -74789 -11369 53540 173304 234688 234078 177695 65575 58030 81202
13499 81202 142414 185548 241085 230401 383819 418335 265089 212805 253090 227494 101285
13488 101285 5125 31818 9947 -2017 -28043 -104455 -159801 -135671 -28645 45301 83649
13477 83649 13119 88694 156286 213123 163371 129413 95236 207354 264751 215615 220116 290347
13465 290347 318104 353643 346823 319382 335103 280135 292743 247779 161210 115363 132190 206832
13453B06832J3063j9557N5085j17271j5662o9438O6211J25779j4688o9530M1217
13442B02041l969k6392J4607R6139p0671m1830R1054n310j2940Q37O6816m6763
13430B63619q4537J3039J09952j2259p9173o1664j7652J4164L4876p9898j4362
13419H6105L1883j45957j4241N2707J56849J86516P0513j19829o3348J7226q374
13408B50050k79K2863n8533l6070Q451L7634j2041j8089O3820M4532j43076j08432
13396E0830L68P7696J02511m3102l0376l2060l4408P8999l2988o4030J3288Q2166
13384A68894R6952m2311P483R412L1472M0371J2075k7202N3507k0344Q593m6439
13372B92463J08839q001j043N0217q8965r3078m548N110m7919N7654P3541m8723
$$ plain form
13453 206832 219895 200338 255423 138152 122490 53052 119263 245042 230354 160824 202041
13442 202041 198072 171680 186287 282426 211755 169925 260979 255669 242729 243566 310382 263619
13430 263619 179082 192121 302073 289814 210641 148977 131325 145489 180365 100467 86105
13419 86105 117988 -27969 -42210 10497 167346 353862 424375 304546 241198 258424 250050
13408 250050 249771 272634 214101 178031 186482 224116 212075 193986 257806 302338 159262 50830
13396 50830 51198 128894 231405 188303 157927 125867 91459 170458 137470 73440 86728 168894
13384 168894 265846 223535 231018 240430 271902 312273 324348 297146 350653 330309 338902 292463
13372 292463 401302 393301 392258 442475 353510 260432 255884 260994 213075 270729 344270 295547
13360B95547j15371K2396Q561j58073J6486J43332K5381o7846K616o0543L3930
13349A46416J13791o8275j3927j8935p729o064O7201o7857j42185J11631J06478
13338B20545R1686J66727j96685j22859p0391J79492O8411o4323N0935l0186j41525
13327A51827o9791q57J3717L5214p6l1097J9818J7346M3882p322J2427R9781L1087
13314C15956Q5697L5813M8192j32989j29549n4569n2133k2202K7958Q0367K2458
13303B24999J58297M2294k7809j27639l8015o8738L714J07113l9161o6870m1616
13292A26569J3749r626k6393J25971J37737J4895k5770k6661n2135Q879Q0366
13281C67581M5604k3880q6533k5924l2317o2882j1451K8954P3347P0879p7379
$$ plain form
13360 295547 180176 202572 211133 53060 69546 212878 238259 170413 173029 112486 146416
13349 146416 260207 191932 178005 159070 151341 145277 212478 144621 2436 114067 220545
13338 220545 312231 478958 282273 159414 89023 268515 336926 272603 323538 293352 151827
13327 151827 82036 81179 94896 130110 130034 98937 118755 136101 179983 172661 185088 284869 315956
13314 315956 401653 437466 485658 352669 223120 168551 116418 94216 122174 202541 224999
13303 224999 383296 425590 397781 270142 232127 163389 167103 274216 235055 168185 126569
13292 126569 140318 130692 104299 230270 368007 382902 357132 330471 278336 287215 367581
13281 367581 413185 389305 302772 276848 244531 181649 170198 199152 272499 343378 265999
13270B65999m8010N2014L6268R7060J4255q371K7089J28677j44125j42693K278
13259B80441k8067l7784k0138Q6854J64528j7288J4140r3871l2240m8704N8107
13248C25978P5499L5413p6948j12882o7670N2188k6495Q4885K2071J27054O1016
13237E00109L6520j8772j05473k48697j86052J22209J53095k4002O176K6284j7871
13226B43526j3752J9286N4779P0760l4004J5598J3679j4195J6816R5940k8683
13215D39750N3123K574r2042r4388J9371J084R2563P5053j86r0216p5786m2703
13203B88197J25025J17312n6089J7204R826p9585o6198o6408J6725r292j0809
13192B85908M2789R8118L5738J06323l3825j09886k3072n4417p9019R4729O2737
$$ plain form
13270 265999 217989 270003 306271 403331 417586 409215 436304 564981 420856 278163 280441
13259 280441 252374 214590 194452 281306 445834 428546 442686 348815 316575 267871 325978
13248 325978 401477 436890 359942 247060 179390 231578 205083 289968 312039 439093 500109
13237 500109 536629 517857 412384 163687 -22365 99844 252939 228937 235113 261397 243526
13226 243526 229774 249060 303839 374599 340595 356193 369872 355677 372493 468433 439750
13215 439750 492873 495447 403405 309017 328388 329472 422035 497088 496902 406686 330900 288197
13203 288197 413222 530534 474445 491649 501475 421890 355692 289284 306009 296717 285908
13192 285908 328697 426815 462553 568876 535051 425165 402093 347676 268657 363386 426123
13181D26123r6030K1056l9176K4410L0636j4170J5502J0770R7016O9082j9785
13170E25434k1055j89078q4925k0465p4902K0039P0877J44703R8204L3683l4935
13159D67580l499K6482j00675o3752M5323K7996j5510R1801q3478m3677J28604
13148D77195L5579j5178N4959n3968J7411j36385l4824j4914L7010J42578L1340
13137E40803k5663j15227k43714j0958J38979P0143J53745J21059L0037M3601
13127G02805o2776P817L6592N8566K9417j11807p2131j40835n4735N152J16336
13116E14401J25507O3242j22149k00591p2929L9442J4326J36483J78294q7183
13106E88843j34469l2765l7522J0686Q8690O6327R5678m2729j7255J7243N043
$$ plain form
13181 426123 330093 351149 311973 336383 367019 352849 368351 379121 476137 545219 525434
13170 525434 504379 315301 230376 209911 135009 155048 225925 370628 468832 502515 467580
13159 467580 464081 490563 389888 326136 371459 399455 383945 475746 392268 348591 477195
13148 477195 512774 497596 552555 498587 515998 379613 344789 329875 366885 509463 540803
13137 540803 515140 399913 156199 145241 284220 354363 508108 629167 659204 702805
13127 702805 640029 647846 684438 743004 772421 660614 588483 447648 392913 398065 514401
13116 514401 639908 703150 581001 380410 307481 346923 361249 497732 676026 588843
13106 588843 454374 421609 384087 394773 483463 549790 645468 602739 585484 602727 607770
13095F07770P3406N1461o3514p5867L0292P4944q8363j01612J42278R3213J2341
13084G56349l9115R1754O8624o7734P0092O9596M7391j28991q9197J08618J9432
13073I06819L3825r2044k02791M8056j52003j621P9186J28906J37280q3215o7986
13062G34412M391j08673m183L0005L8827J86916j19730j37883k4737Q1389M6081
13051G26815j2866k5646o0189J22447K10203k567r838P4348j60402q0090P8363
13040H60578p7348j21066r6578j0218N3957M5522J44565N9456j67147j10662Q6665
13029F67724K66055M3827Q5229k2705r1656o2496K3032J1587K331j3598R2486
13018A001816j4147k465N6365j00920K6591J2425N9308P17N2533Q717J432p4359
$$ plain form
13095 607770 681176 732637 669123 593256 623548 698492 610129 508517 650795 744008 756349
13084 756349 717234 808988 877612 809878 879970 949566 996957 867966 778769 887387 906819
13073 906819 940644 848600 645809 693865 541862 540241 619427 748333 885613 802398 734412
13062 734412 738803 630130 625947 655952 694779 881695 761965 624082 599345 680734 726815
13051 726815 713949 688303 628114 750561 960764 958197 948359 1022707 862305 782215 860578
13040 860578 783230 662164 565586 555368 609325 654847 799412 858868 691721 581059 667724
13029 667724 933779 977606 1062835 1040130 948474 885978 909010 920597 922928 909330 1001816
13018 1001816 987669 985204 1041569 940649 967240 979665 1038973 1039690 1092223 1100940 1102372 1028013
13006A028013K9971N2664j10060L5565J4288R521J7695M9280P174O2559n8542
12995A138128m6666J00813J21237n6206j9902P0200M2819J9761n7361Q7530P8417
12984A478770n1744n4532r0231j5720J16126O9477J8344L3161m9986l2106J2736
12973A434295n2942O5438K38858J05770J51793m6885j98R8657P5008J31109k55
12962B200648J3525K438q0916r2292M2781P9757l5724j19343q0657M1184R3236
12951B064637p2774k7840O1487m7250k2279l1224n1743j20938k2079P2957j2447
12940A790507r0952m2322O3699O3089P1350Q7327p935k46553m6950J25872O0152
12929A827284p6987j25469N4862J33475J05486P2693Q795k474J20548P5405n1082
$$ plain form
13006 1028013 1057984 1110648 1000588 1036153 1050441 1059962 1077657 1126937 1134111 1196670 1138128
12995 1138128 1091462 1192275 1313512 1257306 1237404 1307604 1350423 1370184 1312823 1400353 1478770
12984 1478770 1427026 1372494 1282263 1266543 1382669 1452146 1470490 1503651 1453665 1421559 1434295
12973 1434295 1381353 1446791 1685649 1791419 1943212 1896327 1896129 1994786 2069794 2200903 2200648
12962 2200648 2214173 2216611 2135695 2043403 2086184 2165941 2130217 2010874 1930217 1971401 2064637
12951 2064637 1991863 1964023 2025510 1978260 1955981 1924757 1873014 1752076 1729997 1802954 1790507
12940 1790507 1699555 1657233 1720932 1784021 1855371 1942698 1934763 1688210 1641260 1767132 1827284
12929 1827284 1750297 1624828 1679690 1813165 1918651 1991344 2000139 1997665 2118213 2193618 2142536
12918B142536k560J3352R8582k7230q9883L1739K2423l72K6279K2170j4053l5060
12906B187923J01969K5839r744J40927K1751j43349p4776J23511L2065M6497k895
12895B449718K7208Q8004r4697K9568J21187R4447m9624q0492K6236R6664O9551
12884B777770J46485p178j30783l1977M568k648Q6981N5676J9730N7802J06481
12873C082907j7897J15846J7495k5410j7102k4841L6812N0124K4350J59452J90338
12862C592074N9110M9784L5576k8466M010Q4250O6007K2151J1493P5455K28096
12851D199540r402O1524n5357o7437J01188K05525J48042k4520J23368N683M5883
12840D734037N8644K3518N3395J81262K22001K21774J71117P4002J3780n29J73184
$$ plain form
12918 2142536 2139976 2153328 2251910 2224680 2134797 2166536 2188959 2188587 2214866 2237036 2222983 2187923
12906 2187923 2289892 2315731 2305987 2446914 2468665 2325316 2250540 2374051 2406116 2452613 2449718
12895 2449718 2476926 2564930 2470233 2499801 2620988 2715435 2665811 2585319 2611555 2708219 2777770
12884 2777770 2924255 2917077 2786294 2754317 2758885 2756237 2843218 2898894 2918624 2976426 3082907
12873 3082907 3065010 3180856 3198351 3172941 3155839 3130998 3167810 3217934 3242284 3401736 3592074
12862 3592074 3651184 3700968 3736544 3708078 3712088 3796338 3862345 3884496 3895989 3971444 4199540
12851 4199540 4190138 4251662 4196305 4128868 4230056 4435581 4583623 4559103 4682471 4688154 4734037
12840 4734037 4792681 4816199 4869594 5050856 5272857 5494631 5665748 5739750 5753530 5753001 5926185
12829E926185K3153L4467J22881Q9886J11789J42327Q7013J42536R1081k8715
12819F742603K086J52027Q5609K13810K49969J90018Q0536Q3722K8067j8910N9190
12808G868727K56661K07934J51663K13506K04328J17601J90075J60688K89255
12799I660438K48977K18933K40229K04058K95485K69848K47605K40598K97387
12790A1923558K49232L17127J80215K91787K20133K22345M02819L61942L50928
12781A4520086L93162M00476M95135M57708L20427N40415N71934L95372N11657
12772A8606372O77511O79704M61046N12408O42135P63223P12659P23051Q78924
12763B4657033Q46707R23204Q91176Q68907J028711J186347J138062J202846J178336
$$ plain form
12829 5926185 5949338 5983805 6106686 6196572 6308361 6450688 6537701 6680237 6771318 6742603
12819 6742603 6744689 6896716 6982325 7196135 7446104 7636122 7716658 7800380 7828447 7809537 7868727
12808 7868727 8125388 8333322 8484985 8698491 8902819 9020420 9210495 9371183 9660438
12799 9660438 9909415 10128348 10368577 10572635 10868120 11137968 11385573 11626171 11923558
12790 11923558 12172790 12489917 12670132 12961919 13182052 13404397 13807216 14169158 14520086
12781 14520086 14913248 15313724 15808859 16266567 16586994 17127409 17699343 18094715 18606372
12772 18606372 19283883 19963587 20424633 20937041 21579176 22342399 23055058 23778109 24657033
12763 24657033 25503740 26426944 27318120 28187027 29215738 30402085 31540147 32742993 33921329
12754C3921329J303163J329598J461221J592955J554027J579770J717966J808560
12746D6268589J962023K202841K283796K378410K393046K499458K552257K632127
12738F5172547K950031L203665L199756L279691L483480L698828L756033L790358
12730I2534389L792157L777841L675793L791116L726323L678569L579912L185882
12722A21741982K983449K673808K408256J933854J439259R62733M57817k1784
12714A34579374l02711p64277j355783j634854k010193k368058k509930k593256
12706A21040312k893251l095248l162015l275776l306188l320253l236065l246950
12698I5504566l198152k968123k981423k882571k727754k814390k689986k573106
$$ plain form
12754 33921329 35224492 36554090 38015311 39608266 41162293 42742063 44460029 46268589
12746 46268589 48230612 50433453 52717249 55095659 57488705 59988163 62540420 65172547
12738 65172547 68122578 71326243 74525999 77805690 81289170 84987998 88744031 92534389
12730 92534389 96326546 100104387 103780180 107571296 111297619 114976188 118556100 121741982
12722 121741982 124725431 127399239 129807495 131741349 133180608 134143341 134601158 134579374
12714 134579374 134276663 133512386 132156603 130521749 128511556 126143498 123633568 121040312
12706 121040312 118147061 115051813 111889798 108614022 105307834 101987581 98751516 95504566
12698 95504566 92306414 89338291 86356868 83474297 80746543 77932153 75242167 72669061
12690G2669061k472440k411132k249100k159639k066691k141149k011655j703290
12682E5453965j743420j742832j624753j475245j425387j533180j498458j373957
12674D3036733j380633j222545j087849j085509j105353j014822j040669r57856
12666C4141497r35231r31425q91977p73390p78893p82239q79671p98401p63194
12657B6607076n80308o06505o26855o00483o19273o98082n74531n14774n14126
12648B1272139m79510n28504m80136n07443m46498m66319l50352k91641l51197
12639A7370539m55792n49433m52337l80529l15243l17856l78198m36816l06073
12630A3778262l51400l26459j47197l05394k52441j65286l32523k43726k48523
$$ plain form
12690 72669061 70196621 67785489 65536389 63376750 61310059 59168910 57157255 55453965
12682 55453965 53710545 51967713 50342960 48867715 47442328 45909148 44410690 43036733
12674 43036733 41656100 40433555 39345706 38260197 37154844 36140022 35099353 34141497
12666 34141497 33206266 32274841 31382864 30609474 29830581 29048342 28168671 27370270 26607076
12657 26607076 26026768 25420263 24793408 24192925 23573652 22875570 22301039 21786265 21272139
12648 21272139 20792629 20264125 19783989 19276546 18830048 18363729 18013377 17721736 17370539
12639 17370539 16914747 16365314 15912977 15532448 15217205 14899349 14521151 14084335 13778262
12630 13778262 13426862 13100403 12953206 12647812 12395371 12230085 11897562 11653836 11405313
12621A1405313j92057l32516k22812j70071k62614k90423j58176k00229k41293
12612I335122k83324l16847k29335j88017k9383q6850j54881j24324o6770k02433
12602G652958k37971n5614j88600l30728j56292q0206m937q3091k09386o5365
12592F240768p0699l9503p8422j72812k51531j57629k9500j1377r2754k47739
12582E088802k95766r8661N6553l7855j10811p0878q9076j34941p371k484q709
12571D288803q7218K058r1130j36691m7408q9979m432p7899j30967j02325O4867
12560C587679n1337n5132N1763n3674j49747p7361N3798l7847O3280Q2977R3236
12549C507635J20728P0345O4028R5137m9155J10785j95262l36550k02123j62354
$$ plain form
12621 11405313 11213256 10880740 10657928 10487857 10225243 9934820 9776644 9576415 9335122
12612 9335122 9051798 8734951 8505616 8317599 8288216 8201366 8046485 7922161 7855391 7652958
12602 7652958 7414987 7359373 7170773 6840045 6683753 6603547 6598610 6515519 6306133 6240768
12592 6240768 6170069 6130566 6052144 5879332 5627801 5470172 5440672 5429295 5336541 5088802
12582 5088802 4793036 4694375 4750928 4713073 4602262 4531384 4442308 4307367 4299996 4297512 4288803
12571 4288803 4201585 4203643 4112513 3975822 3928414 3838435 3834003 3756104 3625137 3522812 3587679
12560 3587679 3536342 3481210 3532973 3479299 3329552 3252191 3305989 3268142 3331422 3414399 3507635
12549 3507635 3628363 3698708 3762736 3857873 3808718 3919503 3724241 3387691 3185568 3023214
12539C023214k14931O2948j66438j22521L6695K3091l0533o5751k9173o6939r137
12528B440525j23313O9625o2214L9040k6798J1506M7210J47087p1155j40379K3944
12517B355078k4709N2093l924q5786P9973N1634p0961k0823J35722J13635j6605
12506B565327M3878K59804M58965O14107O51302M71166J48936k27501n26500o86449
12496C773035n39051l49884k93041j81483j07160m3430N364j59935n6961K0560
12486B068014j71063j43409R8887j7655L5207O4869l4082q1933P1270J3009r56
12475A902158J19575J07593M6578l6958k2289r494J02229K09831O2716K9638K8727
12464B540304n053J13594J80771J09577L28201M91357M92913K78951J86631N9077
$$ plain form
12539 3023214 2808283 2871231 2704793 2582272 2618967 2642058 2611525 2545774 2516601 2449662 2440525
12528 2440525 2317212 2386837 2324623 2363663 2336865 2348371 2395581 2542668 2471513 2331134 2355078
12517 2355078 2330369 2382462 2378538 2292752 2372725 2424359 2353398 2332575 2468297 2581932 2565327
12506 2565327 2609205 2869009 3327974 3942081 4593383 5064549 5213485 4985984 4459484 3773035
12496 3773035 3233984 2884100 2591059 2409576 2302416 2258986 2264350 2104415 2047454 2068014
12486 2068014 1896951 1753542 1852429 1834774 1869981 1934850 1900768 1818835 1890105 1903114 1902158
12475 1902158 2021733 2129326 2175904 2138946 2116657 2107163 2209392 2419223 2481939 2511577 2540304
12464 2540304 2535251 2648845 2829616 2939193 3267394 3758751 4251664 4530615 4717246 4776323
12454D776323n30059p77626o33070m21527j86432j42604k38386j76478k36067
12445A434074r9302M2451M3469N1407l7231J9409K2908p5762n0859o7990j706
12434A280868o1479p2957K166J4447K8629j24019q6190J1383N602O3721R0560
12423A152731P5205j15379j41121K3062J84151J02661J36314P9525K07803J92006
12413A896958L4842J98217K1664m0736k06048k33279k74428k10538n4787r3574
12403A038291j35195J5972k6274J8767P1370Q0778m4311q0584R138o1350j00952
12392G85650p5745K6477J15391O0469n068Q9163J38099J8952l575j26955K1180
12381A044038l8150k32810o8313L3322M1926k9709J2933Q7503J03920j8763q4012
$$ plain form
12454 4776323 4246264 3468638 2835568 2414041 2227609 2085005 1846619 1670141 1434074
12445 1434074 1334772 1377223 1420692 1472099 1434868 1454277 1477185 1401423 1350564 1282574 1280868
12434 1280868 1219389 1146432 1148598 1163045 1191674 1067655 981465 992848 998450 1062171 1152731
12423 1152731 1227936 1112557 971436 994498 1178649 1281310 1417624 1497149 1704952 1896958
12413 1896958 1931800 2130017 2151681 2110945 1904897 1671618 1397190 1186652 1131865 1038291
12403 1038291 903096 919068 892794 911561 982931 1063709 1019398 938814 947952 886602 785650
12392 785650 709905 736382 851773 912242 907174 996337 1134436 1153388 1149813 1022858 1044038
12381 1044038 1005888 773078 704765 738087 780013 750304 763237 850740 954660 935897 851885
12370H51885L8740k0881q0149P06l3119j32693K6969R024L6903k7319l3678o5967
12358E70421l7751l4765p9797J4613Q2824J83531p5822r0736N7667j4000m7278
12347E28907j3436N9246m7679l1515M0459J464q7279J2081M7058p0627j5886O4526
12335D87319N2990p6032o6287Q958Q2433Q2794K4729j27356j64251j0897j8076
12324B76324J27162P0188J4794M8804j6049m9097K9337L3375O1568m4460N2818
12313F04764M2326j53670r2104J08030j10790j50763o482l186m6846J22134M9439
12302C62852L7982j0448n3973K3267O2639j9875o2980J8549L1358M5887K7784
12291D63042O9064m9057k1577o2860j564J493n3890K4490M522m7720j4457J028
$$ plain form
12370 851885 890625 869744 789595 790301 757182 624489 651458 660482 697385 670066 636388 570421
12358 570421 532670 497905 418108 432721 515545 699076 623254 532518 590185 576185 528907
12347 528907 515471 574717 527038 495523 535982 537446 450167 462248 509306 438679 422793 487319
12335 487319 540309 464277 397990 406948 489381 572175 596904 469548 305297 294400 276324
12324 276324 403486 473674 488468 537272 521223 472126 501463 534838 596406 551946 604764
12313 604764 647090 493420 401316 509346 398556 247793 241311 238125 191279 313413 362852
12302 362852 400834 390386 336413 359680 422319 402444 339464 358013 389371 435258 463042
12291 463042 532106 483049 461472 398612 397048 398541 344651 369141 373663 325943 311486 312514
12279C12514M2599N0383r3500r5097J83193m9780M4364M3684m0417O0542j710
12268D56775o952k0002j13488j3667K2868P261n7023r0281j53276Q0965P7488
12257A90668O7377R6702M3685L7776O8524j23820n5842P9662R337m7893L926j25557
12245B44545p7350o4763K8883O4093J67053J6116K6291n1786j72865M1350O9151
12234B90718j20512N774R9444L5652j1126k9887N4579J9080m4004j01362K5107
12223B23463M6498O448o4749M5167k4159K2317N995n5254n3807o4330j24224n0617
12211h7252J03338J57738j9827l3726k241N9294J711N79q3621p4559Q9998M4316
12199A55748p1098p8861o2516M5677l6863J11810N4930K5306L1101Q7202J8813
$$ plain form
12279 312514 355113 405496 311996 216899 400092 350312 394676 438360 397943 458485 456775
12268 456775 449823 429821 316333 302666 325534 332795 275772 185491 32215 113180 190668
12257 190668 258045 354747 398432 436208 504732 380912 325070 404732 414069 366176 370102 244545
12245 244545 167195 102432 131315 195408 362461 378577 404868 353082 180217 221567 290718
12234 290718 170206 175980 275424 311076 299950 270063 324642 343722 299718 198356 223463
12223 223463 269961 276409 211660 256827 232668 254985 260980 205726 151919 87589 -36635 -87252
12211 -87252 16086 173824 153997 120271 118030 177324 179035 179614 95993 21434 111432 155748
12199 155748 84650 5789 -56727 -11050 -47913 63897 118827 144133 175234 262436 281249
12188B81249j06549j4984k2318R093Q0264m9551o3554q9640O5414N9043P3038
12177B21505m7503p6952j16556j16964P1556K02598N0341o2516q1364J07342m4228
12166A07259P560K2235o2389L3598R2422L7750k7712J4309m0140m0741Q907n9781
12154I3277j3848J97o80K7532Q2611M4782k1517j15384N0085O6568k1137p0319
12142A22167l2151j01448R7015J54654o5559p095P2385p0306L2472L6073p634
12131B30573k6352J27430K2456r770L8468k60025j30034l1827j1305j272J09902
12120E8244R9703k6092Q871K0905O0189q4657j38303r0001L1753J24748N2381
12109A17741O4305M5077m2018n6384J1961n9574o6350J54235n00K4002N4765m4860
$$ plain form
12188 281249 174700 159716 137398 146491 226755 177204 113650 24010 89424 148467 221505
12177 221505 174002 97050 -19506 -136470 -64914 137684 188025 125509 44145 151487 107259
12166 107259 114819 137054 74665 108263 200685 238435 210723 225032 184892 144151 153058 93277
12154 93277 79429 79626 78946 106478 189089 233871 212354 96970 147055 213623 192486 122167
12142 122167 90016 -11432 85583 240237 174678 167583 239968 169662 202134 238207 230573
12131 230573 204221 331651 354107 344337 382805 122780 -7254 -39081 -50386 -51658 58244
12120 58244 157947 131855 140726 161631 221820 137163 -1140 -91141 -59388 65360 117741
12109 117741 182046 227123 185105 128721 140682 81108 14758 168993 168493 192495 247260 202400
12097B02400k6992n4151j02543O5092N5571n5341J6709r2758j2390R4182l0073
12086E9706k4507L4691r42L6392N6826m1322N2624M6712m5199p6551n5628j5702
12074B7100m8827n5115J325O2186k1813R057Q6373L8462O5642K9333P7259M3143
12062C14125m0354r9693j33086k6833N3541L0041L1236K4139q052k5546j625o1140
12050E6753j51502j26541k565n096J30452O3133q7150l2531K0484R4788O3508
12039B3733P5024K4799l859k9731n6198R3804m7876j14448N2361J62338M3273
12028B23220J2254l7638j9359q6927m1310K3830K5909p2225j09236l8535R4936
12017b5081J22849J38958j47870m8085N306l3836R4969m0524o8450Q6853J2251
$$ plain form
12097 202400 175408 121257 18714 83806 139377 84036 100745 7987 -4403 89779 59706
12086 59706 35199 69890 68948 105340 162166 120844 173468 220180 174981 98430 42802 27100
12074 27100 -21727 -76842 -75517 -13331 -35144 -26087 60286 98748 164390 193723 270982 314125
12062 314125 273771 174078 40992 14159 67700 97741 128977 153116 145064 119518 117893 56753
12050 56753 -94749 -221290 -223855 -228951 -98499 -35366 -122516 -155047 -134563 -39775 23733
12039 23733 98757 123556 119697 89966 33768 127572 79696 -34752 17609 179947 223220
12028 223220 235474 197836 178477 91550 50240 74070 99979 27754 -81482 -120017 -25081
12017 -25081 97768 236726 88856 40771 46077 12241 107210 66686 -1764 85089 97340
12006I7340k413K7377m4722j05470k3341Q6041L7764L0886k1435q2010n7575L1850
11994b5708j9087M1691M7668J26858O66N8777J0517m6155p9046q5023j0551k2792
11982b185M0348m0597l1533J03285k5045q12J31477l7687m2170M4941o6245r3045
11970a9268j9728k0375Q9687n2730l3216n9276n4631R5319O2528j5898N2017n2705
11958b8276M323L7592O9624L5303M8809p2440j28696J2018L2281k7110o6818q0859
11946a64249L6150Q5836J08532m2962J5027o592j32292m671O4569m5822n4672
11935a41146L5173J23429L2240j9961m5120j08494K13267R9347j8635q9141n5777
11924B5182J69415K5121j85577o6755k8037l2601J0478q358P3263Q6884P8814
$$ plain form
12006 97340 94927 122304 77582 -27888 -51229 34812 72576 103462 82027 17 -57558 -25708
11994 -25708 -44795 -3104 44564 171422 172088 230865 241382 195227 116181 31158 20607 -2185
11982 -2185 38163 -2434 -33967 69318 44273 43461 174938 137251 95081 140022 73777 -19268
11970 -19268 -38996 -59371 30316 -22414 -55630 -114906 -169537 -74218 -11690 -27588 24429 -28276
11958 -28276 -23953 13639 83263 118566 167375 94935 -33761 -21743 10538 -16572 -83390 -164249
11946 -164249 -128099 -42263 66269 23307 38334 31742 -100550 -105221 -40652 -86474 -141146
11935 -141146 -105973 17456 49696 29735 -15385 -123879 89388 188735 170100 80959 25182
11924 25182 194597 219718 34141 -32614 -60651 -93252 -82774 -91132 -17869 69015 147829
11913A47829O002n6671n7976n3126N2873O735r846L6464P6908R7716k2635N3582
11901B77855M8635m6406o3049k819N8582k1757m3664O1283j3731p8188m8967o3277
11889F4497o041n2911n2651P0973J46774K0820k37643K0616O349l8743k7070J1308
11877g3722j4109L3071M5417M5787J6060Q1329q3245r9963m969K9038N0971J29120
11865A54785O2566p1710j61774k1751k0168M0196R6119K8717J8373r2424o5607
11854c2678p1103m3294J37663J05798q4470m0407j04287l4597L9744L7115l1323
11843a21839n2810J4291L2103J94328M2846n5250r8113m9128K9747J43619o912
11832G2882k3562J71876J0937l4877n4288j62286q6049J55373J13445j9085l5863
$$ plain form
11913 147829 153831 97160 39184 -13942 38931 45666 35820 72284 149192 246908 224273 277855
11901 277855 326490 280084 217035 214216 272798 251041 207377 268660 254929 176741 127774 64497
11889 64497 58456 5545 -47106 23867 170641 191461 -46182 -25566 -19217 -57960 -85030 -73722
11877 -73722 -87831 -54760 -9343 36444 52504 133833 50588 -49375 -54344 -25306 25665 154785
11865 154785 217351 145641 -16133 -37884 -58052 -17856 78263 106980 125353 32929 -32678
11854 -32678 -103781 -147075 -9412 96386 11916 -28491 -132778 -167375 -127631 -90516 -121839
11843 -121839 -174649 -160358 -128255 66073 108919 53669 -44444 -93572 -63825 79794 72882
11832 72882 49320 221196 232133 197256 142968 -19318 -105367 50006 163451 144366 108503
11821A08503q4538l1103n733K3812m8961n0292O5287K8346r7811P048j46367j2070
11809b43879K55095J56865n8627k7490j3705K5425O1325r0932j08581j63609k6666
11798b34779O1154J47026q3105r5149M8132Q1009M9351K6002O7902p0609J598
11787a468o8715o8223N3640J8328j0788J42846J3240j1004l7562n3276M6377J1101
11775C4496j13115j6025q6438J0869R9118j02687n0577K4858J22398P4115p2884
11764g5872R071r188k5032k5610N245J45154J18609j55769m2851J72626N6921
11753A73304l2087j18978j1114O6546q0626p9157q995M440n3916P4632M1873k8629
11741e2707j07294q7651m8071m231N2947Q5309J7923l4755N9919Q3623R8132M5988
$$ plain form
11821 108503 23965 -7138 -12871 10941 -38020 -88312 -23025 5321 -92490 -85442 -231809 -243879
11809 -243879 11216 168081 109454 81964 68259 93684 155009 64077 -44504 -208113 -234779
11798 -234779 -173625 -26599 -109704 -204853 -156721 -75712 -26361 -359 67543 -3066 -1468
11787 -1468 -70183 -138406 -84766 -66438 -77226 65620 78860 67856 30294 -22982 23395 34496
11775 34496 -78619 -94644 -181082 -170213 -71095 -173782 -224359 -199501 -77103 -2988 -75872
11764 -75872 -66801 -75989 -101021 -126631 -121386 23768 142377 -13392 -56243 116383 173304
11753 173304 141217 22239 11125 77671 -2955 -82112 -91107 -86667 -140583 -65951 -24078 -52707
11741 -52707 -160001 -247652 -295723 -299954 -247007 -161698 -143775 -178530 -118611 -34988 63144 109132
11729A09132Q779k057m2670q4595l9072N8566Q8684J30766j13661k04794l4103
11718a25025J25698R0679j2516M5596p990K9971p6259j62356P0719l0881L1622
11707b0742L1974K3624k3112j05646J9368J19600R6298r1974J7653K9849O7985
11696A64877j8893o2050j26970j49547n0292J27604J28177M6680Q2631o5890K841
11685G9168K8634J1707o2588j3540k2094O6863R43k2192N3222m015m5406k411
11673F8291k0654m0277K6170R2929m2270j39294r8273J2049R9931J4590M6354
11662A9546J2933N9228K8713N57k409K6492p1783q9879L9945O3800j00416l9903
11650e3176j7066O2814k2298l7538O398j6751M8020l0715m7388j740M109k510
$$ plain form
11729 109132 117911 115854 73184 -11411 -50483 8083 96767 227533 113872 -90922 -125025
11718 -125025 673 91352 78836 124432 116442 146413 70154 -92202 -21483 -52364 -20742
11707 -20742 11232 34856 11744 -93902 -74534 45066 141364 49390 67043 96892 164877
11696 164877 145984 83934 -43036 -192583 -242875 -115271 12906 59586 142217 76327 79168
11685 79168 107802 119509 56921 43381 21287 88150 89093 66901 120123 116108 70702 68291
11673 68291 47637 7360 33530 126459 84189 -55105 -153378 -141329 -41398 -26808 19546
11662 19546 32479 91707 120420 120977 118568 145060 73277 -16602 23343 87143 -13273 -53176
11650 -53176 -70242 -7428 -29726 -67264 -60866 -77617 -29597 -60312 -107700 -109440 -105331 -107841
11638a07841j00412M27N8185J43424J3455l4013J11280q8294j5370N6404k3843
11627A3402p6076n7309O8354J26447J25609j18102o0730l9988j22371J37995N9825
11616E7056J833L8782M8666J0971j3255j08904j60935L3335J09857O4839o303
11605G5942j08366q373o0908j11626J02366m854m7659J8433j8600J69762J15652
11594A21769j1543m7403M5373J7600p2670l7463j666Q8538J5628r1673J37928
11583A64418N876o2579j12913p730Q2894N1270o8277l3956p3755K2618j4045j09822
11571a56001J3735O0277J9903N1827k3015n7772J45972J2720m1007k9492r4428
11560i7281N2071J08106m8385K1706R190j2J36446N2016j3254j12526p6301N2227
$$ plain form
11638 -107841 -208253 -207826 -149641 -6217 7238 -26775 84505 -3789 -19159 37245 13402
11627 13402 -62674 -119983 -51629 74818 200427 82325 21595 -18393 -140764 -2769 57056
11616 57056 58889 97671 146337 157308 144053 35149 -125786 -92451 17406 82245 75942
11605 75942 -32424 -40797 -101705 -213331 -110965 -115819 -163478 -145045 -163645 6117 121769
11594 121769 110226 62823 108196 125796 53126 15663 13997 102535 118163 26490 164418
11583 164418 170294 107715 -5198 -12928 69966 121236 52959 19003 -54752 -32134 -46179 -156001
11571 -156001 -142266 -81989 -62086 -10259 -33274 -91046 54926 67646 26639 -2853 -97281
11560 -97281 -45210 62896 14511 36217 45407 45395 181841 233857 220603 108077 31776 84003
11548H4003k6485n3459o294Q6968j5271o7130o9064J2682M9598L949j56Q2710
11536H2051L8238r9323n6220j8224l7478Q2602K347n7753K9251J8763l821P6736
11524E7169N2762j13469q5729j7850J76106J11944q9170l7882k8603k20512j13876
11513c09110N2180M8492j6992k2107N7118Q6660M0551M6400J5056j45733m4826
11502a92311Q7300J4302M4596j400P4558j66683m9275J17142j1080l2235J17184
11491B098P2169j15556l1040M3646L3181O618j29353R9591K0066J6523l8976o2405
11479h3438K3218J3911k4795m1369R5454n2304m2098J25633P8760K0870N9196
11468A73038l1437Q4800r483j22702m5634j9317m0318J8747Q4879L352p7899J08998
$$ plain form
11548 84003 57518 4059 -2235 84733 69462 2332 -66732 -54050 -4452 -503 -659 82051
11536 82051 120289 20966 -35254 -53478 -90956 -8354 -6007 -63760 -34509 -15746 -19567 57169
11524 57169 109931 -3538 -89267 -107117 68989 180933 91763 53881 25278 -195234 -309110
11513 -309110 -256930 -208438 -225430 -247537 -190419 -103759 -63208 -16808 -1752 -147485 -192311
11502 -192311 -105011 -90709 -46113 -47513 27045 -139638 -188913 -71771 -82851 -115086 2098
11491 2098 74267 -41289 -72329 -28683 4498 11116 -118237 -18646 1420 17943 -21033 -83438
11479 -83438 -60220 -46309 -71104 -112473 -17019 -69323 -111421 14212 92972 113842 173038
11468 173038 141601 226401 216918 94216 48582 29265 -11053 7694 92573 95925 18026 127024
11456A27024k0597J8131k5324n6724k8645r1712j09190k5563P7914L6232J27194
11445B8740l2129k3617l076Q0185q4696r885Q712j6852P9421Q5411m1362j37660
11433f6808n8053J1539Q6261O1152J06756j0220m0667N35m8962o7037m4867J7141
11421e3230l9753l074M8681n735j5787J2892m8333n1575Q3753M0773R418p4277
11409i6247N9600j6732J83626J1440j07507j65974m5283R6794O399O2852l9500
11398e0532M0913O0366k8101J5450M0643j00502k3389P5623o4675O5836j02696
11387g1064K9658N6185j5898k8689L5195N940l4592m3628K3180J07085j19595
11376e6223l8412J43107k8843l2198m4220n6981K3556M0368L3681j16140R347
$$ plain form
11456 127024 106427 124558 99234 42510 13865 -77847 -187037 -212600 -134686 -98454 28740
11445 28740 -3389 -27006 -30082 50103 -34593 -44478 -35766 -52618 26803 112214 70852 -66808
11433 -66808 -124861 -113322 -27061 34091 140847 130627 89960 90495 41533 -25504 -70371 -53230
11421 -53230 -92983 -96057 -47376 -53111 -68898 -56006 -104339 -155914 -72161 -31388 -21970 -96247
11409 -96247 -36647 -53379 130247 141687 34180 -131794 -177077 -80283 -73884 -11032 -50532
11398 -50532 -9619 50747 22646 38096 78739 -21763 -45152 30471 -34204 31632 -71064
11387 -71064 -41406 14779 -1119 -29808 5387 11327 -23265 -66893 -43713 63372 -56223
11376 -56223 -94635 48472 19629 -12569 -56789 -113770 -90214 -49846 -16165 -132305 -122958
11365a22958R0178j8943l8962k4021N2779P5607L6349o8548m4358M6771o3960
11354h0066n5518R7651j04756J3399J0028P0194K0356k565J00802l9706j13551
11343h3732J19718l112r5659m2234K1808Q0120O2770k5294O2310Q6252k1469o6759
11331I4719l7930O4173j02084j10777l437R1695O5552j16663J6297O2750P9218
11320A03513o1086j12379R3865N3623o862q5363j56561L747O4272J729K1503Q7896
11308G897O5459J8538o3042m4713q5442P4163r8709o249J5195r7012N1497O5431
11296i6987n8347j9162P8863P2146M6517J20678k0773r3892r5238r5008K9922
11285a31281M6566L7574l8419Q2320R2615L3820q9244j38556N6005J09973K0470
$$ plain form
11365 -122958 -32780 -51723 -90685 -114706 -61927 13680 50029 -18519 -62877 -16106 -80066
11354 -80066 -135584 -37933 -142689 -129290 -119262 -49068 -28712 -31277 69525 29819 -83732
11343 -83732 35986 32874 -62785 -105019 -83211 -3091 59679 34385 96695 182947 161478 94719
11331 94719 56789 120962 18878 -91899 -95336 -3641 61911 -54752 -38455 24295 103513
11320 103513 42427 -69952 23913 77536 70674 -14689 -171250 -167503 -103231 -101502 -79999 7897
11308 7897 73356 91894 28852 -15861 -101303 -27140 -125849 -132098 -116903 -213915 -162418 -96987
11296 -96987 -155334 -174496 -95633 -23487 23030 143708 122935 29043 -66195 -161203 -131281
11285 -131281 -84715 -47141 -85560 -3240 89375 123195 33951 -104605 -48600 61373 81843
11274H1843k5085p9252q2586M9676J9271O5106p6486k5057q329J01353N4176m5229
11262B9401n2892L6852L7296j5689j2225n4612j16165O4189J04979O218n1276
11251b3924o1619r2107J01629Q9028N8123k0701j03093m8563j7061J8343M761
11240i5184l1361P8946M304J2688l9765J4293r0499l8061O4085n859P242K09743
11228I0572j2243K0506J21220m5983k962n7381K8495r8613j06084j06937r7575
11217b66985L8443n1246M0876P3915j7756J267P3820q320J2493J40506P4975l6386
11205G5602L510o9405m7923o4102q382Q1611J19625k6684j94056j14247J5430
11194b29021O3474J15782R9461K0238M6135n3618n4205N1702Q0240j2681r1979
$$ plain form
11274 81843 56758 -22494 -105080 -55404 -36133 28973 -47513 -72570 -80899 20454 74630 29401
11262 29401 -23491 13361 50657 34968 22743 -31869 -148034 -83845 21134 27352 -23924
11251 -23924 -85543 -177650 -76021 13007 71130 50429 -52664 -101227 -118288 -99945 -95184
11240 -95184 -126545 -47599 -43295 -30607 -70372 -56079 -146578 -184639 -120554 -126413 -119171 90572
11228 90572 78329 98835 220055 174072 171110 113729 142224 43611 -62473 -169410 -266985
11217 -266985 -228542 -279788 -238912 -164997 -182753 -181486 -107666 -115986 -103493 37013 111988 75602
11205 75602 79112 9707 -38216 -102318 -110700 -29089 90536 63852 -130204 -244451 -229021
11194 -229021 -165547 -49765 49696 69934 116069 62451 8246 59948 140188 127507 35528
11183C5528o0956k1486j5192m4243J67980M9077q4038K2610N9823J13010j18394
11172A03719n6662j14046q6863K3339q6639k2205J09539o3714m1471P565P4769
11161a52669L8726m8083k16L0548J6678N98J18083J03934j44888j06177l4757
11150a78223O2169P0545Q8699M8282k9359j42491j18886n0477J21459Q5810p6871
11139a19343O5658J18746J5677q510o0822M6420J53800M614M1951r6738o0725
11128A00728K2835o6257K4077J9967n0321k8523N916J5733j41540p6844J37944
11117c6285M2677J72826K3267q3368N3278N7810j37665j3583q9340l0282m6044
11106h6709q164N5891L4850j730r8617K5922o3451r3179J25459J06756J00038
$$ plain form
11183 35528 -25428 -46914 -62106 -106349 61631 110708 26670 49280 109103 222113 103719
11172 103719 47057 -66989 -153852 -130513 -217152 -239357 -129818 -193532 -235003 -227438 -152669
11161 -152669 -113943 -162026 -162242 -131694 -115016 -114418 3665 107599 -37289 -143466 -178223
11150 -178223 -116054 -45509 43190 91472 62113 -80378 -199264 -249741 -128282 -42472 -119343
11139 -119343 -53685 65061 80738 72228 11406 57826 211626 216240 258191 161453 100728
11128 100728 123563 57306 81383 101350 51029 22506 28422 44155 -97385 -174229 -36285
11117 -36285 6392 179218 202485 119117 172395 230205 92540 78957 -10383 -40665 -86709
11106 -86709 -94873 -38982 -4132 -5862 -104479 -78557 -142008 -235187 -109728 -2972 97066
11095I7066P8143k4525q0783o0546M1044M2569k2990m1831Q5985J07331l8634
11084A82829q9355j03078r2353m7140n0442P9556M3741L0164J2746m875J3235
11073b4972M655k3705J0700r648M1013K0123l5116n081K3575l9051M5873l9418
11061c1052L8193J42047O630K3826n6943L603N4611j30103j20217J8405J03370
11050E2370L8323l5402m2767K4531k9756m7491m1548j2415M7711p0572m2416O219
11038a53213Q2233l4605j0445N9427J00862M9480N0508r3008n3812k3790l0263
11027e6626M4477r3586J0437N9869R8938J66219o254k16582p6093r3815n1568
11016b14584o3368J1126J01813o4548N3833R6639R7818k0493j61330R5897N5355
$$ plain form
11095 97066 175209 150684 69901 9355 50399 92968 69978 28147 114132 221463 182829
11084 182829 93474 -9604 -101957 -149097 -199539 -119983 -76242 -46078 -33332 -38207 -24972
11073 -24972 -20317 -44022 -33322 -42970 -1957 18166 -16950 -22031 1544 -37507 8366 -31052
11061 -31052 7141 149188 155818 179644 122701 126304 180915 50812 -69405 -51000 52370
11050 52370 90693 55291 12524 37055 7299 -40192 -81740 -94155 -46444 -117016 -159432 -153213
11038 -153213 -70980 -105585 -116030 -56603 44259 93739 144247 51239 -2573 -26363 -56626
11027 -56626 -12149 -105735 -95298 -35429 63509 229728 223474 6892 -69201 -163016 -214584
11016 -214584 -277952 -266826 -165013 -229561 -175728 -79089 18729 -1764 -163094 -67197 -11842
11005a1842m3498k5981k0281m2577l8386O3456L2831N0245O2070L573O8699J7689
10993A15998j06800j11387N6066J569Q5337K1366M8672m6245j59122O5454N4090
10982B4998m0248n807R335K0864p2051P121Q6763K9966K4227M4484n9343j1683
10970E8626k8686M6098L9745j57798n9942q3935J3015J1412J18649K03296l1383
10959A29097K5905q3678j12198M4908K7601m4283q087L5692L8927j07926j1150
10948f5192N9041n1596m0742Q6950Q3897j8055j07319j4792N3260j16675M2606
10937h8617J13063Q415J6085M1649o0081j01375n1962M1630K3470Q2218Q5736
10926A10231o6736J171j6456o9800P941Q9395l8127j37961K2075J27769P0480
$$ plain form
11005 -11842 -55340 -81321 -101602 -144179 -182565 -119109 -86278 -36033 26037 29610 98309 115998
10993 115998 9198 -102189 -46123 -44554 40783 62149 110821 64576 -94546 -29092 24998
10982 24998 -15250 -21057 -11722 9142 -62909 -55788 30975 60941 85168 129652 70309 58626
10970 58626 29940 76038 115783 -42015 -101957 -185892 -172877 -161465 -42816 160480 129097
10959 129097 155002 71324 -40874 4034 31635 -12648 -20735 14957 53884 -54042 -65192
10948 -65192 -6151 -57747 -98489 -11539 72358 54303 -53016 -67808 -14548 -131223 -88617
10937 -88617 24446 32861 48946 90595 30514 -70861 -122823 -81193 -57723 24495 110231
10926 110231 43495 44666 28210 -41590 -33649 55746 17619 -120342 -98267 29502 99982
10915I9982l8544q9684r1671j5196K6917P0804L7461j01773Q535K3082l457J11596
10903C8052l3900o0147j2268O9462R8194J2927n6547j2079K1894q0837m7673K447
10891f0475j109J97619M8052j48848k3845J3494j4759m7976J05745k7199p1349
10880c0650j78625m8014p8382l43R7815Q8785K7419k5085j10923L8524J83811
10869c5668O6307j13694p4392J00319n0500R360J267o8406J23273m5606j58526
10858b46266p826Q4306Q1698l3127K0922M7652n4136P830N5245p4073R4023J01600
10846G7848k432j7912m9138j38583R4202p4224o3616l5679P6770J61070P5572
10835A03878J0204O6466Q3575j15648k28960J1705J36032m2039p6182L920m3241
$$ plain form
10915 99982 61438 -28246 -119917 -135113 -108196 -37392 69 -101704 -93169 -70087 -73544 38052
10903 38052 4152 -55995 -68263 1199 99393 112320 55773 43694 65588 -15249 -62922 -60475
10891 -60475 -61584 136035 184087 35239 11394 24888 10129 -37847 67898 40699 -30650
10880 -30650 -209275 -257289 -335671 -336014 -238199 -149414 -121995 -147080 -258003 -219479 -35668
10869 -35668 30639 -83055 -157447 -57128 -107628 -98268 -97001 -165407 -42134 -87740 -246266
10858 -246266 -254092 -169786 -88088 -121215 -100293 -52641 -106777 -98947 -43702 -117775 -23752 77848
10846 77848 75416 57504 8366 -130217 -36015 -110239 -173855 -209534 -132764 28306 103878
10835 103878 114082 180548 264123 148475 -80485 -68780 67252 25213 -50969 -47049 -90290
10824i0290P74m9224J9811J64401J32119m2239j1027k2968k40977q5151J09752
10813a15019N2984n0114o9839j25176R0077J18914O3727L3441j04190m4359J1557
10802a37997J62693l5676o1062k0310J18892P6994q0776j11807p4808L0314K05373
10791G1830j6683p0755o0323l9217q4157l6132j3159n806J86419N7865j02272
10780a12390o4072P1572J27877J30348q0683r7635j23939j32006P8485J43790
10770e8653J7756L8552l1734Q704q6918Q820j9993M3581L8511k6311j7445p2015
10758a57145j27668L6830N2115J12228J31735P1434p5186o0575l2624L0582L3732
10747A5458j07299Q352O0807n7755j34662j0515J50992N397J32091j7525Q541
$$ plain form
10824 -90290 -89516 -138740 -118929 45472 177591 135352 124325 101357 -139620 -224771 -115019
10813 -115019 -62035 -112149 -181988 -307164 -217087 -98173 -34446 -1005 -105195 -149554 -137997
10802 -137997 24696 -10980 -72042 -92352 26540 103534 22758 -89049 -163857 -133543 71830
10791 71830 55147 -15608 -75931 -115148 -199305 -235437 -248596 -254402 -67983 -10118 -112390
10780 -112390 -176462 -104890 22987 153335 72652 -24983 -148922 -280928 -202443 -58653
10770 -58653 -40897 -2345 -34079 -25375 -112293 -103473 -123466 -79885 -41374 -67685 -85130 -157145
10758 -157145 -284813 -247983 -195868 -83640 48095 119529 44343 -16232 -48856 -18274 15458
10747 15458 -91841 -83489 -22682 -80437 -215099 -225614 -74622 -69225 62866 45341 53882
10736E3882r4025o7141m0353L0752n265k2836j4786N5010J41599P2674j7166n9496
$$ plain form
10736 53882 -40143 -107284 -147637 -116885 -122150 -144986 -159772 -104762 36837 109511 92345 32849
$$ [...]
##END NTUPLES=NMR SPECTRUM
##END=
