##TITLE=Analysis number 321685
Compound Code km 07844
Project Code adrs
Chemist Name fudan
##JCAMPDX= 6.0         $$ Bruker NMR JCAMP-DX V2.0
##DATA TYPE= NMR SPECTRUM
##DATA CLASS= NTUPLES
##ORIGIN= Bruker BioSpin GmbH
##OWNER= nmr
$$ XWIN-NMR		Version 3.5
$$ Tue Aug 22 12:46:39 2006 GMT Daylight Time (UT+1h)  MAYBRIDGE\nmr@NMR_250MHZ
##.OBSERVE FREQUENCY= 250.131544655141
##.OBSERVE NUCLEUS= ^1H
##.ACQUISITION MODE= SIMULTANEOUS (DQD)
##.ACQUISITION SCHEME= undefined
##.AVERAGES= 16
##.DIGITISER RES= 18
##SPECTROMETER/DATA SYSTEM= dpx250
##.PULSE SEQUENCE= zg30
##.SOLVENT NAME= CDCl3
##.SHIFT REFERENCE= (INTERNAL, CDCl3, 0, 16.522)
##AUDIT TRAIL= $$ (NUMBER, WHEN, WHO, WHERE, WHAT)
$$ ##TITLE= Audit trail, XWIN-NMR		Version 3.5
$$ ##JCAMPDX= 5.01
$$ ##ORIGIN= Bruker BioSpin GmbH
$$ ##OWNER= nmr
$$ C:\u/data/dgb/nmr/ADRS/1360/pdata/1/auditp.txt
$$ ##AUDIT TRAIL=  $$ (NUMBER, WHEN, WHO, WHERE, WHAT)
(   1,<2006-08-22 12:46:16.21 +100>,<MAYBRIDGE\nmr>,<NMR_250MHZ>,
      <created by zg, POWCHK disabled, PULCHK disabled
       configuration hash MD5:
       E2 DF 36 D8 04 B2 41 60 5A D7 A3 38 5A 4B D0 FE
       data hash MD5: 64K
       6E 57 AB B8 E9 32 15 B5 6F E3 32 67 F6 9B 3A E5>)
(   2,<2006-08-22 12:46:29.57 +100>,<MAYBRIDGE\nmr>,<NMR_250MHZ>,
      <Start of raw data processing
       ef LB = 0.3 FT_mod = 6 PKNL = 1 SI = 32K 
       data hash MD5: 32K
       27 63 53 5C 33 9C DD 1F 0C 38 9C CC CB B8 A0 4B>)
(   3,<2006-08-22 12:46:32.15 +100>,<MAYBRIDGE\nmr>,<NMR_250MHZ>,
      <apk 
       data hash MD5: 32K
       60 D9 48 9C 00 B6 66 8A 88 2D 14 7C 77 AD 27 2F>)
(   4,<2006-08-22 12:46:33.11 +100>,<MAYBRIDGE\nmr>,<NMR_250MHZ>,
      <abs ABSG = 5 
       data hash MD5: 32K
       18 42 46 1A F9 61 69 87 0B 44 4B B3 DD 7B A8 F0>)
$$ ##END=
$$ 
$$ hash MD5
$$ 90 AC E9 CF 9E 68 74 8C 45 D6 9C 2C 67 06 07 03
##$RELAX= 
##$RELAX= 
##$RELAX= 
##$RELAX= 
##$RELAX= 
##$RELAX= 
##$RELAX= 
$$ Bruker specific parameters
$$ --------------------------
##$DU= <C:\u>
##$EXPNO= 1360
##$NAME= <ADRS>
##$PROCNO= 1
##$TYPE= <nmr>
##$USER= <dgb>
##$AMP= (0..31)
100 100 100 100 100 100 100 100 100 100 100 100 100 100 100 100 100 100 
100 100 100 100 100 100 100 100 100 100 100 100 100 100 
##$AQSEQ= 0
##$AQ_mod= 3
##$AUNM= <au_zg>
##$AUTOPOS= <30 >
##$BF1= 250.13
##$BF2= 250.13
##$BF3= 250.13
##$BF4= 250.13
##$BF5= 500.13
##$BF6= 500.13
##$BF7= 500.13
##$BF8= 500.13
##$BYTORDA= 1
##$CFDGTYP= 0
##$CFRGTYP= 5
##$CHEMSTR= <none>
##$CNST= (0..31)
1 1 145 1 1 1 1 1 1 1 1 1 1 1 1 1 1 1 1 1 1 1 1 1 1 1 1 1 1 1 1 1 
##$CPDPRG= <>
##$CPDPRG1= <>
##$CPDPRG2= <>
##$CPDPRG3= <>
##$CPDPRG4= <mlev>
##$CPDPRG5= <mlev>
##$CPDPRG6= <mlev>
##$CPDPRG7= <mlev>
##$CPDPRG8= <mlev>
##$CPDPRGB= <>
##$CPDPRGT= <>
##$D= (0..31)
0 1 0 0 0 0 0 0 0 0.06 0 0 0 0 0 0 0.0002 0 0 0 0 0 0 0 0 0 0 0 0 0 0 
0 
##$DATE= 1156247175
##$DBL= (0..7)
120 120 120 120 120 120 120 120 
##$DBP= (0..7)
150 150 150 150 150 150 150 150 
##$DBP07= 0
##$DBPNAM0= <>
##$DBPNAM1= <>
##$DBPNAM2= <>
$$ [...]
##$SUBNAM7= <"">
##$SUBNAM8= <"">
##$SUBNAM9= <"">
##$SW= 20.6930455092707
##$SWIBOX= (0..15)
0 0 3 0 0 0 0 0 0 0 0 0 0 0 0 0 
##$SW_h= 5175.983436853
##$TD= 65536
##$TD0= 1
##$TE= 295.16
##$TE2= 300
##$TE3= 300
##$TEG= 300
##$TL= (0..7)
0 120 120 120 120 120 120 120 
##$TP= (0..7)
150 150 150 150 150 150 150 150 
##$TP07= 0
##$TPNAME0= <>
##$TPNAME1= <>
##$TPNAME2= <>
##$TPNAME3= <>
##$TPNAME4= <>
##$TPNAME5= <>
##$TPNAME6= <>
##$TPNAME7= <>
##$TPOAL= (0..7)
0.5 0.5 0.5 0.5 0.5 0.5 0.5 0.5 
##$TPOFFS= (0..7)
0 0 0 0 0 0 0 0 
##$TUNHIN= 0
##$TUNHOUT= 0
##$TUNXOUT= 0
##$USERA1= <user>
##$USERA2= <user>
##$USERA3= <user>
##$USERA4= <user>
##$USERA5= <user>
##$V9= 5
##$VALIST= <valist>
##$VCLIST= <CCCCCCCCCCCCCCC>
##$VD= 0
##$VDLIST= <DDDDDDDDDDDDDDD>
##$VPLIST= <PPPPPPPPPPPPPPP>
##$VTLIST= <TTTTTTTTTTTTTTT>
##$WBST= 1024
##$WBSW= 4
##$XGAIN= (0..3)
0 0 0 0 
##$XL= 0
##$YL= 0
##$YMAX_a= 514123
##$YMIN_a= -512145
##$ZGOPTNS= <>
##$ZL1= 120
##$ZL2= 120
##$ZL3= 120
##$ZL4= 120
##$ABSF1= 16.522
##$ABSF2= -4.171173
##$ABSG= 5
##$ABSL= 3
##$ALPHA= 0
##$AQORDER= 0
##$ASSFAC= 0
##$ASSFACI= 0
##$ASSFACX= 0
##$ASSWID= 0
##$AUNMP= <proc_1d>
##$AZFE= 0.1
##$AZFW= 0.1
##$BCFW= 0
##$BC_mod= 0
##$BYTORDP= 0
##$COROFFS= 0
##$CY= 12.5
##$DATMOD= 1
##$DC= 0
##$DFILT= <>
##$DTYPP= 0
##$F1P= 14.0000005364418
##$F2P= -0.99999901652339
##$FCOR= 0.5
##$FTSIZE= 32768
##$FT_mod= 6
##$GAMMA= 0
##$GB= 0
##$INTBC= 1
##$INTSCL= 1
##$ISEN= 128
##$LB= 0.3
##$LEV0= 0
##$LPBIN= 0
##$MAXI= 10000
##$MC2= 0
##$MEAN= 0
##$ME_mod= 0
##$MI= 0
##$NCOEF= 0
##$NC_proc= -4
##$NLEV= 6
##$NOISF1= 0
##$NOISF2= 0
##$NSP= 0
##$NTH_PI= 0
##$NZP= 0
##$OFFSET= 16.522
##$PC= 1
##$PHC0= 3.215423
##$PHC1= -4.366397
##$PH_mod= 1
##$PKNL= yes
##$PPARMOD= 0
##$PSCAL= 4
##$PSIGN= 0
##$REVERSE= no
##$SF= 250.13
##$SI= 32768
##$SIGF1= 0
##$SIGF2= 0
##$SINO= 400
##$SIOLD= 32768
##$SREGLST= <1H.CDCl3>
##$SSB= 0
##$STSI= 32768
##$STSR= 0
##$SW_p= 5175.98343685301
##$SYMM= 0
##$S_DEV= 0
##$TDeff= 65536
##$TDoff= 0
##$TI= <Analysis number 999999
Compound Code 99
Book Reference 9
Project Code 9>
##$TILT= no
##$TM1= 0
##$TM2= 0
##$TOPLEV= 0
##$USERP1= <user>
##$USERP2= <user>
##$USERP3= <user>
##$USERP4= <user>
##$USERP5= <user>
##$WDW= 1
##$XDIM= 32768
##$YMAX_p= 354370616
##$YMIN_p= -398646
$$ End of Bruker specific parameters
$$ ---------------------------------
##NTUPLES= NMR SPECTRUM
##VAR_NAME=  FREQUENCY,     SPECTRUM/REAL,   SPECTRUM/IMAG
##SYMBOL=    X,             R,               I
##VAR_TYPE=  INDEPENDENT,   DEPENDENT,       DEPENDENT
##VAR_FORM=  AFFN,          ASDF,            ASDF
##VAR_DIM=   32768,         32768,           32768
##UNITS=     HZ,            ARBITRARY UNITS, ARBITRARY UNITS
##FACTOR=    0.157963299565203, 1,           1
##FIRST=     4132.6476996994, 0,             0
##LAST=      -1043.33573715361, 0,           0
##MIN=       -1043.33573715361, -398646,     0
##MAX=       4132.6476996994, 354370616,     0
$$ Real data points
##PAGE= N=1
##DATA TABLE= (X++(R..R)), XYDATA
$$ [...]
$$ plain form
15965 -6443 4012 -441 -6228 -12579 -11382 -15492 -11929 -16293 -24173 -21583 -13868 -7693 -12161 -19544
15951 -19544 -12672 -15320 -6673 -5916 -7117 1108 8898 14835 7036 923 -2494 -2684 -1415 -6092 -10202
15936 -10202 -7178 -2143 2065 2729 -2209 -6281 -5164 -9993 -18078 -17308 -1835 7736 11088 9551 9791
15921 9791 9621 7348 4532 -1529 963 -3519 -6384 -4441 338 4665 517 7354 14772 11044 10216
15906 10216 1314 -8337 -16661 -12166 -6074 -3232 -6141 -9085 -5928 -1336 -3659 -397 3493 6896
15892 6896 8909 9204 5821 -8337 -24354 -21325 -3921 8323 11487 6995 -5243 -10628 -15171 -15354
15878 -15354 -6260 3839 -2406 -4956 -9569 -10856 -7004 -15087 -19008 -16372 -16849 -6375 8554 13287
15864 13287 9995 8340 5677 7036 3555 -2504 3939 11802 6497 1470 2992 6672 3366 -275
$$ packed form
15965f443J0455m453n787o351J197m110L563m364p880K590P715O175m468p383
15951a9544O872k648Q647P57j201Q225P790N937p799o113l417j90J269m677m110
15936a0202L024N035M208O64m938m072J117m829q085P70J5473R571L352j537K40
15921I791j70k273k816o061K492m482k865J943M779M327m148O837P418l728q28
15906A0216q902r651q324M495O092K842k909k944L157M592k323L262L890L403
15892F896K013K95l383j4158j6017L029J7404J2244L164m492j2238n385m543j83
15878a5354R094J0099o245k550m613j287L852q083l921K636m77J0474J4929M733
15864A3287l292j655k663J359l481o059O443P863n305n027J522L680l306l641
$$ plain form
15850 -275 -4050 -7473 -18804 -17877 -10796 -6754 -2974 -5673 4273 6204 1122 -3436 -3891 -8787 -10755
15835 -10755 -13509 -20587 -23410 -12202 -10841 -5913 -2433 -1348 -7036 -11039 -11073 -7871 -13386 -23348 -33338
15820 -33338 -21838 -3846 6072 1630 -3761 -10352 -19647 -23612 -17704 -17782 -15909 -14829 -9294 -8173
15806 -8173 -9107 -5538 -3969 -2453 5835 10086 14182 11308 -2073 -6250 1213 6412 -3326 -12908 -12071
15791 -12071 -17438 -21328 -13203 -708 -1264 -4929 5751 287 -4305 -7634 -14489 -12643 -11469 -4787
15777 -4787 -3798 -4415 -215 1376 -5483 2718 11142 5921 3004 2068 2795 266 10388 7595 2121
15762 2121 -7776 -13083 -20489 -12942 -917 1734 -5294 -2071 7408 5039 3165 1301 -5124 -12648
15748 -12648 -9850 -3215 -1653 -7942 -10487 -14931 -11911 -7460 -2971 -9158 -11550 -7355 -13956 -14837 -14881
$$ packed form
15850b75l775l423j1331R27P081M042L780k699R946J931n082m558m55m896j968
15835a0755k754p078k823J1208J361M928L480J085n688m003l4L202n515r962r990
15820c3338J1500J7992R918m442n391o591r295l965N908p8J873J080N535J121
15806h173r34L569J569J516Q288M251M096k874j3381m177P463N199r738r582Q37
15791a2071n367l890Q125J2495n56l665J0680n464m592l329o855J846J174O682
15777d787R89o17M200J591o859Q201Q424n221k917r36P27k529J0122k793n474
15762B121r897n307p406P547J2025K651p028L223R479k369j874j864o425p524
15748a2648K798O635J562o289k545m444L020M451M489o187k392M195o601q81m4
$$ plain form
15733 -14881 -21441 -13202 2088 -4978 -5217 2363 -5788 -5097 7476 11995 8775 5897 1566 3821
15719 3821 10593 8585 2593 -5155 -16982 -15346 -10712 -8178 -5507 -6131 -11755 -12306 -2202 -173 -11234
15704 -11234 -14830 -20773 -16980 -4439 737 3629 -1760 -4852 -3178 4238 13358 12003 2576 -933
15690 -933 3400 -853 -3684 -10896 -9974 1387 1605 4052 4544 1036 -27 4458 5592 1830 -4687
15675 -4687 -2594 -5851 -11507 -13584 -11358 -23792 -32835 -33429 -20560 -17396 -11833 -7783 -4257 -12105
15661 -12105 -11693 -10066 -19545 -15980 -7821 -6955 -5053 -759 -5090 -9918 -9486 -7924 -6125 -10702 -5042
15646 -5042 -2610 1803 1480 -4896 -5091 -9413 -10332 -4922 -970 -497 -11106 -15253 -16976 -14834 -7072
15631 -7072 -2574 2660 2089 -5554 -5679 2424 1191 -5169 -1850 -6395 -1258 -1961 -3225 -4951 -2506
$$ packed form
15733a4881o560Q239J5290p066k39P580q151O91J2573M519l220k878m331K255
15719C821O772k008n992p748j1827J636M634K534K671o24n624n51J0104K029j1061
15704a1234l596n943L793J2541N176K892n389l092J674P416R120j355r427l509
15690i33M333m253k831p212R22J1361K18K447M92l508j063M485J134l762o517
15675d687K093l257n656k077K226j2434r043n94J2869L164N563M050L526p848
15661a2105M12J627r479L565Q159Q66J902M294m331m828M32J562J799m577N660
15646e042K432M413l23o376j95m322r19N410L952M73j0609m147j723K142P762
15631g072M498N234n71p643j25Q103j233o360L319m545N137p03j264j726K445
$$ plain form
15616 -2506 -7987 -12324 -6686 -2887 -6567 -17529 -18016 -21110 -20615 -16771 -13843 -7928 -10552 -15373 -18610
15601 -18610 -17989 -10213 590 -4973 -8593 -9793 -6319 -12482 -16975 -12769 -11556 -15833 -22340 -22591 -23889
15586 -23889 -26722 -30650 -24830 -20259 -6299 9673 8728 4272 8166 4867 -2655 -2052 -1300 2725 10649
15571 10649 9105 495 -5452 -10728 -4905 -6881 -11910 -8826 -9292 -13719 -16479 -18513 -17055 -15138 -8884
15556 -8884 -1699 2086 5033 10077 17273 11855 -4490 -9463 -3316 -9504 -10754 -10252 -6373 -1193 -430
15541 -430 -1813 1869 3840 678 -3779 -15520 -16766 -13889 -8438 1254 8653 6775 -8478 -10255
15527 -10255 -9219 -8909 -5787 -8756 -11479 -12898 -13517 -8592 -1643 5197 7372 -8028 -13766 -14617 -22071
15512 -22071 -19178 -6392 -9317 -9537 -15282 -13107 -22222 -23366 -21673 -23076 -19957 -12006 -13949 -19886
$$ packed form
15616b506n481m337N638L799l680j0962m87l094M95L844K928N915k624m821l237
15601a8610O21P776J0803n563l620j200L474o163m493M206J213m277o507k51j298
15586b3889k833l928N820M571J3960J5972r45m456L894l299p522O03P52M025P924
15571A0649j544q610n947n276N823j976n029L084m66m427k760k034J458J917O254
15556h884P185L785K947N044P196n418j6345m973O147o188j250N02L879N180P63
15541d30j383L682J971l162m457j1741j246K877N451R692P399j878j5253j777
15527a0255J036L10L122k969k723j419o19M925O949O840K175j5400n738q51p454
15512b2071K893J2786k925k20n745K175r115j144J693j403L119P951j943n937
$$ plain form
15498 -19886 -22669 -17422 -14808 -12162 -12141 -13617 -15790 -14096 -8624 -8937 -5422 -13816 -20292 -19188 -13230
15483 -13230 -5935 -1733 -8280 -11160 -6482 -5885 -17934 -18917 -19012 -15609 -8241 -4407 -10850 -15358 -16817
15468 -16817 -3133 5148 866 8725 8075 8368 1256 -3188 -2100 -8136 -3689 -210 -10602 -12182
15454 -12182 -1165 3563 5038 4630 15020 10950 -6454 -9532 2295 1420 11432 7570 3765 6968
15440 6968 8931 2434 -6465 -9573 -13508 -10512 -1808 -1934 -3518 -503 -1854 -8417 -5947 -3046 -3439
15425 -3439 -3152 -6089 -10496 -13831 -14010 -14375 1042 5623 -2331 8684 23147 19680 16477 13128 11685
15410 11685 13398 8167 10461 8875 -1207 -9949 -6119 -423 -1013 -7772 -19969 -20538 -17077 -10260
15396 -10260 -19756 -29894 -20866 -14795 -16675 -17016 -5602 -5233 -7500 -4703 -9515 -7990 -3768 -2371
$$ packed form
15498a9886k783N247K614K646K1j476k173J694N472l13L515q394o476J104N958
15483a3230P295M202o547k880M678N97j2049r83r5L403P368L834o443m508j459
15468a6817J3684Q281m282P859o50K93p112m444J088o036M447L479j0392j580
15454a2182J1017M728J475m08J0390m070j7404l078J1827q75J0012l862l805L203
15440F968J963o497q899l108l935K996Q704j26j584L015j351o563K470K901l93
15425c439K87k937m407l335j79l65J5417M581p954J1015J4463l467l203l349j443
15410A1685J713n231K294j586j0082q742L830N696n90o759j2197n69L461O817
15396a0260r496j0138R028O071j880l41J1414L69k267K797m812J525M222J397
$$ plain form
15382 -2371 6198 146 -11306 -11726 -7056 -12498 -10602 -3377 4105 573 -6654 -11069 -10308 3141 -9748
15367 -9748 -24724 -23876 -9841 1037 -5884 -16880 -11377 -4420 -160 3459 905 1090 -8490 -16180
15353 -16180 -9970 -1538 3185 -92 -3428 -2460 4236 6883 5500 6689 2217 6118 2876 -4690 -14103
15338 -14103 -10972 -2606 4703 310 -6783 -14791 -16272 -12557 -17651 -19758 -10841 -7157 7350 10717
15324 10717 9260 8564 6198 8521 6161 -4106 2178 4998 -1070 -10988 -10266 -20909 -19585 -7430
15310 -7430 -5121 -8613 -15796 -15977 -13255 -8560 6513 4062 -2489 -3901 -5344 -3704 -1304 447 -4128
15295 -4128 7199 12793 19146 11312 1081 -8583 -15189 -11758 -11842 -20734 -15404 -3563 -2704 -7212 1893
15280 1893 6183 4029 -1258 -7290 -14256 -23678 -20327 -22403 -24555 -25133 -31314 -31679 -18509 -19042 -23017
$$ packed form
15382b371Q569o052j1452m20M670n442J896P225P482l532p227m415P61J3449j2889
15367i748j4976Q48J4035J0878o921j0996N503O957M260L619k554J85r580p690
15353a6180O210Q432M723l277l336R68O696K647j383J189m472L901l242p566r413
15338a4103L131Q366P309m393p093q008j481L715n094k107Q917L684J4507L367
15324A0717j457o96k366K323k360j0267O284K820o068r918P22j0643J324J2155
15310g430K309l492p183j81K722M695J5073k451o551j412j443J640K400J751m575
15295d128J1327N594O353p834j0231r664o606L431q4q892N330J1841Q59m508R105
15280A893M290k154n287o032o966r422L351k076k152n78o181l65J3170n33l975
$$ plain form
15265 -23017 -11310 -10833 -17091 -8227 -12594 -9261 -10813 -10579 -7295 -5059 -5842 -8005 -8624 -4135 -4694
15250 -4694 -7104 -6223 -5389 870 1801 1956 5320 3341 6831 7720 8008 7530 -882 -8712 -2128 -2573 -7118
15233 -7118 -8004 -9673 -15222 -8952 -7550 -9031 -19661 -24030 -7071 6948 12785 11333 7600 -4626
15219 -4626 -1264 -8114 -4882 -2846 -1116 -833 3165 14146 18228 9747 3078 7853 8611 483 -6125
15204 -6125 -496 -195 2755 3827 2915 -345 -237 -5526 -14926 -4182 10636 11974 3550 3962 5031
15189 5031 7460 5000 2141 8133 6403 -1811 -3074 3360 9095 8495 6802 6263 2014 -3723 -11171
15174 -11171 -17832 -23041 -16340 -19590 -24897 -16816 -8256 -10608 -6972 -4761 294 1083 4862 -4609 -17049
15159 -17049 -13521 -13332 -9444 -285 2786 -12951 -14743 -15439 -19928 -17242 -18266 -20503 -26026 -26597 -26024
$$ packed form
15265b3017J1707M77o258Q864m367L333j552K34L284K236p83k163o19M489n59
15250d694k410Q81Q34O259R31J55L364j979L490Q89K88m78q412p830O584m45m545
15233g118q86j669n549O270J402j481j0630m369J6959J4019N837j452l733j2226
15219d626L362o850L232K036J730K83L998J0981M082q481o669M775P58q128o608
15204f125N629L01K950J072r12l260J08n289r400J0744J4818J338q424M12J069
15189E031K429k460k859N992j730q214j263O434N735o00j693n39m249n737p448
15174a1171o661n209O701l250n307Q081Q560k352L636K211N055P89L779r471j2440
15159a7049L528J89L888R159L071j5737j792o96m489K686j024k237n523n71N73
$$ plain form
15144 -26024 -24706 -12199 -5829 -1709 4614 164 -3665 -862 -1376 -241 -4517 -11713 -16218 -26397
15130 -26397 -26921 -14799 -5778 -1668 344 121 4389 1624 -8498 342 -1140 -7100 -9711 -11252
15116 -11252 -14883 -10473 -9698 -6575 -13570 -8674 -7811 -12527 -524 9803 4625 822 1771 9864 11117
15101 11117 4282 959 3141 -1694 -4211 2409 -2302 -3977 -8722 -11895 -11131 -8282 -3338 -11465 -11940
15086 -11940 -4524 -3816 -8756 -3518 -508 -12900 -22392 -13248 -5066 -8380 -11620 -9748 2356 3712
15072 3712 -3005 -8218 -15591 -14966 -7328 -7178 -17978 -14557 -6396 -2366 -4504 -6566 -8124 -4539 4236
15057 4236 12792 17449 8642 -2143 586 -565 -1573 5336 6781 1598 -1209 -2791 -5011 -3813
15043 -3813 -7870 -14659 -16150 -17116 -14848 -5345 -1019 -11190 -12512 -15862 -9510 -6234 -12526 -10016 -8894
$$ packed form
15144b6024J318J2507O370M120O323m450l829K803n14J135m276p196m505j0179
15130b6397n24J2122R021M110K012k23M268k765j0122Q840j482n960k611j541
15116a1252l631M410P75L123o995M896Q63m716J2003J0327n178l803R49Q093J253
15101A1117o835l323K182m835k517O620m711j675m745l173P64K849M944q127m75
15086a1940P416P08m940N238L010j2392r492R144Q182l314l240J872J2104J356
15072C712o717n213p373O25P638J50j0800L421Q161M030k138k062j558L585Q775
15057D236Q556M657q807j0785K729j151j008O909J445n183k807j582k220J198
15043c813m057o789j491r66K268R503M326j0171j322l350O352L276o292K510J122
$$ plain form
15028 -8894 -7658 -3825 -4078 -4061 2302 2333 -3303 3829 14929 14029 11203 11698 19021 9383 -4471 -5017
15012 -5017 -11918 -19393 -12095 -1525 4503 12125 9478 10331 8869 3778 3552 1929 -12581 -14457 -4643
14997 -4643 -2431 -6024 -8596 -7218 -5013 -9830 -8011 -462 -2170 7230 3358 -1711 11391 19601
14983 19601 12303 -5183 -12345 -19515 -20908 -16898 -13738 -5774 -575 845 -7140 -16588 -11308 -6682
14969 -6682 -6334 -3915 -9283 -5969 -13412 -18468 -27832 -28061 -22241 -13006 -4205 -8272 -6016 -3987 -4278
14954 -4278 1190 9374 10965 7550 4580 4540 7919 7766 2156 3665 -5015 -3969 6084 7172 7283
14939 7283 -3556 -15928 -22619 -19217 -10728 -1920 -3207 -10574 -2984 -3824 -6241 -9294 -9640 -8595 -5035
14924 -5035 -9654 -15797 -19376 -15360 -8093 -6650 -1108 -8088 -12708 -10208 -13257 -6573 -1965 -4384 -14443
$$ packed form
15028h894J236L833k53J7O363L1n636P132J1100r00k826M95P323r638j3854n46
15012e017o901p475P298J0570O028P622k647Q53j462n091k26j623j4510j876R814
14997d643K212l593k572J378K205m817J819P549j708R400l872n069J3102Q210
14983A9601p298j7486p162p170j393M010L160P964N199J420p985r448N280M626
14969f682L48K419n368L314p443n056r364k29N820R235Q801m067K256K029k91
14954d278N468Q184J591l415k970m0L379j53n610J509q680J046J0053J088J11
14939G283j0839j2372o691L402Q489Q808j287p367P590q40k417l053l46J045L560
14924e035m619o143l579M016P267J443N542o980m620K500l049O684M608k419j0059
$$ plain form
14909 -14443 -16489 -15009 -8031 -10167 -5989 -2752 -7489 -7183 -1279 6798 3274 -1043 1393 -5943 -5477
14894 -5477 -4309 -2594 -7934 -11548 -14783 -8598 -3910 -7917 -12901 -20261 -26541 -22646 -11333 -13255
14880 -13255 -22703 -17019 -12776 -15960 -13358 -1530 2728 -769 -12938 -18568 -14881 -7404 -9039 -15989
14866 -15989 -8363 -3033 -4343 -9800 -11890 -7725 -5455 4883 11019 4512 -13 -4312 -4324 -15164
14852 -15164 -13439 -11588 -13434 -13817 -11921 -14931 -9749 -6142 -5879 -3054 -6042 -155 4580 7400 6746
14837 6746 5163 653 -14744 -22877 -17968 -15173 -10981 -325 1109 -2896 1881 -833 -2155 -3496
14823 -3496 -5105 -9794 -10032 -9059 -888 16496 25793 27724 30560 18380 14276 15371 6004 -1257 -768
14808 -768 2338 -3408 -7043 -9444 -13996 -16883 -16349 -12976 -7498 1652 5991 9604 17231 17847 18873
$$ packed form
14909a4443k046J480O978k136M178L237m737L06N904Q077l524m317K436p336M66
14894e477J168J715n340l614l235O185M688m007m984p360o280L895J1313j922
14880a3255r448N684M243l184K602J1828M258l497j2169n630L687P477j635o950
14866a5989P626N330j310n457k090M165K270J0338O136o507m525m299j2j0840
14852a5164J725J851j846l83J896l010N182L607K63K825k988N887M735K820o54
14837F746j583m510j5397q133M909K795M192J0656J434m005M777k714j322j341
14823c496j609m689k38R73Q171J7384R297J931K836j2180m104J095r367p261M89
14808g68L106n746l635k401m552k887N34L373N478R150M339L613P627O16J026
$$ plain form
14793 18873 15540 17556 3509 -8633 -13185 -33626 -46316 -37244 -32898 -23019 -15828 -18837 -25958
14780 -25958 -30290 -21182 -7713 -6308 -9088 -18302 -31952 -17329 -3048 -2027 -3678 227 4992
14767 4992 5120 -2374 -1540 -4326 -13443 -13219 -17092 -24104 -33266 -39496 -34850 -30505 -26091 -20930 -6174
14752 -6174 6029 11135 10733 15854 22328 22986 14613 19586 14929 2300 -5850 -6146 -6379 -12611 -13945
14737 -13945 -13260 -16180 -14401 -12607 -7271 -5130 -9876 -8950 -3403 -622 263 1630 -6265 -12108 -17567
14722 -17567 -13422 -8025 -9808 -7904 -6769 -13249 -13141 -8073 -12441 -19266 -17563 -11451 -5691 4440
14708 4440 14876 24781 22634 16257 4017 3634 10498 2206 -6311 -11815 -20923 -13893 -2521 1229
14694 1229 2632 7915 8089 4869 8154 -3508 -16938 -22570 -13230 -14610 -14248 -11520 -8013 -9155 -14578
$$ packed form
14793A8873l333K016j4047j2142m552k0441j2690R072M346R879P191l009p121
14780b5958m332R108J3469J405k780r214j3650J4623J4281J021j651L905M765
14767D992J28p494Q34k786r117K24l873p012r162o230M646M345M414N161J4756
14752f174J2203N106m02N121O474O58q373M973m657j2629q150k96k33o232j334
14737a3945O85k920J779J794N336K141m746R26N547K781Q85J367p895n843n459
14722a7567M145N397j783J904J135o480J08N068m368o825J703O112N760J0131
14708D440J0436R905k147o377j2240l83O864q292q517n504r108P030J1372L750
14694A229J403N283J74l220L285j1662j3430n632R340j380L62K728L507j142n423
$$ plain form
14679 -14578 -4657 391 9367 5117 3044 16263 17873 3972 -1158 2933 3324 3087 4387 956
14665 956 -3690 -7249 -7793 -5437 -4204 1802 -981 -12458 -9236 -12108 -14938 -8884 -11233 -10178 -8466
14650 -8466 -14063 -7834 1653 -6830 -10695 -3504 -4315 -12097 -16183 -20458 -16326 -20572 -17332 -10765 -15103
14635 -15103 -16551 -10569 -4155 -3664 -5388 -1266 552 -12678 -20794 -11803 -1115 -3986 2341 5257
14621 5257 319 -1563 6233 10963 10675 -3337 -12530 -19332 -15695 -8139 -9774 -17852 -17269 -22701 -15901
14606 -15901 -8300 -6755 -10966 -20945 -29747 -24296 -22491 -17456 -5917 -2165 -7375 -8914 -7732 -10658
14592 -10658 -17091 -18440 -29791 -38139 -33374 -12482 -8953 -8128 -2313 -8978 -7552 -10238 3297 8903
14578 8903 6571 5819 -2977 -5850 -9506 -13903 -13491 -14527 -13655 -16921 -14087 -18750 -26439 -30838 -29053
$$ packed form
14679a4578R921N048Q976m250k073J3219J610j3901n130M091L91k37J300l431
14665I56m646l559n44K356J233O006k783j1477L222k872k830O054k349J055J712
14650h466n597O229R487q483l865P191q11p782m086m275M132m246L240O567m338
14635a5103j448N982O414M91j724M122J818j3230q116Q991J0688k871O327K916
14621E257m938j882P796M730k88j4012r193o802L637P556j635q078N83n432O800
14606a5901P601J545m211r979q802N451J805N035J1539L752n210j539J182k926
14592a0658o433j349j1351q348M765K0892L529Q25N815o665J426k686J3535N606
14578H903k332p52q796k873l656m397M12j036Q72l266K834m663p689m399J785
$$ plain form
14563 -29053 -19000 -17167 -14748 -17601 -11508 -162 -3015 -11720 -17630 -20433 -18259 -19901 -15268 -13235
14549 -13235 -14514 -12731 -9029 -1586 3228 -2730 3460 9602 23351 13561 2220 1818 4891 7064
14535 7064 -4877 -5817 -4644 -5827 -11460 -3280 -2080 -8312 -18036 -17646 -23316 -18512 -18840 -13649 1012
14520 1012 1452 -4934 -11308 -13962 -19554 -17211 -14746 -16778 -14199 -16304 -12080 -6081 -5964 -5176 -1467
14505 -1467 -11 -2530 -1360 -9444 -17640 -17111 -21691 -19465 -16853 -12702 -10094 -11075 -4968 -965 2843
14490 2843 4022 8876 -2979 -11305 -8239 -7862 1267 -1127 -7323 -9099 -8363 -2848 146 -6943 -14201
14475 -14201 -10326 -5628 -1620 -3695 -11567 -16756 -15332 -18288 -23984 -17632 -16747 -8038 2734 6155
14461 6155 2448 1970 -7228 -9450 -8772 -4725 -3135 -2436 9929 12493 9696 8149 2650 1634 -1640
$$ packed form
14563b9053J0053J833K419k853O093J1346k853q705n910k803K174j642M633K033
14549a3235j279J783L702P443M814n958O190O142J3749r790j1341m02L073K173
14535G064j1941r40J173j183n633Q180J200o232r724L90n670M804l28N191J4661
14520A012M40o386o374k654n592K343K465k032K579k105M224N999J17P88L709
14505a467J456k519J170q084q196N29m580K226K612M151K608r81O107M003L808
14490B843J179M854j1855q326L066L77R129k394o196j776P36N515K994p089p258
14475a4201L875M698M008k075p872n189J424k956n696O352Q85Q709J0772L421
14461F155l707m78r198k222O78M047J590O99J2365K564k797j547n499j016l274
$$ plain form
14446 -1640 3140 724 -7342 -14724 -9221 -8756 -20707 -16405 -10040 -13380 -12011 -120 2677 2985 4482
14431 4482 -5117 -2535 812 -416 7415 14670 17657 8817 -4913 -17412 -28112 -33262 -23927 -13310
14417 -13310 -9914 -15418 -17423 -13467 -13090 -15182 -19801 -11393 -19633 -27217 -25645 -15882 2832 1448
14403 1448 -7764 -13019 -10409 -13382 -19745 -17480 -15584 -22763 -25165 -23894 -22728 -16594 -16588 -21717 -15023
14388 -15023 3076 5631 -3789 -16106 -14060 -13454 -14472 -11636 -14265 -10005 -16423 -22678 -24610 -17198
14374 -17198 -592 -287 -2035 -1495 1213 -782 -6711 -17228 -17713 -17334 -18088 -16399 -16348 -17313 -6822 1361
14358 1361 4990 1377 -199 -4504 -6595 -8775 -293 1394 -8220 -10646 -7437 1165 9541 6287 -4018
14343 -4018 -8406 -6453 -13922 -9458 -6851 -2383 2745 4946 1017 -5209 -1781 -72 3421 -2183 -10846
$$ packed form
14446a640M780k416q066p382N503M65j1951M302O365l340J369J1891K797L08J497
14431D482r599K582L347j228P831P255K987q840j3730j2499j0700n150R335J0617
14417a3310L396n504k005L956L77k092m619Q408q240p584J572R763J8714j384
14403A448r212n255K610k973o363K265J896p179k402J271J166O134On129O694
14388a5023J8099K555r420j2317K046O06j018K836k629M260o418o255j932P412
14374a7198J6606L05j748N40K708j995n929j0517m85L79p54J689N1r65J0491Q183
14358A361L629l613j576m305k091k180Q482J687r614k426L209Q602Q376l254j0305
14343d018m388J953p469M464K607M468N128K201l929o226L428J709L493n604q663
$$ plain form
14328 -10846 -9841 -2730 -5798 -10585 -11408 -17895 -28964 -29185 -17247 -10967 -8663 -18127 -14380 -6755
14314 -6755 -3270 3303 480 -1243 2430 802 2503 -519 -4250 -3026 -5513 -12719 -12571 -9107 -10492
14299 -10492 -20540 -23265 -19430 -8745 -8920 -8024 -8793 -4614 -10014 -22335 -24473 -17159 -21755 -24430
14285 -24430 -13188 -10982 -3070 4499 1992 -2063 12577 11875 1968 -2542 -4901 -3203 -3676 -6578
14271 -6578 -7428 -10118 -10358 -7976 -8613 -7588 -3709 2896 4731 -4925 2573 6380 8577 1325 -5142
14256 -5142 -11424 -1533 -728 -8280 -14824 -8887 -7786 -4164 -2613 -4190 -18738 -28225 -20899 -8483
14242 -8483 -14916 -18503 -17619 -11571 -9229 -7400 -4367 -2563 4697 11528 9096 -1581 -60 1185 -2258
14227 -2258 1107 8364 1062 -3340 -3602 -1633 -522 -8793 -12114 -14302 -17473 -9881 -7590 -9428 -6365
$$ packed form
14328a0846J005P111l068m787q23o487j1069k21J1938O280K304r464L747P625
14314f755L485O573k823j723L673j628J701l022l731J224k487p206J48L464j385
14299a0492j0048k725L835J0685j75Q96p69M179n400j2321k138P314m596k675
14285b4430J1242K206P912P569k507m055J4640p02r907m510k359J698m73k902
14271f578q50k690k40K382o37J025L879O605J835r656P498L807K197p252o467
14256e142o282R891Q05p552o544N937J101L622J551j577j4548r487P326J2416
14242h483o433l587Q84O048K342J829L033J804P260O831k432j0677J521J245l443
14227b258L365P257p302m402k62J969J111q271l321k188l171P592K291j838L063
$$ plain form
14212 -6365 -16376 -13155 -12111 -10472 -7254 552 10392 5414 -5980 -10749 916 -3242 -1631 4262
14198 4262 4290 -163 -512 7738 8756 11140 -4089 -12645 -9389 -9582 -9946 -4807 -3866 -353 -3431 -11066
14182 -11066 -9055 -13656 -21374 -22806 -9438 2441 -2431 -10619 -10879 -4452 -11264 -15569 -20945 -22619
14168 -22619 -19726 -10186 -10482 -10742 -7730 -12167 -3941 -5205 -4163 -3422 -4953 -6913 1205 -344 6763
14153 6763 5367 406 -2044 5272 8741 8564 2317 -2574 -3061 -7364 -10700 -8027 -12978 -18974 -14209
14138 -14209 -4021 3683 3657 -532 -12545 -26355 -27108 -24037 -8605 1435 3752 -4277 -1291 -1580
14124 -1580 1892 -3390 -3915 -5503 -5453 -11531 -8805 -8586 -13181 -3808 -14535 -22416 -24351 -13722 -3072
14109 -3072 -6224 -11778 -14476 -10812 -5106 -5263 -8197 -16199 -20010 -22610 -12719 -13135 -10266 -5362 -1460
$$ packed form
14212f365j0011L221J044J639L218P806R840m978j1394m769J1665m158J611N893
14198D262K8m453l49Q250J018K384j5229q556L256j93l64N139R41L513l078p635
14182a1066K011m601p718j432J3368J1879m872q188k60O427o812m305n376j674
14168b2619K893R540k96k60L012m437Q226j264J042P41j531j960Q118j549P107
14153F763j396m961k450P316L469j77o247m891m87m303l336K673m951n996M765
14138a4209J0188P704k6m189j2013j3810p53L071J5432J0040K317q029K986k89
14124a580L472n282n25j588N0o078K726K19m595R373j0727p881j935J0629J0650
14109c072l152n554k698L664N706j57k934q002l811k600R891m16K869M904L902
$$ plain form
14094 -1460 -5866 -15817 -25975 -26179 -15752 -7004 -10636 -11950 -24246 -27256 -33351 -21363 -7498 -4800
14080 -4800 -5348 -11389 -5613 -2636 -5130 -6647 -2920 -7720 -10367 -7825 -7899 -303 -3230 -11802 -1718
14065 -1718 3391 -726 -4505 -10481 -3300 7361 2643 1088 -5358 -6578 -2704 -3992 4646 -3480
14051 -3480 -19529 -19247 -11824 -15487 -14103 -9006 -8896 -4169 -16562 -20963 -23885 -18483 -8704 -3246 -2849
14036 -2849 -4617 5985 10809 542 -698 4457 744 -6409 -5138 -7282 -13216 -13736 -14002 -9743 -4856
14021 -4856 -6002 -11821 -7658 -12348 -11545 -7851 -4279 -13992 -18127 -16354 -7601 -3275 -15034 -24530 -25245
14006 -25245 -19767 -9092 -13822 -16313 -20058 -20895 -14659 -6353 -4375 -8309 -8456 3315 -5114 -12279
13992 -12279 -25334 -27026 -19791 -8683 -8919 -5892 -3753 -6341 -12337 -9898 -3550 6052 -1266 -10752
$$ packed form
14094a460m406r951j0158k04J0427Q748l632j314j2296l010o095J1988J3865K698
14080d800n48o041N776K977k494j517L727m800k647K542p4P596k927q572J0084
14065a718N109m117l779n976P181J0661m718j555o446j220L874j288Q638q126
14051c480j6049K82P423l663J384N097J10M727j2393m401k922N402R779N458L97
14036b849j768J0602M824j0267j240N155l713p153J271k144n934n20k66M259M887
14021d856j146n819M163m690Q03L694L572r713m135J773Q753M326j1759r496p15
14006b5245N478J0675m730k491l745q37O236Q306J978l934j47J1771q429p165
13992a2279j3055j692P235J1108k36L027K139k588n996K439O348R602p318r486
$$ plain form
13978 -10752 -9262 -8096 -7290 -11773 -9310 -9472 -3112 6259 6841 8553 6742 3327 -1994 83 1240
13963 1240 -3712 -9212 -7219 -1099 1649 -4037 -6139 -4650 -8001 -14894 -14698 -15863 -20475 -18698 -13928
13948 -13928 -6642 -9515 -11697 -9482 -3622 4741 16015 8514 3644 1028 4930 9794 5829 7744
13934 7744 8726 685 -616 -2441 -8807 -10412 -7004 -2811 8288 13110 6255 -734 -694 8675 5731
13919 5731 2067 3825 -4857 -12757 -18364 -20715 -17184 -10832 -15553 -16160 -16260 -18974 -3734 3510 1860
13904 1860 1331 6200 8892 19440 24071 13603 917 -8551 -8337 -5912 -965 -2962 5691 1399
13890 1399 3015 73 -4755 -3614 5052 8035 -5863 -14598 -17866 -15939 -10866 -3100 -907 13550
13876 13550 21022 23287 19263 12224 2667 -929 -944 -4986 -5912 1409 11203 7957 6775 13398 24558
$$ packed form
13978a0752J490J166Q06m483K463j62O360R371N82J712j811l415n321K077J157
13963A240m952n500J993O120K748n686k102J489l351o893J96j165m612J777M770
13948a3928P286k873k182K215N860Q363J1274p501m870k616L902M864l965J915
13934G744R82q041j301j825o366j605L408M193J1099M822o855o989M0R369k944
13919E731l664J758q682p900n607k351L531O352m721o07j00k714J5240P244j650
13904A860n29M869K692J0548M631j0468j2686r468K14K425M947j997Q653m292
13890A399J616k942m828J141Q666K983j3898q735l268J927N073P766K193J4457
13876A3550P472K265m024p039r557l596j5m042r26P321R794l246j182O623J1160
$$ plain form
13861 24558 30598 18809 6272 2161 6196 6375 8388 4559 -1298 48 5247 8544 7705 3552
13847 3552 -12623 -12074 -4243 1891 1199 4294 6287 1232 3057 3997 5107 6682 14681 27131 30460
13832 30460 28921 30326 27027 13928 16289 20894 20624 22121 28865 18944 13537 16692 13427 14213 22966
13817 22966 19285 15583 5357 -6037 -751 13685 9588 3162 2247 -834 8581 15020 13372 4727
13803 4727 212 26 1334 -3181 1662 12457 15757 15340 14888 11436 5491 7902 8718 13466 13543 12982
13787 12982 7594 10065 15313 10873 15805 23731 14480 12593 8999 2370 -2494 -2260 731 9529 11254
13772 11254 14040 19387 20767 19563 12004 6948 -1584 3459 4585 -4810 -9598 6634 12197 11071
13758 11071 5751 8050 6714 8475 8377 1046 499 -5405 -11253 -5844 -10912 -9183 5762 9899 14469
$$ packed form
13861B4558O040j1789j2537m111M035J79K013l829n857J346N199L297q39m153
13847C552j6175N49P831O134o92L095J993n055J825R40J110J575P999J2450L329
13832C0460j539J405l299j3099K361M605k70J497O744r921n407L155l265P86Q753
13817B2966l681l702j0226j1394N286J4436m097o426r15l081R415O439j648q645
13803D727m515j86J308m515M843J0795L300m17m52l452n945K411Q16M748P7n61
13787A2982n388K471N248m440M932P926r251j887l594o629m864K34K991Q798J725
13772A1254K786N347J380j204p559n056q532N043J126r395m788J6232N563j126
13758A1071n320K299j336J761r8p331n47n904n848N409n068J729J4945M137M570
$$ plain form
13743 14469 13352 6594 15763 28468 36997 30620 15222 5822 5830 6623 -3306 -2055 5866 18960 26153
13728 26153 28340 27721 31312 28239 32609 42618 55556 59120 72002 98566 122318 136296 132319
13715 132319 142822 140337 129146 121013 113948 100668 83827 62138 45756 34553 35622 41019
13703 41019 32701 27715 20704 19109 27581 34477 40445 42405 45871 44328 41193 39569 35799 40924
13689 40924 38412 36417 43021 45315 37981 44998 53154 59241 65546 75987 92108 109322 133043
13676 133043 174911 236683 313565 400786 473385 502562 498423 466220 409598 350917 302780 257683
13664 257683 222702 194709 172049 154441 137370 130678 111690 95649 80995 85004 83079 69854
13652 69854 66834 64372 68833 67250 56071 54103 58694 56737 56648 63827 73344 76578 70992 70591 74328
$$ packed form
13743A4469j117o758R169J2705Q529o377j5398r400QP93r929J251P921J3094P193
13728B6153K187o19L591l073M370J0009J2938L564J2882K6564K3752J3978l977
13715A32319J0503k485j1191q133p065j3280j6841k1689j6382j1203J069N397
13703D1019q318m986p011j595Q472O896N968J960L466j543l135j624l770N125
13689D0924k512j995O604K294p334P017Q156O087O305J0441J6121J7214K3721
13676A33043M1868O1772P6882Q7221P2599K9177m139l2203n6622n8681m8137m5097
13664B57683l4981k7993k2660j7608j7071o692j8988j6041j4654M009j925j3225
13652F9854l020k462M461j583j1179j968M591j957q9P179R517L234n586m01L737
$$ plain form
13637 74328 85356 92717 97745 114950 130623 164539 205798 270323 339958 416317 480167 510546
13625 510546 514622 486599 417547 344556 291682 256663 233478 208033 194600 177976 159333 146758
13613 146758 131543 119046 101184 96247 93501 90906 91779 90000 78776 68319 71588 63869 65022
13600 65022 72233 69976 71935 72814 70342 67357 60578 41619 41843 41470 50925 54194 55355 73105 85994
13585 85994 106015 133956 152100 170563 184691 196626 193498 180910 158399 134395 118030 105874
13573 105874 100027 87890 78118 76601 74843 72168 63071 61471 54545 52595 66629 59556 49111
13560 49111 49647 52685 50533 54559 44580 36689 31107 37790 28834 26377 31807 30754 39858 34024 22041
13545 22041 29822 24537 28106 23641 25485 28694 29560 24183 19807 24774 34713 40592 30782 25524 29980
$$ packed form
13637G4328J1028P361N028J7205J5673L3916M1259O4525O9635P6359O3850L0379
13625E10546M076k8023o9052p2991n2874l5019k3185k5445j3433j6624j8643j2575
13613A46758j5215j2497j7862m937k746k595Q73j779j1224j0457L269p719J153
13600F5022P211k257J959Q79k472k985o779j8959K24l73R455L269J161J7750J2889
13585H5994K0021K7941J8144J8463J4128J1935l128j2588k2511k4004j6365j2156
13573A05874n847j2137r772j517j758k675r097j600o926j950J4034p073j0445
13560D9111N36L038k152M026r979p891n582O683q956k457N430j053R104n834j1983
13545B2041P781n285L569m465J844L209Q66n377m376M967R939N879r810n258M456
$$ plain form
13530 29980 36405 42678 47809 53773 59541 51260 40368 37865 47034 44696 42669 36156 33661 37605
13516 37605 36146 25050 20969 28473 37459 45442 35641 46958 54562 44623 32843 35321 33156 36936
13502 36936 37434 34497 43875 40583 28626 27180 22364 14264 14264 15223 19441 29801 41791 38433 40868
13487 40868 39219 36352 33575 36383 47650 46780 44426 42325 37481 31765 17902 16991 12666 16160
13473 16160 22940 21780 14686 16053 22076 24298 22572 36532 53213 62076 79715 89848 84098
13460 84098 82733 91310 94359 93491 91416 87770 84424 79045 77221 82577 85531 84637 88121 89252 87393
13445 87393 99312 100413 104232 113611 127963 127536 120844 108931 88003 69651 57440 51979 43299
13432 43299 31368 32210 42603 54207 48632 43790 40108 48398 51130 51355 58408 71491 83528 95950
$$ packed form
13530B9980O425O273N131N964N768q281j0892k503R169k338k027o513k495L944
13516C7605j459j1096m081P504Q986P983r801J1317P604r939j1780K478k165L780
13502C6936M98k937R378l292j1957j446m816q100%R59M218J0360J1990l358K435
13487D0868j649k867k777K808J1267q70k354k101m844n716j3863r11m325L494
13473A6160O780j160p094J367O023K222j726J3960J6681Q863J7639J0133n750
13460H4098j365Q577L049q68k075l646l346n379j824N356K954q94L484J131j859
13445H7393J1919J101L819R379J4352m27o692j1913k0928j8352j2211n461q680
13432D3299j1931Q42J0393J1604n575m842l682Q290K732K25P053J3083J2037J2422
$$ plain form
13418 95950 113105 121341 128407 125610 127891 130863 125406 130048 132669 145121 155508 157689 149926 160074
13404 160074 173662 186564 215915 233183 254378 275272 284545 265375 254537 232833 181574 144206
13392 144206 138433 142483 143491 142563 133180 122699 117811 106899 100505 101465 101410 106151 110596 122402
13378 122402 139010 146567 161863 176567 197427 222993 250117 289754 363406 457906 530362 556575
13366 556575 561364 539720 491014 446082 414567 390426 371673 368149 364538 369789 375071 396568
13354 396568 418258 416248 391175 364618 347043 309244 276385 253158 238142 233432 219393 206173
13342 206173 204265 204507 203997 208811 221077 230616 241801 262208 286852 305430 325046 356407 402091
13329 402091 451439 508838 607549 752142 960435 1215386 1440474 1547120 1576902 1530083
$$ packed form
13418I5950J7155Q236P066k797K281K972n457M642K621J2452J0387K181p763J0148
13404A60074J3588J2902K9351J7268K1195K0894R273j9170j0838k1704n1259l7368
13392A44206n773M050J008r28r383j0481m888j0912o394R60n5M741M445J1806
13378A22402J6608P557J5296J4704K0860K5566K7124L9637P3652R4500P2456K6213
13366E56575M789k1644m8706m4932l1515k4141j8753l524l611N251N282K1497
13354C96568K1690k010k5073k6557j7575l7799l2859k3227j5016m710j4039j3220
13342B06173j908K42n10M814J2266R539J1185K0407K4644J8578J9616L1361M5684
13329D02091M9348N7399R8711J44593K08293K54951K25088J06646K9782m6819
$$ plain form
13319 1530083 1365486 1171786 1021242 918904 835402 767623 717894 664240 621588 598287
13309 598287 587241 573049 550220 524543 501872 480884 469658 457038 451711 452878 441662 448119
13297 448119 454311 473455 493160 521118 545866 560408 571003 595352 632773 673985 704063 737157
13285 737157 782007 855299 938451 1056092 1203334 1430745 1728001 2014020 2196483 2284641
13275 2284641 2302169 2200510 2059378 1971419 1946342 1970321 2023534 2112409 2245146 2427260
13265 2427260 2670599 2989639 3401568 3937853 4634939 5595747 6970021 9005018 12095256
13256 12095256 16533395 21849448 26363958 28838489 29469242 28266843 25145257 21425090
13248 21425090 18346465 15986199 14037574 12332528 10853451 9626676 8633644 7837138
$$ packed form
13319A530083j64597j93700j50544j02338q3502o7779m9729n3654m2652k3301
13309E98287j1046j4192k2829k5677k2671k0988j1226j2620n327J167j1216O457
13297D48119O192J9144J9705K7958K4748J4542J0595K4349L7421M1212L0078L3094
13285G37157M4850P3292Q3152J17641J47242K27411K97256K86019J82463Q8158
13275B284641J7528j01659j41132q7959k5077K3979N3213Q8875J32737J82114
13265B427260K43339L19040M11929N36285O97086R60808J374274K034997L090238
13256A2095256M438139N316053M514510K474531O30753j202399l121586l720167
13248B1425090l078625k360266j948625j705046j479077j226775r93032p96506
$$ plain form
13240 7837138 7180872 6657104 6241820 5920014 5682812 5541159 5459318 5409954 5369734 5337064
13230 5337064 5310131 5279539 5267777 5313375 5430783 5632252 5904213 6259773 6741051 7351696
13220 7351696 8106658 9057689 10254925 11790462 13823866 16597303 20523166 26346897
13212 26346897 35222561 48402315 65199417 80475530 88843973 91012480 88113121 78574097
13204 78574097 66052065 55688474 48126859 42033739 36607476 31866432 27925443 24698560
13196 24698560 22056451 19885929 18078868 16594651 15378392 14363832 13484492 12718805
13188 12718805 12069312 11516680 11046751 10660660 10349098 10115378 9953979 9904877 9954945 10072531
13178 10072531 10281266 10612540 11072831 11697844 12512209 13564960 14962135 16855456 19460153
$$ packed form
13240G837138o56266n23768m15284l21806k37202j41653q1841m9364m0220l2670
13230E337064k6933l0592j1762M5598J17408K01469K71961L55560M81278O10645
13220G351696P54962R51031J197236J535537K033404K773437L925863N823731
13212B6346897Q875664J3179754J6797102J5276113Q368443K168507k899359r539024
13204G8574097j2522032j0363591p561615o093120n426263m741044l940989l226883
13196B4698560k642109k170522j807061j484217j216259j014560q79340p65687
13188A2718805o49493n52632m69929l86091l11562k33720j61399m9102N0068J17586
13178A0072531K08735L31274M60291O25013Q14365J052751J397175J893321K604697
$$ plain form
13169 19460153 23192470 28742207 37234124 49980954 66725748 82771045 92063347 94681097
13161 94681097 92297481 83166812 70233374 59176963 51142554 44793004 39162886 34171407
13153 34171407 29972236 26525734 23675082 21304014 19340705 17717428 16358130 15194395
13145 15194395 14196417 13312448 12528828 11817789 11187154 10640648 10174880 9778670 9432766
13136 9432766 9152551 8927956 8762700 8644305 8561656 8535001 8562718 8656745 8843192 9159226
13126 9159226 9639778 10363374 11457913 13162310 15827845 19856911 25151221 30294520
13118 30294520 33492249 34536963 33781940 30889456 26743885 22991775 20146459 17898238
13110 17898238 15935005 14179002 12653920 11370977 10275980 9365424 8605373 7968290
$$ packed form
13169A9460153L732317N549737Q491917J2746830J6744794J6045297R292302K617750
13161I4681097k383616r130669j2933438j1056411q034409o349550n630118m991479
13153C4171407m199171l446502k850652k371068j963309j623277j359298j163735
13145A5194395r97978q83969p83620p11039o30635n46506m65768l96210l45904
13136I432766k80215k24595j65256j18395q2649k6655K7717R4027J86447L16034
13126I159226M80552P23596J094539J704397K665535M029066N294310N143299
13118C0294520L197729J044714p55023k892484m145571l752110k845316k248221
13110A7898238j963233j756003j525082j282943j094997r10556p60051o37083
$$ plain form
13102 7968290 7429630 6966549 6546388 6175725 5847391 5545373 5254458 4994405 4755169
13093 4755169 4540202 4336394 4150250 3981514 3834406 3702299 3573391 3451200 3333560
13084 3333560 3216752 3106120 2999868 2887425 2770109 2667359 2578259 2516111 2455472 2377338
13074 2377338 2308258 2250648 2195047 2138042 2082519 2033644 1990996 1944317 1893112 1847469 1814678
13063 1814678 1762593 1704809 1643460 1603105 1563913 1520969 1483203 1447365 1415142 1388895 1356818
13052 1356818 1319993 1281253 1251350 1224954 1178521 1146019 1109845 1076325 1047298 1012882 970264
13041 970264 931463 909535 896887 872643 862473 838411 813634 790322 775976 766160 743054 723723
13029 723723 706252 683002 670510 665516 651920 631083 606079 576576 532986 475485 424803 393357
$$ packed form
13102G968290n38660m63081m20161l70663l28334l02018k90915k60053k39236
13093D755169k14967k03808j86144j68736j47108j32107j28908j22191j17640
13084C333560j16808j10632j06252j12443j17316j02750q9100o2148o0639p8134
13074B377338o9080n7610n5601n7005n5523m8875m2648m6679n1205m5643l2791
13063A814678n2085n7784o1349m0355l9192m2944l7766l5838l2223k6247l2077
13052A356818l6825l8740k9903k6396m6433l2502l6174l3520k9027l4416m2618
13041I70264l8801k1928j2648k4244j0170k4062k4777k3312j4346r816k3106j9331
13029G23723j7471k3250j2492m994j3596k0837k5004k9503m3590n7501n0682l1446
$$ plain form
13017 393357 368557 363528 367757 372600 369789 364407 374866 384392 387118 404367 409674 408378 398701
13004 398701 391883 403795 389700 371153 368365 368647 363153 351110 343486 333708 337574 344358 346464
12991 346464 358207 354439 341495 344238 337870 330128 317825 317727 310874 307799 295887 290827 284667 270319
12977 270319 248072 218719 173192 133778 105753 77207 71874 77062 89343 110886 118699 128435
12965 128435 143085 154633 163433 168863 156857 168804 180599 185388 187142 188602 189314 184031 178244
12952 178244 182212 179982 179703 187973 196404 202172 207401 214529 221028 217539 213875 208964 207197 192748
12938 192748 183400 172686 166019 155849 149650 144287 134279 122102 113136 99197 84151 72713
12926 72713 79262 91059 103303 117518 121363 116365 115915 110799 109318 113728 125059 129186 123860 123142
$$ packed form
13017C93357k4800n029M229M843k811n382J0459R526K726J7249N307j296r677
13004C98701o818J1912j4095j8547k788K82n494j2043p624r778L866O784K106
12991C46464J1743l768j2944K743o368p742j2303r8o853l075j1912n060o160j4348
12977B70319k2247k9353m5527l9414k8025k8546n333N188J2281K1543P813R736
12965A28435J4650J1548Q800N430j2006J1947J1795M789J754J460P12n283n787
12952A78244L968k230k79Q270Q431N768N229P128O499l489l664m911j767j4449
12938A92748r348j0714o667j0170o199n363j0008j2177q966j3939j5046j1438
12926G2713O549J1797J2244J4215L845m998m50n116j481M410J1331M127n326p18
$$ plain form
12912 123142 137435 142838 149249 149681 147827 145518 134588 129512 136256 136447 139958 138955 124729 125060
12898 125060 130813 135427 130076 121154 120288 116176 111981 107836 108909 119040 116565 109359 102851 111194
12884 111194 107047 99758 100457 97613 94370 110743 126191 128669 124402 124825 113719 108534 108753 108731 118250
12869 118250 133612 126602 116822 118478 114124 107716 103457 102247 103100 98761 102904 101306 99377 105233
12855 105233 108924 102826 104805 99632 99944 89528 99219 97786 99158 108176 100755 87049 76418 68002
12841 68002 72495 77674 89504 89955 92893 87702 81721 77143 78421 83617 91552 91746 82207 77481 83955
12826 83955 85641 76034 71245 82582 86953 89641 87830 95445 102602 93442 82489 78701 77755 78025
12812 78025 74433 73124 68410 62686 66638 61536 71292 65227 64664 63456 62518 63179 58035 55875 55598
$$ packed form
12912A23142J4293N403O411M32j854k309j0930n076O744J91L511j003j4226L31
12898A25060N753M614n351q922q66m112m195m145J073J0131k475p206o508Q343
12884A11194m147p289O99k844l243J6373J5448K478m267M23j1106n185K19k2R519
12869A18250J5362p010r780J656m354o408m259j210Q53m339M143j598j929N856
12855A05233L691o098J979n173L12j0416R691j433J372R018p421j3706j0631q416
12841F8002M493N179J1830M51K938n191n981m578J278N196P935J94r539m726O474
12826H3955J686r607m789J1337M371K688j811P615P157r160j0953l788r46K70
12812G8025l592j309m714n724L952n102R756o065n63j208r38O61n144k160k77
$$ plain form
12797 55598 53482 59438 62420 56407 60799 70800 80910 83051 81901 89410 101984 107899 125104
12784 125104 149367 183122 206978 219335 225442 213009 182848 167777 163246 154413 151458 149186
12772 149186 142207 134861 128828 122497 110901 108126 107517 103877 98432 100147 108169 102283 97407 79718
12758 79718 74713 83433 94849 95329 92378 87944 96425 98797 94671 99770 105968 112557 110191 112006
12744 112006 129518 151295 172415 204823 247771 309818 399601 490587 541957 561061 547333
12733 547333 496802 424114 362526 315776 286367 269442 237885 214712 194672 190472 182497 175558
12721 175558 166399 163170 153903 148006 136684 133630 142193 138150 130563 124370 120912 108771 106318 112447
12707 112447 117980 112192 107637 111192 119484 133994 135530 137108 155154 173688 186238 213564 260395
$$ packed form
12797E5598k116N956K982o013M392J0001J0110K141j150P509J2574N915J7205
12784A25104K4263L3755K3856J2357O107j2433l0161j5071m531q833k955k272
12772A49186o979p346o033o331j1596k775o09l640n445J715Q022n886m876j7689
12758G9718n005Q720J1416M80k951m434Q481K372m126N099O198O589k366J815
12744A12006J7512K1777K1120L2408M2948O2047Q9783R0986N1370J9104j3728
12733E47333n0531p2688o1588m6750k9409j6925l1557k3173k0040m200p975o939
12721A75558r159l229r267n897j1322l054Q563m043p587o193l458j2141k453O129
12707A12447N533n788m555L555Q292J4510J536J578J8046J8534J2550K7326M6831
$$ plain form
12694 260395 318678 404359 480399 533017 552379 543735 507512 444059 384044 334923 296158 276321
12682 276321 246856 217259 180992 166862 157942 150668 149057 138325 130491 129607 121474 114571 122119
12669 122119 118957 119228 117084 126644 124184 126194 112113 95688 93915 95668 91445 104463 104827 101527
12655 101527 101391 107501 113029 120358 124776 138502 164672 192202 218750 234737 239233 242209 234826
12642 234826 203337 176805 166672 148239 134097 123971 115467 113425 108347 107503 115270 112109 94237
12629 94237 92696 89221 83094 89362 79468 64419 58125 53745 53230 66635 75973 83419 88221 99498
12615 99498 103964 85812 71723 64155 68272 71814 72930 67166 74698 76228 67016 58800 63617 60134
12601 60134 61629 67485 79638 80060 77600 76541 74366 67206 62767 54261 51539 54473 58184 55174
$$ packed form
12694B60395N8283Q5681P6040N2618J9362q644l6223o3453o0015m9121l8765j9837
12682B76321k9465k9597l6267j4130q920p274j611j0732p834q84q133o903P548
12669A22119l162K71k144R560k460K010j4081j6425j773J753m223J3018L64l300
12655A01527j36O110N528P329M418J3726K6170K7530K6548J5987M496K976p383
12642B34826l1489k6532j0133j8433j4142j0126q504k042n078q44P767l161j7872
12629I4237j541l475o127O268r894j5049o294m380n15J3405R338P446M802J1277
12615I9498M466j8152j4089p568M117L542J116n764P532J530r212q216M817l483
12601F0134J495N856J2153M22k460j059k175p160m439q506k722K934L711l010
$$ plain form
12587 55174 52860 55627 66930 65079 57259 52759 53122 47258 45636 48748 52501 51768 48958 54753 65380
12572 65380 62805 56191 57765 64223 65700 63360 64115 62842 65397 62991 61483 54282 51034 43221 41205
12557 41205 40981 40505 42394 49107 52800 48868 40597 36496 38674 49442 55246 47396 45966 51149 48806
12542 48806 46879 46324 55897 59591 60565 56213 52756 56194 56771 51155 51035 45310 47504 57216 54055
12527 54055 43629 40849 52638 47684 37643 40351 43666 32979 45828 47947 40251 50782 63209
12514 63209 55346 45420 44374 46167 49105 50760 46193 43586 43511 46796 53111 53990 59963 55407 49102
12499 49102 47715 54953 64724 62242 63361 56178 46142 44496 59838 63679 73321 75871 68159 72287
12485 72287 75093 72780 63008 57614 64614 77801 76588 68130 63881 65932 76471 81647 79461 76375
$$ packed form
12587E5174k314K767J1303j851p820m500L63n864j622L112L753p33k810N795J0627
12572F5380k575o614J574O458J477k340P55j273K555k406j508p201l248p813k016
12557D1205k24m76J889O713L693l932q271m101K178J0768N804p850j430N183k343
12542D8806j927n55R573L694R74m352l457L438N77n616j20n725K194R712l161
12527E4055j0426k780J1789m954j0041K708L315j0687J2849K119p696J0531J2427
12514F3209p863r926j046J793K938J655m567k607p5L285O315Q79N973m556o305
12499D9102j387P238R771k482J119p183j0036j646J5342L841R642K550p712M128
12485G2287K806k313r772n394P000J3187j213q458m249K051J0539N176k186l086
$$ plain form
12471 76375 71425 68212 67244 61358 48632 48324 57470 54656 54326 59642 69066 72258 76228 75468 75248
12456 75248 71244 64279 65968 61037 60676 63485 69882 66239 65332 76444 79837 88976 93531 92198 87596
12441 87596 89268 88951 80057 86335 88238 85163 79415 70875 66452 65329 70902 72212 70245 74468 64289
12426 64289 66140 55772 56185 66910 65340 64199 53943 49386 56459 62344 72533 69544 57979
12413 57979 58643 55173 53020 49871 52443 56726 53242 62956 65944 58035 59702 67376 73073 72634 64223
12398 64223 61311 55792 49830 50668 43286 46777 57607 59739 73914 76792 72864 66836 61839 68347
12384 68347 63080 65981 73135 60303 63409 70753 70226 67440 62492 58074 56556 51217 50681 59860 62355
12369 62355 50582 55189 59772 52494 56971 59704 62558 65554 67001 70036 69122 68426 61366 53772 72342
$$ packed form
12471G6375m950l213r68n886j2726l08R146k814l30N316R424L192L970p60k20
12456G5248m004o965J689m931l61K809O397l643r07J1112L393R139M555j333m602
12441H7596J672l17q894O278J903l075n748q540m423j123N573J310j967M223j0179
12426F4289J851j0368M13J0725j570j141j0256m557P073N885J0189k989j1565
12413E7979O64l470k153l149K572M283l484R714K988p909J667P674N697m39q411
12398F4223k912n519n962Q38p382L491J0830K132J4175K878l928o028m997O508
12384F8347n267K901P154j2832L106P344n27k786m948m418j518n339n36R179K495
12369F2355j1773M607M583p278M477K733K854K996J447L035r14o96p060p594J8570
$$ plain form
12354 72342 75923 68572 65042 66441 75411 84082 81597 77017 82532 79161 69183 73458 79978 79006 77257
12339 77257 65452 48983 38636 49573 51405 52798 49170 43175 44493 54094 67037 68239 62558
12326 62558 62357 68852 64788 58601 58789 58168 61622 62577 56763 61397 64132 58650 56915 58231 64655
12311 64655 64481 55536 53397 49137 43043 34134 38756 47418 62693 77236 87195 82981 79524 74576
12297 74576 67726 67265 76392 74991 74363 75172 72445 72133 70131 60953 65246 67027 67971 72665 77157 78101
12281 78101 83160 75853 77275 73160 65456 55924 61868 86450 95973 89499 84492 79106 75403 76873
12267 76873 72864 62494 61490 59669 66795 76251 76696 73525 64105 58607 47608 50226 57009 58753
12253 58753 69234 67628 61501 57946 58430 72199 85626 94038 88620 79669 85252 81880 72962 76790
$$ packed form
12354G2342L581p351l530J399Q970Q671k485m580N515l371r978M275O520r72j749
12339G7257j1805j6469j0347J0937J832J393l628n995J318R601J2943J202n681
12326F2558k01O495m064o187J88o21L454R55n814M634K735n482j735J316O424
12311F4655j74q945k139m260o094q909M622Q662J5275J4543R959m214l457m948
12297G4576o850m61R127j401o28Q09k727l12k002r178M293J781R44M694M492R44
12281G8101N059p307J422m115p704r532N944K4582R523o474n007n386l703J470
12267G6873m009j0370j004j821P126R456M45l171r420n498j0999K618O783J744
12253E8753J0481j606o127l555M84J3769J3427Q412n418q951N583l372q918L828
$$ plain form
12239 76790 75034 63278 58677 61819 70812 76227 69702 70371 67715 57051 57455 54675 46172 52464
12225 52464 62776 58663 52058 61537 65275 62156 56347 57570 62895 64934 64401 70438 64917 54631
12211 54631 51257 55669 62089 52115 51343 54999 56453 55967 55455 53660 51329 50439 43661 46046 44637
12196 44637 45113 41047 46948 47232 40998 47638 55728 58453 59847 74093 72992 69941 67669 61501 63224
12181 63224 58062 54785 50002 43087 55691 56894 45199 40705 43404 49733 50734 55188 53241 57264
12167 57264 66848 70271 70228 74615 72923 67291 54790 56651 64347 61617 63049 72557 82443 88670 87102
12152 87102 80436 69573 68109 65927 70913 80057 74081 64251 61845 61699 61935 65245 77661 87265
12138 87265 87138 88231 92602 89521 84338 69572 57718 55784 55781 61709 65318 64303 65927 63287 61470
$$ packed form
12239G6790j756j1756m601L142Q993N415o525O69k656j0664M04k780q503O292
12225E2464J0312m113o605R479L738l119n809J223N325K039n33O037n521j0286
12211E4631l374M412O420r974p72L656J454m86n12j795k331q90o778K385j409
12196D4637M76m066N901K84o234O640Q090K725J394J4246j101l051k272o168J723
12181F3224n162l277m783o915J2604J203j1695m494K699O329J001M454j947M023
12167E7264R584L423m3M387j692n632j2501J861P696k730J432R508R886O227j568
12152H7102o666j0863j464k182M986R144n976r830k406j46K36L310J2416R604
12138H7265j27J093M371l081n183j4766j1854j934lN928L609j015J624k640j817
$$ plain form
12123 61470 62382 78321 83154 87158 86513 81634 84552 90368 99640 84012 72878 76410 74992 63542
12109 63542 56139 61911 66748 66516 61341 67713 71346 70865 70084 72592 77045 75903 74072 77277 78511
12094 78511 81932 82992 93220 97432 95402 86119 65606 50439 47663 52414 56797 55029 54008 56766
12080 56766 68034 80384 81937 72760 68027 59433 71725 78826 73290 63030 62367 66404 70653 78381
12066 78381 73225 76818 69235 67594 62736 59215 71572 79472 76751 62732 64435 76510 67266 58252
12052 58252 54068 58177 56054 57095 63140 64291 51201 45173 43851 46921 47599 56279 54918 50475
12038 50475 58594 60926 68713 79417 71479 59658 54634 50826 59825 62809 65371 56681 58432 58737
12024 58737 63235 59695 67699 70561 72217 75852 78918 73572 69955 79647 81395 82247 69203 60954
$$ packed form
12123F1470R12J5939M833M004o45m879K918N816R272j5628j1134L532j418j1450
12109F3542p403N772M837k32n175O372L633m81p81K508M453j142j831L205J234
12094G8511L421J060J0228M212k030r283k0513j5167k776M751M383j768j021K758
12080E6766J1268J2350J553r177m733q594J2292P101n536j0260o63M037M249P728
12066G8381n156L593p583j641m858l521J2357P900k721j4019J703J2075r244r014
12052E8252m184M109k123J041O045J151j3090o028j322L070O78Q680j361m443
12038E0475Q119K332P787J0704p938j1821n024l808Q999K984K562q690J751L05
12024E8737M498l540Q004K862J656L635L066n346l617R692J748Q52j3044q249
$$ plain form
12010 60954 65382 62453 61511 66885 77292 73770 72932 79809 82242 82309 77615 79461 79889 83322 81029
11995 81029 76942 73925 76244 66477 62417 57674 67426 71732 62968 64162 67493 74965 73172 76432
11981 76432 85031 86125 69664 67714 82290 82329 82956 86067 84783 92511 94428 84719 75760 79871 94316
11966 94316 95677 86083 79804 78826 81567 90796 90338 84863 79022 69028 66142 63533 71516 80881 82234
11951 82234 84430 83565 87746 85800 82174 77272 81321 81157 75649 69883 65940 62438 62017 60192 68487
11936 68487 76243 71152 64987 77329 83148 86739 89427 91727 90968 84727 74702 70556 67260 74026
11922 74026 84787 87350 95356 93782 86795 78404 78744 76005 71642 73013 80472 84709 84338 77457 83766
11907 83766 84797 91407 92434 88791 91656 93681 88982 85551 88737 94425 91723 88048 87880 90418 87757
$$ packed form
12010F0954M428k929r42N374J0407l522q38O877K433O7m694J846M28L433k293
11995H1029m087l017K319r767m060m743R752M306q764J194L331P472j793L260
11981G6432Q599J094j6461j950J4576L9O27L111j284P728J917r709q959M111J4445
11966I4316J361r594o279r78K741R229m58n475n841r994k886k609P983R365J353
11951H2234K196q65M181j946l626m902M049j64n508n766l943l502m21j825Q295
11936F8487P756n091o165J2342N819L591K688K300p59o241j0025m146l296O766
11922G4026J0761K563Q006j574o987q391L40k739m363J371P459M237l71o881O309
11907H3766J031O610J027l643K865K025m699l431L186N688k702l675j68K538k661
$$ plain form
11892 87757 86965 90169 97491 110888 108043 100560 99675 104495 99641 91482 87381 86230 81837 78608 87422
11877 87422 92461 81496 81987 81868 89466 91467 85358 80852 79836 87345 82537 84849 87791 96513 103582
11862 103582 93697 85994 88367 95393 102276 103953 98115 89862 91747 92062 84712 83660 93584 104857
11848 104857 120170 126111 119662 114871 110043 115072 113652 108549 96924 92058 96133 99599 106042 109508
11834 109508 106907 97053 92114 96799 102585 113705 117615 122122 131875 140477 143033 142747 138612 133972
11820 133972 136489 125581 119700 118953 121240 119507 111939 106885 98227 86775 85166 93996 102365 104917
11806 104917 112454 112327 120853 114728 112426 114704 110358 102526 109783 107703 97621 97826 95686 97957
11792 97957 98869 98200 96099 92605 88523 98721 103281 118877 136777 145835 150086 153131 164203 172241
$$ packed form
11892H7757p92L204P322J3397k845p483q85M820m854q159m101j151m393l229Q814
11877H7422N039j0965M91j19P598K001o109m506j016P509m808K312K942Q722P069
11862A03582r885p703K373P026O883J677n838q253J885L15p350j052R924J1273
11848A04857J5313N941o449m791m828N029j420n103j1625m866M075L466O443L466
11834A09508k601r854m939M685N786J1120L910M507R753Q602K556k86m135m640
11820A33972K517j0908n881p47K287j733p568n054q658j1452j609Q830Q369K552
11806A04917P537j27Q526o125k302K278m346p832P257k080j0082K05k140K271
11792I7957R12o69k101l494m082J0198M560J5596J7900R058M251L045J1072Q038
$$ plain form
11778 172241 172905 159087 147691 133441 115359 111961 117608 115523 104428 97754 100077 110281 123198
11765 123198 131913 123433 127797 123669 135782 140555 126078 124505 111559 108472 116980 111021 107003
11752 107003 112541 105737 104608 109752 118990 124023 123414 119180 116698 116453 118468 113554 119161 125496 126613
11737 126613 123365 126047 131326 130511 130626 135525 126287 122577 120918 125117 120961 122451 121172 119260 123287
11722 123287 126176 144242 165639 190943 191397 181855 185928 205228 219527 233863 248823 249234 239800
11709 239800 225705 210749 210733 211908 204454 193475 195015 201284 205495 200750 203154 208886 218342 214590
11695 214590 214355 217617 228695 242964 258573 268613 270837 260883 254679 253103 248518 244299 252394
11682 252394 264858 248811 238284 238791 229438 212985 202131 202403 193044 191847 189069 194942 207094
$$ packed form
11778A72241O64j3818j1396j4250j8082l398N647k085j1095o674K323J0204J2917
11765A23198Q715q480M364m128J2113M773j4477j573j2946l087Q508n959m018
11752A07003N538o804j129N144R238N033o09m234k482k45K015m914N607O335J117
11737A26613l248K682N279q15J15M899r238l710j659M199m156J490j279j912M027
11722A23287K889J8066K1397K5304M54r542M073J9300J4299J4336J4960M11r434
11709B39800j4095j4956j6J175p454j0979J540O269M211m745K404N732R456l752
11695B14590k35L262J1078J4269J5609J0040K224r954o204j576m585m219Q095
11682B52394J2464j6047j0527N07r353j6453j0854K72r359j197k778N873J2152
$$ plain form
11669 207094 211827 216483 219366 219463 217116 218690 222912 228752 242476 244158 252168 260281 259554 269023 275547
11654 275547 280116 278996 286131 297124 306308 296990 291504 272657 264012 269414 270813 266723 252842
11641 252842 241328 248807 261016 284337 293323 300274 320809 336415 355111 364968 372137 372849 369157
11628 369157 363386 356812 356699 358459 355806 350928 355393 347266 333258 319999 318255 317820 321438 315080
11614 315080 302952 295081 292888 295922 305769 315534 319422 324938 335006 336693 335808 340240 335609 320596
11600 320596 309318 297458 292192 282296 272424 271188 271114 258507 259763 269777 275328 269951 265140 280736
11586 280736 291826 287505 285089 305702 340154 375048 426566 481578 535679 567793 575103 575299
11574 575299 554865 519136 482313 444838 409479 392313 385456 376697 370199 369524 356726 358699 376071
$$ packed form
11669B07094M733M656K883R7k347J574M222N840J3724J682Q010Q113p27R469O524
11654B75547M569j120P135J0993R184r318n486j8847q645N402J399m090j3881
11641B52842j1514P479J2209K3321Q986O951K0535J5606J8696R857P169P12l692
11628C69157n771o574j13J760k653m878M465q127j4008j3259j744m35L618o358
11614C15080j2128p871k193L034R847R765L888N516J0068J687q85M432m631j5013
11600C20596j1278j1860n266r896r872j236p4j2607J256J0014N551n377m811J5596
11586B80736J1090m321k416K0613L4452L4894N1518N5012N4101L2114P310J96
11574E75299k0434l5729l6823l7475l5359j7166o857q759o498o75j2798J973J7372
$$ plain form
11561 376071 393356 420235 452139 486991 516866 540005 552516 569864 580509 579552 562988 533700
11549 533700 505180 478814 451591 432321 412538 400242 385006 375920 371633 357099 346777 341776
11537 341776 340600 349575 367268 377655 391748 394815 394138 396735 396598 384662 359915 346022 337608
11524 337608 340213 341411 353508 358763 354910 343673 331817 329326 315293 309302 303527 296073 299283
11511 299283 306262 310987 301875 290945 283661 277986 275990 281873 284025 278213 279043 275690 274841 274569 265298
11496 265298 269196 264947 261511 261812 255480 246883 242585 249012 244000 243737 253155 265228 275655 287039
11482 287039 284395 280741 292958 300542 301165 299728 296735 298641 298529 302303 315112 318604 328008 326077
11468 326077 322185 328163 333204 328255 339536 333796 324635 314367 316257 325476 333370 348349 352982
$$ packed form
11561C76071J7285K6879L1904L4852K9875K3139J2511J7348J0645r57j6564k9288
11549E33700k8520k6366k7223j9270j9783j2296j5236r086m287j4534j0322n001
11537C41776j176Q975J7693J0387J4093L067o77K597j37j1936k4747j3893q414
11524C37608K605J198J2097N255l853j1237j1856k491j4033n991n775p454L210
11511B99283O979M725r112j0930p284n675j996N883K152n812Q30l353q49k72r271
11496B65298L898m249l436L01o332q597m298O427n012k63R418J2073J0427J1384
11482B87039k644l654J2217P584O23j437k993J906j12L774J2809L492R404j931
11468C26077l892N978N041m949J1281n740r161j0268J890R219P894J4979M633
$$ plain form
11455 352982 356666 365946 365400 369830 376043 387778 405667 410161 413099 411632 395726 393664 402868 397584
11441 397584 389709 391010 406986 410380 401206 398715 407327 411817 410203 412354 413670 426867 436083 441139
11427 441139 443633 443817 448667 454075 452626 454113 456136 452245 448497 443774 438112 443823 440420 434125
11413 434125 435697 444240 451113 469885 474048 473622 478121 483503 481804 479467 482525 483734 483888 486924
11399 486924 500000 508952 503224 504211 509214 530617 541478 543882 548847 568473 580997 583678 580310
11386 580310 586354 585523 585851 572076 570016 575153 573747 583827 594735 589490 585203 588916 594855 597663
11372 597663 600374 610568 628804 650034 639784 633567 634683 635829 646632 656338 654368 658108 661179
11359 661179 669771 670137 670661 674258 674059 684061 687904 691815 710131 727814 732894 735480 736543 745208
$$ packed form
11455C52982L684R280n46M430O213J1735J7889M494K938j467j5906k062R204n284
11441C97584p875J301J5976L394r174k491Q612M490j614K151J316J3197R216N056
11427D41139K494J84M850N408j449J487K023l891l748m723n662N711l403o295
11413D34125J572Q543O873J8772M163m26M499N382j699k337L058J209J54L036
11399D86924J3076Q952n728R87N003K1403J0861K404M965J9626J2524K681l368
11386E80310O044q31L28j3775k060N137j406J0080J0908n245m287L713N939K808
11372E97663K711J0194J8236K1230j0250o217J116J146J0803R706j970L740L071
11359F61179Q592L66N24L597j99J0002L843L911J8316J7683N080K586J063Q665
$$ plain form
11345 745208 756201 762280 769352 779530 788269 788303 790983 810944 831330 848624 856727 865376 868094
11332 868094 880950 898279 910910 926221 939640 951540 955742 968875 989467 1018716 1043788 1071296
11320 1071296 1096532 1133306 1162342 1177009 1203381 1234896 1263042 1292636 1322049 1363466 1409680
11309 1409680 1447829 1499217 1551832 1613069 1684065 1753101 1827938 1914269 2008583 2116075 2231130
11298 2231130 2378466 2547156 2732717 2920070 3138349 3397747 3693883 4034271 4433400
11289 4433400 4891928 5440130 6091525 6872153 7810717 8918319 10218611 11677815 13235155
11280 13235155 14792220 16216818 17387113 18208488 18632308 18648687 18341159 17810738 17171222
11271 17171222 16521737 15957911 15539296 15298071 15264674 15442252 15842095 16485458 17365668
$$ packed form
11345G45208J0993O079P072J0178Q739L4K680J9961K0386J7294Q103Q649K718
11332H68094J2856J7329J2631J5311J3419J1900M202J3133K0592K9249K5072K7508
11320A071296K5236L6774K9036J4667K6372L1515K8146K9594K9413M1417M6214
11309A409680L8149N1388N2615O1237P0996O9036P4837Q6331R4314J07492J15055
11298B231130J47336J68690J85561J87353K18279K59398K96136L40388L99129
11289D433400M58528N48202O51395P80628R38564J107602J300292J459204J557340
11280A3235155J557065J424598J170295Q21375M23820J6379l07528n30421o39516
11271A7171222o49485n63826m18615k41225l3397J77578L99843O43363Q80210
$$ plain form
11262 17365668 18466809 19718687 21009932 22215525 23172743 23763402 23882171 23508445 22713396
11253 22713396 21605526 20297372 18902621 17529911 16247937 15097664 14077630 13192320
11245 13192320 12445923 11819239 11306648 10907296 10584490 10348516 10205907 10120863 10113110 10164941
11235 10164941 10265743 10401954 10592933 10828175 11109455 11449664 11867696 12382165 13022488
11226 13022488 13810393 14774707 15938491 17273329 18733479 20243950 21667589 22891520
11218 22891520 23813113 24360804 24536226 24390339 24021997 23547513 23078553 22712553 22551704
11209 22551704 22649147 23057125 23816991 24954592 26479943 28376262 30562184 32899581 35208407
11200 35208407 37272316 38851334 39764466 39895571 39267007 37976588 36183124 34080753
$$ packed form
11262A7365668J101141J251878J291245J205593R57218N90659J18769l73726p95049
11253B2713396j107870j308154j394751j372710j281974j150273j020034q85310
11245A3192320p46397o26684n12591l99352l22806k35974j42609q5044p753N1831
11235A0164941J00802J36211J90979K35242K81280L40209M18032N14469O40323
11226A3022488P87905R64314J163784J334838J460150J510471J423639J223931
11218B2891520R21593N47691J75422j45887l68342m74484m68960l66000j60849
11209B2551704R7443M07978P59866J137601J525351J896319K185922K337397K308826
11200C5208407K063909J579018R13132J31105o28564j290419j793464k102371
$$ plain form
11192 34080753 31850055 29650413 27590156 25706358 24017523 22566881 21345551 20338716
11184 20338716 19556213 18985150 18625067 18473082 18491669 18667026 18981073 19352366 19738834
11175 19738834 20074850 20291572 20358986 20291659 20087445 19778468 19407018 18990065 18547137 18101231
11165 18101231 17650220 17194610 16741232 16306224 15900327 15530007 15213487 14965592 14793153
11156 14793153 14727536 14790232 14980654 15306356 15796814 16441032 17213129 18090989 19008138 19885202
11146 19885202 20658758 21273592 21682143 21863293 21832050 21632633 21318866 20959662 20628824
11137 20628824 20357761 20191818 20142620 20200465 20331078 20506180 20641969 20719412 20720658 20665855
11127 20665855 20568241 20479657 20385527 20275562 20100201 19810820 19352620 18731816 17956159 17059813
$$ packed form
11192C4080753k230698k199642k060257j883798j688835j450642j221330j006835
11184B0338716p82503n71063l60083j51985J8587J75357L14047L71293L86468
11175A9738834L36016K16722O7414o7327k04214l08977l71450m16953m42928m45906
11165A8101231m51011m55610m53378m35008m05897l70320l16520k47895j72439
11156A4793153o5617O2696J90422L25702M90458O44218P72097Q77860R17149Q77064
11146A9885202P73556O14834M08551J81150l1243j99417l13767l59204l30838
11137B0628824k71063j65943m9198N7845J30613J75102J35789P7443J246n4803
11127B0665855r7614q8584r4130j09965j75361k89381m58200o20804p75657q96346
$$ plain form
11117 17059813 16097646 15110166 14117550 13175717 12300619 11488984 10756927 10096712 9511995
11108 9511995 8995169 8534007 8122157 7739369 7401768 7098279 6816762 6565828 6350453
11099 6350453 6157028 5978690 5817416 5671971 5537206 5415617 5303547 5205144 5121445 5045779
11089 5045779 4986259 4929622 4885106 4851008 4830189 4814785 4808119 4805059 4795434 4788893 4785057 4773315
11077 4773315 4778683 4788846 4796290 4802202 4818509 4847733 4893992 4970519 5058326 5180275 5329530
11066 5329530 5487308 5627238 5716347 5770127 5773648 5710961 5583158 5425134 5236047 5025550
11056 5025550 4811261 4623231 4457042 4312317 4197258 4104446 4024368 3950385 3882259 3818638
11046 3818638 3752756 3693784 3641772 3598763 3577973 3558023 3553304 3557490 3591506 3645184 3703286 3780322
$$ packed form
11117A7059813r62167r87480r92616r41833q75098q11635p32057o60215n84717
11108I511995n16826m61162m11850l82788l37601l03489k81517k50934k15375
11099F350453j93425j78338j61274j45445j34765j21589j12070r8403q3699p5666
11089E045779n9520n6637m4516l4098k0819j5404o666l060r625o541l836j1742
11077D773315N368J0163P444N912J6307K9224M6259P6527Q7807J21949J49255
11066E329530J57778J39930Q9109N3780L521o2687j27803j58024j89087k10497
11056E025550k14289j88030j66189j44725j15059r2812q0078p3983o8126o3621
11046C818638o5882n8972n2012m3009k0790j9950m719M186L4016N3678N8102P7036
$$ plain form
11034 3780322 3870999 3982828 4116556 4287523 4472773 4686224 4947055 5244788 5587737 5978134
11024 5978134 6442177 6966173 7553410 8197172 8876386 9590376 10301003 10985237 11620963
11015 11620963 12186139 12677270 13114882 13515762 13895844 14268637 14629429 14982157 15325886
11006 15325886 15653089 15948139 16173917 16309195 16372373 16396649 16388928 16357564 16300082 16230484
10996 16230484 16146742 16054168 15930030 15780937 15611352 15437514 15279454 15148542 15022255 14905838
10986 14905838 14779132 14598979 14346219 14021831 13616749 13126876 12584462 11994121 11409338
10977 11409338 10837524 10301883 9805636 9340380 8925499 8550294 8223137 7946782 7710754
10968 7710754 7521329 7375458 7260721 7182609 7135814 7133702 7180409 7261059 7384708 7553030
$$ packed form
11034C780322R0677J11829J33728J70967J85250K13451K60831K97733L42949L90397
11024E978134M64043N23996N87237O43762O79214P13990P10627O84234O35726
11015A1620963N65176M91131M37612M00880L80082L72793L60792L52728L43729
11006A5325886L27203K95050K25778J35278O3178K4276p721l1364n7482o9598
10996A6230484q3742r2574j24138j49093j69585j73838j58060j30912j26287j16417
10986A4905838j26706j80153k52760l24388m05082m89873n42414n90341n84783
10977A1409338n71814n35641m96247m65256m14881l75205l27157k76355k36028
10968G710754j89425j45871j14737p8112m6795k112M6707Q0650J23649J68322
$$ plain form
10958 7553030 7763850 8043183 8394138 8807474 9299653 9874862 10533463 11248748 12007432
10949 12007432 12784584 13541379 14251005 14893527 15456122 15932295 16350227 16733237 17101100
10940 17101100 17493668 17890741 18286462 18648571 18959675 19220195 19391256 19461622 19463416 19440435
10930 19440435 19393427 19324397 19252237 19150346 19021041 18864267 18665366 18449292 18227425 18020954
10920 18020954 17832593 17656753 17485919 17297086 17053398 16719806 16296362 15766758 15144637
10911 15144637 14453841 13714883 12952752 12192546 11454191 10749781 10089722 9480800 8907242
10902 8907242 8385454 7913802 7486709 7095476 6735120 6405665 6099270 5823844 5564832
10893 5564832 5331317 5123834 4917831 4731611 4565463 4406026 4243567 4102572 3968374
$$ packed form
10958G553030K10820K79333L50955M13336M92179N75209O58601P15285P58684
10949A2007432P77152P56795P09626O42522N62595M76173M17932L83010L67863
10940A7101100L92568L97073L95721L62109L11104K60520J71061P0366J794k2981
10930A9440435m7008o9030p2160j01891j29305j56774j98901k16074k21867k06471
10920A8020954j88361j75840j70834j88833k43688l33592m23444n29604o22121
10911A5144637o90796p38958p62131p60206p38355p04410o60059o08922n73558
10902H907242n21788m71652m27093l91233l60356l29455l06395k75426k59012
10893E564832k33515k07483k06003j86220j66148j59437j62459j40995j34198
$$ plain form
10884 3968374 3823477 3705346 3596334 3483703 3383469 3278661 3175733 3090140 3011091 2939494
10874 2939494 2862244 2790522 2730461 2671690 2608323 2542736 2490215 2433367 2380402 2333935 2287502
10863 2287502 2242898 2204884 2163789 2113157 2073652 2034568 1996620 1963776 1925331 1896407 1876996
10852 1876996 1848559 1819294 1799188 1776574 1750609 1726850 1709541 1703507 1695565 1689474 1683164 1677249
10840 1677249 1672089 1674448 1662725 1643959 1628270 1612784 1597331 1575813 1545478 1531034 1509792 1499409
10828 1499409 1473374 1459285 1461601 1450784 1432209 1422179 1427755 1422609 1411684 1408036 1412323 1407114
10816 1407114 1407990 1414385 1413729 1406098 1407516 1414000 1406890 1411474 1419425 1424329 1423647 1437762 1455563 1471725
10802 1471725 1489999 1509356 1536144 1573442 1623330 1668960 1713123 1763176 1835526 1917341 2006300
$$ packed form
10884C968374j44897j18131j09012j12631j00234j04808j02928q5593p9049p1597
10874B939494p7250p1722o0061n8771o3367o5587n2521n6848n2965m6467m6433
10863B287502m4604l8014m1095n0632l9505l9084l7948l2844l8445k8924j9411
10852A876996k8437k9265k0106k2614k5965k3759j7309o034p942o091o310n915
10840A677249n160K359j1723j8766j5689j5486j5453k1518l0335j4444k1242j0383
10828A499409k6035j4089K316j0817j8575j0030N576n146j0925l648M287n209
10816A407114Q76O395o56p631J418O484p110M584P951M904o82J4115J7801J6162
10802A471725J8274J9357K6788L7298M9888M5630M4163N0053P2350Q1815Q8959
$$ plain form
10791 2006300 2098186 2200060 2299095 2403404 2492452 2569716 2640117 2708817 2763179 2827242 2885284
10780 2885284 2926328 2958922 2993398 3017266 3045504 3052323 3040674 3008159 2968001 2932032 2887292
10769 2887292 2854728 2829722 2820529 2809905 2797242 2791335 2792330 2793653 2792733 2805195 2829982 2852860 2867173
10756 2867173 2879062 2903985 2935239 2969740 3013564 3060047 3112715 3177672 3259719 3359431 3464419
10745 3464419 3587526 3732108 3905887 4102640 4316128 4560401 4838606 5163244 5533418
10736 5533418 5943064 6392510 6884572 7414009 7969778 8536344 9097784 9660053 10209672
10727 10209672 10742553 11257825 11768210 12252047 12694940 13096512 13448698 13764100 14032704
10718 14032704 14269511 14484089 14673581 14832697 14969744 15092397 15176818 15240526 15271850 15271436
$$ packed form
10791B006300R1886J01874R9035J04309Q9048P7264P0401O8700N4362O4063N8042
10780B885284M1044L2594L4476K3868K8238O819j1649l2515m0158l5969m4740
10769B887292l2564k5006r193j0624j2663n907R95J323r20J2462K4787K2878J4313
10756B867173J1889K4923L1254L4501M3824M6483N2668O4957Q2047R9712J04988
10745C464419J23107J44582J73779J96753K13488K44273K78205L24638L70174
10736E533418M09646M49446M92062N29437N55769N66566N61440N62269N49619
10727A0209672N32881N15272N10385M83837M42893M01572L52186L15402K68604
10718A4032704K36807K14578J89492J59116J37047J22653Q4421O3708L1324m14
$$ plain form
10708 15271436 15274097 15264137 15231263 15175210 15112361 15047235 14990727 14952324 14915591 14891170 14880601
10697 14880601 14876285 14877943 14869435 14851204 14820014 14784836 14747453 14716561 14694913 14697340 14743411 14830701
10685 14830701 14963318 15134501 15323403 15530642 15744336 15947009 16110557 16232326 16311614
10676 16311614 16346586 16364762 16371954 16373518 16367955 16350223 16314565 16269211 16189833 16077580 15933940
10665 15933940 15780212 15630569 15500938 15426708 15409962 15451120 15556146 15717374 15910421 16106463
10655 16106463 16280505 16416341 16509292 16537794 16511625 16462181 16384970 16289380 16183899 16040127
10645 16040127 15862017 15630373 15320206 14939670 14473997 13929708 13343721 12724869 12109369
10636 12109369 11504823 10934485 10417366 9942190 9522060 9155783 8844660 8567473 8330638
$$ packed form
10708A5271436K661r960l2874n6053o2849o5126n6508l8403l6733k4421j0569
10697A4880601m316J658q508j8231l1190l5178l7383l0892k1648K427M6071Q7290
10685A4830701J32617J71183J88902K07239K13694K02673J63548J21769P9288
10676A6311614L4972J8176P192J564n563j7732l5658m5354p9378j12253j43640
10665A5933940j53728j49643j29631p4230j6746M1158J05026J61228J93047J96042
10655A6106463J74042J35836R2951K8502k6169m9444p7211r5590j05481j43772
10645A6040127j78110k31644l10167l80536m65673n44289n85987o18852o15500
10636A2109369o04546n70338n17119m75176m20130l66277l11123k77187k36835
$$ plain form
10627 8330638 8142601 7983712 7841124 7727008 7613355 7520983 7453847 7404107 7380431 7396905
10617 7396905 7446844 7513260 7560345 7575596 7533088 7401158 7184386 6928093 6645976 6353744
10607 6353744 6069868 5802912 5560460 5316721 5094037 4885047 4696758 4539393 4393936
10598 4393936 4264131 4134416 4018793 3923891 3847254 3798821 3777946 3768006 3776269 3799809 3827047
10587 3827047 3857820 3887986 3928617 3935008 3932541 3920760 3912373 3890696 3852290 3817524 3786895 3743415
10575 3743415 3697736 3642797 3570925 3475643 3369769 3251462 3142904 3044276 2942044 2854951
10565 2854951 2772683 2687289 2603669 2540013 2480390 2442449 2418321 2392922 2377362 2373970 2387415
10554 2387415 2422346 2488438 2584257 2746877 2951359 3175212 3344655 3431899 3425896 3324424
$$ packed form
10627H330638j88037j58889j42588j14116j13653r2372o7136m9740k3676J6474
10617G396905M9939O6416M7085J5251m2508j31930k16772k56293k82117k92232
10607F353744k83876k66956k42452k43739k22684k08990j88289j57365j45457
10598D393936j29805j29715j15623r4902p6637m8433k0875r940Q263K3540K7238
10587C827047L0773L0166M0631O391k467j1781q387k1677l8406l4766l0629m3480
10575C743415m5679n4939p1872r5282j05874j18307j08558r8628j02232q7093
10565B854951q2268q5394q3620o3656n9623l7941k4128k5399j5560l392J3445
10554B387415L4931O6092R5819J62620K04482K23853J69443Q7244o003j01472
$$ plain form
10544 3324424 3135971 2923385 2715394 2529979 2370666 2230384 2102703 1986066 1893989 1813789
10534 1813789 1737579 1681484 1631183 1586312 1538325 1491410 1456229 1423829 1384635 1345506 1326834
10523 1326834 1303559 1276212 1249502 1227065 1213838 1204789 1192838 1192270 1189296 1169685 1159523 1154647
10511 1154647 1142647 1137076 1118449 1104896 1100745 1104215 1094325 1084582 1076352 1071329 1070975 1065940 1059013
10498 1059013 1043761 1044201 1041150 1037668 1047902 1051896 1053332 1070002 1080017 1070623 1059163 1061548 1055822
10485 1055822 1055467 1059243 1063339 1053823 1054053 1057321 1045510 1038312 1039393 1027795 1025216 1012542 1000523
10472 1000523 998542 995147 985133 986558 969669 953639 943872 934644 923086 920541 917596 909599 903338
10459 903338 899243 903757 906022 913182 916511 925563 934228 943715 961241 987509 1025365 1057006 1085667
$$ packed form
10544C324424j88453k12586k07991j85415j59313j40282j27681j16637r2077q0200
10534A813789p6210n6095n0301m4871m7987m6915l5181l2400l9194l9129j8672
10523A326834k3275k7347k6710k2437j3227r049j1951n68k974j9611j0162m876
10511A154647j2000n571j8627j3553m151L470r890r743q230n023l54n035o927
10498A059013j5252M40l051l482J0234L994J436J6670J0015r394j1460K385n726
10485A055822l55L776M096r516K30L268j1811p198J081j1598k579j2674j2019
10472A000523j981l395j0014J425j6889j6030r767r228j1558k545k945p997o261
10459I03338m095M514K265P160L329R052Q665R487J7526K6268L7856L1641K8661
$$ plain form
10446 1085667 1085999 1083124 1072727 1069411 1071293 1060388 1043811 1033845 1035163 1027790 1028271 1032962 1041116 1049648
10432 1049648 1058365 1064986 1084243 1112887 1134379 1146195 1159649 1184286 1201826 1215465 1228624 1232999
10420 1232999 1225762 1226472 1226293 1216758 1200710 1180737 1152707 1132326 1123793 1110870 1097937 1098948 1100099
10407 1100099 1111083 1123895 1131448 1134378 1147520 1155850 1161106 1165873 1168466 1185470 1210967 1233997
10395 1233997 1263224 1295518 1332897 1374674 1418590 1470545 1522159 1585542 1670394 1767248 1866268
10384 1866268 1950089 1997062 1977122 1915261 1836772 1760522 1703619 1644472 1604689 1590047 1565596
10373 1565596 1543345 1516935 1484811 1461906 1438419 1426426 1415985 1403126 1397857 1405142 1409162 1417159
10361 1417159 1427358 1446481 1466537 1488132 1501677 1509508 1527590 1531220 1535615 1541980 1547298 1563725
$$ packed form
10446A085667L32k875j0397l316J882j0905j6577r966J318p373M81M691Q154Q532
10432A049648Q717O621J9257K8644K1492J1816J3454K4637J7540J3639J3159M375
10420A232999p237P10j79r535j6048j9973k8030k0381q533j2923j2933J011J151
10407A100099J0984J2812P553K930J3142Q330N256M767K593J7004K5497K3030
10395A233997K9227L2294L7379M1777M3916N1955N1614O3383Q4852R6854R9020
10384A866268Q3821M6973j9940o1861p8489p6250n6903n9147l9783j4642k4451
10373A565596k2251k6410l2124k2905k3487j1993j0441j2859n269P285M020P997
10361A417159J0199J9123K0056K1595J3545P831J8082L630M395O365N318J6427
$$ plain form
10349 1563725 1579917 1579126 1593199 1602406 1621318 1635638 1644559 1660670 1681841 1711246 1752445 1792634
10337 1792634 1828998 1873449 1920683 1955493 1983592 2018685 2060729 2111127 2154764 2212643 2286868
10326 2286868 2374670 2461982 2569725 2703687 2844605 3006635 3192012 3360365 3454268 3504432
10316 3504432 3536364 3548892 3565498 3608434 3690150 3801055 3940247 4131716 4383595 4713166
10306 4713166 5137195 5685918 6385175 7248768 8253551 9294423 10253873 11000956 11446001
10297 11446001 11590951 11495019 11269078 11013965 10816324 10705265 10655970 10614806 10537741 10401484
10287 10401484 10189206 9913003 9576504 9201765 8815396 8441911 8084975 7757943 7472981
10278 7472981 7231992 7034826 6881857 6773592 6703250 6655487 6630971 6625431 6619229 6626837 6651334
$$ packed form
10349A563725J6192p91J4073R207J8912J4320Q921J6111K1171K9405M1199M0189
10337A792634L6364M4451M7234L4810K8099L5093M2044N0398M3637N7879P4225
10326B286868Q7802Q7312J07743J33962J40918J62030J85377J68353R3903N0164
10316C504432L1932J2528J6606M2936Q1716J10905J39192J91469K51879L29571
10306D713166M24029N48723O99257Q63593J004783J040872R59450P47083M45045
10297A1446001J44950r5932k25941k55113j97641j11059m9295m1164p7065j36257
10287A0401484k12278k76203l36499l74739l86369l73485l56936l27032k84962
10278G472981k40989j97166j52969j08265p0342m7763k4516n540o202P608K4497
$$ plain form
10267 6651334 6705492 6788327 6896473 7028474 7173523 7336859 7514463 7732048 7989501 8279367
10257 8279367 8598207 8949896 9345481 9770794 10218616 10716247 11278385 11920338 12665962
10248 12665962 13518826 14515519 15679760 17076093 18750878 20810214 23364548 26557375
10240 26557375 30562030 35510644 41416926 48095977 55085478 61694263 67270234 71388825
10232 71388825 73873375 74768522 74359223 73032669 71086238 68713293 66042554 63207250
10224 63207250 60312481 57437925 54642827 51967790 49490174 47296659 45432159 43952185
10216 43952185 42882261 42221789 41991947 42241657 42969654 44145489 45728192 47685832 50033374
10207 50033374 52849965 56256785 60460615 65783841 72636521 81519747 93139550 108471132
$$ packed form
10267F651334N4158Q2835J08146J32001J45049J63336J77604K17585K57453K89866
10257H279367L18840L51689L95585M25313M47822M97631N62138O41953P45624
10248A2665962Q52864R96693J164241J396333J674785K059336K554334L192827
10240B6557375M004655M948614N906282O679051O989501O608785N575971M118591
10232G1388825K484550Q95147m09299j326554j946431k372945k670739k835304
10224F3207250k894769k874556k795098k675037k477616k193515j864500j479974
10216D3952185j069924o60472k29842K49710P27997J175835J582703J957640K347542
10207E0033374K816591L406820M203830N323226O852680Q883226J1619803J5331582
$$ plain form
10199 108471132 128843586 155832426 190471544 231150623 271522622 302675516 319468027
10192 319468027 321603764 309841472 287511855 261724070 238165955 218293688 201396567
10185 201396567 186916683 174885498 165379322 158118594 152287439 146902744 141197082 134729134
10177 134729134 127290553 119081325 110688273 102533005 94835711 87726816 81300037 75571869
10169 75571869 70527178 66106366 62243034 58870964 55935409 53356880 51088635 49096391
10161 49096391 47345059 45802382 44466655 43332190 42394592 41656298 41123593 40795752 40685278
10152 40685278 40798974 41151370 41753065 42630014 43799438 45211902 46792478 48488645 50311347
10143 50311347 52315573 54613468 57360723 60757485 65087637 70729215 78195680 88246965
$$ packed form
10199A08471132K0372454K6988840L4639118M0679079M0371999L1152894J6792511
10192C19468027K135737j1762292k2329617k5787785k3558115j9872267j6897121
10185B01396567j4479884j2031185r506176p260728n831155n384695n705662o467948
10177A34729134p438581q209228q393052q155268p697294p108895o426779n728168
10169G5571869n044691m420812l863332l372070k935555k578529k268245j992244
10161D9096391j751332j542677j335727j134465r37598p38294n32705l27841j10474
10152D0685278J13696L52396O01695Q76949J169424J412464J580576J696167J822702
10143E0311347K004226K297895K747255L396762M330152N641578P466465J0051285
$$ plain form
10135 88246965 102012110 121255189 148679988 187483768 238267934 292455935 333366342
10128 333366342 352932218 354370616 336941331 302229546 263446708 230384260 203488744
10121 203488744 180169650 159237038 140997088 125693149 113094071 102786420 94319410
10114 94319410 87336101 81480289 76430463 71880338 67637559 63604127 59730914 56064651
10106 56064651 52691622 49658409 46966304 44567593 42426073 40521520 38805469 37219209
10098 37219209 35735049 34360399 33067813 31852733 30704004 29635510 28640903 27706198
10090 27706198 26847270 26070362 25382024 24765175 24209981 23737988 23327744 22975691 22667141
10081 22667141 22403761 22161150 21925830 21709962 21504147 21331821 21180075 21046472 20908261
$$ packed form
10135H8246965J3765145J9243079K7424799L8803780N0784166N4188001M0910407
10128C33366342J9565876J438398j7429285l4711785l8782838l3062448k6895516
10121B03488744k3319094k0932612j8239950j5303939j2599078j0307651q467010
10114I4319410o983309n855812n049826m550125m242779m033432l873213l666263
10106E6064651l373029l033213k692105k398711k141520j904553j716051j586260
10098C7219209j484160j374650j292586j215080j148729j068494r94607r34705
10090B7706198q58928p76908o88338o16849n55194m71993m10244l52053l08550
10081B2667141k63380k42611k35320k15868k05815j72326j51746j33603j38211
$$ plain form
10072 20908261 20772428 20640997 20491192 20314964 20112845 19864346 19557697 19211207 18825002
10063 18825002 18401981 17939222 17430602 16886860 16318676 15748364 15193606 14642593 14094726
10054 14094726 13585594 13116462 12656278 12204594 11773220 11362042 10953502 10549168 10168291
10045 10168291 9798501 9447708 9119150 8810221 8532711 8277132 8030685 7792446 7569984
10036 7569984 7347974 7131506 6928563 6726789 6537967 6362707 6207714 6068687 5940376
10027 5940376 5811568 5691383 5573185 5465927 5351166 5242891 5138852 5023895 4915243
10018 4915243 4808981 4689687 4553887 4407580 4270496 4137726 4005055 3865963 3716067
10009 3716067 3558333 3383085 3185330 2969956 2762939 2591797 2434229 2314275 2236113 2188609
$$ packed form
10072B0908261j35833j31431j49805j76228k02119k48499l06649l46490l86205
10063A8825002m23021m62759n08620n43742n68184n70312n54758n51013n47867
10054A4094726n09132m69132m60184m51684m31374m11178m08540m04334l80877
10045A0168291l69790l50793l28558l08929k77510k55579k46447k38239k22462
10036G569984k22010k16468k02943k01774j88822j75260j54993j39027j28311
10027E940376j28808j20185j18198j07258j14761j08275j04039j14957j08652
10018D915243j06262j19294j35800j46307j37084j32770j32671j39092j49896
10009C716067j57734j75248j97755k15374k07017j71142j57568j19954p8162m7504
$$ plain form
9999 2188609 2165192 2148660 2122962 2073333 2014001 1956986 1911925 1864100 1838153 1829091 1803512 1759980
9987 1759980 1715560 1678256 1648105 1638733 1639365 1631649 1634656 1637804 1624675 1607275 1582176 1567473 1555914
9974 1555914 1534448 1506326 1488152 1480250 1471539 1450670 1416218 1380318 1355873 1344744 1346490 1338136
9962 1338136 1336878 1343403 1348347 1348678 1360598 1375772 1385440 1386939 1375617 1352502 1345432 1336586 1306318
9949 1306318 1265725 1238971 1214956 1187112 1157222 1110801 1046905 943118 806847 657872 523201
9938 523201 419581 346764 328787 355748 395595 425395 443623 467820 496989 520295 545127
9927 545127 576356 599207 611938 624868 632003 629702 626172 623203 622793 633809 630284 608224 616002
9914 616002 622873 625899 638085 639899 632166 613449 609025 609078 605072 602204 583700 554525 538330 531835
$$ packed form
9999B188609k3417j6532k5698m9629n9332n7015m5061m7825k5947r062k5579m3532
9987A759980m4420l7304l0151r372O32p716L007L148j3129j7400k5099j4703j1559
9974A555914k1466k8122j8174p902q711k0869l4452l5900k4445j1129J746q354
9962A338136j258O525M944L31J1920J5174R668J499j1322k3115p070q846l0268
9949A306318m0593k6754k4015k7844k9890m6421o3896j03787j36271j48975j34671
9938E23201j03620p2817j7977K6961L9847K9800J8228K4197K9169K3306K4832
9927E45127L1229K2851J2731J2930P135k301l530k969m10J1016l525k2060P778
9914F16002O871L026J2186J814p733j8717m424N3m006k868j8504k9175j6195o495
$$ plain form
9900 531835 532894 531806 523752 522539 516404 512829 513039 516336 523557 537784 550133 563849 571007 582060
9886 582060 583207 571416 547743 540334 527465 516297 507999 506287 500508 482851 477741 472469 472669
9873 472669 476025 468382 463372 468954 470824 470954 467793 475023 484702 495648 495354 480169 467080 457723
9859 457723 449295 434260 423286 418688 412498 407919 410453 410561 411907 417072 422944 427768 428069 426303
9845 426303 425130 423739 418477 421352 428143 413599 389401 380345 380203 376632 369663 358666 363467 354345
9831 354345 339217 331257 325254 319241 325248 336257 345320 345400 332829 328288 317959 308958 296916 302934
9817 302934 313238 321196 326910 330491 331309 321226 317884 324920 327372 330589 332657 337083 334011 341983
9803 341983 348790 351145 356375 364671 379332 390069 399962 408887 423672 429839 431173 443759 456006
$$ packed form
9900E31835J059j088q054j213o135l575K10L297P221J4227J2349J3716P158J1053
9886E82060J147j1791k3673p409j2869j1168q298j712n779j7657n110n272K00
9873D72669L356p643n010N582J870J30l161P230R679J0946k94j5185j3089r357
9859D57723q428j5035j0974m598o190m579K534J08J346N165N872M824L01j766
9845D26303j173j391n262K875O791j4544k4198r056j42l571o969j0997M801r122
9831C54345j5128p960o003o013O007J1009R063Q0j2571m541j0329r001j2042O018
9817C02934J0304P958N714L581Q18j0083l342P036K452L217K068M426l072P972
9803C41983O807K355N230Q296J4661J0737R893Q925J4785O167J334J2586J2247
$$ plain form
9790 456006 461699 468595 482445 488225 499163 521516 535359 546514 559665 570908 583528 588884
9778 588884 592121 617346 649275 696931 756987 827186 934808 1092141 1276882 1473706 1647120
9767 1647120 1789163 1861179 1848744 1771529 1639390 1495277 1350198 1222141 1110419 1017420
9757 1017420 932056 854128 793238 738760 694660 659664 630135 595122 559683 526718 515032
9746 515032 494644 465044 455116 440155 423005 411378 399205 399438 399432 398812 397134 390291 390211 386354 376844
9731 376844 372142 387942 404827 403399 400316 396310 384062 377965 371767 389367 412068 434852 446731
9718 446731 453743 470638 495885 520563 545143 577133 613363 669577 733609 825003 950754 1135970
9706 1135970 1376491 1661297 1942028 2160643 2276422 2274106 2150288 1961373 1745286 1544618
$$ packed form
9790D56006N693O896J3850N780J0938K2353J3843J1155J3151J1243J2620N356
9778E88884L237K5225L1929M7656O0056P0199J07622J57333J84741J96824J73414
9767A647120J42043P2016j2435p7215j32139j44113j45079j28057j11722r2999
9757A017420q5364p7928o0890n4478m4100l4996k9529l5013l5439l2965j1686
9746E15032k0388k9600r928j4961j7150j1627j2173K33oo20j678o843q0l857r510
9731C76844m702J5800J6885j428l083m006j2248o097o198J7600K2701K2784J1879
9718D46731P012J6895K5247K4678K4580L1990L6230N6214O4032R1394J25751J85216
9706A135970K40521K84806K80731K18615J15779k316j23818j88915k16087k00668
$$ plain form
9696 1544618 1367225 1226190 1100751 983834 884647 808556 740185 687787 641860 603204 569314
9685 569314 544080 519593 495851 475198 467512 455121 431062 412527 396004 372705 350335 344969
9673 344969 336545 320194 305502 296490 293994 291658 292239 292035 294236 290411 289041 288604 281031 266707
9659 266707 263525 259915 260111 249328 235797 232560 231384 233759 234922 240853 243337 239838 242257 246976
9645 246976 235826 232882 235141 239701 234325 228870 222789 217161 211689 212219 213904 204596 209534 215473
9631 215473 215864 218510 224022 219494 219398 226347 237005 238080 231778 227204 219735 202943 190839 187915
9617 187915 182562 179567 175812 177547 179001 180233 166723 156278 143417 141686 143689 145515 152522 144636
9603 144636 135798 136055 142247 142802 138911 140948 140100 135535 131895 134487 140344 149227 148807 143418 131634
$$ packed form
9696A544618j77393j41035j25439j16917r9187p6091o8371n2398m5927l8656l3890
9685E69314k5234k4487k3742k0653p686j2391k4059j8535j6523k3299k2370n366
9673C44969q424j6351j4692r012k496k336N81k04K201l825j370m37p573j4324
9659B66707l182l610J96j0783j3531l237j176K375J163N931K484l499K419M719
9645B46976j1150k944K259M560n376n455o081n628n472N30J685r308M938N939
9631B15473L91K646N512m528r6O949J0658J075o302m574p469j6792j2104k924
9617A87915n353k995l755J735J454J232j3510j0445j2861j731K003J826P007p886
9603A44636q838K57O192N55l891K037q48m565l640K592N857Q883m20n389j1784
$$ plain form
9588 131634 118427 120133 120519 119894 114973 114737 121985 112078 108896 117283 120894 115405 106134 97515 93252
9573 93252 101057 101201 83585 88461 97156 102212 104761 99669 97888 103350 91177 90434 87920 76641
9559 76641 76299 85342 82232 73863 67276 58716 61680 70563 81074 83094 73408 66177 69154 65383 65246
9544 65246 68408 71380 67018 64727 62006 64280 60213 64406 71546 83313 80283 72392 77113 79309
9530 79309 93429 102639 95036 86749 79074 65956 61042 64255 71051 70991 63702 64860 66885 67230 64996
9515 64996 68232 68940 68346 78392 85282 81983 66988 71901 89732 85910 86129 81720 71575 73364
9501 73364 75156 77192 70079 66647 72874 80351 83141 77507 67060 73710 76480 66277 70413 77095
9487 77095 77528 70251 62912 55152 48767 57743 64789 53816 51367 51582 47495 45873 46027 53621 59130
$$ packed form
9588A31634j3207J706L86o25m921k36P248r907l182Q387L611n489r271q619m263
9573I3252P805J44j7616M876Q695N056K549n092j781N462j2173p43k514j1279
9559G6641l42R043l110q369o587q560K964Q883J0511K020r686p231K977l771j37
9544F5246L162K972m362k291k721K274m067M193P140J1767l030p891M721K196
9530G9309J4120R210p603q287p675j3118m914L213O796o0p289J158K025L45k234
9515F4996L236P08n94J0046O890l299j4995M913J7831l822K19m409j0145J789
9501G3364J792K036p113l432O227P477K790n634j0447O650K770j0203M136O682
9487G7095M33p277p339p760o385Q976P046j0973k449K15m087j622J54P594N509
$$ plain form
9472 59130 61805 65840 58715 58990 60492 59222 52708 51987 50743 49072 50604 47628 62544 64250 57585
9457 57585 50566 56560 70811 71198 68079 63526 65653 66166 76083 75527 69594 67101 71211 78790 79776
9442 79776 76652 67639 57674 59600 63732 71658 73150 76670 73078 73518 77127 76891 76879 77701 81071 77645
9426 77645 82663 85095 89066 95928 81294 66149 63642 73820 82855 77024 78433 79363 74003 68426
9412 68426 74486 77849 65895 55583 61360 60477 54690 45303 50009 56198 57576 67735 77184 93186
9398 93186 84161 78985 73570 69190 73010 81101 79431 68430 68105 64677 63778 69408 75224 74884 76164
9383 76164 80409 81283 89088 84652 78834 81577 83295 86626 84520 74063 75574 76527 71126 68732 68146
9368 68146 69228 76188 83711 88603 75468 66956 70813 75019 78294 77215 67614 70442 72197 68828
$$ packed form
9472E9130K675M035p125K75J502j270o514p21j244j671J532k976J4916J706o665
9457E7585p019N994J4251L87l119m553K127N13R917n56n933k493M110P579R86
9442G9776l124r013r965J926M132P926J492L520l592M40L609k36j2Q22L370l426
9426G7645N018K432L971O862j4634j5145k507J0178R035n831J409R30n360n577
9412F8426O060L363j1954j0312N777q83n787r387M706O189J378J0159R449J6002
9398I3186r025n176n415m380L820Q091j670j1001l25l428q99N630N816l40J280
9383G6164M245Q74P805m436n818K743J718L331k106j0457J511R53n401k394n86
9368F8146J082O960P523M892j3135q512L857M206L275j079r601K828J755l369
$$ plain form
9354 68828 68354 71768 74182 69810 56305 63106 72789 86149 85805 74680 67478 58837 63559 71960
9340 71960 76984 74895 73414 71388 67678 69987 74561 78799 77844 74223 72280 71131 71442 67642 69406
9325 69406 70328 74926 74377 70432 64814 65935 65203 69588 80997 83745 77281 71186 69833 67596 66294
9310 66294 62081 64465 63516 61103 60555 66298 67707 69892 66234 74803 82147 82915 78596 72193 66829
9295 66829 71878 74511 73472 72784 75415 73427 71852 81878 92580 88880 84408 85033 72729 72510 64312
9280 64312 65228 75895 84479 98304 90175 75222 70769 73885 71574 67152 61264 53290 44763 55614
9266 55614 61088 64182 76828 87475 91974 92913 89236 96361 92022 93680 91093 85795 84289 91920
9252 91920 95081 86292 76799 80309 81887 78684 75846 81790 84467 79275 76804 81724 75042 77697 86288
$$ packed form
9354F8828m74L414K414m372j3505O801R683J3360l44j1125p202q641M722Q401
9340G1960N024k089j481k026l710K309M574M238r55l621j943j149L11l800J764
9325F9406R22M598n49l945n618J121p32M385J1409K748o464o095j353k237j302
9310F6294m213K384r49k413n48N743J409K185l658Q569P344P68m319o403n364
9295F6829N049K633j039o88K631j988j575J0026J0702l700m472O25j2304k19q198
9280F4312R16J0667Q584J3825q129j4953m453L116k311m422n888p974q527J0851
9266E5614N474L094J2646J0647M499R39l677P125m339J658k587n298j506P631
9252I1920L161q789r493L510J578l203k838N944K677n192k471M920o682K655Q591
$$ plain form
9237 86288 89457 93995 91641 90824 89682 79837 83967 83831 81200 83943 75958 69596 67487 64574 68294
9222 68294 75050 77483 78559 82046 83106 82669 81881 75325 81386 89919 96488 104202 101162 97626 97969
9207 97969 104749 103921 94269 90023 88263 85305 93303 97142 95810 92007 90761 97514 89971 85009 94412
9192 94412 104490 105920 111193 110894 101758 100864 96311 99185 101485 101464 109296 110181 105413 95282 98320
9177 98320 106783 113538 106678 98392 95728 94505 93068 82243 78793 78994 91662 92570 89874 96940 94809
9162 94809 95362 92271 90432 86132 91536 94536 93294 92780 91651 88454 95762 89693 81251 81202 82386 80970
9146 80970 90005 96560 104153 107841 102213 109064 113740 114792 111059 116596 109531 105250 104429 103048 84735
9131 84735 76262 78925 95342 106768 103528 95983 103429 105151 98297 91405 95099 97814 95669 97041
$$ packed form
9237H6288L169M538k354q17j142r845M130j36k631K743p985o362k109k913L720
9222F8294O756K433J076L487J060m37p88o556O061Q533O569P714l040l536L43
9207I7969O780q28r652m246j760k958P998L839j332l803j246O753p543m962R403
9192I4412J0078J430N273k99r136q94m553K874K300k1P832Q85m768j0131L038
9177I8320Q463O755o860q286k664j223j437j0825l450K01J2668R08k696P066k131
9162I4809N53l091j839m300N404L000j242n14j129l197P308o069q442m9J184j416
9146H0970R035O555P593L688n628O851M676J052l733N537p065m281q21j381j8313
9131H4735q473K663J6417J1426l240p545P446J722o854o892L694K715k145J372
$$ plain form
9117 97041 99273 88154 73665 75959 87397 105732 119983 109191 97407 93569 96276 92007 86879
9104 86879 80928 76400 75572 74762 79710 80306 82479 87976 85150 82402 78433 80579 78101 80075 95426
9089 95426 107741 113446 117425 103754 93865 95194 97258 93439 91239 88566 82504 86536 91772 102886
9075 102886 104139 101746 104783 104178 100970 96096 95028 102842 110188 115440 124492 119965 119458 110741 102697
9060 102697 106503 111390 109912 109224 104892 107657 112533 117874 120899 114465 107380 116835 120713 117140 122065
9045 122065 116930 116465 125221 127262 122712 115485 125501 133498 144152 140068 135381 154977 165235 164701
9031 164701 154890 156417 156924 156896 150162 139474 125049 119998 119615 119370 126473 129891 122972 125913 130763
9016 130763 131558 136856 137057 138843 149005 149223 156227 155799 146944 148911 156694 168556 168720 162848 158412
$$ packed form
9117I7041K232j1119j4489K294J1438J8335J4251j0792j1784l838K707m269n128
9104H6879n951m528q28q10M948N96K173N497k826k748l969K146k478J974J5351
9089I5426J2315N705L979j3671r889J329K064l819k200k673o062M032N236J1114
9075A02886J253k393L037o05l208m874j068P814P346N252R052m527n07q717q044
9060A02697L806M887j478o88m332K765M876N341L025o434p085R455L878l573M925
9045A22065n135m65Q756K041m550p227J0016P997J0654m084m687J9596J0258n34
9031A64701r811J527N07k8o734j0688j4425n051l83k45P103L418o919K941M850
9016A30763P95N298K01J786J0162K18P004m28q855J967P783J1862J64n872m436
$$ plain form
9001 158412 168456 178296 189617 200763 213654 213103 213620 219738 240567 276131 312775 375960 454036
8988 454036 545418 623994 660779 670923 638627 572897 504828 457858 420413 379445 343246 310495
8976 310495 288784 265231 248303 250947 246531 245199 239969 239701 241544 239759 236774 236676 237258 235707 230953
8961 230953 225046 229697 229313 240492 249045 253258 258635 263155 273720 288759 304276 319207 338837
8948 338837 374007 423691 481611 577563 728833 930293 1102659 1187133 1204414 1149130 1013529
8937 1013529 884734 764227 682484 616411 542389 478637 428844 393863 379068 358679 341640
8926 341640 326072 316190 313034 301945 296553 294252 295818 290035 283594 285086 283703 264751 262544 273655
8912 273655 273787 267078 267919 272937 284130 289117 297780 297503 296495 317699 346369 378908 423888 489900
$$ packed form
9001A58412J0044R840J1321J1146J2891n51N17O118K0829L5564L6644O3185P8076
8988D54036R1382P8576L6785J0144l2296o5730o8069m6970l7445m0968l6199l2751
8976C10495k1711k3553j6928K644m416j332n230k68J843j785k985r8N82j551m754
8961B30953n907M651l84J1179Q553M213N377M520J0565J5039J5517J4931J9630
8948C38837L5170M9684N7920R5952J51270K01460J72366Q4474J7281n5284j35601
8937A013529j28795j20507q1743o6073p4022o3752m9793l4981j4795k0389j7039
8926C41640j5568r882l156j1089n392k301J566n783o441J492j383j8952k207J1111
8912B73655J32o709Q41N018J1193M987Q663k77j008K1204K8670L2539M4980O6012
$$ plain form
8898 489900 572222 660403 710781 721164 696732 639668 568387 517465 479178 443203 398622 366243
8886 366243 337905 326968 319745 301770 289890 288430 286213 286928 287853 274710 261567 262349 256634 252103
8872 252103 246930 244750 247530 254124 257490 270786 272402 266236 256778 255107 252795 260535 257046 244069
8858 244069 235869 232660 227166 228170 228907 224741 215492 217011 201993 192790 191431 198772 213121 225780
8844 225780 245010 259066 281299 294250 294262 300411 324499 329072 329470 333860 326811 318950 315745 300284
8830 300284 282883 273870 265770 249156 243455 243946 252527 265493 269003 272268 288095 301053 296049
8817 296049 285589 288277 295390 296656 283997 264424 258900 260217 249915 240426 244405 240944 245361
8804 245361 257136 259316 264492 269970 277955 296004 328799 364108 391437 385089 371299 361434 360532
$$ packed form
8898D89900Q2322Q8181N0378J0383k4432n7064p1281n0922l8287l5975m4581l2379
8886C66243k8338j0937p223j7975j1880j460k217P15R25j3143j3143P82n715m531
8872B52103n173k180K780O594L366J3296J616o166r458j671k312P740l489j2977
8858B44069q200l209n494J004P37m166r249J519j5018r203j359P341J4349J2659
8844B25780J9230J4056K2233J2951J2O149K4088M573L98M390p049p861l205j5461
8830C00284j7401r013q100j6614n701M91Q581J2966L510L265J5827J2958n004
8817B96049j0460K688P113J266j2659j9573n524J317j0302r489L979l461M417
8804B45361J1775K180N176N478P985J8049L2795L5309K7329o348j3790r865r02
$$ plain form
8791 360532 362527 371038 376975 390904 395967 397990 401417 396322 398293 413799 433792 467672 489640
8778 489640 514361 531874 531220 523636 501739 468765 440399 418016 394517 390656 381972 378139 369739
8765 369739 363698 348631 339395 334519 336044 343373 347824 353237 354729 357163 365019 368127 373522 388893
8751 388893 400915 403912 402359 409314 424522 435254 442389 449005 469842 494900 511878 527284 542017
8738 542017 556480 584677 621900 672508 734932 787484 814764 808154 781094 739035 660045 583417
8726 583417 543360 515880 495881 467481 446758 429199 421293 419951 406996 406624 409150 410966 423945
8713 423945 441987 453557 475083 490797 505324 513876 525773 534420 534384 538021 526102 513275 503948
8700 503948 508647 524957 545197 556232 577843 603490 629820 641424 679076 710964 726513 750495
$$ packed form
8791C60532J995Q511N937J3929N063K023L427n095J971J5506J9993L3880K1968
8778D89640K4721J7513o54p584k1897l2974k8366k2383k3499l861q684l833q400
8765C69739o041j5067r236m876J525P329M451N413J492K434P856L108N395J5371
8751C88893J2022K997j553O955J5208J0732P135O616K0837K5058J6978J5406J4733
8738E42017J4463K8197L7223N0608O2424N2552K7280o610k7060m2059p8990p6628
8726E83417m0057k7480j9999k8400k0723j7559p906j342j2955l72K526J816J2979
8713D23945J8042J1570K1526J5714J4527Q552J1897Q647l6L637j1919j2827r327
8700E03948M699J6310K0240J1035K1611K5647K6330J1604L7652L1888J5549K3982
$$ plain form
8688 750495 787024 819672 840305 853996 865715 872102 883311 915027 989742 1114356 1345522
8677 1345522 1655541 1896579 1988964 2001992 1928895 1748044 1553836 1412887 1315961 1258711
8667 1258711 1212875 1161432 1127956 1121224 1112695 1104881 1099641 1093433 1065354 1040498 1027738 1035314 1048725
8654 1048725 1056518 1075492 1096965 1113473 1131777 1148486 1158383 1173698 1186039 1202973 1234268 1268232
8642 1268232 1305127 1342319 1392477 1449220 1527514 1630031 1757177 1940105 2241158 2712592
8632 2712592 3358579 3924432 4198006 4320247 4269308 3922641 3537792 3281366 3127282 3023600
8622 3023600 2954162 2903060 2891939 2962316 3093485 3316110 3635757 3996366 4326319 4584736
8612 4584736 4751617 4802576 4780694 4732712 4700258 4743194 4855390 5038387 5314399 5701938
$$ packed form
8688G50495L6529L2648K0633J3691J1719O387J1209L1716P4715J24614K31166
8677A345522L10019K41038R2385J3028p3097j80851j94208j40949r6926n7250
8667A258711m5836n1443l3476o732q529p814n240o208k8079k4856j2760P576J3411
8654A048725P793J8974K1473J6508J8304J6709R897J5315J2341J6934L1295L3964
8642A268232L6895L7192N0158N6743P8294J02517J27146J82928L01053M71434
8632B712592O45987N65853K73574J22241n0939l46667l84849k56426j54084j03682
8622C023600o9438n1102j1121P0377J31169K22625L19647L60609L29953K58417
8612D584736J66881N0959k1882m7982l2454M2936J12196J82997K76012L87539
$$ plain form
8602 5701938 6179982 6740052 7371863 8104617 8975553 10054122 11468091 13426691 16177507
8593 16177507 20084497 25832378 34603214 48034838 66203688 83870714 94077650 97349211
8585 97349211 95502204 85899415 72067209 60329662 51780217 44985614 38925665 33612653
8577 33612653 29253246 25803876 23118123 21039207 19426243 18147609 17113727 16293290
8569 16293290 15643258 15122693 14675372 14259135 13917949 13622857 13364221 13209139 13214716 13377399
8559 13377399 13723268 14251312 14976027 15901122 16961216 18140723 19567791 21379139 23815648
8550 23815648 27242526 32129200 39160543 49545558 65612202 91029058 127306978 163809594
8542 163809594 184077608 190156629 187824697 169004968 140365545 116507478 99692815
$$ packed form
8602E701938M78044N60070O31811P32754Q70936J078569J413969J958600K750816
8593A6177507L906990N747881Q770836J3431624J8168850J7667026J0206936L271561
8585I7349211j847007r602789j3832206j1737547q549445o794603o059949n313012
8577C3612653m359407l449370k685753k078916j612964j278634j033882q20437
8569A6293290o50032n20565m47321m16237l41186k95092k58636j55082N577J62683
8559A3377399L45869N28044P24715R25095J060094J179507J427068J811348K436509
8550B3815648L426878M886674P031343J0385015J6066644K5416856L6277920L6502616
8542A63809594K0268014O079021k331932j8819729k8639423k3858067j6814663
$$ plain form
8535 99692815 86462736 74465899 63803878 55024155 48058341 42607818 38349654 34975615
8527 34975615 32223358 29904687 27889597 26102405 24484294 23025466 21718866 20564032
8519 20564032 19560228 18663351 17912571 17321979 16889794 16599393 16447839 16406513 16483135 16653132
8509 16653132 16906505 17286395 17872674 18763494 20121072 22178270 25243873 29881856 37099199
8500 37099199 48390888 64522064 81860343 93093102 96866063 95920433 88162243 74813094
8492 74813094 62544447 53607597 46720873 40642267 35212109 30660749 26987429 24068606
8484 24068606 21780371 19956096 18442429 17135576 15997860 14958012 13989549 13090320
8476 13090320 12276592 11549142 10889114 10297104 9763260 9284481 8862580 8486786 8143498
$$ packed form
8535I9692815j3230079j1996837j0662021q779723o965814n450523m258164l374039
8527C4975615k752257k318671k015090j787192j618111j458828j306600j154834
8519B0564032j003804q96877p50780n90592m32185k90401j51554m1326P6622J69997
8509A6653132K53373L79890N86279Q90820J357578K057198L065603M637983P217343
8500C7099199J1291689J6131176J7338279J1232759L772961r45630p758190j3349149
8492G4813094j2268647q936850o886724o078606n430158m551360l673320k918823
8484B4068606k288235j824275j513667j306853j137716j039848r68463q99229
8476A3090320q13728p27450o60028n92010n33844m78779m21901l75794l43288
$$ plain form
8467 8143498 7827647 7528707 7236251 6960581 6702553 6440472 6190970 5942289 5704471 5472224
8457 5472224 5268880 5081478 4908613 4760384 4610603 4465192 4337255 4218466 4102635 3980826
8447 3980826 3853026 3729880 3612988 3509907 3409337 3310208 3210207 3110421 3030131 2956074
8437 2956074 2882434 2801278 2725639 2655339 2591562 2539557 2475165 2396953 2313564 2228938 2143860
8426 2143860 2048650 1961161 1881187 1804169 1739836 1678617 1609084 1548282 1502737 1460408 1432395
8415 1432395 1396226 1359029 1311179 1264757 1235933 1209441 1170042 1120760 1071204 1020527 987156
8404 987156 975383 953262 908437 864046 805645 733687 685156 638855 593491 575478 572356 559295
8392 559295 552211 547102 556384 558555 553536 551118 551145 543204 541346 537575 522165 499948 481572 456729
$$ packed form
8467H143498l15851k98940k92456k75670k58028k62081k49502k48681k37818k32247
8457E472224k03344j87402j72865j48229j49781j45411j27937j18789j15831j21809
8447C980826j27800j23146j16892j03081j00570r9129j00001r9786q0290p4057
8437B956074p3640q1156p5639p0300o3777n2005o4392p8212q3389q4626q5078
8426B143860r5210q7489p9974p7018o4333o1219o9533o0802m5545m2329k8013
8415A432395l6169l7197m7850m6422k8824k6492l9399m9282m9556n0677l3371
8404I87156j1773k2121m4825m4391n8401p1958m8531m6301m5364j8013l122j3061
8392E59295p084n109R282K171n019k418K7p941j858l771j5410k2217j8376k4843
$$ plain form
8378 456729 439322 421969 397802 387014 379580 377337 380598 381171 375717 383167 381453 384285 391998 392248
8364 392248 376934 356098 345890 332429 327133 329926 337928 314519 269033 201284 99540 11256
8352 11256 -44195 -82465 -101315 -74630 -28718 17074 64266 117387 157452 185930 208045 219489
8340 219489 213731 209270 208049 211689 203796 183564 175860 164474 155405 151734 148117 149408 149385 168119
8326 168119 176970 183248 200940 224545 228728 219298 199494 179130 171630 159324 154418 141478 139986
8313 139986 136417 116398 101622 73712 31337 -14938 -45319 -66695 -81539 -75939 -56227 -34503
8301 -34503 -11064 3975 15541 12943 13083 11483 8499 10522 29264 44989 45211 46735 54237 41924
8287 41924 35428 35610 33948 36862 40391 49888 56040 64588 70620 69047 53404 48921 43635 43144 33810
$$ packed form
8378D56729j7407j7353k4167j0788p434k243L261N73n454P450j714K832P713K50
8364C92248j5314k0836j0208j3461n296K793Q002k3409m5486o7749j01744q8284
8352A1256n5451l8270j8850K6685M5912M5792M7192N3121M0065K8478K2115J1444
8340B19489n758m461j221L640p893k0232p704j1386r069l671l617J291k3J8734
8326A68119Q851O278J7692K3605M183r430j9804k0364p500j2306m906j2940j492
8313A39986l569k0019j4776k7910m2375m6275l0381k1376j4844N600J9712K1724
8301c4503K3439J5039J1566k598J40j600k984K023J8742J5725K22J524P502j2313
8287D1924o496J82j662K914L529R497O152Q548O032j573j5643m483n286m91r334
$$ plain form
8272 33810 42834 45849 39912 25489 20456 13973 4840 -2187 -8332 -1984 2307 15379 15053 15005 10316
8257 10316 12898 15655 6950 4727 14155 11867 11117 12347 11970 23436 38254 43845 40697 28718
8243 28718 18862 7563 16139 23014 20567 16960 14158 12735 12184 13253 7232 -102 -4383 5782
8229 5782 18562 19105 12451 6894 7826 2253 -3848 524 -7542 -19297 -32013 -34682 -25525 -22860 -24716
8214 -24716 -23491 -18184 -5412 -4693 -8902 -2489 346 9478 17181 20346 19477 22619 20824 27448 42724
8199 42724 49260 48870 41765 39699 40707 41965 39854 36509 35329 46327 74635 94549 127322 175847
8185 175847 241414 325521 415775 477390 501571 504383 455960 378810 305994 258854 221422 191150
8173 191150 166449 140023 120091 101472 87391 83032 74240 61844 47116 45543 45475 52722 61890
$$ packed form
8272C3810R024L015n937j4423n033o483r133p027o145O348M291J3072l26m8m689
8257A0316K582K757q705k223R428k288p50J230l77J1466J4818N591l148j1979
8243B8718r856j1299Q576O875k447l607k802j423n51J069o021p334m281J0165
8229E782J2780N43o654n557R32n573o101M372q066j1755j2716k669R157K665j856
8214b4716J225N307J2772P19m209O413K835R132P703L165q69L142j795O624J5276
8199D2724O536l90p105k066J008J258k111l345j180J0998K8308J9914L2773M8525
8185A75847O5567Q4107R0254O1615K4181K812m8423p7150p2816m7140l7432l0272
8173A91150k4701k6426j9932j8619j4081m359q792j2396j4728j573o8P247R168
$$ plain form
8160 61890 61904 54016 46463 51554 55014 60919 71661 76279 74552 69698 71087 77622 92166 105426
8146 105426 113212 129771 157710 190470 240835 318328 441182 627483 831660 962332 1010533
8135 1010533 1003045 917614 769383 626831 533738 470982 411141 345222 291447 242800 203177
8124 203177 168360 148654 141392 139754 140511 134639 121108 115695 99912 79783 72570 63867 59005
8111 59005 69126 80436 77014 75674 88099 97453 99163 100479 94214 92919 96822 96996 106722 124892
8097 124892 155050 193254 248620 333031 421380 480600 503958 489694 446782 377731 313069 276805
8085 276805 248556 219638 189092 164729 135733 114689 100482 105748 105919 97531 82580 74643 72402
8072 72402 64723 67241 61017 52315 49919 53401 54632 49678 45892 45539 39500 22930 14228 8261 341
$$ packed form
8160F1890J4p888p553N091L460N905J0742M618j727m854J389O535J4544J3260
8146A05426P786J6559K7939L2760N0365P7493J22854J86301K04177J30672M8201
8135A010533p488q5431j48231j42552r3093o2756n9841o5919n3775m8647l9623
8124B03177l4817j9706p262j638P57n872j3531n413j5783k0129p213q703m862
8111E9005J0121J1310l422j340J2425R354J710J316o265j295L903J74R726J8170
8097A24892L0158L8204N5366Q4411Q8349N9220K3358j4264m2912o9051o4662l6264
8085B76805k8249k8918l0546k4363k8996k1044j4207N266J71q388j4951p937k241
8072G2402p679K518o224q702k396L482J231m954l786l53o039j6570q702n967p920
$$ plain form
8057 341 3695 16658 31001 23477 15695 13917 5488 -777 -11418 -19729 -10955 -4507 4340 14492
8043 14492 19571 18688 17562 8721 2125 -2876 -7558 -7089 -4509 7626 17204 10475 6040 8072 3176
8028 3176 2976 9042 14978 8418 -10168 -15045 -15223 -8144 -6406 3129 3099 2372 529 -4238 -6621 -928
8012 -928 4748 7482 3523 2076 -5487 -12972 -15107 -15363 -19590 -22085 -19016 -22733 -22065 -13459 -8277 2599
7996 2599 6346 945 -13122 -20418 -20354 -8399 -1026 -3028 -809 -5546 -7518 123 5354 3951 -3135
7981 -3135 4053 3095 -6647 -17361 -27678 -30496 -20609 -21690 -21941 -13787 -10609 -10273 -15307 -14891 -8002
7966 -8002 2079 6915 -7851 -21387 -25478 -14325 -11411 -13836 -9655 -13056 -12337 -4964 -2641 -12154
7952 -12154 -20393 -28844 -31304 -32962 -31507 -29076 -26558 -33896 -29333 -25636 -25570 -26604 -26363 -24742 -18791
$$ packed form
8057C41L354J2963J4343p524p782j778q429o265j0641q311Q774O448Q847J0152
8043A4492N079q83j126q841o596n001m682M69K580J2135R578o729m435K032m896
8028C176k00O066N936o560j8586m877j78P079J738R535l0p27j843m767k383N693
8012i28N676K734l959j447p563p485k135k56m227k495L069l717O68Q606N182J0876
7996B599L747n401j4067p296O4J1955P373k002K219m737j972P641N231j403p086
7981c135P188r58r742j0714j0317k818R887j081k51Q154L178L36n034M16O889
7966h002J0081M836j4766j3536m091J1153K914k425M181l401P19P373K323r513
7952a2154q239q451k460j658J455K431K518p338M563L697O6j034K41J621N951
$$ plain form
7937 -18791 -13014 -6385 1179 95 -8006 -19283 -29313 -29474 -26229 -22977 -14971 -9230 -1547 -2634
7923 -2634 -14147 -20672 -32739 -37181 -28453 -24118 -18120 -15286 -11314 -12614 -10403 -12017 -8069 -12093
7909 -12093 -166 -1716 2353 -1249 -330 -14263 -17264 -10660 -20224 -20594 -14927 -11593 -17181 -21064 -21929
7894 -21929 -24340 -25005 -21813 -10975 -5544 -13133 -9818 402 -736 2360 3290 3608 -561 -4033 -2861
7879 -2861 -3288 -1430 6980 7747 2445 -5118 -4535 -970 -4415 -3908 -9230 -15547 -15082 -7531 -1126 -3413
7863 -3413 -9392 -16082 -20138 -17807 -5407 -780 -4390 -8446 -9347 -10332 -6274 -701 -11026 -24738 -19625
7848 -19625 -5626 2228 9612 9845 7058 88 622 -2609 -6454 3409 -6563 -6007 7816 12936 12450
7833 12450 8491 -4347 -11086 -13829 -4446 3357 -342 -4869 -1248 1031 -5926 -3204 -2769 1742 -8940
$$ packed form
7937a8791N777O629P564j084q101j1277j0030j61L245L252Q006N741P683j087
7923b634j1513o525j2067m442Q728M335N998K834L972j300K211j614L948m024
7909a2093J1927j550M069l602R19j3933l001O604r564l70N667L334n588l883q65
7894b1929k411o65L192J0838N431p589L315J0220j138L096R30L18m169l472J172
7879b861m27J858Q410P67n302p563N83L565l445N07n322o317M65P551O405k287
7863c413n979o690m056K331J2400M627l610m056r01r85M058N573j0325j3712N113
7848a9625J3999P854P384K33k787o970N34l231l845R863r972N56J3823N120m86
7833A2450l959j2838o739k743R383P803l699m527L621K279o957K722M35M511j0682
$$ plain form
7818 -8940 -12133 -14756 -5715 -5214 -6166 -4128 3849 5567 1831 -11641 -8856 -446 -622 -9313 -11840
7803 -11840 -8800 -8199 -8871 -14679 -4196 417 -5013 -14573 -12731 -16541 -16965 -5058 -710 -2265 7307
7788 7307 3844 3652 689 -5848 -22301 -18897 -18556 -13349 -17145 -24806 -17946 -15762 -11190 -2375 -3183
7773 -3183 -5939 -10784 -11617 -13429 -12242 -11012 -16488 -23396 -30369 -31756 -26726 -27203 -32763 -25537 -23949
7758 -23949 -15430 -16793 -14811 -16506 -11591 -16776 -31505 -30382 -29403 -25961 -26007 -33677 -23075 -14735 -7484
7743 -7484 -13263 -22468 -23848 -11895 -16490 -6192 -4777 -3737 -8605 -14204 -18597 -17527 -20350 -24952
7729 -24952 -19806 -15807 -17660 -20978 -26553 -22714 -18805 -10915 -9206 -10881 -14158 -7057 -2829 -7750 -7590
7714 -7590 -19573 -28920 -36566 -30399 -25887 -18808 -12246 -11329 -14950 -7893 -7852 -16035 -12474 -4197 -1008
$$ packed form
7818h940l193k623R041N01r52K038P977J718l736j3472K785Q410j76q691k527
7803a1840L040O01o72n808J0483M613n430r560J842l810m24J1907M348j555R572
7788G307l463j92k963o537j6453L404L41N207l796p661O860K184M572Q815q08
7773c183k756m845q33j812J187J230n476o908o973j387N030m77n560P226J588
7758b3949Q519j363J982j695M915n185j4729J123R79L442m6p670J0602Q340P251
7743g484n779r205j380J1953m595J0298J415J040m868n599m393J070k823m602
7729b4952N146L999j853l318n575L839L909P890J709j675l277P101M228m921J60
7714g590j1983r347p646O167M512P079O562R17l621P057M1q183L561Q277L189
$$ plain form
7699 -1008 -7849 -10615 -22140 -28839 -34906 -33560 -30653 -22617 -22315 -20924 -12612 -11830 -11601 -6454 -7415 -13611
7683 -13611 -15634 -18730 -14802 -7556 -9527 -9307 -8415 -25385 -29628 -29221 -32082 -26144 -21778 -25421 -28701
7668 -28701 -26007 -20473 -25515 -20004 -21947 -27394 -26614 -23085 -21412 -23680 -23648 -21692 -23686 -29681 -25119
7653 -25119 -20537 -26406 -29056 -26148 -23481 -35333 -34395 -24153 -22324 -13514 -14408 -13998 -14580 -18178 -14737
7638 -14737 -19479 -28084 -22431 -8184 -6493 -5289 -10390 -9382 -6938 -10290 -19981 -23326 -15723 -21610
7624 -21610 -27419 -31900 -36192 -39476 -37129 -33727 -27609 -26268 -15578 -18952 -28746 -30992 -26030 -17912
7610 -17912 -16823 -10941 -13260 -13038 -17540 -17141 -13011 -23142 -33374 -32282 -21240 -21233 -26051 -15993 -14455
7595 -14455 -16562 -19898 -21135 -18349 -8475 2997 -5764 -16258 -6838 -13158 -18784 -20253 -22995 -27627
$$ packed form
7699a008o841k766j1525o699o067J346K907Q036L02J391Q312P82K29N147r61o196
7683a3611k023l096L928P246j971K20Q92j6970m243M07k861N938M366l643l280
7668b8701K694N534n042N511j943n447P80L529J673k268L2J956j994n995M562
7653b5119M582n869k650K908K667j1852R38J0242J829Q810q94M10n82l598L441
7638a4737m742q605N653J4247J691J204n101J008K444l352r691l345P603n887
7624b1610n809m481m292l284K347L402O118J341J0690l374r794k246M962Q118
7610a7912J089N882k319K22m502L99M130j0131j0232J092J1042Pm818J0058J538
7595a4455k107l336j237K786R874J1472q761j0494R420o320n626j469k742m632
$$ plain form
7581 -27627 -26919 -11446 -3701 -15406 -17842 -28833 -38240 -38465 -29226 -30328 -31249 -33532 -34916 -28880 -25185
7566 -25185 -26601 -26246 -16156 -23113 -31750 -35091 -35482 -30303 -27727 -35113 -31988 -31301 -32442 -23890 -9665
7551 -9665 -9418 -19386 -14803 -18223 -26619 -29915 -32191 -37975 -33135 -31622 -30273 -25807 -18025 -12145 -13643
7536 -13643 -28825 -35357 -33871 -38797 -34167 -33324 -27041 -29822 -30440 -23893 -10256 -4112 -6043 -8581 -11553
7521 -11553 -9275 -9185 -15596 -19950 -13893 -17204 -26408 -22271 -19476 -32356 -31510 -22132 -12715 -14527 -22126
7506 -22126 -16639 -14166 -10296 -16826 -18621 -4336 4042 3797 1794 -2512 -1320 1503 1923 2665 12828
7491 12828 7290 1837 -8718 -12241 -15394 -10159 523 3866 1912 -3267 -16040 -22328 -25741 -37519
7477 -37519 -40278 -35428 -31569 -29400 -16154 -11759 -1404 -7374 -6843 -6338 -11909 -20326 -21675 -23830 -36995
$$ packed form
7581b7627P08J5473P745j1705k436j0991r407k25R239j102r21k283j384O036L695
7566b5185j416L55J0090o957q637l341l91N179K576p386L125O87j141Q552J4225
7551i665K47r968M583l420q396l296k276n784M840J513J349M466P782N880j498
7536a3643j5182o532J486m926M630Q43O283k781o18O547J3637O144j931k538k972
7521a1553K278R0o411m354O057l311r204M137K795j2880Q46R378R417j812p599
7506b2126N487K473L870o530j795J4285Q378k45k003m306J192K823M20P42J0163
7491A2828n538n453j0555l523l153N235J0682L343j954n179j2773o288l413j1778
7477c7519k759M850L859K169J3246M395J0355n970N31N05n571q417j349k155j3165
$$ plain form
7462 -36995 -33202 -19788 -22727 -25930 -21939 -18416 -11923 -8421 -11459 -8097 -10342 -18007 -17361 -12281 -23423
7447 -23423 -21562 -9863 -6416 -7673 -9210 -12936 -4175 -3325 -11246 -13927 -9948 -6696 -6195 -13281 -18741
7432 -18741 -19834 -21485 -19208 -20857 -23793 -35143 -30578 -31197 -34187 -25210 -28289 -31267 -32072 -25051 -23655
7417 -23655 -27627 -36451 -35154 -28135 -20850 -24002 -30268 -27038 -30632 -22099 -15605 -12027 -4973 -1389 -2861
7402 -2861 -3984 -1261 -2602 -3381 -6719 -6311 -17318 -32654 -42904 -43170 -35343 -18718 -2168 5356
7388 5356 -5439 -12046 -9410 -11429 -21240 -31786 -30954 -20419 -27407 -27189 -26212 -25015 -20454 -17214 -26140
7373 -26140 -24596 -18702 -20609 -17540 -16864 -17368 -15789 -15317 -20693 -21840 -27451 -23238 -17072 -13167 -12751 -21987
7357 -21987 -25693 -22075 -16648 -10619 -11000 -11388 -8362 -9456 -11936 -11092 -18101 -23169 -20897 -13496 -12569 -19346
$$ packed form
7462c6995L793J3414k939l203L991L523O493L502l038L362k245p665O46N080j1142
7447b3423J861J1699L447j257j537l726Q761Q50p921k681L979L252N01p086n460
7432a8741j093j651K277j649k936j1350M565o19k990Q977l079k978q05P021J396
7417b3655l972q824J297P019P285l152o266L230l594Q533O494L578P054L584j472
7402b861j123K723j341p79l338M08j1007j5336j0250k66P827J6625J6550P524
7388E356j0795o607K636k019r811j0546Q32J0535o988K18R77J197M561L240q926
7373b6140J544N894j907L069O76n04J579M72n376j147n611M213O166L905M16r236
7357b1987l706L618N427O029l81l88L026j094k480Q44p009n068K272P401R27o777
$$ plain form
7341 -19346 -12113 -11587 -16470 -18481 -12846 -8839 -9182 -15537 -20025 -18121 -12579 -22919 -31397 -22005 -20328
7326 -20328 -21023 -25129 -17844 -13357 -22731 -27499 -27256 -28721 -31404 -29327 -14955 -3468 -7332 -7845 -5774
7311 -5774 -11661 -7542 -260 -4031 -13138 -18446 -15892 -15567 -17797 -7870 -2977 -6629 -18692 -14319 -11765
7296 -11765 -10395 -20300 -30534 -28037 -13096 -6546 -8561 -15833 -26062 -20318 -9013 -7562 -4196 -11592
7282 -11592 -23300 -29385 -38597 -44495 -39894 -35703 -31467 -37438 -33508 -24976 -23884 -20095 -26287 -22296
7268 -22296 -12884 -9701 -9799 -10468 -10409 2810 4553 -8999 -5406 2283 8442 3777 -4491 -12018 -16942
7253 -16942 -22998 -23604 -34294 -28213 -9889 -13628 -24550 -25531 -20478 -14346 -9089 -9483 -8786 4546 12768
7238 12768 10656 3081 -7785 -15186 -17921 -16952 -12701 -10013 -15985 -22756 -11544 -1902 -5044 -15876
$$ packed form
7341a9346P233N26m883k011N635M007l43o355m488J904N542j0340q478R392J677
7326b0328o95m106P285M487r374m768K43j465k683K077J4372J1487l864n13K071
7311e774n887M119P282l771r107n308K554L25k230R927M893l652j2063M373K554
7296a1765J370r905j0234K497J4941O550k015p272j0229N744J1305J451L366p396
7282a1592j1708o085r212n898M601M191M236n971L930Q532J092L789o192L991
7268b2296R412L183r8o69N9J3219J743j3552L593P689O159m665q268p527m924
7253a6942o056o06j0690O081J8324l739j0922r81N053O132N257l94O97J3332Q222
7238A2768k112p575j0866p401k735R69M251K688n972o771J1212R642l142j0832
$$ plain form
7224 -15876 -12535 -11478 -15442 -14922 -19126 -19016 -13031 -13463 -6737 -10817 -13256 -12482 -15276 -18309 -22259 -21855
7208 -21855 -20010 -15224 -8328 -4179 -4375 634 -4936 -10506 -10030 -5460 -10097 -7679 -10260 -4616 -4655 -6686
7192 -6686 -11341 -19606 -18639 -18961 -20396 -21317 -13983 -4550 -4796 -8099 -2852 -11531 -16807 -11569 -1804 3905
7176 3905 691 -11003 -14213 -11338 -1643 1238 -6706 -8723 -12824 -17959 -10841 -12314 -13115 -8961 -3198
7161 -3198 4572 3134 13765 20070 24771 26373 24423 8284 -4036 -9646 -1169 -3893 -8768 5126
7147 5126 2603 -3452 -12774 -19871 -14700 -9742 -14226 -12614 -13943 -4418 -6958 -9743 -3694 -4977 -4649
7132 -4649 -6927 -5950 -8402 -15855 -24646 -25779 -15092 -4656 -2300 585 -3161 -8091 -10162 -18145 -19163
7117 -19163 -9874 -10161 -1579 -105 -5458 -11038 -14843 -17014 -21052 -19852 -16856 -17585 -16001 -15287 -19293
$$ packed form
7224a5876L341J057l964N20m204J10N985m32O726m080k439P74k794l033l950M04
7208b1855J845M786O896M149j96N009n570n570M76M570m637K418k581N644l9k031
7192f686m655q265R67l22j435r21P334R433k46l303N247q679n276N238R765N709
7176C905l214j1694l210K875R695K881p944k017m101n135P118j473q01M154N763
7161c198P770j438J0631O305M701J602j950j6139j2320n610Q477k724m875J3894
7147E126k523o055r322p097N171M958m484J612j329R525k540k785O049j283L28
7132d649k278R77k452p453q791j133J0687J0436K356K885l746m930k071p983j018
7117a9163R289k87Q582J474n353n580l805k171m038J200K996p29J584P14m006
$$ plain form
7102 -19293 -10355 -7020 -5757 -4151 -9462 -17211 -9308 -6836 -89 1013 -6703 -2238 -4147 -15524
7088 -15524 -9786 -8637 -17307 -15579 -4568 -3346 -4534 -9080 -14653 -13346 -2596 1791 -11295 -22146
7074 -22146 -25843 -28281 -26844 -22973 -17660 -14258 -7799 -23906 -36694 -39714 -32975 -30911 -22689 -16170
7060 -16170 -10006 -5239 -3697 -9902 -12639 -15501 -11928 -11765 -17542 -21860 -23460 -19962 -7206 -4898 -2444
7045 -2444 -1869 -16976 -29385 -37663 -32685 -26219 -16352 -8448 -287 -7359 -7592 -2064 9787 13973 5531
7030 5531 -968 -1714 -1527 -3951 -3165 -16028 -13359 -20479 -27419 -34497 -30816 -34483 -25279 -11151 -7095
7015 -7095 -3191 3996 535 -4086 -10898 -8864 -4065 -10991 -6338 1434 -5192 -9619 -1838 387 -23
7000 -23 5735 1169 8898 7404 -162 -6973 -15949 -24087 -31743 -22605 -19769 -17080 -8998 -8274 -16824 -11947
$$ packed form
7102a9293Q938L335J263J606n311p749P903K472O747J102p716M465j909j1377
7088a5524N738J149q670J728J1011J222j188m546n573J307J0750M387j3086j0851
7074b2146l697k438J437L871N313L402O459j6107j2788l020O739K064Q222O519
7060a6170O164M767J542o205k737k862L573J63n777m318j600L498J2756K308K454
7045b444N75j5107j2409q278M978O466R867P904Q161p072k33N528J1851M186q442
7030E531o499p46J87k424P86j2863K669p120o940p078L681l667R204J4128M056
7015g095L904P187l461m621o812K034M799o926M653P772o626m427P781K225m10
7000b3N758m566P729j494p566o811q976q138p656R138K836K689Q082P24q550M877
$$ plain form
6984 -11947 -5261 -4315 4267 2312 -1315 551 -1006 2056 4369 -10525 -24428 -19885 -18113 -21169
6970 -21169 -16364 -7524 -717 8682 7483 -6991 -14063 -17453 -20161 -17410 22 7821 8993 6286
6956 6286 10611 18871 19898 10774 6850 2738 -1529 -18442 -28088 -32495 -33835 -24528 -8574 -8305 -1926
6941 -1926 -1614 -8102 2091 331 -7318 -3676 723 2065 13370 11725 8500 2213 -6108 -22572
6927 -22572 -23329 -13120 -6456 4514 4011 6632 12148 5198 1741 -2356 -8397 -8169 -4473 1081 -998
6912 -998 6677 4476 -6582 -3546 3507 5637 767 -598 -1531 2708 3707 4764 626 -10753 -14733
6897 -14733 -21246 -14137 -6315 -3256 -11143 -15309 -8326 5148 8349 9371 18508 12056 1755 -4515
6883 -4515 -6735 -1008 1594 2263 -1953 -8669 -2334 -7185 -8012 -6408 -6248 -11747 -3233 -10873 -16759 -18978
$$ packed form
6984a1947O686R46Q582j955l627J866j557L062K313j4894j3903M543J772l056
6970b1169M805Q840O807R399j199j4474p072l390k708K751J7432P799J172k707
6956F286M325Q260J027r124l924m112m267j6913r646m407j340R307J5954K69O379
6941a926L12o488J0193j760p649L642M399J342J1305j645l225o287q321j6464
6927b2572p57J0209O664J0970n03K621N516o950l457m097o041K28L696N554k079
6912i98P675k201j1058L036P053K130m870j365r33M239R99J057m138j1379l980
6897a4733o513P109P822L059p887m166O983J3474L201J022R137o452j0301o270
6883d515k220N727K602O69m216o716O335m851q27J604J60n499Q514p640n886k219
$$ plain form
6867 -18978 -22945 -22751 -10083 3250 2003 -9143 -9463 2708 -2011 -2236 -6105 -2366 -600 2909
6853 2909 -1634 -12173 -14920 -7415 -5642 -5100 -465 -4030 -6407 -12923 -18466 -12793 -14409 -18383 -10563
6838 -10563 -9107 -19702 -18057 -20314 -24015 -24488 -26064 -19939 -13611 -15065 -14466 -16806 -6607 -4470 -14043
6823 -14043 -17971 -21124 -11559 -6843 -13387 -15444 -4980 644 -1585 -7763 -5198 -12557 -10848 -6775
6809 -6775 -10560 -9632 -12861 -9879 -6050 2584 1935 -4642 -12929 -13667 -14592 -27391 -29595 -18508 -16791
6794 -16791 -14823 -6834 -3018 -4030 -9652 -7681 -6499 -8989 -12617 -4606 -8150 -21638 -25039 -26659
6780 -26659 -14112 -20030 -25567 -27371 -20990 -16496 -8072 -698 470 -944 -5852 -4346 811 1431 3831
6765 3831 1409 1809 -532 6055 6213 -310 6060 4911 4067 463 4204 15071 11987 9863 8081
$$ packed form
6867a8978l967J94J2668J3333j247j1146l20J2171m719k25l869L739J766L509
6853B909m543j0539k747P505J773N42M635l565k377o516n543N673j616l974P820
6838a0563J456j0595J645k257l701m73j576O125O328j454N99k340J0199K137r573
6823a4043l928l153R565M716o544k057J0464N624k229o178K565p359J709M073
6809f775l785R28l229K982L829Q634o49o577q287p38r25j2799k204J1087J717
6794a6791J968P989L816j012n622J971J182k490l628Q011l544j3488l401j620
6780b6659J2547n918n537j804O381M494Q424P374J168j414m908J506N157O20K400
6765C831k422M00k341O587J58o523O370j149q44l604L741J0867l084k124j782
$$ plain form
6750 8081 -586 -13390 -9802 -9956 -17764 -10623 -9929 -10252 -9237 -12686 -9037 -12107 -5686 4933 8939
6735 8939 4968 -683 -1236 -5274 933 5153 1845 -4428 -2458 -2442 -6252 -4164 4394 10450 4606 -107
6719 -107 -2413 -12527 -9823 -12718 -11099 -10938 -11584 -12879 -16111 -7475 -6430 -18907 -27602 -11675 -7424
6704 -7424 -7647 -6937 6115 8354 -1428 -5577 -15970 -10963 -4068 -8700 -9310 -7620 -1300 -135 -4259
6689 -4259 -4076 -2851 6690 15899 11301 5081 -3805 -5323 -13892 -11782 -13787 -13090 -15480 -9552 349
6674 349 -713 -3296 1272 2677 1030 -348 -3386 -4943 -7890 -7610 -9816 -11226 -18115 -25138 -25255 -27470
6658 -27470 -24086 -18102 -13634 -12989 -14137 -1363 -3996 3395 8496 4426 -4737 -8275 235 -2951 -3454
6643 -3454 -11899 -19787 -9319 1609 -957 -11560 -11945 -10946 -6715 -1648 -8417 -14062 -11051 -8819 -12756
$$ packed form
6750H081q667j2804L588j54p808P141O94l23J015l449L649l070O421J0619M006
6735H939l971n651n53m038O207M220l308o273J970J6l810K088Q558O056n844m713
6719a07k306j0114K704k895J619J61o46j295l232Q636J045j2477q695J5927M251
6704g424k23P10J3052K239r782m149j0393N007O895m632o10J690O320J165m124
6689d259J83J225R541R209m598o220q886j518q569K110k005O97k390N928R901
6674C49j062k583M568J405j647j378l038j557k947K80k206j410o889p023j17k215
6658b7470L384N984M468O45j148J2774k633P391N101m070r163l538Q510l186n03
6643c454q445p888J0468J0928k566j0603l85R99M231N067o769n645L011K232l937
$$ plain form
6628 -12756 -9971 -484 5193 4344 -8031 -2511 2017 4996 -144 2988 7307 6266 3832 8824 19735
6613 19735 35788 31132 24599 27010 29009 22182 20420 17754 16749 19309 18699 22235 19947 6339
6599 6339 1226 1578 -3704 -9881 -8978 -13460 -8441 585 8125 5977 1996 3620 2717 -2387 -3563 -2564
6583 -2564 -5703 -1722 -2877 5840 10754 14085 6826 -6509 -17643 -13505 -13531 -11422 -6945 3106 6147
6568 6147 886 -4650 -13341 -14205 -22107 -16886 -9027 -11095 -21043 -27066 -28007 -20257 -8797 -4389 -1688
6553 -1688 4032 7189 7809 12709 16140 7898 800 3203 5048 -3326 -8953 -3769 -2421 -7019 -14527
6538 -14527 -12799 -4246 -71 -2699 -5504 -5323 -3598 -11810 -10889 -13415 -6115 -3034 -2896 -3277 37 -2595
6522 -2595 -15426 -26886 -27236 -19038 -5865 83 -5509 -5201 -6701 -6810 -1576 -3655 -5777 -4980 -4863
$$ packed form
6628a2756K785R487N677q49j2375N520M528K979n140L132M319j041k434M992J0911
6613A9735J6053m656o533K411J999o827j762k666j005K560o10L536k288j3608
6599F339n113L52n282o177R03m482N019R026P540k148l981J624r03n104j176R99
6583b564l139L981j155Q717M914L331p259j3335j1134M138k6K109M477J0051L041
6568F147n261n536q691q64p902N221P859k068r948o023r41P750J1460M408K701
6553a688N720L157O20M900L431q242p098K403J845q374n627N184J348m598p508
6538a4527J728Q553M175k628k805J81J725q212R21k526P300L081J38l81L314k632
6522b595j2831j1460l50Q198J3173N948n592L08j500j09N234k079k122P97J17
$$ plain form
6507 -4863 -2693 -1911 -9925 -12936 -15679 -8746 -6195 301 717 -5908 -7956 -13714 -7726 -5564 -6118 2796
6491 2796 12449 13434 5450 -5501 -12984 -9473 360 1366 1023 10163 16831 19108 19531 21141 15271
6476 15271 13844 6511 -5332 -3109 2179 4127 -2024 -439 560 423 -1454 -4947 -5929 -7216 -4982
6461 -4982 10434 20503 23613 23833 18603 9937 10540 8851 8039 10665 5661 3436 2905 1955 4891 3992
6445 3992 1595 3213 8435 7177 -6548 -1118 8353 3532 3931 2890 -2475 -12301 -7102 5232 7981
6430 7981 5105 751 -5281 -5069 -4831 -4542 -795 -1791 -696 -5070 -2153 -9929 -13539 -4239 11450 5384
6414 5384 -1897 1566 -2775 -10414 -9448 -8194 -1102 8318 13237 12450 10869 17197 20443 20510 12377 10120
6398 10120 615 -8401 -11607 -12226 -10265 -5782 -1580 594 74 6731 12021 15793 9672 3211 1826
$$ packed form
6507d863K170P82q014l011k743O933K551O496M16o625k048n758N988K162n54Q914
6491B796R653R85p984j0951p483L511R833J006l43R140O668K277M23J610n870
6476A5271j427p333j1843K223N288J948o151J585R99j37j877l493r82j287K234
6461d982J5416J0069L110K20n230q666O03j689q12K626n004k225n31r50K936q99
6445C992k397J618N222j258j3725N430R471m821L99j041n365r826N199J2334K749
6430G981k876m354o032K12K38K89L747r96J095m374K917p776l610R300J5689o066
6414E384p281L463m341p639R66J254P092R420M919p87j581O328L246O7q133k257
6398A0120r505r016l206o19J961M483M202K174n20O657N290L772o121o461j385
$$ plain form
6383 1826 4444 7073 13712 13344 11219 17330 12463 6278 11220 9073 2706 -8865 -6266 -1483 -1557
6368 -1557 7311 5602 210 7705 14827 10254 -768 -4551 -9236 -4477 11340 11023 12746 16608 22867
6353 22867 19864 17009 7525 -1856 -8477 -14483 -10136 -4489 -10061 -8606 -3212 -7195 -8004 723 188
6338 188 4900 6667 6530 1553 5431 12889 11580 1271 -3385 -3571 -2765 -4419 -3806 11419 23011
6323 23011 17738 19705 13906 8711 5339 -2369 -10662 -12062 -5178 -10998 -17360 -23930 -18098 -8677 -4631
6308 -4631 -3973 984 9224 10225 10619 1651 -6640 -7052 1522 6873 8928 4548 -3778 -5095 -81 -2351
6292 -2351 -2299 -3274 -180 3126 5213 10436 6779 5379 3759 -182 -6253 -7336 -4090 -4988 -8139 -7096
6276 -7096 -12697 -17523 -15783 -10210 -7839 -9209 -11156 -8565 -12503 -5492 -5540 -15254 -18597 -12565 -12005 -8534
$$ packed form
6383A826K618K629O639l68k125O111m867o185M942k147o367j1571K599M783p4
6368a557Q868j709n392P495P122m573j1022l783m685M759J5817l17J723L862O259
6353B2867l003k855r484r381o621o006M347N647n572J455N394l983q09Q727n35
6338A88M712J767j37m977L878P458j309j0309m656j86Q06j654O13J5225J1592
6323B3011n273J967n799n195l372p708q293j400O884n820o362o570N832R421M046
6308d631O58M957Q240J001L94q968q291m12Q574N351K055m380q326j317N014k270
6292b351N2r75L094L306K087N223l657j400j620l941o071j083L246q98l151J043
6276g096n601m826J740N573K371j370j947K591l938P011m8r714l343O032N60L471
$$ plain form
6260 -8534 -3482 -10913 -16449 -13252 1751 6700 2422 -6509 -13415 -11538 -10869 -17589 -11258 5663 16913
6245 16913 8123 -8417 -14179 -4908 -2633 -987 -2767 4248 7995 8548 11831 -13 1105 -3578
6231 -3578 -8321 3334 1676 -672 -6782 2215 6258 -3673 -3185 -4425 -4502 -944 5580 14353 11977
6216 11977 2549 5776 4125 -4144 -6950 -3835 -10360 -10983 -7714 -3292 3577 -7757 -16901 -16234 -6529
6201 -6529 -2212 -3486 -8386 -3738 5967 7294 7128 3360 2940 2147 8435 9475 6698 17217 20373
6186 20373 18087 9858 9632 8696 -3596 -6109 -6324 -7862 -9874 -2451 -5118 -11784 -11024 -6315 4059
6171 4059 9900 11225 10370 4636 -3348 -5397 -10985 -15084 -17070 -8789 -853 3231 -756 -2327 -11324
6156 -11324 -10815 -18501 -15257 -1475 2425 -3446 -2966 -8473 -3837 -3349 -5364 -9241 -7919 -3986 11983
$$ packed form
6260h534N052p431n536L197J5003M949m278q931o906J877O69o720O331J6921J1250
6245A6913q790j6540n762R271K275J646j780P015L747N53L283j1844J118m683
6231c578m743J1655j658k348o110Q997M043r931M88j240p7L558O524Q773k376
6216A1977r428L227j651q269k806L115o525o23L269M422O869j1334r144O67R705
6201f529M317j274m900M648R705J327j66l768m20p93O288J040k777J0519L156
6186B0373k286q229k26r36j2292k513k15j538k012P423k667o666P60M709J0374
6171D059N841J325q55n734p984k049n588m099j986Q281P936M084l987j571q997
6156a1324N09p686L244J3782L900n871M80n507M636M88k015l877J322L933J5969
$$ plain form
6141 11983 13761 7162 5113 5897 3215 -5210 -10234 -8577 -7433 -5296 -4852 -8876 -13909 -13018 -11235
6126 -11235 -404 2556 3661 -1562 -9003 -3716 -3297 1672 8131 4838 -190 -1135 4048 5579 -5612
6111 -5612 -13589 -5120 -4905 -10758 -4837 4507 3566 4307 270 -4306 -5914 -3180 -9566 -10533 -11586 -19354
6095 -19354 -21883 -18180 -7681 274 -485 -12145 -19334 -9378 -2819 -4863 -2049 -7458 -12619 -15169
6081 -15169 -19991 -16096 -9114 -4229 -1309 2663 3792 10073 6253 9106 14101 9317 -824 -1426 -583
6066 -583 6329 8390 9779 8409 4778 3288 2302 1911 -774 -6423 1832 9883 7868 7625 10038 -1165
6050 -1165 -13276 -6258 -3963 7430 7947 754 -9930 -10425 -17925 -19985 -18980 -20591 -9845 -7217
6036 -7217 -6612 -7039 -6133 -17095 -8001 3058 2198 12617 6453 -496 -2017 5167 4819 -1225 -5851
$$ packed form
6141A1983J778o599k049P84k682q425n024J657J144K137M44m024n033Q91J783
6126a1235J0831K960J105n223p441N287M19M969O459l293n028r45N183J531j1191
6111e612p977Q469K15n853N921R344r41P41m037m576j608K734o386r67j053p768
6095a9354k529L703J0499P955p59j1660p189R956O559k044K814n409n161k550
6081a5169m822L895O982M885K920L972J129O281l820K853M995m784j0141o02Q43
6066e83O912K061J389j370l631j490r86l91k685n649Q255Q051k015k43K413j1203
6050a165j2111P018K295J1393N17p193j0684m95p500k060J005j611J0746K628
6036g217O05m27R06j0962R094J1059q60J0419o164o949j521P184l48o044m626
$$ plain form
6021 -5851 -11488 1413 7666 311 735 4169 2126 -564 -6814 -4171 3733 4309 7084 17095 6497
6006 6497 -2283 -1004 6148 8630 12285 3298 -6500 1238 -3890 -5007 -2754 -3120 3390 8904 13519
5991 13519 10026 8590 10898 17853 23912 13110 6099 3198 -2729 6265 2157 8505 5870 3385
5977 3385 4991 9386 17700 11413 1083 843 -2057 -2851 -5293 -2928 -6634 1455 10685 12853 6177
5962 6177 2676 902 -8439 -10740 -11525 -15478 -4335 -2228 1535 16630 17281 10092 12480 4658 2868
5947 2868 4310 -977 -10948 -9086 2003 4590 3975 4447 2655 3692 6341 14324 17666 7106 2688
5932 2688 -851 -2724 -7128 -10502 -3988 -10933 -9180 -1480 1961 1513 -6134 -16141 -11736 -13005 -4449
5917 -4449 2590 2168 3870 4862 -3429 -16929 -16950 -6181 -6444 -15977 -11186 2066 5896 5439 14250 7557
$$ packed form
6021e851n637J2901O253p355M24L434k043k690o250K643P904N76K775J0011j0598
6006F497q780J279P152K482L655q987r798P738n128j117K253l66O510N514M615
5991A3519l493j436K308O955O059j0802p011k901n927Q994m108O348k635k485
5977C385J606M395Q314o287j0330k40k900p94k442K365l706Q089R230K168o676
5962F177l501j774r341k301p85l953J1143K107L763J5095O51p189K388p822j790
5947B868J442n287r971J862J1089K587o15M72j792J037K649P983L342j0560m418
5932B688l539j873m404l374O514o945J753P700L441m48p647j0007M405j269Q556
5917d449P039m22J702R92q291j3500k1J0769k63r533M791J3252L830m57Q811o693
$$ plain form
5901 7557 -2936 -4174 -5244 -5004 -1792 -9076 -10583 -7374 -4568 -5752 -549 7009 7387 7057 -245
5886 -245 -3364 1003 7035 2009 -6451 -8306 -11221 -5659 -5095 -485 780 456 512 2526 7568 15787
5870 15787 13089 11882 6780 4355 7675 2948 -884 4322 6879 18987 16615 6244 3173 -3804
5856 -3804 -14534 -8095 3146 1062 1916 -7416 -7427 -13327 -15402 -11004 -4661 -3615 -9510 -9553 -8455 -535
5840 -535 4782 8773 17218 5961 8301 26926 28617 29805 31580 24990 12687 4950 5909 19124
5826 19124 19904 10066 5690 9941 12365 10074 11585 4441 -5395 -9406 -1591 8417 13597 10637 -1834
5811 -1834 1778 -5306 16 7706 5722 1143 1139 -3929 -2029 7860 7441 -2460 -1563 8473 14463 5912
5795 5912 1622 -3938 -5289 -5264 -14032 -12588 -2339 7139 14488 16087 6559 -5736 -4188 -3029 -5427
$$ packed form
5901G557j0493j238j070K40L212p284j507L209K806j184N203P558L78l30p302
5886b45l119M367O032n026q460j855k915N562N64M610J265l24N6K014N042Q219
5870A5787k698j207n102k425L320m727l832N206K557J2108k372j0371l071o977
5856c804j0730O439J1241k084Q54r332j1n900k075M398O343J046n895m3J098P920
5840e35N317L991Q445j1257K340J8625J691J188J775o590j2303p737R59J3215
5826A9124P80r838m376M251K424k291J511p144r836m011P815J0008N180k960j2471
5811a834L612p084N322P690j984m579mn068J900R889m19r901Q97J0036N990q551
5795E912m290n560j351K5q768J444J0249R478P349J599r528j2295J548J159k398
$$ plain form
5780 -5427 -11327 -17059 -8670 6162 5305 12225 4911 -7883 -20593 -12706 1510 -3244 -12152 -9960
5766 -9960 -3014 -1287 -2609 -4267 1102 8599 14352 13597 9109 6448 3120 -854 -6182 -11403 -8841
5751 -8841 -10292 -7424 5139 17023 12801 2846 3465 11691 16046 21011 13390 16181 19269 19303 8690
5736 8690 10094 9512 9567 11510 14596 13315 11450 10775 10016 14384 19833 14741 7140 2517 -10021 -11089
5720 -11089 -13861 -11530 225 1610 -3341 -9453 -12862 2501 14273 13885 12678 16090 16559 12802
5706 12802 3032 3767 8146 11290 8669 -34 3662 8984 15817 12238 2306 -339 -9438 -12367 -755
5691 -755 705 6389 12171 7445 6674 7161 12985 1836 -4975 -7477 1100 5873 4362 -3553 -4153 5508
5675 5508 7584 3778 -110 284 306 -4798 -6089 -15953 -12067 -6188 -562 7956 10011 9229 7302 11656
$$ packed form
5780e427n900n732Q389J4832q57O920p314j2794j2710P887J4216m754q908K192
5766i960O946J727j322j658N369P497N753p55m488k661l328l974n328n221K562
5751h841j451K868J2563J1884m222r955O19Q226M355M965p621K791L088L4j0613
5736H690J404n82N5J943L086j281j865o75p59M368N449n092p601m623j2538j068
5720a1089k772K331J1755J385m951o112l409J5363J1772l88j207L412M69l757
5706A2802r770P35M379L144k621q703L696N322O833l579r932k645r099k929J1612
5691g55J460N684N782m726p71M87N824j1149o811k502Q577M773j511p915o00R661
5675E508K076l806l888L94K2n104j291r864L886N879N626Q518K055p82j927M354
$$ plain form
5659 11656 12766 5142 4629 6767 3313 -5572 -7049 -1966 3757 7213 7174 8037 6085 985 -32 3269
5643 3269 205 -5014 -6723 -7235 -6421 -3392 -7118 -13501 -9208 -2465 -7797 1721 5067 1525 2859
5628 2859 -2768 -3932 -3552 -3289 -396 7161 16432 18026 13987 17880 19236 1022 -8613 -19193 -19697
5613 -19697 -22396 -9300 -8315 -12888 -2157 -6249 -1680 940 -12046 -17524 -15761 -14934 -12424 -9720
5599 -9720 -7820 -4791 -14135 -21848 -23630 -18148 -14285 -12653 -21212 -24350 -10345 6607 3684 4345 7918
5584 7918 4317 -2649 -13044 -17173 -1549 3325 -3656 -800 13854 29319 18974 10628 5315 7930
5570 7930 15215 14741 14039 10933 5675 5385 5859 14090 14906 3040 -6833 -3153 -2011 7744 9954 19382
5554 19382 24279 26581 15802 15503 17630 22886 19274 9087 2818 7211 6428 89 -9174 -7549 -3024
$$ packed form
5659A1656J110p624n13K138l454q885j477N083N723L456l9Q63j952n100j017L301
5643C269l064n219j709n12Q14L029l726o383M293O743n332R518L346l542J334
5628B859n627j164L80K63K893P557R271J594m039L893J356j8214r635j0580n04
5613a9697k699J3096R85m573J0731m092M569K620j2986n478J763Q27K510K704
5599i720J900L029r344p713j782N482L863J632q559l138J4005J6952k923O61L573
5584G918l601o966j0395m129J5624M874o981K856J4654J5465j0345q346n313K615
5570G930P285m74p02l106n258k90M74Q231Q16j1866r873L680J142R755K210R428
5554A9382M897K302j0779k99K127N256l612j0187o269M393p83o339r263J625M525
$$ plain form
5539 -3024 -249 4407 10458 3680 3298 10059 14473 20010 22954 23273 17236 11562 11173 11643 11839 3266
5523 3266 3621 -1561 -260 8557 15984 12894 7381 8837 -1289 -2255 -2526 19652 39749 33338 22291
5508 22291 19143 16983 25686 35840 33096 25497 3333 -11247 -17720 -9423 -4176 -23615 -28031 -17864
5494 -17864 -7371 -6402 -14187 -12215 -9759 -5782 -2586 -10539 -19578 -11162 7499 11936 5329 7426
5480 7426 11584 20018 16532 13781 14730 14619 -2937 -8640 -8512 -17979 -18027 -18633 -12400 -3322 3002 13202
5464 13202 13526 4195 11731 19783 18779 19437 12559 7374 -3301 -11122 -17196 -18557 -3800 266 -1911
5449 -1911 -14144 -15047 -16346 -23659 -23671 -20047 -10133 -12598 -17986 -16880 -14860 -8052 -419 8917 26460
5434 26460 33421 20522 15484 1599 -2216 -4631 -2750 -7294 -17362 -24062 -25690 -10895 -8152 5006
$$ packed form
5539c024K775M656O051o778l82O761M414N537K944L19o037n674l89M70J96q573
5523C266L55n182J301Q817P427l090n513J456j0126r66k71K2178K0097o411j1047
5508B2291l148k160Q703J0154k744p599k2164j4580o473Q297N247j9439m416J0167
5494a7864J0493R69p785J972K456L977L196p953r039Q416J8661M437o607K097
5480G426M158Q434l486k751R49j11j7556n703J28r467m8o06O233R078O324J0200
5464A3202L24r331P536Q052j004O58o878n185j0675p821o074j361J4757M066k177
5449a911j2233r03j299p313j2L624R914k465n388J106K020O808P633R336J7543
5434B6460O961j2899n038j3885l815k415J881m544j0068o700j628J4795K743J3158
$$ plain form
5420 5006 11905 15269 10095 3813 11367 19597 18218 5624 -1101 -4510 -4170 -1417 650 13105 12761
5405 12761 6998 6441 3340 5551 4839 1698 6525 6897 9432 10580 7050 4094 7922 17125 13842
5390 13842 756 -6437 4236 14245 12192 6764 9978 6745 -1914 -7611 6852 9453 6312 -344
5376 -344 9632 20964 17538 5532 -2118 3285 8840 4874 -7151 -9859 1767 3385 4521 14746
5362 14746 25558 25606 23376 25919 22795 6890 9599 6879 3923 827 -4007 -9354 -14150 -15450 -15264
5347 -15264 -12692 -11003 3819 21308 15992 7469 -1259 -370 -2258 146 1681 -5483 -3774 12145
5333 12145 14567 7932 2597 2461 -221 -4623 1707 -2387 -7629 -4953 -647 -11253 -22851 -23985
5319 -23985 -16029 451 5027 -1897 2788 9179 22844 13580 4246 6351 11683 9734 6738 10676
$$ packed form
5420E006O899L364n174o282P554Q230j379j2594o725l409L40K753K067J2455l44
5405A2761n763n57l101K211p12l141M827L72K535J148l530k956L828R203l283
5390A3842j3086p193J0673J0009k053n428L214l233q659n697J4463K601l141o656
5376c44R976J1332l426j2006p650N403N555l966j2025k708J1626J618J136J0225
5362A4746J0812M8k230K543l124j5905K709k720k956l096m834n347m796j300J86
5347a5264K572J689J4822J7489n316q523q728Q89j888K404J535p164J709J5919
5333A2145K422o635n335j36k682m402O330m094n242K676M306j0606j1598j134
5319b3985P956J6480M576o924M685O391J3665r264r334K105N332j949k996L938
$$ plain form
5305 10676 4719 -3243 -11469 -11762 -6316 9067 4975 4209 5838 2785 465 -2923 -8088 -11157 -11287
5290 -11287 -12914 -10382 -5735 -7243 -13741 -9711 873 1620 -4331 -4078 -5655 1313 -4560 -1926 4160
5275 4160 1128 -1956 -465 9335 17708 14242 2382 6975 13476 15064 12326 10974 3995 -6688
5261 -6688 -13625 -12941 -5847 -9576 -15772 -16538 -10001 -787 -1795 -376 -1315 3878 9219 8566 17030 9219
5245 9219 4735 2125 -617 -8715 -8541 -3579 -4616 -3126 5678 13305 11966 -5028 -4106 4017 -31
5230 -31 1974 1083 5008 -1000 1793 8963 7907 5378 5366 6953 3358 -2529 -204 -156 -3060 -9328 1126
5213 1126 12474 4832 -6577 -2812 5317 2140 -5555 -4021 4303 14703 12848 13833 17738 11410
5199 11410 6651 8381 9993 -524 -1262 2202 4492 4101 863 4880 6805 -1555 -5910 -6172 -9205
$$ packed form
5305A0676n957p962q226k93N446J5383m092p66J629l053k320l388n165l069j30
5290a1287j627K532M647j508o498M030J0584P47n951K53j577O968n873K634O086
5275D160l032l084J491R800Q373l466j1860M593O501J588k738j352o979j0683
5261f688o937O84P094l729o196p66O537R214j008J419r39N193N341o53Q464p811
5245I219m484k610k742q098J74M962j037J490Q804P627j339j6994R22Q123m048
5230c1K005q91L925o008K793P170j056k529j2J587l595n887K325M8k904o268J0454
5213A126J1348p642j1409L765Q129l177p695J534Q324J0400j855R85L905o328
5199A1410m759J730J612j0517p38L464K290l91l238M017J925q360m355k62l033
$$ plain form
5184 -9205 -3635 -1159 5606 10177 9791 3204 2088 5093 2054 4737 5219 5558 10218 6727 6976 5049
5168 5049 6809 -1790 -18108 -15812 -7496 -4138 -12826 -13300 -11883 -11280 -1181 -2381 -5126 -7620 -13109
5153 -13109 -6369 40 4974 2435 3892 1070 1098 9959 26889 34539 30730 20135 20041 21838 16235
5138 16235 4805 -3493 3351 8061 9295 22669 25380 6850 -7133 -9803 -2723 9651 11711
5125 11711 5692 -3307 -14299 -13105 -8321 -14826 -14497 -21513 -24939 -18256 -5602 -2711 -1028 -1441 -11524
5110 -11524 -16824 -19822 -9826 7097 4925 -1530 -1676 6943 2668 -4842 -11832 -7202 -6590 -2880 -1911
5095 -1911 -1469 -8784 420 7065 14214 14973 7083 15428 12755 8529 2874 2951 -1065 3443 4830 1946
5079 1946 872 -4685 7452 10933 -10527 -15719 3609 12997 6152 -2814 -8394 -7864 -7839 -11164 -15111
$$ packed form
5184i205N570K476O765M571l86o587j116L005l039K683M82L39M660l491K49j927
5168E049J760q599j6318K296Q316L358q688m74J417O03J0099j200k745k494n489
5153a3109O740O409M934k539J457k822K8Q861J6930P650l809j0595r4J797n603
5138A6235j1430q298O844M710J234J3374K711j8530j3983k670P080J2374K060
5125A1711o019q999j0992J194M784o505L29p016l426O683J2654K891J683m13j0083
5110a1524n300k998R996J6923k172o455j46Q619m275p510o990M630O12L710R69
5095a911M42p315R204O645P149P59p890Q345k673m226n655P7m016M508J387k884
5079A946j074n557J2137L481k1460n192J9328R388o845q966n580N30K5l325l947
$$ plain form
5064 -15111 -16112 -1920 15175 12447 8956 6571 9423 17493 17460 18258 22814 27948 32688 31621 14838
5049 14838 12658 10948 12533 24136 25301 14984 11281 6532 -3739 -9727 2490 13698 21465
5036 21465 25208 22041 13565 20011 20559 13826 8524 6641 4411 1360 -5369 -7494 -5598 -1145 -2479
5021 -2479 -8208 -11597 -20637 -15869 -7725 -6931 -594 7991 5001 -5068 264 5578 8299 2710 4214
5006 4214 1991 3889 9487 2495 -6254 -216 9221 15532 14086 1281 10066 13560 1419 -1653
4992 -1653 885 7593 6766 13213 15184 6107 -1084 -1073 -4823 -5942 -13627 -20529 -21942 -15532 -5819 1816
4976 1816 -417 -5082 -3135 -12295 -19058 -5478 3273 6150 -1952 1653 5731 1618 -717 -6501 -7920
4961 -7920 -6860 -8622 -1088 14352 10595 -3778 -3027 -55 944 -1830 -2729 -4260 -1483 -7478 -9780
$$ packed form
5064a5111j001J4192J7095k728l491k385K852Q070l3P98M556N134M740j067j6783
5049A4838k180j710J585J1603J165j0317l703m749j0271n988J2217J1208P767
5036B1465L743l167q476O446N48o733n302j883k230l051o729k125J896M453j334
5021b479n729l389r040M768Q144P94O337Q585k990j0069N332N314K721n589J504
5006D214k223J898N598o992q749O038R437O311j446j2805Q785L494j2141l072
4992a653K538O708q27O447J971r077p191J1l750j119p685o902j413O410R713P635
4976A816k233m665J947r160o763J3580Q751K877q102L605M078m113k335n784j419
4961g920J060j762P534J5440l757j4373P51K972R99k774q99j531K777n995k302
$$ plain form
4946 -9780 -13402 -14411 -15148 -11091 -6425 -16216 -6797 -7729 -10745 -13700 -3334 7964 18611 13870 9987
4931 9987 9441 12359 10922 4827 398 4172 9049 4424 1550 -527 3385 4827 2385 -6418 -7368
4916 -7368 8193 7547 6363 -2954 -3337 -7553 -14311 -9321 -3927 -1463 -1414 -6314 -15469 -25391 -28592 -29793
4900 -29793 -26100 -11082 -2723 -3891 -9526 -2143 7485 4203 4681 3194 -4145 -10210 -12942 -14489 -13822
4885 -13822 -8416 4082 -4425 -18434 -19094 -8504 -276 -2576 3 2334 9051 13853 13076 14953
4871 14953 10224 4378 6007 2467 8790 8876 888 13034 11641 9207 -981 -440 -600 -5719 -16364
4856 -16364 -6607 4334 9954 7011 -2925 -8840 -11713 -5463 -2481 3958 6156 3951 -3725 646
4842 646 3061 274 -3004 2824 10909 8236 1327 -6330 -4131 -5547 -9130 -1895 8989 9041 297
$$ packed form
4946i780l622j009p37M057M666r791R419r32l016k955J0366J1298J0647m741l883
4931I987n46K918j437o095m429L774M877m625k874k077L912J442k442q803r50
4916g368J5561o46j184r317l83m216o758M990N394K464M9m900r155r922l201j201
4900b9793L693J5018Q359j168n635P383R628l282M78j487p339o065k732j547O67
4885a3822N406J2498q507j4009o60J0590Q228k300K579K331O717M802p77J877
4871A4953m729n846J629l540O323Q6p988J2146j393k434j0188N41j60n119j0645
4856a6364R757J0941N620k943r936n915k873O250K982O439K198k205p676M371
4842F46K415k787l278N828Q085k673o909p657K199j416l583P235J0884N2q744
$$ plain form
4827 297 -6517 3241 -4487 -19363 -13372 -10722 -20316 -16283 -7598 -3437 -8022 -2356 4039 6912 4661
4812 4661 -426 2122 4353 8273 12596 10128 6481 1412 1880 201 -3614 -6306 -3585 -1569 -1159
4797 -1159 3951 5731 12565 19146 12189 14892 22338 24919 26663 22450 13670 22997 25247 17723 16533
4782 16533 19224 18283 18639 20899 8634 1498 -2714 -8588 -4809 1844 973 3769 -3067 -10493 -3271
4767 -3271 -3656 -4236 5894 13479 7693 2073 2603 4694 4288 9235 6190 -6489 -18952 -19612 -14353
4752 -14353 -5393 -1179 -5175 -6768 -6958 257 3328 19009 20197 13203 3852 5850 16723 12972
4738 12972 9836 10297 5319 1289 -5186 -4769 -5745 -5735 -518 3752 2502 7336 8827 6333 2718 -4664
4722 -4664 -13292 -7880 22 -7495 -14810 -7368 -216 -9301 -16723 -15829 -6717 -3525 7371 9001 -3858
$$ packed form
4827B97o814R758p728j4876N991K650r594M033Q685M161m585N666O395K873k251
4812D661n087K548K231L920M323k468l647n069M68j679l815k692K721K016M10
4797a159N110J780O834O581o957K703P446K581J744m213q780R327K250p524j190
4782A6533K691r41L56K260j2265p136m212n874L779O653q71K796o836p426P222
4767c271l85n80J0130P585n786n620N30K091m06M947l045j2679j2463o60N259
4752a4353Q960M214l996j593j90P215L071J5681J188o994r351J998J0873l751
4738A2972l136M61m978m030o475M17r76J0N217M270j250M834J491k494l615p382
4722d664q628N412P902p517p315P442P152r085p422Q94R112L192J0896J630j2859
$$ plain form
4707 -3858 -5215 -7931 -4421 2297 8601 8129 -210 -5561 -16203 -21734 -13639 -3884 2155 -5605 -7671
4692 -7671 -9807 -591 -1221 -3249 5588 7101 959 -2214 -348 -1004 10208 14951 8357 10747 13352
4677 13352 4777 1710 7053 5287 2010 -4537 -4844 -3264 3771 8378 3942 7418 6946 2975 -1185
4662 -1185 -5885 286 4589 3468 7265 9561 12676 4490 8257 14390 6089 6857 11476 12411 811
4647 811 -7713 -15895 -5634 2602 3369 7466 19982 30306 32346 17292 7622 6109 11948 6532
4633 6532 -2531 -7824 181 4035 4191 6230 1876 2993 6430 18737 17441 12640 14902 22773 24562
4618 24562 13683 4140 145 -2304 2757 11704 10635 11298 5792 -1842 -763 6294 9662 8989 14372
4603 14372 18674 19175 14927 9354 2297 -3967 2219 -6016 -19120 -10544 -4761 2479 7564 75 -12136
$$ packed form
4707c858j357k716L510O718O304m72q339n351j0642n531Q095R755O039p760k066
4692g671k136R216o30k028Q837J513o142l173J866o56J1212M743o594K390K605
4677A3352q575l067N343j766l277o547l07J580P035M607m436L476m72l971m160
4662a185m700O171M303j121L797K296L115q186L767O133q301P68M619R35j1600
4647H11q524q182J0261Q236P67M097J2516J0324K040j5054r670j513N839n416
4633F532r063n293Q005L854J56K039m354J117L437J2307j296m801K262P871J789
4618B4562j0879r543l995k449N061Q947j069O63n506p634J079P057L368o73N383
4603A4372M302N01m248n573p057o264O186q235j3104Q576N783P240N085p489j2211
$$ plain form
4588 -12136 -8605 2266 15126 9764 -70 -2954 -339 3899 12203 19409 17825 24350 23379 19721
4574 19721 7788 8260 -911 -4823 -6841 1884 2010 -4618 -4727 -9107 -5884 -7768 -11074 -3725 -7565
4559 -7565 -8320 -6971 -3264 15 1659 8359 16517 6618 -1999 -3081 -1459 11150 17095 9137 -3569
4544 -3569 1990 9287 3891 -2329 7660 9000 8311 4411 2509 10543 14919 11410 8526 1597 3396
4529 3396 -4031 -1300 -202 5499 12480 4988 -6094 -13367 -8865 -11491 -7182 1308 4302 16399
4515 16399 24029 29208 21774 9773 4981 5675 5126 4123 10949 13717 13471 9270 5981 1768 -4243
4500 -4243 -1049 -211 -471 -2837 -3190 8423 24276 23242 21363 9974 -8376 -9339 -3529 -6583 -8279
4485 -8279 -6138 6800 18910 13015 6975 7400 698 4740 8834 109 -6555 -1629 2264 -1346 -11143
$$ packed form
4588a2136L531J0871J2860n362r834k884K615M238Q304P206j584O525r71l658
4574A9721j1933M72r171l912k018Q725J26o628j09m380L223j884l306P349l840
4559g565p55J349L707L279J644O700Q158r899q617j082J622J2609N945p958j2706
4544c569N559P297n396o220R989J340o89l900j902Q034M376l509k884o929J799
4529C396p427K731J098N701O981p492j1082p273M502k626M309Q490K994J2097
4515A6399P630N179p434j2001m792O94n49j003O826K768k46m201l289m213o011
4500d243L194Q38k60k366l53J1613J5853j034j879j1389j8350r63N810l054j696
4485h279K141J2938J2110n895o040M25o702M042M094q725o664M926L893l610r797
$$ plain form
4470 -11143 -17564 631 10712 6953 4316 3810 20054 18505 20700 11321 7255 8256 2860 3054
4456 3054 8581 5403 -2072 2178 5376 9780 11217 3783 1934 800 -3447 -3915 -6746 -10874 -9584
4441 -9584 -9098 -4738 -2349 -1036 6169 1847 -7369 -1051 -3661 -2008 2576 1459 12425 10168 251
4426 251 4447 10459 1370 -5278 -3550 549 -4321 -8082 2800 3261 2821 6869 6180 630 1397 8830
4410 8830 10526 4949 -4702 -4345 1223 -1558 -2662 -10620 -10969 -15287 -6877 8595 12356 6969 5074
4395 5074 5031 -2323 -11922 -3304 2306 -3600 695 1450 10042 11844 15971 10022 11507 6846 5005 10150
4379 10150 11200 15481 22929 17740 21143 14561 53 -3939 -4308 -3961 6260 4157 -7656 -10228
4365 -10228 -9179 -6180 2353 5466 1598 -10053 -8635 -4868 2799 3455 9929 12642 13989 14193 4710
$$ packed form
4470a1143o421J8195J0081l759k637n06J6244j549K195r379m066J001n396J94
4456C054N527l178p475M250L198M404J437p434j849j134m247m68k831m128J290
4441i584M86M360K389J313P205m322r216O318k610J653M584j117J0966k257r917
4426B51M196O012r089o648J728M099m870l761J0882M61m40M048o89n550P67P433
4410H830J696n577r651L57N568k781j104p958l49m318Q410J5472L761n387j895
4395E074m3p354r599Q618N610n906M295P55Q592J802M127n949J485m661j841N145
4379A0150J050M281P448n189L403o582j4508l992l69L47J0221k103j1813k572
4365a0228J049K999Q533L113l868j1651J418L767P667O56O474K713J347K04r483
$$ plain form
4350 4710 -7632 1190 5427 6049 6212 5311 10834 9950 15765 17405 24642 23360 24636 19596 13357 6405
4334 6405 -1367 4917 8262 11392 14080 14062 10805 7662 1734 -1920 6900 20118 16654 13655 11105
4319 11105 5964 3856 13098 16294 10999 13627 10227 -3424 -3933 841 -529 -3740 -436 -1262 -3362
4304 -3362 -3446 -6180 -8234 -19198 -18377 -18933 -16397 -2492 -395 -7582 -1294 6393 5009 -696 3529
4289 3529 -5312 -84 8438 4052 5633 7250 1541 6200 10197 9065 8626 6516 8906 14832 19857
4274 19857 14235 7005 2526 7846 7499 4253 -5867 -744 6338 6249 6658 10180 8319 9909 15218
4259 15218 19043 8626 2210 11088 11088 14715 16827 21855 10281 1228 2551 2926 -2792 -7971 -9661
4244 -9661 -7522 -2267 -872 -703 -4116 -6639 -6223 6360 13116 21304 21908 21510 24490 24641 10787 11358
$$ packed form
4350D710j2342Q822M237O22J63r01N523q84N815J640P237j282J276n040o239o952
4334F405p772O284L345L130K688j8l257l143n928l654Q820J3218l464k999k550
4319A1105n141k108R242L196n295K628l400j3651n09M774j370l211L304q26k100
4304c362q4k734k054j0964Q21n56K536J3905K097p187O288P687j384n705M225
4289C529q841N228Q522m386J581J617n709M659L997j132m39k110K390N926N025
4274A9857n622p230m479N320l47l246j0120N123P082q9M09L522j861J590N309
4259A5218L825j0417o416Q878%L627K112N028j1574r053J323L75n718n179j690
4244i661K139N255J395J69l413k523M16J2583O756Q188O04l98K980J51j3854N71
$$ plain form
4228 11358 10942 11664 8631 7721 2625 -2625 -3596 -12375 -16681 990 222 175 620 2028 5466 16050
4212 16050 21993 14097 16716 15502 9290 8752 5863 7109 11082 2562 -1384 -3022 -2339 -4407 -12204
4197 -12204 -13810 -4532 1114 -4376 -6655 -1825 1535 13333 23379 15542 12253 16316 21271 13287
4183 13287 4967 9405 10303 5585 -4332 -10620 -11053 -2128 3543 5145 1577 4044 -1446 -3751 688
4168 688 1359 5831 5573 -861 -2279 -10637 -17443 -15344 -9623 825 673 6300 7568 15546 9332 1001
4152 1001 -1201 -10210 -14691 -9300 -5895 1628 12519 17908 8240 -291 -524 1286 5257 11025 7738
4137 7738 4852 14735 14694 3627 11159 17462 19383 24485 17498 -2024 -3343 2294 -1063 2130 1325
4122 1325 -175 4815 4897 9605 14117 3751 -6718 -8473 1292 -5259 -3160 10897 20809 16162 11485
$$ packed form
4228A1358m16P22l033r10n096n250r71q779m306J7671p68m7M45J408L438J0584
4212A6050N943p896K619j214o212n38k889J246L973q520l946j638O83k068p797
4197a2204j606R278N646n490k279M830L360J1798J0046p837l289M063M955p984
4183A3287q320M438Q98m718r917o288m33Q925N671J602l568K467n490k305M439
4168F88O71M472k58o434j418q358o806K099N721J0448j52N627J268P978o214q331
4152A001k202r009m481N391L405P523J0891N389r668q531k33J810L971N768l287
4137G738k886R883m1j1067P532O303J921N102o987j9522j319N637l357L193q05
4122A325j500M990Q2M708M512j0366j0469j755R765o551K099J4057R912m647m677
$$ plain form
4107 11485 7463 11601 10522 -3312 4694 9519 2793 448 1167 11495 18880 15181 18752 16779
4093 16779 10319 4946 3848 -2236 4322 -1318 -3499 6879 18700 19762 15810 9269 47 5897
4079 5897 11727 12002 5946 1454 -4854 -6667 2663 5509 5837 6897 6234 8722 5322 -6748 -9006
4064 -9006 -1052 9419 7351 6716 11579 21106 16978 15725 11719 11554 8914 252 -15145 -15682 -17259
4049 -17259 -6930 -3411 -5831 2005 5488 -3861 -10529 -354 7433 7919 16991 8588 8463 7242 7384
4034 7384 -3315 -13008 -10334 -5902 -4945 -4671 -12698 -19055 -30291 -30598 -15016 -1882 10652 10237 2153
4019 2153 620 79 -10288 -11189 -10307 -3693 -1202 -3155 -2355 4404 13607 3528 -1259 -2721 4127
4004 4127 4073 3029 237 -2567 8636 16514 11473 8034 6810 19497 20482 14104 4412 99 -4625
$$ packed form
4107A1485m022M138j079j3834Q006M825o726k345P19J0328P385l699L571j973
4093A6779o460n373j098o084O558n640k181J0378J1821J062l952o541r222N850
4079E897N830K75o056m492o308j813R330K846L28J060o63K488l400j2070k258
4064i006P954J0471k068o35M863R527m128j253m006j65k640q662j5397n37j577
4049a7259J0329L519k420P836L483r349o668J0175P787M86R072q403j25j221J42
4034G384j0699r693K674M432R57K74q027o357j1236l07J5582J3134J2534m15q084
4019B153j533n41j0367r01Q82O614K491j953Q00O759R203j0079m787j462O848
4004D127n4j044k792k804J1203P878n041l439j224J2687R85o378r692m313m724
$$ plain form
3989 -4625 -10438 -12957 -4948 -4504 -4714 -2999 -479 5188 6232 5261 7708 20409 27125 18140 11135
3974 11135 9804 6162 2729 -233 5270 4158 4951 14196 15861 11137 13164 7112 739 2907 5580
3959 5580 4806 10195 17662 13931 12458 11211 14017 7902 9722 11786 6437 3625 -3024 -7590 163
3944 163 11054 18958 15000 6914 9390 6205 12576 11209 10330 3954 3620 5004 12085 7062 1939
3929 1939 106 -3620 -13996 -4279 8103 9937 12166 2438 1604 8655 10704 14107 13707 12801 11049
3914 11049 -1656 -5647 -14409 -13199 -4496 10767 18341 13328 11872 4154 -8504 345 3627 2744
3900 2744 -3203 -9398 -7397 -11054 -14484 -897 11615 9264 12644 17483 18986 14402 12273 9350
3886 9350 9898 8696 32 -943 -1150 -638 1437 15394 14534 7031 19042 13479 15082 12754 17226 7711
$$ packed form
3989d625n813k519Q009M44k10J715K520N667J044r71K447J2701O716q985p005
3974A1135j331l642l433k962N503j112P93R245J665m724K027o052o373K168K673
3959E580p74N389P467l731j473j247K806o115J820K064n349k812o649m566P753
3944A63J0891P904l958q086K476l185O371j367q79o376l34J384P081n023n123
3929A939j833l726j0376R717J2382J834K229r728q34P051K049L403m00r06j752
3914A1049j2705l991q762J210Q703J5263P574n013j456p718j2658Q849L282q83
3900B744n947o195K001l657l430J3587J2512k351L380M839J503m584k129k923
3886I350N48j202q664r75k07N12K075J3957q60p503J2011n563J603k328M472r515
$$ plain form
3870 7711 -5258 -2501 -1327 5241 10213 16854 19452 12938 10681 3599 -8595 -10564 -9332 -14926
3856 -14926 -23989 -12225 -3127 -6255 -13015 -8406 -9143 -11120 -9860 -4098 3241 10171 16099 10582 3591
3841 3591 -1484 6339 -2067 -8595 -18389 -9617 1946 5525 10596 8695 11496 19096 12313 14099 11152
3826 11152 6910 1206 -14108 -17798 -2704 9252 18491 20881 12732 -3994 -13866 -12903 -6256 -5128
3812 -5128 -6967 -6054 340 -5162 -12175 -11957 -8606 -6168 -7379 -4773 1317 -5561 -6891 -3574 -9712
3797 -9712 2007 4123 2580 -579 1009 -2725 -6700 -1902 1493 743 9247 7093 8477 5570 3184
3782 3184 -1633 -7377 -10159 -18012 -16441 -8098 -2437 -7778 -7433 688 11747 12831 13311 15341 4066
3767 4066 -1704 -923 7773 10539 13298 17948 16612 15709 15692 25111 25448 17388 10793 9967 11448 9322
$$ packed form
3870G711j2969K757J174O568M972O641K598o514k257p082j2194j969J232n594
3856a4926r063J1764R098l128o760M609p37j977J260N762P339O930N928n517o991
3841C591n075P823q406o528r794Q772J1563L579N071j901K801P600o783J786k947
3826A1152m242n704j5314l690J5094J1956R239K390q149j6726r872R63O647J128
3812e128j839R13O394n502p013K18L351K438j211K606O090o878j330L317o138
3797i712J1719K116j543l159J588l734l975M798L395p50Q504k154J384k907k386
3782C184m817n744k782p853J571Q343N661n341L45Q121J1059J084M80K030j1275
3767D066n770P81Q696K766K759M650j336r03j7R419L37q060o595q26J481k126
$$ plain form
3751 9322 14464 7267 -1010 -8254 -3292 5348 5001 1199 6780 14091 8726 -3905 4643 2114 -7359
3736 -7359 -13191 -12895 -1105 -261 -5667 2084 10055 9189 8153 -2940 208 4080 -3775 -7021 -6151
3721 -6151 6517 12647 16340 24900 16556 9399 4883 4357 14189 7971 -910 -7471 -8016 3051 10648
3706 10648 3086 -2919 -1791 5127 1615 -6745 -3371 4671 3250 7407 11330 7895 12194 14320 19477
$$ packed form
3751I322N142p197q277p244M962Q640l47l802N581P311n365j2631Q548k529r473
3736g359n832K96J1790Q44n406P751P971q66j036j1093L148L872p855l246Q70
3721f151J2668O130L693Q560q344p157m516n26R832o218q881o561n45J1067P597
3706A0648p562o005J128O918l512q360L374Q042j421M157L923l435M299K126N157
$$ [...]
##END NTUPLES=NMR SPECTRUM
##END=
