##TITLE=Analysis number 321275
Compound Code km 09269
Project Code adrs
Chemist Name stores
##JCAMPDX= 6.0         $$ Bruker NMR JCAMP-DX V2.0
##DATA TYPE= NMR SPECTRUM
##DATA CLASS= NTUPLES
##ORIGIN= Bruker BioSpin GmbH
##OWNER= nmr
$$ XWIN-NMR		Version 3.5
$$ Wed Aug  2 14:22:42 2006 GMT Daylight Time (UT+1h)  MAYBRIDGE\nmr@NMR_250MHZ
##.OBSERVE FREQUENCY= 250.131544655141
##.OBSERVE NUCLEUS= ^1H
##.ACQUISITION MODE= SIMULTANEOUS (DQD)
##.ACQUISITION SCHEME= undefined
##.AVERAGES= 16
##.DIGITISER RES= 18
##SPECTROMETER/DATA SYSTEM= dpx250
##.PULSE SEQUENCE= zg30
##.SOLVENT NAME= CDCl3
##.SHIFT REFERENCE= (INTERNAL, CDCl3, 0, 16.522)
##AUDIT TRAIL= $$ (NUMBER, WHEN, WHO, WHERE, WHAT)
$$ ##TITLE= Audit trail, XWIN-NMR		Version 3.5
$$ ##JCAMPDX= 5.01
$$ ##ORIGIN= Bruker BioSpin GmbH
$$ ##OWNER= nmr
$$ C:\u/data/dgb/nmr/ADRS/70/pdata/1/auditp.txt
$$ ##AUDIT TRAIL=  $$ (NUMBER, WHEN, WHO, WHERE, WHAT)
(   1,<2006-08-02 14:22:22.38 +100>,<MAYBRIDGE\nmr>,<NMR_250MHZ>,
      <created by zg, POWCHK disabled, PULCHK disabled
       configuration hash MD5:
       E2 DF 36 D8 04 B2 41 60 5A D7 A3 38 5A 4B D0 FE
       data hash MD5: 64K
       A6 23 6A 11 2C 9F EA 38 FD 45 5C BB B4 17 62 33>)
(   2,<2006-08-02 14:22:33.50 +100>,<MAYBRIDGE\nmr>,<NMR_250MHZ>,
      <Start of raw data processing
       ef LB = 0.3 FT_mod = 6 PKNL = 1 SI = 32K 
       data hash MD5: 32K
       71 F4 93 A1 D3 EF A5 7F F1 16 9F 18 C8 5C 96 EE>)
(   3,<2006-08-02 14:22:35.63 +100>,<MAYBRIDGE\nmr>,<NMR_250MHZ>,
      <apk 
       data hash MD5: 32K
       AF 72 4B FB 17 6F 45 A8 03 D8 FD 13 AD B0 07 59>)
(   4,<2006-08-02 14:22:36.46 +100>,<MAYBRIDGE\nmr>,<NMR_250MHZ>,
      <abs ABSG = 5 
       data hash MD5: 32K
       6E 3F 63 2B 1A 90 A6 65 7D AB EC 92 38 11 35 61>)
$$ ##END=
$$ 
$$ hash MD5
$$ DB 58 00 83 64 13 98 62 34 11 2F FA C5 52 8A 3A
##$RELAX= 
##$RELAX= 
##$RELAX= 
##$RELAX= 
##$RELAX= 
##$RELAX= 
##$RELAX= 
$$ Bruker specific parameters
$$ --------------------------
##$DU= <C:\u>
##$EXPNO= 70
##$NAME= <ADRS>
##$PROCNO= 1
##$TYPE= <nmr>
##$USER= <dgb>
##$AMP= (0..31)
100 100 100 100 100 100 100 100 100 100 100 100 100 100 100 100 100 100 
100 100 100 100 100 100 100 100 100 100 100 100 100 100 
##$AQSEQ= 0
##$AQ_mod= 3
##$AUNM= <au_zg>
##$AUTOPOS= <18 >
##$BF1= 250.13
##$BF2= 250.13
##$BF3= 250.13
##$BF4= 250.13
##$BF5= 500.13
##$BF6= 500.13
##$BF7= 500.13
##$BF8= 500.13
##$BYTORDA= 1
##$CFDGTYP= 0
##$CFRGTYP= 5
##$CHEMSTR= <none>
##$CNST= (0..31)
1 1 145 1 1 1 1 1 1 1 1 1 1 1 1 1 1 1 1 1 1 1 1 1 1 1 1 1 1 1 1 1 
##$CPDPRG= <>
##$CPDPRG1= <>
##$CPDPRG2= <>
##$CPDPRG3= <>
##$CPDPRG4= <mlev>
##$CPDPRG5= <mlev>
##$CPDPRG6= <mlev>
##$CPDPRG7= <mlev>
##$CPDPRG8= <mlev>
##$CPDPRGB= <>
##$CPDPRGT= <>
##$D= (0..31)
0 1 0 0 0 0 0 0 0 0.06 0 0 0 0 0 0 0.0002 0 0 0 0 0 0 0 0 0 0 0 0 0 0 
0 
##$DATE= 1154524941
##$DBL= (0..7)
120 120 120 120 120 120 120 120 
##$DBP= (0..7)
150 150 150 150 150 150 150 150 
##$DBP07= 0
##$DBPNAM0= <>
##$DBPNAM1= <>
##$DBPNAM2= <>
##$DBPNAM3= <>
$$ [...]
##$SUBNAM7= <"">
##$SUBNAM8= <"">
##$SUBNAM9= <"">
##$SW= 20.6930455092707
##$SWIBOX= (0..15)
0 0 3 0 0 0 0 0 0 0 0 0 0 0 0 0 
##$SW_h= 5175.983436853
##$TD= 65536
##$TD0= 1
##$TE= 295.16
##$TE2= 300
##$TE3= 300
##$TEG= 300
##$TL= (0..7)
0 120 120 120 120 120 120 120 
##$TP= (0..7)
150 150 150 150 150 150 150 150 
##$TP07= 0
##$TPNAME0= <>
##$TPNAME1= <>
##$TPNAME2= <>
##$TPNAME3= <>
##$TPNAME4= <>
##$TPNAME5= <>
##$TPNAME6= <>
##$TPNAME7= <>
##$TPOAL= (0..7)
0.5 0.5 0.5 0.5 0.5 0.5 0.5 0.5 
##$TPOFFS= (0..7)
0 0 0 0 0 0 0 0 
##$TUNHIN= 0
##$TUNHOUT= 0
##$TUNXOUT= 0
##$USERA1= <user>
##$USERA2= <user>
##$USERA3= <user>
##$USERA4= <user>
##$USERA5= <user>
##$V9= 5
##$VALIST= <valist>
##$VCLIST= <CCCCCCCCCCCCCCC>
##$VD= 0
##$VDLIST= <DDDDDDDDDDDDDDD>
##$VPLIST= <PPPPPPPPPPPPPPP>
##$VTLIST= <TTTTTTTTTTTTTTT>
##$WBST= 1024
##$WBSW= 4
##$XGAIN= (0..3)
0 0 0 0 
##$XL= 0
##$YL= 0
##$YMAX_a= 618298
##$YMIN_a= -645181
##$ZGOPTNS= <>
##$ZL1= 120
##$ZL2= 120
##$ZL3= 120
##$ZL4= 120
##$ABSF1= 16.522
##$ABSF2= -4.171173
##$ABSG= 5
##$ABSL= 3
##$ALPHA= 0
##$AQORDER= 0
##$ASSFAC= 0
##$ASSFACI= 0
##$ASSFACX= 0
##$ASSWID= 0
##$AUNMP= <proc_1d>
##$AZFE= 0.1
##$AZFW= 0.1
##$BCFW= 0
##$BC_mod= 0
##$BYTORDP= 0
##$COROFFS= 0
##$CY= 12.5
##$DATMOD= 1
##$DC= 0
##$DFILT= <>
##$DTYPP= 0
##$F1P= 14.0000005364418
##$F2P= -0.99999901652339
##$FCOR= 0.5
##$FTSIZE= 32768
##$FT_mod= 6
##$GAMMA= 0
##$GB= 0
##$INTBC= 1
##$INTSCL= 1
##$ISEN= 128
##$LB= 0.3
##$LEV0= 0
##$LPBIN= 0
##$MAXI= 10000
##$MC2= 0
##$MEAN= 0
##$ME_mod= 0
##$MI= 0
##$NCOEF= 0
##$NC_proc= -5
##$NLEV= 6
##$NOISF1= 0
##$NOISF2= 0
##$NSP= 0
##$NTH_PI= 0
##$NZP= 0
##$OFFSET= 16.522
##$PC= 1
##$PHC0= -6.590975
##$PHC1= -4.999535
##$PH_mod= 1
##$PKNL= yes
##$PPARMOD= 0
##$PSCAL= 4
##$PSIGN= 0
##$REVERSE= no
##$SF= 250.13
##$SI= 32768
##$SIGF1= 0
##$SIGF2= 0
##$SINO= 400
##$SIOLD= 32768
##$SREGLST= <1H.CDCl3>
##$SSB= 0
##$STSI= 32768
##$STSR= 0
##$SW_p= 5175.98343685301
##$SYMM= 0
##$S_DEV= 0
##$TDeff= 65536
##$TDoff= 0
##$TI= <Analysis number 999999
Compound Code 99
Book Reference 9
Project Code 9>
##$TILT= no
##$TM1= 0
##$TM2= 0
##$TOPLEV= 0
##$USERP1= <user>
##$USERP2= <user>
##$USERP3= <user>
##$USERP4= <user>
##$USERP5= <user>
##$WDW= 1
##$XDIM= 32768
##$YMAX_p= 355084076
##$YMIN_p= -93659
$$ End of Bruker specific parameters
$$ ---------------------------------
##NTUPLES= NMR SPECTRUM
##VAR_NAME=  FREQUENCY,     SPECTRUM/REAL,   SPECTRUM/IMAG
##SYMBOL=    X,             R,               I
##VAR_TYPE=  INDEPENDENT,   DEPENDENT,       DEPENDENT
##VAR_FORM=  AFFN,          ASDF,            ASDF
##VAR_DIM=   32768,         32768,           32768
##UNITS=     HZ,            ARBITRARY UNITS, ARBITRARY UNITS
##FACTOR=    0.157963299565203, 1,           1
##FIRST=     4132.6476996994, 0,             0
##LAST=      -1043.33573715361, 0,           0
##MIN=       -1043.33573715361, -93659,      0
##MAX=       4132.6476996994, 355084076,     0
$$ Real data points
##PAGE= N=1
##DATA TABLE= (X++(R..R)), XYDATA
$$ [...]
20279 -10863 -1462 9479 -4092 -6570 11492 16491 9873 17602 31208 15893 -13111 -5245 4089
20266 4089 15356 18389 -3096 -5296 -12091 -14445 -10109 -14187 -19729 -2984 18804 5472 4193
20253 4193 20973 15257 -9503 -19203 -20602 -13615 -31299 -26336 -16054 7261 24195 5098 1173
20240 1173 15745 10861 17765 6848 -16714 -28990 -22494 -28742 -35110 -20369 -14484 -19216 -36582
20227 -36582 -25832 -17113 -754 10865 4990 -11568 -17501 -43643 -31122 -8367 -3810 -6901 -725
20214 -725 -3194 -9569 -22818 -37912 -17248 -7506 -11549 -8480 -7256 427 -8585 -25091 -37750 -40238
20200 -40238 -27666 -29317 -16185 3106 7186 2967 -5672 -18597 -15967 -14256 -2379 1293 -8899
20187 -8899 -5448 11910 19217 13275 12296 20488 8475 5302 2028 -5022 -6101 -1914 -3256 5510
20173 5510 9644 -3605 -1212 3905 -12533 -19871 -20782 -8413 -23007 -38955 -30824 -7258 -10099
20160 -10099 11221 -7277 4167 6541 5575 -223 -19342 -6850 -4535 -6804 1836 -2901 -10947
20147 -10947 -5309 -6479 -26757 -18439 -10552 -26203 -31122 -32762 -31835 -36044 -19427 1108 29436
20134 29436 33813 7058 6117 11309 11123 10813 -3649 -384 10079 -7069 -8514 19 -3849 -4544
20120 -4544 150 -8024 -20035 -23186 -16792 -801 3534 19770 14035 14621 4380 -9233 1296
20107 1296 5758 12771 10490 9114 26413 -350 -9661 -6949 -18521 -11134 -19129 -13190 2743 10057
20093 10057 3755 -21117 -11297 -29148 -37879 -28411 -18415 -14169 -13326 -12516 -12411 -13920 -12915 -12966 -1874
20078 -1874 -14872 -18549 5393 23156 6962 -7838 4782 6427 -4616 -4779 7422 11389 1270
20065 1270 -15688 -22169 -9162 1429 13027 11498 7291 14637 -618 -13732 -14251 -3876 21464
20052 21464 15145 -1059 -5062 13307 7740 11980 9153 17570 18089 12913 2620 14212 32638
20039 32638 44599 22144 -12607 -38266 -25915 -9659 -7046 -26507 -32303 -38516 -36071 -28345 -20001
20026 -20001 -10979 -15517 -31328 -35088 -25279 -8369 -562 9055 13400 13193 -2179 -9761 -9095 -12371
20012 -12371 -20893 -19730 2134 30634 32593 11500 8354 709 -8193 -660 3825 -17162 -16866 -17270
19998 -17270 -22959 3636 492 -13181 -26016 -15485 -15868 -22573 -16161 -18162 -29707 -33165 -25516
19985 -25516 -13635 -8919 -9051 -5024 20559 1211 -22237 -21593 -19736 -13127 -15171 -18900 -33675 -36406
19971 -36406 -12839 -14673 -9160 -6845 -10874 -5442 2493 -2005 17190 21744 14391 33683 50160
19958 50160 35018 15126 8856 5569 21304 30384 13039 759 -15229 -21849 -13415 4179 21763
19945 21763 10507 -18473 -13413 10729 10491 6612 -516 -3126 -4291 -3242 -7917 -8119 -8098 745 13149
19930 13149 42010 52038 32023 16744 8422 -1911 -19225 -3276 19632 24761 22034 28966
19918 28966 26923 6590 -1455 12888 11084 14670 21963 26850 -2711 -12403 -18362 -43949 -40778
19905 -40778 -22342 -16087 -9446 3147 4419 22863 32957 32423 32280 10766 11596 21685 9227
19892 9227 -18911 -21510 -10351 6284 10541 20265 28248 12065 28126 31425 15920 -12882 -4297
19879 -4297 3935 3850 -1294 -5194 634 -4438 -7399 -22620 -18598 -1053 11629 5978 658 11184
19865 11184 9740 7501 15677 545 -495 -7678 -10926 -19850 -33113 -27870 -22838 -11925 -7869 -20949
19851 -20949 -23115 -14516 -15332 -13987 -30118 -24058 -14980 -19576 -33327 -33411 -21312 -21844 -19919 -7166
19837 -7166 -11533 3536 6225 2390 913 -1068 -4845 -21727 -30785 -27679 -21559 -626 -4340 10877
19823 10877 20395 4939 14279 15881 24115 15473 8804 5310 10050 4221 5688 2631 -16691 -22526
19809 -22526 -28781 -19949 -19112 -23472 -17011 -20596 -22454 -20315 -21135 -36657 -46839 -42174 -57968 -75965
19795 -75965 -64122 -33407 -27720 -29174 -4548 14502 9016 -7194 -7761 -12896 -24012 -13683 -8481
19782 -8481 738 10921 -175 -5706 -11114 -10179 5551 -13309 -34392 -48850 -40200 -30802 -19558
19769 -19558 -6808 -14127 -2043 6771 714 -14459 -15259 -13986 -21065 -17965 -16250 -10945 7542 22172
19755 22172 15462 21375 6775 -226 10321 19209 1186 -8173 -11648 -2636 14392 1917 3289
19742 3289 142 1262 -5976 -17737 -27136 -3550 5221 17471 17688 5065 -5924 -14364 -14571 2910
19728 2910 2601 -4104 1337 -3505 -20691 -28587 -15983 -31460 -46249 -23830 -19658 -28053 -13914
19715 -13914 -18483 -22840 -17975 9513 7927 -19014 -14154 -5463 -945 -10531 -17854 -8540 -7464 2324
19701 2324 14574 11255 4878 -7404 -14321 -12176 470 -12821 -33772 -37466 -50254 -59875 -17208
19688 -17208 3972 4 4609 17319 5351 -4584 -1519 4467 4916 9320 20521 37958 27603
19675 27603 9538 10410 -1446 -8524 -8758 -12638 -27585 -32614 -34438 -1785 13374 1519 -17206
19662 -17206 -23127 -2414 13125 13303 -7719 -757 17579 6193 15771 14550 20803 25513 18797
19649 18797 490 6136 13546 19094 24098 12609 -5866 -26383 -29565 -24563 -24820 -18018 929
19636 929 -19751 602 16136 18858 14918 4258 -6272 -13671 -19565 -23661 -16884 1 23726
19623 23726 26103 3372 2135 -314 19025 11566 224 -11933 -14149 -18793 -30049 -10978 15487
19610 15487 16480 -4814 -16658 -17129 -20628 5458 2521 -2783 3463 -25348 -29810 3750 1723 -12452
19596 -12452 -28679 -28390 -6434 4448 -352 -12584 -27117 -25156 -12068 -4003 3897 13218 656
19583 656 -17202 -20653 -22235 -3066 659 -13349 -16045 -8178 -18919 -18619 -3189 -9621 -9926 -18977
19569 -18977 -23648 -7517 13424 17637 6791 19653 22913 21293 11602 1370 -12552 -24651 -8629
19556 -8629 13834 25922 32745 35700 15609 21178 36626 38527 41197 32156 11267 21780 14365
19543 14365 -3853 -2374 -7433 -18779 -15772 -8916 -10939 -9771 313 -3458 -2209 -10407 -6421 -6052
19529 -6052 3267 16427 26136 30291 16194 13416 27767 25430 17118 16916 17 -8110 23813 36798
19515 36798 29595 23551 35822 30618 15588 45594 54443 51861 63512 58672 67994 96523 109423
19502 109423 99876 115854 123942 130590 128781 127374 147350 141102 156312 165445 161752 144713 130392
19489 130392 136536 154878 155892 138286 127491 128439 125114 110344 107139 109052 122346 119087 109593
19476 109593 91634 94686 88789 88945 85643 84160 61573 51337 49638 52283 40143 23503 21222
19463 21222 32738 37926 28278 6524 3259 5164 -4599 754 19831 24862 31070 26218 26832 27902
19449 27902 24225 27314 31128 27394 39916 30684 24504 26703 1503 5351 14041 21086 7580 6706
19435 6706 8804 9085 13476 8539 4707 6875 2662 12729 22236 1941 -11218 -19249 -23908 -27137
19421 -27137 -15681 2979 1160 -4514 4326 12381 14376 19047 -4551 -18084 -11354 -9622 -12026
19408 -12026 -11979 -12691 126 -6650 -23676 -12407 -7081 -19851 3859 10766 -16929 -20599 -23935 -29284
19394 -29284 -25230 -13990 -16830 -18138 -10603 -12706 -20381 -15477 -26325 -41212 -36377 -19180 -5504
19381 -5504 -1249 -13506 -16426 -21686 -22182 -29556 -19126 -8819 -5584 -12297 -31633 -39734 -22721 -29782
19367 -29782 -42415 -45601 -34229 -14020 -8964 3529 16715 16078 16395 32093 46594 47623 61031
19354 61031 64695 64351 43436 39342 40470 28815 38999 38368 21792 36572 65965 50233 53180
19341 53180 72824 69440 63172 61833 73904 71543 43317 28570 26967 27815 46544 74506 77586
19328 77586 95928 101195 108274 107756 92834 81493 61771 54991 58604 32649 -3925 -8206 -15363
19315 -15363 -4888 4143 4979 13136 2653 1647 4464 9515 14744 8892 14692 22434 15094 29018
19301 29018 34632 24570 28001 30298 20320 28625 16948 -5015 -5349 -2177 -3186 -1005 -4181 -1267
19287 -1267 5208 2867 4390 3379 13272 27478 40351 46587 45822 43497 49650 43688 43792 36718 10747
19272 10747 15168 21514 39779 35625 20113 20973 27375 26534 50769 66459 72057 63678 44372 39708
19258 39708 47554 44453 38719 54414 50549 41189 46275 45943 30898 10111 7129 18911 40275
19245 40275 44016 49530 55349 63468 75025 89503 82276 72094 62560 58935 50001 48982 47113 42169
19231 42169 31017 30050 40589 38547 24280 11187 9172 6905 -1866 -24431 -18324 -5351 -27
19218 -27 -4673 2115 37800 47410 47582 41661 35328 26824 21759 9300 -3703 -11706 -10954 -21247 -5057
19203 -5057 -10280 -11013 -10404 18702 29466 24932 14073 9655 -2703 -10721 7743 9319 9426 19590
19189 19590 33279 16828 -2715 -367 -4661 -13648 -10680 -10924 -9588 -12189 -8774 5815 9685 -2925
19175 -2925 -6132 -9045 -4455 2601 13914 1421 -5459 -8186 -5980 -9905 2767 18397 26292 31761
19161 31761 13278 9 -20912 -17337 -19304 -15577 -12782 -6259 -18598 -28270 -4837 -2235 8437
19148 8437 -13791 -42228 -47734 -49229 -29128 -30540 -45124 -34797 -18362 -25395 -18280 -13647 -10576
19135 -10576 8731 9726 7601 -825 -14989 -10216 -9083 -28648 -23642 8695 33230 34891 28357
19122 28357 15888 15466 35259 12223 -5769 -11199 -19099 -8340 4740 16619 -8 -6963 -15113
19109 -15113 -16470 -6411 -5158 -9920 -8072 -13770 -15740 -16057 -17564 -19795 -23345 -26718 -29097 -33296
19095 -33296 -36171 -27292 -24282 -12566 -8592 -4454 4537 6108 -1343 -18361 -24272 -20028 -3076 21133
19081 21133 -2489 -10067 -15399 -19704 -8320 -2997 -22118 -35935 -40721 -24328 -21060 -35212 -30298
19068 -30298 -5275 -3191 -11549 -22760 -34406 -43407 -47374 -35455 -28428 -28629 -34556 -13166 -14970
19055 -14970 -23807 -24556 -25614 -25514 -17994 -10933 -15163 -462 4986 26765 44525 16817 -30521 -44554
19041 -44554 -23033 -710 -915 -16220 1778 4919 -9737 88 7157 5873 -5639 -17096 -15079
19028 -15079 -7993 7400 2192 -181 4537 -1553 -8562 -23509 -29486 -34563 -33010 -9924 -8902 -1477
19014 -1477 -11472 -4040 -4530 134 -7544 534 -10889 -21629 -17358 -15448 2067 20890 12871 10595
19000 10595 15240 20215 35655 37925 21676 16780 31290 34746 12605 -2899 -16543 3583 1142
18987 1142 208 -19951 -5727 -2384 -14325 -1668 -613 -7811 -1357 12401 21651 -4180 -1670
18974 -1670 9144 13512 16018 6789 1232 2798 7870 12384 40315 42704 24293 9098 9731 8145
18960 8145 17711 27233 31638 24394 11295 398 -6370 -5159 -4859 3888 -8329 -13228 5067 11911
18946 11911 20610 35807 41847 38225 38739 24924 25484 27282 17205 24298 27626 35972 38902 35324
18932 35324 35471 25537 12122 292 8180 22928 31431 33491 14214 1045 15261 19257 31966
18919 31966 35100 18840 12998 2989 1928 6198 19878 28995 14918 -1610 -15285 -19020 -66
18906 -66 21986 30242 26943 29700 29313 32944 36965 30367 22239 42836 44866 46327 40818 46791 50231
18891 50231 24806 35618 39076 19819 11308 7722 16542 16838 -6402 -6300 311 -4858 -3431 1345
18877 1345 3247 9075 14680 13231 4652 -8923 13544 52758 63956 62401 53177 40285 24358
18864 24358 2933 7226 15298 -2973 -842 11992 17306 20746 -50 -21642 -14211 12273 10535
18851 10535 14685 4706 3141 7065 14193 5705 -14567 -5151 2619 1694 14246 6498 171 11205
18837 11205 27834 21537 933 -1967 -14931 -18311 10632 29910 34362 38063 44283 47703 43109
18824 43109 36499 22135 29315 24699 19269 18124 32719 25131 14201 16487 13346 11529 23735
18811 23735 16772 2542 -9693 -24221 -13590 985 16403 20986 24921 16704 4316 854 17311
18798 17311 30624 35951 32587 40549 57347 39143 18012 -9326 -11195 5863 15754 2620 -14257
18785 -14257 -16549 -4635 14126 36537 46385 30046 19729 20916 35745 24267 14644 14149 17579
18772 17579 1410 -14991 -33845 -23226 8362 34604 54529 63543 57104 71239 67670 62536
18760 62536 83249 94816 77662 45287 23991 8988 23725 36822 44679 58196 52668 50596
18748 50596 41049 57183 56568 59228 51163 48312 38981 40252 37148 41375 63940 54435 46955 28804
18734 28804 33507 33055 24863 43861 42787 26818 21539 26439 26254 20184 27563 27815 28701 11291 22449
18719 22449 33560 38941 46997 43060 15480 2215 -196 5848 14328 24261 19656 24800 26936 18225
18705 18225 27621 25597 19974 21924 47030 60267 59510 51105 45496 54848 61480 49531 41955 36587
18691 36587 52093 54223 38853 36724 46746 39712 38475 40996 35272 33431 50945 37334 38988
18678 38988 18948 20307 28689 10680 2223 6105 1621 3698 -7212 -6681 16609 19714 14192 96
18664 96 15059 30692 27367 33190 38521 45197 50820 49920 37869 28194 13306 22079 9257 -13635
18650 -13635 -148 21479 22797 3137 -7309 -4797 -4090 14487 32933 53876 64670 51252
18638 51252 36258 31810 38339 36081 39327 36319 24665 10410 12486 30609 30995 33646 41232 41497
18624 41497 44842 56149 54235 67796 54967 37906 49288 52109 29032 27699 32495 15576 -9706
18611 -9706 -6214 8340 17748 1924 -18994 -33245 -46926 -27616 6566 11247 24646 16806 20186
18598 20186 10904 -4784 15 13276 26620 24679 8600 -10197 151 23870 31871 39236 37096
18585 37096 40105 18145 7573 -2594 13645 13248 4201 -9734 -15312 -9969 -5694 19178 37943
18572 37943 22837 -5179 -7510 13598 18770 20177 9464 -3289 7292 20385 7349 8391
18560 8391 18810 23892 10262 6226 7853 -2725 -6041 -2353 -13220 84 -1543 847 -234
18547 -234 -1930 -2777 -11911 -30617 -31962 -14099 -23437 -24944 -16006 1487 1654 541 -24417 -33367
18533 -33367 -24278 -14286 -17162 -10807 -12007 -12895 -9842 -4366 -7624 -24636 -41041 -39383 -33271 -21490
18519 -21490 -2668 -16001 -27114 -9481 -12058 -6715 -4496 -4109 605 -6058 -17805 1892 27339
18506 27339 39258 25456 2139 -4183 5198 12324 14400 2242 7182 4473 -10350 -17166 4381
18493 4381 18458 12874 9499 -2886 -1518 4070 22650 25565 5555 -2443 5197 12196 7510 -14481
18479 -14481 -30892 -21973 -34088 -31245 -22317 -7028 7688 18181 27925 41880 24371 14437 17734
18466 17734 29924 13875 -11472 -23016 -23600 -12540 -641 -2024 4843 -3492 -14282 -20684 -21220
18453 -21220 -16925 -15483 -5366 -8582 -13772 -9477 -16473 1819 25102 11389 -1955 -9315 -7390
18440 -7390 1662 -772 -11444 -7920 -5896 -6076 -14736 -3129 5554 10908 -8220 -13397 -14493 -20087
18426 -20087 -19456 -17274 -14047 -6722 -15678 -25650 -28077 -21516 -13315 -7402 -10990 -19396 -28246 -34966 -24392
18411 -24392 -16465 -12123 -16741 -7526 9607 -12142 -28868 -35818 -5261 18873 16704 13666 -2461
18398 -2461 -17698 -8265 -12249 -13025 -11292 -27130 -22089 -5767 7548 18426 19974 16175 -3398
18385 -3398 2878 4605 9902 19549 1618 -81 9396 21369 15436 -4832 -25517 -31139 -39009 -9576
18371 -9576 5768 5097 10133 9992 6897 -4279 -15346 -29068 -19216 2150 15329 -3396 -14884
18358 -14884 -24603 -19476 9799 13068 6372 -3695 1256 -4802 -11742 -26277 -41695 -41742 -25263 -10639
18344 -10639 -4612 13673 21908 27419 30584 23904 14711 7606 -10595 -18560 -16786 2564 4823 -19236
18330 -19236 -20193 5740 23502 19358 14566 12463 8231 16308 14065 -1983 438 -4934 -7055 -10091
18316 -10091 -31874 -54607 -60507 -55687 -55513 -46007 -39944 -29043 -28979 -10127 -16036 -20888 -7667 344
18302 344 -11743 -24157 -20400 -18373 -13509 -2504 -7955 12458 19567 -8503 -19930 -28857 -29761 -36174
18288 -36174 -50438 -42440 -16120 -21000 -37148 -34277 -17592 3756 -9274 -29991 -28793 -13935
18276 -13935 4921 4016 -3709 -5086 -13782 -29859 -26597 -32885 -33986 -49236 -51862 -46947 -39737 -33994
18262 -33994 -33025 -54657 -49675 -34893 -17213 -19905 -14745 -27671 -28586 -45775 -47853 -34707 -14496
18249 -14496 -10935 -11894 -7248 -4570 -7526 -5566 5489 7415 2203 -4336 15797 5161 891 15565
18235 15565 22426 7505 8570 26590 40821 46458 34833 8567 4944 16957 17165 18604 22929
18222 22929 24968 17721 20521 52485 95789 136037 165453 196737 222196 244426 277979 321792
18210 321792 345010 344038 315695 290315 304217 329166 352599 353350 340719 344130 373078 430382
18198 430382 455550 469769 471788 492796 575797 710252 834337 875854 873916 934443 1064142
18187 1064142 1212347 1288648 1255279 1156906 1123326 1176082 1288878 1350231 1277168 1169253 1124214
18176 1124214 1189210 1301263 1357566 1294508 1134366 997628 924047 883398 803369 666290
18166 666290 537301 443128 373122 334975 317875 304247 297989 286191 272152 237053 215600
18155 215600 190605 190201 193740 196120 178778 152568 162521 177702 164303 151486 161506 164469 173694
18142 173694 181043 176279 172687 184970 188918 191936 206826 213237 200347 192588 212004 238212 234072
18129 234072 239835 238418 247400 266731 292429 323574 336064 366566 421501 473367 530533 576922
18117 576922 649340 783007 969519 1176226 1425058 1742875 2247508 3055385 4447099 7031160
18107 7031160 11162171 14962010 16023438 15595309 15011919 14845836 15291069 16071270 15166240
18098 15166240 11055077 7224293 5075331 3905357 3185275 2697818 2358215 2121132 1937262
18089 1937262 1798827 1705269 1601335 1512650 1425330 1348161 1294145 1242499 1182896 1131143 1080024
18078 1080024 1028942 964865 910481 876933 844722 838935 822284 792338 762886 723628 701177
18067 701177 664624 624667 566006 540003 538274 542337 525485 514707 519739 522083 495586 472215
18055 472215 449958 441064 441217 432976 409147 382077 371987 354532 340262 325752 322325 306939
18043 306939 274040 266140 290242 282256 266047 270000 257471 244014 243848 241284 234269 217018 203899
18030 203899 207458 218445 223465 215386 211175 198885 201341 205203 226332 248253 214585 184567 163443
18017 163443 137843 126544 141388 141233 125097 125913 133220 120399 118242 133402 134038 131828 133278
18004 133278 132457 139975 128701 126867 113844 98873 133786 147955 115063 105307 102941 116753 136047
17991 136047 112395 93289 97582 89544 67822 77445 69955 58573 66108 65344 93019 87684 61276
17978 61276 50913 57192 52048 63099 66364 61074 56023 62412 58336 69139 61862 47341 46626 55631
17964 55631 78634 73999 56639 36422 35714 43051 20155 12983 30901 23781 20461 38136 47499
17951 47499 42228 42886 62435 62597 68785 69137 69971 59899 54833 66379 70491 38471 35442 58484
17937 58484 58028 49212 46010 46814 41354 20936 41432 55894 44020 43819 27304 18619 33243 39944
17923 39944 32622 31828 35530 30059 32039 42264 35701 36959 32872 20499 12912 36588 51676 45879
17909 45879 19565 22070 48351 41791 10509 -10358 11291 31565 33370 34415 42214 37936 33485
17896 33485 43070 42091 19147 26433 27371 31769 43211 41981 33733 31173 18589 32088 47773 62068
17882 62068 55518 33299 43178 48376 42479 19737 15282 7172 3695 6226 20048 20084 5154 3372
17868 3372 -12479 -5019 9626 16296 12007 9920 7341 21059 14155 8757 -1529 1899 12836
17855 12836 19554 22010 30353 45751 44141 28041 34794 47210 56708 56304 40967 20252 8242
17842 8242 10909 6863 12123 -1419 5768 12387 14169 14599 5982 3372 -11541 5271 15917 -3282
17828 -3282 8605 24416 27807 30879 28005 29066 37844 31653 34208 13931 22208 23000 21030 30964
17814 30964 27330 4467 -1929 24107 50355 54540 41283 27845 25017 22462 12196 10348 4122
17801 4122 -13350 -16695 -11002 10700 16413 7658 26080 33367 20900 11722 3685 8432 -3146
17788 -3146 6676 32327 33333 32731 22428 5513 -6510 3187 2619 -16782 -25449 -31807 -13838 9111
17774 9111 7717 6156 9443 -4960 -21579 -10400 -3659 3670 3573 -16639 -18836 -17113 -12341 -16905
17760 -16905 -12322 -248 5651 14975 24013 14831 -700 -1855 21147 36868 29994 -3231 -19185
17747 -19185 -7208 -17725 -17562 -7536 8933 21661 8074 10467 19755 11936 -4070 20323 28397
17734 28397 34329 36908 47558 38143 41980 58285 61933 46112 47772 60634 60238 63691 65304 71371
17720 71371 57425 24443 11356 2260 5040 30308 27391 -2030 -34591 -29979 -16171 -21158 -19481
17707 -19481 -7023 1318 441 8459 -8750 -12488 -12850 1121 -1457 -1021 60 -4781 10818 28988
17693 28988 33617 35191 13337 9675 17895 34926 35506 10643 7353 21493 36086 42390 49759
17680 49759 59830 66416 79677 71554 78114 82446 78623 56307 53269 30516 31538 30814 34740 8044
17666 8044 -16903 -26576 -21701 -18390 1166 7296 9150 10678 19399 17969 11629 -6232 1298 -11216
17652 -11216 -15172 7067 25524 18893 1372 -1493 17558 36365 50236 61311 59015 47051
17640 47051 43341 61912 76103 49999 49067 71234 72386 61022 59273 72928 53215 33254 28451
17627 28451 21396 27385 12581 1810 10157 18861 14955 13394 13682 11224 20267 11231 6212 884
17613 884 6980 -10269 -45964 -41728 -33296 -34504 -37398 -32059 -10710 7574 -1340 1481 337 -3672
17599 -3672 7711 15018 24813 7859 7502 9427 14358 22147 21007 12911 20439 34381 36903 39041
17585 39041 37924 34182 17838 -6645 -22352 -24253 -13678 6692 22927 14759 5184 -1416 -8239
17572 -8239 -1684 -13041 -29235 -22877 -18440 -20354 -16358 10645 11709 -11662 -5430 -1160 -17031
17559 -17031 -35463 -39085 -45035 -41561 -38042 -22713 10739 29413 20055 14569 14450 11169 27800
17546 27800 48323 55695 35317 12446 22379 26098 13229 7014 11119 4776 4506 7934 8558 8990
17532 8990 5310 13555 16311 16468 4546 12402 18009 23523 26456 17143 14470 2965 16691 18405
17518 18405 14267 19061 4520 2198 -9399 -18578 -10198 -4491 -2238 -11754 -17806 -9024 -19241 -21666
17504 -21666 -21555 -12126 -8589 -12313 -20687 -29806 -29630 -26735 -21664 -22328 -29716 -9814 -213 -17409 -42708
17489 -42708 -40684 -19898 -33497 -19721 14827 19717 3932 17302 23266 -2335 -19924 -23778
17477 -23778 -17479 -10079 -16132 -21650 -37143 -47217 -53596 -39395 -18832 -6994 -17241 -27122 -28474
17464 -28474 -9491 2876 9468 24649 30613 19838 7342 8494 40253 28399 14693 -12193
17452 -12193 -8883 -6834 1255 4489 8334 22739 20408 12538 8463 12607 5091 3440 33250 85251
17438 85251 112344 123641 100479 62999 70457 76737 75405 86566 71769 69802 68040 63683 30881
17425 30881 18030 23829 26738 29788 17352 -3166 -17243 -18487 -14802 -5379 17239 25380 16689
17412 16689 9996 6873 15329 17366 3239 -13936 -15280 -15606 -4391 2561 -4066 -12148 -4936 20133
17398 20133 14980 22166 9745 -9884 -10608 -14284 -6649 3255 7358 8073 7717 6646 15985 18904 14405
17383 14405 -7359 -23786 -36275 -3901 -15954 -28340 -23799 -21166 -24692 -27065 -25767 -15427 -9595
17370 -9595 -1075 -6656 -6445 -1554 8024 -11137 -38271 -31129 -30944 -35429 -30726 -34502 -12398 16300
17356 16300 32083 34357 15838 -3748 -22018 -10783 13530 11748 26249 54384 53565 36544
17344 36544 28880 26306 26798 10399 -16719 -38468 -5208 16706 14450 12672 6538 5946 17531
17331 17531 26292 5881 -15805 -12927 16997 17840 984 15238 22197 1502 4050 8194 9742
17318 9742 23674 21425 -6140 3320 23172 29846 21959 37157 17785 -14209 -12554 -24689 -31415
17305 -31415 -19260 -8492 -3886 -21985 -35460 -20476 -2081 -17064 -29344 -35680 -40829 -29440
17293 -29440 -16318 -10918 -1965 1997 197 400 8721 28404 28572 32732 10669 12358 16526 16415
17279 16415 10103 2250 3016 6139 -4860 -13967 2136 16012 13803 21551 15365 23635 31353 18725
17265 18725 20640 23079 15637 -2608 -11748 -13080 6197 34030 38490 33242 14007 4660 1832
17252 1832 18700 9975 -7783 -5656 14928 41925 29758 5269 7514 18251 10963 -5015 -3455
17239 -3455 -19977 -25251 -10840 -14122 -15580 -17006 -16280 -9839 -9777 -5155 -9442 -14621 -13864 -3202 4218
17224 4218 -8012 -18395 -16021 -7386 -10188 -13386 -13580 -31899 -36418 -16753 -1102 7645 6208 -9279
17210 -9279 994 9138 18605 17075 24468 17900 15720 22111 2223 -7437 -2923 17928 19659 -10091
17196 -10091 -29553 -14000 -12346 -19501 -13711 3843 823 2085 8007 -4564 -7426 -2541 1527
17183 1527 -6891 8679 10291 20328 2532 -37675 -41751 -15489 -9661 -16475 -5355 7187 1544
17170 1544 -6321 5296 -4438 -15622 -32833 -31617 -28508 -22550 -14750 -23160 -26862 -963 10343
17157 10343 8709 2497 2970 18873 23051 8435 -90 3322 3363 9474 17420 12289 11444 6077 -6706
17142 -6706 -16106 -19529 -20743 -23551 -23455 -41195 -29197 -9080 -12559 -25497 -36069 -23952 -13074
17129 -13074 -8344 -14445 -28689 -10304 -12645 -23612 -15486 164 8122 8933 819 -1063 -25577
17116 -25577 -37460 -22341 -7766 2628 -2726 -3095 -9187 -22171 -20442 -27780 -35768 -49071 -41724
17103 -41724 -3762 6470 17261 -2998 -27446 -43393 -22421 -4199 1775 -3654 -3435 -13205 7253
17090 7253 3239 -5087 -3706 -6592 -13725 -12448 -12647 -10055 -3721 -17955 -17741 -10599 -29418 -26698 -12244
17075 -12244 -2887 -7889 -22844 -28013 -29942 -18268 -6916 -875 -6511 3844 15047 3828 6473
17062 6473 8088 12672 7417 -14666 -16424 2950 3173 207 4284 1827 -22697 -36542 -46918 -40486
17048 -40486 -23110 2187 15289 23478 22574 10171 -10366 -18285 991 3130 -13104 -19821 -20629
17035 -20629 -13299 -13240 -9237 -18630 -12769 -14191 -24062 -43007 -25486 -12729 -15448 -26022 -14770 -1693
17021 -1693 -2068 -28068 -31094 -19727 -14640 18049 37407 22408 -8606 -8742 24189 22750 1054
17008 1054 -3901 4351 5120 19293 12481 8306 7460 18845 22461 -3296 -10399 -13986 -21259 -16535
16994 -16535 1505 -6786 -15663 -259 1919 -8516 -14606 -5323 14884 -2337 -9753 -21559 -6582
16981 -6582 4939 12119 10710 2461 -10802 -22762 -2648 15663 27042 13636 7716 -14455 -2814
16968 -2814 8646 27536 40416 31333 30447 22810 -2000 -5082 9527 13766 691 -11579 -13115
16955 -13115 401 30705 43365 39201 21935 -2591 4345 12309 18209 13337 16416 10939 10014
16942 10014 14262 21416 -4154 -29661 -32036 -26872 -23236 -8875 -22120 -19219 -20295 -23717 -21830
16929 -21830 -9532 -7994 -4293 4498 11249 5820 9691 11265 1613 -3981 -7016 -12123 -11087 -11616
16915 -11616 2619 17641 -873 -3005 -10865 -8145 -25024 -35465 -30623 -32657 -24474 -4975 -20902
16902 -20902 -24924 3725 9812 18658 -3988 -7168 -6673 -5397 -14021 -9621 14356 23612 24123 12843
16888 12843 -5257 8059 6121 -2573 -18457 -20160 -19964 -9832 3612 5559 -22789 -42294 -43143
16875 -43143 -49413 -61241 -50202 -29208 -27146 -38150 -26816 -17308 -17199 2061 5684 -3023 7921
16862 7921 19667 29800 9815 -4990 -25334 -15335 -8893 -20391 -12964 -8373 -1382 6210 12905
16849 12905 2799 -3853 -18549 -11356 -18908 -10295 585 -12320 -28000 -32483 -24722 -28197 -19950
16836 -19950 -809 6277 31 2814 2365 -2213 -9035 -34723 -41024 -29529 -24241 5658 25696
16823 25696 36726 24658 7425 -4485 -17867 -8234 9988 1052 11635 15125 -8022 -16000
16811 -16000 -14223 -21430 -26733 -25821 -27529 -33713 -58506 -65045 -55423 -32100 -36756 -56956 -42267 -20721
16797 -20721 -14801 -10115 -19331 -2810 -1830 -26483 -21891 -17826 -18906 990 -10021 -31551 -9731
16784 -9731 24020 38930 7258 -15944 -27926 -30183 -22697 -19340 -30309 -23163 -10037 -857 12603
16771 12603 8629 -5177 -24511 -41298 -47641 -44585 -39704 -31831 -25825 -26556 -28890 -25007 -16379 -20684
16757 -20684 -21526 -32259 -40796 -32807 -27005 -13328 3183 9964 1776 2039 -6660 -20574 -8722 -3494
16743 -3494 -3760 -5096 -25213 -33632 -42452 -37313 -27984 -28790 -20402 -20794 -27366 -41192 -34338 -18764 -9171
16728 -9171 -8637 -22850 -38947 -48704 -65641 -74244 -72747 -68455 -61625 -28886 -18527 -25880 -18505 -9077
16714 -9077 -4313 -20688 -20072 -12529 -1437 -36 -16799 -26994 -41503 -40385 -35024 -19909 -5498
16701 -5498 -9743 -30083 -54309 -47620 -23389 -15938 -27346 -25249 -17494 -1170 5103 3127 -10644
16688 -10644 -12295 5776 3449 5453 -1770 5079 31191 24278 25348 18615 32189 27303 -867
16675 -867 -24624 -22263 -10530 -19021 -27036 -26653 -7383 14062 15956 24818 6667 -36794 -28570 7430
16661 7430 10585 -12963 -34339 -27695 -9144 -8507 -23657 -41815 -44606 -31756 -22279 -619 15736
16648 15736 3113 -27457 -18798 -19629 -40954 -25762 -20031 -14340 -6298 -7692 -3929 -11270 -1506 -16944
16634 -16944 -28990 -15836 -16752 -23600 -21878 -15619 -33538 -41936 -70032 -67376 -35986 -29111 -19319
16621 -19319 -19855 -6650 -30735 -25175 -16228 -27398 -19037 -17327 -2392 -14550 -34102 -49881 -46560
16608 -46560 -23283 2006 1722 -64 -14470 -5525 236 -11514 -7995 -3332 -6134 2099 5070 -314
16594 -314 -19679 -38889 -35992 -37140 -42256 -33612 -27455 -33958 -32333 -44309 -38684 -40850 -37918 -22411
16580 -22411 -8733 -7290 -18285 -19907 -24736 -17546 -999 -6446 5117 27450 23937 -1234 -1537
16567 -1537 532 -1652 -12750 7076 24175 11925 19024 29411 46620 78062 89292 113258
16555 113258 115437 131328 156399 153827 141967 145802 162258 162229 173751 198712 222253 272870 303957
16542 303957 351153 433750 521931 618529 672216 723548 760278 781102 783495 785202 773434 738340
16530 738340 708586 704528 727851 766094 794050 829788 862322 898231 939798 988909 1051231 1070467
16518 1070467 1058742 1034208 990816 933128 910578 883009 858561 811239 766921 748970 745636
16507 745636 756018 777786 794984 807423 788598 763605 751367 714256 641193 538029 439355
16496 439355 354913 279392 239751 201478 199656 209627 204023 179384 179393 188158 187513 178902 153014 123379
16482 123379 130534 141622 140939 120160 98202 75195 88463 102909 93818 75248 82965 77243 81427
16469 81427 81020 73875 72414 56278 57704 67726 54736 51621 44872 50294 43567 13470 4648 16726
16455 16726 43371 32193 32664 29859 33653 51951 54211 46494 41465 16870 11452 35617 36165 9842
16441 9842 20702 22809 32271 40010 53247 33296 31188 45059 39139 24986 12696 27988 57345
16428 57345 73608 61893 59628 76057 83349 74116 67588 45792 41839 41253 34667 31943 20598
16415 20598 6948 29623 23500 1860 8883 35229 54819 51474 50675 62770 75762 76106 64710
16402 64710 59950 43369 33759 12902 7227 21088 35417 46386 48461 56185 77621 101698 100634
16389 100634 97306 113614 140078 173476 207098 228469 229596 257539 270363 295031 300060 290728
16377 290728 274469 275905 257772 234759 219127 218188 220597 205884 185884 188047 191728 207875 214901
16364 214901 231979 281085 324013 354812 357956 355942 344367 334127 340279 334058 346470 353579
16352 353579 386492 447832 521018 610803 720475 803984 867842 955047 1019702 1084954 1145752
16341 1145752 1148444 1102127 1047605 978374 905676 842714 773491 703687 662296 658454 657073 646283
16329 646283 656413 690332 748502 786405 828967 856813 892618 934330 952462 957929 891475 830561
16317 830561 790032 727172 639196 553985 481965 428805 375979 319870 258719 215474 196712
16306 196712 185900 179536 188038 173332 149540 134506 117634 100491 98703 107856 112828 109892 96238
16293 96238 75546 73713 51361 57831 68405 79196 60478 60987 57883 55057 42613 39837 36761
16280 36761 32266 49470 69494 86929 71565 46157 40506 46122 47942 23756 16499 10867 13914
16267 13914 -1057 5044 37324 47244 44122 34404 25585 12770 -4094 21792 34010 43986 45090
16254 45090 54451 61136 42974 27802 19457 38338 35587 22670 16915 22355 39510 33206 32138
16241 32138 30199 17919 15966 15275 1497 -7991 -4822 -14650 -24333 -17345 -11349 -25726 -38364 -31663
16227 -31663 -20001 -2394 4530 7543 13244 27893 16872 15775 5907 1045 7967 5750 11569
16214 11569 14457 19795 20414 -8970 -8788 -13686 -16228 -24740 -27347 -39601 -21385 -35683 -35138 -17787
16200 -17787 -13274 -11249 -3986 3522 -15963 -25452 -19015 -19491 -26960 -32106 -22923 -29444 -28870 -7937
16186 -7937 -26502 -40829 -36346 -38814 -28513 -22041 -12810 -2482 12590 15403 22040 20684 10406
16173 10406 3643 18261 1070 -10423 1693 -10832 6710 -1603 -7010 1655 9070 19414 16049
16160 16049 3555 9132 27315 11227 273 17011 17486 6324 365 -5212 -3976 12230 17130
16147 17130 34841 48763 49421 22780 4746 -7649 12970 29069 36747 30306 15346 16001 21568
16134 21568 31979 23809 31414 48065 72424 87234 82982 95998 123316 149395 183461 220266
16122 220266 245394 264627 252174 252104 245195 235612 219855 208869 192866 169696 133667 143809
16110 143809 170035 182463 198111 227234 253656 269970 291407 314125 323243 325591 298939 283213
16098 283213 280480 234615 197271 184238 162117 136690 126668 108862 93426 71601 55725 31492
16086 31492 29701 51550 66955 78797 63023 51767 46177 30284 18640 19976 32362 25176
16074 25176 34803 47760 21335 -3287 -3201 -4370 -2619 10675 9874 -10066 -21621 -16114 -41611
16061 -41611 -24742 -8656 4783 9907 8057 8832 13649 1938 -8472 -11044 -13797 -9770 -1993
16048 -1993 -17846 -25786 -9250 -9205 -18535 413 16303 -1254 -19361 -8822 -2712 301 18215
16035 18215 22649 -739 -31849 -27351 2404 10860 7817 28565 12940 -12175 -15935 -6863 -11999
16022 -11999 6707 -3730 1323 -6397 -16313 -13882 -13679 16 7257 15555 25 1855 -1828 -16216
16008 -16216 -26656 -43514 -46033 -39705 -30040 -32416 -33836 -15786 -19712 -18558 -14555 -3013 16921
15995 16921 14185 13020 15210 9343 15388 8132 -6348 -8602 -6301 -9668 -6117 -28950 -35626 -32452
15981 -32452 -26009 -10165 -1107 13857 5987 -5365 -16412 -11664 -21754 -19407 -1167 12550 12963
15968 12963 15995 12397 3838 -6637 -23428 -14338 -8552 -6117 -8128 4828 3074 -4711 -11644 -25328
15954 -25328 -46483 -38076 -36816 -38008 -22422 3227 3486 -21898 -23119 -5277 -19173 -13825 -6132
15941 -6132 -29950 -56793 -34048 -1681 -17596 -24645 -40464 -36464 -31235 -24161 -12843 -2084 -12402
15928 -12402 -19273 -19011 -9874 -3415 -8650 1347 -9442 -13952 -9038 -13627 -12903 -14830 -9021 -1387 -19249
15913 -19249 -29654 -8668 -8431 -8131 720 -9135 -13601 -13003 -24067 -23085 -23351 -10085 -2612 -10153 -7392
15898 -7392 6008 16093 17847 11667 4246 -12054 -23893 -37546 -20488 -10639 6081 3162 -13326
15885 -13326 -22594 -13646 -6343 -15118 -17130 -13115 -34432 -46825 -40000 -36793 -35821 -38994 -50969 -47206
15871 -47206 -35946 -30674 -23888 -31244 -27079 -26980 -29714 -19905 -8426 -7924 -24472 -17879 -21649 -25956
15857 -25956 -34455 -20569 3646 -1631 2532 32776 42635 46316 43858 29009 50061 60675 68281
15844 68281 89208 126000 146125 154957 168005 196794 211942 202773 201088 191201 212990 238275
15832 238275 245500 227443 206853 185095 202115 200535 198858 185259 173186 180907 195526 206050
15820 206050 229329 231554 221695 223912 220421 229232 233587 222237 191487 180155 189235 175143 163907
15807 163907 141537 113462 114733 117211 107462 93960 75452 60196 39843 18813 13672 15789
15795 15789 20234 10397 7858 7896 20890 19909 8462 -3543 -21878 -18833 -4625 4236 11796 -1743
15781 -1743 4252 15791 2280 -13667 -25945 -7114 1230 441 -6703 1568 -11998 -15499 -14418
15768 -14418 -7708 -18333 -21708 -7605 -3231 -22299 -40719 -43657 -22186 7442 8584 -13205 -21252
15755 -21252 -12920 1092 21621 21786 9856 4739 3737 -5565 -6444 -8339 -19189 -32574 -35211 -49957
15741 -49957 -47638 -38405 -16575 8736 -1409 -20731 -22379 -17488 -24312 -34210 -43615 -41565 -25643
15728 -25643 -7568 -1813 -11859 -20378 124 26594 41755 33861 12092 -11423 -20405 -22435 -13571
15715 -13571 -21381 -16833 -14914 -17113 -18206 -17328 -30686 -29837 -28346 -21289 3143 -20799 -31102 -504
15701 -504 2959 -10397 -21022 -29542 -51925 -60008 -54067 -42075 -31116 -32305 -29253 -20142 -23414 -23801
15687 -23801 -31626 -37610 -36870 -28863 -34441 -41148 -31170 -29251 -30137 -46382 -42710 -41482 -25518 -24696 -53333
15672 -53333 -56086 -52652 -42511 -45321 -48198 -58354 -69093 -78072 -70935 -63268 -58230 -31455 -23966
15659 -23966 -32301 -45591 -44069 -40706 -40107 -35970 -30832 -20897 -28609 -42808 -25686 -18552 -15180 -7783
15645 -7783 -19455 -3794 9600 -443 -8928 -145 -4962 -8160 -21754 -21961 -10331 -10574 -4692 -2237
15631 -2237 -10726 -25591 -34393 -29542 -18473 -13400 -18735 -19157 1580 6179 2176 -9734 -6904 807
15617 807 -6660 21 -4171 -14295 -23375 -21553 -25864 -25061 -26706 -34162 -27475 -22979 -24144 -27491 -27804
15602 -27804 -34935 -43790 -18150 -9870 -38949 -49926 -36688 -29730 -19625 -20504 -23952 -20665 -13179
15589 -13179 -10653 -9925 -15105 -13899 -12936 -4876 -5225 -8371 -13590 -33374 -42456 -52555 -53129 -43020 -49049
15574 -49049 -46140 -18745 6238 8104 4538 1787 -7595 -16041 -29823 -51132 -36887 -24362 -18967
15561 -18967 -5549 -4128 -29165 -49126 -70859 -66118 -36976 -34593 -24287 -29113 -40965 -60643
15549 -60643 -58636 -44909 -44145 -56784 -61492 -54924 -42133 -56103 -56793 -53470 -52192 -42110 -17240
15536 -17240 6458 -3495 -4438 -2834 4498 10067 609 -8639 -413 -3570 -23111 -20581 -26354 -25037
15522 -25037 -21589 -28757 -43192 -24726 -19047 -2048 -13339 -33608 -53277 -65229 -54686 -43204
15510 -43204 -42447 -39460 -29293 -34795 -49691 -44949 -35907 -24298 -15635 -6733 -7718 -8504 -10608 -12901
15496 -12901 -6785 -1391 17250 16929 2411 -6845 -8284 -23859 -23584 -14673 -20102 -17555 -32386 -39809
15482 -39809 -43338 -58426 -59402 -30731 -5172 -22858 -23689 7595 14055 -6360 -25423 -20051 -14518
15469 -14518 -12243 -7133 -5125 -5567 -16266 -14722 3982 8943 5586 -2354 -13479 -24474 -17808 -36384
15455 -36384 -53558 -49963 -24531 -19541 -9053 -9642 -7048 -2381 -4213 -5320 -8561 -25541 -22255 -16635
15441 -16635 -7658 -11573 2309 7935 -8117 -28302 -35789 -29925 -33150 -34547 -40379 -48547 -21301
15428 -21301 -23467 -36284 -31763 -18314 -7221 -11512 -2655 -4745 -31571 -33753 -34639 -33166 -21388
15415 -21388 -26841 -41730 -65100 -55790 -50127 -44444 -14371 2720 2618 1272 19088 13727 20129
15402 20129 9336 -2711 -508 -17133 -12643 -16086 4237 -16342 -22618 -22570 -28737 -26748 -21498 -15850
15388 -15850 -8715 -9130 -722 -12356 -23614 -16950 3721 -4737 -9454 -6412 -19691 -23384 -21875 -20608
15374 -20608 -22523 -37519 -38376 -36223 -37194 -46828 -55257 -43776 -23151 -31419 -54131 -55063 -51988 -42143
15360 -42143 -20187 -30397 -49939 -42253 -18722 -17313 -11274 -1553 44 -3065 -999 -12297 -32770
15347 -32770 -30042 -21764 -38473 -47658 -48704 -48123 -30135 -6887 -18999 -21657 -18394 -15944 -21484 -15488
15333 -15488 -23926 -5845 10225 6636 15501 22825 20634 7642 -3916 -12723 -31991 -41644 -16754
15320 -16754 1305 -13718 -16303 -19826 -14262 -21644 -23299 -2554 13732 2479 4661 -8837 -24921
15307 -24921 -32661 -24612 -5225 8747 -12721 -37091 -29967 -32277 -36335 -30120 -24155 1130 6027
15294 6027 8253 22328 3193 -11677 -17844 -13310 -7768 -6182 -16548 -35034 -42364 -46118 -25879
15281 -25879 -31646 -22831 7002 -5855 -5875 -955 -7646 -3746 -383 -10274 8027 9036 -775 1647
15267 1647 3462 -7018 11835 14198 1716 -4019 4785 12682 15261 20101 9796 -11565 -1819
15254 -1819 7629 -5164 -1539 24849 14517 15484 16069 21215 17826 25819 25326 18600 4765 8913
15240 8913 2617 29350 37994 33203 34449 32870 27303 13415 7820 -6721 -3726 19838 29623 34717
15226 34717 28881 32755 24425 27025 42343 43716 31760 21930 11044 11023 35946 43149 56288 42089
15212 42089 31373 24514 11657 -453 -7469 14444 35771 45299 27653 15449 19003 10246 21379
15199 21379 23773 1979 -12825 -31082 -26345 -2550 9 2277 13709 7666 -4987 -15031 -12390
15186 -12390 -11509 3132 6194 22475 25927 16431 26786 30314 25474 14105 -22432 -30394 -18290
15173 -18290 -21394 -24731 -1285 18931 7476 -8409 -25805 -23072 -20311 4282 17253 -3347
15161 -3347 -29419 -15874 22135 31184 33774 20847 -1529 -19600 -25066 -30469 -15965 16694 26681
15148 26681 18917 11203 -1703 -3679 -10352 -18107 -27100 -11662 6679 13408 18416 26263 9728
15135 9728 25012 24881 -10726 -12205 11564 17456 -1775 8306 22344 30241 14083 -2452 -22676
15122 -22676 -38792 -51741 -58151 -50914 -27374 -25324 -31380 -13368 -3085 -8014 3696 4648 -67
15109 -67 10765 21816 10650 13501 -6425 -3117 -21021 -31432 -34869 -14202 -8403 -11365 4948
15096 4948 19271 -4451 -10166 -5567 -10928 -20808 -36399 -28853 -38281 -22160 -22560 -11108 -4599 -22501
15082 -22501 -26763 -13581 -5236 5261 -11604 -21778 -23324 -30752 -27704 -12417 11535 22255 26602
15069 26602 15153 24884 36090 7848 -26187 -41226 -41568 -49929 -66940 -73040 -51552 -37173 -11595
15056 -11595 -2296 2981 -14519 -9049 5325 -6701 -11667 -7969 -10707 -9407 -16478 734 13935
15043 13935 3208 -3254 -7539 4584 -3392 -19203 -31918 -31658 -28869 -22655 -31517 -18479 -11729
15030 -11729 -12141 -10884 -11010 -11971 -8946 -2323 16071 20447 7118 -1875 13728 9474 -2734 -3752
15016 -3752 -15350 -31427 -54050 -63818 -62793 -61665 -54447 -49573 -46819 -43654 -29573 -11796 -12371 3370
15002 3370 9289 16257 -2969 -23145 -27122 -17325 -9918 -29435 -32775 -38432 -50656 -56205 -53777 -37545
14988 -37545 -53060 -55826 -53815 -50502 -33736 -57232 -45104 -28925 -40509 -40542 -49790 -62090 -39023
14975 -39023 -32566 -44613 -34447 -16227 -25997 -32009 -31138 -25828 -17016 -23645 -30110 -3969 17400
14962 17400 13068 7808 3443 -16592 -29832 -28216 -40379 -30374 -14773 3293 7077 181 -13896
14949 -13896 -8756 3907 11220 3366 -2411 -14825 -35030 -28562 -17823 -27975 -33695 -42680 -22551
14936 -22551 3496 14097 3435 -18527 -21210 -24423 -41154 -47114 -39724 -35709 -27258 -25949 -32248
14923 -32248 -32279 -43872 -52771 -35072 -23407 -23041 -23417 4080 9925 14902 13845 16325 24216 40870
14909 40870 38951 37617 31856 15418 6356 -1162 11348 19601 15855 22821 37218 40499 39234 29373
14895 29373 25768 17401 -1030 -4515 -14392 -15275 2299 344 -3794 8586 12009 21734 16351 10765
14881 10765 16946 16884 20816 28474 8693 -13148 -12792 2553 7951 -5136 -20863 -8090 23277
14868 23277 33893 18404 8858 -7629 -29574 -35847 -12531 -1220 -355 -14451 -6397 -5948 -21758
14855 -21758 -22859 -20761 -18996 907 12564 5095 1978 -2953 13429 15665 16596 15997 32598 24250
14841 24250 13477 4920 15525 2989 -13510 -16888 -31587 -27400 -22434 -20655 -26462 -30252 -22080
14828 -22080 -23663 -24848 -21762 -14901 -22435 -32352 -23042 -23065 -20452 9584 14786 -16171 -40843 -30985
14814 -30985 -27031 -14343 415 1055 -15411 -44118 -41678 -33364 -28608 -16150 -34533 -55745 -55192
14801 -55192 -40347 -38580 -14048 6176 3985 -3886 -1858 -4381 2076 -6340 -33917 -34783 -45330
14788 -45330 -41292 -17426 -12618 -6665 -22002 -20675 -11045 -18395 -16247 -25501 -26306 -593 -1257 512
14774 512 11472 15671 18364 1637 -18308 -21654 -4753 5311 10370 480 -5295 -4471 -21526 -27860
14760 -27860 -27643 -27919 -20517 -6561 971 -6275 4844 6546 -23959 -16763 12943 17706 26703 5240
14746 5240 -11147 3868 21368 26289 26671 23494 8973 8413 -6352 -2745 -7148 -7608 962 13800
14732 13800 21314 13226 4842 2905 12206 7456 -1292 5000 18278 16264 29937 30697 11342 4033
14718 4033 -4777 816 15704 14479 3098 2317 -3407 -2297 1115 996 16775 7447 8327 -11714
14704 -11714 -16027 -6742 -5806 5311 30377 43730 42378 34558 19905 8840 -10506 -31571 -36281
14691 -36281 -30584 -14517 -8405 -10461 -4763 -5064 -15510 -26434 -26398 -22793 -6924 -937 2062 -5325
14677 -5325 -8526 2335 794 -244 12514 28591 28520 -6034 -19922 -25267 -44265 -55295 -32362
14664 -32362 -9755 -8067 -22962 -49302 -51955 -32529 -33143 -34134 -42233 -59647 -58729 -51693 -38447 -28550
14650 -28550 -22627 -34680 -51140 -64729 -50365 -26022 -22982 -30161 -29925 -40009 -35263 -39935 -43274
14637 -43274 -31861 -30162 -36168 -57829 -64437 -56291 -50594 -41434 -50192 -44440 -16706 -407 -8959
14624 -8959 -15949 -31190 -42966 -43155 -59291 -50747 -30777 -20811 -10744 14183 20976 6527 -18016
14611 -18016 -17826 -21752 -24089 2681 -11155 -44429 -52969 -43462 -35708 -26987 -23644 -21872 -17159 -15206
14597 -15206 -11382 -9779 -12122 -13406 -10373 -5392 -17939 -32847 -43155 -59539 -53697 -30806 -21336
14584 -21336 -18051 -36052 -48094 -29871 -13918 -18745 -38689 -46268 -62539 -63117 -57649 -37244 -9774
14571 -9774 -9623 -10890 -20679 -34703 -34447 -13116 -18427 -26901 -22000 -9284 -14384 -45565 -72512 -68070
14557 -68070 -48724 -27645 -23182 -16850 -17837 -35545 -39570 -30181 -40845 -48667 -39937 -12923 1404
14544 1404 -2987 -4737 -14189 -44702 -45974 -40181 -21015 -14317 -25714 -23223 -21270 -8305 -18159 -19311
14530 -19311 10513 4370 -25288 -30033 -34739 -17044 -16761 -28548 -23319 -4891 11467 3562 9086
14517 9086 -836 -24645 -11130 -29324 -37987 -29361 -19573 -18044 -8482 -16396 -27308 -24743 -24039 -24811
14503 -24811 -21616 -25040 -30169 -20117 -14141 -17228 -34851 -38619 -27454 -33053 -35691 -49175 -58086
14490 -58086 -64509 -53041 -28135 -26993 -29237 -14871 -17843 -30377 -37223 -41394 -35120 -19506 -31047
14477 -31047 -51304 -58296 -47506 -50013 -51200 -32786 -15430 -21550 -11897 -5921 -1163 -21778 -19513
14464 -19513 -26956 -43359 -49503 -33432 -30752 -36963 -12422 -13707 -39673 -39819 -40398 -33280 -15195 -31125
14450 -31125 -46287 -36880 -40878 -39656 -52001 -39417 -15887 5791 -12484 -21486 -27797 -27788 -33165 2333
14436 2333 9876 12018 -8037 -25628 -30840 -21032 -12776 -24843 -18923 -12524 -12590 -6312 -17012 -23023
14422 -23023 -27454 -37463 -41728 -42926 -36237 -15812 -14606 -29189 -35841 -36861 -41379 -45129 -23356
14409 -23356 -2944 4660 11455 4072 -14915 -36191 -37181 -25832 -10132 -9925 -25577 -21516 -22343 -26935
14395 -26935 -28696 -25507 -28786 -28558 -45074 -65779 -46656 -33295 -34103 -36158 -58061 -89634 -93659
14382 -93659 -81518 -77811 -68021 -33879 -23823 -27585 -26398 -37907 -37349 -48302 -42271 -22066 -7293
14369 -7293 -10049 -8118 -12842 -18892 -31665 -49383 -50689 -50671 -44889 -49278 -42505 -37527 -34667 -25465 -21855
14354 -21855 -22128 -17470 -25387 -34434 -14184 2180 -2797 -3064 -9771 -30954 -41131 -38079 -32870 -25897
14340 -25897 -25731 -49421 -66548 -62319 -71323 -71790 -65725 -62296 -68729 -80889 -49213 -36197 -31185 -12072
14326 -12072 -2597 -7732 960 1629 -13340 -16953 -17139 -22979 -38874 -29507 -22400 -37237 -30360 -24289
14312 -24289 -22136 -35800 -31874 -28938 -19125 -22607 -25197 -18026 -10007 -11213 -41217 -56794 -29809
14299 -29809 -21970 -23295 -20781 -18624 -29829 -40444 -45172 -53837 -45774 -40166 -43089 -52223 -54877 -50112
14285 -50112 -39588 -41041 -36334 -32646 -41340 -35963 -42730 -48394 -45474 -31373 -3364 -8004 -22636
14272 -22636 -8558 -3088 -17411 -18335 -37169 -67419 -82082 -61866 -55705 -41599 -35248 -24913 -30529
14259 -30529 -33488 -33448 -51490 -62018 -28588 -9715 -21943 -40795 -32844 -10648 -22047 -53322 -59006
14246 -59006 -61848 -76850 -66592 -56290 -47896 -29660 -24423 -39341 -38485 -34505 -23523 -30903 -42086
14233 -42086 -40915 -31258 -48540 -55519 -33903 -14013 -12346 -26044 -30271 -25577 -30880 -52273 -61917
14220 -61917 -60987 -59102 -37158 -32427 -19803 -11596 -10518 -8623 -14338 -4500 208 9409 4846 -13000
14206 -13000 -23725 -16110 -26144 -27137 -9686 -9759 -15976 -31781 -42738 -20014 -11006 -1250 5610 -73
14192 -73 -11042 -32218 -38101 -49441 -50497 -38311 -20127 -15091 -21249 -29563 -50350 -65085 -49582
14179 -49582 -47483 -64608 -60533 -43681 -37415 -28566 -39646 -48637 -36884 -43399 -48391 -43702 -53367
14166 -53367 -29175 -7058 -27356 -39215 -39137 -39132 -33748 -22600 -6147 6163 -3098 -31849 -50092
14153 -50092 -60640 -46151 -41492 -33993 -27189 -26614 -33415 -24560 -30755 -19100 -12917 -14107 5169 1579
14139 1579 -28865 -39165 -24231 2208 -5582 -12336 -19426 -35439 -39049 -25680 -12004 -12710 -22928
14126 -22928 -7257 -11562 -20778 -13313 -24202 -30260 -25458 -14771 -15162 -23845 -41232 -50334 -43384 -27776
14112 -27776 -8008 -29589 -38420 -28809 -12574 5301 7745 574 -10677 7746 11245 2731 -18813
14099 -18813 -32420 -34098 -29846 -26260 -25663 -17437 -17251 -10099 2616 9846 5858 -6849 -13491 -40551
14085 -40551 -40363 -20795 -10200 -23094 -42909 -46655 -36791 -25956 3431 1238 -10924 10022 -6949
14072 -6949 -22368 -25481 -22436 -24905 -5628 -4573 -11486 9124 31013 43500 25531 12850 4691
14059 4691 -190 12902 -262 -16870 -29168 -44921 -45235 -37320 -26289 -9110 -11841 -16391 -16023
14046 -16023 -11979 -2466 14475 10692 -12569 -20893 -3311 -6133 -14385 -36248 -42139 -29399 -17289
14033 -17289 -19331 -37948 -52138 -52390 -31040 -15005 -24649 -41238 -28066 -14889 -5903 -13927 -12448
14020 -12448 -18086 -32056 -46150 -51131 -48928 -41009 -37241 -23317 -33862 -51826 -55524 -54850 -66176
14007 -66176 -84544 -93337 -74519 -51226 -38654 -36911 -29555 -35319 -50503 -32176 -22777 -36401 -13281
13994 -13281 -2799 -21904 -50804 -49615 -48649 -40160 -39062 -51462 -43929 -20920 -627 -2667 -8621
13981 -8621 -24968 -30568 -40998 -31108 -6251 8613 3549 -25203 -37264 -42103 -33460 -26456 -5298
13968 -5298 -335 -3098 -21716 -25888 -36221 -28632 -37072 -33765 -38459 -51161 -46483 -35460 -47371
13955 -47371 -46824 -29552 -36991 -39699 -32976 -14264 -15844 -22140 -25487 -35536 -31718 -15503 -19053 -34209
13941 -34209 -53367 -54175 -27899 -22391 -41095 -21526 -13634 -15460 -29809 -61949 -63358 -51309 -32287
13928 -32287 -40663 -26244 -19781 -15337 -11723 -15862 1520 24811 10069 -16357 -34130 -31002 -18469
13915 -18469 -24178 -10506 1167 -12123 -29160 -29150 -22141 -16790 -29881 -36972 -24914 -26674 -16980
13902 -16980 -6201 -22786 -18759 -21905 -15607 5023 19471 21638 20670 23323 29011 21820 17625 13140
13888 13140 14886 -757 -7928 -8393 -11029 9922 -7743 -24748 -30541 -36025 -32218 -33555 -11600
13875 -11600 -13602 -13529 -8861 -17219 -20741 -14053 -19744 -16936 -7065 -11682 -19514 -21929 -19659 -21342 -18309
13860 -18309 -15714 -16866 -23484 -29036 -35507 -32018 -11256 10894 16444 12775 -3889 -25583 -34349
13847 -34349 -18501 -12433 -23756 -12464 -19389 -16745 -3922 -21051 -43424 -34788 -19169 -7413
13835 -7413 -5169 -3423 -22414 -22518 -5845 -11097 -30680 -53108 -44866 -21712 -29877 -39756 -26398
13822 -26398 -28469 -34151 -30967 -29350 -33574 -34128 -23486 -16979 -22732 -13975 -7701 -10124 -27143 -40723
13808 -40723 -39882 -42701 -35947 -35250 -41569 -40634 -45731 -50673 -45229 -8383 311 -17724 -28592 -40947
13794 -40947 -50035 -51295 -54947 -31759 -25559 -29642 -25880 -17804 -19231 -18975 -27030 -36816 -35204 -8970
13780 -8970 -15028 -9768 -14436 -14946 841 -18477 -30536 -13746 -10129 -6530 -357 -16890 -21380 -30433
13766 -30433 -42045 -40334 -15419 -3863 -3791 -11352 -7462 -6387 -22470 -32066 -35500 -64117 -50294
13753 -50294 -23949 -5703 -11698 -20283 -20031 -14567 -43858 -51633 -39385 -55158 -53945 -27141 -31562
13740 -31562 -22237 -28191 -37209 -36393 -32334 -28001 -25213 -29829 -20770 -20572 -12932 -17791 -35522 -30404 -24406
13725 -24406 -30757 -46518 -47156 -39055 -19081 4091 -6428 -25981 -41637 -38498 -9217 3377 10166
13712 10166 9144 7070 24442 22219 10899 8447 2961 -15237 -5758 4208 -13272 -34348 -28463
13699 -28463 -36793 -56254 -51889 -65015 -52338 -50060 -37259 -19056 630 -9006 -27752 -44134
13687 -44134 -42342 -28295 -18261 -12707 -9019 -18448 -30628 -44500 -37336 -37508 -35157 -46760 -56580
13674 -56580 -41658 -14466 -19329 -26018 325 16953 4338 -6684 -10906 -29344 -21564 -1398
13662 -1398 1778 2213 -18718 -23598 -25701 -44533 -49588 -36622 -30329 -30312 -19978 -9253 -15217 -37773
13648 -37773 -16707 -19715 -32182 -31343 -13260 -20489 -10498 -3091 7947 -3357 -20107 -31219 -31033
13635 -31033 -18248 -26693 -6315 -9719 -13250 -13980 -14395 -4121 6333 5755 2067 -13984 -25635 -21057
13621 -21057 -7482 -22690 -18851 -15674 -16460 -11292 -5515 -21512 -46576 -70932 -78684 -61920 -45136
13608 -45136 -20324 -8202 -5875 -10243 -3219 6639 3454 439 -4599 -5407 -24386 -23249 9557 -1710
13594 -1710 -14084 -2459 1636 10991 38658 39720 35796 18502 -4971 8256 10185 -1098 5148
13581 5148 17853 1268 -14452 -13126 -10240 -14689 -4929 -615 -9661 -9899 -23785 -15385 -8862 -7329
13567 -7329 15400 12376 37220 31366 19064 2392 19996 42058 39746 35598 47221 67892 51631
13554 51631 45563 29369 24848 14043 12352 6093 -2403 3611 10829 32252 27433 28475 40604
13541 40604 20312 4631 13662 22541 18540 28069 47064 52006 42378 25797 24959 36605 51354
13528 51354 73213 63392 51653 19724 7133 -18819 -25730 -33783 -38015 -26869 -14698 -8419 7570
13515 7570 35781 42679 36814 24848 32241 14015 839 -11903 -12402 -9189 1675 25843 17406
13502 17406 15617 38958 30945 30482 31050 37132 43210 43941 16076 20623 14896 18597 36663 46356
13488 46356 35836 36655 20804 18724 30733 24508 9889 22283 2940 -18263 -17014 -11373 -14936
13475 -14936 -10428 19383 9443 16888 23448 16895 18638 24089 33930 17883 5437 1431 19503
13462 19503 28500 36018 41487 51922 42370 51782 56463 29370 10318 10855 38966 56639 60587
13449 60587 50582 25961 25808 25517 1269 -5575 7684 14385 8441 9627 22831 30051 22037 26316
13435 26316 19305 21214 21389 11108 6242 5162 17363 19698 12653 -4793 -1544 552 -10094 -18047
13421 -18047 -11392 16691 19706 31382 41574 44949 47614 37076 38643 37663 13699 3856 250
13408 250 4784 8495 35731 57661 67800 64433 64163 67529 58079 45499 29243 10514 12400 11796
13394 11796 -999 -2017 5144 4538 4196 18650 28985 40152 48861 55213 82562 75608 45382
13381 45382 25677 21467 20589 20020 20856 31346 39779 30305 44199 45124 41383 35102 16939 1009
13367 1009 5119 11106 21217 48855 73380 77126 83166 95955 92242 77579 72526 79748 68979
13354 68979 65813 50065 40862 48700 63595 74666 66143 76455 82631 85801 109905 130403 146634
13341 146634 168393 147531 115528 105013 122355 143626 125755 98075 86019 90654 94817 100235
13329 100235 88348 89101 90874 105168 128776 155774 154844 149349 179699 183098 177078 186105 198891
13316 198891 208528 208355 195490 195390 173245 173043 182018 200620 207091 203036 219179 233845 247330
13303 247330 265302 296315 317395 344730 360462 363890 379089 361712 348813 350407 337147 317488
13291 317488 311014 293238 265872 274843 261870 234173 232089 245637 256763 242164 235412 249440
13279 249440 292047 324844 342126 367738 385042 393557 394090 375533 352284 337590 317648 311348
13267 311348 294565 295524 283063 292198 294256 289162 308750 322940 346666 354646 362123 372193 377786
13254 377786 394679 421915 430667 416506 390407 354109 317283 307929 302580 270415 234587 224223
13242 224223 232274 237575 237514 235340 258016 300136 300999 329497 368965 393670 409470 411311 421364
13229 421364 426314 408345 387091 376758 369166 362556 348671 311298 257005 201748 183373 173774
13217 173774 171024 175761 171261 178342 200872 220950 241753 239717 227870 226816 230712 216637 207937
13204 207937 196672 192574 169990 158385 167213 167458 145759 145980 159569 149717 137106 138526 141559
13191 141559 141066 166481 198270 219704 230014 231435 253419 244267 235728 222027 222873 225396 210329
13178 210329 187642 151792 140125 125245 127386 139767 118736 110438 115790 122628 120527 120289 112333
13165 112333 114294 126605 131194 112200 108019 100400 98956 95826 94865 91393 110342 119497 139246
13152 139246 148515 134211 147024 136833 114447 117433 123266 144132 142671 128621 138987 153704
13140 153704 172907 172465 166266 166233 176712 176522 196675 209588 238979 262182 299553 306248 295872
13127 295872 306746 307390 316958 296177 279500 253007 229147 207186 192850 181792 181225 187149 205835
13114 205835 199644 216916 231058 203146 191444 227043 236540 220820 219267 233465 217737 204701
13102 204701 206885 220049 225595 229811 228242 206538 195044 209538 226423 263890 285485 361172
13090 361172 396703 424489 460376 479392 504957 516004 527846 543704 551625 554222 542521 528565
13078 528565 546076 560591 581922 580623 587119 598403 599732 593823 563362 514033 455181 413186
13066 413186 380656 361385 358147 356673 345985 332334 323098 319323 338426 346321 342207 345023 331208
13053 331208 339244 357581 374593 389278 414124 435565 455345 492319 508278 536765 569495 585970
13041 585970 579547 581813 628310 681710 740333 774971 817055 876953 886833 890004 894752 874983
13029 874983 846833 789521 724794 654113 597192 558951 523754 511106 488864 461975 460843 470308
13017 470308 479394 498250 480113 455536 453009 452416 447002 462376 450185 420618 399887 423860
13005 423860 417680 411817 407983 414953 427711 444800 466320 508101 561936 595464 641785 681027
12993 681027 709296 717584 713755 721301 732957 755849 768399 721022 669857 636705 602600 584102
12981 584102 557325 510191 505266 505497 493132 499519 512179 532409 566375 587800 594706 610667
12969 610667 615593 616435 625614 622426 628508 631376 646174 667762 692803 732357 781442 844096 887294
12956 887294 921458 938718 940074 958143 992184 1014190 986372 942259 935082 922076 920926 915548
12944 915548 907465 892826 901987 925210 928567 937074 944696 951328 966319 986630 985047 981475 978895
12931 978895 985450 979366 986209 1010306 1028164 1050475 1091910 1128828 1149192 1178912 1235672 1302274
12919 1302274 1368379 1424414 1510482 1593019 1663923 1752669 1847281 1922004 1982560 2029418 2054179
12908 2054179 2066015 2103556 2155109 2197898 2228966 2266278 2370305 2532070 2739689 2999582
12898 2999582 3345051 3789530 4364797 5165345 6285085 7807433 9691418 11736003 13666427
12889 13666427 15318242 16647939 17719517 18499639 18912998 18785380 18047787 16862951 15492574
12880 15492574 14098191 12818347 11752834 10922468 10335296 10048804 10056020 10303362 10797508
12871 10797508 11574285 12730782 14332704 16288728 18348897 20237748 21780225 22951151
12863 22951151 23802851 24418884 24743760 24640215 24095166 23363778 22657887 22152570 21994711
12854 21994711 22228508 22968867 24357257 26444792 28989381 31709387 34597691 37850337
12846 37850337 41641882 45881497 50072867 53337199 55108610 55504920 54992280 53889250
12838 53889250 52238631 49798994 46390605 42374783 38513480 35334144 33055431 31682938
12830 31682938 31127126 31409389 32571128 34500785 36932956 39568142 42407102 45606596
12822 45606596 49227852 53033860 56486162 58850310 59754521 59411545 58261378 56559343
12814 56559343 54304441 51305615 47623761 43794738 40434137 37934675 36487140 36129209
12806 36129209 36938925 39037687 42500617 46982791 51697573 55992027 59748309 63073170
12798 63073170 65938410 68115254 68978452 67821086 64648499 60292195 55514644 50745851
12790 50745851 46138156 41721066 37630094 34233341 31964343 30930157 31067908 32221019
12782 32221019 34434351 37715567 41981115 46820160 51563958 55778241 59317991 62190215
12774 62190215 64354918 65547772 65193117 62907703 59030005 54250504 49148720 44098704
12766 44098704 39194784 34473820 30126023 26456464 23683714 21887118 20936263 20789085
12758 20789085 21477899 22990640 25128616 27523644 29719516 31402244 32379893 32713487
12750 32713487 32542761 31837856 30386870 28137119 25371235 22357334 19440206 17012000
12742 17012000 15266137 14123812 13430492 13063043 13019918 13278887 13879820 14924942 16547737
12733 16547737 18729916 21250470 23768830 25906354 27449187 28304405 28517058 28197629
12725 28197629 27277422 25608278 23258700 20461120 17542210 14823356 12587716 10921936
12717 10921936 9722881 8862238 8206029 7708506 7320220 6987405 6707378 6495842 6306321
12708 6306321 6138042 5966570 5797634 5660421 5530678 5418595 5297655 5186465 5100439 5020258
12698 5020258 4952781 4887252 4809024 4709057 4629358 4578288 4533239 4484645 4437215 4424316 4438916
12687 4438916 4485412 4588246 4719451 4874195 5086217 5385842 5777958 6312841 6989736 7860529
12677 7860529 9159326 11217627 14420783 18949712 24315346 29104042 31981745 33083389
12669 33083389 33284414 33308931 33244978 32439317 29735444 24794750 19306187 15030803 12315048
12660 12315048 10643089 9573933 8877520 8393506 8055652 7834825 7652311 7502425 7401525
12651 7401525 7345877 7337547 7359348 7421629 7568523 7809748 8094668 8437452 8854714 9350866
12641 9350866 9957113 10761209 11842016 13338211 15491428 18802011 23628347 29559027
12633 29559027 35793575 42359015 49484813 56648024 62635486 66797349 68730589 68400120
12625 68400120 67231982 66467934 65906396 65150290 64953720 66129118 68105675 69690333 69985085
12616 69985085 69332966 68776343 68379609 66595488 61895631 54608592 46273803 38908014
12608 38908014 33625319 29990568 27038483 24273123 22015089 20472707 19520741 18984989
12600 18984989 18785066 18912277 19414886 20273363 21351872 22606763 24156881 26363517 29678992
12591 29678992 34251784 39531502 44403602 48226985 51268371 53941572 56669450 60007476
12583 60007476 64171278 69208695 75089696 81658388 88664284 96070575 103450618 109077898
12575 109077898 111875482 111712859 108510057 103042550 96561080 88785392 78170396 65635999
12567 65635999 54477568 46528362 41376467 37989620 35431713 33165784 31343712 30041557
12559 30041557 29019526 28209916 27701327 27596349 27822893 27964460 27442194 26224430 24943777
12550 24943777 23972359 23366366 22946355 22461734 21888057 21567171 21875055 22975656 24846312
12541 24846312 27377895 30770577 35585368 41862363 48478506 53775911 56832265 57775693
12533 57775693 57241760 56210057 54796339 51861410 46436312 39317038 32409319 26729990
12525 26729990 22381461 19342457 17334197 15998074 15055634 14336183 13780240 13308861 12934431
12516 12934431 12664737 12488650 12405712 12439970 12599630 12980941 13613591 14623038 16258041
12507 16258041 18852198 22815421 28347929 35063296 41856227 47631354 51957178 55290356
12499 55290356 58286005 60683792 61257658 59055886 54188708 47810076 41594268 36452280
12491 36452280 32023404 27541484 23275758 19946945 17714785 16208712 15109359 14271659
12483 14271659 13625440 13144703 12797568 12540473 12314949 12133545 12032851 12062964 12244873
12474 12244873 12554194 13036904 13689652 14533808 15655347 17178826 19204354 21955735 25769437
12465 25769437 30973656 37870596 46570141 56935775 68226692 79299488 89533333
12458 89533333 98835102 106867468 112894919 116063827 115977006 113021351 108376702 103024546
12450 103024546 97055494 89884372 81319482 72526318 65277198 59915997 55398355 50776071
12442 50776071 45767157 40801441 36588500 33422162 31052766 29111103 27298838 25542399
12434 25542399 24090735 22973117 21935614 20835164 19964657 19551752 19626874 20173512 21235966
12425 21235966 22794473 24715310 26926957 29665414 33432422 38690673 45521480 53142445
12417 53142445 60087805 65367117 69115473 71841313 73941714 75591642 76402184 75677745
12409 75677745 73562032 71213790 69252140 67851274 67157350 66917632 66367902 64934877
12401 64934877 62565132 59403964 55573582 51135775 46151341 40836473 35606699 31025411
12393 31025411 27433217 24819423 22850094 21318084 20214119 19420880 18740167 18199102
12385 18199102 17842043 17685569 17705671 17693906 17373007 16688442 15958489 15392132 14986291 14728686
12375 14728686 14463803 14171014 14011856 14153972 14690930 15552136 16702311 18253841 20282603
12366 20282603 22768420 25476961 27971695 29875977 31069235 31519909 31259928 30388515
12358 30388515 28928776 26777373 24064943 21147912 18162857 15324932 12993946 11306209
12350 11306209 10134172 9276947 8595924 8015834 7531615 7119213 6734007 6418657 6116390
12341 6116390 5828249 5589924 5388934 5209291 5060550 4938654 4827687 4703685 4570474
12332 4570474 4445534 4320056 4189641 4049715 3908210 3771988 3627701 3500365 3384019
12323 3384019 3261726 3145910 3068118 3024489 3010239 2993053 2980102 2987284 3032564 3073789 3102959
12312 3102959 3117122 3071573 3038848 3002856 2966169 2908480 2814777 2700011 2619421 2518254 2395532
12301 2395532 2349342 2320833 2251380 2185764 2140222 2103204 2093563 2086037 2072616 2049880 2065218 2081639
12289 2081639 2080251 2036732 1988639 1967727 1974140 1987670 2011580 2066050 2132494 2201183 2270374 2333658
12277 2333658 2368027 2383082 2402045 2385579 2322933 2246817 2162605 2070661 1970049 1885522 1820010
12266 1820010 1746178 1676283 1606918 1546391 1493546 1443589 1392162 1342175 1314163 1294308 1263892
12255 1263892 1239069 1211172 1179921 1183775 1181635 1184493 1168963 1151630 1141165 1125855 1136145 1141320
12243 1141320 1140291 1117577 1103514 1084313 1076809 1076234 1074220 1055946 1015640 1006273 1001874 1000631 982209
12230 982209 962450 961598 962988 955305 918918 878591 871898 860325 834609 826636 850518 861744 864448
12217 864448 874871 874540 871038 859362 856115 835244 826046 859833 907522 923324 944251 966925
12205 966925 999956 1031582 1038394 1034372 1021915 1020794 1000138 974445 933235 908809 908390 889687
12193 889687 895813 888289 856172 827509 825339 830972 810186 806480 810095 789344 778094 741980 740038
12180 740038 758726 766606 756098 740590 752445 747476 743106 748098 740286 746290 754561 775658 823624
12167 823624 888590 921792 977541 1033274 1077578 1101220 1100305 1126582 1139760 1151835 1169849 1179201
12155 1179201 1189789 1208578 1199952 1174550 1167494 1160687 1164417 1140500 1109320 1074358 1038836 1025933
12143 1025933 1002934 964267 954937 952401 921480 933778 943541 954448 962494 935882 886792 891325
12131 891325 889536 883124 864010 857741 870299 894663 919367 933569 954122 989508 1009137 1036399
12119 1036399 1071984 1092948 1083194 1100510 1137341 1160762 1209889 1244164 1255767 1263452 1258764 1248223
12107 1248223 1216322 1188387 1158592 1114582 1076164 1045735 1042741 1052477 1032817 1035643 1025088 996912
12095 996912 984064 999344 983411 938061 885973 848738 826667 807499 789800 784552 771236 779885
12083 779885 778689 800740 828079 834289 834357 836247 855921 856409 855934 844637 835900 847299 876221 898214
12069 898214 893395 902313 892847 895944 889611 876213 857871 809939 774699 757641 740766 727934
12057 727934 708028 683367 693409 697157 667222 645071 625219 619857 625760 647715 645533 646580
12045 646580 635341 626920 659219 686378 718176 770946 812551 840073 856959 857476 866401 869467
12033 869467 871828 846492 813222 785261 795432 783848 756913 752786 738092 716974 689380 680333
12021 680333 673765 655928 632089 606951 585986 580372 591195 589123 581913 582652 589146 578745 569035
12008 569035 567584 572504 575239 555955 564602 592661 608441 623069 666307 722349 757754 796255
11996 796255 848245 917621 997533 1029841 1055524 1066032 1053477 1044777 1036583 1021688 997827 955087
11984 955087 886086 832009 781185 750909 734413 743015 719170 705219 712601 693820 668653 644801
11972 644801 608058 591025 566209 552793 544295 524278 509423 503979 484824 500502 511807 525408
11960 525408 546121 559311 592563 635650 671464 682459 713586 752744 772960 815047 824769 830441
11948 830441 842094 822213 809755 799278 773119 750929 770006 781379 772531 756340 757610 745824
11936 745824 734612 737723 723516 682684 656677 651638 635263 603518 589835 601884 583827 558296
11924 558296 554096 562196 542224 544751 562601 567899 557531 550479 561020 573634 549535 518719
11912 518719 532198 526798 516845 515708 536705 543217 538933 546062 552997 565797 556004 545464 539399
11899 539399 528357 522398 538127 555815 568737 586534 580772 595740 597737 610703 629368 646372
11887 646372 637468 618949 592222 590073 571112 546574 537005 527309 506041 481382 441069 411270
11875 411270 410744 422539 434169 432242 420258 437104 460172 493245 525401 548036 550845 561807
11863 561807 565855 556022 569278 561319 531358 479445 439026 426947 427894 423406 436059 451219 426430
11850 426430 415391 425902 435214 434094 449615 464297 464439 447423 435847 450141 463450 453753
11838 453753 442368 428225 421832 416437 409799 399467 382547 387005 413303 451360 466602 464506
11826 464506 431228 417068 421215 412317 392156 374796 365296 359466 355695 372698 378699 373128 375614
11813 375614 397446 414700 410426 420287 419707 426754 439245 464382 449475 442345 441642 449701 434858
11800 434858 426044 426051 413182 380886 372628 379650 379050 366319 362921 367743 385977 394328 393813 409576
11786 409576 410256 403574 394054 397321 399386 423127 461690 467984 467297 462525 455847 457341 459085 441903
11772 441903 429434 430494 422023 414205 417782 429511 439036 448759 460339 465608 443096 423341 422278
11759 422278 419311 419753 413599 413977 411068 395672 397478 412722 417305 426713 447092 452738 456186 444939
11745 444939 424370 425022 441854 444874 443792 433586 424221 407926 401376 396536 415472 435950 446620
11732 446620 445773 437666 420747 415524 417690 414080 417681 404864 398771 415761 428314 427423 430205 446394
11718 446394 451666 447819 445434 458171 453823 451611 431018 414295 416053 415503 409271 401195 405172 407460
11704 407460 398448 406106 410454 409211 414924 432881 442551 442176 431481 441386 440898 436914 424637 410421
11690 410421 419916 424991 410384 412973 445462 445000 455194 472540 500079 541346 562868 597109
11678 597109 645401 728997 818348 937781 1069027 1175685 1249870 1266141 1274416 1276388 1260432
11667 1260432 1203464 1109538 979034 862239 753760 676108 639923 620855 614101 606783 611678
11656 611678 605133 627785 645839 651648 650596 666959 679059 686825 698056 690429 694160 702051 704174
11643 704174 707096 695505 705501 731485 744705 788591 860463 948793 1070525 1220315 1446054
11632 1446054 1724789 2008520 2220975 2345700 2381330 2396699 2402517 2375929 2267754 2032423
11622 2032423 1759074 1512538 1358658 1297015 1311315 1461809 1727775 2028163 2161350 2172140
11612 2172140 2174141 2154474 2171114 2214785 2151975 1875542 1534107 1285850 1135889 1043645 992170
11601 992170 956180 916569 903283 897759 902324 924753 943162 964975 1002393 1046145 1110291 1229703
11589 1229703 1372507 1505102 1581587 1607316 1604747 1577073 1565116 1542861 1454328 1338589 1227046
11578 1227046 1120974 1030456 950507 894237 856745 827781 806450 800096 787676 759406 759234 756430
11566 756430 767059 779744 758654 720220 718447 723269 725999 734493 757510 742863 723980 721802
11554 721802 717744 707534 690036 661868 634756 621067 613865 608016 612492 598163 599561 598331 594957
11541 594957 595031 604801 622294 628013 651005 677010 683874 679098 701632 709071 709204 701227 682228 684305
11527 684305 688935 675356 683725 695652 700079 698026 689260 683890 684462 683673 694874 705816 695025
11514 695025 680048 682723 693454 700010 703248 711175 707662 705733 683790 664107 654385 650330 639704
11501 639704 633433 628946 617087 632787 661464 683519 687550 717616 758646 762872 754367 742738
11489 742738 718193 738983 749849 755006 742049 746019 771066 780031 765110 763918 772047 759252
11477 759252 759440 764129 751782 753368 767119 765814 752334 733147 741057 757859 766018 752232 716758
11464 716758 715734 724992 735405 738830 740747 734514 731922 734505 770325 795867 809572 838184 868528
11451 868528 891680 924693 931847 907634 878583 855397 835259 850931 857540 839022 802583 781256
11439 781256 809964 801030 771434 756891 783526 802174 828012 835053 815419 837447 842021 829298
11427 829298 838943 841072 833051 827448 811908 780912 784027 797191 784009 766434 784732 804345
11415 804345 813989 840559 869237 878434 877315 897416 935292 936891 939439 914791 888679 867703
11403 867703 845143 838750 833932 853927 846200 812982 821264 847517 880011 901475 905970 926880
11391 926880 960449 975499 1004969 994268 990379 976915 966305 953363 908571 885282 881782 876039
11379 876039 877704 873510 866314 874428 872057 884031 915945 918341 944384 996894 1051331 1082660 1083236
11366 1083236 1090607 1097772 1099716 1095194 1075414 1058289 1014985 972677 939715 914583 898946 908720
11354 908720 933996 971026 1001933 1004908 1015045 1061723 1123713 1157314 1178074 1176899 1184446 1211857
11342 1211857 1221184 1249528 1285904 1309887 1341253 1389084 1444086 1476856 1491049 1496453 1520846 1555487
11330 1555487 1579905 1588737 1574122 1586933 1625141 1692972 1715484 1714620 1716376 1726602 1720273 1716331
11318 1716331 1718430 1718141 1732456 1747745 1753488 1777835 1810631 1835300 1869625 1879740 1873239 1862381
11306 1862381 1840447 1831611 1810242 1818943 1831878 1841223 1874782 1928923 1989984 2043595 2065415 2088297
11294 2088297 2118071 2146013 2184491 2252675 2306137 2361415 2438590 2529349 2629735 2777680 2955466
11283 2955466 3127792 3288934 3430471 3547274 3630101 3691314 3743052 3795411 3829242 3859503
11273 3859503 3912478 3945360 4008155 4067846 4165103 4304058 4497210 4728204 4990806 5316171
11263 5316171 5760967 6295780 6902656 7554415 8225940 8938801 9730464 10610282 11608397
11254 11608397 12744606 14029972 15555625 17450950 19871653 23033373 27247689 33068342
11246 33068342 41339818 53323630 69990647 90338843 111041342 129337006 143140001
11239 143140001 151093807 154628196 155526954 153125622 144964266 130964769 112992480 92662010
11231 92662010 73686207 59169244 49128948 42283509 37556879 34207679 31823518 30134543
11223 30134543 28928528 28052103 27442018 27090670 26995599 27177316 27575872 28165908 28932963
11214 28932963 29955458 31280868 32993671 35160221 37823313 41136843 45329924 50791840
11206 50791840 58091196 68000815 81833684 101794010 130633218 169223418 213616309
11199 213616309 258476700 300876295 331801906 345213856 348430228 345891967 335387896
11192 335387896 314151931 284926200 245074288 193715475 147788819 116268192 95955257
11185 95955257 82433372 72945695 66061709 60986383 57098632 53944319 51214245 48802757
11177 48802757 46720314 45006928 43604690 42394781 41376936 40568901 39892784 39421134
11169 39421134 39325454 39553213 40111617 41163953 42878460 45460921 49199910 54589988 62455166
11160 62455166 74209129 91689338 115574202 143111231 168894352 188359866 199373491
11153 199373491 203646462 204566260 203265887 197124847 182296668 159009675 130979064 104115608
11145 104115608 83127101 68437857 58333204 51203848 46082404 42310372 39416636
11138 39416636 37091824 35159491 33442264 31938127 30604539 29298756 27967262 26639604
11130 26639604 25321018 24007146 22712720 21472544 20261351 19096342 18063315 17167659
11122 17167659 16380577 15651600 15026936 14461742 13946207 13485961 13091763 12737011 12414259
11113 12414259 12124824 11843760 11548925 11259355 10955900 10640297 10322431 9980219 9629837
11104 9629837 9262376 8884816 8543639 8223668 7971640 7761415 7606225 7499940 7438357 7407264
11094 7407264 7388540 7374401 7323551 7228531 7100674 6945051 6766089 6567449 6312619 6034176
11084 6034176 5738707 5460400 5229983 5065069 4968159 4868403 4793390 4749260 4716081 4695992
11074 4695992 4666368 4648673 4623761 4541456 4448434 4349697 4248570 4166239 4100022 3997378 3867941
11063 3867941 3740427 3620153 3507335 3394503 3286405 3196406 3098120 3000995 2902429 2819444
11053 2819444 2756461 2712776 2700835 2695266 2729912 2779652 2816330 2826096 2803810 2791064 2802404 2796952
11041 2796952 2802045 2802748 2763185 2724525 2691984 2690344 2707897 2742126 2773418 2763372 2732396 2722423
11029 2722423 2715068 2696476 2640902 2551300 2465223 2377678 2299530 2236479 2194245 2168226 2147182
11018 2147182 2117585 2103585 2126939 2163359 2207651 2246706 2282393 2303657 2305725 2288523 2304962
11007 2304962 2323553 2312982 2343800 2392869 2437169 2494939 2562263 2636341 2717625 2831409 2968275
10996 2968275 3085887 3191766 3262415 3322980 3393347 3493263 3568415 3564214 3475491 3358084 3244627
10985 3244627 3145034 3050661 2929195 2821670 2716010 2637437 2606577 2598851 2643177 2739033 2884584
10974 2884584 3036129 3174663 3283446 3397972 3508200 3617731 3726463 3769188 3715120 3582458
10964 3582458 3466931 3376215 3260042 3131040 3004140 2912464 2872301 2872021 2906582 3005466 3116575
10953 3116575 3227365 3347338 3476032 3622186 3781743 3932197 4063557 4154389 4186383 4213664
10943 4213664 4242543 4275164 4330465 4365857 4423216 4500374 4632642 4812103 5090927 5471774
10933 5471774 5935705 6431922 6948593 7569707 8318568 9315899 10639768 12359438 14648474
10924 14648474 17956558 22827587 29286302 36276607 42097651 45671286 47293100 47847746
10916 47847746 48031129 47734266 45949604 41566902 35053142 28389223 23139453 19619243
10908 19619243 17467973 16225335 15618520 15499556 15859398 16756245 18292246 20808622 24778003
10899 24778003 30595989 37934275 45317205 50842881 53776836 54772073 54917935 54734905
10891 54734905 53805212 50772505 44747606 36865181 29451383 23912718 20175849 17678276
10883 17678276 15927531 14634110 13610636 12775609 12074068 11465132 10953674 10530026 10185464
10874 10185464 9888738 9633027 9416211 9230531 9114879 9069876 9093872 9174846 9315837 9516572
10864 9516572 9815638 10199689 10667338 11223069 11873262 12627189 13497067 14520889 15776838
10855 15776838 17326264 19243679 21638597 24667123 28602005 33952078 41493438 52280596
10847 52280596 67146084 85551648 104523433 119888783 129367712 133781847 135314087
10840 135314087 135448797 133533751 127063190 113960634 96016183 78065529 63827131
10833 63827131 54039396 47816831 44115428 42209713 41731684 42568943 44810787 48858226
10825 48858226 55420939 65416430 79353873 96076047 112212218 124007867 130232667
10818 130232667 132303140 132239809 130930192 127228857 118546628 103674953 85423789 68492437
10810 68492437 55491018 46363552 40029845 35473206 32037801 29372903 27246193 25463521
10802 25463521 23974918 22755796 21694594 20783731 19974264 19302371 18714793 18198510 17741542
10793 17741542 17335219 16993917 16705334 16488352 16343098 16275523 16344255 16551867 16936576 17571179
10783 17571179 18367162 19294289 20398567 21791307 23557651 25846257 28801449 32781948
10775 32781948 38361794 46520980 58592520 75515684 95858682 115014113 128423853
10768 128423853 135111051 137310739 137658472 137151291 133940398 124213636 106822485 85959480
10760 85959480 67494381 54023921 44956092 38849100 34499040 31242407 28761237 26794961
10752 26794961 25180854 23785440 22529909 21344207 20281384 19360937 18556149 17883425
10744 17883425 17355507 16972031 16703705 16525988 16483685 16580179 16826687 17233743 17798621 18463471
10734 18463471 19272353 20299705 21664912 23467242 25804262 28896474 33126586 39199005
10726 39199005 48246550 61519617 79051901 97933965 113354378 122453985 126129780
10719 126129780 127001368 126936767 125671582 120216140 107491187 88936378 70009133 55087949
10711 55087949 44799497 37957057 33320900 30065808 27722011 25987522 24726202 23885173
10703 23885173 23377707 23168115 23272652 23832788 25016452 27173692 30905556 36614901 43676760
10694 43676760 50119446 54117605 55547623 55541613 55142972 54693620 53269650 49187941 42091195
10685 42091195 33976996 27273219 22648536 19619905 17611085 16168789 15064673 14191166
10677 14191166 13473165 12873221 12351690 11854219 11388557 10970388 10600130 10244835 9903303
10668 9903303 9615249 9364516 9141815 8968641 8870583 8854191 8908795 9013325 9202724 9440245
10658 9440245 9722349 10080287 10578492 11256516 12149559 13339267 14957510 17345177 21070063
10649 21070063 26719090 34292857 42335433 48513658 51742862 52703319 52704202 52578931 52084200
10640 52084200 49609640 43706834 35317029 27276369 21422364 17646352 15187242 13509437
10632 13509437 12323863 11392991 10662623 10066685 9530163 9036977 8595617 8212384 7851548
10623 7851548 7497026 7166700 6857894 6613831 6388291 6183142 6000149 5849964 5693978
10614 5693978 5555790 5416362 5281211 5174842 5100836 5015770 4957950 4906099 4866776 4838317
10604 4838317 4817821 4795401 4755034 4740427 4729482 4708053 4684884 4650037 4613093 4585554 4583832
10593 4583832 4597171 4628867 4661737 4709270 4760888 4804935 4834296 4861802 4894803 4965644 5073182
10582 5073182 5213764 5393293 5609173 5844218 6068926 6273205 6491587 6689448 6903978
10573 6903978 7144357 7408001 7711364 8086449 8531031 9083809 9786462 10673202 11692106
10564 11692106 12794819 14012409 15393944 17014827 18968759 21342758 24260704 27938298
10556 27938298 32785045 39418522 48917326 62887578 82972927 108797381 136363739
10549 136363739 161322479 180596704 191543103 195851839 196931520 195089217 187029730
10542 187029730 170917028 148736846 122184389 96420237 76741681 63388652 54417245
10535 54417245 48219827 43851961 40730685 38489452 36926457 35812731 34977330 34451067
10527 34451067 34228178 34274213 34606387 35238083 36086784 37134325 38388904 39845179 41545351
10518 41545351 43700677 46519565 50030330 54480161 60530053 68995947 81275256 100090199
10510 100090199 130279052 176566186 232522099 278622632 310445785 331754487 343358961
10503 343358961 349964967 355084076 351619756 322577660 275969842 230698253 188263125
10496 188263125 150528077 121272893 100417720 85847284 75579644 68193285 62735054
10489 62735054 58610949 55430608 52922370 50833433 49132854 47702670 46404743 45252729
10481 45252729 44319460 43575187 43009882 42721381 42740037 43054756 43603043 44426271 45548846
10472 45548846 47144200 49514110 53128725 58628706 67059483 79796788 97032464 116176798
10464 116176798 134027368 149268898 159662326 164159571 164945985 163093411 156759605 144460783
10456 144460783 128379861 109386699 88365316 69953362 56675940 47676177 41490842
10449 41490842 37067479 33808798 31326914 29358446 27756711 26410888 25237895 24161500
10441 24161500 23147012 22167472 21186765 20227605 19354978 18567789 17852871 17208091 16634454
10432 16634454 16102421 15621106 15160227 14713594 14220662 13719855 13191082 12680222 12252995
10423 12252995 11848395 11464619 11079044 10733804 10407913 10088101 9785145 9488935 9165970
10414 9165970 8803405 8446770 8056796 7646589 7283387 6953282 6668587 6401611 6184895
10405 6184895 5991214 5789216 5591033 5434953 5306323 5217967 5164703 5110493 5009732 4899730
10395 4899730 4794494 4704511 4601265 4484892 4326776 4149015 3969218 3820765 3682499 3579612
10385 3579612 3492471 3442023 3373485 3296545 3213291 3149513 3125042 3081971 3055862 3018419 2943296
10374 2943296 2875848 2817106 2789434 2756225 2687242 2616222 2558331 2504692 2448109 2404646 2358045
10363 2358045 2316901 2298604 2266416 2210366 2145967 2110612 2104722 2065635 2009990 1976164 1941709
10352 1941709 1937461 1925178 1937153 1997365 2083064 2195205 2276631 2349464 2380549 2374922 2364230
10341 2364230 2354490 2340808 2283365 2171188 2053786 1953897 1861643 1765590 1691316 1638628 1589773
10330 1589773 1560256 1507035 1480014 1469168 1473281 1467352 1439168 1416045 1441270 1476026 1492981 1468684
10318 1468684 1445368 1429866 1413587 1376696 1345216 1323888 1287313 1244887 1229779 1233056 1257090
10307 1257090 1299603 1342738 1398208 1489849 1570344 1658377 1767716 1906987 2043084 2105459 2112047
10296 2112047 2118968 2109610 2106869 2083013 2035770 1954728 1835560 1724549 1642422 1591272 1546088
10285 1546088 1521670 1505905 1494116 1481661 1483917 1486906 1494406 1499677 1523276 1549591 1557617 1566195
10273 1566195 1589750 1625562 1651826 1691662 1752290 1807000 1845340 1892236 1937900 1990052 2042495
10262 2042495 2080681 2118421 2156619 2244803 2354519 2495579 2713405 3013511 3474059 4151436
10252 4151436 5028146 6017165 6960600 7732192 8208060 8420588 8456618 8353091 8049898 7463884
10242 7463884 6584899 5570218 4629866 3886193 3357129 2989906 2752754 2606423 2511730
10233 2511730 2436137 2363466 2284631 2228040 2165801 2115014 2079318 2054762 2033491 2020859 2005416
10222 2005416 1983632 1960055 1929483 1897728 1862115 1829643 1787794 1731965 1657012 1581653 1509887
10211 1509887 1465420 1419473 1388321 1354641 1330112 1321602 1322773 1311245 1321561 1335404 1368717 1421319
10199 1421319 1488828 1591254 1731410 1920073 2169918 2415080 2618097 2747823 2829510 2849572
10189 2849572 2817435 2738269 2597323 2384939 2144344 1853021 1605521 1425153 1302288 1214437
10179 1214437 1150224 1109404 1068338 1031439 1005651 992950 990909 973013 955389 942990 914278
10168 914278 927478 943340 941279 930025 892604 860419 864498 866092 865138 851924 856891 869364 884433
10155 884433 871120 861441 858138 875631 899527 897788 885017 884334 880753 852919 840516 853592 866966
10142 866966 856335 832508 831330 825755 816181 814125 819377 835704 844245 842351 844403 857255 865168
10129 865168 900277 941183 991826 1017291 1058973 1125967 1183770 1268540 1416324 1594263 1795739
10118 1795739 1974441 2113642 2233216 2347588 2469621 2602430 2704827 2740818 2726716 2711839
10108 2711839 2731710 2780388 2786753 2756187 2712551 2623484 2507747 2381489 2236354 2107819 1970805
10097 1970805 1821510 1659738 1538685 1427686 1349103 1303361 1256501 1232885 1227469 1214149 1227336
10086 1227336 1250691 1285249 1304352 1353189 1416165 1492050 1603592 1783687 2045237 2355878
10076 2355878 2604113 2769401 2860546 2902448 2923179 2955177 2940031 2781303 2510622 2226623
10066 2226623 1964842 1764792 1621029 1528839 1450980 1375846 1317359 1256372 1216484 1184794 1139793
10055 1139793 1100090 1084838 1064541 1047224 1004549 991184 1019081 1023230 1031557 1024533 1017196 1038071
10043 1038071 1060807 1064853 1084087 1111174 1145055 1179632 1250466 1360541 1515310 1670004 1803847
10032 1803847 1905058 1979404 2012947 2027251 2009246 1985561 1895154 1745367 1575601 1432037
10022 1432037 1307437 1232260 1197279 1174861 1125129 1094689 1106814 1122006 1135183 1144392 1162527
10011 1162527 1171871 1175509 1196413 1193713 1186091 1170466 1158233 1146229 1128663 1127235 1141565 1123856
9999 1123856 1079891 1053999 1044114 1024930 1007231 1021237 1011130 1019606 1032266 1037778 1030494 1039141
9987 1039141 1058758 1047990 1032188 1032040 1011662 993687 996264 988838 990623 990767 990993 975441 977745
9974 977745 1019224 1070538 1106019 1152216 1203219 1250341 1273416 1307819 1363131 1431833 1496570 1569258
9962 1569258 1626723 1671315 1706398 1735354 1747554 1721339 1686563 1648667 1619714 1566457 1517585
9951 1517585 1470245 1479712 1491930 1458942 1402476 1366508 1336325 1326065 1335776 1310079 1224298 1147018
9939 1147018 1111802 1092529 1081225 1092787 1122275 1137597 1138655 1150293 1203835 1255980 1286785 1322266
9927 1322266 1362996 1378012 1377079 1401624 1418473 1467038 1508398 1542628 1566504 1612352 1673636 1736264
9915 1736264 1811616 1880661 1932007 1933601 1904944 1862866 1794561 1715204 1627676 1537931 1433304
9904 1433304 1349165 1266384 1217419 1186469 1156628 1171381 1152079 1138487 1125461 1125625 1133719 1134409
9892 1134409 1134097 1120956 1135766 1158168 1175259 1197057 1205450 1207368 1224804 1246405 1270682 1294141
9880 1294141 1295258 1311348 1346922 1395716 1465158 1553688 1652289 1752978 1818725 1851807 1869062
9869 1869062 1884617 1883789 1839877 1752163 1661616 1582348 1514468 1457300 1422767 1366414 1327402 1302906
9857 1302906 1278120 1243143 1224829 1229959 1237196 1249724 1260773 1237252 1235870 1246420 1247375 1227968
9845 1227968 1221548 1228057 1235577 1241002 1243106 1243837 1261078 1270760 1283760 1329229 1372734 1390850 1438433
9832 1438433 1479991 1499250 1527403 1547440 1561706 1565530 1557876 1545920 1530077 1537924 1538266 1526466
9820 1526466 1507052 1473686 1444833 1450890 1456672 1468528 1465305 1453151 1445665 1446985 1463709 1478318
9808 1478318 1466633 1481154 1493242 1477355 1447365 1422549 1418483 1436910 1457031 1479148 1492753 1540331
9796 1540331 1596458 1621726 1622635 1631178 1651508 1658191 1665604 1687229 1717121 1717880 1717697 1725477 1762510
9783 1762510 1793793 1822173 1867158 1906083 1926130 1933657 1949312 1950575 1957784 1970072 1969473 1971975 1972770
9770 1972770 1971103 2011151 2045697 2087492 2137852 2203982 2271616 2329735 2371208 2418507 2473847 2528942
9758 2528942 2608211 2704459 2798448 2933889 3081759 3281827 3545822 3877078 4296111 4905886
9748 4905886 5810465 7124755 8866639 10838137 12644230 14023677 14919973 15347451 15505029
9739 15505029 15501000 15097912 14084142 12540293 10741103 9007663 7642529 6671256 6054095
9730 6054095 5667095 5414295 5253109 5174360 5185732 5199406 5226082 5277160 5358301 5480906 5630125
9719 5630125 5821418 6069845 6381146 6717897 7171615 7756367 8539103 9684703 11401910
9710 11401910 13837798 16902701 19980487 22405499 24093147 25470907 27077072 29134276
9702 29134276 31308467 32790185 33245133 33245151 33447089 34052089 34874301 35581194 35690607 34951136
9692 34951136 33445890 31294638 28692685 26061101 23643890 21293307 18799869 16430611
9684 16430611 14602300 13442209 12779978 12445824 12354457 12491118 12874750 13546845 14590651
9675 14590651 15925521 17396560 19000947 20757334 22531418 24341707 26423567 28831227
9667 28831227 31279628 33506607 35347459 36763411 38338405 40867438 44293650 47570541
9659 47570541 49710260 50483637 50372399 50391016 51058441 51793838 51630888 50269612 48268913
9650 48268913 46171199 44284583 42787571 41444308 39921274 38295815 36727597 35098193
9642 35098193 33211642 31082302 29069882 27345589 25930305 24779724 23888106 23131497
9634 23131497 22360991 21728748 21460378 21500181 21649812 21770709 21823352 21877431 22133720 22739553
9624 22739553 23731855 25256669 27766629 31897450 37867408 45188875 52747522 59414745
9616 59414745 64646174 68326697 70375086 70816709 69496848 66096752 60699693 54052346
9608 54052346 47165815 40675840 35256930 31597964 29552766 28541611 28315110 28851675
9600 28851675 30304369 32733810 35666486 38255115 40401412 42777105 45801209 49215360
9592 49215360 52496048 55382295 57682600 59699410 61473546 62812146 63882115 65351265
9584 65351265 68563970 73271534 76905615 77878081 77526673 78567595 82870653 90900558
9576 90900558 100872794 108840166 112727704 113426009 112465847 110894150 109144505 106697050
9568 106697050 101629168 92620761 80817125 69314526 60172962 53564784 49316027 47130627
9560 47130627 46717377 47877734 50050853 52218199 54066641 56366767 59469365 62895976
9552 62895976 66270078 69517197 72538611 75994375 81165355 88739374 99062819 112631063
9544 112631063 129301072 147328444 163729785 175935846 184183978 189921700 193258576
9537 193258576 192216161 184828458 170960197 152293035 132769310 115118671 99728133
9530 99728133 86032678 74032097 64622468 58326798 54663381 52676702 51619401 50997631
9522 50997631 50607788 50648626 51236573 51997886 52385656 52211853 51405668 50237302 49362801
9513 49362801 49012437 48883567 48844377 49165358 50168581 52499570 56983641 64232362 74270486
9504 74270486 86196528 98900521 111838276 124576529 137507558 151454679 165713576
9497 165713576 177397562 183673407 184025750 179535846 172676968 165487213 157361050 146481129
9489 146481129 132079384 115644229 100036728 87569685 78122345 70088438 62925002
9482 62925002 57080521 52861780 50271644 48771936 47585555 46381845 45440646 44889598
9474 44889598 44594773 44354196 43993332 43370574 42506769 41827596 41601143 41649308 41965887 43169495
9464 43169495 45799502 49829806 54841292 60584880 66724311 73107474 80173585 88165381
9456 88165381 96585205 104351497 110536637 114627556 116301773 116110122 115146432 113849629
9448 113849629 111278990 106019468 98255669 89026110 79213706 70333390 63335761 57135511
9440 57135511 50221941 43110321 37062049 32536659 29278670 26915875 25172851 23832961
9432 23832961 22777043 21932175 21297535 20831911 20520237 20333816 20275258 20352462 20619910 21126283
9422 21126283 22017439 23411123 25399364 27863265 30416012 32798098 34751930 35956765
9414 35956765 36568319 36955462 37174554 37094994 37006334 37216124 37201332 36484953 35163460 33613899
9404 33613899 32169571 31024469 30030987 28496733 25661437 21858072 18358402 15802435
9396 15802435 14057624 12854222 11974318 11292603 10744785 10265927 9849181 9516752 9236131
9387 9236131 8967062 8686581 8460500 8269052 8115007 7989713 7919062 7862130 7818196 7839277
9377 7839277 7878641 7935270 8037595 8189927 8381111 8507100 8482934 8329344 8150957 7930872
9367 7930872 7710268 7476802 7165222 6732740 6249734 5881799 5649438 5499835 5363979 5239977
9357 5239977 5141585 5055839 4980963 4896958 4807903 4737718 4662754 4606487 4563503 4511145 4451655
9346 4451655 4394347 4359335 4318940 4289052 4272400 4278360 4289570 4307750 4324984 4360181 4405842 4450732
9334 4450732 4524142 4627896 4762935 4871277 4930467 4967747 4964633 4951603 4921383 4883055 4789124
9323 4789124 4660582 4517700 4395937 4325290 4273353 4229069 4210938 4214606 4218847 4196442 4181821
9312 4181821 4154736 4141636 4153823 4150828 4129149 4095832 4061825 4035933 4047356 4048126 4040302 4037444
9300 4037444 4049893 4062773 4073382 4076192 4082273 4098956 4143959 4187042 4202598 4203745 4198072 4230723
9288 4230723 4253537 4263759 4290340 4332222 4355319 4367829 4374552 4386427 4418563 4454467 4466302 4489120
9276 4489120 4512482 4547700 4592595 4652266 4730017 4807736 4884836 4930134 4969307 4999221 5025959
9265 5025959 5043815 5044677 5028187 4997495 4979887 4987274 4994759 4974690 4950053 4928640 4937025 4948831
9253 4948831 4976674 5016089 5065288 5111129 5151461 5179710 5195587 5210661 5246296 5292563 5367524
9242 5367524 5435925 5484849 5531175 5594981 5663532 5716440 5778622 5831081 5880494 5969120 6032450
9231 6032450 6103941 6171778 6227055 6286318 6361911 6447907 6536708 6635374 6721405 6808337 6867446
9220 6867446 6926046 6971349 6981957 6975462 6982642 6958509 6911212 6876853 6840302 6841304 6863471 6893607
9208 6893607 6941045 7000278 7054381 7137029 7196621 7244154 7323898 7417723 7512399 7587519 7699886
9197 7699886 7821761 7922867 8019560 8128177 8224365 8315044 8400703 8468371 8561789 8647990 8733467
9186 8733467 8825216 8949870 9067637 9200739 9357362 9494724 9607079 9713133 9826598 9918464
9176 9918464 10001197 10074035 10113685 10159078 10211616 10249230 10265678 10283840 10305806 10354053 10385617
9165 10385617 10425179 10495793 10565066 10620947 10693479 10787105 10904004 11020711 11129266 11253840
9155 11253840 11367957 11504157 11653414 11801721 11955128 12109472 12249503 12388139 12529469
9146 12529469 12665970 12799112 12925653 13050549 13225676 13449330 13697653 13983841 14294315
9137 14294315 14627731 14938188 15242022 15527248 15763495 15950056 16082459 16152714 16176943 16227228
9127 16227228 16235008 16225650 16256576 16316479 16392770 16501034 16643817 16780619 16933962 17085503 17247717
9116 17247717 17420669 17605967 17780252 17993664 18249191 18542845 18880666 19234301 19636986
9107 19636986 20128994 20671738 21325419 22105906 23040461 24142674 25479505 27135318 29304129
9098 29304129 32105404 35353308 38508088 41212190 43480276 45501020 47337264 48825344
9090 48825344 49500043 48835779 46953701 44631491 42377592 40211647 38037765 35854327
9082 35854327 33763820 31990431 30639330 29707202 29092800 28692852 28394955 28198930 28081808
9073 28081808 28007200 27957867 27961258 28011543 28123157 28282720 28505075 28792928 29149808 29557589
9063 29557589 30043181 30705096 31589227 32746952 34274917 36336332 39071992 42428557 46147888
9054 46147888 49930329 53548447 56770570 59429783 61625149 63375826 64496612 64888573
9046 64888573 64618041 63728915 62403784 61104804 60186738 59558422 59195684 59196947 59449581
9037 59449581 59867507 60334273 60734582 60962971 61012679 60904807 60607396 60080430 59487324 59041522
9027 59041522 58850688 59007345 59578373 60462267 61446979 62125330 62194599 61565616 60465783
9018 60465783 58978174 56981689 54398959 51417802 48304749 45611662 43936244 43571828
9010 43571828 44508924 46478216 48941903 51477182 53802568 55638478 56795249 57449608
9002 57449608 57720263 57566010 57195363 56906902 56503798 55755978 54882513 54104055 53470719
8993 53470719 53041569 52758821 52325228 51526873 50198376 48389783 46560042 45289345 44933039
8984 44933039 45472564 46666670 48277423 50335656 53313037 57635534 63306753 69729362
8976 69729362 75987054 81274201 85104979 87309747 87842236 86713606 83839067 79231629
8968 79231629 73182995 66262486 59114250 52352969 46587080 42204996 39148891 37035307
8960 37035307 35547593 34499816 33725282 33149820 32776628 32703848 33139995 34218747 35889558
8951 35889558 37829624 39618617 40925472 41585128 41713778 41506267 40954034 39890363 38228620
8942 38228620 36118537 33911201 32127126 31180093 31031879 31476321 32445578 33936684 35971073
8933 35971073 38620992 42019181 46041048 50326351 54496872 58119197 60652536 61741387
8925 61741387 61472035 60099005 57720796 54266895 49789371 44581725 39002542 33637528
8917 33637528 29163753 25897516 23628446 22016926 20876075 20054937 19444059 18971053 18652362
8908 18652362 18473829 18468274 18557993 18573241 18449870 18184503 17844394 17526625 17233809 16897518
8898 16897518 16419246 15824610 15285206 14938410 14824509 14957963 15366393 16014349 16730407
8889 16730407 17422191 18093005 18665124 19124919 19518498 19861761 19992491 19794746 19293332
8880 19293332 18526100 17569568 16625034 15792783 15041783 14246358 13366490 12521626 11858393
8871 11858393 11351017 10910186 10562702 10293903 10061045 9855932 9670815 9443349 9209437
8862 9209437 9007413 8888680 8834393 8773614 8697630 8602261 8481622 8368067 8270324 8159890
8852 8159890 8014912 7817322 7622934 7460119 7322988 7246162 7189872 7152774 7155832 7181489 7237140
8841 7237140 7303233 7396175 7578102 7769001 7925239 8003039 7974512 7891590 7794624 7735346 7640862
8830 7640862 7445247 7149371 6819727 6547554 6344124 6191249 6076946 5974201 5884310 5797963
8820 5797963 5748438 5727090 5686072 5694992 5734354 5757991 5765076 5740358 5727241 5695916 5655744 5583696
8808 5583696 5469407 5338454 5187589 5022322 4912162 4812890 4724888 4655312 4582827 4512530
8798 4512530 4467247 4441679 4446812 4443164 4446188 4440041 4421709 4411038 4422186 4434373 4426801 4407131
8786 4407131 4385339 4363593 4328859 4257654 4186771 4144674 4125272 4095984 3998377 3911135 3831188
8775 3831188 3787654 3736967 3675058 3625797 3583965 3556140 3481693 3427439 3403255 3380963 3362652
8764 3362652 3343707 3292997 3229314 3180086 3149509 3134400 3111678 3103100 3082926 3058012 3037195 3034968
8752 3034968 3027259 3007748 2992491 2996522 3053514 3097982 3132894 3128063 3104496 3098216 3109643 3073485
8740 3073485 3034189 3035779 2990322 2901478 2836293 2755175 2699522 2646335 2610890 2591903 2574312 2552827
8728 2552827 2522951 2506625 2516170 2506490 2503364 2495993 2466922 2427902 2436055 2424404 2397786 2392358 2388411
8715 2388411 2406383 2411730 2395552 2373835 2349991 2304154 2259859 2249555 2250916 2235437 2219373 2202912
8703 2202912 2187689 2189318 2187877 2181453 2167318 2155581 2136879 2124334 2115642 2081424 2046713 2024762
8691 2024762 2019430 1994664 1968941 1957437 1961694 1968452 1964124 1956528 1968158 1969999 1957855 1946881 1916020
8678 1916020 1864118 1810795 1778810 1735270 1700477 1665461 1642984 1656965 1661854 1658480 1646875 1646239
8666 1646239 1638651 1612756 1596547 1590927 1582495 1566845 1552147 1555145 1554532 1522972 1506748 1513917 1521512
8653 1521512 1525854 1522713 1511397 1490400 1466545 1452938 1460641 1448499 1453512 1444160 1448837 1459790 1459429
8640 1459429 1482811 1517904 1554383 1557234 1553887 1563433 1551794 1559293 1552687 1540048 1513388 1471526
8628 1471526 1458388 1449281 1419607 1400628 1361637 1327647 1311325 1289127 1277599 1250445 1232087 1218606
8616 1218606 1227973 1230598 1238663 1235774 1228497 1231841 1226222 1208986 1204250 1230922 1245259 1249180 1242404
8603 1242404 1230700 1220684 1187937 1167510 1148569 1116077 1112628 1110739 1103924 1098335 1118050 1141632
8591 1141632 1153297 1160731 1167493 1184093 1183082 1204009 1215006 1231005 1245407 1248299 1239594 1229717 1204723
8578 1204723 1174177 1167722 1163581 1120401 1065618 1017005 992095 975618 961622 967188 959154 946508
8566 946508 945188 957794 985155 999969 1006266 1040656 1072265 1107587 1139324 1144468 1141887 1123065
8554 1123065 1129217 1126884 1126312 1079629 1025902 987101 959238 926512 895217 862628 834255 831304
8542 831304 832130 824589 828047 833061 827171 856312 883686 868797 874136 877625 883494 858518 828914
8529 828914 806291 802687 790101 778066 787809 763047 749528 754667 774252 773433 775214 764256 748438
8516 748438 751367 755336 763578 797985 818959 829691 876662 911034 930362 943495 956800 944621
8504 944621 909482 875671 848792 837461 829234 800105 778861 764936 748739 734990 712698 709485
8492 709485 720048 733595 736303 718348 694593 698031 705088 720127 740410 789947 847103 900490
8480 900490 938080 959057 948617 952693 951838 922880 869516 781144 725629 676470 633355 634130 628714
8467 628714 612601 602428 580369 575692 561975 552248 559851 572985 591733 615199 632150 626068
8455 626068 632674 611203 588354 592291 588697 585557 577740 583317 593988 630708 692101 765189 822080
8442 822080 823050 822527 854437 872974 880497 889792 862737 787956 707579 645522 590875 574323 571703
8429 571703 549851 514657 495997 488870 497012 499816 494720 487140 480483 474532 487548 499421 482919
8416 482919 453781 436665 445581 451724 442621 424690 415516 422520 426968 427754 446416 458339 437435
8403 437435 410812 395608 389746 373531 372415 384030 363813 376506 401566 405608 418904 409608
8391 409608 379367 354937 345275 352904 364462 368445 371997 366077 353902 357767 364613 341460 321087
8378 321087 313370 310670 327926 340204 351073 366433 364735 351585 349312 373729 377102 353143 342513
8365 342513 342604 339143 339923 335642 324166 328343 331107 335490 328636 315714 317814 319261 321607 295005
8351 295005 285480 267860 254279 261730 282150 290055 278407 266494 276896 277862 279556 301623 311739
8338 311739 318922 324819 338422 349442 352903 333768 324751 343516 352656 345519 331961 318008 324817
8325 324817 320609 307498 304574 286475 268444 291793 299093 287202 270700 267549 270079 267919 276880
8312 276880 252479 253541 275597 264973 258796 272936 266931 245290 238199 262176 265130 261955 266895
8299 266895 267396 263440 276227 283975 301082 315533 306867 282292 273236 279342 310610 312986 294168
8286 294168 272685 277182 307100 304846 310289 317749 325595 303962 281043 278079 256812 241454 231545
8273 231545 211992 202765 205107 190719 208284 232577 251774 249577 229027 214892 211932 211354 211237
8260 211237 215156 225378 247619 272791 281447 289347 308001 314616 319015 321154 307701 265036 215378
8247 215378 210273 221651 214482 223896 237115 242501 240054 232785 233038 220394 227343 233089 216664 209315
8233 209315 210359 202010 196249 195540 202019 192246 194417 193776 184155 190573 193898 193035 202090 212565 237653
8218 237653 242359 213277 209000 220450 227617 225355 238554 254140 266385 267114 272715 275258 252890
8205 252890 241792 217603 206908 196482 210089 217452 206207 197251 187618 191779 201799 206768 175775
8192 175775 178819 200469 216853 206609 202577 192495 178070 173776 169098 151581 141126 159436
8180 159436 186261 198537 202028 187192 181033 197253 201683 206912 217236 220458 215615 236606 256301
8167 256301 265762 256236 261531 277884 290667 281637 280131 261123 213486 185638 187194 190558 194271
8154 194271 197960 179389 168576 186350 181862 198823 209197 184002 156628 164153 197497 218409
8142 218409 217103 208813 226252 242821 225000 214963 208548 205835 234223 248620 238916 240990 235891
8129 235891 238092 246826 249946 238309 229263 229343 249284 265205 250601 240563 235273 216951 216908 209116
8115 209116 218741 204035 172619 174917 185758 201909 227416 242500 245938 255807 265835 268658 260989
8102 260989 263142 277673 287459 289981 293316 309303 331755 328676 340482 351122 340294 348939 368123
8089 368123 392101 428118 482746 566813 657912 780415 922111 1041973 1123751 1169545 1195836
8078 1195836 1205707 1177808 1139243 1067856 975066 850847 730093 630544 555593 515199 485739
8067 485739 466562 438996 415215 434273 446503 472565 490200 504020 502653 500504 518368 546483
8055 546483 551058 553633 559605 572146 582866 585854 596452 570910 566025 595015 594150 603594 648897
8042 648897 713112 779187 859595 1005194 1242223 1527143 1828226 2106389 2327162 2490878
8032 2490878 2596015 2641332 2621744 2532269 2372443 2159224 1920901 1683901 1484300 1337140
8022 1337140 1219536 1136401 1113667 1087510 1058357 1046302 1036045 1027207 1024313 1031108 1013469 1017129
8010 1017129 1024057 1008440 1017002 1031076 1031086 1022972 1006674 997818 978743 980749 978223 991636 1009898
7997 1009898 1024376 1046407 1081139 1140453 1224187 1337561 1477289 1634609 1813214 1962257
7987 1962257 2066722 2135953 2187208 2192213 2165781 2080088 1947638 1782922 1630260 1494244 1382732
7976 1382732 1290910 1217770 1162767 1116825 1090116 1088188 1078181 1070759 1053689 1034239 1024824 1027891
7964 1027891 1023964 1008412 977353 938319 932098 937863 924493 907837 912403 913201 876700 851706 827145
7951 827145 794264 779264 761748 743915 743468 743042 737491 740358 732099 719806 701875 689407 693374
7938 693374 717466 703035 658570 605298 577528 569138 538079 508397 477488 450743 423706 428519
7926 428519 415172 387621 384746 366239 352180 348968 366597 367446 349243 341059 343660 344709 330299
7913 330299 309815 297116 284908 268839 253145 248399 252253 238123 229440 237345 243107 221133 226433
7900 226433 226938 179248 152369 150422 152549 145247 144016 144401 142085 150968 154356 161076 156203 133131
7886 133131 154297 154864 162983 172985 159809 141900 120122 128593 133650 130923 132979 142593 144646
7873 144646 132843 124254 117495 127115 127198 119828 130608 139650 128168 111769 89513 81289 82348 69188
7859 69188 53297 60814 79134 99274 92327 92437 104394 105794 108307 100415 100481 102915 98909 107781
7845 107781 91413 54391 31305 28819 69077 90698 102262 115633 108739 93995 99219 104819
7833 104819 89888 71168 69015 69826 71847 73996 79955 66696 68897 67913 39742 36611 48917 51630
7819 51630 31349 45146 72059 63536 50166 36771 36991 35285 45009 62257 65826 86931 91290
7806 91290 81282 76905 75119 53257 56874 69227 77142 87325 79374 74079 82600 90243 80634 70601
7792 70601 51929 42549 19330 15289 22850 20428 21632 22011 51121 60723 54562 43403 31290 42208
7778 42208 40385 28727 32874 30154 26536 28326 39095 52643 59530 43408 31796 37961 51646
7765 51646 62371 59627 39397 31216 34004 19314 19566 25206 22982 30320 28328 19114 16350 39767
7751 39767 78970 81570 81969 88469 81045 77733 52456 39009 17927 2089 19134 27428 17608
7738 17608 19183 11355 219 6723 18755 19928 1184 18528 44170 43717 20733 -3792 -3496
7725 -3496 4036 19803 25529 30463 21675 12445 30632 48059 33133 31969 38099 54422 47182 37271
7711 37271 32230 28592 37355 37425 17571 7799 -1577 5823 21511 43826 45083 38133 34096 26940
7697 26940 33788 27433 1940 -4913 -10728 -9046 20518 45164 34179 12613 20673 18344 15700
7684 15700 26267 26362 24625 29253 40655 16042 -2653 -5666 -8470 -3639 -21143 -33189 -34827 -27572
7670 -27572 -23993 -25936 -6988 7180 14639 18063 17800 11825 4811 29870 46830 34636 38096 32766
7656 32766 29197 21022 8286 493 -5171 -12688 16753 33884 43862 44144 26766 10439 19672 13147
7642 13147 14086 11769 3180 21915 22490 22229 33622 45989 42502 36694 11846 -4300 3189 2277
7628 2277 -504 1252 -5400 -2455 1793 -16521 -33870 -31564 -27420 -3284 18897 39057 28838
7615 28838 26256 16712 14128 28582 22632 2558 -16288 -27033 -12622 -16933 -28965 -9390 8344
7602 8344 13457 31399 49398 47146 44831 47214 29486 -1043 -26020 -27186 -20941 -18584 -18180 -4395
7588 -4395 14363 5214 4462 17876 16274 20691 36538 11905 19286 13958 -19010 -36509 -29528 -26387
7574 -26387 -4370 26231 23501 26126 37807 18668 18632 33214 47082 19849 5447 -4824 13785
7561 13785 28727 45180 30992 11462 -7517 4246 11138 28758 34950 36756 39774 27372 11574
7548 11574 -3239 -16269 -14377 24885 36995 38942 40112 20762 11374 14112 18304 7603 3383
7535 3383 -20816 -32716 -5884 11738 9741 -2897 -5152 7787 2058 8160 25421 20218 -258
7522 -258 -7885 7050 19795 23204 17064 19686 -2962 -14319 23647 29585 7077 -14583 -9561
7509 -9561 4398 -8480 -11576 -15497 -15925 -8646 402 20118 26889 30643 27520 31730 33440 33918 43881
7494 43881 47774 27926 12606 17889 12545 11521 10766 1579 4302 -7719 -22083 -10639 -10831 -9389
7480 -9389 -23525 -8157 -10428 -11626 -8892 -1760 -15696 -10639 -203 5077 33887 37734 29255 29954
7466 29954 33739 23033 16490 32532 26861 15194 15996 9336 11974 6642 -6869 -840 10927 -4539
7452 -4539 -17972 -48288 -52798 -38512 -28386 -19839 3636 31469 34203 21938 8146 -1390 -2427
7439 -2427 1994 3520 -6927 8437 -4241 -8728 -6136 -10747 -15074 -23371 -17985 -12455 11142 27757
7425 27757 15687 4439 8134 21882 23095 4895 -9138 -12700 -12780 6619 12411 14596 304
7412 304 -15215 -17541 -28727 -26250 -21286 -21221 -6482 1248 -12964 -24875 -21719 -10419 -8308 -22826
7398 -22826 -14392 -994 -2899 -10292 -27677 -30326 -18208 -10234 -21450 -22552 1645 -1623 -10560
7385 -10560 -6824 -5788 246 -1493 -1934 -1992 6030 18888 24321 41720 26804 27544 28505 30633 42471
7370 42471 53892 56742 55907 33024 4993 -18304 -22854 -39650 -48157 -28177 -3374 10293 6924
7357 6924 4312 4423 -11483 -5674 1234 -3828 -20978 -14508 -5126 -9020 -501 23596 24046 22566 -5118
7342 -5118 -6095 5795 -6044 -11687 -27670 -36039 -37149 -28018 -696 10702 -4087 -12015 -10777 8403
7328 8403 19880 6256 8162 7610 -4230 -7953 -3192 -16470 -33330 -57041 -60427 -45830 -24648
7315 -24648 -31582 -26593 -14571 -5764 -249 -4758 -15649 -22990 -4181 17054 23157 28829 32742 8495
7301 8495 627 -9898 -18750 -5372 23018 11199 -12134 -20401 -15825 -11204 -8310 -13861 4545
7288 4545 -8808 -20452 -15096 -19390 -24756 -18410 -6062 -16178 -26195 -12017 1889 13103 13065
7275 13065 13448 19005 4039 -4844 -5844 -4009 -12243 -15305 -17863 -21887 -9731 14495 25258 8005
7261 8005 2001 -2557 -3942 1643 7230 14892 -3983 -1076 -1519 -1409 -14585 5520 23876 31616
7247 31616 11647 8845 -689 5230 5909 -4136 6038 -2251 20050 24082 20380 11589 12992 10258
7233 10258 18220 9697 3579 1234 5293 -5329 -17317 -16100 -14110 -35488 -41864 -29928 -13270
7220 -13270 -9325 -8415 -22145 -15860 -6076 3293 16408 8110 -9279 1403 -7258 -26415 -34950 -32229
7206 -32229 -34517 -37582 -23925 -20500 -26762 -33887 -21587 -25947 -42554 -37714 -24092 -4287 5005
7193 5005 7713 -6641 -23598 -26739 -27646 -12351 12235 23818 27255 38970 38655 28436 17456
7180 17456 -12123 -15906 -1525 -8861 -13252 -17857 -26612 -50312 -61849 -53921 -31449 -21559 -20125
7167 -20125 -32812 -28485 -15611 -488 1178 -9768 -18664 -34045 -27587 -13763 417 2359 -730
7154 -730 -13039 -28948 -24100 -21214 -18859 -32076 -31889 -34723 -29055 -20721 -4924 -10228 -4117 10154
7140 10154 23610 12297 -1762 -10276 -13876 -4328 7015 -8893 -11202 -16370 -18896 -25429 -24579 -28612
7126 -28612 -27045 -21572 -17258 -23318 -6277 -11959 -24114 -38628 -42120 -19880 355 11692 -10778
7113 -10778 -1456 2698 -16116 -34479 -43634 -41029 -46567 -46879 -61267 -61789 -50151 -38963 -24143 -27677
7099 -27677 -32549 -22830 -26181 -26501 -31861 -38619 -40839 -34878 -25683 -27238 -14635 -8523 -20655 -23470
7085 -23470 -36115 -35084 -22864 -3707 6274 10381 -5544 -13436 -7760 -8950 -2075 -19444 -34474
7072 -34474 -47729 -15620 10425 304 10444 8704 -10476 -24177 -28984 -20741 -34262 -46449
7060 -46449 -45750 -20232 -3707 -24571 -32275 -26419 -21967 -18049 1370 8629 -563 -9446 -20881 -5909
7046 -5909 -4118 -13384 1187 6174 -8859 -9182 22680 20636 -8620 -717 2626 -10712 -20538 -9328
7032 -9328 -35797 -57010 -54546 -50572 -40454 -13391 -17962 -27816 -21594 -12743 -8886 7866 24146
7019 24146 17720 3359 -368 -7165 -13232 -13828 -9569 -10539 -23817 -27203 -38847 -34624 -34033 -22777
7005 -22777 -6493 -10971 -23570 -18750 -8571 -15669 -5672 -5192 901 14410 5132 -3787 -18316 -10710
6991 -10710 -11062 -17353 -42822 -43709 -49608 -58538 -48984 -48237 -44374 -27054 -32147 -36575 -37062 -27352 -33239
6976 -33239 -11878 -8150 7822 10135 11670 -2256 -19825 -14147 1454 20399 25341 9554 664
6963 664 1679 3025 -10505 -20214 -4509 -5894 -25980 -25889 -15814 -12822 -15702 -40608 -20251 2525
6949 2525 -2549 -1460 -11107 -17506 -26936 -35945 -39217 -45508 -27229 -16803 733 -13122 -14549 -7191
6935 -7191 -14588 -6825 -7907 -1145 12623 25837 16101 11965 9124 5785 1850 -18777 -15972 -1753
6921 -1753 -779 -1450 -4663 -5359 -3048 -319 -15706 -27546 -26448 -26295 -10554 -18440 -27110 -40703 -28951
6906 -28951 -1255 12603 7785 -4721 -15741 -29727 -15457 1855 8830 16608 19922 1375 -3266
6893 -3266 2752 -10109 -11845 -21077 -16924 -17157 -17651 -26125 -21848 7420 8785 -11672 -16803 -17313 -9722
6878 -9722 -3484 -11110 -22104 -41677 -49082 -40210 -29374 -8874 -8565 -6755 2139 -903 -9708 -1617
6864 -1617 -16554 -35661 -32301 -14049 7535 6803 -277 8220 19243 22513 36957 44396 25137
6851 25137 -17426 -56357 -68044 -64566 -46381 -41656 -62854 -63310 -46065 -29344 -7362 2614 2155
6838 2155 -9563 -2267 17740 10610 -11182 -13791 -5995 -2667 8545 -5534 -3541 10221 8264
6825 8264 4401 21896 19123 -9531 -19468 -15740 -10213 4965 6123 -9653 -8673 -9457 -18696 -35422
6811 -35422 -40882 -30878 -4622 5830 773 15872 30408 15064 4255 18294 32631 28136
6799 28136 9738 20029 15633 17371 2504 -39911 -52602 -25296 -3473 8523 -10765 -22027
6787 -22027 -33196 -38506 -55001 -37729 -9387 -7242 -12239 -14675 -22300 -6142 -447 -16822 -36178
6774 -36178 -25393 -16759 -9242 -20611 -37596 -31566 -33815 -21244 -30292 -38943 -38209 -23288 -3773
6761 -3773 -5610 11183 -7135 -20810 -22816 -32694 -39860 -22618 -9934 5879 -14761 -11627 -10738
6748 -10738 -19432 -16813 -5704 -6271 -18997 -21471 -10592 -9409 1874 11922 11804 -14735 -34951
6735 -34951 -30825 -7035 -15614 -37765 -38029 -20893 -34105 -57145 -59437 -58556 -60807 -44081 -21916
6722 -21916 -1152 146 -13801 -38738 -52476 -38509 -13565 -11097 -18931 -22964 -7969 -10996 -25282
6709 -25282 -11479 -10906 -20799 -8108 -30125 -23275 -22431 -5036 4412 -990 -11226 -18982 4195 17809
6695 17809 12647 19273 21354 20614 32577 17274 -15208 -19331 3027 5544 3076 -2317 2849 5381
6681 5381 14828 21572 5790 10 18178 23636 40642 40752 10033 -19639 -35682 -33224 -12706
6668 -12706 -26462 -15873 -9489 -20689 -15000 7348 18629 31973 39487 24829 14976 621 -13995
6655 -13995 408 18818 12745 -11221 -28201 -42371 -28625 -15222 3014 -20540 -26805 -13490
6643 -13490 14839 41094 38066 30765 13988 5095 11707 18576 5661 2033 7214 2833 4876 -2982
6629 -2982 -9559 807 -5518 -8776 3951 12222 19842 16462 7319 882 -20380 -34932 -30255 -18686
6615 -18686 -11353 -8545 -14822 -27724 -12434 -5896 -2784 -9421 -7909 -10656 7145 10036 -878 5551
6601 5551 12596 11498 5612 4559 10501 6538 -1251 -22431 -15563 17999 14991 -14131 -28866 -27055
6587 -27055 -19689 -10937 -23850 -41064 -24207 -17049 -16084 -11400 -3106 -3997 1757 -11235 -21234 -11192
6573 -11192 -11249 -11214 -13821 -9516 -33764 -44800 -22561 -7788 -8520 -11888 -12328 -5169 5994 21739 7447
6558 7447 -12190 -12552 -7531 -6282 -1725 5157 6709 15145 25769 43427 39577 24482 -10271 -22821
6544 -22821 -16372 -28131 -33569 -28471 -21970 -24110 -26524 -16581 -3458 -10041 -14319 -36707 -30952 -19892
6530 -19892 -9179 8129 11191 1993 -7285 -4631 -10841 -8363 11786 10078 17687 22346 28635 34008
6516 34008 45172 24994 16095 13413 13300 -223 -5367 9132 12059 7658 -317 -2918 -14228 -3038
6502 -3038 -1397 -7991 -24187 -45220 -36433 -38406 -29075 -30749 -24960 -27436 -20471 -24396 -31508 -30601 -13174
6487 -13174 8711 6825 1033 9070 -22099 -33756 -27662 -32653 -25145 -24618 -13797 -9322 -9722 -15046
6473 -15046 -18291 -13742 -12625 -10268 -11204 -16502 -36364 -33592 -8428 4896 12565 11933 -7233 -15470
6459 -15470 -11249 -13980 -27416 -30815 -23522 -21879 -18617 -5072 3958 -1416 499 2926 2066 -19522
6445 -19522 -20215 -27014 -23713 -20707 -25585 15 569 -11105 -21991 -27943 -13181 -4762 -19162 -15865
6431 -15865 -11564 -2186 -7593 -18566 -40024 -33770 -17257 -7893 -10701 -5991 3392 12136 -9136 -24758
6417 -24758 -23275 -9450 -5958 450 516 -3815 -6573 -24934 -48843 -47887 -26619 -18443 -23439 -29492
6403 -29492 -25170 -8115 7681 18114 -3149 -11992 -16777 -23555 13162 7744 -12150 -3087 -9187
6390 -9187 -12287 -7697 -10842 -15411 -6330 8715 13674 -12257 -26208 -31971 -27843 -415 10808 8776
6376 8776 -1711 -24601 -20193 -6964 -24404 -28220 -5318 -1445 1317 -13509 -40264 -28819 -3848
6363 -3848 633 -7831 -1902 -5779 -17254 -12937 -17968 -11018 -5426 -1142 2378 8523 13251 2818
6349 2818 -13661 -17812 -15027 -36777 -45083 -32184 -32188 -17865 -23660 -24340 -15102 -20722 -34303 -34899 -50550
6334 -50550 -40651 -34772 -34554 -24610 -37679 -37887 -22500 -20332 -25290 -27157 -25032 -30611 -28379 -19188 -9190
6319 -9190 11545 23489 4696 -5915 -5618 -3389 6612 2086 -11143 -20934 -12620 -3229 -20052
6306 -20052 -29711 -14708 -3350 -8463 -20133 -9579 675 -3305 -10699 -17158 -4485 8152 11815
6293 11815 3592 -4309 -4901 9128 2726 18099 9704 -16686 -30267 -28591 -6845 -13012 -6043 2965
6279 2965 -13996 -12731 -24 1144 -10341 -15513 -7937 -19057 -24100 -27058 -22900 -25402 -47056 -47112
6265 -47112 -48622 -50919 -46702 -23346 -10985 -4389 -16820 -38108 -39700 -23612 -29058 -20371 7460
6252 7460 22020 21643 18671 1807 -9538 -648 -6651 -31364 -42963 -53493 -56624 -65938 -66794 -55098
6238 -55098 -60386 -58687 -24311 -8654 3882 -23485 -35531 -26586 -44062 -36707 -5772 -4198 -18752
6225 -18752 -34188 -23121 -5179 4000 5829 -15087 -26339 -8496 -6224 -24180 -28466 -5429 -14377
6212 -14377 -13413 3217 17028 23620 19642 -416 -15353 -28331 -8613 10959 -2015 -10476 3940
6199 3940 10105 2912 -5197 -7327 -9718 -19475 -14621 -1488 -18207 -16842 -23294 -10701 4113 -4239
6185 -4239 -6885 -7425 -17461 -37111 -37569 -31962 -27788 -22501 -32460 -33595 -28424 -13934 1128 -15866
6171 -15866 -32220 -21906 -4710 2069 6472 14821 17139 -4036 -27171 -26278 -16127 -22761 -13979
6158 -13979 -3784 -9919 -14790 -1648 -14205 -19439 -9153 19061 32310 16493 -11438 -7079 7420
6145 7420 -4879 -11376 -22536 -25978 -7029 17347 20023 7594 -5212 -3565 -333 -6289 3870
6132 3870 12111 16491 3040 3151 11344 16603 871 514 1832 -8646 -17519 -16091 -6465 -418 -201
6117 -201 6287 6288 -7064 -34438 -38623 -27568 -29885 -31241 -44531 -36190 -19133 -19811 -12006 -24128 -11556
6102 -11556 142 -8718 -22262 -28539 -24276 -16291 -5735 -3132 4351 -3750 -3563 -13267 -17966 -18466
6088 -18466 -15727 -12435 -22129 -27461 -32431 -40386 -25450 -29105 -39090 -29690 -32386 -25509 -20946 -15103
6074 -15103 7815 34291 13528 -16771 -16083 -2570 7168 -5216 -5534 7959 -187 -24536 -31402
6061 -31402 -28411 -16118 -9847 -15367 -30761 -9729 -15057 -26040 -7232 11044 4963 -192 -20286
6048 -20286 -23451 -479 1461 -24585 -33025 -9199 -7963 1702 -8120 -11725 3424 13018 18621 21498
6034 21498 15867 10695 19147 34085 33579 10818 -2131 8191 22001 28131 21703 16999 17211 -1411
6020 -1411 -5730 4956 6253 -6476 10589 -3419 -18638 -41831 -32096 -23992 -13262 -12443 -13055 -7088
6006 -7088 -9456 -21796 -21019 -27954 -26893 -15154 -5677 3777 6971 -7024 -19356 -23370 942 16320
5992 16320 -1601 -13239 -18951 -3605 3902 -8819 -3662 -2841 -6912 7061 9314 -5726 -8984
5979 -8984 -1443 507 -11343 -5552 -7320 -10480 -18575 -40611 -39737 -26126 -1219 18983 17861 24619
5965 24619 22095 20079 5894 -7170 -9070 10318 5941 -6809 -1007 3846 15547 -5676 -12470
5952 -12470 -11098 -13695 2329 12828 -7956 -16566 230 5941 21396 17680 -14294 -19802 -26881
5939 -26881 -32667 -42594 -30507 7260 25617 21874 12824 11204 605 -5789 -12284 -21864 -44153
5926 -44153 -24624 6775 13693 2302 9721 4754 -113 -5150 -24356 -9789 14112 23997 28366
5913 28366 19657 -1527 -11749 -14362 6730 33256 25117 12315 2050 9720 -5250 -15749 7430
5900 7430 9954 8458 20818 10568 8272 12957 8301 -481 -11866 -32716 -28740 -32598 -35919 -42202
5886 -42202 -27887 -37557 -34462 -13589 -3320 -16965 -20682 -31779 -37267 -25302 -10253 6922 32016
5873 32016 48501 17047 10451 2524 -13836 -15921 1799 8909 6331 12246 30569 37573 39480
5860 39480 40463 19652 -914 -6503 8395 16386 27626 34381 32884 21854 9464 23661 32139
5847 32139 16018 6770 12895 18142 26377 31288 20896 6553 2638 11447 2834 -17368 0
5834 0 14715 18869 15114 5860 -3159 8447 8628 3537 -9515 -18871 -26351 -31384 -14522 1224 20991
5819 20991 16744 2053 -8395 -11046 -15397 -33375 -31550 -30163 -32395 -32706 -20517 -13079 -9197 -10527
5805 -10527 2694 4906 3300 -7596 -15370 -20753 -19246 3981 9960 7882 10343 19710 20641 10819
5791 10819 3457 11422 3595 2021 11230 21083 19089 6332 -9031 -13275 -1325 18367 25655 4326
5777 4326 -13679 -9889 -24222 -16533 5307 -3143 -17350 -2891 -5761 -7218 -21226 -7212 -23328
5764 -23328 -16075 2981 -12021 -27631 -30227 -19570 -15458 -19105 -15346 -17156 -27141 -21389 -22576 -30167
5750 -30167 -33155 -860 19909 29674 23239 18501 32076 36670 19793 -6833 -5932 -4836 -2321 -5537
5736 -5537 -1506 258 -1881 -16681 -15913 -8566 -13172 -4589 10473 28740 15995 9720 11943 -29313
5722 -29313 -51188 -36772 -2612 -14205 -32364 -35250 -17037 -12091 -7415 -13931 -31251 -26040 -2656
5709 -2656 4901 -689 754 11459 16581 32267 28044 12846 381 -17507 -3397 -19533 -19292
5696 -19292 -2725 -1958 28491 25476 2791 -3063 27320 15796 7563 9517 24074 10381 -8283
5683 -8283 -30074 -39042 -42853 -25978 -5343 -525 -21960 -21622 -12965 -3265 -4034 -28894 -47676 -28180
5669 -28180 -17220 -15110 -3023 -3741 -30213 -30947 -2257 19855 11331 -2338 -7213 -14383 -23731 -24734
5655 -24734 -24074 -28591 -16703 3602 14292 10297 4091 -11733 -18522 -14898 -23698 -28012 -18177 -5204
5641 -5204 4390 -18090 -29628 -22957 1035 7594 1471 11477 -14228 -39522 -23641 -12883 2002
5628 2002 14915 18674 9351 -392 5309 2603 2558 6213 7265 10 -5022 4276 2522 -16624 -12100
5613 -12100 -1503 3497 -7806 -5696 -19520 -17297 3598 2699 -8184 -8233 -9689 -25382 -30528 -31732
5599 -31732 -13716 7169 8671 -2956 -9832 -20754 -17301 -11133 -32742 -45472 -24632 -13559 -21269
5586 -21269 -20608 -15995 1851 17152 13174 -1629 -1695 -8065 5735 7553 5119 -23906 -21139 -4739
5572 -4739 -2455 -4547 -13568 -13511 -15202 -21252 -15687 -130 6203 9752 1346 -2687 -13279 255 -5035
5557 -5035 -16458 -13627 -1510 -17545 -22408 -18019 -26321 -16374 12339 5257 -2164 -13983 -38341
5544 -38341 -57611 -30663 -2575 -5979 -7909 -10255 -18947 -12029 -21287 -26908 1328 -1250 -13591
5531 -13591 -36155 -42511 -36598 -29236 3014 24735 8729 5884 -4641 -5329 -469 -1955 296 14528
5517 14528 24612 11951 3100 -18339 -18124 918 7953 14632 2488 -14869 -16101 2614 5079
5504 5079 2528 -21236 -16781 2080 6584 14952 14970 3117 19779 33226 19355 7836 -349 -2261
5490 -2261 13811 665 -16398 -8527 -12940 -4027 -7937 -15266 -5315 -13658 -22498 -5032 -14084 -24927
5476 -24927 -15404 2995 -3515 -7690 6969 14829 12554 -14752 -16008 -31479 -8025 4859 11763
5463 11763 15975 10334 14668 26803 30059 27954 22947 -1995 -21748 -7814 12334 28137 34358
5450 34358 29179 36045 16449 1429 4449 1192 -5424 -1077 -5073 -2431 -15437 -25233 -13266 -12298
5436 -12298 -2851 -1764 -17476 -26085 -26876 -22233 -10756 -25742 -24543 -11653 -3272 -8642 -908 -6765
5422 -6765 -35199 -36418 -40225 -12022 21169 20016 -3373 -12196 -27008 -37400 -21303 -19755 -20232
5409 -20232 -732 -13621 -21673 -13974 -10026 -2210 -2695 -18375 -13555 -13395 -11054 -24645 -38818 -43083
5395 -43083 -28176 1250 8939 12102 -11738 -28444 -28873 -23066 -12190 -7264 -15887 -6318 18625
5382 18625 13803 11479 8243 -6720 -19514 -12494 -13706 -23050 -21141 -7707 -12268 -23333 -25344 -19326
5368 -19326 -10776 -2462 3751 5507 3379 14349 20344 10115 -5196 -4716 -22072 -19562 -10791 -12983
5354 -12983 9606 24274 20747 9909 3845 598 -8757 354 250 2730 -9940 -17644 -11232 -9800
5340 -9800 -12665 -8264 -31562 -27721 5292 12537 9936 4539 -8162 13034 21950 8 -3470 12382
5326 12382 18232 10007 12635 3469 -8136 -3794 -6218 -20763 -28475 -16237 -5448 6396 -244
5313 -244 -1190 22018 25925 24005 32751 21808 -6697 -4853 -17754 -3107 3901 -11496 11934 24382
5299 24382 15824 14873 20898 29356 20591 18077 23710 34287 39881 32726 26941 6649 -1617 4342
5285 4342 -80 -522 -6595 12210 18941 23265 6573 -8245 -4441 -7914 2515 9811 -4844 -4746
5271 -4746 -6857 -13896 -10510 -3149 -189 -18577 -21061 453 157 -23108 -27073 -21870 -23992 -18103
5257 -18103 -35316 -25512 -5652 11380 17073 10453 12871 19234 25564 8159 14405 32298 16399
5244 16399 4708 16423 20035 11741 2011 9847 11793 -3149 -16884 -40112 -34793 -14407 1066
5231 1066 14562 31078 24286 12085 27148 35741 8972 -4297 -6268 4816 7690 14387 15742
5218 15742 309 11799 11758 7852 5345 -12590 -23019 -12020 -1181 -10467 -15123 -11505 -8655 -11582
5204 -11582 -10299 -20210 -30926 -34455 -16836 15321 8011 -6209 -11615 -2455 16216 19492 -21125
5191 -21125 -48019 -29096 -11580 -5057 -3587 3030 -767 9240 2523 16958 15195 4517 -8309
5178 -8309 3671 27178 23566 25840 17812 31211 50007 29886 12312 5734 5381 1248 4784 3956
5164 3956 1803 1623 10791 12019 8535 -6070 -22113 -5229 9670 12415 14723 16285 28987 40898
5150 40898 39730 7717 -9206 -10550 -30999 -13101 -10525 -3006 12284 -3137 5759 30272 22364
5137 22364 -7487 4767 9368 13575 11562 20816 15906 26619 23640 9583 10830 18585 18058 16650
5123 16650 19722 14883 20539 772 -23578 -24852 -14005 -27179 -14779 6660 -15350 -38354 -40092
5110 -40092 -53011 -41356 -19637 -10616 -26801 -16034 17181 33165 38117 30644 -3220 -12414 -5280
5097 -5280 251 9093 4150 -8121 -8179 5817 9511 1173 -24825 -32916 -28842 -29045 -32686 -37694 -27986
5082 -27986 -23452 -20088 -17350 -15699 -18485 -16678 -23844 -18316 -3112 16298 23956 7508 -11150 -21576
5068 -21576 -29082 -37304 -7479 9807 8977 5072 -10295 -18601 -12611 -14114 -18993 -17053 -10895 -854
5054 -854 -628 -11691 835 21440 17568 16265 3129 -3358 -11226 -16408 -5759 -30398 -60084 -67980
5040 -67980 -37291 -12857 -12274 -12436 213 3182 -10973 11473 25545 26290 14980 10946 34711
5027 34711 34645 -2862 -28113 -44008 -36508 -26722 -9756 10255 -4330 -12484 3863 13444 19537
5014 19537 15409 12532 17189 18011 19647 43604 39618 46760 61301 54651 43356 31694 33147 19817
5000 19817 20445 29102 22457 21004 11158 1272 -1646 -8036 4167 4706 -8627 -7314 2980 4678
4986 4678 -2584 -5419 -677 -16732 -32279 -19889 -16624 -992 -5694 -12945 -17117 -5923 -2652 -9151
4972 -9151 -10464 -7193 -5959 -1076 9214 5201 18095 18420 27488 -2593 -37811 -32530 -29658 -24867
4958 -24867 -20459 -22969 -27507 -21532 -24349 -31545 -26338 -19115 -17910 1471 18078 25013 29174 40621
4944 40621 45007 41423 39000 31764 1624 3762 3718 8348 -7937 -5085 26385 23610 18105 15914
4930 15914 14705 27814 31179 12874 -3395 -1848 1455 -548 17489 30464 28159 8050 -2083
4917 -2083 -663 10026 35591 39962 35066 36290 27864 24540 15475 13015 -11290 -9329 12446 10859
4903 10859 -5330 -26654 -33113 -34658 -28277 -12725 328 3535 -21466 -15143 -2776 4574 -1489
4890 -1489 -13816 -2895 -9358 -19143 -4078 -12855 -13531 -7962 6201 16039 29160 46575 44652 40053
4876 40053 35008 31145 5955 4178 962 2100 4838 12439 31658 27302 17396 -14942 -26532 -32433
4862 -32433 -34155 -47245 -40990 -25431 -15300 -12397 -3675 -4194 2020 13517 15187 11016 23698 19175
4848 19175 17462 6915 15038 -2218 -18561 -13934 -4280 -9690 -2841 10297 24519 37334 33152
4835 33152 15725 10301 2501 -13953 -9329 8019 3892 -5967 2031 4608 -11796 -9691 5799
4822 5799 10133 11561 4963 -6852 -21840 -13766 -18897 -27244 -31544 -34011 -44531 -50944 -33198 -528
4808 -528 11135 14481 516 -9180 -13102 -15986 -6619 4840 -12321 -23440 -13504 -9492 -7795 -19
4794 -19 6308 -3262 -1394 17418 10889 -3675 -24473 -11807 9711 9966 275 877 5851 -904 -17773
4779 -17773 -29372 -26637 -14899 -3218 2124 -13616 -27192 -12749 1203 14306 34635 34698 38389
4766 38389 37768 10943 -11500 3236 -7992 -40099 -33781 -17416 -28329 -25724 -6339 1877 12157
4753 12157 13398 13960 15521 9273 -750 9743 1132 -6040 3475 24277 34396 8819 -15518
4740 -15518 -10284 12828 8284 -1599 17053 16267 1258 -2999 7660 17932 18040 26266 29067 27086
4726 27086 21026 10167 18926 6649 -10404 -20904 -19764 -7288 -9505 -15399 2678 8334 4086
4713 4086 6669 -192 2385 26279 21311 17495 12683 1304 -12548 -13347 -6272 2712 1887 -11664
4699 -11664 -4907 4067 18915 41596 18777 6330 6696 -418 -7810 -483 3966 -3946 13527 5073
4685 5073 -4246 -362 2993 15349 19820 11510 3913 -2650 -10389 724 12802 23029 27995 44643
4671 44643 36967 19498 4088 2172 16145 8592 8088 12318 17001 7067 -440 -7361 -7434 -7846 19804
4656 19804 40872 42537 35712 22464 24346 21366 7685 -5792 10436 5265 1222 14914 10480
4643 10480 7420 -1958 -190 19502 21967 12546 15839 16760 10112 -14421 -9214 13851 11793 5401
4629 5401 -31 -12857 -22441 -17969 -12426 -11244 -2879 17778 15869 12074 13327 -15441 -11298 -9997
4615 -9997 15395 15040 4692 14441 28707 15485 5317 12716 12426 7756 20825 26225 6344 10717
4601 10717 38718 31276 3273 15158 16400 10076 4174 -7567 -19525 -25093 -30908 -13273 -378
4588 -378 7506 18324 37858 52820 52684 47440 57292 52273 26872 21268 8008 -2511 -590 30397
4574 30397 33009 10816 8392 927 872 -13380 -6622 6027 7034 -6523 -18929 -22143 -19084 -8596
4560 -8596 -9883 -8939 -7399 11822 34980 36808 29284 12379 5588 13747 11457 14175 1742 11795
4546 11795 22577 7633 -4218 -13286 4827 2332 -18636 -12833 -2480 -11043 -8533 -15834 -13526
4533 -13526 -24211 -30379 -28695 -21568 -11391 3445 16128 24868 23953 22992 10282 6572 6169 15654
4519 15654 16228 15285 33445 31509 13888 12322 16802 6036 10642 17353 4100 -28909 -29122 -4246
4505 -4246 7983 3926 13521 19714 8172 1169 26558 21448 12010 14432 12129 -6058 -25689 -8565
4491 -8565 26161 10491 -17743 -23351 -14495 23310 14110 -13042 -38320 -9659 11966 24906 2751
4478 2751 -15190 -30630 -44773 -32648 -20238 -5900 -2613 -9184 -7001 3641 -322 -19654 -20765
4465 -20765 -21373 -19781 -28017 -11750 28335 24436 10923 18834 21161 3027 2923 -13961 -17093 -6809
4451 -6809 -25362 -16221 8599 15973 6732 2336 13915 9113 -1818 431 -3911 -14962 -29868
4438 -29868 -33772 -18634 -8427 -3471 21619 44152 36509 26148 27961 7162 -13354 -10981 -131
4425 -131 15425 20644 12271 14370 17433 1620 5640 -11863 -12623 -2443 12247 -9367 -10878 -11694
4411 -11694 -8509 -8761 -17522 -17216 -4457 3113 18204 19968 15543 17929 4978 9162 21038 19104
4397 19104 7785 -3931 2097 -3779 -11791 -20512 -21163 -6429 -3389 2489 27206 25938 26006 9602
4383 9602 12605 30219 40950 38485 30106 16055 47648 46138 47497 43140 29437 25805 26571 6176
4369 6176 -2439 1555 -13080 -3265 15707 34390 27306 28066 19993 3593 5998 -2358 -19809 -11832
4355 -11832 4870 -5647 -24688 -21386 -1169 8461 -2873 2510 16861 18513 7009 -19708 -27938
4342 -27938 -25114 -21515 -2350 -25239 -35586 -21039 6571 25084 25523 24408 -16688 -28550 -24958
4329 -24958 -14375 280 9861 19594 33601 -782 -4816 1513 4057 8961 28068 41548 42098
4316 42098 29516 14139 7245 11544 30136 19025 6695 -1267 -13630 -23357 -36649 -26056 -15159
4303 -15159 -27427 -31301 -40622 -42167 -28111 5596 -4750 -8625 18805 12874 22132 23454 15442
4290 15442 -2685 2846 -218 -13231 -7710 -2777 -4043 -9071 -12007 -3771 8758 5244 -15852 -16111
4276 -16111 -9064 5890 3519 -1208 449 19532 24196 9615 3465 21212 19597 1764 -4401
4263 -4401 1695 4382 -9352 -9756 1867 7775 4005 7242 11836 23465 30718 37410 27625 13879
4249 13879 23746 22998 20619 24922 41201 39130 17482 16918 13949 7151 9256 9388 21082 2727
4235 2727 2316 11874 12611 -1401 -7476 -6181 10696 29845 42494 35238 20128 5629 -5601 -22032
4221 -22032 -3725 -361 -14783 -11740 -5025 16739 27518 22933 17203 1301 -19143 -15326 2435
4208 2435 28579 45294 33527 6194 -5636 -18941 -18202 -6624 -2424 -472 -7027 5611 8604
4195 8604 -1012 -7188 -20088 -11064 -15412 -9071 -8337 6607 12296 11769 -10172 -21867 -15464 20476
4181 20476 22072 19185 13610 11044 15913 23579 39918 52760 51283 54917 35041 35404 26254 5406
4167 5406 8161 7210 -11322 -11234 9125 6472 -3328 15116 10476 11029 15230 42808 50061 47139 26270
4152 26270 20868 18949 24824 22115 12017 -14418 1545 16842 24758 1750 -9198 4831 18598
4139 18598 15565 13549 17060 22389 8339 -8807 11392 23555 17369 27255 29534 25121 1278
4126 1278 -2936 2235 -12447 -2947 -65 -5937 5340 14682 8937 11498 9508 22890 39368 38638
4112 38638 44455 23694 38136 62597 52419 26148 24859 17666 17206 1482 -14676 -12735 3281
4099 3281 2827 -9846 -16138 -5084 -6971 -7233 -4733 5420 13862 14377 13683 11826 16455 3429 2329
4084 2329 12102 7526 11796 19556 18691 18668 23475 32945 13484 6538 1405 1746 5697 22746 30571
4069 30571 14651 429 15356 9811 14005 44 13410 22929 2542 1086 46 -8547 -6230
4056 -6230 -9874 -24351 -34519 -34768 -30224 -29593 -26674 -10603 10031 16289 4242 6752 26431 34561
4042 34561 26324 3313 -1064 10226 6495 27121 13912 -12299 -12326 -11166 -12524 -16864 -20899 -25058
4028 -25058 -18062 -6864 -18001 -26524 -18604 -18414 -13648 11387 32354 33377 18431 20763 36948
4015 36948 27040 15671 19432 20400 12658 19506 21666 30512 30232 23905 16375 -4579 -14136 -4462 13067
4000 13067 19326 16439 5017 17864 -1491 1161 -16652 -16986 -22043 -13085 3083 2468 7037 14485
3986 14485 10773 9042 41497 33405 19381 17620 8098 -1392 -4122 10062 13712 12555 16791 16030
3972 16030 7856 9263 14906 13556 32648 43186 39168 53439 62891 35514 26534 12465 11064
3959 11064 18048 12804 -3210 -15240 1681 7459 -10638 -15722 -5838 -13869 -12258 5142 16924
3946 16924 23280 26954 23227 21211 8235 -8840 -18916 -3376 -2645 -8375 -10100 -20719 -15607 -6815
3932 -6815 -10778 -6790 -17767 -13902 -4933 252 -11685 -8941 -12294 -3705 -3454 2473 -52 -18367
3918 -18367 -23489 -17037 -3590 18296 23804 30099 30762 12633 5666 10108 28042 24894 13475 1191
3904 1191 16445 26849 24254 16082 -2407 -7322 20726 11634 538 -9603 -6841 10620 11970
3891 11970 10295 21919 24810 14929 -10461 -28826 -31864 -21479 -12126 -8619 -9107 -14307 -41086 -44359
3877 -44359 -14117 -279 -16803 -17836 -13686 -9060 727 12277 33899 23929 11493 -3430 2442
3864 2442 293 21315 30036 26883 15683 15647 27557 27598 13493 9560 14893 7556 6109 21526 4943
3849 4943 -9522 -16352 -24181 -28815 -19161 -5994 -14478 -27504 -18826 -8798 -7696 3532 8576 19158
3835 19158 7690 994 -598 -2774 -12946 -10413 3604 -5959 -26683 -20723 -27716 -20765 -8610
3822 -8610 26626 23214 253 -5029 16993 37719 46688 26947 27227 55091 61438 41217 35615
3809 35615 32405 6050 -5312 14864 16809 16055 13616 -7723 -15019 -10781 -6250 1079 -9383 -13586
3795 -13586 -16067 -7673 17947 30211 17667 4515 20483 19942 -3967 -13007 3261 8713 -16249
3782 -16249 -588 6416 8340 16760 19717 17245 3419 -2165 9179 -4336 -7417 4934 -497
3769 -497 -15506 -21793 -24966 -14731 -20051 -24569 -30348 -20253 -3440 10867 20260 26660 7179 -17530
3755 -17530 -33942 -9586 10269 2476 17 16486 6887 -1623 4278 3118 8705 7361 -10069
3742 -10069 -19176 10439 31638 43977 41604 50707 37956 32282 22132 31037 32537 28967 12239
3729 12239 9050 3973 13674 19370 16051 12519 8347 13213 20310 4844 -7458 -15385 -1078 17157
3715 17157 12067 -5246 -6502 -9041 9810 10489 5591 9439 13397 14085 53 -11299 -11410 -14746
3701 -14746 -24379 -26549 -33894 -17762 1213 8794 1570 446 -3758 -6500 1454 -7132 -14330 10107
3687 10107 28827 23098 21668 12791 -11862 -15957 -18497 -26594 -3726 -3350 -20181 -17862 -26391 -27123
3673 -27123 -16636 -252 4245 1723 15719 9047 4323 -704 2508 11836 11599 35812 33867 11926
3659 11926 10720 14299 6790 3185 7704 16381 31762 27956 30491 30456 24347 46708 51992 48090 51023
3644 51023 38782 17369 16401 16611 31255 46009 39871 41863 41305 25625 22278 31457 43472 48418
3630 48418 43876 26463 5957 32243 48623 34995 31113 20689 6515 18826 12579 8924 1461
3617 1461 7277 13063 23925 12052 718 -18406 -37124 -27187 -43917 -31110 776 18907 18184
3604 18184 7317 22518 25374 23436 38941 39315 37128 30621 23158 25889 2829 -10736 -23555
3591 -23555 -18170 2964 -12706 -14721 3727 13435 3625 4190 907 17338 29330 22820 -2208
3578 -2208 -2944 9106 9134 13463 23994 17912 -1179 9001 14483 20538 28317 30180 38116 19993
3564 19993 5932 -7624 1820 10473 -1895 4321 8165 11361 29137 36871 40227 53501 51329
3551 51329 25126 17012 16330 41359 55037 48277 35079 27136 21274 14080 11059 6694 -4761 -12225
3537 -12225 4947 8300 -17921 -23290 -10073 4593 -238 -2112 7774 19221 11947 -9124 -7263
3524 -7263 -13701 -15221 -27282 -19365 -7460 -10023 -34172 -23128 -8390 -8299 -9846 432 14131 11138
3510 11138 16485 18584 -2043 19861 37860 37970 37027 30366 22903 17694 25488 36261 31516 33104
3496 33104 19965 7750 -14505 -4258 -11426 -10834 8332 26017 31225 28046 34857 47299 48090
3483 48090 43130 19462 19746 29072 30996 19413 -1507 -12166 -10863 5320 9619 25645 23296
3470 23296 2917 -19338 -24603 -16373 -13508 -16129 -37705 -27850 -8364 -13850 -8610 -6270 -21758
3457 -21758 -21975 -20107 -18167 -12472 -8197 1486 18559 8228 9030 24581 27360 30692 23136 11095
3443 11095 14627 17451 6086 9242 9377 12275 12281 16872 7514 5249 -7387 6981 25025 11292
3429 11292 2122 -6032 -15350 -4074 -1165 16527 30723 35964 16460 5480 11054 7234 17340
3416 17340 20706 17535 18787 20411 7214 12327 3583 -5537 7736 322 -12985 3831 -8256
3403 -8256 8564 17428 9640 -6614 -10559 -5894 14510 10489 11515 7119 4198 -4626 -16240 -18743
3389 -18743 -9464 -2808 -4945 13611 18580 -9234 -16479 -14081 -8344 1579 11950 21741 1115 6880
3375 6880 12264 17627 18285 8761 17881 15182 15411 35429 36531 18043 23705 21928 11818 -542
3361 -542 -7412 -4463 -2857 -5390 2829 7031 4414 10197 19471 27769 27231 23186 17985 13736 11246
3346 11246 4847 5892 9248 2838 3585 -16392 -32383 -15101 9714 17894 17522 1507 -2471 -5464
3332 -5464 6947 -8236 -14714 -14609 -12880 -15429 -1858 -9324 -8313 -9915 -5065 -11502 -6413 4589
3318 4589 18833 5093 -4826 -18300 -34974 -50273 -33382 -8344 6754 15711 3198 -754 -1285
3305 -1285 4719 16335 34305 43738 34506 36857 28025 21199 15486 2588 10892 3072 14298 25252
3291 25252 18463 19732 10733 17591 43464 38031 26553 19593 27192 27629 17520 -1330 -12252 786
3277 786 15924 10576 -1705 -4805 -10753 -21935 -13785 6469 -1470 13205 16360 5789 1304 6857
3263 6857 5452 -3494 -6819 3973 15473 22964 30767 23198 13516 -309 -7535 -6357 12822 25125
3249 25125 12641 2133 -15694 -18645 -16431 -19162 -1907 8834 17818 35688 18366 10172 3889
3236 3889 8885 26382 33245 33980 23186 7447 -10443 -5394 7567 18020 17210 12579 -268 -1444
3222 -1444 -8955 -25626 -27599 -7559 -4544 -1855 -4882 -1936 13116 27783 25303 17541 11935 16313
3208 16313 15117 15215 11242 10090 4252 -11734 4413 9717 11909 10964 -10931 -16461 -20989 -22131 -4007
3193 -4007 13038 14713 8078 8132 11617 -2100 12356 12639 -15265 -23945 -27315 -25885 -1259 5912
3179 5912 10140 6728 -7088 -5900 13209 21225 13824 15564 22933 21082 1847 -12616 -37281 -45836
3165 -45836 -37995 -25665 -12681 -11021 8030 15484 13251 23971 11504 4816 5892 6068 -1576 -4499
3151 -4499 -2623 7639 9380 3983 143 -5410 12642 8318 11927 34195 36385 22144 6410 833
3137 833 13845 29915 29330 18186 -451 -8282 -16125 -9113 13407 35098 27958 13651 2772
3124 2772 12038 14153 14933 7990 -3926 -9268 3134 22690 23950 21412 3104 3625 9120 24550
3110 24550 21355 17994 14989 -3552 -5097 -4775 -13075 15866 24755 29975 22588 23996 10612 7397
3096 7397 -2903 10866 33653 -1518 -4311 -11176 -16121 -10831 5474 18677 4277 -13137 -10392
3083 -10392 3416 8000 10389 37924 55331 51345 33839 15016 3214 1332 12952 18027 4579
3070 4579 10833 3426 14918 52225 55764 26101 9410 -4177 769 18503 14994 16520 19341
3057 19341 2168 21241 32971 33354 14730 10460 11634 904 7128 17508 11991 -15976 -25058
3044 -25058 -16389 -15561 6803 10868 18765 12460 -3171 -16454 -4480 12264 12498 7368 11007 7560
3030 7560 -2431 4381 4271 33000 48195 41670 30066 11835 -4251 -15659 -17899 -21612 -53087
3017 -53087 -47519 -18862 -17959 -2717 7191 -5316 -1533 12898 13502 4006 -15703 -18879 -12767 -14222
3003 -14222 -7339 -5542 4127 5918 11100 17365 27245 10500 6599 432 -2113 -8457 3065 8029
2989 8029 -4162 -13822 17810 37457 40331 22453 33770 35016 34487 16570 6574 -16416 -43874
2976 -43874 -21955 -7883 -9407 -6313 -8125 -10405 -12965 -2504 2824 -4860 -1508 21329 33989
2963 33989 35584 22561 15258 14945 -10388 -16392 2278 15990 29498 20647 10757 19469 17358 6981
2949 6981 18200 20108 13415 24941 39816 40108 30206 20231 17775 7560 -1409 -14180 -6062 8385
2935 8385 19453 7995 -8915 -14944 -22051 -8850 -11467 -22469 -3292 2450 11509 25746 12112
2922 12112 5644 28288 33938 36490 32372 17707 13868 16938 22778 25717 32859 30520 16339 11735
2908 11735 -7868 -934 23319 45177 18456 -5868 -1777 -7412 -1544 -10792 -3902 18926 29020
2895 29020 27434 19012 10143 1356 16204 13345 16079 -3593 -12907 -108 4311 13964 19353 16813
2881 16813 18395 19035 11479 19466 35087 35294 20558 2859 4830 -10459 -14209 -931 -7181 -6646
2867 -6646 16021 17407 13703 33187 30872 29821 37512 21539 16984 23034 22014 26629 25394 22894
2853 22894 19726 22435 25991 44617 64860 49679 22244 10629 -9858 1412 20682 20615 169
2840 169 1441 7383 7543 4715 15946 21065 24788 29110 17011 10942 9159 15984 14655 2191 -3637
2825 -3637 1036 7085 2163 20430 17659 14374 11553 11660 4811 8322 26360 20942 -3974 -7680
2811 -7680 1930 10834 5124 1780 11563 27305 35508 40281 51971 31677 7706 20368 14431 18711
2797 18711 7613 8435 -531 -8591 -7474 -8784 -9512 -13852 -7169 -3402 339 2237 13849 9988 -34539
2782 -34539 -31445 -22296 -14510 3898 11446 24392 16610 15468 23075 10357 11098 11309 19946 539
2768 539 -14888 -4619 -587 4261 5369 -4369 -656 -8461 -21265 -20866 -18307 -13183 -7946 -4832 -7371
2753 -7371 -14951 -7126 8256 6050 6775 267 -10777 -13273 -27312 -24375 -14493 7633 7369 72
2739 72 -4088 13 12351 21704 14418 14351 6968 9852 3919 -9586 -3222 14459 11386 2879 2497
2724 2497 -9644 -3618 7015 -4844 9449 2205 -16442 -24621 -7434 7887 -6076 -17706 -11890
2711 -11890 -10850 -10138 -14212 -12448 -12839 -9030 8244 4610 11263 23377 13665 21501 21221 16131 26563
2696 26563 28943 6023 -3802 -1105 -16461 -24871 -10094 6724 13453 3070 -2232 -107 13667
2683 13667 10474 7212 15160 17804 19117 5403 6943 -18119 -31162 -15187 -7648 -4575 -2427 -1774
2669 -1774 6746 8681 918 2659 -6075 -29428 -56837 -43079 -19611 4770 -402 663 26276
2656 26276 22723 9685 21429 19758 5599 16554 8430 -6415 -32811 -27735 -20382 -12007 -14454
2643 -14454 -13733 -3113 6681 372 -9302 -5748 11268 18255 17065 46352 46724 32065 22057 20331
2629 20331 10016 -12408 -11221 -2092 5422 -2441 -13833 2127 19327 17115 19418 15559 9938
2616 9938 8867 13649 8091 6344 22624 16634 15485 12010 12988 -2015 -4203 -1956 -25472 -37515
2602 -37515 -26771 -13494 8708 17338 6082 -18396 -19720 -15272 6522 27155 35059 30444 11303
2589 11303 8848 18107 11775 13561 23889 32593 22414 21257 34621 38778 22569 -2416 -9177
2576 -9177 -26707 -10471 8778 13524 3961 -2614 16754 40628 36124 27786 25946 16476 8165 15749
2562 15749 20119 1784 5557 1989 17302 18433 17058 33192 19383 4786 19216 29520 32754
2549 32754 25627 23059 12091 4217 8876 -1042 5194 9559 5098 8292 4113 9765 13370 -934
2535 -934 -13774 -11431 -15475 -8519 21030 34402 32716 39692 24687 2843 14953 14742 17719 21804
2521 21804 28070 12773 5445 12887 7002 7046 16680 17340 5920 10398 2801 1390 6220 10246 15735
2506 15735 24522 25015 -847 -13734 -9979 -12171 -7567 746 -3656 1966 33280 23566 2723 -10842
2492 -10842 -32045 -23211 -19265 -6297 -10898 -19260 -9506 1280 17994 484 -10172 -1515 -142
2479 -142 -3628 1013 -684 4758 2073 -2958 11638 11923 2132 3667 -3978 -10217 4077 17100 24416
2464 24416 16554 12769 1550 -15649 -19281 -22028 -28555 -20291 -1880 23854 24869 8492 11158
2451 11158 -744 15204 31490 5959 -8698 -4316 -6826 -1135 10239 11662 9303 8428 13682
2438 13682 19288 18548 7167 5730 19210 1902 -9677 -20073 -17671 -14568 -19517 -17855 -26580 -23400
2424 -23400 -12866 4920 3527 -11778 -15447 -15546 -412 9235 34301 45397 21984 2866 -13303
2411 -13303 -18407 -26757 -23596 -1616 7696 7290 758 -10829 -16183 -32269 -14350 5242 12745 35739
2397 35739 30207 25595 29307 28288 13708 190 14935 15102 12657 14153 2563 -16399 -22336 -11568
2383 -11568 -10009 4489 16491 10140 -4689 -13451 -6163 3417 17184 24725 25698 15345 19042 15528
2369 15528 6597 21015 30029 37602 38001 41744 25909 17642 29179 28537 17725 25826 21767 -11702
2355 -11702 -29256 -20171 1917 14687 15655 -7662 -7004 19205 31878 26392 22406 28286 18638 3697
2341 3697 9080 3155 8101 -6786 -13534 -9769 -1298 -2159 2415 7292 -952 7979 15206 17062 29864
2326 29864 32055 13797 -15197 -15529 -7878 -24822 -30298 -5232 6481 -2898 -21374 -15663 -9489
2313 -9489 -1960 -1697 1997 4724 9217 8145 2517 -1765 -194 7051 19456 5428 3535 24536
2299 24536 25590 34717 35207 29081 12812 17554 9375 11535 8784 20114 18517 25897 27708 26801 8934
2284 8934 7480 1490 4545 20763 -4654 -13231 -27859 -35782 -11392 7708 -4787 -17151 -11954
2271 -11954 -4284 -1861 -10637 6664 6056 -5572 -2100 8078 20150 10615 -4727 1370 3140 1278
2257 1278 5765 9366 1726 3464 -9668 16101 30933 25017 20490 10132 9770 -18147 -31224 -26388
2243 -26388 2981 3995 1654 19074 13555 8116 21703 14669 4792 1852 6614 13013 20868 28763
2229 28763 22902 16614 9999 11106 20490 35328 53025 31432 7371 -1796 -1825 13708 8335 -1375
2215 -1375 -16051 -7252 22260 24085 23427 34108 22372 17219 37453 54551 38338 14468 13368
2202 13368 -407 -23254 -31547 -24225 -21059 -9285 -14224 -5389 4786 25538 36026 24357 14020
2189 14020 3706 -13908 -4471 15587 18611 6204 -5396 777 16070 25240 4229 -7864 -1451
2176 -1451 -10176 -4654 2925 11883 49966 64846 44695 37451 26578 32878 23968 26825 4032 -10743
2162 -10743 -21984 -20511 -8916 -3223 9732 8072 -9161 -563 20545 18580 7547 -8586 17443
2149 17443 40282 42393 27021 39605 45771 46499 32057 26138 39769 32633 20019 5518 -39
2136 -39 -4272 5677 13014 16327 23858 12889 9726 9946 5463 -15250 -18429 -20247 -19838 -17732 -31168
2121 -31168 -21914 -4428 -14048 -25014 -18347 -17109 -6789 9863 8821 18815 23053 11914 -15121
2108 -15121 -2321 18925 15435 5517 -2331 2971 11996 18461 18172 17619 -10791 -19006 -15725 -15153 -10324
2093 -10324 4132 -501 -17931 -32486 -26940 -18881 -20364 -22571 -35324 -33768 -12847 -2140 -9497
2080 -9497 -10916 -3169 -14358 -18199 -2079 3510 5664 -3451 -4536 10680 34072 29451 20077 3841
2066 3841 -9520 -2452 -12642 2375 -12657 -8265 1195 -4176 -30787 -23064 -22498 -6660 -5277 -3114
2052 -3114 -1538 7407 8532 -8912 -14997 -13092 -13633 9589 25006 24515 22403 16537 4654 31
2038 31 -3862 -15627 -21240 -7020 -10132 -5447 4730 10488 -4330 -7323 16947 21052 9566 19443
2024 19443 8971 5494 10826 23566 13614 12169 11204 13739 6694 -7839 -710 5170 -652 -19579
2010 -19579 -21354 -15696 -45 11060 6936 -8633 -19149 -3554 1828 -7069 4003 -2125 -4157
1997 -4157 -1648 -3396 764 1116 8189 1731 -981 11595 7470 1566 13919 30137 21770 -1401
1983 -1401 -10165 -27508 -27169 -23155 -18141 -9501 6042 13108 -1068 -379 7211 16373 3688 -9562
1969 -9562 5371 11600 16830 31576 32210 23594 22830 28432 19535 9404 -2903 -7777 -17607 -38976
1955 -38976 -24076 -5421 -1702 8451 7262 21940 10338 4252 8521 2349 -5906 3645 14473
1942 14473 15498 12464 13697 15594 22663 10211 -7227 -83 -3851 -23937 -33997 -22315 -28866
1929 -28866 -39117 -24259 -12432 -1444 1130 -6592 1809 -7365 -6635 -11183 -8309 8433 16995 21265
1915 21265 19576 -1306 -18186 -40967 -41751 -38883 -17792 -7677 -1255 -2574 -20749 -8776 -2007
1902 -2007 19210 38012 21307 10025 9746 23753 6016 -18035 -38310 -25365 -8494 6320
1890 6320 13116 11029 16482 14859 22701 27433 22882 21813 27749 24017 20276 32126 30683 20140
1876 20140 16263 3952 -28333 -36119 -12909 2048 8023 21521 15670 15600 -2330 -7866 5042
1863 5042 29817 27031 12387 2812 -6606 -7493 -11648 4565 23612 29446 21483 29208 26760 4483
1849 4483 -8170 3886 9292 5423 -6304 -30672 -32317 -29023 -5371 18408 5886 7518 -10490
1836 -10490 218 18070 17724 27971 21444 13324 14499 7805 13550 -4773 -39459 -31540 -20746
1823 -20746 -23821 -32745 -13664 6223 -323 -17194 -11642 -10769 -26476 -22038 -20409 -23765 -19086 -4766
1809 -4766 15120 8522 -7684 -29006 -29086 -16655 -15772 -15282 -6700 7905 7659 -3487 -13592 -12732 9856
1794 9856 -3112 -5153 5387 7526 -2386 -8737 -4762 -30551 -28352 953 33047 38831 51253
1781 51253 35987 24563 12369 878 12719 10867 14873 20397 4857 -13105 -2747 1023 372
1768 372 -2744 -11148 -10653 4804 8857 -904 -1744 13544 15653 4563 12171 14991 -8217 -11502 -14834
1753 -14834 -8608 -15186 -28759 -21649 4815 21432 21325 33334 19095 18324 18032 17570 17311 554
1739 554 -5868 -16035 -12364 1778 -3040 -7771 -9643 -2636 10420 3960 -825 6208 969 -3824
1725 -3824 -8939 -17462 -16413 -24402 -25028 -33162 -30880 -1611 2843 4015 1293 12081 17563 10644 2217
1710 2217 -13222 -5339 -1360 161 9216 -4006 -11068 -16775 -5747 -7539 -16369 -14198 -28856 -40317
1696 -40317 -42811 -45794 -25835 -7343 22879 21149 12659 12421 23734 32173 20882 9286 -558
1683 -558 -5241 -4673 8455 1170 -5488 7038 14236 12787 20060 17776 7229 4074 12986 8808 -7581
1668 -7581 -9246 4096 587 2240 8088 -13396 -27497 -9749 -7330 -10650 -4870 -22569 -49463
1655 -49463 -59093 -51346 -42520 -11419 -90 21416 25856 23922 45727 51473 27009 13186 12968
1642 12968 14319 22348 20172 186 -5814 -4099 -23298 -37892 -26921 -8962 -4098 -10604 -6146
1629 -6146 6659 5971 13097 29021 21708 12350 8746 6549 8506 -3568 -8991 -24365 -29289 -33225
1615 -33225 -30986 -2741 -1445 -9945 -25553 -9163 4747 18363 14609 13604 11088 21187 17893
1602 17893 3974 -8905 -11008 -6599 -13867 -26424 -14040 8828 12547 4945 10576 6423 18522
1589 18522 7128 13826 15029 14635 -6868 -18203 -17591 -23587 -38326 -46594 -17274 1541 -5902 -34441
1575 -34441 -46529 -42736 -38036 -32376 -16553 -7698 -6679 -2869 3608 2664 4825 -7209 -18225 -22235
1561 -22235 -22758 -19340 -11406 8201 19863 37049 9180 -22715 -19661 -16482 -16351 -9828 -2813 -381
1547 -381 -4663 -5992 -17107 -12665 -2017 11996 3640 646 -7691 -17562 -3673 140 10948 12780
1533 12780 18753 29388 28860 7333 4187 6300 9458 19489 15887 -5669 -5184 5574 -10464 -31475
1519 -31475 -36729 -38222 -31149 -20759 -27864 -22281 -19154 -32338 -13935 15309 10191 12337 17894 20367
1505 20367 1511 -16305 -21301 -14908 -23326 -34415 -41085 -28895 -28882 -34739 -19165 -2472 12499
1492 12499 11209 -19507 -30261 -20709 -20406 160 -14654 11859 928 -22456 -34488 -30906 -45574
1479 -45574 -55242 -22966 9134 11548 2091 5745 -16603 -24288 -35808 -32313 -27908 -19872 -9849
1466 -9849 2049 17595 11044 -1050 7981 23665 32483 20517 17133 7060 6997 6647 -2907 -28323
1452 -28323 -21872 -5327 -3275 -1736 -7304 -35993 -46403 -38368 -31815 -36541 -31912 -26957 -11621 -18017
1438 -18017 -12628 4906 21398 9366 4458 -322 -1620 1101 -11322 -39355 -34511 -22205 -23349
1425 -23349 -11821 13068 -3909 -32486 -45339 -29093 -28579 -16260 -7927 7331 10412 21026 25928
1412 25928 12442 4044 -16352 -29652 -47070 -39071 -27657 -21899 -20546 -23133 -18402 -14375 8327
1399 8327 32213 22062 -2327 -10252 -24223 -10088 12096 12834 20711 31137 17342 2810 -8876
1386 -8876 -13768 3561 3439 -9112 -4048 -14984 -21488 -5743 2783 -9886 -8702 2559 -8605
1373 -8605 -25391 -22004 -4229 14771 3309 -14666 -14633 -12803 -30949 -28687 16024 29323 28457 11076
1359 11076 -2771 -10616 -17783 -7889 4469 -21916 -19255 -11492 -15885 -18844 -21686 -23419 -12222 -7052
1345 -7052 -7832 -2050 1135 6353 -5019 -16444 -29929 -24167 -18808 -17523 -22088 -16644 -18588 -31326
1331 -31326 -31428 -19002 -10828 -19151 -19970 -19220 -9370 -8174 5325 13189 14161 5417 -9094 -4163 11765
1316 11765 312 -78 2314 -8901 -9554 -10441 -21827 -15596 -12813 -10482 521 -5787 -35535 -32521
1302 -32521 -29521 -23547 -3905 -5126 -11925 -21653 -34225 -32470 -35726 -41565 -19622 2890 1380 -10952
1288 -10952 4767 16010 25665 23810 21519 21198 11599 5170 3612 -2139 -15234 -8488 9784 4261
1274 4261 -10522 -19929 -17961 -5621 -1683 12159 8654 -13339 -3782 5687 4643 -10017 -3586 3973
1260 3973 -14348 -18470 -13577 6441 19442 1627 -5394 -17133 -15424 -16503 -16682 -12960 -5183 22932
1246 22932 17614 2849 -18173 -9732 -10687 -5354 15744 692 -10518 -31488 -39475 -13507 8978
1233 8978 -1152 6694 10316 -9334 -49729 -47389 -33307 -19503 -13839 -21931 6876 23683 14723
1220 14723 -4585 -8976 -7714 -2123 -438 -6676 -5667 4631 4351 3717 3395 3426 8946 1964 1079 -6961
1204 -6961 -8097 -8454 -13835 -7046 -24020 -32152 -26732 -29977 -34509 -22790 -5272 5271 3342 13444
1190 13444 3750 14328 8954 81 -18146 -19465 -20895 -26603 -41794 -66655 -47799 -41060 -31540
1177 -31540 -32119 -17914 -5925 2491 2810 1879 2059 -20185 -19574 -21494 -24255 -12712 -11895 576 7853
1162 7853 -7962 -15207 -14257 -2060 -8507 -20554 -18004 -19088 -31791 -35283 -20875 -8363 7198
1149 7198 5744 -8768 -8087 -13676 -16569 -23510 -36742 -30093 -10189 -9710 -11792 -11744 16635 19574 12889
1134 12889 6420 -91 904 2208 5412 24292 34193 33490 38713 47536 45427 25949 19240 20982 13746
1119 13746 9429 3605 6935 -4385 -17368 -23021 -20085 -34238 -38107 -34888 -40438 -22845 -19358 -10037
1105 -10037 -15324 -13861 -22163 -20696 -28094 -41240 -24065 -18624 -12241 -16437 -23891 -17384 -15773 -20155
1091 -20155 -16671 -6820 -7911 -15144 -19357 -26361 -32782 -21036 -27286 -28716 -16324 4245 2762 -9956
1077 -9956 -18536 -10532 -2390 7586 22984 23562 27421 21010 12834 3957 -19742 -25226 -27369 -25274 -8228
1062 -8228 -5016 -7523 -7868 -25080 -25761 -12945 -6094 10032 8437 -2793 -19843 -24262 -11581 -13184
1048 -13184 -20760 -19802 -23587 -11653 -6030 -11457 -2205 -14306 -14551 -7461 -16135 -21165 -24786 -27209 -25362
1033 -25362 -20451 -20138 -26496 -20093 -28055 -12343 -14167 3026 -2928 -8262 -3166 -16438 -8328 -8898
1019 -8898 -27594 -47955 -38643 -23803 -17114 -27997 -38188 -17045 -766 -17197 -15154 -11952 -3878
1006 -3878 9056 -4569 -27978 -19242 -6914 -9451 -20254 -8472 -18151 -27834 -21265 -8160 -13950
993 -13950 -23357 -12037 -1295 -107 13812 10252 -11505 -20661 1766 10037 19614 29171 5422
980 5422 -10501 -23222 -14289 -18720 -14388 -2600 6773 18977 32767 7859 -811 9695 8472
967 8472 -17492 -21149 -20286 -37618 -35845 -15321 -12539 2443 5523 -6727 -21531 -15766 -5549 -9590
953 -9590 -12660 -23941 -45449 -41890 -12250 -1876 -8330 -13278 -29625 -33458 -34979 -29524 -39336 -41679
939 -41679 -48499 -47972 -47114 -36607 -11535 -4460 -11208 -29656 -24609 2835 4549 483 -12166 -25517
925 -25517 -33625 -24752 -14693 -15091 -14355 -26449 -23399 -23793 -38418 -34805 -25296 -15637 -27440 -44473
911 -44473 -37750 -29799 -21232 -9359 -10351 5451 -7693 -32130 -36022 -25542 -15714 -3939 -3054 10507
897 10507 1204 -18352 -25629 -6698 -2262 3071 5819 11012 31795 11548 6986 13989 -3697 -12442
883 -12442 8108 5049 -22389 -24081 -14874 2442 -10081 -33294 -30093 -23452 -17282 -4039 -13895
870 -13895 -21027 -16994 -14404 -21808 -26060 -28360 -23955 -39623 -40107 -30031 -30437 -31648 -35929 -34929 -28868
855 -28868 6226 18133 28288 24151 -8583 -18636 -36166 -26262 -36601 -57196 -48124 -41334 -43739
842 -43739 -42911 -23265 -10012 5310 13651 11941 -1083 -9068 -16978 -38670 -50271 -49025 -41174 -13692
828 -13692 -4200 -13188 -18173 -16710 -24040 -30561 -26994 -35237 -19655 5282 -4134 -9426 -14745 -15253 -30514
813 -30514 -34453 -33618 -33472 -34484 -37588 -28814 -41144 -45035 -27709 -20879 -9638 -13666 -37473 -38274 -14467
798 -14467 12332 23697 12212 15553 32859 14781 -4512 8595 -1661 -13395 -18208 2785
786 2785 -9904 -24906 -15514 -22336 -19332 -6511 -3679 -13925 -21328 -28548 -34515 -27222 -33808 -40546
772 -40546 -49925 -42794 -45104 -62973 -83967 -81329 -52438 -30077 -12633 -13404 -25281 -32337 -33333 -44142
758 -44142 -49678 -57871 -45713 -40548 -35437 -27374 -34989 -29487 -13188 -5430 9255 2866 337 6104
744 6104 -8402 -18526 -19598 -38574 -38487 -25528 -7499 -7558 -12573 1276 9664 -8519 -12726 -14420
730 -14420 -17599 -12681 -17340 -8709 -8894 -22033 -21201 -18739 -21982 -9445 -9441 -22501 -14815 -21049 -23925
715 -23925 -16439 -14544 -11955 -17416 -9041 5605 6057 -4471 -11479 -19525 -40391 -32728 -25673 -14936
701 -14936 6876 -8362 -39330 -29050 -13440 -20331 -17110 -13052 -24358 -20753 -11747 -14030 -16703
688 -16703 -10967 -10365 -11903 -16938 -41025 -58791 -47380 -34365 -46533 -63895 -70104 -39070 -15920
675 -15920 -10130 -17275 -31300 -36542 -36858 -40324 -39963 -37802 -44249 -41497 -27346 -13978 -9478 -7665 -21291
660 -21291 -34191 -48774 -48396 -41125 -35822 -31662 -51466 -56971 -39473 -34181 -22151 -30613 -26817 7147
646 7147 18577 3607 -18585 -27101 -8762 3512 -3302 -11742 7339 -8451 -24108 -18682 -11397
633 -11397 -23697 -24800 -31216 -31384 -41423 -34695 -26329 -18840 -22132 -18608 -21696 -20876 -23853 -26976 -25084
618 -25084 -19730 -26019 -30313 -20803 -17793 -25394 -26545 -28907 -24708 -17976 -9178 -31089 -44381 -31051
604 -31051 -22933 -25148 -23160 -20665 -10712 -20023 -31517 -23314 -11754 -20904 -18823 -16704 -19806 -698
590 -698 13815 -6935 -20655 -48062 -37740 -28105 -25070 -17798 -11755 -12280 -36410 -45191 -33870 -33785
576 -33785 -38332 -37967 -41777 -30358 -12236 3034 -5430 -25439 -31172 -35288 -28602 -34960 -21633 -820
562 -820 8797 -3122 -40739 -30533 -30457 -31763 -18092 -5869 -7269 -37119 -59910 -61490 -47678 -18174
548 -18174 -20271 -25673 -19508 -2311 6693 -6692 -17342 -16916 -32654 -18911 3439 -16016 -31611
535 -31611 -25704 -23571 -17275 -19880 -12171 -7439 1068 24257 15934 -100 -2853 -16124 -9013 3302
521 3302 3852 -905 106 -7043 -5088 -15445 -9278 -1303 -11788 -24645 -23428 -40117 -55033 -44837
507 -44837 -31040 -36547 -25384 -19123 -19317 -27964 -19106 -15117 -19730 -41346 -29806 -374 8725 12910
493 12910 5715 -3812 -11615 -42515 -52312 -27116 -25977 -40307 -44690 -49147 -52032 -35157 -23621 -22941
479 -22941 -23259 -33908 -45278 -45414 -41550 -36627 -19922 -5507 -4755 -7522 -19423 -16181 -7771 -10562
465 -10562 -23331 -42795 -51790 -49748 -51012 -48636 -47757 -42257 -53734 -51591 -49281 -31127 -22751 -38620
451 -38620 -45136 -43141 -24927 -20009 -14821 -9352 602 -2337 -24990 -27243 -30516 -30523 -42532 -39868 -42369
436 -42369 -47310 -46846 -32225 -26643 -24954 -27173 -21304 -30675 -45620 -39057 -31288 -32326 -30319 -28107 -9511
421 -9511 -8090 1325 11255 248 -12227 -28991 -36541 -29185 -34237 -19858 -10986 -19978 -30056 -51829
407 -51829 -68987 -56144 -55644 -76109 -87001 -59353 -43244 -24940 -2676 -4000 -10239 -14803 -2559
394 -2559 2807 14432 20157 -465 2690 14225 1790 -38151 -49604 -35365 -20614 -19834 -18543
381 -18543 -25584 -7026 1131 -3377 -14603 -19151 -21351 -19990 -15674 -32897 -28057 -31331 -39073 -49560
367 -49560 -52859 -48442 -46856 -53847 -70853 -60516 -34323 -3196 4104 -25575 -35520 -37670 -28788 -15105
353 -15105 -11907 -7422 -18162 -20501 -34005 -50040 -52573 -50138 -35699 -28745 -21329 -13727 -35069 -53515
339 -53515 -50141 -58718 -62262 -45538 -35563 -22434 2217 4203 2266 -10728 1189 -1863 -25871
326 -25871 -49787 -67903 -51647 -51515 -34082 -22616 -11660 -2726 -13833 -18980 -23345 -36266 -29985
313 -29985 -21771 -7212 -18913 -24391 -18417 -19449 -26204 -16845 3945 7784 6428 -9678 -14035 -9356
299 -9356 -11737 -10697 -17239 -19200 -13353 -12057 -15699 -24183 -33224 -41328 -35734 -45000 -44339 -38537 -44465
$$ [...]
##END NTUPLES=NMR SPECTRUM
##END=
