##TITLE=Analysis number 312315
Compound Code rdp 00265
Book Reference 1
Project Code adrs
Chemist Name stores
##JCAMPDX= 6.0         $$ Bruker NMR JCAMP-DX V2.0
##DATA TYPE= NMR SPECTRUM
##DATA CLASS= NTUPLES
##ORIGIN= Bruker BioSpin GmbH
##OWNER= NMR
$$ XWIN-NMR		Version 3.5
$$ Mon Aug  1 12:41:45 2005 GMT Daylight Time (UT+1h)  MAYBRIDGE\NMR@NMR_250MHZ
##.OBSERVE FREQUENCY= 250.131544655141
##.OBSERVE NUCLEUS= ^1H
##.ACQUISITION MODE= SIMULTANEOUS (DQD)
##.ACQUISITION SCHEME= undefined
##.AVERAGES= 16
##.DIGITISER RES= 18
##SPECTROMETER/DATA SYSTEM= dpx250
##.PULSE SEQUENCE= zg30
##.SOLVENT NAME= CDCl3
##.SHIFT REFERENCE= (INTERNAL, CDCl3, 0, 16.522)
##AUDIT TRAIL= $$ (NUMBER, WHEN, WHO, WHERE, WHAT)
$$ ##TITLE= Audit trail, XWIN-NMR		Version 3.5
$$ ##JCAMPDX= 5.01
$$ ##ORIGIN= Bruker BioSpin GmbH
$$ ##OWNER= NMR
$$ C:\u/data/dgb/nmr/ADRS/6940/pdata/1/auditp.txt
$$ ##AUDIT TRAIL=  $$ (NUMBER, WHEN, WHO, WHERE, WHAT)
(   1,<2005-08-01 12:41:07.96 +100>,<MAYBRIDGE\NMR>,<NMR_250MHZ>,
      <created by zg, POWCHK disabled, PULCHK disabled
       configuration hash MD5:
       62 19 C7 07 E1 42 D1 B7 37 6C 3D D0 77 39 F9 E6
       data hash MD5: 64K
       1A CB B5 6D B0 F6 4D E7 7B 2D 4E 0A 89 44 2E 52>)
(   2,<2005-08-01 12:41:25.98 +100>,<MAYBRIDGE\NMR>,<NMR_250MHZ>,
      <Start of raw data processing
       ef LB = 0.3 FT_mod = 6 PKNL = 1 SI = 32K 
       data hash MD5: 32K
       D4 4B 9C 43 A6 7C 2E AE D3 1C EA 3B 32 F3 76 4D>)
(   3,<2005-08-01 12:41:31.06 +100>,<MAYBRIDGE\NMR>,<NMR_250MHZ>,
      <apk 
       data hash MD5: 32K
       18 17 A5 5B 9F A6 32 6D F3 7C 22 61 17 C5 63 95>)
(   4,<2005-08-01 12:41:32.85 +100>,<MAYBRIDGE\NMR>,<NMR_250MHZ>,
      <abs ABSG = 5 
       data hash MD5: 32K
       CB 27 42 A9 A1 9E AC A0 9E 1B FF 48 E6 6C 3B 75>)
$$ ##END=
$$ 
$$ hash MD5
$$ FE E4 84 02 B8 A8 1C 59 A1 D7 C5 9A 45 5F 9D E5
##$RELAX= 
##$RELAX= 
##$RELAX= 
##$RELAX= 
##$RELAX= 
##$RELAX= 
##$RELAX= 
$$ Bruker specific parameters
$$ --------------------------
##$DU= <C:\u>
##$EXPNO= 6940
##$NAME= <ADRS>
##$PROCNO= 1
##$TYPE= <nmr>
##$USER= <dgb>
##$AMP= (0..31)
100 100 100 100 100 100 100 100 100 100 100 100 100 100 100 100 100 100 
100 100 100 100 100 100 100 100 100 100 100 100 100 100 
##$AQSEQ= 0
##$AQ_mod= 3
##$AUNM= <au_zg>
##$AUTOPOS= <26 >
##$BF1= 250.13
##$BF2= 250.13
##$BF3= 250.13
##$BF4= 250.13
##$BF5= 500.13
##$BF6= 500.13
##$BF7= 500.13
##$BF8= 500.13
##$BYTORDA= 1
##$CFDGTYP= 0
##$CFRGTYP= 5
##$CHEMSTR= <none>
##$CNST= (0..31)
1 1 145 1 1 1 1 1 1 1 1 1 1 1 1 1 1 1 1 1 1 1 1 1 1 1 1 1 1 1 1 1 
##$CPDPRG= <>
##$CPDPRG1= <>
##$CPDPRG2= <>
##$CPDPRG3= <>
##$CPDPRG4= <mlev>
##$CPDPRG5= <mlev>
##$CPDPRG6= <mlev>
##$CPDPRG7= <mlev>
##$CPDPRG8= <mlev>
##$CPDPRGB= <>
##$CPDPRGT= <>
##$D= (0..31)
0 1 0 0 0 0 0 0 0 0.06 0 0 0 0 0 0 0.0002 0 0 0 0 0 0 0 0 0 0 0 0 0 0 
0 
##$DATE= 1122896466
##$DBL= (0..7)
120 120 120 120 120 120 120 120 
##$DBP= (0..7)
150 150 150 150 150 150 150 150 
##$DBP07= 0
##$DBPNAM0= <>
##$DBPNAM1= <>
$$ [...]
##$SUBNAM7= <"">
##$SUBNAM8= <"">
##$SUBNAM9= <"">
##$SW= 20.6930455092707
##$SWIBOX= (0..15)
0 0 3 0 0 0 0 0 0 0 0 0 0 0 0 0 
##$SW_h= 5175.983436853
##$TD= 65536
##$TD0= 1
##$TE= 295.16
##$TE2= 300
##$TE3= 300
##$TEG= 300
##$TL= (0..7)
0 120 120 120 120 120 120 120 
##$TP= (0..7)
150 150 150 150 150 150 150 150 
##$TP07= 0
##$TPNAME0= <>
##$TPNAME1= <>
##$TPNAME2= <>
##$TPNAME3= <>
##$TPNAME4= <>
##$TPNAME5= <>
##$TPNAME6= <>
##$TPNAME7= <>
##$TPOAL= (0..7)
0.5 0.5 0.5 0.5 0.5 0.5 0.5 0.5 
##$TPOFFS= (0..7)
0 0 0 0 0 0 0 0 
##$TUNHIN= 0
##$TUNHOUT= 0
##$TUNXOUT= 0
##$USERA1= <user>
##$USERA2= <user>
##$USERA3= <user>
##$USERA4= <user>
##$USERA5= <user>
##$V9= 5
##$VALIST= <valist>
##$VCLIST= <CCCCCCCCCCCCCCC>
##$VD= 0
##$VDLIST= <DDDDDDDDDDDDDDD>
##$VPLIST= <PPPPPPPPPPPPPPP>
##$VTLIST= <TTTTTTTTTTTTTTT>
##$WBST= 1024
##$WBSW= 4
##$XGAIN= (0..3)
0 0 0 0 
##$XL= 0
##$YL= 0
##$YMAX_a= 416579
##$YMIN_a= -492891
##$ZGOPTNS= <>
##$ZL1= 120
##$ZL2= 120
##$ZL3= 120
##$ZL4= 120
##$ABSF1= 16.522
##$ABSF2= -4.171173
##$ABSG= 5
##$ABSL= 3
##$ALPHA= 0
##$AQORDER= 0
##$ASSFAC= 0
##$ASSFACI= 0
##$ASSFACX= 0
##$ASSWID= 0
##$AUNMP= <proc_1d>
##$AZFE= 0.1
##$AZFW= 0.1
##$BCFW= 0
##$BC_mod= 0
##$BYTORDP= 0
##$COROFFS= 0
##$CY= 12.5
##$DATMOD= 1
##$DC= 0
##$DFILT= <>
##$DTYPP= 0
##$F1P= 14.0000005364418
##$F2P= -0.99999901652339
##$FCOR= 0.5
##$FTSIZE= 32768
##$FT_mod= 6
##$GAMMA= 0
##$GB= 0
##$INTBC= 1
##$INTSCL= 1
##$ISEN= 128
##$LB= 0.3
##$LEV0= 0
##$LPBIN= 0
##$MAXI= 10000
##$MC2= 0
##$MEAN= 0
##$ME_mod= 0
##$MI= 0
##$NCOEF= 0
##$NC_proc= -3
##$NLEV= 6
##$NOISF1= 0
##$NOISF2= 0
##$NSP= 0
##$NTH_PI= 0
##$NZP= 0
##$OFFSET= 16.522
##$PC= 1
##$PHC0= 130.5016
##$PHC1= 5.034929
##$PH_mod= 1
##$PKNL= yes
##$PPARMOD= 0
##$PSCAL= 4
##$PSIGN= 0
##$REVERSE= no
##$SF= 250.13
##$SI= 32768
##$SIGF1= 0
##$SIGF2= 0
##$SINO= 400
##$SIOLD= 32768
##$SREGLST= <1H.CDCl3>
##$SSB= 0
##$STSI= 32768
##$STSR= 0
##$SW_p= 5175.98343685301
##$SYMM= 0
##$S_DEV= 0
##$TDeff= 65536
##$TDoff= 0
##$TI= <Analysis number 999999
Compound Code 99
Book Reference 9
Project Code 9>
##$TILT= no
##$TM1= 0
##$TM2= 0
##$TOPLEV= 0
##$USERP1= <user>
##$USERP2= <user>
##$USERP3= <user>
##$USERP4= <user>
##$USERP5= <user>
##$WDW= 1
##$XDIM= 32768
##$YMAX_p= 380934306
##$YMIN_p= -720339
$$ End of Bruker specific parameters
$$ ---------------------------------
##NTUPLES= NMR SPECTRUM
##VAR_NAME=  FREQUENCY,     SPECTRUM/REAL,   SPECTRUM/IMAG
##SYMBOL=    X,             R,               I
##VAR_TYPE=  INDEPENDENT,   DEPENDENT,       DEPENDENT
##VAR_FORM=  AFFN,          ASDF,            ASDF
##VAR_DIM=   32768,         32768,           32768
##UNITS=     HZ,            ARBITRARY UNITS, ARBITRARY UNITS
##FACTOR=    0.157963299565203, 1,           1
##FIRST=     4132.6476996994, 0,             0
##LAST=      -1043.33573715361, 0,           0
##MIN=       -1043.33573715361, -720339,     0
##MAX=       4132.6476996994, 380934306,     0
$$ Real data points
##PAGE= N=1
##DATA TABLE= (X++(R..R)), XYDATA
$$ [...]
17668I963O024M854m97k540k169p828k304K228R98j593P470J476O18K08L632L824
$$ 9963 15987 20841 20344 17804 15635 7807 5503 7731 8729 7136 14606 16082 16700 16908 20540 24364
17652B4364m303j410O563K622J758K91K071p44k823n172k694k678r978l650K170
$$ 24364 20061 18651 25214 27836 29594 29885 31956 31212 28389 23217 20523 17845 7867 4217 6387
17637F387m645J372Q718L836j711m784k410r65L216K833K74K277K521j704N69
$$ 6387 1742 3114 11832 15668 13957 9173 6763 5798 9014 11847 12121 14398 16919 15215 15784
17622A5784l226L233J803M945k30k42j210l448J134k253O960O241L461J579J973
$$ 15784 12558 15791 17594 22539 22309 22067 20857 17409 18543 16290 23250 29491 32952 34531 36504
17607C6504o69J179Q080R451L227J1772J0292L554K274O520J8293K3254J9138
$$ 36504 35835 37014 45094 54545 57772 69544 79836 83390 85664 92184 110477 133731 152869
17594A52869J9711J5145L887r388p834j776N549Q572P514p79r416j6594j2888
$$ 152869 172580 187725 191612 182224 174390 172614 178163 186735 194249 193470 184054 167460 154572
17581A54572j2458j1141j0641r047m112l705r567j3357j8270j2715o348k797n530
$$ 154572 142114 130973 120332 111285 107173 103468 93901 80544 62274 49559 43211 40414 34884
17568C4884q903m067k129j111J588o15Q97l348j623m5n234m78L447J642N942K286
$$ 34884 25981 21914 19785 18674 20262 19647 20544 17196 15573 15528 10294 9816 13263 14905 20847 23133
17552B3133k19L41L470q94n609l300L07O31l65m671l553O583K607j219j063j843
$$ 23133 22914 23255 26725 25831 20222 16922 17229 17860 17495 12824 9271 15854 18461 17242 16179 14336
17536A4336n170j543K099K72L298m30l061K142P49R44j90j766K135M0k000n851
$$ 14336 9166 7623 9722 9994 13292 12862 9801 11943 12692 13636 13446 11680 13815 13855 11855 6004
17520F004j015L831K683K305M81m621l808J574j071o04L385M360j533m4j456p37
$$ 6004 4989 8820 11503 13808 14289 9668 5860 7434 6363 5759 9144 13504 11971 11927 10471 9734
17504I734j663K452m700l450o6M062N999j085j202j220N675j387O46N160l215
$$ 9734 8071 10523 5823 2373 2307 6369 12368 11283 10081 8861 14536 13149 13795 18955 15740
17489A5740l794k620k878n33k269j668L290J1134J139l812j491q18m144J890M222
$$ 15740 11946 9326 6448 5915 3646 1978 5268 16402 17541 13729 12238 11420 7276 9166 13388
17474A3388l166l961R53j688L491l25l085J278K98k807j705J013O260K318J805
$$ 13388 10222 6261 7214 5526 9017 8692 5607 6885 7183 4376 2671 3684 9944 12262 14067
17459A4067L518J571P35n503m255K612J027J259p66j53N62j801J541K85J897K804
$$ 14067 17585 19156 19891 14388 10133 12745 13772 15031 14265 14112 14674 12873 14414 14699 16596 19400
17443A9400j17L694J2343J0825J617J600n830p860q347m602l508J349M363m605
$$ 19400 19283 22977 35320 46145 47762 49362 43532 35672 27325 22723 19215 20564 24927 20322
17429B0322l148Q26L169P194j233n569n067O40J418p95l073l92K834Q83k016q584
$$ 20322 17174 18000 21169 28363 27130 21561 16494 17134 18552 17757 14684 14292 17126 18009 15993 7409
17413G409l51j167J039L386r23L984N406J226j291n163k310K199j245k634j956
$$ 7409 7058 5891 6930 10316 9393 13377 18783 20009 18718 13555 11245 13444 12199 9565 7609
17398G609l109J184N4l329l239O81J233K452J193L366k051K103K160k011o79j670
$$ 7609 4500 5684 5738 2409 -830 -149 1084 3536 4729 8095 6044 8147 10307 8296 7617 5947
17382E947n320L21P105K52n85K63k722K697O016l319J358j227k948j286P63M192
$$ 5947 627 948 8053 8305 7720 7983 5261 7958 13974 10655 12013 10786 7838 6552 7315 11507
17366A1507l217L56j74k7K773J983K591l923m323N74Q15j065L160M360j16j306
$$ 11507 8290 8646 8472 8445 11218 13201 15792 11869 7546 8120 8935 7870 11030 15390 15274 13968
17350A3968n530o31j94j24l93n781K762q19J526J541k62L158K979k597M022M261
$$ 13968 8438 7807 7613 7489 7096 1315 4077 3258 4784 6325 6063 9221 12200 9603 13625 17886
17334A7886k442n455K42L888j770m904L358N780n24j776p606k223L727L229k613
$$ 17886 15444 9989 10231 14119 12349 7445 10803 16583 16059 14283 6677 4454 8181 11410 8797
17319H797l114j083K998K069o08l18m096l358j404L351K155L978K713k850o934
$$ 8797 5683 4600 7598 9667 9059 8741 4645 1287 -117 3234 5389 9367 12080 9230 2296
17304B296K19L435J611R61m85j305J01K161J134k904q570J093K700K088K705L148
$$ 2296 2515 5950 7561 8522 8037 6732 6833 8994 10128 7224 -1346 -253 2447 4535 7240 10388
17288A0388J538k652j445m670l485j073j269L700k16M776J179o277j170k772N570
$$ 10388 11926 9274 7829 3159 -326 -1399 -2668 1032 816 5592 6771 494 -676 -3448 2122
17273B122N529L069J130j957m675N14Q69o953K808L105K231L656k302k240J096
$$ 2122 7651 10720 11850 9893 5218 5732 6601 -352 2456 5561 7792 11448 9146 6906 8002
17258H002Q39n530n948l093k599k156J066K292O239J847J27K693R25L91j799o343
$$ 8002 8841 3311 -2637 -5730 -8329 -10485 -9419 -7127 -888 959 1086 3779 4704 5095 3296 -3047
17242c047L729L753k208J242k99j433j332L796N436P38j853k456L916P45q06p55
$$ -3047 682 4435 2227 3469 3170 1737 405 4201 9637 10375 8522 6066 9982 10727 9921 9166
17226I166q954j76M537J894J059N5K594N627J998l557j857o5N62l737n516n83
$$ 9166 212 36 4573 6467 7526 7581 10175 15802 17800 14243 12386 12321 12883 9146 3630 3047
17210C047l37L632j071m40K000J709r54k353j66q37P47P28k220P99j668J484L216
$$ 3047 2710 6342 5271 4831 6831 8540 7586 5233 5067 4230 4977 5705 3485 4284 2616 4100 7316
17193G316RJ871p79K70j948l510P81j296l733j491J645P68K462L147r78J662J949
$$ 7316 7325 9196 8417 8687 6739 3229 4010 2714 -1019 -2510 -865 -97 2365 5512 4534 6196 8145
17176H145M94K085J578k916j460J274K829L3j614l278j711j399k630L206j194
$$ 8145 8639 10724 12302 9386 7926 9200 12029 12062 10448 7170 5459 4060 1430 4636 3442
17161C442K121N591q37q787n348R08k182K562J60M56M027L703j628M170P90r74
$$ 3442 5563 11154 10317 1530 -3818 -2910 -5092 -2530 -2370 -1914 2113 5816 4188 8358 9148 8174
17145H174L06K34j555l383R16l055R46L323L498O29M46j467N93o454j836L631
$$ 8174 8480 8714 7159 3776 4692 1637 2583 5906 9404 10033 10479 9012 9605 3151 1315 4946
17129D946l211J583j022l291L849K443q55K251L890k268l608l266L822J968n26
$$ 4946 1735 3318 2296 -995 2854 5297 4442 6693 10583 8315 4707 1441 5263 7231 6705
17114F705K080L09m240L242J070p51j828k636K667j63M68k875J176o39m433Q01
$$ 6705 8785 9094 4854 8096 9166 8415 6587 3951 6618 6455 6923 4048 5224 4585 152 953
17098I53N458J70J561M257J262j04n459j574l478n76L483L196J506l013p3R79
$$ 953 6411 6581 8142 12399 13661 13557 8098 6524 3046 2470 5953 9149 10655 7642 7569 8548
17082H548O857J400l697n57J989n066q96J064j910m662J984O309L78K159j455
$$ 8548 15405 16805 13108 12551 14540 9474 8578 9642 7732 3070 5054 11363 11741 13900 12445
17067A2445l620J453J327J3k490J731k747l239K757k384K9J278L350l895p692
$$ 12445 8825 10278 11605 11618 9128 10859 8112 4873 7630 5246 5275 6553 9903 6008 -1684
17052a684J657j182j936L758L957p33M68m69M600k978o06n007j158N490M926p37
$$ -1684 -27 -1209 -3145 613 4570 3837 4305 3836 8436 5458 4852 -155 -1313 4177 9103 8366
17036H366m545K77M368j33j398k770j745k559j8M855k451l665k305J047J328P28
$$ 8366 3821 4098 8466 8333 6935 4165 2420 -139 -157 4698 2247 -1418 -3723 -2676 -1348 -620
17020f20M276j984J256l94K467L59j361l274N139M088n396j518M36k187N83k758
$$ -620 3656 1672 2928 2534 5001 5360 3999 725 5864 9952 4556 3038 3474 1287 1870 -888
17004h88N719L622K97k951r15j306J398k885m669J190N72K340k782j159r4J985
$$ -888 4831 8453 8750 5799 4884 3578 4976 2091 -2578 -1388 -816 1524 -1258 -2417 -2511 -526
16988e26l00K249p98j485J613L018Q80k461K353P37j03J632n00j432l49j5k755
$$ -526 -826 1423 625 -860 753 3771 4651 2190 4543 5280 5177 6809 6309 4877 4528 4513 1758
16971A758k288K770K908k88j743n394L581K849o305J218M754r69j378j551K338
$$ 1758 -530 2240 5148 4860 3117 -2277 1304 4153 -2152 -934 3820 2851 1473 -78 2260
16956B260L156k201Q44J615m49L573o34q78l49J561k134p43O66M668k035J269
$$ 2260 5416 3215 4059 5674 5225 8798 8164 7286 6937 8498 6364 5621 6287 10955 8920 10189
16940A0189k33n597K142q04L20M082J420p581k773K087M965m475o818n38K360
$$ 10189 9956 4359 6501 5697 6017 10099 11519 3938 1165 3252 8217 3742 -3076 -3614 -1254
16925a254K515M135M053K422L00J627J685J6j435l699o780K90N026j264p61j078
$$ -1254 1261 5396 9449 11871 12171 13798 15483 15499 14064 10365 3585 3875 8901 7637 6876 5798
16909E798m661m519L929M254K596L476l995k635l62j340J368J165M24k049j067
$$ 5798 1137 -3382 547 4801 7397 10873 6878 4243 3881 2541 3909 5074 5498 3449 2382
16894B382j541J856K349J307R85k87l447J9l97j882k821L920P80J934J110K02
$$ 2382 841 2697 5046 6353 7338 7051 3604 3623 3226 1344 -1477 2443 3223 5157 6267 6469
16878F469K684M54n092J471K773R15j695J039K04n34j852J239l257J06k464k288
$$ 6469 9153 9607 4515 5986 8759 9674 7979 9018 9222 8688 6836 8075 4818 4924 2460 172
16862A72L693O891l591n136K423J966J026j655j027L330N129j161k588k41l613
$$ 172 3865 10756 7165 2029 4452 6418 7444 5789 4762 8092 13221 12060 9472 9231 5618
16847E618j749J668J792j08J0J642J225k531L495k568k005n102l124L888M922
$$ 5618 3869 5537 7329 7221 7231 8873 10098 7567 11062 8494 6489 1387 -1737 2151 7073
16832G073p15m87j103J721M142m575j718m751K98L505N784K865K551j171m49k814
$$ 7073 6358 5871 4768 6489 10631 6056 4338 -413 -115 3390 9174 12039 14590 13419 12970 10156
16816A0156j854l086K082L640r36k274j783M815K318l62k028j30K542k223k986
$$ 10156 8302 5216 7298 10938 10002 7728 5945 10760 13078 12716 10688 10558 13100 10877 7891
16801G891N95j271Q09N156l002q06j725K961J032p049n343J504O387L004N455
$$ 7891 8486 7215 8024 13180 10178 9372 7647 10608 11640 4591 -752 752 7139 10143 15598
16786A5598j027n550m609j39l653J038P94n865N33M141L163K122nl252j362j069
$$ 15598 14571 9021 4412 4273 620 1658 2452 -3413 -2880 1261 4424 6546 6541 3289 1927 858
16770H58L434K218l255l019K350J182K309K43l15j486K567K428m943k001N445
$$ 858 4292 6510 3255 236 2586 3768 6077 6320 6005 4519 7086 9514 4571 2570 8015
16755H015L519K257n01m760k995J901P75n80J151k497o625j631K78J433L423J116
$$ 8015 11534 13791 13290 8530 5535 7436 8211 7631 8782 6285 -340 -1971 -1693 -260 3163 4279
16739D279k192M76J471K06J428j009P26j698K137j373P57q87m728O46O473K67
$$ 4279 2087 2563 4034 4240 5668 4659 5385 3687 5824 4451 5208 4321 -407 239 6712 6979
16723F979j617J863J620K501j207n985k511O36J644M046L182J797k831j988j263
$$ 6979 5362 7225 8845 11346 10139 4154 1643 2279 3923 7969 11151 12948 10117 8129 6866
16708F866o69L19M494M733m360m368k917l710k99J739M53r36j214M44M535j625
$$ 6866 6197 6516 11010 15743 11383 7015 4098 388 89 1828 2281 1345 131 575 5110 3485
16692C485l662J521M596L954k142o1j655k229l448J176k217m521O15N684J342
$$ 3485 -177 1344 5940 9894 7752 7691 6036 3807 359 1535 -682 -5203 -4588 1096 2438
16677B438l239L109k03m500m088J304M056L968J198k95M087m539o172M74M105
$$ 2438 -801 2308 2105 -2395 -6483 -5179 -1123 2845 4043 3748 7835 3296 -2876 -2402 1703
16662A703P90J817k211l427k379J712N662O013K278l725m786J444L190l1P12o82
$$ 1703 2493 4310 2099 -1328 -3707 -1995 3667 9680 11958 8233 3447 4891 8081 8050 8762 8080
16646H080j255l449M825n38J094o99q28J732n90l745l793m253M379M234p546o272
$$ 8080 6825 3376 8201 7663 8757 8058 7230 8962 8372 4627 834 -3419 960 5194 -2352 -8624
16630h624L316M265Q770J565m125j28J192l827m628r57K725K454L68K141j230
$$ -8624 -5308 -1043 7727 9292 5167 5039 6231 2404 -2224 -3181 -456 1998 2366 4507 3277
16615C277m181K670M301k895k732j020L200M766j844J372R93m207q80L09n29L714
$$ 3277 -904 1766 6067 3172 440 -580 2620 7386 5542 6914 7907 3700 2820 3129 2600 6314
16599F314O51p94l761k611K949m90L496N812K670R18j647q10m50k611n131l676
$$ 6314 6965 6171 2410 -201 2748 2258 5754 11566 14236 15154 13507 12697 12247 9636 4505 829
16583H29K97M162m25j665p66M195k471r522j117M456J771M32L216L762K610q55
$$ 829 1126 5288 4863 3198 2432 6627 4156 -5366 -6483 -2027 -256 176 3392 7154 9764 8909
16567H909l712J782j876n218j824L909N261k060L02n8M53J01j547j816m53L205
$$ 8909 5197 6979 5103 -115 -1939 1970 7231 5171 5473 5415 5868 5969 4422 2606 2153 5358
16551E358m873n76J328j40Q96J74j843m078l113K347M640N689L033o334n806L421
$$ 5358 485 -91 1237 1097 1993 2167 324 -3754 -6867 -4520 120 5809 8842 2508 -3298 123
16535A23N184j361o13j53Q12J09K119L106o777j22J775m273K699Q95j468j812
$$ 123 5307 3946 3333 3180 3992 4101 6220 9326 2549 2427 4202 -71 2628 3523 2055 243
16519B43j27J866L562j221L61K635q34o973m102m373K909Q863N241J304N216j549
$$ 243 116 1982 5544 4323 4684 7319 6485 -488 -4590 -8963 -6054 2809 8050 9354 14570 13021
16503A3021m872o470o2m87M699p8K3J075L675L25q722j223M597K685q10j932J433
$$ 13021 8149 1679 1617 1130 5829 5751 5774 6849 10524 10849 2127 904 5501 8186 7376 5444 6877
16486F877k081q22N584J846j270k524m991n828Q37N252k705Q30K507j608j959
$$ 6877 4796 3974 9558 11404 10134 7610 2619 -3209 -2372 2880 175 1005 3512 1904 -55
16471e5L366J143K782J624r48M91J145p94l124k428j267K910r18K976k196l371
$$ -55 3311 4454 7236 8860 7912 8403 9548 8754 5630 3202 1935 4845 3927 6903 4707 1336
16455A336k04M133L273p58l857K324Q68o650j251L908N890N258k24j081l814k10
$$ 1336 1132 5265 8538 7780 3923 6247 7115 465 -786 3122 9012 14270 14046 12965 9151 8941
16439H941k225J14j424k123r19Q75n674j166L163K545k819J93K102P03j72j515
$$ 8941 6716 6830 5406 3283 2364 3239 -2435 -3601 -438 2107 -712 -519 1583 2286 2114 599
16423E99j4k729O4j080O45K991M04L318K13J741j209J314L039l216m671M73k187
$$ 599 585 -2144 -2080 -3160 -2515 476 880 4198 4411 6152 4943 6257 9296 6080 1409 1882 -305
16406c05l70P70j919L07K770k553q3M128L333k704k084K286j525m119J255l8q69
$$ -305 -675 95 -1824 -1517 1253 -1300 -1383 2745 6078 3374 1290 3576 2051 -2068 -813 -851 -1720
16389a720l319O57Q86K777j418P76M75k127L74q2J751K193R86K498N906J107J85
$$ -1720 -5039 -4382 -3496 -719 -2137 -1361 -886 -3013 -2639 -2721 -970 1223 2209 4707 10613 11720 11905
16372A1905j731l309r52j806l614k215J676m27L463j528k57r39m037K782O826
$$ 11905 10174 6865 5913 4107 493 -1722 -46 -473 2990 1462 1205 266 -3771 -989 5837
16357E837K750m723q23K530K044m576K100l608p201p28L480j236J86M611K263
$$ 5837 8587 3864 3041 5571 7615 3039 5139 1531 -5670 -6398 -2918 -4154 -3968 643 2906
16342B906m492N910j396k598N788O57n28K093o26j203m059r57k86K337l293m544
$$ 2906 -1586 4324 2928 330 6118 6775 6247 8340 7714 6511 2452 1495 1209 3546 253 -4291
16326d291M78J329j527O40J276N519L824n9k473k621O15k213l287l427L292M778
$$ -4291 -3813 -2484 -4011 -3371 -2095 3424 7248 7189 4716 2095 2710 497 -2790 -6217 -2925 1853
16310A853M414J8j216K169j341m409j521j974j276j657K309Q43J141J984r86L651
$$ 1853 6267 6285 5069 7238 5897 1488 -33 -2007 -3283 -4940 -2631 -1788 -647 1337 351 4002
16294D002J581K271o10j004l840J229K5k050p8L06lM083k397l835l865j419M596
$$ 4002 5583 7854 7244 6240 2400 3629 3654 1604 1526 1832 1829 5912 3515 -320 -4185 -5604 -1008
16277a008k48J587K416J849l530j11Q82L090q0k477O92J737K67j830k316j618
$$ -1008 -1256 331 2747 4596 1066 955 1837 4927 4847 2370 3062 4799 5066 3236 920 -698
16261f98L217j217l024L99J565M210j309j201k548l770k890k557N714M612m43
$$ -698 2519 1302 -1722 -1323 242 4452 3143 1942 -606 -4376 -7266 -9823 -4109 503 60
16246F0L354m946m600k349J280N616P251J77l647m702j99K606M426J387J573K309
$$ 60 3414 -1532 -6132 -8481 -7201 -1585 5666 5843 2196 -2506 -2705 -99 4327 5714 7287 9596
16230I596j633o575O03o106j519M984K386P71l11J061J398l48J232m464k660p68
$$ 9596 7963 1388 1991 -4115 -5634 -650 1736 2507 2196 3257 4655 4307 5539 1075 -1585 -2353
16214b353j409m50k453J14N636J026m099K27L867K627j615m914J6K932j458J084
$$ -2353 -3762 -4212 -6665 -6551 -915 111 -3988 -3761 106 2733 1118 -3796 -3780 -848 -2306 -1222
16198a222j21L173k391j0K497L881J839p231l343j741J243L33K781Q95l095J990
$$ -1222 -1343 1830 -561 -571 1926 5807 7646 415 -2928 -4669 -3426 -3093 -312 583 -2512 -522
16182e22J346J476m542J490O116J047m37l394q55m812o44J201j210o782K837M941
$$ -522 824 2300 -2242 -752 5364 6411 5974 2580 1725 -3087 -3731 -2530 -3740 -10522 -7685 -2744
16166b744J217J28L209j483o622j871M142M185O03K523p75l049l89r73j16j4k507
$$ -2744 -1527 -1399 1810 327 -6295 -8166 -4024 161 764 3287 2512 -537 -926 -1899 -2015 -2029 -4536
16149d536k257M89L377L42n05j315J857J015J571k331m274r04N328N201n57j490
$$ -4536 -6793 -6304 -2927 -2585 -3090 -4405 -2548 -1533 38 -2293 -6567 -7471 -2143 3058 2501 1011
16133A011K974k217l480k488j388R22P16J995L323N83l670M7K47K89k767J597
$$ 1011 3985 1768 -1712 -4200 -5588 -4666 -3950 -1955 1368 1951 -1719 -1672 -1425 -1136 -3903 -2306
16117b306J477L018K889k454n967k209L056N307m503j420M865n56K73n391J534
$$ -2306 -829 2189 5078 2624 -3343 -5552 -2496 2811 -1692 -3112 1753 1197 1470 -3921 -2387
16102b387K361j691m339P43J708l709M611J891L63j058L000o78l129L8K746n694
$$ -2387 -26 -1717 -6056 -5313 -3605 -7314 -2703 -812 -449 -1507 1493 815 -2314 -2276 470 -5224
16086e224L469L236m210j407n93p03O538L126L715O57l623P56M763m81q8n389
$$ -5224 -1755 1481 -2729 -4136 -4729 -5432 1106 4232 7947 8604 4981 5737 10500 10019 9931 4542
16070D542k762R77M822L145o03k778l687k075n10J278L230m310m712K358N77j118
$$ 4542 1780 2757 7579 10724 10121 7343 3656 1581 1071 2349 5579 1269 -3443 -1085 -508 -1626
16054a626L557l62k220j948k90l030M431K91L008j371o21J370j540M80J945qK296
$$ -1626 1931 1569 -651 -2599 -2889 -5919 -1488 -1197 1811 440 -181 1189 -351 129 2074 2066 4362
16037D362K783R58M13j171j092l98R81qo40j405k108l71K740P224K155j492m152
$$ 4362 7145 8103 8516 7345 6253 5855 6836 6828 6188 4783 2675 2304 5044 12268 14423 12931 8779
16020H779n213o215m538L638J321K891K147j160J099N152K185m443L079q55m400
$$ 8779 3566 -2649 -7187 -3549 -2228 663 2810 1650 2749 7901 10086 5643 8722 7867 3467
16005C467j26R60Q99o69l804K298k85r31J834r0j820R85j320n511q22J714R65
$$ 3467 3341 4301 5200 4531 727 3025 2740 1809 3643 3553 1733 2718 1398 -4113 -4935 -3221 -2256
15988b256l34j160K052M610J874q363P47M954J635K372K355l416k606k078J007
$$ -2256 -2590 -3750 -1698 2912 4786 -3577 -2830 2124 3759 6131 8486 5070 2464 386 1393
15973A393L408K357j380m575j037J256N303O735n371n524m677m855j280K588l491
$$ 1393 4801 7158 5778 1203 166 1422 6725 13460 8089 2565 -2112 -6967 -8247 -5659 -9150
15958i150J86N293L285k717L56l336K387K778j433n84j988n565L650N172K817
$$ -9150 -8964 -3671 -386 -3103 -2747 -6083 -3696 -918 -2351 -2935 -4923 -10488 -6838 -1666 1151
15943A151j580J927J170j600k369K99J336K756k496M22L406L195p501k457J477
$$ 1151 -429 1498 2668 1068 -1301 -1002 334 3090 594 1016 4422 7617 116 -2341 -864
15928h64L371K003l816ok308j058m776j610N816N231K49j445L135N805J459r026
$$ -864 2507 4510 694 688 -1620 -2678 -7454 -9064 -3248 1983 2232 787 3922 9727 11186 2160
15912B160n789K646L158j114j792J209j198N944J305J519Lo303r06J940m7l17
$$ 2160 -3629 -983 2175 1061 -731 478 -720 5224 6529 8048 8051 1748 842 2782 2735 2418
15896B418K655k57P15O51P93K300l131m677r92M189L537K45j141p345m494l65
$$ 2418 5073 4816 5531 6182 6975 9275 6144 1467 475 4664 8201 8446 7305 -40 -4534 -4899
15880d899j958l605J329N866O84m79J032L167j256n058l511L001K542l712J56
$$ -4899 -6857 -10462 -9133 -3267 -2583 -3062 -2030 1137 -119 -5177 -8688 -5687 -3145 -6857 -6701
15865f701O145J124j567J595n021l940N110K490j622R52K283k074k734L454L279
$$ -6701 -556 568 -999 596 -4425 -8365 -3255 -765 -2387 -1435 848 -1226 -3960 -506 2773
15850B773O74l010J472L773j316j223n174j164J557r01L127r83j171l214J13M089
$$ 2773 3447 437 1909 5682 4366 3143 -2031 -3195 -1638 -2539 588 -395 -1566 -4780 -4667 -578
15834e78n547k727p98j285K813L047p97J026K601k426K557K706J880J894K914
$$ -578 -6125 -8852 -9650 -10935 -8122 -5075 -5872 -4846 -2245 -4671 -2114 592 2472 4366 7280
15819G280k540l42J249K58j720m97k797k030J504P048J844q943l165k371m879
$$ 7280 4740 4398 5647 5905 4185 3688 891 -1139 365 7413 9257 314 -2851 -5222 -10101
15804a0101M640N585K955J320o954m837O923L643l30j766m185J462R39J585m37
$$ -10101 -5461 124 3079 4399 -2555 -7392 -469 3174 2844 1078 -3107 -1645 -706 879 442
15789D42o335o69k67O53J896J901j434L003N52m490P62N201Q12J41N71l530l886
$$ 442 -5893 -6562 -6829 -6176 -4280 -2379 -3813 -810 -258 -4748 -3986 1215 2027 2168 2739 -791 -4677
15772d677M153p60J268j038j916J385q08L909J538K335Q86j735L632k600l315
$$ -4677 -524 -1284 -16 -1054 -2970 -1585 -2393 1516 3054 5389 6275 4540 8172 5572 2257
15757B257N97N378p12l01l398o353j745l25L026L064k95q56P33p41J043j900r34
$$ 2257 2854 8232 7520 7219 3821 -2532 -4277 -4602 -1576 1488 1193 337 1070 329 1372 -528 -1462
15740a462k82j910L533l314M112N601K552l33j573k75j162N730n371p006j890
$$ -1462 -1744 -3654 -121 -3435 677 6278 8830 8497 6924 6649 5487 11217 5846 -1160 -3050
15725c050J986J855R11K590J194m766J62j781P7L426L651k334J70j428l474n218
$$ -3050 -1064 791 1702 4292 5486 720 882 -899 -822 2604 6255 3921 4091 2663 -811 -6029
15709f029J733N606O398j511M0O891K17k929k41l31m672p331k983k179k816J402
$$ -6029 -4296 1310 7708 6197 6237 13128 13345 10416 10175 9844 5172 -2159 -5142 -7321 -10137 -8735
15693h735N130K739l368L15L027L677j656J163R00m803j756K002M173k227k138
$$ -8735 -3605 -866 -4234 -3919 -892 2785 1129 2292 3192 -1611 -3367 -1365 2808 581 -1557
15678a557k192K725K693L565j67M91k694M26j106R02J971k192o399K425l484k144
$$ -1557 -3749 -1024 1669 5234 5067 5558 2864 3290 2184 3086 5057 2865 -3534 -1109 -4593 -6737
15662f737K307M505M506j566m231k94L381k047k346m313K873N064M898m96m998
$$ -6737 -4430 75 4581 3015 -1216 -1510 1871 -176 -2522 -6835 -3962 1102 6000 5504 506
15647E06l011r26k894j713R366M464Q91P4p82n269K672j015q36l237k157K643
$$ 506 -2505 -3431 -6325 -8038 1328 5792 6683 6757 5975 706 3378 2363 1527 -1710 -3867 -1224
15631a224N980Q61l47K30O07n119l726L146M644j650p1L110L424q307l693L359
$$ -1224 4756 5617 5270 5500 6107 988 -2738 408 5052 3402 3331 6441 9865 1558 -2135 1224
15615A224J237J003Q23l911n394K42j112j771k654J777j631L178L553M396L782
$$ 1224 2461 3464 4287 376 -5018 -4776 -5888 -7659 -10313 -8536 -10167 -6989 -3436 960 4742
15600D742M814K47O35n062l190L33k440M065N05K65J647p52n20m538K498M020
$$ 4742 9556 9803 10438 5376 2186 2519 79 4144 4649 4914 6561 5809 5289 751 3249 7269
15584G269j369l192j732K839J570j567l642k817l82J009K482L52l913J684L179
$$ 7269 5900 2708 976 3815 5385 3818 176 -2641 -3023 -2014 468 820 -3093 -1409 1770
15569A770J440J765K174l134K443J397j412n547k575L123l286l97k243K727L990
$$ 1770 3210 4975 7149 4015 6458 7855 6443 896 -1679 1444 -1842 -2239 -4482 -1755 2235
15554B235l004K630N228l200k61o494l1m8l02j025N764K520j133l348n440l44
$$ 2235 -769 1861 7089 3889 3628 -2866 -2897 -2945 -3247 -4272 1492 4012 2879 -469 -5909 -6253
15538f253J806K654k867q72K903O93J14r58o45k778K210K30L152j152j778O398
$$ -6253 -4447 -1793 -4660 -5532 -2629 -1936 -1822 -2780 -3425 -6203 -3993 -3763 -611 -1763 -3541 2857
15522B857m46k231l909l790N711K5j822j286R67J211k550J255K934j91k015N787
$$ 2857 2411 180 -3729 -7519 -1808 -1783 -3605 -4891 -3924 -2713 -5263 -4008 -1074 -1265 -3280 2507
15506B507P9n629O5k781l436M913P678L503k043m315j061M746J515m893j462K886
$$ 2507 2586 -3043 -2978 -5759 -9195 -4282 3396 6899 4856 541 -520 4226 5741 848 -614 2272
15490B272j466R03m675l198N559J782j96M87m53K15K671k625n071k97K202P1k739
$$ 2272 806 1709 -2966 -6164 -605 1177 981 1468 1015 1230 3901 1276 -3795 -4092 -1890 -1819 -4558
15473d558M69K217P082J716J368m354j742k267L802l428j948l765j803J30M323
$$ -4558 -4089 -1872 5210 6926 8294 3940 2198 -69 3733 305 -1643 -5408 -7211 -7081 -2758
15458b758K579r40j50L192l625r7K462J129M83Q66j110k639L580J611l618q68
$$ -2758 -179 -1119 -1269 1923 -1702 -1799 663 1792 2275 3141 2031 -608 2972 4583 965 97
15442I7J583r77L366j94n619k005k057J939K464l667N499j598m511j215L424K503
$$ 97 1680 703 4069 3875 -1744 -3749 -5806 -3867 -1403 -5070 429 -1169 -5680 -6895 -3471 -968
15426i68j319J352k798l88K372K918K846k033l013M025L305l995p168j154K317
$$ -968 -2287 -935 -3733 -4121 -1749 1169 4015 1982 -1031 2994 6299 2304 -4864 -6018 -3701
15411c701K215K215j359k176J244j8j40R930L605L09Q92o560m204l06J963L8k024
$$ -3701 -1486 729 -630 -2806 -1562 -1580 -1720 8210 11815 12124 13016 6456 2252 1946 3909 3947 1923
15394A923o639m07L848K726k73P78k251j650J785R99l27m384J29J580K194O23
$$ 1923 -4716 -5123 -1275 1451 1178 1956 -295 -1945 -160 839 512 -3872 -3743 -2163 31 654
15378F54K062J081J311J890q94l389m032K576N108l795j753N09Q46k265J945J657
$$ 654 2716 3797 5108 6998 6104 2715 -1317 1259 6367 2572 819 1328 2174 -91 1854 3511
15362C511j567K066j871j876n167k874K922O389n00j528j227L029J178k538k317
$$ 3511 1944 4010 2139 263 -4904 -7778 -4856 1533 1033 -495 -1722 1307 2485 -53 -2370
15347b370m803L86J454K117L949q06m006j641j475K410K590k87K431J088L05J015
$$ -2370 -7173 -6787 -5333 -3216 733 -73 -4079 -5720 -7195 -4785 -2195 -2482 -51 1037 1342 2357
15331B357O2k527p14r3K937j295n759Q48K513K02M038J207n913k015j914K244
$$ 2357 2419 -108 -822 -915 2022 727 -5032 -4184 -1671 -1469 2569 3776 -2137 -4152 -6066 -3822
15315c822N612J674k202j950R04K58j476j374J166L545p88K530O00l068n197k742
$$ -3822 1790 3464 1262 -688 216 474 -1002 -2376 -1210 2335 1547 4077 4677 1609 -3588 -6330
15299f330K845j290K128N995k518l701l628K730L901J259l726m251j444j488J282
$$ -6330 -3485 -4775 -2647 3348 830 -2871 -6499 -3769 132 1391 -2335 -6586 -8030 -9518 -8236
15284h236M827K245r80k930j396j203J693L541P99m457J897J191k096L036J447
$$ -8236 -3409 -1164 -2144 -5074 -6470 -7673 -5980 -2439 -1640 -6097 -4200 -3009 -5105 -2069 -622
15269f22m81L044L474n8J364n538j984l214l716q16N140L570j09j629q15J772
$$ -622 -1103 1941 5415 5357 6721 1183 -801 -4015 -7731 -8547 -3407 163 54 -1575 -2390 -618
15253f18p13r61l115N64R02K377N290j163o37L416k889J095J453m193j41j498
$$ -618 -1331 -2292 -5407 -4843 -3941 -1564 3726 2563 1926 5342 2453 3548 5001 808 667 -831
15237h31m673J516N283J535o539r80J435q66J963K860l985L7P700L620L043l265
$$ -831 -5504 -3988 1295 2830 -3709 -4689 -3254 -4120 -2157 703 -3282 -3245 4455 8075 11118 7853
15221G853p277l963m67J505k768J306Q601K437n316j204K690j483J088o88l97
$$ 7853 576 -3387 -3854 -2349 -5117 -3811 4790 7227 1911 707 3397 1914 3002 2314 1917
15206A917L976m041o642j056Q99K573k338L383K622r48R4K825m388j636l096O87
$$ 1917 5893 1852 -4790 -5846 -4947 -2374 -4712 -1329 1293 345 439 3264 -1124 -2760 -5856 -5169
15190e169m43n897j157M335M005J923k612jj954Q19M072K258J473m315o00J553
$$ -5169 -5612 -11509 -12666 -8331 -4326 -2403 -5015 -5016 -6970 -6151 -2079 179 1652 -2663 -3263 -1710
15174a710O91r04J618K083K244n479l964J57K371J607M408J675m090m686j560
$$ -1710 -1019 -1923 -305 1778 4022 -1457 -5421 -5264 -2893 -1286 3122 4797 707 -3979 -5539
15159e539k597L843k5Q7P0M14M643J553n485k955l666J118N435j246j814K006
$$ -5539 -8136 -4293 -4318 -4231 -4161 -3747 896 2449 -3036 -5991 -9657 -8539 -3104 -4350 -6164 -4158
15143d158L544j372j142K327l876j438r8j152J223M686L364k303r21j753M19J709
$$ -4158 -614 -1986 -3128 -801 -4677 -6115 -6213 -7365 -6142 -1456 1908 -395 -1316 -3069 -2650 -941
15127i41L177K910k629j593k934J07m032J612nJ310L359R35m094k594r33M171
$$ -941 2236 5146 2517 924 -2010 -1903 -5935 -4323 -4328 -3018 341 1276 -2818 -5412 -6345 -2174
15111b174K174m609j673N757k447N86M02M308j028n377J24j446N0k72k472J955
$$ -2174 0 -4609 -6282 -525 -2972 -2386 -1984 2324 1296 -4081 -3957 -5403 -5353 -5625 -8097 -6142
15095f142K498P074K861o47K949m880K103L988p84n750m941r31R24l296k313j728
$$ -6142 -3644 3430 6291 5644 8593 3713 5816 9804 9020 3270 -1671 -2602 -1678 -4974 -7287 -9015
15079i015K010M447o95k556R34M12P144L13k265L142j299J132M300p13j875k516
$$ -9015 -7005 -2558 -3253 -5809 -4875 -4463 2681 2994 729 3871 2572 3704 8004 7291 5416 2900
15063B900n060k658K139M520m150j343k189n13O893K555J832m146j48J853K926
$$ 2900 -2160 -4818 -2679 1841 -2309 -3652 -5841 -6354 539 3094 4926 780 632 2485 5411
15048E411o34j581j648k28j407m007q226j41O051M501o83N68J132M513k443j531
$$ 5411 4777 3196 1548 1320 -87 -4094 -12320 -12461 -6410 -1909 -2592 -2024 -892 3621 1178 -353
15032c53m206k041K714N221j806m355L193J628j354j031k674j101j345K899J020
$$ -353 -4559 -6600 -3886 1335 -471 -4826 -1633 -5 -1359 -2390 -5064 -6165 -7510 -4611 -3591
15017c591m475k794K643L057L495r19j974J229j837j8p40l95J735P86J932m65
$$ -3591 -8066 -10860 -8217 -5160 -1665 -2584 -4558 -3329 -5166 -5184 -5924 -6319 -4584 -3798 -1866 -2331
15001b331O772L400m446j476q83k373n007l954j250N223L753N86k280r02K097
$$ -2331 4441 7841 3395 1919 1036 -1337 -6344 -10298 -11548 -6325 -2572 -1986 -4266 -5168 -3071
14986c071J35J364L107o858l774J785K519J697r92L007M338m636j757l652J389
$$ -3071 -2936 -1572 1535 -5323 -9097 -7312 -4793 -3096 -4088 -1081 3257 -1379 -3136 -6788 -5399
14971e399L709R01q36P78K743J651l825L23L631M2m685q35Q57l11m2j530k949
$$ -5399 -1690 -789 -1625 -847 1896 3547 -278 45 3676 3718 -967 -1802 -945 -1256 -1298 -2828 -5777
14954e777k92l240j364M251K236P79k332K33M493l734k514j539M15N620m309m136
$$ -5777 -6069 -9309 -10673 -6422 -4186 -3407 -5739 -5506 -1013 -4747 -7261 -8800 -8385 -2765 -7074 -11210
14938a1210m18N813L750q6l989m29n90J209j116p07k697K827K29M904l215j999
$$ -11210 -11628 -5815 -2065 -2151 -6140 -6569 -7159 -5950 -7066 -7773 -10470 -7643 -7414 -2510 -5725 -7724
14922g724j222j918K293K331p07l641K152J677L188k99j387j282L141P957J479
$$ -7724 -8946 -10864 -8571 -6240 -6947 -10588 -8436 -6759 -3571 -3870 -5257 -6539 -3398 4559 6038
14907F038l771j470O21m26r17k681N57N803k9p174m532J364M296J49l690k000
$$ 6038 2267 797 1418 992 75 -2606 -2049 3754 3725 -3449 -7981 -6617 -2321 -2172 -5862 -7862
14891g862j694K987k656p26Q14R440N786o09j265m724J107J179M837J375r12l097
$$ -7862 -9556 -6569 -9225 -9951 -9137 303 6089 5480 4215 -509 598 1777 6614 7989 7077 3980
14875C980K400K618K196J336O502K415J0946J6690J2735N99J059n262j0288j1180
$$ 3980 6380 8998 11194 12530 19032 21447 32393 49083 61818 62417 63476 58214 47926 36746
14861C6746j1267q518n510P38l103m232k655n030o90R24J086M596J126J687l320
$$ 36746 25479 16961 11451 12189 9086 4854 2199 -2831 -3521 -2597 -1511 3085 4211 5898 2578
14846B578k721m317N595N91j830K423K730L16j495l651l639P091M108N94J709
$$ 2578 -143 -4460 1135 1726 -104 2319 5049 5365 3870 219 -3420 3671 7779 8373 10082
14831A0082j643k965j321j537m277o99p93J970j03K286R95J478L402M810l314
$$ 10082 8439 5474 4153 2616 -1661 -2360 -3153 -1183 -1286 1000 1995 3473 6875 11685 8371
14816H371n920q586k949O934M472J844J091j271K649l917l363j627K065M129k959
$$ 8371 2451 -6135 -9084 -2150 2322 4166 5257 3986 6635 2718 -645 -2272 -207 3922 963
14801I63l054j709j624M190j232n61j197K060L823k239l350q56J14K4k914j150
$$ 963 -2091 -3800 -5424 -1234 -2466 -3027 -4224 -2164 1659 -580 -3930 -4786 -4672 -4648 -7562 -8712
14785h712N576J296J933R79o868k017J596M885N44o283j064p2o92K155l95L614
$$ -8712 -3136 -1840 93 1072 -5796 -7813 -6217 -1332 -788 -7071 -8135 -8207 -8899 -6744 -7139 -3525
14769c525J563K372L056K472l118n872m082J458J990M110k589m390J054M81J010
$$ -3525 -1962 410 3466 5938 2820 -3052 -7134 -5676 -3686 424 -2165 -6555 -5501 -5020 -4010
14754d010p18L411j111J258l607L541K306m77l765M796M634m711K92k232m38J497
$$ -4010 -4728 -1317 -2428 -1170 -4777 -1236 1070 593 -3172 1624 6258 1547 1839 -393 -831 666
14738F66K281J407L56k488q06k724l610L185L670K3K332j73p225q253K60J174
$$ 666 2947 4354 4710 2222 1416 -1308 -4918 -1733 1937 1960 4292 4119 -3106 -11359 -11099 -9925
14722i925J236K065J711J157K376l10L68R79L64r10j745m540l471N09N891M055
$$ -9925 -8689 -6624 -4913 -3756 -1380 -1690 -1322 -343 21 -889 -2634 -7174 -10645 -10136 -4245 -190
14706a90L750J416j275M89j122m075J723J320j579n084o554o34R431N878j230
$$ -190 3560 4976 3701 4190 3068 -1007 716 2036 457 -4627 -11181 -11815 -2384 3494 2264
14691B264R97j078k580j378R0K819j525j520J882k239r38k586k041J878m122r23
$$ 2264 3261 2183 -397 -1775 -1685 1134 -391 -1911 -29 -2268 -3206 -5792 -7833 -5955 -10077 -11000
14675a1000P041K917l521l096L578o2L447N397L837j807o707l229K285l103j396
$$ -11000 -3959 -1042 -4563 -7659 -4081 -4143 -696 4701 8538 6731 24 -3205 -920 -4023 -5419
14660e419L064O405N199k958o864p114m73n76q91o23L277n26M977J588J688M649
$$ -5419 -2355 4050 9249 6291 -573 -7687 -8160 -8736 -9627 -10250 -6973 -7499 -2522 -934 754 5403
14644E403j895p249K452J93m749k48M142k328o7j516J978N509K195J547n374l884
$$ 5403 3508 -3741 -1289 -1096 -5845 -6093 -1951 -4279 -4346 -5862 -3884 1625 3820 5367 -7 -3891
14628c891p10J286L695M471q31l859j139K183J078j1J490p59j342r0R79J765l252
$$ -3891 -4601 -3315 380 4851 4020 161 -978 1205 2283 2272 3762 3003 1661 1571 2550 4315 1063
14611A063n337q02l850J216K210k607J592J276K581K596n063j318q9J562K606
$$ 1063 -4274 -5076 -8926 -7710 -5500 -8107 -6515 -5239 -2658 -62 -5125 -6443 -6532 -4970 -2364
14596b364K346j811K704L032n426m61K619l346q80p69k604J52N587L280n2N89
$$ -2364 -18 -1829 875 3907 -1519 -1980 639 -2707 -3587 -4356 -6960 -6808 -1221 2059 2007 2596
14580B596k58j512J443o83J516L402l538l891m149n251Q41J85K949K549O94J76
$$ 2596 2338 826 2269 1586 3102 6504 2966 -925 -5074 -10325 -9484 -9299 -6350 -3801 -3107 -2931
14564b931q06J746j517P30J632j172m388j046m107P50K703P08J782l597l32n8
$$ -2931 -3737 -1991 -3508 -2778 -1146 -2318 -6706 -7752 -11859 -11109 -8406 -7698 -5916 -9513 -9845 -9903
14548i903m856R6J859r03j76K187M482O39l607K43L33j973j268K089L617L111
$$ -9903 -14759 -14663 -12804 -13707 -13883 -11696 -7214 -6575 -10182 -9939 -9606 -11579 -12847 -10758 -7141 -4030
14532d030j79l57N299J249l307J506k10m272l22j202M720m9q43l004k095K37Q30
$$ -4030 -4209 -4566 733 1982 -1325 181 -29 -4301 -4623 -5825 -1105 -1154 -1997 -5001 -7096 -6859 -6029
14515f029q015l006M159M560k401j532N515O612L600m885k418l136J810O244J242
$$ -6029 -14044 -17050 -12891 -8331 -10732 -12264 -6749 -137 3463 -1422 -3840 -6976 -5166 1078 2320
14500B320J421l14j598k586k842o97J504m940p5M100j712k159L23L301l648j02
$$ 2320 3741 3427 1829 -757 -3599 -4296 -2792 -7732 -7807 -3707 -5419 -7578 -7255 -3954 -7602 -7704
14484g704K255j258n726k442J202N248K627K084M211J279k102K52J232m049k879
$$ -7704 -5449 -6707 -12433 -14875 -13673 -8425 -5798 -3714 497 1776 -326 -74 1158 -2891 -5770
14469e770k045K195K199j248j390Q40J545k057m234L213N457J316j477J6J664
$$ -5770 -7815 -5620 -3421 -4669 -6059 -5219 -3674 -5731 -9965 -6752 -1295 21 -1456 -1440 224
14454B24o873l26N572l92L24k681r247J477N29O50K603L006O00L707K531Q55k096
$$ 224 -6649 -6975 -1403 -1795 -1471 -4152 -13399 -11922 -11393 -10743 -8140 -5134 -4534 -827 1704 2559 463
14437D63P28k097l536K823P76R68m98j667j014L538L192m879o733M484J595k15
$$ 463 1191 -906 -4442 -1619 -843 125 -373 -2040 -3054 484 3676 -1203 -7936 -3452 -1857 -2072
14421b072O38j897k32J907j908p988K263O268J07J407j599J016J845L821J244
$$ -2072 -1434 -3331 -3563 -1656 -3564 -11552 -9289 -3021 -2914 -1507 -3106 -2090 -245 3576 4820
14406D820j42p275m644K724K152j3J53l168k166L729L554q73K090k21o14K842
$$ 4820 4678 -2597 -7241 -4517 -2365 -2378 -2225 -5393 -7559 -3830 -276 -1149 941 720 106 2948
14390B948P97l052j680K6J505R87k425j749j906j202j358J175M94M785j753j537
$$ 2948 3745 693 -987 -961 544 1531 -894 -2643 -4549 -5751 -7109 -5934 -5440 -655 -2408 -3945
14374c945J323l264l8K806M12O534K148n883K506l601k620J120o84k80l17K8o08
$$ -3945 -2622 -5886 -5924 -3118 -2706 3828 5976 93 2599 -1002 -3622 -2502 -3186 -3466 -3783 -3755 -4363
14357d363l048J884M834J887j163m928k00q54M57N311N00k625n936n704K976Q749
$$ -4363 -7411 -5527 -693 1194 31 -4897 -5097 -5951 -5494 -183 317 -2308 -8244 -13948 -10972 -2223
14341b223R95J86Q510J290j730k493M263j007k044j946J069j416j939j70J440
$$ -2223 -1228 -1042 7468 8758 7028 4535 8798 7791 5747 3801 4870 3454 1515 1345 2785
14326B785j745k5K094J200n855m955O34M089l537k45M22L990k964j753j054l248
$$ 2785 1040 1015 3109 4309 -1546 -6501 -5867 -1778 -5315 -5560 -5138 -1148 -4112 -5865 -6919 -10167
14310a0167j076N590P671J065j091m478k057l971K889N70L377O178k201o463M63
$$ -10167 -11243 -5653 2018 3083 1992 -2486 -4543 -8514 -5625 -5055 -1678 4500 2299 -4164 -3701
14295c701j869L017J263K686K121m295J541K246L047j261j602j117j707L104M724
$$ -3701 -5570 -2553 -1290 1396 3517 -778 763 3009 6056 4795 3193 2076 369 3473 8197
14280H197k899n35N404n214p239J85K903J29m734j13j727L115l50l66l813k032
$$ 8197 5298 4763 10167 4953 -2286 -2101 802 931 -3803 -3916 -5643 -2528 -2878 -3244 -7057 -9089
14264i089N486l0J184K736R62k800L95L774J856o128q110k157P73N322N354k588
$$ -9089 -3603 -3633 -2449 287 1249 -1551 -1156 2618 4474 -1654 -9764 -11921 -11148 -5826 -472 -3060
14248c060p947j857M160P59j096j928K105K454O203j317p454N73O68q02n636K638
$$ -3060 -11007 -12864 -8704 -7945 -9041 -10969 -8864 -6410 -207 -1524 -8978 -8405 -7737 -8539 -14175 -11537
14232a1537M755L232P24P29o99O8L38n102n72m8J595J638K939j768L32m795K107
$$ -11537 -6782 -3550 -2826 -2097 -2796 -2728 -2390 -7492 -8064 -8112 -6517 -4879 -1940 -3708 -3376 -8171 -6064
14215f064J784k676M49K560N829R72o405k003J206K39m089j073M85m644K383M443
$$ -6064 -4280 -6956 -6507 -3947 1882 2854 -3551 -5554 -4348 -4109 -8198 -9271 -8786 -13430 -11047 -6604
14199f604m380p802l46O494L426j29K865q62l228K437K417J425Q62K499k014k928
$$ -6604 -10984 -18786 -19132 -12638 -9212 -9341 -6476 -7338 -10566 -8129 -5712 -4287 -3425 -926 -2940 -5868
14183e868m899j024O122k657k323J315J754M186L160m400l761K903K485l379j245
$$ -5868 -10767 -11791 -5669 -8326 -10649 -9334 -7580 -3394 -234 -4634 -8395 -5492 -3007 -6386 -7631
14168g631M912J242k288l700j996K755K051J794L70L298K936j782p62l239n845
$$ -7631 -2719 -1477 -3765 -7465 -9461 -6706 -4655 -2861 -2491 807 3743 1961 1199 -2040 -7885
14153g885L04q25l797Q95L984j79j459K095J972O61m876P79M800N085M492l94
$$ -7885 -7581 -8406 -12203 -11308 -7324 -7503 -8962 -6867 -4895 -4234 -9110 -8331 -3531 1554 6046 5652
14137E652n926m872m108j459L967l07J386j280k077l32M498K132m232j462M028
$$ 5652 -274 -5146 -9254 -10713 -6746 -7053 -5667 -6947 -9024 -9356 -4858 -2726 -6958 -8420 -4392
14122d392K909l349K104K939k856l428o628m730M507J821m63L314K502K288j761
$$ -4392 -1483 -4832 -2728 211 -2645 -6073 -12701 -17431 -12924 -11103 -11566 -8252 -5750 -3462 -5223
14107e223k656l840N968J312m168k58J045p27j222L692p75l449l88j594K76P551
$$ -5223 -7879 -11719 -5751 -4439 -8607 -8865 -7820 -8547 -9769 -6077 -6852 -10301 -10689 -12283 -12007 -4456
14091d456M528j878j012J554j35K260k656q26J063j492j637j88j323J643K315
$$ -4456 72 -1806 -2818 -1264 -1399 861 -1795 -2621 -1558 -3050 -4687 -4875 -6198 -4555 -2240
14076b240O08j001K104P82K012L935k385j973k706l981R75n011R48L252K557j471
$$ -2240 -1632 -2633 -529 253 2265 6200 3815 1842 -864 -4845 -3870 -8881 -7933 -4681 -2124 -3595
14060c595j47P85O03K716J788j15l542m588k707m802L089N614j232m61K226K21
$$ -3595 -3742 -2957 -2354 362 2150 2035 -1507 -6095 -8802 -13604 -10515 -4901 -6133 -6594 -4368 -4147
14044d147j826k740P7j725Q8K432J858k264O8K206K72N400K52n13j491J322j799
$$ -4147 -5973 -8713 -8636 -10361 -10273 -7841 -5983 -8247 -8179 -5973 -5701 -301 -49 -562 -2053 -731 -2530
14027b530J256J752m502l006N70k568M331L006j353P55J509l7k369m260P23L737
$$ -2530 -1274 478 -4024 -7030 -6460 -9028 -4697 -1691 -3044 -2289 -780 -817 -3186 -7446 -6723 -2986
14011b986Q49l395n027k462M347K511l754L255J290r54k241k220M703K89j363
$$ -2986 -2137 -5532 -10559 -13021 -8674 -6163 -9917 -6662 -5372 -6326 -8567 -10787 -6084 -5795 -7158
13996g158k574N24O126M92l142L491l65n949K460L353K160k749k322o368K56J126
$$ -7158 -9732 -9208 -3082 -2590 -5732 -2241 -2606 -8555 -6095 -2742 -582 -3331 -5653 -12021 -11765 -10639
13980a0639L860K119R73O42O61m5j137O44M17K589J357j867j252L331J029k810
$$ -10639 -6779 -4660 -3687 -3045 -2384 -2429 -3566 -2922 -2505 84 1441 -426 -1678 1653 2682 -128
13964a28m2L412k97MK154l557l596j849j626l868K52J906j273L94L672J84j172
$$ -128 -170 3242 2945 2949 5103 1546 -2050 -3899 -5525 -9393 -9141 -7235 -8508 -8114 -4442 -4258 -5430
13947e430L081M75Q33j514l598J486P26k446k52K317K321R82o044k211L709K4
$$ -5430 -2349 -1874 -1041 -2555 -6153 -4667 -3941 -6387 -6639 -4322 -2001 -1019 -7063 -9274 -5565 -5541
13931e541L101P691L55K3m536j255MJ315O64m296k803J87N8J629M225n134k153
$$ -5541 -2440 5251 5606 5629 1093 -162 -158 1157 1821 -2475 -5278 -5091 -5033 -3404 821 -4313 -6466
13914f466o50J952M1J52Q11K742L005j726p189n694K098M760M160M189L425l97
$$ -6466 -7116 -5164 -5123 -4971 -4160 -1418 1587 -139 -7328 -13022 -10924 -6164 -2004 2185 5610 5213
13898E213J094J797j54m810l606m713m355j074q61J846K254J570J023L718l827
$$ 5213 6307 8104 7950 3140 -466 -5179 -9534 -10608 -11469 -9623 -7369 -5799 -4776 -1058 -4885
13883d885p77L805j0j970p24P46l236K49J634N99M50K058J287l540l31M767j41
$$ -4885 -5662 -1857 -1867 -3837 -4561 -3815 -7051 -6802 -5168 -4569 -4119 -2061 -774 -4314 -4645 122 -19
13866a9M59K485k904n031j432K477K75j028M41p186n126L219M793K461J821j017
$$ -19 440 2925 21 -5010 -6442 -3965 -3690 -4718 -4277 -11463 -16589 -13370 -8577 -6116 -4295 -5312
13850e312K96N451L765O83n100l223j192P55L118l707k907J011k341k102J778
$$ -5312 -5016 435 4200 4883 -217 -3440 -4632 -3877 -759 -4466 -7373 -6362 -8703 -10805 -9027
13835i027J230j373L34j565m450M007N722L537J755K735N310k471m564j584K311
$$ -9027 -7797 -9170 -8836 -10401 -14851 -10844 -5122 -1585 170 2905 8215 5744 1180 -404 1907
13820A907J298m102J879j286k123j447J579o745n979L907L874K288k770j68N486
$$ 1907 3205 -897 982 -304 -2427 -3874 -2295 -9040 -15019 -11112 -7238 -4950 -7720 -7888 -2402
13805b402L203j968m326j817O25p76Q58N12P19l681k8M163P09p452K94M107K379
$$ -2402 801 -1167 -5493 -7310 -6685 -7461 -6603 -6091 -5372 -9053 -9081 -4918 -4209 -11661 -11367 -7260 -4881
13788d881l230l637M048L42L378N020K130L2k350o622k353J079M050N285l964
$$ -4881 -8111 -11748 -7700 -7358 -3980 1040 3170 3202 852 -5770 -8123 -7044 -2994 2291 -1673
13773a673k126k784o00N139j447j926K011k108J650k379j598J108j418n09m71
$$ -1673 -3799 -6583 -7183 -2044 -3491 -5417 -3406 -5514 -3864 -6243 -7841 -6733 -8151 -8660 -9131
13758i131L515j548l695N77O860N196m17J47p126j454k85M094l74m382P77j323
$$ -9131 -5616 -7164 -10859 -10282 -3422 1774 1357 1504 -5622 -7076 -7361 -3267 -3641 -8023 -7246 -8569
13742h569L986R97p67j967j783Q49N658M678k953j736j045l915n73P3j621o291
$$ -8569 -4583 -3586 -4353 -6320 -8103 -7254 -1596 3082 129 -1607 -2652 -6567 -7140 -7067 -8688 -14979
13726a4979p11J300M594J74K178K750K406J430K917j446n20n201Q07L450m271
$$ -14979 -15690 -14390 -9796 -9622 -7444 -4694 -2288 -858 2059 613 93 -5108 -4301 -851 -5122
13711e122k44L36l790K812K54J480K082l906J65K78K249Q28O086J226m852o789
$$ -5122 -5366 -5030 -8820 -6008 -5754 -4274 -2192 -6098 -5933 -5655 -3406 -2578 3508 4734 -118 -6907
13695f907m82O17j036j230m178N327N233O70k732m938J617Q301O866n530n333
$$ -6907 -7389 -6772 -7808 -9038 -13216 -7889 -2656 -1986 -4718 -9656 -8039 262 7128 1598 -3735
13680c735j778N013J5p68l179L169j115J813K105k928r10p250j012O587L994k354
$$ -3735 -5513 -500 -485 -1253 -4432 -1263 -2378 -565 1540 -1388 -2298 -9548 -10560 -3973 21 -2333
13664b333J908N025J545J14k292k817J547K148j528k702N55L78k700p51L802r52
$$ -2333 -425 4600 6145 6259 3967 1150 2697 4845 3317 615 1170 1548 -1152 -1903 1899 947
13648I47k37p98M96l538l26K30J436J878K154j365p19K227j402o72j862K545k353
$$ 947 710 -88 408 -3130 -3456 -3226 -1790 88 2242 877 158 2385 983 311 -1551 994 -1359
13631a359n619k154k01M674J356K957J412J246K98m646o802j724P041Q462J047
$$ -1359 -6978 -9132 -9333 -4659 -3303 -346 1066 2312 2610 -2036 -8838 -10562 -3521 4941 5988
13616E988l111m29l752k719J771j053k170P54O85k44n1L196O447J944o245n499
$$ 5988 2877 2448 -1304 -4023 -2252 -3305 -5475 -4721 -4036 -4280 -4331 -1135 5312 7256 1011 -4488
13600d488L222K968m261k51J146P383p76j593k103N004L443M251M177l909l865
$$ -4488 -1266 1702 -2559 -2810 -1664 5719 4943 3350 1247 6251 9694 13945 18122 14213 10348
13585A0348m28m169n994l273J918j478p6J546n64q04j856p05K876M369L34j765
$$ 10348 9920 5751 -243 -3516 -1598 -3076 -3152 -1606 -2170 -2974 -4830 -5535 -2659 1710 2044 279
13569B79j720k839j788K560Q59o51k659k674Q61N541l0j002l116l507N11J758
$$ 279 -1441 -4280 -6068 -3508 -2649 -3300 -5959 -8633 -7772 -2231 -2261 -3263 -6379 -9886 -9375 -7617
13553g617J222j290Q81O356L573l254k741k826j061o43l293k430L270L825K402
$$ -7617 -6395 -7685 -6804 -448 3125 -129 -2870 -5696 -6757 -7400 -10693 -13123 -9853 -6028 -3626
13538c626m022M196k829n989L868N070K682o61q4n032j402L61j194n57J660N30
$$ -3626 -7648 -3452 -6281 -12270 -8402 -3332 -650 -1311 -1395 -6427 -7829 -7468 -8662 -9219 -7559 -7029
13522g029m133j738N087K842K154J992r95l718m38K980j256j702O97K096J41p600
$$ -7029 -11162 -12900 -7813 -4971 -2817 -825 -1820 -5538 -5976 -2996 -4252 -5954 -5257 -3161 -3020 -10620
13506a0620l669L638r25L653j836o32J834J611q32l94n81l344k605K355N329K705
$$ -10620 -14289 -10651 -11576 -7923 -9759 -10391 -8557 -6946 -7778 -8172 -8753 -12097 -14702 -12347 -7018 -4313
13490d313k12n42k887k02K816m123j018J986L836L643M5J253k916k531M211J505
$$ -4313 -4525 -5067 -7954 -8156 -5340 -9463 -10481 -8495 -4659 -1016 -971 282 -2634 -5165 -954 551
13474E51l79j744m016m783j268m14K067N465M642K723L760j42m499m717J759j281
$$ 551 172 -1572 -5588 -10371 -11639 -12053 -9986 -4521 121 2844 6604 6462 1963 -2754 -995 -2276
13458b276j224K95j548J682M381J652n31J067J203n142j867j771k341p72j272
$$ -2276 -3500 -3205 -4753 -3071 1310 2962 2431 3498 4701 -441 -2308 -4079 -6420 -7192 -8464
13443h464lM028j744J388K371K143l151k174M14p06J337P856M952n856m835m235
$$ -8464 -8467 -4439 -6183 -4795 -2424 -281 -3432 -5606 -5192 -5898 -4561 3295 8247 2391 -2444 -6679
13427f679n63K482K261l368j532J388Q50j693N07j928l9k93J107K887p76K362
$$ -6679 -7242 -4760 -2499 -5867 -7399 -6011 -5161 -6854 -6347 -8275 -8314 -8607 -7500 -4613 -5389 -3027
13411c027O28K364m825J001j33O427K690l570l957j021l64j91L233q54n85K983
$$ -3027 -2399 -35 -4860 -3859 -3992 2435 5125 1555 -2402 -3423 -3787 -3978 -745 -1599 -2184 799
13395G99j347k60k301k497k776r90Q11M817j177o266j945l79N80k96K947O756
$$ 799 -548 -808 -3109 -5606 -8382 -9372 -8561 -3744 -4921 -11187 -13132 -13511 -12931 -13227 -10280 -3524
13379c524k195q23J572J148J761r69l374j456l769n58M13K777O316N05M27l802
$$ -3524 -5719 -6542 -4970 -3822 -2061 -3030 -6404 -7860 -11629 -12187 -11774 -8997 -2681 -2176 -1749 -5551
13363e551J197Q96K129p56p7R86J280k636k212j118j154K016O5k137L30J208O794
$$ -5551 -4354 -3458 -1329 -2085 -2162 -1176 104 -2532 -4744 -5862 -7016 -5000 -4935 -7072 -6742 -5534 1260
13346A260N229L54m505n202k841K383J056n112j545J529L343Q25j688J018j737
$$ 1260 6489 6843 2338 -2864 -5705 -3322 -2266 -7378 -8923 -7394 -4051 -3226 -4914 -3896 -5633
13331e633k210K889p3j134L644k607k028M919k049k985j436n491j984M547M607
$$ -5633 -7843 -4954 -5027 -6161 -2517 -5124 -7152 -2233 -4282 -7267 -8703 -14194 -16178 -11631 -7024
13316g024J656j652n58l201k567J389M715J585k162L36K035j483j733L168L734
$$ -7024 -5368 -7020 -7578 -10779 -13346 -11957 -7242 -5657 -7819 -7483 -5448 -6931 -8664 -5496 -1762
13301a762L255N76p61l450J99m87j721k379n946J71L633P88K694J645l473k127
$$ -1762 1493 2069 1308 -2142 -1943 -2430 -4151 -6530 -12476 -12305 -8672 -7884 -5190 -3545 -7018 -9145
13285i145L775k440q63L921J037p17J071J162J103N39o232n047P73L323M623J856
$$ -9145 -5370 -7810 -8673 -4752 -3715 -4432 -3361 -2199 -1096 -557 -6789 -11836 -11063 -7740 -3117 -1261
13269a261o63n918J304J244k282P82N03J448l22j897M29m79k003l813r1M986M615
$$ -1261 -1924 -7842 -6538 -5294 -7576 -6794 -6291 -4843 -5165 -7062 -6633 -7112 -9115 -12928 -13019 -8033 -3418
13252c418k680k854J855K596M41K189J316k790j314J295l47n5j622j36M174M152
$$ -3418 -6098 -8952 -7097 -4501 -4060 -1871 -555 -3345 -4659 -3364 -3711 -3766 -5388 -5524 -1350 2802
13236B802J819l637k640k131J090K610j923n640o96J579m105j170M721j334N205
$$ 2802 4621 984 -1656 -3787 -2697 -87 -2010 -7650 -8346 -6767 -10872 -12042 -7321 -8655 -3450
13221c450K330n068k787L421M211M434l05j552m901m048j398m4M774Q04k877j663
$$ -3450 -1120 -6188 -8975 -5554 -1343 3091 2786 1234 -3667 -7715 -9113 -9157 -4383 -3579 -6456 -8119
13205h119j028j032M877L530j420J804M723J830J418m667o332l840J124J389L386
$$ -8119 -9147 -10179 -5302 -1772 -3192 -1388 3335 5165 6583 1916 -4416 -8256 -7132 -5743 -2357
13190b357K516M82o66k542L827L200L342m6l668p054m387j268J5M151P334K261
$$ -2357 159 641 -25 -2567 1260 4460 7802 7756 4088 -2966 -7353 -8621 -8606 -4455 2879 5140
13174E140k159j927M33r4k244K99l888m386J626J489N34l079L49K529K305k837
$$ 5140 2981 1054 1487 1393 -851 -552 -4440 -8826 -7200 -5711 -5177 -8256 -7907 -5378 -3073 -5910
13158e910n710j249L440J744L074j456L953Q180m333o070k706k659M0O815p32
$$ -5910 -11620 -12869 -9429 -7685 -4611 -6067 -2114 6066 1733 -4337 -7043 -9702 -9662 -2847 -3579
13143c579m312l086L248L982j513K345L504n13k780j847n16M630L591j149k947
$$ -3579 -7891 -10977 -7729 -3747 -5260 -2915 589 76 -2704 -4551 -5067 -437 3154 2005 -942
13128i42k194J327n21n48m099O33l457l60O842L143l04n06M948P46o578k829l709
$$ -942 -3136 -1809 -2330 -2878 -6977 -6344 -9801 -10161 -3319 -176 -480 -986 3962 4708 -1870 -4699 -8408
13111h408j539O750N435J037n185K397K524n054l105O92L122N76j50J294O43k583
$$ -8408 -9947 -3197 2238 3275 -1910 487 3011 -2043 -5148 -4456 -1334 -758 -908 386 1029 -1554
13095a554j067k842L618J550k353N60L554k118m605j093L853k401j044L196J455
$$ -1554 -2621 -5463 -1845 -295 -2648 -2088 1466 -652 -5257 -6350 -2497 -4898 -5942 -2746 -1291
13080a291k457n510J160K66M673J274j599l021m243J779M982N070M77n026l520
$$ -1291 -3748 -9258 -8098 -7832 -3159 -1885 -3484 -6505 -10748 -8969 -3987 1083 1560 -3466 -6986
13065f986P79k0j527P77J988J872m95k746k15q18L941P59p60j571L166L82j769
$$ -6986 -6207 -6227 -7754 -6977 -4989 -3117 -3612 -6358 -6573 -7391 -3450 -2691 -3451 -5022 -1856 -1474 -3243
13048c243k256j329j247j145m89L783L565K7j825J016L376K485l478k329m634
$$ -3243 -5499 -6828 -8075 -9220 -9709 -5926 -2361 -2334 -4159 -3143 233 2718 -760 -3089 -7723
13033g723K787M46Q15L839M673l914l640l280O35J771J835M061l142j850q04Q44
$$ -7723 -4936 -4490 -3675 164 4837 923 -2717 -5997 -5362 -3591 -1756 2305 -837 -2687 -3491 -2647
13017b647K096K315l425m112J87K065K331J579j685O04n52m48l087k924M00N802
$$ -2647 -551 1764 -1661 -5773 -5586 -3521 -1190 389 -1296 -692 -1244 -1692 -4779 -7703 -7303 -1501
13001a501O72o3k578j964m545p60L095M00J285k421P85k282K007L199J018k829
$$ -1501 -829 -892 -3470 -5434 -9979 -10739 -7644 -7244 -5959 -8380 -7595 -9877 -7870 -4671 -3653 -6482
12985f482l636L014O691J050k689Q196N974m577O29j99n333l244j522l10k098
$$ -6482 -10118 -7104 -413 637 -2052 6144 12118 7541 8170 7971 2638 -606 -2128 -2438 -4536
12970d536K759m95k423j844R08l12q96K248R09j361n64Q00L928K577j638J117
$$ -4536 -1777 -2272 -4695 -6539 -5631 -5943 -6839 -4591 -3682 -5043 -5607 -4807 -879 1698 60 1177
12954A177J40J510m211m243K28j994m79M447K486o68L13k01j442L108O322j84
$$ 1177 1317 2827 -1384 -5627 -5399 -7393 -7872 -3425 -939 -1607 -1294 -1495 -2937 171 6493 6309
12938F309j647l464j994j118j274O89j03O122r68m279l05P860O164N64m259L863
$$ 6309 4662 1198 -796 -1914 -3188 -2499 -2602 3520 2552 -1727 -2032 5828 11992 12556 8297 12160
12922A2160J842n435q057k458j193J348M377j286p522l707O483O750p36J945k05
$$ 12160 14002 8567 510 -1948 -3141 -1793 2584 1298 -6224 -9931 -3448 3302 2566 4511 4306
12907D306m591J788J713k906m120J055n8K681M0j092J570r65o276j770J012L728
$$ 4306 -285 1503 3216 310 -3810 -2755 -2813 -132 -92 -1184 386 -579 -6855 -8625 -7613 -3885
12891c885Q28L174p14n938J38K320j449n028j095J923R239O488m073R16J996m72
$$ -3885 -3057 117 -597 -6535 -6397 -4077 -5526 -10554 -11649 -9726 -487 6001 1928 2844 4840 4368
12875D368n903l191L307M85m427M179N16K11J196r84m650m208P35L183L957j163
$$ 4368 -1535 -4726 -1419 -934 -5361 -1182 -666 -455 741 -243 -4893 -9101 -8366 -5183 -1226 -2389
12859b389K547M28M66K280k106k966j421J174p5l414M105j092l256j67J698j251
$$ -2389 158 586 1052 3332 1226 -1740 -3161 -1987 -2062 -5476 -1371 -2463 -5719 -5886 -4188 -5439
12843e439j309J02J876J070K10K047M830j245o605l473j496J081M46L788L492
$$ -5439 -6748 -6646 -4770 -3700 -3490 -1443 3387 2142 -4463 -7936 -9432 -8351 -7905 -4117 -625
12828f25j878j822j278J10n83j774K72k187R17J021R9j649J243p00n80N8N312
$$ -625 -2503 -4325 -5603 -5493 -6076 -7850 -7578 -9765 -8848 -7827 -7728 -9377 -8134 -8834 -9414 -9356 -4044
12811d044J700q708l390k754Q37O555N142M647k698k723o199o148J806M073N291
$$ -4044 -2344 -11052 -14442 -17196 -16359 -9804 -4662 -15 -2713 -5436 -11635 -17783 -15977 -11904 -6613
12796f613K740o33Q13R95K135J979l319n824qK69n042q92k104J805N619k55J075
$$ -6613 -3873 -4506 -3693 -2698 -563 1416 -1903 -7727 -7735 -7466 -12508 -13400 -15504 -13699 -8080 -8335 -7260
12779g260J030L968l62R64J1m175P48K224J447l75k051m31o286l067J010r27l86
$$ -7260 -6230 -2262 -2624 -1660 -1649 -5824 -5076 -2852 -1405 -1780 -3831 -4262 -10548 -13615 -12605 -13532 -13918
12762a3918L214J80j664R88q6J292J700N944q23j477k047Q62N764j489K613j019
$$ -13918 -10704 -10524 -12188 -11200 -11286 -9994 -8294 -2350 -3173 -4650 -6697 -5835 -71 -1560 1053 34
12746C4j694l915J003L886L904J31l402m037j286M982o03o191o902J694M786N811
$$ 34 -1660 -5575 -4572 -686 3218 3349 -53 -4090 -5376 -394 -997 -7188 -14090 -12396 -7610 -1799
12730a799J400J372K03k508j342k733m604k799R09K481M436L165j422M778M132
$$ -1799 -399 973 1176 -1332 -2674 -5407 -10011 -12810 -11901 -9420 -4984 -1819 -3241 1537 5669
12715E669j866j45m798o543l90j073k533M72L818K96R4K611N195k692o811J506
$$ 5669 3803 3658 -1140 -7683 -8073 -9146 -11679 -11207 -7389 -7093 -6999 -4388 807 -1885 -8696 -7190
12699g190J200L559j218N174J691m590p48k966l496M492j9n702L477L515O098
$$ -7190 -5990 -2431 -3649 1525 3216 -1374 -2122 -5088 -8584 -4092 -4111 -9813 -6336 -2821 3277
12684C277J726l325k366j198q74L0l695M350N213N71K896p51p256J320M208J738
$$ 3277 5003 1678 -688 -1886 -2760 -2730 -6425 -2075 3138 3709 6605 5854 -1402 -82 4126 5864
12668E864m054m4j832L901J426p387p09L559l5L098M221k637n768k555j027M062
$$ 5864 1810 1766 -66 3835 5261 -2126 -2835 724 689 3787 8008 5371 -397 -2952 -3979 83
12652H3J280k138k411n881j502L205N572L574j969K329J596m53p37j667k255m65
$$ 83 1363 -775 -3186 -9067 -10569 -7364 -1792 1782 -187 2142 3738 3285 2548 881 -1374 -1839
12636a839L032L947j742l591N085P232O0q00J101j928J556K11o571n385J881K836
$$ -1839 1193 5140 3398 -193 4892 12124 12184 11384 12485 10557 12113 12324 5753 368 2249 5085
12620E085m11l194k989m216J111K544j716j509J124O106J145m213m574o78K538
$$ 5085 4674 1480 -1509 -5725 -4614 -2070 -3786 -5295 -4171 1935 3080 -1133 -5707 -6385 -3847
12605c847j94q004n250L885P350Q547J773j440r60j569k939j308O00j393k849
$$ -3847 -4041 -12045 -17295 -13410 -6060 2487 4260 2820 1860 291 -2648 -3956 -3356 -4749 -7598
12590g598K79M09R00q93p97k944J463J318J445l423m036j273M497L720L700J037
$$ -7598 -7319 -6910 -6010 -6903 -7700 -10644 -9181 -7863 -6418 -9841 -13877 -15150 -10653 -6933 -3233 -2196
12574b196k979J601LK43P21l889n46O145M037m048L117K852j441m50m429J688
$$ -2196 -5175 -3574 -3571 -3328 -2607 -6496 -7042 -897 3140 -908 2209 5061 3620 3170 -1259 429
12558D29O77J18j518j067O5l81J535O56K856k273K154L084J586R42J956N291P50
$$ 429 1106 1224 -294 -1361 -1296 -1677 -142 514 3370 1097 3251 6335 7921 8863 10819 16110 16860
12541A6860L705J64K167p59j140N477K495K776O041L490P914J6701J1432R603
$$ 16860 20565 20729 22896 22137 20997 26474 28969 31745 37786 41276 49190 65891 77323 86926
12527H6926J2923K1023L3172M8609O8050J08279J83665K96031L45041K22272j318
$$ 86926 99849 120872 154044 202653 270703 378982 562647 858678 1203719 1425991 1424673
12516A424673j46339k32850k47493k06106j43489r8593p6487o4489m8616l2253
$$ 1424673 1278334 1045484 797991 591885 448396 349803 273316 208827 160211 127958
12506A27958k3179k2137j7195r977j0425k915k100q741n720k149l955j504L562
$$ 127958 104779 82642 65447 55470 45045 42130 40030 31289 25569 23420 19465 17961 21523
12493B1523q69m086J911N59J201K727P332J0445Q390L275J29k790o223j0294q864
$$ 21523 20654 16568 18479 19038 20239 22966 30298 40743 49133 52408 52537 49747 43524 33230 24366
12478B4366l524o397k884l167n119o15j887j119K058L142L203M491j35k523l216
$$ 24366 20842 14445 11561 8394 3275 2660 773 -346 1712 4854 8057 12548 12413 9890 6674
12463F674j754m16M473J437J704K719K121J414l088k792k536l277k282L928K802
$$ 6674 4920 4504 8977 10414 12118 14837 16958 18372 15284 12492 9956 6679 4397 8325 11127
12448A1127J982j188l354p969l117l487K229M112Q2J583L541n58k420k408n283
$$ 11127 13109 11921 8567 598 -2519 -6006 -3777 335 417 2000 5541 4983 2563 155 -5128
12433e128k639J92K610L569k994J700K792k965l058M276J898M174M318m7J968
$$ -5128 -7767 -7575 -4965 -1396 -4390 -2690 102 -2863 -5921 -1645 253 4427 8745 8698 10666
12418A0666p00k773J473j465J309k46j278J185l95J046j678j507L495Q770J2538
$$ 10666 9966 7193 8666 7201 8510 8264 6986 8171 7776 8822 7144 5637 9132 17902 30440
12403C0440J5451Q296n2n057p117q970q461j314n136j083n373m481o43j880j077
$$ 30440 45891 54187 54135 49078 41961 32991 24530 23216 18080 16997 11624 7143 6500 4620 3543
12388C543n29m427L174K20k31p60m898L484O123k883k123K668m708o630m00L521
$$ 3543 3014 -1413 1761 1981 1750 990 -3908 -424 5699 2816 693 3361 -1347 -7977 -8377 -4856
12372d856o85R61J27J869M464J385k057k366j858M200l82m472J425M260j039J17
$$ -4856 -5541 -4580 -4453 -2584 1880 3265 1208 -1158 -3016 1184 802 -3670 -2245 2015 976 1093
12356A093l06p82J608K532K643m699l786J435J534j274K802J159L82R87j470j09
$$ 1093 787 5 1613 4145 6788 2089 -1697 -262 1272 -2 2800 3959 4341 5328 3858 3749
12340C749l349j024Q90K038j557N162J363j641l055m592M572J713J891M05K115
$$ 3749 400 -624 266 2304 747 5909 7272 5631 2576 -2016 2556 4269 6160 6565 8680
12325H680K478k373k172j603k699k549K105L361J85J28J620j250l225l256J734
$$ 8680 11158 8785 6613 5010 2311 -238 1867 5228 5413 5541 7161 5911 2686 -570 1164
12310A164P158L973l031j384J91l964n209l227p54k32N027j304l006J228M149
$$ 1164 8322 12295 9264 7880 8071 4107 -1102 -4329 -5083 -5315 -288 -1592 -4598 -3370 779
12295G79l67L019J361o066o363J1P5l9k678J443J091J215j658m72k307K652J667
$$ 779 412 3431 4792 -1274 -7637 -7626 -7551 -7590 -10268 -8825 -7734 -6519 -8177 -8649 -10956 -8304 -6637
12278f637l026M907N79L755p58l575n191m795R31Q075O582K236j002n61j995l607
$$ -6637 -9663 -4756 -4177 -422 -1180 -4755 -9946 -14741 -13810 -5735 847 3083 2081 1520 -475 -4082
12262d082o468K440Q09M053M34k09J538p30k643l841M33O38J469L724P8l243M84
$$ -4082 -10550 -8110 -7301 -3248 -2814 -3023 -1485 -2215 -4858 -8699 -8266 -7628 -6159 -2435 -2357 -5600 -5116
12245e116J724KN31m20k894J422l30Q46K806P310L254J658O76l974K8N563J378
$$ -5116 -3392 -3390 -2859 -3279 -6173 -4751 -5081 -4235 -1429 5881 9135 10793 11469 7495 7523 13086 14464
12228A4464k081q413l678k778j167K538L153L099k306k28p57k511J65M602J945
$$ 14464 12383 3970 292 -2486 -3653 -1115 2038 5137 2831 2603 1846 -665 -500 4102 6047
12213F047l08K732Lm650l246l818M688L861k167j122K816o31J035m03q55j559
$$ 6047 5739 8471 8474 3824 578 -3240 1448 5309 3142 2020 4836 4205 5240 4837 3982 2423
12197B423k635l391Q96M386L241k491l909k330Q45m778K52M384O331O379l689
$$ 2423 -212 -3603 -2707 1679 4920 2429 -1480 -3810 -2965 -7743 -7491 -3107 3224 9603 5914
12182E914p16K433j581m834j666j086m29L135j30O14l717n128J355J5N971K546
$$ 5914 5198 7631 6050 1216 -450 -1536 -1965 1170 1040 1654 -2063 -7191 -5836 -5821 150 2696
12166B696M82K841P34k215j03l132K709L982j708l458j465k564K206l628Q54O215
$$ 2696 3178 6019 6753 4538 4435 1303 4012 7994 6286 2828 1363 -1201 1005 -2623 -1769 4446
12150D446O75l513m81l425M96M631J329L682J445k930Q71K032o891l808K964M056
$$ 4446 5121 1608 1127 -2298 -1802 2829 4158 7840 9285 6355 7226 9258 2367 -1441 1523 5579
12134E579j727m401O82q28N4K177J836J650j262k295l586K54l30j98j32J550M418
$$ 5579 3852 -549 133 -695 -641 1536 3372 5022 3760 1465 -2121 -1867 -2197 -2395 -2527 -977 3441
12117C441m396m306j087K225j320K270P489M009k34J144l916m177n046m012M284
$$ 3441 -955 -5261 -6348 -4123 -5443 -3173 4316 8325 8091 9235 5319 1142 -3904 -7916 -3632
12102c632N677M402M496k446j594m242k735k476K715j210n25j904K409N121J301
$$ -3632 2045 6447 10943 8497 6903 2661 -74 -2550 165 -1045 -1570 -3474 -1065 4056 5357
12087E357l02j418J185K928k616O94N4k881l459J180P40j309k746L46J816L489
$$ 5357 5055 3637 4822 7750 5134 5828 5882 3001 -458 722 1462 153 -2593 -2247 -431 3058
12071C058M548n636j884m580K327J837n43O933O646K648l999o144o308j471j218
$$ 3058 7606 1970 86 -4494 -2167 -330 -873 6060 12706 15354 11355 5211 -1097 -2568 -3786
12056c786K363R251L297k016j355N361J72l599l46L910j355j635l952n48P64p13
$$ -3786 -1423 7828 11125 9109 7754 13115 13287 9688 9342 13252 11897 10262 6310 5762 6526 5813
12040E813j987L213N566l778r477q68l246l668K877J14K861K683K187L39r79l108
$$ 5813 3826 7039 12605 8827 -650 -1518 -4764 -8432 -5555 -5441 -2580 103 2290 2629 1650 -1458
12024a458o720k771K193O076M530o54k446l266J578M290m175l96K405J511J247
$$ -1458 -8178 -10949 -8756 -2680 1850 1196 -1250 -4516 -2938 1352 -2823 -3219 -814 697 1944
12009A944o691j813L555j817P19M554N372Q99n524j85K638L570R39k792j224O00
$$ 1944 -4747 -6560 -3005 -4822 -4103 451 5823 6722 1198 1013 3651 7221 8160 5368 4144 4744
11993D744j77p28k230k911N450N194M837M118M274L972N11n507k206J005J629
$$ 4744 4567 3839 1609 -1302 4148 9342 14179 18297 22571 26543 27054 21547 19341 20346 21975
11978B1975q265o673j970j122j24j152n335m476L124J131n89k751Q49q10j09N589
$$ 21975 13710 7037 5067 3945 3821 2669 -2666 -7142 -4018 -2887 -3476 -6227 -5378 -6188 -6297 -708
11962g08K291n277m119n42K112J994M161R49J310M3p91j309M04J450K013L82o79
$$ -708 1583 -3694 -7813 -8355 -6243 -4249 -88 861 2171 2214 1423 114 518 1968 3981 4363 3684
11945C684l698p12q63K496J560J135j919l040n744J18M020J2324p52m288J048
$$ 3684 -14 -726 -1589 907 2467 3602 1683 -1357 -7101 -6983 -2963 9361 8609 4321 5369
11930E369l27O551o01r73m521j321M300k687k161j682J666j536k396j495L420
$$ 5369 5042 11593 10992 10019 5498 4177 8477 5790 3629 1947 3613 2077 -319 -1814 1606
11915A606Q17K651K658l446o618J33J5j496K409J151K332J610L80o666j506M941
$$ 1606 2423 5074 7732 4286 -2332 -2199 -2184 -3680 -1271 -120 2212 3822 4202 -2464 -3970 971
11899I71J252J788L455k195k567J493m80o236J950K714m504j159k41o310r35P484
$$ 971 2223 4011 7466 5271 2704 4197 3717 -2519 -569 2145 -2359 -3518 -3759 -10069 -11004 -3520
11883c520Q354Q73J379Q50K11K343l673o641k07L067M446Q12m939l394J394N104
$$ -3520 4834 5707 7086 7936 8147 10490 6817 176 -31 3036 7482 8294 3355 -39 1355 6459
11867F459o87P40J895j504k916M58K067Q86K269R44N32k694m897q561m065M90
$$ 6459 5772 6512 8407 6903 3987 4445 6512 7398 9667 10611 11143 8449 3552 -5009 -9074 -8584
11851h584N071J113M53L326j117m294q591l012N530L188L528N629N993l455l623
$$ -8584 -3513 -2400 -1947 1379 262 -4032 -12623 -15635 -10105 -6917 -3389 2240 8233 4778 1155
11836A155k244k400K320m678n033K009N238M818N627j637l008N430J022j055j449
$$ 1155 -1089 -3489 -1169 -5847 -10880 -8871 -3633 1185 6812 5175 2167 7597 8619 7564 6115
11821F115J842p36M53J842j725j002j124P89J876j603n47l202l018Q06K99N206
$$ 6115 7957 7221 7674 9516 7791 6789 5665 6454 8330 6727 6180 2978 -40 766 1065 6271
11805F271k395j926N826j885n88K444o309p154k303K743J668K905m850j592J808
$$ 6271 3876 1950 7776 5891 5303 7747 1438 -5716 -8019 -5276 -3608 -703 -5553 -7145 -5337
11790e337L176k974j990J618J227K562k76L993l276l527N094L809l893l021L041
$$ -5337 -2161 -5135 -7125 -5507 -4280 -1718 -1994 1999 -1277 -4804 290 4099 206 -2815 226
11775B26K4k350m248j273o83K87N100p41j925K768Q18L303j521R69L959P37k391
$$ 226 250 -2100 -6348 -7621 -8304 -8017 -2917 -3658 -5583 -2815 -1997 1306 -215 754 4713 5450 3059
11758C059l703o53J445J890K311j204K551L941R78j764j174K582J137q346o349
$$ 3059 -644 -1297 148 2038 4349 3145 5696 9637 10615 8851 7677 10259 11396 3050 -3299
11743c299k498l597J307K48P750M389k260m567J138J159K207j636K386J406m321
$$ -3299 -5797 -9394 -8087 -7839 -89 4300 2040 -2527 -1389 -230 1977 341 2727 4133 -188
11728a88R52K195N655Q56Q21m408n499k408L750J626j177k666n643j769K400K150
$$ -188 764 2959 8614 9470 10291 5883 384 -2024 1726 3352 2175 -491 -6134 -7903 -5503 -3353
11712c353K068J913J224J679j406k010J127n928P65Q30l152j340O589J561l38
$$ -3353 -1285 628 1852 3531 2125 115 1242 -4686 -3921 -3091 -6243 -7583 -994 567 229
11697B29m132m235K489M153L324N06M19M93j726K899j586M618j204j307k440o712
$$ 229 -3903 -8138 -5649 -1496 1828 2334 2753 3246 1520 4419 2833 7451 6247 4940 2500 -4212
11681d212k118j31J331J959k137k988j362N628P43r87K682M873L575J113J325
$$ -4212 -6330 -6461 -5130 -3171 -5308 -8296 -9658 -4030 -3287 -4274 -1592 3281 6856 7969 9294
11666I294m813q058l758K202N097J851m351j186M612K733j782k944L311K872m132
$$ 9294 4481 -3577 -7335 -5133 -36 1815 -2536 -3722 890 3623 1841 -1103 2208 5080 948
11651I48j581K010R83L202l457l840k949o32j946L394K41K682J257m039l601J799
$$ 948 -633 1377 2360 5562 2105 -1735 -4684 -5316 -7262 -3868 -3627 -945 312 -3727 -7328 -5529
11635e529L505N450k039p70k094r40L788L082L231J599k4l550k533NK341J010
$$ -5529 -2024 3426 1387 617 -1477 -2417 1371 4453 7684 9283 9259 5709 3176 3181 5522 6532
11619F532l520j573J728L059P46J524l037k477Q01K572P28r88J803q0k758j793
$$ 6532 3012 1439 3167 6226 6972 8496 5459 2982 3783 6355 7083 6095 7898 7818 5060 3267
11603C267K355M458r5k098p95Q94J793J176k751k268K228M220R88m64j152j327
$$ 3267 5622 10080 9985 7887 7092 7986 9779 10955 8204 5936 8164 12384 13372 12908 11756 10429
11587A0429k865J850K774k376k938m638r61L413N588n77j274K454j667j097j22
$$ 10429 7564 9414 12188 9812 6874 2236 1275 4688 10276 9699 8425 10879 9212 8115 7993
11572G993l665m815j451L158M099O208k725m202j467l24k196J424l668r90L157
$$ 7993 4328 -487 -1938 1220 5319 11527 8802 4600 3133 2809 613 2037 -1631 -2621 536
11557E36O289J215k808J889L209k462j659J862j947k908o36l404J97R19p68j162
$$ 536 6825 8040 5232 7121 10330 7868 6209 8071 6124 3216 2580 -824 -627 292 -476 -1638
11541a638j28J013k354K46N162L928M464k523j650K852JK012k044K098K217m262
$$ -1638 -1766 -753 -3107 -2861 2301 6229 10693 8170 6520 9372 9373 11385 9341 11439 13656 9394
11525I394o502k000K841j049J458J706k966M693J364J961m135l30l866K333j42
$$ 9394 2892 892 3733 2684 4142 5848 2882 7575 8939 10900 6765 6435 2569 4902 4760
11510D760P56k254k199L009j877nk392K335J582K086R89k515o283k310J104M75
$$ 4760 5516 3262 1063 4072 2195 2190 -202 2133 3715 5801 6790 4275 -2008 -4318 -3214 -2739
11494b739l239j667K236K783n600m17M796J328M965m480J468J872L795o8r34n49
$$ -2739 -5978 -7645 -5409 -2626 -8226 -8643 -3847 -2519 2446 -2034 -566 1306 5101 5033 4099 3550
11478C550J682J2M390Q86k95M530P35l205M54j412J298J608J412j064l282n625
$$ 3550 5232 5244 9634 10520 10225 14755 15490 12285 12739 11327 12625 14233 15645 14581 11299 5674
11462E674j05O492j836n372m703l784L256M638L145p98k585k457j181m089j277
$$ 5674 5569 12061 10225 4853 150 -3634 -378 4260 7405 6607 4022 1565 384 -3705 -4982
11447d982M990R170k446m475j353p93M065j06N25K889j456m366O75l552Q90o85
$$ -4982 8 9178 6732 2257 904 111 4176 4070 4595 7484 6028 1662 2337 -1215 -325 -1010
11431a010K028O569j1n751J17L243L968r88O42q13K678K510N62j299m424M651
$$ -1010 1018 7587 7576 1825 1942 5185 9153 8165 8807 7994 10672 13182 13744 12445 8021 12672
11415A2672k088k499j028J718j811m582L461K963k50p55N69N955M21k811n015
$$ 12672 10584 8085 7057 8775 6964 2382 5843 8806 8556 7801 8370 14325 14746 11935 6920
11400F920K219l294J21P19K253n85o95L261K312j856k349j110m69m694J227L382
$$ 6920 9139 5845 5966 6685 8938 8353 7658 10919 13231 11375 9026 7916 7447 2753 3980 7362
11384G362N026M867j019m704l055N966J279j216j898j389L018l781n333M36j31
$$ 7362 12388 17255 16236 11532 8477 14443 15722 14506 12608 11219 14237 10456 5123 5559 5428
11369E428p52L85O64J913L622j314m656q324R16J993r04K358J658k139n97J966
$$ 5428 4676 5061 5725 7638 11260 9946 5290 -3034 -2118 -125 -1029 1329 2987 848 251 2217
11353B217L678L462K383k013K307p6J289n660l698M324L212j431o948L053M412
$$ 2217 5895 9357 11740 9727 12034 11958 13247 7587 3889 8213 11425 9994 3046 6099 10511
11338A0511k460l096K879j989J842L77l357L520J253k190M528K142j316J854n191
$$ 10511 8051 4955 7834 5845 7687 8064 4707 8227 9480 7290 11818 13960 12644 14498 9307
11323I307n97l984j596L716L474j122l541k065J122P50P273j50R37K931k712l100
$$ 9307 8710 4726 3130 6846 10320 9198 5657 3592 4714 5464 12737 12587 13524 16455 13743 10643
11307A0643K840J5K905k106K288k269J39k316ML629q78L311M456l383k124k278
$$ 10643 13483 13498 16403 14297 16585 14316 14455 12139 12143 15772 14894 18205 22661 19278 17154 14876
11291A4876n182K270K199m726m961N752M683m450n546K643K668k554k816J197
$$ 14876 9694 11964 14163 9437 4476 10228 14911 10461 4915 7558 10226 7672 4856 6053
11277F053n47l882l411M706L504j799L112K181M607J014k771k915j041M874N986
$$ 6053 5506 1624 -1787 2919 6423 4624 7736 9917 14524 15538 12767 9852 8811 13685 19671
11262A9671O57J630k794q181K02L766L985j954n091N297R80N87N198k948l440
$$ 19671 20328 21958 19164 10983 11185 14951 18936 16982 11891 17188 18168 18755 23953 21005 17565
11247A7565m839k998L755m995j090O03j605O495o61l970k39Q42N398J777K303
$$ 17565 12726 9728 13483 8488 7398 8001 6396 12891 12230 8260 8021 8863 14261 16038 18341
11232A8341j222R38k490m493M444L743M748M300r56o547p700Q997K490J213N3
$$ 18341 17119 18057 15567 11074 15518 19261 24009 28309 27353 20806 13106 22103 24593 25806 25859
11217B5859j139J132M952J656l006n35k677k695j847l758j794L237l7O39L655
$$ 25859 24720 25852 30804 32460 29454 28919 26242 23547 21700 17942 16148 19385 19348 19987 23642
11202B3642l82K340p72o44M59j330q77J431j497j37j367J18l952n335o43K580
$$ 23642 23260 25600 24828 24184 24643 23313 22436 23867 22370 22233 20866 20984 17032 11697 11054 13634
11186A3634O81j619K495k121N086L171q79r12J136M073k46o606l477N88M344Q15
$$ 13634 14315 12696 15191 13070 18156 21327 20448 19536 20672 24745 24499 17893 14416 15004 19348 20163
11170B0163p57k610j566L630R11j085k474L038J087L528M290Q36q97J300L8n971
$$ 20163 19406 16796 15230 18860 19771 18686 16212 19250 20337 23865 28155 28991 28094 29394 29432 23461
11154B3461k81k323l545P44j268j681J416k198J457J938L28O970J03j297K428
$$ 23461 23180 20857 17312 18056 16788 15107 16523 14325 15782 17720 18048 25018 25121 23824 26252
11139B6252R73j235K102n782k228m56L517L178l9l457j37J163l302J928L419L973
$$ 26252 27225 25990 28092 22310 20082 19626 23143 26321 26282 22825 22688 23851 20549 22477 25896 29869
11123B9869K979M074J447j105k436L211Q133L382K978L072O0K803Q083J1748K2594
$$ 29869 32848 36922 38369 37264 34828 38039 46172 49554 52532 55604 55664 58467 66550 78298 100892
11108A00892L2876M3118M6284M4495L2824K3401o07k4459l9531m6515l7786k8533
$$ 100892 133768 176886 223170 267665 300489 323890 323283 298824 259293 212778 174992 146459
11096A46459k1710j1525o245j1231q668o575o854m255R26q68Q51q38j71j616R57
$$ 146459 124749 113224 106979 95748 87080 80505 73651 69396 70322 69454 70305 69467 69296 67680 68637
11081F8637P07K605K701M975N44N376L664j509P796K915K26J0203J0170M389M432
$$ 68637 69344 71949 74650 79625 80169 85545 89209 87700 95496 98411 98637 108840 119010 123399 127831
11066A27831P37P23L175R720J0989J0818L345L440J2454J8510K2139K1274K5751
$$ 127831 128568 129291 132466 142186 153175 163993 167338 170778 183232 201742 223881 245155 270906
11053B70906L4793L6055M1946M9475O1536P6460J06624J30035J60310K16548K80124
$$ 270906 305699 341754 383700 433175 494711 571171 677795 807830 968140 1184688 1464812
11042A464812L41776L97964L99854L36844K32454R7661l0162j14779j38836j14166
$$ 1464812 1806588 2204552 2604406 2941250 3173704 3271365 3241203 3126424 2987588 2873422
11032B873422p8766n1034n5312j13468j96503k51948k60852k42118k11744j74999
$$ 2873422 2794656 2743622 2688310 2574842 2378339 2126391 1865539 1623421 1411677 1236678
11022A236678j41491j21993j10662j05714j04385r2819p3714o2837m8678l6680
$$ 1236678 1095187 973194 862532 756818 652433 559614 485900 423063 374385 337705
11012C37705k9640l1703k2557j4640j3684j2096j1693j4004q706q250r633o998
$$ 337705 308065 276362 253805 239165 225481 213385 201692 187688 178982 170732 161099 154101
11000A54101j004j455q046o990n393l034m866k851M616L085k7j22K930L010L204
$$ 154101 153097 151642 143596 136606 131213 128179 123313 120462 125078 128163 128136 128014 130944 133954 137158
10985A37158O983J2089J1224J1859J8531J9463J7535K2595L0461L6542N4520Q0781
$$ 137158 144141 156230 167454 179313 197844 217307 234842 257437 287898 324440 378960 459741
10973D59741J09034J63560K17042K57424K74782K45953J99586J49511R8778O6183
$$ 459741 568775 732335 949377 1206801 1481583 1727536 1927122 2076633 2175411 2241594
10963B241594L1094n690m9501j14525j75227k31602k65953k62286k29411j90135
$$ 2241594 2272688 2266998 2217497 2102972 1927745 1696143 1430190 1167904 938493 748358
10953G48358j52708j14635q4490n9885n4008l8028k5855k3302j5423j1645n357
$$ 748358 595650 481015 396525 336640 282632 244604 218749 195447 180024 168379 163022
10942A63022j0113j2017l860l409l623j637r70p259q787R08K421O80q36K46L411
$$ 163022 152909 140892 137032 133623 130000 128363 127393 120134 111347 112255 114676 115356 114520 114766 118177
10927A18177m032n372l08k095l746l255k62k415r97j052P67m189m833j943q897
$$ 118177 114145 108773 108465 106370 102624 99369 99107 96692 95695 94643 95410 91221 86388 84445 75548
10912G5548o339n189j017n286j972l921k164N34O201L804m091J077q196l712k229
$$ 75548 69209 64020 63003 57717 55745 51824 49660 50194 56395 60199 56108 57185 48989 45277 43048
10897D3048K094k50p713n950l679k564k971o89N037J465P99R91r30N242R106J341
$$ 43048 45142 44892 37179 31229 27550 24986 22015 21326 26363 27828 28627 29618 28688 33930 43036 44377
10881D4377O00N422J699M261N714K929O213J731L75J421m646r74K577k907j449
$$ 44377 44977 50399 52098 56359 62073 65002 71215 72946 73321 74742 70096 69122 71699 68792 67343
10866F7343p36k87j574j786n154j035N281o57j562O164K473k368j016l236L010
$$ 67343 66607 66320 64746 62960 57806 56771 62052 61395 59833 65997 68470 66102 65086 61850 64860
10851F4860j5Q94K623J1017O917k503L424M323l473j356M183j382K184L385M366
$$ 64860 64845 65739 68362 79379 86296 83793 87217 91540 88067 86711 90894 89512 91696 95081 99447
10836I9447L441j017L46R531R900O177O162R501J2082J2931J5832K5003K7922
$$ 99447 102888 101871 102217 111748 121648 127825 133987 143488 155570 168501 184333 209336 237258
10823B37258L2868L6117L4727K6858J8859K0752J8562O074O358J0027k39m691
$$ 237258 270126 306243 340970 367828 386687 407439 426001 432075 438433 448460 448221 443530
10811D43530k0381k5000k5057k7756k7426k5978k6916j7947k2181j3352o512q254
$$ 443530 423149 398149 373092 345336 317910 291932 265016 247069 224888 211536 205024 196770
10799A96770p940n600q976o915k302l718k62m230k540j610j224j155J640N649
$$ 196770 188830 183230 174254 167339 165037 161319 161057 156827 154287 152677 151453 150298 151938 157587
10785A57587L731P415J0342J5306K1991K3628J6168J7425J5522K1147K4122K6137
$$ 157587 161318 168733 179075 194381 216372 240000 256168 273593 289115 310262 334384 360521
10773C60521K4124K3157K7380K8490L6487L8396M7595N7460P2423P9223Q2763
$$ 360521 384645 407802 435182 463672 500159 538555 586150 643610 716033 795256 878019
10762H78019O7599M8036K2364o069l3040n0844n6701o3419p2168q6833j00213
$$ 878019 945618 993654 1016018 1009949 976909 926065 869364 805945 733777 646944 546731
10751E46731j13258j08720r7334q2311o3271l3860j1551j775M094P305J3797J6079
$$ 546731 433473 324753 227419 145108 81837 47977 36426 34651 38745 46050 59847 75926
10739G5926J1560M870J1326J4216R428K3054K2179K2643L2474L8469M9453N2212
$$ 75926 87486 92356 103682 117898 127326 150380 172559 195202 227676 266145 315598 367810
10727C67810N8562N3965M6419K7271L951j1522j7930k4247l0676l4255m7823n7477
$$ 367810 426372 480337 526756 554027 557978 546456 528526 504279 473603 439348 391525 334048
10715C34048n9523o0318n2432m3485k6958q304K22L62M358J1439K2227K2322K4677
$$ 334048 274525 214207 161775 118290 91332 83028 83250 83612 87970 99409 121636 143958 168635
10702A68635L2491L1516M0651M9131N8041O8832P9295P4786O7124N0015L2724
$$ 168635 201126 232642 273293 322424 380465 449297 528592 603378 670502 720517 753241
10691G53241J6068R284m975k1241k7801l8841n6819p3460p6015p6773n9455m8410
$$ 753241 769309 778593 773618 752377 724576 685735 628916 555456 479441 402668 343213 294803
10679B94803l6356k9370j8880j7088j0465j495k703J467J674k027l102j152L055
$$ 294803 258447 229077 210197 193109 182644 181149 178446 179913 181587 179560 176458 175306 178361
10666A78361M092L224M069K275J0489J5358J0193R776J1172Q467R815M274J653
$$ 178361 182453 185677 189746 192021 202510 217868 228061 237837 249009 257476 267291 271565 273218
10653B73218Q307J5378J5597J3926J6875J8911J8233J9020J7375K1100K2755K4170
$$ 273218 281525 296903 312500 326426 343301 362212 380445 399465 416840 437940 460695 484865
10641D84865K2706K1097J5854J4551J0229M037N42p596p081k313K159O326J5623
$$ 484865 507571 528668 544522 559073 569302 573339 573881 566285 559204 556891 559050 565376 580999
10628E80999K5420K8738L5953L4581K4427K7388L4087L3495L7114M4119N0487
$$ 580999 606419 635157 671110 705691 730118 757506 791593 825088 862202 906321 956808
10617I56808N3433N2877O0349O9952P5428Q5677R2426R6173J01537J01798J02762
$$ 956808 1010241 1063118 1123467 1193419 1268847 1354524 1446950 1543123 1644660 1746458 1849220
10606A849220J17664J24786J37208J49971J58201J72700J89753K11213K43816
$$ 1849220 1966884 2091670 2228878 2378849 2537050 2709750 2899503 3110716 3354532
10597C354532K86406L34987L96683M71813N63679O77891Q16792R91175J199555
$$ 3354532 3640938 3975925 4372608 4844421 5408100 6085991 6902783 7893958 9093513
10588I093513J419987J629976J815262J960689K083226K222403K424371K754883
$$ 9093513 10513500 12143476 13958738 15919427 18002653 20225056 22649427 25404310
10580B5404310L236941L885770M811809O211825Q460447J2179009J8094702K6411005
$$ 25404310 28641251 32527021 37338830 43550655 52011102 64190111 82284813 108695818
10572A08695818L5778193M3576277M7271918M4920834L7315027K7583902J7811830
$$ 108695818 144474011 188050288 235322206 280243040 317558067 345141969 362953799
10565C62953799J0561474N766159J652874l747766j1367949k1304956l1571285
$$ 362953799 373515273 379281432 380934306 377186540 365818591 344513635 312942350
10558C12942350l9263353m3286986m2377527l7661865l1034544k4323999j8601838
$$ 312942350 273678997 230392011 188014484 150352619 119318075 94994076 76392238
10551G6392238j4175065j0873792q359938o429899m963796l873998l099009k567014
$$ 76392238 62217173 51343381 42983443 36553544 31589748 27715750 24616741 22049727
10543B2049727k198445j957003j772966j627254j490817j345404j195906j038533
$$ 22049727 19851282 17894279 16121313 14494059 13003242 11657838 10461932 9423399
10535I423399q82796p40961o24162n27331m51587l88652l51819l26289l03421
$$ 9423399 8540603 7799642 7175480 6648149 6196562 5807910 5456091 5129802 4826381
10526D826381k70708k45244k21230k00234j82272j66448j52884j46066j44656
$$ 4826381 4555673 4310429 4089199 3888965 3706693 3540245 3387361 3241295 3096639
10517C096639j30195j17312j09808r2839q5560p5173p1589o8134o6979o5381o2465
$$ 3096639 2966444 2849132 2739324 2646485 2560925 2485752 2414163 2346029 2279050 2213669 2151204
10506B151204o2523o0315o3306o5236o2310n4597m6533m4656m8211n5034n3043
$$ 2151204 2088681 2028366 1965060 1899824 1837514 1782917 1736384 1691728 1643517 1588483 1535440
10495A535440n4337n1680n4295n0344m7194m4220l6189k5653l0416k8947j9049
$$ 1535440 1481103 1429423 1375128 1324784 1277590 1233370 1197181 1171528 1141112 1112165 1093116
10484A093116j3406j0634j2906j4100q550j062M350J236N420J0977J6401L8744
$$ 1093116 1079710 1069076 1056170 1042070 1033520 1032458 1036808 1038044 1043464 1054441 1070842 1109586
10472A109586P5683J35085K04171K38527K10850J17248j7542j36018j99510k14907
$$ 1109586 1185269 1320354 1524525 1763052 1973902 2091150 2073608 1937590 1738080 1523173
10462A523173j83161j45121j06769q0420n6646m9126l7050k5712j7534j4246k574
$$ 1523173 1340012 1194891 1088122 1007702 951056 901930 864880 839168 821634 807388 804814
10451H04814l697j994O741J0129J4731K6676K8061L3939L4679K6867J7776N651
$$ 804814 801117 799123 805864 815993 830724 857400 885461 919400 954079 980946 998722 1004373
10439A004373p755p740n981p833j9766k8962l2652m1844m5443m3910m0836l2621
$$ 1004373 996618 988878 982897 975064 955298 926336 893684 851840 806397 762487 721651 689030
10427F89030k3853k3046k3226k6097k5733j8625j1809n391n821j2591j9838l6859
$$ 689030 665177 642131 618905 592808 567075 548450 536641 531250 525429 512838 493000 456141
10415D56141n5399p3966p7584p3122o4682n9391n7853n4894m4979l9899l3397
$$ 456141 400742 326776 249192 176070 111388 51997 -5856 -60750 -105729 -145628 -179025
10404a79025j3083J4935K9872M2599N1051M9668M6806L8234L4426L2768K5929
$$ -179025 -192108 -177173 -147301 -104702 -53651 -3983 42823 81057 115483 148251 174180
10393A74180J7706J3189J4641R063J0798J3828N250Q444J3615J4011O443j415
$$ 174180 191886 205075 219716 228779 239577 253405 258655 267099 280714 294725 301168 299753
10381B99753j5083m3670p0563r1555j09570j11092j05416r6349p9743p1504o7548
$$ 299753 284670 241000 170437 78882 -30688 -141780 -247196 -343545 -423288 -494792 -562340
10370e62340o3562n3329l2732q376K2094M2047O1019O7504O3022N6340N2065M4878
$$ -562340 -625902 -679231 -711963 -720339 -698245 -656198 -595179 -527675 -464653 -408313 -356248 -311370
10358c11370L5710L2191L2642L3502L1751K3406K0027J7875J5441J9788J8378
$$ -311370 -275660 -243469 -210827 -177325 -145574 -122168 -102141 -84266 -68825 -49037 -30659
10347c0659J7910J3444J4796J1265M316P303R384N169K146L460J483m346j588
$$ -30659 -12749 695 15491 26756 31072 38375 47759 52928 55074 58534 60017 55671 54083
10334E4083m755J464j528l717j723n313o55L344Q55n38J841M174L717j434K916
$$ 54083 49328 50792 49264 45547 43824 38511 37856 41200 42055 41517 43358 47532 51249 49815 52731
10319E2731O440K215N001Q21J223L771J0545Q524p90J311L955J68R8j205k979
$$ 52731 59171 61386 66387 67208 68431 72202 82747 91271 90481 91792 95747 95915 96013 94808 91829
10304I1829n529o689k019J061J933J090j548J335o164n179L417K784j333k514
$$ 91829 86300 79611 77592 78653 80586 81676 80128 81463 75299 70120 73537 76321 74988 72474
10290G2474m314o614m072l857R94o5L01k016j099j5J87M189o02l690m30m980M338
$$ 72474 68160 61546 57474 53617 54611 54546 54847 52831 51732 51717 51904 56093 55491 51801 51371 46391 50729
10273E0729L082M339K907K069J685m431l136k668p008l508j021m11M387N605p13
$$ 50729 53811 58150 61057 63126 64811 60380 57244 54576 47568 44060 43039 42628 47015 52620 51907
10258E1907j636n011n905l566M003l07j213J431L812JJ598J046O982M480J0215
$$ 51907 50271 45260 39355 35789 39792 39485 38272 39703 43515 43516 45114 46160 53142 57622 67837
10243F7837P306O523k702k736K908k258k342J218j467J39N42j400o352m685N391
$$ 67837 75143 81666 78964 76228 79136 76878 74536 75754 74287 74426 74968 73568 67216 62531 67922
10228F7922n936p095J921l33j265o62K44J330m684l692m157m509Q71m235o520
$$ 67922 61986 54891 56812 56479 55214 54552 54796 56126 51442 47750 43593 39084 39955 35720 29200
10213B9200j411k335ml17n122l915m515l198j059N188L319R86J377j956Q3k048
$$ 29200 27789 25454 25450 25133 20011 16096 11581 8383 7324 12512 15831 16817 18194 16238 16321 14273
10197A4273n072Q80K581N867M612O492R124N707O169Q003P067O931Q405L933R205
$$ 14273 9201 10081 12662 18529 23141 29633 38757 44464 50633 58636 65703 72634 81039 84972 94177
10182I4177J2422J4428J5476J5203J5253Q980J0823J0687J4862K2882K8497L8440
$$ 94177 106599 121027 136503 151706 166959 175939 186762 197449 212311 235193 263690 302130
10170C02130N6099Q6184J26522J79118K27697K60645K74584K36752J83521J30949
$$ 302130 358229 444413 570935 750053 977750 1238395 1512979 1749731 1933252 2064201
10160B064201Q8190M9119J9398k1213p2706j38670j96607k40261k63509k47349
$$ 2064201 2152391 2201510 2220908 2199695 2126989 1988319 1791712 1551451 1287942 1040593
10150A040593k19787j73290j31199r9772p1275n2245m4480l1623k3143k2058j9188
$$ 1040593 820806 647516 516317 416545 345270 293025 248545 216922 193779 171721 152533
10139A52533j6614j5155q579p286m779m650j0343p846o547p880p623r619m278
$$ 152533 135919 120764 112185 104899 100120 95470 85127 77281 70734 62854 55231 45612 41334
10126D1334m060k13j182k955m900q011m082J668Q46K743J557k978K013L004l152
$$ 41334 37274 37061 35879 32924 28024 20013 15931 17599 18445 21188 22745 19767 21780 24784 21632
10111B1632L745P611K037j287J434l054l993n853p564p258n820o980j401J270
$$ 21632 25377 32988 35025 33738 35172 32118 28125 22272 14708 7450 1630 -5350 -6751 -5481
10097e481J050M609k537Q20K746k14J471O622J492N562L911K268l14L121q5M239
$$ -5481 -4431 178 -2359 -1539 1207 993 2464 9086 10578 16140 20051 22319 22005 25126 25041 29280
10081B9280K426j050k543k349K918Q691R784J2611P036P744L554j952j905l247
$$ 29280 31706 30656 28113 25764 28682 37373 47157 59768 66804 74548 78102 76150 74245 70998
10067G0998o507m222o297m964k377o35j149j315L737L804p76l537K135K163l339
$$ 70998 64491 60269 53972 49008 46631 45996 44847 43532 47269 51073 50297 46760 48895 51058 47719
10052D7719j926n014k794k450J811m2l719k142o417j40J946j85n753K159L192
$$ 47719 45793 40779 37985 35535 37346 37304 33585 31443 25026 24886 26832 26647 20894 23053 26245
10037B6245K748o8p76l487J066l768m429M40l335p163K27L671J396L268K25K017
$$ 26245 28993 28925 28149 24662 25728 21960 17531 17971 14636 7473 7700 11371 12767 16035 16260 18277
10021A8277j116n15K052l316r18k197j11Q86J224M625O328K75m558j785k022M038
$$ 18277 17161 16646 18698 15382 14464 12267 12156 13042 14266 18891 25219 25494 20936 19151 17129 21167
10005B1167N2j945R16M779J92l85j296M42o407k504N25k326l649j079l34K544
$$ 21167 21219 19274 20190 24969 25161 24776 23480 23922 17515 15011 15536 13210 9561 8482 8148 10692
9989A0692O305K705n52K91l000J536q48m436r01j589k028N354K464P69J333M471
$$ 10692 16997 19702 19150 19441 16441 17977 17129 12693 11792 10203 8175 13529 15993 16762 18095 22566
9973B2566K189O39L242J954J030P83m061o617o060j354j604K818K274k523K277
$$ 22566 24755 25394 28636 30590 31620 32403 28342 21725 15665 14311 12707 15525 17799 15276 17553
9958A7553K466j830k931m7M907K907l696m649j195l9K276L474m830m058K212k042
$$ 17553 20019 18189 15258 15211 20118 23025 19329 14680 13485 13446 15722 19196 14366 10308 12520 10478
9942A0478p39M492P692L544K863Q403K890m920K357N341J182j948n699n601q18
$$ 10478 9739 14231 21923 25467 28330 36733 39623 34703 37060 42401 43583 41635 35936 30335 29517
9927B9517m891n712j439J170J00j392L316L890M677L45l877j127q6J77N15r31
$$ 29517 24626 18914 17475 18645 18745 17353 20669 24559 29236 29581 25704 24577 24491 24668 25183 24252
9911B4252J929L38n86P246J0241J0246j46m251q413j1370n813R5J771M060K437
$$ 24252 26181 26519 25933 33179 43420 53666 53520 49269 40856 29486 23673 23768 25539 29599 32036
9896C2036l558j189k453l406L643J010k190n496k080K408k339j693K931M824l997
$$ 32036 28478 27289 24836 21430 25073 26083 23893 18397 16317 18725 16386 14693 17624 22448 18451
9881A8451n656J493K455r37k400j187q96k135j632Q77K641M086J807K267k661
$$ 18451 12795 14288 16743 15806 13406 12219 11323 9188 7556 8433 11074 15160 16967 19234 16573
9866A6573l607M464N090J469J567J966M04m01J540P093Q138N297J422J583R449
$$ 16573 12966 17430 22520 23989 25556 27522 27926 27525 29065 36158 44296 49593 51015 52598 62047
9851F2047J5747P950J0710J9347K6969M4371P4550J18196J49714J37203P0698
$$ 62047 77794 85744 96454 115801 142770 187141 261691 379887 529601 666804 737502
9840G37502k429n5735p0095m6149J6114Q3525R0254L5462m0846r6035j18617j22459
$$ 737502 735073 679338 609243 563094 579208 662733 752987 788449 747603 651568 532951 410492
9828D10492r8531p2990n5349l9174k5503j6260j1479j5403j0654n337k826r471
$$ 410492 311961 238971 183622 144448 118945 102685 91206 75803 65149 59812 56986 47515
9816D7515p523l702n086k323J659j410l098oq810j09l268k475n77k733N926M648
$$ 47515 39992 36290 31204 28881 30540 29130 26032 26026 17216 17107 13839 11364 10787 8054 13980 18628
9800A8628l712o032J938J494l148M527j801k038K424Q26j838m29K343J3n132k167
$$ 18628 14916 8884 10822 12316 9168 13695 11894 9856 12280 13106 11268 10839 13182 13195 8063 5896
9784E896k80J864q98k940m44L813M713J142J363k998k250L050Q22l305j95L358
$$ 5896 5616 7480 6582 3642 3198 7011 11724 12866 14229 11231 8981 12031 12853 9548 9353 12711
9768A2711n52o61j975q33j796o98j425r57j381N139L849k126m87m380l246j139
$$ 12711 12159 11498 9523 8690 6894 6196 4771 3814 2433 7572 11421 9295 8808 4428 1182 43
9752D3Q83J334J474M208M56O42P608K12J069M712l253o535R55j717l682l273j123
$$ 43 926 2260 3734 7942 8398 9040 16648 16860 17929 22641 19388 12853 13808 12091 8409 5136 4013
9735D013j72K368j048m402m255l161N165r0J269N573L896J310O683N221j03k95
$$ 4013 3841 6209 5161 759 -3496 -6657 -1492 -1582 -313 5260 9156 10466 17149 22370 22267 21972
9719B1972p168p930n896j896j775o64J831K206M690L031j584k281l912N463J237
$$ 21972 14804 6874 978 -918 -2693 -3357 -1526 680 5370 8401 6817 4536 624 6087 7324
9704G324j214k157J03K416J533q77k720k836j185j965K307J889k739j194N138
$$ 7324 6110 3953 4056 6472 8005 7128 4408 1572 387 -1578 729 2618 -121 -1315 3823
9689C823O171o75n096k910L140N986j875o59K331l937m823N35J050Q59j185J159
$$ 3823 9994 9319 4223 1313 4453 10439 8564 7905 10236 6299 1476 2011 3061 3920 2735 3894
9673C894n798k328O259L025k259p43K3m98l640N94M337K324K924k829k829L851
$$ 3894 -1904 -4232 2027 5052 2793 2050 2073 1575 -2065 -1471 2866 5190 8114 5285 2456 6307
9657F307j1o632n03L173q01J090Q71J715P07k708j035K205o01L528k002K897q57
$$ 6307 6296 -336 -839 2334 1533 2623 3494 5209 5916 3208 2173 4378 3777 7305 5303 8200 7343
9640G343K69K207L806l392R47K913M241m394m630k209O42O68q09L93L133K896
$$ 7343 7612 9819 13625 10233 11180 14093 18334 13940 9310 7101 7743 8411 7602 7995 11128 14024
9624A4024n047k38J472N745l895l009L938l82l297n933k847k723O49M17j388J312
$$ 14024 8977 8739 10211 15956 12061 9052 12990 12608 9311 3378 531 -2192 -1543 -1126 -2514 -1202
9608a202m074j572N094L196M045n305m834R06K225J15p08K112n33K335L322j392
$$ -1202 -5276 -6848 -1754 1442 5487 182 -4652 -3746 -1521 -1406 -2114 -2 -535 1800 5122 3730
9592C730m082n415K248J549k34M276j24k884l589j683J553J292N486K296J352
$$ 3730 -352 -5767 -3519 -1970 -2204 2072 1948 -936 -4525 -6208 -4655 -3363 2123 4419 5771
9577E771M711P392K362P32N21l999n577m08N36J124m6J917k58r9o937m576K090
$$ 5771 10482 17874 20236 20968 21489 17490 11913 11505 12041 13165 13119 15036 14778 14679 7742 3166 5256
9560E256k899q79L739N186J405j323o430k414N9K818l801p282M717M652j505r08
$$ 5256 2357 1478 5217 10403 11808 10485 4055 1641 1700 4518 717 -6565 -1848 2804 1299 391
9544C91L084J747K293j618l102j873K891J091m630l616k5L121j174n16l319j853
$$ 391 3475 5222 7515 5897 2795 922 3813 4904 274 -3342 -3367 -246 -1420 -1936 -5255 -7108
9528g108M668L286j157m148j859k643j302Q16J99k736K570L051L608j92K939L860
$$ -7108 -2440 846 -311 -4459 -6318 -8961 -10263 -9447 -9248 -11984 -9414 -6363 -2755 -2947 -8 3852
9512C852j979l015J666Q8l342K705K369l66L42N39K878L159R77k694K978L734
$$ 3852 1873 -1142 524 612 -2730 -25 2344 1978 2320 2859 5737 8896 9873 7179 10157 13891
9496A3891n089N87l810p097l918k150L579M985j883n10mL95L920P882Q36r866
$$ 13891 8802 9389 5579 -1518 -5436 -7586 -4007 978 -905 -1415 -1419 -1024 2896 10778 11614 1748
9480A748m049k202k302J554M414L033J276L066L497k689k972l463P55j593n262
$$ 1748 -2301 -4503 -6805 -5251 -837 2196 3472 6538 10035 7346 4374 911 1666 73 -5189
9465e189R93M288O927K206p781k187R90J460n08J930L708n007j705l20R59k429
$$ -5189 -4196 92 7019 9225 1444 -743 247 1707 1199 3129 6837 1830 125 -195 764 -1665
9449a665r68J477j717j684j329J982J892K226k792Q86k31L775M193n765k476K228
$$ -1665 -2633 -1156 -2873 -4557 -5886 -3904 -2012 214 -2578 -1692 -1923 1852 6045 280 -2196 32
9433C2K810K970N07m322j754M903K876j081R79l251k678J532l86J285N955K337
$$ 32 2842 5812 6319 1997 243 5146 8022 6941 7920 4669 1991 3523 3137 4422 10377 12714
9417A2714o283k038mK528j28l40p55L276J759j588l277n44l383L627L59n778N254
$$ 12714 6431 4393 4389 6917 6789 6449 5694 8970 10729 9141 5864 5320 1937 5564 5923 145 5399
9400E399k388l390K731M1j997j806l537n711m764r2O645J124O357O971k280J301
$$ 5399 3011 -379 2352 2393 396 -1410 -4947 -10658 -15422 -15514 -8869 -7745 -1388 5583 3303 4604
9384D604l88l137m917J282L487M681k45n488p98L0N585p7K714L248k636J606k14
$$ 4604 4216 1079 -3838 -2556 931 5612 5367 -121 -919 -889 4696 4619 7333 10581 7945 9551 9337
9367I337m164R86k085k146m641L253J264M78n128l848M209M578j602m218l07j435
$$ 9337 5173 6159 4074 1928 -2713 540 1804 2282 -2846 -6694 -2485 2093 491 -3727 -4034 -5469
9351e469L816L151K86j429j88m05n3L568O955o60l05j706j306m034N36o09l578
$$ -5469 -1653 1498 1784 355 167 -238 -291 3277 10232 9572 9267 7561 6255 2221 2757 2148 -1430
9334a430j180m342N011L502J960P497K605n474j458k53K002j018l817k994j639
$$ -1430 -2610 -6952 -1941 1561 3521 11018 13623 8149 6691 6438 8440 7422 3605 611 -1028
9319a028j904p41r34M361K371k227K620L964n75k022k431k685k687L580O189J791
$$ -1028 -2932 -3673 -4607 -246 2125 -102 2518 6482 5907 3885 1454 -1231 -3918 -338 5851 7642
9303G642k379o020l921l044K659M532K996k411m46M166L148J012j482j65J176
$$ 7642 5263 -757 -4678 -7722 -5063 -531 2465 54 -392 3774 6922 7934 6452 6287 7463
9288G463R26J601J691k921k015l951N7k879J46l23l729K201J704J282N34N150
$$ 7463 8389 9990 11681 8760 6745 2794 2851 -28 118 -205 -3934 -1733 -29 1253 1787 6937
9272F937M246o503k798O36n15M558K51p70j604o090J855K858M059k895n819m194
$$ 6937 11183 4680 1882 2518 2003 6561 6812 6042 4438 -1652 203 3061 7120 4225 -1594 -5788
9256e788L176O611m718k153J713m00k072J764J836M623P621m365o960r52L4K001
$$ -5788 -2612 3999 -719 -2872 -1159 -1559 -3631 -1867 -31 4592 12213 7848 888 -64 -30 1971
9240A971n30L549O204L292l039n990L062M444N904k85n207o816n316l741k069
$$ 1971 1441 4990 11194 14486 11447 5457 8519 12963 18867 18582 13375 6559 1243 -2498 -4567
9225d567m078K121K243O008j99J137K613j955L425P806l172k020l448m413m637
$$ -4567 -8645 -6524 -4281 1727 1528 2665 5278 3323 6748 14554 11382 9362 5914 1501 -3136
9210c136M947k39K666J564K259o45n815K686n44J336J508L93l041j644K27l045
$$ -3136 1811 1572 4238 5802 8061 7416 1601 4287 3743 5079 6587 6980 3939 2295 2522 -523
9194e23K348k090J385n65q94K936L568j009j529J399p62k044K946N291K891k853
$$ -523 1825 -265 1120 555 -339 2597 6165 5156 3627 5026 4264 2220 5166 10457 13348 10495
9178A0495o335L70K271j356L29j899M45O577p52l703l304m556M81L448J687l976
$$ 10495 4160 4530 6801 5445 5774 3875 4320 10897 10145 6442 3138 -1418 -937 2511 4198 222
9162B22J484O99J019J841M319m951m281M061O295L649L609j330n908o298k525
$$ 222 1706 2405 3424 5265 9584 4633 352 4413 10708 14357 17966 16636 10728 4430 1905
9147A905M90K783l426J596M65k117J67j155m955j601P887K543K646k308M37P37
$$ 1905 2395 5178 1752 3348 3813 1696 1863 708 -4247 -5848 2039 4582 7228 4920 5357 6094
9131F094K924J31K617k745m592m110m090L718j755k979K25J322O503K317p44m06
$$ 6094 9018 9149 11766 9021 4429 319 -3771 -53 -1808 -4787 -4562 -3240 3263 5580 4836 4430
9115D430p60N76Q20Q19j702J989o94l959l342k068j774M184K971l376P55L243
$$ 4430 3670 4246 5066 5885 4183 6172 5478 1519 -1823 -3891 -5665 -1481 1490 -1886 -1131 2112
9099B112N00j821J837q16k554j292j517L706J027K025L818k636K691Q034l835
$$ 2112 2612 791 2628 1812 -742 -2034 -3551 155 1182 3207 7025 4389 7080 15114 11279
9084A1279l726p910j401N670n63j450J14k83L632j160r48N50M299K772k686l045
$$ 11279 7553 -357 -1758 3912 3349 1899 2013 1730 5362 4202 3254 3804 8103 10875 8189 5144
9068E144j419m149j391k161o33K602J994J094J295m731K030q57l000J96N478M432
$$ 5144 3725 -424 -1815 -3976 -4609 -2007 -13 1081 2376 -2355 -325 -1182 -4182 -3986 1492 5924
9052E924l012m310L88K666K283l7l089k474l003o59J34K118j287J50L053J908
$$ 5924 2912 -1398 -1010 1656 3939 3902 813 -1661 -4664 -5323 -5189 -3071 -4358 -4208 -1155 753
9036G53K446m988l289M169L29r82P88O99L057K15k225n974K188L80j115O042O420
$$ 753 3199 -1789 -5078 -909 -580 -1562 -774 -75 2982 3197 972 -5002 -2814 -2434 -3549 2493 8913
9019H913m50k554M603j526j240J385n040j057K250k658p13j379j175l623K551
$$ 8913 8463 5909 10512 8986 7746 9131 4091 3034 5284 2626 1913 534 -641 -4264 -1713
9004a713N454O504M149o083N312K5o379l496Q07k659K378L672j377n909j013J936
$$ -1713 3741 10245 14394 8311 13623 13648 7269 3773 4580 1921 4299 7971 6594 685 -328 1608
8988A608k65J192l490L002J12m203J075j34j7O56M199q72o078J936L531P62J626
$$ 1608 1343 2535 -955 2047 2159 -2044 -969 -1103 -1120 -464 3735 2863 -3215 -1279 2252 3014 4640
8971D640m43k465l973K22L73j011J131L365K644J506K182L12m11k842k162L309
$$ 4640 4197 1732 -2241 -2019 -1646 -2657 -1526 1839 4483 5989 8171 8483 8072 5230 3068 6377
8955F377k062k060M205N66l168q08j47m593J811q62J267k310J303Q01l483m659
$$ 6377 4315 2255 6460 7026 3858 3050 2903 -1690 121 -741 526 -1784 -481 320 -3163 -7822
8939g822L41K998K876o01j154N7N520N469L955L458o636p419K198P43L049l501
$$ -7822 -7481 -4483 -1607 -2208 -3362 -3305 2215 7684 11639 15097 8461 1042 3240 3983 7032 3531
8923C531m550k279N6L75K139m869M739Q103m699l462N337L460l543J022o229N02
$$ 3531 -1019 -3298 -3242 -2867 -728 -5597 -858 7245 2546 -916 4421 7881 4338 5360 -869 -367
8907c67J243l673n244M840N941j560k732K132J356k248p008J422L475O68j083
$$ -367 876 -2797 -8041 -3201 2740 1180 -1552 580 1936 -312 -7320 -5898 -2423 -1755 -2838
8892b838L036M234M398l152k961j959L505M073k846J389k104l094L32J203m583
$$ -2838 198 4432 8830 5678 2717 758 4263 8336 5490 6879 4775 1681 2013 3216 -1367
8877a367L618N575p9o3M09J7J56j173l362m627K309L016R85K061j555k925K36
$$ -1367 2251 7826 7747 7684 8093 8110 8266 7093 3731 -896 1413 4429 5414 7475 5920 2995 3231
8860C231j988K277L41n808j490J629l133j861M756P100j401O331J702o260p04
$$ 3231 1243 3520 3861 -1947 -3437 -1808 -4941 -6802 -2046 5054 3653 9984 11686 5426 4722
8845D722j66K873K657k070m095K833m22m003J1j704Q10q95M16K71K544k519K147
$$ 4722 4556 7429 10086 8016 3921 6754 6332 2329 2340 636 1446 551 967 1238 3782 1263 3410
8828C410L843j745l596J006J359J396J252j92N74m264m55m792K469O261M507O86
$$ 3410 7253 5508 1912 2918 4277 5673 6925 6733 7307 3043 2588 -2204 265 6526 11033 11719
8812A1719l476r46j163q82j669l848M723R39p608j58J245m143J944P187J766m361
$$ 11719 8243 7297 6134 5252 3583 -265 4458 5397 -2211 -2369 -1124 -5267 -3323 3864 5630 1269
8796A269l924L404M100k763rJ830J525L146j620j234J526P12K294L436q005l776
$$ 1269 -2655 749 4849 2086 2077 3907 5432 8578 6958 5724 7250 7962 10256 13692 5687 1911
8780A911M897J469o036k352L49O356j793o129j130L39L638L885O346M065m767
$$ 1911 6808 8277 2241 -111 238 6594 4801 -1328 -2458 -2119 1519 5404 11750 15815 11048
8765A1048o975j875l664k467j621J331K558M103Q14j098K091m13m794j028M520
$$ 11048 4073 2198 -1466 -3933 -5554 -4223 -1665 2438 3252 2154 4245 3832 -962 -1990 2530
8750B530J06K439o76j654K183k911l227j100j909K801K190m322L632J382j682
$$ 2530 2636 5075 4399 2745 4928 2017 -1210 -2310 -4219 -1418 772 -3550 82 1464 -218
8735b18K727K014j008J490Q174k14o001m692j164k951m706N14M043L030O476P304
$$ -218 2509 4523 3515 5005 13179 12965 6964 2272 1108 -1843 -6549 -6035 -1992 1038 7514 14818
8719A4818K737O92j642K861K47l759J132k479m91J559n756p240KM420J748j113
$$ 14818 17555 18247 16605 19466 19713 15954 17086 14607 14116 15675 9919 2679 2681 7101 8849 7736
8703G736j140J344K554r25m781j16n74k400O76M147M588M76l005l182k248k687
$$ 7736 6596 7940 10494 9569 4788 4672 4098 1698 2374 6521 11109 11585 8580 5398 3150 463
8687D63j942O21L440j238j0319o87K054P88M438N589k204k069N143Q23k57L98
$$ 463 -1479 -858 2582 1344 -8975 -9662 -7608 -6820 -2382 3207 1003 -1066 4077 4900 4643 5041
8671E041M74j54L095J190L061k560j509m003m072n257J602M746L526q46J743L14
$$ 5041 5515 5361 8456 9646 12707 10147 8638 4635 563 -4694 -3092 1654 5180 4334 6077 6391
8655F391k97l652j032L233K924J551J75k880K167K960M682j696o239N33M258L693
$$ 6391 6094 2442 1410 4643 7567 9118 9293 6413 8580 11540 16222 14526 8287 8820 13078 16771
8639A6771k372o298n67J699K233o54k754K397K44j828l541L16M913L929j930k495
$$ 16771 14399 8101 7534 9233 11466 10812 8058 10455 10699 8871 5330 5646 10559 14488 12558 10063
8623A0063j27O18K48N58j768J267L137j39k925p27l475o573l723l679J074L311
$$ 10063 9936 10554 10802 11360 9592 10859 13996 13857 10932 10205 6730 157 -3566 -7245 -6171 -2860
8607b860K218O433J410q49O006o49o498r85m65j487j01M309J742L140J463l329
$$ -2860 -642 5791 7201 6352 12358 11709 5211 4226 3761 2274 2173 6482 8224 11364 12827 9498
8591I498l025j610K186J461o209j549L921L161L792M95L643m264o784k900k405
$$ 9498 6473 4863 7049 8510 2301 752 4673 7834 11626 12121 15764 11500 4716 1816 -589
8576e89K216K863j109k641M360N385J353j092J750J063R94J45p1j920J345o888
$$ -589 1627 4490 3381 740 5100 10485 11838 10746 12496 13559 14553 14698 14627 12707 14052 7164
8560G164n652l707o23j86L697r88n76O363N072L484J490n256l689j968o52J07
$$ 7164 1512 -2195 -2818 -3004 693 -295 -871 5492 10564 14048 15538 10282 6593 4625 3973 4080
8544D080j662L776k534k659j180J878O83J345M582k549l551J144J97j157l129
$$ 4080 2418 6194 3660 1001 -179 1699 2382 3727 8309 5760 2209 3353 3550 2393 -736
8529g36K043N988J103m06j676L592M003K075j223K006j652k674L823n205n456
$$ -736 1307 7295 8398 7992 6316 9908 13911 15986 14763 16769 15117 12443 16266 11061 5605
8514E605M217R932q2n333o657M181M778o41j201j407M235k398p903l091R060N22
$$ 5605 9822 19754 19672 14339 7682 11863 16641 16000 14799 13392 17627 15229 7326 4235 13295 13817
8498A3817n049j306j93Q318P73r65J264n80M24O925R958P463j146p912m159N345
$$ 13817 8768 7462 7269 15587 16360 15395 16659 16079 16503 23428 33386 40849 39703 31791 27632 32977
8482C2977k194m488m546o520l103M906m500J832O42k171L318K958N71n94p113
$$ 32977 30783 26295 21749 15229 12126 17032 12532 14364 15006 12835 16153 19111 19682 19088 11975
8467A1975m27n65k773P772J440M337q15l63M775n705o38L998L070j901m056l155
$$ 11975 11548 10983 8210 15982 17422 21759 20944 20581 25356 19651 19013 23011 26081 24180 20124 16969
8451A6969N76L084L621M879k358k390q7r34k726j294q355l989O49L743j467J458
$$ 16969 17545 20629 24250 29129 26771 24381 24294 23360 20634 19340 10985 6996 7645 11388 9921 11379
8435A1379R4k356k891J801M310J050J696r96n032K340L723L104M84l000K400j623
$$ 11379 11473 9117 6226 8027 12337 13387 15083 14087 9055 11395 15118 18222 18706 15706 18106 16483
8419A6483M40j95K402M82n59K365o527o759m2O74L492J255J434J922m990j506
$$ 16483 16923 16728 19130 19612 19053 21418 14891 8132 8090 8764 12256 13511 14945 16867 11877 10371
8403A0371P34K979J423m635Q32N060M657j034l217k652j138j008j874j877j170
$$ 10371 11105 14084 15507 10872 11704 16764 21421 20387 17170 14518 13380 12372 10498 8621 7451
8388G451k907K800O708j788m971m142j179K021R08l812j291L814L926N604L28
$$ 7451 4544 7344 14052 12264 7293 3151 1972 3993 4901 1089 -202 3612 7538 13142 13470
8373A3470j241k059l318O51K817n212n908L8L798o2l755Q38J38M404L397k339
$$ 13470 12229 10170 6852 7503 10320 5108 -800 -762 3036 2974 -781 57 195 4599 7996 5657
8357E657l724O63J508J781K362J601L071K318m316q279n64M822K668l976L53l247
$$ 5657 1933 2596 4104 5885 8247 9848 12919 15237 10921 2642 2078 6900 9568 5592 5945 2698
8341B698k273q662R84K419R93j96K994J541J119M499k650k431o83L958N43l686
$$ 2698 425 -8237 -7253 -4834 -3841 -4037 -1043 498 1617 6116 3466 1035 352 4310 4853 1167
8325A167L64K729n99m224J899M45J914J262J401l102k918j255n49J658J020j028
$$ 1167 1531 4260 3661 -563 1336 1781 3695 4957 6358 3256 338 -917 -1466 192 1212 184
8309A84l184K830r04l608J345L473M091J617L30p2l910J879J907N56R43k485n872
$$ 184 -3000 -170 -1074 -4682 -3337 136 4227 5844 6174 6102 2192 4071 5978 6534 7477 4992 -880
8292h80j798j309j15j430l136K746N500J124m745k991M231M751l431K003R53K757
$$ -880 -2678 -3987 -4102 -5532 -8668 -5922 -422 702 -4043 -7034 -2803 1948 -1483 520 1473 4230
8276D230M097N78n792l929M710N072J523m080j793j112l832J919J646n87l763
$$ 4230 8327 8905 3113 -816 3894 8966 10489 6409 4616 3504 -328 1591 3237 2650 -1113
8261a113k029m359j859K286K170L707O307o97J136J920K793k974l389j821o023
$$ -1113 -3142 -7501 -9360 -7074 -4904 -1197 5110 4413 5549 7469 10262 7288 3899 2078 -3945
8246c945J734J518O88O292m82m012l488j645K252R38J093j662J463J321l082M384
$$ -3945 -2211 -693 -5 6287 5805 1793 -1695 -3340 -1088 -150 943 -719 744 2065 -1017 3367
8230C367k869k697J69J247P56p45j710j126j036J722n569O2O054N512n09M26l616
$$ 3367 498 -2199 -2030 -783 -27 -772 -2482 -3608 -4644 -2922 -8491 -8429 -2375 3137 2628 3054 -562
8213e62j941K183J823m098J76j979J666J324K608j932K087K038k18J501P41k476
$$ -562 -2503 -320 1503 -2595 -2419 -4398 -2732 -1408 1200 -732 1355 3393 3175 4676 5417 2941
8197B941K418l011p203P74J566J78J785J134L293R8k21m37j232J536N07R86K258
$$ 2941 5359 2348 -4855 -4081 -2515 -2337 -552 582 3875 3973 3752 3315 2083 3619 4126 5112 7370
8180G370J181m342k309M15L032K084l085k414j273j699m21j256l253j481J980
$$ 7370 8551 4209 1900 2315 5347 7431 4346 1932 659 -1040 -1461 -2717 -5970 -7451 -5471
8165e471O513M90p18N6j880l446k429l067p80O008Q437k466j986J240K83J287
$$ -5471 1042 1532 814 870 -1010 -4456 -6885 -9952 -10732 -4724 3713 1247 -739 501 784 2071
8149B071N040R59l957j126l626k551J518m272M234N907j385J378k160m04j097
$$ 2071 7111 8070 4113 2987 -639 -3190 -1672 -5944 -1710 4197 2812 4190 2030 1626 529
8134E29k984o867k893M994M241K750k715q22O85k771k431p66k6O123O420J241
$$ 529 -2455 -9322 -12215 -7221 -2980 -230 -2945 -3767 -3082 -5853 -8284 -9050 -9076 -2953 3467 4708
8118D708k760n090R66M766J459k302q258J658M688k264l647K648M344J446r60
$$ 4708 1948 -3142 -2176 2590 4049 1747 -6511 -4853 -165 -2429 -6076 -3428 916 2362 1402
8103A402j522j207N625Jo402l06K482k878l579j482o63Q980Q407R47n359l403
$$ 1402 -120 -1327 4298 4299 -2103 -2409 73 -2805 -6384 -7866 -8529 451 8858 9805 4446 1043
8087A043l187J686j277p74M0J396l312N23J910J682j701j773N623N561l65j223
$$ 1043 -2144 -458 -1735 -2509 -2469 -1073 -4385 -3862 -1952 -270 -1971 -3744 1879 7440 7075 5852
8071E852J792k104l599k069l598l98j857N987L311m069L29M795M2L016m75m537
$$ 5852 7644 5540 1941 -128 -3726 -4124 -5981 6 3317 -752 -423 4372 4414 7430 6955 2418
8055B418o689m106L150R46L652K211k092M71n967l071M976O22J305j507l050j427
$$ 2418 -4271 -8377 -5227 -4281 -629 1582 -510 -39 -6006 -9077 -4101 -3479 -2174 -3681 -6731 -8158
8039h158l517L404M583m41K318K930m267M980N251j22m733r31k42l256m96L999
$$ -8158 -11675 -8271 -3688 -4129 -1811 1119 -3148 1832 7083 6961 2228 1297 1055 -2201 -2697 1302
8023A302M10J724O462J587p29m267k303J883K210l524l871J909J329l627j635
$$ 1302 1712 3436 9898 11485 10756 6489 4186 6069 8279 4755 884 2793 4122 495 -1140
8008a140m109l340J990M174J789J534O48o620J061M870K269P83k207m95L36Q73
$$ -1140 -5249 -8589 -6599 -2425 -636 898 1546 -5074 -4013 857 3126 3909 1702 1207 1543 2416
7992B416l823k010M990M720K288J046L53m104k313K419r33J652K481k645j585
$$ 2416 -1407 -3417 1573 6293 8581 9627 9980 5876 3563 5982 5049 6701 9182 6537 4952
7977D952n464J485J620n277q57K855J229K767N032k645o162k289M454L763j807
$$ 4952 -512 973 2593 -2684 -3541 -686 543 3310 8342 5697 -465 -2754 1700 5463 3656
7962C656j527J586K311M27l766k538k044k109j621j592N845O430l586j19k539
$$ 3656 2129 3715 6026 6453 2687 149 -1895 -4004 -5625 -7217 -1372 5058 1472 1353 -1186
7947a186p35J538L105K16o35J830J699K605R80m115l427q17J883R62k140L321
$$ -1186 -1921 -383 2722 2938 2303 4133 5832 8437 9417 5302 1875 1058 2941 3903 1763 5084
7931E084j333k921L211J039l05l169j032k432j868r35J977J863n4l864N785K577
$$ 5084 3751 830 4041 5080 4775 1606 574 -1858 -3726 -4661 -2684 -821 -875 -4739 1046 3623
7915C623K76Q35N64r2l471k10j301J469j288n400l98J590L282n76J728L518K664
$$ 3623 3899 4734 5298 5206 1735 1525 224 1693 405 -4995 -5393 -3803 -521 -1097 631 4149 6813
7898F813O99L016j629K849L708j213l680R94l821l770m19j962l14J606J380n241
$$ 6813 7512 10528 8899 11748 15456 14243 10563 11557 7736 3966 3547 1585 1271 2877 4257 -984
7882i84M671K484k553j050k183K969L366j451J585n82m000r04K264K867Rj175
$$ -984 3687 6171 3618 2568 385 3354 6720 5269 6854 6272 2272 1368 3632 6499 6508 5333
7866E333j889M784l75j550j357L851L948O300n56l977o032k675m791K492J978
$$ 5333 3444 8228 7853 6303 4946 8797 12745 19045 18489 14512 8480 5805 1014 3506 5484
7851E484J219J229j302l970j717O58K600K508K585N7j121j557l162K230N430M99
$$ 5484 6703 7932 6630 2660 943 1601 4201 6709 9294 9351 8230 6673 3511 5741 11171 11670
7835A1670l345k125L31L131J724p46k705j422L875j15J592L18j934l13j8l486
$$ 11670 8325 6200 6531 9662 11386 10640 7935 6513 10388 10273 11865 12183 10249 9936 9918 6432
7819F432l325K413m5L823R16k930J349P79j551J328j378k330J187L416R43k340
$$ 6432 3107 5520 5475 9298 10214 7284 8633 9412 7861 9189 7811 5481 6668 10084 11027 8687
7803H687J585K990m356k299K165J527j922j843l656J48l107L368J158N32m85n399
$$ 8687 10272 13262 8906 6607 8772 10299 8377 6534 2878 3026 -81 3287 4445 4977 4492 -907
7787i07M062R6j400N32J539O472L330l036j515j520k580K186J970j221K893K187
$$ -907 3155 3251 1851 2383 3922 10394 13724 10688 9173 7653 5073 7259 9229 8008 10901 13088
7771A3088l880m344m89k538k207J393L809j613k321J495N434M4N35k70j989m443
$$ 13088 9208 4864 4375 1837 -370 1023 4832 3219 898 2393 7827 7871 8406 8136 6147 1704
7755A704m27j544k64j470J393J429o2L04j655N688K39n319k242n97K238j841j356
$$ 1704 1277 -267 -531 -2001 -608 821 759 1063 -592 5096 5335 16 -2226 -2823 -585 -2426 -3782
7738c782M28J980L341k506j744M067J700n149l387J259K846k37l031j139K374
$$ -3782 -3354 -1374 1967 -539 -2283 1784 3484 -1665 -5052 -3793 -947 -1184 -4215 -5354 -2980
7723b980M98l940n19M883O834K335m909k335M182J286O15K986m091m810J546l131
$$ -2980 -2482 -6422 -6941 -2058 4776 7111 2202 -133 4049 5335 5950 8936 4845 35 1581 -1550
7707a550K74K329L13J317J498K67k637L116r05j207m20j310L46l70N47r60j219
$$ -1550 -1276 1053 1366 2683 4181 4448 1811 4927 4022 2815 2395 1085 1431 1061 1608 648 -571
7690e71q89R80n898J338L080j724K271P93o190j32R10m113P50N265n84k173Q73
$$ -571 -1460 -480 -6378 -5040 -1960 -3684 -1413 -620 -6810 -6942 -6032 -10145 -9395 -4130 -4714 -6887 -6014
7673f014L67j985j310M720K702j504m906r05m36J640n54L556J031l396R50J694
$$ -6014 -5647 -7632 -8942 -4222 -1520 -3024 -7930 -8835 -9271 -7631 -8185 -4629 -3598 -6994 -6044 -4350
7657d350p65O025K087l774m005J691J438k151l866Q31K633J095j48k791q70J603
$$ -4350 -5115 910 2997 -777 -4782 -3091 -1653 -3804 -7670 -6839 -4206 -3111 -3259 -6050 -6920 -5317
7641e317M508J560k568m330k681j728J794L532L897M175O494L344n512k823k519
$$ -5317 -809 751 -1817 -6147 -8828 -10556 -8762 -5230 -1333 2842 9336 12680 7168 4345 1826
7626A826K060j532k083k589J753J503K31K027M17m597m666m636M583N424K324
$$ 1826 3886 2354 271 -2318 -565 938 1169 3196 3613 -984 -5650 -10286 -5703 -279 2045
7611B045K071k226k359j396k816l387M055O721k631o245K191K658k821l762K858
$$ 2045 4116 1890 -469 -1865 -4681 -8068 -4013 2708 77 -6168 -3977 -1319 -4140 -7902 -5044
7596e044N636j692k763M206J834L023L650l442m003k838K462M32j953j547l46
$$ -5044 592 -1100 -3863 343 2177 5200 8850 5408 1405 -1433 1029 1461 -492 -2039 -2385
7581b385M765l635K012K4k754k057K295L03k78L22k89o99j355l740K524N102J333
$$ -2385 2380 -1255 757 781 -1973 -4030 -1735 -1432 -1710 -1388 -1677 -2376 -3731 -7471 -4947 155 1488
7564A488k242N1k649O86N086K71j190m199l825M9J934l532Q77L743O96m379K335
$$ 1488 -754 -703 -3352 -2666 2420 2691 1501 -2698 -6523 -6474 -4540 -8072 -7195 -3452 -2756 -7135 -4800
7547d800J559J992M55n58J285K488o02J113l577l469j160K096L656j699P57l191
$$ -4800 -3241 -1249 -794 -1352 -67 2421 1819 2932 -645 -4114 -5274 -3178 478 -1221 -464 -3655
7531c655p156K589L672j422j146L293K240l778k354L233L262p33L355J194j62
$$ -3655 -10811 -8222 -4550 -5972 -7118 -3825 -1585 -5363 -7717 -4484 -1222 -1955 1400 2594 2432
7516B432k616K090J500m607l131m392J76K20Q74P725p10n28q24l266l173j433
$$ 2432 -184 1906 3406 -1201 -4332 -8724 -8548 -8328 -7454 271 -439 -967 -1791 -5057 -8230 -9663
7500i663J190M418K911K72J933K460p29m920j242L26L585l74k42L508j339j415
$$ -9663 -8473 -4055 -1144 -872 1061 3521 2792 -2128 -3370 -3044 541 167 -75 3433 2094 679
7484F79n35J694R21p328l580j48P259L936M19L972r20m933j135L25m343o77M908
$$ 679 144 1838 2759 -4569 -8149 -8297 -1038 2898 3317 7289 6369 1436 301 626 -3717 -4394 514
7467E14J69m593K563K46P98j306N509L905n002O9K530j91l534m672j325j648m50
$$ 514 683 -3910 -1347 -1101 -303 -1609 3900 7805 2803 2872 5402 5211 1677 -2995 -4320 -5968 -6418
7450f418N266J974J689J456j515l123j874k047l629J454Q2j561M61J253m23M952
$$ -6418 -1152 822 2511 3967 2452 -671 -2545 -4592 -8221 -6767 -6685 -8246 -7785 -6532 -6955 -2003
7434b003O525k045l368j704l685k21K972Q87L419J231j653l054o79j177P061L922
$$ -2003 4522 2477 -891 -2595 -6280 -6501 -3529 -2642 777 2008 355 -2699 -3378 -4555 2506 6428
7418F428K786k513n476K102K111k802l785j211k977L633N082k034p505k73J58
$$ 6428 9214 6701 1225 3327 5438 2636 -1149 -2360 -5337 -1704 3378 1344 -6161 -6434 -6276
7403f276L836j583j914M047k180j09M668J652m079j397q35j899L642K301L284
$$ -6276 -2440 -4023 -5937 -1890 -4070 -4179 489 2141 -1938 -3335 -4170 -6069 -2427 -126 3158
7388C158j645j984K633M538o112n407j876J858K521k565m919j232K202K508l256
$$ 3158 1513 -471 2162 6700 588 -4819 -6695 -4837 -2316 -4881 -9800 -11032 -8830 -6322 -9578
7373i578j116P493j249J655K622L11n692j144m763p93K707Q614L290K595j439
$$ -9578 -10694 -3201 -4450 -2795 -173 138 -5554 -6698 -11461 -12254 -9547 -933 2357 4952 3513
7358C513l881j619r72j969r39p68n28L553O25m078j723q30j119j791J526L191
$$ 3513 -368 -1987 -2959 -4928 -5867 -6635 -7163 -3610 -2985 -7063 -8786 -9616 -10735 -12526 -11000 -7809
7342g809n44M72L497K337j30k716o10j381N065J679L495l117n581o024j909M957
$$ -7809 -8353 -7881 -4384 -2047 -2177 -4893 -5503 -6884 -1819 -140 3355 238 -5343 -11367 -13276 -8319
7326h319J533J261K519k26j887P9k879J676J760j249J464K987J821k459q48n191
$$ -8319 -6786 -5525 -3006 -3232 -5119 -5040 -7919 -6243 -4483 -5732 -4268 -1281 540 -1919 -2767 -7958
7310g958j547J926J678j193N67r11N571J404j423L270L206k275k704k735m85j856
$$ -7958 -9505 -7579 -5901 -7094 -6527 -7438 -1867 -463 -1886 1384 4590 2315 -389 -3124 -3609 -5465
7294e465M896p73j076j632J428Q06O04K544l531j392J306m207j936M657J054o802
$$ -5465 -569 -1342 -2418 -4050 -2622 -1816 -1212 1332 -2199 -3591 -2285 -6492 -8428 -3771 -2717 -9519
7278i519K510J491j948m301J584K195O3l78N062N081l361n220o584M415L285K468
$$ -9519 -7009 -5518 -7466 -11767 -10183 -7988 -7925 -8303 -3241 1840 -1521 -6741 -13325 -8910 -5625 -3157
7262c157M824L557l525J848m753n296n764K683o75R43K506K043p35J089l469r41
$$ -3157 1667 5224 1699 3547 -1206 -6502 -12266 -9583 -10258 -9315 -6809 -4766 -5501 -4412 -7881 -8822
7246h822N660N149j501j613k578O44J198l263l502r3m749j335N632J914j660k122
$$ -8822 -3162 1987 486 -1127 -3705 -3061 -1863 -5126 -8628 -8721 -13470 -14805 -9173 -7259 -8919 -11041
7230a1041M222K909o68J001M266K418n197l02J460J327o068O6r47K631L790N12
$$ -11041 -6819 -3910 -4578 -3577 689 3107 -2090 -2392 -932 395 -5673 -5607 -6554 -3923 -133 379
7214C79k362N29M18k315L101M79l596j375K983K390K74n071J867N01R25L708j86
$$ 379 -1983 -1454 -1036 -3351 -250 229 -3367 -4742 -1759 631 905 -4166 -2299 -1798 -873 2835 2649
7197B649P3J25J38q68k493K85L5J54l854p632k216R19Q33O010O602L722j380j946
$$ 2649 2722 2847 2985 2117 -376 -91 -56 98 -3756 -11388 -13604 -12685 -11852 -5842 760 4482 3102 1156
7179A156m636q52L305J254P65o441J164K151k637j044%Q79L024p81J194K014M553
$$ 1156 -3480 -4332 -1027 227 992 -5449 -4285 -2134 -4771 -5815 -5815 -4936 -1912 -2693 -1499 515 5068
7162E068J326n868j923M521j536k211L338J078l696L5j5N92L589K357m573l982
$$ 5068 6394 526 -1397 3124 1588 -623 2715 3793 97 132 117 709 4298 6655 2082 -1900
7146a900l791j431J918k454l377M757N475m004k43O60J426m756K254R609K101
$$ -1900 -5691 -7122 -5204 -7658 -11035 -6278 -803 -4807 -5050 -4390 -2964 -7720 -5466 4143 6244
7131F244j005q363k342J690l797M971M618j385m232k769o214j15N319M843J970
$$ 6244 5239 -3124 -5466 -3776 -7573 -2602 2016 631 -3601 -6370 -12584 -12699 -7380 -2537 -567
7116e67m681n36J51l60K774Q62J926L404k864K574L630P92j079o598j112k186
$$ -567 -5248 -5784 -5633 -5993 -3219 -2357 -431 2973 109 2683 6313 7105 6026 -572 -1684 -3870
7100c870K325M17l211J292L383o41K773k160j560l735n102L79K780l31L041P42
$$ -3870 -1545 -1128 -4339 -3047 336 -305 2468 308 -1252 -4987 -10089 -9710 -6930 -7261 -4220 -3478
7084c478M790l70j132L244J673l962o85k417j886K86k393m628J608K418J572l196
$$ -3478 1312 942 -190 3054 4727 765 80 -2337 -4223 -3937 -6330 -10958 -9350 -6932 -5360 -8556
7068h556L919N103L07J623L60l181j615J110J485o227n086k820M061N699K791
$$ -8556 -4637 466 773 2396 2756 -425 -2040 -930 555 -5672 -10758 -13578 -9517 -3818 -1027
7053a027j835j919m10K124J907P1j942m19J772J810M67j850k311p91J510K400
$$ -1027 -2862 -4781 -5191 -3067 -1160 -1089 -3031 -3450 -1678 132 599 -1251 -3562 -4353 -2843 -443
7037d43L613m138k632J186k02J32L754K340k686n927j249J147M38j716k375O787
$$ -443 3170 -968 -3600 -2414 -2616 -2484 1270 3610 924 -5003 -6252 -5105 -4667 -6383 -8758 -1971
7021a971j81m396O14j916j59M943K046n708n979k934O695N041M25j325k663k242
$$ -1971 -2152 -6548 -5934 -7850 -8009 -3066 -1020 -6728 -12707 -15641 -8946 -3905 -3480 -4805 -7468 -9710
7005i710K847j563j37J579K44J337J660o302M333P506o827n163K067M797k889
$$ -9710 -6863 -8426 -8563 -6984 -6740 -5403 -3743 -10045 -5712 1794 -5033 -10196 -8129 -3332 -6221
6990f221j798L648L647j020P82j181l461k457Q12M657K383j736j629k626J017
$$ -6221 -8019 -4371 -724 -1744 -962 -2143 -5604 -8061 -7249 -2592 -209 -1945 -3574 -6200 -5183
6975e183P139p53l525l357j069m271K501L122J739L970M438j599J114m440n838
$$ -5183 1956 1203 -2322 -5679 -6748 -11019 -8518 -5396 -3657 313 4751 3152 4266 -174 -6012
6960f012O777N480J910K287m211r411j176M097p81P75J923J103n66l842m799l258
$$ -6012 765 6245 8155 10442 6231 -3180 -4356 -259 -1040 -265 1658 2761 2195 -1647 -6446 -9704
6944i704p81O005K111m51j864j478o03M870P421q68k268r73j261l559J470j822
$$ -9704 -10485 -4480 -2369 -2820 -4684 -6162 -6765 -1895 5526 4658 2390 1417 156 -3403 -1933 -3755
6928c755K728k348l952L254o34j034K363K484r81k611p30K26j733K011M062k130
$$ -3755 -1027 -3375 -7327 -4073 -4707 -5741 -3378 -894 -1875 -4486 -5216 -4990 -6723 -4712 -650 -2780
6912b780m034J707M275P33l726o606k025L202M531q9m11p88O22M116p3k900k261
$$ -2780 -6814 -5107 -832 -99 -3825 -10431 -12456 -9254 -4723 -4812 -5223 -6011 -5389 -1273 -1346 -4246 -6507
6895f507Q33J702L005M471M081l32j708J44n574O47J877J197L35l75q9l187o212
$$ -6507 -5674 -3972 -967 3504 7585 7253 5545 5689 115 762 2639 3836 4171 3796 3707 520 -5692
6878e692l632K158J297K541Q35j806m7J880k06k199L490L125K493j299m865q79
$$ -5692 -9324 -7166 -5869 -3328 -2493 -4299 -4346 -2466 -2672 -4871 -1381 1744 4237 2938 -1927 -2806
6862b806j804K221P11K605k478m1J396k048J541M794M370j422l240k375k174K239
$$ -2806 -4610 -2389 -1678 927 -1551 -1592 -196 -2244 -703 4091 8461 7039 3799 1424 -750 1489
6846A489o37j100k974N080J779j280m21m659o298M049N222K119k518m25j798l868
$$ 1489 852 -248 -3222 1858 3637 2357 1936 -2723 -9021 -4972 250 2369 -149 -574 -2372 -6240
6830f240k698m77o70K782K340L387J963P12j062m147K63P73m768K253K077K692
$$ -6240 -8938 -9415 -10085 -7303 -4963 -1576 387 1099 37 -4110 -3847 -3074 -7842 -5589 -3512 -820
6814h20k217j643K221j729l956J890J929k8r3J239J56k641J669K764l03o052j826
$$ -820 -3037 -4680 -2459 -4188 -8144 -6254 -4325 -4353 -4446 -3207 -3051 -5692 -4023 -1259 -1562 -7614 -9440
6797i440O757N664K935j114k585J298P4P60n31M653K197l001q610J542K877k279
$$ -9440 -2683 2981 5916 4802 2217 3515 3589 4349 3818 8471 10668 7667 -943 599 3476 1197
6781A197l299l377l932M402P420L729j878J94L176n782j896K952K248N86J95n53
$$ 1197 -2102 -5479 -9411 -5009 2411 6140 4262 4456 7632 1850 -46 2906 5154 5740 5935 5382
6765E382K045n34m641n543m46K169j171q32o55L992r77l356L270J214J006J766
$$ 5382 7427 6893 2252 -3291 -3737 -1568 -2739 -3571 -4226 -234 -1211 -4567 -1297 -83 923 2689
6749B689j696J100K178K134k890j730l206k369J059J1J705N674K172J61k290m909
$$ 2689 993 2093 4271 6405 3515 1785 -1421 -3790 -2731 -2720 -1015 4659 6831 6992 4702 -207
6733b07j066j560j215j500K508M67k572K441j56J521k254k612j365K855J150P3
$$ -207 -1273 -2833 -4048 -5548 -3040 -2573 -5145 -2704 -2860 -1339 -3593 -6205 -7570 -4715 -3565 -3492
6717c492R64m4N3k510j397o83J980N30l30J022j094J269M301q9L099j154k422
$$ -3492 -2528 -2572 -2519 -5029 -6426 -7109 -5129 -4599 -4929 -3907 -5001 -3732 569 480 3579 2425 3
6700Cj379l966j581j671P3L371R90M196K622J681m586l240l498j370O62P62K546
$$ 3 -1376 -5342 -6923 -8594 -8521 -5150 -4160 36 2658 4339 -247 -3487 -6985 -8355 -7693 -6931 -4385
6683d385J954l867L698k922m039K89k59J717J603j277K062N583K82J775k403j620
$$ -4385 -2431 -6298 -2600 -5522 -9561 -9272 -9531 -7814 -6211 -7488 -5426 157 439 2214 -189 -1809
6667a809K749N87K401j421m545K072K794M603M09M282k985n949n12l070K326K694
$$ -1809 940 1527 3928 2507 -2038 34 2828 7431 7840 12122 9137 3188 2676 -394 1932 4626
6651D626m54l805n619R92R75k405j02L596K229m764j834L781L476k342M09K929
$$ 4626 4172 367 -5252 -4260 -3285 -5690 -5792 -2196 33 -4731 -6565 -2784 692 -1650 -1241 1688
6635A688n397o59N761m055j847O278K002l933O232K911o140l642K562j30k275
$$ 1688 -3709 -4368 1393 -2662 -4509 1769 3771 -162 6070 8981 2841 -801 1761 1631 -644
6620f44l826J071L06j179l342l391P69l430Q28O769O172L768l990o81J901L35
$$ -644 -4470 -3399 -3093 -4272 -7614 -11005 -10236 -13666 -12838 -6069 103 3871 -119 -800 1101 1436
6604A436m494J422N413j995l656M54K874j213P30k372n95l523j598L532K331j044
$$ 1436 -3058 -1636 3777 1782 -1874 -1420 1454 241 971 -1401 -1996 -5519 -7117 -3585 -1254 -2298
6588b298n59O24Q27k233L365M189m065n858K71j559K691k112j521O84K540j531
$$ -2298 -2857 -2233 -1406 -3639 -274 3915 -150 -6008 -5737 -7296 -4605 -6717 -8238 -7554 -5014 -6545
6572f545K041N540O313j029o790l15N302K498l525q952J254L525k250J159L639
$$ -6545 -4504 1036 7349 6320 -470 -785 4517 7015 3490 -5462 -4208 -683 -2933 -1774 1865
6557A865J079M05M47n96J41l086l486k336k269L986Q321j713n968j876K190N962
$$ 1865 2944 3349 3796 3200 3341 255 -3231 -5567 -7836 -3850 4471 2758 -3210 -5086 -2896 3066
6541C066K451m513k208K167N84o47q17j110j919L55M967m21l170j827N452J513
$$ 3066 5517 1004 -1204 963 1547 900 83 -1027 -2946 -2591 2376 1955 -1215 -3042 2410 3923
6525C923l570j598J931j214L079p26j786q92J569m413l585J375K720M796k394
$$ 3923 353 -1245 686 -528 2551 1825 39 -853 716 -3697 -7282 -5907 -3187 1609 -785
6510g85n362k39J258M297l60N35j366k374K496J474j51o53k404j996K142O750
$$ -785 -6147 -6386 -5128 -831 -1191 -656 -2022 -4396 -1900 -426 -577 -1230 -3634 -5630 -3488 3262
6494C262l333m73K151M199K416j675k764j571l742j420L579K572j92j882k004
$$ 3262 -71 -544 1607 5806 8222 6547 3783 2212 -1530 -2950 629 3201 3009 1127 -877
6479h77k105K499l180o070j269O30K555j740j518L505J0966K329j421M50N84J536
$$ -877 -2982 -483 -3663 -9733 -11002 -10372 -7817 -9557 -11075 -7570 3396 5725 4304 4754 5338 6874
6463F874k184j128k911n472l889L530K727J950P006L020q10n845l034n759n003
$$ 6874 4690 3562 651 -4821 -8710 -5180 -2453 -503 6503 9523 8713 2868 -166 -5925 -10928
6448a0928Q82L351K321L439k595l043K157N650K080m728r058m552L136O187M488
$$ -10928 -10046 -6695 -4374 -935 -3530 -6573 -4416 1234 3314 -1414 -10472 -15024 -11888 -5701 -1213
6433a213L868K193m710J754j61n76k567l567j621J575L476m98q58L55L03o323
$$ -1213 2655 4848 138 1892 1731 1155 -1412 -4979 -6600 -5025 -1549 -2047 -2905 -2550 -2247 -8570
6417h570p63l33j280L761M964M193q04J277j278l091M26L389l912n04j578j669
$$ -8570 -9333 -9666 -10946 -7185 -2221 1972 1168 2445 1167 -1924 -1498 1891 -2021 -2525 -4103 -5772
6401e772j617k691K069L455l588k90K012L772K760k234j682J177J330m83N64j778
$$ -5772 -7389 -10080 -8011 -4556 -8144 -8434 -6422 -2650 110 -2124 -3806 -2629 -1299 -1782 -1218 -2996
6385b996r22L903K309l436L012k044k153m326N668L30m047O3j201L213K207q98
$$ -2996 -3918 -15 2294 -1142 1870 -174 -2327 -6653 -985 -655 -4702 -4639 -5840 -2627 -420 -1318
6369a318m344j633J347Q35k955n402N083L045N622L769k87R42L237J106j504o85
$$ -1318 -5662 -7295 -5948 -5113 -8068 -13470 -8387 -5342 280 4049 3762 4704 7941 9047 7543 6858
6353F858n988o024J292L324J650J273J510o530l186L022J547K55q32J874k950
$$ 6858 870 -5154 -3862 -538 1112 2385 3895 -2635 -5821 -2799 -1252 -997 -1829 45 -2905
6338b905j260L421L366k050K05O512k973q317O73N510K664J360k143n874j623
$$ -2905 -4165 -744 2622 572 777 7289 4316 -4001 -3328 2182 4846 6206 4063 -1811 -3434
6323c434K093K787l966l141J216N360L121l659n07K334k759n289j653l830L992
$$ -3434 -1341 1446 -2520 -5661 -4445 915 4036 377 -130 2204 -555 -5844 -7497 -11327 -7335
6308g335L460Q82M641l33J16J051M11M32j909j152k482M169K943l360p999M87
$$ -7335 -3875 -2993 1648 1315 1431 2482 2893 3325 1416 264 -2218 1951 4894 1534 -6465 -5978
6292e978l967L975M404l781K533R39k933k855O188L525j195l552N14o39K753M351
$$ -5978 -9945 -5970 -1566 -5347 -2814 -1875 -4808 -7663 -1475 2050 855 -2697 -2183 -2822 -69 4282
6276D282j881J565J908k920m891L62j754n876o93M39K198K429O93n639j559J954
$$ 4282 2401 3966 5874 2954 -1937 -1575 -3329 -9205 -9898 -9459 -7261 -4832 -4139 -9778 -11337 -9383
6260i383J384L723L176M075J404R72m025k831l712k63P462j629q01m546l911m287
$$ -9383 -7999 -4276 -1100 2975 4379 5351 1326 -1505 -5217 -5480 1982 353 -448 -4994 -8905 -13192
6244a3192k23j292N944M464K217J122J443L233Q54L155K7o07j332j645l513m16
$$ -13192 -13415 -14707 -8763 -4299 -2082 -960 483 3716 4570 7725 7752 7145 5813 4168 655 239
6228B39P8L740r20J26k367P72P5p710l146J336J330L225L635K880j135J320n75
$$ 239 317 4057 3137 3263 896 1668 1743 -5967 -9113 -7777 -6447 -3222 413 3293 2158 3478 2903
6211B903m514j536J573J038J474j749k769k277k234J830N899j502l077L722R47
$$ 2903 -1611 -3147 -1574 -536 938 -811 -3580 -5857 -8091 -6261 -362 -1864 -4941 -1219 -272
6196b72m126J252J484L216J368J261j169J013j797j857p97k309k301L081Q49j476
$$ -272 -4398 -3146 -1662 1554 2922 4183 3014 4027 2230 373 -424 -2733 -5034 -1953 -1104 -2580
6180b580L794k738k959K975K093J450J177L844M25p6m945m809n086p24M374nm896
$$ -2580 1214 -1524 -4483 -1508 585 2035 3212 7056 7481 7405 2460 -2349 -7435 -8159 -3785 -3790 -8686
6163h686J624J638k111k041j97M547o40L10N116L333r96n022m867J024K858M989
$$ -8686 -7062 -5424 -7535 -9576 -9773 -5226 -5866 -5556 -440 2893 1897 -3125 -7992 -6968 -4110 879
6147H79o1l156J79J56k43L841L71n227m692p66J158K591j126l195l137O23M491
$$ 879 818 -2338 -2159 -2003 -2246 1595 1966 -3261 -7953 -8719 -7561 -4970 -6096 -9291 -12428 -11805 -7314
6130g314L728M963j606P34K366j040l581K122J514j242m881n980L509L679N45
$$ -7314 -3586 1377 -229 505 2871 1831 -1750 372 1886 644 -4237 -10217 -6708 -3029 -2484
6115b484J210k212r52k371L613J875o80N172N346K74j147j980k488k09K116n21
$$ -2484 -1274 -3486 -4438 -6809 -3196 -1321 -2001 3171 8517 8791 7644 5664 3176 2967 5083 4562
6099D562l418k628M250J251n473M53L553n070j702m26l955L293k4M810k358n961
$$ 4562 1144 -1484 2766 4017 -1456 -1003 2550 -2520 -4222 -4648 -8603 -5310 -5334 -524 -2882 -8843
6083h843J344M531j440L636K554l31n394j169q57l926L580N862l540J219n77N26
$$ -8843 -7499 -2968 -4408 -772 1782 1451 -3943 -5112 -5969 -9895 -6315 -453 -3993 -2774 -3351 -2825
6067b825M00r45J02N12J119l06K151M58k151l924P10J0533k83n978k047n84K4
$$ -2825 -2425 -3370 -3268 -2756 -1637 -1943 208 666 -1485 -5409 -4699 5834 5551 -427 -2474 -3058 -3034
6050c034l541J752N752j444M6j006p51j544J349K744J325K872l96l837j897O483
$$ -3034 -6575 -4823 929 -515 -469 -1475 -2226 -3770 -2421 323 1648 4520 4124 287 -1610 4873
6034D873k793m002n30P64l263m878k693M758N566O580N90k754J87P004M86o253
$$ 4873 2080 -1922 -2452 -1688 -4951 -9829 -12522 -7764 -2198 4382 4972 2218 2405 9409 9895 3642
6018C642m806J86k03k592K219R11l351q3J736Q151K697m031p450l171K101k370
$$ 3642 -1164 -978 -1181 -3773 -1554 -643 -3994 -4077 -2341 5810 8507 4476 -2974 -6145 -4044 -6414
6002f414n38N724q45k281J681p0k728m581K631j654o06O419p53J183r45m148o44
$$ -6414 -6952 -1228 -2073 -4354 -2673 -2743 -5471 -10052 -7421 -9075 -9681 -3262 -4015 -2832 -3777 -7925 -8569
5985h569J026j219l072Q16N031M925M127m83K053k934m972L00L252o3l05P70K755
$$ -8569 -7543 -8762 -11834 -11018 -5987 -1062 3065 2582 4635 1701 -3271 -2971 281 218 -87 683 3438
5968C438L117k928o517J414J27o11l166l146N17K66M807P67J201k60j875k97k89
$$ 3438 6555 3627 -2890 -1476 -1349 -1960 -5126 -8272 -7755 -7489 -2682 -1915 -714 -974 -2849 -3146 -3435
5951c435k374L501O839M139L70k918N00l004k953k092l02L49l691n174K402K543
$$ -3435 -5809 -2308 4531 8670 9040 6122 6622 3618 665 -1427 -1729 -1380 -5071 -10245 -7843 -5300
5935e300l59l231n89L013Q00K000J205k736K8j133k718J924K999J152K815k174
$$ -5300 -5659 -8890 -9479 -6466 -5666 -3666 -2461 -5197 -5169 -6302 -9020 -7096 -4097 -2945 -130 -2304
5919b304p447K90m399j14J041l0N12P084L484L122k102J261n379q881k224K69
$$ -2304 -9751 -9461 -13860 -13974 -12933 -12963 -12451 -5367 -1883 1239 -863 398 -4981 -13862 -16086 -15817
5903a5817M526J980L711K697m016p96O74K835L747O10j500m718J976L574J312
$$ -15817 -11291 -9311 -5600 -2903 -6919 -7715 -7041 -4206 -459 151 -1349 -6067 -4091 -517 795
5888G95M662J659j790j392N10k862K221J825l656l89l179J773P032L61o311j573
$$ 795 5457 7116 5326 3934 4444 1582 3803 5628 1972 1583 -1596 177 7209 7570 1259 -314
5872c14j163l826j353l055o06K138j708J323K959K692j100J41J274L167J271j151
$$ -314 -1477 -5303 -6656 -9711 -10317 -8179 -9887 -8564 -5605 -2913 -4013 -3872 -2598 569 1840 689
5856F89k491M8o81k901M477J024n057m748p78J184J730K013m395j207K0R64J001
$$ 689 -1802 -1754 -2435 -5336 -859 165 -4892 -9640 -10418 -9234 -7504 -5491 -9886 -11093 -11073 -10109 -9108
5839i108J328M594J771j89K912n254J146J286m612K166j572m963K625K205J956
$$ -9108 -7780 -3186 -1415 -1604 1308 -3946 -2800 -1514 -6126 -3960 -5532 -10495 -7870 -5665 -3709
5824c709K990L693L474l163R81l461m486k319k014m165J714P051L326K780n21
$$ -3709 -719 2974 6448 3285 4266 805 -3681 -6000 -8014 -12179 -10465 -3414 -88 2692 2171
5809B171j218j160j080j666k474j407K23J445o90k983m096M530L690J406L042
$$ 2171 953 -207 -1287 -2953 -5427 -6834 -6611 -5166 -5856 -8839 -12935 -8405 -4715 -3309 -267
5794b67J65m167k138l255J912J48j73N091j768k275j586j531J165O890J65j352
$$ -267 -102 -4269 -6407 -9662 -7750 -7602 -7775 -2684 -4452 -6727 -8313 -9844 -8679 -1789 -1624 -2976
5778b976m265o94P39l056J039K379P909j17o288L886o69j803J258L789M96j040
$$ -2976 -7241 -7935 -7196 -10252 -9213 -6834 1075 958 -5330 -1444 -2113 -3916 -2658 1131 1627 587
5762E87L744N16N20L33k405o174m969j048K499M584J950k82j465j985j157J267
$$ 587 4331 4847 5367 5700 3295 -2879 -7848 -8896 -6397 -1813 137 -145 -1610 -3595 -4752 -3485
5746c485J591j613K01J579K900k848n98L83j705N57J961l267l461l37Q06J568
$$ -3485 -1894 -3507 -3306 -1727 1173 -1675 -2273 -1890 -3595 -3038 -1077 -4344 -7805 -8142 -7336 -5768
5730e768L360J449m874K149N93k482k98L746K555N11o77K688O75o972k344j736
$$ -5768 -2408 -959 -5833 -3684 -3091 -5573 -5871 -2125 430 941 264 2952 3627 -3345 -5689 -7425
5714g425K942K302J899l076o775j869K202k326K700j451n60K675K336M551P555
$$ -7425 -4483 -2181 -282 -3358 -10133 -12002 -9800 -12126 -9426 -10877 -11437 -8762 -6426 -1875 5680
5699E680l289K469J167j488J311l869j542m892k526M772L195O46j098l750m632
$$ 5680 2391 4860 6027 4539 5850 1981 439 -4453 -6979 -2207 988 1634 536 -3214 -7846
5684g846k157O106N398L78k243l038j272n8l050K59L165m951l616J917K665O583
$$ -7846 -10003 -3897 1501 1879 -364 -3402 -4674 -4732 -7782 -7523 -4358 -9309 -12925 -11008 -8343 -1760
5668a760J509K432K057O221o191o048L6p45n111M014l099L68L061K138Q27J484
$$ -1760 -251 2181 4238 10459 4268 -1780 -1744 -2489 -7600 -3586 -6685 -6317 -3256 -1118 -291 1193
5652A193J79J956P29j458l238k860Q65N21l059J350n05m220l666K976J0490K469
$$ 1193 1372 3328 4057 2599 -639 -3499 -2634 -2113 -5172 -3822 -4327 -8547 -12213 -9237 1253 3722
5636C722l606k315k110J337j837K323J662k168J65k326K355O417K771n469l992
$$ 3722 116 -2199 -4309 -2972 -4809 -2486 -824 -2992 -2827 -5153 -2798 3619 6390 921 -3071
5621c071Q57j38p57M769O31N14j375l553l195j622j35K087j093k94L545K002J844
$$ -3071 -2214 -2352 -3109 1660 2291 2805 1430 -2123 -5318 -6940 -7075 -4988 -6081 -6375 -2830 -828 1016
5604A016M85J298m826k716J442O11k972k397K957K497Q50J363m189J129K11K943
$$ 1016 1501 2799 -2027 -4743 -3301 -2690 -5662 -8059 -5102 -2605 -1755 -392 -4581 -3452 -3241 -298
5588b98K886j268r603l443J207K866N07Q53N488R6k701l224L013k654m559k40
$$ -298 2588 1320 -8283 -11726 -10519 -7653 -7146 -6293 -805 -709 -3410 -6634 -3621 -6275 -10834 -11074
5572a1074L029J499k036J59K761Q512K935k292J8k956R66o423J177K607o59j470
$$ -11074 -8045 -6546 -8582 -8423 -5662 2850 5785 3493 3511 555 1521 -4902 -3725 -1118 -1777 -3247
5556c247k72N201l948Q58L066N44J577j04K702m084j978K324K949l499k559J188
$$ -3247 -3519 1682 -2266 -1408 1658 2202 3779 3675 6377 2293 315 2639 5588 2089 -470 718
5540G18p30m131q01j517K057K823k805p100mK029j785K090P43K48K881J738L100
$$ 718 -12 -4143 -4944 -6461 -4404 -1581 -4386 -11486 -11490 -9461 -11246 -9156 -8413 -8165 -5284 -3546 -446
5523d46L143M76K05m74K154l449m3Q64q26k229q35p1p58P53k502l508K240N037
$$ -446 2697 3173 3378 2904 5058 1609 1566 2430 1604 -625 -1460 -1531 -2289 -1536 -4038 -7546 -5306 -269
5505b69j057L348O08k932K24k343o84M722q27l036M80K574p96j77L07k468m914
$$ -269 -1326 2022 2630 -302 -78 -2421 -3105 1617 790 -2246 -1766 808 12 -165 142 -2326 -7240
5488g240k935J061J616M386J690k052j544J077M770J508K07r720l313M128N445
$$ -7240 -10175 -9114 -7498 -3112 -1422 -3474 -5018 -3941 829 2337 2544 -7176 -10489 -6361 -916
5473i16N077K411l458l89j531J631k036j029j484j359j723K354J983L524N009
$$ -916 4161 6572 3114 2725 1194 2825 789 -240 -1724 -3083 -4806 -2452 -469 3055 8064
5458H064m825o281j730P10l444R93K28J693K829l02p531L205O249L810j575k896
$$ 8064 3239 -3042 -4772 -4062 -7506 -6513 -6285 -4592 -1763 -2065 -9596 -6391 -142 3668 2093 -803
5442h03j522Q0J732l551n389J085N194K402k199r75J697L200N458k206k475j630
$$ -803 -2325 -2245 -513 -4064 -9453 -8368 -3174 -772 -2971 -3946 -2249 951 6409 4203 1728 98
5426I8q15j046K96K221J471k200k484L20j507k555K695J72j26K872J910k687k696
$$ 98 -717 -1763 -1467 754 2225 25 -2459 -2139 -3646 -6201 -3506 -3334 -3460 -588 1322 -1365 -4061
5409d061J791J715N433P69K989l399m481N018o44j57q92p089l399r28J054J20
$$ -4061 -2270 -555 4878 5647 8636 5237 756 5774 5130 4973 4081 -3008 -6407 -7335 -6281 -6161
5393f161l54K470N813J610l604k712Q98j247k176J130k101M070m339j134k448
$$ -6161 -6515 -4045 1768 3378 -226 -2938 -2040 -3287 -5463 -4333 -6434 -2364 -6703 -7837 -10285
5378a0285q39K6J543J281k718m471k65L015j729N101N453K245k365n94k73q08
$$ -10285 -11124 -11098 -9555 -8274 -10992 -15463 -15728 -12713 -14442 -9341 -3888 -1643 -4008 -4602 -4875 -5683
5362e683L394n97J124Q64R15o83L247N685l806k767m520j388J528K825k316o90
$$ -5683 -2289 -2886 -1762 -898 17 -666 2581 8266 4460 1693 -2827 -4215 -2687 138 -2178 -2868
5346b868J398J886Q67m879K215N271n069p507j304K046L700K837P36J869K498
$$ -2868 -1470 416 1283 -3596 -1381 3890 -1179 -8686 -9990 -7944 -4244 -1407 -671 1198 3696
5331C696m169j892j554N451L974k686J521m552l914K761J423q82j620J631l58
$$ 3696 -473 -2365 -3919 1532 5506 2820 4341 -211 -4125 -1364 59 -823 -2443 -812 -1170
5316a170r62J148j503j430j643M31K182K689J612k921J189J895MJ938L583j094
$$ -1170 -2132 -984 -2487 -3917 -5560 -5129 -2947 -258 1354 -1567 -378 1517 1521 3459 7042 5948
5300E948j838j498k635K63k384l956n318J988J199n189k966Q780K657k03J946
$$ 5948 4110 2612 -23 240 -2144 -6100 -11418 -9430 -8231 -13420 -16386 -7606 -4949 -5152 -3206
5285c206j964m32J069k078P299o42l415j86j17j315L860K007k340k341L92K796
$$ -3206 -5170 -5602 -4533 -6611 688 46 -3369 -3555 -3672 -4987 -1127 880 -1460 -3801 -3409 -613
5269f13j24l780j165L996K850l43K086P43m228j831M8N708M619K740l607m397
$$ -613 -737 -4517 -5682 -1686 1164 821 2907 3650 -578 -2409 -2361 3347 7966 10706 7099 2702
5253B702l76l212q59J405K474k514k85l85k731J806J755J355k484j365M371j477
$$ 2702 2326 -886 -1745 -340 2134 -380 -665 -1050 -3781 -1975 -220 1135 -1349 -2714 1657 180
5237A80n7M202j485p123K246J800o31J885k275m960K102L789l026l553qO301Q708
$$ 180 123 4325 2840 -4283 -2037 -237 -868 1017 -1258 -6218 -4116 -327 -3353 -6906 -6914 -613 8095
5220H095l115r21o21n749R67J664l718L426j581k860M609m780o327l345P316P763
$$ 8095 4980 4059 3438 -2311 -1344 320 -3398 28 -1553 -4413 196 -4584 -10911 -14256 -6940 823
5204H23O041L311l997m034k49M25M597M378j850q781Q20J767M71J770P60k67o05
$$ 823 6864 10175 6178 2144 1895 2320 6917 11295 9445 664 1484 3251 3722 5492 6252 5985 5380
5187E380L980N80l393l593j814R80j713M312o65j672m045k190Q19l591q14J02
$$ 5380 9360 9940 6547 2954 1140 2120 407 4719 4054 2382 -1663 -3853 -3034 -6625 -7439 -7337
5171g337P9J948M469K537j562j2J305K099l237K080k191p418p436J014L770M387
$$ -7337 -7258 -5310 -841 1696 134 122 1427 3526 289 2369 178 -7240 -14676 -13662 -9892 -5505
5155e505M943J931j142j382n35l342l884J884m65j4K548M48j474p50k959p71M402
$$ -5505 -562 1369 227 -1155 -1690 -5032 -8916 -7032 -7497 -7511 -4963 -4515 -5989 -6739 -9698 -10469 -6067
5138f067M844L103P54J327j251M084N67k612j796l4K721J528o495l595N904Q68
$$ -6067 -1223 1880 2634 3961 2710 6794 7361 4749 2953 2919 5640 7168 673 -2922 2982 3850
5122C850k714k844J743l351J022L572P09l87k346N010K061n157J536L830j275
$$ 3850 1136 -1708 35 -3316 -2294 1278 1987 1600 -746 4264 6325 1168 2704 6534 5259
5107E259j398l01j655k225m726K260k389k311n53M190K126K265l023k576k292
$$ 5259 3861 3560 1905 -320 -5046 -2786 -5175 -7486 -8039 -3849 -1723 542 -2481 -5057 -7349
5092g349n249l037n97N758M060J763K956m104l267o67J305N194J547k878j360
$$ -7349 -12598 -15635 -16232 -10474 -6414 -4651 -1695 -5799 -9066 -9733 -8428 -3234 -1687 -4565 -5925
5077e925M027L610j67L90k695m65j488r26k771j755o66J778K889Q24L611J55k555
$$ -5925 -1898 1712 1545 1935 -760 -1225 -2713 -3639 -6410 -8165 -8831 -7053 -4164 -3340 271 426 -2129
5060b129L261P48J487p8k661Q9L415j93L086J181j320j06n452k322j606N633J837
$$ -2129 1132 1880 3367 3289 628 717 4132 3939 7025 8206 6886 6780 1328 -994 -2600 3033 4870
5043D870k423L073M943j760m918J010n16J222M602O14m820k493J300q10k83L911
$$ 4870 2447 5520 10463 8703 3785 4795 4279 5501 10103 10717 5897 3404 4704 3894 3611 7522
5027G522n36j269O13L606p18l435J74m729m576L12M370l798n117K474N566J1008
$$ 7522 6986 5717 6330 9936 9218 5783 5957 1228 -3348 -3036 1334 -2464 -7581 -5107 459 11467
5011A1467o577q330N297J576k747l884m912j044L559P23O534N509k530p355l899
$$ 11467 4890 -3440 1857 3433 686 -3198 -8110 -9154 -5595 -4872 1662 7171 4641 -2714 -6613
4996f613J778n16j1p07J313O796K038j511l801K036J440M596j546l904m135k073
$$ -6613 -4835 -5351 -5362 -6069 -4756 2040 4078 2567 -1234 802 2242 6838 5292 1388 -2747 -4820
4980d820k177K119O279J428J541m034l138j780L458L386J915J344k195j532m76
$$ -4820 -6997 -4878 1401 2829 4370 336 -2802 -4582 -1124 2262 4177 5521 3326 1794 1318
4965A318m260J782j86r69L281N79m268M46L723l089Q07M423m059p734K414R03
$$ 1318 -2942 -1160 -1346 -2315 966 1545 -2723 -2277 1446 -1643 -836 3587 -472 -8206 -5792 -4889
4949d889J385p07k275j607J966M94m30K947p69J231J0495M105m815m717N17N165
$$ -4889 -3504 -4211 -6486 -8093 -6127 -5633 -6063 -3116 -3885 -2654 7841 11946 7131 2414 2931 8096
4933H096k669j0624k85n854M156L562K576k094R70K772m393j179M494N65L268
$$ 8096 5427 -5197 -5482 -11336 -7180 -3618 -1042 -3136 -2166 606 -3787 -4966 -472 93 3361
4918C361M10M097k511m526j54q04m459n15J265K609j629n115K95jK777J970l4
$$ 3361 3771 7868 5357 831 677 -127 -4586 -5101 -3836 -1227 -2856 -7971 -7676 -7677 -4900 -2930 -2964
4901b964K108k66J799o00j547m527j590r97L768M092J721Jq93j137n749j975K026
$$ -2964 -856 -1122 677 77 -1470 -5997 -7587 -8584 -4816 -724 997 998 105 -1032 -6781 -8756 -6730
4884f730pm697l153N2K768O422J076L068k793Q23L596L182K138m250l034N98J52
$$ -6730 -6737 -11434 -14587 -14535 -11767 -5345 -4269 -1201 -3994 -3171 425 3607 5745 1495 -1539 -941 -789
4867g89o233m63R20M671J325l15l261R90L255L130l189N30Q461K278m235q9n07
$$ -789 -7022 -7485 -6565 -1894 -569 -884 -4145 -3155 100 3230 41 571 9032 11310 7075 6986 6479
4850F479k523m553n047n30N793K841j313L154O04J237m99k002l177o5k001J947
$$ 6479 3956 -597 -5644 -6174 -381 2460 1147 4301 4905 6142 5643 3641 464 399 -1602 345
4834C45J746o79J181l485l867j407J883j3L102L212j579K391L308n15l757j433
$$ 345 2091 1412 2593 -892 -4759 -6166 -4283 -4296 -1194 2018 439 2830 6138 5623 1866 433
4818D33R67K523l581o006l268n755r00M62K145J109M810J634J152j104N419N275
$$ 433 1400 3923 342 -5664 -8932 -14687 -15587 -15125 -12980 -11871 -7061 -5427 -4275 -5379 40 5315
4802E315K293j015L95k603K17M36L1q38m712k919j4j083L109M452O754J367l561
$$ 5315 7608 6593 6988 4385 4602 5038 5069 4231 -481 -3400 -3414 -4497 -1388 3064 9818 11185 7624
4785G624m301l558j122l018m287K060M524K029p44J040J427k84M18K058L5l300
$$ 7624 3323 -235 -1357 -4375 -8662 -6602 -2078 -49 -793 247 1674 1390 1808 3866 3901 601
4769F01K607M604k650m117l931M609J881L083j465o755O64K62K84J132J338J049
$$ 601 3208 7812 5162 1045 -2886 1723 3604 6687 5222 -1533 -869 -607 -323 809 2147 3196
4753C196n24l236M06P056K692l999n727n488N077M486j93k27k127p98M28K263
$$ 3196 2672 -564 -158 6898 9590 5591 -136 -5624 -547 3939 3746 3519 1392 594 1022 3285
4737C285j032K046M406J60l045j235j08j92l497n700k052k712M252L121R21l94
$$ 3285 2253 4299 8705 8865 5820 4585 4477 4285 788 -4912 -6964 -9676 -5424 -2303 -1382 -1776
4721a776N161M936j455k24J605k026p503j716J482O83J363j396l477M634l859
$$ -1776 3385 8321 6866 6642 8247 6221 -1282 -2998 -1516 -833 530 -866 -4343 291 -3568
4706c568p14M015K685O64j475n627l542L100M750J911J127L287L48k17m400k062
$$ -3568 -4282 -267 2418 3082 1607 -4020 -7562 -4462 288 2199 3326 6613 6961 6744 2344 282
4690B82j929o88o18j55O98r99j134p08L43L326j054k721m32m25o80k459j137N551
$$ 282 -1647 -2335 -2953 -3108 -2410 -3409 -4543 -5251 -4908 -1582 -2636 -5357 -5789 -6214 -6894 -9353 -10490 -4939
4672d939M729M053L689o264r23K932L919L645m471m373n145j24K799K136j626
$$ -4939 -210 3843 7532 1268 345 3277 7196 10841 6370 1997 -3148 -3272 -473 1663 37
4657C7k036n063m244P71R985O743k500J020O272j163l129j354q34K218M723O39
$$ 37 -1999 -7062 -11306 -10535 -550 6193 3693 4713 10985 9822 6693 5339 4505 6723 11446 12085
4641A2085J988k321j367l690k667n525n618k098M227L996l174l036M739J690R6
$$ 12085 14073 11752 10385 6695 4028 -1497 -7115 -9213 -4986 -990 -4164 -7200 -2461 -771 -675
4626f75p35j761k808l346P81k400l15P072M434l321k125J817O821j395l195k228
$$ -675 -1410 -3171 -5979 -9325 -8544 -10944 -11259 -4187 247 -3074 -5199 -3382 3439 2044 -1151 -3379
4610c379o28O80J137k687J542N415M452p43m976n93L255J063n04j402p17j733
$$ -3379 -4007 -3327 -2190 -4877 -3335 2080 6532 5789 813 220 3475 4538 4034 2632 1915 182
4594A82k293M730K914l425j716J760L176m661k210m211r73l86K042k71L771K654
$$ 182 -2111 2619 5533 2108 392 2152 5328 667 -1543 -5754 -6727 -7113 -5071 -5342 -1571 1083
4578A083m56K098J765k631m29R56O66l307q35K114J127k019M91M843j724l954
$$ 1083 627 2725 4490 1859 1430 2386 3052 -255 -1090 1024 2151 132 623 5466 3742 -212
4562b12Q62K54N62K602J597l572j966k707l317l01k249j287P046L718p41k815
$$ -212 650 904 1466 4068 5665 2093 127 -2580 -5897 -6198 -8447 -9734 -2688 1030 289 -2526
4546b526k688n88K85L634K893m064k930m957l134L353N792M612j960J354M67N27
$$ -2526 -5214 -5802 -5517 -1883 1010 -3054 -5984 -10941 -14075 -10722 -4930 -318 -2278 -924 -457 70
4530G0M38Q89M111O48j455j511q84o50q92j173j267M359K934L918j540n129l327
$$ 70 508 1397 5508 6156 4701 3190 2306 1656 764 -409 -1676 2683 5617 9535 7995 2866 -461
4513d61O31j040Q28n95K142J687k692J298L409K97m539o924l711M443J404J679
$$ -461 170 -870 -42 -637 1505 3192 500 1798 5207 5504 965 -5959 -9670 -5227 -3823 -2144
4497b144m500m510K907M882K826J448L861n32j263l94k49o63k667n421l81k25
$$ -2144 -6644 -11154 -8247 -3365 -539 909 4770 4238 2975 2581 2332 1669 -998 -6419 -6800 -7025
4481g025J132J6l1m299o284O118Q917r51M42K69k684K549l588p857K894P417J467
$$ -7025 -5893 -5877 -5908 -10207 -16491 -10373 -1456 -2407 -1965 -1696 -4380 -1831 -5419 -13276 -10382 -2965 -1498
4464a498m91j292l98J137m724N79O665j997P45L307K829p03O14J409N010J517
$$ -1498 -1989 -3281 -3679 -2542 -7266 -6687 -22 -2019 -1274 2033 4862 4159 4773 6182 11192 12709
4448A2709m514k033J870k145k264n745K706m12N476M683L432k25k563p964r398
$$ 12709 8195 6162 8032 5887 3623 -2122 584 172 5648 10331 13763 13538 10975 3011 -6387
4433f387k066N607L990m144n184J691J582Q029Q29k955r19l015l031K380K801
$$ -6387 -8453 -2846 1144 -3000 -8184 -6493 -4911 3118 3947 992 73 -2942 -5973 -3593 -792
4418g92Q68P79J074m363l028K264M632l656Q15L559L218J364n983k454L905J557
$$ -792 76 855 1929 -2434 -5462 -3198 1434 -2222 -1407 2152 5370 6734 751 -1703 2202 3759
4402C759r64j085J155K247K25m198m869k621M056j33k433J176o53m492J353J52
$$ 3759 2795 1710 2865 5112 5337 1139 -3730 -6351 -2295 -2428 -4861 -3685 -4338 -8830 -7477 -7325
4386g325R57K504Q62o001L691J941N77j976J457l287M59N686l712l805N111M995
$$ -7325 -6368 -3864 -3002 -9003 -5312 -3371 -2794 -4770 -3313 -6600 -6141 -455 -4167 -7972 -2861 2134
4370B134J223n464l549k196K697J28l190k52l723K600P982R885J656l279K835
$$ 2134 3357 -2107 -5656 -7852 -5155 -5027 -8217 -8469 -12192 -9592 -1610 8275 9931 6652 9487
4355I487n77m621n501k744J667l29K470L256M568J165R07n480l795M445j58l888
$$ 9487 8910 4289 -1212 -3956 -2289 -2618 -148 3108 7676 8841 9748 4268 473 4918 4760 872
4339H72j853J430L68J424P78m04l89q15J64K214L99l686m849J659J036J90K618
$$ 872 -981 449 817 2241 3019 2615 2226 1411 1575 3789 4188 502 -4347 -2688 -1652 -1462 1156
4322A156J262n82R79l587m83J634m189j69K055j646m54J004P662k193p409Q98
$$ 1156 2418 1836 2815 -772 -1255 379 -3810 -3979 -1924 -3570 -4024 -3020 4642 2449 -4960 -4062
4306d062l4K936L931R31M043n948P08j366l812p213k269N389O976N502l95m401
$$ -4062 -4096 -1160 2771 3702 7745 1797 2505 1139 -2673 -9886 -12155 -6766 210 5712 5317 916
4290I16l083l124J016M920J241L020l423p237m87K157K250N095J312K547k904
$$ 916 -2167 -5291 -4275 645 1886 4906 1483 -5754 -6241 -4084 -1834 3261 4573 7120 4216
4275D216m017M098j915k733j004J724P20k787K8J515l407l390p50K221O69O884
$$ 4216 199 4297 2382 -351 -1355 369 1089 -1698 -1670 -155 -3562 -6952 -7702 -5481 -4812 2072
4259B072K894o79K592j468l488l123j289n49j309O85m600j522n38L463N540M267
$$ 2072 4966 4287 6879 5411 1923 -1200 -2489 -3038 -4347 -3662 -8262 -9784 -10322 -6859 -1319 2948
4243B948k70k177J167L6l519J175k661J421L181Q47j801j938J536M65q73J232
$$ 2948 2678 501 1668 1704 -1815 -640 -3301 -1880 1301 2148 347 -1591 -55 410 -463 769
4227G69J72M457J679o188j305M686N31k905j570k331l474n744R02L375N804J526
$$ 769 941 5398 7077 889 -416 4270 4801 1896 326 -2005 -5479 -11223 -10321 -6946 -1142 384
4211C84j977J57K063L034k943j519k439j355k46L973J080P61k452p77j659L43
$$ 384 -1593 -1436 627 3661 718 -801 -3240 -4595 -4841 -868 212 973 -1479 -2256 -3915 -3572
4195c572p21o90L013K930R54N81j977j192N59J225j144j571J830J264J48n26l615
$$ -3572 -4293 -4983 -1970 960 1914 2495 518 -674 -115 1110 -34 -1605 225 1489 1637 1111 -2504
4178b504k283K938L581M854j959k63P17l94o192k086N69J230M129J755k162p66
$$ -2504 -4787 -1849 1732 6586 4627 4364 5081 4687 -1505 -3591 -3022 -1792 2337 4092 1930 1164
4162A164q79m259k610L211M62j581K351j82R08K676K078n232k548k521J756n06
$$ 1164 285 -3974 -6584 -3373 -2911 -4492 -2141 -2323 -1415 1261 3339 -1893 -4441 -6962 -5206 -5712
4146e712J254M802j264k127r76L080J281k074L732K936j662L273K514J449o72
$$ -5712 -4458 344 -920 -3047 -4023 -943 338 -1736 1996 4932 3270 6543 9057 10506 9834
4131I834l142J109k379n547j0273j005K235P93M627n085o89P861K711k473k132
$$ 9834 6692 7801 5422 -125 -10398 -11403 -9168 -8375 -3748 -8833 -9522 -1661 1050 -1423 -3555
4116c555q014o802J976O888k231l869N602o72l72N613R63j493N215M399N662l817
$$ -3555 -11569 -18371 -16395 -9507 -11738 -15607 -10005 -10677 -11049 -5436 -4473 -5966 -751 3648 9310 5493
4100E493p241j140N006M784o71l374k383L647K433k124n538m697O85N75k833J281
$$ 5493 -1748 -2888 2118 6902 6231 2857 474 4121 6554 4430 -1108 -5805 -5120 -4545 -7378 -6097
4084f097J91p28r37J414k129J427l0K037j037J968O56K062J028L301K829m798
$$ -6097 -5906 -6634 -7571 -6157 -8286 -6859 -6889 -4852 -5889 -3921 -3265 -1203 -175 3126 5955 1157
4068A157m704r01o2M456N211K540l403l679k743l18j096J784J612l560k551J471
$$ 1157 -3547 -4448 -4510 -54 5157 7697 4294 615 -2128 -2446 -3542 -1758 -146 -3706 -6257 -4786
4052d786L565M916l89j947k327k828J975l83j867M249J847K169J734J61j045k126
$$ -4786 -1221 3695 3306 1359 -968 -3796 -1821 -2204 -4071 178 2025 4194 5928 6089 5044 2918
4036B918j599m545l09K803k278K650j180k726N84J05o21L16K765M923M920n76
$$ 2918 1319 -3226 -3535 -732 -3010 -360 -1540 -4266 -3682 -3577 -4198 -3882 -1117 3806 8726 8150
4020H150l896l342j516o08J994l488N840N3m269k23R60j796L252M311M77m350
$$ 8150 4254 912 -604 -1212 782 -2706 3134 3187 -1082 -1305 -345 -2141 1111 5422 5899 1549
4004A549m49j417l593Q84M659K55m645O31j124m440m77L551P44o14J839J33l516
$$ 1549 1100 -317 -3910 -3026 1633 1888 -2757 -2126 -3250 -7690 -8167 -4616 -3872 -4486 -2647 -2514 -6030
3987f030n261L460M346j253o61N620R10l508M121J232m804o070j787J05m24L211
$$ -6030 -11291 -7831 -3485 -4738 -5399 221 1131 -2377 1744 2976 -1828 -7898 -9685 -9580 -10004 -6793
3971f793Q170j093L69j153n18l998l197k9p23p80N183j047k417P72Q6M894N460
$$ -6793 1377 284 653 -500 -1018 -5016 -8213 -8242 -8965 -9745 -4562 -5609 -8026 -7254 -7168 -2274 3186
3954C186l48p71l76j545k474j966J390k292k051L040P76o04K775k405N366k04
$$ 3186 2838 2067 1691 146 -2328 -4294 -2904 -5196 -7247 -4207 -3431 -4035 -1260 -3665 1701 1497
3938A497l232J869K31j480j330O197O55j710j948k520j177l575K565L181K717
$$ 1497 -1735 134 365 -1115 -2445 3752 4407 2697 749 -1771 -2948 -6523 -3958 -777 1940
3923A940o93n87K511J215N26m346k116J824K379O94k06j341l066o549P01L681
$$ 1940 1247 660 3171 4386 4912 566 -1550 274 2653 3347 3141 1800 -1266 -7815 -7114 -3433
3907c433K899k306j365J464j497R37L185R28j987j540j269j669k67P83K701L940
$$ -3433 -534 -2840 -4205 -2741 -4238 -3301 -116 812 -1175 -2715 -3984 -5653 -5920 -5137 -2436 1504
3891A504l357l365k826j372M008L775L693K420J375l184o27j279j815k44N424
$$ 1504 -1853 -5218 -8044 -9416 -5408 -1633 2060 4480 5855 2671 2044 765 -1050 -1294 4130
3876D130M467n677l939K96J247J023k753j718J86K582J17m146J317L544Q232j295
$$ 4130 8597 2920 -1019 -723 524 1547 -1206 -2924 -2738 -156 -39 -4185 -2868 676 8908 7613
3860G613j0205p32M773j211k780j272k649R30K249M44O39j541m12k579Q72p48
$$ 7613 -2592 -3324 1449 238 -2542 -3814 -6463 -5533 -3284 -2840 -2201 -3742 -4154 -6733 -5861 -6609
3844f609m44J808L252L388j869l238p87P236K641q720j136K641J410m76m241k288
$$ -6609 -7053 -5245 -1993 1395 -474 -3712 -4499 2737 5378 -3342 -4478 -1837 -427 -903 -5144 -7432
3828g432K267K748J512k607k934n92k788L39M355K070O22K94o76J286J758K80
$$ -7432 -5165 -2417 -905 -3512 -6446 -7038 -9826 -9487 -5132 -3062 -2440 -2146 -2822 -1536 222 502
3812E02R44J966k232k407n246K539L053M362K128j488j909j883O34j178k771J00
$$ 502 1446 3412 1180 -1227 -6473 -3934 -881 3481 5609 4121 2212 329 963 -215 -2986 -2886
3796b886J704J372J433K672j645J664K195m379k142n134l619M692J375M751L801
$$ -2886 -1182 190 1623 4295 2650 4314 6509 2130 -12 -5146 -8765 -4073 -2698 2053 5854
3781E854o86o302m280L902P287M496l356n994q48j215j444M44O044L772p676J981
$$ 5854 5168 -1134 -5414 -1512 5775 10271 6915 921 73 -1142 -2586 -2142 3902 7674 -2 1979
3765A979M067n471m980q95J572N765K144N96o250l750K388M738k127j545k704
$$ 1979 6046 575 -4405 -5300 -3728 2037 4181 4777 -1473 -5223 -2835 1903 -224 -1769 -4473
3750d473L337o6m6Q66l935k968L490L42J680K802j856m127R66L389L941k031l618
$$ -4473 -1136 -1202 -1248 -382 -4317 -7285 -3795 -3453 -1773 1029 -827 -4954 -3988 -599 3342 1311 -2307
3733b307j300J028K071m80R11K898M066K560p17o642k947M9m49J095M048k105
$$ -2307 -3607 -2579 -508 -988 -77 2821 6887 9447 8730 2088 -859 -810 -1259 -164 3884 1779
3717A779k074m674O09O65M433l48j849L465L90K81m156M15L79J076J149m634p349
$$ 1779 -295 -4969 -4360 -3695 738 390 -1459 2006 2396 2677 -1479 -1064 -685 391 1540 -3094 -10443
3700a0443N166P371P026O402j995l075m040n216m400L504n91k626k080K359L914
$$ -10443 -5277 2094 9120 15522 13527 10452 6412 1196 -3204 300 -291 -2917 -4997 -2638 1276
3685A276R10j120l453K028q70J568K043J231j0n550j077k489l740J276L116m315
$$ 1276 2186 1066 -2387 -359 -1229 339 2382 3613 3603 -1947 -3024 -5513 -9253 -7977 -4861 -9176
3669i176j219L243N615j581J155J539j64r08j33J369K251O79o40m661k565J407
$$ -9176 -10395 -7152 -1537 -3118 -1963 -424 -588 -1496 -1629 -260 1991 2670 2030 -2631 -5196 -3789
3653c789J780P070O45m185Q14J767p82J640k378m744K894J708O98j063k569m339
$$ -3789 -2009 5061 5706 1521 2335 4102 3320 4960 2582 -2162 732 2440 3138 2075 -494 -4833
3637d833L412N875M562M447m357l570l81n67j455j377j578K532p30L362M51K12
$$ -4833 -1421 4454 9016 13463 9106 5536 5155 4588 3133 1756 178 2710 1980 5342 5793 6005
3621F005O65l871k436L977R254m700l489J120n578j052l146q11K434P0J091j415
$$ 6005 6670 2799 363 4340 13594 8894 5405 6525 947 -105 -3251 -4062 -1628 -1558 -467 -1882
3605a882J518L227j395R59J907Q76l320o645k392N9L314N227q86j753k72K837
$$ -1882 -364 2863 1468 2427 4334 5210 1890 -4755 -7147 -7088 -3774 1453 567 -1186 -1458 1379
3589A379j104m39m609j036K263j023n19K562R48J524J666j777j726N340l88l096
$$ 1379 275 -164 -4773 -5809 -3546 -4569 -5088 -2526 -1578 -54 1612 -165 -1891 3449 3061 -35
3573c5l471Q01j967j439Q38M112J124l813K02J111K221Q69N53j426k12M051r08
$$ -35 -3506 -2705 -4672 -6111 -5273 -1161 -37 -3850 -3648 -2537 -316 553 1106 -320 -532 3519 2611
3556B611l924l135J763K126j905P27M420J785j740k379N09J487J695J086k898
$$ 2611 -1313 -4448 -2685 -559 -2464 -1737 2683 4468 2728 349 858 2345 4040 5126 2228
3541B228o063j997O452M305n961k725N671Q75l428l163j469J151K038j11m718
$$ 2228 -3835 -5832 620 4925 -1036 -3761 1910 2785 -643 -3806 -5275 -4124 -2086 -2197 -6915
3526f915K790M52p76n81J295N230J241q55k397j865l140l097l403k172K65k006
$$ -6915 -4125 -3673 -4449 -5030 -3735 1495 2736 1881 -516 -2381 -5521 -8618 -12021 -14193 -13928 -15934
3510a5934N344N666M60m987j651P594L782q277l579J787L663M335j391j288m22
$$ -15934 -10590 -4924 -4464 -9451 -11102 -3508 274 -8003 -11582 -9795 -6132 -1797 -3188 -4476 -4898
3495d898M838j040L444Q50q62l2p742k557L771K822k851R76J511l382R12K212
$$ -4898 -60 -1100 2344 3194 2332 2300 -5442 -7999 -4228 -1406 -4257 -3281 -1770 -5152 -4240 -2028
3479b028L733K108r0m895J204k860j977m954J852L390k329l475j478N864J1806
$$ -2028 1705 3813 3723 -1172 32 -2828 -4805 -9759 -7907 -4517 -6846 -10321 -11799 -5935 5871
3464E871L899l981r28l600l260j522N67J752k117l531K935M992k041J586q43k496
$$ 5871 9770 5789 4861 1261 -1999 -3521 -2954 -1202 -3319 -6850 -3915 1077 -964 622 -221 -2717
3448b717L445Q08L396l835n338O774L374l815l098j047J48p08L302k613j182N230
$$ -2717 728 1536 4932 1097 -4241 2533 5907 2092 -1006 -2053 -1905 -2613 689 -1924 -3106 2124
3432B124J762P47k718n599J909J836K981M497j881o651l892N10n155L541K266
$$ 2124 3886 4633 1915 -3684 -1775 61 3042 7539 5658 -993 -4885 -4375 -9530 -5989 -3723
3417c723L723K094j867l73k89k021K50J836J042j103k004k996L038L057m612O
$$ -3723 0 2094 227 -146 -435 -2456 -2206 -370 672 -431 -2435 -5431 -2393 664 -3948 -3942
3401c942q1N89j115o29P39J27M175L015J165OQ88k739l060j099J568P59o835J354
$$ -3942 -4023 -3434 -4549 -5178 -4439 -4312 -137 2878 4043 4049 4937 2198 -862 -1961 -393 366 -6469 -5115
3383e115K570K910J979J947k56j803m176k245N166K083k719l089j356K02o05o4
$$ -5115 -2545 365 2344 4291 4035 2232 -1944 -4189 977 3060 341 -2748 -4104 -3902 -4507 -4571
3367d571K060j176m87L306K604L01O97j639o31L479J362q088P53J863K343L480
$$ -4571 -2511 -3687 -4174 -868 1736 2037 2734 1095 464 3943 5305 -2783 -2030 -167 2176 5656
3351E656j981n308k344L814k93l549L692J890o944M708M537l002J917m314m686
$$ 5656 3675 -1633 -3977 -163 -456 -4005 -313 1577 -5367 -659 3878 876 2793 -1521 -6207
$$ [...]
##END NTUPLES=NMR SPECTRUM
##END=
