##TITLE=Analysis number 307378
Compound Code tl 00238
Book Reference 281/199
Project Code qc-cat
Chemist Name antons
##JCAMPDX= 6.0         $$ Bruker NMR JCAMP-DX V2.0
##DATA TYPE= NMR SPECTRUM
##DATA CLASS= NTUPLES
##ORIGIN= Bruker BioSpin GmbH
##OWNER= NMR
$$ XWIN-NMR		Version 3.5
$$ Thu Apr 28 14:40:01 2005 GMT Daylight Time (UT+1h)  MAYBRIDGE\NMR@NMR_250MHZ
##.OBSERVE FREQUENCY= 250.131544655141
##.OBSERVE NUCLEUS= ^1H
##.ACQUISITION MODE= SIMULTANEOUS (DQD)
##.ACQUISITION SCHEME= undefined
##.AVERAGES= 16
##.DIGITISER RES= 18
##SPECTROMETER/DATA SYSTEM= dpx250
##.PULSE SEQUENCE= zg30
##.SOLVENT NAME= DMSO
##.SHIFT REFERENCE= (INTERNAL, DMSO, 0, 16.522)
##AUDIT TRAIL= $$ (NUMBER, WHEN, WHO, WHERE, WHAT)
$$ ##TITLE= Audit trail, XWIN-NMR		Version 3.5
$$ ##JCAMPDX= 5.01
$$ ##ORIGIN= Bruker BioSpin GmbH
$$ ##OWNER= NMR
$$ C:\u/data/dgb/nmr/ADRS/2500/pdata/1/auditp.txt
$$ ##AUDIT TRAIL=  $$ (NUMBER, WHEN, WHO, WHERE, WHAT)
(   1,<2005-04-28 14:39:28.26 +100>,<MAYBRIDGE\NMR>,<NMR_250MHZ>,
      <created by zg, POWCHK disabled, PULCHK disabled
       configuration hash MD5:
       62 19 C7 07 E1 42 D1 B7 37 6C 3D D0 77 39 F9 E6
       data hash MD5: 64K
       46 4D 71 ED 7B 8F 53 8F AA C5 94 51 03 41 4B B4>)
(   2,<2005-04-28 14:39:43.84 +100>,<MAYBRIDGE\NMR>,<NMR_250MHZ>,
      <Start of raw data processing
       ef LB = 0.3 FT_mod = 6 PKNL = 1 SI = 32K 
       data hash MD5: 32K
       B1 8F 47 74 DC 25 01 6A 79 EE D1 D7 1D F2 6A 69>)
(   3,<2005-04-28 14:39:48.46 +100>,<MAYBRIDGE\NMR>,<NMR_250MHZ>,
      <apk 
       data hash MD5: 32K
       86 BC 56 AB BF 75 96 8E 88 7F 39 97 A6 89 9C 8C>)
(   4,<2005-04-28 14:39:49.99 +100>,<MAYBRIDGE\NMR>,<NMR_250MHZ>,
      <abs ABSG = 5 
       data hash MD5: 32K
       57 FB B2 00 15 B9 04 58 CD E6 0C 3A AC 9A 55 55>)
$$ ##END=
$$ 
$$ hash MD5
$$ 37 39 B6 A9 63 6C FD BD AB D1 96 09 FF 33 DB 4F
##$RELAX= 
##$RELAX= 
##$RELAX= 
##$RELAX= 
##$RELAX= 
##$RELAX= 
##$RELAX= 
$$ Bruker specific parameters
$$ --------------------------
##$DU= <C:\u>
##$EXPNO= 2500
##$NAME= <ADRS>
##$PROCNO= 1
##$TYPE= <nmr>
##$USER= <dgb>
##$AMP= (0..31)
100 100 100 100 100 100 100 100 100 100 100 100 100 100 100 100 100 100 
100 100 100 100 100 100 100 100 100 100 100 100 100 100 
##$AQSEQ= 0
##$AQ_mod= 3
##$AUNM= <au_zg>
##$AUTOPOS= <44 >
##$BF1= 250.13
##$BF2= 250.13
##$BF3= 250.13
##$BF4= 250.13
##$BF5= 500.13
##$BF6= 500.13
##$BF7= 500.13
##$BF8= 500.13
##$BYTORDA= 1
##$CFDGTYP= 0
##$CFRGTYP= 5
##$CHEMSTR= <none>
##$CNST= (0..31)
1 1 145 1 1 1 1 1 1 1 1 1 1 1 1 1 1 1 1 1 1 1 1 1 1 1 1 1 1 1 1 1 
##$CPDPRG= <>
##$CPDPRG1= <>
##$CPDPRG2= <>
##$CPDPRG3= <>
##$CPDPRG4= <mlev>
##$CPDPRG5= <mlev>
##$CPDPRG6= <mlev>
##$CPDPRG7= <mlev>
##$CPDPRG8= <mlev>
##$CPDPRGB= <>
##$CPDPRGT= <>
##$D= (0..31)
0 1 0 0 0 0 0 0 0 0.06 0 0 0 0 0 0 0.0002 0 0 0 0 0 0 0 0 0 0 0 0 0 0 
0 
##$DATE= 1114695567
##$DBL= (0..7)
120 120 120 120 120 120 120 120 
##$DBP= (0..7)
150 150 150 150 150 150 150 150 
##$DBP07= 0
##$DBPNAM0= <>
##$DBPNAM1= <>
$$ [...]
##$SUBNAM7= <"">
##$SUBNAM8= <"">
##$SUBNAM9= <"">
##$SW= 20.6930455092707
##$SWIBOX= (0..15)
0 0 3 0 0 0 0 0 0 0 0 0 0 0 0 0 
##$SW_h= 5175.983436853
##$TD= 65536
##$TD0= 1
##$TE= 296.16
##$TE2= 300
##$TE3= 300
##$TEG= 300
##$TL= (0..7)
0 120 120 120 120 120 120 120 
##$TP= (0..7)
150 150 150 150 150 150 150 150 
##$TP07= 0
##$TPNAME0= <>
##$TPNAME1= <>
##$TPNAME2= <>
##$TPNAME3= <>
##$TPNAME4= <>
##$TPNAME5= <>
##$TPNAME6= <>
##$TPNAME7= <>
##$TPOAL= (0..7)
0.5 0.5 0.5 0.5 0.5 0.5 0.5 0.5 
##$TPOFFS= (0..7)
0 0 0 0 0 0 0 0 
##$TUNHIN= 0
##$TUNHOUT= 0
##$TUNXOUT= 0
##$USERA1= <user>
##$USERA2= <user>
##$USERA3= <user>
##$USERA4= <user>
##$USERA5= <user>
##$V9= 5
##$VALIST= <valist>
##$VCLIST= <CCCCCCCCCCCCCCC>
##$VD= 0
##$VDLIST= <DDDDDDDDDDDDDDD>
##$VPLIST= <PPPPPPPPPPPPPPP>
##$VTLIST= <TTTTTTTTTTTTTTT>
##$WBST= 1024
##$WBSW= 4
##$XGAIN= (0..3)
0 0 0 0 
##$XL= 0
##$YL= 0
##$YMAX_a= 322560
##$YMIN_a= -259019
##$ZGOPTNS= <>
##$ZL1= 120
##$ZL2= 120
##$ZL3= 120
##$ZL4= 120
##$ABSF1= 16.522
##$ABSF2= -4.171173
##$ABSG= 5
##$ABSL= 3
##$ALPHA= 0
##$AQORDER= 0
##$ASSFAC= 0
##$ASSFACI= 0
##$ASSFACX= 0
##$ASSWID= 0
##$AUNMP= <proc_1d>
##$AZFE= 0.1
##$AZFW= 0.1
##$BCFW= 0
##$BC_mod= 0
##$BYTORDP= 0
##$COROFFS= 0
##$CY= 12.5
##$DATMOD= 1
##$DC= 0
##$DFILT= <>
##$DTYPP= 0
##$F1P= 14.0000005364418
##$F2P= -0.99999901652339
##$FCOR= 0.5
##$FTSIZE= 32768
##$FT_mod= 6
##$GAMMA= 0
##$GB= 0
##$INTBC= 1
##$INTSCL= 1
##$ISEN= 128
##$LB= 0.3
##$LEV0= 0
##$LPBIN= 0
##$MAXI= 10000
##$MC2= 0
##$MEAN= 0
##$ME_mod= 0
##$MI= 0
##$NCOEF= 0
##$NC_proc= -6
##$NLEV= 6
##$NOISF1= 0
##$NOISF2= 0
##$NSP= 0
##$NTH_PI= 0
##$NZP= 0
##$OFFSET= 16.522
##$PC= 1
##$PHC0= -81.81522
##$PHC1= 3.808434
##$PH_mod= 1
##$PKNL= yes
##$PPARMOD= 0
##$PSCAL= 4
##$PSIGN= 0
##$REVERSE= no
##$SF= 250.13
##$SI= 32768
##$SIGF1= 0
##$SIGF2= 0
##$SINO= 400
##$SIOLD= 32768
##$SREGLST= <1H.DMSO>
##$SSB= 0
##$STSI= 32768
##$STSR= 0
##$SW_p= 5175.98343685301
##$SYMM= 0
##$S_DEV= 0
##$TDeff= 65536
##$TDoff= 0
##$TI= <Analysis number 999999
Compound Code 99
Book Reference 9
Project Code 9>
##$TILT= no
##$TM1= 0
##$TM2= 0
##$TOPLEV= 0
##$USERP1= <user>
##$USERP2= <user>
##$USERP3= <user>
##$USERP4= <user>
##$USERP5= <user>
##$WDW= 1
##$XDIM= 32768
##$YMAX_p= 319775454
##$YMIN_p= -1019034
$$ End of Bruker specific parameters
$$ ---------------------------------
##NTUPLES= NMR SPECTRUM
##VAR_NAME=  FREQUENCY,     SPECTRUM/REAL,   SPECTRUM/IMAG
##SYMBOL=    X,             R,               I
##VAR_TYPE=  INDEPENDENT,   DEPENDENT,       DEPENDENT
##VAR_FORM=  AFFN,          ASDF,            ASDF
##VAR_DIM=   32768,         32768,           32768
##UNITS=     HZ,            ARBITRARY UNITS, ARBITRARY UNITS
##FACTOR=    0.157963299565203, 1,           1
##FIRST=     4132.6476996994, 0,             0
##LAST=      -1043.33573715361, 0,           0
##MIN=       -1043.33573715361, -1019034,    0
##MAX=       4132.6476996994, 319775454,     0
$$ Real data points
##PAGE= N=1
##DATA TABLE= (X++(R..R)), XYDATA
$$ [...]
$$ plain form
23591 341279 406730 107660 31362 368 82037 248395 315663 295293 294218 327794 297416
23580 297416 240331 187628 95834 51686 4829 222051 528570 523246 397984 305812 308462
23569 308462 386591 403918 475603 548939 188568 262073 71825 38980 37 444221 460979
23558 460979 455475 653066 624937 390601 206500 -173304 -83443 286568 459106 371971
23548 371971 312793 268360 126868 21335 93562 163297 145521 272657 409965 516164
23538 516164 423602 461110 530286 265241 392955 448085 426017 532108 398422 307134 100205
23527 100205 88552 405341 579169 388574 365599 383730 476062 644374 669461 626430 273285
23516 273285 399432 574673 338031 358226 332912 104284 204765 143819 -34050 -43835
$$ packed form
23591C41279O5451k99070p6298l0994Q1669J66358O7268k0370j075L3576l0378
23580B97416n7085n2703r1794m4148m6857K17222L06519n324j25262r2172K650
23569C08462P8129J7327P1685P3336l60371P3505j90248l2845l8943M44184J6758
23558D60979n504J97591k8129k34336j84101l79804Q9861L70011J72538q7135
23548C71971n9178m4433j41492j05533P2227O9735j7776J27136J37308J06199
23538E16164r2562L7508O9176k65045J27714N5130k2068J06091j33686r1288k06929
23527A00205j1653L16789J73828j90595k2975J8131R2332J68312K5087m3031l53145
23516B73285J26147J75241k36642K0195k5314k28628J00481o0946j77869r785
$$ plain form
23506 -43835 2613 96084 157554 405176 658209 732788 662000 580510 368965 36166 -42533
23495 -42533 159188 246776 468474 446350 201271 131397 168981 187730 318998 257150 226343
23484 226343 326921 274787 19680 -31064 138281 513002 640814 461326 242327 179330
23474 179330 301139 543136 487386 462139 335120 281635 567434 892429 895152 583809
23464 583809 618016 677121 577942 350422 271164 278369 618656 465618 183391 -62419 119171
23453 119171 409126 819997 769687 495903 311828 154103 142408 201406 339395 438576
23443 438576 588755 542707 630454 513486 505841 462591 331605 421594 320619 211402 275397
23432 275397 252554 545906 662052 442678 538917 383444 112638 174286 249198 156891
$$ packed form
23506d3835M6448R3471O1470K47622K53033P4579p0788q1490k11545l32799p8699
23495d2533K01721Q7588K21698k2124k45079o9874L7584J8749J31268o1848l0807
23484B26343J00578n2134k55107n0744J69345L74721J27812j79488k18999o2997
23474A79330J21809K41997n5750k5247j27019n3485K85799L24995K723l11343
23464E83809L4207N9105r9179k27520p9258P205L40287j53038k82227k45810J81590
23453A19171K89955M10871n0310k73784j84075j57725j1695N8998J37989R9181
23443D38576J50179m6048Q7747j16968p645m3250j30986Q9989j00975j09217O3995
23432B75397k2843K93352J16146k19374R6239j55473k70806O1648P4912r2307
$$ plain form
23422 156891 282716 238512 67351 195827 279026 231093 338060 314102 587922 731674
23412 731674 292131 141807 260201 238970 328759 519421 704736 470695 523043 541066
23402 541066 617389 537925 411438 352110 362086 396771 488415 480523 414355 322551 178566
23391 178566 117854 410012 369253 293213 486787 561566 518864 447086 345410 350064 468489
23380 468489 148695 -64512 -10162 46854 172071 411887 809966 895111 499886 531028
23370 531028 410554 322779 422715 283263 197702 263254 379232 631018 659855 507009
23360 507009 47722 -47495 143747 43610 141985 354488 261084 -83497 -187453 -54891
23350 -54891 -68207 40708 111875 79802 94056 212733 337953 573820 500012 234893 316443
$$ packed form
23422A56891J25825m4204j71161J28476Q3199m7933J06967k3958K73820J43752
23412G31674m39543j50324J18394k1231Q9789J90662J85315k34041N2348J8023
23402E41066P6323p9464j26487n9328R976L4685R1644p892o6168r1804j43985
23391A78566o0712K92158m0759p6040J93574P4779m2702p1778j01676M654J18425
23380D68489l19794k13207N4350N7016J25217K39816L98079Q5145l95225L1142
23370E31028j20474q7775R9936j39452q5561O5552J15978K51786K8837j52846
23360E07009m59287r5217J91242j00137R8375K12503r3404l44581j03956J32562
23350e4891j3316J08915P1167l2073J4254J18677J25220K35867p3808k65119Q1550
$$ plain form
23339 316443 388905 387474 518727 642463 809552 663021 573662 577370 647356 633102 386328
23328 386328 177729 81445 -34258 135296 420560 540210 479513 240511 281848 406265
23318 406265 324827 225843 169932 238236 66716 165286 274638 198709 134424 20530 271023
23307 271023 439249 204257 180618 335410 330741 194183 175737 155000 67547 -28057 16124
23296 16124 293161 299267 251012 -133452 -36987 226586 516421 586198 360820 287240 339298
23285 339298 395513 390977 493923 610178 522236 451417 512578 474292 489365 301122 113261
23274 113261 31448 179579 413554 390218 181296 257229 156583 288818 324654 596935
23264 596935 724309 685254 723094 500239 442792 129039 296204 556189 534411 213707
$$ packed form
23339C16443P2462j431J31253J23736J67089j46531q9359L708O9986j4254k46774
23328C86328k08599r6284j15703J69554K85264J19650o0697k39002M1337J24417
23318D06265q1438r8984n5911O8304j71520R8570J09352p5929o4285j13894K50493
23307B71023J68226k34992k3639J54792m669j36558j8446k0737q7453r5604M4181
23296A6124K77037O106m8255l84464R6465K63573K89835O9777k25378p3580N2058
23285C39298N6215m536J02946J16255q7942p0819O1161l8286J5073j88243j87861
23274A13261q1813J48131K33975k3336k08922P5933j00646J32235L5836K72281
23264E96935J27374l9055L7840k22855n7447l13753J67165K59985k1778l20704
$$ plain form
23254 213707 149365 173244 86783 -169963 102358 520980 552577 371736 512080 575197
23244 575197 372295 152160 46145 -91066 -146900 -37805 -211677 -133262 46089 14551
23234 14551 -92780 139523 374736 448830 173508 223098 170304 55114 63697 335343 357724
23223 357724 462681 558294 450196 241417 235821 294518 534011 720337 808368 724760 544909
23212 544909 502451 494793 471630 547893 392805 70636 15785 70855 -11314 -20281 197228
23201 197228 252645 199244 137229 545217 871024 567556 450331 508690 564869 532602 556807
23190 556807 568741 392475 192619 -81665 -99497 -21049 102853 -248042 -213951 -177022
23180 -177022 -229842 -137906 187715 342338 166688 267816 89335 -176389 109680 430569
$$ packed form
23254B13707o4342K3879q6461k56746K72321M18622L1597j80841J40344O3117
23244E75197k02902k20135j06015j37211n5834J09095j73872P8415J79351l1538
23234A4551j07331K32303K35213P4094k75322M9590n2794j15190Q583K71646K2381
23223C57724J04957R5613j08098k08779n596N8697K39493J86326Q8031q3608j79851
23212E44909m2458p658k3163P6263j55088l22169n4851N5070q2169q967K17509
23201A97228N5417n3401o2015M07988L25807l03468j17225N8359N6179l2267K4205
23190E56807J1934j76266j99856k74284j7832P8448J23902l50895L4091L6929
23180a77022n2820R1936L25621J54623j75650J01128j78481k65724K86069L20889
$$ plain form
23170 430569 417667 371263 279659 272465 438992 348489 257011 382908 321411 139304 -126245
23159 -126245 -174723 -85052 -129181 -194007 -38699 26927 -33830 -79838 -103402 123968 124199
23148 124199 -179085 -304260 -160338 159850 82390 -123770 -400268 -353239 -97526 88625
23138 88625 -12905 122773 345354 329761 205195 299674 502675 473217 470342 479912 313408
23127 313408 353326 452436 110602 24717 47974 95011 61228 257403 185400 57174 93335
23116 93335 114495 160001 133917 68492 268464 326149 163533 178655 -41654 -91781 -46994
23105 -46994 -115488 -42993 -233545 -231406 -223910 -151138 14738 52081 -30395 64853 90249 115750
23093 115750 132579 145928 477476 400198 169075 69545 -13356 -155364 -343824 -256844 -123333
$$ packed form
23170D30569j2902m6404r1604p194J66527r0503r1478J25897o1497j82107k65549
23159a26245m8478Q9671m4129o4826J55308O5626o0757m6008k3564K27370K31
23148A24199l03284j25175J43922L20188p7460k06160k76498M7029K55713J86151
23138H8625j01530J35678K22581j5593j24566R4479K03001k9458k875R570j66504
23127C13408L9918R9110l41834q5885K3257M7037l3783J96175p2003j28226L6161
23116I3335K1160M5506k6084o5425J99972N7685j62616J5122k20309n0127M4787
23105d6994o8494P2495j90552K139P496P2772J65876L7343q2476R5248K5396K5501
23093A15750J6829J3349L31548p7278k31123r9530q2901j42008j88460Q6980J33511
$$ plain form
23082 -123333 114738 230049 142378 79172 75809 213612 293629 448603 309715 295470 448742
23071 448742 478736 328343 222562 156579 181497 93972 3182 219034 -31732 -304324
23061 -304324 -259589 -159782 91590 186033 -110349 -88485 -6975 -51854 26801 -156813 -91472
23050 -91472 -59791 -139303 -145660 63514 69732 145368 101179 -790 -92979 53720 242739
23039 242739 231621 287822 20513 -225641 -449791 -473294 -233680 -74708 29215 -77599
23029 -77599 -85990 101321 447997 190382 -44625 203663 392064 301164 330115 437363
23019 437363 496957 260629 175221 117201 -97590 -345874 -231665 -132167 -124237 -62067 146775
23008 146775 178949 15001 148301 246868 175922 375096 235368 170990 221353 33059
$$ packed form
23082a23333K38071J15311q7671o3206l363J37803Q0017J54974j38888j4245J53272
23071D48742K9994j50393j05781o5983K4918q7525r0790K15852k50766k72592
23061c04324M4735R9807K51372R4443k96382K1864Q1510m4879P8655j83614O5341
23050i1472L1681p9512o357K09174O218P5636m4189j01969r2189J46699J89019
23039B42739j1118N6201k67309k46154k24150k3503K39614J58972J03923j06814
23029g7599q391J87311L46676k57615k35007K48288J88401r0900K8951J07248
23019D37363N9594k36328q5408n8020k14791k48284J14209R9498P930O2170K08842
23008A46775L2174j63948J33300R8567p0946J99174j39728o4378N0363j88294
$$ plain form
22998 33059 -265022 -436444 -284613 -138152 -185006 -72336 -11666 318544 358601 185214
22988 185214 91927 -13656 -141850 -61873 -89494 -38193 172964 201961 43027 -108144
22978 -108144 -211151 -115963 67000 -35377 -64117 -266724 -241085 -466427 -298955 -188090
22968 -188090 -17384 -115118 -348054 -256933 -75961 -72747 16626 87438 -43116 -71422 129141
22957 129141 77552 66631 255858 13252 18911 38784 174809 238146 125749 -61256 80274
22946 80274 252243 55758 53652 -36531 199289 342567 209103 98612 185709 534864
22936 534864 399774 262218 -25203 -204631 -186050 21195 130408 14344 37461 -192719
22926 -192719 -118480 -100037 207969 119002 -173244 -185915 -186568 -116608 64317 -180782 -658761
$$ packed form
22998C3059k98081j71422J51831J46461m6854J12670O0670L30210M0057j73387
22988A85214r3287j05583j28194P9977k7621N1301K11157K8997j58934j51171
22978a08144j03007R5188J82963j02377k8740k02607K5639k25342J67472J10865
22968a88090J70706r7734k32936R1121J80972L214Q9373P0812j30554k8306K00563
22957A29141n1589j0921J89227k42606N659J9873J36025O3337j12397j87005J41530
22946H0274J71969j96485k106r0183K35820J43278j33464j10491Q7097L49155
22936E34864j35090j37556k87421j79428J8581K07245J09213j16064K3117k30180
22926a92719P4239J8443L08006q8967k92246j2671o53O9960J80925k45099m77979
$$ plain form
22915 -658761 -602128 -102684 242930 201542 224171 162929 45349 -213137 -449511 -436333
22905 -436333 -549502 -246003 -227047 -120212 25018 -62776 -76804 -148518 -134221 -272878
22895 -272878 -419589 -420170 -59987 185241 160186 119882 68601 233512 82821 -110294 -52323
22884 -52323 -248660 -348159 -275733 -44285 -61899 -223400 -275434 -231606 -344824 -285458 -199794
22873 -199794 -222043 -353311 -58417 -32656 -594643 -710923 -611229 -474192 -249515 -264080
22863 -264080 -194765 -38353 30514 52423 88636 76057 64428 39013 -320290 -505464 -328389
22852 -328389 -293665 -188632 -307870 -274742 -220892 -216091 -252313 94817 286563 192643 8215
22841 8215 36610 68760 43857 142314 134728 129312 -19485 -321139 -365012 -207133 -73828
$$ packed form
22915f58761N6633M99444L45614m1388K2629o1242j17580k58486k36374J3178
22905d36333j13169L03499J8956J06835J45230q7794j4028p1714J4297j38657
22895b72878j46711n81L60183K45228k5055m0304n1281J64911j50691j93115N7971
22884e2323j96337r9499P2426K31448j7614j61501n2034M3828j13218N9366Q5664
22873a99794k2249j31268K94894K5761n61987j16280R9694J37037K24677j4565
22863b64080O9315J56412O8867K1909L6213j2579j1629k5415l59303j85174J77075
22852c28389L4724J05033j19238L3128N3850M801l6222L47130J91746r3920j84428
22841H215K8395L2150k4903R8457p586n416j48797l01654m3873J57879J33305
$$ plain form
22830 -73828 144368 251247 306271 135244 109684 130168 30731 117698 183595 69184 -92191
22819 -92191 -100451 5959 -183413 -55091 -20570 -194865 156870 287371 140548 45252
22809 45252 30049 -107424 35025 444398 711999 704305 523919 121022 -23557 86279
22799 86279 560 1421 -17925 -32406 57604 -89875 -226850 -140586 169386 99511 -122373
22788 -122373 -218637 -328912 -102247 -96658 -224120 -232625 -512529 -213706 -9939 36289 141504
22777 141504 -36238 -98499 -100526 -125434 -246269 -390256 -421144 -148634 -172261 -109850 -58848
22766 -58848 72019 -18457 -52464 -51044 6223 277939 346887 440962 586850 486534 431470
22755 431470 486773 309023 76916 -208880 -274453 -116503 -49417 -221452 -289686 -287763 10443
$$ packed form
22830g3828K18196J06879N5024j71027k5560K0484r9437Q6967O5897j14411j61375
22819i2191q260J06410j89372J28322L4521j74295L51735J30501j46823r5296
22809D5252j5203j37473J42449M09373K67601p694j80386m02897j44579J09836
22799H6279q5719Q61j9346j4481R0010j47479j36975Q6264L09972o9875k21884
22788a22373r6264j10275K26665N589j27462q505k79904K98823K03767M6228J05215
22777A41504j77742o2261k027k4908j20835j43987l0888K72510k3627O2411N1002
22766e8848J30867r0476l4007J420N7267K71716O8948R4075J45888j00316n5064
22755D31470N5303j77750k32107k85796o5573J57950O7086j72035o8234J923K98206
$$ plain form
22744 10443 260856 226576 326955 203770 83313 108663 3944 -38665 3462 -137771
22734 -137771 -117966 7038 51450 161076 171494 156695 43391 96502 263149 328721 257719
22723 257719 188217 10320 -181195 -143686 42443 -8489 -168402 -173495 -41152 239750
22713 239750 101443 265063 339255 226736 311566 138803 26380 175479 312833 272214
22703 272214 403951 396387 154824 -80527 -47600 138339 99788 -56307 96065 142216
22693 142216 39717 -92193 103812 288005 230629 -146060 -246080 -177088 -319872 -611202
22683 -611202 -672189 -455630 -364082 -134566 -84528 -262915 -394076 -416861 -328728 -487527
22673 -487527 -382019 -170517 -190056 -234964 -376015 -470617 -456150 -357635 -283393 -156582 -93382
$$ packed form
22744A0443K50413l4280J00379j23185j20457K5350j04719m2609M2127j41233
22734a37771J9805J25004M4412J09626J0418j4799j13304N3111J66647O5572p1002
22723B57719o9502j77897j91515L7509J86129n0932j59913n093J32343K80902
22713B39750j38307J63620P4192j12519Q4830j72763j12423J49099J37354m0619
22703B72214J31737p564k41563k35351L2927J85939l8551j56095J52372M6151
22693A42216j02499j31910J96005J84193n7376l76689j00020O8992j42784k91330
22683f11202o0987K16559R1548K29516N0038j78387j31161k2785Q8133j58799
22673d87527J05508K11502j9539m4908j41051r4602J4467R8515P4242J26811O3200
$$ plain form
22662 -93382 -148613 -162654 -161710 -190536 -227082 -266456 -264245 -412278 -316203 -371450 -328061 -531701
22650 -531701 -437639 -247545 -245040 -264523 -370617 -331135 -204127 -22274 78505 27439 -201604
22639 -201604 -181356 -292985 -324518 -148289 51334 103176 52237 242213 330629 291194 274810
22628 274810 51536 118298 199303 19528 -161869 -65942 235378 233783 12939 54983 138850
22617 138850 209769 281183 299664 324475 292657 512115 335612 90575 210773 171848 45894
22606 45894 229729 130344 248867 119566 -272474 -249752 -170415 -338768 -339320 118048 356511
22595 356511 392736 177005 -109734 -128173 -62826 -115768 96055 150968 175332 -56990 -278446
22584 -278446 -126736 69027 248990 250973 116104 -106263 -153184 -56611 56029 -199457
$$ packed form
22662i3382n5231j4041R44k8826l6546l9374K211j48033R6075n5247M3389k03640
22650e31701R4062J90094K505j9483j06094L9482J27008J81853J00779n1066k29043
22639b01604K0248j11629l1533J76229J99623N1842n0939J89976Q8416l9435j6384
22628B74810k23274O6762Q1005j79775j81397R5927L01320j595k20844M2044Q3867
22617A38850P0919P1414J8481K4811l1818K19458j76503k45037J20198l8925j25954
22606D5894J83835r9385J18523j29301l92040K2722P9337j68353n52M57368K38463
22595C56511L6225k15731k86739j8439O5347n2942K11823N4913K4364k32322k21456
22584b78446J51710J95763J79963J983j34869k22367m6921R6573J12640k55486
$$ plain form
22574 -199457 -236514 -293669 -242805 -383902 -371735 -379412 -191777 3103 2718 67605 16088
22563 16088 -113038 -271872 -220698 -121822 -127315 27704 -93481 -31090 111940 106195 120572
22552 120572 261230 244859 -8498 -82168 -286492 -154672 -355318 -310056 -116261 -285312
22542 -285312 -348754 -534011 -507465 -358472 -245056 -69556 -281079 -388215 -411118 -205202
22532 -205202 -83787 -10480 -58857 -27078 -39972 -187830 -235149 -246570 -293109 -83600 -60158
22521 -60158 -163199 101469 -30984 -328352 -162700 -109872 -143858 -137503 44959 40159 -191822
22510 -191822 -249734 -276837 -262280 -110864 52614 3508 -68864 -187601 185798 215517 76594
22499 76594 102589 97971 -40816 -149543 -100226 -391571 -484652 -166457 -376455 -339745 -338554
$$ packed form
22574a99457l7057n7155N0864j41097J2167p677J87635J94880l85O4887n1517
22563A6088j29126j58834N1174R8876n493J55019j21185O2391J43030n745J4377
22552A20572J40658j6371k53357p3670k04324J31820k00646M5262J93795j69051
22542b85312o3442j85257K6546J48993J13416J75500k11523j07136k2903K05916
22532b05202J21415P3307m8377L1779j2894j47858m7319j1421m6539K09509K3442
22521f0158j03041K64668j32453k97368J65652N2828l3986O355J82462m800k31981
22510a91822n7912k7103J4557J51416J63478m9106p2372j18737L73399K9719j38923
22499G6594K5995m618j38787j08727M9317k91345r3081L18195k09998L6710J191
$$ plain form
22488 -338554 -435467 -613864 -751421 -487688 -383817 -422291 -147591 299371 151917 14526
22478 14526 77532 221737 -13179 -320930 -131093 166180 232396 201648 18557 -222522
22468 -222522 -400017 -315408 -10925 268477 509137 418513 406336 438222 339371 217110
22458 217110 278201 147031 -35289 -124917 -186683 -209943 -550154 -567942 -423398 -471453 -427889
22447 -427889 -195951 -21177 7065 -124630 -81059 -263394 -111738 30293 76450 110006
22437 110006 -44638 -205793 -284004 -461329 -541344 -478563 -299030 -168877 -111539 18388
22427 18388 -152967 -11954 -92446 -161997 20892 -144046 -201459 -115324 -187977 -414974 -561455
22416 -561455 -384470 -321234 -167146 -122401 -180855 -165457 -246277 -370957 -391805 -298321 -316708
$$ packed form
22488c38554r6913j78397j37557K63733J03871l8474K74700M46962j47454j37391
22478A4526O3006J44205k34916l07751J89837K97273O6216l0748j83091k41079
22468b22522j77495Q4609L04483K79402K40660r0624j2177L1886r8851j22261
22458B17110O1091j31170j82320q9628o1766k3260l40211j7788J44544m8055M3564
22447d27889K31938J74774K8242j31695M3571j82335J51656J42031M6157L3556
22437A10006j54644j61155p8211j77325q0015O2781J79533J30153N7338J29927
22427A8388j71355J41013q0492o9551J82889j64938n7413Q6135p2653k26997j46481
22416e61455J76985O3236J54088M4745n8454J5398q0820j24680k0848R3484j8387
$$ plain form
22405 -316708 -495210 -515527 -410174 -86386 -94361 -174391 -392907 -299275 -135662 -51982 -171710
22394 -171710 -221756 -65674 -40405 -79989 -121241 -164458 -89601 -209530 -344684 -359420 -179663
22383 -179663 -357774 -435476 -501241 -655062 -546675 -360683 -369265 -160772 -220097 -123708 -39121
22372 -39121 -257247 -457552 -312791 -170597 29408 -133121 -251590 -231054 -302671 -234752
22362 -234752 -34436 -44449 -78734 -66541 -70064 -233150 -262492 -289869 -225680 -213234 -147326
22351 -147326 22710 -142376 -287598 -89006 -11864 -248111 -496367 -286762 -36451 31379
22341 31379 -189876 -475087 -370656 -63944 111493 24214 64765 -23427 -134391 -226524
22331 -226524 -150351 241822 311777 1512 -327610 -392814 -411933 -319883 -137755 70019
$$ packed form
22405c16708j78502k0317J05353L23788p975q0030k18516R3632J63613Q3680j19728
22394a71710n0046J56082K5269l9584m1252m3217P4857j19929j35154j4736J79757
22383a79663j78111p7702o5765j53821J08387J85992q582K08493n9325R6389Q4587
22372c9121k18126k00305J44761J42194K00005j62529j18469K0536p1617O7919
22362b34752K00316j0013l4285J2193l523j63086k9342k7377O4189J2446O5908
22351a47326J70036j65086j45222J98592P7142k36247k48256K09605K50311O7830
22341C1379k21255k85211J04431L06712J75437q7279M0551q8192j10964r2133
22331b26524P6173L92173O9955l10265l29122o5204j9119R2050J82128K07774
$$ plain form
22321 70019 145635 71401 76099 -77409 -33313 30839 -10748 -140101 -178044 -172061 -86219 -44546
22309 -44546 -71118 -142717 -54020 26995 62223 137751 218172 298959 340827 333439 161540 -90018
22297 -90018 -5020 -43468 -224817 -131038 -154824 -130459 -229860 -212371 -14562 -308853 -360902
22286 -360902 68 -199836 -174296 -224796 1918 -95871 -382378 -472013 -203199 -71126
22276 -71126 -136132 -340952 -276337 -334669 -67277 -105669 -15087 150756 33440 -175385 -384061
22265 -384061 -670320 -716450 -638017 -475614 -204856 -259285 -313514 -391834 -286560 -160351
22255 -160351 115444 8350 -212717 -229580 -164835 -202619 -31008 -13122 -139948 7341
22245 7341 43869 61932 25659 215550 99626 -86605 -39754 -276002 -410018 -470176 -510662
$$ packed form
22321G0019P5616p4234M698j53508M4096O4152m1587j29353l7943N983Q5842M1673
22309d4546k6572p1599Q8697Q1015L5228P5528Q0421Q0787M1868p388j71899k51558
22297i0018Q4998l8448j81349R3779k3786K4365r9401J7489J97809k94291n2049
22286c60902L60970j99904K5540n0500K26714r7789k86507q9635K68814J32073
22276g1126o5006k04820O4615n8332K67392l8392R0582J65843j17316k08825k08676
22265c84061k86259m6130P8433J62403K70758n4429n4229p8320J05274J26209
22255a60351K75795j07094k21067j6863O4745l7784J71611J7886j26826J47289
22245G341L6528J8063l6273J89891j15924j86231M6851k36248j34016o0158m0486
$$ plain form
22234 -510662 -352295 -307011 -76546 97687 106939 111730 123055 213276 405775 100937 29214
22223 29214 293700 295511 153125 205588 -101706 -344867 -169445 -137756 -190991 -326340 -580994
22212 -580994 -642940 -350080 -180704 -144936 -95532 -220299 -154411 -230335 -356433 -361155 -377887
22201 -377887 -213084 -171472 -504856 -428120 -286379 -30606 84662 23881 -9066 -50246
22191 -50246 -128379 -336368 -76523 55350 26464 30242 175485 51287 -105123 -221361
22181 -221361 -243118 -144373 119554 187938 -253814 -266238 -231582 -235898 -142528 -20671 -68632
22170 -68632 -68916 -224552 -539246 -348584 -173687 -48228 -52806 -261909 -357499 -403212 -291715
22159 -291715 -156163 -231580 -105603 -143641 -350400 -272787 -501484 -648074 -351760 -62877
$$ packed form
22234e10662J58367M5284K30465J74233R252M791J1325R0221J92499l04838p1723
22223B9214K64486J811j42386N2463l07294k43161J75422L1689n3235j35349k54654
22212e80994o1946K92860J69376L5768M9404j24767O5888p5924j26098m722j6732
22201c77887J64803M1612l33384P6736J41741K55773J15268o0781l2947m1180
22191e0246p8133k07989K59845J31873k8886L778J45243j24198j56410j16238
22181b21361k1757R8745K63927O8384m41752j2424L4656m316R3370J21857m7961
22170f8632k84j55636l14694J90662J74897J25459m578k09103r5590m5713J11497
22159b91715J35552p5417J25977l8038k06759P7613k28697j46590K96314K88883
$$ plain form
22149 -62877 -44210 -39505 -54991 47567 -9386 226023 123874 -121793 -321442 -553899 -565444
22138 -565444 -479882 -256592 -286744 -212039 -239057 -240940 -416373 -512082 -533963 -648261 -381417
22127 -381417 -245166 33902 24775 -3901 -168541 106503 195449 -85723 -241060 -429995
22117 -429995 -154391 134369 278919 244452 15258 8122 152179 -32636 -247119 -372044
22107 -372044 -403009 -419322 -496787 -378091 -192088 -19717 2395 -175389 -355934 -297679
22097 -297679 -148424 -208761 -398081 -409780 -417564 -360669 -513906 -576824 -472997 -306030 -191403
22086 -191403 -231210 -178975 -192528 -169902 -142399 119047 30841 -395943 -433935 -282237 -241401
22075 -241401 -265384 -273663 -245280 -22987 306099 391078 224488 -212835 -390261 -411088 -204806
$$ packed form
22149f2877J8667M705j5486J02558n6953K35409j02149k45667j99649k32457j1545
22138e65444Q5562K23290l0152P4705k7018j883j75433r5709k1881j14298K66844
22127c81417J36251K79068r127k8676j64640K75044Q8946k81172j55337j88935
22117d29995K75604K88760J44550l4467k29194p136J44057j84815k14483j24925
22107c72044l0965j6313p7465J18696J86003J72371K2112j77784j80545N8255
22097b97679J49255o0337j89320j1699p784N6895j53237o2918J03827J66967J14627
22086a91403l9807N2235j3553K2626K7503K61446q8206m26784l7992J51698M0836
22075b41401k3983q279K8383K22293L29086Q4979j66590m37323j77426k0827K06282
$$ plain form
22064 -204806 -50293 -80680 -102353 -264448 -206668 -241335 -410460 -476180 -381310 -223774 -234975
22053 -234975 -190655 -138890 -230443 -183272 -409432 -171096 162204 138627 -126850 -414971
22043 -414971 -321677 -428783 -488745 -499650 -615392 -658659 -534190 -608055 -517230 -314996 20753
22032 20753 158120 70605 -47904 -14513 -149184 -501303 -628455 -524619 -436511 -256293
22022 -256293 -250658 -200215 -8640 55136 15807 95149 121567 351330 154388 -192817 -269834
22011 -269834 -150187 -194176 -281212 -89124 29435 -29659 -152670 -283061 -368910 -395156
22001 -395156 -386262 -370043 -386744 -481567 -362581 -247976 -97081 14570 -41366 -106361 -105614
21990 -105614 17871 331436 216668 122009 -47063 40142 69401 110858 162641 103962 162564
$$ packed form
22064b04806J54513l0387k1673j62095N7780l4667j69125o5720R4870J57536j1201
22053b34975M4320N1765r1553M7171k26160K38336L33300k3577k65477k88121
22043d14971R3294j07106n9962j0905j15742m3267J24469p3865R0825K02234L35749
22032B0753J37367q7515j18509L3391j34671l52119j27152J03836Q8108J80218
22022b56293N635N0443J91575O3776l9329P9342K6418K29763j96942l47205p7017
22011b69834J19647m3989q7036J92088J18559n9094j23011j30391q5849k6246
22001c95156Q894J6219j6701r4823J18986J14605J50895J11651n5936o4995P47
21990a05614J23485L13565j14768r4659j69072Q7205K9259M1457N1783n8679N8602
$$ plain form
21979 162564 64341 275360 167712 108794 107530 371629 458676 657956 576254 398839 205436
21968 205436 41487 85867 103196 139933 76384 47262 236422 435019 530106 715456 472918
21957 472918 356359 494401 371150 202426 45723 27586 50443 39671 -179159 -502747
21947 -502747 -711975 -538926 -519357 -319516 -33565 -27514 -152481 -238320 -444764 -681365
21937 -681365 -534730 -454003 -633823 -827957 -727562 -511499 -414985 -294252 -426475 -634018
21927 -634018 -609879 -390119 -120637 211511 321300 226105 248997 187064 195486 340119 16962
21916 16962 4276 93143 -177359 -240213 -369818 -226201 -507906 -620374 -514610 -515633 -527968
21905 -527968 -369651 -388280 -161638 -132817 -310604 -452603 -405376 -330496 -416127 -506406 -246876
$$ packed form
21979A62564r8223K11019j07648n8918j264K64099Q7047J99280q1702j77415j93403
21968B05436j63949M4380J7329L6737o3549k9122J89160J98597R5087J85350k42538
21957D72918j16559J38042j23251j68724j56703j8137K2857j0772k18830l23588
21947e02747k09228J73049J9569J99841K85951O051j24967q5839k06444k36601
21937f81365J46635Q0727j79820j94134J00395K16063R6514J20733j32223k07543
21927f34018K4139K19760K69482L32148J09789r5195K2892o1933Q422J44633l23157
21916A6962j2686Q8867k70502o2854j29605J43617k81705j12468J05764j023j2335
21905e27968J58317j8629K26642K8821j77787j41999M7227P4880q5631r0279K59530
$$ plain form
21894 -246876 -433618 -403942 -188093 -404324 -406773 -230121 -238848 -215330 -311333 -259327 -108974
21883 -108974 -156253 68719 179428 107214 -38168 -55799 -173848 -206511 -413172 -505542
21873 -505542 -480536 -253433 62444 -56249 -253573 -519470 -721833 -637335 -544783 -342798
21863 -342798 -398592 -290369 -245873 -505787 -588000 -749721 -589681 -442470 -556859 -651988
21853 -651988 -557436 -307432 -140010 111263 -28887 -23349 47725 -125767 -371821 -319290
21843 -319290 -367666 -494871 -468891 -227165 -164784 -369714 -586165 -501734 -225861 -31760
21833 -31760 -234174 -438341 -475085 -442019 -492986 -488137 -429882 -290480 -195634 11420 -280375
21822 -280375 -137907 -225693 -280880 -342596 -402162 -356403 -288598 -291394 -268776 -148679 -210011
$$ packed form
21894b46876j86742K9676K15849k16231k449J76652q727K3518r6003N2006J50353
21883a08974m7279K24972J10709p2214j45382j7631j18049l2663k06661r2370
21873e05542K5006K27103L15877j18693j97324k65897k02363Q4498R2552K01985
21863c42798n5794J08223M4496k59914q2213j61721J60040J47211j14389r5129
21853f51988R4552K50004J67422K51273j40150N538P1074j73492k46054N2531
21843c19290m8376j27205K5980K41726O2381k04930k16451Q4431K75873J94101
21833c1760k02414k04167l6744L3066n0967M849N8255J39402R4846K07054k91795
21822b80375J42468q7786n5187o1716n9566M5759O7805k796K2618J20097o1332
$$ plain form
21811 -210011 -471517 -678967 -588111 -538188 -429964 -285563 -185189 -214731 -268581 -229463
21801 -229463 77812 12647 -359969 -471341 -510891 -617618 -597742 -268439 -82962 50427
21791 50427 97633 209115 103934 -231052 -341604 -547934 -497104 -207260 -417944 -511655
21781 -511655 -600309 -671921 -511448 -301998 -11186 266408 240253 -16676 -48198 -181173
21771 -181173 -346928 -262626 128150 107939 -61377 -329210 -427723 -209320 -422445 -492101
21761 -492101 -404936 -540673 -647517 -751736 -680428 -327296 -6418 -93002 -494071 -397064
21751 -397064 -47346 4820 -16037 -106033 -265313 -141224 48875 203054 83673 -99571
21741 -99571 -187785 -47926 -135000 -154971 -283458 -441438 -388395 -175638 59202 95879 -98368
$$ packed form
21811b10011k61506k07450R0856M9923J08224J44401J00374k9542n3850L9118
21801b29463L07275o5165l72616j11372l9550j06727J9876L29303J85477J33389
21791E0427M7206J11482j05181l34986j10552k06330N0830K89844k10684r3711
21781e11655q8654p1612J60473K09450K90812K77594k6155k56929l1522j32975
21771a81173j65755Q4302L90776k0211j69316k67833r8513K18403k13125o9656
21761d92101Q7165j35737j06844j04219P1308L53132L20878q6584m01069R7007
21751c97064L49718N2166k0857q9996j59280J24089J90099J54179j19381j83244
21741i9571q8214J39859q7074j9971j28487j57980N3043K12757K34840L6677j94247
$$ plain form
21730 -98368 -195347 -269208 -60276 -46518 -326076 -436795 -602047 -478792 -444222 -418321 -339395
21719 -339395 -336918 -383564 -465509 -554422 -383752 -222946 -57266 175044 359584 99971
21709 99971 -162295 -387459 -514869 -399530 -396106 -414686 -321955 -468600 -529682 -480655 -325572
21698 -325572 -305829 3225 129813 -90533 -183187 78786 -191558 -268677 -316532 -212892
21688 -212892 -562662 -721271 -586936 -385797 -182023 7179 -280177 -343377 -274838 -221691
21678 -221691 -149341 -203080 -320750 -269363 -103201 -175338 12713 -59802 -194330 -388304
21668 -388304 -273973 -165301 -202063 -12672 50201 37304 -276778 23961 139535 -44836
21658 -44836 -166520 -152724 -196010 -129871 9674 109094 271655 486510 345640 303835 402776
$$ packed form
21730i8368r6979p3861K08932J3758k79558j10719j65252J23255L4570K5901P8926
21719c39395K477m6646q1945q8913J70670J60806J65680K32310J84540k59613
21709I9971k62266k25164j27410J15339L424j8580R2731j46645o1082M9027J55083
21698c25572J9743L09054J26588k20346r2654K61973k70344p7119m7855J03640
21688b12892l49770j58609J34335K01139K03774J89202k87356o3200O8539N3147
21678b21691P2350n3739j17670N1387J66162p2137J88051p2515j34528j93974
21668c88304J14331J08672l6762J89391O2873j2897l14082L00739J15574j84371
21658d4836j21684J3796m3286O6139J39545R9420J62561K14855j40870m1805R8941
$$ plain form
21647 402776 456966 566566 484908 226047 -25353 -337569 -230958 -167893 136722 278450
21637 278450 245325 263991 464380 601723 620903 517308 187111 317863 690254 388495
21627 388495 82504 10464 -28722 49457 126053 53278 -253630 -430426 -365512 -191914 -155091
21616 -155091 -183388 -27873 93850 3613 -200381 -379179 -308520 -357129 -343612 -177081
21606 -177081 -178816 -109218 -88591 117289 224814 117894 39322 -282459 -566258 -385654
21596 -385654 -253490 -455604 -558841 -672592 -482845 -405150 -397949 -258563 -245631 -190867
21586 -190867 -245296 -170119 -260290 -564914 -432167 -54740 97254 -153907 -270242 -250686
21576 -250686 -259872 -417915 -620308 -752472 -627109 -606329 -449888 -301956 -368016 -288698
$$ packed form
21647D02776N4190J09600q1658k58861k51400l12216J06611O3065L04615J41728
21637B78450l3125J8666K00389J37343J9180j03595l30197J30752L72391l01759
21627C88495l05991p2040l9186P8179P6596p2775l06908j76796O4914J73598L6823
21616a55091k8297J55515J21723r0237k03994j78798P0659m8609J3517J66531
21606a77081j735O9598K0627K05880J07525j06920p8572l21781k83799J80604
21596c85654J32164k02114j03237j13751J89747P7695P201J39386J2932N4764
21586a90867n4429P5177r0171l04624J32747L77427J51994k51161j16335J9556
21576b50686r186j58043k02393j32164J25363K0780J56441J47932o6060P9318
$$ plain form
21566 -288698 -278283 -124944 -226598 -246649 -168391 -46200 -32243 -147494 -160323 48352
21556 48352 155291 -23319 -67295 91284 36196 -70517 -322012 -321173 -436445 -503959 -81574
21545 -81574 223816 149217 -131529 -343920 -405175 -292376 -221089 -28565 -152747 -309625
21535 -309625 -179945 -217567 -548981 -700614 -326879 -147299 -141001 -236831 -508604 -669375
21525 -669375 -770620 -842464 -578661 -628534 -554682 -352648 -67342 46856 -38902 -354811
21515 -354811 -507600 -690734 -788135 -638638 -389071 -294449 -415809 -458684 -406980 -355568
21505 -355568 -477783 -519030 -298513 -300745 -237190 -86887 -137355 15809 -33394 -231170 -289322
21494 -289322 -217840 -120565 -162056 -103818 -330825 -298311 -114003 -84392 146892 -119110 -406620
$$ packed form
21566b88698J0415J53339j01654k0051P8258J22191J3957j15251j2829K08675
21556D8352J06939j78610m3976J58579n5088j06713k51495Q39j15272o7514M22385
21545h1574L05390p4599k80746k12391o1255J12799P1287J92524j24182j56878
21535c09625J29680l7622l31414j51633L73735J79580O298r5830k71773j60771
21525f69375j01245p1844K63803m9873P3852K02034K85306J14198q5758l15909
21515c54811j52789j83134r7401J49497K49567R4622j21360m2875N1704N1412
21505c55568j22215m1247K20517k232O3555J50303n0468J53164m9203j97776n8152
21494b89322P1482R7275m1491N8238k27007L2514J84308K9611K31284k66002k87510
$$ plain form
21483 -406620 -302106 -376688 -363387 -469535 -159426 124928 276892 336439 242084 -96012
21473 -96012 -254403 -278116 -303628 -373660 -225844 -337320 -418182 -258274 -506115 -526430 -207636
21462 -207636 -177240 -300051 -385766 -533049 -715123 -686947 -498914 -407488 -279680 -37566
21452 -37566 -70656 -160182 -276949 -120372 27845 91347 23852 -153469 -105216 -265777 -391073
21441 -391073 -399259 -430428 -453633 -329088 -289497 -360792 -283030 9594 12009 -269529 -295051
21430 -295051 -113838 -11898 98346 -42334 18331 -19398 139186 -125478 -208908 -374799
21420 -374799 -607213 -540300 -344777 -484790 -448989 -147126 -64847 6745 -209025 -290228
21410 -290228 -179094 -204667 980 -112384 -288316 -335641 -362618 -232163 -280943 -420377
$$ packed form
21483d06620J04514p4582J3301j06148L10109K84354J51964N9547r4355l38096
21473i6012j58391k3713k5512p0032J47816j11476q0862J59908k47841k0315L18794
21462b07636L0396j22811q5715j47283j82074K8176J88033R1426J27808K42114
21452c7566l3090q9526j16767J56577J48217O3502o7495j77321M8253j60561j25296
21441c91073q186l1169k3205J24545L9591p1295P7762K92624K415k81538k5522
21430b95051J81213J01940J10244j40680O0665l7729J58584k64664q3430j65891
21420c74799k32414O6913J95523j40013L5801L01863Q2279P1592k15770q1203
21410b90228J11134k5573K05647j13364j75932m7325k6977J30455m8780j39434
$$ plain form
21400 -420377 -495670 -355690 -370690 -509884 -620107 -695979 -904161 -729617 -549234 -561839
21390 -561839 -319048 -134989 -155501 403700 64248 -277945 -530518 -419201 32674 79834
21380 79834 8942 27736 197654 169464 -41260 -202039 -236477 -174359 -45630 150027 501582
21369 501582 338037 72406 190489 66253 -104723 -176578 -356179 -468175 -159078 -82065
21359 -82065 -473573 -418783 -533968 -686312 -747078 -613399 -531874 -345435 -129019 86335
21349 86335 98986 -105717 41724 118356 158715 -88846 -235482 -97926 -385640 -523109
21339 -523109 -269893 -240966 -184905 -226894 -354220 -330966 -385796 -453970 -439692 -256232 10948
21328 10948 -124840 -76519 18131 -115010 -149072 -27323 -76394 -127282 -116234 -265516 -256318
$$ packed form
21400d20377p5293J39980j5000j39194j10223p5872k08182J74544J80383j2605
21390e61839K42791J84059k0512N59201l39452l42193k52573J11317M51875M7160
21380G9834p0892J8794J69918k8190k10724j60779l4438O2118J28729J95657L51555
21369E01582j63545k65631J18083j24236j70976p1855j79601j11996L09097P7013
21359h2065l91508N4790j15185j52344o0766J33679Q1525J86439K16416K15354
21349H6335J2651k04703J47441P6632M0359k47561j46636J37556k87714j37469
21339e23109K53216K8927N6061m1989j27326K3254n4830o8174J4278J83460K67180
21328A0948j35788M8321R4650j33141l4062J21749m9071n0888J1048j49282R198
$$ plain form
21317 -256318 -38294 100120 245552 102319 -898 -28560 -39895 -134578 -224888 -224886 -483282
21306 -483282 -495438 -478072 -561224 -309803 -397954 -446865 -199090 -142105 190067 172902 -53558
21295 -53558 -195695 -151735 -25263 -280794 -530040 -601117 -578595 -364026 -215151 -433894
21285 -433894 -598473 -693135 -561116 -547157 -713888 -752360 -611474 -386782 -102281 -145242
21275 -145242 -286878 -240412 -451515 -522986 -502632 -515026 -528478 -353169 -321244 -379993 -378313
21264 -378313 -586513 -456968 -346588 -349767 -254039 -400619 -616062 -734317 -566735 -158221
21254 -158221 -177704 -84124 -26717 -65703 -120623 -179390 -242376 -186920 -255849 -197564 -222775
21243 -222775 -108136 -158861 -132963 -188608 -713086 -898253 -750350 -426849 -270455 -174932
$$ packed form
21317b56318K18024J38414J45432j43233j03217k7662j1335r4683r0310Kk58396
21306d83282j2156J7366q3152K51421q8151m8911K47775N6985L32172j7165k26460
21295e3558j42137M3960J26472k55531k49246p1077K2522K14569J48875k18743
21285d33894j64579r4662J32019J3959j66731l8472J40886K24692K84501m2961
21275a45242j41636M6466k11103p1471K0354j2394j3452J75309L1925n8749J680
21264c78313k08200J29545J10380l179R5728j46580k15443j18255J67582M08514
21254a58221j9483R3580N7407l8986n4920n8767o2986N5456o8929N8285k5211
21243b22775J14639n0725K5898n5645n24478j85167J47903L23501J56394R5523
$$ plain form
21233 -174932 -55509 -325307 -305689 -345772 -146562 7848 -271553 -501622 -530911 -401679
21223 -401679 -481022 -458219 -384563 -317953 -45665 -80368 -99163 55422 327501 412242 319309
21212 319309 372529 385909 161371 -74993 -25286 -27647 10297 -170093 -42726 19277 -944
21201 -944 -178110 -544235 -538690 -323607 -201675 -303429 -303877 11587 146033 79982 53970
21190 53970 133431 291705 397811 263467 366679 316235 409867 289381 217159 157655 76624
21179 76624 88643 231933 280452 378398 345103 356841 202671 -78427 -249994 -44711 15452
21168 15452 -111913 -168137 -361118 -485685 -408248 -375484 -351417 -173944 -184989 -392236 -560618
21157 -560618 -528872 -597845 -526836 -249551 -261762 -155630 -88473 -90222 -1867 48010 117600
$$ packed form
21233a74932J19423k69798J9618m0083J99210J54410k79401k30069k9289J29232
21223d01679p9343K2803P3656O6610K72288l4703j8795J54585K72079Q4741r2933
21212C19309N3220J3380k24538k36364M9707k361L7944j80390J27367O2003k0221
21201i44j77166l66125N545K15083J21932j01754m48L15464J34446o6051k6012
21190E3970P9461J58274J06106j34344J03212n0444R3632j20486p2222n9504q1031
21179G6624J2019J43290M8519R7946l3295J1738j54170k81098j71567K05283O0163
21168A5452j27365n6224j92981j24567P7437L2764K4067J77473j1045k07247j68382
21157e60618L1746o8973P1009K77285j2211J06132O7157j749Q8355M9877O9590
$$ plain form
21146 117600 200826 369173 132432 -49588 -146895 -317962 -430507 -360278 -225736 -204506
21136 -204506 -303799 -256165 62178 85531 73479 110031 240161 4707 -51032 -127154 -256567
21125 -256567 -174598 94255 -41978 -335000 -419531 -299285 -238612 -243554 -312844 -369630 -117351
21114 -117351 -158505 -144405 -65467 -200082 -310966 -146042 -66712 -162078 -235841 -296059 -258459
21103 -258459 -227092 45699 92163 30368 -65136 -297128 -290712 -171004 -1671 -119007 62017
21092 62017 8292 -26030 -129421 -23987 71995 -1431 110238 -8095 -251876 -256168 -269120
21081 -269120 -485086 -717870 -630387 -522612 -708316 -764602 -849063 -652352 -699066 -511580
21071 -511580 -502020 -411625 -261271 -306137 -459735 -454875 -262676 -395755 -308721 -241098 -428498
$$ packed form
21146A17600Q3226J68347k36741j82020r7307j71067j12545P0229J34542K1230
21136b04506r9293M7634L18343K3353j2052L6552J30130k35454n5739p6122j29413
21125b56567Q1969K68853j36233k93022q4531J20246O0673m942o9290n6786K52279
21114a17351m1154J4100P8938j34615j10884J64924P9330r5366p3763o0218L7600
21103b58459L1367K72791M6464o1795r5504k31992O416J19708J69333j17336J81024
21092F2017n3725l4322j03391J05434R5982p3426J11669j18333k43781m292j2952
21081b69120k15966k32784Q7483J07775j85704n6286q4461J96711m6714J87486
21071e11580R560R0395J50354m4866j53598M860J92199j33079Q7034O7623j87400
$$ plain form
21060 -428498 -533138 -487678 -122335 -255590 -397736 -478396 -102960 -70552 -27751 -200414
21050 -200414 -244746 -275487 -86998 -76167 -303858 -618335 -606233 -475081 -475928 -365198 -254695
21039 -254695 -142500 15126 -241690 -415990 -392774 -256779 -83557 -233276 -462212 -635914
21029 -635914 -553453 -366948 -431770 -458559 -439439 -486086 -590249 -325654 -132411 -9575
21019 -9575 -91307 -94345 -120696 -282093 -276431 -168252 -304143 -541623 -605763 -484768 -552726
21008 -552726 -695815 -471930 -155472 2979 -203130 -465509 -712060 -547353 -401523 -362632
20998 -362632 -296713 -375895 -403915 -290860 -462865 -244540 -150018 -401367 -562122 -369526
20988 -369526 -194751 -295414 -424269 -374773 -60645 -9478 -251798 -276655 -286329 -477427
$$ packed form
21060d28498j04640M5460L65343j33255j42146q0660L75436L2408M2801j72663
21050b00414m4332l0741J88489J0831k27691l14477J2102J31152q47J10730J10503
21039b54695J12195J57626k56816j74300K3216J35995J73222j49719k28936j73702
21029f35914Q2461J86505o4822k6789J9120m6647j04163K64595J93243J22836
21019i575q1732l038k6351j61397N662J08179j35891k37480o4140J20995o7958
21008e52726j43089K23885L16458J58451k06109k62379k46551J64707J45830L8891
20998c62632O5919p9182k8020J13055j72005K18325R4522k51349j60755J92596
20988c69526J74775j00663j28855M9496L14128N1167k42320k4857r674j91098
$$ plain form
20978 -477427 -465865 -539793 -747968 -628716 -646754 -621675 -370851 -363271 -249747 -302476 -252293
20967 -252293 -124393 -231017 -281349 -310163 -160498 -63202 -466397 -601773 -592673 -489807
20957 -489807 -458627 -492303 -372110 -135935 -230547 -400346 -387994 -404869 -605553 -606257 -510188
20946 -510188 -203804 -55048 -285903 -284715 -282016 -306675 -407472 -371275 -330986 -225830 -224490
20935 -224490 -310473 -209732 -130439 -105308 -25467 -208045 -330757 -351468 -382597 -590046 -561541
20924 -561541 -541642 -438463 -536747 -297291 -126383 -504868 -377032 -213980 -147878 -182477
20914 -182477 -320062 -329125 -345343 -396933 -587663 -584178 -591676 -624629 -700581 -651711 -668058 -868717
20902 -868717 -956344 -783772 -547198 -598973 -688064 -466537 -238750 -4828 8337 -89565
$$ packed form
20978d77427J1562p3928k08175J19252j8038K5079K50824P580J13524n2729N0183
20967b52293J27900j06624n0332k8814J49665R7296m03195j35376R100J02866
20957d89807L1180l3676J20193K36175r4612j69799J2352j6875k00684p04R6069
20946e10188L06384J48756k30855J188K699k4659j00797L6197M0289J05156J340
20935b24490q5983J00741P9293K5131P9841j82578j22712k0711l1129k07449K8505
20924e61541J9899J03179r8284K39456J70908l78485J27836J63052O6102l4599
20914a82477j37585r063j6218n1590j90730L485p498l2953p5952M8870j6347k00659
20902h68717q7627J72572K36574n1775q9091K21527K27787K33922J3165r7902
$$ plain form
20892 -89565 -395998 -540986 -547090 -473892 -273085 -84167 -415989 -648831 -621119 -690789 -707245
20881 -707245 -993273 -868005 -634023 -320562 -186156 -330810 -331031 -447271 -643281 -543671
20871 -543671 -381725 -377163 -294943 -90725 -373980 -251739 -103410 -439144 -746054 -443719
20861 -443719 -193875 -201256 -380703 -549206 -645257 -465585 -177095 -114724 -114401 68484 -242813
20850 -242813 -468082 -346629 -244880 -237364 -285285 -518358 -502536 -276013 -339289 -569393
20840 -569393 -510403 -409543 -367615 -520768 -575457 -657845 -404149 -265891 -153894 -116924
20830 -116924 -12754 -46208 -179856 -236855 -367032 -337144 -533615 -535767 -464127 -392528 -98037
20819 -98037 -58441 -56978 -335179 -294274 -287681 -313515 -72463 142732 -128 -204977 -550283
$$ packed form
20892h9565l06433j44988o104P3198K00807J88918l31822k32842K7712o9670j6456
20881g07245k86028J25268K33982L13461J34406j44654k21j16240j96010R9610
20871e43671J61946M562Q2220K04218k83255J22241J48329l35734l06910L02335
20861d43719K49844p381j79447j68503r6051J79672K88490O2371L23J82885l11297
20850b42813k25269J21453J01749P516m7921k33073J5822K26523o3276k30104
20840e69393N8990J00860M1928j53153n4689q2388K53696J38258J11997L6970
20830a16924J04170l3454j33648n6999j30177K9888j96471k152P1640P1599K94491
20819i8037L9596J463k78201M0905O593k5834K41052K15195j42860k04849l45306
$$ plain form
20808 -550283 -517887 -438541 -149841 106107 166280 201489 115688 145798 27810 -77634 -248101
20797 -248101 -409585 -260346 -115344 -28307 -15485 -156397 -487107 -702766 -586588 -494374
20787 -494374 -395041 -260730 -219602 -249536 -135392 -116129 -83133 57610 349846 399731 196345
20776 196345 -60971 -260951 -179683 -268957 -390989 -315583 -229249 -281197 -822008 -899619 -409453
20765 -409453 -267404 -128941 -196146 -377877 -197931 85867 208567 -131640 -232307 -58284
20755 -58284 -64513 -313145 -375495 -86094 -81056 131517 146038 190267 -14273 -281431 -210459
20744 -210459 -244090 -453602 -428681 -229120 -303197 -452636 -186292 -84974 -378046 -459478
20734 -459478 -251218 -454968 -697328 -550878 -187009 27962 139669 45452 -117584 -279056
$$ packed form
20808e50283L2396P9346K88700K55948O0173L5209q5801L0110j17988j05444j70467
20797b48101j61484J49239J45002Q7037J2822j40912l30710k15659J16178R2214
20787d94374R9333J34311M1128k9934J14144J9263L2996J40743K92236M9885k03386
20776A96345k57316j99980Q1268q9274j22032P5406Q6334n1948n40811p7611M90166
20765d09453J42049J38463o7205j81731J79946K83798J22700l40207j00667J74023
20755e8284o229k48632o2350K89401N038K12573J4521M4229k04540k67158P0972
20744b10459l3631k09512K4921J99561p4077j49439K66344J01318k93072q1432
20734d59478K08260k03750k42360J46450L63869K14971J11707r4217j63036j61472
$$ plain form
20724 -279056 -372590 -338324 -205992 -272535 -484125 -338679 -394894 -359435 -193242 -176980 -400272
20713 -400272 -404164 -317143 -459845 -536610 -423875 -642092 -757071 -550199 -218313 -195145
20703 -195145 -197602 -242548 -339280 -373573 -722878 -954429 -893760 -679114 -327447 -183876 -388756
20692 -388756 -415244 -311092 -231622 -391314 -167923 -96730 -179524 -164996 -124905 -190311 -553454
20681 -553454 -631932 -607692 -574254 -756808 -967683 -748449 -548145 -469155 -260086 -133995
20671 -133995 -181785 -214675 -289213 -262751 -274508 -450259 -417502 -281751 -151943 28732 -97634
20660 -97634 -203560 -294311 -47527 83387 60611 72074 29293 -115479 37939 -61604 -234829
20649 -234829 -392883 -512361 -346388 -315751 -531683 -569637 -351390 -354786 -317373 -350211 -512004
$$ packed form
20724b79056r3534L4266J32332o6543k11590J45446n6215L5459J66193J6262k23292
20713d00272l892Q7021j42702p6765J12735k18217j14979K06872L31886K3168
20703a95145k457m4946r6732l4293l49305k31551O0669K14646L51667J43571k04880
20692c88756k6488J04152P9470j59692K23391P1193q2794J4528M0091o5406l63143
20681e53454p8478K4240L3438j82554k10875K19234K00304P8990K09069J26091
20671a33995m7790l2890p4538K6462j1757j75751L2757J35751J29808J80675j26366
20660i7634j05926r0751K46784J30914k2776J1463m2781j44772J53418r9543j73225
20649b34829j58054j19478J65973L0637k15932l7954K18247l396L7413l2838j61793
$$ plain form
20638 -512004 -379113 -178875 -264842 -397424 -271914 -498350 -603234 -476495 -434454 -341322
20628 -341322 -66151 -977 -28812 -136329 -210780 -191893 -363104 -461077 -353503 -432675 -481695
20617 -481695 -429445 -205326 -175685 -117759 -226174 -469786 -363960 173270 373659 176538
20607 176538 15689 -10727 -181269 -171258 -415853 -278908 -85928 -76782 -204961 -203539 -173188
20596 -173188 -203293 -158045 19002 147083 19578 52629 359079 445475 409156 551146
20586 551146 567696 594677 444380 250034 82895 99055 209749 5688 -100767 -111136
20576 -111136 -319490 -420003 -382877 -16061 232946 49403 -161688 -29367 33922 112676
20566 112676 65783 134781 121141 63288 113064 134190 39667 66915 -39961 -254466 -287667
$$ packed form
20638e12004J32891K00238q5967j32582J25510k26436j04884J26739M2041R3132
20628c41322K75171O5174k7835j07517p4451J8887j71211r7973J07574p9172m9020
20617d81695N2250K24119K9641N7926j08415k43612J05826N37230K00389j97121
20607A76538j60849k6416j70542J0011k44595J36945J92980R146j28179J422L0351
20596a73188l0105M5248J77047J28081j27505L3051L06450Q6396l6319J41990
20586E51146J6550K6981j50297j94346j67139J6160J10694k04061j06455j0369
20576a11136k08354j00513L7126L66816K49007j83543k11091J32321O3289P8754
20566A12676m6893O8998j3640n7853M9776K1126r4523K7248j06876k14505l3201
$$ plain form
20555 -287667 -261108 -159505 11491 149146 -38236 173405 75954 -57057 -103257 -33185
20545 -33185 184445 46153 -76014 -77028 4042 -7948 -107213 -267013 -602896 -697547 -759900
20534 -759900 -609516 -490105 -426360 -205414 -116861 -176059 -250422 -381220 -456291 -463693 -467852
20523 -467852 -472547 -386216 -599292 -673564 -497123 -538262 -490504 -388936 -507442 -372342 -126107
20512 -126107 -86120 74042 202521 92835 -141615 5023 -150710 -336470 -335550 -258644
20502 -258644 30844 -180980 -96357 52704 111502 -122231 -64288 29323 -100985 -156502
20492 -156502 -239890 -580689 -586932 -501238 -586803 -641331 -325891 -115736 -266618 -444497 -580871
20481 -580871 -418875 -417397 -345030 -244994 -244339 -329606 -131085 -109948 -407875 -391887 -147038
$$ packed form
20555b87667K6559J01603J70996J37655j87382K11641r7451j33011m6200P0072
20545c3185K17630j38292j22167j014Q1070j1990r9265j59800l35883r4651o2353
20534g59900J50384J19411O3745K20946Q8553n9198p4363j30798p5071p402m159
20523d67852m695Q6331k13076p4272J76441m1139M7758J01568j18506J35100K46235
20512a26107L9987J60162J28479j09686k34450J46638j55733j85760R20P6906
20502b58644K89488k11824Q4623J49061N8798k33733N7943R3611j30308n5517
20492a56502q3388l40799o243Q5694q5565n4528L15440K10155j50882j77879j36374
20481e80871J61996J478P2367J00036O55q5267J98521K1137k97927J5988K44849
$$ plain form
20470 -147038 -44907 48554 23064 -110091 -81950 -190206 -302067 -275003 -277182 -136394 -74462
20459 -74462 -174515 -348560 -330667 -250636 -210825 -379573 -364846 -259157 -326639 -101076 -135910
20448 -135910 -185583 -8087 44507 -39672 -259570 -537060 -607995 -428778 -425954 -515780 -130442
20437 -130442 -367633 -641604 -482996 -596853 -550601 -542206 -436609 -284851 -136673 80717
20427 80717 -141319 -285717 -360665 -26823 -206187 -228761 -212152 -369559 -299146 -381141 -541606
20416 -541606 -549286 -406676 -158181 12456 -255228 -668084 -855867 -720126 -388015 -125430
20406 -125430 -216647 -388625 -380339 -283670 -243165 -293831 -381048 -460270 -248333 -426852 -391244
20395 -391244 -458733 -390935 -248145 -164730 -248534 -247520 -137607 -28690 -31435 23915 140860
$$ packed form
20470a47038J02131R3461k5490j33155K8141j08256j11861K7064k179J40788O1932
20459g4462j00053j74045J7893Q0031L9811j68748J4727J05689o7482K25563l4834
20448a35910m9673J77496N2594q4179k19898k77490p0935J79217K824q9826L85338
20437a30442k37191k73971J58608j13857M6252Q395J05597J51758J48178K17390
20427H0717k22036j44398p4948L33842j79364k2574J6609j57407P0413q1995j60465
20416e41606p680J42610K48495J70637k67684m12856j87783J35741L32111K62585
20406a25430r1217j71978Q286R6669M0505n0666q7217p9222K11937j78519L5608
20395c91244o7489O7798J42790Q3415q3804J014J09913J08917k745N5350J16945
$$ plain form
20384 140860 292988 138501 101591 -100068 -247770 -214463 -239622 -136916 -262857 -66787
20374 -66787 -12713 -8883 -169133 -212309 -151242 -170009 -121655 -2880 -60154 155492 278126
20363 278126 431624 470757 516508 658382 688671 352325 355809 423021 278593 312279 131755
20352 131755 229741 443055 474954 572140 279539 126659 31623 -7177 32231 72949 -13257
20341 -13257 71195 190451 138115 191174 -14098 -224254 -228420 -144257 -99312 -141282 21790
20330 21790 455778 581176 306936 152743 51490 11826 168525 359645 325675 452353
20320 452353 564745 663089 456683 223680 416234 419377 199783 -68952 25132 28811 136539
20309 136539 310469 277039 -31448 -13917 -1627 -334100 -549897 -452518 -177386 -121254
$$ packed form
20384A40860J52128j54487l6910k01659j47702L3307k5159J02706j25941J96070
20374f6787N4074L830j60250m3176O1067j8767M8354J18775n7274K15646J22634
20363B78126J53498L9133M5751J41874L0289l36346L484O7212j44428L3686j80524
20352A31755R7986K13314L1899R7186k92601j52880r5036l8800L9408M0718q6206
20341a3257Q4452J19256n2336N3059k05272k10156m166Q4163M4945m1970J63072
20330B1790M33988J25398k74240j54193j01253l9664J56699J91120l3970J26678
20320D52353J12392R8344k06406k33003J92554L143k19594k68735R4084L679J07728
20309A36539J73930l3430l08487J7531J2290l32473k15797R7379K75132N6132
$$ plain form
20299 -121254 -73908 -73715 3954 107757 95103 75864 -28490 -272531 -130880 -18262 22350
20288 22350 178183 58826 -129636 -593250 -761820 -602483 -771809 -185916 206632 172844
20278 172844 263162 206689 169513 -75425 -192808 -179405 -267934 -593350 -417298 -489561 -801072
20267 -801072 -588725 -365627 -523312 -560020 -464563 -534887 -592755 -235350 220686 162742
20257 162742 47738 -256965 -402486 -405669 -440757 -201447 49339 -107174 -373276 -473888
20247 -473888 -450081 -659849 -775002 -444796 -243860 -389805 -719704 -773456 -593934 -494499
20237 -494499 -565791 -411732 -23517 -68805 -558349 -670457 -634110 -479693 -553505 -664090
20227 -664090 -647851 -599124 -676278 -583246 -569985 -542957 -538712 -357061 -176142 -210624 -155997
$$ packed form
20299a21254M7346J93P7669J03803j2654j9239j04354k44041J41651J12618M0612
20288B2350J55833j19357j88462m63614j68570J59337j69326N85893L92548l3788
20278A72844R0318n6473l7176k44938j17383J3403q8529l25416J76052p2263l11511
20267h01072K12347K23098j57685l6708R5457p0324n7868L57405M56036n7944
20257A62742j15004l04703j45521l183l5088K39310K50786j56513k66102j00612
20247d73888K3807k09768j15153L30206K00936j45945l29899n3752J79522R9435
20237d94499p1292J54059L88215m5288m89544j12108L6347J54417p3812j10585
20227f64090J6239M8727p7154R3032J3261K7028M245J81651J80919l4482N4627
$$ plain form
20216 -155997 -308385 78553 72774 -280681 -278439 -250511 -460445 -535605 -507682 -418702 -289559
20205 -289559 -233285 -237378 -300423 -307727 -232402 -207083 -403272 -360399 -251054 -139580 -195070
20194 -195070 -223892 -396352 -259229 -402020 -327388 -158801 -151985 -159257 7545 149171 120958
20183 120958 186725 -110714 -236166 -282665 -240497 -266087 -303973 -307032 -251038 -58717 -149792
20172 -149792 -259862 -436352 -460784 -131574 151801 -69721 -115911 221825 214464 -49692
20162 -49692 -428942 -467048 -461333 -574059 -627039 -668782 -483047 -455731 -582999 -420605 -437159
20151 -437159 -646551 -554139 -299583 -226930 -217646 56755 16053 -245711 -268333 -219599 -232959
20140 -232959 -519301 -578571 -330701 -405346 -252357 -265838 -301256 -382953 -409305 -495764 -308390
$$ packed form
20216a55997j52388L86938n779l53455K242K7928k09934p5160K7923Q8980J29143
20205b89559N6274m093o3045p304P5325K5319j96189M2873J09345J11474n5490
20194a95070k8822j72460J37123j42791P4632J68587O816p272J66802J41626k8213
20183A20958O5767k97439j25452m6499M2168k5590l7886l059N5994J92321r1075
20172a49792j10070j76490k4432L29210K83375k21522m6190L37736p361k64156
20162d9692l79250l8106N715j12726n2980m1743J85735K7316j27268J62394j6554
20151d37159k09392R2412K54556P2653R284K74401m0702k61764k2622M8734j3360
20140b32959k86342n9270K47870p4645J52989j3481l5418q1697k6352q6459J87374
$$ plain form
20129 -308390 -295569 -343247 -174550 -112178 34136 -56633 -104100 -241128 -50546 89389
20119 89389 21419 -66829 -122169 -28039 -138901 -265597 -355922 -379908 -584197 -401835 -269017
20108 -269017 -294686 -397343 -469897 -237184 -153313 -292658 -363483 -509562 -632125 -763872
20098 -763872 -619383 -533085 -411723 -234429 -88100 -20690 -329569 -372584 -310632 -215988
20088 -215988 -68096 -132553 -243427 -268447 -220964 -314987 -316649 -123775 -347237 -264266 -262637
20077 -262637 -485234 -374749 -600566 -440952 -366600 -410479 -528979 -627958 -628759 -411030 -149412
20066 -149412 -44173 -126904 -419210 -464046 -424968 -419901 -433274 -249290 -328227 -468194 -386192
20055 -386192 -267052 -278563 -89703 -16108 -111995 7815 8615 -413898 -363434 -20883 -143335
$$ packed form
20129c08390J2821m7678J68697O2372J46314r0769m7467j37028J90582J39935
20119H9389o7970q8248n5340R4130j10862j26696r0325k3986k04289J82362J32818
20108b69017k5669j02657p2554K32713Q3871j39345p0825j46079j22563j31747
20098g63872J44489Q6298J21362J77294J46329O7410l08879m3015O1952R4644
20088b15988J47892o4457j10874k5020M7483r4023j662J92874k23462Q2971J629
20077b62637k22597J10485k25817J59614P4352m3879j18500r8979q01K17729K61618
20066a49412J05239q2731k92306m4836L9078N067j3373J83984p8937j39967Q2002
20055c86192J19140j1511J88860P3595r5887J19810Q00m22513N0464L42551j22452
$$ plain form
20044 -143335 9885 -297923 -545710 -582880 -532732 -313527 -187716 -272993 -427979 -442244
20034 -442244 -395932 -469877 -636140 -610217 -492272 -432341 -310397 -413149 -476407 -598464
20024 -598464 -667957 -618894 -491905 -470368 -309666 41118 64523 -37350 -112003 -224818
20014 -224818 -356027 -380025 -173132 71081 -165967 -763548 -800670 -572951 -384957 -235882
20004 -235882 -206824 -214855 -469690 -589988 -631874 -594348 -235280 165375 271816 115935
19994 115935 -319683 -354697 -167351 -160859 -265014 -389990 -377843 -339548 -386743 -352226 -705618
19983 -705618 -842114 -704934 -503945 -358523 -273464 -460344 -712465 -758120 -678547 -396386
19973 -396386 -313267 -510022 -612495 -619934 -454405 -342579 -508103 -675361 -416472 -215360
$$ packed form
20044a43335J53220l07808k47787l7170N0148K19205J25811q5277j54986j4265
20034d42244M6312p3945j66263K5923J17945N9931J21944j02752o3258j22057
20024e98464o9493M9063J26989K1537J60702L50784K3405j01873p4653j12815
20014b24818j31209k3998K06893K44213k37048n97581l7122K27719J87994J49075
20004b35882K9058q031k54835j20298m1886L7526L59068M00655J06441j55881
19994A15935m35618l5014J87346O492j04155j24976J2147L8295m7195L4517l53392
19983g05618j36496J37180K00989J45422Q5059j86880k52121m5655P9573K82161
19973c96386Q3119j96755j02473p439J65529J11826j65524j67258K58889K01112
$$ plain form
19963 -215360 -332838 -527646 -558664 -22027 147886 72463 -71799 -589926 -732269 -735223
19953 -735223 -407840 -156783 -85765 -149036 -284959 -419119 -460504 -225490 -338163 -646803
19943 -646803 -692512 -662661 -498774 -286534 -402177 -554566 -686515 -616097 -411593 -333652
19933 -333652 -508259 -704933 -633736 -576981 -766777 -928622 -780971 -126824 -48200 -285656
19923 -285656 -386810 -227843 -70877 -257385 -599708 -600486 -307247 33714 14791 -109046
19913 -109046 -30018 -135004 -137482 -302726 -312458 -239273 -230491 -462545 -565512 -510705 -540191
19902 -540191 -202175 -373644 -547436 -784479 -700951 -473543 -620680 -506815 -412641 -316075
19892 -316075 -269548 -295817 -39772 14763 -192974 -358774 -336912 -152444 -180633 -193454 -241682
$$ packed form
19963b15360j17478j94808l1018N36637J69913p5423j44262n18127j42343k954
19953g35223L27383K51057P1018o3271j35923j34160m1385K35014j12673l08640
19943f46803m5709K9851J63887K12240j15643j52389j31949P0418K04504P7941
19933c33652j74607j96674P1197N6755j89796j61845J47651O54147P8624k37456
19923b85656j01154J58967J56966j86508l42323p78K93239L40961j8923j23837
19913a09046P9028j04986k478j65244r732P3185Q782k32054j02967N4807k9486
19902e40191L38016j71469j73792k37043Q3528K27408j47137J13865R4174R6566
19892c16075M6527k6269K56045N4535k07737j65800K1862J84468k8189j2821m8228
$$ plain form
19881 -241682 -35047 -50289 -36871 -181075 -229014 -319638 -414385 -218305 -476454 -592126
19871 -592126 -319498 -61212 23745 109521 -147572 -22215 -52669 -294586 -467077 -663718
19861 -663718 -534626 -177186 -79452 -263350 -283266 -117044 -29102 71171 -67723 -184979
19851 -184979 -485917 -793550 -613918 -488540 6508 -25152 57 -116107 -157031 -37033
19841 -37033 -131425 -215160 -181192 -203464 -337843 -119100 47879 5511 -42702 2773 -277564
19830 -277564 -550339 -547588 -212483 -84503 -276642 -324810 18373 76015 -240737 -539260
19820 -539260 -207587 -91094 -71838 -70457 10170 181181 456952 510565 189944 276319 486660
19809 486660 291725 -56388 -107660 -76685 -96824 -68511 66431 102746 -121453 74434
$$ packed form
19881b41682K06635j5242J3418j44204m7939r0624r4747J96080k58149j15672
19871e92126K72628K58286Q4957Q5776k57093J25357l0454k41917j72491j96641
19861f63718J29092L57440R7734j83898j9916J66222Q7942J00273j38894j17256
19851a84979l00938l07633J79632J25378M95048l1660K5209j16164m0924J19998
19841c7033r4392q3735L3968k2272j34379K18743J66979m2368m8213M5475k80337
19830b77564k72775K751L35105J27980j92139m8168L43183N7642l16752k98523
19820e39260L31673J16493J9256J381Q0627J71011K75771N3613l20621Q6375K10341
19809D86660j94935l48113n1272L0975k0139K8313J34942L6315k24199J95887
$$ plain form
19799 74434 78118 -139963 -181992 60165 -38811 -79726 32797 -244592 -287475 -261299 32037
19788 32037 437487 345038 8172 51964 261870 50294 -145257 -24249 75 -111422
19778 -111422 49518 189873 63998 121482 344158 460802 307531 404397 717306 655639
19768 655639 691229 660211 675382 837425 711146 466999 115056 47627 192141 126403
19758 126403 22946 26754 143840 221138 380645 467136 468006 754579 687583 548379 355414
19747 355414 375195 452189 243653 160361 65653 14401 84321 110271 47871 322191 389674
19736 389674 386602 544816 386998 98519 45780 42732 178097 11525 -169016 -158601 -142050
19725 -142050 -3069 185077 198272 226303 437747 496230 363584 161161 44342 -32985
$$ packed form
19799G4434L684k18081m2029K42157r8976m0915J12523k77389m2883K6176K93336
19788C2037M05450r2449l36866M3792K09906k11576j95551J21008K4324j11497
19778a11422J60940J40355j25875N7484K22676J16644j53271R6866L12909o1667
19768F55639L5590l1018J5171J62043j26279k44147l51943o7429J44514o5738
19758A26403j03457L808J17086P7298J59507Q6491Q70K86573o6996j39204j92965
19747C55414J9781P6994k08536q3292r4708n1252O9920K5950o2400K74320O7483
19736C89674l072J58214j57818k88479n2739l048J35365j66572j80541J0415J6551
19725a42050J38981J88146J3195K8031K11444N8483j32646k02423j16819p7327
$$ plain form
19715 -32985 -72036 -72652 -13342 -110109 90146 317973 350377 105780 22425 120153 67880
19704 67880 -284201 -277998 -20226 18274 -75773 -15655 381398 370687 115955 -27005 -86572
19693 -86572 -343567 -285937 -261758 -182552 -64779 71665 -12781 -138545 13614 261972
19683 261972 414325 503412 216725 -206507 -516531 -419727 -308687 -28991 182004 401357
19673 401357 559862 487651 378320 353411 -18555 146374 376640 81208 21505 -70395
19663 -70395 -235021 -427891 -551361 -416994 -56792 23265 -202420 -296894 -101747 8018
19653 8018 -81771 181341 219619 9752 -127010 -110878 109233 184127 4766 -54394 68808
19642 68808 1898 131155 163887 213316 63195 66927 356387 448029 141137 -107624 -79722
$$ packed form
19715c2985l9051o16N9310r6767K00255K27827L2404k44597q3355R7728n2273
19704F7880l52081O203K57772L8500r4047O0118L97053j0711k54732j42960n9567
19693h6572k56995N7630K4179P9206J17773J36444q4446j25764J52159K48358
19683B61972J52353Q9087k86687m23232l10024R6804J11040K79696K10995K19353
19673D01357J58505p2211j09331k4909l71966J64929K30266k95432n9703r1900
19663g0395j64626j92870j23470J34367L60202Q0057k25685r4474J95147J09765
19653H018q9789K63112L8278k09867j36762J6132K20111P4894j79361n9160J23202
19642F8808o6910J29257L2732M9429j50121L732K89460R1642l06892k48761K7902
$$ plain form
19631 -79722 86164 159950 174034 153802 134021 200321 199962 62289 100564 237638 292183
19620 292183 152253 70010 120555 453660 382512 86307 264004 460259 288437 157485
19610 157485 47602 55958 241199 374316 64890 66812 301209 262661 243354 234414 475053
19599 475053 438884 3369 -137825 25116 78436 -62682 -139115 -205706 -350649 -272414
19589 -272414 -179213 -44804 75664 93624 -3394 -67289 -74776 -11568 -268613 -179970 -72096
19578 -72096 58514 3837 99052 -19976 -54455 -32714 -13979 -95868 -128908 -22570 29818
19567 29818 -258629 -345623 -234441 -29494 -19035 200621 253428 141976 265165 427448
19557 427448 363733 258554 238281 205406 309323 430256 358482 287830 216378 271240 262473
$$ packed form
19631g9722J65886P3786J4084k0232j9781O6300l59j37673L8275J37074N4545
19620B92183j39930q2243N0545L33105p1148k96205J77697J96255j71822j30952
19610A57485j09883Q356J85241J33117l09426J922K34397l8548j9307q940K40639
19599D75053l6169m35515j41194J62941N3320j41118p6433o6591j44943P8235
19589b72414R3201J34409J20468J7960r7018o3895p487O3208k57045Q8643J07874
19578g2096J30610n4677R5215j19028l4479K1741J8735q1889l3040J06338N2388
19567B9818k88447q6994J11182K04947J0459K19656N2807j11452J23189J62283
19557D27448o3715j05179k0273l2875J03917J20933p1774p0652p1452N4862q767
$$ plain form
19546 262473 356617 61127 -106041 -78068 122140 150346 249460 219662 73537 213906
19536 213906 291135 220798 219882 -103389 -38106 196800 616832 772546 589475 305626 208396
19525 208396 271876 389671 576196 471405 442276 411319 466462 403931 277131 353393 333286
19514 333286 379409 404352 461725 342782 265258 361434 527684 420635 440653 500245 737419
19503 737419 1188386 1154608 1169025 1534008 1369504 1077480 715281 516643 592510 454481
19493 454481 428883 561848 505255 489598 694124 669593 571567 639080 694690 496104 552348
19482 552348 528383 636960 948371 864057 545642 480149 424412 276736 510803 838686
19472 838686 856721 884279 797319 701064 803496 954276 658569 306929 31529 28470 68267
$$ packed form
19546B62473R4144k95490j67168K7973K00208K8206R9114k9798j46125J40369
19536B13906P7229p0337r16l23271O5283K34906M20032J55714j83071k83849r7230
19525B08396O3480J17795J86525j04791k9129l0957N5143o2531j26800P6262k0107
19514C33286M6123K4943N7373j18943p7524R6176J66250j07049K0018N9592K37174
19503G37419M50967l3778J4417L64983j64504k92024l62199j98638P5867j38029
19493D54481k5598J32965n6593j5657K04526k4531r8026O7513N5610j98586N6244
19482E52348k3965J08577L11411q4314l18415o5493n5737j47676K34067L27883
19472H38686J8035K7558q6960r6255J02432J50780k95707l51640k75400l059L9797
$$ plain form
19461 68267 78174 392096 705074 765989 698423 806952 786271 834937 805155 726382 578419
19450 578419 678612 510143 627967 707615 673353 941522 1027596 1227067 1376516 1385216
19440 1385216 1302476 827825 736752 916821 1121821 1052980 784903 732265 882276 944300
19430 944300 923294 895498 741910 807907 979144 1174748 858441 779742 685993 781090 1097415
19419 1097415 1261349 1267186 976569 1007944 1281270 1424720 1481672 1441797 1374689 1278588 1382719
19408 1382719 1193316 1077422 1118610 1405043 1630762 1518128 1386747 1365589 1439528 1659849
19398 1659849 1877856 2052180 1868819 1766469 1666116 1579057 1449432 1219295 1155877 1437898
19388 1437898 1718673 1738874 1796518 1785968 1705523 1817474 1857649 1962420 1911843 2104373
$$ packed form
19461F8267R907L13922L12978O0915o7566J08529k0681M8666k9782p8773j47963
19450E78419J00193j68469J17824P9648l4262K68169Q6074J99471J49449Q700
19440A385216q2740m74651r1073J80069K05000o8841k68077n2638J50011O2024
19430I44300k1006k7796j53588O5997J71237J95604l16307p8699r3749R5097L16325
19419A097415J63934N837k90617L1375K73326J43450N6952l9875o7108r6101J04131
19408A382719j89403j15894M1188K86433K25719j12634j31381k1158P3939K20321
19398A659849K18007J74324j83361j02350j00353q7059j29625k30137o3418K82021
19388A437898K80775K0201N7644j0550q0445J11951M0175J04771n0577J92530
$$ plain form
19378 2104373 2257306 2388168 2394867 2203667 2013687 1721934 1805448 1824452 1895890 2122895
19368 2122895 2056543 1962975 1837110 2066538 2112245 2374258 2308956 2176978 2128586 2102658
19358 2102658 2371792 2550789 2576281 2335393 2332686 2599080 2752972 2912454 3124543 3111048
19348 3111048 2932698 2638901 2641090 2423050 2376832 2577490 2816465 2864982 2614821 2665763
19338 2665763 2863380 2800729 2676057 2618420 2657370 2790821 2839752 3015191 2816900 2690710
19328 2690710 2979122 3173472 3152708 2933500 2763242 3049240 2825012 2738042 2761862 2709699
19318 2709699 2754025 2724154 2336198 2142776 2314443 2609291 2808421 2614490 2535164 2405455
19308 2405455 2235028 2096917 2153887 2299526 2137208 1991328 1883852 1899750 1861370 1647368
$$ packed form
19378B104373J52933J30862O699j91200j89980k91753Q3514J9004P1438K27005
19368B122895o6352r3568j25865K29428M5707K62013o5302j31978m8392k5928
19358B102658K69134J78997K5492k40888k707K66394J53892J59482K12089j3495
19348C111048j78350k93797K189k18040m6218K00658K38975M8517k50161N0942
19338B665763J97617o2651j24672n7637L8950J33451M8931J75439j98291j26190
19328B690710K88412J94350k0764k19208j70258K85998k24228q6970K3820n2163
19318B709699M4326k9871l87956j93422J71667K94848J99130j93931p9326j29709
19308B405455j70427j38111N6970J45639j62318j45880j07476J5898l8380k14002
$$ plain form
19298 1647368 1667441 1883273 1957125 1938616 2059847 2015400 1983545 1860665 1666645 1343377
19288 1343377 1183015 1212962 1346414 1557122 1546746 1478625 1421110 1581012 1825366 1575225
19278 1575225 1552572 1598281 1553324 1538641 1703159 1888428 1517958 1281064 1404628 1221702
19268 1221702 1197327 1495227 1677939 1475512 1188885 1189908 1126085 876813 686431 668847
19258 668847 881547 846442 935067 1076839 1203940 1370776 1445464 1281726 1181501 1071371
19248 1071371 1058567 1203547 1701706 1853828 1662466 1334748 1128386 1188630 1249514 1188612
19238 1188612 1395154 1621880 1605587 1664260 1386781 1236025 1220602 1308300 1121478 1075119
19228 1075119 1050171 1227482 1263787 1279658 1273357 1339223 1603499 1933381 2053849 1672210
$$ packed form
19298A647368K0073K15832P3852j8509J21231m4447l1855j22880j94020l23268
19288A343377j60362K9947J33452K10708j0376o8121n7515J59902K44354k50141
19278A575225k2653M5709m4957j4683J64518J85269l70470k36894J23564j82926
19268A221702k4375K97900J82712k02427k86627J023o3823k49272j90382j7584
19258F68847K12700l5105Q8625J41772J27101J66836P4688j63738j00225j10130
19248A071371j2804J44980M98159J52122j91362l27718k06362O0244O0884o0902
19238A188612K06542K26726j6293N8673k77479j50756j5423Q7698j86822m6359
19228A075119k4948J77311L6305J5871o301O5866K64276L29882J20468l81639
$$ plain form
19218 1672210 1309951 1433735 1741693 1968472 2007044 1908820 1945854 2328225 2385309 2184822
19208 2184822 2201678 2326037 2315303 2159980 1972398 1769021 1701281 1542659 1549621 1629889
19198 1629889 1631615 1627882 1360843 1310411 1276012 1456648 1662714 1635768 1524621 1470301 1477470
19187 1477470 1417533 1511305 1531170 1483662 1567042 1654995 1685978 1622125 1490559 1508565 1489781
19176 1489781 1577378 1546469 1468413 1370775 1530212 1655206 1799632 1627482 1676322 1908995
19166 1908995 2092794 2024099 1928743 1862150 1802116 1522335 1513531 1644204 1992092 2112801
19156 2112801 1859366 1582260 1573225 1699375 1939197 1819286 1748077 1606122 1457958 1666646
19146 1666646 1870591 1943088 1992518 1789626 1635754 1687646 1605887 1435164 1306136 1294295
$$ packed form
19218A672210l62259J23784L07958K26779L8572r8224L7034L82371N7084k00487
19208B184822J6856J24359j0734j55323j87582k03377o7740j58622O962Q0268
19198A629889J726l733k67039n0432l4399J80636K06066k6946j11147n4320P169
19187A477470n9937R3772J9865m7508Q3380Q7953L0983o3853j31566J8006j8784
19176A489781Q7597l0909p8056r7638J59437J24994J44426j72150M8840K32673
19166A908995J83799o8695r5356o6593o0034k79781q804J30673L47888J20709
19156B112801k53435k77106r035J26150K39822j19911p1209j41955j48164K08688
19146A666646K03945P2497M9430k02892j53872N1892q1759j70723j29028j1841
$$ plain form
19136 1294295 1517883 1646890 1529702 1435214 1639358 1627067 1683264 1692678 1465619 1290038
19126 1290038 1371942 1676794 1794143 1991780 1967785 1993962 2002147 2073886 1943881 1860838 1932771
19115 1932771 2082579 2171564 2382502 2215850 1856372 1827652 1811482 1673260 1933802 1898673
19105 1898673 1752954 1883474 1863579 1806062 1570983 1316943 1508775 1891390 1857646 1803566
19095 1803566 1760029 1569306 1740082 1870305 1957424 2166724 2199430 1961352 1959636 1872151
19085 1872151 1810876 1926180 1840011 1547208 1509534 1742525 1816242 1868481 1985371 1987520 2030211
19074 2030211 2299589 2175451 2339282 2309595 2305381 2231568 2233255 2426440 2644281 2522349
19064 2522349 2428336 2242318 1901734 1864800 2028178 1985212 2009082 2081483 2187651 2285164
$$ packed form
19136A294295K23588J29007j17188r4488K04144j2291N6197R414k27059j75581
19126A290038Q1904L04852J17349J97637k3995K6177Q185P1739j30005q3043P1933
19115A932771J49808Q8985K10938j66652l59478k8720j6170j38222K60542l5129
19105A898673j45719J30520j9895n7517k35079k54040J91832L82615l3744n4080
19095A803566m3537j90723J70776J30223Q7119K09300L2706k38078j716q7485
19085A872151o1275J15304q6169k92803l7674K32991P3717N2239J16890K149M2691
19074B030211K69378j24138J63831k9687m214p3813J687J93185K17841j21932
19064B522349r4013j86018l40584l6934J63378m2966K3870P2401J06168R7513
$$ plain form
19054 2285164 2284139 2224154 2574320 2689790 2654383 2801485 2672621 2437720 2212695 2366066
19044 2366066 2600594 2746764 2913007 3042952 3207200 2873313 2676669 2649075 2923380 3106749
19034 3106749 3053119 2925458 2961406 2867122 2810245 2822620 3013779 3218718 3307109 2960697
19024 2960697 2856951 3106499 3207680 3158638 3223646 3260984 3080743 3000454 3089229 3165381
19014 3165381 3300003 3261312 3226605 3116850 3092866 3040953 3055097 3162847 3241183 3502311
19004 3502311 3733956 3857961 3794222 3871113 3698970 3307427 3348820 3381641 3575591 3913781
18994 3913781 4268114 4114398 4044482 4013841 3784778 3728068 3656481 3799269 3928189 3697921
18984 3697921 3712374 4075150 4246490 4420385 4443160 4107392 3738016 3540461 3590742 3726785
$$ packed form
19054B285164j025n9985L50166J15470l5407J47102j28864k34901k25025J53371
19044B366066K34528J46170J66243J29945J64248l33887j96644k7594K74305J83369
19034C106749n3630j27661L5948r4284n6877J2375J91159K04939Q8391l46412
19024B960697j03746K49548J01181m9042O5008L7338j80241q0289Q8775P6152
19014C165381J34622l8691l4707j09755k3984n1913J4144J07750P8336K61128
19004C502311K31645J24005o3739P6891j72143l91543M1393L2821J93950L38190
18994C913781L54333j53716o9916l0641k29063n6710p1587J42788J28920k30268
18984C697921J4453L62776J71340J73895K2775l35768l69376j97555N0281J36043
$$ plain form
18974 3726785 3800959 4038021 4141161 4124469 4219797 4263323 4109891 4103752 4446940 4662362
18964 4662362 4519749 4790169 5147968 5048637 4821313 4623608 4588628 4736742 4771984 4805229
18954 4805229 4691713 4661219 4794823 4931629 5040842 4887238 5285140 5350855 5685696 5656092
18944 5656092 5437078 5263168 5220877 5276898 5396753 5572254 5703034 5910485 5977590 6084733
18934 6084733 5912006 5895351 6126930 5999535 5659841 5852293 6125466 6462285 6288401 6268950
18924 6268950 6481162 6300249 6137141 6039789 6560270 6964624 7074346 6989182 6965690 7026524
18914 7026524 6920052 6692123 6720052 7163572 7279655 7105418 7155241 7479131 7309183 7045282
18904 7045282 7191063 7413933 7529175 7546806 7763819 8020173 7985919 7978082 7751741 7898572
$$ packed form
18974C726785P4174K37062J03140j6692R5328M3526j53432o139L43188K15422
18964D662362j42613K70420L57799r9331k27324j97705l4980J48114L5242L3245
18954D805229j13516l0494J33604J36806J09213j53604L97902O5715L34841k9604
18944E656092k19014j73910m2291N6021J19855J75501J30780K07451O7105J07143
18934F084733j72727j6655K31579j27395l39694J92452K73173L36819j73884j9451
18924F268950K12212j80913j63108r7352N20481M04354J09722q5164k3492O0834
18914G026524j06472k27929K7929M43520J16083j74237M9823L23890j69948k63901
18904G045282J45781K22870J15242J7631K17013K56354l4254p837k26341J46831
$$ plain form
18894 7898572 7864193 7984125 8144338 7968298 8072316 8070094 7880465 7986427 8276300 8334913
18884 8334913 8449352 8112925 8185191 8516039 8594200 8521001 8791271 9021112 9176352 9305060
18874 9305060 9371441 9501478 9247709 9101823 9134130 9159312 9157379 9186351 9463089 9926604
18864 9926604 10224400 10155389 9940587 9909723 10077036 10180953 10354853 10558170 10839423 10719122
18854 10719122 10550841 10787747 10894694 10790020 10784139 11034011 11231736 11442524 11674439 11819668
18844 11819668 11836092 11915160 11973864 12046299 12186113 12203247 12161306 12087044 11982874 12163604
18834 12163604 12513645 12712291 12849780 12923863 13076766 13311918 13408814 13504413 13664240 13772899
18824 13772899 14081372 13882012 13825100 14161355 14640324 14862010 14985741 14914051 14802187 14863666
$$ packed form
18894G898572l4379J19932J60213j76040J04018k222j89629J05962K89873N8613
18884H334913J14439l36427P2266L30848P8161p3199K70270K29841J55240J28708
18874I305060O6381J30037k53769j45886L2307K5182j933K8972K76738M63515
18864I926604K97796o9011k14802l0864J67313J03917J73900K03317K81253j20301
18854A0719122j68281K36906J06947j04674n881K49872J97725K10788K31915J45229
18844A1819668J6424P9068N8704P2435J39814J7134m1941p4262j04170J80730
18834A2163604L50041J98646J37489P4083J52903K35152R6896R5599J59827J08659
18824A3772899L08473j99360n6912L36255M78969K21686J23731p1690j11864O1479
$$ plain form
18814 14863666 15210444 15521739 15555665 15979195 16155312 16167875 16155870 16536092 16618425 16624194
18804 16624194 16962695 17338816 17694172 17765199 17516564 17439825 17569526 17667872 17888758 18264104
18794 18264104 18504203 18906903 19267700 19543649 19663725 19894944 20334375 20629096 20553969
18785 20553969 20764974 21025068 21082999 21451909 21896208 22390160 22510739 22669354 23026720
18776 23026720 23004107 22967329 23419620 23639940 23957721 24131166 24553230 25007737 25354235 25853507
18766 25853507 26364339 26677897 27164979 27389421 27504403 27833986 28306059 28678453 29116983
18757 29116983 29561018 29849211 30188233 30383687 30844259 31420157 31807603 32192947 32856246
18748 32856246 33348910 33741074 34163689 34780155 35078650 35417736 36123036 36710272 37250098
$$ packed form
18814A4863666L46778L11295L3926M23530J76117J2563j2005L80222Q2333N769
18804A6624194L38501L76121L55356P1027k48635p6739J29701R8346K20886L75346
18794A8264104K40099M02700L60797K75949J20076K31219M39431K94721p5127
18785B0553969K11005K60094N7931L68910M44299M93952J20579J58615L57366
18776B3026720k2613l6778M52291K20320L17781J73445M22064M54507L46498M99272
18766B5853507N10832L13558M87082K24442J14982L29583M72073L72394M38530
18757B9116983M44035K88193L39022J95454M60572N75898L87446L85344O63299
18748C2856246M92664L92164M22615O16466K98495L39086P05300N87236N39826
$$ plain form
18739 37250098 37707589 38265394 38978877 39563957 40017772 40697073 41167001 41751518 42266100
18730 42266100 42751626 43385494 43877812 44578881 45162831 46062738 47194729 47962543 48477060
18721 48477060 49174194 49914652 50925068 52249602 53226029 53761846 54387947 55299505 56434305
18712 56434305 57404741 58505263 59424987 60163441 61130654 62542784 63807998 64751690 65875376
18703 65875376 66854484 68061990 69308685 70420280 71789827 73117200 74391460 75838595
18695 75838595 77098529 78304875 80130285 81963567 83533705 85000263 86345108 87674143
18687 87674143 89044855 91099991 92934107 94826088 96533999 98491010 100754083 102690667
18679 102690667 104739638 106705521 108761245 111027615 113372631 115715183 117990523 120537850
$$ packed form
18739C7250098M57491N57805P13483N85080M53815O79301M69928N84517N14582
18730D2266100M85526O33868M92318P01069N83950Q99907J131991P67814N14517
18721D8477060O97134P40458J010416J324534R76427N35817O26101R11558J134800
18712E6434305R70436J100522R19724P38454R67213J412130J265214R43692J123686
18703F5875376R79108J207506J246695J111595J369547J327373J274260J447135
18695G5838595J259934J206346J825410J833282J570138J466558J344845J329035
18687H7674143J370712K055136J834116J891981J707911J957011K263073J936584
18679A02690667K048971J965883K055724K266370K345016K342552K275340K547327
$$ plain form
18671 120537850 123094241 125447505 128083345 130842984 133351588 135820090 138640250 141793525
18663 141793525 144922763 148087199 151131648 154413369 157741069 160932206 164356549 167495957
18655 167495957 171032256 174547298 177945678 181448393 185242498 188975754 192830516 196768535
18647 196768535 200672739 204645240 208598624 212651724 216417311 220041193 223819791 227686931
18639 227686931 231796891 236008396 240060175 243887893 247472010 251153257 254973269 258976475
18631 258976475 262793521 266457417 269898681 273344052 276857633 280380052 283447586 286370118
18623 286370118 288979103 291161420 293607756 295972086 297971761 299845320 301574886 303025179
18615 303025179 304380891 305205500 305613316 306251565 306851960 307063531 307023532 306547162 306003930
$$ packed form
18671A20537850K556391K353264K635840K759639K508604K468502K820160L153275
18663A41793525L129238L164436L044449L281721L327700L191137L424343L139408
18655A67495957L536299L515042L398380L502715L794105L733256L854762L938019
18647A96768535L904204L972501L953384M053100L765587L623882L778598L867140
18639B27686931M109960M211505M051779L827718L584117L681247L820012M003206
18631B58976475L817046L663896L441264L445371L513581L522419L067534K922532
18623B86370118K608985K182317K446336K364330J999675J873559J729566J450293
18615C03025179J355712Q24609M07816O38249O00395K11571l9999m76370n43232
$$ plain form
18606 306003930 305391383 304374512 303035962 301171700 299466273 297570821 295421194 293363546
18598 293363546 291358621 288706097 285814132 283306228 280662471 277571544 274079622 270790648
18590 270790648 267574775 264326139 260784967 257230108 253864051 250412792 246848608 242954742
18582 242954742 239108749 235391724 231735514 228040981 224210895 220500532 216967450 213155536
18574 213155536 209561224 205981236 201993644 198263227 194795914 191460966 188234867 184858154
18566 184858154 181419130 178092250 175069179 171727468 168353952 165168989 162182179 159256523
18558 159256523 156376518 153796328 151215236 148418816 145554945 142864388 140427011 137888874
18550 137888874 135281938 132797120 130368922 127918051 125479951 123263090 121073703 118861622
$$ packed form
18606C06003930o12547j016871j338550j864262j705427j895452k149627k057648
18598B93363546k004925k652524k891965k507904k643757l090927l491922l288974
18590B70790648l215873l248636l541172l554859l366057l451259l564184l893866
18582B42954742l845993l717025l656210l694533l830086l710363l533082l811914
18574B13155536l594312l579988l987592l730417l467313l334948l226099l376713
18566A84858154l439024l326880l023071l341711l373516l184963k986810k925656
18558A59256523k880005k580190k581092k796420k863871k690557k437377k538137
18550A37888874k606936k484818k428198k450871k438100k216861k189387k212081
$$ plain form
18542 118861622 116979447 115151620 113222339 111177534 109255556 107509083 105676226 103968017
18534 103968017 102135597 100429818 98688729 96944641 95310238 93826980 92367399 90767554
18526 90767554 89119133 87498921 86191120 84938118 83609618 82357893 81207177 80065541
18518 80065541 78691676 77401086 76217992 75097540 74024268 72841122 71718670 70744240
18510 70744240 69565262 68374143 67195641 66306263 65187162 64439794 63370274 62479072
18502 62479072 61662782 60922245 60539350 59696518 58745322 57906470 57182671 56353921 55591668
18493 55591668 54863431 54157068 53523606 52730158 51841885 51189739 50908772 50257959 49525133
18484 49525133 49114038 48367381 47650861 46628720 46117233 45803651 45111721 44624095 44418938
$$ packed form
18542A18861622j882175j827827j929281k044805j921978j746473j832857j708209
18534A03968017j832420j705779j741089j744088j634403j483258j459581j599845
18526I0767554j648421j620212j307801j253002j328500j251725j150716j141636
18518H0065541j373865j290590j183094j120452j073272j183146j122452r74430
18510G0744240j178978j191119j178502q89378j119101p47368j069520q91202
18502F2479072q16290p40537l82895q42832r51196q38852p23799q28750p62253
18493E5591668p28237p06363o33462p93448q88273o52146k80967o50813p32826
18484D9525133m11095p46657p16520j022141n11487l13582o91930m87626k05157
$$ plain form
18475 44418938 44053697 43639074 43086575 42380731 42061587 41770684 41069009 40328508 39822838
18466 39822838 39231411 38722802 38314774 38103108 37657954 37346801 37024889 36558890 36202127
18457 36202127 35820368 35414958 35252561 35292984 34628970 34286192 34177176 34033067 33806310
18448 33806310 33248662 32614427 32023797 31666793 31364588 31056535 30772567 30722845 30522817
18439 30522817 30501327 30323603 30027932 29884558 29679853 29583948 29567945 29075995 28623180 28385118
18429 28385118 28425781 28262191 28087605 28131264 28227567 28233307 27829149 27659954 27569427 27508566
18419 27508566 27339035 27219872 27286822 27174386 26821073 26585557 26119837 25744928 25580280
18410 25580280 25440608 24913437 24767060 24736215 24266588 24081125 23731665 23454456 23339427
$$ packed form
18475D4418938l65241m14623n52499p05844l19144k90903p01675p40501n05670
18466C9822838n91427n08609m08028k11666m45154l11153l21912m65999l56763
18457C6202127l81759m05410j62397M0423o64014l42778j09016j44109k26757
18448C3806310n57648o34235n90630l57004l02205l08053k83968m9722k00028
18439C0522817k1490j77724k95671j43374k04705r5905j6003m91950m52815k38062
18429B8385118M0663j63590j74586M3659R6303N740m04158j69195r0527o0861
18419B7508566j69531j19163O6950j12436l53313k35516m65720l74909j64648
18410B5580280j39672n27171j46377l0845m69627j85463l49460k77209j15029
$$ plain form
18401 23339427 22885176 22511801 22442124 22337309 21909711 21728333 21443032 21177485 20877951
18392 20877951 20607927 20208371 19945559 19927117 20227614 20206361 20106512 19773472 19375159 19000842
18382 19000842 18843983 18633178 18182819 18039076 17938258 17831396 17915160 17785236 17745002 17755197
18372 17755197 17559170 17388722 17075534 16804080 16827245 16699543 16928955 16786853 16373556
18363 16373556 16261471 16378614 16230915 16264098 16130679 15960559 15542457 15333070 15409205 15507196
18353 15507196 15560885 15795732 15590043 15291140 14991497 14890223 14664902 14483777 14608847
18344 14608847 14519293 14506041 14717963 14664380 14283773 14047878 14010860 14082605 13928575 14030380
18334 14030380 14246961 14021336 13687457 13496961 13436851 13244660 13360883 13402801 13497074 13563067
$$ packed form
18401B3339427m54251l73375o9677j04815m27598j81378k85301k65547k99534
18392B0877951k70024l99556k62812j8442L00497k1253r9849l33040l98313l74317
18382A9000842j56859k10805m50359j43743j00818j06862Q3764j29924m0234J0195
18372A7755197j96027j70448l13188k71454K3165j27702K29412j42102m13297
18363A6373556j12085J17143j47699L3183j33419j70120m18102k09387P6135R7991
18353A5507196N3689K34847k05689k98903k99643j01274k25321j81125J25070
18344A4608847q9554j3252K11922n3583l80607k35895l7018P1745j54030J01805
18334A4030380K16581k25625l33879j90496o0110j92191J16223M1918R4273O5993
$$ plain form
18324 13563067 13308196 12838458 12759822 12901732 12824990 12761092 12575471 12304291 12484776 12531733
18314 12531733 12649033 12365816 12091859 12159834 12165445 12058012 11816436 11702676 11925696 12162032
18304 12162032 12003833 11795616 11748452 11534199 11320443 11206629 11337935 11320192 11210419 11165843
18294 11165843 11135746 10934746 10590319 10379216 10618657 10715584 10653922 10709403 10562402 10511289
18284 10511289 10541803 10370515 10091054 9801386 10035751 10151536 9996375 9763733 9933083
18275 9933083 9921820 9767643 9871336 9935182 10018227 9613902 9529441 9217960 9072331 9233687
18265 9233687 8898815 8830563 8894364 8848190 8812721 8703755 8675366 8629123 8623878 8803974 9009737
18254 9009737 9099370 8797623 8495539 8600891 8603902 8647565 8822905 8799918 8509320 8361502
$$ packed form
18324A3563067k54871m69738p8636J41910p6742o3898j85621k71180J80485M6957
18314A2531733J17300k83217k73957O7975N611j07433k41576j13760K23020K36336
18304A2162032j58199k08217m7164k14253k13756j13814J31306j7743j09773m4576
18294A1165843l0097k01000l44427k11103K39441R6927o1662N5481j47001n1113
18284A0511289L0514j71288k79461k89668K34365J15785j55161k32642J69350
18275I933083j1263j54177J03693O3846Q3045m04325q4461l11481j45629J61356
18265I233687l34872o8252O3801m6174l5469j08966k8389m6243n245J80096K05763
18254I009737Q9633l01747l02084J05352L011M3663J75340k2987k90598j47818
$$ plain form
18244 8361502 8074931 7934494 8164585 8335695 8131182 8071794 8065902 8315074 8402117 8411515
18234 8411515 8527416 8158756 7898026 7839572 7727695 7883939 8067036 7859400 7717515 7677457
18224 7677457 7845934 7864445 7630097 7232994 7290920 7409793 7165500 6981018 6961030 6800920
18214 6800920 6898329 7039882 7210334 7023051 7019970 7244591 7461306 7506036 7502055 7551518 7213181
18203 7213181 6825230 6937048 6768568 6916892 6956134 6696905 6725876 6617941 6659822 6606636
18193 6606636 6273953 6158683 6227175 6402435 6363237 6349800 6396082 6474960 6384847 6604999
18183 6604999 6515737 6427884 6400952 6127893 6128928 6052889 6058316 6295007 6463449 6463341 6548824
18172 6548824 6496459 6270188 6270668 6290440 6343041 6245082 6097153 5956163 5824973 5701695 5806962
$$ packed form
18244H361502k86571j40437K30091J71110k04513n9388n892K49172Q7043R398
18234H411515J15901l68660k60730n8454j11877J56244J83097k07636j41885m0058
18224G677457J68477J8511k34348l97103N7926J18873k44293j84482j9988j60110
18214F800920R7409J41553J70452j87283l081K24621K16715M4730l981M9463l38337
18203G213181l87951J11818j68480J48324L9242k59229K8971j07935M1881n3186
18193F606636l32683j15270O8492J75260l9198j3437M6282P8878r0113K20152
18183F604999q9262q7853k6932k73059J035p6039N427K36691J68442j08Q5483
18172F548824n2365k26271M80J9772N2601r7959j47929j40990j31190j23278J05267
$$ plain form
18161 5806962 5970186 5924915 6116020 6141061 6189999 6034888 5736211 5511442 5476089 5390040
18151 5390040 5355066 5384421 5498372 5579269 5341072 5275252 5517373 5702782 5682321 5608347
18141 5608347 5407972 5631403 5952473 6078233 5697429 5362989 5317664 5486845 5456827 5529210
18131 5529210 5536052 5553345 5347355 5451208 5528286 5463689 5153402 5142498 5260304 5099208
18121 5099208 5146205 5139443 5240243 5162950 5081782 4995286 4920426 4965140 5041183 5075728 5163650
18110 5163650 5372707 5572067 5600160 5238575 4999199 5137401 5401568 5374575 5120078 4924761
18100 4924761 5147842 4906444 4659024 4659924 4676782 4499374 4373235 4427338 4251084 4229969
18090 4229969 4282675 4514195 4761738 4690551 4598509 4676553 4660990 4822339 4837191 4827692 4786792
$$ packed form
18161E806962J63224m5271J91105K5041M8938j55111k98677k24769l5353q6049
18151E390040l4974K9355J13951Q0897k38197o5820K42121J85409k0461p3974
18141E608347k00375K23431L21070J25760l80804l34440m5325J69181l0018P2383
18131E529210O842J7293k05990J03853P7078o4597l10287j0904J17806j61096
18121E099208M6997o762J00800p7293q1168q6496p4860M4714P6043L4545Q7922
18110E163650K09057J99360K8093l61585k39376J38202K64167k6993k54497j95317
18100D924761K23081k41398k47420R00J6858j77408j26139N4103j76254k1115
18090D229969N2706K31520K47543p1187r2042P8044j5563J61349J4852r499m0900
$$ plain form
18079 4786792 4618510 4366348 4253950 4249291 4139925 4344623 4423236 4328113 4377616 4308305
18069 4308305 4456060 4569109 4416967 4343834 4258171 4377268 4449674 4466183 4735700 4835302
18059 4835302 4803300 4783422 4498267 4449183 4536526 4285734 4396394 4497809 4469780 4672237
18049 4672237 4752398 4411666 3996009 3957154 3955735 3977559 4050671 3896187 4127584 4292456
18039 4292456 4281815 4172212 3938263 3956662 4014309 4035670 4183977 4339620 4235647 3922180
18029 3922180 4062027 4189422 4154150 4184842 4224611 4474216 4626280 4548930 4413178 4311903
18019 4311903 4212167 4342472 4241671 3988236 3948144 4009753 4181765 3879575 3798955 3983118
18009 3983118 4131483 4379080 4373617 4271736 4094633 4116020 3933340 3968025 4268243 4194909
$$ packed form
18079D786792j68282k52162j12398m659j09366K04698P8613r5123M9503o9311
18069D308305J47755J13049j52142p3133q5663J19097P2406J6509K69517R9602
18059D835302l2002j9878k85155m9084Q7343k50792J10660J01415k8029K02457
18049D672237Q0161l40732m15657l8855j419K1824P3112j54484K31397J64872
18039D292456j0641j09603k33949J8399N7647K1361J48307J55643j03973l13467
18029C922180J39847J27395l5272L0692L9769K49605J52064p7350j35752j01275
18019D311903r9736J30305j00801k53435m0092O1609J72012l02190q0620J84163
18009C983118J48365K47597n463j01881j77103K1387j82680L4685L00218p3334
$$ plain form
17999 4194909 4145621 4372035 4350831 4024661 4116828 4105252 3975788 3761519 3754553 4026907
17989 4026907 3985321 3683422 3771838 3966481 3982879 3905903 4224030 4209922 3862062 3861215 3951724
17978 3951724 4061185 4061395 4143433 4192853 4237284 4141543 3889430 3712407 3711686 3801405 3993017
17967 3993017 4087761 4208749 4288626 4070188 3713410 3783788 3785663 3636556 3553758 3479595 3329346
17956 3329346 3418936 3629055 3586640 3773247 3726871 3617926 3646629 3583071 3548700 3802706
17946 3802706 4193985 4300621 4317066 4456174 4409520 4204772 4205284 4125479 3829211 3857331 4183750
17935 4183750 3964460 3792898 3868490 3720473 3635941 3618737 3635373 3689375 3761383 3794356 3486516
17924 3486516 3488564 3580920 3477742 3413547 3561208 3605181 3199534 3163062 3315138 3321134 3524379
$$ packed form
17999D194909m9288K26414k1204l26170R2167j1576j29464k14269o966K72354
17989D026907m1586l01899Q8416J94643J6398p6976L18127j4108l47860q47R0509
17978C951724J09461K10Q2038M9420M4431r5741k52113j77023p21Q9719J91612
17967C993017R4744J20988P9877k18438l56778P0378J875j49107q2798p4163j50249
17956C329346Q9590K10119m2415J86607m6376j08945K8703o3558l4371K54006
17946C802706L91279J06636J6445J39108m6654k04748N12p9805k96268K8120L26419
17935D183750k19290j71562P5592j48017q4532j7204J6636N4002P2008L2973l07840
17924C486516K048R2356j03178o4195J47661M3973m05647l6472J52076N996K03245
$$ plain form
17913 3524379 3592275 3708808 3446991 3293786 3600429 3821836 3972357 3804091 3503159 3142914
17903 3142914 2925060 3260285 3403295 3568727 3530205 3546248 3532286 3454026 3149919 2811452
17893 2811452 2922333 3070942 3589753 3775025 3643547 3787244 3788577 3682423 3712364 3435139
17883 3435139 3371524 3282408 3321055 3273311 2945812 2938206 3037413 3068888 3357607 3348764 3239700
17872 3239700 3100772 3253129 3049365 2931847 3022000 3126207 3143064 3034059 2748361 2753437
17862 2753437 2899522 2825480 2972372 2898314 2848444 3100038 3055095 3002833 2944126 2879403 3128562
17851 3128562 3246444 3057036 2674140 2882493 3126788 3071307 3135936 3164371 3163047 3039225
17841 3039225 3009575 2999679 2811806 2496267 2967452 3137636 2941824 2592223 2498864 2529156
$$ packed form
17913C524379O7896J16533k61817j53205L06643K21407J50521j68266l00932l60245
17903C142914k17854L35225J43010J65432l8522J6043j3962p8260l04107l38467
17893B811452J10881J48609N18811J85272j31478J43697J333j06154K9941k77225
17883C435139o3615q9116L8647m7744l27499p606R9207L1475K88719q843j09064
17872C239700j38928J52357k03764j17518R0153J04207J6857j09005k85698N076
17862B753437J46085p4042J46892p4058m9870K51594m4943n2262n8707o4723K49159
17851C128562J17882j89408l82896K08353K44295n5481O4629K8435j324j23822
17841C039225k9650r896j87873l15539M71185J70184j95812l49601r3359L0292
$$ plain form
17831 2529156 2400565 2433139 2496183 2571653 2865982 2962993 3124201 3363301 3342315 3061870
17821 3061870 2709363 2654942 2921523 3041150 2814793 2789506 2722503 2623401 2689336 2781462
17811 2781462 2855194 2712584 2724141 2720078 2709861 2693612 2502696 2573558 2534376 2738387 2740195
17800 2740195 2901348 2989142 2934341 2932610 2874589 2730246 2820413 2844897 2924818 2785565 2554341
17789 2554341 2707249 2953377 2818153 2302948 2400683 2491365 2682489 2632742 2715217 2704023
17779 2704023 2614445 2571016 2775026 2707404 2869172 3101954 2841753 2597873 2532198 2525946
17769 2525946 2695891 2676141 2913938 2951475 2964308 2756943 2649260 2389227 2278369 2291888
17759 2291888 2465044 2332126 2386020 2391040 2497633 2450211 2392060 2408931 2488418 2461734 2556889
$$ packed form
17831B529156j28591L2574O3044P5470K94329R7011J61208K39100k0986k80445
17821C061870l52507n4421K66581J19627k26357k5287o7003r9102O5935R2126
17811B781462P3732j42610J1557m063j0217j6249j90916P0862l9182K04011J808
17800B740195J61153Q7794n4801j731n8021j44343R0167K4484P9921j39253k31224
17789B554341J52908K46128j35224n15205R7735R0682J91124m9747Q2475j1194
17779B704023q9578m3429K04010o7622J61768K32782k60201k43880o5675o252
17769B525946J69945j9750K37797L7537J2833k07365j07683k60033j10858J3519
17759B291888J73156j32918N3894N020J06593m7422n8151J6871P9487k6684R5155
$$ plain form
17748 2556889 2678899 2540018 2467140 2473210 2339402 2395572 2423519 2421389 2587646 2402464 2299330
17737 2299330 2400278 2542813 2613649 2453570 2675327 2649896 2324864 2206351 2269659 2205964
17727 2205964 2114752 2197170 2209168 2515031 2881111 2682738 2485385 2170035 2077267 2007369
17717 2007369 2171350 2252363 2297716 2038059 2128361 2307442 2109287 1908561 1878702 2034437
17707 2034437 2263458 2440325 2373894 2384489 2146918 1934031 1936826 2071217 2087662 2067530
17697 2067530 2097327 2451496 2180148 1690795 1566215 1492714 1750392 1821473 1733047 1762726
17687 1762726 1854766 2143683 2444218 2497713 2398392 2425873 2358342 2232089 2158242 2185435 2325980
17676 2325980 2249531 2168886 2168092 2079226 2084940 2182986 2365635 2436152 2226460 2401068 2517795
$$ packed form
17748B556889J22010j38881p2878O070j33808N6170K7947k130J66257j85182j03134
17737B299330J00948J42535P0836j60079K21757k5431l25032j18513O3308o3695
17727B205964r1212Q2418J1998L05863L66080j98373j97353l15350r2768o9898
17717B007369J63981Q1013M5353k59657R0302J79081j98155k00726k9859J55735
17707B034437K29021J76867o6431J0595k37571k12887K795J34391J6445k0132
17697B067530K9797L54169k71348m89353j24580p3501K57678P1081q8426K9679
17687A762726R2040K88917L00535N3495r9321K7481o7531j26253p3847K7193J40545
17676B325980p6449q0645p94q8866N714R8046J82649P0517k09692J74608J16727
$$ plain form
17665 2517795 2419832 2261795 2242557 2177164 2138566 2131932 2074586 2073448 2226917 2153324 1908888
17654 1908888 1797168 1872618 1924029 2027714 2066538 2166477 2255516 1996637 2040736 1846361
17644 1846361 1862012 2019008 2173058 2084072 1948701 1863817 1999887 2111274 1992624 1721571
17634 1721571 1713723 1548019 1719825 1941700 2022911 1929277 2093511 2250588 1949266 1771764
17624 1771764 1706448 1629151 1631368 1487155 1665598 1902622 1880599 1749748 1858815 1738371
17614 1738371 1806837 2027662 1954325 1855842 1795882 2071763 2016680 1821604 1857287 2005427
17604 2005427 2313452 2149843 2047751 1998191 2004251 2017824 1734583 1659767 1742114 1924363
17594 1924363 1925493 1868260 1889448 1889123 1710409 1687937 1586296 1569625 1863061 1915995 2072344
$$ packed form
17665B517795r7963j58037j9238o5393l8598o634n7346j138J53469p3593k44436
17654A908888j11720P5450N1411J03685L8824R9939Q9039k58879M4099j94375
17644A846361J5651J56996J54050q8986j35371q4884J36070J11387j18650k71053
17634A721571p848j65704J71806K21875Q1211r3634J64234J57077l01322j77502
17624A771764o5316p7297K217j44213J78443K37024k2023j30851J09067j20444
17614A738371O8466K20825p3337r8483n9960K75881n5083j95076L5683J48140
17604B005427L08025j63609j02092m9560O060J3573k83241p4816Q2347J82249
17594A924363J130n7233K1188l25j78714k2472j01641j6671K93436N2934J56349
$$ plain form
17583 2072344 1937428 1983876 2069779 2154689 2127167 2134445 2245722 2404429 2375406 2322836 2208820
17572 2208820 1962811 1785544 2183249 2525119 2422574 2508262 2732761 2848943 2679282 2771513
17562 2771513 3063721 3119466 3113365 3465585 3688426 3678656 3678835 3486911 3466185 3442898 3674286
17551 3674286 3722103 3583096 3500222 3366312 3495855 3725026 3825438 3639531 3419968 3273519
17541 3273519 2845993 2472757 2379431 2486161 2762724 2670849 2551961 2402056 2267230 2160189
17531 2160189 2329010 2439476 2539647 2365406 2183041 2087736 2157647 2340607 2307026 2081163
17521 2081163 2259997 2380864 1948548 1676220 1874493 1788621 1708076 1711500 1840449 1928452
17511 1928452 1858671 1602480 1690425 1793796 1726912 1661727 1706775 1866487 1936927 1928822 1571398
$$ packed form
17583B072344j34916M6448Q5903Q4910k7522P278J11277J58707k9023n2570j14016
17572B208820k46009j77267L97705L41870j02545Q5688K24499J16182j69661R2231
17562B771513K92208N5745o101L52220K22841r770J79j91924k0726k3287K31388
17551C674286M7817j39007q2874j33910J29543K29171J00412j85907k19563j46449
17541C273519m27526l73236r3326J06730K76563r1875j18888j49905j34826j07041
17531B160189J68821J10466J00171j74241j82365r5305O9911J82960l3581k25863
17521B081163J78834J20867m32316k72328J98273q5872q0545L424J28949Q8003
17511A928452o9781k56191Q7945J03371o6884o5185M5048J59712P0440q105l57424
$$ plain form
17500 1571398 1248343 1156125 1370176 1589161 1609325 1425296 1047830 827223 1071223 1368269
17490 1368269 1276321 1229839 1317589 1365458 1495796 1623227 1430641 1209412 1129707 1141119
17480 1141119 1149280 1239956 1404974 1554022 1581790 1235321 969019 950305 608788 398794
17470 398794 486255 771842 825097 1153419 1302198 1170765 1232727 988176 1008322 1191450
17460 1191450 1243318 1330384 1297086 1269499 1334209 1510440 1624354 1535347 1555174 1707385 1703672
17449 1703672 1778897 1752997 1645456 1414654 1235758 1135660 1199444 1275577 1470496 1879019
17439 1879019 1854559 1498207 1273811 1317633 1485368 1591402 1509651 1287304 1317108 1360528
17429 1360528 1297459 1458627 1307237 1298623 1342765 1360462 1325658 1398190 1371627 1181328 1145521
$$ packed form
17500A571398l23055r2218K14051K18985K0164j84029l77466k20607K44000K97046
17490A368269r1948m6482Q7750M7869J30338J27431j92586k21229p9705J1412
17480A141119Q161R0676J65018J49048K7768l46469k66302j8714l41517k09994
17470C98794Q7461K85587N3255L28322J48779j31433O1962k44551K0146J83128
17460A191450N1868Q7066l3298k7587O4710J76231J13914q9007J9827J52211l713
17449A703672P5225k5900j07541k30802j78896j00098O3784P6133J94919M08523
17439A879019k4460l56352k24396M3822J67735J06034q1751k22347K9804M3420
17429A360528o3069J61168j51390q614M4142J7697l4804P2532k6563j90299l5807
$$ plain form
17418 1145521 1471805 1645048 1706438 1555663 1463063 1443254 1526702 1704969 1566951 1314967
17408 1314967 1342877 1291962 862508 727054 619680 767910 1133005 1130003 925233 1215069
17398 1215069 1350283 1420737 1648389 1601850 1461521 1419735 1152109 1114289 1270191 1381122
17388 1381122 1569659 1681884 1489703 1538614 1636575 1641548 1534038 1416666 1351044 1445311
17378 1445311 1502675 1471311 1454459 1152552 992822 1084623 1241526 1231364 1080837 1052406
17368 1052406 1134634 1109301 1268800 1332981 1178870 1125098 1224625 1266847 1309585 1338247 1119196
17357 1119196 1103435 1062481 956961 773307 709609 801543 756197 811155 963980 1189276
17347 1189276 1186113 1127241 909168 1140407 1075190 867587 859482 1036298 738823 578087
$$ packed form
17418A145521L26284J73243O1390j50775r2600j9809Q3448J78267j38018k51984
17408A314967K7910n0915m29454j35454j07374J48230L65095l002k04770K89836
17398A215069J35214P0454K27652m6539j40329m1786k67626l7820J55902J10931
17388A381122J88537J12225j92181M8911R7961M973j07510j17372o5622R4267
17378A445311N7364l1364j6852l01907j59730R1801J56903j0162j50527k8431
17368A052406Q2228k5333J59499O4181j54111n3772R9527M2222M2738K8662k19051
17357A119196j5761m0954j05520j83654o3698R1934m5346N4958J52825K25296
17347A189276l163n8872k18073K31239o5217k07603q105J76816k97475j60736
$$ plain form
17337 578087 495969 603846 895930 1035331 974948 1158360 1274295 1111532 703128 671714
17327 671714 717286 586107 597733 627805 829539 862396 469657 302665 416684 835991
17317 835991 849773 739255 932198 733526 618268 569588 639877 800203 969549 1022924
17307 1022924 1051380 955933 862806 1029483 913906 796375 1003781 1115747 1170518 1136961
17297 1136961 774647 741780 991620 1216595 1189325 934582 713527 389878 241586 311660
17287 311660 710134 760384 496584 590649 655177 846558 920422 974654 998195 872626 984858
17276 984858 1019423 850152 600125 676713 946595 628744 438825 519540 557201 705364
17266 705364 896442 769370 682354 270057 45843 142822 485158 656289 618106 483523
$$ packed form
17337E78087q2118J07877K92084J39401o0383J83412J15935j62763m08404l1414
17327F71714M5572j31179J1626L0072K01734L2857l92739j66992J14019M19307
17317H35991J3782j10518J92943j98672j15258m8680P0289J60326J69346N3375
17307A022924K8456r5447r3127J66677j15577j17531K07406J11966N4771l3557
17297A136961l62314l2867K49840K24975k7270k54743k21055l23649j48292P0074
17287C11660L98474N0250k63800R4065O4528J91381P3864N4232K3541j25569J12232
17276I84858L4565j69271k50027P6588K69882l17851j89919Q0715L7661J48163
17266G05364J91078j27072q7016m12297k24214R6979L42336J71131l8183j34583
$$ plain form
17256 483523 513647 684951 916176 957049 956744 871273 584182 641690 969636 1238014 1200921
17245 1200921 1063568 896323 826411 823307 919707 935596 995984 1101074 1045870 925275 830199
17234 830199 961226 882089 680249 632713 614373 514179 404343 493897 415591 166254
17224 166254 168413 515255 529691 591383 554149 562230 881562 1022860 715558 371727 385243
17213 385243 486759 725310 899670 1025118 870553 862306 765319 628426 680112 871396
17203 871396 1082125 1237710 1243051 1052333 970791 1005854 664959 445905 456357 510203 735447
17192 735447 804728 767894 593462 587712 622504 513356 284822 381751 445629 568100 716884
17181 716884 765359 634129 403563 247870 239124 360747 370247 316044 292890 465344 679479
$$ packed form
17256D83523L0124J71304K31225M0873l05q5471k87091N7508L27946K68378l7093
17245A200921j37353j67245o9912l104R6400J5889O0388J05090n5204j20595r5076
17234H30199J31027p9137k01840m7536j8340j00194j09836Q9554p8306k49337
17224A66254K159L46842J4436O1692l7234Q081L19332J41298l07302l43831J3516
17213C85243J01516K38551J74360J25448j54565q247r6987j36893N1686J91284
17203H71396K10729J55585N341j90718q1542L5063l40895k19054J0452N3846K25244
17192G35447O9281l6834j74432n750L4792j09148k28534R6929O3878J22471J48784
17181G16884M8475j31230k30566j55693q746J21623R500n4203k3154J72454K14135
$$ plain form
17170 679479 638547 339072 286676 533008 408145 536828 629035 568408 870250 990765
17160 990765 969684 850751 754863 847320 476555 621611 617098 821530 737997 506603 680504
17149 680504 596737 420301 343913 754853 974642 871903 726654 549556 660923 630915
17139 630915 605520 715221 694168 370404 68142 66584 406345 557548 740486 746960 234936
17128 234936 -32376 168255 411143 431643 357965 314801 409125 611925 897569 849834
17118 849834 476097 557474 738583 835812 861768 714989 534710 410967 611927 813208
17108 813208 473082 158987 190991 246240 354288 245832 184317 145161 525061 707666
17098 707666 513934 334566 297454 128242 162093 189973 559076 756170 702680 459049
$$ packed form
17170F79479m0932k99475n2396K46332j24863J28683R2207o0627L01842J20515
17160I90765k1081j18933r5888R2457l70765J45056m513K04432q3533k31394J73901
17149F80504q3767j76436p6388M10940K19789j02739j45249j77098J11367l0008
17139F30915k5395J09701k1053l23764l02262j558L39761J51203J82938O474n12024
17128B34936k67312K00631K42888K0500p3678m3164R4324K02800K85644m7735
17118H49834l73737Q1377J81109R7229K5956j46779j80279j23743K00960K01281
17108H13208l40126l14095L2004N5249J08048j08456o1515l9156L79900J82605
17098G07666j93732j79368l7112j69212L3851K7880L69103J97094n3490k43631
$$ plain form
17088 459049 602515 557932 582701 606915 613736 762935 592054 699775 998653 1103552
17078 1103552 1146960 1188700 1078930 802715 499290 393528 558806 659706 535368 523277
17068 523277 592308 683018 794649 950405 1088204 1215477 1370776 1422828 1113309 780681
17058 780681 636839 933353 980154 936465 971601 1017475 957573 790213 836081 831282 987293
17047 987293 1151143 1310370 1457156 1481732 1421834 1332281 1380747 1455243 1485898 1307665 1174765
17036 1174765 1172356 1171819 1419381 1475717 1596253 1676482 1738692 1523358 1347075 1185678 911351
17025 911351 1017454 1078548 1199943 1114054 1171414 1229847 1038498 910753 961039 1251066
17015 1251066 1509662 1429752 1272218 1000964 924414 634905 533863 983409 1317362 1237688
$$ packed form
17088D59049J43466m4583K4769K4214O821J49199j70881J07721K98878J04899
17078A103552M3408M1740j09770k76215l03425j05762J65278J00900j24338j2091
17068E23277O9031R0710J11631J55756J37799J27273J55299N2052l09519l32628
17058G80681j43842K96514M6801m3689L5136M5874n9902j67360M5868m799J56011
17047I87293J63850J59227J46786K4576n9898q9553M8466P4496L0655j78233j32900
17036A174765k409n37K47562N6336J20536Q0229O2210k15334j76283j61397k74327
17025I11351J06103O1094J21395q5889N7360N8433j91349j27745N0286K90027
17015A251066K58596p9910j57534k71254p6550k89509j01042M49546L33953p9674
$$ plain form
17005 1237688 1073699 813841 969953 1191404 1446061 1256087 913638 681432 366458
16996 366458 682868 811464 691722 657832 945639 1154066 1118281 842756 441491 303597
16986 303597 598106 526973 589728 454994 436141 425981 417833 194522 242537 403825 576475
16975 576475 699462 829042 845724 729282 670897 721407 290859 45207 291885 366843
16965 366843 362991 397210 321513 310322 345705 342805 505572 250648 78827 3364 -85516
16954 -85516 -16805 378403 578684 529824 362106 163490 32759 -307657 -169999 228263
16944 228263 450664 217253 177018 309242 538417 509809 317506 262822 160709 98658
16934 98658 189757 200363 354344 396055 174663 74266 237077 340146 226480 77503
$$ packed form
17005A237688j63989k59858J56112K21451K54657j89974l42449k32206l14974
16996C66458L16410J28596j19742l3890K87807K08427l5785k75525m01265j37894
16986C03597K94509p1133O2755j34734j8853j0160q148k23311M8015J61288J72650
16975E76475J22987J29580J6682j16442n8385N0510m30548k45652K46678P4958
16965C66843l852L4219p5697j1191L5383k900J62767k54924j71821p5463q8880
16954h5516O8711L95208K00281m8860j67718j98616j30731l40416J37658L98262
16944B28263K22401k33411m0235J32224K29175k8608j92303n4684j02113o2051
16934I8658R1099J0606J53981M1711k21392j00397J62811J03069j13666j48977
$$ plain form
16924 77503 62769 225607 275398 280974 105601 200053 577327 497655 154355 34306 132165
16913 132165 259019 403130 566149 552803 480327 402790 343296 438277 737114 623008
16903 623008 150524 -70224 22247 135173 304033 359611 503298 443585 364843 318480
16893 318480 404839 334632 325618 155702 149917 343603 294930 174374 179890 536748 510918
16882 510918 191661 199085 276548 211098 193604 7848 -134728 292163 397839 329679 322667
16871 322667 399338 472900 491925 472538 432763 242227 157505 222973 160904 6073 62060
16860 62060 219903 445211 315208 331970 251077 277153 314677 272108 85912 83364 7518
16849 7518 -58968 -277409 -2888 349208 341702 411641 563021 585878 296513 125537 -12347
$$ packed form
16924G7503j4734J62838M9791N576j75373R4452L77274p9672l43300j20049R7859
16913A32165J26854J44111J63019j3346p2476p7537n9494R4981K98837j14106
16903F23008m72484k20748R2471J12926J68860N5578J43687n9713p8742m6363
16893C18480Q6359p0207r014j69916n785J93686m8673j20556N516L56858k5830
16882E10918l19257P424P7463o5450j7494j85756j42576M26891J05676o8160p012
16871C22667P6671P3562J9025j9387l9775j90536q4722O5468o2069j54831N5987
16860F2060J57843K25308j30003J6762q0893K6076L7524m2569j86196k548p5846
16849G518o6486k18441K74521L52096p506O9939J51380K2857k89365j70976j37884
$$ plain form
16838 -12347 -107732 123559 128085 144557 42897 75932 266978 491904 526626 250338 -75582
16827 -75582 -116233 43584 180324 298336 225577 74361 79814 38636 -65974 -205568 -187644
16816 -187644 -377886 -50258 316865 452894 569819 763695 683327 583030 290991 166505
16806 166505 99343 17518 161177 220601 490272 575743 513273 540644 295322 317410 190865
16795 190865 130319 258946 294100 448039 550852 642973 627735 645374 584820 420000 256768
16784 256768 59015 242213 346382 265395 512084 546294 552983 512517 374908 199499
16774 199499 -140439 -221517 -103494 -201236 -148509 -149594 -3265 86279 128220 67279 36287
16763 36287 56905 260543 415311 550357 664459 244439 -113148 -61558 186853 323981
$$ packed form
16838a2347r5385K31291M526J6472j01660L3035J91046K24926L4722k76288l25920
16827g5582m0651J59817J36740J18012p2759j51216N453m1178j04610j39594J7924
16816a87644j90242L27628L67123J36029J16925J93876q0368j00297k92039j24486
16806A66505o7162q1825J43659N9424K69671Q5471o2470K7371k45322K2088j26545
16795A90865o0546J28627L5154J53939J02813R2121j5238J7639o0554j64820j63232
16784B56768j97753J83198J04169q0987K46689L4210O689m0466j37609j75409
16774A99499l39938q1078J18023r7742N2727j085J46329Q9544M1941o0941l0992
16763C6287K0618K03638J54768J35046J14102m20020l57587N1590K48411J37128
$$ plain form
16753 323981 191327 389029 412768 445680 324925 549913 448136 -136021 -429277 155769
16743 155769 165888 173268 347163 199611 363414 408173 131320 348985 569323 541165
16733 541165 428703 258363 43047 123414 217923 435070 252947 197863 133936 149145
16723 149145 420478 588456 411537 251277 169365 116750 367030 294823 24451 -253920
16713 -253920 -12981 16629 16675 47098 -129561 -79296 -171420 103253 347570 494988 534783
16702 534783 187964 1118 290092 368810 150812 -82125 21043 115185 163043 114678
16692 114678 30412 -100311 -81637 -109847 60624 -134524 -85928 -117570 -191943 -203455 -380501
16681 -380501 -254596 17163 280369 145467 89722 317302 571712 511552 350276 271864
$$ packed form
16753C23981j32654J97702K3739L2912j20755K24988j01777n84157k93256N85046
16743A55769J0119P380J73895j47552J63803M4759k76853K17665K20338k8158
16733E41165j12462j70340k15316Q0367R4509K17147j82123n5084o3927J5209
16723A49145K71333J67978j76919j60260q1912n2615K50280p2207k70372k78371
16713b53920K40939K9610M6L0423j76659N0265r2124K74673K44317J47418L9795
16702E34783l46819j86846K88974P8718k17998k32937J03168R4142M7858m8365
16692A14678q4266j30723J8674k8210J70471j95148M8596l1642p4373j1512j77046
16681c80501J25905K71759K63206j34902n5745K27580K54410o0160j61276p8412
$$ plain form
16671 271864 176424 1799 17889 123328 192723 83681 47238 254914 189973 223547 391559
16660 391559 374265 246223 231680 150971 -15700 115834 282706 281975 273256 252272 225557
16649 225557 306895 195189 240942 456448 666701 444691 274835 36617 108835 171638
16639 171638 146793 171569 94970 5516 -128155 -89251 -142656 49191 142975 392446 381987
16628 381987 253831 363685 178083 366388 394015 299343 110972 268495 363464 260131
16618 260131 483197 656014 358206 278481 411641 209659 -24436 -64275 -183238 -253744
16608 -253744 -221558 -60732 -47707 69924 124387 129701 248597 238922 183602 -95064 -322403
16597 -322403 -66806 436816 311147 -34046 193920 152783 72454 -55367 49829 150107
$$ packed form
16671B71864r5440j74625J6090J05439O9395j09042l6443K07676o4941L3574J68012
16660C91559j7294j28042j4543q0709j66671J31534J66872p31q719k0984k6715
16649B25557Q1338j11706M5753K15506K10253k22010j69856k38218P2218O2803
16639A71638k4845K4776p6599q9454j33671L8904n3405J91847R3784K49471j0459
16628C81987j28156J09854j85602J88305K7627r4672j88371J57523R4969j03333
16618B60131K23066J72817k97808p9725J33160k01982k34095l9839j18963p0506
16608b53744L2186J60826J3025J17631N4463N314J18896r675n5320k78666k27339
16597c22403K55597N03622j25669l45193K27966m1137q0329j27821J05196J00278
$$ plain form
16587 150107 40877 18222 214751 152203 111586 -4162 -194514 -27124 142521 166977
16577 166977 -31912 -137229 -26687 39224 -196685 -95190 160929 159928 208611 194406
16567 194406 125849 -51464 -282940 -366322 -391747 -193781 -91992 -43467 31108 335245
16557 335245 499419 276085 -79341 -164050 80102 119869 78211 168082 300205 366019
16547 366019 220641 -105557 -279419 -70530 121008 -50888 -235983 -84583 -86578 -78584
16537 -78584 57973 60628 196969 287514 4760 -237418 -205384 -18382 28543 -90005 138749
16526 138749 401537 579960 498438 473534 667498 382329 -45815 194028 458015 583168
16516 583168 654259 444126 281518 113676 125970 218006 265553 204909 7925 -82712 2979
$$ packed form
16587A50107j09230k2655J96529o2548m0617j15748j90352J67390J69645K4456
16577A66977j98889j05317J10542O5911k35909J01495K56119j001M8683j4205
16567A94406o8557j77313k31476q3382k5425J97966J01789M8525P4575L04137
16557C35245J64174k23334l55426q4709K44152L9767m1658Q9871J32123O5814
16547C66019j45378l26198j73862K08889J91538j71896j85095J51400j995P994
16537g8584J36557K655J36341R0545k82754k42178L2034J87002M6925j18548K28754
16526A38749K62788J78423q1522k4904J93964k85169m28144K39843K63987J25153
16516E83168P1091k10133j62608j67842J2294R2036M7547o0644j96984r0637Q5691
$$ plain form
16505 2979 99213 21002 -144239 -130716 59478 169242 98904 206086 501456 534604 283337
16494 283337 302187 476427 418951 233083 288913 483947 449802 377745 179649 226972 295697
16483 295697 530210 507684 385989 67552 33439 142604 -183141 -546940 -489911 -225902
16473 -225902 -159140 32025 75316 -23933 -178696 81493 289729 265831 -23965 -101410
16463 -101410 -182139 -377727 -262137 -253255 -384296 -467395 -596639 -911566 -644856 -307259
16453 -307259 -404261 -567576 -388278 -135894 -110214 -61586 36920 -32346 -61485 -179375 -388195
16442 -388195 -423287 -63229 70753 -91273 -218567 -219776 -124464 20830 -43737 176097
16432 176097 273567 60224 188177 259669 351560 427471 414447 227584 84837 37517 75689
$$ packed form
16505B979R6234p8211j65241J3523J90194J09764p0338J07182K95370L3148k51267
16494B83337J8850J74240n7476j85868N5830J95034l4145p2057j98096M7323O8725
16483B95697K34513k2526j21695l18437l4113J09165l25745l63799N7029K64009
16473b25902O6762J91165M3291r9249j54763K60189K08236k3898k89796p7445
16463a01410q0729j95588J15590Q882j31041q3099j29244l14927K66710L37597
16453c07259r7002j63315J79298K52384K5680M8628R8506o9266k9139j17890k08820
16442c88195l5092L60058J33982j62026j27294j209R5312J45294o4567K19834
16432A76097R7470k13343J27953P1492R1891P5911j3024j86863j42747m7320L8172
$$ plain form
16421 75689 21934 94605 465100 581457 462350 428748 297279 -3904 -255907 -318751
16411 -318751 -53798 100451 146739 132979 405131 433459 230072 215109 457855 406428
16401 406428 369096 475584 205150 63214 11053 54547 110648 138605 117008 4974 -191042
16390 -191042 -83419 51488 262307 305725 124462 95822 270346 133987 -111238 -149009
16380 -149009 -96334 -241992 -115447 45420 33881 -46882 -186431 -128013 90569 -17639
16370 -17639 -117917 -186101 -161312 -64878 254567 292233 250109 250174 223924 80274 36604 -178977
16358 -178977 -239398 -165693 -15269 -179067 -216875 -230081 -97239 -46553 53037 295362 197516
16347 197516 207055 231853 419479 505358 210625 -31367 23898 43194 241639 275818 268943
$$ packed form
16421G5689n3755P2671L70495J16357j19107l3602j31469l01183k52003o2844
16411c18751K64953J54249M6288j3760K72152K8328k03387j4963K42746n1427
16401D06428l7332J06488k70434j41936n2161M3494N6101K7957k1597j12034j96016
16390a91042J07623J34907K10819M3418j81263k8640J74524j36359k45225l7771
16380a49009N2675j45658J26545J60867j1539q0763j39549N8418K18582j08208
16370a7639j00278o8184K4789R6434L19445L7666m2124O5k6250j43650m3670k15581
16358a78977o0421P3705J50424j63798l7808j3206J32842N0686R9590K42325r7846
16347A97516R539K4798J87626Q5879k94733k41992N5265J9296J98445L4179o875
$$ plain form
16336 268943 193127 182530 319953 270489 128574 95141 147801 204151 61559 -15582 70951
16325 70951 -40516 -11878 94844 16091 164195 -68477 -440058 -505193 -416803 -113904
16315 -113904 -83853 -116131 -239968 -71545 -131726 -325413 -349370 -259713 -177699 -383122 -373634
16304 -373634 -136124 -67300 -168040 -322467 -102690 43566 -27932 27131 89486 311425
16294 311425 254146 135228 7405 120091 -131940 -195343 -7506 188185 171990 98743
16284 98743 112747 31393 -131500 -317825 -502110 -454303 -122460 14125 -54284 75492
16274 75492 98205 388812 327834 199604 -5762 -161900 -64712 -149881 -172245 -302286 -358495
16263 -358495 -171298 -90859 8833 104565 -111463 -248380 -406134 -384093 -318794 75555
$$ packed form
16336B68943p5816j0597J37423m9464j41915l3433N2660N6350j42592p7141Q6533
16325G0951j11467K8638J06722p8753J48104k32672l71581o5135Q8390L02899
16315a13904L0051l2278j23837J68423o0181j93687k3957Q9657Q2014k05423R488
16304c73634K37510O8824j00740j54427K19777J46256p1498N5063O2355K21939
16294C11425n7279j18918j27823J12686k52031o3403J87837J95691j6195p3247
16284I8743J4004q1354j62893j86325j84285M7807L31843J36585o8409J29776
16274G5492K2713K90607o0978j28230k05366j56138R7188q5169k2364j30041n6209
16263c58495J87197Q0439R9692R5732k16028j36917j57754K2041O5299L94349
$$ plain form
16253 75555 279020 287046 515353 436249 579185 504045 476141 386648 125086 -78901 -370340
16242 -370340 -381350 -270748 -196497 -165723 -235874 -113381 -8652 -26512 168701 157533 130550
16231 130550 -47972 -56195 10679 151189 306243 302424 196772 278048 226299 61134 -44317
16220 -44317 -4245 -45946 90766 -131405 -49840 119152 22904 40364 -149848 -257457 -217664
16209 -217664 -168885 -207358 -205351 -246073 -450830 -503452 -268929 -81696 -57496 -110421 -69422
16198 -69422 -39554 -156778 -75822 -43109 50468 96339 -275867 -486293 -385007 -39881 226546
16187 226546 254125 295469 116963 -12391 272326 98152 -41665 -15839 180821 355117
16177 355117 100726 210515 341049 155185 -84229 -268400 -465913 -494945 -330804 -198516
$$ packed form
16253G5555K03465Q026K28307p9104J42936p5140k7904q9493k61562k03987k91439
16242c70340j1010J10602P4251L0774p0151J22493J04729j7860J95213j1168k6983
16231A30550j78522q223O6874J40510J55054l819j05652Q1276n1749j65165j05451
16220d4317M0072m1701J36712k22171Q1565J68992r6248J7460j90212j07609L9793
16209b17664M8779l8473K007m0722k04757n2622K34523J87233K4200n2925M0999
16198f9422K9868j17224Q0956L2713R3577M5871l72206k10426J01286L45126K66427
16187B26546K7579M1344j78506j29354K84717j74174j39817K5826J96660J74296
16177C55117k54391J09789J30534j85864k39414j84171j97513k9032J64141J32288
$$ plain form
16167 -198516 72410 114717 -169671 -129584 163873 347353 478703 222417 89059 210124
16157 210124 -37664 -127336 142493 356008 91387 15077 179622 -196287 -187615 -145935
16147 -145935 -293378 -256642 -205408 -128191 -163460 -198814 -335692 -217107 -311488 -322071 -171335
16136 -171335 -128874 36827 -64559 -331005 -377992 -233078 -217795 -311810 -413890 -428298
16126 -428298 -646707 -631240 -455521 -351902 -233921 -258199 -189986 -149960 -92991 -124370 -84279
16115 -84279 29071 156050 -35658 -170851 -305828 -388853 -369191 -317901 -175906 -135183
16105 -135183 12059 67171 -154166 -355485 -198786 -10374 71165 60396 -156992 -305730
16095 -305730 -93173 41457 24714 -81799 -319386 -337582 -327980 -400633 -246272 36540
$$ packed form
16167a98516K70926M2307k84388M0087K93457J83480J31350k56286j33358J21065
16157B10124k47788q9672K69829K13515k64621p6310J64545l75909Q672M1680
16147a45935j47443L6736N1234P7217l5269l5354j36878J18585r4381j0583J50736
16136a71335M2461J65701j01386k66446m6987J44914J5283r4015j02080j4408
16126d28298k18409J5467J75719J03619J17981k4278O8213M0026N6969l1379M0091
16115h4279J13350J26979j91708j35193j34977q3025J9662N1290J41995M0723
16105a35183J47242N5112k21337k01319J56699J88412Q1539j0769k17388j48738
16095c05730K12557J34630j6743j06513k37587j8196R602p2653J54361K82812
$$ plain form
16085 36540 130909 -64245 -130458 -160871 -228535 121628 169917 291003 254500 219409 253549
16074 253549 3370 -85541 63212 -24069 76942 357922 105038 -87308 -173667 -296284
16064 -296284 -370185 -415460 -277190 -161969 -20150 72713 -46282 -91523 130091 55715
16054 55715 169267 93018 -201249 -435008 -352626 -99901 77519 91019 -58071 28470
16044 28470 -145344 -134595 -141029 -249696 -245074 -177698 -145525 -75524 -15887 162860 -22950
16033 -22950 -261420 -489948 -563518 -463040 -565041 -668365 -454762 -173092 -119917 -13207
16023 -13207 -179261 -140086 -209276 -319727 -373915 -247645 -213724 -214364 37233 27441 -65359
16012 -65359 -263629 -299412 -203744 -376514 -603643 -371324 -145181 -25627 -101103 -2993
$$ packed form
16085C6540R4369j95154o6213l0413o7664L50163M8289J21086l6503l5091L4140
16074B53549k50179q8911J48753q7281J01011K80980k52884j92346q6359j22617
16064b96284p3901m5275J38270J15221J41819R2863j18995m5241K21614p4376
16054E5715J13552p6249k94267k33759Q2382K52725J77420J3500j49090Q6541
16044B8470j73814J0749o434j08667M622O7376L2173P0001N9637J78747j85810
16033b2950k38470k28528p3570J00478j02001j03324K13603K81670N3175J06710
16023a3207j66054L9175o9190j10451n4188J26270L3921o40K51597r792r2800
16012f5359j98270l5783R5668j72770k27129K32319K26143J19554p5476R8110
$$ plain form
16002 -2993 66582 -18086 -195907 -353633 -481471 -325280 -280581 -289699 -414779 -274481 -69386
15991 -69386 159731 64217 -121633 -132601 -355866 -341515 -168039 -76255 -73241 -2580 98270
15980 98270 -5490 -91587 75775 163987 5182 -221079 -248653 -45135 -21732 -20881 -122125
15969 -122125 -14312 107745 171839 88757 46242 10425 20677 188725 239760 306795 376374
15958 376374 335780 447018 170951 15564 -60748 118425 362633 251927 -82464 -111242
15948 -111242 -80169 -292912 -180473 27658 -107395 -21536 -82957 -148469 30 -25232
15938 -25232 -110038 -228138 -49489 315537 291197 294710 84077 84891 159521 -101723 -220427
15927 -220427 -23607 35746 -77150 -171609 -241753 -102263 50313 24854 85996 189885
$$ packed form
16002b993O9575q4668j77821j57726j27838J56191M4699r118j25080J40298K05095
15991f9386K29117r5514j85850j0968k23265J4351J73476R1784L014P0661J00850
15980I8270j03760q6097J67362Q8212j58805k26261k7574K03518K3403Q51j01244
15969a22125J07813J22057O4094q3082m2515l5817J0252J68048N1035O7035O9579
15958C76374m0594J11238k76067j55387p6312J79173K44208j10706l34391k8778
15948a11242L1073k12743J12439K08131j35053Q5859o1421o5512J48499k5262
15938b5232q4806j18100J78649L65026k4340L513k10633Q14P4630k61244j18704
15927b20427J96820N9353j12896r4459p0144J39490J52576k5459O1142J03889
$$ plain form
15917 189885 -35448 -207904 -273647 -141044 -130807 -311115 -81996 66431 229016 7855
15907 7855 -170902 141012 314214 150245 -131551 -5382 53047 -126009 -205199 -76692
15897 -76692 -3399 22214 239663 262650 32013 -110823 -177772 -11912 -102905 -276859 -213948
15886 -213948 -137989 -58463 -117073 -233985 187949 256808 38226 -34727 -217817 -219563 -395187
15875 -395187 -411614 -423723 -340552 -241091 13655 89365 -414 -135087 -40518 38424 130956
15864 130956 243506 310631 236947 39822 -173631 -138781 -277813 -349221 -298683 -115116
15854 -115116 -125080 -140087 -350144 -198447 -182990 -270261 -210913 -4804 -292735 -551241 -481762
15843 -481762 -409315 -372691 -88724 124242 346005 43920 -55660 172067 261983 329439
$$ packed form
15917A89885k25333j72456o5743J32603J0237j80308K29119J48427J62585k21161
15907G855j78757L11914J73202j63969k81796J26169N8429j79056p9190J28507
15897g6692P3293K5613K17449K2987k30637j42836o6949J65860r0993j73954O2911
15886b13948P5959P9526n8610j16912M21934O8859k18582p2953j83090j746j75624
15875c95187j6427j2109Q3171R9461K54746P5710q9779j34673R4569P8942R2532
15864A30956J12550O7125p3684j97125k13453L4850j39032p1408N0538J83567
15854a15116r964j5007k10057J51697J5457q7271N9348K06109k87931k58506O9479
15843d81762P2447L6624K83967K12966K21763l02085r9580K27727Q9916O7456
$$ plain form
15833 329439 469661 234810 -76990 -82454 -53803 60389 227247 194284 150069 7049
15823 7049 -99305 110303 293592 164867 190691 37514 -2277 -40844 37369 151897 106254
15812 106254 138072 1333 -58362 16499 -90980 -147665 -171521 -246943 -397033 -240172 -189803
15801 -189803 -198714 -18405 -47647 -73227 -99236 -302500 -239714 46053 137681 -179932 -362732
15790 -362732 -195344 178297 276504 286793 156063 128602 143210 173539 183081 28025 -206821
15779 -206821 -340958 -468721 -377005 -200129 283483 412592 308758 258071 186090 -95998
15769 -95998 -310585 -261313 65516 -41197 -211007 -88573 285771 167626 232262 175227
15759 175227 -140806 -271258 -230352 248031 634608 533005 476902 288781 -178312 -84397
$$ packed form
15833C29439J40222k34851l11800n464K8651J14192J66858l2963m4215j43020
15823G049j06354K09608J83289j28725K5824j53177l9791l8567P8213J14528m5643
15812A06254L1818j36739n9695P4861j07479n6685k3856p5422j50090J56861N0369
15801a89803q911J80309k9242k5580k6009k03264O2786K85767R1628l17613j82800
15790c62732J67388L73641R8207J0289j30730k7461J4608L0329R542j55056k34846
15779b06821j34137j27763R1716J76876M83612J29109j03834n0687p1981k82088
15769i5998k14587M9272L26829j06713j69810J22434L74344j18145O4636n7035
15759A75227l16033j30452M0906M78383L86577j01603n6103j88121m67093R3915
$$ plain form
15749 -84397 -245664 -450049 -283277 -347641 -362945 -157713 -100875 -109796 -103346 -412499 -724433
15738 -724433 -629940 -467122 -95972 7104 -46523 165230 248840 28432 -196025 -185007
15728 -185007 -27134 -2206 -51676 -41793 -154704 27520 -62272 -196522 -71991 -29564 -288801
15717 -288801 -291636 12891 -23076 -112774 -88202 88662 154704 113121 188414 175356 -34332
15706 -34332 -110669 44404 -166472 -455489 -479158 -344319 -204572 9684 127589 -274315
15696 -274315 -360968 -371861 -411440 -336167 -382707 -375716 -68747 -189560 -2734 150360 120844
15685 120844 -62739 -118317 71280 176665 289771 70090 -123722 -198893 -35940 -108653
15675 -108653 52979 -28743 -87361 -235263 -535204 -168776 216257 149463 -105609 -424755
$$ packed form
15749h4397j61267k04385J66772o4364j5304K05232N6838q921O450l09153l11934
15738g24433R4493J62818L71150J03076n3627K11753Q3610k20408k24457J1018
15728a85007J57873K4928m9470R883j12911J82224q9792j34250J24531M2427k59237
15717b88801k835L04527l5967q9698K4572J76864O6042m1583P5293j3058k09688
15706c4332p6337J55073k10876k89017k3669J34839J39747K14256J17905m01904
15696b74315q6653j0893l9579P5273m6540O991L06969j20813J86826J53094k9516
15685A20844j83583n5578J89597J05385J13106k19681j93812p5171J62953p2713
15675a08653J61632q1722n8618j47902k99941L66428L85033o6794k55072l19146
$$ plain form
15665 -424755 -709929 -758588 -481304 -333143 -303194 -279018 -81332 -315038 -446593 -333624
15655 -333624 -432232 -400480 -578082 -405281 -245270 -365295 -307140 -265216 -335205 -144307
15645 -144307 -106157 -306666 -153410 -41289 115722 212392 34920 -157325 -1068 -132118
15635 -132118 -38417 81785 8710 -44649 -117231 -89719 88000 -39370 -240307 -44281
15625 -44281 113751 -7679 297855 461399 204090 178309 313318 375623 163319 -19078
15615 -19078 -582 164963 79565 -295548 -447441 -366450 -181825 -201311 -214901 54031 145080
15604 145080 141194 44783 201438 323291 108 -119040 -208803 -124358 -29294 -9421 -66979
15593 -66979 -132817 -95622 -43642 -311055 -314720 117767 -102991 -340329 -302600 -153726 -65343
$$ packed form
15665d24755k85174m8659K77284J48161K9949K4176J97686k33706j31555J12969
15655c33624r8608L1752j77602J72801J60011j20025N8155M1924o9989J90898
15645a44307L8150k00509J53256J12121J57011R6670j77472j92245J56257j31050
15635a32118R3701J20202p3075n3359p2582K7512J77719j27370k00937J96026
15625d4281J58032j21430L05534J63544k57309k5781J35009O2305k12304j82397
15615a9078J8496J65545q5398l75113j51893Q0991J84625j9486j3590K68932R1049
15604A45080l886r6411J56655J21853l23183j19148q9763Q4445R5064J9873n7558
15593f6979o5838L7195N1980k67413l665M32487k20758k37338L7729J48874Q8383
$$ plain form
15582 -65343 -109907 -259280 -212837 -26055 -149019 -297715 -335878 -282456 -211469 -251764 -329746
15571 -329746 -249961 -242003 -309561 -476239 -553783 -434982 -256439 -193529 -281946 -368483 -290812
15560 -290812 -124454 34388 -13293 -124670 -188908 -62595 126778 332208 199416 246223
15550 246223 196843 -49591 -45366 -25057 -327537 -337493 -381761 -478433 -201922 -29680 -203221
15539 -203221 -150299 6965 232054 396804 287668 182796 251145 165299 -157237 -177143
15529 -177143 -136117 -230889 -253534 -49811 -43614 -119224 68376 -8198 -54235 -52920 -94468
15518 -94468 252324 418667 281372 3151 -268573 -185452 5362 240127 356342 62952
15508 62952 -159453 -115078 -128163 -133057 -140453 36878 34564 -37420 78615 69210 -155370 -111256
$$ packed form
15582f5343m4564j49373M6443J86782j22964j48696l8163N3422P0987m0295p7982
15571c29746P9785P958o7558j66678p7544J18801J78543O2910q8417q6537P7671
15560b90812J66358J58842m7681j11377o4238J26313J89373K05430j32792M6807
15550B46223m9380k46434M225K0309l02480r956m4268r6672K76511J72242j73541
15539b03221N2922J57264K25089J64750j09136j04872O8349q5846l22536j9906
15529a77143M1026r4772k2645K03723O197p5610J87600p6574m6037J315m1548
15518i4468L46792J66343j37295k78221k71724Q3121J90814K34765J16215k93390
15508F2952k22405M4375j3085m894p396J77331k314p1984J16035r405k24580M4114
$$ plain form
15496 -111256 100449 -2808 112920 255150 325817 245502 107376 126047 127051 15101
15486 15101 -140770 -246003 -232188 -91895 112289 361337 318579 357599 333679 368667 193781
15475 193781 -34880 -52307 -69706 -193269 -130649 -186818 -295394 -362944 -373258 -334156 -276432
15464 -276432 -314852 -196981 221576 154658 -232591 -175428 -124191 -240650 -425089 -397670
15454 -397670 -252915 -240104 -248113 -161910 -29007 -46718 -183226 -173808 -10380 -127050 -87823
15443 -87823 225505 379538 412950 333187 304812 72319 1808 -84834 -92403 -17830 179044
15432 179044 188100 103077 -64807 -155647 -229282 120472 285273 574899 432393 301037
15422 301037 223387 239990 168815 22480 -167873 -213810 -156600 -32634 -42747 -29105 65718
$$ packed form
15496a11256K11705j03257J15728J42230P0667q0315j38126J8671J004j11950
15486A5101j55871j05233J3815J40293K04184K49048m2758L9020k3920L4988j74886
15475A93781k28661j7427j7399j23563O2620n6169j08576o7550j0314L9102N7724
15464b76432l8420J17871M18557o6918l87249N7163N1237j16459j84439K7419
15454c97670J44755J2811q009Q6203J32903j7711j36508R418J63428j16670L9227
15443h7823L13328J54033L3412p9763k8375k32493p0511q6642p569P4573J96874
15432A79044R056q5023j67884r0840p3635L49754J64801K89626j42506j31356
15422C01037p7650J6603p1175j46335j90353m5937N7210J23966j0113J3642R4823
$$ plain form
15411 65718 100429 -54602 -142545 -135665 -150788 -210627 182656 447654 203174 -241750 -327545
15400 -327545 -322539 -255326 -357468 -491381 -347436 -110559 95390 -15383 -160600 -161682
15390 -161682 -34726 171164 26510 -5288 -55019 -135756 -38193 151840 42545 -69689
15380 -69689 -82519 40971 -252273 -207443 -151481 53165 59736 -262398 -284396 -210735 -275409
15369 -275409 -180787 -290402 -292199 -326356 -238226 -194367 -104400 -167400 -446216 -395190 -366164
15358 -366164 -261765 -121673 -135768 -17193 17740 -182420 -55035 37179 -33868 -398049
15348 -398049 -539423 -597902 -560533 -639511 -335401 -38170 141123 75367 -27662 -22968 94645
15337 94645 227239 280725 156289 8121 -81340 -126216 134381 458290 472074 276039
$$ packed form
15411F5718L4711j55031q7943O880j5123n9839L93283K64998k44480m44924q5795
15400c27545N006O7213j02142j33913J43945K36877K05949j10773j45217j082
15390a61682J26956K05890j44654l1798m9731q0737R7563J90033j09295j12234
15380f9689j2830J23490k93244M4830N5962K04646O571l22134k1998P3661o4674
15369b75409R4622j09615j797l4157Q8130M3859Q9967o3000k78816N1026K9026
15358c66164J04399J40092j4095J18575L4933k00160J27385R2214p1047l64181
15348c98049j41374n8479L7369p8978L04110K97231J79293o5756j03029M694J17613
15337I4645J32594N3486j24436j48168q9461m4876K60597L23909J3784j96035
$$ plain form
15327 276039 62626 95743 82713 -191277 -162725 345563 684260 434896 -141071 -162421
15317 -162421 -79984 -75482 30068 282558 90318 116235 210397 209663 -91363 -359537 -205229
15306 -205229 73452 80696 -53316 -151911 -238493 -351179 -494641 -308252 23198 275343
15296 275343 290294 202631 6359 -249933 -308252 -17673 145985 -2124 -158092 -40452
15286 -40452 105255 30433 -226491 -339678 -416629 -316327 -82912 58857 118849 -85797
15276 -85797 -185980 -4478 26884 -152069 -198420 -357897 -444826 -407205 -212221 -356963
15266 -356963 -486073 -356660 -17807 304437 178624 132525 -29198 -29515 -105727 -249549
15256 -249549 -302017 -428367 -513129 -504348 -648795 -517546 -86818 368053 177009 238245
$$ packed form
15327B76039k13413L3117j3030k73990K8552N08288L38697k49364n75967k1350
15317a62421Q2437M502J05550K52490j92240K5917R4162p34l01026k68174J54308
15306b05229K78681P244j34012r8595q6582j12686j43462J86389L31450K52145
15296B75343J4951q7663j96272k56292n8319K90579J63658j48109j55968J17640
15286d0452J45707p4822k56924j13187p6951J00302K33415J41769N9992k04646
15276h5797j00183J81502L1362j78953m6351j59477q6929L7621J94984j44742
15266c56963j29110J29413L38853L22244j25813m6099j61723l17p6212j43822
15256b49549n2468j26350q4762Q781j44447J31249M30728M54871j91044O1236
$$ plain form
15246 238245 296362 128667 64030 -110454 -368199 -349965 -240638 51791 383945 485595
15236 485595 402939 216555 -169626 -10410 95040 317262 152529 64586 316402 225780
15226 225780 74167 167620 221916 361867 327846 194686 -158003 -310587 -227601 -129114
15216 -129114 -8464 -96348 -290640 -459467 -470125 -326170 -163000 -44366 -56152 -91542
15206 -91542 116014 192419 1959 58039 222189 311640 422604 430945 209093 105133 242554
15195 242554 323193 345476 356357 366780 299173 365829 167202 -262380 -357083 -423837 -142748
15184 -142748 -186366 -36696 43931 411563 453010 221914 60580 3361 34308 6721 81516
15173 81516 102788 52428 58827 50655 -9182 70105 104411 298604 488239 385766 271888
$$ packed form
15246B38245N8117j67695o4637j74484k57745J8234J09327K92429L32154J01650
15236D85595q2656j86384l86181J59216J05450K22222j64733q7943K51816r0622
15226B25780j51613R3453N4296J39951l4021j33160l52689j52584Q2986R8487
15216a29114J20650q7884j94292j68827j0658J43955J63170J18634j1786l5390
15206i1542K07556P6405j90460N6080J64150Q9451J10964Q341k21852j03960J37421
15195B42554Q0639K2283J0881J0423o7607O6656j98627m29582r4703o6754K81089
15184a42748m3618J49670Q0627L67632M1447k31096j61334n7219L0947k7587P4795
15173H1516K1272n0360O399q172n9837P9287L4306J94193J89635j02473j13878
$$ plain form
15162 271888 212454 -75651 -200403 -322667 -475056 -494254 -199249 -135197 -79985 -235052
15152 -235052 -371965 -347697 -85912 -182198 -281288 -241932 -368177 -443656 -240779 -68446
15142 -68446 -185929 -307476 -307572 -416654 -302621 -31701 157959 98190 -22482 -44615 -63252
15131 -63252 -44258 -127036 -261841 -25700 7918 116147 281816 259279 243435 321050 454393
15120 454393 462085 418479 427301 -63315 -260738 -167911 80490 288338 265003 66597 -28483
15109 -28483 170578 214336 18308 -259617 -353225 -188530 -189189 -106530 -308200 -508047 -414365
15098 -414365 -256785 -136789 -177523 -234156 -80333 -65620 107956 116433 -94004 -329298
15088 -329298 -322547 -237715 -485465 -557405 -479494 -553938 -458367 -497263 -300479 -151351 -195578
$$ packed form
15162B71888n9434k88105j24752j22264j52389j9198K95005O4052N5212j55067
15152b35052j36913K4268K61785r6286r9090L9356j26245p5479K02877J72333
15142f8446j17483j21547r6j09082J14033K70920J89660n9769j20672k2133j8637
15131f3252J8994q2778j34805K36141L3618J08229J65669k2537j5844P7615J33343
15120D54393P692m3606Q822m90616j97423R2827K48401K07848k3335j98406r5080
15109b8483J99061M3758j96028k77925r3608J64695o59Q2659k01670j99847R3682
15098d14365J57580J19996m0734n6633J53823J4713J73576Q477k10437k35294
15088c29298O751Q4832k47750p1940P7911p4444R5571l8896J96784J49128m4227
$$ plain form
15077 -195578 -159752 9082 1631 -200488 -253011 -171410 -207189 -271968 -526808 -428325 -125129
15066 -125129 -198886 -357784 -528508 -580263 -586337 -246408 50092 277261 280925 6144 217194
15055 217194 345715 488663 452906 478511 638247 582241 175610 -90943 -257419 -66764
15045 -66764 59497 94398 -56443 88832 128481 -15072 142240 -112274 -132306 98495
15035 98495 274808 311986 465204 166066 -36059 71815 322473 186408 6694 45709
15025 45709 -158261 -285299 -267166 -329798 -580639 -708342 -564297 -316873 -135625 -286601
15015 -286601 -443287 -397977 -307241 -336489 -458489 -535919 -333624 -105748 12291 78273
15005 78273 234893 200931 81588 100998 177346 130944 11249 123051 -32421 -197425
$$ packed form
15077a95578L5826J68834p451k02119n2523Q1601l5779o4779k54840R8483L03196
15066a25129p3757j58898j70724n1755o074L39929K96500K27169L664k74781K11050
15055B17194J28521J42948l5757K5605J59736n6006m06631k66553j66476J90655
15045f6764J26261L4901j50841J45275L9649j43553J57312k54514k0032K30801
15035I8495J76313L7178J53218k99138k02125J07874K50658j36065j79714L9015
15025D5709k03970j27038J8133o2632k50841j27703J44045K47424J81248j50976
15015b86601j56686M5310R0736k9248j22000p7430K02295K27876J18039O5982
15005G8273J56620l3962j19343J9410P6348m6402j19695J11802j55472j65004
$$ plain form
14995 -197425 -63304 136440 -118771 -140543 -99241 -98159 -128086 50615 -236888 -247954 -237556
14984 -237556 -530335 -541894 -337660 -33622 221260 347778 77525 -266336 -64980 -189549
14974 -189549 -412200 -239165 -9970 -158984 -231369 -189294 -269901 -319736 -66638 116889
14964 116889 53249 61611 -169812 -428039 -469499 -474102 -383640 -302436 -550731 -462981 -219392
14953 -219392 -80849 -44404 -27257 108156 -95712 -446820 -408271 -108120 -98197 159328
14943 159328 163236 -186559 -157201 33419 36536 126241 32127 -241510 -332371 -106461 -46260
14932 -46260 52129 278248 304663 208276 -51170 -63154 283556 491228 443725 176844 139244
14921 139244 24955 45512 121341 111899 13192 -192626 -27803 90712 30296 128606 103565
$$ packed form
14995a97425J34121J99744k55211k1772M1302J082k9927J78701k87503j1066J0398
14984b37556k92779j1559K04234L04038K54882J26518k70253l43861K01356j24569
14974a89549k22651J73035K29195j49014p2385M2075q0607m9835K53098J83527
14964A16889o3640Q362k31423k58227m1460m603R0462Q1204k48295Q7750K43589
14953b19392J38543L6445J7147J35413k03868l51108L8549L00151R923K57525
14943A59328L908l49795K9358J90620L117Q9705r4114k73637r0861K25910O0201
14932d6260R8389K26119K6415r6387k59446j1984L46710K07672m7503k66881l7600
14921A39244j14289K0557P5829r442r8707k05818J64823J18515o0416R8310k5041
$$ plain form
14910 103565 -177170 -150246 2094 -136561 -334433 -375322 -319444 -370363 -412408 -538560
14900 -538560 -721043 -565209 -614303 -725732 -433980 -85217 -124389 -228483 -326060 -238001
14890 -238001 -215911 -238674 -433311 -405248 -282326 -355618 -195280 -218146 -153876 -5425 230191
14879 230191 370692 46613 26397 -68605 -139391 -141919 -36349 194713 101805 206025 125143
14868 125143 318447 206557 11136 -179625 -166855 42444 248813 143763 143440 176487
14858 176487 62106 -33012 -90831 -20290 37621 148578 177284 -129517 -365315 -342810 -274091
14847 -274091 -146290 -15345 16846 -222333 -166858 78592 173375 171921 223908 199697 12626
14836 12626 -155013 -183521 191393 539986 632355 357805 273323 -3863 104994 192212
$$ packed form
14910A03565k80735K6924J52340j38655j97872m0889N5878n0919m2045j26152
14900e38560j82483J55834m9094j11429K91752L48763l9172j04094r7577Q8059
14890b38001K2090k2763j94637K8063J22922p3292J60338k2866O4270J48451K35616
14879B30191J40501l24079k0216r5002p0786k528J05570K31062r2908J04220q0882
14868A25143J93304j11890j95421j90761J2770K09299K06369j05050l23L3047
14858A76487j14381r5118n7819P0541N7911J10957K8706l06801k35798K2505O8719
14847b74091J27801J30945L2191k39179N5475K45450R4783j454N1987k4211j87071
14836A2626j67639k8508L74914L48593R2369k74550q4482k77186J08857Q7218
$$ plain form
14826 192212 184037 -65097 -252889 -456410 -561739 -598399 -473990 -590407 -556481 -351686
14816 -351686 -376998 -75071 61664 247537 381182 235771 125838 123470 199002 117380
14806 117380 -100639 -166676 -198001 -190575 -237893 -383438 -334009 -142104 -102066 -145580 -366258
14795 -366258 -420275 -621316 -575905 -526718 -501027 -266985 -311902 -403269 -134298 10128 36279
14784 36279 -245638 -256883 -297823 -263067 -257485 -31325 59401 28784 -69164 67832 192276
14773 192276 200085 -16591 -62264 -73843 7156 187289 362726 346986 191247 226804 191728
14762 191728 240345 260885 215638 78920 26489 135670 305320 288824 148613 50593 136976
14751 136976 118508 104769 272505 315352 163290 32364 9474 28926 -88618 -161506 -406904
$$ packed form
14826A92212q175k49134j87792k03521j05329l6660J24409j16417L3926K04795
14816c51686k5312L01927J36735J85873J33645j45411j09933k368P5532q1622
14806A17380k18019o6037l1325P426m7318j45545M9429J91905M0038m3514k20678
14795c66258n4017k01041M5411M9187K5691K34042m4917r1367K68971J44426K6151
14784C6279k81917j1245m0940L4756N582K26160R0726l0617r7948J36996J24444
14773A92276P809k16676m5673j1579Q0999J80133J75437j5740j55739L5557l5076
14762A91728M8617K0540m5247j36718n2431J09181J69650j6496j40211r8020Q6383
14751A36976j8468j3739J67736M2847j52062j30926k2890J9452j17544p2888k45398
$$ plain form
14740 -406904 -343360 -1150 177455 248188 75528 -143564 -345714 -316785 -347972 -404697
14730 -404697 -377522 -516747 -476793 -284718 75513 29053 -9056 -196998 -248762 -213115 -353029
14719 -353029 -284999 -223086 -147993 34503 -104871 -247351 -360803 -364600 -6025 196443
14709 196443 352883 373029 299639 125730 58050 54443 11009 -58366 -146039 -296107 -385467
14698 -385467 34201 229927 118945 -42633 -116006 -31769 226674 236615 107668 142571
14688 142571 259653 -29671 -300228 -379013 -337522 -262178 -51518 -149913 -192361 -16418
14678 -16418 53207 -59616 -139304 -103485 -180880 -4416 48459 63406 369530 256832 -33502
14667 -33502 -292680 -388718 -174911 -128087 -232285 -149766 -95880 -65337 -29326 -139983 -5258
$$ packed form
14740d06904O3544L42210J78605P0733j72660k19092k02150K8929l1187n6725
14730d04697K7175j39225L9954J92075L60231m6460l8109j87942n1764L5647j39914
14719c53029O8030O1913P5093J82496j39374j42480j13452l797L58575K02468
14709A96443J56440K0146p3390j73909o7680l607m3434o9375q7673j50068q9360
14698c85467M19668J95726j10982j61578p3373Q4237K58443R941j28947L4903
14688A42571J17082k89324k70557p8785M1491P5344K10660r8395m2448J75943
14678a6418O9625j12823p9688L5819p7395J76464N2875J4947L06124j12698k90334
14667c3502k59178r6038K13807M6824j04198Q2519N3886L0543L6011j10657J34725
$$ plain form
14656 -5258 -129405 -81603 -168583 -229603 -509517 -179355 147678 187808 11271 -75169 74448
14645 74448 262838 18434 -234808 -262123 -106770 -99141 41988 211778 88302 29576
14635 29576 517152 527933 309661 197071 300257 353581 212763 8293 -370873 -507231
14625 -507231 -294574 -185227 -277014 -329818 -249144 -238366 -321415 -308812 -298924 -63549 -165541
14614 -165541 -148237 -77559 -94906 16490 -12016 -148038 -177182 -166818 -69280 232537 251189
14603 251189 305181 328749 219961 212552 290536 110895 -164850 -115091 -252546 -545530 -618066
14592 -618066 -374765 -193386 54074 70918 -201074 -363010 -247033 -130204 1121 107297
14582 107297 98308 131095 -607 -259094 -279818 -100912 230548 325842 77247 80105 275665
$$ packed form
14656e258j24147M7802q6980o1020k79914L30162L27033M0130j76537q6440J49617
14645G4448J88390k44404k53242k7315J55353P629J41129J69790j23476n8726
14635B9576M87576J0781k18272j12590J03186N3324j40818k04470l79166j36358
14625e07231K12657J09347r1787n2804Q0674J0778q3049J2603R888K35375j01992
14614a65541J7304P0678j7347J11396k8506j36022k9144J0364R7538L01817J8652
14603B51189N3992K3568j08788p409P7984j79641k75745M9759j37455k92984p2536
14592f18066K43301J81379K47460J6844k71992j61936J15977J16829J31325J06176
14582A07297q989L2787j31702k58487k0724J78906L31460R5294k48595K858J95560
$$ plain form
14571 275665 391683 366414 139946 5277 50651 13931 -105324 -229051 -17564 425905
14561 425905 185421 84676 -35147 -229785 -376633 -210713 -94016 -209960 -426745 -231922
14551 -231922 76044 240890 238179 107036 122312 387591 755129 606718 338936 323464
14541 323464 264616 37837 -130591 -206554 -158893 -212835 -186011 108712 342234 248526 79710
14530 79710 -46736 -202978 -202287 -351456 -172870 -243501 -18620 75113 -55301 141233 314090
14519 314090 295988 221347 284640 186130 1889 -153957 -368476 -450562 -246888 47424
14509 47424 333802 285620 207263 140749 273398 262760 47296 41041 -6451 -158356 -38407
14498 -38407 -78266 -36615 2949 171454 332291 26006 -149053 -255997 -362526 -161942
$$ packed form
14571B75665J16018k5269k26468j34669M5374l6720j19255j23727K11487M43469
14561D25905k40484j00745j19823j94638j46848J65920J16697j15944k16785J94823
14551b31922L07966J64846k711j31143J5276K65279L67538j48411k67782j5472
14541C23464n8848k26779j68428p5963M7661n3942K6824K94723K33522r3708j68816
14530G9710j26446j56242O91j49169J78586p0631K24881R3733j30414J96534J72857
14519C14090j8102p4641O3293r8510j84241j55846k14519q2086K03674K94312
14509D7424K86378m8182p8357o6514J32649j0638k15464o255m7492j51905J19949
14498c8407l9859M1651L9564J68505J60837l06285j75059j06944j06529K00584
$$ plain form
14488 -161942 -21848 -7656 -97430 -68369 -46 -63256 -330031 -36194 77470 -10501 -113421
14477 -113421 -101684 155182 235321 305850 386651 279529 152707 -26846 80722 127144
14467 127144 437595 666908 792928 503157 197798 283350 320953 320388 135543 239116
14457 239116 433741 309581 26817 -104834 -72161 135893 381904 488639 374806 193690
14447 193690 168237 4460 86642 161709 42113 -227212 -227540 -192073 -479078 -693053 -539106
14436 -539106 -351216 -221931 83144 197350 -150591 -288604 -146813 233743 434672 427344
14426 427344 284533 154961 -32577 -122807 139897 206453 57734 278639 241105 267112
14416 267112 83770 177661 367388 124767 -83319 47572 53529 26293 -116592 -355884
$$ packed form
14488a61942J40094J4192q9774K9061O8323o3210k66775K93837J13664q7971j02920
14477a13421J1737K56866Q0139P0529Q0801j07122j26822j79553J07568M6422
14467A27144L10451K29313J26020k89771l05359Q5552L7603n65j84845J03573
14457B39116J94625j24160k82764j31651L2673K08054K46011J06735j13833j81116
14447A93690k5453j63777Q2182P5067j19596k69325l28L5467k87005k13975J53947
14436e39106J87890J29285L05075J14206l47941j38013J41791L80556K00929p328
14426D27344j42811j29572j87538r0230K62704O6556j48719K20905l7534K6007
14416B67112j83342R3891J89727k42621k08086J30891N957k7236j42885k39292
$$ plain form
14406 -355884 -260118 -167880 -56452 -77656 -168846 -367366 -378974 -274197 -74706 -104980 -162644
14395 -162644 -149600 -195060 -331800 -357460 -178220 -25212 50983 -69453 -286796 -371571
14385 -371571 -24106 93758 263701 58148 5274 221330 67763 -128760 -244196 -121956
14375 -121956 -122291 -210226 -254218 -214500 -456084 -338155 -97121 -181040 -297088 -296516 -424176
14364 -424176 -389441 -277410 -269528 -133618 -70798 -174271 124929 374506 171124 -349676
14354 -349676 -518340 -371211 -324984 -284169 -79031 114208 -107611 -96166 112828 93451
14344 93451 -672 -75490 -373969 -133031 -38231 23108 -66649 120585 307767 242166 -108927
14333 -108927 34357 137992 140914 187266 156016 109245 95327 126831 359580 418674 243841
$$ packed form
14406c55884R5766R2238J11428k1204r1190j98520j1608J04777J99491l0274n7664
14395a62644J3044m5460j36740k5660J79240J53008P6195j20436k17343q4775
14385c71571L47465J17864J69943k05553n2874K16056j53567j96523j15436J22240
14375a21956l35q7935m3992L9718k41584J17929K41034q3919j16048N72j27660
14364d24176L4735J12031P882J35910O2820j03473K99200K49577k03382n20800
14354c49676j68664J47129M6227M0815K05138J93239k21819J1445K08994j9377
14344I3451r4123p4818k98479K40938R4800O1339q9757J87234J87182o5601l51093
14333a08927J43284J03635K922M6352l1250m6771j3918L1504K32749N9094j74833
$$ plain form
14322 243841 195375 83173 -109914 -289888 -433577 -322831 -98846 -164457 -153945 -111228
14312 -111228 528 -27597 -110737 -172691 -55234 143737 391933 435563 296281 -6296
14302 -6296 -271131 -45468 156846 42689 -82273 75636 46342 -133839 -61684 81730
14292 81730 295666 367961 197012 270023 274433 357915 410363 378660 292407 464552 457895
14281 457895 277008 47413 215110 138080 -749 -67003 -108878 -28811 194071 163927
14271 163927 52204 -3730 164577 266776 367690 380319 350672 193196 -92386 -141146
14261 -141146 153332 197751 411979 314916 112395 292070 663733 522925 180215 -150077
14251 -150077 -93327 86986 230288 285113 158378 -40338 -331335 -330037 37141 314027
$$ packed form
14322B43841m8466j12202j93087j79974j43689J10746K23985o5611J0512M2717
14312a11228J11756k8125q3140o1954J17457J98971K48196M3630j39282l02577
14302f296k64835K25663K02314j14157j24962J57909k9294j80181P2155J43414
14292H1730K13936P2295j70949P3011M410Q3482N2448l1703q6253J72145o657
14281D57895j80887k29595J67697p7030j38829o6254m1875Q0067K22882l0144
14271A63927j11723n5934J68307J02199J00914J2629k9647j57476k85582m8760
14261a41146K94478M4419K14228r7063k02521J79675L71663j40808l42710l30292
14251a50077N6750J80313J43302N4825j26735j98716k90997J298L67178K76886
$$ plain form
14241 314027 111406 5546 -26337 236360 26022 -222076 -52015 -135130 -230698 -324530
14231 -324530 -164594 121019 359296 308592 220818 339578 322730 516072 440164 321948
14221 321948 133184 351990 548556 684774 563285 312980 236608 95526 -74809 -91146
14211 -91146 -173849 142101 413420 410746 346951 410873 125075 -90772 -35576 176517 312206
14200 312206 -68063 -349983 -48315 206991 324026 310266 256287 206409 45681 -81826
14190 -81826 146570 246211 222734 103508 -396449 -223302 55503 144822 -79257 -109715
14180 -109715 -48201 46403 264846 247359 94920 224184 408696 376990 248150 -8557
14170 -8557 -136987 -3154 217265 413080 578298 536497 407530 324029 303631 395591 343302
$$ packed form
14241C14027k02621j05860l1883K62697k10338k48098J70061q3115r5568r3832
14231c24530J59936K85613K38277n0704q7774J18760j6848J93342p5908j18216
14221C21948j88764K18806J96566J36218j21489k50305p6372j41082j70335j6337
14211i1146q2703L15950K71319k674o3795O3922k85798k15847N5196K12093J35689
14200C12206l80269k81920L01668K55306J17035j3760n3979m9878j60728j27507
14190h1826K28396R9641k3477j19226m99957J73147K78805Q9319k24079l0458
14180a09715O1514R4604K18443j7487j52439J29264J84512l1706j28840k56707
14170h557j28430J33833K20419J95815J65218m1801j28967q3501k0398R1960n2289
$$ plain form
14159 343302 203312 99100 120719 272484 182764 245171 177780 165890 140618 23048 336111
14148 336111 223067 88972 25941 -97660 -328827 -421453 -260647 -14086 103113 324645
14138 324645 377704 244717 80954 -65586 52313 207848 236181 34130 65998 138540
14128 138540 159187 229830 186558 -63442 -1687 -7589 -197060 -359583 -388607 -228703 -263240
14117 -263240 -5453 184668 513502 470021 359152 192255 43070 179539 196784 -4204
14107 -4204 -143532 -323092 -505097 -296406 -214904 -1078 396058 486728 304651 143811
14097 143811 -39858 -237621 -102546 -180996 -82209 -82023 -35693 -141784 -244013 19776 88637
14086 88637 66709 59871 231503 489351 370965 240947 205360 138105 -32786 -293212 -373584
$$ packed form
14159C43302j39990j04212K1619J51765q9720O2407o7391j1890k5272j17570L13063
14148C36111j13044j34095o3031j23601k31167r2626J60806K46561J17199K21532
14138C24645N3059j32987j63763j46540J17899J55535K8333k02051L1868P2542
14128A38540K0647P0643m3272k50000O1755n902j89471j62523k9024J59904l4537
14117b63240K57787J90121L28834m3481j10869j66897j49185J36469J7245k00988
14107d204j39328j79560j82005K08691Q1502K13826L97136R0670j82077j60840
14097A43811j83669j97763J35075p8450R8787J86M6330j06091j02229K63789O8861
14086H8637k1928o838J71632K57848j18386j30018l5587o7255j70891k60426q0372
$$ plain form
14075 -373584 -166941 19882 84100 109156 83294 -79814 -69694 47939 133412 347268
14065 347268 173893 33437 -93484 -230957 -296641 -305496 -203599 -242842 -243848 -141664 -94053
14054 -94053 -25050 -152372 -230160 -188105 -132499 101722 178921 251228 212987 207826 270821
14043 270821 380390 106724 163128 352572 439827 397315 404241 273831 318860 467258 542923
14032 542923 370187 380997 353666 308674 178590 134258 31526 -66266 -78915 111242 351711
14021 351711 540455 454902 544218 712051 853774 1085015 1125140 688718 341994 395137
14011 395137 318141 71133 107352 184470 119426 -103332 -393296 -323597 -35506 13372 -78175
14000 -78175 -119920 -89227 32211 153666 68501 -65681 50160 13351 287941 372908 303049
$$ packed form
14075c73584K06643J86823O4218K5056k5862j63108J0120J17633Q5473K13856
14065C47268j73375j40456j26921j37473o5684q855J01897l9243j006J02184M7611
14054i4053O9003j27322p7788M2055N5606K34221P7199P2307l8241n161O2995
14043B70821J09569k73666N6404J89444Q7255m2512O926j30410M5029J48398P5665
14032E42923j72736J0810k7331m4992j30084m4332j02732r7792j2649J90157K40469
14021C51711J88744q5553Q9316J67833J41723K31241M0125m36422l46724N3143
14011C95137p6996k47008L6219P7118o5044k22758k89964O9699K88091M8878r1547
14000g8175m1745L0693J21438J21455q5165j34182J15841l6809K74590Q4967o9859
$$ plain form
13989 303049 130774 -174307 -123482 71123 235246 264282 121727 95786 -139147 -248559
13979 -248559 15267 122183 142712 157847 93295 -155839 -46377 153562 257131 177679
13969 177679 -230431 -162256 -3771 -174552 32192 124384 116241 137757 91894 160218 451914
13958 451914 610227 322742 106594 190158 418921 531729 775820 774766 656232 548791
13948 548791 645361 525400 238214 66290 -24051 129204 -25758 48644 -16975 20096
13938 20096 -101880 51516 21715 156964 212973 19691 92857 199505 242156 217731 197283
13927 197283 72064 -150910 25332 159938 286756 317189 794840 636247 497845 761168
13917 761168 773715 763610 490317 510703 288715 231162 468273 427700 403180 474452 655854
$$ packed form
13989C03049j72275l05081N0825J94605J64123K9036j42555k5941k34933j09412
13979b48559K63826J06916K0529J5135o4552k49134J09462J99939J03569p9452
13969A77679m08110O8175J58485j70781K06744R2192q143K1516m5863O8324K91696
13958D51914J58313k87485k16148Q3564K28763J12808K44091j054j18534j07441
13948E48791R6570j19961k87186j71924r0341J53255j54962P4402o5619L7071
13938B0096j21976J53396k9801J35249N6009j93282P3166J06648M2651k4425k0448
13927A97283j25219k22974J76242J34606J26818L0433M77651j58593j38402K63323
13917G61168J2547j0105k73293K0386k21988n7553K37111m0573k4520P1272J81402
$$ plain form
13906 655854 443519 84215 -3343 122992 139359 107783 72492 124336 369117 278277 299328
13895 299328 353174 299867 337838 590543 682352 506276 478689 744078 867447 567681
13885 567681 64635 -129433 204570 408306 462310 528461 392716 124523 21326 -146620
13875 -146620 -25975 205192 366349 384710 405940 387416 345641 519841 645242 625949
13865 625949 688874 471239 363421 207961 400631 552041 446114 294339 250234 120384
13855 120384 142575 -46967 88010 361607 365349 414115 302489 84124 -73303 -142476
13845 -142476 -60095 -60423 46635 126427 368413 432589 237685 100692 55675 71148 85377
13834 85377 125360 147294 -15977 -50560 -10306 137302 242671 436043 755938 1048238
$$ packed form
13906F55854k12335l59304q7558J26335J6367l1576l5291N1844K44781r0840K1051
13895B99328N3846n3307L7971K52705R1809j76076k7587K65389J23369k99766
13885E67681n03046j94068L34003K03736N4004O6151j35745k68193j03197j67946
13875a46620J20645K31167J61157J8361K1230j8524m1775J74200J25401j9293
13865F25949O2925k17635j07818j55460J92670J51410j05927j51775m4105j29850
13855A20384K2191j89542J34977K73597L742M8766j11626k18365j57427o9173
13845a42476Q2381l28J07058P9792K41986O4176j94904j36993m5017J5473J4229
13834H5377L9983K1934j63271l4583M0254J47608J05369J93372L19895K92300
$$ plain form
13824 1048238 1003671 836368 591141 446211 390584 359816 453236 478372 264684 22409
13814 22409 74484 178893 337040 204915 99847 425591 382232 167185 200820 376393
13804 376393 529795 585818 889819 786419 419731 308144 380808 452474 625259 512159
13794 512159 747153 810785 748425 818813 727722 353174 102827 142205 200304 153365 332536
13783 332536 526557 450118 129832 239021 414676 495060 367827 246476 349571 548797
13773 548797 674183 764296 844871 795826 585910 239277 223431 70470 -94686 -135264
13763 -135264 43543 209080 257344 276905 324035 59864 -256262 -54722 174157 356417
13753 356417 434929 420991 435313 457406 578078 698915 959287 1074276 718768 516687
$$ packed form
13824A048238m4567j67303k45227j44930n5627l0768R3420K5136k13688k42275
13814B2409N2075J04409J58147j32125j05068L25744m3359k15047L3635J75573
13804C76393J53402N6023L04001j03400l66688j11587P2664P1666J72785j13100
13794E12159K34994O3632o2360P0388r1091l74548k50347L9378N8099m6939J79171
13783C32536J94021p6439l20286J09189J75655Q0384j27233j21351J03095J99226
13773E48797J25386R0113Q0575m9045k09916l46633j5846j52961j65156m0578
13763a35264J78807J65537M8264J9561M7130k64171l16126K01540K28879J82260
13753C56417P8512j3938J4322K2093J20672J20837K60372J14989l55508k02081
$$ plain form
13743 516687 357948 392444 623660 587296 375404 205741 388043 345426 89064 113046
13733 113046 362204 207000 341407 502902 445431 309157 346251 331042 351970 245168
13723 245168 185653 485679 533422 468841 638510 519015 342696 143912 -99786 -128296
13713 -128296 -367617 -417557 -225248 37623 326514 574468 543494 356479 229444 215760
13703 215760 292612 190558 197690 379827 501013 645472 698084 376213 195938 499925
13693 499925 610104 620221 631995 729815 786050 562183 489160 567400 421105 309535 490126
13682 490126 609050 848434 862365 523401 428835 272208 295029 722754 772105 808417
13672 808417 732908 769774 741841 717351 411213 480236 614620 541007 628035 509506 256952
$$ packed form
13743E16687j58739L4496K31216l6364k11892j69663J82302m2617k56362K3982
13733A13046K49158j55204J34407J61495n7471j36274L7094j5209K0928j06802
13723B45168n9515L00026M7743o4581J69669j19495j76319j98784k43698k8510
13713a28296k39321m9940J92309K62871K88891K47954l0974j87015j27035j3684
13703B15760P6852j02054P132J82137J21186J44459N2612l21871j80275L03987
13693D99925J10179J0117J1774R7820N6235k23867p3023P8240j46295j11570J80591
13682D90126J18924K39384J3931l38964r4566j56627K2821M27725M9351L6312
13672H08417p5509L6866k7933k4490l06138O9023J34384p3613Q7028j18529k52554
$$ plain form
13661 256952 376066 452726 272451 146405 337043 563571 390924 521140 633784 660493
$$ packed form
13661B56952J19114P6660j80275j26046J90638K26528j72647J30216J12644K6709
$$ [...]
##END NTUPLES=NMR SPECTRUM
##END=
