##TITLE=Analysis number 325629
Compound Code btb 02003
Book Reference 146294
Project Code adrs fraglib
Chemist Name jom
##JCAMPDX= 6.0         $$ Bruker NMR JCAMP-DX V2.0
##DATA TYPE= NMR SPECTRUM
##DATA CLASS= NTUPLES
##ORIGIN= Bruker BioSpin GmbH
##OWNER= nmr
$$ XWIN-NMR		Version 3.5
$$ Fri Jan  5 11:28:47 2007 GMT Standard Time (UT+0h)  MAYBRIDGE\nmr@NMR_250MHZ
##.OBSERVE FREQUENCY= 250.131544655141
##.OBSERVE NUCLEUS= ^1H
##.ACQUISITION MODE= SIMULTANEOUS (DQD)
##.ACQUISITION SCHEME= undefined
##.AVERAGES= 16
##.DIGITISER RES= 18
##SPECTROMETER/DATA SYSTEM= dpx250
##.PULSE SEQUENCE= zg30
##.SOLVENT NAME= DMSO
##.SHIFT REFERENCE= (INTERNAL, DMSO, 0, 16.522)
##AUDIT TRAIL= $$ (NUMBER, WHEN, WHO, WHERE, WHAT)
$$ ##TITLE= Audit trail, XWIN-NMR		Version 3.5
$$ ##JCAMPDX= 5.01
$$ ##ORIGIN= Bruker BioSpin GmbH
$$ ##OWNER= nmr
$$ C:\u/data/dgb/nmr/ADRS/450/pdata/1/auditp.txt
$$ ##AUDIT TRAIL=  $$ (NUMBER, WHEN, WHO, WHERE, WHAT)
(   1,<2007-01-05 11:28:19.85 +000>,<MAYBRIDGE\nmr>,<NMR_250MHZ>,
      <created by zg, POWCHK disabled, PULCHK disabled
       configuration hash MD5:
       49 4B E0 1D 92 C2 6B 37 9F E6 65 BC 52 41 86 1D
       data hash MD5: 64K
       45 DB F2 99 C3 D2 C8 85 A5 3A D5 65 66 46 97 CE>)
(   2,<2007-01-05 11:28:35.96 +000>,<MAYBRIDGE\nmr>,<NMR_250MHZ>,
      <Start of raw data processing
       ef LB = 0.3 FT_mod = 6 PKNL = 1 SI = 32K 
       data hash MD5: 32K
       42 4D B0 D4 B5 24 B6 82 D1 61 A4 C5 25 38 F0 F2>)
(   3,<2007-01-05 11:28:38.26 +000>,<MAYBRIDGE\nmr>,<NMR_250MHZ>,
      <apk 
       data hash MD5: 32K
       70 B1 E9 9D FC 45 F6 75 E0 6B 57 5A 15 5F 2F E7>)
(   4,<2007-01-05 11:28:39.09 +000>,<MAYBRIDGE\nmr>,<NMR_250MHZ>,
      <abs ABSG = 5 
       data hash MD5: 32K
       E6 8A 65 35 C8 FE 43 0D 81 A7 B0 C6 8C B5 19 F1>)
$$ ##END=
$$ 
$$ hash MD5
$$ 63 FC 70 5A 83 AE DB E6 DD D3 33 1A 82 51 A4 09
##$RELAX= 
##$RELAX= 
##$RELAX= 
##$RELAX= 
##$RELAX= 
##$RELAX= 
##$RELAX= 
$$ Bruker specific parameters
$$ --------------------------
##$DU= <C:\u>
##$EXPNO= 450
##$NAME= <ADRS>
##$PROCNO= 1
##$TYPE= <nmr>
##$USER= <dgb>
##$AMP= (0..31)
100 100 100 100 100 100 100 100 100 100 100 100 100 100 100 100 100 100 
100 100 100 100 100 100 100 100 100 100 100 100 100 100 
##$AQSEQ= 0
##$AQ_mod= 3
##$AUNM= <au_zg>
##$AUTOPOS= <35 >
##$BF1= 250.13
##$BF2= 250.13
##$BF3= 250.13
##$BF4= 250.13
##$BF5= 500.13
##$BF6= 500.13
##$BF7= 500.13
##$BF8= 500.13
##$BYTORDA= 1
##$CFDGTYP= 0
##$CFRGTYP= 5
##$CHEMSTR= <none>
##$CNST= (0..31)
1 1 145 1 1 1 1 1 1 1 1 1 1 1 1 1 1 1 1 1 1 1 1 1 1 1 1 1 1 1 1 1 
##$CPDPRG= <>
##$CPDPRG1= <>
##$CPDPRG2= <>
##$CPDPRG3= <>
##$CPDPRG4= <mlev>
##$CPDPRG5= <mlev>
##$CPDPRG6= <mlev>
##$CPDPRG7= <mlev>
##$CPDPRG8= <mlev>
##$CPDPRGB= <>
##$CPDPRGT= <>
##$D= (0..31)
0 1 0 0 0 0 0 0 0 0.06 0 0 0 0 0 0 0.0002 0 0 0 0 0 0 0 0 0 0 0 0 0 0 
0 
##$DATE= 1167996498
##$DBL= (0..7)
120 120 120 120 120 120 120 120 
##$DBP= (0..7)
150 150 150 150 150 150 150 150 
##$DBP07= 0
##$DBPNAM0= <>
##$DBPNAM1= <>
$$ [...]
##$SUBNAM7= <"">
##$SUBNAM8= <"">
##$SUBNAM9= <"">
##$SW= 20.6930455092707
##$SWIBOX= (0..15)
0 0 3 0 0 0 0 0 0 0 0 0 0 0 0 0 
##$SW_h= 5175.983436853
##$TD= 65536
##$TD0= 1
##$TE= 294.16
##$TE2= 300
##$TE3= 300
##$TEG= 300
##$TL= (0..7)
0 120 120 120 120 120 120 120 
##$TP= (0..7)
150 150 150 150 150 150 150 150 
##$TP07= 0
##$TPNAME0= <>
##$TPNAME1= <>
##$TPNAME2= <>
##$TPNAME3= <>
##$TPNAME4= <>
##$TPNAME5= <>
##$TPNAME6= <>
##$TPNAME7= <>
##$TPOAL= (0..7)
0.5 0.5 0.5 0.5 0.5 0.5 0.5 0.5 
##$TPOFFS= (0..7)
0 0 0 0 0 0 0 0 
##$TUNHIN= 0
##$TUNHOUT= 0
##$TUNXOUT= 0
##$USERA1= <user>
##$USERA2= <user>
##$USERA3= <user>
##$USERA4= <user>
##$USERA5= <user>
##$V9= 5
##$VALIST= <valist>
##$VCLIST= <CCCCCCCCCCCCCCC>
##$VD= 0
##$VDLIST= <DDDDDDDDDDDDDDD>
##$VPLIST= <PPPPPPPPPPPPPPP>
##$VTLIST= <TTTTTTTTTTTTTTT>
##$WBST= 1024
##$WBSW= 4
##$XGAIN= (0..3)
0 0 0 0 
##$XL= 0
##$YL= 0
##$YMAX_a= 248403
##$YMIN_a= -231542
##$ZGOPTNS= <>
##$ZL1= 120
##$ZL2= 120
##$ZL3= 120
##$ZL4= 120
##$ABSF1= 16.522
##$ABSF2= -4.171173
##$ABSG= 5
##$ABSL= 3
##$ALPHA= 0
##$AQORDER= 0
##$ASSFAC= 0
##$ASSFACI= 0
##$ASSFACX= 0
##$ASSWID= 0
##$AUNMP= <proc_1d>
##$AZFE= 0.1
##$AZFW= 0.1
##$BCFW= 0
##$BC_mod= 0
##$BYTORDP= 0
##$COROFFS= 0
##$CY= 12.5
##$DATMOD= 1
##$DC= 0
##$DFILT= <>
##$DTYPP= 0
##$F1P= 14.0000005364418
##$F2P= -0.99999901652339
##$FCOR= 0.5
##$FTSIZE= 32768
##$FT_mod= 6
##$GAMMA= 0
##$GB= 0
##$INTBC= 1
##$INTSCL= 1
##$ISEN= 128
##$LB= 0.3
##$LEV0= 0
##$LPBIN= 0
##$MAXI= 10000
##$MC2= 0
##$MEAN= 0
##$ME_mod= 0
##$MI= 0
##$NCOEF= 0
##$NC_proc= -5
##$NLEV= 6
##$NOISF1= 0
##$NOISF2= 0
##$NSP= 0
##$NTH_PI= 0
##$NZP= 0
##$OFFSET= 16.522
##$PC= 1
##$PHC0= 214.2395
##$PHC1= 5.457774
##$PH_mod= 1
##$PKNL= yes
##$PPARMOD= 0
##$PSCAL= 4
##$PSIGN= 0
##$REVERSE= no
##$SF= 250.13
##$SI= 32768
##$SIGF1= 0
##$SIGF2= 0
##$SINO= 400
##$SIOLD= 32768
##$SREGLST= <1H.DMSO>
##$SSB= 0
##$STSI= 32768
##$STSR= 0
##$SW_p= 5175.98343685301
##$SYMM= 0
##$S_DEV= 0
##$TDeff= 65536
##$TDoff= 0
##$TI= <Analysis number 999999
Compound Code 99
Book Reference 9
Project Code 9>
##$TILT= no
##$TM1= 0
##$TM2= 0
##$TOPLEV= 0
##$USERP1= <user>
##$USERP2= <user>
##$USERP3= <user>
##$USERP4= <user>
##$USERP5= <user>
##$WDW= 1
##$XDIM= 32768
##$YMAX_p= 543989765
##$YMIN_p= -484506
$$ End of Bruker specific parameters
$$ ---------------------------------
##NTUPLES= NMR SPECTRUM
##VAR_NAME=  FREQUENCY,     SPECTRUM/REAL,   SPECTRUM/IMAG
##SYMBOL=    X,             R,               I
##VAR_TYPE=  INDEPENDENT,   DEPENDENT,       DEPENDENT
##VAR_FORM=  AFFN,          ASDF,            ASDF
##VAR_DIM=   32768,         32768,           32768
##UNITS=     HZ,            ARBITRARY UNITS, ARBITRARY UNITS
##FACTOR=    0.157963299565203, 1,           1
##FIRST=     4132.6476996994, 0,             0
##LAST=      -1043.33573715361, 0,           0
##MIN=       -1043.33573715361, -484506,     0
##MAX=       4132.6476996994, 543989765,     0
$$ Real data points
##PAGE= N=1
##DATA TABLE= (X++(R..R)), XYDATA
$$ [...]
13933H3525N0996o9620m1267K7012q7541n0726p540j466k1867L9028m9382J007
$$ 83525 134521 64901 23634 50646 -36895 -87621 -95161 -96627 -118494 -79466 -128848 -127841
13921a27841K061j10418q792J24891N7701J24136M065j29776r6655Q5556j9114
$$ -127841 -125780 -236198 -244990 -120099 -62398 61738 65803 -63973 -160628 -75072 -94186
13910i4186M9983N9897o6548q8591n6168P0284p165J7290j374Q6201l8653r4836
$$ -94186 -44203 15694 -50854 -139445 -195613 -125329 -132494 -115204 -116578 -30377 -69030 -163866
13898a63866l4329o0863J17524P5310o625K4765m1643o0740R6494Q752L0297p7530
$$ -163866 -198195 -259058 -141534 -66224 -72849 -48084 -89727 -150467 -53973 -45221 -14924 -92454
13886i2454m9900L5868P0172q569k8650J39096P9770m1920j15477k9862O7127
$$ -92454 -142354 -106486 -36314 -44883 -73533 65563 145333 103413 -12064 -41926 25201
13875B5201L7507M9P0678m8272j6609J5605J7609j3095j8609m4053j6924L8181
$$ 25201 62708 62757 133435 85163 68554 84159 101768 88673 70064 26011 9087 47268
13863D7268O1075J27992O1701p4819j34261m2703K5023k3332J9000r888o6816
$$ 47268 108343 236335 298036 223217 88956 46253 71276 47944 66944 57056 -9760
13852i760m9019j38430N2048O8801J08933P2999p1332J02309J5811p758K3860
$$ -9760 -58779 -197209 -145161 -76360 32573 105572 34240 136549 152360 144602 168462
13841A68462J07661j6220j3189q4922k437j6925M8485O1740P998n9071j11359
$$ 168462 276123 259903 246714 161792 159355 142430 190915 252655 260653 201582 90223
13830I0223j24582N2759N2857n7605L0685l735j3571J1407o9601m1364K0380r1655
$$ 90223 -34359 18400 71257 13652 44337 40602 27031 38438 -31163 -72527 -52147 -143802
13818a43802p474J86602L0292m8956Q6078J17108p1070j25252p0989N7395n1989
$$ -143802 -151276 35326 65618 16662 102740 219848 148778 23526 -47463 9932 -42057
13807d2057l5427k2292J50574O6431J08719J09710J06237O4632P5614J89024Q1568
$$ -42057 -77484 -99776 50798 117229 225948 335658 441895 506527 582141 771165 852733
13796H52733N9139P7066k4832k09424j97251p2497j41833j20242p2495m6843J11221
$$ 852733 911872 988938 964106 754682 557431 484934 343101 222859 150364 103521 214742
13785B14742O9465K1684j7087k775j25485L2513m900N3252m2364n5211R809o4828
$$ 214742 284207 305891 288804 286029 160544 193057 188157 241409 199045 143834 153643 88815
13773H8815j04479p058k6959j8199P6200m3548p000J55203N6480p928l8853o2745
$$ 88815 -15664 -22722 -49681 -67880 8320 -35228 -42228 112975 169455 161527 122674 59929
13761E9929J9946J21302M2452K15420J68792M6227J32347J05524O2266L7733N6651
$$ 59929 79875 201177 243629 459049 627841 674068 806415 911939 974205 1011938 1068589
13750A068589j24557j64640j29326j42105n6847j31089K8146J8573L9292Q0197
$$ 1068589 944032 779392 650066 507961 451114 320025 348171 366744 406036 486233
13740D86233K5074q9626q3397n772K7770k5708r8374j86995o2810O7355J28373
$$ 486233 511307 421681 338284 332512 360282 334574 236200 49205 -13605 53750 182123
13729A82123K8538j29068o0434J9491M1921K9617n9233J081K261m5479J1112J0678
$$ 182123 210661 81593 21159 40650 82571 112188 52955 54036 56297 10818 21930 32608
13717C2608L4492j6383m2850j5393m0664N6398P3512R0600o856J28532l2356l7719
$$ 32608 67100 50717 7867 -7526 -48190 8208 81720 172320 165464 293996 261640 223921
13705B23921K5575Q2854p9359o9535j5703J7288o8621j40686q7017J42831M8417
$$ 223921 249496 332350 252991 183456 167753 185041 116420 -24266 -111283 31548 79965
13694G9965K9912k4312n3433k1200n3817Q4855R4239l141O151l5869p2941n4323
$$ 79965 109877 85565 32132 10932 -42885 41970 136209 133068 139219 103350 30409 -23914
13682b3914l8559L45J74879O0723M881n2571j49681k8635J0707M8541j0240r1845
$$ -23914 -62473 -62128 112751 173474 178355 125784 -23897 -52532 -41825 6716 -3524 -95369
13670i5369K739L6504R4258Q2476l681p8566j28657L4681J8432J15956R2252n1016
$$ -95369 -92630 -56126 38132 120608 116927 38361 -90296 -55615 -37183 78773 171025 120009
13658A20009M8585j05762j49692J01M4378P6921P343J2016k4342j09294m2168
$$ 120009 168594 62832 -86860 -86759 -42381 34540 41883 53899 29557 -79737 -121905
13647a21905J13959J11193P2530n5920n2531k6146M0226r9334p8953j9667J56654
$$ -121905 -7946 103247 175777 119857 67326 41180 81406 -17928 -96881 -116548 40106
13636D0106J05913j47193j8792K6786J0799q0787M9983j31278r852Q1158M5702
$$ 40106 146019 -1174 -19966 6820 17619 -63168 -13185 -144463 -154315 -73157 -27455
13625b7455L5306m7014K9166J46854n730j36751P6966L127k9747Q0223R7411k0763
$$ -27455 7851 -39163 -9997 136857 131127 -5624 71342 74469 44722 124945 222356 201593
13613B01593Q1411j1991r656j35689j10041k8882Q1609q3063q2582J37352m7530
$$ 201593 283004 271013 261357 125668 15627 -13255 68354 -14709 -97291 40061 -7469
13602g469J16923J03267l975j33138K3469k2743J1085J00514o4668q9402P5873
$$ -7469 109454 212721 208746 75608 99077 76334 87419 187933 123265 33863 109736
13591A09736k6138L4082j7221J1752l2590k4401O293M3393j01903M0120N3647
$$ 109736 83598 117680 100459 112211 79621 55220 61513 104906 3003 43123 96770
13580I6770J5450j8401J8717L1863l3476p3724K1926J7525l0117j34634p0630
$$ 96770 112220 93819 112536 144399 110923 37199 59125 76650 46533 -88101 -158731
13569a58731M5405Q8368R5977M066o694n0602j35765M8419Q6182n4120J7860P6049
$$ -158731 -113326 -24958 71019 75085 68391 17789 -117976 -69557 16625 -37495 -19635 56414
13557E6414P3649L427j63353j5403l6406P228n701N1497Q0507r5240K5608J42512
$$ 56414 130063 133490 -29863 -45266 -81672 -74444 -80145 -28648 51859 -43381 -17773 124739
13545A24739J00058k6831N2046k7557l0841l1508o4560j26659q3694K5808Q6811
$$ 124739 224797 197966 250012 222455 191614 160106 95546 -31113 -114807 -88999 -2188
13534b188J59334j09155j10155Q5645k2277j7573m4073J24937R3234m475k6866
$$ -2188 157146 47991 -62164 23481 1204 -16369 -60442 64495 157729 153254 126388
13523A26388M6458p0163j25245L4606R5676Q295l6749j40756l3025J09325J42484
$$ 126388 172846 102683 -22562 12044 107720 116015 79266 -61490 -94515 14810 157294
13512A57294P8724J68412j07705K4446P9981m8020r3208r7306n9651l2811k3319
$$ 157294 236018 404430 296725 321171 401152 353132 259924 162618 102967 70156 46837
13501D6837N4818N6661j00607k4623Q9070M3344n1500j068N7576j7448k1185o4563
$$ 46837 101655 158316 57709 33086 122156 165500 114000 112932 170508 153060 131875 67312
13489F7312q9803O6403J50303O2123j6112p55J21606n2741j05782o7191j3823
$$ 67312 -22491 43912 194215 256338 240226 239471 361077 308336 202554 135363 121540
13478A21540p8803m3676J15833N5659K3137J5485J1123m9396J8364l9742r4203
$$ 121540 42737 -939 114894 170553 193690 209175 220298 170902 189266 149524 55321
13467E5321j0386K15397P8271n132k0807N8068L000k0910O685K3719k9480k4780
$$ 55321 44935 260332 338603 333471 312664 370732 373732 352822 359507 383226 353746 328966
13455C28966j33874k3241J33384J29683n4374r9483n8457p9487l2828r3071R5686
$$ 328966 195092 171851 305235 434918 380544 281061 222604 143117 110289 17218 112904
13444A12904K0210L1496J34065Q4441N0868R5641m3165j49613J5961P2264L0057
$$ 112904 133114 164610 298675 383116 433984 529625 486460 336847 352808 425072 455129
13433D55129Q4146n2808k8445J32760R8922L1144o4575j9384L006O8542J25826
$$ 455129 539275 486467 458022 590782 689704 720848 656273 636889 639895 708437 834263
13422H34263N2861k8770K6257n5618j12099J601Q7346Q3374P1864K1430M3766
$$ 834263 887124 858354 884611 828993 716894 718495 805841 889215 961079 982509 1026275
13411A026275J5764K9895j2589J14358J61363J01613M9499J94822J01415J06045
$$ 1026275 1042039 1071934 1059345 1173703 1335066 1436679 1486178 1681000 1782415 1888460
13401A888460K13370J52537M1468J43193L77273L32125M58769N53721P04570P55493
$$ 1888460 2101830 2254367 2295835 2439028 2816301 3148426 3607195 4160916 4865486 5620979
13391E620979Q50153J085840J324262J849496K354403L398159M564277O333540
$$ 5620979 6471132 7556972 8881234 10730730 13085133 16483292 21047569 27381109
13383B7381109Q856469J1316347J1939942R192005L666976k378740p210174j0125558
$$ 27381109 36237578 47553925 59493867 68685872 72352848 69974108 62763934 52638376
13375E2638376j0468808q571341o406671m624758l330182k415609j963578j586088
$$ 52638376 42169568 33598227 27191556 22566798 19236616 16821007 14857429 13271341
13367A3271341j404274j081122p03168n98569m47987l53368k78572j37032k7320
$$ 13271341 11867067 10785945 10082777 9484208 9036221 8682853 8404281 8267249 8239929
13358H239929l1483M4309J39531L41502N36625N93603N36866P56626R80110J276191
$$ 8239929 8208446 8252755 8392286 8733788 9270413 9864016 10400882 11157508 12137618 13413809
13348A3413809J689159K100968K622459L321882M217527N362560O937583R608452
$$ 13413809 15102968 17203936 19826395 23148277 27365804 32728364 39665947 49274399
13340D9274399J3749414K0144729K8788892L8027020M1981057L1857626R964174
$$ 49274399 63023813 83168542 111957434 149984454 191965511 223823137 233787311
13333B33787311j0952982k6388263l6286981l6283488k8389895k0059131j4106065
$$ 233787311 222834329 196446066 160159085 123875597 95485702 75426571 61320506
13326F1320506j0047834p568573n666895m591057l744579l291382k683553k159011
$$ 61320506 51272672 43704099 38037204 33446147 29701568 26410186 23726633 21567622
13318B1567622j818400j403045j162191r83491p92651n46849l12890j25434M586
$$ 21567622 19749222 18346177 17183986 16200495 15407844 14860995 14548105 14422671 14427257
13309A4427257L601Q4907M75026O95077Q65693J126957J579932K055430K554478
$$ 14427257 14430858 14515765 14990791 15685868 16551561 17678518 19258450 21313880 23868358
13300B3868358L194915M106853N403864P032898R946347J4283192K0746962K9640451
$$ 23868358 27063273 31170126 36573990 43606888 53553235 67836427 88583389 118223840
13292A18223840L8879318M2351810L1374422Q632282j2405789k7858705l7567108
$$ 118223840 157103158 199454968 230829390 239461672 227055883 199197178 161630070
13285A61630070l6889545k8785485k0424766j4163552j0050337p486604n883874
$$ 161630070 124740525 95955040 75530274 61366722 51316385 43829781 37945907
13278C7945907m828156m001566l334356k751739k362296j979310j570663j240861
$$ 37945907 33117751 29116185 25781829 23030090 20667794 18688484 17117821 15876960
13270A5876960j129111j040401r01230o82534l53532l51009m87129k38004l7642
$$ 15876960 14747849 13707448 12806218 12123684 11770152 11419143 10932014 10694010 10656368
13261A0656368J8064L1637J66376K81435N31480P67229J021853J233468J775297
$$ 10656368 10674432 10706069 10872445 11153880 11685360 12452589 13474442 14707910 16483207
13252A6483207K460795L390092M977397P028022R527083J1942923J2270910Q500704
$$ 16483207 18944002 22334094 27311491 34339513 43866596 55809519 68080429 76581133
13244G6581133K120650m009526q800470j1499357j1375024r100571o784892m871966
$$ 76581133 78701783 74692257 65891787 54392430 43017406 33916835 27131943 22259977
13236B2259977l482843k603579k075293j606656j444367j220316r53316q45967
$$ 22259977 18777134 16173555 14098262 12491606 11047239 9826923 8873607 8027640
13228H027640q00449o49153m25742l66464m25702m94453m35227k16047k75143
$$ 8027640 7227191 6578038 6152296 5785832 5360130 4865677 4430450 4214403 3939260
13219C939260k84643j01010j15086j55196r8544j47494k55146q9088p422j07033
$$ 3939260 3654617 3553607 3438521 3283325 3184781 3037287 2782141 2693053 2685631 2578598
13209B578598n9779m9309j88857j79327q6910R7379J04117j10287j34105L8448
$$ 2578598 2518819 2469510 2280653 2101326 2014416 2111795 2215912 2105625 1971520 2009968
13199B009968q3676j57935o8053j02916q0801q339l0531j66094m3020O3016M4585
$$ 2009968 1926292 1768357 1700304 1597388 1516587 1508248 1477717 1311623 1268603 1331619 1376204
13188A376204j01571j02699J3253J4724n9902q0851J10890M5184M9676j19812
$$ 1376204 1274633 1171934 1185187 1199911 1140009 1059158 1170048 1215232 1264908 1145096
13178A145096j07788l0141J42776o4650k83909j53270R9591J28860J18713M8348
$$ 1145096 1037308 1007167 1149943 1085293 801384 648114 747705 876565 995278 1043626
13168A043626P054j37052Q635O8234l0519j13305m4733m1354m5045j07710n8708
$$ 1043626 1050680 913628 922263 990497 959978 846673 801940 760586 715541 607831 549123
13157E49123L3338J35191J2616J7024j23075q3558J18798P7475k4454j7119k3126
$$ 549123 582461 717652 730268 747292 624217 540659 659457 736932 712478 695359 672233
13146F72233m9078m4103q1593J17798N423m7080J0703R9457l7841m9403j958o1664
$$ 672233 623155 579052 497459 615257 620680 573600 584303 683760 645919 596516 594558 532894
13134E32894k6506r9009n1984J27545j2726j3183k3011j03492M8251K3652o5863
$$ 532894 506388 407379 355395 482940 470214 457031 434020 330528 378779 402431 336568
13123C36568o5484J27776M2017O9955o9778q3582P2129j5790j15456p0662M9434
$$ 336568 271084 398860 440877 510832 441054 357472 429601 413811 298355 227693 277127
13112B77127J36399m8725n4591q837l6116J03303J45206J1290L4518m0600r9450
$$ 277127 413526 364801 310210 301373 265257 368560 513766 525056 559574 518974 419524
13101D19524K9607j23787k08235j7371m563N1229L3035K6894J7665k9144m200
$$ 419524 449131 325344 117109 99738 95175 146404 179439 206333 223998 194854 190654
13090A90654K7111N622J20826J09234J3002l1444j9440r7972j64256k2210R8904
$$ 190654 217765 223387 344213 453447 466449 435005 415565 317593 153337 131127 230031
13079B30031P2574N9580L9602Q032l4419q8559K9222J00856J2629K3265j2240
$$ 230031 302605 362185 401787 409819 375400 286841 316063 416919 429548 452813 440573
13068D40573p3041m0490q9111k8316l9502m7736L3264L7212P2395r5702K3237
$$ 440573 367532 327042 237931 209615 170113 122377 155641 192853 265248 169546 192783
13057A92783M9877P5578P8431j42174j68091P364L0970K1519j1029k491j9488
$$ 192783 242660 318238 396669 254495 86404 93768 124738 146257 135228 132737 113249
13046A13249K8591L6492P8209j5590l7481o1753k8803N740j7744M1706J1902N6692
$$ 113249 141840 178332 256541 240951 203470 141717 112914 118654 100910 142616 154518 211210
13034B11210L4676M0565J0723L854P3307R52p0386m6771l1622J16189K4862j73695
$$ 211210 245886 286451 297174 301028 374335 375287 304901 258130 226508 342697 367559 193864
13022A93864j10819j9918J34389N8789k3882m2539j1854L1381o8218q0875j8117
$$ 193864 83045 63127 197516 256305 232423 189884 178030 209411 141193 60318 42201
13011D2201J02302O7874j8992k36384j48432J13944J45353J08746j2118L3826
$$ 42201 144503 212377 193385 -42999 -191431 -77487 67866 176612 164494 198320
13001A98320O851l9358l9047r989P5869j4318n1938p0679l9534L0558O8260j34252
$$ 198320 205171 165813 126766 116777 192646 178328 126390 55711 16177 46735 114995 -19257
12989a9257j4552Q2514P9341P9772O1772K8448r696j15546j64460P0370K844j16694
$$ -19257 -33809 48705 128046 207818 269590 298038 288342 172796 8336 78706 81550 -35144
12977c5144K2558M6388P357J06067O5675j7526o146L3854j13837k004M3559l8456
$$ -35144 -12586 33802 41159 147226 212901 195375 189229 223083 109246 107242 150801 112345
12965A12345j32176J05403L696r4828K9860j5594o3998J63O0719n5550K5514M3760
$$ 112345 -19831 85572 89268 -5560 24300 8706 -55292 -55129 5590 -49960 -24446 19314
12953A9314m2184l9342J36725K6688j24360k2573J05580P1755k3654M9068K6719
$$ 19314 -22870 -62212 74513 101201 -23159 -45732 59848 131603 107949 157017 183736
12942A83736O3282o6023p1049k3159K5160K8891k9579p3162q1064Q1282j5828
$$ 183736 247018 180995 109946 86787 111947 140838 111259 38097 -42967 38315 22487
12931B2487j1290J04877r18j6602l0004L9078L6183m4744J47437l571m2159q4095
$$ 22487 11197 116074 115156 98554 68550 107628 143811 99067 246504 242933 200774 116679
12919A16679M294r299M1861l1868m6101J1662J89806J25843J00706Q7178M5561
$$ 116679 120973 111674 153535 121667 75566 87228 277034 402877 503583 590761 636322
12908F36322M0148r474j18089j02291j82011J8659j7744L8165r8749j23365k6852
$$ 636322 676470 666996 548907 446616 264605 283264 265520 303685 204936 81571 54719
12897E4719R165J37173R8856q3219k7468j01852p9822O0950J10088n1507o349
$$ 54719 63884 201057 299913 216694 189226 87374 7552 68502 178590 127083 120734
12886A20734Q7580m2993k6273k5235Q9232j08262k2184M1172J4170M2270l4212
$$ 120734 208314 165321 139048 113813 203045 94783 72599 113771 127941 170211 135999
12875A35999j0769J1693N6796J92241N842j8841j9502J04706L09435J18993J56743
$$ 135999 125230 136923 193719 385960 391802 372961 353459 458165 767600 886593 1043336
12864A043336J90374K3390m7105j26159j75014l1902p3489j52183j47964q6832
$$ 1043336 1233710 1257100 1209995 1083836 908822 876920 803431 651248 503284 416452
12854D16452q3824j7745n4358P5460L934L7996j0646R234j33130n028K1972n5651
$$ 416452 332628 314883 260525 335985 339919 377915 367269 376503 243373 238345 260317 204666
12842B04666m7268K0459M3014j32315O4851P0377q5435n6039j35052P9336R0956
$$ 204666 157398 177857 220871 88556 153407 223784 138349 82310 -52742 26594 117550
12831A17550N4255L182r2264j3896J9477K03482O3078O8909J64769J11586K06146
$$ 117550 171805 174987 82723 68827 88304 291786 354864 423773 588542 700128 906274
12820I06274K95921J09422L5390j24808k07126j44342j09528j20477p7761r3490
$$ 906274 1202195 1311617 1347007 1222199 1015073 870731 761203 640726 562965 469475
12810D69475q0737l1587p1317L2290R7729j02289j28055j6529m3017O468l182
$$ 469475 388738 357151 285834 318124 415853 313564 185509 168980 125963 132431 129249
12799A29249o5710o3272J8731Q3168L8027l1064o6207O407J4249k7737M5982J15366
$$ 129249 63539 267 18998 102166 140193 109129 42922 49329 63578 35841 81823 197189
12787A97189L966o8394j8913k159q2314l3194J4339l1011m9936N0160K35835J59426
$$ 197189 201155 132761 113848 111689 29375 -3819 10520 -20491 -70427 -20267 215568 374994
12775C74994N2564Q5561o5605j84475p3356J9054k1979o1803L0600K0269l9626
$$ 374994 427558 513119 447514 263039 189683 208737 186758 124955 155555 175824 136198
12764A36198q53N1358N555j08904J475M3688K8430m7928L2685o2478M0892N3237
$$ 136198 135345 186703 192258 83354 84829 128517 156947 109019 141704 79226 120118 173355
12752A73355K1187P6468L4270j65844k02269L7928P6726J15936r390p6740K1601
$$ 173355 194542 271010 305280 139436 -62833 -24905 51821 167757 158367 81627 103228
12741A03228j6192P8141j8239j70775n3274J0825J06747J41762J5965p4938p4424
$$ 103228 87036 165177 146938 -23837 -77111 -66286 40461 182223 198188 123250 48826
12730D8826m477N881J0985o8315j6274j710l0940R9509j22142p9915J28490P3213
$$ 48826 44349 50230 61215 -7100 -23374 -25084 -56024 43485 -78657 -158572 -30082 43131
12718D3131Q6405K2807n4309J116M1333o6905r430N6844n0775o8944r2276m8972
$$ 43131 129536 152343 98034 99150 140483 73578 64148 120992 70217 1273 -91003 -139975
12706a39975M079q9928M4972J64893P2304K5258O5761l4o2316l4391j2357l0419
$$ -139975 -135896 -225824 -180852 -15959 56345 81603 147364 147330 85014 50623 38266 7847
12694G847R723L7411j18671n8002M3133J07202L3987N357p528J5647K5733l7313
$$ 7847 17570 54981 -63690 -121692 -78559 28643 62630 67987 60459 76106 101839 64526
12682F4526M2004l6006p7942n0346j8196O833L2327J48869K7267m836l4610P8969
$$ 64526 106530 70524 -7418 -57764 -75960 -69127 -36800 112069 139336 134500 99890 178859
12670A78859m5357r5739J4802P623J7221m5190J10553L8393p4063k3676m8360
$$ 178859 133502 37763 52565 60188 77409 32219 142772 181165 107102 83426 35066
12659C5066l0614j281L9055O876k9480Q8388L7235q8733n7307j42758K0988P4487
$$ 35066 4452 3171 42226 49102 19622 108010 145245 56512 -795 -143553 -122565 -48078
12647d8078K1966L9086R5491o0635L3342m01l7805O6857M5204k9952j06688o383
$$ -48078 -26112 12974 108465 47830 81172 80771 42966 109823 155027 125075 18387 12004
12635A2004Q5948o6132p975j3657j0938j12052l3855N5800k3626Q2033N7879K5015
$$ 12004 97952 31820 23845 10188 -750 -112802 -146657 -90857 -114483 -32450 25429 50444
12623E0444o3697J02600K1484k07333k00675Q5550J37686L7236J4212j6701L1339
$$ 50444 -13253 89347 110831 -96502 -297177 -211627 -73941 -36705 -22493 -39194 -7855
12612g855N37K6650J6197N3778j33248j191P4700k0947m175P1236K7818r692L9693
$$ -7855 -7318 19332 35529 89307 -43941 -45132 29568 8621 4446 75682 103500 93808 133501
12599A33501J8657O5692k8321j00210k4826J6341N9129K4773j01436j04637j998
$$ 133501 152158 217850 189529 89319 64493 80834 139963 164736 63300 -41337 -43335
12588d3335n1560J0651J82898N6152l0981j41246J36487j2432l5688k2936m26
$$ -43335 -94895 -84244 98654 154806 123825 -17421 119066 106634 70946 48010 47584
12577D7584j479N3798J935O3228k1022J43448J86781L9859N6133r2222J4262J14231
$$ 47584 46105 99903 101838 165066 144044 287492 474273 514132 570265 478043 492305 606536
12565F06536l3694j25963l40736m2427J61611N7654j05014p4657J8196j9371K9570
$$ 606536 572842 446879 106143 63716 225327 282981 177967 103310 121506 102135 131705
12554A31705k1593j02993j5851q1293m6114O8392J16107J20932J5379m3606K351
$$ 131705 110112 7119 -8732 -90025 -136139 -67747 48360 169292 184671 141065 143416
12543A43416j74145j30403M9047M0886J0390L3040Q4013J4384J6866m817j0041
$$ 143416 -30729 -161132 -112085 -71199 -60809 -27769 56244 70628 87494 82677 72636
12532G2636J3612O8903K544j3721p2773p0541r2434L2187N5223K1704P1710J3434
$$ 72636 86248 155151 157695 143974 71201 660 -91774 -59587 -4364 17340 89050 102484
12520A02484j8996q4204O0492L3164q6609K3274L3829m7538M5881J31287n9406
$$ 102484 83488 -716 59776 92940 6331 29605 63434 15896 61777 193064 133658
12509A33658j05945j0786r8551m7264O86m6281M386K06554N8213n1884L6321J9568
$$ 133658 27713 16927 -81624 -128888 -128202 -174483 -170097 36457 94670 42786 79107 98675
12497I8675j666L1210P3180J3550j09882j14280P2783J10012j61753j91083j11455
$$ 98675 97009 128219 201399 214949 105067 -9213 63570 173582 11829 -179254 -290709
12486b90709R2169O7786m5066o3359j4458K2960N1413J7955J20568P255o7060
$$ -290709 -198540 -130754 -175820 -239179 -253637 -230677 -179264 -161309 -40741 -33486 -100546
12475a00546P8849J9533R9443Q5356p6955k1927q208K5594j3710J8937r3941R2247
$$ -100546 -21697 -2164 97279 182635 105680 83753 75545 101139 87429 106366 12425 104672
12463A04672o7256j02239q9675J37650Q1239q0692P9150o9140J0722r455N81n641
$$ 104672 37416 -64823 -154498 -16848 64391 -16301 62849 -6291 4431 -5024 -4443 -10084
12451a0084o9739j21327J1536J00335P0324Q3432N1420O7214l4886q1964P4169
$$ -10084 -79823 -201150 -189614 -89279 -18955 64477 115897 183111 148225 66261 140430
12440A40430N9146j03866R409k1015P2675O3461j91104q7326R3960Q4332Q9650
$$ 140430 199576 95710 105119 84104 156779 220240 29136 -58190 35770 120102 209752
12429B09752j1155k01480l5338J05452k0714r0884n6796j0334O5101J8481K2250
$$ 209752 198597 -2883 -38221 67231 46517 -44367 -101163 -111497 -46396 -27915 -5665
12418e665o6576J5679j1737M0383M2528J08098r1055J7927P1366j01864j07988
$$ -5665 -72241 -56562 -68299 -27916 14612 122710 31655 49582 120948 19084 -88904
12407h8904J52002m8457r7390N7362M1638M5144J09039L4350j6894j25601j59597
$$ -88904 63098 14641 -82749 -25387 16251 61395 170434 204784 187890 62289 -97308
12396i7308M1855n184n6307K4507L5243J18088K2779l4425n7739n1358l8156q0198
$$ -97308 -55453 -60637 -116944 -92437 -57194 60894 83673 49248 -8491 -59849 -98005 -178203
12384a78203O2529J12294q821o1078O5439n2708p2339R2018Q0019k2840J7719
$$ -178203 -115674 -3380 -12201 -73279 -7840 -60548 -132887 -40869 39150 16310 34029
12373C4029O9245O1067j06532L2444n9802o5410O9197K07707j5641m8707N4331
$$ 34029 103274 164341 57809 90253 30451 -34959 34238 241945 226304 177597 231928
12362B31928l0387n5187o7718k4283J17914N7168j20944r7749J32845N4097j5524
$$ 231928 201541 146354 78636 54353 172267 229435 108491 10742 143587 197684 182160
12351A82160j1303p0827p0748N3255l1583j32035L6978J8728j656K3883J09234
$$ 182160 170857 100030 29282 82537 50954 -81081 -44103 -25375 -27031 -3148 106086
12340A06086o0423j65641r0605J1372J35313J07020l7287p6573n276J12833m3241
$$ 106086 45663 -119978 -210583 -199211 -63898 43122 5835 -70738 -76014 36819 -6422
12329f422l622M2622L7882J12168K2295j63188j23121l0073L6134N9123M3099
$$ -6422 -10044 32578 70460 182628 204923 41735 -81386 -111459 -75325 -16202 26897
12318B6897R9691K6098J9069J37119Q0101j40771j20500m8822j46738j8394J20156
$$ 26897 126588 152686 171755 308874 388975 248204 127704 78882 -67856 -86250 33906
12307C3906O3135p562j29523j14050p0170L5035J52836o3731k1522K7053m2683
$$ 33906 97041 89479 -40044 -154094 -224264 -189229 -36393 -100124 -121646 -94593 -137276
12296a37276j25899J01046O2746J6981M3669m4002K3134J12526J32776k592j14496
$$ -137276 -263175 -162129 -99383 -82402 -38733 -82735 -59601 52925 185701 183109 68613
12285F8613J7185K5268n8385q6010n2767n2738J19395L5569l5875J03379L7460
$$ 68613 85798 111066 52681 -33329 -86096 -138834 -19439 16130 -19745 83634 121094
12274A21094M1346J59175o2113j31067L7293k2992l7589K5327M0626j0236J6520
$$ 121094 162440 321615 259502 128435 165728 142736 105147 130474 171100 160864 177384
12263A77384r8682o9290k1756M9489R063k9662q101J23679j953n4811p5070n2807
$$ 177384 78702 9412 -12344 37145 46208 16546 8445 132124 130171 75360 290 -52517
12251e2517L9048J58926J1583l9549r712q0997j00852n3209P3190Q2975J44510
$$ -52517 -13469 145457 157040 117491 107779 26782 -74070 -127279 -54089 28886 173396
12240A73396o7969m2582R1760R3818m9470p1588q2685r9806K5384R5483L16j5528
$$ 173396 105427 62845 154605 248423 198953 127365 44680 -55126 -29742 65741 66057 50529
12228E0529j9825p1143J30397J00945n7244J7153n5376m1873j03504r1885O2878
$$ 50529 30704 -40439 89958 190903 133659 150812 95436 53563 -49941 -141826 -78948
12217g8948M7286L1420R7850o4925l2730N2764j8788L8368p4229K0542r0405n8145
$$ -78948 -31662 -242 97608 32683 -47 52717 33929 72297 -1932 18610 -71795 -129940
12205a29940R4713K8162Q9636R6356M9231p1262M7745M3905l7937r3033M66J1618
$$ -129940 -35227 -7065 82571 178927 228158 156896 204641 248546 210609 117576 118042 129660
12193A29660M9064p540R0522J3401j6767M5986n4735L6065O9895o1014J57559
$$ 129660 178724 171184 261706 275107 258340 304326 249591 285656 355551 294537 452096
12182D52096L0578j29367k9254l5100R3476m4550j08634j65105J0821n0238p1324
$$ 452096 482674 353307 324053 288953 382429 337879 229245 64140 74961 24723 -46601
12171d6601P7486k4594n1390O5127p4628m2520K7695N3774M0182K8990l6706K0856
$$ -46601 30885 6291 -45099 20028 -54600 -97120 -69425 -15651 24531 53521 16815 37671
12159C7671O2982M3869j3412K5000K0034J38464N3603p1814L2179J02688q0373
$$ 37671 100653 144522 131110 156110 176144 314608 368211 296397 328576 431264 350891
12148C50891j29267q1591j5460r3834j1830n7774k2237m5104N7387Q5627N9201
$$ 350891 221624 140033 124573 30739 18909 -38865 -61102 -106206 -48819 36808 96009
12137I6009O6392J24966j3016j04964o3840P8100J19761j4494j6742N9746n7322
$$ 96009 162401 287367 274351 169387 105547 183647 303408 288914 272172 331918 274596
12126B74596J0448Q329P0114J7123m9914r8705j23960m5490p6318o77L3367K5252
$$ 274596 285044 293373 363487 380610 330696 231991 108031 62541 -13777 -14454 18913 44165
12114D4165O2094j5056j3937L4808J06967j0721Q1124N3672J847r4960N3357k8831
$$ 44165 106259 91203 77266 112074 219041 208320 289444 343116 344963 250003 303360 274529
12102B74529q3528J0715N361l7953K5575J21767o9399j48567l9692N3677K7696
$$ 274529 191001 201716 207077 169124 194699 316466 247067 98500 58808 112485 140181
12091A40181J4969L8054J5438r85o5896n1025J09826M815j08575K7523N804Q7155
$$ 140181 155150 193204 208642 207657 141761 90736 200562 205377 96802 124325 130129 217284
12079B17284N0482O0810k260K4769p3290Q638M6116M1094n2553p8345M033o6227
$$ 217284 267766 328576 326316 351085 277795 286433 332549 373643 321090 242745 246778 180551
12067A80551O9066L2492p0140J2520J21845q045p6350n4631J05617K05312R2365
$$ 180551 249617 282109 211969 224489 346334 338289 261939 207308 312925 518237 610602
12056F10602q2244p605O6901l1908j06462K3960J32019Q1073J05359n6020m756
$$ 610602 528358 520753 587654 555746 449284 473244 605263 686336 791695 735675 730919
12045G30919l9538n9190j62939N0553L2803r5641j0225K7612J55999R4514m3875
$$ 730919 691381 632191 469252 519805 552608 456967 446742 474354 630353 724867 680992
12034F80992k1106j11942P1256P784m9347P8195M6321k7887p3027q6988r1602
$$ 680992 659886 547944 619200 626984 577637 655832 702153 674266 601239 514251 422649
12023D22649L6939J04547K9628o6273M3522l1584M5323O7565o2619o1652J00441
$$ 422649 459588 564135 593763 527490 571012 539428 584751 652316 589697 528045 628486
12012F28486J58713J22989q86J8196K503m4740N9086N9564J7259q8801R3496R9870
$$ 628486 787199 910188 909302 927498 930001 885261 944347 1003911 1021170 932369 1025865 1125735
12000A125735P4928n0471o7176Q4260p604M4853J4349L2486J20182K0289J06417
$$ 1125735 1200663 1150192 1083016 1167276 1159672 1204525 1218874 1251360 1371542 1391831 1498248
11989A498248J90389J34294M6281L727j9781L5760O6825N4978O1446J33147P5239
$$ 1498248 1688637 1822931 1869212 1872939 1853158 1888918 1955743 2010721 2072167 2205314 2280553
11978B280553J17419J5259Q9174J58492J65046J19703J50434K61284K18632K11070
$$ 2280553 2397972 2413231 2502405 2660897 2825943 2945646 3096080 3357364 3575996 3787066
11968C787066O6543k3840J41979L80705M15279L36496J91601K50129M11814M63079
$$ 3787066 3853609 3829769 3971748 4352453 4767732 5104228 5295829 5545958 5957772 6420851
11958F420851M23220M39463N17171N36962P54979Q83135Q79217Q82088J157894
$$ 6420851 6844071 7283534 7800705 8337667 9092646 9975781 10854998 11737086 12894980
11949A2894980J297941J409081J701435K016838K467073K721288L257208M093242
$$ 12894980 14192921 15602002 17303437 19320275 21787348 24508636 27765844 31859086
11941C1859086M910460N975790P258196R053823J1345381J4437627J7919081K2059435
$$ 31859086 36769546 42745336 50003532 59057355 70402736 84840363 102759444 124818879
11933A24818879K5866991K8054609K7232193K2284137J3141088J787867r539735
$$ 124818879 150685870 178740479 205972672 228256809 241397897 243185764 233646029
11926B33646029j8876728k4843112k6267788k4558331k1220691j7846503j4519486
$$ 233646029 214769301 189926189 163658401 139100070 117879379 100032876 85513390
11919H5513390j1799680r640799q004259o631963n483435m678440l892109l173239
$$ 85513390 73713710 64072911 56068652 49436689 43953254 39274814 35382705 32209466
11911C2209466k826704k388257k191988j927589j779776j585165j309715j154185
$$ 32209466 29382762 26994505 24802517 22874928 21095152 19509987 18200272 17046087
11903A7046087j049109q76398q22873q75623p28132p17279o95297n95198m26436
$$ 17046087 15996978 15120580 14297707 13422084 12693952 11976673 11281376 10686178 10259742
11894A0259742n97765n02786m12291m37323l21644k89373l76461k19705k74834
$$ 10259742 9661977 9159191 8746900 8309577 7987933 7698560 7322099 7102394 6827560
11885F827560k91820l86555l10199j89354j35213k56126l42883k92380k17795
$$ 6827560 6535740 6149185 5838986 5649632 5514419 5258293 4915410 4623030 4405235
11876D405235j87325k25399j26786p0468j49667j19636q4323o4811k23646j18812
$$ 4405235 4217910 3992511 3865725 3795257 3645590 3525954 3441631 3376820 3153174 3034362
11866C034362j88944k34069p3086k9616n8462j01576n3570n6681j00298K607q3897
$$ 3034362 2845418 2611349 2538263 2508647 2450185 2348609 2295039 2238358 2138060 2140667 2056770
11855B056770j70235K072M0447p8676j40065l9970q3734p4151M8557K7863N6303
$$ 2056770 1886535 1888607 1929054 1850378 1710313 1670343 1586609 1512458 1561015 1588878 1645181
11844A645181l0114j04131r3423j35673K9627N2088l5169o9897m8412k8431J2430
$$ 1645181 1615067 1510936 1417513 1281840 1311467 1363555 1328386 1258489 1210077 1181646 1194076
11833A194076L2511k4212r1192r6486q0322J3293o7877K7642J31260R6502m0773
$$ 1194076 1226587 1202375 1111183 1014697 934375 947668 879791 907433 1038693 1135195 1094422
11822A094422o1729j36541r1119P5603q0039j74547k5927M1546j6315O2964J2040
$$ 1094422 1032693 896152 805033 880636 800597 626050 600123 641669 625354 688318 700358
11811G00358K6515m4616j34680o8236J52829j706j0159J22963M8813j44790k0611
$$ 700358 726873 682257 547577 479341 632170 630464 620305 743268 792081 647291 626680
11800F26680j7839P3616j03259j50355o9085M6558J03346N5240K6444R915r0890
$$ 626680 608841 682457 579198 428843 359758 406316 509662 564902 591346 601261 510371
11789E10371N9048J31717m8443k16940k05301m860J21530J72932M4534n7454m3392
$$ 510371 569419 701136 652693 435753 230452 225592 347122 520054 564588 507134 463742
11778D63742k1376l9838n2498k415K2672m5063l0172N520O5656J52216j2817n9605
$$ 463742 442366 402528 350030 347615 370287 325224 295052 300572 366228 518444 505627 446022
11766D46022L2350N5048m5191o667n4723k15098p9133J24260Q5024Q684j1883
$$ 446022 478372 533420 488229 481562 426839 211741 132608 256868 341892 350576 338693
11755C38693J9759l7298K3902P065J9901J8136m3887J62720j2196j07173J6540
$$ 338693 358452 321154 345056 352121 372022 390158 346271 508991 496795 389622 406162
11744D06162J1821j55627M3162r7624m0840J42138N2056j45832l4334j15828j58066
$$ 406162 417983 262356 305518 207894 167054 309192 361248 215416 181082 65254 -92812
11733i2812j23528M141J34820Q1930Q7490J17013j12297j00385O1420J13544N8836
$$ -92812 -216340 -212199 -77379 4551 92041 209054 96757 -3628 57792 171336 230172
11722B30172N6624m5833l1516j9899M55k238K6270m3833j7856M3114J09982j17717
$$ 230172 286796 240963 209447 189548 190003 187765 214035 170202 152346 195460 305442 187725
11710A87725K0672Q120r8697p7660P770N3461J1821j10691P7681Q2811K0269J3563
$$ 187725 208397 216517 117820 40160 47930 101391 113212 2521 80202 163013 183282 196845
11698A96845r7977j10663P8957P444P1530P7079m9508K4547q0443J00186O4152
$$ 196845 98868 -11795 67162 74606 146136 223215 173707 198254 117811 217997 282149
11687B82149r3470j50279n5684J47226J23633M342l8588N1648L5671N2290J744
$$ 282149 188679 38400 -17284 129942 253575 257917 219329 270977 306648 358938 360682
11676C60682j51670r1209n3929P2020J265J4296R5137k4539m0807M0001P2464
$$ 360682 209012 117803 63874 135894 137159 151455 246592 222053 181246 221247 293711
11665B93711P8112k1775k34180j16761M9769M7070j5938j6830L3388o233j9634
$$ 293711 371823 350048 115868 -893 48876 95946 80008 63178 96566 90333 70699
11654G0699O1645O6641q7475q9049O2697k0860O1358L2609n9068k6871O464j0248
$$ 70699 132344 198985 111510 22461 85158 64298 125656 158265 99197 72326 78790 68542
11642F8542Q4041O7007k057l6426o0515J10422L6343N890j50607J5350j2855M8663
$$ 68542 152583 219590 217533 181107 120592 231014 267357 273247 122640 137990 125135 173798
11630A73798J71331P9605m6820j33580J7747j615K4659n7625j19944J0911j0444
$$ 173798 345129 424734 377914 244334 262081 260466 285125 227500 107556 118467 108023
11619A08023p91o5936M2894l5120j16395N0229J39890n1029P7072O6942l8294
$$ 108023 107232 41296 84190 49070 -67325 -17096 122794 71765 148837 215779 177485
11608A77485M7149L0700r2724J9401P2613l4500n2920q4386P7218j6095q5203
$$ 177485 224634 255334 162610 182011 254624 220124 167204 82818 160036 143941 58738
11597E8738q351m836K8993M8559n6977j4274k21J7145Q9543J8036p0911m8900
$$ 58738 50387 45551 74544 123103 66126 51852 51631 68776 158319 176355 105444 56544
11585E6544p655L1689l440K7909l1617N596O0775J0736m2941j53621r2479k8260
$$ 56544 48889 80578 77138 105047 73430 79026 139801 150537 107596 -46025 -138504 -166764
11573a66764J12496l8871m1980J51291J01370j00888p4743K1743m8801O573L5324
$$ -166764 -54268 -93139 -135119 16172 117542 16654 -58089 -36346 -85147 -78574 -43250
11562d3250M0141J8073k3980O4022K3250n661Q3843Q4044m1418j56669l5055O9598
$$ -43250 -3109 14964 -9016 55006 78256 72595 156438 240482 199064 42395 7340 76938
11550G6938Q8468j34307r7477P4707n6263p356J9223m8517J23360Q2960L6605
$$ 76938 165406 31099 -66378 8329 -47934 -55290 -36067 -84584 38776 121736 158341
11539A58341K2457J5820n3314R562J33797p244j68105J42768P0875J7569r4187
$$ 158341 180798 196618 143304 152866 286663 279419 111314 254082 324957 342526 248339
11528B48339o3059N4557n0879n0348r01n299q8329j8702l0522r1742N7662Q9958
$$ 248339 185280 239837 188958 138610 137709 132410 44081 25379 -5143 -96885 -39223 50735
11516E0735J4853j3944m3962K2725O8528L5888q6410j64364l3161m5014J49146
$$ 50735 65588 51644 7682 30407 98935 134823 48413 -115951 -149112 -194126 -44980
11505d4980J59991K8553q3660j00669n4897N6717J09223J24600J0828M694r9393
$$ -44980 115011 143564 59904 -40765 -95662 -38945 70278 194878 205706 210400 111007
11494A11007j3754q712p7429O526M1188M9994l164o7408p8780O2825L5753l6173
$$ 111007 97253 88541 11112 17638 58826 108820 105656 38248 -40532 22293 58046 21873
11482B1873r5982o0855K8385j0538j5982M6203m8985k9333Q9778O5500l9145m4137
$$ 21873 -74109 -134964 -106579 -117117 -133099 -86896 -135881 -165214 -75436 -9936 -49081 -93218
11470i3218j7315n1800j07806O2596J01583P9034O2372O0016k4427J1335o4573
$$ -93218 -110533 -162333 -270139 -207543 -105960 -26926 35446 95462 71035 82370 17797
11459A7797j4768l351J03381N924k2339K7401j22727j34237P3934N8350N4076
$$ 17797 3029 -322 103059 108983 86644 114045 -8682 -142919 -68985 -10635 43441
11448D3441K9644n5487j94978p2298L3919J40589O6193K0135O343n9767N0847
$$ 43441 73085 17598 -177380 -249678 -215759 -75170 -8977 11158 17501 -42266 8581
11437H581P4584J62977j08391o7020o0386m8004M385m7127j35091k2616K5979
$$ 8581 83165 246142 137751 70731 10345 -37659 -33274 -80401 -215492 -238108 -212129
11426b12129R4306P2274k7163m334K1732J04655J41851q930N5384R4614n7792
$$ -212129 -117823 -45549 -72712 -77046 -55314 49341 191192 182262 237646 332260 274468
11415B74468j07399n0475M4761M9619Q2462k3914j9252j21270n3475j1280J17435
$$ 274468 167069 116594 161355 210974 293436 269522 250270 129000 75525 64245 181680
11404A81680K1469q2243K8011J3735l7491M1107j14602j05841k4364m0889n5826
$$ 181680 203149 120906 148917 162652 125161 166268 51666 -54175 -78539 -119428 -175254
11393a75254M3804J17949J29890P475j38793M648M2364r034J1246o0065n1062
$$ -175254 -131450 -13501 116389 123864 -14929 -10281 32083 23049 34295 -25770 -76832
11382g6832N36Q241J82175P7532r7114o3972J211Q6557J2337K0073O0721n1241
$$ -76832 -76296 -68055 114120 191652 94538 30566 31777 118334 130671 150744 211465 160224
11370A60224j63507m4798l6979o183O8509m8381K3376P8719k8616k0669m388O5724
$$ 160224 -3283 -48081 -85060 -91243 -22734 -71115 -47739 30980 2364 -18305 -22693 43031
11358D3031j0047j31520o9627P3930K3241j2617l3173k7323R482j2482n7951N1358
$$ 43031 32984 -98536 -168163 -94233 -70992 -83609 -116782 -144105 -134623 -147105 -205056 -153698
11346a53698J16189j5772N0579j9788J7100k5371M798K025K3472o4104O1468O2544
$$ -153698 -37509 -53281 -2702 -22490 -5390 -30761 -25963 -23938 -466 -64570 -3102 59442
11334E9442R1043O3442q4682j8633p2301n3908J1011J28169M7868n232N378l8932
$$ 59442 150485 213927 129245 110612 38311 -15597 -4586 123583 171451 166219 171597 132665
11322A32665r0222j4255j86741j10932O877R8513J17628m583O7227K9539K1524
$$ 132665 42443 28188 -158553 -269485 -262608 -164095 -46467 -51050 16177 45716 67240
11311F7240J10873m1454j29425l1742o132n9233o6612l16P5329R5344Q1994m433
$$ 67240 178113 136659 7234 -24508 -30640 -89873 -156485 -156801 -81472 13872 95866 91433
11299I1433l5862J766K7706p7489l7867l0710N2853K0797n2125K3098L7159k8859
$$ 91433 55571 57337 85043 7554 -30313 -61023 -8170 12627 -39498 -16400 20759 -8100
11287h100N7531l4330R7456O8635j08345j1288Q2838p1353m8896m335L1957q7265
$$ -8100 49431 15101 112557 181192 72847 61559 144397 73044 24148 19813 51770 -35495
11275c5495m6295O3588o1558q2363J04484J249k7400L7224L3749K6878J54230
$$ -35495 -81790 -18202 -79760 -162123 -57639 -56390 -83790 -46566 -12817 14061 168291
11264A68291k535j24096j02195j3613K5628M9659J8532p902j10922n7982q1773
$$ 168291 165756 41660 -60535 -74148 -48520 1139 19671 11769 -99153 -157135 -238908
11253b38908m7650M3047R3500O2677J25278r2538o5983j68527N5451J84524j0659
$$ -238908 -286558 -243511 -150011 -87334 37944 -54594 -120577 -289104 -233653 -49129 -59788
11242e9788N0217k2907l012j90p5303L5445N2338P0411R9512M6949N9024n5770
$$ -59788 -9571 -32478 -35490 -35680 -110983 -75538 -23200 47211 146723 193672 252696 196926
11230A96926m1077K9620j08701j69292j4419L8196J09118K3794P277K7638M1420
$$ 196926 155849 185469 76768 -92524 -106943 -68747 40371 64165 71442 99080 140500
11219A40500k1698j0363o5121j24543K4620p743L8921q726K0427L1687L2337k8323
$$ 140500 118802 108439 43318 -81225 -56605 -64348 -25427 -34153 -13726 17961 50298 21975
11207B1975J02846L2598r8087l6175j3413m8319k4783k4536l721J00185J8799
$$ 21975 124821 157419 59332 23157 9744 -38575 -63358 -87894 -91615 8570 27369
11196B7369m493N4794L4007l9123M4706k5963k3473O8883J19507J0704j44340
$$ 27369 22876 77670 111677 72554 117260 91297 67824 136707 256214 266918 122578
11185A22578j65537Q089K9651J4052R4219j23343j39235n0802m1360N2092O8346
$$ 122578 -42959 -34870 -5219 8833 103052 -20291 -159526 -210328 -251688 -199596 -131250
11174a31250J75580R4661R703r0283k7530j18769o4236M5650n6259j8486J48356
$$ -131250 44330 138991 148694 58411 30881 -87888 -152124 -106474 -162733 -181219 -32863
11163c2863J12370k1003o2399o1880P529l8378O4939J11918R6228K6869k5755
$$ -32863 79507 58504 -3895 -65775 -58246 -96624 -31685 80233 176461 203330 177575
11152A77575J5771m5593k15076j7473J9970j5082R0563P2542k5638j67554j56972
$$ 177575 193346 147753 -67323 -84796 -64826 -79908 10655 83197 57559 -109995 -266967
11141b66967L2772m6239R4133J17573p9630O338M5260J4056J6659j5216l1103
$$ -266967 -234195 -280434 -186301 -68728 -148358 -142020 -96760 -82704 -66045 -81261 -112364
11130a12364J8428j16j22521K5763R8034q40J9776k8290K8192p760l9341M5804
$$ -112364 -93936 -94052 -216573 -190810 -92776 -93616 -73840 -102130 -73938 -81698 -121039 -75235
11118g5235J64126k77j10626n8585Q209j2970o9179K3934P005O2513J44542N5269
$$ -75235 88891 88614 -22012 -80597 -72388 -85358 -154537 -130603 -123598 -61085 83457 138726
11106A38726q1619j51474r0225J02463q5624N8989K4167n2061Q8215O2080R1125
$$ 138726 57107 -94367 -184592 -82129 -167753 -108764 -84597 -136658 -48443 13637 104762
11095A04762p7084Q91j08293k2324j17905M5521M7611K0079K1510N1710P1907
$$ 104762 27678 28569 -79724 -102048 -219953 -174432 -126821 -106742 -85232 -33522 38385
11084C8385o8502J2737M8909R5275J077m8083j16845K8636J2286r680R105l9169
$$ 38385 -30117 -17380 31529 126804 127881 79798 -37047 -8411 3875 -5805 3300 -35869
11072c5869j5778k6178P0106M7309L0715o9068Q4785J40625p1255n5510n8830
$$ -35869 -51647 -77825 -7719 39590 70305 1237 86022 226647 155392 99882 41052
11061D1052P4481M733r2714L587J0201N6801k6818M446K1201j25077O5276J06784
$$ 41052 115533 120266 27552 31139 41340 98141 71323 75769 96970 -28107 37169 143953
11049A43953J18242l0875m485L9763R7342J04316o9147n8147l2559M5689l0829
$$ 143953 262195 231320 226835 266598 363940 468256 399109 340962 308403 354092 323263
11038C23263Q9974J03442J75486J34302J7382j0977N1079j11862j39825j27459
$$ 323263 413237 516679 692165 826467 843849 832872 883951 772089 632264 504805
11028E04805M5064J55892P992N1278J21651J92451M3384l5032m9216k2477M129
$$ 504805 549869 705761 713753 765031 886682 1079133 1122517 1087485 1038269 1015792 1019921
11017A019921r9170r2594j90123l6188J48913O8605O723R931q054M7799o7814
$$ 1019921 920751 828157 638034 601846 750759 819364 826087 836018 827964 875763 807949
11006H07949j37425k84523j13611N593l0452k608Q886Q0854J10757J4298K6667
$$ 807949 670524 386001 272390 277983 247531 244923 253809 334663 445420 459718 486385
10995D86385M790j71502j03064j98825j27188R5687J4215p3988L1433N5130j7403
$$ 486385 491175 319673 216609 17784 -109404 -13717 498 -73490 -42057 13073 -4330
10984d330K804J09290n9563k10580k2100P8723N998O6356j8895K5424p558q9457
$$ -4330 -1526 107764 48201 -162379 -184479 -105756 -99758 -33402 -52297 -26873 -34431 -123888
10972a23888L7314O9036K6230l2422O4411J78198J3306l9907m9708o8107j5311
$$ -123888 -86574 -17538 8692 -23730 40681 218879 232185 192278 142570 74463 59152
10961E9152J7988j39801p6550m8709J6446J85918J08072l6474r8328n9657K7676
$$ 59152 77140 -62661 -139211 -187920 -171474 14444 122516 86042 -12286 -71943 -44267
10950d4267l0506j4279M555M2209j10229n9047j4112j3616J57657N4937n911q6835
$$ -44267 -74773 -89052 -84497 -42288 -152517 -211564 -225676 -239292 -81635 -26698 -32609 -119444
10938a19444P8752J22685p8297o6016l125O2737Q701j8104K1043J6050L2388M0876
$$ -119444 -40692 81993 3696 -62320 -65445 -2708 5993 -12111 8932 24982 57370 98246
10926I8246n493o2210q7097j3378L7755J07346M84q5216k3569Q873P5941n0807
$$ 98246 92753 30543 -56554 -69932 -32177 75169 75653 -9563 -33132 -24259 51682 875
10914H75o3708j2902Q6958P4588j7565K1445q8514l3864m3066L644M7167L90l1251
$$ 875 -62833 -75735 11223 85811 68246 89691 1177 -32687 -75753 -72109 -24942 -24552 -55803
10901e5803j7297Q1828n0838k7045P436m4790j41625k4051J16772n3406m9289
$$ -55803 -73100 8728 -42110 -69155 -61719 -106509 -248134 -272185 -155413 -208819 -258108
10890b58108M7154k2660O0073m4465l5334R18M2937j761K5750L5077k1735Q7345
$$ -258108 -210954 -233614 -173541 -218006 -253340 -252422 -209485 -211246 -185496 -150419 -172154 -84809
10878h4809M8504r8893L7188Q3112k1608J01625l7936l8145K8381N4736J06247
$$ -84809 -36305 -135198 -98010 -14898 -36506 65119 27183 -10962 17419 72155 178402
10867A78402K4114j10185n1132K3135L3064o3977j3101Q4364L0067q4135Q8003
$$ 178402 202516 92331 41199 64334 97398 33421 20320 104684 134751 50616 138619
10856A38619L0973j19168o7925L7547l7902j19k6825P849k9887k0658L9736k3608
$$ 138619 169592 50424 -17501 20046 -17856 -17975 -44800 -36951 -66838 -87496 -47760 -71368
10844g1368M5792R1072j9032q6833L0930O376o4261K7719k8418O9414J83634L5951
$$ -71368 -25576 65496 46464 -40369 -9439 -3063 -67324 -39605 -68023 1391 185025 220976
10832B20976k6794o2749o813K3688M4934j32253n1780K0829K6280j6165q8554
$$ 220976 194182 131433 124620 148308 193242 60989 9209 30038 56318 40153 -48401
10821d8401j49302N0218M8698J04483J48706q7826j19954o0262j18035j30073
$$ -48401 -197703 -147485 -98787 5696 154402 66576 -53378 -113640 -231675 -361748
10811c61748R9918J73978k0054r1253l2339M1141J12839R8949m2165K5727l4317
$$ -361748 -261830 -87852 -107906 -199159 -231498 -190357 -77518 21431 -20734 4993 -29324
10800b9324N6884J62554R96m9013j14948O4000q6125j16123k7024k6283R6375
$$ -29324 27560 190114 191110 142097 27149 91149 5024 -111099 -138123 -164406 -68031
10789f8031k532L1421j24257M409J24925N770m2622P7861K7331j4451L5231O8361
$$ -68031 -70563 -39142 -163399 -158990 -34065 -28295 -70917 6944 34275 19824 55055 123416
10777A23416R8508j02787p8131k2959Q6139r4173j32468o267J06672j2078l5968
$$ 123416 221924 119137 41006 18047 104186 10013 -122455 -128722 -22050 -34128 -70096
10766g0096j6698N7712o3397M8088k9793l1578J17959J67194o6540j15085j31229
$$ -70096 -86794 -29082 -92479 -44391 -74184 -105762 12197 179391 112851 -2234 -133463
10755a33463r785J15561n2235k7734j08720O2277J15352P1413q3755K4122k544
$$ -133463 -143248 -27687 -79922 -107656 -216376 -154099 -38747 32666 -51089 -26967 -29511
10744b9511j8096K1844Q5805k2204K3680p3355l2314j6140J8979Q8031L2758N9161
$$ -29511 -47607 -25763 60042 37838 61518 -11837 -44151 -60291 -41312 46719 79477 138638
10732A38638O6233j1937J387l5213r3003q1385P4204J67453m1423r2911J25623
$$ 138638 204871 192934 194321 159108 66105 -15280 58924 226377 184954 92043 217666
10721B17666J45383P23j0342n9483R011R4438n4526l8147l9859J54338J19446
$$ 217666 363049 363772 353430 293947 302958 397396 342870 304723 264864 419202 538648
10710E38648K732N2011n9569j14142o5990N5198j1403l6304J5651p8395o3294
$$ 538648 541380 593391 533822 419680 353690 408888 397485 361181 376832 298437 235143
10699B35143r5615K9879O7679j5279P0690L1733k06323n6138K50191J10158j09427
$$ 235143 139528 169407 237086 221807 292497 324230 117907 61769 311960 422118 312691
10688C12691K3848N6659n5496M0155N3836N4106q2915P2052n9730j00913j6977
$$ 312691 336539 393198 337702 377857 431693 485799 402884 474936 415206 314293 297316
10677B97316R775j4018M8500Q2797m0631q4095R8633Q4864p8439Q9573j4801K5361
$$ 297316 307091 293073 341573 424370 383739 299644 398277 483141 404702 494275 479474 504835
10665E04835l5094j02931j4797j9847Q4802J22769k4262O5676j058J9973M1421
$$ 504835 469741 366810 352013 332166 416968 539737 515475 581151 580093 600066 641487
10654F41487J05029K00474J30337J9742m4822q5679K8626M1589l6842J45755J30472
$$ 641487 746516 946990 1077327 1097069 1052247 966568 995194 1036783 999941 1145696 1276168
10643A276168K4550Q6481J74942J32242J37176K42047M44226L94604M85566O01897
$$ 1276168 1300718 1387199 1562141 1694383 1831559 2073606 2517832 2912436 3398002 3999899
10633C999899O06864O29991L90100M84880M04820L12273L83109P26157J183293
$$ 3999899 4606763 5236754 5626854 6111734 6516554 6828827 7211936 7938093 9121386
10624I121386J643920K235023L021238M059402N243369O813583Q274866R072879
$$ 9121386 10765306 13000329 16021567 20080969 25324338 32137921 40412787 49485666
10616D9485666Q633026O597581L692965Q38582j067645j382936L8708K743981
$$ 49485666 58118692 64716273 68409238 69247820 68180175 66797239 66835947 69579928
10608F9579928O498232J1110859J5727227J8191183J6406063J0322526K673047
$$ 69579928 76078160 87189019 102916246 121107429 137513492 147836018 150509065
10601A50509065m233623q769404r475982o366459p18122O384423J3614522J9978616
$$ 150509065 146275442 137506038 128030056 121663597 120945475 127329898 140944420 160923036
10593A60923036K2673176J8459215Q290741l383473j3085033j9238698k0206866
$$ 160923036 183596212 202055427 210346168 206962695 193877662 174638964 154432098
10586A54432098j6035066r471582k594866L827860R062121J0612353P253710N2308
$$ 154432098 138397032 128925450 126330584 130158444 139220565 149832918 157086628 157138936
10578A57138936p507332j3486642j6772550j6504799j3191487q692873m484381
$$ 157138936 149631604 136144962 119372412 102867613 89676126 80983253 76498872
10571G6498872j163086R57215J650490J57987k690874n757201p977942r253226
$$ 76498872 75335786 76293001 77943491 78101478 75410604 69653403 61675461 52422235
10563E2422235r074082p517069o022004m813709l761253k726225k113605j632869
$$ 52422235 43348153 35831084 29809080 24995371 21234118 18507893 16394288 14761419
10555A4761419j297292j261094j082670q66080p70674n75304n98368o38194o62313
$$ 14761419 13464127 12203033 11120363 10254283 9483609 8908305 8309937 7671743 7009430
10546G009430l72691l16225k98768l51274k01410j54909k36764l91555k40131
$$ 7009430 6636739 6320514 6021746 5670472 5469062 5314153 5077389 4685834 4445703
10537D445703r1733k54420k50050j57674k35553j97646j27144j59578L2615N8342
$$ 4445703 4353970 4099550 3849500 3691826 3456273 3258627 3131483 2971905 3004520 3062862
10527C062862j40466k07986p0693j16403j40680J5240j6736j11165j02099p9105
$$ 3062862 2922396 2714410 2643717 2527314 2386634 2401874 2385138 2273973 2171874 2092769
10517B092769r5085j1206j40273j51557O1680J6240l5920q3494q3296j1638j45362
$$ 2092769 1997684 1986478 1846205 1694648 1756328 1772568 1736648 1653154 1569858 1558220 1412858
10506A412858j82237P7676J0976r9992O098j2248m3037L0667o532q1943L3711
$$ 1412858 1230621 1308297 1319273 1219281 1225379 1213131 1170094 1200761 1194229 1112286 1145997
10495A145997l8635n469L0754o3967o6400m8770k2296p5039j29917q5699J14482
$$ 1145997 1107362 1101893 1132647 1068680 1002280 953510 931214 856175 726258 640559 755041
10484G55041K1920r0515k1066P473O9968m3921p6443N8134N2492l586r7321p0405
$$ 755041 776961 686446 665380 672853 742821 698900 622457 680591 733083 729497 632176 561771
10472E61771O6193R1599M9444p6576q2987j24541j83144m4733J7026R1053Q6240
$$ 561771 627964 719563 769007 692431 609444 484903 301759 257026 274052 365105 451345
10461D51345Q5241Q4518j22144m4633P2321L7250J8923j38266j33653P9957p322
$$ 451345 536586 621104 498960 454327 526648 563898 582821 444555 310902 390859 383537
10450C83537j3495M464M5829R3535N5948j51766j36325n3850N3100P9955R2989
$$ 383537 370042 374506 420335 513870 569818 418052 281727 227877 280977 360932 453921
10439D53921p770K4660L9838p1198k9493l3363n0500M9761O1141K3849q6907r2101
$$ 453921 446151 470811 510649 439451 409958 376595 326095 375856 436997 460846 373939 281838
10427B81838m2299M5227P1689R1369m2397l899r4892r2736R5100R7719L1272k4434
$$ 281838 239539 284766 356455 447824 405427 401528 306636 213900 309000 406719 437991 413557
10415D13557j8999k7786O332p5687j09821r9829P3291N2615M7792O0071j06859
$$ 413557 394558 366772 373104 297417 187596 87767 161058 213673 261465 321536 214677
10404B14677J227j0647M1447k6297N7277l5737r7306j33517m3017J08382K4838
$$ 214677 215904 205257 246704 220407 277684 241947 144641 11124 -31893 76489 101327
10393A01327n7211L1820K0615R302j0108o0802R8363L3962j8113m5283q1208m830
$$ 101327 44116 75936 96551 105853 95745 34943 133306 167268 149155 103872 22664 17834
10381A7834m8624N291Q7343J26172L4929m4778p7302K5568o4339m8632L9916r263
$$ 17834 -30790 -25499 61844 188016 222945 178167 100865 126433 62094 13462 53378 44115
10369D4115P0129Q1879R1746O332r0423j5429m9089r7847k7456P5236j4055j62101
$$ 44115 114244 196123 287869 294201 203778 188349 139260 41413 13957 89193 75138 -86963
10357h6963q749K53860J25308o0388L7883J49325O9512j66709o7760L6391l0520
$$ -86963 -95712 158148 283456 223068 260951 410276 479788 313079 245319 281710 251190
10346B51190K5825k5151K4010J3665j9291m3343M4215j79706j54793O5444r677
$$ 251190 277015 251864 275874 289539 270248 226905 271120 91414 -63379 2065 -7612
10335g612k4861J04165P2207R3793q0693r3604M9859N1551p2514J3374Q2976P1705
$$ -7612 -32473 71692 143899 237692 156999 63395 113254 164805 92291 105665 188641 260346
10323B60346j15020p7834k0047J265l9575J56284L5511r8899j13446M5459J24555
$$ 260346 145326 67492 47445 48710 9135 165419 200930 102031 -11415 34044 158599
10312A58599p4304r3437J941l0375m2512L459J40655J19660Q2637m9958j21584
$$ 158599 84295 -9142 -7201 -37576 -80088 -76629 64026 183686 266323 216365 94781
10301I4781q153K7399o2781l607O3297N4582K3320j43357j1771N2959J8866p2757
$$ 94781 86628 114027 51246 47639 110936 165518 188838 45481 33710 86669 105535 32778
10289C2778K9130O3901P0777P7952j024j398p3901l773q971j5366N215J12331
$$ 32778 61908 125809 196586 274538 273514 272116 198215 194442 185471 170105 175320 287651
10277B87651o6908j05131n8897L9110M0361k10602N0340J57200l519o3774m6954
$$ 287651 220743 115612 56715 95825 136186 -74416 -24076 133124 129605 65831 18877
10266A8877K9737N0522K2142j3267P8348N1519J4615p1543m9547o5932j08852
$$ 18877 48614 99136 121278 108011 186359 237878 252493 180950 131403 65471 -43381
10255d3381l1454j8946M1727M3356J6721q4581J5021J9549p2178q0671J11038
$$ -43381 -74835 -93781 -52054 -8698 8023 -76558 -61537 -41988 -114166 -194837 -83799
10244h3799R6617K8427K2394k8352n0900Q4655k4499n6082j1525k9709m940J34270
$$ -83799 12818 41245 63639 35287 -15613 69042 44543 -11539 -23064 -52773 -57713 76557
10232G6557M3930p7671L5615p8342j05553M1099Q000l9557n606R4723R1885L7020
$$ 76557 120487 42816 78431 89 -105464 -64365 -56365 -95922 -101528 -6805 85080 122100
10220A22100k3548K5255q1885o9860J24787j00030j08536K9294J7955J18474J4983
$$ 122100 98552 123807 41922 -27938 96849 -3181 -111717 -82423 -64468 54006 68989
10209F8989p2343R1563K3655N573M2861Q6066j35591r6898R48Q087P522M4342
$$ 68989 -3354 88209 111864 117437 160298 246364 110773 13875 14823 22910 30432 74774
10197G4774P2887M3967K5162O913j07036j8574o1379j0608J061L3345J50080J27749
$$ 74774 147661 191628 216790 223703 116667 98093 36714 26106 27167 60512 210592 338341
10185C38341j26204o236K5847l5598P8592J78246R3688J01860l4491n8353J06630
$$ 338341 212137 205901 231748 196150 274742 452988 546676 648536 614045 555692 662322
10174F62322o361j22398q1860R5204N6584L3294J08032M9480K817m7429J04890
$$ 662322 655961 533563 451703 546907 603491 636785 744817 794297 797114 749685 854575
10163H54575j7327k093M1683l370j19157l2728M8777K15938K12106J04053L719
$$ 854575 837248 835155 876838 873468 754311 721583 770360 986298 1198404 1302457 1306176
10152A306176j53482k14910j71136j07110K2409K38914L508o5274k343j0199l3872
$$ 1306176 1152694 937784 766648 659538 681947 920861 924369 859095 856752 846553 812681
10141H12681L3283o0903j57782n0349m5882n0804o5413M3470M4352j3185M01K7191
$$ 812681 845964 785061 627279 576930 531048 480244 414831 458301 502653 489468 489869 517060
10129E17060j18891J6509n4081q4730L6084j35187r932L2924O7404r6000j01934
$$ 517060 398169 414678 360597 275867 311951 176764 166832 199756 267160 171160 69226
10118F9226o3533q6639j22213P0655j0809J6732J06329k7292L0386P2794Q2969
$$ 69226 5693 -80946 -203159 -132504 -143313 -126581 -20252 -47544 -17158 55636 138605
10107A38605K7917p3548N7487k8009k3864j24977m855L5151J7298N251K1942j04474
$$ 138605 166522 92974 150461 122452 98588 -26389 -31244 3907 21205 26456 48398 -56076
10095e6076k1180j4154K2991J59979K8499p7336k6535o631k0214Q7661P0348k00097
$$ -56076 -77256 -91410 -68419 91560 120059 42723 16188 9557 -10657 77004 147352 -52745
10083e2745k5111P2586k4358K3246O4099R1728R4773r5576J4034L3576j39638
$$ -52745 -77856 -5270 -29628 -6382 57717 149445 244218 148642 162676 196252 56614
10072E6614p242N3614l4819j9384M2733j3326P9715K7048j2599q3164j23626P96
$$ 56614 49372 102986 68167 48783 91516 78190 157905 184953 172354 89190 -34436 -33640
10060c3640J00828O3554N8269J2921q7728j08413j27892M8432J15524l389O3028
$$ -33640 67188 130742 189011 201932 114204 5791 -122101 -73669 41855 38466 101494
10049A01494j76881r4890J59678p3562k7254N4161N5015r4938M4757K5785m6547
$$ 101494 -75387 -170277 -10599 -84161 -111415 -57254 -2239 -97177 -52420 -26635 -73182
10038g3182r1904J1446l625K7549N9840k7321j3966J5701J11414J16501k093o233
$$ -73182 -165086 -153640 -157265 -129716 -69876 -97197 -111163 -95462 15952 132453 130360 124127
10026A24127O6864q1130n2471J8093l1777r6022n757j1748j4358L9486o0140l6496
$$ 124127 190991 109861 57390 75483 43706 -52316 -58073 -69821 -84179 -44693 -104833 -141329
10014a41329M928Q8087O9580n0395L1825J6503j2575j2761K3184n104P1074o7369
$$ -141329 -136401 -48314 21266 -29129 2696 19199 6624 -6137 17047 11943 83017 15648
10002A5648k1972p4169j13167k3379R4847J09164j8386m9940R2570N2480J17932
$$ 15648 -6324 -80493 -193660 -217039 -122192 -13028 -31414 -81354 11216 63696 181628
9991A81628j0124j4948j32107R976M2212J02432p2429k6031J3678j1362O7324
$$ 181628 171504 156556 24449 34425 76637 179069 106640 80609 94287 82925 150249
9980A50249M060j04221J4702N8814j2170J3809r1012j34711J34437k7390j20279
$$ 150249 154309 50088 64790 123604 111434 125243 34231 -100480 33957 6567 -113712
9969a13712J05805j6722J5775m5153m8022J04980O8652q453j10167o9839L0497
$$ -113712 -7907 -24629 -8854 -54007 -102029 2951 71603 63150 -47017 -116856 -86359
9958h6359m1319N052J50557O874k46N0553k3044o2886o659N584j54238l6004J66184
$$ -86359 -127678 -122626 27931 34805 34559 85112 62068 -818 -7477 -1893 -156131 -192135 -25951
9945b5951O5094J9734n243n7490n0439q2700k5484J13550R6207J4466q884O3494
$$ -25951 39143 58877 53634 -3856 -54295 -136995 -162479 -48929 47278 61744 52860 116354
9933A16354o2465o547o0135L5712p0491n2946N0033n6063n8086J49429J93046
$$ 116354 53889 47342 -12793 22919 -47572 -100518 -50485 -106548 -164634 -15205 177841
9922A77841m6736j04757r0165J9778j535n5952n3318O8881M9294L1663l4951p2347
$$ 177841 131105 26348 -63817 -44039 -45574 -101526 -154844 -85963 -36669 -5006 -39957 -112304
9910a12304L0182M6161j8924k6329j16820j48591m4841J13741J69810J12597J6068
$$ -112304 -82122 -35961 -54885 -81214 -198034 -346625 -391466 -277725 -107915 4682 20750
9899B0750L2834j7877O0307P8192K6979j50751j8737J63168O0613J4200j95064
$$ 20750 53584 35707 96014 174206 201185 50434 31697 194865 255478 269678 74614
9888G4614m9557n7888Q5366N6570l2281k9855j6045n4340K818L1707O0762l2378
$$ 74614 25057 -32831 52535 109105 76824 46969 30924 -23416 -20598 11109 71871 39493
9876C9493j9629J9457J0670L4377Q2149K4712L4185n2314l8663j19882q2732J6930
$$ 39493 19864 39321 49991 84368 166517 191229 225414 173100 134437 14555 -68177 -51247
9864e1247r7455r3647m7790n6175K14884J35696K396j67881k4608N7488m6756
$$ -51247 -148702 -242349 -290139 -346314 -131430 4266 6662 -161219 -185827 -128339 -175095
9853a75095L332R8879M5671R0517j5839m5516o0407p6259q543N9532P9731J06005
$$ -175095 -171763 -72884 -27213 63304 47465 1949 -58458 -134717 -143260 -83728 -3997 102008
9841A02008l4293n3360Q377l1082p7804R9522M0184r2487R14p688k0286n3211
$$ 102008 67715 14355 22732 -8350 -86154 13368 53552 -38935 -38021 -45709 -65995 -119206
9829a19206q1998r0016m5768J06496M8705o1611p238m6305O9158M3056P6438K8001
$$ -119206 -201204 -291220 -336988 -230492 -181787 -243398 -250636 -296941 -227783 -184727 -108289 -80288
9817h0288J4480J8337M2221Q0865L4788l5198q1612l9851O3987j139M391J20674
$$ -80288 -65808 -47471 -5250 75615 110403 75205 -6407 -46258 17729 16590 20981 141655
9805A41655q7637q2837N7668P4072r6684M0079p1732j46245o4878M7978O3937
$$ 141655 54018 -28819 28849 102921 6237 46316 -25416 -171661 -236539 -188561 -124624
9794a24624M830p2873J584m7819M2538m1466l0106k9834O8598L7648l1900J81834
$$ -124624 -119794 -192667 -191083 -238902 -196364 -237830 -267936 -297770 -229172 -191524 -223424 -41590
9782d1590J08931M8801P3744j57504k26135K6916R7245R3995K816o0925j13239
$$ -41590 67341 116142 189886 32382 -193753 -166837 -69592 24403 27219 -33706 -146945
9771a46945n4689K2083K2337P4871L5406k5435k3762J3324j1706m271n467k5387
$$ -146945 -201634 -179551 -157214 -82343 -46937 -72372 -96134 -82810 -94516 -98787 -104254 -129641
9759a29641K973J11883R0023j27381k5261J7101q7032Q6179N2906J4602r686j03033
$$ -129641 -126668 -14785 75238 -52143 -77404 -60303 -147335 -61156 -8250 6352 -3334 -106367
9747a06367M3963j5103P4319O4550K5355q9055j6716n7423n9525K2703R4480M2955
$$ -106367 -62404 -77507 -3188 61362 86717 -2338 -19054 -76477 -136002 -113299 -18819 24136
9735B4136O035p0321q3676m225k9982R5072Q3149j35051p8273R5391N6010J6089
$$ 24136 30171 -40150 -123826 -128051 -158033 -62961 20188 -114863 -193136 -97745 -41735 -25646
9723b5646L4164m5080P29O8095L2886o5868j15565l1992L754j847j1274Q2071
$$ -25646 8518 -36562 -35833 32262 65148 -720 -116285 -148277 -144523 -146370 -157644 -75573
9711g5573P8994P6609N4588k7092K1157N5254O661j8235p6900j53495q549R0746
$$ -75573 3421 80030 134618 107526 128683 183937 190598 172363 95463 -58032 -66581 24165
9699B4165L4743J1337j0615L0079O7559J44818k5511j97962J9068p6181p0001
$$ 24165 58908 70245 59630 89709 157268 302086 276575 78613 97681 21500 -48501
9688d8501M365q9271J7983J66846Q9881j6270j07088m7726K0952L1513R662q0641
$$ -48501 -44136 -133407 -115424 51422 141303 125033 17945 -29781 -8829 22684 32346 -48295
9676d8295o2951J07977q659r6972J05525n6286m2409L7708j0977J1188L4705N2304
$$ -48295 -111246 -3269 -11928 -108900 -3375 -59661 -102070 -64362 -75339 -64151 -29446 22858
9664B2858m8679L845q2570J1793k0976K0659M1008N3450J13131m1940J82241O0518
$$ 22858 -25821 -21976 -104546 -92753 -113729 -93070 -52062 1388 114519 72579 254820 315338
9652C15338N2374j421o6730k5632k9072n1990k3265M4575q1547N56l3804j62835
$$ 315338 367712 366291 299561 273929 244857 192867 169602 214177 132630 133186 99382 -63453
9640f3453K628J04505k5583K8742J8242o8826j18916r541M5476J17372O0768j28368
$$ -63453 -60825 43680 18097 46839 65081 -3745 -122661 -132202 -86726 30646 91414 -36954
9628c6954m9630n4137R4378O0696K2876r899K5525m8618K8240n41j35115M5868
$$ -36954 -86584 -140721 -46343 14353 37229 27330 52855 4237 32477 31936 -103179 -57311
9616e7311K9830P5216P4546m1308j24164n620q0130k2715R5472l1018q3110M5042
$$ -57311 -27481 47735 122281 80973 -43191 -48811 -128941 -151656 -56184 -87202 -170312 -125270
9604a25270j8931o6725J05734n2514k5225m1816J39620M5906l5139j59358l1161
$$ -125270 -144201 -210926 -105192 -157706 -182931 -224747 -85127 -39221 -74360 -233718 -264879
9593b64879J20594O6609k4460K5589J9545L1126O6045K5267j08226l3546J1657
$$ -264879 -144285 -77676 -102136 -76547 -57002 -25876 40169 65436 -42790 -76336 -64679
9582f4679R4047L045p3064k0012L6217m962O0698Q9425k209K3437j1581n6096
$$ -64679 29368 32413 -40651 -60663 -24446 -29408 31290 120715 118506 141943 130362 74266
9570G4266o6851K2054O874l8103M114J30833K2393j52044j55974Q042J22681O6898
$$ 74266 7415 29469 36343 -1760 2354 133187 155580 3536 -152438 -144396 -21715 45183
9558D5183J00795k5377o378m4912n3383p9214O440r800K0982o8184o0345k7960
$$ 45183 145978 120601 114223 69311 15928 -63286 -56846 -66646 -45664 -113848 -174193 -202153
9546b02153K2467j6099M3787J36n4635R348K0359K8958K3153J22453J3837M5031
$$ -202153 -179686 -195785 -151998 -151862 -206497 -197149 -176790 -147832 -124679 -2226 11611 56642
9534E6642R942j06782L1467l4425l2826J1933l5145j0984P1764J24200r856N0001
$$ 56642 66584 -40198 -8731 -43156 -75982 -64049 -99194 -110178 -38414 85786 75930 125931
9522A25931q8905j44863M4367J21215L9220j6033k4294m6802j2228M2495K21244
$$ 125931 37026 -107837 -63470 57745 96965 80932 56638 9836 -2392 40103 261347
9511B61347k1408k1180j7794N2721m2900j59942l0702j6289N237L2349J6917p6891
$$ 261347 239939 218759 200965 253686 210786 50844 20142 3853 9090 41439 58356 -18535
9499a8535o9678j13851O4542R2253N7835j6574o7976r7639k9292o1858J23238
$$ -18535 -88213 -202064 -137522 -45269 12566 -4008 -71984 -169623 -198915 -260773 -137535
9488a37535J44072j43055j44352M0172L9586J35313J39167O1929M190j17215j8945
$$ -137535 6537 -136518 -280870 -240698 -201112 -65799 73368 135297 139487 22272 3327
9477C327J4310J27829K4162J9206m7997r4173j00304j44734n683K7278M6262O9796
$$ 3327 17637 145466 169628 188834 140837 46664 -53640 -198374 -204057 -176779 -130517 -60721
9465f0721l2396m408q7015n1555J06965J27784k9016p5396J1289L8908K4061O736
$$ -60721 -93117 -97525 -184540 -236095 -129130 -1346 -30362 -105758 -94469 -55561 -31500 -24764
9453b4764n9993j22386M175j8815J1185K9034J34199J34901l5777j23051k3877
$$ -24764 -84757 -207143 -202968 -221783 -210598 -181564 -47365 87536 51759 -71292 -95169
9442i5169L2253J6639K1488o7090M286M1001r19j24732p2471P5335J06670J39865
$$ -95169 -62916 -46277 -24789 -91879 -87593 -46592 -47511 -172243 -244714 -169379 -62709 77156
9430G7156R9O3625k4806o3136L9706J42399P2682j88393j86052L1955L2683j0166
$$ 77156 77255 140880 116074 52938 92644 235043 307725 119332 -66720 -34765 -2082 -12248
9418a2248r9658n0033q6597L4969J67757N1058m7579K1020O6329l9755j30048
$$ -12248 -111906 -161939 -248536 -213567 -45810 5248 -42331 -21311 45018 5263 -124785
9407a24785p4356M6806P4242J6027K8365j19858j73790j3003P5902J05297J15486
$$ -124785 -199141 -152335 -78093 -62066 -33701 -153559 -327349 -340352 -264450 -159153 -43667
9396d3667M4446M5325m7966j6684l8185R8729O007k0774Q8205M8739K1928k17277
$$ -43667 779 46104 -1862 -18546 -56731 41998 48005 27231 115436 164175 186103 -31174
9384c1174k6460R4102J16144m1176n7828L1011O3506j0882m2404o3489j82102
$$ -31174 -57634 36468 152612 111436 53608 84619 148125 137243 94839 31350 -150752
9373a50752j10919J62847J55897N1516K4908M2965l7310k9398m2621j07985n7866
$$ -150752 -261671 -98824 57073 108589 133497 176462 139152 109754 67133 -40852 -98718
9362i8718J1908O8245j3574j19316J17109k148M530Q9810O2992l79m4381j0363
$$ -98718 -86810 -18565 -32139 -151455 -34346 -36494 -31964 57846 120838 120459 76078 65715
9350F5715p2537j53477n5284Q3216K2321O0427M264k740M5767j08518M3769J17325
$$ 65715 -6822 -160299 -215583 -132367 -110046 -49619 -45355 -48095 -2328 -110846 -67077 50248
9338E0248J5175l3646k8707m7422l5549o6175M4609j2104N3923j325m3577J3008
$$ 50248 65423 31777 3070 -44352 -79901 -146076 -101467 -113571 -59648 -60973 -104550 -91542
9326i1542m9369M0118M946p3602o8074J55463Q706k7544n8194n9112R264l3722
$$ -91542 -140911 -100793 -95847 -169449 -237523 -82060 -73354 -100898 -159092 -218204 -208940 -242662
9314b42662Q6445J71772L5605j12482P5199N7027p8589n3142Q3885L7116N7535
$$ -242662 -156217 15555 51160 -61322 13877 70904 -7685 -60827 23058 60174 117709
9303A17709j34142j37545N2396O9177l8502r7577l7866J39375L6665p6848p1942
$$ 117709 -16433 -153978 -101582 -32405 -70907 -168484 -206350 -66975 -30310 -107158 -179100
9292a79100L1618J1080K1226J5739k9132J12195n7364p3158o1876Q4363J15384
$$ -179100 -147482 -136402 -115176 -99437 -128569 -16374 -73738 -146896 -208772 -124409 -9025
9281i025J3719k8674L267l4451J28825M9350O9829o5938j45751O7197o292Q641
$$ -9025 4694 -23980 -20713 -55164 73661 123011 192840 126902 -18849 48348 42056 50697
9269E0697m4950Q896O2782n3230j14151j1262o5136Q6867J77221l2851j20184
$$ 50697 5747 14643 77425 24195 -89956 -101218 -166354 -79487 97734 64883 -55301
9258e5301j13380p3940j5410J1330L6337K5924J23485P1049j79818J39366P5849
$$ -55301 -168681 -242621 -258031 -246701 -210364 -184440 -60955 10094 -169724 -30358 45491
9247D5491r012k9587k3266l2782n9074o2019J22287j2451L1543K6473j19352o1328
$$ 45491 36479 6892 -16374 -49156 -108230 -170249 -47962 -60413 -28870 -2397 -121749 -183077
9235a83077J02383K3253j44513m7329J18244Q8512k6257M5804P7747M5532K1135
$$ -183077 -80694 -57441 -201954 -249283 -131039 -42527 -68784 -22980 54767 100299 121434
9224A21434n4618P1036J5508j42768p8911n6939L6444J25562N40k7252O0736m9994
$$ 121434 66816 137852 153360 10592 -68319 -125258 -88814 36748 37288 10036 70772 20778
9212B0778j19200K8483P025K102j252r799o8829L2780r392m7341J07870M0140
$$ 20778 -98422 -69939 -62914 -60812 -62064 -71863 -140692 -107912 -117304 -164645 -56775 -16635
9200a6635q638n0869j02381P3416R7540M2963N8461N8613j26908P31m164o3056
$$ -16635 -25273 -76142 -178523 -105107 -7567 35396 93857 152470 25562 26293 22129 -40927
9188d0927Q9282M9121K3108m8059K137k732N9736M8196N9960m7099p2618o1404
$$ -40927 48355 97476 120584 72525 74662 71930 131666 179862 239822 192723 120105 58701
9176E8701j0762q9229l0015O9741q426m9100k583l2329N2155m3193K1594K9508
$$ 58701 47939 -41290 -71305 -1564 -9990 -59090 -61673 -94002 -41847 -85040 -63446 -33938
9164c3938n9844P964M8120m7072M2622Q1952N1621m9203j16528n8486Q2216J25526
$$ -33938 -93782 -85818 -37698 -84770 -42148 39804 91425 42222 -74306 -132792 -50576 74950
9152G4950P9187O267L6368m8129q5943Q8600j3533n1971O5037n120l3224L123
$$ 74950 154137 160404 196772 148643 62700 151300 137767 85796 150833 145713 112489 115612
9140A15612j27716r5647n8176K6373M2986N595k6627N4081J25861j42178J844
$$ 115612 -12104 -107751 -165927 -139554 -96568 -90973 -117600 -63519 62342 -79836 -77992
9129g7992J26993k3493k17941q7178J5202P7601L503j5135J06614J28422M3135
$$ -77992 49001 25508 -192433 -279611 -264409 -186808 -183305 -198440 -91826 36596 79731
9118G9731n1877O979p8298j6405o2991J8961J88314J264P3958J30179L4368q0021
$$ 79731 27854 34833 -43465 -59870 -122861 -103900 84414 85678 159636 289815 324183 244162
9106B44162r4164r6738N0631Q3944J95751K10302P8582J44595J81264J21177p230
$$ 244162 149998 53260 103891 187835 383586 593888 672470 817065 998329 1119506 1112276
9095A112276j13944k55509k25443j04895r0397q8349q2498K6302j8501L826k2524
$$ 1112276 998332 742823 517380 412485 322088 233739 151241 177543 159042 162868 140344
9084A40344n2242p1317l9188J00412j6672r767J18005N6962p029j04339J05341
$$ 140344 88102 16785 -22403 78009 61337 51570 169575 226537 219508 115169 220510
9073B20510o0018m4782K2376j8132M3387L1336k27369J1078J17288M486j1828
$$ 220510 160492 115710 138086 119954 163341 194677 -32692 -21614 95674 100160 88332
9062H8332L4338R3889O0921P107K18662K94504L70266M64774O14219N01493j3347
$$ 88332 122670 216559 277480 284587 503249 797753 1168019 1632793 2247012 2748505 2735158
9051B735158q9831l76348n38454n41655l77607j72727j97758j21466q0279j8120
$$ 2735158 2645327 2268979 1730525 1188870 811263 638536 440778 319312 239033 220913
9041B20913l371m1738n5654m3851J7771r2755K6471J19020p9121n5042r4920N035
$$ 220913 217542 175804 120150 76299 94070 1315 27786 146806 67685 12643 -82277 -77242
9029g7242O6101l360l7727m1768j5953O4142j5498O4371Q6638J223P3069j1937
$$ -77242 -11141 -14501 -52228 -93996 -109949 -45807 -61305 3066 89704 90927 163996 152059
9017A52059N312j3039N3982O6388P1881J08145L10067J53009J56599J84149J2243
$$ 152059 157371 144332 198314 264702 336583 444728 754795 907804 1064403 1248552 1260795
9006A260795L1055k51547j57425l11921k11696o8028l0804J20538n112r8406r2041
$$ 1260795 1291850 1040303 882878 570957 359261 291233 260429 380967 375855 277449 185408
8995A85408k8419j0746O9866o047q6458j5354m1422k3469N8315N7963m216l747
$$ 185408 156989 146243 216109 210062 123604 108250 66828 43359 101674 159637 155421 151674
8983A51674K2835r480l7759l8427O6956q204q8518n0236K6571n9234K7422j7190
$$ 151674 174509 165029 127270 88843 155799 147595 59077 8841 35412 -23822 3600 -13590
8971a3590Q7512J8539O3467k458p8460p0401Q255M1021Q7813p7568r0297j9389
$$ -13590 73922 92461 155928 153470 75010 4609 12864 53885 141698 64130 -26167 -45556
8959d5556J4689j03680p317O7079M1002O2991J57572N4783j26382j7000o6799
$$ -45556 -30867 -134547 -141864 -74785 -33783 29208 186780 241563 115181 98181 31382
8948C1382p0146j01679Q6220J34720Q6972j12815k0424j23000l3561J34859n1208
$$ 31382 -38764 -140443 -54223 80497 167469 54654 34230 -88770 -122331 12528 -38680
8937c8680j2133M5915J99722J08524j52638j31238r6882l2384J2575J10056l805
$$ -38680 -50813 -4898 194824 303348 150710 19472 -77410 -109794 -97219 12837 9032
8926I032l117J39049k8009j64237o7627M2145J48708m609o7978l5480k3400r9647
$$ 9032 5915 144964 116955 -47282 -114909 -72764 75944 71335 3357 -32123 -55523 -155170
8914a55170O2712R3016N0275K3785M2434J18418J62212Q9083j9470m9320j16638
$$ -155170 -92458 558 50833 74618 117052 235470 397682 486765 467295 417975 301337
8903C01337p69J2573m1350j33370l1486K136n391j12686R820L9894Q1595Q2003
$$ 301337 300568 313141 271791 138421 106935 109071 103680 -9006 814 40708 122303 204306
8891B04306l7438p7191j43340p4228k7526R1763K0787n8128K4434J33144J8191
$$ 204306 166868 89677 -53663 -127891 -155417 -63654 -42867 -100995 -76561 56583 74774
8880G4774Q081k5996j24821j8606J36129k2660k5021M9429J14835O713R8755j7269
$$ 74774 82855 56859 -67962 -86568 49561 26901 1880 51309 166144 172857 271612 254343
8868B54343j24003p9670J22320R1210N833L2235j06586J2565j37769l0402l7048
$$ 254343 130340 50670 172990 264200 270033 302268 195682 208247 70478 40076 3028
8857C028r0158J31911N2504r5788j7704J8251J5276J882J15030L6559k6813j07954
$$ 3028 -87130 44781 97285 1497 -16207 2044 17320 19202 134232 170791 143978 36024
8845C6024q5892O226L4220P0016q1820m4268O7571M9101P9560M7342M4822l1366
$$ 36024 -49868 -43642 -9422 60594 -21226 -65494 2077 51178 130738 178080 222902 191536
8833A91536J04781L605j31040j9296n0909k0592N7195J19991k8551l2415L2572
$$ 191536 296317 299922 168882 149586 98677 78085 135280 255271 226720 194305 226877
8822B26877N013k8317m4175M2441M1487N5579R4275J0443q5791r4590J9403j40529
$$ 226877 231890 203573 159398 201839 243326 298905 393180 403623 317832 223242 242645 102116
8810A02116R5253Q7172M6133m9184n2787M1579k9813J5885j7544L8442P520O7591
$$ 102116 197369 284541 330674 281490 228703 270282 240469 256354 238810 277252 284772 352363
8798C52363P6870j14628Q5728Q3553r6391l3590M997j73007r9802N0872Q3324
$$ 352363 429233 314605 400333 483886 387495 353905 358902 185895 86093 136965 220289
8787B20289P9474r209j7574J44836J2626k3134J88285Q3188j2515k644n6707N733
$$ 220289 299763 290554 272980 417816 430442 407308 595593 678781 666266 663622 606915 612648
8775F12648J49614k5611m2631J27815J30283M807j87516p1203q2509M1296P1376
$$ 612648 762262 736651 694020 821835 952118 956925 769409 698206 615697 656993 728369
8764G28369l5954L4806J832o2574O8548J69379J30968o4707R334O9301r3908j71750
$$ 728369 692415 727221 729053 666479 735027 904406 1035374 970667 980001 1049302 955394 783644
8752G83644k8966N7262M0059l5145J31056R4567J33504J16796k4577l3847j62
$$ 783644 754678 811940 851999 816854 947910 1042477 1175981 1292777 1268200 1234353 1234191
8741A234191Q0066J37507L5621k3615O1355J98772K01972J28415J21220J20544
$$ 1234191 1314257 1451764 1487385 1463770 1525125 1723897 1925869 2054284 2175504 2296048
8731B296048M8554R9976J84548K32634K21421K573J94749L22848L14144K25986
$$ 2296048 2344602 2444578 2629126 2861760 3083181 3085754 3280503 3603351 3917495 4143481
8721D143481K45379L35827M69753O38485Q30344R27322J211853J403348J614233
$$ 4143481 4388860 4724687 5194440 5832925 6663269 7590591 8802444 10205792 11820025
8712A1820025J598636J945469K508433L181421M295583N961427Q623414J2725774
$$ 11820025 13418661 15364130 17872563 21053984 25349567 31310994 39934408 52660182
8704E2660182J8858179K8284387M0455941M9999206M4103825K0318526n177638
$$ 52660182 71518361 99802748 140258689 190257895 234361720 254680246 249502608
8697B49502608k4542072l9104187m2823214l4908208k4736614j7070942j1960782
$$ 249502608 224960536 185856349 143033135 108124927 83388313 66317371 54356589
8690E4356589q740108o447373m951815l671548k842886k194145j846890j521415
$$ 54356589 45616481 39169108 34217293 30545745 27702859 25508714 23661824 22140409
8682B2140409j154525r83065q68813o61801m73940l94963j28410P3987L60836
$$ 22140409 20985884 20002819 19134006 18472205 17998265 17603302 17474892 17548879 17909715
8673A7909715N84976R45804J328225J666953K049569K498891K774865L282464
$$ 17909715 18494691 19440495 20768720 22435673 24485242 26984133 29758998 33041462
8665C3041462M108490N572707P632153J0834454J5779898K3631595L6636378N8142729
$$ 33041462 37149952 42722659 50354812 61189266 76969164 100600759 137237137 195379866
8657A95379866R0025400J20049972J02873265L5661262k0200470n8408142r5947590
$$ 195379866 285405266 405455238 508328503 543989765 523789295 465381153 369433563
8650C69433563r9014361p2647812m8138358l2078612k2278902j6027742j1846407
$$ 369433563 270419202 197771390 149633032 117554420 95275518 79247776 67401369
8643F7401369r146882o832793n233543m130580l525132l053647k664424k407447
$$ 67401369 58254487 51421694 46188151 42057571 38532439 35478792 32814368 30406921
8635C0406921k235962j935093j642227j292915j010546p58206n06074l07305k00287
$$ 30406921 28170959 26235866 24593639 23300724 22290178 21531972 21025898 20718593 20518306
8626B0518306J63255M14203O68988Q05094J283542J563719K165397L041752M182354
$$ 20518306 20681561 21095764 21764752 22569846 23853388 25417107 27582504 30624256 34806610
8617C4806610N915495Q544164J2615402J8782027K7947069L9560678M7441668
$$ 34806610 40722105 49266269 61881671 80663698 108610767 148171445 195613113
8610A95613113L9384828J5033688r074362k6849766l9979844m1811197l3007115
$$ 195613113 234997941 250031629 240957267 214107501 174127657 132316460 99309345
8603I9309345k3039153j5886213j1179278q161219o073409m768046l603403k786255
$$ 99309345 76270192 60383979 49204701 41043482 34970073 30202027 26598624 23812369
8595B3812369k258401j910124j729077j616324j457388j280389j050300j002470
$$ 23812369 21553968 19643844 17914767 16298443 14841055 13560666 12510366 11507896
8587A1507896r74710q20707o04249n53446n20835n15560l69314l08534k76302
$$ 11507896 10533186 9712479 9108230 8554784 8033949 7518389 7149075 6840541 6564239
8578F564239k87172k36003k99540l14513k05572j86465j68362j18319j38236k40241
$$ 6564239 6277067 6041064 5741524 5427011 5221439 5034974 4866612 4748293 4610057 4369816
8568D369816k02219n0857o0520m7701r2129j44863k01366k62970k35008j36275
$$ 4369816 4167597 4116740 4056220 4008519 3916390 3771527 3570161 3307191 3072183 2935908
8558B935908l7558p0020l0763n205j11098r9352r104j45574j81166j37177L0571
$$ 2935908 2898350 2828330 2797567 2792362 2681264 2581912 2572808 2427234 2246068 2108891 2139462
8547B139462k1011j18498J4173k1819k8053j59994o2711j1944j26806j09998q5944
$$ 2139462 2118451 1999953 2014126 1992307 1964254 1804260 1741549 1729605 1602799 1492801 1406857
8536A406857l4639l5626Q2251O6750m325q7831k3641r7933n9002L9989j5931O1322
$$ 1406857 1372218 1336592 1418843 1485593 1481268 1393437 1369796 1271863 1212861 1252850 1236919 1298241
8524A298241j36755r1278J02478J07896j25240r7038M8182n1521o2456J0530J15099
$$ 1298241 1161486 1070208 1172686 1280582 1155342 1058304 1106486 1054965 992509 1003039 1118138
8513A118138o8886p9605o1697o2358k3436J2073l526k9262Q6740N0758m1335K2713
$$ 1118138 1049252 969647 907950 845592 822156 834229 830703 801441 888181 938939 897604 920317
8501I20317o2171k8107K8733L8070l6501R3940N6278j18952j01021j20323Q1955
$$ 920317 858146 830039 858772 896842 860341 954281 1010559 891607 790586 670263 752218
8490G52218N0286J75j0163j5842n7957k4916l9292r5782L8577n032j1458P570
$$ 752218 802504 802679 792516 776674 718717 693801 654509 558727 597304 592272 580814 588384
8478E88384j3488L9690o9021m412M3708r2763N8566K7913q3987j27945J31671
$$ 588384 574896 614586 545565 541153 584861 492098 550664 578577 494590 366645 498316
8467D98316J10399m6096p5613m5104L8740M2729j39726j49293L2888K6244L9000
$$ 498316 608715 562619 487006 441902 480642 523371 383645 234352 267240 293484 332484
8456C32484J00406O5734O5430q2163l6335m6476j6140l4711J40396J64093J39328
$$ 332484 432890 498624 564054 481891 445556 399080 382940 348229 488625 652718 792046
8445G92046p528p6218j54618k09536K7681O1793k526L3663o678J472M0154q5685
$$ 792046 784518 708300 553682 344146 371827 433620 431094 464757 458079 459551 499705 414020
8433D14020j37409k1196L6751m425M8312m0717p7512o4493j3081L6784J22216
$$ 414020 276611 255415 292166 287741 336053 295336 217824 153331 140250 177034 299250
8422B99250M5312J49345K5061k440o4463j07351K3075L0293j31821n5304m0454
$$ 299250 344562 493907 518968 516528 452065 344714 367789 398082 266261 210957 170503
8411A70503J5465M8431M0409M9289j028J2283J5379k408j21755m5062K7213N6967
$$ 170503 185968 234399 274808 324097 323069 335352 350731 348323 226568 181506 208719 265686
8399B65686J07162O1364j12757m1856l2361o7080K0887N299j8394r6904l5686
$$ 265686 372848 434212 321455 279599 247238 180158 201045 206344 187950 91046 55360
8388E5360N7811o9603n1186J4365j07053p9350L682k7524K4727J21286R1986Q8187
$$ 55360 113171 43568 -7618 6747 -100306 -179656 -175974 -203498 -178771 -57485 34501 122688
8376A22688J82574Q8671o0795j06349j89505O9520J12967l3897J5675R8972l9813
$$ 122688 305262 393933 333138 226789 37284 106804 219771 185874 201549 300521 260708
8365B60708k7378O2564k2472j16931N6211R6847K4969J4645j05071O7087R6976
$$ 260708 233330 295894 273422 156491 212702 309549 334518 349163 244092 311179 408155
8354D08155k6543q9021L2195J01619O9449O4149j40952l2090J498n6701k05914
$$ 408155 381612 292591 324786 426405 495854 560003 419051 386961 388459 331758 125844
8343A25844k07078R6976O9641j3048k2263O3360Q2983j19801j07404n8073l8394
$$ 125844 -81234 15742 85383 72335 50072 113432 196415 76614 -30790 -88863 -127257
8332a27257O084Q4598J2167N2764P6397N5001l8052M010K2544m0372m3157l7423
$$ -127257 -121173 -36575 -24408 28356 104753 159754 121702 125712 148256 107884 64727 27304
8320B7304J66549J84416k8294j32784j5236p8989J22577K626M9518K0757j8832
$$ 27304 193853 378269 349975 217191 201955 122966 245543 248169 297687 318444 299612
8309B99612j5478m6720L6480J54045O0164q2724l1112J62321J20843p2589K46008
$$ 299612 284134 237414 273894 427939 488103 405379 374267 536588 657431 584842 830850
8298H30850L74213J79732Q7354k2687k7618j3458k06596l04533j88368j17774
$$ 830850 1205063 1384795 1472149 1449462 1421844 1408386 1201790 897257 708889 591115
8288E91115q5612m5317K0508L1286q7755q5836J5274o9973o965r7440q267J399
$$ 591115 505503 460186 480694 511980 424225 338389 353663 283690 276725 179285 171018 172417
8276A72417n4930l5124Q0150N7199L8313o5825N9805N0983m4912J14079o484o422
$$ 172417 117487 82363 162513 219712 258025 192200 252005 302988 258076 372155 365671 359249
8264C59249k2631l5437j6508j30560J8872M0495J41583J49575J93711K53768L21322
$$ 359249 336618 301181 284673 154113 172985 213480 355063 504638 698349 952117 1273439
8253A273439M80169P16099M53134J15884m9501l10649m64938m76785m46289k92967
$$ 1273439 1753608 2469707 2922841 3038725 2989224 2678575 2213637 1736852 1290563 997596
8243I97596j38938k21005j59083q1437n4570m8117L0318m5862j08679L1542q7405
$$ 997596 858658 637653 478570 397133 342563 294446 324764 278902 170223 201765 114360
8232A14360L8032O6110M2969n8157j4192Q076J4754L7232O8007j3501q1532m6535
$$ 114360 152392 218502 261471 203314 189122 197198 211952 249184 317191 303690 222158 175623
8220A75623k2408n172J78767R9501J7476n6424n8617q4117r9351O2504J92125
$$ 175623 153215 148043 326810 426311 443787 387363 328746 244629 145278 207782 399907
8209C99907L18615K50740L52927K12177O8314j86720j99200j72583k08047j19670
$$ 399907 718522 969262 1322189 1534366 1602680 1415960 1216760 1044177 836130 716460
8199G16460j45686j86043o3703M1928k6768r0192j6149M4707m5932N9721L7261
$$ 716460 570774 384731 321028 362956 336188 245996 229847 274554 228622 288343 325604
8188C25604q5671m9391K74l8592K5902k404j03643p0279N4159K6807O1041N9677
$$ 325604 239933 190542 190816 152224 178126 175722 72079 1800 55959 82766 143807 203484
8176B03484L6064N6245K0837M070q9685p7257r6147P1836O4417l2979r9049j20748
$$ 203484 239548 295793 316630 320700 231015 153758 57611 129447 193864 160885 61836 -58912
8164e8912o6887Q3866J29441Q5198J1188j34041m8966P2290O5173N8050l1301
$$ -58912 -125799 -41933 87508 172706 183894 49853 887 73177 138350 196400 165099
8153A65099M2865J5177k2706j58777q6191J33076R3170q59M7823j13622r9092
$$ 165099 207964 223141 200435 41658 -44533 88543 181713 180854 228677 115055 15963
8142A5963J9203j4937m3811L0196O7419P1213k228m4009J3546K7819j02560q2647
$$ 15963 35166 20229 -23582 6614 74033 145246 143018 99009 112555 140374 37814 -44833
8130d4833p5706J5214K9324O7233J46251r0235j05918k5428m4182j1893l000R9800
$$ -44833 -120539 -105325 -76001 -8768 137483 47248 -58670 -84098 -128280 -140173 -143173 -43373
8118d3373Q6586n7102n0919k9738M0939K7452l4061M8510K4460j02619r920J25325
$$ -43373 43213 -13889 -64808 -94546 -53607 -26155 -60216 -11706 12754 -89865 -99785 25540
8106B5540P3021n3223k4951L7255K8070N1927J7160l6364l3639n3299l6536j5249
$$ 25540 98561 45338 20387 57642 85712 137639 154799 118435 84796 31497 -5039 -20288
8094b0288J3328n9591J62701Q7861P8057L5652l9627r3109k0339l6291o4707k0687
$$ -20288 -6960 -66551 96150 184011 262068 297720 258093 164984 144645 108354 43647 22960
8082B2960K3671q511q2869r2703Q3196Q8014j1401l5965P7233q7874m5991M0269
$$ 22960 46631 38120 -44749 -137452 -54256 33758 22357 -13608 63625 -24249 -70240 -29971
8070b9971M2842o294l4179k7657k4639k947R3885M6537p0815j6196k2190N4329
$$ -29971 12871 6577 -27602 -55259 -79898 -82845 11040 57577 -13238 -29434 -51624 2705
8058B705J14577R4065n0533r2050L6729J01654K9736l1071K1285q1001l6228r8382
$$ 2705 117282 211347 160814 68764 105493 207147 236883 205812 227097 146096 109868 11486
8046A1486k4076L2659j9163K7189R0906J08176M2286k4090N0485o9161j24234
$$ 11486 -12590 20069 906 28095 119001 227177 269463 245373 295858 226697 102463
8035A02463j52580j0315L6843J33066O8929J0003l3176q9849L549M7355m9581
$$ 102463 -50117 -60432 -23589 109477 178406 188409 155233 65384 68933 116288 66707
8024F6707j85580q8845q4488J77J46658Q0507J7859j4572J48005O5132K7853o6312
$$ 66707 -118873 -207718 -292206 -292029 -145371 -64864 -47005 -61577 86428 151560 179413 113101
8012A13101J2813n7213j5673q421Q5495M3240n9653r7680J3475Q5381L3792o4403
$$ 113101 125914 68701 53028 44607 130102 173342 113689 16009 29484 114865 148657 84254
8000H4254M287P3277n0443n3506k6621L8471o4494j6871R7969J42799Q4395m7267
$$ 84254 88541 161818 111375 57869 31248 69719 5225 -11646 86323 229122 313517 266250
7988B66250k27789p2643l4263j3541O7224P0177l758L170o6357M0777l6953l7931
$$ 266250 38461 -34182 -68445 -81986 -14762 55415 51657 54827 -11530 29247 -7706 -45637
7976d5637M2488O326j3300P3882k7520r9232n6087j6977O7565Q520O8004N6795
$$ -45637 -3149 3177 -10123 63759 36239 -62993 -119080 -136057 -68492 -59972 8032 64827
7964F4827J05958P3272k7232j50027j39382m1074o894J57929n1252K44R653p1755
$$ 64827 170785 244057 216825 66798 -72584 -113658 -120552 37377 -13875 -13631 -3978 -75733
7952g5733N5638P4826K3464k7003j40541P217M9427Q651J2636o398J62991J04934
$$ -75733 -20095 54731 78195 51192 -89349 -82132 -32705 -24054 -11418 -17816 145175 250109
7940B50109j3080n0637r0947J5232Q1694p1803j4194j12068q3774J4390J67279
$$ 250109 237029 186392 95445 110677 192371 120568 106374 -5694 -89468 -75078 92201
7929I2201Q5650p192n8346o5964k5304R208O573l6441j84161m5445J67842j0005
$$ 92201 177851 170659 112313 46349 21045 30253 36826 385 -183776 -229221 -61379 -71384
7917g1384NQ6242J08955N6353j34167k0090m0085K9754k6555J2724J759K7287
$$ -71384 -71379 14863 123818 180171 46004 25914 -14171 15583 -10972 1752 3511 30798
7905C0798O8176q8120j93315N4691J13860j110l7117o1741N4364J22463j02551
$$ 30798 98974 10854 -182461 -127770 -13910 -15020 -52137 -113878 -59514 62949 -39602
7894c9602o6344o966M8276n0164j751J9795J25319K8406n2995j12208n5011O6365
$$ -39602 -105946 -112912 -64636 -114800 -116551 -96756 28563 56969 3974 -108234 -163245 -96880
7882i6880r9K9565J27879Q3331k9248j12829p2667L0407p5955J968K0543J28682
$$ -96880 -96979 -67414 60465 143796 114548 1719 -70948 -40541 -116496 -114528 -93985 34697
7870C4697K0481p1501l4340J5371n9254K2092J24445n7491k8155n3714n759p1731
$$ 34697 55178 -16323 -50663 -35292 -94546 -72454 51991 -5500 -33655 -87369 -93128 -164859
7858a64859N5564J31020k0852m2575K1975J7875Q369J65342P0736r3244j19506
$$ -164859 -109295 21725 873 -41702 -19727 -1852 6517 171859 242595 149351 29845
7847B9845j05137R1388J72568k9261j70181m8186r470m9403O5420P3376j5850
$$ 29845 -75292 16096 188664 159403 -10778 -58964 -68434 -117837 -52417 20959 5109
7836E109O9622q3656m0943M6750k0299l5249O892O4951K096R3218l5741J34026
$$ 5109 74731 -8925 -49868 -3118 -23417 -58666 -51774 13177 15273 108491 72750 206776
7824B06776l2336r6765q7873N1686Q439k6358n6491j06726K6478K8405M9328N890
$$ 206776 174440 77675 -10198 41488 49927 23569 -32922 -139648 -113170 -84765 -35437 -29547
7812b9547o4421O3978P2001J39260r1387l6136J9059O7305m9554q9368k435L1264
$$ -29547 -93968 -29990 42011 181271 89884 53748 72807 140112 90558 1190 -1245 30019
7800C0019l0027J8507J7969p655k7231l1370j5713J03109O8492j05079n2667k9370
$$ 30019 -8 18499 36468 28813 1582 -29788 -45501 57608 126100 21021 -31646 -61016
7788f1016p4856K6154K1724O3566Q3600J04844J5816P4222l75j74255j54906j2739
$$ -61016 -135872 -109718 -87994 -24428 59172 164016 179832 254054 253679 79424 -75482 -88221
7776h8221J06790K1691j9227Q247J3264K4372m7333r5445o0106R28J29921P5793
$$ -88221 18569 40260 21033 29280 42544 66916 19583 -75862 -135968 -135040 -5119 70674
7764G0674m7659n9507J4316O2661M2994p6647j48004M094J85273L0863p2640K923
$$ 70674 23015 -36492 -22176 40485 83479 6832 -141172 -137078 48195 79058 6418 9341
7752I341k455Q8493k3180n1902j41741o514K2142P0020J70226L8117n2031Q665
$$ 9341 6886 95379 72199 20297 -121444 -127958 -105816 -35796 134430 172547 120516 129181
7740A29181j34572n8333J4162k0810q0960J21599P0468p6479m3855n404j4093
$$ 129181 -5391 -63724 -49562 -70372 -151332 -29733 40735 -35744 -79599 -85003 -99096
7729i9096J5708J15140j4662K7016J31701l9217N950J1747k1169n5933n3013L1134
$$ -99096 -83388 31752 17090 44106 175807 136590 142540 154287 133118 77185 24172 55306
7717E5306J5361Q4220N6106o2435N3839J26143p7178j72969p8877L1075J03588
$$ 55306 70667 154887 210993 148558 202397 328540 251362 78393 -484 30591 134179
7706A34179l0282o6325n0071O437P2762k7136K6367o6225M248J28443k8030J5038
$$ 134179 103897 37572 -12499 -6062 66700 39564 65931 -294 3954 132397 104367 119405
7694A19405K0239j50024j8856l0505J2267K200o0187M8884O7267K6213o706n745
$$ 119405 139644 -10380 -29236 -59741 -47474 -45274 -105461 -56577 10690 36903 30197 24452
7682B4452K1707o4792L1795R3656r6106J08135K8098P6301m9611j34309l6537
$$ 24452 46159 -18633 13162 106818 10712 118847 146945 223246 173635 39326 2789
7671B789L9688m8631j14017J02040K9943j5841M7358o8434n1018K6781J27291
$$ 2789 42477 -6154 -120171 -18131 11812 -4029 43329 -25105 -76123 -49342 77949
7660G7949M6207k169P5642p7557L0786L2754k5588j32758j03186Q7617J8619K8240
$$ 77949 124156 121987 197629 120072 150858 183612 158024 25266 -77920 9697 28316 56556
7648E6556o7051K6316j00238Q3439J26757P1840m8229j26218j07266J10054P4935
$$ 56556 -10495 15821 -84417 -978 125779 197619 149390 23172 -84094 25960 100895
7637A00895l7184q3703m5901j7565n1238J00132K6849J6317K1033k2220K2932
$$ 100895 63711 -19992 -65893 -83458 -134696 -34564 -7715 8602 29635 7415 30347
7626C0347k9224J5418l5750j71013l7611O9091R2318L4720j4858J0445p0723O6501
$$ 30347 1123 16541 -19209 -190222 -227833 -158742 -66424 -31704 -46562 -36117 -106840 -40339
7614d0339Q7059p2562n2207j6036j59961k7113O2720P9225J25765L008m3270N8562
$$ -40339 46720 -25842 -78049 -94085 -254046 -281159 -218439 -139214 -13449 -10441 -53711 4851
7602D851j3929Q5945N4271l7189o079j4807O7727j92j06509r9980k2960l8189
$$ 4851 -9078 76867 131138 93949 87870 73063 140790 140598 34089 -65891 -88851 -127040
7590a27040j54461j14582J09660J52878Q3995J894j35172M8681J50618L3836j10319
$$ -127040 -281501 -396083 -286423 -133545 -49550 -47656 -182828 -134147 16471 50307 -60012
7579f0012O238l5595j60790n295J63961J78507k583j9772r3989p3380O8299J2764
$$ -60012 -53774 -89369 -250159 -255454 -91493 87014 84431 64659 -29330 -102710 -34411 -21647
7567b1647J17756P03j17909p6828K24275J9197p9982p2748r7865Q7677J33174
$$ -21647 96109 96812 -21097 -97925 126350 145547 65565 -7183 -105048 -17371 115803
7556A15803l3795L4804p178j39485l9999j6629n0413M1603N57p3207N2092Q1071
$$ 115803 82008 116812 109634 -29851 -69850 -86479 -136892 -95289 -94732 -167939 -115847 -34776
7544c4776L5072l2500j37594J0342J06022L4598k086j8088N3034r1969P8575K4627
$$ -34776 296 -32204 -169798 -159456 -53434 -18836 -20922 -39010 14024 -77945 630 25257
7532B5257j82595r8931J21396J37915J1135j3084j51330L9280Q4415L4485N352
$$ 25257 -157338 -256269 -134873 3042 14177 1093 -150237 -110957 -26542 7943 13295
7521A3295q3588l7048J48733R1644j25407j24466N4137N8934J6750j12409N2717
$$ 13295 -70293 -107341 41392 133036 7629 -116837 -62700 -3766 12984 -99425 -46708
7510d6708J22036J2955n5128n4155n0239J425O6823k007K9428l6182j41415N3911
$$ -46708 75328 88283 33155 -21000 -71239 -69814 -2991 -4998 24430 -11752 -153167 -99256
7498i9256M237n5121q6689Q6469J0421j7364k7066n018m288m0111J18507O2145
$$ -99256 -95019 -150140 -236829 -150360 -139939 -157303 -184369 -189387 -193675 -233786 -115279 -53134
7486e3134J27953k5597n9062l0654n8454P3757m8699q3838L6736n0563j04858
$$ -53134 74819 49222 -9840 -40494 -98948 -25191 -73890 -157728 -120992 -171555 -276413
7475b76413N8581K04600R5265p3974k41K7170L4667K7938r185M446O0289Q53j02478
$$ -276413 -217832 -13232 82033 8059 7818 34988 69655 97593 88408 92854 153143 153996 51518
7462E1518j12003q0383K8479L4203j4372m6235r879J49400R8115M8732m0586L0676
$$ 51518 -60485 -140868 -112389 -78186 -92558 -138793 -148672 728 98843 147575 106989 137665
7450A37665p5482M4559R440p6542n5064J17315o1824n9284O0818k9012j19776
$$ 137665 62183 106742 116182 39640 -15424 101891 40067 -19217 41601 12589 -107187
7439a07187l6752J15505R2813N8698n6838n3531p1727k5841j03882j7666P4386
$$ -107187 -143939 -28434 64379 123077 66239 12708 -59019 -84860 -188742 -206408 -132022
7428a32022R0161l8027n3943N807P4712J21621J44625R7211q1158q9548j4681
$$ -132022 -41861 -79888 -133831 -128024 -53312 68309 212934 310145 228987 139439 124758
7417A24758j39309j03989N2193M6821L4727r9739l6308P6928K0957j09201m3341
$$ 124758 -14551 -118540 -66347 -19526 15201 -84538 -120846 -43918 -22961 -132162 -175503
7406a75503m2642o5363O5595J75455P093K328o5920n8837J16017O6393l6509r101
$$ -175503 -218145 -283508 -217913 -42458 -35365 -33037 -98957 -157794 -41777 24616 -11893 -20994
7394b0994Q1200J31490m7757J516n192j49393n7889K0269j0581q6700P0707j9130
$$ -20994 60206 191696 143939 145455 140263 -9130 -67019 -46750 -57331 -144031 -73324 -92454
7382i2454K4348k6662N5401l870o0462J9817L8978J01551R9981K0337J0304q4744
$$ -92454 -68106 -94768 -39367 -43237 -103699 -83882 -44904 56647 156628 176965 187269 102525
7370A02525m6224k3134K2660j05335m1198k6109K3952N0219R1565J6583l707J3302
$$ 102525 56301 33167 55827 -49508 -90706 -116815 -92863 -42644 48921 65504 61797 75099
7358G5099r7289Q2553n2173m3499P9509m3625j2201N0100O1313O7353j81332r3006
$$ 75099 -22190 60363 8190 -35309 44200 575 -11626 38474 99787 167140 -14192 -107198
7346a07198l6616J12140R3692L9169O4395p4469K6437m8496m5619m5444R0425
$$ -107198 -143814 -31674 62018 101187 165582 91113 117550 69054 23435 -22009 68416
7335F8416M4872K083L3326O2550o7783j2627q6576j3376n3147r4029J09151m2444
$$ 68416 113288 115371 148697 211247 143464 130837 44261 30885 -22262 -116291 -7140 -49584
7323d9584p0895l4173K6905J3376p993j2749O4496k2173o684N0789k4544l1961
$$ -49584 -120479 -154652 -127747 -114371 -122364 -135113 -70617 -92790 -99474 -48685 -73229 -105190
7311a05190J6677J5297j4939n556N3717K0386M9019j38213j57542M019P6639N7473
$$ -105190 -88513 -73216 -88155 -93711 -39994 -19608 29411 -108802 -266344 -262325 -185686 -128213
7299a28213o717j2646M0213J7433P5885P4707j40187J3692M4814L0076J0309J23485
$$ -128213 -134930 -147576 -107363 -89930 -14045 60662 -79525 -65833 -21019 9057 19366 142851
7287A42851P9869K582p8352r8947r138l6917q7876p739Q5952n2440q4512J3723
$$ 142851 222720 225302 146950 48003 38865 1948 -85928 -93667 -7715 -60155 -144667 -130944
7275a30944j9841J46378M8562J01821n7737q6539K9424K454j5890O8400j5309
$$ -130944 -150785 -4407 44155 145976 88239 1700 31124 33578 17688 86088 70779
7264G0779j6474j7086n5240K0774N5452K3125n3689o0458k9555j14813n550J24143
$$ 70779 54305 37219 -18021 2753 58205 81330 27641 -32817 -62372 -177185 -182735 -58592
7252e8592Q9138J0468O1159J802k8588q142l1191k3207n575J19996j17032m1100
$$ -58592 30546 41014 102173 103975 75387 67245 36054 12847 7272 127268 10236 -30864
7240c0864L0022r0130K3117j30108l9293J52556P5758k4993p2121n3574P0411
$$ -30864 -842 -90972 -67855 -197963 -237256 -84700 -8942 -33935 -106056 -159630 -89219
7229h9219P4580N4847r5890m2447J2240o6439K6451k7983J67598J00654N7965
$$ -89219 -14639 40208 -55682 -98129 -85889 -152328 -125877 -153860 13738 114392 172357
7218A72357j8495J4734m5581l6026N536k196r7071r9570J5898L3519n481j7337
$$ 172357 153862 168596 123015 86989 92525 90329 -6742 -106312 -90414 -56895 -62376 -79713
7206g9713P2578J53680m663j05930p1012O920K0737J1703R354l5686J0205Q7676
$$ -79713 -7135 146545 141882 35952 -35060 -28140 -7403 4300 13654 -22032 -11827 75849
7194G5849m216k3309k1948j2060P2743L4291p8237j0882q4931r6567J33664Q9324
$$ 75849 71633 48324 26376 14316 87059 121350 43113 32231 -52700 -149267 -15603 73721
7182G3721j6801M6626K7423n7856q2697J958K4749o9002m8329q483M0557P8414
$$ 73721 56920 103546 130969 73113 -9584 -7626 17123 -51879 -100208 -108691 -68134 10280
7170A0280O3673j8454j15003l7589J132J09582P4567m7910P328O1068l4608p5313
$$ 10280 73953 55499 -59504 -97093 -95961 13621 88188 40278 47606 108674 74066 -1247
7158a247l828J26428L1590j40469p2107j08177n3133J23351O9161L652l894J1467
$$ -1247 -5075 121353 152943 12474 -59633 -167810 -220943 -97592 -28431 -24779 -28673 -17206
7146a7206l4556P6485j45223q4828O8479O1611M5678k7215m0064R3859L8017j1009
$$ -17206 -51762 24723 -120500 -205328 -136849 -75238 -29560 -56775 -96839 -2980 35037 24028
7134B4028N1602j4367o647j3161o1978K2983m7686M0546R9871p8746M2508m684
$$ 24028 75630 61263 54616 41455 -20523 2460 -45226 -4680 95191 16445 58953 54269
7122E4269o6150j73420L754P2953P8102r6670M864N4537M0476J5311n4450l2843
$$ 54269 -11881 -185301 -181547 -108594 -30492 -127162 -122298 -67761 -27285 -11974 -66424 -99267
7110i9267r962K6210K6908l0479J12905J304r0646Q2466J09192J9517j829L611
$$ -99267 -109229 -83019 -56111 -86590 26315 27619 -63027 19439 128631 148148 146319 149930
7098A49930o9179R97J0852O4360j2657r9469R407M459k10821L0635j0825k4126
$$ 149930 80751 81748 92600 156960 144303 44834 54241 58700 -152121 -121486 -132311 -156437
7086a56437K267L2971q3867K5933K7197M4464L0738L70p5261m6304O4882N2770
$$ -156437 -154170 -121199 -205066 -179133 -151936 -107472 -76734 -76364 -151625 -197929 -133047 -80277
7074h0277J73153M8241L662j23320j97070k7647P2178o967J46174Q6687j60833
$$ -80277 92876 141117 144779 21459 -175611 -203258 -131080 -138047 8127 94814 -66019
7063f6019p0546J33409N7009m670l2503n0006m0608j9877R1903M7821k9817J8024
$$ -66019 -136565 -3156 53853 49183 16680 -33326 -73934 -93811 -1908 45913 16096 34120
7051C4120L8149j9981r9446M2469M9290m2007r3087O8044k2512l0256J00678J0522
$$ 34120 72269 52288 -47158 -4689 44601 2594 -90493 -22449 -44961 -75217 25461 35983
7039C5983R1204J4631O673n559n4509m1941n9552P81p3562J0262K4347M1550p2243
$$ 35983 127187 141818 148491 142932 88423 46482 -13070 -12289 -85851 -75589 -51242 -9692 -81935
7026h1935j12216O8569J81186M0454J5261P4663p4179j55371M3662L8109l4508
$$ -81935 -194151 -125582 55604 96058 111319 185982 111803 -43568 94 38203 3695
7015C695l1475P9490N0384J2663p3718L3433K7016J668m2703J9254q8258n0428
$$ 3695 -27780 51710 102094 114757 41039 74472 101488 103156 60453 79707 -8551 -58979
7003e8979J3521J9801J06480j08414p8234J38827J801k3272L038o8496P846J61615
$$ -58979 -45458 -25657 80823 -27591 -105825 33002 34803 11531 14569 -53927 -46081 115534
6991A15534J6840J8083n6053p0377P8644m2466m0925o30P0167n240p3499r6489
$$ 115534 132374 150457 94404 24027 102671 60205 19280 18650 88817 83577 10078 -86411
6979h6411N7211J1343N5668j0720p9766o2708N7937J11493M2699J63431N4207
$$ -86411 -29200 -17857 37811 27091 -52675 -115383 -57446 54047 96746 260177 314384
6968C14384j44381o8076M2669j8896p2821Q308j45936j27003K7432J36693O3791
$$ 314384 170003 101927 144596 125700 52879 61187 -84749 -211752 -184320 -47627 16164
6957A6164J3653o959Q9489m3323j57687o4552J0609J44954N3242l5316L4606M3943
$$ 16164 29817 22858 112347 69024 -88663 -153215 -142606 2348 55590 20274 54880 98823
6945I8823K1130p6112q4253m8682K6977O3200J37743P4344r3452j98474M5887
$$ 98823 119953 43841 -40412 -89094 -62117 1083 138826 213170 119718 -78756 -32869
6934c2869R38l2625q774O1087M0941n6949j33876J02122L0430m3097o4605n1167
$$ -32869 -31931 -64556 -73330 -12243 28698 -28251 -162127 -60005 -29575 -72672 -137277 -188444
6922a88444O1646J80097J22027k1779o0254o4105P1208o7017j16358l9140J9337
$$ -188444 -126798 53299 175326 153547 93293 29188 100396 33379 -82979 -122119 -102782
6911a02782N2493J26830K3739j20107r832q3692j8701N1442P4872L829K702r4696
$$ -102782 -50289 76541 100280 -19827 -29659 -113351 -132052 -80610 -5738 -1909 793 -93903
6899i3903r497J48103L5033q7691l3275K6492J0897l7282k4895K6850M038M8768
$$ -93903 -103400 44703 79736 -7955 -41230 -14738 -3841 -41123 -66018 -39168 -35130 13638
6887A3638o8262n1011O3150j1417r741o5846k3451P586J62984K3708k990p7513
$$ 13638 -54624 -105635 -42485 -53902 -63643 -129489 -152940 -145354 17630 41338 38348 -39165
6875c9165p269J12421P632n4632J6793k5917q3732k8552J09740K33839P8159j08269
$$ -39165 -46434 65987 73619 18987 35780 9863 -73869 -102421 7319 241158 319317 211048
6863B11048M9670q3972k21377O9614L5021o3579m0136j5942L2759n1187L3708
$$ 211048 260718 176746 -44631 24983 60004 -3575 -43711 -59653 -26894 -78081 -44373
6852d4373Q7503o2008j06548m214Q90q68K6587K8192n910M0868K6527L676k1733
$$ -44373 43130 -18878 -125426 -129640 -128750 -129618 -103031 -74839 -80749 -39881 -13354 -9678 -31411
6839c1411O8255l6821M3921q6191O9481L6056j166k5613l4992p9474o1195n438
$$ -31411 36844 23 43944 -42247 27234 63290 62124 36511 1519 -77955 -139150 -144588
6827a44588M3800J18976o5292O6819Q4773O022J4640k382j29913M759m4753r7229
$$ -144588 -100788 18188 -47104 19715 104488 110510 125150 122768 -7145 -2386 -47139 -144368
6815a44368r1160L0802R4857J4299M4149J5954J4704r909J096o5162p6213R9026
$$ -144368 -235528 -204726 -109869 -95570 -51421 -35467 -20763 -30672 -29576 -94738 -170951 -71925
6803g1925k6087o4517J09347K3917O1634k7198k0153Q0978n6460k19387m7789
$$ -71925 -98012 -162529 -53182 -29265 32369 5171 -14982 65996 9536 -209851 -257640
6792b57640m0007k4137J68803J62767J26525p7018N94J51995k7452q6388j33771
$$ -257640 -297647 -321784 -152981 9786 136311 59293 59887 211882 184430 98042 -35729
6781c5729k2399O5072l276L1958L2851m6102l0775Q4169K7981o9615j8209q3739
$$ -35729 -58128 6944 3668 35626 68477 22375 -8400 75769 103750 34135 15926 -67813
6769f7813K2252M1755l7196M0026K8088J9951O761n6433n8613n4872L9866O0539
$$ -67813 -45561 -3806 -41002 -976 27112 47063 53824 -2609 -61222 -116094 -76228 -15689
6757a5689N459O2138Q9326q6324l6856J0444n2809o6913o5541N7665L6139p6794
$$ -15689 -10230 51908 141234 54910 18054 28498 -24311 -91224 -156765 -99100 -62961 -139755
6745a39755L6078J09162n5422j68976p482J59936J11501q324l2115N5116M8105
$$ -139755 -103677 5485 -49937 -218913 -226395 -66459 45042 36718 4603 59719 107824
6734A07824q5356m5976O8785k8405Q4236M1018j3169j1327J38653Q797j51298
$$ 107824 22468 -23508 45277 16872 101108 142126 128957 117630 256283 265080 113782
6723A13782r8850j10161K420N6560k2773M0997r4210O4917N5123N0541j03416
$$ 113782 14932 -95229 -92809 -36249 -59022 -18025 -112235 -47318 7805 58346 -45070
6712d5070n1427J23691J01008j59087p2761J10590p344r7628r2110M4941J18460
$$ -45070 -96497 27194 128202 -30885 -103646 6944 -400 -98028 -190138 -145197 -26737
6701b6737M454J5758k3349N912l2909P7971Q8556l28O4451J138p5707j61052n0225
$$ -26737 -22283 -6525 -29874 -23962 -56871 21100 109656 109328 173779 174917 99210 -61842 -112067
6688a12067N7545N1969K8752Q0289j3551j01612k28058l225J32422O5335k7070
$$ -112067 -54522 -2553 26199 106488 92937 -8675 -236733 -239958 -107536 -42201 -69271
6677f9271K432k0185k1770N733P8960M8496k9541j05800n2868N8199o4237k055
$$ -69271 -66839 -87024 -108794 -103061 -24101 24395 -5146 -110946 -163814 -105615 -169852 -171907
6665a71907M9122J6783K4823J46673j39726j20455N7633Q6841J2205J01292r6409
$$ -171907 -122785 -106002 -81179 65494 -74232 -194687 -137054 -50213 -38008 63284 -33125
6654c3125n1271L1560N7440m3896r1229K2286o2600J6449O1506L0805K9827K8434
$$ -33125 -84396 -52836 4604 -39292 -130521 -108235 -170835 -154386 -92880 -62075 -32248 -3814
6642c814K5123o0726N4198J32397O3588j1997n7020j9489m4102j01460M1980K7749
$$ -3814 21309 -39417 14781 147178 210766 198769 141749 122260 78158 -23302 18678 46427
6630D6427k5025Q5062k1804r2951j50494j251L8701J04271Q6103m5690j57044
$$ 46427 21402 106464 84660 -8291 -158785 -160036 -121335 -17064 69039 23349 -133695
6619a33695q3998O1819L9613K3463r2195O7828Q9885Q1448M1275J02250r147m7459
$$ -133695 -217693 -155874 -116261 -92798 -184993 -117165 -27280 54168 95443 197693 188546 141087
6607A41087n7112p4467N04L840p817Q7992k3065o7264j59029n8320K670j1844
$$ 141087 83975 9508 10012 13852 6035 94027 70962 3698 -155331 -213651 -210981 -222825
6595b22825Q0104J985K320q0675L9965N6488P0804l4134j07865o703J15624n859
$$ -222825 -142721 -140736 -138416 -219091 -179126 -122638 -51834 -85968 -193833 -200536 -84912 -90771
6583i0771K2382J00981O3364J7190J03049J8912p2608j11891p0264L6448n375
$$ -90771 -68389 32592 95956 113146 216195 235107 162499 50608 -19656 16792 11417
6572A1417m4763N2961P3319o9407l2322O0535m0521n3988q107o3906L1712L8423
$$ 11417 -33346 19615 92934 23527 -8795 51740 11219 -42769 -50876 -114782 -83070 -44647
6560d4647n1604J2613L2830J13750l0805M1996q41K373o336k6911L4520O4839
$$ -44647 -96251 -83638 -50808 62942 32137 74133 73292 75665 69329 42418 76938 141777
6548A41777n4472p8571j40327K4986L2498L9872J32722J77053m4916j20869q8966
$$ 141777 87305 8734 -131593 -106607 -74109 -34237 98485 275538 230622 109753 20787
6537B0787J8575M4362l1941j22615J26228Q4685m7112k5170j6186L571N4331l4034
$$ 20787 39362 83724 51783 -70832 55396 140081 92969 67799 51613 55184 109515 75481
6525G5481P402J7618n1910K8277q1086m9873M2825j968p3160m3481k0350j2986
$$ 75481 82883 100501 48591 76868 -4218 -54091 -11266 -13234 -86394 -129875 -150225 -163211
6513a63211N3870m0646M868m2526O8626L6910j18522q3013k9447L6995m7636M1574
$$ -163211 -109341 -149987 -145119 -187645 -119019 -82109 -200631 -283644 -313091 -276096 -323732 -282158
6501b82158J5107P5772k3717n0265M6970J71659P6930l9359j07971K8580O1182
$$ -282158 -267051 -191279 -214996 -265261 -218291 -46632 30298 -9061 -117032 -88452 -27270
6490b7270K7795K1903M50l3803p8212l4745j01769O5374L6979K06535K2589l5652
$$ -27270 525 22428 22878 -10925 -89137 -123882 -225651 -160277 -123298 83237 105826 70174
6478G0174K5679O7207K2946P2420o2056j43659j12019j0987j9078p5124p3220
$$ 70174 95853 163060 186006 258426 196370 52711 -59308 -70295 -89373 -164497 -237717
6467b37717l6080J51694J2350N4725m8705q6476K7790o552L6291J8066J8421J6725
$$ -237717 -273797 -122103 -109753 -55028 -103733 -190209 -162419 -168971 -132680 -114614 -96193 -79468
6455g9468R7941k6783k16044p6622R2348J82409P251j16661L4677J55363O9854
$$ -79468 18473 -8310 -224354 -300976 -208628 -26219 -18968 -135629 -100952 54411 124265
6444A24265q0068j82933j86167l0608o5450o3545J98371K45621J8172p422J4295
$$ 124265 44197 -138736 -324903 -355511 -420961 -484506 -286135 -40514 -22342 -29764 -15469
6433a5469P3878n5475l9910k1474L6739j0216J2492R5910O0005j13371m4321q927
$$ -15469 58409 2934 -36976 -58450 -21711 -31927 -19435 76475 136480 23109 -21212 -30139
6421c0139n086K1718K0322p5686o2158M3662Q4884J29L5734K8672n1973j56408
$$ -30139 -35225 -13507 6815 -68871 -131029 -87367 -2483 -2354 33380 62052 10079 -146329
6409a46329n2362J87202q6494j39305R243n7141J63698j6832Q732r8317R4098
$$ -146329 -198691 -11489 -97983 -237288 -228045 -285186 -121488 -138320 -129588 -227905 -133807
6398a33807j653j6666J32124L5184k3271J01114j7450m1963l6025l9182O5314
$$ -133807 -135460 -152126 -20002 15182 -8089 93025 75575 33612 -2413 -41595 23719
6387B3719R820j8275J0258K1900o7094j14775j2509o9948q373N7144J56594O2692
$$ 23719 33539 15264 25522 47422 -19672 -134447 -146956 -216904 -225277 -168133 -11539 51153
6375E1153q0594J00435j2147q7012R6862k6257j42842q2763j28j2892q1534N2761
$$ 51153 -29441 70994 58847 -28165 68697 42440 -100402 -183165 -183293 -196185 -277719 -224958
6363b24958K25302J16748L6981l332k8329M2460R8738J4392j31127j75494j48012
$$ -224958 344 117092 154073 150741 122412 164872 263610 278002 146875 -28619 -176631
6352a76631O1471L3841J3369L9074P644L7514M7628O9584J942j27107q6200j5908
$$ -176631 -115160 -81319 -67950 -28876 -21232 16282 63910 133494 135436 8329 -77871 -93779
6340i3779L95l8898m0173O3305Q401j5993K462o3949N6925J18721L5616l8363
$$ -93779 -93384 -132282 -172455 -109150 -100749 -116742 -114280 -178229 -121304 -2583 33033 -5330
6328e330m6426J4837J20152M9731l3067q9961M0933j00680q5863K7016L6219J0368
$$ -5330 -51756 -36919 83233 132964 99897 9936 50869 -49811 -135674 -108658 -72439 -62071
6316f2071o860M5764Q9461m8578j34881o0729n0836n94J09491N0664l2201L8657
$$ -62071 -68931 -23167 66294 17716 -117165 -177894 -228730 -229324 -119833 -69169 -101370 -62713
6304f2713Q9442m7167L1427P4797p2909p5928j1523M5445J10903o6857j08531
$$ -62713 26729 -20438 10989 85786 12877 -63051 -74574 -29129 81774 14917 -93614
6293i3614n9344J21015P2388O732k0472l7662R3360P1439j02881j53153q6639
$$ -93614 -152958 -31943 40445 47177 26705 -10957 82403 153842 50961 -102192 -188831
6282a88831J24361L7195k7587P3392L1773m4492O545N5845J14553r6027m5140
$$ -188831 -64470 -27275 -54862 18530 50303 5811 12356 68201 182754 86727 41587
6271D1587M846N5759O2861l2091p7519o5502M3801K1890m4724n8147q848P1820
$$ 41587 46433 102192 165053 132962 55443 -10059 33742 55632 10908 -47239 -56087 15733
6259A5733q286l5319O5512l7011o7860P4274J17135M1969m9995j97636l0730P1234
$$ 15733 7447 -27872 37640 629 -67231 7043 124178 166147 116152 -81484 -112214 -40980
6247d0980n6055L5389N493M960q5976Q47k0126Q9228J1644K0299L3172j9013O9319
$$ -40980 -97035 -61646 -56153 -51193 -137169 -136322 -156448 -67220 -55576 -35277 -2105 -21118 48201
6234D8201K7933K4157n4579m5487O6035L3853m1254p1071j5687j4683m6727k7075
$$ 48201 76134 100291 45712 225 66260 100113 58859 -12212 -27899 -42582 -89309 -116384
6222a16384O4451m2287r338q0407L5113J04748R4081P4329P0594k9060n0221N4849
$$ -116384 -51933 -94220 -103558 -183965 -148852 -44104 49977 124306 194900 165840 115619 170468
6210A70468M9589p3215j4985l7422p396J6168j43308l7015K4489j2054M9834J3098
$$ 170468 220057 146842 131857 94435 87039 103207 -40101 -77116 -52627 -64681 -14847 -1749
6198a749N6817M0919N3080q9736j64591J8090K3014O2010Q3093j6279n8983r7992
$$ -1749 55068 95987 149067 59331 -105260 -87170 -64156 -2146 80947 64668 5685 -92307
6186i2307o0571k5797R1619p9671m5438O0831n8447R0770l2438k0942J1260N1764
$$ -92307 -152878 -178675 -87056 -166727 -212165 -151334 -209781 -119011 -151449 -172391 -161131 -109367
6174a09367J03166J14492j4636p2746j5591O3120k4929j47256m6844j5373M6656
$$ -109367 -6201 108291 93655 20909 5318 68438 43509 -103747 -150591 -165964 -119308
6163a19308J30044L6726Q9643k3294J23321R0623p4756j36872j23820J2581Q5071
$$ -119308 10736 47462 137105 113811 237132 327755 252999 116127 -7693 4888 89959
6152H9959K9406j7900J58814p762j18317p7543M7133o7098p3425n4654j1510Q2933
$$ 89959 119365 101465 260279 252517 134200 56657 103790 36692 -36733 -91387 -102897 -19964
6140a9964R4701K7719q2357j58534J8024J21115R5456l7518r9613R2802l8207
$$ -19964 74737 102456 20099 -138435 -120411 704 96160 58642 -40971 51831 13624
6129A3624j3220l481J3475M0720J0309L4433J13305o3092p9223K3530j6666p1425
$$ 13624 404 -3077 10398 51118 61427 95860 209165 146073 66850 90380 73714 2289
6117B289M3456j7905l5255k8788j28515Q314R0430Q5127J12822J02425r6407n9901
$$ 2289 45745 27840 -7415 -36203 -164718 -156404 -65974 19153 131975 234400 137993 78092
6105G8092M2926q3905m8307K5548r4859j4601K7711P0121L8078Q2283q6747j03111
$$ 78092 121018 37113 -11194 14354 -80505 -95106 -67395 2726 40804 123087 36340 -66771
6093f6771m7834l9581L3356J65486n3492o1939k5843N5957O628k9965j05371M275
$$ -66771 -114605 -154186 -120830 44656 -8836 -70775 -96618 -40661 -34033 -63998 -169369 -165094
6081a65094Q7270R9680J41086Q1459n9872j62346q0484P774P100p2857k4700J8733
$$ -165094 -77824 21856 162942 244401 184529 22183 -58301 -50527 -43427 -116284 -140984 -122251
6069a22251j6333N4667J99052J28007j14887o5306r6089l1146M4036M445o4099
$$ -122251 -138584 -83917 115135 243142 128255 62949 -33140 -64286 -20250 -15805 -79904
6058g9904L928J09331k638j2213m8867j4099P408l6865j6069J29751J4136o0640
$$ -79904 -75976 33355 30717 18504 -30363 -44462 -37054 -73919 -89988 39763 53899 -6741
6046f741j29665L0087J18313N2821q4026K745J55917l9588q2484J1864J3912j01909
$$ -6741 -136406 -106319 11994 64815 -19211 -16466 139451 99863 17379 29243 43155 -58754
6034e8754k9684m321p6598J9831L1574m1553J401o2585K6110l824J03055J51922
$$ -58754 -88438 -92759 -169357 -149526 -117952 -159505 -158104 -220689 -194579 -198403 -95348 56574
6022E6574O0659Q6195p2697j85918J7406n8786k1688M5896M1214j962j9061L5052
$$ 56574 117233 203428 130731 -55187 -37781 -96567 -118255 -72359 -31145 -33107 -52168 -17116
6010a7116R2153l6932j37288j08694M0361O9618J6439o2079L4488O9657J6663
$$ -17116 75037 38105 -99183 -207877 -167516 -97898 -81459 -143538 -109050 -39393 -22730
5999b2730J9867k6157l0768p327k9506L5755O9933p0152j21248J887M1615O1741
$$ -22730 -2863 -29020 -59788 -67115 -96621 -60866 9067 -61085 -182333 -180446 -138831 -77090
5987g7090J30872p2675j10633m4825L6567m3779J13274J21121l4333p5857o6829
$$ -77090 53782 -18893 -129526 -174351 -137784 -181563 -68289 52832 18499 -57358 -124187
5976a24187M3049k0706J7532J3710j15261k8210J9386Q3682l020n1190J07235
$$ -124187 -81138 -101844 -84312 -70602 -185863 -214073 -194687 -111005 -114025 -165215 -57980
5965e7980o5222l9201N7242K4332R7007J03069L737p8452k7145j7482J78545j33209
$$ -57980 -123202 -162403 -105161 -80829 16178 119247 122984 44532 17387 -95 178450 45241
5953D5241o6051l4107j1695l5887M2487L9944k1457k005J3239Q39O3801M0069
$$ 45241 -20810 -54917 -66612 -102499 -60012 -20068 -41525 -43530 -30291 -29452 34349 74418
5941G4418M908p0936n4966j7429p7217J12939J79798p1817n5590n359J4175J4039
$$ 74418 79326 8390 -46576 -64005 -141222 -28283 151515 79698 24108 18749 32924 46963
5929D6963L3023n2183k9351N7052n0781L9983J3407j7086n6666k6827L7697P6276
$$ 46963 79986 27803 -1548 55504 4723 44706 58113 41027 -15639 -42466 -4769 71507
5917G1507p0976j95053m4861j4034L9088o00J59123M1771p2022k3521k0208N9600
$$ 71507 531 -194522 -239383 -253417 -214329 -214929 -55806 -14035 -86057 -109578 -129786 -70186
5905g0186R0871O6914K6958j11324k9626l1599o6403J7314K0901L8888N840k4697
$$ -70186 20685 87599 114557 3233 -26393 -57992 -124395 -107081 -86180 -47292 -41452 -66149
5893f6149j04287l1091M2406R881k8000Q2439O3694J2877R589L5194o0258p4617
$$ -66149 -170436 -201527 -159121 -149240 -177240 -94801 -31107 -18230 -8641 26553 -33705 -108322
5881a08322O2885K712M8157M5463k2199r961l5265p2938l9939l4483k3723j2057
$$ -108322 -45437 -42725 5432 50895 28696 18735 -16530 -89468 -129407 -163890 -187613 -199670
5869a99670P7267n0158M5117l2809J354Q3115K7937j3085L6899l1422o5850P4309
$$ -199670 -122403 -172561 -127444 -160253 -158899 -75784 -47847 -60932 -24033 -55455 -121305 -46996
5857d6996j05463j9371n3871P9966J59152n8510n9736L8347j0549J32445J13347
$$ -46996 -152459 -171830 -225701 -145735 13417 -45093 -104829 -66482 -77031 55414 168761
5846A68761j0001p623n9506k1170m7144l5833q0097Q6904j205l6320O0258k6154
$$ 168761 158760 151137 91631 70461 23317 -12516 -92613 -5709 -6914 -43234 17024 -9130
5834i130n1651j01866J1657O5751R9171N4346r427n8779M3948n5423o6401K8108
$$ -9130 -60781 -162647 -150990 -85239 13932 68278 58851 72 44020 -11403 -77804 -49696
5822d9696q8921L0683J11897n7212p9094k3880R224P2825Q616Q2538N9333j0264
$$ -49696 -138617 -107934 3963 -53249 -132343 -156223 -146999 -74174 -65558 16980 76313 66049
5810F6049j26747r3871K5065J39663P9986q0490k7361k4792M0345n7762Q9154
$$ 66049 -60698 -154569 -129504 10159 90145 9655 -17706 -42498 -2153 -59915 29239
5799B9239K0344j4194o5557q5150L9297R5124R0788o8554m8673j12184m6971K9118
$$ 29239 49583 35389 -30168 -115318 -76021 19103 109891 41337 -7336 -119520 -166491 -137373
5787a37373n249R734L2697P0917o9529k8986j2718j067J08043P4381Q6683K2999
$$ -137373 -142622 -132888 -100191 -29274 -98803 -127789 -140507 -141574 -33531 40850 127533 150532
5775A50532p9940P768q475n209j0635P996j46534o0087o0791O0768J03945R1015
$$ 150532 70592 78360 69885 64676 54041 62037 -84497 -144584 -205375 -144607 -40662 50353
5763E0353J08354n5697j0572n3265q7010l235J50687Q8011r4074j64554o6684
$$ 50353 158707 103010 92438 39173 -47837 -51072 99615 187626 93552 -71002 -137686
5752a37686M6733P1887K2523J12097N6699k7651l9573p9498K3511J32797P833
$$ -137686 -90953 -19066 3457 115554 172253 144602 105029 25531 49042 181839 189672
5741A89672r8557N5937N8431j11405J5886q1484K2834k8133k06206O8263J38919
$$ 189672 91115 147052 205483 94078 109964 28480 51314 23181 -183025 -114762 24157
5730B4157O9364m5580n9270l0660m3524k9467R9916M4160k2089N6585p8748o3981
$$ 24157 93521 47941 -11329 -41989 -85513 -114980 -15064 29096 7007 63592 -15156 -79137
5718g9137M7494j11479o0601M6601R9318N9577r0591p437l6396J10130R4626j28498
$$ -79137 -31643 -143122 -203723 -157122 -57804 1773 -88818 -96255 -132651 -22521 72105 -56393
5706e6393k1527p6842J3223J69534J08584n2150j15088l424n3271o524l896P373
$$ -56393 -77920 -154762 -141539 27995 136579 84429 -30659 -34083 -87354 -93878 -97774 -90401
5694i0401P2582r3385j82391J9904L5214M1698l467j6390N4734L1075K0719p4455
$$ -90401 -17819 -111204 -293595 -273691 -238477 -196779 -200246 -216636 -161902 -130827 -110108 -184563
5682a84563K3351L5635P3484J31304j97280r995j3588N6446J95604l846j27868
$$ -184563 -161212 -125577 -52093 79211 -118069 -128064 -141652 -85206 110398 106552 -21316
5671b1316l9352m4854P5957L6719J10588p462n9653r4685Q276P8677n3260j8572
$$ -21316 -60668 -105522 -29565 7154 117742 110280 50627 -44058 -35782 42895 -10365 -28937
5659b8937J6558l0648j6068r0902q3255O5030N3698M5655J7303O0727O6265n5721
$$ -28937 -12379 -43027 -59095 -149997 -233252 -168222 -114524 -68869 -51566 9161 75426 19705
5647A9705j0635l2954P5052N2985O9464r4799K6924O4615j6626r6338j19559K2868
$$ 19705 9070 -23884 51168 104153 173617 78818 105742 170357 153731 57393 -62166 -39298
5635c9298L4678j277M5209R7973K4841j83794j00702Q5251J17849q8308j05849
$$ -39298 -4620 -5897 39312 137285 162126 -21668 -122370 -37119 80730 -7578 -113427
5624a13427P0985J95469l1286j98966n5035N6705P1246j3785o5185J2606J7152
$$ -113427 -42442 153027 121741 -77225 -132260 -75555 -4309 -18094 -83279 -70673 -53521
5613e3521L4863R5533j44997N1903R4273j9312r0513m2011n7068K7691P4235Q2280
$$ -53521 -18658 76875 -68122 -16219 78054 58742 -31771 -73782 -130850 -103159 -28924 53356
5601E3356L2451k2241k2767j04316n3527J01554N1821k322l2942j766J90005l8312
$$ 53356 85807 63566 40799 -63517 -117044 -15490 36331 34009 1067 -699 189306 150994
5589A50994j92202p1680o9463l4155m665p3982J22315J56496L7918l1143P9430
$$ 150994 -41208 -112888 -182351 -216506 -221171 -295153 -172838 -16342 21576 -9567 69863
5578F9863L7924J57091o3403l9917o7045K1107J1567q0327j74586m5386R7089
$$ 69863 107787 264878 201475 161558 94513 115620 127187 46860 -127726 -173112 -76023
5567g6023K21M0809p1681q6529M7258K0237R659J47780J46050m485q8721K177
$$ -76023 -75802 -34993 -106674 -193203 -145945 -125708 -116049 31731 177781 173296 84575 86752
5555H6752q3935K708P9548P3027R886j26086j38651j6810Q46m6166O1242J05361
$$ 86752 2817 5525 85073 158100 167986 41900 -96751 -113561 -112715 -158881 -97639 7722
5543G722Q8402o8987j61435R286L2838j6725L5389M1388Q5382P0844N5366j11883
$$ 7722 96124 27137 -134298 -125012 -92174 -108899 -73510 -32122 53260 124104 179470 67587
5531F7587r2794L521m3409j82792m6791P3018R1978J14909p562n6306J03107n990
$$ 67587 -25207 -21686 -65095 -247887 -294678 -221660 -129682 -14773 -22335 -78641 24466 18476
5519A8476l9902k0751p0740q1913Q6228J2959R748q2824N3770O6629Q5898M6792
$$ 18476 -21426 -42177 -112917 -194830 -108602 -95643 -85895 -168719 -114949 -48320 37578 84370
5507H4370Q7j8670J0938o364r9976j33793j1625Q9850M0995n4129J19984P8008
$$ 84370 84457 65787 76725 70361 -29615 -163408 -175033 -85183 -44188 -98317 21667 99675
5495I9675j70730o6990O233J19528M491M8605N1882n2189j60383j7839R4555n8302
$$ 99675 -71055 -138045 -131812 -12284 -7793 40812 92694 40505 -119878 -137717 -43162 -101464
5483a01464J6476j7206P0092R5860r0958q6126m0797P1412N9285J09743K9152
$$ -101464 -84988 -102194 -32102 63758 -27200 -113326 -154123 -82711 -23426 86317 115469
5472A15469o0696J5191K999o0149j45864L9490J10760N137o949O1329J3340j4470
$$ 115469 54773 69964 72963 12814 -133050 -93560 17200 22337 15388 76717 90057 75587
5460G5587Q267p0729j06911p8132L7574L7798L8391Q3490r1027n4396p1854n0657
$$ 75587 83854 13125 -93786 -171918 -134344 -96546 -58155 25335 -65692 -120088 -191942 -242599
5448b42599M1500M8858R5158L4808k7551j57847n8331J82757J80897q8321j06614
$$ -242599 -201099 -152241 -57083 -22275 -49826 -207673 -266004 -83247 97650 9329 -97285
5437i7285j02998R8338Q6372P0261k1118n1513N0143q052k2560K7978P084Q4769
$$ -97285 -200283 -101945 -15573 54688 33570 -17943 32200 24148 1588 29566 36650 121419
5425A21419J31547J4906n3861k6822q4556j26627j9365r2244J15705N9534J3080
$$ 121419 252966 267872 214011 187189 102633 -23994 -43359 -135603 -19898 39636 52716
5414E2716P0781L996m6105K8175O0515m9578J6629p38R334j58760m0410N4218
$$ 52716 123497 127493 81388 109563 170078 120500 137129 136391 145725 -13035 -53445 773
5402G73P5149J19647m8192j46341p9867N8249J9540L3100Q9916J11278n6581R008
$$ 773 75922 195569 147377 1036 -78831 -20582 -1042 32058 121974 233252 176671 185679
5390A85679P507j2610n2456O1968o241j77190m3370J18476J00812j8903m97N6647
$$ 185679 193186 180576 128120 190088 183847 6657 -36713 81763 182575 163672 163175 219822
5378B19822m5444J254J8522j59966j10048K3974K933R5087M5655m5332l0875j3416
$$ 219822 174378 175632 194154 34188 -75860 -51886 -48953 46134 91789 46457 15582 2166
5366B166N9332o1247j08019r0216J6130R7961N2192m5949l3420L1688l5191n2416
$$ 2166 61498 251 -107768 -197984 -181854 -83893 -31701 -77650 -111070 -79382 -114573 -166989
5354a66989J13013n2971m9445O7456Q791k5130r0106O6010Q1487K0384N8389J4093
$$ -166989 -53976 -106947 -156392 -88936 -80145 -105275 -195381 -129371 -47884 -27500 30889 44982
5342D4982j18939P7952K077r7502K7212N9878M6259j443J7734j6351j3726o5594
$$ 44982 -73957 3995 6072 -91430 -64218 -4340 41919 40476 58210 41859 28133 -37461
5330c7461k9771J7687r706J434J1589M126q743J6987J8806m2222l5028Q6649P8123
$$ -37461 -67232 -49545 -59251 -57817 -46228 -42102 -50845 -33858 -15052 -57274 -92302 -5653 72470
5317G2470l2112l9209o4186J44413Q2219j5659L3680Q4286p3813r8007q3912L4300
$$ 72470 40358 1149 -63037 81376 163595 147936 181616 265902 192089 94082 10170 44470
5305D4470p7423l8834M5296n0347J8899P870M0184o9671o2227q3962L5922Q4698
$$ 44470 -32953 -71787 -26491 -76838 -57939 -50069 -9885 -79556 -141783 -225745 -189823 -105125
5293a05125n9040N9743N7283j2244k7796J03144n8276m9887J08625L4935o285
$$ -105125 -164165 -104422 -47139 -59383 -87179 15965 -42311 -92198 16427 51362 45077
5282D5077K0425l9708j56357J5744P3542L0367P7513M6701m1574M5827N1021K5351
$$ 45077 65502 25794 -130563 -114819 -41277 -10910 66603 113304 71730 117557 168578 193929
5270A93929k7122M5203k4927l546L5877j7147p1612j25043j7204L9147j72018
$$ 193929 166807 212010 187083 183537 219414 202267 130655 5612 -11592 27555 -144463
5259a44463p7673j6616J01239J35662J2550j8761M4556L9824M3548l8272j94956
$$ -144463 -222136 -238752 -137513 -1851 10699 -8062 36494 76318 119866 81594 -113362
5248a13362l6683K2219m2333J1256M9769J02049k1663l1543N1843O3944N044q8821
$$ -113362 -150045 -127826 -170159 -158903 -109134 -7085 -28748 -60291 -8448 55496 60540 -28281
5236b8281p3989l0627O3084J9125P2346r8330n6476K8265m944N2048j08131L1204
$$ -28281 -102270 -132897 -69813 -50688 21658 -76672 -133148 -104883 -109827 -57779 -165910 -134706
5224a34706J57333Q5991m6167n2950J3117J1060q6251j08679N2230m864l7930
$$ -134706 22627 108618 62451 9501 22618 33678 -52573 -161252 -109022 -113886 -151816
5213a51816r0638K729N6788J04419J01345J3190k457j3531M594j48357l7361m925
$$ -151816 -242454 -239725 -182937 -78518 22827 36017 33560 20029 24623 -123734 -161095 -166020
5201a66020m3459M1898J51643L5714J1202J0147N243j9839l2954j14954j7358
$$ -166020 -209479 -167581 -15938 19776 30978 41125 46368 26529 -6425 -121379 -138737
5190a38737P8114k5116n7802r711J41096J9765M5950K8957j6536J4903J09408
$$ -138737 -60623 -85739 -143541 -153252 -12156 7609 53559 82516 65980 80883 190291
5179A90291O0120J0459j28984j11179j86000j32986q3367P17J46833K5043K6436
$$ 190291 250411 260870 131886 20707 -165293 -298279 -381646 -380929 -234096 -209053 -182617
5168a82617J90384m4833j38579M374K3098J88686K6221m6221n5608r1683k3738
$$ -182617 7767 -37066 -175645 -171271 -148173 40513 66734 20513 -35095 -126778 -150516
5157a50516L5034K010k7960N0832N5802j7914j1912L2798J24250j0057j803j13954
$$ -150516 -115482 -113472 -141432 -90600 -34798 -52712 -64624 -31826 92424 82367 80564 -33390
5145c3390j08943j8201J20540p1248r016O4423j5740N548k5177M7951J78240R0887
$$ -33390 -142333 -160534 -39994 -111242 -120258 -55835 -71575 -66027 -91204 -43253 134987 225874
5133B25874r4353j74299k7656J11473M0782m6567l395q9124q6521k939Q7289L3136
$$ 225874 131521 -42778 -70434 41039 81821 35254 31859 -57265 -143786 -146725 -59436 -26300
5121b6300J6854n1961r1160L3561Q2714L4837p3696M681P8350O8509M7159j03047
$$ -26300 -9446 -61407 -152567 -119006 -36292 -1455 -75151 -70470 7880 76389 123548 20501
5109B0501j76670l6090N0460K08900J14594k9055k4218j23559K152p190P8513
$$ 20501 -156169 -192259 -141799 67101 181695 152640 128422 4863 7015 -175 78338
5098G8338j3796p3465m6533p147K5850K486N8742n2938J0908O7791M4531n4911
$$ 78338 64542 -8923 -55456 -62603 -36753 -34267 24475 -28463 -17555 50236 94767 39856
5086C9856q336K7772K6380n2996k3133m0056p9030O3185J49188j7486p7707J56589
$$ 39856 31520 59292 85672 32676 9543 -30513 -109543 -46358 102830 85344 7637 164226
5074A64226n8259q7411M3417R4752Q177k3529o9393j8404n6654j465m0722j68635
$$ 164226 105967 18556 61973 156725 164902 141373 71980 53576 -3078 -4543 -45265 -213900
5062b13900M0208R1241J83953Q889l9204O1999p0939j61759M9718L913k9941L557
$$ -213900 -173692 -82451 101502 110391 71187 133186 62247 -99512 -49794 -45881 -75822 -72265
5050g2265J17754m8959n5818N840m9680j31730J8041K4468R7652o8846l1100M0870
$$ -72265 45489 -3470 -59288 -53448 -103128 -234858 -216817 -192349 -94697 -163543 -194643 -153773
5038a53773R9483q7909J5176M7318j8995j7195J17147r535P9899O0032P3034k2235
$$ -153773 -54290 -142199 -127023 -79705 -98700 -115895 1252 -8283 71616 131648 204682 182447
5026A82447q4262j44352q3198j09464L8299J36786m1802M595J07479R7155o728
$$ 182447 98185 -46167 -129365 -238829 -200530 -63744 -105546 -100951 6528 103683 96955
5015I6955L9392k9104p3801J8241R7860M0008O7603l5897n9814o354o9408p3689
$$ 96955 136347 107243 33442 51683 149543 189551 257154 221257 161443 155089 85681 11992
5003A1992l0700k6289o3933P1280K4279L9870k7640M0330J3515o2999L5550P1738
$$ 11992 -18708 -44997 -108930 -37650 -13371 26499 -1141 39189 52704 -10295 25255 96993
4991I6993k2818j33388o8225Q8594J30020l5381q9929j7869R7681J20182l1826
$$ 96993 74175 -59213 -127438 -38844 91176 55795 -34134 -52003 45678 165860 134034
4980A34034q5079q1464K0902l3973k4470M672L0466j1140J15822K15707j43990
$$ 134034 48955 -32509 -11607 -45580 -70050 -65378 -34912 -46052 69770 285477 141487
4969A41487j57098J33997L9992l8846j23691o4047L7790J03960P7757n3592q9869
$$ 141487 -15611 118386 158378 119532 -4159 -68206 -30416 73544 151301 97709 7840
4958G840j00135m6947K9099j1863l4872M3548P2560J3362j13672m9406K1334l8970
$$ 7840 -92295 -139242 -110143 -122006 -156878 -113330 -40770 -27408 -141080 -190486 -169152 -208122
4946b08122J876J9586R1352M8636L2859n2991Q0169R70p703l9483r0795N305j3183
$$ -208122 -206246 -186660 -95308 -46672 -13813 -66804 13365 14335 6632 -32851 -123646 -118341 -131524
4933a31524p7591o1366R5877j6180j294K8152K2640k3973l3887K8328j3752m9670
$$ -131524 -209115 -270481 -174604 -190784 -192078 -163926 -141286 -165259 -199146 -170818 -184570 -234240
4921b34240n7341N5941M1058J46043M724L4874n2584r0978n0059K6913K3617R3087
$$ -234240 -291581 -235640 -194582 -48539 -43815 -8941 -61525 -152503 -202562 -175649 -152032 -58945
4909e8945R5251n1117L6447L0152k5789m4853K2031J9586M8660m6410l2681Q7625
$$ -58945 36306 -14811 21636 51788 25999 -18854 3177 22763 71423 25013 -7668 79957
4897G9957j8798m1733M4175P0727j30440j23588N8550J8654n648k6856n5640M340
$$ 79957 61159 19426 63601 134328 3888 -119700 -61150 -42496 -48144 -75000 -130640 -126300
4885a26300n4077K7107N5469r8003J67226Q9906J21243n1067q3103r4674Q3240
$$ -126300 -180377 -153270 -97801 -195804 -28578 61328 182571 131504 48401 -46273 36967
4874C6967J74571q370n5519l0863j15716j65823P6252J09730N9942O2622j7283
$$ 36967 211538 203168 147649 116786 1070 -164753 -88501 21229 81171 143793 126510
4863A26510o3341J0635m974J5429r182j16248p0654n5262J43182J49634J29097
$$ 126510 63169 73804 68830 84259 75077 -41171 -111825 -167087 -23905 125729 254826
4852B54826j9017l3765j62751l1672k0171j14691J13685P2215R1670L5390j4466
$$ 254826 235809 202044 39293 7621 -12550 -127241 -13556 58659 150329 185719 171253
4841A71253l6923K5037n2590m9155R6084J0227k29277j15100J20477J08148R8721
$$ 171253 134330 159367 106777 57622 153706 163933 -65344 -180444 -59967 48181 146902
4830A46902k6159j09613K8009l0046J21667j57710j71477J3181P549J6661K888
$$ 146902 120743 11130 39139 9093 130760 -26950 -198427 -185246 -177697 -161036 -158148
4819a58148m5866L3795N9951L4048k8185m1772L1720K4613R5098M1297l8789r1570
$$ -158148 -204014 -170219 -110268 -76220 -104405 -146177 -114457 -89844 5254 46551 7762 -83808
4807h3808n3211m1046q0774m2568O4287L0221k907K7754r998R9779R1089L0003
$$ -83808 -137019 -178065 -258839 -301407 -237120 -206899 -209806 -182052 -192050 -92271 -1182 28821
4795B8821n7704J0046O8536q1760j13384l2262N2904K4378L000q6151n0660m184
$$ 28821 -28883 -18837 49699 -32061 -145445 -177707 -124803 -100425 -97425 -183576 -234236 -238420
4783b38420M1796p6665M1343J89118L9188K7381M947K9057m3443K3630k3033m0156
$$ -238420 -196624 -273289 -231946 -42828 -3640 23741 28688 57745 14302 37932 14899 -25257
4771b5257j23846J1940M6563K5958L0888K6523j2385J5594n9920n6790n217J3382
$$ -25257 -149103 -137163 -90600 -64642 -33754 -7231 -19616 -4022 -63942 -120732 -125949 -112567
4759a12567O0023r4899n9559M706N5768n4665l3376J34424O9985L6811M3765n9452
$$ -112567 -52544 -147443 -207002 -202296 -146528 -201193 -234569 -100145 -30160 6651 50416 -9036
4747i036j0436N7957p734J20466J04144P6767j3805j73961j06965K290o3073N7723
$$ -9036 -19472 38485 30751 151217 255361 332128 318323 144362 37397 39687 -23386 34337
4735C4337k5352j61011O6581N3797j43399j9881J20715J5499r660j12460K242
$$ 34337 8985 -152026 -85445 -31648 -175047 -194928 -74213 -58714 -68374 -180834 -178592
4724a78592J18661j2368J1317j4095K4344J8499P6616m0004p0949k8188l1925
$$ -178592 -59931 -72299 -60982 -75077 -50733 -32234 44382 4378 -66571 -94759 -126684
4713a26684M7349R1120J03258j3856o1786n2023q1719L0262L6739J18462Q0519
$$ -126684 -79335 11785 115043 101187 39401 -12622 -94341 -64079 -27340 91122 171641
4702A71641j93473r0250r577M2122N5057l2353K6796J19288K4795n2031N1460
$$ 171641 -21832 -112082 -121659 -79537 -24480 -56833 -30037 89251 114046 62015 113475
4691A13475l493j26017N6698L1704j09619P7587R5593q690j58447j9977L9674
$$ 113475 109982 -16035 40663 72367 -37252 40335 135928 127238 -31209 -51186 -11512
4680a1512m8138J28143O0928j04938k5474L9850n5562q9001J07793J21249j635
$$ -11512 -59650 68493 129421 24483 -991 38859 -16703 -105704 2089 123338 121703
4669A21703l7647j1857K6738m0612o5438o858J01515l7513j20137N9506m6664
$$ 121703 84056 72199 98937 58325 -7113 -13971 87544 50031 -70106 -10600 -57264
4658e7264l7120P6036R3816J2327k9347O1131J8489j55079j38210K0822R171K8715
$$ -57264 -94384 -18348 75468 87795 58448 119579 138068 -17011 -155221 -134399 -125228 -96513
4646i6513O8933q3138K135J65773L7617M4091R932o4970m0646o1972L9862J14765
$$ -96513 -27580 -110718 -108583 57190 94807 138898 148830 83860 43214 -18758 21104 135869
4634A35869M0796j13984n5271J936L9418n8764k6253n5111o3993J21561J91058
$$ 135869 176665 62681 7410 9346 48764 -10000 -36253 -91364 -155357 -33796 157262
4623A57262n2445p2576L6739l5131p5272J0874K9528N3446K2055n4872J3189J30451
$$ 157262 104817 32241 68980 33849 -41423 -30549 -1021 52425 74480 19608 32797 163248
4611A63248R4299r9143j36030m1755j9367k9197r4842n9093m3326K23969J50659
$$ 163248 257547 158404 22374 -19381 -38748 -67945 -162787 -221880 -265206 -41237 109422
4600A09422j16959o9506J18224N6662O2930n7813p415J06708q0251l7378j6609
$$ 109422 -7537 -77043 41181 97843 160773 102960 95545 202253 122002 84624 68015
4589F8015K8299K7902m7111j11678r5223K5474K3696P4211n9319j45928R6795
$$ 68015 96314 124216 77105 -34573 -129796 -104322 -80626 -6415 -65734 -211662 -114867
4578a14867N0534N3453P8198M8738j49285r4099r694R6357L1776J568n7085m2182
$$ -114867 -64333 -10880 67318 116056 -33229 -127328 -137022 -40665 -8889 -7321 -64406 -106588
4566a06588o3878J09441J01423Q8602P271J0933o8221j73807j0616N3154j917
$$ -106588 -170466 -61025 40398 129000 136271 147204 78983 -94824 -105440 -52286 -54203
4555e4203n5094o3723l7538P4948K9229L4219k0598J3767j35522j30575J7987
$$ -54203 -109297 -173020 -210558 -135610 -106381 -72162 -92760 -78993 -214515 -345090 -327103
4544c27103J08741J45884L0219R0349J65705N724j3102k8119r1329j9945M2729
$$ -327103 -218362 -72478 -42259 48090 213795 219519 206417 178298 86969 67024 109753
4533A09753M1889j4497n321K6001k2196j22869n1560K750Q4201r0442m2752o6219
$$ 109753 151642 137145 131824 157825 135629 12760 -38800 -36050 48151 -42291 -85043 -151262
4521a51262L7490L2300n353L5626j16017J0185Q1518m4357r6332o3456k2283R2981
$$ -151262 -113772 -81472 -86825 -51199 -167216 -157031 -75513 -119870 -216202 -279658 -301941 -208960
4509b08960J53567j8089m0423L9141M2410o191K952n381Q5211N845j11591m4320
$$ -208960 -55393 -73482 -113905 -74764 -32354 -38545 -35593 -40974 44237 50082 -61509 -105829
4497a05829j06425p2202O0766P9799J12862O1534j45961M8082M2212L9631J18254
$$ -105829 -212254 -284456 -223690 -143891 -31029 30505 -115456 -67374 -25162 14469 132723
4486A32723j1411q5457j28761r809J01469L0346O6370L4149m1705j08926P733
$$ 132723 121312 35855 -92906 -102715 -1246 29100 95470 129619 87914 -21012 -13279
4475a3279M4687n4932m1950M7455P4923k9009j1927J54437L0685k2348l4887r0589
$$ -13279 31408 -23524 -65474 -18019 56904 27895 15968 170405 201090 178742 143855 53266
4463E3266j38427K6076J11748L7285j16466l169J1965L1176q0466l4447K6758
$$ 53266 -85161 -59085 52663 89948 -26518 -29687 -17722 13454 -67012 -101459 -74701
4452g4701j8738K5650K2129J8950Q0485P9845m4394j39088n6760n907o106r4310
$$ -74701 -93439 -67789 -45660 -26710 53775 133620 89226 -49862 -106622 -112529 -118635 -212945
4440b12945M1728N6604J09167J3614q354R907k483m5449n2919M5474j9184O7927
$$ -212945 -171217 -114613 -5446 8168 -186 9721 7238 -38211 -91130 -45656 -64840 3087
4428C087L3470Q391r838K4871O7322K2200o148r0586l5482N8611L127o62n5681
$$ 3087 36557 44948 35110 59981 127303 149503 143355 52769 17287 75898 79025 78363 22682
4415B2682o2387N7093J01885K8936o7949n8274j10394q1998N742O876J03348J02481
$$ 22682 -39705 17388 119273 148209 80260 21986 -88408 -170406 -164664 -157788 -54440 48041
4403D8041J48595j46951j10010K355m9684L9432N4039p4095j679Q7116M3354k8710
$$ 48041 196636 49685 -60325 -57970 -107654 -68222 -14183 -88278 -89957 -2841 40513 11803
4391A1803k0173j05622q162M2650O1756J18016K6439n8020o9431P8469n9217j03003
$$ 11803 -8370 -113992 -122154 -79504 -17748 100268 126707 68687 -744 77725 18508 -84495
4379h4495p9252N7751J20291J07081K2691R1096n9675r3068q4485j9941J3905
$$ -84495 -163747 -105996 14295 121376 144067 235163 175488 82420 -2065 -22006 -8101
4368h101j00969k9295j5709l8271Q1819Q4949L5485o5684l2536R0245N6924j5938
$$ -8101 -109070 -138365 -154074 -192345 -110526 -25577 9908 -55776 -88312 1933 58857 42919
4356D2919J08303m3654K1544o6409N332k5415n9885n0573o091J6526M9877N1176
$$ 42919 151222 107568 129112 62703 68035 42620 -17265 -67838 -73929 -57403 -7526 43650
4344D3650n9808p5956P8983j03888p9495o633m233J77410Q5299K1353K6003K4645
$$ 43650 -16158 -92114 -13131 -117019 -196514 -203147 -207380 -29970 55329 76682 102685 127330
4332A27330k6622j03823o2721L9570O0924P4651p6027j28831l0586L8550j0718
$$ 127330 100708 -3115 -65836 -26266 34658 109309 33282 -95549 -126135 -87585 -98303
4321i8303l2075J30095Q5956P956j8822j10290l3529J2151r5829l1481J11592
$$ -98303 -130378 -283 85673 93629 74807 -35483 -69012 -56861 -152690 -184171 -72579
4310g2579R234L6189J03230j8645l5190P751k1897l538J54402L0084j67999j09824
$$ -72579 -63345 -27156 76074 57429 22239 29990 8093 4555 158957 189041 21042 -88782
4298h8782L3245K6031k2237l0306L0126O3219q1472m2348Q0373R7737L0394q8603
$$ -88782 -55537 -29506 -51743 -82049 -51923 11296 -70176 -112524 -32151 65586 95980 7377
4286G377j12425Q1842J54775n1621o9567k4717J57830K8688p5751r2906q9907
$$ 7377 -105048 -23206 131569 79948 10381 -14336 143494 172182 96431 3525 -86382
4275h6382o2146n8645N8248P5315O676N0257r5896n6380j2273K0717K3731L3738
$$ -86382 -148528 -207173 -148925 -73610 -66934 -16677 -112573 -168953 -181226 -160509 -136778 -103040
4263a03040O7595J1521j34991J21017J18089O3223n6440o7054m0385m0933j8638
$$ -103040 -35445 -23924 -158915 -37898 80191 143414 86974 19920 -20465 -61398 -80036
4252h0036m2013J4549N2609J11388R7323M2604l3533k5151k4931m0745Q9802J3213
$$ -80036 -122049 -107500 -54891 56497 153820 196424 162891 137740 112809 72064 161866 175079
4240A75079n9725n1620j32053N6559P7917L8435j0291q070j57229l3698n806Q7162
$$ 175079 115354 63734 -68319 -11760 66157 104592 94301 86231 -70998 -104696 -110502 -23340
4228b3340R4069j9954M9519R2021j6868j93418n9217N2467Q2140Q1915J05093
$$ -23340 70729 50775 100294 192315 175447 -17971 -77188 -24721 57419 139334 244427
4217B44427O0240j36493q3762p7781j34841q667J50871J5290J2627K6515k4454
$$ 244427 304667 168174 84412 6631 -128210 -136877 13994 29284 41911 68426 43972
4206D3972L1391k3250n8722R79J9325j10665n2663R2839M9271l3377k4113o5031
$$ 43972 75363 52113 -6609 -5630 13695 -96970 -149633 -56794 -7523 -40900 -65013 -130044
4194a30044J8339K078K8054N5284J15822O1729j35366L5095K7849l651O3644o4015
$$ -130044 -111705 -109627 -81573 -26289 89533 151262 15896 50991 78840 75189 138833 74818
4182G4818j20566P5870l6197O1921p3443J2774N4075p2244n7609M3773M9085L0154
$$ 74818 -45748 30122 -6075 55846 -17597 -4823 49252 -22992 -80601 -36828 12257 42411
4170D2411o1317m4612J13894R2009l2331m198n8719J0492j35520o1708O8588L0203
$$ 42411 -18906 -63518 50376 142385 110054 105856 47137 57629 -77891 -139599 -71011 -40808
4158d0808L5143j1337j05230j9047J91458K2807l0847j04781j8845J9331O1834
$$ -40808 -5665 -17002 -122232 -141279 50179 72986 42139 -62642 -81487 -62156 -322
4147c22o8004m0657M4641n2083n6551J862J30181l7383p0185j5476J51637K5982
$$ -322 -68326 -108983 -64342 -116425 -172976 -171114 -40933 -78316 -148501 -163977 -12340 13642
4135A3642j3910J06588N3361n9012J8688J8737j32012r334m3986o6662P9580M152
$$ 13642 -268 106320 159681 100669 119357 138094 6082 -3252 -47238 -113900 -34320 -30168
4123c0168Q1339J17503o4348k6510k6786j25289l4646k4239P4710j7059P7901
$$ -30168 51171 168674 104326 77816 51030 -74259 -108905 -133144 -58434 -75493 2408
4112B408P8329P2873p3296M6968p046m18J05036N7450p9482j27218p7143R198
$$ 2408 80737 153610 80314 127282 120236 119818 224854 282304 202822 75604 -1539 7659
4100G659M6016j6903j3945n5359P8274j28197p7302p548J59494J9602p1813Q001
$$ 7659 53675 36772 22827 -32532 45742 -82455 -159757 -167305 -7811 11791 -60022 -52021
4088e2021J28097P7696M5462M5283r9374j37505k6280M3270P2572J5402P6283
$$ -52021 76076 153772 199234 244517 145143 7638 -18642 24628 97200 112602 188885
4077A88885j5967O8238o4046L0659k0403r7284M180n6518O9657Q4287j33392r1427
$$ 188885 172918 241156 177110 207769 187366 90082 94262 37744 107401 191688 58296 -33131
4065c3131L7195m9354q5032k6600L6534L9678O425L6087J91450O6122j96811p4710
$$ -33131 4064 -45290 -130322 -156922 -120388 -80710 -74285 -38198 153252 219374 22563 -52147
4053e2147J8551P5738j8653J9842j23906l924O5241k9796n9720m3132k224L6613
$$ -52147 -33596 42142 23489 43331 -80575 -84499 -19258 -49054 -108774 -151906 -154130 -117517
4041a17517Q9985L5202K8912N0377k693r7450P9063J08678k8567L694j43158j4982
$$ -117517 -27532 7670 36582 86959 84266 -13184 65879 174557 145990 149684 6526 -8456
4029h456J4144j2765M4495R7572M9661l3183J9652k2569M8179j2198j58240L8860
$$ -8456 5688 -7077 37418 134990 184651 151468 171120 148551 196730 184532 26292 65152
4017F5152J34082R798r995j13965j23039p7630j5467J34373J4277p1440k471M9795
$$ 65152 199234 209032 199037 85072 -37967 -115597 -131064 3309 17586 -53854 -56325 -6530
4005f530J45111k327n3276j38571q8713m107K287j11968p073K7387L98n301M2794
$$ -6530 138581 136254 82978 -55593 -144306 -148413 -146126 -258094 -265167 -237780 -237382 -242683 -199889
3992a99889J34831l1892q56K0074O7343L3803K0541K1701p4193n0184R5260N0274
$$ -199889 -65058 -96950 -97806 -77732 -10389 23414 43955 65656 -8537 -58721 36539 86813
3980H6813p0491o9922j15260n382L5854Q5217J11280K2781P8228j11461j66885
$$ 86813 16322 -53600 -168860 -174242 -138388 -53171 58109 80890 159118 47657 -119228
3969a19228p816k2379k0989O1741O5340N5480P8899L1510j12640p2184m3151O7542
$$ -119228 -127044 -149423 -170412 -108671 -43331 12149 91048 122558 9918 -62266 -105417 -37875
3957c7875J2505r5079N1826J42353J16671j7418n5859l2065j5685N4029o8720
$$ -37875 -25370 -120449 -68623 73730 190401 172983 117124 85059 69374 123403 54683
3946E4683q4548r009l4928p9178R6487n7309r9413O0842P775j4249K6375q745
$$ 54683 -29865 -38874 -73802 -152980 -56493 -113802 -213215 -152373 -144598 -158847 -132472 -141217
3934a41217L1100N9739j6429J09260m4292l358L6586O3033k026J5887K3136j7592
$$ -141217 -110117 -50378 -66807 42453 -1839 -5197 31389 94422 92396 108283 131419 113827
3922A13827J3707j90618k6202N7299m8782J00J1633p5082L8988N5328L2323J8091
$$ 113827 127534 -63084 -89286 -31987 -80769 -80669 -69036 -144118 -105130 -49802 -17479 612
3910F12j75802m6199P8916J8278J8690m0626j75436N7611J29288N3482R2880L1990
$$ 612 -175190 -221389 -142473 -124195 -105505 -146131 -321567 -263956 -134668 -81186 11694 43684
3898D3684r3136m4967K3243N1343j5537J4985n4019m7029j7498l7372k8002N1199
$$ 43684 -49452 -94419 -71176 -19833 -35370 -20385 -74404 -121433 -138931 -176303 -204305 -153106
3886a53106M6125O2554Q3458L6578M154J18728L756m0286n8516K8101m2821r4965
$$ -153106 -106981 -44427 39031 75609 79763 198491 202247 161961 103445 131546 88725 -6240
3874f240k460n9447j06361P9375l0820K3279k8403j8679K5462J7795k8911L3035
$$ -6240 -8700 -68147 -174508 -95133 -125953 -102674 -131077 -149756 -124294 -106499 -135410 -102375
3862a02375j556j22077J3267J69731Q1944j0003j18661J3008M3079J6449L1012
$$ -102375 -103931 -226008 -212741 -43010 38934 28931 -89730 -76722 -33643 -17194 13818
3851A3818q3614J11577P6109n1062j17370j25292q193L5483k0197J1173M0416
$$ 13818 -69796 41781 117890 66828 -50542 -175834 -184027 -148544 -168741 -157568 -117152
3840a17152O7418Q807J1537K4453J3477M9782k1060Q217K646O2692q9311J922
$$ -117152 -49734 -40927 -29390 -4937 8540 58322 37262 45479 48125 110817 21506 23428
3828B3428o2973j32395L6854P7954L5354j3180j2268J1671k4770Q6200O081N0692
$$ 23428 -39545 -171940 -135086 -57132 -21778 -34958 -47226 -35555 -60325 25875 31956 82648
3816H2648p0556q5299J1142Q0413q6286L0342j6779k8622J1753o5753P642K2940
$$ 82648 12092 -73207 -62065 18348 -67938 -37596 -54375 -82997 -71244 -136997 -129355 -106415
3804a06415m8619l2480M7232R6230M9210J4338k1046j61993m1708J73513J8443
$$ -106415 -155034 -187514 -140282 -44052 5158 19496 -1550 -163543 -205251 -31738 -13295
3793a3295j41733N8209P9352m9598L5058J8311m2988K5602k3840k3969M1797l8694
$$ -13295 -155028 -96819 -17467 -67065 -32007 -13696 -56684 -31082 -54922 -78891 -37094 -75788
3781g5788L5296P8075o8232q8267j15137O123O9949j3307R8247J42459n239j21218
$$ -75788 -40492 37583 -30649 -118916 -234053 -227930 -157981 -171288 -73041 69418 64179 -57039
3769e7039p2109J105J52816N3226k4810L8773l2481J4346m8961o9900J5091L5481
$$ -57039 -129148 -128043 24773 77999 53189 91962 59481 73827 24866 -45034 -29943 5538
3757E538J19307R71j38320j5307J38669M5440q5815j04311l5804J4309Q8110J9840
$$ 5538 124845 125816 -12504 -27811 110858 156298 70483 -33828 -69632 -55323 32787 52627
3745E2627N0756Q9559n2358n724j03466p6243p6222m6397M2290O9857n426L4095
$$ 52627 103383 192942 140584 134860 31394 -44849 -121071 -167468 -125178 -55321 -60747 -26652
3733b6652J8092n0919L6848P197n5626j1493m177M7233J5351o8290K7843n027
$$ -26652 -8560 -59479 -22631 -15434 -71060 -82553 -86730 -39497 -24146 -92436 -64593 -69620
3721f9620n9851M9104R4115j588Q7537O646j03247j16623j9597J05445M8155r3031
$$ -69620 -129471 -80367 13748 12160 99697 106343 3096 -113527 -133124 -27679 20476 -72555
3709g2555N8881n9502J0127m2618j9652M5725O1557j26399k7774J79523M5949
$$ -72555 -13674 -73176 -63049 -105667 -125319 -79594 -18037 -144436 -172210 7313 53262
3698E3262M6845m4363r4640M8446K2636j16203k14742R8389O1123L4090J36572
$$ 53262 100107 55744 -38896 9550 32186 -84017 -298759 -200370 -139247 -105157 31415
3687C1415n4257j8385J7774K2337J53650m6577j2365j12823r0206n6848P642J13027
$$ 31415 -22842 -41227 -23453 -1116 152534 105957 93592 -19231 -109437 -166285 -158643 -45616
3675d5616o5466n4181L7143O8085K2980R2776Q6588n1040p7997o4227l9067p12
$$ -45616 -111082 -165263 -128120 -60035 -37055 55721 142309 91269 13272 -50955 -90022 -90734
3663i0734M5961J04517N7114J6618o6195j12642j0737P7533n448k5681M8961M1399
$$ -90734 -44773 59744 116858 133476 67281 -45361 -56098 21435 15987 -9694 39267 80666
3651H0666J9236k1873L467k0675J4977p6971l2796J05560N270j27396j24768P0459
$$ 80666 99902 78029 81496 60821 75798 -1173 -33969 71591 76861 -50535 -175303 -104844
3639a04844J37847P6548n4878l975Q4404P3144N2246q6752k6160n8424J7970n9941
$$ -104844 33003 109551 54673 50698 135102 208246 260492 173740 147580 89156 107126 47185
3627D7185l1814O8338J03776L2657n7026o3264m9631P3500J40366K9717k5292
$$ 47185 15371 83709 187485 220142 163116 99852 50221 123721 264087 293804 268512
3616B68512k05385n7596J5016j7695J8766k8230q9223P2201m349N7243R1532N2947
$$ 268512 63127 5531 20547 2852 21618 -6612 -95835 -23634 -27983 29260 120792 173739
3604A73739L1743l7506j62961M0639Q8533K0646l764j70630J0999J03299K1700
$$ 173739 205482 167976 5015 45654 134187 154833 151069 -19561 -8562 94737 116437
3593A16437m309l0562m5189K9220j40391j13074J29343J20100j5389k0221R9476
$$ 116437 112128 81566 36377 65597 -74794 -187868 -58525 61575 46186 25965 125441
3582A25441o1325j09207m5909P677M9731j2682q4403M7346o5457l415j7186k8131
$$ 125441 64116 -45091 -91000 -83323 -33592 -46274 -130677 -83331 -148788 -152203 -169389 -197520
3570a97520J30814P2870j2443L1319k957l1468p5886o4608O9597J34209M3352
$$ -197520 -66706 6164 -6279 25040 22083 -9385 -85271 -149879 -80282 53927 97279
3559I7279m3554R469J4058j25850K7293J1038R7511j9984j49906j5562J2733o883
$$ 97279 53725 63194 77252 -48598 -21305 -10267 87244 67260 -82646 -98208 -85475 -92358
3547i2358M4988K1207M7520R7505p3017j8171o1146r2631O669J00787L4117l5875
$$ -92358 -47370 -26163 21357 118862 45845 27674 -33472 -126103 -119434 -18647 15470 -20405
3535b0405r644j19901p6518Q5350J67951M2851J2736O902o4795q1375k9929m1469
$$ -20405 -30049 -149950 -226468 -141118 26833 69684 82420 89322 24527 -56848 -86777 -128246
3523a28246q1727J02784M9750O3088j1359j83941K6908K70042p453j04752r3000
$$ -128246 -209973 -107189 -57439 5649 -5710 -189651 -162743 107299 99846 -4906 -97906
3512i7906P5952M0068j51056m0011j1166K4451J15280l8324j5469M6243j7065
$$ -97906 -21954 18114 -132942 -172953 -184119 -159668 -44388 -82712 -98181 -51938 -69003
3501f9003j4015K3147l4625M6637k0067o928K3373O6340P4648J3140Q1327p1551
$$ -69003 -83018 -59871 -94496 -47859 -67926 -74854 -51481 14859 89507 102647 183974 112423
3489A12423l0246l1048k2152n7095r135J0220J06471J09131p9535n9704n0242
$$ 112423 82177 51129 28977 -28118 -37253 -27033 79438 188569 109034 49330 -912
3478i12j01021Q0198J7322p340p195r5961k96R3171P4358o3515r2518q1532m7157
$$ -912 -101933 -21735 -4413 -11753 -18948 -114909 -115205 -22034 52324 -11191 -103709 -185241 -232398
3465b32398Q9604K24729Q4600o8898o2443q6190K5592m8458O9119K7137l9270
$$ -232398 -142794 81935 166535 97637 35194 -50996 -25404 -73862 -4743 22394 -16876
3454a6876N2302M6214o5459K5044K0676r761j6487l9948l6576O6971J37302j0479
$$ -16876 35426 81640 16181 41225 61901 52140 35653 -4295 -40871 26100 163402 152923
3442A52923j17454m9976r9331j41386Q2479J10223Q5676O6243J0079n8720j10265
$$ 152923 35469 -14507 -113838 -255224 -172745 -62522 23154 89397 99476 40756 -69509
3431f9509O1214q2749n2492R0631K3959P7642l6670r5042n7264J3251J66250Q1697
$$ -69509 -8295 -91044 -143536 -52905 -28946 48696 12026 -83016 -140280 -127029 39221 120918
3419A20918o1454j5291k5323j1661Q2194j0510q7445n3601M1428J62965q5496
$$ 120918 59464 44173 18850 7189 89383 78873 -8572 -62173 -20745 142220 56724
3408E6724J1981N2335O9297n0334j47770r3864J9968P9963m2703k4516m2436q6902
$$ 56724 68705 121040 190337 140003 -7767 -101631 -81663 -1700 -44403 -68919 -111355 -198257
3396a98257M1944J03751K0216P4080l561j15696r503R045Q459j03551j9873n389
$$ -198257 -156313 -52562 -32346 41734 38173 -77523 -87026 -77981 -69522 -173073 -192946 -198335
3384a98335O656J26911Q2916N0848q8985n8756j2624r328n4333L8966J4321l8128
$$ -198335 -191679 -64768 18148 68996 -19989 -78745 -91369 -100697 -155030 -116064 -101743 -139871
3372a39871O291q7968M8837N0674M2775n3202Q0608O6393k6890K5525j20898j90463
$$ -139871 -133580 -221548 -172711 -122037 -79262 -132464 -51856 14537 -12353 13172 -107726 -298189
3360b98189M0067J02275N6880J5715P656M6628j860n455N1440r7612K8104J38069
$$ -298189 -258122 -155847 -98967 -83252 -75596 -28968 -30828 -36283 15157 -82455 -54351 83718
3348H3718J06186l5320k1j08733q430P8958q9907j08540Q2559N4221J3907m5175
$$ 83718 189904 154584 154563 45830 37400 116358 26451 -82089 470 54691 68598 23423
3336B3423k6158P614J11952N2461j02453p6600Q3529Q1804M1701j21947Q56N1871
$$ 23423 -2735 4879 116831 169292 66839 -9761 73768 155572 197273 75326 76182 128053
3324A28053K1237m727J26743j13316k15661j00605L2047L125q674J22832R2212
$$ 128053 149290 144563 271306 157990 -57671 -158276 -126229 -123104 -131778 -8946 83266
3313H3266P6476n4375K8571k6249M4666K3774j50297p1873O2002o3171j03880
$$ 83266 159742 105367 133938 107689 152355 176129 25832 -46041 15961 -47210 -151090
3302a51090r0600P4997L5388L8560m924J9598j5064J35857L6796j9852k128N1982
$$ -151090 -241690 -166693 -131305 -92745 -97669 -78071 -93135 42722 79518 59666 57538 109520
3290A09520q4794p2468n4986j6296L7002R8263P5041k1904o9382j66043M3671
$$ 109520 24726 -47742 -102728 -119024 -82022 16241 91282 69378 -4 -166047 -122376
3279a22376Q7182J50859L6218R424k5063j0635l1641p9661l2425l9192l346O1852
$$ -122376 -35194 115665 151883 161307 136244 125609 93968 14307 -18118 -57310 -60656 1196
3267A196N1226j18674M1614Q6615J1252o8387J0299Q6861J2917j60294m747O9187
$$ 1196 52422 -66252 -24638 61977 73229 4842 15141 102002 114919 -45375 -50122 19065
3255A9065o5202j205N718K7913Q5617O798n0054J9835J18053l2017j36856j2376
$$ 19065 -46137 -47342 -41624 -13711 71906 78704 28650 48485 166538 134521 -2335 -14711
3243a4711l8274Q9162M1767r6688j27906K1792M4294J3494K3230k2778k1783J00979
$$ -14711 -52985 36177 77944 -18744 -146650 -124858 -80564 -67070 -43840 -66618 -88401 12578
3231A2578J5364Q113P963k7990n7213o8263m7628L8184l8428o5400J5863J41548
$$ 12578 27942 36055 44018 16028 -41185 -109448 -157076 -118892 -157320 -222720 -206857 -65309
3219f5309N6842J9602J0179r7174j24368k2134N907P1177O7349L7452o9302m4379
$$ -65309 -8467 11135 21314 -75860 -200228 -222362 -216455 -145278 -77929 -40477 -109779 -154158
3207a54158J954R8924m1158n6873Q8807J982J7636J44951l0097l4159M1930P1301
$$ -154158 -152204 -53280 -94438 -151311 -62504 -60522 -42886 102065 71968 37809 79739 151040
3195A51040j12217k224k7805n5023R8607N7709L8076j40974j4155K4691Q8050
$$ 151040 38823 36599 8794 -46229 52378 110087 148163 7189 -6966 17725 105775
3184A05775M7781q8287p1867M3904M3237j02891R5392J69435j53825k43039n5488
$$ 105775 153556 65269 -6598 37306 80543 -22348 73044 242479 88654 -154385 -209873
3173b09873R7922l0214R8251R7493L8673n7738r5375j12883L0565J05035P5183
$$ -209873 -111951 -142165 -43914 53579 92252 34514 -60861 -173744 -143179 -38144 37039
3162C7039q8796P6534J5556p5555m5560K8325R1510K1879r9668m5791Q3749N5553
$$ 37039 -51757 24777 40333 -35222 -80782 -52457 39053 60932 -38736 -84527 -778 54775
3150E4775l2139l711J6903l5916n8877q448l5487Q2798L0333P8313j11035J4250
$$ 54775 22636 18925 35828 -88 -58965 -67413 -102900 -20102 10231 88544 -22491 -8241
3138h241O766K8776R9313j4922o7837l8281o0386J8372N8270O0070J1572r4385
$$ -8241 -1475 27301 126614 111692 43855 5574 -54812 -36440 21830 81900 93472 -913
3126i13k3178j6886q0814O625P6577n308l0593N045P055Q916K18357J14703p9902
$$ -913 -24091 -40977 -121791 -115166 -38589 -43897 -74490 -69445 -62390 -53474 164883 279586 199684
3113A99684n6460Q2634j5227p8147r0249k1147m0611K4169j4835l564K2837L2399
$$ 199684 143224 225858 210631 132484 42235 21088 -19523 4646 -10189 -13753 9084 41483
3101D1483N6383K3242k4533q5393l2288p8520L4488J1223K8036k2009k9275l0388
$$ 41483 97866 121108 96575 11182 -21106 -99626 -65138 -53915 -25879 -47888 -77163 -107551
3089a07551J11883J21649m1150M5028K0431j23439o6754N0884j0844L3807J6835
$$ -107551 4332 125981 84831 129859 150290 26851 -39903 10981 137 33944 50779
$$ [...]
##END NTUPLES=NMR SPECTRUM
##END=
