##TITLE=Analysis number 325635
Compound Code btb 07485
Book Reference 48524
Project Code adrs fraglib
Chemist Name jom
##JCAMPDX= 6.0         $$ Bruker NMR JCAMP-DX V2.0
##DATA TYPE= NMR SPECTRUM
##DATA CLASS= NTUPLES
##ORIGIN= Bruker BioSpin GmbH
##OWNER= nmr
$$ XWIN-NMR		Version 3.5
$$ Fri Jan  5 13:52:24 2007 GMT Standard Time (UT+0h)  MAYBRIDGE\nmr@NMR_250MHZ
##.OBSERVE FREQUENCY= 250.131544655141
##.OBSERVE NUCLEUS= ^1H
##.ACQUISITION MODE= SIMULTANEOUS (DQD)
##.ACQUISITION SCHEME= undefined
##.AVERAGES= 16
##.DIGITISER RES= 18
##SPECTROMETER/DATA SYSTEM= dpx250
##.PULSE SEQUENCE= zg30
##.SOLVENT NAME= DMSO
##.SHIFT REFERENCE= (INTERNAL, DMSO, 0, 16.522)
##AUDIT TRAIL= $$ (NUMBER, WHEN, WHO, WHERE, WHAT)
$$ ##TITLE= Audit trail, XWIN-NMR		Version 3.5
$$ ##JCAMPDX= 5.01
$$ ##ORIGIN= Bruker BioSpin GmbH
$$ ##OWNER= nmr
$$ C:\u/data/dgb/nmr/ADRS/510/pdata/1/auditp.txt
$$ ##AUDIT TRAIL=  $$ (NUMBER, WHEN, WHO, WHERE, WHAT)
(   1,<2007-01-05 13:52:04.54 +000>,<MAYBRIDGE\nmr>,<NMR_250MHZ>,
      <created by zg, POWCHK disabled, PULCHK disabled
       configuration hash MD5:
       49 4B E0 1D 92 C2 6B 37 9F E6 65 BC 52 41 86 1D
       data hash MD5: 64K
       95 00 EB 98 FC 30 94 A6 45 E4 4A 16 E4 0C CA 28>)
(   2,<2007-01-05 13:52:16.07 +000>,<MAYBRIDGE\nmr>,<NMR_250MHZ>,
      <Start of raw data processing
       ef LB = 0.3 FT_mod = 6 PKNL = 1 SI = 32K 
       data hash MD5: 32K
       A8 89 94 7C FB BC 57 A6 7B 87 4D 16 4D 30 A6 0B>)
(   3,<2007-01-05 13:52:17.76 +000>,<MAYBRIDGE\nmr>,<NMR_250MHZ>,
      <apk 
       data hash MD5: 32K
       73 61 39 70 F9 95 41 DF 14 AC 8D 0A B5 0B A9 92>)
(   4,<2007-01-05 13:52:18.48 +000>,<MAYBRIDGE\nmr>,<NMR_250MHZ>,
      <abs ABSG = 5 
       data hash MD5: 32K
       04 52 86 C8 D7 18 04 98 E8 EF 28 61 85 50 04 93>)
$$ ##END=
$$ 
$$ hash MD5
$$ FE E5 48 66 75 37 1D AF DC 2E DE AD 34 CA 9F 2E
##$RELAX= 
##$RELAX= 
##$RELAX= 
##$RELAX= 
##$RELAX= 
##$RELAX= 
##$RELAX= 
$$ Bruker specific parameters
$$ --------------------------
##$DU= <C:\u>
##$EXPNO= 510
##$NAME= <ADRS>
##$PROCNO= 1
##$TYPE= <nmr>
##$USER= <dgb>
##$AMP= (0..31)
100 100 100 100 100 100 100 100 100 100 100 100 100 100 100 100 100 100 
100 100 100 100 100 100 100 100 100 100 100 100 100 100 
##$AQSEQ= 0
##$AQ_mod= 3
##$AUNM= <au_zg>
##$AUTOPOS= <51 >
##$BF1= 250.13
##$BF2= 250.13
##$BF3= 250.13
##$BF4= 250.13
##$BF5= 500.13
##$BF6= 500.13
##$BF7= 500.13
##$BF8= 500.13
##$BYTORDA= 1
##$CFDGTYP= 0
##$CFRGTYP= 5
##$CHEMSTR= <none>
##$CNST= (0..31)
1 1 145 1 1 1 1 1 1 1 1 1 1 1 1 1 1 1 1 1 1 1 1 1 1 1 1 1 1 1 1 1 
##$CPDPRG= <>
##$CPDPRG1= <>
##$CPDPRG2= <>
##$CPDPRG3= <>
##$CPDPRG4= <mlev>
##$CPDPRG5= <mlev>
##$CPDPRG6= <mlev>
##$CPDPRG7= <mlev>
##$CPDPRG8= <mlev>
##$CPDPRGB= <>
##$CPDPRGT= <>
##$D= (0..31)
0 1 0 0 0 0 0 0 0 0.06 0 0 0 0 0 0 0.0002 0 0 0 0 0 0 0 0 0 0 0 0 0 0 
0 
##$DATE= 1168005123
##$DBL= (0..7)
120 120 120 120 120 120 120 120 
##$DBP= (0..7)
150 150 150 150 150 150 150 150 
##$DBP07= 0
##$DBPNAM0= <>
##$DBPNAM1= <>
$$ [...]
##$SUBNAM7= <"">
##$SUBNAM8= <"">
##$SUBNAM9= <"">
##$SW= 20.6930455092707
##$SWIBOX= (0..15)
0 0 3 0 0 0 0 0 0 0 0 0 0 0 0 0 
##$SW_h= 5175.983436853
##$TD= 65536
##$TD0= 1
##$TE= 294.16
##$TE2= 300
##$TE3= 300
##$TEG= 300
##$TL= (0..7)
0 120 120 120 120 120 120 120 
##$TP= (0..7)
150 150 150 150 150 150 150 150 
##$TP07= 0
##$TPNAME0= <>
##$TPNAME1= <>
##$TPNAME2= <>
##$TPNAME3= <>
##$TPNAME4= <>
##$TPNAME5= <>
##$TPNAME6= <>
##$TPNAME7= <>
##$TPOAL= (0..7)
0.5 0.5 0.5 0.5 0.5 0.5 0.5 0.5 
##$TPOFFS= (0..7)
0 0 0 0 0 0 0 0 
##$TUNHIN= 0
##$TUNHOUT= 0
##$TUNXOUT= 0
##$USERA1= <user>
##$USERA2= <user>
##$USERA3= <user>
##$USERA4= <user>
##$USERA5= <user>
##$V9= 5
##$VALIST= <valist>
##$VCLIST= <CCCCCCCCCCCCCCC>
##$VD= 0
##$VDLIST= <DDDDDDDDDDDDDDD>
##$VPLIST= <PPPPPPPPPPPPPPP>
##$VTLIST= <TTTTTTTTTTTTTTT>
##$WBST= 1024
##$WBSW= 4
##$XGAIN= (0..3)
0 0 0 0 
##$XL= 0
##$YL= 0
##$YMAX_a= 407510
##$YMIN_a= -443503
##$ZGOPTNS= <>
##$ZL1= 120
##$ZL2= 120
##$ZL3= 120
##$ZL4= 120
##$ABSF1= 16.522
##$ABSF2= -4.171173
##$ABSG= 5
##$ABSL= 3
##$ALPHA= 0
##$AQORDER= 0
##$ASSFAC= 0
##$ASSFACI= 0
##$ASSFACX= 0
##$ASSWID= 0
##$AUNMP= <proc_1d>
##$AZFE= 0.1
##$AZFW= 0.1
##$BCFW= 0
##$BC_mod= 0
##$BYTORDP= 0
##$COROFFS= 0
##$CY= 12.5
##$DATMOD= 1
##$DC= 0
##$DFILT= <>
##$DTYPP= 0
##$F1P= 14.0000005364418
##$F2P= -0.99999901652339
##$FCOR= 0.5
##$FTSIZE= 32768
##$FT_mod= 6
##$GAMMA= 0
##$GB= 0
##$INTBC= 1
##$INTSCL= 1
##$ISEN= 128
##$LB= 0.3
##$LEV0= 0
##$LPBIN= 0
##$MAXI= 10000
##$MC2= 0
##$MEAN= 0
##$ME_mod= 0
##$MI= 0
##$NCOEF= 0
##$NC_proc= -3
##$NLEV= 6
##$NOISF1= 0
##$NOISF2= 0
##$NSP= 0
##$NTH_PI= 0
##$NZP= 0
##$OFFSET= 16.522
##$PC= 1
##$PHC0= 211.3797
##$PHC1= 7.479506
##$PH_mod= 1
##$PKNL= yes
##$PPARMOD= 0
##$PSCAL= 4
##$PSIGN= 0
##$REVERSE= no
##$SF= 250.13
##$SI= 32768
##$SIGF1= 0
##$SIGF2= 0
##$SINO= 400
##$SIOLD= 32768
##$SREGLST= <1H.DMSO>
##$SSB= 0
##$STSI= 32768
##$STSR= 0
##$SW_p= 5175.98343685301
##$SYMM= 0
##$S_DEV= 0
##$TDeff= 65536
##$TDoff= 0
##$TI= <Analysis number 999999
Compound Code 99
Book Reference 9
Project Code 9>
##$TILT= no
##$TM1= 0
##$TM2= 0
##$TOPLEV= 0
##$USERP1= <user>
##$USERP2= <user>
##$USERP3= <user>
##$USERP4= <user>
##$USERP5= <user>
##$WDW= 1
##$XDIM= 32768
##$YMAX_p= 386152075
##$YMIN_p= -100980
$$ End of Bruker specific parameters
$$ ---------------------------------
##NTUPLES= NMR SPECTRUM
##VAR_NAME=  FREQUENCY,     SPECTRUM/REAL,   SPECTRUM/IMAG
##SYMBOL=    X,             R,               I
##VAR_TYPE=  INDEPENDENT,   DEPENDENT,       DEPENDENT
##VAR_FORM=  AFFN,          ASDF,            ASDF
##VAR_DIM=   32768,         32768,           32768
##UNITS=     HZ,            ARBITRARY UNITS, ARBITRARY UNITS
##FACTOR=    0.157963299565203, 1,           1
##FIRST=     4132.6476996994, 0,             0
##LAST=      -1043.33573715361, 0,           0
##MIN=       -1043.33573715361, -100980,     0
##MAX=       4132.6476996994, 386152075,     0
$$ Real data points
##PAGE= N=1
##DATA TABLE= (X++(R..R)), XYDATA
$$ [...]
$$ plain form
24658 3446 6991 -2941 -18139 -6504 5910 17957 39278 36787 11390 -2942 20873 39081
24646 39081 34297 9484 -12667 -27390 -18055 -15532 4907 -1168 -145 -6699 -32152 -15903 -33329
24633 -33329 -5312 16241 19865 9572 -9817 -16804 -4326 -6859 -37959 -24492 -485 4929
24621 4929 398 9606 20675 58940 57323 32410 34718 24832 42904 29148 3076 13483 28914
24608 28914 27520 25844 16952 9940 -19430 -8191 -17104 -19169 78 -11647 -19682 -14453 -19549
24595 -19549 -1878 14030 54302 59123 25645 -966 -30778 -32217 -29545 -14615 -12148 10
24583 10 9669 21462 25909 21528 2099 -21435 -31227 -16803 -14059 -11695 -32410 -28860 -7309 -11248
24569 -11248 -2090 -1665 14618 18182 -4965 -28565 -38220 -41100 -35757 -21246 -17901 -17716 -18765 1122
$$ packed form
24658C446L545r932j5198J1635J2414J2047K1321k491k5397j4332K3815J8208
24646C9081m784k4813k2151j4723R335K523K0439o075J023o554k5453J6249j7426
24633c3329K8017K1553L624j0293j9389o987J2478k533l1100J3467K4007N414
24621D929m531R208J1069L8265j617k4913K308r886J8072j3756k6072J0407J5431
24608B8914j394j676q892p012k9370J1239q913k065J9247j1725q035N229n096
24595a9549J7671J5908M0272M821l3478k6611k9812j439K672J4930K467J2158
24583A0R659J1793M447m381j9429k3534r792J4424K744K364k0715L550K1551l939
24569a1248R158M25J6283L564k3147k3600r655k880N343J4511L345J85j049J9887
$$ plain form
24555 1122 -2682 -24105 -40693 -65065 -38175 -1536 14941 14528 5933 8299 10369 1671 3753
24542 3753 -6947 -33219 -7885 10266 -17843 -17470 -12178 -22015 -18758 -24160 -12013 -55110 -54721
24529 -54721 -35815 -23004 -10325 15148 21724 15884 5877 -17996 -25812 -6156 1762 -21721
24517 -21721 -41899 -12752 13131 14594 20502 40463 18806 304 5791 7742 -24997 -53390
24505 -53390 -48603 -22436 -28993 -24251 -12419 -14163 -18928 -13403 -9986 9370 2139 -2283 -19774
24492 -19774 -8471 -18091 -29076 -32600 -17664 -5960 17887 21561 27206 16828 679 -15421
24480 -15421 2668 18068 -680 -11719 -14513 924 7228 -3992 8437 12704 20006 5418
24468 5418 -10711 -12999 -13884 -18726 -26912 -33391 -27506 -10412 -8779 35064 58730 57302 33156 26306
$$ packed form
24555A122l804k1423j6588k4372K6890L6639J6477m13q595K366K070q698K082
24542C753j0700k6272K5334J8151k8109L73N292r837L257n402J2147m3097L89
24529e4721J8906J2811J2679K5473O576n840j0007k3873p816J9656P918k3483
24517b1721k0178K9147K5883J463N908J9961k1657j8502N487J951l2739k8393
24505e3390M787K6167o557M742J1832j744m765N525L417J9356p231m422j7491
24492a9774J1303r620j0985l524J4936J1704K3847L674N645j0378j6149j6100
24480a5421J8089J5400j8748j1039k794J5437O304j1220J2429M267P302j4588
24468E418j6129k288q85m842q186o479N885J7094J633M3843K3666j428k4146o850
$$ plain form
24454 26306 42055 20660 2579 -7506 -10448 -1001 6139 16800 20173 26797 32803 31480 27478
24441 27478 38116 29330 15131 14999 26733 23654 15950 8231 -1715 -5721 -3732 442 -25278 -43681
24427 -43681 -37350 -32027 -14162 -23146 -15475 -6033 -7790 -15744 -6312 21976 28192 12113 -2999
24414 -2999 -23625 -46672 -49678 -58087 -48928 -46188 -41372 -30109 -12016 -10257 1255 20308 7084
24401 7084 -708 -11546 -27480 -20926 -43845 -49528 -27254 -15889 -29601 -15612 1320 -1736 -7757
24388 -7757 -13717 -22494 -6587 -8960 -12163 -5778 -8221 -25838 -16780 798 -7631 -7812 14414 51522
24374 51522 39428 29760 30817 26315 32315 41302 4089 9885 -10546 -33613 -23042 -1319 10240
24361 10240 12588 26440 545 -8663 12368 28541 14702 12800 6175 -12755 -15894 -141 24533
$$ packed form
24454B6306J5749k1395j8081j0085k942R447P140J0661L373O624O006j323m002
24441B7478J0638q786j4199j32J1734l079p704p719r946m006J989M174k5720j8403
24427d3681O331N323J7865q984P671R442j757p954R432K8288O216j6079j5112
24414b999k0626k3047l006q409R159K740M816J1263J8093J759J1512J9053j3224
24401G084p792j0838j5934O554k2919n683K2274J1365j3712J3989J6932l056o021
24388g757n960q777J5907k373l203O385k443j7617R058J7578q429j81K2226L7108
24374E1522j2094r668J057m502O000Q987l7213N796k0431k3067J0571K1723J1559
24361A0240K348J3852k5895r208K1031J6173j3839j902o625j8930l139J5753K4674
$$ plain form
24348 24533 11219 -378 14684 13837 5450 8027 -15316 -24900 -7903 4721 4196 16390 15631
24335 15631 2319 -22182 30443 56514 46182 25749 10894 14941 29386 12402 -13018 -15893
24323 -15893 -23564 -22566 -14995 -7378 -23436 -43095 -28782 -25630 -10869 -10877 -32938 -18867 -11189 -25887
24309 -25887 -42348 -37801 -18670 -23321 -21531 -2597 -19168 -26210 -12978 -14272 -22211 -31465 -47357
24296 -47357 -46130 -34299 -33381 -12487 -4307 -12543 -37979 -30452 -33613 -19833 -9973 -21019 -8236
24283 -8236 31228 33770 17283 14834 14964 -5784 -12250 -20771 -3681 -10024 -24990 -29597 -15177
24270 -15177 -9665 155 -3904 -15435 -37549 -35183 -26149 -14677 -11509 -7810 5640 -12172 -24311
24257 -24311 2453 14768 38374 48621 18031 20147 52022 39088 -36 -14680 -36231 -29522
$$ packed form
24348B4533j3314j1597J5062q47q387K577k3343r584J6997J2624n25J2194p59
24335A5631j3312k4501N2625K6071j0332k0433j4855M047J4445j6984k5420k875
24323a5893p671R98P571P617j6058j9659J4313L152J4761qk2061J4071P678j4698
24309b5887j6461M547J9131m651J790J8934j6571p042J3232j294p939r254j5892
24296d7357J227J1831R18K0894Q180q236k5436P527l161J3780R860j1046J2783
24283h236L9464K542j6487k449J30k0748o466q521J7090o343j4966m607J4420
24270a5177N512R820m059j1531k2114K366R034J1472L168L699J3450j7812j2139
24257b4311K6764J2315K3606J0247l0590K116L1875j2934l9124j4644k1551O709
$$ plain form
24245 -29522 -11668 -15181 -45858 -56900 -43519 6189 41654 19747 12631 9078 -6143 -2164
24233 -2164 -1816 -906 -3644 6384 3230 -4588 -6290 -48945 -56944 -15209 29195 33374 25538 4472
24219 4472 -41916 -50918 -33906 -28597 3532 25648 23689 15533 21506 33660 21275 12875 28096
24206 28096 15253 355 5953 34756 38352 20017 2624 5506 14956 29181 59996 60871 43343
24193 43343 18317 39040 36520 5859 16624 35094 19262 6792 11477 3265 -17842 -1211
24181 -1211 -1116 3797 -7860 4399 4218 4348 8227 8031 -4399 -25631 685 19883 15764 14238
24167 14238 6801 -24516 -24728 -19513 2283 27455 16184 14275 7096 -7384 15602 46852 33666
24154 33666 21179 9580 9025 -1106 -12814 -14303 -1033 3557 17119 4254 9353 13451 26440
$$ packed form
24245b9522J7854l513l0677j1042J3381M9708L5465k1907p116l553j5221L979
24233b164L48R10k738J0028l154p818j702m2655p999M1735M4404M179p836k1066
24219D472m6388r002J7012N309L2129K2116j959q156N973J2154j2385q400J5221
24206B8096j2843j4898N598K8803L596j8335j7393K882R450J4225L0815Q75j7528
24193D3343k5026K0723k520l0661J0765J8470j5832j2470M685q212k1107J6631
24181a211R5M913j1657J2259j81J30L879j96j2430k1232K6316J9198m119j526
24167A4238p437l1317k12N215K1796K5172j1271j909p179j4480K2986L1250j3186
24154C3666j2487j1599n55j0131j1708j489J3270M590J3562j2865N099M098J2989
$$ plain form
24141 26440 17133 -1269 13143 14264 -19282 -17855 -4664 5764 16926 20647 8887 -874 469
24128 469 -477 -12611 -20071 -11936 -17586 -27380 -9541 -19797 -28174 -23500 -15196 31204 29831 5909
24114 5909 -6499 -15973 -23201 -7318 -2041 -6828 -19762 -33468 -40357 -39802 -18132 16587 31751
24101 31751 17061 18904 13541 -5989 -28569 -5827 10739 -14423 -53979 -46735 -33394 -29409
24089 -29409 2901 10243 -6593 -14932 13591 21278 20124 5472 3761 -7469 -22651 -3288 4543
24076 4543 -5247 -9234 -15243 -11972 -12636 -19840 -65838 -66298 -51085 -47854 -34402 -15845 -14371 -24274
24062 -24274 -17508 -315 6774 5237 2432 14787 32341 24187 6347 4548 16168 31203 34277
24049 34277 18613 16368 -2900 13288 15597 28552 36540 17842 -174 -7667 -14922 140 1117
$$ packed form
24141B6440r307j8402J4412J121l3546J427J3191J0428J1162L721j1760r761J343
24128D69r46j2134p460Q135n650r794J7839j0256q377M674Q304M6400j373k3922
24114E909j2408r474p228J5883N277m787j2934j3706o889N55K1670L4719J5164
24101C1751j4690J843n363j9530k2580K2742J6566k5162l9556P244J3341L985
24089b9409L2310P342j6836q339K8523P687j154j4652j711j1230j5182J9363P831
24076D543r790l987o009L271o64p204m5998m60J5213L231J3452J8557J474r903
24062b4274O766J7193P089j537k805J2355J7554q154j7840j799J1620J5035L074
24049C4277j5664k245j9268J6188K309J2955P988j8698j8016p493p255J5062R77
$$ plain form
24036 1117 -4124 -15541 -6656 27722 47616 43123 -15759 -14846 -36303 -40138 -23309 -39311 -53529
24023 -53529 -30018 -19351 -28647 -24246 -1373 32089 31725 24405 18714 22500 4448 -9444 -4813
24010 -4813 9688 6612 -11168 -24690 -36878 -40750 -26147 -29819 -37280 -29646 -21928 -15678 2237
23997 2237 -5108 -20671 -13509 -16604 16541 62410 47456 12875 -10338 -14744 -33225 -46308 -40840
23984 -40840 11194 31948 25515 11661 -17633 -35590 -11939 -29593 -15360 -19008 -40714 -17241
23972 -17241 19952 30216 27145 3875 -27683 -39167 -31692 -40435 -36639 -48519 -40883 -24104 -14599
23959 -14599 -12341 1641 40678 52586 18549 23187 21208 33624 33099 29401 27630 30525 33026
23946 33026 2607 -12287 -29337 -33181 -13943 5783 -6783 13994 16475 14373 15371 11508 4586
$$ packed form
24036A117n241j1417Q885L4378J9894m493n8882R13k1457l835J6829j6002j4218
24023e3529K3511J0667r296M401K2873L3462l64p320n691L786j8052j3892M631
24010d813J4501l076j7780j3522j2188l872J4603l672p461P634P718O250J7915
23997B237p345j5563P162l095L3145M5869j4954l4581k3213m406j8481j3083N468
23984d0840N2034K0754o433j3854k9294j7957K3651j7654J4233l648k1706K3473
23972a7241L7193J0264l071k3270l1558j1484P475q743L796j1880P636J6779R505
23959a4599K258J3982L9037J1908l4037M638j979J2416n25l698j771K895K501
23946C3026l0419j4894j7050l844J9238J9726j2566K0777K481k102R98l863o922
$$ plain form
23933 4586 -6493 -5647 11850 -20846 -51380 -15760 13242 4152 -1178 12243 8773 2173 13174
23920 13174 11116 903 -3692 -7422 10788 6827 -15721 -8378 -3755 15703 22632 12370 614
23907 614 30590 38995 39345 28931 25645 9103 8514 45607 26676 -351 -8328 -18823 10598
23894 10598 18107 4343 19984 8196 -17739 -34778 -41887 -47921 -41644 -31456 -29968 -4338 21230
23881 21230 17236 -1572 -4563 -21514 -22005 -38755 -25022 15744 14331 13184 -138 -13320 4991
23868 4991 -22152 -25082 -11578 -3733 -25534 -45166 -52345 -33722 -23992 -15333 17747 9934 -16015
23855 -16015 -2663 20188 13468 11506 7500 16802 18968 20298 -8582 -20059 -26630 -40102 -27201
23842 -27201 -15839 -3907 9314 -292 -15481 -10733 4300 26207 29352 -6407 -24579 -10294
$$ packed form
23933D586j1079Q46J7497l2696l0534L5620K9002r090n330J3421l470o600J1001
23920A3174k058j0213m595l730J8210l961k2548P343M623J9458O929j0262j1756
23907F14K9976Q405L50j0414l286j6542n89L7093j8931k7027p977j0495K9421
23894A0598P509j3764J5641j1788k5935j7039p109o034O277J0188J488K5630K5568
23881B1230l994j8808k991j6951m91j6750J3733M0766j413j147j3322j3182J8311
23868D991k7143k930J3504P845k1801j9632p179J8623R730Q659L3080p813k5949
23855a6015J3352K2851o720j962m006R302K166J330k8880j1477o571j3472J2901
23842b7201J1362J1932J3221r606j5189M748J5033K1907L145l5759j8172J4285
$$ plain form
23830 -10294 13890 44679 21295 9328 19914 26235 23327 4892 -16164 -15501 -2206 8786
23818 8786 15055 39102 8251 -21728 -14022 -21844 -5589 21528 -5055 -19241 -20073 -25994 -21500
23805 -21500 -5520 -8256 -17418 -19826 -3999 23150 18315 5253 17468 772 -2617 -38533 -34920
23792 -34920 727 14843 17756 29501 46492 41637 18480 19946 24088 17381 16038 -15317 -51578
23779 -51578 -38317 -26236 -908 -4829 7196 9790 20754 8569 -13368 -9864 -21647 -38435
23767 -38435 -45144 -28899 -4237 17621 22256 11598 3603 -1301 -6860 -5796 -3493 -15143 -7251
23754 -7251 17468 19776 -1132 -2013 13656 -4821 -13871 -10248 2720 19773 17414 22966 19229
23741 19229 -8938 -15361 -619 7552 28403 26009 22557 13954 1829 -12483 -9025 -7296 -2234
$$ packed form
23830a0294K4184L0789k3384j1967J0586O321k908j8435k1056O63J3295J0992
23818H786O269K4047l0851k9979P706p822J6255K7117k6583j4186q32n921M494
23805b1500J5980k736r162k408J5827K7149m835j3062J2215j6696l389l5916L613
23792c4920L5647J4116K913J1745J6991m855k3157J466M142o707j343l1355l6261
23779e1578J3261J2081K5328l921J2025K594J0964j2185k1937L504j1783j6788
23767c8435o709J6245K4662K1858M635j0658p995m904n559J064K303j1650P892
23754g251K4719K308k0908q81J5669j8477r050L623J2968J7053k359N552l737
23741A9229k8167o423J4742Q171K0851k394l452q603j2125j4312L458J729N062
$$ plain form
23728 -2234 85 3339 11197 42367 42661 49675 62963 40254 33605 27356 16490 -335 -11860
23715 -11860 -9360 -34368 -47217 -22089 -2282 10696 20795 2503 -23792 -9105 -7020 -4081
23703 -4081 -24029 -37627 -11174 16008 29675 40215 47376 33764 29657 20459 24094 7414 9389
23690 9389 -3517 -10462 -11248 -3012 15140 15661 6136 -2062 10392 2866 -1511 -50695 -43793 -10506
23676 -10506 -13115 -28560 -29751 -33795 -43807 -46090 -6617 13690 17473 10370 -4061 -10239 -18263
23663 -18263 -7282 -29639 -44223 -18417 8468 1301 24293 41975 39736 21378 17436 18435 11562
23650 11562 -13015 -27297 -22004 -29965 -25254 -53855 -28193 -26279 -52541 -49726 -50208 -29287 -12199
23637 -12199 -23334 -27170 -20504 -4393 -37335 -29502 -24047 -23061 -9426 -7785 7416 13406 -10668
$$ packed form
23728b234K319L254P858L1170K94P014J3288k2709o649o249j0866j6825j1525
23715a1860K500k5008j2849K5128J9807J2978J0099j8292k6295J4687K085K939
23703d081j9948j3598K6453K7182J3667J0540P161j3612m107r198L635j6680J975
23690I389j2906o945p86Q236J8152N21r525q198J2454p526m377m9184O902L3287
23676a0506k609j5445j191m044j0012k283L9473K0307L783p103j4431o178q024
23663a8263J0981k2357j4584K5806K6885p167K2992J7682k239j8358l942R99o873
23650A1562k4577j4282N293p961M711k8601K5662J914k6262K815m82K0921J7088
23637a2199j1135l836O666J6111l2942P833N455R86J3635J641J5201N990k4074
$$ plain form
23624 -10668 -15800 7978 4026 -29249 -39200 -28442 -9918 -1027 286 17042 19652 -17891 -14869
23611 -14869 4870 -16014 -38667 -40885 -1418 3680 -5889 -2661 16637 28793 5513 -6772
23599 -6772 1500 20142 36481 30476 18399 1041 -23051 -15657 -19914 -21170 -23828 -33767 -49364
23586 -49364 -57349 -38902 -2615 -9475 22453 29702 49913 54408 39164 16586 7028 32221 48359
23573 48359 40775 45625 12057 -38468 -57957 -49311 -23579 -22679 -24252 4350 -22593 -37135 -33127
23560 -33127 -30995 -26560 -29377 -46488 -57616 -45840 -39038 -15452 -11360 9438 23826 21420 15782
23547 15782 3127 7431 4980 -15871 -20226 -3189 -5921 -6609 2137 1696 -1319 15967 26933 27988
23533 27988 1267 3953 23709 40284 4595 -45579 -15348 20162 18330 -18235 -23033 -28346
$$ packed form
23624a0668n132K3778l952l3275r951J0758J8524Q891J313J6756K610l7543L022
23611a4869J9739k0884k2653k218L9467N098r569L228J9298J2156k3280j2285
23599f772Q272J8642J6339o005j2077j7358k4092P394m257j256k658r939j5597
23586d9364p985J8447L6287o860L1928P249K0211M495j5244k2578r558K5193J6138
23573D8359p584M850l3568n0525j9489Q646K5732R00j573K8602k6943j4542M008
23560c3127K132M435k817j7111j1128J1776O802K3586M092K0798J4388k406n638
23547A5782j2655M304k451k0851m355J7037k732o88Q746m41l015J7286J0966J055
23533B7988k6721K686J9756J6575l5689n0174L0231L5510j832l6565m798n313
$$ plain form
23521 -28346 -38103 -20355 -6240 24986 13831 2564 16600 32638 24292 36111 38514 29732
23509 29732 9464 10580 15237 21701 -11911 -10372 -18104 -36277 -24173 -28443 -37740 -19348 -27687
23496 -27687 -38605 -57258 -58203 -21050 4869 18850 35767 20684 6579 7678 30392 40499
23484 40499 32755 -22268 -58176 -50040 -46744 -66267 -61883 -36315 5202 7170 -9536 -5752 19979
23471 19979 39949 38373 -10497 -31304 -32219 -6277 3735 11131 5795 18203 52357 55119 19190
23458 19190 9785 1202 4619 -9182 -22053 -35035 -36067 -32205 -9564 28338 17294 2610 8101
23445 8101 17880 -4102 -6340 10262 29169 -10146 -23300 -27492 -18751 -18408 -5916 -6386 -11285 -13321
23431 -13321 -10238 -10171 -21091 -6137 2123 17510 23238 27764 30161 17830 14934 4795 -6611
$$ packed form
23521b8346r757J7748J4115L1226j1155j1267J4036J6038q346J1819K403q782
23509B9732k0268J116M657O464l3612J539p732j8173J2104m270r297J8392q339
23496b7687j0918j8653r45L7153K5919J3981J6917j5083j4105J099K2714J0107
23484D0499p744n5023l5908Q136L296j9523M384K5568M1517J968j6706L784K5731
23471A9979J9970j576m8870k0807r15K5942J0012P396n336J2408L4154K762l5929
23458A9190r405q583L417j3801j2871j2982j032L862K2641L7902j1044j4684N491
23445H101R779k1982k238J6602J8907l9315j3154m192Q741L43J2492m70m899k036
23431a3321L083O7j0920J4954Q260J5387N728M526K397j2331k896j0139j1406
$$ plain form
23418 -6611 -7808 -13736 -22224 -23760 -14713 -22843 -35834 -33658 -23423 -3957 -4087 -16739 -17735 -4981
23404 -4981 -11683 -24900 -19827 -25961 -40587 -21651 -13934 -4721 7599 -15952 -7262 -15811 -7093
23391 -7093 -13220 -10748 -13653 -17786 -9168 -6581 8890 20944 21673 15369 24661 27032 15983 30788
23377 30788 41757 48214 66156 55014 40325 12291 -8865 -74 -5491 8651 -641 5713 13435
23364 13435 -5454 -14313 -10118 -12388 -17842 -41025 -33246 -561 -9198 -27428 -37964 -33901 -28073
23351 -28073 -17245 -15083 7126 19424 20760 4564 4891 -1331 -15478 -382 -1943 -10341 -17138
23338 -17138 -14658 11112 21476 10225 34449 37374 7011 -7553 4797 6175 -23498 -26985
23326 -26985 17756 47567 29705 562 -9551 -17630 -10309 -913 14216 6723 6969 21675 11291
$$ packed form
23418f611j197n928q488j536R047q130j2991K176J0235J9466j30j2652r96J2754
23404d981o702j3217N073o134j4626J8936P717R213J2320k3551Q690q549Q718
23391g093o127K472k905m133Q618K587J5471J2054P29o304R292K371j1049J4805
23377C0788J0969O457J7942j1142j4689k8034k1156Q791n417J4142r292O354P722
23364A3435j8889q859M195k270n454k3183P779L2685q637j8230j0536M063N828
23351b8073J0828K162K2209J2298J336j6196L27o222j4147J5096j561q398o797
23338a7138K480K5770J0364j1251K4224K925l0363j4564J2350J378k9673l487
23326b6985M4741K9811j7862k9143j0113q079P321R396J5129p493K46J4706j0384
$$ plain form
23313 11291 -16647 -10069 -6007 -22656 -34406 -52208 -37282 -19927 -6225 -7840 -25736 -34821
23301 -34821 -6800 1214 -10728 -23539 -4520 9180 10522 5824 -11643 -11987 -15517 -25373 -12049
23288 -12049 938 -9199 -31916 -3748 24088 40212 28091 27352 11645 -231 -1506 2380
23276 2380 -6758 13581 20505 21068 38078 14510 13322 11406 29382 18500 -2412 6420 36065
23263 36065 25337 23943 5992 -45 -27035 -24318 -9075 3556 16842 27454 54959 49467
23251 49467 62817 26455 -6752 -28025 -30933 -10467 -6691 17377 45039 15804 -33092 -44626
23239 -44626 -9583 -16544 -5984 -2295 -29971 -45990 -51236 -21106 -20095 -30227 -41630 -56207
23227 -56207 -58892 -60329 -60168 -49191 -31095 -23759 -25886 -18569 -34467 -39126 -18062 17354 27964
$$ packed form
23313A1291k7938O578M062j6649j1750j7802J4926J7355J3702j615j7896r085
23301c4821K8021Q014j1942j2811J9019J3700J342m698j7467l44l530r856J3324
23288a2049J2987j0137k2717K8168K7836J6124j2121p39j5707j1876j275L886
23276B380r138K0339O924N63J7010k3568j188j916J7976j0882k0912Q832K9645
23263C6065j0728j394j7951o037k6990K717J5243J2631J3286J0612K7505n492
23251D9467J3350l6362l3207k1273k908K0466L776K4068K7662k9235m8896j1534
23239d4626L5043o961J0560L689k7676j6019n246L0130J011j0132j1403j4577
23227e6207k685j437J61J0977J8096P336k127P317j5898m659K1064L5416J0610
$$ plain form
23214 27964 7346 -35108 -33663 -14566 11616 8970 -11401 1469 37253 51023 44673 29553
23202 29553 9343 12766 4600 -316 6432 1684 -9735 -22997 -26983 -30186 -42453 -51518 -39104
23189 -39104 -14567 -26006 -39484 -36737 -34484 -19462 -11746 -39388 -71049 -72735 -44894 -28920
23177 -28920 3617 34096 30360 40819 49730 48200 30979 11418 48 -7027 -16310 -11521 28080
23164 28080 18184 -9852 4896 -13770 -41574 -17883 -3628 -27569 -42879 -43708 -28482 -48984
23152 -48984 -66095 -66777 -38233 -28870 -14262 -11520 9342 -3297 -3446 14335 -4624 3955 2041
23139 2041 7106 9419 -189 -2562 -8845 -3085 -14260 -16317 -22594 -42671 -53241 -28714 -14770
23126 -14770 -29887 -48948 -45934 -15298 -12555 26910 46589 42302 41131 43223 28785 17128 -13405
$$ packed form
23214B7964k0618m2454J445J9097K6182k646k0371J2870L5784J3770o350j5120
23202B9553k0210L423q166m916O748m748j1419j3262l986l203j2267r065J2414
23189c9104K4537j1439j3478K747K253J5022P716k7642l1661j686K7841J5974
23177b8920L2537L0479l736J0459Q911j530j7221j9561j1370p075r283M789L9601
23164B8080r896k8036J4748j8666k7804K3691J4255k3941j5310q29J5226k0502
23152d8984j7111o82K8544R363J4608K742K0862j2639j49J7781j8959Q579j914
23139B041N065K313r608k373o283N760j1175k057o277k0077j0570K4527J3944
23126a4770j5117j9061L014L0636K743L9465J9679m287j171K092j4438j1657l0533
$$ plain form
23113 -13405 -14409 7520 14560 17218 18438 35893 39598 44365 46643 34872 39786 16720 22959
23100 22959 31684 19440 35717 18007 780 -470 -13728 -5973 18708 24858 21621 -8983 -15456
23087 -15456 -17874 -19182 -21277 -8536 9561 -9233 -24622 -37026 -37561 -22077 -21037 -39243 -52312
23074 -52312 -13117 26393 28217 -459 -40527 -44674 -25876 -22795 18162 44902 13539 -2939
23062 -2939 -12701 -11732 -17997 -36724 -23993 -1754 -15019 -13492 11543 29261 25534 -3998 -9488
23049 -9488 -7408 -23215 -3895 3447 -19647 -33337 -31122 -26683 -44024 -19803 -25223 -18351 -13751
23036 -13751 4677 8751 19926 -12803 -17855 -702 3424 -35454 -53264 -67096 -50346 -47241
23024 -47241 -26441 -5566 -3517 358 -22893 -17667 -14171 -31034 -24340 -26878 -26464 -34200 -16755
$$ packed form
23113a3405j004K1929P040K658J220J7455L705M767K278j1771M914k3066O239
23100B2959Q725j2244J6277j7710j7227j250j3258P755K4681O150l237l0604o473
23087a5456k418j308k095J2741J8097j8794j5389j2404n35J5484J040j8206j3069
23074e2312L9195L9510J824k8676m0068m147J8798L081M0957K6740l1363j6478
23062b939r762R69o265j8727J2731K2239j3265J527K5035J7718l727k9532n490
23049i488K080j5807J9320P342k3094j3690K215M439j7341K4221n420O872M600
23036a3751J8428M074J1175l2729n052J7153M126l8878j7810j3832J6750L105
23024d7241K0800K0875K049L875k3251N226L496j6863O694k538M14p736J7445
$$ plain form
23011 -16755 -14878 15828 47790 34121 10506 -12376 -7912 -7063 -17037 -21254 -21654 -8709 -7652
22998 -7652 -670 -5645 -2919 3580 -9878 7127 13335 19447 15183 2327 3920 19385 6474
22985 6474 -14237 -6950 -27395 -46624 -45758 -49627 -53473 -50267 -59937 -72017 -40252 -2217 7140
22972 7140 -2773 -9760 -3705 -564 8012 -2547 -24844 -48279 -50249 -9718 1730 -16211 -17432
22959 -17432 -4412 18294 21028 13618 14001 9161 -17726 -43676 -57311 -37065 -31830 -40620 -41176
22946 -41176 -4200 7115 -687 18411 39807 41735 1889 -14246 2135 20826 20420 -6635
22934 -6635 -31661 -27991 -12313 -6721 1162 268 2918 -12731 -17173 -20014 -17214 -19121 -6636 4862
22920 4862 7870 46152 28854 -12044 -10749 10183 -4630 -12770 17811 -1458 1498 26269 15302
$$ packed form
23011a6755J877L0706L1962j3669k3615k2882M464Q49r974m217m00J2945J057
22998g652O982m975K726O499j3458J7005O208O112m264j2856J593J5465j2911
22985F474k0711P287k0445j9229Q66l869l846L206r670j2080L1765L8035R357
22972G140r913o987O055L141Q576j0559k2297k3435j970M0531J1448j7941j221
22959a7432J3020K2706K734p410L83m840k6887k5950j3635K0246N235q790n56
22946d1176L6976J1315p802J9098K1396J928l9846j6135J6381J8691m06k7055
22934f635k5026L670J5678N592P883q94K650j5649m442k841K800j907J2485J1498
22920D862L008L8282j7298m0898J295K0932j4813q140L0581j9269K956K4771j0967
$$ plain form
22907 15302 9926 -13164 -10491 -17233 -43532 -50577 -41977 -44510 -62863 -33619 -33212 -28082 -18920 -20265
22893 -20265 -26244 -52556 -41833 -10698 -10981 9787 -4282 -19527 185 19281 43640 34343
22881 34343 28766 -93 -8119 -992 7107 30948 25615 7569 313 -2711 -22960 -30576 -26396
22868 -26396 -32491 -11458 -16132 -45445 -48676 -40058 -26156 -8702 -14096 -23842 -21597 -7732 -5449
22855 -5449 26190 5422 -31096 -47168 -46903 -16464 1627 -22556 -43309 -18919 -27398 -31483 -37025
22842 -37025 -5976 -14545 -11713 -25504 -1883 18906 12086 -13511 -7001 11015 764 12055
22830 12055 10168 6746 -13539 -3951 -8008 -4953 -4030 -8341 20582 42092 23676 14410 13871 20260
22816 20260 8105 9743 16728 23128 2750 -19680 -30064 -26293 -42026 -30698 -34548 -23165 -21977
$$ packed form
22907A5302n376k3090K673o742k6299p045Q600k533j8353K9244M07N130R162j345
22893b0265n979k6312J0723L1135k83K0768j4069j5245J9712J9096K4359r297
22881C4343n577k8859q026P127Q099K3841n333j8046p256l024k0249p616M180
22868b6396o095K1033m674k9313l231Q618J3902J7454n394r746K245J3865K283
22855e449L1639k0768l6518j6072K65L0439J8091k4183k0753K4390q479m085n542
22842c7025L1049q569K832j3791K3621K0789o820k5597O510J8016j0251J1291
22830A2055j887l422k0285R588m057L055R23m311K8923K1510j8416r266n39O389
22816B0260j2155J638O985O400k0378k2430j0384L771j5733J1328l850J1383J188
$$ plain form
22803 -21977 5008 8486 20854 15652 19555 30849 19222 13196 3090 -8885 -8925 14294 33224
22790 33224 10070 10374 4283 6261 -520 -24212 -44547 -15198 28657 10853 16459 30565 28343
22777 28343 24314 20967 5162 2433 16979 17701 33265 23732 18894 31030 23640 25688 29736 20886
22763 20886 33925 32592 21312 17217 44316 33879 50928 80711 56333 19739 18531 25445
22751 25445 4417 -19151 -20469 -31143 -43271 -53635 -47846 -17625 -26203 -32479 -8360 17242
22739 17242 15623 16709 520 -12598 -8711 -22294 -22467 -9724 19988 38125 15396 -11681 -16549
22726 -16549 7216 11754 7163 11921 22324 25206 32080 41889 23301 9317 -1260 -7039 -92
22713 -92 -33875 -48506 -40903 -45052 -22181 -6253 -16796 -29977 -30915 -12757 10472 24661 27939
$$ packed form
22803b1977K6985L478J2368n202L903J1294j1627o026j0106j1975m0K3219J8930
22790C3224k3154L04o091J978o781k3692k0335K9349M3855j7804N606J4106k222
22777B8343m029l347j5805k729J4546P22J5564r533m838J2136p390K048M048q850
22763B0886J3039j333j1280m095K7099j0437J7049K9783k4378l6594j208O914
22751B5445k1028k3568j318j0674j2128j0364N789L0221q578o276K4119K5602
22739A7242j619J086j6189j3118L887j3583j73J2743K9712J8137k2729k7077m868
22726a6549K3765M538m591M758J0403K882O874R809j8588j3984j0577n779O947
22713i2l3783j4631P603m149K2871J5928j0543j3181r38J8158K3229J4189L278
$$ plain form
22700 27939 27533 162 7859 2168 9460 29038 32694 34653 13128 -17128 -32676 11248 16311
22687 16311 17036 42819 24007 526 -20236 -16314 -22479 -26249 -16735 -15039 8057 36939 37378
22674 37378 34739 22980 21445 22505 3898 -21875 -34317 -9603 2439 32291 33029 14897 -3089
22661 -3089 -18764 -29029 -41572 -8161 15091 -4811 -16307 -34373 -23958 4258 14084 -9936
22649 -9936 -27723 -36524 -21460 -29005 -23030 -19249 3525 24710 16346 -4901 -17442 -26659 -15133
22636 -15133 -473 5660 -7496 5329 10074 -16533 -28138 -48830 -32596 -7591 -13002 -22140
22624 -22140 -18863 -38352 -24791 -18092 -17507 -9360 -9286 -12797 -9722 8991 26634 33577 40700 33061
22610 33061 36221 19287 28051 50016 65411 21461 6143 17614 -17813 -28129 -33228 -39442
$$ packed form
22700B7939m06k7371P697n691P292J9578L656J959k1525l0256j5548M3924N063
22687A6311P25K5783j8812k3481k0762L922o165l770R514J696K3096K8882M39
22674C7378k639j1759j535J060j8607k5773j2442K4714J2042K9852P38j8132j7986
22661c089j5675j0265j2543L3411K3252j9902j1496j8066J0415K8216R826k4020
22649i936j7787q801J5064p545N975L781K2774K1185q364k1247j2541r217J1526
22636a5133J4660O133j3156J2825M745k6607j1605k0692J6234K5005n411r138
22624b2140L277j9489J3561O699N85Q147P4l511L075J8713J7643O943P123p639
22610C3061L160j6934Q764K1965J5395m3950j5318J1471l5427j0316n099o214
$$ plain form
22598 -39442 10672 25281 -10169 -35939 -23425 4032 21460 -10850 -24803 -30078 -14247 90
22586 90 -10446 7161 30510 21542 2380 11394 26108 2384 -31088 -30648 -3153 32842 34690
22573 34690 30687 -5824 -41 895 -17460 -23920 -19339 -11459 3210 -8735 -21460 -25505 -4312
22560 -4312 15855 28360 21889 33496 30619 19193 33385 20284 -13557 -25718 -41487 -22383
22548 -22383 -3200 -1036 1127 -12044 -25296 -17753 -6683 2466 -1521 11234 1410 -34218 -17260
22535 -17260 -27270 -32505 -28563 -30863 -28768 -14278 -1034 12151 23589 20399 -17200 -15704 9468
22522 9468 10513 1795 7287 -451 -4743 -2671 -29237 -62144 -54033 -58840 -54894 -59253 -50281 -23293
22508 -23293 -15087 -15582 1814 27884 34009 7863 -10847 -22494 -10518 16948 9682 13849 18273
$$ packed form
22598c9442N0114J4609l5450k5770J2514K7457J7428l2310j3953n275J5831J4337
22586I0j0536J7607K3349q968j9162R014J4714k3724l3472M40K7495L5995J848
22573C4690m003l6511N783R36j8355o460M581P880J4669j1945j2725m045K1193
22560d312K0167J2505o471J1607k877j1426J4192j3101l3841j2161j5769J9104
22548b2383J9183K164K163j3171j3252P543J1070R149l987J2755r824l5628J6958
22535a7260j0010n235L942k300K095J4490J3244J3185J1438l190l7599J496K5172
22522I468J045q718N492p738m292K072k6566l2907Q111m807L946m359Q972K6988
22508b3293Q206m95J7396K6070O125k6146j8710j1647J1976K7466p266M167M424
$$ plain form
22495 18273 50883 66787 80921 61609 33527 29972 32957 8508 -4891 3855 -9995 10600
22483 10600 14686 2971 16892 20545 28237 6971 -24922 -9815 3845 5739 6444 430 -4949
22470 -4949 -23049 -51785 -30872 -11764 -4404 -16112 1061 3583 11432 380 -19527 -36342
22458 -36342 -18446 -20580 -18718 -3266 -10680 -36507 -32987 -36238 -46854 -23965 -13210 -27106 -24159
22445 -24159 -20461 -32062 -42529 -29629 -32492 -35371 6086 12824 -195 10413 -7807 -16467 4508
22432 4508 17565 8506 -12309 5105 1025 -16412 -48004 -65833 -43939 -26619 -34271 -19145
22420 -19145 -15252 -21903 -29561 -34796 -35593 -31197 25346 26849 20117 15143 13736 20426 26617 20306
22406 20306 16976 20392 -579 -6406 -8963 6003 16003 34300 48453 37169 5907 -7212
$$ packed form
22495A8273L2610J5904J4134j9312k8082l555K985k4449j3399Q746j3850K0595
22483A0600M086j1715J3921L653P692k1266l1893J5107J3660J894P05o014n379
22470d949j8100k8736K0913J9108P360j1708J7173K522P849j1052j9907j6815
22458c6342J7896k134J862J5452p414k5827L520l251j0616K2889J0755j3896K947
22445b4159L698j1601j0467J2900k863k879M1457O738j3019J0608j8220q660K0975
22432D508J3057r059k0815J7414m080j7437l1592j7829K1894J7320p652J5126
22420a9145L893o651p658n235p97M396N6543J503o732m974j407O690O191o311
22406B0306l330L416k0971n827k557J4966J0000J8297J4153j1284l1262j3119
$$ plain form
22394 -7212 16135 35954 19298 5 -18360 -19743 4049 3873 787 -32738 -41306 -25278 -30263
22381 -30263 -15409 -11500 -11022 6249 8891 5333 5678 -1648 6984 18794 60063 53238 27140 33891
22367 33891 25642 26144 34317 13737 4065 -4277 6256 11873 21813 3648 -11606 -6996 17244
22354 17244 2745 -17470 -26549 -19688 -12727 23110 -1895 -5818 -20516 -31883 -32362 -38326 -41520
22341 -41520 -40093 -28166 -33197 -33772 -12239 -19951 -21953 -180 -7971 -9896 -35373 -47066 -24342
22328 -24342 -3539 -7732 -8080 -2291 3682 -7160 -16516 -16439 4688 8588 13680 21339 33445 47221
22314 47221 36998 37318 22119 1285 5036 4019 -20232 -51071 -33463 -1776 -11974 -18908 -15543
22301 -15543 11658 321 -13130 -34327 -61971 -38822 -22091 -4582 4133 -23684 -42289 -29916
$$ packed form
22394g212K3347J9819j6656j9293j8365j383K3792j76l086l3525q568J6028m985
22381c0263J4854L909M78J7271K642l558L45p326Q632J1810M1269o825k6098O751
22367C3891q249N02Q173k0580r672q342J0533N617R940j8165j5254M610K4240
22354A7244j4499k0215r079O861O961L5837k5005l923j4698j1367m79n964l194
22341d1520J427J1927n031n75K1533p712k002K1773p791j925k5477j1693K2724
22328b4342K0803m193l48N789N973j0842r356P7K1127L900N092P659J2106J3776
22314D7221j0223L20j5199k0834L751j017k4251l0839J7608L1687j0198o934L365
22301a5543K7201j1337j3451k1197k7644K3149J6731J7509Q715k7817j8605J2373
$$ plain form
22289 -29916 -34310 -1506 5568 -6003 -1014 1193 -6005 -5845 7043 34767 45667 30797 20021
22276 20021 -21424 -60023 -56904 -28896 -9484 5119 4469 -17361 -29741 -1381 10571 6912
22264 6912 18081 1366 -12160 1504 -5037 -17567 -16707 -13828 -11856 -28851 -18157 -14262 -11406
22251 -11406 4634 11960 19232 11411 3361 -6375 -5650 14213 4895 -6678 10520 14113 -6749
22238 -6749 2947 8137 20469 18569 29350 8663 -6213 -42171 -45631 -32531 -22620 -13022 -8090
22225 -8090 -7399 -7419 -364 -22316 -35278 -34425 -30902 -37477 -21382 9498 33102 8872 -1473 20746
22211 20746 27286 24137 6645 2556 6543 27580 23037 13434 9404 4832 28365 22930 -3544
22198 -3544 -4115 4472 -11527 -23570 -6733 -11642 -38120 -49216 -30657 -22260 -6667 302 -12396
$$ packed form
22289b9916m394L2804P074j1571M989K207p198J60J2888K7724J0900j4870j0776
22276B0021m1445l8599L119K8008J9412J4603o50k1830j2380K8360J1952l659
22264F912J1169j6715j3526J3664o541j2530Q60K879J972j6995J0694L895K856
22251a1406J6040P326P272p821q050r736P25J9863r318j1573J7198L593k0862
22238f749R696N190J2332j900J0781k0687j4876l5958l460J3100R911R598M932
22225h090O91k0P055k1952j2962Q53L523o575J6095L0880K3604k4230j0345K2219
22211B0746O540l149j7492m089L987K1037m543r603m030m572K3533n435k6474
22198c544n71Q587j5999j2043J6837m909k6478j1096J8559Q397J5593O969j2698
$$ plain form
22185 -12396 -4665 1245 -10850 -19675 -26002 -158 8721 15568 9861 6355 -7870 -5335 -15492
22172 -15492 -4267 4400 2058 -2361 9603 14180 -11545 -9688 -3072 7780 -12927 -26559 -17894
22159 -17894 -8430 16921 37527 71117 74605 69843 51832 22566 15424 -7994 -53417 -67641
22147 -67641 -48205 -44609 -30967 -19534 -18335 -20771 -27833 -44910 -43478 -30027 -48009 -41686 -18980
22134 -18980 -16192 -2558 -9317 5731 13752 17415 13662 -3700 19335 22095 19349 -29002 -41761
22121 -41761 -21779 9505 30163 -329 -16819 -17172 -24832 -14552 -16557 -18228 -6287 -1213 -17280
22108 -17280 -17821 -17645 -34962 -25530 -16216 3088 16173 11721 19737 27868 48280 28166 -9737
22095 -9737 -15964 6428 53962 76946 78168 34460 -2117 -27693 -15274 -9027 -3284 -8192 607
$$ packed form
22185a2396P731N910j2095q825o327K5844Q879O847n707l506j4225K535j0157
22172a5492J1225Q667k342m419J1964M577k5725J857O616J0852k0707j3632Q665
22159a7894R464K5351K0606L3590L488m762j8011k9266p142k3418m5423j4224
22147f7641J9436L596J3642J1433J199k436p062j7077J432J3451j7982O323K2706
22134a8980K788J3634o759J5048Q021L663l753j7362K3035K760k746m8351j2759
22121d1761J9982L1284K0658l0492j6490l53p660J0280k005j671J1941N074j6067
22108a7280n41J76j7317R432R314J9304J3085m452Q016Q131K0412k0114l7903
22095i737o227K2392M7534K2984J222m3708l6577k5576J2419O247N743m908Q799
$$ plain form
22082 607 3584 -27015 -13031 7613 -648 -3613 -15013 -10784 -14745 -35991 -26227 -58569 -67460
22069 -67460 -59221 -15295 883 -6400 -2776 11393 -5028 11138 47856 49787 30100 28122 4251
22056 4251 -15043 -5883 28888 8112 -12249 -7174 -4241 -34285 -7840 24816 25029 22024 10364
22043 10364 -10938 -21221 -15128 -15585 -18646 -18139 4566 11092 23804 21226 27333 8655 -18515
22030 -18515 -28785 -529 -4041 -3955 -10925 -30224 -39771 -39274 -47133 -50305 -577 34720 26839 15515
22016 15515 -10453 7474 2140 -2750 -13577 10337 9239 4369 -5482 -9635 -9314 1762 -4277
22003 -4277 -10707 7112 3937 -641 -8013 -13992 -12830 -8477 -8675 -16982 -30315 -39000 -35382 2368
21989 2368 17549 9176 -7257 -19509 -14133 -24685 -45151 -54947 -42751 -46426 -42951 -25593 -28175
$$ packed form
22082F07K977l0599J3984K0644q261k965j1400M229l961k1246R764l2342q891
22069f7460Q239M3926J6178p283L624J4169j6421J6166L6718J931j9687j978k3871
22056D251j9294R160L4771k0776k0361N075K933l0044K6445L2656K13l005j1660
22043A0364k1302j0283O093m57l061N07K2705O526J2712k578O107j8678k7170
22030a8515j0270K8256l512Q6o970j9299r547M97p859l172M9728L5297p881j1324
22016A5515k5968J7927n334m890j0827K3914j098m870r851m153L21J1076o039
22003d277o430J7819l175m578p372n979J162M353j98q307j3333q685L618L7750
21989B368J5181q373j6433j2252N376j0552k0466r796J2196l675L475J7358k582
$$ plain form
21976 -28175 521 -1759 -33602 -28115 -921 -9253 -42267 -66345 -75291 -74258 -34178 -6291 -1621
21963 -1621 -12087 -5237 9384 23792 -6164 -36090 -38033 -9641 8299 8366 -4485 -21560 -27009
21950 -27009 -19864 442 24739 16241 -2564 -24016 1968 4052 -3224 15299 32911 15995
21938 15995 -35380 -52743 -42162 -50602 -41139 -16751 -2212 -2960 -544 -11204 -20876 2803 35498
21925 35498 48265 21714 3438 -22059 -34001 -33545 -23952 -15624 -11351 4149 20785 30657 24529
21912 24529 8803 -3093 -13265 -16113 -1297 39665 41692 5707 -3909 -7164 -7721 -14588 -33564
21899 -33564 -25385 -5697 -21280 -53594 -45582 -30554 -30133 -47361 -17299 -10827 -11445 -7405 -4685
21886 -4685 -11068 -13950 -29412 2746 36074 61635 49539 20725 26191 31978 8041 -17003 -32885
$$ packed form
21976b8175K8696k280l1843N487K7194q332l3014k4078q946J033M0080K7887M670
21963a621j0466O850J4621J4408k9956k9926j943K8392J7940O7j2851j7075n449
21950b7009P145K0306K4297q498j8805k1452K5984K084p276J8523J7612j6916
21938A5995n1375j7363J0581q440R463K4388J4539p48K416j0660r672K3679L2695
21925C5498J2767k6551j8276k5497j1942M56R593Q328M273J5500J6636R872o128
21912B4529j5726j1896j0172k848J4816M0962K027l5985r616l255n57o867j8976
21899c3564Q179J9688j5583l2314Q012J5028M21j7228L0062O472o18M040K720
21886d685o383k882j5462L2158L3328K5561j2096k8814N466N787k3937k5044j5882
$$ plain form
21873 -32885 -38434 -36944 -34238 -41821 -36890 -18723 -22496 -18841 -24079 -30939 -10399 5561 7444 349
21859 349 -4865 -863 2780 1705 -3144 -68 13533 7375 24650 40181 33858 15056 10589 22068
21845 22068 25785 15706 35023 16299 -7192 -10433 -15486 -8322 -9073 -14820 -1328 10783 38382
21832 38382 29745 15196 -9445 -28167 -22695 -5906 7040 28332 5046 -11978 -6256 -7748
21820 -7748 4876 -16364 -20578 -2944 1699 1297 -2567 -5982 -24154 -26742 -7768 -16400 -35347
21807 -35347 -32447 -41990 -42015 -30909 -810 -1613 -11733 -21865 -45857 -29783 -14417 -28698 -38511
21794 -38511 -39821 -13016 -11085 -17223 -25440 -18745 -31170 -50238 -46841 -42819 -33788 -11864 6636
21781 6636 -25690 -37763 -23943 19365 20489 14162 99 -3731 -17295 -8300 -10878 -4154 -36401
$$ packed form
21873c2885n549J490K706p583M931J8167l773L655n238o860K0540J5960J883p095
21859C49n214M002L643j075m849L076J3601o158J7275J5531o323j8802m467J1479
21845B2068L717j0079J9317j8724k3491l241n053P164p51n747J3492J2111K7599
21832C8382q637j4549k4641j8722N472J6789J2946K1292k3286j7024N722j492
21820g748J2624k1240m214J7634M643m02l864l415j8172k588J8974q632j8947
21807c5347K900r543k5J1106L0099q03j0120j0132k3992J6074J5366j4281r813
21794c8511j310K6805J931o138q217O695j2425j9068L397M022R031K1924J8500
21781F636l2326j2073J3820M3308J124o327j4063l830j3564Q995k578O724l2247
$$ plain form
21768 -36401 -29578 10459 13692 1326 23623 42936 44800 75631 72331 57892 46109 38349 25249
21755 25249 14480 12430 13798 4720 -18525 -47783 -65016 -60687 -65786 -45183 -48693 -47259 -37887
21742 -37887 -7101 10539 -2246 -26127 -65757 -58590 -32565 -7509 20420 10798 1717 14081
21730 14081 22146 10790 3611 32243 59056 64278 52669 16249 -22412 -26286 -15288 -28679
21718 -28679 -4540 19570 33435 11322 -16827 -28049 -35334 -21170 13170 25179 7570 -6170
21706 -6170 -15877 -7774 -5003 8556 -3145 -20415 -15758 10068 11601 15316 -9110 3281 13483
21693 13483 -13695 -22679 -20101 -2225 4923 11491 19094 50112 49553 37928 14300 21545 22962
21680 22962 25503 39382 43861 21529 27230 -22116 -33323 9924 23028 -8580 -14600 -17434 3937
$$ packed form
21768c6401O823M0037L233j2366K2297J9313J864L0831l300j4439j1783p760j3100
21755B5249j0769k050J368r078k3245k9258j7233M329n099K0603l510J434R372
21742c7887L0786J7640j2785k3881l9630P167K6025K5056K7929r622r081J2364
21730A4081Q065j1356p179K8632K6813N222j1609l6420l8661l874J0998j3391
21718b8679K4139K4110J3865k2113k8149j1222p285J4164L4340J2009j7609j3740
21706f170r707Q103K771J3559j1701j7270M657K5826J533L715k4426J2391J0202
21693A3483k7178q984K578J7876P148O568P603L1018n59j1625k3628P245J417
21680B2962K541J3879M479k2332N701m9346j1207M3247J3104l1608o020k834K1371
$$ plain form
21667 3937 -8606 -3013 -8974 -13298 6696 5405 7249 12630 -257 -14277 8653 27638 24383
21654 24383 12420 -138 -20445 -37252 -12556 36204 30900 23871 10179 1632 -17295 -35984
21642 -35984 -15310 -1535 -5026 3845 15275 23183 22560 19371 13434 4255 -5013 14306 27385
21629 27385 25726 22492 19065 17022 20881 10676 21356 21785 18881 26200 29104 29417 20369 28912
21615 28912 23553 26098 29848 21842 1657 -13186 -20864 -17153 1433 9436 -5377 13761 5661
21602 5661 22317 46063 26791 18840 51421 62546 59503 40926 35594 45491 40035 17978 14958
21589 14958 10216 25105 11186 14789 30481 24001 9002 18824 15750 2297 460 8100 -9787
21576 -9787 -21991 -9526 -2919 12703 15232 24509 14577 10840 8477 -23220 -51065 -35534 -18864
$$ packed form
21667C937j2543N593n961m324J9994j291J844N381j2887j4020K2930J8985l255
21654B4383j1963j2558k0307j6807K4696M8760n304p029j3692q547j8927j8689
21642c5984K0674J3775l491Q871J1430P908o23l189n937r179r268J9319J3079
21629B7385j659l234l427k043L859j0205J0680M29k904P319K904L13r048Q543
21615B8912n359K545L750q006k0185j4843p678L711J8586Q003j4813J9138q100
21602E661J6656K3746j9272p951L2581J1125l043j8577n332R897n456k2057l020
21589A4958m742J4889j3919L603J5692o480j4999R822l074j3453j837P640j7887
21576i787j2204J2465O607J5622K529R277r932l737k363l1697k7845J5531J6670
$$ plain form
21563 -18864 -30636 -21410 1240 23365 25913 15479 51371 41430 6936 11352 13626 9259 357
21550 357 -6978 -24060 -39084 -21752 -13145 -44575 -58197 -33995 -31702 -14613 20952 20916 2040
21537 2040 -10056 -1866 1181 -9344 -49796 -92523 -83011 -47695 -28304 -21322 -12438 -5930 -17418
21524 -17418 -8923 -16156 -30592 -16536 16694 39781 29672 -2113 -379 -12768 -21660 -39118
21512 -39118 -32147 -21993 -34064 -17589 -5817 -10622 -9377 15301 15851 -23075 -13804 -9588 -1850
21499 -1850 -8296 1053 -7376 -38446 -24089 -16399 -26004 -29102 -23961 -145 15429 3334 -898
21486 -898 -20312 -26112 -10559 4490 3968 1940 8111 4211 8941 13597 6774 -23672 -48107 -36272
21472 -36272 -35862 -33398 -50493 -63527 -59550 -41372 602 15623 1354 -320 5340 -2646 8692
$$ packed form
21563a8864j1772R226K2650K2125K548j0434L5892r941l4494M416K274m367q902
21550C57p335j7082j5024J7332Q607l1430j3622K4202K293J7089L5565l6j8876
21537B040j2096Q190L047j0525m0452m2727R512L5316J9391O982Q884O508j1488
21524a7418Q495p233j4436J4056L3230K3087j0109l1785J734j2389q892j7458
21512c9118O971J0154j2071J6475J1772m805J245K4678N50l8926R271M216P738
21499a850o446R349q429l1070J4357P690r605l098N141K3816J5574j2095m232
21486h98j9414n800J5553J5049n22k028O171l900M730M656o823l0446k4435J1835
21472c6272M10K464j7095j3034L977J8178M1974J5021j4269j674N660p986J1338
$$ plain form
21459 8692 44568 52761 39147 26900 12878 -26618 -41942 -31140 -23683 -14990 5222 19824
21447 19824 13810 -11956 -17961 -19875 -19208 -22857 5198 18886 13496 32963 23783 6498 256
21434 256 11938 18280 5417 -1931 -11059 3594 -27911 -37436 -14682 7343 -6161 -27229 -25669
21421 -25669 -11733 -1198 -4708 17585 28110 11667 -12466 -12106 -15021 -45543 -38066 -33071 -14317
21408 -14317 11849 4811 8031 21660 5798 13655 36616 35281 22224 -8253 -17207 -15598 -28059
21395 -28059 -42244 -57353 -62161 -32848 9368 23017 21929 -10909 -26411 -5535 13168 6704
21383 6704 6183 -1112 26659 4213 5151 10542 -220 -12878 -18316 -9401 -8042 3557 13761 8292
21369 8292 14811 5996 11271 6898 436 5554 7192 36968 29474 33319 34222 14188 11730 12889
$$ packed form
21459H692L5876Q193j3614j2247j4022l9496j5324J0802P457Q693K0212J4602
21447A9824o014k5766o005j914O67l649K8055J3688n390J9467r180j7285o242
21434B56J1682O342j2863p348r128J4653l1505r525K2754K2025j3504k1068J560
21421b5669J3936J0535l510K2293J0525j6443k4133L60k915l0522P477M995J8754
21408a4317K6166p038L220J3629j5862P857K2961j335j3057l0477q954J609j2461
21395b8059j4185j5109m808K9313M2216J3649j088l2838j5502K0876J8703o464
21383F704n21p295K7771k2446R38N391j0762j2658n438Q915J359J1599J0204n469
21369H292O519q815N275m373o462N118J638K9776p494L845R03k0034k458J159
$$ plain form
21355 12889 37309 26960 -12681 -39687 -41147 -26695 -8156 -10027 -2252 -3716 15413 29127
21343 29127 24011 22224 16368 -22495 -29760 -23859 -41592 -46781 -39907 -59164 -53454 -20428 5350
21330 5350 16264 -3367 -8146 -468 6467 -22861 -34543 -30507 -9969 566 -10833 -10989 -4105
21317 -4105 7496 15367 -9695 -20606 -3187 38403 13630 -2143 4733 6704 5577 -8318 -21413
21304 -21413 -11280 17915 16869 -1112 -22726 -24711 -9219 -10739 -27611 -35521 -10614 -3828 -26976
21291 -26976 -43194 -37832 -42666 -31144 -37440 -53145 -32457 -31497 -59716 -59438 -41660 -9965 -12852
21278 -12852 -46923 -36814 -19486 31 -33553 -61533 -71704 -38353 3750 -1037 -28903 -19597
21266 -19597 -24959 -5373 -16882 -31164 -11413 7278 8278 -4078 -16646 -48268 -43351 -30978
$$ packed form
21355A2889K4420j0349l9641k7006j460J4452J8539j871P775j464J9129J3714
21343B9127n116j787n856l8863p265N901j7733n189O874j9257N710L3026K5778
21330E350J0914j9631m779P678O935k9328j1682M036K0538J0535j1399j56O884
21317d105J1601P871k5062j0911J7419M1590k4773j5773O876J971j127j3895j3095
21304b1413J0133K9195j046j7981k1614j985J5492j520j6872p910K4907O786k3148
21291b6976j6218N362m834J1522o296j5705K0688R60k8219K78J7778L1695k887
21278a2852l4071J0109J7328J9517l3584k7980j0171L3351M2103m787k7866R306
21266a9597n362J9586j1509j4282J9751J8691J000j2356j2568l1622M917J2373
$$ plain form
21254 -30978 -23175 -13973 -11828 -5932 -33154 -30612 -22027 -24402 -3469 -5215 -6705 -19053 -14890 22672
21240 22672 30455 23169 -7485 -13556 -35888 -6229 46469 60856 47154 38167 48028 55256 38711
21227 38711 34873 30500 4483 -7543 13332 47808 32307 -12763 -22706 -13862 -3069 -18345
21215 -18345 -26466 -7370 -17425 -52374 -54467 -23966 -3168 3893 4327 -11996 -12010 -5565 -37993
21202 -37993 -67707 -47149 -22268 -2376 -1270 13558 -6323 -36693 -14635 7818 1172 2800
21190 2800 -15611 -28129 -28535 -26337 -22501 -2098 9742 -4782 4132 11521 15109 17027 15744 -7003
21176 -7003 -21334 -16566 -28605 -6650 6706 785 -16784 -42538 -64504 -64700 -50102 -41280 -22025
21163 -22025 2687 -2917 -24232 -35919 3885 -2323 -4240 15952 11532 -217 500 25751 16987
$$ packed form
21254c0978P803R202K145N896k7222K542Q585k375K0933j746j490j2348M163L7562
21240B2672P783p286l0654o071k2332K9659N2698J4387j3702q987R861P228j6545
21227C8711l838m373k6017j2026K0875L4476j5501m5070r943Q844J0793j5276
21215a8345q121J9096j0055l4949k093L0501K0798P061M34j6323j4O445l2428
21202c7993k9714K0558K4881J9892J106J4828j9881l0370K2058K2453o646J628
21190B800j8411j2518m06K198L836K0403J1840j4524Q914P389L588J918j283k2747
21176g003j4331M768j2039K1955J3356n921j7569k5754k1966j96J4598Q822J9255
21163b2025K4712n604k1315j1687L9804o208j917K0192m420j1749P17K5251q764
$$ plain form
21150 16987 4407 17612 -1356 -8744 -28466 -35731 -7356 -338 -2075 -11102 -8239 42789 50660
21137 50660 34551 37406 8609 -10429 -17853 28991 43297 34360 16293 -6395 -2769 -5266 -866
21124 -866 -1277 -8207 -9165 -17813 -17925 6500 -17178 -36816 -25602 -16099 -20973 -23830 -27829 -2440
21110 -2440 26816 50881 49729 40182 19769 21397 -4811 -21039 -10395 2376 24830 24563 3179
21097 3179 23631 33907 30528 -13028 -19357 -27503 -47644 -57472 -48580 -45280 -49488 -11245 11142
21084 11142 2194 2584 -12246 -25292 -21349 -23947 -20332 -12368 -2634 -1322 -8192 -2323 -27575 -47971
21070 -47971 -57997 -19703 15244 30894 19020 21254 15245 13964 5876 5200 5702 481 -2822 -11362
21056 -11362 -30803 -33698 -10530 7270 14336 -6794 -20962 -16041 -11946 -11669 -6809 -17146 -17102 -31190
$$ packed form
21150A6987j2580J3205j8968p388j9722p265K8375P018j737r027K863N1028P871
21137E0660j6109K855k8797j9038p424M6844J4306q937j8067k2688L626k497M400
21124h66m11o930r58q648j12K4425k3678j9638J1214R503m874k857l999K5389
21110b440K9256K4065j152r547k0413J628k6208j6228J0644J2771K2454k67k1384
21097C179K0452J0276l379m3556o329q146k0141r828Q892L300m208L8243K2387
21084A1142q948L90j4830j3046L943k598L615P964R734J312o870N869k5252k0396
21070d7971j0026L8294L4947J5650j1874K234o009j281q088o76N02n221l303q540
21056a1362j9441k895K3168J7800P066k1130j4168M921M095K77M860j0337M4j4088
$$ plain form
21042 -31190 -24296 -24466 -10479 -10249 4592 34022 30391 13608 -23008 -34912 -24778 -46702 -31778
21029 -31778 -21223 -18257 -7360 -5078 4133 -3260 -48643 -50390 -30242 -24475 -10881 -12732 -3925
21016 -3925 -5014 -5091 -4235 -10676 3322 11241 17623 37405 29799 14422 5378 -9451 -19080 -14948
21002 -14948 -23141 -34569 -45445 -37521 -19898 6276 19991 10956 -8044 -34980 -45411 -62698
20990 -62698 -68458 -56925 -31794 -13787 -1255 11195 -3567 2997 11947 4421 -5981 -28702
20978 -28702 -16925 -10186 -8946 15378 20361 42721 58505 44355 17329 12373 -6007 -34934
20966 -34934 -21564 -24339 -23064 -1863 4913 4712 -12073 -7094 4962 -31701 -33150 -6193 -20412
20953 -20412 -34263 2639 8049 6753 16200 -2053 -21915 -20293 -14438 10423 13797 -29193 -45834
$$ packed form
21042c1190O894j70J3987K30J4841K9430l631j6783l6616j1904J0134k1924J4924
21029c1778J0555K966J0897K282R211p393m5383j747K0148N767J3594j851Q807
21016c925j089p7Q56o441J3998P919O382J9782p606j5377r044j4829r629M132
21002a4948q193j1428j0876P924J7623K6174J3715r035j9000k6936j0431j7287
20990f2698n760J1533K5131J8007J2532J2450j4762O564Q950p526j0402k2721
20978b8702J1777O739J240K4324M983K2360J5784j4150k7026m956j8380k8927
20966c4934J3370k775J275K1201O776k01j6785M979J2056l6663j449K6957j4219
20953b0412j3851L6902N410j296R447j8253j9862J622N855K4861L374m2990j6641
$$ plain form
20940 -45834 -43729 -37308 -24544 -11656 -10109 -6374 -18488 -32453 -33727 -38712 -23099 -2792 5084
20927 5084 3597 -1857 27343 27926 37724 43352 11733 -17934 -26079 -7534 -4875 -3718 -12841 -15594
20913 -15594 -51734 -65923 -44724 -38211 -32052 -19197 -21340 -21234 -38388 -59446 -64342 -27256 -21157
20900 -21157 -55407 -32534 1155 6618 -8176 8051 7255 -12571 -34516 -42904 -50250 -58330 -16514
20887 -16514 17458 24822 25217 32885 38839 28289 26658 25787 2017 -4445 -606 9939 940 -3504
20873 -3504 -18013 -4254 30394 56500 45823 65983 59045 28116 20330 34796 40864 47524 17079
20860 17079 5349 10702 -12109 -24892 -24764 12799 21871 7731 27777 65414 62803 20971 -10842
20847 -10842 -15973 -892 291 1804 14252 20066 -1368 -17737 -22999 -24026 -56546 -53250 -38955
$$ packed form
20940d5834K105O421J2764J2888J547L735j2114j3965j274m985J5613K0307P876
20927E084j487n454K9200N83R798N628l1619k9667q145J8545K659J157r123k753
20913a5594l6140j4189K1199O513O159J2855k143J06j7154k1058m896L7086O099
20900b1157l4250K2873L3689N463j4794J6227p96j9826k1945q388p346q080M1816
20887a6514L3972P364L95P668N954j0550j631q71k3770o462L839J0545q999m444
20873c504j4509J3759L4648K6106j0677K0160o938l0929p786J4466O068O660l0445
20860A7079j1730N353k2811j2783J28L7563R072j4140K0046L7637k611m1832l1813
20847a0842n131J5081J183J513J2448N814k1434j6369n262j027l2520L296J4295
$$ plain form
20834 -38955 -39324 -39562 -31409 -46805 -57181 -24798 7087 12315 30525 53684 63307 19986 -15767
20821 -15767 -16966 -22011 -17696 -28507 -18454 -3629 -3461 9576 6700 1970 -20449 -30331 -10486
20808 -10486 -19182 -4596 89 -4931 -16414 -24455 -13370 9395 10571 19227 26668 15512 8691
20795 8691 40970 34684 15276 13815 42415 72534 79549 63364 23703 2725 -8166 -4825 6600
20782 6600 -19173 -15112 -14391 6958 10761 -14573 -17771 -22869 -21944 -35056 -27449 -8563 -5973 -18791
20768 -18791 -18591 -28271 1721 31591 17538 12564 18906 -6065 -13434 15337 37163 34403 17198
20755 17198 29091 32125 15727 3085 -22547 -20915 -14489 -5508 -13463 -4187 -14455 -22449 -4478
20742 -4478 167 -4925 11036 30159 49228 28460 1686 8086 17519 10292 19097 36168 12289
$$ packed form
20834c8955l69k38Q153j5396j0376L2383L1885N228J8210K3159R623m3321l5753
20821a5767j199n045M315j0811J0053J4825J68J3037k876m730k2419r882J9845
20808a0486q696J4586M685n020j1483q041J1085K2765J176Q656P441j1156o821
20795H691L2279o286j9408j461K8600L0119P015j6185l9661k0978j0891L341J1425
20782F600k5773M061P21K1349L803k5334l198n098R25j3112P607J8886K590j2818
20768a8791K00r680K9992K9870j4053m974O342k4971p369K8771K1826k760j7205
20755A7198J1893L034j6398j2642k5632J632O426Q981p955R276j0268p994J7971
20742d478M645n092J5961J9123J9069k0768k6774O400R433p227Q805J7071k3879
$$ plain form
20729 12289 5273 20830 16424 23815 24024 26695 17265 13994 6199 -9042 9618 26385 23228 -26015
20715 -26015 -43649 -26163 7606 23171 23477 1551 -23007 -33136 -7657 32606 21534 21933
20703 21933 40492 33380 31519 55554 39370 28607 8596 -2226 2754 -18007 -29336 -16670
20691 -16670 -6377 1111 -456 9113 393 17865 17392 -13714 -18918 -21927 -16493 -30613 -41279
20678 -41279 -36806 -44502 -35728 -57251 -53957 -28636 12308 35129 23387 34984 27698 13789 24504
20665 24504 29296 12837 18028 31267 27891 39080 25459 -11306 -19149 -9929 2952 4820 -3819
20652 -3819 -13383 7385 15740 -17289 -30798 -9941 -2332 -7438 -8420 -9105 -14975 -16106 -18784 284
20638 284 6108 -1766 2214 4392 4682 -6036 -37273 -29194 -3352 -8567 -41327 -49744 -48543 -56848
$$ packed form
20729A2289p016J5557m406P391K09K671r430l271p795j5241J8660J6767l157m9243
20715b6015j7634J7486L3769J5565L06k1926k4558j0129K5479M0263j1072L99
20703B1933J8559p112j861K4035j6184j0763k0011j0822M980k0761j1329J2666
20691a6670J0293P488j567R569q720J7472m73l1106n204l009N434j4120j0666
20678d1279M473p696Q774k1523L294K5321M0944K2821j1742J1597p286j3909J0715
20665B4504M792j6459N191J3239l376J1189j3621l6765p843R220J2881J868q639
20652c819r564K0768Q355l3029j3509K0857P609n106r82o85n870j131k678J9068
20638B84N824p874L980K178K90j0718l1237Q079K5842n215l2760q417J201q305
$$ plain form
20624 -56848 -19731 12874 -2280 12614 16443 22598 13234 23464 19713 5775 -22794 -30281 -16825
20611 -16825 -16782 -43764 -64403 -44514 -9721 -14592 -13396 -15449 -18757 -18602 -24600 -25862 -24000 -15094
20597 -15094 -24618 -42605 -48378 -54193 -45260 -37625 -38706 -24938 -33109 -40302 -44195 -44738 -26715 -24095
20583 -24095 -53323 -61839 -54965 -32626 -18492 -22032 -30501 -29147 -5149 -28079 -48783 -51239 -33390
20570 -33390 -40323 -24124 -3146 17318 26580 28000 17573 -16896 -18365 -39104 -42567 -36423 -15000
20557 -15000 -10343 -10504 13785 6773 -1650 -9555 -9617 -9796 -10162 29511 44215 28693 7718 -26533
20543 -26533 -15453 1637 2907 167 -8169 -8433 -2325 -10380 -25955 -24810 8483 19954 -16230
20530 -16230 -44414 -47615 -59850 -75045 -59030 -51895 -34434 -17796 -20296 -47804 -31651 -32180 -23073
$$ packed form
20624e6848L7117L2605j5154J4894L829O155r364J0230l751j3938k8569p487J3456
20611a6825M3k6982k0639J9889L4793m871J196k053l308J55n998j262J862Q906
20597a5094r524j7987n773n815Q933P635j081J3768q171p193l893n43J8023K620
20583b4095k9228q516O874K2339J4134l540q469J354K3998k2930k0704k456J7849
20570c3390o933J6199K0978K0464R262J420j0427l4469j469k0739l463O144K1423
20557a5000M657j61K4289p012q423p905o2j79l66L9673J4704j5522k0975l4251
20543b6533J1080J7090J270k740q336k64O108q055j5575J145L3293J1471l6184
20530a6230k8184l201j2235j5195J6015P135J7461J6638k500k7508J6153n29R107
$$ plain form
20517 -23073 -23980 -24753 -39565 -22915 -24840 -31740 -40803 -7824 -9083 -17520 -20519 -4103 9765 7570
20503 7570 -7861 2586 8665 11794 17296 21689 39229 46318 34930 11216 4174 -5678 16923
20490 16923 18844 25943 33413 74684 53852 23925 6700 1026 -2419 5646 26061 27567 25133
20477 25133 39133 28812 5202 -19524 -37702 -36294 -18127 27883 43889 31895 5338 4317
20465 4317 2337 -7078 -18085 -27548 -12091 13271 50090 63703 55266 41827 36816 35089 18553
20452 18553 1981 -4727 4724 -19195 -26809 -3202 27409 38517 30141 36209 25031 16680 17104
20439 17104 17524 29742 13205 -10110 -19813 -18777 -22024 -16205 -7052 805 -17889 -14984 -13070 -19386
20425 -19386 -31940 -31489 -1729 -2962 -16426 -4900 -8411 13038 24820 49492 54930 45488 34722
$$ packed form
20517b3073r07p73j4812J6650j925o900r063L2979j259q437k999J6416J3868k195
20503G570j5431J0447O079L129N502M393J7540P089j1388k3714p042r852K2601
20490A6923J921P099P470M1271k0832k9927j7225n674l445Q065K0415J506k434
20477B5133J4000j0321k3610k4726j8178J408J8167M6010J6006j1994k6557j021
20465D317j980r415j1007r463J5457K5362L6819J3613q437j3439n011j727j6536
20452A8553j6572o708R451k3919p614K3607L0611J1108q376O068j1178q351M24
20439A7104M20J2218j6537k3315r703J036l247N819R153P857j8694K905J914o316
20425a9386j2554M51K9760j233j3464J1526l511K1449J1782K4672N438r442j0766
$$ plain form
20412 34722 -3827 -21427 -14236 -11406 -4325 15612 42667 47810 52382 29639 22337 2342 -4213
20399 -4213 481 7737 15372 -3938 -7108 -13014 -26259 -17810 -36482 -48066 -34571 -26695 -41186
20386 -41186 -34215 -31373 -33122 -13192 -26631 -21030 24806 17108 13071 2602 15150 -8137 -39354
20373 -39354 -19061 -21872 -44931 -36606 -31018 -19517 -2244 -7886 -11526 -18904 4501 48859 32291
20360 32291 10917 -6499 5487 34683 51365 31969 5320 10178 -8612 -30830 -45037 -47609
20348 -47609 -20239 -3785 -14354 -23368 -8514 3124 1263 3880 983 -10201 -6713 9135 9578
20335 9578 4600 6446 2646 8679 8106 12306 1664 -12893 -9462 -14063 -19648 -6445 -9289 -285
20321 -285 -17226 -7501 23241 10109 15271 2792 6389 14532 17002 17140 1611 7479 12487 36197
$$ packed form
20412C4722l8549j7600P191K830P081J9937K7055N143M572k2743p302j9995o555
20399d213M694P256P635j9310l170n906j3245Q449j8672j1584J3495P876j4491
20386d1186O971K842j749J9930j3439N601M5836p698m037j0469J2548k3287l1217
20373c9354K0293k811k3059Q325N588J1501J7273n642l640p378K3405M4358j6568
20360C2291k1374j7416J1986K9196J6682j9396k6649M858j8790k2218j4207k572
20348d7609K7370J6454j0569r014J4854J1638j861K617k897j1184L488J5848M43
20335I578m978J846l800O033n73M200j0642j4557L431m601n585J3203k844R004
20321b85j6941R725L0742j3132N162j2479L597Q143K470J38j5529N868N008K3710
$$ plain form
20307 36197 31509 18483 27585 22992 33640 53897 39471 24121 27314 17755 3592 6918 9320
20294 9320 19144 13413 10385 7771 12640 574 -17363 5292 30295 27021 35833 37138 6935
20281 6935 -42452 -38368 -31333 -20500 -21127 -25873 -23433 1315 -5841 -1838 -17098 -38847 -46566 -16639
20267 -16639 19696 8931 -9507 -7148 12432 26 -36384 -39029 -16955 -22266 -29115 -19537 6357
20254 6357 30812 6467 -19340 -41927 -46344 -33758 -7461 -12255 -14200 -11827 -23958 -32468 -18914
20241 -18914 -9050 -23332 -489 8787 10801 25571 30711 33835 6484 -35939 -22176 -1294 1475
20228 1475 6229 1031 -18328 -16704 -18272 -30112 -14848 -12897 -8816 16104 3612 4425 -1069 -3478
20214 -3478 7485 12897 26187 34938 49197 20452 -14949 -23767 -10477 -17356 -32817 -11895 912
$$ packed form
20307C6197m688j3026R102m593J0648K0257j4426j5350L193r559j4163L326K402
20294I320R824n731l028k614M869j2066j7937K2655K5003l274Q812J305l0203
20281F935m9387M084P035J0833o27m746K440K4748p156M003j5260k1749p719K9927
20267a6639L6335j0765j8438K359J9580j2406l6410k645K2074n311o849R578K5894
20254F357K4455k4345k5807k2587m417J2586K6297m794j945K373j2131q510J3554
20241a8914R864j4282K2843R276K014J4770N140L124k7351m2423J3763K0882K769
20228A475M754n198j9359J624j568j1840J5264J951M081K4920j2492Q13n494k409
20214c478J0963N412J3290Q751J4259k8745l5401q818J3290o879j5461K0922J2807
$$ plain form
20201 912 -8149 -20770 -21739 -9860 25026 29743 33113 56834 43635 34264 38225 8395 -16525
20188 -16525 -22169 -3329 12616 -5531 -25848 -23590 -23992 -10658 -25943 -18550 7151 -4647 -21464
20175 -21464 -36521 -37225 -33507 -10912 3894 -4128 -12165 15191 22470 3061 -18642 -18167 3162
20162 3162 11771 3419 212 -16833 -47462 -56775 -35108 -11091 -10477 -36158 -51218 -50883 -37717
20149 -37717 -31751 -18341 -17447 -14619 -2936 6475 29002 14480 13195 14944 2393 -5401 -10325
20136 -10325 3858 19090 34170 43094 61456 50049 16627 -9257 -1944 -2412 -21496 -13410 -27020
20123 -27020 -26508 -6936 -36102 -55169 -45020 -47487 -33030 -7919 -3592 -16483 -11693 -8959 3547
20110 3547 -3897 -19894 -32050 -44898 -53200 -44581 -21982 -11760 -16864 -10066 -24259 -28994 3500
$$ packed form
20201I12r061j2621r69J1879L4886M717L370K3721j3199r371L961k9830k4920
20188a6525n644J8840J5945j8147k0317K258m02J3334j5285P393K5701j1798j6817
20175b1464j5057p04L718K2595J4806q022q037K7356P279j9409k1703M75K1329
20162C162Q609q352l207j7045l0629r313K1667K4017O14k5681j5060L35J3166
20149c7717N966J3410Q94K828J1683R411K2527j4522j285J749j2551p794m924
20136a0325J4183J5232J5080Q924J8362j1407l3422k5884P313m68j9084Q086j3610
20123b7020N12J9572k9166j9067J0149k467J4457K5111M327j2891M790K734J2506
20110C547p444j5997j2156j2848q302Q619K2599J0222n104O798j4193m735L2494
$$ plain form
20097 3500 31312 29829 8908 6852 -15949 -41328 -42230 -28509 -27738 -1571 19118 13586 18079
20084 18079 23549 9876 4765 1978 -9435 -8458 -1864 5934 -10615 -40782 -51385 -38395 -15187
20071 -15187 35948 57909 54727 25602 -10005 -15393 -9753 23208 37605 27844 16905 15565 23645
20058 23645 32061 24681 45241 32826 21428 13832 12922 15954 15819 10439 7724 2734 -15451 -3297
20044 -3297 8280 -3723 -29323 -26873 -17930 -7609 12099 21424 19015 14182 5446 -7038 -10571
20031 -10571 -14945 -11806 -7808 -3962 6226 1143 2350 20260 26187 39851 38142 20044 6773
20018 6773 40744 39108 23250 11476 -9965 -21103 -36444 9099 27692 29494 11709 12042 7346
20005 7346 6 -3670 4790 29274 45933 2685 -12109 -14775 -33727 -43568 -45698 -14071 -881
$$ packed form
20097C500K7812j483k0921k056k2801k5379r02J3721P71K6167K0689n532M493
20084A8079N470j3673n111k787j1413R77O594P798j6549l0167j0603J2990K3208
20071a5187N1135K1961l182k9125l5607n388N640L2961J4397r761j0939j340Q080
20058B3645Q416p380K0560j2415j1398p596r10L032j35n380k715m990j8185J2154
20044c297J1577j2003k5600K450Q943J0321J9708R325k409m833q736j2484l533
20031a0571m374L139L998L846J0188n083J207J7910N927J3664j709j8098j3271
20018F773L3971j636j5858j1774k1441j1138j5341M5543J8593J802j7785L33m696
20005G346p340l676Q460K4484J6659m3248j4794k666j8952r841k130L1627J3190
$$ plain form
19992 -881 2401 13971 14613 8711 9699 -2295 7377 54731 83570 72946 48501 24685 7827
19979 7827 3545 -1346 15386 8130 -8530 -105 6036 11184 21346 35268 20694 20902 36411
19966 36411 26764 35461 25225 26957 28934 10654 -1388 -8631 -3866 6885 6267 -22139 -15604
19953 -15604 -24524 -22470 -21768 -1298 7682 -3176 11728 47865 45386 11131 -9917 -13888 4357
19940 4357 17527 28081 31600 27498 -585 15368 7232 -9915 -2682 -21734 -21560 -12823 -2270
19927 -2270 10485 16592 17602 4366 -3617 -2481 1964 9792 17806 -2139 -20933 -1354 -598 8515
19913 8515 11914 15886 16505 21969 22857 15627 1179 -16221 -1403 35159 54887 45204 43397 27289
19899 27289 14188 32061 41675 39608 13148 23299 41939 16984 -7831 14487 17986 16290
$$ packed form
19992h81L282J1570O42n902R88j1994R672M7354K8839j0624k4445k3816j6858
19979G827m282m891J6732p256j6660Q425O141N148J0162J3922j4574K08J5509
19966C6411r647Q697j0236J732J977j8280j2042p243M765J0751o18k8406O535
19953a5604q920K054P02K0470Q980j0858J4904L6137k479l4255k1048l971J8245
19940D357J3170J0554L519m102k8083J5953q136j7147P233j9052J74Q737J0553
19927b270J2755O107J010j3236p983J136M445P828Q014j9945j8794J9579P56R113
19913H515L399L972O19N464Q88p230j4448j7400J4818L6562J9728r683j807j6108
19899B7289j3101J7873R614k067k6460J0151J8640k4955k4815K2318L499j696
$$ plain form
19887 16290 -729 20048 31712 9315 -4414 4469 13852 -7298 -5847 -4809 -10347 -4470 -11353
19874 -11353 -2358 -1767 -7865 17280 30280 22891 14069 5856 -1523 111 -6583 -8067 -119 -23991
19860 -23991 -29046 -10444 16485 13513 7292 -5574 -21987 -22066 -3759 -1715 5320 5980 15724 4620
19846 4620 8706 -15646 -37009 -6443 4679 1315 -3588 22940 15757 6574 21434 19828 -2204
19833 -2204 -9813 9425 7974 11939 -3172 -40176 -35077 -16207 15793 28132 21683 -1416 -13193
19820 -13193 -32847 -22979 9543 35669 22382 16241 29867 28646 5816 29681 21371 27482 38591
19807 38591 39712 17583 -1541 -11088 28610 34063 11468 23161 15049 -10518 3870 -524 31919
19794 31919 48913 24447 37783 38150 32475 49452 49695 53289 11538 11182 29753 27473 42532
$$ packed form
19887A6290j7019K0777J1664k2397j3729Q883R383k1150J451J038n538N877o883
19874a1353Q995N91o098K5145J3000p389q822q213p379J634o694j484P948k3872
19860b3991n055J8602K6929k972o221j2866j6413p9J8307K044P035O60R744j1104
19846D620M086k4352k1363L0566J1122l364m903K6528p183r183J4860j606k2032
19833b204p609J9238j451L965j5111l7004N099J8870L2000J2339o449k3099j1777
19820a3193j9654R868L2522K6126j3287o141J3626j221k2830K3865q310O111J1109
19807C8591J121k2129j9124r547L9698N453k2595J1693q112k5567J4388m394L2443
19794C1919J6994k4466J3336L67n675J6977K43L594m1751l56J8571k280J5059
$$ plain form
19781 42532 51041 58534 41720 -8416 -13981 13939 6505 1102 21812 3393 4608 20164 26274
19768 26274 31002 38983 21099 8472 22400 -4955 -29692 -24735 -19448 -26545 -14601 -8971 8072
19755 8072 40693 45229 8546 16060 11023 8905 19910 36692 32102 4674 -3621 4018 10985
19742 10985 8612 766 8215 14808 -6423 -4473 -12712 -24792 -34301 -45396 -40328 -43711 -52250 -25365
19728 -25365 -9386 9956 23094 16646 41933 48307 31852 32629 30230 23426 32522 18017 -24925
19715 -24925 -47455 -52597 -50870 -34646 -20463 -26883 -29973 -12291 7863 31504 25932 7300 -975
19702 -975 20149 49181 29710 15912 2909 -8056 2672 1941 -11996 3831 27081 32189 27988
19689 27988 8003 -10857 21364 23685 37840 27405 -1713 -2900 12248 10215 -5497 -8963
$$ packed form
19781D2532Q509P493j6814n0136n565K7920p434n403K0710j8419J215J5556O110
19768B6274M728P981j7884j2627J3928k7355k4737M957N287p097J1944N630J7043
19755H072L2621M536l6683P514n037k118J1005J6782m590k7428q295P639O967
19742A0985k373p846P449O593k1231J950q239j2080r509j1095N068l383q539K6885
19728b5365J5979J9342J3138o448K5287O374j6455P77k399o804R096j4505m2942
19715b4925k2530n142J727J6224J4183o420l090J7682K0154K3641n572j8632q275
19702i75K1124K9032j9471j3798j3003j0965J0728p31j3937J5827K3250N108m201
19689B7988j9985j8860L2221K321J4155j0435k9118j187J5148k033j5712l466
$$ plain form
19677 -8963 -10449 -10238 -22947 -7298 -4929 5622 -3701 -20253 -5540 -9454 13736 37448 31960
19664 31960 19391 20230 8007 3616 12550 -2754 -3507 -8318 -16496 -34772 -35117 -34821 -6362 -12234
19650 -12234 -21641 -27146 -17079 -10299 -4156 16335 13195 38463 38037 35659 20957 20122 19561 27511
19636 27511 22509 11169 -13016 3728 15521 47069 57738 43892 50873 43398 64126 73708
19624 73708 84146 79239 81697 83815 85458 97617 86537 55098 54922 35200 25409 35639 37445
19611 37445 46046 74148 93748 83310 87063 120891 157789 188156 257015 336857 424530 537529
19599 537529 637165 694351 708145 660026 574434 483403 398094 328280 280825 235861 180848
19588 180848 145441 117673 106266 109746 62397 33163 27085 45313 46899 17494 -9217 -9489
$$ packed form
19677h963j486K11j2709J5649K369J0551r323j6552J4713l914K3190K3712n488
19664C1960j2569Q39j2223m391Q934j5304p53m811q178j8276l45K96K8459n872
19650a2234r407n505J0067O780O143K0491l140K5268m26k378j4702q35n61P950
19636B7511n002j1340k4185J6744J1793L1548J0669j3846O981p475K0728R582
19624G3708J0438m907K458K118J643J2159j1080l1439j76j9722r791J0230J806
19611C7445Q601K8102J9600j0438L753L3828L6898L0367O8859P9842Q7673J12999
19599E37529R9636N7186J3794m8119q5592r1031q5309o9814m7455m4964n5013
19588A80848l5407k7768j1407L480m7349k9234o078J8228J586k9405k6711k72
$$ plain form
19576 -9489 19671 24024 37378 39191 46611 54790 49148 45110 71737 54981 24870 22861 30180
19563 30180 13906 39495 42256 39262 43417 36690 36295 25245 22079 30068 42118 24203 2823
19550 2823 -5077 -7473 14417 19030 11033 -1278 7827 19728 -5220 -37683 -29080 -2254 15367
19537 15367 34229 29172 32255 60555 77355 75507 85662 83136 42178 38656 -3136 16218 42339
19524 42339 59307 24884 1861 15894 39058 10463 -10285 -19281 551 35230 17327 -6448
19512 -6448 6771 -6108 12437 21866 47798 12262 208 -5138 -3628 -20868 -32213 19517
19500 19517 35995 41237 52092 55285 28032 19136 49934 62187 37719 43393 45368 72292 70927
19487 70927 79629 72375 47902 16294 1012 17145 35938 42309 66044 83289 54079 18540
$$ packed form
19576i489K9160M353J3354J813P420Q179n642m038K6627j6756l0111k009P319
19563C0180j6274K5589K761k994M155o727l95j1050l166P989J2050j7915k1380
19550B823p900k396K1890M613p997j2311R105J1901k4948l2463Q603K6826J7621
19537A5367J8862n057L083K8300J6800j848J0155k526m0958l522m1792J9354K6121
19524D2339J6968l4423k3023J4033K3164k8595k0748q996J9832L4679j7903k3775
19512f448J3219j2879J8545R429K5932l5536j2054n346J510j7240j1345N1730
19500A9517J6478N242J0855L193k7253q896L0798J2253k4468N674J975K6924j365
19487G0927Q702p254k4473l1608j5282J6133J8793O371K3735J7245k9210l5539
$$ plain form
19475 18540 32236 66400 65922 33860 2957 11119 -8246 -15254 -2683 -4288 3 34320 44179
19462 44179 9319 12865 21683 14927 34193 49547 35069 32345 37492 42807 29788 19419 17761
19449 17761 23085 14371 35692 67753 46974 -13401 -11152 -10685 -29645 -32299 -22549 -15545 11963
19436 11963 7421 3464 36926 60852 42637 31926 15098 -8198 1758 7272 15622 23019 24706
19423 24706 29141 12004 1321 12009 23692 18446 9996 21578 7664 3801 20716 16376 6426
19410 6426 16514 27340 47411 52826 73580 82754 54441 -9005 -15201 442 14247 4023
19398 4023 6581 14449 6578 20537 32941 11325 1659 6579 24150 19140 6989 -13 -6550
19385 -6550 18217 20218 9060 22631 49742 75389 39251 20921 -2936 -13967 -16455 -10082
$$ packed form
19475A8540J3696L4164m78l2062l0903Q162j9365p008J2571j605M291L4317R859
19462D4179l4860L546Q818o756J9266J5354j4478k724N147N315j3019j0369j658
19449A7761N324q714K1321L2061k0779o0375K249M67j8960k654R750P004K7508
19436A1963m542l957L3462K3926j8215j0711j6828k3296R956N514Q350P397J687
19423B4706M435j7137j0683J0688J1683n246q450J1582j3914l863J6915m340r950
19410F426J0088J0826K0071N415K0754R174k8313o3446o196J5643J3805j0224
19398D023K558P868p871J3959J2404k1616r666M920J7571n010j2151p002o537
19385f550K4767K001j1158J3571K7111K5647l6138j8330k3857j1031k488O373
$$ plain form
19373 -10082 100 17789 39403 42892 41597 16608 -5690 -7865 4157 12522 1794 11830
19361 11830 7082 36369 60756 57063 58186 28124 7652 25635 38594 33236 38257 52537 52766
19348 52766 40018 14188 17708 15022 22759 37366 30460 46798 52685 83654 64880 57804 42539
19335 42539 7906 17237 19525 25146 36393 41377 38385 34452 12011 -4138 -360 28584 51709
19322 51709 83441 59425 24361 33385 34351 42093 9273 -6401 -20268 -3174 22222 28976 23681
19309 23681 9233 18492 33683 41148 69555 69842 59816 68317 52533 24841 13849 -11221 -24329
19296 -24329 -29618 8283 35109 50804 35551 39424 62722 73491 61036 45800 58335 58354 37541
19283 37541 34022 -10809 -31992 -2555 33726 4405 814 25873 33475 64145 77225 63637
$$ packed form
19373a0082J0182J7689K1614L489j295k4989k2298k175J2022Q365j0728J0036
19361A1830m748K9287K4387l693J123l0062k0472J7983J2959n358N021J4280K29
19348E2766j2748k5830L520k686P737J4607o906J6338N887L0969j8774p076j5265
19335D2539l4633R331K288N621J1247M984k992l933k2441j6149L778K8944K3125
19322E1709L1732k4016l5064R024R66P742l2820j5674j3867J7094K5396O754n295
19309B3681j4448R259J5191P465K8407K87j0026Q501j5784k7692j0992k5070j3108
19296b4329n289L7901K6826J5695j5253L873K3298J0769j2455j5236J2535J9k0813
19283C7541l519m4831k1183K9437L6281k9321l591K5059P602L0670J3080j3588
$$ plain form
19271 63637 52368 35041 24208 42406 20986 -1988 -6076 -23668 -14846 15205 37136 56309
19259 56309 70253 59382 39893 30135 30035 20840 41322 66057 79974 66759 67791 80838 122700
19246 122700 150169 177014 165324 141023 114235 66869 54677 48923 56915 78861 58860 51100
19234 51100 55845 59936 71133 89508 97554 72655 47194 46674 60839 79639 66303 95469 98770
19221 98770 90548 78837 73518 74045 94017 116789 111538 105259 104660 117200 116801 130360 172043 219989
19207 219989 283960 303269 287641 286433 246013 206388 181375 178071 177395 160017 138868 143497
19195 143497 160247 188811 205870 266236 342260 378721 406737 396377 364856 304291 274298
19184 274298 266587 283902 279591 268149 237045 212605 188865 156061 131262 117445 105530 121807
$$ packed form
19271F3637j1269j7327j0833J8198k1420k2974m088j7592Q822L0051K1931J9173
19259E6309J3944j0871j9489r758j00r195K0482K4735J3917j3215J032J3047M1862
19246A22700K7469K6845j1690k4301k6788m7366j2192n754P992K1946k0001p760
19234E1100M745M091J1197J8375Q046k4899k5461n20J4165J8800j3336K9166L301
19221I8770q222j1711n319N27J9972K2772n251o279n99J2540l99J3559M1683M7946
19207B19989O3971J9309j5628j208m0420l9625k5013l304o76j7378k1149M629
19195A43497J6750K8564J7059O0366P6024L6461K8016j0360l1521o0565k9993
19184B74298p711J7315m311j1442l1104k4440k3740l2804k4799j3817j1915J6277
$$ plain form
19172 121807 140077 123400 126372 129001 132749 132154 130179 159516 160633 160451 157950 171491 162510 159068
19158 159068 132153 101345 120534 135695 148557 166140 188693 221337 273075 328604 382393
19147 382393 412830 414489 402603 392265 375711 357558 387397 414033 440307 420291 409972 379011
19135 379011 366461 357346 365758 358672 362950 352803 351049 314388 291886 285553 301637 336018 342535
19122 342535 380073 425096 477932 506991 503886 505191 473912 433691 405216 350650 311055 295852
19110 295852 300818 327058 355440 376446 375629 346376 329934 368850 404317 435290 429491 392129
19098 392129 355751 303663 258086 229944 205734 182069 186336 193299 204370 187223 218077 224786
19086 224786 241548 229262 232111 224453 205099 213206 217795 215902 206840 208727 201104 190983 198939
$$ packed form
19172A21807J8270j6677K972K629L748n95j975K9337J117j82k501J3541q981l442
19158A59068k6915l0808J9189J5161J2862J7583K2553L2644N1738N5529N3789
19147C82393L0437J659j1886j0338j6554j8153K9839K6636K6274k0016j0319l0961
19135C79011j2550r115Q412p086M278j0147j754l6661k2502o333J6084L4381O517
19122C42535L7538M5023N2836K9059l105J305l1279m0221k8475n4566l9595j5203
19110B95852M966K6240K8382K1006q17k9253j6442L8916L5467L0973n799l7362
19098C92129l6378n2088m5577k8142k4210k3665M267O963J1071j7147L0854O709
19086B24786J6762j2286K849p658j9354Q107M589j893r062J887p623j0121P956
$$ plain form
19073 198939 223776 248559 278415 293464 300656 308878 338776 377051 405382 407442 418792 434941
19061 434941 446587 456717 493828 533372 550671 570794 573932 569295 525009 492367 454672 413555
19049 413555 402401 421314 451091 462927 484241 520576 597845 682343 747466 774400 762780
19038 762780 727501 707657 726125 760910 821081 908412 1002014 1073898 1096348 1146855 1239616
19027 1239616 1395223 1592251 1795355 1908067 1923708 1879588 1812115 1728990 1697850 1648741
19017 1648741 1624290 1659260 1724133 1831279 1993613 2203257 2491856 2820584 3229359 3760162
19007 3760162 4427434 5249045 6257251 7467046 8921212 10902496 13810165 18161825
18999 18161825 24709744 34361882 48425416 68229082 94410484 125330846 154315310
$$ packed form
19073A98939K4837K4783K9856J5049P192Q222K9898L8275K8331K060J1350J6149
19061D34941J1646J0130L7111L9544J7299K0123L138m637m4286l2642l7695m1117
19049D13555j1154J8913K9777J1836K1314L6335P7269Q4498O5123K6934j1620
19038G62780l5279j9844J8468L4785O0171Q7331R3602P1884K2450N0507R2761
19027A239616J55607J97028K03104J12712J5641m4120o7473q3125l1140m9109
19017A648741k4451L4970O4873J07146J62334K09644K88599L28728M08775N30803
19007C760162O67272Q21611J008206J209795J454166J981284K907669M351660
18999A8161825O547919R652138J4063534J9803666K6181402L0920362K8984464
$$ plain form
18992 154315310 168074853 154490957 121830460 89111070 63951054 46019132 33575610
18985 33575610 25071809 19208827 15161314 12313368 10246805 8695518 7407807 6276537
18977 6276537 5309309 4503301 3865376 3394512 2985542 2674080 2417093 2212852 2051526
18968 2051526 1933088 1881876 1868686 1886660 1889904 1877360 1842077 1843158 1882552 1889782 1809447 1606987
18956 1606987 1367355 1160149 1051632 962326 909582 892998 874125 878213 854686 781107 699257
18945 699257 614912 559628 516011 486465 457949 416114 382580 383295 376660 382728 373639 385069
18933 385069 357403 310563 290251 289661 281973 301583 331153 319021 330301 298300 241203 217020
18921 217020 214403 221587 207788 188321 193233 202591 172761 192494 213084 192369 210267 250511
$$ packed form
18992A54315310J3759543j3583896l2660497l2719390k5160016j7931922j2443522
18985C3575610q503801n862982m047513k847946k066563j551287j287711j131270
18977F276537r67228q06008o37925m70864m08970l11462k56987k04241j61326
18968B051526j18438n1212j3190J7974L244j2544l5283J081L9394P230q0335k02460
18956A606987k39632k07206j08517q9306n2744j6584j8873M088k3527p3579q1850
18945F99257q4345n5284m3617k9546k8516m1835l3534P15o635O068r089J1430
18933C85069k7666m6840k0312n90p688J9610K9570j2132J1280l2001n7097k4183
18921B17020k617P184j3799j9467M912R358k9830J9733K0590k0715J7898M0244
$$ plain form
18909 250511 256354 239621 239039 206470 181578 181467 157787 151751 174177 214318 230655 199510 170060
18896 170060 178110 171811 174214 173492 148460 146194 148688 168274 193100 172843 161532 149315 157005
18883 157005 148601 136606 139603 156564 151056 126547 112465 115475 132384 190852 253624 300193
18871 300193 318939 328697 311038 303669 249180 180692 114934 96164 101153 113388 116870 114403
18859 114403 122520 114019 91275 115726 135334 144113 133122 132596 126776 111207 124442 139120 137906
18846 137906 136946 110107 94130 101849 100501 115658 137277 171585 181448 182426 183735 184308 200743
18833 200743 177519 191637 237653 252337 257208 275314 273937 283564 284459 241316 234682 225643 179497
18820 179497 142580 144870 158310 182349 174943 168333 172513 184585 190344 177569 183128 181896 190285
$$ packed form
18909B50511N843j6733n82l2569k4892j11k3680o036K2426M0141J6337l1145k9450
18896A70060Q050o299K403p22k5032k266K494J9586K4826k0257j1311j2217P690
18883A57005q404j1995K997J6961n508k4509j4082L010J6909N8468O2772M6569
18871C00193J8746R758j7659p369n4489o8488o5758j8770M989J2235L482k467
18859A14403Q117q501k2744K4451J9608Q779j0991n26n820j5569J3235J4678j214
18846A37906r60k6839j5977P719j348J5157K1619L4308R863R78J309N73J6435
18833B00743k3224J4118M6016J4684M871J8106j377R627Q95m3143o634r039m6146
18820A79497l6917K290J3440K4039p406o610M180J2072N759j2775N559j232Q389
$$ plain form
18807 190285 211492 208098 190618 185691 173871 183953 195906 238489 260295 238996 217586 216879
18795 216879 217306 180423 161165 174252 176750 197340 213708 209176 182839 180045 167471 133095
18783 133095 139302 153093 153206 156492 121192 124936 169281 178999 197126 225225 245505 243170 246846
18770 246846 240887 246704 264354 285693 292548 279779 248640 245677 242668 245335 306185 365139 359870
18757 359870 357304 345922 294770 305004 319266 295750 310814 362643 394685 398060 417906 459687
18745 459687 526202 599665 657580 646854 592900 523924 454892 410440 369121 333088 334390 343807
18733 343807 327595 341034 353866 372750 386957 393966 404784 392632 378867 401700 417023 457378
18721 457378 518893 538459 558627 587302 603837 655700 696641 705649 720546 718472 721397 711815
$$ packed form
18807A90285K1207l394j7480m927j1820J0082J1953M2583K1806k1299k1410p07
18795B16879M27l6883j9258J3087K498K0590J6368m532k6337k794j2574l4376
18783A33095O207J3791J13L286l5300L744M4345R718J8127K8099K0280k335L676
18770B46846n959N817J7650K1339O855j2769l1139k963l009K667O0850N8954n269
18757C59870k566j1382n1152J0234J4262k3516J5064N1829L2042L375J9846M1781
18745D59687O6515P3463N7915j0726n3954o8976o9032m4452m1319l6033J302R417
18733C43807j6212J3439J2832J8884J4207P009J0818j2152j3765K2833J5323M0355
18721D57378O1515J9566K0168K8675J6535N1863M0941R008J4897k074K925r582
$$ plain form
18709 711815 737485 777016 836510 903502 1002352 1099213 1208138 1369645 1586915 1726724 1811693
18698 1811693 1845415 1837289 1814748 1823529 1887267 2077761 2418563 2930972 3710067 4741568
18688 4741568 5903563 6823039 6942736 6366633 5906916 5900745 6368624 7288338 8723363
18679 8723363 11146981 15325572 22037993 31620525 42853795 50924129 50393385 44570799
18671 44570799 40574094 39818679 37527776 30235372 21990958 16457041 13349627 11776288
18663 11776288 11265010 11722843 13252414 15948374 19600252 23104070 24145343 21068738
18655 21068738 16167086 12205041 9616640 7916505 6777002 6063758 5667986 5468725
18647 5468725 5452161 5554662 5795340 6102245 6423412 6771876 7198344 7843598 8832290 10338014
$$ packed form
18709G11815K5670L9531N9494O6992R8850R6861J08925J61507K17270J39809Q4969
18698A811693L3722q126k2541Q781O3738J90494L40802N12409P79095J031501
18688D741568J161995R19476J19697n76103m59717o171M67879R19714J435025
18679H723363K423618M178591O712421R582532J1233270Q070334n30744n822586
18671D4570799l996705p55415k290903p292404q244414n533917l107414j573339
18663A1776288n11278M57833J529571K695960L651878L503818J041273l076605
18655B1068738m901652l962045k588401j700135j139503p13244l95772j99261
18647E468725j6564J02501K40678L06905L21167L48464M26468O45254R88692J505724
$$ plain form
18637 10338014 12678499 16229447 21283569 27547067 33435304 35904683 33269108 28254310
18629 28254310 24267624 22223989 21794273 22688309 24849232 28567851 34513704 44111382
18621 44111382 59777614 84371187 119483187 161508202 196028507 207419544 195611985
18614 195611985 169956274 134255151 96882911 69398404 52407007 42124207 36000346
18607 36000346 32885681 32391021 34349317 38052949 41232371 39728440 32735171 25226973
18599 25226973 19890847 16435786 14287960 13046435 12489328 12476621 13001779 14057128 15657027
18590 15657027 18145253 22088018 27655593 34124928 38912941 38398256 33869667 30306467
18582 30306467 29648820 31902232 37328442 46898334 62353614 85700637 117692809 155003123
$$ packed form
18637A0338014K340485L550948N054122O263498N888237K469379k635575n014798
18629B8254310l986686k043635m29716Q94036K160923L718619N945853R597678
18621D4111382J5666232K4593573L5112000M2025015L4520305J1391037j1807559
18614A95611985k5655711l5701123l7372240k7484507j6991397j0282800o123861
18607C6000346l114665m94660J958296L703632L179422j503931o993269p508198
18599B5226973n336126l455061k147826j241525n57107j2707N25158J055349J599899
18590A5657027K488226L942765N567575O469335M788013n14685m528589l563200
18582C0306467o57647K253412N426210R569892J5455280K3347023L1992172L7310314
$$ plain form
18574 155003123 186667671 202068614 199769011 176765766 136609583 96508049 68196492
18567 68196492 50826440 40137956 33230443 28576312 25500359 23824994 23586157 24909100
18559 24909100 27839976 31949232 35738057 36383753 31949694 24870860 18700775 14454329
18551 14454329 11684268 9820087 8520696 7555508 6820773 6273473 5935010 5769048 5765842
18542 5765842 5854572 5962619 6083452 6276313 6653416 7406497 8793197 11067279 14404980
18533 14404980 18613322 22642545 24126112 21577250 17226228 13800959 11848448 11099769
18525 11099769 11335707 12539302 15075376 19467002 25975351 33965464 40656225 42737180
18517 42737180 43350996 47174838 51540319 49453511 38769073 26443197 18128177 13335023
$$ packed form
18574A55003123L1664548J5400943k299603k3003245m0156183m0101534k8311557
18567F8196492j7370052j0688484o907513m654131l075953j675365k38837J322943
18559B4909100K930876M109256L788825O45696m434059p078834o170085m246446
18551A4454329k770061j864181j299391r65188p34735n47300l38463j65962l206
18542E765842Q8730J08047J20833J92861L77103P53081J386700K274082L337701
18533A4404980M208342M029223J483567k548862m351022l425269j952511p48679
18525A1099769K35938J203595K536074M391626O508349P990113O690761K080955
18517D2737180O13816L823842M365481k086808j0684438j2325876q315020m793154
$$ plain form
18509 13335023 10487769 8708102 7516583 6823366 6553589 6676493 7052351 7314142 6887550
18500 6887550 5712621 4488692 3606874 2986012 2539190 2243060 2037123 1847619 1669638
18491 1669638 1544684 1448539 1373969 1337308 1297677 1266036 1247717 1228323 1170724 1066983 950238
18480 950238 861777 804497 762987 697141 655635 655624 665216 656455 618231 582546 560235 545271
18468 545271 537969 524086 494707 472796 472373 477703 461360 427539 423220 419325 431645 455265 465872
18455 465872 469546 442583 432303 396602 400227 380464 331955 302742 285532 276127 216974 164377
18443 164377 175573 245359 277084 264851 264041 268975 284289 279807 271011 271879 281006 267316 235587
18430 235587 194292 205252 207428 203620 201683 205712 211058 237063 228074 216069 229783 276239 298929
$$ packed form
18509A3335023k847254j779667j191519o93217k69777J22904L75858K61791m26592
18500F887550j174929j223929q81818o20862m46822k96130k05937j89504j77981
18491A669638j24954r6145p4570l6661l9631l1641j8319j9394n7599j03741j16745
18480I50238q8461n7280m1510o5846m1506j1R592q761l8224l5685k2311j4964
18468E45271p302j3883k9379k1911m23N330j6343l3821m319l895J2320K3620J0607
18455D65872L674k6963j0280l5701L625j9763m8509k9213j7210r405n9153n2597
18443A64377J1196O9786L1725j2233q10M934J5314m482q796Q68R127j3690l1729
18430B35587m1295J0960K176l808j937M029N346K6005q989j2005J3714M6456K2690
$$ plain form
18417 298929 280037 265016 252456 238700 242695 250582 245691 232168 228819 235122 237721 239883 217474
18404 217474 190681 193295 198106 212269 225344 240612 253966 248759 233748 217331 214482 240314
18392 240314 229395 235548 239832 226440 240962 279648 322307 343791 382403 448154 531985 609249
18380 609249 701250 796283 833120 816142 737417 638104 532890 439228 365370 302835 268746
18369 268746 249261 248911 263478 246783 230912 237308 197921 170569 166226 176647 149808 146362
18357 146362 148322 154236 155290 170190 157397 143498 146709 162393 161967 152869 165293 151111 142897
18344 142897 131107 112309 104030 100329 93205 114934 155101 135091 126372 143722 131474 126394
18332 126394 105641 90859 94112 101822 98450 101446 119645 125413 122085 128604 145698 120241 122530
$$ packed form
18417B98929j8892j5021j2560j3756L995P887m891j3523l349O303K599K162k2409
18404B17474k6793K614M811J4163J3075J5268J3354n207j5011j6417k849K5832
18392B40314j0919O153M284j3392J4522L8686M2659K1484L8612O5751Q3831P7264
18380F09249R2001R5033L6837j6978p8725r9313j05214r3662p3858o2535l4089
18369B68746j9485l50J4567j6695j5871O396l9387k7352m343J0421k6839l446
18357A46362J960N914J054J4900j2793j3899L211J5684m26r098J2424j4182q214
18344A42897j1790j8798q279l701p124K1729M0167k0010q719J7350j2248n080
18332A26394k0753j4782L253P710l372K996J8199N768l328O519J7094k5457K289
$$ plain form
18319 122530 124831 110469 113123 93349 99990 97057 96463 111703 112352 132350 105827 86220 83852
18306 83852 78023 52953 37027 46863 82033 89642 91086 100556 102094 123746 115014 105155 111158
18293 111158 109887 89178 74111 91024 100495 103158 109754 92897 93173 93139 78936 57938 43073
18280 43073 57870 55082 55974 43966 32020 45099 71149 61234 50281 46186 75049 85323 81515
18267 81515 77602 64874 51817 58641 37701 14879 19257 32037 38618 47874 40840 20303 30539
18254 30539 42963 55737 39117 56288 60717 43419 59375 70340 68163 40292 18741 21010
18242 21010 39719 22677 14340 25030 49972 46571 47431 39735 22843 44968 31880 17113 6083
18229 6083 22591 65602 86584 76142 72369 53746 31326 4604 2224 17733 5811 -5679
$$ packed form
18319A22530K301j4362K654j9774O641k933n94J5240O49J9998k6523j9607k368
18306H3852n829k5070j5926R836L5170P609J444R470J538K1652q732r859O003
18293A11158j271k0709j5067J6913R471K663O596j6857K76l4j4203k0998j4865
18280D3073J4797k788Q92j2008j1946J3079K6050r915j0953m095K8863J0274l808
18267H1515l913j2728j3057O824k0940k2822M378J2780O581R256p034k0537J0236
18254C0539J2424J2774j6620J7171M429j7298J5956J0965k177k7871k1551K269
18242B1010J8709j7042q337J0690K4942l401Q60p696j6892K2125j3088j4767j1030
18229F083J6508M3011K0982j0442l773j8623k2420k6722k380J5509j1922j1490
$$ plain form
18217 -5679 1283 3859 6635 26158 48110 73173 94149 70139 35768 41362 47984 31151 27101
18204 27101 27304 29695 33059 57046 63842 54052 56807 63458 52014 55107 63925 43790 55134 70215
18190 70215 72366 80354 84333 49362 11536 18688 23192 31115 35497 44918 48505 24409 1445
18177 1445 4868 6728 10445 15933 26773 14790 42799 48742 40834 36161 52812 43766 38307 47154
18163 47154 43473 34575 56715 80231 51119 24006 26262 53079 59689 74187 85704 88693 102739
18150 102739 98498 85205 90561 112396 136098 123683 96727 90067 119875 137010 186622 249696
18138 249696 285032 337314 369673 408380 395796 358155 314554 270963 221819 208209 241053
18127 241053 208864 203183 230728 266068 326380 387459 427945 431408 400545 343205 284370 268233
$$ packed form
18217e679O962K576K776J9523K1952K5063K0976k4010l4371N594O622j6833m050
18204B7101K03K391L364K3987O796r790K755O651j1444L093Q818k0135J1344J5081
18190G0215K151P988L979l4971l7826P152M504P923M382R421L587k4096k2964
18177A445L423J860L717N488J0840j1983K8009N943p908m673J6651r046n459Q847
18163D7154l681q898K2140K3516k9112k7113K256K6817O610J4498J1517K989J4046
18150A02739m241j3293N356K1835K3702j2415k6956o660K9808J7135M9612O3074
18138B49696L5336N2282L2359L8707j2584l7641m3601m3591m9144j3610L2844
18127B41053l2189n681K7545L5340O0312O1079M0486L463l0863n7340n8835j6137
$$ plain form
18115 268233 269917 287758 324664 329355 299435 245147 161501 123055 128303 143481 135470 111175
18103 111175 103644 107975 83407 74408 70838 67697 102276 110120 115209 125151 137906 166118 178358
18090 178358 180870 170026 154964 151893 146924 136697 135129 135519 145657 139568 169907 209982 273140
18077 273140 322930 348050 369867 385739 379848 356303 364213 353611 317027 299603 293204 287129
18065 287129 273581 328818 393081 428625 443317 476988 488418 446324 423138 416032 427451 462515
18053 462515 455266 409514 373077 340481 333212 336625 368033 389473 384171 375936 393698 360536
18041 360536 275317 215309 187346 174043 137198 104368 81613 89886 99610 91232 98092 90917
18029 90917 93108 99528 111820 111315 110478 113486 123060 151696 147424 146758 125370 93691 111448 129863
$$ packed form
18115B68233J684J7841L6906M691k9920n4288q3646l8446N248J5178q011k4295
18103A11175p531M331k4568q999l570l141L4579P844N089R942J2755K8212J2240
18090A78358K512j0844j5062l071m969j0227j568L90J0138o089L0339M0075O3158
18077B73140M9790K5120K1817J5872n891k3545P910j0602l6584j7424o399o075
18065B87129j3548N5237O4263L5544J4692L3671J1430m2094k3186p106J1419L5064
18053D62515p249m5752l6437l2596p269L413L1408K1440n302q235J7762l3162
18041C60536q5219o0008k7963j3303l6845l2830k2755Q273R724q378O860p175
18029I0917K191O420J2292n05q37L008R574K8636m272o66k1388l1679J7757J8415
$$ plain form
18015 129863 116931 94375 126163 144508 161924 189936 224796 242311 273956 316734 348925
18004 348925 365918 381798 378156 347698 316434 254469 169731 162551 159077 151668 154178 178490
17992 178490 204943 208898 241485 239026 249933 297436 327536 348207 350544 302190 234390 196910
17980 196910 165839 140193 114593 114924 110119 109465 70468 65584 89713 78837 63106 71883 48866
17967 48866 35595 65813 87429 70735 76879 85912 102849 84892 49277 44957 31348 34075
17955 34075 39054 23110 23620 33876 40238 49651 31950 22268 6258 21500 32754 33635 3234
17942 3234 -13998 -16810 -8523 16901 43349 64772 63010 57737 42403 61427 64006 76373 76207
17929 76207 89515 82201 71370 72100 77175 64491 80171 57819 31313 26137 25624 28711 63741
$$ packed form
18015A29863j2932k2556L1788J8345J7416K8012L4860J7515L1645M2778L2191
18004C48925J6993J5880l642l0458l1264o1965q4738p180l474p409K510K4312
17992A78490K6453L955L2587k459J0907M7503L0100K0671K337m8354o7800l7480
17980A96910l1071k5646k5600L31m805o54l8997m884K4129j0876j5731Q777k3017
17967D8866j3271L0218K1616j6694O144R033J6937j7957l5615m320j3609K727
17955C4075M979j5944N10J0256O362R413j7701r682j6010J5242J1254Q81l0401
17942C234j7232k812Q287K5424K6448K1423j762n273j5334J9024K579J2367j66
17929G6207J3308p314j0831P30N075j2684J5680k2352k6506n176n13L087L5030
$$ plain form
17916 63741 94106 89157 77888 62340 40468 60990 93939 102427 72933 51529 52692 59120
17904 59120 23682 12260 23686 31216 14927 15043 24574 39403 32868 30450 -3174 4006 34738
17891 34738 10313 29795 68486 63119 53360 32836 10664 35114 51867 68029 41404 36278
17879 36278 73519 97146 110827 114609 93382 71282 71889 76928 89635 74630 70950 60389 51558
17866 51558 58843 50288 69845 105415 122918 111055 108601 90530 83975 86805 69047 68432 71264
17853 71264 70898 69970 30993 12529 12440 53530 84826 60642 64230 38409 15512 34527 37099
17840 37099 30209 38918 49212 15812 45224 88026 117496 127829 103473 90378 87919 73371
17828 73371 87676 121749 111425 92053 85844 75889 79945 85276 69392 63730 86505 76743 53947
$$ packed form
17916F3741L0365m949j1269j5548k1872K0522L2949Q488k9494k1404J163O428
17904E9120l5438j1422J1426P530j6289J16R531J4829o535k418l3624P180L0732
17891C4738k4425J9482L8691n367r759k0524k2172K4450J6753J6162k6625n126
17879C6278L7241K3627J3681L782k1227k2100O07N039J2707j5005l680j0561q831
17866E1558P285q555J9557L5570J7503j1863k454j8071o555K830j7758o15K832
17853G1264l66r28l8977j8464q9M1090L1296k4184L588k5821k2897J9015K572
17840C7099o890Q709J0294l3400K9412M2802K9470J0333k4356j3095k459j4548
17828G3371J4305L4073j0324j9372o209r955M056N331j5884n662K2775r762k2796
$$ plain form
17815 53947 55422 51114 64965 95459 97720 90993 66248 57269 57142 57976 58538 72243 84104 99634
17801 99634 71834 61187 67450 64177 64770 33678 27597 45443 28959 21089 35435 44030 60036
17788 60036 71757 104561 106568 112575 94607 92826 122880 140891 108098 103566 97410 77372 82234
17775 82234 77315 99320 92619 76965 78917 75339 90743 96670 64283 38216 40365 49748 70480
17762 70480 71786 64761 68541 62104 71081 109020 145155 150204 128692 117377 131422 129268 102734
17749 102734 69801 55011 82635 103097 70951 75690 87238 54937 59598 102153 116597 110242
17737 110242 108094 134083 131517 137323 143182 148839 153795 144461 127932 111911 127278 110077 92435
17724 92435 78904 78269 102548 117646 125792 114640 117403 121585 121292 134421 126376 97460 99525
$$ packed form
17815E3947J475m308J3851L0494K261o727k4745q979j27Q34N62J3705J1861J5530
17801I9634k7800j0647O263l273N93l1092o081J7846j6484p870J4346Q595J6006
17788F0036J1721L2804K007O007j7968j781L0054J8011l2793m532o156k0038M862
17775H2234m919K2005o701j5654J952l578J5404N927l2387k6067K149R383K0732
17762G0480J306p025L780o437Q977L7939L6135N049k1512j1315J4045k154k6534
17749A02734l2933j4790K7624K0462l2146M739J1548l2301M661M2555J4444o355
17737A10242k148K5989k566N806N859N657M956r334j6529j6021J5367j7201j7642
17724I2435j3531o35K4279J5098Q146j1152K763M182k93J3129q045k8916K065
$$ plain form
17711 99525 111481 134114 140667 142862 130391 94673 108439 148427 170534 188838 205119 201034
17699 201034 199562 192362 165302 156424 159754 169103 173842 171396 180397 172658 179668 168820 166730 158466
17685 158466 146308 129308 131369 150400 170363 193346 146557 112490 137180 182748 183101 195591
17673 195591 188105 207624 223872 216764 214416 232259 237229 216556 248152 296440 311147 330485
17661 330485 359184 364447 389461 432896 430760 463796 483247 480576 495186 479745 474939 431455
17649 431455 431254 417242 381170 333560 299203 282570 295682 294269 279109 316306 339143 346222
17637 346222 351731 365227 377697 341898 328936 320429 310934 299999 291640 263731 243156 249151
17625 249151 253345 287766 275289 268976 258575 253454 245240 241925 219390 243869 266079 248508
$$ packed form
17711I9525J1956K2633O553K195j2471l5718J3766L9988K2107J8304J6281m085
17699B01034j472p200k7060q878L330R349M739k446R001p739P010j0848k090q264
17685A58466j2158j7000K061J9031J9963K2983m6789l4067K4690M5568L53J2490
17673A95591p486J9519J6248p108k348J7843M970k0673L1596M8288J4707J9338
17661C30485K8699N263K5014M3435k136L3036J9451k671J4610j5441m806m3484
17649D31455k01j4012l6072m7610l4357j6633J3112j413j5160L7197K2837P079
17637C46222N509J3496J2470l5799j2962q507r495j0935q359k7909k0575N995
17625B49151M194L4421j2477o313j0401n121q214l315k2535K4479K2210j7571
$$ plain form
17613 248508 227466 226171 236970 246098 264795 265863 275266 281787 269087 279343 291701 288995 277213
17600 277213 267008 271623 278158 268982 269078 263151 252325 260267 259362 263764 272837 271996 281984 265336
17586 265336 274292 300407 327805 348322 328974 314366 310016 329361 343065 347367 320318 297707
17574 297707 301570 317747 343327 323875 332701 347790 361100 391805 392119 390943 411971 420826 391858
17561 391858 384858 413316 440228 455107 442194 419036 441499 451911 441456 427406 439269 462177
17549 462177 486443 483804 491083 491959 492022 501194 495461 482069 484656 472513 495028 522509 567771
17536 567771 594950 557879 549771 578370 579524 585451 612151 657297 655037 664496 664560 667707 683582
17523 683582 697670 696928 707460 740781 731579 732853 742472 759737 806466 840276 842037 837419 854372
$$ packed form
17613B48508k1042j295J0799R128J8697J068R403O521j2700J0256J2358k706j1782
17600B77213j0205M615O535r176R6n927j0826P942r05M402R073q41R988j6648
17586B65336Q956K6115K7398K0517j9348j4608m350J9345J3704M302k7049k2611
17574B97707L863J6177K5580j9452Q826J5089J3310L0705L14j176K1028Q855k8968
17561C91858p000K8458K6912J4879j2913k3158K2463J0412j0455j4050J1863K2908
17549D62177K4266k639P279Q76O3R172n733j3392K587j2143K2515K7481M5262
17536E67771K7179l7071q108K8599J154N927K6700M5146k260R459O4L147J5875
17523F83582J4088p42J0532L3321r202J274R619J7265M6729L3810J761m618J6953
$$ plain form
17510 854372 899746 939914 983486 995952 997533 1015538 1024393 1023724 1044496 1015422 1002636 1015200
17498 1015200 1041578 1021297 990486 986963 1004361 1042963 1068843 1085674 1106432 1119968 1130322
17487 1130322 1158731 1182040 1202581 1210112 1235247 1250277 1279991 1315753 1361827 1388746 1389114 1417615
17475 1417615 1452340 1464130 1493967 1517148 1536338 1561471 1575663 1606364 1648483 1701168 1734721
17464 1734721 1777345 1818778 1870822 1921501 1965406 2032648 2086864 2104539 2165410 2217387 2260774
17453 2260774 2315861 2401663 2489418 2544791 2608209 2675700 2759615 2835687 2910890 2995003 3105402
17442 3105402 3197325 3302391 3417028 3509423 3618648 3726706 3845855 3971963 4126627 4290240
17432 4290240 4445715 4591622 4758098 4939533 5112535 5328832 5543263 5757766 5978208
$$ packed form
17510H54372M5374M0168M3572J2466J581J8005Q855o69K0772k9074j2786J2564
17498A015200K6378k0281l0811l523J7398L8602K5880J6831K0758J3536J0354
17487A130322K8409K3309K0541P531K5135J5030K9714L5762M6074K6919L68K8501
17475A417615L4725J1790K9837K3181J9190K5133J4192L0701M2119N2685L3553
17464A734721M2624M1433N2044N0679M3905O7242N4216J7675O0871N1977M3387
17453B260774N5087Q5802Q7755N5373O3418O7491Q3915P6072P5203Q4113J10399
17442C105402R1923J05066J14637R2395J09225J08058J19149J26108J54664J63613
17432D290240J55475J45907J66476J81435J73002K16297K14431K14503K20442
$$ plain form
17423 5978208 6228406 6503032 6767568 7052034 7368545 7728285 8109103 8512205 8916633
17414 8916633 9323385 9795777 10315392 10867294 11472046 12113306 12802617 13574549 14410167
17405 14410167 15301583 16249337 17308751 18466111 19722942 21078970 22582717 24211738
17397 24211738 26014569 27988264 30119924 32436337 34954728 37688215 40632498 43764580
17389 43764580 47086989 50595431 54240663 57963625 61707222 65293637 68643074 71681665
17381 71681665 74243242 76193389 77427886 77911319 77612868 76582709 74834524 72485106
17373 72485106 69646530 66440166 62989316 59419725 55821815 52232978 48762931 45457669
17365 45457669 42299287 39333967 36541999 33965317 31557304 29324668 27281967 25441075
$$ packed form
17423E978208K50198K74626K64536K84466L16511L59740L80818M03102M04428
17414H916633M06752M72392N19615N51902O04752O41260O89311P71932Q35618
17405A4410167Q91416R47754J059414J157360J256831J356028J503747J629021
17397B4211738J802831J973695K131660K316413K518391K733487K944283L132082
17389D3764580L322409L508442L645232L722962L743597L586415L349437L038591
17381G1681665K561577J950147J234497M83433k98451j030159j748185k349418
17373G2485106k838576l206364l450850l569591l597910l588837l470047l305262
17365D5457669l158382k965320k791968k576682k408013k232636k042701j840892
$$ plain form
17357 25441075 23728994 22144690 20731376 19432014 18198630 17069043 16057302 15100986
17349 15100986 14234385 13418219 12669123 12002902 11387716 10782175 10253115 9770212 9277865
17340 9277865 8839996 8468613 8097901 7746810 7384179 7079407 6769114 6478527 6233344
17331 6233344 5981783 5735431 5537063 5345678 5157348 4958664 4751262 4550597 4399270
17322 4399270 4264303 4148266 4028958 3901769 3796947 3698826 3555592 3407100 3318380 3236061
17312 3236061 3169954 3057413 2948994 2862645 2774660 2696034 2627901 2566699 2508842 2473974 2426391
17301 2426391 2322612 2256160 2192384 2136667 2083404 2033996 2022624 2014206 1955262 1893151 1857285
17290 1857285 1791274 1746213 1715922 1702286 1673902 1634487 1597165 1543266 1533986 1519174 1470554
$$ packed form
17357B5441075j712081j584304j413314j299362j233384j129587j011741r56316
17349A5100986q66601q16166p49096o66221o15186o05541n29060m82903m92347
17340I277865m37869l71383l70712l51091l62631l04772l10293k90587k45183
17331F233344k51561k46352j98368j91385j88330j98684k07402k00665j51327
17322D399270j34967j16037j19308j27189j04822r8121j43234j48492q8720q2319
17312C236061o6107j12541j08419q6349q7985p8626o8133o1202n7857l4868m7583
17301B426391j03779o6452o3776n5717n3263m9408j1372q418n8944o2111l5866
17290A857285o6011m5061l0291j3636k8384l9415l7322n3899r280j4812m8620
$$ plain form
17279 1470554 1421636 1395617 1361332 1353526 1316440 1296842 1292365 1268470 1268009 1266510 1227782 1193587
17267 1193587 1193240 1188576 1162787 1159620 1154172 1105234 1064314 1043876 994788 965588 966623 971148 972589
17254 972589 971970 973701 960631 940072 931892 910033 873871 869124 888946 902587 894108 867438 877075
17241 877075 858851 847720 866007 852890 830367 802814 775340 749983 712268 673278 646927
17230 646927 642132 619856 612314 609152 619244 631143 622734 588969 604079 628561 638153 632994 589449
17217 589449 538400 528613 528106 546781 550110 506233 497763 532267 549123 525679 495593 478457
17205 478457 478295 479084 474224 474807 463280 438650 427064 449792 424793 409634 383174 393897 428139
17192 428139 425813 432220 447524 429970 414111 381839 374369 367763 348421 344966 343702 348705 366878
$$ packed form
17279A470554m8918k6019l4285p806l7086j9598m477k3895m61j499l8728l4195
17267A193587l47m664k5789l167n448m8938m0920k0438m9088k9200J035M525J441
17254I72589o19J731j3070k0559q180k1859l6162m747J9822J3641q479k6670R637
17241H77075j8224j1131J8287j3117k2523k7553k7474k5357l7715l8990k6351
17230F46927m795k2276p542l162J0092J1899q409l3765J5110K4482R592n159m3545
17217E89449n1049r787n07J8675L329m3877q470L4504J6856k3444l0086j7136
17205D78457j62P89m860N83j1527k4630j1586K2728k4999j5159k6460J0723L4242
17192D28139k326O407J5304j7554j5859l2272p470o606j9342l455j264N003J8173
$$ plain form
17179 366878 399451 403042 402136 368564 359924 356652 387755 398634 384904 368065 353701 335940
17167 335940 293015 295876 338552 365135 354763 339362 362914 369731 351502 322002 297613 286058
17155 286058 289110 294088 305220 321207 330659 314573 300262 285128 273260 275023 281367 269715
17143 269715 275729 280166 295855 296957 252709 242614 239892 253577 255213 257932 244524 221267 232719
17130 232719 236846 257120 250258 236254 226958 232347 234153 235640 244447 252664 251343 273008 280699
17117 280699 269524 251925 222733 204893 221216 258008 272867 303599 325999 322617 334156 360260
17105 360260 385566 413914 464247 474642 444821 417311 419905 397394 354014 338475 336610 327247
17093 327247 282236 250687 225506 241896 269321 248095 229768 227945 217642 225595 246865 229989
$$ packed form
17179C66878L2573L591r06l3572q640l272L1103J0879j3730j6839j4364j7761
17167C35940m2925K861M2676K6583j0372j5401K3552O817j8229k9500k4389j1555
17155B86058L052M978J1132J5987R452j6086j4311j5134j1868J763O344j1652
17143B69715O014M437J5689J102m4248j0095k722J3685J636K719j3408k3257J1452
17130B32719M127K0274o862j4004r296N389J806J487Q807Q217j321K1665P691
17117B80699j1175j7599k9192j7840J6323L6792J4859L0732K2400l382J1539K6104
17105C60260K5306K8348N0333J0395k9821k7510K594k2511m3380j5539j865r363
17093C27247m5011l1549k5181J6390K7425k1226j8327j823j0303P953K1270j6876
$$ plain form
17081 229989 211678 196666 181933 146544 173195 180353 148294 132675 121310 113623 129419 167251
17069 167251 157065 134847 106682 93500 96113 129128 130974 136796 141420 115682 74316 66656
17057 66656 89238 124153 132610 140182 141919 127613 139316 136411 131375 148402 151878 144647 142952
17044 142952 132617 114760 147856 141943 117454 133944 113106 93585 113717 122292 118366 128372
17032 128372 138396 131361 135109 105037 77252 58945 66372 80522 94784 107906 120260 138351
17020 138351 124055 119739 119020 102750 80546 99798 112140 114788 106610 95007 97318 94841 113400
17007 113400 107678 106577 106667 109854 113799 103084 103129 111464 109132 87502 66746 63588 70269 83578
16993 83578 89251 77301 79923 91939 93544 92391 105142 86655 61463 55245 74239 84707 87815
$$ packed form
17081B29989j8311j5012j4733l5389K6651P158l2059j5619j1365p687J5796L7832
17069A67251j0186k2218k8165j3182K613L3015J846N822M624k5738m1366p660
17057F6656K2582L4915Q457P572J737j4306J1703k905n036J7027L476p231j695
17044A42952j0335j7857L3096n913k4489J6490k0838j9521K0132Q575l926J0006
17032A28372J0024p035L748l0072k7785j8307P427J4150J4262J3122J2354J8091
17020A38351j4296m316p19j6270k2204J9252J2342K648q178j1603K311k477J8559
17007A13400n722j101R0L187L945j0715M5Q335k332k1630k0756l158O681J3309
16993H3578N673j1950K622J2016J605j153J2751j8487k5192o218J8994J0468L108
$$ plain form
16980 87815 92816 88692 89024 109660 113557 72116 61952 69142 78791 80704 42944 38382 83980
16967 83980 107481 113916 108614 101210 95651 94782 96277 94556 80640 62790 60190 45895 32498
16954 32498 47374 52317 63634 56059 66911 77554 58198 33123 48810 46899 63610 67454
16942 67454 70713 75195 98100 101314 84747 25968 35290 33834 7727 5546 18947 25890 38424
16929 38424 62522 40200 36404 51736 37423 32821 46357 41304 13330 10079 3411 11577 32421
16916 32421 69194 100377 92381 48691 61672 71373 79381 74562 82465 92264 70260 59259 47475
16903 47475 48936 48248 44640 42992 33095 31887 29626 28094 44534 50746 40907 34839 73597 55818
16889 55818 49253 58607 46795 52686 39515 36323 54420 37179 33462 26836 52584 50709 41604
$$ packed form
16980H7815N001m124L32K0636L897m1441j0164P190R649J913l7760m562M5598
16967H3980K3501O435n302p404n559q69J495j721j3916j7850k600j4295j3397
16954C2498J4876M943J1317p575J0852J0643j9356k5075J5687j911J6711L844
16942F7454L259M482K2905L214j6567n8779R322j456k6107k181J3401O943J2534
16929C8424K4098k2322l796J5332j4313m602J3536n053k7974l251o668Q166K0844
16916C2421L6773L1183p996m3690J2981R701Q008m819P903R799k2004j1001j1784
16903D7475J461o88l608j648r897j208k261j532J6440O212r839o068L8758j7779
16889E5818o565R354j1812N891j3171l192J8097j7241l717o626K5748j875r105
$$ plain form
16876 41604 35107 24805 9974 30721 43561 49969 56269 47217 33681 34786 38112 26030 22209
16863 22209 39275 64150 49528 40272 79544 66833 18739 36323 60327 66318 44481 47292
16851 47292 51850 43942 36469 41934 38001 14871 10974 13193 -3517 7898 9168 -13354 -5742
16838 -5742 7136 33525 61896 71613 83502 71285 73899 52255 32973 59 -7866 2047 1018
16825 1018 -2159 -4866 2123 23567 12902 7347 13619 28246 46483 40506 39867 37863 15657 12822
16811 12822 27198 23484 39335 17566 12453 26860 14196 28354 50232 36338 13797 -5328
16799 -5328 -5346 -2074 9142 14408 30164 26436 21779 15447 32699 34517 33356 28278 7678 13362
16785 13362 35413 23302 -24177 -39802 -15160 5527 18484 26435 43899 42356 4470 -20728
$$ packed form
16876D1604o497j0302j4831K0747J2840O408O300r052j3536J105L326j2082l821
16863B2209J7066K4875j4622r256L9272j2711m8094J7584K4004N991k1837K811
16851D7292M558p908p473N465l933k3130l897K219j6710J1415J270k2522P612
16838e742J2878K6389K8371R717J1889j2217K614k1644j9282l2914p925R913j029
16825A018l177k707O989K1444j0665n555O272J4627J8237n977o39k004k2206k835
16811A2822J4376l714J5851k1769n113J4407j2664J4158K1878j3894k2541j9125
16799e328j8L272J1216N266J5756l728m657o332J7252J818j161n078k0600N684
16785A3362K2051j2111m7479j5625K4642K0687J2957P951J7464j543l7886k5198
$$ plain form
16773 -20728 -14815 -11496 -15278 -28120 -47936 -27526 -1620 -487 -6282 -35037 -49986 -37939 -6838
16760 -6838 22174 32433 11995 -12409 1168 -20125 -5175 21954 28940 51942 45283 22389
16748 22389 15292 22330 3005 -11194 16396 19829 18507 18238 13601 23393 38486 33277 28507 47006
16734 47006 59500 34446 33570 26186 -4471 -8637 5779 -2639 -6042 -9124 9494 4929 2684
16721 2684 1142 2425 15807 18193 5955 17961 27783 22883 18147 -11956 -7207 10348 38552
16708 38552 14980 35438 46142 49886 38574 22110 39238 39476 39241 44916 66105 57744 45559
16695 45559 37125 19641 8350 7199 26959 27743 10547 -1559 32620 69859 64720 42904 23108
16682 23108 14178 38544 48644 58726 46780 46038 58357 51548 30657 16975 1269 21972
$$ packed form
16773b0728N913L319l782j2842j9816K0410K5906J133n795k8755j4949J2047L1101
16760f838K9012J0259k0438k4404J3577k1293J4950K7129O986K3002o659k2894
16748B2389p097P038j9325j4199K7590L433j322k69m637R792J5093n209m770J8499
16734D7006J2494k5054q76p384l0657m166J4416q418l403l082J8618m565k245
16721B684j542J283J3382K386j2238J2006R822m900m736l0103M749J7555K8204
16708C8552k3572K0458J0704L744j1312j6464J7128K38k35N675K1189q361j2185
16695D5559q434j7484j1291j151J9760P84j7196j2106L4179L7239n139k1816j9796
16682B3108q930K4366J0100J0082j1946p42J2319o809k0891j3682j5706K0703
$$ plain form
16670 21972 5103 6916 -4514 -4141 1225 36006 51442 34957 14776 16909 22479 18924 -29946
16657 -29946 -32031 -2911 12348 -172 8842 19527 10083 -626 -1268 -21763 -30474 -28858 3740
16644 3740 31762 19523 6601 -2923 -5306 26597 2390 -13445 -8457 10310 16665 29948 32443
16631 32443 45980 56246 38883 14820 -3126 5777 24058 10558 -14288 -37628 -53344 -48534
16619 -48534 -12764 3519 12241 6958 -2645 4508 18380 19047 7549 -19879 -28656 -24743 -864
16606 -864 -9694 -20390 -29327 1724 35660 36976 19929 3255 -3911 21103 45693 55843 54993
16593 54993 37387 15978 -2915 -9605 -6277 -3118 -19926 -20210 -9633 -16115 9115 18616 55304
16580 55304 80732 42554 25551 26339 21172 26155 30249 21914 12454 18109 18500 -1406 780 9217
$$ packed form
16670B1972j6869J813j1430L73N366L4781J5436j6485k0181K133N570l555m8870
16657b9946k085K9120J5259j2520R014J0685r444j0709o42k0495q711J616L2598
16644C740K8022j2239j2922r524k383L1903k4207j5835M988J8767O355J3283K495
16631C2443J3537J0266j7363k4063j7946Q903J8281j3500k4846k3340j5716M810
16619d8534L5770J6283Q722n283r603P153J3872O67j1498k7428q777L913K3879
16606h64q830j0696q937L1051L3936J316j7047j6674p166K5014K4590J0150q50
16593E4993j7606k1409j8893o690L328L159j6808k84J0577o482K5230R501L6688
16580E5304K5428l8178j7003P88n167M983M094q335r460N655L91j9906K186Q437
$$ plain form
16566 9217 18419 6144 -6543 6878 12011 3786 5796 32976 46564 46378 53568 66222 40062
16553 40062 26628 24302 26820 52505 42193 16244 -16698 -20667 -2390 1244 -7756 -1022 860
16540 860 15414 25570 28880 12161 12017 30389 4555 -2702 5569 -2462 -684 59846 73197
16527 73197 60110 34849 37723 49838 42166 42902 72796 92598 65111 31334 831 -11740
16515 -11740 633 15624 38081 38773 18349 757 2316 8805 -12725 -6258 -18375 -37136 -24130
16502 -24130 -8562 8485 -10195 -11760 -6564 -1411 6197 12560 20345 5947 -7087 -7689 -16929
16489 -16929 -35152 -29887 -5821 10834 -8324 -30513 -24807 -25012 4836 36248 25072 12851
16477 12851 4226 -5234 8192 -5805 -13444 -14088 -19809 -13446 -8674 13789 9297 8007 14658 26175
$$ packed form
16566I217R202j2275j2687J3421N133q225K010K7180J3588j86P190J2654k6160
16553D0062j3434k326K518K5685j0312k5949l2942l969J8277L634r000O734J882
16540H60J4554J0156L310j6719j44J8372k5834p257Q271q031J778O0530J3351
16527G3197j3087k5261K874J2115p672P36K9894J9802k7487l3777l0503j2571
16515a1740J2373J4991K2457O92k0424j7592J559O489k1530O467j2117j8761J3006
16502b4130J5568J7047j8680j565N196N153P608O363P785j4398j3034o02r240
16489a6929j8223N265K4066J6655j9158k2189N706k05K9848L1412j1176j2221
16477A2851q625r460J3426j3997p639o44n721O363M772K2463m492j290O651J1517
$$ plain form
16463 26175 40007 52319 36326 -4716 -6316 4181 10151 18761 11022 32971 41156 25574 -10534
16450 -10534 -33097 -26818 -20419 -7418 -6010 -5158 -4658 12532 27354 34389 20416 18572 10300 10578
16436 10578 7920 4034 -23028 -20733 12482 -5636 -6526 3950 1194 21121 11495 15490 14995 17660
16422 17660 -15446 -4814 13705 1228 -4931 -9267 779 -960 9610 3771 21579 12734 4415
16409 4415 13883 15315 24171 21018 6247 4401 -5342 -14520 -4184 -6797 -5853 6495 -12389 -25335
16395 -25335 -12974 -44461 -47425 -19918 1636 13955 5218 -14655 -21461 3358 14797 27585
16383 27585 14203 -19029 -50452 -53493 -36113 -26497 -8929 -23047 -17160 -23075 -25418 -17888 -33892
16370 -33892 -38611 -14295 -6565 -12311 -6824 -5599 -3250 5584 -2982 -42670 -48293 -39285 -25244 -7455
$$ packed form
16463B6175J3832J2312j5993m1042j600J0497N970Q610p739K1949Q185j5582l6108
16450a0534k2563O279O399J3001J408Q52N00J7190J4822P035j3973j844q272K78
16436A0578k658l886k7062K295L3215j8118q90J0476k756J9927r626L995m95K665
16422A7660l3106J0632J8519j2477o159m336J0046j739J0570n839J7808q845q319
16409D415R468J432Q856l153j4771j846r743r178J0336k613R44J2348j8884j2946
16395b5335J2361l1487k964K7507K1554J2319q737j9873o806K4819J1439J2788
16383B7585j3382l3232l1423l041J7380R616J7568j4118N887n915k343P530j6004
16370c3892m719K4316P730n746N487J225K349Q834q566l9688n623R008J4041J7789
$$ plain form
16356 -7455 644 9123 10000 -6463 -21053 -12590 24964 48085 40781 43602 36910 33420 47140 48727
16342 48727 33292 17025 13604 11896 17241 15717 -440 10937 19587 2823 -14679 -2024 -7272
16329 -7272 -6051 -26154 -25726 -11059 -12319 -28410 1228 -13505 -36823 -42206 -10693 -14481 -23803
16316 -23803 2680 -3763 -3821 4782 6132 1021 10485 21857 26006 18854 7756 -3911 3406 6039
16302 6039 6758 -1905 -12681 6405 10782 -6404 -11992 -27541 -6187 17324 12051 -25016 -54220
16289 -54220 -59057 -43441 -13696 -23193 -44635 -40442 3263 14492 11291 20617 22501 29926 25543
16276 25543 3826 -19997 -41861 -30373 -21653 -19533 -9379 -5764 -9209 -7372 -9074 -6992 19265
16263 19265 41869 52694 65238 42055 11393 -17567 -32193 -12628 3197 -6500 -23923 -34317
$$ packed form
16356g455Q099Q479Q77j6463j4590Q463L7554K3121p304K821o692l490J3720J587
16342D8727j5435j6267l421j708N345j524j6157J1377Q650j6764j7502J2655n248
16329g272J221k0103M28J4667j260j6091K9638j4733k3318n383L1513l788r322
16316b3803K6483o443n8Q603J350n111R464J1372M149p152j1098j1667P317K633
16302F039P19q663j0776J9086M377j7186n588j5549K1354K3511n273l7067k9204
16289e4220m837J5616K9745r497k1442M193M3705J1229l201R326J884P425m383
16276B5543k1717k3823k1864J1488Q720K120J0154L615l445J837j702K082K6257
16263A9265K2604J0825J2544k3183l0662k8960j4626J9565J5825r697j7423j0394
$$ plain form
16251 -34317 -25894 5990 -4464 -13814 -4260 18598 38079 17815 -16961 -25693 -13105 -7499 -13514
16238 -13514 -52658 -51323 -49899 -34235 -19965 -12839 16085 23173 4683 -6472 9075 25285
16226 25285 11573 767 4296 5954 -4971 898 -5512 -6390 2169 13810 9159 12591 -11159
16213 -11159 -15409 -45651 -47686 -14700 12630 21130 16040 4065 11977 10013 -3885 -28235 -33592
16200 -33592 -35361 -11393 11600 2095 -6284 -223 -13509 -41575 -28157 -19232 -1710 7745 11280
16187 11280 8723 -19802 -67046 -60678 -42306 -3605 8744 16156 15843 18109 -13751 -33757 -30710
16174 -30710 -33004 -23170 -14803 -10583 -17045 -14473 -7224 -21255 -32870 -15135 655 -17137 -19811
16161 -19811 -16577 -19324 5254 6520 3749 -4791 -2196 -20406 -5084 7622 9661 8326 -13664
$$ packed form
16251c4317Q423L1884j0454r350R554K2858J9481k0264l4776q732J2588N606o015
16238a3514l9144J335J424J5664J4270P126K8924P088j8490j1155J5547J6210
16226B5285j3712j0806L529J658j0925N869o410q78Q559J1641m651L432k3750
16213a1159m250l0242k035L2986K7330Q500n090j1975P912j964j3898k4350n357
16200c3592j769K3968K2993r505q379O061j3286k8066J3418Q925J7522R455L535
16187A1280k557k8525m7244O368J8372L8701J2349P412l13K266l1860k0006L047
16174c0710k294R834Q367M220o462K572P249j4031j1615J7735J5790j7792k674
16161a9811L234k747K4578J266k771q540K595j8210J5322J2706K039j335k1990
$$ plain form
16148 -13664 -24568 -17816 -18350 -31434 -43487 -36796 -25770 -12694 -7663 -12481 -25389 -17410 4533
16135 4533 -1566 -14777 -32288 -22906 -17153 12943 -10211 -20683 15661 13746 7895 -1390 6241
16122 6241 17536 -4614 -42427 -28863 -17366 -29728 -21475 -14491 -17197 -19681 -14316 1128 12036
16109 12036 20953 19258 19220 32077 29479 41562 32429 16682 -6450 -10075 -20459 -21377 -51268 -42291
16095 -42291 -10462 -902 3891 -560 -4011 -7120 -16611 -1856 17719 16700 -6740 -16437 -25380
16082 -25380 -17498 -20634 -7283 -294 -12305 -19949 -29153 -32739 -36390 -2323 8383 -9018 -46851
16069 -46851 -47469 -39017 -35984 -28364 -7661 -26397 -55772 -72474 -68040 -56481 -32395 5341 10930
16056 10930 -19414 -31758 -28248 -20168 -18460 -20428 -13483 -17741 -33367 -33167 -28489 -35029 -14084 -3424
$$ packed form
16148a3664j0904O752n34j3084j2053O691J1026J3076N031m818j2908P979K1943
16135D533o099j3211j7511R382N753L0096k3154j0472L6344j915n851r285P631
16122F241J1295k2150l7813J3564J1497j2362Q253O984k706k484N365J5444J0908
16109A2036Q917j695l8J2857k598J2083r133j5747k3132l625j0384r18k9891Q977
16095d2291L1829R560M793m451l451l109r491J4755J9575j019k3440r697q943
16082b5380P882l136J3351O989j2011p644r204l586l651L4067J0706j7401l7833
16069d6851o18Q452L033P620K0703j8736k9375j6702M434J1559K4086L7736N589
16056A0930l0344j2344L510Q080J708j968O945m258j5626K00M678o540K0945J0660
$$ plain form
16042 -3424 24128 37801 40882 47288 21818 -1300 -16686 -551 16368 -18809 -63527 -48391
16030 -48391 -23680 -14352 -8757 -11918 4469 4318 23981 30699 7603 -3680 -16623 -9133 639
16017 639 -16084 -1932 6235 52689 80353 47612 13809 959 -10534 -32129 -39148 -31609 -20389
16004 -20389 -10730 -6477 13561 28994 4042 10045 23034 4954 9901 25465 15917 -3714 -12578
15991 -12578 -22839 -23101 -38991 -49789 -29768 -9959 510 7083 17626 18770 18329 -10400 -21148
15978 -21148 -4973 21461 33083 28477 21899 26109 8069 4104 -15141 -6030 -10971 -12358 -5462
15965 -5462 7764 36353 59610 43784 22618 15305 16613 4727 31100 38621 16157 14460 2285
15952 2285 -12127 15859 29581 25023 16813 14148 11054 11473 -11547 4560 33306 17638 1039
$$ packed form
16042c424K7552J3673L081O406k5470k3118j5386J6135J6919l5177m4718J5136
16030d8391K4711R328N595l161J6387j51J9663O718k3096j1283j2943P490R772
16017F39j6723J4152Q167M6454K7664l2741l3803j2850j1493k1595p019P539J1220
16004b0389R659M253K0038J5433k4952O003J2989j8080M947J5564r548j9631q864
15991a2578j0261k62j5890j0798K0021J9809J0469O573J0543J144m41k8729j0748
15978b1148J6175K6434J1622m606o578M210j8040l965j9245R111m941j387O896
15965e462J3226K8589K3257j5826k1166p313J308j1886K6373P521k2464j697j2175
15952B285j4412K7986J3722m558q210k665l094M19k3020J6107K8746j5668j6599
$$ plain form
15939 1039 -11943 -11988 -23413 -14620 -14397 -20597 -40050 -37743 -26402 618 -3411 -30818 -37987 -43288
15925 -43288 -21296 -21233 -17432 -4143 -4727 10797 105 -9975 -2226 24406 5507 -9518 1845
15912 1845 15007 25833 16944 11056 2547 6766 1053 -708 21621 20968 -7043 -11678 2144 14178
15898 14178 -265 -18227 -28216 -42831 -46659 -25157 -1960 -20397 -16458 9607 21670 5914
15886 5914 -18796 -24858 -16968 -11940 10558 10938 9128 9786 22707 24040 13775 -3739 -6790 3386
15872 3386 20157 32394 32934 2380 -11321 -23391 -24268 -12561 470 16219 -9436 -52188 -59140
15859 -59140 -37397 -34508 -26173 -7215 -14487 -11882 -10872 -21573 -28589 -40402 -35809 -29885 -32805
15846 -32805 -31710 -22327 -23666 -21589 -46358 -52881 -15634 -8367 -15141 -17570 -2484 21412 20497 13322
$$ packed form
15939A039j2982m5j1425Q793K23o200j9453K307J1341K7020m029k7407p169n301
15925d3288K1992O3L801J3289n84J5524j0692j0080P749K6632j8899j5025J1363
15912A845J3162J0826q889n888q509M219n713j761K2329o53k8011m635J3822J2034
15898A4178j4443j7962r989j4615l828K1502K3197j8437L939K6065J2063j5756
15886E914k4710o062P890N028K2498L80j810O58J2921J333j0265j7514l051J0176
15872C386J6771J2237N40l0554j3701j2070q77J1707J3031J5749k5655m2752o952
15859e9140K1743K889Q335J8958p272K605J010j0701p016j1813M593N924k920
15846c2805J095R383j339K077k4769o523L7247P267o774k429J5086K3896r15p175
$$ plain form
15832 13322 2621 4745 10798 11859 -8570 2900 16333 -6771 -11815 -5734 6716 -153 -14710
15819 -14710 -58464 -64595 -52055 -59724 -63927 -49195 -52805 -32214 -15975 -37256 -57698 -32751
15807 -32751 -1643 -5953 115 -4045 -4921 3051 -14504 -17848 -12605 -2599 169 -2900 8306 -2395
15793 -2395 -13151 -47388 -50922 -26296 11889 36599 9064 -24606 -65552 -85768 -56850 -12242
15781 -12242 -4890 -29486 -56831 -50015 -39336 -29401 -14857 -5176 -8385 10642 202 -6700 -17514
15768 -17514 -32891 -15084 -11012 14056 17387 19119 14549 7088 6652 18930 15820 7461 -8111
15755 -8111 -1209 11042 11079 -7670 -13410 -4925 -10120 -17610 -33961 -58437 -52741 -57305 -49895 -29063
15741 -29063 -23846 -25832 -10099 -1780 21644 31183 21473 -15122 -27220 -1842 -2710 5678 22956
$$ packed form
15832A3322j0701K124O053J061k0429J1470J3433k3104n044O081J2450o869j4557
15819a4710m3754o131J2540p669m203J4732l610K0591J6239k1281k0442K4947
15807c2751L1108m310O068m160q76P972j7555l344N243J0006K768l069J1206j0701
15793b395j0756l4237l534K4626L8185K4710k7535l3670m0946k0216K8918M4608
15781a2242P352k4596k7345O816J0679R935J4544R681l209J9027j0440o902j0814
15768a7514j5377J7807M072K5068L331J732m570p461m36J2278l110q359j5572
15755h111O902J2251L7j8749n740Q485n195p490j6351k4476N696m564P410K0832
15741b9063N217j986J5733Q319K3424R539r710l6595j2098K5378q68Q388J7278
$$ plain form
15728 22956 367 -19925 -18295 -26967 -24181 -15504 -34227 -46569 -20455 -1031 -1917 6309 15680
15715 15680 11830 -4178 2257 -2536 -17609 -7706 -3937 -35920 -12743 3595 31155 38908 57084
15702 57084 40977 17785 -22185 -11190 4981 705 2043 8645 13865 8715 11502 20168 20822
15689 20822 17150 3224 -16389 -44443 -38712 -16017 -17078 -17158 -23548 -29308 -24830 -35708 -39658 -16252
15675 -16252 1577 -7069 -14810 6742 33602 47154 35011 1057 -27095 -9109 -2615 13916
15663 13916 13742 10202 -21056 -23093 -20203 -19699 -24185 -10195 -26354 -52122 -52317 -39109 -32244 -5422
15649 -5422 18215 25404 16878 -26869 -14113 13743 14069 -2056 -15639 -37653 -51007 -38416 -33541
15636 -33541 -48122 -45522 -19222 -1903 -16249 -31056 -16097 13627 10489 8658 -5243 1666
$$ packed form
15728B2956k2589k0292J630q672K786Q677j8723j2342K6114J9424q86Q226R371
15715A5680l850j6008O435m793j5073R903L769l1983K3177J6338K7560P753J8176
15702E7084j6107k3192l9970J0995J6171m276J338O602N220n150K787Q666O54
15689B0822l672j3926j9613k8054N731K2695j061q0o390n760M478j0878l950K3406
15675a6252J7829q646p741K1552K6860J3552j2143l3954k8152J7986O494J6531
15663A3916j74l540l1258k037K890N04m486J3990j6159k5768j95J3208O865K6822
15649e422K3637P189q526m3747J2756K7856L26j6125j3583k2014j3354J2591M875
15636c3541j4581K600K6300J7319j4346j4807J4959K9724l138j831j3901O909
$$ plain form
15624 1666 14980 31799 19283 6575 2998 2383 -31010 -47163 -39712 -29770 -6212 6397 1648
15611 1648 12339 3971 -14595 -28352 -19429 -17280 -11384 -9334 -4139 17989 21259 11100 3490
15598 3490 11425 39984 49384 21420 11365 27737 24657 33174 15444 4586 23201 -8713 -4139
15585 -4139 14571 -7567 -14484 -24033 -28153 -40714 -35327 -25293 -8573 -721 -13805 -14445 -22413
15572 -22413 -5117 653 26698 30874 24954 33486 14755 3571 -6264 -13992 -25226 -41956 -53055
15559 -53055 -37404 1443 20763 8467 -2929 6494 -430 -19582 -23087 -21461 -37130 -49817
15547 -49817 -50024 -38431 -12958 -30310 -51895 -35234 -33135 -34957 -28246 4111 1182 -18585 -33768
15534 -33768 -35513 -46119 -30821 -6502 4101 5075 -11526 4819 1065 -735 -18443 -15998 -16659
$$ packed form
15624A666J3314J6819j2516j2708l577o15l3393j6153P451R942K3558J2609m749
15611A648J0691q368j8566j3757Q923K149N896K050N195K2128L270j0159p610
15598C490P935K8559R400k7964j0055J6372l080Q517j7730j0858J8615l1914M574
15585d139J8710k2138o917r549m120j2561N387J0034J6720P852j3084o40p968
15572b2413J7296N770K6045M176n920Q532j8731j1184r835p728j1234j6730j1099
15559e3055J5651L8847J9320j2296j1396R423o924j9152l505J626j5669j2687
15547d9817k07J1593K5473j7352k1585J6661K099j822O711L2357k929j9767j5183
15534c3768j745j0606J5298K4319J0603R74j6601J6345l754j800j7708K445o61
$$ plain form
15521 -16659 -26092 -21179 -8344 9659 5906 -13668 -43327 -37277 -51582 -28235 2475 11291 -1840
15508 -1840 3286 16133 -6261 -22482 -17280 -27052 -42710 -27557 -45731 -39763 -26388 -10628 10031
15495 10031 13389 6855 13629 4021 6712 17929 -1493 -4774 4851 26293 7619 -8623 -15309
15482 -15309 -42122 -67736 -53757 -6490 8619 14331 -4310 -6600 -2884 -8835 -21812 7487
15470 7487 29054 24098 27803 40156 35978 33593 37320 24540 14249 23972 2995 -27379 -24622
15457 -24622 -5809 10925 15889 -18519 -41190 -45311 -46932 -17447 -5655 -11308 -16526 -57063 -58752
15444 -58752 -34625 -34597 -48822 -60735 -35139 -34454 -12818 2235 17834 21078 8885 7647 3029
15431 3029 3845 13265 6664 -8252 -21181 -14228 -1052 4799 4666 -4868 3932 52 4551 18724
$$ packed form
15521a6659r433M913J2835J8003l753j9574k9659O050j4305K3347L0710Q816j3131
15508a840N126J2847k2394j6221N202r772j5658J5153j8174N968J3375J5760K0659
15495A0031L358o534O774r608K691J1217j9422l281R625K1442j8674j6242o686
15482a5309k6813k5614J3979M7267J5109N712j8641k290L716n951j2977K9299
15470G487K1567m956L705J2353m178k385L727j2780j0291R723k0977l0374K757
15457b4622J8813J6734M964l4408k2671m121j621K9485J1792n653n218m0537j689
15444e8752K4127K8j4225j1913K5596O85K1636J5053J5599L244j2193j238m618
15431C029Q16R420o601j4916j2929O953J3176N851j33r534Q800l880M499J4173
$$ plain form
15417 18724 -6748 -30431 -33333 -18856 -5357 29151 22544 -16842 -32751 -36709 -10315 198
15405 198 -6340 -9731 -5301 -15446 -29303 -47337 -48096 -34020 -16852 1912 12830 5692 -13666
15392 -13666 -27352 -50359 -40052 -11729 29062 56052 47739 24620 14795 21963 36132 34127
15380 34127 36305 16698 -11518 6680 11564 12200 34575 42081 27496 33886 52500 57327 55588
15367 55588 42697 3359 -15627 -8706 -11620 -24305 -4257 30438 29389 15933 -3419 -18481
15355 -18481 -35967 -36342 -16257 -883 431 5576 18141 14757 7997 197 -22655 -17988 -5045
15342 -5045 -21476 -39440 -49960 -38113 -31735 -36423 -37681 -14789 -13059 3961 24464 23045 33564
15329 33564 27690 5388 -10681 -21132 -37058 -24678 6346 31532 35098 20521 15316 -1196
$$ packed form
15417A8724k5472k3683k902J4477J3499L4508o607l9386j5909l958K6394J0513
15405A98o538l391M430j0145j3857j8034p59J4076J7168J8764J0918p138j9358
15392a3666j3686k3007J0307K8323M0791K6990q313k3119r825P168J4169k005
15380C4127K178j9607k8216J8198M884O36K2375P506j4585O390J8614M827j739
15367E5588j2891l9338j8986O921k914j2685K0048L4695j049j3456j9352j5062
15355a8481j7486l75K0085J5374J314N145J2565l384o760p800k2852M667J2943
15342e045j6431j7964j0520J1847O378m688j258K2892J730J7020K0503j419J0519
15329C3564n874k2302j6069j0451j5926J2380L1024K5186L566j4577n205j6512
$$ plain form
15317 -1196 -7409 -8091 -12574 20242 7578 6765 -26624 -33609 -20478 -16882 -17950 -23420 -28726 -14788
15303 -14788 -9279 -21919 -28321 -26011 -37002 -5979 18145 22650 21327 -593 -11617 -694 19846
15290 19846 39687 11160 -477 -12137 -8627 11741 11266 9568 -10431 -25601 -13451 -8504 3316
15277 3316 -23638 -32558 -31539 -30770 -8423 -7282 -31107 -35202 -59447 -49850 -17685 -14164 -30882
15264 -30882 -32873 -19975 -11906 -22604 -19584 -10726 10723 17661 25661 34452 6491 -15475 -16381
15251 -16381 -2828 -2813 -17898 -8584 12868 20253 14057 19579 -12968 -283 37598 27558 38798
15238 38798 47075 22816 5926 2029 -4722 -6100 -8344 -23571 -43120 -11492 948 18144 30652
15225 30652 -3501 -9426 -5687 -8274 -289 -6901 -16822 -8910 -22391 -8369 790 -6656 -26315
$$ packed form
15317a196o213o82m483L2816j2664q13l3389o985J3131L596j068n470n306J3938
15303a4788N509j2640o402K310j0991L1023K4124M505j323k1920j1024J0923K0540
15290A9846J9841k8527j1637j1660L510K0368m75j698j9999j5170J2150M947J1820
15277C316k6954q920J019P69K2347J141k3825m095k4245R597L2165L521j6718
15264c0882j991J2898Q069j0698L020Q858K1449O938Q000Q791k7961k1966r06
15251a6381J3553J5j5085R314K1452P385o196N522l2547J2685L7881j0040J1240
15238C8798Q277k4259j6890l897o751j378k244j5227j9549L1628J2440J7196J2508
15225C0652l4153n925L739k587P985o612r921P912j3481J4022R159p446j9659
$$ plain form
15212 -26315 -22959 -7604 -7595 -4325 -11010 -20872 -34983 -33693 -23697 -18595 -19445 13986 -7772 -48527
15198 -48527 -49947 -19261 -24420 -16074 -28848 -39413 -14398 5638 29977 39343 11874 -15338
15186 -15338 -23541 -27706 -41388 -14624 941 -7954 4526 -11419 -20175 -7027 13248 16091 34427
15173 34427 17646 -11387 -24532 -34737 -23794 -2399 6403 -19007 -9955 4353 5057 11670 11187
15160 11187 17007 15188 -14864 -1287 -8373 -51152 -61319 -66665 -73024 -47868 -1367 -3241 -19765
15147 -19765 8055 -4328 -28764 -9100 -18304 -40852 -34646 -8405 -22418 -16416 -33730 -29369
15135 -29369 -32372 -38952 -32273 -44050 -57271 -44220 -2954 7714 -3629 -7621 -23345 -37595
15123 -37595 -27683 -32153 -31147 -22204 -17130 727 11386 564 -16528 -45915 -30223 20496 15058
$$ packed form
15212b6315L356J5355RL270o685r862j4111J290R996N102q50L3431k1758m0755
15198d8527j420L0686n159Q346j2774j0565K5015K0036K4339R366k7469k7212
15186a5338q203m165j3682K6764J5565q895J2480j5945q756J3148K0275K843J8336
15173C4427j6781k9033j3145j0205J0943K1395Q802k5410R052J4308P04O613m83
15160A1187N820j819l0052J3577p086m2779j0167n346o359K5156M6501j874j6524
15147a9765K7820j2383k4436J9664r204k2548O206K6241j4013O002j7314M361
15135b9369l003o580O679j1777j3221J3051M1266J0668j1343l992j5724j4250
15123c7595R912m470J006Q943N074J7857J0659j0822j7092k9387J5692N0719n438
$$ plain form
15110 15058 -6582 -20354 -37818 -46352 -30500 -29847 -23358 440 1784 2207 -33583 -39975 -28828
15097 -28828 -13421 -12778 -43139 -54149 -24754 -20285 2748 -19669 -19996 -15690 -25491 -29468 -43999
15084 -43999 -65784 -75696 -50518 -22076 -19025 -3015 -358 -28834 -24532 3485 -1485 14586 48129
15071 48129 36524 -2325 -7355 12756 1913 -6265 -10640 -4418 14851 15584 23193 27676 27756 12956
15057 12956 33491 42140 29863 32367 24016 -12419 -19610 -9458 -35654 -27754 -28656 -28801 -36761 -39897
15043 -39897 -22374 -18266 -7435 16941 2721 8009 -2584 -19423 -11525 12433 22742 -6321
15031 -6321 -27281 -17423 5381 20088 25941 549 -36296 -42764 -53097 -23987 -13098 1435
15019 1435 30142 74459 58742 22094 26445 24790 18652 39601 30540 25322 13073 723 -3880
$$ packed form
15110A5058k1640j3772j7464q534J5852O53O489K3798J344M23l5790o392J1147
15097b8828J5407O43l0361j1010K9395M469K3033k2417l27M306r801l977j4531
15084d3999k1785r912K5178K8442L051J6010K657k8476M302K8017m970J6071L3543
15071D8129j1605l8849n030K0111j0843q178m375O222J9269P33P609M483Q0j4800
15057A2956K0535Q649j2277K504q351l6435p191J0152k6196P900r02j45p960l136
15043c9897J7523M108J0831K4376j4220N288j0593j6839P898K3958J0309k9063
15031f321k0960R858K2804J4707N853k5392l6845o468j0333K9110J0889J4533
15019A435K8707M4317j5717l6648M351j655o138K0949r061n218j2249j2350m603
$$ plain form
15006 -3880 17075 42436 31470 13512 1311 10227 18934 27640 29851 16283 19615 24431 22716
14993 22716 9718 15320 40464 52672 28510 22021 -15296 -37509 -23536 -16054 -17035 1403 -11242
14980 -11242 -15026 -6251 -7116 14250 -10873 -34500 -46339 -33605 -1533 5307 22408 10369 -11486
14967 -11486 22259 58634 33165 28211 18000 -28659 -46870 -19567 13765 18004 -2731 -15140
14955 -15140 -27279 -19915 -9028 10090 24581 3405 -11833 14662 39801 26270 3116 9713
14943 9713 -4750 -12623 -26584 -46228 -25653 -30965 -43771 -35579 14640 13988 7388 4716 9134
14930 9134 24233 13404 -4045 -15601 538 5329 8224 2125 -15582 -17474 12618 10073 2415
14917 2415 -20104 -42236 -37950 -40557 -28710 3878 1592 -4770 -7056 -19852 -23182 -560 -24930
$$ packed form
15006c880K0955K5361j0966j7958j2201Q916Q707Q706K211j3568L332M816j715
14993B2716j2998N602K5144J2208k4162o489l7317k2213J3973P482r81J8438j2645
14980a1242l784Q775q65K1366k5123k3627j1839J2734L2072O840J7101j2039k1855
14967a1486L3745L6375k5469m954j0211m6659j8211K7303L3332M239k0735j2409
14955a5140j2139P364J0887J9118J4491k1176j5238K6495K5139j3531k3154O597
14943I713j4463p873j3961j9644K0575n312j2806Q192N0219o52o600k672M418
14930I134J5099j0829j7449j1556J6139M791K895o099j7707j892L0092k545p658
14917B415k2519k2132M286k607J1847L2588k286o362k286j2796l330K2622k4370
$$ plain form
14904 -24930 -18285 4244 -12629 -27908 -49114 -30857 10447 21660 19343 38629 32595 21999
14892 21999 10994 12534 28591 38256 59814 42000 7247 11999 18196 612 -12591 -14562 -15993
14879 -15993 -25946 -21312 3345 6283 18079 15385 25641 26072 42817 62006 67941 25170 -12052
14866 -12052 -10839 -10822 2143 26220 11057 23145 -13957 -26007 -9317 -2403 30694 9524 6315
14853 6315 14820 22561 36259 41216 30404 38834 48685 44375 57056 54493 47476 31650 -3966
14840 -3966 -29962 -15497 -37424 -31790 -8424 840 -12616 -2883 -1694 7831 24662 1728 -14554
14827 -14554 -10409 -10993 -21288 -5884 19422 12282 17689 22901 28279 28683 16004 -78 3051 16603
14813 16603 4277 -25281 -48582 -22505 -25171 -53990 -60249 -49516 -28414 -7964 -9092 -24936
$$ packed form
14904b4930O645K2529j6873j5279k1206J8257M1304J1213k317J9286o034j0596
14892B1999j1005J540J6057R665K1558j7814l4753M752O197j7584j3203j971j431
14879a5993r953M634K4657K938J1796k694J0256M31J6745J9189N935m2771l7222
14866a2052J213J7J2965K4077j5163J2088l7102j2050J6690O914L3097k1170l209
14853F315Q505P741J3698M957j0812Q430R851m310J2681k563p017j5826l5616
14840c966k5996J4465k1927N634K3366R264j3456R733J189R525J6831k2934j6282
14827a4554M145n84j0295J5404K5306p140N407N212N378M04j2679j6082L129J3552
14813A6603j2326k9558k3301K6077k666k8819o259J0733K1102K0450j128j5844
$$ plain form
14801 -24936 5136 22141 21966 -3068 -3342 17132 18952 17937 11658 26166 7675 -16833 -2737
14788 -2737 12425 32918 30950 16104 2242 -16690 6799 -10398 -24698 -8730 -12008 15232
14776 15232 36798 25290 1083 -16454 -31842 -40749 -50027 -68209 -59312 -46675 -39197 -24610
14764 -24610 -13206 -15053 -11369 -17852 -21070 124 37570 59531 53696 15241 9975 6264 1408
14751 1408 -12606 -17714 -4214 -13659 -25397 -17119 -1781 -13587 -25969 -23866 -15820 -32969 -35510
14738 -35510 -36002 -30016 -49686 -43195 -38343 -44114 -38277 -32184 -30488 -7977 -5001 -44798 -60188 -51094
14724 -51094 -12746 32962 58310 68163 50337 44832 41601 33313 26125 52232 56017 25803 633
14711 633 -680 26162 28452 21289 11967 -26514 -35533 8604 35365 40863 37791 19710 -7726
$$ packed form
14801b4936L0072J7005j75k5034k74K0474J820j015o279J4508j8491k4508J4096
14788b737J5162K0493j968j4846j3862j8932K3489j7197j4300J5968l278K7240
14776A5232K1566j1508k4207j7537j5388q907r278j8182Q897J2637P478J4587
14764b4610J1404j847L684o483l218K1194L7446K1961n835l8455n266l711m856
14751A408j4014n108J3500r445j1738Q278J5338j1806j2382K103Q046j7149k541
14738c5510m92N986j9670O491M852n771N837O093J696K2511K976l9797j5390R094
14724e1094L8348M5708K5348R853j7826n505l231q288p188K6107L785l0214k5170
14711F33j313K6842K290p163r322l8481r019M4137K6761N498l072j8081k7436
$$ plain form
14698 -7726 2688 11909 11379 -9597 -20700 -12831 4353 16356 5877 4961 40284 61518 46552
14685 46552 44114 38219 31508 11483 23695 27231 28778 6982 8201 14358 42567 49878 40151
14672 40151 6944 14857 238 -2167 15440 21453 1846 1306 -10847 -13475 1662 17240 -5379
14659 -5379 -23202 -1738 -6310 -4602 2962 129 -21416 12424 25808 18351 23953 16466 15302
14646 15302 26376 38023 22026 5752 -4297 -27102 -23452 -43358 -48733 -34134 -20797 -29111
14634 -29111 -27083 -24973 -5102 -34673 -38415 -28609 -23802 -29815 -31056 -48374 -54578 -51342 -45966 -36858
14620 -36858 -34306 -29574 -37189 -46085 -20079 -1075 10850 15529 27630 34924 35733 32202 23187 27037
14606 27037 15676 -11580 -33463 -52912 -28467 20230 44180 20245 17674 13296 -6836 -18031
$$ packed form
14698g726J0414R221n30k0976j1103P869J7184J2003j0479r16L5323K1234j4966
14685D6552k438n895o711k0025J2212L536J547k1796J219O157K8209P311r727
14672D0151l3207P913j4619k405J7607O013j9607n40j2153k628J5137J5578k2619
14659e379j7823K1464m572J708P564k833k1545L3840J3384p457N602p487j164
14646A5302J1074J1647j5997j6274j0049k2805L650j9906n375J4599J3337q314
14634b9111K028K110J9871k9571l742R806M807o013j241j7318o204L236N376R108
14620c6858K552M732p615q896K6006J9004J1925M679J2101P294Q09l531r015L850
14606B7037j1361k7256k1883j9449K4445M8697K3950k3935k571m378k0132j1195
$$ plain form
14594 -18031 22316 27532 30510 10181 16254 18092 18735 18398 25591 31735 22606 32452 11746 -4106
14580 -4106 -14725 -10179 -3987 -12098 -7803 -3734 -9580 -2478 360 1661 -2349 -6773 -21286 -25097
14566 -25097 -4502 16381 26949 24664 11284 13192 -20630 -24281 -32380 -28207 -30151 -28140 -14566
14553 -14566 2980 21616 36395 25645 25784 16547 3552 -12630 -16265 -10200 15644 16784 3984
14540 3984 28439 12264 13771 35501 22236 8066 -25199 -24631 10584 34292 34950 17955 9377
14527 9377 13384 29342 8468 -9215 -7858 -841 2475 -15851 -14497 21560 31216 35868 57976
14514 57976 57288 38559 44890 47293 31502 32723 31462 21549 -8219 13576 37731 63132 49868
14501 49868 12880 -8303 -29695 -30584 137 -3210 -17008 -28376 4327 19160 22236 11102
$$ packed form
14594a8031M0347N216K978k0329O073J838O43l37P193O144r129R846k0706j5852
14580d106j0619M546O192q111M295M069n846P102K838J301m010m424j4513l811
14566b5097K0595K0883J0568k285j3380J908l3822l651q099M173j944K011J3574
14553a4566J7546J8636J4779j0750J39r237j2995j6182l635O065K5844J140j2800
14540C984K4455j6175J507K1730j3265j4170l3265N68L5215K3708O58j6995q578
14527I377M007J5958k0874j7683J357P017L316j8326J354L6057R656M652K2108
14514E7976o88j8729O331K403j5791J221j261r913k9768K1795K4155K5401j3264
14501D9868l6988k1183k1392q89L0721l347j3798j1368L2703J4833L076j1134
$$ plain form
14489 11102 -27011 -50800 -37827 -26859 -13500 12835 30365 24758 -2352 -28081 -16603 -34994
14477 -34994 -43894 -17672 1235 15195 41224 52400 39771 34682 56244 29362 8263 -2509
14465 -2509 2009 27891 31189 18032 4145 -4658 6167 16273 22983 -8337 -18759 -4012 10858
14452 10858 20568 20416 33918 25675 6856 2374 -1326 18038 4321 -3888 2375 3477 4935 6157
14438 6157 8848 19129 3493 -21865 -15066 -8596 5706 17193 16721 14789 26194 29012 36574
14425 36574 34679 14700 11918 12775 14596 29935 25944 35354 45342 21821 14539 21749 29916 33539
14411 33539 32675 28855 24830 6150 -11635 -26526 -21049 -29037 -21048 -10296 13273 28854 -2069
14398 -2069 -14787 -18664 -13237 -26634 -41789 -24515 -20000 -24190 -9565 7592 -7483 -18155 -10686
$$ packed form
14489A1102l8113k3789J2973J0968J3359K6335J7530n607k7110k5729J1478j8391
14477c4994q900K6222J8907J3960K6029J1176j2629n089K1562k6882k1099j0772
14465b509M518K5882L298j3157j3887q803J0825J0106O710l1320j0422J4747J4870
14452A0858R710j52J3502q243j8819m482l700J9364j3717q209O263J102J458J222
14438F157K691J0281j5636k5358O799O470J4302J1487m72j932J1405K818P562
14425C6574j895j9979k782Q57J821J5339l991R410R988k3521p282P210Q167L623
14411C3539q64l820m025j8680j7785j4891N477p988P989J0752K3569J5581l0923
14398b069j2718l877N427j3397j5155J7274M515m190J4625J7157j5075j0672P469
$$ plain form
14385 -10686 -15722 -25412 -10764 -17342 -10872 13225 18957 8251 -6233 -19956 -9774 -11616 -4010
14372 -4010 -15231 -30135 -28298 -9398 -16926 -30930 -16938 -11216 -11623 -7996 -12993 -33673 -29852
14359 -29852 -43383 -23418 -19834 -15531 -53575 -42088 87 4107 -3371 -7584 -20150 -15647 2132
14346 2132 6530 3568 17194 28073 32779 35539 47267 24389 4197 -20475 -43548 -31513 -18478
14333 -18478 -6923 1166 6804 -7916 -19452 -44208 -60024 -42298 -33385 -11354 6274 16345
14321 16345 23598 6097 -17393 -6333 28387 38565 17416 -3537 -1503 6706 3461 -19026
14309 -19026 -10313 -9779 5077 14640 3096 22827 36748 3248 -18657 -20106 -699 -7628 9047
14296 9047 629 -18886 -30473 -38875 -48811 -16906 -578 1243 -30307 -53275 -35821 -33705 -14443
$$ packed form
14385a0686n036r690J4648o578O470K4097N732j0706j4484j3723J0182j842P606
14372d010j1221j4904J837J8900p528j4004J3992N722m07L627m997k0680L821
14359b9852j3531J9965L584M303l8044J1487M2175M020p478m213j2566M503J7779
14346B132M398k962J3626J0879M706K760J1728k2878k0192k4672k3073J2035J3035
14333a8478J1555Q089N638j4720j1536k4756j5816J7726Q913K2031J7628J0071
14321A6345P253j7501k3490J1060L4720J0178k1149k0953K034Q209l245k2487
14309a9026Q713N34J4856R563j1544J9731J3921l3500k1905j449J9407o929J6675
14296I047q418j9515j1587q402r936L1905J6328J821l1550k2968J7454K116J9262
$$ plain form
14283 -14443 -9236 -11792 14265 22760 7128 -34416 -80513 -75958 -36220 -32945 -51286 -18835 -5129
14270 -5129 -15067 -35709 -42192 -33644 -40690 -57268 -24198 28265 23798 33563 23825 -9220 -46698
14257 -46698 -42407 -36160 -33292 -56228 -49636 -12627 7246 33501 29691 -9346 -4916 -2147 4868
14244 4868 13032 9167 6774 22587 1427 -2450 16750 7877 -30529 -32652 -20068 -5809 2476
14231 2476 15326 22336 17645 22839 -8374 4209 26529 22406 3831 17957 15371 2788 -26022
14218 -26022 -26480 -23789 -26156 -23809 -37210 -59038 -50809 -41998 -20505 13968 22944 7388 15888
14205 15888 49432 36598 34341 3303 -12586 -208 20640 392 -46151 -78956 -70711 -51579
14193 -51579 -57619 -51407 -36060 -21440 -10867 -6717 -10173 -32524 -45616 -33738 -21314 -36933
$$ packed form
14283a4443N207k556K6057Q495j5632m1544m6097M555L9738L275j8341L2451J3706
14270e129r938k0642o483Q548p046j6578L3070N2463m467R765r738l3045l7478
14257d6698M291O247K868k2936O592L7009J9873K6255l810l9037M430K769P015
14244D868Q164l865k393J5813k1160l877J9200q873l8406k123J2584J4259Q285
14231B476J2850P010m691N194l1213J2583K2320m123j8575J4126k586j2583k8810
14218b6022m58K691k367K347j3401k1828Q229Q811K1493L4473Q976j5556Q500
14205A5888L3544j2834k257l1038j5889J2378K0848k0248m6543l2805Q245J9132
14193e1579o040O212J5347J4620J0573M150l456k2351j3092J1878J2424j5619
$$ plain form
14181 -36933 -51065 -17217 16610 33474 40094 38655 25008 18975 10855 29037 35739 41438 56143
14168 56143 56451 47831 31631 13126 -10512 -13650 -4585 19845 48185 34088 19370 20826 -7633
14155 -7633 -6761 12796 31768 36033 45290 43314 43049 54350 57518 56663 24245 10410 16193 18792
14141 18792 -2429 -36815 -16461 2156 22657 17445 9137 -3226 -16569 270 -2966 7079
14129 7079 33131 41996 31959 10678 18932 21142 1380 -10938 -17568 -1577 -2887 9387 30878
14116 30878 39606 50918 23111 15806 27497 55831 44859 14664 -6459 -26610 -21989 -19204
14104 -19204 -31527 -23361 -17062 -16413 -26336 -32341 -12283 3634 11127 8627 -6417 -6671 -10459 -11385
14090 -11385 6620 -15265 -20587 3191 24309 26519 42267 50406 33189 41223 9042 -16912
$$ packed form
14181c6933j4132L3848L3827J6864O620j439j3647o033q120J8182O702N699J4705
14168E6143L08q620j6200j8505k3638l138R065K4430K8340j4097j4718J456k8459
14155g633Q72J9557J8972M265R257j976k65J1301L168q55l2418j3835N783K599
14141A8792k1221l4386K0354J8617K0501n212q308j2363j3343J6839l236J0045
14129G079K6052Q865j0037k1281Q254K210j9762j2318o630J5991j310J2274K1491
14116C0878Q728J1312k7807p305J1691K8334j0972l0195k1123k0151M621K785
14104a9204j2323Q166O299O49r923o005K0058J5917P493k500j5044k54l788r26
14090a1385J8005k1885n322K3778K1118K210J5748Q139j7217Q034l2181k5954
$$ plain form
14078 -16912 9592 22290 23405 25104 6644 7116 11818 -5448 -29579 -36618 -10110 7629 -7666
14065 -7666 -37320 -37259 -28029 -16657 2755 13970 10177 14150 34054 35310 2971 -8633 -1819
14052 -1819 13762 -2452 -2005 -3057 -8069 -6598 -16864 -35361 -45371 -41337 -46106 -28391 -24801
14039 -24801 -22335 -27216 -7674 -11870 -40738 -58653 -34501 -15736 3249 1378 -11743 -20626 -37271
14026 -37271 -24973 -36107 -41418 -41769 -20731 -6940 -9707 -2276 24721 31506 28000 14562 37818
14013 37818 21703 -4689 -22258 -38035 -40833 -26925 -32653 -27044 -13702 -24203 -18310 -8476 1946
14000 1946 669 2498 -14494 -34469 -39993 -33949 -12428 -8743 14619 25383 28660 22561 8398
13987 8398 -21124 -34648 -49568 -50584 -65478 -68382 -44960 -34707 -31302 -52300 -18606 20341
$$ packed form
14078a6912K6504J2698J115J699j8460M72M702j7266k4131p039K6508J7739j5295
14065g666k9654O1R230J1372J9412J1215l793L973J9904J256l2339j1604O814
14052a819J5581j6214M47j052n012J471j0266j8497j0010M034m769J7715L590
14039b4801K466m881J9542m196k8868j7915K4152J8765J8985j871j3121q883j6645
14026c7271J2298j1134n311l51K1038J3791k767P431K6997O785l506j3438K3256
14013C7818j6115k6392j7569j5777k798J3908n728N609J3342j0501N893R834J0422
14000A946j277J829j6992j9975n524O044K1521L685K3362J0764L277o099j4163
13987H398k9522j3524j4920j016j4894k904K3422J0253L405k0998L3694L8947
$$ plain form
13975 20341 -3957 -12413 -11046 -40769 -34201 -10860 -12936 -10772 -13491 -13669 -15202 -8864 -1377 -23621
13961 -23621 -34281 -43538 -54127 -41110 -16944 -13253 -5417 16988 29152 19757 1446 -20057
13949 -20057 -21070 -25785 -21874 -5090 -18283 -15556 10774 27285 21876 41731 29214 13117 7726
13936 7726 8690 14245 -996 -22507 -10093 13779 11103 -1222 -3831 26739 30016 10614 -14671
13923 -14671 3304 7784 15199 -14769 -2441 -11804 -22178 4149 30776 36516 27784 28757 24095
13910 24095 30928 26680 43082 36392 31579 18732 -21 -30290 -39168 -55603 -64997 -32966 -24011
13897 -24011 -35355 -18895 2011 7285 -4319 -4586 6679 -17304 -3698 9608 -7236 1205
13885 1205 845 -5347 -2804 -6978 -5845 -13367 -7137 4354 8400 18308 20627 44158 50683 25105
$$ packed form
13975B0341k4298q456J367k9723O568K3341k076K164k719j78j533O338P487k2244
13961b3621j0660r257j0589J3017K4166L691P836K2405J2164r395j8311k1503
13949b0057j013m715L911J6784j3193K727K6330J6511n409J9855j2517j6097n391
13936G726R64N555j5241k1511J2414K3872k676j2325k609L0570L277j9402k5285
13923a4671J7975M480P415k9968J2328r363j0374K6327K6627N740q732R73m662
13910B4095O833m248J6402o690m813j2847j8753l0269q878j6435r394L2031Q955
13897b4011j1344J6460K0906N274j1604k67J1265k3983J3606J3306j6844Q441
13885A205l60o192K543m174J133p522O230J1491M046R908K319K3531O525k5578
$$ plain form
13871 25105 6208 26478 9427 -30638 -36903 -18626 -1072 2010 3259 -12286 -42008 -52995
13859 -52995 -28704 -10038 -3578 -14586 -28483 -23817 2176 -3813 -16219 -20899 -17198 -11196 -4756
13846 -4756 -7498 -24742 -12710 -2511 3883 -2931 -8373 -15819 -11854 29443 26411 18670 17062 19356
13832 19356 18989 10419 -3198 4488 4706 5173 23403 43299 49359 28012 9386 10768 11839 31745
13818 31745 33578 40422 38817 20732 16355 -3011 -10637 17904 22927 -1533 -25632 -13284 -28438
13805 -28438 -31257 -3845 21644 -3069 1905 11746 14566 20357 18388 -20583 -35741 -30413 -24725
13792 -24725 -8815 9810 19685 18820 17751 23924 -7275 -32509 -38275 -22746 32006 28422 18889
13779 18889 18658 -726 8785 26619 373 -10647 -9257 1622 9036 -20083 -41028 -30980 -20730
$$ packed form
13871B5105j8897K0270j7051m0065o265J8277J7554L082J249j5545k9722j0987
13859e2995K4291J8666O460j1008j3897M666K5993n989j2406m680L701O002O440
13846d756k742j7244J2032J0199O394o814n442p446L965M1297l032p741j608K294
13832A9356l67q570j3617P686K18M67J8230J9896O060k1347j8626J382J071J9906
13818C1745J833O844j605j8085m377j9366p626K8541N023k4460k4099J2348j5154
13805b8438k819K7412K5489k4713M974R841K820N791j969l8971j5158N328N688
13792b4725J5910J8625R875q65j069O173l1199k5234n766J5529N4752l584r533
13779A8889k31j9384R511J7834k6246j1020J390J0879P414k9119k0945J0048J0250
$$ plain form
13766 -20730 -4949 -29629 -17412 -5365 -24611 -27111 -12996 3056 3217 7721 22618 25677 17954
13753 17954 3960 9059 17186 40455 23439 6666 2324 25260 -2009 -8038 -14708 15035 20728
13740 20728 26288 34786 28448 744 -3794 -10203 -16208 11936 12650 7197 -3001 -5262 -900 -9280
13726 -9280 12232 2934 22346 26861 19579 -20954 -48186 -32676 -15746 -6400 -634 -8912 -6827
13713 -6827 703 16639 2785 18072 13587 15936 15903 12052 -268 -19748 -18337 -5219 12946
13700 12946 16183 -6144 -6748 -1131 -16865 -20629 -22932 -54829 -36851 -11398 -5468 -6633 -6508 -9975
13686 -9975 -5982 1512 -12967 -17662 -1048 8651 2470 -10699 -14953 -29201 -30609 -32770 -25605 -2570
13672 -2570 31177 23476 -18005 -54252 -53387 -40955 -56388 -55244 -50692 -53342 -24951 -44513 -44471 -34638
$$ packed form
13766b0730J5781k4680J2217J2047j9246k500J4115J6052J61M504J4897L059p723
13753A7954j3994N099Q127K3269j7016j6773m342K2936k7269o029o670K9743N693
13740B0728N560Q498o338k7704m538o409o005K8144P14n453j0198k261M362q380
13726i280K1512r298J9412M515p282m0533k7232J5510J6930R346N766q278K085
13713f827P530J5936j3854J5287m485K349l3l851j2320j9480J411J3118J8165
13700A2946L237k2327o04N617j5734l764k303l1897J7978K5453N930j165J25l467
13686i975L993P494j4479m695J6614R699o181j3169m254j4248j408k161P165K3035
13672b570L3747p701m1481l6247Q65J2432j5433J144M552k650K8391j9562M2R833
$$ plain form
13658 -34638 -38810 -29772 -27644 -28203 3613 32073 35992 19026 30629 14450 -5844 11066 22513
13645 22513 13542 14507 14776 -6833 6008 -13328 -24208 -23638 -23285 -54881 -70091 -25072 -5526
13632 -5526 -15314 -27162 -23686 -16171 1243 -9420 -21692 -7843 -11050 -14027 -10206 -6895 -1352
13619 -1352 -24990 -4966 -9300 -18415 -38608 -20944 5845 1666 -1569 28440 19233 13468 -4336
13606 -4336 15292 35286 21377 -15717 -17305 -16130 -13172 -16341 -21377 -35263 -40439 -43824 -60682
13593 -60682 -51874 -38678 -5584 37873 34141 5649 -5111 9511 423 -5460 4021 -7511 -4107
13580 -4107 10847 28745 33267 29909 37580 -13345 -31578 -24996 -27210 -51068 -57480 -65185 -43685
13567 -43685 -29733 -14901 7931 3873 4002 6623 -13707 -18507 -7918 8 -667 -2621 -8768 4978
$$ packed form
13658c4638m172R038K128n59L1816K8460L919j6966J1603j6179k0294J6910J1447
13645B2513q971R65K69k1609J2841j9336j0880N70L53l1596j5210M5019J9546
13632e526r788j1848L476P515J7414j0663j2272J3849l207k977L821L311N543
13619a352k3638K0024m334r115k0193J7664K6789m179l235L0009r207n765j7804
13606d336J9628J9994j3909l7094j588J175K958l169n036j3886n176l385j6858
13593f0682Q808J3196L3094M3457l732k8492j0760J4622r088n883R481j1532L404
13580d107J4954J7898M522l358P671n0925j8233O582k214k3858o412p705K1500
13567d3685J3952J4832K2832m058J29K621k0330m800J0589P926o75j954o147J3746
$$ plain form
13553 4978 29079 9553 503 3346 -36 332 -19757 -32458 -10643 -6976 -32550 -42785 -40100
13540 -40100 -8251 4238 11123 2112 8123 17514 10217 8263 -18325 -48416 -55162 -31442 -21398
13527 -21398 -38078 -60712 -66385 -52463 -56492 -51695 -41015 -26481 -4174 5656 -751 -4094 27381
13514 27381 31923 17451 12684 4472 -28638 -18603 -11236 -2081 7617 4553 -2566 -5530 7928
13501 7928 47081 48415 7541 -12326 -41839 -47635 -63341 -54211 -32138 -10628 -12496 14816 18177
13488 18177 12119 3387 6340 10807 -1799 -6538 -19623 -35439 -62148 -30178 -17542 -10263 -11160
13475 -11160 -12673 -20063 9111 14227 18930 23656 10161 -5646 -19741 -2312 16606 10926 8028
13462 8028 32354 35655 19742 25592 36228 13384 -485 3750 -4731 -13353 -1446 -2509 -4389
$$ packed form
13553D978K4101j9526r050K843l382L68k0089j2701K1815L667k5574j0235K685
13540d0100L1849J2489O885r011O011R391p297j954k6588l0091o746K3720J0044
13527b1398j6680k2634n673J3922m029M797J0680J4534K2307R830o407l343L1475
13514B7381M542j4472m767q212l3110J0035P367R155R698l064p119k964J3458
13501G928L9153J334m0874j9867k9513n796j5706R130K2073K1510j868K7312L361
13488A8177o058q732K953M467j2606m739j3085j5816k6709L1970J2636P279q97
13475a1160j513p390K9174N116M703M726j3495j5807j4095J7429J8918n680k898
13462H028K4326L301j5913N850J0636k2844j3869M235q481q622J1907j063j880
$$ plain form
13449 -4389 -12463 -27115 -23906 -30268 -29237 -16634 -10279 850 15292 -10952 -28459 -11261 -4568
13436 -4568 6118 38433 45299 29846 34531 41040 28212 20197 5654 -11451 891 20328 32255
13423 32255 29373 1183 -17942 -8792 -11461 13687 23124 36268 -3617 -24638 -33394 3910 20607
13410 20607 29547 27433 30118 29110 27606 2476 -2257 18345 13304 16810 -1864 -14699 -25449
13397 -25449 -18899 14448 35119 8422 -20706 -15441 7212 36169 17846 -5877 -13179 3130
13385 3130 26693 9413 -32500 -43532 -7465 -5600 -6321 5931 4337 -14758 -14983 -25175 -41426
13372 -41426 -32191 -8140 -5567 -20718 -8224 7657 -4757 -20117 -24172 -24762 -11474 7439 25652
13359 25652 25894 15893 -623 -20899 -33688 -24891 -6422 -21332 -20739 -13568 -30764 -2694 11961
$$ packed form
13449d389q074j4652L209o362J031J2603O355J1129J4442k6244j7507J7198O693
13436d568J0686L2315O866j5453M685O509j2828q015j4543j7105J2342J9437J1927
13423C2255k882k8190j9125R150k669K5148R437J3144l9885k1021q756L7304J6697
13410B0607Q940k114K685j008j504k5130m733K0602n041L506j8674j2835j0750
13397b5449O550L3347K0671k6697k9128N265K2653K8957j8323k3723p302J6309
13385C130K3563j7280m1913j1032L6067J865p21J2252j594j9095k25j0192j6251
13372d1426R235K4051K573j5151J2494J5881j2414j5360m055n90J3288J8913J8213
13359B5652K42j0001j6516k0276j2789Q797J8469j4910N93P171j7196K8070J4655
$$ plain form
13346 11961 4028 -3115 -19366 -33830 -23099 -25906 -25892 -5566 -10026 -2922 6359 -4246 -19116
13333 -19116 -39015 -43544 3633 9523 -17138 -38230 -18650 -30736 -16729 19025 17030 16511 -1461
13320 -1461 2523 33401 24185 -1582 4185 22426 34160 21371 26471 14407 21420 23843 10044
13307 10044 -18701 -12355 10797 -402 -10318 -23346 -8949 10040 1454 9131 9810 -11298 -23856
13294 -23856 -26493 -11453 -10874 -31265 -25647 -17355 -7993 -6918 -21742 -38618 -25095 -12229 16032
13281 16032 36812 8508 -4529 7865 34186 40028 28398 48029 26364 -2006 -4526 2971
13269 2971 8807 -6449 -13163 -12027 3642 -20105 -7860 14280 8088 14406 22473 41206 9303
13256 9303 4230 136 -13325 -11600 -19274 -8213 -12703 -19513 -21691 -5896 197 -12157 -12865 -33953
$$ packed form
13346A1961p933p143j6251j4464J0731k807J4K0326m460P104R281j0605j4870
13333a9116j9899m529M7177N890k6661k1092J9580j2086J4007L5754j995n19j7972
13320a461L984L0878r216k5767N767J8241J1734j2789N100j2064P013K423j3799
13307A0044k8745O346K3152j1199r916j3028J4397J8989q586P677O79k1108j2558
13294b3856k637J5040N79k0391N618Q292R362J075j4824j6876J3523J2866K8261
13281A6032K0780k8304j3037J2394K6321N842j1630J9631k1665k8370k520P497
13269B971N836j5256o714J136J5669k3747J2245K2140o192O318Q067J8733l1903
13256I303n073m094j3461J725p674J1061m490o810k178J5795O093j2354p08k1088
$$ plain form
13242 -33953 -25743 -38979 -32881 -29966 -3861 -857 14815 37587 50209 18065 -19929 -27009 -33284
13229 -33284 -40730 -25783 -3293 25295 11929 7101 38599 27691 34 -25820 -5933 16299
13217 16299 22014 16281 -10600 -1025 -24056 -23126 5510 23653 24850 33225 38259 24621 6353
13204 6353 -15212 -32334 -29474 -13136 -30537 -59122 -55455 -41833 -39067 -15247 -28515 -49874
13192 -49874 -29457 -21476 -2919 -6465 -23 10726 46976 42156 20649 29016 34763 39500 51091
13179 51091 65290 48299 -820 -46052 -44949 -16291 -2389 -12529 16833 37201 48340 42291
13167 42291 41500 32118 -12045 -12749 -8069 -3598 -15789 -24249 -19280 5605 26143 42889 34932 29663
13153 29663 57415 42508 8282 -12126 -354 14693 10738 18121 36804 45865 56290 25582
$$ packed form
13242c3953Q210j3236O098K915K6105L004J5672K2772J2622l2144l7994p080o275
13229c3284p446J4947K2490K8588j3366m828L1498j0908k7657k5854J9887K2232
13217A6299N715n733k6881R575k3031R30K8636J8143J197Q375N034j3638j8268
13204F353k1565j7122K860J6338j7401k8585L667J3622K766K3820j3268k1359
13192d9874K0417P981J8557l546O442J0749L6250m820k1507Q367N747M737J1591
13179E1091J4199j6991m9119m5232J103K8658J3902j0140K9362K0368J1139o049
13167D2291p91r382m4163p04M680M471j2191q460M969K4885K0538J6746p957n269
13153B9663K7752j4907l4226k0408J1772J5047l955P383J8683R061J0425l0708
$$ plain form
13141 25582 -23075 -9492 13004 9326 -1354 -17511 2085 1368 13752 16547 10451 26124 13594
13128 13594 10798 18614 6570 21966 28277 31129 15874 29554 39895 25181 22600 -7073 -36164
13115 -36164 -26616 -17366 -16577 -28297 -21395 -7339 -14684 -7795 8779 40935 27919 12712 23329
13102 23329 13292 21608 27635 24911 3727 -11828 -7860 168 32240 32140 40075 63811 52960
13089 52960 51440 23679 7570 4453 19857 18715 26875 35244 34872 15495 384 -10233 -7268
13076 -7268 -31759 -14978 -3510 -14384 -23740 -16495 -25519 -36047 3679 17263 3939 2815 12448
13063 12448 19817 8142 -26760 -27225 -25891 -29351 -20201 -28692 -30153 -11741 1654 -1997 212 4117
13049 4117 -10322 -8753 -18367 2684 17840 23078 18856 -16439 -5582 8793 8175 8202 14416 -1368
$$ packed form
13141B5582m8657J3583K2496l678j0680j6157J9596p17J2384K795o096J5673j2530
13128A3594k796P816j2044J5396O311K852j5255J3680J0341j4714k581k9673k9091
13115c6164R548R250P89j1720O902J4056p345O889J6574L2156j3016j5207J0617
13102B3329j0037Q316O027k724k1184j5555L968Q028L2072j00P935K3736j0851
13089E2960j520k7761j6109l117J5404j142Q160Q369l72j9377j5111j0617K965
13076g268k4491J6781J1468j0874r356P245r024j0528L9726J3584j3324j124R633
13063A2448P369j1675l4902m65J334l460R150q491j461J8412J3395l651K209L905
13049D117j4439J569r614K1051J5156N238m222l5295J0857J4375o18K7O214j5784
$$ plain form
13035 -1368 -3571 -7290 -14862 -12286 -8350 9679 11761 -8277 -22139 2319 19949 2409 -10562
13022 -10562 -1549 20055 9637 4542 5340 -5501 -13613 -10659 -18015 -7139 -3267 -12642 -18908 -9449
13008 -9449 9297 20387 15349 11514 20417 8954 3736 27499 39482 40381 24183 16083 11482
12995 11482 -681 -22886 4454 -5225 -18618 4253 12517 -5117 -16212 -16306 -14060 -3487 9700
12982 9700 14580 40360 26968 4928 4249 16046 12447 -2604 -8076 2281 -27042 -19727 -26999
12969 -26999 -45475 -53363 -33413 -23168 -46174 -38973 -22296 -6575 -2712 -11546 -4273 -12476 -1134
12956 -1134 13826 27669 36778 23543 9772 5500 2419 -2604 -13189 -12673 -4765 9833 12557
12943 12557 15727 12414 29065 7044 -17309 -4877 -24744 -22883 -15875 5856 14334 9181 21321
$$ packed form
13035a368k203l719p572K576L936J8029K082k0038j3862K4458J7630j7540j2971
13022a0562R013K1604j0418n095P98j0841q112K954p356J0876L872r375o266R459
13008i449J8746J1090n038l835Q903j1463n218K3763J1983Q99j6198q100m601
12995A1482j2163k2205K7340r679j3393K2871Q264j7634j1095r4K246J0573J3187
12982I700M880K5780j3392k2040o79J1797l599j5051n472J0357k9323P315p272
12969b6999j8476p888J9950J0245k3006P201J6677J5721L863q834P273q203J1342
12956a134J4960J3843R109j3235j3771m272l081n023j0585N16P908J4598K724
12943A2557L170l313J6651k2021k4353J2432j9867J861P008K1731Q478n153J2140
$$ plain form
12930 21321 18075 37819 16584 -10861 -18692 -18323 -4084 -12083 -232 -2338 -22722 -33927 -18142
12917 -18142 -6236 4053 1792 8149 15258 9823 19337 10144 15465 36552 42087 28206 1478
12904 1478 -3954 -8135 9182 -5905 -18709 -14520 -8270 -11442 -23352 -17596 -22122 -7444 7612
12891 7612 -2077 31296 18763 -16329 -24615 -23815 -5554 11256 9472 -9112 -8042 -18504 -27507
12878 -27507 -50316 -47462 -37735 -22696 -7952 389 11040 10897 -16123 -17118 -32377 -46389 -48401
12865 -48401 -33811 -626 18664 -2404 5887 4485 -14216 -37223 -34040 -7782 -11217 1381
12853 1381 -3817 -3056 10358 2586 -22380 -24129 -3579 11430 -9048 -9899 -25069 -10513 -6050
12840 -6050 -9454 -23146 2125 25501 14202 -9804 -23005 -17920 -12477 -5861 16313 26060 -9303
$$ packed form
12930B1321l246J9744k1235k7445p831L69J4239p999J1851k106k0384j1205J5785
12917a8142J1906J0289k261O357P109n435R514r193N321K1087N535j3881k6728
12904A478n432m181J7317j5087j2804M189O250l172j1910N756m526J4678J5056
12891G612r689L3373j2533l5092q286Q00J8261J6810j784j8584J070j0462r003
12878b7507k2809K854R727J5039J4744Q341J0651j43k7020r95j5259j4012k012
12865d8401J4590L3185J9290k1068Q291j402j8701k3007L183K6258l435J2598
12853A381n198P61J3414p772k4966j749K0550J5009k0478q51j5170J4556M463
12840f050l404j3692K5271K3376j1299k4006j3201N085N443O616K2174R747l5363
$$ plain form
12827 -9303 -23953 -13198 -19636 10594 37693 49196 46750 22699 12940 10807 7732 16270 16983
12814 16983 -582 194 22871 41956 48659 25332 21220 4543 6175 11691 -1191 15788 30834
12801 30834 19943 710 -18595 -8280 27440 32806 12643 -14330 -26629 -1283 16517 21873
12789 21873 10019 8389 27594 26391 1329 1780 -4702 -10131 -12943 6269 -418 -15778 -18895
12776 -18895 -15308 -253 -15077 -22647 -11074 7416 -31339 -23418 13673 26759 25508 11873
12764 11873 12868 21354 30739 16966 -4651 -9383 21422 17236 -6999 -25860 -31837 -53419 -65516
12751 -65516 -53918 -35636 2697 17798 25146 28916 20393 8934 6726 2051 -18612 -23501 -29675
12738 -29675 -18468 -885 52836 61938 56524 40531 27107 8041 -664 -24610 -37117 -7937
$$ packed form
12827i303j4650J0755o438L0230K7099J1503k446k4051r759k133l075Q538P13
12814A6983j7565P76K2677J9085O703k3327m112j6677J632N516j2882J6979J5046
12801C0834j0891j9233j9305J0315L5720N366k0163k6973j2299K5346J7800N356
12789B1873j1854j630J9205j203k5062M51o482n429k812J9212o687j5360l117
12776a8895L587J5055j4824p570J1573J8490l8755P921L7091J3086j251j3635
12764A1873R95Q486R385j3773k1617m732L0805m186k4235j8861n977k1582j2097
12751f5516J1598J8282L8333J5101P348L770q523j1459k208m675k0663m889o174
12738b9675J1207J7583N3721R102n414j5993j3424j9066q705k3946j2507K9180
$$ plain form
12726 -7937 -9624 3528 18172 28982 36004 41462 32312 24398 21174 9599 -15850 -11181 -6317
12713 -6317 -14252 -30179 -63522 -43027 -22895 -22643 -12004 10808 3333 -10074 -6781 6744 4599
12700 4599 -491 4992 13489 8293 12535 29482 44707 34908 -482 -9342 -966 -5317 -12092 -1045
12686 -1045 -7383 -653 17353 33097 30571 17048 30546 44323 47285 38424 28108 57947 66261
12673 66261 49116 26996 13839 24626 13231 -122 11595 7360 -10032 -16244 -11025 -508
12661 -508 19093 1221 -19437 -19871 -267 16690 12625 -9529 -17279 -36741 -27981 -8766 -15788
12648 -15788 -17943 -15988 5311 33436 40781 43245 29542 -5190 -23876 -12079 -3428 -27061 -40651
12635 -40651 -25145 -30205 -11871 6062 -3655 9076 8799 8856 3863 -2878 -23513 -43319 -19859
$$ packed form
12726g937j687J3152J4644J0810P022N458r150p914l224j1575k5449M669M864
12713f317p935j5927l3343K0495K0132K52J0639K2812p475j3407L293J3525k145
12700D599n090N483Q497n196M242J6947J5225r799l5390q860Q376m351o775J1047
12686a045o338O730J8006J5744k526j3523J3498J3777K962q861j0316K9839Q314
12673F6261j7145k2120j3157J0787j1395j3353J1717m235j7392o212N219J0517
12661e08J9601j7872k0658m34J9604J6957m065k2154p750j9462Q760J9215p022
12648a5788k155J955K1299K8125P345K464j3703l4732j8686J1797Q651k3633j3590
12635d0651J5506n060J8334J7933r717J2731k77N7m993o741k0635j9806K3460
$$ [...]
##END NTUPLES=NMR SPECTRUM
##END=
