##TITLE=Analysis number 325630
Compound Code btb 08015
Book Reference 50350
Project Code adrs fraglib
Chemist Name jom
##JCAMPDX= 6.0         $$ Bruker NMR JCAMP-DX V2.0
##DATA TYPE= NMR SPECTRUM
##DATA CLASS= NTUPLES
##ORIGIN= Bruker BioSpin GmbH
##OWNER= nmr
$$ XWIN-NMR		Version 3.5
$$ Fri Jan  5 11:36:44 2007 GMT Standard Time (UT+0h)  MAYBRIDGE\nmr@NMR_250MHZ
##.OBSERVE FREQUENCY= 250.131544655141
##.OBSERVE NUCLEUS= ^1H
##.ACQUISITION MODE= SIMULTANEOUS (DQD)
##.ACQUISITION SCHEME= undefined
##.AVERAGES= 16
##.DIGITISER RES= 18
##SPECTROMETER/DATA SYSTEM= dpx250
##.PULSE SEQUENCE= zg30
##.SOLVENT NAME= CDCl3
##.SHIFT REFERENCE= (INTERNAL, CDCl3, 0, 16.517)
##AUDIT TRAIL= $$ (NUMBER, WHEN, WHO, WHERE, WHAT)
$$ ##TITLE= Audit trail, XWIN-NMR		Version 3.5
$$ ##JCAMPDX= 5.01
$$ ##ORIGIN= Bruker BioSpin GmbH
$$ ##OWNER= nmr
$$ C:\u/data/dgb/nmr/ADRS/460/pdata/1/auditp.txt
$$ ##AUDIT TRAIL=  $$ (NUMBER, WHEN, WHO, WHERE, WHAT)
(   1,<2007-01-05 11:36:23.06 +000>,<MAYBRIDGE\nmr>,<NMR_250MHZ>,
      <created by zg, POWCHK disabled, PULCHK disabled
       configuration hash MD5:
       49 4B E0 1D 92 C2 6B 37 9F E6 65 BC 52 41 86 1D
       data hash MD5: 64K
       A7 C6 B2 18 28 AE 5D D1 EC A0 C6 BB FB 4B 9B 09>)
(   2,<2007-01-05 11:36:35.31 +000>,<MAYBRIDGE\nmr>,<NMR_250MHZ>,
      <Start of raw data processing
       ef LB = 0.3 FT_mod = 6 PKNL = 1 SI = 32K 
       data hash MD5: 32K
       91 3F AE 25 5A E8 C6 55 59 A1 66 27 B1 DF 2C F6>)
(   3,<2007-01-05 11:36:36.99 +000>,<MAYBRIDGE\nmr>,<NMR_250MHZ>,
      <apk 
       data hash MD5: 32K
       00 0C 0C 5F 56 C5 DE 20 5B 45 89 A1 C5 63 11 8D>)
(   4,<2007-01-05 11:36:37.68 +000>,<MAYBRIDGE\nmr>,<NMR_250MHZ>,
      <abs ABSG = 5 
       data hash MD5: 32K
       81 29 87 AC 7D EB 6B 83 EE 29 9E 19 9B 7A 75 B2>)
$$ ##END=
$$ 
$$ hash MD5
$$ 7C 79 9D FF 2F 23 7E 76 A2 60 B4 65 7C 9F 59 BD
##$RELAX= 
##$RELAX= 
##$RELAX= 
##$RELAX= 
##$RELAX= 
##$RELAX= 
##$RELAX= 
$$ Bruker specific parameters
$$ --------------------------
##$DU= <C:\u>
##$EXPNO= 460
##$NAME= <ADRS>
##$PROCNO= 1
##$TYPE= <nmr>
##$USER= <dgb>
##$AMP= (0..31)
100 100 100 100 100 100 100 100 100 100 100 100 100 100 100 100 100 100 
100 100 100 100 100 100 100 100 100 100 100 100 100 100 
##$AQSEQ= 0
##$AQ_mod= 3
##$AUNM= <au_zg>
##$AUTOPOS= <36 >
##$BF1= 250.13
##$BF2= 250.13
##$BF3= 250.13
##$BF4= 250.13
##$BF5= 500.13
##$BF6= 500.13
##$BF7= 500.13
##$BF8= 500.13
##$BYTORDA= 1
##$CFDGTYP= 0
##$CFRGTYP= 5
##$CHEMSTR= <none>
##$CNST= (0..31)
1 1 145 1 1 1 1 1 1 1 1 1 1 1 1 1 1 1 1 1 1 1 1 1 1 1 1 1 1 1 1 1 
##$CPDPRG= <>
##$CPDPRG1= <>
##$CPDPRG2= <>
##$CPDPRG3= <>
##$CPDPRG4= <mlev>
##$CPDPRG5= <mlev>
##$CPDPRG6= <mlev>
##$CPDPRG7= <mlev>
##$CPDPRG8= <mlev>
##$CPDPRGB= <>
##$CPDPRGT= <>
##$D= (0..31)
0 1 0 0 0 0 0 0 0 0.06 0 0 0 0 0 0 0.0002 0 0 0 0 0 0 0 0 0 0 0 0 0 0 
0 
##$DATE= 1167996982
##$DBL= (0..7)
120 120 120 120 120 120 120 120 
##$DBP= (0..7)
150 150 150 150 150 150 150 150 
##$DBP07= 0
##$DBPNAM0= <>
##$DBPNAM1= <>
$$ [...]
##$SUBNAM7= <"">
##$SUBNAM8= <"">
##$SUBNAM9= <"">
##$SW= 20.6930455092707
##$SWIBOX= (0..15)
0 0 3 0 0 0 0 0 0 0 0 0 0 0 0 0 
##$SW_h= 5175.983436853
##$TD= 65536
##$TD0= 1
##$TE= 294.16
##$TE2= 300
##$TE3= 300
##$TEG= 300
##$TL= (0..7)
0 120 120 120 120 120 120 120 
##$TP= (0..7)
150 150 150 150 150 150 150 150 
##$TP07= 0
##$TPNAME0= <>
##$TPNAME1= <>
##$TPNAME2= <>
##$TPNAME3= <>
##$TPNAME4= <>
##$TPNAME5= <>
##$TPNAME6= <>
##$TPNAME7= <>
##$TPOAL= (0..7)
0.5 0.5 0.5 0.5 0.5 0.5 0.5 0.5 
##$TPOFFS= (0..7)
0 0 0 0 0 0 0 0 
##$TUNHIN= 0
##$TUNHOUT= 0
##$TUNXOUT= 0
##$USERA1= <user>
##$USERA2= <user>
##$USERA3= <user>
##$USERA4= <user>
##$USERA5= <user>
##$V9= 5
##$VALIST= <valist>
##$VCLIST= <CCCCCCCCCCCCCCC>
##$VD= 0
##$VDLIST= <DDDDDDDDDDDDDDD>
##$VPLIST= <PPPPPPPPPPPPPPP>
##$VTLIST= <TTTTTTTTTTTTTTT>
##$WBST= 1024
##$WBSW= 4
##$XGAIN= (0..3)
0 0 0 0 
##$XL= 0
##$YL= 0
##$YMAX_a= 345986
##$YMIN_a= -397691
##$ZGOPTNS= <>
##$ZL1= 120
##$ZL2= 120
##$ZL3= 120
##$ZL4= 120
##$ABSF1= 16.51701
##$ABSF2= -4.176163
##$ABSG= 5
##$ABSL= 3
##$ALPHA= 0
##$AQORDER= 0
##$ASSFAC= 0
##$ASSFACI= 0
##$ASSFACX= 0
##$ASSWID= 0
##$AUNMP= <proc_1d>
##$AZFE= 0.1
##$AZFW= 0.1
##$BCFW= 0
##$BC_mod= 0
##$BYTORDP= 0
##$COROFFS= 0
##$CY= 12.5
##$DATMOD= 1
##$DC= 0
##$DFILT= <>
##$DTYPP= 0
##$F1P= 14.0000005364418
##$F2P= -0.99999901652339
##$FCOR= 0.5
##$FTSIZE= 32768
##$FT_mod= 6
##$GAMMA= 0
##$GB= 0
##$INTBC= 1
##$INTSCL= 1
##$ISEN= 128
##$LB= 0.3
##$LEV0= 0
##$LPBIN= 0
##$MAXI= 10000
##$MC2= 0
##$MEAN= 0
##$ME_mod= 0
##$MI= 0
##$NCOEF= 0
##$NC_proc= -5
##$NLEV= 6
##$NOISF1= 0
##$NOISF2= 0
##$NSP= 0
##$NTH_PI= 0
##$NZP= 0
##$OFFSET= 16.51701
##$PC= 1
##$PHC0= 224.6416
##$PHC1= 4.978133
##$PH_mod= 1
##$PKNL= yes
##$PPARMOD= 0
##$PSCAL= 4
##$PSIGN= 0
##$REVERSE= no
##$SF= 250.130001247666
##$SI= 32768
##$SIGF1= 0
##$SIGF2= 0
##$SINO= 400
##$SIOLD= 32768
##$SREGLST= <1H.CDCl3>
##$SSB= 0
##$STSI= 32768
##$STSR= 0
##$SW_p= 5175.98343685301
##$SYMM= 0
##$S_DEV= 0
##$TDeff= 65536
##$TDoff= 0
##$TI= <Analysis number 999999
Compound Code 99
Book Reference 9
Project Code 9>
##$TILT= no
##$TM1= 0
##$TM2= 0
##$TOPLEV= 0
##$USERP1= <user>
##$USERP2= <user>
##$USERP3= <user>
##$USERP4= <user>
##$USERP5= <user>
##$WDW= 1
##$XDIM= 32768
##$YMAX_p= 357918696
##$YMIN_p= -479864
$$ End of Bruker specific parameters
$$ ---------------------------------
##NTUPLES= NMR SPECTRUM
##VAR_NAME=  FREQUENCY,     SPECTRUM/REAL,   SPECTRUM/IMAG
##SYMBOL=    X,             R,               I
##VAR_TYPE=  INDEPENDENT,   DEPENDENT,       DEPENDENT
##VAR_FORM=  AFFN,          ASDF,            ASDF
##VAR_DIM=   32768,         32768,           32768
##UNITS=     HZ,            ARBITRARY UNITS, ARBITRARY UNITS
##FACTOR=    0.157963299565203, 1,           1
##FIRST=     4131.39966565013, 0,            0
##LAST=      -1044.58377120288, 0,           0
##MIN=       -1044.58377120288, -479864,     0
##MAX=       4131.39966565013, 357918696,    0
$$ Real data points
##PAGE= N=1
##DATA TABLE= (X++(R..R)), XYDATA
$$ [...]
23521b77268R780J03496J11595n1030n560J40964O5763j49274j07038L0407M5858
23510h2307M0768o4735j23492Q1572J22994n7283n7248k6857J37151O456k2159
23499d5140P58Q4032p8842j64230Q0881m2779l371J61405K8638p5052q1578l9088
23487a74366O7456Q5797J30324l0253j82196N0974M5372n0830K3805J21307J08147
23476A95537N2869j22659r8550r7153l9206K5987Q6112Q319Q4911o3443j7611
23465A5113J61152J01653o6135j343j39667q108P7059K3032o4119p2529l2058
23454e950N1848N474p4052O9351J26207J6135j14804N8806l2049o1150q64m6249
23442g297j69105j02044L4299m6660R2421J88029o1255q8501p4520J15294J51115
$$ plain form
23521 -277268 -267488 -163992 -52397 -103427 -108987 31977 97740 -51534 -158572 -128165 -82307
23510 -82307 -41539 -106274 -229766 -148194 -25200 -82483 -139731 -166588 -29437 -22981 -45140
23499 -45140 -44382 39650 -39192 -203422 -122541 -165320 -168691 -7286 21352 -53700 -135278 -174366
23487 -174366 -106910 -21113 109211 78958 -103238 -52264 -6892 -57722 -33917 87390 195537
23476 195537 248406 125747 27197 -69956 -109162 -83175 2937 11256 96167 32724 15113
23465 15113 176265 277918 211783 210440 70773 62665 139724 162756 98637 26108 -5950
23454 -5950 45898 51372 -22680 46671 172878 189013 74209 133015 100966 39816 38952 -7297
23442 -7297 -176402 -278446 -244147 -290807 -198386 -10357 -71612 -160113 -234633 -119339 31776
23431C1776j932j1672p8053l3047n278R2877q363j5830J21582K0264j8978j0200
23419H3146k7921p9031l59L0106P0207n9138p6520M686K8662J49014N6326l6248
23407A42930j07840p8841j7937p491J0659M7236M5609r8147N4564J80258o0253
23396A10747q7136r6069P0869O4550M767L6926m4213L7407K199m726n7191k4142
23384A3988q5792n6662J9836l5266j05946m366L3172J00166J06600k2050j45603
23373a81923j07557Q4521J66157N1911q288r9455J3420Q9867n4362j9573J00704
23362C5422O115n4178L8204q5937L7474K552P1635j3364L59O9661l9883k8326
23350C9734o3438J7731M904j3576N6309k3369M4007J1914p1214R62J3428K2463
$$ plain form
23431 31776 29844 18172 -59881 -92928 -98206 -5329 -13692 -29522 92060 112324 93346 83146
23419 83146 55225 -23806 -24165 5941 76148 17010 -59510 -54824 -26162 122852 179178 142930
23407 142930 35090 -43751 -61688 -69179 -58520 -11284 34325 -63822 -9258 171000 110747
23396 110747 23611 -72458 -1589 62961 67728 104654 60441 97848 100047 95321 38130 13988
23384 13988 -71804 -128466 -108630 -143896 -249842 -254208 -221036 -120870 -14270 -36320 -181923
23373 -181923 -289480 -204959 -38802 13109 4821 -94634 -81214 8653 -45709 -65282 35422
23362 35422 41537 -12641 25563 -60374 -22900 -20348 51287 37923 38282 107943 68060 39734
23350 39734 -23704 -5973 -1069 -14645 41664 18295 62302 74216 3002 3964 17392 39855
23338C9855p0668N1722O155Q9324J0350n2578N4189m8211K4874p1854j4472N2369
23326G1055O2080p7201p9541J30479R6938o0133m6105L4803l1178O1481M3290
23315B05968J04355n4991o1149j16035k988P2100J1902M1019J19469o6277n5290
23304A98083p1378j6490p4833o4798O8397N2978n9771n2890l9908M0462R9476
23293G9328j04223j14533P7226l2587o1682L7172K8387M5096N6649J01060n9644
23282E2249j30260p4626L5118J5602m9125k1897R6729J8518p7371m8123J31556
23271e1630l1293J34411K04358l7101L3429k8611o6010L6584J6751k6167j55305
23260B9416p8053j06674J8969J4496J6792n7324k4046J14229Q5193n442L0767
$$ plain form
23338 39855 -30813 20909 27064 116388 126738 74160 128349 80138 105012 33158 18686 71055
23326 71055 133135 55934 -23607 106872 203810 143677 97572 132375 101197 162678 205968
23315 205968 310323 255332 194183 78148 75160 147260 159162 200181 319650 253373 198083
23304 198083 126705 110215 35382 -29416 38981 91959 32188 -20702 -60610 -20148 79328
23293 79328 -24895 -139428 -62202 -94789 -156471 -119299 -90912 -45816 10833 111893 52249
23282 52249 -78011 -152637 -117519 -101917 -151042 -172939 -76210 -57692 -135063 -183186 -51630
23271 -51630 -82923 51488 255846 218745 252174 223563 157553 194137 210888 184721 29416
23260 29416 -48637 -155311 -136342 -121846 -105054 -162378 -186424 -72195 12998 7556 38323
23249C8323k3694r9527M5728R9335J5842p7628J6691P9294q6840n6843o2319J51645
23237D0007J5209L2848k537n9596r6921m1475M1466Q8251j04483j6040j0126M1328
23225g2069J13888J07087k1042n6922l6226j01431j41678Q918J53382J63636p1076
23214D6467j68916m2296R0902J42736P5198L3104j10336n5686R2384p512j18j22561
23202b6634j13206P6939J11541j5160o8906l8999O471p6750j0633j070N1409J5529
23190h9469k1283k781O3804L9571M1077P7930J02475q3992n2864N1697n8723j3197
23178E4245O8069q9235L140M4175n3482q7626K0398p92J2263p8827j42477J97403
23166e2746J52980k0603l2586Q9252j591r468l696r7729j15268J08531O8775j5598
$$ plain form
23249 38323 14629 -84898 -39170 60165 76007 -1621 15070 94364 7524 -49319 -111638 40007
23237 40007 55216 88064 85527 25931 -70990 -112465 -70999 17252 -87231 -103271 -113397 -72069
23225 -72069 41819 148906 127864 70942 34716 -66715 -208393 -199475 -46093 117543 46467
23214 46467 -122449 -164745 -73843 68893 144091 177195 66859 11173 103557 96045 95927 -26634
23202 -26634 -139840 -62901 48640 33480 -35426 -74425 -67954 -144704 -155337 -156407 -104998 -89469
23190 -89469 -110752 -113533 -49729 -10158 30919 108849 211324 127332 74468 126165 67442 54245
23178 54245 122314 33079 36219 80394 26912 -60714 -40316 -41108 -28845 -107672 -250149 -52746
23166 -52746 100234 79631 47045 136297 134706 125238 121542 23813 -91455 17076 85851 70253
23154G0253l7828J74357K1478r5144j11968l3849n113j4704J024n293L5390m9530
23142e0927q8187j02885o4513n6645Q0304O457R3353O2494r3717j10443O9850
23131b54859J30378N9068N7609O5005k4719r4605l8592K3810K2606N4028J1085
23120A0814m1597J7653n8501j1782K2645R7568O6815n9798p6938R115O4818J7529
23108E8341q6665k0193R1762j43j91532k4909J06976J22481n19o1818K1004o4706
23096d9921j25820Q4924M9226o8656M993Q9588Q7290j06342q4908m8077q669P9759
23084i6613J0602p1827m4443n963J0826L04P327O0543l0976m864K2642n0027L8001
23071a54468K0902O0125O8247p9824m6377k0356J9780J69774Q682m1457L7323
$$ plain form
23154 70253 32425 206782 228260 133116 21148 -12701 -17814 -32518 -31494 -36787 -1397 -50927
23142 -50927 -139114 -241999 -306512 -363157 -282853 -276396 -183043 -120549 -214266 -324709 -254859
23131 -254859 -124481 -65413 -7804 57201 32482 -62123 -100715 -76905 -54299 -271 10814
23120 10814 -30783 -13130 -71631 -83413 -60768 36800 103615 43817 -33121 -24006 40812 58341
23108 58341 -28324 -48517 43245 43102 -148430 -173339 -66363 56118 55599 -6219 14785 -49921
23096 -49921 -175741 -90817 -41591 -110247 -105254 -15666 71624 -34718 -119626 -167703 -176372 -96613
23084 -96613 -86011 -157838 -202281 -208244 -197418 -197114 -189787 -129244 -160220 -165084 -142442 -192469 -154468
23071 -154468 -133566 -73441 -5194 -85018 -131395 -151751 -131971 37803 46485 5028 42351
23060D2351R8393j1009j16462j0174r2385N6637J17920M8247o2197k5784J3162
23049E8699K7924K231k4686r6446J6758m8499L9442k1738R7903j8066j59977j5705
23037a42160R798J43780l6587N2982P4385r4807j05645P0160K4593R6262M9286
23026A42047j00506p6728o6742P6556L9676n1072q009j535m7508J438J16462J4096
23014C8175l1945p997m04P6389O9378k3562j17753r7511o3629M8613R3263n6744
23002g3727L7928M5637K7578k1328O3331O6133q2726n7146n4860j7853p5116m9744
22990a91893J33628R1385J05817j9840j24309J4003J1524J14325l6651j38930
22980d0941N7079J23502r2184m6043n703J24580K2966q1404n2731J19147O3388
$$ plain form
23060 42351 140744 129735 13273 3099 -89286 -32649 85271 133518 71321 45537 58699
23049 58699 86623 88854 64168 -32278 -15520 -64019 -24577 -46315 51588 33522 -126455 -142160
23037 -142160 -132362 11418 -25169 27813 102198 7391 -98254 -28094 -3501 92761 142047
23026 142047 41541 -35187 -101929 -25373 14303 -36769 -44778 -46313 -93821 -92383 24079 38175
23014 38175 6230 -1767 -2171 74218 143596 120034 2281 -95230 -158859 -110246 -16983 -73727
23002 -73727 -35799 9838 37416 16088 79419 145552 62826 5680 -49180 -67033 -142149 -191893
22990 -191893 -58265 33120 138937 119097 -5212 8791 20315 134640 97989 -40941
22980 -40941 16138 139640 47456 1413 -4290 120290 143256 61852 9121 128268 191656
22969A91656j7007l5382k3317l2427n2002j24166K8492N6823j2854L3272J58j9521
22957f275o8283N1040r9641K4209m2096J1589l7695p2969N2194P9724J7196n554
22945i6561m979M6760o8541k8716J37865J17832M4299m618o7126o9665o2903J4278
22933d2075m5283Q614p7286J48960J09345k4335k9948j28659n2048J41209J31144
22922A39638j07208q33J2695l7809J9669M6236R241K4844r3739p9892M0942J04657
22910G8441P1814p2491j09993m2376m0451k8964o0815r9809J06698k0602M0896
22899a77652Q4921R2071J27101P8457m7399P0718o4258r0532m1297n371j16331
22888h9572m2322j7639J6188k0024p8494N5677J21968J8484m6006J3068L7890
$$ plain form
22969 191656 174649 139267 115950 83523 31521 -92645 -64153 -7330 -20184 13088 13246 -6275
22957 -6275 -74558 -23518 -123159 -98950 -141046 -129457 -167152 -240121 -187927 -108203 -91007 -96561
22945 -96561 -101540 -54780 -123321 -152037 -14172 103660 147959 143341 76215 6550 -56353 -42075
22933 -42075 -87358 -78744 -156030 -7070 102275 77940 47992 -80667 -132715 8494 139638
22922 139638 32430 31597 44292 6483 26152 72388 81629 106473 12734 -67158 -26216 78441
22910 78441 150255 77764 -32229 -74605 -115056 -144020 -204835 -304644 -197946 -218548 -177652
22899 -177652 -92731 -660 126441 204898 157499 228217 163959 73427 32130 26759 -89572
22888 -89572 -131894 -149533 -133345 -153369 -231863 -176186 -54218 -35734 -81740 -68672 -30782
22877c0782J7161K2787L96o4111O1942N1165J40572k1350j76560j29954Q9829
22866c8905K5377o3818N5323k3489k9601M2285Q3368l1709K9564N2167n3026j3067
22854C4469K428Q8811P4158j6856k3905q5322k0089n1139n766q4577j18404n3685
22842b59877R9434R4180J6333N7879J9906j02790r4877K5020J23750P1783n5732
22831d991q6112K4036K075J8118l0262M4305R1547J30650j54806o9189O9001L9303
22819G3675J07012j0312k3549m8974l5293l7159q7282k814m1067j26771L733k109
22807b30910J48651J28876J203L6067o538Q8477j5089r9219j47226k9306R691
22796a15323P7016L4631o8233n1411M0905q1150Q0281M6432n7194J4382N0631
$$ plain form
22877 -30782 -13621 9166 9562 -54549 7393 58558 199130 177780 1220 -128734 -38905
22866 -38905 -13528 -77346 -22023 -45512 -75113 -32828 50540 18831 48395 100562 47536 34469
22854 34469 36897 125708 199866 183010 159105 73783 53694 2555 -3211 -87788 -206192 -259877
22842 -259877 -160443 -66263 -49930 7949 27855 -74935 -169812 -144792 -21042 50741 -4991
22831 -4991 -91103 -67067 -64992 -46874 -77136 -32831 58716 189366 34560 -34629 34372 73675
22819 73675 180687 170375 146826 97852 62559 25400 -61882 -64696 -105763 -232534 -228801 -230910
22807 -230910 -82259 46617 47820 83887 77349 165826 150737 51518 -95708 -125014 -115323
22796 -115323 -38307 -3676 -71909 -123320 -82415 -163565 -83284 -36852 -94046 -79664 -29033
22785b9033K2308m0472l2491j55017M8320p189K4216K2556j6778m424q0889K2742
22773b26151J45917N709Q9693P7939r270p6635o7609k2745o15J204J35801L2411
22761H5649n7562j29192N9609J04621J8274j37656P5316Q0751p8848q0222j37215
22750a96475L0602R0353N0958k7428J9617L4208m5514l2605p4064P75J42295j9084
22738b6362j13207K1349L3589O1361O2150K568p9751J2626L8045L0055Q8749L7504
22726A68676n3368j00852l6689j4088m2916M0495J1305j50623J818J23474N0547
22715b221j98546p9640L4474K677J30300N6309k1503J1644o1674r1111K8937M4995
22703a45359J03680l5504j66110N6694R1927m2553j9907J39212R8774m8303L7444
$$ plain form
22785 -29033 -6725 -47197 -79688 -234705 -186385 -193574 -169358 -146802 -163580 -168004 -248893 -226151
22773 -226151 -80234 -74525 15168 93107 83837 7202 -60407 -83152 -83767 -82563 53238 85649
22761 85649 28087 -101105 -41496 63125 81399 -56257 19059 99810 20962 -59260 -196475
22750 -196475 -165873 -75520 -24562 -51990 -32373 1835 -43679 -76284 -150348 -149573 -7278 -26362
22738 -26362 -139569 -118220 -84631 -23270 38880 41448 -38303 -25677 12368 42423 131172 168676
22726 168676 115308 14456 -22233 -36321 -79237 -38742 -27437 -178060 -176242 -52768 -2221
22715 -2221 -200767 -280407 -245933 -243256 -112956 -56647 -78150 -66506 -128180 -219291 -190354 -145359
22703 -145359 -41679 -77183 -243293 -186599 -94672 -137225 -157132 -17920 80854 32551 69995
22692F9995R603l9026J4204O7567j58602m0329K8906M7123L0219j120N8055J34969
22680B21564P4660l2693j48439k3717n5734K7668n1513o9335o5660m7614O488
22669a64325L0184k0605L9747J52149L9085p0489r663P6948o4016j26017R323
22658a07679N0739N8067m0805l0611n9853K510J11316J19905J09035k0348j01873
22647I0403J1598k8056o19m8454L5473J9095j7946n5307N6560r3990n3401l9754
22635a24398o1858M7094P9393J21376Q5690n9650K6117K930j2448k3304P2559
22624A53501P5537o3113k0372j01346r3712J4370M7634j2321r2964q5327j1200
22613a89313O4054J52585Q9565l7257P519K9265m3902n634j07771k7931n2270
$$ plain form
22692 69995 79598 40572 54776 122343 -36259 -76588 -47682 -559 29660 28540 86595 221564
22680 221564 296224 263531 115092 91375 35641 63309 11796 -57539 -123199 -170813 -164325
22669 -164325 -134141 -154746 -114999 37150 76235 5746 -3917 73031 9015 -117002 -107679
22658 -107679 -56940 1127 -39678 -70289 -130142 -127632 -16316 103589 212624 192276 90403
22647 90403 102001 73945 73326 24872 60345 79440 61494 6187 62747 -31243 -84644 -124398
22635 -124398 -186256 -139162 -59769 61607 147297 87647 113764 116694 104246 80942 153501
22624 153501 229038 165925 145553 44207 -49505 -35135 12499 178 -92786 -178113 -189313
22613 -189313 -125259 27326 116891 79634 87153 116418 72516 66882 -40889 -68820 -121090
22602a21090j7497J06635J7321k1687q5711J2506J61534J8461l6323p1851J0965
22591b6737k1086K870M1062N510n8879J02811j1491j3147o2158M5135j8897R3928
22579G8921J18646k2928k4212q3370o5903N529l4825J0556J7202q2974N5477j76207
22567b04088m3263J6515j055J2472j8161j1142J45780J14795m3871l7019J8751
22556e0286q584Q500p528r1617Q1567q134Q1145l2726O7984L5580m1275m3369
22544h743J3083l5850m2709o5613P2472M0855o517L8220j2678k4629O1570P4579
22532A04040j61121q5876J09851J9674l7147M0968M6622N4200K5390o0356j49615
22521i3370o0496Q0878o953O3201N7535N7610j79505q1022J05671L6969m5026
$$ plain form
22602 -121090 -138587 -31952 -14631 -36318 -122029 -109523 52011 70472 34149 -37702 -26737
22591 -26737 -47823 -44953 -3891 1619 -57260 45551 34060 20913 -41245 3890 -15007 78921
22579 78921 197567 174639 150427 67057 1154 6683 -28142 -17586 -384 -83358 -27881 -204088
22567 -204088 -247351 -230836 -231891 -219419 -237580 -248722 -102942 11853 -32018 -69037 -50286
22556 -50286 -58870 -50370 -57898 -149515 -67948 -76082 5063 -27663 40321 75901 34626 -8743
22544 -8743 4340 -31510 -74219 -139832 -67360 -26505 -33022 5198 -7480 -32109 29461 104040
22532 104040 -57081 -142957 -33106 -13432 -50579 -9611 37011 91211 116601 56245 -93370
22521 -93370 -153866 -72988 -79941 -16740 40795 98405 -81100 -162122 -56451 -19482 -64508
22510f4508j52139m9089P2072O5194R0729M1716l5389p0074l3374Q9296R6480
22499E0914L5582K4708O9781k3540q9544m8337n0224J3593m150L4819L0421P7638
22487A21661L63p114m9170n0822l6201M3410J08050J7210N1133q5719N7312o7058
22475A03055j22604L6216M8938L7220M4302J1904K7507j14860L3308j9840n3401
22464C1745j325Q0837J63k2249J9881o5501k9086Qj18N1868r128N3894q2155j78218
22450a49384L0052O6669P9215N984o1554j42574j8240lJ2015L3468Q3443N0450
22438a0459q538J691J20762K9335j01661q8593r253N5182n3435P7462J02403k6294
22426H8602m954j05108N548q171J36176J19048j24499o7380N018m9731p608j1834
$$ plain form
22510 -64508 -216647 -265736 -193664 -128470 -37741 3975 -31414 -101488 -134862 -45566 50914
22499 50914 86496 111204 180985 157445 67901 19564 -30660 -17067 -21217 13602 44023 121661
22487 121661 122024 114910 65740 14918 -21283 22127 130177 147387 198520 112801 170113 103055
22475 103055 -19549 16667 65605 102825 147127 159031 186538 71678 104986 85146 31745
22464 31745 30420 111257 111420 89171 109052 43551 14465 14473 14355 66223 57095 110989 28834 -149384
22450 -149384 -119332 -52663 26552 32536 -29018 -171592 -189832 -189835 -177820 -144352 -60909 -10459
22438 -10459 -18997 -17306 103456 132791 31130 -57463 -66716 -11534 -64969 12493 114896 88602
22426 88602 83648 -21460 -15912 -24083 112093 231141 106642 39262 44280 -5451 -13059 -24893
22414b4893j6687J43257L4621k9938L656j22827j29683j5258L9519O4842k3579
22403g6970m6269j08190q5247l320J30511k3716r3076m2619J06452J29425J07556
22392e463q101L7723Q8770q8050o0876L8419J2690j3336k0074L4693J4722j12733
22380h1616k1511J08172K5849J02608L9809j75705o6148l5741Q7022J16447J5661
22369A14847m6318O582k6362R947J8956O9752M4896R992O3354L90q4060j61430
22357B0546j0358J39523J14700m3277O3722J2590r1474p866j44420j81427K0310
22346a07431M7744R1795O5562R8787n6664p1381l3892n4479J86262J05165j0602
22335B60866j07525j96852j08149M6845J97573k352j17141M4131J45144m181k2083
$$ plain form
22414 -24893 -41580 101677 136298 106360 110016 -12811 -142494 -157752 -118233 -53391 -76970
22403 -76970 -123239 -231429 -316676 -319996 -189485 -213201 -306277 -348896 -242444 -113019 -5463
22392 -5463 -13564 24159 112929 24879 -35997 2422 15112 1776 -18298 16395 31117 -81616
22380 -81616 -103127 5045 30894 133502 173311 -2394 -68542 -104283 -17261 99186 114847
22369 114847 68529 75111 48749 58696 77652 147404 192300 202292 265646 266036 181976 20546
22357 20546 10188 149711 264411 221134 284856 297446 205972 198106 53686 -127741 -107431
22346 -107431 -59687 32108 97670 196457 139793 68412 34520 -19959 166303 271468 260866
22335 260866 153341 -43511 -151660 -104815 92758 90406 -26735 17396 162540 158359 136276
22324A36276n1297l9143m1233k8610q5199J43232R3211k3570r3452o9314j4987
22313g4086O5195M1789P2588m5190j3955j1181j08616M9887J08585J01842o7854
22302A19004j28802l0140M3281N4535q5581M4940P7211K0319N0726j21385p7731
22291c3623J8552M8405R7478Q3900o2827j21296r6844n7673k706l7995O4559r49
22279a01019J4434L2976K07923J17708k7929j36559j99683k1404L7283K7466J2131
22268c6673J65989J19662L0559q8771j19406j02667L9193M4473j45475m4499Q6022
22257e1593J4745M367P1366k1740j06631l6091J16153R3184L3376l3613L5712
22246A19235L2925P4504Q37j32361p5724o4104m0422p4389n8014O2564j1181J8102
$$ plain form
22324 136276 84979 45836 4603 -24007 -109206 34026 127237 103667 10215 -59099 -74086
22313 -74086 -8891 32898 105486 60296 46341 35160 -73456 -23569 85016 186858 119004
22302 119004 -9798 -39938 3343 57878 -27703 17237 94448 114767 165493 44108 -33623
22291 -33623 -15071 33334 130812 214712 151885 30589 -66255 -123928 -126634 -164629 -100070 -101019
22279 -101019 -86585 -53609 154314 272022 244093 107534 -92149 -113553 -76270 -48804 -36673
22268 -36673 129316 248978 279537 190766 71360 -31307 7886 52359 -93116 -137615 -51593
22257 -51593 -36848 -32481 38885 17145 -89486 -125577 -9424 83760 117136 83523 119235
22246 119235 152160 226664 227501 95140 19416 -44688 -85110 -159499 -217513 -154949 -166130 -148028
22234a48028O9513J6985m1047k5757l3907J3028J6617Q6533J24384k8638j01522
22223e1839j31167Q361M5715j07903R3344J45417K1918o5723J07533O4080O8636
22212A98372q0720j33295j3383J01902N2925O3742m4734j56691r8108k4886l8544
22201a73420J32257N3699j2663p6610Q1396O0985k4419j7229r8864j3351j16123
22190b04342l2745j0670J05297R5635L051j0650q768j7330l706J37895j9319J31363
22178A65711k9714n3885j44422m7449Q8574J74525j7725j49926j704N442q8684
22167i9257O929L4874M9127P4128k0637j7969n879l0141r5359o1622M5655N1897
22155f8254O5294m5050n415N3771m6566O1510N0722Q4193n9385j82338q4176k1256
$$ plain form
22234 -148028 -78515 -61530 -102577 -128334 -162241 -149213 -132596 -46063 78321 49683 -51839
22223 -51839 -183006 -174645 -128930 -236833 -143489 1928 23846 -41877 65656 129736 198372
22212 198372 117652 -15643 -29026 72876 125801 189543 144809 -11882 -109990 -134876 -173420
22201 -173420 -41163 12536 -127 -76737 4659 65644 41225 23996 -74868 -88219 -204342
22190 -204342 -237087 -247757 -142460 -46825 -43774 -54424 -63192 -80522 -84228 53667 34348 165711
22178 165711 135997 82112 -62310 -109759 -21185 153340 135615 -14311 -16015 -10573 -99257
22167 -99257 -92328 -57454 -8327 65801 45164 27195 21316 -8825 -104184 -165806 -120151 -68254
22155 -68254 -2960 -48010 -53425 346 -46220 15290 66012 150205 90820 -91518 -175694 -196950
22143a96950j21962q9109J06756Q8315k9764J26450R9425J0210o3795M794Q2024
22132A6394j5367j11121k8996N1651M3755M9156n350l2991j14597j1393R3139
22121f5720M8218l6668n4167o2678O5654K21761M7283Q1294J120j19279j46697
22110a9879j35499N797l9152L7392M4668M8668m6132j58442n32Q9231P949L1391
22098a34540R476Q1414O0251O3371p830K8691n6648j07699j19049n7664N6150
22087a84077J02988N2055o5868l5620q505j4520P6091M0476L9332J7999k2548
22076b197R695Q6558j4963p2917j39126N7556O334J49649q3474p9157K8079p8990
22064a32953r1676P6442j7584m4363M6555J30315Q756l0391L2331N1289J9286
$$ plain form
22143 -196950 -318912 -408021 -301265 -212950 -242714 -116264 -16839 -6629 -70424 -65630 16394
22132 16394 1027 -110094 -139090 -87439 -43684 5472 122 -32869 -147466 -158859 -65720
22121 -65720 -17502 -54170 -108337 -171015 -105361 116400 163683 244977 246097 126818 -19879
22110 -19879 -155378 -149581 -188733 -151341 -106673 -58005 -104137 -262579 -263111 -173880 -165931 -134540
22098 -134540 -125064 -43650 16601 79972 72142 100833 44185 -63514 -182563 -240227 -184077
22087 -184077 -81089 -29034 -94902 -130522 -139027 -153547 -77456 -36980 2352 20351 -2197
22076 -2197 7498 94056 79093 6176 -132950 -75394 -69060 80589 -2885 -82042 -53963 -132953
22064 -132953 -224629 -148187 -165771 -210134 -163579 -33264 -24508 -54899 -22568 28721 48007
22053D8007q4844O0013L7606n5871j82983m9017J28761M6131L5947p920j4232
22042c8402O8789J61176j2557j37110l8250N8494P1060m5167j0215n8456p0280
22031e0918r0254l4399L4023P2667L5545J68035j9477r0279j30324N5745O0807
22020A1171n6745o3358K5573n7603K6070k0104L0360O3614k8770m9334L1900Q310
22008g8916J6044J4441N4059Q9929j59297k3819k9732P4611P0041M8072o7063
21997H370q9499p7827J4991P9109o5950n2270O1050N0057N6821o9311j8700q2906
21985a86065J10092J33476m0231J9539J3172O884j17725n5312k991R003O7009
21974d3149O8277J35174n5447K8927j17123n4231J01435r5252j54320P7236M1988
$$ plain form
22053 48007 -36837 23176 60782 4911 -178072 -227089 -98328 -52197 -16250 -24170 -38402
22042 -38402 30387 191563 179006 41896 3646 62140 133200 88033 77818 19362 -50918
22031 -50918 -141172 -175571 -141548 -68881 -33336 134699 115222 24943 -105381 -49636 11171
22020 11171 -45574 -108932 -83359 -140962 -114892 -134996 -104636 -41022 -69792 -119126 -87226 -78916
22008 -78916 -62872 -48431 5628 95557 -63740 -87559 -117291 -42680 27361 75433 8370
21997 8370 -81129 -158956 -143965 -64856 -130806 -183076 -122026 -71969 -15148 -84459 -103159 -186065
21985 -186065 -75973 57503 17272 36811 49983 56867 -60858 -116170 -119161 -110158 -43149
21974 -43149 25128 160302 104855 133782 16659 -37572 63863 -31389 -185709 -108473 -66485
21963f6485N8533j134k0182P9822K0036n258m9671p387o1909r2513j3357J8944
21951a40561L0199J50963j3136P471J26457n8806r4421L9673l5731o9324m7369
21940a04585n6849N0443l9253M3274R9361m1468Q1561P6203J14196J25357L5439
21929C83679r440k33398j73646L0162J23190O6886r6668r5202r6920k3013L402
21918a20968P3109j12j4031L087q4096l3650K77N8893K1467N8287l890o9403l1993
21905a43023M7606N891l454L0772Q7204J79162J12342j18094m3413Q007O1707
21894B24707o9j52351p9070R7968L8460k03209o7532K3727k148O0613N3609L1451
21882B6156P7548O6696j8437j19585p0984K2345R0379p8761q3647m5099j8006
$$ plain form
21963 -66485 -7952 -9086 -29268 50554 70590 65332 15661 8274 -53635 -146148 -159505 -140561
21951 -140561 -110362 40601 27465 34936 161393 102587 8166 47839 12108 -57216 -104585
21940 -104585 -161434 -110991 -150244 -106970 -7609 -49077 32484 108687 222883 348240 383679
21929 383679 374239 140841 -32805 -2643 120547 187433 90765 -4437 -101357 -124370 -120968
21918 -120968 -47859 -47971 -62002 -58915 -143011 -176661 -176384 -117491 -96024 -37737 -41627 -111030 -143023
21905 -143023 -95417 -89526 -92980 -62208 24996 204158 316500 198406 154993 163000 224707
21894 224707 224638 72287 -6783 91185 129645 -73564 -141096 -117369 -119517 -58904 -5295 26156
21882 26156 103704 170400 151963 32378 -38606 -16261 74118 -4643 -88290 -133389 -151395
21871a51395L4012J41025P0221j12093j39555L2724P523P6182M8935K7490o4811
21860b9742n4254J28566m9024j67996o5308n5363M0092j5520l5500R2242N4659
21849a57148M9140J70192r6000j9165L6839K2387Q4854o1207o9436K8832P2381
21838F1669o8496j86418o7436O060J14993J62632J0095j8769l1182M3495L1173
21827E7816j35407l4032M5185k5891j1766N2867J04194o510l8530j12930j9375
21816a24379Q2092J03109J13413R2941j9096j11890m5179m964j5862m6584M2690
21805F6291q8805j31204J56864J26107p0143k05774j21956O3249J30080J11228
21795C5937j1487J3752j39487p2895Q9096P7054J60584K2131n4648j35137l5290
$$ plain form
21871 -151395 -117383 23642 93863 -18230 -157785 -125061 -117538 -41356 7579 35069 -29742
21860 -29742 -83996 44570 -4454 -172450 -237758 -293121 -253029 -268549 -304049 -211807 -157148
21849 -157148 -108008 62184 -33816 -52981 -16142 6245 91099 29892 -39544 -10712 61669
21838 61669 -6827 -193245 -260681 -254621 -139628 23004 33099 14330 -16852 26643 57816
21827 57816 -77591 -111623 -66438 -92329 -104095 -51228 52966 46456 7926 -105004 -124379
21816 -124379 -42287 60822 174235 267176 248080 136190 91011 86047 70185 23601 66291
21805 66291 -22514 -153718 3146 129253 59110 -146664 -268620 -205371 -75291 35937
21795 35937 24450 38202 -101285 -174180 -85084 -8030 152554 174685 120037 -15100 -50390
21784e0390R8623k6114j2031J2969m2845m7191m8549J23073k6804q0656K715N8578
21772c8622o7811p5421N3999R6238P3651M5536n6193K5937M3619j18446l9542
21761e7055L0031P4061M2494J05963m3109j00584j90921j06286J16954L7427j830
21750i2855J547j9008m7564J49792R3640n8210j6520M5577o1091j51013O6118
21739h9587J11275r273m8054J27951j0093l0449j24975N7717J52983m3715q2979
21728A0801n054o1913m9019l2315K4085O2796R2103J2041m7792N9364L4377o2687
21716C6787m6192J49383m2783j78915q0944m3380k4876O3051J4070K2056M2491
21705h9252q191m5131J5996R7006J8793p9356L1395K5018M0445P8120L0009o6522
$$ plain form
21784 -50390 48233 22119 10088 23057 -19788 -66979 -115528 7545 -19259 -99915 -97200 -38622
21772 -38622 -106433 -181854 -127855 -31617 42034 87570 31377 57314 100933 -17513 -57055
21761 -57055 -27024 47037 89531 195494 152385 51801 -139120 -245406 -128452 -91025 -92855
21750 -92855 -91308 -110316 -157880 -8088 85552 27342 10822 56399 -4692 -155705 -89587
21739 -89587 21688 12415 -35639 92312 82219 51770 -73205 -15488 137495 93780 10801
21728 10801 5747 -56166 -105185 -137500 -113415 -50619 41484 53525 5733 65097 99474 36787
21716 36787 -9405 139978 97195 -81720 -162664 -206044 -230920 -167869 -153799 -131743 -89252
21705 -89252 -97443 -142574 -126578 -29572 -10779 -90135 -58740 -33722 6723 84843 114852 48330
21693D8330q2614o450R3311j4640p4917J26219k210j25182p220P7555M3707j3902
21681F1987k0674O2239L9005l875j19463r2648L5672n1337j20714P5284N9650
21670g4874m0350K425p9225J13248O7587R3276M5615o9851k7463p6920K4273o6805
21658h9064o843k3319P5989M5111o4842N8700Q2942j01804r4622J7518j1887J09994
21646b127k0171r7010J4331L8534Q3737K828m7203k6743l0316L9501K5102l8458
21634e7995p2118J13740J16461N1909j05330j75716Q401j5694Q0465K6617n486
21623c4746r59J09698P3038k4209j24988J3209J05845M7112M9258M2502q5598
21612A70162j65955M1958J2865j15352l656L8502j59J3706J01898K3269N024j35873
$$ plain form
21693 48330 -34284 -40734 52577 37937 -36980 89239 87029 -38153 -45373 32182 75889 61987
21681 61987 41313 103552 142557 138682 19219 -73429 -37757 -89094 -209808 -134524 -74874
21670 -74874 -115224 -112799 -192024 -78776 -11189 82087 127702 57851 30388 -46532 -22259 -89064
21658 -89064 -95907 -119226 -43237 1874 -62968 -4268 78674 -23130 -117752 -100234 -112121 -2127
21646 -2127 -22298 -119308 -104977 -66443 17294 20122 -27081 -53824 -84140 -44639 -19537 -57995
21634 -57995 -130113 -16373 100088 151997 46667 -129049 -120648 -136342 -55877 -29260 -34746
21623 -34746 -35705 73993 147031 122822 -2166 11043 116888 164000 213258 255760 170162
21612 170162 4207 46165 59030 -56322 -59978 -21476 -21635 -7929 93969 117238 122262 -13611
21600a3611j21310O9316N1143Q381M9007J192m2159J5559m7726l7869m9393j22802
21588b40272l0025K6111P9617q5978k9954J72313O7234N2737R1150r6108m6684
21577c9859Q0203Q2425q226q5044j01886r814l3835O582J19369o707l8913N3716
21565A8011j393k0827O9956K4720N7181Q9139j0904r3195j03898m9304j24946
21554a45460r5058J06927J715J02691J057J21187R7303j9489r9617m6173q3990
21543e8907m8375K5697N8353m599N5435k44p5402j03452L939J1648o6678r836
21531b12421k9231k6629m8930J90256J30825l401M2483O6420K5079P160n1227
21520I0384o8730j05785r3088O9510J19154m6080K8746J31744l4869p2556j53264
$$ plain form
21600 -13611 -134921 -65605 -14462 -6081 42926 44118 1959 17518 -30208 -68077 -117470 -240272
21588 -240272 -270297 -244186 -164569 -250547 -280501 -108188 -40954 11783 102933 6825 -39859
21577 -39859 40344 122769 114543 29499 -72387 -82201 -116036 -109454 9915 3208 -35705 18011
21565 18011 16618 -4209 65747 90467 147648 236787 225883 132688 28790 -20514 -145460
21554 -145460 -240518 -133591 -131876 -29185 -28128 93059 190362 170873 71256 25083 -58907
21543 -58907 -107282 -81585 -23232 -27831 27604 27360 -48042 -151494 -147555 -135907 -202585 -212421
21531 -212421 -241652 -268281 -317211 -126955 3870 469 42952 109372 134451 141611 90384
21520 90384 21654 -84131 -177219 -107709 11445 -34635 -5889 125855 90986 18430 -134834
21509a34834N0226M4308l2435N2602k6087N0549o3656q8373Q2477J52178L1073
21498A18028J737j02213n0815P3593n9860j6736J78645j8847j34360r9072l6277
21487a46177j34793p0324L2336J82812Q7767M0562K0391q6380O387N7839L9086
21476B9506K1399k531j05110m5496J49092J1615q2801n7806M8382l7274j07867
21465a78891J2683J18382O4286r914j9505P277j1554k9776m2806J3902O6057L4593
21453B4734q9818L856J03187L3357j53005j9589P6615K2620r306q6187m4117R7125
21441d0528N7151k6087M313J3487J13669J6305j13040m5468o1546M5887n8277
21430i4134l8242J2982J15720O732L139j7099l2140L8310l892p7949M236O7672
$$ plain form
21509 -134834 -84608 -40300 -72735 -20133 -46220 4329 -59327 -147700 -65223 86955 118028
21498 118028 119765 17552 -33263 40330 -19530 -36266 142379 123532 -10828 -109900 -146177
21487 -146177 -280970 -351294 -318958 -136146 -48379 -7817 12574 -73806 -67419 -9580 29506
21476 29506 50905 48374 -56736 -102232 46860 58475 -24326 -82132 -33750 -71024 -178891
21465 -178891 -166208 -47826 16460 6546 -12959 -5682 -17236 -47012 -89818 -75916 -9859 24734
21453 24734 -65084 -61228 41959 75316 -77689 -97278 -20663 1957 -7349 -93536 -137653 -40528
21441 -40528 16623 -9464 -5151 8336 122005 138310 25270 -20198 -81744 -35857 -94134
21430 -94134 -132376 -119394 -3674 3058 6197 -10902 -43042 -4732 -8624 -86573 -82337 -14665
21418a4665r702o3779N5701k7247l2414L1859L585J5931M7326L4896N9436k8476
21406G2451K1289l0631K9K1732L504q4409o1127n6308k4541M6108k2748L421j624
21393a12854K837N4163k6348k2458O8289M7231j55572j27666o201P3812k1574
21382b26341P6280K2372M5067O6589J384J9781J3566L435q4701j4530O3684L8373
21370B4959K24819m392j66798j9862M3837q916l7687R7180p1373P8k9973J1425
21358F3297P9660m0668l7304l8284J9107m4757p8990J00580j1006q5680M895J0388
21346e8762M8083q070j3754l6329j5465R1615o0012J3443M5476J5067n684K5102
21334D0710j12486r4675M4414k1354R2581P8455K9557K2301j0307p5643j03244
$$ plain form
21418 -14665 -24367 -88146 -32445 -59692 -92106 -60247 -56662 -40731 6595 41491 100927 72451
21406 72451 93740 63109 63138 84870 88374 3965 -57162 -113470 -138011 -91903 -114651 -111230 -112854
21393 -112854 -110017 -55854 -82202 -104660 -36371 10860 -144712 -272378 -278579 -204767 -226341
21382 -226341 -150061 -127689 -82622 -16033 -14649 5132 18698 22133 -62568 -77098 -13414 24959
21370 24959 249778 245386 78588 58726 102563 93647 55960 153140 81767 81845 51872 63297
21358 63297 142957 102289 64985 26701 45808 1051 -77939 22641 11635 -74045 -69150 -58762
21346 -58762 -10679 -18749 -32503 -68832 -84297 7318 -52694 -39251 6225 21292 15608 40710
21334 40710 -71776 -166451 -122037 -143391 -50810 27645 57202 79503 69196 -6447 -109691
21323a09691j7702r9626J0999J35758J10540M3325o3218L0517p6023o856l8627
21312h0604p8506j2487l8521L0118L2215k2922o5804K18078Q2915j4824l9675
21301I983q4859O960O8568j4325j4275R0172k6709k4296r2434p413j5865j15362
21289b19855M5101M5137O82k8088K0314M7758J303j0417k05L948j249K4287L8553
21276c2731J7067n2572l3702K890p3942k5068L584Q0952J37236m8212M1345l1604
21264a4757J7861k2161k8143q1928r8746K3753P8411K07663J1341L3279r1281
21253C5292p2040R8055n5770L7462m4625K7313P1902J3465N9317j9583r9660r336
21241D1792j06195j10124J28008J23935m3415n6195L5025M6530M4574P9070K2208
$$ plain form
21323 -109691 -127393 -227019 -216020 -80262 30278 73603 10385 40902 -35121 -41977 -80604
21312 -80604 -159110 -171597 -210118 -180000 -147785 -170707 -236511 -18433 64482 49658 9983
21301 9983 -74876 -67916 652 -13673 -27948 62224 35515 11219 -81215 -88628 -104493 -219855
21289 -219855 -174754 -129617 -128935 -157023 -136709 -88951 -87648 -98065 -98270 -94322 -95571 -71284 -32731
21276 -32731 -15664 -68236 -101938 -99048 -172990 -198058 -194474 -113522 23714 -24498 16847 -14757
21264 -14757 3104 -19057 -47200 -129128 -227874 -204121 -125710 81953 93294 126573 35292
21253 35292 -36748 61307 5537 42999 -1626 25687 97589 111054 170371 150788 51128 41792
21241 41792 -64403 -174527 -46519 77416 34001 -22194 12831 59361 103935 183005 205213
21230B05213k00584k87402m506K18754R332o5803m8041L3054O950l040N2899J013
21218h2161j8334m6911P8770N4227j4042p720P0462m8841J2068O7513r6150p66
21206c1885o1508q76J1186o5298J336J08689K9285n8027m1401M9608P3201Q0423
21194I4733p2214j21375q7715j2292k0798J47108J46165K7482j21439j30465M2692
21183a08118Q7239M5524q2522N8813N3589o1025m7436n9877P8604r092o9165q2109
21171a95575q1722O7294J01199N4938P9765N4904o1579p5456n9933L9374J51206
21160G4415N7023j02957j4446m7321p6719N2633K1008j15606K1093k0620J0775
21149a40722J267k622L9463R0093L9534L3429K1517k1055j17196J9816l9682j36709
$$ plain form
21230 205213 4629 -282773 -287279 -68525 -59193 -124996 -173037 -139983 -133033 -136073 -83174 -82161
21218 -82161 -100495 -147406 -68636 -14409 -28451 -36171 34291 -14550 -2482 65031 -31119 -31885
21206 -31885 -93393 -94269 -83083 -148381 -147045 -38356 -9071 -67098 -108499 -58891 14310 94733
21194 94733 22519 -98856 -186571 -198863 -219661 -72553 73612 101094 -20345 -150810 -108118
21183 -108118 -20879 24645 -57877 936 54525 -6500 -53936 -113813 -35209 -44301 -113466 -195575
21171 -195575 -277297 -210003 -108804 -53866 25899 80803 19224 -56232 -116165 -76791 74415
21160 74415 131438 28481 14035 -33286 -110005 -57372 -36364 -151970 -130877 -151497 -140722
21149 -140722 -139455 -142077 -102614 -12521 27013 60442 81959 60904 -56292 -36476 -76158 -212867
21137b12867r0598j9237N8114J06940Q6519j22380o0845K4566O0997j4352r2600
21126b75743O0738J12834l0316L153J23053J0094j76096o8336J05818R2773L5549
21115f479K0423J3132P0957J188r4912k0581p3309j06313J2716L7813N7523K77317
21103A89475l7939j28510m7683j1164L7865o830P6373k6542j2978P851L6970q0337
21091c449o3828J43096p4523p8099n2420M6390N3123J8167M6431m5714l6722o6876
21079a14424j30484Q6000N4504p345J51414J21118n6608k9085J8188P6834m5028
21068A25084p2552L8246L4118j54221N3025M9323o5738n9419K5955K5498J2993
21057A2312O5855l180L1178R4169o8530j23109k2851J72460M3530n7848j52473
$$ plain form
21137 -212867 -303465 -322702 -264588 -157648 -71129 -193509 -254354 -229788 -168791 -183143 -275743
21126 -275743 -215005 -102171 -132487 -129334 -6281 3813 -172283 -240619 -134801 -42028 -6479
21115 -6479 13944 27076 98033 99221 4309 -16272 -89581 -195894 -183178 -145365 -87842 189475
21103 189475 151536 23026 -24657 -35821 2044 -4786 71587 45045 32067 39918 76888 -3449
21091 -3449 -67277 75819 1296 -76803 -129223 -82833 -29710 -11543 34888 -10826 -47548 -114424
21079 -114424 -244908 -158908 -104404 -111749 39665 160783 104175 75090 93278 170112 125084
21068 125084 52532 90778 124896 -29325 23700 73023 7285 -52134 -26179 -681 12312
21057 12312 78167 74987 106165 200334 131804 8695 -14156 158304 201834 143986 -8487
21046h487r1615K129K6580J65332K9737j28308J8682j01712l5833M0823N3261
21035b9411n663j2055k5219J4719N2269l272p7729L9171o0666K0634Q3756l6161
21023c9627N465m4512p3771m5676Q2909K7963m6478R136L3357j36509Q8577N4448
21011h4718J27896O6692j16190p1642M4542N7068r2788p3478R456o342k7863Q484
20999a58883J17461N2959j5752O7523j47062n6079M2603O4395O0539m1630n9229
20988g3155J64552j0784L4773M704j15476j58469P7755J32304P5892L2456m0176
20977A24376Q956r8414j06075l4383K8642J1981p3877J3326Q8030L9020O0127
20966F1709n7892K6777n9749p2506J7644r097M6598L1580q2946K5633M0400Q4834
$$ plain form
21046 -8487 -100102 -97973 -71393 93939 123676 -4632 14050 -87662 -123495 -82672 -29411
21035 -29411 -35074 -47129 -72348 -57629 -5360 -8632 -86361 -47190 -107856 -87222 -3466 -39627
21023 -39627 -34162 -78674 -152445 -198121 -115212 -87249 -133727 -124591 -91234 -227743 -139166 -84718
21011 -84718 43178 109870 -6320 -77962 -33420 23648 -69140 -142618 -133162 -139504 -167367 -158883
20999 -158883 -41422 11537 -4215 63308 -83754 -139833 -97230 -32835 27704 -13926 -73155
20988 -73155 91397 80613 115386 120090 4614 -153855 -76100 56204 132096 164552 124376
20977 124376 133332 34918 -71157 -105540 -76898 -64917 -138794 -125468 -37438 1582 61709
20966 61709 3817 30594 -29155 -101661 -84017 -93114 -46516 -14936 -97882 -72249 -31849 52985
20954E2985j726M9047N8006j7255l3532p4177J393L1943l7492l4634o808k45J5811
20941C316R1399Q0656o9757j31784r8324r8894M3696N1714m586R9102j03731k03937
20929c41130J53196J50768r9498J836J4876J5108j5028Q4733m4317J0082q471
20918g7845j30171P7651J50105K5155k0831o3728J0560l0166k5044p1349K4265
20907a31398j09157J1067J88715O5117K7430J4369q4760j8237K3105K0302j0911
20896d358n5018R2574J0912O2952r6340k0549L1294r9044N1724m1964O0550J06022
20884I8755l0299n7603j6732m8164n8023O3263l475N5375j21861m3302J9436N8675
20872h3955J9108p112P030p0606J04128Q088n4192m2394P7469N8728N4422M4745
$$ plain form
20954 52985 51259 100306 158312 141057 107525 33348 34741 66684 29192 -5442 -12250 -12495 3316
20941 3316 94715 175371 105614 -26170 -124494 -223388 -179692 -127978 -132564 -33462 -137193 -341130
20929 -341130 -187934 -37166 -136664 -134828 -119952 -104844 -119872 -35139 -79456 -69374 -77845
20918 -77845 -208016 -130365 19740 44895 24064 -39664 -29104 -59270 -84314 -155663 -131398
20907 -131398 -240555 -229488 -40773 24344 51774 66143 -18617 -36854 -13749 6553 -4358
20896 -4358 -59376 33198 44110 107062 10722 -9827 21467 -77577 -25853 -67817 -7267 98755
20884 98755 68456 10853 -5879 -54043 -112066 -48803 -52278 3097 -118764 -162066 -142630 -83955
20872 -83955 -64847 -71959 -64929 -135535 -31407 -23319 -77511 -119905 -42436 16292 70714 115459
20860A15459N615o0809k8674j8648O0960O5247P7092K8564M2956n4732q5362K1475
20848A69143j4657k5731m3375N944p933j13207j22603P3017K7874J3035k7607
20837f6100R8525j21439j12944o8604P7029R0469n0678O6162L1959j0521R6770
20826C0628J5056j04345k9616K5556r6940M826O4043O7940O1168j55899r9212
20815b16795J75713J78100L2133p1550L4938R4468p9558k56N4461j12513r1523
20804b382n2903r2771R8455j545J13127j5703o679l3155K9471N9608l7225j15347
20792e7049p0099L7261J1063r4969J5560J26500p0073l4857m8596r3010J1591
20781b66678j0565N8785Q2526Q8426l3912m6411k6705L9346L0579l8153J5831
$$ plain form
20860 115459 121074 60265 31591 12943 73903 139150 216242 244806 287762 233030 147668 169143
20848 169143 154486 128755 85380 91324 83391 -29816 -152419 -79402 -51528 -38493 -66100
20837 -66100 32425 -89014 -201958 -270562 -193533 -103064 -153742 -87580 -55621 -66142 30628
20826 30628 45684 -58661 -88277 -62721 -159661 -154835 -90792 -22852 38316 -117583 -216795
20815 -216795 -41082 137018 169151 97601 132539 227007 147449 147193 201654 89141 -2382
20804 -2382 -55285 -148056 -49601 -51146 61981 46278 39599 6444 35915 95523 58298 -57049
20792 -57049 -127148 -89887 -78824 -173793 -158233 -31733 -101806 -136663 -185259 -278269 -266678
20781 -266678 -277243 -218458 -135932 -47506 -81418 -127829 -154534 -115188 -84609 -122762 -106931
20770a06931N7080j0108J2509K7355k9765R1757R8047J8495p4730J4574J12397
20759B10680L563k930n0114j79516j02937M3360O4039n2911n291k0033L9296q6089
20747a38883j10888m6041M5590J25149O7295r219J21241L9161r222n0694K0479
20736E3968r7551J8402M4497K1553K7001m5536j05583l7583J02249R18k9761J85607
20724A38181J3993k9610o787m692O7582L9198q538r9964o292L0323j906j36698
20712e210o7154L8055P016k8077m2904J13630N208k3412l4829j67397r7534J85921
20700a16687Q3027m8378L9948L4863L680L8874k8660k4521L3352k0941L9193O5951
20688I9701l7038p8121O2858q5240j67614n9703J12246J94909P0936k1089m7402
$$ plain form
20770 -106931 -49851 -59959 -47450 -20095 -49860 41897 139944 158439 83709 98283 210680
20759 210680 214243 211313 161199 -18317 -121254 -77894 -13855 -66766 -72057 -92090 -52794 -138883
20747 -138883 -249771 -295812 -250222 -125073 -57778 -66997 54244 93405 84183 33489 53968
20736 53968 -43583 -25181 19316 40869 67870 22334 -83249 -120832 -18583 -17665 -47426 138181
20724 138181 152174 122564 115777 111085 178667 217865 209327 109363 103071 133394 131488 -5210
20712 -5210 -72364 -34309 -27293 -55370 -98274 15356 20564 -2848 -37677 -205074 -302608 -116687
20700 -116687 -33660 -82038 -42090 -7227 -3547 35327 6667 -17854 15498 -5443 33750 99701
20688 99701 62663 -15458 47400 -37840 -205454 -265157 -152911 41998 112934 91845 44443
20677D4443R6106l3525j22387l2321P28M9214N6751n6435J15898J25199O0933
20666C04604j05201q3185K0203p6008K7511J22716o0652r2585n8201P287O4279
20655G0768M7067j12616R865J04025l5278l7164K9303O7607r2000j85517L3410
20644a00530J96038P3062r9572J2424J8914M5875l7551j59739q4095L4856J58808
20633E8490J43765r3173j27209L3688j8248M3822Q3057o3868m4258R586n6401
20622c0749K418R6207l2329j39001j03372K9844O9843J23362L3357J4854o623
20611E7811j08739L1729P786j26174P9550J29963N9606J05082J17864l1521k18217
20600A04740p8311P1617J04715N021j48815K4613K9338m4769l9602P0020p4117
$$ plain form
20677 44443 140549 107024 -15363 -47684 -46956 2258 59009 2574 118472 243671 304604
20666 304604 199403 116218 136421 60413 87924 210640 149988 57403 -798 6489 70768
20655 70768 117835 5219 15084 119109 83831 46667 75970 143577 51577 -133940 -100530
20644 -100530 95508 168570 68998 81422 100336 146211 108660 -51079 -135174 -100318 58490
20633 58490 202255 109082 -18127 15561 -2687 41135 124192 60324 16066 25652 -30749
20622 -30749 -28331 67876 35547 -103454 -206826 -176982 -107139 16223 49580 64434 57811
20611 57811 -50928 -19199 -11413 -137587 -58037 71926 131532 236614 354478 322957 104740
20600 104740 26429 98046 202761 207782 58967 83580 112918 68149 28547 98567 24450
20589B4450q3077j1858Q2150M0246o7087m3637o1975K5427J3878p2255J04879
20578d8859j9540M7677O8784R6933J27043o6627j52329r0798J1743M2395L7946
20567E4368j4332J3980j1549j6733K536j9100P5517K8671q5200J314j0293R9030
20555A18209j03695r3353j5692n0105J25120N4602m8922r1399l3272M9368j4077
20544a03216m0373K1231M9305O0888p07r795J14358Q0239L3849L859m6667m5518
20532A17453j10426K6082L315J16339J8027j29672q4795k8427l6130l1502L1864
20521a07872M1107l467j95R4261l165j25250m3677O1922n5088j158N2416L0889
20509e9277l7245Q0706J7740J1398P6105n2437j2853j5898q97L1925J48050K7973
$$ plain form
20589 24450 -58627 -70485 11665 51911 -15176 -58813 -120788 -95361 -81483 -153738 -48859
20578 -48859 -68399 -20722 48062 144995 272038 205411 53082 -37716 -25973 16422 54368
20567 54368 40036 54016 42467 25734 28270 9170 84687 113358 28158 29472 19179 118209
20555 118209 14514 -78839 -94531 -144636 -19516 35086 -13836 -105235 -138507 -89139 -103216
20544 -103216 -143589 -122358 -73053 -12165 -12872 -22667 91691 171930 205779 209638 162971 117453
20532 117453 7027 33109 36424 152763 170790 41118 -43677 -72104 -108234 -139736 -107872
20521 -107872 -66765 -70232 -70427 23834 20669 -104581 -148258 -86336 -141424 -142582 -90166 -59277
20509 -59277 -96522 -15816 1924 13322 89427 36990 24137 8239 7342 39267 187317 215290
20497B15290l5323j45493j19542K569m779J19541R4853l6079o0361j52053M62
20486a20915L9140M7625P519m1366r724J181M7147N5287n1406n8172J17179O9837
20474A03332q3424q5943q5998j38153j6013J03897m2084N1039R0100J07146J06670
20463A10569P0044o7434n2226n4360P6160O8399Q1048j38251m5996P7285n5562
20452F9676j28497j08718q3761J8610n5948j3900K09719J52063q2000j09426O8300
20441f3882j0428L8223m1719K664J45995l082o1833o0523P616N5574O8224P378
20429H4207J4356L3116o3059M7171N1139m8076M2776l5058l442l9502p7686l1802
20417b5860k2282K2122p176N3309j8353P547R730N4184j27979n231l7220O5807
$$ plain form
20497 215290 179967 34474 -85068 -82499 -87278 32263 127116 91037 30676 -121377 -120915
20486 -120915 -81775 -34150 -26631 -67997 -77721 -76540 -29393 25894 -25512 -83684 33495 103332
20474 103332 19908 -66035 -152033 -290186 -306199 -202302 -244386 -193347 -103247 3899 110569
20463 110569 180613 113179 60953 6593 82753 151152 232200 93949 47953 125238 69676
20452 69676 -58821 -167539 -251300 -232690 -288638 -302538 -92819 59244 -22756 -132182 -63882
20441 -63882 -74310 -36087 -77806 -75142 70853 67771 5938 -54585 -46969 8605 76829 84207
20429 84207 98563 131679 68620 115791 166930 118854 161630 126572 123130 83628 5942 -25860
20417 -25860 -48142 -26020 -33196 20113 1760 9307 19037 73221 -54758 -59989 -97209 -31402
20405c1402j1226K8213M5428L2655P417J7990j51786K1758K1222K9712P1430J62248
20393B43659n7372k29589j02790K0689N3768M5064j07180K2145J32995l9508k3619
20382d1738l8830o98J27749N4606O4390p4550j29523r423L2117m70N4519N748
20370D3897l0341o9011k9959n0937q0497R271M9573m1718P1081J15020R9373q9633
20358c881p990m7318N5915K3200k8843o4767p2258P4606o3764j67652l8427J55942
20346a85237P2666j2822p3038m4613n106O1905p1888J0193J84752l44N1469m7312
20334e9375o3333O9172J9289l4507J952k0777P5438j07778J1286J22410l2777
20323a9000L2206j49088l809K0978R235J2370J9479O4677m8119m7696n3853J00990
$$ plain form
20405 -31402 -42628 -14415 31013 63668 71085 89075 -62711 -40953 -19731 9981 81411 243659
20393 243659 186287 -43302 -146092 -125403 -71635 -26571 -133751 -111606 21389 -18119 -41738
20382 -41738 -80568 -81266 46483 101089 165479 90929 -38594 -48017 -15900 -16370 38149 43897
20370 43897 13556 -55455 -85414 -136351 -216848 -207577 -158004 -199722 -128641 -13621 85752 -3881
20358 -3881 -11871 -59189 -3274 19926 -8917 -73684 -145942 -71336 -135100 -302752 -341179 -185237
20346 -185237 -112571 -125393 -198431 -243044 -248150 -186245 -258133 -247940 -63188 -63532 -12063 -59375
20334 -59375 -122708 -53536 -34247 -68754 -66802 -87579 -12141 -119919 -108633 13777 -19000
20323 -19000 13206 -135882 -139691 -118713 -109478 -97108 -77629 -12952 -61071 -108767 -162620 -61630
20311f1630L2358p8663J20465K9037q0526l1357P6910l0589p9915L470l1643P9535
20299e2548O919J4464Q8888j40532m7006J21952M8597k8381l7736K0841K04171
20288A99629j12063j17746o3280J6602q6244O1016P7065j40786n8148O6895J08749
20277d8311M6765J2274k6877j8271J4183p7591l4631N2850R6230L8656O5814o831
20265A14260n0429P8451l552r5177j5342N4503j0870K7377j01809j53512p3092
20254b29192l7085K1320J48818J06913l5072j47840J8951Q0920o3287r2117o417
20243b34088J39407P4713r934L7910o6507n8988j2511m1954P9675J97647l6638
20232F8732j47916J43301O7020K9597k1046L1194r7296j00309j4299l028L9656
$$ plain form
20311 -61630 -29272 -107935 12530 41567 -38959 -70316 6594 -23995 -103910 -100440 -132083 -52548
20299 -52548 -45629 -31165 57723 -82809 -129815 -7863 40734 12353 -25383 -4542 199629
20288 199629 87566 -30180 -93460 -76858 -163102 -102086 -25021 -165807 -223955 -157060 -48311
20277 -48311 -1546 10728 -16149 -34420 -20237 -97828 -132459 -79609 16621 55277 121091 114260
20265 114260 63831 142282 138730 43553 28211 82714 71844 99221 -2588 -156100 -229192
20254 -229192 -266277 -244957 -96139 10774 -24298 -172138 -153187 -72267 -135554 -227671 -234088
20243 -234088 -94681 -19968 -29902 8008 -58499 -117487 -129998 -171952 -92277 105370 68732
20232 68732 -79184 64117 131137 160734 139688 170882 73586 -26723 -41022 -44050 -4394
20221d394L2009M6136m4295N509m2140l5625O7715L7187P064J15255Q6167p9986
20209A90602j52098j2159J0857J3774o7638Q2696J7823L780m0527j17906k3907
20198i4703J50935M2981j01254L8468j0068J3493k2402m1677P0698o5693j2542
20187c1764L2561n7070R4008R5984o3130p1478J0477K8834Q9147o3252j32594
20176f8277k1705P8773k2797q0019k704K3057o0192k4948N1666N3082L7613r160
20164d5611M7817k8127j25848P0340J47018n5973j87776J06511R0275n6165l9899
20153g7438M9415J13659N4772j5393q8608n6870l5506j1842K5139K2220K516J16165
20141I8229R855p3434m524J8456K8247l3926m453q7911k8123P6137M6699l395
$$ plain form
20221 -4394 27615 73751 29456 34965 -7175 -42800 24915 62102 69166 184421 270588 190602
20209 190602 38504 26345 37202 50976 -16662 66034 83857 87637 47110 -70796 -94703
20198 -94703 56232 99213 -2041 36427 26359 39852 17450 -24227 46471 -19222 -31764
20187 -31764 797 -56273 37735 133719 70589 -889 9588 38422 127569 64317 -68277
20176 -68277 -89982 -11209 -34006 -114025 -116729 -93672 -153864 -178812 -127146 -74064 -36451 -45611
20164 -45611 2206 -25921 -151769 -81429 65589 9616 -178160 -71649 18626 -37539 -77438
20153 -77438 -28023 85636 140408 125015 36407 -20463 -55969 -67811 -42672 -20452 -17936 98229
20141 98229 108084 34650 30126 48582 76829 42903 38450 -49461 -77584 -1447 45252 41857
20129D1857P6633k2478r2814k0145J24830j2403m3950Q028P3698j09731m8133
20118b4608N3580J2018O714m558N1983k9094J2157m5976J3658n4371l1847O6221
20106B5877Q1942Q023Q731j05666r922J7263M3658J8190j2572k7654O7659j01536
20094A3993l9075r31M4609j5656p0294q2707L811P6281J47753K3284j16384L734
20082a1582J52066K8148j3914m8937o0142K7057J04078M9534K1591j43438r2040
20071A2421o9241m985k88P4190n1823J9255Q532N3510k4469Q830N4527M2287m5349
20058G7397p8210N9506l2656J43246K8807q94j8389j03022j09509k6623N4470
20047e877K2179k4456M8501o1395l5441n6886K4679p620k9192R8981n4381O8821
$$ plain form
20129 41857 118490 96012 3198 -16947 107883 95480 51530 59558 133256 23525 -24608
20118 -24608 28972 40990 47704 43146 95129 66035 78192 32216 45874 -8497 -40344 25877
20106 25877 107819 115842 124573 18907 8985 26248 69906 88096 75524 47870 115529 13993
20094 13993 -25082 -26013 18596 2940 -67354 -150061 -146250 -69969 77784 101068 -15316 -11582
20082 -11582 140484 168632 154718 105781 45639 72696 176774 226308 247899 104461 12421
20071 12421 -56820 -61805 -62093 12097 -39726 -20471 -11939 41571 17102 25932 80459 122746 77397
20058 77397 -813 58693 26037 169283 198090 197196 178807 75785 -33724 -60347 -5877
20047 -5877 16302 -8154 40347 -21048 -56489 -113375 -88696 -96316 -125508 -26527 -80908 -12087
20035a2087k7125o2726J02928j7244J26981m5546j26441j194P0895k2676J06575
20024I2340L5349j20228M4977K3560j08479j54301o0749N9916k0648j30326n0296
20013c88885J90026J24461m533J42j6364J621J33130J41448r7264j17224o98O5547
20001C1407k5202n6759J3687r5865j04772J25729J27399P1606O2585p4749j84136
19990a09070j5588k4115P3937N8395M5163M2748J2402Q6967K185k8317m9516P5365
19978A70556J9529J2317q4751L0769R551j73892M6422J18900L5832p6637n2670
19967E5926J3842k5712m7588j00798J06963n8267l8016R4032r783r5564L724L9523
19955f1718N1308Q8517o3693l8819J6193j1885P7907L4596J5033J2586p2997j4697
$$ plain form
20035 -12087 -39212 -101938 990 -16254 110727 65181 -61260 -62454 8441 -14235 92340
20024 92340 127689 7461 52438 75998 -32481 -186782 -247531 -187615 -208263 -338589 -388885
20013 -388885 -198859 -74398 -78931 -78789 -95153 -93532 39598 181046 83782 -33442 -34140 31407
20001 31407 6205 -50554 -36867 -132732 -237504 -111775 15624 87230 149815 75066 -109070
19990 -109070 -124658 -148773 -74836 -16441 28722 71470 83872 170839 173024 144707 95191 170556
19978 170556 190085 202402 117651 148420 157971 -15921 30501 149401 185233 108596 55926
19967 55926 69768 44056 -3532 -104330 2633 -55634 -93650 382 -9401 -104965 -101241 -61718
19955 -61718 -10410 78107 14414 -24405 -8212 -20097 57810 92406 107439 120025 47028 32331
19943C2331j5973q9330J53227L1697n7947q5054p8787k4932M7521k7661l1965
19932a46873J22490l186M6660J8972m2938n9615k6726O1457M4686J7503M1209
19921G3639J2783j1583J8104o2567J1129K0149k3576j31265j40092R2360Q7833
19910e3086L5632J1108k3884J02038q6733p5197n5682M6371P3395J08519l0654
19899E1827j86961Q7656K2252R503J33343M2836Q1819o578J216j17543r1523o7140
19887c9293k0025M2164J21828j3901q3978n8377O6480o2728j6844Q3368l8015
19876a9321M3225O6909k8813r5918P9487J15125q4212O52k1359o4061p8302l0778
19864a17366J13651Q5720O735L9438J6053O0645j9744j37053j05204J520Q1721
$$ plain form
19943 32331 16358 -72972 80255 111952 54005 -31049 -109836 -134768 -87247 -114908 -146873
19932 -146873 -24383 -27569 19091 38063 -4875 -64490 -91216 -29759 14927 32430 73639
19921 73639 86422 74839 92943 30376 41505 61654 38078 -93187 -233279 -140919 -53086
19910 -53086 -17454 -6346 -30230 71808 -14925 -90122 -145804 -99433 -26038 82481 51827
19899 51827 -135134 -47478 -25226 -15723 117620 160456 242275 235697 236913 119370 27847 -39293
19887 -39293 -59318 -17154 104674 90773 6795 -51582 14898 -47830 -64674 18694 -19321
19876 -19321 23904 90813 62000 -33918 45569 160694 76482 77134 55775 -8286 -86588 -117366
19864 -117366 -3715 82005 88740 128178 144231 204876 185132 48079 -57125 -55605 26116
19853B6116R481J11594k5490N5002K6009m0828L0837q7688j77968j4173J38111
19842E1003j3004j00235r050J233L2081L0695P1840L2569l7983o2353M2194Q9552
19830A28542p4646o3745n2625n7738J76116O6909m9483j36233M127L6030L7372
19819A4626o7348j37998J4998L1819J8354o797P5199L5389k2284k3330j0016M8008
19807b9380M5505L8371j14602p1499J27203N6107L8776m7361l706M057R4071P432
19795A44974k10019m5274L1151J09705J41664P8200j04841k03953j27698n443
19785a91534L4795J09074r3132J29099N937q4834J9291o289o8424N3073N308m2249
19773a29885j0276k4349k4119J2040J27147J30269N2833m7512K3796p2598K2442
$$ plain form
19853 26116 35597 147191 121701 176703 202712 161884 192721 105033 -72935 -87108 51003
19842 51003 37999 -62236 -71286 -70053 -37972 -7277 64563 97132 59149 -3204 38990 128542
19830 128542 53896 -9849 -62474 -120212 55904 122813 73330 -62903 -58776 -22746 14626
19819 14626 -52722 -190720 -175722 -143903 -125549 -132346 -57147 -21758 -44042 -67372 -77388 -29380
19807 -29380 16125 54496 -60106 -131605 -4402 51705 90481 43120 39414 43471 137542 144974
19795 144974 -65045 -110319 -79168 30537 172201 250401 145560 -58393 -186091 -191534
19785 -191534 -156739 -47665 -140797 -11698 -5761 -90595 -71304 -77593 -146017 -92944 -87636 -129885
19773 -129885 -140161 -164510 -188629 -176589 -49442 80827 133660 86148 109944 37346 59788
19762E9788M7865l5043m3043P200N9132M3572l9028k9964m9976o6702j1151R085
19750d8265O1123N2660j5444J7590n8210k0308M5963l3931j6555k9408N840N1771
19738A2826j4201k830l5729n7387J11051p4858o7127M2678O2917p2637M6770j8987
19726f7514j73165O2891J55989J00225K3417N8736P9564l7643j12663j73165j75784
19715b59112J18082K59920Q8056k05665j09722k8564o8073r159J78976n5162q0127
19704a70550N2699n8045k5464J62440N1532p5565j31440m7878n8763J98416J28773
19693B6155J6546j5218K3461J7375k5877m8117J8150r586m270N6278j2833o7019
19681b4955n7880M0011J2149R1700o5586j04840M4638L5254k4597J6602R5691
$$ plain form
19762 59788 107653 72610 29567 36767 95899 139471 100443 70479 20503 -46199 -57350 -48265
19750 -48265 12858 65518 50074 67664 9454 -10854 35109 1178 -15377 -44785 -38945 12826
19738 12826 -1375 -4205 -39934 -97321 13730 -61128 -128255 -85577 -22660 -95297 -48527 -67514
19726 -67514 -240679 -177788 -21799 78426 101843 160579 240143 202500 89837 -83328 -259112
19715 -259112 -141030 118890 206946 1281 -108441 -137005 -205078 -214237 -35261 -90423 -170550
19704 -170550 -117851 -175896 -201360 -38920 12612 -62953 -194393 -242271 -301034 -102618 26155
19693 26155 42701 27483 50944 68319 42442 -5675 12475 2889 -1381 54897 42064 -24955
19681 -24955 -82835 -42824 -30675 61025 -4561 -109401 -64763 -29509 -54106 -37504 58187
19670E8187K1352j03218l6651R9748K2511p8683p1197Q0116J55909N1228j20999
19659G8303o5190L0239p3551o1549R3708L3367J663Q6152J100n1607o6751o110
19647b26J22313J35254K0129j35735j61266Q0318r5732m5486J30059L4012q1451
19636B189q5647l4174p243k5800L6303J31853J13250M9358p2372r1398L1923r6875
19624d8633K5814J95972P8807j70882q4314L7949N0362N8137n0425m4904L1920
19613G9803k0345K3404l8225k9609L3716L8846n5095L935m5168j16573j28978
19602b54289L2828n944N446m3824m9651J13983K44894M9988r1496k9041Q1289
19591E4183J37533q6864N1264j8854j27035J2991K0512r9896o3155R5046Q0660
$$ plain form
19670 58187 79539 -23679 -60330 39418 61929 -16754 -87951 -7835 148074 199302 78303
19659 78303 13113 43352 -30199 -91748 1960 35327 36990 123142 124242 72635 5884 -226
19647 -226 122087 257341 277470 141735 -19531 60787 -34945 -80431 49628 83640 2189
19636 2189 -83458 -117632 -124875 -150675 -114372 17481 130731 180089 107717 16319 48242 -48633
19624 -48633 -22819 173153 251960 81078 -3236 34713 85075 143212 92787 47883 79803
19613 79803 59458 82862 44637 15028 48744 87590 32495 36430 -8738 -125311 -254289
19602 -254289 -221461 -227405 -221959 -265783 -315434 -201451 43443 93431 1935 -27106 54183
19591 54183 191716 104852 156116 137262 10227 23218 43730 -56166 -119321 -24275 56385
19580E6385j14851L5996M0990k027k6441n0594N9679k1908R25m9878N0130j6233
19568c7827J9052J05928N5291j82793j10640O4234K3780J57834k2596q3504k4224
19557c5465M6171N8517K5630j5343j71583J0527O8125q4538l634N8355r0494P0078
19545f3654O6601n8679k0900J11103N9460j4572L8699j24832q0457k5726O8289
19534d4668n4213N8958J1246k0491m2708M5215k9155J851K5387N6452J511q4044
19522g4659q9217j9080O0914J48636J13388j27042n4770Q0555l9100j02062j04191
19511b06628K3058J22731J89030J25085r9883k84805p1699q3818P0018J50011
19501f6900O6231M041n2174L1966N6045M3027r5151o0231q0192J6882L5962Q5860
$$ plain form
19580 56385 -58466 -22470 18520 16493 -9948 -60542 -863 -22771 -21846 -71724 -21594 -37827
19568 -37827 -18775 87153 142444 -40349 -150989 -86755 -62975 94859 72263 -11241 -35465
19557 -35465 10706 69223 94853 79510 -92073 -81546 -13421 -97959 -101593 -43238 -133732 -63654
19545 -63654 2947 -55732 -76632 34471 93931 79359 118058 -6774 -87231 -112957 -44668
19534 -44668 -98881 -39923 -28677 -49168 -91876 -46661 -75816 -73965 -48578 7874 9385 -74659
19522 -74659 -163876 -182956 -122042 26594 139982 12940 -41830 38725 -375 -102437 -206628
19511 -206628 -183570 -60839 128191 253276 153393 -131412 -203111 -286929 -216911 -66900
19501 -66900 -669 3372 -48802 -16836 39209 82236 -12915 -73146 -153338 -136456 -100494 -14634
19489a4634J23273j34498M2370J06070k5451q1638j6372J33853j39210n1118m9462
19478a06817O6900J42076M4505k5946O902O0336q5861j44209n4517J920M3623
19467e1088M3614N0767Q4477M0433j48998M1202q221o7556K4340Q0668P781n793
19455I1626p780O0348r8411M4615M4433l8257r1457j14406J03344M1837K7474
19444F3366J5712o5985r4593n8984R448P6035j955m3268J53273Q3191K78m21q7940
19431D8157P342K0237L9511q623r129n6144m2147J25531R1615l49l4805K0840
19419B02036Q5328J2294J230J0805k0745j06785p0541l2474j82600l2098l6575
19408a70125J5409Q4375J09451o6144j35189p3534K6725J73222J10806m7907j8606
$$ plain form
19489 -14634 108639 -25859 16511 122581 97130 15492 -880 132973 -6237 -57355 -106817
19478 -106817 -39917 102159 146664 120718 127620 187956 102095 -42114 -96631 -94711 -51088
19467 -51088 -7474 43293 127770 168203 19205 60407 52186 -15370 8970 89638 97419 91626
19455 91626 83846 144194 45783 90398 134831 96574 5117 -109289 -5945 35892 63366
19444 63366 79078 13093 -81500 -140484 -131036 -55001 -56956 -100224 53049 136240 136518 136097 48157
19431 48157 55499 75736 115247 106624 97495 41351 -796 124735 216350 216001 181196 202036
19419 202036 287364 299658 300888 311693 290948 184163 113622 81148 -101452 -133550 -170125
19408 -170125 -154716 -70341 39110 -27034 -162223 -235757 -209032 -35810 74996 27089 8483
19397H483J03296r2768m4154k2856K0667j2754j5723L5734M5717O7580n5268j14988
19385g7034L341p11j06888k4838M5141R2972O9947J01191o7170j6166K0867N2646
19373I3298n0934p2076P3955o0719J907M7285J15369m5257r8987R3680K12854
19362C10375j7021k38028l6645Q1757j8740m743N7325q9328o9988Q2487J273j77730
19350a19006j1383Q3288o388J6860n6376q698K3930o1256j30767p3769J41769
19339b01796K41366J1954p3345P3362M2466J3518J7034o2781k2234M6097O599
19328I2240L4133p7179j34556J35794N6316N530J737k9828j6326q3562m9408N0529
19316a4580Q6723J27249J5744o5172n3545n1907O6173N3562j01057J53799J5397
$$ plain form
19397 8483 111779 19011 -25143 -47999 -27332 -40086 -55809 -20075 25642 93222 37954 -77034
19385 -77034 -73693 -74404 -181292 -206130 -160989 -68017 1930 103121 35951 19785 40652 93298
19373 93298 42364 -29712 44243 -16476 -14569 32716 148085 102828 3841 97521 310375
19362 310375 293354 55326 18681 100438 81698 76955 134280 44952 -25036 57451 58724 -119006
19350 -119006 -130389 -47101 -53489 -36629 -93005 -101703 -77773 -139029 -269796 -343565 -201796
19339 -201796 39570 51524 -21821 51541 94007 107525 124559 61778 39544 85641 92240
19328 92240 126373 49194 -85362 50432 106748 112278 114015 84187 67861 -15701 -65109 -14580
19316 -14580 72143 199392 215136 149964 96419 44512 110685 164247 63190 216989 232386
19305B32386L7874l3984J546j9786m6508p1330j30525j7176J7967m8343q562L2148
19293e4293N0953J0046N8926m7682R0613k6584N5799j31599q3458L9154N3068
19282A4943J20929N7551n7434n3348j25828o0535N5026L0299N0853o2796K2018
19271h322J04139L205K3601J05275N6072j29604j74258n0208J09248J20503m9478
19260A10173q2595q648r486L2184m87k7492n4791N2327J58229J04196o9427o4216
19248A39967j00078l9386n8570J7895R2918m9424q3218j17429M3956R1807o2172
19237a23734P7088K1873l4919l4145O8010j9377K1663Q8517J16331P5296q2077
19226A74526l3462O419k7190p8425M4795N1853n7330j19967r2426O3399P9023
$$ plain form
19305 232386 270260 236276 237822 218036 171528 100198 -30327 -47503 -29536 -77879 -86441 -54293
19293 -54293 -3340 6706 65632 17950 108563 81979 137778 6179 -77279 -38125 14943
19282 14943 135872 193423 135989 82641 -43187 -103722 -48696 -18397 32456 -30340 -8322
19271 -8322 95817 99022 122623 227898 283970 154366 -19892 -70100 39148 159651 110173
19260 110173 27578 18930 9444 41628 41141 13649 -41142 11185 169414 273610 204183 139967
19248 139967 39889 503 -58067 -40172 52746 3322 -79896 -197325 -153369 -61562 -123734
19237 -123734 -46646 -24773 -59692 -93837 -25827 -45204 -23541 64976 181307 256603 174526
19226 174526 141064 147483 120293 41868 86663 138516 81186 -38781 -131207 -67808 11215
19215A1215j10126k6343J75283L6792m6373L2487J4338K0596M8288l8665j36152
19204a8660j46547O5057L0056q8191P8691R8090J1282P8904M707N5923p2681q3321
19192A3310K6978k6014m7957P094K61176l5147j67531j07075k1570k6416j7367
19181a40519L0119N784k2620p7350n910Q7076J75825J17739k1492M4780k0325
19170A73107j2429M8607j6551r402J0700J24582J0113j30954j58854o461R6537
19159A28995k8204j27470p5488J18597J3740j25918J0001N2175j0024p3139K8517
19148h8218J42361k5527k0877j56564p3779J98908J35028q29p1948n4078l5850
19137e1373o3503n2628M8318K07377J7475J270j10592m1199L5384l8140P9111
$$ plain form
19215 11215 -98911 -125254 50029 86821 40448 72935 87273 107869 156157 117492 -18660
19204 -18660 -165207 -100150 -70094 -158285 -79594 18496 29778 108682 113389 169312 96631 13310
19192 13310 40288 14274 -33683 -26589 234587 199440 31909 -75166 -96736 -123152 -140519
19181 -140519 -110400 -104616 -127236 -204586 -210496 -123420 52405 170144 148652 193432 173107
19170 173107 160678 209285 192734 183332 194032 318614 328727 197773 38919 32458 128995
19159 128995 100791 -26679 -102167 16430 30170 -95748 -85747 -33572 -43596 -116735 -88218
19148 -88218 54143 28616 7739 -148825 -222604 -23696 111332 110503 38555 -15523 -51373
19137 -51373 -114876 -167504 -119186 88191 105666 106936 -3656 -44855 -9471 -47611 31500
19126C1500L0706q1410J411P6774K348N0274p39o8208K9393N828P2444O5130o0989
19113A54462l0530J9360J7776p2554n4324O1898K0111O0605k2856j11552j0274
19102C2122K4505N4722N1824O8747n8770j61232n5819k37L6297j0905J5152P4694
19090G1100K6806N8952l2390J5014O9143p419j11861M0043K82198J95678J66337
19079G73601J49103K83443j00957k40258j72996r2769J6756l6522Q554R5779J81310
19068H65044J50843O0406j81023k18076k07789j82511j3031M7838j4661m6959
19058B60081j03675q5938K0095N0697Q7991Q0830J9426N3465K02396J85694K29611
19047A000673J37663j29576j41699j86692j33278l9755N2343N9253R3942K12254
$$ plain form
19126 31500 62206 -19204 -17793 58981 61329 111603 110864 42656 72049 77877 150321 215451 154462
19113 154462 123932 143292 161068 88514 34190 96088 116199 176804 153948 42396 32122
19102 32122 56627 111349 163173 231920 173150 11918 -43901 -44138 -7841 -18746 -3594 71100
19090 71100 97906 156858 124468 139482 208625 201206 89345 129388 411586 607264 773601
19079 773601 922704 1206147 1105190 864932 691936 599167 615923 579401 587955 683734 865044
19068 865044 1015887 1076293 895270 677194 469405 286894 273863 321701 307040 260081
19058 260081 156406 70468 90563 141260 229251 310081 329507 382972 585368 771062 1000673
19047 1000673 1138336 1008760 867061 680369 547091 507336 559679 618932 712874 925128
19037I25128K73728l7694k71768k38020l09776q3124J0233r3008j17494L823m567
19026E7461k7044q8359p7428l8425J45904J07659O3847J0467O5688J2515j6499
19015B15786M503J5186l4796j99460p3944q7762J54235k8541N4952L1646J00656
19004A52461k876n2393M7728P6590j0073M0407j70759j28799k9395l5785P8701
18993c4193J43996k2142J8947q612l6790Q3335n2653K1921J056L6401j0401o1998
18981G8867l7126Q013j01416n4838L9419J4785J4809P1358J85742r867j24094
18970H5652J09379L0202j8757K3219q7379j7222R4141N7876M957j864r6968j09009
18958G4227M3592O3009m3098L5862P7540p6477j01839p8342j00032j1887J14178
$$ plain form
19037 925128 1198856 1161162 889394 651374 341598 258474 268707 175699 58205 62028 57461
19026 57461 30417 -57942 -135370 -173795 -27891 79768 143615 154082 219770 232285 215786
19015 215786 220289 235475 200679 1219 -72725 -160487 -6252 -34793 20159 51805 152461
19004 152461 149585 97192 144920 221510 211437 251844 81085 -47714 -77109 -112894 -34193
18993 -34193 109803 87661 106608 97996 61206 144541 91888 113809 114865 151266 140865 78867
18981 78867 41741 49754 -51662 -106500 -67081 -52296 -37487 33871 219613 209746 85652
18970 85652 195031 225233 206476 229695 142316 125094 219235 277111 282068 280204 183236 74227
18958 74227 117819 180828 137730 173592 251132 174655 72816 -5526 -105558 -117445 -3267
18947c267J22107N566O9616Q5460J08781Q482k3973j49058q1874k4098J0327K9293
18935A57362R7001o4901q7605j01779J31288M3387M4657J00459L7124q3119J8769
18924B92643j35306l7792l5852l833L5121P4030k9708r4310j6762O9715j09192
18913H754O79k8498k1900j0032Q490J68166J08294l9872J3197m7865l9333R3963
18901B14043o8048M6710p6144o2943j5973J18970O0370J20932j0749k232k1576
18890C03360p5329n3714o2991m3596N1308J48952O9659J9897l9202n8466p4369
18879A85509P3097L5839m2381o5468j45241L7528l5181M5469R826j064j0199k4232
18867F3502l3207J4990P0088m5840Q6983k5387k1611m0264m1975R9586N2399R0689
$$ plain form
18947 -3267 118840 124406 194022 279482 388263 396745 372772 223714 141840 117742 128069 157362
18935 157362 254363 189462 101857 78 131366 174753 219410 319869 356993 273874 292643
18924 292643 157337 119545 83693 79860 114981 189011 159303 64993 48231 117946 8754
18913 8754 9433 -19065 -40965 -50997 -42507 125659 233953 194081 207278 159413 120080 214043
18901 214043 145995 192705 116561 53618 37645 156615 216985 337917 327168 324936 303360
18890 303360 228031 174317 111326 67730 119038 267990 337649 357546 318344 259878 185509
18879 185509 258606 294445 252064 186596 41355 78883 43702 89171 98997 97933 87734 63502
18867 63502 30295 45285 115373 69533 156516 131129 109518 69254 27279 126865 179264 269953
18855B69953O4840p835r9670o3675l1232j40669j3322J45382L9994K0669m4499
18844A39936j22986J22030R2790o099m5859N7675r2586q4625J61225l5724m0359
18833A45418o8617j15471K1002J0258l8403J48740J86419K0116o6459J5329R8373
18822C56705k5431k9524n4320k6937J07699j5198j87744j1041J14930J77574l4306
18811C72407j1191n8474j22481j64123J4534J07043Q1852Q9499r41n4588p2481
18800A81056q3802L5701p9121k7012O9392L809L4977L9168l079o6792q7637P7203
18788I3863J11852K1034o2169K5020m0684J3631J5343j9439k1587k521k6004l5510
18776G2829K9295N0433J4285R5280J45458J00958J93629J73997K03680N50187
$$ plain form
18855 269953 334793 326958 227288 163613 132381 -8288 -21610 123772 163766 184435 139936
18844 139936 16950 138980 231770 225671 179812 237487 144901 60276 221501 185777 145418
18833 145418 76801 -38670 -17668 -7410 -45813 102927 289346 309462 243003 258332 356705
18822 356705 331274 301750 247430 220493 328192 312994 125250 114209 229139 406713 372407
18811 372407 361216 302742 180261 16138 30672 137715 219567 309066 308125 253537 181056
18800 181056 97254 132955 53834 26822 96214 100023 135000 174168 171089 104297 16660 93863
18788 93863 205715 226749 164580 189600 148916 162547 177890 158451 136864 134343 108339 72829
18776 72829 102124 152557 166842 262122 407580 508538 702167 876164 1079844 1630031
18766A630031L83098m88989n82987l98183j42923L034p1172k1037m1663k6949
18756B42260l2050O7748j61222N5467O6344P7168k2248J22192m0510j14894j09098
18745A51157j27236k0661j2292M9992J13104J26202k9111N0344k0773r8363J9681
18734B02044q8513P0079R8176l7297N09M8541k8315N3790o6232k19821J6541J77116
18722B26618P3880q453j8753O6034K3508n2965K2397j3877R740l9570J6086J07297
18710D11942N648m3973j67100j37374L0961j5320k8582j2397l1548N5898J18201
18699A86356R333m7273M5650K7498p2496P0085J29077J06036o0422o2780n2869
18688B78195j8470j07732j6568L7233r936N2999J2284P5870J12369O3343j8798
$$ plain form
18766 1630031 2013129 1524140 941153 542970 400047 403081 331909 310872 269209 242260
18756 242260 210210 277958 116736 172203 238547 315715 293467 415659 375149 260255 151157
18745 151157 23921 3260 -9032 40960 154064 280266 251155 301499 280726 182363 202044
18734 202044 113531 183610 281786 244489 244998 293539 265224 319014 252782 32961 49502 226618
18722 226618 300498 292045 273292 339326 362834 309869 332266 318389 328129 288559 304645 411942
18710 411942 417590 373617 206517 69143 100104 84784 56202 43805 12257 68155 186356
18699 186356 195689 148416 194066 221564 149068 219153 348230 454266 393844 331064 278195
18688 278195 259725 151993 135425 172658 162722 215721 228005 303875 416244 479587 460789
18677D60789r1641m2452N0800k60p1190l5049M8283L7779j0962K9950P8356j6904
18665D37499N403m9605J7611k982K9467P1382P5237J41056R5619k6971q2613M4554
18653G55657j88855k07556o7006k1495l0017M1121j4663K0056J12427J47745M1637
18642E89051O1486K1223J4289o4622p461l0517L8944j1219p5334o0199J83626
18631F59267Q2323j60884r3836J4883J07806J50073J02157J12323R1906J8389
18621A084407J2987j22922j72299k1801L111j8995M8832O5327j89463J2630N1777
18610G53591L7627p403k1770N0383J45623o5209J66582K90500J50415r0337p1410
18599A338592j5762j41840p7447N4992M9360r2880j30886j64218l8585O173j7917
$$ plain form
18677 460789 369148 326696 377496 377236 306046 270997 319280 357059 346097 376047 454403 437499
18665 437499 442902 393297 410908 407926 437393 508775 584012 725068 820687 793716 711103 755657
18653 755657 566802 359246 292240 270745 240728 281849 267186 287242 399669 547414 589051
18642 589051 650537 671760 686049 621427 613966 583449 622393 611174 535840 475641 659267
18631 659267 741590 580706 486870 501753 609559 759632 861789 974112 1066018 1084407
18621 1084407 1097394 974472 802173 780372 783483 764488 813320 878647 689184 701814 753591
18610 753591 791218 783815 762045 812428 958051 892842 1059424 1349924 1500339 1410002 1338592
18599 1338592 1322830 1180990 1103543 1158535 1207895 1115015 984129 819911 781326 787499 769582
18588G69582N9795l4386n8273j6621R7148J0864l6267m2799L0685k3942k2699
18577G33087N624J8530o1950N3917P0094Q4687J78785M7581R5319J87340J76788
18566A589802j13782o9696j8540q9089k4462j5797n6858J5539J24686J8143K691
18555A362637l5402k12J18197Q378J745k1252J58499K79067K90647L62027K84074
18544B808405J45298p3829q9910l3999o7257J42824P4477J39300M20622M55201
18534C921132M41645J89600J73034L73313J00338k56395k67681j96366K6185K16409
18524D721214L00277O15777P63686R14006R48907P34289P20582Q54878J365478
18515A1939094K012198K904542M057800O099395J0107122J6519632K6593217M0029028
$$ plain form
18588 769582 829377 794991 736718 720097 817245 828109 791842 749043 779728 755786 733087
18577 733087 738711 757241 695291 749208 819302 903989 1082774 1130355 1225674 1413014 1589802
18566 1589802 1476020 1406324 1387784 1298695 1274233 1258436 1201578 1217117 1341803 1359946 1362637
18555 1362637 1327235 1327023 1445220 1453598 1455343 1434091 1592590 1871657 2162304 2524331 2808405
18544 2808405 2953703 2879874 2789964 2755965 2688708 2831532 2906009 3045309 3465931 3921132
18534 3921132 4362777 4552377 4725411 5098724 5199062 4942667 4674986 4478620 4504805 4721214
18524 4721214 5021491 5637268 6400954 7314960 8263867 8998156 9718738 10573616 11939094
18515 11939094 13951292 16855834 20913634 27013029 37120151 53639783 80233000 120262028
18507A20262028M8855883K9874188k1857144m8245628l6236889j8454130n524958
18500F8673350M531539J5595121K9954757M3935067M0915876l217992n0724098
18493A49663620n0969281l1652492j7448901j0142601o548390m560332l213873
18486B5127750j868823o03990M37849J892076L485464O034601J0360826J7296954
18478F2162707K8258005M2671249N1238059K9522557k5832798n2032120l8575615
18471I7412044j9512004n462514N512827J7239068L1874930M5360822M0136987
18464B12562160o508640n3894338n3067676l3492802j8991461j1386020p514931
18457B7706292n537169m096162l045113k391022j762438j147148r87677q13176
$$ plain form
18507 120262028 169117911 198992099 177134955 128889327 92652438 74198308 68673350
18500 68673350 73204889 88800010 118754767 162689834 203605710 200387718 149663620
18493 149663620 98694339 67041847 49592946 39450345 32901955 28341623 25127750
18486 25127750 23258927 22654937 23092786 24984862 28470326 34504927 44865753 62162707
18478 62162707 90420712 133091961 184330020 213852577 188019779 135987659 97412044
18471 97412044 77900040 72437526 77950353 95189421 127064351 172425173 212562160
18464 212562160 206053520 152159182 99091506 65598704 46607243 35221223 27706292
18457 27706292 22169123 18072961 15027848 12636826 10874388 9727240 8739563 7926387
18449G926387p54125m19300l21959m52546n71798m58266k47949m3322o1356n9459
18439D536307l8141J30143Q6333j39747n30519n91226o06952l84190j34526r3725
18429B233757K8369K51101K78568M1602l4269l39753o18838m08663o1845o9495
18419A300534l1858m6887k3192N1185m6342j93754k07234k22386j19871l6775
18409D23420k258K01732J16165L6836j74887j76866P7113R0329p6805M4223O8318
18398F27320j57384k28M4847n0719l1487L2404J40926P28k3755m8534k5472K7629
18386E36275n1123o8864m4964n4632K4784N5011j26974K0725k9834r25Q1221K5146
18374C65846m2050j37156l0362R4194J5236M6000L6078O301J38152K03929R7645
$$ plain form
18449 7926387 7172262 6752962 6431003 5978457 5406659 4948393 4700444 4657122 4595766 4536307
18439 4536307 4498166 4628309 4714642 4574895 4044376 3453150 2846198 2462008 2327482 2233757
18429 2233757 2262126 2513227 2791795 2833397 2799128 2459375 1840537 1431874 1370029 1300534
18419 1300534 1268676 1221789 1198597 1249782 1203440 1009686 802452 580066 460195 423420
18409 423420 421162 622894 739059 775895 601008 424142 501255 591584 514779 559002 627320
18398 627320 469936 469708 514555 463836 432349 464753 605679 606407 582652 534118 508646 536275
18386 536275 485152 416288 371324 316692 341476 396487 269513 290238 260404 259479 340700 365846
18374 365846 323796 186640 156278 250472 265708 311708 347786 354087 492239 696168 793813
18363G93813K2473L6550l3543l5577j04365j46461n3530l8493j03255k7818N5780
18352C65574l6008R154Q2300p995q2344j41285O7049p4694J7692Q4426j5003k5179
18340B43687J36432o0592Q073k0362Q6785J07847n5649j61950n3744o3226p48
18329A66553P8733Q5386N9645J1543J2503L4265J7041L6164p1990M475m2489k2825
18317C69004N1601m6283J9620k4842j14236K9076k3064r4548M5060J7872R8439
18306C27699P6896j6357J540m8490m5169M4629L4506M08k03771m6019R6030J05100
18294C27002j3736l4772M1817P9907l4081K3128j4872K8506k4654n5496o7171
18283B55578L6917k1574K1138J40316n250j5487n9203j52273J03102K19662J64316
$$ plain form
18363 793813 816286 852836 819293 783716 679351 532890 479360 440867 337612 309794 365574
18352 365574 329566 338720 421020 413025 330681 189396 256445 181751 199443 283869 268866 243687
18340 243687 380119 319527 327600 307238 394023 501870 446221 284271 230527 167301 166553
18329 166553 245286 330672 390317 401860 414363 448628 465669 501833 429843 434318 391829 369004
18317 369004 420605 374322 393942 369100 254864 283940 260876 166328 211388 229260 327699
18306 327699 404595 388238 389778 341288 296119 340748 375254 375662 171891 125872 221902 327002
18294 327002 313266 278494 320311 400218 366137 389265 374393 402899 378245 322749 255578
18283 255578 292495 270921 292059 432375 427125 411638 352435 200162 303264 522926 687242
18272F87242R4275J58360K26745P0572J45606J70283j5499j65345j84277k80345
18262I07617q5621j2033Q0691J75950J26469J61429Q4162j41807k41864j38953
18252I16040o0626q7237r0034n8163n9986j6865L9267L2566L0163O9493r3702
18241F20916r31P7921P0124p3527n2967L9929J68454R8108L3337o9243K7758M7964
18229I87843l7612n8900j3227j4862r2277N4270K11114K98136L46983K37458N0700
18218A969626j0034k16122l50569k44548j50012P978L585L9559M21630M60813
18208A931906J18784k25066j62202n4077j866l9620j39847j47038r6943q1156
18198A102875k6457j22013j75083J8944M629O016k2212Q4564J04240k3752p6740
$$ plain form
18272 687242 781517 939877 1166622 1237194 1382800 1553083 1537584 1372239 1187962 907617
18262 907617 821996 809963 890654 1066604 1193073 1354502 1438664 1296857 1054993 916040
18252 916040 855414 768177 678143 619980 559994 543129 582396 614962 645125 714618 620916
18241 620916 619985 697906 768030 694503 641536 681465 849919 948027 981364 912121 939879 987843
18229 987843 950231 891331 878104 863242 770965 825235 1036349 1334485 1681468 1918926 1969626
18218 1969626 1959592 1743470 1392901 1148353 998341 1006319 1009904 1049463 1471093 1931906
18208 1931906 2050690 1825624 1663422 1609345 1607479 1567859 1428012 1280974 1184031 1102875
18198 1102875 1076418 954405 779322 798266 802895 808911 786699 871263 975503 951751 875011
18187H75011O1215J49180J80658L26671L05909J10793j42862j13870j42793j46515
18177A463397q2404m0003o2007r5328J02687K70154J240j8090j38634j31531r8924
18166A170557P1756P9008J4427J14049K06717N4738P6283R0194J58220K67476
18156B303425K20763J57732L18431L49334M61304N89221N56765P25661O63716
18147F346352R70926J531605K686980M730440P925673J3147834J9170010J8172938
18139G4682758L758577k270099r911153k0302448j5944568r022338n165804l206148
18131A2618777k064848j328688r27557n76253k13064m1839k6164K17368M09771
18122H067503N87197P83631J038872J285609J453077J843640K309172L235447
$$ plain form
18187 875011 936226 1085406 1266064 1592735 1898644 2009437 1866575 1752705 1609912 1463397
18177 1463397 1380993 1340990 1278983 1183655 1286342 1556496 1557736 1539646 1401012 1269481 1170557
18166 1170557 1242313 1321321 1335748 1449797 1656514 1711252 1787535 1877729 2035949 2303425
18156 2303425 2524188 2681920 3000351 3349685 3810989 4400210 4956975 5682636 6346352
18147 6346352 7317278 8848883 11535863 16266303 24191976 37339810 56509820 74682758
18139 74682758 78441335 76171236 66260083 45957635 30013067 20990729 15824925 12618777
18131 12618777 10553929 9225241 8297684 7721431 7508367 7466528 7440364 7657732 8067503
18122 8067503 8654700 9438331 10477203 11762812 13215889 15059529 17368701 20604148
18114B0604148O010808J0861686J9698216L7063346O6035524J03871042R3773926
18107C57918696o8654941j03863740m0239345j8359153j6213099j2991252k2655130
18100G4942036k2447050j2997173o068673j990902k96713k483873m274189k933465
18092B1449998q80736P79128K544169M996304Q876284J5474734K4938620L1377957
18084A09556458K0913632n03263j0735927r464546k0587586k0513741p913814
18077F0751213L13520m460134j4594658j2914502p701435m355732k547903j591926
18069A2898443q99763m63330n05528k24847K64637O49563R63640J476197K536337
18060A6695349L761514M469254J735957k686436k393614K93648L330187P240417
$$ plain form
18114 20604148 26614956 37476642 57174858 94238204 160273728 264144770 357918696
18107 357918696 289263755 185400015 145160670 126801517 110588418 97597166 74942036
18100 74942036 52494986 39497813 33429140 31438238 31141525 28657652 24383463 21449998
18092 21449998 20569262 21348390 23892559 28888863 37765147 53239881 78178501 109556458
18084 109556458 130470090 129966827 119230900 109766354 89178768 68665027 60751213
18077 60751213 61064733 56604599 42009941 29095439 21394004 17038272 14490369 12898443
18069 12898443 11998680 11535350 11029822 10804975 11069612 11719175 12682815 14159012 16695349
18060 16695349 20456863 24926117 26662074 23975638 21582024 21875672 25205859 32446276
18052C2446276J3177545K1628956L0657587K7394921N829455j1404660j0634502
18045A09095578j6690440k4753839j6407911n704383J690122N183978q21592q788782
18037D2802731m830431K819353Q517667P173877n760706j2039441p338691j915697
18029B9428662K851164Q101954J3636528J4004146l318200j9391686j5562414
18022B9750154q599426m688677k467854p98134M92719J819049K970740K936313
18014B1414884q99481m844909l917194k087819j040787m29893n3654L21226R65941
18005I428314J828316L214612N135559Q028029J0269433O087990o301820j0381643
17997B7308790o355506k347202Q07848L760387P672926J2513845J5356204N515681
$$ plain form
18052 32446276 45623821 67252777 97910364 125305285 131134740 119730080 109095578
18045 109095578 92405138 67651299 51243388 45539005 47229127 52413105 51591513 42802731
18037 42802731 37972300 40791653 49309320 56483197 50722491 38683050 31344359 29428662
18029 29428662 32279826 40381780 54018308 68022454 64704254 45312568 29750154
18022 29750154 21150728 16462051 13994197 13196063 13688782 15507831 18478571 21414884
18014 21414884 20515403 15670494 11753300 9665481 8624694 8194801 8141147 8462373 9428314
18005 9428314 11256630 14471242 19606801 27634830 37904263 43992253 37690433 27308790
17997 27308790 20953284 18606082 19413930 23174317 30847243 43361088 58717292 64232973
17989F4232973j4583486j7230901j0129762m871753j694829O92113K715565M046598
17981B3176518J490454n522946o486793l979869k167100j249161o73613l28072
17973D259418l02695j88363j12626o1274k35364l78869m69271k15132j94545j96519
17963A904760j22495l3375r5368M4731P0544J6448O973R9505K07614J67607J24615
17952B391559q9370j38170k43653k35757j39799j91382j38453k03210q1912N2858
17942I82711n553L5656m0388q0906o6629m1686L5259k0897l6542q1319R1404J49366
17930I20476L46340K59810L8704n9449p8722J29163J67924J35281R8881r605j07904
17919A840899M5482P2098k1187o8367k02130m14276j26870m0663n7293m3639j47590
$$ plain form
17989 64232973 49649487 32418586 22288824 17417071 15722242 16414355 19129920 23176518
17981 23176518 24666972 19144026 12657233 8677364 6510264 5261103 4587490 4259418
17973 4259418 3956723 3768360 3655734 3594460 3359096 2980227 2510956 2295824 2101279 1904760
17963 1904760 1782265 1748890 1653522 1698253 1768797 1785245 1792218 1891723 2099337 2266944 2391559
17952 2391559 2302189 2164019 1920366 1684609 1544810 1353428 1214975 1011765 929853 982711
17942 982711 977158 1012814 972426 891520 824891 783205 818464 797567 761025 679706 771110 920476
17930 920476 1266816 1526626 1565330 1505881 1427159 1556322 1724246 1859527 1958408 1948803 1840899
17919 1840899 1886381 1958479 1937292 1868925 1666795 1252519 1125649 1084986 1027693 984054 836464
17908H36464j65795n1556K1700N4507L427R2778o4794L5170M1408L20042L24381
17897A447732J57054j10839j89766j8875Q6872K4822m4400M8827J77690J77272
17887A756389J15928K7624j14420k84630k31821j69122j16687o2748J5144r8984
17877H36673j16829q6570j19187p9262J00940N1315K1935j00141J3511j6870q0758
17866D24757m6825k392M6536J63672J67408J43995O6443r540R614j2519m1591
17855I09558j39273J4466L7723L1414N5009J13493L4277n2586p2966n6613j14765
17844G59737r4270N3464J09302R9940K9216N5756K8888M9583j6067M362j45990
17833I33921r7726Q546R7436J0903N078l1039q8196m4848J56644r840j59982P9793
$$ plain form
17908 836464 670669 619113 640813 695320 698747 791525 726731 761901 803309 1123351 1447732
17897 1447732 1604786 1493947 1304181 1285306 1372178 1397000 1352600 1401427 1579117 1756389
17887 1756389 1872317 1899941 1785521 1500891 1269070 1099948 983261 920513 935657 836673
17877 836673 719844 633274 514087 434825 535765 587080 609015 508874 522385 505515 424757
17866 424757 377932 375540 422076 585748 753156 897151 963594 954054 963668 951149 909558
17855 909558 770285 784751 822474 853888 908897 1022390 1056667 1004081 931115 874502 759737
17844 759737 665467 718931 828233 928173 957389 1013145 1042033 1091616 1075549 1079911 933921
17833 933921 836195 844741 942177 953080 958158 927119 838923 794075 950719 940879 780897 860690
17821H60690O2656k5581P9019K1454r623o083R6506J1968j02977M3586J94716
17810A226331J87305J38358n9590J09636R0703K7854J10626J49805q6440j98664
17800A695924n5331K57710K78055L04177M77238P18175M76243l0466l05634j32283
17790C683808j36012k2469J72480L00604M83873N12256P83634L92477J19870O6531
17780F357052N19137Q99811J022578J340768K154960L656740O099431J0233111
17772C2283588J7690328K9577766M4195652M9478832J7170095l8467826m9795140
17765A02133295l1233000j4102508k734095O833927J8588009L3654810M6170411
17758A59310849L3900045k0960400n5772634m3579890k4476389j3285132p978616
$$ plain form
17821 860690 923346 897765 976784 998238 988615 982532 1079038 1091006 988029 1031615 1226331
17810 1226331 1413636 1551994 1492404 1602040 1692743 1720597 1831223 1981028 1894588 1695924
17800 1695924 1640593 1898303 2176358 2480535 2957773 3675948 4152191 4121725 3816091 3683808
17790 3683808 3547796 3525327 3697807 3998411 4482284 4994540 5778174 6170651 6290521 6357052
17780 6357052 6876189 7776000 8798578 10139346 12294306 15951046 22050477 32283588
17772 32283588 49973916 79551682 123747334 173226166 190396261 151928435 102133295
17765 102133295 70900295 56797787 54063692 60897619 79485628 113140438 159310849
17758 159310849 193210894 172250494 116477860 72897970 48421581 35136449 27157833
17751B7157833n444526l924815k684063j654292o52623l44812n43179n08813n44926
17742A0855784q64011j016260o18504p7351M58287P93879J104590R00747L76344
17733A1913505M99313O43551N62597R14582J650384K592478M501372P715960J3322898
17724D4316640K2903983L8836965N9493344P0906735L5503735m5674450p3510931
17717A52776021m9028353k3141405o263718O980787K2285472M1789432N9558961
17710B04957197N0070826j5751864p1653273o2735475l6766657k0255066j1804859
17703C6060829p708846n576856m082346k987527k021726j155120n49772j45506
17695A1833130j26752p55779j026836p23442l99160J29637N94919J135293J697484
$$ plain form
17751 27157833 21713307 17788492 15104429 13450137 12797514 12452702 11909523 11400710 10855784
17742 10855784 9991773 8975513 8357009 8279658 8737945 9531824 10636414 11537161 11913505
17733 11913505 12412818 13056369 13618966 14533548 16183932 18776410 23277782 30993742 44316640
17724 44316640 67220623 106057588 165550932 236457667 271961402 226286952 152776021
17717 152776021 103747668 80606263 74342545 81323332 103608804 145398236 204957197
17710 204957197 255028023 239276159 167622886 104887411 68120754 47865688 36060829
17703 36060829 28351983 22775127 18692781 15705254 13683528 12528408 11978636 11833130
17695 11833130 11706378 10950599 9923763 9200321 8801161 8930798 9525717 10661010 12358494
17686A2358494L128855N302449Q435566J2900814J7152836J2959718J978732j100266
17678G3117198j3066516j9844294j3076412o909538l764632k167630j126899m47188
17670A2714089K37310J175003K507004M533947Q306408J4374689K2333834K6900305
17662I3082589J2979596l786262q387118k3114626k4838763j5479343q820703
17655B1635370n220020l248906k249575j529424q63204n63455m12312k21675L0080
17646G356879Q3405K4901M6709R9059J94526K9534k014Q6247L3156K21084N96157
17635H769643R04006J497238K434396M049205O910196J0856722J5892066J7418081
17627F8731553P207549Q28912m087962j7905640j6526474q772519l992920j322420
$$ plain form
17686 12358494 15487349 20789798 29225364 42126178 59279014 72238732 74217464 73117198
17678 73117198 60050682 40206388 27129976 20220438 16455806 14288176 13161277 12714089
17670 12714089 12951399 14126402 16633406 21167353 29473761 43848450 66182284 93082589
17662 93082589 106062185 102275923 93888805 70774179 45935416 30456073 21635370
17655 21635370 16415350 13166444 10916869 9387445 8524241 7960786 7548474 7326799 7356879
17646 7356879 7440284 7465185 7511894 7610953 7805479 7835013 7832999 7919246 7952402 8173486 8769643
17635 8769643 9673649 11170887 13605283 17654488 24564684 35421406 51313472 68731553
17627 68731553 75939102 76768014 72680052 54774412 38247938 29475419 25482499 24160079
17619B4160079P21675K977801O462290J0951174J4510546R914909k153225J216619
17611F8761868J3691523K6175898K8228846J4356826J6585323K4765104L4644343
17604B27209731M8963797J54618o6717225n0930275j4323068J305003j1514861
17597A34147720j4855862l724856j2261037k8308774k3019864j3519952p868296
17590C0589079m491844k758417j580409o98458Q69179K364874L359063N090141
17582C2743208R060415J2494101O677164j0703201j4842413r073017m971379k866935
17574A8517943k095186j686692j007591k16119L36983O60158J177638J687419
17566A7374553K193218L190395N328002Q631930J2127428J1727272p15774q099420
$$ plain form
17619 24160079 24881754 27859555 34321845 45273019 59783565 69698474 67545249 68761868
17611 68761868 82453391 108629289 136858135 151214961 167800284 192565388 227209731
17604 227209731 276173528 276328146 209610921 158680646 144357578 145662581 134147720
17597 134147720 119291858 115567002 103305965 74997191 51977327 38457375 30589079
17590 30589079 26097235 23338818 21758409 21059951 21929130 24294004 27653067 32743208
17582 32743208 41803623 54297724 60974888 50271687 35429274 26356257 21384878 18517943
17574 18517943 16422757 14736065 13728474 13512355 13849338 14509496 15687134 17374553
17566 17374553 19567771 22758166 28086168 36718098 48845526 60572798 59857024 51757604
17558E1757604j392624P933379J9309365L6820230O2247638Q8936050P5247376
17551C40859018k4784372p5499110m9648027m4675624l6994239j6115987K357943
17544I5499602J7533471K7503399J1413864l1673095l9059276k3168140j1277669
17537D6772156l518235K537603P786222J0097219L689598j378021K844738M78826
17529F9310106j2517104j3029029n260618J623608P220569Q532887k669874j4453050
17521C8757495j1511689o517283l639280k261110j565263j228777j050527o88113
17513A0295453j79080K95689Q31346J241985J604609K375905L417311N841593
17505B5724811J0199932J5813320J8814955L414816j8916159j7024404q359357
$$ plain form
17558 51757604 50364980 58298359 77607724 114427954 176675592 265611642 340859018
17551 340859018 316074646 240575536 190927509 146251885 109257646 93141659 95499602
17544 95499602 113033073 140536472 151950336 120277241 81217965 58049825 46772156
17537 46772156 43253921 45791524 53577746 63674965 67364563 65986542 68831280 69310106
17529 69310106 56793002 43763973 38503355 40126963 47347532 55880419 53210545 38757495
17521 38757495 27245806 20728523 17089243 14828133 13262870 12034093 10983566 10295453
17513 10295453 10116373 10412062 11243408 12485393 14090002 16465907 19883218 25724811
17505 25724811 35924743 51738063 70553018 73967834 55051675 38027271 29667914
17498B9667914k642333R01907M720526R298670J4794796J7656738N484699j1536757
17490F8346160o341047P046518K1350012L8382456N4460040N7517508L0108853
17483B70870500k8850264o3842546n7486986l8110593k1657513j1281790m490443
17476D5150365J228105O229694O691576n190066j4819940j1108404o181899l491521
17468A8507910k063479j085356m76783K51127R88614J602160K380432L347658
17460B3452283N061937Q315939J3560134K2237414L4694308M6529197M5993170
17453A99844382J9855904k6151017n0280497m6294337l1511489j8259164j0424713
17446C6779069n890481l033861p00582J718985M813221Q310947J4206677K3983646
$$ plain form
17498 29667914 27025581 27927488 32648014 41946684 56741480 74398218 79882917 68346160
17490 68346160 62005113 69051631 90401643 128784099 183244139 240761647 270870500
17483 270870500 242020236 178177690 120690704 82580111 60922598 49640808 45150365
17476 45150365 46378470 52608164 59299740 54109674 39289734 28181330 21999431 18507910
17468 18507910 16444431 15359075 14882292 15133419 16122033 17724193 20104625 23452283
17460 23452283 28514220 36830159 50390293 72627707 107322015 153851212 199844382
17453 199844382 219700286 193549269 143268772 96974435 65462946 47203782 36779069
17446 36779069 30888588 27854727 27154145 28873130 33686351 41997298 56203975 80187621
17438H0187621L4444728L6493662K0037193j5009522l8159863l7245427k6547932
17431E4200460j6049364r615834o064981m196825l232796k476475j777908j167120
17423I619157q17196o16196l11215k77725o7040K67843M87949O31369J126087
17414A0043033J642240K342340L639809N911876R243200J5283513K4394081L3775686
17406A06275778L5341101J8811334j5659829l7264961l5873885k5112473j5068769
17399C1448296r060654n619806l794323k735623j991320j326709q41611o94371
17391E383879o79820p12246n98097k28334j99554k47566k73778k32849j26474
17382B085161o2214l9914j4650k01307j57761k06528j08065j36405j48980r6100
$$ plain form
17438 80187621 114632349 151126011 171163204 156153682 117993819 80748392 54200460
17431 54200460 38151096 28535262 22470281 18273456 15040660 12564185 10786277 9619157
17423 9619157 8801961 8185765 7874550 7596825 7529785 7797628 8285577 8916946 10043033
17414 10043033 11685273 14027613 17667422 23579298 32822498 48106011 72500092 106275778
17406 106275778 141616879 160428213 144768384 107503423 71629538 46517065 31448296
17399 31448296 22387642 16767836 12973513 10237890 8246570 6919861 6078250 5383879
17391 5383879 4704059 3991813 3393716 3165382 2965828 2718262 2444484 2211635 2085161
17382 2085161 2022947 1983033 1968383 1767076 1609315 1402787 1294722 1158317 1009337 913237
17372I13237n7461p0418p721k00393p3759K8519M9792m9857K9011Q4243o8085
17361E77108j99797j06678J00044j490q2693n2356k3721M427L7959K240j38122
17350A16921n3494J25513J59595R051r5917P3272L4656j4414o2231j54578j71428
17339c3054P2309J53823K4052q8867k1277N9439j00374J18591N9273o351n5299
17328A82265m2352J5604N9987r990K0829L827l0460j55912m8236l0478L6873l8827
17316c6870m8406j7594J02154k0077k7289p1555J25804P3666n2574n6730m6619
17305g6090K1583j09885k7748m2271K6743K7526R2594R1769k0057r954O4496m202
17293C4504n7483o4741Q235R9841n5065m7733n0594N84J6897J00175P6222o2032
$$ plain form
17372 913237 855776 785358 777637 577244 503485 532004 581796 531939 560950 645193 577108
17361 577108 377311 270633 370677 369187 286494 234138 210417 214844 252803 255043 116921
17350 116921 63427 188940 348535 357586 261669 334941 369597 355183 292952 138374 -33054
17339 -33054 39255 193078 217130 128263 106986 166425 66051 184642 243915 237564 182265
17328 182265 139913 155517 215504 205514 226343 230170 199710 43798 -4438 -34916 1957 -36870
17316 -36870 -85276 -102870 -716 -20793 -48082 -119637 6167 79833 27259 -29471 -76090
17305 -76090 -54507 -164392 -192140 -234411 -207668 -180142 -87548 4221 -15836 -25790 38706 34504
17293 34504 -22979 -87720 -79485 20356 -34709 -82442 -133036 -132452 -115555 -15380 60842 -1190
17281a190P619R6417J7691j91588r3370J19651M7988J4484j10331j03399j10049
17270c06077J17877J77782P6374J8934P0082K5372j0157J12800R2599K60205K39562
17259H75353K48752J20224o3294l45143l80957k11770q7674O4763K45531M42189
17249I07974K58656K02963j57400l93135l83330j80574m022k2339M3916O109l5433
17238B43385j73993r1458q8271p470P591J4408R5400l0028M4840J25976j3064
17227A27316j11508k1355M4298j52412J4145J36168L1350J8060J8786J5910M0207
17216A60965j54166k6516J61749n4130K68511L47980J58841j57856l07996j04250
17206B93132q8347l1805j6115J67757J78011O2820J63524J1146p7126j63318j55467
$$ plain form
17281 -1190 6429 102846 120537 -71051 -164421 -44770 3218 17702 -92629 -196028 -306077
17270 -306077 -188200 -10418 65956 84890 154972 180344 170187 282987 375586 635791 875353
17259 875353 1124105 1244329 1181035 835892 454935 243165 155491 220254 465785 907974
17249 907974 1166630 1369593 1212193 819058 435728 255154 251132 228793 272709 278818 243385
17238 243385 69392 -22066 -110337 -117807 -110216 -95808 -408 -30436 14404 140380 127316
17227 127316 15808 -5547 38751 -113661 -99516 36652 68002 86062 104848 120758 160965
17216 160965 6799 -19717 142032 87902 356413 704393 863234 705378 397382 293132
17206 293132 204785 172980 156865 324622 502633 565453 728977 740123 662997 499679 344212
17195C44212j63343k8062r7800j22604K5944N6367j8683L3698M4863o4818r1010
17184h1236R032j16649Q9032K5593P3855Q2193j76892j08436P8624n415L5725
17173i4574j4370M4288q08P3391j22572Q739n1366N7784K5029R574K28046J08941
17161B72102j54091m5352L4197j21969l5875J52176M824J35074N6690n030k133
17150B90613j5871j03306n6043k27709j02625m5022N3656J02924j980M8683r334
17139f6014j1864J67101J58882r7202j0988K36253J43564n0158r6992j30446j19071
17128A23065m5011m4271J4319l0498J0466j315n8402J6687l5619r4195o5605Q4110
17116a26269J32705J00158r3282k8846M0802K08677q4853j47270N4962j06547
$$ plain form
17195 344212 180869 152807 55007 -67597 -41653 14714 -3969 29729 74592 9774 -81236
17184 -81236 -72204 -188853 -99821 -74228 -373 81820 -95072 -203508 -124884 -130299 -94574
17173 -94574 -108944 -64656 -65464 7927 -114645 -105906 -157272 -99488 -74459 -64885 163161 272102
17161 272102 118011 72659 106856 -15113 -50988 101188 106012 241086 297776 292746 290613
17150 290613 274742 171436 115393 -112316 -214941 -259963 -206307 -103383 -105363 -56680 -66014
17139 -66014 -77878 89223 248105 150903 139915 376168 519732 469574 372582 242136 123065
17128 123065 78054 33783 48102 17604 28070 26755 -31647 -14960 -50579 -144774 -210379 -126269
17116 -126269 6436 106594 13312 -15534 25268 233945 149092 1822 56784 -49763
17106d9763n0209J50849N8835l4222P64J09077J38529J07157p7758m6948l1716
17095B74595p8884M3704o3475o1358K4773P5645J42521R7062R2571l0231j0500
17084E06423l4446J21768N3819M2284K9364J625j41348k42551k67767n9413J82830
17073A92588J58739J79893n0315o0795k68855m2081J48008R4629n0690j5070Q2819
17062C68870Q4518m8490j45582k21281K8224J26712R238K2502R199P3315L0521
17051C37746p2094r2563j66387k2730l8910l604M2443L168K6889M2292L9690K4515
17039A20455q7512j4399L6030L6145K69185L01971M5161N1727M6662r6750n8880
17028F49795q6051n6637j41m8127p3308J19097Q8069j15447n4814L387j29022
$$ plain form
17106 -49763 -99972 50877 109712 75490 76254 185331 323860 431017 353259 306311 274595
17095 274595 195711 239415 175940 114582 139355 215000 357521 454583 547154 516923 506423
17084 506423 471977 593745 647564 689848 719212 720837 579489 336938 69171 9758 192588
17073 192588 351327 531220 480905 420110 151255 109174 257182 351811 301121 286051 368870
17062 368870 453388 404898 259316 38035 66259 192971 202209 224711 233910 307225 337746
17051 337746 265652 173089 6702 -16028 -54938 -58542 -16099 -12931 13958 56250 95940 120455
17039 120455 32943 18544 54574 90719 359904 661875 707036 758763 805425 708675 649795
17028 649795 563744 507107 506966 458839 385531 504628 592697 477250 422436 425823 296801
17017B96801N7195J91189L57428K28573o861k14261l03677j93567L485p666j13716
17006B94923r0862O2510N7893J36318J00672j56036l41442l5904l6157J03866
16996I5781J55330j26937k8802j4310l3154L0969P3633q9637m2522O234J8234
16985D4819l4453m9429p9548l1096M6635L8466J75761j1863P9221J21440M6263
16974C46216M6328o392N1761n4569Q5056J39418K02816L46860M3890k1902k26738
16963I52744m06983l75490j65873j0289P2870M3030L040P637r7181r6130j05056
16952a77681L2149J01005M5099R448J5992N4305J25273K27421q5292r2365k0290
16941B35064P966J27221J34171J8974L39417J99418Q2213j63538j78874j50595
$$ plain form
17017 296801 353996 545185 902613 1131186 1124325 910064 606387 412820 416305 408639 294923
17006 294923 204061 266571 324464 460782 561454 405418 63976 28072 -8085 95781
16996 95781 251111 124174 95372 81062 47908 78877 152510 62873 20351 26585 44819
16985 44819 10366 -39063 -118611 -149707 -103072 -64606 111155 99292 178513 299953 346216
16974 346216 392544 386152 437913 383344 468400 607818 810634 1157494 1201384 1179482 952744
16963 952744 545761 170271 4398 -5891 66979 110009 113049 120686 23505 -72625 -177681
16952 -177681 -145532 -44527 572 10020 26012 80317 205590 433011 347719 255354 235064
16941 235064 243030 370251 504422 523396 862813 1062231 1144444 980906 802032 651437
16931F51437j91857r3648m6383j16904j32118O4093K1190j59244M4430K11409
16921B52405J59966K40191K26292J87j45256j42088k44934j86479j32297j60M9632
16910G7459L4321k5780R5989J0685j6581m5286j30507p6447J28371Q3579o015
16899A29788O4554p2891o9802m0100M6865L5656O3809J17838L9978R1761Q9361
16888D96817J07699o7435q0337o3469j66046m0594m2446q8102P1104J1757j1671
16877A27277j15283M9970n2769q896J9440K5525k1536K694l4276j04711q6970
16866a99535M6522M0012j8222N9420L4885P2125m7350k9780j36368N4503O8829
16855e4959j9372M5964J12154L3779o0620M4076J243r6128j18251M0923J22732
$$ plain form
16931 651437 459580 365932 319549 202645 70527 134620 155810 -3434 40996 252405
16921 252405 412371 652562 878854 879041 733785 591697 346763 160284 27987 27827 77459
16910 77459 111780 86000 181989 192674 176093 130807 300 -76147 52224 135803 129788
16899 129788 194342 121451 51649 11549 58414 94070 157879 275717 315695 407456 496817
16888 496817 604516 537081 456744 393275 227229 186635 144189 56087 127191 138948 127277
16877 127277 11994 61964 9195 299 19739 45264 23728 26422 -7854 -112565 -199535
16866 -199535 -153013 -113001 -131223 -71803 -36918 35207 -12143 -41923 -178291 -123788 -54959
16855 -54959 -74331 -28367 83787 117566 56946 101022 102265 6137 -112114 -71191 51541
16844E1541J36581j6833j50858j46093l8024J32973N4693q5908J7161K4255M9824
16833B9312J8979q0997o4424P7938R4800p0708j35151k9385K5088M8719Q2718
16822c111j8550j92532j2324j6160j46572J6689M3906J30798N2489L501O8666
16811g3200j7503k6177k0836M5220o589o5832n774J3244n3741n5724L1797J65451
16799f9664R9104q781k6346k7500N5461m3625j00890k4016m4692p8765k5939J01085
16787a94568K2852O3269J52769J1788o870n5757n4757j02695L4913N6363q7430
16776a60123l4454J10574J01368j9439q861j41458j10361J26597L425k9410r2488
16765b54630J23637K5083j0641q9863k5479k0674R155N5429r775J37762k591K0576
$$ plain form
16844 51541 188122 171289 20431 -125662 -163686 -30713 23980 -61928 -44767 -20512 29312
16833 29312 48291 -32706 -97130 -19192 75608 4900 -130251 -159636 -134548 -85829 -3111
16822 -3111 -21661 -214193 -226517 -242677 -389249 -372560 -328654 -197856 -145367 -141866 -73200
16811 -73200 -90703 -116880 -137716 -92496 -99085 -164917 -170691 -157447 -211188 -266912 -235115 -69664
16799 -69664 29440 20659 -5687 -33187 22274 -21351 -122241 -146257 -190949 -269714 -295653 -194568
16787 -194568 -171716 -108447 44322 56110 49240 -6517 -61274 -163969 -129056 -72693 -160123
16776 -160123 -194577 -84003 17365 -2074 -10935 -152393 -262754 -136157 -132732 -162142 -254630
16765 -254630 -130993 -105910 -116551 -206414 -231893 -252567 -243412 -187983 -197758 -59996 -62587 -42011
16753d2011J14028m3087p1625o9759n2567K2429J00123j4830j80806k3280J3135
16742b48250L4774m3299L6251J2987J250p974q9485k3140p566n495J83439Q5970
16730g0538N6100L5021l0964j43633o4783k6505Q147J6050L3147l7429O9431J3075
16718a42881J53767K5612p1551r0273J8247J48207j3884l9862n7908P6104l4088
16707b8510r4388m792p6739o1456k7854j350L274J45046J7142J0352j5498n203
16695a39976k0580m3389o4485l623J25395J60504M8503j82982O964Q9458K2050
16684b161N1177J7628p8491J1557k5984l2700n3077L67J06775j1554q1594k0597
16672a18654K950J25729P0005L2022m1207J15319k3234o3666m6934j26577j4917
$$ plain form
16753 -42011 72017 28930 -42695 -112454 -165021 -142592 -42469 -57299 -238105 -261385 -248250
16742 -248250 -213476 -256775 -220524 -207537 -206287 -214261 -303746 -326886 -334452 -339947 -156508 -70538
16730 -70538 -14438 20583 -10381 -154014 -218797 -245302 -237155 -221105 -187958 -225387 -155956 -142881
16718 -142881 10886 36498 -35053 -125326 -107079 41128 27244 -12618 -70526 5578 -28510
16707 -28510 -122898 -127690 -204429 -265885 -293739 -295089 -291815 -146769 -129627 -119275 -134773 -139976
16695 -139976 -160556 -203945 -268430 -272053 -146658 13846 62349 -120633 -113669 -24211 -2161
16684 -2161 49016 66644 -11847 -290 -26274 -58974 -112051 -111684 -4909 -16463 -98057 -118654
16672 -118654 -115704 10025 80030 112052 70845 186164 162930 99264 52330 -74247 -89164
16661h9164l9237k9488M0099N6480p5429O3542J29220L1367r562L2599j39448
16650b9021q6568l6759q8982M0136K4666O1317J78730j13908j85496m0788L0630
16639b46043L477r090Q1491j20463M4023Q2725K0614o9051J19530R9869j9403
16628a2321r9463j12155J9938J44271M5647J3926j9885j03834m8779M815J87070
16617A9230J19885j32201m89l8134j1417r374K0304o7473K011J11042P8598l2308
16605E9674K7119P9736r46q9951R377q7309j20474j7604J06151L0186n6642r40
16593f1623r757N5111N4755l2636j69617q3959m2498J10252J06284l0892q5197
16582a89777J6187Q729k4505m5722J15386l5850l1849j4825L8107Q2705J2031
$$ plain form
16661 -89164 -128401 -157889 -117790 -61310 -136739 -73197 56023 87390 77828 110427 -29021
16650 -29021 -115589 -152348 -241330 -201194 -176528 -115211 63519 -50389 -235885 -276673 -246043
16639 -246043 -242566 -251656 -170165 -290628 -246605 -163880 -143266 -212317 -92787 7082 -12321
16628 -12321 -111784 -223939 -204001 -59730 -14083 -157 -20042 -123876 -172655 -167840 19230
16617 19230 139115 6914 6425 -31709 -43126 -52500 -32196 -99669 -97658 13384 91982 59674
16605 59674 86793 166529 165583 75632 85009 -2300 -122774 -140378 -34227 -4041 -60683 -61623
16593 -61623 -71380 -16269 38486 5850 -163767 -247726 -290224 -179972 -73688 -104580 -189777
16582 -189777 -173590 -164861 -189366 -235088 -119702 -155552 -187401 -202226 -164119 -81414 -69383
16571f9383K1339N7332J4230P0114j5608Q884j10314J2809R1156O7607r213q7407
16559E1546j40839j51093j12748K7544J45339R0975j7712P1838r9957r719R2496
16548e2330K3510j5658J16630n7407j35498j6200J8975N7485j1202q7415m1931
16537b01041M095k7549J20426K6407p8748m6587k8977M1911M4981O3614n8536
16526a40004j23871J4510M6111J19907R9489K0313l9088Q173P9603j99N9545N3244
16514A97733l6049q8465N0570q9321r3602N321J7714P944j9477K4824p4898n8412
16502a56118n5075L5115q7802N3617j4657J21133P8122J08553k7109J7443n6420
16491A6802o9449o8757k1058J59431J40408r8492j11358k6240L7307J26841j982
$$ plain form
16571 -69383 -48044 9288 23518 93632 78024 86908 -23406 -10597 80559 148166 138953 51546
16559 51546 -89293 -240386 -353134 -325590 -180251 -89276 -106988 -35150 -135107 -144826 -52330
16548 -52330 -28820 -44478 72152 14745 -120753 -136953 -117978 -60493 -71695 -159110 -201041
16537 -201041 -196946 -224495 -104069 -77662 -156410 -202997 -231974 -190063 -145082 -81468 -140004
16526 -140004 -263875 -249365 -203254 -83347 16142 36455 -2633 5540 85143 84944 144489 197733
16514 197733 161684 73219 123789 34468 -59134 -53813 -36099 -28155 -47632 -22808 -97706 -156118
16502 -156118 -211193 -176078 -263880 -210263 -224920 -103787 -25665 82888 55779 73222 16802
16491 16802 -52647 -121404 -142462 16969 157377 58885 -52473 -78713 -41406 85435 83453
16480H3453j9742M273r2673m1259N1576m2590j44248K3266q0645M4560J00086
16469a13943n2062K5435M6964M8086j58883p6382M5926M7714P9579Q3405j8575
16458d2736o8153K4099K1455n5338J51875j28204j05492j00374q712R1394Q6426
16447a33760N4928j9447l5090L7879J3941Q2280M3320P639o0125o3489M8699N0768
16435B7543K0616q8632l6452O09m5955p7412k947N8840J76522R0021p723p071
16423A07959n5616m1329n375P3620q9771q7618O6708J7609J9008l6261n4122J38616
16411E3428M0641j2424M0506m83o8337o9183J4773P4959r7094n4522K6759O4132
16399A3155L2114p4447j31507J66885K1162L8818P6686n2723l6893M6006q9086
$$ plain form
16480 83453 63711 67984 -24689 -65948 -14372 -56962 -201210 -177944 -258589 -214029 -113943
16469 -113943 -166005 -140570 -93606 -45520 -204403 -280785 -234859 -187145 -107566 -24161 -42736
16458 -42736 -110889 -86790 -65335 -120673 31202 -97002 -202494 -302868 -311580 -220186 -133760
16447 -133760 -78832 -98279 -133369 -95490 -81549 731 44051 51690 -8435 -71924 -23225 27543
16435 27543 48159 -40473 -76925 -76316 -122271 -199683 -202630 -143790 32732 122753 115030 107959
16423 107959 52343 11014 5639 79259 -10512 -98130 -31422 -13813 5195 -31066 -85188 53428
16411 53428 94069 81645 122151 121668 53331 -15852 -1079 73880 -23214 -77736 -50977 13155
16399 13155 45269 -29178 -160685 6200 27362 66180 142866 90143 53250 99256 10170
16388A0170O420p8095r3305M4485J7051Q372K7683l4071m662n8329K8008N9516
16376f6757M4178o1108K5544K9040J566j3513q495m7396m7622n8560L4006m4155
16364b13272J9070k1416n3799O056J25819Q2963N0059M6092l5149j63318J5981
16353a40914m7203J2560J26186J39149l6454J345N4052j5980j7733J3214k0759
16342F7463Q3420j30454j18180j46971q9814J37675K11916r789j88310q1240j11666
16331c75950J01595N6255J6070m9243Q8781J28079k0838j07140l5983J34089K1235
16320d3050n987n6910K9238m9727j35486R3905R9584R0997m5221j13586J0668
16309a25575J05494Q8239k3484p2178q3522l5522N164O0510L579m6604R5628k1171
$$ plain form
16388 10170 16590 -61505 -154810 -110325 -93274 -84902 -57219 -91290 -95952 -154281 -126273 -66757
16376 -66757 -22579 -83687 -58143 -29103 -27537 -41050 -49545 -96941 -144563 -203123 -169117 -213272
16364 -213272 -194202 -215618 -269417 -263361 -137542 -54579 -4520 41572 6423 -156895 -140914
16353 -140914 -188117 -175557 -49371 89778 53324 54669 108721 92741 75008 88222 67463
16342 67463 150883 20429 -97751 -244722 -334536 -196861 15055 5266 -183044 -264284 -375950
16331 -375950 -274355 -218100 -202030 -251273 -162492 -34413 -55251 -162391 -198374 -64285 -43050
16320 -43050 -49037 -105947 -76709 -126436 -261922 -168017 -68433 22564 -22657 -136243 -125575
16309 -125575 -20081 68158 44674 -27504 -111026 -146548 -141384 -80874 -77295 -123899 -28271 -49442
16297d9442j00201j27256M390M7581j0553J27216J72631M3k6268J78359j56372
16286F0128j85307K459N0650p363m7055o9095m3764j9698Q6661r3198L8937K02351
16274b4294J32616m8855l6742j41718j09816j5378K9094j526L9088J18562J27823
16263F8854p61M9661o1360j32106Q8347J9713j27211l2376o4947m2559J03689
16252a31056J5231J03463J00603R040n9935L0973j02855k5780r8869m0905j8760
16241b18850K7054K28741P6169L5435k8331p4121L8302l561m0283N1544m6284
16230D5815j28959p7354r0052J20703N8010N4281r7177j18642M2852J13995l3549
16219a10077o178N5134Q895l2082l3986m1250J04720J59950m8466o2005q4918
$$ plain form
16297 -49442 -149643 -276899 -272509 -224928 -235481 -108265 64366 64409 38141 216500 60128
16286 60128 -125179 -122720 -72070 -79433 -126488 -195583 -239347 -259045 -172384 -265582 -226645 -24294
16274 -24294 108322 59467 22725 -118993 -228809 -244187 -215093 -216619 -177531 -58969 68854
16263 68854 68093 117754 56394 -75712 12635 32348 -94863 -127239 -192186 -234745 -131056
16252 -131056 -115825 -12362 88241 97281 37346 68319 -34536 -60316 -159185 -200090 -218850
16241 -218850 -191796 36945 113114 148549 120218 46097 84399 80838 40555 92099 45815
16230 45815 -83144 -160498 -250550 -129847 -71837 -17556 -114733 -233375 -190523 -76528 -110077
16219 -110077 -116255 -61121 -52226 -84308 -118294 -159544 -54824 105126 56660 -5345 -90263
16208i0263r9301K7777N0489N5608l0350o3966J00700L9409j73113k7287J23505
16197h6792m183N771J06423k4263r3467M0945j0359K7349P4032N2684j71153K5226
16185e7787J56228O01p7328Q5719l8565r5072R3068J6864q5739o3907K5010N0541
16173I633m166j1549N4947N343o6584q08n6741O6101K918K1610o5697o4402l3455
16160a42850O5673K2327n8059m9888p6511J25010Q3238O7489L9068o8670k5029
16149a8202q3094K8563L3708n1043P0299k1408r9944m1178P2702Q6127J20403
16138I6933J2697k1858j9001o3423j58431p9593J20460J84273Q9272p6215j08867
16127b3753q0495j06310k2212Q0381N5688N4432r656J30885k7456n8436m0748
$$ plain form
16208 -90263 -189564 -161787 -111298 -55690 -86040 -150006 -49306 -9897 -183010 -210297 -86792
16197 -86792 -90975 -85204 21219 -3044 -96511 -55566 -65925 -38576 35456 88140 -83013 -57787
16185 -57787 98441 99042 21714 107433 68868 -26204 66864 83728 -2011 -65918 -40908 9633
16173 9633 5467 -6082 48865 54208 -12376 -13184 -69925 -3824 -906 20704 -44993 -109395 -142850
16160 -142850 -77177 -54850 -112909 -162797 -239308 -114298 -31060 36429 75497 6827 -18202
16149 -18202 -101296 -72733 -39025 -90068 -19769 -41177 -141121 -182299 -109597 -23470 96933
16138 96933 109630 87772 68771 5348 -153083 -232676 -112216 72057 161329 85114 -23753
16127 -23753 -104248 -210558 -232770 -152389 -96701 -42269 -51925 78960 51504 -6932 -47680
16116d7680j16977K7735J68660n6745k5120Q3558q080P3408O7990M7314r0468
16105A23595j71183p3167O6568J26396m1234j34436J9997O5427r5151l179J07430
16094h937o1140o993k0016n4627k3407L4271N7172j03360L0739J129O6268J7005
16082g1896j4055Q8662K0781K9499o3764M489l7255K1233J24636M3648j6002j29370
16070F06l2642n5841r873j3101K6824m3934j38900J06415J10521m4500m1672Q2020
16058e4077L3159r0046m913k5889J21515J13026J4431j94050n7662Q5302J09823
16047E0619o2390J106l3775l7000k6291r0273l5380K3298k0375j4645Q3932J13550
16035d7624J07415L2135j04649m1348J7051n2454n9611l4457M2895o2757K602
$$ plain form
16116 -47680 -164657 -136922 31738 -25007 -50127 33431 25351 98759 166749 214063 123595
16105 123595 -47588 -120755 -54187 72209 30975 -103461 -83464 -18037 -113188 -116367 -8937
16094 -8937 -70077 -77070 -97086 -151713 -175120 -140849 -83677 -187037 -156298 -155169 -88901 -71896
16082 -71896 -85951 2711 23492 52991 -10773 -6284 -43539 -22306 102330 145978 129976 606
16070 606 -32036 -87877 -97750 -110851 -84027 -127961 -266861 -160446 -49925 -94425 -136097 -54077
16058 -54077 -20918 -110964 -115877 -141766 -20251 92775 107206 -86844 -144506 -59204 50619
16047 50619 -11771 -10665 -44440 -81440 -107731 -198004 -233384 -210086 -230461 -245106 -161174 -47624
16035 -47624 59791 91926 -12723 -54071 -37020 -89474 -149085 -183542 -140647 -203404 -200802
16024b00802R4257R6026Q2988J20595Q1635j11957j59672k4O6499P5552L3049
16013A78146j04721k7655j06083J3817j3301n6998N8110J3363n3035J38265q2071
16002d2163r4157r563l7542q3185J2422J57505J21053m3353j17670N1977J66085
15991H1409N8861j57420r6429N5269O8164j7751k472l2939m7782o5032Q228p2703
15979b20597O8506N1786N9583Q4660J28718O366n7142j56P884q0652j53987o5864
15967a70895K938j1064K8582M8918l1984q386n8748Q164R0008K1454l4646O2432
15955e3227m4738O8765K8211L6035O4859j248p3961j14517O3011P9838L5625J5201
15943A03854O9803n0366n3083l5512J935l611j36356J9839J79114l3982P0988
$$ plain form
16024 -200802 -106545 -10519 72469 193064 274699 162742 3070 3046 69545 145097 178146
16013 178146 73425 45770 -60313 -46496 -59797 -116795 -58685 -45322 -98357 39908 -42163
16002 -42163 -136320 -145883 -183425 -266610 -254188 -96683 24370 -18983 -136653 -84676 81409
15991 81409 140270 -17150 -113579 -58310 9854 -7897 -10369 -43308 -91090 -156122 -147894 -220597
15979 -220597 -152091 -100305 -40722 43938 172656 179022 121880 121724 129608 48956 -105031 -170895
15967 -170895 -167957 -179021 -150439 -101521 -133505 -141891 -200639 -192475 -102467 -81013 -115659 -53227
15955 -53227 -97965 -29200 -989 35046 99905 98657 24696 -89821 -26810 53028 88653 103854
15943 103854 173657 123291 70208 34696 36631 33020 -103336 -83497 95617 61635 132623
15932A32623P8160m7182l6332j00262o9879N2692n6032o088K6020n008K8421j4164
15920a7031J50727P2752J16131k7770j10573m0717j47746o9634K484K8513K0565
15909b2299M5097J9398R097j2148L5687N829n3030N814j5345n7283j91777q4010
15897c14970J74379L9594k6771M4006L2144L6503l0210j1900j27948j06314n2926
15886c44413M4892N7342K41470J7801n1698j24475l6263R292J09633N1103J23557
15875I8241m7519j00103m8518P9646p157k3320J15836O3748K2044m1749j31997
15864b0848O8826O5642R2152k2267j14460r307O0951K7746O366o9070m128J6570
15852I8173J2922L5064p3473m8058k9414m5416M91j6526j4817L4726M8290N001
$$ plain form
15932 132623 210783 163601 127269 27007 -42872 9820 -46212 -52300 -26280 -31288 -2867 -17031
15920 -17031 133696 206448 322579 294809 184236 143519 -4227 -73861 -71377 -42864 -22299
15909 -22299 22798 42196 51293 39145 74832 80661 27631 33445 18100 -39183 -230960 -314970
15897 -314970 -140591 -100997 -127768 -83762 -51618 -15115 -45325 -57225 -185173 -291487 -344413
15886 -344413 -299521 -242179 -709 17092 -34606 -159081 -195344 -186052 -76419 -25316 98241
15875 98241 50722 -49381 -97899 -18253 -25410 -48730 67106 130854 152898 111149 -20848
15864 -20848 47978 113620 205772 183505 69045 59738 120689 148435 154801 85731 81603 98173
15852 98173 111095 146159 72686 24628 -4786 -50202 -49711 -66237 -81054 -46328 1962 6963
15840F963n9697M5106j4757r4375J8364p7257L874Q3025O3380P9881p2032k3361
15828d0886L9117l158q5791M7029K3510M1890o1509R6945R480l7319k0878R2577
15816A01007l7074N9834j09401m2799N948M0146j5017K8013P1244N465J9212J0476
15804A37054j01482K4651K7328m7841r1948j5141J1869N8345j09102l3310P7193
15793f2384J16548N5261R4132j40688j47052J7438N7355J8204M4213J879K9972
15782H4878j01969K3567r8262J3161R5185L4357J25482J48077j18145o1829n1954
15771I2548j45267q2601j0457o8788l6885M1590m0001M4986K78849Q5531j03577
15760E5928k503O1496j1450m3224p9255k4070J4963o9479q956P8524k1720j55212
$$ plain form
15840 6963 -52734 -7628 -22385 -116760 -98396 -175653 -171779 -88754 -25374 54507 -17525 -40886
15828 -40886 -1769 -4927 -90718 -43689 -20179 21711 -39798 57147 66627 29308 8430 101007
15816 101007 63933 123767 14366 -28433 -22485 17661 2644 30657 101901 107366 126578 137054
15804 137054 35572 60223 87551 39710 -52238 -67379 -55510 2835 -106267 -139577 -62384
15793 -62384 54164 109425 203557 62869 -84183 -66745 -9390 8814 53027 54906 84878
15782 84878 -17091 6476 -91786 -78625 16560 50917 176399 324476 206331 144502 92548
15771 92548 -52719 -135320 -145777 -214565 -251450 -209860 -249861 -204875 73974 159505 55928
15760 55928 53425 114921 103471 60247 -19008 -43078 -28115 -97594 -106550 -28026 -49746 -204958
15748b04958k0690M4914N515p305K6422q0790O0614K611R1682J00339q2796j75607
15736b40049M4544P5716L8670P5865K8475N5823O7538j3275m879m7954o6614n0511
15724c6651m9786J9285J03544J56983K9083j91731n0427M5501M3906n3104M1097
15713E7700j24075K3320p8046o4885O2809Q6184j7504l6433M777j7396M7813M7463
15701h273m0028r5962N3041J33758j9408l9481O9463p2709m2082l1414q8045J25428
15689e5712J06430K7478j1802m0188j50946l3765L2224j6617Q0510J17176K4136
15678G8924Q2482J31944n8439j9147L1127j67684r2188j46197j21205N6041P5086
15667a49256K436R2677p2390R039j6724r234M5533P553q0317l9963J11715J86004
$$ plain form
15748 -204958 -225648 -180734 -175219 -182524 -156102 -236892 -176278 -173667 -81985 18354 -64442 -240049
15736 -240049 -195505 -119789 -81119 -5254 23221 79044 146582 133307 128428 80474 13860 -36651
15724 -36651 -86437 -67152 36392 193375 222458 30727 -19700 25801 69707 16603 57700
15713 57700 -66375 -43055 -121101 -185986 -123177 -36993 -54497 -90930 -86153 -103549 -55736 -8273
15701 -8273 -48301 -144263 -91222 42536 23128 -16353 53110 -19599 -61681 -93095 -181140 -55712
15689 -55712 50718 78196 66394 26206 -124740 -158505 -126281 -142898 -62388 54788 78924
15678 78924 161406 293350 234911 215764 246891 79207 -12981 -159178 -280383 -224342 -149256
15667 -149256 -146820 -54143 -126533 -117494 -134218 -143452 -97919 -90366 -170683 -210646 -98931 87073
15655H7073q9812P0632K2623o1702j10534m824M5752J04392Q5288J7923q5838
15644H0973J2313K5021q7668l1776j06239m4739P0114j4314k0759R3464N1813
15633B8203l1500m7935m6033j4255L0595q9807J1938J67399O2434n5527m0362
15622b4850K2263j9761R0962Q5828R5721O1833n4391q1606m5685o5884j85K4513
15610H8758k8515n1588m4110j657J1610p2987q9973Q9411K18095p6487n094L2699
15598G0162J5814r054o8623Q5771K7184k2146k5667m8423l2315l1076J02890n3675
15586A0842j12653K297K03545M149j14769N1625j306K9882R856k869J08136j3610
15574A75125m9028n64o0740o6434j73780p4129Q5456R7117P8249J7090N0023K11159
$$ plain form
15655 87073 -2739 67893 90516 28814 -81720 -86544 -40792 63600 148888 166811 80973
15644 80973 93286 118307 30639 -1137 -107376 -152115 -82001 -96315 -117074 -23610 28203
15633 28203 -3297 -51232 -97265 -111520 -80925 -170732 -158794 8605 71039 15512 -24850
15622 -24850 -2587 -22348 68614 154442 250163 311996 257605 175999 130314 64430 64245 88758
15610 88758 60243 8655 -35455 -37112 -25502 -98489 -188462 -99051 119044 42557 37463 70162
15598 70162 85976 76922 8299 94070 121254 99108 73441 25018 -7297 -38373 64517 10842
15586 10842 -101811 -99514 104031 108180 -6589 45036 43730 73612 83468 80599 188735 175125
15574 175125 126097 125533 64793 -1641 -175421 -249550 -164094 -66977 11272 28362 78385 289544
15562B89544J4646p9316L8466n0904j67142l6798l3606j7052J13676N4768P247
15551A33529m0422o5294k477J7565n2391J3136J8674k0603j10988K2785J33142
15540D6656K6312J0896n3657Q8370p2604o8857k9905q5148M2678J7319o7438q642
15528a54020O2734L7181R38N2513J3600l8689j63222K9716M4257j3689l4567J15591
15516d7657J07884J3816j00725L3346n1768N4091Q2705p0574o8088Q9765K4814
15505F7609j16742l1816R7471J07343Q052p6231m9526N6759k7341P7509J3300
15494A26387j1237N938m3764m140N1422p9571j19450k05701Q418K4715J47672
15483i9311J20878L6734n7162n253L0075q6589o4237l8211J3391J3552r1377J78730
$$ plain form
15562 289544 304190 224874 263340 212436 45294 8496 -25110 -42162 71514 126282 133529
15551 133529 93107 27813 25336 42901 -9490 3646 22320 1717 -109271 -86486 46656
15540 46656 72968 83864 30207 118577 45973 -22884 -52789 -137937 -95259 -77940 -145378 -154020
15528 -154020 -91286 -54105 -53167 -654 12946 -25743 -188965 -159249 -114992 -128681 -163248 -47657
15516 -47657 60227 74043 -26682 6664 -45104 8987 91692 21118 -46970 42795 67609
15505 67609 -49133 -80949 16522 123865 131917 55686 6160 62919 35578 113087 126387
15494 126387 115150 121088 77324 73184 124606 45035 -74415 -280116 -271698 -246983 -99311
15483 -99311 21567 58301 1139 -4114 25961 -60628 -124865 -163076 -149685 -136133 -227510 -48780
15471d8780N4059j1671O5103m1773k5001l1777L6089Q3921N823p399J8565p4488
15459B2671J2312R6929l2043j31692j31486J0125k7199o5549K9289R3633R6586
15448b6424J57557P4086k4330j23614l0431p6211p6645m036m7518o9997R0303
15437a57260k5387j1328N4274R6533J06586p418m1805M7093L2857O8672O8978
15426B31795j44139j56642K9870N6954J43111J02798j2066l5742J0884k8026j04416
15415I4381j01293l651l0809q677q0512P4619n8709n9172K8924N7484J0185M8114
15403b9116k0567j2372N904r870j7543M8179m488n6085O1483L2571q2347q237
15391i2488O6967O4369m8434l3110L8548N4627k0544p0935Q699Q114J83389L0301
$$ plain form
15471 -48780 5279 -6392 58711 16938 -8063 -39840 -3751 80170 85993 78594 97159 22671
15459 22671 34983 131912 99869 -31823 -163309 -153184 -180383 -245932 -216643 -123010 -26424
15448 -26424 131133 205219 180889 57275 26844 -49367 -126012 -130048 -177566 -247563 -157260
15437 -157260 -182647 -193975 -139701 -43168 63418 56000 14195 61288 94145 162817 231795
15426 231795 87656 -68986 -39116 17838 160949 263747 251681 215939 226823 198797 94381
15415 94381 -6912 -10563 -41372 -50049 -130561 -55942 -114651 -173823 -144899 -87415 -77230 -29116
15403 -29116 -49683 -62055 -56151 -66021 -83564 -35385 -39873 -95958 -34475 -1904 -84251 -92488
15391 -92488 -25521 38848 -9586 -42696 -4148 50479 29935 -41000 -32301 -24187 159202 189503
15379A89503o2303l4896R2453p5586p5436O5774r7779m5169J48578O273j15704
15368d292o5874q9000n5607N7173J25469p3683Q395R1207Q575q9029r206J81824
15356H5952J1362o8915K6887l5933m4020J17251J35512j20910l3965M0403k7985
15345H5639J9478M4148q1378m9650q5320Q0842J5258K2271n2013L3420J66017
15334A98712j4169l7973j56530L8148r7719N5684K52712o9310k0868Q537r9780
15323E7444n4790j13754j3654M7319q5319N6814m3582j0585P4697j6556K7682
15312g4284j5109R2839P6837k5205M1P3501k7536K7244m2337N4429j12973O5060
15300I2507k0964o352K7109L4169R7896J1228j07993j64691j938n9448j91570
$$ plain form
15379 189503 127200 92304 184757 109171 33735 99509 1730 -43439 105139 111412 -4292
15368 -4292 -70166 -159166 -214773 -157600 -32131 -105814 -97419 -6212 2363 -86666 -95872 85952
15356 85952 97314 28399 55286 19353 -24667 92584 228096 107186 73221 113624 85639
15345 85639 105117 149265 67887 18237 -67083 13759 29017 51288 -725 32695 198712
15334 198712 184543 146570 -9960 28188 -69531 -13847 238865 169555 148687 157224 57444
15323 57444 2654 -111100 -124754 -77435 -162754 -105940 -149522 -160107 -85410 -101966 -74284
15312 -74284 -89393 3446 80283 55078 55119 128620 101084 128328 85991 140420 27447 92507
15300 92507 71543 65191 92300 126469 224365 235593 127600 -37091 -39029 -98477 -290047
15289b90047L5631J96071L0885J9609j01208M2660M3011O2359n853J5683N3092
15278A01893R4236r2577j81378l0436M6225N3281N8161j5651k2804O1655M8841
15267A21446k5028j3517J1628K9965k3967o4589j72080n8473K01906p1822o1232
15256a25763M8247J02555k2545j5886O8606L4607o902q4917l8748O960M204P241
15244b2341L5130N8583j4689R663p1937K1738L0413m7653k1446N0725O871m01
15232C4656j3365o9997n7737K5237M0020N6940j22116j9222J65335P3989n6594
15221E7146R803k0965J09599p401j51962j3967O0957J0901r0208k0981N7930l2811
15209c1959r4766J25408j4235p1125J0951p2824N5196J38644j4741j06650j8596
$$ plain form
15289 -290047 -254416 -58345 -27460 -7851 -109059 -66399 -23388 38971 33118 48801 101893
15278 101893 196129 103552 -77826 -108262 -62037 -8756 49405 33754 10950 72605 121446
15267 121446 96418 82901 94529 124494 100527 35938 -136142 -194615 7291 -64531 -125763
15256 -125763 -77516 25039 2494 -13392 55214 89821 82919 -1998 -40746 -33786 -29582 -22341
15244 -22341 12789 71372 56683 66346 -5591 16147 46560 -1093 -22539 28186 35057 34656
15232 34656 21291 -48706 -106443 -81206 -41186 15754 -106362 -125584 39751 113740 57146
15221 57146 66949 45984 155583 148182 -3780 -17747 43210 54111 -36097 -57078 852 -31959
15209 -31959 -126725 -1317 -15552 -86677 -75726 -148550 -93354 45290 30549 -76101 -94697
15198i4697P6397K725M2265k1382n9074j44190j60791O0107J24297O4719m3745
15187a53369j71646J4062M9515J55516J12116j647q5033j15334N014M0460P1069
15176g9277p6329j2835l1570M5775R6664P2277k2881o5139k53J08737J0924r0704
15164d4611K4599O3255L048L1195J572P3515j6146q2201K4315n4267j41245L6847
15152h0124O3708P7083N2183k592j6216n7738P9680m3796j13532j24316j1645
15141a77305P593N3218N6258J3136J22121j25250m1125M7849R7624J2591j76556
15130a09846n2379P1375J7327q6057P1763K0830K2655P7729j3378P9284P7692
15119A76995J12915r141p3739N5445K595j62877j22947J52547R3159q3603k11530
$$ plain form
15198 -94697 -18300 -15575 26690 5308 -53766 -197956 -358747 -298640 -174343 -109624 -153369
15187 -153369 -325015 -310953 -261438 -105922 6194 4547 -80486 -195820 -190806 -150346 -79277
15176 -79277 -155606 -168441 -200011 -154236 -57572 14705 -8176 -73315 -73568 35169 46093 -44611
15164 -44611 -20012 43243 46291 77486 79058 152573 136427 54226 78541 24274 -116971 -80124
15152 -80124 -16416 60667 112850 110258 94042 36304 115984 72188 -41344 -165660 -177305
15141 -177305 -169712 -116494 -60236 -47100 75021 -50229 -91354 -43505 54119 66710 -109846
15130 -109846 -162225 -90850 -73523 -159580 -87817 -66987 -44332 33397 20019 99303 176995
15119 176995 289910 280769 207030 262475 265070 102193 -20754 131793 224952 141349 -70181
15108g0181o9167M5445K2966k2418L02728J26134r5345n7614J8003o0897q0417
15097E9237j17545l2789O6036J6663R9533o3115p8173j03693N7911j4099l6723
15086a46757m3841j6229P2691J65983L3318q4926r6576r6674Q78J4101J54489
15075d3543K4218J5729J7572o706Q1985Q8993q6107j29844J09334K3507m7125
15064D8013r3272K6461m358j3732j14660K1778M0528O4361J60583M3194n05r461
15052A68930j920q2713l0358L5377P7496j0544j06909p3052k8909J35736L3520
15041A16654o5393k4062j2969j024k1598L1833O7807J8941p1712k6316M7521j50949
15029i1267l0852P8072K3528J00051J5700p4244k9855k1704P1351j6764p4307
$$ plain form
15108 -70181 -139348 -93903 -70937 -93355 209373 335507 240162 182548 200551 139654 59237
15097 59237 -58308 -91097 -25061 -8398 91135 28020 -50153 -153846 -95935 -110034 -146757
15086 -146757 -190598 -206827 -134136 31847 65165 -19761 -116337 -213011 -212133 -198032 -43543
15075 -43543 -19325 -3596 13976 7270 89255 178248 92141 -37703 71631 95138 48013
15064 48013 -45259 -18798 -23156 -36888 -151548 -129770 -89242 -24881 135702 178896 178391 168930
15052 168930 167010 84297 53939 89316 166812 156268 49359 -23693 -52602 83134 116654
15041 116654 51261 27199 14230 13206 -8392 23441 91248 110189 38477 12161 59682 -91267
15029 -91267 -122119 -44047 -20519 79532 95232 20988 -8867 -30571 40780 24016 -50291
15018e0291R4251j4838O8697M2042m2087k7861k0339J625L0678K6177J13223p5554
15006A45723j08383p1893k3982K4846L3104P3701L4923l3022p1330m827m8916
14995e0056J10529L7225r3897N2110M9797Q6500Q1561j06397j00854r9960r0073
14984a23515J22070J26158j6201r5561L5178J07930q9636l3819j10685J2627Q7018
14973B1564M6409K2700p4033m0854j59650O1464J27419Q5347Q2199j22330j1295
14962C8940N9200J78176M6744o6324j41819j48857j09998k4533L3884J40255P4583
14951H0251J08654k6954j59485M9654P6675j01345m7031N0367m6868J12299j5887
14940H0330K4641l2752j00971j121N304K1708P4015p3348o5892o6114J7695q232
$$ plain form
15018 -50291 43960 29122 97819 139861 97774 69913 49574 51199 81877 108054 221277 145723
15006 145723 37340 -34553 -58535 -33689 -585 73116 108039 75017 3687 -1140 -50056
14995 -50056 60473 97698 3801 55911 105708 192208 273769 167372 66518 -33442 -123515
14984 -123515 -1445 124713 108512 12951 48129 156059 66423 32604 -78081 -65454 21564
14973 21564 67973 90673 16640 -24214 -183864 -122400 5019 90366 172565 50235 38940
14962 38940 98140 276316 323060 256736 114917 -33940 -143938 -168471 -134587 5668 80251
14951 80251 188905 161951 2466 52120 128795 27450 -19581 30786 -16082 96217 80330
14940 80330 104971 72219 -28752 -29873 -24569 -2861 71154 -2194 -68086 -134200 -116505 -124737
14928a24737M1453J37997L8392k58158j60265J05333K08544L2469R798J28058
14918A58884o1720o9333q0264P89J2812k4389j1980j9454l469O4402M1187M32
14906G897L1304m1045J3501j4553j22377L4395O2087M8897j2345N7063Q2885K5678
14894A73387r0475n0297k0280K8719r7247N5901m7785j43831l1504N6597M5707
14883a21108Q6540m035l9277N739L2089k9168k1107P4294N0960m017K6664o2083
14871d509j09688l974M4072n7988M1710P6626N037Q013l8824p2857j8697Q3709
14859d7370M0607J4238J899o0298j4636k2909r4591L1698O2465N6901m3525l9500
14847a15021p1059K8568P2987N4237Q6373R5220O063K191q1736L4495l8906k4888
$$ plain form
14928 -124737 -83284 54713 93105 -165053 -325318 -219985 -11441 21028 30826 158884
14918 158884 97164 27831 -52433 -51644 -38832 -63221 -75201 -94655 -98124 -33722 7465 7897
14906 7897 39201 -1844 11657 -2896 -125273 -90878 -28791 20106 7761 64824 147709 173387
14894 173387 82912 32615 12335 41054 -56193 -292 -48077 -191908 -223412 -166815 -121108
14883 -121108 -34568 -38603 -77880 -72141 -40052 -69220 -90327 -16033 34927 30910 57574 -4509
14871 -4509 -114197 -118171 -74099 -132087 -90377 -13751 -8714 -701 -39525 -112382 -131079 -47370
14859 -47370 -6763 7475 9374 -50924 -65560 -88469 -183060 -151362 -88897 -31996 -75521 -115021
14847 -115021 -186080 -157512 -84525 -30288 56085 151305 157368 159559 77823 112318 73412 48524
14835D8524q767k5232L3440J0740l432k3991n6419K2323J3243L528K7506J2576
14823E4039j06356N4186J0370j005q1980L8284N2137L4408n6223j41121O2992
14812h0269J23312N1929J08076L0182m7320j26721r6991m020r6123k7736O642
14801a59039O2919J80303J17156j09921j65725k6234k6377j6107J24472J53920
14791A35367o0375j17758m4429L9967O4590Q1844o2304n6967n2646q115m8334
14780a29160n1109k1137q5549J14613J51932J58120j5216J5539k2403j39197j39986
14769a63553m1367L9671J26177J13944J22838p1135p7317o6488O3836J3695L821
14758F4122l2998q0516n5740p3416l4430Q2647j04291M9770P0108O3384j8754
$$ plain form
14835 48524 39757 14525 47965 58705 55273 31282 -25137 -2814 10429 13957 41463 54039
14823 54039 -52317 1869 12239 11234 -70746 -32462 19675 54083 -2140 -143261 -80269
14812 -80269 43043 94972 203048 233230 185910 59189 -37802 -41822 -137945 -165681 -159039
14801 -159039 -96120 84183 201339 91418 -74307 -100541 -126918 -143025 -18553 135367
14791 135367 74992 -42766 -87195 -47228 17362 99206 36902 -20065 -72711 -80826 -129160
14780 -129160 -180269 -201406 -286955 -172342 -20410 137710 122494 138033 115630 -23567 -163553
14769 -163553 -204920 -165249 -39072 74872 197710 126575 49258 -17230 46606 60301 64122
14758 64122 31124 -49392 -105132 -178548 -212978 -130331 -234622 -184852 -114744 -51360 -70114
14747g0114Q6854R3285j01022n312m7474J4984J3059J11048n4161j64689N58Q4904
14735c8080K9038j7509M2104P1431j5868O1224J1614j40097P5227M641j2958q0127
14723i360K2138N8614j1227K4410k5764K029R267p9065R0928J62408L8580n6514
14711B26444r2101L2995k6579o0344p0469K1686Q3624N6991p9101O9511o4650
14700I8007m9502Q127p0106l8468J3527k5316K7363j0327j5357J18012J0401J9860
14688H6221j17675o287M4239K6433j21867k1710l3878p8518K8422K5111O759j7570
14676a80320J35445K6562Q7977l3869l7779J39066k488q1397L8266Q1229J6763
14665A89455j20440n0009J4068m671m2224r080K5367J2803k0039j19535O9937
$$ plain form
14747 -70114 16740 110025 9003 3691 -43783 -28799 -15740 95308 41147 -123542 -122984 -38080
14735 -38080 -9042 -26551 15553 86984 71116 132340 143954 3857 79084 83725 70767 -9360
14723 -9360 12778 71392 60165 84575 58811 60840 70107 -8958 81970 244378 282958 226444
14711 226444 134343 167338 140759 80415 9946 31632 115256 172247 93146 162657 98007
14700 98007 48505 56632 -13474 -51942 -38415 -63731 -36368 -46695 -62052 55960 66361 86221
14688 86221 -31454 -37741 6498 32931 -88936 -110646 -144524 -223042 -194620 -169509 -162750 -180320
14676 -180320 -44875 -18313 69664 35795 -1984 137082 134594 53197 91463 172692 189455
14665 189455 69015 19006 33074 28403 -13821 -22901 2466 15269 -4770 -124305 -54368
14654e4368P8581j4467O0915M3214j29175K6473P4322P3997O7522J1954n5243
14643A83725k5993J2866J9904m926r133p9382j08503K34J6175Q3338k7047j00056
14631c8798N5942K5890l7090m4586J15168K7412m1866K9449o2339M878O9933j84433
14619h0440r3705L3254l6912K3310N0915J04037o9792j3379N6101J20700P9328
14608A73417n0507j2656N1844j1663K2997l2681j18155j10751q7675J39539k066
14597c8357p0715J62799j8412j6366O4529R2933q7536p9658N4212J2943q913m8157
14585A9302j95886K1509J37863J97275R6117q0255q3326j64703r3111j3438l6705
14574a95358N1167J54776O1180J01931M9961J8679j60931p0768J33210O270n1119
$$ plain form
14654 -54368 24213 9746 70661 113875 -15300 11173 85495 159492 227014 238968 183725
14643 183725 157732 170598 190502 185576 176443 97061 -11442 -11208 4967 88305 61258 -38798
14631 -38798 17144 43034 5944 -38642 76526 103938 62072 91521 29182 34060 103993 -80440
14619 -80440 -174145 -140891 -177803 -154493 -103578 459 -69333 -82712 -26611 94089 173417
14608 173417 122910 110254 162098 150435 173432 140751 22596 -88155 -175830 -36291 -38357
14597 -38357 -109072 53727 35315 18949 83478 176411 88875 9217 63429 76372 67459 19302
14585 19302 -176584 -155075 -17212 180063 276180 195925 112599 -52104 -145215 -158653 -195358
14574 -195358 -144191 10585 71765 173696 223657 242336 81405 10637 143847 150117 98998
14563I8998M5515l1847R6952j2189j36071j11452O6664R4223j04619M466K928
14552A3568M837J3887R312m0469m5694K9444L3472r3196L875J1752n5743J40652
14540B5697N316L0643Q9226K9971J11433j18251l9453J00190j30592l7974Q0194
14529A46400j3674m7162K6660p6434J0549M8329k0477o6788K7320N6186P5042
14518A65951o3372q7790J15476R3621n4645j5973l6254k7265R0410l980j37663
14507C8516o5947q9143N1769J8340M10m7410n8781J42053M996k580n1270J04241
14495D5194Q9201Q392m409o0090Q6193J18041m9411o2666n3882L4148L311J80268
14483C34290j25389j14293k8513k1393k6638N9106J4347J11073P3919j70931r7277
$$ plain form
14563 98998 144513 112666 209618 197429 61358 -50094 16570 110793 6174 10640 13568
14552 13568 18405 32292 41604 1135 -44559 -15115 18357 -74839 -70964 -59212 -114955 25697
14540 25697 31013 61656 150882 180853 292286 174035 134582 234772 104180 66206 146400
14529 146400 132726 85564 112224 35790 46339 94668 74191 7403 34723 90909 165951
14518 165951 102579 14789 130265 223886 169241 153268 117014 89749 180159 176179 38516
14507 38516 -27431 -116574 -64805 -46465 -46055 -93465 -152246 -10193 -5197 -7777 -59047 45194
14495 45194 134395 142787 138378 78288 164481 282522 233111 170445 116563 150711 154022 334290
14483 334290 208901 94608 66095 44702 18064 77170 91517 202590 276509 105578 8301
14472H301m3434K403P2378P8299o0315j5808K6461n8466k6146k6584J4767N7042
14460B8898l4858j6280P7957r4815M1008J05017k6300k0264M1012m3578J76054
14449B33851K2490j82657k8179O7399N9063o476q1913j97341L7157J67897M1826
14438A33117o5684J6997p8564j26496J50269L3160m5576m5545J1658M4121L7921
14427F5378Q2890J57844k9000r3739n9288j33913l7777Q2985P0780j60277k6072
14416h0189r760M2064J448m7756O0338J14286K3037l6613k6281K4145J20704r7933
14404H7490l6943L0094j09951m422J23149K0356n3426k580J270r515j22936K8299
14392d9115N5637q0026l6601O5877l4067j00935R0755J32782R0977k0149L9639
$$ plain form
14472 8301 -35133 -32730 39648 117947 57632 41824 68285 9819 -16327 -42911 -28144 28898
14460 28898 -5960 -22240 55717 -39098 1910 106927 80627 60363 101375 57797 233851
14449 233851 256341 73684 45505 112904 171967 165491 83578 -113763 -76606 91291 133117
14438 133117 67433 84430 5866 -120630 29639 62799 17223 -28322 -16664 27457 65378
14427 65378 148268 306112 277112 183373 124085 -9828 -47605 35380 106160 -54117 -80189
14416 -80189 -89949 -47885 -46437 -94193 -33855 80431 103468 66855 40574 64719 185423 87490
14404 87490 50547 80641 -29310 -33732 89417 109773 56347 53767 55037 45522 -77414 -49115
14392 -49115 6522 -73504 -110105 -44228 -78295 -179230 -88475 44307 135284 115135 154774
14381A54774o650j83516j47828O5499J10746p6613k8269J60229L4399m0896k746
14370C9129p914p0735q190L6790M9903n7646q4662J16903J51578j2851l9914K541
14358A14932O847K6206K9648o4065j5554N9788l2801K7702q695o1567o1765J0263
14346C0939o7063J24864n180J03795J1991o2853M0701j19735m3033M2648j4716
14335D2358r6546j14469L6238O6180l4225K4752O4543Q1903j5224j22149r6833
14324a63472k9486l5825L1102J67713Q6800J23861p247j5912P9304K9800j2865
14313B53773l1018N2024j38215j6892J6773L277l7463m2768m8243j3657P3035
14302G0626m8385o9788M2435l8517K6204L9621K0931Q3227o691j22927l3878O0955
$$ plain form
14381 154774 148124 -35392 -183220 -117721 -6975 -83588 -111857 48372 82771 41875 39129
14370 39129 31215 -39520 -47710 -10920 38983 -18663 -103325 13578 165156 152305 112391 114932
14358 114932 121779 147985 177633 113568 98014 157802 125001 152703 144008 82441 20676 30939
14346 30939 -36124 88740 83560 187355 199346 136493 177194 57459 14426 57074 42358
14335 42358 -54188 -168657 -132419 -66239 -100464 -75712 -11169 70734 55510 -66639 -163472
14324 -163472 -192958 -228783 -197681 -29968 56832 180693 173446 157534 236838 266638 253773
14313 253773 222755 274779 136564 119672 136445 139722 102259 59491 11248 -2409 70626
14302 70626 22241 -47547 -5112 -43629 -17425 22196 43127 126354 119663 -3264 -37142 23813
14290B3813K4591N1462M8504n2515K4215J8151Q3395m5097j55500p6637K9628
14279b5990l358L1239J02011m9847N2598J1475R001n5797l3630n9895N2115N5537
14267H5459P4614N7289r1293n5165O6744P9791K2911O3374M6142q0072j51955
14256A17839r5930k9472o6340R3610K21728r2161K21J42467j4855j51335j55425
14245b9653l6421O2873J38943m2378k4920P8346L1724m7655m5732O4085J1627
14234A60839K2753M8049m6855o7740m2953N6330k3499j713j23439j891Q6314k1021
14222D5174n1801N0060L0138M3880K4187L6858P4601j1428j00448j17742J85838
14211B09317O3090O6611r6358j30187n6182r0748k5777L5804R1208R3050k9910
$$ plain form
14290 23813 48404 99866 148370 95855 120070 138221 221616 176519 21019 -55618 -25990
14279 -25990 -29348 1891 103902 54055 106653 118128 127129 71332 37702 -22193 29922 85459
14267 85459 160073 217362 126069 70904 137648 217439 240350 303724 349866 269794 117839
14256 117839 21909 -7563 -73903 19707 241435 149274 149495 291962 277107 125772 -29653
14245 -29653 -66074 -3201 135742 93364 68444 146790 178514 130859 85127 149212 160839
14234 160839 183592 231641 184786 117046 74093 130423 106924 105211 -18228 -20119 66195 45174
14222 45174 -6627 43433 73571 117451 141638 178496 253097 241669 141221 23479 209317
14211 209317 272407 339018 242660 112473 56291 -34457 -60234 -24430 66778 159828 129918
14200A29918j53847q8276R8670K05428L8443J28319J4804k6931j80871j26429
14190C9228n5797J7601M5952M5266j33667o8254l0379J60926J10207j18433M0044
14179E2694N2985k2902m3056Q2210l9569m3953J51803k4407j36993p0232J17681
14168G6261J7865L7558r743N4327M600p2122L1051Q5681l4336j13053o1422M2865
14156E9532J07164j0986P752o0762L9003l3392J53291K5200j01023r9370l6324
14145E0085m6931P209l5753J2394O0396J985P7341J10987M6436j00467k8145R3399
14133B48936j51435j72308n12m1977o9896J10412J75214Q7381l6869o0543K8602
14122A17005R5733l89n0304R2560n4929m6561j1601k858j9060P57P370j51307
$$ plain form
14200 129918 -23929 -112205 -13535 191893 230336 358655 373459 346528 165657 39228
14190 39228 -16569 1032 46984 92250 -41417 -109671 -140050 20876 131083 12650 52694
14179 52694 105679 82777 39721 121931 82362 38409 190212 165805 28812 -41420 76261
14168 76261 94126 131684 121941 176268 180868 108746 139797 225478 191142 78089 16667 59532
14156 59532 166696 155710 163462 102700 141703 108311 261602 286802 185779 86409 50085
14145 50085 3154 10363 -25390 -12996 47400 49385 126726 237713 284149 183682 155537 248936
14133 248936 97501 -74807 -75319 -117296 -187192 -76780 98434 185815 148946 88403 117005
14122 117005 212738 212349 162045 254605 199676 153115 141514 138656 119596 120353 127723 -23584
14110b3584r460j7710J1952J333M6115Q1802M9745k5642j78960O805J27202J00133
14098A69731Q1193o4718r8842K7812O8752j7300o4915l5771P9037K22687R9676
14087D67342j61047j58654q9058k192J11610j7351J0039L8911l8077M5620P8289
14076B85432J788l1318j06162L3282M8241M5555l5924p8229p6828P674m73Q1963
14064A75001P9617J3093j34957j63112P9159M3163m5084l1143O3474n1963Q8368
14053A15616O3139k2373N6623j74741m06P8683o8469l259J46M0950J78407N741
14041B70057m1688L9366L3844K055L5944j5496J2074j78325p7346n867K3909k7274
14029G1253q9622L4596P2226K3360l1205j8328N3146K976j47280k2792J49099
$$ plain form
14110 -23584 -33044 -50754 -38802 -37469 8646 90448 140193 114551 -64409 -57604 69598 169731
14098 169731 250924 186206 87364 115176 183928 166628 101713 65942 144979 367666 467342
14087 467342 306295 147641 58583 56391 168001 150650 160689 199600 161523 207143 285432
14076 285432 287220 255902 149740 183022 231263 276818 240894 162665 85837 93511 93038 175001
14064 175001 254618 267711 132754 -30358 48801 91964 46880 15737 79211 27248 115616
14053 115616 178755 156382 213005 38264 37858 116541 48072 44813 44959 85909 264316 270057
14041 270057 228369 267735 301579 303634 339578 324082 336156 157831 80485 74618 98527 71253
14029 71253 -18369 16227 88453 111813 80608 62280 115426 118402 -28878 -51670 97429
14018I7429J43089l8640q2350P205P1057l1837j170l2684j6056J5485P7989j0710
14006A98807n4113q6593k4492M1843j02237p5586J94996J18466j9050p5179p4121
13995D2741P3863M8398p63j8794j33759j39479O5128J25440O6680p394n3710n7220
13983A1131j8723M5085N1515o3719o2017L0776N353l2163o0202P3728n3676K07849
13971A34937J68048o8242j28827j54708O3799O8430J13487k9074j9302K1177J0823
13960A80548m1089m987N4348m6172l1498J31142o4013N526Q2986k7796q1782l1617
13948A25596k2108m8408J16265L7627p4043M0943P3760k26508P762N2091O6062
13937A49039R208l3087p215K6384J3616j9498Q6121J47399m9530N8977J7628j03968
$$ plain form
14018 97429 240518 201878 119528 126733 197790 165953 164783 132099 116043 131528 209517 198807
14006 198807 144694 58101 33609 75452 -26785 -102371 92625 211091 192041 116862 42741
13995 42741 116604 165002 164239 145445 11686 -127793 -62665 62775 129455 122061 68351 11131
13983 11131 -7592 37493 89008 25289 -36728 -5952 -599 -32762 -92964 -19236 -72912 134937
13971 134937 302985 234743 105916 -48792 15007 83437 196924 167850 148548 169725 180548
13960 180548 139459 134472 188820 142648 111150 242292 178279 183805 266791 238995 157213 125596
13948 125596 103488 55080 171345 208972 134929 175872 249632 23124 30886 82977 149039
13937 149039 158247 125160 117945 144329 157945 138447 224568 371967 322437 381414 399042 295074
13925B95074p0671J4865P8194L4545p1973p7031O3975O2076k4086K2789N5937
13914C83694Q625p5378m0497O5471R5074p6439r8470l3939j39117N7787p1470
13903G5341L4396L4854P8145q2718m7279k760o030l8239j04650O1418J41212Q663
13891A52353j6343L8848n9236N6693m2707Q0655l6423M673P8923q9101o2294p8777
13879B7264K7352K5607J0481M3167N3209J8600Q1163K8584Q5974l418K3421n4323
13867C67081p4779j43108Q3590K4790j09242M8875L4034J676l2784N5254j46529
13856A08858q3109Q4393j113L6479J73908J6747j09873n2758O9729O6159j7084
13845B92336j09986K595k6429p1599J04552N7177j4482q8635j10865o0114K1874
$$ plain form
13925 295074 224403 239268 317462 352007 280034 203003 266978 329054 304968 327757 383694
13914 383694 392319 316941 276444 341915 436989 360550 262080 228141 89024 146811 75341
13903 75341 109737 144591 222736 140018 92739 89979 83949 45710 -58940 2478 143690 152353
13891 152353 136010 174858 115622 172315 129608 210263 173840 178513 257436 168335 106041 27264
13879 27264 54616 80223 90704 133871 187080 205680 286843 315427 401401 397983 421404 367081
13867 367081 292302 149194 232784 257574 148332 197207 231241 232917 200133 255387 108858
13856 108858 25749 110142 109029 145508 319416 336163 226290 173532 243261 309420 292336
13845 292336 182350 184945 158516 86917 191469 248646 234164 145529 34664 -25450 -3576
13834c576Q8857J05438o830j567J75451J05869p4205j01155j58114o3801J10877
13823A77244J1933N3298j70371l5187P7791K4705K6776p3661P2613J9413m9265
13812A35289o9525r0541Q159P2709P2661Q1430j01033k6099K3586n1712p4030
13801a9106p8383P6283J31397O9974j839o2381L9891l5273M010L358n5913L4999
13789A07017K9183j6084J5546L2000J03277J6346j28468n4824J10006J19067o4843
13778B68223j55361p0397j8129J62693J37760L0417N065m6960p8579J5708k284
13767B48156m6029l2028N7747J14848J12255j16747o7360k07586r9473J52100
13757A15883N3822p409q1451p281J42138P7753n0973n2395N6324N6207m4592K7426
$$ plain form
13834 -3576 85281 190719 183889 182322 357773 463642 389437 288282 130168 66367 177244
13823 177244 189177 242475 72104 36917 114708 139413 166189 92528 165141 184554 135289
13812 135289 65764 -24777 -16618 56091 128752 210182 109149 83050 106636 54924 -19106
13801 -19106 -97489 -21206 110191 180165 178326 115945 155836 120563 124573 127931 72018 107017
13789 107017 136200 120116 135662 167662 270939 287285 158817 103993 213999 333066 268223
13778 268223 112862 42465 24336 187029 324789 355206 360271 313311 234732 250440 248156
13767 248156 202127 170099 227846 342694 454949 338202 270842 63256 -36217 115883
13757 115883 169705 162296 80845 73564 215702 293455 242482 190087 246411 302618 258026 285452
13745B85452R3722p1250N9728M3498l5245k5322Q7462k3794l8507j04036j80111
13734I1597k1891n7220m0149R9594K7663L820l2369p3546P3770N8095L6973l3089
13722A33248N8098L296k1279L9477p372k4174K0494N7042p4665n2336k9562k9494
13710G2773n9789l1978P6783R3247Q5600Q9719K6494p3521r2808N797j782q2126
13698A08409P0914Q3500j05444n7575J07644O9018j494m7624m771P2796K4289
13687C19662n7806L8334P9402r3305j37883p2696R1222m0991J10714O6243j13591
13676A89305m0162L5881k3981J8543P7868j6681r331j04431j37519K9775J17268
13665A36535J01523J5430p0739j0143M1313o854M1942o0855J14142R7920j02583
$$ plain form
13745 285452 379174 307924 367652 411150 375905 350583 438045 414251 375744 271708 91597
13734 91597 69706 12486 -27663 71931 99594 103414 71045 -2501 71269 129364 166337 133248
13722 133248 191346 194642 173363 212840 205468 181294 201788 258830 184165 131829 102267 72773
13710 72773 12984 -18994 57789 151036 236636 326355 352849 279328 186520 192317 190535 108409
13698 108409 179323 262823 157379 99804 207448 276466 274972 227348 222577 295373 319662
13687 319662 261856 300190 379592 286287 148404 75708 166930 125939 236653 302896 189305
13676 189305 149143 185024 161043 179586 257454 240773 231442 127011 -10508 19267 136535
13665 136535 238058 253488 182749 172606 213919 207065 249007 188152 302294 400214 297631
13654B97631P4604R5539m5478j35845l3200r3902q0465J8049k516P7359N022Q6925
13642B63723J37391j7632j75869m8317j9575O4793j4848L9595o0715n378m2175
13631A20993j7470k8656Q795J36314J7806m41K025m6009K1104O8856J01321O0262
13619D44900N8390j32708j33665j24780M0527K8540M1389k2859N4624O6280r4374
13608B26264o5081J02407J1884k5214P4390j7293j17679K5767O8161K5159n0368
13597B58397k6432r2099k8271Q8384R6629J43698M3736M4051p5664j93740j45218
13586A13471J31145P4055M8824n6300q255K7813j7990j03929r4352Q2853Q2274
13575B79609o094J29526j5370o7211O4740k1802K8576r3060m3610L4680o5318
$$ plain form
13654 297631 372235 467774 422296 286451 253251 159349 78884 96933 94417 171776 176798 263723
13642 263723 401114 383482 207613 159296 139721 204514 189666 229261 168546 163168 120993
13631 120993 103523 74867 83662 219976 237782 237341 239366 193357 214461 283317 384638 444900
13619 444900 503290 370582 236917 112137 152664 181204 222593 199734 254358 320638 226264
13608 226264 161183 263590 275474 250260 324650 307357 189678 215445 283606 308765 258397
13597 258397 231965 139866 111595 199979 296608 440306 484042 528093 452429 258689 113471
13586 113471 244616 318671 367495 311195 302940 330753 312763 208834 114482 197335 279609
13575 279609 273515 403041 387671 320460 385200 363398 391974 298914 255304 289984 224666
13564B24666m3929J33937N64o0476j796O0639N9099J30147j08540q7756K487K3325
13552C32367l7070j09483P5496J22464j26208j06712k5207J11614M6038J12201
13542C95500J7604q851j24418r3005J18688J60912J6543M5951l4711j36544m6363
13531C11306n7158M9415J48239M0522p7452j59471Q4837O674l7910O4444r516
13520C63930N959j5845m1071j3193N2902O487Q0525j7061p2162J0172l5034M9082
13508C74691q0451J21n7897J51468J29967k24402k1566k1578O4299K0463l0953
13497C04162k8048o8347R979M5650L9660m4319J7922R5827n069O8602L2367M5298
13485E13684p8872L8576N6622N4232N2928l1515j69266l9584M6852m6568p2942
$$ plain form
13564 224666 180737 314674 315238 254762 252966 313605 372704 502851 394311 306555 309042 332367
13552 332367 295297 185814 261310 383774 257566 150854 125647 237261 283299 395500
13542 395500 413104 404253 279835 186830 305518 466430 482973 528924 494213 357669 311306
13531 311306 254148 303563 451802 492324 414872 255401 340238 346912 309002 373446 363930
13520 363930 369889 354044 312973 299780 352682 359169 439694 422633 350471 360643 325609 374691
13508 374691 294240 294361 236464 387932 517899 293497 271931 250353 314652 335115 304162
13497 304162 276114 207767 217746 263396 303056 258737 276659 372486 367417 436019 468386 513684
13485 513684 434812 473388 530010 584242 637170 605655 436389 396805 443657 397089 324147
13474C24147k6602R9512L0027o962o9805K7202Q0983P4632L3192r27l701j05488
13462D56210o6822j01315O2349J46706N2644J1808o2940j67467j1547L0317K0208
13451C70151P072q2816q1454N3264K6160J16495N2900N1148L0211L103K1556J32690
13439G00480O2368j09566j67001j51526Q0484r068M1591o0478J982L2708l3437
13428C88537p428Q3685Q4869K2883j45236r9005O8157l5689P4087L1472J371m0424
13416D27279N70P8930J23329L7860k6789k3711q5124n8387r28o363N3830J60373
13404F80869J49837j16784P0418l443j18109j04787K1770r0566j3716Q2407M833
13393E62729N4994K1291k590k4807J4321r349k7580O6643o9318m1849j19833P6001
$$ plain form
13474 324147 297545 397057 427084 420122 350317 377519 458502 533134 566326 565399 561698 456210
13462 456210 389388 288073 350422 497128 549772 561580 498640 331173 319626 349943 370151
13451 370151 377223 294407 212953 266217 292377 408872 461772 512920 543131 546234 567790 700480
13439 700480 762848 653282 486281 334755 415239 406171 447762 387284 389266 421974 388537
13428 388537 381109 464794 549663 572546 427310 328305 396462 360773 434860 466332 467703 427279
13416 427279 427849 506779 630108 667968 641179 617468 532344 473957 473029 466666 520496 680869
13404 680869 830706 713922 784340 780897 662788 558001 579771 489205 475489 557896 562729
13393 562729 617723 639014 636424 611617 625938 616589 589009 655652 586334 544485 424652 500653
13381E00653N7980M8646P6587Q2545k5040L3368J00524p3842l2818q7852j26520
13370E54231o9947J4329N6008P7018J21587m7303j9131j0568l8636j0279r685
13359F17624l9544J5947M6256j02349K8337l015K0061P8183R2635P1269n3093
13348G72311n6661k9023l8977P6868J618k3275j57718K5632J52922J18450K7117
13337H69264J06130k3255j11941l4887R1634p898k7641n7342j03007j43356q4679
13326D73022P6781J48807O7558J9947n4325J8315J05997P2945r7441J8013j12997
13315G36622j71175O6425J37061R2630l3581o9677j6561L7522j49123j92625R8928
13304E36446R0238K3818J49132Q6478M5844M4977O7421N1242j4234j24338K5874
$$ plain form
13381 500653 558633 607279 683866 766411 741371 774739 875263 801421 768603 680751 554231
13370 554231 484284 498613 554621 631639 753226 705923 686792 676224 637588 627309 617624
13359 617624 578080 594027 640283 537934 566271 563256 583317 661500 754135 825404 772311
13348 772311 715650 686627 647650 724518 726136 702861 545143 570775 723697 842147 869264
13337 869264 975394 952139 840198 805311 896945 889047 861406 804064 701057 557701 473022
13326 473022 549803 698610 766168 786115 731790 750105 856102 929047 831606 849619 736622
13315 736622 565447 631872 768933 861563 827982 758305 741744 779266 630143 437518 536446
13304 536446 626684 650502 799634 886112 931956 976933 1044354 1095596 1081362 957024 982898
13293I82898J6742R2954m6085p6483m3927p3486j26247K37603J09488j16998J4621
13282I71080n2414j2288q7921N4398O5716J47141o820j16485q8054n5396n2109
13271G66848J09997K4021Q4268q5058n4677n5573n9677N4020Q6196M0270k681
13260I07954k4939J08776k7910J06244r59o7791N901j5043l0700K3089N6503J04124
13248A145249K6037q0480j7109J33811P9673j36268n3714J39415K914j5066o9847
13237A154615N6840k1131J27295n8229j67797p5795J6048J6327M604J72963J49073
13226A374813P3956j30541o6694J34643N3097k2453j84334l3980K9581R4844N2315
13215A375247J6022M7943m2217J3022O7889J10027N7188l1842M3941r5743j03438
$$ plain form
13293 982898 999640 1092594 1046509 970026 926099 852613 726366 963969 1073457 956459 971080
13282 971080 918666 906378 818457 872855 938571 1085712 1078892 962407 874353 818957 766848
13271 766848 876845 900866 985134 900076 845399 789826 730149 784169 870365 910635 907954
13260 907954 883015 991791 963881 1070125 1069166 1001375 1007276 992233 961533 984622 1041125 1145249
13248 1145249 1171286 1090806 1073697 1207508 1287181 1150913 1097199 1236614 1239528 1224462 1154615
13237 1154615 1211455 1190324 1317619 1259390 1091593 1015798 1031846 1048173 1052777 1225740 1374813
13226 1374813 1448769 1318228 1251534 1386177 1439274 1416821 1232487 1198507 1228088 1322932 1375247
13215 1375247 1391269 1439212 1396995 1410017 1477906 1587933 1645121 1613279 1657220 1561477 1458039
13204A458039P7219J31939p7226n7786j5039j7583n066j3803J16364N2291k7074
13193A622275L7800K9948l4784O027J46624p2707j10147K0643Q0178K6895J31315
13182A884067o0097P939J15381o890q6367K0335Q001L8154Q0383k3620l3950q9929
13170A853407r9716R006J39433j2344r6269M2098P1098J56048Q5787J64147k3237
13159B289458k0889K7756k0285J49420J78853J73765J08058L23994N03304L37229
13149D050663K7230k48133l10514l41654k58243j76916j74150m4887R2085j3473
13139B602008n2342j13329n0566l3221l1573Q7284J7844K6620L8015M1560l2318
13128B499982j75930q0145J36047Q7832K84m9443N3438J34416J44991N600j27523
$$ plain form
13204 1458039 1535258 1667197 1589971 1532185 1517146 1499563 1494497 1480694 1597058 1649349 1622275
13193 1622275 1660075 1690023 1655239 1661266 1807890 1735183 1625036 1645679 1725857 1752752 1884067
13182 1884067 1823970 1831909 1947290 1940400 1854033 1874368 1882369 1920523 2000906 1977286 1943336 1853407
13170 1853407 1753691 1762697 1902130 1889786 1793517 1835615 1906713 2062761 2148548 2312695 2289458
13159 2289458 2268569 2296325 2276040 2425460 2604313 2778078 2886136 3210130 3713434 4050663
13149 4050663 4077893 3829760 3519246 3177592 2919349 2742433 2568283 2523396 2615481 2602008
13139 2602008 2549666 2436337 2385771 2352550 2320977 2408261 2426105 2452725 2490740 2532300 2499982
13128 2499982 2324052 2243907 2379954 2467786 2468070 2418627 2472065 2606481 2751472 2757072 2629549
13117B629549m9957N609M9777q4100m0407J19259R7623M6464J00455m3779p0892
13106B759601J32798M0237k6713N494K7598o3836j2579J45960N7706O2231P9061
13095C207558o6901n4010r8527N6804J69963R0081Q3945M4480o4157Q534L2923
13084C410693P4338l5804Q5883J28481k8101L1228J40694j6788l0238J51440J33440
13073D045266m0878j33236k920k3966J6474J04599Q0737J78958K4366P7880M1970
13062D369250m8885N1827J75442J50782J03097k5156Q5890M1947n517j9856J97834
13051E076655R7719J01127J02287k0465j8461O8547R5152L9924K0674J29137j12190
13040E580106j6976J27739K47746J62528Q991M8701J11221O2541J7760M1589J82314
$$ plain form
13117 2629549 2579592 2585201 2634978 2550878 2510471 2629730 2727353 2773817 2874272 2830493 2759601
13106 2759601 2892399 2932636 2905923 2911417 2939015 2875179 2862600 3008560 3066266 3128497 3207558
13095 3207558 3140657 3086647 2988120 3044924 3214887 3304968 3388913 3433393 3369236 3377770 3410693
13084 3410693 3485031 3449227 3535110 3663591 3635490 3666718 3807412 3790624 3760386 3911826 4045266
13073 4045266 4004388 3871152 3868232 3844266 3860740 3965339 4046076 4225034 4249400 4327280 4369250
13062 4369250 4320365 4372192 4547634 4698416 4801513 4776357 4862247 4904194 4898677 4878821 5076655
13051 5076655 5174374 5275501 5377788 5357323 5338862 5407409 5502561 5542485 5563159 5692296 5580106
13040 5580106 5563130 5690869 5938615 6101143 6110134 6158835 6270056 6332597 6350357 6391946 6574260
13029F574260K03024N7407J11304J25029O3750k388L7337J28703J21776J10196
13019G530398J94925K47177J39720k8975n9840J32655P896P5068J12791K87608
13009H639423M01906K72336J88386J18576L4753O6125O7378M5263K84811K49920
12999A0368877K63085J45898J24460J51598K83909J72357R2181K02294J29360
12990A1934019K12667J26920K01534K76284K57800L36898L10154K46770L34178
12981A4237224L70421K67497J97843K25109K54088L60957M07164L32437K35729
12972A6888469L76227K75260L66598N80742N44926L58759M84182M61367N40588
12963B0877118N21780N22748M46668M44944N00656M80563O81628P10679O22283
$$ plain form
13029 6574260 6777284 6834691 6945995 7071024 7134774 7132386 7169723 7298426 7420202 7530398
13019 7530398 7725323 7972500 8112220 8083245 8023405 8156060 8163956 8239024 8351815 8639423
13009 8639423 9041329 9313665 9502051 9620627 9655380 9721505 9788883 9834146 10118957 10368877
12999 10368877 10631962 10777860 10902320 11053918 11337827 11510184 11602365 11804659 11934019
12990 11934019 12146686 12273606 12475140 12751424 13009224 13346122 13656276 13903046 14237224
12981 14237224 14607645 14875142 15072985 15298094 15552182 15913139 16320303 16652740 16888469
12972 16888469 17264696 17539956 17906554 18487296 19032222 19390981 19875163 20336530 20877118
12963 20877118 21398898 21921646 22368314 22813258 23313914 23794477 24476105 25186784 25809067
12954B5809067O09889P44300O42756P16936P02126P44477P89387R96041J029437
12945C2784416Q82909R27763J168682J177246J069913J180996J192378J162548
12937D1546851J307047J397856J390393J327101J264300J503520J557368J569701
$$ plain form
12954 25809067 26418956 27163256 27806012 28522948 29225074 29969551 30758938 31754979 32784416
12945 32784416 33667325 34595088 35763770 36941016 38010929 39191925 40384303 41546851
12937 41546851 42853898 44251754 45642147 46969248 48233548 49737068 51294436 52864137
$$ [...]
##END NTUPLES=NMR SPECTRUM
##END=
