##TITLE=Analysis number 325632
Compound Code btb 08846
Book Reference 17538
Project Code adrs fraglib
Chemist Name jom
##JCAMPDX= 6.0         $$ Bruker NMR JCAMP-DX V2.0
##DATA TYPE= NMR SPECTRUM
##DATA CLASS= NTUPLES
##ORIGIN= Bruker BioSpin GmbH
##OWNER= nmr
$$ XWIN-NMR		Version 3.5
$$ Fri Jan  5 11:53:09 2007 GMT Standard Time (UT+0h)  MAYBRIDGE\nmr@NMR_250MHZ
##.OBSERVE FREQUENCY= 250.131544655141
##.OBSERVE NUCLEUS= ^1H
##.ACQUISITION MODE= SIMULTANEOUS (DQD)
##.ACQUISITION SCHEME= undefined
##.AVERAGES= 16
##.DIGITISER RES= 18
##SPECTROMETER/DATA SYSTEM= dpx250
##.PULSE SEQUENCE= zg30
##.SOLVENT NAME= DMSO
##.SHIFT REFERENCE= (INTERNAL, DMSO, 0, 16.522)
##AUDIT TRAIL= $$ (NUMBER, WHEN, WHO, WHERE, WHAT)
$$ ##TITLE= Audit trail, XWIN-NMR		Version 3.5
$$ ##JCAMPDX= 5.01
$$ ##ORIGIN= Bruker BioSpin GmbH
$$ ##OWNER= nmr
$$ C:\u/data/dgb/nmr/ADRS/480/pdata/1/auditp.txt
$$ ##AUDIT TRAIL=  $$ (NUMBER, WHEN, WHO, WHERE, WHAT)
(   1,<2007-01-05 11:52:33.09 +000>,<MAYBRIDGE\nmr>,<NMR_250MHZ>,
      <created by zg, POWCHK disabled, PULCHK disabled
       configuration hash MD5:
       49 4B E0 1D 92 C2 6B 37 9F E6 65 BC 52 41 86 1D
       data hash MD5: 64K
       FD 61 FD B2 61 AA B6 0C 87 B4 98 7A 1A 36 D6 17>)
(   2,<2007-01-05 11:52:52.59 +000>,<MAYBRIDGE\nmr>,<NMR_250MHZ>,
      <Start of raw data processing
       ef LB = 0.3 FT_mod = 6 PKNL = 1 SI = 32K 
       data hash MD5: 32K
       62 AC 9C 23 2D D4 19 2F A4 B2 AA 39 1D FD 02 0E>)
(   3,<2007-01-05 11:52:56.18 +000>,<MAYBRIDGE\nmr>,<NMR_250MHZ>,
      <apk 
       data hash MD5: 32K
       7C F8 6C F6 22 A6 74 07 05 0A CF E6 AC C8 BB 0C>)
(   4,<2007-01-05 11:52:58.90 +000>,<MAYBRIDGE\nmr>,<NMR_250MHZ>,
      <abs ABSG = 5 
       data hash MD5: 32K
       2D 92 7A B8 0A 68 1B 3F 74 4D 3B 0E 47 A1 48 4B>)
$$ ##END=
$$ 
$$ hash MD5
$$ 48 FC F3 F2 F6 5A D4 3E 58 E0 76 81 DB 20 76 FF
##$RELAX= 
##$RELAX= 
##$RELAX= 
##$RELAX= 
##$RELAX= 
##$RELAX= 
##$RELAX= 
$$ Bruker specific parameters
$$ --------------------------
##$DU= <C:\u>
##$EXPNO= 480
##$NAME= <ADRS>
##$PROCNO= 1
##$TYPE= <nmr>
##$USER= <dgb>
##$AMP= (0..31)
100 100 100 100 100 100 100 100 100 100 100 100 100 100 100 100 100 100 
100 100 100 100 100 100 100 100 100 100 100 100 100 100 
##$AQSEQ= 0
##$AQ_mod= 3
##$AUNM= <au_zg>
##$AUTOPOS= <38 >
##$BF1= 250.13
##$BF2= 250.13
##$BF3= 250.13
##$BF4= 250.13
##$BF5= 500.13
##$BF6= 500.13
##$BF7= 500.13
##$BF8= 500.13
##$BYTORDA= 1
##$CFDGTYP= 0
##$CFRGTYP= 5
##$CHEMSTR= <none>
##$CNST= (0..31)
1 1 145 1 1 1 1 1 1 1 1 1 1 1 1 1 1 1 1 1 1 1 1 1 1 1 1 1 1 1 1 1 
##$CPDPRG= <>
##$CPDPRG1= <>
##$CPDPRG2= <>
##$CPDPRG3= <>
##$CPDPRG4= <mlev>
##$CPDPRG5= <mlev>
##$CPDPRG6= <mlev>
##$CPDPRG7= <mlev>
##$CPDPRG8= <mlev>
##$CPDPRGB= <>
##$CPDPRGT= <>
##$D= (0..31)
0 1 0 0 0 0 0 0 0 0.06 0 0 0 0 0 0 0.0002 0 0 0 0 0 0 0 0 0 0 0 0 0 0 
0 
##$DATE= 1167997951
##$DBL= (0..7)
120 120 120 120 120 120 120 120 
##$DBP= (0..7)
150 150 150 150 150 150 150 150 
##$DBP07= 0
##$DBPNAM0= <>
##$DBPNAM1= <>
$$ [...]
##$SUBNAM6= <"">
##$SUBNAM7= <"">
##$SUBNAM8= <"">
##$SUBNAM9= <"">
##$SW= 20.6930455092707
##$SWIBOX= (0..15)
0 0 3 0 0 0 0 0 0 0 0 0 0 0 0 0 
##$SW_h= 5175.983436853
##$TD= 65536
##$TD0= 1
##$TE= 294.16
##$TE2= 300
##$TE3= 300
##$TEG= 300
##$TL= (0..7)
0 120 120 120 120 120 120 120 
##$TP= (0..7)
150 150 150 150 150 150 150 150 
##$TP07= 0
##$TPNAME0= <>
##$TPNAME1= <>
##$TPNAME2= <>
##$TPNAME3= <>
##$TPNAME4= <>
##$TPNAME5= <>
##$TPNAME6= <>
##$TPNAME7= <>
##$TPOAL= (0..7)
0.5 0.5 0.5 0.5 0.5 0.5 0.5 0.5 
##$TPOFFS= (0..7)
0 0 0 0 0 0 0 0 
##$TUNHIN= 0
##$TUNHOUT= 0
##$TUNXOUT= 0
##$USERA1= <user>
##$USERA2= <user>
##$USERA3= <user>
##$USERA4= <user>
##$USERA5= <user>
##$V9= 5
##$VALIST= <valist>
##$VCLIST= <CCCCCCCCCCCCCCC>
##$VD= 0
##$VDLIST= <DDDDDDDDDDDDDDD>
##$VPLIST= <PPPPPPPPPPPPPPP>
##$VTLIST= <TTTTTTTTTTTTTTT>
##$WBST= 1024
##$WBSW= 4
##$XGAIN= (0..3)
0 0 0 0 
##$XL= 0
##$YL= 0
##$YMAX_a= 267496
##$YMIN_a= -220636
##$ZGOPTNS= <>
##$ZL1= 120
##$ZL2= 120
##$ZL3= 120
##$ZL4= 120
##$ABSF1= 16.522
##$ABSF2= -4.171173
##$ABSG= 5
##$ABSL= 3
##$ALPHA= 0
##$AQORDER= 0
##$ASSFAC= 0
##$ASSFACI= 0
##$ASSFACX= 0
##$ASSWID= 0
##$AUNMP= <proc_1d>
##$AZFE= 0.1
##$AZFW= 0.1
##$BCFW= 0
##$BC_mod= 0
##$BYTORDP= 0
##$COROFFS= 0
##$CY= 12.5
##$DATMOD= 1
##$DC= 0
##$DFILT= <>
##$DTYPP= 0
##$F1P= 14.0000005364418
##$F2P= -0.99999901652339
##$FCOR= 0.5
##$FTSIZE= 32768
##$FT_mod= 6
##$GAMMA= 0
##$GB= 0
##$INTBC= 1
##$INTSCL= 1
##$ISEN= 128
##$LB= 0.3
##$LEV0= 0
##$LPBIN= 0
##$MAXI= 10000
##$MC2= 0
##$MEAN= 0
##$ME_mod= 0
##$MI= 0
##$NCOEF= 0
##$NC_proc= -5
##$NLEV= 6
##$NOISF1= 0
##$NOISF2= 0
##$NSP= 0
##$NTH_PI= 0
##$NZP= 0
##$OFFSET= 16.522
##$PC= 1
##$PHC0= 210.6033
##$PHC1= 11.5086
##$PH_mod= 1
##$PKNL= yes
##$PPARMOD= 0
##$PSCAL= 4
##$PSIGN= 0
##$REVERSE= no
##$SF= 250.13
##$SI= 32768
##$SIGF1= 0
##$SIGF2= 0
##$SINO= 400
##$SIOLD= 32768
##$SREGLST= <1H.DMSO>
##$SSB= 0
##$STSI= 32768
##$STSR= 0
##$SW_p= 5175.98343685301
##$SYMM= 0
##$S_DEV= 0
##$TDeff= 65536
##$TDoff= 0
##$TI= <Analysis number 999999
Compound Code 99
Book Reference 9
Project Code 9>
##$TILT= no
##$TM1= 0
##$TM2= 0
##$TOPLEV= 0
##$USERP1= <user>
##$USERP2= <user>
##$USERP3= <user>
##$USERP4= <user>
##$USERP5= <user>
##$WDW= 1
##$XDIM= 32768
##$YMAX_p= 614572903
##$YMIN_p= -490233
$$ End of Bruker specific parameters
$$ ---------------------------------
##NTUPLES= NMR SPECTRUM
##VAR_NAME=  FREQUENCY,     SPECTRUM/REAL,   SPECTRUM/IMAG
##SYMBOL=    X,             R,               I
##VAR_TYPE=  INDEPENDENT,   DEPENDENT,       DEPENDENT
##VAR_FORM=  AFFN,          ASDF,            ASDF
##VAR_DIM=   32768,         32768,           32768
##UNITS=     HZ,            ARBITRARY UNITS, ARBITRARY UNITS
##FACTOR=    0.157963299565203, 1,           1
##FIRST=     4132.6476996994, 0,             0
##LAST=      -1043.33573715361, 0,           0
##MIN=       -1043.33573715361, -490233,     0
##MAX=       4132.6476996994, 614572903,     0
$$ Real data points
##PAGE= N=1
##DATA TABLE= (X++(R..R)), XYDATA
$$ [...]
15982h125k6190p5614O5091k1142j09187m039r301m6457m4101P5109o5841l3469
15970c03266Q7796J02604L8288n7522n3218P0577R1682o3215O0843J08338p3990
15959H917j29872M6121K2903K4570M0815j25700p3883k9063M0201K6940n4165
15948b02216R2530K642N3267J3102j7474j12009m8797J00453r211N5149k6386
15937i8950l4311R5873N4092J9076m8663P567j54803j33074J26587R5506n469
15926g6569N0970N1515R2435L0708P497m3684r824K2909j90907p8386m4398L4650
15914a53084j5444l5776k6167Q9760P8797N0062k8456j2290o802m796j33085K3423
15902a73858Q2886N8481l3175n9026j0033O6649R6098J0353n9325j3896L0855
$$ y = [-8125, -34315, -109929, -44838, -65980, -175167, -179206, -188507, -234964, -279065, -203956, -269797, -303266, -215470, -112866, -74578, -132100, -185318, -114741, -23059, -86274, -25431, 82907, 8917, -120955, -74834, -51931, -27361, 13454, -112246, -186129, -215192, -174991, -148051, -202216, -109686, -107044, -53777, -40675, -58149, -170158, -218955, -118502, -127713, -72564, -98950, -133261, -37388, 16704, 35780, -12883, -5316, -160119, -293193, -166606, -71100, -76569, -25599, 25916, 118351, 149059, 156556, 112872, 103048, 125957, -64950, -143336, -187734, -153084, -168528, -204304, -230471, -140711, -61914, -11852, -40308, -52598, -59400, -64196, -197281, -173858, -90972, -32491, -65666, -124692, -134725, -68076, 28022, 38375, -20950, -34846, -3991]
15891c991n5074j37101n8943l7341m390Q9444N2093k736J7187j1877R0971k774
15879f4532m9588O7437n045j825k6550J6912j8190J52471J68064l4602j22992
15868H1560k9223L7010j9063p5247j07746N8400L1600R9196M052k8272j7850j3512
15856B0905n153l3844j3305P7949K064k7990p753m4300M1148n6687J00833L0316
15844H4183r5548j6355j5336j7991k4048l1125J9233l8300l5019p9246O415O4247
15832a78890Q0389J6695N0302O0051O2500j8177n5765j48548n3494K0160K3617
15821a41160N5457P8512J01045N7245r4337M0853J2472K7615P9435n2800j02224
15810F2113k3324J2158K3982k0810j1949p0200p0695K384M565K3329j50786O524
$$ y = [-3991, -59065, -196166, -255109, -292450, -296840, -207396, -155303, -158039, -140852, -152729, -61758, -64532, -114120, -46683, -51728, -53553, -80103, -63191, -81381, 71090, 239154, 204552, 81560, 52337, 89347, 70284, -4963, -112709, -54309, -22709, 76487, 80539, 52267, 34417, 20905, 15752, -18092, -31397, 46552, 48616, 20626, 12873, -31427, 9721, -46966, 53867, 84183, -11365, -27720, -43056, -61047, -85095, -116220, -96987, -135287, -170306, -249552, -243137, -178890, -98501, -81806, -31504, 28547, 91047, 72870, 17105, -131443, -184937, -164777, -141160, -85703, -7191, 93854, 151099, 56762, 97615, 110087, 137702, 217137, 164337, 62113, 38789, 50947, 74929, 54119, 42170, -28030, -98725, -96341, -91776, -68447, -219233, -212709]
15798b12709J5732P5644N9134r2861l9595P745L6761j8724l3430J48307J97394
15787A43398n9798J8594n43Q8560p0277m7278j05204r8074J03464O1466j7345
15776A6963l8452N9001M6639l5483k1145k3697M4011j17181j383m7725r6168l4291
15764b48911J25187J61293P956K2822J08119M4707r4276n3242n8376J7101l3270
15753h90j4675k0506r6005p7406R2559L7313l0449m3916p0173o3936O5748P9629
15741a42707J64463p0188j01911P703o916j9139R9219l8242j3421p459m091P9992
15729e2697P7679p3196P8583l983k5820k3551k6340o5923J5978J5459L7478K8780
15717a7553k23194l6516O0293K3198J36891R2431k8685N9126K4357l2185n8307
$$ y = [-212709, -196977, -121333, -62199, -155060, -194655, -186910, -150149, -168873, -202303, -53996, 143398, 83600, 102194, 101651, 190211, 119934, 72656, -32548, -130622, -27158, 34308, 16963, -21489, 37512, 84151, 48668, 27523, 3826, 47837, -69344, -70727, -118452, -214620, -248911, -123724, 37569, 45525, 68347, 176466, 221173, 126897, 73655, 15279, 32380, -890, -15565, -36071, -132076, -209482, -116923, -79610, -110059, -153975, -224148, -288084, -222336, -142707, 21756, -48432, -150343, -142640, -149556, -168695, -69476, -107718, -121139, -128598, -132689, -52697, 24982, -48214, 30369, 26386, 566, -22985, -49325, -115248, -99270, -83811, -46333, -17553, -240747, -277263, -216970, -193772, -56881, 35550, 6865, 65991, 90348, 58163, -144]
15706a44P726j8303N31M0554P3362n4381j08471p053R1592J4549R3063p8094j30470
15693g5539j9546n859R2044j9312j03664m6112Q7096P5530P5534r8061R807j9606
15681d7688k776q9276j3843R568L6469q2672n4046j0508O3540J19078L4504n9077
15669i6727l1546k181N2753J6853K2517p2677O539N8705n3968j00808k2430J07486
15657a15484J13358p3105N592r4400r1959Q7605J77734L8861p1928Q1119k7085
15646C0308j8217J67391j7066K5224n4924j46202k5502J00576L7473j31380k7344
15635e9663Q7632m6501l7307n0193m7400P9476L3864n4761N6112N0414m2308M9039
15623A8404k869N090k7112Q3810r6057p152R1740O4071r1000j5913j0943K4817
$$ y = [-144, 7582, -10721, -10190, 30364, 103726, 49345, -59126, -66179, 25413, 39962, 133025, 54931, -75539, -95085, -100944, -8900, -28212, -131876, -177988, -90892, -15362, 60172, -37889, -28082, -47688, -50464, -139740, -153583, -144015, -107546, -190218, -244264, -254772, -191232, -72154, -37650, -96727, -128273, -130454, -77701, -60848, -38331, -111008, -104469, -45764, -99732, -200540, -222970, -115484, -2126, -75231, -69639, -164039, -255998, -168393, 9341, 48202, -23726, 57393, 30308, 12091, 179482, 162416, 187640, 132716, -13486, -38988, 61588, 99061, -32319, -59663, 27969, -18532, -55839, -106032, -153432, -73956, -40092, -94853, -38741, 11673, -30635, 18404, 15535, 20625, -6487, 77323, -18734, -25886, 65854, 129925, 38925, 23012, 12069, 36886]
15611C6886n2526n6605j45979r8238L9376J20766k2809N9314K61J4800J34544
15600B9790J58536o7752p3633O9289n4480o9895M385M971j6641j4230l7296j5931
15588h2887M3263L2585K5730N4782j7482l4515j1789j32547n6661P6906m883O0917
15576d6581n4131J3950J11879o1067L6747j3558K3060J04470j9117p1042j04672
15565h0062O8911J51728O8872m3392m9708j80123j06167P0421J10455K1762n4777
15554b2080L6938q4190j18582J5582n279J6820L4497K1884r102n0178Q6146R2288
15542A4744k4520j74878j33902N7388L059J02259J16597N9918P051J5046M5592
15531H8354N4670r3514R883l5732k1260n926M6796J7672J6915n231j45171m4310
$$ y = [36886, -15640, -72245, -218224, -316462, -277086, -156320, -179129, -119815, -119554, -104754, 29790, 188326, 120574, 46941, 116230, 61750, -8145, -3760, 1211, -15430, -29660, -66956, -82887, -39624, -7039, 18691, 73473, 55991, 21476, 9687, -122860, -179521, -102615, -107498, -46581, -100712, -86762, 25117, -35950, 797, -12761, 10299, 114769, 95652, 24610, -80062, -11151, 140577, 209449, 166057, 116349, -63774, -169941, -99520, 10935, 32697, -22080, 14858, -69332, -187914, -172332, -177611, -160791, -126294, -104410, -113512, -163690, -77544, 14744, -9776, -184654, -318556, -261168, -258109, -155850, -39253, 20665, 27716, 42762, 88354, 143024, 49510, 59393, 23661, 2401, -3525, 43271, 60943, 77858, 72627, -72544, -116854]
15519a16854K2165Q8030M9437K302n7532r130Q3573O7852j85724p6073R3982J04083
15507F6111R6972j31945p7536j18562p9705J46382K25080q3410j08909j1402o3026
15496a39950j6603N7365k17j520M169J07645j6924K6515j8173r1565O1799J40552
15484A13093r3636q9509N9672k2430j2794O712Q1908O1537q2774M3721K2128k6890
15472F0738m241j69000p271R1150O6303K8009K0053k2592m7562k380j11715P492
15460i1016J35088M2196l9412J47315n3344j02181o590r342K8862Q2592O3380
15449A97548o5698j84187K5969M9955O9723J7328p7818j32479q7561J89790J38616
15438A41186M7263r548k48643p6460J90284P6611j21261l1762R4615j4928n6530
$$ y = [-116854, -94689, -6659, 42778, 45080, -12452, -21582, 61991, 129843, -55881, -131954, -37972, 66111, 163083, 31138, -46398, -164960, -244665, -98283, 126797, 43387, -65522, -76924, -139950, -156553, -99188, -99405, -100925, -96756, 10889, -6035, 20480, 2307, -89258, -27459, 113093, 19457, -70052, -10380, -32810, -45604, -38892, 43016, 104553, 21779, 65500, 87628, 60738, 56497, -112503, -119774, -28624, 37679, 65688, 85741, 63149, 15587, 13207, -98508, -91016, 44072, 86268, 46856, 194171, 140827, 38646, 32056, 22714, 51576, 134168, 197548, 131850, -52337, -26368, 23587, 93310, 110638, 32820, -99659, -187220, 2570, 141186, 188449, 178901, -69742, -146202, 44082, 120693, -568, -32330, 62285, 47357, -9173]
15427i173l0418P306r108m5116j6178l2521P19J22129q926o6622n2415Q0946Q3916
15414B4539m5340n7569J01710q7573j62082N6556K4180r6159J1389J17974Q8452
15403b3923J11158o0994j54509J2934O3909k8175o4573k4746O1584L2776m3995
15392a18554M4693M1529O0394R1440K1650o9116O091m2379K562k5199J2877L7065
15380F3053j3756o721j08776l4303M5061J14776k1454J4793j19754l8251o6461
15369a71793R2807J15473J43527J5662r1530j07116j15458O6125l8301J7910j4192
15358h6886J5509q463O0824p2150o08M6652j6906N8521P8484j9565k4083M235
15346C5564q963l419O6629p5481p2109M1021L3593m4594n90m2101L9005Q2075
$$ y = [-9173, -39591, -32285, -41393, -86509, -102687, -135208, -134489, -12360, -21286, -87908, -140323, -59377, 24539, -20801, -78370, 23340, -64233, -226315, -169759, -145579, -241738, -230349, -112375, -23923, 87235, 26241, -128268, -115334, -51425, -79600, -144173, -168919, -107335, -74559, -118554, -73861, -32332, 28062, 119502, 141152, 72036, 78127, 35748, 38310, 13111, 25988, 63053, 49297, 42576, -66200, -100503, -55442, 59334, 37880, 52673, -67081, -105332, -171793, -78986, 36487, 180014, 195676, 104146, -2970, -118428, -52303, -90604, -72694, -86886, -71377, -79840, -19016, -91166, -91774, -45122, -62028, -3507, 74977, 55412, 31329, 35564, 26601, 23182, 89811, 14330, -57779, -16758, 16835, -27759, -28349, -70450, -31445, 50630]
15334E0630l1087L0599n293M7343j59577j69445J02370J40955l3950P4767R7621
15323A44933j12016j13643P0813Q8238j76313j88532K02743J43709p867k8804
15313B3261N3228p8652m3260R6595J808j629k2896o10l7642j31910Q5179p8317
15301a34845n3694K9868Q9895R0078M4065p450r4409j80441m8320J8833J37892
15290a08528J51089J1605O855k7959M8912L1446p0339J401J53403o4533j69944
15279c6592p1736M0545J05245J26640k9627l0673M9367m0976j33335n3619n1895
15268a26656J3610k3924n9633q1998M2989J15297N5367J6525N7507K1975j39642
15257a08583Q7414L4658j50646K8606J94572p248j10575l2393J38756K941j41392
$$ y = [50630, 19543, 50142, 44849, 92192, -67385, -236830, -134460, 6495, -27455, 47312, 144933, 32917, -80726, -9913, 78325, -97988, -286520, -83777, 59932, 52065, 23261, 76489, -2163, -45423, 51172, 52980, 51351, 28455, 27845, -9797, -141707, -56528, -134845, -188539, -158671, -68776, 21302, 65367, 57917, -36492, -216933, -265253, -246420, -108528, 42561, 54166, 61021, 33062, 81974, 113420, 43081, 44482, 197885, 133352, -36592, -108328, -67783, 37462, 164102, 134475, 103802, 153169, 112193, -21142, -74761, -126656, -113046, -136970, -196603, -278601, -235612, -120315, -64948, -48423, 9084, 31059, -108583, -21169, 13489, -137157, -108551, 86021, 78773, -31802, -64195, 74561, 77502, -63890]
15246f3890O161l8280J645N8598Q8542P1128o288r173L676K0409j69671n4162
15234i1305J30001N8761P340q8764j9820p8875m1151m9999O7367M8487M6098J65044
15222A53184m2735j49615n9870Q3325j1663l3197J08439p858k1787P8735L420
15211A00378N0142k1777k16304l2545k2433k2289j2026Q0802j9877K0572J42168
15200D6811k3561o7102l9727o9895J8809o3369j16574j04487M8049J02603n5338
15189c23781Q0796J65203m4011o469q535O750M7962N4234n4714l2273J15965J33942
15177A35069J03875j40745q9437r9646O586J41517k7904j3518Q8710l2921r6853
15166b5267r334N5393L0479l4226l4330k2760P205K4105l7227l8183K18208J10962
$$ y = [-63890, -57729, -96009, -94364, -35766, 52776, 123904, 117616, 108443, 112119, 132528, -37143, -91305, 38696, 97457, 104797, 16033, -3787, -82662, -123813, -173812, -106445, -57958, -11860, 153184, 110449, -39166, -99036, -15711, -27374, -60571, 47868, 40010, 18223, 96958, 100378, 150520, 128743, -87561, -120106, -142539, -164828, -176854, -96052, -115929, -95357, 46811, 23250, -43852, -83579, -153474, -134665, -198034, -314608, -419095, -371046, -268443, -323781, -242985, -77782, -121793, -128262, -136797, -130047, -82085, -27851, -82565, -114838, 1127, 135069, 238944, 98199, 8762, -90884, -84298, 57219, 29315, 15797, 104507, 71586, -25267, -34601, 20792, 51271, 17045, -17285, -40045, -32840, -8735, -45962, -84145, 134063, 245025]
15154B45025m6160j29277j35244n2824m1567M3729N2148j43226J048K0378j00843
15143b86813R2475K21915J02571j53976q0395L0212Q7616l8279j04594p6522J44650
15132f1140Q2103L104j20720o6789L6303p7757p9401J28791J37235J0169n2055
15121f0157k0074L5594n078K8789J6913J13N2366N2372N8342p2061p5604K7130
15109C8645N1379p074j7118q966j5392k8137l3538M1230J8693j37310n2975R89
15097a49574m2915l5240M6571J30766M5983J9451L0852P7269O6641J9048j28917
15086G9935l7450j00104n0651p973L5331O9619M1454q787r4010J387O1197o5516
15074g5568j57492P7723K47501J7224P0092r3819Q8961O1650j38616j17467j5064
$$ y = [245025, 198865, 69588, -65656, -118480, -160047, -116318, -64170, -207396, -206348, -185970, -286813, -194338, 27577, 130148, -23828, -104223, -74011, 13605, -24674, -129268, -205790, -61140, 20963, 24067, -96653, -163442, -127139, -204896, -284297, -155506, -18271, -8102, -60157, -80231, -44637, -49715, -20926, -4013, -3900, 48466, 100838, 159180, 87119, 11515, 38645, 90024, 82950, 65832, 56866, 41474, 13337, -20201, 21029, 39722, -97588, -150563, -149574, -192489, -227729, -181158, -50392, -4409, 15042, 45894, 123163, 189804, 208852, 79935, 42485, -57619, -108270, -116243, -80912, -11293, 30161, 21374, -72636, -71249, -10052, -75568, -233060, -155337, 92164, 109388, 179480, 85661, 174622, 236272, 97656, -19811, -34875]
15063c4875L5852n6154m3858N0585K2430k771j7230J15785n8844N2781o0547l234
15051h0J64423P0421n7801J6990l9580j55373L1079o3422j3558P1010K4227j2978
15039C5358J3356l5572n3982n6129P271j5519k02Q8056R7377l1646q0675o7156
15027i9463n036M9368k7538O4075k7953J4415M2365n4859j8113m6995K4692K6749
15015e8293j17730m4336J36553J37105J36387L99n4579j09929K1011M0531K1792
15004A08911q4312q0151k3909O3046L0853N8198p663K3594o7222j69901L7381
14993a11175N1678M1238L5106j40104o7316N6416j01055o557R1846M5373L3237
14982g1313L8188p3102m2834j12151N1254J75694J19613n8863m9219m1792J8886
$$ y = [-34875, 977, -55177, -99035, -48450, -26020, -28791, -46021, 69764, 10920, 63701, 3154, -80, 164343, 234764, 176963, 193953, 154373, -1000, 30079, -33343, -46901, 24109, 48336, 35358, 48714, 13142, -40840, -96969, -89698, -105217, -105419, -17363, 80014, 48368, -32307, -99463, -104499, -55131, -82669, -18594, -46547, -32132, 10233, -44626, -62739, -109734, -85042, -58293, -176023, -220359, -83806, 53299, 189686, 190085, 135506, 25577, 46588, 87119, 108911, 24599, -55552, -79461, -16415, 14438, 72636, 64973, 88567, 21345, -148556, -111175, -59497, -18259, 16847, -123257, -190573, -134157, -235212, -241769, -149923, -104550, -71313, -33125, -106227, -149061, -261212, -209958, -34264, 85349, 26486, -22733, -64525, -45639]
14971d5639J25610m8562n2629m1427j9225p541j3603m4348k5321P9892J01345
14960H552q5107j17365q3524P0226L9133M3203P9527O9400N6149j51340k02313
14949b73459Q3036O3974k9676M2259J05524M7955j21085N378n8412P7679N721
14938e1106j07047n5754P6263P2735k0419K0288q2018j00546J16728M4205M6429
14927d0242p2493p9114o8331j6469J350q2319p492J27619J2685R5933P1358l8763
14915i6278N2655K4360J03287R495K5330K7631q3048K7154J4605m1975Q153k6717
14903D4652J07665J03772J7523j8223r4433j90932j73846N657L1870M9267J59239
14892D2211J574l3631j9976Q0584N6942l2110j00601k1545J15365Q9942q5012
$$ y = [-45639, 79971, 31409, -21220, -62647, -81872, -89413, -103016, -147364, -172685, -92793, 8552, -76555, -193920, -277444, -207218, -168085, -124882, -45355, 24045, 80194, -71146, -273459, -190423, -126449, -156125, -113866, -8342, 39613, -81472, -76094, -134506, -56827, -51106, -158153, -213907, -137644, -64909, -85328, -65040, -147058, -247604, -130876, -86671, -40242, -112735, -191849, -260180, -276649, -275299, -357618, -365110, -237491, -224806, -128873, -57515, -96278, -43623, -19263, 84024, 93519, 118849, 146480, 63432, 90586, 105191, 63216, 71369, 44652, 152317, 256089, 273612, 255389, 160956, -29976, -203822, -198165, -166295, -117028, 42211, 43785, 10154, -9822, 70762, 127704, 95594, -5007, -26552, 88813, 178755, 93743]
14881I3743n2704j893n592j73335l1192J32940M2021K5543m8868l8408o0480J912
14869a16313Q040n3349J40964J74120p56l0014q3805j64197K8990k5355J14228
14858g447L4933J4374l8349j52708n2188P2734J77636P0173r2008j9317m0147
14847c2314j01991q3025Q6309J01207k1350J7805J20806j8108j34127o6111K323
14836a28576k208M128l0363l6289K0759k6837K2061J05048J29827n739J3045K6328
14824I1184r3138k016r6738k0249M7627Q3536j14628r2691J7318M3364R6179r900
14812e0152j6780J3817R633r2878L7897J20181J00657j1801L4566O5663N6175
14801B66978j2109R5548j07293k13544m9004J19004L2054o6663J2805l2030k8787
$$ y = [93743, 41039, 39146, 33554, -139781, -170973, -38033, 3988, 29531, -19337, -57745, -118225, -116313, -108273, -161622, -20658, 153462, 152706, 122692, 38887, -125310, -96320, -121675, -7447, 27486, 41860, 3511, -149197, -201385, -128651, 48985, 119158, 27150, 7833, -32314, -134305, -217330, -131021, -29814, -51164, -33359, 87447, 69339, -64788, -130899, -128576, -130784, -126656, -157019, -193308, -172549, -199386, -177325, -72277, 57550, 51811, 64856, 91184, -1954, -3970, -100708, -120957, -73330, 10206, -104422, -197113, -179795, -136431, -40252, -50152, -66932, -53115, -43482, -136360, -98463, 21718, 122375, 110574, 145140, 210803, 266978, 254869, 350417, 243124, 29580, -19424, 99580, 131634, 64971, 77776, 45746, 16959]
14790A6959M9342j12965M3591J6612P0705j7121o6855j3915q563O8287j12886
14779f6809o2049m6402n1762J2604J03342O0105O2355j1106m8763J03636J9899
14768G5050p5679k9337p2355j3133j482k4670k2732j32979L7993J72264M3325
14757d3735P178r163P8688J181r9908L1338L9563M1017o504m0285j01105n1432
14745a53167o4873J04648J19676L4516J56404l1196j78887l3580p176Q2532N0647
14734G9544o5905j17717J09304J59992N3357j01461j40284k8833Q966P3571k2338
14723H196p542L1025L2325n9470o7612l958k2697M9700k3708j75238N1037J23356
14711f4586M267m37m3829K1783R4634R419k5968k7344p3862m2004p717n1082K6402
$$ y = [16959, 66301, -46664, -3073, 13539, 84244, 67123, 268, -13647, -22210, 46077, -66809, -128858, -175260, -227022, -214418, -111076, -50971, 11384, 278, -48485, 55151, 75050, -629, -29966, -102321, -115454, -116936, -141606, -164338, -297317, -259324, -87060, -43735, -36557, -45720, 32968, 34149, -65759, -34421, 5142, 46159, 39655, -630, -101735, -153167, -218040, -113392, 6284, 40800, 197204, 166008, -12879, -46459, -53635, 28897, 79544, 13639, -104078, 5226, 165218, 218575, 117114, -23170, -52003, -43037, 30534, 8196, 654, 31679, 64004, 4534, -63078, -67036, -89733, -40033, -63741, -238979, -187942, -64586, -60319, -60756, -104585, -82802, 11832, 21251, -4717, -32061, -105923, -147927, -155644, -206726, -180324]
14698a80324P6639J7659R6341J05750k70r7016q6120L3682o3233J4708Q0890O889
14686E595n3130O4667n412o236J891j6643l1155o8381K2729k5128J14543L5762
14674C9102j2175P4676o5353m8246n1458Q4518j3370N4442M0590k1980K4950j53447
14662d7751m7772j04682L1066N9786J5234L2988L9757O3093n1459O139P4381j07373
14650c6593j76865J08750J04126P6281l2591l6714p5975m1220M9533J011j12976
14639a73233J34570r889P2484P9708L4157K224J6898n8816q6584L9193N7058R1980
14627A99750j4712j13566q2530K8201J14399l3041j01097L880r063n7985l1182
14616i6946K1208J36141R214R0169K247q9201k1303l7618r3791J4589J27443L970
$$ y = [-180324, -103685, -86026, 10315, 116065, 115795, 18779, -67341, -33659, -96892, -82184, -1294, 5595, -47535, 17132, 11720, 5484, 7375, -9268, -40423, -108804, -86075, -111203, 3340, 39102, 26927, 101603, 36250, -11996, -63454, 21064, 7694, 62136, 102726, 80746, 105696, -47751, -95523, -200205, -169139, -109353, -94119, -61131, -21374, 41719, -9740, -3601, 70780, -36593, -213458, -104708, -582, 75699, 43108, 6394, -69581, -110801, -61268, -60257, -173233, -38663, -48552, 23932, 103640, 137797, 140021, 156919, 98103, 11519, 50712, 107770, 199750, 185038, 71472, -11058, 17143, 131542, 98501, -2596, 1284, -7779, -65764, -96946, -75738, 60403, 69617, 159786, 162033, 72832, 51529, 13911, -79880, -65291, 62152, 66122]
14604F6122R26l9673q8414l7024m1292k770O1584Q0248R9692L3939P0014P7577
14592B80929m9914j9157j9729j7354q5839r0630q1132P602J14052m71l0621J2727
14580B0463M4207j8127L0902K6498l5930j08278p8921J49571R5025O1221r0136
14569I6495j334K7345j4454O7211p7545r0820l8326O5466j8148Q5590n8291j65872
14557a22683K5443J37952J5790K5827P3077n4977N6835Q7056j64008j74700r2622
14546a87010M8497P3506J3547p5774j2705j01470L3987N1236N8350J30449K11762
14535B44375J10814o2585j16513J2670N9735r6932j9275M0804m9591j74276j04609
14524a55383L8901L8632m4135k7882J05599J6386L0354N261M2090n8623q2776
$$ y = [66122, 67048, 27375, -61039, -98063, -139355, -142125, -80541, -293, 99399, 133338, 203352, 280929, 231015, 211858, 192129, 174775, 88936, -1694, -82826, -75224, 38828, 38357, 7736, 20463, 64670, 46543, 77445, 103943, 68013, -40265, -119186, 30385, 125410, 186631, 96495, 95161, 122506, 108052, 175263, 97718, 6898, -31428, 34038, 15890, 101480, 43189, -122683, -97240, 40712, 56502, 82329, 155406, 100429, 157264, 244320, 80312, -94388, -187010, -138513, -65007, -51460, -127234, -139939, -241409, -207422, -156186, -97836, 32613, 244375, 355189, 292604, 176091, 188761, 248496, 151564, 132289, 173093, 123502, -50774, -155383, -116482, -77850, -121985, -149867, -44268, -27882, 2472, 7733, 49823, -8800, -91576]
14513i1576j911j410j34687r4613J00953L4336L4997M8885j657r0208L3321M8535
14501a15035j8920k4925P384J13207M3460m9019p3593L6596R4432J1141J8740
14490D3468j13725j53593J5214J29004l3628q1455n2214P4100M1275k7627K9754
14479a29427n9978o9475K317K4207j3903M8170O3376P3679M8866P1033m9030j25052
14467a15217L0357O7348P11j6394J25304j1833j4296M3871p3351j7203n2604L0989
14455b318l6705j4960k285j0320J04065Q8683k9417p7186j3415l4438j5843M992
14443c9147J2730Q7703M3843m3504j4650j6920m4943k4979R7070J8700m0893K9092
14431F4102q887K0455N0484n8230N0332O6853K309p7762q8623k7175j8304K6731
$$ y = [-91576, -93487, -94897, -229584, -324197, -223244, -188908, -153911, -105026, -106683, -196891, -163570, -115035, -133955, -158880, -151496, -38289, 5171, -43848, -117441, -80845, 13587, 24728, 43468, -70257, -223850, -208636, -79632, -113260, -194715, -246929, -172829, -131554, -159181, -129427, -189405, -258880, -256563, -232356, -246259, -198089, -134713, -61034, -12168, 58865, 9835, -115217, -84860, -17512, -16801, -33195, 92109, 80276, 65980, 109851, 36500, 19297, -33307, -2318, -39023, -53983, -56268, -66588, 37477, 126160, 96743, 19557, 6142, -28296, -44139, -39147, -26417, 61286, 105129, 61625, 46975, 30055, -14888, -39867, 57203, 75903, 35010, 64102, 55215, 75670, 126154, 67924, 118256, 185109, 187418, 109656, 21033, -6142, -24446, 2285]
14419B285j7766l2637R046n7539n7047N8515J07109J71818P3812o9078j16437
14408G2081p7496J01655K1767n3132j81953j9653O8302R4q5237p08J9140J07545
14396b7595j8713m7640R3079N4467p4930r1539J18586N6442j21930m9550l2257
14385a41580Q4392M7310k517J40685J90420k4170m9037j37048j24372q9580K6788
14374g8709M9607M1671R080j8932o3332m8841Q0060Q8599p0820j9332n2571k545
14362h6065j9332o433J12644j26528o5988P6540M5590M5971Q6245p7243r3387
14351a07986N609n8853o7356p3669K170O7295J03058J09337M9350J2603J8184
14340E9742j17296L7745J27745R740j43560q6972j56968l9910J58566J69097J39174
$$ y = [2285, -15481, -48118, -39072, -96611, -153658, -95143, 11966, 183784, 257596, 188518, 72081, -5415, 96240, 118007, 64875, -117078, -136731, -68429, -68335, -153572, -154280, -135140, -27595, -46308, -93948, -869, 53598, -21332, -112871, 5715, 62157, -59773, -109323, -141580, -57188, -9878, -12395, 128290, 318710, 294540, 245503, 108455, -15917, -105497, -78709, -29102, 12569, 21649, 2717, -60615, -109456, -29396, 59203, -11617, -30949, -83520, -86065, -105397, -111830, 814, -125714, -191702, -115162, -69572, -23601, 62644, -14599, -107986, -102377, -161230, -228586, -302255, -300085, -232790, -129732, -20395, 28955, 41558, 59742, -57554, -19809, 107936, 117676, -25884, -112856, -269824, -309734, -151168, 17929, 157103]
14329A57103R48j30022M5390R6450M9206N1405q0506j07832j52260l2188k32774
14318c35080j34538J35699Q9635O3502P3673O7696R3210O5175j9047j11172j51680
14307a62927j11440l3719O0734J72935J58369R0561k4994j80312p6799K9905L1610
14296d6077O0851n3143o3375p1422R725J57797J25542Q1470k5659q7873j38242
14285e0406l1635K9385J42867J11137J03433l1151m1792o5408k10775K15L1610
14274a2520k7538j08220l3796P5374J8558L3485O1214P025N0358j3366r3834R5324
14262E2064j3246m5599M5929K7119p1299p3142o1063q332L0177k8314j7973R7332
14250f6347N3230j08700k8555K5982M794m1208q821M6810J26820J50349r3569
$$ y = [157103, 158051, 28029, 73419, 169869, 219075, 270480, 189974, 82142, -70118, -102306, -335080, -469618, -333919, -244284, -180782, -107109, -39413, 53797, 118972, 99925, -11247, -162927, -274367, -308086, -247352, -74417, 83952, 174513, 149519, -30793, -107592, -77687, -46077, 14774, -38369, -101744, -173166, -163441, -5644, 119898, 201368, 175709, 87836, -50406, -82041, -52656, 90211, 201348, 304781, 273630, 231838, 166430, -44345, -44130, -12520, -40058, -148278, -182074, -106700, -88142, -54657, 6557, 13582, 63940, 50574, -43260, 52064, 38818, -6781, 39148, 66267, -5032, -78174, -139237, -147569, -117392, -145706, -163679, -66347, -13117, -121817, -150372, -124390, -119596, -160804, -169625, -122815, 4005, 154354, 60785]
14239F0785o9796R8450m8540p8481O4734J1680j00472j14532Q0482Q0941N5898
14228D1149Q6756Q7072K3893j05012j9818J4282k8924j34235L6831O4925j2098
14217E4821j2012n8483q438q4724k9718P4214K597K1760l7476J03326M6974j64518
14205i1677o7735k6885L830J27519J39095L6199p1341m2735L0047r3455L9762
14194a7376Q6652o5477n6518J203p802P010J427M0175M1835M8701J03947l6785
14182A46992r5187o2633R1758r7065k583Q7016o0902j6383K9334l476q7318q6335
14170a56782R2195M8587R206j7823R185n243J18721L1744m0515n4148k4585O9121
14158G9663L7880q3695j06490l3155m268L890M2505O4069j9132n867m4127P877
$$ y = [60785, -9011, 89439, 40899, -37582, 27152, 38832, -61640, -176172, -95690, -14749, 41149, 127905, 214977, 238870, 133858, 114040, 128322, 99398, -34837, 1994, 66919, 54821, 42809, -15674, -24112, -108836, -138554, -64340, -61743, -39983, -77459, 25867, 72841, -91677, -159412, -186297, -182467, -54948, 84147, 120346, 49005, 6270, 36317, -57138, -17376, 69276, 3799, -52719, -51516, -59318, -52308, -50881, -10706, 31129, 79830, 183777, 146992, 51805, -10828, 80930, -16135, -18718, 68298, 7396, -8987, 20347, 16871, -70447, -156782, -64587, -16000, -6794, -24617, -15432, -20675, 98046, 129790, 89275, 35127, 10542, 79663, 117543, 33848, -72642, -105797, -110065, -106175, -63670, 399, -18733, -24600, -68727, -60850]
14146f0850J52941L6406n598K7309p9302m8053J12195K9335M8362r1375j29572
14135h202o0678P836P1282R6896n6005j81372k0851J41283Q7281n0887q6433m6717
14123a06567J04017R0950p9227j08594M3349N2635j00453o5900J18381J05302
14113E3893L5872P7048P5480M0387j57344j47011J27790Q6700j60949n2843k5435
14102d6412N371L3770J2840m7671o1644p5891q2620M8325J42875N6269k5249M5694
14090E657n3111q6400j2347R1368O2455o289m1064j0695o2936R5093J46615L2377
14078A60723j55428j06762l3794P8731L2170k3210l1908j5121N5600L1729Q5426
14067G8156O7001k5640l8578Q5095L1466r5302j43352k4347L5407j31361o597
$$ y = [-60850, 92091, 128497, 122899, 150208, 70906, 22853, 135048, 164383, 212745, 121370, -8202, -68880, -61044, 10238, 107134, 51129, -130243, -151094, -9811, 77470, 26583, -59850, -106567, -2550, 88400, 9173, -99421, -56072, -3437, -103890, -169790, -51409, 53893, 89765, 166813, 242293, 282680, 125336, -21675, 106115, 192815, 31866, -20977, -46412, -41041, -7271, 5569, -42102, -103746, -179637, -262257, -213932, -71057, -14788, -40037, 5657, -47454, -133854, -146201, -54833, 7622, 1333, -39731, -50426, -113362, -18269, 128346, 160723, 5295, -101467, -135261, -56530, -24360, -47570, -79478, -94599, -38999, -7270, 78156, 145157, 119517, 80939, 166034, 197500, 102198, -41154, -65501, -30094, -161455, -168052]
14056a68052N2938j21888J6833O6379j9329K5050N4578J17632j7542j19867R1034
14045b2234J8670j57272j84886Q8314K52689K01934J6284m0930j39750N6582Q2750
14034A72151j17160m4321N0097j06895M0102N236m3992l8984k0596j21429j37446
14023c63237M449R5001J85886M9649N3699m2489l8446L905P0214M3866J02985
14012A65482m3233j1096j2038M1902l1878q9819q171k02O3771J06438R6710J4886
14000B92752l0961m6737m7802n1360N239R9361N8025j00392l8805M396J52307
13989B96023q3066j23160j60041q1923L0991K5762J4001l126R059K3290N6281
13978D091Q2952J17304K7774o3568l2573M89p4459k3557O3897L2228N2208r7823
$$ y = [-168052, -115114, -237002, -220169, -153790, -173119, -148069, -93491, 24141, 6599, -113268, -22234, -3564, -160836, -345722, -257408, -4719, 197215, 213499, 172569, 32819, 89401, 172151, 54991, 10670, 60767, -46128, -6026, -790, -44782, -83766, -104362, -225791, -363237, -358788, -263787, -77901, -28252, 25447, -17042, -55488, -51583, 18631, 62497, 165482, 122249, 111153, 99115, 141017, 109139, 19320, 11149, 10947, 74718, 181156, 277866, 292752, 261791, 215054, 167252, 115892, 121131, 220492, 278517, 178125, 139320, 143716, 296023, 212957, 89797, -70244, -152167, -121176, -95414, -81413, -84539, -75480, -52190, 4091, 87043, 204347, 232121, 168553, 135980, 136469, 62010, 38453, 102350, 134578, 186786, 88963]
13966H8963k28660j32070M1630K3060Q1090J3084K4132l4891k786J09001k5446
13955d2893l0294O1492q7622j4074N5814Q3256J5366l7655L8376R5419J4151k3805
13943A27531o3017r8985m0088J06349J01694n9219n0083o5134L7979L5328j9095
13932A3260k5626k4693j080p038l0786o2850l3062M5300Q1311O22k8187L2564
13920d0265m8140o6178j8748k4177J11993M9726K8831j7372k7620O534M1046O846
13908B476Q664J07173M1890q1900p6300K2974P0511N8036j18430L8431M4341m4545
13896G3321r4184r5604m1788j9095M8089J40659n5405Q3077J41014p2685j06021
13885A378L8529j5797k5232l7745k5188R16L0678R9077J85005Q3863m9358R7833
$$ y = [88963, -139697, -271767, -230137, -207077, -125987, -112903, -88771, -123662, -126448, -17447, -42893, -73187, -11695, -99317, -113391, -57577, 25679, 41045, 3390, 41766, 137185, 151336, 127531, 64514, -34471, -74559, 31790, 133484, 74265, 24182, -40952, -2973, 32355, 13260, -12366, -37059, -38139, -45177, -75963, -138813, -171875, -126575, -45264, -44642, -72829, -40265, -88405, -154583, -173331, -197508, -85515, -35789, -6958, -24330, -51950, -45416, -4370, 2476, 11140, 118313, 160203, 78303, 2003, 24977, 95488, 153524, 35094, 73525, 117866, 73321, -20863, -116467, -158255, -177350, -129261, 11398, -44007, 39070, 180084, 107399, 1378, 39907, 24110, -1122, -38867, -64055, -63139, -32461, 66616, 251621, 335484, 286126, 383959]
13873C83959L0305o2753j19469j19350o4833j40392L4134Q0557m2425p4123j7531
13862a11921O302l2038M1517J15958Q2707j64465m0637Q8488o4229j0718J08568
13851A9532M5637N9393J00750k17200o9990k6593j9040L9502O9596J4282J23651
13840A39520l8888J24295J30377k2867n7697q1520r6192m6681L3054J08613n2070
13829A39944k11765p4801P7527K3653L0513j8974N5931j3124j31232l6254J2294
13818a46288J39720R246o7445J02045r7407j28945J39395q695q2648N7665N5448
13807b7909Q0862K0070K7950J9555P2104o2029j25893k6549L1329p964K0908r339
13795A3095N7917k5141o5122M014l2573R4588p8923j2799J29315M452o3982l0636
$$ y = [383959, 414264, 351511, 232042, 112692, 47859, -92533, -58399, 22158, -20267, -94390, -111921, -105619, -137657, -96140, 19818, 102525, -61940, -102577, -14089, -78318, -89036, 19532, 65169, 124562, 225312, 8112, -61878, -88471, -107511, -68009, 1587, 15869, 139520, 100632, 224927, 355304, 332437, 274740, 193220, 97028, 50347, 83401, 192014, 139944, -71821, -146622, -69095, -45442, -14929, -33903, 22028, 8904, -122328, -158582, -146288, -6568, 2678, -64767, 37278, -60129, -189074, -49679, -58374, -141022, -83357, -27909, 52953, 73023, 100973, 120528, 192632, 130603, 4710, -21839, 9490, 1526, 22434, 13095, 71012, 45871, -19251, -15237, -47810, 46778, -32145, -44944, 84371, 88823, 24841, -5795]
13783e795Q6417M936q5658J06966m968J5918N3109J8867j99838j90069J12837
13772h7278O9432l7132k5649K2116l3447Q3846m9740p148J06806j27185p179n565
13760i8123k5860O2024J03081m6547n6811j7700j122K7097j6574q525K5927L8805
13748a4328K8416o4860r1975N2201M1421M469J7213k8743j45064r305J28142m819
13736h7232q2469P5835J87575M4956o3160k8603K7711l9126J4397P9270L7834
13725A66988m3943j2268K4303k0845p335m2865m2180l6192j8870K8634J5272q8703
13713g8004K3739M6234O6180K3555o1760j5921N3285J4579O8221L4828k7325J3897
13701A61508J8542o0689p7002j49889r5322l2658J9895J0286J08117J0507l6660
$$ y = [-5795, 80622, 85558, -100, 106866, 101898, 117816, 170925, 189792, -10046, -200115, -87278, -17846, -54978, -80627, -58511, -91958, -8112, -57852, -65000, 41806, -85379, -92558, -98123, -123983, -61959, 41122, -5425, -62236, -79936, -81058, -53961, -70535, -79060, -53133, -14328, 14088, -50772, -142747, -90546, -49125, -44656, -27443, -56186, -201250, -210555, -82413, -87232, -169701, -93866, 93709, 138665, 75505, 46902, 74613, 35487, 49884, 129154, 166988, 123045, 110777, 135080, 114235, 106900, 64035, 21855, -14337, -33207, -4573, 10699, -78004, -54265, -8031, 58149, 81704, 19944, 4023, 57308, 71887, 140108, 174936, 147611, 161508, 180050, 119361, 42359, -107530, -202852, -235510, -215615, -205329, -97212, -86705, -123365]
13690a23365P3562N005m9142M1782J05834J02017Q6710j59240l3488o4587r8104
13679a13016k0364O2738J38486O1329M3355p6063j0906J31566j26098j28377l4193
13668g1543M4533M2007Q320n3892o2303J6447K0426R0246J80643m05k25122l2881
13656d3524j5861K921r1997K963R9278Q7996k4366j00758j97873r1893J31236
13645b41878P1546L633p852l4188N9644l4704M0777J72314k1778k6709n7626L8979
13633c7842J35515L5427L4778J3056J9210o8610K8908j07986j40431O2882J5800
13622i293m505N7101J03208J1727k4221j1986P328J16422j63151j55436n6320
13611a29126l0778L6439J9924Q87l1579R9842R3731l1270j53423j9139R5181k2456
$$ y = [-123365, -49803, -44798, -93940, -52158, 53676, 155693, 242403, 83163, 49675, -14912, -113016, -133380, -70642, 67844, 129173, 172528, 96465, 85559, 217125, 91027, -37350, -71543, -27010, 14997, 23317, -30575, -92878, -76431, -56005, 34241, 214884, 214479, -10643, -43524, -59385, -56464, -148461, -145498, -46220, 41776, 17410, -83348, -281221, -373114, -241878, -170332, -166699, -174551, -208739, -149095, -183799, -143022, 29292, 7514, -19195, -76821, -37842, 97673, 133100, 167878, 180934, 200144, 131534, 160442, 52456, -87975, -25093, -9293, -13798, 43303, 146511, 158238, 134017, 122031, 129359, 245781, 82630, -72806, -129126, -159904, -123465, -103541, -102654, -134233, -34391, 59340, 28070, -125353, -144492, -49311, -71767]
13599g1767j29833k9039J8913Q732q3525J5352K55040J66475q8703J6984J5349
13588I3978j23459m3802Q9942p854j45032o3936R0095l3205j1091k024P2627J03277
13576A9516N2237l6472j56677N7802N9859k3459o33j7834m6069M4980L8438m0357
13564d8669J00534j7594q1686n0092Q3521J32811M3264J3929j01991j6492P2250
13553A29785N6492k5963n9372n9777K4198R2989O3929m5425o3972K6175k9884
13542A09175K0831l0531k5862j02868n7818k9682J19168o5892l705Q8833J54553
13531A76202j7717j07502q9226M2775M3841j63828j19887L0848j1307m7810O3731
13520a99880j6992J01157p582J20022P0061n6210L1958Q075j7471Q7337l1972
$$ y = [-71767, -201600, -230639, -211726, -202994, -286519, -271167, -16127, 150348, 61645, 78629, 93978, -29481, -73283, 16659, 8805, -136227, -200163, -110068, -143273, -154364, -156388, -83761, 19516, 71753, 35281, -121396, -63594, -3735, -27194, -27827, -45661, -91730, -46750, -8312, -48669, 51865, 34271, -47415, -97507, -13986, 118825, 162089, 176018, 74027, 57535, 129785, 186277, 160314, 100942, 41165, 65363, 158352, 222281, 176856, 112884, 139059, 109175, 130006, 99475, 73613, -29255, -87073, -116755, 2413, -63479, -67184, 21649, 176202, 158485, 50983, -38243, 4532, 48373, -115455, -235342, -204494, -215801, -263611, -199880, -216872, -115715, -123297, -3275, 66786, 10576, 42534, 50609, 33138, 120475, 88503]
13509H8503j04816j22554Q7744J83082J72232k509j28108r0414j49825O547J6791
13498d3327j01400p8305n8873N5244J40626k9810J0980K6003p8091j4621O4610
13487a06964M1209J57559N8540k3894j11369L0161l9450m5105l8153j691Q1530
13476B373L408o7083l934R3076j8901j6615Q5104J14450J07081l5166o88n8386
13464B04719o5734J1702m536l5036j26228k5089K12663P0251R3243J5153j18601
13453B32507j06938q8773l5632K7148k4553O9006J1631Q3490K9632j8234j30490
13442D8794j37846O4030J62767J14347j2650o5061j71427l6968M123l2940J22183
13431E9352J09864k9274m3803k8648m7263n8070m8567p8064R961K1183J01169
$$ y = [88503, -16313, -138867, -51123, 131959, 304191, 301682, 173574, 83160, -66665, -60118, -43327, -144727, -223032, -281905, -226661, -86035, -115845, -104865, -78862, -156953, -171574, -106964, -65755, 91804, 150344, 126450, 15081, 45242, 5792, -39313, -77466, -79157, 2373, 5781, -61302, -65236, 27840, 8939, -7676, 77428, 191878, 298959, 263793, 263105, 204719, 138985, 150687, 146151, 111115, -15113, -40202, 172461, 242712, 335955, 351108, 232507, 125569, 36796, 1164, 28312, 3759, 72765, 84396, 167886, 197518, 179284, 48794, -89052, -25022, 137745, 252092, 239442, 174381, 2954, -34014, -29891, -62831, 59352, 169216, 139942, 96139, 67491, 20228, -37842, -86409, -164473, -154512, -133329, -32160]
13420c2160M3925N0900o9286j04613O7331P800o0438P8437P8323l7068P08J0436
13408C4295J30710N6284m7914o5680o0242k3782r961M5260K1298m3392M151R2782
13396A33809J6117k3862r6843q8552n157Q8538J35438J5462P4207l9286l3186
13385A76685q3013n7144o2816j3234J8673l208n3411J4776l7625J28368J99974
13374B28025N2690o9089k7130P2993j7188q0538k2735p1850j65114P7089L7987
13363A5140O795j3379L6776J7408J04218J21032q1128j09651j10679m0624J2600
13352d1492L3672l7155p8793J3316J14005J82779J5020n7771p7575l6349l7266
13341g609P9358N344O8804P0114l6722n9512q3203M8780R0077p494j35853j1608
$$ y = [-32160, 11765, 62665, -6621, -111234, -43903, -36103, -96541, -18104, 60219, 23151, 23859, 34295, 165005, 221289, 173375, 107695, 47453, 23671, 13710, 58970, 80268, 36876, 41027, 133809, 149926, 126064, 29221, -59331, -64488, 24050, 159488, 174950, 249157, 209871, 176685, 93672, 36528, -26288, -39522, -20849, -24057, -77468, -62692, -100317, 28051, 228025, 280715, 211626, 184496, 257489, 240301, 159763, 137028, 65178, -99936, -22847, 15140, 21935, 8556, 45332, 62740, 166958, 287990, 206862, 97211, -13468, -54092, -41492, -7820, -44975, -123768, -110452, 3553, 186332, 201352, 143581, 66006, 29657, -7609, 71749, 77093, 145897, 216011, 179289, 119777, 36574, 85354, 175431, 167937, 32084, 20476]
13329B0476P7391J8839j10864n7231o8937R1149q4336j7280R1093K2253p0029
13318h7476J4135M9263P9729J13329K8400p6886Q7814N9963j91961l3419L0040
13307G2931K4999J53482O9821j51560j12301j16469q3009j4433p75Q9333J9636
13296d8345J80717j50882j58948J32063L1647J62068n7828j81624k6820R1264
13286b6688J25386L6259j02196n1638m7710m519o2931Q4563Q1726P9167q8288
13275B3131j48747n7967j02667Q092N6819J6662j2605J25894p4905K6881k6630
13264a66042P2885J77236J50510r4068j25645L1185M421k2674P982o7946J6285
13253a5871L0600J64049j9235m2729n4479j10408k6779j7399P1281L6950n3319
$$ y = [20476, 97867, 116706, 5842, -51389, -120326, -29177, -113513, -130793, -39700, -17447, -87476, -73341, -24078, 55651, 168980, 197380, 120494, 208308, 268271, 76310, 42891, 72931, 97930, 251412, 321233, 169673, 57372, -59097, -142106, -156539, -157314, -67981, -48345, 132372, -18510, -177458, -45395, -13748, 148320, 90492, -91132, -117952, -26688, 98698, 134957, 32761, -18877, -66587, -71106, -134037, -49474, 32252, 111419, 23131, -125616, -183583, -286250, -278158, -221339, -204677, -217282, -91388, -166293, -139412, -166042, -93157, 84079, 234589, 140521, 14876, 46061, 50482, 27808, 35790, -32156, -15871, 14729, 178778, 159543, 116814, 62335, -48073, -74852, -92251, -20970, 15980, -37339]
13242c7339L8818n600Q5315k8896k3909j9983L1161N7926K3169q5454j16503J3442
13230f7853P2522J00350N6673K5481R598o1423n2737p3212M8930J26768P107n1888
13218A40316P5270m2319m4496M3811K2412o4967M3700M7880J6190m9487L6584
13207B24894j06408L1990J22646L5295l6837r9691j2030n5815p1226K9102m1193
13196B0727r8910j7404O5951N3523P6279Q5878J2123r5569o5753o1514k377M1222
13184A4176j40017j1888J31592P4358J06367k703o7748p1379Q8143O9470j4419
13173A75952l6735l2947m3701p1813L1987L432O3255J25898o7266j20956l9175
13162a2069N7965m2888Q5397P8979k3431j54078j26851j51J32766R0950l454j11845
$$ y = [-37339, 1479, -4121, 81194, 52298, 28389, 8406, 39567, 97493, 120662, 35208, -81295, -67853, 4669, 105019, 161692, 187173, 196771, 135348, 82611, 9399, 58329, 185097, 192204, 140316, 215586, 173267, 128771, 172582, 194994, 130027, 173727, 221607, 237797, 188310, 224894, 118486, 150476, 273122, 308417, 271580, 171889, 159859, 104044, 32818, 61920, 20727, -78183, -95587, -29636, 23887, 100166, 186044, 198167, 102598, 36845, -24669, -27046, 14176, -125841, -137729, -6137, 68221, 174588, 171885, 104137, 32758, 120901, 190371, 175952, 139217, 106270, 62569, -9244, 22743, 26175, 89430, 215328, 148062, 27106, -12069, 45896, 3008, 88405, 167384, 143953, -10125, -136976, -137127, -4361, 86589, 83135, -28710]
13150b8710k3304L1619j06972J6317J10896Q0391J39542J72801q758j13631j52864
13139A17327m6553n8815o3738P4019O9102J18303J74763k9560j27124q4460J16905
13128B60169L2887j46214m4471j8892n9583K042m7258J46342O7768p4924j80693
13117f2827J30297J5209n3034m5020Q8061Q9999o3067k823J22612P8170l4433
13106B63144n0319J04149R075l9608j08262q9859j9772q4713P2597R4499L5084
13095A86015J0689N6147J65140J39013Q634k500r8872n8024K7577Q8125P0294
13084E92238Q2194j3292J77822J93970K50473L91762L69917L94095K39367j38118
13074B540428m48240m88866l70692j96848j65261j05638j34219o7244p3157m6635
$$ y = [-28710, -52014, -20395, -127367, -111050, -154, 80237, 219779, 392580, 383822, 270191, 117327, 70774, 11959, -51779, 22240, 91342, 209645, 384408, 354848, 227724, 143264, 260169, 293056, 146842, 102371, 83479, 23896, 25938, -21320, 125022, 192790, 117866, -62827, 67470, 82679, 29645, -15375, 72686, 162685, 99618, 96795, 219407, 297577, 263144, 212825, 316974, 326049, 286441, 178179, 88320, 68548, -16165, 56432, 150931, 186015, 196704, 252851, 417991, 557004, 565638, 563138, 464266, 406242, 433819, 521944, 592238, 674432, 661140, 838962, 1032932, 1283405, 1675167, 2045084, 2439179, 2678546, 2540428, 2092188, 1603322, 1232630, 1035782, 870521, 764883, 630664, 563420, 490263, 443628]
13064D43628m7989m0193j01002m877J12453o6116q7166J00308l9332J6953j5886
13053B70781o1864r080M8420k2101O4332L8260o0652o7963l4408J8057L0465N7837
13041B72084P8844J19100q2983j16396j01868J9805m6288p5277n0664j24952n9972
13030a68567J15858J29776q168k9799L9979p2094J7412M8875r1259m88J70868
13019A52393L9165J19629j5585j05554R03k8410p5830K0403O3300J49266P551
13008C27231n0220k286K6383K6827o9076P4304P3022R696k4838L7748N7750m8026
12996D38515o9694J56361O6252J05378J50839J61841L80734L39113N00147O83363
12986B912849P90719Q37801N53047k24149r09945r40326p71292n43399l22343
$$ y = [443628, 395639, 355446, 254444, 249567, 362020, 295904, 208738, 309046, 269714, 286667, 270781, 208917, 199837, 248257, 226156, 290488, 328748, 268096, 200133, 165725, 183782, 214247, 272084, 350928, 470028, 387045, 270649, 168781, 188586, 142298, 67021, 16357, -108595, -168567, -52709, 77067, 68899, 39100, 79079, 6985, 24397, 73272, -17987, -18475, 152393, 191558, 311187, 295602, 190048, 190951, 162541, 86711, 107114, 170414, 319680, 327231, 277011, 274725, 301108, 327935, 258859, 333163, 406185, 415881, 391043, 428791, 486541, 438515, 368821, 525182, 591434, 696812, 847651, 1009492, 1390226, 1729339, 2229486, 2912849, 3703568, 4541369, 5094416, 4870267, 3960322, 3019996, 2248704, 1705305, 1382962]
12977A382962j59206j06195j86244n3211j40512j90610l7744l7509O3683j0528
12967E24886j13436j22001R0242P7079l7542j200m5891l8954k7256J7561j8464
12956C05024J40143Q9706R5415p2359j72438j49805p1660O3175J92508j8908n9603
12945C41198n4382R9519K0011j18579k3182N9491j30724K4798J54061k651j6264
12934C53296q2667q8964k3330P4330k6051J30751P3962q4723j21252q1788n5216
12923F8348l6067O3231J22022j42404j8944k2040J035k9433q9397J51929J88085
12912B56365K1054l0924j51309k0038N5885N9639m3957L2393L5472M9363N6152
12901C20095K7535j00478R921J04959l1653P7652R0727j50401L74m9289k5562
$$ y = [1382962, 1223756, 1117561, 931317, 878106, 737594, 546984, 509240, 471731, 535414, 524886, 411450, 289449, 379691, 456770, 419228, 418028, 372137, 333183, 305927, 323488, 305024, 445167, 534873, 630288, 557929, 385491, 235686, 164026, 227201, 419709, 400801, 341198, 286816, 386335, 406346, 287767, 264585, 324076, 193352, 218150, 372211, 369560, 353296, 270629, 181665, 158335, 232665, 206614, 337365, 411327, 326604, 205352, 123564, 68348, 32281, 95512, 217534, 75130, 56186, 34146, 35181, 5748, -83649, 68280, 256365, 277419, 246495, 95186, 75148, 131033, 190672, 146715, 179108, 214580, 263943, 320095, 347630, 247152, 257073, 362032, 330379, 408031, 498758, 348357, 348731, 299442, 273880]
12890B73880J3399j409n0385j0094J32794k1848N453j8503J10245j6323n3321
12879C63888R6204K1091m4195N7758J7722k0450M0354R6405Q7925j6845k4084
12868F75773R8832L6119k2513p9570j50647l0274j00083j33990L3775J36406j6041
12857D47787j44741j45121Q1764J18514J22849O0265O1213r3945j70025r3693
12847B44867J7087J53559O5838r2436n5121p7570j5655J9737j9426j2022M9451
12836B78309J7389O3874j25388n8728l1500l005P7668J117Q1380N9683J00480
12825D61279j2037m5216l7892k3911J66424K9236j08439p0456n3089K4895q5478
12814B45316q8437J0348Q0903J17739J10239K8055j7435p3040J2400K2188j31936
$$ y = [273880, 287279, 285870, 235485, 225391, 358185, 336337, 341790, 323287, 433532, 417209, 363888, 460092, 481183, 436988, 494746, 512468, 492018, 532372, 628777, 716702, 699857, 675773, 774605, 810724, 788211, 708641, 557994, 527720, 427637, 293647, 327422, 463828, 447787, 303046, 157925, 239689, 358203, 481052, 541317, 602530, 508585, 338560, 244867, 261954, 415513, 481351, 388915, 333794, 256224, 240569, 260306, 240880, 228858, 278309, 295698, 359572, 234184, 175456, 143956, 140951, 218619, 219736, 301116, 360799, 461279, 449242, 404026, 366134, 342223, 508647, 537883, 429444, 358988, 305899, 330794, 245316, 156879, 167227, 248130, 365869, 476108, 504163, 486728, 413688, 426088, 448276, 316340]
12803C16340n021n738j2459k9963o4123q0628P9826L0132n6705L2191J09404R4908
12791D08164K114J1851J32355l0584q4167q2604r3887K2191J406J7055l1908k137
12779B69849J96819l0762k16438j03000R0338J31775O5284K18224J09780j02725
12769F29144K2968J19700K8206o993n1358j05855p6393j22253j75178k491J02017
12758C61514l6839L8971J77696J13178O6950j4580q8061o6897k7739O4019m9700
12747E38512N3462J56761l8441o3029j26486j05287q0617p7368j42989m2556m6703
12736B5259p1937N6617P8545R2255L8230O3977j00J51680J42510q913l5155n9854
12724D73114j29362R76R5036R7884l9491N592L4164k9793J14926r1383q3365k0645
$$ y = [316340, 311319, 305581, 293122, 263159, 199036, 118408, 198234, 228366, 171661, 203852, 313256, 408164, 410278, 422129, 554484, 523900, 439733, 357129, 263242, 285433, 286839, 303894, 271986, 269849, 466668, 435906, 219468, 116468, 206806, 338581, 403865, 622089, 731869, 629144, 652112, 771812, 800018, 793025, 741667, 635812, 559419, 437166, 261988, 259497, 361514, 324675, 363646, 541342, 654520, 721470, 706890, 618829, 551932, 524193, 588212, 538512, 591974, 748735, 710294, 647265, 520779, 415492, 334875, 257507, 114518, 71962, 25259, -46678, 9939, 88484, 180739, 218969, 282946, 282846, 434526, 577036, 568123, 532968, 473114, 343752, 344728, 439764, 537648, 498157, 503749, 537913, 508120, 623046, 531663, 448298, 427653]
12712D27653j4555K108j5105O2676r3534m814K08677P7846J87262J3800l9097
12701H12917o2385n8421M0307L2781Q5377q1555M9104M4628o3930m6179P9967
12690H32611J35133R7141K9890l9325R1345M212q3474j09711Q19M948J9691J23984
12678A107264J13432o3644r3219K8020N9682J40146J3151J6644O3250J12098P9853
12667A576677J85182N5175O1325J04038l2355p9988m948J33816J81405K09261
12657B389588K28094Q7271J09259J22412K56049O5695J17928J84438K85752L68788
12647D215274J77882J24901K36373N54372N03305M20526M56655N82670N94877
12638G866835O50470P39498R04960J258377J264314J341144J690738K043179K315407
$$ y = [427653, 413098, 415206, 400101, 462777, 369243, 364429, 573106, 650952, 838214, 852014, 812917, 750532, 692111, 732418, 765199, 850576, 769021, 818125, 862753, 798823, 752644, 832611, 967744, 1064885, 1094775, 1055450, 1146795, 1151007, 1067533, 957822, 958641, 963589, 983280, 1107264, 1220696, 1157052, 1063833, 1091853, 1151535, 1291681, 1304832, 1321476, 1384726, 1496824, 1576677, 1761859, 1817034, 1878359, 1982397, 1950042, 1870054, 1865106, 1998922, 2180327, 2389588, 2617682, 2704953, 2814212, 2936624, 3192673, 3258368, 3376296, 3560734, 3846486, 4215274, 4393156, 4518057, 4754430, 5308802, 5812107, 6232633, 6689288, 7271958, 7866835, 8517305, 9256803, 10161763, 11420140, 12684454, 14025598, 15716336, 17759515, 20074922]
12629B0074922L009449L689356M386480N246676N663016O932394R189568J2370679
12621G0562540J6964712K3628759L2717482M5991030O3572145Q3351924R7814165
12614D34602757R0651241K5656185q2496117j09789162q7125575o3205210m5285559
12607A63008560l2819564k4140562j8050145j3612969j0453195q252491o585072
12600D9094562n581240n085181m586420l830224l260093k825143k416441k028094
12592A9481726j508178j423095j242481j167150j070418p87878p21034p25336
12584A0836156o56405n95586l62316m38521m65409m66576k58763j60000l66203
12575G066377m18046k29495j50416k04213j22367m4992n7473k29031j45904r3709
$$ y = [20074922, 23084371, 26773727, 31160207, 36406883, 42069899, 49002293, 58191861, 70562540, 87527252, 111156011, 143873493, 189864523, 253436668, 336788592, 434602757, 525253998, 550910183, 468414066, 358624904, 271499329, 208294119, 163008560, 130188996, 106048434, 87998289, 74385320, 63932125, 55679634, 49094562, 43513322, 38428141, 33841721, 30011497, 26751404, 23926261, 21509820, 19481726, 17973548, 16550453, 15307972, 14140822, 13070404, 12282526, 11561492, 10836156, 10179751, 9584165, 9221849, 8783328, 8317919, 7851343, 7592580, 7432580, 7066377, 6648331, 6418836, 6268420, 6064207, 5941840, 5896848, 5839375, 5610344, 5464440, 5370731]
12565E370731o4200K9459L08319M27664K27288K91794N01223N66803J85603k98322
12555G546362n75908p23039o43481n21818m36602l67226k27223k04167k83647
12546C563251j88032j67921q4362J17829J07624j79380k22491j24488j09783j31557
12536B580690o6776q9070J06176O4481j08467m2364M7355J50609j9056o2103m0554
12525B520921p1263O7362m7654k8043j8831j70932o299K7176J45467M5333j66266
12514B296971j52981l2351N4569j2928J32184q3275j01438L6915r1008j6836O1146
12503B090968O4864L8907r1588o2246l7879m2990O8241M5494N8775n6758o6166
12492B009622M2856J27912J77148J09353J57548N1806j67457q0143j11192j64796
$$ y = [5370731, 5306531, 5335990, 5644309, 6071973, 6299261, 6591055, 7092278, 7659081, 7844684, 7546362, 6970454, 6247415, 5603934, 5082116, 4645514, 4278288, 4051065, 3846898, 3563251, 3375219, 3207298, 3122936, 3240765, 3348389, 3169009, 2946518, 2822030, 2712247, 2580690, 2513914, 2424844, 2531020, 2595501, 2487034, 2444670, 2492025, 2642634, 2623578, 2561475, 2520921, 2449658, 2517020, 2469366, 2441323, 2422492, 2251560, 2245261, 2272437, 2417904, 2463237, 2296971, 2143990, 2111639, 2166208, 2153280, 2285464, 2202189, 2100751, 2137666, 2046658, 2029822, 2090968, 2155832, 2194739, 2103151, 2040905, 2003026, 1960036, 2028277, 2073771, 2132546, 2075788, 2009622, 2052478, 2180390, 2357538, 2466891, 2624439, 2676245, 2508788, 2428645, 2317453, 2152657]
12482B152657j00245m8498j29697n7934L9618m0870j4713J9579J2104o6596k813
12471A762592J135m9393j4321N2266o9409j9445N1132K9918k0428p86n926M5325
12459A762660m7659m3712M1725J6485J11096p3061k10448j96400O2924O4698M0417
12448A528725l0697p7924Q9310N2337m353P5671q9934q1305J35571J64077L0223
12437A791701n5111r6510l8261k0951m6442m1482K8954N0147O0176K7757n942
12426A654036j7981l8482j396O3225l4983j09378N6992M8931l954J11800J10598
12415A839408O3245p1602j58523k0953j0957o1654j8228j04587j7989J02078M9921
12404A590159o802K13834Q3274j6956p196J01820j32177r2805j5504J19317K6579
$$ y = [2152657, 2052412, 2003914, 1874217, 1816283, 1855901, 1815031, 1800318, 1819897, 1832001, 1765405, 1762592, 1763727, 1714334, 1700013, 1752279, 1682870, 1663425, 1714557, 1744475, 1724047, 1723261, 1717335, 1762660, 1715001, 1671289, 1713014, 1729499, 1840595, 1767534, 1557086, 1360686, 1423610, 1488308, 1528725, 1498028, 1420104, 1509414, 1561751, 1557398, 1633069, 1543135, 1461830, 1597401, 1761478, 1791701, 1736590, 1640080, 1601819, 1580868, 1534426, 1492944, 1521898, 1572045, 1632221, 1659978, 1654036, 1636055, 1597573, 1596177, 1659402, 1624419, 1515041, 1572033, 1620964, 1617010, 1728810, 1839408, 1902653, 1831051, 1672528, 1651575, 1640618, 1578964, 1560736, 1456149, 1438160, 1540238, 1590159, 1583357, 1797191, 1880465, 1863509, 1856313, 1958133, 1825956, 1733151, 1717647, 1836964, 1863543]
12393A863543j234r7496j36075J6364q188q4737P2341P2011J10436j0736J15010
12382A911239j09356P6111Q6465j4535r2643j01374p6093J3564O8411R674M5838
12371A817301L4558K2185n7818n8669p5248M5917Q460M7692N0698K1965N9065
12360A916106Q7855k5644p9500L329K2856K0349k9248P8530K2672K6480j56739
12349A887046r8076q2704N0254J954O0441Q8818r0993j414R2851K3065q9193k2753
12337A819296k6345K8076j166n7798j1610L3298J5902o4949J1449p876L3569Q5694
12325A857540l2902L7869J29744j0845o3032k1179J04742m4904L854Q1318p9274
12314A962931k0411L9205R3024J50379J41060L5649J14143P105j13369j23091
$$ y = [1863543, 1862309, 1764813, 1628738, 1645102, 1636914, 1552177, 1624518, 1696529, 1806965, 1796229, 1911239, 1801883, 1877994, 1964459, 1949924, 1857281, 1755907, 1679814, 1693378, 1761789, 1771463, 1817301, 1851859, 1874044, 1816226, 1757557, 1682309, 1728226, 1736686, 1784378, 1835076, 1857041, 1916106, 2003961, 1978317, 1898817, 1902146, 1925002, 1945351, 1916103, 1994633, 2017305, 2043785, 1887046, 1788970, 1706266, 1756520, 1758474, 1818915, 1907733, 1816740, 1815326, 1908177, 1931242, 1842049, 1819296, 1792951, 1821027, 1819861, 1762063, 1750453, 1783751, 1799653, 1734704, 1746153, 1738277, 1771846, 1857540, 1824638, 1862507, 1992251, 1981406, 1918374, 1897195, 2001937, 1957033, 1960887, 2042205, 1962931, 1942520, 1981725, 2074749, 2225128, 2366188, 2401837, 2515980, 2523085, 2409716, 2286625]
12304B286625P750j5560o2065k2685n3577k789N1629L4622O6171N4822m5521l0003
12292B269419J23554k8888k3363o7350J2792j6853q71O7479q3697K2354J26612
12281B401188L3765L2831m2577q246P0585j15192m7668N7025Q8098Q3363J16323
12270B669495j3875j54457n435R2958Q7552r0691k1389O7829M4394j2564J5334
12259B679151n9997M4051M4113j9623M3032j8156r2513L7574O3990n6196J994
12248B667420J50548K0806P903J8144o752N2831n8404n5818J04440M4255q0124
12237B865249n2960j5344O631j33770M0195J50019J16501o2061L9407P1655J59656
12226C185178q8714j79296Q2141P2505L3662P8995o1578N8577K10669k0560p6086
$$ y = [2286625, 2294375, 2278815, 2216750, 2194065, 2140488, 2137699, 2189328, 2223950, 2290121, 2344943, 2299422, 2269419, 2392973, 2364085, 2340722, 2273372, 2286164, 2269311, 2268440, 2335919, 2252222, 2274576, 2401188, 2434953, 2467784, 2425207, 2416961, 2487546, 2372354, 2324686, 2381711, 2469809, 2553172, 2669495, 2655620, 2501163, 2495728, 2588686, 2676238, 2585547, 2564158, 2631987, 2676381, 2663817, 2679151, 2619154, 2663205, 2707318, 2687695, 2730727, 2712571, 2620058, 2657632, 2721622, 2665426, 2667420, 2817968, 2838774, 2846677, 2864821, 2858069, 2910900, 2852496, 2796678, 2901118, 2945373, 2865249, 2812289, 2796945, 2803576, 2669806, 2710001, 2860020, 2976521, 2914460, 2953867, 3025522, 3185178, 3096464, 2917168, 2999309, 3071814, 3105476, 3184471, 3122893, 3181470, 3392139, 3371579, 3295493]
12215C295493j681Q774M5830L2208M986m9742j04153J01255l6893J40365J31116
12204C567558j2941m4565P0664m9186p0317m1776j29822r1403R5900K09667J13311
12193C617090l8488o8842m2407Q5393O4773n6050j3124R840J2525m2045J06771
12182C635436R3594K9660J29418N9527m3235L8708m5620k6173J1238k5737M7173
12171C903989M1484M6351J67352N1212N9013J6255K4180O0412j10849L8128Q0953
12160D378480j3536M1682J639J3453J6111J6600Q2490J40674J70508o955P7193
12149D918339J86256K43129L37911K39172L76195M60175L51349k0502k13776m67486
12139F410762m89412l86290j28859K86j38013j27573p4763j1223N8425J6900R4608
$$ y = [3295493, 3293812, 3302586, 3348416, 3380624, 3385610, 3335868, 3231715, 3332970, 3296077, 3436442, 3567558, 3554617, 3510052, 3580716, 3531530, 3461213, 3419437, 3289615, 3198212, 3294112, 3503779, 3617090, 3578602, 3509760, 3467353, 3552746, 3617519, 3561469, 3548345, 3558185, 3570710, 3528665, 3635436, 3729030, 3758690, 3888108, 3947635, 3904400, 3943108, 3897488, 3871315, 3882553, 3856816, 3903989, 3945473, 3991824, 4159176, 4210388, 4269401, 4285656, 4309836, 4370248, 4259399, 4297527, 4378480, 4364944, 4406626, 4408265, 4421718, 4437829, 4454429, 4536919, 4677593, 4848101, 4841146, 4918339, 5104595, 5347724, 5685635, 5924807, 6301002, 6761177, 7112526, 7092024, 6878248, 6410762, 5921350, 5535060, 5406201, 5406487, 5268474, 5140901, 5066138, 5054915, 5113340, 5130240, 5224848]
12128E224848p7600m9038o983j1115L7514M2316K8530k5175J8966O6369Q6849
12117E335481J960R9259K2913j5565K9303r0728q4501J5955R878p8460J16699
12106E362194K24307P4463j20332j1734K06783M7360l3731l9131k7520M2294M2233
12095E767186k946Q3999L5763P6862k0287l2369K0270K0950J5776K5427O2533
12084F053164N0339J266o3401L0339J35687N8775J35509J30407L2390R8393j51783
12073F511085k5452P452j08209J7588J21466J4895R7656N1356K3050k6300N0559
12062F735146m7655n6095O2146n4430K2576J57013j6999J5030m2947O0472J54745
12051F989002m8970L7068k736p158N6216n3574o3702r2675n5991O3576P2601p337
$$ y = [5224848, 5147248, 5098210, 5091227, 5080112, 5117626, 5159942, 5188472, 5163297, 5182263, 5248632, 5335481, 5337441, 5436700, 5459613, 5444048, 5473351, 5382623, 5298122, 5314077, 5323955, 5245495, 5362194, 5586501, 5660964, 5540632, 5528898, 5735681, 5783041, 5749310, 5710179, 5682659, 5724953, 5767186, 5764240, 5848239, 5884002, 5960864, 5940577, 5908208, 5928478, 5949428, 5965204, 5990631, 6053164, 6103503, 6104769, 6041368, 6071707, 6207394, 6266169, 6401678, 6532085, 6564475, 6662868, 6511085, 6485633, 6493085, 6384876, 6402464, 6523930, 6538825, 6636481, 6687837, 6710887, 6684587, 6735146, 6687491, 6631396, 6693542, 6639112, 6661688, 6818701, 6801702, 6816732, 6773785, 6834257, 6989002, 6940032, 6977100, 6974364, 6967206, 7023422, 6969848, 6906146, 6813471, 6757480, 6821056, 6893657, 6886320]
12039F886320O2437R5201O46N6375J16675J20402L1152l4453j7717K02656q8313
12028G431381k12934N4858K13914J29214r635O595Q2022J64637J0363n5875l1927
12017G782613p098j12084l9313P4978j7083O1952O9660J50220Q6107J0890j21392
12006G939450q8902M5359R0296J06430O3203K8933N9072N81J9009q8940j89866
11995G984625M0850j0030O0069Q5133L4983J13252N90M1617p2578K2291P7634
11984H378436m541m802L8925n0971j7973J9851k8263j41109P1818J27O3737J49219
11972H474454l139o5989j3428j6706j31420r9256n9752J06356J45039M8376j7606
11961H366929r625K5415L6378l711L8861P2076q4108o7042j080M1397P1001N4434
$$ y = [6886320, 6948757, 7043958, 7044604, 7100979, 7217654, 7338056, 7369208, 7334755, 7317038, 7519694, 7431381, 7218447, 7273305, 7487219, 7616433, 7606798, 7613393, 7695415, 7860052, 7870415, 7814540, 7782613, 7775515, 7663431, 7624118, 7699096, 7682013, 7743965, 7813625, 7963845, 8049952, 8060842, 7939450, 7850548, 7895907, 7986203, 8092633, 8155836, 8184769, 8243841, 8244422, 8263431, 8174491, 7984625, 8025475, 8015445, 8075514, 8160647, 8195630, 8308882, 8309472, 8351089, 8278511, 8300802, 8378436, 8373895, 8369093, 8408018, 8357047, 8339074, 8358925, 8330662, 8189553, 8261371, 8261498, 8325235, 8474454, 8471315, 8405326, 8391898, 8375192, 8243772, 8144516, 8084764, 8191120, 8336159, 8384535, 8366929, 8357304, 8382719, 8419097, 8415386, 8454247, 8526323, 8442215, 8375173, 8374093, 8415490, 8486491, 8540925]
11949H540925p1267q6298R7911J29361m8040o6466k9466o6248M40m217r8088j10305
11937H188242O9450Q9669k1824m9769q0171k6275K3478Q1146l6005j5142K2579
11926H245378M4909j9228q3915m6300O645j9510N4786J27567j0700r3245M243
11915H210630l8365j82408o1386q6841J21925P0184j41962p0504p5080j03925
11905G642268n5847L9116R1934n3510n0391M6250O9955p6705j15611m3622L6983
11894G530820J9913N7896j6478q2709p4068j34955r5609l6899j22359O2706k8343
11883G079915M6779k6503P8572J32855N5465j1390n9535j05012k1557P7089j0795
11872G235883j1953o1750o1273j27557K3316j02291j32360o7357j00534M8108
$$ y = [8540925, 8469658, 8383360, 8481271, 8610632, 8562592, 8496126, 8466660, 8400412, 8400852, 8396635, 8298547, 8188242, 8257692, 8347361, 8325537, 8275768, 8195597, 8169322, 8192800, 8273946, 8237941, 8222799, 8245378, 8290287, 8271059, 8187144, 8140844, 8147489, 8127979, 8182765, 8310332, 8299632, 8206387, 8210630, 8172265, 7989857, 7928471, 7841630, 7963555, 8033739, 7891777, 7821273, 7746193, 7642268, 7586421, 7625537, 7717471, 7663961, 7613570, 7659820, 7729775, 7653070, 7537459, 7493837, 7530820, 7550733, 7608629, 7592151, 7509442, 7435374, 7300419, 7204810, 7167911, 7045552, 7108258, 7079915, 7126694, 7100191, 7178763, 7311618, 7367083, 7355693, 7296158, 7191146, 7169589, 7246678, 7235883, 7223930, 7162180, 7100907, 6973350, 6996666, 6894375, 6762015, 6694658, 6594124, 6642232]
11862F642232J9654j8460j0347Q0142r5763o8759O4639p227r4953n8989J3690
11851F465859J78884n3552j61784r3760K9378L6796l4501o4560n9243l5126j11935
11840F096456o3885O1798N6921L2543n2824j46037l6753J1180K6603J0305r2416
11829E903891j289k8754j42468K6208N3736r8585j05569K0105J3371j8443k7450
11818E594753o7625l7792N3793O1694R756q3851q7261l0093m2154j3594m8294
11807E309332n9172k3090r2934j9320K006n304J5324J18298L2367k10459j24571
11796D942477m4181l782O914n7314j71519l0105K6910O591J6718J5788N161j3067
11784D700591J5015k3840k03719M4665J12428r7433o2170J22056L2583j42567
$$ y = [6642232, 6661886, 6643426, 6633079, 6713221, 6617458, 6548699, 6613338, 6606111, 6511158, 6452169, 6465859, 6644743, 6591191, 6429407, 6335647, 6365025, 6401821, 6367320, 6302760, 6243517, 6208391, 6096456, 6032571, 6094369, 6151290, 6183833, 6131009, 5984972, 5948219, 5959399, 5986002, 5996307, 5903891, 5902602, 5873848, 5731380, 5757588, 5811324, 5712739, 5607170, 5627275, 5640646, 5622203, 5594753, 5527128, 5489336, 5543129, 5604823, 5614579, 5530728, 5443467, 5413374, 5371220, 5357626, 5309332, 5250160, 5227070, 5134136, 5114816, 5116822, 5111518, 5126842, 5245140, 5277507, 5067048, 4942477, 4898296, 4894514, 4901428, 4844114, 4672595, 4642490, 4669400, 4675991, 4692709, 4708497, 4713658, 4700591, 4715606, 4691766, 4488047, 4532712, 4645140, 4547707, 4485537, 4607593, 4640176, 4497609]
11774D497609K1974R4189K7123p198l2647j22647j19558j50001J8073n8945K692
11763D170664m1765o2471J02323k3914n5796j4210J1840n530m8787P626J8096
11752D058076P8701p6103p7741M9330P8457j06210k2637P9726j7267m3443j45690
11741C855199p0899N4428j03551k9422O6146J9920j35007j45505k5228k1506L2642
11730C497217P7816q7333k6490O5888L8474L4924J683J42524j5756o6971j51051
11719C510925q4083j44087J5693K5794P0996N5296m1301o9356p1016N1129n2934
11708C267056M0569J007j51095k6861q7081j69709j28406J07508J56369N8471
11698C067828q3790P1335L5921p1162j40970r8295P476K7103M1525o0908k4263
$$ y = [4497609, 4519583, 4613772, 4640895, 4633697, 4601050, 4478403, 4358845, 4208844, 4226917, 4167972, 4170664, 4128899, 4066428, 4168751, 4144837, 4089041, 4074831, 4086671, 4081141, 4032354, 4039980, 4058076, 4136777, 4060674, 3982933, 4032263, 4110720, 4004510, 3981873, 4061599, 4044332, 4000889, 3855199, 3784300, 3838728, 3735177, 3705755, 3771901, 3791821, 3656814, 3511309, 3486081, 3464575, 3497217, 3575033, 3487700, 3461210, 3527098, 3565572, 3600496, 3602179, 3744703, 3728947, 3661976, 3510925, 3426842, 3282755, 3298448, 3324242, 3395238, 3450534, 3409233, 3339877, 3268861, 3319990, 3267056, 3307625, 3308632, 3157537, 3130676, 3043595, 2873886, 2745480, 2852988, 3009357, 3067828, 2984038, 3055373, 3091294, 3020132, 2879162, 2780867, 2788343, 2815446, 2856971, 2796063, 2771800]
11687B771800p0197j35487L7636J40870J16410N2699m109j27302j43577j58846
11677B479897O3202J6658J8620N4304p2096m9733O1072K2227J4153n3858m6363
11666B508083J9998N3090q3146j29430n3453M3286L4441j765j50001q1758l7333
11655B122012N2655J86413J83349Q312q5945l4307j11933k8849p366k8031q1505
11644B174805l522M000k1449K0158P3827P2286r4673K66q9559j03332L3105l3078
11632B032834K2663r1398j9968M0386P140K6769p0247M491J10500J30522r7998
11621B095694N523o6466J2742N7058L0881k7209l1948q5863o4259P3043m3731
11610A955465j4393L7794l3181j4772J2370k6919j31943m9819p5761P1225J18407
$$ y = [2771800, 2701603, 2566116, 2603752, 2744622, 2861032, 2913731, 2909622, 2782320, 2638743, 2479897, 2543099, 2559757, 2578377, 2632681, 2560585, 2510852, 2571924, 2594151, 2608304, 2554446, 2508083, 2528081, 2581171, 2498025, 2368595, 2315142, 2358428, 2392869, 2391104, 2241103, 2159345, 2122012, 2174667, 2361080, 2544429, 2552741, 2466796, 2432489, 2320556, 2291707, 2284341, 2256310, 2174805, 2171283, 2175283, 2153834, 2173992, 2247819, 2320105, 2225432, 2225698, 2136139, 2032807, 2065912, 2032834, 2055497, 1964099, 1944131, 1984517, 1991657, 2018426, 1948179, 1952670, 2063170, 2193692, 2095694, 2101217, 2034751, 2047493, 2104551, 2135432, 2108223, 2076275, 1990412, 1926153, 1999196, 1955465, 1941072, 1978866, 1945685, 1930913, 1943283, 1916364, 1784421, 1734602, 1658841, 1730066, 1848473]
11599A848473p9365r2142j6988J02313q1825K4456j3824j9154L6576l2665p9942
11588A595913J46764J08297m3880l7010n0534p1283J1257j18856p06O5648K2517
11577A628127j23878N8914J08010P3051M1277j22303j08021J1291l615J01614
11567A664467m7125r6435L6037M8394P8639j58290l9360J982m8089j9008L1738
11556A452950l9365M2338L4440l1672j78191O6418J13466M6770K3926J29186J0880
11545A671146L6293q2775j76697p8499j2119J46343P9821j79590r7860k3229P1070
11534A353904J25291p901j54763o6970L5760O761L1937J20061m8813k3529L4609
11523A406347P5176M6396l03J0090l6020j69592j17881J1045M6047j025m7486
$$ y = [1848473, 1769108, 1676966, 1659978, 1762291, 1680466, 1704922, 1691098, 1671944, 1708520, 1675855, 1595913, 1742677, 1850974, 1807094, 1770084, 1719550, 1648267, 1659524, 1540668, 1539962, 1605610, 1628127, 1504249, 1563163, 1671173, 1744224, 1785501, 1663198, 1555177, 1566468, 1562853, 1664467, 1617342, 1520907, 1556944, 1605338, 1683977, 1525687, 1486327, 1488309, 1440220, 1421212, 1452950, 1413585, 1455923, 1490363, 1458691, 1280500, 1346918, 1460384, 1507154, 1531080, 1660266, 1671146, 1707439, 1624664, 1447967, 1369468, 1357349, 1503692, 1583513, 1403923, 1306063, 1282834, 1353904, 1479195, 1471294, 1316531, 1249561, 1285321, 1292082, 1324019, 1444080, 1395267, 1371738, 1406347, 1481523, 1527919, 1527616, 1537706, 1501686, 1332094, 1214213, 1225258, 1271305, 1270280, 1222794]
11512A222794K9066m5637q3337R504j8022o4013k6581R9729M3970m6714K5827
11501A146586L5881n3480p96l120q1304j21032J13789R6005p920r1665J3355O8071
11489A114370k957p500N8614r651o5367O4210J24389J13241q3144j576j7019j11985
11477A175625m6925j0541L8594j7594j02118m4057M4896l7675R0990J6085O090
11466A113370N1484m5042r1516Q936N2247q1467q3239j3696j9548Q0434k1795
11455I50168K1085l473Q6539r420r1636j43036J1350p377k8551j02939J7777N8887
11443G59374J236K2769J00054L4912J15266J5426K729k4156j30831r7658o1103
11432G38018M7609m320O8489j44868j98866o502r536M6129J55058J19463L0357
$$ y = [1222794, 1251860, 1206223, 1122886, 1132390, 1114368, 1050355, 1023774, 1123503, 1167473, 1120759, 1146586, 1182467, 1128987, 1128191, 1125071, 1043767, 922735, 1036524, 1132529, 1124609, 1032944, 1046299, 1114370, 1111413, 1103913, 1162527, 1152876, 1087509, 1151719, 1276108, 1389349, 1306205, 1304629, 1287610, 1175625, 1128700, 1118159, 1156753, 1139159, 1037041, 992984, 1037880, 1000205, 1091195, 1107280, 1113370, 1164854, 1119812, 1028296, 1037232, 1089479, 1008012, 924773, 911077, 891529, 971963, 950168, 971253, 967780, 1054319, 1044899, 953263, 810227, 821577, 814200, 785649, 682710, 700487, 759374, 760610, 783379, 883433, 918345, 1033611, 1049037, 1051766, 1027610, 896779, 799121, 738018, 785627, 781307, 849796, 704928, 506062, 499560, 490024, 536153, 691211, 810674, 841031]
11421H41031m0470K4541N3181O925k692j05449n0615M1996k3347R6967R2072l5069
11409H99071j8433P070J4343n1788K1706j437J70407p446j21693r6222J3119L5616
11397H64313M9226L9104q2920j46401m1769k7480q8496k9512O0423M8833K547
11386F47868k2515L656j3666m2883l1180n8317P0148j3337K3601N9038Q8641J37333
11374H48387o3855j83472o4077P6800q5454O276N8615j5191k6992K5371J19223
11363F95631M0245r0876j6487Q328l0438O7547J401P1301p2556m4807L5035j9901
11351F44423o7011M0306k0473l6584J0580O1713M6727L5842Q016q1858N0887J2497
11339G05065n4662r0941n3426J3345m17P1806j0554j16839L280J35495P3217q3756
$$ y = [841031, 800561, 825102, 878283, 885208, 882516, 777067, 726452, 768448, 745101, 842068, 934140, 899071, 880638, 887708, 902051, 850263, 871969, 870532, 1040939, 1033493, 911800, 815578, 828697, 864313, 913539, 952643, 869723, 723322, 681553, 654073, 565577, 536065, 596488, 645321, 647868, 625353, 629009, 615343, 572460, 541280, 482963, 553111, 539774, 563375, 622413, 711054, 848387, 784532, 601060, 536983, 613783, 528329, 534605, 593220, 578029, 551037, 576408, 695631, 735876, 645000, 628513, 636841, 606403, 673950, 675351, 746652, 674096, 629289, 664324, 644423, 577412, 617718, 597245, 560661, 571241, 632954, 679681, 715523, 723539, 641681, 692568, 705065, 650403, 559462, 506036, 519381, 518964, 590770, 580216, 463377, 466657, 602152, 675369, 591613]
11327E91613k7040L1023m9914Q456j8292J03855l3979R513n332J22029n981K2918
11315G48869P0002j93801q2040j39513m6345n7878l4994R3747J51480M3063R732
11304E62322l8579p1145J1837j77245M911K0068m9749R156R2451J2836J00024
11293D76887P0525q4265K0041p6874j60361m2665P3806J21153J20434k1274p7277
11282D20130M5168L6151n9049n4387k0845K7572O6869m4283j01481q1914l8538
11271A95393L3745R6568l461j0846l725L9572P241J06320J12588O9380r0637j31301
11259D20837p2121l7916J52006P0967q878j11071n5432j6801j3568L3801M5533
11248D07357m2088J5394L9398L68k2063P1792P824n11l089R1201j2233r7630l6371
$$ y = [591613, 564573, 595596, 545682, 554138, 535846, 639701, 605722, 615235, 609903, 731932, 725951, 748869, 818871, 625070, 543030, 403517, 357172, 299294, 264300, 358047, 509527, 552590, 562322, 523743, 452598, 464435, 287190, 292101, 312169, 262420, 271576, 364027, 376863, 476887, 547412, 463147, 483188, 406314, 245953, 203288, 277094, 398247, 518681, 497407, 420130, 465298, 501449, 442400, 388013, 367168, 394740, 461609, 417326, 315845, 233931, 195393, 229138, 325706, 322245, 311399, 307674, 347246, 354487, 460807, 573395, 642775, 552138, 420837, 348716, 310800, 462806, 533773, 524895, 413824, 358392, 341591, 328023, 361824, 407357, 365269, 380663, 420061, 420429, 398366, 470158, 477982, 477471, 474382, 565583, 553350, 455720, 419349]
11235D19349J6575j08799O852J65469J9056o1133j31394Q1112l4129p8171J20099
11224D14886R7681J03164K4211j2877j11130j36463o7094j2539J02974J194j0658
11213C93349O8792n641q2883R2267J15009J85847L50694N20337P99231N74251
11203C011253R0805j0793j58896n74663p45494m98630j37001P586k28224j57804
11193E98139L6599K6150p1836j37130n467J09056N4088p3615j25138j86026J10456
11182C35276J66249j28899p3444j1204L7286O6170m2019K6605r1239l4934j7323
11171B32524K11010L9338r9569O558K6242j1119k9283n1553q2390k9941J57926
11160C69743J79236J5316j57235J28653J31631K5805k6074l4061O1357Q2046K54825
$$ y = [419349, 435924, 327125, 333977, 499446, 518502, 457369, 325975, 407087, 372958, 294787, 414886, 512567, 615731, 639942, 627065, 515935, 379472, 312378, 299839, 402813, 404007, 393349, 462141, 456500, 373617, 465884, 580893, 766740, 1117434, 1637771, 2437002, 3011253, 3102058, 3091265, 2932369, 2357706, 1612212, 1113582, 976581, 984167, 755943, 598139, 634738, 660888, 589052, 451922, 446455, 555511, 609599, 535984, 410846, 224820, 335276, 501525, 372626, 299182, 287978, 325264, 391434, 349415, 376020, 284781, 249847, 232524, 443534, 482872, 383303, 389861, 416103, 404984, 375701, 324148, 241758, 211817, 369743, 548979, 564295, 407060, 535713, 667344, 693149, 667075, 633014, 694371, 776417, 1031242]
11149A031242J99889J57505K5617K0831O7445M7398J11704K70048L87202L97237
11139B716118K81203j30361m33842m65584l98023l72061k54554r5156j07301l0579
11129G09860j0134o2507j14589j35180O3250L749m0111K8186o6677P0169P0294
11118E16310p0440k45531J0198M5228j40477r9716m6468L4453J02828J33936m0118
11107B00203p22q1532k9250j1843R4773L0730r1062M7435M2823L6803K746n3024
11095A88080n0196K4436J8291m0083n7169P8660J14494R5418m072j42997j41278
11084H3584r728M5875J16225o440N470J2100r0660m2493m7424l9754R3054p1195
11072D8614n4457j8729K5413P2905J27527L176j56623j6347J14925P3247k4474
$$ y = [1031242, 1231131, 1388636, 1414253, 1435084, 1502529, 1549927, 1661631, 1931679, 2318881, 2716118, 2997321, 2866960, 2433118, 1967534, 1569511, 1197450, 942896, 847740, 740439, 709860, 699726, 637219, 522630, 387450, 450700, 454449, 414338, 442524, 375847, 446016, 516310, 445870, 200339, 210537, 255765, 115288, 15572, -30896, 3557, 106385, 240321, 200203, 199481, 117949, 88699, 76856, 171629, 202359, 111297, 158732, 201555, 238358, 241104, 188080, 137884, 162320, 180611, 140528, 83359, 162019, 276513, 371931, 367859, 224862, 83584, 73856, 119731, 235956, 229516, 234986, 247086, 156426, 113933, 66509, 26755, 119809, 48614, -5843, -24572, 841, 73746, 201273, 204449, 47826, 31479, 146404, 219651, 195177]
11061A95177q2452o1653K6725O0044Q045N7285m0753j07236L7876J37587L6149
11050B66794j32530j22469J39787K05027j40985J2848J92148J06920j7973n3488
11040D56079l7319j29862J68900J00291R0638N8349J25941J81552J81090j15594
11030A080065k00843j95746j10616R1167M5891O7455K68926L50916J05312L4306
11020A536833k4320j66909j94015j80669j50823j46625o2901L7491J69387P0390
11010H87839J17233J10813m4700k53387j24723j86542j24603o8478p203k3898
11000B82351q6784J00218Q9385O9647J8711R895j33537p0820J7824M7942l2561
10989C12271j22770m7772j33557r6621J06339P9773j41426q3602J01131R6808
$$ y = [195177, 112725, 51072, 77797, 137841, 145886, 203171, 162418, 55182, 93058, 230645, 266794, 134264, 11795, 151582, 356609, 215624, 228472, 420620, 527540, 509567, 456079, 418760, 288898, 457798, 558089, 648727, 707076, 833017, 1014569, 1195659, 1080065, 879222, 683476, 572860, 664027, 709918, 777373, 1046299, 1397215, 1502527, 1536833, 1512513, 1345604, 1151589, 970920, 820097, 673472, 610571, 648062, 817449, 887839, 1005072, 1115885, 1071185, 817798, 693075, 506533, 381930, 313452, 306249, 282351, 195567, 295785, 385170, 454817, 473528, 483423, 349886, 279066, 296890, 344832, 312271, 189501, 141729, 8172, -88449, 17890, 97663, -43763, -127365, -26234, 70574]
10979G0574Q0083p2192L8016J14792j7583j40000l2515J86376J07452K4656J4331
10968C73990k3345j06424j60981r7118j8379O6880J22382J74940K09539L4826
10958E76310J69655j6046J18365L81926N39551M98392K44550j06237o5908K89039
10948B629597P057n78588p10780m33762l09751j71962l9024k3363q0149o3673
10938B25602n7380k8157O8183m6619K9498j5416m9367L9889k2345j44314p2699
10927g3125n7230o8758J30273K1814j8655L5480r6087n6819J02279L1217l9460
10916h9071k5158K0795M3771M8406o3345j1856J8051m0848m3261o5967j2193o245
10904b26921K9767J32230Q9288j9599l2059p8499j9230M7110Q760p0618Q3288
$$ y = [70574, 150657, 78465, 116481, 231273, 213690, 73690, 41175, 227551, 335003, 359659, 373990, 350645, 244221, 83240, -13878, -32257, 34623, 157005, 331945, 541484, 576310, 745965, 729919, 848284, 1230210, 1769761, 2268153, 2512703, 2406466, 2340558, 2629597, 2636654, 2058066, 1347286, 913524, 603773, 431811, 392787, 369424, 289275, 225602, 168222, 140065, 208248, 161629, 191127, 175711, 126344, 166233, 143888, -426, -73125, -130355, -199113, -68840, -47026, -65681, -30201, -126288, -183107, -80828, -49611, -89071, -114229, -93434, -49663, -1257, -64602, -76458, -58407, -99255, -142516, -208483, -220676, -226921, -197154, -64924, 24364, 4765, -27294, -105793, -125023, -77913, -69153, -139771, -56483]
10893e6483J04488M4074m7515j1038j67957m207K6479q4235j8603n530P2099J9533
10881a28895J06088L5135J09n5723J13708J40077Q5357j8874r5253q2214P933
10870A07448J2926J7902M2031j22231J8570k0848j9738J1215K3669j0856J5571
10859G5659L8339O0592J4160P5041p5595j20348k1447L6461m2551N4765J72877
10848B67953K6730J7561o767j5335o0592l9187q8613J3968M5210K9061j07175
10837H2814j36695N0750P6673K6790n1606r0638j22743L3503L1761k749N1122
10826e1018J34283J27966j0579r4177j13270j20904m6735k913n1958j39290p4046
10815d42641m7592P6187K2520k7998N3218j5014L3187j6986J55996L8867j67347
$$ y = [-56483, 48005, 92079, 44564, 33526, -134431, -138638, -112159, -196394, -214997, -220527, -148428, -128895, -22807, 12328, 12437, -43286, 70422, 210499, 295856, 276982, 181729, 99515, 107448, 120374, 138276, 180307, 58076, 76646, 55798, 36060, 47275, 70944, 60088, 75659, 113998, 174590, 188750, 263791, 188196, 67848, 46401, 82862, 40311, 95076, 267953, 294683, 312244, 305477, 290142, 229550, 190363, 101750, 115718, 160928, 189989, 82814, -53881, -3131, 73542, 100332, 48726, -41912, -164655, -131152, -99391, -102140, -51018, 83265, 211231, 200652, 106475, -6795, -127699, -174434, -177347, -229305, -368595, -442641, -490233, -414046, -391526, -419524, -366306, -381320, -348133, -365119, -209123, -170256, -337603]
10804c37603n6576N5851O7227M2983O3413j1340L5537J0847m7680O8347J10406
10793A412j09881j00555L2391m0542p5782O9573R0991P6485L2944o4899k4511
10782a12374M5083O7851R0036q5364q0841J7689P1145N6980k4343j7506M6015
10771G4371Q7478n9917l2646J10359J0758l877K5867j01082P8746J02911q3011
10760B09957J49009J32900l0269q9225O2815J17855O5339J39720J48867L7088
10750I44056o933R3206J18611l2521L5467J52630J82922J05201J12159J20844
10740A825642O0736Q147J43059K33932K54374K66966L59815K82134L66480L46180
10730D147465L43905L93487N71391O26283O18321P90444R84451R83466J146364
$$ y = [-337603, -394179, -338328, -271101, -228118, -164705, -176045, -140508, -129661, -177341, -108994, 1412, -108469, -209024, -176633, -217175, -292957, -223384, -132393, -55908, -22964, -87863, -112374, -67291, 560, 90596, 5232, -75609, -57920, 13225, 70205, 45862, 28356, 74371, 161849, 101932, 69286, 179645, 190403, 186526, 212393, 111311, 190057, 292968, 209957, 358966, 491866, 461597, 372372, 435187, 553042, 618381, 758101, 906968, 944056, 937123, 1030329, 1148940, 1116419, 1151886, 1304516, 1487438, 1592639, 1704798, 1825642, 1886378, 1894525, 2037584, 2271516, 2525890, 2792856, 3152671, 3434805, 3801285, 4147465, 4491370, 4884857, 5456248, 6082531, 6700852, 7491296, 8475747, 9459213, 10605577]
10721A0605577J493118J664220J790630J670178J619885J900472K601187L450320
10713B6795587M553571O227585Q552447J2002220J7091303K4768249L4998566
10706A34989528M6181771N2739156M0103924q372093l7558006k4271388k558799
10699B01254093J9574340M3663742P1078805R7950271J09221785P1829867m2792201
10692E71780702j23368819j13414748q3048733n8387647m1190151k9702422k1664102
10685A01004080j6325756j2492458r622076p576593o154336n451738n112181m581577
10677C3687365l675512l133931k706326k274788j841268j623403j395986j217233
10669A5818918j005336r70183j024396r24470q33256o65278n38997m78705m04964
$$ y = [10605577, 12098695, 13762915, 15553545, 17223723, 18843608, 20744080, 23345267, 26795587, 31349158, 37576743, 46129190, 58131410, 75222713, 99990962, 134989528, 181171299, 233910455, 274014379, 265642286, 228084280, 203812892, 201254093, 220828433, 264492175, 335570980, 433521251, 542743036, 614572903, 571780702, 448411883, 334997135, 251948402, 193560755, 152370604, 122668182, 101004080, 84678324, 72185866, 62563790, 54987197, 48832861, 43381123, 38268942, 33687365, 30011853, 26877922, 24171596, 21896808, 20055540, 18432137, 17036151, 15818918, 14813582, 13843399, 12819003, 11894533, 11061277, 10395999, 9857002, 9378297, 8973333]
10660H973333j53121q0070m40243m70949l71997l06293j95168j34384k74590l33303
10650F213215k88192j33208j60078l47959k76534k09697j55549p0437j1470k3755
10640D536336o1643j0122R7620J12065L58109M73706O57931P96491P54106O36017
10630H350616J51609j97428p0497J79098O35076Q46252J244260K104811K998424
10621A6242221M068246N550780P283852Q949987J1329968J2981764J1995688O713350
10613H5115856m44138m719829n105357k732582J108006N839900J1009373J7058324
10605A07129553K3631694K8086781K4195414Q947112j0066857j9671400j8223902
10598A44028395j1664971l709040M741191J3631684K3279160L2091051L5947408
$$ y = [8973333, 8820212, 8740142, 8299899, 7828950, 7456953, 7150660, 6955492, 6821108, 6546518, 6213215, 5925023, 5791815, 5631737, 5283778, 5007244, 4797547, 4641998, 4571561, 4560091, 4536336, 4474693, 4464571, 4562191, 4674256, 5032365, 5506071, 6164002, 6960493, 7714599, 8350616, 8502225, 8304797, 8234300, 8413398, 9048474, 9894726, 11138986, 13243797, 16242221, 20310467, 25861247, 33145099, 42095086, 53425054, 66406818, 78402506, 85115856, 84671718, 79951889, 74846532, 72113950, 73221956, 79061856, 90071229, 107129553, 130761247, 158848028, 183043442, 191990554, 181923697, 162252297, 144028395, 132363424, 128654384, 133395575, 147027259, 170306419, 202397470, 238344878]
10591B38344878K7354914K424923k4924393l6294226l2185415k2822678j3150580
10584A38747423m480508L791984J1518889J7646674J9177563J1477154o107796
10577A91771383k3261398k8906760k4591622j7284263j0643847n294009p35566
10570H1053918K854154N134209M827640Q39015o077902j2140918j4068366j2719657
10562D9702093j0054527p418504n440829m095365l162697k509088j745038j417314
10554A3858731j345768j047926q44245q27732o57736n89824m47998k07385l31728
10545G558389k03956p2828o7981M0461L69292O11813Q43928J017757J251636R01814
10535A2250325p57370j709828j369400j012330p85030p81160o16992m43294k41456
$$ y = [238344878, 265699792, 268124715, 243200322, 206906096, 174720681, 151898003, 138747423, 134266915, 138058899, 149577788, 167224462, 186402025, 197879179, 191771383, 168509985, 139603225, 115011603, 97727340, 87083493, 81789484, 81053918, 83908072, 89042281, 93869921, 94708936, 88631034, 76490116, 62421750, 49702093, 39647566, 32229062, 26788233, 22692868, 19530171, 17021083, 15276045, 13858731, 12512963, 11465037, 10620792, 9793060, 9135324, 8545500, 8097502, 7890117, 7558389, 7354433, 7281605, 7213624, 7254085, 7623377, 8235190, 9079118, 10096875, 11348511, 12250325, 11492955, 9783127, 8413727, 7401397, 6616367, 5835207, 5218215, 4774921, 4533465]
10526D533465j55454j14298j38726j38568j63967j46522j75087q0425j00023q320
10516C312075k9682n3597m1356m9548j08549j27634j91442j16257j28857r7805
10506B367348M8492j03889k1272o2798r5553l9277L7758P7313J17372m594L880
10495B324780k8332L7958j2043n4897M3884j8424P7282O193j31644J3833R2273
10484B350863R8152O2237m9308L1271j3513n0889L9277R5546m3169j89540j22968
10473B207959j26115k0355k8201k5426P0185Q2254J02039K3184p4506n7646q4738
10462B068634n5818r8172N08p8831o3269k5102j23184L1205N0948l4042R1752
10451A764629N8943j38242Q807l0284o2426L4297J37142n9089o3456j15438k07
$$ y = [4533465, 4378011, 4263713, 4124987, 3986419, 3822452, 3675930, 3500843, 3420418, 3320395, 3312075, 3282393, 3228796, 3187440, 3137892, 3029343, 2901709, 2710267, 2594010, 2465153, 2367348, 2415840, 2311951, 2290679, 2227881, 2132328, 2093051, 2130809, 2208122, 2325494, 2320900, 2324780, 2296448, 2334406, 2322363, 2267466, 2311350, 2292926, 2370208, 2376401, 2244757, 2258590, 2350863, 2449015, 2511252, 2461944, 2493215, 2479702, 2428813, 2468090, 2563636, 2520467, 2330927, 2207959, 2081844, 2061489, 2033288, 2007862, 2078047, 2160301, 2262340, 2285524, 2211018, 2153372, 2068634, 2012816, 1914644, 1915152, 1836321, 1773052, 1747950, 1624766, 1655971, 1706919, 1672877, 1764629, 1823572, 1685330, 1694137, 1663853, 1601427, 1635724, 1772866, 1713777, 1650321, 1534883, 1534676]
10440A534676k3897m4958r8224k7228p9440L2948M7721k3941K3034q7688P2053
10429A325056m224m3005r0320r9871j1117N2817l5679q0973k6314M5861J42070
10418A174301P7364k7864j26915j1683O0827K1626j22767K6640N5039l5991R7323
10407A187900K3812q6262k4309M8261q9370k3304L7841J4255j2707l0841l2315
10396A012961j23932m7394O9986J49566J9731J8410n284p1751n4817k1426J24270
10385A070320j4393K5323M3072j09412q0645j18295L8919J58296O4951p6852j43216
10374H58068l4214O920j894J2992Q5884R1895K0058m2620j4563q7410p1537r981
10362H13598P0470J31015k7736m3340l2291J2083j10465L7487q132l0338K1736
$$ y = [1534676, 1510779, 1465821, 1367597, 1340369, 1260929, 1293877, 1341598, 1317657, 1340691, 1253003, 1325056, 1320832, 1277827, 1187507, 1087636, 1076519, 1129336, 1093657, 1012684, 986370, 1032231, 1174301, 1251665, 1223801, 1096886, 1085203, 1146030, 1167656, 1044889, 1071529, 1126568, 1090577, 1187900, 1211712, 1125450, 1101141, 1149402, 1060032, 1036728, 1074569, 1088824, 1076117, 1045276, 1012961, 889029, 841635, 911621, 1061187, 1080918, 1099328, 1094044, 1022293, 967476, 946050, 1070320, 1055927, 1081250, 1124322, 1014910, 934265, 815970, 854889, 1013185, 1078136, 1001284, 858068, 823854, 830774, 828880, 841872, 927756, 1019651, 1039709, 997089, 982526, 895116, 823579, 813598, 884068, 1015083, 987347, 944007, 911716, 923799, 813334, 850821, 842689, 812351, 834087]
10351H34087o8961Q420o86j07689m8761J5861l2151J32797Q1217J4532n8057k9075
10339G41534n5525j16125O3718O8528k6495Q0033N5942j5708M8093Q738o9155
10328G83578m523m9009m2270l1747M6652P0202J2000p9194q2836q4797M0767J29636
10316G08459J53979m6436j52044j2009O5726j8765n0700L461O2226j48905q0592
10305D84400q7645k810J63487P6777l3516r3278K2728N8430J81861k7531j51220
10294E91683j6723N6233J1078p0223r400K8977m8407l4120L1795P5712N8877n3161
10282F22321J0194M5533q1386l5752Q6725l1383j464L062q3809M3701J36719m6888
10270F67573L0482J02167n727l0782J816n8395m03l3688R0555J90587K2704M3296
$$ y = [834087, 765126, 773546, 772860, 665171, 616410, 632271, 600120, 732917, 814134, 828666, 770609, 741534, 686009, 569884, 633602, 702130, 675635, 755668, 811610, 795902, 843995, 852733, 783578, 779055, 730046, 687776, 656029, 702681, 772883, 784883, 705689, 622853, 538056, 578823, 708459, 862438, 816002, 663958, 651949, 717675, 698910, 648210, 651671, 713897, 564992, 484400, 396755, 393945, 557432, 634209, 600693, 507415, 530143, 588573, 770434, 742903, 591683, 574960, 631193, 642271, 572048, 562648, 591625, 543218, 509098, 540893, 616605, 675482, 622321, 632515, 678048, 596662, 560910, 647635, 616252, 614788, 617850, 534041, 577742, 714461, 667573, 698055, 800222, 794495, 763713, 765529, 707134, 706731, 673043, 763598, 954185, 976889, 1020185]
10258A020185O0977J58609J63442K40472K43686N590j25066j52140p7405l8331
10248A500019J263R3397K47259L54243M58994L80904J63178j92187n04002l76328
10238B126740l50964k49232j30614q4125j71979k27373j09484m7268l063j20753
10228F31885J19004J08454o8954q4052Q596m1110n3171j35629Q016M0050N334
10217E38423j5831M1961J6994j25930K1117q95o6186p6421p0560J10652K04065
10206E77389k5502q7300j42238m18J59325l4202Q8135R8145R4330O4767n2341
10195G40090j11507j82421N6594Q4337k8297R9214o4066k16682j02904M8992O0604
10184C83954J16353J93691L0777N1265P3261n3703m382o8266M9747M1556M0348
$$ y = [1020185, 1081162, 1239771, 1403213, 1643685, 1887371, 1892961, 1767895, 1615755, 1538350, 1500019, 1501282, 1594679, 1841938, 2196181, 2655175, 3036079, 3199257, 3007070, 2503068, 2126740, 1775776, 1526544, 1395930, 1311805, 1139826, 912453, 802969, 755701, 752638, 631885, 750889, 859343, 790389, 706337, 714933, 673823, 620652, 485023, 493039, 533089, 538423, 522592, 564553, 581547, 455617, 476734, 475839, 409653, 333232, 262672, 373324, 577389, 551887, 464587, 322349, 321931, 481256, 447054, 535189, 633334, 727664, 792431, 740090, 628583, 446162, 502756, 587093, 558796, 658010, 593944, 377262, 274358, 323350, 383954, 500307, 693998, 724775, 776040, 849301, 795598, 791216, 722950, 772697, 814253, 854601]
10173H54601m9853Q5032J20930j0570M3496J54259J98988J99242K4222n1890j10027
10162A458430r9500j09507J80285J26233J29955J61602K32523M9090K4111j17247
10152B035975l32344l57371j67971p2753j10225J31428M4015k6850Q3657k585
10142A224976J88916R7083j5986j11807l58353k38131j8997r7212k7999K0925
10132F63415k0839P3187J06805l517j20970o4144k7389L4500q3117j7547J07984
10121F48368N3061m6288j65861l0613o0303l9031o665P3924n5606O4217o3118
10110C72085P944N8296j27411n6169J47025L5487l3800J2329L2777R8722K4079
10099E71364j7088J05544q3159j42112j15972j7722J9556O9711L9222J5216m2431
$$ y = [854601, 804748, 889780, 1010710, 1000140, 1043636, 1197895, 1396883, 1596125, 1620347, 1568457, 1458430, 1358930, 1249423, 1429708, 1555941, 1685896, 1847498, 2080021, 2129111, 2153222, 2035975, 1703631, 1346260, 1178289, 1105536, 995311, 1126739, 1170754, 1143904, 1227561, 1224976, 1413892, 1510975, 1494989, 1383182, 1024829, 786698, 767701, 670489, 642490, 663415, 642576, 715763, 822568, 819051, 698081, 633937, 606548, 641048, 557931, 540384, 648368, 701429, 655141, 489280, 458667, 398364, 359333, 352668, 426592, 370986, 435203, 372085, 380029, 438325, 310914, 254745, 401770, 437257, 403457, 415786, 448563, 547285, 571364, 554276, 659820, 576661, 434549, 318577, 300855, 320411, 390122, 429344, 444560, 402129]
10088D02129r8555n74R7160O5747j2177K1252l3726k7773j73064l1605K17303
10077D26117M632l2683J6982n2898N7092J5636J2091Q41p299l7123J9070j4163
10065D08295k6119M5796l946l1301k8518J55754Q100k13963m8990J9849M9702
10054C34659O6700P1925j5451N856n5472j79201j5400J57017K6962p7583j14735
10043B05277n8272J59361j8944J5721j027q3162l3995J00668Q2555P7637j3560
10032D32259K0443L0872j13342l2356M2886j18185o6717P604N8051L9820l1767
10021B69568p9693J10065J05158o137q8921o240o0527K1958j6028J40225K9317
10010D18745l9382k55202o7073P2724P8876l8852K3182L7498j59239o3133N6601
$$ y = [402129, 303574, 303000, 400160, 465907, 453730, 474982, 441256, 413483, 240419, 208814, 426117, 430749, 398066, 415048, 362150, 419242, 434878, 446969, 447810, 440511, 403388, 422458, 408295, 382176, 427972, 424026, 392725, 364207, 519961, 528061, 314098, 265108, 284957, 334659, 401359, 473284, 457833, 463689, 408217, 229016, 213616, 370633, 397595, 320012, 205277, 147005, 306366, 287422, 303143, 302116, 218954, 184959, 285627, 368182, 445819, 432259, 452702, 483574, 370232, 337876, 380762, 262577, 195860, 203464, 261515, 301335, 269568, 189875, 299940, 405098, 398961, 310040, 303800, 243273, 265231, 249203, 389428, 418745, 379363, 124161, 57088, 129812, 208688, 169836, 193018, 230516, 71277, 8144, 64745]
9999F4745J22950N2092p87L2275Q9503Q5513p8876p0029k0734N3750q3125m575
9987B42702J14721J7025p1484j06108l966J5198O0720M3900m4555j28825q3252
9976E6076k551q223R2660J79157j8936j9952m4465j48040j04469J4517J60738
9965A56512O3758M0999J8672K6969N2181j3334j77294l2515L2647K1961L3115
9954B23671P04q2556l8117P7235Q1542R0589O1085K2965n9914r6284k1150P070
9942B66840O2726J7619J30134N0994R8087K70760J68199J43303P18522J414188
9932C341372K156425L393664K585204l326434l660499j640180q62433n66436l15501
9923A105182k11828j10686k6496k5213j19468j86036k3237J42629O5108j6101
$$ y = [64745, 187695, 239787, 239000, 271275, 360778, 446291, 367415, 297386, 276652, 330402, 247277, 242702, 357423, 374448, 302964, 196856, 192890, 208088, 268808, 312708, 268153, 139328, 56076, 53525, 45302, 137962, 317119, 298183, 278231, 233766, 85726, -18743, -4226, 156512, 220270, 261269, 279941, 306910, 359091, 345757, 168463, 135948, 168595, 190556, 223671, 224375, 141819, 103702, 180937, 262479, 353068, 414153, 437118, 377204, 280920, 259770, 266840, 329566, 347185, 477319, 528313, 626400, 897160, 1065359, 1208662, 1927184, 3341372, 5497797, 8891461, 11476665, 8150231, 4489732, 2849552, 1987119, 1420683, 1105182, 893354, 782668, 756172, 730959, 611491, 425455, 402218, 544847, 609955, 593854]
9913E93854o1308P788k3809p8231k7228K9610J04485K8257j93715l8751K9140
9902C70092j50063o005R5037Q0359J60356q7177o3023J0378q0184n7161J5180
9891B87789J1614J0422J7547N679J46419p4051j37559L2502L528m2215o7016O256
9879B00915J20636Q3310o4781m4851J5378l9737J0780l4617j03418j825Q9346
9868B31136K5770o8678n4322K5728k4439N4650L2400j0921k786L7092k5156P3113
9856B93587l0647P295O1681q2599l6858O4779N5184k5000K7783k2132j4832r4329
9844B03912k3508K6438P490K917j48505p2065J1764R5135J13634k5696N770O1373
9832B58659L6196o489O6835J1304j08134k5113K8328L6147j3649n3259l0374l0893
$$ y = [593854, 532546, 540334, 516525, 438294, 411066, 440676, 545161, 573418, 379703, 340952, 370092, 220029, 214024, 309061, 389420, 549776, 462599, 399576, 409954, 329770, 272609, 287789, 299403, 309825, 327372, 333051, 479470, 405419, 267860, 300362, 303890, 261675, 194659, 200915, 321551, 404861, 340080, 295229, 310607, 270870, 281650, 247033, 143615, 141790, 231136, 256906, 188228, 133906, 159634, 135195, 189845, 222245, 211324, 208538, 245630, 220474, 293587, 262940, 270235, 331916, 249317, 212459, 277238, 332422, 307422, 335205, 313073, 298241, 203912, 180404, 206842, 214332, 217249, 68744, -3321, 8443, 103578, 217212, 191516, 197286, 258659, 294855, 288366, 355201, 366505, 258371, 233258, 261586, 297733, 284084, 230825, 200451, 169558]
9820A69558j5207p7291p2033J19411Q2185J4322q9117o8294Q8526J02567J8867
9809B73494M8641n4937j13912k597J03215O1492m809N636N1316P106j00269l9091
9797B35285O4549n1322j51673M8682J30443k6782j7927p200j14454J090k40l9510
9785G0941m4594J26026K07588O3183j17147r7976m4064N107Q2105L0794j4912
9774B67051P5892m0925j50286k0173k5465M4341M4469q9442k9652M9549j0369
9763A14990j28099Q2431N6585r271l1611j7761j9486p9363M8889p1641k9077J07985
9751B4571J03023N9847l4947j21959O5227J99426L2571n5149r6887j53242j6568
9740E913l8074K3717M0919J07245N9800k4004j19820k2505L0559P6913p2542r228
$$ y = [169558, 154351, 77060, 5027, 124438, 206623, 220945, 131828, 63534, 152060, 254627, 273494, 322135, 267198, 153286, 150689, 253904, 315396, 310587, 316223, 367539, 374645, 274376, 235285, 299834, 248512, 96839, 145521, 275964, 249182, 231255, 224055, 109601, 110691, 110451, 70941, 26347, 152373, 359961, 423144, 305997, 208021, 163957, 169064, 251169, 281963, 267051, 342943, 302018, 151732, 131559, 106094, 150435, 194904, 105462, 75810, 125359, 114990, -13109, 69322, 125907, 116636, 85025, 67264, 47778, -31585, 17304, -54337, -83414, 24571, 127594, 187441, 152494, 30535, 95762, 295188, 327759, 272610, 175723, 22481, 5913, -32161, -8444, 32475, 139720, 199520, 175516, 55696, 33191, 63750, 140663, 68121, 58893]
9728E8893R1895M0246J66970J0761j21942k7153r044r429k4646J6616M8744n6988
9716A84923N3997Q2445o5614J9935K6042N775k4502k743o3860k0829k4746j16064
9704E4759j40892j4961M9524O9060m1821l361J37413k0224K19j17914R0601N7981
9692A20384O1364j2283o9923J771j14471m812J09586Q3663q517M0492M2526j43827
9680A05953j56712J35030P3050N004j34829K4041J39754j8106O974N3617l8285
9669A95491n3040J28109J33049M3836n2264P6593k2281M7814J9652K1010K09801
9658G47770L32967O37579J069043J745765L039486N001920O486427K039486o618754
9649A4481689n907827l078304j724021j019583o54064l78317l30380j78154j55895
$$ y = [58893, 150788, 191034, 358004, 368765, 246823, 219670, 210626, 201197, 176551, 193167, 241911, 184923, 238920, 321365, 255751, 275686, 301728, 307503, 283001, 280258, 216398, 195569, 170823, 54759, -86133, -101094, -51570, 17490, -24331, -27692, 109721, 89497, 89716, -28198, 62403, 120384, 181748, 169465, 99542, 101313, -13158, -17970, 91616, 175279, 166762, 207254, 249780, 105953, -50759, 84271, 157321, 162325, 27496, 51537, 191291, 173185, 180159, 233776, 195491, 142451, 270560, 403609, 447445, 395181, 471774, 449493, 497307, 516959, 537969, 747770, 1080737, 1718316, 2787359, 4533124, 7572610, 12574530, 19060957, 21100443, 14481689, 8573862, 5495558, 3771537, 2751954, 2097890, 1719573, 1389193, 1211039, 1055144]
9640A055144k05041o4156j35138k4413N8658o0663n9566j01168k1374j13543r954
9629C18786m5536R9152p957r6225p9853N8646m5061n620N9633j38510j14818J29797
9617A32434Q8444j5677n5449k7874N7121j01836O2895K7749L2692O2316J7934
9606B80749n7853j4798j24368k38J37147l1637j4188Q96p4216J34974J14715J3756
9594C64939o7708L6942N1882l37p7811j42997m9452K1224r009L8555j5346Q66
9582A51748o0184L1109n4787l0965n3558L1669L6864K2237Q0134P5815l8184j15274
9570G6624O599J8248j4253P4624j1644Q9144N0436J07848N2608j68691j63721
9559A17822P3941J61145j0752m5864p6546r565P5384N0818J52712j01953n9864
$$ y = [1055144, 850103, 785947, 650809, 626396, 685054, 624391, 564825, 463657, 442283, 328740, 318786, 273250, 372402, 364445, 268220, 188367, 247013, 201952, 196332, 255965, 117455, 2637, 132434, 220878, 205201, 149752, 121878, 178999, 77163, 140058, 167807, 200499, 262815, 280749, 222896, 208098, 83730, 83492, 220639, 189002, 174814, 175710, 101494, 236468, 351183, 364939, 297231, 334173, 386055, 385718, 307907, 164910, 115458, 136682, 127673, 166228, 150882, 151748, 91564, 122673, 67886, 36921, -16637, 15032, 51896, 74133, 154267, 230082, 191898, 76624, 83223, 101471, 87218, 161842, 150198, 239342, 289778, 397626, 450234, 281543, 117822, 191763, 352908, 342156, 296292, 219746, 210181, 285565, 336383, 489095, 387142, 327278]
9548C27278j23131M982j07019j2440O7303L5895J83833J1955k8454K1496q6698
9537B95000j38194n1335O9036J11517Q3037N633j41183q9759j8850j28374j28951
9526a32423P2963K935R8391J79637o5298n3984J28609j4236n0372m0396q46J38538
9514B63518N039j23719P045J11417L7941n2109p4710j2584j27764k2666N8553
9503F9961j131N4941q0423K7553J04262r7656L9025J22388n7375m4755k8819p3340
9491C4631k8382L9240J25171K294j17557j19398K1529J41982N7605l2530k6526
9480I8059J1835K9387j12112J04012Q714m0867j4099N20O386L4775N2284Q9023
9468B67917M6008j1531j07567j43716q9431L973O8228R6939M2564j04417l7463
$$ y = [327278, 204147, 209129, 102110, 89670, 156973, 192868, 376701, 388656, 360202, 381698, 295000, 156806, 105471, 174507, 286024, 369061, 374694, 233511, 143752, 124902, -3472, -132423, -59460, -56525, 41866, 221503, 156205, 102221, 230830, 216594, 166222, 125826, 124980, 263518, 268557, 144838, 151883, 263300, 301241, 249132, 174422, 161838, 34074, 11408, 69961, 68830, 123771, 43348, 70901, 175163, 77507, 116532, 238920, 181545, 136790, 107971, 34631, 6249, 45489, 170660, 172954, 55397, -64001, -42472, 99510, 157115, 124585, 98059, 109894, 139281, 27169, 131181, 139895, 99028, 84929, 85449, 91835, 126610, 178894, 267917, 313925, 302394, 194827, 51111, -38320, -34347, 33881, 130820, 173384, 68967, 31504]
9457C1504k5722K0046q916O0367m2665j13603j2640K56568J56593P25j22191o0575
9445A39491J00988p0973p1619n246N3024J65768k1674p5730K2621P0924k0852
9434B86722n0075q3449q5254k4684m3567L6531R7191M5705L9930j16126j47005
9423d4081p2658J09485J11635l9622j02766Q1488K5782l3183K4113J59420j639
9412B17974p9125n7328R1531P5568Q8964k2045o4515P0833n5200r438r8218m6123
9400A12878L271j1802K7853j3896R243J27173m2764j9556L6135k0165j69174j00783
9388f1587P8449Q8276r2010J13530J25277P4493j11019r7396l8180K8322l0555
9377G7600j8917j22116k3878N5866m7575O9416P4020O3322N3535m4930q9826j22826
$$ y = [31504, 5782, 25828, 16912, 77279, 34614, -78989, -91629, 164939, 321532, 322257, 200066, 139491, 240479, 169506, 97887, 92641, 145665, 311433, 289759, 214029, 236650, 307574, 286722, 236647, 153198, 67944, 43260, -307, 36224, 133415, 179120, 219050, 102924, -44081, -116739, -7254, 104381, 64759, -38007, 43481, 69263, 36080, 60193, 219613, 217974, 138849, 81521, 173052, 248620, 337584, 315539, 251024, 321857, 266657, 257219, 159001, 112878, 116149, 104347, 132200, 118304, 127547, 254720, 211956, 192400, 228535, 208370, 39196, -61587, 16862, 105138, 13128, 126658, 251935, 326428, 215409, 118013, 79833, 108155, 77600, 58683, -63433, -87311, -31445, -79020, -9604, 64416, 127738, 181273, 136343, 46517, -76309]
9365g6309k1507N8666O0958J16324l4713q7684J09674N2938O6061n1683n5311
9354A37414r3906j27030N7913J51190k3880j72399j11091P0030R8993j3748k8942
9343e5456L3244J473p392q5798q5859P5252J12855m9555k9336J32184O4784L4578
9331A40974J8223j38412p3366n8615P978K6085r579l1991l7983m9406L1776R7937
9319g6379Q8759n4254M9988Q7383L1721j8195K8412J4538o4913P631p2060l0972
9307h341r2618N6648J11837O3519P5484m3671L5046q5853j48809j5412o6219J78016
9295E9627J21841p8411J9296K0233n200j20108n6520P3921K44724m4144j01907
9284A33352k0405J1892L9392n8073n139m3576j8458L9551O8527M023m0427M9754
$$ y = [-76309, -97816, -39150, 21808, 138132, 103419, 15735, 125409, 178347, 244408, 192725, 137414, 43508, -83522, -25609, 125581, 101701, -70698, -181789, -111759, -12766, -26514, -55456, -22212, -20739, -28131, -113929, -199788, -124536, -11681, -61236, -90572, 41612, 106396, 140974, 159197, 20785, -52581, -111196, -103218, -77133, -86712, -118703, -156686, -206092, -174316, -76379, 12380, -41874, 8114, 95497, 127218, 109023, 137435, 151973, 87060, 94691, 22631, -8341, -100959, -44311, 67526, 131045, 206529, 162858, 197904, 112051, -36758, -52170, -118389, 59627, 181468, 103057, 122353, 142586, 137386, 17278, -39242, 34679, 279403, 235259, 133352, 112947, 124839, 164231, 106158, 101019, 57443, 38985, 78536, 147063, 151086, 110659, 160413]
9272A60413M6909N6072o480l5048j61094o6528K192J4958J1373o9080O4420R7888
9260A15995M6648m8199r8627L4565O0476O0214j6791j27606n416J414n9479K5221
9248a1585L361Q4585m8931q7294J01211J89783j29035j34174j9475O8236p0912
9237e4230j39129O5252J39415j912p9864O3102P6014L2459j42354J8166M9967
9226B6886K0764J15091O2826j5462K8455n6349r4511N9660R9506n0458o8854l0402
9214I7152l3442J1554l7636L4430k7508o3044m430Q5143J49315J6750j9866N9768
9202B68186M1920p0722p0477K5970j3284j21731r7558J3830J03310Q6454M474
9191A70372k5834m0621n1563j0373M8145M6144j41133j39489l2540Q7849O6408
$$ y = [160413, 207322, 263394, 256914, 221866, 60772, -5756, -3564, 11394, 22767, -46313, 18107, 115995, 162643, 114444, 15817, 50382, 110858, 171072, 154281, 26675, 21259, 22673, -36806, -11585, -8224, 76361, 27430, -59864, 41347, 231130, 102095, -32079, -51554, 16682, -54230, -193359, -128107, 11308, 9396, -70468, -7366, 68648, 101107, -41247, -23081, 26886, 47650, 162741, 225567, 210105, 238560, 182211, 87700, 147360, 246866, 196408, 127554, 97152, 63710, 75264, 37628, 72058, 44550, -18494, -22924, 62219, 211534, 228284, 208418, 268186, 310106, 239384, 168907, 194877, 181593, 59862, -37696, -23866, 79444, 165898, 170372, 144538, 103917, 52354, 41981, 90126, 136270, -4863, -144352, -176892, -89043, -22635]
9180b2635j16272M1227J22683P0365O6944O9382k1778K3044p527l375j57663j25742
9168f1347L2957J9871P3105O0513J94948P0149j81529j27756L3695P1061n7261
9157A28406n1775J05182J9870j69625j44925j15834j02006o1911P7032R7353Q5491
9146a32742J7087J2401J6306L9374P6190P4501m3327p4184J52587L234j41181
9135B46m8348Q556O3009O7223q7637Q9493o2586m4707O3695R1422j8578n1082
9123G0706p9561M0082M3532o309m7065j70544O669J11098Q9398J01519m2636l7474
9111G9415k6664l3311j8406k9351K0198P8919J10735R0855q8081k6604l8166N997
9099A25536j2194q5999k0961M5144N2226R540n2387P5680J1824J7979N684j6998
$$ y = [-22635, -138907, -97680, 25003, 95368, 162312, 231694, 209916, 232960, 225433, 222058, 64395, -61347, -28390, -8519, 64586, 125099, 320047, 390196, 208667, 80911, 114606, 185667, 128406, 76631, 181813, 201683, 32058, -112867, -228701, -330707, -392618, -315586, -218233, -132742, -115655, -103254, -86948, -47574, 28616, 103117, 59790, -14394, 138193, 141427, 246, -48102, -39546, 23463, 90686, 3049, 92542, 29956, -14751, 48944, 140366, 121788, 70706, -8855, 31227, 74759, 68450, 21385, -149159, -142490, -31392, 58006, 159525, 116889, 79415, 52751, 19440, 1034, -28317, -8119, 70800, 181535, 272390, 184309, 157705, 119539, 125536, 113342, 27343, 6382, 51526, 103752, 113292, 60905, 136585, 148409, 166388, 172072, 155074]
9087A55074j16078k1405R644Q5761n2844q644N5880N8203o4181R835N1024N1626
9075B13895j8128j42255Q375J19714K0887l0335j7034K7549j7714L6328r0954
9064A10328K2759O1000M788m7998M8819j02459q1675m6908m8463N5758M9475K5933
9052E1357L0246O769Q8185j7419q717J3579m2202m3691l4546P556J226K103n7521
9039c075k7452p4732J01988O5987p771j24686n1794J21375J18562n702J0698P8746
9027B02144L2290J1988N004r5150j7600q7639M7090O0597rJ6509r4257l4190p7430
9014c0653p9250l2873P8280O258J12372K4594j18563O1946m2003p9739J15684
9003A6053m810r4508M5104J46668L1445n3978j26347O3227O4559p42p9455M9484
$$ y = [155074, 38996, 17591, 27235, 112996, 60152, 51508, 107388, 165591, 101410, 111245, 162269, 213895, 195767, 53512, 61887, 181601, 202488, 172153, 155119, 182668, 164954, 201282, 110328, 133087, 194087, 198875, 150877, 199696, 97237, 15562, -31346, -79809, -24051, 25424, 51357, 81603, 88372, 176557, 159138, 150421, 164000, 121798, 78107, 43561, 51117, 52343, 54446, -3075, -30527, -105259, -3271, 62716, 54945, -69741, -121535, -160, 118402, 112700, 123398, 202144, 234434, 246422, 251426, 156276, 138676, 51037, 98127, 158724, 158715, 175224, 80967, 46777, -30653, -109903, -142776, -64496, -58238, 54134, 78728, -39835, 22111, -19892, -99631, 16053, 11243, -83265, -38161, 108507, 139952, 85974, -40373, 22854, 87413, 86671, 7216, 56700]
8991E6700M7588l851j28254J6514J32450P7380N070j5644j39417r60r0677j30129
8979a73230P4779J62956M6815L9245k631J4879j05068j29715K9022Q1315K9258
8968F7625j05019j9657p8155p2787Q1204P5070J40893n952p501j0860j6745L653
8956E1769j4547O9302O5445j28623p601L6328o1656j337P3723M6379j1234O653
8944A24601j07557j18843N2928L8210N3011P8110N6859o1993K1732L0646j16537
8933E1167p943Q3362L2936k0805J3219k6774q6634p4871j21515L4935p256R0069
8921d0110J665k0743j6797o7496K2936o727J2283L4189L439Q5067l2243P0510
8909D5973Q9491j19595n1998p5858P795J35912Q9496L0535j872j7271k9729l0675
$$ y = [56700, 104288, 100437, -27817, -11303, 121147, 198527, 203597, 187953, 48536, 47576, -43101, -173230, -98451, 64505, 111320, 150565, 147934, 162813, 57745, -71970, -42948, 38367, 67625, -37394, -57051, -135206, -207993, -126789, -51719, 89174, 83222, 75721, 64861, 48116, 51769, 37222, 106524, 171969, 43346, 35745, 72073, 10417, 9080, 82803, 129182, 117948, 124601, 17044, -101799, -48871, -10661, 42350, 120460, 177319, 115326, 137058, 167704, 51167, 43224, 126586, 159522, 138717, 151936, 125162, 38528, -36343, -157858, -122923, -130179, -40110, -38445, -59188, -75985, -143481, -120545, -127272, -114989, -80800, -77361, 7706, -24537, 45973, 135464, 15869, -36129, -111987, -104192, 31720, 121216, 151751, 149879, 132608, 102879, 72204]
8897G2204l641q9424j08677Q944L6794P0640M4506k0170J7024j1659j28137P1425
8885d0171J30557K8814O938J58906K8916p9135l9205j17279R453n696j7769J4978
8873G9307J06594m3799o5772j3842j8740q6876L1095l2009P2361J06180J6656
8862A51155j58896l8979P2096N9282j24614j6580Q2118N9288L4889p011q8916
8851B3832N2513J9806o6699K0866R5485j8993o6811Q8067m278M9771j509O4715
8839B56765m1577l9881K8934o9575j03114L229j03439J2236J0116q3421p4260
8828b03987k076O4740K01644L7251j158l9902j11089m7743n0469J1109L0294J16352
8816D966O3099M4604j5034q3941k4574O1378J01381O2963n6782j11104k529Q3536
$$ y = [72204, 68563, -20861, -129538, -120594, -83800, -13160, 31346, 11176, 28200, 16541, -111596, -40171, 90386, 119200, 126138, 285044, 313960, 234825, 195620, 78341, 87794, 82098, 64329, 79307, 185901, 142102, 76330, 62488, 43748, -43128, -12033, -44042, 28319, 134499, 151155, -7741, -46720, 25376, 84658, -39956, -56536, 25582, 84870, 119759, 112748, 23832, 76345, 96151, 29452, 50318, 145803, 126810, 59999, 148066, 143788, 193559, 192050, 256765, 215188, 175307, 204241, 134666, 31552, 34781, -68658, -56422, -46306, -129727, -203987, -206063, -141323, 60321, 97572, 96414, 56512, -54577, -102320, -152789, -141680, -111386, 4966, 68065, 112669, 97635, 13694, -10880, 50498, 151879, 214842, 158060, 46956, 44427, 127963]
8804A27963J5492J5032M0236l456o318k9651N5164j390j06187K6586J2122l0921
8792A14672P066q315j03976K7051N6404L9110q7775q6859p1992n6730K22546Q1430
8780A32632l7382l8241o3358N2523J62605O9681N1441j2549k6505p9790j66649
8769D4408p994J3710m5513m1665j7599j921J0426L6802K2877P5827J5079n4522
8757D9915l6195M5987k5429k7254j44845l4199O5394Q2947J69996J19445j04438
8746A61324j77868m6273n1264k5418R4182L0359o0722o1004J3733J2989N7071
8735e2891k2664p8085R813J44768J2748k8106Q0108k981O501k2716M4368l6481
8723E4382k4433j05678n5475Q5972M1975Q8272K9578k1707j4811j9910Q3548P953
$$ y = [127963, 143455, 158487, 198723, 195267, 188949, 159298, 214462, 213072, 106885, 133471, 145593, 114672, 121738, 113423, 9447, 36498, 92902, 132012, 44237, -42622, -114614, -171344, 51202, 132632, 95250, 57009, -6349, 46174, 208779, 278460, 329901, 317352, 290847, 211057, 44408, 36414, 50124, 4611, -37054, -54653, -56574, -46148, -9346, 13531, 89358, 104437, 49915, 13720, 59707, 34278, 7024, -137821, -172020, -106626, -23679, 146317, 265762, 161324, -16544, -62817, -114081, -139499, -45317, -14958, -75680, -136684, -122951, -109962, -52891, -75555, -153640, -143827, 941, 13689, -14417, 65691, 62710, 69211, 46495, 90863, 54382, 29949, -75729, -131204, -45232, -3257, 85015, 114593, 92886, 78075, 58165, 141713, 149666]
8711A49666r1553q6275l7095L4096P8975K5263j72602r4153J13492M8822m1049
8700g2413l7425J22616M7881j9118p1074J2928J6736R987K5059m3725j725J4504
8688D231J91895o8905j28400M1490R1070n7101K7527J892L0026L9425N8699r4024
8676A37825J6633M7314J50539k7714j96328K9108J12821Q386P585p8377j9180
8665A88612r3426l8744j00610Q1485J04475N723L3452o1913q0940p6296n0325
8654h8507K959o286j6779M9967J17953N1442p2213k0532n3356O6892l7904l1109
8642c7473n4088Q7994J03530m3658j3885O0009k8379j11984K0752J25937k1004
8631H7751k2607N4755k0532l1597p4759r7666l6853R0233M3862L4858l7105J15856
$$ y = [149666, 58113, -28162, -65257, -31161, 47814, 73077, -99525, -193678, -80186, -31364, -72413, -109838, 12778, 60659, 41541, -29533, -16605, 131, 10118, 35177, -8548, -10273, 4231, 196126, 127221, -1179, 40311, 131381, 74280, 101807, 103699, 133725, 173150, 231849, 137825, 154458, 201772, 352311, 324597, 128269, 157377, 270198, 278584, 286169, 207792, 188612, 95186, 56442, -44168, 37317, 141792, 147515, 180967, 119054, 38114, -38182, -88507, -85548, -91834, -108613, -58646, 59307, 110749, 38536, 18004, -35352, 31540, -6364, -37473, -91561, -3567, 99963, 56305, 42420, 102429, 74050, -37934, -17182, 108755, 87751, 65144, 119899, 99367, 67770, -6989, -104655, -141508, -51275, -7413, 27445, -9660, 106196]
8619A06196j1775j61626l8610J82982J42485N4742J5090l3304o3021r8273P4624
8608A69510M4066m7661q7528N805K3831o2680m3695M456o043O2842M5739k9368
8596G9274j04328j32995q713J24337J58783N458n9037k8810P8997J19434J34752
8585C67152Q396k2321o2586k33310o2727J01578m6111n4028Q903J04382Q1136
8574A90464R286l7269r2802j17293K6313J0875q011R6562r662j06407K270J13851
8562G8177m0813m8699l5558R1068P7725Q2828J1485m4166k6409n2104n5365j16425
8550g8256J6501J6056L4151R2228J22245j11658q5247R9158J28941k3236j21982
8539H8901j01296p3845N5456Q7814j0630N067N2020K3966J617L1582o6224j53836
$$ y = [106196, 94421, -67205, -105815, 77167, 219652, 274394, 289484, 256180, 193159, 94886, 169510, 213576, 165915, 78387, 84192, 108023, 45343, 1648, 6104, 61, 62903, 108642, 79274, -25054, -158049, -166762, -42425, 116358, 121816, 62779, 33969, 112966, 232400, 367152, 375548, 353227, 290641, 57331, -5396, 96182, 50071, -3957, 4946, 109328, 190464, 199750, 162481, 69679, -47614, -21301, -10426, -18437, 78125, 68463, -37944, -35674, 78177, 37364, -11335, -46893, 44175, 121900, 204728, 216213, 172047, 145638, 93534, 38169, -78256, -61755, -45699, -11548, 80680, 202925, 91267, 6020, 105178, 234119, 210883, 88901, -12395, -86240, -30784, 57030, 46400, 51467, 103487, 127453, 129070, 160652, 94428, -59408]
8527e9408m4536Q8902q424M0554N4529O3873p1434j55661n1824J7756J7469L2864
8515g5340O3365J72074L0038l8096q2841r5947n6192m4449j8157J98415M3619
8504I6489q6014o5929q7061J330j5117q2152O5513J16027L2374J5779k5677L9855
8492E417p8619M9494M85j4592n2896N3691J02644l8535J8959j5769q7911j76896
8480b34528m7243k4970O7642Q9102J8406M2783K6569k2657M3897k2990N3061r7537
8468a08465p0335R6127P4041N3766J1142k2266l4197r4961O6266J4263n9744O2232
8456a2131j03482q2192o1939j8963k1556R1224R6378K0793k4252R3097J46161
8445A23138n425J36490k4554r0586m9852P3659l7305N813k0480j52273j15975
$$ y = [-59408, -103944, -15042, -23466, 17088, 71617, 135490, 64056, -91605, -143429, -125673, -108204, -75340, -11975, 160099, 190137, 152041, 69200, -26747, -82939, -127388, -145545, 52870, 96489, 10475, -55454, -142515, -141185, -156302, -238454, -172941, -56914, -24540, -8761, -34438, 5417, -73202, -23708, -23223, -37815, -90711, -37020, 65624, 27089, 46048, 30279, -57632, -234528, -281771, -306741, -239099, -149997, -131591, -88808, -62239, -84896, -40999, -63989, -10928, -108465, -178800, -82673, -8632, 45134, 56276, 34010, -187, -95148, -28882, -14619, -74363, -12131, -115613, -197805, -259744, -278707, -300263, -209039, -112661, -91868, -116120, -23023, 123138, 117713, 254203, 229649, 139063, 89211, 162870, 125565, 131378, 110898, -41375, -157350]
8434a57350O7948J67756J25299j25618K33J00296L3558j07668m2999r022O4466
8423A16899O343L7916q2923J18477l826l1868p0814o4246k2627n83O755n782J4447
8410A8168j6209L984j3304k798k777J32160J24378M75k3603j57830O80m2481o9404
8397d8561m5320P3586q951j17145p1204J36576J66244p2218k0800p530J56176
8386A40853M7002j6241q6361j35031r5447J41925J2113l9838M6302J8812q8780
8375e4691J1203K39776Q2822q6334M921o7206j16530q0422O7476N7504R069j4672
8363E2916r5212j40410M2907r037o6853K2230m6003J7725J87738L6756j4297P6325
8351F4785r96n4788l1353L5872n5507M1434K4207l3235J64156n9343l0232j04999
$$ y = [-157350, -89402, 78354, 203653, 78035, 78268, 178564, 212122, 104454, 61455, 52433, 116899, 123242, 161158, 78235, 196712, 192886, 161018, 90204, 25958, 3331, 2748, 9503, 3721, 18168, 1959, 5943, -7361, -10159, -12936, 119224, 243602, 244077, 220474, 62644, 63324, 20843, -48561, -93881, -20295, -29246, -146391, -217595, -81019, 85225, 13007, -7793, -15323, 140853, 187855, 171614, 85253, -49778, -145225, -3300, 8813, -31025, 15277, 34089, -54691, -43488, 196288, 279110, 192776, 197697, 130491, 13961, -66461, 1015, 58519, 67588, 52916, -42296, -182706, -139799, -148836, -215689, -193459, -239462, -221737, -33999, 2757, -11540, 64785, 63789, 9001, -22352, 13520, -41987, -553, 23654, -9581, 154575, 95232, 65000, -39999]
8339c9999j35589N2001J57415Q7730j4168o7461j2739L8505L3904J7833M3036
8328A60468j7648O894j44575j228N9964r7202r4176L0098o3618o0905M6238Q5513
8316i0177Q2720j208j2556j4178m6000N2569R2779k4131j4437J08841n4587o0900
8304A8735j09053K2858L3294N9923M9134l2147r3064j67843J03286J71102n5421
8293H04j33445Q2355J42895N9010J01388j18551p2745q0344Q6119J06263n9561
8282A14188l7729k4062K7603k6389K1121N0226R2159j15831j12700M6220N9019
8271I3825J0429m9834K7017p8157o6252m9543j06839N0222O6384O4674R8724j28004
8259f7354k8129J44462L7125m2556P8365M8301R4114Q4155r9070j09186k806P9662
$$ y = [-39999, -175588, -123587, 33828, 121558, 107390, 39929, 27190, 65695, 99599, 117432, 160468, 142820, 149714, 5139, 3911, 63875, -33327, -127503, -97405, -161023, -221928, -175690, -90177, -7457, -8665, -21221, -35399, -81399, -28830, 63949, 39818, 25381, 134222, 79635, 18735, -90318, -67460, -34166, 25757, 74891, 42744, -50320, -218163, -114877, 56225, 804, -132641, -50286, 92609, 151619, 253007, 134456, 61711, -18633, 67486, 173749, 114188, 76459, 52397, 80000, 53611, 74732, 124958, 217117, 101286, -11414, 34806, 93825, 104254, 54420, 81437, 3280, -62972, -112515, -219354, -169132, -102748, -38074, 60650, -67354, -95483, 48979, 86104, 43548, 121913, 170214, 264328, 348483, 249413, 140227, 137421, 217083]
8247B17083R704L0453q4648m6267r0154m7509K102O9081l4066k7983J8357K9142
8235D5295n3028q5053r3302p1155J3293R2577M6505k7192L1301R7454N410N1960
8223E4065k5914M3097Q0l4599Q1690Q2479k1571J05883r4090j67005r9752L5590
8211d0047n0669n304M0356Q7232M5492l4055k7853M5593O2780k2484r434j11014
8199a9407r0480J0907j0850O040m7998J00630K4189Q6219o2791J5717J21814N6865
8187A90855N3464o830n7851o5739j41977q9780j7712O1612R6695O3492n0674m5896
8175a0341n7206K5814j4428J9934o9830p2052J63337P635j09288j13377J16239
8164a13563J05921L026J6204N1951r0599n0214M7706q0537J07140P8877n4668
$$ y = [217083, 226787, 257240, 172592, 126325, 36171, -11338, -9236, 59845, 25779, -2204, 16153, 45295, -7733, -92786, -186088, -257243, -243950, -151373, -104868, -132060, -100759, -3305, 2105, 54065, 28151, 71248, 71328, 36729, 118419, 200898, 179327, 285210, 191120, 24115, -75637, -40047, -90716, -96020, -55664, 31568, 77060, 43005, 15152, 60745, 123525, 101041, 91607, -19407, -109887, -98980, -109830, -103790, -151788, -51158, -26969, 59250, -3541, 12176, 133990, 190855, 244319, 237489, 179638, 113899, -28078, -117858, -135570, -73958, 22737, 86229, 35555, -10341, -67547, -41733, -56161, -36227, -106057, -178109, -14772, -7137, -116425, -229802, -113563, -7642, -4616, 11588, 63539, -27060, -77274, -29568, -110105, -2965, 75912, 21244]
8153B1244k16141Q0186J36106n6325l9634R1335q5382k18082o463R0973K4516
8142a77667Q8401j179l1345J22747J5993j8061q616R4697J29508m1937n4350m5906
8130G2285Q9113N5656n3968q6681j898O4141k9168j58454r5187L4346K474k4905
8118a32246O041J13223L9928J983o0237P983n0923l7968p3284k930J64496R0522
8106F6588N5573r767m0906P542L4364n808k9543j4235J4502J1702k665l8106m8684
8093E57J3623n1700J1540m2188p9436l1593n588L5259o286K6954J85513l7999
8081A8656K8500J9392o6917L6200p0251p5536K1790N9151J3349q9371m7723M669
8069a48091K8184Q6899K0173j08932p1060m9810j30316P3932K25431J81892L6770
$$ y = [21244, -194897, -114711, 21395, -34930, -74564, 16771, -68611, -286693, -293156, -202183, -177667, -89266, -90445, -121790, 957, 16950, -1111, -9727, 84970, 214478, 172541, 118191, 72285, 161398, 217054, 163086, 76405, 74507, 138648, 109480, -48974, -144161, -109815, -107341, -132246, -126205, -12982, 26946, 28929, -31308, -23325, -74248, -112216, -185500, -188430, -23934, 66588, 122161, 112394, 71488, 79030, 113394, 107586, 78043, 63808, 78310, 90012, 87347, 49241, 557, 14180, -37520, -25980, -68168, -147604, -179197, -184785, -149526, -155812, -128858, 56655, 18656, 47156, 66548, -369, 35831, -34420, -109956, -88166, -29015, -15666, -105037, -152760, -148091, -119907, -33008, -12835, -121767, -192827, -242637, -372953, -299021, -73590, 108302, 145072]
8058A45072l072L5380l3116r6353q835K6844m5005J07582o5314j9428K8106O6008
8046A37869n1035k7391j0792K7325J09258j33333l1816o5147n7877Q8628L9900
8035B5589n7830o7585o2099k7160O3187Q5441p3024M0605k7421J4758Q5333p3216
8023g3422P3769Q2168o7528L0146M0953l3505L05L2490J991M050P9176p7304J8144
8010A11433n3123r5415O08J6685o3815j8519m5321j3273j4976O6026O2548j13021
7998a60163r0811o6065R3727O1674o9322P6853R9099J05039O4312j01466o4410
7987e1533q2351L3831J20456r239q2744N264J10181j3979o3086l5360m3873J928
7975a10505L2127J1468n3657R5855k06o3191K0356O0810p7374O2458J25227J13307
$$ y = [145072, 142000, 177380, 144264, 47911, 39076, 65920, 20915, 128497, 63183, 43755, 71861, 137869, 86834, 59443, 48651, 75976, 185234, 51901, 20085, -45062, -102939, -14311, 25589, -32241, -99826, -161925, -189085, -125898, -40457, -113481, -72876, -100297, -85539, -206, -73422, 347, 82515, 14987, 45133, 86086, 52581, 52886, 85376, 87367, 91417, 170593, 93289, 111433, 58310, -37105, -36497, -19812, -83627, -102146, -147467, -160740, -175716, -109690, -47142, -160163, -250974, -317039, -223312, -161638, -230960, -154107, -55008, 50031, 114343, 12877, -51533, -133884, -100053, 20403, 11164, -71580, -66316, 43865, 29886, -33200, -68560, -112433, -110505, -78378, -66910, -120567, -24712, -24918, -88109, -67753, -6943, -84317, -21859, 103368, 216675]
7963B16675m8963n2255j06312M3585O5531Q2856q0502o3992J3363O1021q1436
7952D9571j56724N4737J60725n5381k6708j6782j8662O6295M7043p2100n4006
7941b1992J42838M6764J3282l2381j30333j7415m4835M2530N972P5413M7946l5877
7929I1912j02606m6762k346J7934j28695l4659Q3123M4925Q9244P5097j7644j08829
7917c9306m6482k8386J2305k8754k7074J47986l3364o8272J06990J32179P497
7906A35319p3772j40718N8764J49877l2909j34426J9814J3015o2091q7252p2173
7895b26552J7099R0308R2415J20566o2886l0838R347L1986m5277L687k1640K4629
7883B844k0797R2288K2496q8233J4446m9582K6648J39139m4516r7536j27281q119
$$ y = [216675, 167712, 115457, 9145, 52730, 118261, 201117, 120615, 56623, 69986, 131007, 49571, -107153, -52416, 108309, 52928, 26220, 9438, -9224, 57071, 104114, 32014, -21992, 120846, 167610, 180892, 148511, 18178, 763, -44072, -1542, 4430, 79843, 127789, 91912, -10694, -57456, -59802, -41868, -170563, -205222, -122099, -77174, 12070, 87167, 69523, -39306, -85788, -114174, -101869, -130623, -157697, -9711, -43075, -111347, -4357, 127822, 135319, 61547, -79171, -20407, 129470, 96561, -37865, -18051, -5036, -67127, -154379, -226552, -209453, -119145, -26730, 93836, 30950, 112, 9459, 41445, -3832, -145, -21785, 2844, -17953, 74335, 96831, 8598, 23044, -26538, 110, 139249, 94733, -2803, -130084, -138203]
7871a38203J40596N1870Q6172l0399n6698Q3660k4871n8899j3451N4649l7725
7860E6701r0122j25685K4512R0511K4918o7753J06566O7259Q642k8946l8317l2891
7848d605j21536j6762O2987M9660M0025l8147j11834n891R5554k3807j34924l3900
7836b43180R5128O1072M5388M2526k9573l4591k1071K2505p0356j02848Q7993
7825a47007n1988n597j9164J0089K07596M6955n8514n3818J1752l7283m296N086
7813i6189l8144j1644O7499Q3240L7204o125J14962J11935o5002p5427q351m0970
7801G2988k3472k800N7973j05707q5317M8636O1950q5853K8858L6162k2549M787
7789a4344N941n6909J04538M3604j3189j71285P0963R2740O1935j04193K6310
$$ y = [-138203, 2393, 54263, 140435, 110036, 53338, 136998, 112127, 53228, 39777, 94426, 56701, -33421, -159106, -134594, -44083, -19165, -86918, 19648, 86907, 95549, 66603, 28286, -4605, -126141, -142903, -79916, -30256, 9769, -28378, -140212, -146103, -50549, -74356, -209280, -243180, -148052, -86980, -41592, 934, -28639, -63230, -84301, -61796, -132152, -235000, -147007, -198995, -204592, -223756, -213667, -6071, 40884, -17630, -71448, -59696, -96979, -101275, -96189, -134333, -145977, -78478, 4762, 41966, 35841, 150803, 262738, 197736, 122309, 113958, 72988, 49516, 46716, 104689, -1018, -86335, -37699, 24251, -61602, -32744, 3418, -19131, -14344, -8403, -65312, 39226, 82830, 69641, -101644, -30681, 62059, 123994, 19801, 46111]
7778D6111M1072n0251q7591r4985K1970q961N1468l7739k8993O8584m1181p8172
7766a98668K4100K1486l5340R0507J43584m0413p712R5647q3K3735j47927l6220
7754f7304L4520j4004M8801J8942k4458J6421m4607J3469Q6170j8407j22604j3106
7742h6167N5437J09243Q717n3254m4176P1942K7908k5164o0486m1178j811M0042
7730A053K0875N6203j12551o9377M4013N7996n0982M2623K0065k7747M3648j9600
7718F219l5830J4993K6165n7079k0660m5380m5428n9584N1150M2142J13804N9081
7706D9593J08279m960m644m1838p0205P1468Q8703k5324j56945n0886j898r249
7694d7906J06149J15464o6096l8434M8204o7782j24303O6393O8394p808K6887
$$ y = [46111, 87183, 36932, -50659, -145644, -123674, -132635, -81167, -118906, -147899, -79315, -120496, -198668, -174568, -153082, -188422, -97915, 45669, 5256, -2456, 93191, 93108, 116843, -31084, -67304, -32784, -46788, 2013, 20955, -3503, 12918, -31689, -18220, 67950, 49543, -73061, -86167, -30730, 78513, 87230, 33976, -10200, 61742, 89650, 64486, 4000, -37178, -38989, 1053, 21928, 78131, -34420, -103797, -59784, -1788, -52770, -10147, 9918, -17829, 25819, 6219, -29611, -14618, 11547, -45532, -66192, -111572, -157000, -216584, -165434, -123292, -9488, 49593, 157872, 152912, 148268, 106430, 36225, 107693, 196396, 171072, 14127, -36759, -38657, -47906, 58243, 173707, 107611, 69177, 117381, 49599, -74704, -8311, 60083, 52275, 79162]
7683G9162j60191n1417l9234m7738J28477l7718j15469k315J38432k3395n2672
7672a84078o0J5244R8131J43836K4921r3994m4131J8968k3407O6651j0477p9973
7660f8369k0873J29K300P723L9472m8801j1282O7911J1591L9596K2779p4379o78
7647c2881j6869N7466M0948l7173j1459P4728N1772M7587q1306o3263j6369R3303
7635A06484l11O0971J8790J27899j45393k79776j7742J05113J07140M298p8757
7624H716J7199R3392R4081k6790k18232K374K6599K8521J11560L565j25133j04737
7612h8885j0638M3300l8195J12073o1246k9893n8313j5663p5786Q1777Q0721j14067
7600a74815J16952n5029n4128K8533n230J03724j1446q8655L9483O8741k5844
$$ y = [79162, -81029, -132446, -171680, -219418, -90941, -128659, -244128, -246443, -108011, -131406, -184078, -184138, -168894, -70763, 73073, 97994, 4000, -40131, -21163, -44570, 22081, 11604, -68369, -89242, -89113, -86813, -79090, -39618, -88419, -99701, -31790, -20199, 19397, 42176, -32203, -32881, -49750, 7716, 48664, 11491, 32, 74760, 126532, 174119, 92813, 29550, 13181, 106484, 106173, 167144, 185934, 313833, 168440, -111336, -129078, -23965, 83175, 87473, 8716, 25915, 119307, 213388, 186598, -31634, -29260, -2661, 25860, 137420, 140985, 15852, -88885, -99523, -56223, -94418, 17655, -43591, -73484, -131797, -147460, -223246, -141469, -60748, -174815, -57863, -112892, -167020, -138487, -143717, -39993, -51439, -140094, -100611, -31870, -57714]
7589e7714l2506k2152K8923p5976Q266N8502L5288l4432n744J42568k2789l2575
7577a0341j7518K8854N795K8693L5230l0803k02558l8076J71049j08838n9133
7566a97646J2057R3833M0042Q3033j006j6819L3139N740O6166j53532n3422m355
7554i2770J30548K18528P963j24070o4633r1024j6327q288L6422J15415n872j43296
7542c7404k5781N8412K3058n7089P9023M8854j17313j34690N0933R8039n3202
7531f7160q4239N592J15306J15382M397P0980r9085j6809o3340K6015P2560m6559
7519C3040M882l4648o9571r2636J14156l9047l3404Q4841M5824m9751L3758Q5017
7507H2461K7117k9630j33060o5568j003J66773k8755j28854K8175K7685O1115
$$ y = [-57714, -90220, -112372, -83449, -159425, -151159, -92657, -57369, -91801, -97545, 45023, 22234, -10341, -27859, 995, 6790, 35483, 70713, 39910, -162648, -200724, -29675, -138513, -197646, -185589, -91756, -51714, 31319, 30313, 13494, 46633, 52373, 118539, -34993, -88415, -92770, 37778, 256306, 264269, 140199, 75566, -15458, -31785, -40073, -3651, 111764, 105892, -37404, -63185, -4773, 18285, -38804, 40219, 89073, -28240, -162930, -111997, -13958, -67160, -151399, -145807, -30501, 84881, 89278, 160258, 61173, 44364, -18976, 7039, 79599, 33040, 37922, 3274, -66297, -158933, -44777, -83824, -117228, -32387, 13437, -36314, -2556, 82461, 109578, 79948, -53112, -118680, -119683, 47090, 18335, -110519, -82344, -54659, 6456]
7496F456L2394j04775m2040R8099o1356o0519J34753J51427M6693p032n6792j6789
7484A20519o1164k9738L0784q9955o3512p9930K4957R5289n8082m1106m8926M7907
7472a52957J0368J0715N2606O0222r3438m845J23317J06477N8901o4853j5430
7461I1083l4806M2201K5409L4322L3101p8245m5722J4110j8049m1557O7632j52100
7449f2621j15583J05015N7778K4557J01778Q3729L4281r755m0867j13558q1898
7438a7144L8764M6297j14931P739j12351n5603l3700N615O3863R1033P9083L1966
7426C0631p6235K9721J52137J18527p674j28182j23729l2569r9876p2412O2351
7415a47310Q5852J6959J0974L0774J24033P4874l4033m5545n3478n1788m5338
$$ y = [6456, 38850, -65925, -107965, -9866, -71222, -131741, 3012, 154439, 201132, 194100, 137308, 120519, 59355, 29617, 60401, -29554, -93066, -172996, -148039, -52750, -110832, -151938, -200864, -152957, -142589, -131874, -79268, -19046, -112484, -117329, 5988, 112465, 171366, 106513, 91083, 56277, 98478, 123887, 158209, 191310, 113065, 67343, 81453, 63404, 21847, 89479, -62621, -178204, -73189, -15411, 9146, 110924, 194653, 228934, 219179, 178312, 64754, -17144, 21620, 67917, -47014, -39275, -151626, -207229, -240929, -235314, -171451, -80418, -1335, 30631, -45604, -15883, 136254, 254781, 247107, 118925, -4804, -37373, -137249, -209661, -147310, -61458, -44499, -33525, -2751, 121282, 196156, 162123, 116578, 63100, 11312, -34026]
7404c4026l3407K2033P1594j4687q1662l9120J9811p4755L2438J773j0192K5814
7392a14386l1141K2060J6188M196J1255N7798J08018k1487k12264L3574J31867
7381E678J21166J0607l3152j82721m2605J04217J21327l612r8168J2727o6914
7370e1450M947Q1914o504j4501O4685R0707m8947n879n4637Q1751R8054r6982
7358A43158n9768p6576l0759r169J5468N3490j7533M909o2557q2651p7737p9396
7346b79121L7239k5534L3142P0240J466J40376R6839l4523p560J13534q3476j9440
7334D3182j5627p2631K9367M2038l4402O9576j63095p8128N1522l5307J540N8667
7322a03298R0981N0830n6826Q89n9940Q8614L1833N4796k627j11174o6186Q8425
$$ y = [-34026, -67433, -45400, 26194, 11507, -70155, -109275, -89464, -164219, -131781, -130008, -140200, -114386, -145527, -123467, -107279, -103083, -91828, -34030, 73988, 52501, -159763, -126189, 5678, 126844, 137451, 104299, -78422, -121027, -16810, 104517, 100905, 2737, 15464, -51450, -46503, 35411, 28907, 14406, 79091, 169798, 120851, 114972, 60335, 142086, 240140, 143158, 83390, 6814, -23945, -33114, -17646, 35844, 18311, 23220, -39337, -121988, -199725, -279121, -241882, -267416, -234274, -164034, -162568, -22192, 74647, 40124, 32564, 146098, 62622, 43182, 27555, -45076, -15709, 26329, -8073, 61503, -101592, -179720, -128198, -163505, -161965, -103298, -12317, 38513, -18313, -17424, -77364, 11250, 43083, 97879, 95252, -15922, -82108, 6317]
7310F317M2577R1524j6715l668R0082j19046p8289M1866j206p4744q9227n0520
7298a61049R7777m6342k1231M8260j32373Q848P7482J06368K4725O0990j15935
7287e2480m6804O9433J48721m7284q1089j1213L6121O1529k4777Q574k7133o8841
7275c5243r5781j13341L4683o9493l6861Q1034J00242M1711k2567j26992N7823
7264a84785p562J5982N7083O3741J01530m039j12854J0795P5670m506q9741k101
7252h0787J083m4725P7365J6490n4157j05433O954O5836N4659O8538L5148r657
7240C1314J20890k7568j20402r4509J3212N9399q180l1443N07K2935k6210m697
7228f4752k4636O4811q2282q8742P1402m0679j051J45640N9495L9617m5q6950
$$ y = [6317, 48894, 140418, 123703, 120035, 210117, 91071, 12782, 54648, 53442, -21302, -110529, -161049, -63272, -109614, -130845, -82585, -214958, -206110, -128628, -22260, 2465, 63455, -52480, -99284, -29851, 118870, 71586, -9503, -20716, 15405, 76934, 52157, 60731, 33598, -35243, -131024, -244365, -209682, -279175, -316036, -235002, -134760, -93049, -115616, -242608, -184785, -192347, -176365, -119282, -55541, 45989, 41950, -70904, -60109, 15561, 11055, -78686, -80787, -79704, -124429, -47064, -30574, -84731, -190164, -183210, -117374, -62715, 5823, 40971, 31314, 152204, 124636, 4234, -90275, -77063, -17664, -25844, -57287, -56780, -33845, -60055, -64752, -89388, -24577, -106859, -195601, -124199, -164878, -165929, -20289, 39206, 78823, 78778, -8172]
7216h172l5597K5290j6078J4537R779N8896J12333m9891j30406K2282r3495J6451
7204g4071P2102J27675q7052n964J986m6498O1810N1675k6558O3125p7408L1243
7192I2065J33400o9958j86897n0013j4163m0683Q3395J37339l2778j15929Q7689
7181B3467J07395j36469K3952j11382j49687O3683n72l8958J02450J08739M9001
7170D1619j08945j45558o8250P3545O5281O0266P8828J12054m2179j18224q3125
7159a34688R6523P0156l1488j6245k7217N4555j3102q9620j0366J4809Q763M2047
7147c5873j8601l9104o5204j0918R3555R6141J29106J2888o7816k3237k4075l8991
7135G871l0273N3035L8915j0946p7901j12095N9420N79J9943o8099P8352Q0250
$$ y = [-8172, -43769, -18479, -34557, -20020, -10241, 48655, 160988, 111097, -19309, 2973, -90522, -74071, -1969, 125706, 38654, 32690, 34676, -11822, 49988, 101663, 75105, 138230, 60822, 92065, 225465, 155507, -31390, -81403, -95566, -136249, -52854, 84485, 51707, -64222, 23467, 130862, -5607, 18345, -93037, -242724, -179041, -179613, -218571, -116121, -7382, 41619, -67326, -212884, -281134, -207589, -142308, -82042, -3214, 108840, 66661, -51563, -134688, -38165, 31991, 503, -15742, -42959, 11596, -1506, -91126, -101492, -86683, -77920, -35873, -54474, -93578, -158782, -169700, -76145, 19996, 149102, 161990, 94174, 70937, 46862, 7871, -22402, 30633, 69548, 58602, -19299, -131394, -71974, -71395, -51452, -119551, -41199, 39051]
7123C9051n6082j25873j3520Q3016J10879J3653L0394p5676o3756M7130j40647
7112a51431j6651P9837J36531k0561j31023J394N1368R8813P873k5991J44305
7101A74464n0458j54456L0305L3049n4597J190K6984q2309N0137l1451K9120k9225
7089e7247p0431j07544K94R7213N6406n780m2897J8996J33502K026l3516O7250
7077E8272l6076M1440o1982n8674Q0265M6753j16491j60907M1275J78839O8871
7066H1585m0999o0613j6329J01957k1226j1972l3784p8260J23949O5640o5538
7055D4410j10878K6796k2409M6827M1278l6402j03086j2212m671n3427O7128J05336
7043a1310O3890k12217k8926P5262M6512N1770K677L882L2495j4512Q232p0504
$$ y = [39051, -17031, -142904, -156424, -73408, 37471, 51124, 81518, 5842, -57914, -10784, -151431, -168082, -88245, 48286, 27725, -103298, -101904, -50536, 48277, 56150, 30159, 174464, 124006, -30450, -145, 32904, -21693, -20503, 6481, -75828, -25691, -57142, -28022, -57247, -127678, -235222, -234928, -137715, -81309, -87089, -129986, -110990, 22512, 24538, -8978, 58272, 22196, 63636, 1654, -57020, 23245, 69998, -46493, -207400, -166125, 12714, 81585, 40586, -20027, -36356, 65601, 44375, 32403, -1381, -79641, 44308, 109948, 44410, -66468, -39672, -62081, -15254, 26024, -10378, -113464, -125676, -130347, -183774, -116646, -11310, 52580, -159637, -188563, -113301, -66789, -15019, -12342, -8460, 24035, 9523, 17755, -52749]
7031e2749N8068n242o9912J07809k7982r5523P7243P1508J43219l6550l6826J1993
7019A45056p9107K2352o0459j43841j8017J3267m8545J62797K4493K9272J0267
7008E7535o6344L6589o2860o430J43008J3160l6368l6099l0885L1208M8637P3554
6996A64705k454j75967n5247R735j1082N2819Q9241o0631j5478J00345O7817j29005
6984C4798j73789n7005R9825P2893k3850l2725J1213l0538l5910l7960r215L5598
6972a46665J17564R6435k7747L1713j5192l9125j37217l3644q3320k8753J73806
6961i2145J11190Q5875J0775j68463m769m2852M0612N901L7555O8248k7381O5122
6949H9668l0316r9557J6359J50144K8692r3206L397l3759o6533o1035l5357Q0036
$$ y = [-52749, 5319, 77, -69835, 37974, 9992, -85531, -8288, 63220, 206439, 169889, 133063, 145056, 65949, 88301, 27842, -115999, -134016, -120749, -169294, -6497, 17996, 47268, 57535, -8809, 27780, -35080, -41510, 101498, 114658, 78290, 42191, 11306, 42514, 91151, 164705, 162251, -13716, -68963, -59228, -70310, -17491, 71750, 11119, -4359, 95986, 163803, 34798, -138991, -195996, -96171, -23278, -47128, -79853, -68640, -99178, -135088, -173048, -182263, -146665, -29101, 67334, 39587, 71300, 56108, 16983, -120234, -153878, -237198, -265951, -92145, 19045, 104920, 115695, -52768, -57537, -100389, -59777, -53876, -16321, 51927, 24546, 89668, 59352, -40205, -23846, 126298, 154990, 61784, 65181, 31422, -35111, -96146, -131503, -51467]
6937e1467k9323j7814K7464J5633q1476m3073P4400Q4307q7040N6559O2749j03757
6925i2838n3149N9502j12078o8862J06423J33726P5431M9964o3682q2117n4297
6914a01977j8329j4o950n408p625O9910J1393O8143J04106J80194m367j13487
6902A75589m6963m2888n0073q8405J12463m6699j0705O5562J37454r3225K029
6891A14139J6161m4756k2874L4369Q5520J22514l551q2797r6531q7248r7399K7936
6879c4517L594j04172R0985J38091o927l0863K4716q9776K9850O3282o8540j55719
6867a39996j16311L8623M4867L9503N6037L6188Q8880J3388n8959l9387J25720
6856H8553k7681l6414k6166j0314N338q4030J13465J12210j25062K8676N6519
$$ y = [-51467, -80790, -98604, -71140, -55507, -136983, -180056, -105656, -21349, -108389, -51830, 10919, -92838, -145987, -86485, -198563, -267425, -161002, -27276, 48155, 98119, 34437, -47680, -101977, -120306, -120320, -127270, -132678, -140303, -70393, -59000, 9143, 113249, 293443, 289076, 175589, 128626, 85738, 35665, -52740, 59723, 13024, 2319, 67881, 205335, 112110, 114139, 130300, 85544, 62670, 97039, 182559, 305073, 301522, 218725, 122194, 34946, -62453, -34517, -30923, -135095, -44110, 93981, 87054, 56191, 80907, -8869, 20981, 84263, 15723, -139996, -256307, -217684, -172817, -133314, -77277, -41089, 47791, 61179, 2220, -37167, 88553, 60872, 24458, -1708, -12022, -6684, -90714, 22751, 134961, 9899, 38575, 95094]
6845I5094n6146j2478l5844Q0739n3227k7323P0324M1545r4941l8186O5882o3815
6833b8376q4535n309Q3976q897L3472m367k01524Q4382P2216K1481k185j7634
6821e7300K5680k9677J0378j534j21897K5108m971J17083L9618j3908o8435L2076
6809d7779o3566K4271O6907M7637l3782p4717m8192q0650o7167j9504p150J6567
6797b87125P9785M0946q2342M5574M5974k4613p5496J18008Q8945m2170P2789
6786a9725N3424N8265q1318l4875j4539K8830J56687p0153l7721p0711m8323J06452
6774B6293M4165m9148J38184R588J2812K4202q5264j45090m404P1347K0557j01769
6762c8527n2140n9262o5713M530J21641j1036R3267J41833p3706r8732m4719o5176
$$ y = [95094, 38948, 26470, -9374, 71365, 18138, -9185, 61139, 102684, 7743, -30443, 35439, -28376, -112911, -118220, -34244, -43141, -9669, -14036, -215560, -131178, -58962, -37481, -39666, -57300, -31620, -61297, -50919, -52453, -174350, -149242, -154213, -37130, 2488, -11420, -79855, -47779, -111345, -87074, -20167, 27470, -6312, -81029, -129221, -209871, -277038, -296542, -303692, -287125, -207340, -166394, -248736, -203162, -157188, -181801, -257297, -139289, -50344, -92514, -19725, 33699, 91964, 10646, -24229, -38768, -9938, 146749, 76596, 38875, -31836, -80159, 26293, 70458, 21310, 159494, 169082, 181894, 206096, 120832, -24258, -28662, 42685, 63242, -38527, -90667, -149929, -215642, -211112, -89471, -100507, -7240, 134593, 60887, -37845, -82564, -147740]
6750a47740m9089M5231K1009J15346m1575J0078M7996N8769Q063o691n1444M3414
6738E3367j5481l4813L3865O5376n6342o1459k9584l1457m1501O2771P6305K8508
6726D9555o2290J1836K8208J9247q5556r015M3965K9249j18098j85896J05300
6715a73495J06572M82J21401J20577l4517n3960q2082l9770J4958n6409n4245
6704a30488N3891N1882j0293l6528j9965m6590M7870o2802p8854q2230P2355N5133
6692a86619K2880P716Q1181N227n7279r636J9785m974j15800n061n522O7836P5818
6679a04448k4112k78n3901Q652Q2524P545Q8305K1981o1932l8083q089o2878N7963
6666h6751m2364q0020k3185K8589J90894Q6764l9053j36835j08423N0026J38231
$$ y = [-147740, -196829, -151598, -130589, -15243, -56818, -46740, 1256, 60025, 68088, 61397, 9953, 53367, 37886, 3073, 36938, 102314, 45972, -15487, -45071, -76528, -118029, -55258, 21047, 49555, -12735, -899, 27309, 46556, -39000, -48015, -4050, 25199, -92899, -278795, -173495, -66923, -66441, 54960, 175537, 141020, 87060, 4978, -34792, -19834, -76243, -130488, -76597, -24715, -35008, -71536, -91501, -138091, -90221, -153023, -231877, -314107, -241752, -186619, -163739, -156023, -74842, -69615, -126894, -136530, -116745, -121719, -237519, -242580, -248102, -180266, -104448, -128560, -128838, -182739, -174087, -91563, -84018, 4287, 26268, -35664, -73747, -81836, -144714, -86751, -129115, -209135, -232320, -203731, -12837, 73927, 34874, -101961, -210384, -160358, -22127]
6655b2127J15957o4052q6181p4165j8547J85507J32122p4194q101J08900M6602
6644B41721k6896j69718J74063J01382p9942k1292q2145j07499j39068j76890
6634b86284q8436K7862J04811J44224k7946L27L1842K3268K0608q1152J7127j4141
6622a27890P3126Q5077J2463m7560r873J169K4074j08565j16997O4303R0004M5488
6610a5181R3632L417l7742R0794o2483p5522j4182n3680R428j5213K3338N0894
6598b500o0458j9750Q77J2619K7295J0844l7614l3737J21844J54467n1909j83900
6586f1922o4480P38O7905m8417J2662N7554l063o3043L0187l6781J4220M6317
6574d8123k3427M1509N8617m2926j12350P7680k8380j15257K0604J00302m001
$$ y = [-22127, 93830, 29778, -56403, -130568, -149115, 36392, 168514, 94320, 86219, 195119, 241721, 214825, 45107, 219170, 320552, 240610, 219318, 137173, 29674, -109394, -286284, -374720, -346858, -242047, -97823, -125769, -125442, -93600, -70332, -49724, -130876, -113749, -127890, -54764, 30313, 42776, -4784, -14657, -13488, 10586, -97979, -214976, -150673, -60669, -15181, 78451, 81868, 44126, 134920, 72437, -3085, -17267, -70947, -61519, -76732, -53394, -2500, -62958, -82708, -81831, -69212, -41917, -31073, -68687, -102424, 19420, 173887, 121978, -61922, -126402, -125664, -57759, -106176, -93514, -35960, -39023, -102066, -71879, -108660, -94440, -48123, -71550, -30041, 28576, -14350, -126700, -49020, -77400, -192657, -172053, -71751, -75752]
6563g5752P7095R5322m6768J304m3917J6587p0652m5614M9759J47992K2994j50096
6551b1746r3513k9242R9702J3597l4007J5596j4670K8754Q3212M947m4901n24
6539G205J8606J13582O1863q9502r3744o513j44059j5903j4283J8180M9807j37806
6527b32567n1728K1109P6028Q7312k768Q0072J1096o3749K8966k9379p8666R7356
6515e6918J8575l0859J57000K7786q0389p2402o0500N390j14395K9948J46883
6504b9881M1096j5584o964J01752L8438j67643q9416n4307r1852m7897J14528
6493b07730R2575J41377R840j34206J6342L7849l387Q155j1195p1784P6942J06151
6481F0929N8105n3810k39640K3203Q6559m3020m7744o6136K935L5864K223p86
$$ y = [-75752, 1343, 96665, 49897, 51201, 7284, 23871, -46781, -92395, -42636, 105356, 128350, -21746, -115259, -144501, -44799, -31202, -65209, -49613, -64283, -35529, 47683, 52630, 7729, 7205, 25811, 139393, 201256, 111754, 18010, 11497, -132562, -148465, -162748, -144568, -94761, -232567, -284295, -263186, -187158, -99846, -102614, -22542, -11446, -75195, -46229, -75608, -154274, -56918, -38343, -69202, 87798, 115584, 35195, -37207, -97707, -92317, -206712, -176764, -29881, 11215, -4369, -11333, 90419, 128857, -38786, -128202, -182509, -274361, -322258, -207730, -115155, 26222, 36062, -98144, -81802, -43953, -47340, -39185, -50380, -122164, -45222, 60929, 119034, 65224, -174416, -151213, -64654, -107674, -155418, -221554, -218619, -182755, -180532, -181318]
6469a81318K0904l3263k2475O3135O0416p3656j6980J01159J07663k5700p5399
6458g5514O6196n0796j5017J20195O859j1884m031j05357p8846j24696J3996N4782
6446b04113O1182j7367L2540j928l1036R2418J08357O6011M5625o8209q9792l3709
6434d0021K4584k1843p7651J1312r503N3168O037J0736J4622m8881o8175N1235
6422i4380N3609J9966j19554l5838K04835r816j08128O017J55424K3227k20330
6411a24968n4055J40489N6353m0293k9069p9144j44922m4527J04668J44475J21672
6400E0679j6657j06172k5652k5877J3328J2785j0916J88590k805o2941K525j0607
6388F280l7820r125L0881L6049o056m1992L2379O3230j01405n6881k6841O9922
$$ y = [-181318, -160414, -193677, -216152, -153017, -92601, -166257, -183237, -82078, 25585, -115, -75514, -9318, -60114, -75131, 45064, 51923, 40039, 36008, -69349, -148195, -272891, -258895, -204113, -142931, -160298, -127758, -129686, -160722, -68304, 40053, 106064, 151689, 83480, -6312, -40021, -15437, -37280, -114931, -103619, -113122, -59954, -53917, -43181, -28559, -77440, -145615, -94380, -40771, -20805, -140359, -176197, 28638, 18822, -89306, -83289, 72135, 95362, -124968, -179023, -38534, 17819, -22474, -51543, -130687, -275609, -320136, -215468, -70993, 50679, 34022, -72150, -97802, -123679, -110351, -97566, -108482, 80108, 77303, 14362, 16887, 6280, -31540, -40665, -9784, 26265, 20209, -21783, 10596, 73826, -27579, -84460, -111301, -41379]
6376d1379q09n8398m4645L8886M3789j26908p6090J80362J04604Q585P6510l8411
6364F6096j39493J28836N7075l4880n9744j63592j00116J3190k273L0278J22032
6353h2591N7485m1606J18631J26635n3853q8858j7668l7012p3448J89411L4365
6342A31491m7340j0111j25435p5025P8794n8283k03895n684J43313J08780l2530
6331i5925l7496N9270p2848n0442m2237J6664J57839J05720K6038R0292m2815
6320A14060P3770j23202l7371O6116Q7636q2048q2038J8298j5695o6313q2215
6309a29002p9646j1415j789L9216j8258J05352J16248k0309q5617j5848J51230
6298E0162K7317K5135j47960p4288n2153k098m6448Q1470o813K4887J32406j5109
$$ y = [-41379, -42188, -100586, -145231, -106345, -62556, -189464, -265554, -85192, 19412, 27997, 104507, 66096, -73397, 55439, 112514, 77634, 17890, -145702, -245818, -232628, -234901, -204623, -82591, -25106, -66712, 51919, 178554, 124701, 35843, 18175, -18837, -92285, 97126, 131491, 84151, 74040, -51395, -126420, -47626, -105909, -309804, -315488, -172175, -63395, -95925, -133421, -74151, -146999, -197441, -239678, -223014, -65175, 40545, 66583, 156875, 114060, 187830, 64628, 27257, 93373, 181009, 98961, 16923, 35221, 19526, -46787, -129002, -208648, -220063, -221852, -182636, -200894, -95542, 20706, 397, -85220, -101068, 50162, 77479, 102614, -45346, -119634, -171787, -173885, -220333, -138863, -145676, -120789, 11617, -3492]
6286c492r3274m6480J05993R9496R2222j31096r3456J57676q3665j73460k2564
6275a92100O8905R9176J21848l7966k9848l9405j24351K1930J27225R8122N4698
6264A68234p4209n8667J2417p7820n5077J04111J00809j10749j8756j07666m5923
6253a63296Q4906J77806J44751L2505m1589j40863l6929M5298l6496q1889n4565
6242g0361M3525p004P3746l8751l4411m396m3250L882Q959l2218p717O4643k95
6229d3648N739N0699N7154k32m4182q5805J29281J42220J1203N9962P043k05649
6217H3785k53668q5840J40869R3930l9401l6723p9663k571O9272M2532J06125
6206C8647R8750n6172p8217j78304k1304K8050Q9462l0602p1020O936P7402k7509
$$ y = [-3492, -96766, -143246, -37253, 62243, 154465, 23369, -70087, 87589, 3924, -169536, -192100, -123195, -24019, 97829, 59863, 30015, -9390, -133741, -111811, 15414, 113536, 168234, 94025, 35358, 47775, -30045, -85122, 18989, 119798, 9049, -9707, -117373, -163296, -78390, 99416, 244167, 276672, 235083, 94220, 57291, 102589, 66093, -15796, -70361, -26836, -33840, 39906, 1155, -33256, -37652, -80902, -77020, -68061, -100279, -107996, -43353, -43648, -37909, 12790, 69944, 69712, 25530, -60275, 69006, 211226, 222429, 282391, 289434, 83785, -169883, -255723, -114854, -20924, -60325, -97048, -176711, -179282, -110010, -67478, 38647, 137397, 81225, 3008, -175296, -196600, -168550, -79088, -109690, -180710, -173774, -96372, -123881]
6194a23881O418N4218n7955m8150j3788Q1954O7888l8596L5070L0326r4259n1231
6182a51986L8916L6295k5549O8728Q0254l9223j22283l4511R0511M8653O4677
6171E4482L9499p3479l8161L0201P7238j41069K2346m758L2215R8609p8775q8404
6159g0056M5340M690k7893l1840L4016P2540n971o4049K9065L3427J26536n595
6147A40210L6508j0437j85735q8427J3634J08968J6034p0730o6437n2759O2184
6136i6987N3610l6117L3853k8920n2242N5570Q4792R5203k6014j32732j24573
6125a74557j0069J01051N5393p9957j6793p9342M1465J1173L3365N7246K3300
6114c7725N1057J39024l0183p6775L395L0218o2533n3640r612k1747K0981J6253
$$ y = [-123881, -117463, -63245, -121200, -169350, -183138, -101184, -33296, -71892, -36822, -6496, -100755, -151986, -113070, -76775, -102324, -33596, 46658, 7435, -114848, -149359, -58848, -10195, 54482, 93981, 20502, -17659, 12542, 89780, -51289, -28943, -33701, -1486, 97123, 18348, -70056, -24716, -20026, -47919, -79759, -45743, 26797, 20826, -43223, -14158, 19269, 145805, 140210, 176718, 166281, -19454, -107881, -94247, 14721, 30755, -39975, -106412, -159171, -96987, -43377, -79494, -45641, -74561, -126803, -71233, 13559, 108762, 82748, -49984, -174557, -184626, -83575, -28182, -108139, -124932, -204274, -162809, -151636, -118271, -61025, -37725, 13332, 152356, 122173, 45398, 48793, 79011, 16478, -37162, -46774, -68521, -47540, -31287]
6102c1287o7872J07634J88534l8194k05177m7851J01312L1288j12702j7241M0338
6091e1218p9576N6633P7510j8375n4930K3353O3785M9547N3489k4193n2390j80691
6079a37056O3021Q4865p2113j66576L0934J04244R2545r2464j38977L593Q1948
6068a46036P4370q411J20353k8329Q877N3453j25113j77950n2637P4012K5343
6057a82068L3286L3597P6785K9323J5561L1924K4993p1177p0827J404M5041n7856
6045i0014L125L5172K1526M6301k2972k8426r4326j03971L7818Q8081m6484M2726
6033a11444q55m125P788M8897j18013k2786R3885K01266J76049r2530o911N9082
6021B30303O870m0768M4030j13344q4082L007m9107p4678J06461j7083j9117Q8348
$$ y = [-31287, -99159, 8475, 197009, 158815, -46362, -94213, 7099, 38387, -74315, -91556, -51218, -130794, -74161, 3349, -15026, -69956, -46603, 17182, 66729, 120218, 96025, 43635, -137056, -74035, 10830, -61283, -227859, -196925, -92681, -136, -92600, -231577, -227984, -146036, -71666, -80077, 40276, 11947, 20824, 74277, -50836, -228786, -281423, -207411, -182068, -148782, -115185, -38400, -9077, 6484, 38408, 63401, -7776, -78603, -77199, -32158, -90014, -86889, -51717, -30191, 16110, -6862, -35288, -129614, -233585, -195767, -107686, -154170, -111444, -112299, -116424, -108636, -59739, -177752, -200538, -106653, 94613, 270662, 178132, 171221, 230303, 237173, 196405, 240435, 127091, 43009, 46016, -3091, -77769, 28692, 11609, -7508, 80840]
6009H0840p4564j7347Q7726J35716k8953m6790k8872k8018M4869J47403r854m0040
5997B22116J6208j26599j65533n3413Q5916N4387N5520R882l7292P6979o3358
5986G4813r9136N2734K3432q4j38971o5078O0274P7503l2566P32o2491M3009P9889
5973A4060K0293p2812P910R4958M4038l5643j76192n2085Q8987K866Q973Q6242
5961C1595J1148P2665L7412j12766j33732K4585J10327Q920N8215N8332l0222
5950A36479k0242m5838j02908K1879l1886J2160Q1074n4132k0754Q5790m7657
5939A3965O0023o1699j769K1401j8730L3299Q511J10345M283o0872l8133P5613
5927A46237K7211o1930J6242K0611j45570j0544J53985N6786q0818j49649J5823
$$ y = [80840, 6276, -11071, 76655, 212371, 183418, 136628, 107756, 79738, 124607, 272010, 262156, 222116, 238324, 111725, -53808, -107221, -21305, 33082, 88602, 98484, 61192, 138171, 74813, -24323, 28411, 51843, 51759, -87212, -152290, -92016, -14513, -47079, -46347, -108838, -65829, 14060, 34353, -38459, -30549, 64409, 108447, 72804, -103388, -155473, -66486, -63620, -54647, 31595, 42743, 115408, 152820, 40054, -93678, -69093, 41234, 50154, 108369, 166701, 136479, 116237, 70399, -32509, -10630, -42516, -30356, 50718, -3414, -24168, 61622, 13965, 73988, 12289, 10520, 31921, 13191, 46490, 55001, 165346, 169629, 108757, 70624, 146237, 173448, 111518, 127760, 148371, 2801, -7743, 146242, 203028, 122210, -27439, -11616]
5916a1616Q686J8828m1599r0699n483N9642J4232P3688m889l1062q7304m7846
5904a45422P5119K3363M2352m3654j08882o6387l4037R0239P8113R3978p4178
5893f9396j06408K1454q572j21406R6699M5624N1976J64021O7545q5766M3707
5882I9478J1672k9486p1920n4120p3668k856O3533R3973o4687k06782j9207n549
5870b59619m3132K43258J98597q0313m1334r6760n2999J0041J40925o8524l5099
5859h4959Q9121J3568j84534m6781k2512N314j7014N6694k0033O3134M1333K9366
5847g7303P0818R841k02758K2964O8857O1956J1386o6464j15326K0479j06355
5836c01905l5530Q7061k697J12206M0320M0690r8982l4434O5438J13635L273m4291
$$ y = [-11616, -2930, 15898, -25701, -116400, -121883, -62241, -48009, 25679, 20790, -10272, -97576, -145422, -70303, -46940, -4588, -48242, -157124, -223511, -257548, -167309, -89196, 4782, -69396, -175804, -154350, -162922, -284328, -187629, -142005, -90029, 73992, 141537, 55771, 99478, 111150, 81664, 9744, -44376, -118044, -120900, -57367, 36606, -28081, -234863, -254070, -259619, -302751, -59493, 139104, 58791, 17457, -79303, -132302, -122261, 18664, -49860, -84959, 4162, 17730, -166804, -213585, -236097, -230783, -247797, -191103, -211136, -148002, -106669, -77303, -6485, 3356, -199402, -176438, -107581, -45625, -34239, -100703, -216029, -195550, -301905, -337435, -250374, -253071, -140865, -100545, -59855, -158837, -193271, -127833, -14198, -10925, -55216]
5824e5216K2158J3869J28176O9222j04955o8217J45555M0571j27841j51924l3535
5813a22137K3978J15252O6892o6378o9415o6630K1876K0932Q2558J39999k0943
5802A25984Q6711o8621k11478R8J5319p4134j649N0339J5130P0666j2761p9877
5790h4273l0859O79M0454r7567j8260Q7735J34601K0497p4410l5694M1353Q0771
5778F5027K4244r7891o5354P5737J41004L8411r6695q626l9818q2675K0957K6042
5766C63J07121R37j19842p0797Q8288o6741q60J28259m4809l7826l329J70454
5754A51218M1732q0129n1598j69P720L4329r6484j16795P9797K0564l8608L2811
5742a5612J01486m0440k32658o6736k4935J36374J2773L5936m7327L4000J53183
$$ y = [-55216, -33058, -19189, 108987, 178209, 73254, 5037, 150592, 191163, 63322, -88602, -122137, -98159, 17093, 83985, 17607, -51808, -118438, -96562, -75630, 6928, 146927, 125984, 212695, 144074, -67404, -67306, -51987, -126121, -127770, -77431, -62301, 8365, -4396, -84273, -115132, -114453, -73999, -171566, -189826, -102091, 32510, 53007, -21403, -57097, -15744, 65027, 89271, -8620, -73974, 1763, 142767, 181178, 84483, 75857, 36039, -46636, -25679, 363, 107484, 108421, -11421, -82218, 6070, -60671, -61531, 66728, 21919, -15907, -19236, 151218, 192950, 112821, 61223, 61054, 68774, 103103, 6619, -110176, -30379, -9815, -48423, -15612, 85874, 45434, -187224, -253960, -278895, -142521, -129748, -93812, -141139, -107139, 46044]
5731D6044N1631l9349k01150R4342R8442j58641l6438J51838Q0340m6467j13257
5720g2665k0646M2298J00646k4967k443k4463k7646N7864n9430n4961J117J5210
5708g0086M3544k084m1487r9768j1244L5884M6478K6464R3909J52735L4845j73601
5696C5589q5957R5332J08210l1022j61758p2409J2153Q9443m731O432l5870j78665
5684b23253p8780J13021J61661m8518k0326Q1744M0198R6552j7703l0740o2844
5673A1012K9623K59J6602N4872N3198k3849j81928j03878L0762n4380k1594O423
5661a82878J01096K1384J26360J34073r8285l3713l0882o479j1165n3408n094
5650c8991j06433p1161j9835l4158M1818J38632J16953J7972j73305K6202L8916
$$ y = [46044, 97675, 58326, -142824, -48482, 49960, -108681, -145119, 6719, 87059, 40592, -72665, -93311, -51013, 49633, 24666, 22223, -2240, -29886, 27978, -31452, -86413, -85296, -70086, -26542, -28626, -70113, -169881, -181125, -145241, -98763, -72299, 21610, 174345, 209190, 35589, -50368, 44964, 153174, 122152, -39606, -112015, -99862, -10419, -15150, -8718, -44588, -223253, -302033, -189012, -27351, -75869, -96195, -14451, 25747, 122299, 104596, 73856, 11012, 40635, 40894, 57496, 112368, 165566, 141717, -40211, -144089, -113327, -167707, -189301, -182878, -81782, -60398, 65962, 200035, 101750, 68037, 37155, 30676, 19511, -33897, -38991, -145424, -216585, -236420, -270578, -228760, -90128, 26825, 44797, -128508, -102306, -63390]
5639f3390j05141m1971n2223l8003P5318Q1652J7917O2041j1175N6944n5590n4040
5627a27661J5007N5884l6818l6707J53162J41107o6787p1001J0454M8686L283
5616H8609L6881j18852j04222J3244o5499k1842J09448N4718N0026Q3671R229
5605A35411j50938p2717n1745N2688N7787r657l8679K5198o316M3663O5067l6873
5593A2889L0672L7019n5317q5243j32636m4981l9441J11479J32359J55633R3149
5582B15582L979N275l1915L093N915j14678P677q7262j02622n5363k2232J50827
5570b1724J46408n0116p4642p8072L2714J23654L3114o687N263n1641m6296K3498
5558C5473l1629j0710j2656N7519Q1066J1884j8961j36177l8776r610k7203M1043
$$ y = [-63390, -168531, -210502, -262725, -300728, -225410, -143758, -125841, -63800, -74975, -18031, -73621, -127661, -112654, -56770, -93588, -130295, 22867, 163974, 97187, 26186, 36640, 85326, 88609, 125490, 6638, -97584, -84340, -149839, -171681, -62233, -7515, 42511, 126182, 135411, -15527, -88244, -139989, -87301, -29514, -39171, -77850, -52652, -58968, -15305, 49762, 12889, 43561, 80580, 25263, -59980, -192616, -237597, -277038, -165559, -33200, 122433, 215582, 219561, 224836, 192921, 196014, 201929, 87251, 94928, 7666, -94956, -150319, -172551, -21724, 124684, 74568, -74, -78146, -45432, 78222, 111336, 104649, 109912, 58271, 11975, 35473, 3844, -6866, -19522, 37997, 119063, 130947, 111986, -24191, -62967, -72577, -99780, -58737]
5546e8737j9478p0061L4301L2640N1049K5198l2142m3621p572o2068j5383J02439
5534f3435M8979m0394p0218l6627M9414J25525L4477j5830k8029j9114j02387
5523a17639J2749J73949R2131P0654p1132J2577j28566n3455j47223J13692J46989
5512A04726P8203j18445k26523m1494m8350M8227J81875k1889K097l3063R3177
5501A8541O244j47608J8932J19029r571m073o3380n7376q026L249J03608N9156
5489C8725j4088j4308k365m5698m1497M8313j30010N4632J2952L6449o0116j00855
5477b17866R3433J50969J1793P9013j09415j39010l6276q387n0482M6994L9398
5466a39836k3214J8988k3344r3779J1081J2257P1528m5423P8010P5038K1698p0288
$$ y = [-58737, -78215, -148276, -113975, -81335, -30286, -5088, -37230, -80851, -88423, -150491, -165874, -63435, -14456, -54850, -125068, -161695, -112281, 13244, 47721, 31891, 3862, -15252, -117639, -104890, 69059, 161190, 231844, 160712, 173289, 44723, -8732, -155955, -42263, 104726, 182929, 64484, -162039, -203533, -251883, -203656, -21781, -43670, -41573, -74636, 18541, 24785, -122823, -103891, 15138, 5567, 1494, -61886, -119262, -127288, -124039, -20431, 38725, 24637, 10329, 7964, -37734, -79231, -30918, -160928, -106296, -93344, -56895, -117011, -217866, -124433, 26536, 38329, 117342, 7927, -131083, -167359, -175746, -226228, -179234, -139836, -163050, -144062, -167406, -261185, -250104, -237847, -166319, -211742, -133732, -58694, -36996, -107284]
5454a07284N1830p5417o532m8353p7790J19339J18999j833L9725k5720r991n0882
5442g3909j76031l854Q4060P4656J07782k6913o5742O3977r1185q9185N6724L0270
5430a09350J18712P3255l7468o5171j3291J03646J12436L4379j7220j35274j28675
5419f4021n8404L5646R9453K3699j6043n9788O567J28827L4958K6527P175o4420
5407A00176p1455J8773o1998j13108l101R8472M6082J3597j89672K2424J37523
5396b287m5792m9428K3733K9018P2593K0594L7591j1336j10864J430J6491j7336
5384c5593l7332m8164M0026l398q8735q3827J43411J41722L691j54659j12738
5373b35596K10405J39957N899P8357j9137J6282j7098L9573q1788j17215o1032
$$ y = [-107284, -55454, -130871, -137403, -185756, -263546, -144207, -25208, -27041, 12684, -13036, -23027, -73909, -249940, -253794, -169734, -95078, 12704, -14209, -79951, -15974, -107159, -196344, -139620, -109350, 9362, 82617, 45149, -20022, -33313, 70333, 182769, 217148, 199928, 64654, -64021, -122425, -86779, 12674, 36373, 20330, -39458, -32891, 95936, 130894, 157421, 164596, 100176, 28721, 47494, -14504, -127612, -130713, -32241, 13841, 27438, -162234, -139810, -2287, -48079, -97507, -73774, -44756, 27837, 48431, 86022, 74686, -36178, -34748, -18257, -35593, -72925, -121089, -81063, -84461, -173196, -257023, -113612, 28110, 31801, -122858, -235596, -25191, 114766, 120665, 199022, 179885, 196167, 179069, 218642, 136854, 19639, -41393]
5362d1393j74634n5401P002J32963k7547j1168L2783J19995N1913l0723n3724
5351d9934r2657m0473p811O9565n3365N730J08217k9333o5600P9763Q3744m5712
5339c7866n1129j4697L6510k4030p2598J62024k1024j5891n1784m7903N2921R6282
5327A0815k0394k4455L8287j2484j4674J734j9315p2282L9197Q1594N3712K048
5315F3783K8687K9889L3684L6357K1868p8382m6104o145j23169J4659m8284k5402
5303i8559q863L6472j1122n944M4039j05013j2259J02282R5069Q8186p467m2964
5291G3857j35583m4676r6090L8615N5263L9122K8917M4562j13111j55278N2958
5280b11444Q5928J28830l0840r3818m1631J3198J40552J14269j8732J9023J4832
$$ y = [-41393, -216027, -271428, -264426, -131463, -159010, -170178, -137395, -17400, 34513, 3790, -49934, -142591, -183064, -190875, -121310, -174675, -168945, -60728, -90061, -155661, -75898, 7846, -37866, -88995, -103692, -67182, -91212, -163810, -1786, -22810, -38701, -90485, -138388, -85467, 10815, -9579, -34034, 4253, -8231, -22905, -21171, -40486, -112768, -73571, 8023, 61735, 63783, 92470, 122359, 156043, 192400, 214268, 135886, 89782, 83637, -39532, -24873, -73157, -98559, -107422, -70950, -82072, -88016, -43977, -148990, -161249, -58967, 36102, 124288, 116821, 73857, -61726, -106402, -202492, -163877, -108614, -69492, -40575, 3987, -109124, -264402, -211444, -125516, 3314, -27526, -121344, -162975, -149777, -9225, 105044, 86312, 105335, 120167]
5269A20167P953j33462j01598Q8882J50845k0821j21118n8908o8819N8577M3400
5258c4902K8098M458m0293j01071j06245N536J26454J10812k7349k4545K6491
$$ y = [120167, 128120, -5342, -106940, -18058, 132787, 111966, -9152, -68060, -136879, -78302, -34902, -6804, -2346, -42639, -143710, -249955, -244419, -117965, -7153, -34502, -59047, -32556]
$$ [...]
##END NTUPLES=NMR SPECTRUM
##END=
